##TITLE=Analysis number 308382
Compound Code mo 00348
Project Code adrs
Chemist Name ugmt
##JCAMPDX= 6.0         $$ Bruker NMR JCAMP-DX V2.0
##DATA TYPE= NMR SPECTRUM
##DATA CLASS= NTUPLES
##ORIGIN= Bruker BioSpin GmbH
##OWNER= NMR
$$ XWIN-NMR		Version 3.5
$$ Tue May 24 12:18:36 2005 GMT Daylight Time (UT+1h)  MAYBRIDGE\NMR@NMR_250MHZ
##.OBSERVE FREQUENCY= 250.131544655141
##.OBSERVE NUCLEUS= ^1H
##.ACQUISITION MODE= SIMULTANEOUS (DQD)
##.ACQUISITION SCHEME= undefined
##.AVERAGES= 16
##.DIGITISER RES= 18
##SPECTROMETER/DATA SYSTEM= dpx250
##.PULSE SEQUENCE= zg30
##.SOLVENT NAME= CDCl3
##.SHIFT REFERENCE= (INTERNAL, CDCl3, 0, 16.454)
##AUDIT TRAIL= $$ (NUMBER, WHEN, WHO, WHERE, WHAT)
$$ ##TITLE= Audit trail, XWIN-NMR		Version 3.5
$$ ##JCAMPDX= 5.01
$$ ##ORIGIN= Bruker BioSpin GmbH
$$ ##OWNER= NMR
$$ C:\u/data/dgb/nmr/ADRS/3390/pdata/1/auditp.txt
$$ ##AUDIT TRAIL=  $$ (NUMBER, WHEN, WHO, WHERE, WHAT)
(   1,<2005-05-24 12:18:17.59 +100>,<MAYBRIDGE\NMR>,<NMR_250MHZ>,
      <created by zg, POWCHK disabled, PULCHK disabled
       configuration hash MD5:
       62 19 C7 07 E1 42 D1 B7 37 6C 3D D0 77 39 F9 E6
       data hash MD5: 64K
       03 E3 87 1F 66 E2 B7 B7 AB 24 13 FF D2 39 50 51>)
(   2,<2005-05-24 12:18:28.43 +100>,<MAYBRIDGE\NMR>,<NMR_250MHZ>,
      <Start of raw data processing
       ef LB = 0.3 FT_mod = 6 PKNL = 1 SI = 32K 
       data hash MD5: 32K
       EC C7 61 17 A8 B8 59 BF 31 02 49 16 07 EC 18 56>)
(   3,<2005-05-24 12:18:30.06 +100>,<MAYBRIDGE\NMR>,<NMR_250MHZ>,
      <apk 
       data hash MD5: 32K
       01 15 9F 2D 71 60 F3 58 1F 0C C0 C6 28 6C FC 7C>)
(   4,<2005-05-24 12:18:30.71 +100>,<MAYBRIDGE\NMR>,<NMR_250MHZ>,
      <abs ABSG = 5 
       data hash MD5: 32K
       BB E2 64 F8 D4 27 91 88 91 AA AB 68 53 FE 83 C2>)
$$ ##END=
$$ 
$$ hash MD5
$$ 61 C0 5C B9 2D 71 3F 3F 1D 8C E7 75 AD 85 5E 1B
##$RELAX= 
##$RELAX= 
##$RELAX= 
##$RELAX= 
##$RELAX= 
##$RELAX= 
##$RELAX= 
$$ Bruker specific parameters
$$ --------------------------
##$DU= <C:\u>
##$EXPNO= 3390
##$NAME= <ADRS>
##$PROCNO= 1
##$TYPE= <nmr>
##$USER= <dgb>
##$AMP= (0..31)
100 100 100 100 100 100 100 100 100 100 100 100 100 100 100 100 100 100 
100 100 100 100 100 100 100 100 100 100 100 100 100 100 
##$AQSEQ= 0
##$AQ_mod= 3
##$AUNM= <au_zg>
##$AUTOPOS= <24 >
##$BF1= 250.13
##$BF2= 250.13
##$BF3= 250.13
##$BF4= 250.13
##$BF5= 500.13
##$BF6= 500.13
##$BF7= 500.13
##$BF8= 500.13
##$BYTORDA= 1
##$CFDGTYP= 0
##$CFRGTYP= 5
##$CHEMSTR= <none>
##$CNST= (0..31)
1 1 145 1 1 1 1 1 1 1 1 1 1 1 1 1 1 1 1 1 1 1 1 1 1 1 1 1 1 1 1 1 
##$CPDPRG= <>
##$CPDPRG1= <>
##$CPDPRG2= <>
##$CPDPRG3= <>
##$CPDPRG4= <mlev>
##$CPDPRG5= <mlev>
##$CPDPRG6= <mlev>
##$CPDPRG7= <mlev>
##$CPDPRG8= <mlev>
##$CPDPRGB= <>
##$CPDPRGT= <>
##$D= (0..31)
0 1 0 0 0 0 0 0 0 0.06 0 0 0 0 0 0 0.0002 0 0 0 0 0 0 0 0 0 0 0 0 0 0 
0 
##$DATE= 1116933496
##$DBL= (0..7)
120 120 120 120 120 120 120 120 
##$DBP= (0..7)
150 150 150 150 150 150 150 150 
##$DBP07= 0
##$DBPNAM0= <>
##$DBPNAM1= <>
##$DBPNAM2= <>
##$DBPNAM3= <>
$$ [...]
##$SUBNAM7= <"">
##$SUBNAM8= <"">
##$SUBNAM9= <"">
##$SW= 20.6930455092707
##$SWIBOX= (0..15)
0 0 3 0 0 0 0 0 0 0 0 0 0 0 0 0 
##$SW_h= 5175.983436853
##$TD= 65536
##$TD0= 1
##$TE= 295.16
##$TE2= 300
##$TE3= 300
##$TEG= 300
##$TL= (0..7)
0 120 120 120 120 120 120 120 
##$TP= (0..7)
150 150 150 150 150 150 150 150 
##$TP07= 0
##$TPNAME0= <>
##$TPNAME1= <>
##$TPNAME2= <>
##$TPNAME3= <>
##$TPNAME4= <>
##$TPNAME5= <>
##$TPNAME6= <>
##$TPNAME7= <>
##$TPOAL= (0..7)
0.5 0.5 0.5 0.5 0.5 0.5 0.5 0.5 
##$TPOFFS= (0..7)
0 0 0 0 0 0 0 0 
##$TUNHIN= 0
##$TUNHOUT= 0
##$TUNXOUT= 0
##$USERA1= <user>
##$USERA2= <user>
##$USERA3= <user>
##$USERA4= <user>
##$USERA5= <user>
##$V9= 5
##$VALIST= <valist>
##$VCLIST= <CCCCCCCCCCCCCCC>
##$VD= 0
##$VDLIST= <DDDDDDDDDDDDDDD>
##$VPLIST= <PPPPPPPPPPPPPPP>
##$VTLIST= <TTTTTTTTTTTTTTT>
##$WBST= 1024
##$WBSW= 4
##$XGAIN= (0..3)
0 0 0 0 
##$XL= 0
##$YL= 0
##$YMAX_a= 345880
##$YMIN_a= -393907
##$ZGOPTNS= <>
##$ZL1= 120
##$ZL2= 120
##$ZL3= 120
##$ZL4= 120
##$ABSF1= 16.45399
##$ABSF2= -4.239182
##$ABSG= 5
##$ABSL= 3
##$ALPHA= 0
##$AQORDER= 0
##$ASSFAC= 0
##$ASSFACI= 0
##$ASSFACX= 0
##$ASSWID= 0
##$AUNMP= <proc_1d>
##$AZFE= 0.1
##$AZFW= 0.1
##$BCFW= 0
##$BC_mod= 0
##$BYTORDP= 0
##$COROFFS= 0
##$CY= 12.5
##$DATMOD= 1
##$DC= 0
##$DFILT= <>
##$DTYPP= 0
##$F1P= 14.0000005364418
##$F2P= -0.99999901652339
##$FCOR= 0.5
##$FTSIZE= 32768
##$FT_mod= 6
##$GAMMA= 0
##$GB= 0
##$INTBC= 1
##$INTSCL= 1
##$ISEN= 128
##$LB= 0.3
##$LEV0= 0
##$LPBIN= 0
##$MAXI= 10000
##$MC2= 0
##$MEAN= 0
##$ME_mod= 0
##$MI= 0
##$NCOEF= 0
##$NC_proc= -2
##$NLEV= 6
##$NOISF1= 0
##$NOISF2= 0
##$NSP= 0
##$NTH_PI= 0
##$NZP= 0
##$OFFSET= 16.45399
##$PC= 1
##$PHC0= -73.8479
##$PHC1= 5.324735
##$PH_mod= 1
##$PKNL= yes
##$PPARMOD= 0
##$PSCAL= 4
##$PSIGN= 0
##$REVERSE= no
##$SF= 250.130017010811
##$SI= 32768
##$SIGF1= 0
##$SIGF2= 0
##$SINO= 400
##$SIOLD= 32768
##$SREGLST= <1H.CDCl3>
##$SSB= 0
##$STSI= 32768
##$STSR= 0
##$SW_p= 5175.98343685301
##$SYMM= 0
##$S_DEV= 0
##$TDeff= 65536
##$TDoff= 0
##$TI= <Analysis number 999999
Compound Code 99
Book Reference 9
Project Code 9>
##$TILT= no
##$TM1= 0
##$TM2= 0
##$TOPLEV= 0
##$USERP1= <user>
##$USERP2= <user>
##$USERP3= <user>
##$USERP4= <user>
##$USERP5= <user>
##$WDW= 1
##$XDIM= 32768
##$YMAX_p= 281413415
##$YMIN_p= -59519
$$ End of Bruker specific parameters
$$ ---------------------------------
##NTUPLES= NMR SPECTRUM
##VAR_NAME=  FREQUENCY,     SPECTRUM/REAL,   SPECTRUM/IMAG
##SYMBOL=    X,             R,               I
##VAR_TYPE=  INDEPENDENT,   DEPENDENT,       DEPENDENT
##VAR_FORM=  AFFN,          ASDF,            ASDF
##VAR_DIM=   32768,         32768,           32768
##UNITS=     HZ,            ARBITRARY UNITS, ARBITRARY UNITS
##FACTOR=    0.157963299565203, 1,           1
##FIRST=     4115.63703278727, 0,            0
##LAST=      -1060.34640406574, 0,           0
##MIN=       -1060.34640406574, -59519,      0
##MAX=       4115.63703278727, 281413415,    0
$$ Real data points
##PAGE= N=1
##DATA TABLE= (X++(R..R)), XYDATA
$$ [...]
19169A5710J3484j3010p750p171N839J5575J2660K2702J7233L3553N9682N9649
$$ 15710 29194 16184 8434 1263 7102 22677 35337 58039 75272 108825 168507 228156
19157B28156M1421O13m6484n3586n4404l1577q228M235J0688K0042J2896K6608
$$ 228156 269577 270190 223706 170120 115716 84139 75911 80146 90834 110876 123772 150380
19145A50380L3413M3172L2081k3247o1674m6352l1890j7194j1416j6560q971k876
$$ 150380 183793 226965 259046 235799 174125 127773 95883 78689 67273 50713 41742 38866
19133C8866m854k5815J177n793j0453M870L240O695l728k507L340m347J922n234
$$ 38866 34012 8197 9374 3581 -6872 -2002 1238 7933 4205 1698 5038 691 2613 -2621
19119b621M226Q729P616n477J509O342m007j5804q003J1346p02J2989n58j5940
$$ -2621 1605 10334 17950 12473 13982 20324 16317 513 -7490 3856 3154 16143 15585 -355
19105c55k118k632P465K996K536O517q161j2871p393J1679K541q435o071J2762
$$ -355 -2473 -5105 2360 5356 7892 14409 6248 -6623 -14016 -2337 204 -8231 -14302 -1540
19091a540m7Q368M61m030m250r920k540o288J549q92K3254O292r648q871J428
$$ -1540 -1587 6781 7242 3212 -1038 -10958 -13498 -19786 -18237 -19129 4125 10417 769 -8102 -6674
19076f674K772r424o683n852R77j561R065J9518J0005p154M308r12j8071j3389
$$ -6674 -3902 -13326 -20009 -25861 -24884 -26445 -17380 2138 12143 4989 9297 8385 -9686 -23075
19062b3075j396J4140q869M22m895N78J5818P927m689j1071r361R087J6270J2295
$$ -23075 -24471 -10331 -19200 -18778 -23673 -23095 -7277 650 -4039 -15110 -24471 -15384 886 13181
19048A3181j528l106K3536K1682j7714j8822J254k403j7053j784P767R316P27
$$ 13181 11653 8547 32083 53765 36051 17229 18483 16080 -973 -2757 5010 14326 15053
19035A5053m51r868K004J217k1660k075N733p746j0604M504P280j2047O310m268
$$ 15053 14602 4734 6738 7955 -13705 -15780 -10047 -17793 -28397 -23893 -16613 -28660 -22350 -26618
19021b6618Q710M798Q353n551J4045M443j7031j71L326o051j794j354j902r462
$$ -26618 -17908 -13110 -4757 -10308 3737 8180 -8851 -9022 -5696 -11747 -13541 -14895 -16797 -26259
19007b6259j1396K980J3196J7370N442K1221k903l502j504r105l987k996j1731
$$ -26259 -37655 -34675 -21479 -4109 1333 22554 19651 16149 14645 5540 1553 -1443 -13174
18994a3174j6689J811K1306L843p884R500J5302p362j873Q598p381q402n845N855
$$ -13174 -29863 -28052 -6746 -2903 -10787 -1287 14015 6653 4780 13378 5997 -2405 -8250 -2395
18980b395J0251Q361l334j0240l402O290R028m466J2447J746l542j1853n582j970
$$ -2395 7856 16217 12883 2643 -759 5531 14559 10093 22540 24286 20744 8891 3309 1339
18966A339r671j1689N778J1733o909j2545J0648J1593K457J786K937p062k972
$$ 1339 -8332 -20021 -14243 -2510 -9419 -21964 -11316 277 2734 4520 7457 395 -2577
18953b577J3773k366j297N288j8353k1331J265J8214l64j41j679p285j2345O763
$$ -2577 11196 8830 7533 12821 -5532 -26863 -25598 -7384 -7748 -7889 -9568 -16853 -29198 -22435
18939b2435J2390J2535J4632J727j0957p023K448k583J1021p075n973n853K267
$$ -22435 -10045 2490 17122 18849 7892 869 3317 734 11755 4680 -1293 -7146 -4879
18926d879K398K32n893p544J5451m811P080K865n907j2855j73l460r819N183R002
$$ -4879 -2481 -2249 -8142 -15686 -235 -5046 2034 4899 -1008 -13863 -14036 -17496 -27315 -22132 -13130
18911a3130k1P849n25J0763J5130o804k6878j774O282j636M100K8768K5194J9631
$$ -13130 -13151 -5302 -5827 4936 20066 13262 -13616 -15390 -9108 -10744 -6644 22124 47318 66949
18897F6949L4039N5760M7728J0135l747l3491m6845l7300l3152p155o064l364
$$ 66949 100988 156748 204476 214611 210864 177373 130528 93228 60076 52921 46857 43493
18885D3493p523j6260j4599L631R201J230p765L805j2209K597k651r133M531o698
$$ 43493 35970 19710 5111 8742 17943 19173 11408 15213 3004 5601 2950 -6183 -1652 -8350
18871h350p312K054J3890l593k363L205j0672p686R422Q446K412J585K05j754
$$ -8350 -15662 -13608 282 -3311 -5674 -2469 -13141 -20827 -11405 -2959 -547 1038 1243 -511
18857e11K631L836q317k0579m166J4473J4384o161m770m200J4967K3577L4060
$$ -511 2120 5956 -2361 -22940 -27106 -12633 1751 -4410 -9180 -13380 1587 25164 59224
18844E9224M3076M0082L9705L2712k215m4362n6314n0113j8823k742n432Q425
$$ 59224 102300 142382 182087 214799 212584 168222 111908 61795 42972 40230 34798 43223
18832D3223R023j8107j5011j5395j493O970J7236k05K009K34j150j5462j1924
$$ 43223 52246 34139 19128 3733 2240 9210 26446 26241 28250 28484 27334 11872 -52
18819e2o393J0770J412p851j79j1719j0966K138N467J0969k16m373K3609M155
$$ -52 -6445 4325 5737 -2114 -2293 -14012 -24978 -22840 -17373 -6404 -6620 -10993 12616 16771
18805A6771l667K162K22k633m395m73m087j584o043o434M255O284j9450k988J4209
$$ 16771 13104 15266 15488 12855 8460 7987 3900 2316 -3727 -10161 -5906 378 -19072 -22060 -7851
18790g851J0317O806N651m335k3408j2424k461J504N347K612m755j397J5860L424
$$ -7851 2466 9272 14923 10588 -12820 -25244 -27705 -26201 -20854 -18242 -22997 -24394 -8534 -5110
18776e110p339k395K953M137P923J8938J4589J8484M0166L2179L3512M322l6728
$$ -5110 -12449 -14844 -11891 -7754 169 19107 33696 52180 92346 124525 158037 162359 125631
18763A25631l8920l4172k1195l955p13K769j0746q892p938Q680J2138J5861q906
$$ 125631 86711 52539 31344 27389 26676 29445 18699 9807 1869 10549 22687 38548 29642
18750B9642r769K259R29j2270o278j216j7331K214Q544m466n456P256L504k503
$$ 29642 19873 22132 23061 10791 4513 3297 -14034 -11820 -3276 -7742 -13198 -5942 -2438 -4941
18736d941q24L481o331j7994r18L806J48o758J3625J2553K726q396P585M845j1134
$$ -4941 -5765 -2284 -8615 -26609 -27527 -23721 -23573 -30331 -16706 -4153 -1427 -9823 -2238 2607 -8527
18721h527r624J0217K754k856j526K473K388J424Q244l605q510P31P507J0392
$$ -8527 -18151 -7934 -5180 -8036 -9562 -7089 -4701 -3277 4967 1362 -7148 -6417 1090 11482
18707A1482k880j079P213k249l706Q23J8721L061j9802j0991J27j3374r705k281
$$ 11482 8602 7523 14736 12487 8781 9604 28325 31386 11584 593 720 -12654 -22359 -24640
18693b4640O718J246n609P263M372K1998J81L723j5546p391J1024k521L379Q126
$$ -24640 -17922 -16676 -22285 -15022 -10650 11348 11529 15252 -294 -7685 3339 818 4197 12323
18679A2323r098n67J1028m60p361Q554n765r059o256K920J815J724N869o31n81
$$ 12323 3225 2658 13686 13226 5865 14419 8654 -405 -6661 -3741 -1926 -202 5667 5036 4455
18664D455R66n40J065L908r134j3919o781N23j0222n591P949J0144R855k797k789
$$ 4455 5421 4881 5946 9854 720 -13199 -19980 -19457 -29679 -35270 -27321 -17177 -7322 -10119 -12908
18649a2908J1235j0485j2521j364J5391O995R563K815j3660n037J2439J7146K682
$$ -12908 -1673 -12158 -24679 -26043 -10652 -3657 5906 8721 -4939 -9976 2463 19609 22291
18636B2291j4824j0425K527M687q436m75p134m584P126N308J5969N623l602r538
$$ 22291 7467 -2958 -431 4256 -4180 -4655 -11789 -16373 -9247 -3939 12030 17653 14051 4513
18622D513r949q191P729j2259r60R337J7173R46K001J022j4390j0504r865j0795
$$ 4513 -5436 -13627 -5898 -18157 -19117 -9780 7393 8339 10340 11362 -3028 -13532 -23397 -34192
18608c4192J828J2500O819K288P200n6k54j8312J9275J2474J1538q482j9061j9023
$$ -34192 -32364 -19864 -13045 -10757 -3557 -3613 -3867 -22179 -2904 9570 21108 12626 -6435 -25458
18594b5458Q292J2271J5047p049j6583n03J2199J3726O556q015q689Q530J025
$$ -25458 -17166 -4895 10152 3103 -13480 -13983 -1784 11942 18498 10483 1794 10324 11349
18581A1349j3235K157q272l471l767r034L201P144r158p056J5364J2229j97J150
$$ 11349 -1886 271 -8001 -11472 -15239 -24273 -21072 -13928 -23086 -30142 -14778 -2549 -2746 -1596
18567a596M424m57j2898N825O405l985J4021J3143q638j4657m698M165j6248j2791
$$ -1596 2828 2371 -10527 -4702 1703 -2282 11739 24882 16244 1587 -3111 1054 -15194 -27985
18553b7985M077J7779L313J456n045k211p19o136L766O885J8142M960L241K455
$$ -27985 -23908 -6129 -2816 -1360 -6405 -8616 -9335 -15471 -11705 -4820 13322 18282 21523 23978
18539B3978P118P207j3580M56j140q424J6834J0553J6940J5845J9274K5581K7139
$$ 23978 31096 38303 24723 25179 24039 15615 32449 43002 59942 75787 95061 120642 147781
18526A47781J8744J8969J8607j0458k2321k6066l0743l3456j8319J131k4127k2437
$$ 147781 166525 185494 204101 193643 171322 145256 114513 81057 62738 63869 39742 17305
18514A7305N70k8Q742o563m270n773L216o25L84M915J5859Q136J952r275j4226
$$ 17305 17875 17847 26589 20026 15756 9983 13199 12574 12958 17873 33732 41868 43820 34545 20319
18499B0319O090p361l60m592M86P825k1804j0915J3515O496P250L71J930N602
$$ 20319 26409 19048 18688 14096 14582 22407 603 -10312 3203 9699 16949 17320 19250 24852
18485B4852j7366q978j6517J631J7079J2990J4013j191J0475J7473L767J2783
$$ 24852 7486 -1492 -18009 -16378 701 13691 27704 26513 36988 54461 58228 71011
18473G1011K3562K5235R077K0142P611P283j1411k6131k3486k0400k7786j4629
$$ 71011 94573 119808 128885 149027 156638 163921 152510 126379 102893 82493 54707 40078
18461D0078p962l714P028O627k686o436l688p233j6250n912K433q637Q673J0162
$$ 40078 32116 28402 35430 42057 39371 32935 29247 22014 5764 -148 2285 -6352 2321 12483
18447A2483M591j8835q616j496o165J6043j13M473N204J4921l712j2851P355q605
$$ 12483 17074 -1761 -10377 -11873 -18038 -1995 -2108 2365 7569 22490 18778 5927 13282 4677
18433D677L380J338J944M512j5590L555m469M004k409Q839K516q086j408R77J0830
$$ 4677 8057 9395 11339 15851 261 3816 -653 3351 942 9781 12297 4211 2803 3780 14610
18418A4610j498L948o013O884R289j0187j6275j6693j4284J642P658Q011M30J4655
$$ 14610 13112 17060 11047 17931 27220 17033 758 -15935 -30219 -28577 -20919 -12908 -12478 2177
18404B177N586l496M048j3999j5239K853K0158j7200n602L748Q248J2133k859
$$ 2177 7763 4267 8315 -5684 -20923 -18070 2088 -15112 -20714 -16966 -8718 3415 556
18391E56r402j4089J0786j3K317m535q505K012o06J2380J6908R854o550k293L079
$$ 556 -8846 -22935 -12149 -12162 -9845 -14380 -22885 -20873 -21479 -9099 7809 17663 11113 8820 11899
18376A1899j896q377M596P309l048l03k834j1702o367P967K281J6189n705k730
$$ 11899 10003 1626 6222 13531 10483 10180 7346 -4356 -10723 -2756 -475 15714 10009 7279
18362G279k339R47K665K887R279j2270j1835j186R555k559r984n98J968J8483
$$ 7279 4940 5887 8552 11439 20718 8448 -3387 -4573 4982 2423 -7561 -8159 -6191 12292
18348A2292J1148r566k990q345k314r621O013J4603O065L087j0359j8159k1O388
$$ 12292 23440 13874 10884 2539 225 -9396 -3383 11220 17285 20372 10013 -8146 -8167 -1779
18334a779J5080R004n727j3644r239r577J0148R472P377O951n033J8101o67j0731
$$ -1779 13301 22305 16578 2934 -6305 -15882 -5734 3738 11115 18066 13033 31134 30467 19736
18320A9736j6133M420M483J4530K066o465j355n261j24r560k0004j0579J6384
$$ 19736 3603 8023 12506 27036 29102 22637 21282 16021 15897 6337 -13667 -24246 -7862
18307g862L604l004m054k73J2928j736q767J724J119K140L83N15m59J173P517
$$ -7862 -4258 -7262 -11316 -11589 1339 -397 -9164 -7440 -6321 -4181 -3798 -3283 -3742 -2569 4948
18292D948R497N746l329n528M238M194R925P078j2574j5452j1307K510J2048k777
$$ 4948 14445 20191 16862 11334 15572 19766 29691 36769 24195 8743 -2564 -54 11994 9217
18278I217N820m542o421K1179R281j1358m414l88o366O255q177J566J1117J2905
$$ 9217 15037 10495 4074 25253 34534 23176 18762 18374 12008 18263 10086 11652 22769 35674
18264C5674q006OJ0860K281%q953q160J48j1411J0534J1671m066K975n718m620
$$ 35674 27668 27674 38534 40815 40815 31862 23702 23850 12439 22973 34644 30578 33553 27835 23215
18249B3215p024N873M495k66j1153j3347K327K0311J291n230j6328K074q311K350
$$ 23215 16191 22064 26559 26293 15140 1793 4120 24431 25722 20492 4164 6238 -2073 277
18235B77q21Q06O90Q317n817r616n365J437J1253J1614K32n13N283m43m913N811
$$ 277 -544 262 952 9269 3452 -6164 -11529 -10092 1161 12775 13007 12494 17777 17334 12421 18232
18219A8232N547N948j0505l304O275n337l126M11q19l454Q087J9284K0467j2178
$$ 18232 23779 29727 19222 15918 22193 16856 13730 14141 13322 9868 17955 37239 57706 45528
18205D5528j2735M803J0912M981r52j3130k059j1684j1286j1254l366J2451K2099
$$ 45528 32793 37596 48508 53489 52537 39407 37348 25664 14378 3124 -242 12209 34308
18192C4308N480k831k485k093J4501J0022j0248k1923r032j163J9066Q593j4483
$$ 34308 39788 36957 34472 32379 46880 56902 46654 24731 15699 14536 33602 42195 27712
18179B7712n241O186L631J7896l284j6056m550P618N979l221o356o053K221Q370
$$ 27712 22471 28657 32288 50184 46900 30844 26294 33912 39891 36670 30314 24261 26482 34852
18165C4852N958M62R632J337l524l643M955J0776N825k098m291L641L291o676
$$ 34852 40810 41272 50904 52241 48717 45074 50029 60805 66630 64532 60241 63882 67173 60497
18151F0497l540J0877N736j0527k431K697o082j47m034J4426K7104P863K1581
$$ 60497 56957 67834 73570 63043 60612 63309 57227 57080 53046 67472 94576 102439 124020
18138A24020J3744N518M756l347O168J1263R022J1131J0019J8377R518J7987K7920
$$ 124020 137764 143282 148038 144691 150859 162122 171144 182275 192294 210671 220189 238176 266096
18125B66096L6160M8305M5770N3928P9851J11069J16446J39878J88226K61123
$$ 266096 302256 350561 396331 450259 530110 641179 757625 897503 1085729 1346852
18115A346852L72049N52538R11596J583101L006676N541275Q307028P343629J039319
$$ 1346852 1718901 2271439 3183035 4766136 7772812 13314087 21621115 28964744 30004063
18106C0004063m640537o372668o165604m359458k544520j451908r20578o77383
$$ 30004063 25363526 18990858 12825254 8465796 5921276 4469368 3548790 2871407
18098B871407n10040m22327l66407k93663k20310j60861j29220j12742q3097n0495
$$ 2871407 2361367 1939040 1572633 1278970 1058660 897799 768579 655837 572740 522245
18088E22245n1018n6132l7715m1803l1455j8530k9431j2614j7225k9766J992R37
$$ 522245 471227 415095 377380 335577 304122 285592 256161 243547 226322 196556 198548 199485
18076A99485m217k8412q712r019j1097n860J3215j8711k2618j0083J1891L600
$$ 199485 195268 166856 158144 149125 138028 132168 145383 126672 104054 93971 105862 109462
18064A09462J1315L010Q282O588q718P502Q242P635l718K195j686M865L072j4073
$$ 109462 120777 123787 132069 138657 129939 137441 145683 153318 149600 151795 150109 154974 158046 143973
18050A43973L619R250J2549J7690k671O082Q969K1689J7887J1388L128J8373J9892
$$ 143973 147592 156842 169391 187081 184410 190492 199461 221150 239037 250425 253553 271926 291818
18037B91818M3440N2929O3018P9672P1539P5687P8727N2308K8211r128k6581r057
$$ 291818 335258 388187 451205 530877 602416 678103 756830 809138 837349 828221 801640 792583
18025G92583K1462K6716M6464R3910J56208J85185K13879K93475M06020N72009
$$ 792583 814045 840761 887225 981135 1137343 1322528 1536407 1829882 2235902 2807911
18015B807911Q41289J321859K111789L295015M790335O264916O915688O070856
$$ 2807911 3649200 4971059 7082848 10377863 15168198 21433114 28348802 34419658
18007C4419658L602121P1682l206522n406116o111100n548343m455778l279809
$$ 34419658 38021779 38093461 34886939 29480823 23369723 17821380 13365602 10085793
17999A0085793k319793j644677j208006r10200p01075n58170m41005l08352k46133
$$ 10085793 7766000 6121323 4913317 4003117 3302042 2743872 2302867 1994515 1748382
17990A748382j95033j41451j05262m7304k0036j9043k4155l9416l3928l9575l1139
$$ 1748382 1553349 1411898 1306636 1259332 1239296 1220253 1196098 1156682 1122754 1083179 1052040
17979A052040j6885j7972j413J7993J2699p376l1915k9738k4849j2736J441K2747
$$ 1052040 1035155 1017183 1015770 1033763 1046462 1039086 1007171 977433 952584 939848 941289 964036
17967I64036P3173J01513J28786J46639K12430L15611M24583O07977R02028J401686
$$ 964036 1037209 1138722 1267508 1414147 1626577 1942188 2366771 2974748 3876776 5278462
17957E278462K168200L285674M691771N972864O392191N423459K946536m38864
$$ 5278462 7446662 10732336 15424107 21396971 27789162 33212621 36159157 35720293
17949C5720293l461395n408578n863721n220998m085834k934293k042856j429906
$$ 35720293 32258898 26850320 20986599 15765601 11679767 8745474 6702618 5272712
17941E272712j049842p91003o12968m84640l88593k95590k22000j65617j36382
$$ 5272712 4222870 3431867 2818899 2334259 1945666 1650076 1428076 1262459 1126077
17932A126077q1143m4642k4056k2157l0987m2637o8759q6793p8404q9145p8066
$$ 1126077 1044934 1000292 976236 954079 923092 880455 811696 724903 646499 557354 479288
17921D79288n5185n6536m9257k7165j4616o27j0124l6935k0311o582o947j9522
$$ 479288 424103 367567 318310 291145 276529 275902 265778 228843 208532 201950 195003 175481
17909A75481j2509R639k7130r648K586l559q422j7159j9670j4421j606J4624J8269
$$ 175481 162972 172611 145481 135833 138419 134860 126438 109279 89609 75188 73582 88206 106475
17896A06475J2196l464j3288l643j043n733j0323M14J0348J0697j1137j6005K369
$$ 106475 118671 115207 101919 98276 97233 91500 81177 81591 91939 102636 91499 75494 77863
17883G7863J3587P27j2730o603M500m797l682j1352j0660j8733p813J9369K809
$$ 77863 91450 92177 79447 72844 77344 72547 68865 57513 46853 28120 20307 39676 42485
17870D2485j0376M360J676J0375k91j4359j7636l231J4322k081J730L154M068
$$ 42485 32109 36469 38145 48520 48229 33870 16234 13003 27325 25244 26974 30128 34196
17857C4196J140J1723J770J371K86j0051M094o501p874l414N175J2070O438j1925
$$ 34196 35336 47059 48829 50200 50486 40435 44529 38028 30154 26740 31915 43985 50423 38498
17843C8498j1042j5984P748m387k806r585M41N655Q029p980L549K1665J4122K283
$$ 38498 27456 11472 19220 14833 12027 2442 2883 8538 16567 8587 12136 33801 47923 50206
17829E0206p957p318n238n836L749j926R744j5684k422J1323j405r094O763M216
$$ 50206 42249 34931 29693 23857 27606 25680 35424 19740 17318 28641 27236 18142 24905 29121
17815B9121P090k513j3519O82P311P446o65j1710q380L051j117l727k403k642
$$ 29121 36211 33698 20179 20861 28172 35618 34953 23243 14863 17914 16797 13070 10667 8025
17801H025p330l797J1768J5531Q470J0417K276j4933j1342J3104Q363k39M94j2609
$$ 8025 695 -3102 8666 24197 32667 43084 45360 30427 19085 32189 40552 40313 40807 28198
17787B8198k1986N621J0862J2715O597k6189j4261L593R031L081J0699J1833j1552
$$ 28198 6212 11833 22695 35410 42007 15818 1557 5150 14181 17262 27961 39794 28242
17774B8242j6198j2946L851L544N090j1089Q50O145k13R946J2502m226m432N979
$$ 28242 12044 -902 2949 6493 11583 494 1344 7489 7276 17222 29724 25498 21066 27045
17760B7045R67M088p253j5350p34o707j1744N719J3367M958p725m838J7934l359
$$ 27045 28012 32100 24847 9497 8763 2056 -9688 -3969 9398 14356 6631 1793 19727 16368
17746A6368j4280l123K917N414j3720j936o555J11k654K497Q191O457P895O325
$$ 16368 2088 -1035 1882 7296 -6424 -8360 -14915 -14804 -17458 -14961 -6770 -313 7582 13907
17732A3907J354k324l951J3967r42j7926j5860O405K994j3330j2843l279L0627
$$ 13907 15261 12937 8986 22953 22011 4085 -11775 -5370 -2376 -15706 -28549 -31828 -1201
17719a201J1816m209n458K181O783J081O96m437J474l218j2676O981J8968L369
$$ -1201 10615 6406 948 3129 9912 10993 11689 7252 8726 5508 -7168 -187 18781 22150
17705B2150q685j5846m522l953k361k605J1883K5241j753k96n34r03j882r925
$$ 22150 13465 -2381 -6903 -10856 -13217 -15822 -3939 21302 19549 19253 18719 17816 15934 6009
17691F009j6906O218j685K207P967O870j1341j0334L275P65L611Q397Q1p512N092
$$ 6009 -10897 -4679 -6364 -4157 3810 10680 -661 -10995 -7720 -6955 -3344 5053 5134 -2378 2714
17676B714J821r54l547M83R329M597j1316j1459J40J7202O928K099r032o886K910
$$ 2714 4535 3581 34 517 9846 14443 3127 -8332 -8192 9010 15938 18037 9005 2119 5029
17661E029J4005j364o280j82J2592P128n825j997M868l273Q208J1430J830K4904
$$ 5029 19034 17670 11390 11208 23800 30928 25103 23106 27974 24701 32909 44339 46169 71073
17647G1073N9851P2210O6295O7484N1163J4231k1412n2925o8482n8123l3248m2283
$$ 71073 130924 203134 269429 336913 388076 402307 380895 327970 259488 201365 168117 125834
17635A25834l7899j4406j5178k5442j5778r459j4413o601Q953K098R428k276k630
$$ 125834 87935 73529 58351 32909 17131 7672 -6741 -13342 -4389 -2291 7137 4861 2231
17622B231N399P757r39N677N221p666l762O838R926L877j774j1670q151q568n430
$$ 2231 7630 15387 14448 20125 25346 17680 13918 20756 30682 34559 32785 21115 12964 4396 -1034
17607a034L929O796k103j0756o021Q603J0902N635J9149j0434M252Q997P862K4783
$$ -1034 2895 9691 7588 -3168 -9189 -586 10316 15951 35100 24666 28918 37915 45777 70560
17593G0560L5049K0621O5809Q6938O4679M0949q999l6646o9557o3944m4791l0870
$$ 70560 105609 126230 192039 278977 343656 384605 375606 338960 269403 205459 160668 129798
17581A29798l8624k1009l03p307j8419j0969n890R253m908j1679j3827l501K5206
$$ 129798 91174 70165 69862 62555 44136 33167 27277 36530 31622 19943 6116 2615 27821
17568B7821N000n928j6909L514M20j929R095K709p835n756L82j6033j44K027j1163
$$ 27821 32821 26893 9984 13498 13918 11989 21084 23793 15958 10202 10584 -5449 -5593 -3566 -14729
17553a4729p023L477K4464L0125L275j2663q840K465m469Q874r985n257n482P596
$$ -14729 -21752 -18275 6189 36314 39589 26926 18086 20551 16082 24956 14971 9714 4232 11828
17539A1828m238n062R636J3485o737m659P134r06j4258q587o188p68j1678n086
$$ 11828 7590 2528 12164 25649 18912 14253 21387 20481 6223 -2364 -8552 -9320 -20998 -26084
17525b6084K013L222Q871J7524R375j321L29J41j571q034K20r072k221m602J8269
$$ -26084 -24071 -20849 -11978 5546 14921 13600 13929 14070 12499 4465 4685 -4387 -6608 -11210 7059
17510G059J0729l742M33Q386m591j5116M131M019j6019p979J41M728m530L942
$$ 7059 17788 14046 14479 22865 18274 3158 7289 11308 -4711 -12690 -12549 -7821 -12351 -8409
17496h409R935R870r29R338L158J2975J3115M25Q813K9388K7355K0683R381J415
$$ -8409 1526 11396 10467 19805 22963 35938 49053 49478 58291 87679 115034 135717 145098 146513
17482A46513P823O62k3108l5886j1426Q551r853k3650o890q251j4831j7875j036
$$ 146513 154336 154998 131890 96004 84578 93129 83276 59626 52736 44485 29654 11779 10743
17469A0743k94J0652M731l236p411n302n957Q900Q659l047L210q74r883k709m469
$$ 10743 10449 21101 25832 22596 15185 9883 3926 12826 21485 18438 21648 20774 10891 8182 3713
17454C713o830N316N685n602q414J0679J2605m119R900K4740K6383L8681M1529
$$ 3713 -3117 2199 7884 2282 -6132 4547 17152 13033 22933 47673 74056 112737 154266
17441A54266K2190p014k1780m8456l1355j1422Q791J4760R216J2420Q485K4180
$$ 154266 176456 169442 147662 99206 67851 56429 65220 79980 89196 101616 110101 134281
17429A34281K7576J7050J2237m583k7177j5522l9471m0839j2115K543n984k0049
$$ 134281 161857 178907 191144 186561 159384 143862 104391 63552 51437 53980 47996 27947
17417B7947j1462j877r678L614K271p264j4800o287J678L498J4472P665K225K879
$$ 27947 16485 14608 4930 8544 10815 3551 -11249 -17536 -15858 -12360 2112 9777 12002 14881
17403A4881J4908M070k0496l786J89N524j4864n029P25l249m347J244J1290Q374
$$ 14881 29789 33859 13363 9577 9766 15290 426 -4603 -3878 -7127 -11474 -10230 1060 9434
17389I434j9586J00j95j091L384P4m819L556N818l974m217j020l681M039J2360
$$ 9434 -10152 -10052 -10247 -11338 -7954 -7880 -12699 -9143 -3325 -7299 -11516 -12536 -16217 -12178 182
17374A82n845j0514k70k503q10L281J9377N441j3950j5990M714J7375J763j0280
$$ 182 -5663 -16177 -16447 -18950 -19760 -16479 2898 8339 -5611 -21601 -16887 488 2251 -8029
17360h029n61L375n730n016M438R593P708K542q161j5804q706P278J2062L884
$$ -8029 -8590 -5215 -10945 -15961 -11523 -1930 5778 8320 159 -15645 -24351 -17073 -5011 -1127
17346a127J0055k425J3216J8780j4961k856p968o8m933q213L631o224o247r295
$$ -1127 8928 6503 19719 38499 23538 20682 12714 12646 7713 -500 3131 -3093 -9340 -18635
17332a8635o760K647K149L608L125J749N433K406j0521R034J0301K905K700j2247
$$ -18635 -25395 -22748 -20599 -16991 -13866 -12117 -6684 -4278 -14799 -5765 4536 7441 10141 -2106
17318b106n887K466l231l835O171j3832m261K448N44k182K4165K276j4976Q200
$$ -2106 -7993 -5527 -8758 -12593 -6422 -20254 -24515 -22067 -21523 -23705 460 2736 -12240 -4040
17304d040P900J686O420n323K094R043q987j2268m804j4643p582M792K48J6766
$$ -4040 3860 5546 11966 6643 8737 17780 8793 -3475 -8279 -22922 -30504 -25712 -25464 -8698
17290h698J2284l003j0080L628Q684n265j1813R369J6231J048Q747n364j321o838
$$ -8698 3586 583 -9497 -5869 2815 -2450 -14263 -4894 11337 12385 21132 15768 14447 7609
17276G609j4609n214j528m525M772N068J3143J163l790p509r353p82N263l53p805
$$ 7609 -7000 -12214 -13742 -18267 -13495 -8427 4716 5879 2089 -5420 -14773 -15555 -10292 -10645 -18450
17261a8450M004Q99l367J4057J0137J0199j8111q173m786k625j1267o847J3006
$$ -18450 -14446 -13547 -16914 -2857 7280 17479 -632 -8805 -13591 -16216 -27483 -34330 -21324
17248b1324Q390N212k983r72m428l60O89j1885J7952J9529q200r022p507N142
$$ -21324 -12934 -7722 -10705 -11677 -16105 -16465 -15776 -27661 -9709 9820 1620 -7402 -14909 -9767
17234i767N957O546j1084n581R634J4710J077R63k28j2939K260J0457l381j4664
$$ -9767 -3810 2736 -8348 -13929 -4295 10415 11492 12455 12227 -712 1548 12005 8624 -6040
17220f040p452j493m561K717O282j0284M356J8442K884m217L948L550j1209N43
$$ -6040 -13492 -14985 -19546 -16829 -10547 -20831 -16475 1967 4851 634 4582 8132 -3077 -2534
17206b534M118o89m701K163l492O281J2344M345r159j9277j4286n43J9028j597
$$ -2534 1584 895 -3806 -1643 -5135 1146 13490 17835 8676 -10601 -24887 -25430 -6402 -7999
17192g999l748j0494K897J1037j10J471J269N368m455n288j3950j375J3102P281
$$ -7999 -11747 -22241 -19344 -8307 -8417 -6946 -5677 -309 -4764 -10052 -24002 -25377 -12275 -4994
17178d994j367m981J1555j5745l212K0957R64j5478o887N246N127J7424n693j6048
$$ -4994 -6361 -11342 213 -15532 -18744 2213 3177 -12301 -19188 -13942 -8815 8609 2916 -13132
17164a3132p937k872K702j742J1790o644j9027N393K4167L4856J0309p744M089
$$ -13132 -21069 -23941 -21239 -22981 -11191 -17835 -36862 -31469 -7302 27554 37863 30119 34208
17151C4208j000p389J05J0373k1902p409R34p073J49j1000q188j3915K904J7575
$$ 34208 33208 25819 25924 36297 14395 6986 7920 847 996 -10004 -18192 -32107 -29203 -11628
17137a1628M134J2078J2021j937j1842j1562l599j2890J5201K0832J854k332j2046
$$ -11628 -7494 4584 16605 14668 2826 -8736 -12335 -25225 -10024 10808 12662 10330 -1716
17124a716m325J93R25Q762R236J7315o628j5997K25p364j427P488P514J3479K986
$$ -1716 -6041 -5848 -4923 3839 13075 30390 23762 7765 7990 626 -801 6687 14201 27680 30666
17109C0666M704j3550j4182L522j0456n567N335N318P663j9617k857M573n478
$$ 30666 35370 21820 7638 11160 704 -4863 472 5790 13453 -6164 -9021 -4448 -9926
17096i926O916J0586q231r149R606m821l552m685o513N949J5824l413j885k746
$$ -9926 -3010 7576 -655 -9804 -198 -5019 -8571 -13256 -19769 -13820 2004 -1409 -3294 -6040
17082f040R337j0324o381N07M128J5106N874k896n439P013p227j2925n905O167
$$ -6040 3297 -7027 -13408 -12901 -8773 6333 12207 9311 3872 10885 3658 -9267 -15172 -9005
17068i005J2057R010Q842R188j7383k2067j2838j726J6234M184j4061j2098K488
$$ -9005 3052 12062 20904 30092 12709 -9358 -22196 -23922 -7688 -3504 -17565 -29663 -27175
17055b7175K143j405O040P815K069K934J1688l786r323p46J0297O548p377n519
$$ -27175 -25032 -26437 -20397 -12582 -10513 -7579 4109 323 -9000 -9746 551 7099 -278 -5797
17041e797Q34N347j0781j5757L714r46R404P358R1O00o515P721Q151Q018j123
$$ -5797 -4963 384 -10397 -26154 -22440 -23386 -13982 -6624 -6533 -5933 -12448 -4727 3424 11442 10319
17026A0319K034O810J3536j4332j7798j2507M822R798o069m714J1504P470n088
$$ 10319 12353 19163 32699 18367 569 -11938 -7116 2682 -3387 -8101 3403 10873 5785
17013E785j0800o110M703K2040j164j4022j0584j4789J4005J607j2183j843j000
$$ 5785 -5015 -11125 -6422 15618 14454 432 -10152 -24941 -10936 -9329 -21512 -23355 -24355
17000b4355R59M992P360K3156J1194j5024j0427l295k135O585L248n350J2362
$$ -24355 -23396 -18404 -11044 12112 23306 8282 -2145 -5440 -7575 -990 2258 -3092 9270
16987I270J828j1387q980j232m534J624q163J3221J3478j002j2007l789R865J994
$$ 9270 11098 -289 -9269 -10501 -15035 -13411 -21574 -8353 5125 4123 -7884 -11673 -1808 186
16973A86O864q257j977L403L388k008k574J986N117K112q510n68N535q436o330
$$ 186 7050 -1207 -3184 219 3607 1599 -975 1011 6128 8240 -270 -838 4697 -3739 -10069
16958a0069l355j0072q479J1597K2715N634R27k484j7299j9966M977J0670J2596
$$ -10069 -13424 -23496 -31975 -20378 2337 7971 8898 6414 -10885 -30851 -25874 -15204 -2608
16945b608K0613j979M802P659K636m836l525J624k441j8516o721n933j7740m404
$$ -2608 18005 16026 20828 28487 31123 26287 22762 24386 21945 3429 -3292 -9225 -26965 -31369
16931c1369J3852K3870n071Q656K717m898m011q446j0216K515J4417J2512o628
$$ -31369 -17517 6353 1282 9938 12655 7757 3746 -4700 -14916 -12401 2016 14528 7900
16918G900j6539P978J4732r434p075k17o642K543Q827j2722L506J612N64o14J7951
$$ 7900 -8639 -661 14071 4637 -2438 -2655 -9297 -6754 2073 -10649 -7143 -5531 -4967 -5581 12370
16903A2370N409o914j3256l885k216L980O97R398m651L709L029P33R410J056p686
$$ 12370 17779 10865 -2391 -6276 -8492 -4512 -3815 5583 932 4641 7670 8403 17813 18869 11183
16888A1183L114l938q721K107J0146J0858m64p246n109j0753K605O466p457Q140
$$ 11183 14297 10359 1638 3745 13891 24749 24285 17039 11930 1177 3782 10248 2791 10931
16874A0931N23j3283j2610O835O361o327N104J0030r45r156q74j4337p0K85n697
$$ 10931 11454 -1829 -14439 -7604 -1243 -7570 -2466 7564 6619 -2537 -3411 -17748 -17818 -17533 -23230
16859b3230r284k473n936N45n973J0431J9991N6L673P552K258l619J89p110K885
$$ -23230 -32514 -34987 -40923 -40378 -46351 -35920 -15929 -15873 -12200 -4648 -2390 -6009 -5820 -12930 -10045
16844a0045O467m100J247k251j4393m196o733o526L315K317K7554J1401j283l234
$$ -10045 -3578 -7678 -6431 -8682 -23075 -27271 -34004 -40530 -37215 -34898 -7344 4057 2774 -460
16830d60K102Q813n017j2856M506M847k0551K287N334m344M677m32m849l564J2579
$$ -460 1642 10455 5438 -7418 -2912 1935 -18616 -16329 -10995 -15339 -10662 -11094 -15943 -19507 -6928
16815f928J084L20R812J7203j1384r280J394J156l473n967l216r611P250P729
$$ -6928 -5844 -5524 4288 21491 10107 827 2221 3377 -96 -6063 -9279 -18890 -11640 -3911
16801c911M830o782q646R431l021j0151Q22n85J511M25O910O685J0834K076j2185
$$ -3911 919 -5863 -14509 -5078 -8099 -18250 -17428 -18013 -16502 -16077 -9167 -2482 8352 10428 -1757
16786a757k0094O861j663Q873M850p86L726Q095j394k276j1173j9922j7519Q529
$$ -1757 -21851 -14990 -16653 -7780 -2930 -3716 10 8105 6711 4435 -6738 -26660 -44179 -35650
16772c5650J6003J3796J4153J435j0485k2015r544O28R092Q964P440O788M094
$$ -35650 -19647 -5851 8302 9737 -748 -22763 -32307 -31679 -22587 -13623 -6183 605 4699
16759D699j517p108J08N023P277M694J2727k767k1165q532n7J5182Q145l567n02
$$ 4699 3182 -3926 -3818 1205 8482 13176 25903 23136 1971 -6561 -6618 8564 16709 13142 12640
16744A2640Q595p801j5844k765O411R060j4970j4785J875K6897P827o929L474
$$ 12640 21235 13434 -2410 -5175 1236 10296 -4674 -19459 -17584 9313 17140 10211 13685
16731A3685k567Q092J063l07m029p560M445J2772M395r957r218M551R976k072
$$ 13685 11118 19210 20273 19966 15937 8377 12822 25594 29989 20032 10814 15365 25341 23269
16717B3269R637q554k0936j3392J7566M719o649k2679p936J7599J6108o397m157
$$ 23269 32906 24352 3416 -9976 7590 12309 5660 -17019 -24955 -7356 8752 2355 -1802
16704a802q870k770J4734L600m577R85j2019j5246L859R23J4846J6186m969k41
$$ -1802 -10672 -13442 1292 4892 315 1300 -10719 -25965 -22106 -21183 -6337 9849 4880 4639
16690D639N305M102r21j0215p964L960n215J0094J0254o290j1812K577Q767l758
$$ 4639 9944 14046 13125 2910 -5054 -1094 -6309 3785 14039 7749 -4063 -1486 7281 3523
16676C523j1015R229L386o497l844r260p98j769j7209P199N747J834k279m594
$$ 3523 -7492 1737 5123 -1374 -5218 -14478 -15276 -17045 -34254 -27055 -21308 -19474 -21753 -26347
16662b6347Q716J3402j0607l405L156Q746l518m518J2899j5654j0481L741J544
$$ -26347 -17631 -4229 -14836 -18241 -15085 -6339 -9857 -14375 -1476 -17130 -27611 -23870 -22326
16649b2326kJ1276M871L453J871J1762K326m212R949j085j2872j0885m654n671
$$ -22326 -22328 -11052 -6181 -2728 -857 10905 13231 9019 18968 17883 5011 -5874 -10528 -16199
16635a6199k235J1474l516j5599L092J6152j41q495J872O935l525J2613l438j4382
$$ -16199 -18434 -6960 -10476 -26075 -22983 -6831 -6972 -15467 -13595 -6660 -10185 2428 -1010 -15392
16621a5392j788P213O64l77M484J4298k66q634n782O091J5130k569k432m546j0326
$$ -15392 -17180 -9967 -9303 -9680 -5196 9102 8836 202 -5580 511 15641 13072 10640 6094 -4232
16606d232l07m036K002J2665N791j1068j1096l114p11o932J3320J6867J0154J4786
$$ -4232 -4539 -8575 -6573 6092 11883 815 -10281 -13395 -14106 -21038 -7718 9149 19303 34089
16592C4089o019q65j2697k6783j1444J4534p400k200J424k305L823N066J981j1249
$$ 34089 28070 27205 14508 -12275 -23719 -9185 -16585 -18785 -17361 -19666 -15843 -10777 -8796 -20045
16578b0045r766J0593P410m614L534R043O808j0581j5115Q389m695P307J0788
$$ -20045 -29811 -19218 -11808 -16422 -12888 -3845 2963 -7618 -22733 -14344 -19039 -11732 -944
16565i44R981J749K757j9731j3325q448R898R773k024o351k827N252R678J2672
$$ -944 9037 10786 13543 -6188 -19513 -27961 -18063 -8290 -10314 -16665 -19492 -14240 -4562 8110
16551H110k010N547m517n386L670L953m519j7248j016m506J7661j784j1233J355
$$ 8110 6100 11647 7130 1744 5414 9367 4848 -12400 -13416 -17922 -261 -2045 -13278 -11923
16537a1923o741j2429p001O110J3202K972q658o199m900J2647J085J1372O831
$$ -11923 -18664 -31093 -38094 -31984 -18782 -15810 -24468 -30667 -35567 -22920 -21835 -10463 -3632
16524c632l363J2754N359j4577k3k784o115J419J2042Q702L985n422j1069p179
$$ -3632 -6995 5759 11118 -3459 -3482 -6266 -12381 -10962 1080 9782 13767 8345 -2724 -9903
16510i903J2568n159j4658j3355O463J2846N48r389J511j5318o022K5829K2407
$$ -9903 2665 -2494 -17152 -30507 -24044 -11198 -10650 -20039 -18528 -33846 -39868 -14039 8368
16497H368J2458j2318J804J0947K960m242P655n400j5426l947J4564J0744p880
$$ 8368 20826 8508 10312 21259 24219 19977 27632 22232 6806 2859 17423 28167 20287
16484B0287M802j4185o148r03o796j2949P341J7120r095k803Q260J2865n522j093
$$ 20287 25089 10904 4756 3853 -2943 -15892 -8551 8569 -526 -3329 4931 17796 12274 11181
16470A1181j722m658Q421M494k683j4128p107J6812l614L110O4q2j49J241j2637
$$ 11181 9459 4801 13222 17716 15033 905 -6202 10610 6996 10106 10170 10088 9939 11180 -1457
16455a457J671O164j874l190kk575M197O868O974p617j4474q144l032n563j252
$$ -1457 214 6378 4504 1314 1312 -1263 2934 9802 16776 9159 -5315 -13459 -16491 -22054 -23306
16440b3306R855N938M135l694l758j573j167J5683J781j1150K208m072L311O755
$$ -23306 -13451 -7513 -3378 -7072 -10830 -12403 -13570 2113 3894 -7256 -5048 -9120 -5809 946
16426I46M929J2544Q77j6771L24J917m827k450J157M229J4061J854o72j2044n405
$$ 946 5875 18419 19296 2525 2849 4766 -61 -2511 -1354 2875 16936 18790 18118 6074 669
16411F69j2978M546N511j025k674J0632L100p982K774R638O156p104j440L751
$$ 669 -12309 -7763 -2252 -3277 -5951 4681 7781 -201 2573 12211 18367 11263 9823 13574
16397A3574j70n750l792J3032M616J374n523j4059j6937k286J3289J3789j6012
$$ 13574 13404 7654 3862 16894 21510 22884 17361 3302 -13635 -15921 -2632 11157 -4855
16384d855m071Q153j637J2409Q80N930J833n015j081j1719Q125J3993J526P577
$$ -4855 -8926 -773 -2410 9999 10879 16809 18642 13627 12546 827 8952 22945 24471 32048
16370C2048P3m734l859j3892K586N508m656l597k974j3474k0346N033N014j041
$$ 32048 32121 27387 23528 9636 12222 17730 13074 9477 6503 -6971 -27317 -22284 -17270 -18311
16356a8311O664J2922o690R652n353k1817J2946N803j460n187O318J2393p705
$$ -18311 -11647 1275 -5415 4237 -1116 -22933 -9987 -4184 -5644 -10831 -4513 7880 175
16343A75k275J747p330L22J809p454j660K601J044M328K0116o882n442n234j683
$$ 175 -2100 -353 -7683 -7361 -5552 -13006 -14666 -12065 -11021 -6693 13423 6541 1099 -4135 -5818
16328e818J1673j2562M257J2939n618j4015j0173J200k762K354K373O802K822
$$ -5818 5855 -6707 -2450 10489 4871 -9144 -19317 -18117 -20879 -18525 -16152 -9350 -6528
16315f528j0483O804J1303j3044j0064L492J1374M373n023j4070k3564o591J7534
$$ -6528 -17011 -10207 1096 -11948 -22012 -18520 -7146 -2773 -7796 -21866 -45430 -52021 -34487
16302c4487J4319R198J4653M454o992n762r86R158j951n484n419P063m06l957
$$ -34487 -20168 -10970 3683 8137 1145 -4617 -5603 3555 1604 -3880 -9299 -2236 -2642 -6599
16288f599j5465K859K0355J6372k873j3165K09N625O000P772n429j9774j3044
$$ -6599 -22064 -19205 1150 17522 14649 1484 1693 7318 13318 21090 15661 -4113 -17157
16275a7157L278K2547M778j887L79j6660M454J192J767K583j278j117K510K599
$$ -17157 -13879 8668 13446 11559 11938 -4722 -268 924 2691 5274 3996 2879 5389 7988
16261G988J650j1968m272R216L365N245m282o583j58j3462m814K554l255Q107
$$ 7988 9638 -2330 -6602 2614 5979 11224 6942 359 201 -13261 -18075 -15521 -18776 -10669
16247a0669J962J296j58K636p7m99M239j596j402j062j196J1154j798o448j4048
$$ -10669 -8707 -7411 -7569 -4933 -5010 -5509 -1270 -2866 -4268 -5330 -6526 4628 2830 -3618 -17666
16232a7666l836L147J1159J996K433q21o638M100N297J4168K806Q6o904k1966
$$ -17666 -21502 -18355 -7196 -5200 -2767 -3588 -10226 -6126 -829 13339 16145 16231 9327 -12639
16218a2639p663J5746J0920r584o971j450L820L958J684K375n187L32K1279P326
$$ -12639 -20302 -4556 6364 -3220 -10191 -11641 -7821 -3863 -2179 196 -4991 -4659 16620 23946
16204B3946j4298j2099m904q675J3355J997J2107Q014j0172r0j1607k33k477P38
$$ 23946 9648 -2451 -7355 -16030 -2675 -678 11429 19443 9271 9181 -2426 -2659 -5136 -4398
16190d398J920q678R642J815N595P513j0830n671J1847j0154j5527M857l20J902
$$ -4398 -2478 -11156 -1514 301 5896 13409 2579 -3092 8755 -1399 -16926 -12069 -12389 -10487
16176a0487P02J431l236P68J0539P523j0062q367L214k07J3071M029Q270l925
$$ -10487 -9785 -8354 -11590 -10822 -283 7240 -2822 -11189 -7975 -8182 4889 8918 17188 13263
16162A3263m868n122k317j7588l760O744l861J957M052P705N891P930j817o697
$$ 13263 8395 3273 956 -16632 -20392 -13648 -17509 -15552 -11500 -3795 2096 10026 8209 1512
16148A512L705M506Q056O549o911j2123j8857r143K3L185J2209m548k972J0468
$$ 1512 5217 9723 17779 24328 17417 5294 -13563 -22706 -22683 -19498 -7289 -11837 -14809 -4341
16134d341J1408R822J325o185l595l990J162J533m355R36Q324m667j6221J852
$$ -4341 7067 16889 18214 12029 8434 4444 5606 7139 2784 3720 12044 7377 -8844 -6992
16120f992L730M479n87l316L42K233p346J6020p018p058m25l757N31J580J2827
$$ -6992 -3262 1217 630 -2686 -2344 -111 -7457 8563 1545 -5513 -5938 -9695 -9164 -7584 5243
16105E243M3R714R36n127j963p468k2N850m393m347n719k767L318o52R662R886
$$ 5243 5286 15000 15936 10809 8846 1378 1356 7206 2813 -1534 -7253 -10020 -6702 -7354 2308 12194
16089A2194k87r546o940p60j307q827j0779p616L298J3196N215J5499o850Q54
$$ 12194 11907 2361 -4579 -5339 -6646 -15473 -26252 -33868 -30570 -17374 -12159 3340 -3510 -2656
16075b656M090j628K335r264J4575R751l686k0723q825J2936J282J420J2337J741
$$ -2656 1434 -194 2141 -7123 7452 17203 13517 -7206 -16031 -3095 -1813 -393 11944 13685
16061A3685P119J2801r381k789j489j6273m867K167k231M281q545o794O670O285
$$ 13685 20804 33605 24224 21435 19946 3673 -1194 973 -1258 3023 -5522 -12316 -5646 639
16047F39M137l262N531M390j2136j0970q700L155K2242M985j9906j5252J0415
$$ 639 4776 1514 7045 11435 -701 -11671 -20371 -17216 5026 10011 -9895 -25147 -14732
16034a4732N476J5294Q236j5190l931N83J62P96j1544k382r565P619N597K5616
$$ -14732 -9256 6038 14274 -916 -4847 -4264 -4102 -3306 -14850 -17232 -26797 -19178 -13581 12035
16020A2035M372j326p119l876l101p282J433O70O139O222q62M267N549K019o939
$$ 12035 16407 15081 7962 4086 985 -6297 -4864 -4194 1945 8167 7305 11572 17121 19140 12201
16005A2201o351j147l394n539n874p867J1680M974J813k047j0096L30J8227Q986
$$ 12201 5850 4703 1309 -4230 -10104 -17971 -6291 -1317 496 -1551 -11647 -11317 6910 15896
15991A5896P185P132J0574p647j6435q381O964j6890o408Q806K975o27L582k1361
$$ 15896 23081 30213 40787 33140 16705 8324 15288 -1602 -8010 796 3771 3144 6726 -14635
15977a4635j0639k1558J5084J6092k341m364L929K833N209J2791o988n794J0348
$$ -14635 -25274 -46832 -31748 -15656 -17997 -22361 -18432 -15599 -10390 2401 -4587 -10381 -33
15964c3k022p29p772k685m368m317R605R834M55K626n458j0767k700l072J1507
$$ -33 -2055 -2784 -10556 -13241 -17609 -21926 -12321 -2487 -2032 594 -4864 -15631 -18331 -21403 -9896
15949i896o38m861K661N529J535p856r49P213l060j1779j791J7620J29M680L458
$$ -9896 -10534 -15395 -12734 -7205 -5670 -13526 -14475 -7262 -10322 -22101 -23892 -6272 -6143 -1463 1995
15934A995j9926n065N14p27O523j083j2375O260O289j0558l931J5298q477O238
$$ 1995 -17931 -22996 -22482 -23209 -16686 -17769 -30144 -23884 -17595 -28153 -32084 -16786 -25263 -19025
15920a9025J921j5407J0526P340J0947J8519j1023j595q313M144L042M34M610
$$ -19025 -17104 -32511 -21985 -14645 -3698 14821 3798 2203 -6110 -1966 1076 1510 6120
15907F120K918j803N987n584P376m594l29P296O860j5910q861o676k089R60l46
$$ 6120 9038 7235 13222 7638 15014 10420 10091 17387 24247 8337 -524 -7200 -9289 -8329 -8675
15892h675N072r536L765M306m667P158J6026k826j9194o24O159J6767J2814n739
$$ -8675 -3603 -13139 -9374 -5068 -9735 -2577 13449 10623 -8571 -9195 -3036 13731 26545 20806
15878B0806k878M037m740j1037l614K581P525O855J0567j16p279Q89l623k4193
$$ 20806 17928 21965 17225 6188 2574 5155 12680 19535 30102 29986 22707 23596 19973 -4220
15864d220N110J6133J9199m236k3070j0819P184m524q988K739j029O641r01p883
$$ -4220 890 17023 36222 31986 8916 -1903 5281 757 -8231 -5492 -6521 120 -781 -8664
15850h664P584J0436n191r203k126L434K645m635K533N435J1655Q111o267k1368
$$ -8664 -1080 9356 4165 -5038 -7164 -3730 -1085 -5720 -3187 2248 13903 22014 15747 -5621
15836e621k345O79M053r08m416k740P152N726P762R459k61J0601q072p742j5477
$$ -5621 -7966 -7287 -3234 -4142 -8558 -11298 -4146 1580 9342 18801 18540 29141 21069 13327 -2150
15821b150j3254j0713J2518J0077l328m837p054q306L152J9525J9909J2309l752
$$ -2150 -15404 -26117 -13599 -3522 -6850 -11687 -18741 -27047 -23895 -4370 15539 27848 24096
15808B4096j5080k11K662j1787n062k0953l813q61k549J221O704J5449N996L042
$$ 24096 9016 8805 11467 -320 -5382 -26335 -30148 -31009 -33558 -32337 -25633 -10184 -4188 -1146
15794a146J886M78q970J52K923N810r85N45R489p75k987m733M123m498j643M357
$$ -1146 740 1218 -7752 -7600 -4677 1133 148 693 10182 9407 6420 1687 5810 1312 -331 4026
15778D026j0902N542n309q772o428R232R951n888J631P812L51J3733M401n989
$$ 4026 -6876 -1334 -6643 -15415 -21843 -12611 -2660 -8548 -6917 895 1246 14979 19380 13391
15764A3391k525j343l346m971K474n789J606K601j1182n598N317k611k137K466
$$ 13391 10866 9523 6177 1206 3680 -2109 -503 2098 -9084 -14682 -9365 -11976 -14113 -11647
15750a1647m972k970P199J0428N657R144m599j2260K588l79m188k6137l267L738
$$ -11647 -16619 -19589 -12390 -1962 3695 12839 8240 -4020 -1432 -1811 -5999 -32136 -35403 -31665
15736c1665P993J5259Q925K693j694N427O159p923j2196p277R880q034l352l388
$$ -31665 -23672 -8413 512 3205 1511 6938 13097 5174 -7022 -14299 -4419 -12453 -15805 -19193
15722a9193o456J5384K7543k803K599k465j0018j0644L718o940p242Q652J9976
$$ -19193 -25649 -10265 17278 14475 17074 14609 4591 -6053 -2335 -9275 -16517 -7865 12111
15709A2111m98j4495R306N678p191J717R083j0977j0323p322K134J4899Q239Q064
$$ 12111 11613 -2882 6424 12102 4911 6628 15711 4734 -5589 -12911 -10777 4122 12361 20425
15695B0425o171J4462k403k0430q543q742P92K633N240J3372j932L602N098j3246
$$ 20425 14254 28716 26313 5883 -2660 -11402 -10610 -7977 -2737 10635 8703 12305 17403 4157
15681D157l244N658n938J2830j631j027O17N49l661j7828r04J1829l809N920J364
$$ 4157 913 6571 633 13463 11832 10805 11422 11971 8310 -9518 -10422 1407 -2402 3518 4882
15666D882L069N694j69p862k637o47q071J2128R87k1156j1800J7006J0887J972
$$ 4882 7951 13645 13476 5614 2977 2330 -5741 6387 7374 -13782 -25582 -8576 2311 4283
15652D283Q364j0930j4210o99N013p381q552O737N842O203Q746j970j16O044j1054
$$ 4283 12647 1717 -12493 -13192 -8179 -15560 -24112 -17375 -11533 -5330 3416 1446 1330 7374 -3680
15637c680P31j1401k051J0324J1467q05K156j257q752K625M358m143n795J0066
$$ -3680 -2949 -14350 -16401 -6077 5390 4585 6741 5484 -3268 -643 3715 -428 -6223 3843
15623C843J1190P884j3175j0051n707o762q287L09P365O550O899N241P023P722
$$ 3843 15033 22917 9742 -309 -6016 -12778 -21065 -20756 -13391 -6841 58 5299 12322 20044
15609B0044j3318k4198K62J8799o983j2765R07J3632Q422P863q344o377q025m969
$$ 20044 6726 -17472 -17210 1589 -5394 -18159 -17252 -3620 4802 12665 4321 -2056 -10081 -15050
15595a5050J866J1346N005m15j1338J0420M080L786m359r647O740j147n31P716
$$ -15050 -13184 -1838 3167 2752 -8586 1834 5914 9700 5341 -4306 2434 1287 756 8472
15581H472j206R79k026m557j074q971J5320J4157R171k4361k1503k206K73J5823
$$ 8472 7266 8245 6219 1662 588 -8383 6937 21094 30265 5904 -15599 -17805 -17532 -1709
15567a709R886j807j5973m257j0509q158J2790o255J151K3701k699k944J0802
$$ -1709 8177 6370 -9603 -13860 -24369 -32527 -19737 -25992 -24841 -1140 -3839 -6783 4019
15554D019J76l45K125L71m320l414M6O16Q391r687K297n728P074J0286P1l909
$$ 4019 4195 3850 5975 6346 2026 -1388 -1342 -726 7665 -2022 275 -5453 1621 11907 11978 8069
15538H069p083L526j508r131o247M973j6435j643J0444K126M22J0648O492j2249
$$ 8069 986 4512 3004 -6127 -12374 -7401 -23836 -25479 -15035 -12909 -12487 -1839 4653 -7596
15524g596l47J3443K32j769j2202K94J3892q68J72j1932m055L552m677Q133O732
$$ -7596 -7943 5500 5732 3963 -8239 -7945 5947 5079 5251 -6681 -10736 -7184 -11861 -3728 3004
15509C004k019j3722m369R761Q437o501j1700L568P003m985p520n255j2815R051
$$ 3004 985 -12737 -17106 -7345 1092 -5409 -17109 -13541 -6538 -11523 -19043 -24298 -37113 -28062
15495b8062J6578R572k369m1K712j8378k326l145R790J3922M303M970j303n693
$$ -28062 -11484 -1912 -4281 -4322 -1610 -19988 -22314 -25459 -15669 -1747 2556 7526 6223 530
15481E30p188n090r782j0109M695J2589j24K22J7911P825j1838m187n531L211
$$ 530 -6658 -11748 -21530 -31639 -26944 -14355 -14479 -14257 3654 11479 -359 -4546 -10077 -6866
15467f866N905n761P451L472o743j7294l43M651l296K636O920P109K073O28O029
$$ -6866 -961 -6722 729 4201 -2542 -19836 -20179 -15528 -18824 -16188 -9268 -2159 -86 542 6571
15452F571J791J199n318l815m808n024Q396o117j8622M208J3120N198J4453O228
$$ 6571 8362 9561 4243 428 -4380 -9404 -1008 -7125 -25747 -21539 -8419 -3221 11232 17460
15438A7460r148o079K1126J6269j4800j7602l214J2437J686r212J1468L200j8765
$$ 17460 8312 2233 23359 39628 24828 7226 4012 16449 18135 8923 20391 23591 4826
15425D826Q721k274j7063m5N480K884o499q534O86l150K960J3632k975q503M499
$$ 4826 13547 11273 -5790 -5835 -355 2529 -3970 -12504 -11818 -14968 -12008 1624 -1351 -9854 -5355
15410e355N669q701p701L823m40J403K561l993o956K905k882M223r534R849J1788
$$ -5355 314 -8387 -16088 -12265 -12705 -11302 -8741 -12734 -19690 -16785 -19667 -15444 -24978 -15129 -3341
15395c341P277r612J2971j0679o101j1219K013J0245j626j591q280n330O494q302
$$ -3341 3936 -5676 7295 -3384 -9485 -20704 -18691 -8446 -10072 -11663 -19943 -25273 -18779 -27081
15381b7081L018K808N342J2230O051l341J188k756o53j4845o788J5266K439J93
$$ -27081 -24063 -21255 -15913 -3683 2368 -973 215 -2541 -3194 -18039 -24827 -9561 -7122 -6929
15367f929P730N11M20k930O63K698o091m801K863q607j3573r253M385J5847K499
$$ -6929 801 1312 1732 -1198 -535 2163 -3928 -8729 -5866 -14473 -28046 -37299 -32914 -17067 -14568
15352a4568o631j4168K768K1831J7209P559J3318O821j3082j6956l245j1101K993
$$ -14568 -21199 -35367 -32599 -10768 6441 14000 27318 34139 21057 4101 856 -10245 -7252
15339g252J7521k589k684n192p943Q203R356L048j0957p470Q606Q831j4051j3841
$$ -7252 10269 7680 4996 -196 -8139 64 9420 12468 1511 -5959 2647 11478 -2573 -16414
15325a6414K042J9491K0684l954j2073q207j5842l954R018J2789L311j4981P990
$$ -16414 -14372 5119 25803 21849 9776 1569 -14273 -18227 -9209 3580 6891 -8090 -100
15312a00O579k818m26p299j4850p487M489O977J9185J0750m779j220Q976o0j1945
$$ -100 6479 3661 3235 -4064 -18914 -26401 -21912 -14935 4250 15000 10221 9001 17977 17917 5972
15297E972p233p613j2160J931K0954Q180R72k378j2784l179l250J8324j123p037
$$ 5972 -1261 -8874 -21034 -19103 1851 10031 11003 8625 -4159 -7338 -10588 7736 6613 -424
15283d24j5707n359R991J4571L070m312n246m104l215N951N33n719r93J0614l320
$$ -424 -16131 -21490 -11499 3072 6142 1830 -3416 -7520 -10735 -4784 -4251 -9970 -10963 -349 -3669
15268c669N668J1986j3330m724J1130j582j2084p119J0992k303l127q605N482
$$ -3669 1999 13985 655 -4069 7061 5479 -6605 -13724 -2732 -5035 -8162 -16767 -11285
15255a1285Q821N612L102L741L971p162J805O173n876p3K2189J6k7976l812M070
$$ -11285 -2464 3148 6250 9991 13962 6800 8605 14778 8902 8829 31018 31034 3058 -754 3316
15240C316o192R911j5822j5613j4482o63J9963J5704J7154P191j2474r890n410
$$ 3316 -2876 7035 -8787 -24400 -38882 -39545 -19582 -3878 13276 20467 7993 -1897 -7307
15227g307J9180J24q995M462J6427m695o613N14o133N817k071J501J094k0435
$$ -7307 11873 11997 3002 7464 23891 19196 12583 13097 6964 12781 10710 12211 13305 -7130
15213g130o949j241J452N345P29N769J3152K203j347j7070r561N967k84K874M634
$$ -7130 -14079 -15320 -13868 -8523 -7794 -2025 11127 13330 11983 -5087 -14648 -8681 -8965 -6091 -1457
15198a457L957L725j2529m757M127k722J4417J2138p575j0171p24l582q027N71
$$ -1457 2500 6225 -6304 -11061 -6934 -9656 4761 16899 9324 -847 -1571 -5153 -13180 -12609
15184a2609K446J606J2038J3628j0958N356p772j0718k5614J796J2697K7013L58
$$ -12609 -10163 -8557 3481 17109 6151 11507 3735 -6983 -32597 -30801 -18104 8909 9267
15171I267j1538M791K0945n273l043n17l25k648j2304j5778O406J4668r68j1972
$$ 9267 -2271 2520 23465 18192 15149 14632 14307 11659 -645 -16423 -10017 4651 3683 -8289
15157h289L476l041m399J064Q179o33j3427j0865L230J1784R3m032J0068J573
$$ -8289 -4813 -7854 -12253 -11189 -3010 -3643 -17070 -27935 -24705 -12921 -12828 -16860 -6792 -5219
15143e219p932q188O686j088m259P295K2844n933j1284O453J012m79J5191R139
$$ -5219 -13151 -21339 -14653 -15741 -20000 -12705 10139 4206 -7078 -625 387 -92 15099 24238
15129B4238j0530N649j1325r19j0110N671Q59p950m042J0221J2766K198l500J158
$$ 24238 13708 19357 8032 7113 -2997 2674 3533 -4417 -8459 1762 14528 16726 13226 14384
15115A4384j0409o866o186q356p29J2341K2365m283l95J1934J0107n534j5824
$$ 14384 3975 -2891 -9077 -17433 -18162 -5821 16544 12261 11866 23800 33907 28373 12549
15102A2549j0331j2923j2013P78O969J8765J8928j1068j3821N069J0545Q582o569
$$ 12549 2218 -10705 -22718 -21940 -14971 3794 22722 11654 -2167 2902 13447 22029 15460
15089A5460l649P465M974K377n758j4815q366L732J0471J602k338q754r281J970
$$ 15460 11811 19276 24250 26627 20869 6054 -2312 1420 11891 13493 11155 2401 -6880 -4910
15075d910M975k140j5728m8L323N528N60j1804m51O175l473j082j1456L14J4985
$$ -4910 65 -2075 -17803 -17851 -14528 -9000 -8440 -20244 -20695 -14520 -17993 -19075 -30531 -30217 -15232
15060a5232J3242J0799J0353k733j8617l092k060l066M692M773m597J0323l236
$$ -15232 -1990 8809 19162 16429 -2188 -5280 -7340 -10406 -5714 -941 -5538 4785 1549
15047A549j639J4733j664n741l308j2576k2219m777J9556J2042m858k639R591
$$ 1549 -90 14643 12979 7238 3930 -8646 -30865 -35642 -16086 -4044 -8902 -11541 -1950
15034a950O061p410j081K954k793L104q437P221R890l403Q636p284n737m122P542
$$ -1950 4111 -3299 -4380 -1426 -4219 -1115 -9552 -2331 7559 4156 12792 5508 -229 -4351 3191
15019C191J0446R825j0677o857l143l088R085P657J1694o8N325j712L726J6863
$$ 3191 13637 23462 12785 5928 2785 -303 8782 16439 28133 28065 33390 31678 35404 52267
15005E2267K4946K7788O9145J31797J98876K46526J04881r8212j69904j75385
$$ 52267 77213 105001 174146 305943 504819 751345 856226 758014 588110 412725
14995D12725j43185q3243o3313l5237k2287k0994j7029o042J6228L187j1110k716
$$ 412725 269540 186297 122984 87747 65460 44466 27437 21395 37623 40810 29700 26984
14983B6984j1759q517q855j1604M523M384O64L064M650J9450P390k257p221N347
$$ 26984 15225 6708 -2147 -13751 -9228 -4844 -4180 -1116 3534 22984 30374 28117 20896 26243
14969B6243P79p09q645m094j6959J692O976R79J2270J2442o954l5537J701J1567
$$ 26243 27022 26313 17668 13574 -3385 -1693 5283 6262 18532 30974 24020 -11517 -9816 1751
14955A751R846q062j465K87K831R516j2430j0271J2094k549m581j6382m337O369
$$ 1751 11597 3535 2070 2357 5188 14704 2274 -7997 4097 1548 -3033 -19415 -23752 -17383
14941a7383k900L890J6960J7507q060j5679q434J4147n628j2838k5O292L506J0285
$$ -17383 -20283 -16393 567 18074 10014 -5665 -14099 48 -5580 -18418 -18443 -12151 -8645 1640
14927A640J2260l296j657k918j6999p678Q451K915M034j1560j663J9690P171J3907
$$ 1640 13900 10604 8947 6029 -10970 -18648 -10197 -7282 -3248 -14808 -16471 3219 10390 24297
14913B4297N472n929k6840o196N383J250O789j208m18j8987p162J7788J3837J1135
$$ 24297 29769 23840 -3000 -9196 -3813 -2563 4226 3018 2600 -16387 -23549 -5761 8076 19211
14899A9211j5877j1738K078O652J5211O907q71q723q897O708j0130M443J3282
$$ 19211 3334 -8404 -6326 326 15537 22444 21573 12850 3953 10661 531 4974 18256
14886A8256m531j4114l724M149k865j1440O725J3466l553q079J1923J7162p154
$$ 18256 13725 -389 -4113 36 -2829 -14269 -7544 5922 2369 -5710 6213 23375 16221
14873A6221K498p922j2180k205O059K0649J1177L696L587n396j2968l075p186
$$ 16221 18719 10797 -1383 -3588 2471 23120 34297 37993 41580 36184 23216 20141 12955
14860A2955m503m614O177R326j6154j8585Q918J1384R918l664j8469j1434J1681
$$ 12955 8452 3838 10015 19341 3187 -15398 -6480 4904 14822 11158 -7311 -18745 -7064
14847g064K6432l94r124m224j1446O03O962Q180j1730O051P960q821p375r026
$$ -7064 19368 18974 9850 5626 -5820 -5217 1745 9925 -1805 4246 12206 3385 -3990 -13016
14833a3016J942J1020q157l048J9188q92j0938j3323p247R961K7384r406n462
$$ -13016 -11074 -54 -8211 -11259 7929 7037 -3901 -17224 -24471 -14510 12874 3468 -1994
14820a994j140L340J560M091L582j3642m339R832J2299N145j5399k161j0278r333
$$ -1994 -3134 206 1766 5857 9439 -4203 -8542 1290 13589 18734 3335 1174 -9104 -18437
14806a8437k303R925J6305j703L73K938L626P83j238o913l385J1020K468p664
$$ -18437 -20740 -10815 5490 3787 4160 7098 10724 11507 10269 3356 -29 10991 13459 5795
14792E795K243j784k974J671M743J627o843n497L20k716J306k414P510J187r999
$$ 5795 8038 6254 3280 4951 9694 11321 4478 -1019 -699 -3415 -2109 -4523 2987 4174 -5825
14777e825Q547n208j0190K300o043k990K767K6059k330k979P434Q46p362p23q927
$$ -5825 2722 -2486 -12676 -10376 -16419 -19409 -16642 9417 7087 4108 11542 12388 5026 4303 -4624
14762d624m686j1893M09M803p455J7669N635Q415R792r754j6978J0123r105j8051
$$ -4624 -9310 -21203 -20794 -15991 -23446 -5777 -142 8273 18065 8311 -8667 1456 -7649 -25700
14748b5700P262j279M862J1792j679M56r12q0J0534M840o39r264N501j414J95
$$ -25700 -18438 -19717 -14855 -3063 -4742 -4286 -5198 -5278 5256 10096 9457 193 5694 4280 4475
14733D475j8143P131l520m371r211J7080J8607J910r534o412J8453R421o609k249
$$ 4475 -13668 -6537 -10057 -14428 -23639 -6559 12048 13958 4424 -1988 16465 25886 19277 17028
14719A7028j4656j4267j607n049o425R255Q430J0166P751J2239j948j0140o063
$$ 17028 2372 -11895 -13502 -18551 -24976 -15721 -7291 2875 10626 22865 20917 10777 4714
14706D714J152J4439R80j0846m500K023j6980o217K6510L999j7634n516K7099
$$ 4714 5866 20305 21285 10439 5939 7962 -9018 -15235 11275 15274 -2360 -7876 19223
14693A9223L4961J637k4881j6304n983j207J816P802m705p419j2654m622R120
$$ 19223 54184 55821 30940 14636 8653 7446 9262 17064 12359 4940 -7714 -12336 -3216
14680c216Q610O352j77p238j5246l087j245j2937j835J2726J1630J7406q230k0412
$$ -3216 5394 11746 11569 4331 -10915 -14002 -15247 -28184 -30019 -17293 -5663 11743 3513 -16899
14666a6899m037J494l773N682N561Q194P608J1629P294p854J2306m671j8671j1468
$$ -16899 -20936 -19442 -23215 -17533 -11972 -3778 3830 15459 22753 14899 27205 22534 3863 -7605
14652g605j1108K7948J8241k0019P26q280k561J5828P360Q961j0722m846l202
$$ -7605 -18713 9235 27476 7457 8183 -97 -2658 13170 20530 29491 18769 13923 10721
14639A0721p845J2909Q831Q748M84j3753q734j437K061J0146l31q485o321K529
$$ 10721 2876 15785 24616 33364 33848 20095 11361 9924 11985 22131 21800 13315 6994 9523
14625I523J0107j0287o848l270o544J985J3258J554J4910Q079n16n019j6920p229
$$ 9523 19630 9343 2495 -775 -7319 -5334 7924 9478 24388 32467 31951 26932 10012 2783
14611B783J449m685j0409m720J2445J0291M55m241m545l630K475M844j720O887
$$ 2783 4232 -453 -10862 -15582 -3137 7154 7609 3368 -1177 -4807 -2332 2512 792 7679
14597G679m735O131j918o77K362Q930j5130o522o181N9O802k761n222o664L504
$$ 7679 2944 9075 7157 6480 8842 17772 2642 -3880 -10061 -10002 -3200 -5961 -11183 -17847 -14343
14582a4343o260o59K934K522m549l026l538k068J161O853Q91o921J72K4740J5853
$$ -14343 -20603 -21262 -18328 -15806 -20355 -23381 -26919 -28987 -27826 -20973 -20082 -27003 -26831 -2091 13762
14567A3762q594p562j6581Q256N815J1196R056Oj5439J4063K529p5k280M466o977
$$ 13762 5168 -2394 -18975 -10719 -4904 6292 15348 15354 -85 13978 16507 16432 14152 18618 11641
14552A1641k632p518j3925k045j652P535k743k21p817o717K0831J939j4389L580
$$ 11641 9009 1491 -12434 -14479 -16131 -8596 -11339 -11560 -19377 -26094 -5263 -3324 -17713 -14133
14538a4133O967o007m412k658P186m35l3p975R075l66R242J0153Q401j3532j5048
$$ -14133 -7166 -13173 -17585 -20243 -13057 -13492 -13525 -21500 -12425 -12791 -3549 6604 15005 1473 -13575
14523a3575L42J621O62J4179R592k2r635j3921j8006N869J4208N163L738j597
$$ -13575 -13233 -11612 -10950 3229 12821 12799 3164 -10757 -28763 -22894 -8686 -3523 215 -1382
14509a382M688K334n18O112P670J5087R75j9386o662p619P324K1720J580l7123
$$ -1382 3306 5640 5122 11234 18904 33991 34966 15580 8918 1299 8623 30343 31923 -5200
14495e200p466N409q084K867J1398J0115J0374j0626M172J659k1193m999J2560
$$ -5200 -12666 -7257 -15341 -12474 -1076 9039 19413 8787 12959 14618 -6575 -11574 986
14482I86N775m351j403R548k91J932q306p400m597p428M301O421j873n848Q973
$$ 986 6761 2410 1007 10555 10264 12196 3890 -3510 -8107 -15535 -11234 -4813 -6686 -12534 -3561
14467c561O981L96k602M574L46m84J2964r313j9249K741J8403o49m111n154L773
$$ -3561 3420 3816 1214 5788 6134 5650 18614 9301 -9948 -7207 11196 10547 6436 1282 5055
14452E055J243j8087j379P295j85K0260j915p371j3171j3434P980N666m546J0494
$$ 5055 6298 -11789 -13168 -5873 -6058 14202 12287 4916 -8255 -21689 -13709 -8043 -12589 -2095
14438b095N939Q574l236k258j3429O895J9587j0026o821J1574l259n111K071l465
$$ -2095 3844 12418 9182 6924 -6505 390 19977 9951 3130 14704 11445 6334 8405 4940
14424D940J6048R516j7560J768P257J0236N610p174k0578j3020l665M225J3211
$$ 4940 20988 30504 12944 14712 21969 32205 37815 30641 10063 -2957 -6622 -2397 10814
14411A0814K701j0147k505k900l400p420j0030O553L2457J6489O627M242j9997
$$ 10814 13515 3368 863 -2037 -5437 -12857 -22887 -16334 16123 32612 39239 43481 23484
14398B3484j5875k2480O60M21L443J2565M24j199P577n689k145n263p58Q126Q445
$$ 23484 7609 -14871 -14211 -13790 -10347 2218 2642 1443 9020 3331 1186 -4077 -4835 3291 11736
14383A1736O789n272l201k806o692o418M385Q89O783N021R445r846q509P494Q08
$$ 11736 18525 13253 10052 7246 554 -5864 -1479 -590 6193 11214 20659 10813 2304 9798 10606
14368A0606L057l101J2975J3996Q847j7201j5712R660l782j0346j5224P452k402
$$ 10606 13663 10562 23537 37533 46380 29179 13467 23127 19345 8999 -6225 1227 -1175
14355a175j218J0401J2176N420K540j5896J444n3L555j795k2253P583J2227l385
$$ -1175 -2393 8008 20184 25604 28144 12248 13692 13639 17194 15399 -6854 729 12956 9571
14341I571R431j147j3323P568m627r443j1025K741Q692R472J067l927q009O141
$$ 9571 19002 17855 4532 12100 7473 -1970 -12995 -10254 -1562 7910 8977 5050 -2959 3182
14327C182Q424j314L362J4745N192k968j1979q824k173r12j1117N956Q87N814
$$ 3182 11606 10292 13654 28399 33591 30623 18644 9820 7647 6735 -4382 1574 2461 8275
14313H275R319K2584N542q307l128j1657n690j0370j0978J3688j0151o697P265
$$ 8275 17594 40178 45720 37413 34285 22628 16938 6568 -4410 9278 -873 -7570 -305
14300c05m370q134L316r291J736K244o743q408J2768K1856J0918r85K413k045
$$ -305 -4675 -12809 -9493 -18784 -17048 -14804 -21547 -29955 -17187 4669 15587 14602 17015 14970
14286A4970K469r175j9177l631J8251L603l692j459J6634L864j1058j8317J5117
$$ 14970 17439 8264 -10913 -14544 3707 7310 3618 2159 18793 22657 11599 -6718 8399
14273H399n78K053k272k186P033q062m555L204k997k1081k138K6237J5199j121
$$ 8399 7821 9874 7602 5416 12449 4387 -168 3036 39 -21042 -23180 3057 18256 17135
14259A7135p449k198p459J1709j0208k201Q68M088o0r069O975J2040j3272R682
$$ 17135 9686 7488 29 11738 1530 -671 197 4285 4225 -4844 2131 14171 899 10581
14245A0581l689l766M023P943K4089j1756j7249J3770Q3j1582K779j0557j0881
$$ 10581 6892 3126 7149 15092 39181 27425 10176 23946 24029 12447 15226 4669 -6212
14232f212N229j17p123l196j451Q093K707k672k482o808q39N614J234J4176O788
$$ -6212 -983 -1100 -8223 -11419 -12870 -4777 -2070 -4742 -7224 -14032 -14871 -9257 -8023 6153 12941
14217A2941j977Q289j957O46K2190J1j049k548L113K075j0215Q020Q322k6058
$$ 12941 10964 19253 17296 17942 40132 40143 39094 36546 39659 41734 31519 39539 47861 21803
14203B1803n321o5l804k141n942o060r555J1076N995m424k561j335n430j2003
$$ 21803 16482 16417 12613 10472 4530 -1530 -11085 -9 5986 1562 -999 -2334 -7764 -19767
14189a9767J016J8411R905M673l068n921M019N777k2174j0518J0669Q445L972
$$ -19767 -18751 -340 9565 14238 11170 5249 9268 15045 -7129 -17647 -6978 1467 5439
14176E439r570M680m148L940N513n632r211j995m374Q114R410j163j0336J6581
$$ 5439 -4131 549 -3599 341 5854 222 -8989 -10984 -15358 -7244 2166 1003 -9333 7248
14162G248J0893p797l4936m422k314N253P52K028J8543L096j0140q524J8230J5913
$$ 7248 18141 10344 -24592 -29014 -31328 -26075 -25323 -23295 -4752 -1656 -11796 -20320 -2090 13823
14148A3823R478J777J51l154k653l35j019L716J1452J870p084j2359n515P227
$$ 13823 23301 25078 25229 22075 19422 19087 18068 21784 33236 35106 28022 15663 10148 17375
14134A7375P821R673j1655Q95r84j8249k686L968Q878J663m498l965M204K915
$$ 17375 25196 34869 23214 24109 23125 4876 2190 6158 15036 16699 12201 8236 12440 15355
14120A5355Q384k910o047M463J30l702l702J753j163n905q935J4603K045k2083
$$ 15355 23739 20829 14782 19245 19375 15673 11971 13724 12561 6656 -2279 12324 14369 -7714
14106g714J4770J5700L146M255j3227j1959l516r222J13j737J4414J2576L915
$$ -7714 7056 22756 25902 30157 16930 4971 1455 -7767 -7654 -9391 5023 17599 21514
14093B1514M449P326j0837k740L48j6465l629q851m046r169k448J5975K7822J0708
$$ 21514 25963 33289 22452 19712 20060 3595 -34 -8885 -12931 -22100 -24548 -8573 19249 29957
14079B9957j417L095m819j597j025n571r540j1119N136J6863P98o916L688l255
$$ 29957 28540 31635 26816 25219 24194 18623 9083 -2036 3100 19963 20761 13845 17533 14278
14065A4278n326J6697m582j2510l807k774J159N234J2506K1386j2178j6116k685
$$ 14278 8952 25649 21067 8557 4750 1976 3135 8369 20875 42261 30083 13967 11282
14052A1282m315j5140j2812J8018J2390J4327K359q488k655r285k831N202R49
$$ 11282 6967 -8173 -20985 -2967 9423 23750 26109 17621 14966 5681 2850 8052 9001
14039I001p402m633R208J6965L692r440j4478M254J5159J1027J708m223p327j7944
$$ 9001 1599 -3034 6174 23139 26831 17391 2913 7167 22326 33353 35061 30838 23511 5567
14025E567p531l87q48o121m69M885o403M985J6087J5467n796o013k897N898j2199
$$ 5567 -1964 -2351 -3199 -9320 -9789 -4904 -11307 -6322 9765 25232 19436 13423 10526 16424 4225
14010D225O0K0083J3262j501j3165j9052P188K736o232n08K491J8693j5665j1101
$$ 4225 4285 24368 37630 36129 22964 3912 11100 13836 7604 7096 9587 28280 12615 1514
13996A514J623k995k987l947L460L740J232J4391J9747r431j4067J031M8K230
$$ 1514 3137 142 -2845 -6792 -3332 408 1640 16031 35778 26347 12280 13311 13359 15589
13982A5589j843K359O301m994O419m017l738L529J3976j7858j2301O89P357J628
$$ 15589 13746 16105 22406 17412 23831 19814 16076 19605 33581 15723 3422 4111 11468 13096
13968A3096j2093k0615J0937L358O639J0422P602n990j4002j2470N479J8086j1352
$$ 13096 1003 -19612 -8675 -5317 1322 11744 19346 13356 -646 -13116 -7637 10449 -903
13955i03p454J1137P881n202R01J2665O364j1467n466J541J7808K646j7412j1685
$$ -903 -8357 2780 10661 5459 6360 19025 25389 13922 8456 9997 27805 30451 13039 1354
13941A354P838J5466o078j0129R856j0643p677J492q641N515R788O925M878J426
$$ 1354 9192 24658 18580 8451 18307 7664 -13 1479 -7162 -1647 8141 15066 19944 21370
13927B1370R163j0374j765q438K645l047m255r380J499p003K724L601Q312N470
$$ 21370 30533 20159 18394 9956 12601 9554 5299 -4081 -2582 -9585 -6861 -3260 5052 10522
13913A0522k645j495P23J4051j0315j1578k789J5003J0617M158m961j5400J282
$$ 10522 7877 6382 7105 21156 10841 -737 -3526 11477 22094 26252 21291 5891 7173
13900G173K869K042n062O685N382m422j6624o64j884P144J3544J293r72l95j289
$$ 7173 10042 12084 7022 13707 19089 14667 -1957 -2621 -4505 2639 16183 17476 16504 16109 14820
13885A4820p14Q629p56j3024p259m91j0400J7771M212M196j1658o636J249j1984
$$ 14820 14106 22735 21979 8955 1696 1205 -9195 8576 12788 16984 5326 -1310 -61 -12045
13871a2045n860J1370J4470j1244J7326J0859o118p741m162O859l408o25j585
$$ -12045 -17905 -6535 7935 -3309 14017 24876 18758 11017 6855 13714 10306 9681 8096
13858H096L011n32M614j3540q121J8210R707m575l930m844R9j267M789R923Q598
$$ 8096 11107 10575 15189 1649 -6472 11738 21445 16870 12940 8096 8195 6928 11717 21640 30238
13843C0238n018j0447R939J0964j21k0666k072M801K146M032o785J4156J1597
$$ 30238 25220 14773 24712 35676 35555 14889 12817 17618 19764 23796 17011 31167 42764
13830D2764k898j1313q926k987k474q276j388N833J0389l641p950K073O173p566
$$ 42764 39866 28553 19627 16640 14166 5890 4502 10335 20724 17083 9133 11206 17379 9813
13816I813p23O328j5287K696K306n721N84n916R64J069m372k541J512Q040J7301
$$ 9813 9090 15418 131 2827 5133 -588 -4 -5920 -4956 -3887 -8259 -10800 -9288 -1248 16053
13801A6053O715N139o574q738N713j12j16P683M385J1127r010j4933j3305r920
$$ 16053 22768 27907 21333 12595 18308 18196 18080 25763 30148 41275 32265 17332 4027 -5893
13787e893LJ3091P055J1849j1444j2926M216J4662k035q179j4399J7412J4823
$$ -5893 -5890 7201 14256 26105 14661 1735 5951 20613 18578 10399 -4000 13412 28235
13774B8235j2815O879O981j0321j85M966j3369j7699q969J2655J2667O68P287
$$ 28235 15420 22299 29280 18959 18774 23740 10371 -7328 -16297 -3642 9025 9693 16980
13761A6980k242j596q61m076j0470L290k149N342J814Q41R120Jr526j2997N530
$$ 16980 14738 13142 12281 8205 -2265 1025 -1124 4218 6032 6873 15993 15994 6468 -6529 -999
13746i99K089l442L791P362n257N246Q806J192n168K005J1585j0285j3353j1354
$$ -999 1090 -2352 1439 8801 3544 8790 17596 18788 13620 15625 27210 16925 3572 -7782
13732g782j914O297P053j2616l583P329O701l776O668J71J8325J9544K376m461
$$ -7782 -9696 -3399 3654 -8962 -12545 -5216 1485 -2291 4377 4548 22873 42417 44793 40332
13718D0332r170J842M894J2828r64o528r031j0832j8201N645J3081K854K667J4692
$$ 40332 31162 33004 37898 50726 49762 43234 34203 23371 5170 10815 23896 26750 29417 44109
13704D4109j3776j4430J0271M618o304j1471l228m333O896R801L691n300L637
$$ 44109 30333 15903 26174 30792 24488 13017 9789 5456 12352 22153 25844 20544 24181
13691B4181L650R325N991o928j5706o282Q27k058J3639K975p029O538P655Q140
$$ 24181 27831 37156 43147 36219 20513 14231 15058 13000 26639 29614 22585 29123 36778 44918
13677D4918n04j5133k5646r355o697k251K2029J2781o26o076m296O391M004J492
$$ 44918 44414 29281 3635 -5720 -12417 -14668 7361 20142 19516 13440 9144 15535 19539 21031
13663B1031k808K010N815l279J745Q304k096n363l743o572k030K1751J3725l908
$$ 21031 18223 20233 26048 22769 24514 32818 30722 25359 21616 15044 13014 34765 48490 44582
13649D4582o397r257O150J28Q577J6072q850n504n323q862k5672j0069J0343J0261
$$ 44582 38185 28928 35078 35206 43783 59855 51005 45501 40178 31316 5644 -4425 5918 16179
13635A6179K797J0347M469N781R039J5693J3314P263J3250K4239K6191L7071M2073
$$ 16179 18976 29323 33792 39573 48612 64305 77619 84882 98132 122371 148562 185633 227706
13622B27706P5286J09342J84117K38133K33609J71153J9991j08599j95658k14989
$$ 227706 302992 412334 596451 834584 1068193 1239346 1259337 1150738 955080 740091
13612G40091j90931j31939r7661o6359l3406k6591l6832k6753k2104j2761K224
$$ 740091 549160 417221 319560 253201 219795 193204 156372 129619 107515 94754 96978
13601I6978R323l597j9558j6122j0066j8096q453p325n008M959q983j4853R821
$$ 96978 106301 102704 83146 67024 56958 38862 30409 23084 18076 23035 14052 -801 9020
13588I020J7755N080L168j5594J111N668N426m360L733j408k755O600R241k587
$$ 9020 26775 31855 35023 19429 20540 26208 31634 27274 31007 29599 26844 33444 42685 40098
13574D0098Q719j0133k1121q984J0337O383j950n666L667K488j1997l479J1238
$$ 40098 48817 38684 17563 8579 18916 25299 23349 17683 21350 23838 11841 8362 19600
13561A9600M348j909p528j0096N600R684n561o387n089O625N761J9445P726j1203
$$ 19600 23948 22039 14511 4415 10015 19699 14138 7751 2662 9287 15048 34493 42219 31016
13547C1016l275m590j13O320p308j533R613L026m932j4787p976P907m78M826J5176
$$ 31016 27741 23151 23038 29358 22050 20517 30130 33156 28224 13437 5461 13368 12890 17716 32892
13532C2892k621J883q78L547k935J5724j2397j2382o866o206K310J1702K611P598
$$ 32892 30271 32154 31276 34823 31888 47612 35215 22833 15967 9761 12071 23773 26384 33982
13518C3982J986j0231m541L090p312j36K4071o22k938N347N974o020n216N754
$$ 33982 35968 25737 21196 24286 16974 16838 40909 40287 37349 42696 48670 42650 37434 43188
13504D3188J1692J25p357K108R15q155j1163P96p483O724P38p813l038J801k20
$$ 43188 54880 55005 47648 49756 50671 42516 31353 32149 24666 31390 32128 24315 21277 23078 22858
13489B2858J7880M266L971o821j402m772p426O647O578J236L75N896p256k647
$$ 22858 40738 45004 48975 42154 40752 35980 28554 35201 41779 43015 43390 49286 42030 39383
13475C9383l054N531J1051o630j0717J5715K0531j6512j4048p15p003L377j827
$$ 39383 36329 41860 52911 46281 35564 51279 71810 55298 41250 40535 33532 36909 35082
13462C5082P66J7823J0222q243j6851m501j660J127R576J855p547m347j030L135
$$ 35082 35848 53671 63893 55650 38799 34298 32638 33765 43341 45196 37649 33302 32272 35407
13448C5407j5816n33k08N898P906L572q035M405N947k9l576Q975J4393P165l78
$$ 35407 19591 19058 18850 24748 32654 36226 28191 32596 38543 38514 34938 43913 58306 65471 65093
13433F5093k525j3736j5015O106K1255j4112k045J440L471J500O141J175P660
$$ 65093 62568 48832 33817 39923 61178 47066 45021 46461 49932 51432 57573 58748 66408
13420F6408J4279J1267N83j9066K400K4475J7668J1062K866J0487R290L502J3439
$$ 66408 80687 91954 92537 73471 75871 100346 118014 129076 131942 142429 151719 155221 168660
13407A68660p814k0529j4329j9676k3321j8695p359j4637m723J0370R705k5424
$$ 168660 160846 140317 125988 106312 82991 64296 56937 42300 37577 47947 57652 32228
13395C2228q696R261J2130K3214j1108j3039j331q157P525n483O017Q931R550
$$ 32228 23532 32793 44923 68137 57029 43990 42659 34502 42027 36544 42561 51492 61042
13382F1042r123Q202J342j6081q039J034J220m821n993L020P970J8568M457k638
$$ 61042 51919 60121 61463 45382 37343 38377 39597 34776 28783 31803 39773 58341 62798 60160
13368F0160p736J317O802K241m964L624K2731J2118p356r186j2006J4153j778
$$ 60160 52424 53741 60543 62784 57820 61444 84175 96293 88937 79751 67745 81898 80120
13355H0120j5240j9373N889J2840p032j2068m852r209j0657O759J3563J5249K943
$$ 80120 64880 45507 51396 64236 57204 45136 40284 31075 20418 27177 40740 55989 58932
13342E8932K4698K8563J1449M156j0002O398j0512r882n304n478o796j4623l637
$$ 58932 83630 112193 123642 127798 117796 124194 113682 103800 98496 93018 86222 71599 67962
13329F7962j0769N106O031J0732K5771K247j219J5194J0062n00Q913J2810J5647
$$ 67962 57193 62299 68330 79062 104833 107080 105861 121055 131117 130617 139530 152340 167987
13316A67987J4710L6129M1090P2721J06548J53040K47906L16204K99609R2579
$$ 167987 182697 218826 259916 332637 439185 592225 840131 1156335 1455944 1548523
13306A548523j39185k56085k79123k09354j39667j05080p7619m8443l8135k5443
$$ 1548523 1409338 1153253 874130 664776 525109 420029 342410 293967 255832 230389
13296B30389j8073l0171j7796P260J3574L584N722m27J4457J0229k0007j8617
$$ 230389 212316 182145 164349 171609 185183 188767 194489 194062 208519 218748 198741 180124
13284A80124j6984k5697j6312K793N001R38q140j9971j5441o462Q102j148J2501
$$ 180124 163140 137443 121131 123924 128925 129863 121723 101752 86311 79849 87951 86803 99304
13271I9304J288n28J003K303J1227J1243L230R620J5697L566k1528j824J4635
$$ 99304 100592 100064 101067 103370 114597 125840 129070 138690 154387 157953 136425 134601 149236
13258A49236J2405P04j1329l936m237J1975O493J530Q781K1072K2633J5135K831
$$ 149236 161641 162345 151016 147080 142843 154818 161311 162841 171622 192694 215327 230462 233293
13245B33293O598K8035L565j5412M175O784K507j2540J436r57Q335P909J1026
$$ 233293 239891 267926 271491 256079 260254 267038 269545 257005 258441 257484 265819 273728 284754
13232B84754L129R312L671J136K3870J7549j5319k83l229J1533J8035J5142j800
$$ 284754 287883 297195 300866 302002 325872 343421 328102 327819 324590 336123 354158 369300 367500
13219C67500O758r399j674L518N901K7300K0933R659K3667L8950M0674K4562K2393
$$ 367500 374258 364859 363185 366703 372604 399904 420837 430496 454163 493113 533787 558349 580742
13206E80742K6617J9160J6925J5377L0361L9306J1864L9904N5029N0438L4233
$$ 580742 607359 626519 643444 658821 689182 728488 740352 780256 835285 885723 919956
13195I19956J5717J3609L1859O4432P2129Q2699Q9881J06383R8858J04364J39282
$$ 919956 935673 949282 981141 1045573 1117702 1200401 1290282 1396665 1495523 1599887 1739169
13184A739169J62670J41829J38677J55133J84509J89797K09290K64929L38088
$$ 1739169 1901839 2043668 2182345 2337478 2521987 2711784 2921074 3186003 3524091
13175C524091M29485N70758P36515R22583J075155J172416J242057J376566J672113
$$ 3524091 3953576 4524334 5260849 6183432 7258587 8431003 9673060 11049626 12721739
13166A2721739K255216L164425M608752O962558J0944850J7859550K9057691M3282053
$$ 12721739 14976955 18141380 22750132 29712690 40657540 58517090 87574781 130856834
13158A30856834N2418882M5331019K0889105j0742940l5979788m5294851m1704578
$$ 130856834 183275716 228606735 249495840 238752900 202773112 157478261 115773683
13151A15773683l2018264k1803509j4317995r741672p022613n336419m181546
$$ 115773683 83755419 61951910 47633915 37892243 30869630 25533211 21351665
13144B1351665l312691k661705k222310j928956j655505j379707j107727r11560
$$ 21351665 18038974 15377269 13154959 11226003 9570498 8190791 7083064 6171504
13136F171504p55797o18858n32221m70786m04482l69534l09184k43728k03202
$$ 6171504 5415707 4796849 4264628 3793842 3389360 3019826 2710642 2466914 2263712
13127B263712j60508j29423j31780j22247r9852p8620o9191q2726p9318p0023
$$ 2263712 2103204 1973781 1842001 1719754 1619902 1541282 1472091 1389365 1310047 1240024
13117A240024o9373q9675p3662n2743l4200k0425m2580m4936l5808m7091l7366
$$ 1240024 1170651 1080976 1007314 954571 920371 899946 857366 812430 776622 729531 692165
13106F92165k8597k4543j0926J0476K9726K2646j113k8072q042J2040q133j6127
$$ 692165 663568 639025 628099 638575 668301 690947 689834 661762 653720 665760 657627 641500
13094F41500k6303o3646m9261k0740j3503l7617j4389j3003k4255l0574k4592
$$ 641500 615197 551551 502290 481550 468047 430430 416041 403038 378783 348209 323617
13083C23617j5291n566q534K2376J5137J0318l951j7183m992q020j6298l0776
$$ 323617 308326 302760 294226 316602 331739 342057 338106 320923 315931 307911 291613 260837
13071B60837j6563j7004o610M136L872m180j1916O189J5779K2183O811J878L120
$$ 260837 244274 227270 220660 224796 228668 224488 212572 218761 234540 256723 263534 265412 268532
13058B68532j3317j1047j1222k4697k5736K409K8918O904n226q622j3130O709
$$ 268532 255215 244168 232946 208249 182513 184922 213840 220744 215518 206896 193766 200475
13046B00475M503N070J2191M392O809j5902j3379j3885n724k012K4426J759j95
$$ 200475 204978 210048 222239 226631 233440 217538 204159 190274 184550 182538 206964 208723 208528
13033B08528L963P480R065R542L679j1951j1106o852q589N430j4795j6123n875
$$ 208528 212491 219971 229036 238578 242257 230306 219200 212348 203759 209189 194394 178271 172396
13020A72396N574q221j3082K405o3j2338j3708R208k725q061K51l744R593K592
$$ 172396 177970 169749 156667 159072 159009 146671 132963 142171 139446 131385 131636 127892 137485 140077
13006A40077j2524O598P755n721j0002M569P640J1167O159r454n40r985j0457
$$ 140077 127553 134151 141906 136185 126183 130752 138392 149559 155718 146264 145724 135739 125282
12993A25282K465Q038J2523J4916J5983p114r791j0517j614L490M219J2666N190
$$ 125282 127747 135785 148308 163224 179207 172093 162302 151785 150171 153661 157880 170546 175736
12980A75736q568l054J5899J2510J4755L223L677n881j6802j6859j8849Q291L5254
$$ 175736 167168 164114 180013 192523 207278 210501 214178 208297 191495 174636 155787 164078 199332
12967A99332l955k8007l0154l7621p841J2792Q086n893p764O238J0108P292K0100
$$ 199332 195377 167370 137216 99595 91754 104546 112632 106739 98975 105213 115321 122613 142713
12954A42713L724J6893J6690L600j386j0862n381j1613O789J4314j1030j1431
$$ 142713 146437 163330 180020 183620 182234 171372 165991 154378 161167 175481 164451 153020
12942A53020L827P227r352J2800J2869K5392J9744O013O548J2809P828J2742J5569
$$ 153020 156847 164074 154722 167522 180391 205783 225527 231540 238088 250897 258725 271467 287036
12929B87036J4609J2216l169P404J3373J5434J6411L1864N2718R9120J69697K59132
$$ 287036 301645 313861 310692 318096 331469 346903 363314 395178 447896 547016 716713 975845
12917I75845L63012L65548J13872j67505k92427k82751k14212j47572p0999m9741
$$ 975845 1338857 1704405 1818277 1650772 1358345 1075594 861382 713810 642811 593070
12907E93070m5514l6875r309p259K347k049n326J0916J0011K7374O0276L5726
$$ 593070 547556 510681 501372 494113 496460 494411 489085 500001 510012 537386 597662 633388
12895F33388L3386L8048K1855J579K7685O9243J02791J48331K21555L34474N02353
$$ 633388 666774 704822 726677 728256 755941 825184 927975 1076306 1297861 1632335 2134688
12884B134688O14772N22624K69629n3834l52912m18399l62488k73231j59779n9019
$$ 2134688 2749460 3272084 3541713 3487879 3134967 2716568 2354080 2080849 1921070 1862051
12874A862051Q984P2459Q1985R7542J08362R8477J13148J34261J64136K17399
$$ 1862051 1871035 1943494 2025479 2123021 2231383 2329860 2443008 2577269 2741405 2958804
12864B958804K61948L58355M62896N76087P44500R43194J202732J445296J570094
$$ 2958804 3220752 3579107 4042003 4618090 5362590 6305784 7508516 8953812 10523906
12855A0523906J626143J949459K646738L835311N763529Q989372J4764527K5434005
$$ 10523906 12150049 14099508 16746246 20581557 26345086 35334458 50098985 75532990
12847G5532990M3395051O4627696O7440985L0416693k1325991m8930654n5469838
$$ 75532990 118928041 183555737 250996722 281413415 260087424 211156770 155686932
12840A55686932m6987602l1797315j9753087j2610764q640251o362791m920408
$$ 155686932 108699330 76902015 57148928 44538164 35897913 29535122 24614714
12833B4614714l857000l145004k731100k400978k015377j653912j290999r90864
$$ 24614714 20757714 17612710 14881610 12480632 10465255 8811343 7520344 6529480
12825F529480p89575o65076n63135m97664m41324l80317l38935k78425k44064
$$ 6529480 5739905 5074829 4511694 4014030 3572706 3192389 2853454 2575029 2330965
12816B330965j93038j47644j44810j34863j03962q7608p4264o2205n6826q0512
$$ 2330965 2137927 1990283 1845473 1710610 1606648 1519040 1444776 1382571 1325745 1245233
12806A245233r7951q5176o8975m8167k9559l0232l4265l9722m3966l4072l7432
$$ 1245233 1147282 1062106 993131 944964 915405 885173 850908 811186 767220 733148 695716
12795F95716m1561l2575l8705j7756q977M567O170R885O338Q590N905m596j8212
$$ 695716 654155 621580 582875 565119 556142 560709 566879 576764 583102 591692 597597 593001 574789
12782E74789j792R710K3323N0372Q5376J63712K95029N22240P56296O89407J63471
$$ 574789 572997 582707 606030 656402 741778 905490 1200519 1722759 2479055 3168462 3331933
12771C331933l86668n91513o08153m67494k89378j68552j27840r5295n6424n1260
$$ 3331933 2945265 2353752 1745599 1278105 988727 820175 692335 597040 540616 489356
12761D89356m0362k1607k7344m8050k9989j5179l342j4874j7002r8l185P119N349
$$ 489356 448994 427387 400043 351993 322004 306825 303483 288609 271607 271509 268324 275443 280792
12748B80792q591r198k0937k4639j6107j0632k29j2838q462m028j2385j7196k905
$$ 280792 272201 263003 242066 217427 201320 190688 190459 177621 169159 165131 152746 135550 132645
12735A32645M298j1960k054J063M53J3222J5026K6719J1653M919N385J7542O660
$$ 132645 136943 124983 122929 123992 124445 137667 152693 179412 191065 195984 201369 218911 225571
12722B25571K2899K4076J0207N225j915M428j8031j7360j2633k9174j5102j1096
$$ 225571 248470 272546 282753 287978 286063 290491 272460 255100 242467 213293 198191 187095
12710A87095j5084k787l192J1256q317K29j7913p296r469j56O020P984J6289Q235
$$ 187095 172011 169224 166032 177288 168971 169200 151287 143991 134522 134366 140386 148370 164659 172894
12696A72894K7995L7091L8833O4349J05364J63240K26664K44923J78353K3515
$$ 172894 200889 237980 276813 341162 446526 609766 836430 1081353 1259706 1283221
12686A283221j08564j93037k26774j83589j30929r1696n3283k8464l5611k2253
$$ 1283221 1174657 981620 754846 571257 440328 348632 295349 266885 231274 209021
12676B09021k8713l6295k9819J0911Q870K620o329k0189j9635j1600l546j1888
$$ 209021 180308 144013 114194 125105 133975 136595 130266 110077 90442 78842 75296 63408
12664F3408k7066k6259J103L2491R743M653J9266Q739R520k387r417M657L063
$$ 63408 36342 10083 11186 43677 53420 58073 77339 86078 95598 93211 83794 88451 91514
12651I1514j6390j3102j2271Q045k354k272j6554m91r25J6177J6795l806k4170
$$ 91514 75124 62022 49751 57796 55442 53170 36616 36125 35200 51377 68172 64366 40196
12638D0196j3653k412J977J508J9473J3292k830N869m188j5652n219l502N645
$$ 40196 26543 24131 26108 27616 47089 60381 57551 63420 59232 43580 38361 34859 40504
12625D0504J8610O00j3338j9956l182J0163J4620K4155r507j3014j9815j4209
$$ 40504 59114 59714 46376 26420 23238 33401 48021 72176 62669 49655 29840 15631
12613A5631L84J8570K5358o07j95k370j424k726O192M272j0441j466J0938K993
$$ 15631 16015 34585 59943 59336 59141 56771 55347 52621 58813 63085 52644 51178 62116 65109
12599F5109p391j4452j7904J5272J9011p578m808j3346j4795l478J0306n76J79
$$ 65109 57718 43266 25362 40634 59645 52067 47259 33913 19118 15640 25946 25370 25549
12586B5549L614j737L111m265j5247k3532J9223J7557N536j3745q918K557P680
$$ 25549 29163 27426 30537 26272 11025 -12507 6716 24273 29809 16064 7146 9703 17383
12573A7383j4464R832K1379O898k4640k0507J677k0865j417P236J1125J1613J5009
$$ 17383 2919 12751 34130 41028 16388 -4119 -2442 -23307 -24724 -17488 -6363 5250 20259
12560B0259P706K632N337q977j4852j0487N248j764j10J4607M62N355j8519n759
$$ 20259 27965 30597 35934 26957 12105 1618 6866 5102 4992 19599 20061 25416 6897 1138
12546A138M658J3972Q63j2608m953M9M589j1296r888J296J2306J8370K7931K2900
$$ 1138 5796 19768 20631 8023 3070 3119 7708 -3588 -13476 -12180 126 18496 46427 69327
12532F9327J7280l209l1926k6481j8997J396K237j826j52J3107K6049P54r127
$$ 69327 86607 83398 51472 24991 5994 7390 9627 7801 7649 20756 46805 47559 38432
12519C8432m646n933j1125k0464Q68K1410j1587n551n351j1721J9351K4122p760
$$ 38432 33786 27853 16728 -3736 -2868 18542 6955 1404 -3947 -15668 3683 27805 20045
12506B0045L162K878r564j4933n877R152R559m664j6176J0125K815O4q412J933
$$ 20045 23207 26085 16521 1588 -4289 4863 14422 9758 -6418 3707 6522 6586 -1826 107
12492A07J5440J3183j3442o288l51Q60p066P032M353m88k0711j9276N729J0015
$$ 107 15547 28730 15288 9000 8649 9509 2443 9475 13828 13340 -7371 -26647 -20918 -10903
12478a0903O947j128K542Q419M900K713J1m069R2p666j0578m09J2196P389L911
$$ -10903 -3956 -5084 -2542 5877 10777 13490 13501 9432 9524 1858 -8720 -9129 3067 10456 14367
12463A4367m079o945J5613k126l335N215k278j2025p841O572J6537k474j8719
$$ 14367 10288 3343 18956 16830 13495 18710 16432 4407 -3434 3138 19675 17201 -1518
12450a518j880m685l90P193J9594J3768N811j299j1822j3854J699K836j291j337
$$ -1518 -3398 -8083 -8473 -1280 18314 32082 37893 36594 24772 10918 12617 15453 14162 12825
12436A2825p110j5315m197M084L0280Q925j4395j8320j855J1657r255p645J3246
$$ 12825 5715 -9600 -13797 -9713 20567 29492 15097 -3223 -5078 6579 -2676 -10321 2925
12423B925J0942O100O721j34k619n99J77N053l969j3675l890Q798M952K576L263
$$ 2925 13867 19967 26688 26554 23935 23336 23513 28566 24597 10922 7032 15830 20782 23358 26621
12408B6621n071k663N46Q052j579N855j348m78N621M191j6729k6927l045J6401
$$ 26621 21550 18887 19433 27485 25906 31761 30413 29935 35556 39747 23018 -3909 -6954 9447
12394I447Q950K693O945J3549J934M914O119K439j7151L794J3240J1441K7266
$$ 9447 18397 21090 28035 41584 43518 48432 54551 56990 39839 43633 56873 68314 95580
12381I5580K6055J7852N3732P7537J28698K01420K99930L39722J96277m6783k18882
$$ 95580 121635 139487 193219 270756 399454 600874 900804 1240526 1436803 1390020 1171138
12370A171138k85005k58492j76103j19032p0835n5329n1113k3390j4702p989K629
$$ 1171138 886133 627641 451538 332506 261671 206342 155229 131839 117137 109148 111777
12359A11777j5745k9877j9748p359P306j6037k0738M057n552J256j2154j794J3352
$$ 111777 96032 66155 46407 39048 46354 30317 9579 13636 8084 9340 -2814 -4608 8744
12346H744Q377q295L903J4469j1601j1644Q251L085j1561k425k355O926K508l878
$$ 8744 17121 8826 12729 27198 15597 3953 12204 15289 3728 1303 -1052 5874 8382 4504
12332D504J0989o173k1877j1861J5741K0259Q130n423j4185j5322J362j0966P303
$$ 4504 15493 9320 -12557 -24418 -8677 11582 19712 14289 104 -15218 -13856 -24822 -17519
12319a7519O079R710L097Q053m99k786P113K655j778l161K940j2258q113J1349
$$ -17519 -11440 -1730 1367 9420 8921 6135 13248 15903 14125 10964 13904 1646 -6467 4882
12305D882R419L009P850r376q032J0455K263j5924j0852l625J2875N680J256j4309
$$ 4882 14301 17310 25160 15784 7752 18207 20470 4546 -6306 -9931 2944 8624 9880 -4429
12291d429k7078L467K0560J5507q741L694J1869K271M46J1253l167j6968k0558
$$ -4429 -31507 -28040 -7480 8027 -714 2980 14849 17120 17566 28819 25652 8684 -11874
12278a1874J069J2488m602N421K3092q305o643j416J796N341m611Q207j881j6965
$$ -11874 -10805 1683 -2919 2502 25594 17289 10646 9230 11026 16367 11756 19963 18082 1117
12264A117k76j561L794K432k060K170k255j5491J0610O036M526K4184j6147r069
$$ 1117 841 -720 3074 5506 3446 5616 3361 -12130 -1520 4516 9042 33226 17079 8010
12250H010J4571J872R80o562j7603J657l880j1770O528o779o046o852L595J1963
$$ 8010 22581 24453 25433 18871 1268 2925 -955 -12725 -6197 -12976 -19022 -25874 -22279 -10316
12236a0316J4276O343N06l603P995N854j0494k323p528n733R158K0350n08j3725
$$ -10316 3960 10303 10809 7206 15201 21055 10561 8238 710 -5023 4135 24485 23977 10252
12222A0252j6881j2113k795P383P693J2086J28R441P12P959L416o874j564k718
$$ 10252 -6629 -18742 -21537 -14154 -6461 5625 5753 15194 15906 23865 27281 20407 18843 16125
12208A6125j5113P404j478J919q148n510k14m358l183K872L13j2320j1003O837
$$ 16125 1012 8416 6938 8857 709 -4801 -5015 -9373 -12556 -9684 -9371 -21691 -32694 -25857
12194b5857Q246P704N817R588p521j1400K88J080n986O581J598j472L085N144
$$ -25857 -17611 -9907 -4090 5498 -2023 -13423 -13135 -12055 -18041 -11460 -9862 -11334 -8249 -3105
12180c105n572l209K1000M459k112L920N191L662j7410k3067J1029M861j793l605
$$ -3105 -8677 -11886 9114 13573 11461 15381 20572 24234 6824 -16243 -5214 -353 -2146 -5751
12166e751R432J3124p37P070r267k578K36j809p863r106m933k401R804O34l786
$$ -5751 3681 16805 16068 23138 13871 11293 11529 9720 1857 -7249 -12182 -14583 -4779 -4145 -7931
12151g931r728q069N189p752L773K1406J4574l87o318P75L183j3727J2014k131
$$ -7931 -17659 -25728 -20539 -28291 -24518 -3112 11462 11075 4757 5532 8715 -5012 7002 4871
12137D871q205N079M89M116l456J97j73j1710M002R695p653n597q223K0470J5443
$$ 4871 -3334 1745 2234 6350 2894 3091 2918 -8792 -4790 4905 -2748 -8345 -16568 3902 19345
12122A9345n508q170p862m201n755j565j1355j928R019N598m323j4468m872J7248
$$ 19345 13837 5667 -2195 -6396 -12151 -13716 -25071 -26999 -17980 -12382 -16705 -31173 -36045 -18797
12108a8797J7707j498l096l719K703J3809O378j092j1870j1803j264J9062q046
$$ -18797 -1090 -2588 -5684 -9403 -6700 7109 13487 12395 525 -11278 -12542 6520 -1526
12095a526M084N471q215n132p87J2086K6325J1365j9229j8750n970j2619j2231
$$ -1526 2558 8029 -186 -5318 -6105 5981 32306 43671 24442 5692 -278 -12897 -25128
12082b5128R598J2989m74N879o111Q949j035k529n965p718j005L869n355N149
$$ -25128 -15530 -2541 -3015 2864 -3247 5702 4667 2138 -3827 -11545 -12550 -8681 -14036 -8887
12068h887k53k613L080O583Q070m550P90L810M154j4799j6279K293N60k245k426
$$ -8887 -9140 -11753 -8673 -2090 5980 1430 2220 6030 10184 -4615 -20894 -18601 -18041 -20286 -22712
12053b2712O653k81J3999R46j2201o674l223Q411L827J1239n464k954J210m936
$$ -22712 -16059 -16340 -2341 -1395 -13596 -20270 -23493 -15082 -11255 -16 -5480 -8434 -7224 -12160
12039a2160m810J84M980m647q084M5J0591J2289l229P154R227n063j0714o833
$$ -12160 -16970 -16786 -11806 -16453 -24537 -24492 -13901 -1612 -4841 2313 11540 6477 -4237 -11070
12025a1070M893J083n466N717K780J6928Q64j2650j3294m041J0757Q042j6468
$$ -11070 -6177 -5094 -10560 -4843 -2063 14865 15729 3079 -10215 -14256 -3499 4543 -11925
12012a1925k6933O827J7515O281l877J737K1774Q057j6840k1992k690n65j34Q081
$$ -11925 -38858 -32031 -14516 -8235 -12112 -10375 11399 19456 2616 -19376 -22066 -22631 -22765 -14684
11998a4684j678R779l227j2543Q474J5901Q868j5298j1227l479O059l666l024
$$ -14684 -16362 -6583 -9810 -22353 -13879 2022 10890 -4408 -15635 -19114 -13055 -16721 -19745
11985a9745J0155J4519k012n427m158n991k535M218J3536j4157n879K5703J3605
$$ -19745 -9590 4929 2917 -2510 -6668 -12659 -15194 -10976 2560 -11597 -17476 8227 21832
11972B1832m491J458N520n715k137p457j5360j194J2017j770o008l318L20Q366
$$ 21832 17341 18799 24319 18604 16467 9010 -6350 -7544 4473 2703 -3305 -6623 -6303 2063
11958B063j0603j0122O966M283J5971O929j3353j666j2078q58R211K676J169L928
$$ 2063 -8540 -18662 -11696 -7413 8558 15487 2134 468 -11610 -12468 -3257 -581 588 4516
11944D516N249N536j1345j0402L994r630o439Q246Q80m382K794J4834Q597j0545
$$ 4516 9765 15301 3956 -6446 -2452 -12082 -18521 -10275 -9395 -13777 -10983 3851 12448 1903
11930A903j5401R795J1799Q688k580n087r378o32m800r586j315R120O848k890
$$ 1903 -13498 -3703 8096 16784 14204 9117 -261 -893 -5693 -15279 -16594 -7474 -626 -3516
11916c516P810K949q404o304q549j884L431Q289N277j3146j546J0859L20N364
$$ -3516 4294 7243 -1161 -7465 -16014 -17898 -14467 -6178 -901 -14047 -15593 -4734 -4414 950
11902I50j262J274n708k477n012Q892M265p141M172n52n517l542j2733r938L816
$$ 950 -312 962 -4746 -7223 -12235 -3343 922 -6219 -2047 -2599 -8116 -11658 -24391 -34329 -30513
11887c0513P035K788o920J5526J5259j236M841n060K229K03J5397J1117j396j3460
$$ -30513 -23478 -20690 -27610 -12084 3175 1939 6780 1720 3949 4152 19549 30666 29270 15810
11873A5810l598m704n012j1061r193O309o181J0693P990Q659Q033L238N925M47
$$ 15810 12212 7508 2496 -8565 -17758 -11449 -17630 -6937 1053 9712 17745 20983 26908 27355
11859B7355j1364m919q587o748L450J4364j7769J385j3986j8458O103L370P337
$$ 27355 15991 11072 2485 -4263 -813 13551 -4218 -2833 -16819 -35277 -29174 -25804 -18467
11846a8467J1669o500n276k231R902N727k534Q248m306j0281p808J0228O456J094
$$ -18467 -6798 -13298 -18574 -20805 -10903 -5176 -7710 538 -3768 -14049 -21857 -11629 -5173 -4079
11832d079O925J0800K322j039J320k923Q607J464j1407j1028J603J1789R194K289
$$ -4079 2846 13646 15968 14929 16249 13326 21933 23397 11990 962 2565 14354 23548 25837
11818B5837J930j3814Q608l233n906M212j2500o170O73l097k038j3719M671P128
$$ 25837 27767 13953 22561 19328 13422 17634 5134 -1036 -363 -3460 -5498 -19217 -14546 -7418
11804g418n506L153J4812J0428L881n857k2649L836M692P415j2845j0280o192
$$ -7418 -12924 -9771 5041 15469 19350 13493 -9156 -5320 -628 6787 -6058 -16338 -22530
11791b2530O612K488L970J0699n837m467J413M937J6577k470j5533j0095L229
$$ -22530 -15918 -13430 -9460 1239 -4598 -9065 -7652 -2715 13862 11392 -4141 -14236 -11007
11778a1007M122R226o396q707k442Q268K006L91k1249K306J0644k098Q648R86
$$ -11007 -6885 2341 -4055 -12762 -15204 -6936 -4930 -4539 -25788 -23482 -12838 -14936 -6288 -5302
11764e302j8000p62Q960P569J1132M657p114k407n624O279Q318J2981j4589r907
$$ -5302 -23302 -24064 -15104 -7535 3597 8254 1140 -1267 -6891 -612 7706 20687 6098 -3809
11750c809N351j2479n900O958N903J405q921k210r47J3630R685M705j9R816M2
$$ -3809 1542 -10937 -16837 -9879 -3976 -2571 -11492 -13702 -14649 -1019 8666 13371 13352 23168 23210
11735B3210j3698k541j2551L689l264P021p21o68m146O549K676l079j2764r322
$$ 23210 9512 6971 -5580 -1891 -5155 1866 1145 477 -3669 2880 5556 2477 -10287 -19609
11721a9609r782L802J681m041N564J299m836K1103J3897P765k049k0301j3123
$$ -19609 -29391 -25589 -23908 -27949 -22385 -21086 -25922 -4819 9078 16843 14794 -5507 -18630
11708a8630k482J8829P551j642k72k944k1294Q180J7913J1432n783p41K878L648
$$ -18630 -21112 -2283 5268 3626 3354 410 -20884 -12704 5209 16641 10858 10117 12995 16643
11694A6643o089j5942r902L434J2023k46j7889J1363P182p360j999J3549M192
$$ 16643 10554 -5388 -15290 -11856 167 -79 -17968 -6605 577 -6783 -8782 4767 8959
11681H959n883J061q921p874J0559L593j0961L736j6947l103J2810K4962l769
$$ 8959 3076 4137 -4784 -12658 -2099 1494 -9467 -5731 -22678 -25781 -12971 11991 8222
11668H222j6347o136K372p492p099J2981J8248J5453K473k767j5161j7824j2126
$$ 8222 -8125 -14261 -11889 -19381 -26480 -13499 4749 20202 22675 19908 4747 -13077 -25203
11655b5203q019Q651P877j021Q664R393j273n66p794j379O442R009k1678o086
$$ -25203 -33222 -24571 -16694 -17715 -9051 342 -931 -1497 -9291 -10670 -4228 4781 -16897 -22983
11641b2983P140K810k278Q907j1406j0478P963Q664K192o604j169K294l922n773
$$ -22983 -15843 -13033 -15311 -6404 -17810 -28288 -20325 -11661 -9469 -16073 -17242 -14948 -18870 -24643
11627b4643K432J6334J1975j3213m88K1129j945K65m265L866l438m356q069r475
$$ -24643 -22211 -5877 6098 -7115 -7603 13526 11581 11846 7581 11447 8009 3653 -4416 -13891
11613a3891q997q554M180J8909J907J352J6725Q957j969j0642j3564L282j0325
$$ -13891 -22888 -31442 -27262 -8353 -6446 -5094 11631 20588 18619 7977 -5587 -2305 -12630
11600a2630o895l230m633K1985O973j512j2989q577q136J0414K3383R053j2474
$$ -12630 -19525 -22755 -27388 -5403 1570 58 -12931 -21508 -29644 -19230 4153 13206 732
11587G32p072M469R271j5981j1908R785K3052J6340j3689j2683K619m47m21j66
$$ 732 -6340 -1871 7400 -8581 -20489 -10704 12348 28688 14999 2316 4935 4488 4067 3901
11573C901j8358J825n34n623R908J752k428K951n666L997R058J591N09K409N582
$$ 3901 -14457 -12632 -13166 -18789 -8881 -7129 -9557 -6606 -12272 -8275 783 2374 2883 5292 10874
11558A0874l564K11r195l016n931l268o83K71Q577j120J8155J2052o296k402J423
$$ 10874 7310 7521 -1674 -4690 -10621 -13889 -14572 -14301 -5724 -6844 11311 23363 17067 14665 16088
11543A6088k651j273n63n695j6389l922q255K33J8975J9532P27p056M718n191
$$ 16088 13437 12164 11601 5906 -10483 -14405 -22660 -22427 -3452 16080 16807 9751 14469 9278
11529I278K735k567j1253M625k044o26k140K266j1396L100j2218N510J3653J3814
$$ 9278 12013 9446 -1807 2818 774 148 -1992 274 -11122 -8022 -20240 -14730 -1077 12737
11515A2737j2966K324J1628J734j211K112l232j0122k951J1447j4842o834K772
$$ 12737 -229 2095 13723 15457 14246 16358 13126 3004 53 11500 -3342 -10176 -7404
11502g404P051P520j1939j5657j483Q466M476J873M539j6103K28r589J189J517
$$ -7404 -353 7167 -4772 -20429 -21912 -13446 -8970 -7097 -2558 -18661 -18433 -28022 -26833 -25316
11488b5316M556M253M401n981q259J6053K852O076K370j6023o0q135J619J1078
$$ -25316 -20760 -16507 -12106 -18087 -26346 -10293 -7441 -1365 1005 -15018 -15078 -23213 -21594 -10516
11474a0516J2461q46M858n636j0638L368O141j3462n12J5642N748O970j6937r650
$$ -10516 1945 1099 5957 321 -10317 -6949 -808 -14270 -14782 860 6608 13578 -3359 -13009
11460a3009J5582J9806j0143n501l564j0013q04M82R340J2357r569j914K168m967
$$ -13009 2573 22379 12236 6735 3171 -6842 -7646 -7164 2176 14533 4964 3050 5218 251
11446B51p320J2955J2277o955q587J776J10j632J14Q966k137l92O722O629j4611
$$ 251 -7069 5886 18163 11208 2621 4397 4507 2875 2989 11955 9818 9426 16148 22777 8166
11431H166j5548N887L312o258k522p280K287M332k298J1190O377J6697j7079J0083
$$ 8166 -7382 -1495 1817 -4441 -6963 -14243 -11956 -7624 -9922 1268 7645 24342 7263 17346
11417A7346K988r290k017R25m731o882j012M477J3648N628K393M13n278m705j0104
$$ 17346 20334 11044 9027 9952 5221 -1661 -2673 1804 15452 21080 23473 23886 18608 13903 3799
11402C799q698P480K28o901N787K962m248J1118l99k4133K554K702L680j2848
$$ 3799 -4899 2581 2809 -4092 1695 4657 409 11527 11128 -13005 -10451 -7749 -4069 -16917
11388a6917J40L080m227O707J9198j315j212L592J4193M59n085j610o905k0066
$$ -16917 -16777 -13697 -17924 -11217 7981 6666 5454 9046 23239 23698 18613 17003 10098 -9968
11374i968q668J105K033K612k090R412K2730K312j2973j8550P595L882j3515J145
$$ -9968 -18636 -17531 -15498 -12886 -14976 -5564 17166 19478 6505 -12045 -4450 -568 -14083 -12938
11360a2938J908R224Q440k173j589J1424O26l278L759K000R589K283J6851k893
$$ -12938 -11030 -1806 6634 4461 2872 14296 14922 11644 15403 17403 26992 29275 46126 43233
11346D3233p330j0812o764j1903j6284j0979N777l490Q032J1883k166n176l608
$$ 43233 35903 25091 18327 6424 -9860 -20839 -15062 -18552 -10520 1363 -803 -5979 -9587
11333i587l168Q369p383J1575L099m107k3903p417Q170P012J5505M802p053n030
$$ -9587 -12755 -4386 -11769 -194 2905 -1202 -25105 -32522 -24352 -17340 -1835 2967 -4086 -9116
11319i116N938J4518j0034J8363R44M164r085j4335j6484l975l415M057O414J0086
$$ -9116 -3178 11340 1306 19669 20613 24777 15692 1357 -15127 -19102 -22517 -18460 -12046 -1960
11305a960r519Q82j0037r371L820N456Q739o020N753M461j3739N428J2175l716
$$ -1960 -11479 -10597 -20634 -30005 -26185 -20729 -11990 -18010 -12257 -7796 -21535 -16107 -3932 -7648
11291g648j1099L737M229j1984l32Q613J9673n616k415J0113P343m99p771P705
$$ -7648 -18747 -15010 -10781 -22765 -23097 -14484 5189 -427 -2842 7271 14614 14115 6344 14049
11277A4049J5907j4133k7504k309Q502p51j3855l503q845J2977J6539Q577o838
$$ 14049 29956 15823 -11681 -13990 -5488 -6239 -20094 -23597 -32442 -19465 -2926 5651 -1187
11264a187o380p906q877p536r089O549N919M797J5705J9341R120j7986j7178K513
$$ -1187 -7567 -15473 -24350 -31886 -40975 -34426 -28507 -23710 -8005 11336 20456 2470 -14708 -12195
11250a2195J1688j5221j950J6984N206K299r428j6109Q737l882m553K860k494
$$ -12195 -507 -15728 -17678 -694 4512 6811 -2617 -18726 -9989 -13871 -18424 -15564 -18058
11237a8058O383o07l986r444L474J0718J3606K92j1455K657K2127l803r054o073
$$ -18058 -11675 -12282 -16268 -25712 -22238 -11520 2086 2378 -9077 -6420 15707 11904 2850 -3223
11223c223M135N51m062N908L323j4358L07o624k0176m159J0763O696K977N911
$$ -3223 912 1463 -2599 3309 6632 -7726 -7419 -14043 -34219 -38378 -27615 -20919 -17942 -12031
11209a2031J861R72j0717n918O856Q33m305J7929J913J80m822J8754j165p56o46
$$ -12031 -10170 -9198 -19915 -25833 -18977 -18144 -22449 -4520 -2607 -2427 -7249 11505 10340 9584 8938
11194H938j3364r292j975j696l459k962j0085N816p569Q473K1810J5704N308L716
$$ 8938 -4426 -13718 -15693 -17389 -20848 -23810 -33895 -28079 -35648 -27175 -5365 10339 15647 19363
11180A9363j1158O323j1533m932Q957J1323m968j3660q821J905l526j0566K368
$$ 19363 8205 14528 2995 -1937 7020 18343 13375 -285 -9106 -7201 -10727 -21293 -18925
11167a8925O763P056m582N608j799r611J2283R939k811r291p476o236R293J734
$$ -18925 -12162 -5106 -9688 -4080 -5879 -15490 -3207 6732 3921 -5370 -12846 -19082 -9789 -8055
11153h055N359j2543k451J870O097J0901P036k782p785M340o345j0191J953O380
$$ -8055 -2696 -15239 -17690 -15820 -9723 1178 8214 5432 -2353 1987 -4358 -14549 -12596 -6216
11139f216r991K895q769J0446K0868l125J631j8M484j6521j6419J5723K0594q82
$$ -6216 -16207 -13312 -22081 -11635 9233 6108 7739 7721 12205 -4316 -20735 -5012 15582 14700
11125A4700j3829k42r275O254J7171R412J072j4951j8047j3087J1747J2219M920
$$ 14700 871 629 -8646 -2392 14779 24191 25263 10312 -7735 -20822 -9075 3144 8064
11112H064N266j3030J377Q84O63r809j0567k56j416p297m584M303j568M188m597
$$ 8064 13330 300 1677 2561 3224 -6585 -17152 -17408 -18824 -26121 -30705 -26402 -27970 -23782 -28379
11097b8379K445J9308j1679k4937K253J3272M321N818J0865p655k282n406L73
$$ -28379 -25934 -6626 -18305 -43242 -40989 -27717 -23396 -17578 -6713 -14368 -16650 -22056 -21683
11084b1683q44P904n965l628M916J7547L798J293p693L465j443j3233P200M459
$$ -21683 -22527 -14623 -20588 -24216 -19300 -1753 2045 3338 -4355 -890 -2333 -15566 -8366 -3907
11070c907l210p170m060J585J1706p333m441o906P468J2201r567j2730J6797K2323
$$ -3907 -7117 -14287 -18347 -16762 -5056 -12389 -16830 -23736 -16268 -4067 -13634 -26364 -9567 12756
11056A2756M690j5975j0560O255k263k1525Q724J3110L743m293p159m662q449
$$ 12756 17446 1471 -9089 -2834 -5097 -26622 -17898 -4788 -1045 -5338 -12497 -17159 -25608
11043b5608p723o02K94R798J0877Q438o701j1223Q010k590K827O981r8J1960N633
$$ -25608 -33331 -33933 -33639 -23841 -12964 -4526 -11227 -22450 -14440 -17030 -14203 -7222 -7320 4640 10273
11028A0273r107j0339j3108O858j6532P84n047O475R773m693j120J1887L629l13
$$ 10273 1166 -9173 -22281 -15423 -31955 -31171 -36218 -29743 -19970 -24663 -25783 -13896 -10267 -10580
11014a0580n041J6669M488j2982j3876N458O379J3060p614O717J320p143j547
$$ -10580 -15621 1048 5536 -7446 -21322 -15864 -9485 3575 -4039 2678 3998 -3145 -4692
11001d692J702J5008J1614K221n994l32L857M794p862q514r113O070n272O136
$$ -4692 -2990 12018 23632 25853 19859 19527 23384 28178 20316 11802 2689 8759 3487 9623
10987I623R651n411k2547n852R864n13L358J7855R368m790l835j3325Q32M284
$$ 9623 19274 13863 -8684 -14536 -4672 -5185 -1827 16028 25396 20606 16771 3446 4278 8562
10973H562r98O729L100N484j0714l861K140L962j0769m610o422J5773Q785p313
$$ 8562 7564 14293 17393 22877 12163 8302 10442 14404 3635 -975 -7397 8376 17161 9848
10959I848m356j2922p599N990J9639M205j178k038L741P478p510j5452m178j0652
$$ 9848 5492 -7430 -15029 -9039 10600 14805 13627 11589 15330 22808 15298 -154 -4332 -14984
10945a4984l339P204Q173l006m424J613j273j3261N054J261j3726n812J1242J0170
$$ -14984 -18323 -11119 -2946 -5952 -10376 -8763 -10036 -23297 -18243 -16982 -30708 -36520 -25278 -15108
10931a5108p395M797k67M973O973j7266j369J959o741K703O164N960P23Q032Q711
$$ -15108 -22503 -17706 -17973 -13000 -6027 -23293 -24662 -22703 -29444 -26741 -20577 -14617 -13894 -5862 2849
10916B849p216L202j1616L179j211l879l412m889l935J4899p27o885K045m193
$$ 2849 -4367 -1165 -12781 -9602 -10813 -14692 -18104 -22993 -26928 -12029 -12756 -19641 -17596 -21789
10902b1789k630J0291o025L029N321N904p08O970m444l275j051r20J490J0679
$$ -21789 -24419 -14128 -20153 -17124 -11803 -5899 -6607 363 -4081 -7356 -8407 -9327 -7837 2842
10888B842j4349j0119L066L2225J5934m550R57l100j9843q957R138O376j5057
$$ 2842 -11507 -21626 -18560 13665 29599 25049 26006 22906 3063 -5894 3244 9620 -5437
10875e437K238Q840Q55N739j5193q696m138k216N238r037l215O100K702o131j589
$$ -5437 -3199 5641 6496 12235 -2958 -11654 -15792 -18008 -12770 -21807 -25022 -18922 -16220 -22351 -23940
10860b3940l788l876R353J3258Q389L781Q106Q71M058J076M40J1442l559m372
$$ -23940 -27728 -31604 -22251 -8993 -604 3177 11283 12154 16212 17288 17728 29170 25611 21239
10846B1239J3738j3315p600J4322n48q603j6390K354J3044J3430O822k419m559
$$ 21239 34977 21662 14062 28384 27836 19233 2843 5197 18241 31671 38493 36074 31515
10833C1515o220j0056m311r87Q059o379j3524J094K325O033p390N168P349q271
$$ 31515 25295 15239 10928 9941 18000 11621 -1903 -809 1516 7549 159 5327 12676 4405
10819D405j2841j060J7989J760j567p479N15j077M340j0020n682P759Q404o826
$$ 4405 -8436 -9496 8493 10253 8686 1207 1722 645 4985 -5035 -10717 -2958 5446 -1380
10805a380J1603M688j4781j8145j0258m45j383M688o014k790M074J6329k375o006
$$ -1380 10223 14911 130 -18015 -28273 -28718 -30101 -25413 -31427 -34217 -30143 -13814 -16189 -22195
10791b2195m592R859Q302P69p68J532q125O602P541j7074m638m279P406J5617
$$ -22195 -26787 -16928 -8626 -7857 -8625 -7093 -15218 -8616 -1075 -18149 -22787 -27066 -19660 -4043
10777d043Q519P593J79l973m322j0849P966l648o400l988j2145K886M178J1134
$$ -4043 4476 12069 12248 8275 3953 -6896 1070 -2578 -8978 -12966 -25111 -22225 -18047 -6913
10763f913O423o90j5413j4128j102J5677K3134J4732j0524j859o173k66M76k969
$$ -6913 -490 -1180 -16593 -30721 -31823 -16146 6988 21720 11196 9337 3164 2898 3374 405
10749D05l303q248k471M584j0731q566Q525Q177m931j325O061J1777J6125O166
$$ 405 -2898 -11146 -13617 -9033 -19764 -28330 -19805 -11628 -16559 -17884 -11823 -46 16079 22245
10735B2245j5324j0657r321P519J3681K3308l263j0055J127j4517k432p172m977
$$ 22245 6921 -3736 -13057 -5538 8143 31451 28188 18133 19260 4743 2311 -4861 -9838
10722i838K397j3819J0697J4968q259j477j985l613j0875K440J7042J8810J389
$$ -9838 -7441 -21260 -10563 4405 -3854 -5331 -7316 -10929 -21804 -19364 -2322 16488 17877
10709A7877j0614k2004r823J575L150p105j2504k231K2536K4045n4n674J092J5441
$$ 17877 7263 -14741 -24564 -22989 -19839 -26944 -39448 -41679 -19143 4902 4848 -826 266 15707
10695A5707L049K427J1818n927n992J525M166j529r686r054j0504m156j026J259
$$ 15707 18756 21183 33001 27074 21082 22607 26773 25244 15558 6504 -4000 -8156 -9182 -7923
10681g923m887R117J8851n836k2514j3344R425N601j6122j658Q99P26K786M145
$$ -7923 -12810 -3693 15158 9322 -13192 -26536 -17111 -11510 -27632 -29290 -28391 -27665 -24879 -20734
10667b0734R557O609k399j925M695J0908l303R36N722M486K561n960k684R170
$$ -20734 -11177 -4568 -6967 -8892 -4197 6711 3408 4344 10066 14552 17113 11153 8469 17639
10653A7639j24j1339j9619L031K58J301J0802J560q665N029J2837K792n862r194
$$ 17639 17515 6176 -13443 -10412 -10154 -8853 1949 3509 -5156 -127 12710 15502 9640 446
10639D46K564p299j6120p44J4853N397l877J4656M050j3712o5J210R368N12l436
$$ 446 3010 -4289 -20409 -21153 -6300 -903 -4780 9876 13926 214 149 1359 10727 11239 7803
10624G803n565r835p992M380j740j405Q526q626J6313K3958K28j5822j7060j1763
$$ 7803 2238 -7597 -15589 -11209 -12949 -14354 -5828 -14454 1859 25817 26045 10223 -6837 -18600
10610a8600p383J2872J2768M827m697P233J1540K31o352J71L122m905o294m80
$$ -18600 -25983 -13111 -343 4484 -213 7020 18560 18791 12439 12610 15732 10827 4533 4053
10596D053r44l345O712K689R689J86j1249q429p024O468J6876M10l816j0029j670
$$ 4053 3109 -236 6476 9165 18854 19040 7791 -638 -7662 -1194 15682 16092 12276 2247 577
10581E77p560m324R52n704m801J311K03J411O425j139K348J1420m579j6306m452
$$ 577 -6983 -11307 -10355 -16059 -20860 -19549 -19346 -17935 -11510 -12649 -10301 1119 -3460 -19766 -24218
10566b4218J4640K0567J6196j0131j2664j1520k519j3463n61J7750Q25O248J627
$$ -24218 -9578 10989 27185 17054 4390 -7130 -9649 -23112 -23673 -5923 -5098 1150 2777
10553B777m625j606k529j174J399N505p905L430j056L912P588N740M686o464j3772
$$ 2777 -1848 -3454 -5983 -7157 -5758 -253 -8158 -4728 -5784 -1872 5716 11456 16142 9678 -4094
10538d094k525J0400J5308o026O957j4862n314O715K439L401j1480k0903L998
$$ -4094 -6619 3781 19089 13063 20020 5158 -156 6559 8998 12399 919 -19984 -15986
10525a5986Q718K0876L715j6637r381j669J2169n107N432N659k1912j3622J7572
$$ -15986 -7268 13608 17323 686 -8695 -10364 1805 -3302 2130 7789 -14123 -27745 -10173
10512a0173Q579K73j472q849k932N394M026J2809N348R129q272L331N969n608
$$ -10173 -1594 -1321 -2793 -11642 -14574 -9180 -5154 7655 13003 22132 13860 17191 23160 17552
10498A7552k1502o869L765J1264J2657J4483j4120j2521O480Q929p14n050L947
$$ 17552 -3950 -10819 -7054 4210 16867 31350 17230 4709 11189 20118 19404 14354 18301
10485A8301j2045p758k326j4031n494L104P651N226k382r617J2039l648O874M131
$$ 18301 6256 -1502 -3828 -17859 -23353 -20249 -12598 -7372 -9754 -19371 -7332 -10980 -4106 25
10471B5J4047p856j6102N216p963L531J0076o606j3684k0142J0461J1105Q519
$$ 25 14072 6216 -9886 -4670 -12633 -9102 974 -5632 -19316 -39458 -28997 -17892 -9373
10458i373Q760J3679m932L77k746n322K754J099l142J327Q532o527J79K099o394
$$ -9373 -613 13066 8134 8511 5765 443 3197 4296 1154 2481 11013 4486 4665 6764 370
10443C70P900p766P280J99l1091P28J9981L70n345m416o707Q252L28N521J1704
$$ 370 8270 504 7784 7983 -23108 -22380 -2399 -2029 -7374 -11790 -18497 -10245 -9917 -4396 7308
10428G308j7443k2717l71K2338J4219k322K535P152Q6Q808mJ3525N497j4507j2924
$$ 7308 -10135 -32852 -33223 -10885 3334 1012 3547 10699 10785 19593 19589 33114 38611 24104 11180
10413A1180m863k625o670j2726j1686j161K6590J1225n619P618M609j0283j3058
$$ 11180 6317 3692 -2978 -15704 -27390 -28551 -1961 9264 3645 11263 15872 5589 -7469
10400g469k044R111J4509K43q608j7158j1117n772J1151Q000n192K945J2106Q568
$$ -7469 -9513 -402 14107 14350 5742 -11416 -22533 -28305 -17154 -9154 -14346 -11401 705 9273
10386I273N142L617J1441j2733m156j8940j5092j863M819J0468q38R094J4229
$$ 9273 14415 18032 29473 16740 12584 -6356 -21448 -23311 -18492 -8024 -8862 232 14461
10373A4461p608N94m481j2721k532K561M962J0035j2306r16K707m962O830P933
$$ 14461 6853 7447 2966 -9755 -12287 -9726 -4764 5271 -7035 -7951 -5244 -10206 -3376 4557
10359D557N458j3132J2768k589j797K7882P276k8176k6298J251J4556K958L736
$$ 4557 10015 -3117 9651 7062 5265 33147 40423 12247 -14051 -12800 1756 4714 8450
10346H450Q63r959p333P295Q194r553J1922O319r204j3993L67O987K3604K425
$$ 8450 9313 -646 -7979 -684 7510 -2043 9879 16198 6994 -6999 -6632 355 23959 26384
10332B6384j0922q925j8281m086k482J1776O280J0488r46p994J4312M224o432
$$ 26384 15462 6537 -11744 -15830 -18312 -6536 -256 10232 9286 1292 15604 19828 13396
10319A3396q447K97j1521m351O647P03j673r179q10M828j3115N362j870n596M818
$$ 13396 4949 5246 -6275 -10626 -3979 -3276 -4949 -14128 -14938 -10110 -23225 -17863 -19733 -25329 -20511
10304b0511l72J5231Q842j217k84q755N980K4461Q338n97K230j5348q89j1139
$$ -20511 -20883 -5652 3190 1973 1689 -7066 -1086 23375 31713 31116 33346 17998 17109 5970
10290E970M58M641j0397p947l351n816o358m12l913P394Q050J0787j59r703m052
$$ 5970 6428 11069 672 -7275 -10626 -16442 -22800 -23212 -27125 -19731 -11681 -894 -1053 -10756 -14808
10275a4808R361K4208j841O061R587k3859o939K097P951M772o610p887l020O228
$$ -14808 -5447 18761 16920 22981 32568 8709 1770 3867 11818 16590 9980 2093 -927 5301
10261E301K086j6812j3806k418O280m335J0036M627Q13O108j936k588J002J834
$$ 5301 7387 -9425 -23231 -25649 -19369 -23704 -13668 -9041 -8228 -2120 -4056 -6644 -5642 -3808
10247c808M511j509p156M520l807J2376q41l745k468j724J1131Q856j4421j3556
$$ -3808 703 -806 -7962 -3442 -7249 5127 4286 541 -1927 -3651 7480 16336 1915 -11641
10233a1641q592q616M702J0672O293p98r81Q242M288l229N61L25k919Q092j0800
$$ -11641 -20233 -28849 -24147 -13475 -7182 -7980 -8961 -719 3569 340 901 1226 -1693 6399 -4401
10218d401l313J1413J1428r590r446m243J0110P903N356j8755j4037Q042r350
$$ -4401 -7714 3699 15127 5537 -3909 -8152 1958 9861 15217 -3538 -17575 -9533 -18883
10205a8883N757N575R618J2409k480q419N430n022j5200O717K1961Q334L03p71
$$ -18883 -13126 -7551 2067 14476 11996 3577 9007 3985 -11215 -4498 17463 25797 26100 25329
10191B5329o401q202r028n067q286L316M483J1377J48K476r625j569J187L365
$$ 25329 18928 10726 1698 -3369 -11655 -8339 -3856 7521 7669 10145 520 -1049 138 3503
10177C503L583M173J7395q426j6811p92O712k72j833L849j126j1634n417Q7O638
$$ 3503 7086 11259 28654 20228 3417 2625 9337 9065 7232 11081 9955 -1679 -7096 -7009 -371
10162c71p41N483K938p54M372m598j5664m020K3636O435r825j4715J45Q744M785
$$ -371 -1112 4371 7309 6555 10927 6329 -9335 -13355 10281 16716 6891 -7824 -7679 1065 5850
10147E850k068q477o42J761n011o104N580P055p50K897l264P829R73k08l790o09
$$ 5850 3782 -4695 -5337 -3576 -8587 -14691 -9111 -2056 -2806 91 -3173 4656 5629 5421 1631 1022
10131A022J972p955k814J0337p160m730k006J0705N853L010j719j381P56k979
$$ 1022 2994 -4961 -7775 2562 -4598 -9328 -11334 -629 5224 8234 6515 5134 5890 2911
10117B911m297J1544m830r545l346j274m076J3810j086q253O587R683j1120k619
$$ 2911 -1386 10158 5328 -4217 -7563 -8837 -12913 897 -189 -8442 -1855 7828 -3292 -5911
10103e911N400L845j4400P161N725J545n347j115n403K58J51J2607q049l041J1003
$$ -5911 -511 3334 -11066 -3905 1820 3365 -1982 -3097 -8500 -8242 -8091 4516 -3533 -6574 4429
10088D429P192P902j345p8k7j5426l658j912k62O458J6983n888j3975r738n781
$$ 4429 11621 19523 18178 18100 18073 2647 -1011 -2923 -3185 3273 20256 14368 393 -9345 -15126
10073a5126J4463J4414k506j5721m458J7927j740j0925m687J6085M001j1916j2196
$$ -15126 -663 13751 11245 -4476 -8934 8993 7253 -3672 -8359 7726 11727 -189 -12385
10060a2385O679M352j3538l572M219J764J2258J657OL753n486j2015N626J2015
$$ -12385 -5706 -1354 -14892 -18464 -14245 -12481 -223 1434 1440 5193 -293 -12308 -6682 5333
10046E333K1630j5257k0091j3443N383J1584N121l420j1319p180J2377J3582j2492
$$ 5333 26963 11706 -8385 -21828 -16445 -4861 260 -3160 -14479 -21659 -9282 4300 -8192
10033h192j5114K855n936K851J026J8600J1196o269O708j0791R46p35l32m727
$$ -8192 -23306 -20451 -26387 -23536 -22510 -3910 7286 1017 7725 -3066 -2120 -2855 -3187 -7914
10019g914q457J2003j75K460n24o101J22L353j5772O258q888j898N078r145N585
$$ -7914 -16371 -4368 -4543 -2083 -2607 -8708 -8586 -5233 -21005 -14747 -23635 -25533 -20455 -29600 -24015
10004b4015J1183p177p095K2072L367Q33M611J609j2537r016O158J2073J0179
$$ -24015 -12832 -20009 -27104 -5032 -1665 -832 3779 5388 -7149 -16165 -10007 2066 12245
9991A2245j2402M160j531n445J919J2992J4095p089p564R406n886J939O479K925
$$ 12245 -157 4003 2472 -2973 -1054 11938 26033 18944 11380 20786 14900 16839 23318 26243
9977B6243j2089j0502j988L461r876K907O562J997r297k328J7841J671k951P383
$$ 26243 14154 3652 1664 5125 -4751 -1844 4718 6715 -2582 -4910 12931 14602 11651 19034
9963A9034n465j6166j2412n155K336J6288l622j579Q663N309m293k920J1135m199
$$ 19034 13569 -2597 -15009 -20164 -17828 -1540 -5162 -6741 1922 7231 2938 18 11153 6954
9949F954m962p117r327Q61m037k802r667m644J1197J6841N100K416k831L515O612
$$ 6954 1992 -5125 -14452 -13591 -17628 -20430 -30097 -34741 -23544 -6703 -1603 813 -2018 1497 8109
9934H109j64j8498j443K0248M290N530K228j2476j7004J812j0419O719k93j029
$$ 8109 7945 -10553 -11996 8252 12542 18072 20300 7824 -9180 -7368 -17787 -11068 -11361 -12390
9920a2390N856L796k216l663o575N142J0322k923o307j129J2426R105L215j8209
$$ -12390 -6534 -2738 -4954 -8617 -15192 -10050 272 -2651 -8958 -10087 2339 11444 14659 -3550
9906c550j0460k069k789r75K133L076R938J8642N380m407j3738j3656J283R734
$$ -3550 -14010 -16079 -18868 -19843 -17710 -14634 -4696 13946 19326 14919 1181 -12475 -11192 -1458
9892a458Q940N435n16K280K081n770j7627j681J3547j277o053J6190J1204J548
$$ -1458 7482 12917 12401 14681 16762 10992 -6635 -8316 5231 3954 -2099 14091 25295 26843
9878B6843o434j2309j381m074P491m519j0688N820J1642p868K76J177m373p850
$$ 26843 20409 8100 6719 2645 10136 5617 -5071 749 12391 4523 4799 5976 1603 -6247
9864f247J855j0732O446J029M03j5079m804p994J6772J0292J4950N211n086M90
$$ -6247 -4392 -15124 -8678 -7649 -7246 -22325 -27129 -35123 -18351 -8059 6891 12102 7016 7506
9850G506j281j878K286k758m182K070K632r531J3244L665n126O996j3849j6337
$$ 7506 6225 4347 6633 3875 -307 1763 4395 -5136 8108 11773 6647 13643 -206 -16543
9836a6543K7N375l145L930J1030m467l823o795R651J2727o320j0551j782q77O553
$$ -16543 -16516 -11141 -14286 -10356 674 -3793 -7616 -14411 -4760 7967 1647 -8904 -10686 -11563 -5010
9821e010n398P43j154J063M29j476J189M990P226j3508k1652O466J8496K123j0140
$$ -5010 -10408 -9665 -10819 -9756 -9327 -10803 -9614 -4624 2602 -10906 -32558 -26092 -7596 -5473 -15613
9806a5613R188L302p15J0604K773J3207O628k0785M291Q656o697r375N029j512
$$ -15613 -6425 -3123 -3838 6766 9539 22746 29374 8589 12880 21536 14839 5464 10493 8981
9792H981q553M714J931j0850j3871l484o570J6544N16Q882o012q837J1540L363
$$ 8981 428 5142 7073 -3777 -17648 -21132 -27702 -11158 -10642 -1760 -7772 -16609 -5069 -1706
9778a706K981l480p955N693m191j546L947m724l870j7726k158K4743J5508p716
$$ -1706 1275 -2205 -10160 -4467 -8658 -10204 -6257 -10981 -14851 -32577 -34735 -9992 5516 -2200
9764b200q228J4512N294j9077Q57J7597j105n775p357l607L385O416m577J494
$$ -2200 -10428 4084 9378 -9699 -8842 8755 7650 1875 -5482 -9089 -5704 712 -3865 -2371
9750b371k710l651L779j404O655J7315R675j6058l237P707p417q19k149n96j3659
$$ -2371 -5081 -8732 -4953 -6357 298 17613 27288 11230 7993 15700 8283 7464 5315 4719 -8940
9735h940q999J222J1521k316r017M99o582M862J0862O77J897q042l340K212R505
$$ -8940 -17939 -16717 -5196 -7512 -16529 -16030 -22612 -17750 -6888 -6211 -4314 -12356 -15696 -13484 -3979
9720c979Q610m612o276O886J92j1621m800J165M399L986P028q888Q735N270r002
$$ -3979 4631 19 -6257 629 821 -10800 -15600 -14435 -10036 -6050 978 -7910 825 6095 -2907
9705b907O21j735j574N256P94r081q672J532J1260j424O411R233r767J3039m172
$$ -2907 -2286 -4021 -5595 -339 455 -8626 -17298 -15766 -4506 -5930 481 9714 -53 12986 8814
9690H814j4532N117L394j2965l227k081J8098N138k581J226J1132J5250n701J871
$$ 8814 -5718 -601 2793 -10172 -13399 -15480 2618 7756 5175 6401 17533 32783 27082 28953
9676B8953m114n070k1830n993Q258J8349p517q509j1742p651l796N798J7945q638
$$ 28953 24839 19769 -2061 -8054 204 18553 11036 2527 -9215 -16866 -20662 -14864 3081 -5557
9662e557j0249m168o312J6985K11j0761j0101J3545j957j805k299k107O518J1833
$$ -5557 -15806 -19974 -26286 -9301 -9090 -19851 -29952 -16407 -18364 -20169 -22468 -24575 -18057 -6224
9648f224J5552J0005P628j066K35n527q060o244R693R81q267q829j818J5078m095
$$ -6224 9328 19333 26961 25895 26130 20603 12543 6299 15992 16973 8706 -123 -1941 13137 9042
9633I042j3190l107O15P097n610o04J025q073l670J5086J0971r184m97J690Q458
$$ 9042 -4148 -7255 -6640 457 -5153 -5757 -4732 -12805 -16475 -1389 9582 398 -99 1591 10049
9618A0049L476P150k136m999p819J8629J0756M639j8534j8885q291M072R437O942
$$ 10049 13525 20675 18539 13540 5721 24350 35106 39745 21211 2326 -5965 -1893 7544 14486
9604A4486j0575L215j94M573n834j3368o215n080J3572R408o492o479J6297j756
$$ 14486 3911 7126 6932 11505 5671 -7697 -13912 -18992 -5420 3988 -2504 -8983 7314 5558
9590E558r750k782J0719p42j193R042J1348M946r200j2969m274n393J982Q384
$$ 5558 -4192 -6974 3745 3003 1810 10852 22200 27146 17946 4977 703 -4690 -2708 5676
9576E676q105o134n238N745M440P207r389l158J5715J5386m537P58k360p608N820
$$ 5676 -2429 -8563 -13801 -8056 -3616 3591 -5798 -8956 6759 22145 17608 18366 16006 8398 14218
9561A4218m861j7033l789M669J0199K572p159L099L956K415j0726o482j750J1051
$$ 14218 9357 -7676 -11465 -6796 3403 5975 -1184 1915 5871 8286 -2440 -8922 -10672 379
9547C79M921q311n076O152J2026o638o661j7453n240J2004J1313J7595j517J884
$$ 379 5300 -3011 -8087 -1935 10091 3453 -3208 -20661 -25901 -13897 -2584 15011 13494 15378
9533A5378l994R3J4227k91j0978o608j7668p264n373M062J800J7057K814p798
$$ 15378 11384 11477 25704 25413 14435 7827 -9841 -17105 -22478 -18416 -16616 441 3255 -4543
9519d543r781m015J0358J7113j1993n471l211m250n932K0512L445q653j119O976
$$ -4543 -14324 -18339 -7981 9132 -2861 -8332 -11543 -15793 -21725 -1213 2232 -6421 -7540 -564
9505e64o72q596k0334n181L3390J5263Q585O104k0514p560j745n549m209l329
$$ -564 -1236 -9832 -30166 -35347 -1957 13306 21891 27995 7481 -79 -1824 -7373 -11582 -14911
9491a4911P22J2995q58K089j3607j8676l194J2727J4043R090q978n406l747P282
$$ -14911 -14189 -1194 -2052 37 -13570 -32246 -35440 -22713 -8670 420 -8558 -13964 -17711 -10429
9477a0429N645o735l292K896l234J5106K828M102n946Q884K545o358Q120j44o336
$$ -10429 -4784 -11519 -14811 -11915 -15149 -43 2785 6887 941 9825 12370 6012 14132 13988 7652
9462G652n742Q143J0398Q493M550j7405j1956M792j217j491k945K240J292O30
$$ 7652 1910 10053 20451 28944 33494 16089 4133 8925 7708 6217 3272 5512 6804 7434
9448G434N031L95j5417l466o07R740k073P833P805m824q478K729P160j8117m968
$$ 7434 12465 12860 -2557 -6023 -6630 3110 1037 8870 16675 11851 3373 6102 13262 -4855 -9823
9433i823J5672L019o136Q23r134l430n022r244R992J4444J2227P722n631k0176
$$ -9823 5849 8868 2732 3555 -5579 -9009 -14031 -23275 -13283 1161 13388 21110 15479 -4697
9419d697M320J0968L474k07q311J1698M013o111j2135q330r79k346o5J2833L303
$$ -4697 -377 10591 14065 13858 5547 17245 21258 15147 3012 -5318 -6297 -8643 -8708 4125 7428
9404G428L623J7143O719q636k2753j2439l76O102K044p289p332Q237P460L898
$$ 7428 11051 28194 34913 26277 3524 -8915 -9291 -3189 -1145 -8434 -15766 -7529 -69 3829
9390C829n607J5192J856L922p153j118j7659R10J6585J2601q497j8198q071N230
$$ 3829 -1778 13414 15270 19192 12039 10921 -6738 -5828 10757 23358 14861 -3337 -11408 -6178
9376f178j132J120O721m110O973r532k708Q638J1074O276j446j0678m439j434
$$ -6178 -7310 -6190 531 -3579 3394 -6138 -8846 -208 10866 17142 15696 5018 579 -855
9362h55m387j436K434L16M990J2613k58K900j0974j319K116P330L824l941J033
$$ -855 -5242 -6678 -4244 -3928 1062 13675 13417 16317 5343 4024 6140 13470 17294 13353 14386
9347A4386l683O443j796j1844N365o03n420l174k811l9l954m448R78Q535q882
$$ 14386 10703 17146 15350 3506 8871 8268 2848 -326 -3137 -3176 -7130 -11578 -10600 -2065 -10947
9332a0947j1527O101Q658j79P587J7892q282k9879j7855J6692J5947n129K375
$$ -10947 -22474 -16373 -7715 -7894 -307 17585 9303 -20576 -38431 -21739 -5792 -10921 -8546
9319h546J3075j628P01j567r702Q024n364r415j799K590n027p980n836K8378K0203
$$ -8546 4529 2901 3602 2035 -7667 357 -5007 -14422 -16221 -13631 -18658 -26638 -32474 -4096 16107
9304A6107j002o630r529j6969R55J996k261k39J2045N517j7381j3729Q868N575
$$ 16107 15105 8475 -1054 -18023 -17068 -15072 -17333 -17572 -5527 -10 -17391 -31120 -22252 -16677
9290a6677L962N846R613n218j8732j74Q749J1356J0305p464R79J3041M055o772
$$ -16677 -12715 -6869 2744 -2474 -21206 -21380 -12631 -1275 9030 1566 2545 15586 19641 12869
9276A2869l956n188J1227K655j0788n852R107j049j1855J1550q523q023J5033
$$ 12869 8913 3725 14952 17607 6819 967 10074 9025 -2830 8720 197 -7826 7207
9263G207J5398k161L027j6726K650L523k17j040j496J7755J1153j2092j3696k4646
$$ 7207 22605 20444 23471 6745 9395 12918 12701 11661 10165 27920 39073 26981 13285 -11361
9249a1361r741P961O312M345r502O260k359j467J2418R710Q216j3818N530K2527
$$ -11361 -21102 -13141 -6829 -2484 -11986 -5726 -8085 -9552 2866 12576 20792 6974 12504 35031
9235C5031O909J762o888k385R86p185j4281o683j020o783K4730M133j5064P469
$$ 35031 41940 43702 36814 34429 35415 28230 13949 7266 6246 -537 24193 28326 13262 20731
9221B0731M056q216L298o153L81J700R405J1368r420k1604O217n97j7174R125
$$ 20731 24787 16571 19869 13716 14097 15797 25202 36570 27150 5546 11763 11166 -6008 3117
9207C117J1286m857r413N717j2068k389N891P295P651k280m771o974j841o042
$$ 3117 14403 9546 133 5850 -6218 -8607 -2716 4579 12230 9950 5179 -1795 -3636 -9678
9193i678k809K421J377L586N444J1840Q014n55r757Q441J94l900Q550K414j5774
$$ -9678 -12487 -10066 -8689 -5103 341 12181 20195 19640 9883 18324 18518 14618 23168 25582 9808
9178I808O830O129O140o837j1627p890k348J9157J3700L871q665L457J2086n421
$$ 9808 16638 22767 28907 22070 10443 2553 205 19362 33062 36933 28268 31725 43811 38390
9164C8390r135q212n920m648k030K088J3433J2127j7500j4715P166J0031r79K62
$$ 38390 29255 21043 15123 10475 8445 10533 23966 36093 18593 3878 11044 21075 20096 20358
9150B0358M630N260k283l471J2298J4577J1802J5151Q073L114l367l743J285q151
$$ 20358 24988 30248 27965 24494 36792 51369 63171 78322 86395 89509 86142 82399 83684 75533
9136G5533J1570J9279J3475J4774K3204K5763L7998M4410O4707P7211R5056J37466
$$ 75533 87103 106382 119857 134631 157835 183598 221596 266006 330713 407924 502980 640446
9124F40446K13619L52284O25416J206489K087794K516439J370636o19817j701821
$$ 640446 854065 1206349 1831765 3038254 5126048 7642487 9013123 8393306 6691485
9115F691485j959266j613463j002911n61971l40262k26350j85103j38103j12658
$$ 6691485 4732219 3118756 2115845 1553874 1213612 987262 802159 664056 551398
9106E51398j10648p9760l8904m3689l8010k0487k9242k9315j3325j6901j0116
$$ 551398 440750 360990 322086 278397 240387 219900 190658 161343 148018 131117 121001
9095A21001k3789M204l196j8195j9797q973J2274J268k4451r673j23J2929P59
$$ 121001 97212 101416 98220 80025 60228 51255 63529 64797 40346 30673 30550 43479 44238
9082D4238j907j8307o711j83j004P34l122M304p461j6974J0959J1757Q966J1720
$$ 44238 42331 24024 17313 17130 16126 16860 13738 18042 10581 -6393 4566 16323 25289 37009
9068C7009o778j0994k392j154N089L642R204N428r125j4409Q482r470k3549Q595
$$ 37009 30231 19237 16845 15691 20780 24422 33626 39054 29929 15520 24002 14532 -9017 -422
9054d22J2018J3215N052M865M242j0726j8557n653q355k041p278J3202n77L121
$$ -422 11596 24811 29863 34728 38970 28244 9687 4034 -4321 -6362 -13640 -438 -1015 2106
9040B106J4474k36o669j88M915m169n711o746M138K5111J268j0889M985l426m367
$$ 2106 16580 16344 9675 9487 14402 10233 4522 -2224 1914 27025 28293 17404 22389 18963 14596
9025A4596K842r554l823K889J1021r643O483K97P135j2195m287J206J550j6761
$$ 14596 17438 7884 4061 6950 17971 8328 14811 15108 22243 10048 5761 6967 8517 -8244
9011h244O684J4086L687j900N982J00j7312j0561j0007J2235J3211L192k059l556
$$ -8244 -1560 12526 16213 14313 20295 20395 3083 -7478 -17485 -5250 7961 11153 9094 5538
8997E538J7060M952m572m666K355j138L480k659k436r124j5027p950l116J0962
$$ 5538 22598 27550 22978 18312 20667 19529 23009 20350 17914 8790 -6237 -14187 -17303 -6341
8983f341J2904J02q680L428N597M157R899M121j2813o427r385l534l511m071J0758
$$ -6341 6563 6665 -2015 1413 7010 11167 21066 25187 12374 5947 -3438 -6972 -10483 -14554 -3796
8968c796N324j0621n230R066o893m065Q427j954q203N140l742J5813J0898o924
$$ -3796 1528 -9093 -14323 -5257 -12150 -16215 -7788 -9742 -17945 -12805 -16547 -734 10164 3240
8954C240r331j959J245R896O389l368N563R040j981m483j104O426K388j2483j3987
$$ 3240 -6091 -8050 -6805 3091 9480 6112 11675 20715 18734 14251 13147 19573 21961 9478 -4509
8939d509n956qR245p116k876J108n538J6707L470k0761J591M540J1003J7565O490
$$ -4509 -10465 -10473 -1228 -8344 -11220 -10112 -15650 1057 4527 -16234 -14643 -10103 900 18465 24955
8924B4955j975o191j6613n372o265l027K488L984L710j0721j2J965J1996J646
$$ 24955 22980 16789 176 -5196 -11461 -14488 -12000 -8016 -4306 -15027 -15039 -13074 -1078 568
8910E68J430l578M115J7258K5j7137k26l886k955R883R973m552j4915J4043N099
$$ 568 1998 -1580 2535 19793 19818 2681 2455 -1431 -4386 5497 15470 10918 -3997 10046 15145
8895A5145k684K459k603j3523J0301N478R24n616n891J2271j3099q626o357L918
$$ 15145 12461 14920 12317 -1206 9095 14573 15497 9881 3990 16261 3162 -5464 -11821 -7903
8881g903P452K3242M138j0961L083M341K306k110m919l431j1163k3275R376Q323
$$ -7903 -451 22791 26929 15968 19051 23392 25698 23588 18669 15238 4075 -19200 -9824 -1501
8867a501k27K77Q959o71O082R87P993k42j0585J0255j4489q485J444J0455K773
$$ -1501 -1728 -1451 7508 6837 12919 13906 21899 21657 11072 21327 6838 -1647 -203 10252 13025
8852A3025J0917J2578P924l086j5460j555p482j2245M888j2623K687O373J0708
$$ 13025 23942 36520 44444 41358 25898 24343 16861 4616 9504 -3119 -432 5941 16649
8839A6649j7551j5500Q444J2390n384M936Q484R936K417j0309j0091L598m71o443
$$ 16649 -902 -16402 -7958 4432 -952 3984 12468 22404 24821 14512 4421 8019 7548 1105
8825A105R944o037j0851n018J033J2124J7201N393P010j718q476j6014k6179O148
$$ 1105 11049 5012 -5839 -10857 -9824 2300 19501 24894 31904 30186 21710 5696 -20483 -14335
8811a4335Q818J8907J3994j118r131j5026l204L123K601K113J740M899r51j5595
$$ -14335 -5517 13390 27384 26266 17135 2109 -1095 2028 4629 6742 8482 13381 12430 -3165
8797c165n276Q421J1746Q595q045l238p5o619j8583L870N859J1213K1880L874
$$ -3165 -8441 -20 11726 20321 12276 9038 8963 2344 -16239 -12369 -6510 4703 26583 30457
8783C0457l827j9513L650Q262q233j6593m551M097j019N625Q187P924J4257O918
$$ 30457 26630 7117 10767 19029 10796 -5797 -10348 -6251 -7270 -1645 6542 14466 28723 35641
8769C5641k335j1555j4838j0059r510J0083K654Q523J673l954K308O489N196O174
$$ 35641 33306 21751 6913 -3146 -12656 -2573 81 8604 10277 6323 8631 15120 20316 26490
8755B6490J052n956o720j5328j29Q281k270O564J3160j3518p450N30p242J1209
$$ 26490 27542 21586 14866 -462 -591 7690 5420 11984 25144 11626 4176 4706 -2536 8673
8741H673J0607J2279q076q251j988Q59j51o524J0327J7157p897j1303p810p286
$$ 8673 19280 31559 23483 15232 13244 14103 13952 7428 17755 34912 27015 15712 7902 616
8727F16J085N469P791J1468o018o859L927k011J782O070l488o932n39P063j93
$$ 616 1701 7170 14961 26429 20411 13552 17479 15468 17250 23320 19832 12900 12361 19424 19231
8712A9231L395K749p167j2302r090N82J4187J109k537l700K633L778Q85J3595
$$ 19231 22626 25375 18208 5906 -3184 -2602 11585 12694 10157 6457 9090 12868 13753 27348
8698B7348K283j060m029p869j1970L671Q123J1731P92o151l963p628n147l351
$$ 27348 29631 28571 24542 16673 4703 8374 16497 28228 29020 22869 18906 11278 6131 2780
8684B780J2818L012j0012j0688K647J3240O669J5932R483j1848j0875O183J0338
$$ 2780 15598 18610 8598 -2090 557 13797 20466 36398 45881 34033 23158 29341 39679
8671C9679r591k28N828J533K362P336r167k1427n703q25j4065O95J1757M801m91
$$ 39679 30088 29860 35688 37221 39583 46919 37752 16325 10622 9797 -4268 -3573 8184 12985 12494
8656A2494J2632J886j3237r720O343Q918L424j631j258J5419J0109r699j69Q113
$$ 12494 25126 27012 13775 4055 10398 19316 22740 21109 19851 35270 45379 35680 35511 43624
8642D3624k110j442Q506p051p565R909o73j2220j9825K786P184l496j19Q640O733
$$ 43624 41514 40072 48578 41527 33962 43871 43198 30978 11153 13939 21123 17627 17508 26148 32881
8627C2881j550l643k389k512L641n627P232O14J51O781k326J0767J7580l792o032
$$ 32881 31331 27688 25299 22787 26428 20801 28033 28647 28798 35579 33253 44020 61600 57808 51776
8612E1776K297Q812l69j4500P848K0590K0495R615K999Q348J6166m291N277J7694
$$ 51776 54073 62885 62516 48016 55864 76454 96949 106564 109563 117911 134077 129786 135063 152757
8598A52757J4103J2093J2017J3894M729J849J4720J5260Q921K8995K5450M0497
$$ 152757 166860 178953 190970 204864 209593 211442 226162 241422 250343 279338 304788 345285
8586C45285J9518P24P836n036j5835m5936n1580l4696l3347k9203k4279j0122
$$ 345285 364803 365527 373363 368327 352492 306556 254976 220280 186933 157730 133451 123329
8574A23329j3415J511q919k4686J808l46J599o455l025l777r005j0180K798J501
$$ 123329 109914 111425 102506 77820 79628 79282 80881 74426 71401 67624 58619 48439 51237 52738
8560E2738p350N384m008j4797m215Q177J1495j2631j7624J3136J7053L313l219
$$ 52738 45388 50772 46764 31967 27752 35929 47424 34793 17169 30305 47358 50671 47452
8547D7452r002k0689q833J1564K761j1821n219N571L11J7461N567J5784J2486
$$ 47452 38450 17761 8928 20492 23253 11432 6213 11784 12095 29556 35123 50907 63393
8534F3393k227j0849P056o531K634j7477j5551J195o109L537n853K617O418J864
$$ 63393 61166 50317 57373 50842 53476 35999 20448 21643 15534 19071 13218 15835 22253 24117
8520B4117l148j496k879j1387K372N249m405j3833n212J0869N707Q022J5094N792
$$ 24117 20969 19473 16594 5207 7579 12828 8423 -5410 -10622 247 5954 13976 29070 34862
8506C4862n268j6288r306o655N868L330p095J0337J2024R348k385p682n586R242
$$ 34862 29594 13306 4000 -2655 3213 6543 -552 9785 21809 31157 28772 21090 15504 24746
8492B4746J2267P095Q310j3004j1465k909k961P436N930m406o897P16l666n767
$$ 24746 37013 44108 52418 39414 27949 25040 22079 29515 35445 31039 24142 24858 21192 15425
8478A5425K974r292m7O447l31O215O000J0906n926j5581O109J908j0577L77l34
$$ 15425 18399 9107 9060 15507 15176 21391 27391 38297 32371 16790 22899 24807 14230 14607 14273
8463A4273J5785P204p550n156K507j733o786m156J1911m543j0207k8708p948Q180
$$ 14273 30058 37262 29712 24556 27063 25330 18544 14388 26299 21756 11549 -17159 -25107 -16927
8449a6927K934Q947J4888J748k49J8196p27o140P633J479k0872r184N331K126
$$ -16927 -13993 -5046 9842 11590 11341 29537 28810 22670 30303 31782 10910 1726 7057 9183
8435I183n144J1855J6847n850L992l231K275m390p351r447k709J0335J458p335
$$ 9183 4039 15894 32741 26891 30883 27652 29927 25537 18186 8739 6030 16365 17823 10488
8421A0488O093k828N279J8214j690k65q622o302K976l40J102R63j731j2778j4680
$$ 10488 16581 13753 19032 37246 35556 35291 26669 20367 23343 23003 24105 25068 23337 10559 -4121
8406d121M389Q507K0266J4411j0112j5310j892j154J6527P277k327k2005M143
$$ -4121 268 8775 29041 43452 33340 18030 16138 14984 31511 38788 36461 14456 18599
8393A8599j0057m577k1978j0675J1237J7927Q471J0590O830M116m686p420j2174
$$ 18599 8542 3965 -18013 -28688 -17451 476 8947 19537 26367 30483 25797 18377 6203
8380F203n965J907j0995j4933n467p66J6206J4445J650K545R098r333j3488J4097
$$ 6203 238 2145 -8850 -23783 -29250 -30016 -13810 635 2285 4830 13928 4595 -8893 5204
8366E204L680q498J3215q061O583q135M463L109k0330j3477J7078m071L299K875
$$ 5204 8884 386 13601 5540 12123 3988 8451 11560 -8770 -22247 -5169 -9240 -5941 -3066
8352c066J7017N456m702M458j0458k87J0635K782M695k2291j4386J3616K2216
$$ -3066 13951 19407 14705 19163 8705 8418 19053 21835 26530 4239 -10147 3469 25685
8339B5685R24j648P810j5159j5179q576Q326j189M378J928Q05l655K889L446l652
$$ 25685 26609 24961 32771 17612 2433 -6143 2183 994 5372 7300 8105 4450 7339 10785 7133
8324G133J6044J2136m808j2820m406q935L051n317q43k702m152k542j0761l04
$$ 7133 23177 35313 30505 17685 13279 4344 7395 2078 1235 -1467 -5619 -8161 -18922 -19226
8310a9226J344j706J2725k882k730J953L15J3652P36j910l34J0253J911J1157
$$ -19226 -17882 -19588 -6863 -9745 -12475 -10522 -10207 3445 4181 2271 1937 12190 14101 25258
8296B5258L287q221m810j7436N341P786j098r44j9239M015J0733j500L702Q236
$$ 25258 28545 20324 15514 -1922 3419 11205 10107 9163 -10076 -6061 4672 3172 6874 15110
8282A5110k527r526N79R416K416n889p258n637j728n006J0382R938j3457o753
$$ 15110 12583 3057 3636 13052 15468 9579 2321 -3316 -5044 -10050 332 10270 -3187 -9940
8268i940N844J4466K007j3970p341R475J1582L974o210m792N526n320M79m989
$$ -9940 -4096 10370 12377 -1593 -8934 541 12123 16097 9887 5095 10621 5301 5780 791
8254G91p093J1679J586N424r225j533n909M976J1297N987p647R21o276J22k04
$$ 791 -6302 5377 6963 12387 3162 1629 -4280 696 11993 17980 10333 11254 4978 5100 4896
8239D896Q072N487p835N24J4664N172R556j1813j5923p81q312o431k711J3575
$$ 4896 12968 18455 10620 11144 25808 30980 40536 28723 12800 12019 3707 -2724 -5435 8140
8225H140k298j206J7689J1069j66j0096j589k389q73m463m960p827p500p934j827
$$ 8140 5842 4636 22325 33394 33228 23132 21543 19154 18281 13818 8858 1031 -6469 -14403 -16230
8210a6230J7279K6840n89j4271j1358l071N417K575L993j2934k758J829J0617
$$ -16230 1049 27889 27300 13029 1671 -1400 4017 6592 10585 -2349 -5107 -3278 7339
8197G339K281R162N042M045q886n238J601m118j8706o89K570j30m983J3089Q978
$$ 7339 9620 18782 23824 27869 18983 13745 15346 11228 -7478 -8167 -5597 -5727 -10710 2379 11357
8182A1357K531j5056j2308l18J2758J038R79p391m644r071k116M199P062J5358
$$ 11357 13888 -1168 -13476 -13794 -1036 2 981 -6410 -11054 -20125 -22241 -18042 -10980 4378
8168D378M372n326M108L156K81j626j7838Q707j3139L834J5865k0685r164L201
$$ 4378 8750 3424 7532 10688 10969 9343 -8495 212 -12927 -9093 6772 -13913 -23077 -19876
8154a9876N613J117J3663J2478K158p917r251q460J1980R133k698M091J2202m564
$$ -19876 -14263 -13146 517 12995 15153 7236 -2015 -10475 1505 10638 7940 12031 24233 19669
8140A9669k0895R84N2j295m891m257r7J0568P675j163r86j6688q302M843J6515
$$ 19669 -1226 -242 -190 -1485 -6376 -10633 -10730 -162 7513 6350 5364 -11324 -19626 -14783 1732
8125A732Q859j3547p366K30J6897J8986L042r613J70k883n090K927k628j6000
$$ 1732 10591 -2956 -10322 -10092 6805 25791 28833 19220 19390 16507 11417 14344 11716 -4284
8111d284j4827M03J3114L660J0008J301j1881L446J5739j114j2163q116P653J5450
$$ -4284 -19111 -18708 -5594 -1934 8074 9375 -2506 940 16679 15565 3402 -4714 2939 18389
8097A8389Q621q318j2225j2409k149k995P544O279J5870M743M224L872j458L76
$$ 18389 27010 18692 6467 -5942 -8091 -11086 -3542 2737 18607 23350 27574 31446 29988 30364
8083C0364O913o615p270k0669r077J0637J5052J1361j836j0267j2077n647J1854
$$ 30364 37277 30662 23392 2723 -6354 4283 19335 30696 28860 18593 6516 869 12723
8070A2723k337j3165J664N185N548R149m565J3157K216n558r292n163Q379j523
$$ 12723 10386 -2779 -1115 4070 9618 18767 14202 27359 29575 24017 14725 9562 17941 16418
8056A6418N169j0930j5966r027m46J4565K1443J0878M224J746k235j489K700n525
$$ 16418 21587 10657 -5309 -14336 -14782 -217 21226 32104 36328 38074 35839 34350 37050 31525
8042C1525K733n223j4557L502R608J4566p822l919M085j0908j3265l901J9188
$$ 31525 34258 29035 14478 17980 27588 42154 34332 30413 34498 23590 10325 6424 25612
8029B5612J752j1867n010J3437J7871K4k2185k952q93N104M592o642k256J587
$$ 25612 27364 15497 10487 23924 41795 41819 19634 16682 15789 20893 25485 18843 16587 18174
8015A8174j4390j0881O941K0799Q300j3571j0187Q350J5383J6204P272q043j932
$$ 18174 3784 -7097 -156 20643 28943 15372 5185 13535 28918 45122 52394 44351 42419
8002D2419R697L491o163J119m439L296R291J644n332l756j1331J0541n421j8185
$$ 42419 52116 55607 49444 50563 46124 49420 58711 60355 55023 51267 39936 50477 45056 26871
7988B6871n811J6213K3080J959k0466Q67O093o829o055q7J1078j750K052j3021
$$ 26871 21060 37273 60353 62312 41846 42713 48806 41977 35922 35835 46913 45163 47215 34194
7974C4194j6964P770J701M853M387K407K819J4129J4162p936k3190O744J0967
$$ 34194 17230 25000 26701 31554 35941 38348 41167 55296 69458 61522 38332 45076 56043
7961E6043M458j5620j2380N88q798K936J4791K2623R454j7357r957L62r32q682
$$ 56043 60501 44881 32501 33089 24291 27227 42018 64641 74095 56738 46781 47143 46211 37529
7947C7529M31Q162J1485o231p125K148M037l13j5886k1222p174J2096M995p90
$$ 37529 37960 46122 57607 51376 44251 46399 50436 50123 34237 13015 5841 17937 22932 22142
7933B2142K899L708r972k068k875Q222J490j4458k0868Q330Q995l330J0027J4240
$$ 22142 25041 28749 18777 16709 13834 22056 23546 9088 -11780 -3450 5545 2215 12242 26482
7919B6482j2392P17k108l102J6684J4950n250j947o046N910o753k2486p85P825
$$ 26482 14090 14807 12699 9597 26281 41231 35981 34034 27988 33898 27145 4659 3874 11699
7905A1699J3750n84o549r788q362k441p185l568Q630L125R028Q186N779K639r316
$$ 11699 25449 24865 18316 8528 166 -2275 -9460 -13028 -4398 -1273 7755 15941 21720 24359 15043
7890A5043j7419J3J9252M794m279j194J1875l954j5263j1658K299J8944K970L609
$$ 15043 -2376 -2363 16889 21683 17404 16210 28085 24131 8868 -2790 -491 18453 21423 25032
7876B5032j3380R15M774k634Q054P482Q229K366j6174j2276j253J2941k58O661
$$ 25032 11652 12567 17341 14707 22761 30243 38472 40838 24664 12388 11135 24076 23818 30479
7862C0479L787n064n377M016J887L997q607k1341n759P105M028J180j667K183
$$ 30479 34266 29202 23825 27841 29728 33725 25118 3777 -1982 5123 9151 10331 8664 10847
7848A0847J2839l567l757j0795j0853p122K258j33k077R997j804N29k361Q365
$$ 10847 23686 20119 16362 5567 -5286 -12408 -10150 -10283 -12360 -2363 -4167 -3638 -5999 2366
7834B366L322N488j0066p387N0N205O16L578j4369J492J87J52l511j346K0819
$$ 2366 5688 11176 1110 -6277 -6227 -1022 -406 3172 -11197 -9705 -9518 -9366 -12877 -14223 6596
7819F596l671j4900R894L267L199q241O224J2015Q577m418o070j4890j571M917
$$ 6596 2925 -11975 -2081 1186 4385 -3856 2368 14383 22960 18542 12472 -2418 -3989 928
7805I28N441L246o14K576j0565l009k494Q348R296l675j2064o468J426m489j673
$$ 928 6369 9615 9001 11577 1012 -1997 -4491 3857 13153 9478 -2586 -9054 -7628 -12117 -13790
7790a3790p936k109P757O532M611j219M828M052N330Q365K196n601l589J13K108
$$ -13790 -21726 -23835 -16078 -9546 -4935 -6154 -1326 2726 8056 16421 18617 13016 9427 9540 11648
7775A1648R141o697j3440l015J176J0866L213N163l508j2222j698J7529O567j1039
$$ 11648 20789 14092 652 -2363 -1187 9679 12892 18055 14547 2325 627 18156 24723 13684
7761A3684j180j757j2809j353L797o071K576p785K646L561O034j3131n902O156
$$ 13684 12504 10747 -2062 -3415 382 -5689 -3113 -10898 -8252 -4691 1343 -11788 -17690 -11534
7747a1534J3988J0987j0573l070l459M992j5872n682K5468N932p673j6892j463
$$ -11534 2454 13441 2868 -202 -3661 1331 -14541 -20223 5245 11177 3504 -13388 -14851
7734a4851L595o717j1074K1231J3088N668j2617P190L680q31O935K97q827p362
$$ -14851 -11256 -17973 -29047 -7816 5272 10940 -1677 5513 9193 8362 15297 15594 6767 -595
7720e95j051L259k918J076N84J0203k623R176L068M555k6633m498J698p105j0076
$$ -595 -1646 1613 -1305 -229 355 10558 7935 17111 20179 24734 -1899 -6397 -4699 -11804 -21880
7705b1880J0809J2466J8647K616j7082m792K493q012l730m959L226L710k424J605
$$ -21880 -11071 1395 20042 22658 5576 784 3277 -4735 -8465 -13424 -10198 -6488 -8912 -7307
7691g307k605n879M872n852N738k796K975l386M378M490j406p446P470J3127N66
$$ -7307 -9912 -15791 -10919 -16771 -11033 -13829 -10854 -14240 -9862 -5372 -6778 -14224 -6754 6373 6939
7676F939O365p2q716j664J763k626P854q746o627J772j234r418K654K399O961
$$ 6939 13304 13232 4516 2852 4615 1989 9843 1097 -5530 -3758 -4992 -14410 -11756 -9357 -2396
7661b396j3727o818N358N895k452k667K3735n419n939M032k632j0753q673Q082
$$ -2396 -16123 -22941 -17583 -11688 -14140 -16807 6928 1509 -4430 -398 -3030 -13783 -22456 -14374
7647a4374j28K747j3549J5206R920j696m798K481J7066m084q075l724q17O349
$$ -14374 -14502 -11755 -25304 -10098 -178 -1874 -6672 -4191 12875 8791 716 -3008 -3825 2524
7633B524j864L379j073R433J3701m146q112r223O558J3r240j0554j3629l458M895
$$ 2524 660 4039 2966 12399 26100 21954 13842 4619 11177 11190 1950 -8604 -22233 -25691 -20796
7618b0796r5R727P049M904R079J026j5760j0534r407M168R253N861j0778P803
$$ -20796 -20891 -11164 -4115 789 9868 10894 -4866 -15400 -24807 -20639 -11386 -5525 -16303 -8500
7604h500j520j0895k875o99R398N111n696Q533Q818M389J060k668k993j0520n615
$$ -8500 -10020 -20915 -23790 -24489 -15091 -9980 -15676 -7143 1675 6064 7124 4456 1463 -9057 -14672
7589a4672P743N035O745J21J631j6638j3474P673J5061K509K743o419j2012M781
$$ -14672 -6929 -1894 4851 4972 6603 -10035 -23509 -15836 -775 1734 4477 -1942 -13954 -9173
7575i173J3891N902p70k32O488J524j4190j236O428n189K390J1912m281l456Q84
$$ -9173 4718 10620 9850 9618 16106 17630 3440 2204 8632 3443 5833 17745 13464 10008 10892
7560A0892o892j3107N102K2503q387q992r320O181N430L527J1383k476j3734m298
$$ 10892 4000 -9107 -4005 18498 10111 1119 -8201 -2020 3410 6937 18320 15844 2110 -2188
7546b188L272P26j6220r872J4381L694L591o073k877K892O169J6315n11j3847
$$ -2188 1084 1810 -14410 -24282 -9901 -6207 -2616 -8689 -11566 -8674 -2505 13810 13299 -548
7532e48n368M290l017O972j146k2642N251M848p375j719M970N560J0367M607J6
$$ -548 -5916 -1626 -4643 2329 1183 -21459 -16208 -11360 -18735 -20454 -15484 -9924 443 5050 5066
7517E066N51l670K245k457J0100j37k4059N312J0117m464q93J931J7524J0977
$$ 5066 5617 1947 4192 1735 11835 11698 -12361 -7049 3068 -1396 -2289 -358 17166 28143
7503B8143p005l3637j2095J0746Q075J0283Q061n518N540j365k1112j8027J7705
$$ 28143 21138 -12499 -24594 -13848 -5773 4510 12571 7053 12593 11228 -9884 -27911 -10206
7490a0206Q942j5549j4339J4695M165O471p084l995j4959K236n29M82j571M85
$$ -10206 -1264 -16813 -31152 -16457 -12292 -5821 -12905 -16900 -31859 -29623 -30152 -29670 -31241 -30756
7476c0756J1802J69j2590O771Q772M135J5433o866p226K634n475j0017r895N580
$$ -30756 -18954 -18785 -31375 -24604 -15832 -11697 3736 -3130 -10356 -7722 -13197 -23214 -33109 -27529
7462b7529Q517l759Q710K2071k994r857J1171j1244j5224Q778j129j941o6M192
$$ -27529 -19012 -22771 -14061 8010 5016 -4841 6330 -4914 -20138 -11360 -12489 -14430 -14496 -10304
7448a0304j2555j5473J3345O512R531R317r794j0955m979P805J5189m529j093
$$ -10304 -22859 -38332 -24987 -18475 -8944 373 -9421 -20376 -25355 -17550 -2361 -6890 -7983
7435g983J2211j0155m436O299J9520J4495Q16p029j9916r244m559J172r123J4221
$$ -7983 4228 -5927 -10363 -4064 15456 29951 30767 23738 3822 -5422 -9981 -8809 -17932 -3711
7421c711J2345k838k95j9077m058N692P399j771N460O684M779j0308p793J5521
$$ -3711 8634 5796 5501 -13576 -17634 -11942 -4543 -6314 -854 5830 10609 301 -7492 8029
7407H029L197m753o102L302l048j6392J43J1196q68k1383p183J1381J0354N549
$$ 8029 11226 6473 371 3673 625 -15767 -15624 -4428 -5296 -26679 -33862 -22481 -12127 -6578
7393f578l825j2189J77l997J0562J8373O98j4675j188K2482J085L568j5678r626
$$ -6578 -10403 -22592 -22415 -26412 -15850 2523 3221 -11454 -12642 9840 10925 14493 -1185 -10811
7379a0811Q834K2099J0755p320j5799J701j932k0185q449L097n928m428q409j0685
$$ -10811 -1977 20122 30877 23557 7758 9459 7527 -12658 -21107 -18010 -23938 -28366 -36775 -47460
7365d7460j2059J2837J3075P452n287M825K2026O220j135j0344l792K7206N294
$$ -47460 -59519 -46682 -33607 -26155 -31442 -26617 -4591 1629 494 -9850 -13642 13564 18858
7352A8858m041j090j2930n636K827M90m248j1824j4338Q52J3608J0690k148O703
$$ 18858 14817 13727 797 -4839 -2012 -1522 -5770 -17594 -31932 -31080 -17472 -6782 -8930 -2227
7338b227M858j2382m844n205P285Q7j2101P557O613P682R902L225j4580n496O538
$$ -2227 2631 -9751 -14595 -19800 -12515 -12428 -24529 -16972 -10359 -2677 7225 10450 -4130 -9626 -3088
7323c088j3912q457R76q072m506N076L414J940N597k81M881J4434J43o058n181
$$ -3088 -17000 -25457 -24481 -32553 -37059 -31983 -28569 -26629 -21032 -21313 -16432 -1998 -1855 -7913 -13094
7308a3094M9J1148k613m673L414P115r347p870k582L368L370q03J40m279n20J1312
$$ -13094 -13045 -1897 -4510 -9183 -5769 1346 -8001 -15871 -18453 -15085 -11715 -12518 -12378 -16657 -17177 -5865
7292e865J4781Q289q324j0139L203p158k573P949q930J491r89O471n253n074O277
$$ -5865 8916 17205 8881 -1258 1945 -5213 -7786 163 -8767 -7276 -8265 -1794 -7047 -12121 -5844
7277e844K1329J340J526O266n009j1552j4700n112Q757m471M783Q39R637m275
$$ -5844 15485 16825 18351 24617 19608 8056 -6644 -11756 -2999 -7470 -2687 -1848 7789 3514
7263C514j2247J154R284K800k778j1745Q76N844j664j2502R480l950j2932k508
$$ 3514 -8733 -7579 1705 4505 1727 -10018 -9142 -3298 -4962 -17464 -7984 -11934 -24866 -27374
7249b7374J0453P289p300p379K342M835O428K150J4261r27n619J555M795J276
$$ -27374 -16921 -9632 -16932 -24311 -21969 -17134 -10706 -8556 5705 4778 -841 714 5509 6785
7235F785n27m727J2723J3716N740k326p148j8870k2492R83K351k642m671J1550
$$ 6785 6258 1531 14254 27970 33710 31384 24236 5366 -17126 -16143 -13792 -16434 -21105 -9555
7221i555o751n914p087K570M585L122n16Q263J3772n166n451O122L362M188M762
$$ -9555 -16306 -22220 -29307 -26737 -22152 -19030 -19546 -11283 2489 -2677 -8128 -2006 1356 5544 10306
7206A0306J966l937j9374j2382r164K057Q59O909J7186j570J878p280q87o315
$$ 10306 12272 8335 -11039 -23421 -32585 -30528 -29669 -22760 -5574 -7144 -5266 -12546 -13433 -19748
7192a9748O353q62q87k802q386L65J2662k186J194q106j7702J369J5519J6332
$$ -19748 -13395 -14257 -15144 -17946 -26332 -25967 -13305 -15491 -14297 -22403 -40105 -38736 -23217 -6885
7178f885n757m799m513P301R995J786O629j317l175q074R049N79j0622k532J0005
$$ -6885 -12642 -17441 -21954 -14653 -4658 -2872 3757 2440 -735 -8809 240 819 -9803 -12335 -2330
7163b330o346r502L587R721n68o90j5572j0536J7522J0263l849k789m004Q134
$$ -2330 -8676 -18178 -14591 -4870 -5438 -6128 -21700 -32236 -14714 -4451 -8300 -11089 -15093 -6959
7149f959l220n384j824J0892J0206j0877j4497Q050J257Q66r948Q773J5522J2105
$$ -6959 -10179 -15563 -17387 -6495 3711 -7166 -21663 -13613 -12356 -11490 -21438 -12665 2857 14962
7135A4962j0415j4668p68J1003M050J182M204P248n184l212N032o905J824j785
$$ 14962 4547 -10121 -10889 114 4164 5346 9550 16798 11614 8402 13434 6529 8353 6568
7121F568K083J2629N174p703j3577m891J0833K641j146l604n846Q87p512K372
$$ 6568 8651 21280 26454 18751 5174 283 11116 13757 12611 9007 3161 4048 -3464 -1092
7107a092m288J633L232J6396P718j1906k4024j1093j834N96J2291N406o892M132
$$ -1092 -5380 -3747 -515 15881 23599 11693 -12331 -23424 -25258 -24662 -12371 -6965 -13857 -9725
7093i725M706p943J5M37j3422p087j8423P425J4827K2455J6015O761r136j2328
$$ -9725 -5019 -12962 -12947 -12510 -25932 -33019 -51442 -44017 -29190 -6735 9280 16041 6905 -5423
7079e423L850q787j3033K655J3121J922r772J1640J1739J4238J653q506J917O369
$$ -5423 -1573 -10360 -23393 -20738 -7617 -5695 -15467 -3827 7912 22150 23803 15297 17214 23583
7065B3583O763j6349k1749K980J1044L44M26M238l024J643k453l369J7525o242
$$ 23583 30346 13997 -7752 -4772 6272 6616 7042 11280 8256 9899 7446 4077 21602 15360
7051A5360j3035j7246J25r761j3619o152O575Q121R801J3257n48K549K0247K202
$$ 15360 2325 -14921 -14796 -24557 -38176 -44328 -37753 -29632 -19831 -6574 -7122 -4573 15674 17876
7037A7876j9965r866P184J151l248O570k588K722M128p333o447j65M661M013Q8
$$ 17876 -2089 -11955 -4771 -3620 -6868 -298 -2886 -164 3964 -3369 -9816 -9981 -5320 -1307 -1219
7022a219R58O855R258m035j6012J174J5420m138j9331r884m24r943o298L448J7629
$$ -1219 -261 6594 15852 11817 -4195 -3021 12399 8261 -11070 -20954 -21378 -31321 -37619 -34171 -16542
7007a6542N948N971L689J2789J872j4219j1032k307J6880J0010O375O888j4182
$$ -16542 -10594 -4623 -934 11855 13727 -492 -11524 -13831 3049 13059 19434 26322 12140
6994A2140j9443Q193J2509n940K425j2306j0286R613j1110q606Q007J0084n328
$$ 12140 -7303 890 13399 7459 9884 -2422 -12708 -3095 -14205 -22811 -14804 -4720 -10048
6981a0048L689q861j2363r143P242J1082q85q410M750Q680R585J3394J0297J909
$$ -10048 -6359 -15220 -27583 -36726 -29484 -18402 -19287 -27697 -22947 -14267 -4682 8712 19009 20918
6967B0918j0108r666p744o240P334k061P091R967r834O100l010M183l593j4787
$$ 20918 10810 1144 -6600 -12840 -5506 -7567 -476 9491 -343 5757 2747 6930 3337 -11450
6953a1450P852l649j1547o478N29j621P026J945N177N301J9330n22j6852m079
$$ -11450 -3598 -7247 -18794 -25272 -24743 -26364 -19338 -17393 -12216 -6915 12415 11893 -4959 -9038
6939i038N273M710L37J3469j5871j4445j795K413J1175J2824m923n00M681o329
$$ -9038 -3765 945 1282 14751 -1120 -15565 -17360 -14947 -3772 9052 4129 3629 8310 1981
6925A981P840j0923k2385n206J5653J2669j192j027k890p338P93R301n116l141
$$ 1981 9821 -1102 -23487 -28693 -13040 -371 -1563 -2590 -5480 -12818 -12025 -2724 -7840 -10981
6911a0981j211O724J4049o0N95L007N883k92n765j3887j0953O547J5112m161m672
$$ -10981 -12192 -5468 8581 8521 9116 12123 18006 17714 11949 -1938 -12891 -6344 8768 4607 -65
6896f5j185N123r337p520j735J1571n944p786J7200J2685l337j0597r885j4334
$$ -65 -1250 3873 -5464 -12984 -14719 -3148 -9092 -16878 322 13007 9670 -927 -10812 -25146
6882b5146j213k339P890m910R394J9000L823j0484n535q30j3911Q501Q414M026
$$ -25146 -26359 -28698 -20808 -25718 -16324 2676 6499 -3985 -9520 -10350 -24261 -15760 -7346 -3320
6868c320n290Q999Q161j014k0096j2976O634n31L867Q647o493J3M078J912K430
$$ -3320 -8610 389 8550 7536 -12560 -25536 -18902 -19433 -15566 -6919 -13412 -13399 -9321 -7409 -4979
6853d979J1455n862k371l139n888m095l562J73K415J3583J0040L699o059r456
$$ -4979 6476 614 -1757 -4896 -10784 -14879 -18441 -18268 -15853 -2270 7770 11469 5410 -4046
6839d046k856k978K608M940j5159j9095Q082R433j267l119M895R408J8163Q429
$$ -4046 -6902 -9880 -7272 -2332 -17491 -36586 -28504 -19071 -20338 -23457 -18562 -9154 9009 17438
6825A7438n651j2756j6671J3943o867j739M612k0383o578L820J616J5502K02j1900
$$ 17438 11787 -969 -17640 -3697 -10564 -12303 -7691 -28074 -34652 -30832 -29216 -13714 -13512 -25412
6811b5412k07M768J0757Q700P96J2585M069k308j9062k5132j5151J0673M821M694
$$ -25412 -25619 -20851 -10094 -1394 -598 11987 16056 13748 -5314 -30446 -45597 -34924 -30103 -25409
6797b5409R260N675N654J5789P882j961N421j047k2649n334N745p29j758L54q191
$$ -25409 -16149 -10474 -4820 10969 18851 16890 22311 21264 -1385 -6719 -974 -1703 -3461 -3107 -11298
6782a1298j054J6306k790j1080j2087K589j097P467K5541J1434o586j0408j0635
$$ -11298 -12352 3954 1164 -9916 -22003 -19414 -20511 -13044 12497 23931 17345 6937 -3698
6769c698L072Q612M865n459q871M89J0331l183M828k770r022J98l223R918J61
$$ -3698 -626 7986 12851 7392 -1479 -990 9341 6158 10986 8216 -806 -608 -3831 6087 6248
6754F248j908J2335j648o370J021l389K585L851q07J0328r744q215m929N244J3201
$$ 6248 4340 16675 15027 8657 9678 6289 8874 12725 11918 22246 12502 4287 -642 4602 17803
6739A7803K94r773L865L200j917M985k763j0747M529p157j466O153R493N13l582
$$ 17803 18097 8324 12189 15389 13472 18457 15694 4947 9476 2319 853 7006 16499 17012 13430
6724A3430J36L813l24Q874O906K2760K6258L3754M7774O1383O7042L3804j6157
$$ 13430 13566 17379 17055 25929 32835 55595 81853 115607 163381 224764 291806 325610 309453
6711C09453n3598o6165n8849m7187j9407j3300j5695j668O156p13j9334l874O504
$$ 309453 255855 189690 130841 83654 64247 50947 35252 33584 39740 39027 19693 15819 22323
6698B2323J8124q63j0669j7791m509P358L835j0028m480J4394m653q79K983m887
$$ 22323 40447 39584 28915 11124 6615 13973 17808 7780 3300 17694 13041 12162 15145 10258
6684A0258o068J0193P344j2153q077K21n03r767L327J8034L915p109o281k632
$$ 10258 4190 14383 21727 9574 1497 1718 1215 -8552 -5225 12809 16724 9615 3334 702
6670G02L224J7259o44l482j6901n705J2240M716j1410O945J6144J1502j6652j4913
$$ 702 3926 21185 20541 17059 158 -5547 6693 11409 -1 6944 23088 34590 17938 3025
6656C025p792p951m84L702j0632p256J6051J2378n375N339l395j139K494k139
$$ 3025 -4767 -12718 -13202 -9500 -20132 -27388 -11337 1041 -4334 1005 -2390 -3529 -1035 -3174
6642c174k990p571L254M12K346M386J2647j883j1788j701l213p885K6265J8076
$$ -3174 -6164 -13735 -10481 -10069 -7723 -3337 9310 7427 -4361 -6062 -9275 -17160 9105 27181
6628B7181n633j5580j8211K3761L784k1157j1218J0914J5286J426j1877l78K0676
$$ 27181 21548 5968 -12243 11518 15302 -5855 -17073 -6159 9127 10553 -1324 -1702 18974
6615A8974N669j4203j5514o557k009j082k756k290o010n944P890j420K0157j333
$$ 18974 24643 10440 -5074 -11631 -13640 -14722 -17478 -19768 -25778 -31722 -23832 -25252 -5095 -6428
6601f428j3927o343K770J56O304J8587l329l38j0425p16Q324R147L07l76p88O150
$$ -6428 -20355 -26698 -23928 -23772 -17468 1119 -2210 -2548 -12973 -13689 -5365 3782 4089 3713 2925 9075
6585I075J8777r868j7662r131J5983J424k4779L409L349O532l60J1177N223j816
$$ 9075 27852 17984 322 -8809 7174 8598 -16181 -12772 -9423 -2891 -3251 7926 13149 11333
6571A1333L115j391o065L940O273R429R078j1418r661J423J042p832j2490p958
$$ 11333 14448 13057 6992 10932 17205 26634 35712 24294 14633 16056 17098 9266 -3224 -11182
6557a1182J128J1950Q705N787L856k4340r444j5492P865P370J1570O664J96k199
$$ -11182 -10054 1896 10601 16388 20244 -4096 -13540 -29032 -21167 -13797 -2227 4437 4633 2434
6543B434N93N465j3280k1490M255L909k734Q490J2170N932k636n8p821o885n177
$$ 2434 3027 8492 -4788 -26278 -22023 -18114 -20848 -12358 -188 5744 3108 3050 -4771 -11656 -16833
6528a6833O927J84J0726J530k1808j0155L529J079p419m891J1040L399l94j0368
$$ -16833 -9906 -9722 1004 2534 -19274 -29429 -25900 -24821 -32240 -37131 -26091 -22692 -23086 -33454
6514c3454Q139r55j0329M513M578o445P587J4148P093R071o915m556q115j301
$$ -33454 -25315 -26270 -36599 -32086 -27508 -33953 -26366 -12218 -5125 3946 -2969 -7525 -15640 -16941
6500a6941L384L440q105o145k310J8051K330m097l645j4115n487J2764K3265N999
$$ -16941 -13557 -10117 -18222 -24367 -26677 -8626 -6296 -10393 -14038 -28153 -33640 -20876 2389 8388
6486H388J168o522J861J1048J801r257j0699j2749R747P651j253q528J994J454
$$ 8388 9556 3034 4895 15943 17744 8487 -2212 -14961 -5214 2437 1184 -7344 -5350 -3896
6472c896k0976r86J6186K2156Q72n368J7137L664p171o039P224n395l952n125
$$ -3896 -24872 -25858 -9672 12484 13356 7988 25125 28789 21618 15579 22803 17408 13456 8331
6458H331M013J269l075n359k353l431k718n231n742N310K578N07j080m755O804
$$ 8331 12344 13613 10538 5179 2826 -605 -3323 -8554 -14296 -8986 -6408 -5901 -6981 -11736 -4932
6443d932J1489p692Q978J8211M777j5186p882p990L36J1380k8234o381J7522M991
$$ -4932 6557 -1135 7843 26054 30831 15645 7763 -227 109 11489 -16745 -23126 -5604 -613
6429f13N203O664q060j1681M771L21o558p832j0923m358J5517k377J551R865J2087
$$ -613 4590 11254 3194 -8487 -3716 -3395 -9953 -17785 -28708 -33066 -17549 -19926 -18375 -8510 3577
6414C577R667L082M758j3563j1355p606M325O996O181K247L641M228o530k612
$$ 3577 13244 16326 21084 7521 -3834 -11440 -7115 -119 6062 8309 11950 16178 9648 7036
6400G036p475p454l710O165n426j3518Q421k718k953N306N1M035N673j073l706
$$ 7036 -439 -7893 -11603 -5438 -10864 -24382 -15961 -18679 -21632 -16326 -16275 -12240 -6567 -7640 -11346
6385a1346M905R302K327n211k490o677J3202P113P081J0674k5437j5298R070R098
$$ -11346 -6441 2861 5188 -23 -2513 -9190 4012 11125 18206 28880 3443 -11855 -2785 6313
6371F313j8637J072r421M381K0454O297n185k144j0769j2384n531N115J3492N299
$$ 6313 -12324 -11252 -20673 -16292 4162 10459 5274 3130 -7639 -20023 -25554 -20439 -6947 -1648
6357a648M69M429M49J240j1329Q87p57o623o594J2865N807R093l353j354n27J2333
$$ -1648 -1179 3250 3699 4939 -6390 -5503 -6260 -12883 -19477 -6612 -805 8288 4935 3581 3054 15387
6341A5387P36J95n303q672q966J740P30J729K088L736n012p489J983R6M382m401
$$ 15387 16123 16318 11015 2343 -6623 -4883 -4153 -2424 -336 3400 -1612 -9101 -7118 -7022 -2640 -7041
6325g041r87m03n915J1402L0000J585j6147o78k190j071K359N108O59n034k0400
$$ -7041 -8028 -8431 -14346 -2944 27056 28641 12494 11816 9626 8555 10914 16022 16681 11647 -8753
6310h753p909L724J2889J6661l387o434j870L055J850l109Q45j2411m219R033
$$ -8753 -16662 -12938 -49 16612 13225 6791 4921 7976 9826 6717 7562 -4849 -9068 -35
6296c5R520m158k806N26L29P222l16j3704j536N967K0029o76J470O161j8813k4684
$$ -35 9485 5327 2521 3047 3376 10598 10282 -3422 -4958 1009 21038 20362 21832 27993 9180 -15504
$$ [...]
##END NTUPLES=NMR SPECTRUM
##END=
