##TITLE=Analysis number 312827
Compound Code mo 01157
Book Reference 416/12
Project Code qc-cat
Chemist Name stevenp
##JCAMPDX= 6.0         $$ Bruker NMR JCAMP-DX V2.0
##DATA TYPE= NMR SPECTRUM
##DATA CLASS= NTUPLES
##ORIGIN= Bruker BioSpin GmbH
##OWNER= NMR
$$ XWIN-NMR		Version 3.5
$$ Mon Aug 15 12:00:56 2005 GMT Daylight Time (UT+1h)  MAYBRIDGE\NMR@NMR_250MHZ
##.OBSERVE FREQUENCY= 250.131544655141
##.OBSERVE NUCLEUS= ^1H
##.ACQUISITION MODE= SIMULTANEOUS (DQD)
##.ACQUISITION SCHEME= undefined
##.AVERAGES= 16
##.DIGITISER RES= 18
##SPECTROMETER/DATA SYSTEM= dpx250
##.PULSE SEQUENCE= zg30
##.SOLVENT NAME= CDCl3
##.SHIFT REFERENCE= (INTERNAL, CDCl3, 0, 16.522)
##AUDIT TRAIL= $$ (NUMBER, WHEN, WHO, WHERE, WHAT)
$$ ##TITLE= Audit trail, XWIN-NMR		Version 3.5
$$ ##JCAMPDX= 5.01
$$ ##ORIGIN= Bruker BioSpin GmbH
$$ ##OWNER= NMR
$$ C:\u/data/dgb/nmr/ADRS/7920/pdata/1/auditp.txt
$$ ##AUDIT TRAIL=  $$ (NUMBER, WHEN, WHO, WHERE, WHAT)
(   1,<2005-08-15 12:00:35.60 +100>,<MAYBRIDGE\NMR>,<NMR_250MHZ>,
      <created by zg, POWCHK disabled, PULCHK disabled
       configuration hash MD5:
       62 19 C7 07 E1 42 D1 B7 37 6C 3D D0 77 39 F9 E6
       data hash MD5: 64K
       D8 68 17 97 B5 24 64 7B FE 00 58 4D BF 7F 99 A1>)
(   2,<2005-08-15 12:00:47.84 +100>,<MAYBRIDGE\NMR>,<NMR_250MHZ>,
      <Start of raw data processing
       ef LB = 0.3 FT_mod = 6 PKNL = 1 SI = 32K 
       data hash MD5: 32K
       47 B6 53 23 F4 06 DE FB 6F 98 06 E3 5F 92 C4 15>)
(   3,<2005-08-15 12:00:49.73 +100>,<MAYBRIDGE\NMR>,<NMR_250MHZ>,
      <apk 
       data hash MD5: 32K
       A4 02 2F 7B 4F 07 8F 63 55 8B 08 77 47 35 71 26>)
(   4,<2005-08-15 12:00:50.46 +100>,<MAYBRIDGE\NMR>,<NMR_250MHZ>,
      <abs ABSG = 5 
       data hash MD5: 32K
       A6 5B CF C3 45 31 24 48 81 EA E0 72 57 3D 27 78>)
$$ ##END=
$$ 
$$ hash MD5
$$ 99 26 97 BE 45 53 74 03 D4 4D 5E 86 8C C4 CA 99
##$RELAX= 
##$RELAX= 
##$RELAX= 
##$RELAX= 
##$RELAX= 
##$RELAX= 
##$RELAX= 
$$ Bruker specific parameters
$$ --------------------------
##$DU= <C:\u>
##$EXPNO= 7920
##$NAME= <ADRS>
##$PROCNO= 1
##$TYPE= <nmr>
##$USER= <dgb>
##$AMP= (0..31)
100 100 100 100 100 100 100 100 100 100 100 100 100 100 100 100 100 100 
100 100 100 100 100 100 100 100 100 100 100 100 100 100 
##$AQSEQ= 0
##$AQ_mod= 3
##$AUNM= <au_zg>
##$AUTOPOS= <19 >
##$BF1= 250.13
##$BF2= 250.13
##$BF3= 250.13
##$BF4= 250.13
##$BF5= 500.13
##$BF6= 500.13
##$BF7= 500.13
##$BF8= 500.13
##$BYTORDA= 1
##$CFDGTYP= 0
##$CFRGTYP= 5
##$CHEMSTR= <none>
##$CNST= (0..31)
1 1 145 1 1 1 1 1 1 1 1 1 1 1 1 1 1 1 1 1 1 1 1 1 1 1 1 1 1 1 1 1 
##$CPDPRG= <>
##$CPDPRG1= <>
##$CPDPRG2= <>
##$CPDPRG3= <>
##$CPDPRG4= <mlev>
##$CPDPRG5= <mlev>
##$CPDPRG6= <mlev>
##$CPDPRG7= <mlev>
##$CPDPRG8= <mlev>
##$CPDPRGB= <>
##$CPDPRGT= <>
##$D= (0..31)
0 1 0 0 0 0 0 0 0 0.06 0 0 0 0 0 0 0.0002 0 0 0 0 0 0 0 0 0 0 0 0 0 0 
0 
##$DATE= 1124103634
##$DBL= (0..7)
120 120 120 120 120 120 120 120 
##$DBP= (0..7)
150 150 150 150 150 150 150 150 
##$DBP07= 0
##$DBPNAM0= <>
##$DBPNAM1= <>
$$ [...]
##$SUBNAM7= <"">
##$SUBNAM8= <"">
##$SUBNAM9= <"">
##$SW= 20.6930455092707
##$SWIBOX= (0..15)
0 0 3 0 0 0 0 0 0 0 0 0 0 0 0 0 
##$SW_h= 5175.983436853
##$TD= 65536
##$TD0= 1
##$TE= 296.16
##$TE2= 300
##$TE3= 300
##$TEG= 300
##$TL= (0..7)
0 120 120 120 120 120 120 120 
##$TP= (0..7)
150 150 150 150 150 150 150 150 
##$TP07= 0
##$TPNAME0= <>
##$TPNAME1= <>
##$TPNAME2= <>
##$TPNAME3= <>
##$TPNAME4= <>
##$TPNAME5= <>
##$TPNAME6= <>
##$TPNAME7= <>
##$TPOAL= (0..7)
0.5 0.5 0.5 0.5 0.5 0.5 0.5 0.5 
##$TPOFFS= (0..7)
0 0 0 0 0 0 0 0 
##$TUNHIN= 0
##$TUNHOUT= 0
##$TUNXOUT= 0
##$USERA1= <user>
##$USERA2= <user>
##$USERA3= <user>
##$USERA4= <user>
##$USERA5= <user>
##$V9= 5
##$VALIST= <valist>
##$VCLIST= <CCCCCCCCCCCCCCC>
##$VD= 0
##$VDLIST= <DDDDDDDDDDDDDDD>
##$VPLIST= <PPPPPPPPPPPPPPP>
##$VTLIST= <TTTTTTTTTTTTTTT>
##$WBST= 1024
##$WBSW= 4
##$XGAIN= (0..3)
0 0 0 0 
##$XL= 0
##$YL= 0
##$YMAX_a= 543665
##$YMIN_a= -773738
##$ZGOPTNS= <>
##$ZL1= 120
##$ZL2= 120
##$ZL3= 120
##$ZL4= 120
##$ABSF1= 16.522
##$ABSF2= -4.171173
##$ABSG= 5
##$ABSL= 3
##$ALPHA= 0
##$AQORDER= 0
##$ASSFAC= 0
##$ASSFACI= 0
##$ASSFACX= 0
##$ASSWID= 0
##$AUNMP= <proc_1d>
##$AZFE= 0.1
##$AZFW= 0.1
##$BCFW= 0
##$BC_mod= 0
##$BYTORDP= 0
##$COROFFS= 0
##$CY= 12.5
##$DATMOD= 1
##$DC= 0
##$DFILT= <>
##$DTYPP= 0
##$F1P= 14.0000005364418
##$F2P= -0.99999901652339
##$FCOR= 0.5
##$FTSIZE= 32768
##$FT_mod= 6
##$GAMMA= 0
##$GB= 0
##$INTBC= 1
##$INTSCL= 1
##$ISEN= 128
##$LB= 0.3
##$LEV0= 0
##$LPBIN= 0
##$MAXI= 10000
##$MC2= 0
##$MEAN= 0
##$ME_mod= 0
##$MI= 0
##$NCOEF= 0
##$NC_proc= -4
##$NLEV= 6
##$NOISF1= 0
##$NOISF2= 0
##$NSP= 0
##$NTH_PI= 0
##$NZP= 0
##$OFFSET= 16.522
##$PC= 1
##$PHC0= -79.96985
##$PHC1= 5.230233
##$PH_mod= 1
##$PKNL= yes
##$PPARMOD= 0
##$PSCAL= 4
##$PSIGN= 0
##$REVERSE= no
##$SF= 250.13
##$SI= 32768
##$SIGF1= 0
##$SIGF2= 0
##$SINO= 400
##$SIOLD= 32768
##$SREGLST= <1H.CDCl3>
##$SSB= 0
##$STSI= 32768
##$STSR= 0
##$SW_p= 5175.98343685301
##$SYMM= 0
##$S_DEV= 0
##$TDeff= 65536
##$TDoff= 0
##$TI= <Analysis number 999999
Compound Code 99
Book Reference 9
Project Code 9>
##$TILT= no
##$TM1= 0
##$TM2= 0
##$TOPLEV= 0
##$USERP1= <user>
##$USERP2= <user>
##$USERP3= <user>
##$USERP4= <user>
##$USERP5= <user>
##$WDW= 1
##$XDIM= 32768
##$YMAX_p= 378141461
##$YMIN_p= -156950
$$ End of Bruker specific parameters
$$ ---------------------------------
##NTUPLES= NMR SPECTRUM
##VAR_NAME=  FREQUENCY,     SPECTRUM/REAL,   SPECTRUM/IMAG
##SYMBOL=    X,             R,               I
##VAR_TYPE=  INDEPENDENT,   DEPENDENT,       DEPENDENT
##VAR_FORM=  AFFN,          ASDF,            ASDF
##VAR_DIM=   32768,         32768,           32768
##UNITS=     HZ,            ARBITRARY UNITS, ARBITRARY UNITS
##FACTOR=    0.157963299565203, 1,           1
##FIRST=     4132.6476996994, 0,             0
##LAST=      -1043.33573715361, 0,           0
##MIN=       -1043.33573715361, -156950,     0
##MAX=       4132.6476996994, 378141461,     0
$$ Real data points
##PAGE= N=1
##DATA TABLE= (X++(R..R)), XYDATA
$$ [...]
$$ plain form
18515 367830 410367 421226 381917 350224 333983 360324 375138 360623 343333 343725 337719 340447
18503 340447 356918 352029 322697 299628 281850 288689 293048 282128 265529 250315 248191 230265
18491 230265 191026 179936 199975 232812 215341 206603 199744 203136 224387 233513 263690 302804
18479 302804 317074 317376 312681 313036 326609 331835 369695 398405 441400 463843 486715 498339 504806
18466 504806 538407 526279 485306 467924 426410 397833 377960 403776 429399 443901 445478 437612
18454 437612 427833 424898 379504 326004 291958 278716 258356 250802 239722 224945 192830 166117
18442 166117 146775 119397 103978 107820 110661 112289 99945 111076 102900 67118 94562 68484
18430 68484 19559 13899 29420 23225 16327 35429 41588 48135 48558 57854 40587 49260 55533 35136
$$ packed form
18515C67830M2537J0859l9309l1693j6241K6341J4814j4515j7290L92o006K728
18503C40447J6471m889k9332k3069j7778O839M359j0920j6599j5214k124j7926
18491B30265l9239j1090K0039L2837j7471q738o859L392K1251R126L0177L9114
18479C02804J4270L02m695L55J3573N226L7860K8710M2995K2443K2872J1624O467
18466E04806L3601j2128m0973j7382m1514k8577j9873K5816K5623J4502J577p866
18454D37612r779k935m5394n3500l4046j3242k0360p554j1080j4777l2115k6713
18442A66117j9342k7378j5419L842K841J628j2344J1131q176l5782K7444k6078
18430F8484m8925n660J5521o195o898J9102O159O547M23R296j7267Q673O273k0397
$$ plain form
18416 35136 12655 7242 13492 4282 629 -2834 -2178 -44863 -33190 -5298 1311 156 3769 9109
18402 9109 37324 80896 65816 43172 35934 45964 54245 59424 61590 58414 30243 36931 62376
18389 62376 49738 30142 42424 70098 97913 97793 80826 74616 88727 118887 105916 92741
18377 92741 100805 112870 110354 106828 105387 104018 132417 169457 131577 118226 141447 149108 146933
18364 146933 177625 194883 180644 171244 184416 191632 179692 159030 167293 175846 198343 198208 197451
18351 197451 181194 183980 167864 142488 135484 136124 140688 171441 190098 160588 138368 153235
18339 153235 144180 167310 205575 193170 198479 199124 192864 195485 201896 181556 194113 249945 301491
18326 301491 297918 317278 341172 346625 361956 397303 445881 483632 534090 558136 591140 615431
$$ packed form
18416C5136k2481n413O250r210l653l463O56m2685J1673K7892O609j155L613N340
18402I109K8215M3572j5080k2644p238J0030Q281N179K166l176k8171O688K5445
18389F2376j2638j9596J2282K7674K7815j20j6967o210J4111L0160j2971j3175
18377I2741Q064J2065k516l526j441j369K8399L7040l7880j3351K3221P661k175
18364A46933L0692J7258j4239r400J3172P216j1940k0662Q263Q553K2497j35p57
18351A97451j6257K786j6116k5376p004O40M564L0753J8657k9510k2220J4867
18339A53235r055K3130L8265j2405N309O45o260K621O411k0340J2557N5832N1546
18326C01491l573J9360K3894N453J5331L5347M8578L7751N0458K4046L3004K4291
$$ plain form
18314 615431 609727 600336 554073 536230 510707 479185 431069 407897 406208 378690 352553 326872
18302 326872 320991 323870 268355 247089 229699 200296 199616 222608 247220 267804 319222 370589
18290 370589 422439 454065 465164 455116 451595 452454 423102 377388 346183 313636 280474 238679
18278 238679 180378 138465 122080 129315 103247 90893 73950 64092 60349 66186 68293 95099
18266 95099 133683 137692 140221 126008 115113 132278 170000 203841 211608 208845 232270 255793
18254 255793 257283 246442 250735 280615 282454 290643 336440 390175 438940 504092 574514 594031
18242 594031 628317 636427 574120 509449 474449 452409 455718 473829 473518 456969 469260 511523
18230 511523 521870 495471 480855 496034 506471 514011 537294 581742 614027 626558 665517 694442
$$ packed form
18314F15431n704r391m6263j7843k5523l1522m8116k3172j689k7518k6137k5681
18302C26872n881K879n5515k1266j7390k9403o80K2992K4612K0584N1418N1367
18290C70589N1850L1626J1099j0048l521Q59k9352m5714l1205l2547l3162m1795
18278B38679n8301m1913j6385P235k6068j2354j6943r858l743N837K107K6806
18266I5099L8584M009K529j4213j0895J7165L7722L3841P767k763K3425K3523
18254B55793J490j0841M293K9880J839Q189M5797N3735M8765O5152P0422J9517
18242E94031L4286Q110o2307o4671l5000k2040L309J8111l11j6549J2291M2263
18230E11523J0347k6399j4616J5179J0437P540K3283M4448L2285J2531L8959K8925
$$ plain form
18218 694442 697200 707975 744568 796338 821390 830180 870810 921509 919944 921882 954105 1007176
18206 1007176 1052722 1086790 1125853 1154195 1168436 1228695 1293634 1328657 1353082 1390280 1399611
18195 1399611 1415198 1426972 1403638 1374467 1370648 1396066 1448106 1551303 1691261 1870459 2133829
18184 2133829 2529025 3107800 3949430 5250960 7222985 10079389 13837879 18031909 21911215
18175 21911215 24755412 26280497 26548475 25565056 23131718 19536517 15453821 11663298
18167 11663298 8668358 6564557 5206082 4324278 3759398 3376331 3101553 2911924 2800688
18158 2800688 2845992 2939812 3060376 3193316 3384841 3615541 3866840 4152079 4509491 4966477
18148 4966477 5604165 6512367 7808930 9476927 11432365 13414568 15139259 16522825
$$ packed form
18218F94442K758J0775L6593N1770K5052Q790M0630N0699j565J938L2223N3071
18206A007176M5546L4068L9063K8342J4241O0259O4939L5023K4425L7198R331
18195A399611J5587J1774k3334k9171l819K5418N2040J03197J39958J79198K63370
18184B133829L95196N78775Q41630J301530J972025K856404L758490M194030L879306
18175B1911215K844197J525085K67978r83419k433338l595201m082696l790523
18167A1663298k994940k103801j358475q81804n64880l83067k74778j89629j11236
18158B800688M5304R3820J20564J32940J91525K30700K51299K85239L57412M56986
18148D966477O37688R08202J296563J667997J955438J982203J724691J383566
$$ plain form
18140 16522825 17750726 19056548 20652674 22580658 24768168 26844101 28390401 29277388
18132 29277388 30021608 31439979 33963202 37057743 39957941 42401928 44638184 46841574
18124 46841574 48740685 49698198 49132537 46988653 43952614 41128584 39661286 39955097
18116 39955097 41671594 44364543 47858649 51975930 56599509 62634141 72960011 89402091
18108 89402091 106808790 112193927 104282641 91115991 81621731 77992634 78122449 80451871
18100 80451871 83787406 87562843 91828853 95892235 98640142 99996086 100807268 100960124
18092 100960124 99534526 97031584 95326167 96012651 99523062 105814323 115223095 127378166
18084 127378166 139618806 149601170 157944780 163876266 160212874 142343158 115849053
$$ packed form
18140A6522825J227901J305822J596126J927984K187510K075933J546300Q86987
18132B9277388P44220J418371K523223L094541K900198K443987K236256K203390
18124D6841574J899111R57513n65661k143884l036039k824030j467298K93811
18116C9955097J716497K692949L494106M117281M623579O034632J0325870J6442080
18108H9402091J7406699N385137p911286j3166650r494260l629097J29815K329422
18100H0451871L335535L775437M266010M063382K747907J355944Q11182J52856
18092A00960124j425598k502942j705417O86484L510411O291261R408772J2155071
18084A27378166J2240640R982364Q343610N931486l663392j7869716k6494105
$$ plain form
18077 115849053 90187012 70624103 55866749 43870683 34117529 26788571 21639293
18070 21639293 17955803 15224891 13184759 11628459 10475690 9647686 9078579 8707878
18062 8707878 8408714 8074121 7683567 7298693 6980140 6706393 6461769 6193994 5909821
18053 5909821 5659724 5484006 5394861 5341084 5336978 5384618 5427825 5449058 5472334 5533004 5593966
18042 5593966 5707664 5896974 6123484 6388090 6647736 7005790 7432707 7954488 8658335
18033 8658335 9560066 10644181 11910548 13347545 14996059 16880670 19131398 21897429
18025 21897429 25521502 30479510 37109634 45662424 56227042 68265218 80710598 92817884
18017 92817884 103901370 112978600 119927101 125615310 130700739 135447544 140245133 144606139
$$ packed form
18077A15849053k5662041j9562909j4757354j1996066r753154p328958n149278
18070B1639293l683490k730912k040132j556300j152769q28004n69107l70701
18062H707878k99164l34593l90554l84874l18553k73747k44624k67775k84173
18053E909821k50097j75718q9145n3777m106M7640M3207K1233K3276O0670O0962
18042E593966J13698J89310K26510K64606K59646L58054M26917N21781P03847
18033H658335R01731J084115J266367J436997J648514J884611K250728K766031
18025B1897429L624073M958008O630124Q552790J0564618J2038176J2445380J2107286
18017I2817884J1083486R077230O948501N688209N085429M746805M797589M361006
$$ plain form
18009 144606139 146337906 142913858 133356163 119819928 106279282 96242963 91188460
18002 91188460 90697519 93577491 97685130 99329320 95349594 86137636 74224029 62279721
17994 62279721 51721808 42926066 35717754 29766136 24874505 21102563 18534294 17070833
17986 17070833 16589200 17017474 18250686 20102296 22325249 24852090 27625862 30367054
17978 30367054 32974721 35330332 37105022 38271384 39265370 40548471 42230556 44266678
17970 44266678 46660029 49417582 52216859 54653859 56433369 57263791 57002100 55790346
17962 55790346 53892525 51863212 50407502 49875320 49949088 50041465 49571591 48094503 45581094
17953 45581094 42378207 39026211 35900240 33299379 31257865 29581365 28051381 26485391
$$ packed form
18009A44606139J731767l424048r557695j3536235j3540646j0036319n054503
18002I1188460m90941K879972M107639J644190l979726r211958j1913607j1944308
17994F2279721j0557913q795742p208312n951618m891631l771942k568269j463461
17986A7070833m81633M28274J233212J851610K222953K526841K773772K741192
17978C0367054K607667K355611J774690J166362R93986J283101J682085K036122
17970D4266678K393351K757553K799277K437000J779510Q30422k61691j211754
17962E5790346j897821k029313j455710n32182P3768R2377m69874j477088k513409
17953D5581094l202887l351996l125971k600861k041514j676500j529984j565990
$$ plain form
17945 26485391 24593767 22397916 19897972 17227250 14578261 12057184 9820927 7996784
17937 7996784 6571760 5530634 4779925 4214924 3817686 3511408 3225073 2979830 2782619
17928 2782619 2652380 2543553 2454583 2373144 2295815 2212897 2124492 2024080 1933285 1853117 1780124
17917 1780124 1727872 1678819 1620278 1583540 1571485 1526035 1521585 1509976 1477535 1436175 1403130
17906 1403130 1398023 1363761 1319400 1297718 1289544 1271349 1242111 1231677 1202159 1170964 1152561 1160918
17894 1160918 1139265 1100495 1071806 1062299 1035728 1004277 964304 922416 886104 874340 860895
17883 860895 834608 800114 802527 819769 823871 805178 778378 751658 747788 754018 766151 789767
17871 789767 781008 765440 769125 787654 783987 779588 790655 778626 767818 782931 766606 763762
$$ packed form
17945B6485391j891624k195851k499944k670722k648989k521077k236257j824143
17937G996784j425024j041126p50709n65001l97238l06278k86335k45243j97211
17928B782619j30239j08827q8970q1439p7329q2918q8405j00412r0795q0168p2993
17917A780124n2252m9053n8541l6738j2055m5450m450j1609l2441m1360l3045
17906A403130n107l4262m4361k1682q174j8195k9238j0434k9518l1195j8403Q357
17894A160918k1653l8770k8689r507k6571l1451l9973m1888l6312j1764j3445
17883H60895k6287l4494K413J7242M102j8693k6800k6720l870O230J2133K3616
17871G89767q759j5568L685J8529l667m399J1067j2029j0808J5113j6325k844
$$ plain form
17859 763762 774905 758628 753775 767811 752352 753217 777390 776643 780597 787668 759362 759154 762718
17846 762718 766275 775810 761079 703676 695445 669800 658100 684090 687150 674353 640993 617982
17834 617982 604973 586714 582306 585261 588812 605670 614929 619459 616149 591871 572065 556585 554581
17821 554581 540024 522498 513746 476731 463819 463717 473465 461242 428507 460456 493699 471304
17809 471304 475609 481094 472400 485507 454764 431439 395990 374071 386959 415669 419137 419973 402395
17796 402395 370148 349338 316021 271024 253519 258514 276542 291595 249161 231734 242047 275144
17784 275144 280034 282209 285619 270343 256694 262394 276860 280439 287108 260621 263941 281223 296283
17771 296283 281541 281720 278041 265803 277400 288622 285717 277247 283628 290502 267650 249212 262594
$$ packed form
17859G63762J1143j6277m853J4036j5459Q65K4173p47L954P071k8306k08L564
17846G62718L557R535j4731n7403q231k5645j1700K5990L060j2797l3360k3011
17834F17982j3009j8259m408K955L551J6858R259M530l310k4278j9806j5480k004
17821E54581j4557j7526q752l7015j2912j02R748j2223l2735L1949L3243k2395
17809D71304M305N485q694J3107l0743k3325l5449k1919J2888K8710L468Q36j7578
17796D02395l2247k0810l3317m4997j7505M995J8028J5053m2434j7427J0313L3097
17784B75144M890K175L410j5276j3649N700J4466L579O669k6487L320J7282J5060
17771B96283j4742J79l679j2238J1597J1222k905q470O381O874k2852j8438J3382
$$ plain form
17758 262594 298403 296070 269287 236001 225485 229606 229210 200980 191377 181183 160281 197453
17746 197453 216674 231787 215321 222545 261108 265150 249068 229740 235800 215117 213823 221131
17734 221131 217174 236674 235419 235067 254599 249820 246341 266430 290986 295724 297760 276794 287201
17721 287201 265867 255366 256716 246736 236622 253086 245347 215126 208827 203616 196756 201327 186929
17708 186929 174257 170812 162933 184634 171505 173799 188250 179269 191205 222828 253689 245686
17696 245686 248578 250588 269850 252959 252583 262448 261378 268974 257330 259445 263718 244243 230874
17683 230874 236848 240503 259664 260568 254655 244099 249530 228760 228771 216864 237992 270202 267598
17670 267598 254671 233286 240879 260030 320244 350404 411777 504648 601351 655406 712917 769642
$$ packed form
17758B62594L5809k333k6783l3286j0516M121l96k8230r603j0194k0902L7172
17746A97453J9221J5113j6466P224L8563M042j6082j9328O060k0683j294P308
17734B21131l957J9500j255l52J9532m779l479K0089K4556M738K036k0966J0407
17721B87201k1334j0501J350r980j0114J6464p739l0221o299n211o860M571j4398
17708A86929j2672l445p879K1701j3129K294J4451q981J1936L1623L0861q003
17696B45686K892K010J9262j6891l76R865j070P596j1644K115M273j9475j3369
17683B30874N974L655J9161R04n913j0556N431k0770J1j1907K1128L2210k604
17670B67598j2927k1385P593J9151O0214L0160O1373R2871R6703N4055N7511N6725
$$ plain form
17658 769642 788702 793605 749796 697965 620463 549592 504282 449940 373141 306317 283964 237880
17646 237880 187264 176715 186138 199371 184513 135211 116626 143746 145487 126675 112962 122973
17634 122973 140317 141178 137339 154914 140809 129573 143392 150998 138296 134115 139931 148148 154317
17621 154317 197103 266902 332255 398017 474528 542625 624820 742376 792523 828052 867459
17610 867459 897007 894836 864578 826829 777577 756916 752292 742318 722371 681091 667023 650576
17598 650576 618814 573552 542725 500987 479708 475282 453720 443270 437261 412002 350641 313154
17586 313154 286611 279803 254794 232877 202060 155077 161735 152749 120691 98127 78750 60046
17574 60046 90347 126998 149854 151228 162698 190918 219022 250997 266013 270048 290713 292927
$$ packed form
17658G69642J9060M903m3809n1831p7502p0871m5310n4342p6799o6824k2353m6084
17646B37880n0616j0549R423J3233j4858m9302j8585K7120J741j8812j3713J0011
17634A22973J7344Q61l839J7575j4105j1236J3819P606j2702m181N816Q217O169
17621A54317M2786O9799O5353O5762P6511O8097Q2195J17556N0147L5529L9407
17610H67459K9548k171l0258l7749m9252k0661m624r974j9947m1280j4068j6447
17598F50576l1762m5262l0827m1738k1279m426k1562j0450o009k5259o1361l7487
17586C13154k6543o808k5009k1917l0817m6983O658q986l2058k2564j9377j8704
17574F0046L0301L6651K2856J374J1470K8220K8104L1975J5016M035K0665K214
$$ plain form
17562 292927 290906 277559 252547 220397 200919 189372 168079 113921 91217 89260 99648 100855
17550 100855 77071 71564 72964 74690 92656 83251 101061 111763 76537 72420 77738 55489 53435
17537 53435 77244 89712 87270 102208 110180 103521 92431 100981 119856 147757 175885 198489
17525 198489 243066 283792 321233 322283 388127 457616 508813 533742 561669 589456 593548 627809
17513 627809 661512 707430 724486 743817 733025 733567 729847 690750 611209 590512 577716 559173
17501 559173 526538 503380 484873 451559 407961 346744 293287 285006 259070 210098 185292 163117
17489 163117 152061 150644 153540 178089 183322 186808 193036 212392 227201 249790 283263 317359
17477 317359 320017 309485 314949 330104 350576 374694 402826 460594 499567 509588 529063 545123
$$ packed form
17562B92927k021j3347k5012l2150j9478j1547k1293n4158k2704j957J0388J207
17550A00855k3784n507J400J726J7966r405J7810J0702l5226m117N318k2249k054
17537E3435K3809J2468k442J4938P972o659j1090Q550J8875K7901K8128K2604
17525A98489M4577M0726L7441J050O5844O9489N1197K4929K7927K7787M092L4261
17513F27809L3703M5918J7056J9331j0792N42l720l9097p9541k0697j2796j8543
17501E59173l2635k3158j8507l3314m3598o1217n3457q281k5936m8972k4806k2175
17489A63117j1056j417K896K4549N233L486O228J9356J4809K2589L3473L4096
17477C17359K658j0532N464J5155K0472K4118K8132N7768L8973J0021J9475J6060
$$ plain form
17465 545123 584986 609031 591597 560270 521489 525379 537408 526563 513727 477112 445634 430231
17453 430231 403749 383573 351911 313066 275778 241468 230565 248561 262513 282618 328345
17442 328345 405852 463058 429590 329555 232333 161768 123981 87132 74673 73685 52723 44713
17430 44713 23304 32121 65831 68204 54430 48500 31727 18300 9601 -1282 7332 53520 60789
17417 60789 51889 42998 34810 49133 48729 67948 64509 74874 56592 69135 59243 47615 69885
17404 69885 59312 49859 45048 56011 74087 66223 52396 68769 65217 63833 43942 66178 56044
17391 56044 62896 70206 97664 91640 102530 102503 114275 100509 72910 52868 22674 11757 50540
17378 50540 35391 39028 67659 76111 69652 69935 73965 84484 61600 52349 50459 22405 15581
$$ packed form
17465E45123L9863K4045j7434l1327l8781L890J2029j0845j2836l6615l1478j5403
17453D30231k6482k0176l1662l8845l7288l4310j0903J7996J3952K0105M5727
17442C28345P7507N7206l3468j00035r7222p0565l7787l6849j2459r88k0962q010
17430D4713k1409Q817L3710K373j3774n930j6773j3427q699j0883Q614M6188P269
17417F0789q900q891q188J4323m04J9219l439J0365j8282J2543r892j1628K2270
17404F9885j0573r453m811J0963J8076p864j3827J6373l552j384j9891K2236j0134
17391E6044O852P310K7458o024J0890k7J1772j3766k7599k0042l0194j0917L8783
17378E0540j5149L637K8631Q452o459K83M030J0519k2884r251j890k8054o824
$$ plain form
17365 15581 16503 24744 -5368 6670 12713 13263 4013 6924 -728 -10394 19199 -3655 1098 19838
17351 19838 23204 13696 17687 15270 30398 36553 33354 56223 40288 36891 26157 -1227 2989
17338 2989 11552 9238 -3177 11566 22933 48781 63931 55729 22507 37644 47847 71171
17326 71171 42516 29082 38361 36089 10973 14139 41478 80203 99649 90744 37641 8126
17314 8126 -13288 -26461 -12454 -20441 -22717 -17023 -37493 -31203 -32790 -4634 34284 49444 46245
17301 46245 39080 33156 39904 49835 35055 37004 30192 29307 49031 69330 41397 31479 41697
17288 41697 48914 49379 12614 -12568 -19514 -13484 -2847 -1012 8381 34763 62650 64051 58723
17275 58723 68241 74267 61784 44594 11381 -17759 -35847 -21317 -6981 5247 13189 18058
$$ packed form
17365A5581R22Q241l0112J2038O043N50r250K911p652r666K9593k2854M753J8740
17351A9838L366r508L991k417J5128O155l199K2869j5935l397j0734k7384M216
17338B989Q563k314j2415J4743J1367K5848J5150q202l3222J5137J0203K3324
17326G1171k8655j3434R279k272k5116L166K7339L8725J9446q905n3103k9515
17314H126k1414j3173J4007p987k276N694k0470O290j587K8156L8918J5160l199
17301D6245p165n924O748R931j4780J949o812q85J9724K0299k7933r918J0218
17288D1697P217M65l6765k5182o946O030J0637J835R393K6382K7887J401n328
17275E8723R518O026j2483j7190l3213k9140j8088J4530J4336J2228P942M869
$$ plain form
17263 18058 8603 -12632 824 5862 21270 25176 36482 68177 78134 49160 20575 11019 6405
17250 6405 27646 54712 47447 49201 41687 34648 34296 40544 34503 36079 41278 18659 2428 18203
17236 18203 36692 359 -27113 2508 34534 41315 20143 12873 8636 22698 4003 -1666
17224 -1666 -1618 13720 17723 -9370 -14257 -22208 -10908 1250 2646 -7954 11991 5132 -17952
17211 -17952 -6134 14206 21722 -161 11534 12426 23109 38846 16611 9529 12272 28960 39328
17198 39328 30575 19910 27421 38206 27179 33824 -5763 -38492 -47468 -60865 -43339 -9395
17186 -9395 -1212 19592 17702 5776 7480 27827 18900 24060 23095 11164 19803 18924 12897 -23345
17172 -23345 -40136 -31672 -10673 1473 -2576 -14453 -17465 -24346 -2070 13097 13212 -16270 -16247
$$ packed form
17263A8058r455k1235J3456N038J5408L906J1306L1695R957k8974k8585r556m614
17250F405K1241K7066p265J754p514p039l52O248o041J576N199k2619j6231J5775
17236A8203J8489l6333k7472K9621L2026O781k1172p270m237J4062j8695n669
17224a666M8J5338M003k7093m887p951J1300J2158J396j0600J9945o859k3084
17211a7952J1818K0340P516k1883J1695Q92J0683J5737k2235p082K743J6688J0368
17198C9328q753j0665P511J0785j1027O645l9587l2729q976j3397J7526L3944
17186i395Q183K0804j890j1926J704K0347q927N160r65j1931Q639q79o027l6242
17172b3345j6791Q464K0999J2146m049j1877l012o881K2276J5167J15k9482K3
$$ plain form
17159 -16247 -7583 4017 7554 14750 14835 16147 -20835 -10058 312 -4540 -25911 -13690 -948
17146 -948 2328 -13790 -9850 -15994 -18706 -11003 -14341 -29230 -40653 -39036 -19876 -19691 -7184 -16639
17132 -16639 -2116 832 -11425 -22161 -30327 -44321 -34025 -29156 -23915 -8304 25388 5533
17120 5533 -1161 16995 18897 12314 5986 -3327 1849 -10189 -13405 -364 -9862 -20343 -15737 15844
17106 15844 10745 4577 12795 5614 22436 35355 36591 49349 51131 28395 38564 28676 6653
17093 6653 5797 21036 51952 27839 9661 16441 30897 31139 34981 20857 10953 -28056 -18883
17080 -18883 28724 48942 44955 38467 76191 61208 37458 19718 17089 5569 -11911 -20611
17068 -20611 -23495 -24575 -1063 985 -8229 10998 11772 6429 -20499 3450 40257 48284 36434
$$ packed form
17159a6247Q664J1600L537P196Q5J312l6982J0777J0370m852k1371J2221J2742
17146i48L276j6118L940o144k712P703l338j4889j1423J617J9160J85J2507r455
17132a6639J4523K948j2257j0736q166j3994J0296M869N241J5611L3692j9855
17120E533o694J8156J902o583o328r313N176j2038l216J3041r498j0481M606L1581
17106A5844n099o168Q218p181J6822J2919J236J2758J782k2736J0169r888k2023
17093F653q56J5239L0916k4113j8178O780J4456K42L842j4124r904l9009R173
17080a8883M7607K0218l987o488L7724j4983k3750j7740k629j1520j7480q700
17068b0611k884j080K3512K048r214J9227P74n343k6928K3949L6807Q027j1850
$$ plain form
17055 36434 15153 8636 9995 -565 15551 38125 71958 56686 14989 -18035 -25454 -3576
17043 -3576 14442 2542 -15397 2446 10715 21087 -12276 -41857 -27094 7645 20445 50439
17031 50439 18770 11035 18848 32148 42045 4358 -13588 -6380 7333 -9523 -1322 21312 15137
17018 15137 16793 17007 13217 -8356 -50152 -56065 -38535 -27486 -26231 -5883 21826 43255 274
17005 274 -10431 5344 4598 -12635 -4051 -4416 6827 9077 -24764 -33664 -11976 7631 25626
16992 25626 47662 65972 44800 15461 7221 -20264 -31304 -17870 5019 23095 14012 35233
16980 35233 28425 -1247 -1056 -23416 -37995 -18033 3611 -3958 -20244 -15539 4424 14977 20871
16967 20871 3331 -3449 25951 73810 56073 37283 21923 -9338 -6349 -6602 889 -3249 -30586
$$ packed form
17055C6434k1281o517J359j0560J6116K2574L3833j5272m1697l3024p419K1878
17043c576J8018j1900j7939J7843Q269J0372l3363k9581J4763L4739J2800K9994
17031E0439l1669p735P813J3300R897l7687j7946P208J3713j6856Q201K2634o175
17018A5137J656K14l790k1573m1796n913J7530J1049J255K0348K7709K1429m2981
17005B74j0705J5775p46j7233Q584l65J1243K250l3841q900K1688J9607J7995
16992B5626K2036J8310k1172k9339q240k7485j1040J3434K2889J8076r083K1221
16980C5233o808k9672J91k2360j4579J9962K1644p569j6286M705J9963J0553N894
16967B0871j7540o780K9400M7859j7737j8790j5360l1261K989k53P491m138k7337
$$ plain form
16954 -30586 -60304 -47351 -35371 239 -315 20057 15607 1822 -8489 -3587 -26645 -35523 -33181
16941 -33181 -25062 -28012 -47852 -29973 -23439 -12959 9475 -1631 3634 -16201 -2721 21940
16929 21940 27307 -8885 -11499 -3672 7872 15162 -1972 -4527 7992 18592 -13821 -36332 -54646
16916 -54646 -9736 13399 32148 36646 28643 26709 -16481 -26614 -23598 3025 22539 -8177
16904 -8177 -21009 -21226 -36821 -23364 -17750 -1817 -9778 -21621 -25981 -22971 1965 19412 6676
16891 6676 5210 14591 -2173 -7402 38234 46298 22749 9989 28325 43700 87916 86924 68501
16878 68501 47335 34968 4318 -11636 17567 8545 -17105 -37397 -47795 -35517 -23049 -23204
16866 -23204 -1701 19635 26701 10609 -318 19226 27271 41408 41946 19003 6186 15749 1513
$$ packed form
16954c0586k9718J2953J1980L5610n54K0372m450j3785j0311M902k3058q878K342
16941c3181Q119k950j9840J7879O534J0480K2434j1106N265j9835J3480K4661
16929B1940N367l6192k614P827J1544P290j7134k555J2519J0600l2413k2511j8314
16916e4646M4910K3135J8749M498q003j934m3190j0133L016K6623J9514l0716
16904h177j2832k17j5595J3457N614J5933p961j1843m360L010K4936J7447j2736
16891F676j466R381j6764n229M5636Q064k3549j2760J8336J5375M4216r92j8423
16878F8501k1166j2367l0650j5954K9203r022k5650k0292j0398J2278J2468j55
16866b3204K1503K1336P066j6092j0927J9544Q045J4137N38k2943j2817R563j4236
$$ plain form
16853 1513 -29428 -12814 -2500 -865 10532 19519 23737 10523 11313 7756 -24422 -25106 -723
16840 -723 9037 15598 21573 6071 -646 8316 -13658 3495 8473 -6621 -14666 -31066 -28971 -24219
16826 -24219 -15548 -10314 19953 24441 27567 9179 21903 10870 -8882 -14747 -6619 6420 43119
16813 43119 20963 11866 9138 -23135 -35924 -25220 -26436 -15216 -9443 -4669 -23864 -36261 -16461
16800 -16461 -5277 -9078 10786 -7881 -17291 -15070 -2845 -14931 -16445 -7682 3162 -26422 -49238
16787 -49238 -27071 3070 39910 50633 59668 45919 36148 21581 26487 747 -1561 -5459 -21410
16774 -21410 -34214 -41815 -15396 -6402 583 19802 32416 31778 -9422 -47629 -52538 -38002 -16930
16761 -16930 -3719 -10949 -6515 9081 5257 1240 -7888 -11696 5599 6830 5874 22234 -5740
$$ packed form
16853A513l0941J6614J0314J635J1397Q987M218j3214P90l557l2178o84K4383
16840g23R760O561N975j5502o717Q962k1974J7153M978j5094q045j6400K095M752
16826b4219Q671N234L0267M488L126j8388J2724j1033j9752n865Q128J3039L6699
16813D3119k2156r097k728l2273j2789J0704j216J1220N773M774j9195j2397J9800
16800a6461J1184l801J9864j8667r410K221J2225j2086j514Q763J0844k9584k2816
16787d9238K2167L0141L6840J0723R035j3749r771j4567M906k5740k308l898j5951
16774b1410j2804p601K6419Q994O985J9219J2614o38m1200l8207m909J4536K1072
16761a6930J3211p230M434J5596l824m017r128l808J7295J231r56J6360k7974
$$ plain form
16748 -5740 -11107 -12644 -4409 8181 35246 26973 14970 20864 16840 14061 39541 30582 -4899
16735 -4899 -17318 3577 12880 -4632 -42244 -62936 -48290 -36511 -17966 -30825 -41469 942
16723 942 43797 54228 41526 -22102 -31673 -3735 -7288 -7965 -25848 -45883 -34972 -32436 -24833
16710 -24833 -41299 -43975 -48426 -39413 -39485 -20886 -32198 -31086 -19584 -22892 -19347 -15298 -13314 11880
16696 11880 14156 15899 17250 17934 16375 21103 848 -11899 -30426 -20279 -20082 -11050 6251 -7001
16682 -7001 -1451 12532 28624 8900 -1812 6002 -23091 -35081 -22410 -2900 -15223 -26637
16670 -26637 -46318 -61844 -44785 -46371 -33808 -34042 -31598 -22335 -26268 -39498 -22122 -24194 -28243
16657 -28243 -19677 -13992 -10217 -13969 -39875 -21363 -33783 -36391 -49805 -35076 -9656 4775 22784
$$ packed form
16748e740n367j537Q235J2590K7065q273j2003N894m024k779K5480q959l5481
16735d899j2419K0895R303j7512l7612k0692J4646J1779J8545j2859j0644M2411
16723I42M2855J0431j2702o3628r571K7938l553o77j7883k0035J0911K536P603
16710b4833j6466k676m451R013p2J8599j1312J112J1502l308L545M049J984K5194
16696A1880K276J743J351O84j559M728k0255j2747j8527J0147J97R032J7301j3252
16682g001N550J3983J6092j9724j0712P814k9093j1990J2671J9510j2323j1414
16670b6637j9681j5526J7059j586J2563k34K444R263l933j3230J7376k072m049
16657b8243Q566N685L775l752k5906J8512j2420k608j3414J4729K5420J4431J8009
$$ plain form
16644 22784 14726 6322 -18212 -25775 -2362 -2728 -21847 -34999 -31490 -23258 -43208 -30425 -14297
16631 -14297 -23810 6138 1805 -18063 11693 40185 43242 31464 13519 8339 15997 -4802 -18382
16618 -18382 -25551 -32062 -44151 -19421 13257 20399 10347 8357 -2312 -27075 -13446 -10865 -23755
16605 -23755 -16105 -11561 -12820 -16336 -11894 -708 -37779 -35205 -22006 -3503 -20892 -27439 -21672
16592 -21672 -32833 -38757 -37691 -18912 757 2222 -6620 -35895 -21403 -28798 -28975 -13337 3939
16579 3939 10640 723 25651 21037 3968 -4966 -9181 -9538 -9307 9054 21621 19761 21230 22376
16565 22376 18518 9680 31279 38682 42792 28904 32442 25842 18134 9972 -17073 -33053 -25692
16552 -25692 -36680 -22047 31078 60924 50343 20028 -3542 12608 -2665 -32820 -19835 -266
$$ packed form
16644B2784q058q404k4534p563K3413l66j9119j3152L509Q232j9950J2783J6128
16631a4297r513K9948m333j9868K9756K8492L057j1778j7945n180P658k0799j3580
16618a8382p169o511j2089K4730L2678P142j0052j990j0669k4763J3629K581j2890
16605b3755P650M544j259l516M442J1186l7071K574J3199J8503j7389o547N767
16592b1672j1161n924J066J8779J9669J465q842k9275J4492p395j77J5638J7276
16579C939O701r917K4928m614j7069q934m215l57K31J8361J2567j860J469J146
16565B2376l858q838K1599P403M110j3888L538o600p708q162k7045j5980P361
16552b5692j0988J4633N3125K9846j0581l0315k3570J6150j5273l0155J2985J9569
$$ plain form
16540 -266 4997 268 -10454 -284 18744 36594 51517 41118 12264 -12269 -19402 -20491 -823
16527 -823 31839 26789 10340 1077 1694 7354 22955 19107 18715 5532 -30230 -27947 -8038 68
16513 68 8540 12297 8593 -11515 -20157 -19921 -17678 -24625 -29363 -29860 -17197 -4317 -7663 -32862 -34854
16498 -34854 -30556 -45305 -23011 -11440 -30528 -4908 16788 17499 -4803 -16176 7705 23083
16486 23083 35788 25036 31878 31205 18089 9026 -35785 -42610 -27011 -33351 -35680 -24481 -22159
16473 -22159 -12613 -10503 -27936 -36243 -58223 -72353 -61955 -48767 -38061 -34178 -26350 -33816 -43492
16460 -43492 -18687 -50836 -51857 -30983 -30070 569 -935 -13916 -18911 -6744 -2930 18263 31012
16447 31012 24517 -14910 -29772 -18988 6139 8920 21990 22710 10503 4874 16313 7509 -3286
$$ packed form
16540b66N263m729j0722J0170J9028J7850J4923j0399k8854k4533p133j089J9668
16527h23L2662n050j6449r263O17N660J5601l848l92j3183l5762K283J9909Q106
16513F8Q472L757l704k0108q642K36K243o947m738m97J2663J2880l346k5199j992
16498c4854M298j4749K2294J1571j9088K5620K1696P11k2302j1373K3881J5378
16486B3083J2705j0752O842o73j3116r063m4811o825J5599o340k329J1199K322
16473b2159R546K110j7433q307k1980j4130J0398J3188J0706L883P828p466r676
16460d3492K4805l2149j021K0874R13L0639j504j2981m995J2167L814K1193J2749
16447C1012o495l9427j4862J0784K5127K781J3070P20j2207n629J1439q804j0795
$$ plain form
16434 -3286 -10264 -10055 -439 -5149 -24457 -13934 19634 45947 26839 2518 7629 -13026 -23362
16421 -23362 -28967 -36459 -22196 -31613 -32504 -39527 -38097 -40077 -19718 -15617 -19810 -10309 -6319 -13346
16407 -13346 -3191 -15459 -33541 1306 4451 -5081 -21367 -10834 -15656 -22221 -13198 -7224 -7645
16394 -7645 -3793 -4752 -104 -16475 -31974 -9806 12798 36592 23666 9483 -23776 -52074 -51112
16381 -51112 -60833 -48877 -54702 -54625 -39830 -9113 15414 -2522 -24931 -29574 -4328 5046 -11250
16368 -11250 -9527 -20497 -18280 -32219 -47048 -36094 -34488 -20021 -14239 -30383 -755 -2866 -15924
16355 -15924 -16166 -1265 2684 8437 50915 42833 6401 19774 13380 -17294 -15587 -22553 -25663
16342 -25663 -19038 -23523 -18192 -12836 -17458 -23670 -17317 12123 19022 19464 17559 29022 30809 9556
$$ packed form
16434c286o978K09R616m710j9308J0523L3568K6313j9108k4321N111k0655j0336
16421b3362n605p492J4263r417q91p023J430j980K0359M101m193R501L990p027
16407a3346J0155j2268j8082L4847L145r532j6286J0533m822o565R023N974m21
16394g645L852r59M648j6371j5499K2168K2604K3794j2926j4183l3259k8298R62
16381e1112r721J1956n825P7J4795L0717K4527j7936k2409m643K5246R374j6296
16368a1250J723j0970K217j3939j4829J0954J606J4467N782j6144K9628k111j3058
16355a5924k42J4901L949N753M2478q082l6432J3373o394l0674J707o966l110
16342b5663O625m485N331N356m622o212O353K9440O899M42j905J1463J787k1253
$$ plain form
16328 9556 -3628 8028 24787 23294 -9389 251 16448 15607 4317 -2252 -21923 -36948 -20717
16315 -20717 -732 -7170 -19958 -15220 -7494 10407 20063 23410 20950 18424 23626 1984 -19800
16302 -19800 -12168 1479 -7428 -46310 -34354 -26008 -38070 -35776 -33017 -12813 -3343 -19725 -68241
16289 -68241 -65777 -37182 -49864 -67468 -36916 -5151 7397 -480 -9800 1705 22978 21552
16277 21552 14518 -494 -11493 -19410 1931 7025 1988 23396 14020 13963 31791 26691 25425 -5257
16263 -5257 -19254 18490 1777 -18242 -15947 4479 -736 -16133 -1793 13058 27582 29312
16251 29312 23057 -8870 -12722 -5036 -17372 -29080 -23537 -19981 -18415 -28743 -39561 -34978 4649
16238 4649 31132 9052 -1534 -10000 902 36887 46848 28163 28492 21863 23975 8427 -25840
$$ packed form
16328I556j3184J1656J6759j493l2683R640J6197q41j1290o569j9671j5025J6231
16315b0717J9985o438j2788M738P726J7901R656L347k460k526N202k1642k1784
16302a9800P632J3647q907l8882J1956Q346j2062K294K759K0204R470j6382m8516
16289f8241K464K8595j2682j7604L0552L1765J2548p877r320J1505K1273j426
16277B1552p034j5012j0999p917K1341N094n037K1408r376n7J7828n100j266l0682
16263e257j3997L7744j6713k0019K295K0426n215j5397J4340J4851J4524J730
16251B9312o255l1927l852P686j2336j1708N543L556J566j0328j0818M583L9627
16238D649K6483k2080j0586q466J0902L5985R961j8685L29o629K112j5548l4267
$$ plain form
16225 -25840 -22529 -13262 -1500 2358 2660 -10150 -19195 -7319 14831 21254 19205 -4721 -43296
16212 -43296 -38452 -26796 -38015 -33096 12253 17328 -1282 -16873 -11221 -12700 -1654 4005 14688
16199 14688 11480 3554 -33058 -37989 -28008 -30854 -30272 -30714 -29421 -16492 -4314 2964 6258 12158
16185 12158 11299 4430 13700 3194 -26238 -41275 -38889 -5222 18533 27914 10457 -1878 -7226
16172 -7226 7881 -4223 -23329 -16213 -9160 -9189 -780 20939 -12752 -35106 -34659 -31374 -23331 -19383
16158 -19383 -20479 -23176 -14302 -19843 -11354 -14471 -7704 5310 -11827 -19509 -21549 -23749 -8731 17899
16144 17899 4490 -2821 17940 -465 -5000 11388 23178 48602 59316 46905 29261 4949
16132 4949 6221 -14018 2924 24395 15266 -3430 5000 12449 42930 52215 43352 32928 20494
$$ packed form
16225b5840L311R267J1762L858L02j2810r045J1876K2150O423k049k3926l8575
16212d3296M844J1656j1219M919M5349N075j8610j5591N652j479J1046N659J0683
16199A4688l208p926l6612m931R981k846N82m42J293J2929J2178P278L294N900
16185A2158q59o869R270j0506k9432j5037K386L3667K3755R381j7457j2335n348
16172g226J5107j2104j9106P116P053k9Q409K1719l3691k2354M47L285Q043L948
16158a9383j096k697Q874n541Q489l117O767J3014j7137p682k040k200J5018K6630
16144A7899j3409p311K0761j8405m535J6388J1790K5424J0714j2411j7644k4312
16132D949J272k0239J6942K1471r129j8696Q430P449L0481R285q863j0424j2434
$$ plain form
16119 20494 -16071 -24147 -17984 -32757 -40964 -10445 -19845 -18311 -10097 -28665 -51266 -66852 -73941
16106 -73941 -78055 -57234 -10672 5778 -8238 -13430 -3861 -12527 -26031 -10334 -24741 -29417 -18846
16093 -18846 -9797 -6715 14048 35474 62685 67996 73806 54975 21755 5132 7952 11246 3135
16080 3135 -10089 -6275 -2156 -1775 9333 25781 22482 36962 74737 72365 45409 13287 -5498
16067 -5498 -17363 -24964 -10802 -18854 -36843 -33252 -23414 -29850 -12333 -9958 -20604 -25997 -2652
16054 -2652 -316 16752 34476 22484 -12559 9871 3590 -3694 -20175 -21953 -2990 16637 15891
16041 15891 -26123 -24067 -2836 319 -30145 -40639 -29628 -25934 -36075 -12022 12714 14666
16029 14666 -11964 -28900 -9885 27856 34757 61064 54131 49160 54334 9127 -42886 -56341
$$ packed form
16119B0494l6565q076O163j4773q207L0519r400J534Q214j8568k2601j5586p089
16106g3941m114K0821M6562J6450j4016n192R569q666j3504J5697j4407m676J0571
16093a8846R049L082K0763K1426K7211N311N810j8831l3220j6623K820L294q111
16080C135j3224L814M119L81J1108J6448l299J4480L7775k372k6956l2122j8785
16067e498j1865p601J4162q052j7989L591R838o436J7517K375j0646n393K3345
16054b652K336J7068J7724j1992l5043K2430o281p284j6481j778J8963J9627p46
16041A5891m2014K056K1231L155l0464j0494J1011L694j0141K4053K4736J952
16029A4666k6630j6936J9015L7741O901K6307o933m971N174m5207n2013j3455
$$ plain form
16017 -56341 -48454 -38831 -29088 -872 37398 40057 41061 33469 10867 -15949 -22042 -24773 -9982
16004 -9982 -9590 39629 67046 58463 40588 38762 18335 2186 -4532 7795 8639 -3192 3158
15991 3158 10217 5304 -22018 -23785 -11206 -6988 -16761 -2281 10024 23426 5827 9337 38300
15978 38300 29221 -5783 11467 15483 4855 -4301 -11342 -16443 12218 10748 3305 20793 33632
15965 33632 26517 18936 26442 52739 44041 28538 5127 11397 14222 -5332 -15841 14023 28725
15952 28725 35914 39451 22497 16829 24317 23970 21968 18960 11965 6964 27704 14282 16145 24588
15938 24588 6183 27501 42160 6524 -11318 -23391 -19814 11837 31457 51556 49252 16692
15926 16692 25658 44335 45422 9986 -4295 -13257 -14660 19585 25397 24174 36277 22658 18094
$$ packed form
16017e6341P887R623R743K8216L8270K659J004p592k2602k6816o093k731J4791
16004i982L92M9219K7417q583j7875j826k0427j6149o718J2327Q44j1831O350
15991C158P059m913k7322j767J2579M218r773J4480J2305J3402j7599L510K8963
15978C8300r079l5004J7250M016j0628r156p041n101K8661j470p443J7488J2839
15965C3632p115p581P506K6297q698j5503k3411O270K825j9554j0509K9864J4702
15952B8725P189L537j6954n668P488l47k002l008o995n001K0740j3422J863Q443
15938B4588j8405K1318J4659l5636j7842j2073L577L1651J9620K0099k304l2560
15926A6692Q966J8677J087l5436j4281q962j403L4245N812j223J2103j3619m564
$$ plain form
15913 18094 23931 36006 25464 15868 654 11971 6949 2977 10639 24592 31223 -771 -17003
15900 -17003 -19754 958 -11782 -23798 -7876 12408 9201 -20183 -10468 -14609 430 -18931
15888 -18931 -32176 -60612 -49353 -29493 -9758 -1816 -9748 -15854 -27298 -7540 -260 -16855
15876 -16855 -21157 -1388 12835 1497 -4965 -525 6983 -9648 -46506 -53031 -43748 -37359 -23243
15863 -23243 -11138 -4066 -18874 -14532 -20849 -19412 -15706 -38406 -44623 -38108 -42675 -40372 -50915
15850 -50915 -73462 -64057 -52351 -42657 -14640 -14028 -10541 -27482 -22950 -13010 -6417 23401 39162
15837 39162 8197 -12016 -12297 -6353 8003 -5589 11263 322 -18752 -32697 -37915 -32394 -39744
15824 -39744 -30134 -19668 1690 1482 -13458 -15749 -22272 -22471 -20139 5347 3969 10212 8926 9933
$$ packed form
15913A8094N837J2075j0542r596j5214J1317n022l972P662J3953O631l1994j6232
15900a7003k751K0712j2740j2016J5922K0284l207k9384R715m141J5039j9361
15888a8931j3245k8436J1259J9860J9735P942p932o106j1444J9758P280j6595
15876a6855m302J9769J4223j1338o462M440P508j6631l6858o525R283O389J4116
15863b3243J2105P072j4808M342o317J437L706k2700o217O515m567K303j0543
15850e0915k2547R405J1706R694K8017O12L487j6941M532R940O593K9818J5761
15837C9162l0965k0213k81N944J4356j3592J6852j0941j9074j3945n218N521p350
15824c9744R610J0466K1358k08j4940k291o523j99K332K5486j378O243j286J007
$$ plain form
15810 9933 -4902 -16068 -21365 -24769 -2566 18030 -2179 -23153 -48746 -50619 -36988 -12703
15798 -12703 -31791 -50990 -54697 -46786 -45683 -27922 -16860 -15882 -18166 -25851 -27394 -36570 -21045
15785 -21045 -21071 -38091 -52818 -20541 -28089 -32798 -11387 10005 22811 20687 626 -15716 -21342
15772 -21342 -11965 -1759 -1037 -16766 -25457 -32289 -42925 -61842 -47210 -33205 -22144 -23282 -33634
15759 -33634 -40361 -10557 13290 -6025 -15630 -9850 -27786 -24660 -12905 -15916 -25151 -29813 -16667
15746 -16667 -16821 -9692 -14668 -22655 -25945 -47108 -39411 -22192 -8569 -2750 -20341 -26883 -25172 -22589
15732 -22589 -13922 -19862 1854 -3584 -21415 -37649 -33924 -26795 -35210 -45519 -47814 -26246 -15422
15719 -15422 -37410 -33090 -3760 -19074 -26140 -18378 -24203 -32745 -47364 -54374 -34871 -8230 16297
$$ packed form
15810I933j4835j1166n297l404K2203K0596k0209k0974k5593j873J3631K4285
15798a2703j9088j9199l707P911J103J7761J1062R78k284p685j543r176J5525
15785b1045k6j7020j4727L2277p548m709K1411K1392J2806k124k0061j6342n626
15772b1342R377J0206P22j5729q691o832j0636j8917J4632J4005J1061j138j0352
15759c3634o727K9804K3847j9315r605N780j7936L126J1755l011r235m662J3146
15746a6667j54P129m976p987l290k1163P697J7219J3623N819j7591o542J711K583
15732b2589Q667n940K1716n438j7831j6234L725P129q415j0309k295K1568J0824
15719a5422k1988M320K9330j5314p066P762n825q542j4619p010J9503K6641K4527
$$ plain form
15706 16297 35467 18828 19604 28021 7840 -7352 -5005 -13723 -18027 -3166 -8126 -15313 -1745
15693 -1745 816 -12373 -23636 -45690 -39913 -44192 -26605 -24089 -42728 -32426 -15081 5377 30291
15680 30291 29152 5748 -14397 -41273 -57010 -35918 -41574 -17602 4067 2112 2172 12589 4090
15667 4090 -3587 291 -32851 -60803 -38191 -16429 -6746 -880 14400 5601 -1397 -9697 -16994
15654 -16994 -39603 -61282 -29792 -6080 -12643 -7314 -19184 -34865 -5052 7029 8127 4508
15642 4508 7 671 -15221 -3322 19 -13059 -30806 -8519 21229 6398 -890 3395 12068
15629 12068 8183 12452 -1228 4505 1663 2745 18616 18277 14166 -9248 -14510 -5659 10158 -1195
15615 -1195 -18203 -13971 -3862 -8572 -25821 -55657 -45032 -34416 -21649 -3451 -3323 8050 11175
$$ packed form
15706A6297J9170j6639P76Q417k0181j5192K347q718m304J4861m960p187J3568
15693a745K561j3189j1263k2054N777m279J7587K516j8639J0302J7345K0458K4914
15680C0291j139k3404k0145k6876j5737K1092n656K3972K1669j955O0J0417q499
15667D090p677L878l3142k7952K2612K1762R683N866J5280q799o998q300p297
15654a6994k2609k1679L1490K3712o563N329j1870j5681K9813J2081J098l619
15642D508m501O64j5892J1899L341j3078j7747K2287K9748j4831p288M285Q673
15629A2068l885M269j3680N733k842J082J5871l39m111k3414n262Q851J5817j1353
15615a195j7008M232J0109m710j7249k9836J0625J0616J2767J8198J28J1373L125
$$ plain form
15602 11175 5622 19583 18518 20227 39931 -10950 -35737 -47203 -57669 -54383 -49206 -61198 -48279
15589 -48279 -15981 -8725 -1850 -18577 -20682 -37541 -45841 -37803 -44407 -42618 -37791 -26189 -20192
15576 -20192 -18551 -31037 -38888 -22364 -24105 -29418 -10433 10762 23382 27053 -2228 -8226 -18169
15563 -18169 -37055 -30846 -39755 -61174 -64004 -38544 -35432 -34083 -18131 -36315 -41559 -55331 -52488
15550 -52488 -55108 -51827 -53396 -163 -2268 -1143 -8487 -10588 -46565 -53889 -47094 -30859 -37064 -60418
15536 -60418 -64095 -56118 -59044 -62560 -40600 -7831 -21721 -25221 -8220 -32615 -55265 -42401 -22102
15523 -22102 -42379 -56193 -27847 1518 4114 3651 -11368 -19840 -22798 -28692 -25683 -4330 8035
15510 8035 5681 -17551 -36761 -35293 -2832 14436 23066 -663 -13560 -11680 -14127 -36593 -29210
$$ packed form
15602A1175n553J3961j065J709J9704n0881k4787j1466j0466L286N177j1992J2919
15589d8279L2298P256O875j6727k105j6859q300Q038o604J789M827J1602N997
15576b0192J641j2486p851J6524j741n313J8985K1195J2620L671k9281n998r943
15563a8169j8886O209q909k1419k830K5460L112J349J5952j8184n244j3772K843
15550e2488k620L281j569N3233k105J125p344k101l5977p324O795J6235o205k3354
15536f0418l677P977k926l516K1960L2769j3890l500J7001k4395k2650J2864K0299
15523b2102k0277j3814K8346K9365K596m63j5019q472k958n894L009K1353J2365
15510H035k354k3232j9210J468L2461J7268Q630k3729j2897J880k447k2466P383
$$ plain form
15497 -29210 -43350 -39916 -16824 -31491 -40102 -59959 -58882 -32359 -13590 -16697 -18554 -10706 -6558
15484 -6558 1051 -29891 -51537 -57594 -67871 -39810 -32094 -48504 -55093 -15594 -2876 1077 6936
15471 6936 4948 12524 15499 3719 -10538 -12488 -16850 -15247 -32778 -32501 -35002 -37631 -20622 -10177
15457 -10177 -26506 -22162 -24641 -42428 -39002 -57513 -61534 -23759 -13767 -27029 -46357 -30806 -25204
15444 -25204 -26573 -12878 569 -13684 -36407 -67050 -88501 -73144 -31446 -18032 -28882 -34415
15432 -34415 -24317 -11862 -3022 8269 26903 39602 25721 -12641 -46133 -71944 -47598 -12630
15420 -12630 -10826 -8011 -6094 -13180 -24521 -26736 -14426 -20310 -30360 -49103 -43161 -48366 -55016
15407 -55016 -79730 -52821 -32220 -42127 -34988 -46237 -49495 -41904 -19465 -17565 -21426 -39705 -30167
$$ packed form
15497b9210j4140L434K3092j4667q611j9857J077K6523J8769l107j857P848M148
15484f558P609l0942k1646o057j0277K8061P716j6410o589L9499J2718L953N859
15471F936j988P576K975j1780j4257j950m362J603j7531K77k501k629J7009J0445
15457a0177j6329M344k479j7787L426j8511m021L7775R992j3262j9328J5551N602
15444b5204j369J3695J3447j4253k2723l0643k1451J5357M1698J3414j0850n533
15432c4415J0098J2455Q840J1291J8634J2699j3881l8362l3492k5811K4346L4968
15420a2630J804K815J917p086j1341k215J2310n884j0050j8743N942n205o650
15407e5016k4714K6909K0601r907P139j1249l258P591K2439J900l861j8279R538
$$ plain form
15394 -30167 -10489 -37536 -37687 -60441 -80731 -81436 -72327 -67645 -71029 -45890 -27673 -19411 -11165
15381 -11165 -31655 -37851 -23141 -25882 -21971 -11472 -45020 -44400 -41647 -19690 -27647 -27582 -8637 -9120
15367 -9120 -27710 869 -10554 -24352 -22960 -38711 -67376 -43914 -30126 -18944 -14499 -19988
15355 -19988 -46433 -61641 -38844 -8927 -3878 -8646 -33879 -30187 -16997 -6789 10232 23633
15343 23633 15212 -6903 7661 -8001 -16517 -27393 -31598 -21859 -20378 -26137 -31589 -27715 -14885
15330 -14885 6446 -13512 5547 14738 421 15345 35761 26380 -6422 -22454 -37048 -52407
15318 -52407 -46020 -40270 -11627 11496 18722 20853 4291 -19262 -43303 -48068 -50747 -28957 -28099
15305 -28099 -24753 -25543 -9284 1460 -5346 -11266 9459 -3377 -14888 14816 35576 36205 42626
$$ packed form
15394c0167J9678k7047j51k2754k0290p05R109M682l384K5139J8217Q262Q246
15381a1165k0490o196J4710k741L911J0499l3548O20K753K1957p957O5J8945m83
15367i120j8590K8579j1423j3798J392j5751k8665K3462J3788J1182M445n489
15355a9988k6445j5208K2797K9917N049m768k5233L692J3190J0208J7021J3401
15343B3633q421k2115J4564j5662q516j0876m205R739J481n759n452L874J2830
15330a4885K1331j9958J9059R191j4317J4924K0416r381l2802j6032j4594j5359
15318e2407O387N750K8643K3123P226K131j6562k3553k4041m765k679K1790Q58
15305b8099L346p90J6259J0744o806n920K0725j2836j1511K9704K0760O29O421
$$ plain form
15292 42626 44194 30062 34949 42616 32748 11967 -2028 -16671 -31492 -13032 -15434 -39095 -56109
15279 -56109 -77005 -98764 -79977 -59544 -67239 -61544 -40327 -23689 -18494 -22088 -13225 -17856 -23392
15266 -23392 -35486 -44539 -31857 -27048 -706 7853 -3390 -24635 -49044 -61500 -53040 -25470
15254 -25470 -20755 -30145 -10971 -8804 5716 7085 4735 -964 -18548 -36571 -31683 -11860 4476
15241 4476 9489 -29403 -36389 -50071 -31608 -792 -7078 -14324 -14630 -8050 -12626 -29490 -43551
15228 -43551 -30683 -27215 -21713 -19538 -14566 -1743 19532 -11170 -23644 -3536 7191 19948
15216 19948 36929 -2952 -38836 -54665 -55435 -46782 -36962 -20009 -22387 -37639 -14492 -2733 6981
15203 6981 -3744 5234 -1042 -25715 -16959 -422 -22373 -30525 -39312 -37092 -10307 16196 8317
$$ packed form
15292D2626J568j4132M887P667r868k0781j3995j4643j4821J8460k402k3661j7014
15279e6109k0896k1759J8787K0433p695N695K1217J6638N195l594Q863m631n536
15266b3392j2094r053J2682M809K6342Q559j1243k1245k4409j2456Q460K7570
15254b5470M715r390J9174K167J4520J369k350n699j7584j8023M888J9823J6336
15241D476N013l8892o986j3682J8463L0816o286p246l06O580m576j6864j4061
15228d3551J2868L468N502K175M972J2823K1275l0702j2474K0108J0727J2757
15216A9948J6981l9881l5884j5829p70Q653R820J6953k378j5252K3147J1759R714
15203F981j0725Q978o276k4673Q756J6537k1951q152q787K220K6785K6503p879
$$ plain form
15190 8317 -29530 -25072 -31204 5645 -12863 -36151 -27383 -36238 -36301 -67803 -86891 -82097 -71200
15177 -71200 -47204 -35479 -21747 -29001 -29946 -27149 -33163 -39061 -42415 -43535 -14260 1406 264
15164 264 -32075 -50701 -57648 -60396 -53127 -25798 -14292 22224 25709 -9759 -25478 -51684 -43626
15151 -43626 -33082 -34043 -70678 -57258 -31085 -17012 -763 -21284 -38803 -34135 -47583 -40023
15139 -40023 -61505 -67724 -46110 -22245 -14924 -10481 -18336 -4259 -20407 -31882 -34358 -21085 -23990
15126 -23990 -51084 -51190 -7488 11388 3708 -10926 -13707 -30215 -32835 -24478 -31328 -31299 -55074 -69678
15112 -69678 -68441 -65453 -52296 -59777 -60275 -50489 -38714 -18737 -10665 -1133 8736 -21439 -34538
15099 -34538 -20191 -21244 -50765 -69177 -41196 -32152 -34954 -33742 -37918 -20216 1979 442 -9171
$$ packed form
15190H317l7847M458o132L6849j8508k3288Q768q855o3l1502j9088M794J0897
15177g1200K3996J1725J3732p254r45K797o014n898l354j120K9275J5666j142
15164B64l2339j8626o947k748P269K7329J1506L6516L485l5468j5719k6206Q058
15151d3626J0544r61l6635J3420K6173J4073J6249k0521j7519M668j3448P560
15139d0023k1482o219K1614K3865P321M443p855J4077j6148j1475k476J3273k905
15126b3990k7094j06M3702J8876p680j4634k781j6508k620Q357o850K9k3775j4604
15112f9678J237K988J3157p481m98R786J1775J9977Q072R532R869l0175j3099
15099c4538J4347j053k9521j8412K7981R044k802J212m176J7702K2195j537r613
$$ plain form
15086 -9171 -14447 -34252 -21900 -11959 -50886 -77205 -72071 -58550 -26323 -23256 -38899 -42355 -27998
15073 -27998 -34631 -25810 -14216 -8024 -20214 -19795 -3771 7671 3802 -3785 -18706 -27695 -48633
15060 -48633 -49382 -49165 -36657 -19310 -32193 -20499 -7994 2739 5319 2373 12614 8858 1675
15047 1675 14247 17956 17863 16770 18005 32447 7056 -20050 -11665 1575 -17463 -20786 -29181 -52174
15033 -52174 -39064 -32405 -40585 -52853 -55481 -62644 -28928 518 10764 22748 31592 21786 -7252
15020 -7252 -29815 -30283 -40038 -65647 -69549 -57860 -65595 -63979 -51419 -21853 510 8553 4463
15007 4463 -12306 -15600 -12820 -16524 -25670 -32015 -29063 -34044 -30944 -31495 -13538 -35715 -62268 -38770
14993 -38770 -52332 -50543 -43736 -14420 -4103 -16399 -30203 -39380 -35922 -32173 -22087 -24435 -26613
$$ packed form
15086i171n276j9805J2352R941l8927k6319N134J3521L2227L067j5643l456J4357
15073b7998o633Q821J1594O192j2190M19J6024J1442l869p587j4921q989k0938
15060d8633p49K17J2508J7347j2883J1694J2505J0733K580k946J0241l756p183
15047A675J2572L709r3j093J235J4442k5391k7106Q385J3240j9038l323q395k2993
15033e2174J3110O659q180j2268k628p163L3716K9446J0246J1984Q844r806k9038
15020g252k2563m68r755k5609l902J1689p735J616J2560K9566K2363Q043m090
15007D463j6769l294K780l704r146o345K952m981L100n51J7957k2177k6553K3498
14993c8770j3562J789O807K9316J0317j2296j3804r177L458L749J0086k348k178
$$ plain form
14980 -26613 -31244 -17853 -1993 -31305 -27630 -45677 -73335 -60447 -36370 -39752 -27500 -20305
14968 -20305 -55725 -48160 -10547 31 -4933 3936 27974 12116 -22143 -16102 -29405 -36169 -23919
14955 -23919 -46732 -34899 -31584 -43152 -42438 -29684 -16528 -9944 -11471 -10058 -37193 -37696 -25190
14942 -25190 -18911 -43085 -43108 -28336 -5845 20174 34143 15541 -4359 22421 31163 -1317 -22472
14929 -22472 -20042 -17611 -9705 -25943 -31235 -13413 -16859 -11817 -19727 -28309 -13593 -24508 -41094
14916 -41094 -45657 -59255 -44484 -10554 -6038 -11008 -48247 -61235 -62451 -71477 -48762 -43668 -33341
14903 -33341 -31720 -32226 -42379 -35990 -11935 21091 3124 -23628 -24147 -40786 -37961 -47186 -48926
14890 -48926 -35010 -63054 -48637 -26653 -38323 -7863 4573 6567 -5337 -7113 1913 -9627
$$ packed form
14980b6613m631J3391J5860k9312L675j8047k7658J2888K4077l382J2252P195
14968b0305l5420P565L7613J0578m964Q869K4038j5858l4259O041j3303o764J2250
14955b3919k2813J1833L315j1568P14J2754J3156O584j527J413k7135n03J2506
14942b5190O279k4174k3J4772K2491K6019J3969j8602j9900K6780Q742l2480k1155
14929b2472K430K431P906j6238n292J7822l446N042p910q582J4716j0915j6586
14916d1094m563j3598J4771L3930M516m970l7239j2988j216r026K2715N094J0327
14903c3341J621n06j0153O389K4055L3026j7967k6752n19j6639K825r225j740
14890d8926J3916k8044J4417K1984j1670L0460J2436J994j1904j776R026j1540
$$ plain form
14878 -9627 -10933 -13141 -14105 -2332 12191 2504 -12411 -34145 -32385 -22949 -40903 -45760 -22447
14865 -22447 -26131 -29579 -20998 900 4632 -31951 -36547 -44558 -57733 -33683 -12717 -15788 -40320
14852 -40320 -58363 -44175 -25821 -11910 -27745 -32620 -11209 -3872 -16253 -30525 3101 19760
14840 19760 24737 13294 -19901 -39998 -44550 -31396 -35444 -34084 -43603 -25370 -15483 -4795 -1745
14827 -1745 -17637 -28027 -31613 7365 41349 44182 7876 -9596 -23854 -51900 -30502 -25824
14815 -25824 -10951 5055 -3427 -46909 -32719 -47489 -59301 -7162 28759 21743 -8801 -18934
14803 -18934 -38327 -67064 -77343 -60965 -61259 -54406 -60414 -45138 -46911 -66031 -54192 -44125 -57996
14790 -57996 -65453 -49793 -31586 -25892 -19551 -10911 -799 20885 21948 12586 15182 30404 47062
$$ packed form
14878i627j306k208r64J1773J4523r687j4915k1734J760R436j7954m857K3313
14865b2447l684l448Q581K1898L732l6583m596q011j3175K4050K0966l071k4532
14852d0320j8043J4188J8354J3911j5835m875K1411P337j2381j4272L3626J6659
14840A9760M977j1443l3195k0097m552J3154m048J360r519J8233R887J0688L050
14827a745j5892j0390l586L8978L3984K833l6306j7472j4258k8046K1398M678
14815b5824J4873J6006q482m3482J4190j4770j1812N2139L5921p016l0544j0133
14803a8934j9393k8737j0279J6378k94O853o008J5276j773j9120J1839J0067j3871
14790e7996p457J5660J8207N694O341Q640J0112K1684J063r362K596J5222J6658
$$ plain form
14777 47062 43077 41907 11695 -4179 -1416 -24116 -52720 -44363 -32747 -27528 -28908 -18529 -23187
14764 -23187 -24367 -36851 -51823 -44888 -20960 3796 28599 17464 -26236 -40331 -16402 -1013
14752 -1013 -23517 -9546 -20684 -46104 -73649 -76519 -82806 -72058 -64450 -60501 -39723 -30470 -25218
14739 -25218 -24744 -46990 -39947 -26512 -22395 -32062 -38332 -45635 -50425 -32927 -24332 -45265 -55921
14726 -55921 -76678 -76934 -79468 -80168 -47057 -20683 -17528 -14617 -13528 -13106 -27589 -25759 -41619 -40946
14712 -40946 -35767 -23163 -21445 -30571 -54531 -66822 -64235 -41846 -22032 -14992 2028 6235 -1367
14699 -1367 18510 17684 -4997 -11215 -6198 -12908 -21596 -17709 -12993 -27243 -17008 10182 20737
14686 20737 -2604 3559 24432 29288 28341 7979 9411 706 -16347 350 866 -20501 -10598
$$ packed form
14777D7062l985j170l0212j5874K763k2700k8604Q357J1616N219j380J0379m658
14764b3187j180j2484j4972O935K3928K4756K4803j1135m3700j4095K3929J5389
14752a013k2504J3971j1138k5420k7545k870o287J0748P608L949K0778R253N252
14739b5218M74k2246P043J3435M117r667o270p303m790J7498Q595k0933j0656
14726e5921k0757k56k534p00L3111K6374L155K911J089M22j4483J830j5860O73
14712d0946N179J2604J718r126k3960j2291K587K2389J9814P040J7020M207p602
14699a367J9877q26k2681o218N017o710q688L887M716j4250J0235K7190J0555
14686B0737k3341O163K0873M856r47k0362J432q705j7053J6697N16k1367R903
$$ plain form
14673 -10598 2729 -9331 -28638 -16770 -19531 -28935 -43680 -50853 -77929 -56670 -45089 -33705
14661 -33705 -31577 -34562 -22924 -27608 -53442 -31060 -13471 -28909 -30624 -63111 -76063 -69545 -61627
14648 -61627 -51578 -47162 -58084 -52178 -41625 -51709 -62188 -59932 -48685 -46583 -42580 -31216 -14805
14635 -14805 -23582 -48260 -36743 -1775 6212 -11717 -14857 -41322 -61131 -48347 -34684 -13871
14623 -13871 3437 15569 -13776 -29110 4824 15965 7731 -6063 -25308 -51425 -44681 -20993
14611 -20993 -17800 6841 7913 -4051 -5606 -26038 -58379 -75977 -69154 -52596 -37064 -53897
14599 -53897 -54362 -53183 -65386 -71013 -70946 -56587 -37269 -13466 3870 25177 6004 -6516 15378
14586 15378 6291 -25072 -27844 -25850 -12784 10066 21173 34870 37658 17123 -4918 -24095
$$ packed form
14673a0598J3327j2060j9307J1868k761r404j4745p173k7076K1259J1581J1384
14661c3705K128k985J1638m684k5834K2382J7589j5438j715l2487j2952O518P918
14648f1627J0049M416j0922N906J0553j0084j0479K256J1247K102M003J1364J6411
14635a4805q777k4678J1517L4968P987j7929l140k6465j9809J2784J3663K0813
14623a3871J7308J2132k9345j5334L3934J1141q234j3794j9245k6117O744K3688
14611b0993L193K4641J072j1964j555k0432l2341j7598O823J6558J5532j6833
14599e3897m65J179j2203n627O7J4359J9318K3803J7336K1307j9173j2520K1894
14586A5378r087l1363k772J994J3066K2850J1107J3697K788k0535k2041j9177
$$ plain form
14574 -24095 -35317 -39257 -29845 -10350 842 29458 47612 37321 11731 182 -1882 -16209
14562 -16209 5024 3255 -6375 -12978 -29013 -15152 1590 681 11421 1822 -20810 -17129 -25143
14549 -25143 -20037 -30056 -27587 -13244 -37214 -35780 -18048 -33244 -48145 -42349 -24455 -21617 -32909
14536 -32909 -12896 2322 21634 19791 242 -13402 -32833 -60662 -77039 -80579 -66192 -54240
14524 -54240 -71061 -59993 -61253 -60431 -63023 -80835 -78980 -50608 -51002 -68299 -69258 -55609 -29424
14511 -29424 -52529 -68658 -62553 -47064 -40060 -33485 -31257 -30023 -35512 -32587 -24217 -39528 -24903
14498 -24903 -2016 4538 6981 -627 -11590 -13195 -13104 -22378 -46239 -50642 -50917 -30718 -26872 -28290
14484 -28290 -26383 -14894 -18485 -13317 -31369 -35594 -20690 -10777 2751 7734 11238 4898 -22540
$$ packed form
14574b4095j1222l940R412J9495J1192K8616J8154j0291k5590j1549k064j4327
14562a6209K1233j769r630o603j6035J3861J6742r09J0740r599k2632L681q014
14549b5143N106j0019K469J4343k3970J434J7732j5196j4901N796J7894K838j1292
14536c2909K0013J5218J9312j843j9549j3644j9431k7829j6377l540J4387J1952
14524e4240j6821J1068j260Q22k592j7812J855K8372l94j7297r59J3649K6185
14511b9424k3105j6129O105J5489P004O575K228J234n489K925Q370j5311J4625
14498b4903K2887O554K443p608j0963j605R1r274k3861m403k75K0199L846j418
14484b8290J907J1489l591N168j8052m225J4904R913J3528M983L504o340k7438
$$ plain form
14471 -22540 -4858 -22121 -36289 -27505 -5466 -19540 -27531 -29864 -9276 13357 -3216 -15494
14459 -15494 -27171 -24820 -20148 -27787 -25329 -26990 560 33543 11651 -16003 -56784 -62175 -52923
14446 -52923 -60325 -40205 -23769 -19214 -16594 -23081 -11671 -5558 -20760 -19352 -15920 -29749 -29311
14433 -29311 -16438 16533 18063 20614 37313 5450 -25394 -21698 -17122 -16694 -12753 12771 7187
14420 7187 -32592 -27021 -28618 -36107 -35653 -26053 -27691 -28164 -25902 -52636 -72463 -48315 -25241 -12918
14406 -12918 -3906 -7191 -7479 -1668 -18257 -24933 -12194 4104 7312 6525 -15272 -40059 -41934 -38707
14392 -38707 -54219 -59799 -37438 -33762 -28476 -38034 -30205 -37973 -28253 -4673 7007 6420 -18081
14379 -18081 -8631 -27293 -46910 -63829 -65727 -22365 -23737 -22307 -17133 -21425 -67321 -79196 -65420
$$ packed form
14471b2540J7682j7263j4168Q784K2039j4074p991k333K0588K2633j6573j2278
14459a5494j1677K351M672p639K458j661K7550L2983k1892k7654m0781n391R252
14446e2923p402K0120J6436M555K620o487J1410O113j5202J408L432j3829M38
14433b9311J2873L2971J530K551J6699l1863l0844L696M576M28L941K5524n584
14420G187l9779N571j597p489M54R600j638m73K262k6734j9827K4148K3074J2323
14406a2918R012l285k88N811j6589o676J2739J6298L208p87k1797k4787j875L227
14392c8707j5512n580K2361L676N286r558P829p768R720K3580J1680n87k4501
14379a8081R450j8662j9617j6919j898M3362j372J430N174m292m5896j1875J3776
$$ plain form
14366 -65420 -54875 -59235 -65591 -47193 -20336 4161 25428 28620 13526 3335 -15772 -23500
14354 -23500 -27376 -19255 -14427 -21742 -21220 7518 30589 24942 21721 10361 -4794 -16192 -32911
14341 -32911 -23058 17501 38998 26164 -14211 -40263 -25995 334 2590 26031 42770 7961
14329 7961 -30987 -42426 -29388 -15448 -8768 2785 8257 2495 -15290 -17037 -2082 -8568 -30206
14316 -30206 -38783 -37228 -33078 -38240 -16055 -28206 -27295 -27524 -18024 -14043 -8170 -9544 -14641 -16185
14302 -16185 -30502 -8129 -2547 -19266 -10269 -31705 -49643 -50094 -32840 -25264 -24731 -15501 14692
14289 14692 15496 21746 26286 17554 -7491 12923 15562 27000 18077 -8743 11626 16344 16893 33827
14275 33827 27442 5984 -15199 -9747 -11992 -24233 -22761 -15391 -1348 -6016 11742 -8651 -18133
$$ packed form
14366f5420J0545m360o356J8398K6857K4497K1267L192j5094j0191j9107p728
14354b3500l876Q121M828p315N22K8738K3071n647l221j1360j5155j1398j6719
14341c2911R853M0559K1497j2834m0375k6052J4268K6329K256K3441J6739l4809
14329G961l8948j1439J3038J3940O680J1553N472n762j7785j747J4955o486k1638
14316c0206q577J555M150n162K2185j2151R11k29R500L981N873j374n097j544
14302a6185j4317K2373N582j6719Q997k1436j7938m51J7254P576N33R230L0193
14289A4692Q04O250M540q732k5045K0414K639J1438q923k6820K0369M718N49J6934
14275C3827o385k1458k1183N452k245j2241J472P370J4043m668J7758k0393r482
$$ plain form
14262 -18133 -4634 -3143 6189 23961 16242 3543 27829 60459 54697 10144 -6410 -3093 4593
14249 4593 12316 19345 29617 56490 72420 69664 77653 100564 132413 156705 176172 185387 192600
14236 192600 242412 299163 347949 381498 398197 431014 470864 548468 643698 734624 815128
14225 815128 893210 952566 990480 1036051 1036991 1026114 1013800 981573 945104 910527 863509 852771
14213 852771 799658 732673 660919 586659 497661 418671 348678 297905 277669 227478 172004
14202 172004 138205 116073 120257 108334 93501 79583 80151 93117 81917 57193 39808 38163
14190 38163 27436 51610 74894 54270 16067 6464 -720 2907 14216 34479 38753 14969
14178 14969 -6433 947 21195 6087 -4833 -7551 1236 17294 23678 25777 17828 22184 19475
$$ packed form
14262a8133J3499J491R332J7772p719j2699K4286L2630n762m4553j6554L317P686
14249D593P723P029J0272K6873J5930k756P989K2911L1849K4292J9467R215P213
14236A92600M9812N6751M8786L3549J6699L2817L9850P7604R5230R0926Q0504
14225H15128P8082N9356L7914M5571R40j0877j2314l2227l6469l4577m7018j0738
14213H52771n3113o6985p1754p4260q8998p8990o9993n0773k0236n0191n5474
14202A72004l3799k2132M184j1923j4833j3918N68J2966j1200k4724j7385j645
14190C8163j0727K4174K3284k0624l8203r603p184L627J1309K0263M274k3784
14178A4969k1402P380K0248j5108j0920k718Q787J6058O384K099p949M356k709
$$ plain form
14165 19475 -6236 -18993 -11709 -23828 -38478 -26231 -21739 -36596 -30111 -25405 -9619 6521
14153 6521 30200 42807 73579 82559 51594 6941 -3959 -10630 14413 12109 9927 -9541 -23875
14140 -23875 -26758 -25185 -8220 9418 26107 1964 -11433 -16792 -13168 369 -10052 -18059 -10703
14127 -10703 -14371 -23665 -5997 1166 -2849 21855 20702 4040 -10854 -37926 -47577 -58196 -50283
14114 -50283 -19953 -22865 -30611 -31668 -30014 -39722 -34966 -15797 -22390 -28918 -30667 -25351 -15172 -29747
14100 -29747 -58510 -67564 -74550 -57707 -39870 -44691 -37168 -62243 -79192 -65509 -65975 -51180 -45925
14087 -45925 -66555 -92190 -81373 -72298 -56438 -19491 -10834 -27475 -28536 -28790 -42327 -71923 -41764
14074 -41764 -13042 -2486 3778 10672 28753 -1081 -14246 11226 33255 58566 81958 93924
$$ packed form
14165A9475k5711j2757P284j2119j4650J2247M492j4857O485M706J5786J6140
14153F521K3679J2607L0772Q980l0965m4653j0900o671K5043k304k182j9468j4334
14140b3875k883J573J6965J7638J6689k4143j3397n359L624J3537j0421q007P356
14127a0703l668r294J7668P163m015K4704j153j6662j4894k7072r651j0619P913
14114e0283L0330k912p746j057J654r708M756J9169o593o528j749N316J0179j4575
14100b9747k8763r054o986J6843J7837m821P523k5075j6949J3683m66J4795N255
14087d5925k0630k5635J0817R075J5860L6947Q657j6641j061k54j3537k9596L0159
14074d1764K8722J0556O264O894J8081k9834j3165K5472K2029K5311K3392J1966
$$ plain form
14062 93924 93047 68627 20940 -2859 -2720 3055 10372 167 -8033 9303 20986 11766 1904
14049 1904 6943 15102 7090 12 -8561 -4491 15003 25761 -11775 -44137 -17598 8647 -12647
14036 -12647 -49900 -59836 -47811 -19374 -7206 -14158 -24009 -34367 -25781 -29882 -9509 13436 37033
14023 37033 1383 -4798 6046 9029 31454 63803 103775 117514 170382 251631 356064 492340
14011 492340 651997 792736 882044 942111 988565 1001508 979763 886711 749780 626599 533969
14000 533969 445689 333434 262685 191728 140515 130848 133653 138300 149939 129803 111956 106983
13988 106983 100555 58711 28765 14885 35879 31087 11104 1481 3625 13962 24687 -7689
13976 -7689 -11185 -3971 -18693 -25020 -11025 -20924 -30305 -39435 -40523 -35366 -13147 -22312 -37780 -42969
$$ packed form
14062I3924q77k4420m7687k3799J39N775P317j0205q200J7336J1683r220r862
14049A904N039Q159q012p078q573M070J9494J0758l7536l2362K6539K6245k1294
14036a2647l7253r936J2025K8437J2168o952r851j0358Q586m101K0373K2945K3597
14023C7033l5650o181J0844K983K2425L2349L9972J3739N2868Q1249J04433J36276
14011D92340J59657J40739Q9308O0067M6454J2943k1745r3052j36931j23181r2630
14000E33969q8280j12255p0749p0957n1213r667K805M647J1639k0136j7847m973
13988A06983o428m1844k9946j3880K0994m792j9983r623K144J0337J0725l2376
13976g689l496P214j4722o327J3995r899r381r130j088N157K2219r165j5468n189
$$ plain form
13962 -42969 -50059 -36924 -25700 -14222 -38057 -36948 -22197 -25030 -2099 13096 -9501 -29891
13950 -29891 -33522 -34593 -12018 -342 -17303 -24956 -8288 -17450 -26011 -20180 -20286 15411 24478
13937 24478 42690 30441 14954 -2237 -25507 -39037 -57565 -54169 -34706 -37000 -32576 -13964
13925 -13964 -5382 -4564 -8839 -5685 -2734 -9925 -17354 -24675 -32465 -15703 -6178 3206 -16463 -27972
13911 -27972 -38265 -52422 -28495 -21584 -44054 -48354 -57664 -40527 -39814 -61688 -44687 -26389 -10474
13898 -10474 -17952 -18344 -1505 -10445 -39578 -26499 -29781 -39714 -40719 -22011 -24211 -35663 -52120
13885 -52120 -72946 -44824 -5030 -19127 -36674 -17409 -24611 -24518 -43498 -43616 -21792 -19623 -15569
13872 -15569 -1064 -17795 -28191 -18863 -41683 -54939 -54886 -34013 -30852 -54714 -53738 -15400 2100
$$ packed form
13962d2969p090J3135J1224J1478k3835J109J4751k833K2931J5195k2597k0390
13950b9891l631j071K2575J1676j6961p653J6668r162q561N831j06L5697R067
13937B4478J8212j2249j5487j7191k3270j3530j8528L396J9463k294M424J8612
13925a3964Q582Q18m275L154K951p191p429p321p790J6762R525R384j9669j1509
13911b7972j0293j4157K3927O911k2470m300r310J7137P13k1874J7001J8298J5915
13898a0474p478l92J6839q940k9133J3079l282r933j005J8708k200j1452j6457
13885e2120k0826K8122L9794j4097j7547J9265p202R3j8980j18K1824K169M054
13872a5569J4505j6731j0396R328k2820j3256N3K0873L161k3862R76L8338J7500
$$ plain form
13859 2100 -4374 -11209 -26046 -38859 -36658 -42207 -24295 -16220 -9127 -3148 -4627 -13323 -8745 6177
13845 6177 22385 14416 -4699 12841 29305 19115 3276 5896 -3378 9655 44100 50460 46801
13832 46801 35667 41168 39414 7290 15664 15968 -19682 -26101 -918 -7982 5409 26451 38271
13819 38271 51598 31097 12109 -17611 -11383 14763 6437 -21769 -30635 -10212 34507 49040
13807 49040 37904 11227 5958 6360 -4682 -12711 -45232 -56883 -26847 -2595 6227 -26994 -40217
13794 -40217 -11139 9526 8109 3791 -509 -1478 23437 7120 8359 25594 13568 11661 9861
13781 9861 28385 37787 4163 2202 5601 -11079 1421 -11233 -12797 -30885 -9248 -19280 -40162
13768 -40162 -52456 -55899 -51901 -29101 -16908 -26954 -33247 -7118 12697 28047 27497 27295 21414
$$ packed form
13859B100o474o835j4837j2813K201n549J7912Q075P093N979j479q696M578J4922
13845F177J6208p969j9115J7540J6464j0190j5839K620r274J3033L4445O360l659
13832D6801j1134N501j754l2124Q374L04l5650o419K5183p064J3391K1042J1820
13819C8271J3327k0501j8988k9720O228K6146q326k8206q866K0423M4719J4533
13807D9040j1136k6677n269M02j1042q029l2521j1651L0036K4252Q822l3221j3223
13794d0217K9078K0665j417m318m300r69K4915j6317J239J7235j2026j907j800
13781I861J8524R402l3624j961L399j6680J2500j2654j564j8088K1637j0032k0882
13768d0162j2294l443L998K2800J2193j0046o293K6129J9815J5350n50k02n881
$$ plain form
13755 21414 38931 32841 18107 10224 11247 -16023 -24283 -1770 4621 -10172 -16229 -16939 -15391
13742 -15391 -32329 -31796 -17651 -23177 -36391 -30100 -16927 -3822 -8312 -25035 -6942 -631 -9972
13729 -9972 -674 -1177 -38181 -43749 -24614 -19789 -13021 13194 20647 21477 -6747 -29174 -30280 -24022
13715 -24022 -39585 -45526 -25404 -33434 -50086 -43296 -9635 17009 29244 -780 -13100 -23803
13703 -23803 -39402 -21879 -10731 -33989 -47462 -39014 -43511 -42187 -47390 -34547 -43360 -27760 -7844
13690 -7844 -13698 -13655 -24437 -19607 -2875 -26542 -44982 -25181 -14255 -26820 -40508 -41181 -13821
13677 -13821 27602 14187 8833 1231 138 -6143 -34433 -21121 -44501 -37142 -4975 16405 17259
13664 17259 12774 -6013 -11716 3257 -3905 -5498 735 -4121 -14049 -10859 -3076 -5235 -8685 -10332
$$ packed form
13755B1414J7517o090j4734p883J023k7270q260K2513O391j4793o057p10J548
13742a5391j6938N33J4145n526j3214O291J3173J3105m490j6723J8093O311r341
13729i972R298n03l7004n568J9135M825O768K6215P453Q30k8224k2427j106O258
13715b4022j5563n941K0122q030j6652O790L3661K6644J2235l0024j2320j0703
13703b3803j5599J7523J1148k3258j3473Q448m497J324n203J2843q813J5600J9916
13690g844n854M3j0782M830J6732k3667j8440J9801J0926j2565j3688o73K7360
13677a3821M1423j3415n354p602j093o281k8290J3312k3380P359L2167K1380Q54
13664A7259m485j8787n703J4973p162j593O233m856r928L190P783k159l450j647
$$ plain form
13650 -10332 -15534 3551 25157 24919 48523 49352 42116 38498 47722 57421 77594 53979 68112
13637 68112 77182 91780 91741 112978 144716 180872 214691 294170 354809 396871 449983 437756
13625 437756 437724 470438 480331 474176 413775 380925 347990 305759 280609 266335 209900 165876
13613 165876 137090 89175 47236 54788 58115 53353 63526 62526 57200 64674 60645 65125 62254
13600 62254 42813 37679 54992 93901 111708 132125 129909 154998 190144 226855 230919 259212
13588 259212 278413 276878 257394 232383 170677 138512 125173 115029 81739 67529 54102 51447
13576 51447 52189 51183 54219 47318 59442 84542 102892 89032 76345 78259 69580 58293 31768
13563 31768 14478 26839 38943 37377 939 11290 38728 44566 44638 57286 59612 44191 41028
$$ packed form
13650a0332n202J9085K1606k38K3604Q29p236l618R224R699K0173k3615J4133
13637F8112R070J4598l9K1237L1738L6156L3819P9479O0639M2062N3112j2227
13625D37756l2L2714R893o155o0401l2850l2935m2231k5150j4274n6435m4024
13613A65876k8786m7915m1939P552L327m762J0173j000n326P474m029M480k871
13600F2254j9441n134J7313L8909J7807K0417k216K5089L5146L6711M064K8293
13588B59212J9201j535j9484k5011o1706l2165j3339j0144l3290j4210j3427k655
13576E1447P42j006L036o901J2124K5100J8350j3860j2687J914q679j1287k6525
13563C1768j7290J2361J2104j566l6438J0351K7438N838P2J2648K326j5421l163
$$ plain form
13550 41028 57317 47953 28163 21533 38633 42720 32283 29919 31147 39807 37423 15880 10458
13537 10458 3484 18420 45583 34613 21305 27635 27299 13921 30844 55249 61546 49319 51484
13524 51484 49321 62404 47304 37776 33239 46540 30211 65995 67218 60938 59944 52940 42509
13511 42509 48521 50765 33016 16136 22431 36598 43888 26924 7960 27686 35703 52631 66816
13498 66816 80681 77435 50324 39947 32114 36965 60417 26991 10271 -5321 13481 7196
13486 7196 -3972 -11489 -21767 -56050 -64699 -53592 -24704 -11018 638 -5263 -21127 -22863 -21530
13473 -21530 -10890 -25823 -31789 -22244 -19622 -9595 9961 5623 -4578 -9452 80 10401 11297
13460 11297 1661 9311 -20032 -56297 -56591 -19186 -21006 -31690 -21513 -14788 -11711 -11996 -2311 -3155
$$ packed form
13550D1028J6289r364j9790o630J7100M087j0437k364J228Q660k384k1543n422
13537A0458o974J4936K7163j0970j3308O330l36j3378J6923K4405O297j2227K165
13524E1484k163J3083j5100r528m537J3301j6329L5784J223o280r94p004j0431
13511D2509O012K244j7749j6880O295J4167P290j6964j8964J9726Q017J6928J4185
13498F6816J3865l246k7111j0377p833M851K3452l3426j6720j5592J8802o285
13486G196j1168p517j0278l4283q649J1107K8888J3686J1656n901j5864j736J333
13473b1530J0640j4933n966R545K622J0027J9556m338j0201m874R532J0321Q96
13460A1297r636P650k9343l6265k94L7405j820j0684J0177O725L077k85R685q44
$$ plain form
13446 -3155 -10167 -30845 -34518 -26252 -37190 -32425 -21764 -37164 -24418 -6440 10614 -1044 -1745
13433 -1745 -2691 8706 -24722 -29558 -34876 -42865 -50488 -30378 -30285 -40614 -49845 -42456 -10215 -2123
13419 -2123 3567 -21567 -31478 -22462 -1292 6526 24491 17312 -6058 643 6346 37260 72389
13406 72389 98206 108652 149167 199286 197010 169760 178792 218538 232921 244132 241667 233990
13394 233990 227552 219734 203331 197919 197055 180076 158865 113493 56694 32087 9475 -3973
13382 -3973 5928 -2338 1396 -16644 -29766 -15069 4767 10942 8709 8987 -18425 -19418 -15172 -14376
13368 -14376 -23761 -28108 -8172 -9056 -17607 -17535 -24456 -3605 54188 44944 21312 817 -5763 16283
13354 16283 33359 14954 -7790 4119 -12691 -48285 -75441 -46904 -20108 -13094 -8923 18764
$$ packed form
13446c155p012k0678l673Q266j0938M765J0661j5400J2746J7978J7054j1658p01
13433a745r46J1397l3428m836n318p989p623K0110R3j0329r231P389L2241Q092
13419b123N690k5134r911R016K1170P818J7965p179k3370O701N703L0914L5129
13406G2389K5817J0446M0515N0119k276k7250R032L9746J4383J1211k465p677
13394B33990o438p818j6403n412q64j6979k1211m5372n6799k4607k2612j3448
13382c973R901q266L734j8040j3122J4697J9836O175k233K78k7412r93M246P96
13368a4376r385m347J9936q84q551P2o921K0851N7793r244k3632k0495o580K2046
13354A6283J7076j8405k2744J1909j6810l5594k7156K8537K6796P014M171K7687
$$ plain form
13342 18764 58896 66540 74939 86793 101734 87045 70823 47829 45065 57030 34303 -7544
13330 -7544 -25747 -28828 -30159 -54692 -36464 -22237 -5055 -26097 -30563 -16480 -11144 282 -10751
13317 -10751 -35189 -34668 -11639 -5556 -27366 -37543 -14667 -6623 -8181 -10626 -11341 -3334 -4884 1677
13303 1677 -23 -21891 -39087 -55401 -36854 -19918 3406 -12775 -36987 -24489 -10244 -12475
13291 -12475 1346 -2431 -31680 -27804 -11580 5359 2394 -92 26340 39002 40775 28599 26536
13278 26536 25307 31795 7487 -8687 -10789 6148 28518 -2304 -11399 13888 31361 24826 32355
13265 32355 45351 22017 1373 -12181 -15167 -27378 -9067 26182 30144 11130 141 -28875
13253 -28875 -12963 -14031 -31412 -43330 -38900 -36926 -31660 4977 11623 -11788 -9065 -21214 -11360
$$ packed form
13342A8764M0132P644Q399J1854J4941j4689j6222k2994k764J1965k2727m1847
13330g544j8203l081j331k4533J8228J4227J7182k1042m466J4083N336J1426j1033
13317a0751k4438N21K3029O083k1810j0177K2876Q044j558k445p15Q007j550O561
13303A677j700k1868j7196j6314J8547J6936K3324j6181k4212J2498J4245k231
13291a2475J3821l777k9249L876J6224J6939k965k486K6432J2662J773j2176k063
13278B6536j229O488k4308j6174k102J6937K2370l0822r095K5287J7473o535P529
13265C2355J2996k3334k0644j3554k986j2211J8311L5249L962j9014j0989k9016
13253b8875J5912j068j7381j1918M430J974N266L6637O646k3411K723j2149R854
$$ plain form
13240 -11360 601 8470 17419 11297 -2439 3147 44526 48366 34959 33296 30215 10670 14815
13227 14815 16295 18211 27621 43491 19200 -4618 -13615 -37905 -31413 -40439 -61655 -51243 -28591
13214 -28591 -31350 -28226 -31328 -42913 -39202 -27836 -2177 11854 8220 6060 -17505 -28224 -8781
13201 -8781 -19214 -23919 -4445 4636 10358 3837 -17033 -6078 -854 460 -18113 -18232 -22054 -25125
13187 -25125 -42586 -37993 -36765 -50560 -47988 -21282 8696 36711 36406 16703 16968 25445 40260
13174 40260 15647 -1446 11235 16195 10217 -8557 -24793 -12805 -27901 -44530 -32832 57017
13162 57017 77734 50668 57681 81382 87906 113789 125432 169720 210648 252955 286654 332160
13150 332160 372228 406450 462123 472612 453810 455280 484921 534235 646314 803728 952474
$$ packed form
13240a1360J1961P869Q949o122j3736N586M1379L840j3407j663l081j9545M145
13227A4815J480J916R410J5870k4291k3818q997k4290O492r026k1216J0412K2652
13214b8591k759L124l102j1585L711J1366K5659J4031l634k160k3565j0719J9443
13201h781j0433m705J9474R081N722o521k0870J0955N224J314j8573j19l822l071
13187b5125j7461M593J228j3795K572K6706K9978K8015l05j9703K65Q477J4815
13174D0260k4613j7093J2681M960n978j8774j6236J1988j5096j6629J1698Q9849
13162E7017K0717k7066P013K3701O524K5883J1643M4288M0928M2307L3699M5506
13150C32160M0068L4222N5673J0489j8802J470K9641M9314J12079J57414J48746
$$ plain form
13139 952474 1160199 1416617 1681586 1882908 1968998 1988920 1979563 1851195 1625427 1380310
13129 1380310 1136772 926022 722650 535654 396499 283645 208671 167959 173165 155064
13119 155064 145061 147660 143538 123083 99386 73782 56423 49406 48167 34138 30138 19501
13107 19501 24708 30045 39583 47383 92614 99935 98681 100210 91467 74197 50923 32287 34989
13094 34989 51567 46475 63460 81094 73520 89850 101980 86952 45791 17701 3795 15555
13082 15555 30636 41607 50592 50848 10779 12200 10749 4174 4439 -10221 620 17554 33566
13069 33566 48635 30125 19946 18090 16304 1421 -6336 -7343 14857 33422 49285 50029 61585
13056 61585 68734 56621 19125 10893 33494 35247 29197 30826 43625 66562 63198 51853 37906
$$ packed form
13139I52474K07725K56418K64969K01322Q6090J9922r357j28368k25768k45117
13129A380310k43538k10750k03372j86996j39155j12854p4974m0712N206j8101
13119A55064j0003K599m122k0455k3697k5604j7359p017j239j4029m000j0637
13107A9501N207N337R538P800M5231P321j254J529q743j7270k3274j8636K702
13094C4989J6578n092J6985J7634p574J6330J2130j5028m1161k8090j3906J1760
13082A5555J5081J0971Q985K56m0069J421j451o575K65j4660J0841J6934J6012
13069C3566J5069j8510j0179j856j786j4883p757j007K2200J8565J5863P44J1556
13056F1585P149j2113l7496q232K2601J753o050J629J2799K2937l364j1345j3947
$$ plain form
13043 37906 46135 36456 39350 53977 35593 44045 50095 42801 22146 30562 60541 72552 88873
13030 88873 117051 146693 142905 159280 183878 204690 191808 183589 183512 172580 141792 109339 96614
13017 96614 97136 69810 57992 49935 43797 69848 84628 59936 73956 85347 74973 71310 66370
13004 66370 69719 76915 54381 38821 34272 29010 56322 36511 40010 40441 54645 43856 29122
12991 29122 39109 60576 47205 49125 56690 49471 28959 -4318 21260 47891 39846 24616 30508
12978 30508 31248 51836 51638 48909 64075 77810 92464 107644 153337 201372 220212 234461 264412
12965 264412 289263 272357 252985 222703 213125 230344 222969 210622 195814 185133 162643 129321
12953 129321 90530 59747 98856 93611 86173 71056 68846 53065 62868 61154 71709 86939
$$ packed form
13043C7906Q229r679K894J4627j8384Q452O050p294k0655Q416K9979J2011J6321
13030H8873K8178K9642l788J6375K4598K0812j2882q219p7j0932l0788l2453j2725
13017I6614N22k7326j1818q057o138K6051J4780k4692J4020J1391j0374l663m940
13004F6370L349P196k2534j5560m549n262K7312j9811L499M31J4204j0789j4734
12991B9122R987K1467j3371J920P565p219k0512l3277K5578K6631q045j5230N892
12978C0508P40K0588j98k729J5166J3735J4654J5180M5693M8035J8840J4249K9951
12965B64412K4851j6906j9372l0282r578J7219p375j2347j4808j0681k2490l3322
12953A29321l8791l0783L9109n245p438j5117k210j5781R803j714J0555J5230
$$ plain form
12941 86939 86379 70973 88127 100750 126603 117787 140461 134141 120620 102829 94646 111242 106096
12928 106096 105143 104837 94928 80480 71918 73369 99142 120562 129549 147423 151790 118668 104058
12915 104058 128537 128645 120623 110804 102018 120217 114503 92197 65547 59200 49189 17372 5251
12902 5251 -50810 -106585 -119842 -118710 -131296 -126162 -110032 -125930 -122034 -119430 -85402 -53475 -35320
12889 -35320 -37525 -37039 -36128 -24785 -11963 -25385 4475 33286 7990 -28022 -40144 -40298 -33006
12876 -33006 -35762 -47974 -98348 -121213 -126001 -141650 -151823 -156950 -137424 -120079 -109453 -67092
12864 -67092 -25927 9365 40994 74206 112938 141969 135370 169706 192574 198085 165281 140620
12852 140620 129374 158761 183080 202076 255898 282945 307106 317616 340953 373778 425172
$$ packed form
12941H6939n60j5406J7154J2623K5853q816K2674o320j3521j7791q183J6596n146
12928A06096r53l06r909j4448q562J451K5773K1420Q987J7874M367l3122j4610
12915A04058K4479J08q022r819q786J8199n714k2306k6650o347j0011l1817j2121
12902E251n6061n5775j3257J132j2586N134J6130j5898L896K604L4028L1927J8155
12889c5320k205M86R11J1343J2822j3422K9860K8811k5296l6012j2122j54P292
12876c3006k756j2212n0374k2865m788j5649j0173n127J9526J7345J0626M2361
12864f7092M1165L5292L1629L3212L8732K9031o599L4336K2868N511l2804k4661
12852A40620j1246K9387K4319J8996N3822K7047K4161J0510K3337L2825N1394
$$ plain form
12841 425172 485177 565258 590763 583550 572192 590833 597264 574876 530464 501827 477285 438129
12829 438129 419196 427837 440242 450623 448316 453164 453166 463481 447679 461877 450277 399779 342923
12816 342923 333298 303285 246833 232236 249472 282255 292687 290757 307938 305045 286750 309257
12804 309257 321557 328729 361630 363965 375617 403480 402122 425382 421697 435504 448682 474774
12792 474774 511970 516099 501376 500392 546877 624419 690921 807000 897291 942681 970940 991137
12780 991137 999378 983683 933988 879527 804366 741236 734352 738580 773420 815177 814045 813148 823930
12767 823930 823849 861103 880396 902017 935593 965861 1036816 1118756 1181429 1254245 1340795 1424975
12755 1424975 1494306 1570995 1667540 1774580 1900301 1985473 2080659 2203391 2344323 2516947
$$ packed form
12841D25172O0005Q0081K5505p213j1358J8641O431k2388m4412k8637k4542l9156
12829D38129j8933Q641J2405J0381k307M848KJ0315j5802J4198j1600n0498n6856
12816C42923r625l0013n6452j4597J7236L2783J0432j930J7181k893j8295K2507
12804C09257J2300P172L2901K335J1652K7863j358K3260l685J3807J3178K6092
12792D74774L7196M129j4723r84M6485P7542O6502J16079R0291M5390K8259K0197
12780I91137Q241j5695m9695n4461p5161o3130o884M228L4840M1757j132q97J0782
12767H23930q1L7254J9293K1621L3576L0268P0955Q1940O2673P2816Q6550Q4180
12755A424975O9331P6689R6545J07040J25721Q5172R5186J22732J40932J72624
$$ plain form
12745 2516947 2705396 2920118 3159526 3442917 3711691 4042589 4423711 4876142 5399818
12736 5399818 6019479 6764601 7655155 8692399 9920159 11387919 13123556 15124922 17364520
12727 17364520 19926563 22825813 26164861 30075311 34739480 40570603 48369758 59619838
12719 59619838 76490371 101994627 139107110 188542789 246106233 301866766 343574916
12712 343574916 364693623 368853503 362362001 346546424 319091576 280913381 237290554
12705 237290554 193616434 152666406 116417410 86975710 65254466 50369758 40358167
12698 40358167 33404008 28378417 24490111 21329682 18641380 16279011 14228562 12431753
12690 12431753 10879646 9549671 8438968 7554070 6839262 6242097 5736556 5304757 4937641
$$ packed form
12745B516947J88449K14722K39408K83391K68774L30898L81122M52431N23676
12736E399818O19661P45122Q90554J037244J227760J467760J735637K001366K239598
12727A7364520K562043K899250L339048L910450M664169N831123P799155J1250080
12719E9619838J6870533K5504256L7112483M9435679N7563444N5760533M1708150
12712C43574916K1118707M159880o491502j5815577k7454848l8178195m3622827
12705B37290554m3674120m0950028l6248996k9441700k1721244j4884708j0011591
12698D0358167o954159n025591l888306l160429k688302k362369k050449j796809
12690A2431753j552107j329975j110703q84898p14808n97165n05541m31799l67116
$$ plain form
12681 4937641 4633638 4335252 4086930 3914838 3744704 3557495 3352871 3177105 3034628
12672 3034628 2886178 2731821 2562478 2434224 2311280 2218847 2172853 2121366 2066842 1990116
12662 1990116 1902062 1842369 1814943 1779433 1728560 1671388 1622217 1561088 1500938 1432689 1393114
12651 1393114 1358480 1294051 1248527 1216822 1167518 1125895 1120052 1089699 1063600 1043767 1023702
12640 1023702 1023932 1035840 1063182 1052816 1053415 1060385 1076021 1093885 1132353 1145211 1123737 1102392
12628 1102392 1081139 1054199 1046253 1014429 962196 949608 983091 1044961 1142159 1266916 1371280
12617 1371280 1446952 1527670 1581441 1598833 1557987 1509253 1431215 1311165 1202133 1106432 1035920
12606 1035920 1004570 1016413 1002656 1011680 1005142 1022428 1125469 1246955 1349564 1465851 1575691
$$ packed form
12681D937641l04003k98386k48322j72092j70134j87209k04624j75766j42477
12672C034628j48450j54357j69343j28254j22944r2433m5994n1487n4524p6726
12662A990116q8054n9693k7426l5510n0873n7172m9171o1129o0150o8249l9575
12651A393114l4634o4429m5524l1705m9304m1623n843l0353k6099j9833k0065
12640A023702K30J1908K7342j0366N99O970J5636J7864L8468J2858k1474k1345
12628A102392k1253k6940p946l1824n2233j2588L3483O1870R7198J24757J04364
12617A371280P5672Q0718N3771J7392m0846m8734p8038j20050j09032r5701p0512
12606A035920l1350J1843j3757R024o538J7286J03041J21486J02609J16287J09840
$$ plain form
12595 1575691 1724079 1913635 2048631 2173853 2239541 2241132 2156647 2020205 1845461 1670583
12585 1670583 1521833 1340957 1163369 1025594 917993 855067 816885 830771 849919 892410
12575 892410 983487 1051900 1072788 1019280 960656 892246 800717 708269 613793 557509 489075
12564 489075 430005 397082 389646 406745 442977 508164 550021 564056 575988 593202 584166 583632
12552 583632 578631 564688 590703 600681 577884 537691 502966 492706 459778 452580 434247 437940
12540 437940 443219 447761 452357 485891 505410 525384 581908 638524 738860 802941 775971 712578
12528 712578 658751 647433 646715 668591 681926 672868 668507 631703 607964 621886 639125 655791
12516 655791 657117 638004 612294 554788 504244 488964 493621 521816 611500 737088 868930
$$ packed form
12595A575691J48388J89556J34996J25222O5688J591q4485j36442j74744j74878
12585A670583j48750j80876j77588j37775j07601o2926l8182J3886J9148M2491
12575H92410R1077O8413K0888n3508n8624o8410r1529r2448r4476n6284o8434
12564D89075n9070l2923p436J7099L6232O5187M1857J4035J1932J7214r036n34
12552E83632n001j3943K6015R978k2797m0193l4725j0260l2928p198j8333L693
12540D37940N279M542M596L3534J9519J9974N6524N6616J00336O4081k6970o3393
12528G12578n3827j1318p18K1876J3335r058m361l6804k3739J3922J7239J6666
12516F55791J326j9113k5710n7506n0544j5280M657K8195Q9684J25588J31842
$$ plain form
12505 868930 1051955 1284770 1519481 1733812 1924229 2043388 2124855 2100136 1979233 1811305
12495 1811305 1624576 1413558 1178285 958964 833411 736860 684325 629842 555037 534507
12485 534507 518088 518832 500958 485534 492066 482763 458884 456381 429826 401998 373388 349125
12473 349125 354062 378210 381195 339641 284397 264351 249828 232568 225532 239353 202083 165885
12461 165885 165512 200180 210437 215511 218410 216775 236181 264136 256946 219101 186589 181590 171797
12448 171797 165054 153136 133116 149990 166988 165667 170236 169554 161348 159641 153733 166261 167757
12435 167757 185574 178528 156017 164740 191190 206559 214150 251022 249730 253724 249533 233402 241418
12422 241418 284853 322256 369615 451710 581962 745432 873002 934260 896590 768305 634678
$$ packed form
12505H68930J83025K32815K34711K14331J90417J19159Q1467k4719j20903j67928
12495A811305j86729k11018k35273k19321j25553r6551n2535n4483p4805k0530
12485E34507j6419P44j7874j5424O532r303k3879k503k6555k7828k8610k4263
12473C49125M937K4148K985m1554n5244k0046j4523j7260p036J3821l7270l6198
12461A65885l73L4668J0257N074K899j635J9406K7955p190l7845l2512m999r793
12448A71797o743j1918k0020J6874J6998j321M569o82q206j707n908J2528J496
12435A67757J7817p046k2511Q723K6450J5369P591L6872j292L994m191j6131Q016
12422B41418M3435L7403M7359Q2095J30252J63470J27570O1258l7670j28285j33627
$$ plain form
12411 634678 540936 484054 437756 421793 430129 393826 420986 415924 443958 494561 518176 537896
12399 537896 542523 584509 631590 672165 716081 741810 752148 766438 782737 767314 727000 706213
12387 706213 708047 764244 859145 950126 1101948 1292694 1541932 1821043 2026749 2070823 1948485
12376 1948485 1688244 1402191 1200735 1029649 874961 774424 701867 648325 668295 711402
12366 711402 764536 782666 768779 742112 710989 655037 626321 603755 561905 545540 557824
12355 557824 530255 477687 435716 387438 373575 375228 378796 415231 475725 558155 652073 780720
12343 780720 934307 1043537 1018902 896486 742360 616251 506616 402023 339053 305561
12333 305561 290976 285171 264745 238067 250298 253263 249822 249679 233488 240605 244099 253618 243670
$$ packed form
12411F34678r3742n6882m6298j5963Q336l6303K7160n062K8034N0603K3615J9720
12399E37896M627M1986M7081M0575M3916K5729J0338J4290J6299j5423m0314k0787
12387G06213J834N6197R4901R0981J51822J90746K49238K79111K05706M4074j22338
12376A948485k60241k86053k01456j71086j54688j00537p2557n3542J9970M3107
12366G11402N3134J8130j3887k6667l1123n5952k8716k2566m1850j6365J2284
12355E57824k7569n2568m1971m8278j3863J653L568L6435O0494Q2430R3918J28647
12343G80720J53587J09230k4635j22416j54126j26109j09635j04593o2970l3492
12333C05561j4585n805k0426k6678J2231K965l441j43j6191P117L494R519r948
$$ plain form
12320 243670 253562 250426 226088 267219 310863 304576 300296 281057 242515 220747 212096 204158 193127
12307 193127 184578 191583 216651 206598 190384 182493 179880 178171 188662 235616 269002 287968
12295 287968 311809 318840 331337 375583 416068 511977 631367 787498 1002725 1270156 1529514
12284 1529514 1748148 1945058 2063544 2097351 2088828 1986621 1800712 1543133 1295520 1083881
12274 1083881 860441 664379 486623 330347 226068 179344 137971 120421 116068 128998
12264 128998 120745 109263 100938 115179 133332 146873 155056 142269 123692 115405 114558 104138 88710
12251 88710 85930 59801 35519 35016 18898 10386 -41304 -91237 -90221 -71915 -40721 -35803 -10256
12238 -10256 54399 101066 128869 148700 161254 212883 267503 275629 276481 264527 229351 206140
$$ packed form
12320B43670R892l136k4338M1131M3644o287m280j9239l8542k1768q651p938j1031
12307A93127q549P005K5068j0053j6214p891k613j709J0491M6954L3386J8966
12295B87968K3841P031J2497M4246M0485R5909J19390J56131K15227K67431K59358
12284A529514K18634J96910J18486L3807q523j02207j85909k57579k47613k11639
12274A083881k23440j96062j77756j56276j04279m6724m1373j7550m353J2930
12264A28998q253j1482q325J4241J8153J3541Q183j2787j8577q287q47j0420j5428
12251H8710k780k6129k4282n03j6118q512n1690m9933J016J8306L1194M918K5547
12238a0256O4655M6667K7803J9831J2554N1629N4620Q126Q52j1954l5176k3211
$$ plain form
12226 206140 237400 267422 267869 287012 309586 340901 380770 431883 483391 543633 573187 583545
12214 583545 630268 669432 698226 694921 661576 654467 655033 602269 544686 506793 464865 449845
12202 449845 459747 475584 480505 472614 438702 453387 457536 420296 421228 426820 430988 414976 396616
12189 396616 365668 320513 289406 264689 258324 227017 229733 269529 302831 290564 298319 325627
12177 325627 346818 378216 398915 410605 431808 450685 482436 515320 499463 495702 505933 517818
12165 517818 499936 482869 503281 476392 466569 484472 508940 540007 575717 588275 614075 647404
12153 647404 683315 719950 746687 746080 762719 768869 793657 785075 805352 851329 892385 929096
12141 929096 983164 1040071 1085990 1165090 1231668 1313177 1418107 1547758 1726725 1903781 2155049
$$ packed form
12226B06140L1260L0022M47J9143K2574L1315L9869N1113N1508O0242K9554J0358
12214E83545M6723L9164K8794l305l3345p109N66n2764n7583l7893m1928j5020
12202D49845R902J5837M921p891l3912J4685M149l7240R32N592M168j6012j8360
12189C96616l0948m5155l1107k4717o365l1307K716L9796L3302j2267P755K7308
12177C25627K1191L1398K0699J1690K1203J8877L1751L2884j5857l761J0231J1885
12165E17818j7882j7067K0412k6889r823J7903K4468L1067L5710J2558K5800L3329
12153F47404L5911L6635K6737o07J6639O150K4788q582K0277M5977M1056L6711
12141I29096N4068N6907M5919P9100O6578Q1509J04930J29651J78967J77056K51268
$$ plain form
12130 2155049 2398380 2639504 2884130 3096770 3258010 3320710 3316779 3277920 3246556 3242819 3260848
12119 3260848 3329251 3439123 3598560 3830681 4070007 4347264 4711729 5119018 5597381 6179082
12109 6179082 6895011 7766002 8854917 10261813 12098120 14355474 16999033 19974463
12101 19974463 23115187 26387607 29834451 33565398 37868345 43068916 49931860 59690288
12093 59690288 74209704 96198695 128859878 174265745 230267781 288707952 337521658
12086 337521658 367545231 378141461 373569619 356449972 327064635 287276186 241879450
12079 241879450 196042076 153403681 116764851 87983759 67370814 53541635 44392324
12072 44392324 38105719 33457489 29781396 26652519 23805327 21134521 18594974 16224108
$$ packed form
12130B155049K43331K41124K44626K12640J61240O2700l931l8859l1364l737J8029
12119C260848O8403J09872J59437K32121K39326K77257L64465M07289M78363N81701
12109F179082P15929Q70991J088915J406896J836307K257354K643559K975430
12101A9974463L140724L272420L446844L730947M302947N200571O862944R758428
12093E9690288J4519416K1988991L2661183M5405867N6002036N8440171M8813706
12086C37521658L0023573J0596230m571842j7119647k9385337l9788449m5396736
12079B41879450m5837374m2638395l6638830k8781092k0612945j3829179r149311
12072D4392324o286605m648230l676093l128877k847192k670806k539547k370866
$$ plain form
12064 16224108 14106605 12257958 10686804 9419399 8447016 7663009 7015065 6468433 5967737
12055 5967737 5503977 5078121 4671544 4315342 4004508 3733567 3520869 3326869 3142284
12046 3142284 2987833 2808547 2631998 2504618 2380879 2266643 2199535 2192263 2163662 2113833
12036 2113833 2074677 2045721 1990702 1927642 1855268 1780100 1713947 1651832 1582702 1497878 1403776
12025 1403776 1334162 1287279 1238661 1213607 1191562 1150835 1093961 1040318 1007419 978736 958727
12014 958727 939774 906478 896449 867561 864981 857564 804670 767069 773834 751285 741869 727948
12002 727948 696697 686548 691909 650120 641487 646568 655097 684493 727734 766821 759040 740796
11990 740796 734357 727519 710305 692799 677383 667234 635193 611116 591604 559035 579633 579340
$$ packed form
12064A6224108k117503j848647j571154j267405r72383p84007o47944n46632n00696
12055E967737m63760m25856m06577l56202l10834k70941k12698j94000j84585
12046C142284j54451j79286j76549j27380j23739j14236o7108p272k8601m9829
12036B113833l9156k8956n5019o3060p2374p5168o6153o2115o9130q4824r4102
12025A403776o9614m6883m8618k5054k2045m0727n6874n3643l2899k8683k0009
12014I58727j8953l3296j0029k8888k580p417n2894l7601O765k2549r416j3921
12002G27948l1251j0149N361m1789q633N081Q529K9396M3241L9087p781j8244
11990G40796o439o838j7214j7506j5416j0149l2041k4077j9512l2569K0598k93
$$ plain form
11978 579340 534342 513576 519605 536818 541747 519361 509591 513539 525679 565426 621490 641856
11966 641856 657245 658893 675242 716002 758538 765611 737578 693420 637468 579367 548240 512160
11954 512160 463562 413227 400975 412988 404524 400616 380235 359278 353811 333354 305664 291467
11942 291467 315936 310546 277516 278400 281448 279739 256332 267426 289105 309999 356814 415456
11930 415456 442425 452265 474457 487070 450005 424578 396982 381046 374849 368267 372526 358009
11918 358009 353537 336013 314773 309722 302014 332971 343634 364881 371363 399164 433539 467809
11906 467809 523886 557509 545098 534867 526593 519486 514965 513709 491594 487726 494206 465818 415311
11893 415311 393440 362185 325084 303469 308686 337297 380628 387780 450089 513070 545074 545075 493080
$$ packed form
11978E79340m4998k0766O029J7213M929k2386r770L948J2140L9747N6064K0366
11966F41856J5389J648J6349M0760M2536P073k8033m4158n5952n8101l1127l6080
11954E12160m8598n0335j2252J2013q464l908k0381k0957n467k0457k7690j4197
11942B91467K4469n390l3030Q84L048j709k3407J1094K1679K0894M6815N8642
11930D15456K6969R840K2192J2613l7065k5427k7596j5936o197o582M259j4517
11918C58009m472j7524k1240n051p708L0957J0663K1247O482K7801L4375L4270
11906D67809N6077L3623j2411j0231q274p107m521j256k2115l868O480k8388n0507
11893D15311k1871l1255l7101k1615N217K8611M3331P152O2309O2981L2004Jn1995
$$ plain form
11880 493080 422000 342296 285527 210266 170140 166638 158305 153744 146635 137737 159804 150034 141707
11867 141707 138270 118052 94840 106217 92689 78557 82686 101853 96443 83826 89502 87394
11855 87394 95467 100309 110036 115201 99014 109259 113614 133721 128017 104320 96863 110705 118115
11842 118115 97469 81388 97765 102299 88912 99891 94273 118995 127073 129908 126368 108867
11830 108867 106897 118342 125121 110699 106066 128202 158877 136487 104966 75740 80835 88036
11818 88036 105488 130746 131843 127007 123244 111056 110241 121047 120273 131235 131253 124289 110893 74709
11804 74709 35398 38942 41745 61191 79191 90884 77047 50842 32979 23497 35167 43370
11792 43370 31440 25064 38884 81721 74048 74700 80977 71079 61510 43009 46278 42206 46088 71456
$$ packed form
11880D93080p1080p9704n6769p5261m0126l502q333m561p109q898K2067r770q327
11867A41707l437k0218k3212J1377j3528j4132M129J9167n410j2617N676k108
11855H7394Q073M842R727N165j6187J0245M355K0107n704k3697p457J3842P410
11842A18115k0646j6081J6377M534j3387J0979n618K4722Q078K835l540j7501
11830A08867j970J1445O779j4422m633K2136L0675k2390l1521k9226N095P201
11818H8036J7452K5258J097m836l763j2188q15J0806p74J0962J8o964j3396l6184
11804G4709l9311L544K803J9446J8000J1693j3837k6205j7863r482J1670Q203
11792D3370j1930o376J3820M2837p673O52O277r898r569j8501L269m072L882K5368
$$ plain form
11778 71456 71297 73405 64335 71584 75591 62145 47782 77775 116128 97689 105987 92998 97838
11765 97838 90637 73221 65526 51253 52290 70750 49941 45613 51206 69563 66601 77173 64573
11752 64573 47658 65909 75578 41945 30023 14837 5272 -17803 -7138 24746 31592 57112
11740 57112 86168 69872 68655 69869 49081 28469 41249 48582 37949 24057 14955 12389 11150
11727 11150 37324 54228 50538 47665 50536 39277 52213 74246 63536 62158 61195 33700 51708
11714 51708 44686 21533 53633 78279 65052 42785 43266 43039 31271 52769 70709 85612 112290
11701 112290 96425 49224 12996 23096 29272 30238 42732 43083 50087 57323 66260 84574 81551
11688 81551 85023 85260 96270 101030 121291 147838 150790 156316 185224 198712 233208 272250 310271
$$ packed form
11778G1456j59K108r070P249M007j3446j4363K9993L8353j8439Q298j2989M840
11765I7838p201j7416p695j4273J037J8460k0809m328N593J8357k962J0572j2600
11752F4573j6915J8251R669l3633j1922j5186r565k3075J0665L1884O846K5520
11740E7112K9056j6296j217J214k0788k0612J2780P333j0633j3892r102k566j239
11727A1150K6174J6904l690k873K871j1259J2936K2033j0710j378r63k7495J8008
11714E1708p022k3153L2100K4646j3227k2267M81k27j1768K1498J7940J4903K6678
11701A12290j5865m7201l6228J0100O176R66J2494L51P004P236Q937J8314l023
11688H1551L472K37J1010M760K0261K6547K952N526K8908J3488L4496L9042L8021
$$ plain form
11675 310271 333054 336126 374516 483305 612488 803747 1068006 1360223 1616655 1825883
11665 1825883 1967217 2006518 1987956 1880141 1731390 1533399 1319124 1098650 887229 678186
11655 678186 533854 420249 326388 294793 263659 263914 257537 239383 180400 141946 138351 127345
11643 127345 119697 98644 71099 59571 60164 56925 69269 75912 90463 111902 102257 94931 65905
11630 65905 47488 44698 38987 76330 88374 59618 19875 29352 23574 2613 3250 13837 12509
11617 12509 7067 -9522 -12470 3919 12470 22721 26761 35021 25885 28333 65403 27133 100
11604 100 -3075 -485 21444 17983 -6220 -21820 -11514 -7841 -8866 21657 26354 10723 -10820
11591 -10820 -8936 541 -3118 -24073 -23429 2350 -29033 -43359 -25038 -7258 3186 10933 12904
$$ packed form
11675C10271K2783L072L8390J08789J29183J91259K64259K92217K56432K09228
11665A825883J41334L9301j8562j07815j48751j97991k14275k20474k11421k09043
11655F78186j44332j13605r3861l1595l1134K55o377j8154n8983l8454l595j1006
11643A27345p648k1053k7545j1528N93l239J2344O643J4551K1439r645p326k9026
11630F5905j8417k790n711L7343J2044k8756l9743R477n778k0961O37J0587j328
11617A2509n442j6589k948J6389Q551J0251M040Q260r136K448L7070l8270k7033
11604A00l175K590K1929l461k4203j5600J0306L673j025L0523M697j5631k1543
11591a0820J884R477l659k0955O44K5779l1383j4326J8321J7780J0444P747J971
$$ plain form
11578 12904 8237 19184 22479 5982 14097 35028 47373 66169 74479 76212 97135 94633 62742
11565 62742 61067 56160 76397 38634 1831 15008 33131 21826 13842 32230 32211 18201 21241
11552 21241 43362 65204 43766 19574 -10144 -21858 -5238 -3309 -3481 10824 -2399 27962
11540 27962 46343 33512 13822 2230 18863 36257 31778 3220 15410 29775 28982 19740
11528 19740 -10020 -36095 -26292 -11652 6738 23583 30370 49238 51670 17940 20055 32115
11516 32115 55880 58965 46593 52917 51714 53185 64831 37131 9631 -9688 -12575 524 17869
11503 17869 39205 35166 27738 24510 38619 53453 45470 30577 18717 5834 2575 1390 31088
11490 31088 45942 61523 64373 66092 55905 47998 54444 53800 47382 42402 54334 87802 71611
$$ packed form
11578A2904m667J0947L295j6497Q115K0931J2345J8796Q310J733K0923k502l1891
11565F2742j675m907K0237l7763l6803J3177J8123j1305p984J8388j9j4010L040
11552B1241K2121K1842k1438k4192k9718j1714J6620J929j72J4305j3223L0361
11540B7962J8381j2831j9690j1592J6633J7394m479k8558J2190J4365p93r242
11528A9740k9760k6075R803J4640J8390J6845O787J8868K432l3730K115J2060
11516C2115K3765L085j2372O324j203J471J1646k7700k7500j9319k887J3099J7345
11503A7869K1336m039p428l228J4109J4834p983j4893j1860j2883l259j185K9698
11490C1088J4854J5581K850J719j0187p907O446o44o418m980J1932L3468j6191
$$ plain form
11477 71611 28113 -2644 3893 14400 16206 17723 6340 6762 12931 25219 36823 36468 25637
11464 25637 31991 58760 80108 101398 117197 118404 105957 80964 48905 51394 56537 37662
11452 37662 12859 -14703 -29180 -32908 -35949 -7648 52275 90813 74714 53361 26071 15051
11440 15051 7071 22737 10805 8843 4902 12903 6474 3329 -18280 -534 23191 5079 6066
11427 6066 42507 70882 76849 39087 23255 30988 27007 27363 42509 11971 33796 36644 40015
11414 40015 18474 -1549 -10992 -2874 31357 42852 51378 61014 82368 83547 83895 74269 37570
11401 37570 7275 22131 73443 67595 63632 35634 25267 -7034 -26749 -21992 8478 12680
11389 12680 7285 2008 11874 7699 2334 22219 18490 16733 717 -1477 2170 -3154 -22974 -11078
$$ packed form
11477G1611m3498l0757O537J0507J806J517j1383M22O169J2288J1604l55j0831
11464B5637O354K6769K1348K1290J5799J207j2447k4993l2059K489N143j8875
11452C7662k4803k7562j4477l728l041K8301N9923L8538j6099k1353k7290j1020
11440A5051p980J5666j1932j962l941Q001o429l145k1609J7746K3725j8112R87
11427F066L6441K8375N967l7762j5832P733l981L56J5146l0538K1825K848L371
11414D0015k1541k0023r443Q118L4231J1495Q526R636K1354J179L48r626l6699
11401C7570l0295J4856N1312n848l963k7998j0367l2301j9715M757L0470M202
11389A2680n395n277R866m175n365J9885l729j757j6016k194L647n324j9820J1896
$$ plain form
11375 -11078 19867 27413 29689 14508 3279 2445 100 11378 17620 22543 17271 39061 34061
11362 34061 2530 -6283 9740 26725 22959 27559 23198 12947 40259 63045 77248 67542 53042
11349 53042 31050 -10791 -13107 6605 13073 -4460 -6342 -6219 23524 61135 49578 53410 37422
11336 37422 22014 34288 29489 33981 28078 31331 45693 29604 33577 49228 64756 35647 24098
11323 24098 20554 32091 20553 37263 50720 50905 61461 79136 65987 51363 54837 50958 46896
11310 46896 19577 21219 18159 39515 54775 53350 36365 27193 8801 4603 15087 29852 74181
11297 74181 115367 106708 100544 73194 75988 81346 44232 24851 25139 33872 33003 45285 81325
11284 81325 103250 106862 97491 84346 96762 118412 108310 107129 110850 140065 131169 112127 88786
$$ packed form
11375a1078L0945P546K276j5181j1229q34k345J1278O242M923n272K1790n000
11362C4061l1531q813J6023J6985l766M600m361j0251K7312K2786J4203r706j4500
11349E3042k1992m1841k316J9712O468j7533j882J23K9743L7611j1557L832j5988
11336C7422j5408J2274m799M492n903L253J4362j6089L973J5651J5528k9109j1549
11323B4098l544J1537j1538J6710J3457J85J0556J7675j3149j4624L474l879m062
11310D6896k7319J642l060K1356J5260j425j6985r172j8392m198J0484J4765M4329
11297G4181M1186q659o164k7350K794N358l7114j9381K88Q733q69J2282L6040
11284H1325K1925L612r371j3145J2416K1650j0102j181L721K9215q896j9042k3341
$$ plain form
11271 88786 73473 54636 45770 40687 52408 77665 89442 83810 84090 93086 83897 88424 91947
11258 91947 49874 2217 16457 53011 73158 76983 83949 97823 99290 77984 54137 47759
11246 47759 73545 83239 89335 89075 69763 102110 75537 61632 87115 107287 83444 58716
11234 58716 55492 67326 78742 61795 58244 63950 97816 80293 48035 34639 37722 38220 61334
11221 61334 56812 38962 49663 56263 59077 55209 64901 67029 54215 70244 66495 69611 80005
11208 80005 71560 66337 67131 45735 38166 24816 21684 34356 62304 66753 51816 81445 98364
11195 98364 88538 96890 106388 113401 113584 103197 81092 99108 111923 131881 100049 85095 66795
11182 66795 50965 30223 43169 56671 53248 42742 43157 59732 76280 101752 102191 99063 85513
$$ packed form
11271H8786j5313j8837q866n083J1721K5257J1777n632K80Q996r189M527L523
11258I1947m2073m7657J4240L6554K0147L825O966J3874J467k1306k3847o378
11246D7759K5786R694O096k60j9312L2347k6573j3905K5483K0172k3843k4728
11234E8716l224J1834J1416j6947l551N706L3866j7523l2258j3396L083M98K3114
11221F1334m522j7850J0701O600K814l868R692K128j2814J6029l749L116J0394
11208H0005q445n223P94k1396p569j3350l132J2672K7948M449j4937K9629J6919
11195I8364r826Q352R498P013J83j0387k2105J8016J2815J9958l1832j4954j8300
11182F6795j5830k0742J2946J3502l423j0506M15J6575J6548K5472M39l128j3550
$$ plain form
11169 85513 67973 54102 60011 81109 71315 71700 82623 94730 96009 100414 114538 100542 61462
11156 61462 44877 25578 27109 47601 71785 51374 67781 70242 89706 86333 65875 66812 96385
11143 96385 112043 98777 96106 89218 64731 66419 79742 73710 59975 53530 60990 47380 33321
11130 33321 58171 91728 89223 56251 39668 46935 51724 73218 95250 124622 136595 121593
11118 121593 103046 97963 99855 85654 82526 63628 35920 40277 41713 48454 47404 48752 52966
11105 52966 52463 64877 53217 60543 63890 75015 75553 86386 101461 71160 46860 25640 10193
11092 10193 54432 92493 72240 58849 71248 90215 96892 64884 85008 82910 60100 55401
11080 55401 61653 60531 88162 95620 83977 70057 66135 43413 53792 86217 109054 101588 56722
$$ packed form
11169H5513j7540j3871N909K1098r794L85J0923J2107J279M405J4124j3996l9080
11156F1462j6585j9299J531K0492K4184k0411J6407K461J9464l373k0458R37K9573
11143I6385J5658j3266k671o888k4487J688J3323o032j3735o445P460j3610j4059
11130C3321K4850L3557k505l2972j6583P267M789K1494K2032K9372J1973j5002
11118A21593j8547n083J892j4201l128j8898k7708M357J436O741j050J348M214
11105E2966n03J2414j1660P326L347J1125N38J0833J5075l0301k4300k1220j5447
11092A0193M4239L8061k0253j3391J2399J8967O677l2008K0124k098k2810m699
11080E5401O252j122K7631P458j1643j3920l922k2722J0379L2425K2837p466m4866
$$ plain form
11067 56722 30826 24828 37362 71211 77909 99525 129665 135510 143375 125861 94415 64490
11055 64490 84557 87922 101269 118617 100998 97345 108335 110532 107966 90456 85247 108461 136409
11042 136409 140507 138822 142066 138286 132310 131916 107735 100867 122761 126975 102359 108563 99143 113147
11028 113147 126800 119918 113663 119795 127602 142576 138435 132829 113428 114032 124129 106210 107180
11015 107180 129576 113224 89644 98948 131660 128366 127710 135299 132799 130252 134852 132939 113659
11002 113659 112565 111313 116870 107554 82994 90988 119695 144086 158036 150001 121170 124423 121829
10989 121829 125478 113916 145429 159838 166087 152782 126068 97612 105899 119836 148081 156337
10977 156337 138219 131814 112007 112188 122656 135704 105922 88555 116764 121266 115813 126472
$$ packed form
11067E6722k5896n998J2534L3849O698K1616L0140N845P865j7514l1446k9925
11055F4490K0067L365J3347J7348j7619l653J0990K197k566j7510n209K3214K7948
11042A36409M098j685L244l780n976l94k4181o868K1894M214k4616O204r420J4004
11028A13147J3653o882o255O132P807J4974m141n606j9401O04J0097j7919R70
11015A07180K2396j6352k3580R304L2712l294o56P589k500k547M600j913j9280
11002A13659j094j252N557r316k4560P994K8707K4391J3950q035k8831L253k594
10989A21829L649j1562L1513J4409O249j3305k6714k8456Q287J3937K8245Q256
10977A56337j8118o405j9807J81J0468J3048k9782j7367K8209M502n453J0659
$$ plain form
10965 126472 126300 123640 111634 81008 89605 85008 88679 92469 113103 119869 124091 134112 117891
10952 117891 118171 144500 114933 100770 91966 101224 113457 117979 129020 112335 108757 101114 110875
10939 110875 122281 128497 147946 149221 141143 130473 114080 102637 128380 160989 185869 234204
10927 234204 302020 344546 320652 273932 237169 187694 142120 128563 132492 148931 164590 156912
10915 156912 159456 178417 182156 170145 164910 163751 175620 167010 177112 184211 177747 150029 166788
10902 166788 217939 230978 219342 200944 167709 138831 144859 151742 169429 187121 167755 175838
10890 175838 199540 221624 219022 226164 280039 313638 366035 465456 584228 691816 773849
10879 773849 770156 644836 495722 368872 295098 264368 251437 266481 275167 256582 241439
$$ packed form
10965A26472j72k660j2006l0626Q597m597L671L790K0634O766M222J0021j6221
10952A17891K80K6329k9567j4163q804R258J2233M522J1041j6685l578p643R761
10939A10875J1406O216J9449J275q078j0670j6393j1443K5743L2609K4880M8335
10927B34204O7816M2526k3894m6720l6763m9475m5574j3557L929J6439J5659p678
10915A56912K544J8961L739j2011n235j159J1869q610J0102P099o464k7718J6759
10902A66788N1151J3039j1636j8398l3235k8878O028O883J7687J7692j9366Q083
10890A75838K3702K2084k602P142N3875L3599N2397R9421J18772J07588Q2033
10879G73849l693j25320j49114j26850p3774l0730j2931J5044Q686j8585j5143
$$ plain form
10868 241439 234582 233223 238345 222190 254091 267565 259092 242043 224182 209356 200060 190171 195751
10855 195751 224220 226021 239441 257251 243123 240484 230162 242718 241407 241748 233276 245113 292132
10842 292132 356557 396052 438491 511905 589524 678649 787929 877786 841278 729305 613484
10831 613484 508214 429836 358110 332423 337802 355294 385234 399383 396659 369163 344369 374873
10819 374873 420073 449827 476627 497484 509330 523717 523118 525443 540783 563093 571709 577054
10807 577054 557099 585939 624626 669775 669898 655662 622535 635893 631369 620214 636344 644287
10795 644287 654614 662330 699236 747523 831601 885165 913492 890620 847360 782555 756311 750647
10783 750647 743236 744516 760421 797981 823897 841706 858838 835635 824624 827005 844123 867397
$$ packed form
10868B41439o857j359N122j6155L1901J3474q473j7049j7861j4826r296r889N580
10855A95751K8469J801J3420J7810j4128k639j0322J2556j311L41q472J1837M7019
10842B92132O4425L9495M2439P3414P7619Q9125J09280Q9857l6508j11973j15821
10831F13484j05270p8378p1726k5687N379J7492K9940J4149k724k7496k4794L0504
10819C74873M5200K9754K6800K0857J1846J4387n99K325J5340K2310Q616N345
10807E77054j9955K8840L8687M5149J23j4236l3127J3358m524j1155J6130P943
10795F44287J0327P716L6906M8287Q4078N3564K8327k2872m3260o4805k6244n664
10783G50647p411J280J5905L7560K5916J7809J7132k3203j1011K381J7118K3274
$$ plain form
10771 867397 883180 880216 903387 905424 905627 887908 884876 876481 839904 817555 801468 792498 770611
10758 770611 764112 742544 720783 718132 719036 680327 652145 662925 673346 658469 657524 693340 715063
10745 715063 700783 709493 718748 741113 731841 725098 724707 741394 746963 757770 768435 724045 701844
10732 701844 695658 702477 702510 694992 658758 614364 568068 564034 545975 540384 537618 518415 519270 479070
10718 479070 479136 467464 452961 458442 452794 449424 461325 431086 425628 432403 442554 435355 409800
10705 409800 416894 412725 424627 417973 394913 375820 360202 395624 405948 407866 385017 363085
10693 363085 375498 371474 364526 381581 411779 425434 435997 431361 414197 426611 426052 442669
10681 442669 429801 434965 426193 426237 406517 407182 432718 428378 425093 436810 411319 392505 398557
$$ packed form
10771H67397J5783k964K3171K037K03j7719l032q395l6577k2349j6087q970k1887
10758G70611o499k1568k1761k651R04l8709k8182J0780J0421j4877r45L5816K1723
10745G15063j4280Q710R255K2365r272o743l91J6687N569J0807J0665m4390k2201
10732G01844o186O819L3p518l6234m4394m6296m034j8059n591k766j9203Q55m0200
10718D79070O6j1672j4503N481n648l370J1901l0239n458O775J0151p199k5555
10705D09800P094m169J1902o654k3060j9093j5618L5422J0324J918k2849k1932
10693C63085J2413m024o948J7055L0198J3655J0563m636j7164J2414n59J6617
10681D42669j2868N164q772M4j9720O65K5536m340l285J1717k5491j8814O052
$$ plain form
10668 398557 430674 421514 407920 421981 450392 470879 479209 478726 478768 488018 483412 488100 520136
10655 520136 521798 511816 504272 516556 527919 514848 519479 514105 519158 485192 498964 520979 528588
10642 528588 527278 543653 555051 575689 583618 577410 553684 538426 546955 557993 575501 589648
10630 589648 619055 625061 608194 612717 616780 625992 634283 645905 636767 646182 648700 647383 640172
10617 640172 647927 640590 671180 696424 691373 714518 706228 685403 695763 705115 732100 751112
10605 751112 764528 779106 779604 789338 798508 806975 809552 800148 798024 800711 806841 802425 771496 768527
10591 768527 781290 796552 806712 849162 880255 871913 841799 815284 838721 849189 841149 852609
10579 852609 865086 855413 871558 878646 891383 897796 895783 888080 904068 900896 902317 937381 962591
$$ packed form
10668C98557L2117r160j3594J4061K8411K0487Q330m83M2R250m606M688L2036
10655E20136J662r982p544J2284J1363j3071M631n374N053l3966J3772K2015P609
10642E28588j310J6375J1398K0638P929o208k3726j5258Q529J1038J7508J4147
10630E89648K9407O006j6867M523M063R212Q291J1622r138R415K518j317p211
10617F40172P755p337L0590K5244n051K3145q290k0825J0360R352K6985J9012
10605G51112J3416J4578M98R734R170Q467K577r404k124K687O130m416l0929k969
10591G68527J2763J5262J0160M2450L1093q342l0114k6515K3437J0468q040J1460
10579H52609J2477r673J6145P088J2737O413k013p703J5988l172J421L5064K5210
$$ plain form
10566 962591 962499 952560 924729 927993 959107 994890 993557 980750 972757 979428 992600 1010343 1019400
10553 1019400 1032120 1048487 1065420 1069241 1043219 1035338 1080314 1105358 1108759 1124946 1153038 1192406
10541 1192406 1229189 1191444 1174774 1203771 1225216 1221647 1230828 1252716 1290239 1336306 1364180 1396378
10529 1396378 1394617 1403647 1438182 1464701 1489936 1495917 1511955 1535856 1572916 1600661 1618555 1682662
10517 1682662 1719161 1736863 1754281 1745729 1776032 1817715 1840133 1860508 1919262 1946000 1987152
10506 1987152 2027367 2063689 2081066 2097289 2133554 2178115 2187689 2239589 2312424 2390371 2481243
10495 2481243 2573015 2592129 2580241 2563787 2551264 2538817 2553615 2585652 2600739 2612894 2666712
10484 2666712 2728622 2777424 2852147 2898450 2912552 2954778 3018608 3070990 3123081 3172375 3223912
$$ packed form
10566I62591r2r939k7831L264L1114L5783j333j2807p993O671J3172J7743R057
10553A019400J2720J6367J6933L821k6022p881M4976K5044L401J6187K8092L9368
10541A192406L6783l7745j6670K8997K1445l569R181K1888L7523M6067K7874L2198
10529A396378j761R030L4535K6519K5235N981J6038K3901L7060K7745J7894O4107
10517A682662L6499J7702J7418q552L0303M1683K2418K0375N8754K6738M1152
10506A987152M0215L6322J7377J6223L6265M4561R574N1900P2835P7947R0872
10495B481243R1772J9114j1888j6454j2523j2447J4798L2037J5087J2155N3818
10484B666712O1910M8802P4723M6303J4102M2226O3830N2382N2091M9294N1537
$$ plain form
10473 3223912 3283130 3360817 3432838 3481524 3557918 3656207 3719817 3771531 3856300 3914162 3959268
10462 3959268 4040232 4144718 4238641 4317116 4419664 4526799 4641652 4739707 4842086 4973160
10452 4973160 5105423 5231565 5367375 5470888 5591995 5761426 5919538 6091686 6272992
10443 6272992 6425479 6593658 6795366 7007130 7219586 7471522 7706561 7929215 8205828
10434 8205828 8508535 8802259 9129782 9463449 9833705 10202935 10583099 10982879 11435455
10425 11435455 11954824 12489383 13061982 13666776 14305965 15014718 15820032 16637653 17529700
10416 17529700 18515461 19607375 20764294 21980982 23321377 24818950 26406441 28125187
10408 28125187 29986847 32000313 34202492 36594139 39189857 41957859 44898960 48028468
$$ packed form
10473C223912N9218P7687P2021M8686P6394R8289O3610N1714Q4769N7862M5106
10462C959268Q0964J04486R3923P8475J02548J07135J14853R8055J02379J31074
10452D973160J32263J26142J35810J03513J21107J69431J58112J72148J81306
10443F272992J52487J68179K01708K11764K12456K51936K35039K22654K76613
10434H205828L02707K93724L27523L33667L70256L69230L80164L99780M52576
10425A1435455N19369N34559N72599O04794O39189P08753Q05314Q17621Q92047
10416A7529700R85761J091914J156919J216688J340395J497573J587491J718746
10408B8125187J861660K013466K202179K391647K595718K768002K941101L129508
$$ plain form
10400 48028468 51356924 54822076 58393442 62047466 65696115 69233997 72615572 75783205
10392 75783205 78586999 80975129 82914995 84400693 85397684 85958698 86150953 86058364 85742535
10383 85742535 85316771 84923976 84607196 84426219 84469965 84732624 85258243 86084710 87205100
10374 87205100 88606958 90310891 92334614 94628614 97136656 99846732 102715993 105638139
10366 105638139 108573493 111427088 114119895 116573582 118754127 120550984 121907281 122790217
10358 122790217 123204839 123151773 122641198 121726477 120416158 118752817 116794911 114585284 112172345
10349 112172345 109594651 106923707 104226217 101548766 98938405 96461587 94159990 92066114
10341 92066114 90201883 88591545 87271847 86256016 85562911 85193879 85125776 85360682 85879650
$$ packed form
10400D8028468L328456L465152L571366L654024L648649L537882L381575L167633
10392G5783205K803794K388130J939866J485698R96991N61014J92255r2589l15829
10383H5742535m25764l92795l16780j80977M3746K62659N25619Q26467J120390
10374H7205100J401858J703933K023723K294000K508042K710076K869261K922146
10366A05638139K935354K853595K692807K453687K180545J796857J356297Q82936
10358A22790217M14622n3066n10575r14721j310319j663341j957906k209627k412939
10349A12172345k577694k670944k697490k677451k610361k476818k301597k093876
10341I2066114j864231j610338j319698j015831o93105l69032o8103K34906N18968
$$ plain form
10332 85879650 86645385 87620599 88729055 89886622 91026981 92015765 92726921 93038942 92909720
10323 92909720 92258521 90994599 89124027 86657145 83657750 80277742 76601614 72743610
10315 72743610 68789864 64824599 60941987 57180456 53612106 50214601 47023849 44030011
10307 44030011 41209945 38596396 36179493 33951248 31905752 30017702 28253522 26609287
10299 26609287 25104498 23691290 22367507 21170174 20117787 19131510 18186959 17298047
10291 17298047 16458436 15716133 15031176 14401716 13814390 13253163 12727776 12246892 11816688
10282 11816688 11373116 10964380 10588949 10225908 9861150 9522068 9203530 8905106 8648861
10273 8648861 8414592 8190223 7936694 7726197 7547016 7331905 7117080 6942559 6782808
$$ packed form
10332H5879650P65735R75214J108456J157567J140359R88784P11156L12021j29222
10323I2909720o51199j263922j870572k466882k999395l380008l676128l858004
10315G2743610l953746l965265l882612l761531l568350l397505l190752k993838
10307D4030011k820066k613549k416903k228245k045496j888050j764180j644235
10299B6609287j504789j413208j323783j197333j052387r86277r44551q88912
10291A7298047q39611p42303o84957o29460n87326n61227n25387m80884m30204
10282A1816688m43572m08736l75431l63041l64758l39082l18538k98424k56245
10273H648861k34269k24369k53529k10497j79181k15111k14825j74521j59751
$$ plain form
10264 6782808 6612039 6452130 6317559 6164107 6007117 5875186 5752474 5629273 5485546
10255 5485546 5360978 5249406 5139739 5045180 4981977 4888449 4792481 4737862 4653887 4538941
10245 4538941 4431927 4312037 4252926 4196813 4139273 4087437 4003038 3939961 3885306 3808140 3750191
10234 3750191 3680619 3626180 3567859 3527208 3490811 3454373 3409612 3357896 3327578 3315607 3268476
10223 3268476 3211983 3169215 3112334 3069039 3037100 2998525 2972240 2956045 2962384 2914008 2849475
10212 2849475 2836923 2844746 2847291 2844690 2846036 2859516 2889161 2908307 2917798 2931028 2942222 2948851
10200 2948851 2935587 2841254 2732402 2666688 2646315 2546880 2451901 2361391 2281540 2217718 2153839
10189 2153839 2130833 2101700 2057607 2011675 1957426 1919107 1887747 1865378 1860636 1843408 1815870
$$ packed form
10264F782808j70769j59909j34571j53452j56990j31931j22712j23201j43727
10255E485546j24568j11572j09667r4559o3203r3528r5968n4619q3975j14946
10245D538941j07014j19890n9111n6113n7540n1836q4399o3077n4655p7166n7949
10234C750191o9572n4439n8321m0651l6397l6438m4761n1716l0318j1971m7131
10223C268476n6493m2768n6881m3295l1939l8575k6285j6195O339m8376o4533
10212B849475j2552P823K545k601J346J3480K9645J9146R491J3230J1194O629
10200B948851j3264r4333j08852o5714k0373r9435r4979r0510p9851o3822o3879
10189B153839k3006k9133m4093m5932n4249l8319l1360k2369m742j7228k7538
$$ plain form
10178 1815870 1795810 1780651 1754483 1730220 1697381 1656221 1631591 1603344 1556486 1531875 1525961
10167 1525961 1517215 1498767 1491044 1474956 1460442 1428972 1402608 1398295 1367114 1327947 1330549 1334514
10155 1334514 1280199 1252371 1251834 1259699 1250850 1229734 1222480 1225825 1215852 1200361 1175840 1135168 1129764
10142 1129764 1114555 1074028 1053675 1024640 1003273 992476 978329 981767 977468 996481 999781 994503
10130 994503 1003621 987457 942564 937813 923019 916990 912920 896939 880473 876142 880853 867534 860012
10117 860012 841239 824566 831134 796594 805133 806296 770958 765227 786775 777495 798182 799109 791601
10104 791601 782398 774922 743150 740695 746102 748838 721351 710410 730734 736110 705747 694428 689238
10091 689238 685308 693085 685177 679028 696223 715504 718494 689588 684469 663902 651239 660063 635361
$$ packed form
10178A815870k0060j5159k6168k4263l2839m1160k4630k8247m6858k4611n914
10167A525961q746j8448p723j6088j4514l1470k6364m313l1181l9167K602L965
10155A334514n4315k7828n37P865q849k1116p254L345r973j5491k4521m0672n404
10142A129764j5209m0527k0353k9035k1367j0797j4147L438m299J9013L300n278
10130I94503R118j6164m4893m751j4794o029m070j5981j6466m331M711j3319p522
10117H60012j8773j6673O568l4540Q539J163l5338n731K1548r280K0687R27p508
10104G91601r203p476l1772k455N407K736k7487j0941K0324N376l0363j1319n190
10091F89238l930P777p908o149J7195J9281K990k8906n119k0567j2663Q824k4702
$$ plain form
10078 635361 598409 580180 567437 572010 600087 610508 621440 615999 609495 589959 576326 594324
10066 594324 624640 605708 579925 583988 596511 631432 636398 625671 612816 595468 588964 575676
10054 575676 545123 519895 525294 535367 542964 550169 585154 608187 580967 518949 487660 518090
10042 518090 526143 530656 518805 469833 477954 523324 528242 537677 541683 509097 471398 461417 453353
10029 453353 484009 498308 474789 452392 451682 477536 505018 500957 471820 466130 482670 496740
10017 496740 492405 462078 454588 446866 443788 453681 460718 458771 452486 442534 426239 432467 442347 428809
10003 428809 415663 430643 451190 466959 488628 494096 506375 481898 459044 463607 474358 460789
9991 460789 480216 485333 491837 507751 553695 557378 556289 566070 556460 580759 594163 608554 647314
$$ packed form
10078F35361l6952j8229j2743M573K8077J0421J0932n441o504j9536j3633J7998
10066E94324L0316j8932k5783M063J2523L4921M966j0727j2855j7348o504j3288
10054E75676l0553k5228N399J0073P597P205L4985K3033k7220o2018l1289L0430
10042E18090Q053M513j1851m8972Q121M5370M918R435M006l2586l7699r981q064
10029D53353L0656J4299k3519k2397p10K5854K7482m061k9137n690J6540J4070
10017D96740m335l0327p490p722l078R893P037j947o285r952j6295O228R880j3538
10003D28809j3146J4980K0547J5769K1669N468J2279k4477k2854M563J0751j3569
9991D60789J9427N117O504J5914M5944L683j089R781r610K4299J3404J4391L8760
$$ plain form
9978 647314 714830 731740 742471 749593 789527 804696 806478 804675 802848 782208 771440 783774
9966 783774 794703 805144 810970 796947 777610 796158 786604 764782 774882 769279 770226 817155 837809
9953 837809 808311 839372 859211 833733 835625 854973 903818 934299 914486 942686 978609 1006289
9941 1006289 1006868 1002975 998375 999191 1009801 1004974 994117 991099 992136 992470 966755 955316 939991 920089
9927 920089 917692 909891 900044 897844 898477 913812 956573 997646 1025554 1013699 980929 953313 938728
9914 938728 941443 993124 1086841 1168447 1260873 1256421 1182588 1097452 1031873 1002235 1002724 1008620 1018045
9901 1018045 1047592 1031115 950798 876080 817930 735977 678044 669308 663208 657577 624328 581758
9889 581758 542363 557729 550447 523255 483061 480787 506765 481730 445700 435870 411100 390651
$$ packed form
9978F47314O7516J6910J0731P122L9934J5169J782j803j827k0640j0768J2334
9966G83774J0929J0441N826j4023j9337J8548r554k1822J0100n603R47M6929K0654
9953H37809k9498L1061J9839k5478J892J9348M8845L0481j9813K8200L5923K7680
9941A006289N79l893m600Q16J0610m827j0857l018J037L34k5715j1439j5325j9902
9927I20089k397p801r847k200O33J5335M2761M1073K7908j1855l2770k7616j4585
9914I38728K715N1681R3717Q1606R2426m452p3833q5136o5579k9638M89N896R425
9901A018045K9547j6477q0317p4718n8150q1953n7933q736o100n631l3249m2570
9889E81758l9395J5366p282k7192m0194k274K5978k5035l6030r830k4770k0449
$$ plain form
9877 390651 394237 388976 378019 362737 334685 321614 334782 360163 339502 306908 306412 329746
9865 329746 334259 317338 307313 341000 353535 311100 277984 283677 301673 289567 312916 309165
9853 309165 314366 287694 292385 325836 336919 335646 366113 414910 452069 482935 475404 497376
9841 497376 528989 546172 580991 635568 653507 612466 525213 435529 376081 335810 329823 329126
9829 329126 331040 320157 313721 311203 287872 295710 297414 311710 319790 335925 345496 334101 331062
9816 331062 331985 328219 324103 300106 280561 280894 292016 306069 309600 308473 329331 355509 368263
9803 368263 412416 521887 702679 905820 1170338 1436437 1602158 1588239 1426717 1175596
9793 1175596 943904 737708 593180 476055 403506 374636 369571 353608 339752 323336 310848
$$ packed form
9877C90651L586n261j0957j5282k8052j3071J3168K5381k0661l2594m96K3334
9865C29746M513j6921j0025L3687J2535m2435l3116N693J7996j2106K3349l751
9853C09165N201k6672M691L3451J1083j273L0467M8797L7159L0866p531K1972
9841D97376L1613J7183L4819N4577J7939m1041q7253q9684n9448m0271n987o97
9829C29126J914j0883o436k518k3331P838J704J4296Q080J6135R571j1395l039
9816C31062R23l766m116k3997j9545L33J1122J4053L531j127K0858K6178J2754
9803C68263M4153J09471J80792K03141K64518K66099J65721j3919j61522k51121
9793A175596k31692k06196j44528j17125p2549k8870n065j5963j3856j6416j2488
$$ plain form
9782 310848 294320 286699 272243 280320 299340 310693 308923 311067 292785 286414 245872 227393 225024
9769 225024 232263 258386 262950 258311 280913 308779 321611 332676 299354 258351 224817 238472
9757 238472 261657 273316 269304 255633 255881 228642 217952 218241 222077 206900 209181 217635 226994
9744 226994 223806 232208 238589 249793 233503 234794 235923 240271 238146 246611 242927 243933 226443 243232
9730 243232 264554 291550 276191 277984 268836 257137 236772 238934 235654 199620 223568 251339
9718 251339 245726 226153 235175 240801 233790 236938 283974 275741 267154 258947 228843 191195 186912
9705 186912 217073 247103 272973 276577 269134 268709 260290 239483 224431 219607 227525 220648 219868 211672
9691 211672 201697 222738 227894 234692 228442 214570 204150 225665 230275 254720 263634 256494 241063
$$ packed form
9782C10848j6528p621j4456Q077J9020J1353j770K144j8282o371m0542j8479k369
9769B25024P239K6123M564m639K2602K7866J2832J1065l3322m1003l3534J3655
9757B38472K3185J1659m012j3671K48k7239j0690K89L836j5177K281Q454R359
9744B26994l188Q402O381J1204j6290J291J129M348k125Q465l684J006j7490J6789
9730B43232K1322K6996j5359J793r148j1699k0365K162l280l6034K3948K7771
9718B51339n613j9573R022N626p011L148M7036q233q587q207l0104l7648m283
9705A86912L0161L0030K5870L604p443m25q419k0807j5052m824P918o877p80q196
9691B11672r975K1041N156O798o250j3872j0420K1515M610K4445Q914p140j5431
$$ plain form
9678 241063 260896 274718 276784 332207 332096 368604 436246 510698 547627 590807 653091 722069
9666 722069 799445 811691 759753 686826 619423 557141 524874 485095 422926 356329 318525 287614
9654 287614 259231 267682 272280 256891 235431 237640 243227 233579 210434 215051 232903 244835 264442
9641 264442 253922 237036 237698 238275 234514 220019 228634 249702 240997 249836 253621 248158 238990 247180
9627 247180 236849 203322 217146 220885 227405 232757 230537 243288 228147 225397 240850 237888 236714
9614 236714 241325 229654 234912 225668 228539 227828 227284 252381 291653 312770 297816 311958 325950
9601 325950 313746 295009 284836 282415 283593 308372 307830 281596 269882 268484 276382 299373 335821
9588 335821 351870 330941 325970 308347 293701 292638 278191 286958 314146 325645 344252 367088
$$ packed form
9678B41063J9833J3822K066N5423j11L6508O7642P4452L6929M3180O2284O8978
9666G22069P7376J2246n1938p2927o7403o2282l2267l9779o2169o6597l7804l0911
9654B87614k8383Q451M598j5389k1460K209N587r648k3145M617J7852J1932J9607
9641B64442j0520j6886O62N77l761j4495Q615K1068q705Q839L785n463r168Q190
9627B47180j0331l3527J3824L739O520N352k220J2751j5141k750J5453k962j174
9614B36714M611j1671N258r244K871p11n44K5097L9272K1117j4954J4142J3992
9601C25950j2204j8737j0173k421J178K4779n42k6234j1714j398P898K2991L6448
9588C35821J6049k0929m971j7623j4646j063j4447Q767K7188J1499J8607K2836
$$ plain form
9576 367088 398570 425324 458789 494535 498594 472991 454537 448606 440788 422312 419830 431476
9564 431476 447836 481166 531906 586173 627514 617203 630975 624931 623297 624240 584138 552467
9552 552467 545196 548837 549938 548612 542399 516830 501571 488344 499446 524150 511768 487752 490619
9539 490619 515277 544912 592337 681514 795069 878163 975887 1098606 1152881 1149017 1126888
9528 1126888 1079627 1003475 981368 952781 951502 957650 939172 938342 921607 889040 905260 900645
9516 900645 886314 862878 838133 801531 807345 821762 812550 804943 788437 762753 723577 699190
9504 699190 678315 677359 698855 732161 766161 768349 784263 819069 865819 884527 925966 959404
9492 959404 1057558 1144494 1174463 1221189 1226043 1215601 1205597 1175565 1133530 1081287 1031370 1003407
$$ packed form
9576C67088L1482K6754L3465L5746M059k5603j8454n931p818j8476k482J1646
9564D31476J6360L3330N0740N4267M1341j0311J3772o044j634R43m0102l1671
9552E52467p271L641J101j326o213k5569j5259j3227J1102K4704j2382k4016K867
9539D90619K4658K9635M7425Q9177J13555Q3094R7724J22719N4275l864k2129
9528A126888m7261p6152k2107k8587j279O148j8478q30j6735l2567J6220m615
9516I00645j4331k3436k4745l6602N814J4417r212p607j6506k5684l9176k4387
9504F99190k0875r56K1496L3306L4000K188J5914L4806M6750J8708M1439L3438
9492I59404R8154Q6936K9969M6726M854j0442j0004l0032m2035n2243m9917k7963
$$ plain form
9480 1003407 988678 920505 876344 836849 784732 782867 779983 753713 717940 694843 716411 699320
9468 699320 639888 605991 625592 681392 697013 674848 693329 717297 757945 784509 810292 814629
9456 814629 837116 880196 892893 903974 896477 917274 919636 934443 916888 909406 873242 838308
9444 838308 794637 783977 767771 743266 709593 681888 651502 640209 640537 618994 586243 591420
9432 591420 575477 551407 540863 528834 522815 521050 535320 550608 550500 563987 565769 569432 606023
9419 606023 618470 621263 629834 642852 642418 658885 669750 664060 632338 597230 575040 554382 496185
9406 496185 450800 464380 502181 510110 541677 507080 453575 468950 477986 459884 458245 463743
9394 463743 471801 447512 447104 469488 484893 485004 473881 476020 495338 502563 518945 532503 529106
$$ packed form
9480A003407j4729o8173m4161l9495n2117j865k884k6270l5773k3097K1568j7091
9468F99320n9432l3897J9601N5800J5621k2165J8481K3968M0648K6564K5783M337
9456H14629K2487M3080J2697J1081p497K0797K362J4807j7555p482l6164l4934
9444H38308m3671j0660j6206k4505l3673k7705l0386j1293L28k1543l2751N177
9432E91420j5943k4070j0544j2029o019j765J4270J5288j08J3487J782L663L6591
9419F06023J2447K793Q571J3018m34J6467J0865n690l1722l5108k2190k0658n8197
9406D96185m5385J3580L7801P929L1567l4597n3505J5375R036j8102j639N498
9394D63743Q058k4289m08K2384J5405J11j1123K139J9318P225J6382J3558l397
$$ plain form
9381 529106 516173 522360 500016 493695 486949 481971 484052 492011 511509 539490 549467 557147 544580
9368 544580 554562 576880 570056 535073 525522 536485 551392 554457 560491 587939 600992 572579 545148
9355 545148 554970 602013 611945 614799 617703 636339 646459 648276 648301 653457 654918 651746 638253 638712
9341 638712 634240 631830 625088 619976 641191 657002 681483 692134 694893 719222 747571 757856 757840
9328 757840 751477 742038 740856 746856 746159 758435 767823 769186 746075 742120 776701 775566 762422 752564
9314 752564 776554 800268 820620 829062 840462 853699 869054 872760 856734 840148 863669 896001
9302 896001 881932 898657 926479 929371 928839 896940 912075 941220 985104 1058608 1127438 1190779
9290 1190779 1255211 1311493 1440770 1580677 1716643 1825521 1853422 1772149 1636858 1506017
$$ packed form
9381E29106j2933O187k2344o321o746m978K081P959J9498K7981R977P680j2567
9368E44580R982K2318o824l4983r551J0963J4907L065O034K7448J3053k8413k7431
9355E45148R822M7043R932K854K904J8636J0120J817K5N156J461l172j3493M59
9341F38712m472k410o742n112K1215J5811K4481J0651K759K4329K8349J0285j6
9328G57840o363r439j182O000o97J2276R388J363k3111l955L4581j135j3144r858
9314G52564K3990K3714K0352Q442J1400J3237J5355L706j6026j6586K3521L2332
9302H96001j4069J6725K7822K892n32l1899J5135K9145M3884P3504O8830O3341
9290A190779O4432N6282J29277J39907J35966J08878K7901q1273j35291j30841
$$ plain form
9280 1506017 1390557 1329403 1305112 1293179 1306793 1341997 1425510 1529981 1650426 1764444 1854544
9269 1854544 1934660 1962708 1941262 1923955 1901270 1891840 1873101 1829851 1788933 1774455 1764078 1769368
9257 1769368 1805327 1840729 1887229 1959465 2109931 2346240 2661146 3007931 3301759 3426439
9247 3426439 3324615 3043391 2724288 2436445 2232882 2117970 2074150 2034880 1998545 1988237
9237 1988237 1986816 2018164 2064059 2112505 2191109 2275762 2322816 2373607 2406876 2420719 2401170 2338082
9225 2338082 2258670 2145237 2044720 2001353 1990985 2016258 2034691 2039580 2082910 2157567 2262680
9214 2262680 2409553 2567376 2666591 2695416 2608066 2500592 2421033 2344480 2295357 2261671 2228515
9203 2228515 2234557 2281755 2290950 2307833 2345944 2377361 2421897 2470135 2501560 2544034 2615636 2693634
$$ packed form
9280A506017j15460o1154k4291j1933J3614L5204Q3513J04471J20445J14018R0100
9269A854544Q0116K8048k1446j7307k2685r430j8739m3250m0918j4478j0377N290
9257A769368L5959L5402M6500P2236J50466K36309L14906L46785K93828J24680
9247C426439j01824k81224l19103k87843k03563j14912m3820l9270l6335j0308
9237A988237j421L1348M5895M8446P8604Q4653M7054N0791L3269J3843j9549o3088
9225B338082p9412j13433j00517m3367j0368K5273J8433M889M3330P4657J05113
9214B262680J46873J57823R9215K8825q7350j07474p9559p6553m9123l3686l3156
9203B228515O042M7198R195J6883L8111L1417M4536M8238L1425M2474P1602P7998
$$ plain form
9191 2693634 2768642 2865319 2979217 3090046 3188974 3323107 3489007 3728345 3952421 4211421
9181 4211421 4526977 4876438 5323904 5860648 6483910 7273422 8255583 9447418 10813596
9172 10813596 12330179 13974613 15840585 17985734 20423039 22996316 25627155 28226353
9164 28226353 30563244 32369353 33344821 33231733 32058729 30117756 27825059 25513096
9156 25513096 23400010 21617451 20181953 19111672 18414131 18096863 18160123 18553087 19328442
9147 19328442 20465532 21951803 23795065 25975520 28450031 31179141 34164544 37482311
9139 37482311 41266483 45515621 50179108 55132436 60147121 64980501 69369515 73116499
9131 73116499 76212497 78714712 80762844 82454113 83795890 84795117 85348788 85344144 84580949
$$ packed form
9191B693634P5008R6677J13898J10829R8928J34133J65900K39338K24076K59000
9181D211421L15556L49461M47466N36744O23262P89512R82161J191835J366178
9172A0813596J516583J644434J865972K145149K437305K573277K630839K599198
9164B8226353K336891J806109R75468j13088j173004j940973k292697k311963
9156B5513096k113086j782559j435498j070281o97541l17268O3260L92964P75355
9147A9328442J137090J486271J843262K180455K474511K729110K985403L317767
9139C7482311L784172M249138M663487M953328N014685M833380M389014L746984
9131G3116499L095998K502215K048132J691269J341777R99227N53671m644p63195
$$ plain form
9122 84580949 82957814 80616510 77821068 74840075 71838651 68939159 66236916 63834906
9114 63834906 61910507 60581781 59906998 59920101 60582287 61907527 63766505 66166473 69028518
9105 69028518 72381672 76202799 80476093 85226508 90435926 96088068 102061587 108158063
9097 108158063 114190545 119973165 125402821 130416871 135025045 138974376 141835875 142998049
9089 142998049 141974466 138755553 133696456 127354842 120278795 112910895 105650686 98830777
9081 98830777 92690022 87357935 82814131 79044715 76024011 73709119 72070168 71078032
9073 71078032 70749343 71047389 71955685 73451499 75532433 78197943 81398162 85142457 89304166
9064 89304166 93810486 98502200 103148234 107505158 111327936 114450728 116627582 117617122
$$ packed form
9122H4580949j623135k341304k795442k980993l001424k899492k702243k402010
9114F3834906j924399j328726o74783J3103O62186J325240J858978K399968K862045
9105F9028518L353154L821127M273294M750415N209418N652142N973519O096476
9097A08158063O032482N782620N429656N014050M608174L949331K861499J162174
9089A42998049j023583l218913n059097o341614p076047p367900p260209o819909
9081I8830777o140755n332087m543804l769416l020704k314892j638951r92136
9073G1078032l28689K98046R08296J495814K080934K665510L200219L744295M161709
9064H9304166M506320M691714M646034M356924L822778L122792K176854R89540
$$ plain form
9056 117617122 117173922 115261083 111921793 107362062 101878878 95852729 89632288 83499786
9048 83499786 77649992 72230802 67311193 62844684 58825729 55238730 52041381 49256202
9040 49256202 46819038 44717793 43035895 41721847 40831280 40366457 40341757 40798536 41749580
9031 41749580 43217381 45122518 47305986 49515288 51497075 53043418 54079481 54595813
9023 54595813 54500234 53669254 52011926 49597528 46661280 43453028 40202629 37199417 34589818
9014 34589818 32358737 30480220 28926602 27623713 26456662 25378677 24372227 23376795
9006 23376795 22421394 21498313 20633143 19851281 19141565 18497286 17976781 17590356 17236361
8997 17236361 16966623 16786031 16709280 16682872 16704692 16770662 16865655 17053549 17264442 17478352
$$ packed form
9056A17617122m43200j912839l339290m559731n483184o026149o220441o132502
9048H3499786n849794n419190m919609m466509m018955l586999l197349k785179
9040D9256202k437164k101245j681898j314048q90567m64823k4700M56779R51044
9031D1749580J467801J905137K183468K209302J981787J546343J036063N16332
9023E4595813r5579q30980j657328k414398k936248l208252l250399l003212k609599
9014C4589818k231081j878517j553618j302889j167051j077985j006450r95432
9006B3376795r55401r23081q65170p81862p09716o44279n20505l86425l53995
8997A7236361k69738j80592p6751k6408K1820O5970R4993J87894K10893K13910
$$ plain form
8987 17478352 17710902 18001956 18302375 18600267 18917840 19239145 19626405 20059476 20510281
8978 20510281 20982418 21503461 22047889 22620808 23252294 23923295 24610557 25325663 26067491
8969 26067491 26826711 27641264 28474072 29344889 30246017 31192652 32218854 33294260 34435039
8960 34435039 35633203 36926931 38275883 39672744 41166623 42750866 44412133 46135506
8952 46135506 47944333 49835240 51779052 53763060 55789800 57847512 59900581 61990302
8944 61990302 64084730 66181979 68278738 70353366 72393503 74376348 76266034 78126591
8936 78126591 79887051 81547408 83106997 84616049 86041360 87452061 88858390 90166415
8928 90166415 91284448 92116161 92452867 92252670 91435687 90123588 88457258 86570448 84663335
$$ packed form
8987A7478352K32550K91054L00419K97892L17573L21305L87260M33071M50805
8978B0510281M72137N21043N44428N72919O31486O71001O87262P15106P41828
8969B6067491P59220Q14553Q32808Q70817R01128R46635J026202J075406J140779
8960C4435039J198164J293728J348952J396861J493879J584243J661267J723373
8952D6135506J808827J890907J943812J984008K026740K057712K053069K089721
8944F1990302K094428K097249K096759K074628K040137J982845J889686J860557
8936G8126591J760460J660357J559589J509052J425311J410701J406329J308025
8928I0166415J118033Q31713L36706k00197q16983j312099j666330j886810j907113
$$ plain form
8919 84663335 82854182 81245553 79871147 78747543 77869675 77142082 76553944 76049846 75470037
8910 75470037 74729232 73869978 72884909 71836918 70773136 69794674 68931729 68252162 67854412
8901 67854412 67729777 67880440 68333305 69017064 69907911 70982316 72110266 73154838 73965243
8892 73965243 74458892 74582457 74354869 73854289 73120722 72228164 71213650 70021074 68673671
8883 68673671 67175467 65557355 63848360 62069198 60187812 58226113 56313734 54492527
8875 54492527 52892302 51606537 50734384 50397152 50668457 51292985 51745720 51807459 51765697
8866 51765697 52088304 52978845 54382266 56173443 58132298 60007975 61547051 62635035
8858 62635035 63227647 63246006 62719298 61703481 60295363 58603855 56777416 54885792 52984243
$$ packed form
8919H4663335j809153j608629j374406j123604q77868p27593n88138n04098n79809
8910G5470037p40805q59254r85069j047991j063782r78462q62945o79567l97750
8901F7854412j24635J50663M52865O83759Q90847J074405J127950J044572Q10405
8892G3965243M93649J23565k27588n00580p33567q92558j014514j192576j347403
8883F8673671j498204j618112j708995j779162j881386j961699j912379j821207
8875E4492527j600225j285765q72153l37232K71305O24528M52735O1739m1762
8866E1765697L22607Q90541J403421J791177J958855J875677J539076J087984
8858F2635035N92612J8359n26708j015817j408118j691508j826439j891624j901549
$$ plain form
8849 52984243 51141295 49415441 47777373 46223245 44727592 43316706 42015340 40857991
8841 40857991 39873276 39051859 38364446 37752115 37141512 36479178 35696646 34787039 33835934
8832 33835934 32966118 32230530 31622644 31196026 30941841 30842884 30825061 30827582 30783074 30678703
8822 30678703 30510476 30228877 29868632 29514100 29188260 28886591 28642852 28441908 28199627
8813 28199627 27914608 27503455 26918554 26134189 25129233 23924024 22568166 21140804 19696297
8804 19696297 18313277 17056453 15933045 14929013 14081164 13391294 12850380 12435562 12144675
8795 12144675 11977978 11913210 11947413 12005422 12073141 12104749 12036095 11862769 11593716 11292190
8785 11292190 10966400 10686798 10470142 10332282 10222448 10120935 10026257 9843616 9512675 9098473
$$ packed form
8849E2984243j842948j725854j638068j554128j495653j410886j301366j157349
8841D0857991r84715q21417o87413o12331o10603o62334p82532r09607r51105
8832C3835934q69816p35588o07886m26618k54185r8957j7823K521m4508j04371
8822C0678703j68227k81599l60245l54532l25840l01669k43739k00944k42281
8813B8199627k85019m11153n84901p84365j004956j205209j355858j427362j444507
8804A9696297j383020j256824j123408j004032q47849o89870n40914m14818k90887
8795A2144675j66697o4768L4203N8009O7719L1608o8654j73326k69053l01526
8785A1292190l25790k79602k16656j37860j09834j01513r4678j82641l30941m14202
$$ plain form
8775 9098473 8640278 8111502 7556992 7074578 6664866 6302750 5961502 5645838 5342438 5099816
8765 5099816 4890530 4706034 4539846 4396577 4282568 4197150 4072565 3959300 3840154 3747028
8755 3747028 3707723 3650016 3580205 3520369 3476168 3442866 3410079 3355159 3287144 3213021 3154590
8744 3154590 3092376 3047273 2999405 2957778 2924617 2863725 2826488 2789444 2779040 2754933 2717410
8733 2717410 2692709 2662317 2636005 2617730 2633946 2630838 2599694 2576078 2573544 2588866 2575700 2584618
8721 2584618 2558882 2549986 2571829 2571236 2592538 2594456 2594124 2592956 2555011 2496973 2437682 2378067 2341005
8708 2341005 2310540 2243583 2192353 2187802 2186340 2142634 2089062 2073605 2064065 2050979 2048504 2043589
8696 2043589 2034657 2034019 2047119 2033873 2017540 2028065 2041055 2077821 2099384 2099390 2094134 2112350 2132469
$$ packed form
8775I098473m58195n28776n54510m82414m09712l62116l41248l15664l03400k42622
8765E099816k09286j84496j66188j43269j14009q5418j24585j13265j19146r3126
8755C747028l9305n7707o9811n9836m4201l3302l2787n4920o8015p4123n8431
8744C154590o2214m5103m7868m1627l3161o0892l7237l7044j0404k4107l7523
8733B717410k4701l0392k6312j8275J6216l108l1144k3616k534J5322j3166Q918
8721B584618k5736q896K1843n93K1302J918l32j168l7945n8038n9291n9615l7062
8708B341005l0465o6957n1230m551j462m3706n3572j5457r540j3086k475m915
8696B043589q932o38J3100j3246j6333J0525J2990L6766K1563On256J8216K0119
$$ plain form
8683 2132469 2150472 2166657 2161278 2124183 2072361 2023989 1990256 1966261 1942485 1914173 1894030 1870854
8671 1870854 1836013 1823440 1798425 1755711 1702860 1649420 1657817 1633477 1587204 1543507 1491928 1500480
8659 1500480 1506804 1509533 1501304 1493174 1494605 1523220 1570770 1561387 1556947 1574379 1574561 1542788 1533594
8646 1533594 1540871 1532890 1518022 1526615 1538137 1515337 1512665 1512568 1501484 1442265 1396176 1356457 1280428
8633 1280428 1241630 1202993 1150158 1114098 1079656 1056773 1049559 1070693 1055044 1024204 1026384 1039254
8621 1039254 1025035 994108 983812 1014278 1019790 999409 990361 976172 978363 970648 976062 978791 968406
8608 968406 959071 959808 960281 958560 952975 964615 933416 933391 937360 916883 923680 964453 993007 1042579
8594 1042579 1110273 1143039 1133604 1108370 1036236 972139 903911 857086 827779 777855 730330 709150
$$ packed form
8683B132469J8003J6185n379l7095n1822m8372l3733k3995k3776k8312k0143k3176
8671A870854l4841j2573k5015m2714n2851n3440Q397k4340m6273m3697n1579Q552
8659A500480O324K729q229q130J431K8615M7550r383m440J7432J82l1773r194
8646A533594P277p981j4868Q593J1522k2800k672r7j1084n9219m6089l9719p6029
8633A280428l8798l8637n2835l6060l4442k2883p214K1134j5649l0840K180J2870
8621A039254j4219l0927j0296L0466N512k0381r048j4189K191p715N414K729j0385
8608I68406r335P37M73j721n585J1640l1199k5L969k0477O797M0773K8554M9572
8594A042579O7694L2766r435k5234p2134o4097o8228m6825k9307m9924m7525k1180
$$ plain form
8582 709150 700294 686365 707477 715000 730854 744849 761146 738793 710912 702583 685408 667377
8570 667377 675411 679728 656155 627990 602729 587513 600075 607323 631883 640209 621285 608170
8558 608170 609535 597283 570624 575469 589749 614422 627255 650822 685839 728077 797207 852518
8546 852518 841366 788004 736663 699019 657338 642580 629668 642031 637339 622969 642844 676940
8534 676940 690252 659224 667824 649020 627945 619083 607724 601101 601929 588562 589645 606215 616356
8521 616356 610015 578901 585567 601923 621352 619425 636907 637908 631158 639619 627543 606962 633364
8508 633364 638137 596843 590089 624007 658277 688216 742152 762960 739976 695272 676664 658233
8496 658233 662696 688920 711857 720288 704534 709170 708825 672170 635811 649254 658668 664531 687717
$$ packed form
8582G09150q856j3929K1112P523J5854J3995J6297k2353k7881q329j7175j8031
8570F67377Q034M317k3573k8165k5261j5216J2562P248K4560Q326j8924j3115
8558F08170J365j2252k6659M845J4280K4673J2833K3567L5017M2238O9130N5311
8546H52518j1152n3362n1341l7644m1681j4758j2912J2363m692j4370J9875L4096
8534F76940J3312l1028Q600j8804k1075q862j1359o623Q28j3367J083J6570J0141
8521F16356o341l1114O666J6356J9429j927J7482J001o750Q461j2076k0581K6402
8508F33364M773m1294o754L3918L4270K9939N3936K0808k2984m4704j8608j8431
8496F58233M463K6224K2937Q431j5754M636l45l6655l6359J3443R414N863K3186
$$ plain form
8483 687717 695566 695621 691124 677772 683806 697806 661583 650942 645847 613542 562050 569336 584600
8470 584600 584519 587509 596197 611993 622518 613641 632550 655954 670670 694257 700876 701995 724698
8457 724698 720803 722088 730892 720055 712299 687274 688459 703635 718479 752205 808960 874241 965479
8444 965479 1102193 1225862 1235185 1145933 991194 834870 712122 640034 613332 584294 542130
8433 542130 539225 533789 518889 525615 533467 544093 558412 556518 526149 516787 494412 472134 482436
8420 482436 518201 530528 508173 469874 451145 452051 446285 465964 476061 488507 480435 458493
8408 458493 443703 467919 481812 509133 530903 610430 745840 896817 1130163 1424424 1608137
8397 1608137 1579281 1380074 1119449 893440 736410 624957 561189 499791 448662 406163
$$ packed form
8483F87717P849N5m497j3352O034J4000l6223j0641n095l2305n1492P286J5264
8470E84600q1K990Q688J5796J0525q877J8909K3404J4716K3587O619J119K2703
8457G24698l895J285Q804j0837p756k5025J185J5176J4844L3726N6755O5281R1238
8444I65479J36714J23669R323q9252j54739j56324j22748p2088k6702k9038m2164
8433E42130k905n436j4900O726P852J0626J4319j894l0369r362k2375k2278J0302
8420D82436L5765J2327k2355l8299j8729R06n766J9679J0097J2446q072k1942
8408D58493j4790K4216J3893K7321K1770P9527J35410J50977K33346K94261J83713
8397A608137k8856j99207k60625k26009j57030j11453o3768o1398n1129m2499
$$ plain form
8387 406163 376224 367985 388696 405457 429843 433101 422171 405462 372490 335997 326757 339153
8375 339153 312864 307434 310649 285094 269493 271698 266844 270549 280283 282506 310566 318020 309380
8362 309380 295228 324475 363720 388762 405869 415615 454937 568275 684449 787034 838521
8351 838521 789768 659182 514943 450627 397897 341808 331390 301955 273869 277053 272219 257254
8339 257254 243530 237469 261620 284264 272240 236324 231039 227206 218517 232733 253965 257318 258942
8326 258942 250452 247533 261333 258674 252953 224526 225773 246866 268177 253844 257895 235721 213863
8313 213863 195530 193405 198679 180736 183577 190986 182405 228077 242465 237607 203016 153085 142313
8300 142313 151408 172923 200448 224279 194961 173907 194852 216024 217527 240175 259789 244989
$$ packed form
8387D06163k9939q239K0711J6761K4386L258j0930j6709l2972l6493r240J2396
8375C39153k6289n430L215k5555j5601K205m854L705R734K223K8060P454q640
8362C09380j4152K9247L9245K5042J7107R746L9322J13338J16174J02585N1487
8351H38521m8753j30586j44239o4316n2730n6089j0418k9435k8086L184m834j4965
8339B57254j3724o061K4151K2644j2024l5916n285l833q689J4216K1232L353J624
8326B58942q490k919J3800k659n721k8427J247K1093K1311j4333M051k2174k1858
8313B13863j8333k125N274j7943K841P409q581M5672J4388m858l4591m9931j0772
8300A42313R095K1515K7525K3831k9318k1054K0945K1172J503K2648J9614j4800
$$ plain form
8288 244989 223502 217461 206958 184540 175831 170175 158047 153173 177859 210579 226249 218388 206008
8275 206008 200043 194914 172133 157591 143749 142079 160848 166084 178277 162946 159568 174795 179723
8262 179723 204023 215996 173822 139211 131269 138514 157987 176474 177670 162974 163923 162829 151199
8249 151199 157553 153649 173358 180160 171298 150289 166228 166511 138270 109584 119587 148942 180662
8236 180662 175256 160926 137107 133063 137066 169000 179782 174480 156544 136863 131308 133886 132235
8223 132235 122566 128510 126939 116194 120448 119899 137192 129046 141180 133341 130475 119981 134912
8210 134912 157437 176751 193157 193895 184402 165026 174632 211316 186967 155443 154337 181522 192378
8197 192378 169405 167607 164098 145800 171843 170516 165857 162549 148853 115399 110695 114781 149008
$$ packed form
8288B44989k1487o041j0503k2418q709n656j2128m874K4686L2720J5670p861j2380
8275B06008n965n129k2781j4542j3842j670J8769N236J2193j5331l378J5227M928
8262A79723K4300J1973m2174l4611p942P245J9473J8487J196j4696R49j094j1630
8249A51199O354l904J9709O802q862k1009J5939K83k8241k8686J0003K9355L1720
8236A80662n406j4330k3819m044M003L1934J0782n302j7936j9681n555K578j651
8223A32235r669N944j571j0745M254n49J7293q146J2134p839k866j0494J4931
8210A34912K2525J9314J6406P38r493j9376R606L6684k4349l1524j106K7185J0856
8197A92378k2973j798l509j8298K6043j327m659l308j3696l3454m704M086L4227
$$ plain form
8184 149008 165595 156999 144580 123818 86593 79984 110255 154536 161128 140630 105076 117536
8172 117536 113504 122257 146790 124349 111299 112765 120064 125017 135746 148726 131773 121461 152752
8159 152752 181149 197227 201632 180826 170851 176186 201490 211607 208459 187317 148491 124759
8147 124759 122246 108517 110322 108947 98114 113170 138386 143939 166345 169338 150667 140051 135982
8134 135982 114631 125867 158200 209067 219781 223180 210968 225217 215718 200501 195032 171912
8122 171912 132411 87243 59879 59660 82330 85015 106754 103136 123344 132463 131586 121560 120842
8109 120842 115790 90719 102358 114830 106909 107088 103576 145797 149805 125742 119545 119436 125905 101065
8095 101065 101609 70268 69810 81965 89553 108523 136066 126353 120551 106733 130821 173503 224495
$$ packed form
8184A49008J6587q596j2419k0762l7225o609L0271M4281O592k0498l5554J2460
8172A17536m032Q753K4533k2441j3050J466P299M953J0729J2980j6953j0312L1291
8159A52752K8397J6078M405k0806r975N335K5304J0117l148k1142l8826k3732
8147A24759k513j3729J805j375j0833J5056K5216N553K2406K993j8671j0616m069
8134A35982k1351J1236L2333N0867J0714L399j2212J4249r499j5217n469k3120
8122A71912l9501m5168k7364k19K2670K685K1739l618K0208R119q77j0026p18
8109A20842n052k5071J1639J2472p921J79l512M2221M008k4063o197j09O469k4840
8095A01065N44l1341m58J2155P588J8970K7543r713n802j3818K4088M2682N0992
$$ plain form
8082 224495 259743 288620 293976 267693 226894 192071 188638 197636 192979 168256 160463 157965 195506
8069 195506 187927 169246 180731 186151 181294 199270 231077 226592 215544 201443 186008 179459 181597
8056 181597 163359 172822 178228 151359 143069 140293 128726 111295 115160 143994 149228 157465 157429 158289
8042 158289 162612 154800 172101 187794 209485 221597 239273 232460 229749 220894 208433 196277 201665
8029 201665 243923 283974 278444 255267 229994 201755 184547 183174 193445 209753 216524 230840
8017 230840 267115 260253 248936 212157 181752 153697 158621 161446 144457 135849 151484 115946
8005 115946 117019 141010 138817 136722 163433 179940 188524 203786 223921 226529 207689 195685 161750
7992 161750 138273 98894 109678 156946 165201 153031 133821 129819 146338 150374 118662 135736
$$ packed form
8082B24495L5248K8877N356k6283m0799l4823l433Q998m657k4723p793k498L7541
8069A95506p579j8681J1485N420m857J7976L1807m485j1048j4101j5435o549K138
8056A81597j8238R463N406k6869q290k776j1567j7431L865K8834N234Q237l6Q60
8042A58289M323p812J7301J5693K1691J2112J7676o813k711q855j2461j2156N388
8029B01665M2258M0051n530k3177k5273k8239j7208j373J0271J6308O771J4316
8017B30840L6275o862j1317l6779l0405k8055M924K825j6989q608J5635l5538
8005A15946J073K3991k193k095K6711J6507Q584J5262K0135K608j8840j2004l3935
7992A61750k3477l9379J0784M7268Q255j2170j9210m002J6519M036l1712J7074
$$ plain form
7980 135736 147504 149285 154537 181771 151126 113647 106202 115959 115378 109513 95051 87447 101274
7967 101274 128868 113130 101959 114948 135713 144547 144940 143029 160294 159514 152570 150731 161651
7954 161651 166913 152203 144480 143790 137467 125435 106908 135851 146647 111448 83454 69942 49209
7941 49209 41865 61660 108317 109509 98970 100964 77680 79451 79088 74132 84896 92578 88088 96972
7927 96972 136092 154824 127395 101356 102976 93957 88564 75564 60752 67830 80193 75638 70894
7914 70894 104931 95974 71742 57523 63363 103457 121311 97941 73450 44415 47840 58661
7902 58661 64352 58930 53285 96534 114943 128820 142253 129968 120157 113618 93374 102859 100358
7889 100358 84716 86362 84010 96209 93966 98689 87002 82354 86475 60301 86714 93118 97798
$$ packed form
7980A35736J1768J781N252K7234l0645l7479p445R757n81n865j4462p604J3827
7967A01274K7594j5738j1171J2989K0765Q834L93j911J7265p80o944j839J0920
7954A61651N262j4710p723o90o323j2032j8527K8943J0796l5199k7994j3512k0733
7941D9209p344J9795M6657J192j0539J994k3284J771l63m956J0764P682m490Q884
7927I6972L9120J8732k7429k6039J620r019n393j3000j4812P078J2363m555m744
7914G0894L4037q957k4232j4219N840M0094J7854k3370k4491k9035L425J0821
7902E8661N691n422n645M3249J8409J3877J3433j2285r811o539k0244R485k501
7889A00358j5642J646k352J2199k243M723j1687m648M121k6174K6413O404M680
$$ plain form
7876 97798 100304 84081 80595 85487 65435 60468 54876 32011 35241 42761 49241 46415 60766 83130
7862 83130 85032 57285 44084 36268 54881 51828 40499 42042 42514 30900 37418 49305 58732
7849 58732 52955 41631 44682 51529 47942 49748 50644 52291 63588 71628 62702 47282 56129 37220
7835 37220 24596 51114 53251 58272 48948 25761 30104 45930 71583 76206 49049 60984 80751
7822 80751 87157 63276 36215 35759 53153 70375 90249 69600 57548 88132 82968 35777 36793
7809 36793 71583 59519 59839 54260 62777 70159 77762 69159 46001 35540 31148 44887 50028 49604
7795 49604 32887 50798 78016 93884 91543 94406 128242 136668 116930 92962 50565 75286
7783 75286 73467 57292 52313 25243 8805 7498 20660 36863 54872 37458 36039 28185 30556
$$ packed form
7876I7798K506j6223l486M892k0052m967n592k2865L230P520O480k826J4351K2364
7862H3130J902k7747j3201p816J8613l053j1329J543M72j1614O518J1887R427
7849E8732n777j1324L051O847l587J806Q96J647J1297Q040q926j5420Q847j8909
7835C7220j2624K6518K137N021r324k3187M343J5826K5653M623k7157J1935J9767
7822H0751O406k3881k7061m56J7394J7222J9874k0649j2052L0584n164m7191J016
7809C6793L4790j2064L20n579Q517P382P603q603k3158j0461m392J3739N141m24
7795D9604j6717J7911K7218J5868k341K863L3836Q426j9738k3968m2397K4721
7783G5286j819j6175m979k7070j6438j307J3162J6203J8009j7414j419p854K371
$$ plain form
7770 30556 32199 42364 58686 62392 60677 39582 33505 36908 46546 51722 49138 65583 58298 43462
7756 43462 14573 20938 31766 38256 36842 41144 70493 84330 58886 47757 42680 46942 48727
7743 48727 42146 37401 26764 38687 30688 42895 39120 20760 36977 37633 48184 23411 28702
7730 28702 36859 32185 27066 17259 30414 35611 46038 64466 58290 55536 56333 48522 69597 50935
7716 50935 27294 38790 57878 61340 45571 -2654 -8906 34023 26571 25993 33655 34053 16480
7703 16480 5932 13272 33115 35559 28542 19099 40768 51446 41463 25016 40279 68641 84899
7690 84899 58319 42878 68257 61210 31769 8893 10059 17117 40658 59194 71674 40826
7678 40826 -9016 -6368 -1784 36410 17246 13897 14709 1174 -23120 -4560 10805 3226 -447
$$ packed form
7770C0556J643J0165J6322L706j715k1095o077L403R638N176k584J6445p285j4836
7756D3462k8889O365J0828O490j414M302K9349J3837k5444j1129n077M262J785
7743D8727o581m745j0637J1923p999J2207l775j8360J6217O56J0551k4773N291
7730B8702Q157m674n119r807J3155N197J0427J8428o176k754P97p811K1075j8662
7716E0935k3641J1496J9088L462j5769m8225o252M2929p452n78P662L98j7573
7703A6480j0548P340J9843K444p017r443K1669J0678r983j6447J5263K8362J6258
7690H4899k6580j5441K5379p047k9441k2876J166P058K3541J8536J2480l0848
7678D0826m9842K648M584L8194j9164l349Q12j3535k4294J8560J5365p579l673
$$ plain form
7665 -447 23208 48595 28184 36224 40798 29804 -10833 1689 30146 36064 22092 25832 54688
7652 54688 70582 66249 47337 37865 43084 62386 47118 48187 47690 60549 63529 42903 73385
7639 73385 77542 45119 25991 45482 50868 47343 33297 38067 36732 39702 24873 22423 47664
7626 47664 33974 38684 50587 61246 61791 65942 55022 47634 32090 27763 33068 20716 14310
7613 14310 33682 50817 39220 6991 13514 21227 29955 28270 27613 36076 76322 75850 63220 66105
7599 66105 64048 50139 48735 65981 58152 35173 34780 49915 52686 37598 47880 31141 49642
7586 49642 60527 45626 22613 20855 65244 67083 42481 35416 38548 11152 -4831 -5948 -6162
7573 -6162 -7639 28091 38860 28836 19006 19753 15469 35890 62596 54129 55010 70060 66190 38951
$$ packed form
7665d47K3655K5387k0411Q040M574j0994m0637J2522K8457N918j3972L740K8856
7652E4688J5894m333j8912r472N219J9302j5268J069m97J2859K980k0626L0482
7639G3385M157l2423j9128J9491N386l525j4046M770j335K970j4829k450K5241
7626D7664j3690M710J1903J0659N45M151j0920p388j5544m327N305j2352o406
7613A4310J9372J7135j1597l2229O523P713Q728j685o57Q463M0246m72j2630K885
7599F6105k057j3909j404J7246p829k2979l93J5135K771j5088J0282j6739J8501
7586D9642J0885j4901k3013j758M4389J839k4602p065L132k7396j5983j117k14
7573f162j477L5730J0769j0024r830P47m284K0421K6706q467Q81J5050l870k7239
$$ plain form
7559 38951 20038 3090 24112 53059 42176 26172 -9350 -10278 15918 33932 51778 38504
7547 38504 33455 13924 -4061 -5993 -7944 -13986 -6366 2377 2675 -897 -4210 6372 36146 37560
7533 37560 45872 59185 67909 75039 83826 40961 18258 22829 32491 22765 32824 38862 37871 54659
7519 54659 44482 42897 43816 35220 26678 48903 57468 58030 45661 24884 27058 40958 45222 44708
7505 44708 45770 39466 42969 40105 30501 24197 15138 6756 9095 13489 29758 39844 48102 29094
7491 29094 18259 -21094 -6240 1221 16656 41216 52423 35124 36116 51813 65891 46565
7479 46565 27549 30492 30920 17772 32190 42599 30954 -19899 -8567 4096 -34363 -24838 -48962
7466 -48962 -61432 -68236 -35617 2014 -3999 -31002 -30209 -4218 4228 -15256 8739 13097 10285
$$ packed form
7559C8951j8913j6948K1022K8947j0883j6004l5522r28K6196J8014J7846j3274
7547C8504n049j9531j7985j932j951o042P620Q743K98l572l313J0582K9774J414
7533C7560Q312J3313Q724P130Q787m2865k2703M571R662r726J0059O038r91J6788
7519E4659j0177j585R19q596q542K2225Q565N62j2369k0777K174J3900M264n14
7505D4708J062o304L503k864r604o304r059q382K339M394J6269J0086Q258j9008
7491B9094j0835l9353J4854P461J5435K4560J1207j7299R92J5697J4078j9326
7479D6565j9016K943M28j3148J4418J0409j1645n0853J1332J2663l8459R525k4124
7466d8962j2470o804L2619L7631o013k7003P93K5991Q446j9484K3995M358k812
$$ plain form
7453 10285 8725 25026 36998 47606 54988 60218 64340 80986 51768 7630 27150 40556 42108
7440 42108 31724 41587 28249 18832 10701 25298 42314 57160 72857 42891 16868 18758 43062
7427 43062 56718 41187 6933 -2474 3283 9679 8015 8544 20661 25214 34512 25903 37955 66763
7413 66763 52043 28003 30194 20721 20136 34655 13269 -15434 -30036 12957 26060 2322 -136
7400 -136 32755 23118 20637 50995 61635 49483 33589 24089 30229 35510 24450 5948 9855
7387 9855 5067 3051 -13163 13017 12642 -4078 1169 -14667 -5014 18060 21350 37892 40805 25102
7373 25102 41699 36617 20256 9438 9117 5664 37483 50078 33421 45964 64000 57598 47499
7360 47499 21810 13612 15472 21211 20715 24065 25025 22937 20496 44042 60240 46838 1723 48
$$ packed form
7453A0285j560J6301J1972J0608P382N230M122J6646k9218m4138J9520J3406J552
7440D2108j0384R863j3338r417q131J4597J7016J4846J5697k9966k6023J890K4304
7427D3062J3656j5531l4254r407N757O396j664N29J2117M553R298q609J2052K8808
7413F6763j4720k4040K191r473n85J4519k1386k8703j4602M2993J3103k3738k458
7400a36L2891r637k481L0358J0640j2152j5894r500O140N281j1060j8502L907
7387I855m788k016j6214K6180l75j6720N247j5836R653K3074L290J6542K913j5703
7373B5102J6597n082j6361j0818l21l453L1819J2595j6657J2543J8036o402j0099
7360D7499k5689q198J860N739m96L350R60k088k441K3546J6198j3402m5115j675
$$ plain form
7346 48 2897 25332 43313 46443 65946 71877 70394 51308 47465 34739 28333 15711 48268 57846
7332 57846 49676 45434 49951 35469 7811 13333 27127 21245 -3372 -20078 -9231 -5100 21279
7319 21279 70857 103062 80849 44216 37243 50774 52640 31195 20586 2638 14581 14802 -2158
7306 -2158 9088 -6454 -8084 11481 36914 51256 44565 61108 61490 14730 4898 21556 1175
7293 1175 15956 29867 54883 67716 67505 67283 54989 47193 56871 81456 81490 53618 47558 19158
7279 19158 18917 27497 22546 21754 30958 51169 35085 18432 18167 22701 14339 5032 9175 21352
7265 21352 43346 49168 12865 21543 26827 36930 44474 43315 33587 25786 30002 30145 45466 51760
7251 51760 19049 10019 16896 22123 22340 26167 14824 24836 39904 43619 61893 67658 86438
$$ packed form
7346D8K849K2435J7981L130J9503N931j483j9086l843j2726o406j2622L2557R578
7332E7846q170m242M517j4482k7658N522J3794n882k4617j6706J0847M131K6379
7319B1279M9578L2205k2213l6633o973J3531J866k1445j0609j7948J1943K21j6960
7306b158J1246j5542j630J9565K5433J4342o691J6543L82m6760r832J6658k0381
7293A175J4781J3911K5016J2833k11k22j2294p796R678K4585L4k7872o060k8400
7279A9158k41Q580m951p92R204K0211j6084j6653k65M534q362r307M143J2177
7265B1352K1994N822l6303Q678N284J0103P544j159r728p801M216J43J5321O294
7251E1760l2711r030O877N227K17L827j1343J0012J5068L715J8274N765J8780
$$ plain form
7238 86438 90527 74155 90746 75987 58169 48757 32616 22906 23195 17504 13565 19907 13574 29703
$$ packed form
7238H6438M089j6372J6591j4759j7818r412j6141r710K89n691l939O342o333J6129
$$ [...]
##END NTUPLES=NMR SPECTRUM
##END=
