##TITLE=Analysis number 310647
Compound Code mo 01317
Project Code adrs
Chemist Name stores
##JCAMPDX= 6.0         $$ Bruker NMR JCAMP-DX V2.0
##DATA TYPE= NMR SPECTRUM
##DATA CLASS= NTUPLES
##ORIGIN= Bruker BioSpin GmbH
##OWNER= NMR
$$ XWIN-NMR		Version 3.5
$$ Tue Jun 21 12:59:23 2005 GMT Daylight Time (UT+1h)  MAYBRIDGE\NMR@NMR_250MHZ
##.OBSERVE FREQUENCY= 250.131544655141
##.OBSERVE NUCLEUS= ^1H
##.ACQUISITION MODE= SIMULTANEOUS (DQD)
##.ACQUISITION SCHEME= undefined
##.AVERAGES= 16
##.DIGITISER RES= 18
##SPECTROMETER/DATA SYSTEM= dpx250
##.PULSE SEQUENCE= zg30
##.SOLVENT NAME= DMSO
##.SHIFT REFERENCE= (INTERNAL, DMSO, 0, 16.522)
##AUDIT TRAIL= $$ (NUMBER, WHEN, WHO, WHERE, WHAT)
$$ ##TITLE= Audit trail, XWIN-NMR		Version 3.5
$$ ##JCAMPDX= 5.01
$$ ##ORIGIN= Bruker BioSpin GmbH
$$ ##OWNER= NMR
$$ C:\u/data/dgb/nmr/ADRS/4460/pdata/1/auditp.txt
$$ ##AUDIT TRAIL=  $$ (NUMBER, WHEN, WHO, WHERE, WHAT)
(   1,<2005-06-21 12:59:04.00 +100>,<MAYBRIDGE\NMR>,<NMR_250MHZ>,
      <created by zg, POWCHK disabled, PULCHK disabled
       configuration hash MD5:
       62 19 C7 07 E1 42 D1 B7 37 6C 3D D0 77 39 F9 E6
       data hash MD5: 64K
       E9 8D 7E E6 A8 52 70 1E 24 E7 38 DA AB 45 13 63>)
(   2,<2005-06-21 12:59:15.07 +100>,<MAYBRIDGE\NMR>,<NMR_250MHZ>,
      <Start of raw data processing
       ef LB = 0.3 FT_mod = 6 PKNL = 1 SI = 32K 
       data hash MD5: 32K
       B6 AF DC 0B BD B2 35 D9 D8 3D 0D 6A 04 F0 95 B1>)
(   3,<2005-06-21 12:59:16.94 +100>,<MAYBRIDGE\NMR>,<NMR_250MHZ>,
      <apk 
       data hash MD5: 32K
       04 6D DA FE AE ED A9 5C 69 7E AD 86 4D 1F 36 1A>)
(   4,<2005-06-21 12:59:17.63 +100>,<MAYBRIDGE\NMR>,<NMR_250MHZ>,
      <abs ABSG = 5 
       data hash MD5: 32K
       B3 97 60 A2 98 AD FB 61 96 0A 66 AE 91 B1 76 C5>)
$$ ##END=
$$ 
$$ hash MD5
$$ CB C3 29 ED 4E CE 80 4A 95 A5 5F 3A F1 6E 03 93
##$RELAX= 
##$RELAX= 
##$RELAX= 
##$RELAX= 
##$RELAX= 
##$RELAX= 
##$RELAX= 
$$ Bruker specific parameters
$$ --------------------------
##$DU= <C:\u>
##$EXPNO= 4460
##$NAME= <ADRS>
##$PROCNO= 1
##$TYPE= <nmr>
##$USER= <dgb>
##$AMP= (0..31)
100 100 100 100 100 100 100 100 100 100 100 100 100 100 100 100 100 100 
100 100 100 100 100 100 100 100 100 100 100 100 100 100 
##$AQSEQ= 0
##$AQ_mod= 3
##$AUNM= <au_zg>
##$AUTOPOS= <26 >
##$BF1= 250.13
##$BF2= 250.13
##$BF3= 250.13
##$BF4= 250.13
##$BF5= 500.13
##$BF6= 500.13
##$BF7= 500.13
##$BF8= 500.13
##$BYTORDA= 1
##$CFDGTYP= 0
##$CFRGTYP= 5
##$CHEMSTR= <none>
##$CNST= (0..31)
1 1 145 1 1 1 1 1 1 1 1 1 1 1 1 1 1 1 1 1 1 1 1 1 1 1 1 1 1 1 1 1 
##$CPDPRG= <>
##$CPDPRG1= <>
##$CPDPRG2= <>
##$CPDPRG3= <>
##$CPDPRG4= <mlev>
##$CPDPRG5= <mlev>
##$CPDPRG6= <mlev>
##$CPDPRG7= <mlev>
##$CPDPRG8= <mlev>
##$CPDPRGB= <>
##$CPDPRGT= <>
##$D= (0..31)
0 1 0 0 0 0 0 0 0 0.06 0 0 0 0 0 0 0.0002 0 0 0 0 0 0 0 0 0 0 0 0 0 0 
0 
##$DATE= 1119355143
##$DBL= (0..7)
120 120 120 120 120 120 120 120 
##$DBP= (0..7)
150 150 150 150 150 150 150 150 
##$DBP07= 0
##$DBPNAM0= <>
##$DBPNAM1= <>
##$DBPNAM2= <>
##$DBPNAM3= <>
$$ [...]
##$SUBNAM7= <"">
##$SUBNAM8= <"">
##$SUBNAM9= <"">
##$SW= 20.6930455092707
##$SWIBOX= (0..15)
0 0 3 0 0 0 0 0 0 0 0 0 0 0 0 0 
##$SW_h= 5175.983436853
##$TD= 65536
##$TD0= 1
##$TE= 295.16
##$TE2= 300
##$TE3= 300
##$TEG= 300
##$TL= (0..7)
0 120 120 120 120 120 120 120 
##$TP= (0..7)
150 150 150 150 150 150 150 150 
##$TP07= 0
##$TPNAME0= <>
##$TPNAME1= <>
##$TPNAME2= <>
##$TPNAME3= <>
##$TPNAME4= <>
##$TPNAME5= <>
##$TPNAME6= <>
##$TPNAME7= <>
##$TPOAL= (0..7)
0.5 0.5 0.5 0.5 0.5 0.5 0.5 0.5 
##$TPOFFS= (0..7)
0 0 0 0 0 0 0 0 
##$TUNHIN= 0
##$TUNHOUT= 0
##$TUNXOUT= 0
##$USERA1= <user>
##$USERA2= <user>
##$USERA3= <user>
##$USERA4= <user>
##$USERA5= <user>
##$V9= 5
##$VALIST= <valist>
##$VCLIST= <CCCCCCCCCCCCCCC>
##$VD= 0
##$VDLIST= <DDDDDDDDDDDDDDD>
##$VPLIST= <PPPPPPPPPPPPPPP>
##$VTLIST= <TTTTTTTTTTTTTTT>
##$WBST= 1024
##$WBSW= 4
##$XGAIN= (0..3)
0 0 0 0 
##$XL= 0
##$YL= 0
##$YMAX_a= 292562
##$YMIN_a= -235257
##$ZGOPTNS= <>
##$ZL1= 120
##$ZL2= 120
##$ZL3= 120
##$ZL4= 120
##$ABSF1= 16.522
##$ABSF2= -4.171173
##$ABSG= 5
##$ABSL= 3
##$ALPHA= 0
##$AQORDER= 0
##$ASSFAC= 0
##$ASSFACI= 0
##$ASSFACX= 0
##$ASSWID= 0
##$AUNMP= <proc_1d>
##$AZFE= 0.1
##$AZFW= 0.1
##$BCFW= 0
##$BC_mod= 0
##$BYTORDP= 0
##$COROFFS= 0
##$CY= 12.5
##$DATMOD= 1
##$DC= 0
##$DFILT= <>
##$DTYPP= 0
##$F1P= 14.0000005364418
##$F2P= -0.99999901652339
##$FCOR= 0.5
##$FTSIZE= 32768
##$FT_mod= 6
##$GAMMA= 0
##$GB= 0
##$INTBC= 1
##$INTSCL= 1
##$ISEN= 128
##$LB= 0.3
##$LEV0= 0
##$LPBIN= 0
##$MAXI= 10000
##$MC2= 0
##$MEAN= 0
##$ME_mod= 0
##$MI= 0
##$NCOEF= 0
##$NC_proc= -5
##$NLEV= 6
##$NOISF1= 0
##$NOISF2= 0
##$NSP= 0
##$NTH_PI= 0
##$NZP= 0
##$OFFSET= 16.522
##$PC= 1
##$PHC0= -92.7636
##$PHC1= 12.01008
##$PH_mod= 1
##$PKNL= yes
##$PPARMOD= 0
##$PSCAL= 4
##$PSIGN= 0
##$REVERSE= no
##$SF= 250.13
##$SI= 32768
##$SIGF1= 0
##$SIGF2= 0
##$SINO= 400
##$SIOLD= 32768
##$SREGLST= <1H.DMSO>
##$SSB= 0
##$STSI= 32768
##$STSR= 0
##$SW_p= 5175.98343685301
##$SYMM= 0
##$S_DEV= 0
##$TDeff= 65536
##$TDoff= 0
##$TI= <Analysis number 999999
Compound Code 99
Book Reference 9
Project Code 9>
##$TILT= no
##$TM1= 0
##$TM2= 0
##$TOPLEV= 0
##$USERP1= <user>
##$USERP2= <user>
##$USERP3= <user>
##$USERP4= <user>
##$USERP5= <user>
##$WDW= 1
##$XDIM= 32768
##$YMAX_p= 319610109
##$YMIN_p= -495925
$$ End of Bruker specific parameters
$$ ---------------------------------
##NTUPLES= NMR SPECTRUM
##VAR_NAME=  FREQUENCY,     SPECTRUM/REAL,   SPECTRUM/IMAG
##SYMBOL=    X,             R,               I
##VAR_TYPE=  INDEPENDENT,   DEPENDENT,       DEPENDENT
##VAR_FORM=  AFFN,          ASDF,            ASDF
##VAR_DIM=   32768,         32768,           32768
##UNITS=     HZ,            ARBITRARY UNITS, ARBITRARY UNITS
##FACTOR=    0.157963299565203, 1,           1
##FIRST=     4132.6476996994, 0,             0
##LAST=      -1043.33573715361, 0,           0
##MIN=       -1043.33573715361, -495925,     0
##MAX=       4132.6476996994, 319610109,     0
$$ Real data points
##PAGE= N=1
##DATA TABLE= (X++(R..R)), XYDATA
$$ [...]
27323 993572 892001 993823 1089057 1337478 1423246 1418735 1403268 1264407 1141459 1096200 1121758
27312 1121758 1148823 1081775 1022021 951432 815992 778794 807580 951570 1086110 1055717 910881
27301 910881 751631 785692 875860 753774 861141 960580 898883 850447 848502 778790 813264
27290 813264 902009 917972 896025 735389 681121 640637 631427 696408 756966 897816 1117556
27279 1117556 1089352 861365 858581 997894 950377 857195 837483 751119 789705 769940 743814
27268 743814 727230 726766 778973 858629 947054 954947 935319 902075 993322 1004649 995118 1020096
27256 1020096 840482 768171 722531 652369 610079 529177 516834 529713 640639 632135 762214
27245 762214 808079 729638 635490 563856 650744 609224 504970 459179 541523 767097 869063
27234 869063 829347 697104 553396 644912 740000 734750 768750 765642 840194 872432 882869
27223 882869 799812 752070 694169 572827 567132 584858 620496 640037 609619 567409 487527
27212 487527 600749 742352 740326 708472 647147 805487 915791 876103 852524 766745 754959
27201 754959 762196 743540 758965 762821 732167 769533 804234 661347 568046 462057 450954
27190 450954 466106 399432 393647 558309 588712 421989 400141 479579 437493 593518 742632
27179 742632 851698 659166 580774 639587 639337 673185 864097 865790 729285 526927 391363
27168 391363 419773 478348 539893 568491 630552 680738 606104 600392 724475 675293 381842
27157 381842 372976 369394 326041 403530 578427 664267 588182 586354 547913 554887 489848 357542
27145 357542 375104 493629 453967 453320 656823 662678 587391 592781 663891 696629 634155 537547
27133 537547 506526 528666 547319 571360 515096 593200 612194 578567 545134 493254 545807
27122 545807 536281 584356 578821 450584 454539 530345 468336 416019 420847 510448 496444 402049
27110 402049 471776 454913 373901 292239 344006 335742 494767 606087 623290 587668 562789
27099 562789 506272 532518 545555 587068 615705 621770 678462 618387 439571 341163 341489 278007
27087 278007 286836 273248 291807 311015 271328 122187 35919 40976 112553 341752 301440
27076 301440 241206 279820 337942 271037 307263 507698 617121 451495 357689 496152 443616
27065 443616 267420 247098 296061 367117 403241 333542 336854 282139 313077 395266 408540
27054 408540 440128 474039 457172 484798 530460 559710 579078 598312 647900 503521 351321
27043 351321 362601 364102 393903 316448 261709 168520 229889 360299 310542 225803 274723
27032 274723 373343 484428 539537 509881 368840 307081 310431 327174 446529 421010 415334
27021 415334 361763 314949 335074 359086 462193 571798 459455 316239 259137 245099 322622
27010 322622 348535 392285 395605 423420 481421 411117 325140 340088 386773 293462 236714 154436
26998 154436 138424 255409 224216 206161 262014 199825 240188 220262 148382 350776 388558
26987 388558 420123 404256 231170 200088 296160 367591 369488 307981 285902 356352 464242
26976 464242 447751 463738 324439 158541 213143 323344 333702 378691 477150 439959 412792
26965 412792 378508 377935 346572 285867 299070 383863 417818 430356 335814 317008 316482 253148
26953 253148 230374 196219 132278 278244 371050 381615 307709 254756 318087 488844 510310
26942 510310 440190 312923 232286 273101 314754 255092 308077 388878 405042 304315 300638
26931 300638 277867 180791 40729 38002 100769 161244 238094 318785 265727 276266 273601 239627
26919 239627 205090 246730 388849 471750 457343 397920 500658 400177 294992 270365 256208
26908 256208 222812 272074 413194 472865 480201 455176 361345 439032 586439 567834 481566
26897 481566 531676 467920 278979 296836 319301 270722 258220 210628 204166 104998 244411
26886 244411 403077 360184 412888 521387 410979 407029 347280 374146 398264 405160 366084
26875 366084 325416 332813 404823 431820 326304 346415 261779 250816 301756 302258 268174 367664
26863 367664 333677 261430 159676 138979 134154 196791 241524 154278 144771 261233 362185
26852 362185 325340 317787 390766 351132 376046 258738 241135 315004 433077 373031 344730
26841 344730 282248 275212 263551 167064 43932 173735 335330 324318 350561 294054 327313
26830 327313 419486 452101 280930 229405 311565 243217 259857 360613 413749 349331 280411
26819 280411 266787 230339 295065 298751 271693 259750 141109 33354 119310 83856 106408
26808 106408 52343 147170 109503 4578 157864 261154 189738 176177 246283 334952 252207
26797 252207 229767 289488 266339 57323 17023 143808 107834 150568 136324 30396 -54754
26786 -54754 4244 65911 206134 133096 157309 249530 308544 211720 113452 -90461 -20060
26775 -20060 79486 92380 72609 -27954 -17724 -10198 -26267 -43429 -152870 -134227 -11253
26764 -11253 3007 17779 50396 69238 150990 239757 124214 3545 50781 167208 234428
26753 234428 211300 228666 135255 91236 131898 194256 303333 313520 235070 149170 217531
26742 217531 122198 42750 40223 129064 125102 197582 250563 226825 180493 166446 160065 173834
26730 173834 249986 351124 308392 165612 147971 183229 37760 -36110 -12026 38344 59137
26719 59137 57560 156044 271054 352682 333252 256281 84827 118020 199281 147532 126477
26708 126477 178763 171653 105236 52275 140830 189360 282069 300358 285701 301165 316779 357153
26696 357153 355421 299409 349597 334096 218570 176139 259058 347189 198115 189669 196555 82979
26684 82979 15360 120394 223798 212670 27109 -45109 16766 173431 208729 209140 144805
26673 144805 210277 192911 276534 292184 276456 317165 222207 165773 106429 88210 74659
26662 74659 -22899 -32573 3649 -68824 -105385 -124091 -64533 1265 -13023 29684 53645 24533
26650 24533 -42465 -33185 -37344 42286 33481 87471 103483 287851 275593 211501 191460 139911
26638 139911 152726 109435 -29287 -65182 -43301 25124 -60146 -20264 9999 33855 15059
26627 15059 133172 199672 243874 375139 428270 326403 258386 157319 81561 55334 48969
26616 48969 69942 8179 64875 266279 276332 235196 197785 285913 380849 347480 355000 419199
26604 419199 313894 139152 81326 166802 331686 343570 308204 322383 225569 126283 -33824
26593 -33824 -90275 -58561 -10358 -18071 33951 157903 196035 149476 -4367 89440 80911 -50045
26581 -50045 -82491 -18119 67965 76551 80642 -9783 -172311 -82885 25751 -23097 -106103 -75046
26569 -75046 -23069 80055 279183 216451 109398 136759 -26375 -169033 -55224 23003
26559 23003 -46622 -143913 -148587 -34952 95530 94162 3511 -11080 8549 -9229 -56154 -27850
26547 -27850 -9937 27457 -16066 39307 91691 119321 121204 115780 192568 260865 162684 163571
26535 163571 153779 101155 108766 43296 16127 59670 -9102 -94169 4140 133378 144195 271409
26523 271409 170069 130584 86412 64245 95685 26293 128599 209979 61312 -105986 -200872
26512 -200872 -63101 125092 266751 128563 52351 103701 54122 -5147 31396 32108 135415
26501 135415 200137 161637 78118 76192 116140 44032 -51856 -108580 -44220 201884 345765
26490 345765 261840 49572 -110861 -22353 90479 55230 106531 110937 58751 241711 255167
26479 255167 297231 290076 273778 234958 303676 229777 129002 -42947 32480 -50706 -130602
26468 -130602 -53690 10201 141284 202392 182087 78358 6963 43343 103819 223937 162452
26457 162452 135395 98545 121637 177183 135998 126184 116820 103332 90169 183239 316019 327978
26445 327978 281384 265515 278078 363999 366608 354072 247059 63367 15919 35851 18833
26434 18833 95733 40689 -25525 -159747 -146916 -105314 -90303 -36683 -144048 -72410 -18667
26423 -18667 9284 -47579 -84720 -131156 -117489 -91337 -42796 79222 118782 234785 214120
26412 214120 175037 216394 148003 -17938 115313 35992 73187 -40963 28992 152180 188976
26401 188976 139369 200669 351956 309265 205138 42462 -79604 82046 168172 193731
26391 193731 213303 172878 212913 264602 174105 3638 24580 59385 -4147 85214 162266
26380 162266 -30382 -248328 -380108 -354983 -236233 -166566 -133662 -70236 29626 125387 266677
26369 266677 347556 396273 297311 241664 233264 145982 102510 35897 -25415 19939 -21899 15609
26357 15609 175467 234345 54855 -47096 -130397 20363 193324 78677 35404 -8876
26347 -8876 -137349 -134463 -72312 -44900 -81774 4028 44247 6203 74954 -104981 -109663 -49830
26335 -49830 -8092 72471 192015 139428 15136 1317 -75761 -76584 -52699 -14247 -23136 29197
26323 29197 200637 183103 84509 -55000 -126586 -56156 -30180 64713 30339 98263 -5859
26312 -5859 -25982 122467 91697 109933 108042 84342 97595 174634 221420 236580 208128 108659
26300 108659 128150 155892 81442 41738 58913 48771 20513 -11158 -94738 -91080 -86858 -13257
26288 -13257 67735 22141 106353 189030 108199 62612 19051 47727 84442 144392 139736 -28804
26276 -28804 -201841 -103841 -28498 -62221 -3849 -27812 14370 48220 -11429 -7409 -18137 -58444
26264 -58444 -195469 -196655 -66403 61110 33550 -28211 -30829 -114547 -83787 -58094 -40412
26253 -40412 -32834 34691 27241 43927 225455 201628 135593 215827 286612 267448 294802 290371
26241 290371 210310 180554 85090 -42701 34822 220813 239517 192753 147342 107057 160218
26230 160218 153138 84229 107115 51020 53959 112956 164000 168305 115868 72355 -70317 -100993
26218 -100993 -154701 -99876 69588 146037 229955 47647 -18139 89799 88878 -58240 -68520
26207 -68520 -9989 30598 160151 241891 101236 125871 153739 217015 185966 26843 -15679
26196 -15679 78051 48800 -63515 -155611 -164352 -89345 81935 236088 146995 11032 64270
26185 64270 108147 86807 177771 68711 40326 -15252 -55953 -33207 106630 88750 125702
26174 125702 143403 36826 -8194 117036 90298 34511 -43147 -68120 -73616 -127804 -148161
26163 -148161 -76114 -44205 -39114 -137529 -257292 -434231 -298337 -96441 -45514 -102113 -37255
26152 -37255 -4386 120784 92072 -35757 2136 79840 168259 185917 139760 86439 3437
26141 3437 -4726 -72362 -87890 -98189 -9271 119794 38804 24373 -28540 -102716 -102815 -26925
26129 -26925 45390 9067 907 -13129 -104066 6544 39787 -50244 -60396 2994 -106725
26118 -106725 73138 112290 -24766 -32580 65051 -4884 47279 66173 104582 108181 190357
26107 190357 68211 -87970 -87736 -36672 170573 254526 187014 143055 74117 449 -33432
26096 -33432 -166397 -112587 -41137 27868 90672 214672 187023 -39964 12647 9477 125306
26085 125306 93373 54964 -85253 -134550 -96681 -12112 39095 123430 17267 -100892 -119835
26074 -119835 -235537 -218905 -136136 -102001 -93868 -60136 97389 65814 -992 -13610 17776
26063 17776 125304 141537 32791 -10998 60091 -14422 150826 175787 44200 -69580 -36422
26052 -36422 10985 37671 168873 200034 181059 -27285 -27704 57687 81477 -40965 -120897
26041 -120897 -111181 -168206 -83884 -9895 -4483 70254 9812 7516 89459 56328 212052 257261
26029 257261 187829 128478 8149 2469 24379 56011 35316 67702 91286 4013 -93831
26018 -93831 -128232 -250946 -185860 -70951 83721 101382 134171 124224 63263 -49066 -137552
26007 -137552 -200423 -144685 -126607 -117119 -56754 -37268 -64948 -52945 -4445 -8912 95266 86580
25995 86580 92500 111388 111590 -3010 -110522 -91504 42597 24158 108073 67533 8357 -84166
25983 -84166 -159419 -297527 -105037 58051 -23045 -102922 -201677 -46388 -51679 -182242 -67788
25972 -67788 83348 41897 28787 118185 237942 96696 -1063 36541 -40345 -30763 32102
25961 32102 -53575 -56839 6459 14800 49913 35746 106292 69492 -15455 -32807 -98385 -11944
25949 -11944 -56525 -13091 -30986 -3195 -42493 -81004 -141179 -142583 -79661 -65997 -120587 -222011
25937 -222011 -229564 -128644 -48910 -79659 -105181 -147173 -32608 56427 54708 6896 -107785
25926 -107785 -61834 -18158 -28753 78671 49040 4048 31329 97119 43595 55630 64685
25915 64685 -30425 -97137 101890 236389 210718 250276 183849 133608 -19576 7638 -45938
25904 -45938 -229012 -51461 61036 14843 -60759 -70062 -60129 -3530 -23929 28805 109574
25893 109574 17487 -192681 -175864 -168415 -184278 -105019 -164609 -110833 355 -104607 -143461
25882 -143461 -113768 -143584 -39500 -29124 23212 -17876 -73560 -63461 -8458 169080 250052
25871 250052 153458 12597 22444 -28637 -140123 -90642 25481 21283 40730 45709 27841
25860 27841 57653 -31644 -96815 -14411 158176 249633 122313 80657 208869 243916 146430
25849 146430 195907 311523 234238 251533 264473 147201 130749 95456 106870 262508 289090
25838 289090 289073 258498 88680 -82689 -111969 -156185 -46065 9239 129120 138158 90290
25827 90290 196373 112379 -152501 -124433 9491 39465 67605 -2127 -31562 -196654 -260430
25816 -260430 -80625 16882 -5192 39856 192809 239371 135893 18732 -64328 -73110 -25849
25805 -25849 1530 -50765 -248751 -271410 -254406 -145925 -112709 -123757 -65748 -54824 36544
25794 36544 129962 150112 152745 178720 108058 -114994 -166498 56914 64321 -22427 -119982 -121833
25782 -121833 8316 31895 92383 11792 -114789 -179512 -263714 -379786 -319524 -207108 -188184
25771 -188184 -116947 130691 81901 14895 40416 17324 26029 21611 -5250 164184 172880 122896
25759 122896 176387 166365 128435 61289 -120549 -76213 -27436 -57801 -77137 53138 87092
25748 87092 53564 -108477 -172757 -45684 -22381 73836 121844 167049 53406 34793 68701
25737 68701 36500 143764 91414 10777 8290 40255 -59868 -45199 -132792 -122956 -42897 15081
25725 15081 118386 153082 77954 -56391 -74803 31199 -10764 -80851 56293 24623 -83301
25714 -83301 -142121 -96407 -117509 -75723 -32926 -161542 -144432 -96509 19363 119990 -31019
25703 -31019 -12449 83566 8088 6067 35462 90385 -54846 -104377 -40736 13168 -14628 -4048
25691 -4048 -132778 -172318 -62976 -42345 -75783 -58009 -154160 -230475 -227349 -200329 -217722 -52128
25679 -52128 70178 -67719 -118229 -157485 -178104 -138640 -63719 -23274 -105002 -120637 -142528
25668 -142528 -235813 -167136 -25270 21617 32719 -145237 -176978 -107547 -106116 -103878 -146689
25657 -146689 -209174 -43981 30361 -33616 -84404 22603 -36229 -95610 -97444 -41051 -93411
25646 -93411 -127246 -250573 -213876 -139742 -168544 -252383 -244140 -232939 -265902 -190983 -137976 -211523
25634 -211523 -131288 -55514 -50624 -7700 55996 110401 22413 127991 270533 263327 269570 238575
25622 238575 160612 80738 64149 143488 163874 150730 -84478 -132474 -23696 -74341 -53227
25611 -53227 -15621 -76058 -191196 -21725 85371 23576 198152 149669 26799 -53081 -71598
25600 -71598 451 -117054 -142976 -187401 -196287 -180354 -140814 -160616 -53220 64177 12637
25589 12637 -55033 69379 2608 -69784 -116666 -49695 -85595 -138132 -250396 -130865 -93392
25578 -93392 -74305 -140623 -85564 -22963 21919 122520 68358 5339 -6976 -45681 -71532
25567 -71532 46465 17426 7372 59206 111679 -20401 -127801 -144959 -83748 -32697 -87487
25556 -87487 -26662 60164 95949 63745 88313 -8260 -34238 -75092 -80537 -32310 69749 92393
25544 92393 136840 148490 175966 47998 46357 146234 179205 175327 213899 164122 98079 90597
25532 90597 58324 40648 -1648 -4079 -117811 -94624 65350 114662 93332 32863 12940
25521 12940 92829 65054 -26775 -3098 -852 -3640 22101 19439 -1417 -28700 -153939 -231573
25509 -231573 -206871 -196249 -152467 -108243 -56518 8060 118959 196084 136399 196082 298915
25498 298915 193650 -14177 -129294 -31688 147952 175760 99487 -75301 -289509 -387698
25488 -387698 -224977 -63095 -19656 -50726 -20659 -30836 24970 88817 60037 48542 -82521
25477 -82521 2831 170323 109174 29720 40092 72819 -58901 -129662 -117778 -77492 12726
25466 12726 -81023 73332 76872 40548 -132727 -224296 -126354 -68992 -21095 -10225 44835
25455 44835 48828 -45456 -87703 -30936 -51642 29886 113095 281666 226722 93269 -62201
25444 -62201 -128874 -147390 -136559 -97165 -83950 -144461 -318399 -359655 -346711 -324819 -244562
25433 -244562 -192971 -209693 -139603 -73464 -133227 -127251 -1972 33483 -11671 -46873 -21522
25422 -21522 -2329 -12720 72619 55226 -135478 -219711 -15099 132341 235337 133053 28679
25411 28679 90931 233167 233808 165581 227332 217313 156344 43270 -79735 -18132 32939
25400 32939 59984 -6967 7922 143022 229704 264190 129757 -31772 70158 61595 60476
25389 60476 18609 40974 -17456 9797 187817 198046 84289 118452 196327 199187 179467
25378 179467 54310 -34412 -142290 -260095 -201058 -120465 -5779 62092 50010 82608 6895
25367 6895 -22718 26379 -97675 -179825 -107696 -17355 -47285 -162086 -148855 -116811 -102252
25356 -102252 -95250 -93878 30686 29363 -60220 -122741 -40029 -65859 -125083 -210396 -233687 -236402
25344 -236402 -87996 -94976 -182217 -116082 -146859 -231568 -159637 -21795 -87505 -204901 -248526
25333 -248526 -242881 -101024 -74312 -172207 -206117 -49245 1251 -36303 -117540 -179366 -242805
25322 -242805 -231955 -172512 -122548 -109812 -62702 34249 12239 -15425 -112744 -119832 -10978
25311 -10978 95797 74278 124014 63743 31208 -13939 33167 180194 39772 -140178 -195594
25300 -195594 -122150 -33493 130513 143481 33173 179710 154260 126609 166205 161940 198468
25289 198468 190367 61337 -94045 -58556 -97262 -86111 -190471 -139427 -1021 -105056 -136013
25278 -136013 -19948 -39842 45129 91980 -45369 -59968 -71342 13477 -67422 -126657 -174419
25267 -174419 -183513 -111820 -71654 -34798 -38166 -84296 -194706 -248641 -250817 -230224 -323972 -309928
25255 -309928 -243528 -167291 -32950 -19696 -92762 -174485 -78036 -1954 42233 139827 200033
25244 200033 8546 -44163 181424 293844 261493 68120 46085 56462 86747 79291 31857
25233 31857 -14963 -80232 -151070 -232188 -195474 -199009 -120692 -35607 99947 168468 52048
25222 52048 -9680 -53560 1763 128005 96509 162960 106452 93535 30440 23741 193531
25211 193531 205117 111157 136754 170801 202204 162306 28051 -12279 -4862 -76038 -93645
25200 -93645 -78429 -117752 -133670 -110982 -162920 -161473 -54886 1662 71672 82107 95790 93159
25188 93159 70453 175893 169436 163870 107281 -43033 -79271 33066 69978 153519 124700
25177 124700 113695 115271 45443 101194 54768 -21608 -131248 -160762 -327407 -394893 -237118
25166 -237118 -141111 -104354 -44292 90298 22043 1196 106689 219846 290121 93411 -51640
25155 -51640 -67668 25755 16483 13659 -54047 -67294 17285 28529 66965 81970 56245 18579
25143 18579 82635 17445 -108322 -138271 -257517 -239871 -176646 -162156 -144125 -1639 -39955
25132 -39955 -75670 150963 283628 125387 64306 152214 129498 69430 -6935 -60426 -74454
25121 -74454 -60003 9406 60101 4971 -31166 -90742 -36896 -131171 -151359 -144154 -80709 -45870
25109 -45870 -122187 -112361 -157336 -54385 62807 87348 50823 56358 -14516 -113790 -241967
25098 -241967 -242835 -183246 -184329 -194513 -148745 -43503 -73056 -13953 -57534 -99627 -91850 -109855
25086 -109855 33964 85725 17289 -58125 14570 -15410 -28552 14797 87091 24129 -26057
25075 -26057 -19676 -199744 -259489 -200519 -145719 -26247 6996 -15476 -41993 -73180 -111909
25064 -111909 -100322 -85068 -39268 -18742 -129401 -226273 -307856 -344678 -132556 -59158 -68211
25053 -68211 -56568 -159140 -145576 -58145 -42649 -41747 36634 105693 150161 -18021 -75038 1494
25041 1494 -38411 -97560 -63019 -140366 -131487 -49396 33893 -80614 -189203 -297019 -325550
25030 -325550 -259329 -183880 -141794 -157356 -201007 -104135 -35444 -34090 -77072 -113358 -21895 15901
25018 15901 2436 -76832 -75394 -198796 -242626 -229032 -293959 -314249 -129327 -42223 -204452
25007 -204452 -249400 -233300 -334648 -212291 -99497 -57546 -123381 -144225 -93787 9763 57624
24996 57624 25209 10462 80618 88326 1503 -72494 -164177 -110291 -74552 -61897 -31432 29399
24984 29399 59677 24672 117754 165974 126895 5511 -77287 -38351 -39885 -111040 -137207 -96684
24972 -96684 -48540 -47784 -96270 -36362 -115737 -268132 -254563 -224548 -292536 -399069 -377929 -263021
24960 -263021 -61126 -152633 -240491 -250599 -268486 -224847 -62450 35013 58644 -38655 -11942
24949 -11942 -22271 -78630 -27463 -53361 59899 60037 -24627 -113079 23455 114328 41348 90149
24937 90149 49826 41864 147366 90408 108847 22171 -79636 -100172 -17626 6047 29785
24926 29785 19923 -22724 24306 106246 190902 154172 25938 -42505 -105507 13347 -2298
24915 -2298 76537 233859 141616 -32959 -167419 -190586 -251131 -297856 -114226 -25296 -13956
24904 -13956 74255 93820 4834 2893 113165 29940 24643 62741 162547 229027 37167 -99947
24892 -99947 -30511 107616 263651 174348 13637 -99447 -154890 -171212 -64229 -51327 -72115
24881 -72115 12141 129522 169523 35424 -121433 -166798 -207183 -210575 -248606 -218608 -139935
24870 -139935 -191759 -145769 -36572 -2102 46703 152554 272548 228440 204453 97909 -64025
24859 -64025 -59243 -94391 -103235 -180529 -251679 -199903 -94804 56445 82206 41675 -2188 -56344
24847 -56344 -25960 -113966 -96913 -208480 -168156 -62266 -166333 -211623 -246536 -184126 -148111
24836 -148111 -81854 -53397 -75725 -116716 -143748 -82257 -83123 -51831 -77040 -28960 -101866 -41210
24824 -41210 63243 55258 -26538 -100667 -193187 -236477 -302838 -299965 -158598 -77820 -113647 -128136
24812 -128136 -55177 35588 -29699 61788 98714 -28479 -128326 -229818 -116809 19229 78281
24801 78281 101816 97446 104180 -40106 -124713 -86270 -27348 6765 -39859 -107144 -123102 -156075
24789 -156075 -153879 -40050 71055 -48775 1394 19060 -64481 -90629 -75378 -9677 -42841
24778 -42841 -216717 -210523 -309784 -382045 -422129 -388576 -234115 -148897 -171896 -289290 -260168
24767 -260168 -209674 -252252 -70932 -89195 -88876 -127848 45287 252141 237918 130906 46583
24756 46583 -44721 93289 119409 144201 150953 34581 32504 57770 -20642 -1599 124375
24745 124375 -10591 -62575 -67576 10792 86468 200043 182032 77402 -27076 -54895 67502
24734 67502 41346 -22790 -62986 30372 167559 275334 177739 128505 -40830 -15079 89585
24723 89585 656 48799 186674 155703 54498 4393 -44461 -129781 -20115 -3697 25554
24712 25554 -15926 -13313 -110431 -227205 -212051 -162474 -169973 -157324 -131884 -186914 -204434 -184021
24700 -184021 -156374 -132861 -199632 -206103 -141944 79790 140361 -6643 -141184 -90585 -126358
24689 -126358 -116365 -59732 -25903 107135 64539 125225 26433 1368 11453 -7740 -150462
24678 -150462 -204671 -197851 -172343 -239684 -286473 -155235 -110344 -132758 -81638 -47272 -47675 -24223
24666 -24223 26648 -131850 -218077 -135598 -155057 -196894 -125528 -108431 -138537 -83340 -43898
24655 -43898 -77941 -92175 76030 176871 -583 -53416 6227 -52044 -119525 -163766 -120505
24644 -120505 -12491 -34547 -191158 -102666 5276 88833 166018 129747 85099 -52541 -148790
24633 -148790 -257024 -204371 -40820 102538 1883 37642 -143166 -155868 -40814 -56970
24623 -56970 -82576 -116053 -166101 -166417 -192630 -288390 -266876 -99436 120818 215692 235793 -2592
24611 -2592 -124590 -25236 102359 82108 3876 -60292 -73822 -113425 -135930 -202040 -98013
24600 -98013 -121433 -154724 -147623 -216542 -129866 58590 82884 -25098 -163040 -150925 -100074
24589 -100074 -60510 31448 91694 53389 59869 -38752 -107756 16200 217571 206636 100784
24578 100784 42678 80636 -114 11516 43845 -59856 -100365 -72264 41609 26404 59969
24567 59969 94949 141653 60016 19644 -58284 -166732 -89765 -99635 -101800 -58301 -20565 -67257
24555 -67257 -10829 -41640 -157485 -168878 -64568 -37998 -68980 22923 66587 60173 37791
24544 37791 2883 7859 -100454 -102842 -98797 -103924 -58620 -126944 -113931 -89758 71352 86032
24532 86032 80985 82639 40710 -50263 -62558 -93811 -146697 -169562 -144949 -120425 -113188 -102155
24520 -102155 -43088 -36786 1874 55278 124439 113296 124633 206383 214766 296381 249107 89157
24508 89157 -62958 39633 -106005 -271470 -254684 -281425 -115589 -3450 -97605 -143229
24498 -143229 -85613 -106033 -20385 -86693 -152362 -139205 -67340 -69405 -25011 -98459 -171181 -127809
24486 -127809 -147703 -237121 -91485 -69343 -131978 -221898 -147745 -47275 -104254 -152675 -147006
24475 -147006 -61323 -71372 -48122 -78039 -98981 -105058 -109883 -115087 -38414 163830 171386 106597
24463 106597 76251 -7695 -41776 -64503 -19352 -21791 31894 82998 -69991 -102139 -101170 -24662
24451 -24662 -33505 -98419 -166699 -202590 -266432 -200073 -78722 -60653 -29862 -26591 -1104 -9144
24439 -9144 6426 91330 68555 107485 153375 111542 29210 39524 74411 58859 169416 184983
24427 184983 123441 36533 -44748 -27422 -55959 -7360 198294 269687 110003 44576 52197
24416 52197 -1255 -108546 -4553 117241 98541 -64059 -69882 -32110 86607 111748 74562
24405 74562 75431 8795 -65996 -150210 -21599 -11096 -83064 -29291 54550 155112 153770 199915
24393 199915 146506 111431 101292 78733 178364 174030 132778 89246 -23239 -70768 -69026 -49184
24381 -49184 -40254 -38846 -71639 -26791 94546 109051 29381 -12737 -50207 -44658 -16780 -5672
24369 -5672 -41077 -67645 -56905 -80616 -37129 30034 43426 -1211 39612 -54367 -114975 -110247
24357 -110247 -3554 60731 77318 62069 90464 115270 103773 27771 -22844 -15066 -18877 4306
24345 4306 3877 -69008 -307676 -343996 -265220 -192137 -39861 105204 36273 58184 94115 47200
24333 47200 94791 56411 91015 -60094 -31948 22939 116898 155278 256387 252185 189780
24322 189780 62005 -13771 39253 -26838 -126572 -100236 47718 -8112 -110256 -20898 -41717
24311 -41717 -51820 1662 69461 175484 129401 2029 -31735 -186068 -150215 -19617 31457
24300 31457 -41587 -83473 -92071 -127149 6983 94546 113259 92612 177098 209498 134695 102396
24288 102396 36155 -59029 -59273 -113038 -99112 -185584 -201674 -166781 -75025 -85950 958 851
24276 851 37380 -113589 -51145 106475 1601 -143489 -88330 -75332 -51424 -25632 -48803
24265 -48803 -48337 -59179 -65659 -135380 -138454 -221026 -183810 -34446 48725 -49402 -146454 -213211
24253 -213211 -218200 -232952 -245820 -90812 64109 1783 -67744 47354 -46674 45952 75131
24242 75131 9749 30492 105880 29640 -118582 -92767 -14883 -12048 -53242 -62044 9285 7026
24230 7026 -81345 -107349 -184011 -153694 4920 75336 138117 133478 66995 -67374 -131494 -122554
24218 -122554 57587 123816 -37374 -41047 -50006 -45920 68324 105686 -63331 -216501 -150650
24207 -150650 -157207 -198301 -129393 -34657 -52318 87709 132320 78153 -47950 -14429 17961
24196 17961 24534 -45493 -92222 6915 69690 -93405 -110507 -76254 36836 161111 113761
24185 113761 154058 80441 2710 -35868 -35990 -118829 -44619 -91656 -46285 108560 103937 175059
24173 175059 153318 101991 27349 -120428 -159272 -146299 35747 37570 -51462 -77388 72996
24162 72996 97409 52104 11679 -111546 -177641 -117781 -31450 -81536 -269580 -278733 -217077
24151 -217077 -151324 -143489 -153500 -24902 -28095 -99633 -17777 -65121 -83367 -27310 -33014 -52643
24139 -52643 -121815 -62870 23256 -58879 -87374 -44896 -56769 -54377 -184756 -117912 -21007 -46977
24127 -46977 62508 107990 -12071 -44283 -64384 30060 17593 47706 165536 93639 65326
24116 65326 37686 57710 124292 107154 80400 -15853 -28044 -14098 -149616 -68789 -12909
24105 -12909 48004 70509 -88 -176868 -183673 -27979 229593 347159 247239 46343 -172200
24094 -172200 -251440 -175648 -23436 7843 49926 7351 16163 26794 -40313 -81034 -108298
24083 -108298 -18016 -121870 -194568 -195862 -59755 -25831 -57117 -151314 -169866 -176533 -110775
24072 -110775 23150 140302 86616 -150349 -262437 -251951 -188301 -139100 -141230 -116364 -154572
24061 -154572 -177221 -201090 -64652 -6536 7467 5170 9941 -10058 23977 163195 308607
24050 308607 369788 253021 117177 114313 60486 2081 -55898 11963 78840 -50433 -57818
24039 -57818 -52737 -100049 -181661 -169592 -117562 -18870 156143 159564 113260 33444 -41950 -55395
24027 -55395 -62796 -63775 -35012 -120339 -108394 33019 105453 123707 35375 43287 62715 61947 -53456
24014 -53456 -50574 -34121 -52843 -5708 -35419 -35977 81074 52416 -35862 -75151 -56718 -25509
24002 -25509 54205 72019 144153 176924 6525 -223475 -200844 -128717 -179503 -96934 836
23991 836 156498 176681 111220 22 24176 75275 19885 -2666 -152759 -86445 -25994
23980 -25994 -162759 -236921 -157693 -149924 -128710 -129308 -69758 27912 157933 145196 -5456 -138072
23968 -138072 -53870 84615 124613 87738 58870 22070 84624 172775 123134 -47425 -84631
23957 -84631 -156381 -209934 -240056 -237611 -136781 -161767 -170911 -131959 -72321 -84076 -162176 -118841
23945 -118841 -38418 84846 69267 -58487 -81982 -187330 -234343 -170048 -161305 -88749 -45609
23934 -45609 -21847 -24720 29237 147573 212965 92010 90793 116538 -13900 -58826 15378
23923 15378 -19141 -22919 -26692 -104064 -215419 -184394 -169218 -203871 -159630 -28488 99330
23912 99330 135964 -62024 -153908 -304532 -256313 -209496 -320080 -249606 -171682 -166677 -135071
23901 -135071 -145424 -176894 -101885 -62817 -81937 -81440 -31491 70888 92793 128518 167906 77657
23889 77657 -89978 -98557 53349 107795 1234 925 34694 -65512 -127309 -26573 -122893
23878 -122893 -172341 -137166 -113881 -159081 -44443 -28894 3467 38649 -74456 -109666 -78176
23867 -78176 -2295 -4535 147961 181287 48137 -12046 106896 92461 -32250 194016 351980
23856 351980 339193 266729 46649 -105601 94486 154282 58010 55553 796 39837 -56356
23845 -56356 -45660 35741 89519 225672 148107 74234 27542 86851 70011 102057 79296
23834 79296 81446 98230 -95248 -152746 -224252 -142064 10532 -81703 -138889 -126697 -84823
23823 -84823 -85746 -68593 -72259 -140317 -103521 -73400 109860 102233 35588 -92068 -111248 -90731
23811 -90731 -75734 -66586 46158 213535 190158 89431 108986 59681 15553 -28020 -191232
23800 -191232 -286038 -208000 -55417 -63512 -81967 -67266 -99242 -179143 -227010 -164660 -164263 -210660
23788 -210660 -96942 1070 70103 149004 113757 148441 87562 43323 -7183 -48249 -39701
23777 -39701 -98117 -92597 -173940 -74464 -48609 6810 61132 -82482 -158304 -58440 -8206 22320
23765 22320 43723 -152104 -260956 -103823 -28511 -117527 -91392 -60534 17070 -94658 -100743
23754 -100743 -34557 -45461 20387 76715 153767 133945 22632 37080 49881 -45365 25350
23743 25350 244 -23152 -11891 95680 38625 -15045 -60716 -176464 -162843 -18009 142912
23732 142912 165996 62933 -72609 -157190 -219708 -180348 -26025 44903 56801 52570 -5134
23721 -5134 -44776 -136678 -231436 -193748 -62056 110977 31375 17193 -71782 -135031 -140134 -129632
23709 -129632 -87519 -60166 8334 61304 146129 221961 239618 228639 117372 112677 140491
23698 140491 10736 -78078 -72722 -23002 -52588 -105743 38242 206997 112562 -40667 -13597
23687 -13597 -156776 -249626 -138059 46280 -55085 -75930 -70836 -101660 -157651 -118224 -121681
23676 -121681 -149648 -87536 -2296 24958 158 14230 80357 129336 75410 48019 -110704
23665 -110704 -119234 -149326 -104097 -44151 8481 -38981 -84410 -110370 -89657 -22593 -20635 -29810
23653 -29810 -8341 -43699 -94685 -200450 -186829 -177021 -99618 -88139 -227239 -245331 -176350
23642 -176350 -146997 -115162 -207314 -93617 79648 -3848 -97653 -126969 -210140 -139076 -113459
23631 -113459 -48720 -97075 -5176 -66111 -31738 -56533 38040 165844 159134 64465 110778
23620 110778 89521 -35856 -47345 8918 72719 -4287 -25645 40361 44109 164668 204961
23609 204961 203115 143630 62877 29223 -63636 -76552 -55985 -216971 -343274 -294957 -155243
23598 -155243 -116800 -149843 -136586 -114699 -133329 -16507 111963 43209 12640 -3944 12860
23587 12860 20047 7431 -48296 -136701 -118592 1252 160777 62287 25431 27956 103083 26790
23575 26790 -21809 35861 61563 -1456 -10213 -32468 -30706 -8715 -18389 -146282 -174689 -78029
23563 -78029 -47997 -135210 -45550 24724 807 79611 114687 110247 21924 -123430 -202254 -245291
23551 -245291 -179264 -40225 -39800 -66723 -23252 -23715 -36765 -62585 -179012 -214419 -197086 -133222
23539 -133222 -45608 -15960 -24938 -148550 -142746 -113768 -31929 27591 -21206 -3886 -52784 -110393
23527 -110393 -115919 -185005 -102477 12985 -78524 -3033 3029 42545 2500 -94323 -148526 -159138
23515 -159138 31591 54392 23593 -47017 -123778 -212756 -209714 -190600 -140002 -100865 -87799
23504 -87799 -53000 80770 140627 -130 -160605 -124144 -72269 10079 12597 -179117 -214188
23493 -214188 -246384 -223476 -175034 -213836 -291763 -199562 -138975 -136142 -133530 -179540 -150295 -49864
23481 -49864 35637 83208 55739 95787 147845 -44280 -170441 -136123 52775 150047 151551
23470 151551 76865 81444 7230 -2473 -82171 -79009 -57245 -89660 -49945 -104011 -87152 -176678
23458 -176678 -254407 -225722 -239817 -199943 -119979 -17948 2796 29387 -51668 -84319 -79024
23447 -79024 95573 201934 274929 239218 60857 -38729 6905 -61199 -136961 -73411 -57481
23436 -57481 -71864 8702 57225 10988 -6200 12289 99093 127615 137421 67034 -1582 -53656
23424 -53656 -76155 -84355 -30671 -105468 18120 23935 132103 156067 14949 -156766 -184757
23413 -184757 -72468 -22585 4619 99180 64417 45569 111067 88909 31095 -40910 -51397
23402 -51397 10423 -32418 -63184 -34663 -56718 45999 103748 165149 144389 99262 -56722
23391 -56722 -64261 -22031 87018 111421 129817 153377 129965 63377 77294 -35567 -137057
23380 -137057 -237365 -156909 -18630 -10987 -75221 -66222 35596 5230 -125951 -199499 -39421
23369 -39421 -62439 -82364 -62443 -173417 -265649 -151410 -41296 118186 63236 74297 90472
23358 90472 -14089 -2738 32053 8121 -65127 -56743 48810 17293 -127609 -102210 -83058
23347 -83058 -199507 8026 150932 168101 54924 -86013 -76691 72346 -33916 -113956
23337 -113956 -148729 9642 114384 85203 -24597 -155 78101 12175 -188964 -258666 -167675
23326 -167675 -83494 77317 124644 2194 23206 6726 8247 30810 -98194 -137645 -105750
23315 -105750 -92118 -95130 -116631 -84782 -108944 -67783 -60520 -66326 40761 88744 -58060 -82775
23303 -82775 -38373 -68079 20751 -26578 -30827 219263 348377 234279 -47043 -183660 -232051
23292 -232051 -155626 -73663 -141213 -88610 -25573 -114942 -78815 -15279 -57222 -32872 -112445
23281 -112445 -199491 -121925 -66588 -150917 -19 106506 -26047 -134610 -224747 -160814 -83947
23270 -83947 -28599 64638 221721 187811 87718 192394 116789 49418 -52089 -24895 -110
23259 -110 138191 35661 -95768 -36516 85856 114613 60356 34743 83814 95995 174209
23248 174209 148653 36102 -46439 6050 -44252 -82374 158629 341182 197173 -21607
23238 -21607 63500 220339 149368 94374 138440 166662 140832 443 -4565 44049 50497 60847
23226 60847 -55199 -97734 -115894 95657 115314 154210 148227 110352 100994 94497 171328 145176
23214 145176 230019 297172 281260 259468 228070 231859 205520 189701 116665 -7962 59417
23203 59417 113071 194350 216945 159215 228146 255101 172502 138568 139451 33507 16386 27153
23191 27153 15175 129949 133835 42991 121342 94853 101097 58268 56365 105646 33697 14001
23179 14001 61867 156356 115143 59107 78401 105243 262609 328469 155846 -15843 27
23168 27 35104 -40626 -23969 -81012 -10401 37807 35739 66491 47545 25154 81465 91562
23156 91562 37601 93595 183170 75151 31653 24347 -39090 -103203 -80278 -89371 -104700 28159
23144 28159 190249 161852 130464 114602 52775 22426 -83531 -103165 -64231 -42016 -160337
23133 -160337 -110749 -67257 -2492 -35308 90285 66738 31227 115337 141268 174237 -483
23122 -483 -48489 6378 82005 141420 174933 143884 106356 136079 -23538 14370 17960 -42769
23110 -42769 -100823 -31660 -7610 27788 34756 -142511 -226563 -112899 12895 16379 -6623
23099 -6623 19006 36996 -15927 32433 20632 -188570 -148095 -142728 -162664 62706 165830
23088 165830 127227 -56655 -51628 -106196 -31557 -9613 -58379 -207639 -199777 -111174 -40528
23077 -40528 24489 37160 62445 -26843 -92610 -101331 -192344 -169231 -64863 -128248 -179824 -229022
23065 -229022 -211462 -109500 -115938 -93894 -54201 -44413 -92270 -160699 -167301 -140013 -140461 140011
23053 140011 222153 103181 175004 238611 107781 -607 -829 -121016 -159626 -75483 8415
23042 8415 113464 146926 38763 -41519 328 12965 45098 46528 171080 225530 108226
23031 108226 -29845 -158133 -97706 -125244 -211185 -271880 -145138 2146 7509 -13962 11832
23020 11832 48202 -81988 -191838 -144773 -15340 -19795 -87887 -95792 -57183 -115135 -116275 -78821
23008 -78821 -114941 -190185 -151448 -92574 -16055 -76955 -192702 -159981 -142391 -134065 -20350
22997 -20350 -1179 -110407 -66994 -94574 15072 114298 137190 215416 92552 -902 31868
22986 31868 -148215 -161902 -148087 14851 148141 151583 88804 6510 -16478 -60445 59017
22975 59017 116690 181160 173186 221228 225900 178035 102311 -71172 -26694 47892 77747 -9581
22963 -9581 -116846 -45411 -114935 -152405 6129 191702 136234 62279 82304 -71176 -195105
22952 -195105 -276031 -159876 -3413 -111699 -69365 -25711 -109096 -142217 -32538 18605 -9968
22941 -9968 -28079 -123690 -75923 -78972 -72813 -89558 -142905 -80388 26453 23120 68646 88661
22929 88661 18916 -162926 -172887 -41257 23845 47384 90130 46597 40675 49852 51346 -60104
22917 -60104 -121208 -57903 19762 91669 -69276 -113626 -69887 204 -58611 -55052 -4936 5828
22905 5828 39433 49727 -46707 -32917 -87238 -154582 -212974 -138992 -213106 -189407 -87776 -71883
22893 -71883 -116338 -24508 2349 90920 87281 186865 172447 50326 -121117 -222017 -255201
22882 -255201 -174267 -177684 -126587 -18132 -37261 -93440 -89106 28077 127728 146511 172012
22871 172012 104564 -100476 -172302 -26380 -9588 -98647 -151548 -19350 154641 256305
22861 256305 84403 -62493 -60323 144746 128036 199869 187696 54584 12711 137891 25373
22850 25373 26087 19835 -154547 -48709 50075 -19711 5630 -40102 -79476 -102440 3627 27351
22838 27351 -6034 -138135 -216567 -190577 -156872 -211882 -178623 -109853 -81386 6982 -8696
22827 -8696 -71773 -109517 -87381 -6266 -64902 -150366 -24818 61454 112464 26399 50930 156334
22815 156334 132363 -2351 23140 103746 -11442 -64267 -141243 -64422 53818 63983 31097
22804 31097 52758 69612 118411 143023 250037 153643 90987 54492 -78094 -92846 76003
22793 76003 70213 -55545 -178366 -147931 11424 123459 66831 30838 61910 53654 17461
22782 17461 -49112 -28315 -71641 -97513 121649 234048 215893 89598 141183 -51497 -347980
22771 -347980 -379433 -138737 -47861 -90179 -127696 -132082 -150357 -170072 -15921 66167 104369
22760 104369 163422 22579 43395 28297 6640 94909 215271 173666 149524 121128 95420
22749 95420 -353 -22694 -18434 -66806 -97500 -14788 26728 151978 205471 201204 124973 38634
22737 38634 -74977 -52133 18546 33805 50145 124549 59537 -83159 -65862 29067 78915
22726 78915 30123 -74771 -30464 20882 -146591 -271318 -257673 -43766 30967 19513 80172
22715 80172 99549 161578 206230 121806 192398 249126 149472 -7343 -84140 -156847 -78535
22704 -78535 95746 -27502 -132172 48355 33318 -69138 -76668 -49359 -82791 -219363 -175678
22693 -175678 -90533 -27593 -78332 -85145 -94400 -82360 -136793 -189562 -175673 -73650 6697 12974
22681 12974 90117 -13691 -126262 -176125 -129345 -148866 -81894 -81408 -91396 -55801 -105776 -78589
22669 -78589 -78306 -41016 48432 31503 107054 -109653 -173965 -301744 -301313 -42224 61619 61922
22657 61922 145793 122148 64620 60603 -77917 -221828 -205191 -53022 -33354 -7771 97857
22646 97857 52155 -46529 -137840 -208301 -102258 -142918 -174349 -215635 -133544 -61679 -157630
22635 -157630 -224067 -285381 -236646 -208622 -114233 -142779 -192245 -119130 -71130 29798 -2406
22624 -2406 8728 35111 46370 11536 69064 116948 156758 46920 100205 60062 132786 201128
22612 201128 146168 177968 196274 134192 210131 200617 48775 -155677 -70261 -28299 -136539
22601 -136539 -106742 -97888 -141132 -140746 -113929 -44744 47210 35932 8480 -1573 -51203 44591
22589 44591 183118 80755 -83881 -96256 -645 56985 -40540 -228638 -225057 -224355 -83740
22578 -83740 49998 50994 -109004 82468 139085 37289 85314 27093 -71949 -79248 -48380
22567 -48380 -79591 -24254 236527 264875 236036 231037 38714 -97390 -146846 -83594 -159572
22556 -159572 -396316 -445693 -264280 -157062 -163063 -149365 -194698 -13270 19039 64952 90289
22545 90289 21702 -68785 -145305 -256460 -275171 -232984 -254709 -276477 -122011 -77649 -38246
22534 -38246 -60799 -105002 -1347 71348 13641 64312 110927 42920 -48698 -31877 -119935
22523 -119935 -155344 -121404 -144627 -46208 -25743 -1170 30675 3947 -21684 -89740 -101137
22512 -101137 -157137 -80170 -12865 36066 107210 110472 208917 281711 142851 113293 129531
22501 129531 245212 322534 211553 186317 132265 -9755 -43030 -160379 -45272 1523
22491 1523 -51290 7027 -9663 -86730 -131964 -71157 -82074 -248223 -219836 -194905 -140888 -154324
22479 -154324 -33776 -84698 -40148 -113924 -141993 -50499 -50686 -23340 -71470 -281618 -325318
22468 -325318 -275570 -168487 -11067 140787 -8293 -134435 -154728 -333776 -186619 -135626
22458 -135626 -75319 -98200 -93166 -48372 -63432 -191280 -263246 -228411 -114999 -67646 103792
22447 103792 210070 152234 118545 73065 -86744 -141346 -106045 -48545 -13651 50866 -86049
22436 -86049 -175925 -237054 -178557 -121701 -210972 -140594 -117498 -52584 50720 16940 -15196
22425 -15196 -41330 -42549 -29283 66431 -59254 -118715 -136039 -108285 21257 160048 196948
22414 196948 137989 -11531 -81268 -22904 -10360 -8426 -118741 -107727 -71064 16943 -109486
22403 -109486 -191319 -104237 -57304 44187 153119 93407 -23911 -156621 -251995 -217372 -241460
22392 -241460 -197536 -29118 175823 91757 75408 11480 -71978 -95274 -39657 12200 -4760
22381 -4760 68858 110116 101066 7391 -7965 -22715 -54136 -53060 -111253 -192088 -224707 -83661
22369 -83661 -53530 -105985 -48668 21857 25962 11582 6877 -52136 12451 44990 13696 -65531
22357 -65531 -89685 10098 141572 302291 204263 33693 -46258 11659 154168 199150 161914
22346 161914 30493 -34404 -24796 -39364 43052 59041 51828 46985 -39418 -94663 -40329 34176
22334 34176 -115773 -77222 56347 76328 -46803 -87726 -59878 -20603 -118804 -88171 46174
22323 46174 172416 207404 144215 -15076 -22998 -88774 -151058 -148536 -147733 -74222 93568 197352
22311 197352 114408 93618 94029 773 39739 63411 81784 31691 60542 -26130 -71325 -19934
22299 -19934 2332 16070 -61163 -60205 -45078 -39839 -48903 78043 157178 240339 183816 122307
22287 122307 8222 67986 130788 128992 -999 -76081 -12861 120206 152748 184813 111355
22276 111355 -51658 -52380 42192 94667 38282 -181436 -285144 -259135 -143699 -110247 -197330
22265 -197330 -76651 -12639 103195 71564 127856 146932 205695 98417 -8367 -67176 -129878
22254 -129878 -196839 -255786 -230611 -165410 -51485 63846 13582 -47012 13073 83186 8582
22243 8582 -155606 -180416 -163615 -83444 -11803 -120698 -219027 -134519 -59461 -10122 -118687
22232 -118687 -86345 -9949 -26487 -125177 -105644 -32274 3502 13522 116971 252860 209271
22221 209271 229873 104394 -17518 -15955 -16388 -15912 -11854 102978 124837 200855 132991 -54053
22209 -54053 -93933 -3318 59888 88752 48318 -57273 -48292 -58875 6980 -11244 43831 112003
22197 112003 -6191 35578 50583 -43735 6628 47234 -4786 -47254 26272 49648 -83961
22186 -83961 -54099 -49286 -118544 -69494 -88036 -133568 -176919 -97662 -28435 -112686 -42127 -22388
22174 -22388 -8672 -101955 -85500 23507 33211 105311 -36992 -121930 -80139 -88533 -92312 51128
22162 51128 94486 -37860 88273 126011 109881 37736 -61574 -169556 -219030 -90381 65832
22151 65832 136834 102305 100383 135926 71034 -22922 -15789 48421 8126 -33601 -132125 -212226
22139 -212226 -134022 -72420 -31533 -89854 -104664 -167867 -257046 -314327 -267608 -110310 -14915
22128 -14915 179814 223755 47948 -26308 -136204 -200452 -219589 -206163 -194448 -63544 -49882
22117 -49882 103547 149621 82153 -47308 -150840 -147266 -64283 19867 118436 146892 66849
22106 66849 33217 -45348 -101773 -111578 -150488 -194514 -167362 -37004 -30056 60298 91122 146581
22094 146581 10624 -155741 -138384 -128323 -176976 -138179 -243534 -230873 -176545 -211884 -42490
22083 -42490 71521 137830 35317 -217273 -282948 -315818 -262122 -199384 -233934 -207810 -210407
22072 -210407 -53609 -129354 -253177 -152372 -109838 -94449 -106177 -98018 -198942 -105663 -35456
22061 -35456 -83392 -68546 -78532 -28556 117389 178548 47332 12021 58528 -77577 -223703
22050 -223703 -300874 -143111 58710 119296 30374 -5655 -133582 -126705 -47957 -43256 32647
22039 32647 -50410 -116514 6122 -41842 -83590 -131866 -45082 33087 22582 -55325 -36359
22028 -36359 -49054 -88780 -35582 4048 -64765 -50815 47845 159238 234640 167698 111713
22017 111713 -8251 -126636 -77287 -6836 184393 85683 -58682 -251477 -250546 -108444 -44637
22006 -44637 -36922 24357 68894 -87062 -99509 -103008 -168402 -150488 -174349 -189256 -112691 -114259
21994 -114259 -96237 12088 14443 -68035 -79114 15522 19533 -53569 -139916 -7677 90050
21983 90050 76829 -2708 -54438 -68225 -19743 13896 -10265 33852 6588 -80299 -58667 -151230
21971 -151230 -187859 -166174 -148401 -27506 -663 50193 115310 152437 206199 166131 174740
21960 174740 265597 145495 38633 -59975 -58980 -60404 -45299 -178913 -80481 -47050 -64408
21949 -64408 -88102 -86158 -72343 -41398 -4434 -41317 -18705 88416 121211 61820 82393 58855
21937 58855 81117 174870 119868 62371 -70782 -55416 -31640 -45018 -137634 -97554 33517
21926 33517 109628 134117 67569 93147 147573 -29772 -231315 -260354 -242440 -164023 -96894
21915 -96894 -132247 -146654 -150420 -105136 -99407 26279 -30486 -94393 -71648 -39443 -34459 4115
21903 4115 -26426 -170478 -270616 -284073 -162373 -91150 -102780 -87353 -148459 -140745 -159843
21892 -159843 -169661 55466 113838 50397 108459 277737 232695 40102 43387 7806 51828
21881 51828 99761 -31022 -33613 -19464 99342 73200 163503 113751 47479 -86119 13716
21870 13716 97338 203938 179958 123903 1648 33733 117128 134592 98075 -81657 -119492
21859 -119492 -197926 -307726 -285193 -63821 -86914 -147552 -259052 -280024 -106860 -34167 -64687
21848 -64687 -164728 -173068 -217334 -267827 -379684 -386986 -280015 -205611 -165270 -22026 -115536
21837 -115536 -211970 -211771 -239920 -150946 -46783 -52750 -216956 -95318 28727 -71235 -16444
21826 -16444 -147804 -161692 57503 152296 175305 151311 85794 24595 -3776 -12772 18028
21815 18028 -9982 -62140 35092 4409 22127 -24216 -105848 -76230 64416 166855 97680
21804 97680 8177 -82735 22127 135337 162708 103797 -11153 -59692 16296 10435 -23965
21793 -23965 13342 87550 63474 -152539 -185882 -146895 -145615 -188480 -182290 -183032 -100479 80020
21781 80020 110786 171310 240088 138766 103590 69078 -3679 -24035 60036 144761 132151
21770 132151 101470 70568 129653 254262 332729 344919 232883 151342 48730 -87780 -141154
21759 -141154 -41857 4785 -33598 -55994 -117058 -97380 -85193 46743 164109 182751 209806
21748 209806 72996 50179 -83214 -58821 -61773 -39498 -23629 31326 34800 -40269 -161894
21737 -161894 -250827 -164365 35784 112342 106793 107394 45148 -104341 -172867 -26050 -26094 -128372
21725 -128372 -106096 -167893 -99505 75150 190326 184950 91216 113140 -21084 -139191 -253853
21714 -253853 -146272 -13492 -2645 -32895 19089 -38025 -171132 -169240 -147602 -137384 -96780
21703 -96780 -256546 -328285 -254253 -231591 -153450 -199843 -260283 -154617 -134306 -206573 -259754
21692 -259754 -300113 -312286 -451941 -361790 -168369 -102346 -203145 -240092 -142666 -38937 146476
21681 146476 123597 132175 184280 55458 -69002 -51430 -133034 -175053 -265291 -199143 -105911
21670 -105911 -99464 -122544 8040 158940 248854 176899 94124 35237 126861 197621 129555
21659 129555 757 -91164 -134194 15818 79598 104539 17885 -32499 -108111 11778 33667
21648 33667 40148 112521 235688 273615 296016 241501 90674 92937 68390 103805 188149 114276
21636 114276 -42235 -105861 -20886 100878 86919 62486 8310 62502 58676 -45662 -112858
21625 -112858 -147297 -121020 -145476 -17286 53761 103309 69642 15753 94986 232761 211148
21614 211148 203546 115908 -41085 -146078 -162638 -172560 -5636 -136766 -214044 -319652 -299201
21603 -299201 -273433 -251743 -320915 -241341 -230618 -149162 -122549 -236349 -235006 -155613 -92814
21592 -92814 -159173 -124221 -116128 -200576 -186927 -7411 -38766 -199295 -166857 -167990 -204250 -228334
21580 -228334 -125791 -5653 41644 84036 87469 -57903 -60560 114 -80042 -201590 -146540
21569 -146540 -88659 -230443 -122423 -11766 4751 53557 76080 37855 90799 34865 -116605
21558 -116605 -181120 -101592 59515 149039 152896 37817 -46015 45000 115742 210794 132600
21547 132600 74189 7296 -13601 -132600 -155435 -82150 -35637 -47081 -25533 22471 90227
21536 90227 171555 139662 227754 162266 177502 37119 -90378 -141940 -104194 -21998 90211
21525 90211 148936 169823 200677 138168 195626 142592 90367 189428 118007 63622 36000 -26316
21513 -26316 105480 -6246 -43604 -8233 50606 73754 -28731 30204 87206 61179 73909
21502 73909 -45272 -235072 -338098 -187517 -201164 -394081 -399287 -145769 -147194 -154237 -208882
21491 -208882 -180569 -131360 -141449 -232105 -319392 -189789 -224623 -237949 -238914 -230355 -234466 -25313
21479 -25313 77189 -4407 2575 -13600 25859 -122794 -219395 -308717 -279613 -140941 -117757
21468 -117757 -57342 -185743 -182994 -59978 -103691 -52111 576 20483 163843 143349 4176
21457 4176 -34615 17679 152604 147263 -83104 -158091 -164038 -267997 -242723 -100711 97705
21446 97705 173494 129314 72480 37231 43864 17024 -28792 -25371 16346 -29192 -68725 -92349
21434 -92349 -46177 -81818 -106462 -77082 -32553 52623 36462 -48144 -49350 -160175 -240109 -194376
21422 -194376 -71296 -104010 -122474 -57496 -31281 -206349 -311510 -33978 165697 213045
21412 213045 72796 12328 6854 -39963 23328 157330 70125 -14816 -72597 -102609 -90658
21401 -90658 -12360 -18282 -129274 -233758 -281539 -72583 102182 226267 214095 244791 14925
21390 14925 -32869 115656 100273 106894 50207 -18106 -106710 -101455 -152884 -192711 -33407 32060
21378 32060 -105992 -216472 -181917 27228 130431 19502 -85197 -63827 -47820 -59227
21368 -59227 -34448 32561 28524 -78003 -113861 -38866 -35038 -74356 -121342 -5480 -12666 -35288
21356 -35288 -26399 44267 113377 -859 -143692 -157484 -194179 -111412 -14597 -24583 130646
21345 130646 314560 228506 74852 -57569 -74782 -51172 -26514 67177 68146 43240 55792
21334 55792 -13099 -43233 -112057 -61813 -40383 85207 37218 -78317 -89103 9934 -23266
21323 -23266 -4558 -40618 2927 45743 -68961 -132503 -64862 -11745 -7277 146926 88198
21312 88198 51847 49802 49513 -41811 -79529 -61990 63688 210773 179800 184711 109412 -60855
21300 -60855 -80039 -86596 -45985 48973 22948 -18219 -48432 -28374 86912 228205 348864
21289 348864 366269 197320 121189 -26375 -163638 -30495 80082 199558 126719 -29160
21279 -29160 -41827 -25824 -107657 -137131 -91336 -168289 -246165 -208512 -147235 76696 91117
21268 91117 91003 150990 154081 20402 62287 105482 68698 48945 -18273 -90583 -16310 144214
21256 144214 149876 135515 8991 -24853 -101198 47279 92094 3909 -157838 -222154 -285126
21245 -285126 -277195 -49665 5692 -98212 -100908 -112963 -85251 -111090 -70443 -96460 -101278 -25957
21233 -25957 118918 146525 126370 105067 62783 20515 -17132 -22603 -145193 -122905 -12194
21222 -12194 -95492 -114714 -27553 163000 132968 68146 149004 172522 49316 -616 -34283
21211 -34283 1308 -12885 7001 -162752 -204366 -152643 -105023 -166611 -355303 -338834 -195100
21200 -195100 -129347 -53144 22645 -30816 -88793 -148897 -200476 -163328 -114616 -99024 -135036
21189 -135036 -218672 -178875 4228 -51379 -146440 -143302 -35743 149624 148952 180209 173204 146726
21177 146726 69583 77345 158623 89894 -23678 -9866 -73450 46183 7800 91250 195238
21166 195238 48671 84605 87982 87696 62735 49506 64570 123147 188357 108871 79498 73220
21154 73220 57922 -26042 -82716 -13615 -25114 -30316 6605 -86129 -197370 -111583 -11358
21143 -11358 -77028 -164296 -137744 -25120 70542 91070 178575 285977 174744 -40588 -120053
21132 -120053 -229483 -215116 -208429 -168648 -209925 -132415 -137940 -162124 -145086 -140726 -159916 -7711
21120 -7711 -7111 -141350 -254453 -161603 -148261 -242139 -221929 -203051 -159603 -170047 -144192 -151193
21108 -151193 -177452 -94339 4496 105660 200297 155350 42927 116121 62366 12581 41145
21097 41145 21794 -108310 -171981 -118354 -79379 22704 35421 -106142 -124685 -68164 10161
21086 10161 65483 50807 -48636 -73807 -203179 -212905 -16827 74703 -78140 -31731 49095
21075 49095 -27338 -169895 -223741 -173987 -210558 -201847 -152237 -118334 -105454 -37252 11460 49474
21063 49474 48877 -59535 68669 192284 116721 54151 93693 -6964 -40167 39111 146752
21052 146752 103881 7517 -615 -17602 42910 -43878 -126583 -49858 -98116 -90590 27853 203771
21040 203771 99397 -52280 -67595 -19127 -20591 -31888 -36790 -30047 -90380 -72680 -67098 -27783
21028 -27783 11760 -46120 -83169 -79234 -144659 -225852 -295341 -276860 -213578 -198991 -100781 -23295
21016 -23295 -5540 -63928 -21035 87087 74187 -30092 -72317 -67902 -117549 -142339 -110902
21005 -110902 148859 188614 94869 159594 281890 209019 79156 -19490 -93352 -209886 -80594
20994 -80594 -75584 -103462 -59308 74168 133111 251303 122496 -72062 -129406 -58348 -69864
20983 -69864 -94146 -106837 -158938 -86422 -167853 -198851 -231343 -330019 -275924 -260043 -291360 -104584
20971 -104584 -63745 12994 -36596 -122770 -71176 -8970 29754 -117308 -118702 -107611 -247804
20960 -247804 -215275 -170822 -137083 -158511 -183437 -105449 -24482 -74967 -120096 -196910 -187728 -97226
20948 -97226 -136342 -166790 -197781 -285447 -262870 -272034 -257776 -147846 -12751 1387 24121
20937 24121 -33475 -105009 -98855 -81891 -110327 -244445 -236556 -271371 -239790 -11024 167763
20926 167763 180581 151216 163845 87204 75132 193699 -18620 -92539 -15397 163825 181519
20915 181519 150496 71646 23330 58740 59796 -14079 -89433 -216675 -156099 10513 24554
20904 24554 -85688 -32259 70136 41173 89985 91906 113321 56433 26064 -67680 88332
20893 88332 137505 56941 -25846 16031 58952 91781 -54961 -232951 -174682 -7407 9103
20882 9103 -52486 -34980 39311 -60663 -124976 13140 38577 -30512 40518 -110224 -220067
20871 -220067 -45521 20929 14434 105884 148260 56583 17280 -63492 -87666 29578 -11227
20860 -11227 133756 233999 296650 206319 76464 24112 100737 243693 208930 172049 111229
20849 111229 44793 -71211 -183150 -253433 -269059 -202337 -97629 -176624 -163219 -171305 -48370
20838 -48370 162700 107909 80177 158277 143034 164273 151816 109007 23832 -83235 -79049
20827 -79049 -96263 -126318 -134466 -84198 116406 129752 38868 -4555 -24602 40500 72191 -34478
20815 -34478 -58215 35137 59469 46806 72121 79904 35064 82156 -100752 -162847 -106148 -86677
20803 -86677 -161109 -118179 -21426 -10316 -36785 -26441 48443 61530 204337 258024 4250
20792 4250 -179404 -67645 18861 53240 42954 76145 135886 249645 190743 94450 193876
20781 193876 261812 219522 287793 160305 74424 16287 -97357 -72060 -231164 -122858 -83793
20770 -83793 -71554 -114831 -127391 -74614 -40064 20600 -66757 -196550 -218326 -79546 -21201
20759 -21201 153749 163351 83926 -57871 -63616 -104602 36456 111846 174928 238913 192566
20748 192566 152536 38686 164324 198777 74828 52395 27734 138851 143723 134729 15332
20737 15332 40867 81227 196450 290214 272033 107588 164944 163815 193404 125510 58365
20726 58365 15680 7288 100718 89655 -119941 -267780 -218748 -184616 -230006 -271408 -222684
20715 -222684 -195860 -140108 -130695 -126279 -153327 -126129 -45405 -32576 -163502 -247595 -217442 -105924
20703 -105924 65041 29160 45080 -85121 -37325 5323 4826 -36431 -60584 -48136 -79249
20692 -79249 -197338 -215984 -45664 14602 130227 192391 167341 14586 -207304 -178457 -104904
20681 -104904 -156857 -55951 88428 176984 75670 -52848 -118736 -128763 -13307 55414
20671 55414 34332 -36502 -188533 -186715 -317422 -152957 -140011 -140400 -100597 -24882 -44410 -95646
20659 -95646 -63954 -7371 6762 133139 187316 246043 169049 125750 90239 100686 67524
20648 67524 -18224 -142626 -215985 -202699 -74395 47569 44554 99859 224006 137862 57938
20637 57938 48413 219 -64230 -62308 81517 264863 249898 100486 31594 166575 215816
20626 215816 109005 -17102 -60272 -43766 145937 287224 249403 109369 139185 172122
20616 172122 145336 144213 101708 6308 -23849 71625 25873 -99155 -156925 -130966 -117915
20605 -117915 -81870 -168385 -89923 44198 1105 107170 100426 79629 36367 6736 35731
20594 35731 -15989 29802 -22909 -46245 22033 40029 60388 -33720 -44194 -145605 -135875 36456
20582 36456 216857 268525 250965 235800 118595 143340 188130 214104 117896 45360 -1632
20571 -1632 -220 11697 7434 -55115 -70189 38059 118661 164071 246766 200518 196143 87814
20559 87814 -34509 -74180 -52514 -55773 -95980 -37298 159123 210901 205229 169716 189519 96095
20547 96095 -579 141204 303903 219540 110807 47541 -30699 -71379 -163843 -134155 -104330
20536 -104330 -91526 -149026 -219531 -183329 -93348 -89536 -63649 27801 70076 21438 13543 -44276
20524 -44276 -148727 8872 14394 18183 17875 -40901 -94522 -65768 -99664 -120853 -100880 -23949
20512 -23949 -116871 72335 170736 262268 335329 198209 -60324 -103325 -104482 -44868 -25608
20501 -25608 48910 41025 -8837 -76488 -152634 -127963 -81824 -5591 38191 202238 189064 7163
20489 7163 -81199 -102410 -8831 60537 67539 126741 4594 -109250 -58511 70741 73570 4755
20477 4755 14657 -1144 105074 202051 157489 91517 165283 96495 59947 -34564 -51481 55269
20465 55269 88068 70782 109527 114412 32457 -56600 -68228 -125936 13173 53916 37697 219633
20453 219633 230519 98629 -29208 -132875 -136026 -90943 -9293 18893 119187 27752 -18927
20442 -18927 -7570 20669 125085 155436 183605 156598 140583 153137 21145 -82325 -118675
20431 -118675 -68027 97986 149406 60201 -76882 -20906 -29280 -137580 -191660 -258240 -205098
20420 -205098 -148912 -136097 -199987 -178521 -112437 -26999 80487 -22581 -76506 -23431 18095
20409 18095 38684 17650 -36005 -98957 -64922 10758 36318 75665 143490 -48756 -232817
20398 -232817 -173236 -108045 -95010 -53358 -27514 -48002 106691 119259 2600 -101874 -9024
20387 -9024 118151 190879 139071 27293 10695 -79877 -135373 -101892 -89214 -97263 -65165 -14999
20375 -14999 98491 18909 -1339 65571 81659 -139022 -287465 -177451 -7350 76292 87066
20364 87066 -17371 2384 59755 80718 57395 -92642 -101873 -174456 -194098 -190980 -71182
20353 -71182 -11783 4713 -119619 -54396 -72241 -135968 -77971 -34933 -8154 -92240 21025
20342 21025 97030 9695 22814 23953 28590 -81189 -7908 140636 206501 237876 22179
20331 22179 -21889 42265 80166 -24330 -51123 33555 -13153 -83287 3927 108625 -17625
20320 -17625 -121290 -88612 32792 187751 169998 45163 -33395 2191 32715 69451 -31461
20309 -31461 83961 49089 -3120 44316 -34209 -80683 -119734 -169740 -207449 -195006 -213378
20298 -213378 -46949 -120040 -63686 6940 10798 103784 194706 147212 -35197 -163374 -168676
20287 -168676 -135916 -66161 -75737 -172995 -196586 -122781 -82665 -47820 -14456 3950 47533 166473
20275 166473 123763 2135 -164087 -220588 -74876 -74597 -86218 -133381 -31935 90539 77837
20264 77837 36801 -61282 -58596 7526 147673 175473 88719 -49837 -76979 91346 153368
20253 153368 148418 95911 52983 45828 77567 151797 69715 13120 28612 6945 -24976 -9790
20241 -9790 68395 172018 219547 -70622 -165284 -69426 -82975 45568 39483 -46618 -9766
20230 -9766 19367 46612 9371 -63081 70568 45272 -79122 -197677 -64008 58290 15220
20219 15220 -74454 -217264 -58413 72809 37877 100826 39590 35703 -2179 -71828 -201181
20208 -201181 -219609 -147235 -178852 -64295 -43939 -129205 -87431 45086 140952 179712 101845
20197 101845 70085 98956 225601 371806 305409 94973 6516 7351 125841 179984 131661
20186 131661 164180 8815 -74920 -45793 -41530 73699 134834 155446 130679 104465 2198
20175 2198 66036 101957 149277 130114 160970 232652 257459 181927 117204 105747 155311 231361
20163 231361 130863 37606 114031 223296 212850 31151 -50293 -71909 -78300 -115890 -70257
20152 -70257 -38552 -147472 -137037 -138250 -193284 4785 262834 333100 233554 140106 187300
20141 187300 209937 248274 308488 259932 189858 129967 -62874 -140721 -80791 -10019 12257
20130 12257 17924 39064 -35290 10639 127154 229599 241870 180472 235412 244919 85558
20119 85558 53145 68982 37847 42956 95621 87903 104107 82476 105753 131794 43834 -67331
20107 -67331 -170155 -167863 -62914 5920 -55331 -176292 -186619 -137645 -44464 -8448 -195556
20096 -195556 -275459 -178756 -95829 -52850 26788 109676 86563 62806 95794 201427 174488
20085 174488 121984 87900 22965 -69169 -161901 -100084 -15130 -29014 -235941 -241871 -140748
20074 -140748 -118064 -101777 -154867 -205321 -243548 -193569 -141795 -60102 -121655 -200948 -273629
20063 -273629 -197180 862 102330 167390 227956 180371 149566 132832 143676 158116 182867
20052 182867 184277 40697 77685 156344 24379 -193087 -159771 35283 116553 155076 149923
20041 149923 127857 2491 -33713 -29830 -87440 -147576 -234076 -229721 -110147 30937 -26052
20030 -26052 13231 116664 86173 32732 107313 61930 -28984 -99766 -42869 -23712 -124100
20019 -124100 -241221 -214670 -225221 -137733 11282 -8805 -114739 -76804 8329 17686 93421
20008 93421 150226 7005 -118802 -96563 -192143 -146551 -74382 -148431 -127342 22590 157206
19997 157206 142106 140155 154164 210640 165879 115241 50467 -70675 -135325 -169170 -114183
19986 -114183 -140945 -138551 -108852 -100023 -75062 -116413 -43177 -20446 -83671 12854 -59769 -196553
19974 -196553 -226455 -139278 -79971 99641 112381 -132180 -280894 -155016 40709 32064 -74440
19963 -74440 -39241 -72128 -193270 -117763 38924 11810 57768 36445 -17877 66303 181816
19952 181816 222949 213663 172505 82939 139171 167153 270112 382385 323203 160066 81713
19941 81713 27058 -43436 -9794 179435 248127 241422 245065 157589 85350 40896 135209 227266
19929 227266 303378 206228 86205 193622 201299 157746 240389 127537 118395 164110 79977
19918 79977 78328 96380 28816 -38511 -100176 -25691 41867 88682 -126532 -68861 -49479 -3433
19906 -3433 10544 85243 96092 156012 290935 247478 120544 45849 104440 72503 28820
19895 28820 -6994 -86384 -151127 -290338 -182825 -42701 -19197 54109 17524 158663 139858
19884 139858 79901 110376 254034 363198 176954 62701 75632 136877 137715 115836 117335
19873 117335 195063 450579 497121 331379 110208 -63941 -20665 -26203 -74735 -76028 49586
19862 49586 102290 22280 -8408 135530 62516 17260 63035 71181 66405 35148 40492 84310
19850 84310 201139 122794 143455 261614 306659 141106 35357 28606 192937 262208 245708
19839 245708 211915 63905 -27306 -24647 24241 -46410 -199196 -186880 -129889 -133130 -54167
19828 -54167 34745 184082 246083 96079 80805 -72728 -28433 -23147 -41927 11367 121198
19817 121198 198422 124028 -67694 -17493 37220 -17992 133844 252578 215550 59281 -52804
19806 -52804 -23579 -60525 -128991 -167993 -124952 -8864 -7733 -78149 -31709 32572 103577 177624
19794 177624 224163 208195 97193 125026 30301 -98172 -142477 -135410 -48981 -90617 -64200
19783 -64200 -26339 -7567 -59781 5858 17477 99149 104733 137493 184769 118003 -49041 -41262
19771 -41262 37758 -21157 46545 58499 143674 181913 143346 116440 180079 230461 14356
19760 14356 -38972 -84681 -178956 -171416 -192976 -213948 -56627 134892 189799 158474 -27526
19749 -27526 -192204 -193538 -110759 -21682 -8600 156384 125941 -53790 -125332 -192338 -212760
19738 -212760 -166585 -82105 -69361 -119741 61662 103000 94684 89037 -35438 -43099 38776 159629
19726 159629 344966 386352 255531 146164 183483 234336 112267 104126 140321 42519 -9311
19715 -9311 42978 170783 267254 333460 312507 308555 100912 -12221 14907 6573 -4910 -31125
19703 -31125 -81091 -29442 68963 30507 -15952 -17664 13755 -37962 -87132 -140361 -213520 -191874
19691 -191874 -151213 -153086 -88408 -164426 -91611 20376 70973 216515 276858 196634 110098
19680 110098 120734 110918 151508 131194 97163 167210 221107 71234 -94088 -129645 -72274
19669 -72274 10816 73694 115020 41668 39161 65034 94162 75001 144125 114036 170409 114983
19657 114983 44243 -14225 -8359 136682 109576 81534 48011 44990 63095 40739 27871 -10372
19645 -10372 18597 -22847 39546 86392 89021 42070 20683 19741 121854 148597 137295 126504
19633 126504 132130 106916 170160 96198 146741 134047 98536 70228 77129 90582 -32700 -70062
19621 -70062 -10010 -54391 -56714 30034 40881 -78538 -62322 95257 102973 142244 173328 35511
19609 35511 40526 118813 31720 14999 105682 202155 199529 -48973 -90970 2343 81588 163733
19597 163733 253992 115094 73471 54906 58107 139933 168855 242907 342168 326191 427258
19586 427258 480155 515573 653530 629285 510733 502121 557600 648828 728874 772496 745665
19575 745665 759325 874042 933563 984015 953489 1069739 1023062 817679 754356 785581 774976
19564 774976 837602 820379 822724 886985 765542 636983 680727 800756 903727 909222 895405
19553 895405 679489 644367 582938 512652 497745 365956 348193 475549 425421 413790 435998
19542 435998 432653 352238 415664 578352 634289 603661 601122 661846 643553 746150 1011882
19531 1011882 1085060 1013587 885989 813755 853714 983642 974170 838947 842112 916501 1024127
19520 1024127 1071107 1068395 920919 1021885 974265 793598 802327 697629 750281 679726 578316
19509 578316 710354 718283 531780 391206 448023 524616 558608 473674 355438 356366 318807
19498 318807 308080 295243 242761 205702 424036 470275 497271 472120 544731 419949 316109
19487 316109 253732 231811 79463 39880 123694 185435 138252 204950 273713 260547 337529
19476 337529 456118 382381 319106 250268 238586 300038 309784 321573 415570 342115 268775
19465 268775 251521 230245 209017 140818 58672 -19574 94281 247477 293096 276635 109088
19454 109088 12828 82031 210795 164278 200723 206771 292953 349225 306091 238082 324358
19443 324358 262608 301702 246732 230088 253521 372716 466543 294747 196329 245872 276930
19432 276930 379121 371668 225337 187194 121381 185998 278367 356251 494993 502194 350199
19421 350199 203255 280725 325778 292119 292587 286649 193465 236887 203664 273623 367276 233078
19409 233078 130246 151566 164845 189357 243456 216097 165118 290716 186801 176230 304561
19398 304561 375419 332899 170099 85731 84918 196162 358906 439679 382454 272116 361830
19387 361830 234512 232386 304840 316107 274635 464964 596740 410491 395066 315813 232132
19376 232132 196372 166576 51165 133944 156010 27461 13739 119624 168501 183810 270780
19365 270780 240914 265542 172936 104374 93037 124850 185183 78591 72965 139149 192797
19354 192797 208885 242470 276568 404395 485760 427370 438831 412568 418291 303082 238699
19343 238699 343665 341012 251564 179380 108512 131866 223815 424428 507877 455475 417052
19332 417052 334144 372500 399219 433207 400247 447489 367248 346011 468016 600901 578745
19321 578745 449822 373525 349607 512000 591666 439471 404859 406938 229856 52591 192253
19310 192253 254655 246889 290716 244051 208083 262432 255376 252606 149506 87678 106027 195174
19298 195174 210283 405562 554881 466281 459600 574516 622693 652647 611962 559941 607199
19287 607199 533810 442108 554539 552806 551341 736602 871836 840418 725305 689582 665933
19276 665933 647449 680006 764507 734303 611650 602438 618536 556841 463079 503117 517487
19265 517487 597652 716956 826877 760544 615896 553579 602949 580576 542636 641455 735702
19254 735702 694230 442559 288720 478086 498478 543559 590992 564631 524663 491680 441426
19243 441426 496820 489888 520097 358679 350696 447428 466137 478181 468949 453550 555105 731656
19231 731656 733533 698380 650463 692989 694906 586627 622410 611438 723169 806784 799837 787691
19219 787691 809741 836059 814255 906327 864350 893230 997619 1153231 1178218 1271283 1172905
19208 1172905 1105476 1076675 1232300 1260843 1415833 1566519 1815208 1970823 2086481 2207003
19198 2207003 2309134 2527004 2874392 3176249 3163451 2884883 2711490 2626645 2580926 2670720
19188 2670720 2802561 2844229 2682143 2629663 2657257 2587094 2676363 2659968 2551883 2741326
19178 2741326 2963153 3256424 3524091 3677312 3573586 3562605 3632132 3689791 3796296 3601256
19168 3601256 3322192 3120026 3031320 3151383 3303107 3446857 3544684 3428974 3330531 3292797
19158 3292797 3276679 3277291 3280180 3326884 3561924 3814519 4089187 4181357 4192749 4081230 4127842
19147 4127842 4074403 4125522 4217340 4228993 4186670 4153905 3979879 3889379 3903934 3897300 4096325
19136 4096325 4552160 4959775 5209301 5188780 4955602 4775526 4512489 4375461 4164040 3959630
19126 3959630 3875346 3699832 3683901 3658065 3687416 3799601 3902033 3945550 3874325 3899042 4107137
19115 4107137 4157020 4357470 4517250 4560740 4710623 4962838 5251545 5419022 5714047 5930649
19105 5930649 6194825 6493338 6787763 6958403 7273289 7653286 8056707 8517210 9106431
19096 9106431 9586253 10068261 10844381 11690296 12573122 13616540 14840884 16303374 17921453
19087 17921453 19898988 22449350 25521985 29125061 33876924 40042789 47797387 57256357
19079 57256357 68550826 81358681 94920086 108407845 120557048 129800512 134593197
19072 134593197 134968637 133568363 133328162 136024327 143039284 154176077 167238472 178304547
19064 178304547 183422620 180548026 170684321 156744926 141188354 125904935 111946637
19057 111946637 100213673 91019919 84215703 79544862 76594160 74454437 71949856 68686256
19049 68686256 64796807 60518162 56424842 52896702 50071371 47901489 46530321 45955009
19041 45955009 46083229 46834287 48354885 50876345 54395303 58994397 65138523 72966011
19033 72966011 82150400 92232956 102365318 111326286 118706281 124775332 130544353 137034776
19025 137034776 145388772 156595956 171100704 187605068 202972229 213357496 217236016
19018 217236016 215450761 210004247 203297698 197327717 192085706 185976582 176673844 162920540
19010 162920540 145782218 127546542 110335863 95343988 83087553 73369149 65974615
19003 65974615 60406748 56358536 53398350 51256598 49224699 47224509 44937609 42278695
18995 42278695 39490132 36813863 34417842 32335619 30513444 29092769 27769848 26518965
18987 26518965 25526385 24671334 23835009 22991748 22295825 21493430 20754687 19994120 19180575
18978 19180575 18491139 17835858 17126134 16444902 15809448 15171184 14609791 13909546 13235821
18969 13235821 12643861 12022850 11570342 11142397 10711151 10378857 10152171 9829953 9445561
18960 9445561 9100293 8769062 8393647 8116768 7875572 7484264 7193274 7066744 6872996
18951 6872996 6566333 6274580 6120433 6004538 5706888 5435332 5376873 5192508 4859411 4617499
18941 4617499 4434336 4259767 4141240 3989922 3822813 3652543 3532131 3513998 3378720 3170842
18931 3170842 3065311 2849730 2618523 2571270 2646848 2589594 2572691 2525034 2462887 2404184 2381830
18920 2381830 2487559 2553046 2597036 2591929 2587600 2601431 2523407 2558927 2493505 2385197 2419181
18909 2419181 2445898 2388331 2449902 2474370 2497979 2506451 2524062 2456737 2301234 2152261 2183165
18898 2183165 2337643 2310759 2243656 2141569 2068406 2040407 2035102 2065235 2012262 1720496 1691820
18887 1691820 1690795 1679523 1589662 1492825 1494319 1491980 1576908 1621204 1594724 1548648 1515655 1465619
18875 1465619 1408846 1404087 1377477 1216161 1118924 1043857 1041061 1100375 1163915 1156880 1206676 1233777
18863 1233777 1265004 1316520 1358696 1264438 1365774 1430880 1517243 1409070 1331829 1268842 1233752
18852 1233752 1261611 1331327 1352271 1326996 1192756 1119572 1076909 1139139 1105932 1085352 1133196
18841 1133196 1173719 1201470 1144666 1082846 1080939 1102180 1022202 864554 822925 704460 723500
18830 723500 786700 911455 925769 913894 893388 945551 970129 990500 838352 758699 807707
18819 807707 702502 787872 809749 867431 987444 1038629 998234 924350 911892 921669 968407
18808 968407 910471 742475 784315 777638 640939 633566 698460 665215 639915 685742 581012
18797 581012 590715 729700 762582 633337 508896 416819 426510 573997 619285 554347 583759
18786 583759 632116 651015 566181 501775 456981 510845 469819 534234 567431 643805 780065
18775 780065 894189 1007241 941447 864401 765558 783259 723563 744214 794594 703155 775358
18764 775358 798763 898567 900058 825654 784055 808704 798410 799681 747071 619041 568127 642718
18752 642718 677639 636254 628546 610636 639288 679919 669941 686098 815870 913910 845990 739837
18740 739837 689128 714733 682071 659686 676152 731550 735833 760605 720920 826443 857127
18729 857127 816151 884860 969883 995783 1121099 1082880 1027069 802694 810359 1035600 1087257
18718 1087257 949502 890316 987888 963428 982968 948579 804581 813679 854913 803444 754066
18707 754066 729983 548853 491598 477887 441018 433785 403683 280693 353377 460152 626799
18696 626799 634720 555079 479968 439058 545228 714959 658658 571999 578060 633152 838772
18685 838772 956096 1018969 1059268 1030519 881703 818819 770279 786266 844323 898729 926034
18674 926034 886209 844789 835994 819364 683939 713130 792390 836914 760421 597917 530208
18663 530208 583490 674721 679393 716475 669814 747248 675940 648263 541149 376333 290239
18652 290239 373867 468470 545744 520511 507959 453397 526454 461518 454282 533714 514144 556168
18640 556168 428935 493476 535590 602855 487705 473723 511158 391903 526928 683587
18630 683587 566667 561579 667428 699314 744802 673537 717759 764820 743456 672578 583415
18619 583415 679217 746404 669801 466862 563165 805500 795074 647053 658350 642385 611669
18608 611669 695190 895941 997311 1021119 953274 855935 831940 929956 1113140 1139508 1110260
18597 1110260 1173487 1432791 1465712 1462979 1563506 1660626 1847251 1916226 1958501 2016931 1927532
18586 1927532 1790675 1692040 1647089 1594118 1457545 1359268 1367538 1383936 1340579 1395003 1423194
18575 1423194 1445664 1470074 1397182 1415270 1362196 1326558 1357995 1479259 1586157 1657593 1723372
18564 1723372 1695777 1573630 1568504 1554860 1654409 1700761 1658557 1563381 1531575 1613948 1632904
18553 1632904 1642394 1613697 1569753 1501863 1433137 1617954 1787885 1774014 1737346 1749746 1791295
18542 1791295 1841569 1851315 1821904 1726522 1769877 1917334 1868088 1874132 1937764 1969669 2135800
18531 2135800 2205188 2200989 2092419 2197837 2379593 2596939 2669581 2567572 2657120 2618925
18521 2618925 2694309 2793616 2863909 2852723 2876800 2942247 3081961 3109934 3214534 3238818 3205176
18510 3205176 3152651 3188776 3225188 3163008 3168357 3259425 3431361 3576283 3785881 3876499 3914794
18499 3914794 4054253 4089628 4104944 4154611 4256984 4437485 4599896 4767281 4822436 5033108
18489 5033108 5381277 5759443 6099292 6342141 6742544 7188994 7606957 8145050 8706133
18480 8706133 9124148 9669637 10366535 11127238 11956237 13135966 14595809 16502161 19127653
18471 19127653 22280204 26162799 30961392 36263799 41951703 47717929 53206447 57558439
18463 57558439 60358950 61734802 62654843 64111048 67127067 72262529 78976777 85820756
18455 85820756 90421590 90770428 86667096 79826121 72140515 64995697 59329849 55469209
18447 55469209 53233488 52223605 51728592 50940098 49415926 47010496 44187671 41220618
18439 41220618 38528680 36484238 34751318 33638194 32941840 32571879 32425132 32848481 33893462
18430 33893462 35630404 38366764 42054058 46341570 51009566 55715151 60329578 65011447
18422 65011447 69921835 75338035 81980638 90236652 100836337 114216026 130159360 147870196
18414 147870196 166062344 183680720 199347260 210798178 215704277 212376497 201420235
18407 201420235 185828693 169375950 155029595 143890863 136648295 132571309 129630834
18400 129630834 125948864 120191570 111813503 101627444 90878113 80583909 71437978
18393 71437978 63690835 57396723 52469598 48575032 45603342 43367568 41573591 40378225
18385 40378225 39590970 38958931 38719861 38833757 39397043 40631094 42501205 45063344 48419324
18376 48419324 52828085 58246457 64599309 71474245 78217245 84071930 89043879 93991784
18368 93991784 100011157 108155453 118907460 131186748 142884385 151481691 155574956 155383563
18360 155383563 151436502 144461328 134791336 122609089 108913327 95465014 83288094
18353 83288094 72957162 64819907 58641895 54098855 50406519 46987138 43666926 40468133
18345 40468133 37377557 34607245 32030031 29852376 28102220 26635726 25433448 24281744
18337 24281744 23231519 22562034 21888983 21247830 20563420 20058355 19588748 19167493 18953414
18328 18953414 18732969 18606246 18522649 18436809 18398704 18317610 18339330 18436747 18613287 18954698
18318 18954698 19308791 19839127 20701118 21973800 23699850 25970415 28982076 32994975
18310 32994975 38069094 43840380 49855683 55103395 58820335 61088975 62781490 65220143
18302 65220143 69201804 75202200 82702155 90110485 95189066 96077713 92720877 87172296
18294 87172296 81020166 75827928 72557247 70777864 69385640 67184771 63311265 57672015
18286 57672015 51430564 45345870 39984649 35488647 31973284 29331633 27313303 25778285
18278 25778285 24818663 24323214 24139583 24388008 25145297 26242104 27791892 30055269 32888337
18269 32888337 35864917 38556510 40251059 40714056 40350852 39722591 39409455 39849233 41411654
18260 41411654 44375431 49031746 55695119 64419510 74918770 86050164 96586698 104864856
18252 104864856 108661088 106895419 100252899 90530176 79774088 69343507 59995528 52021247
18244 52021247 45701755 40678545 36856403 34097951 32471015 31617921 31390736 31534842
18236 31534842 31854078 31847333 31227863 29685273 27552243 25400080 23250192 21481649 20095381
18227 20095381 19056698 18276015 17669007 17200521 17033271 17139778 17389160 17873981 18691871
18218 18691871 20046199 21810970 23782088 25533562 26703247 27313292 27559719 27854193
18210 27854193 28525896 29763629 31510520 33252231 34315329 34218297 32870983 30713480
18202 30713480 28404811 26575268 25291377 24325638 23343377 22062957 20447299 18358351
18194 18358351 16435435 14522347 12903627 11527756 10371779 9416014 8765378 8154932
18186 8154932 7715803 7413949 7104523 6748033 6466571 5977905 5767343 5632651 5530622
18177 5530622 5484816 5356340 5248955 5015805 4895810 4793056 4636990 4459695 4370676 4329762
18167 4329762 4255817 4184057 4119831 4069762 4029150 3878649 3679444 3603320 3581481 3420588 3277039
18156 3277039 3319742 3324925 3226262 3137782 3071852 2969493 2867222 2810474 2661312 2598310 2552440
18145 2552440 2579054 2494466 2419074 2268031 2117316 2076590 2023326 1975181 1946124 1978580 1897606
18134 1897606 1848169 1899481 1890741 1795816 1823709 1838062 1933916 2007463 1934962 1936672 1841690 1799504
18122 1799504 1868609 1932109 1852658 1843017 1863838 1940724 1975125 1920973 1927953 1832191 1859563 1921213
18110 1921213 1961012 1992007 2099132 2169138 2114305 2065176 2159548 2113882 2009388 2083769 2217849
18099 2217849 2121238 2051919 2064372 2203934 2331950 2427846 2475161 2460582 2545857 2505594 2448995
18088 2448995 2495245 2654812 2651095 2703987 2680793 2704921 2902861 3096704 3148572 3326447 3457365
18077 3457365 3462724 3472969 3447396 3475786 3568692 3698702 3833542 4029498 4281016 4578341
18067 4578341 4673272 4706207 4809440 4971898 5294009 5671306 5924267 6200070 6501400 6829228
18057 6829228 7376418 7881844 8397211 9100913 9936157 11056828 12372023 13631975 15159169
18048 15159169 16816287 18657799 20537848 22477159 24784696 27680023 31163583 35621727
18040 35621727 41147839 48137965 56881293 68191527 82925249 102327163 127532226
18033 127532226 159971168 199613805 243480866 284619201 312906793 319610109 303473953
18026 303473953 271192157 232256688 193711059 159681417 131870877 109957683 93001728
18019 93001728 79746676 69179249 60802965 54147643 48946601 44535287 41091983 38447032
18011 38447032 36359569 34644208 33087343 31636589 30048285 28456720 26960788 25487021
18003 25487021 24431951 23553479 22807482 22155827 21537444 20948531 20527250 20183484 19886803
17994 19886803 19639505 19338618 18917602 18297621 17618500 16884476 16077335 15293870 14550487
17985 14550487 13856383 13333907 12792262 12180611 11597939 11034631 10569455 10114617 9617866
17976 9617866 9147044 8730819 8309858 7843185 7410787 7096609 6781819 6487973 6155199
17967 6155199 6042273 5835001 5635635 5443113 5253470 5026362 4887814 4723933 4497731
17958 4497731 4326504 4082136 3912409 3867956 3872899 3807748 3740103 3666807 3539788 3290297
17948 3290297 3170398 3100395 3124787 3000698 2919320 2836480 2896035 2901416 2797549 2788154 2638047
17937 2638047 2384842 2284012 2271309 2332072 2230487 2068687 1949707 1983737 1872511 1736732
17927 1736732 1729607 1810687 1833163 1842314 1792469 1716174 1487982 1533511 1517089 1430842 1278227
17916 1278227 1272782 1368120 1356906 1345544 1349003 1439808 1647524 1713431 1595786 1544581 1648987
17905 1648987 1684394 1698964 1859495 1971041 1975132 1935243 1986504 1940529 1915591 1751929 1660546
17894 1660546 1728330 1706747 1657562 1615529 1554972 1537985 1463472 1370156 1353657 1284618 1101922
17883 1101922 1172736 1293639 1278314 1067022 1028137 930081 918770 856808 809652 862392 944088
17872 944088 951567 934368 910978 935825 1059059 1080472 874996 799365 946759 882971 893026
17861 893026 846785 891840 976622 976280 1008092 1014602 1063859 1073618 988792 1037820 1118530 1197036
17849 1197036 1153294 1046257 996931 895023 811496 765434 745361 747838 781064 859007 994194
17838 994194 1008295 951241 1016642 856543 653382 675265 687962 683645 597480 636757 715164
17827 715164 696304 637425 612624 709441 719966 674215 541297 546604 613215 530726 459035
17816 459035 547160 652189 550735 361624 270129 319608 427480 488399 450268 402368 282723
17805 282723 309206 424851 436123 470521 532699 392615 373455 408095 416413 467634 526237
17794 526237 632164 716810 659445 481429 430406 445683 492065 580299 465140 326069 299098
17783 299098 361662 468026 429949 383259 479223 533832 470296 320532 261653 322194 430195
17772 430195 515667 553581 530046 403269 304016 271289 382850 347935 372174 339859 293809
17761 293809 423584 415564 492250 497397 426849 424018 546127 669157 681983 596822 431971
17750 431971 535131 634752 649240 626993 701294 586110 535881 458153 349344 349459 404250
17739 404250 442210 377374 305782 239963 164505 168742 214823 214940 356988 402793 338251 292579
17727 292579 262391 267787 280826 331588 359086 325289 180372 161908 173189 119305 60920
17716 60920 124310 136800 69299 10886 113585 215865 269960 295708 326506 347859 331835
17705 331835 388205 467318 423207 500148 450486 501808 469552 497685 494732 406320 349016 189065
17693 189065 205803 252212 245882 257056 184977 167413 220949 177326 83726 163722 74676 37547
17681 37547 52810 118194 145269 177402 295316 185598 5341 32900 152002 92234 63452
17670 63452 29089 59396 225640 138626 79639 95739 109927 135411 158338 154872 162981 94475
17658 94475 28112 43422 21152 20436 55927 165051 160603 256754 306306 209550 222224 208301
17646 208301 88017 -4841 -1315 170284 265477 256298 203379 156246 74810 76238 -20074 -142715
17634 -142715 -95053 -2773 -3780 -6992 42084 30796 -140091 -210351 -54253 -17089 62401
17623 62401 86229 93211 106444 119531 95239 73980 18894 98838 85349 35417 -31056 -86638
17611 -86638 -62705 -16584 -37026 -53885 67279 173746 242934 217684 177232 117336 76960
17600 76960 59092 -87385 -160103 -139314 -97615 93217 148108 116869 -38119 -142267 -193955
17589 -193955 -210587 -160783 -128479 -54028 142593 220231 256943 237929 276669 411259 395349
17578 395349 260745 168811 293750 426372 354729 254957 239952 227719 269333 325451 305676
17567 305676 246268 162594 97714 62749 -41580 -45663 -177233 -63268 6018 33073 144507
17556 144507 165596 166619 105796 128969 145836 92990 77090 170234 151550 77010 108975 176856
17544 176856 161757 136813 164186 142665 173098 160548 173335 142299 37765 37096 115582 124386
17532 124386 148038 177955 129335 -15770 7049 206906 202409 235763 234181 117739 34462
17521 34462 38684 84748 213849 233675 212255 120684 39015 -52628 -23276 -83218 -157214 -168620
17509 -168620 -51597 4065 45362 103064 -11157 25310 128195 122378 174778 150205 97116
17498 97116 123012 113187 19716 34456 50928 26546 -44541 -78239 -33134 121252 175700 284311
17486 284311 304773 216811 170074 170451 189845 87771 31635 51482 142925 253231 312615
17475 312615 232189 217448 298732 350968 441358 453248 519374 637490 754471 839537 915513
17464 915513 855491 932906 1161331 1173202 1025819 865507 903379 842975 830171 777690 564508
17453 564508 471010 403649 280090 326892 330407 211917 173318 187439 226129 271106 381317
17442 381317 354250 68050 43358 143714 211511 266669 232338 117646 77971 193758 312599
17431 312599 289077 237388 275134 351604 369493 97459 58252 143861 168572 101666 -13678
17420 -13678 9672 -22839 55081 78175 92960 93815 106496 185087 117522 88443 183880 132094
17408 132094 106913 47699 9706 166176 263534 211311 20800 -57702 -591 32225 -121601
17397 -121601 -126825 -34494 -16327 -193223 -197340 -54679 5702 -111931 -182095 -36044 -31819
17386 -31819 -100062 -47788 45833 121084 116870 81062 42442 -80754 -288 211364 136983
17375 136983 78130 256260 197311 57213 5763 -4638 20573 159277 161095 74428 109735
17364 109735 68500 39035 -82097 -97962 -80169 16026 -19523 -73996 -48087 -125373 -203649
17353 -203649 -181314 -228503 -138401 -100193 -51358 -75052 -102094 113315 291959 230236 194643
17342 194643 95481 -13106 35840 129085 129518 204893 209767 151334 26709 -63224 -39742 -77017
17330 -77017 -82680 -134967 -90224 15538 70413 173550 189494 -92474 -190322 -49589 -105199
17319 -105199 -78161 106741 74179 -32199 44184 110777 105214 -21143 -144658 -145086 -100929
17308 -100929 -8126 -39270 -19534 30501 23653 63126 247908 283014 149166 122934 86465
17297 86465 75682 -86174 -34987 44533 39075 -33362 -147364 -166476 -38645 -88718 -80249
17286 -80249 -101579 -64164 -31582 13484 13609 -30348 -48663 -145436 -87245 8014 -104065 -158613
17274 -158613 -110060 -53513 -167453 -55944 80826 60495 -47619 -7336 -10653 -54866 -60056
17263 -60056 -10201 55099 37333 -73550 -127566 -10242 15912 18918 26434 -7527 -19172 -12513
17251 -12513 7052 -35754 -65100 -67018 -35704 -110495 -313778 -332304 -131585 -19626 -37780
17240 -37780 -134318 -45713 24711 -26127 -42872 -140405 -127508 53201 41083 -43811 -47733 -117010
17228 -117010 -110220 -88736 -138001 -174921 -82311 563 -54718 -64040 -128842 -119789 -47174 39952
17216 39952 -35824 -136989 -202685 -206028 -186540 -139470 -97358 -118860 -68490 -33377 97235
17205 97235 25804 -158935 -124150 -44034 57377 90692 23328 -56657 -85150 -165899 -379710
17194 -379710 -401156 -495925 -434553 -300239 -283545 -276836 -236819 -246755 -227213 -148013 -34563
17183 -34563 -10259 24450 20844 -58360 -117531 -225280 -276610 -207474 -72563 98997 122224
17172 122224 133985 28221 124389 227759 237138 182309 -15736 -96758 -65279 88274 246027
17161 246027 397263 304796 177553 168847 128669 91867 -24761 -109697 -49097 83051 46754
17150 46754 -23383 2811 1383 -55380 -124286 -91107 -104292 -164380 -152127 -78952 -96629 -159478
17138 -159478 -220782 -80062 29020 -36861 -62315 -24921 652 42707 35 27178 58936
17127 58936 87766 161582 95117 30827 -141088 -50173 -17609 -121038 -130319 -142612 -76141
17116 -76141 -81741 -117685 -77380 -30737 76085 68048 791 26742 118308 112537 80548 -40191
17104 -40191 24252 -58224 -180870 -36092 136255 120972 99658 -4284 -92337 -56519 -10419
17093 -10419 12206 20972 128277 56397 132788 291186 229937 152126 19167 -79337 -121703
17082 -121703 -73998 -51447 -11950 -24178 -96123 -153469 -78527 -56094 -41724 -43067 -97258 -34053
17070 -34053 20738 14308 50975 81636 117493 112976 12896 -51774 -48306 38478 -13275 -43088
17058 -43088 -136769 -279307 -293996 -269410 -248703 -143185 -87640 4493 -97127 -129812 -81618
17047 -81618 -86161 10796 177654 174604 173321 18947 6025 -20169 -73426 22914 -5037 9902
17035 9902 26917 -32847 -87759 -47626 -122525 -31844 71166 153938 124283 30454 14779 -42402
17023 -42402 -31518 163080 301459 234600 209298 243710 87139 9368 -105628 -167655 -279857
17012 -279857 -201301 -76905 -4908 -109605 -90453 -128611 -154058 -63438 25997 48124 29615
17001 29615 44355 67473 58681 38619 150349 164054 204227 125095 101011 166853 224477 165487
16989 165487 52099 80388 78836 70529 -68157 -134377 -68152 -28342 -112653 -74388 -100622
16978 -100622 -31444 7386 34910 -12938 -114199 -196734 -318440 -392091 -311361 -138772 -82052
16967 -82052 -124999 -8150 -5074 -94757 -30093 44455 -3820 -23652 -38916 63366 91029
16956 91029 76564 69804 6881 -112338 -61481 102628 148707 30917 -8726 44193 78280
16945 78280 6581 40683 42151 31867 -34635 -144816 -181889 -265639 -235537 -230780 -154204 -146690
16933 -146690 -92047 -161312 -15379 124517 66709 -19095 -119399 -99912 -112802 -32158 -48754
16922 -48754 -41728 -24717 23600 58987 52031 -160638 -245280 -145681 -111588 -140663 -53793 5324
16910 5324 9272 -90079 -179139 -195066 -216059 -165652 -60857 -151177 -156690 -11682 46377 45672
16898 45672 -97449 -141394 -18709 44570 53633 40470 146026 144251 72261 -76506 10255
16887 10255 168203 232558 155257 36437 41924 29402 -25638 4467 106287 74934 410
16876 410 42925 70250 19895 61429 67443 63446 174732 150957 13596 -7893 35012 627
16864 627 69014 -4475 41159 159505 243267 244234 123283 37019 107033 199809 100878 -68147
16852 -68147 -187896 -92272 43646 -32399 -46738 39188 145669 154378 75357 115762 109328
16841 109328 -24628 -109629 -124485 -205866 -230645 -113399 -169562 -289074 -229196 -259916 -290582
16830 -290582 -275035 -234110 -143057 -127394 -127387 -5368 -110041 -65878 8772 -40367 -79999 -86813
16818 -86813 -211139 -146451 -59884 58857 34928 8558 81903 63205 14274 -57073 -139195
16807 -139195 -73536 8089 -54916 -75223 -61135 -107268 -86656 57828 55395 26996 -77265
16796 -77265 -57727 84740 146700 49458 -66163 15682 27210 26860 1104 -71503 -101123 -109978
16784 -109978 -57473 -1530 108095 139859 32969 30146 1012 -54796 -86414 -65974 64392
16773 64392 26798 -70495 -29338 43356 -22633 55342 -39828 -89552 -31917 -3751 72430 75720
16761 75720 126381 48729 4100 -66875 -45519 90517 111195 34708 49368 254 -22901
16750 -22901 74685 45946 153755 221547 279402 177282 62866 -3903 -25228 -51196 31404
16739 31404 24381 84305 49509 87838 68757 -35680 58820 153047 186615 92696 20226 158001
16727 158001 202433 105555 50529 124109 155765 19557 29010 -152897 -134470 -84433 -193014
16716 -193014 -221887 -114836 -21061 192873 40963 12559 -11054 -83143 -287113 -290953 -153821
16705 -153821 -151210 -153090 -117551 -128072 -79621 -15523 -83092 -94135 -135835 -185065 -103686 -99188
16693 -99188 -131964 55650 49942 -50914 15726 55053 48948 2711 72757 117574 46447 -8390
16681 -8390 40719 84445 102346 246404 215469 168350 147812 153054 10387 -17343 51746 149579
16669 149579 122615 22932 -13127 -12778 54067 7236 -43279 -162535 -299371 -316737 -312639 -231925
16657 -231925 -78599 -4465 78276 32965 -116485 -126236 -22233 -127885 -76722 -68074 26497
16646 26497 8679 -128180 -213751 -29383 -85854 -130782 -208300 -148035 -158314 -159045 -54232
16635 -54232 40055 -46081 -45188 90493 147687 75639 13404 40564 -62032 -234287 -67733
16624 -67733 100146 138009 165729 56711 -84999 -182199 -281630 -195896 -22151 -50351 -132118
16613 -132118 -148893 -134870 -73559 -117664 -112229 -70141 -141542 -219331 -275314 -364992 -408876 -126919
16601 -126919 34214 -67573 -128505 -186517 -105529 -93687 -55999 -78025 8296 -62729 7943
16590 7943 80288 10841 -75979 -100664 -172327 -59206 70972 68941 58528 -158765 -241825
16579 -241825 -205023 -63178 36859 41247 6149 -43831 -116375 -113240 -44894 -50082 490 51128
16567 51128 75330 110799 61665 -39722 -32608 -47617 1017 24232 120320 89160 91003 91371
16555 91371 70844 4096 200780 279292 314501 191755 57962 146972 165434 164468 76176
16544 76176 168668 227468 108203 76350 100616 70674 6180 -46194 -54663 -21793 -29734 -699
16532 -699 -38001 -13375 16293 -47333 -164303 -246803 -167788 -137984 -122056 -195419 -171230 -198804
16520 -198804 -196178 -98175 3413 -42121 -65326 -145859 -249575 -211437 -244720 -269279 -227020
16509 -227020 -106350 -154008 -265036 -220312 -177656 -228988 -193355 -39800 -41732 33215 13360
16498 13360 24760 46955 77640 58278 76086 -50370 -135178 -103144 -84976 9841 35620
16487 35620 104469 64347 -32872 -18843 -71448 -78389 -81179 -76317 -112689 -174437 -194781 -91385
16475 -91385 -21218 32004 -26395 -202637 -126270 -62117 -14495 60639 71110 -12766 -37255
16464 -37255 5399 78298 55654 132685 215880 167891 123802 145015 25231 7629 68988
16453 68988 38134 48560 -30089 -183957 -173825 -74398 -49839 -28063 89745 134424 78742
16442 78742 -70473 -154407 -99911 -70307 48876 104048 81734 132770 137736 72542 41654
16431 41654 36004 71027 55411 76578 8762 21358 20138 -70022 -26298 29594 45609 82903
16419 82903 11901 -29615 -122988 -126447 -62269 26207 -11852 -173369 -62747 86601 -9795
16408 -9795 -36210 -5478 -49702 -128686 -131909 -163537 -30338 31606 -87620 -142699 14673
16397 14673 96640 60222 56308 148295 55953 21535 2129 -55430 -3762 90865 -57243 -150127
16385 -150127 -126980 -204604 -79727 49725 119207 109831 -22606 -200906 -268812 -215762 -153809
16374 -153809 -101441 -70900 -104267 -123231 -33765 50951 77777 -13427 61961 64687 4543 -69447
16362 -69447 -12736 6298 67386 -22532 22760 172476 170840 93322 -7727 26592 57419
16351 57419 132443 239508 253515 94320 51409 72233 -13642 31573 21078 -125059 -167967
16340 -167967 -185645 -211874 -147932 -146087 -104309 19944 74521 138413 210935 93049 -37173
16329 -37173 17911 64521 133224 227914 242843 35307 -35145 -82748 -191010 -157910 -113404
16318 -113404 -212156 10278 202333 77466 47243 79750 89892 16482 58445 -76111 -199921
16307 -199921 -182925 -137330 -54818 -57020 -159237 -137886 16395 89447 108547 76319 70830
16296 70830 109087 173509 98027 2250 -50811 23774 119610 123405 62297 1466 -37863 -119984
16284 -119984 -111599 -88404 -60415 -125478 -41107 -4108 -89376 -61580 67109 83442 17266
16273 17266 44432 28497 15826 -15885 12086 -25044 44227 107417 51146 -324 14057 51156
16261 51156 -50719 -119085 -65105 -12822 -30358 -58432 -208654 -313060 -217272 -176545 -232182
16250 -232182 -131087 -63907 -81553 -92362 -2020 -78348 -221573 -234186 -115602 -88823 -8732
16239 -8732 62642 30337 45798 20574 51913 63866 43072 -13625 -60131 -63182 53626 50137
16227 50137 -24292 -174600 -87899 -74136 -5609 124422 173625 107107 60817 46620 -47000
16216 -47000 -102790 -135358 -121102 -46344 -46698 -86082 -133834 -185856 -251826 -169353 -7614 -5751
16204 -5751 -102589 -175938 -176009 -161941 -106448 -39352 -117591 -189261 -91984 -148656 -144522 -67464 -22445
16191 -22445 -55709 -21217 25901 -57207 -102845 -82929 -11327 -153728 -248285 -121942 -195610
16180 -195610 -66692 46557 63820 -37433 -106815 -88870 -143124 -167762 -136203 -90401 -140401
16169 -140401 -225249 -200006 -171149 -151923 -116066 -61891 -26126 37742 7603 97426 237643
16158 237643 122570 -36014 -78575 101269 110841 92678 101689 83056 -47734 5536 -74006
16147 -74006 -186203 -50918 45798 20691 4256 76180 26117 -79384 -229410 -226588 -117384
16136 -117384 -72618 -6067 57164 54421 -5817 -50059 -18671 39105 67544 197548 231833
16125 231833 219303 215837 160041 148007 17132 -125800 -146314 -129244 -27638 -11715 -83541
16114 -83541 -182069 -189254 -20608 -72211 -61000 -66556 -34267 150435 205630 158022 -71905
16103 -71905 -171893 -188324 -42914 -29224 -87046 -4517 -36754 -27234 -8550 3515 54473 -55114
16091 -55114 -62251 37821 146255 276856 332640 305410 176488 70431 65016 155878 289645
16080 289645 337351 362166 281227 202324 171736 147063 102283 121484 178173 200877 43797
16069 43797 -93920 -144391 -36621 -62234 -65160 -109616 -15139 132780 130723 118035 167393
16058 167393 269941 110133 -105466 -141114 -40824 6061 -47183 40138 149587 129313
16048 129313 9421 -45541 -102240 -122493 -70781 -78156 -56125 -108492 -61637 -47705 -27851
16037 -27851 46988 103672 -29840 -137622 -67792 -1761 -1531 -66192 1832 152817 17327
16026 17327 12402 68741 51864 -39730 7339 -112520 -101864 33371 26360 31998 -5625 -80628
16014 -80628 -75872 -63911 -51914 -81273 -7221 110539 114464 194418 131708 -4638 -47563 64260
16002 64260 -25523 58215 196296 148715 -7042 -167404 -280356 -248797 -185923 -44056 -64830
15991 -64830 -32633 -64809 -65023 -30190 -3053 -55677 68891 127453 101496 136857 32721 -54401
15979 -54401 -124906 -81155 -27810 -46794 2178 -81099 -236548 -223416 -201150 -75626 76135
15968 76135 153558 102124 41499 76763 94086 73320 -6782 -167789 -355203 -261032 -122897
15957 -122897 -52112 69975 98284 69134 41572 -32629 36653 19349 86401 49803 59778
15946 59778 80283 -38201 -51917 16719 58532 57599 64387 1945 -127256 -84519 13333 39078
15934 39078 26352 80207 77924 31538 136542 83104 54092 -16271 -72082 -62031 33373 -11709
15922 -11709 -165406 -208519 -187116 -70522 -18337 19065 144735 102608 58519 12398 3928
15911 3928 -28519 -138941 -146766 -180365 -78868 -144641 -41667 46994 9303 115781 58731
15900 58731 28586 -1896 -47944 71895 36237 -23241 11490 -51736 -40170 -61505 -67520 -86876
15888 -86876 -74222 -20393 -54464 -123330 -209468 -194483 -208848 -158854 -130456 -265130 -184344
15877 -184344 -112643 -230196 -230104 -121998 -61587 -1406 -20203 -90706 -69193 -57538 -4943 -74254
15865 -74254 60188 131376 30911 49838 59991 198008 88104 -15171 -25760 26663 60473
15854 60473 41820 48334 -51172 -183959 -322950 -417399 -400951 -325064 -249374 -220693 -130682
15843 -130682 -130885 -76765 -34919 -51572 19120 147662 10366 -36181 8823 152275 105866
15832 105866 114312 10791 10264 200140 155264 23048 -39013 -13572 -17930 6551 100626 86291
15820 86291 -19201 -83696 -44814 -27230 -33576 -70324 -89409 -122306 -99104 -223255 -75135
15809 -75135 -34770 -159504 -185477 -179619 -164002 -37811 -19094 -5001 -111093 -97243 -30807
15798 -30807 93620 27511 -134456 -115122 -7878 18411 74486 135324 92882 -106371 -239935
15787 -239935 -286566 -245424 -186237 -56747 151988 58209 -183362 -211132 -175311 -49250 -69146
15776 -69146 -211257 -204264 -140404 -168753 -22047 96216 74608 61147 51547 71117 -42913
15765 -42913 129600 217389 111286 -1090 -13736 27971 97749 32151 76999 98234 182634
15754 182634 238853 291109 183295 202225 358888 341244 368645 377026 295692 269458 324606
15743 324606 379070 368626 120911 -71637 -74727 105880 224689 253395 239134 149321 23899
15732 23899 -136371 -86652 -89215 -68733 2479 66427 75363 56174 780 100361 165479 158062
15720 158062 77790 66482 59344 86758 183550 206897 49828 -116782 -161196 -106528 -8969
15709 -8969 131266 48867 -79249 -104282 -120209 -5653 82889 41618 96023 198588 78600
15698 78600 -84475 10435 35859 -84242 -219639 -206362 -75595 -111368 -42778 105608 101157
15687 101157 -32700 -97101 -132628 -27326 50906 68886 15103 -164616 -179150 -139664 -40483
15676 -40483 -60907 -74948 -59527 -29251 -11684 47543 45032 -50686 -244114 -215590 -87239
15665 -87239 52672 -38283 -23193 -4988 -54620 -87366 -27494 -70597 -69848 -88919 -18307 18062
15653 18062 7731 -40075 -81304 -178057 -217130 -118566 -152560 -157298 -106041 -56615 -175998 -211677
15641 -211677 -67669 -34864 -83209 -73336 -68994 37312 48420 -51499 -157285 -202104 -172094
15630 -172094 -110460 -58987 -37926 78630 136658 74603 162481 198204 172666 100506 81962
15619 81962 182131 177495 228460 73942 -7577 15208 33024 -9117 1943 -17992 6868
15608 6868 40426 138877 114409 25827 8718 -27450 -25901 -92502 55663 86955 118555 79231
15596 79231 68729 172741 137437 31051 -66028 -177305 -192582 -252234 -229123 -230468 -168544
15585 -168544 -188003 -107167 22575 42878 5209 169063 216966 129366 152346 156495 210659
15574 210659 157015 15096 -108167 -57735 -4603 -62642 -46225 -59882 58632 77437 24337
15563 24337 -18321 -52389 -86417 -126951 -76896 1606 37086 64737 2600 -62489 -87366 -11299
15551 -11299 -49819 -73801 -89492 -142077 -195528 -134910 -100550 -41187 131482 180428 25635
15540 25635 26468 117700 180131 163896 77707 39495 -72942 -137491 -209632 -186507 -132174 -168779
15528 -168779 -169933 -177217 -192468 -233465 -215811 -132113 -60292 39295 137209 96145 125299 111625
15516 111625 66187 31820 86297 45690 125407 129963 88089 49941 -23513 21675 37039 73167
15504 73167 17978 -11447 -21625 31772 81413 -27744 -14703 142428 301786 254408 122858
15493 122858 253054 240528 132301 81705 -11354 -17008 -78571 -142218 -78960 -25783 -16582
15482 -16582 -21385 -91363 -138801 -136662 -39744 -85921 -95131 -88512 -51002 -187542 -161451 -26898
15470 -26898 -16216 -4685 -19512 49751 116196 83409 -105817 -148150 -40211 -8063 25586
15459 25586 -13894 -124149 -65257 -23679 -101802 -201233 -153692 -131888 -80065 -34110 -19902
15448 -19902 -93299 -126216 -192007 -242137 -298343 -418984 -417636 -405263 -346135 -175397 -76828
15437 -76828 -63426 80706 43854 -21100 -110231 -119906 -112305 -65531 -109156 -172982 -169845 -168623
15425 -168623 -59713 -92538 -26847 81275 152991 132800 67572 16355 56815 -45487 -161880
15414 -161880 -130808 -22191 169549 186229 17641 -40249 -127046 36540 138378 179779
15404 179779 207058 141190 13425 -35643 86881 188283 172931 281200 173234 44322
15394 44322 -32309 90703 173815 -8087 23310 153512 19235 -22957 163781 129419 30753
15383 30753 -228432 -269388 -127009 -19266 -54810 -133223 -156030 -119953 -2894 -117711 -182796
15372 -182796 -128142 -159561 -147595 -152401 -137852 -130436 -4175 166759 219838 113673 130834
15361 130834 126373 -41996 44967 195255 123985 2255 -1899 -36077 27547 85131 -4510
15350 -4510 33756 118739 27774 -5644 75201 -35111 -217517 -138060 -41988 -32965 8492 145865
15338 145865 45075 -462 127900 190310 180504 147602 93478 203938 227979 173220 72236
15327 72236 88299 65750 42093 42126 153439 299090 255095 184914 124541 68439 61854 -58229
15315 -58229 -144904 -51768 64215 53530 66922 40203 70621 29411 93782 36873 84935
15304 84935 20962 -57266 -95299 -133185 -120219 -100514 -292652 -263725 -54711 -68932 -267508
15293 -267508 -215299 -23938 -92665 -180465 -114181 -80544 -34121 -51339 -18843 13022 55304
15282 55304 -25120 -19056 39283 6392 -124539 -162509 -62170 -38086 30510 -35548 46687
15271 46687 8817 -92418 -87356 -114292 -22266 157543 135463 68539 -3356 -98321 -41671
15260 -41671 82000 106761 20582 81866 127488 62486 -58139 -123086 -92249 -151156 -208511
15249 -208511 -126847 -179511 -230742 -51687 14637 -123489 -153043 -80972 19189 132001 8568
15238 8568 -85913 -34128 -25503 -63195 -101666 -134346 -144141 -136540 -116834 -27525 12607 -19157
15226 -19157 -23797 68562 98913 54206 46945 -89843 -142930 -130260 -134255 -102424 -157086 -258147
15214 -258147 -151234 -38506 -122046 -250761 -193058 -99130 -187795 -141528 -115387 -185461 -167511
15203 -167511 -69023 -92812 -77111 -592 76145 99011 71631 94651 83819 82528 55909 -17483
15191 -17483 -23822 -24960 -41779 3750 -33882 -48261 60917 46661 -33645 63042 81739 20046
15179 20046 -84760 38752 9785 48697 12727 -55349 -120913 -13736 82828 19195 10430
15168 10430 37694 106744 29582 36821 8678 -33925 -41004 47853 42637 102632 335393 429904
15156 429904 370183 97683 1073 120893 171091 78914 -28231 -35185 -114184 -74917 -81186
15145 -81186 -88356 64804 128072 158630 128985 95818 -31301 -113248 -19531 -30699 47402
15134 47402 -37973 -153792 -62842 -27053 10528 13394 -94675 -188519 -117080 -38370 30809
15123 30809 -7038 -23234 -27009 -37039 -34894 -13153 -91381 -53458 -132275 -139562 -150859 -132786
15111 -132786 -25582 -88839 -121698 -179303 -220786 -198780 -45095 -122797 -102398 -41330 -20653
15100 -20653 1933 -50125 51285 137201 87394 70160 -13476 -26961 -10959 12819 -134733
15089 -134733 -117345 99070 95213 13099 66893 -77856 -156758 -150399 -119892 -220579 -209710
15078 -209710 -6003 108877 138083 286093 237564 186210 189191 139877 42865 53606 -11700
15067 -11700 -204470 -269630 -319325 -271544 -184898 -158217 -272501 -73521 179511 214721 185481
15056 185481 80348 -6589 32695 32922 140344 223548 236662 145954 64678 67415 26239 -42889
15044 -42889 -31003 45244 134956 -117571 -196724 -225868 -132989 -85105 -123007 -266023 -208024
15033 -208024 -182633 -203104 -191318 -76596 -4199 -66965 -49532 -41651 -87443 -89240 -174570 -177822
15021 -177822 -132660 -153739 -202876 -159820 -117115 15776 11319 -15062 -88283 -77977 -24050
15010 -24050 19725 50047 51033 -48553 -104351 27337 34739 -34135 65085 125798 92654 120412
14998 120412 58471 -1718 96065 165916 281449 379296 178371 130721 89803 59361 19021
14987 19021 87861 207065 289480 236935 181606 33560 -102500 -161098 -164245 -11718 27866
14976 27866 92192 89245 70705 59459 -8146 -74767 -70029 1617 47821 154282 81393 136474
14964 136474 97405 48942 69319 50340 4894 41611 64596 -30385 -24851 8346 -13710 6225
14952 6225 98650 162047 206879 191292 180115 72135 91836 82166 -67497 -220934 -241652
14941 -241652 -118291 -16425 -98643 -111195 -97001 -40662 -1419 -65347 -18578 35361 -37908
14930 -37908 -47813 46016 -15006 -50226 -67871 -116065 -158836 -142721 -6914 10307 -3108 -17231
14918 -17231 -11408 57862 49103 78946 48275 -9472 66364 109707 116656 16280 -45253 -126779
14906 -126779 18577 37464 44845 24664 89383 173409 233832 205471 67019 -49685 -4558
14895 -4558 -31436 -129559 -147497 -155014 -131248 -108440 2375 -30037 -41967 114638 128849 71147
14883 71147 90998 36568 46964 7537 -117242 -64915 20673 2997 -2381 83306 65182 -45644
14871 -45644 -50188 27284 95161 134116 34104 72007 82208 128488 151869 174129 86745 59247
14859 59247 -83651 -112283 -190632 -150933 81560 133796 100615 41348 -15306 -40437 -90721
14848 -90721 -38846 66962 -239 -60269 -13305 -64656 -46762 -159152 -111437 -139096 -108390
14837 -108390 51571 135154 179775 85307 -41099 -98905 -103422 -113117 -53610 -15341 -20815 -60038
14825 -60038 22843 108862 15021 -96135 -143936 -95241 -78905 -76007 -84767 -85622 188 116628
14813 116628 86887 76178 78618 2840 -8781 2104 1786 125948 99504 -57358 -175285
14802 -175285 -187124 -201984 -93296 -1462 -51016 -140856 -72376 -3297 -48215 35150 -2402
14791 -2402 -36063 28770 143436 157304 197982 121579 -30271 -58140 17697 33527 52408
14780 52408 189688 116168 55932 -40007 -52523 -37472 -32096 -88178 -138906 -289350 -260784
14769 -260784 -147963 -102860 -102219 1776 120704 29910 1206 -58997 -114462 -89521 -149244
14758 -149244 -268359 -324090 -282810 -347766 -218481 -90414 -193323 -275668 -198322 -68057
14748 -68057 -4934 26244 -102614 -107114 -6208 36215 -40095 -46439 -248021 -194974 43419
14737 43419 136228 71220 35028 -129201 -157594 -74544 -71913 -30488 65746 167585 110515
14726 110515 125416 172803 39104 -16737 28798 -26275 -23640 -20605 -10243 31144 86527 65871
14714 65871 -83119 -250236 -258641 -192273 -170148 -204694 -170316 -206225 -168804 -89820 -72765
14703 -72765 -79515 -129656 -122120 -52020 98160 210466 264802 256023 186755 71525 79696 124404
14691 124404 203563 7699 -140549 -123097 32213 6231 -73536 -60477 23184 120448 161845
14680 161845 151195 156654 79743 86253 167651 147542 81397 16791 -30597 -979 -99696 -147588
14668 -147588 -205959 -186260 27365 210322 257942 204846 116593 143842 127751 27985 53462
14657 53462 -16940 -59964 128634 131313 56933 59927 -113914 -223560 -71563 81215 53622
14646 53622 6940 -6229 -89156 -175884 -200021 -160648 -99470 29874 173995 120615 53909
14635 53909 84921 149485 113226 57328 -3922 -51810 -131833 -283323 -171864 -88882 22197
14624 22197 160396 255394 227413 179417 142165 132696 89823 1046 -35203 -119755 -63176 10563
14612 10563 98864 85057 61871 61774 14991 -17069 -27647 -52711 -184646 -96731 40447 2851
14600 2851 -184254 -170386 -162634 -61382 52280 107848 110854 3059 -100839 53021 87749
14589 87749 10208 -95327 -82310 -60500 -111834 -122290 -45176 4207 4902 -26211 126251 45697
14577 45697 -121255 -99536 80030 -68887 -212619 -125096 -121762 51670 24621 -16584 -97204
14566 -97204 -12282 80669 146044 -19958 -118639 -53348 -71851 -72326 -25783 -99844 -42865 -17873
14554 -17873 -20338 -75986 -52424 4316 41103 -66293 -166030 -126424 -132848 -40261 -49552 -51370
14542 -51370 -16822 1865 107917 177536 97970 62600 -83231 -80595 -79030 -105933 14978
14531 14978 25546 28069 152298 212070 168487 110685 96053 8162 -97198 -214361 -155785
14520 -155785 -55765 -237 -52461 -95190 -11984 120882 175684 146873 -26967 -155005 -227224
14509 -227224 -148656 -238290 -152638 -90890 -91955 -58732 -84707 -34815 35091 70208 -16286 -197496
14497 -197496 -220748 -117031 34600 -35752 -24058 -72939 30394 147113 283372 287435 185005
14486 185005 133005 143099 48022 -65394 -170181 -85749 20536 127627 235767 193861
14476 193861 119648 42441 -40346 -83274 -179015 -176523 -131356 -62425 -63483 -182339 -194403 -112948
14464 -112948 -10721 -11547 4988 -27300 -120008 -29324 110116 173724 145308 173220 216015
14453 216015 279798 204993 246598 201713 80219 96230 -38893 -83539 -51072 -25481 -40694
14442 -40694 -209759 -235611 -155589 -108705 -165016 -123112 -162678 -182043 -177845 -191665 -162448 -52829
14430 -52829 48255 -46980 -137687 -130845 -191887 -152159 -33534 -34971 8475 17464 -24491 115296
14418 115296 81845 31086 -46075 -169844 -227907 -182838 -138519 -106585 -11984 11999 9218
14407 9218 88929 140223 38191 -61193 1132 35916 148588 298839 193750 106704 76865
14396 76865 59391 -3459 -32571 49887 30664 -60189 -53036 58119 155789 21951 -47630
14385 -47630 -127042 -201921 -147359 -138259 -202163 -1394 -5471 -162767 -195504 -115894 -20396 -17709
14373 -17709 43913 175248 190581 187324 143647 132035 117473 181552 87247 -28192 49920
14362 49920 155719 179225 160190 56486 -85721 -116394 -38018 132355 63696 36138 70903
14351 70903 77582 -33155 402 57899 138280 153855 81145 -4083 -10745 -15331 175891 198159
14339 198159 72642 -42380 -179403 -143178 -106593 -55002 -101536 -124248 -13321 78422 53313
14328 53313 -27509 -143847 -175826 -218106 -179759 -57129 23989 137572 163889 60656 -83336
14317 -83336 -39024 481 122201 196777 145899 43830 -17324 -136491 -199541 -94392 38600
14306 38600 -10887 46372 179793 87087 -49166 -138846 -71269 41631 68364 17690 26908
14295 26908 -43778 108556 70427 30148 39764 157256 99441 -30805 58568 110915 18256
14284 18256 21310 -24858 -80201 67640 -54165 -150339 -201937 -279659 -271183 -98734 -30351
14273 -30351 -63383 -158852 -229329 -141855 -8600 94313 112306 45303 11463 32172 -76288
14262 -76288 -96939 -91976 -79164 -51876 -52600 -70251 -100829 -245071 -269197 -59514 -47641 -35102
14250 -35102 17163 67410 43512 34346 177502 155750 60766 17136 58421 92085 141572 51031
14238 51031 -86062 -97359 -90292 -196621 -120660 19804 -59754 -213516 -173196 -132676 -32979
14227 -32979 164415 83994 -79815 -97422 -90487 1817 122127 215721 146777 -42319 5484
14216 5484 163820 142523 56409 34454 -50369 -49442 -44927 -23657 101401 121282 57025 1465
14204 1465 33276 -21790 43695 -22812 -35905 30048 137379 184650 233955 189043 203167 248798
14192 248798 191586 167355 89986 66011 -58708 52942 150323 98270 -87828 -109816 89934
14181 89934 134260 134167 161931 124069 -76972 -56967 -373 -97156 -117233 -110 -77050 -109815
14169 -109815 -126926 -170582 -221202 -231152 -226943 -231415 -77388 96011 11383 -32859 35246 -72044
14157 -72044 -139009 -55943 19727 53322 -85797 -188030 -110169 -67160 -78472 -161599 -135076
14146 -135076 -78476 -48987 -94483 -196092 -261790 -314765 -222499 33229 7645 -66822 -150770
14135 -150770 -53323 -4920 -126001 -140107 -74858 76239 155188 63091 -59058 -40546 -118586
14124 -118586 -175090 -188221 -50028 38873 58092 79725 138793 30968 -33211 -82194 -91429
14113 -91429 -38332 -47766 -7358 143454 136561 47455 -36585 -45998 -9319 17719 -15162 -96636
14101 -96636 -123782 -62805 77882 82562 71123 79196 -19454 -136702 -78810 -17682 103242
14090 103242 185010 187259 138842 61562 50871 83050 57669 59974 130433 104974 121088 123234
14078 123234 -16707 -63849 44919 42075 -16902 -22576 36577 -34127 -132215 -93456 -104055
14067 -104055 -171892 -7210 87419 99633 63218 -15673 3985 36302 67497 -38908 -56815
14056 -56815 13845 74765 85261 42798 -2379 1471 -29968 -59159 -29256 -9912 -4056 -29393
14044 -29393 4994 124961 122473 -47124 -121934 -95546 -61074 -18857 -114567 -152950 -41539
14033 -41539 118377 164484 61044 128179 82230 38377 35485 73287 144048 141653 69295 110980
14021 110980 116274 146010 128002 27816 67214 -2845 36389 -29407 -23140 -4635 11064 -76248
14009 -76248 -21315 36336 -15686 -83734 -91864 -223349 -221418 -69767 -27786 -45891 51460 -10621
13997 -10621 -51633 -202070 -168061 -54657 -36770 -112918 -109188 21655 10988 7570 -13263
13986 -13263 -28871 4746 69681 69084 115099 184659 148379 27289 -26881 4088 -19019 -17093
13974 -17093 -63738 -120323 -153412 -79405 -94406 -67076 -105499 -132213 -221337 -127287 3724
13963 3724 -35434 7557 23338 86178 -772 -50071 -5912 117743 171044 296702 293547 218390
13951 218390 293373 240945 65152 -29665 -109813 -141463 -135780 -79716 -159307 -141391 -4885
13940 -4885 86947 -26632 -99624 -125794 -54619 -93696 33985 58029 125878 147169 73152
13929 73152 26561 57825 46123 11661 -23016 78833 86290 32880 14979 55395 80804 125199
13917 125199 134587 159844 41950 136130 166539 47883 43069 67604 101621 12329 -91433
13906 -91433 -190429 -91721 93776 121744 189409 119577 76620 -9757 -47447 -42511 26234 -14109
13894 -14109 10409 68741 146752 98319 -89433 -126474 -170835 -262184 -177129 -35644 -9428
13883 -9428 75702 105034 46799 -46534 -44347 -208868 -196490 -56556 -113562 -88513 4222 27983
13871 27983 44051 151136 391798 418611 269023 73115 57976 25755 14829 21825 -143278
13860 -143278 -246401 -118181 -44755 35361 77617 133852 74041 149377 182607 5984 -162488
13849 -162488 -47616 28811 20410 -120477 -255475 -191280 -20489 109587 140459 68375 -24066
13838 -24066 154756 165586 208413 289030 234486 165940 68979 -83510 -169755 -235205 -222543
13827 -222543 -82979 6447 20810 -17716 -95792 -41218 67852 113275 20223 124518 78809
13816 78809 4167 -21521 -48895 76759 85786 94752 106925 -55152 -54372 -80418 -39340 -30945
13804 -30945 -48562 -66067 -30568 47751 72820 143159 182296 207672 212538 129671 33718 51616
13792 51616 98189 75727 78744 135646 155390 83603 37436 -185468 -121360 28855 12632
13781 12632 -40004 12468 106925 145162 67326 -22837 -7353 -13740 -72099 -236064 -241417 -156468
13769 -156468 -124567 -31738 1251 -13351 -49839 -73196 -179526 -161423 -105682 -100774 -184123
13758 -184123 -285896 -253070 -132659 -68859 7719 -9973 -113208 -127367 -2375 89704 72156
13747 72156 -105167 -144164 40043 135621 101321 -7957 -173548 -193509 -69357 -35823 -152939
13736 -152939 -146518 -71164 4057 33711 -29465 -138671 -105919 -79758 -142823 -133808 -70617 -157884
13724 -157884 -255707 -189392 -89787 -31114 -39877 -93840 -121554 -124735 -66302 57774 13868 -33497
13712 -33497 -113808 -137544 -84635 -40399 46703 -18077 -51358 3235 9068 -33386 -103069 -8070
13700 -8070 141650 173799 106658 85830 180400 221135 185863 40720 -11412 114644 571
13689 571 -171089 30656 233965 157111 120534 174450 213103 124213 62817 54551 -20605 3105
13677 3105 13584 85752 147955 41718 33028 -28226 -137715 -90399 24138 59385 -33359
13666 -33359 112612 232328 192937 240073 162273 106628 72779 7785 -93813 -183143 -203651
13655 -203651 -75787 151746 212801 142325 31541 209 -70132 -142214 -132875 -47756 90377
13644 90377 138595 80100 118601 11402 -49334 -23539 -136344 -5544 -17076 -112570 -33631
13633 -33631 71962 7147 -80156 -58668 -48583 -57457 -19241 5265 10538 -40048 -86633 -47116
13621 -47116 109719 112515 85122 108858 86592 -93963 -143830 -100442 -220494 -287146 -121423
13610 -121423 5996 -6557 -24468 3821 13007 -34154 -86836 -88441 -92853 -94995 -107513 -12264
13598 -12264 23575 -102628 -115001 -92331 -184188 -204777 -107925 -105888 -66322 -66584 27214 65909
13586 65909 35061 66645 -12662 149131 116536 -43278 -2 75499 15182 -97589 -239018
13575 -239018 -262419 -220860 -145851 -72900 -129268 -61990 -90454 -73249 10616 -43295 -113835
13564 -113835 -120838 12584 6460 9959 84848 67667 47208 44336 -33481 -51327 -15333 -66598
13552 -66598 61814 93106 -4324 -61508 -161393 -138707 -130485 -68483 -33444 -49061 -171916
13541 -171916 -123064 24489 -141707 -175842 -103555 -165930 -287099 -221247 -216463 -268299 -233278
13530 -233278 -113483 -68997 -88103 -117887 -271519 -253019 -214927 -90365 5733 3598 64812
13519 64812 129942 136244 101605 -36934 -220432 -249610 -153539 -197028 -123691 1143 150255
13508 150255 157547 202774 143785 12240 17279 57695 70958 56837 1418 58694 45991 64173
13496 64173 80826 148356 173059 241968 287715 154360 23171 58464 35964 -9134 71264
13485 71264 95799 115035 -414 -150296 -187289 -218633 -276265 -295722 -195963 -68178 81315
13474 81315 126221 152827 150463 63709 93329 113769 120231 69053 -11148 -56529 17468 -38982
13462 -38982 -140223 -129960 -38452 57353 -45621 26529 178182 131302 27898 28792 91580
13451 91580 176130 168098 169091 205043 198105 54189 -33726 -37906 -37903 113147 198781 80623 78256
13438 78256 44019 -51037 20327 203754 236394 124513 -42875 -43997 103935 159829 191991
13427 191991 118471 1561 -100792 -86730 -22796 -91994 -51656 -54455 -42743 -166468 -166513 -72635
13415 -72635 -53455 -19761 -540 5002 40872 -61144 46133 44019 -53022 -27616 20594 -27505
13403 -27505 31143 107875 101552 97608 81541 122143 33414 -117903 -8295 61398 81323 111433
13391 111433 -26370 -90404 94258 140876 176474 139655 48975 99803 124362 124682 145768
13380 145768 33065 -75180 -50426 -29615 -12990 -8910 841 -107928 -159862 -147882 -211275
13369 -211275 -125321 -81436 -71406 -2076 54036 -43206 -112184 -127102 -181312 -227771 -208683
13358 -208683 -142664 -3014 -11963 -106100 -33601 -56331 -136840 -139878 4580 72461 57511
13347 57511 -46731 -4880 94011 160573 21738 -68441 -139465 -78181 21233 92675 97906
13336 97906 102384 25297 1527 -130097 -143884 -48389 22854 71415 132704 167688 60393
13325 60393 2846 542 46547 65747 96078 -88632 -128546 -100768 -10045 22491 104141 179093
13313 179093 143367 179667 216306 115582 49538 -54690 18605 -23774 -49248 -151736 -196058
13302 -196058 -157831 -4139 59599 152279 129758 -72819 -214310 -279024 -268747 -179856 -66777
13291 -66777 65650 171519 87647 68138 97543 144547 118213 8829 -111083 -36424 20847
13280 20847 -70374 5992 -45950 -52220 37632 181937 93848 4491 122520 65198 111162
13269 111162 173450 133071 42945 79479 -31525 -158008 -155606 -32114 96314 135748 178317
13258 178317 78044 -21332 -66986 7513 -6071 -38412 -123045 -17577 125850 -76465 -221051
13247 -221051 -59617 91138 80652 137580 154658 120428 99989 147567 100956 51550 109424
13236 109424 94545 90752 106756 97998 123579 100922 -59944 -136522 -158599 -94592 19711
13225 19711 -32020 -102727 -59503 -77733 -127478 -253798 -300124 -280650 -184094 -29826 88318
13214 88318 -6636 44723 165465 147608 153934 23658 -38964 -57904 1664 14118 -11047
13203 -11047 58360 45644 -75969 -29125 -8637 -22084 -44829 20912 -51543 -179365 -263165
13192 -263165 -244573 -148682 45015 107388 23452 -55592 -32124 39742 127476 158522 145489
13181 145489 204716 118637 29134 -16213 -100077 -39821 49287 -4472 18957 66614 117018
13170 117018 116390 145750 93411 -16140 -79420 -104133 4317 131075 113734 11930 19408
13159 19408 96525 113171 66745 -61922 -127267 -205889 -282413 -210039 -132731 -184265 -186282 -14204
13147 -14204 -57893 -1762 134506 185885 196450 106153 47396 80024 -65950 -215373 -37516
13136 -37516 70762 114383 116292 160199 100777 80655 68088 56493 151276 142929 80644 -17244
13124 -17244 -139374 -153728 -116739 -19746 46644 -45827 -20403 41811 -24667 12504 -16568
13113 -16568 -71242 -25255 54945 115968 -16301 -71204 -54734 -14006 42937 76272 106281
13102 106281 87818 25339 98887 169675 205243 240854 363380 308870 247860 119792 104431
13091 104431 10653 -43652 -121520 7879 113201 164285 120655 -55850 -185349 -75847
13081 -75847 -81297 -20731 -11560 -65023 317 116599 50817 40053 63868 9153 129960 147441
13069 147441 210913 288344 213157 135474 196676 61691 -126332 -147845 -174477 -124083 -19560
13058 -19560 39125 80313 4935 -102291 -116755 -67506 -69711 26470 121192 52208 -16523 -30247
13046 -30247 -73998 -45206 31539 3725 -133682 -219269 -251397 -197310 -119749 -113904 -86468 -104467
13034 -104467 -86119 76061 203834 277029 201022 167755 126128 203216 237755 234328 208865
13023 208865 366422 429548 298472 185825 310021 370536 430242 344057 249351 68355
13013 68355 -101932 -15761 118928 202027 182849 138562 39291 55487 -15197 -8358 -28311
13002 -28311 -157031 -106720 -59169 47591 26848 -1520 41259 125846 84739 91109 68433
12991 68433 14587 -146078 -169724 -85640 -155944 -63967 -95891 -72399 28989 56317 38989
12980 38989 182156 319101 554258 475717 259530 213632 217774 189698 315103 385255 311896
12969 311896 170383 109358 221151 223667 178988 206346 178668 210632 224226 88661 -15822
12958 -15822 30236 13714 52196 32462 16887 -50782 -33186 12246 15063 -131897 -113340 -116106
12946 -116106 -27444 -17052 -188744 -219435 -95829 -1651 67575 163640 121048 121143 112137 -29205
12934 -29205 14992 103094 135942 138895 193428 61958 -132274 -212407 -173717 -103340 17942
12923 17942 102363 20064 -33524 -107320 -93228 -30008 74383 97872 165591 181160 232178
12912 232178 180742 -29163 -49791 116942 98691 108589 -85839 -185392 -193096 -78738 147163
12901 147163 127932 -7194 -116654 -203564 -205480 -110840 -23647 43239 12429 -17625 -36366
12890 -36366 -52879 -10815 -43096 -118480 -20729 -58846 -95952 -45483 -20066 -103896 -185437 -265134
12878 -265134 -140406 41467 27785 -41488 -43482 -2068 40933 -16307 -112400 -153427 -39435
12867 -39435 25074 -27601 -64742 -9688 2070 13261 84198 201401 155737 -69386 5471
12856 5471 68720 34870 82830 -35138 -88216 -113390 -108722 -53130 -3950 -54458 -12855 198277
12844 198277 396925 333061 167698 160509 16079 -71726 -8244 83670 198764 273055 178760
12833 178760 107729 53712 46937 73002 138803 14584 -25604 -97976 -142091 -57917 -24056
12822 -24056 -19619 -42396 60946 168278 59737 -50980 -32929 -62607 -13290 88506 38781
12811 38781 -39672 25105 25683 47878 51549 98458 105156 101676 -11790 2768 -140376 -73650
12799 -73650 1785 -70938 -66758 -73030 -50098 18592 -160518 -112026 -146413 -184017 -158282 -118439
12787 -118439 -164381 -46473 82757 51412 -34987 -66314 25764 59260 78196 -30629 5238
12776 5238 46293 38416 -57028 -3688 50478 81417 55136 -3765 11424 97609 146472 53460
12764 53460 133987 116774 29921 -95242 -55391 42994 10792 -33201 18827 29575 440
12753 440 -128861 -102829 -41662 23951 27985 41862 4934 -45083 -77352 -67208 -15193 24700
12741 24700 -610 -21997 -39207 5531 127440 212434 228105 251563 208808 167505 170492 153791
12729 153791 236849 215152 155244 227541 289603 96425 -25076 11215 109255 152660 69912
12718 69912 59348 -11488 32781 43270 -38183 -40601 -25667 -56683 -66165 -6748 156404 124749
12706 124749 137636 39574 16680 -113019 -214606 -143585 -50168 -28282 -35450 74040 75456
12695 75456 98066 120588 191799 260465 187306 -22970 -100308 26126 82956 260172 201679
12684 201679 127513 233065 188323 170318 163798 138182 90685 36722 -21796 20800 57101
12673 57101 -16826 110001 104196 90370 92472 102467 20465 114212 85781 -42266 -30681 -64308
12661 -64308 -11437 -91643 -6559 -42933 -47898 35405 127030 178917 126901 65249 -4975 93603
12649 93603 205637 374024 348810 436231 386840 286040 89377 16607 -3688 107250 193064
12638 193064 134853 151334 291352 222965 115819 19224 -33927 -74685 -85229 -76888 -9950
12627 -9950 -12888 -153393 -257718 -140781 41331 104455 126743 97636 107710 38669 33718
12616 33718 113999 62677 263304 360079 329041 274984 172066 47330 11062 31724 38765
12605 38765 23926 9966 40518 112492 64818 -22329 42022 167008 198452 117247 84236
12594 84236 110890 208970 248286 268603 255694 261435 194551 113824 14727 53461 108035 125732
12582 125732 168883 179320 293352 360985 331472 317606 242367 69301 106052 156862 150081
12571 150081 268193 284192 267428 249926 189470 197803 232878 272940 215747 54502 198482
12560 198482 260648 247984 285301 242459 327871 379359 269473 116395 29449 127843 140306
12549 140306 122883 208643 259430 246791 158521 136820 194954 123181 37989 27565 -27518
12538 -27518 -67585 -17648 30133 71505 80066 128576 139075 141621 130801 82846 152909 116991
12526 116991 78248 254578 314306 210782 197821 284122 247391 253104 203461 224881 165558
12515 165558 155774 270413 250677 280641 229300 134603 77980 197489 175947 108016 137524
12504 137524 75466 40875 22815 83125 342336 354080 241126 146951 84675 105741 262291
12493 262291 201801 277864 202476 183940 82017 -14094 -82783 -86673 10467 43258 192176
12482 192176 278024 272944 231868 115687 170568 262250 207793 135810 275186 149747 59317
12471 59317 37776 79910 25595 43603 118272 91597 178687 304035 370004 289087 279404 219908
12459 219908 214357 325086 392521 399939 241989 206527 305102 318270 286904 357724 342158
12448 342158 189376 151107 255383 307169 187158 154132 247287 205156 129575 140631 136327
12437 136327 180924 16236 123903 128491 62332 21023 12805 -39541 -46302 -27792 34829 130462
12425 130462 252071 236361 227773 165623 125121 64995 67035 194493 302374 300542 193058
12414 193058 102489 33549 -73939 10654 175130 215608 280958 255370 210361 228419 318746
12403 318746 396090 386966 463326 441678 373426 359825 441393 482672 532807 481157 409106 317396
12391 317396 300476 280716 377725 351173 348307 276803 110662 65559 110840 313949 314821 254575
12379 254575 283180 320671 466552 446468 387118 291925 262825 216179 207106 310953 308071
12368 308071 172285 252759 341504 419088 311811 306370 322893 310921 335201 317087 282421
12357 282421 325741 382132 330547 315589 240154 219191 107910 127640 176154 225786 129745
12346 129745 160015 284062 334854 246969 219737 294986 297167 387477 419559 399716 382446
12335 382446 359596 417364 656929 669865 535590 453255 440924 377441 417745 473659 424361
12324 424361 384232 412484 380156 391765 445578 482543 433723 536639 621504 626124 472393
12313 472393 471498 470640 456081 431887 429073 394245 386141 429552 453546 518968 620666 583400
12301 583400 526925 534996 540861 510920 556040 620816 571005 444763 391820 460705 360418
12290 360418 308305 382094 402243 477911 463396 367704 329185 386482 398928 445785 427632
12279 427632 461640 454230 522264 608714 729001 731973 795412 892679 854161 743745 700551
12268 700551 625912 804945 765810 711744 754039 650946 708039 693942 633840 566212 599262
12257 599262 625178 628482 544808 526016 655375 718423 677518 633652 641039 695353 640000 649165
12245 649165 727549 668917 664800 691155 690897 639180 607723 755856 663892 677213 911112 915346
12233 915346 997778 902625 781632 901494 943069 950944 1013995 1035188 913431 918674 843115
12222 843115 787019 862598 799946 813095 882054 830309 720084 803171 901213 1013587 926878
12211 926878 812096 876958 874341 830265 726344 634152 575705 652536 648011 745670 828894
12200 828894 953888 974726 1064448 1176749 1197876 1115319 1153926 1167798 1093359 1076301 1003545
12189 1003545 1035231 1050048 983779 898996 986766 1039160 940055 955587 1032401 1081882 1051594
12178 1051594 1135441 1136744 1277084 1283104 1144796 1104840 1163096 1252424 1152544 1203731 1140738
12167 1140738 1121429 1305605 1321819 1301999 1272202 1395537 1349001 1268144 1312426 1354420 1509528
12156 1509528 1474641 1454539 1536048 1540996 1356628 1300628 1370178 1437739 1547873 1509521 1494708
12145 1494708 1586829 1567903 1630912 1726076 1654482 1507679 1480312 1565193 1486893 1501506 1605257
12134 1605257 1706100 1710218 1736491 1826662 1837057 1823589 1698504 1605691 1619531 1690401 1798212
12123 1798212 1837209 1753040 1684934 1692239 1808210 1747549 1716526 1753078 1787581 1908212 1990830
12112 1990830 2041321 2123311 2049616 2003695 2184738 2171499 2209135 2204142 2196009 2155553 2331987
12101 2331987 2483967 2483119 2414265 2453767 2452693 2389423 2381327 2472170 2734436 2801569 2775111 2720863
12089 2720863 2818543 2882699 2891840 3133691 3116227 2941239 2850119 2880894 2972006 2898905 2983723
12078 2983723 3175352 3209015 3260352 3335821 3347051 3299006 3464660 3517973 3321115 3450067
12068 3450067 3493242 3617176 3815128 3762644 3731704 3732732 3783121 3884380 3938923 3899786 3945978
12057 3945978 4055690 4189841 4218052 4252344 4286345 4233217 4302336 4351099 4372540 4291126 4460304
12046 4460304 4682092 4702659 4654526 4703748 4800109 4784614 4766943 4868277 5006541 4951340 5147866
12035 5147866 5374247 5462300 5525461 5522125 5659878 5793966 5963571 5894493 5946522 6084860
12025 6084860 6161053 6205244 6256648 6404554 6437917 6449274 6529006 6642306 6747803 6847045 7065761
12014 7065761 7329968 7372700 7504463 7593361 7614470 7717327 7774923 7840717 8084011 8238010
12004 8238010 8454131 8677826 8798579 8943871 9056682 9158811 9246459 9316072 9338361 9595199
11994 9595199 9853210 9944185 10132917 10381489 10542519 10633217 10788667 10993390 11257839 11414446
11984 11414446 11542457 11631138 11734691 11878944 11990337 12133070 12405328 12544566 12665307
11975 12665307 12898032 13033828 13324576 13619347 13667699 13818969 14022657 14216837 14534969
11966 14534969 14816912 14957587 15044037 15138287 15410144 15645219 15747548 15806481 15857296 16007374
11956 16007374 16069895 16104572 16322236 16533842 16672734 16804433 16913726 17110571 17044918 17157921
11946 17157921 17378451 17381699 17357712 17508080 17515357 17570717 17631330 17683916 17712483 17563935 17496528
11935 17496528 17540347 17479297 17495562 17681552 17764103 17755943 17911037 17991713 17894406 17700227 17507546
11924 17507546 17525401 17419466 17339239 17269182 17228310 17222853 17185637 17019172 16798294 16784514 16707698
11913 16707698 16448657 16202887 16040534 15915534 15827304 15662442 15383264 15132878 15059248 14881230
11903 14881230 14597514 14415528 14298800 14276522 14235788 14082618 13917763 13742832 13524854 13244104
11893 13244104 13070372 12944401 12853344 12720880 12526073 12313264 12138670 11943414 11814527
11884 11814527 11625413 11520325 11392502 11138226 11059139 10996869 10783828 10712547 10681594 10499387
11874 10499387 10393383 10205054 10044856 9963710 9758392 9523917 9275276 9228382 9203798 9055751
11864 9055751 8956337 8736659 8586870 8438376 8360101 8271873 8157098 8190059 8229586 8118168
11854 8118168 7953301 7733416 7551075 7367725 7327199 7274123 7032738 6882491 6862523 6804089
11844 6804089 6724136 6581820 6475564 6307024 6246747 6298318 6305965 6338095 6211506 6001261
11834 6001261 5785417 5649429 5546421 5596590 5503852 5371431 5353769 5365777 5295204 5311623
11824 5311623 5206723 5040837 5020312 4993012 4864003 4805929 4775223 4663657 4566007 4531358
11814 4531358 4401835 4356035 4399887 4376023 4276954 4087367 3979084 4016523 4039975 3954561 3871216
11803 3871216 3805236 3777567 3844146 3834448 3736959 3677601 3580484 3472190 3379695 3410053 3429952
11792 3429952 3461541 3445206 3545594 3525648 3357117 3144851 2967674 2812745 2823219 2897387
11782 2897387 2928968 2926593 2798270 2711062 2663387 2693466 2712622 2667104 2699186 2560053 2528241
11771 2528241 2654706 2676292 2512189 2497411 2543866 2539691 2530450 2607493 2771547 2734201 2563135
11760 2563135 2558354 2419493 2446066 2326998 2341623 2202080 2124567 2192463 2358109 2300022 2136451
11749 2136451 2187043 2128322 2117016 2060246 1986513 1993112 1991260 2109433 2064256 1974925 1772755
11738 1772755 1701208 1673438 1703798 1777442 1951740 2080014 2176017 2047973 1923836 1908511
11728 1908511 1822101 1740986 1766211 1751077 1793821 1832864 1866631 1802581 1637826 1544190 1572715
11717 1572715 1673389 1679688 1574034 1484601 1526073 1534627 1424419 1324830 1343153 1382625 1413354
11706 1413354 1467852 1450849 1474718 1647112 1697898 1598905 1507963 1408207 1328938 1314226 1239135
11695 1239135 1305114 1201467 1085019 1186834 1331457 1223304 1180826 1190358 1157725 1223632
11685 1223632 1249946 1195092 1128637 1149991 1118737 1013876 1120352 1101258 988439 986765 1008642
11674 1008642 960135 929290 985146 1082799 1175853 1146074 1007315 883967 940102 1073349 1018867
11663 1018867 959976 883324 713787 732725 820742 863710 889230 956797 905532 847599 767151
11652 767151 756325 882677 1042541 978582 1009900 985254 941738 906950 881774 849746 1000825
11641 1000825 1109404 991165 886704 854635 1031215 934186 673498 646934 770673 818719
11631 818719 807247 898740 910960 873435 788713 820540 914419 852992 813419 870121 882246
11620 882246 896245 833632 691623 691387 679083 682968 639698 609002 641461 753819 735969 751401
11608 751401 773082 839740 891200 869009 789382 861887 918866 854677 810257 707382 656556
11597 656556 756619 793315 648427 675518 664163 682653 580057 552265 508822 604770 715917
11586 715917 745570 698271 678232 770826 818875 764957 644511 608508 575321 486496 434718
11575 434718 300144 253520 328149 484289 617050 532647 452127 432831 572754 745266
11565 745266 716419 581634 494773 597107 590928 584988 541426 558272 502408 521933 404025
11554 404025 267814 373422 425319 493935 559785 425004 356341 392736 385396 321330 263644
11543 263644 409381 472032 524916 533897 595497 480592 539080 499521 523520 520376 517313 486820
11531 486820 432691 530823 554268 467818 491127 445778 479910 541426 602837 661585 581696
11520 581696 486807 398542 389356 390833 468074 573535 559016 578605 599821 412171 222159
11509 222159 299837 439061 512643 453038 470171 461748 431210 414645 388343 397196 497849
11498 497849 541109 482505 451973 475318 472617 505222 494807 257897 358567 499298 398285
11487 398285 202108 187624 337951 384945 296621 281451 130745 134201 248827 271268 252080
11476 252080 230132 206997 268067 283372 324390 192924 121507 209700 348614 433372 429828
11465 429828 547903 592378 547353 469966 393392 265116 255346 330027 368401 247029 186740
11454 186740 216018 271663 298902 238160 220510 202392 270970 315368 172973 212579 191683
11443 191683 228117 341150 304955 249325 360735 405849 409544 415561 297454 157442 95139
11432 95139 120770 144753 153181 188782 162323 195463 294394 191635 156761 96330 146237 93520
11420 93520 68800 155631 173412 58430 46225 98285 219680 230634 164504 81299 152590
11409 152590 163144 77075 -94337 20094 60700 59023 130162 246696 269126 330520 328582
11398 328582 212003 144388 87413 87612 120480 134880 249549 281018 217044 180826 124655
11387 124655 179573 227219 305575 372585 240297 141751 136064 152092 226521 220160 228444 221396
11375 221396 253874 306254 287428 314508 255715 31575 36361 96376 119362 145763 59002
11364 59002 -49393 26456 45148 54391 186866 337888 353890 286167 212556 121611 93109
11353 93109 57150 16676 60185 167838 130928 108543 76889 178226 243243 307608 222314
11342 222314 91046 63235 -22526 -59161 -72337 -104746 11673 -12223 -59400 103249 216588
11331 216588 140566 59598 -1412 -17420 169283 239361 257702 313433 336105 318853 428074
11320 428074 356393 249027 149825 56098 10582 126255 105400 167706 227446 222208 125481
11309 125481 132659 234895 181057 104292 137621 220884 291090 252040 261012 223165 -4597
11298 -4597 12696 43700 28840 -52843 -47358 -44430 69263 39046 -79298 -58000 1538 87463
11286 87463 102448 103760 77131 77691 195099 286672 204524 109659 56705 109795 178254 300820
11274 300820 414132 241919 109934 56227 59674 -20981 -117014 -120437 -56178 13594 168454
11263 168454 259062 308893 315400 344932 241861 204915 100208 62329 126047 199907 124844
11252 124844 141075 162461 124772 125619 74214 80619 226169 286113 308868 269528 37978 -81320
11240 -81320 -90775 -53108 1843 -5591 165917 99908 -11487 32244 73751 124460 231421
11229 231421 247548 149273 53377 116901 125785 -24422 -57849 -114552 -76576 -25693 -20381 -57612
11217 -57612 -58117 57370 135052 259371 388968 281513 179795 73425 3859 7846 -122447
11206 -122447 -107922 22513 85146 103038 39196 66368 7841 -136551 -226676 -250844 -171081
11195 -171081 58376 92243 15208 26349 174221 164448 118714 163633 129825 94435 44187
11184 44187 45577 73551 8330 -31087 -72619 -5584 -12471 14435 54434 66838 109861 230492
11172 230492 164565 24723 -96290 32658 164120 203296 171819 271950 260013 135580
11162 135580 116509 8183 -180084 -18857 11337 12252 209772 227954 245504 195719 123807
11151 123807 -25016 -11787 142209 109297 -8770 34346 -27195 -141945 -94512 41007
11141 41007 130241 10973 -121936 -245243 -199014 -25946 61178 32609 611 103479 199795
11130 199795 140090 -72848 -170862 -40060 55976 -6261 71206 125717 125132 6276 -50782
11119 -50782 24200 53594 128533 93571 17687 67589 210753 122349 75141 -65109 -100818
11108 -100818 15043 -84521 -197733 -186998 -227510 -197260 -57771 -31159 -74045 -27846 -2567
11097 -2567 5551 79397 125614 136162 -57659 -121028 32708 130315 127641 64017 25430 99842
11085 99842 102120 87287 146445 149565 85741 172202 194528 99027 -21453 -1344 132744 168782
11073 168782 173412 238177 204376 210766 270588 176452 111166 14341 133867 229203 244132 215830
11061 215830 186620 42613 38551 -65525 -27105 -13585 33757 41376 6155 -16931 -8535 37026
11049 37026 -9336 149068 245068 270753 410422 542538 470099 363971 371472 492591 443539
11038 443539 396209 493872 525102 587874 671393 761112 693089 661485 738630 620134 633083
11027 633083 596926 560201 577520 584833 647487 740169 746605 856860 875977 889661 866227 847291
11015 847291 656308 504259 503685 569327 504687 461829 470909 416470 429052 470038 461200 350395
11003 350395 441412 494297 590476 459616 457386 531731 444188 311121 315660 391265 407658
10992 407658 316111 299406 286812 306608 307375 188259 49262 96135 94443 89499 201891 244979
10980 244979 236361 122103 -26687 -82067 -22079 128846 141481 86473 13896 61481 171802
10969 171802 293494 198519 164451 267349 259733 72464 -59575 -10770 73995 18192 95988
10958 95988 96111 216402 106762 6788 19624 -43957 -66654 2941 -8540 -33580 6387 93743
10946 93743 133148 72139 -119414 -120675 -78042 -233358 -258168 -152187 -107521 -97651 -126554
10935 -126554 -122007 -73831 -68629 -70813 -98155 2403 -3405 -66831 -148266 -70036 11580 45538
10923 45538 20686 6682 -40229 -7736 12167 -55144 -80775 33402 111962 172886 182007 110519
10911 110519 78647 127942 163585 125249 -29377 83553 154107 152744 70935 90014 76150
10900 76150 93342 -56549 -134789 2997 -3282 354 28076 -48040 -27697 -128341 26556
10889 26556 88224 -43181 -149371 -184876 -118208 -110803 -232971 -177122 -182196 -161520 -67796
10878 -67796 -14321 -82678 -160732 -192958 -200310 -272204 -280037 -196195 -156479 -175033 -256598 -295780
10866 -295780 -249639 -136169 -56660 -92813 -186065 -48826 69731 12112 -369 43656 13645
10855 13645 -31220 -68498 19443 148124 190756 210204 179385 87508 35825 26137 -59364 -82280
10843 -82280 -34749 -42703 -118875 -180025 -229603 -279685 -96080 114304 214756 129334 14403
10832 14403 -93963 -160045 -148087 104119 -51030 -99032 3908 4915 -10131 129463 83779
10821 83779 -78845 -218441 -188760 -87980 -150327 -198947 -192277 -230843 -156992 -59651 1240
10810 1240 -31199 -42853 37754 139477 89105 -38721 -75540 -45853 -37758 -109729 -106919 40735
10798 40735 64776 119834 92073 -19844 -14500 12317 16781 -11808 21040 -69221 -134986 -78484
10786 -78484 -29638 -54933 -112513 -211028 -182380 -43390 -31903 30594 -42535 -151992 -321309
10775 -321309 -316470 -303895 -235055 -340514 -358356 -247853 -84356 -140875 -246288 -169850 -119818
10764 -119818 -152616 -234680 -215217 -106796 31150 21201 -61803 -107358 -125627 -167296 -281027
10753 -281027 -304424 -297331 -293463 -437212 -400063 -421228 -328855 -316726 -382123 -391988 -258782 -156027
10741 -156027 -183927 -367955 -295156 -188670 -220058 -160378 -153811 -190895 -246873 -139552 -1626
10730 -1626 5675 -107785 -55265 -100533 -234464 -130227 -32973 117838 102141 292705 559970
10719 559970 845202 1074442 1189079 1155788 1047649 802081 598284 422140 313690 277559
10709 277559 234335 157145 25590 6566 167023 346995 317439 168491 185009 85499 -55370
10698 -55370 -126015 -101703 -201997 -127020 41270 2495 -145128 -29498 22503 14381 -57464
10687 -57464 -17159 99222 215833 293870 348808 332342 286129 171640 145914 206267 171131
10676 171131 79313 53212 37881 123508 253187 339762 277547 297836 332541 273657 212060
10665 212060 221670 218727 237791 244016 357253 461787 506411 423040 470644 533852 590295 589702
10653 589702 609739 735291 761519 789311 773753 788714 884581 910541 995936 1125811 1227145
10642 1227145 1177267 1141216 1362135 1440723 1465303 1683928 1918670 1996995 2131247 2344872
10632 2344872 2742162 3277972 3633090 3964016 4322520 4811182 5372962 6061084 7148405
10623 7148405 8414443 9955176 12235515 15168717 19046093 24163913 30276664 37200689
10615 37200689 44464837 50681057 54922315 57083784 57573476 57525146 58120079 60298481 64800194
10606 64800194 72319881 83030724 95909672 109108143 119497947 124601426 124292851 120318470
10598 120318470 115310130 111649072 111028802 114633663 122893566 135282898 150555186 165233980
10590 165233980 174985298 176481184 169760747 158001611 144805763 133241579 125214913
10583 125214913 121353425 121656598 125678637 131870847 137449238 139448187 135958771 127429744
10575 127429744 116204865 104518149 94277691 86300948 81122098 78554690 77939517 78206542
10567 78206542 77954829 76260406 72512381 67035855 60398689 53624627 47251824 41835142
10559 41835142 37281381 33805819 30966150 28789760 26988014 25364394 23976261 22759932
10551 22759932 21713356 20788171 19906692 19055170 18242659 17552434 16940673 16464045 15847275
10542 15847275 15292033 14812822 14200234 13556335 13028501 12482217 11833845 11339005 11110724
10533 11110724 10777493 10347153 9920109 9507970 9126474 8651067 8263879 7797947 7511948
10524 7511948 7324911 6924206 6522781 6217517 6005032 5897496 5711668 5386298 5079768
10515 5079768 4983901 4642599 4282352 4147577 4116854 4048769 4043470 3928914 3736352 3596509
10505 3596509 3469335 3383525 3184748 2836691 2628339 2631931 2508911 2416606 2328390 2192886
10495 2192886 2197507 2284185 2276958 2276296 2205369 2071479 2000443 1901803 1762367 1744996 1772877 1704893
10483 1704893 1705385 1714810 1579173 1459442 1408049 1516928 1532281 1511180 1574100 1552804 1696234
10472 1696234 1732542 1673655 1536801 1438808 1458941 1448027 1303975 1115944 884880 1013406
10462 1013406 1134172 1116531 1064521 1009594 1065124 1266165 1259298 1140345 1085037 1013502 861354
10451 861354 803988 905421 1011691 1079178 1174781 1091813 917874 989124 1064644 1060707 984697
10440 984697 1056424 1073413 970197 896713 796964 771156 873077 815586 855169 986646 1028068
10429 1028068 1031842 927185 922554 1028423 1081645 1244329 1185863 1127329 1240042 1462203 1386878
10418 1386878 1253593 1392780 1583590 1665048 1760430 2022437 2366825 2585609 2960620 3404825
10408 3404825 3655235 3756941 3772448 3849464 3608855 3165635 2933943 2706554 2421888 2180316
10398 2180316 1948059 1739437 1648238 1523326 1530829 1540254 1401535 1247392 1188194 1197656 1274772
10387 1274772 1194404 945641 975125 1049417 1067990 1076297 1093847 1032937 929353 875465 697268
10376 697268 672241 661913 687124 742175 792006 818587 867553 847577 834980 697845 579537
10365 579537 598801 612651 640785 612366 579125 712217 814340 833311 773738 771632 839641
10354 839641 844887 695401 550600 523514 503055 493829 395723 361166 388660 402470 478120
10343 478120 669340 746877 629336 451365 452438 535919 540730 637269 531379 442272 228428
10332 228428 133200 325188 390608 407710 409368 350820 397581 446398 466263 417447 395879
10321 395879 275360 199666 333081 388334 336999 278165 212687 260867 290054 387096 388624
10310 388624 487377 345631 266723 200049 168090 244277 228557 256860 338902 223587 143812
10299 143812 180550 204021 258907 439878 423305 339461 308726 428006 434950 320004 166051
10288 166051 270714 406459 420485 411041 500562 528247 394796 337205 188586 111668 126622
10277 126622 121707 193869 238314 240810 274658 264282 354888 366186 317390 300302 302296 319969
10265 319969 290547 340337 360715 317069 323577 321681 338467 262909 308966 236216 191924 239080
10253 239080 374066 396191 391092 540115 643973 553579 502629 572712 727910 890478 887893
10242 887893 864297 1015455 1221975 1426787 1723359 2064980 2508413 3265619 4244852 5481285
10232 5481285 7181048 9599806 12892673 16963282 20748908 22843058 22167090 19535638
10224 19535638 16423035 13239078 10484659 8413489 6982982 5856765 4973548 4343635
10216 4343635 3817282 3270397 2918069 2713946 2462705 2181054 2007365 2083761 2130887 2005870
10206 2005870 1845078 1695957 1603980 1659665 1603529 1498080 1459705 1463630 1365058 1328313 1367710
10195 1367710 1357582 1442504 1521960 1419817 1362183 1420419 1518519 1494502 1381484 1258202 1200576
10184 1200576 1035348 986894 1043139 1013543 983775 878864 925672 1053859 1050959 1033914 1130985
10173 1130985 954220 875432 806243 778768 797543 885859 929811 1116459 1273383 1168102
10163 1168102 1159484 1231061 1114217 992817 944674 990260 1086989 1242816 1355877 1327435 1362618
10152 1362618 1439871 1194431 1059078 1094855 1351869 1355215 1363743 1300285 1269451 1136024 1138947
10141 1138947 1118699 973409 935958 912304 799081 795599 785126 705659 633329 567090 720752
10130 720752 788582 765442 650747 609905 599056 417500 341165 311515 301237 389023 439867
10119 439867 407991 289906 326856 528380 592956 487379 310859 221078 194237 201809 216059
10108 216059 205982 300036 332182 322112 259124 131544 98623 99634 204237 299516 312600
10097 312600 348243 271797 267288 142218 66796 95847 355617 400963 337036 298734 257658
10086 257658 76260 91547 173950 151363 169132 137236 112565 247222 384143 260464 185182
10075 185182 170782 121171 88929 44272 23510 61567 169781 95072 67316 103244 141983
10064 141983 308994 361748 350328 340751 190939 152622 101255 60511 63475 155570 327971
10053 327971 369490 302246 225251 186340 111903 159586 226579 317782 342377 309749 246751
10042 246751 277018 314997 228860 121745 227956 249596 258116 252693 172831 145173 63458
10031 63458 85003 249134 279609 381546 360128 316734 221849 224880 188656 327594 259152
10020 259152 203717 87378 -56504 -115581 -68727 -54878 108280 277635 223505 142914 106648
10009 106648 103289 182333 179510 110076 128455 225832 254820 255716 240864 307424 307436 298656 278722
9996 278722 211436 161751 102157 49507 21884 60841 113530 84693 199223 366360 502727
9985 502727 407291 303965 299236 283771 369933 360082 264056 202927 203832 134911 148750 116866
9973 116866 67266 -59299 17727 84124 75133 -23762 -37391 107902 217728 326133 266570
9962 266570 157290 63206 204873 108670 112107 108996 89676 101372 164985 247866 291754 220832
9950 220832 153985 93613 56212 97589 123179 98714 64292 145282 272434 370182 242759
9939 242759 198806 190654 229027 128549 180838 275829 265859 221159 151866 97216 16384 -53439
9927 -53439 -23819 77898 35235 -59684 -79785 79021 162934 168592 120246 -986 -79264
9916 -79264 -125232 -153321 -128564 -63177 86033 239864 179127 112128 154049 298845 281283
9905 281283 267579 230926 177204 51222 36395 185209 244010 185448 163270 147311 192952
9894 192952 194976 158589 77431 35650 85813 63847 7883 148898 146465 57762 52479 96157
9882 96157 273196 345540 238276 53262 -119146 -54758 -54788 -8872 42250 55106 14925 74909
9870 74909 7119 50872 165291 265014 343112 191482 2256 10902 -37104 572 58083
9859 58083 119605 83599 32596 88767 110347 123842 164129 153971 165680 217371 228312 247220
9847 247220 198756 183654 103859 72215 56147 56903 5828 -6563 58083 177834 108900 1490
9835 1490 6908 -31426 59834 217977 232164 272198 266642 282542 151215 23805 33690 76763
9823 76763 69151 67211 144051 138927 183112 250331 124649 126508 42946 -56725 10507 72827
9811 72827 66281 47637 36637 75124 81405 20965 -34593 47781 154268 149424 134315 88608
9799 88608 54883 -9754 20538 18600 47716 131035 63456 -53936 41149 90994 8945 5702
9787 5702 -27345 -25572 72197 175108 123843 172681 125015 76356 159281 277778 360588 476828
9775 476828 752673 964689 1060192 1271227 1343404 1083538 814608 615362 365771 147785
9765 147785 159881 216958 313004 286460 239764 187081 249381 242270 251417 364952 301868 225550
9753 225550 212360 168148 129159 261150 191145 105530 224221 345294 189482 204384 199688
9742 199688 142894 112719 177787 157867 89952 9135 -25446 -30382 68483 193168 154993 -46482
9730 -46482 -105568 -109820 -86320 -12546 -12398 117893 136759 25253 -101240 -145891 -82062 -43277
9718 -43277 36918 29467 161779 232748 304789 194291 39321 -130329 21066 134599 64605
9707 64605 40766 69416 65364 30005 -40793 -33857 852 10202 187242 347304 344036 302886
9695 302886 242437 298662 209352 79168 10582 -100573 -119268 -43576 -87561 -124990 -146258
9684 -146258 -74325 -96185 -198412 -65346 72943 126864 114589 11221 -21240 22523 209677
9673 209677 253283 279590 315813 358557 449566 394973 144368 42420 97125 100642 105563 82970
9661 82970 115235 250028 174086 250478 287179 248159 300142 242526 134584 167404 197440
9650 197440 157089 138876 230675 228717 173160 813 -12310 -42769 -20102 9487 10612 186962
9638 186962 252747 221619 304306 123356 92765 163092 173866 73625 101506 230111 251622
9627 251622 104077 70057 93026 66509 165735 300316 245793 152169 210094 265477 145420
9616 145420 89721 169064 86274 20702 32602 -41270 15931 47313 176959 163963 69702
9605 69702 -20288 -23681 -90939 -78580 -44416 -8428 14645 38846 27494 49741 86837 100915
9593 100915 175059 144932 -19992 -125894 -170741 -118855 -28670 141927 141493 44041 -2127
9582 -2127 -50632 -82714 14117 79854 29535 -40191 -11607 70283 97764 161028 189489 134115
9570 134115 23943 62754 68434 42379 85153 264847 162087 63460 96533 76221 43880
9559 43880 -70921 -97401 25941 121325 124302 52708 50434 177743 214434 173193 173761 131840
9547 131840 105352 34266 -19736 12632 35610 22809 7522 -13717 16635 111082 260968
9536 260968 95327 -7301 53098 94279 -11085 -108093 -96473 -52718 -78806 -147811 18869
9525 18869 89212 -18408 -166640 -232948 -72682 17776 63092 126689 133778 63699 -99416
9514 -99416 -78060 5995 9487 90969 73702 97350 70432 83716 121470 67652 45964 110803
9502 110803 205626 83417 -43866 -87083 -40761 -95265 -168857 11171 143322 147825 -7734
9491 -7734 -113804 -53432 -15924 -24641 -32494 61046 62007 -5223 18013 2542 -79630 -84478 -61613
9478 -61613 -16961 60215 176079 129195 -5743 -129991 -97022 73008 72050 57659 46921
9467 46921 -9842 -16279 -31560 -83336 -93013 -195330 -153991 -38955 88056 8187 -67592 -47334
9455 -47334 -40211 69269 115829 177406 152374 107639 54662 34853 3855 -44269 60842 151671
9443 151671 246204 198085 172207 168111 77546 3962 -53212 -8915 127690 55575 -70330
9432 -70330 -79404 -24713 -93711 -90073 -45018 -29916 70363 6023 -31516 -8042 -43630 -51159
9420 -51159 -48251 39876 92302 195343 105835 -94415 -49875 94400 118374 43870 24646
9409 24646 36958 92442 29968 19627 -68682 -82359 -52036 -87706 -66523 -103311 -212491 -242212
9397 -242212 -140615 67909 199604 270535 142720 92346 67048 -12494 -60930 -5343 28620
9386 28620 145804 83053 6136 48453 -22094 -75216 -50242 -50107 136551 235959 63473 -129201
9374 -129201 -118687 -29211 43678 -1240 -169748 -155524 -61169 64497 105026 247133 228407
9363 228407 201601 178025 143677 146782 -64309 -151813 -83573 -52735 -103212 -160424 -58118
9352 -58118 -1093 100403 148289 22364 -177622 -147347 -42676 12051 14692 89622 -53277
9341 -53277 -268498 -277730 -102005 15149 -6111 -34936 18958 -42686 -29723 -54470 -59555 -96777
9329 -96777 -41857 127226 186126 174198 149335 124681 178390 137031 78691 -7045 -11788 -52556
9317 -52556 -138079 -178682 -195660 -95574 -50271 30827 112019 107430 101549 4738 -13349 -35735
9305 -35735 -60474 2180 -59839 25636 132201 148597 147136 110575 -23967 21963 125845
9294 125845 83476 16586 -125652 -107088 -8656 44326 184410 194085 81553 -94067 -136002
9283 -136002 -174082 -95839 -19535 30263 6233 -29626 -38979 -18600 112124 175087 187609 114049
9271 114049 26013 43149 24734 56670 100341 70863 23784 15145 136796 249219 108807
9260 108807 73468 62436 99464 83905 83097 172687 138047 118927 231269 142110 74732 226819
9248 226819 84131 -73349 11929 175447 347367 295065 248383 246000 200751 151996 130207
9237 130207 16551 -57197 -152980 -178603 -192758 -136068 -132693 -139615 21457 -6471 25473 40153
9225 40153 150633 113449 37008 -25406 39980 20774 37692 76570 -2624 41802 -104619
9214 -104619 -262514 -232967 -193465 -116365 23357 -33567 -115317 -83282 -75920 38498 156899
9203 156899 240718 263261 64693 42512 -7962 -87269 -51559 116676 126425 232881 260646
9192 260646 154206 39996 53751 125358 194163 191185 113954 -76337 -165705 -104741 -21315
9181 -21315 47694 66047 16083 -41317 -116162 46642 109565 190242 202670 288002 268970 198301
9169 198301 98113 46596 -19258 29857 110762 65285 -101572 -78 108260 104044 112124
9158 112124 120969 173907 238934 257091 256116 280145 234835 249960 290599 178567 38173 -46035
9146 -46035 -90528 -36432 6940 -1710 5015 8202 65427 -2535 90162 150959 161671 125021
9134 125021 50285 38673 25277 -2363 -24797 -39671 32475 46622 62318 -43661 -34068 -16358
9122 -16358 -13740 -21541 -61337 28608 -70270 -48213 -17607 -8716 2652 102936 199276 227897
9110 227897 188880 144080 22034 -93404 -35353 -17976 72647 214507 167192 145410 75295
9099 75295 -34228 -76003 76908 72747 78635 149862 48628 -81343 -23997 134004 105885
9088 105885 71035 -57365 -57824 -70681 -37891 -57052 -180923 -273777 -298285 -313467 -161507
9077 -161507 76724 29352 -9253 124649 147370 82979 -130360 -181487 -198706 -62531 -63463
9066 -63463 -66656 -30903 19157 18299 -871 -17679 1561 -65825 -137437 -58399 -18110 -31390
9054 -31390 -36308 47821 46261 5699 -43206 -54505 -5931 7699 -31937 -41087 -145559 -253809
9042 -253809 -131009 -6064 -19955 -97730 -109860 -105740 -233091 -241260 -263985 -153900 -40659
9031 -40659 87194 138768 60579 -50878 -36623 52699 46251 43843 -5819 74528 -14304 -25737
9019 -25737 29890 10388 -129103 -121089 -63579 -48590 -34814 -70221 -26022 49204 46814 -10394
9007 -10394 -115451 -92131 -12355 51352 62891 31391 3654 79096 60736 11631 -17595 1079
8995 1079 13933 2985 -114810 -72532 -24528 12713 83522 110986 43524 -48796 80024 112268
8983 112268 201373 30921 -117528 -69534 112658 142307 147556 60316 -60625 54233 62958
8972 62958 -21099 114974 163344 158129 94754 -14231 -216657 -273354 -170013 -3298 81460
8961 81460 77279 191097 206116 145084 61760 -61734 -8942 91913 80906 119563 66826
8950 66826 -35390 -52982 83500 86874 35620 -89614 -159930 -117858 -47073 4219 -38167
8939 -38167 33086 -32522 -48033 -166583 -89383 -15660 18022 -57859 -81696 -12909 237621
8928 237621 470731 412037 332849 298787 240694 155769 37209 -71544 -52205 -7896 183466
8917 183466 187871 35878 9670 53821 44954 71106 -37452 23999 50704 -12354 46067 2560
8905 2560 -44852 48961 -11702 -225430 -276093 -115671 -27016 47585 78159 44813 -5207 2833
8893 2833 -43507 -54306 -97075 -97419 -76799 6032 54019 40931 -431 45042 132680 107943
8881 107943 52081 18849 -32451 6633 -21488 -108406 -129770 -84513 -107455 -188314 -43847
8870 -43847 -16689 -41786 67552 83542 -6676 -31745 42168 73028 34020 -77550 -116773
8859 -116773 -44384 17408 -2034 -117589 -214559 -71847 -129145 -171979 -259882 -277571 -293107
8848 -293107 -155400 -102255 -66370 -41391 -47322 -25641 -56430 -10956 69446 101760 117568 16358
8836 16358 12357 -9704 20661 101615 222923 290199 84949 2108 18267 55725 104195 141973
8824 141973 39937 29682 -128070 -164484 -105088 -178874 -220957 -65595 -61782 -98569 48564
8813 48564 44322 14729 -177757 -296236 -126726 -43299 -231948 -159608 -28353 111745 157916
8802 157916 271291 213435 -83949 -106474 -6612 -112940 -200567 -62365 -28635 3092 38415
8791 38415 85535 80884 -69290 -60009 48472 191989 91280 68639 194800 214020 213662 197409
8779 197409 144090 33868 -92230 -105311 59211 120520 202501 162340 132240 127405 -67130
8768 -67130 -32730 -14017 99246 119411 141179 92929 25913 3072 61183 54671 102333 71501
8756 71501 -45836 -80017 70227 98013 79396 21311 -36893 -152445 -94534 -168838 -257555
8745 -257555 -211721 -159790 -144576 -43580 -73830 -105257 -206654 -267542 -229796 -137999 -15117
8734 -15117 15761 30036 36446 52168 -25907 -21422 -36888 -74395 42458 191179 150978 71299
8722 71299 125791 117611 139549 111664 145410 47619 -6726 39686 107757 81148 10254 -14683
8710 -14683 309 61351 139247 209509 237817 116846 -17951 96123 289274 258225 85148
8699 85148 92151 61648 -52987 -58931 -16308 49635 14425 -19336 28240 -38189 -33136 42784
8687 42784 236915 227407 130777 131393 145606 26711 -107495 -159380 -170447 -173352 -165935 -105982
8675 -105982 -47348 97389 191257 129824 141069 148278 159829 129460 128596 103647 -8848 -107653
8663 -107653 -39649 -28872 -103948 12235 74840 28549 101964 150886 123975 7447 -18304
8652 -18304 -4424 38585 17123 64283 140472 242538 208422 -13593 -111840 -35075 42837
8641 42837 78310 -30064 81403 132967 22634 9865 22843 -29617 -37511 -50454 -36730
8630 -36730 -100220 -18533 -38488 -43477 2436 13475 -113671 -104287 -142813 -184072 -92826 -87516
8618 -87516 -102926 -135303 -202481 -170706 -39907 -22620 -73026 -6342 55389 37054 -46000 25223
8606 25223 194278 187474 148003 -680 -26912 -57322 -37919 35378 97554 135779 127674 137461
8594 137461 12144 -200875 -229706 -73256 9713 23535 107913 70010 124846 74656 25879
$$ [...]
##END NTUPLES=NMR SPECTRUM
##END=
