##TITLE=Analysis number 310542
Compound Code mo 07064
Book Reference 302/180
Project Code adrs
Chemist Name toml
##JCAMPDX= 6.0         $$ Bruker NMR JCAMP-DX V2.0
##DATA TYPE= NMR SPECTRUM
##DATA CLASS= NTUPLES
##ORIGIN= Bruker BioSpin GmbH
##OWNER= NMR
$$ XWIN-NMR		Version 3.5
$$ Tue Jun 21 11:05:16 2005 GMT Daylight Time (UT+1h)  MAYBRIDGE\NMR@NMR_250MHZ
##.OBSERVE FREQUENCY= 250.131544655141
##.OBSERVE NUCLEUS= ^1H
##.ACQUISITION MODE= SIMULTANEOUS (DQD)
##.ACQUISITION SCHEME= undefined
##.AVERAGES= 16
##.DIGITISER RES= 18
##SPECTROMETER/DATA SYSTEM= dpx250
##.PULSE SEQUENCE= zg30
##.SOLVENT NAME= DMSO
##.SHIFT REFERENCE= (INTERNAL, DMSO, 0, 16.522)
##AUDIT TRAIL= $$ (NUMBER, WHEN, WHO, WHERE, WHAT)
$$ ##TITLE= Audit trail, XWIN-NMR		Version 3.5
$$ ##JCAMPDX= 5.01
$$ ##ORIGIN= Bruker BioSpin GmbH
$$ ##OWNER= NMR
$$ C:\u/data/dgb/nmr/ADRS/4340/pdata/1/auditp.txt
$$ ##AUDIT TRAIL=  $$ (NUMBER, WHEN, WHO, WHERE, WHAT)
(   1,<2005-06-21 11:04:57.47 +100>,<MAYBRIDGE\NMR>,<NMR_250MHZ>,
      <created by zg, POWCHK disabled, PULCHK disabled
       configuration hash MD5:
       62 19 C7 07 E1 42 D1 B7 37 6C 3D D0 77 39 F9 E6
       data hash MD5: 64K
       1C 79 60 8E 8A 4D A0 54 8C 5A 93 2B CB F2 C8 16>)
(   2,<2005-06-21 11:05:08.33 +100>,<MAYBRIDGE\NMR>,<NMR_250MHZ>,
      <Start of raw data processing
       ef LB = 0.3 FT_mod = 6 PKNL = 1 SI = 32K 
       data hash MD5: 32K
       B5 29 06 C1 87 44 64 71 08 78 4C 59 22 13 99 07>)
(   3,<2005-06-21 11:05:10.00 +100>,<MAYBRIDGE\NMR>,<NMR_250MHZ>,
      <apk 
       data hash MD5: 32K
       F5 13 21 41 32 24 FA D6 EC DF 3F 31 4F DA 25 1D>)
(   4,<2005-06-21 11:05:10.72 +100>,<MAYBRIDGE\NMR>,<NMR_250MHZ>,
      <abs ABSG = 5 
       data hash MD5: 32K
       F7 69 B7 F0 20 E4 17 59 26 ED 96 9B 55 72 13 2C>)
$$ ##END=
$$ 
$$ hash MD5
$$ 6D C6 81 81 AD 31 2F 7D B8 11 57 A7 55 E2 0E 4C
##$RELAX= 
##$RELAX= 
##$RELAX= 
##$RELAX= 
##$RELAX= 
##$RELAX= 
##$RELAX= 
$$ Bruker specific parameters
$$ --------------------------
##$DU= <C:\u>
##$EXPNO= 4340
##$NAME= <ADRS>
##$PROCNO= 1
##$TYPE= <nmr>
##$USER= <dgb>
##$AMP= (0..31)
100 100 100 100 100 100 100 100 100 100 100 100 100 100 100 100 100 100 
100 100 100 100 100 100 100 100 100 100 100 100 100 100 
##$AQSEQ= 0
##$AQ_mod= 3
##$AUNM= <au_zg>
##$AUTOPOS= <12 >
##$BF1= 250.13
##$BF2= 250.13
##$BF3= 250.13
##$BF4= 250.13
##$BF5= 500.13
##$BF6= 500.13
##$BF7= 500.13
##$BF8= 500.13
##$BYTORDA= 1
##$CFDGTYP= 0
##$CFRGTYP= 5
##$CHEMSTR= <none>
##$CNST= (0..31)
1 1 145 1 1 1 1 1 1 1 1 1 1 1 1 1 1 1 1 1 1 1 1 1 1 1 1 1 1 1 1 1 
##$CPDPRG= <>
##$CPDPRG1= <>
##$CPDPRG2= <>
##$CPDPRG3= <>
##$CPDPRG4= <mlev>
##$CPDPRG5= <mlev>
##$CPDPRG6= <mlev>
##$CPDPRG7= <mlev>
##$CPDPRG8= <mlev>
##$CPDPRGB= <>
##$CPDPRGT= <>
##$D= (0..31)
0 1 0 0 0 0 0 0 0 0.06 0 0 0 0 0 0 0.0002 0 0 0 0 0 0 0 0 0 0 0 0 0 0 
0 
##$DATE= 1119348296
##$DBL= (0..7)
120 120 120 120 120 120 120 120 
##$DBP= (0..7)
150 150 150 150 150 150 150 150 
##$DBP07= 0
##$DBPNAM0= <>
##$DBPNAM1= <>
$$ [...]
##$SUBNAM7= <"">
##$SUBNAM8= <"">
##$SUBNAM9= <"">
##$SW= 20.6930455092707
##$SWIBOX= (0..15)
0 0 3 0 0 0 0 0 0 0 0 0 0 0 0 0 
##$SW_h= 5175.983436853
##$TD= 65536
##$TD0= 1
##$TE= 295.16
##$TE2= 300
##$TE3= 300
##$TEG= 300
##$TL= (0..7)
0 120 120 120 120 120 120 120 
##$TP= (0..7)
150 150 150 150 150 150 150 150 
##$TP07= 0
##$TPNAME0= <>
##$TPNAME1= <>
##$TPNAME2= <>
##$TPNAME3= <>
##$TPNAME4= <>
##$TPNAME5= <>
##$TPNAME6= <>
##$TPNAME7= <>
##$TPOAL= (0..7)
0.5 0.5 0.5 0.5 0.5 0.5 0.5 0.5 
##$TPOFFS= (0..7)
0 0 0 0 0 0 0 0 
##$TUNHIN= 0
##$TUNHOUT= 0
##$TUNXOUT= 0
##$USERA1= <user>
##$USERA2= <user>
##$USERA3= <user>
##$USERA4= <user>
##$USERA5= <user>
##$V9= 5
##$VALIST= <valist>
##$VCLIST= <CCCCCCCCCCCCCCC>
##$VD= 0
##$VDLIST= <DDDDDDDDDDDDDDD>
##$VPLIST= <PPPPPPPPPPPPPPP>
##$VTLIST= <TTTTTTTTTTTTTTT>
##$WBST= 1024
##$WBSW= 4
##$XGAIN= (0..3)
0 0 0 0 
##$XL= 0
##$YL= 0
##$YMAX_a= 354064
##$YMIN_a= -287846
##$ZGOPTNS= <>
##$ZL1= 120
##$ZL2= 120
##$ZL3= 120
##$ZL4= 120
##$ABSF1= 16.522
##$ABSF2= -4.171173
##$ABSG= 5
##$ABSL= 3
##$ALPHA= 0
##$AQORDER= 0
##$ASSFAC= 0
##$ASSFACI= 0
##$ASSFACX= 0
##$ASSWID= 0
##$AUNMP= <proc_1d>
##$AZFE= 0.1
##$AZFW= 0.1
##$BCFW= 0
##$BC_mod= 0
##$BYTORDP= 0
##$COROFFS= 0
##$CY= 12.5
##$DATMOD= 1
##$DC= 0
##$DFILT= <>
##$DTYPP= 0
##$F1P= 14.0000005364418
##$F2P= -0.99999901652339
##$FCOR= 0.5
##$FTSIZE= 32768
##$FT_mod= 6
##$GAMMA= 0
##$GB= 0
##$INTBC= 1
##$INTSCL= 1
##$ISEN= 128
##$LB= 0.3
##$LEV0= 0
##$LPBIN= 0
##$MAXI= 10000
##$MC2= 0
##$MEAN= 0
##$ME_mod= 0
##$MI= 0
##$NCOEF= 0
##$NC_proc= -5
##$NLEV= 6
##$NOISF1= 0
##$NOISF2= 0
##$NSP= 0
##$NTH_PI= 0
##$NZP= 0
##$OFFSET= 16.522
##$PC= 1
##$PHC0= -84.0378
##$PHC1= 7.858191
##$PH_mod= 1
##$PKNL= yes
##$PPARMOD= 0
##$PSCAL= 4
##$PSIGN= 0
##$REVERSE= no
##$SF= 250.13
##$SI= 32768
##$SIGF1= 0
##$SIGF2= 0
##$SINO= 400
##$SIOLD= 32768
##$SREGLST= <1H.DMSO>
##$SSB= 0
##$STSI= 32768
##$STSR= 0
##$SW_p= 5175.98343685301
##$SYMM= 0
##$S_DEV= 0
##$TDeff= 65536
##$TDoff= 0
##$TI= <Analysis number 999999
Compound Code 99
Book Reference 9
Project Code 9>
##$TILT= no
##$TM1= 0
##$TM2= 0
##$TOPLEV= 0
##$USERP1= <user>
##$USERP2= <user>
##$USERP3= <user>
##$USERP4= <user>
##$USERP5= <user>
##$WDW= 1
##$XDIM= 32768
##$YMAX_p= 368969331
##$YMIN_p= -695505
$$ End of Bruker specific parameters
$$ ---------------------------------
##NTUPLES= NMR SPECTRUM
##VAR_NAME=  FREQUENCY,     SPECTRUM/REAL,   SPECTRUM/IMAG
##SYMBOL=    X,             R,               I
##VAR_TYPE=  INDEPENDENT,   DEPENDENT,       DEPENDENT
##VAR_FORM=  AFFN,          ASDF,            ASDF
##VAR_DIM=   32768,         32768,           32768
##UNITS=     HZ,            ARBITRARY UNITS, ARBITRARY UNITS
##FACTOR=    0.157963299565203, 1,           1
##FIRST=     4132.6476996994, 0,             0
##LAST=      -1043.33573715361, 0,           0
##MIN=       -1043.33573715361, -695505,     0
##MAX=       4132.6476996994, 368969331,     0
$$ Real data points
##PAGE= N=1
##DATA TABLE= (X++(R..R)), XYDATA
$$ [...]
##PAGE= N=2
##DATA TABLE= (X++(I..I)), XYDATA
25079A624784L9890j25303o4393N5825J1949m8633l409N09P5010J86392r2502
25068A660119l7524J5082P2338J11039m5598j04283o0962o6876R2394P4070l0543
25057A679256m2653l8180k5223o7655j59196j1253J33848R1655j41098j16853
25047A302648q9151K22573o150j11069L2774J13099l6030p5375k9601P3897M9386
25036A447001K48162P5957p9075k16513j25872N1452K6223R5300J46143R232m4888
25025A633122n5672p0873K2656l3894L14185m0749k78236q5591M036q67j360p3727
25013A333030q034J30428J6617n477j58433k40666K7512Q6003R3423J05791J0567
25002A390761N1865J2971J69780L8843o4551J30684l1308j06967J15570m0289
$$ y = [1624784, 1664674, 1539371, 1474978, 1530803, 1542752, 1494119, 1490710, 1491219, 1566229, 1752621, 1660119, 1622595, 1637677, 1710015, 1821054, 1775456, 1671173, 1610211, 1543335, 1635729, 1709799, 1679256, 1636603, 1598423, 1573200, 1505545, 1346349, 1335096, 1468944, 1560599, 1419501, 1302648, 1213497, 1436070, 1429920, 1318851, 1351625, 1464724, 1428694, 1353319, 1323718, 1397615, 1447001, 1695163, 1771120, 1692045, 1475532, 1349660, 1401112, 1427335, 1522635, 1668778, 1678010, 1633122, 1577450, 1506577, 1529233, 1495339, 1809524, 1768775, 1490539, 1404948, 1408984, 1408117, 1406757, 1333030, 1324996, 1455424, 1472041, 1466564, 1308131, 1067465, 1094977, 1180980, 1274403, 1380194, 1390761, 1442626, 1455597, 1625377, 1664220, 1599669, 1730353, 1699045, 1592078, 1707648, 1667359]
24992A667359N0229L9984j43212l33851j74788J32943K53987R1994n7287l4561
24982A492797N8480M0661n0928k33913j7300J35979O9851M5641J00899j17798
24972A524369r9058K17737K14202M5780j95854j62397m3754J16728R1450J5783
24962A724986J8115j07163j23262k3779k339k7604N338O1048N8420M8192Q2718
24951A714670j24842k8706n872m9739J3920M0994M6034n6235j04307O8236J93158
24940A707311J15005n3460J5063j71243j57218q4958L9677Q1741k54Q0733O2412
24929A634809n4947l6841M6853K2685J2074n3718L2593J4149J12221K7815j22600
24918A635093n3542J0667R6142K05193J59443j19346j93792j76999m5848K73881
$$ y = [1667359, 1717588, 1757572, 1614360, 1280509, 1105721, 1238664, 1492651, 1584645, 1527358, 1492797, 1551277, 1591938, 1541010, 1307097, 1289797, 1425776, 1495627, 1541268, 1642167, 1524369, 1425311, 1643048, 1857250, 1903030, 1707176, 1544779, 1501025, 1617753, 1709203, 1724986, 1743101, 1635938, 1512676, 1488897, 1486558, 1458954, 1464292, 1525340, 1583760, 1631952, 1714670, 1589828, 1561122, 1555250, 1505511, 1519431, 1560425, 1606459, 1550224, 1445917, 1514153, 1707311, 1822316, 1768856, 1783919, 1612676, 1455458, 1370500, 1410177, 1491918, 1491664, 1572397, 1634809, 1579862, 1543021, 1589874, 1612559, 1624633, 1570915, 1603508, 1617657, 1729878, 1757693, 1635093, 1581551, 1592218, 1688360, 1893553, 2052996, 1933650, 1739858, 1562859, 1517011, 1790892]
24908A790892j03685j40786L5430J7331Q4504p77j01284m3035j20645K6418O4584
24897A508947Q8376J25042m0656m4442P9119J44996j35225j22079l4461O4869
24887A634486j9238Q0317m1030k3974J21411l0712o2065l8790o4010m4847J3041
24876A524589J58242J5908Q1429j06661r4489O845J05033m5884j6773k5480l5613
24865A567146j47865l5559K8402K2594J9575Q3542M7169R4846N3455k4543J04234
24854A812996k79603j69122p65Q0247N9330J03869M9413j7431K1298r4990j53893
24843A411349l3070p0509m9678L78014K46209j72786k58808j49785J74953L6710
24833A512599k9529J41774J25657l0721k7009j3217Q1798j0929p3562j53721j06037
$$ y = [1790892, 1687207, 1546421, 1581851, 1599182, 1683686, 1682909, 1581625, 1538590, 1417945, 1444363, 1508947, 1597323, 1722365, 1681709, 1637267, 1716386, 1861382, 1726157, 1604078, 1569617, 1634486, 1615248, 1695565, 1654535, 1630561, 1751972, 1721260, 1659195, 1620405, 1556395, 1511548, 1524589, 1682831, 1698739, 1780168, 1673507, 1579018, 1585863, 1690896, 1645012, 1628239, 1602759, 1567146, 1419281, 1383722, 1412124, 1434718, 1454293, 1537835, 1585004, 1679850, 1733305, 1708762, 1812996, 1533393, 1364271, 1363506, 1443753, 1503083, 1606952, 1656365, 1638934, 1660232, 1565242, 1411349, 1378279, 1307770, 1258092, 1636106, 1882315, 1709529, 1450721, 1300936, 1475889, 1512599, 1483070, 1624844, 1750501, 1719780, 1692771, 1679554, 1761352, 1750423, 1676861, 1523140, 1417103]
24822A417103R2683J7671Q531L7247L9396q7019M8001M6849p7108K6811K2173
24811A592338O4635J36584j93837j86754j956J03690L17480P0567r18Q484L3257
24800A943570R4933j24469j32645O5654J86962r8973m2022j84501k13461J41253
24790A636301r480k10722Q0307J88563P7562j25108r2543K2982L0547K6971P6803
24779A702183n7633k27295J760J44114K0012o3878P4375J29816j09340j73662
24769A440452J7884R6190J41556J95219L3090P1618K45j89171P5367r4233l0467
24758A757750r0468N9550R3423q4295j93537Q2836P6725P9002j0072j43895L5831
24747A662850R8744o4814M0857J94153m5787p8588j14861j6055j5479j55803Q6333
$$ y = [1417103, 1509786, 1527457, 1535988, 1573235, 1612631, 1525612, 1573613, 1620462, 1543354, 1570165, 1592338, 1656973, 1793557, 1599720, 1412966, 1411010, 1514700, 1832180, 1902747, 1901829, 1910313, 1943570, 2038503, 1914034, 1781389, 1847043, 2034005, 1935032, 1893010, 1708509, 1495048, 1636301, 1626821, 1416099, 1496406, 1684969, 1762531, 1637423, 1544880, 1567862, 1598409, 1625380, 1702183, 1644550, 1417255, 1419015, 1563129, 1583141, 1519263, 1593638, 1723454, 1614114, 1440452, 1458336, 1554526, 1696082, 1891301, 1924391, 1996009, 1996254, 1807083, 1882450, 1788217, 1757750, 1667282, 1726832, 1820255, 1735960, 1542423, 1625259, 1701984, 1780986, 1770914, 1627019, 1662850, 1761594, 1696780, 1737637, 1931790, 1886003, 1807415, 1692554, 1676499, 1661020, 1505217, 1591550]
24736A591550k4448M2693P3781k2639j00410k8018m9099J3715J86242J68604L5594
24725A887565R0495N5257P9214l0860k12782m02725j11276K39633J93459K03427
24715A991407Q4264j75870k11953r0867l4482j24189P6864P7201J26030j7804
24705A700601p1020J32497J77822r8826j57808q9471J69126K51635m0656n9924
24695A913976j74603j07896J37027J78857K8813O7689l351j32297j01686j20221
24685A686308m2178p7597j40200o8764j1822K15524K32499m0190K7945J22157
24675A903682J72239r3162j21299j19045j22169j16870j20531J47285K03114J25896
24665A859140n9492J2814l0743j63311r2344l9096J1517j38476Q5404R5374P8963
$$ y = [1591550, 1567102, 1609795, 1683576, 1660937, 1560527, 1532509, 1483410, 1497125, 1683367, 1851971, 1887565, 1978060, 2033317, 2112531, 2081671, 1868889, 1466164, 1354888, 1594521, 1787980, 1991407, 2075671, 1899801, 1687848, 1596981, 1562499, 1438310, 1515174, 1592375, 1718405, 1700601, 1629581, 1762078, 1939900, 1841074, 1683266, 1593795, 1762921, 2014556, 1973900, 1913976, 1739373, 1631477, 1768504, 1947361, 1976174, 2043863, 2040512, 1908215, 1806529, 1686308, 1644130, 1566533, 1426333, 1357569, 1345747, 1561271, 1793770, 1753580, 1781525, 1903682, 2075921, 1982759, 1861460, 1742415, 1620246, 1503376, 1382845, 1530130, 1733244, 1859140, 1799648, 1812462, 1781719, 1618408, 1526064, 1486968, 1498485, 1360009, 1445413, 1540787, 1619750]
24654A619750K39458K5630n7024M977j82350j18983M6219R5766j2760M674q6555
24643A578802j24675L2940M1630j21746n2142J66761J98708R9663n6615j02003
24633A661323j16698O7758J62338M0539k8398j62612l8503k0518p1773j47402
24623A346054K03620J53764n2715r0979j32630J2335r325J5620m0361J17450J20882
24612A643715J31744Q3674j51618K24947o3106k73393N486Q6199J20030O814N1086
24601A865578j9698j116O1949j55639k38810o674Q4391k5231m0700P7705k2965
24590A578790o9896L69N2937P7144K6907P8444M089Q79K3609n2565n3128O9059
24578A736638R6019L4006p2208p6873o5860q4626q8504K31039J01829N5477q259
$$ y = [1619750, 1859208, 1884838, 1827814, 1832791, 1650441, 1531458, 1577677, 1673443, 1660683, 1665357, 1578802, 1454127, 1487067, 1528697, 1406951, 1354809, 1521570, 1720278, 1819941, 1763326, 1661323, 1544625, 1612383, 1774721, 1815260, 1786862, 1624250, 1585747, 1565229, 1493456, 1346054, 1549674, 1703438, 1650723, 1559744, 1427114, 1439449, 1430124, 1445744, 1405383, 1522833, 1643715, 1775459, 1859133, 1707515, 1932462, 1869356, 1595963, 1601449, 1687648, 1807678, 1814492, 1865578, 1845880, 1844764, 1906713, 1751074, 1512264, 1505590, 1589981, 1564750, 1524050, 1601755, 1578790, 1508894, 1509263, 1562200, 1639344, 1666251, 1744695, 1748784, 1749663, 1773272, 1720707, 1667579, 1736638, 1832657, 1866663, 1794455, 1717582, 1651722, 1567096, 1478592, 1709631, 1811460, 1866937, 1858678]
24567A858678m6150p3335L9536m9300L7051j6624L0692m0304o7301o6478P5423
24556A681888J5174k6200p811J4967j94957o0410J81197L5051R2132O7605N9953
24545A858589J3933j71510j28234R8227j2482j08674K5572r7523M7671K3921J4696
24534A564186K9937L2792O2189N7163q6244m4081p5710J32596K09401J67958K219
24523B052406j04631j13872l7313k21258j12074P8860J01443K49933L8628m12
24513A931710L9591J60999l6400j19977m8107K6221l0963o8820J9009P0718P4630
24502B018611o4123J8999m9093j26453j6106n5928o6177Q4457J04338N0363k1943
24491A876945k05414j41839m4371K3215r0220j07372K11206J43150q839j33854
$$ y = [1858678, 1812528, 1739193, 1778729, 1729429, 1766480, 1749856, 1780548, 1740244, 1672943, 1606465, 1681888, 1697062, 1670862, 1663051, 1678018, 1483061, 1422651, 1603848, 1638899, 1731031, 1798636, 1858589, 1872522, 1701012, 1572778, 1671005, 1658523, 1549849, 1575421, 1477898, 1525569, 1549490, 1564186, 1594123, 1626915, 1689104, 1746267, 1660023, 1615942, 1540232, 1672828, 1882229, 2050187, 2052406, 1947775, 1833903, 1796590, 1575332, 1463258, 1542118, 1643561, 1893494, 1932122, 1931710, 1971301, 2132300, 2095900, 1975923, 1927816, 1954037, 1923074, 1854254, 1873263, 1943981, 2018611, 1954488, 1973487, 1924394, 1797941, 1781835, 1725907, 1659730, 1744187, 1848525, 1898888, 1876945, 1671531, 1529692, 1485321, 1508536, 1418316, 1310944, 1522150, 1665300, 1656461, 1522607]
24481A522607O8941J57158m9778j24656M2648r0653r561J46564Q7254R9951j28997
24470A721478j9159K58277L2234k01855j19755J9356O9686J59529J88550R239
24460B117580j59963k72779j29360R4794N1492J24128J41255k22958o7845q2671
24450A593673n3150J09506J01560n1981L2568P7796J2407K7054p5169j20732j08188
24439A545344N6297O8141K4827Q222L2558n0936R9677l5856q6202N594Q9548n4024
24427A703190j67928J55904J457j35926o6513J35018K70108K13974O6966j46969
24417B029281j16127j80175j38272Q3446K61381K7325q7272m2917r976J95772
24407B022466K41482r1560j37913j76366j70493K0935Q5755J06351o4717n1953
$$ y = [1522607, 1591548, 1748706, 1698928, 1574272, 1616920, 1526267, 1516706, 1663270, 1750524, 1850475, 1721478, 1702319, 1960596, 1992830, 1790975, 1671220, 1690576, 1760262, 1919791, 2108341, 2117580, 1957617, 1684838, 1555478, 1650272, 1701764, 1825892, 1967147, 1744189, 1676344, 1593673, 1540523, 1650029, 1751589, 1699608, 1732176, 1809972, 1822379, 1849433, 1774264, 1653532, 1545344, 1601641, 1669782, 1694609, 1702831, 1735389, 1684453, 1784130, 1748274, 1662072, 1667666, 1757214, 1703190, 1535262, 1691166, 1692623, 1556697, 1490184, 1625202, 1895310, 2109284, 2176250, 2029281, 1913154, 1732979, 1594707, 1678153, 1939534, 1966859, 1879587, 1836670, 1826694, 2022466, 2263948, 2172388, 2034475, 1858109, 1687616, 1708551, 1794306, 1900657, 1835940, 1783987]
24397A783987K319J68864P6074k08126j78366M0278J57972k8191j3491m5485m1704
24386A714131O9028Q269N2100n0712l0412K5804r4906M4937R462P0086L0588o157
24374A842218r4463O9227m0176j12659K4531K46595j1105P3747R689n5584n8395
24363A893625j51693j19619Q841R8518j08153o4053J45315L7058Q7853m1032j07154
24352A679506L5573p0517P8989J23516k5810o319P0039o1214J08691j83819j59752
24341A588883M0409J18011J27827J16411P1020K8614n2413l03512o3222J11981
24331A784009l5159j56055q1415k4149L8302J18879J77812J72427L7651Q295n3502
24320A987095j64029m1323M5002Q109O983k3504M0859k3557m1005J14279M6019
$$ y = [1783987, 1786306, 1955170, 2031244, 1823118, 1644752, 1685030, 1843002, 1814811, 1801320, 1755835, 1714131, 1783159, 1791428, 1843528, 1792816, 1762404, 1788208, 1693302, 1738239, 1747701, 1817787, 1848375, 1842218, 1747755, 1816982, 1776806, 1664147, 1688678, 1935273, 1924168, 1997915, 2007604, 1952020, 1893625, 1741932, 1622313, 1631154, 1729672, 1621519, 1557466, 1702781, 1739839, 1827692, 1786660, 1679506, 1715079, 1644562, 1723551, 1847067, 1821257, 1814938, 1884977, 1823763, 1932454, 1748635, 1588883, 1629292, 1747303, 1875130, 1991541, 2062561, 2091175, 2038762, 1735250, 1672028, 1784009, 1748850, 1592795, 1511380, 1487231, 1525533, 1644412, 1822224, 1994651, 2032302, 2040597, 1987095, 1823066, 1781743, 1826745, 1834854, 1841837, 1818333, 1859192, 1835635, 1794630, 1908909, 1954928]
24309A954928J05240J76537m7576j23730K1325j24176j04582L1631j58310o6498
24299A664789J31486J05194J50797o5811p9089r1779p7967L3965P0079k7520L4273
24288A848417Q3853Q3957j65778k56599Q984J37193Q6275o9337k0335O4612j86889
24277A614353n8436M5226M4741O3727J54720p239o2572J83297k6071j19415j38237
24266A694094j7065J19209J62461K9134j99041o2089K19207O6751j09223m5987
24256A857451L1189q2331l4993R5026L1101o5793K9724Q3958j9408j85096L7640
24245A778468j91006L6554R3751K0478O6666R4045K1579K4072k03850j37888K0098
24234A622967K9080K52354J34171J75710J6500N9668j67079k13197j7375o0650
$$ y = [1954928, 2060168, 2236705, 2189129, 2065399, 2086724, 1962548, 1857966, 1889597, 1731287, 1664789, 1796275, 1901469, 2052266, 1986455, 1907366, 1815587, 1737620, 1771585, 1841664, 1814144, 1848417, 1932270, 2016227, 1850449, 1593850, 1602834, 1740027, 1826302, 1756965, 1736630, 1801242, 1614353, 1555917, 1601143, 1645884, 1709611, 1864331, 1857092, 1794520, 1977817, 1951746, 1832331, 1694094, 1677029, 1796238, 1958699, 1987833, 1788792, 1726703, 1945910, 2012661, 1903438, 1857451, 1888640, 1806309, 1771316, 1866342, 1897443, 1831650, 1861374, 1945332, 1925924, 1740828, 1778468, 1587462, 1624016, 1717767, 1738245, 1804911, 1898956, 1920535, 1944607, 1740757, 1602869, 1622967, 1652047, 1904401, 2038572, 2214282, 2230782, 2290450, 2123371, 1910174, 1892799, 1832149]
24224A832149O1573L7997q1368k0152p8023j29698J11794K33722O5317j15011
24214A918300J7484J52324j30831q8500P7438m9481Q3034P3331k9151j11067j78831
24203A734050m8277O5452P6404k7375Q3658q4530o919K11963O6012j39067r2801
24192A838570K5910N8543J13217J677j03660o1416M9022r7669p1594O0000K8729
24181A841329k0897l5413J2582M1064j63692k0336J54232N2725K14296J25432
24171B201322k52148q8198P3227K5867n0649n44j12451O28J37915j79686j34926
24160A620357Q1878K70021J71768o9642k2946k24438m7520q4060Q1531J64983
24150A941932P5339j41449p6643k7539K30739L720j68824j38013J16228J91382
$$ y = [1832149, 1893722, 1931719, 1850351, 1830199, 1752176, 1622478, 1734272, 1967994, 2033311, 1918300, 1935784, 2088108, 1957277, 1868777, 1946215, 1896734, 1979768, 2053099, 2023948, 1912881, 1734050, 1685773, 1751225, 1827629, 1800254, 1883912, 1799382, 1792463, 2004426, 2070438, 1931371, 1838570, 1864480, 1923023, 2036240, 2037917, 1934257, 1872841, 1921863, 1824194, 1752600, 1812600, 1841329, 1820432, 1785019, 1797601, 1838665, 1674973, 1654637, 1808869, 1861594, 2075890, 2201322, 1949174, 1860976, 1934203, 1960070, 1909421, 1908877, 1796426, 1797054, 1934969, 1755283, 1620357, 1702235, 1972256, 2144024, 2074382, 2051436, 1826998, 1779478, 1695418, 1776949, 1941932, 2017271, 1875822, 1799179, 1771640, 2002379, 2006099, 1837275, 1699262, 1815490, 2006872]
24140B006872j5446k3569j6232q9858l0741J28639J91807M8518q7349p1828k67197
24129A773616K1737L1142M6891Q4367k3999j22364O4210K04933J44832j35443
24119B089922n6073j00437J0912K9146j15173j21127j07285O3975K7743K24080
24109A945683J96381n1154j86634O3782O7877r9671K3094R5487o0076o7706K7840
24098A954903p371K566K7178j33657l7732P1545m5730j77806m9248J89657Q7750
24087A882055j4980L7193P2713J054j80829n0132p9688J36193K39580P0475J0021
24076B123655j27931r9453J40127J8606O963q016m6867j81498q21j30759K8208
24065A722214J7347k0417R9248J19974q1805m411J78402J40341p9513j82167j70525
$$ y = [2006872, 1991426, 1967857, 1951625, 1861767, 1831026, 1959665, 2151472, 2199990, 2112641, 2040813, 1773616, 1795353, 1826495, 1873386, 1957753, 1933754, 1811390, 1875600, 2080533, 2225365, 2089922, 2033849, 1933412, 1944324, 1973470, 1858297, 1737170, 1629885, 1693860, 1721603, 1945683, 2142064, 2090910, 1904276, 1968058, 2035935, 1936264, 1959358, 2054845, 1994769, 1927063, 1954903, 1947532, 1950098, 1977276, 1843619, 1805887, 1877432, 1831702, 1653896, 1604648, 1794305, 1882055, 1867075, 1904268, 1976981, 1978035, 1797206, 1747074, 1667386, 1803579, 2043159, 2113634, 2123655, 1995724, 1896271, 2036398, 2055004, 2061967, 2053951, 2007084, 1825586, 1824765, 1694006, 1722214, 1739561, 1719144, 1818392, 1938366, 1856561, 1852150, 2030552, 2170893, 2091380, 1909213, 1738688]
24054A738688Q3735J09568N0520l9058r0297o6961m5602Q8696J33092L5223o8926
24043A928678l2888o2165M2596L9572Q7927M0419n4730k50779k0638L08155p8793
24032A947354p1871n5806j56134l6096K59660K07225O6888j1384k19274q1742
24022A848820J08401M3552q163P335o5315o8533P6296L4662l7467j29615R2985
24011A902958r5671k11552J27121J23418J17219j33197l169Q9509k6492l4444
24001A855700J02364m6946O448J00844j3533j14372R3531n3852l5499J69158P980
23990B071823N4k98696r2339J54599k3590O1078l6674P6984J41821M2582P0529
23979B168171k9272K0079o2937j85251r4963L2048J85155k0039K0084J70531Q3404
$$ y = [1738688, 1822423, 1931991, 1982511, 1943453, 1853156, 1786195, 1740593, 1829289, 1962381, 1997604, 1928678, 1895790, 1833625, 1876221, 1915793, 2003720, 2044139, 1989409, 1738630, 1717992, 2026147, 1947354, 1875483, 1819677, 1663543, 1627447, 1887107, 2094332, 2161220, 2149836, 1930562, 1848820, 1957221, 2000773, 1992610, 1999945, 1934630, 1866097, 1942393, 1977055, 1939588, 1809973, 1902958, 1807287, 1595735, 1722856, 1846274, 1963493, 1830296, 1827127, 1916636, 1890144, 1855700, 1958064, 1911118, 1917566, 2018410, 2004877, 1890505, 1984036, 1930184, 1894685, 2063843, 2071823, 2071877, 1773181, 1680842, 1835441, 1811851, 1872929, 1836255, 1913239, 2055060, 2097642, 2168171, 2138899, 2158978, 2096041, 1910790, 1815827, 1847875, 2033030, 2012991, 2033075, 2203606, 2287010]
23968B287010o6288m5378j17974r4882l3286j0362L9167j25108j6915R9252K9166
23957A944402L143j66348o2861P3086J10475J70422K57030n9899j86896l3546
23947B049008o818L7696O345n208R5267J80006Q9442m1461j76445k56929j23917
23936A846986k7682m0240m8574O7185L37581o9244q6524J7157r025J18898l5436
23925B071082M5061R3807R728m3310j29371q040m2297Q6420l002J02116k71063
23914A911131j13534l4344P6752N3607J9240J15923l2219r055o6539O4990K37135
23903B223087P3855j43478l4488m0719q1896l1860M959R5853J7541j50149j13381
23892A819324o312m6350P9455O064l0838q423j8455r218L1972K1403Q134P8602
$$ y = [2287010, 2220722, 2175344, 2057370, 1962488, 1929202, 1918840, 1958007, 1832899, 1815984, 1915236, 1944402, 1947545, 1781197, 1718336, 1791422, 1901897, 2072319, 2329349, 2269450, 2082554, 2049008, 2042190, 2079886, 2086231, 2081023, 2176290, 2356296, 2445738, 2404277, 2227832, 1970903, 1846986, 1819304, 1779064, 1730490, 1797675, 2135256, 2066012, 1979488, 1996645, 1987620, 2106518, 2071082, 2116143, 2209950, 2219678, 2176368, 2046997, 2038957, 1996660, 2083080, 2080078, 2182194, 1911131, 1797597, 1763253, 1840005, 1893612, 1912852, 2028775, 1996556, 1987501, 1920962, 1985952, 2223087, 2296942, 2153464, 2118976, 2078257, 1996361, 1964501, 1969460, 2065313, 2082854, 1932705, 1819324, 1813012, 1766662, 1846117, 1852181, 1821343, 1812920, 1794465, 1785247, 1817219, 1838622, 1846756, 1925358]
23880A925358J54806p6584l5211n6747Q5157K47076j4277j44181k09485q4546
23870A791366J17528J0092O5239J36518P7936k0060k5421k4811r2779J5453n4968
23859A996093p4282m1809m4005Q2317P3333n4980m5210K87602K79916j4606o2823
23848B381546j09810k02936j41242n5073Q0704j18032j07405j9858R1961j43N9515
23837A859227J09997J0270m2925k0435J9757n729j8048r9347J48047K48243J36556
23826B345613J2487n2200l9039j08090j25136M4204R7118j28635l9219R4909q7861
23815B014151j4807k2887k0854J0298m227J20634J19684j7581n4907r3386j55832
23804A880286O5459Q9254j2453J13040J23481j03671J0844j9475j35092o2869
$$ y = [1925358, 2080164, 2003580, 1968369, 1911622, 1996779, 2243855, 2229578, 2085397, 1875912, 1791366, 1908894, 1918986, 1984225, 2120743, 2198679, 2178619, 2153198, 2128387, 2035608, 2051061, 1996093, 1921811, 1880002, 1835997, 1918314, 1991647, 1936667, 1891457, 2179059, 2458975, 2444369, 2381546, 2271736, 2068800, 1927558, 1872485, 1953189, 1835157, 1727752, 1707894, 1799855, 1799712, 1859227, 1969224, 1979494, 1936569, 1916134, 1935891, 1930162, 1912114, 1812767, 1960814, 2209057, 2345613, 2358100, 2305900, 2266861, 2158771, 2033635, 2077839, 2174957, 2046322, 2007103, 2102012, 2014151, 1999344, 1976457, 1955603, 1965901, 1961674, 2082308, 2201992, 2184411, 2129504, 2036118, 1880286, 1945745, 2034999, 2022546, 2135586, 2259067, 2155396, 2166240, 2146765, 2011673, 1948804]
23794A948804j8275j6692R9882k0839m1754L3196j14914k1587N3906J94645J31530
23783B227902Q4774P7164j31939k15247j03816J99978J9435o2672R2376j0374
23773B177581M0494K5134j39082n9845j5451o5734K8948L1528j35518m5558L2890
23762A875387l7825l3994J23984J2582J6722k3189r9508q5148m3784k18881R6936
23751A583282J30691M1404j3179J26912J34602L0827J43784P0411N230k17351
23741B036613j81583n9788L2233O7870P7807K5940J84201m767R3271J01062J8800
23730B391659r7683q3043J9963o5209o2809n2667K1465L1423p153R7573j6640
23719B176879L846p5036j69368o8422Q4606m9022N8104k4754k9314J79776J67056
$$ y = [1948804, 1930529, 1913837, 2013719, 1992880, 1951126, 1984322, 1869408, 1847821, 1901727, 2096372, 2227902, 2312676, 2389840, 2257901, 2042654, 1938838, 2138816, 2158251, 2095579, 2187955, 2177581, 2218075, 2243209, 2104127, 2044282, 2028831, 1963097, 1992045, 2023573, 1888055, 1842497, 1875387, 1837562, 1803568, 1927552, 1940134, 1956856, 1933667, 1834159, 1749011, 1705227, 1486346, 1583282, 1713973, 1755377, 1742198, 1869110, 2003712, 2034539, 2178323, 2248734, 2253964, 2036613, 1855030, 1795242, 1827475, 1895345, 1973152, 1999092, 2183293, 2178526, 2271797, 2372859, 2391659, 2293976, 2210933, 2230896, 2165687, 2102878, 2050211, 2071676, 2103099, 2095946, 2193519, 2176879, 2180725, 2105689, 1936321, 1867899, 1952505, 1903483, 1961587, 1936833, 1907519, 2087295, 2254351]
23708B254351j39739l8063J97229m4572n6208o6369p2983N3056o0802J58167J8638
23697B202705j14785p7150r058R8093J2165o0750n9046O0212Q2233R4334m7690
23686B181263q1901M7049o4416j44109K9275J26489O5535l1091J61457m8368j30875
23675B110308p8294J41768J97503J39141o8052m5873R0324J5998k04589j33231
23665B165003m2296l2512L9501J17655m982j55988L9417R5558j08722j11700j8579
23654A982355o0552l9813J87820R4863j54521O2364J71330n1683J08438j24451
23644B176150j00400m025J13320R0831L7475j5824p6326j96570j0138J64639J6770
23633B195902j46708j75033N7365J12753P3089r0665j69568M5079j21883j8098
$$ y = [2254351, 2114612, 2076549, 2273778, 2229206, 2172998, 2106629, 2033646, 2086702, 2025900, 2184067, 2202705, 2087920, 2010770, 2001712, 2099805, 2111970, 2051220, 1992174, 2052386, 2134619, 2228953, 2181263, 2099362, 2146411, 2081995, 1937886, 1967161, 2093650, 2159185, 2128094, 2289551, 2241183, 2110308, 2032014, 2173782, 2371285, 2510426, 2442374, 2396501, 2486825, 2502823, 2298234, 2165003, 2122707, 2090195, 2129696, 2247351, 2242369, 2086381, 2125798, 2221356, 2112634, 2000934, 1982355, 1921803, 1881990, 2069810, 2164673, 2010152, 2072516, 2243846, 2192163, 2300601, 2176150, 2075750, 2071725, 2185045, 2275876, 2313351, 2297527, 2221201, 2024631, 2014493, 2179132, 2195902, 2049194, 1874161, 1931526, 2044279, 2117368, 2026703, 1857135, 1902214, 1780331, 1762233]
23623A762233J17157J22935J79715O6097O8015j18776k32263O6680Q2141M979
23613B118913m3880J9311O2421J5500P162P1393P68m407K2196l3863k683p9926
23601B152905p9277J3060j10277k3683J51970J08879p0131N3107P8845P290j58726
23590B123962n2078q195Q2131K702r2376l5930j36700p7596P3531l6820k8819
23579A813812L4933N0264P4340m000P5504K30968K00546m1040o5442m7599J59135
23568B481421J0614J1359O1702P6521k3086j35543l882r6080j15516j23710O1321
23557B205121P1808j9760M6085L4715j19734J00389Q1591J10105p4246j77400
23547B258674j01617J3621J6349n8996O9947R374J29227J49917j41022j02075
$$ y = [1762233, 1879390, 2002325, 2182040, 2248137, 2316152, 2197376, 1965113, 2031793, 2113934, 2118913, 2075033, 2094344, 2156765, 2172265, 2179427, 2250820, 2251588, 2247181, 2269377, 2235514, 2232831, 2152905, 2073628, 2086688, 1976411, 1952728, 2104698, 2213577, 2143446, 2196553, 2275398, 2282688, 2123962, 2071884, 2063689, 2145820, 2148522, 2056146, 2020216, 1883516, 1805920, 1879451, 1842631, 1813812, 1848745, 1899009, 1973349, 1969349, 2044853, 2275821, 2476367, 2435327, 2369885, 2322286, 2481421, 2492035, 2503394, 2565096, 2641617, 2618531, 2482988, 2479106, 2383026, 2267510, 2143800, 2205121, 2276929, 2257169, 2303254, 2337969, 2218235, 2318624, 2400215, 2510320, 2436074, 2258674, 2157057, 2170678, 2187027, 2128031, 2197978, 2207352, 2336579, 2486496, 2345474, 2243399]
23537B243399q3724R3147J69756P918p4268j43991m9420R9963n8181n2588j03207
23526B048804p5289K9230K06559K32743m527n4885j84139r9816N7611J13764N8387
23515B328442k9710j27590j08608p2826O8330N2061P9755n8718p0898O1391P1076
23504B192705j32242p0571p2203N4800J91553n1226j23875j96468J6320R0262
23494A899055J29598K87599m2252n2244J25596Q2608n5043q8979j27256q6046
23484B072636L314n6583L5010Q2640L8169J00102j61893k5127J64183j9115L2192
23473B265528l2782m2871n9538Q3614J15734o1064J999o4818J16762L9574j58611
23462B203527r2836q494l1200R3761L1441k0934J00672J18240N9642k7535j16310
$$ y = [2243399, 2159675, 2252822, 2422578, 2430496, 2356228, 2212237, 2162817, 2262780, 2204599, 2152011, 2048804, 1973515, 2002745, 2209304, 2442047, 2437520, 2382635, 2198496, 2098680, 2156291, 2270055, 2328442, 2298732, 2171142, 2062534, 1989708, 2058038, 2110099, 2189854, 2131136, 2060238, 2121629, 2192705, 2060463, 1989892, 1917689, 1972489, 2164042, 2112816, 1988941, 1792473, 1808793, 1899055, 2028653, 2316252, 2274000, 2221756, 2347352, 2429960, 2374917, 2285938, 2158682, 2072636, 2075950, 2019367, 2054377, 2137017, 2175186, 2275288, 2113395, 2088268, 2252451, 2233336, 2265528, 2232746, 2189875, 2130337, 2213951, 2329685, 2268621, 2270620, 2205802, 2322564, 2362138, 2203527, 2110691, 2102197, 2070997, 2164758, 2196199, 2175265, 2275937, 2394177, 2453819, 2426284, 2309974]
23451B309974N7466J61085J08457o7647k32138r5594L3011J05070k5102n7377
23441B297205m5351J08778j6269l9715K0194K0999k8061M928j30888o1209l1490
23430B099121O8022N1393K8506o2602J52869P0818J21147j12708l7476l4503J75039
23419B519626j72574o3812N5239n1074j18943N2640J36743Q2397P7049K159p6866
23408B442584m0201L4779m161n546l1910j16833k9399J10547J928o9865j23013
23397B168910j55449O5045M2511p9270j74764J02765J74524P7731R2784l2041
23387B282746m8110R2323N5519J02282P721j72213o8693M3829n2015O7496J5620
23376B326505j11303K9535q0975q8532R6154J70877o894L5244Q4169j38177R8579
$$ y = [2309974, 2367440, 2528525, 2636982, 2569335, 2337197, 2241603, 2274614, 2379684, 2354582, 2297205, 2251854, 2360632, 2344363, 2304648, 2324842, 2345841, 2317780, 2322708, 2191820, 2130611, 2099121, 2167143, 2218536, 2247042, 2184440, 2337309, 2408127, 2529274, 2416566, 2379090, 2344587, 2519626, 2347052, 2283240, 2338479, 2287405, 2168462, 2221102, 2357845, 2440242, 2517291, 2519450, 2442584, 2402383, 2437162, 2433001, 2427455, 2395545, 2278712, 2249313, 2359860, 2361788, 2291923, 2168910, 2013461, 2078506, 2121017, 2041747, 1866983, 1969748, 2144272, 2222003, 2314787, 2282746, 2234636, 2326959, 2382478, 2484760, 2492481, 2320268, 2251575, 2295404, 2243389, 2310885, 2326505, 2215202, 2244737, 2163762, 2075230, 2171384, 2342261, 2335367, 2370611, 2454780, 2316603, 2415182]
23365B415182K4589j98097Q1725J48118j6916n9737o6068j44572q9688L6789O7353
23354B198678N5585J17904J61181o662k67775M4107R035J8502q3980K1272j00094
23343B167753J58566P1303L536j16737K8613J54704M7826k29977j35646J36897
23333B286838J64221q8840j44413J9485J7597N3417p1249L4770M6382N3496q7800
23322B283904J6128Q2323J48689J23958j37442j75936j56199o9986o549J48562
23312B257452J20024j1329K1951J2555J52103J22263k3844k21993j20423O7513
23302B376272J53205j21319j07662j45448j4971J70598K5802L4194l2204l7372
23292B301095n9541M2475J13078L3470m2766o7858j07434M3673K75944K2075r1161
$$ y = [2415182, 2439771, 2241674, 2323399, 2471517, 2454601, 2394864, 2328796, 2184224, 2094536, 2131325, 2198678, 2254263, 2372167, 2533348, 2526686, 2258911, 2303018, 2312053, 2330555, 2246575, 2267847, 2167753, 2326319, 2397622, 2401158, 2284421, 2313034, 2467738, 2515564, 2285587, 2149941, 2286838, 2451059, 2362219, 2217806, 2237291, 2254888, 2308305, 2237056, 2271826, 2318208, 2371704, 2283904, 2300032, 2382355, 2531044, 2655002, 2517560, 2341624, 2185425, 2115439, 2108890, 2257452, 2377476, 2366147, 2388098, 2400653, 2552756, 2675019, 2651175, 2429182, 2308759, 2376272, 2529477, 2408158, 2300496, 2155048, 2140077, 2310675, 2336477, 2370671, 2338467, 2301095, 2241554, 2284029, 2397107, 2430577, 2387811, 2319953, 2212519, 2256192, 2532136, 2554211, 2463050]
23281B463050r6594r6156l8301j07695J3655J55437j7413J91624M7014L0170j48678
23270B396113l8859k8627k3711R844K5503k59926j21520J26037K75426J19864
23260B480144j9733j14803j30553J18971J74103K02336P8571j62931k71869R9566
23250B453802J17479j57635k6413J0427k9495j1307O4524L6833o3832j63883J94438
23239B424938K8420p1890j20138J10914j2302P566J55152R6660j37304N9494J13015
23228B654525j74637m8978M0461K3387q7949q3482L1814J24408L8755J20396J39375
23217B778075j77348m5193r1252L6491K8186j12535j78423l3280J68130R8783
23207B471634m9435l9434K493N0327m9532j2191j1366K4217J57680Q3267j33037
$$ y = [2463050, 2366456, 2270300, 2231999, 2124304, 2137959, 2293396, 2275983, 2467607, 2514621, 2544791, 2396113, 2357254, 2328627, 2304916, 2314760, 2340263, 2080337, 1958817, 2084854, 2360280, 2480144, 2460411, 2345608, 2215055, 2334026, 2508129, 2710465, 2789036, 2626105, 2354236, 2453802, 2571281, 2413646, 2387233, 2397660, 2368165, 2356858, 2421382, 2458215, 2394383, 2230500, 2424938, 2453358, 2381468, 2261330, 2372244, 2359942, 2367508, 2522660, 2619320, 2482016, 2541510, 2654525, 2479888, 2430910, 2471371, 2494758, 2406809, 2323327, 2355141, 2479549, 2518304, 2638700, 2778075, 2600727, 2555534, 2464282, 2500773, 2528959, 2416424, 2238001, 2204721, 2372851, 2471634, 2422199, 2382765, 2385258, 2435585, 2386053, 2373862, 2362496, 2386713, 2544393, 2627660, 2494623]
23196B494623l9509J32507J3523j37343j21677O1972j6555r3678p4335m0761J32475
23185B311242L2536J8016j13186k6501p0420p5803J20720J99647J6305k557P4051
23174B484050k9567N1306J8154P2715j05766o7732l5292M2900l4670J21905O1550
23163B579553j51838o1123P5556J16432p2214N0743m2574j18369j23015Q1707
23153B334858K14917R8201j07580j19923L4583m2960J14499J20427L6748m2154
23143B641616p9902j21996m9399q2028j70448k9981L6434J08552J47267R5469
23133B495584o3482J13281j02809p3566J06033m0389p4159j74904j57611J2106
23123B040084M5449J09934R8468K6753R7254M6982o7077Q6561Q9565L466m0108
$$ y = [2494623, 2455114, 2587621, 2601144, 2463801, 2342124, 2404096, 2387541, 2293863, 2219528, 2178767, 2311242, 2343778, 2361794, 2248608, 2222107, 2151687, 2075884, 2196604, 2396251, 2412556, 2409999, 2484050, 2454483, 2505789, 2523943, 2596658, 2490892, 2423160, 2387868, 2430768, 2396098, 2518003, 2579553, 2427715, 2366592, 2442148, 2558580, 2486366, 2537109, 2494535, 2376166, 2253151, 2334858, 2549775, 2647976, 2540396, 2420473, 2455056, 2412096, 2526595, 2647022, 2683770, 2641616, 2561714, 2439718, 2390319, 2308291, 2137843, 2107862, 2144296, 2252848, 2400115, 2495584, 2432102, 2545383, 2442574, 2369008, 2475041, 2434652, 2360493, 2185589, 2027978, 2040084, 2085533, 2195467, 2293935, 2320688, 2417942, 2464924, 2397847, 2484408, 2573973, 2577439, 2537331]
23112B537331j18834J5312N8151j83616L9379P5631J85739K7588k07698r2117
23102B336866N6694l1053q2937Q2224N8949P8897j2099l7671j25321L5643K4523
23091B384715J0712q5681k4813K12510J1931j42591P1536j02394j6273J36076
23081B455728J44873J09944L9426P8867n0524k8655j05033o4097k9502r7541k9453
23070B424033J28575P5510j29542j71949j6173Q2303K61950j46840j02169J48146
23060B553844J34250j47351k35412k22166n8476J10588R0016J29468Q6847J8543
23050B460151m1971L6613j67287J8806J63828l2533m5373N6090J8192j5410j7318
23039B433788l6542j2963J4536j293o3508m2280m5284l9383j29389L7755R1483
$$ y = [2537331, 2418497, 2433809, 2491960, 2308344, 2347723, 2423354, 2609093, 2636681, 2428983, 2336866, 2393560, 2362507, 2279570, 2361794, 2420743, 2499640, 2487541, 2449870, 2324549, 2360192, 2384715, 2395427, 2309746, 2284933, 2497443, 2509374, 2366783, 2438319, 2335925, 2319652, 2455728, 2600601, 2710545, 2749971, 2828838, 2778314, 2749659, 2644626, 2580529, 2551027, 2453486, 2424033, 2552608, 2628118, 2498576, 2326627, 2310454, 2392757, 2654707, 2507867, 2405698, 2553844, 2688094, 2540743, 2305331, 2083165, 2024689, 2135277, 2225293, 2354761, 2441608, 2460151, 2418180, 2454793, 2287506, 2306312, 2470140, 2437607, 2392234, 2448324, 2466516, 2451106, 2433788, 2397246, 2384283, 2398819, 2397526, 2334018, 2291738, 2246454, 2207071, 2077682, 2115437, 2206920]
23028B206920O5011r9370P6521K51395J25862p0689M233l8733m6985J8062J5049
23017B507276j4719m430m1197L0089P4382J23048p3248p6166q0808p3109j08159
23006B262959K1143j4539n8272J0662P5212J19635j23808r2656J30927J84913
22996B516176o0116l6295L0191N2882O7097n2290j10099L9081j30088o0713J3473
22985B269299J91286K9492r1333k19j9395J64189J06948n1784N5807k9899M9929
22974B674320R0619k65181q6094K4064M1846k955J28246M8088j01765j0325j0297
22963B530566J20785J22963j8934K1928J0728M8587N8853q2604j89698j5248J3767
22952B621693k8722k5788k3150J48001k0545K8212j87415k6732o101M5327o7434
$$ y = [2206920, 2271931, 2172561, 2249082, 2500477, 2626339, 2555650, 2559883, 2521150, 2474165, 2492227, 2507276, 2492557, 2488127, 2446930, 2477019, 2551401, 2674449, 2601201, 2525035, 2444227, 2371118, 2262959, 2284102, 2269563, 2211291, 2221953, 2297165, 2416800, 2292992, 2200336, 2331263, 2516176, 2456060, 2419765, 2449956, 2502838, 2569935, 2517645, 2407546, 2446627, 2316539, 2255826, 2269299, 2460585, 2490077, 2398744, 2398525, 2379130, 2543319, 2650267, 2598483, 2654290, 2624391, 2674320, 2764939, 2499758, 2413664, 2437728, 2479574, 2476619, 2604865, 2652953, 2551188, 2540863, 2530566, 2651351, 2774314, 2755380, 2777308, 2788036, 2836623, 2895476, 2812872, 2623174, 2607926, 2621693, 2592971, 2567183, 2544033, 2692034, 2671489, 2699701, 2512286, 2485554, 2479453, 2524780, 2457346]
22941B457346j00890R9322N5840q4631J26912J42489n5925N2328q804k5654O3525
22930B721858l9620l1141j04125j18679O3113J58033M3887j2398q3830J64681
22920B761779r1856j96726n6918n336r3061M1487M3101L6816p9722N6308J64363
22909B580235p2858l1411J65435o2697j63166J027J58674P7818J3804N605k0250
22898B652216q2610N6895J80917J15675j40787j46715J90102K2368j23266q1810
22888B642985j7456j19566j2873J01253P3769M2416r365o1228J6767j8288j214
22877B637200L3550j0265l4447q8702K632m3605J32422R7756m037l8528L741L8708
22865B726425K4749k31497q0607K21712M7460l6941O3588J21175N2818j20112
$$ y = [2457346, 2356456, 2455778, 2511618, 2426987, 2553899, 2696388, 2640463, 2692791, 2683987, 2658333, 2721858, 2682238, 2651097, 2546972, 2428293, 2491406, 2649439, 2693326, 2680928, 2597098, 2761779, 2669923, 2473197, 2416279, 2410943, 2317882, 2359369, 2402470, 2439286, 2359564, 2415872, 2580235, 2507377, 2475966, 2641401, 2578704, 2415538, 2416565, 2575239, 2653057, 2666861, 2672466, 2652216, 2569606, 2626501, 2807418, 2923093, 2782306, 2635591, 2825693, 2848061, 2724795, 2642985, 2625529, 2505963, 2493090, 2594343, 2668112, 2710528, 2701163, 2639935, 2656702, 2638414, 2637200, 2670750, 2660485, 2626038, 2537336, 2539968, 2496363, 2628785, 2726541, 2722504, 2683976, 2687717, 2726425, 2751174, 2519677, 2439070, 2660782, 2708242, 2671301, 2734889, 2856064, 2908882, 2788770]
22855B788770m8044L8492J13850L8042o5108j29042j65538r8956n9732J13580
22845B526314J24954q8829Q7678k7478K5366J20059O0921k4608o9880K3021N9051
22834B816569L1959J07438j85347p4816O3364P4562J2819j58095p1692J46929
22824B763690k1156L9479P0832n754j08643o5085o4141M9303K9549n3744m6844
22813B587486j16178Q7503R3864m4892L9579J23800j04287p7936J20118R0301
22803B799358J30750p2792Q6123k21105l5395K809K5222P9656O0493k5597q6744
22792B742778j39943j58L7689p8950L4867L983P429N3578J17310K5999n1765r9404
22780B653413J04275L4081j36429r9991N6553l4809K14410K5363r8957j44354
$$ y = [2788770, 2740726, 2779218, 2893068, 2931110, 2866002, 2736960, 2571422, 2472466, 2412734, 2526314, 2651268, 2562439, 2650117, 2622639, 2648005, 2768064, 2828985, 2804377, 2734497, 2757518, 2816569, 2848528, 2955966, 2770619, 2695803, 2759167, 2833729, 2846548, 2688453, 2616761, 2763690, 2742534, 2782013, 2852845, 2847091, 2738448, 2673363, 2609222, 2658525, 2688074, 2634330, 2587486, 2471308, 2558811, 2652675, 2607783, 2647362, 2771162, 2666875, 2588939, 2709057, 2799358, 2930108, 2857316, 2943439, 2722334, 2686939, 2689748, 2714970, 2794626, 2855119, 2829522, 2742778, 2602835, 2602677, 2640366, 2561416, 2596283, 2600266, 2607695, 2661273, 2778583, 2804582, 2752817, 2653413, 2757688, 2791769, 2655340, 2555349, 2611902, 2577093, 2791503, 2816866, 2717909, 2573555]
22770B573555m2235R8800j0650L4824N0951o879l4334K5016p857m238O3885j25390
22758B615448o8713P5498P7451N8924j3369l21939j61518J19564R9965R71K17598
22747B699880R9802k68509r0747R2145J42843R6711R8286N0476m8622j96280r9174
22736B576811J7113l4731O2495J56190J37693R1902j84141l22046N2921K31100
22726B785307O9682n1702J2089P6592j7740n1662k0149l0670Q360k08342j22526
22715B449239N6435l6627J07679J14978Q0247n3180j52452j73054N8772J75091
22705B627128R3498m5426j05736J16338J11209k2600O2173j36347o7171L1347
22695B664413J0205p3137K3709K0829l1687m4176O3716M1034O0m0398K879J30701
$$ y = [2573555, 2531320, 2630120, 2619470, 2654294, 2705245, 2698366, 2664032, 2689048, 2681191, 2676953, 2740838, 2615448, 2546735, 2622233, 2699684, 2758608, 2745239, 2423300, 2261782, 2381346, 2481311, 2482282, 2699880, 2799682, 2531173, 2440426, 2532571, 2675414, 2772125, 2870411, 2920887, 2872265, 2675985, 2576811, 2593924, 2559193, 2621688, 2777878, 2915571, 3007473, 2823332, 2501286, 2554207, 2785307, 2854989, 2803287, 2815376, 2891968, 2874228, 2822566, 2802417, 2771747, 2780107, 2571765, 2449239, 2505674, 2469047, 2576726, 2691704, 2771951, 2718771, 2566319, 2393265, 2452037, 2627128, 2720626, 2675200, 2569464, 2685802, 2797011, 2774411, 2836584, 2700237, 2633066, 2664413, 2674618, 2601481, 2625190, 2646019, 2614332, 2570156, 2633872, 2674906, 2674966, 2634568, 2637447, 2768148]
22683B768148M1938J7581j71253j49660l823L5356R6354Q9826O9882J26377j77646
22672B743080j28264j36767L1209M3628J15487P8707J08592L5917r6540J773L6879
22661B833701M8376P9375M8794l7836j81331m6174K2532J08027L3092m5711m338
22650B858507p9367r3119L1601R5124r7333n2280J05355M3723o6126l639J8997
22639B761443Q4655P0421L5611j2575L9267k7810j43052p6595l0989p6769N6576
22628B680183P3963j5325M1006J21453j9223n7800Q9942n1589j91461l2358O0819
22617B699610K7625J19965l5643l4737K5285k118R2478J03702k1957J43174n5331
22606C062053o8416J33295o4521o2219j02680o3395k5736J6848R8284k0948n465
$$ y = [2768148, 2810086, 2827667, 2656414, 2506754, 2502931, 2538287, 2634641, 2724467, 2794349, 2920726, 2743080, 2614816, 2478049, 2509258, 2552886, 2668373, 2747080, 2855672, 2891589, 2795049, 2796822, 2833701, 2882077, 2961452, 3010246, 2972410, 2791079, 2744905, 2767437, 2875464, 2908556, 2862845, 2858507, 2779140, 2686021, 2717622, 2812746, 2715413, 2663133, 2768488, 2812211, 2746085, 2742446, 2761443, 2846098, 2916519, 2952130, 2939555, 2978822, 2951012, 2807960, 2731365, 2700376, 2623607, 2680183, 2754146, 2738821, 2779827, 2901280, 2882057, 2824257, 2914199, 2862610, 2671149, 2638791, 2699610, 2727235, 2847200, 2811557, 2776820, 2802105, 2799987, 2892465, 2996167, 2974210, 3117384, 3062053, 2993637, 3126932, 3062411, 3000192, 2897512, 2834117, 2808381, 2825229, 2923513, 2902565, 2897100]
22595B897100K5707L6014P9234Q484k9149k07601O5821P4239j51111j21838J18970
22584B795870p607j62024P0325K2781J10639L752k2287n2884J01965J60384K6113
22573C047027n158r0139j18998l7202J34297J15189L1164k04812m7776j4544O2166
22562B871214O0658M8602O3450R8721Q2902j12963j04334q7966J17076M82R2901
22551C130743M189K14302j1224q3716r4462j07571k6053j04948m0370L0018P2093
22540B983001J25352M4860M690q8172k6725k15325q4270m5883k3705q955P839
22529B672707n8905K29107P9646Q922J9066l9920n3562k5493N851K2647M879o8611
22517B796334J1199R6315N5238l4271o5651J09266m129p1542J07379l7980j9640
$$ y = [2897100, 2922807, 2958821, 3038055, 3046539, 3017390, 2809789, 2875610, 2949849, 2798738, 2676900, 2795870, 2788263, 2626239, 2696564, 2719345, 2829984, 2833736, 2811449, 2758565, 2860530, 3020914, 3047027, 3041869, 2951730, 2832732, 2795530, 2929827, 3045016, 3076180, 2871368, 2823592, 2809048, 2871214, 2931872, 2980474, 3043924, 3142645, 3225547, 3112584, 3008250, 2920284, 3037360, 3037842, 3130743, 3134932, 3349234, 3338010, 3254294, 3159832, 3052261, 3026208, 2921260, 2880890, 2910908, 2983001, 3108353, 3153213, 3157903, 3069731, 3043006, 2827681, 2743411, 2697528, 2673823, 2664868, 2672707, 2613802, 2842909, 2922555, 2931477, 2950543, 2910623, 2857061, 2831568, 2837419, 2860066, 2864945, 2796334, 2807533, 2903848, 2959086, 2924815, 2859164, 2968430, 2964301, 2892759, 3000138, 2962158, 2942518]
22506B942518Q6676k3786O7807m4885j07192O0709j58553J36571J76892L2842
22496C169599k4235m5386n8388j61772J44394n5766k8521M100m772r9956j96618
22485B642679n3985L4251j56J37469K37707k1031M2584J22066J01946o9981p6704
22474C096845j1599j44905J6541n8753l3695j06370Q1371M8168P3762Q2521n5884
22463B988002n7085m4372J674j02902o2513K00375J15699k8935q4783J67930o5099
22452C027991r3713L4601Q3664r9983l6285L5287j776Q1991r3485M2589m7187
22441B933694O6692J5648l687L4293J8372j41988j5722J35970K64q7712n1035
22430B904789q2019m1528j11553O0059l1572k8743J69169J24818r2272m0441L5838
$$ y = [2942518, 3029194, 3005408, 3073215, 3028330, 2921138, 2981847, 2823294, 2959865, 3136757, 3169599, 3145364, 3099978, 3041590, 2879818, 3024212, 2968446, 2939925, 2944025, 2939253, 2839297, 2642679, 2588694, 2622945, 2622789, 2760258, 2997965, 2976934, 3019518, 3141584, 3243530, 3173549, 3096845, 3085246, 2940341, 2956882, 2898129, 2864434, 2758064, 2839435, 2887603, 2961365, 3043886, 2988002, 2930917, 2886545, 2888219, 2785317, 2722804, 2923179, 3038878, 3009943, 2925160, 3093090, 3027991, 2934278, 2968879, 3052543, 2952560, 2916275, 2951562, 2949786, 3031777, 2938292, 2980881, 2933694, 3000386, 3016034, 3012347, 3046640, 3065012, 2923024, 2907302, 3043272, 3043536, 2955824, 2904789, 2822770, 2781242, 2669689, 2729748, 2698176, 2669433, 2838602, 2963420, 2871148, 2830707, 2866545]
22419B866545r5808O7647k6298l3860l5175l6865N297Q6461j06575j14881K8936
22408B605424O6937K53964J14690q6339O4864P2838j35516m7668O5702j95987
22398B778909j1452K0112J38999K4995j062j20381r9573J03735O5684K1669J07178
22387C028813J44494n0646M8119o5653j2939r9405j59487r3582L7789R8533M5894
22376B921930K8057K1603j7478J02711K0865j34044J16863J29106j31227j24948
22366B933438j8584M3450j456M9973m96K4315r0555n1582n0360q741J11711M5744
22354B986857J98962M6943j48223j32781p68k0297J46115M3611n7580K7535J9751
22343C110125O2543p5716k2268j19030j88571l8047J98591O8332N7804r4208L2526
$$ y = [2866545, 2770737, 2838384, 2812086, 2778226, 2743051, 2706186, 2711483, 2797944, 2691369, 2576488, 2605424, 2672361, 2926325, 3041015, 2954676, 3019540, 3092378, 2956862, 2909194, 2974896, 2778909, 2767457, 2787569, 2926568, 2951563, 2950501, 2830120, 2730547, 2834282, 2899966, 2921635, 3028813, 3173307, 3122661, 3170780, 3105127, 3092188, 2992783, 2833296, 2739714, 2777503, 2876036, 2921930, 2949987, 2971590, 2954112, 3056823, 3077688, 2943644, 3060507, 3189613, 3058386, 2933438, 2914854, 2958304, 2956848, 3006821, 3006325, 3030640, 2940085, 2888503, 2838143, 2829402, 2941113, 2986857, 3185819, 3232762, 3084539, 2951758, 2950990, 2930693, 3076808, 3120419, 3062839, 3090374, 3110125, 3172668, 3096952, 3074684, 2955654, 2767083, 2729036, 2927627, 2995959, 3053763, 2959555, 2992081]
22332B992081J05777n614j8544K9321l8354J76101m6185p6647J8025k11478Q555
22321B933038k916p3005m6727P2921R7610J23480p134j92603j31665J73286J34530
22310C080815j28789o3168Q2591J73760m7295k2111J35260O6530j7529j33091
22300C126973l8627J29181k4953n2516r0011N1039L2519l5031M4434M9807j26798
22289C066017n2052O7070M1481k7866K1770k4362J84293n0774O5413L0900r4487
22278C227403j84782r4954J62052P3602J2146O940O9702K3413j11911k65149O2687
22267B981149R9437J91859P6521j25004j20586Q9374j05691J894n0562R4297J8944
22256C151632R7318j2161j79229m7084J6999L823k3655n6228j33707M1751n1764
$$ y = [2992081, 3097858, 3092244, 3073700, 3103021, 3064667, 3240768, 3194583, 3117936, 3135961, 2924483, 2933038, 2930122, 2857117, 2810390, 2883311, 2980921, 3104401, 3097267, 2904664, 2772999, 2946285, 3080815, 2952026, 2888858, 2971449, 3145209, 3097914, 3075803, 3211063, 3277593, 3260064, 3126973, 3088346, 3217527, 3192574, 3140058, 3050047, 3101086, 3133605, 3098574, 3143008, 3192815, 3066017, 3013965, 3081035, 3122516, 3094650, 3116420, 3092058, 3276351, 3225577, 3290990, 3321890, 3227403, 3042621, 2947667, 3109719, 3183321, 3195467, 3202407, 3272109, 3295522, 3183611, 2918462, 2981149, 3080586, 3272445, 3348966, 3223962, 3103376, 3192750, 3087059, 3088953, 3038391, 3132688, 3151632, 3248950, 3236789, 3057560, 3010476, 3027475, 3031298, 3007643, 2951415, 2817708, 2859459, 2807695]
22245B807695l044K08419l6627q8427J87691K75l2126j13002k9184J48124m8191
22234C001603l1555k2161j5217J7678j5410j3309J06836J6853K01649k5587m1603
22223C179777Q4227m6433j03608M1378j6369r6501O3059r807J60205Q6028L2662
22212C374618l2962m8873m9935K4136M1222j28861J0151j086J73825Q8438j70987
22201C279686o164p2063j35332n24J7781R1033Q2691m283R1651J55375K69l7548
22189C462572l8501j45768J02444K5102Q9823J41258l55256j86713J01205J3285
22179C209451K2595M3371k8867J88712J94889J21455r5322j82911j63372L9402
22169C349403J13398j50890p5723N7246J25348n894q5371o7356r6507j6994M0650
$$ y = [2807695, 2804651, 3013070, 2976443, 2888016, 3075707, 3075982, 3043856, 2930854, 2901670, 3049794, 3001603, 2970048, 2947887, 2932670, 2950348, 2934938, 2921629, 3028465, 3045318, 3246967, 3221380, 3179777, 3264004, 3217571, 3113963, 3155341, 3138972, 3042471, 3105530, 3095723, 3255928, 3341956, 3374618, 3341656, 3292783, 3242848, 3266984, 3308206, 3179345, 3189496, 3188410, 3362235, 3450673, 3279686, 3273522, 3201459, 3066127, 3065603, 3083384, 3174417, 3257108, 3252825, 3344476, 3499851, 3500120, 3462572, 3424071, 3278303, 3380747, 3405849, 3495672, 3636930, 3281674, 3094961, 3196166, 3209451, 3232046, 3275417, 3246550, 3435262, 3630151, 3751606, 3656284, 3473373, 3310001, 3349403, 3462801, 3311911, 3236188, 3293434, 3418782, 3412888, 3327517, 3260161, 3163654, 3146660, 3187310]
22158C187310r3332j42804N9904J15844J24272j68389j08741L2571n3847J16738
22148C069526J36442J08465k8498k7905p2117j47092l8287j1279J70386J00307
22138C259948P2416J10810n704L9804K3672K5953R1330k3383j27956m7437O5965
22127C485418j1101k31277K956J93248O3665m6722L754j60364o7876J5826r1700
22116C155827n1013P3432J34829n8706k48507K8717K89678M8895K6149j21313
22106C277988q8089J61570J03715j7061J770M618m1889L5740q6641j68448l619
22095C179654J16589n9783n8806J20412R1667q1427J28221N6216k6240q9790j28009
22084C248704l4769R0950J38731p8404M0176j6791j07649j40473j6821P1115R7116
$$ y = [3187310, 3093978, 2951174, 3011078, 3126922, 3251194, 3082805, 2974064, 3006635, 2952788, 3069526, 3205968, 3314433, 3285935, 3258030, 3185913, 3038821, 3000534, 2989255, 3159641, 3259948, 3332364, 3443174, 3437470, 3477274, 3500946, 3526899, 3618229, 3594846, 3466890, 3419453, 3485418, 3474317, 3243040, 3245996, 3439244, 3502909, 3456187, 3459941, 3299577, 3231701, 3247527, 3155827, 3104814, 3178246, 3313075, 3254369, 3005862, 3034579, 3324257, 3373152, 3399301, 3277988, 3189899, 3351469, 3455184, 3438123, 3439893, 3444511, 3402622, 3438362, 3351721, 3183273, 3179654, 3296243, 3236460, 3177654, 3298066, 3389733, 3308306, 3436527, 3492743, 3466503, 3376713, 3248704, 3213935, 3304885, 3443616, 3365212, 3405388, 3388597, 3280948, 3140475, 3123654, 3194769, 3291885]
22073C291885j19953N6356J43052J94986j71525j37826M0639K1235j5944K7608
22063C330513O5638J06627r2813p2993K8892L6754J6297p383n8937l4888j01506
22052C216201k7761P7296N3917J42073K276K5583n2347K9918m7633J1329j32016
22041C298836J3538J25396O1556n633k740o179j20248k7527K1615j90722j76618
22030B991274O4734R4166J74276q7069K3466J43646n8682N1130Q9813K54322J6770
22019C757846k13247j21795M53J01741k4684L1458J71590r4681j15380M6211J81379
22008C720891O907j71269j8978m9985j52181j29296p3094R815L53Q1262P9463
21997C303888Q9322J05675J1305K4531L3569N338J11507l6226j70831l3003M2497
$$ y = [3291885, 3171932, 3228288, 3371340, 3566326, 3394801, 3256975, 3297614, 3318849, 3302905, 3330513, 3396151, 3502778, 3409965, 3336972, 3365864, 3402618, 3418915, 3411532, 3352595, 3317707, 3216201, 3188440, 3265736, 3319653, 3461726, 3464002, 3489585, 3437238, 3467156, 3419523, 3430852, 3298836, 3312374, 3437770, 3499326, 3493693, 3490953, 3484774, 3364526, 3336999, 3358614, 3167892, 2991274, 3056008, 3150174, 3324450, 3237381, 3260847, 3404493, 3345811, 3396941, 3486754, 3741076, 3757846, 3544599, 3422804, 3423257, 3524998, 3500314, 3531772, 3703362, 3608681, 3493301, 3539512, 3720891, 3727798, 3556529, 3537551, 3487566, 3335385, 3206089, 3132995, 3142810, 3143163, 3224425, 3303888, 3393210, 3498885, 3510190, 3534721, 3568290, 3573628, 3685135, 3648909, 3478078, 3445075, 3487572]
21986C487572O8642J7264r1426L7102K4942j32998M8296K0601q965Q5519p3716
21975C482833m3388L2192j9418n2940P2679m2606O3096J24973J54672p199j07748
21964C657146J12689p5723k88809q2076J80196Q7137p4022n2011o132j02894K24050
21953C579551N9987j19261j46344N6385J17532Q4868m8365j52701k9259K75881
21943C678274O389j61762j26307P4912M1936q0412J2910L0801p6039q5878o7010
21932C247814J57451J58126o3245n0222O589J92352j9662Q4620n5404p1925q3356
21921C503138q0647L7695K06990J8243j28723n4721R8075O9933n4234J97O9663
21910C685609K1339r1831l9717n5034J84685N7920j49112l8147o6681q8746J00813
$$ y = [3487572, 3556214, 3573478, 3482052, 3519154, 3544096, 3411098, 3459394, 3479995, 3471030, 3556549, 3482833, 3439445, 3471637, 3452219, 3399279, 3471958, 3429352, 3492448, 3617421, 3772093, 3764894, 3657146, 3769835, 3694112, 3405303, 3323227, 3503423, 3590560, 3516538, 3464527, 3458395, 3355501, 3579551, 3639538, 3520277, 3373933, 3430318, 3547850, 3632718, 3584353, 3431652, 3402393, 3678274, 3684663, 3522901, 3396594, 3471506, 3513442, 3433030, 3445940, 3476741, 3400702, 3314824, 3247814, 3405265, 3563391, 3500146, 3449924, 3456513, 3648865, 3629203, 3713823, 3658419, 3586494, 3503138, 3422491, 3460186, 3667176, 3685419, 3556696, 3501975, 3600050, 3669983, 3615749, 3615946, 3685609, 3706948, 3615117, 3575400, 3520366, 3705051, 3762971, 3613859, 3575712, 3509031, 3420285, 3521098]
21899C521098K4522J49744M3522r7559j15837j12512r5662n5613L5966K32273
21889C529942O5376l3019l1017J26374M8944o5845j22377N2326P6971o1546N59
21878C586688l5090Q9257J05954j92132q3062J4767P3901J37176N2517k4762j59656
21867C565558j22489n7137O4362L5844o917P643J4702R9466n8546n8575O2025
21856C545936J65152K6956j52909R2253K47493j4245o1693K1931k9275j15053
21846C726546j21627m0286j938K2714L3924k97721j31075M6482J38801J38131
21836C513951O2763P1038L3931P3104M7699j5599n3389N2147p3582m9614J58075
21825C820524m6151k05004j04579j9397J70106K47665j8300o8934k40179K4480
$$ y = [3521098, 3545620, 3695364, 3738886, 3641327, 3525490, 3412978, 3317316, 3261703, 3297669, 3529942, 3595318, 3562299, 3531282, 3657656, 3706600, 3640755, 3518378, 3570704, 3647675, 3586129, 3586688, 3551598, 3640855, 3746809, 3554677, 3471615, 3486382, 3560283, 3697459, 3749976, 3725214, 3565558, 3443069, 3385932, 3450294, 3486138, 3479221, 3486864, 3501566, 3601032, 3542486, 3483911, 3545936, 3711088, 3738044, 3585135, 3677388, 3924881, 3910636, 3848943, 3870874, 3841599, 3726546, 3604919, 3564633, 3562695, 3585409, 3619333, 3321612, 3190537, 3237019, 3375820, 3513951, 3576714, 3647752, 3681683, 3754787, 3802486, 3786887, 3733498, 3785645, 3712063, 3662449, 3820524, 3774373, 3569369, 3464790, 3445393, 3615499, 3863164, 3844864, 3775930, 3535751, 3560231]
21815C560231R5740j59495L3233m674j7214J03916R8274j10237k5481o8279l362
21804C502652L3141J95508l8582j29352R1665J58871R999J13536J66147k06531
21794C897054k28556p8341Q531j2008J62239M386j26634j00187R486j21372l1048
21783C383550K63385J11094l6652j62266j7394n9959J20900J52796J45482Q1313
21773C982249q9684j36117l3973K8350K3229J35352o7914k01355j67749o1683
21763C410705K42848J12743K3048J35047j36567r9843Q9023p0312k25954L2188
21753C512926K06033J21897J1441k6379Q7r397j15968N7560R3587n2703q5950
21742C713134k9914R6062J18260J23126p0343j74083K8885M44j26979J57575J08507
$$ y = [3560231, 3655971, 3496476, 3529709, 3525035, 3507821, 3611737, 3710011, 3599774, 3574293, 3506014, 3502652, 3535793, 3731301, 3692719, 3563367, 3655032, 3813903, 3823902, 3937438, 4103585, 3897054, 3668498, 3590157, 3598688, 3586680, 3748919, 3753305, 3626671, 3526484, 3535970, 3414598, 3383550, 3646935, 3758029, 3721377, 3559111, 3541717, 3481758, 3602658, 3755454, 3900936, 3982249, 3892565, 3756448, 3722475, 3750825, 3774054, 3909406, 3841492, 3640137, 3472388, 3410705, 3653553, 3766296, 3789344, 3924391, 3787824, 3687981, 3777004, 3706692, 3480738, 3512926, 3718959, 3840856, 3852297, 3825918, 3826005, 3816608, 3700640, 3758200, 3851787, 3799084, 3713134, 3683220, 3779282, 3897542, 4020668, 3950325, 3776242, 3805127, 3805571, 3678592, 3836167, 3944674]
21731C944674L5539p9976r0630l6106J8606K6380J59079j05651j26875n2900j1488
21720C680652m8157j31642Q1864J71050O9507p5053O7320J60198K813j18381j82700
21709C677471o7127M7314l2754J9624n4956R7227J56244L6825K3309n6511m8156
21698C798510k1108J33186j44754p4361q4287N0463J6641L774J51452L9903j4405
21687C855014N1854l8845R7565j76417J375K03390l1559N3071j498q8189r1333
21676C834428K0069J68021j20077l1282J8307P129J0866j71168M1556J55075K50257
21665D183181k8416o5110o2113m5806q3921Q773o0053j6242K0232J07265J95815
21654D153605l8378p6343l2126R3393M1198K7276j307M7073J11536l6189j00245
$$ y = [3944674, 3980213, 3900237, 3809607, 3773501, 3792107, 3818487, 3977566, 3871915, 3745040, 3692140, 3680652, 3632495, 3500853, 3582717, 3753767, 3823274, 3748221, 3815541, 3975739, 3978552, 3860171, 3677471, 3610344, 3657658, 3624904, 3644528, 3589572, 3686799, 3843043, 3879868, 3903177, 3846666, 3798510, 3777402, 3910588, 3765834, 3691473, 3607186, 3657649, 3674290, 3678064, 3829516, 3869419, 3855014, 3906868, 3868023, 3965588, 3789171, 3790546, 3993936, 3962377, 4015448, 4013950, 3925761, 3834428, 3854497, 4022518, 3902441, 3871159, 3889466, 3896595, 3907461, 3736293, 3777849, 3932924, 4183181, 4154765, 4089655, 4027542, 3981736, 3897815, 3906588, 3846535, 3830293, 3850525, 3957790, 4153605, 4115227, 4038884, 4006758, 4100151, 4141349, 4168625, 4167318, 4214391, 4325927, 4289738, 4189493]
21643D189493K5K8625o9937m0502o4429k08358N3409O0828l0872J41218j10152
21632C949348j13351Q115J11396J46393R4115l8225o6681p3438j5456l9056k9702
21621C933458J32971j26645m873K5136n9095n0276J33544J72073P8991j2820M7476
21610D269940j9294J0318q5481o2644K4196J23131j26374J59067J00337m523k07751
21599D180922k03053k9361J7587N7979J50882N1128j0870J25548N7j50712j13088
21588D077019r2631K2232r4200n9405P6480K236N7503P2884l8187n9546J04772
21577D069157J09650q9448r3130j49996p8321O97J13953Q2081J28598N7644p8988
21566D071897J3518R4377p8252N6968j54821j14700J59367J7784J10367O8759
$$ y = [4189493, 4189518, 4218143, 4148206, 4107704, 4043275, 3834917, 3888326, 3949154, 3918282, 4059500, 3949348, 3835997, 3844112, 3955508, 4101901, 4196016, 4157791, 4091110, 4017672, 4002216, 3963160, 3933458, 4066429, 3939784, 3934911, 3960047, 3900952, 3850676, 3984220, 4156293, 4235284, 4222464, 4269940, 4250646, 4260964, 4175483, 4112839, 4137035, 4260166, 4133792, 4292859, 4393196, 4388673, 4180922, 3977869, 3948508, 3966095, 4024074, 4174956, 4226084, 4215214, 4340762, 4340819, 4190107, 4077019, 3984388, 4006620, 3912420, 3853015, 3929495, 3931731, 3989234, 4062118, 4023931, 3964385, 4069157, 4178807, 4089359, 3996229, 3846233, 3767912, 3768609, 3882562, 3964643, 4093241, 4150885, 4071897, 4085415, 4179792, 4101540, 4158508, 4003687, 3888987, 4048354, 4066138, 4176505, 4245264]
21556D245264j48790j53866Q8294J23836N0266o2823n5795J08239O4457N8011
21546D317093L6711p341L0456l912q9111k9301N2910j02281j36011j2400J24762
21535D181575M163j62502j02830J24815o7019J30968K08461M838j71680n9280
21525D091509K05730J18951k2942P663j53632j75921O9000J957N1824Q2518p6125
21514D200532j48060M793M0963R889J04025R777k5187P7003N3922m9309N4654
21503D333002O9711r6531j19487r1134R0570J22523R8259m8686q2313q5348K7745
21492D218311M8256n5756Q970j32988l9617n4284J28956J61342o6257j046Q227
21481D224114l6353j11150R5243O0405P0803K9541m2253n5812Q9965L7919j23994
$$ y = [4245264, 4096474, 3942608, 4030902, 4154738, 4205004, 4142181, 4086386, 4194625, 4259082, 4317093, 4353804, 4346463, 4376919, 4373007, 4283896, 4254595, 4307505, 4205224, 4069213, 4056813, 4181575, 4185738, 4023236, 3920406, 4045221, 3978202, 4109170, 4317631, 4322469, 4150789, 4091509, 4297239, 4416190, 4393248, 4400911, 4247279, 4071358, 4140358, 4142315, 4194139, 4276657, 4200532, 4052472, 4057265, 4098228, 4108117, 4212142, 4221919, 4196732, 4273735, 4327657, 4278348, 4333002, 4402713, 4306182, 4186695, 4095561, 4186131, 4308654, 4406913, 4358227, 4275914, 4190566, 4218311, 4266567, 4210811, 4219781, 4086793, 4047176, 3992892, 4121848, 4283190, 4216933, 4215887, 4224114, 4187761, 4076611, 4171854, 4232259, 4303062, 4332603, 4290350, 4234538, 4324503, 4362422, 4238428]
21470D238428k10120J12512J89610o4156k33714j26483J50148K11231J31065j04792
21460D293729q0590N4423K641p5177k7199O6946R6104P4049J66222j289q341r0869
21448D470649p3589P6926j49545p3125J6517k735j33689m1301K05822K55798o2990
21437D488738k64276j43414N0339R7795J41016j72r8527K1565r2782r8876M3276
21426D144682J66291O6519J3031L5697j19031p6263l4469m6416K5509K23516J58568
21415D557634J08410J14358j05622j66949o2522j5019P7261p0224M5477J92016
21405D674820R9122j04j94969j12114O9005j05828j48540L6357q6791L7782J09933
21394D378673k132l9663j8455O47j6510j24528l5569J28637k866O9069J8130j4339
$$ y = [4238428, 4028308, 4140820, 4330430, 4266274, 4032560, 3906077, 4056225, 4267456, 4398521, 4293729, 4213139, 4267562, 4270203, 4195026, 4167827, 4234773, 4330877, 4404926, 4571148, 4569859, 4561518, 4470649, 4397060, 4473986, 4324441, 4251316, 4267833, 4265098, 4131409, 4090108, 4295930, 4551728, 4488738, 4224462, 4081048, 4131387, 4229182, 4370198, 4370026, 4271499, 4293064, 4200282, 4101406, 4144682, 4310973, 4377492, 4390523, 4426220, 4307189, 4230926, 4196457, 4150041, 4175550, 4399066, 4557634, 4666044, 4780402, 4674780, 4507831, 4445309, 4430290, 4507551, 4437327, 4482804, 4674820, 4773942, 4773838, 4578869, 4466755, 4535760, 4429932, 4281392, 4317749, 4230958, 4268740, 4378673, 4376541, 4336878, 4318423, 4319070, 4302560, 4178032, 4142463, 4271100, 4268234, 4337303, 4355433, 4341094]
21382D341094Q0712m0879J2676J04660N235l7782q8965N755J10247N7845K093
21371D552691j40463o6334k3520M2235J66996O876J2167j36342O9272J58080p5891
21360D565767j40881K2466n5073l5435m2444O0880J32071J36925J17883K9017
21350D791176K051r2433q6974L3801o1693K5517K7436K53393J25392j75590m2996
21339D799080j89120j41080j17524O7993J33943R0999J8164k08N9846K1231j12785
21328D630539m3866O6853l6340n3141p6152r2255K1284R7697M6342M8295l1737
21317D577519j27123j08766Q5919K42532R7918k5117j39469p592O148O7939R0720
21306D760628r935j25623P932J19567K635o26P9272j11664m0234Q9786J26799
$$ y = [4341094, 4421806, 4380927, 4393603, 4498263, 4503498, 4465716, 4376751, 4382506, 4492753, 4550598, 4552691, 4412228, 4345894, 4322374, 4364609, 4531605, 4538481, 4550648, 4414306, 4483578, 4641658, 4565767, 4424886, 4447352, 4392279, 4356844, 4314400, 4375280, 4507351, 4644276, 4762159, 4791176, 4793227, 4700794, 4613820, 4647621, 4585928, 4611445, 4638881, 4892274, 5017666, 4842076, 4799080, 4609960, 4468880, 4351356, 4419349, 4553292, 4644291, 4662455, 4662247, 4722093, 4743324, 4630539, 4586673, 4653526, 4617186, 4564045, 4487893, 4395638, 4416922, 4514619, 4560961, 4609256, 4577519, 4450396, 4341630, 4427549, 4670081, 4767999, 4742882, 4603413, 4595821, 4601969, 4669908, 4760628, 4750693, 4625070, 4633002, 4752569, 4755204, 4754578, 4833850, 4722186, 4681952, 4771738, 4898537]
21295D898537R5395M99r4445M4569j84371r6150n7638J12391M344N5241l8869
21284D739503r2562J35209K7752r4400L2471n7074L7142O0756o5705m9667N2999
21273D726424j1095j15606K0682R1382O5623R8440O3239j2645j33879K7418l7435
21262D782548Q005M3301J0857M0841O7619r111j34014R256l216J28077J15947
21251E060110O5506P1787L2848k07361j43487l6592q1438r186n9363K6383J28778
21240D847985j9349m0008J6628Q0944Q662j69189N5127P3319Q1207n706L4331
21229D963951J02273o9749r3526j26341J41666J12896l573J5011l9420k0984l1845
21218D950359n7637K2146L6534M5996R4660J11490p710P5946j83462O017m1335
$$ y = [4898537, 4993932, 4994431, 4899986, 4944555, 4760184, 4664034, 4606396, 4718787, 4723131, 4778372, 4739503, 4646941, 4782150, 4809902, 4715502, 4747973, 4690899, 4728041, 4788797, 4723092, 4673425, 4726424, 4715329, 4599723, 4620405, 4711787, 4777410, 4875850, 4939089, 4926444, 4792565, 4819983, 4782548, 4790553, 4833854, 4844711, 4885552, 4953171, 4944060, 4810046, 4819302, 4816086, 4944163, 5060110, 5125616, 5197403, 5230251, 5022890, 4879403, 4842811, 4761373, 4752187, 4692824, 4719207, 4847985, 4828636, 4788628, 4805256, 4886200, 4894862, 4725673, 4780800, 4854119, 4935326, 4929620, 4963951, 5066224, 4996475, 4902949, 4776608, 4918274, 5031170, 5027597, 5042608, 5003188, 4982204, 4950359, 4892722, 4914868, 4951402, 4997398, 5092058, 5203548, 5195838, 5271784, 5088322, 5094339, 5053004]
21207E053004n4802j8429Q2919Q2458J40460K6708n6629n4933O2019O656j99121
21196E070310n2523j1440J1044q4980o152Q4053m310K4398k48K22148j14398j13568
21184E024334k2379J38426l9641j4868l1390K24165J70729o0783o9776n5584K9705
21173E292938n1766p9842p5467M0385J90545p4455o5037j6317P2561K3069j34588
21162E122026j26834K9977M697R7058P1833l3400j8518M9074O0348J348K2504
21151E280113O6671M3870l6180l2759p9877m5476O961J27799O7001l0459Q4930
21140E452594M5084j16192r6297o5777J4148J9548j18375R8122O4327J32718j53550
21129E276350k42843n2387J71078K10591L3649j61426j67057M176L2959P5877
$$ y = [5053004, 4998202, 4979773, 5062692, 5145150, 5285610, 5312318, 5255689, 5200756, 5262775, 5269431, 5070310, 5017787, 5006347, 5017391, 4932411, 4926259, 5010312, 5006002, 5030400, 5030152, 5252300, 5137902, 5024334, 5001955, 5140381, 5100740, 5085872, 5054482, 5278647, 5449376, 5388593, 5318817, 5263233, 5292938, 5241172, 5161330, 5085863, 5126248, 5316793, 5242338, 5177301, 5160984, 5233545, 5256614, 5122026, 4995192, 5025169, 5029866, 5126924, 5198757, 5165357, 5146839, 5195913, 5256261, 5257609, 5280113, 5346784, 5390654, 5354474, 5321715, 5241838, 5196362, 5203323, 5331122, 5398123, 5367664, 5452594, 5497678, 5381486, 5285189, 5219412, 5233560, 5253108, 5134733, 5232855, 5297182, 5429900, 5276350, 5033507, 4981120, 5152198, 5362789, 5396438, 5235012, 5067955, 5072131, 5105090, 5180967]
21119E180967R944N4341j0954O6307L9703j46641j29530l3969L0833J30705L5268
21108E226974O0090N2150O9686n7138R7666O9375M1140J17213j41905l4751n8533
21097E441967n1034j03302l2983J24266N3760j2548J52357l8877j90442k42639
21087E100525J29264R3248J64088J04440r6447k3953J8383j40553J8429K0733
21077E388157j01634j0970K8459O8873Q0662R7403p1615J9635n0707r2291O7726
21066E423698j33749O2573K12084P9110j17965J4635J35418J6685j75672j05182
21056E411635J07389N5600P1897Q6496o9645j25159N9545K90699L2445k67341
21046E653561j19297O8488K94373L74757m9955j41949J599j17543j58956j14704
$$ y = [5180967, 5190911, 5245252, 5234298, 5300605, 5340308, 5193667, 5064137, 5030168, 5061001, 5191706, 5226974, 5287064, 5339214, 5408900, 5351762, 5449428, 5518803, 5559943, 5677156, 5535251, 5500500, 5441967, 5390933, 5287631, 5254648, 5378914, 5432674, 5420126, 5572483, 5533606, 5343164, 5100525, 5229789, 5323037, 5487125, 5591565, 5495118, 5471165, 5489548, 5348995, 5367424, 5388157, 5286523, 5275553, 5304012, 5372885, 5453547, 5550950, 5479335, 5498970, 5448263, 5355972, 5423698, 5289949, 5352522, 5564606, 5643716, 5525751, 5540386, 5675804, 5692489, 5516817, 5411635, 5519024, 5574624, 5646521, 5733017, 5663372, 5538213, 5597758, 5888457, 5920902, 5653561, 5534264, 5602752, 5897125, 6271882, 6221927, 6079978, 6081577, 5964034, 5805078, 5690374]
21036E690374j19751M9782m2449J23261L4338k5399p3112J13571K4228r8049J4479
21025E691273j29303J05422L0358q3131J39106L6357n3034r5209M5620N628K2990
21014E716077J9515j01844j5318M3636m9482Q8725K09814j47523P100M0249J9412
21003E830361N7327j09051R6432k9468j42937J3558L6374k6307m7086o4579J45536
20992E760160L4504k0720o8722J71470Q4898M7485j15348n0547Q7806J87316J0326
20981F128628p7551j21945p5359J09717J38457N3079J33396n3271o5247p3514
20971F096390l9000K2285k0689m9198j90609L8545J85421K9666m873J0827j81777
20960E896988M1051J39772j43256M6051J30826o2049j13839L197o5015l3972N0251
$$ y = [5690374, 5570623, 5620405, 5577956, 5701217, 5735555, 5710156, 5637044, 5750615, 5774843, 5676794, 5691273, 5561970, 5667392, 5697750, 5614619, 5753725, 5790082, 5737048, 5641839, 5687459, 5693087, 5716077, 5735592, 5633748, 5618430, 5662066, 5612584, 5701309, 5911123, 5763600, 5770700, 5810949, 5830361, 5887688, 5778637, 5875069, 5845601, 5702664, 5716222, 5752596, 5726289, 5679203, 5614624, 5760160, 5794664, 5773944, 5705222, 5876692, 5961590, 6009075, 5893727, 5843180, 5930986, 6118302, 6128628, 6051077, 5929132, 5853773, 5963490, 6101947, 6155026, 6288422, 6235151, 6169904, 6096390, 6057390, 6079675, 6058986, 6009788, 5819179, 5857724, 6043145, 6072811, 6067938, 6078765, 5896988, 5938039, 6077811, 5934555, 5980606, 6111432, 6049383, 5935544, 5938741, 5873726, 5839754, 5890005]
20949E890005R6057p6707j232J20887o9316j33452K2316J86445K04200J476Q6515
20938F327194R4967J7462p4616j32644r5982P5893L4123O6189o9214k38804q0473
20927E924095N5162N5404n7575J06969J33074R5602J911J9652q6257q1126O9094
20916F236005K01812j00068L1967p4784l28037j09747P5284M7277J55931K4657
20906F160297p5711Q5488J16463J008N7803M2350R4206P5357j68872l7774N5010
20895F405625n0004L3979K25152K716k21J18134J09757K15888J6670N9919j26658
20884G010957j50867n3156Q9784j35517l33861k02023k4785m6838j52170j97003
20874E804521j49170M1571J50532J00368j25715m5129N8110K83670J39137l7751
$$ y = [5890005, 5986062, 5909355, 5908123, 6029010, 5959694, 5826242, 5848558, 6035003, 6239203, 6240679, 6327194, 6422161, 6439623, 6365007, 6232363, 6136381, 6212274, 6246397, 6312586, 6243372, 6004568, 5924095, 5979257, 6034661, 5977086, 6084055, 6217129, 6312731, 6314642, 6334294, 6248037, 6166911, 6236005, 6437817, 6337749, 6369716, 6294932, 5966895, 5857148, 5932432, 5979709, 6135640, 6160297, 6084586, 6170074, 6286537, 6287545, 6345348, 6387698, 6481904, 6557261, 6388389, 6350615, 6405625, 6355621, 6389600, 6614752, 6617468, 6617247, 6735381, 6845138, 7061026, 7077696, 7137615, 7010957, 6860090, 6806934, 6896718, 6761201, 6427340, 6225317, 6200532, 6153694, 6001524, 5804521, 5655351, 5696922, 5847454, 5947822, 5822107, 5776978, 5835088, 6118758, 6257895, 6220144]
20864F220144p4286p1945r8637K04393k3782j16315J7082J02639J01604j33609
20854F127288j03111J20865J78869J03450q861K0020r8840M0497J07697o795r6171
20843F384908M1359j45805j14068N5016m1387q5585l7919J7744P9070O028L4129
20832F193490L04824J80560j69501P8587J00782j55278j58918K6439M4912L1636
20822F477533Q4664n9776K9639O3372l5342J58844l1863j34034k7644Q0562P0084
20811F676039J04002o2427J2208J01798K9011R1910l6432j04881j13138j08387
20801F589703J13063Q1256O8517O5240n9201K0345m2852m1642j40133o9504N124
20790F589916J81093J26768R0220J88884j43835k05100j01522P3602J281K2411
$$ y = [6220144, 6145858, 6073913, 5975276, 6179669, 6155887, 6039572, 6056654, 6159293, 6260897, 6127288, 6024177, 6145042, 6323911, 6427361, 6418500, 6438520, 6339680, 6380177, 6487874, 6481079, 6384908, 6426267, 6280462, 6166394, 6221410, 6180023, 6094438, 6056519, 6074263, 6153333, 6159361, 6193490, 6498314, 6678874, 6509373, 6587960, 6688742, 6533464, 6374546, 6400985, 6445897, 6477533, 6562197, 6502421, 6532060, 6595432, 6560090, 6718934, 6687071, 6553037, 6525393, 6605955, 6676039, 6780041, 6717614, 6729822, 6831620, 6860631, 6952541, 6916109, 6811228, 6698090, 6589703, 6702766, 6784022, 6852539, 6917779, 6858578, 6878923, 6836071, 6794429, 6654296, 6584792, 6589916, 6771009, 6897777, 6987997, 7176881, 7033046, 6827946, 6726424, 6800026, 6801307, 6823718]
20780F823718J3527j04202L7314J5109Q0996l8799J878M2492Q0380p1463j31174
20769F749776O9750J07384J68897N7379j55883j17300J25875k2673j2381J08850
20759G079674l0748k8898O5288j3980J2616J2667Q6612K52499J7258k64212j57479
20748G031297j79821M35J84465J30933k6836O388l4096m4024n7797J00841P4790
20737G186575Q8956j34089N553J1367p9698j1583o7084l6707Q6372P1919J30174
20726G251755j7056N6948o4164n11n9002j21707m1399J06595K23530J75695l2044
20715G478640p5076J1053L0944j05415q5270J57368R9903k1164k1615L3116r0002
20704G412482m6305J79769J3008j2802L377J16325J56366Q7938j45171j30650
$$ y = [6823718, 6837245, 6733043, 6770357, 6785466, 6866462, 6827663, 6829541, 6872033, 6952413, 6880950, 6749776, 6819526, 6926910, 7095807, 7153186, 6997303, 6880003, 7005878, 6983205, 6970824, 7079674, 7048926, 7020028, 7085316, 7071336, 7083952, 7096619, 7183231, 7435730, 7452988, 7188776, 7031297, 6851476, 6851911, 7036376, 7167309, 7140473, 7146861, 7112765, 7068741, 7010944, 7111785, 7186575, 7275531, 7141442, 7146995, 7158362, 7078664, 7067081, 6999997, 6963290, 7049662, 7121581, 7251755, 7234699, 7291647, 7227483, 7226972, 7167970, 7046263, 7004864, 7111459, 7334989, 7510684, 7478640, 7403564, 7414617, 7445561, 7340146, 7254876, 7412244, 7512147, 7490983, 7469368, 7502484, 7412482, 7366177, 7545946, 7558954, 7546152, 7549529, 7665854, 7822220, 7910158, 7764987, 7634337]
20694G634337j34837J3000J43272O3738P9427J6224J0644n1828k3663L4873L454
20683G788641k5107j20263L6514N0352j05683J32089P6617j10314m5735K4908
20673G702019J99196P8864J08764j16231j32358m3506J21276o3877Q4537K42963
20663H181647R4897j76495j21940q8525J72848J10416n8171p2541l3457j7705
20653G990974J8037R7960K4924q4491l4135J00606j3763O1198j361P314O7802
20642H235065P8144O3005j7331j8256L6178m4744M4065M8653N4469j806J80910
20631H658352L4077q6822k585j80986j14877q3854j39152K26508M8448j4171j91810
20620H153128M1263J24637J00163M5281j2450j53098J9718k6277Q0363K12437
$$ y = [7634337, 7499500, 7512500, 7655772, 7719510, 7798937, 7815161, 7825805, 7773977, 7750314, 7785187, 7788641, 7763534, 7643271, 7679785, 7730137, 7624454, 7756543, 7833160, 7722846, 7677111, 7702019, 7901215, 7980079, 8088843, 7972612, 7840254, 7796748, 7918024, 7854147, 7938684, 8181647, 8276544, 8100049, 7978109, 7889584, 8062432, 8172848, 8114677, 8042136, 8008679, 7990974, 8009011, 8106971, 8131895, 8047404, 8013269, 8113875, 8100112, 8161310, 8159949, 8167263, 8235065, 8313209, 8376214, 8358883, 8340627, 8376805, 8332061, 8376126, 8424779, 8479248, 8477442, 8658352, 8692429, 8605607, 8603022, 8422036, 8307159, 8223305, 8084153, 8310661, 8359109, 8344938, 8153128, 8194391, 8319028, 8419191, 8464472, 8452022, 8298924, 8318642, 8292365, 8372728, 8585165]
20610H585165J09168Q1578J30272m5601K4848j04347k4948M2025k3921o2359K0655
20599H732535J07390r4963j02112R387L8765O5675l0590j83o8477O681J66441
20588H830549M6562q1054N5879K03128Q6585j00477R9663j465J01462r5952j32772
20577I012108r266j7254m7210l9746R6279N2011L3092J29082J62194k7508L41
20566I344123N0896J0188j6173N8744j22763q3947K0117J10809L7004j94262J2793
20555I227529K2143O2909k2223O2145J08554K075O138j104l9613O0777P8830N2321
20543I620481K7430O6935Q9049K5799N1962l7693j8866J88336Q7480M3675l877
20532A0140711j01928j45591P9401l8017J71113P8138p7235n150q5208l9950O3778
$$ y = [8585165, 8694333, 8775911, 8906183, 8860582, 8885430, 8781083, 8756135, 8798160, 8774239, 8711880, 8732535, 8839925, 8744962, 8642850, 8652237, 8691002, 8756677, 8726087, 8725904, 8657427, 8664108, 8830549, 8877111, 8796057, 8851936, 9055064, 9141649, 9041172, 9140835, 9139370, 9240832, 9144880, 9012108, 9002842, 8985588, 8938378, 8898632, 8994911, 9046922, 9080014, 9209096, 9371290, 9343782, 9344123, 9395019, 9405207, 9389034, 9447778, 9325015, 9241068, 9261185, 9371994, 9408998, 9214736, 9227529, 9249672, 9312581, 9290358, 9352503, 9461057, 9463132, 9469270, 9468166, 9428553, 9489330, 9568160, 9620481, 9647911, 9714846, 9803895, 9829694, 9881656, 9843963, 9825097, 10013433, 10100913, 10144588, 10140711, 10038783, 9893192, 9972593, 9934576, 10105689, 10183827, 10106592, 10101442, 10016234, 9976284, 10040062]
20521A0040062r6966J4419O5171K4190K5810o4726O3135O1338O7616J64809m8508
20510A0316350j9825R4027O2549q5570J5155q3665p6998L9328J36989J65082J4472
20499A0577894M0993J64580L6352l5061o7881j25408k1573j7492K9023R4886k1622
20488A0654691j2355J39093R5941l6891P0681j9361K8140O9451j85039R4449J33988
20477A1032788O3857L4889J18111O502J4940J68682Q5080J24561o0989K5658k2916
20466A1591163j88764Q7162J81494R069Q3172L992M901Q4738K40046J75203L3163
20455A2305339N800m5733k27098j46358L1585K8704K5051O61J03484J7507J506
20444A2100448J84732J50599J01148J49443P9110p0666j86760r1125P3586R6783
$$ y = [10040062, 9943096, 9957515, 10022686, 10046876, 10072686, 10007960, 10071095, 10132433, 10200049, 10364858, 10316350, 10296525, 10390552, 10453101, 10367531, 10382686, 10299021, 10222023, 10261351, 10398340, 10563422, 10577894, 10618887, 10783467, 10819819, 10784758, 10716877, 10591469, 10569896, 10552404, 10581427, 10676313, 10654691, 10642336, 10781429, 10877370, 10840479, 10911160, 10891799, 10919939, 10989390, 10804351, 10898800, 11032788, 11096645, 11131534, 11249645, 11256147, 11271087, 11439769, 11524849, 11649410, 11588421, 11614079, 11591163, 11402399, 11489561, 11671055, 11680124, 11763296, 11767288, 11772189, 11856927, 12096973, 12272176, 12305339, 12311139, 12265406, 12038308, 11891950, 11923535, 11952239, 11977290, 11977951, 12081435, 12098942, 12100448, 12285180, 12435779, 12536927, 12686370, 12765480, 12694814, 12508054, 12416929, 12490515, 12587298]
20434A2587298Q3163Q3783O9256n6897o7965K046K10919J13065L1063K0226K58253
20423A3334210L3622o6693O3367K258L553k7989O4117J72363J45836Q6801m0444
20412A3771001j87520M1931J45943J14724q0402l6214K23743K08278J18561L9555
20402A4359600N4467J5763k2869M6530J06679P1823J57764K41489J04353l5356
20392A5100243K04985Q6222q5441j41696J01371J07667J21815Q4187N9240O3525
20382A5702118N2024L7058K72810K13246J20641K14984J23047K04905J16589m6968
20372A7010454O9465J52296J84752N2346o8148O2410Q1547O8010P6135K22670
20362A7911937J70862K04624J30904R5576O5557N6464K30632K46662J52215J21656
$$ y = [12587298, 12670461, 12754244, 12823500, 12766603, 12698638, 12700684, 12911603, 13024668, 13055731, 13075957, 13334210, 13367832, 13301139, 13364506, 13366764, 13370317, 13342328, 13406445, 13578808, 13724644, 13811445, 13771001, 13583481, 13625412, 13771355, 13886079, 13805677, 13769463, 13993206, 14201484, 14320045, 14359600, 14414067, 14429830, 14406961, 14453491, 14560170, 14631993, 14789757, 15031246, 15135599, 15100243, 15305228, 15391450, 15306009, 15164313, 15265684, 15373351, 15495166, 15579353, 15638593, 15702118, 15754142, 15791200, 16064010, 16277256, 16397897, 16612881, 16735928, 16940833, 17057422, 17010454, 17079919, 17232215, 17416967, 17469313, 17401165, 17463575, 17545122, 17613132, 17689267, 17911937, 18082799, 18287423, 18418327, 18513903, 18579460, 18635924, 18866556, 19113218, 19265433, 19387089]
20352A9387089N1208K02241J39207J21502q092J08410K00671K43877L00612Q7928
20342B0834653J07204J61749K36443K60137K24793O8593J31660K16540J30756
20333B2372528P0825K06336M05916L66396N3034K44945M58859M10502L41210L10100
20323B5240651J85130L06882K87904L51991M16547K87209N03531N43516K45198
20314B8368559L04455N25313M65930L82891M98269M67034M76623N51377O88121
20305C2728572O06668N86725P47456P45866P17050P41353Q80735R58996J052402
20296C9765823J083672J233112J168768J068933J384528J534058J439917J577298
20288E0256109J280503J061638J675749K200497K623785K911286L299171L717539
$$ y = [19387089, 19438297, 19640538, 19779745, 19901247, 19893155, 20001565, 20202236, 20446113, 20746725, 20834653, 20941857, 21103606, 21340049, 21600186, 21824979, 21893572, 22025232, 22241772, 22372528, 22443353, 22649689, 23055605, 23422001, 23475035, 23719980, 24178839, 24589341, 24930551, 25240651, 25425781, 25732663, 26020567, 26372558, 26789105, 27076314, 27579845, 28123361, 28368559, 28673014, 29198327, 29664257, 30047148, 30545417, 31012451, 31489074, 32040451, 32728572, 33335240, 33921965, 34669421, 35415287, 36132337, 36873690, 37754425, 38713421, 39765823, 40849495, 42082607, 43251375, 44320308, 45704836, 47238894, 48678811, 50256109, 51536612, 52598250, 54273999, 56474496, 59098281, 62009567, 65308738, 69026277]
20280F9026277L849949L992145M205051N076876O229283P629318R050551J0877969
20272A19937419J2969027J5519211J8346473J9906433J7106911O226324k1534897
20265A88476901p5907527j21147087j01828264m6322485r616923P635618J4636544
20258a44073223J5437982J4201493J2238074J0393177Q912483P754047O784347
20251f8351620N930892N016861M128561L228823K537757K478321K508159K595703
20243c9926543K320632K045485J662918J145532R43735R74655J036276J168189
20235b8629121J105968J093988J064314J043336R45608K70551j16993n2520R3059
20226b3181810J58255K22907L20991K61760M21103M79671N30921O06919N14872
$$ y = [69026277, 72876226, 76868371, 81073422, 86150298, 92379581, 100008899, 109059450, 119937419, 132906446, 148425657, 166772130, 186678563, 203785474, 210011798, 188476901, 112569374, -8577713, -110405977, -156728462, -166345385, -158709767, -144073223, -128635241, -114433748, -102195674, -91802497, -82890014, -75135967, -68351620, -62420728, -57403867, -53275306, -50046483, -47508726, -45030405, -42522246, -39926543, -37605911, -35560426, -33897508, -32751976, -31808241, -30833586, -29797310, -28629121, -27523153, -26429165, -25364851, -24321515, -23375907, -23105356, -23222349, -23274869, -23181810, -23023555, -22800648, -22479657, -22217897, -21796794, -21317123, -20786202, -20179283, -19664411]
20217a9664411M53555N58465N66110N06786L72455M06747N57381M12648K49604
20208a5580660L28505M24437K33074M42345M29428K73375K84275L13232L81310
20199a2470679K73965L87448L91296L99336M93000J76559K83091K32129K56970
20190i576885L02739L76102J43612J84929L14228L29810K24986K46897O2947K14838
20180g175797L12623K85711K91548K53769K47440K98996q4447j13366L4731K66458
20170e382334K82433J56799L75512J34939P3918N391J24838P0484K3952K40777
20160c893291L21307K18651N5330K10333J84834K5338m0814K29617J13584J27555
20150b447556J38537M887M5483J58176J95599J65624J89060k2256j04965L102
$$ y = [-19664411, -19210856, -18652391, -18086281, -17579495, -17207040, -16800293, -16242912, -15830264, -15580660, -15252155, -14827718, -14594644, -14152299, -13722871, -13449496, -13165221, -12851989, -12470679, -12196714, -11809266, -11417970, -11018634, -10525634, -10349075, -10065984, -9833855, -9576885, -9274146, -8898044, -8754432, -8569503, -8255275, -7925465, -7700479, -7453582, -7390635, -7175797, -6863174, -6577463, -6285915, -6032146, -5784706, -5485710, -5570157, -5683523, -5648792, -5382334, -5099901, -4943102, -4567590, -4432651, -4358733, -4353342, -4228504, -4158020, -4134068, -3893291, -3571984, -3353333, -3298003, -3087670, -2902836, -2877498, -2918312, -2688695, -2575111, -2447556, -2309019, -2304132, -2258649, -2100473, -1904874, -1739250, -1550190, -1572446, -1677411, -1674309]
20140a674309J30560K81937K34051R7546O9036M4155N7242j17973R7103R0092
20130f90560J57520J29537k6582J25862K02257K84019j02544L9498J47848J7793
20120B84648j5329J15795R0172j34J10866J04462J68552l2576m3200O9750J0961
20109H63967l6851j13233P6002M4772j3865K3138N0563J48165J43967J07725M3548
20098A337898n053l6031P4350J98999J07767R0033n308L4387j90026j01964J70089
20087A675141K59492P5887k1076J33010O6058J1662J11045J35248L2416j58348
20077B320535R0033J125M2474J81814L8272K6706N246j5999N8969K04146M3671
20066B996992j0306N05J86929K19810J65431L7932p7527n4950J3910j9310j2898
$$ y = [-1674309, -1543749, -1261812, -1027761, -930215, -861179, -817024, -759782, -877755, -780652, -690560, -533040, -403503, -430085, -304223, -101966, 182053, 79509, 119007, 266855, 284648, 269319, 385114, 475286, 475152, 586018, 690480, 859032, 826456, 783256, 853006, 863967, 827116, 713883, 789885, 834657, 820792, 843930, 894493, 1042658, 1186625, 1294350, 1337898, 1332845, 1296814, 1371164, 1570163, 1677930, 1767963, 1762655, 1797042, 1607016, 1505052, 1675141, 1934633, 2010520, 1989444, 2122454, 2188512, 2200174, 2311219, 2446467, 2478883, 2320535, 2410568, 2411693, 2454167, 2635981, 2674253, 2700959, 2706205, 2690206, 2749175, 2953321, 2996992, 2986686, 2987191, 3174120, 3393930, 3559361, 3597293, 3519766, 3464816, 3478726, 3459416, 3446518]
20055C446518n3159L09879K10320m7266k7095N4698Q4739N5935J62178l5277M7222
20044D208692n0900r6024m6987P881P2409N194j00256l7016K8765M470L23546
20033D319774J86256N3433J17242J45967J42771n5127j11089P7643O0437J9668
20023D956975N0556K07225k7921r7456n8948J36930K28725R9603O4013p0967j74316
20012E314419l6980R9723Q8842M1579J11687r4284R958M4202Q510K09029J7697
20001E814382k03917p1643P9089J54394O6704J44510M2419Q6592Q9789m8199m6873
19990F107247J7638P0450N1360R8496K8917J14390P809j63698j24306K29186L92771
19979F830260K53401k4650q3010M5043J41644j98810k76997q620O325K20912J5265
$$ y = [3446518, 3393359, 3703238, 3913558, 3866292, 3839197, 3893895, 3978634, 4034569, 4196747, 4161470, 4208692, 4157792, 4061768, 4014781, 4022662, 4095071, 4100265, 4000009, 3962993, 3991758, 3996228, 4319774, 4506030, 4559463, 4676705, 4822672, 4965443, 4910316, 4799227, 4876870, 4937307, 4956975, 5007531, 5214756, 5186835, 5089379, 5030431, 5167361, 5396086, 5495689, 5559702, 5488735, 5314419, 5277439, 5377162, 5466004, 5507583, 5619270, 5524986, 5534944, 5579146, 5587656, 5796685, 5814382, 5610465, 5538822, 5617911, 5772305, 5839009, 5983519, 6025938, 6112530, 6202319, 6154120, 6107247, 6124885, 6195335, 6246695, 6345191, 6374108, 6488498, 6496307, 6332609, 6208303, 6437489, 6830260, 7083661, 7059011, 6976001, 7021044, 7162688, 6963878, 6686881, 6678261, 6684586, 6905498, 6920763]
19968F920763J12880R8659M1091m9321J62234K67931P8803p866L1628P6905j49819
19957G583888k09499p4736M3834J93285K32117m2069N5381J17166J9609k4164
19947G894812o6523P832J00268P6724J52116l926j21617P1426J36956J20964O2965
19936H431997K8419N3027o4140l0623J22728L10054R6905j37055j27218K6010
19926H710104K6052J1245L6989J33517J05045P4911J33415L826r4456r0009n6408
19915H994231J83049J82957R1274J22078o5385k54112k8095L6103K82956K39014
19905I784070J08529J64392N8915m0055o1351K6888j29200J38383J38896M9632
19895A0239099M7721L5747m923M0799l5225m7798q9951j04328j8908Q0669J57261
$$ y = [6920763, 7033643, 7132302, 7173393, 7124072, 7286306, 7554237, 7633040, 7625174, 7656802, 7733707, 7583888, 7374389, 7299653, 7343487, 7536772, 7768889, 7726820, 7782201, 7899367, 7918976, 7894812, 7828289, 7836121, 7936389, 8013113, 8165229, 8161303, 8039686, 8111112, 8248068, 8369032, 8431997, 8460416, 8513443, 8449303, 8418680, 8541408, 8851462, 8948367, 8811312, 8684094, 8710104, 8736156, 8747401, 8784390, 8917907, 9022952, 9097863, 9231278, 9235104, 9140648, 9050639, 8994231, 9177280, 9360237, 9451511, 9573589, 9508204, 9254092, 9225997, 9262100, 9545056, 9784070, 9892599, 10056991, 10115906, 10075851, 10014500, 10041388, 9912188, 10050571, 10189467, 10239099, 10286820, 10322567, 10317644, 10358443, 10323218, 10275420, 10185469, 10081141, 10062233, 10142902, 10300163]
19884A0300163J878l5694K14683M3678M9904K73101J30809P66n0306O9371J18390
19873A1116743k11156N6198R7841J61286J20377J22926N2468J10819J1982j85718
19863A1453766J1876J61816Q8774J8654J7460p255r965J50449J17434J05681J75592
19852A2284282J36883j157J73742J08848j37791l3641m0097L2476J88640K2135
19842A2734320m1658M10J17294J13643K8299J06424J43212j9655K2054P2887p1054
19831A3206176J3528O0298J04494K95697J71447P7356J37255M2959J4153J07033
19821A4230396K6778m2046J55795J63180q3163n1993R4174K35530J37955J8381
19811A4884987J32789K07835L23317M4270N6045L2470j02261o9264J47275R379
$$ y = [10300163, 10302041, 10266347, 10481030, 10524708, 10574612, 10847713, 10978522, 10979288, 10928982, 10998353, 11116743, 10905587, 10961785, 11059626, 11220912, 11341289, 11464215, 11516683, 11627502, 11639484, 11453766, 11465642, 11627458, 11716232, 11734886, 11752346, 11745091, 11735126, 11885575, 12003009, 12108690, 12284282, 12421165, 12420008, 12593750, 12702598, 12564807, 12531166, 12491069, 12523545, 12712185, 12734320, 12692662, 12693072, 12810366, 12924009, 12952308, 13058732, 13201944, 13182289, 13204343, 13277230, 13206176, 13219704, 13280002, 13384496, 13680193, 13851640, 13928996, 14066251, 14109210, 14123363, 14230396, 14257174, 14215128, 14370923, 14534103, 14450940, 14398947, 14493121, 14728651, 14866606, 14884987, 15017776, 15225611, 15548928, 15593198, 15649243, 15681713, 15579452, 15510188, 15657463, 15666842]
19801A5666842k5602P6114J86595J52201j3137K08757J04133N0601J7627J75714
19791A6599845K31986J08598o2682J84485J70514J18871M0317K26376J50816p3029
19781A7696097l6419R5525J03382J81919N0330m8732K51701K01212J19589J88902
19771A8803506J70104K2504J34991K52875J41438j610J77957K55770J10210J68561
19761B0236306K87035M0934J56006J70160J1771P0431K96428K43089J69418J4838
19751B1696416Q6869R5943J90175K69456J63391K24309J97044K38258K54897J63629
19741B3580387L32610J34376K40686J30339N2695K08964J60868K00228J94149
19732B5235302L31694K14736J62606K4800J5560L65925M62654L40012K42196K88494
$$ y = [15666842, 15641240, 15717354, 15903949, 16056150, 16043013, 16251770, 16355903, 16406504, 16424131, 16599845, 16831831, 16940429, 16877747, 17062232, 17232746, 17351617, 17391934, 17618310, 17769126, 17696097, 17659678, 17755203, 17858585, 18040504, 18090834, 18042102, 18293803, 18495015, 18614604, 18803506, 18973610, 18996114, 19131105, 19383980, 19525418, 19523808, 19701765, 19957535, 20067745, 20236306, 20523341, 20564275, 20720281, 20890441, 20902212, 20972643, 21269071, 21512160, 21681578, 21696416, 21783285, 21879228, 22069403, 22338859, 22502250, 22726559, 22923603, 23161861, 23416758, 23580387, 23912997, 24047373, 24288059, 24418398, 24471093, 24680057, 24840925, 25041153, 25235302, 25566996, 25781732, 25944338, 25969138, 25984698, 26350623, 26813277, 27153289, 27395485, 27683979]
19722B7683979L83050M67489K96329K74746K37710J84448J18776K24464L55579
19713C0226570M61959L90839L36641L42580K78515L31982L90961M28393M06556
19704C3594996M45609M06127M41211M06397M68017N17216O55894M23921N19908
19695C7879296P22389N61890N74315N16956N41267P02860Q04667Q10270P03413
19686D3817323P53404J029529J036382Q80943R71228J189897J120274J300845
19678E2099825J221048J210364J172520J401097J654299J730276J708925J811599
19670F4009953J945169K081323K090464K084334K316331K367085K418427K249092
19662H1562178K469763K756039L218309L303267L015864K684725K305755J846900
$$ y = [27683979, 28067029, 28534518, 28830847, 29105593, 29343303, 29527751, 29646527, 29870991, 30226570, 30688529, 31079368, 31416009, 31758589, 32037104, 32369086, 32760047, 33188440, 33594996, 34040605, 34446732, 34887943, 35294340, 35762357, 36279573, 36935467, 37359388, 37879296, 38601685, 39163575, 39737890, 40254846, 40796113, 41498973, 42303640, 43113910, 43817323, 44570727, 45600256, 46636638, 47517581, 48488809, 49678706, 50798980, 52099825, 53320873, 54531237, 55703757, 57104854, 58759153, 60489429, 62198354, 64009953, 65955122, 68036445, 70126909, 72211243, 74527574, 76894659, 79313086, 81562178, 84031941, 86787980, 90006289, 93309556, 96325420, 99010145, 101315900, 103162800]
19654A03162800J238976J64101j903851n187321q126187q650595p855716q114994
19646F4727213j0266959j2735638j3247116j1212015q618300p643349p206849
19639f203013o158365m729816l383521j936639p22454K41179Q00451O94195Q59754
19630b0538229J356791K146623K923060K978350L139738L114429L215093L573615
19622A909470L724518L803034L975819L852416L823504L996671M135869M199410
19614C3420711L953780L673164L452121L388891K889415K250634J729429J520424
19606E6278569J852245K014928J797243Q18329j96731j061753k257018m371367
19598E4874445p196334r426012j0949177j3159024j5591209j6165727j4693705
$$ y = [103162800, 104401776, 104565877, 102662026, 97474705, 89348518, 80697923, 72842207, 64727213, 54460254, 41724616, 28477500, 17265485, 8647185, 1003836, -6203013, -12361378, -17091194, -20474715, -22411354, -23133808, -22892629, -22092178, -21397983, -20538229, -19181438, -17034815, -14111755, -11133405, -7993667, -4879238, -1664145, 1909470, 5633988, 9437022, 13412841, 17265257, 21088761, 25085432, 29221301, 33420711, 37374491, 41047655, 44499776, 47888667, 50778082, 53028716, 54758145, 56278569, 58130814, 60145742, 61942985, 62761314, 62564583, 61502830, 59245812, 54874445, 47678111, 38252099, 27302922, 14143898, -1447311, -17613038, -32306743]
19591c2306743j2712303j2202596j2363399j1036705p698068m085348j759040
19584i4164202p54551n53613J05533J574853K647744K966011K792679K626809
19576h2758737K503033K557437K539838K474066K376156K393999K167607K216067
19568f3530534J970195K030353J777679J599459J639669J633275J373898J264367
19560e0241639J214235Q54196Q48580R76238Q73618P49275R51020R15048O31185
19551d2228244N04001N35191P74699O09825P04777P29901O65859P72201O43098
19542c6288692N89132N87619P28226N39104N21818P05003O92787N34503M89412
19533c0901088M62428L90937L38151O06607N35515K79788N60558N67410O78085
$$ y = [-32306743, -45019046, -57221642, -69585041, -80621746, -88319814, -92405162, -94164202, -94918753, -95472366, -95366833, -93791980, -91144236, -88178225, -85385546, -82758737, -80255704, -77698267, -75158429, -72684363, -70308207, -67914208, -65746601, -63530534, -61560339, -59529986, -57752307, -56152848, -54513179, -52879904, -51506006, -50241639, -49027404, -48173208, -47324628, -46348390, -45474772, -44725497, -43774477, -42859429, -42228244, -41724243, -41189052, -40414353, -39804528, -39099751, -38369850, -37703991, -36931790, -36288692, -35699560, -35111941, -34383715, -33844611, -33322793, -32617790, -31925003, -31390500, -30901088, -30438660, -30047723, -29709572, -29102965, -28567450, -28287662, -27727104, -27159694, -26481609]
19524b6481609M47802N07052N55136M14176K77242K86036K58125L59712L94625
19515b2981703M19243O31530M51280K52349J80284M49224L68154L62739K11926
19506a9654974K18330J43716M11600M64327K21832J91526K95743L84566K97894
19497a7025440K06359K26725K46276J38760K26184M23234L25800J93852J59421
19488a4878829O2027J93400k0863J87635K91158N80127L55214P8834P3460K85313
19478a2792524K06484K60404J84562J85911K14059L50085K49089P4948j9M4490
19468a1022511K09652J05361J30333K44839R3008K40121O6553N1927J84509K54204
19458i442004O2703k1443J10015J5813J58019L21910K24172J37290K58314J02571
$$ y = [-26481609, -26033807, -25526755, -24971619, -24557443, -24280201, -23994165, -23736040, -23376328, -22981703, -22562460, -21930930, -21479650, -21227301, -21047017, -20597793, -20229639, -19866900, -19654974, -19436644, -19292928, -18881328, -18417001, -18195169, -18003643, -17707900, -17323334, -17025440, -16819081, -16592356, -16346080, -16207320, -15981136, -15557902, -15232102, -15038250, -14878829, -14816802, -14623402, -14644265, -14456630, -14165472, -13585345, -13230131, -13151297, -13077837, -12792524, -12586040, -12325636, -12141074, -11955163, -11741104, -11391019, -11141930, -11066982, -11067001, -11022511, -10812859, -10707498, -10577165, -10332326, -10239318, -9999197, -9932644, -9880717, -9696208, -9442004, -9379301, -9400744, -9290729, -9274916, -9116897, -8794987, -8570815, -8433525, -8175211, -8072640]
19448h072640K61513J49991n8723K54929K81395J1305n1498J73223J32680J79588
19438f738237K7728K71092K56051P2598K27657J78542J25280n0780P6047J42151
19428e411871J95111J12600J33745O4127l420Q175J77897K16707O1259P2237J44723
19417d228710J2200Q6574J45940O0590n2668J18654J34159L2359K7012L57006
19407c306884N3244P6800q6954J08433K34820J88081N3581J62427P326M2028J81260
19396b285838J04983m1482L3246K08739L16608J88730P6418M5232K0264J07157
19386a225943J70305k1227j9953M8911J00569K0040Q6075O1341J84981J41695
19376d53206J89200l5417o6242Q0906J86369K20526J11885k7910J5581J55672
$$ y = [-8072640, -7811127, -7661136, -7719859, -7464930, -7183535, -7172230, -7223728, -7050505, -6917825, -6738237, -6710509, -6439417, -6183366, -6110768, -5883111, -5704569, -5579289, -5630069, -5554022, -5411871, -5216760, -5104160, -4970415, -4906288, -4909708, -4901533, -4723636, -4506929, -4445670, -4373433, -4228710, -4216510, -4129936, -3983996, -3923406, -3976074, -3857420, -3723261, -3690902, -3663890, -3306884, -3253640, -3176840, -3263794, -3155361, -2920541, -2732460, -2678879, -2516452, -2509126, -2467098, -2285838, -2180855, -2222337, -2189091, -1980352, -1663744, -1475014, -1398596, -1353364, -1333100, -1225943, -1055638, -1076865, -1096818, -1047907, -947338, -927298, -841223, -779882, -594901, -453206, -264006, -299423, -365665, -284759, -98390, 122136, 234021, 206111, 221692, 377364]
19366C77364J73010L10J75766J28106P0464K29966J46470J19985Q0956R7473J61477
19355A761347K07745j2908N9452L3889j48020l3550J47260K07074K56735Q9608
19345B568632O3616q5726J03316K46085K48123J88956O7647O5346Q872K552j4620
19334C462799K20417K13071J67975K5551l1364O6839J79990k1043l6104J58286
19324D406417J56774J36593L5752K16004K30967K84461J09601O421L7863J36719
19314E757572J97557L9014K31032J43271J30901K38750Q6857j488P2182J92825
19304G088473K78893J16979K16117J08362m0319J74143K53908K46674J46954J82547
19294H772731J30914r524J08026K57634J37906K32623K28791J07453J30895K64961
$$ y = [377364, 550374, 550684, 726450, 854556, 925020, 1154986, 1301456, 1421441, 1502397, 1599870, 1761347, 1969092, 1956184, 2015636, 2049525, 1901505, 1867955, 2015215, 2222289, 2479024, 2568632, 2632248, 2546522, 2649838, 2895923, 3144046, 3333002, 3400649, 3465995, 3474867, 3477419, 3462799, 3683216, 3896287, 4064262, 4089813, 4058449, 4125288, 4305278, 4284235, 4248131, 4406417, 4563191, 4699784, 4735536, 4951540, 5182507, 5466968, 5576569, 5582990, 5620853, 5757572, 5955129, 5994143, 6225175, 6368446, 6499347, 6738097, 6824954, 6823466, 6895648, 7088473, 7367366, 7484345, 7700462, 7808824, 7768505, 7942648, 8196556, 8443230, 8590184, 8772731, 8903645, 8894121, 9002147, 9259781, 9397687, 9630310, 9859101, 9966554, 10097449, 10362410]
19284A0362410J88594K00844O0289k0541J49387J89364J86993N3300J76229J40854
19274A1687723J49951M0613J51275J91589K48173J76937L42019L43111K93835
19265A3625226J36788L09414N9491J02364K16821J53082J14218K77287K64564
19256A5259255J65722L77615M48127K57650J39229J89342L79654L53374M20166
19247A7990134K94657K71043J03106J08311K16463L74816L18931J93298M59624
19238B0330383L60346K98330M93759L29084M22451M32884K47966L66134M80118
19229B3761455N10482L66791M87874N29489M35989N29134M51198O41267N88099
19220B8301778N35943M33772N82179P16876O62112N72714N80558Q46080Q91705
$$ y = [10362410, 10551004, 10751848, 10812137, 10791596, 10940983, 11130347, 11317340, 11370640, 11546869, 11687723, 11837674, 11878287, 12029562, 12221151, 12469324, 12646261, 12988280, 13331391, 13625226, 13762014, 14071428, 14130919, 14233283, 14450104, 14603186, 14717404, 14994691, 15259255, 15424977, 15802592, 16250719, 16508369, 16647598, 16836940, 17216594, 17569968, 17990134, 18284791, 18555834, 18658940, 18767251, 18983714, 19358530, 19677461, 19870759, 20330383, 20690729, 20989059, 21482818, 21811902, 22234353, 22667237, 22915203, 23281337, 23761455, 24271937, 24638728, 25126602, 25656091, 26092080, 26621214, 27072412, 27713679, 28301778, 28837721, 29271493, 29853672, 30570548, 31232660, 31805374, 32385932, 33232012, 34123717]
19211C4123717Q41527R04931P60906R60760R55229R99178J031611J086958J244821
19202D2909638J251807J137658J408722J570205J585171J729547J777940J886341
19194E5257029J831603K162645K644020K563566K443126K468481K827489L074025
19186G5271984L153592K964608K718840K634815L115147L740322M155464M186666
19178A01941438L815221K899158J730302Q59283k72436l033558p757682j2521938
19170H7659788j4068145j3965409j5701955j8023935j8220448j5879244j2926280
19163b1125628j0907343q269884n084189k473230j150943n29477l18222M53559
19155d9405357J027976P13244M01475O91062J172510K150885K941324L313702
$$ y = [34123717, 34965244, 35870175, 36631081, 37591841, 38547070, 39546248, 40577859, 41664817, 42909638, 44161445, 45299103, 46707825, 48278030, 49863201, 51592748, 53370688, 55257029, 57088632, 59251277, 61895297, 64458863, 66901989, 69370470, 72197959, 75271984, 78425576, 81390184, 84109024, 86743839, 89858986, 93599308, 97754772, 101941438, 105756659, 108655817, 110386119, 111245402, 110972966, 107939408, 100181726, 87659788, 73591643, 59626234, 43924279, 25900344, 7679896, -8199348, -21125628, -32032971, -40302855, -45387044, -47860274, -49011217, -49540694, -49858916, -49405357, -48377381, -47664137, -47262662, -46571600, -45399090, -43248205, -40306881, -36993179]
19147c6993179L585822L683396L793116L977014L780266L603313L606408L699932
19139g263912L910008L841752L817332L751742L553278L336422L173591K882402
19131B1002615K705039K356605J406689Q49084J054743J330528J062304J2798
19123C1780405p95246j240660k336591m254492o001525o785249q099431j1254776
19115h987565j4571038j5150011j3059663j1737758j2138928j1385802p972884
19108i5003649m465533j895722J93938J626991K363342K640306K915807L149291
19100h8475229K803664K165632J895641J916098J943833J998863K116113K004446
19092g1630939J881971J902856J820882J946193J577876J296762J321042J374382
$$ y = [-36993179, -33407357, -29723961, -25930845, -21953831, -18173565, -14570252, -10963844, -7263912, -3353904, 487848, 4305180, 8056922, 11610200, 14946622, 18120213, 21002615, 23707654, 26064259, 27470948, 28320032, 29374775, 30705303, 31767607, 31780405, 30985159, 29744499, 27407908, 23153416, 17151891, 10366642, 2267211, -8987565, -23558603, -38708614, -51768277, -63506035, -75644963, -87030765, -95003649, -99469182, -101364904, -101170966, -99543975, -97180633, -94540327, -91624520, -88475229, -85671565, -83505933, -81610292, -79694194, -77750361, -75751498, -73635385, -71630939, -69748968, -67846112, -66025230, -64079037, -62501161, -61204399, -59883357, -58508975]
19084e8508975J160225R18776J036618J024154Q72806Q37924R55584O97023O89305
19075e0316560O74745O78927N92087N85304M32629O30678O48762O02668O81187
19066d4789573M92759M74041P56124P98293N24090M21310O94066N52434K87137
19057c9789319M35396O24657M08453L37641K96540M20545O76105L71583K34100
19048c5984299N08584M63145L47869K68602K89207M58038L72334L56469K74700
19039c2645351M12135L89631K10737K23674J77053M42725M11209K55437K98384
19030b9824366L40151K93366K40695K43465L65042K97855K26607J08838M54047
19021b7254300L43952L02695K50776Q7105J56403J55870J30080J84639R8210K76001
$$ y = [-58508975, -57348750, -56429974, -55393356, -54369202, -53496396, -52658472, -51702888, -51005865, -50316560, -49641815, -48962888, -48370801, -47785497, -47352868, -46722190, -46073428, -45470760, -44789573, -44296814, -43822773, -43066649, -42268356, -41744266, -41322956, -40628890, -40076456, -39789319, -39353923, -38729266, -38320813, -37983172, -37686632, -37266087, -36589982, -36218399, -35984299, -35475715, -35012570, -34664701, -34396099, -34106892, -33648854, -33276520, -32920051, -32645351, -32233216, -31843585, -31632848, -31409174, -31232121, -30789396, -30378187, -30122750, -29824366, -29484215, -29190849, -28950154, -28706689, -28341647, -28043792, -27817185, -27708347, -27254300, -26910348, -26607653, -26356877, -26269772, -26113369, -25957499, -25827419, -25642780, -25544570, -25268569]
19011b5268569L24548L00223K45290J92069j09926p268K53923M64587K69423J59780
19001b3175920O3276J73991J60597K37188L05870K30200J97565J29000M0249L2407
18991b1605577J21877J96710J0620j04621J10215J82141J87678L35491K90384
18982b0275082O2942K9288K11622j6894J41197l4206N2532J89208O8992o4046
18972a9634447J40623J90649Q5891J24718J60267K16536J93715m4348K0182P9407
18962a8466807J41344J10566K48973K46661n0406j43578K7245K30732J76576o0326
18952a7539020L966K58828K04491p8851R2088J70909J66735k6343N9940j54238
18942a6841495J0451J33196J44695O3992Q2280K39177J45067J00517J57926m2896
$$ y = [-25268569, -24944021, -24643798, -24398508, -24206439, -24316365, -24323633, -24069710, -23605123, -23335700, -23175920, -23112644, -22938653, -22778056, -22540868, -22234998, -22004798, -21807233, -21678233, -21637984, -21605577, -21483700, -21286990, -21276370, -21380991, -21270776, -21088635, -20900957, -20565466, -20275082, -20212140, -20182852, -19971230, -19988124, -19846927, -19881133, -19828601, -19639393, -19570401, -19634447, -19493824, -19303175, -19217284, -19092566, -18932299, -18715763, -18522048, -18566396, -18546214, -18466807, -18325463, -18214897, -17965924, -17719263, -17769669, -17913247, -17886002, -17655270, -17478694, -17539020, -17535054, -17276226, -17071735, -17150586, -17058498, -16887589, -16720854, -16747197, -16687257, -16841495, -16831044, -16697848, -16553153, -16489161, -16406881, -16167704, -16022637, -15922120, -15764194, -15807090]
18932a5807090p5807j02893J50481K12098K11503l3872k31983M2442K71756J97233
18922a5166132K6491J8607J11857J926M8701r4816O4807J40707o8682J23836J22248
18911a4670450K9221J77496J54456k5472k42152j89648J47156J54035r9200J23146
18901a4441412K69022R1656O5572J52596K20604M0147k73511r2862k1090O3567
18891a3925711J38426P1545m8773N735K34714P6478R6765J94047J13164m541j04863
18880a3153014n7805p3597l8710R1732K28395J9385K0959N4053K49721P042p6728
18869a2728567q6676K34250J68683J11746n45P2843J50999o2383m5689N1956N9638
18858a2073745J0595o2525j04998Q3439N4388M277Q8747J45927L1356J82053J21906
$$ y = [-15807090, -15882897, -15985790, -15835309, -15623211, -15411708, -15445580, -15677563, -15635121, -15363365, -15166132, -15139641, -15121034, -15009177, -15007251, -14958550, -15053366, -14988559, -14847852, -14916534, -14792698, -14670450, -14641229, -14463733, -14309277, -14334749, -14576901, -14766549, -14619393, -14465358, -14564558, -14441412, -14172390, -14080734, -14015162, -13862566, -13641962, -13601815, -13875326, -13968188, -13989278, -13925711, -13787285, -13715740, -13764513, -13758778, -13524064, -13447586, -13350821, -13156774, -13043610, -13048151, -13153014, -13210819, -13284416, -13323126, -13231394, -13002999, -12983614, -12962655, -12908602, -12658881, -12651839, -12728567, -12815243, -12580993, -12412310, -12300564, -12301109, -12228266, -12077267, -12139650, -12185339, -12133383, -12073745, -12063150, -12125675, -12230673, -12147234, -12092846, -12088569, -11999822, -11853895, -11822539, -11640486, -11518580]
18847a1518580r3934O5007J59316P1277j8652J68537j89571j75307J8815J70932
18837a1342160J31752M0839j14814j947K05182J51052r3189j8622j4864j7886
18827a1074657J29111O6800k5583l5101P4376n4393J1633J98392K7858L2139n9924
18816a0709349R5954j3619q8004Q1830J00394M6934q867J68764j38379J7631J21683
18805a0325028J56741N4729k3339P2J0021R2285M9080k56p2266j77944N9996J53825
18793a0022084J32490j7372j04099M5360J06406R6145K01860J24142n7110q0434
18783i574696N7286P8980l2078Q121o7824j38749R0942R2397p2029j35820R3185
18772i600285N0615J0264M1193j01290R1523K67397K46175K127o6564j04987m4968
$$ y = [-11518580, -11612514, -11547507, -11388191, -11316914, -11335566, -11167029, -11356600, -11531907, -11513092, -11342160, -11210408, -11169569, -11284383, -11286330, -11081148, -10930096, -11023285, -11041907, -11056771, -11074657, -10945546, -10878746, -10904329, -10939430, -10865054, -10919447, -10907814, -10709422, -10681564, -10649425, -10709349, -10613395, -10627014, -10715018, -10633188, -10532794, -10485860, -10494727, -10325963, -10464342, -10446711, -10325028, -10168287, -10113558, -10136897, -10136825, -10126804, -10034519, -9985439, -9985695, -10057961, -10235905, -10175909, -10022084, -9889594, -9906966, -10011065, -9965705, -9859299, -9763154, -9561294, -9437152, -9494262, -9574696, -9517410, -9438430, -9470508, -9462387, -9530211, -9668960, -9578018, -9485621, -9557650, -9693470, -9600285, -9549670, -9539406, -9498213, -9599503, -9507980, -9240583, -8994408, -8992281, -9058845, -9163832, -9208800]
18761i208800J11710q7077k118r5485m9120P5026K01134N3692m803J2681o151
18750h999311j8179J03048M9357l2063L3578J34516l967o0722r5064Q0811j322
18739h809318K7183M0069k245r0588N3385J18479J94927L7000j32553J842Q1974
18728h479845J70257l2918N258O428p150M4895L3593K7303k823q8217K6546J0573
18716h286100K7823O3090Q4444J35485p6811l1964m0187J312J36153q2689j04618
18705h174062m3627J19790Q8082J55140J26417n957p9542k51353L9491J39911
18695g885710n0511j30294p714J40925M16j2002J18519M3582l6891J42826J28940
18684g547914K7942j31261P7031J98211N1511P651P3781m2206p7940o798O0555
$$ y = [-9208800, -9097090, -9184167, -9186285, -9281770, -9330890, -9255864, -9054730, -9001038, -9005841, -8993160, -8999311, -9017490, -8914442, -8865085, -8897148, -8863570, -8729054, -8733021, -8793743, -8888807, -8807996, -8809318, -8782135, -8742066, -8744311, -8834899, -8781514, -8663035, -8468108, -8431108, -8563661, -8561819, -8479845, -8309588, -8342506, -8337248, -8330820, -8337970, -8293075, -8259482, -8232179, -8235002, -8323219, -8296673, -8286100, -8258277, -8195187, -8110743, -7975258, -8052069, -8084033, -8124220, -8122908, -7986755, -8069444, -8174062, -8217689, -8097899, -8009817, -7854677, -7728260, -7734217, -7813759, -8065112, -8025621, -7885710, -7936221, -8066515, -8074229, -7933304, -7932888, -7944890, -7826371, -7782789, -7819680, -7676854, -7547914, -7519972, -7651233, -7574202, -7375991, -7324480, -7316829, -7243048, -7285254, -7363194, -7369992, -7309437]
18673g309437o5354k8495N4794J48443K8835K5623p1120j01810k3360N4888J31817
18662g155176J88585K5318J46705J36086q3908l1706j10726j33613o7093J357
18652g084171Q281J32714K76261J05509k05340j68330R9633O7429M793o9584j20900
18641f953705p23P1315P7684N488L809j44766o9944J94067j65838j95485J6133
18630g161965o9634Q5422K05931o4895m9429J67220K2179j02462J2638Q1227k0713
18619f894481m1155j20496J53791J21415o2021Q6672N4335n7644l7690j19048
18609f916322R6819J78066J86554l7294J23625o4360n8844J17619Q1332k6766
18599f319571M2311M4325j50166j72300Q5053J14092j65869j13426q1885R194
$$ y = [-7309437, -7374791, -7403286, -7348492, -7200049, -7171214, -7145591, -7216711, -7318521, -7341881, -7286993, -7155176, -6966591, -6941273, -6794568, -6658482, -6742390, -6774096, -6884822, -7018435, -7085528, -7084171, -7075890, -6943176, -6666915, -6561406, -6766746, -6935076, -6835443, -6768014, -6763221, -6832805, -6953705, -6954428, -6883113, -6805429, -6799941, -6796132, -6940898, -7010842, -6816775, -6982613, -7178098, -7161965, -7231599, -7146177, -6940246, -7005141, -7054570, -6887350, -6865171, -6967633, -6954995, -6873768, -6894481, -6935636, -7056132, -6902341, -6780926, -6842947, -6756275, -6701940, -6759584, -6797274, -6916322, -6819503, -6641437, -6454883, -6492177, -6368552, -6432912, -6491756, -6374137, -6292805, -6319571, -6277260, -6232935, -6383101, -6555401, -6470348, -6356256, -6522125, -6635551, -6717436, -6708242]
18589f708242q6055J75846P6484j66191O6517J22138q5241j46734r1883j2690
18579f856051k7159r3073K019K58548j18208n5773M1712k1494J0356K4543P8866
18568f755714J84477N1979j26649K5809J6047K2868J2005k238J84022N546n4470
18557f436318M7083M8368p2509m4460O5232M6359j65768J01833J93317R3397j2228
18546f135694p6333J37870L3812q1734l9752K3603Q9704p2906k14275L8456J80158
18535f117091J69465J09468O1861O296k30500n6080m7071J13188J34627m8922
18525e904759r7005j86447O9202R0797J28324J3333L9201N0419j288K15482L585
18514e579156k01587j87872k6547O3797Q1069M0173M0827j15682j7497P4283J1934
$$ y = [-6708242, -6794297, -6618451, -6541967, -6708158, -6641641, -6519503, -6604744, -6751478, -6843361, -6856051, -6883210, -6976283, -6974264, -6715716, -6833924, -6889697, -6847985, -6869479, -6859123, -6834580, -6755714, -6571237, -6519258, -6645907, -6620098, -6604051, -6581183, -6569178, -6571416, -6387394, -6381848, -6436318, -6389235, -6340867, -6413376, -6457836, -6392604, -6346245, -6512013, -6410180, -6216863, -6123466, -6135694, -6212027, -6074157, -6040345, -6122079, -6161831, -6138228, -6048524, -6121430, -6335705, -6297249, -6117091, -5947626, -5838158, -5776297, -5770001, -6000501, -6056581, -6103652, -5990464, -5855837, -5904759, -6001764, -6188211, -6119009, -6028212, -5899888, -5886555, -5847354, -5796935, -5798223, -5582741, -5579156, -5780743, -5968615, -5995162, -5931365, -5850296, -5810123, -5769296, -5884978, -5902475, -5828192, -5816258]
18503e816258r7174J8915J26740L1392j7074n0888k9062O6692O9368J19082j13549
18492e691816j34653J11200M0709L9018q196M8709N5281k7740n1201k06060j4588
18481e839337K23592J39136N6516N0564K1950K5267q8514k37104j5464l0340K7086
18470e666648k4341R6474P4878L806J42821R8287l9917j02126M1379K23143N4541
18459e097703n1664L0162m1213K7429L9727j61688m9911N8877o0764O0872j83469
18448e429345p4276l8334J18542J16982j9743P796J16784N3070R955J710j19737
18437e256596n4466K2082l6160P2435j3763j3154j0496M1439J20972p6074J38934
18426e064847L1337j03534N207K392Q7238J34221P4358q7407k14851J2051Q7721
$$ y = [-5816258, -5913432, -5894517, -5767777, -5736385, -5753459, -5804347, -5833409, -5766717, -5697349, -5578267, -5691816, -5826469, -5715269, -5674560, -5635542, -5643738, -5595029, -5539748, -5567488, -5618689, -5824749, -5839337, -5615745, -5476609, -5420093, -5369529, -5347579, -5322312, -5410826, -5647930, -5663394, -5693734, -5666648, -5690989, -5594515, -5519637, -5515831, -5373010, -5274723, -5314640, -5416766, -5375387, -5152244, -5097703, -5149367, -5119205, -5160418, -5132989, -5093262, -5254950, -5304861, -5245984, -5306748, -5245876, -5429345, -5503621, -5541955, -5423413, -5306431, -5326174, -5318378, -5201594, -5148524, -5138569, -5136859, -5256596, -5311062, -5288980, -5325140, -5252705, -5266468, -5279622, -5290118, -5248679, -5127707, -5203781, -5064847, -5033510, -5137044, -5131837, -5129445, -5042207, -4907986, -4833628, -4921035, -5135886, -5123835, -5036114]
18415e036114J3932J1186j66120R5779K07223J37157J03886j15842j23865j24440
18405d997218O1349J98878Q901n374J48819J1405q7652N0288M2703M3748q0608
18394d604761r0870m4334q8544J30251J82697j02291j11647M5751q4604J8626
18384d749726R6235n8631M3318r3647N597M3887J46812m6512j05323j39455L4456
18373d822989o6086P1754M9451M1184j9122K5084J80228l8834q1335o8576L1604
18362d697637n6477L1220J49745Q5926m1530j24396p0693o0812R3488J53071o5200
18351d603295j19994N6390J22904N3289j6932r0866J1390n6429m3886K4887J02289
18340d560253j05115j20210l996J28565K0168m9881j2612K9413k3370Q227P6066
$$ y = [-5036114, -5022182, -5010996, -5177116, -5081337, -4874114, -4736957, -4633071, -4748913, -4872778, -4997218, -4935869, -4736991, -4728090, -4733464, -4584645, -4573240, -4660892, -4610604, -4567901, -4524153, -4604761, -4695631, -4739965, -4828509, -4698258, -4515561, -4617852, -4729499, -4683748, -4768352, -4749726, -4653491, -4712122, -4668804, -4762451, -4756854, -4712967, -4566155, -4612667, -4717990, -4857445, -4822989, -4889075, -4817321, -4767870, -4726686, -4745808, -4720724, -4540496, -4579330, -4660665, -4729241, -4697637, -4754114, -4722894, -4573149, -4487223, -4528753, -4653149, -4723842, -4784654, -4691166, -4538095, -4603295, -4723289, -4666899, -4543995, -4490706, -4507638, -4598504, -4587114, -4643543, -4687429, -4662542, -4560253, -4665368, -4785578, -4789574, -4661009, -4640841, -4690722, -4703334, -4673921, -4697291, -4689064, -4612998]
18329d612998J93695J18090L2348k2307j44192j70354K7048L4331R5584J710R2228
18318d354817J90598L6534j49583l6830J63039J0301j01449q4788J71409j9228
18308d174814k41481Q379K345k1600K07051M3496j6070K0116J49616L9936j30653
18297d113679j74151p2932L4905L1593o212r7197N9017J70392M0454N0179P1758
18286d005873M3988P9902q6038j49342O4644M4810j20249O6045m0267k8340m9481
18275d180201k4190n1412R8304N7732o2047j79339o5677J56608J96061j13314
18265d167475l2274n8476o505J14095P1285J23337o5336M3397K0356O0592n1598
18254c948602n4161j64665k5170J72091k445L1955P8135J20138J11299j23653
$$ y = [-4612998, -4419303, -4301213, -4268865, -4291172, -4435364, -4605718, -4578670, -4544339, -4448755, -4447045, -4354817, -4164219, -4127685, -4277268, -4314098, -4151059, -4140758, -4242207, -4326995, -4155586, -4174814, -4416295, -4407916, -4405571, -4427171, -4220120, -4176624, -4192694, -4172578, -4022962, -3983026, -4113679, -4287830, -4360762, -4325857, -4294264, -4300476, -4397673, -4338656, -4168264, -4127810, -4077631, -4005873, -3961885, -3881983, -3968021, -4117363, -4052719, -4007909, -4128158, -4062113, -4102380, -4130720, -4180201, -4204391, -4255803, -4157499, -4099767, -4161814, -4341153, -4406830, -4250222, -4054161, -4167475, -4199749, -4258225, -4264730, -4150635, -4079350, -3956013, -4021349, -3977952, -3957596, -3897004, -3948602, -4002763, -4167428, -4192598, -4020507, -4022952, -3990997, -3912862, -3792724, -3681425, -3805078]
18244c805078j04261Q6530J02112J0324r6378j45762L4140O837N2796J26566P0376
18233c661798N841J9941J00555j06042k05988L1400J17659J60217r5005m9844
18223c683064P0500R2879j6671n7773l7089j75789j17738j11615k45365M5716
18213d236009J40902J14542n0948L0070J07174Q3258O2866N1461j0306q7049o3011
18202c857050k5812O0474j5407L4604J05834J19659l2643j02527l2219J41314
18192c603773J42743j86594k38230J5431n1172o7606J36335J31623R1959n6082
18182c685366j68364P9632K25737p7505r4228J6071P1991J7353R9850k5774R8025
18171c442578J24205O582r6502p9337m0355n5939M1236J17211j96598K954L9380
$$ y = [-3805078, -3909339, -3822809, -3720697, -3710373, -3806751, -3952513, -3918373, -3911536, -3858740, -3732174, -3661798, -3655957, -3636016, -3535461, -3641503, -3847491, -3816091, -3698432, -3538215, -3633220, -3683064, -3612564, -3519685, -3536356, -3594129, -3631218, -3807007, -3924745, -4036360, -4281725, -4236009, -4095107, -3980565, -4031513, -4001443, -3894269, -3811011, -3748145, -3696684, -3706990, -3794039, -3857050, -3882862, -3822388, -3837795, -3803191, -3697357, -3577698, -3610341, -3712868, -3745087, -3603773, -3461030, -3647624, -3885854, -3870423, -3921595, -3989201, -3852866, -3721243, -3629284, -3685366, -3853730, -3774098, -3548361, -3625866, -3720094, -3704023, -3632032, -3614679, -3514829, -3540603, -3442578, -3318373, -3311791, -3408293, -3487630, -3527985, -3583924, -3542688, -3425477, -3622075, -3619121, -3579741]
18160c579741j58930o4600J17623k6404r588q8265R0166j38584j123Q2616P897
18149c768933J38875J22558J94945p9618j41348L4621m8398q2778J1813J05345
18139c512918J03563j4992q4177O1321p0662o1344J49133J28688N5074J8733j24331
18128c351912p3442J03922q211L858L7596P4236n830o6294j7785m0422r711o4120
18116c418115O1309J63993l2674o5103J27423m4361j10387J75113Q716J8441R9413
18105c016232o3062n5453o8850j05570k7898J18886J77284L938l8746j15224j39880
18094c330807J09329K3154J511j00813n8310J56691J45178J58454p4188l7494
18084c007295j54599J29099j33578k02345J02058J37624J21571q1997j56288Q2145
$$ y = [-3579741, -3738671, -3803271, -3685648, -3712052, -3721640, -3809905, -3719739, -3858323, -3859446, -3776830, -3768933, -3630058, -3507500, -3312555, -3392173, -3533521, -3498900, -3547298, -3630076, -3618263, -3512918, -3409355, -3424347, -3508524, -3447203, -3517865, -3579209, -3430076, -3301388, -3246314, -3227581, -3351912, -3425354, -3321432, -3329643, -3325785, -3288189, -3213953, -3219783, -3286077, -3303862, -3344284, -3353995, -3418115, -3356806, -3192813, -3225487, -3290590, -3163167, -3207528, -3317915, -3142802, -3134086, -3115645, -3016232, -3079294, -3134747, -3203597, -3309167, -3337065, -3218179, -3040895, -3036957, -3075703, -3190927, -3330807, -3221478, -3198324, -3196813, -3297626, -3355936, -3199245, -3054067, -2895613, -2969801, -3007295, -3161894, -3032795, -3166373, -3368718, -3266660, -3129036, -3007465, -3089462, -3245750, -3163605]
18074c163605J25562l938p7940j25554K799L1660o5598N5059L5730R902J37491
18063c038432J48418p5108q5970J20017M2826K8880o0885n8687p6297K8215J21596
18052b905427r8550O049N0786j52283k4677M2103J77135l6514j8312J32901n0044
18041b876833j12676k16955l4564J36634J34163K4510j06774l6995l2760m3602
18031c165852j16270k0905l9686J09191k9964p225J50775J49733J716Q4776M524
18020b879187J7457J15429K9829p7015k3735j22561m5042M6898J36001J3986j8303
18009b806243o8870r7960q4488l8587k1860J9771J03640K89134R6628j34266j26305
17998b869406M9713o7064j87230q133q3770J01045P5094m7374j2213R7533k6239
$$ y = [-3163605, -3038043, -3041981, -3119921, -3245475, -3242676, -3211016, -3276614, -3221555, -3185825, -3175923, -3038432, -2890014, -2965122, -3051092, -2931075, -2888249, -2859369, -2920254, -2978941, -3055238, -3027023, -2905427, -3003977, -2997928, -2947142, -3099425, -3124102, -3081999, -2904864, -2941378, -2959690, -2826789, -2876833, -2989509, -3206464, -3241028, -3104394, -2970231, -2945721, -3052495, -3089490, -3122250, -3165852, -3282122, -3303027, -3342713, -3233522, -3263486, -3270711, -3119936, -2970203, -2968487, -2883711, -2879187, -2861730, -2746301, -2716472, -2793487, -2817222, -2939783, -2984825, -2937927, -2801926, -2787940, -2806243, -2875113, -2973073, -3057561, -3096148, -3118008, -3098237, -2994597, -2705463, -2608835, -2743101, -2869406, -2819693, -2886757, -3073987, -3082120, -3165890, -3064845, -2989751, -3037125, -3049338, -2951805, -2978044]
17987b978044n5422K47799J8841q7474j33513Q0765J49969j54959l8495r2739
17977c043272K8665J07433J45514K4377M8704j5834n8161j48539j19806L7228
17967b993691M9885J22953K0208o4042o9450q4154N325L6207P9094O5090J2102
17956b820473p4995J12561J86751L2820r4259o0604P4528J77345m5868k09665
17946b721859J5068J05730j38756n3551L9784N7431m5543l9017J60040J58646
17936b462027r7749j99590j31825k4213j0865N3599J55696K0415J4772J7053k1359
17925b686093O5262p5443j4869q6938o4877K1401O2077J28991J3135j12513j67001
17914b916868j56626J18650k0745k7272M7863Q3953k4409j02092l5204J84231
$$ y = [-2978044, -3033466, -2785667, -2766826, -2854300, -2987813, -2907048, -2757079, -2912038, -2950533, -3043272, -3014607, -2907174, -2761660, -2737283, -2688579, -2704413, -2762574, -2911113, -3030919, -2993691, -2943806, -2820853, -2800645, -2864687, -2934137, -3018291, -3012966, -2976759, -2897665, -2832575, -2820473, -2895468, -2782907, -2596156, -2563336, -2657595, -2718199, -2643671, -2466326, -2512194, -2721859, -2706791, -2601061, -2739817, -2793368, -2753584, -2696153, -2741696, -2780713, -2620673, -2462027, -2559776, -2759366, -2891191, -2915404, -2926269, -2872670, -2716974, -2696559, -2681787, -2664734, -2686093, -2620831, -2696274, -2711143, -2798081, -2862958, -2841557, -2779480, -2650489, -2637354, -2749867, -2916868, -3073494, -2954844, -2975589, -3002861, -2954998, -2871045, -2895454, -2997546, -3032750, -2848519]
17904b848519P0599M7777L4386j4021m9118L0433J12079M3274k5590J4189j75056
17893b759567j0570L4046o3548J50867m832l7928Q2753J40881o9J6483k4476J21623
17881b354337J9341p3449n7728J03535q6612N1079r0989o7970J8643o1925N252
17870b595160J7240L6419q721P9918M6262Q8448J2663K2252Q0435M1039j8953
17859b198158k2359j51806p1893Q412J12552J27992J00604j61658k56025l2408
17849b544747J6313O1637R0957Q7835n1395j68180l2140M2354p6920l7285K1351
17838b590220j04820m1904J26186L0624P551m7645l4249R6014J38191N8917j4499
17827b375854j6364j03199L990J09559l4430l3542p5764R1043O7748M8825N1328
$$ y = [-2848519, -2777920, -2730143, -2695757, -2709778, -2758896, -2728463, -2616384, -2573110, -2598700, -2584511, -2759567, -2770137, -2736091, -2799639, -2648772, -2653604, -2691532, -2608779, -2467898, -2467967, -2451484, -2475960, -2354337, -2334996, -2408445, -2466173, -2362638, -2449250, -2398171, -2489160, -2557130, -2538487, -2600412, -2595160, -2577920, -2541501, -2550222, -2470304, -2424042, -2335594, -2322931, -2300679, -2220244, -2179205, -2198158, -2220517, -2372323, -2444216, -2435804, -2323252, -2195260, -2094656, -2256314, -2512339, -2544747, -2528434, -2466797, -2375840, -2288005, -2339400, -2507580, -2539720, -2497366, -2574286, -2611571, -2590220, -2695040, -2736944, -2610758, -2580134, -2572583, -2620228, -2654477, -2558463, -2420272, -2361355, -2375854, -2392218, -2495417, -2491427, -2381868, -2416298, -2449840, -2525604, -2434561, -2366813, -2317988, -2266660]
17816b266660J0871j88961j56587J54378J54903J2233M6584M3091q705j75269
17806b374122n8218N2872Q684m8065M8237M1053K3737K45340n5221j77086L057
17795b289732L3186q6993k9461m5086R7918M1876j1529l0629j7077j20295j6632
17784b474454p3537J6614J45193J25143m4219q817n467q0021j32113Q1171M5549
17773b404958J31392r7566q4946N4856j33810K6472j577O7893l6145N7814J52488
17762b268087p5179N9964J62472L5540m9217n0294j49716k13046k5486J3921p138
17751b566266J41606J65867J34798o5888J2033l3119r0210j20021Q6607o8587
17741b403180k2336p8774r1754J67600P0653J19345J08218J40320O2251j12909
$$ y = [-2266660, -2255789, -2444750, -2601337, -2446959, -2292056, -2279823, -2233239, -2190148, -2198853, -2374122, -2432340, -2379468, -2370784, -2418849, -2370612, -2329559, -2305822, -2060482, -2115703, -2292789, -2289732, -2256546, -2343539, -2373000, -2418086, -2320168, -2278292, -2289821, -2320450, -2337527, -2457822, -2474454, -2547991, -2531377, -2386184, -2261041, -2305260, -2314077, -2319544, -2399565, -2531678, -2450507, -2404958, -2273566, -2371132, -2456078, -2401222, -2535032, -2508560, -2510137, -2442244, -2478389, -2420575, -2268087, -2343266, -2283302, -2120830, -2085290, -2134507, -2184801, -2334517, -2547563, -2573049, -2559128, -2566266, -2424660, -2258793, -2123995, -2189883, -2177850, -2210969, -2301179, -2421200, -2334593, -2403180, -2425516, -2504290, -2596044, -2428444, -2357791, -2238446, -2130228, -1989908, -1927657, -2040566]
17731b040566K7333L5814m0341R526q0699j66968P0424J71988M2634P0203M6589
17720a854063J36206k2500k71299j68305k0011J76824m1015k24033m8760J59532
17710b177424j018k7488r735P381R9117K73444J7730j91046M9769L9877n7499
17699a976892j27249J73475J44779j5603k9318R1577R0677p2756o444q5538j18221
17688a931513o7489O7410K1497o8410J2704O7906K7730j82082n833j8494Q3914
17677a992660k45373O1164K02917K87499J8266j64496l311j08288j61777K1718
17667b084341l1649N9477k0652O7081Q6274l8071P616m09J33121p7652k8777N4772
17655a873210M6020N7703q8738j39955m9011l4690Q1016J15264j1958r2870J1371
$$ y = [-2040566, -2013233, -1977419, -2017760, -2008234, -2088933, -2255901, -2185477, -2013489, -1970855, -1900652, -1854063, -1717857, -1740357, -2011656, -2179961, -2199972, -2023148, -2064163, -2288196, -2336956, -2177424, -2178442, -2205930, -2215665, -2208284, -2109167, -1835723, -1817993, -2009039, -1959270, -1919393, -1976892, -2104141, -1930666, -1785887, -1801490, -1830808, -1739231, -1648554, -1721310, -1727754, -1813292, -1931513, -1999002, -1931592, -1910095, -1978505, -1965801, -1897895, -1870165, -2052247, -2058080, -2076574, -1992660, -2238033, -2176869, -1973952, -1686453, -1668187, -1832683, -1835994, -1944282, -2106059, -2084341, -2115990, -2056513, -2077165, -2010084, -1923810, -1961881, -1954265, -1954674, -1821553, -1899205, -1927982, -1873210, -1827190, -1769487, -1858225, -1998180, -2047191, -2081881, -2000865, -1885601, -1897559, -1990429, -1979058]
17644a979058L6023p6083J54432n0506j76813J57913J15148o0191p3404k3988
17634a976527j18496n8808K9071L6636o8936P5642m2974R9961k9707J08404J30891
17623a814843n4758o8940p8137k212J81279J45916r5836M7144k9479r4859q5402
17612a950127j07812k046J249J23435o5442n3915N4732K7716J57999k0376n2941
17601a887528J44742m189o406J21294n7748n8635J09257K2308j59098J253K40678
17590a534072J9434j51923n9735K9095j68293q4466K64644N1495j04397L8396
17580a699822J43201j2801o3583Q194m7386p5289j0912J38609J89287K1681j38046
17569a546867k63730l890m6037j57024K2560l0877J09152J26650R9886l7690p3021
$$ y = [-1979058, -1943035, -2019118, -1864686, -1915192, -2092005, -1934092, -1818944, -1879135, -1952539, -1976527, -2095023, -2153831, -2124760, -2088124, -2157060, -2081418, -2124392, -2024431, -2054138, -1945734, -1814843, -1869601, -1938541, -2016678, -2018890, -1837611, -1691695, -1787531, -1740387, -1769866, -1864725, -1950127, -2057939, -2059985, -2058736, -1935301, -2000743, -2054658, -1999926, -1972210, -1814211, -1834587, -1887528, -1742786, -1746975, -1753381, -1632087, -1689835, -1748470, -1639213, -1616905, -1776003, -1774750, -1534072, -1514638, -1666561, -1726296, -1697201, -1865494, -1949960, -1685316, -1633821, -1738218, -1699822, -1556621, -1569422, -1633005, -1624811, -1672197, -1747486, -1758398, -1619789, -1430502, -1408821, -1546867, -1810597, -1814487, -1860524, -2017548, -1994988, -2025865, -1916713, -1790063, -1690177, -1727867, -1800888]
17558a800888J8997j50302j25856K2901O2275J53715K09824J36733q163j00979
17548a581743j02468Q8290q3510J140R5640o7956p2884J16993j27467j53741J13350
17537a774356O2254R4277M157J5966J25657P6573k25812J26580K36738J02179
17527a155787n0746j45708q6564O8703j78514k85960J16851P4836o893n3006K1335
17516a681453q6447J06671p1378k25262j7809j69185N2153J56707J11357j3989
17506a838635R7745R2116J4701L2149Q7920m2207n6982n2544R3184N7499l1067
17495a546121P0031J04378m0278l0671O723k0428j2546n3051j07293K2352J26599
17484a480305j32505q8246n2348M1434M8573Q7879k7867P3708R4567j5047j34924
$$ y = [-1800888, -1781891, -1932193, -2058049, -2035148, -1972873, -1819158, -1609334, -1472601, -1480764, -1581743, -1684211, -1595921, -1679431, -1678291, -1582651, -1650607, -1723491, -1606498, -1733965, -1887706, -1774356, -1712102, -1617825, -1613668, -1597702, -1472045, -1395472, -1621284, -1494704, -1257966, -1155787, -1206533, -1352241, -1438805, -1370102, -1548616, -1834576, -1717725, -1642889, -1649782, -1702788, -1681453, -1767900, -1661229, -1732607, -1957869, -1975678, -2144863, -2092710, -1936003, -1824646, -1838635, -1740890, -1648774, -1634073, -1601924, -1514004, -1556211, -1613193, -1665737, -1572553, -1515054, -1546121, -1476090, -1371712, -1411990, -1442661, -1435938, -1456366, -1468912, -1521963, -1629256, -1606904, -1480305, -1612810, -1701056, -1753404, -1711970, -1663397, -1575518, -1603385, -1529677, -1435110, -1450157, -1585081]
17473a585081J6121N1583M8014r458j86860j21806L9737J32818k4404r6893M82
17462a735747J91074m2841j7437j61672q2167R7716K10292O6934Q3608m1355j41855
17451a573450k49040L0121J90029J06848p1610M5734K2629m21q3008o057J0457
17440a577768P8453M1033K8276l2539p8043k4813j69559O1942J25716l3003j34624
17429a714929J20119K00533k06934J5289N1893o3730N547j09842j01977K75314
17419a528717O9550j925n9091O5278j2583O7723l2811j34903m5295m7504m2864
17408a703142J81425J86226M1182q1923m8320M5722r4951q1832O1630P7484l1229
17397a447728n0157O8441r6784J00357J7169K6329q4288l3745n9304Q569K2313
$$ y = [-1585081, -1568960, -1517377, -1469363, -1478821, -1665681, -1787487, -1747750, -1614932, -1639336, -1736229, -1735747, -1544673, -1587514, -1604951, -1766623, -1848790, -1751074, -1540782, -1473848, -1390240, -1431595, -1573450, -1822490, -1792369, -1602340, -1495492, -1567102, -1521368, -1498739, -1499160, -1582168, -1588225, -1577768, -1499315, -1458282, -1430006, -1462545, -1540588, -1565401, -1734960, -1673018, -1547302, -1580305, -1714929, -1594810, -1394277, -1601211, -1585922, -1534029, -1597759, -1592212, -1702054, -1804031, -1528717, -1459167, -1461092, -1520183, -1454905, -1467488, -1399765, -1432576, -1567479, -1612774, -1660278, -1703142, -1521717, -1335491, -1294309, -1376232, -1424552, -1378830, -1473781, -1555613, -1493983, -1416499, -1447728, -1497885, -1429444, -1526228, -1425871, -1408702, -1382373, -1466661, -1500406, -1559710, -1551141, -1528828]
17386a528828N9961k9623J22513L9171M1506o8148l1953K0309l3821Q5647o3175
17375a386441p9162Q0790j9597M4912O096P7218J21151j20228j39521j02764Q4040
17364a433506K5189j01460j8127j20006M2707q9312k8638J17424K53832m6399
17354a398296j82741m8060M1782J73097L9403J07183Q182j26259p380Q1201Q8521
17343a223367J21500K8619j2853j33757m8454M1934j2869j14597j2091l2755n2009
17332a450699p229R3268K09628j54601j10733J03266Q1401o1231j37207m8438
17322a482575N0634n9661K27885J11155j88003m2708J23753Q3095Q9100j20814
17312a208139k26979m0479J3830K36399P2327r9479j30163j11052o6744J47436
$$ y = [-1528828, -1468867, -1498490, -1375977, -1336806, -1295300, -1363448, -1395401, -1375092, -1408913, -1323266, -1386441, -1465603, -1384813, -1404410, -1359498, -1353402, -1276184, -1155033, -1275261, -1414782, -1517546, -1433506, -1408317, -1509777, -1527904, -1647910, -1605203, -1694515, -1723153, -1605729, -1351897, -1398296, -1581037, -1629097, -1587315, -1414218, -1374815, -1267632, -1259450, -1385709, -1393089, -1311888, -1223367, -1101867, -1073248, -1086101, -1219858, -1268312, -1226378, -1239247, -1353844, -1365935, -1398690, -1450699, -1457928, -1364660, -1155032, -1309633, -1420366, -1317100, -1235699, -1296930, -1434137, -1482575, -1431941, -1491602, -1263717, -1152562, -1340565, -1383273, -1259520, -1176425, -1087325, -1208139, -1435118, -1475597, -1461767, -1225368, -1153041, -1252520, -1382683, -1493735, -1560479, -1413043]
17302a413043N5046j161J0269J04124M0640J0687j09332j71233P0821Q8268M1074
17291a273840o03J48956K795j57195k47289O1J44655P2500O5041j25468n0945
17280a421332J07115N9008q442J68943M1299k78047j20366J19689J60880P5303
17270a095950K5433k9558r1002j37563J7813k3253R6009j51712q723R0758J30104
17259a177644J9986k81374k6182J20730J10855n1280p0616P4180J1769Q2419R8822
17248a088335Q4697J04268l2117o1804o6597J22450R3113j32667j54146Q0076
17238a051062J34067j75328m3157J6125k00034O9334J43619q6203k07199J01166
17228a298672o1452J50199N5735p5899K2068j2022Q7782K1087J07435j16017q9924
$$ y = [-1413043, -1357997, -1359158, -1348889, -1244765, -1204125, -1193438, -1302770, -1474003, -1403182, -1314914, -1273840, -1274443, -1125487, -1122692, -1279887, -1527176, -1527115, -1382460, -1309960, -1244919, -1370387, -1421332, -1314217, -1255209, -1263651, -1094708, -1053409, -1331456, -1451822, -1332133, -1171253, -1095950, -1070517, -1100075, -1191077, -1328640, -1310827, -1334080, -1238071, -1389783, -1398506, -1307748, -1177644, -1157658, -1439032, -1465214, -1344484, -1233629, -1284909, -1355525, -1281345, -1269576, -1187157, -1088335, -1003638, -899370, -931487, -993291, -1059888, -937438, -844325, -976992, -1131138, -1051062, -916995, -1092323, -1135480, -1119355, -1319389, -1250055, -1106436, -1192639, -1399838, -1298672, -1360124, -1209925, -1154190, -1230089, -1208021, -1220043, -1132261, -1111174, -1003739, -1119756, -1209680]
17217a209680k1017K22998P5804j56396j16202k1592l403J11753L1643j08838
17207a194930J27246j6622j06376J09814K8236q7736K4144Q2263j8536j32667
17197a185164l8590K5066P4038J9828l7014O9786q3923k16261m7303J49535N3101
17186a216901j3027Q6922O7937j47192j42972J42500Q5764L3777l3561o8127k1776
17175a226656O4551k7233J09696j2037n5619J6206l154q4855r5487l989L308j3074
17163a328343J26458J37370L3621j05156J563l7029r9775K1556J74333r9005j06255
17152a280662J07860J31310L5715o521q4607L428j35738n0429K29997J00100j42560
17141a092107q9653J38675J00780m3878k572l0818j92068o5668K77837J28135
$$ y = [-1209680, -1230697, -1007699, -931895, -1088291, -1204493, -1226085, -1229488, -1117735, -1086092, -1194930, -1067684, -1084306, -1190682, -1080868, -1052632, -1140368, -1116224, -1033961, -1052497, -1185164, -1223754, -1198688, -1124650, -1104822, -1141836, -1072050, -1155973, -1372234, -1419537, -1270002, -1216901, -1229928, -1143006, -1075069, -1222261, -1365233, -1222733, -1136969, -1103192, -1136753, -1204880, -1226656, -1162105, -1189338, -1079642, -1091679, -1147298, -1131092, -1134246, -1219101, -1314588, -1318577, -1315269, -1328343, -1201885, -1064515, -1030894, -1136050, -1134487, -1171516, -1271291, -1249735, -1075402, -1174407, -1280662, -1172802, -1041492, -1005777, -1012298, -1096905, -1093477, -1229215, -1279644, -1049647, -949547, -1092107, -1181760, -1043085, -942305, -986183, -988755, -1019573, -1211641, -1277309, -999472, -871337]
17131h71337K5310O5972j31113j37114K28953J7020n427L0360j50156k91974j35453
17120a354959N3149J24203p6441L4023J12186J52148N586j63271k2451J57224
17110i78603j75221o6868J00445J31407N32R013k9124R7265N0918P9264L9040
17099g41932q9494j05407p2497J7646K1983J42190Q4112j54781p7593K7295l2474
17088i80952j56362k926J35573J19957j49633Q234J78623J96355J0272j11861
17078g52720o8698k6497j13786O2043R8847j25124p6725O5328j2094K42242k3973
17067g31157j73330j14561r167J0118l3931n6194K6485O7387P9719J39594J28756
17056f66281p0585j52707p5269m6608N9878J31684k4789l4598K2595L7104n5711
$$ y = [-871337, -846027, -780055, -911168, -1048282, -819329, -802309, -807736, -777376, -927532, -1219506, -1354959, -1301810, -1177607, -1254048, -1220025, -1107839, -955691, -950105, -1113376, -1135827, -978603, -1153824, -1220692, -1120247, -988840, -988308, -979295, -1008419, -911154, -860236, -780972, -741932, -831426, -936833, -1009330, -991684, -969701, -827511, -743399, -898180, -975773, -948478, -980952, -1137314, -1140240, -1004667, -884710, -1034343, -1026109, -847486, -651131, -640859, -752720, -821418, -847915, -961701, -899658, -800811, -925935, -1002660, -937332, -949426, -707184, -731157, -904487, -1019048, -1028215, -1018097, -1052028, -1108222, -1081737, -1014350, -934631, -795037, -666281, -736866, -889573, -964842, -1011450, -951572, -819888, -844677, -879275, -856680, -819576, -875287]
17045h75287m9959K4607p8726o7313K5496R4765Q517j12114o8455N6337M0692
17034a001440l3106J74026R8208j68157r699P6229J94082q8376j2657K1680N4508
17023f94702K4101o4245j37222p5512j02722J17912K38557J60412j18532j25320
17013g77273J21012r866j19359K4486j01720K4025J7929q1939M4784k4006j03733
17002i85660j7633k312J22036o2998j81015o5888J5986N9532n690J23633N6054
16991i43955l8334N8994N974o0376r830R639K6938J28576O4939m7662j4654k18225
16979a037976J01948N8822K5596l2256j1038J56654j90955M5354J64460k3923
16969g43314J91057K1306q6424K3780O870k429j07200o939P7078K9088j63173
$$ y = [-875287, -925246, -900639, -979365, -1046678, -1021182, -926417, -917900, -1030014, -1098469, -1042132, -1001440, -1034546, -860520, -762312, -930469, -940168, -863939, -669857, -758233, -770890, -749210, -694702, -670601, -734846, -872068, -947580, -1050302, -932390, -693833, -533421, -651953, -777273, -656261, -666127, -785486, -761000, -862720, -838695, -820766, -902705, -857921, -881927, -985660, -1003293, -1005605, -883569, -946567, -1127582, -1193470, -1177484, -1117952, -1123642, -1000009, -943955, -982289, -923295, -917321, -977697, -987527, -977888, -950950, -822374, -757435, -805097, -819751, -1037976, -936028, -877206, -851610, -883866, -894904, -738250, -929205, -883851, -719391, -743314, -552257, -530951, -617375, -593595, -586725, -589154, -696354, -703293, -626215, -597127, -760300]
16958g60300k94609J45285J82489p9490n9006k970m0103J5777R0038j3471k05501
16947a021861k35904K116J58295J2330K799l3142Q1017J19956J39940P7477Q9619
16936f07358j76359j28805M0069n9290N125Q4984j75382N3883K38768J95667K3164
16925e05534k01529j94912o9447j1149J71325R2605p2840j3303n5977P7857M4365
16914g38539o3267M1182J79647L9063k3569j42371k03661N7113J25194R2221M719
16903f32268R1596p7385j44120J10144o2686j9257J90542K7036J92657N4421j39218
16892d08538m4114r1082p3728p8807J0688N095r7501j02627n3134j0963J14997
16881h29714J64856J55461n8830k10387m8353o1072N0074j9026K9497O5517r2625
$$ y = [-760300, -1054909, -909624, -727135, -806625, -865631, -868601, -908704, -892927, -802889, -816360, -1021861, -1257765, -1255649, -1097354, -1085024, -1082225, -1115367, -1034350, -914394, -774454, -696977, -607358, -783717, -912522, -872453, -931743, -926618, -841634, -1017016, -963133, -724365, -528698, -505534, -707063, -901975, -971422, -982571, -811246, -718641, -791481, -804784, -860761, -782904, -738539, -801806, -760624, -580977, -541914, -565483, -707854, -911515, -854402, -729208, -636987, -632268, -540672, -618057, -762177, -652033, -714719, -733976, -543434, -516398, -323741, -269320, -408538, -452652, -543734, -617462, -696269, -685581, -680486, -777987, -880614, -933748, -944711, -829714, -664858, -509397, -568227, -778614, -826967, -888039, -837965, -856991, -827494, -761977, -854602]
16870h54602R5689l5712j56445J37195K48275J36294q1094j35882K8109n5554
16860f73727L8748K2537O8288M7148l9543r9174m8061r446K3498L588l4485n5245
16848g55874R4514l4839L4549J51662q3869j14279J61514M4846k11110k01164
16838i14050J17529Q2461r1353j04091L0162l9962R4159j393K62959J28338J4092
16827d21149r2310k14845r1419J32144j1325R9122J09374K5865Q4088l7417r8934
16816e16806m8429j87148k20688j66858J31831J01167J4562l6831J61149j09746
16806h77797O0110J04553o8025J2254Q3869J06345j3492m0723o5313J68973J88302
16795c40944k9750J3933r6418O4914N0550j28939P7685J28155r040r4053k53885
$$ y = [-854602, -758913, -794625, -951070, -813875, -565600, -429306, -510400, -646282, -618173, -673727, -634979, -612442, -544154, -497006, -536549, -635723, -683784, -693230, -669732, -666144, -700629, -755874, -661360, -696199, -661650, -509988, -593857, -708136, -546622, -501776, -712886, -914050, -796521, -714060, -805413, -909504, -879342, -919304, -825145, -826538, -563579, -435241, -421149, -513459, -728304, -819723, -687579, -698904, -599782, -490408, -464543, -380455, -417872, -516806, -565235, -752383, -973071, -1139929, -1008098, -906931, -892369, -929200, -768051, -877797, -817687, -713134, -781159, -768905, -685036, -578691, -592183, -632906, -698219, -529246, -340944, -370694, -356761, -453179, -388265, -337715, -466654, -388969, -260814, -269854, -363907, -617792]
16784f17792M7334J04541N0093J10728J60926j0504l14856j19314r807J22539
16774d76112R200k1906k8020J5913N4115r5048P0979P0092k2201m8913p7398n9126
16762f08425N506k0506p623K1097N8971M6500Q2568k6149J6488p6970m2719q802
16750e60064J55487J01258M655k1431k4038j19323j7002n822N1996p5589q4515
16739e94388M7891N9822r8802N4521k9778j07650m9150J68008K3329j86080N3764
16728f58513J31062R1685K6441q2334J075j0536J86050L3173l1384P7034l4901
16717b71148q1656O7009M9530M0738m9884k44979k10146J9187J43252R2612j4577
16706d60062N447M6671K53886R4325m213j87629q477K0162p3304k01253m5388
$$ y = [-617792, -570458, -465917, -415824, -305096, -144170, -154674, -469530, -588844, -598651, -476112, -466912, -488818, -516838, -500925, -446810, -541858, -470879, -400787, -422988, -471901, -549299, -608425, -602919, -623425, -631048, -609951, -550980, -504480, -421912, -448061, -431573, -508543, -551262, -560064, -404577, -303319, -298664, -320095, -344133, -463456, -480458, -486280, -434284, -509873, -594388, -546497, -486675, -585477, -530956, -560734, -668384, -717534, -549526, -526197, -712277, -658513, -527451, -435766, -409325, -491659, -490584, -501120, -315070, -281897, -313281, -236247, -271148, -352804, -285795, -236265, -195527, -245411, -490390, -700536, -681349, -538097, -445485, -460062, -454615, -407944, -154058, -59733, -63946, -251575, -260052, -239890, -313194, -514447, -559835]
16695e59835J3500R1271Q3713l7184k3004J77948Q9178m2784L4342r6188O8411
16684b00632O7595m8329j44993j59711j66482j24179J8772J01994P7033J10844
16674d68088Q2987J12436n233j38548r1660j29655R8333K64843K1819l0543J26497
16663a56812Q9104k92540k05462R1877J74187j1236l7029k909J04500J46258k1327
16652a21389j05688r2316n7382n8610q4795J17479K6639k44905o2509K42512J01252
16641c39712j15682L8162J42878o4203j78281O3759Q0386P2715j24164j4094P7740
16630c60496R9174j46532j36254l91l2727P3585R9476o900n2050q9919o6083M0327
16618e78790P4766J53990L1947k1542p1329m8190p454N0698o007j15989R2941
$$ y = [-559835, -546335, -455064, -371351, -408535, -431539, -253591, -164413, -207197, -172855, -269043, -200632, -133037, -181366, -326359, -486070, -652552, -776731, -757959, -655965, -578932, -468088, -385101, -272665, -277898, -416446, -508106, -637761, -539428, -274585, -252766, -283309, -156812, -67708, -360248, -565710, -473833, -299646, -310882, -347911, -350820, -246320, -100062, -121389, -227077, -319393, -376775, -435385, -520180, -402701, -376062, -620967, -683476, -440964, -339712, -455394, -417232, -274354, -338557, -516838, -453079, -372693, -299978, -424142, -438236, -360496, -261322, -407854, -544108, -544499, -577226, -503641, -404165, -411065, -463115, -553034, -619117, -578790, -504024, -350034, -318087, -339629, -410958, -459148, -466602, -415904, -421911, -537900, -444959]
16607d44959R7171p9210r8722q872Q8411N3253m2976J05230P4913N7069r1696
16596b90388q2067J70597m3698o4488n3047N7852J41251J23759j21654l4290Q0649
16585a15524O3084k39467j31060r8915j1406J57101P8455l8727J16713Q4371j11885
16574b47260j55288j2042n4281r4706M0440J67206N6281o5822n4710l0155R4941
16563c55396k6735p1962p1124P855M9250l900j1995R0627k9410M1490M940J17854
16551b58506J20450j36091j94065J6391K83667L5383O3430L688q5095j17499k7749
16540b95996p7499M5438n0200Q4624J15129k0829r9168k4164j29263j88294P6303
16529e63919K04243O1647o1666k8979K1483K9469K02316L3136P1403j05957j74843
$$ y = [-444959, -347788, -426998, -525720, -534592, -446181, -392928, -435904, -330674, -255761, -198692, -290388, -372455, -201858, -245556, -310044, -363091, -305239, -163988, -40229, -161883, -196173, -115524, -52440, -291907, -422967, -521882, -533288, -376187, -297732, -336459, -219746, -135375, -247260, -402548, -414590, -468871, -563577, -523137, -355931, -299650, -365472, -420182, -450337, -355396, -382131, -454093, -525217, -517362, -468112, -472012, -484007, -393380, -422790, -381300, -376360, -258506, -138056, -274147, -468212, -451821, -168154, -132771, -69341, -65653, -150748, -268247, -295996, -373495, -328057, -378257, -293633, -178504, -199333, -298501, -322665, -451928, -640222, -563919, -359676, -298029, -359695, -388674, -367191, -337722, -135406, -102270, -30867, -136824, -311667]
16518c11667j39017J55057P1985K345l1198r7759R4252k0535j07937L3540M1146
16507c09788J16901J5024j94256r4690r0097O1574J75331K7670p7229m3972J13307
16496c00225L4906l5548r3743j7434J9146n0671m7346J10868N7361R912P7127
16485b35647O6245N159J9703K8392j15586j56004O144R3300L2707R2571O9817
16474i3199p2387j68412p2053J62918O5718k3919J1154k5332N2458Q990J981L8397
16462a13686o8707n0128O7027j47422P8576Q3349q6339o4513l7151P3036J40031
16451a25927J12505R3942R673j45714l4583P0495N5768j39344l16430r7969J47811
16440c69773J01324o769o1693q8340l8173O9999N7693r5496L397K51886k1478
$$ y = [-311667, -450684, -295627, -223642, -221297, -252495, -350254, -256002, -276537, -384474, -350934, -309788, -192887, -177863, -372119, -466809, -556906, -495332, -320001, -292331, -369560, -413532, -300225, -265319, -300867, -394610, -412044, -392898, -443569, -490915, -380047, -322686, -312774, -235647, -169402, -164243, -144540, -116148, -231734, -387738, -381594, -288294, -255587, -163016, -93199, -165586, -333998, -406051, -243133, -177415, -201334, -190180, -215512, -163054, -154064, -152083, -113686, -182393, -232521, -165494, -312916, -234340, -150991, -237330, -301843, -338994, -265958, -125927, -13422, 80520, 90193, -55521, -90104, -19609, 36159, -103185, -419615, -517584, -369773, -268449, -275218, -336911, -425251, -463424, -393425, -335732, -431228, -427831, -175945, -197423]
16429a97423M3829m4475O3682J04355J37085n7403J02195O6086q1272L649j11939
16418B8369J6298l2577j17549l2506p6181R7183Q5911N1358J04068r2314k27572
16407a95512q3260O2393l7109P417Q1183Q1251K6089j61204M2965K20321P9598
16396A24132l0744j86254j13820p1428r7173R4548l1506l1565J14240L0201j04469
16385c03838J46367J54600j79127k53196j0097J77705K46242Q7338j27755j65216
16375b26977L1793n3325j42782N8428K70551M3712L876k9884q3912O6138N1421
16364a0961Q306j74239j56056J58401Q3825l7081j67633r1264L0055N9183J96597
16353a00867K00638m028j6024k6042q298J407k2408K2960j98437k35672K8274
$$ y = [-197423, -153594, -198069, -134387, -30032, 107053, 49650, 151845, 217931, 136659, 140308, 28369, 44667, 12090, -105459, -137965, -214146, -116963, -31052, 20306, 124374, 32060, -195512, -278772, -216379, -253488, -246071, -164888, -83637, -57548, -218752, -175787, 44534, 124132, 93388, -92866, -206686, -278114, -375287, -280739, -312245, -343810, -229570, -199369, -303838, -157471, -2871, -181998, -435194, -445291, -267586, -21344, 65994, -61761, -226977, -195184, -248509, -391291, -332863, -62312, -18600, -14724, -44608, -128520, -62382, -10961, -2655, -176894, -332950, -174549, -90724, -127805, -295438, -386702, -356647, -297464, -100867, 99771, 95743, 79719, 53677, 45379, 46786, 24378, 47338, -151099, -386771, -358497]
16342c58497n7761Q8475N6192N2784J06180j9354k9136l9705M5450J56886R0760
16331I2274r0489m1842j05441J46193J09143j51020k50411q1239J9317J89571
16321a63944r3397q5740N1697K60739J52291q2294n2694l7422K8865j40727K2080
16310a40546J77138j3001j38914j8620J10339k3234k0804M0756j35576o8405J20221
16299a10646Q6087l8285L3081N2707l5541O6635O5807l9937P644n6310n5279o9717
16287i3754m7747J18668P4268M4614m6969p5960m1737J32078J8550J12969J97348
16276C92328p1567j35164j64387P7038P8873l3441r3707j54962q385n2091O272
16265a59193K7791J09126J55491j08862j39418l3821K2229R3238K4014M5159K06977
$$ y = [-358497, -416258, -327783, -271591, -218807, -112627, -131981, -161117, -200822, -155372, 1514, 92274, 1785, -40057, -145498, 695, 109838, -41182, -291593, -372832, -353515, -163944, -257341, -343081, -291384, -30645, 121646, 39352, -13342, -50764, -21899, -162626, -140546, 36592, 23591, -115323, -133943, -23604, -46838, -67642, -26886, -162462, -230867, -110646, -24559, -62844, -29763, 22944, -12597, 54038, 119845, 79908, 87552, 31242, -24037, -93754, -141501, -22833, 51435, 96049, 49080, -26880, -68617, 63461, 82011, 194980, 392328, 320761, 185597, 21210, 98248, 177121, 143680, 49973, -104989, -113374, -165465, -159193, -131402, -22276, 133215, 24353, -115065, -148886, -126657, -33419, -9405, 35754, 242731]
16254B42731P1045R5211k9232j13019m3018n1787J06071p3393l8388O3800n5761
16243A74260j6145P7869q8840q4599P5904k2171m6342j1074J02454J50701Q0683
16232C92700q1923m9652j81438p7301J47104L089j34364p593J18306J9607p6511
16221G2024p9771q245J17194K6599m9701Q1113R4567M980J7991K8164J4622j0664
16209C08873J05282p6047k34179n7949P505K3140r5042l330l8296o7471P7134
16198e0380J69649J11100q3363k1063m2677N1692j19898P2472R1006n2204q7429
16187C8905n9677m3443J8680J56794K534J64457N5168p952j71846j43142j58203
16176a47725j44690J8330J30901O3667J05458m8526k0127L5762P6963K9190r2697
$$ y = [242731, 313776, 408987, 379755, 266736, 223718, 171931, 278002, 204609, 166221, 230021, 174260, 158115, 235984, 147144, 62545, 138449, 116278, 69936, 58862, 161316, 312017, 392700, 310777, 261125, 79687, 2386, 149490, 152579, 18215, 10622, 128928, 148535, 72024, -7747, -15992, 101202, 127801, 78100, 159213, 253780, 258760, 276751, 304915, 319537, 308873, 414155, 338108, 103929, 45980, 53485, 76625, -18417, -21747, -60043, -127514, -50380, 119269, 230369, 147006, 125943, 83266, 134958, 15060, 87532, 178538, 126334, 38905, -20772, -64215, -45535, 111259, 113793, 278250, 333418, 325466, 153620, 10478, -147725, -292415, -274085, -143184, -79517, 25941, -22585, -42712, -6950, 70013, 99203, 6506]
16165F506m1907R4031O0988L1928l3482N715J41233m8030l3880Q1164n7467O8989
16153B75788Q0522q9678K9953r3729j47444q0534J45350P0891L8500j1623Q3809
16142C01805O8208K11q4522r2005j2571R0449l334J06789J19333M1735j44368
16131C91730k06328o5478k12703j27580O3269J93120J71643j04846K1749L0420
16121A54996r0216J9707J04751J49420p2713J04084O5934k30751k25343n2894
16111g3025L6397J60177j74080M2944p3489p7279J02420J80993N6597j46499j14472
16100g9316J31288P2502O4997q8983q6292J22163R5525o3307j4767L2217J47535
16089C33562k8557j59269j65001o5397N1217J27262L8748J37869L2593P8604q3345
$$ y = [6506, -35401, 58630, 119618, 151546, 118064, 123779, 265012, 216982, 183102, 264266, 206799, 275788, 356310, 266632, 296585, 202856, 55412, -25122, 120228, 191119, 229619, 217996, 301805, 370013, 370224, 285702, 193697, 181126, 271575, 268241, 375030, 494363, 536098, 391730, 185402, 119924, -92779, -220359, -157090, 36030, 207673, 102827, 124576, 154996, 64780, 84487, 189238, 338658, 265945, 370029, 435963, 205212, -20131, -73025, -36628, 123549, -50531, -7587, -81076, -158355, -55935, 125058, 181655, 35156, -79316, 51972, 124474, 189471, 100488, 14196, 136359, 231884, 168577, 153810, 186027, 333562, 305005, 145736, -19265, -84662, -33445, 93817, 132565, 270434, 303027, 381631, 298286]
16078B98286j12587M1625J4746k4731o7130n9345j11956k7038N8820j13653j14474
16067b17437j54708J21948J50309p4224R104J07715J23931J96613L48j37595L2611
16056A58615m117o8921m5361P0637J63437R1599m1323O3886R612p4922q394j8537
16044B96211M3594j17616j02098m5219J7828Q2588r36j2855n927Q6912J7974P3592
16032C34048l5059J840K11335j24548l3421j45859N4631P9928p3117L1949l7752
16021B63975P064j7007p277j21574L537J61683J38023j00615j40592J3109P0451
16010B70777j28858L7399R2988j58141j9091M7095m057M3651P1821r2377j44297
15999A6910N8514R610j2836J02074O0849J17430R9567j69045k7178Q2480j2717
$$ y = [298286, 185699, 227324, 242070, 217339, 150209, 90864, -21092, -48130, 10690, -102963, -217437, -372145, -250197, -99888, -174112, -165008, -57293, 66638, 263251, 263599, 126004, 158615, 154498, 85577, 40216, 110853, 274290, 365889, 324566, 388452, 398064, 323142, 314748, 296211, 339805, 222189, 120091, 74872, 92700, 175288, 174352, 161497, 155570, 242482, 260456, 334048, 298989, 300829, 512164, 387616, 354195, 208336, 262967, 342895, 269778, 301727, 263975, 271039, 254032, 246755, 125181, 128718, 290401, 428424, 327809, 187217, 200326, 270777, 141919, 179318, 272306, 114165, 95074, 142169, 138112, 181763, 253584, 161207, 16910, 75424, 85034, 72198, 174272, 235121, 352551, 452118, 283073, 255895, 338375, 325658]
15988C25658j03553k3936Q545N1433j3768O8738M4243n3238j34531j71974Q5444
15977H3061L19639L08940J83780j32233j83707n2594N7130l61j46754k11968M6002
15966B70935r325Q8864K5937N6637Q1817L1068k0355p9012M0785R186j813K41936
15954G36660j7449k34467j46759o7722J61717J6489p4142P0665Q5361j99321K6932
15943C57964J84029r1568k43850r1016J75006M4083j43233Q1192Q8071J76638
15933E37316j92678n7427M3014o4810j05429n5329K6119L2863Q5064J49231J9840
15922D17774j38114j29091k908P3008K0085K6447q7524J540J75875J77784J93513
15911G28389j11812j96314k01435N4636L8021M3981R0910l6891j17076j60220
$$ y = [325658, 222105, 198169, 206714, 258147, 244379, 313117, 357360, 304122, 169591, -2383, 83061, 402700, 711640, 895420, 763187, 579480, 526886, 584016, 583655, 436901, 224933, 270935, 261610, 350474, 376411, 433048, 514865, 545933, 525578, 446566, 487351, 496537, 494724, 736660, 719211, 484744, 337985, 270263, 431980, 448469, 374327, 444992, 530353, 331032, 357964, 541993, 450425, 206575, 115559, 290565, 334648, 191415, 272607, 360678, 537316, 344638, 287211, 330225, 265415, 159986, 104657, 130776, 163639, 248703, 397934, 417774, 279660, 150569, 147661, 220669, 240754, 267201, 179677, 181217, 357092, 534876, 728389, 616577, 420263, 218828, 273464, 311485, 355466, 446376, 409485, 292409, 132189]
15901A32189j0426j1836O4618N2023J7388K6162K4079l1861L5105R2047k1100
15890C68388j98974J09296J23742q7666m6704J32735R2838L7525n3809j87661
15880B89710j70629J28569O3340J37287O9787L290J08392j3139j72788k3325m8572
15869C71922L3056l8548J07286J7108k401o3286P0365J91361M7880n8827j68461
15858E07455N3599J21145M0286r1978j7084N1516j23964N9294j27431q0148J69033
15847E61723O8623j32167j05519m5380M4242j8154L9914N761l8996L8412J39438
15836E57897m5275j49736l2498p6704K17323K3338j49519j18048m6861O5087P0972
15825C15976N6421J26120Q869l5001p4831K494R9573J8127P1788l5496j01218
$$ y = [132189, 121763, 109927, 174545, 226568, 243956, 270118, 294197, 262336, 297441, 389488, 368388, 169414, 278710, 402452, 314786, 268082, 400817, 493655, 531180, 477371, 289710, 119081, 247650, 310990, 448277, 518064, 521354, 629746, 616607, 443819, 420494, 371922, 404978, 366430, 473716, 490824, 488423, 425137, 495502, 686863, 734743, 675916, 507455, 561054, 682199, 722485, 630507, 613423, 664939, 540975, 600269, 472838, 392690, 561723, 630346, 498179, 392660, 347280, 391522, 373368, 413282, 419043, 380047, 418459, 557897, 512622, 362886, 330388, 253684, 471007, 494345, 344826, 226778, 179917, 245004, 315976, 372397, 498517, 507386, 472385, 397554, 400048, 499621, 517748, 589536, 554040, 452822]
15814D52822O9891O0014q1553r3777P5482N1188p9279J1735J11156P6491l0773
15803F23397l1684p4881k64876l4213J45192J68221K1022k3732P4168Q9060k2296
15792F69378j66071k40090n6045J33207J09926P3027N6556r0875j77442K0874
15782C32445J32482j06153n1218O1901k0862j41464N570N8242O7071K3047m868
15771C56193j21049l1558M4950J4990m75L5993N3328J99731J21524m65Q3224J8030
15759G74416Q222j20777j64851j18305K2392N1456R9818Q640j10730j1884M1533
15748D79930O8593L6761j45317k5770J6703J15193M3583n9643J7487M2593m4770
15737E45343m1586J04624J59465j2178o0249k6068n6376l9004j2299L6438j05231
$$ y = [452822, 522713, 582727, 501174, 407397, 482879, 534067, 454788, 466523, 577679, 654170, 623397, 591713, 516832, 251956, 217743, 362935, 531156, 552178, 528446, 602614, 691674, 669378, 503307, 263217, 207172, 340379, 450305, 523332, 579888, 489013, 311571, 332445, 464927, 358774, 307556, 369457, 348595, 207131, 212701, 270943, 338014, 361061, 356193, 235144, 203586, 248536, 263526, 263051, 299044, 352372, 552103, 673627, 673162, 756386, 774416, 782638, 661861, 497010, 378705, 401097, 452553, 552371, 561011, 450281, 438397, 479930, 548523, 585284, 439967, 414197, 430900, 546093, 589676, 530033, 547520, 590113, 545343, 503757, 608381, 767846, 755668, 695419, 669351, 612975, 573971, 561672, 598110, 492879]
15726D92879j21568O133N1157J2872r598J11524P9584j07299m4729M2742j1671
15715E02026o0739j9729j7382p5211P7303J01406J55042Q064j72758p5203J68319
15704E91138p3288p6578J13966J35451p0275K380P4672K9178l5404l5311R4539
15693G50468P3294p9239J19148R9301K2172l7883N7964j31481r9441j38837M2323
15682F77789J05320j56490Q4313J6490n6065o8114M7921m829q9656P4400K37483
15671H68562j66678k03013j76311P8769k0532O2808K5174J2827J71354j2341k68833
15660C71786N5862J56447M2333j25293n0820j1904k8351n1052K07265M2995j5923
15649E93345J19335J18346R0524m9621J0746q8871r6208k1054q0609k1831K8253
$$ y = [492879, 371311, 377444, 428601, 441473, 431875, 543399, 622983, 515684, 470955, 513697, 502026, 441287, 421558, 404176, 328965, 406268, 507674, 662716, 670780, 498022, 422819, 591138, 517850, 441272, 555238, 690689, 620414, 622794, 697466, 726644, 691240, 655929, 750468, 823762, 744523, 863671, 962972, 985144, 947261, 1005225, 873744, 774303, 635466, 677789, 783109, 626619, 710932, 727422, 671357, 603243, 651164, 646335, 556679, 631079, 868562, 701884, 498871, 322560, 401329, 380797, 443605, 468779, 481606, 652960, 640619, 371786, 427648, 584095, 626428, 501135, 450315, 438411, 410060, 359008, 566273, 609268, 593345, 712680, 831026, 921550, 871929, 882675, 793804, 697596, 676542, 595933, 574102, 602355]
15638F02355q7529N7639J59656J48801K1463J1022n3652N771k6799q0722r4066
15627F63939k8051P5999P3312K7814j67299p0423J59496R6005j6565l8803n9793
15616G15631j53060o1317o2937l0295J25395o3708J15998O5655o6469J1253O6746
15605F62892j53842L9027J53570o9424j50589l390K54613N4465k9300r6459J19666
15594G81229R7995j5107j30700q2431p9729Q0508p2927J32603k0530Q0826K33128
$$ y = [602355, 514826, 572465, 732121, 880922, 902385, 913407, 859755, 865526, 838727, 758005, 663939, 635888, 711887, 785199, 813013, 645714, 575291, 734787, 830792, 814227, 775424, 715631, 562571, 501254, 438317, 408022, 533417, 469709, 585707, 651362, 584893, 596146, 662892, 509050, 548077, 701647, 632223, 481634, 478244, 732857, 787322, 758022, 661563, 781229, 879224, 864117, 733417, 650986, 571257, 651765, 578838, 711441, 690911, 771737, 1004865]
$$ [...]
##END NTUPLES=NMR SPECTRUM
##END=
