##TITLE=Analysis number 310295
Compound Code mo 07079
Book Reference 407/73
Project Code adrs
Chemist Name andyw
##JCAMPDX= 6.0         $$ Bruker NMR JCAMP-DX V2.0
##DATA TYPE= NMR SPECTRUM
##DATA CLASS= NTUPLES
##ORIGIN= Bruker BioSpin GmbH
##OWNER= NMR
$$ XWIN-NMR		Version 3.5
$$ Thu Jun 16 11:44:00 2005 GMT Daylight Time (UT+1h)  MAYBRIDGE\NMR@NMR_250MHZ
##.OBSERVE FREQUENCY= 250.131544655141
##.OBSERVE NUCLEUS= ^1H
##.ACQUISITION MODE= SIMULTANEOUS (DQD)
##.ACQUISITION SCHEME= undefined
##.AVERAGES= 16
##.DIGITISER RES= 18
##SPECTROMETER/DATA SYSTEM= dpx250
##.PULSE SEQUENCE= zg30
##.SOLVENT NAME= CDCl3
##.SHIFT REFERENCE= (INTERNAL, CDCl3, 0, 16.4623)
##AUDIT TRAIL= $$ (NUMBER, WHEN, WHO, WHERE, WHAT)
$$ ##TITLE= Audit trail, XWIN-NMR		Version 3.5
$$ ##JCAMPDX= 5.01
$$ ##ORIGIN= Bruker BioSpin GmbH
$$ ##OWNER= NMR
$$ C:\u/data/dgb/nmr/ADRS/4140/pdata/1/auditp.txt
$$ ##AUDIT TRAIL=  $$ (NUMBER, WHEN, WHO, WHERE, WHAT)
(   1,<2005-06-16 11:43:20.60 +100>,<MAYBRIDGE\NMR>,<NMR_250MHZ>,
      <created by zg, POWCHK disabled, PULCHK disabled
       configuration hash MD5:
       62 19 C7 07 E1 42 D1 B7 37 6C 3D D0 77 39 F9 E6
       data hash MD5: 64K
       F5 63 BB BF 17 94 9C 9F 79 90 AE 4A 77 F3 34 42>)
(   2,<2005-06-16 11:43:39.02 +100>,<MAYBRIDGE\NMR>,<NMR_250MHZ>,
      <Start of raw data processing
       ef LB = 0.3 FT_mod = 6 PKNL = 1 SI = 32K 
       data hash MD5: 32K
       FA 95 11 C7 48 32 20 F0 A1 BE 93 DF 90 52 C3 A9>)
(   3,<2005-06-16 11:43:43.43 +100>,<MAYBRIDGE\NMR>,<NMR_250MHZ>,
      <apk 
       data hash MD5: 32K
       57 17 FC 42 E4 80 6D 5F 1B DB 39 C0 71 F8 0C 5C>)
(   4,<2005-06-16 11:43:44.16 +100>,<MAYBRIDGE\NMR>,<NMR_250MHZ>,
      <abs ABSG = 5 
       data hash MD5: 32K
       61 95 32 41 28 9C 2F 22 CD 0C 76 41 27 D0 EB BB>)
$$ ##END=
$$ 
$$ hash MD5
$$ 06 76 16 C0 03 43 BD F3 C4 BC 5E 69 06 48 BB DE
##$RELAX= 
##$RELAX= 
##$RELAX= 
##$RELAX= 
##$RELAX= 
##$RELAX= 
##$RELAX= 
$$ Bruker specific parameters
$$ --------------------------
##$DU= <C:\u>
##$EXPNO= 4140
##$NAME= <ADRS>
##$PROCNO= 1
##$TYPE= <nmr>
##$USER= <dgb>
##$AMP= (0..31)
100 100 100 100 100 100 100 100 100 100 100 100 100 100 100 100 100 100 
100 100 100 100 100 100 100 100 100 100 100 100 100 100 
##$AQSEQ= 0
##$AQ_mod= 3
##$AUNM= <au_zg>
##$AUTOPOS= <18 >
##$BF1= 250.13
##$BF2= 250.13
##$BF3= 250.13
##$BF4= 250.13
##$BF5= 500.13
##$BF6= 500.13
##$BF7= 500.13
##$BF8= 500.13
##$BYTORDA= 1
##$CFDGTYP= 0
##$CFRGTYP= 5
##$CHEMSTR= <none>
##$CNST= (0..31)
1 1 145 1 1 1 1 1 1 1 1 1 1 1 1 1 1 1 1 1 1 1 1 1 1 1 1 1 1 1 1 1 
##$CPDPRG= <>
##$CPDPRG1= <>
##$CPDPRG2= <>
##$CPDPRG3= <>
##$CPDPRG4= <mlev>
##$CPDPRG5= <mlev>
##$CPDPRG6= <mlev>
##$CPDPRG7= <mlev>
##$CPDPRG8= <mlev>
##$CPDPRGB= <>
##$CPDPRGT= <>
##$D= (0..31)
0 1 0 0 0 0 0 0 0 0.06 0 0 0 0 0 0 0.0002 0 0 0 0 0 0 0 0 0 0 0 0 0 0 
0 
##$DATE= 1118918598
##$DBL= (0..7)
120 120 120 120 120 120 120 120 
##$DBP= (0..7)
150 150 150 150 150 150 150 150 
##$DBP07= 0
##$DBPNAM0= <>
##$DBPNAM1= <>
$$ [...]
##$SUBNAM7= <"">
##$SUBNAM8= <"">
##$SUBNAM9= <"">
##$SW= 20.6930455092707
##$SWIBOX= (0..15)
0 0 3 0 0 0 0 0 0 0 0 0 0 0 0 0 
##$SW_h= 5175.983436853
##$TD= 65536
##$TD0= 1
##$TE= 295.16
##$TE2= 300
##$TE3= 300
##$TEG= 300
##$TL= (0..7)
0 120 120 120 120 120 120 120 
##$TP= (0..7)
150 150 150 150 150 150 150 150 
##$TP07= 0
##$TPNAME0= <>
##$TPNAME1= <>
##$TPNAME2= <>
##$TPNAME3= <>
##$TPNAME4= <>
##$TPNAME5= <>
##$TPNAME6= <>
##$TPNAME7= <>
##$TPOAL= (0..7)
0.5 0.5 0.5 0.5 0.5 0.5 0.5 0.5 
##$TPOFFS= (0..7)
0 0 0 0 0 0 0 0 
##$TUNHIN= 0
##$TUNHOUT= 0
##$TUNXOUT= 0
##$USERA1= <user>
##$USERA2= <user>
##$USERA3= <user>
##$USERA4= <user>
##$USERA5= <user>
##$V9= 5
##$VALIST= <valist>
##$VCLIST= <CCCCCCCCCCCCCCC>
##$VD= 0
##$VDLIST= <DDDDDDDDDDDDDDD>
##$VPLIST= <PPPPPPPPPPPPPPP>
##$VTLIST= <TTTTTTTTTTTTTTT>
##$WBST= 1024
##$WBSW= 4
##$XGAIN= (0..3)
0 0 0 0 
##$XL= 0
##$YL= 0
##$YMAX_a= 355189
##$YMIN_a= -441764
##$ZGOPTNS= <>
##$ZL1= 120
##$ZL2= 120
##$ZL3= 120
##$ZL4= 120
##$ABSF1= 16.4623
##$ABSF2= -4.230873
##$ABSG= 5
##$ABSL= 3
##$ALPHA= 0
##$AQORDER= 0
##$ASSFAC= 0
##$ASSFACI= 0
##$ASSFACX= 0
##$ASSWID= 0
##$AUNMP= <proc_1d>
##$AZFE= 0.1
##$AZFW= 0.1
##$BCFW= 0
##$BC_mod= 0
##$BYTORDP= 0
##$COROFFS= 0
##$CY= 12.5
##$DATMOD= 1
##$DC= 0
##$DFILT= <>
##$DTYPP= 0
##$F1P= 14.0000005364418
##$F2P= -0.99999901652339
##$FCOR= 0.5
##$FTSIZE= 32768
##$FT_mod= 6
##$GAMMA= 0
##$GB= 0
##$INTBC= 1
##$INTSCL= 1
##$ISEN= 128
##$LB= 0.3
##$LEV0= 0
##$LPBIN= 0
##$MAXI= 10000
##$MC2= 0
##$MEAN= 0
##$ME_mod= 0
##$MI= 0
##$NCOEF= 0
##$NC_proc= -5
##$NLEV= 6
##$NOISF1= 0
##$NOISF2= 0
##$NSP= 0
##$NTH_PI= 0
##$NZP= 0
##$OFFSET= 16.4623
##$PC= 1
##$PHC0= -78.23849
##$PHC1= 6.616249
##$PH_mod= 1
##$PKNL= yes
##$PPARMOD= 0
##$PSCAL= 4
##$PSIGN= 0
##$REVERSE= no
##$SF= 250.130014932362
##$SI= 32768
##$SIGF1= 0
##$SIGF2= 0
##$SINO= 400
##$SIOLD= 32768
##$SREGLST= <1H.CDCl3>
##$SSB= 0
##$STSI= 32768
##$STSR= 0
##$SW_p= 5175.98343685301
##$SYMM= 0
##$S_DEV= 0
##$TDeff= 65536
##$TDoff= 0
##$TI= <Analysis number 999999
Compound Code 99
Book Reference 9
Project Code 9>
##$TILT= no
##$TM1= 0
##$TM2= 0
##$TOPLEV= 0
##$USERP1= <user>
##$USERP2= <user>
##$USERP3= <user>
##$USERP4= <user>
##$USERP5= <user>
##$WDW= 1
##$XDIM= 32768
##$YMAX_p= 340405131
##$YMIN_p= -271560
$$ End of Bruker specific parameters
$$ ---------------------------------
##NTUPLES= NMR SPECTRUM
##VAR_NAME=  FREQUENCY,     SPECTRUM/REAL,   SPECTRUM/IMAG
##SYMBOL=    X,             R,               I
##VAR_TYPE=  INDEPENDENT,   DEPENDENT,       DEPENDENT
##VAR_FORM=  AFFN,          ASDF,            ASDF
##VAR_DIM=   32768,         32768,           32768
##UNITS=     HZ,            ARBITRARY UNITS, ARBITRARY UNITS
##FACTOR=    0.157963299565203, 1,           1
##FIRST=     4117.71518146707, 0,            0
##LAST=      -1058.26825538594, 0,           0
##MIN=       -1058.26825538594, -271560,     0
##MAX=       4117.71518146707, 340405131,    0
$$ Real data points
##PAGE= N=1
##DATA TABLE= (X++(R..R)), XYDATA
$$ [...]
$$ plain form
27716 96937 88733 22630 -51374 -40291 -18974 4192 -10791 -7900 -72870 -65729 -59568 -16933
27704 -16933 7521 38046 -18407 -26898 30619 56822 90874 87272 11038 -27768 -65582 -137146
27692 -137146 -130613 -40878 1947 12596 102447 135573 75852 69158 32924 -30834 -425 119938
27680 119938 154424 106985 83289 105311 156473 126344 59410 153272 128144 -349 -78345
27669 -78345 -92240 -73743 -73366 -5717 84434 -11188 -186881 -113051 16462 93300 83611 82495
27657 82495 48264 58354 59057 26021 6514 21325 -5909 47541 103255 95038 37685 -2656
27645 -2656 29496 52171 62851 -11619 3910 16556 20149 -4162 13933 61790 75887 88530
27633 88530 122761 112727 25371 25524 43009 -59211 -118563 -85157 -61636 -53439 -9084 10475
$$ packed form
27716I6937q204o6103p4004J1083K1317K3166j4983K891o4970P141O161M2635
27704a6933K4454L0525n6453q491N7517K6203L4052l602p6234l8806l7814p1564
27692a37146O533Q9735M2825J0649Q9851L3126n9721o694l6234o3758L0409J20363
27680A19938L4486m7439k3696K2022N1162l0129o6934R3862k5128j28493p7996
27669g8345j3895J8497L77O7649R0151r5622j75693P3830J29513P6838r689j116
27657H2495l4231J0090P03l3036j9507J4811k7234N3450N5714q217n7353m0341
27645b656L2152K2675J0680p4470J5529J2646L593k4311J8095M7857J4097J2643
27633H8530L4231j0034q7356J53J7485j02220n9352L3406K3521Q197M4355J9559
$$ plain form
27621 10475 -25113 23799 44347 62276 34682 -7950 20108 59155 61742 24663 -13080 471
27609 471 98082 45489 45545 58793 67943 94195 167698 189996 129512 95222 68676 53097 68087
27596 68087 55763 65216 46467 79554 68407 -92998 -156431 -149509 -114886 -62296 -57023 804
27584 804 14326 14640 15157 -14703 -60930 -77937 -57533 4710 -30773 -56405 -76780 -79796 -14155
27571 -14155 44107 41547 86025 164025 193687 142856 51679 -33584 -50351 -35101 -11012 -1156
27559 -1156 -9124 -49607 -89918 -59038 -14988 -77087 -14126 64515 100256 87157 133378 112791
27547 112791 50517 71572 100021 72787 41596 11653 23034 -79569 -35994 -2250 367
27536 367 -32652 -23301 28060 81970 109826 55582 38177 16669 76371 113282 116289 21588
$$ packed form
27621A0475l5588M8912K0548J7929k7594m2632K8058L9047K587l7079l7743J3551
27609D71R7611n2593N6J3248R150K6252P3503K2298o0484l4290k6546j5579J4990
27596F8087j2324R453j8749L3087j1147j61405o3433O922L4623N2590N273N7827
27584H04J3522L14N17k9860m6227j7007K0404O2243l5483k5632k0375l016O5641
27571a4155N8262k560M4478P8000K9662n0831r1177q5263j6767J5250K4089R856
27559a156p968m0483m0311L0880M4050o2099O2961P8641L5741j3099M6221k0587
27547A12791o2274K1055K8449k7234l1191k9943J1381j02603M3575L3744K617
27536C67l3019R351N1361N3910K7856n4244j7405k1508N9702L6911L007r4701
$$ plain form
27524 21588 -1022 -41925 -81858 -32725 52774 92042 91667 13317 17718 -11448 -54759 -122293
27512 -122293 -183603 -138252 -7015 47120 -44049 -67444 26675 75546 124427 82682 46861
27501 46861 -63670 -106455 -123491 -47921 73066 81206 42026 -16535 12161 -22021 28649
27490 28649 49739 79669 47526 -55606 -61014 22272 11652 -7891 60514 68799 -415 28471
27478 28471 -21044 -43860 -14172 5920 -7064 -46688 -52526 -52000 14380 71549 110745 79750
27466 79750 66600 101769 33411 -14624 -23317 47709 68344 37592 54273 115439 158122 140761
27454 140761 34791 -84276 -78237 -996 -13268 -85106 -97412 -55166 -45372 -58985 -23246
27443 -23246 -1122 83153 71421 35076 40 -57641 -80441 31796 117086 164490 187575
$$ packed form
27524B1588k2610m0903l9933M9133Q5499L9268l75p8350M401k9166m3311o7534
27512a22293o1310M5351J31237N4135r1169k3395R4119M8871M8881m1745l5821
27501D6861j10531m2785j7036P5570J20987Q140l9180n8561K8696l4182N0670
27490B8649K1090K9930l2143j03132n408Q3286j0620j9543O8405Q285o9214K8886
27478B8471m9515k2816K9688K0092j2984l9624n838N26O6380N7169L9196l0995
27466G9750j3150L5169o8358m8035q693P1026K0635l0752J6681O1166M2683j7361
27454A40761j05970j19067O039P7241j2272p1838j2306M2246R794j3613L5739
27443b3246K2124Q4275j1732l6345l5036n7681k2800J12237Q5290M7404K3085
$$ plain form
27432 187575 153195 92129 99020 64809 87563 82507 80808 108102 49557 52962 15877 -33500
27420 -33500 -35143 -69599 -117504 -66583 -13515 -19418 83044 105024 52277 58473 87161 80675
27408 80675 -72208 -103780 -81895 -19679 30284 51206 77111 14850 13824 38698 68966 -6999
27396 -6999 -21594 -7915 -34233 -40546 11149 27589 -33716 21273 27012 29140 381 17246
27384 17246 7049 2911 36401 28424 16940 38297 60582 60268 90068 52194 52242 17947 80055
27371 80055 97474 50163 5988 18104 38703 -29224 -67257 -18674 22126 62609 63843 46750
27359 46750 99398 156945 153464 66408 27915 -28757 -24835 -5727 -41919 -76934 -69414 -78817
27347 -78817 -32785 -23580 9188 -4728 -80075 -136805 -123541 -87116 -73075 -73130 -91022 -82392 -88094
$$ packed form
27432A87575l4380o1066O891l4211K2754n056j699K7294n8545L405l7085m9377
27420c3500j643l4456m7905N0921N3068n903J02462K1980n2747O196K8688o486
27408H0675j52883l1572K1885O2216M9963K0922K5905o2261j026K4874L0268p5965
27396f999j4595J3679k6318o313N1695J6440o1305N4989N739K128k8759J6865
27384A7246j0197m138L3490p977j1484K1357K2285l14K9800l7874M8l4295O2108
27371H0055J7419m7311m4175J2116K0599o7927l8033M8583M0800M0483J234j7093
27359D6750N2648N7547l481q7056l8493n6672L922J9108l6192l5015P520r403
27347g8817M6032R205L2768j3916p5347n6730J3264L6425J4041n5j7892Q630n702
$$ plain form
27334 -88094 -58545 55097 142598 114704 69562 90028 80693 -1669 25022 22557 -43721 -93700
27322 -93700 -25883 51436 66309 107907 106723 67031 -20115 -49994 4693 15965 -73111 -57639
27310 -57639 16550 55893 -24533 -6721 -45620 -6095 35444 61954 5794 11387 -14632 -130755
27298 -130755 -121125 -26778 -40720 -102545 -96477 -151698 -108929 -48100 -65417 -43399 -82608 -104571
27286 -104571 -73822 -53012 -31017 -67309 -67161 98577 179044 67772 -19595 35372 70190
27275 70190 12798 -10017 -51542 -89953 -8239 91940 83819 54390 7470 -28029 -25328 -19737
27263 -19737 -36904 -2462 -54657 -96967 -61303 -77229 -89354 -99970 -85734 -19493 -4743 22170
27251 22170 -15880 -47914 -77603 -70642 -29704 27169 4682 -36800 -26874 27670 -4540 -37262
$$ packed form
27334h8094K9549J13642Q7501k7894m5142K0466r335q2362K6691k465o6278m9979
27322i3700O7817P7319J4873M1598j184l9692q7146k9879N4687J1272q9076J5472
27310e7639P4189L9343q0426J7812l8899L9525M1539K6510n6160N593k6019j16123
27298a30755R630R4347j3942o1825O068n5221M2769O0829j7317K2018l9209k1963
27286a04571L0749K0810K1995l6292J48J65738Q0467j11272q7367N4967L4818
27275G0190n7392k2815m1525l8411Q1714J00179q121k9429m6920l5499K701N591
27263a9737j7167L4442n2195m2310L5664j5926j2125j0616J4236O6241J4750K6913
27251B2170l8050l2034k9689O961M0938N6873k2487m1482R926N4544l2210l2722
$$ plain form
27239 -37262 -26679 -51046 -72297 -54541 -48049 -48366 37249 124318 166613 165228 148620 100163
27227 100163 53176 28817 -65539 -66182 24057 -2036 -83357 -90951 -97096 -92085 -28946 82472
27215 82472 92129 86965 47239 24051 30882 -46966 -61446 -6635 95211 136379 129085 77582
27203 77582 58514 103025 76799 -60956 -77197 -14168 -27347 -32101 20455 -24500 -32661 -39665
27191 -39665 -3327 29754 77750 99259 125760 135051 65256 32947 -62088 -113570 -100267 -40594
27179 -40594 59786 142537 121887 110923 41310 -106953 -112121 30 46270 3881 81270
27168 81270 114002 135665 82081 43513 19893 -31739 -24878 44853 13443 39112 94491 140079
27156 140079 45958 28473 37272 -13699 32927 44327 26373 -10184 -36456 -39109 -20397 -9340
$$ packed form
27239c7262J0583k4367k1251J7756O492l17Q5615Q7069M2295j385j6608m8457
27227A00163m6987k4359r4356o43R0239k6093q1321p594o145N011O3139J11418
27215H2472R657n164l9726k3188O831p7848j4480N4811J01846M1168p294n1503
27203G7582j9068M4511k6226j37755j6241O3029j3179m754N2556m4955q161p004
27191c9665L6338L3081M7996K1509K6501R291o9795l2309r5035n1482J3303N9673
27179d0594J00380Q2751k0650j0964o9613j48263n168J12151M6240m2389P7389
27168H1270L2732K1663n3584l8568k3620n1632O861O9731l1410K5669N5379M5588
27156A40079r4121j7485Q799n0971M6626J1400j7954l6557k6272k653J8712J1057
$$ plain form
27144 -9340 -52813 -52516 -66029 -24286 -33972 35413 65545 21871 -4886 36497 80657 65626
27132 65626 54632 3273 -43526 -71680 -8546 -6580 -60345 -18349 35562 59740 60608 -1915
27120 -1915 -38943 -41920 -10651 5178 -20262 22687 -38107 -13708 50969 13850 23454 -48838
27108 -48838 -65840 -59537 -117493 -123088 -87561 -73693 -78421 -53574 10548 32178 27979 -22542
27096 -22542 -18624 -39906 -39683 3651 -15607 33795 66425 -4894 12740 74600 42410 36891
27084 36891 116517 178877 149027 120102 107929 74489 32756 14770 17557 5155 -43155 -81073
27072 -81073 -99248 -94529 -88840 -102536 -78722 -62700 -93546 -74893 -143948 -164883 -120593 -26898
27060 -26898 50700 78883 87618 73762 12839 -93245 -69702 -38005 29531 29833 27883 -359
$$ packed form
27144i340m3473K97j3513M1743r686O9385L0132m3674k6757M1383M4160j5031
27132F5626j0994n1359m6799k8154O3134J966n3765M1996N3911K4178Q68o2523
27120a915l7028k977L1269J5829k5440M2949o0794K4399O4677l7119R604p2292
27108d8838j7002O303n7956n595L5527J3868m728K4847O4122K1630m199n0521
27096b2542L918k1282K23M3334j9258M9402L2630p1319J7634O1860l2190n519
27084C6891P9626O2360k9850k8925j2173l3440m1733j7986K787j2402m8310l7918
27072h1073j8175M719N689j3696K3814J6022l0846J8653o9055k0935M4290R3695
27060b6898P7598K8183Q735j3856o0923j06084K3543L1697O7536L02j950k8242
$$ plain form
27048 -359 50891 70506 35435 36312 48438 7411 10318 60170 83513 40564 29053 -11529 34031
27035 34031 82641 14634 -18479 -65700 -79916 -51367 -95539 -47770 -17570 3721 -52971 -104179
27023 -104179 -123745 -32214 54273 50395 -13982 -115821 -86671 -38798 -41506 44186 42474 -11806
27011 -11806 6592 25770 -2148 15024 -45060 -96815 -77489 -75501 -137804 -159345 -132899 -82179
26999 -82179 -2457 77440 51248 6021 98468 141243 68323 28810 39474 16278 -47957 6712
26987 6712 41248 42292 31292 11788 -30884 -8685 6324 13664 113099 113094 60834 47857 893
26974 893 26055 9860 53695 52353 3867 -52650 -73154 -31881 9024 20288 50322 55177
26962 55177 5846 -77445 -112036 -135278 -118556 -56012 -61408 -94434 -181405 -146101 -170076 -153266
$$ packed form
27048c59N1250J9615l5071Q77J2126m1027K907M9852K3343m2949j1511m0582M5560
27035C4031M8610o8007l3113m7221j4216K8549m4172M7769L0200K1291n6692n1208
27023a04179j9566R1531Q6487l878o4377j01839K9150M7873k708Q5692j712n4280
27011a1806J8398J9178k7918J7172o0084n1755J9326J988o2303k1541K6446N0720
26999h2179P9722P9897k6192m5227R2447M2775p2920l9513J0664k3196o4235N4669
26987F712L4536J044j1000j9504m2672K2199J5009P340R9435nn2260j2977m6964
26974H93K5162j6195M3835j342m8486n6517k0504M1273M0905J1264L0034M855
26962E5177m9331q3291l4591k3242J6722O2544n396l3026q6971L5304k3975J6810
$$ plain form
26950 -153266 -98897 -101924 -120251 -79407 -38786 -43937 -29247 -13250 -30926 -20838 14473 -13732
26938 -13732 -13718 59509 132145 116878 57972 51117 25032 40749 69146 -6907 -30642 1335
26926 1335 11915 36938 90574 116901 73206 91413 136368 96203 91205 15002 -22099 -72206
26914 -72206 -80832 22486 28627 -31822 -55755 -79927 -102930 -89960 -103981 -105956 -106379 -129756
26902 -129756 -147983 -122851 -108292 -131681 -20149 -26975 -21534 -977 -30837 -114413 -87404 -102909
26890 -102909 -104971 -95580 -125672 -107358 -62886 -63588 -66642 -57161 -33504 27812 169758 139680
26878 139680 126405 121693 98590 80413 6089 -63109 -30051 57930 129305 159963 121442 29493
26866 29493 1094 -8785 -59462 -88041 -87127 -5654 94858 109740 60860 34630 -48877 -102869
$$ packed form
26950a53266N4369l027j8327M0844M0621n151J4690J5997j7676J0088L5311k8205
26938a3732J4P3227P2636j5267n8906o855k6085J5717K8397p6053k3735L1977
26926A335J0580K5023N3636K6327m3695J8207M4955m0165m998p6203l7101n0107
26914g2206q626J03318O141o0449k3933k4172k3003J2970j4021j975m23k3377
26902a29756j8227K5132J4559k3389J11532o826N441K0557k9860q3576K7009j5505
26890a02909k062R391l0092J8314M4472p02l054R481K3657O1316J41946l0078
26878A39680j3275m712k3103j8177p4324o9198L3058Q7981P1375L0658l8521r1949
26866B9493k8399r879n0677k8579R14Q1473J00512J4882m8880k6230q3507n3992
$$ plain form
26854 -102869 -89455 -34218 13941 -14162 -12017 1438 70478 71360 68244 -7087 -29353 -59033
26842 -59033 -61483 -139707 -58425 4955 47795 28075 57884 51105 -16235 -11155 -9342 17326
26830 17326 45128 70413 30699 -22034 52572 114677 31094 -19972 11708 77182 172336 183177
26818 183177 96239 43886 4478 -40872 -19705 30254 41875 -71361 -84447 -63543 -16674
26807 -16674 -29747 -4101 2292 38860 11106 -61377 -30668 -6212 -5434 21237 9200 2005
26795 2005 58632 20496 -10714 -15628 -32875 19337 6301 -80970 -53826 -39986 35927 23424
26783 23424 10909 -13069 -3663 15086 30085 68002 87898 101812 70474 5043 85407 57525
26771 57525 47007 16333 23291 47486 24548 70924 117566 96678 18156 -20175 -36186 13575
$$ packed form
26854a02869J3414N5237M8159k8103K145J3455O9040Q82l116p5331k2266k9680
26842e9033k450p8224Q1282O3380M2840j9720K9809o779o7340N080J813K6668
26830A7326K7802K5285l9714n2733P4606O2105q3583n1066L1680O5474R5154J0841
26818A83177q6938n2353l9408m5350K1167M9959J1621j13236j3086K0904M6869
26807a6674j3073K5646O393L6568k7754p2483L0709K4456P78K6671j2037p195
26795B005N6627l8136l1210m914j7247N2212j3036q7271K7144J3840P5913j2503
26783B3424j2515k3978R406J8749J4999L7917J9896J3914l1338o5431Q0364k7882
26771E7525j0518l0674O958K4195k2938M6376M6642k0888p8522l8331j6011M9761
$$ plain form
26759 13575 74774 53896 34974 -61193 -102282 -133022 -107783 -132786 -121502 -44355 19355 60097
26747 60097 118948 124228 66884 7535 -14273 -31914 -30463 23933 41715 117301 192245 242231
26735 242231 207952 130194 117547 133690 85222 18259 100778 152897 118819 13360 795
26724 795 56382 139106 123149 53625 46193 47685 642 -20577 1893 20092 91690 46059
26712 46059 -68148 -59765 -19020 42553 104245 81401 67390 175256 114585 23599 -66323
26701 -66323 -104402 -54979 -25263 -65109 -68391 -21027 2248 -73539 -61488 -1814 -9706 43214
26689 43214 73464 86478 69354 3972 -120803 -161679 -109444 -119023 -113789 -34000 4102 -58717
26677 -58717 -72396 -43830 6213 -5819 19736 43105 32356 -14340 -4662 -841 10784 -76220
$$ packed form
26759A3575O1199k0878j8922r6167m1089l0740K5239k5003J1284P7147O3710M0742
26747F0097N8851N280n7344n9349k1808j7641J451N4396J7782P5586P4944M9986
26735B42231l4279p7758j2647J6143m8468o6963Q2519N2119l4078j05459j2565
26724G95N5587Q2724j5957o9524p432J492m7043k1219K2470J8199P1598m5631
26712D6059j14207Q383M0745O1573O1692k2844j4011J07866o0671r0986q9922
26701f6323l8079M9423K9716l9846l282M7364K3275p5787J2051N9674p892N2920
26689D3214L0250J3014j7124o5382j24775m0876N2235r579N234P9789L8102o2819
26677e8717j3679K8566N0043j2032K5555K3369j0749m6696R678L821J1625q7004
$$ plain form
26665 -76220 -96224 -123406 -136741 -115480 -77361 -49746 -111735 -112856 -53091 18772 56886 70242
26653 70242 135988 97558 55364 -66039 -35515 2156 -40344 -21824 -43894 -75149 -143877
26642 -143877 -124535 -141701 -173527 -123733 -31480 -42739 -22020 -56139 -134231 -104996 -54837
26631 -54837 -139731 -100290 -16070 66984 14605 25303 49108 104226 69974 2844 -7983 -15893
26619 -15893 64061 89202 91386 13010 -12959 35158 10659 -1377 41213 30533 68607 -12189
26607 -12189 -145042 -134683 -26720 -5318 -57447 -108114 -131084 -57442 -26009 -44999 -23351
26596 -23351 -37039 -49944 25159 2934 -42585 -75775 -32710 31566 35043 74472 44711 51048
26584 51048 15141 -60185 -106641 -66733 -17569 -89693 -110466 -22927 35448 25214 11433 -27103
$$ packed form
26665g6220k0004k7182j3335K1261L8119K7615o1989j121N9765P1863L8114J3356
26653G0242O5746l8430m2194j21403L0524L7671m2500J8520k2070l1255o8728
26642a43877J9342j7166l1826M9794R2253j1259K0719l4119p8092K9235N0159
26631e4837q4894L9441Q4220Q3054n2379J0698K3805N5118l4252o7130j0827p910
26619a5893P9954K5141K184p8376k5969M8117k4499j2036M2590j0680L8074q0796
26607a2189j32853J0359J07963K1402n2129n0667k2970P3642L1433j8990K1648
26596b3351j3688j2905P5103k2225m5519l3190M3065O4276L477L9429k9761O337
26584E1048l5907p5326m6456L9908M9164p2124k0773Q7539N8375j0234j3781l8536
$$ plain form
26572 -27103 -74063 -117404 -103724 -116169 -143917 -78336 51582 108649 70647 68955 50917 -22478
26560 -22478 -93977 -165953 -147496 -128236 -84903 -12254 -43426 101 1111 25536 112427 76764
26548 76764 49943 8401 -14176 33181 53398 49858 80566 27364 14437 -24547 -77120 -38029
26536 -38029 79275 104228 10593 -73616 -61530 13760 44583 71026 53049 3902 -54233
26525 -54233 -60396 52065 93163 98186 -13765 -105727 -61080 -127181 -100720 23616 -24630
26514 -24630 11500 66630 35913 21157 1230 3547 -33077 -26382 -16815 56936 41519 -23352
26502 -23352 -9434 -64438 -13242 -19208 -39950 193 -4448 -38176 -58248 -43609 -44388 13173
26490 13173 26461 -7721 -27480 -34325 54954 117648 92887 129324 116221 89705 -9073 -57377
$$ packed form
26572b7103m6960m3341J3680j2445k7748O5581J29918N7067l8002j692j8038p3395
26560b2478p1499p1976J8457J9260M3333P2649l1172M3527J010K4425Q6891l5663
26548G6764k6821m1542k2577M7357K0217l540L0708n3202j2927l8984n2573L9091
26536c8029J17304K4953r3635q4209J2086P5290L0823K6443j7977m9147n8135
26525e4233o163J12461M1098N023j11951r1962M4647o6101K6461J24336m8246
26514b4630L6130N5130l0717j4756j9927K317l6624O695R567P3751j5417o4871
26502b3352J3918n5004N1196n966k0742M0143m641l3728k0072J4639p79N7561
26490A3173J3288l4182j9759o845Q9279O2694k4761L6437j3103k6516r8778m8304
$$ plain form
26478 -57377 -111841 -66427 23440 40326 80829 23115 -28460 -14175 -161 -1534 53692 53111
26466 53111 66229 44485 67107 78982 112544 98190 35479 84117 154233 119570 73659 101527
26454 101527 41684 25342 41005 30418 -16161 -16861 -22853 -29904 -4654 35164 84591 42828
26442 42828 -20136 22680 41743 3181 18894 -8861 -25873 -38580 -41274 39439 126150 115562
26430 115562 62959 62596 -13957 6035 22208 -11633 -979 -1207 -4951 -60453 -103873 -63838
26418 -63838 -38578 8786 36347 86506 110173 41372 48337 44136 44252 88612 127804 109211
26406 109211 119761 76750 41209 51597 25712 31792 64843 45631 45291 -25840 -45537 -48126
26394 -48126 9948 -5958 -27128 -49324 -7655 36640 26183 -21833 -36915 9911 19255 26627
$$ packed form
26478e7377n4464M5414Q9867J6886M0503n7714n1575J4285J4014j373N5226n81
26466E3111J3118k1744K2622J1875L3562j4354o2711M8638P0116l4663m5911K7868
26454A01527n9843j6342J5663j0587m6579p00n992p051K5250L9818M9427m1763
26442D2828o2964M2816J9063l8562J5713k7755j7012j2707k694Q0713Q6711j0588
26430A15562n2603l63p6553J9992J6173l3841J0654k28l744n5502m3420M0035
26418f3838K5260M7364K7561N0159K3667o8801O965m201J16M4360L9192j8593
26406A09211J0550m3011l5541J0388k5885O080L3051j9212l40p1131j9697k589
26394d8126N8074j5906k1170k2196M1669M4295j0457m8016j5082M6826R344P372
$$ plain form
26382 26627 70500 -9038 -35297 -10657 -26419 -26563 32212 85818 105857 117026 195094 139531
26370 139531 86441 84164 95741 82847 80011 101582 143831 149745 102045 61934 43857 51807
26358 51807 54032 -8320 -43304 -1974 69476 90766 52601 86198 124390 160318 135621 78410
26346 78410 34402 -51825 -25558 -23394 -10350 7397 22794 13245 -2814 -16099 -21799 -72667
26334 -72667 -112897 -39692 4306 -22834 -25008 83468 89522 76056 61246 28108 13490 24029
26322 24029 75589 37815 39655 -9426 -41079 -24294 1471 41228 37408 -10933 -127729 -147478
26310 -147478 -78937 -9162 37151 22665 19966 -34342 8124 20671 72733 130335 57981 16314
26298 16314 -15406 13104 13083 -65025 -70380 -2540 21959 -46861 -100716 -109167 -39838 23593 49515
$$ packed form
26382B6627M3873p9538k6259K4640j5762j44N8775N3606K0039J1169P8068n5563
26370A39531n3090k277J1577j2894k836K1571M2249N914m7700m0111j8077P950
26358E1807K225o2352l4984M1330P1450K1290l8165L3597L8192L5928k4697n7211
26346G8410m4008q6227K6267K164J3044J7747J5397r549j6059j3285n700n0868
26334g2667m0230P3205M3998k7140k174J08476O054j3466j4810l3138j4618J0539
26322B4029N1560l7774J840m9081l1653J6785K5765L9757l820m8341j16796j9749
26310a47478O8541O9775M6313j4486k699n4308M2466J2547N2062N7602p2354m1667
26298A6314l1720K8510k1p8108n355O7840K4499o8820n3855q451O9329O3431K5922
$$ plain form
26285 49515 5020 -13405 23221 -29623 -29708 9565 54279 96071 109363 107314 112991 61333 18488
26272 18488 89579 118114 137378 103922 95791 13835 9881 -48 639 -84466 -44896 -25926 -19405
26259 -19405 -2082 -24514 -13772 -6931 -4442 8158 -23355 -17790 22958 -101010 -61385 -21675
26247 -21675 -14881 33726 755 39316 -35407 -70987 -40572 11641 -20074 -37984 -48041 -56809
26235 -56809 -25485 -24707 -90514 -49856 37100 95421 144952 126255 127967 122140 11810 -16755
26223 -16755 -41604 -25717 -49454 -136340 -126340 -55183 -32370 -36038 -52845 -100043 -55653 -15534
26211 -15534 18940 -1000 17011 47699 26275 -13100 96798 98976 64464 58667 -31057 -110304
26199 -110304 -187468 -182949 -117795 -53000 -85666 -84594 20470 58072 67055 43062 57497 78083
$$ packed form
26285D9515m4495j8425L6626n2844q5L9273M4714M1792J3292k049N677n1658m2845
26272A8488P1091K8535J9264l3456q131q1956l954r929O87q5105L9570J8970O521
26259a9405J7323k2432J0742O841K489J2600l1513N565M0748j23968L9625L9710
26247b1675O794M8607l2971L8561p4723l5580L0415N2213l1715j7910j0057q768
26235e6809L1324P78o5807M0658Q6956N8321M9531j8697J712n827j10330k8565
26223a6755k4849J5887k3737q6886J0000P1157K2813l668j6807m7198M4390M0119
26211a5534L4474j9940J8011L0688k1424l9375J09898K178l4512n797q9724p9247
26199a10304p7164M519O5154O4795l2666J072J05064L7602Q983k3993J4435K0586
$$ plain form
26187 78083 25379 -24028 -8504 59362 49937 71112 24186 46073 109786 155164 80235 37403
26175 37403 28736 102088 197921 133202 39946 -45938 -78824 -126723 -58458 -23248 -29205 -37097
26163 -37097 -48138 -27114 -55067 -57127 -91113 -126594 -104058 17597 -20082 -66117 -69649 -74113
26151 -74113 -74902 23773 46446 4592 3014 12843 81605 105468 -30586 -29424 80552 63698
26139 63698 -25110 -8739 7624 -8909 -8677 -58242 -88472 18442 25597 7417 28734 23876
26127 23876 -4023 -13921 22317 23977 -44990 -112198 -12759 69502 27660 -73316 -41086 -56040
26115 -56040 -27165 -77502 9150 61304 89253 38469 1414 54201 83825 99454 78972 35376
26103 35376 45640 17161 -3675 41821 65787 63735 46749 109485 58053 -6083 -16649 11538
$$ packed form
26187G8083n2704m9407J5524O7866r425K1175m6926K1887O3713M5378p4929m2832
26175C7403q667P3352R5833o4719r3256q5884l2886m7899O8265L5210n957p892
26163c7097j1041K1024k7953k060l3986l5481K2536J21655l7679m6035l532m464
26151g4113p89R8675K2673m1854j578R829O8762K3863j36054J162J09976j6854
26139F3698q8808J6371J6363j6533K32m9565l0230J06914P155j8180K1317m858
26127B3876k7899r898L6238J660o8967o7208R9439Q2261m1842j00976L2230j4954
26115e6040K8875n0337Q6652N2154K7949n0784l7055N2787K9624J5629k0482m3596
26103C5376J0264k8479k0836M5496K3966k052j6986O2736n1432o4136j0566K8187
$$ plain form
26091 11538 -14180 27533 136240 189460 199595 122230 -9991 -41531 -36457 989 -12752
26080 -12752 543 -4018 -8860 15431 53023 76703 40538 -16872 -39271 -1810 63728 131257
26068 131257 120543 57590 -26471 -111339 -100512 -46806 -66385 -65505 -82632 -57766 18980 138612
26056 138612 222360 195890 103557 -4833 -49856 -88100 -35821 1155 -35891 -20462 -32870
26045 -32870 -64712 -4301 -47929 -44354 -16149 -9881 24350 82199 123182 146182 57435 24620
26033 24620 -5559 4139 18761 46137 49296 13728 -21790 45354 28176 -59927 -60899 -71609
26021 -71609 -59495 -62058 13175 6331 -57708 -86541 -83076 -59085 30160 35430 39867 55553 105883
26008 105883 94204 81515 14304 37715 75519 28207 -10661 -84978 -62991 30778 35228 55077
$$ packed form
26091A1538k5718M1713J08707N3220J0135p7365j32221l1540N074L7446j3741
26080a2752J3295m561m842K4291L7592K3680l6165n7410k2399L7461O5538O7529
26068A31257j0714o2953q4061q4868J0827N3706j9579Q80j7127K4866P6746J19632
26056A38612Q3748k6470r2333j08390m5023l8244N2279L6976l7046J5429j2408
26045c2870l1842O0411m3628L575K8205O268L4231N7849M0983K3000q8747l2815
26033B4620l0179R698J4622K7376L159l5568l5518O7144j7178q8103r72j0710
26021g1609J2114k563P5233o844o4039k8833L465K3991Q9245N270M437J5686N0330
26008A05883j1679j2689o7211K3411L7804m7312l8868p4317K1987R3769M450J9849
$$ plain form
25996 55077 -2163 -111203 -81936 -4318 62918 119050 81318 57318 2631 -5660 34246 40168
25984 40168 54455 25226 -20134 -59232 -69165 -150190 -191455 -120138 -105908 -87837 -123958 -159184
25972 -159184 -185461 -163983 -128203 -74568 -4822 21775 111621 168983 153293 87978 98430
25961 98430 94945 82455 92483 74450 44207 152130 253748 214472 91756 -18795 -144632
25950 -144632 -135196 -108556 -58971 -34019 -20999 29108 30086 41288 139397 153241 89666 -30515
25938 -30515 -25754 -56531 -30088 41738 29831 66479 65795 25386 74929 156598 200962 208467
25926 208467 161723 80796 26259 17194 -6013 -13742 -77464 -125395 -30709 46536 78173 63680
25914 63680 33985 -45383 -29262 2657 -10305 -51009 -3622 5445 -62125 -67983 -25043 -43197
$$ packed form
25996E5077n7240j09040K9267P7618O7236N6132l7732k4000n4687q291L9906N922
25984D0168J4287k9229m5360l9098r933q1025m1265P1317J4230J8071l6121l5226
25972a59184k6277K1478L5780N3635O9746K6597Q9846N7362j5690o5315J0452
25961I8430l485j2490J0028j8033l0243J07923J01618l9276j22716j10551j25837
25950a44632R436K6640M9585K4952J3020N0107R78J1202R8109J3844o3575j20181
25938c0515M761l0777K6443P1826j1907L6648o84m0409M9543Q1669M4364P505
25926B08467m6744q0927n4537r065k3207p729o3722m7931R4686P7245L1637j4493
25914F3680k9695p9368J6121L1919j2962m0704M7387R067o7570n858M2940j8154
$$ plain form
25902 -43197 -73637 -59101 -70745 -56640 -112564 -114829 -34580 -14200 -40490 -65800 -44815 -15801
25890 -15801 -26114 56041 66113 9939 -30445 -37910 -62935 -148060 -97392 -95289 -153118 -151865
25878 -151865 -78910 -58272 -35262 9579 -15632 -30312 -6431 -14073 28814 53731 90584 98000
25866 98000 74753 30525 -10964 38003 53175 37937 -66113 -109864 -16812 -9128 -10646 4401
25854 4401 -42801 -76832 -9644 11970 41753 101763 91201 58670 25306 -53300 -98329 -49375
25842 -49375 -46744 -2466 14992 22731 7447 3141 -34435 -75512 -66246 41456 108794 157089
25830 157089 169081 110899 85370 96776 90698 78719 13470 -72286 -52533 5039 18185 31725
25818 31725 18307 25981 -54179 -2993 44281 75160 70539 64686 67833 61592 1362 -1525 -64301
$$ packed form
25902d3197l0440J4536j1644J4105n5924k265Q0249K0380k6290k5310K0985K9014
25890a5801j0313Q2155J0072n6174m0384p465k5025q5125N0668K103n7829J253
25878a51865P2955K0638K3010M4841k5211j4680K3881p642M2887K4917L6853P416
25866I8000k3247m4228m1489M8967J5172j5238j04050m3751R3052P684j518J5047
25854D401m7202l4031O7188K1614K9783O0010j0562l2531l3364p8606m5029M8954
25842d9375K631M4278J7458P739j5284m306l7576m1077R266J07702O7338M8295
25830A57089J1992n8182k5529J1406o078j1979o5249q5756J9753N7572J3146J3540
25818C1725j3418P674q0160N1186M7274L0879m621n853L147o241o0230k887o2776
$$ plain form
25805 -64301 -103685 -112860 -214709 -198041 -46850 1715 -81940 -36040 111888 104426 86396
25794 86396 42751 -64316 -134795 -153067 -110639 -121383 -81521 -84863 -47969 -30527 -27229 22534
25782 22534 18550 13478 -23750 -71332 -67438 -57697 -38648 -535 21376 61101 99489 109234 135682
25769 135682 57734 10317 10675 -18194 28879 -20498 -92473 -73644 -90125 -119653 -55025 -4360
25757 -4360 -7017 -57272 -67670 -66314 -48777 -42596 11439 716 -26280 -3262 -94315 -165497
25745 -165497 -181024 -149712 -81349 -58288 -67513 -60160 -72742 -65394 -16994 -16981 13295 14554 -16935
25732 -16935 -4307 80276 47561 -9405 -23596 -19607 36566 103965 -32973 -79165 -44702 -83668
25720 -83668 -57127 1328 65456 -9911 -17844 -2004 32001 9973 -43727 -44299 -19577 -84371
$$ packed form
25805f4301l9384r175j01849J6668J51191M8565q3655M5900J47928p462j8030
25794H6396m3645j07067p0479j8272M2428j0744L9862l342L6894J7442L298M9763
25782B2534l984n072l7228m7582L894R741J9049L8113K1911L9725L8388R745K6448
25769A35682p7948m7417L58k8869M7073m9377p1975J8829j6481k9528O4628N0665
25757d360k657n0255j0398J356J7537O181N4035j0723k6996K3018r1053p1182
25745a65497j5527L1312O8363K3061r225P353j2582P348M8400J3L0276J259l1489
25732a6935J2628Q4583l2715n6966j4191L989N6173O7399j36938m6192L4463l8966
25720h3668K6541N8455O4128p5367p933J5840L4005k2028n3700n72K4722o4794
$$ plain form
25708 -84371 -86847 -150751 -130699 -38612 -21233 -4809 -11713 -2440 23748 50388 6330 -2318
25696 -2318 52753 86593 78715 111901 91992 56869 17522 10264 8633 -11900 -37109 -65785
25684 -65785 -86544 -41605 -30853 -28343 60224 109985 18473 -44790 -43646 -19442 -112369 -66672
25672 -66672 31385 81910 94252 48668 -21619 -57945 -44596 -12581 16648 -10550 65616 86117
25660 86117 32876 2622 83877 111014 54904 12548 10762 -5037 20495 -76225 -133369 -74623
25648 -74623 -39247 -28797 -25325 -93269 -151134 -174667 -106429 -69036 -62241 -98105 -87332 13066
25636 13066 26886 -66339 -127601 -162443 -225522 -193936 -88622 18979 73708 26338 -37997
25625 -37997 -148981 -184189 -127410 -65937 -108925 -90813 -26331 -88120 -172650 -165552 -206599 -169153
$$ packed form
25708h4371k476o3904K0052R2087J7379J6424o904R273K6188K6640m4058q648
25696b318N5071L3840p878L3186j9909l5123l9347p258j631k0533k5209k8676
25684f5785k0759M4939J0752K510Q8567M9761r1512o3263J144K4204r2927M5697
25672f6672R8057N0525J2342m5584p0287l6326J3349L2015K9229k7198P6166K0501
25660H6117n3241l0254Q1255K7137n6110m2356j786j5799K5532r6720n7144N8746
25648g4623L5376J0450L472o7944n7865k3533O8238L7393O795l5864J0773J00398
25636A3066J3820r3225o1262l4842o3079L1586J05314J07601N4729m7370o4335
25625c7997j10984l5208N6779O1473m2988J8112O4482o1789q4530P098m1047L7446
$$ plain form
25613 -169153 -83082 -109771 -154965 -12889 107173 140478 89066 37030 -10043 -63068 -41303
25602 -41303 11954 77637 48599 43332 80441 118259 43452 -76361 -127498 -105754 -110027 -114344
25590 -114344 -112570 -124413 -120191 -81643 -48642 -69495 -65115 -9513 -35269 -35604 31258 55407
25578 55407 32808 10387 -8157 -5505 -39710 -68110 -58347 -39418 28464 15714 10262 21520
25566 21520 30126 29710 131011 154652 69713 9564 -36586 -13738 1864 6781 22665 34659
25554 34659 67655 64807 26733 87660 124324 74794 28695 -30827 12746 -17930 -47840 -65825
25542 -65825 -74819 -42403 23025 48831 36905 7335 4931 34627 109247 110500 99337 24198
25530 24198 42199 -17027 -77046 -82941 -36486 -71563 -119386 -54944 -5627 37138 40696 9355
$$ packed form
25613a69153Q6071k6689m5194J42076J20062L3305n1412n2036m7073n3025K1765
25602d1303N3257O5683k9038n267L7109L7818p4807j19813n1137K1744m273m317
25590a14344J774j1843M222L8548L3001k0853M380N5602k5756l35O6862K4149
25578E5407k2599k2421j8544K652l4205k8400R763J8929O7882j2750n452J1258
25566B1520Q606m16J01301K3641q4939o0149m6150K2848J5602M917J5884J1994
25554C4659L2996k848l8074O0927L6664m9530m6099n9522M3573l0676k9910j7985
25542f5825q994L2416O5428K5806j1926k9570k404K9696P4620J253j1163p5139
25530B4198J8001n9226o0019n895M6455l5077m7823O4442M9317M2765L558l1341
$$ plain form
25518 9355 28002 66484 108368 42363 36185 72765 11768 -41093 -22650 -41715 -27742 -21885
25506 -21885 23027 69299 28037 48004 88633 81294 -1655 -32326 2252 -35410 -109874 -171928
25494 -171928 -203794 -135567 -106062 -98004 -78970 -75870 -52756 -2302 36566 23904 -34099 -153327
25482 -153327 -109995 -71800 -17690 -11906 5653 -59708 -88067 -91437 -55072 -11845 13371 13915
25470 13915 3986 37161 114164 130488 100358 96711 88401 50683 27346 -51483 -70758 -42611
25458 -42611 -96167 -125425 -34032 -25038 -52069 42788 73925 29093 1812 72298 150262 81148
25446 81148 33674 3034 -2222 22720 73429 80856 -25134 -29584 -16104 20382 24637 -13839
25434 -13839 -47920 -147131 -181675 -103148 -15341 -3587 -63327 -115570 -57928 29178 21641 17899
$$ packed form
25518I355J8647L8482M1884o6005o178L6580o0997n2861J8443j9065J3973N857
25506b1885M4912M6272m1262J9967M0629p339q2949l0671L4578l7662p4464o2054
25494a71928l1866O8227K9505Q058J9034L100K3114N0454L8868j2662n8003j19228
25482a53327M3332L8195N4110N784J7559o5361k8359l370L6365M3227K5216N44
25470A3915r929L3175P7003J6324l0130l647q310l7718k3337p8829j9275K8147
25458d2611n3556k9258R1393Q994k7031R4857L1137m4832k7281P0486P7964o9114
25446H1148m7474l0640n256K4942N0709P427j05990m450J3480L6486M255l8476
25434a3839l4081r9211l4544P8527Q7807J1754n9740n2243N7642Q7106p537l742
$$ plain form
25422 17899 -22261 33250 54505 22551 -15549 -32052 27167 -62658 -107391 -62505 57837
25411 57837 105885 47677 -45379 -43401 -50003 -3199 28407 65737 83100 40280 82061 77371
25399 77371 105557 85381 37696 71678 112497 125487 138031 111298 64407 -5106 -24938 28935
25387 28935 3852 -26647 -9824 20948 101791 94330 93889 84173 29331 12072 -9486 -65853
25375 -65853 22798 96749 106284 46903 -16639 -36132 -79662 -73720 -161045 -246777 -148513 -108876
25363 -108876 -82065 -104236 -60348 24304 39520 42350 30871 -21264 8663 -28803 -4082 -79666
25351 -79666 -141390 -155773 -93830 9623 14664 8091 -52303 -28422 -81078 -34144 -8164 -67837
25339 -67837 -50088 -32759 -55485 36926 89243 133140 101132 14614 -3552 53167 28484 38340
$$ packed form
25422A7899m0160N5511K1255l1954l8100j6503N9219q9825m4733M4886J20342
25411E7837M8048n8208r3056J978o602M6804L1606L7330J7363m2820M1781m690
25399G7371K8186k0176m7685L3982M0819J2990J2544k6733m6891o9513j9832N3873
25387B8935k5083l0499J6823L0772Q0843p461m41r716n4842j7259k1558n6367
25375f5853Q8651P3951R535n9381o3542j9493m3530N942q7325q5732R8264L9637
25363a08876K6811k2171M3888Q4652J5216K830j1479n2135K9927l7466K4721p5584
25351g9666o1724j4383O1943J03453N041o573o0394K3881n2656M6934K5980n9673
25339f7837J7749J7329k2726R2411N2317M3897l2008q6518j8166N6719k4683R856
$$ plain form
25327 38340 17300 -51507 -177247 -176567 -79042 -47556 -96798 -33613 28913 -31526 -29745 -24562
25315 -24562 10361 11986 -33880 -48584 -64563 -51808 -23523 -22587 42850 -10177 -84454 -32575
25303 -32575 -87722 -36144 33631 22170 23747 -45034 -26134 43357 -3042 -49577 -51241 -35640
25291 -35640 -38605 1032 36746 67359 33688 -4114 -2558 -12043 -27431 -76645 -71071 -9890
25279 -9890 -16700 35870 30772 -11021 23149 9521 -24752 -75320 -81574 -45474 -76739 -111432
25267 -111432 -160397 -106151 -122316 -42715 -28190 -78994 -48961 -78835 -128565 -95536 -63065
25256 -63065 -54118 -128099 -118881 -65702 -34012 -55803 -86583 -31983 14454 65727 23806 -70013
25244 -70013 -25865 7614 14237 -16588 -86911 -98216 -49609 -36044 13088 13421 -25844 28975
$$ packed form
25327C8340k1040o8807j25740O80R7525L1486m9242O3185O2526o0439J781N183
25315b4562L4923J625m5866j4704j5979J2755K8285R36O5437n3027p4277N1879
25303c2575n5147N1578O9775j1461J577o8781J8900O9491m6399m6535j664J5601
25291c5640k965L9637L5714L0613l3671l7802J556r485j5388m9214N574O1181
25279i890o810N2570n098m1793L4170j3628l4273n0568o254L6100l1265l4693
25267a11432m8965N4246j6165P9601J4525n0804L0033k9874m9730L3029L2471
25256f3065Q947p3981R218N3179L1690k1791l0780N4600M6437N1273m1921r3819
25244g0013M4148L3479O623l0825p0323j1305M8607J3565M9132L33l9265N4819
$$ plain form
25232 28975 101042 104881 131325 153383 178731 121098 48791 -8569 -69865 -76045 42249 4332
25220 4332 25951 -3990 -22685 -97604 -56840 -16028 -57586 -131498 -116270 -46495 -2230 7459
25208 7459 -8186 22257 75038 44803 60344 36401 27729 6306 -20757 1477 -56637 -71786
25196 -71786 -70153 -76568 -55420 -19976 -44280 -56100 -48051 -91836 -90484 -40468 -8041 182 23820
25183 23820 -988 -77426 -6870 3954 -81118 -94566 -113753 -66369 37698 25277 997
25172 997 -26117 -65108 -80027 -59558 -79465 -75487 -65041 -54829 -17672 -14192 -25169 -77544
25160 -77544 -121818 -161101 -155335 -115624 -107136 -44747 13147 -1806 25010 59276 -1966 62282
25148 62282 17663 30985 17501 -58469 -99475 -106726 -129542 -21486 69998 29562 -10483 -12308
$$ packed form
25232B8975P2067L839K6444K2058K5348n7633p2307n7360o1296o180J18294l7917
25220D332K1619k9941j8695p4919M0764M0812m1558p3912J5228O9775M4265R689
25208G459j5645L0443N2781l0235J5541k3943q672k1423k7063K2234n8114j5149
25196g1786J633o415K1148L5444k4304j1820Q049m3785J352N0016L2427Q223K3638
25183B3820k4808p6438P0556J0824q5072j3448j9187M7384J04067j2421k4280
25172I97k7114l8991j4919K0469j9907L978J0446J0212L7157L480j0977n2375
25160g7544m4274l9283N766L9711Q488O2389N7894j4953K6816L4266o1242O4248
25148F2282m4619J3322j3484p5970m1006p251k2816J08056R1484m0436m0045j825
$$ plain form
25136 -12308 14323 59226 107760 43763 -81435 -116429 -171779 -207218 -141638 -42694 -73783
25125 -73783 -126984 -66487 -25976 32526 424 847 8319 -35562 -83329 -28323 -23808 -31481 -43028
25112 -43028 -71681 -56106 37215 73971 78716 33656 -9583 -50871 -24004 9882 -4340 -43325
25100 -43325 -114423 -18565 36701 370 -26086 -77698 -94826 -73717 -33586 -8205 -18876 35107
25088 35107 64099 102509 89891 111424 49902 25077 73839 70621 37315 7515 -28979 5267
25076 5267 43521 42246 8766 -32220 -59218 -23620 -59858 -59940 -8085 8636 -70766 -91811 35696
25063 35696 47771 35734 9355 -45955 -132861 -131343 -159824 -147289 -84382 -11028 94 50466
25051 50466 49698 8723 -27390 -48007 13144 18528 -73966 -46294 -88946 -12850 16961 -43044
$$ packed form
25136a2308K6631M4903M8534o3997j25198l4994n5350l5439O5580R8944l1089
25125g3783n3201O0497M0511N8502l2102M23P472m3881m7767N5006M515p673j1547
25112d3028k8653J5575R3321L6756M745m5060m3239m1288K6867L3886j4222l8985
25100d3325p1098R5858N5266l6331k6456n1612j7128K1109M0131K5381j0671N3983
25088C5107K8992L8410j2618K1533o1522k4825M8762l218l3306k9800l6494L4246
25076E267L8254j275l3480m0986k6998L5598l6238q2N1855J6721p9402k1045J27507
25063C5696J2075j2037k6379n5310q6906J518k8481J2535O2907P3354J1122N0372
25051E0466p68m0975l6113k0617O1151N384r2494K7672m2652P6096K9811o0005
$$ plain form
25039 -43044 -43192 59018 103319 112696 82971 44629 58576 13767 -38224 -29298 -32658 -72444
25027 -72444 32652 57206 -227 -36994 -127295 -124770 -23279 123040 68924 -56853 12771
25016 12771 -939 -55289 -20859 23934 -7188 33328 75178 82666 55237 87546 24319 -50992
25004 -50992 -51760 -92771 -27550 -34830 -92341 -31530 75282 79135 -34278 -34526 28114 90388
24992 90388 22239 -33828 -26092 35285 102332 78453 113984 106931 71017 47724 23522 69094
24980 69094 64046 28983 20818 -22883 5014 -36179 -37919 -52601 -95062 -38638 61888 83863
24968 83863 18927 -46035 -36200 -22504 -2689 58384 70473 31749 -71179 -62586 -45643 -34044
24956 -34044 -9123 18511 -22796 -72895 -163290 -221036 -179150 -115908 -153589 -168773 -102713 -34951
$$ packed form
25039d3044j48J02210M4301R377k9725l8342J3947m4809n1991Q926l360l9786
25027g2444J05096K4554n7433l6767r0301K525J01491J46319n4116j25777O9624
25016A2771j3710n4350L4430M4793l1122M0516M1850P488k7429L2309o3227p5311
25004e0992p68m1011O5221p280n7511O0811J06812L853j13413k48O2640O2274
24992I0388o8149n6067P736O1377O7047k3879L5531p053l5914k3293k4202M5572
24980F9094n048l5063q165m3701K7897m1193j740j4682m2461N6424J00526K1975
24968H3863o4936o4962R835J3696J9815O1073J2089l8724j02928Q593J6943J1599
24956c4044K4921K7634m1307n0099r0395n7746M1886O3242l7681j5184O6060O7762
$$ plain form
24944 -34951 1254 21028 69523 44713 16148 2651 -15150 23925 79131 136100 96068 148048
24932 148048 190034 104131 67828 27029 19171 -22735 -82640 -106226 -66152 -24245 -25631 -72498
24920 -72498 -88626 -18172 3756 4308 -1420 -59463 -45837 22411 386 -50617 -35467 8308
24908 8308 15959 26485 123017 90623 37732 31788 52416 9421 1023 -34655 -167166 -152902
24896 -152902 -46519 -6462 -16718 -32117 -3049 -103838 -124924 -60988 -27874 21761 28111
24885 28111 -55102 -151918 -163072 -101152 23411 80726 88722 47601 13180 4639 -12133 62373
24873 62373 58306 3605 61570 -79179 -143704 -128076 -55195 -44859 -7828 40793 -17155 -64629
24861 -64629 6891 23690 48274 83726 57887 2695 -59397 -83286 -40651 -3368 -59215 -126650
$$ packed form
24944c4951L6205J9774M8495k4810k8565j3497j7801L9075N5206N6969m0032N1980
24932A48048M1986q5903l6303m0799p858m1906n9905k3586M0074M1907j386m6867
24920g2498j6128P0454K1928N52n728n8043J3626O8248k2025n1003J5150M3775
24908H308P651J0526R6532l2394n2891n944K0628m2995q398l5678j32511J4264
24896a52902J06383M0057j0256j5399K9068j00789k1086O3936L3114M9635O350
24885B8111q3213r6816j1154O1920J24563N7315P996m1121l4421q541j6772P4506
24873F2373m067n4701N7965j40749o4525J5628P2881J0336L7031M8621n7948m7474
24861f4629P1520J6799K4584L5452k5839n5192o2092k3889M2635L7283n5847o7435
$$ plain form
24849 -126650 -103351 26306 68605 58127 -12442 -112478 -158464 -126207 -92691 -10610 -10549 -54843
24837 -54843 -97392 9551 66975 36157 -13013 -66206 -143732 -140379 -147551 -87274 -7693 1640
24825 1640 -27010 -20756 -79556 -105177 -21977 -37717 -65887 -4664 51508 19565 -33576 -9917
24813 -9917 45044 78352 -2755 -41010 61781 25673 -9650 12246 -11726 -47049 -73653 -126100
24801 -126100 -166782 -185375 -109024 -64440 -116495 -98815 -64208 -52143 -21161 5800 52159
24790 52159 55426 101537 83396 62330 100050 27539 -57719 -125278 -135321 -57130 -13919 -11236
24778 -11236 35867 43869 -15094 -4162 -89641 -55867 -82431 -44950 -63405 -14210 43924 59493
24766 59493 55532 42950 -14796 -53796 -71278 -86339 -7879 12799 -4092 -18598 -83201 -133708
$$ packed form
24849a26650K3299J29657M2299j0478p0569j00036m5986L2257L3516Q2081O1m4294
24837e4843m2549J06943N7424l0818m9170n3193p7526L353p172O0277P9581R333
24825A640k8650O254n8800k5621Q3200j5740k8170O1223N6172l1943n3141K3659
24813i917N4961L3308q1107l8255J02791l6108l5323K1896k3972l5323k6604n2447
24801a26100m0682j8593P6351M4584n2055J7680L4607J2065L0982K6961M6359
24790E2159L267M6111j8141k1066L7720p2511q5258o7559j0043P8191M3211K683
24778a1236M7103Q002n8963J0932q5479L3774k6564L7481j8455M9195N8134J5569
24766E9493l961j2582n7746l9000j7482j5061P8460K0678j6891j4506o4603n0507
$$ plain form
24754 -133708 -174950 -110776 -85481 -66567 -58096 -23688 -295 -730 42997 12205 -17849 -2058
24742 -2058 59431 -92943 -161711 -93703 -16746 7922 38533 57256 45842 76627 24102 -53852
24730 -53852 -27860 27251 -9009 -73535 -50296 16193 77035 36593 -22813 -51791 -104761 -70399
24718 -70399 -66785 -85635 -58713 -25210 -33271 -81576 -92658 -72546 -116320 -74452 28668 85112
24706 85112 32158 -39621 -95886 -107024 -44115 17338 -23924 -87679 -100074 -11103 30480 14266
24694 14266 -62317 -64034 -27201 4595 -117627 -157789 -105961 -53762 -38331 -78492 -61941 23936
24682 23936 33994 18451 10053 -69397 -130053 -103629 -119432 -137098 -69887 17840 51116 -28985
24670 -28985 -75192 -24132 24715 -15990 -45023 -85107 -134906 -115873 -84768 -32958 -29895 -72786
$$ packed form
24754a33708m1242O4174K5295J8914Q471L4408K3393m35M3727l0792l0054J5791
24742b058O1489j52374o8768O8008P6957K4668L0611J8723j1414L0785n2525p7954
24730e3852K5992N5111l6260o4526K3239O6489O0842m0442n9406k8978n2970L4362
24718g0399L614j8850K6922L3503q061m8305j1082K0112m3774M1868J03120N6444
24706H5112n2954p1779n6265j1138O2909O1453m1262o3755j2395Q8971M1583j6214
24694A4266p6583j717L6833L1796j22222m0162N1828N2199J5431m0161J6551Q5877
24682B3936J0058j5543q398p9450o0656K6424j5803j7666O7211Q7727L3276q0101
24670b8985m6207N1060M8847m0705k9033m0084m9799J9033L1105N1810L063m2891
$$ plain form
24658 -72786 -124474 -144154 -103947 -102115 -91276 -93631 -63989 -139520 -80266 -40825 22235 111485
24646 111485 139758 194678 139290 61289 57324 97955 72379 116863 134880 60691 41543 51989
24634 51989 19062 37032 35077 77419 105815 54810 42333 -22030 16693 -5660 70299 126162
24622 126162 164974 160185 80018 20525 14429 63702 120920 93607 103629 160836 85505 54560
24610 54560 144127 217511 105913 -34048 -18911 -2106 -35179 -31606 -81140 -19819 -63172
24599 -63172 -181790 -169469 -138446 -72918 -26477 4269 -5517 33839 57186 12426 -19664 -7883
24587 -7883 -81493 -73327 -52185 -27745 -43764 -25866 7850 17136 -52564 -110863 -58524 -42591
24575 -42591 8751 106599 77343 101187 115368 53025 12483 -45967 -81431 -62668 -26437 48725
$$ packed form
24658g2786n1688j9680M0207J832J0839k355K9642p5531N9254L9441O3060Q9250
24646A11485K8273N4920n5388p8001l965M0631k5576M4484J8017p4189j9148J0446
24634E1989l2927J7970j955M2342K8396n1005j2477o4363L8723k2353P5959N5863
24622A26162L8812m789q0167n9493o096M9273N7218k7313J0022N7207p5331l0945
24610E4560Q9567P3384j11598j39961J5137J6805l3073L573m9534O1321m3353
24599f3172j18618J2321L1023O5528M6441L0746r786L9356K3347m4760l2090J1781
24587g883p3610Q166K1142K4440j6019J7898L3716R286o9700n8299N2339J5933
24575d2591N1342R7848k9256K3844J4181o2343m0542n8450l5464J8763L6231P5162
$$ plain form
24563 48725 74868 99169 32014 -4070 -34473 -54405 -46886 -43269 -77800 -46870 -84932 -186526
24551 -186526 -188386 -117390 -51203 -2033 35459 -31531 -51038 -73870 -42335 -36965 -13036 -9626
24539 -9626 -66456 -57114 -10802 -120816 -103182 -56707 -66094 -16445 10837 10563 -21214 -63582
24527 -63582 -118858 -196312 -162004 -98892 -66133 -58375 -96090 -113600 -182349 -166229 -109194 -101321
24515 -101321 -84095 -146595 -191857 -146854 -79325 -69514 -7198 10857 14511 67161 87307 75207
24503 75207 130749 198015 98455 -23044 -120803 -94073 -18348 14735 -92077 -109082 -70422
24492 -70422 -66818 -54458 29964 -16102 -51463 -138409 -120998 -152856 -183643 -154863 -110237 -128712
24480 -128712 -101036 -47245 9489 -21493 -39182 -46910 -103911 -65460 -1768 -78851 -112968 -52513
$$ packed form
24563D8725K6143K4301o7155l6084l0403j9932P519L617l4531L0930l8062j01594
24551a86526j860P0996O6187M9170L7492o6990j9507k2832L1535N370K3929L410
24539i626n6830R342M6312j10014J7634M6475r387M9649K7282k74l1777m2368
24527f3582n5276p7454L4308O3112L2759P758l7715j7510o8749J6120N7035P873
24515a01321J7226o2500m5262M5003O7529R811O2316J8055L654N2650K0146j2100
24503G5207N5542O7266r9560j21499r7759K6730P5725L3083j06812j7005L8660
24492g0422L604J2360Q4422m6066l5361q6946J7411l1858l0787K8780M4626j8475
24480a28712K7676N3791N6734l0982j7689p728n7001L8451O3692p7083l4117O0455
$$ plain form
24468 -52513 -37392 -71798 -107457 -99210 -105792 -139847 -165507 -117240 -47207 -18454 -32251 -66973
24456 -66973 -47692 -40494 -64775 -30778 -7652 18787 -27307 -24559 34759 62415 59793 56835
24444 56835 91743 103898 90550 161740 142790 100882 22054 -110768 -133706 -123502 -85232
24433 -85232 -101446 -114165 -51788 -30246 -2269 -6483 17682 58013 74685 94371 32711 -4299
24421 -4299 1087 58686 92376 -20668 -66151 -92025 -123627 -110772 14218 77782 39367 14333
24409 14333 55264 29857 24859 -28732 -56615 43913 41821 -21700 -104902 -135494 -105820 -3120
24397 -3120 71468 90775 81215 118387 90143 96827 82720 -38408 -6794 -7856 -39704 -24079
24385 -24079 47860 136841 67345 23865 23935 -50414 28460 35182 4493 75528 91002 13638
$$ packed form
24468e2513J5121l4406l5659Q247o582l4055k5660M8267P0033K8753j3797l4722
24456f6973J9281P198k4281L3997K3126K6439m6094K748N9318K7656k622k958
24444E6835L4908J2155j3348P1190j8950m1908p8828j32822k2938J0204L8270
24433h5232j6214j2719O2377K1542K7977m214K4165M0331J6672J9686o1660l7010
24421d299N386N7599L3690j13044m5483k5874l1602J2855J24990O3564l8415k5034
24409A4333M0931k5407m998n3591k7883J00528k092o3521q3202l0592K9674J02700
24397c120P4588J9307r560L7172k8244O684j4107j21128L1614j062l1848J5625
24385b4079P1939Q8981o9496m3480P0p4349P8874O722l0689P1035J5474p7364
$$ plain form
24373 13638 -18030 -67193 -118 22214 45901 17314 -68929 -132030 -147823 -132964 -87331 -27201
24361 -27201 -19790 28856 39563 53848 -2459 10658 78302 57219 41754 -15762 -25582 -45856
24349 -45856 -40441 -932 56304 71231 97177 102568 99948 82532 52834 57184 -33714 -43811
24337 -43811 20069 51590 -20637 -53817 -22300 41021 -20288 -63615 -56233 -52026 -39857 -15177
24325 -15177 -43345 -83284 -23083 12055 55200 25551 -14584 -4016 -40817 -8730 -14307 -28090
24313 -28090 -10686 -67844 -83320 -56192 -52086 -40768 -86423 -100127 -79083 -28333 1553 23861
24301 23861 17214 -14490 -60985 -101057 -55994 -27109 -26838 -28506 54908 132426 141787 63609 -13690
24288 -13690 -55708 31632 6667 -27013 -20299 -1086 -1149 63303 133277 126121 43128 -41359 -8036
$$ packed form
24373A3638l1668m9163O7075K2332K3687k8587q6243o3101j5793J4859M5633O0130
24361b7201P411M8646J0707J4285n6307J3117O7644k1083j5465n7516r820k0274
24349d5856N415L9509N7236J4927K5946N391k620j7416k9698M350r0898j0097
24337d3811O3880L1521p2227l3180L1517O3321o1309m3327P382M207J2169K4680
24325a5177k8168l9939O0201L5138M3145k9649m0135J0568l6801L2087n577j3783
24313b8090J7404n7158j5476K7128M106J1318m5655j3704K1044N0750K9886K2308
24301B3861o647l1704m6495m0072M5063K8885K71j668Q3414P7518R361p8178p7299
24288a3690m2018Q7340k4965l3680O714J9213o3O4452O9974p156q2993q4487L3323
$$ plain form
24275 -8036 -14178 -31351 -25971 -64228 -66438 -35897 -16951 -8916 -19509 -33051 -99515 -134673 -53825
24262 -53825 10366 -15862 -67503 -83327 -57044 -50049 -37319 20657 14613 -6183 -46455 -48360
24250 -48360 40216 75788 57890 -458 -142983 -108764 3948 23341 -29069 -37942 32301
24239 32301 83240 -26191 -137188 -92525 -39545 -64446 -17680 -76336 -11105 13666 -15062
24228 -15062 18542 6085 -74916 -35262 24427 -14095 -45958 -20541 10044 6341 -8114 -85980
24216 -85980 -32512 -55272 -114624 -85995 -103972 -148837 -81440 -39066 -64873 -123305 -61571 -23145
24204 -23145 20594 8591 -62234 -77140 -81607 -130482 -65045 -46304 -75044 -76386 -63329 58743
24192 58743 29071 -26402 -105062 -147645 -48711 -10385 -43512 -83535 -48355 -97 -50366 -50417
$$ packed form
24275h036o142j7173N380l8257k210L0541J8946Q035j0593j3542o6464l5158Q0848
24262e3825O4191k6228n1641j5824K6283O995J2730N7976o044k0796m0272j905
24250d8360Q8576L5572j7898n8348j42525L4219J12712J9393n2410q873P0243
24239C2301N0939j09431j10997M4663N2980k4901M6766n8656O5231K4771k8728
24228a5062L3604j2457q1001L9654N9689l8522l1863K5417L0585l703j4455p7866
24216h5980N3468k2760n9352K8629j7977m4865O7397M2374k5807n8432O1734L8426
24204b3145M3739j2003p0825j4906m467m8875O5437J8741k8740j342J3057J22072
24192E8743k9672n5473p8660m2583R8934L8326l3127m0023L5180M8258n0269n1
$$ plain form
24180 -50417 -44201 10705 -26687 -62088 -39516 -43410 -49972 -76720 -63914 12606 47533 -20344
24168 -20344 -72246 -59617 -63867 -91481 -193455 -138914 -88102 -46450 -13910 41933 92474 48166
24156 48166 38591 1746 -106314 -76589 -3599 -11461 -89893 -93758 -111594 -76682 26834 42651
24144 42651 19638 -16133 -113548 -92270 -74301 6234 24257 20794 32764 -10276 -23355 -67222
24132 -67222 -83155 -110408 -115855 -128659 -112075 -157742 -200674 -182385 -97349 -7790 -13837 -1301
24120 -1301 21171 -15785 6730 6073 -25794 -21359 34223 91993 139456 111283 -22528 -91655
24108 -91655 -67673 -11031 14525 39819 71868 117932 98288 42352 105037 41631 -123225
24097 -123225 -131778 -94458 -885 -9161 -23571 -41621 18221 61289 94839 56815 36413 25666
$$ packed form
24180e0417O216N4906l7392l5401K2572l894o562k6748J2806P6520L4927o7877
24168b0344n1902J2629m250k7614j01974N4541N0812M1652L2540N5843N0541m4308
24156D8166r575l6845j08060K9725P2990p862p8432l865j7836L4912J03516J5817
24144D2651k3013l5771r7415K1278J7969Q0535J8023l463J1970m3040j3079m3867
24132f7222j5933k7253n447j2804J6584m5667m2932J8289Q5036Q9559o047J2536
24120a301K2472l6956K2515o57l1867M435N5582N7770M7463k8173j33811o9127
24108i1655K3982N6642K5556K5294L2049M6064j9644n5936O2685o3406j64856
24097a23225q553L7320R3573q276j4410j8050N9842M3068L3550l8024k0402j0747
$$ plain form
24085 25666 18311 -19372 -24178 -19947 -4767 45234 7196 -20041 -114531 -152858 -64090 -36234
24073 -36234 -46671 -82193 -156376 -147624 -90932 -93779 -84210 -90492 -12108 6928 -45462 -40690 -25776
24060 -25776 -30511 -19344 -49606 -35492 -68731 -126813 -45198 45243 35991 25102 31952 46082
24048 46082 4636 40357 32123 -95395 -106554 -131296 -81028 -8508 29284 4875 44843 51878
24036 51878 46314 67164 21227 -39122 -119176 -90856 4454 63379 16314 -81175 -55546 -109062
24024 -109062 -142550 -70161 9231 -7209 -13253 22644 -32960 -75391 -113423 -81700 -6744 -16028
24012 -16028 -92112 -79490 -66181 -25581 -4565 10135 -17318 -7975 10171 -6894 -34176 -106599
24000 -106599 -107911 -115104 -73752 -68207 -41503 -80895 -120284 -134009 -128292 -94012 -68499 -22245
$$ packed form
24085B5666p355l7683m806M231J5180N0001l8038k7237r4490l8327Q8768K7856
24073c6234j0437l5522p4183Q752N6692k847R569o282P8384J9036n2390M772J4914
24060b5776m735J1167l0262J4114l3239n8082Q1615R0441r252j0889O850J4130
24048D6082m1446L5721q234j27518j1159k4742N0268P2520L7792k4409L9968P035
24036E1878n564K0850m5937o0349q0054K8320R5310N8925m7065r7489K5629n3516
24024a09062l3488P2389P9392j6440o044L5897n5604m2431l8032L1723P4956r284
24012a6028p6084J2622J3309M0600K1016J4700k7453R343J8146j7065k7282p2423
24000a06599j312p193M1352N545K6704l9392l9389j3725N717L4280K5513M6254
$$ plain form
23988 -22245 -86701 -74885 -27576 -44312 -67833 -88580 -42058 60231 11520 -112494 -87119
23977 -87119 -109394 -72032 -47714 -99498 -124697 -197157 -184176 -223728 -245305 -232431 -208042 -209224
23965 -209224 -225374 -181456 -110621 -51523 -20403 -14159 -5479 -23796 64467 56495 -4123 6747
23953 6747 13509 13353 23898 33240 48300 25946 17785 68187 51148 53447 19682 -41101 -63465
23940 -63465 -86519 -24522 -12365 17290 28771 45625 29816 -6066 60666 69588 357 -19724
23928 -19724 -46270 -94322 -80840 -76281 -96677 -124800 -89301 -21353 -8857 -9954 -10225 -21454
23916 -21454 -41213 -169 -21427 -50709 12877 107634 122368 38671 13594 30065 -23122 -34940
23904 -34940 -19973 -7571 8841 44689 63920 134552 95423 23754 -30355 -2141 14964 -50452
$$ packed form
23988b2245o4456J1816M7309j6736k3521k0747M6522J02289m8711j24014K5375
23977h7119k2275L7362K4318n1784k5199p2460J2981l9552k1577J2874K4389j182
23965b09224j6150M3918P0835N9098L1120O244Q680j8317Q8263p972o0618J0870
23953F747O762j56J0545R342J5060k2354q161N0402j7039K299l3765o0783k2364
23940f3465k3054O1997J2157K9655J1481J6854j5809l5882O6732Q922o9231k0081
23928a9724k6546m8052J3482M559k0396k8123L5499O7948J2496j097k71j1229
23916b1454j9759M1044k1258k9282O3586R4757J4734q3697k5077J6471n3187j1818
23904c4940J4967J2402J6412L5848J9231P0632l9129p1669n4109K8214J7105o5416
$$ plain form
23892 -50452 -44123 27769 91783 139519 95970 20869 -36622 -18381 -34820 -78840 -59188 -79867
23880 -79867 -1610 51238 26293 -75484 -92593 -103871 -65181 40657 -17180 -148850 -185693
23869 -185693 -161405 -111942 -84171 -132044 -189527 -150418 -93908 -28658 6078 45829 2013
23858 2013 12467 -23897 -158688 -147613 -110981 -53218 -55930 -100269 -68096 -98518 -60105 -61823
23846 -61823 -85270 -84543 -44156 -85076 -106541 -22382 32287 66687 -8898 -101079 -95994 -78580
23834 -78580 -125701 -104277 -45586 8990 -890 -11253 2017 -67007 -94328 -50441 58950 63392
23822 63392 41970 25994 -14127 2356 -19897 -21126 69921 43703 18850 -16617 -26555 6823
23810 6823 -60511 -122429 -57696 -32898 -89850 -54963 -21803 -7847 4977 11550 -73439 -95349
$$ packed form
23892e0452O329P1892O4014M7736m3549p5101n7491J8241j6439m4020J9652k0679
23880g9867P8257N2848k4945j01777j7109j1278L8690J05838n7837j31670l6843
23869a85693K4288M9463K7771m7873n7483L9109N6510O5250L4736L9751m3816
23858B013J0454l6364j34791J1075L6632N7763k712m4339L2173l0422L8413j718
23846f1823k3447P27M0387m0920k1465Q4159N4669L4400p5585r2181N085J7414
23834g8580m7121K1424N8691N4576r880j0363J3270o9024k7321M3887J09391M442
23822F3392k1422j5976m0121J6483k2253j229R1047k6218k4853l5467r938L3378
23810F823o7334o1918O4733K4798n6952L4887L3160J3956J2824O573q4989k1910
$$ plain form
23798 -95349 -77735 -106453 -135737 -173184 -77867 -40746 -75715 -41341 -23081 -59309 -121802 -62861
23786 -62861 -33330 -14495 -57550 -91597 -110774 -204566 -172129 -48403 23692 -85264 -82897
23775 -82897 -36115 -92788 -154828 -92594 -81249 -14496 1307 54172 66418 67607 133426 86432
23763 86432 44619 17882 85181 107544 21895 -29659 13841 46758 64967 75353 46726 19665
23751 19665 111759 138707 154025 138187 147559 78621 33238 3581 -32033 -54919 17224 83279
23739 83279 84402 3769 56452 79315 92019 52554 11374 61868 61402 50737 -12886 -31700
23727 -31700 20361 -33932 -52348 -6927 9267 -27497 -83668 -219249 -237009 -237500 -232180 -135274
23715 -135274 -89318 -127892 -172690 -171495 -81368 -30781 33112 32354 16852 -1319 -31383 -17100
$$ packed form
23798i5349J7614k8718k9284l7447R5317L7121l4969L4374J8260l6228o2493N8941
23786f2861K9531J8835m3055l4047j9177r3792L2437J23726P2095j08956K367
23775h2897M6782n6673o2040O2234J1345O6753J5803N2865J2246J189O5819m6994
23763H6432m1813k6737O7299K2363q5649n1554M3500L2917J8209J0386k8627k7061
23751A9665R2094K6948J5318j5838R372o8938m5383k9657l5614k2886P2143O6055
23739H3279J123q0633N2683K2863J2704l9465m1180N0494m66j0665o3623j8814
23727c1700N2061n4293j8416M5421J6194l6764n6171j35581j7760m91N320R6906
23715a35274M5956l8574m4798J195R0127N0587O3893p58j5502j8171l0064J4283
$$ plain form
23703 -17100 14664 17424 -23055 -46741 -29875 -88175 -88763 -1662 12921 -66278 -26614 2540
23691 2540 51110 115241 103754 -29163 -106054 -159374 -129491 -92880 -91499 -8949 4421 -39293
23679 -39293 -62748 -106304 -129859 -82701 17509 15667 -20822 -45674 7235 101036 142900 39550
23667 39550 -65260 -66252 14379 -27455 -48592 -38275 -102037 -59605 19763 92488 72854 48950
23655 48950 -22954 -67291 -61682 -85198 -99297 -36412 -5270 4185 47156 98248 53334 -5023
23643 -5023 -56459 -52295 -4246 44433 107995 145411 74665 25938 -44635 -2373 -2762 35812
23631 35812 70521 85358 47164 -5458 -26844 13254 20090 -58161 -128865 -154998 -60398 -54290
23619 -54290 -3938 82491 131393 74596 22001 63090 58205 -7459 -57199 -36024 10771 31217
$$ packed form
23703a7100L1764K760m0479k3686J6866n8300n88Q7101J4583p9199L9664K9154
23691B540M8570O4131j1487j32917p6891n3320K9883L6611J381Q2550J3370m3714
23679c9293k3455m3556k3555M7158J00210j842l6489k4852N2909R3801M1864j03350
23667C9550j04810r92Q0631m1834k1137J0317o3762M2432P9368P2725j9634k3904
23655D8950p1904m4337N609k3516j4099O2885L1142R455M2971N1092m4914n8357
23643e023n1436M164M8049M8679O3562L7416p0746m8727p0573M2262l89L8574
23631C5812L4709J4837l8194n2622k1386M0098O836p8251p0704k6133R4600O108
23619e4290N0352Q6429M8902n6797n2595M1089m885o5664m9740K1175M6795K0446
$$ plain form
23607 31217 4102 -4692 -25146 -128210 -154882 -144119 -107946 -10046 8932 13766 12994 -39887
23595 -39887 -55196 -8887 -24897 -11300 -23451 -92301 -118700 -112053 -81718 -24371 21363 -5993
23583 -5993 -32240 -18286 -89461 -79919 -35053 -8131 -42148 -7549 -39235 -20981 1663 1104
23571 1104 -8710 -24383 -17679 24885 35044 31020 42779 55360 56090 37159 76685 116935 157237
23558 157237 111189 61581 60333 38517 88271 94660 79830 94912 66674 93092 96126 64621
23546 64621 9639 -44238 -66351 -125490 -98168 -80481 -101631 -46538 -98924 -85858 -26971 13997
23534 13997 -37518 -49545 -114968 -197765 -156456 -126234 -64766 15801 93796 31501 -45088 -39926
23522 -39926 -4118 69796 73265 17245 -28049 16730 84319 81332 -1176 -107267 -151090 -114516
$$ packed form
23607C1217k7115q794k0454j03064k6672J0763L6173R7900J8978M834p72n2881
23595c9887j5309M6309j6010J3597j2151o8850k6399O647L0335N7347M5734k7356
23583e993k6247J3954p1175R542M4866K6922l4017L4599l1686J8254K2644n59
23571A104r814j5673O704M2564J0159m024J1759J2581P30j8931L9526M0250M0302
23558A57237m6048m9608j248k1816M9754O389j4830J5082k8238K6418L034l1505
23546F4621n4982n3877k2113n9139K7322J7687k1150N5093n2386J3066N8887M0968
23534A3997n1515j2027o5423q2797M1309L0222O1468Q0567P7995o2295p6589N162
23522c9926L5808P3914L469n6020m5294M4779O7589k987q2508j06091m3823L6574
$$ plain form
23510 -114516 -74033 -61544 -59963 -58547 -106431 -98026 -100268 -116820 -44257 -15736 -1926 15061
23498 15061 26046 12252 -24137 -7638 7182 -13440 -17641 83983 113978 1230 6034 -29563
23486 -29563 -91716 -173935 -161725 -152620 -125066 -107083 -81470 -92111 -73308 -58087 -47562 4575
23474 4575 11236 70897 99088 -19246 -120548 -201602 -148720 -49392 32445 -15937 -54016 -29499
23462 -29499 23714 4369 -64585 -72153 -58964 -38177 -110230 -176395 -76198 28505 67119
23451 67119 22322 -9286 -72345 -82275 -101526 -114822 -99250 -29413 48896 46870 78410 62339
23439 62339 110843 113962 114396 109507 39355 49832 97685 190337 199181 95657 41346 -26392
23427 -26392 6714 41448 66 52312 12102 -38183 -76782 2375 64143 90247 72546 59013
$$ packed form
23510a14516M0483J2489J581J416m7884Q405k242j6552P2563K8521J3810J6987
23498A5061J0985j3794l6389J6499J4820k0622m201J01624K9995j12748M804l5597
23486b9563o2153q2219J2210R105K7554J7983K5613j0641J8803J5221J0525N2137
23474D575O661N9661K8191j18334j01302q1054N2882R9328Q1837m8382l8079K4517
23462b9499N3213j9345o8954p568J3189K0787p2053o6165J00197J04703L8614
23451F7119m4797l1608o3059r930j9251j3296J5572O9837P8309k026L1540j6071
23439F2339M8504L119M34m889p0152J0477M7853R2652Q844j03524n4311o7738
23427b6392L3106L4734m1382N2246m0210n0285l8599P9157O1768K6104j7701j3533
$$ plain form
23415 59013 1863 -42465 -44783 -92383 -108369 -68277 -69241 -37852 33632 29736 11692 -56988
23403 -56988 -49011 -56655 -58571 -91921 -54377 5251 30899 1475 -23630 21479 39565 38770 61810
23390 61810 757 -67828 -99975 -22559 23592 61673 54096 30278 33224 52960 6665 37662
23378 37662 51228 61564 29425 32833 62230 79637 112294 68272 46357 56898 50576 66428
23366 66428 25001 -49703 -93044 -94504 -52885 -12752 48336 64236 -5058 -8775 74735 117873
23354 117873 18903 20240 21267 23158 44161 50687 37478 4263 -88094 -153794 -135061 -92207
23342 -92207 -83064 -32529 55439 77081 5990 -124188 -120495 -103258 -128710 -67955 15468 -50238
23330 -50238 34444 78443 85208 80281 32844 113422 199724 198690 160483 86224 29183 -21528
$$ packed form
23415E9013n7150m4328k318m7600j5986M0092r64L1389P1484l896j8044o8680
23403e6988P977p644j916l3350L7544N9628K5648k9424k5105M5109J8086p95K3040
23390F1810o1053o8585l2147P7416M6151L8081p577k3818K946J9736m6295L0997
23378C7662J3566J0336l2139L408K9397J7407L2657m4022k1915J0541o322J5852
23366F6428m1427p4704m3341j460M1619M0133O1088J5900o9294l717Q3510M3138
23354A17873r8970J337J027J891K1003O526j3209l3215r2357o5700J8733M2854
23342i2207R143N0535Q7968K1642p1091j30178L693J7237k5452O0755Q3423o5706
23330e0238Q4682M3999O765m927m7437Q0578Q6302j034l8207p4259n7041n0711
$$ plain form
23318 -21528 3019 -8100 -747 45983 94473 43621 -45628 -84491 -99169 -74073 -36786 9660
23306 9660 -32857 -18590 -2845 11194 -3619 -102333 -147837 -143260 -65953 26828 21203 48798
23294 48798 43747 38573 82515 129692 59723 17105 -9870 -26976 19414 37630 27723 -43903
23282 -43903 -50141 -91957 -5117 84007 89177 57076 77127 37503 -76826 -81001 -64069 32807
23270 32807 72299 61610 61232 -7292 -52086 -119020 -50648 -18047 16039 -8013 -6345 -20943
23258 -20943 -56268 1476 -1287 15893 -1587 6273 76416 131701 110529 81687 61591 4688
23246 4688 -13824 40502 61421 1883 36094 -25986 -129158 -25248 35007 46078 7521
23235 7521 -24489 -42961 -1702 51434 25003 3626 46991 68386 20588 -22596 2126 16018
$$ packed form
23318b1528K4547j1119P353M6730M8490n0852q9249l8863j4678K5096L7287M6446
23306I660m2517J4267J5745J4039j4813r8714m5504M577P7307R2781n625K7595
23294D8798n051n174M3942M7177o9969m2618k6975j7106M6390J8216r907p1626
23282d3903o238m1816Q6840Q9124N170l2101K0051l9624j14329m175J6932R6876
23270C2807L9492j0689l78o8524m4794o6934O8372L2601L4086k4052J668j4598
23258b0943l5325N7744k763J7180j7480P860P0143N5285k1172k8842k0096n6903
23246D688j8512N4326K0919n9538L4211o2080j03172J03910O0255J1071l8557
23235G521l2010j8472M1259N3136k6431k1377M3365K1395m7798m3184K4722J3892
$$ plain form
23223 16018 -91530 -119865 -66204 8196 126478 137796 46978 -50553 -40555 20822 27540 18205
23211 18205 2542 -15454 -7343 3329 45550 -5726 -48312 -35761 -8396 -16678 -49506 -89791
23199 -89791 -100481 -94552 -92355 -112315 -117779 -126565 -112051 -57203 -10541 9623 11458 -29308 -60677
23186 -60677 -124230 -69243 -55747 -37915 -47264 1056 82075 68877 -38495 -42150 -5171 -101683
23174 -101683 -149867 -155323 -53922 -6842 -49050 -105461 -72860 16675 62762 89781 45998
23163 45998 40738 10082 -24325 -75144 -62013 -29059 32648 112641 101547 54794 20885 9575
23151 9575 -27685 -79249 -77050 10483 38839 24286 34480 4919 12629 41477 18712 3224
23139 3224 -9509 -27761 -57043 -93852 -111278 -104700 -150456 -175763 -110827 -74225 -109190 -111709
$$ packed form
23223A6018j07548k8335N3661P4400J18282J1318r0818r7531R998O1377O718r335
23211A8205j5663j7996Q111J0672M2221n1276m2586J2551K7365q282l2828m0285
23199h9791j0690N929K197j9960n464q786J4514N4848M6662K0164J835m0766l1369
23186f0677o3553N4987J3496J7832r349M8320Q1019j3198j07372l655L6979r6512
23174a01683m8184n456J01401M7080m2208n6411L2601Q9535M6087K7019m3783
23163D5998n260l0656l4407n0819J3131L2954O1707P9993j1094m6753l3909j1310
23151I575l7260n1564K199Q7533K8356j4553J0194k9561P710K8848k2765j5488
23139C224j2733j8252k9282l6809j7426O578m5756k5307O4936L6602l4965k519
$$ plain form
23127 -111709 -43752 -38218 -5702 3146 3483 -20944 -22899 -28751 -43687 -1529 25879 4444 -39283
23114 -39283 -25182 -37388 -43849 -41966 -24941 21761 7212 -93622 -128868 -101087 -23044 34459
23102 34459 29064 11243 -35229 -68163 -60730 -51917 -34308 -10630 -7522 -33945 -99291 -66511
23090 -66511 -14630 -32493 -45016 11795 14809 -47292 -30365 -4080 763 26101 -37872 -133476
23078 -133476 -167837 -80394 -1096 -6363 -67896 -76245 1172 39605 -64155 -53484 -13028 -49368
23066 -49368 -40593 17841 -18498 -76195 -63438 -31792 -39376 -94010 -65649 -33738 -59079 18639
23054 18639 96278 30480 -32916 10612 314 -30237 -15920 62010 79220 11994 -55112 -66417
23042 -66417 -56918 -42513 -98915 -108972 -25514 3322 -39727 6081 69201 80519 56872 26122
$$ packed form
23127a11709O7957N534L2516Q848L37k4427j955n852j4936M2158K7408k1435m3727
23114c9283J4101j2206o461J883J7025M6702j4549j00834l5246K7781P8043N7503
23102C4459n395j7821m6472l2934P433Q813J7609K3678L108k6423o5346L2780
23090f6511N1881j7863j2523N6811L014o2101J6927K6285M843K5338o3973r5604
23078a33476l4361Q7443P9298n267o1533q349P7417L8433j03760J0671M0456l6340
23066d9368Q775N8434l6339n7697J2757L1646p584n4634K8361L1911k5341P7718
23054A8639P7639o5798o3396M3528j0298l0551J4317P7930J7210o7226o7106j1305
23042f6417R499J4405n6402j0057Q3458K8836m3049M5808O3120J1318k3647l0750
$$ plain form
23030 26122 617 16119 49770 73113 67212 15711 -48825 -103393 -103819 -70373 -72863 -26242
23018 -26242 -19926 2989 -29166 12340 46138 -8480 22988 -3177 -60919 -104945 -133651 -95666
23006 -95666 -88196 -43825 -36203 -91896 -144957 -93785 -35497 -24513 -5408 61846 47197 59432
22994 59432 28584 44266 47147 55053 39533 -51575 -117240 -123026 -107171 -58745 -35584 9790
22982 9790 10206 40705 -5034 -87410 -89433 -69881 -52520 2900 -46787 -78190 -39783 -61477
22970 -61477 -76706 -9669 -29743 -53587 -75501 -40849 29101 67207 102737 82422 39638 22317
22958 22317 73883 103851 69693 43195 74172 5046 -82942 -44954 -54465 -34062 -13826 -4646
22946 -4646 -19921 -28890 3587 3052 12076 72760 -21189 -41725 -29954 -48295 -76350 -74230 10828
$$ packed form
23030B6122k5505J5502L3651K3343n901n1501o4536n4568m26L3446k490M6621
23018b6242O316K2915l2155M1506L3798n4618L1468k6165n7742m4026k8706L7985
23006i5666P470M4371P622n5693n3061N1172N8288J0984J9105O7254j4649J2235
22994E9432l0848J5682K881P906j5520r1108o5665n786J5855M8426K3161M5374
22982I790M16L0499m5739q2376k023J9552J7361N5420m9687l1403L8407k1694
22970f1477j5229O7037k0074k3844k1914L4652O9950L8106L5530k0315m2784j7321
22958B2317N1566K9968l4158k6498L0977o9126q7988L7988r511K0403K0236R180
22946d646j5275q969L2477n35R024O0684r3949k0536J1771j8341k8055K120Q5058
$$ plain form
22933 10828 27683 -10513 -12306 -67422 -118479 -160886 -158276 -101597 -161672 -159439 -151114 -81631
22921 -81631 -40419 -75417 -51615 -49221 10431 527 -6162 24211 60407 48280 -46218 -86605
22909 -86605 9467 49759 60142 34342 -43750 -73036 -39128 -11726 21119 -15941 -52746 -71877
22897 -71877 -93567 -59906 -61476 -154612 -152868 -154029 -216112 -224734 -151461 -60157 -5618 13212
22885 13212 -35577 -43682 -53323 -31359 -83089 -59733 47928 -22412 -83959 -115553 -129282 -86744
22873 -86744 -82465 -14003 -9868 -58420 -57880 -105902 -104541 -26147 34183 -17430 -28451 -6835 -1302
22860 -1302 -5351 20030 -11839 -85719 -91944 -81097 -117968 -109572 -94194 -97035 -86253 -38399 4647
22847 4647 7551 -30235 -22060 35081 23636 -15387 -17120 -36777 -40050 -69319 -49783 -19809 -65286
$$ packed form
22933A0828J6855l8196j793n5116n1057m2407K610N6679o0075K233Q325O9483
22921h1631M1212l4998K3802K394N9652r904o689L0373L6196j2127r4498m0387
22909h6605R6072M0292J0383k5800p8092k9286L3908K7402L2845l7060l6805j9131
22897g1877k1690L3661j570r3136J744j161o2083q622P3273R1304N4539J8830
22885A3212m8789q105r641K1964n1730K3356J07661p0340o1547l1594j3729M2538
22873h6744M279O8462M135m8552N40m8022J361P8394O0330n1613j1021K1616N533
22860a302m049K5381l1869p3880o225J0847l6871Q396J5378k841J0782M7854M3046
22847D647K904l7786Q175N7141j1445l9023j733j9657l273k9269J9536K9974m5477
$$ plain form
22834 -65286 -67570 -40028 -40045 -59371 -50812 11767 26843 14284 -5165 45501 25261 -43416 -57894
22821 -57894 -50800 14742 -10627 3958 10159 69573 -4442 -98894 -127223 -145675 -143434 -127594
22809 -127594 -97221 -43442 -65116 -47432 -3421 40669 -11676 4229 1685 18605 10565 -32830
22797 -32830 55088 12514 -7011 -71200 -103687 -34539 7868 -61012 -36339 34718 39273 82742
22785 82742 52244 46694 36297 -22295 9150 86685 117158 84280 106820 171774 130175 52501
22773 52501 4585 -46823 -9675 29648 75437 81009 55977 69007 87424 57771 -31788 2670
22761 2670 -31064 -36325 -8749 115213 151562 129777 10605 -401 48452 106724 76760 939
22749 939 470 -78813 -98695 -40917 -95575 -181430 -143876 -71642 -87058 -90529 -50438 -5316 -67585
$$ packed form
22834f5286k284K7542j7j9326Q559O2579J5076j2559j9449N0666k0240o8677j4478
22821e7894P094O5542k5369J4585O201N9414p4015r4452k8329j8452K241J5840
22809a27594L0373N3779k1674J7684M4011M4090n2345J5905k544J6920q040m3395
22797c2830Q7918m2574j9525o4189l2487O9148M2407o8880K4673P1057M555M3469
22785H2742l0498n550j0397n8592L1445P7535L0473l2878K2540O4954m1599p7674
22773E2501m7916n1408L7148L9323M5789N572k5032J3030J8417k9653q9559L4458
22761B670l3734n261K7576J23962L6349k1785j19172j1006M8853N8272k9964p5821
22749I39m69p9283j9882N7778n4658q5855L7554P2234j5416l471M0091M5122o2269
$$ plain form
22736 -67585 -76699 -19955 -54116 9892 42199 34109 52037 31995 -4078 -19217 -37097 -72003
22724 -72003 -90063 -99183 -115381 -85729 -29950 -75679 -87454 -69231 62574 54149 -47377 -117656
22712 -117656 -95208 -60655 24962 62326 38920 62412 107362 88908 26489 -136657 -142576
22701 -142576 -86508 -90101 -133356 -61812 27565 5693 -22604 49218 59426 43673 -48837 -28759
22689 -28759 -33572 -23975 -202 2121 32602 81654 123593 150030 72364 -12252 4585 98878
22677 98878 144672 186725 116598 81057 33246 20591 28971 74947 8853 -64888 -45845 16733
22665 16733 111580 122479 101605 90627 2136 -56625 -13793 62598 149877 132011 41076 26664
22653 26664 8589 -24138 58308 106081 85905 64826 47436 -5095 -2161 61913 64223 25353
$$ packed form
22736f7585r114N6744l4161O4008L2307q090J7928k0042l6073j5139j7880l4906
22724g2003j8060r120j6198K9652N5779m5729j1775J8223J31805q425j01526p0279
22712a17656K2448L4553Q5617L7364k3406K3492M4950j8454o2419j63146n919
22701a42576N6068l593m3255P1544Q9377k1872k8297P1822J0208j5753r2510K0078
22689b8759m813R597K3773K323L0481M9052M1939K6437p7666q4616J6837R4293
22677I8878M5794M2053p0127l5541m7811j2655Q380M5976o6094p3741J9043O2578
22665A6733R4847J0899k0874j0978q8491n8761M2832P6391Q7279j7866r0935j4412
22653B6664j8075l2727Q2446M7773k0176k1079j7390n2531K934O4074K310l8870
$$ plain form
22641 25353 -10268 23562 5067 29027 38370 -48323 -28134 -34676 -133402 -113170 -57221 -79959
22629 -79959 -48121 -12525 -28234 21103 33207 82859 39925 32275 68607 108023 43889 46795
22617 46795 60121 94959 80184 -10020 -100852 -75253 -31909 -54738 -58945 -16822 -36884 -124412
22605 -124412 -81621 -74987 -78493 -55847 22959 67951 85292 94326 69938 46186 -18687 -25439
22593 -25439 94254 42701 8105 55120 32173 21250 79511 69167 65446 83591 46370 109887
22581 109887 159391 197120 190379 253870 311523 464528 749402 995156 1286013 1463018 1541490
22570 1541490 1732582 1873575 1906297 1780078 1572906 1383131 1190927 973572 799705 641423
22560 641423 487297 386886 362915 269947 251560 174938 207005 254916 262305 194254 75212
$$ packed form
22641B5353l5621L3830j8495K3960R343q6693K0189o542r8726K0232N5949k2738
22629g9959L1838L5596j5709M9337J2104M9652m2934p650L6332L9416o4134K906
22617D6795J3326L4838j4775r0204r0832K5599M3344k2829m207M2123k0062q7528
22605a24412M2791O634l506K2646P8806M4992J7341R034k4388k3752o4873o752
22593b5439J19693n1553l4596M7015k2947j0923N8261j0344l721J8145l7221O3517
22581A09887M9504L7729o741O3491N7653J53005K84874K45754K90857J77005P8472
22570A541490J91092J40993L2722j26219k07172j89775j92204k17355j73867j58282
22560F41423j54126j00411k3971r2968j8387p6622L2067M7911P389o8051j19042
$$ plain form
22549 75212 -31 33511 18666 -13650 48742 99418 132533 91189 135336 142346 132359 126605
22537 126605 163747 185617 159532 241497 265364 316701 177297 55980 31433 124972 172092
22526 172092 88611 32474 28791 -14664 -14615 43177 39499 49898 25517 46041 90523 146431
22514 146431 122624 122114 149803 126640 71273 42582 24737 82428 93807 99807 188386 255691
22502 255691 261763 167937 145337 218128 366258 638584 785348 736416 768761 765831 767336
22491 767336 715464 589480 459474 414585 400818 309706 228821 180889 91986 76704 147062
22480 147062 197636 235959 195942 167096 159222 144260 170350 159901 137818 206953 251312 174027
22468 174027 147389 156213 137253 25353 18265 116822 108594 35753 149812 182147 184732 254991
$$ packed form
22549G5212p5243L3542j4845l2316O2392N0676L3115m1344M4147P010r987n754
22537A26605L7142K1870k6085Q1965K3867N1337j39404j21317k4547R3539M7120
22526A72092q3481n6137l683m3455M9N7792l678J0399k4381K0524M4482N5908
22514A46431k3807n10K7689k3163n5367k8691j7845N7691J1379O000Q8579O7305
22502B55691O072r3826k2600P2791J48130K72326J46764m8932L2345k930J505
22491G67336n1872j25984j30006m4889j3767r1112q0885m7932q8903j5282P0358
22480A47062N0574L8323m0017k8846p874j4962K6090j0449k2083O9135M4359p7285
22468A74027k6638Q824j8960j11900p088R8557q228p2841J14059L2335K585P0259
$$ plain form
22456 254991 334874 311603 260504 233033 190476 272304 354620 356992 381183 437967 383562 356349
22444 356349 447399 611221 718562 873999 1075637 1369966 1692013 2224446 2974211 3920098
22434 3920098 4875585 5720564 6215334 6498894 6525487 6122662 5217918 4203992 3406508
22425 3406508 2717818 2157780 1745235 1449791 1225303 1077622 928306 782528 724166 734238
22415 734238 653015 588983 535087 471997 419591 468984 435408 389497 381611 370355 365585 405932
22403 405932 441631 465752 439763 449561 428192 372211 273183 202515 254537 300241 327731 311753
22391 311753 347426 335530 344003 360972 323909 278912 299891 257553 220232 185325 231848 310383
22379 310383 264329 176369 28722 47966 48265 93398 130360 158346 186011 239392 260180 267289
$$ packed form
22456B54991P9883k3271n1099k7471m2557Q1828Q2316K372K4191N6784n4405k7213
22444C56349R1050J63822J07341J55437K01638K94329L22047N32433P49765R45887
22434C920098R55487Q44979M94770K83560K6593m02825r04744j013926p97484
22425C406508o88690n60038m12545k95444k24488j47681j49316j45778n8362J0072
22415G34238q1223o4032n3896o3090n2406M9393l3576m5911p886j1256m770M0347
22403D05932L5699K4121k5989R798k1369n5981r9028p0668N2022M5704K7490j5978
22391C11753L5673j1896Q473J6969l7063m4997K0979m2338l7321l4907M6523P8535
22379C10383m6054q7960j47647J9244K99M5133L6962K7986K7665N3381K0788P109
$$ plain form
22367 267289 208329 166925 123394 43585 30909 162861 216887 240976 163134 95691 62147
22356 62147 112695 219310 138248 80647 28342 88231 144808 127097 128858 53563 -22049 47894
22344 47894 55566 78321 82030 91157 135631 163596 182650 169883 107266 70772 68731 37721
22332 37721 73534 42902 -5857 -17220 31336 129380 93331 80140 41483 43991 44007 56657
22320 56657 27515 46811 70149 79131 160258 93567 63512 104912 126267 66590 101051 171908
22308 171908 180482 148996 147987 150495 97056 110547 110726 92927 73510 87938 147050 220885
22296 220885 197331 182344 238339 337539 320900 368135 410887 398925 427619 481506 492310
22285 492310 411805 361028 354752 346061 290546 269680 233303 161537 146889 170789 205133 222506
$$ packed form
22367B67289n8960m1404m3531p9809j2676J31952N4026K4089p7842o7443l3544
22356F2147N0548J06615q1062n7601n2305N9889N6577j7711J761p5295p5612O9943
22344D7894P672K2755L709R127M4474K7965J9054j2767o2617l6494k041l1010
22332C7721L5813l0632m8759j1363M8556R8044l6049j3191l8657K508J6J2650
22320E6657k9142J9296K3338Q982Q1127o6691l0055M1400K1355n9677L4461P0857
22308A71908Q574l1486j009K508n3439J3491J79j7799j9417J4428N9112P3835
22296B20885k3554j4987N5995R9200j6639M7235M2752j1962K8694N3887J0804
22285D92310q0505n0777o276q691n5515k0866l6377p1766j4648K3900L4344J7373
$$ plain form
22273 222506 193930 209746 216584 234646 238870 182155 130706 113548 107179 99710 100417 170095 137571
22260 137571 151866 116321 63038 94506 149397 155419 160459 149733 79918 34894 103991 83589
22248 83589 123101 164759 127732 106772 81956 51894 26833 62663 43326 77826 115466 139410
22236 139410 80018 133357 201465 173571 130567 69093 22993 1329 16457 19018 50971 61413
22224 61413 127331 120588 130206 185090 135766 194600 231999 304030 266082 226310 206020 192155
22212 192155 252234 244240 212276 203372 94965 1838 10607 67038 119045 57147 56832 187536
22200 187536 252734 201304 263069 260416 139519 133148 136355 147119 202788 251290 263187 325201
22188 325201 324080 205307 174890 197572 222899 276379 240357 162790 207850 259099 307043
$$ packed form
22273B22506k8576J5816O838J8062M224n6715n1449j7158o369p469P07O9678l2524
22260A37571J4295l5545n3283L1468N4891O022N040j0726o9815m5024O9097k0402
22248H3589L9512M1658l7027k0960k4816l0062k5061L5830j9337L4500L7640K3944
22236A39410n9392N3339O8108k7894m3004o1474m6100k1664J5128K561L1953J0442
22224F1413O5918o743R618N4884m9324N8834L7399P2031l7948l9772k0290j3865
22212A92155O0079p994l1964q904j08407r3127Q769N6431N2007o1898l15J30704
22200A87536O5198n1430O1765k653j20897o371L207J0764N5669M8502J1897O2014
22188C25201j121j18773l0417K2682K5327N3480l6022p7567M5060N1249M7944
$$ plain form
22177 307043 269811 246958 293850 293787 347402 325524 279277 278583 327920 413638 433719 452595
22165 452595 507323 526333 539045 539439 518433 498647 568170 559415 479662 460666 505986 477786
22153 477786 445837 429961 387334 412890 431178 471474 439575 359640 336513 322742 325392 324728
22141 324728 355444 386529 419643 472153 449492 426797 450284 540587 565834 568868 554360 553018
22129 553018 587324 620582 689669 812438 849411 833940 835265 957864 1001029 1083639 1179221
22118 1179221 1309630 1320757 1318809 1426800 1517874 1610526 1756494 2001783 2216871 2441316
22108 2441316 2619860 2734408 2890049 2975032 2943427 2799604 2630764 2383555 2166457 2058594
22098 2058594 2015361 1942810 1815407 1738511 1759428 1884823 1982603 2023857 2027647 2033858 2074891
$$ packed form
22177C07043l7232k2853M6892o3N3615k1878m6247o94M9337Q5718K0081J8876
22165D52595N4728J9010J2712L94k1006j9786O9523q755p9753j8996M5320k8200
22153D77786l1949j5876m2627K5556J8288M0296l1899p9935k3127j3771K650o64
22141C24728L0716L1085L3114N2510k2661k2695K3487R0303K5247L034j4508j342
22129E53018L4306L3258O9087J22769L6973j5471J325J22599M3165Q2610R5582
22118A179221J30409J1127j948J07991R1074R2652J45968K45289K15088K24445
22108B441316J78544J14548J55641Q4983l1605j43823j68840k47209k17098j07863
22098B058594m3233p2551j27403p6896K0917J25395R7780M1254L790O211M1033
$$ plain form
22087 2074891 2112471 2039964 1956084 1953879 1994558 2028557 2016202 2018837 2114222 2224147 2303043
22076 2303043 2359189 2426488 2530825 2573832 2707858 2873359 3021639 3097353 3200208 3312659
22066 3312659 3350260 3448440 3645631 3808851 4036410 4242343 4582121 4939063 5250906 5688159
22056 5688159 6250544 6869085 7559156 8299207 9270972 10484625 11903187 13768211 16221057
22047 16221057 19184355 22957619 27973006 34782294 44045488 56676482 74256476 98786573
22039 98786573 132933311 177457751 227526371 273000779 306232568 327108907 338881197
22032 338881197 340405131 326744646 295936640 253728228 208667775 167054307 131527397
22025 131527397 103430686 82623206 67812668 57204433 49325327 43275184 38466366
$$ packed form
22087B074891L7580p2507q3880k205M0679L3999j2355K635R5385J09925P8896
22076B303043N6146O7299J04337M3007J34026J65501J48280P5714J02855J12451
22066C312659L7601R8180J97191J63220K27559K05933L39778L56942L11843M37253
22056E688159N62385O18541O90071P40051R71765J213653J418562J865024K452846
22047A6221057K963298L773264N015387O809288R263194J2630994J7579994K4530097
22039I8786573L4146738M4524440N0068620M5474408L3231789K0876339J1772290
22032C38881197J523934j3660485l0808006m2208412m5060453m1613468l5526910
22025A31527397k8096711k0807480j4810538j0608235p879106o050143m808818
$$ plain form
22018 38466366 34604470 31462169 28940961 26883566 25185990 23855555 22744253 21674252
22010 21674252 20734031 19958420 19265906 18696363 18229693 17836109 17487533 17237567 17056761
22001 17056761 17016038 16919189 16895884 16993646 16993250 16856709 16701395 16443801 16135531 15746605
21991 15746605 15066063 14368297 13714135 12990009 12286493 11499588 10862371 10312135 9784574
21982 9784574 9258833 8734562 8241530 7775667 7437844 7138396 6803645 6449801 6132292
21973 6132292 5737744 5469927 5237492 4910910 4599880 4393321 4310737 4265306 4252267 4337668
21963 4337668 4448942 4572450 4707718 4783213 4713789 4638546 4509494 4268756 4007389 3663800
21953 3663800 3231711 2912366 2618630 2336152 2091076 1932244 1853482 1883280 1773889 1667213
$$ packed form
22018C8466366l861896l142301k521208k057395j697576j330435j111302j070001
22010B1674252r40221p75611o92514n69543m66670l93584l48576k49966j80806
22001A7056761m0723r6849k3305R7762l96j36541j55314k57594l08270l88926
21991A5746605o80542o97766o54162p24126p03516p86905o37217n50236n27561
21982I784574n25741n24271m93032m65863l37823k99448l34751l53844l17509
21973F132292l94548k67817k32435l26582l11030k06559q2584m5431j3039Q5401
21963D337668J11274J23508J35268P5495o9424p5243j29052k40738k61367l43589
21953C663800m32089l19345k93736k82478k45076j58832p8762K9798j09391j06676
$$ plain form
21943 1667213 1553714 1370057 1286440 1263281 1214722 1169359 1110901 1051402 1088767 1152546 1134990
21932 1134990 1045644 982425 904170 860733 864529 793417 759450 716108 695221 689605 677552 611153
21920 611153 586469 657601 586359 574876 684568 813572 788722 766987 817962 923827 955998
21909 955998 984654 961830 914986 832131 837565 797245 734384 599794 505854 440497 472689
21898 472689 539647 518836 362833 210168 197034 303654 268752 268541 281722 203880 179561
21887 179561 199040 136449 71394 61205 93948 87196 90184 81447 100431 141369 188866 174488
21875 174488 117130 117650 111685 136922 121621 203047 269396 289234 247525 309563 276202 262555
21863 262555 243693 209159 200206 212423 255919 330189 328430 332563 350666 368850 313303 264332
$$ packed form
21943A667213j13499j83657q3617k3159m8559m5363n8458n9499L7365O3779j7556
21932A134990q9346o3219p8255m3437L796p1112l3967m3342k0887n616j2053o6399
21920F11153k4684P1132p1242j1483J09692J29004k4850k1735N0975J05865L2171
21909I55998K8656k2824m6844q2855N434m0320o2861j34590r3940o5357L2192
21898D72689O6958k0811j56003j52665j3134J06620l4902k11J3181p7842k4319
21887A79561J9479o2591o5055j0189L2743o752K988q737J8984M0938M7497j4378
21875A74488n7358N20n965K5237j5301Q1426O6349J9838m1709O2038l3361j3647
21863B62555j8862l4534q953J2217M3496P4270j759M133J8103J8184n5547m8971
$$ plain form
21851 264332 326312 313603 273133 259434 215835 157031 278454 331845 326236 351538 364212
21840 364212 319126 299085 265240 288370 320437 327741 334171 337715 344013 371805 369410 342420
21828 342420 297342 355647 404911 413278 399394 358976 256804 109336 171645 255711 315986
21817 315986 342228 241020 217474 199188 131765 147838 208142 173910 193905 188116 257342
21806 257342 199528 154036 146484 145654 136347 43911 23158 1227 49586 158872 150259 133932
21794 133932 110450 85745 61714 157872 227218 265057 228585 157805 77559 59601 99227
21783 99227 122829 139201 157108 191980 171406 95172 80424 84138 35579 14358 4115 29860
21771 29860 31718 -20270 -56246 54738 87778 95595 86726 71956 14362 -46863 -5240 -11527
$$ packed form
21851B64332O1980j2709m0470j3699m3599n8804J21423N3391n609K5302J2674
21840C64212m5086k0041l3845K3130L2067P304O430L544O298K7792k395k6990
21828C42420m5078N8305M9264Q367j3884m0418j02172j47468O2309Q4066O0275
21817C15986K6242j01208k3546j8286o7423J6073O0304l4232J9995n789O9226
21806B57342n7814m5492p552q30r307r2436k0753k1931M8359J09286q613j6327
21794A33932k3482k4705k4031R6158O9346L7839l6472p0780q0246j7958L9626
21783I9227K3602J6372J7907L4872k0574p6234j4748L714m8559k1221j0243K5745
21771B9860J858n1988l5976J10984L3040P817q869j4770n7594o1225M1623o287
$$ plain form
21759 -11527 -76110 -46369 67927 106291 104756 89820 104193 44218 1792 38611 -8226 12777
21747 12777 -28139 -30228 -55215 -14434 66945 93466 -16953 -27567 -70514 -77263 -50006 -72883
21735 -72883 -115560 -102124 -77959 -67320 18199 13563 -6321 -59191 -16964 22378 63426 26641
21723 26641 48043 75390 160549 124144 92858 29399 -96 -8969 -10553 -9489 28143 7896
21711 7896 2818 48684 51173 31147 41303 -38177 -78956 -51844 -49367 -32970 34176 42539 88810
21698 88810 86780 120372 210936 254317 228173 153524 152907 231942 156352 113794 143258 205814
21686 205814 121565 139338 145625 89748 125656 113620 73510 61513 77496 -625 79374 211081
21674 211081 169255 140433 95725 -5442 -25476 11923 57652 120035 172019 90503 74682
$$ packed form
21759a1527o4583K9741J14296L8364j535j4936J4373n9975m2426L6819m6837K1003
21747A2777m0916k089k4987M0781Q1379K6521j10419j0614m2947o749K7257k2877
21735g2883m2677J3436K4165J0639Q5519m636j9884n2870M2227L9342M1048l6785
21723B6641K1402K7347Q5159l6405l1286o3459k9495q873j584J064L7632k0247
21711G896n078M5866K489k0026J0156p9480m0779K7112K477J6397O7146Q363M6271
21698H8810k030L3592R0564M3381k6144p4649o17P9035p5590m2558K9464O2556
21686B05814q4249J7773O287n5877L5908j2036m0110j1997J5983p8121P9999J31707
21674B11081m1826k8822m4708j01167k0034L7399M5729O2383N1984q1516j5821
$$ plain form
21663 74682 81324 113238 88243 45142 -18060 -9770 -35004 4318 42783 -36161 -67267 13979
21651 13979 58745 43478 77823 72677 11165 -44663 -49049 -76959 -33383 15736 -10135 -63363
21639 -63363 -77759 -23286 -24153 31050 99079 127570 65225 73427 71034 -25771 -62263 -72590
21627 -72590 -90653 -90085 -82392 -55638 9864 -15741 -8873 11542 7856 22377 -39633 -88145 -85799
21614 -85799 -111913 -142209 -156949 -166455 -128473 -75171 -46135 -40205 -31809 -36452 -37543 20071 23191
21601 23191 -17310 -54015 -60662 -58440 -54080 -3900 46288 49406 5865 39912 -27562 -9002
21589 -9002 -23174 -112006 -93996 -60301 -46389 -28978 -10375 15542 -2787 -74916 -47600 8645
21577 8645 93779 118348 113698 132879 29150 -114468 -140882 -59972 -39678 3733 20412 -13746
$$ packed form
21663G4682O642L1914k4995m3101o3202Q290k5234L9322L8465p8944l1106Q1246
21651A3979M4766j5267L4345n146o1512n5828m386k7910M3576M9119k5871n3228
21639f3363j4396N4473q67N5203O8029K8491o2345Q202k393r6805l6492j0327
21627g2590j8063N68P693K6754O5502k5605O868K0415l686J4521o2010m8512K346
21614h5799k6114l0296j4740r506L7982N3302K9036N930Q396m643j091N7614L120
21601B3191m0501l6705o647K222M360N0180N0188L118m3541L4047o7474J8560
21589i002j4172q8832J8010L3695J3912J7411J8603K5917j8329p2129K7316N6245
21577H645Q5134K4569m650J9181j03729j43618k6414Q0910K0294M3411J6679l4158
$$ plain form
21565 -13746 -17391 28780 65700 50885 -9056 19196 95817 93064 20218 1511 25109 31390
21553 31390 138643 130049 98528 12434 -37168 -93443 -53582 5213 51729 33645 28400 60732
21541 60732 47020 -5335 -28162 -8004 8771 50735 59619 51192 89097 19188 -55859 -71880
21529 -71880 -17190 29667 41768 15971 -6881 -70400 -14812 92970 163137 152558 114946
21518 114946 121138 103110 26459 -23951 -62360 -111997 -59924 6214 30259 -11659 1660 11335
21506 11335 -20162 3815 51806 116696 220323 233559 253703 290009 352753 381815 493531
21495 493531 578085 726819 911583 1147875 1330173 1541110 1683890 1791984 1838939 1765417
21485 1765417 1635659 1393287 1171361 961119 775014 593500 495435 462916 305761 142765
$$ packed form
21565a3746l645M6171L6920j4815n9941K8252P6621k753p2846j8707K3598O281
21553C1390J07253q594l1521q6094m9602n6275L9861N8795M6516j8084n245L2332
21541F0732j3712n2355k2827K0158J6775M1964Q884q427L7905o9909p5047j6021
21529g1880N4690M6857J2101k5797k2852o3519N5588J07782P0167j0579l7612
21518A14946O192j8028p6651n0410l8409m9637N2073O6138K4045m1918J3319R675
21506A1335l1497K3977M7991O4890J03627J3236K0144L6306O2744K9062J11716
21495D93531Q4554J48734J84764K36292J82298K10937J42780J08094M6955p3522
21485A765417j29758k42372k21926k10242j86105j81514r8065l2519j57155j62996
$$ plain form
21475 142765 122504 116492 140826 151244 169483 177645 117681 73568 10130 58 45288 116664
21463 116664 84370 80515 98846 143905 132617 76663 16694 -40385 -13304 -7990 -17508 -56354
21451 -56354 -54019 -66817 -23284 1973 -3581 -11297 19282 51041 62894 89642 145295 131347
21439 131347 98074 -2186 -52777 30228 103812 100126 79447 70226 72322 71824 28859 -34400
21427 -34400 -26310 80482 45203 -2673 63204 83840 48775 -43467 -46471 -44438 -51238 33731
21415 33731 215 -91718 -130673 -107448 -82722 9629 108661 74432 3426 -25274 -112599 -152764
21403 -152764 -87953 -77009 -75768 -31533 -33636 -81369 -87165 -39709 -7009 -58177 -128145 -47580
21391 -47580 12499 -44592 -99231 -76969 -21244 -72890 -25186 28152 -46631 -118015 -69080 -41525
$$ packed form
21475A42765k0261o012K4334J0418J8239Q162n9964m4113o3438j0072M5230P1376
21463A16664l2294l855J8331M5059j1288n5954n9969n7079K7081N314r518l8846
21451e6354K335j2798M3533K5257n554p716L0579L1759J1853K6748N5653j3948
21439A31347l3273j00260n0591Q3005P3584l686k0679r221K096m98m2965o3259
21427c4400Q090J06792l5279m7876O5877K0636l5065r2242l004K033o800Q4969
21415C3731l3516r1933l8955K3225K4726R2351R9032l4229p1006k8700q7325m0165
21403a52764O4811J0944J241M4235k103m7733n796M7456L2700n1168o9968Q0565
21391d7580O0079n7091n4639K2262N5725n1646M7704N3338p4783p1384M8935K7555
$$ plain form
21379 -41525 -6910 -34922 -87323 -32242 -29688 -64609 13338 60350 46367 52483 20689 15229
21367 15229 50224 36007 74495 47421 -27235 -50674 -35742 10189 -10553 -48854 -94543 -60213
21355 -60213 -49100 -57118 37130 63749 56108 -7527 -60629 78171 71695 18750 -16460 -35654
21343 -35654 -412 34250 40704 65825 51420 16880 30601 -7285 -14311 -29047 -56452 -56762
21331 -56762 16471 61396 31286 -23321 -29863 -54524 -421 10920 46522 82754 61646 53430
21319 53430 -20261 -62353 -112832 -124791 -128896 -113469 -31436 8562 18535 -22199 1584 92570
21307 92570 121477 86468 63539 62879 13795 611 -10017 -58536 -117133 -47545 -17802 -52052
21295 -52052 -10176 34355 -12154 -54160 -68434 -75397 -49548 3250 79306 51802 -100327 -159562
$$ packed form
21379d1525L4615k8012n2401N5081K554l4921P7947M7012j3983O116l1794n460
21367A5229L4995j4217L8488k7074p4656k3439J4932M5931k0742l8301m5689L4330
21355f0213J1113q018R4248K6619p641o3635n3102J38800o476n2945l5210j9194
21343c5654L5242L4662O454K5121j4405l4540J3721l7886p026j4736k7405l10
21331e6762P3233M4925l0110n4607o542k4661N4103J1341L5602L6232k1108q216
21319E3430p3691m2092n0479j1959m105J5427Q2033L9998R973m0734K3783R0986
21307I2570K8907l5009k2929o60m9084j3184j0628m8519n8597O9588K9743l4250
21295e2052M1876M4531m6509m2006j4274o963K5849N2798P6056k7504j52129n9235
$$ plain form
21283 -159562 -144947 -132138 -144723 -140829 -177393 -78416 -2291 43227 23275 17292 -28481 -75231
21271 -75231 -88658 -65402 -57038 -134035 -97888 -81895 -66200 -126016 -161955 -109774 -82182 -83838
21259 -83838 -119457 -149292 -112396 -46796 6462 4748 -31920 -14198 -49370 24664 13568 -49615
21247 -49615 -53009 -71456 -93978 -76286 -10582 31034 25728 52197 3969 4133 -68048 -121962
21235 -121962 -141315 -53186 -64922 -89827 -143498 -102602 -29876 -10394 13733 69493 144462
21224 144462 113740 42603 21435 -82598 -101652 -61589 -13277 -12273 -152484 -223065 -165082
21213 -165082 -134095 -107118 -34289 -19340 -60969 -43879 -28877 -77328 -44659 -69627 -156043
21202 -156043 -160828 -145211 -144794 -224747 -180621 -152537 -28528 -16639 -102439 -138570 -110593 -96310
$$ packed form
21283a59562J4615J2809j2585L894l6564R8977P6125M5518j9952n983m5773m6750
21271g5231j3427K3256Q364p6997L6147J5993J5695n9816l5939N2181K7592j656
21259h3838l5619k9835L6896O5600N3258j714l6668J7722l5172P4034j1096o3183
21247d9615l394j8447k2522J7692O5704M1616n306K6469m8228J64p2181n3914
21235a21962j9353Q8129j1736k4905n3671M0896P2726J9482K4127N5760P4969
21224A44462l0722p1137k1168j04033j9054M0063M8312J004j40211p0581N7983
21213a65082L0987K6977P2829J4949m1629J7090J5002m8451L2669k4968q6416
21202a56043m785J5617M17p9953M4126K8084J24009J1889q5800l6131K7977J4283
$$ plain form
21190 -96310 -76576 12332 88521 64774 67898 75890 88555 106155 171981 155627 135383 50725
21178 50725 -7244 -37491 -30029 -19336 -82432 -172126 -174511 -140587 -117505 -46604 1167 -29577
21166 -29577 15193 69016 33351 83801 151084 125343 36368 29695 64154 -1534 -46404 -54342
21154 -54342 -5324 -14340 -73114 -60583 -55820 -17594 -21191 -51019 -52051 -130906 -187648 -168201
21142 -168201 -162175 -146551 -122353 -92593 -105211 -98006 -161249 -158700 -119506 -78735 -16058 35013
21130 35013 -10481 -50001 -28557 30648 27670 -55507 -9062 -35927 -65142 3828 -3405 -6317
21118 -6317 -78593 -42063 36154 89716 138440 33228 -53701 -134230 -73540 -32450 26241 -453
21106 -453 32155 11635 72061 48185 29298 -26352 -84895 -66156 -96863 -114514 -119082 -37101
$$ packed form
21190i6310J9734Q8908P6189k3747L124P992J2665J7600O5826j6354k0244q4658
21178E0725n7969l0247P462J0693o3096q9694k385L3924K3082P0901M7771l0744
21166b9577M4770N3823l5665N0450O7283k5741q8975o673L4459o5688m4870p938
21154e4342M9018r016n8774J2531M763L8226l597k9828j032p8855n6742J9447
21142a68201O026J5624K4198K9760j2618P205o3243K549L9194M0771O2677N1071
21130C5013m5494l9520K1444N9205k978q3177M6445k6865k9215O8970p233k912
21118f317p2276L6530P8217N3562M8724j05212q6929q0529O0690M1090N8691k6694
21106d53L2608k0520O0426k3876j8887n5650n8543J8739l0707j7651m568Q1981
$$ plain form
21094 -37101 49369 87929 24548 17692 37527 34597 73863 102962 50687 -14562 -25952 -43080
21082 -43080 -98424 -139049 -149678 -123290 -75533 -56865 -108758 -108484 -166544 -144998 -119862 -24289
21070 -24289 35035 -53871 -27381 94724 128166 65718 -3196 -37439 -14853 -15845 -31805 -17710
21058 -17710 -1875 -5557 -14291 -37122 -41036 4048 -25795 -46244 -60704 -85200 -110324 -127640
21046 -127640 -115283 -110676 -23164 -27701 -64849 -42283 -92620 -178303 -178671 -121986 -79474 -55539
21034 -55539 -22921 24032 25746 29078 -24293 -78261 -63618 -43586 -70921 -178258 -181799 -120996
21022 -120996 -67347 -65664 -3418 38364 50571 15138 17617 -8962 -26328 -18267 21325 -38126
21010 -38126 -16174 -37965 -65330 -38186 -59271 -37375 -12578 -9398 43129 85417 58078 40848
$$ packed form
21094c7101Q6470L8560o3381o856J9835k930L9266K9099n2275o5249j1390j7128
21082d3080n5344m0625j0629K6388M7757J8668n1893K74n8060K1546K5136R5573
21070b4289N9324q8906K6490J22105L3442o2448o8914l4243K2586r92j5960J4095
21058a7710J5835l682q734k2831l914M5084k9843k0449j4460k4496k5124j7316
21046a27640J2357M607Q7512m537l7148K2566n0337q5683l68N6685M2512K3935
21034e5539L2618M6953J714L332n3371n3968J4643K0032k7335j07337l541O0803
21022a20996N3649J683O2246M1782J2207l5433K479k6579j7366Q061L9592n9451
21010c8126K1952k1791k7365K7144k1085K1896K4797L180N2527M2288k7339j7230
$$ plain form
20998 40848 3026 2096 -56540 -124174 -119643 -68191 -103286 -96323 -68094 -37656 -32326 -114944 -87591
20985 -87591 -51451 -74429 -61577 -35323 6829 11213 36903 -8855 -10236 -75762 -93235 -116219
20973 -116219 -140190 -123030 -26472 -8891 -51801 -91023 -62741 -144262 -91509 5190 1237 48510
20961 48510 32307 -74029 -131527 -156198 -83888 -39254 -40696 -107044 -111587 -49529 -20380 -32336
20949 -32336 8873 -83112 -122952 689 40552 -9126 -29491 30325 71036 105287 39436
20938 39436 -67332 -27665 23000 53084 -11205 -155479 -118885 -83643 -58587 -103740 -145799
20927 -145799 -128250 -72783 -16576 -9947 1645 23205 24349 -74749 -159323 -155964 -95068 -55852
20915 -55852 28072 47701 31290 28695 -12979 -15574 -34593 48544 28351 42177 75308 126929
$$ packed form
20998D0848l7822r30n8636o7634M531N1452l5095O963K8229L0438N330q2618K7353
20985h7591L6140k2978J2852K6254M2152M384K5690m5758j381o5526j7473k2984
20973a16219k3971J7160R6558J7581m2910l9222K8282q1521N2753R6699l953M7273
20961D8510j6203j06336n7498k4671P2310M4634j442o6348m543O2058K9149j1956
20949c2336M1209r1985l9840J23641L9863m9678k0365N9816M0711L4251o5851
20938C9436j06768L9667N0665L0084o4289j44274L6594L5242K5056m5153m2059
20927a45799J7549N5467N6207O629J1592K1560J144r9098q4574L359O0896L9216
20915e5852Q3924J9629j6411k595m1674k595j9019Q3137k0193J3826L3131N1621
$$ plain form
20903 126929 107203 54651 13950 31831 33423 -11801 -57340 -37060 -26808 -21217 24279 17149
20891 17149 6862 -13376 -435 -14574 -49795 -38178 -78997 -68325 -47091 -31066 -20959 -41756
20879 -41756 9621 20719 -3572 -9629 66472 28735 -58522 -78257 -103623 -180230 -184732 -64499
20867 -64499 -15939 -66465 -96912 -69282 -56933 -34370 4743 15429 -27288 -76947 -52467 -7855
20855 -7855 33027 3469 -28587 -60340 -67246 30928 57547 63069 -10295 -63268 -82267 -91166
20843 -91166 26136 109630 53398 21828 21575 32295 -32996 -105064 -50826 -4873 4759 -36676
20831 -36676 -47906 18021 63858 31169 99213 99229 108520 -16741 -64493 -55478 -26173 28320
20819 28320 38245 38370 57930 144470 80212 -52559 8801 -44286 -76821 -19335 16233 24203
$$ packed form
20903A26929j9726n2552m0701J7881J592m5224m5539K0280J0252N591M5496p130
20891A7149j0287k0238J2941j4139l5221J1617m0819J0672K1234J6025J0107k0797
20879d1756N1377J1098k4291o057P6101l7737q7257j9735k5366p6607m502J20233
20867f4499M8560n0526l0447K7630J2349K2563L9113J0686m2717m9659K4480M4612
20855g855M0882k9558l2056l1753o906R8174K6619N522p3364n2973j8999q899
20843i1166J17302Q3494n6232l1570k53J0720o5291p2068N4238M5953R632m1435
20831c6676j1230O5927M5837l2689O8044J6R291j25261m7752R015K9305N4493
20819B8320R925J25J9560Q6540o4258j32771O1360n3087l2535N7486L5568P970
$$ plain form
20807 24203 63961 93864 95731 94101 33268 70864 47947 -12295 -38263 -39215 -57908 -20750
20795 -20750 32283 -13402 -19823 -291 10920 79840 14791 32967 30345 28794 39964 36869
20783 36869 69763 125607 154497 63511 7515 -33450 -56402 -43418 -64109 -38713 -42676 -986
20771 -986 -33755 -56922 -26958 -64668 -16955 -8692 4800 13739 50743 67368 46974 35390
20759 35390 17127 -58086 -5130 53007 -32278 -56129 -94298 -46102 -31040 6588 -12247 -500
20747 -500 27492 61076 51869 15988 11442 35238 26207 61917 -16607 -56835 -110842 -139957 -79782
20734 -79782 -69969 -118204 -74162 -75302 7435 65847 7390 -13781 -53963 -46528 4444 83244
20722 83244 141492 116943 136915 118429 89162 50530 -10374 3893 7933 45823 56330 -10674
$$ packed form
20807B4203L9758K9903J867j630o0833L7596k2917o0242k5968r52j8693L7158
20795b0750N3033m5685o421J9532J1211O8920o5049J8176k622j551J1170l095
20783C6869L2894N5844K8890r0986n5996m0965k2952J2984k0691K5396l963M1690
20771i86l2769k3167K9964l7710M7713Q263J3492Q939L7004J6625k0394j1584
20759C5390j8263p5213N2956N8137q5285k3851l8169M8196J5062L7628j8835J1747
20747e00K7992L3584r207l5881m546K3796r031L5710p8524m0228n4007k9115O0175
20734g9782R813m8235M4042j140Q2737N8412n8457k1171m0182P435N0972P8800
20722H3244N8248k4549J9972j8486k9267l8632o0904J4267M040L7890J0507o7004
$$ plain form
20710 -10674 23294 57566 71007 -18368 -19085 -40601 15020 53680 122144 161144 96325 53452
20698 53452 48995 55913 76429 59225 61457 137253 149202 132502 120637 14318 -24429 2565
20686 2565 102106 139618 104952 113357 183046 255884 363011 394662 475157 645292 727635 655003
20674 655003 667724 770656 891854 905462 789442 647288 592630 661284 681446 692922 790138
20663 790138 880902 1023248 1078900 1113646 1080191 988057 887611 817560 778359 704001 606871
20652 606871 539790 430927 384519 335250 270560 255061 214319 158499 146058 167334 182753
20641 182753 154236 139783 234345 317650 309640 319301 337796 360375 385741 394385 412817 389774
20629 389774 379049 379135 333509 310371 277139 260989 288747 274400 264406 313379 306864 341050
$$ packed form
20710a0674L3968L4272J3441q9375p17k1516N5621L8660O8464L9000o4819m2873
20698E3452m457O918K0516j7204K232P5796J1949j6700j1865j06319l8747K6994
20686B565R9541L7512l4666Q405O9689P2838J07127L1651Q0495J70135Q2343p2632
20674F55003J2721J02932J21198J3608j16020j42154n4658O8654K0162J1476R7216
20663G90138R0764J42346N5652L4746l3455r2134j00446p0051l9201p4358r7130
20652F06871o7081j08863m6408m9269o4690j5499m0742n5820j2441K1276J5419
20641A82753k8517j4453R4562Q3305q010R661J8495K2579K5366Q644J8432k3043
20629C89774j0725Q6m5626k3138l3232j6150K7758j4347r994M8973o515L4186
$$ plain form
20617 341050 302562 293687 379347 362794 238101 217710 205791 201460 141789 175980 194729 203746
20605 203746 189020 150369 81591 -8762 -71245 -33035 -28995 -86550 -44144 -5320 12889 25584
20593 25584 8836 9301 51624 6706 25676 154388 192394 131921 101483 57516 50887 79872
20581 79872 157373 152435 118084 147872 204358 97423 117192 135427 126841 157230 202051 261270
20569 261270 299456 245585 215264 206922 180069 216001 229424 275985 308867 323674 413820 517387
20557 517387 606593 628227 624743 653076 768093 964032 1208186 1477600 1800409 2176272
20547 2176272 2374314 2452235 2632334 2776663 2796922 2785875 2528037 2279791 2133225 2032752
20537 2032752 2027989 2118184 2282024 2513815 2739897 2896461 2988908 2994377 2907640 2828821 2648130
$$ packed form
20617C41050l8488q875Q5660j6553j24693k0391j1919m331n9671L4191J8749R017
20605B03746j4726l8651o8778r0353o2483L8210M040n7555M2406L8824J8209J2695
20593B5584j6748M65M2323m4918J8970J28712L8006o0473l0438m3967o629K8985
20581G9872P7501m938l4351K9788N6486j06935J9769J8235q586L0389M4821N9219
20569B61270L8186n3871l0321q342k6853L5932J3423M6561L2882J4807R0146J03567
20557E17387Q9206K1634l484K8333J15017J95939K44154K69414L22809L75863
20547B176272J98042P7921J80099J44329K0259j1047k57838k48246j46566j00473
20537B032752m763R0195J63840K31791K26082J56564R2447N469q6737p8819j80691
$$ plain form
20526 2648130 2383293 2142998 1946359 1661168 1311074 1090658 943237 825279 722170
20517 722170 709327 705490 645447 588238 558787 600831 595770 525291 531823 482473 419828 468679
20505 468679 480703 409053 390957 407583 384609 383750 460120 402438 330205 291068 299543 349953
20493 349953 475678 420179 385178 343548 313856 314201 282045 293587 305600 363697 375002 319532
20481 319532 315929 216827 189351 177812 172272 178119 155049 109666 106270 161376 212765 211556
20469 211556 154775 126085 159167 178905 199376 166087 112157 109445 101929 29926 22508 101444
20457 101444 144148 161727 82630 47806 86687 52795 -32241 7073 6784 -26246 -25394 21698
20445 21698 46319 96682 75855 66506 81844 126946 104501 39864 -3408 22053 62817 98580
$$ packed form
20526B648130k64837k40295j96639k85191l50094k20416j47421j17958j03109
20517G22170j2843l837o0043n7209k9451M2044n061p0479O532m9350o2645M8851
20505D68679J2024p1650j8096J6626k2974q59P6370n7682p2233l9137Q475N0410
20493C49953J25725n5499l5001m1630k9692L45l2156J1542J2013N8097J1305n5470
20481C19532l603r9102k7476j1539n540N847k3070m5383l396N5106N1389j209
20469B11556n6781k8690L3082J9738K0471l3289n3930k712p516p2003p418P8936
20457A01444M2704J7579p9097l4824L8881l3892q5036L9314k89l3030Q52M7092
20445B1698K4621N0363k0827r349J5338M5102k2445o4637m3272K5461M0764L5763
$$ plain form
20433 98580 66304 64495 143896 173764 80046 -63300 -75445 3505 -1805 -48718 -94794 -72286
20421 -72286 -1354 56522 70205 25174 -38437 -30508 21358 48833 106166 127265 87739 68389
20409 68389 145578 145578 43962 1830 -21137 -17139 2837 32397 49310 29068 60572 89620
20397 89620 119476 30961 -21151 57777 150706 251010 285320 299390 303968 256307 196042 225479
20385 225479 188868 126620 186236 185896 214723 228663 232432 225733 194440 244915 277093 273432
20373 273432 297885 304237 281648 250773 236732 311828 380341 349588 286813 264848 270022 229436
20361 229436 312373 388086 309543 267952 268599 266854 273598 176531 93920 66485 24149 39182
20349 39182 79291 143182 149583 126244 161472 139510 146881 193571 207592 72100 93561 147781
$$ packed form
20433I8580l2276j809P9401K9868r3718j43346j2145P8950n310m6913m6076K2508
20421g2286P0932N7876J3683m5031o3611P929N1866K7475N7333K1099l9526j9350
20409F8389P7189%j01616m2132k2967L998J9976K9560J6913k0242L1504K9048
20397H9620K9856q8515n2112P8928R2929J00304L4310J4070M578m7661o0265K9437
20385B25479l6611o2248N9616l40K8827J3940L769o699l1293N0475L2178l661
20373B73432K4453O352k2589l0875j4041P5096O8513l0753o2775k1965N174m0586
20361B29436Q2937P5713p8543m1591O47j745O744r7067q2611k7435m2336J5033
20349C9182M0109O3891O401k3339L5228k1962P371M6690J4021j35492K1461N4220
$$ plain form
20337 147781 140151 123149 111417 117357 99361 130125 118586 74427 155001 161841 166478 127827
20325 127827 23410 -37248 -22172 111422 169742 152207 149515 114102 21613 81791 162833
20314 162833 303882 318017 222414 156502 105855 130565 93579 134894 88231 114512 139635
20303 139635 97314 88486 74026 128795 190759 215402 182284 182810 203512 228680 200061 222018
20291 222018 323860 375134 318036 271570 225931 180104 162488 139841 182966 209189 199764
20280 199764 201414 231086 298612 254184 298243 340687 332152 287942 216944 191952 179797 280677
20268 280677 348933 363518 349879 308420 316241 412899 461100 414260 455415 477195 520474 517378
20256 517378 579154 679784 870862 1128226 1399825 1722330 2018935 2152972 2346696 2588778
$$ packed form
20337A47781p630j7002j1732N940j7996L0764j1539m4159Q0574O840M637l8651
20325A27827j04417o0658J5076J33594N8320j7535k692l5413r2489O0178Q1042
20314A62833J41049J4135r5603o5912n0647K4710l6986M1315m6663K6281K5123
20303A39635m2321q828j4460N4769O1964K4643l3118N26K0702K5168k8619K1957
20291B22018J01842N1274n7098m6466m5639m5827j7616k2647M3125K6223r425
20280A99764J650K9672O7526m4428M4059M2444q535m4210p0998k4992j2155J00880
20268B80677O8256J4585j3639m1459P821R6658M8201m6840M1155K1780M3279l096
20256E17378O1776J00630J91078K57364K71599L22505K96605J34037J93724K42082
$$ plain form
20246 2588778 2748154 2777135 2791270 2629557 2454889 2293295 2029931 1748841 1475257 1348074
20236 1348074 1219930 1032081 952272 865294 766463 646252 637550 669561 704456 673318 662530
20225 662530 674892 620690 636508 671572 675777 775858 869342 844929 870257 816661 702979
20214 702979 765044 810442 828196 824396 885464 940024 928113 903338 895516 970553 1086295 1192139
20202 1192139 1255945 1438098 1599288 1811107 1992692 2241178 2552229 2916343 3236505 3444053
20192 3444053 3765765 4171105 4470668 4490764 4323851 4154905 3948035 3693834 3383515 3061037
20182 3061037 2859270 2704405 2507389 2440676 2455831 2470361 2418555 2451335 2540035 2626518 2675035
20171 2675035 2783290 2889474 3001891 3133258 3346756 3524708 3700477 3881189 4020374
$$ packed form
20246B588778J59376K8981J4135j61713j74668j61594k63364k81090k73584j27183
20236A348074j28144j87849p9809q6978r8831j20211q702L2011L4895l1138j0788
20225F62530J2362n4202J5818L5064M205J00081R3484k4413K5328n3596j13682
20214G02979O2065M5398J7754l800O1068N4560j1911k4775p822P5037J15742J05844
20202A192139O3806J82153J61190K11819J81585K48486L11051L64114L20162K07548
20192C444053L21712M05340K99563K0096j66913j68946k06870k54201l10319l22478
20182C061037k01767j54865j97016o6713J5155J4530n1806L2780Q8700Q6483M8517
20171B675035J08255J06184J12417J31367K13498J77952J75769J80712J39185
$$ plain form
20162 4020374 4116349 4239518 4365603 4379570 4459365 4550424 4765397 5018832 5269436 5609221
20152 5609221 6069698 6615529 7087402 7506362 7957813 8527556 9158764 9767139 10504171
20143 10504171 11324575 12276432 13316278 14627164 16208017 18369239 21136446 24938085
20135 24938085 29907582 36512809 45352063 57054898 72203943 90985809 111705236
20128 111705236 130517409 144096587 153053418 159343826 162257370 159182241 149888783 137508236
20120 137508236 125587980 116226041 111380494 112538598 120107336 133172221 148213767
20113 148213767 160283174 167186607 170463902 171269738 167435908 156810830 140488374 121786686
20105 121786686 103264530 86190217 71666976 60110643 51432999 44968628 39989597
$$ packed form
20162D020374R5975J23169J26085J3967P9795R1059K14973K53435K50604L39785
20152E609221M60477N45831M71873M18960M51451N69743O31208O08375P37032
20143A0504171Q20404R51857J039846J310886J580853K161222K767207L801639
20135B4938085M969497O605227Q839254J1702835J5149045J8781866K0719427
20128A11705236J8812173J3579178Q956831O290408K913544l075129r293458j2380547
20120A37508236j1920256r361939m845547J158104P568738J3064885J5041546
20113A48213767J2069407O903433L277295Q05836l833830j0625078j6322456j8701688
20105A21786686j8522156j7074313j4523241j1556333q677644o464371m979031
$$ plain form
20098 39989597 36191960 33160491 30684980 28810815 27313079 26160255 25230880 24441785
20090 24441785 23724493 23009908 22315461 21665270 21070340 20424386 19607187 18860716 18194249
20081 18194249 17451829 16843600 16303473 15908139 15645392 15373933 15065097 14822090 14534936
20072 14534936 14123963 13661372 13171195 12552365 11921037 11326628 10757293 10141103 9570464
20063 9570464 9053610 8610790 8164466 7720958 7287699 6907878 6556918 6152712 5824752
20054 5824752 5576078 5363939 5131496 4887999 4643715 4438654 4282180 4023580 3846368
20045 3846368 3754479 3531785 3387271 3176838 3040048 2893637 2742319 2614692 2538913 2496202
20035 2496202 2383817 2245618 2170872 2103037 1957524 1835975 1744512 1680220 1606102 1486839
$$ packed form
20098C9989597l797637l031469k475511j874165j497736j152824r29375p89095
20090B4441785p17292p14585o94447o50191n94930o45954q17199p46471o66467
20081A8194249p42420o08229n40127l95334k62747k71459l08836k43007k87154
20072A4534936m10973m62591m90177o18830o31328n94409n69335o16190n70639
20063I570464n16854m42820m46324m43508m33259l79821l50960m04206l27960
20054E824752k48674k12139k32443k43497k44284k05061j56474k58600j77212
20045C846368r1889k22694j44514k10433j36790j46411j51318j27627p5779m2711
20035B496202j12385j38199p4746o7835j45513j21549r1463o4292p4118j19263
$$ plain form
20025 1486839 1438552 1434670 1443864 1309502 1140425 1144992 1111503 1096079 1081253 1128318 1107308
20014 1107308 1121740 1198634 1121556 987109 933269 878084 822606 843288 915659 986542 954566
20003 954566 958071 934022 949563 916166 867619 824824 765285 718355 760838 759746 685406 651736
19991 651736 663301 654850 661384 660163 698864 683059 666780 619145 624415 594862 516540 440887
19979 440887 341208 306677 291938 283356 329511 384520 347467 322716 206007 139193 167368
19968 167368 224335 240019 296162 279603 256034 174402 149578 101248 104951 168761 184894 207533
19956 207533 212656 286742 332337 263600 225987 252662 277201 343045 414642 395108 314357 269077
19944 269077 247904 279033 192680 124096 140961 197370 305377 336584 303404 275643 361668
$$ packed form
20025A486839m8287l882R194j34362j69077M567l3489j5424j4826M7065k1010
20014A107308J4432P6894p7078j34447n3840n5185n5478K0682P2371P0883l1976
20003I54566L505k4049J5541l3397m8547m2795n9539m6930M2483j092p4340l3670
19991F51736J1565q451O534j221L8701j5805j6279m7635N270k9553p8322p5653
19979D40887r9679l4531j4739q582M6155N5009l7053k4751j16709o6814K8175
19968A67368N6967J5684N6143j6559k3569q1632k4824m8330L703O3810J6133K2639
19956B07533N123P4086M5595o8737l7613K6675K4539O5844P1597j9534q0751m5280
19944B69077k1173L1129q6353o8584J6865N6409J08007L1207l3180k7761Q6025
$$ plain form
19933 361668 447153 493050 488101 531967 428073 315840 328151 336312 369652 352843 263060
19922 263060 242066 252837 238899 219107 216938 255201 357373 377256 327489 347157 351155 266639
19910 266639 148452 284899 358402 302196 293104 310641 267283 234837 216825 266371 344094
19899 344094 286094 235528 241118 269199 252174 260336 255951 220724 221243 237474 288497 320169
19887 320169 293061 260759 268944 297572 298819 313341 319705 355893 294290 218763 164466 128864
19875 128864 150046 211370 244816 191368 142118 151150 149410 135368 183966 167979 152890 149449
19863 149449 182206 163551 121809 169639 172493 98254 3392 -76028 -34038 83344 91208 54120
19851 54120 30574 16974 103104 117425 32370 51812 111053 91088 72094 74925 101983 75731
$$ packed form
19933C61668Q5485M5897m949M3866j03894j12233J2311Q161L3340j6809q9783
19922B63060k0994J0771j3938j9792k169L8263J02172J9883m9767J9668L998q4516
19910B66639j18187J36447P3503n6206r092J7537m3358l2446j8012M9546P7723
19899C44094n8000n0566N590K8081j7025Q162m385l5227N19J6231N1023L1672
19887C20169k7108l2302Q185K8628J247J4522O364L6188o1603p5527n4297l5602
19875A28864K1182O1324L3446n3448m9250R032j740j4042M8598j5987j5089l441
19863A49449L2757j8655m1742M7830K854p4239r4862p9420M1990J17382P864l7088
19851E4120k3546j3600Q6130J4321q5055J9442N9241j9965j8994K831K7058k6252
$$ plain form
19839 75731 80688 10277 -22140 45522 120984 78342 -19873 -30354 43181 78703 95484 88141
19827 88141 68246 29351 32316 -10195 -50782 -44368 -70836 -59329 -22402 -21243 -103847 -75649
19815 -75649 21203 56906 113720 130361 80010 40386 19278 59285 53824 74567 168584 155941
19803 155941 59114 13341 44678 90116 39174 -8803 -32246 -18670 483 38603 -4649
19792 -4649 -56575 2184 31811 -1777 14318 132178 163958 185772 164527 157413 127869 161736
19780 161736 161389 93402 63431 38058 75055 66777 63322 124738 125043 118331 136454 30739 -15258
19767 -15258 -36610 -17155 -7219 92005 195702 192218 125894 42682 1695 -40748 -5052 79533
19755 79533 39065 154900 138494 119362 147348 139645 134694 98682 77814 83845 72982 106553
$$ packed form
19839G5731M957p0411l2417O7662P5462m2642r8215j0481P3535L5522J6781p343
19827H8141j9895l8895K965m2511m0587O414k6468J1507L6927J159q2604K8198
19815g5649R6852L5703N6814J6641n0351l9624k1108M0007n461K0743R4017j2643
19803A55941r6827m5773L1337M5438n0942m7977k3443J3576J9153L8120m3252
19792d649n1926N8759K9627l3588J6095J17860L1780K1814k1245p114k9544L3867
19780A61736l47o7987k9971k5373L6997q278l455O1416L05o712J8123j05715m5997
19767a5258k1352J9455R936R9224J03697l484o6324q3212m0987m2443L5696Q4585
19755G9533m0468J15835j6406j9132K7986p703m951l6012k0868O031j0863L3571
$$ plain form
19743 106553 126956 149488 144155 164440 63605 -27844 -36579 -60020 -80536 -31875 32860 38089
19731 38089 19701 -18653 -39735 -89609 -62947 36975 61395 99830 85210 82349 67859 -38245
19719 -38245 -10214 1495 27522 74903 44546 15774 1537 48689 33115 33952 53432 4388
19707 4388 -13519 62577 106475 113751 90206 49407 -16446 5103 -11094 40976 119164 98271
19695 98271 54028 41362 71103 115756 161050 113942 -28629 -95616 -8953 77705 109084
19684 109084 26409 -62011 -43826 37852 34287 23065 76666 24561 -29223 -25378 18541 -11633
19672 -11633 29363 72307 133897 83891 63518 54708 79947 48772 14274 -28248 65862 85849
19660 85849 58247 15187 -10004 -83123 -95067 -134609 -37952 117188 66079 -26609 22293
$$ packed form
19743A06553K0403K2532n333K0285j00835r1449q735k3441k0516M8661O4735N229
19731C8089j8388l8354k1082m9874K6662R9922K4420L8435j4620k861j4490j06104
19719c8245K8031J1709K6027M7381l0357k8772j4237M7152j5574Q37J9480m9044
19707D388j7907P6096M3898P276k3545m0799o5853K1549j6197N2070P8188k0893
19695I8271m4243j2666K9741M4653M5294m7108j42571o6987Q6663Q6658L1379
19684A09084q2675q8420J8185Q1678l565j1222N3601n2105n3784L845M3919l0174
19672a1633M0996M2944O1590n0006k0373q810K5239l1175l4498m2522R4110J9987
19660H5849k7602m3060k5191p3119j1944l9542R6657J55140n1109r2688M8902
$$ plain form
19649 22293 166284 233165 239108 299150 411492 475803 545181 621803 726072 756446 668610
19638 668610 527595 422044 369591 380321 446535 473403 491260 515009 593685 671014 719619
19627 719619 772204 731350 671335 648927 585449 511748 427937 374397 343324 348317 288273 262713
19615 262713 200871 203639 189247 207706 211863 161769 127585 175339 194644 154736 122981 105292
19603 105292 139752 153717 229978 264772 270865 227017 256585 225705 238197 305817 355742 395633
19591 395633 453364 537132 690346 688218 617320 603914 679323 764979 784901 768151 726138
19580 726138 778714 745817 767953 776585 820655 888696 1022788 1159340 1292672 1399672 1551732
19569 1551732 1582879 1571133 1472383 1399138 1262182 1093015 1038220 961571 940571 1037126 1115143
$$ packed form
19649B2293J43991O6881N943O0042J12342O4311O9378P6622J04269L0374q7836
19638F68610j41015j05551n2453J0730O6214K6868J7857K3749P8676P7329M8605
19627G19619N2585m0854o0015k2408o3478p3701q3811n3540l1073M993o0044k5560
19615B62713o1842K768j4392J8459M157n0094l4184M7754J9305l9908l1755j7689
19603A05292L4460J3965P6261L4794O093m3848K9568l0880J2492O7620M9925L9891
19591C95633N7731Q3768J53214k128p0898j3406P5409Q5656J9922j6750m2013
19580G26138N2576l2897K2136Q632M4070O8041J34092J36552J33332J07000J52060
19569A551732L1147j1746r8750p3245j36956j69167n4795p6649k1000R6555P8017
$$ plain form
19558 1115143 1157791 1205320 1230910 1233763 1264464 1251673 1154472 1065122 1033481 1022091 995091
19547 995091 968783 851123 764142 805748 850194 1021102 1269240 1528160 1868791 2219560
19537 2219560 2341614 2234040 2024300 1727289 1428994 1147449 982423 892759 981389 1135408
19527 1135408 1275562 1467118 1793891 2135158 2357497 2297056 2059549 1772809 1473821 1204719
19517 1204719 959696 805866 668682 549542 591133 590217 467939 395616 296693 325418 311071
19506 311071 290106 366429 433013 467689 460487 469332 396032 421041 496684 482542 404207 337599
19494 337599 345499 410827 368507 339532 367623 382211 559527 723863 797445 990151 1255884
19483 1255884 1612890 1898868 2038820 1993692 1815120 1547716 1285129 976951 854636 849680
$$ packed form
19558A115143M2648M7529K5590K853L0701j2791r7201q9350l1641j1390k7000
19547I95091k6308j17660q6981M1606M4446J70908K48138K58920L40631L50769
19537B219560J22054j07574k09740k97011k98295k81545j65026q9664Q8630J54019
19527A135408J40154J91556L26773L41267K22339o0441k37507k86740k98988k69102
19517A204719k45023j53830j37184j19140M1591r16j22278p2323r8923K8725j4347
19506C11071k0965P6323O6584L4676p202Q845p3300K5009P5643j4142p8335o6608
19494C37599P900O5328m2320k8975K8091J4588J77316J64336P3582J92706K65733
19483A255884L57006K85978J39952m5128j78572k67404k62587l08178j22315m956
$$ plain form
19473 849680 759166 812327 963178 1148875 1386956 1778192 2021765 1928845 1724632 1466691
19463 1466691 1171842 956181 785889 686042 593042 535088 539810 489628 371381 235583
19453 235583 194926 213701 175256 141259 139630 224092 242793 169741 168828 186217 196642 210372
19441 210372 238051 176190 187128 206703 176557 196085 223848 148304 110283 111422 85987 63089
19429 63089 116155 148920 141644 84377 73796 128007 158311 128638 65073 97850 86844 -15268
19417 -15268 -16706 61100 115315 202591 232894 232469 226877 195886 154984 70166 21393 40091
19405 40091 53105 3320 -19744 -4517 71068 85976 22859 43101 94572 39219 16408 173625
19393 173625 219779 189459 153118 192078 194323 129814 78510 98481 110649 203728 216547 242295
$$ packed form
19473H49680r0514N3161J50851J85697K38081L91236K43573r2920k04213k57941
19463A466691k94849k15661j70292r9847r3000n7954M722n0182j18247j35798
19453B35583m0657J8775l8445l3997j629Q4462J8701p3052r13J7389J0425J3730
19441B10372K7679o1861J0938J9575l0146J9528K7763p5544l8021J139k5435k2898
19429F3089N3066L2765p276n7267j0581N4211L0304k9673o3565L2777j1006j02112
19417a5268j438P7806N4215Q7276L0303m25n592l0991m0902q4818m8773J8698
19405D0091J3014m9785k3064J5227P5585J4908o3117K0242N1471n5353k2811J57217
19393A73625M6154l0320l6341L8960K245o4509n1304J9971J2168R3079J2819K5748
$$ plain form
19381 242295 203881 147469 104019 125404 129033 99504 101279 154182 233439 249694 226196 203766
19369 203766 161876 150645 245451 240464 146215 144601 148075 149367 188689 178932 107246 66703
19357 66703 125785 135406 63551 28674 50986 78532 133596 115295 135117 122482 149959 155280
19345 155280 31967 -44592 -129534 -145113 -80080 28316 38648 41418 27529 80508 164038
19334 164038 224015 188628 144884 69103 58406 100840 151736 227034 274399 241974 231938
19323 231938 295140 287697 224952 208948 212137 196599 174614 103806 156357 200811 233280 174367
19311 174367 88328 120019 245734 261180 196868 169935 144642 173467 181806 216132 271873
19300 271873 256180 190242 141155 167303 218581 157253 90269 91490 69222 91853 163050 201068
$$ packed form
19381B42295l8414n6412m3450K1385L629k9529J775N2903P9257J6255k3498k2430
19369B03766m1890j1231R4806m987r4249j614L474J292L9322r757p1686m0543
19357F6703N9082R621p1855l4877K2312K7546N5064j8301J9822j2635K7477N321
19345A55280j23313p6559q4942j5579O5033J08396J0332K770j3889N2979Q3530
19334A64038N9977l5387m3744p5781j0697M2434N0896P5298M7365l2425j0036
19323B31938O3202p443o2745j6004L189j5538k1985p0808N2551M4454L2469n8913
19311A74367q6039L1691J25715J5446o4312k6933k5293K8825Q339L4326N5741
19300B71873j5693o5938m9087K6148N1278o1328o6984J221k2268K2631P1197L8018
$$ plain form
19288 201068 177110 196820 221464 151306 143517 162787 200151 173568 128653 110528 53643 25750
19276 25750 5478 10416 126965 185775 232196 229661 209846 163684 97025 89058 43656 117385
19264 117385 183929 165842 147983 142081 219018 293575 299925 303882 207392 178569 263854 259311
19252 259311 189826 141160 180689 200369 205748 204169 160460 180015 207155 298931 347895 370937
19240 370937 298084 186945 185282 234340 297751 366714 349009 335264 308502 309668 304008 302714
19228 302714 288472 236819 225997 349023 404545 362717 353339 328317 345502 379276 390465
19217 390465 367958 310773 332119 357623 417732 405908 396824 406688 399911 423832 429626 510312
19205 510312 616027 588417 644225 679431 700276 781276 820305 784952 733101 729629 723366 720937
$$ packed form
19288B01068k3958J9710K4644p0158p789J9270L7364k6583m4915j8125n6885k7893
19276B5750k0272M938J16549N8810M6421k535j9815m6162o6659p967m5402P3729
19264A17385O6544j8087j7859n902P6937P4557O350L957r6490k8823Q5285m543
19252B59311o9485m8666L9529J9680N379j579m3709J9555K7140R1776M8964K3042
19240C70937p2853j11139j663M9058O3411O8963j7705j3745k6762J166n660j294
19228C02714j4242n1653j0822J23026N5522m1828r378k5022J7185L3774J1189
19217C90465k2507n7185K1346K5504O0109j1824r084R864o777K3921N794Q0686
19205E10312J05715k7610N5808L5206K0845Q1000L9029l5353n1851l472o263k429
$$ plain form
19193 720937 722541 749830 760524 784981 847083 993102 1073152 1105367 1082069 999031 1025361
19182 1025361 1028775 931605 937118 951231 964726 959929 1016340 965868 994615 1123935 1177636 1264494
19170 1264494 1345873 1407124 1456744 1406698 1337927 1450199 1649865 1651514 1773543 1912059 1963968
19159 1963968 2053707 2297528 2513977 2703593 2884326 2989946 3154781 3276759 3351777 3494486
19149 3494486 3794909 4163815 4437738 4737071 5110084 5617994 6212739 7076281 8142742
19140 8142742 9418346 10994333 13068752 15787499 19587196 24847182 32276758 42780936
19132 42780936 57049363 74931892 92931789 104440691 106522519 99236802 87282758
19125 87282758 74114308 62082094 52763767 47182113 45280786 46884249 52041729 60977799
$$ packed form
19193G20937J604K7289J0694K4457O2102J46019Q0050L2215k3298q3038K6330
19182A025361L414r7170N513J4113J3495m797N6411n0472K8747J29320N3701Q6858
19170A264494Q1379O1251M9620n0046o8771J12272J99666J649J22029J38516N1909
19159A963968Q9739K43821K16449J89616J80733J05620J64835J21978P5018J42709
19149C494486L00423L68906K73923K99333L73013N07910N94745Q63542J066461
19140H142742J275604J575987K074419K718747L799697N259986P429576J0504178
19132D2780936J4268427J7882529J7999897J1508902K081828p285717j1954044
19125H7282758j3168450j2032214r318327n581654j901327J603463N157480Q936070
$$ plain form
19117 60977799 74034092 89897203 103443832 109128437 105247633 93788060 79645603
19110 79645603 65175287 52309766 42052247 34644640 29411012 25601953 22862209 20887773
19102 20887773 19258094 17993101 17022409 16180785 15523658 15065533 14719513 14417155 14269246
19093 14269246 14286548 14320989 14335074 14440241 14591028 14722540 14978295 15336928 15957101 16738430
19083 16738430 17803039 19440522 21621862 24740909 29110856 35303564 43977095 56059896
19075 56059896 72147772 91136237 107907100 116274943 114473834 104013067 90302815
19068 90302815 76453426 64502377 55799919 51063496 50133598 52827469 59429710 70196944
19060 70196944 85158827 101637797 113256518 115752585 108159531 94289102 78754129
$$ packed form
19117F0977799J3056293J5863111J3546629N684605l880804j1459573j4142457
19110G9645603j4470316j2865521j0257519p407607n233628l809059k739744j974436
19102B0887773j629679j264993r70692q41624o57127m58125l46020l02358j47909
19093A4269246J7302L4441J4085J05167J50787J31512K55755L58633O20173P81329
19083A6738430J064609J637483K181340L119047M369947O192708Q673531J2082801
19075E6059896J6087876J8988465J6770863Q367843j801109j0460767j3710252
19068I0302815j3849389j1951049q702458m736423r29898K693871O602241J0767234
19060G0196944J4961883J6478970J1618721K496067p593054j3870429j5534973
$$ plain form
19053 78754129 63678336 50758603 40768834 33591317 28486177 24881809 22252157 20157223
19045 20157223 18341979 16887148 15662644 14714065 13959236 13317211 12855501 12418608 11975947
19036 11975947 11602173 11313948 11083784 10803297 10571662 10230240 9830914 9449183 9033886
19027 9033886 8705722 8381313 8034803 7771686 7589080 7382054 7217760 7119453 7027262 6821561
19017 6821561 6509370 6161281 5839270 5604057 5327946 5012192 4699568 4510447 4353545
19008 4353545 4171530 4026360 3821837 3632015 3493158 3326694 3135525 2961245 2850178
18999 2850178 2715060 2583377 2515636 2417623 2301410 2186288 2087353 1992181 1896059 1843668
18989 1843668 1753559 1683171 1635490 1577659 1514043 1453315 1431209 1360438 1208946 1098072 1069659
$$ packed form
19053G8754129j5075793j2919733r989769p177517n105140l604368k629652k094934
19045B0157223j815244j454831j224504r48579p54829o42025m61710m36893m42661
19036A1975947l73774k88225k30164k80487k31635l41422l99326l81731m15297
19027I033886l28164l24409l46510k63117j82606k07026j64294r8307r2191k05701
19017F821561l12191l48089l22011k35213k76111l15754l12624j89121j56902
19008D353545j82015j45170k04523j89822j38857j66464j91169j74280j11067
18999B850178j35118j31683o7741r8013j16213j15122r8935r5172r6122n2391
18989A843668r0109p0388m7681n7831o3616o0728k2106p0771j51492j10874k8413
$$ plain form
18978 1069659 1024349 956706 935419 907490 809088 753515 747476 646792 601886 573558 554477
18967 554477 555683 482924 469304 501029 492445 492933 511553 515608 524589 465153 408089 470129 556162
18954 556162 576587 543930 548819 535219 524061 481259 472258 507129 467739 409380 436698 531262
18942 531262 510265 485968 471160 468924 504301 543289 568208 511597 458808 452511 439872 335915
18930 335915 332431 265569 298377 321628 344845 315138 293673 281711 239662 169600 213547 272758
18918 272758 266238 220768 171605 152695 157310 152893 140453 134776 179847 141013 187486 301039
18906 301039 256004 147563 38899 71718 102477 103315 144058 143873 119861 135659 133831 147310
18894 147310 203138 230895 192599 210631 282891 246654 140161 61148 84680 118357 154878
$$ packed form
18978A069659m5310o7643k1287k7929r8402n5573o039j00684m4906k8328j9081
18967E54477J206p2759j3620L1725q584M88J8620M055Q981n9436n7064O2040Q6033
18954E56162K0425l2657M889j3600j1158m2802r001L4871l9390n8359K7318R4564
18942E31262k0997k4297j4808k236L5377L8988K4919n6611n2789o297j2639j03957
18930C35915l484o6862L2808K3251K3217k9707k1465j1962m2049p0062M3947N9211
18918B72758o520m5470m9163j8910M615m417j2440n677M5071l8834M6473J13553
18906C01039m5035j08441j08664L2819L0759Q38M0743j85k4012J5798j828J3479
18894A47310N5828K7757l8296J8032P2260l6237j06493p9013K3532L3677L6521
$$ plain form
18883 154878 200946 184676 109769 127698 161703 208873 320834 284780 241677 98787 105732
18872 105732 153865 144963 178170 201124 136888 125985 106567 54480 22133 10309 89267 190265
18860 190265 222302 216518 218687 191410 98942 66296 69037 106464 57474 9333 -11931 5207
18848 5207 40586 111771 127028 74896 27198 29059 54421 102743 113564 101763 34385 -3319
18836 -3319 -12097 -21539 -772 -7034 51975 26174 -8061 -30237 18994 75045 -14761 -27357
18824 -27357 -12719 30319 26773 13545 65554 38028 47838 6477 47215 -29581 -17991 -7950
18812 -7950 -61390 -74441 -75141 -18779 19955 -34556 -29205 -54075 -34242 29414 49927 -34617
18800 -34617 -56565 39955 4814 -22607 -62949 -157384 -161015 -162218 -89350 -70465 -71525 -69587
$$ packed form
18883A54878M6068j6270p4907J7929L4005M7170J11961l6054m3103j42890O945
18872A05732M8133q902L3207K2954o4236j0903j9418n2087l2347j1824P8958J00998
18860A90265L2037n784K169k7277r2468l2646K741L7427m8990m8141k1264J7138
18848E207L5379P1185J5257n2132m7698J861K5362M8322J0821j1801o7378l7704
18836c319q778r442K0767o262N9009k5801l4235k2176M9231N6051q9806j2596
18824b7357J4638M3038l546j3228N2009k7526R810m1361M0738p6796J1590J0041
18812g950n3440j3051p00N6362L8734n4511N351k4870J9833O3656K0513q4544
18800c4617k1948R6520l5141k7421m0342r4435l631j203P2868J8885j060J938
$$ plain form
18788 -69587 -54479 -122565 -53202 7883 -3726 14835 -8608 3488 -33466 -58624 -34003 35595
18776 35595 -16204 -7808 28083 13404 71848 105903 134406 158330 269185 460772 528996
18765 528996 518891 471407 363907 330483 257910 173976 134094 68165 71235 105083 100968 144454
18753 144454 107064 -10887 2956 48241 96830 117627 84660 42849 -32310 -13745 50673
18742 50673 19411 -33227 -14732 -29434 -36786 -51919 -114329 -81632 -144486 -143828 3420 6286
18730 6286 27815 -19041 58857 34929 63083 117761 99353 102575 81739 -10573 -69973 -74106
18718 -74106 -128874 -83759 -20906 -56356 -119331 -46624 -469 -2577 -32336 23994 -1044 18047
18706 18047 -4238 -30564 -49722 -65281 -31093 -93095 6671 60000 45184 97688 97791 135730
$$ packed form
18788f9587J5108o8086O9363O1085j1609J8561k3443J2096l6954k5158K4621O9598
18776C5595n1799Q396L5891j4679N8444L4055K8503K3924J10855J91587O8224
18765E28996j0105m7484j07500l3424p2573q3934l9882o5929L070L3848m115M3486
18753A44454l7390j17951J3843M5285M8589K0797l2967m1811p5159J8565O4418
18742E0673l1262n2638J8495j4702p352j5133o2410L2697o2854O58J47248K866
18730F286K1529m6856P7898k3928K8154N4678j8408L222k0836r2312n9400m133
18718g4106n4768M5115O2853l5450o2975P2707M6155k108k9759N6330k5038J9091
18706A8047k2285k6326j9158j5559L4188o2002R9766N3329j4816N2504J03L7939
$$ plain form
18694 135730 112664 93067 23532 31727 83956 114797 101337 12384 3695 -34881 5195 66208
18682 66208 80819 14794 -16941 -15845 -64890 -57453 -35079 3009 -11993 31807 89149 14959
18670 14959 1076 23525 -12478 -25157 -49070 -40333 -73866 -25332 -34865 -29725 8300 -30304
18658 -30304 34429 41118 -19286 50839 57855 113252 33234 -50890 -101071 -99972 -94322 -88247 -24026
18645 -24026 87947 70998 64611 19381 45475 64642 -15627 -53008 -42760 30712 97852 113208
18633 113208 183354 240409 286749 339649 417320 436627 485311 484161 364791 335257 359272
18622 359272 387336 389582 417801 425396 495581 594694 754329 944194 1110731 1112962 1091132
18611 1091132 1106120 1147149 1039164 894195 813343 697055 585722 512319 562186 635095
$$ packed form
18694A35730k3066j9597o9535Q195N2229L0841j3460q8953q689l8576M0076O1013
18682F6208J4611o6025l1735J096m9045P437K2374L8088j5002M3800N7342p4190
18670A4959j3883K2449l6003j2679k3913Q737l3533M8534r533N140L8025l8604
18658c0304O4733O689o0404P0125P016N5397q0018q4124n0181J099N650O075O4221
18645b4026J11973j6949o387m5230K6094J9167q0269l7381J0248P3472O7140J5356
18633A13208P0146N7055M6340N2900P7671J9307M8684j150j19370k9534K4015
18622C59272K8064K246K8219P595P0185R9113J59635J89865J66537K231k1830
18611A091132J4988M1029j07985j44969q0852j16288j11333p3403M9867P2909
$$ plain form
18601 635095 796006 955278 1002000 985409 966880 922031 914149 829387 684735 538622 445294
18590 445294 440296 437490 333222 252556 229585 288575 329337 340593 321366 266468 229412 192548
18578 192548 113249 81273 166744 192832 215633 229543 191910 171755 162974 123773 196530 214605
18566 214605 136734 132849 222347 241954 219833 230175 201217 165096 245346 357123 443287
18555 443287 535686 562462 474747 402727 383656 363953 377301 361023 265932 289442 366358
18544 366358 410485 402597 412668 498559 644006 627419 683852 657958 541692 495905 347020
18533 347020 226061 181405 188250 191236 239348 201637 128208 103489 165513 160611 78135 78365
18521 78365 99800 80631 71712 53975 40441 47519 85873 137411 92657 97103 90223 46697
$$ packed form
18601F35095J60911J59272M6722j6591j8529m4849p882q4762j44652j46113r3328
18590D45294m998k806j04268q0666k2971N8990M0762J1256j9227n4898l7056l6864
18578A92548p9299l1976Q5471K6088K2801J3910l7633k0155q781l9201P2757J8075
18566B14605p7871l885Q9498J9607k2121J0342k8958l6121Q0250J11777Q6164
18555D43287R2399K6776q7715p2020j9071j9703J3348j6278r5091K3510P6916
18544C66358M4127p888J0071Q5891J45447j6587N6433k5894j16266m5787j48885
18533C47020j20959m4656O845K986M8112l7711p3429k4719O2024m902q2476K30
18521G8365K1435j9169q919j7737j3534P078L8354N1538m4754M446o880m3526
$$ plain form
18509 46697 -3408 27215 32343 71871 100277 89316 114087 98151 115422 91577 31265 -17426
18497 -17426 -13193 104139 183560 128601 -31497 -87354 -52554 -31290 -91132 -54900 -17550
18486 -17550 11871 73363 94291 82447 43335 49553 -9152 -44194 -72034 -34784 -97968 -113108
18474 -113108 6463 19034 -19855 16088 -14558 -877 -52713 -85911 6620 40534 13925
18463 13925 -73686 -59952 -12171 -1166 -31262 -58625 -72369 -11269 62865 44925 8880 24335
18451 24335 39385 47542 19262 46076 80021 38532 29726 118378 104643 61507 102160 149142
18439 149142 163288 131643 60195 3522 -34021 -83175 -87670 -57883 -97993 -53859 -1326 -29121
18427 -29121 -26847 -2628 30986 -8545 5003 -23895 -29530 26056 68989 123296 99131 87959
$$ packed form
18509D6697n0105L0623N128L9528K8406j0961K4771j5936J7271k3845o0312m8691
18497a7426M233J17332P9421n4959j60098n5857L4800K1264n9842L6232L7350
18486a7550K9421O1492K0928j1844l9112O218n8705l5042k7840L7250o3184j5140
18474a13108J19571J2571l8889L5943l0646J3681n1836l3198R2531L3914k6609
18463A3925q7611J3734M7781J1005l0096k7363j3744O1100P4134j7940l6045J5455
18451B4335J5050Q157k8280K6814L3945m1489q806Q8652j3735m3136M0653M6982
18439A49142J4146l1645p1448n6673l7543m9154m495K9787m0110M4134N2533k7795
18427b9121K274K4219L3614l9531J3548k8898n635N5586M2933N4307k4165j1172
$$ plain form
18415 87959 94100 36513 52026 -13198 -40227 -34095 -48582 -83799 -89670 -97364 -78529 -86785 -64908
18402 -64908 -74170 -67558 -40987 -6000 3587 61044 191482 212947 178724 65329 65949 26668
18390 26668 67604 123205 159054 185511 195072 175683 253966 277693 298594 291098 252167 221733
18378 221733 261662 184002 80022 13445 -23313 18674 31239 31704 94975 109874 99226 142971
18366 142971 82994 97382 167738 108249 69199 74461 84063 27024 34260 92572 140260 127401
18354 127401 88330 50064 41949 -37704 -43470 55851 97298 75352 103402 124801 89975 75631
18342 75631 62593 1764 -12971 27725 6882 35111 78739 55337 96266 85994 185107 181777
18330 181777 145162 129820 152451 236854 307707 310805 302930 288397 188927 163563 187619 99843
$$ packed form
18415H7959O141n7587J5513o5224k7029O132j4487l5217n871p694J8835q256K1877
18402f4908r262O612K6571L4987R587N7457J30438K1465l4223j13395O20l9281
18390B6668M0936N5601L5849K6457R561j9389P8283K3727K0901p496l8931l0434
18378B21733L9929p7660j03980o6577l6758M1987J2565M65O3271J4899j0648M3745
18366A42971n9977J4388P0356n9489l9050N262R602n7039P236N8312M7688j2859
18354A27401l9071l8266q115p9653n766R9321M1447k1946K8050K1399l4826j4344
18342G5631j3038o0829j4735M0696k0843K8229M3628k3402M0929j0272R9113l330
18330A81777l6615j5342K2631Q4403P0853L098p875j4533r9470k5364K4056q7776
$$ plain form
18318 99843 61917 35064 63208 92628 25360 -29091 15788 -2541 35500 49181 48522 -29175
18306 -29175 -43964 -90315 -112379 -126309 -31502 11067 53417 110082 63177 78220 68693 34638
18294 34638 59337 89086 75062 45458 28461 60536 75199 58101 79759 111979 158713 195457
18282 195457 159817 115733 83835 98253 27976 31485 52924 -603 -36496 7340 61188 35181
18270 35181 -99502 -107813 -87470 -11480 90350 109446 89798 103735 129423 52877 29275
18259 29275 49887 28721 -29863 -95970 -119973 -146802 -59220 25573 40714 278 -3660 -1381
18247 -1381 14706 102111 60135 54829 108934 133377 107621 -11197 -118506 -81051 -18219 61485
18235 61485 112291 94756 143551 197717 237779 250992 170007 104201 38491 44370 56261 10847
$$ packed form
18318I9843l7926k6853K8144K9420o7268n4451M4879j8329L8041J3681o59p7697
18306b9175j4789m6351k2064j3930R4807M2569M2350N6665m6905J5043r527l4055
18294C4638K4699K9749j4024k9604j6997L2075J4663j7098K1658L2220M6734L6744
18282A95457l5640m4084l1898J4418p0277L509K1439n3527l5893M3836N3848k6007
18270C5181j34683q311K0343P5990J01830J9096j9648J3937K5688p6546k3602
18259B9275K0612k1166n8584o6107k4003k6829Q7582Q4793J5141m0436l938K279
18247a381J6087Q7405m1976n306N4105K4443k5756j18818j07309L7455O2832P9704
18235F1485N0806j7535M8795N4166M0062J3213q0985o5806o5710N879J1891m5414
$$ plain form
18223 10847 11627 50988 93189 76867 6003 -23898 -2700 -59090 -119923 -126217 -57454 -27437
18211 -27437 -44628 54805 164967 140948 101316 86139 -10063 -7470 33870 26112 -30950 47835
18199 47835 90987 20849 51218 102229 59273 33128 93277 154600 123331 97274 74251 73137
18187 73137 -1320 -30716 41811 102031 146877 128030 166528 224027 204438 145945 151503 227289
18175 227289 175267 145156 239819 306720 315772 308562 297789 261899 253448 278605 316902 322937
18163 322937 340252 347192 368501 366905 272082 239401 308759 283766 239557 222960 212318 276401
18151 276401 297909 391228 500104 470212 386013 407501 474343 501498 521267 508919 536807
18140 536807 657909 693564 748212 789338 855011 846055 868782 980064 1036164 1130100 1258185
$$ packed form
18223A0847P80L9361M2201j6322p0864k9901K1198n6390o0833o294O8763L0017
18211b7437j7191R9433J10162k4019l9632j5177r6202K593M1340p758n7062P8785
18199D7835M3152p0138L0369N1011m2956k6145O0149O1323l1269k6057k3023j114
18187G3137p4457k9396P2527O0220M4846j8847L8498N7499j9589n8493N558P5786
18175B27289n2022l0111R4663O6901R052p210j0773l5890q451K5157L8297O035
18163C22937J7315O940K1309j596r4823l2681O9358k4993m4209j6597j0642O4083
18151B76401K1508R3319J08876k9892q4199K1488O6842K7155J9769j2348K7888
18140E36807J21102L5655N4648M1126O5673q956K2727J11282N6100R3936J28085
$$ plain form
18129 1258185 1303572 1371000 1504701 1637932 1782637 2082079 2399910 2728811 3203298 3873264
18119 3873264 4699724 5760865 7207334 9250867 11996367 15833563 21398167 29461627
18111 29461627 41174938 57807462 79799085 100821092 102560734 90532242 76461600
18104 76461600 60874872 45666387 33405307 25067318 19572794 15860926 13206240 11255774
18096 11255774 9798238 8615341 7712550 6986169 6495936 6031727 5566507 5244467 5020516
18087 5020516 4816283 4582357 4343039 4110548 3949214 3899684 3760964 3657105 3649415 3601364
18077 3601364 3562254 3536867 3521457 3510138 3474037 3461801 3474457 3461346 3482281 3487736 3321612
18066 3321612 3154704 3033642 2869042 2688942 2558741 2491316 2438005 2358622 2107797 1931697
$$ packed form
18129A258185M5387O7428J33701J33231J44705K99442L17831L28901M74487O69966
18119C873264Q26460J061141J446469K043533K745500L837196N564604Q063460
18111B9461627J1713311J6632524K1991623K1022007J739642j2028492j4070642
18104G6461600j5586728j5208485j2261080q337989n494524l711868k654686j950466
18096A1255774j457536j182897r02791p26381m90233m64209m65220l22040k23951
18087E020516k04233k33926k39318k32491j61334m9530j38720j03859p690m8051
18077C601364l9110k5387j5410j1319l6101j2236J2656j3111K0935N455j66124
18066C321612j66908j21062j64600j80100j30201o7425n3311p9383k50825j76100
$$ plain form
18056 1931697 1814523 1703686 1660736 1549220 1489351 1394294 1275082 1253153 1213314 1216928 1172485
18045 1172485 1040471 887641 859399 905850 890811 785928 750591 701234 665620 633081 601961
18034 601961 569096 534283 530299 488512 452916 432004 420095 388006 371034 320773 344479 344518
18022 344518 277574 281932 366935 336235 304550 236926 184977 165944 113958 132172 125694 208206
18010 208206 231117 220120 141490 37383 52024 104507 108014 76438 112893 141177 105166
17999 105166 49386 49776 71976 70725 123588 106588 111202 171033 216947 191960 213093 267545
17987 267545 233813 180127 167169 225744 233710 201576 184459 165065 161265 178125 174286 169529
17975 169529 123955 72046 51245 -15615 -50687 -50365 -34077 -3984 16742 -54297 -70879 -11883
$$ packed form
18056A931697j17174j10837m2950j11516n9869r5057j19212k1929l9839L614m4443
18045A172485j32014j52830k8242M6451j5039j04883l5337m9357l5614l2539l1120
18034F01961l2865l4813l984m1787l5596k0912j1909l2089j6972n0261K3706L9
18022C44518o6944M358Q5003l0700l1685o7624n1949j9033n1986J8214o478Q2512
18010B08206K2911j0997p8630j04107J4641N2483L507l1576L6455K8284l6011
17999A05166n5780L90K2200j251N2863j7000M614N9831M5914k4987K1133N4452
17987B67545l3732n3686j2958N8575P966l2134j7117j9394l800J6860l839m757
17975A69529m5574n1909k0801o6860l5072L22J6288L0093K0726p1039j6582N8996
$$ plain form
17963 -11883 828 -33183 -29045 -58322 -34026 37365 74387 23909 -6857 -41197 -82826 -21431
17951 -21431 -29624 9038 7192 -89861 -107235 -65737 -26535 -38226 -21281 -6025 49193 32673
17939 32673 -45857 -112241 -116540 -121016 -29483 49294 45014 38789 98932 34499 -72786 -62434
17927 -62434 -47224 24969 124123 141912 96968 84949 56140 45833 95342 96357 -15108 -47526
17915 -47526 69490 132405 100348 113302 63708 33012 9228 15032 24786 12335 20950 64243
17903 64243 52696 -4382 -58816 -40768 -79176 -20434 -9064 -39011 -36512 -19083 21189 40931
17891 40931 45853 94720 89138 -14376 -6881 -33622 -69060 -118022 -93114 -23084 -62832 -56475
17879 -56475 -54512 -112766 -137424 -141111 -58542 -3359 81173 115761 30700 -81851 -108041 -96115
$$ packed form
17963a1883J2711l4011M138k9277K4296P1391L7022n0478l0766l4340m1629O1395
17951b1431q193L8662j846r7053j7374M1498L9202j1691J6945J5256N5218j6520
17939C2673p8530o6384m299m476R1533P8777m280o225O0143o4433j07285J0352
17927f2434J5210P2193R9154J7789m4944j2019k8809j0307M9509J015j11465l2418
17915d7526J17016O2915l2057J2954m9594l0696k3784N804R754j2451Q615M3293
17903F4243j1547n7078n4434J8048l8408N8742J1370k9947K499J7429M0272J9742
17891D0931M922M8867n582j03514P495k6741l5438m8962K4908P0030l9748O357
17879e6475J963n8254k4658l687Q2569N5183Q4532L4588q5061j12551k6190J1926
$$ plain form
17867 -96115 -34253 -44488 -74482 -11965 -18747 -20713 60149 86560 25294 -26905 -46170 -39738
17855 -39738 -1199 60091 131720 127585 140977 138125 103230 62368 46969 6823 -20924 -9550
17843 -9550 -38723 -43427 -66069 -85845 -47713 -12643 -60232 -128062 -114064 -28101 43764 86110
17831 86110 34437 56965 90432 150812 193172 209512 85725 9435 -30710 -82016 -68224
17820 -68224 -9952 18670 880 -33922 18742 42106 115540 93662 7978 -755 42381 -26936
17808 -26936 -47108 -30823 10445 -19879 -24193 -41874 -26149 39153 40575 -11304 -111818 -97641
17796 -97641 25725 152567 119619 20308 -34182 -29829 -96359 -141869 -121985 -150182 -82289
17785 -82289 -15833 50428 23365 -45766 -152528 -172471 -104445 -112162 -103298 -57192 -6345 -42881
$$ packed form
17867i6115O1862j0235k9994O2517o782j966Q0862K6411o1266n2199j9265O432
17855c9738L8539O1290P1629m135J3392k852l4895m0862j5399m0146k7747J1374
17843i550k9173m704k2642j9776L8132L5070m7589o7830J3998Q5963P1865M2346
17831H6110n1673K2528L3467O0380M2360J6340j23787p6290m0145n1306J3792
17820f8224N8272K8622j7790l4802N2664K3364P3434k1878q5684q733M3136o9317
17808b6936k0172J6285M1268l0324m314j7681J5725O5302J422n1879j00514J4177
17796i7641J23366J26842l2948r9311n4490M353o6530m5510J9884k8197O7893
17785h2289O6456O6261k7063o9131j06762j9943O8026p717Q864M6106N0847l6536
$$ plain form
17773 -42881 -23015 2040 541 76 -37004 -19660 21381 20284 48893 68162 57243 106090
17761 106090 27591 -24238 -29630 -57589 -102118 -81077 -60346 -5045 -53749 -133007 -118991 -106141
17749 -106141 -63979 -85060 -62660 -40117 6426 -44355 -113866 -133967 -124353 -121665 -115334 -161964
17737 -161964 -92481 -17374 26692 25532 -4368 -100748 -206959 -204971 -110700 -98462 -102840 -82998
17725 -82998 -133725 -174030 -184071 -170790 -131914 -125028 -46762 -13191 -4427 -13436 -21375 13540
17713 13540 35795 -89290 -84218 -66915 -76692 -119639 -57071 -448 12037 -42432 -70901 -57787
17701 -57787 -48411 45895 92257 71829 97065 -4976 -53175 -29800 -17222 15 40565 -1753
17689 -1753 -78020 -59700 -112369 -67179 -14416 -9715 -22662 -61926 -102808 -85302 -64833 -81354
$$ packed form
17773d2881J9866K5055j499m65l7080J7344M1041j097K8609J9269j0919M8847
17761A06090p8499n1829n392k7959m4529K1041K0731N5301m8704p9258J4016J2850
17749a06141M2162k1081K2400K2543M6543n0781o9511k0101R614K688O331m6630
17737a61964O9483P5107M4066j160k9900r6380j06211J988R4271J2238m378J9842
17725h2998n0727m0305j0041J3281L8876O886P8266L3571Q764r009p939L4915
17713A3540K2255j25085N072J7303r777m2947O2568N6623J2485n4469k8469J3114
17701e7787R376R4306M6362k0428K5236j02041m8199K3375J2578J7237M0550m2318
17689a753p6267J8320n2669M5190N2763M701j2947l9264m0882J7506K0469j6521
$$ plain form
17677 -81354 -70295 -33636 -42682 -83927 -51629 -18804 -49434 -59280 -128566 -139459 -141492 -158926
17665 -158926 -115710 -80820 -75067 -11315 42782 -32994 -85301 -53998 -335 2186 -79062 -135435
17653 -135435 -164620 -169187 -131499 -119542 -153999 -135793 -45687 -8117 -44089 -79749 -45619 -94651
17641 -94651 -135894 -105153 -48524 -98356 -128335 -121763 -79827 -28435 -8063 -60090 -48787 -10398
17629 -10398 -86143 -148927 -115400 -24078 3245 -66020 -65392 11331 10927 -9074 -56296 -85383
17617 -85383 -122778 -103939 -123772 -84276 -68982 -40623 -950 5841 -4920 -28438 -59847 -43904
17605 -43904 -89059 -134604 -153478 -166492 -135161 -111388 -103548 -77485 23218 44914 4936 24722
17593 24722 88643 72404 6386 -72643 -36311 13716 -28110 -73108 -7439 -22306 -70653 -87357
$$ packed form
17677h1354J1059L6659r046m1245L2298L2825l0630r846o9286j0893k033j7434
17665a58926M3216L4890N753O3752N4097p5776n2307L1303N3663K521q1248n6373
17653a35435k9185m567L7688J1957l4457J8206R0106L7570l5972l5660L4130m9032
17641i4651m1243L0741N6629m9832k9979O572M1936N1392K0372n2027J1303L8389
17629a0398p5745o2784L3527R1322K7323o9265O28P6723m04k0001m7222k9087
17617h5383l7395J8839j9833L9496J5294K8359L9673O791j0761k3518l1409J5943
17605d3904m5155m5545j8874j3014L1331K3773P840K6063J00703K1696l9978J9786
17593B4722O3921j6239o6018p9029L6332N0027m1826m4998O5669j4867m8347j6704
$$ plain form
17581 -87357 -84102 -69408 -1633 65384 7565 -64866 -53162 -43145 365 12278 38531 55789
17569 55789 50703 22562 52122 103601 36149 2267 -91827 -93665 -66403 -88736 -113612 -134843
17557 -134843 -32554 -8048 30134 -3284 -23595 -39536 47407 126097 132408 46532 -33400
17546 -33400 -52685 -73967 -70251 -55769 -45510 -47189 20 -59163 -104419 -114511 -98111 -123795
17534 -123795 -59251 -32228 -11323 31197 -49715 -131043 -138015 -90457 -26185 -42784 -86808 -21621
17522 -21621 54601 74419 -17207 -30580 -58187 -80935 -88316 -99082 -60207 -127077 -138427 -94894
17510 -94894 -52899 4535 -29259 -45400 -69734 -127951 -77645 -71979 -78002 -73443 -103679 -118065
17498 -118065 -84151 -67808 23159 49746 33468 -51738 -2338 -29122 -66935 -45401 -45629 -40193
$$ packed form
17581h7357L255J4694O7775O7017n7819p2431J1704J0017M3510J1913K6253J7258
17569E5789n086k8141K9560N1479o7452l3882r4094j838K7262k2333k4876k1231
17557a34843J02289K4506L8182l3418k0311j5941Q6943P8690O311q5876p9932
17546c3400j9285k1282L716J4482J0259j679M7209n9183m5256j0092J6400k5684
17534a23795O4544K7023K0905M2520q0912q1328o972M7558O4272j6599m4024O5187
17522b1621P6222J9818r1626j3373k7607k2748p381j0766L8875o6870j1350M3533
17510i4894M1995N7434l3794j6141k4334n8217N0306N666o023M559l0236j4386
17498a18065L3914J6343R0967K6587j6278q5206M9400k6784l7813K1534k28N436
$$ plain form
17486 -40193 -6480 -5252 -85604 -60716 -34005 -50322 -55156 -89029 -94980 -58100 -45517 -32184
17474 -32184 7031 55008 56473 22232 -29383 -30842 -68277 -27326 -70450 -20338 25312 80618
17462 80618 1131 -79531 -55263 -105752 -122010 -49617 11995 -6323 28724 45342 101096 20372
17450 20372 -48287 -70591 -22222 -45850 -93006 -16391 87940 293978 446914 487344 480033
17439 480033 492876 422090 254193 127280 64723 41885 30587 -23832 -4785 8688 8506
17428 8506 -22618 6010 -53010 -37711 -2184 55306 53580 48460 20232 21503 22335 13275 40613
17415 40613 20566 -87169 -127789 -24065 19738 -32867 -45250 -86150 -54013 -67785 -148662
17404 -148662 -154291 -161876 -154266 -106613 -87285 -118302 -137665 -80759 -63929 -3322 27029 79252
$$ packed form
17486d0193L3713J228q0352K4888K6711j6317m834l3873n951L6880J2583J3333
17474c2184L9215M7977J465l4241n1615j459l7435M0951m3124N0112M5650N5306
17462H0618p9487q0662K4268n0489j6258P2393O1612j8318L5047J6618N5754q0724
17450B0372o8659k2304M8369k3628m7156P6615J04331K06038J52936M0430p311
17439D80033J2843p0786j67897j26913o2557k2838j1298n4419J9047J3473j82
17428H506l1124K8628n9020J5299L5527N7490j726n120k8228J271Q32r060K7338
17415D0613k0047j07735m0620J03724M3803n2605j2383m0900L2137j3772q0877
17404a48662n629p585P610M7653J9328l1017j9363N6906J6830O0607L0351N2223
$$ plain form
17392 79252 32650 -11032 -28047 -19780 66553 34072 -24613 -42371 -12009 -12182 21783 -6654
17380 -6654 -24687 -23804 -16165 -39010 -106131 -178071 -147413 -131499 -151086 -112475 -128911 -119666 -102631
17367 -102631 -140366 -119415 -104303 -84515 -56044 -40636 84247 76080 78603 121662 67681 12153
17355 12153 11635 -54565 -74388 -89154 -153332 -154065 -77413 -50369 -159908 -180350 -176903 -81127
17343 -81127 -13090 28869 17902 -4183 5921 -20174 -687 -39520 -39498 -90243 -71449 -8000
17331 -8000 -36352 -125632 -99209 -83012 -49628 4197 11737 -16287 -55998 -42157 -45383 -79855
17319 -79855 -67742 -24216 55626 -2260 20908 9052 -25185 -32675 -7660 -7508 -31955 -46696
17307 -46696 10315 3640 -64470 -60273 -12858 -17392 -3679 16162 19086 -8295 17908 -38382
$$ packed form
17392G9252m6602m3682j7015Q267Q6333l2481n8685j7758L0362j73L3965k8437
17380f654j8033Q83P639k2845o7121p1940L0658J5914j9587L8611j6436R245J7035
17367a02631l7735K0951J5112J9788K8471J5408J24883q167K523M3059n3981n5528
17355A2153n18o6200j9823j4766o4178p33P6652K7044j09539k0442L447R5776
17343h1127O8037M1959j0967k2085J0104k6095J9487l8833K2n0745J8794O3449
17331h000k8352q9280K6423J6197L3384N3825P540k8024l9711J3841l226l4472
17319g9855J2113M3526P9842n7886K3168j1856l4237p490K5015J52k4447j4741
17307d6696N7011o675o8110M197M7415m534J3713J9841K924k7381K6203n6290
$$ plain form
17295 -38382 -26455 91528 78875 67341 101292 127800 138860 206234 269555 343019 438104
17284 438104 480073 543966 689831 743895 765193 853172 886405 947809 880518 783090 691249
17273 691249 548208 373739 205162 164446 166464 230990 240521 187516 170801 215340 169767
17262 169767 98632 88999 178110 150077 148014 93001 49759 79243 91052 97190 5931 -33856
17250 -33856 -18493 16201 17959 32843 38096 39654 93751 84128 28387 28319 67543 57225 43668
17237 43668 76045 32821 59430 28126 66708 122148 150470 268753 424647 570534 676160
17226 676160 739436 818644 859738 896256 829299 787242 750124 722084 641358 550652 404500
17215 404500 312250 249899 161574 191420 198740 236645 289078 290938 176034 156676 175276 131912
$$ packed form
17295c8382J1927J17983j2653j1534L3951K6508J1060O7374O3321P3464R5085
17284D38104M1969O3893J45865N4064K1298Q7979L3233O1404o7291r7428r1841
17273F91249j43041j74469j68577m0716K018O4526R531n3005j6715M4539m5573
17262A69767p1135r633Q9111k8033k063n5013m3242K9484J1809O138r1259l9787
17250c3856J5363L4694J758J4884N253J558N4097r623n5741o8L9224j0318j3557
17237D3668L2377m3224K6609l1304L8582N5440K8322J18283J55894J45887J05626
17226F76160O3276P9208M1094L6518o6957m2057l7118k8040q0726r0706j46152
17215D04500r2250o2351q8325K9846P320L7905N2433J860j14904j9358J8600m3364
$$ plain form
17203 131912 82054 -78 -15647 30889 57593 38268 -8262 -10259 9703 32141 141402
17192 141402 207072 166491 48813 -8964 44059 7235 16863 9534 -1754 -55162 27362 27524
17180 27524 -6318 -16005 5122 -31240 9984 33237 49871 58289 70533 -50406 -133972 -133673
17168 -133673 -125725 -72101 -39241 -13591 -61442 1498 19698 -30198 -84554 -67685 -15652 -20351
17156 -20351 -63948 -71845 -43813 -76075 -65724 -13309 44093 51160 42788 47439 12541 -48642
17144 -48642 -58383 -100263 -66254 58055 179124 134322 52684 32544 74721 92106 35203
17133 35203 10623 7574 47716 118830 156120 100056 8623 3290 -2338 -10113 -21944 -42305
17121 -42305 -24402 -26273 -11454 28022 60990 -474 16564 -11371 9177 14767 -13883 -4530
$$ packed form
17203A31912m9858q2132j5569M6536K6704j9325m6530j997J9962K2438J09261
17192A41402O5670m0581j17678n7777N3023l6824R628p329j1288n3408Q2524J62
17180B7524l3842r687K1127l6362M1224K3253J6634Q418J2244j20939q3566K99
17168a33673P948N3624L2860K5650m7851O2940J8200m9896n4356J6869N2033m699
17156b0351m3597p897K8032l2262J0351N2415N7402P067q372M651l4898o1183
17144d8642r741m1880L4009J24309J21069m4802q1638k0140M2177J7385n6903
17133C5203k4580l049M0142P1114L7290n6064r1433n333n628p775j1831k0361
17121d2305J7903j871J4819L9476L2968o1464J7038k7935K0548N590k8650R353
$$ plain form
17109 -4530 -12544 -102301 -145449 -135301 -124335 -127608 -155565 -85664 26730 95477 74598 101793
17097 101793 59622 35197 15378 46243 94066 121762 119424 90504 66559 23104 9129 27824
17085 27824 35908 78083 94918 55631 -3878 -701 94147 120577 75169 22694 40850 89281
17073 89281 -3529 19255 13366 707 45980 73194 37948 -40460 -92501 -69903 -3793 -52551
17061 -52551 -130785 -150349 -124724 19862 98509 32449 47157 16233 64558 68571 -19660 -36572
17049 -36572 4889 19836 31870 103101 134691 136022 130201 135483 23095 24799 54261 58532
17037 58532 65096 133366 147551 97513 90487 27174 55739 59849 24230 70175 67565 111248
17025 111248 140836 94013 110327 150991 128070 134242 105507 153235 224791 240767 247216 157157
$$ packed form
17109d530q014q9757m3148J0148J0966l273k7957O9901J12394O8747k0879K7195
17097A01793m2171k4425j9819L0865M7823K7696k338k8920k3945m3455j3975J8695
17085B7824Q084M2175J6835l9287n9509L177R4848K6430m5408n2475J8156M8431
17073H9281r2810K2784n889j2659M5273K7214l5246p8408n2041K2598O6110m8758
17061e2551p8234j9564K5625J44586P8647o6060J4708l0924M8325M013q8231j6912
17049c6572M1461J4947J2034P1231L1590J331n821N282j12388J704K9462M271
17037E8532O564O8270J4185n0038p026o3313K8565M110l5619M5945k610M3683
17025A11248K9588m6823J6314M0664k2921O172k8735M7728P1556J5976O449r0059
$$ plain form
17013 157157 117972 144683 148519 193011 134239 143973 124405 123781 136052 159671 52483 -2380
17001 -2380 65276 139287 108166 76814 32696 106361 140024 92680 145225 199205 197416 226297
16989 226297 209156 217882 204588 199673 188211 157473 141630 150387 100108 130096 217120 245656
16977 245656 240307 201619 152958 238622 220661 161436 109669 186465 238535 218693 214883 216551
16965 216551 189589 224834 254659 117253 92168 181456 252254 240595 252144 208967 215729
16954 215729 256921 344170 325524 300255 290050 200756 168723 90882 71070 31414 48076
16943 48076 101422 90679 114703 116314 85209 79219 178297 291736 309398 262769 146318 83598
16931 83598 23288 69096 86069 123782 160238 169359 185758 207454 216831 196286 226321 240542
$$ packed form
17013A57157l9185K6711L836M4492n8772R734j9568o24J2271K3619j07188n4863
17001b380O7656P4011l1121l1352m4118P3665L3663m7344N2545N3980j789K8881
16989B26297j7141Q726j3294m915j1462l0738j5843Q757n0279K9988Q7024K8536
16977B45656n349l8688m8661Q5664j7961n9225n1767P6796N2070j9842l810J668
16965B16551k6962L5245K9825j37406k5085Q9288P0798j1659J1549m3177O762
16954B15729M1192Q7249j8646k5269j0205q9294l2033p7841j9812l9656J6662
16943D8076N3346j0743K4024J611l1105n990R9078J13439J7662m6629j16451o2720
16931H3598o0310M5808J6973L7713L6456R121J6399K1696R377k0545L0035J4221
$$ plain form
16919 240542 240374 256850 251234 256965 212705 156671 117824 67773 25237 -46631 -65564 29719
16907 29719 84729 68779 132119 191255 187696 137099 176604 261204 288704 255690 290875 347155
16895 347155 345598 342201 353911 311729 329046 386159 339416 356040 296448 276391 242200 209453
16883 209453 227029 232573 182814 160033 129292 79981 89224 136407 91883 83741 107682 98043
16871 98043 155887 203382 190056 236102 249099 224502 184479 174196 137236 181597 165414 167022
16859 167022 200138 324778 354062 368323 377142 375044 430433 394213 393377 443939 453158 510231
16847 510231 515484 442150 449683 464870 526361 542820 504476 564165 648210 721948 717350 677792
16835 677792 733332 807250 817174 858160 824275 866001 861829 817332 791650 887835 968070 1003027
$$ packed form
16919B40542j68J6476n616N731m4260n6034l8847n0051m2536p1868j8933R5283
16907B9719N5010j5950O3340N9136l559n0597L9505Q4600K7500l3014L5185N6280
16895C47155j557l397J1710m2182J7317N7113m6743J6624n9592k0057l4191l2747
16883B09453J7576N544m9759k2781l0741m9311R243M7183m4524q142K3941r639
16871I8043N7844M7495j3326M6046J2997k4597m0023j0283l6960M4361j6183J608
16859A67022L3116J24640K9284J4261Q819k098N5389l6220q36N0562R219N7073
16847E10231N253p3334P533J5187O1491J6459l8344N9689Q4045P3738m598l9558
16835F77792N5540P3918R924M0986l3885M1726m172m4497k5682R6185Q0235L4957
$$ plain form
16823 1003027 1053336 1024521 963693 1021423 1112509 1089101 1086423 1123585 1191065 1173258 1190369
16812 1190369 1260345 1290314 1301068 1337508 1393856 1333533 1362326 1494234 1508765 1505961 1512338
16801 1512338 1622253 1789479 1969775 2068174 2130985 2181099 2307039 2494308 2717575 2962991
16791 2962991 3267586 3588470 3871659 4172514 4464776 4830532 5281569 5757953 6364388
16782 6364388 7047760 7918473 8981779 10260027 11993572 14456264 17721662 22166980
16774 22166980 28245763 36636387 47997400 62548292 79308602 95828172 110655931
16767 110655931 125259530 140389760 153154236 158405434 155508522 148283935 139053475
16760 139053475 127358890 112629773 96336509 80595832 66490414 54395159 44668994
$$ packed form
16823A003027N0309k8815o0828N7730R1086k3408k678L7162O7480j7807J7111
16812A190369O9976K9969J0754L6440N6348o0323K8793J31908J4531k804O377
16801A512338J09915J67226J80296R8399O2811N0114J25940J87269K23267K45416
16791B962991L04595L20884K83189L00855K92262L65756M51037M76384O06435
16782F364388O83372Q70713J063306J278248J733545K462692L265398M445318
16774B2166980O078783Q390624J1361013J4550892J6760310J6519570J4827759
16767A10655931J4603599J5130230J2764476N251198k896912p224587r230460
16760A39053475j1694585j4729117j6293264j5740677j4105418j2095255r726165
$$ plain form
16753 44668994 37162145 31596460 27502375 24451715 22281854 20478348 19007822 17919037
16745 17919037 17038271 16324165 15670426 15070953 14703535 14280297 13850778 13552172 13316835
16736 13316835 13169597 13107924 13110204 13148271 13297855 13486906 13755311 14094165 14486686 14962820
16726 14962820 15441234 15911175 16577674 17354917 18477020 19987567 22097766 25124607 29469194
16717 29469194 35601918 44165390 55657846 69958603 85837241 100938360 114583955
16710 114583955 128223457 141946483 152082722 154195381 149179998 140997543 131099119
16703 131099119 118796378 103795066 88010955 73185453 60089561 49089183 40400325
16696 40400325 33783724 28850467 25229965 22554043 20465236 18799894 17399789 16193747
$$ packed form
16753D4668994p506849n565685m094085l050660k169861j803506j470526j088785
16745A7919037q80766p14106o53739n99473l67418m23238m29519k98606k35337
16736A3316835j47238o1673K280L8067J49584J89051K68405L38854L92521M76134
16726A4962820M78414M69941O66499P77243J122103J510547K110199L026841M344587
16717B9469194O132724Q563472J1492456J4300757J5878638J5101119J3645595
16710A14583955J3639502J3723026J0136239K112659n015383q182455r898424
16703A31099119j2302741j5001312j5784111j4825502j3095892j1000378q688858
16696D0400325o616601m933257l620502k675922k088807j665342j400105j206042
$$ plain form
16688 16193747 15247283 14460741 13803540 13094728 12455251 11955049 11555523 11099724 10697445
16679 10697445 10373833 10099702 9966122 9794603 9658126 9581078 9492738 9330677 9171077 9041597
16669 9041597 8976390 8858380 8671982 8420972 8035639 7719373 7400144 7028166 6616426 6321238
16659 6321238 6014839 5653717 5380353 5049399 4738409 4510706 4283349 4093927 3926179
16650 3926179 3744567 3599662 3493951 3363385 3231245 3061315 2887114 2855567 2800488 2650255
$$ packed form
16688A6193747r46464p86542o57201p08812o39477n00202l99526m55799m02279
16679A0697445l23612k74131j33580j71519j36477p7048q8340j62061j59600j29480
16669I041597o5207j18010j86398k51010l85333l16266l19229l71978m11740k95188
16659F321238l06399l61122k73364l30954l10990k27703k27357j89422j67748
16650C926179j81612j44905j05711j30566j32140j69930j74201l1547n5079j50233
$$ [...]
##END NTUPLES=NMR SPECTRUM
##END=
