##TITLE=Analysis number 307278
Compound Code mo 07650
Book Reference 424/191
Project Code adrs
Chemist Name colinb
##JCAMPDX= 6.0         $$ Bruker NMR JCAMP-DX V2.0
##DATA TYPE= NMR SPECTRUM
##DATA CLASS= NTUPLES
##ORIGIN= Bruker BioSpin GmbH
##OWNER= NMR
$$ XWIN-NMR		Version 3.5
$$ Tue Apr 26 14:49:54 2005 GMT Daylight Time (UT+1h)  MAYBRIDGE\NMR@NMR_250MHZ
##.OBSERVE FREQUENCY= 250.131544655141
##.OBSERVE NUCLEUS= ^1H
##.ACQUISITION MODE= SIMULTANEOUS (DQD)
##.ACQUISITION SCHEME= undefined
##.AVERAGES= 16
##.DIGITISER RES= 18
##SPECTROMETER/DATA SYSTEM= dpx250
##.PULSE SEQUENCE= zg30
##.SOLVENT NAME= CDCl3
##.SHIFT REFERENCE= (INTERNAL, CDCl3, 0, 16.522)
##AUDIT TRAIL= $$ (NUMBER, WHEN, WHO, WHERE, WHAT)
$$ ##TITLE= Audit trail, XWIN-NMR		Version 3.5
$$ ##JCAMPDX= 5.01
$$ ##ORIGIN= Bruker BioSpin GmbH
$$ ##OWNER= NMR
$$ C:\u/data/dgb/nmr/ADRS/2280/pdata/1/auditp.txt
$$ ##AUDIT TRAIL=  $$ (NUMBER, WHEN, WHO, WHERE, WHAT)
(   1,<2005-04-26 14:49:33.65 +100>,<MAYBRIDGE\NMR>,<NMR_250MHZ>,
      <created by zg, POWCHK disabled, PULCHK disabled
       configuration hash MD5:
       62 19 C7 07 E1 42 D1 B7 37 6C 3D D0 77 39 F9 E6
       data hash MD5: 64K
       0D 51 A5 1C 5B A0 BD 10 07 5E 21 8F 8A 52 44 2D>)
(   2,<2005-04-26 14:49:45.62 +100>,<MAYBRIDGE\NMR>,<NMR_250MHZ>,
      <Start of raw data processing
       ef LB = 0.3 FT_mod = 6 PKNL = 1 SI = 32K 
       data hash MD5: 32K
       50 FE B7 C1 1E 7C 38 B7 63 83 7E 3A 1F 09 48 1C>)
(   3,<2005-04-26 14:49:47.13 +100>,<MAYBRIDGE\NMR>,<NMR_250MHZ>,
      <apk 
       data hash MD5: 32K
       BE 23 18 58 E0 2C 65 60 9D 7F A8 7F BF AD 6A 33>)
(   4,<2005-04-26 14:49:47.82 +100>,<MAYBRIDGE\NMR>,<NMR_250MHZ>,
      <abs ABSG = 5 
       data hash MD5: 32K
       BE 63 80 2D 0A 05 23 8D 58 CF D5 B1 C3 8F 71 22>)
$$ ##END=
$$ 
$$ hash MD5
$$ 14 1E 0C 89 3B 20 11 6B EB 20 93 74 85 C3 D4 48
##$RELAX= 
##$RELAX= 
##$RELAX= 
##$RELAX= 
##$RELAX= 
##$RELAX= 
##$RELAX= 
$$ Bruker specific parameters
$$ --------------------------
##$DU= <C:\u>
##$EXPNO= 2280
##$NAME= <ADRS>
##$PROCNO= 1
##$TYPE= <nmr>
##$USER= <dgb>
##$AMP= (0..31)
100 100 100 100 100 100 100 100 100 100 100 100 100 100 100 100 100 100 
100 100 100 100 100 100 100 100 100 100 100 100 100 100 
##$AQSEQ= 0
##$AQ_mod= 3
##$AUNM= <au_zg>
##$AUTOPOS= <39 >
##$BF1= 250.13
##$BF2= 250.13
##$BF3= 250.13
##$BF4= 250.13
##$BF5= 500.13
##$BF6= 500.13
##$BF7= 500.13
##$BF8= 500.13
##$BYTORDA= 1
##$CFDGTYP= 0
##$CFRGTYP= 5
##$CHEMSTR= <none>
##$CNST= (0..31)
1 1 145 1 1 1 1 1 1 1 1 1 1 1 1 1 1 1 1 1 1 1 1 1 1 1 1 1 1 1 1 1 
##$CPDPRG= <>
##$CPDPRG1= <>
##$CPDPRG2= <>
##$CPDPRG3= <>
##$CPDPRG4= <mlev>
##$CPDPRG5= <mlev>
##$CPDPRG6= <mlev>
##$CPDPRG7= <mlev>
##$CPDPRG8= <mlev>
##$CPDPRGB= <>
##$CPDPRGT= <>
##$D= (0..31)
0 1 0 0 0 0 0 0 0 0.06 0 0 0 0 0 0 0.0002 0 0 0 0 0 0 0 0 0 0 0 0 0 0 
0 
##$DATE= 1114523372
##$DBL= (0..7)
120 120 120 120 120 120 120 120 
##$DBP= (0..7)
150 150 150 150 150 150 150 150 
##$DBP07= 0
##$DBPNAM0= <>
##$DBPNAM1= <>
$$ [...]
##$SUBNAM7= <"">
##$SUBNAM8= <"">
##$SUBNAM9= <"">
##$SW= 20.6930455092707
##$SWIBOX= (0..15)
0 0 3 0 0 0 0 0 0 0 0 0 0 0 0 0 
##$SW_h= 5175.983436853
##$TD= 65536
##$TD0= 1
##$TE= 295.16
##$TE2= 300
##$TE3= 300
##$TEG= 300
##$TL= (0..7)
0 120 120 120 120 120 120 120 
##$TP= (0..7)
150 150 150 150 150 150 150 150 
##$TP07= 0
##$TPNAME0= <>
##$TPNAME1= <>
##$TPNAME2= <>
##$TPNAME3= <>
##$TPNAME4= <>
##$TPNAME5= <>
##$TPNAME6= <>
##$TPNAME7= <>
##$TPOAL= (0..7)
0.5 0.5 0.5 0.5 0.5 0.5 0.5 0.5 
##$TPOFFS= (0..7)
0 0 0 0 0 0 0 0 
##$TUNHIN= 0
##$TUNHOUT= 0
##$TUNXOUT= 0
##$USERA1= <user>
##$USERA2= <user>
##$USERA3= <user>
##$USERA4= <user>
##$USERA5= <user>
##$V9= 5
##$VALIST= <valist>
##$VCLIST= <CCCCCCCCCCCCCCC>
##$VD= 0
##$VDLIST= <DDDDDDDDDDDDDDD>
##$VPLIST= <PPPPPPPPPPPPPPP>
##$VTLIST= <TTTTTTTTTTTTTTT>
##$WBST= 1024
##$WBSW= 4
##$XGAIN= (0..3)
0 0 0 0 
##$XL= 0
##$YL= 0
##$YMAX_a= 418403
##$YMIN_a= -314194
##$ZGOPTNS= <>
##$ZL1= 120
##$ZL2= 120
##$ZL3= 120
##$ZL4= 120
##$ABSF1= 16.522
##$ABSF2= -4.171173
##$ABSG= 5
##$ABSL= 3
##$ALPHA= 0
##$AQORDER= 0
##$ASSFAC= 0
##$ASSFACI= 0
##$ASSFACX= 0
##$ASSWID= 0
##$AUNMP= <proc_1d>
##$AZFE= 0.1
##$AZFW= 0.1
##$BCFW= 0
##$BC_mod= 0
##$BYTORDP= 0
##$COROFFS= 0
##$CY= 12.5
##$DATMOD= 1
##$DC= 0
##$DFILT= <>
##$DTYPP= 0
##$F1P= 14.0000005364418
##$F2P= -0.99999901652339
##$FCOR= 0.5
##$FTSIZE= 32768
##$FT_mod= 6
##$GAMMA= 0
##$GB= 0
##$INTBC= 1
##$INTSCL= 1
##$ISEN= 128
##$LB= 0.3
##$LEV0= 0
##$LPBIN= 0
##$MAXI= 10000
##$MC2= 0
##$MEAN= 0
##$ME_mod= 0
##$MI= 0
##$NCOEF= 0
##$NC_proc= -3
##$NLEV= 6
##$NOISF1= 0
##$NOISF2= 0
##$NSP= 0
##$NTH_PI= 0
##$NZP= 0
##$OFFSET= 16.522
##$PC= 1
##$PHC0= -69.24685
##$PHC1= 8.990583
##$PH_mod= 1
##$PKNL= yes
##$PPARMOD= 0
##$PSCAL= 4
##$PSIGN= 0
##$REVERSE= no
##$SF= 250.13
##$SI= 32768
##$SIGF1= 0
##$SIGF2= 0
##$SINO= 400
##$SIOLD= 32768
##$SREGLST= <1H.CDCl3>
##$SSB= 0
##$STSI= 32768
##$STSR= 0
##$SW_p= 5175.98343685301
##$SYMM= 0
##$S_DEV= 0
##$TDeff= 65536
##$TDoff= 0
##$TI= <Analysis number 999999
Compound Code 99
Book Reference 9
Project Code 9>
##$TILT= no
##$TM1= 0
##$TM2= 0
##$TOPLEV= 0
##$USERP1= <user>
##$USERP2= <user>
##$USERP3= <user>
##$USERP4= <user>
##$USERP5= <user>
##$WDW= 1
##$XDIM= 32768
##$YMAX_p= 300168806
##$YMIN_p= -568773
$$ End of Bruker specific parameters
$$ ---------------------------------
##NTUPLES= NMR SPECTRUM
##VAR_NAME=  FREQUENCY,     SPECTRUM/REAL,   SPECTRUM/IMAG
##SYMBOL=    X,             R,               I
##VAR_TYPE=  INDEPENDENT,   DEPENDENT,       DEPENDENT
##VAR_FORM=  AFFN,          ASDF,            ASDF
##VAR_DIM=   32768,         32768,           32768
##UNITS=     HZ,            ARBITRARY UNITS, ARBITRARY UNITS
##FACTOR=    0.157963299565203, 1,           1
##FIRST=     4132.6476996994, 0,             0
##LAST=      -1043.33573715361, 0,           0
##MIN=       -1043.33573715361, -568773,     0
##MAX=       4132.6476996994, 300168806,     0
$$ Real data points
##PAGE= N=1
##DATA TABLE= (X++(R..R)), XYDATA
$$ [...]
28714g7341J4544P685J4979L3563k2677L1219O0085M5048M7559j1677j1753k3736
28702A07498o5148M0253P496l3324o813o329l6911k8548j3567k8255O0313N6103
28690E2768k9792k9305n8316l0833K5157K7819M3464l7562L0231P4187K013m1841
28678B7990l1384k7357N3869M5383k2990m9859K8737N3998L576k6661k1130K5698
28666E9870K6377J1573n9751O209o276n976k4816o330j9598K4831O7002J2487
28654H5602k9636j6469Q826J0461l6053j0489M968j8972Q268j3248J9133l639
28642H752m0250J3098M7274n4611q901J1638P2097l511l0861j8562j8082J2031
28630i888L684m201l0400K375j1351M7066r626M357J01135N3559j0179q7313m1989
$$ y = [-77341, -62797, -55112, -40133, -6570, -29247, 1972, 62057, 107105, 154664, 142987, 131234, 107498, 42350, 82603, 90099, 56775, 49962, 43633, 6722, -21826, -35393, -63648, -3335, 52768, 22976, -6329, -64645, -95478, -70321, -42502, 962, -36600, -6369, 67818, 69831, 27990, -3394, -30751, 23118, 68501, 45511, -4348, 24389, 78387, 81963, 55302, 34172, 59870, 86247, 97820, 38069, 44278, 38002, 32026, 7210, 880, -18718, 6113, 73115, 85602, 55966, 39497, 48323, 58784, 22731, 12242, 17210, -1762, 6506, -6742, 12391, 8752, -31498, -18400, 28874, -25737, -34638, -23000, 49097, 45586, 14725, -3837, -21919, -9888, -6204, -10405, -40805, -38430, -49781, -2715, -12341, -7984, 93151, 146710, 136531, 49218, 7229]
28617G229J6169J2396k831j6863k2574M057l4555n046j8602L2627O4690O081l2325
28604A0453l2888L1513m865k5478J5320J6411p342m9131J7166L6206J2317m0066
28592b0384M205J8509M0894m9399m0510N2095l8424l6129J699K5783R5703R0551
28580A44593p4536m3968k5990j7408M5767k2112l7319j8099o5288M395J6937o067
28568i9095J5931L9951P5975M6685k7480p4319J8641N9362j5545j4020O3573Q7635
28556A77294m790j7025k7092j12947m3351m1489k5775l870Q2658R4757J7383K779
28544I8532J828m5034j4382Q072k8383K1879m7014o2861M5873J3562L5688M646
28532C2406o4688k559R599k9557l0700k19N740J1491J3317K7784p8552l9717P7706
$$ y = [7229, 23398, 35794, 32963, 16100, -6474, -2417, -36972, -42018, -60620, -27993, 36697, 42778, 10453, -22435, 9078, 4213, -21265, -5945, 10466, 3124, -46007, -28841, 7365, 19682, -20384, -16179, 2330, 43224, -6175, -46685, 5410, -33014, -69143, -67444, -41661, 54042, 144593, 70057, 26089, 99, -17309, 28458, 6346, -30973, -49072, -114360, -109965, -93028, -99095, -83164, -43213, 32762, 79447, 51967, -22352, -3711, 55651, 40106, 26086, 89659, 177294, 172504, 155479, 128387, 15440, -27911, -69400, -95175, -99045, -16387, 78370, 95753, 98532, 100360, 55326, 40944, 49016, 20633, 42512, -4502, -67363, -21490, -7928, 27760, 32406, -32282, -34841, -25242, -54799, -85499, -85718, -79978, -68487, -55170, -27386, -105938, -145655, -67949]
28519f7949K8312L610P28q183L6929N6421L7719j654k9558o7147J5757K7658J9779
28506E2422K8302J0786o2079j6617K1969J0274N159k5015m541j5074k1091M1527
28494B6022n3694j8179K235K4782K8060N6873L6738L9195q810m6542o926k8123
28482E1631k1129J9676J2963l3020o424J6172J5999l6591n1173p3141r674N6414
28470e8297K8524J0870M6433J7674l8562m893L3767M843O042J0748k6893n8653
28458b8397k6847j5457P345l2759j130K9282q218L7391m955m9593K7045R5704
28446B9411P607k7982l2999k0279q096l8791n954K0001O8027K4992K8614m2844
28434A707M353N0810K9469j6018j4853o1841k0580r976n1606O4657K8347M985
$$ y = [-67949, -39637, -36027, -35299, -43482, -6553, 49868, 87587, 85933, 56375, -10772, 4985, 32643, 52422, 80724, 91510, 29431, 12814, 34783, 45057, 50216, 25201, 20660, 5586, -15505, 26022, -27672, -45851, -43616, -18834, 9226, 66099, 102837, 142032, 133222, 86680, 79754, 51631, 30502, 50178, 63141, 30121, 23697, 39869, 55868, 19277, -31896, -105037, -114711, -58297, -29773, -18903, 27530, 45204, 6642, 1749, 35516, 40359, 46401, 57149, 30256, -28397, -55244, -70701, -63356, -96115, -97245, -67963, -76181, -38790, -43745, -93338, -66293, 29411, 37018, 9036, -23963, -44242, -52338, -91129, -97083, -77082, -9055, 15937, 44551, 1707, 6060, 56870, 86339, 70321, 55468, -6373, -26953, -36929, -88535, -23878, 4469, 9454]
28422I454K3134j4059j2262k1667j1429J8174L0100l7372L013P2279K556j2534
28410D9387J4711l3205K6970J9185l313K4431M5644n2408o2896l7779J9225j047
28398H905K5834K9739k3008N053k1509p5110q140o181M4935j320p790K1402m8638
28385e5828K408P3325L4360l1987j144Q503j4347j4821K4198j6161k8868k2600
28373d2962m4351J8402j5346j6573M3466L6627r306j7073o4512N419N9479M1515
28361e215L6146N8394r598m7129l1294j05j1225n930m1681K7596N5156J5741j1323
28348B9533R819J5730j5341K4501k0058j1726M2959N1397k873n8392r767K1079
28336G6861l1126J7281J3117j8842k9543J2712o0097k2935k2006J0222L1877k2581
$$ y = [9454, 32588, 18529, 6267, -15400, -26829, -8655, 21445, -15927, -12914, 59365, 61921, 49387, 64098, 30893, 57863, 77048, 73735, 98166, 143810, 91402, 28506, -9273, 9952, 8905, 34739, 64478, 41470, 46523, 25014, -50096, -58236, -64417, -19482, -20802, -28592, -7190, -55828, -53420, 19905, 54265, 22278, 21134, 29637, 15290, 469, 24667, 8506, -20362, -42962, -87313, -68911, -84257, -100830, -57364, -20737, -30043, -47116, -111628, -106209, -46730, -5215, 30931, 89325, 79727, 32598, 1304, 1199, -10026, -15956, -57637, -30041, 25115, 40856, 29533, 39352, 55082, 39741, 64242, 44184, 32458, 75417, 126814, 123941, 65549, 55782, 76861, 45735, 63016, 76133, 57291, 27748, 40460, -19637, -42572, -64578, -54356, -22479, -45060]
28324d5060l7944J7065J6209j7953k0977J5726K9432j3095J59P6960J6436m505
28312C2453l1067J7813k3467j5915J7766k3790J9154O0508L0115l344J9125k8472
28300G0879o5649n043M6088l8992k1095M0178J3528Q584J8274k4551n3569l3298
28288d4666N0169q558j9436j055L3104l1947q7368j7543N4844N5365J4889L1391
28276B9189M3366r5982o3062O1637K6780m9511j4772M4416M5938K1018m2323o2618
28264e5924n6453M1168J4726L0305j2074K1828O8118j5590q3354J065M4624j9435
28252b0996n1348N4854M5032m724k375k7979j6017L3326O6295K056m6331l4798
28240c005m1924Q028J2285J2122m590m88k6583n0114J0356o963m449J1219N989
$$ y = [-45060, -83004, -65939, -49730, -67683, -88660, -72934, -43502, -56597, -56438, 20522, 36958, 32453, 1386, 19199, -4268, -20183, -2417, -26207, -7053, 53455, 83570, 80226, 99351, 70879, 5230, 187, 46275, 7283, -13812, 26366, 39894, 48478, 66752, 42201, -11368, -44666, 5503, -3055, -22491, -23546, 9558, -22389, -109757, -127300, -72456, -17091, -2202, 29189, 72555, -23427, -86489, -24852, 1928, -47583, -62355, -17939, 27999, 49017, 6694, -55924, -112377, -71209, -56483, -26178, -38252, -16424, 51694, 36104, -47250, -46185, -1561, -20996, -72344, -17490, 27542, 22818, 20443, -7536, -23553, 9773, 76068, 78124, 31793, -3005, -44929, -36901, -24616, -12494, -17084, -17572, -44155, -94269, -83913, -90876, -95325, -84106, -78117]
28227g8117O899L0896L1767L9155k9553m647q676j3418P7783J0581j3639k3983
28215B5048j4158k1837P0892j2264q4420r1053J8517L7513k0961J0252q624k2687
28203a13782L0577M9502j7065L386O1303L2292l742n2864m8402k5809K2260M0533
28191b1811m5542L2813j3853L1029N0087J0635l9604k7127J7239K271l1647P581
28179b7929J70m749L4438R3873j5096m5280j4620K4925O4581k6793o5233L4381
28167E2668k2530j9270M422k962P39l7582K6020Q5793o39m2467o4439n2206P506
28154f4947j1351J650J4727o035j5520Q4469O7484k9171l1949N6608l9311m6076
28142a9422k1794N3487R5599k6590k197l3764k004m0089l3943K4153J6613J2513
$$ y = [-78117, -71218, -40322, -8555, 30600, 1047, -3600, -12276, -25694, 52089, 62670, 49031, 25048, 10890, -10947, 59945, 47681, -36739, -127792, -109275, -71762, -92723, -82471, -91095, -113782, -83205, -33703, -50768, -47382, 13921, 46213, 42471, -10393, -58795, -84604, -62344, -21811, -67353, -34540, -48393, -17364, 32723, 43358, 3754, -23373, -6134, -3863, -35510, -27929, -27759, -32508, 1930, 95803, 80707, 35427, 20807, 45732, 110313, 83520, 18287, 52668, 30138, 10868, 15290, 12328, 13067, -24515, 1505, 87298, 86659, 44192, -20247, -72453, -64947, -76298, -74648, -59921, -65956, -81476, 2993, 70477, 41306, 9357, 65965, 26654, -19422, -41216, 12271, 107870, 81280, 79083, 45319, 43315, 3226, -30717, -6564, 10049, 22562]
28130B2562K5745j1136j0755K4362L0540K865O542n0494L4438L4577m412j2736
28118I2098J7773q1497o0240n65j7664N4698J2263L100k760K6887n6042j5969
28106b7918J7354J7231m0695J8741M846n9178k5715K6459L0510j5522j8247J4156
28094e7978J9110k3903l9199O8646M0347Q5956N2859m5703m1324q024r882L9859
28082H0764M3432j1280l5191k0623k5227N1903l6461j7557j2636n7735k69M6796
28070E916K733k7613n5878j0719J3568L9599K7005M696J6306k8098j4370L7658
28058A0803N6365l4220k7189L7631K7768P18j7894m0557l118N246l9007q771j8796
28045e1021M1054J1923L2546P835m237n782J6445r628K2225n1822k0053O519N6860
$$ y = [22562, 48307, 37171, 26416, 50778, 81318, 84183, 90725, 40231, 74669, 109246, 104834, 92098, 109871, 28374, -31866, -32431, -50095, 4603, 16866, 19966, 17206, 44093, -11949, -27918, -10564, 6667, -34028, -15287, -10441, -69619, -95334, -68875, -38365, -53887, -72134, -57978, -38868, -62771, -101970, -33324, 7023, 92979, 145838, 100135, 58811, 50787, 40905, 80764, 124196, 112916, 77725, 57102, 31875, 83778, 47317, 29760, 17124, -40611, -40880, 5916, 8649, -18964, -74842, -85561, -71993, -32394, -5389, -693, 15613, -12485, -26855, 10803, 67168, 32948, 5759, 43390, 71158, 71876, 53982, 13425, 10307, 15553, -23454, -32225, -51021, -9967, 1956, 34502, 42337, 38100, 32318, 48763, 39135, 61360, 9538, -10515, -3996, 52864]
28032E2864J5690k0998J3993k5941l4371J588K5482m2375R42N032k4021k4060
28020e6175O5728q119N536j5615K6090Q925l5616j6374L2143j2012O32J9424N2669
28007F7236p0642n3572n8117n685L1161M0577J08643K3455m2554j28202o935P8058
27995a6577M0283m5360o5043J6275P4843L8524k4932m410o580m6513p612k3595
27983g0697m258M6704N4061j9107j0584j7975j1542j005K1179j9820j6622j301
27971e0967m8794k1169j277K0906Q2061K3375l0440m2816L537N7614L9127j7296
27959A3861o571N1676m5999k6158k8159J8282J0542m1170m153M1727m6686m6168
27947a08976K126M5011L4694K0706J2379j0585L3712L551k8108r315K7800J1252
$$ y = [52864, 68554, 47556, 61549, 35608, 1237, 2825, 28307, -14068, -13126, -8094, -32115, -56175, 9553, 1434, 6970, -8645, 17445, 26370, -9246, -25620, 6523, -5489, -4857, 14567, 67236, -3406, -56978, -115095, -120780, -89619, -49042, 59601, 83056, 40502, -87700, -94635, -16577, 23706, -21654, -86697, -70422, 4421, 42945, 18013, 13603, 7023, -39490, -47102, -70697, -74955, -28251, 25810, 6703, -3881, -21856, -33398, -34403, -13224, -33044, -49666, -50967, -99761, -120930, -122207, -101301, -19240, 4135, -26305, -69121, -65584, -7970, 31157, 13861, 7290, 58966, 12967, -13191, -41350, -23068, -12526, -53696, -57849, -16122, -62808, -108976, -106850, -61839, -27145, -6439, 5940, -4645, 29067, 32618, 4510, -4805, 22995, 34247]
27935C4247p8994n743L0381o942l3878K1578L1949J9461o874R300j0298L9848
27923D4035K5236l84R441l327n014j7539o1853k8018L0059J210K2102k5726k8129
27910c7907M8008L8307r122m7310q5413n631M9895M3907M8115k2113l8737K0169
27898B168L7577N0089L3834J5857j6185p6494o7502j9838j4731j659O5689J7233
27886B6038n4689r401K2511M4481N537k3466m5825Q0106M1892n5197J1905K2575
27874F6467K7049j2875j8936o463L7059k1451k1540r4846j4917O797J7312J0268
27862b6076K3592J592l9080J2270k3497l384j7879J1298N1149N2754k5583K8598
27850D5754l9889j9024J9025K6008M5514J1260n1454k5661K5012j0278N1325O302
$$ y = [34247, -44747, -50490, -20109, -27051, -60929, -39351, -7402, 12059, 5185, 14485, 4187, 44035, 69271, 68887, 78328, 75001, 69987, 52448, -9405, -37423, -7364, -6154, 15948, -9778, -37907, 10101, 48408, 39286, -8024, -93437, -99068, -49173, -5266, 42849, 20736, -18001, 2168, 39745, 89834, 123668, 139525, 123340, 46846, -20656, -40494, -55225, -56884, 8805, 26038, -28651, -38052, -15541, 28940, 34477, 11011, -34814, 45292, 87184, 31987, 43892, 66467, 93516, 80641, 61705, 55242, 92301, 70850, 49310, -45536, -60453, -53656, -36344, -26076, -2484, -892, -39972, -27702, -51199, -54583, -72462, -61164, -10015, 42739, 17156, 45754, 5865, -13159, 5866, 31874, 77388, 88648, 37194, 11533, 36545, 26267, 77592, 83894]
27838H3894l4637o103r993J0437O516J4921p0715K3512K5161k7132j9512K9944
27826B6293N5438j9532n0976l3252K4123K9278N280J5825q403o8279M2974j5321
27814C448N4683l4887o9590J8150K5942J8394n2959k4274Q0839k9922k6218K9733
27802f661m9625o124K1562P7954N5886k422j1189l4120m2255m529n699L0378j855
27789B1301j9319q900k498J884p791M062p21k9407o708p081M4394N4430o151m046
27775C3449o3799n4020q264L9901P5919O1491k6315l9782p885J8655j8394J1214
27763B2170l721N360l8542L6501M3232L0316q3376k1661L3667k4473m7613N6044
27751G904L3872r792n8784m603M7947J02704L2685L114j21124j29283o490L3563
$$ y = [83894, 49257, 43154, 33161, 43598, 50114, 65035, -5680, 17832, 42993, 15861, -3651, 26293, 81731, 62199, 11223, -22029, 2094, 31372, 36652, 52477, 44074, -24205, 18769, 3448, 58131, 23244, -46346, -28196, -2254, 16140, -36819, -61093, 19746, -10176, -36394, -6661, -56286, -62410, -40848, 37106, 92992, 90570, 79381, 45261, 3006, -1523, -7222, 23156, 21301, 1982, -6918, -9416, -7532, -15323, -11261, -11982, -41389, -48097, -55178, -10784, 43646, 37495, 33449, -30350, -84370, -92634, -52733, 23186, 84677, 58362, 18580, 10695, 29350, 10956, 22170, 18449, 23809, -14733, 21768, 65000, 95316, 11940, -9721, 23946, -527, -48140, 7904, 41776, 31984, -26800, -31403, 16544, 119248, 151933, 155047, 33923, -95360, -101850, -68287]
27739f8287O3450K6419l2866l2828k565O547k7006O3029O1793j8054M6897n9712
27727B6817p5903m9936n502n209K2841M7584N868j3445K3091M0944m642Q153R109
27714B9770O4600j2611n6875k2498L2217K4479k709k5981q569k5553M792m5983
27702d4921m4390M9432O7381L0803k8012q696J2143m0256m6040L9811Q6982m9955
27690B4282o0349K5379L348q776K9229J1396m7386m1623k1763N3442N2381K7614
27678D7174j5498o9477r965M2782K4413k1521J5794j6805l8436k9437k9529L1229
27666f9276K6548K4190j902J6872L7857q344J9115l2610p515l717p516J0421m5463
27653d1340J4350P9043K3776l5932o5433j2868K590j335J014N0871J5905k0709
$$ y = [-68287, -4837, 21582, -11284, -44112, -46677, -40130, -67136, -4107, 57686, 39632, 86529, 26817, -49086, -99022, -104524, -109733, -86892, -39308, -33440, -46885, -23794, 17150, 12508, 20661, 29770, 94370, 81759, 24884, 2386, 34603, 59082, 56373, 30392, 21823, -3730, 1062, -44921, -89311, -39879, 27502, 58305, 30293, 21597, 33740, -6516, -52556, -12745, 74237, 24282, -36067, -10688, -7340, -16116, 13113, 24509, -22877, -64500, -86263, -32821, 19560, 47174, 31676, -37801, -47766, -4984, 19429, -2092, 13702, -3103, -41539, -70976, -100505, -69276, -42728, -18538, -20440, -3568, 34289, 25945, 45060, 12450, 4935, 1218, -6298, 4123, -41340, -26990, 52053, 75829, 39897, -25536, -38404, -35814, -37149, -36135, 14736, 30641, 9932]
27641I932j0694k3651n621L690j3684N238K1780k8791o223J37q766L5964K5916
27628E227j7504n7188M143J0881M4527M6868j6221J3790j7845k4973J0141J0813
27616A2659J1142N4939k813m4462j0744N102j7192l8654M1328J4688k5309N3431
27604E4115R1443l6028j0794l0357k3595O1107J0302o7235q4297n6180N4044R8975
27592F1500L378J0612J4105j8466r764p0907m197L2140l0642j6508N232K2020
27580a497J0785k9019J9561j430O805J5230J6820m0403l3422P29j3940K1925J3250
27567a4606K9147K0284m0645N03K001L6331J9366J4635l6091o1131m0118m7387
27555a17711N084O310L2014J4121k4563K4349L7275K3948L551j0650j2455K8160
$$ y = [9932, -762, -24413, -30034, -26344, -40028, -34790, -13010, -41801, -48024, -47887, -56653, -20689, 5227, -12277, -69465, -65322, -54441, -9914, 36954, 20733, 34523, 16678, -8295, 1846, 12659, 23801, 78740, 75927, 31465, 20721, 25823, 8631, -30023, 11305, 25993, 684, 54115, 145558, 109530, 98736, 68379, 44784, 105891, 116193, 48958, -35339, -91519, -37475, 61500, 64878, 75490, 89595, 71129, 61365, -9542, -13739, 18401, -12241, -28749, -23517, -1497, 9288, -19731, -170, -1600, 5205, 20435, 37255, -3148, -36570, -35841, -49781, -27856, -14606, 14541, 34825, -5820, -5317, -3316, 33015, 52381, 67016, 30925, -30206, -70324, -117711, -112627, -106317, -74303, -60182, -84745, -60396, -23121, 827, 4378, -6272, -18727, 9433]
27543I433j36o9272J5640R8548k003l1414k8344P4488L4955l4504l7263l882P569
27530C3815p560m0099N4040L4574J1143k6426n9614m9365J5763K4816K0815K2931
27518C4833K0078l2412m07m447J9122J6443j1993o674k4124L9339J2121j0824
27506E1055l3094k4217k0116k0605K9131o080O971p733k7505k3169K6181O2622
27494A3441M0052l0284m7419L504j6709M8880j2715K5753K3950m1377j2712J2749
27482G113J5573o0153n5398O3048K8114j255K6067K0928o4547m2181o799M0779
27470b8711M2718N095L81m3776q33M4289q257M2798N1731o3946l8293N3711O84
27457E7591k095N1584j9749o7047J3630n536K3625j0569l4451l1939r135K4795
$$ y = [9433, 9297, -59975, -44335, 54213, 52210, 20796, -7548, 66940, 101895, 67391, 30128, 26246, 33815, 26255, -13844, 40196, 74770, 85913, 59487, -127, -49492, -33729, -8913, 11902, 34833, 54911, 22499, 22092, 17645, 36767, 53210, 41217, 34543, 10419, 49758, 61879, 51055, 17961, -6256, -26372, -46977, -17846, -23926, -16955, -24688, -52193, -75362, -49181, 13441, 53493, 23209, -24210, -20706, -37415, 11465, -1250, 24503, 48453, 7076, -5636, 7113, 22686, -37467, -92865, -29817, -1703, -2958, 23109, 44037, -20510, -62691, -69490, -28711, 14007, 19102, 19483, -24293, -25126, 19163, 10906, 53704, 105435, 41489, 3196, 56907, 57591, 55496, 107080, 87331, 20284, 33914, 28378, 52003, 41434, 6983, -24956, -34091, -9296]
27445i296M0500m163j2687k4385o430R983o221m3769j9960o154P0548K97K2137
27432A0400K7213k6825m5015j8481L4534L7518j7255o758J8114J1700O1M1903
27420F7109N1563k9242j4143j4649j3699m3857r181J5616n0420j6403m6832N6146
27408d7992O0239L4200k3418j3273J6325J147k1490o422J3111L1932J7333l1135
27396C0557n596K3033L6479j3252p0649m8792o273Q3224j1121m9800K0698N4270
27384D2778j1457m3561m3252l7535K2092N5518K6274m5618O668K6526k2821l5189
27372e9577Q252q134j7259K8448M2315P5440O4570m5745m4615j1492o5101j0130
27360d3028K1876L4175j0389k0494K8445n1635l1302K7241q119L1675J1326K6827
$$ y = [-9296, 31204, 27041, 14354, -10031, -16461, -6478, -12699, -56468, -76428, -82582, -12034, -11737, 10400, 37613, 10788, -34227, -52708, -18174, 19344, 2089, -4669, 13445, 25145, 25206, 67109, 118672, 89430, 75287, 60638, 46939, 3082, -6099, 9517, -40903, -57306, -104138, -47992, 12247, 46447, 23029, 9756, 26081, 27228, 5738, -684, 12427, 44359, 61692, 30557, 24961, 47994, 84473, 71221, 572, -48220, -54493, 28731, 17610, -32190, -11492, 42778, 31321, -12240, -55492, -93027, -70935, -15417, 10857, -34761, -28093, -1567, -24388, -59577, -51325, -59459, -76718, -48270, -5955, 69485, 134055, 88310, 43695, 32203, -32898, -43028, -21152, 13023, 2634, -17860, 10585, -41050, -72352, -45111, -53230, -21555, -10229, 16598]
27348A6598p36l4362j1841K258l047n71J7664M6241K796j9657n0523L0199R027
27335D046K1851L2545J3109k4041m7656l1802j6813j0361L721J3702N6087N0810
27323F5198k4128j8187n739k4533K2812j078n560M3028n0113m5370O1102L7342
27311E4774n0830j0820o330j440M1068K8592m1247r137j5721o3912k0943N8979
27299c6967O8931j1702p9416l4393L8512O7126J6916M5079K7074R963o8153l7528
27287E442L497m4664o2552L5845J3293p983p905Q073j798L0686P3586M26p300
27274C8646l6169l0424M324K0053L4516J6735l6785M035k5693k3739o114K84n5058
27261i5389m510O6073P1352o3545m2094K6718K2287m4984j0716M349m7050J5030
$$ y = [16598, 15862, -18500, -30341, -28083, -31130, -31701, -14037, 32204, 35000, 15343, -35180, -4981, 4046, 25897, 58442, 71551, 47510, -146, -31948, -48761, -59122, -55401, -41699, 14388, 65198, 41070, 22883, 17144, -7389, 15423, 14345, 8785, 51813, 1700, -43670, 17432, 54774, 3944, -6876, -13206, -14646, 26422, 55014, 13767, 4630, -11091, -75003, -95946, -36967, 31964, 20262, -59154, -93547, -55035, 12091, 29007, 74086, 101160, 111123, 42970, 5442, 8939, -35725, -98277, -62432, -49139, -57122, -65027, -56954, -58752, -28066, 45520, 45946, 38646, 2477, -27947, -23623, -3570, 30946, 47681, 10896, 14931, -10762, -34501, -40615, -40331, -95389, -99899, -33826, 37526, -26019, -68113, -41395, -19108, -64092, -74808, -70459, -117509, -102479]
27249a02479k0295j5845R614M7624k4801P8728K8866j5846K07p628p0646o915
27237i9416j2691j6070L9164O5994J3901l1522J0037j656o1342l3417L536J1275
27225a12207L9663M2864j8689p064N6232l116k2767j3539m3299l9989L8440N970
27213g7501n3089l0939J0290N1871Q0078j5569l2474j3388Q0937J882k1352J6124
27201c130L3722n292j0471o4793K9333L7759m9953q2397m9748N1186Q7362J7704
27189h718p677l7952p730j4295J6269J7220p443l166K2992j9495K6190R540L5050
27176B0785k3648n2364k9625J9535k566L1538k6467j818j0203j4356L5806O7543
27164A4160N3967J3227k1629j1357j7678n4727K0070Q2015j977j8364l6468k1351
$$ y = [-102479, -122774, -138619, -129005, -81381, -106182, -27454, 1412, -14434, -14227, -21855, -92501, -99416, -112107, -128177, -89013, -23019, -9118, -40640, -30603, -32259, -93601, -127018, -123482, -112207, -72544, -29680, -48369, -55433, 799, -2317, -25084, -38623, -81922, -121911, -83471, -77501, -130590, -161529, -151239, -99368, -19290, -34859, -67333, -80721, 216, 2098, -19254, -3130, 30592, 25300, 14829, -49964, -20631, 17128, -32825, -115222, -164970, -113784, -26422, -8718, -16395, -54347, -62077, -76372, -60103, -42883, -50326, -53492, -30500, -49995, -23805, -14265, 20785, -2863, -55227, -84852, -65317, -67883, -36345, -62812, -64630, -74833, -89189, -53383, 14160, 68127, 81354, 59725, 48368, 30690, -24037, -3967, 78048, 76071, 57707, 21239, -112]
27152a12P32p5185J1687O8055q672l9843J7009O3079O607K02J1923j3626n566
27139C6290m9461l4285k6292q656N5092O7333K8293O0084n9672p1281o2018k0083
27127h4656J1151k2989j2659J3159M5614q485K4870O1688J8481J013M687M0880
27115I2754n7451j1348M5319M6520j7283l6928j4275K6689L329l3090j0224M54
27103C4466k4022J2277j8084K510j3610n8273q4943J6027K7809K6727m10m7647
27091a27173P007K8741O0924L6269Q2751M588l6976L3266J5031l6004n4761o1652
27079d7989M0482L5564P302l320Q021K2591m1515l2412L5767J0589m5378q2791
27067i3089N9033O0454j9846k4947p6864n810M4210k4056J3877M4878J6820R120
$$ y = [-112, 620, -74565, -62878, 5177, -3495, -43338, -26329, 36750, 43357, 43559, 55482, 41856, 36290, -13171, -47456, -73748, -82404, -27312, 40021, 68314, 128398, 68726, -2555, -64573, -84656, -73505, -96494, -109153, -95994, -50380, -58865, -33995, 27693, 46174, 47187, 51874, 92754, 35303, 23955, 69274, 115794, 98511, 61583, 47308, 73997, 77326, 44236, 34012, 34466, 10444, 22721, 4637, 7147, -6463, -64736, -149679, -133652, -105843, -79116, -79526, -127173, -120166, -91425, -30501, 5768, 88519, 93107, 56131, 89397, 104428, 68424, 13663, -47989, -7507, 28057, 35359, 32039, 40060, 62651, 21136, -11276, 24491, 35080, -10298, -93089, -34056, 26398, 6552, -18395, -95259, -101069, -56859, -80915, -67038, -22160, -5340, 3780]
27055C780J793j324K9714j5058K5766J895o4863j5359k7626M0644L1352L7211
27043D7925K0139m635l9447l3795j9281N3927L4068o192r861k5667L7693J9469
27031G4343M111m408j4651M0416J6603m6722r2434K45j3745k6445K3122K861N8072
27018B1368q160o1139l0287L9817K4547l2749J4029K6773M4752K3123k4172j3868
27006B4034K0711P7046k5429j14940k7435J5105n8071L5270J8576M4627P693J0583
26994B7770k8371K83K9580K6737m331K8266n027j1509j1665j8277k9630l1644
26982b7818p574L7829l0417j0958J0815o7669l135P1138K4686j3794j4989J0932
26970b0954M1709M2594o9333n3725n8029K6519K6756J5762R525K2322M3465k7684
$$ y = [3780, 5573, 4249, 33963, 18905, 44671, 46566, -18297, -33656, -61282, -20638, 10714, 47925, 68064, 63429, 23982, -9813, -29094, 24833, 58901, 52709, 42848, 17181, 54874, 74343, 78454, 74046, 59395, 99811, 116414, 69692, -22742, -22497, -36242, -62687, -39565, -36704, 21368, 13208, -47931, -78218, -38401, -13854, -46603, -32574, -5801, 38951, 62074, 37902, 24034, 44745, 121791, 96362, -18578, -46013, -30908, -88979, -53709, -35133, 9494, 17187, 27770, -601, -318, 29262, 55999, 51668, 79934, 74907, 63398, 51733, 33456, 3826, -27818, -35392, 2437, -27980, -38938, -28123, -95792, -98927, -27789, -3103, -16897, -31886, -20954, 20755, 63349, -5984, -59709, -117738, -91219, -64463, -48701, -39176, -16854, 26611, -1073]
26958a073Q661k7477j7919m1988J2736M4445M1969M7306l0849n6329M7104K490
26946B9076p5005n6186n1580R786Q5770N3185K3458K441k2074m6750L0940K4667
26934G728k1137P806k4796J4773k4261N944N2336P91L05K8948P0647K2012o1912
26921G9184j46274m9336L1359K188N505N109k9679M3982J5223N1351M6310K3469
26909G8391l73K2173j6208n8134m0195m9658K2849K4264p176L2408m2490J5950
26897a8199N9802l5534j1359k4510N547j7192J8708K1302m2441j0800M1377l9353
26885e2652l1207N7118J9528J9182n3104j992N4883O8293o208m6316L8130O4475
26873A30130N616l5715l5795k8896R770k1936n078l91j5470K6220M7127j57j4725
$$ y = [-1073, 7588, -19889, -37808, -79796, -67060, -22615, 19354, 66660, 35811, -20518, 26586, 29076, -45929, -102115, -153695, -143909, -58139, -4954, 18504, 20945, -1129, -47879, -16939, 7728, -13409, -5603, -30399, -15626, -39887, -33943, 18393, 19184, 19489, 48437, 119084, 141096, 79184, -67090, -116426, -85067, -82879, -77374, -72265, -101944, -57962, -42739, 8612, 54922, 78391, 78018, 100191, 83983, 25849, -14346, -64004, -41155, -16891, -24067, 8341, -34149, -18199, 41603, 6069, -5290, -29800, -24253, -41445, -22737, -1435, -43876, -54676, -13299, -52652, -83859, -26741, -7213, 11969, -41135, -43127, 11756, 80049, 73841, 27525, 65655, 130130, 135746, 100031, 64236, 35340, 45110, 23174, 18096, 17705, 2235, 28455, 75582, 75425, 60700]
26860F0700k3893j6999m8458N88M7292N84l8457J8774M1763K314j3478k9874L7867
26847C8723K7059m0366k6111L3471J4838j8371j3162k6823L1349j9014o41j3851
26835a2899n2570j1903l232M4705k4246l4557M5595Q70J8765j7466n353K5278
26823b7013M8547K3653m5841p8N6109l3429k9701k9142r234K6848N348K2788j61
26810H694r677p6012J9967N6158K1249l715n7037N727L3483P329n7573p593Q0114
26797B1114K8327o0949l1805O1978K3123N825J7617r63K6289n3892k3261K7953
26785D1356N376l1242k0695P3861L8424l020n9666l3469L650k863K4981M7668
26773H4361J4377k6424n0141j6337p5923J7621J0996O5340j1565m1610M3146K1901
$$ y = [60700, 36807, 19808, -28650, -28062, 19230, 19814, -18643, 131, 41894, 44208, 30730, 856, 38723, 65782, 25416, -695, 32776, 47614, 29243, 16081, -10742, 20607, 1593, 952, -12899, -65469, -77372, -80604, -35899, -60145, -94702, -49107, -48237, -29472, -46938, -52291, -27013, 21534, 45187, -654, -732, 55377, 21948, -7753, -36895, -46129, -19281, -13933, 8855, 8694, -983, -76995, -57028, -870, 20379, 16664, -40373, -34646, -1163, 6166, -51407, -59000, 21114, 49441, -11508, -43313, 18665, 41788, 47613, 65230, 64267, 90556, 36664, 13403, 41356, 46732, 15490, -5205, 68656, 107080, 104060, 44394, 10925, 14575, 11712, 36693, 84361, 98738, 72314, 22173, 5836, -70087, -52466, -41470, 23870, 12305, -29305, 13841, 35742]
26761C5742J492M1211M8765j9402l3564l1667r557m9447J3344N0590O6169l6686
26749G6990l0952R309m5119m1074K2174J266k4319R088j1612r036P071J1638L1694
26736G118M4078M2459M478q7793j9370K5420K1004k5857L1724j229n2762o7662
26724g8392j6724k3661L5223N7679K2913N3971O112Q989K27m7067m652K5906j9089
26711B1435J8106K0732l1185m0905k6063j5144k3289J0800M2553N873K806K4336
26699A0055K4810l9402m2899M8647L0702Q455m7910m3525n247K086J9101j7422
26687e2549L3300N6530j6395J1758J8376Q341l6042k8978l2740M1296N1868K545
26675E7310q623j8396m0709o84j1274l6547j6084N5702Q9527J0401l7838J1637
$$ y = [35742, 37234, 78445, 127210, 107808, 74244, 42577, 33020, -16427, -3083, 47507, 113676, 76990, 46038, 55347, 10228, -30846, -8672, -7406, -31725, -22637, -34249, -43285, -36214, -24576, 7118, 51196, 93655, 98133, 10340, -9030, 16390, 37394, 11537, 43261, 42032, -10730, -78392, -95116, -118777, -83554, -25875, -2962, 51009, 57121, 66110, 66337, 19270, 14618, 40524, 21435, 39541, 60273, 29088, -11817, -37880, -53024, -76313, -65513, -22960, -17087, -14281, 10055, 34865, -4537, -47436, 1211, 31913, 40368, -7542, -51067, -56314, -54228, -35127, -52549, -19249, 37281, 20886, 32644, 51020, 59361, 23319, -5659, -38399, 2897, 54765, 57310, 48687, 30291, -10418, -11102, -22376, -58923, -75007, -19305, 70222, 80623, 42785, 54422]
26663E4422j3778n52K5400K3885k3068k9746k4665M2295k1246j7060l5881l1059
26651e1053l6j2578N6284k8284j9867k2119l4147J1584K3648n047j9303L2908
26639f8010K9160J6433k1622J8749N933p4584q806J2684N6112K5102k8510l6060
26627g3419K3092k7621j1577M0318L5162m2601J2694o266P1310K3214k4925m354
26615A5027J7196m5863m856N2237J9743k8639k0464k6966m9657l4501O9290J9849
26603a7604J089Q4376M3038j8142k9442l4454o220M0977K3484k1858n9756p6599
26591g1111K7065N6985m425k9578J0137J1465m0257k6878M62N339j0907n2272
26579a23975J842L9895L3403O0667N5710J7598l0859l5735K9723P4587j8505m0389
$$ y = [54422, 40644, 40092, 65492, 89377, 66309, 36563, 11898, 54193, 32947, 15887, -19994, -51053, -51089, -63667, -7383, -35667, -55534, -77653, -111800, -100216, -76568, -81615, -100918, -68010, -38850, -22417, -44039, -25290, -19357, -93941, -102747, -90063, -33951, -8849, -37359, -73419, -50327, -77948, -89525, -49207, -14045, -56646, -43952, -50218, 21092, 44306, 19381, 15027, 32223, -13640, -18496, 33741, 53484, 24845, 4381, -22585, -72242, -106743, -37453, -17604, -16515, 67861, 110899, 92757, 63315, 28861, 22641, 63618, 87102, 65244, 5488, -71111, -44046, 12939, 8514, -21064, -10927, 538, -39719, -66597, -66135, -60796, -71703, -123975, -122133, -82238, -48835, 11832, 67542, 85140, 54281, 18546, 48269, 122856, 104351, 63962]
26567F3962K9102o726r3054q0508j5020L7394k689r1694j2745L4966Q6525J1298
26555c9189N2618J9110l1882j8554n8381M6960M0507k78k8750J936O0580m1584
26543C093o2290M0612Q969K4373L7380p0010J8836K6182m46l6888k0655k4465
26531e5309K2381L3732K7519k3844K8233M4820k9144m2821l2270L4470R830j3757
26519C840L1483L4671k0828J9626L371j2883l6408J2171K6394M1285l0215n8639
26507A3868M3980J6248p651k5441k1212j2337K576K552j1813q651k9603N0109
26495A2625J3583K4994l833L3608k7669j1909K912M843J7115l0302L3098o679
26483F2386k1345j8368k8822L3281o8378m667K7162K8554j5105K2587J7711M371
$$ y = [63962, 93064, 86338, -6716, -87224, -102244, -64850, -67539, -159233, -171978, -137012, -50487, -39189, 13429, 32539, 657, -17897, -76278, -29318, 11189, 10911, -17839, -15903, 44677, 3093, -59197, -18585, -9616, 14757, 52137, -17873, 963, 27145, 26699, -10189, -30844, -55309, -32928, 804, 28323, 4479, 32712, 77532, 48388, 5567, -26703, 7767, 17597, 3840, 35323, 69994, 49166, 68792, 72163, 59280, 22872, 35043, 61437, 102722, 72507, 13868, 57848, 74096, 66445, 41004, 19792, 7455, 10031, 12583, 770, -7881, -37484, 12625, 26208, 51202, 47369, 80977, 53308, 41399, 44311, 49154, 66269, 35967, 69065, 62386, 41041, 22673, -6149, 27132, -41246, -45913, -18751, 9803, -5302, 17285, 34996, 39367]
26471C9367k013o268O471k9796k9448m785Q78J8817l2168K0275L9082m8922l4977
26458f3487P1556K0490N3309L2350j0787m4914j9603N2472L3863j4080l5963m1468
26446C3738p0446j6669j2584m709J238n125L2376Q2791M639l5699J2564l0616
26434h502k0836j553l266m1968J9794J3838r345l9878L5344K9726k0397r510K2394
26421c4159o6896P886M0692m6436p362J0588K6784J0321K4962K2935m48k378J051
26408a2460l6885k9623J61p37K0471M34r345j4558k7891k3085l3598R5719J4434
26395e6963L8186L8525m2436k8842N4151N1003K4245k7983L3786o882m4208l4059
26383a477m3256M4831J5781J4910j2997l1289K8859K9424k2724m860j3081n382
$$ y = [39367, 37354, 31086, 37557, 7761, -21687, -26472, -25594, -6777, -38945, -18670, 20412, -28510, -63487, 8069, 28559, 81868, 114218, 103431, 58517, 38914, 91386, 125249, 111169, 75206, 33738, -36708, -53377, -65961, -70670, -69432, -74557, -42181, 40610, 45249, 9550, 22114, -8502, -29338, -30891, -34157, -76125, -56331, -42493, -51838, -91716, -56372, -26646, -47043, -56553, -34159, -101055, -93169, -52477, -98913, -106275, -95687, -68903, -58582, -33620, -10685, -11133, -13511, -12460, -49345, -78968, -78807, -79544, -59073, -58639, -67984, -82542, -110433, -133518, -167116, -71397, -56963, -18777, 19748, -22688, -51530, 2621, 53624, 77869, 49886, 83672, 76790, 32582, -1477, -44733, 98, 15879, 30789, 17792, -13497, 15362, 44786, 22062, 17202, 4121, -1261]
26371a261m0013n7001L0068J2162K5716L8151j0113j5268M9884K7697k5668m2999
26359h645k0828N4773M189j16254k3028Q7155L736K871M4187N1057L546M050N751
26346I2560j2343L898n070j8577k858q359k4000l3541K057k245N625j3428m1293
26333e7574m5870j4889j4272N3326K6240m77l8375Q232K3429j0142m832J6859
26321e8345l1909O2699M0470J0347k9982j7377J6770J4191j0959R770n072p781
26309g178Q5648j3272r381k4435l0422k8498j3493L0222M258o609m5703l1144
26297i0007R735Q8502Q5773n9609q2453J2328O1451N8409j8426k2718M097l5958
26285A1124k6098J0741J5722k3158l2707O571M3018M0494j0251p0190m9170N485
$$ y = [-1261, -41274, -98275, -68207, -56045, -30329, 7822, -2291, -17559, 32325, 60022, 34354, -8645, -29473, 25300, 29489, -86765, -109793, -22638, -18902, -16031, 28156, 79213, 82759, 86809, 92560, 80217, 84115, 79045, 60468, 57610, 49251, 25251, -8290, -6233, -8478, -2853, -16281, -57574, -103444, -118333, -132605, -79279, -53039, -53516, -91891, -83659, -60230, -70372, -75204, -58345, -90254, -27555, 12915, 23262, -6720, -24097, -7327, 6864, -4095, 5675, 603, -7178, 78470, 65198, 55817, 31382, 960, -27538, -41031, -10809, -6551, -13160, -58863, -90007, -80272, 8230, 94003, 34394, -48059, -35731, 25720, 84129, 65703, 42985, 47082, 11124, -14974, -4233, 11489, -11669, -44376, -37805, 5213, 45707, 35456, -34734, -83904, -78419]
26273g8419N8422j7057k3579K9461J8561l2747J8772j9842J5783L7220M230j2747
26261a942p239L5124K5640l278l641r538p4l7731l5508m0557k2606M3404K2442
26248c5504O9256O756j3048K8456J1410k1962l2094k8304K1754P0036M8344p266
26236A17834r0603n7280P2210K9563k3708q706J263m2515n565j3502k2626K6662
26224a6973K8908J6499O5341r152n0242k2778l9257j6666O3280O9093l7596j1451
26212C9006Q484l1454r405m3658K4287J3484n9419n7470k6164J0327N0652P6027
26200e303M827j6765m7274J6904M9562K920m0651J7002L7062N2359j089p2302
26188b748J9802M8287j3267L587l791k1550j1205J9384j5077J8498M3041m5176
$$ y = [-78419, -19997, -37054, -60633, -31172, -12611, -45358, -26586, -46428, -30645, 6575, 10805, -1942, -9181, 25943, 51583, 48305, 44664, 35126, 35052, -2679, -38187, -78744, -101350, -57946, -35504, 33752, 40508, 27460, 55916, 67326, 45364, 13270, -15034, 6720, 76756, 125100, 117834, 27231, -30049, 42161, 71724, 48016, 39310, 40573, -1942, -7507, -21009, -43635, -16973, 11935, 28434, 93775, 84623, 34381, 11603, -27654, -44320, 18960, 88053, 50457, 39006, 47490, 16036, 6631, -37027, -12740, 744, -58675, -116145, -142309, -131982, -81330, -5303, -476, -17241, -64515, -47611, 1951, 4871, -35780, -18778, 18284, 70643, 69554, -2748, 17054, 65341, 52074, 55661, 51870, 30320, 19115, 38499, 23422, 41920, 84961, 39785]
26176C9785j7941J9061N697L0249o0568n5277J5476J0844K5531L8484k5374k4094
26164A873k3025L8262J4331K0273o733l9628K556p725r780K8252J9402K56m3916
26151e602n6311K254K1891L2160k0733j5471K3828j9747M8179K1415J140m5100
26139a2097K924j585L731K2650J1201k0866k6467M7407o569m9886k2928J3021
26127c9464O9252Q557j5652k9693J0564Q257m2901j5231L2399N694N1196n8404
26115a5426O172l2704M0771O1220O131j6178k2283K9410k8296j4823L8507P3545
26103A26046L0081k0602l0706N241o1837n4476K1337R635R597J6630O8708J1133
26091A30787j9416m8491n552K3488L3912q0783J9509K7661o0683j7284k9470K3311
$$ y = [39785, 21844, 40905, 46602, 76851, 16283, -38994, -23518, -12674, 12857, 51341, 25967, 1873, -21152, 17110, 31441, 51714, 44981, 5353, 7909, 184, -9596, 18656, 38058, 38314, -5602, -61913, -59659, -37768, -5608, -26341, -41812, -17984, -37731, 10448, 31863, 33003, -12097, -9173, -10758, -7027, 15623, 26824, 5958, -20509, 26898, 20329, -29557, -52485, -39464, 29788, 38345, 22693, -7000, 3564, 11821, -31080, -46311, -13912, -8218, 42978, -15426, -9254, -41958, -1187, 60033, 66164, 49986, 27703, 57113, 28817, 13994, 52501, 126046, 156127, 135525, 104819, 110060, 48223, -6253, 15084, 24719, 34316, 50946, 119654, 130787, 111371, 62880, 57328, 80816, 114728, 33945, 53454, 81115, 20432, 3148, -26322, -3011]
26079c011J2256j4022k2099K3777L4240k8227p0932k2800J00475k1494l5961M6947
26067h51K2378j2606k9166o0907l0959L8926K4018K4909O899p0697J5080M4408
26055b8568J2335L9466J7598l1656m6073N5311O017m662P695L5264n9475o5293
26043f2041l8648p538M4114L4829L1101n56K9490k5956p7680J4519K9302K5679
26031c385L1823L1025J0317k4699j0319k4065J2861n7058m4481n0069j3112K9047
26019a12115M3720R845L5080J0518K1823m910k518j8586K2448j0239j4760M2470
26007B2776j8518l1042j6250L9100j7315p2251k3395O7171J04704N6603o1094
25996E0489m1447L8990n6952o6260l6813J1243K0892O3787R272q257K381j4890
$$ y = [-3011, 9245, -4777, -26876, -3099, 31141, 2914, -68018, -90818, 9657, -11837, -47798, -851, 21527, 8921, -20245, -81152, -112111, -73185, -49167, -24258, -17359, -88056, -72976, -28568, -16233, 23233, 40831, 9175, -36898, 18413, 24430, 19768, 27463, 62727, 3252, -62041, -100689, -108227, -64113, -29284, 1817, 1261, 30751, 4795, -72885, -58366, -29064, -3385, 28438, 59463, 69780, 45081, 34762, 10697, 23558, -33500, -77981, -128050, -141162, -112115, -68395, -58550, -23470, -12952, 8871, 3961, 1443, -17143, 5305, -4934, -19694, 22776, 4258, -26784, -43034, -3934, -21249, -93500, -116895, -49724, 54980, 111583, 50489, 9042, 48032, -8920, -75180, -111993, -100750, -79858, -16071, -6799, -15056, -12675, -27565]
25984b7565P410J2632p34l1338N2694J800K4116j5501j6939k8678p785J1388J5174
25971c326N0774R959Q920o942l8903j1984l0815J43L9076N8407N0715m2971m7284
25958C5769k0641o2119K9664L2124r766K15m484L4931J9006j4485J1415L5929
25946H7558k5700n6902K9884M1520j9798q0003k5137j1590p5978J9917R3471K5564
25934B806J1363l4061l3931k396L1833J5102o9093m4308R943K8217O9793P6278
25922F1546p393l2377n830k6711m3128p327Q2212K7158r03m1791m3135K2702R951
25909e026k2237L4307l623j102K0129m7606N5027J8449o7224m7974r062J4856
25897f1086k0726J0742J13717P6427n7768j5093R839J9607J0681l9107j05282
$$ y = [-27565, -20155, -7523, -8257, -39595, 13099, 14899, 39015, 23514, 6575, -22103, -29888, -18500, -3326, 47448, 57407, 66327, 59385, 20482, 8498, -22317, -22174, 16902, 75309, 126024, 83053, 35769, 15128, -46991, -17327, 14797, 5031, 5246, 762, 35693, 54699, 40214, 51629, 87558, 61858, 4956, 34840, 76360, 56562, -23441, -48578, -60168, -136146, -116229, -22758, 2806, 14169, -19892, -53823, -56219, -24386, -9284, -78377, -122685, -112742, -84525, -14732, 61546, 54153, 21776, 15946, -10765, -53893, -61220, 20992, 48150, 47247, 5456, -37679, -14977, -5026, -27263, 7044, 3421, 2319, 22448, -25158, 29869, 48318, -18906, -66880, -75942, -61086, -81812, -71070, 42647, 119074, 61306, 46213, 56052, 75659, 86340, 47233, -58049]
25886e8049J3535K8527M6287L0959l4490j8930L2292l4249m865p803Q1636M8967
25874A23817n4325q5841j4577o978j1662m3157p0035O4566N8478j3891k7601M8250
25862c2956N1314J9850n439N1707M6927l8995p5371n6303J8046L3964J8785p544
25850B3985J105n5676o8774J9060N8923N4771N1441O8794o202l5332n2747n203
25838E4145M5497k8550M420k8983j3834k1020L644j3235j7588j5419m1350n727
25826g8000O2668M1449J7970m6560k3414L8049R433j4852k2483M683k3580K4515
25814a0122M2860n0165k5523P5738L0136o8438L9018J2658k4077K4621L2108L2328
25802A11142k2449K2088J78q117o2402k1707k2750o1998M071k0395l0814O5382
$$ y = [-58049, -44514, -15987, 30300, 61259, 26769, 7839, 40131, 5882, 1017, -6786, 74850, 123817, 69492, -16349, -30926, -37904, -49566, -92723, -162758, -98192, -39714, -53605, -81206, -32956, 18358, 38208, 32769, 84476, 131403, 92408, 17037, -39266, -21220, 12744, 31529, 23985, 25090, -30586, -99360, -80300, -21377, 33394, 84835, 153629, 147427, 112095, 59348, 54145, 99642, 71092, 75512, 46529, 32695, 11675, 15319, 2084, -15504, -30923, -72273, -78000, -15332, 26117, 44087, -2473, -25887, 12162, 21595, 6743, -15740, -11057, -34637, -10122, 32738, -17427, -42950, 32788, 62924, -5514, 33504, 46162, 22085, 46706, 78814, 111142, 88693, 110781, 110959, 102842, 40440, 18733, -4017, -66015, -61944, -82339, -113153, -47771]
25790d7771L8074L6508K1600l2789k3784l8621J1273N5034P8931l2231l1838K5701
25778F0087j5822n6103K1374P7195k1052p0081j2477k3163J2853M7840j3150l7126
25766b9625o8993L0812K5082q671J7376J9024J0174P961M4812O7685J8065o2147
25754G1555n6698n3640j7205M4594m2057l114N877J5171n2094k9215j7895O3862
25742g0859q131P267r394m0035k4855J08781r855J3661M825L6688K5912k3460
25730A0545m2388n4660N9303M0273J2283k5321l5389J1566M1962M3132o8564o4911
25718g2169l1049J6433K0941M471k197M9827L5280l1406l2264M8306j0964j2334
25706a7125J189J2512J9013L779q844L5079P893l7515l0026J2605K0317j4977
$$ y = [-47771, -9697, 26811, 48411, 15622, -8162, -46783, -35510, 19524, 98455, 66224, 34386, 60087, 44265, -11838, 9536, 86731, 65679, -4402, -16879, -40042, -27189, 20651, 7501, -29625, -98618, -67806, -42724, -51395, -34019, -14995, -4821, 3140, 47952, 115637, 133702, 71555, 14857, -38783, -55988, -11394, -53451, -56565, -50688, -35517, -87611, -116826, -134721, -70859, -78990, -71723, -81117, -121152, -146007, -37226, -47081, -33420, -28595, 8093, 34005, 10545, -31843, -86503, -27200, 13073, 25356, 35, -35354, -23788, 18174, 61306, -7258, -72169, -103218, -86785, -65844, -61373, -63570, -13743, 21537, -9869, -42133, 6173, -4791, -17125, -15936, -3424, 15589, 19368, 10524, 45603, 53496, 15981, -14045, -1440, 18877, 3900]
25694C900K515j6137l3996M7183j7031l9891K9098j9762o5162M3407O0570L0105
25682B4799J0433l9385J3811M0979k836J9846m0904k7044k1161K6729J7701o3797
25670d0829m884O1736K5630k2659k1737k9352J4515M4804R60k1705m633k9428
25658b7582K9664P0821O1722j0172j04686l4954M8505P218k180j3853M210j2149
25646A6564o5073n5540L5546M2445L6784l4403m110K7530J8492k6181n7553k7966
25634i3465M7670L3501m3695Q501O447k4019L041Q836L2520J6761J8935J3492
25622B8525j0721J2069M4012J7332l1215j1533q1840r2704k7674K2626P1661K3966
25610c5496M3790P597r808m4636p7628O165P5759O9813M1887J9999k4997j8702
$$ y = [3900, 6415, -9722, -43718, 3465, -13566, -53457, -24359, -44121, -109283, -65876, -5306, 24799, 35232, -4153, 9658, 50637, 47801, 67647, 26743, -301, -21462, 5267, 22968, -40829, -45713, 16023, 41653, 18994, -2743, -32095, -17580, 27224, 28184, 6479, 1846, -27582, 2082, 72903, 134625, 124453, 19767, -15187, 33318, 40536, 38356, 24503, 28713, 16564, -48509, -104049, -68503, -26058, 10726, -23677, -27787, -257, 18235, -7946, -65499, -93465, -45795, -12294, -55989, -47488, -41041, -65060, -62019, -53183, -20663, -3902, 15033, 28525, 17804, 29873, 73885, 91217, 60002, 48469, -33371, -126075, -153749, -131123, -59462, -35496, 8294, 15891, 6083, -38553, -116181, -110016, -34257, 35556, 77443, 97442, 72445, 53743]
25598E3743n9473j5887l236j2264m035K6121m3181o0842l7031J066K8024P2309
25586e4686J8285L462L6063K511j4553M798l0503L9444j7079k2933o532m2325
25574h4048k3636P696K2963O9645N4376R908m2474n1099L9839j3119j2984N0895
25562B7962l2025n030l9221k0554M555L0399K0780K2168K5099J4932n656p716
25550C5693K6918J5401j6746k4475n4710q303j2291k0552L5852N3517k4544j3167
25538g407K9004O6002j0027m4695k0450j9839M7104o987n2209o980M0654k5627
25526a1457j5012K383R8203M3102p5208n1655r670j2086K6994O6391k8913k7274
25514E798j2106R452L113J0749n718l7244q820m020L3578n4044q322K1704r78
$$ y = [53743, -5730, -21617, -24853, -37117, -41152, -15031, -58212, -119054, -156085, -155019, -126995, -54686, -36401, -32939, 3124, 5635, -8918, -4120, -34623, 4821, -12258, -35191, -41723, -84048, -107684, -99988, -77025, -7380, 46996, 56904, 14430, -36669, 3170, -9949, -22933, 27962, -4063, -9093, -48314, -68868, -64313, -33914, -13134, 9034, 34133, 49065, 43409, 35693, 62611, 78012, 61266, 36791, -17919, -26222, -38513, -59065, -23213, 30304, 5760, -7407, 21597, 87599, 77572, 32877, 12427, -7412, 39692, 32705, -19504, -26484, 14170, -11457, -26469, -24086, 74117, 117219, 42011, -9644, -19314, -31400, -4406, 61985, 33072, 5798, -6308, 3144, 6257, 17006, 11288, -25956, -34776, -38796, -5218, -59262, -67584, -45880, -46858]
25501d6858L1414L5624m0146J3528O1905M493o655q557j3203n7273J4435n179
25489a6472j4759k3522j619j9886K3148N7642K0815O101m1842p5066l5498O13
25477a20345O6153K8391l2482k431N4425K7765J3101K7622j4406l2099m0162j1495
25465c5963O9012K7167k1780k6549K7473L762l210j4830N696m99k476J8295l9373
25452F725j0652j4634j6803j4723J3343K80J1485l5913N168K1179j2143K1712
25440b4976j072j0890O859p198l8490O142l0087R066P6508l405n649J771j1451
25427c2872M0956J6131j0194M583M6844r550q3946k088L4742Q0277m6840j7361
25415B0682K4405J2937J3070k0600l3660j308L8660j8528m7617m1713L1562J5351
$$ y = [-46858, -15444, 20180, -19966, -6438, 55467, 59960, 53305, 44748, 31545, -25728, -11293, -16472, -31231, -54753, -56372, -76258, -53110, 4532, 25347, 31448, -10394, -85460, -120958, -120345, -54192, -25801, -58283, -60714, -6289, 21476, 34577, 62199, 47793, 15694, -24468, -35963, 33049, 60216, 38436, 11887, 39360, 43122, 39912, 25082, 30778, 30279, 27803, 46098, 6725, -3927, -18561, -35364, -50087, -36744, -36464, -24979, -60892, -55724, -34545, -46688, -24976, -26048, -36938, -30079, -37277, -75767, -69625, -99712, -90646, -14138, -17543, -23192, -21421, -32872, 8084, 24215, 14021, 18604, 65448, 55898, -28048, -30136, 4606, 84883, 38043, 20682, 45087, 58024, 71094, 50494, 16834, 15526, 54186, 35658, -11959, -53672, -22110, -6759]
25403f759j9847j1371J4824K2719O7070K026k890o7381L4386O5348R475L8095
25391A45695p322N456n6441k9016l8077k9666o781p830K3089J1841R867j5529
25379E286L7839N722K4334M203k1138p559k8309L0572k3806j1493n3635m498J1375
25366c1107J4325J7597L4805L1985l3061p8860k5790j1609J6119n556K6041K3999
25354b1112r155J3650J8070L646K8008L2055p971o3021J1016K374J846l8633l1423
25341f0650r352O6358m216J8410M3825l2819l9117k4800J6479k99j1669j103K2119
25328a6834k8133J6519M1782j3067k3339m1569n469m822M1604m1616L629J8349
25316e2966J4582l8249o186K5033K588L7491k1946j0925L6697k2007m0307m644
$$ y = [-6759, -26606, -37977, -23153, -434, 66636, 68662, 65772, -1609, 32777, 98125, 107600, 145695, 138373, 143829, 87388, 58372, 20295, -9371, -16152, -23982, -893, 10948, 20815, 5286, 43125, 48847, 73181, 77384, 56246, 48687, 20378, 50950, 27144, 15651, -37984, -42482, -31107, -16782, 815, 35620, 67605, 34544, -44316, -70106, -81715, -65596, -71152, -45111, -21112, -30267, -16617, 1453, 5099, 33107, 65162, 57191, -5830, 5186, 7560, 9406, -29227, -60650, -70002, -3644, -7860, 10550, 54375, 21556, -17561, -42361, -25882, -26181, -37850, -38953, -16834, -44967, -28448, 13334, 267, -23072, -64641, -70110, -74932, -33328, -74944, -71315, -52966, -38384, -76633, -82819, -57786, -55198, -17707, -39653, -50578, -13881, -35888, -76195, -80839]
25304h0839K1450J9204K0137r374Q572l3802j0042J11905M2348m8884o3485k3391
25292d6201p3216k3542M5677Q1029l2893J1692K903J5223J505J5277K873l0018
25280b9691m5293O068j0807K3036p327l0915k5473j7237R5297J6565k6402K0957
25268c1222N8628j7293l9528n720k7691K438r606L5840Q2965L542l4478J6718
25256C4593k1796L9231M7783Q917j3909n0672m5321l5781k3961m1612J3579L1826
25244e7123K4328j4183K2137K3030J4790O5402J7010o9054l9724K0381J5940K4973
25232D7907l4922o8468q60N8333M6327L7848K2502L6170j4419p882M796m552r777
25219A13003j8217o6742m9948l2326N749M3141K2869K8334K1223K8294J4412k0598
$$ y = [-80839, -59389, -40185, -20048, -29422, -20850, -54652, -64694, 47211, 89559, 40675, -22810, -46201, -119417, -142959, -97282, -16253, -49146, -37454, -34551, -19328, -17823, -2546, 327, -29691, -74984, -68916, -79723, -56687, -64014, -94929, -120402, -137639, -42342, -25777, -52179, -31222, 27406, 10113, -29415, -35135, -62826, -60388, -69994, -34154, 48811, 52353, 17875, 34593, 12797, 52028, 99811, 108728, 94819, 44147, -1174, -36955, -60916, -102528, -88949, -57123, -32795, -46978, -24841, -1811, 12979, 78381, 95391, 26337, -13387, 6994, 22934, 47907, 12985, -55483, -56343, 1990, 48317, 86165, 108667, 144837, 130418, 122536, 127332, 122780, 113003, 94786, 28044, -21904, -54230, -48481, -5340, 17529, 45863, 67086, 95380, 109792, 89194]
25207H9194p4422K5077k2879r732j0923l6986J6622l8168k2637k4832O533K5531
25195g7622j5228N4478j6647N9131O49j7349lK2312m1655l326J601l455m6683
25182h3797k219k3226k214O5207L9572l2031p5194N892K1065j8220K0587N805
25170g8773O9621P1599L5324l4366P512K9874m3865l1050j9023p453J2517N6493
25158F8410R28K8107K88o2670l0388J9257J6931M603l514O381l0401l0441j638
25145a4147J266K6935L3127O1803J692n6575J0144m0539O681l2720k9183P164
25133b4352l0087m5349L8869L9676R708J6321p7942n9342L5508K4774m20L169
25121f9467M6147K724p330k3729J662o857K3847n307J1071J4628L0119N934K6317
$$ y = [89194, 14772, 39849, 16970, 7238, -3685, -40671, -24049, -62217, -84854, -109686, -103153, -77622, -92850, -38372, -55019, 4112, 4761, -12588, -12591, 9721, -31934, -35260, -33659, -37114, -83797, -86016, -109242, -111456, -46249, -6677, -38708, -113902, -108010, -86945, -105165, -84578, -78773, -9152, 62447, 97771, 63405, 70917, 100791, 56926, 25876, 6853, -600, 11917, 68410, 69338, 97445, 97733, 35063, 4675, 23932, 40863, 45466, 41952, 48333, 17932, -12509, -14147, -12881, 14054, 47181, 108984, 110676, 54101, 64245, 23706, 30387, -2333, -31516, -24352, -54439, -99788, -60919, -21243, -11535, 4786, -73156, -132498, -96990, -72216, -72636, -69467, -23320, -20596, -27926, -51655, -49993, -56850, -33003, -38310, -27239, -12611, 17508, 23442, 49759]
25108D9759j9898k3365J9417J1735O3225k9791j3366L026J2391n8794j6842L0127
25096B7624k5782n8196J6696k972J604l0381j4449L1773J9538J5211O640K4067
25084A1373Q451k4141L791k6268J6169J4070k9399L2165L6697p0454J8927j1272
25072a9891k3054J8965j0636O3K8387k8686k2101L2242J03749N0266p6590o2634
25060i920P222M39m3001l3455Q685k1261n321l159L4166J09465K6046l041L437
25047G0302n089n8801k8331M4131J9540k4278m2257j6539l9305L867P0525J2000
25035E765p8320o3294O3494R6268P1305O9345k0845o2223j7567N2775l7984N273
25023H3992J2205Q707m127J0629l7801l6794n044J0445k4737k7040L8130L3694
$$ y = [49759, 29861, 6496, 25913, 37648, 100873, 71082, 57716, 60742, 73133, 14339, -2503, 27624, 1842, -56354, -39658, -42630, -41026, -71407, -85856, -54083, -34545, -19334, -12694, 11373, 19824, -4317, -526, -26794, -10625, 3445, -25954, 6211, 42908, -27546, -8619, -19891, -42945, -23980, -34616, -34553, -6166, -34852, -56953, -24711, 79038, 129304, 52714, -9920, -2698, -2259, -45260, -78715, -70030, -91291, -96612, -99771, -65605, 43860, 69906, 66865, 70302, 65213, 6412, -21919, 22212, 41752, 17474, -24783, -41322, -80627, -76760, -6235, 5765, -72555, -135849, -72355, 23913, 95218, 164563, 143718, 81495, 63928, 116703, 78719, 83992, 96197, 104904, 100777, 111406, 73605, 36811, 31767, 42212, 17475, -9565, 28565, 62259]
25011F2259K3171m7289m3416m4554L588P3860L6816n0209q298L7092q4642j721
24999d3343M6525j8964k2026p290M0635J6758N35l6931K9578j2755k5052Q661
24987b3669N810p213K5238p6233j8881M3192K3721O0978K5486L7151q39l7826
24975E6915n6636l5040L8027J176k8039j8549n478J9888J2688j4984M5133J0616
24963B5717k9379k5565M5145K6045K5543Q159Q949p2466m933k6416j2593o750
24951c8544j238j3558Q3294o2692m9767M676M1561J0219l917p1626L1014O9160
24939a418J4836k3302P930j2150j4007J1171J2347K2395l7217l6688L0557M1005
24927A5459L6886K9317O669n1887QM6673n7431n9956j7554k5429l6982j1229Q9146
$$ y = [62259, 85430, 38141, -5275, -49829, -46241, 27619, 64435, 14226, 5928, 43020, -41622, -43343, 3182, -15782, -37808, -45098, -4463, 12295, 12830, -24101, 5477, -7278, -32330, -23669, -17859, -25072, 166, -76067, -94948, -51756, -28035, 32943, 58429, 95580, 94741, 56915, 279, -34761, 3266, 4442, -23597, -42146, -47624, -27736, -15048, -30032, 15101, 25717, -3662, -29227, 15918, 41963, 67506, 75665, 84614, 12148, 7215, -19201, -31794, -38544, -39782, -53340, 29954, -32738, -82505, -77829, -36268, -26049, -29966, -101592, -70578, -1418, 13418, -9884, -1954, -14104, -28111, -16940, -4593, 17802, -19415, -56103, -25546, 15459, 52345, 81662, 88331, 36444, 36452, 83125, 25694, -34262, -51816, -77245, -114227, -125456, -36310]
24914c6310J7694q508l512k1924o288r769k2231j8519k2513N9391R2766L8677
24902E8954l2761k0531j8261l0699K219k6553p443J5262j1925K5811Q1720j2890
24890B2903n8106k9621N0176L0734k705l394p336L7233Q390l7891o3640Q079q961
24877e4139L8483K8025J4564J8609j6916j7867N3043l4621j4671K0751J0154M8019
24865I3434M031j6433j5590J4151K2074n3939p0428l7707j9175L8070R5915m2694
24853A1709l3871L4629n0732n8122K0289o387K6522J7486k8498L812N427K3572
24841c4164j6178J1686R9199j767j13197Q857O8926k4850j9258M8713j7092J8770
24829B9645m3327j994M2715K6077o2042P7561N2345j11497j08788l282J4593j8717
$$ y = [-36310, -18616, -27124, -30636, -52560, -58848, -68617, -90848, -109367, -131880, -72489, 20277, 58954, 26193, 5662, -12599, -43298, -41079, -67632, -75075, -59813, -71738, -45927, 35793, 22903, -35203, -64824, -14648, 16086, 13381, 9987, 2651, 39884, 48274, 10383, -53257, -45178, -54139, -15656, 12369, 26933, 45542, 28626, 10759, 63802, 29181, 14510, 35261, 45415, 93434, 97465, 81032, 65442, 79593, 101667, 47728, -22700, -60407, -79582, -41512, 54403, 11709, -22162, 12467, -38265, -96387, -76098, -82485, -55963, -38477, -66975, -63163, -57736, -34164, -50342, -38656, 60543, 58776, -54421, -45564, 23362, -1488, -20746, 27967, 10875, 29645, -13682, -15676, 27039, 53116, -8926, 68635, 120980, 9483, -99305, -102587, -87994, -106711]
24817a06711l586N2015L9725J3749k0716p774M8804O113K870L2792l9577m9882
24805c2178p971O216L8176K7549J585n942j9106o657l904j2018m6239n0386k8170
24792a39045q81L2242K2807L3965J3148o4532j7264K5829O8880K2673J0135j3873
24780e916J902M8327L2334J6200N0354j03723k6473K9978j2975r126p680l8089
24768b4887p9953L2682O4180M7553P162L0181l2769J742J08646K3103o4053p9870
24756C3717N2582J1892n5582p6380o719K4414N0114m344k6201K4689k2145m0915
24744c4878k612J7016N760k7158r42O49n520N0217K3341k4007j1928N2880l1249
24731A1569R61O3074K7664o3775q1667R475K2177M28L4292O0017L3576J499R233
$$ y = [-106711, -110297, -58282, -18557, -4808, -25524, -33298, 15506, 21619, 24489, 57281, 17704, -32178, -40149, -33933, 4243, 31792, 33377, 27435, 8329, 1672, -2232, -14250, -60489, -110875, -139045, -139926, -107684, -84877, -50912, -37764, -102296, -119560, -93731, -24851, -2178, 7957, -5916, -4014, 44313, 76647, 92847, 143201, 39478, 13005, 42983, 30008, 20882, 13202, -24887, -104840, -72158, -7978, 39575, 46737, 76918, 44149, 45891, 154537, 177640, 113587, 33717, 86299, 98191, 42609, -33771, -40490, -16076, 34038, 29694, 3493, 28182, 6037, -34878, -37490, -20474, -14714, -41872, -42814, -42165, -47685, 2532, 25873, 1866, -10062, 42818, 11569, 12530, 75604, 103268, 39493, -42174, -32699, -10522, -10094, 24198, 84215, 117791, 119290, 128523]
24718A28523m2396n1953p1085j9731l801R214O2823K4492J4446J7913n0681J3681
24706C1445L2068m4199k1056K3212p363o5945p2532K1779Q9213N0273J4507P605
24694E9007k3342L5876j9004j22059m1532K5221J4477K2181L5529L3443k8783
24683h986K0768O385j377P337l2492J4407N6578K7614k7660n9881K1618k2612
24671A699j1790k5002J276P355L0263o183R462K7589m3287o8403l6426L4071K2956
24658e6420k1075L704J4422j719L5681j982K5184K4571o905m0704M0215j1983
24646B989l4556n1129J6151k0015K4664Q4947n638k9799j9626J3177j2370r893
24634d1098L9358K8250J7852m9657L5722L3879n7658k8932K6740l2058K2182J8897
$$ y = [128523, 86127, 34174, -36911, -56642, -60443, -51229, 11594, 36086, 50532, 68445, 17764, 31445, 63513, 19314, -1742, 21470, 14107, -51838, -124370, -102591, -13378, 36895, 51402, 59007, 35665, 71541, 52537, -69522, -111054, -85833, -71356, -49175, -13646, 19797, -8986, 11782, 18167, 16790, 24127, -8365, 6042, 62620, 90234, 62574, 2693, 24311, 1699, -10091, -35093, -33817, -26462, 3801, -2382, 7080, 34669, -8618, -77021, -113447, -79376, -56420, -77495, -73791, -59369, -61088, -25407, -27389, -2205, 22366, 15461, -25243, 14972, 2989, -31567, -82696, -66545, -86560, -61896, 23051, 17413, -12386, -32012, -18835, -31205, -41098, -1740, 26510, 44362, -5295, 30427, 64306, 6648, -22284, 4456, -27602, -5420, 13477]
24622A3477N9030L3259n3780p5404J0286L6293K3470l5032j930j2136J2962j4731
24610d236k2896J590k6012k1739K4747O251K5969J4979J3148J6318P471l1217
24598D373m0119j9611J7048l3354K3404L4978j2759j5058M0796L4296j2993J6427
24586C7428K8448N153k8004j0920J2208L6987J3686m7495p9683k784P654k7805
24574e5127L7652K9641O7777k3893r8074L0767j1007l3325k8762L5236M6978l5774
24562c7911j0443n20n0620J2193Q6922J7706K5538n0852j1931R589l1097J2502
24550b8924O8886p454l3647J6307n2063J3075K3488M895j7191K282k5520j946
24538c7812m1678p7465l0878R946J1845Q6501L9895l0708r980j1367K2025J4868
$$ y = [13477, 72507, 105766, 51986, -23418, -13132, 23161, 46631, 11599, 9669, -2467, 10495, -4236, -27132, -25542, -51554, -73293, -48546, -42295, -16326, -1347, 11801, 28119, 35590, 4373, -35746, -55357, -38309, -71663, -48259, -13281, -26040, -41098, -302, 33994, 21001, 37428, 65876, 71029, 43025, 32105, 44313, 81300, 94986, 47491, -32192, -34976, -27322, -55127, -17475, 12166, 79943, 56050, -42024, -11257, -22264, -55589, -84351, -49115, -2137, -37911, -48354, -48874, -99494, -87301, -379, 17327, 42865, -7987, -19918, -10329, -41426, -28924, 39962, 32508, -1139, 15168, -36895, -23820, -332, 4563, -12628, -10346, -35866, -37812, -79490, -156955, -187833, -177887, -166042, -79541, -39646, -70354, -80334, -91701, -69676, -54808]
24526e4808Q199O0446L6812N9374K4260q0334j03863j6232M152M2376k0221J5059
24514b4780L5067J7532P697l3712L789J4565N6308r7383j10132P0031L9093m4301
24502f6226J7585M7064l2418l2322l1212L1386J1502L7143J0276l403O0455M2368
24490I2198K2054n0206l501k1225j464k4026n3936L232J7421o0112J3301L3953
24478c2311L970N1465m4k6637n2266n4374k6196K3159O1980O6012k2793J8827
24466A0792Q601l5448j1247j3001L6988r74p245o365L7419O324l4517M0165M931
24453C6423L817N0581K3668J2130p1935q1420m667J8855j0763n0826l6102L9773
24441g0466J2410K2670m741K0439K6140p7555J1717M4944nq498M3114O106K4161
$$ y = [-54808, -46609, 13837, 50649, 110023, 134283, 53949, -49914, -66146, -61994, -19618, -39839, -24780, 10287, 27819, 35516, 1804, 5593, 20158, 76466, -20917, -131049, -61018, -21925, -66226, -48641, -1577, -33995, -66317, -97529, -66143, -54641, -17498, -7222, -10625, 49830, 92198, 114252, 64046, 60545, 39320, 37856, 13830, -40106, -36874, -19453, -79565, -66264, -32311, -28341, 23124, 23080, -3557, -55823, -110197, -136393, -113234, -51254, 14758, -8035, 10792, 19393, -16055, -27302, -40303, -3315, -4289, -11534, -17899, 19520, 25844, -8673, 31492, 36423, 40240, 90821, 114489, 126619, 54684, -26736, -31403, -12548, -23311, -74137, -110239, -70466, -58056, -35386, -40127, -19688, 6452, -71103, -59386, -14442, -14447, -22945, 20169, 26275, 50436]
24428E0436M386m9464M2476k9990k3109j8125k664M3482k4276m4020j4152M0832
24416b4188N2299m1004N912L8223j9178j6005R819l5066L0412J9190p518m7602
24404c4706l1775r480L7174O5226j377n2307J9854J8380M5358J5629k2303n5477
24392e804K625o254K2312l0947j826J7418J795l8834k2409P7326L8474j2388L8662
24379H0150n3828m3657J8195K3426J239l8771j6011n3206K1031L8120j4076k9064
24367f6452J3081K0740N0540L6625m784Q793O7437l0615j5215k5301l7993j6163
24355F93k5517n4679K2843m73O0908L9122M8996p955q7348l3595N091J2048k102
24342b1968N8934j4995q2350k5068M763L4994L40p330k831O1102L1913L1260j0467
$$ y = [50436, 54822, 5358, 47834, 17844, -5265, -23390, -26054, 17428, -6848, -50868, -65020, -24188, 28111, -12893, -6981, 31242, 12064, -3941, 5878, -29188, 1224, 20414, 12896, -34706, -66481, -75961, -38787, 26439, 25062, -27245, -7391, 10989, 56347, 71976, 49673, -5804, -3179, -9433, 12879, -18068, -19894, -2476, -681, -39515, -61924, 15402, 53876, 41488, 80150, 26322, -17335, 860, 24286, 25525, -13246, -29257, -82463, -61432, -23312, -37388, -66452, -53371, -32631, 17909, 54534, 49750, 58543, 125980, 95365, 80150, 54849, 16856, 693, -24824, -79503, -56660, -57133, 3775, 42897, 91893, 83938, -3410, -37005, -31914, -19866, -21968, 36966, 21971, -60379, -85447, -80684, -45690, -45350, -52680, -55511, 5591, 37504, 68764, 58297]
24329E8297j2417k6230j553p107K6924J3006N4407P604n2719J577J8923p2547
24317H165j3535m427j5570O712N9998k5110o8012n7266n184K1997O1163m7853
24305g8922l8347O9850P4287Q266O0400K0116o4246k9112m2348J8509M9972J2220
24293F0645j3906l0497m08K9003k0498k7104j0323K4262k6822m1695K825K0998
24281c3520Q0044K6726m0872L652Q112l0511K4039L110K4807j0504n4309o1566
24269f0792P423m645p589j114O5825M2729J294J6126j2147L8817m587j2780L0738
24256I9298m1424k4418k1198l0443K2687J9529K0696K8214M8807K3348n1554j9195
24244G4347k0861m3399m829k7719j6770M7905o015m3243k3545j3073N7750N7740
$$ y = [58297, 45880, 19650, 18097, 10990, 37914, 50920, 105327, 112931, 60212, 61789, 80712, 8165, -5370, -9797, -25367, -18655, 41343, 16233, -51779, -109045, -114229, -92232, -31069, -78922, -117269, -47419, 26868, 35134, 95534, 115650, 51404, 22292, -20056, -1547, 48425, 60645, 46739, 16242, 15834, 44837, 24339, -2765, -13088, 11174, -15648, -57343, -54518, -33520, 46524, 73250, 32378, 36030, 44142, 13631, 37670, 40780, 65587, 55083, 774, -60792, -53369, -58014, -65603, -66717, -892, 41837, 43131, 59257, 47110, 85927, 81340, 68560, 99298, 57874, 33456, 12258, -18185, 4502, 24031, 44727, 72941, 121748, 145096, 93542, 74347, 53486, 10087, 5258, -22461, -39231, 8674, 2659, -40584, -64129, -77202, -19452, 38288]
24232C8288J0336J5177J1053J808p526M1910n4150j1620L4154m2946m9663n5751
24220f8930K1271L4235P844L4545N0944j9742n7229p9590M017K5336k5782P4425
24208A344N2305q490o985M0755o3651m8888J1260M1678k8010K6040N7551O8495
24196A43404m7037m0912l384K0195L2643m4184k1625J2258o8912k6912k1908L3599
24184c2775O489k3278J9804K8053k9548p3446L0135Q1641J1567L964J4434O60
24172C7700k1054P018K1500J1669Q160J8079O5442K3365j4411k4545n1372J4787
24160I6338O273J0910M589k1197q479o255j0509r757j0768L4537L7711o5119l4547
24147B3727l3606k8665j2267M4088L5497m3670o410K4388m5776L989L2371K9142
$$ y = [38288, 48624, 63801, 74854, 76662, 69136, 111046, 56896, 45276, 79430, 36484, -13179, -68930, -47659, -13424, -5580, 28965, 79909, 60167, 2938, -76652, -72635, -47299, -73081, 1344, 53649, 45159, 38174, 78929, 15278, -33610, -22350, 19328, -8682, 17358, 74909, 143404, 96367, 55455, 52071, 72266, 104909, 60725, 39100, 51358, -17554, -44466, -66374, -32775, -26286, -49564, -29760, -1707, -31255, -104701, -74566, 7075, 18642, 22606, 37040, 37700, 16646, 23664, 45164, 56833, 64993, 83072, 148514, 171879, 157468, 132923, 81551, 96338, 102611, 113521, 118110, 96913, 88434, 82179, 71670, 61913, 51145, 85682, 123393, 58274, 23727, -9879, -38544, -50811, -6723, 28774, -14896, -21306, 3082, -42694, -38705, -6334, 22808]
24135B2808j2214o5931l6335K6163K4010j1077L415M2996J1014j092r963K6704
24123B0498l3129L75M4942J9549J5605K9363l3491k2367l7733k7942j6016m885
24111d5231K6300n058N3083O1667m3307l7060L4839K700q035l8987J215k4766
24099b2640k7822r947J8464L3906M1425K8544J3990O876p0886K7571P9202n1417
24087F7266k0030J4257j4973K0683m2395o2132K2334M3154k7048l400Q0973K3825
24075A02514j9147j0269n500J3475o724M3202N4073j3687K2538o399m5715p3924
24063E4437k9617l2903o0148J1221J0783N1783n100m3120J513L6899O3262L1040
24051I0050q0275n2565k552Q960Q541Q2619j4927m3464L0765N4258J3899J3111
$$ y = [22808, 10594, -55337, -91672, -65509, -41499, -52576, -49161, -6165, 4849, 3757, -6206, 20498, -12631, -12256, 32686, 52235, 67840, 97203, 63712, 41345, 3612, -24330, -40346, -45231, -18931, -23989, 29094, 90761, 47454, 10394, 45233, 47933, 39898, 911, 2126, -22640, -50462, -60409, -41945, -8039, 33386, 61930, 75920, 82796, 11910, 39481, 118683, 67266, 47236, 61493, 46520, 67203, 24808, -37324, -14990, 28164, 1116, -2284, 78689, 102514, 83367, 73098, 67598, 81073, 74349, 117551, 171624, 157937, 180475, 174076, 128361, 54437, 24820, -8083, -68231, -57010, -46227, 5556, 456, -42664, -41151, -4252, 59010, 90050, 9775, -42790, -45342, -36382, -27841, 54778, 39851, -3613, 27152, 81410, 95309, 108420]
24039A08420l2647j2818o7809R198K2582l3270J1727j2727J9257j0381m7658n5233
24027a01359J3371K8514N9053M6027L4749n4497m8082l8606l9747J2767K4825
24016f2985J9514n038J2222j9181J3735j4153M7725O6085J6168k8837k0352j8219
24004F684j4584J9482J8964P3435N1365o3784l7759k2690K7646k1684p145j7410
23992A2520N7467M970m8583N41K9087K2612o29o8463l9363m36n2550p104j3092
23979a03023Q896J4233O2418n497k5104O608M0406K2247l5353j8751k2262N2068
23967c114p865k5726O7520J4053o3881j2169L744N2065j3916o1334l3866M249
23955h0240K4290Q646m8321M9566J04793n0947l8769J3941K9113l2278r0695M0395
$$ y = [108420, 75773, 62955, -4854, 4344, 26926, -6344, 5383, -7344, 11913, 1532, -46126, -101359, -87988, -59474, -421, 45606, 80355, 25858, -22224, -60830, -100577, -87810, -62985, -43471, -48509, -36287, -55468, -41733, -55886, -8161, 57924, 74092, 45255, 24903, 6684, -7900, 11582, 30546, 103981, 155346, 91562, 53803, 31113, 58759, 37075, 29930, 12520, 69987, 74957, 26374, 26915, 56002, 78614, 77985, 9522, -29841, -30277, -82827, -89931, -103023, -94127, -79894, -17476, -22973, -48077, -41469, -1063, 21184, -14169, -32920, -55182, -3114, -10979, -36705, 30815, 44868, -19013, -31182, -27438, 24627, 10711, -50623, -84489, -80240, -55950, -47304, -95625, -46059, 58734, 7787, -30982, -17041, 12072, -20206, -110901, -70506]
23943g0506Q8198R137j1206Q936p9276P45K1963M8343K2101q365M6486N8187L0956
23930A65699m6197k0115l3392O0974J4502n7683l6725l9104l9406j2688J5174
23919b8961k6176K920J0136N3886l4491l2414K5465L4922L983j5698k5535m217
23907c6180k5630j9881O2270M36q2172q192l670L3107L2272J6206j2958K5759
23895a8633K1524k6450k6193p4931J4928L5612J3984k3325N4465J6219l8081j3513
23883f4394J3659J6643K9646L9408o2412l9110L0115K0688r637J4123j1205m2924
23871f5400j4531Q8784K8083j1405J6274j5946Q53m2858l1092k5904j7180K4993
23859f5329m8954k6841P3261M9546J5734p431N2888j8289O657J4772m143J3243
$$ y = [-70506, 17692, 26829, 15623, 24559, -54717, -53972, -32009, 16334, 38435, 30070, 76556, 134743, 165699, 119502, 99387, 65995, 126969, 141471, 83788, 47063, 7959, -31447, -44135, -28961, -55137, -52217, -42081, 11805, -22686, -55100, -29635, 5287, 9270, -6428, -31963, -36180, -61810, -81691, -19421, -18985, -101157, -109349, -113019, -79912, -47640, -31434, -44392, -18633, 2891, -23559, -49752, -124683, -109755, -74143, -60159, -83484, -29019, -12800, -50881, -64394, -50735, -34092, -4446, 34962, -27450, -66560, -36445, -15757, -25394, -11271, -22476, -65400, -79931, 8853, 36936, 25531, 41805, 25859, 26712, -16146, -47238, -73142, -90322, -65329, -114283, -141124, -67863, -18317, -2583, -10014, 42874, 24585, 31242, 46014, 41871, 55114]
23847E5114R925l4097q116m2596m3706k9709M6305K2260j5462n547J1981R595
23835b4053J055L8326K3175j216l2685K4638L2771k9572j4876J8488M5139L2200
23823A13390M4436l2403j49156R579l2087o3116N2879J1858k2390N0602K8748
23812A2340l3379j0745O8462Q1241J3408n4125o8635p6817J8818J0980J4388N5898
23800C1834K3041k2894o157j7026J7981J0850k3883j2967l803L8557j789k8162
23788E582L0312m5782K3545M2649k9879l0992l7898O1334O0004n546o0934m5509
23776c3114l1989j3454k7292M0071N2801l6130j6302N895j0230J3456L2000L3686
23764I398j73l4715J1877K0415J7187m6110j0709Q1443J8053p7817n5461M9545
$$ y = [55114, 65039, 30942, 22826, -19770, -63476, -93185, -46880, -24620, -40082, -45629, -33648, -24053, -22998, 15328, 38503, 37287, 4602, 29240, 62011, 32439, 17563, 36051, 81190, 113390, 157826, 125423, -23733, -14154, -46241, -109357, -56478, -44620, -67010, -16408, 12340, -21039, -31784, 36678, 117919, 131327, 77202, 8567, -68250, -49432, -38452, -24064, 31834, 54875, 31981, 25824, 8798, 26779, 37629, 13746, 779, -3024, 35533, 33744, 5582, 35894, -9888, 13657, 56306, 26427, -4565, -42463, 18871, 78875, 73329, 12395, -33114, -65103, -78557, -105849, -65778, -12977, -49107, -65409, -59514, -69744, -56288, -24288, 9398, 9225, -25490, -13613, 6802, 23989, -22121, -32830, 48613, 66666, -11151, -66612, -17067]
23752a7067J5123k9350l8930K4738J8104N9340K1478m1308M5051K8174j9305m1655
23740B4393o4409J2459J653n6340J6645J4553l6826j3722K5006N9L9366K709L98
23727c4056M7516M7909j5954r601p378N7065Q547l5651j1972K015l5535j3972
23715a067J0875j0893n0641N125K2239j5387J1876L9066L6117j7214q037l7875
23703a5816P90n8106n9161j4804J8599Q0245N2737J825j1616O455J131k9159j060
23690b7940M4915Q417J2011K0533l9814n8003k739l2153M1949P6254q042K8478
23678F3866L274l0176l2350n584j806N2579p521m1551o5650m1102P587M6627j1690
23665f3497M5522R817r5J4261K7012m5403O5298K9887p5833L7870K8546R848l037
$$ y = [-17067, -1944, -31294, -70224, -45486, -27382, 31958, 53436, 12128, 57179, 85353, 66048, 24393, -40016, -27557, -25904, -82244, -65599, -51046, -87872, -101594, -76588, -76529, -37163, -34454, -34056, 13460, 61369, 45415, 35814, 28436, 85501, 94048, 58397, 46425, 48440, 12905, -1067, 9808, -1085, -51726, -46601, -24362, -39749, -27873, 11193, 47310, 30096, 22059, -15816, -15026, -73132, -132293, -147097, -128498, -48253, 4484, 6309, -5307, 1148, 2279, -26880, -27940, 16975, 25392, 37403, 57936, 18122, -39881, -42620, -74773, -32824, 43430, 35388, 63866, 67140, 36964, 4614, -970, -2776, 49803, 42282, 731, -64919, -106021, -98434, -51807, -63497, -17975, -8158, -8253, 6008, 33020, -12383, 52915, 82802, 6969, 44839, 73385, 83233, 80196]
23652H0196l2453L4446j4278l3847N88Q405o776k912K9164r942J2883L3228M5251
23639A43953m0437r450k6075m7774l0998j3660l223L0329J3257K3116L2056L393
23627G4487l8127p891l5281o0564K6421j5780L019L8658J3165j1769n0907o660
23615g1229L8678M5560l6020k6390M1415M0407O1425J0209r535m4742l8310k1825
23603a0357j9705K1798L7101l1522k6974o8837J2850L7880J03085J9876l6756
23592C8439J6821O268m3379P073K2819k0000j1960m6205M0316J5533o1063j8336
23580e3674L5169j8096M1300K0723l0833l0355K9938J12898K2653K2638o6219
23569H6142o570r302O730j0833j5578k2890n9014J9013L185q600m6627o770K2582
$$ y = [80196, 47743, 82189, 67911, 34064, 34652, 43057, 36281, 33369, 62533, 52591, 65474, 98702, 143953, 103516, 94066, 67991, 20217, -10781, -24441, -27664, 2665, 15922, 39038, 71094, 74487, 36360, 28469, -6812, -67376, -40955, -56735, -53716, -15058, -1893, -13662, -64569, -71229, -32551, 13009, -23011, -49401, -7986, 32421, 93846, 104055, 94520, 49778, 11468, -10357, -30062, -8264, 28837, -2685, -29659, -98496, -85646, -47766, 55319, 75195, 38439, 55260, 61528, 18149, 25222, 48041, 28041, 16081, -30124, 10192, 25725, -35338, -53674, -18505, -36601, 4699, 25422, -5411, -35766, -5828, 107070, 129723, 152361, 86142, 79572, 70270, 77000, 66167, 50589, 27699, -31315, -12302, -9117, -17717, -64344, -71114, -48532]
23556d8532k0017q68N6271N1775j6229K2586r567l9135l0215M8957J5020M813
23544C4859l9434q617L2724l4413n9862J272M6272L9305O0398J0677J4868L906
23532A01955m5004Q896J7190l1320o2056J0215L1980J6228L9840N5832P78m7685
23520I6849M712l3501k0625K5901j7140l9657M0629J5569M2178J1818J6488m7074
23508I6147m4476j1376M2058M3216L2662l7481n5549k455M5782L960K8538N4989
23496A96015L9724J63002K44003J69029K10123L08367K56402N4889M2156j2188
23486A671522j83682m02683l18726j45905q5830n1843l7292j2609p8612q4029
23476B70311q086K3148n441m1526p2009Q541o8735l5721j9748L7453K9476J1869
$$ y = [-48532, -68549, -69417, -13146, 38629, 22400, 44986, 35419, -3716, -33931, 15026, 30046, 34859, -4575, -13192, 19532, -14881, -74743, -73471, -27199, 12106, 72504, 83181, 98049, 101955, 56951, 65847, 83037, 51717, -10339, -124, 31856, 48084, 87924, 143756, 144534, 96849, 101561, 68060, 47435, 73336, 56196, 16539, 57168, 72737, 114915, 126733, 143221, 96147, 51671, 40295, 82353, 125569, 158231, 120750, 65201, 62746, 108528, 112488, 141026, 196015, 235739, 398741, 642744, 811773, 1021896, 1330263, 1586665, 1641554, 1683710, 1671522, 1487840, 1085157, 766431, 620526, 534696, 482853, 445561, 432952, 354340, 270311, 262225, 285373, 279932, 238406, 166397, 174938, 106203, 70482, 50734, 88187, 117663, 129532]
23464A29532O1554m5964L18J558n9549q1144o9145N6380O4363Q679J3838m4263
23452C6157O789o479l1918K1088J2213j2998J8523J6774k3228j4781J8571j1680
23440B9031l8687j4553Q735K0387J9267N14j418P756k9297j396N347j3010L0151
23427B2827J8605k4811m035J5067m4902k9170K305J6138J4508L8602m2999K6735
23415H870N9999O477o1976m0572m1473J8381J2065L4758L840r540J4754o3045
23403e7462K612K8831K4422J8303L2427k1052l723N3256Q44p7067l6195p221K8224
23390a3801K6139l1025M6629R6291J8600k6342n9252p022L2745K0877m2946l5838
23378B5055Q235N818J1835L887k1577O932j8814m5158o3765l395N1867M9422M892
$$ y = [129532, 191086, 145122, 145440, 146998, 87449, 6305, -62840, -6460, 57903, 66582, 80420, 36157, 42946, 36467, 4549, 25637, 37850, 24852, 43375, 60149, 36921, 22140, 40711, 29031, -9656, -24209, -15474, 4913, 24180, 24694, 23276, 31032, 1735, 339, 5686, -7324, 22827, 41432, 16621, 12586, 27653, -17249, -46419, -44114, -27976, -13468, 25134, -17865, 8870, 68869, 75346, 13370, -27202, -68675, -50294, -38229, -3471, 369, -9171, 5583, -57462, -54850, -26019, -1597, 16706, 49133, 28081, 24358, 77614, 78458, 1391, -34804, -42025, -13801, 12338, -18687, 27942, 124233, 142833, 116491, 57239, 50217, 82962, 103839, 60893, 25055, 33290, 39108, 50943, 54830, 33253, 40185, 21371, -23787, -87552, -90947, -39080, 10342, 15234]
23365A5234J3933P940k9662q680L7108j5625k9281j4493l494L641M7697O7956
23353I2274k5583n751k2552l3244q953K6700j3568p3205k6365L2719K7882M7992
23341A8346K8939l4126j6937N136K1318L5137j3581j6117J5684P7325j5459M1622
23329A47287l873n5610k5081P1912L8727n7156m6213o1624J9061L3121L2422m2609
23317E0364n5189l8858k2720p801K3767n3191O690M5980K5002J9830m3015l7994
23305h7135L3045P3876J3313o3992j1804J0210j8756j6500K6834N5786k597p002
23293E278k4867k5899k0453J6430L2354k5111n729m8642L5551L9493N7137J9976
23281E5518J2192n8147p9468J4626o229N4495K3191J4535J0921j0343J7985j9403
$$ y = [15234, 29167, 37107, 7445, -1235, 35873, 20248, -9033, -23526, -27020, -23379, 24318, 92274, 66691, 60940, 38388, 5144, -3809, 22891, 9323, -63882, -90247, -57528, -29646, 18346, 47285, 13159, -3778, 1358, 22676, 57813, 44232, 28115, 43799, 121124, 105665, 147287, 143414, 87804, 62723, 134635, 173362, 116206, 69993, 8369, 27430, 60551, 92973, 50364, -4825, -43683, -66403, -74204, -50437, -103628, -96938, -50958, -25956, -6126, -49141, -87135, -54090, 19786, 33099, -30893, -42697, -32487, -51243, -67743, -40909, 14877, 12280, 5278, -19589, -45488, -65941, -49511, -17157, -42268, -47997, -96639, -61088, -21595, 35542, 55518, 67710, 9563, -69905, -55279, -61508, -7013, 16178, 30713, 41634, 31291, 49276, 29873]
23269B9873K152K2812N48j4048L7317k5811k3848J0563j8133m3197k4834q228
23257e4834L8030O8024K2286M3993N4283l2325k6989J787n1185k1641L0517L2272
23245A04218l5740k5164j1758J1853N1124k3328J752J7812Q468M258k9679j2207
23233F1609k2663M004J1964j4078J1542k4538j7726K2382q475j0445J8338o809
23221B5105K5357P7054J2820m297L0726R3613J38949J15611M5672m4092m3489
23210D73029J679o9265p5980p2970l9201r1084m7130R116M688j1510Q626P95L2044
23197A22837j0905j03340m3408L7112J0238k3515J0869K4004N709l6516j1289
23186a8204K3539P3573N163L8588P3876J5948o912j4040j1602r3445j2163j7049
$$ y = [29873, 32025, 54837, 55385, 41337, 78654, 52843, 28995, 39558, 21425, -21772, -46606, -54834, -16804, 51220, 73506, 117499, 171782, 139457, 112468, 114255, 63070, 41429, 71946, 104218, 68478, 43314, 31556, 43409, 94533, 71205, 72957, 90769, 99237, 103495, 73816, 61609, 38946, 42950, 54914, 40836, 52378, 27840, 10114, 32496, 24021, 13576, 31914, 25105, 50462, 127516, 140336, 136039, 166765, 260378, 399327, 514938, 560610, 516518, 473029, 474708, 405443, 329463, 256493, 217292, 126208, 79078, 88194, 92882, 81372, 89998, 90793, 122837, 111932, 8592, -34816, 2296, 12534, -10981, -112, 23892, 29601, -6915, -18204, 5335, 78908, 84071, 122659, 196535, 212483, 205571, 191531, 179929, 86484, 74321, 57272]
23174E7272p606J7100Q6378L9103m7704p0004l8975J4063J0970N8668j5861m0173
23162F3231J2166m3144M6313L9663n0245n461J6124J6875L581K430O3059L6508
23150B01100l207O138L2681K8901O2117J4497l9027J9389k5204K072R606p2798
23138B36265m047O9589J2934j38036o6571L330K6475R523j829k947N2148m8451
23126A48383m7601m8254k3276R562P5341M512j2087j5943K8152j6285M2580N6603
23114B01687k4833o1399l0216L5129K150m7776N3892R213ML0154K2547r817m4490
23101A36245K5665L1113j4585k0131k7402L9668l3911R9611K1595n2316m7704
23090A57848k6075N0736J0587m6091m2810m8683o0364K9468M8640j8660q213M2413
$$ y = [57272, 49666, 66766, 153144, 192247, 144543, 74539, 35564, 49627, 60597, 119265, 103404, 63231, 75397, 32253, 78566, 118229, 67984, 62523, 78647, 95522, 99103, 101533, 164592, 201100, 197893, 204031, 236712, 265613, 327730, 342227, 303200, 322589, 297385, 299457, 309063, 236265, 232218, 301807, 314741, 176705, 110134, 113464, 139939, 149462, 147633, 144686, 196834, 148383, 100782, 52528, 29252, 38814, 114155, 118667, 106580, 90637, 118789, 102504, 145084, 201687, 176854, 115455, 85239, 120368, 122518, 74742, 128634, 137847, 137851, 168005, 190552, 180735, 136245, 161910, 193023, 178438, 158307, 130905, 170573, 136662, 236273, 257868, 205552, 157848, 131773, 182509, 193096, 147005, 104195, 55512, -4852, 24616, 73256, 54596, 46383, 88796]
23078H8796K9079K7925M2863K2251K1465N46j0028m3451J5625j9722m5707m7446
23066H2196p2073m0947Q0588L0934J947J8447O265k8272m9081l173j2296R1904
23054A06439K9182l043j400l0944P306K5716m7767l6213O4546k7091Q560M6167
23042A41458Q955o0683J5667K5725J3217l2627M3739M0277l2294N0365M9707o352
23030B57154K3470O136M4409P2263K1333j1066L7952K9317j8057J1820M7938J3353
23018E36022j8900m9224k1864j3372J3578o5284o3527n93K7206J1176p568L0603
23006C78253P1153Q1495L0010M8993o9023n1051l1444m5392m56Q0851L3820j9957
22994E07252j567j6028J1499k3144o0224Q29O2104K196K4093j9768K2167J4629
$$ y = [88796, 117875, 145800, 188663, 210914, 232379, 232925, 222897, 179446, 195071, 175349, 129642, 82196, 10123, -30824, 49764, 80698, 82645, 101092, 107357, 79085, 30004, 26831, 14535, 106439, 135621, 132578, 131178, 100234, 107540, 133256, 85489, 49276, 113822, 86731, 95291, 141458, 150413, 89730, 105397, 131122, 144339, 111712, 155451, 195728, 163434, 213799, 263506, 257154, 280624, 286760, 331169, 403432, 424765, 413699, 451651, 480968, 462911, 474731, 522669, 536022, 517122, 467898, 446034, 432662, 446240, 380956, 317429, 316836, 344042, 355218, 347650, 378253, 449406, 530901, 560911, 609904, 540881, 489830, 458386, 412994, 412538, 493389, 527209, 507252, 505685, 489657, 501156, 478012, 417788, 418617, 480721, 482917, 507010, 487242, 509409, 524038]
22982E24038K1408P5262J23849J13524J82172K12407L14942L12262J05122N019
22972A990005J2538m8149l09849l23066j52186q3195q3429q4020j5839l7274k3865
22961H41671n621k6617n8995k7807q8754L036j3774K574K821M3111J9956l9270
22949F52331k3892Q832M8845R4367L8010J6482l1350L2527L2782O8113J0235K903
22937I50185O0470J00722K4547L2071O6961O6815J09801P5527M3330M9229M8131
22926A627789J18461Q9711J31845J05263P2050J58821K28191K16790K52669L57372
22916C358962L89667L97751M19615N48426O99414Q48551J000469J122961J405227
22907A0191043K017718K795353L847930N229170O582641P808781R186995J1437905
$$ y = [524038, 545446, 620708, 744557, 858081, 1040253, 1252660, 1567602, 1879864, 1984986, 1990005, 2002543, 1954394, 1644545, 1321479, 1169293, 1086098, 1002669, 918649, 902810, 865536, 841671, 836050, 809433, 750438, 722631, 633877, 636913, 623139, 625713, 628534, 671645, 691601, 652331, 628439, 637271, 686116, 780483, 818493, 834975, 803625, 836152, 868934, 937047, 947282, 950185, 1010655, 1111377, 1135924, 1167995, 1234956, 1301771, 1411572, 1487099, 1530429, 1579658, 1627789, 1746250, 1835961, 1967806, 2073069, 2145119, 2303940, 2532131, 2748921, 3001590, 3358962, 3748629, 4146380, 4565995, 5114421, 5813835, 6662386, 7662855, 8785816, 10191043, 12208761, 15004114, 18852044, 24081214, 30663855, 38472636, 47659631, 59097536]
22899E9097536J5335017K1491367L0474926M3562954N8224746N1552084J6724979
22892B96463609L705197j484179k5754646o5298758o0546055l2807104j8379083
22885I5898981j3867216j0920360q843440p889914p260711o275481n123444m027624
22877C1690791l314118k980480k658063k330546k121292k127726k011976j614864
22869A2531726j359290j161640j056106q92791p23464o98011o88305o08418m73966
22860D869735m00498l88809l50009l27197k66345k43486j98438j63980j52472
22851B378501j61029j38690j31028q4711r253j42868j30797n1679o3599r7108
22841A367739r1194o9347k711q2749m9797l8063n3166q2673p8975m7708o5731
$$ y = [59097536, 74432553, 95923920, 126398846, 169961800, 228186546, 279738630, 296463609, 300168806, 298684627, 272929981, 207631223, 147085168, 114278064, 95898981, 82031765, 71111405, 62267965, 54378051, 47117340, 40841859, 35718415, 31690791, 28376673, 25396193, 22738130, 20407584, 18286292, 16158566, 14146590, 12531726, 11172436, 10010796, 8954690, 8061899, 7338435, 6640424, 5952119, 5343701, 4869735, 4469237, 4080428, 3730419, 3403222, 3136877, 2893391, 2694953, 2530973, 2378501, 2217472, 2078782, 1947754, 1863043, 1853790, 1710922, 1580125, 1528446, 1464847, 1367739, 1276545, 1207198, 1204487, 1121738, 1071941, 1033878, 980712, 898039, 819064, 771356, 705625]
22830G05625o0783n4391O147k9546o2513j3824K3511j3003K4297K531J9038N2510
22818E99599N5431J11349J63290J54350K72115L36545K29561K5558k5385n5837
22808A866576k60854l69308k66361j18544j11707n1779m2801o5280n1106K2858
22798E51694m5948o5790l3299J2556k7482m6950k8461J4962k8842k0680J047k5908
22786B56899J3879n8793n5027o1481L4899L4646M9094K6619m6750l2404l3463
22775A28118M9502M9325L4921N7522L5746N6546N6231k3554O1369L2462o5064
22764D73124q3206o0656n5868l8567m599J0904K9530L7894J7400l8342l5436K6668
22752B78846R699j7759m2678k4301K6408M8801j6556p0953j8109n8355j1314N3648
$$ y = [705625, 644842, 590451, 596598, 567052, 504539, 490715, 514226, 501223, 525520, 528051, 547089, 599599, 655030, 766379, 929669, 1084019, 1356134, 1692679, 1922240, 1947798, 1922413, 1866576, 1605722, 1236414, 970053, 851509, 739802, 688023, 645222, 579942, 528836, 551694, 505746, 439956, 406657, 419213, 391731, 344781, 316320, 331282, 302440, 281760, 282807, 256899, 270778, 211985, 156958, 95477, 130376, 165022, 214116, 240735, 193985, 161581, 128118, 177620, 226945, 261866, 319388, 355134, 411680, 467911, 444357, 505726, 538188, 473124, 389918, 329262, 273394, 234827, 230228, 241132, 270662, 308556, 325956, 287614, 252178, 278846, 288545, 270786, 228108, 203807, 230215, 279016, 262460, 191507, 173398, 115043, 103729, 157377]
22740A57377l6811Q63m2455j2758p3379J595J4830O0232J18444K3729k8249k0344
22728A63074k3568k6386o1313M3365J3020k7513K1983k8446j5629J481j5016k8945
22716A6107P7144L5233r886M0769k1859j8891J0566k669l5620j2856J9379O2519
22704A59936J0712m1959k9253k9883j453j7217l0875o6580J09J1363j5386J2152
22692c8334M6943R099J9071K6305L4297l6284j205N948m9304R630J4438r111j7177
22679A4316l4115m4124n641P8121j0852k6112l0536J0926p796L5863k4918k59
22667d5127M3848L0700j8074k5745K21L7020p316m9801Q371M2817J3136m1743
22655a1693K91k6878k4489R643m6564j1610N547P575m983P7347K7255j1988O816
$$ y = [157377, 120566, 121429, 78974, 66216, -7163, -5568, 9262, 69494, 187938, 211667, 183418, 163074, 139506, 113120, 51807, 95172, 108192, 80679, 102662, 74216, 58587, 60068, 45052, 16107, 93251, 128484, 118598, 159367, 137508, 118617, 129183, 126514, 90894, 78038, 97417, 159936, 170648, 128689, 99436, 69553, 68100, 50883, 20008, -46572, -46463, -35100, -50486, -38334, 8609, 17708, 36779, 63084, 97381, 61097, 59892, 65840, 16536, 26166, 40604, 31493, 14316, -19799, -63923, -69564, 8557, -2295, -28407, -58943, -48017, -55813, -19950, -44868, -45127, -1279, 29421, 11347, -14398, -14177, 22843, 15527, -34274, -25903, 16914, 30050, -11693, -11402, -38280, -62769, -53126, -99690, -111300, -105753, -98178, -103161, -25814, 1441, -10547, -3731]
22642c731l2538O66m3684k8331K2391J17910j3175l7191J5670O865k642j6923
22630a4713K0178K1722K8350M7237L0168m7273k839O2027M8697o5268q0825O362
22618E3823P139l9050k6066Q011J0383l2431o2406m2314q930J2400L0346J1728
22606g7367L1193j2390O567J6486m2865L7850N9295m166N3293l3582j23135N413
22594h3408N243J2324ol7427m1159K0536k0295J275J4294o542k0252J9420K1778
22581a14219K31k0399o4496m5287j7657k3457m3790q0811q3647n0378k4863N0349
22569e18424K01616J76553L4618O370L8923m583m0757j2886K6223K0172J8162
22558e4013K8517K2805J6452J2006k107m4573p1703N9717L9938K7306l8683l2639
$$ y = [-3731, -36269, -35603, -79287, -107618, -85227, 32683, 19508, -17683, -2013, 4852, 2210, -14713, 5465, 27187, 55537, 102774, 132942, 85669, 82830, 144857, 193554, 128286, 47461, 53823, 60962, 21912, -4154, 3857, 14240, -18191, -80597, -122911, -131841, -119441, -89095, -77367, -46174, -58564, -51997, -35511, -78376, -40526, 18769, 14603, 67896, 34314, -88821, -83408, -78165, -65841, -65847, -103274, -144433, -123897, -144192, -142917, -128623, -135165, -155417, -135997, -114219, -113988, -134387, -198883, -244170, -261827, -285284, -329074, -409885, -493532, -543910, -568773, -518424, -316808, -140255, -105637, -99267, -60344, -64927, -105684, -118570, -92347, -72175, -54013, -25496, -2691, 13761, 25767, 23660, -20913, -92616, -32899, 7039, 34345, -4338, -36977]
22546c6977J7948r079j698l6708l4182p950O9344N9172m118m8015j9359N884M124
22533d1614K0041K2707N6030m231k3914M844m5553k8255M0795Q9051M3023r3450
22521C9474n8784j6260L7718K4275p642j2968k768j163j4425l3631Q861k4986
22509f2299K4331N6710q2715l4848J0011L4775K5126L9222L5942J5192j5003o9761
22497b3317o805M843P4699L1978M6134l6078k3487j6632n7217l8191M6283M1374
22485D3584J9300p2070k5830n2433J7139P2977m780k3697k527j3980j9136l0135
22473i1588N1134M7851k3776l3273k4670L85K1253M4124K4621k9967j0248J8576
22461e578K4468L9745m3761j3879P9434L2067q5424j01904n8717O2317Q2301K6326
$$ y = [-36977, -19029, -28108, -29806, -66514, -100696, -108646, -39302, 19870, 15752, -32263, -51622, -45738, -41614, -21573, 1134, 57164, 52933, 29019, 33863, -11690, -39945, 850, 89901, 132924, 39474, -19310, -35570, 2148, 26423, 18781, 5813, 3045, 1882, -12543, -46174, -37313, -62299, -37968, 18742, -63973, -98821, -88810, -54035, -28909, 10313, 46255, 61447, 46444, -23317, -30122, -25279, 49420, 81398, 127532, 91454, 67967, 51335, -5882, -44073, 2210, 43584, 62884, -9186, -35016, -87449, -70310, 2667, -2113, -25810, -28337, -42317, -61453, -91588, -40454, 7397, -16379, -49652, -74322, -73937, -52684, -8560, 16061, -13906, -24154, -5578, 18890, 58635, 14874, 995, 80429, 112496, 27072, -74832, -133549, -71232, 11069, 37395]
22449C7395q0530k7342J7079k74O9638K7530r3l8484k9687L720K6118M2897J6292
22436F4259l4616k3246m8766N233R480p7871N9423R3347J9694k2858l3395j6893
22424f209k9776j4147k6210p2532M1916P7792k241n6807q435j5403r599P3512
22412d8139P1308l0330m4657j0674k5172k4958N7872L0189l6705O0681K4897k9988
22400e676j8925m0391O4601J9837J2764j9584n5826K2327K1825J2352k5127j0356
22388b2179P875K1939K8070R735M6818K0593M54q0125k8945m8233l1078N893K7340
22375d1843J7011M0147L0450J0495J3198k2962N3691L5991q2439o9674o7902P221
22363g6616O420o4726n06N4894K5121j2918k4916k2527N1513N7656L2181O912
$$ y = [37395, -43135, -70477, -53398, -53672, 15966, 43496, 43403, 4919, -24768, -21048, 5070, 47967, 64259, 29643, 6397, -42369, -37136, -27656, -105527, -46104, 47243, 66937, 44079, 10684, -6209, -35985, -50132, -76342, -148874, -106958, -29166, -31407, -88214, -96649, -112052, -121651, -48139, 23169, -7161, -51818, -62492, -87664, -112622, -54750, -24561, -61266, -585, 24312, -5676, -24601, -64992, -391, 19446, 32210, 12626, -43200, -20873, 952, 13304, -11823, -22179, -14304, 7635, 35705, 45440, 92258, 112851, 113305, 33180, 4235, -43998, -75076, -69183, -41843, -24832, 15315, 45765, 56260, 69458, 46496, 100187, 136178, 53739, -15935, -83837, -76616, -70196, -134922, -135428, -80534, -55413, -68331, -93247, -115774, -64261, -6605, 25576, 32488]
22351C2488q0483p222K1942j8077m0134q720N1483O6469Q5073p131m3827j2856
22339C9005l7004j3446l528N177K2224o485n218J7779k6635l1973M80l2728k824
22326g5176R1308K4716M824k9172j5098k5158M3517L286o8434k2289L0643R484
22314b7549L2583N0066k541k1195p3668p2848M2886K5132J8205M5075j699M696
22302A9143l2684R289L4971L1372O3653Q2489P8488J05432k0158O5424J79518
22291F16937J51077K74337K92220J45172M9868k0254o9699k50837l21673k10091
22281F57057p7066j04378q7483l586l8572m5648P81k1979j5003o739j0781o1762
22269A84841m9838n1821m6313J0918M5577l3487l551p288o459k7056k9273M3204
$$ y = [32488, -47995, -55217, -33275, -51352, -91486, -100206, -48723, 17746, 102819, 95688, 51861, 39005, 2001, -11445, -14973, -9796, 12428, 5943, 725, 18504, -8131, -40104, -39624, -72352, -75176, 16132, 40848, 45672, 16500, 1402, -23756, 19761, 23047, -45387, -67676, -37033, -27549, 5034, 55100, 52559, 31364, -42304, -115152, -72266, -47134, -28929, 16146, 14447, 19143, -13541, -4252, 30719, 62091, 125744, 208233, 286721, 392153, 371995, 437419, 616937, 768014, 1042351, 1334571, 1479743, 1529611, 1509357, 1439658, 1188821, 867148, 657057, 579991, 475613, 388130, 384544, 345972, 300324, 301105, 279126, 264123, 257384, 246603, 184841, 135003, 83182, 36869, 47787, 93364, 59877, 56326, 49038, 42579, 15523, -13750, 29454]
22257B9454K5184o046J6507K935l3997M0751K542p1060M0194n965R501J6295k4127
22244D2168j6449m1660o616J3690m9834m2830K3289r454k7644P877Q3469L1849
22232G855J5898k7558m0640L3899m9749K0330L7695J2948K9010L305n0098o3090
22220g0195J9335P600r9493n948l1031k0980P8975Q0882J8685j2841m2850k9074
22208a06935J5287K9838K4939J3115m50j11413q7412J0712L7909Q4124L2372o870
22196f4784M3437N9867K3889l0633j4654j3364k5896l2483j3418M124P3423L5143
22184D4651l8940l6782J3352N9313j8044m5616J2668O9827J2017o8295j5557k3845
22172c5251j8467N606N0744K2633m9967k1932j4571M0922k3560n2962m1112j5614
$$ y = [29454, 54638, 48592, 65099, 68034, 34037, 74788, 77330, 6270, 46464, 40499, 50000, 66295, 42168, 25719, -15941, -22557, -8867, -58701, -101531, -78242, -87696, -115340, -107463, -23994, 7855, 23753, -3805, -44445, -10546, -60295, -39965, -2270, 10678, 39688, 42993, -7105, -70195, -50860, -43260, -142753, -148701, -179732, -200712, -121737, -40855, -22170, -35011, -77861, -106935, -91648, -61810, -36871, -23756, -24206, -135619, -223031, -212319, -174410, -90286, -57914, -64784, -21347, 38520, 62409, 31776, 17122, 3758, -22138, -54621, -68039, -63915, 9508, 44651, 5711, -31071, -17719, 41594, 23550, -22066, -9398, 60429, 72446, 4151, -11406, -35251, -53718, -48112, 2632, 25265, -24702, -46634, -61205, -20283, -43843, -96805, -137917, -153531]
22160a53531Q0231Q0352m7523m0147L2098M6079k5930J1407k758Q635j0786J5316
22148f557m9625n771J0923q499k5283K5205o171j5947o196K3061J6050L5909P4031
22135F1130k688k1779p956O897o5553k2127J1133P9042J4585j9696j1768J1250
22123C2470l0616p9484M918L1570k489O5347q149p1997j4962r500O9212L6218
22111B2538J3526L321m1441o9942K1627M036N039K4949l1920o2085L1124K9708
22099d9520K031p168L0099j748j3088J2840K9026K415k0996m1017L9909K1810
22087D593o3119k9822j7727M8927K8726n2625j1897O7639R4643l830n1925o0740
22075d7157o749J7290j7251o0393K1279Q357m0121j0879N8910j0860l572K7898
$$ y = [-153531, -73300, 7052, -40471, -80618, -48520, -2441, -28371, -16964, -19722, -11087, -21873, -6557, -56182, -61953, -51030, -59529, -84812, -59607, -65778, -81725, -87921, -64860, -48810, -12901, 61130, 58442, 36663, 28707, 35604, -29949, -52076, -40943, 38099, 52684, 32988, 21220, 32470, 1854, -77630, -72712, -41142, -43631, 21716, 13567, -58430, -73392, -82892, -13680, 22538, 36064, 39385, -2056, -71998, -50371, -46335, -41296, -16347, -48267, -110352, -79228, -49520, -47489, -54657, -24558, -26306, -39394, -26554, 2472, 4887, -16109, -57126, -17217, 4593, -58526, -88348, -106075, -57148, -28422, -81047, -92944, -25305, 69338, 65508, 13583, -47157, -53906, -36616, -53867, -114260, -92981, -84624, -124745, -135624, -76714, -87574, -91146, -63248]
22063f3248J8529M7011K5596l3510k5242m292n119o2639K4263K0384j3020K4879
22051d6408p119j0662J9865j1635j677o691M3069k6096l9455o534M8889K5729
22039a8725R115k1187L0030N6737J147k5171n0026p7726l3152L4741M7661J3091
22027c3465K1820j2029p6195K5618O9841K6642k8214M592p2534j9668k0371j4362
22015a28325J5403N2478M2166L4884j8556j01290k4250q549Q735N0132O562l5644
22003a06254j7309M7795K3285K9955L8757J2384p98m5067N4402n89n5510n705
21991b4654L8757j1090l3191m8212M1095K2198p0095k9692p951J5731O4472N9216
21979A6584K6695j3605K1066n896j6619O0068m8318p4758L450J2705l9409n5177
$$ y = [-63248, -44719, 2292, 27888, -5622, -30864, -35156, -40275, -102914, -78651, -58267, -71287, -46408, -53527, -64189, -44324, -55959, -57636, -64327, -21258, -47354, -86809, -93343, -44454, -18725, -9610, -30797, -767, 55970, 57117, 31946, -18080, -95806, -128958, -94217, -46556, -33465, -11645, -23674, -99869, -74251, -4410, 22232, -5982, -1390, -73924, -93592, -113963, -128325, -112922, -60444, -18278, 16606, -1950, -103240, -127490, -136039, -127304, -77172, -70610, -106254, -123563, -75768, -52483, -22528, 16229, 28613, 27815, -17252, 37150, 36561, -18949, -24654, 14103, 3013, -30178, -78390, -37295, -15097, -85192, -114884, -122835, -107104, -42632, 16584, 43279, 29674, 50740, 44844, 28225, 88293, 39975, -34783, -31333, -18628, -58037, -113214]
21967a13214K0625J05658N4973n0468N900J8492k9725k3981k9970J6331J4370
21956a1009L0463j4915K169J8970J1592m9158m9446j4242M4975l2521R724J5127
21944c8271L1141j3817Q214k2356j8368m0162Q658L5158O2856L950o1958k5486
21932g0441N1101j6451o2225m0032r61O0348N5998P749j2023n683k2110l0651
21920h5381m350K7892M5362R094J5106k3239j8315K1681J4940M1471j0864j2075
21908B1322k791n4559l6621L1481J215K9747j4193o3576l4075j1355j469M1013
21896i3861Q7240k452J6533N982j4571j3479K9126k1031J1612N5538k7984l8180
21884e527K6282j3976P548l2084m7377j3379L8845O7367L9408j06529l0758Q7
$$ y = [-113214, -92589, 13069, 68042, 17574, 23474, 41966, 12241, -11740, -41710, -25379, -11009, 19454, 4539, 6708, 25678, 37270, -11888, -61334, -75576, -30601, -63122, -53398, -38271, -7130, -20947, -12733, -35089, -53457, -93619, -84961, -49803, 13053, 17003, -44955, -70441, -19340, -35791, -98016, -138048, -139009, -78661, -22663, -14914, -26937, -32620, -54730, -85381, -89731, -61839, -16477, -7383, 7723, -15516, -33831, -12150, 2790, 44261, 33397, 21322, 18531, -36028, -72649, -41168, -39953, -10206, -24399, -87975, -122050, -133405, -134874, -93861, -6621, -9073, 7460, 13442, -1129, -14608, 14518, -6513, 5099, 60637, 32653, -5527, 20755, 6779, 14327, -17757, -65134, -78513, -39668, 27699, 67107, -39422, -70180, -70093]
21872g0093K7446l2447q537O5275M8539l4196L0541j2893k8744k5191j0284l9669
21860i0253M0559p518n4944k915j916N5671k4371q020O2526P3679q391L6939J8726
21847H9772J5277p514n1125o203j7586L954n1219l1236k3720J4772Q549l7498
21835i3777K2730M6676L2246l3656m238K9566j8231j4563k5534M935m1293Q2974
21823a2165j356l1828l8271k5561j2529Q523K6563m7397K4493L5429M5338j7958
21811d6719M254m348J05159k879m1835k4071k0389R036J5781k1124L3734R821
21799A6420k2663Q4258M0581K2190n9600l5169k1155l1159k7354J5650n1959r92
21787g0952r583j5820P807N9449k1923K642N7952r61m7110l1319L0003K1144K5040
$$ y = [-70093, -42647, -75094, -83631, -18356, 30183, -4013, 26528, 13635, -15109, -40300, -50584, -90253, -49694, -57212, -112156, -115071, -116987, -61316, -85687, -93707, -31181, 42498, 34107, 71046, 89772, 105049, 97535, 46410, 40207, 22621, 26575, -24644, -55880, -79600, -64828, -56279, -93777, -71047, -24371, 7875, -25781, -30019, -453, -18684, -33247, -58781, -53846, -95139, -12165, -13521, -45349, -83620, -109181, -121710, -113187, -86624, -134021, -109528, -74099, -28761, -46719, -42465, -46813, 58346, 55467, 13632, -10439, -30828, -21792, -6011, -27135, 6599, 16420, -6243, 78015, 118596, 140786, 81186, 46017, 24862, -6297, -33651, -18001, -69960, -70952, -80535, -96355, -88548, -29099, -51022, -48380, 9572, 8611, -38499, -69818, -39815, -18671, 6369]
21774F369o519J8661m6664l6968K3855M3747K319q399l5273L8622K8039k2645
21762E144L8031K6893m3628p4946k5322J4286n965j6587p608r377O1916N2177
21750A5014K7131m2570p051Nj0676K5335L193J4036K8678j4034m7305k7065J5772
21737a9537k8926j2655P0926P8171J8255p5906m8236p318K1795L3090L6313P067
21725G3039l4880l9240N0945l1703J5746K4044k0695l2078j1608M52J2821r662
21713b819K438q330Q433R700j0897j1156k4952n6403N19L7292L8938k8347L4565
21700a1019m166P176j3364j7244j317L979k3796k6297l392M9798J6923J2986n9552
21687f9285R138k8214m5162J8565P0739P8588m555n3384m1660o2784L6642N4711
$$ y = [6369, -150, 18511, -28153, -65121, -41266, 2481, 4800, -3599, -38872, -250, 27789, 5144, 43175, 70068, 26440, -48506, -73828, -59542, -65507, -82094, -89702, -99079, -37163, 15014, 42145, -425, -7476, -7471, -18147, 7188, 10381, 24417, 53095, 39061, -8244, -35309, -19537, -48463, -61118, 9808, 87979, 106234, 30328, -17908, -25226, -3431, 29659, 65972, 73039, 38159, -1081, 49864, 18161, 33907, 57951, 37256, 5178, -6430, -5978, 6843, -2819, -381, -8711, -278, 9422, -1475, -12631, -37583, -93986, -93467, -56175, -17237, -45584, -11019, -15185, -8009, -21373, -38617, -39934, -35955, -59751, -86048, -89440, -39642, -22719, -9733, -69285, -60147, -88361, -133523, -114958, -44219, 34369, 29814, -23570, -65230, -128014, -91372, -36661]
21675c6661K5081k4946l1370Q7406L6819k8227j5721N258q165q604L0963l7425
21663e592j1481p8755J8444K3206K3559N7681L4839P878O847m3104l6672P827
21651D677j6034k8632N3656J3644J3185p618o1472p4628j148N9911j7713m2447
21639a04619K6822K5204l0785k3040K5841j7417J6586n968J6165J7565J3939K0047
21627a9660K8495K7194O241M2978L709l873k5713j6869p0128k809l6896j1136
21615g8467J2396j1479o129K4918M5879n4869o937n23L1300K4651L1279J6925
21603B8944n112k196K9570J2777K555k1591r1139K7302O7377k9627J42l7282J5608
21590b672L5988l1418q5245m929M8830L7920m0785j8883J9930k5913k2099L1659
$$ y = [-36661, -11580, -36526, -67896, 19510, 56329, 28102, 12381, 17639, 9474, 870, 31833, -5592, -17073, -95828, -77384, -54178, -30619, 27062, 61901, 69779, 76626, 33522, -3150, 4677, -11357, -39989, 13667, 27311, 40496, 32878, -28594, -103222, -104370, -44459, -62172, -104619, -77797, -52593, -83378, -106418, -80577, -97994, -81408, -87376, -71211, -53646, -39707, -19660, 8835, 36029, 42270, 85248, 88957, 85084, 59371, 42502, -27626, -30435, -67331, -78467, -66071, -77550, -83679, -58761, -12882, -67751, -74688, -75211, -43911, -19260, 12019, 28944, 23832, 21636, 51206, 63983, 66538, 44947, -46192, -18890, 48487, 18860, 19002, -18280, -2672, 33316, 1898, -83347, -88276, -39446, -1526, -42311, -61194, -41264, -67177, -89276, -57617]
21578e7617K6874L299l1444N5424R101l4546k9418j1989P5014l2766l1355j7967
21566g7390L7857N486k8388k1046J6975M0011K1404k3607J7430K6648k3491j5804
21554b3915O497k2296M9049j666l8144l5278l4209p336P5600k2566K8968M7412
21542B2116n180j3451k2919q31L778m8575k8705O4175P7559j4701m4734K7381
21530A5913m7589l2259j3778m4765n764K7566M9348N8559J0385n2407m3070Q1821
21518C960J2585o8972O2430M122k0044k2077M975K8549L246k816M5314K0654j2815
21505E9111k0446p2045j5252k9806n339J1533j191k064J9578K1589J9066m0104
21493e5370N6576l5571q2981k1032L4577N0230L7450l4410k6111j3403k2828M0634
$$ y = [-57617, -30743, -27444, -58888, -3464, 5637, -28909, -58327, -70316, 4698, -28068, -59423, -77390, -39533, -34047, -62435, -83481, -66506, -26495, -5091, -28698, -11268, 15380, -8111, -23915, -17418, -39714, 9335, 7669, -30475, -65753, -99962, -107298, -31698, -54264, -25296, 22116, 16936, 3485, -19434, -20265, -16487, -65062, -93767, -29592, 47967, 33266, -11468, 15913, -31676, -63935, -77713, -122478, -128242, -100676, -51328, 7231, 17616, -34791, -77861, 3960, 16545, -52427, 10003, 14125, -5919, -27996, -23021, 5528, 8774, 5958, 51272, 71926, 59111, 38665, -33380, -48632, -78438, -83777, -72244, -73435, -75499, -55921, -34332, -15266, -55370, 1206, -34365, -117346, -138378, -103801, -53571, -16121, -50531, -76642, -90045, -112873, -72239]
21481g2239J0944m072N4092K34J8097K057j0826j1461k204l0521m5079m1878l9330
21468a72186J4791O012P7478L927n1694p003K9504L5342L9880n783k3310O3220
21456A0178L3516n371j4438k1469K7029Q699k6959j6983L9212m709K1037p436
21444D2306J8269j3292k1280P197N72J9924m3559q0260k8634R9055O8803k745
21432F6356p2990j3010K3739N3903J8213m7938O4877n6312j07030J0100K7088
21421c3004l2039k4479P798M5288o952K96N4109n854l3158l4421J0882M5136J6966
21408A0568M1421K0005j7075n4629l6044J1535L547j3817J8970M3975k1520l0422
21396b3486O729m8098q3078m105N4265j7220j9900J2894L634K8223J4468J07976
$$ y = [-72239, -61295, -65367, -11275, -11041, 7056, 9113, -1713, -13174, -15378, -45899, -90978, -132856, -172186, -157395, -151383, -73905, -69978, -121672, -128675, -99171, -63829, -23949, -29732, -53042, 10178, 43694, 38323, 23885, 2416, 29445, 38144, 11185, -5798, 33414, 28705, 49742, 42306, 60575, 47283, 26003, 33200, 33772, 53696, 10137, -70123, -98757, 298, 69101, 66356, -6634, -19644, 4095, 57998, 76211, 28273, 93150, 36838, -70192, -60092, -33004, -65043, -89522, -81724, -36436, -43388, -43092, 11017, 5163, -27995, -62416, -51534, -6398, 10568, 51989, 71994, 54919, 290, -35754, -24219, -20672, -34489, -15519, 28456, 6936, -23486, -16757, -64855, -147933, -152038, -97773, -114993, -134893, -121999, -118365, -90142, -75674, 32302]
21384C2302K1560L7566j6584m4516l695m2020l7156O885M5110N753k0054L6927
21372B2078M6922l526k9628j4560o554l8559m7444k1377L6845k7839K207M4854
21360c6581k7547o0827L1738J2097L5276q53K9319L2555o826k1795J5709l2725
21348c0460K3911N6450n0921N9578k4639m0747J4269l0854l1433J4773L1417J8675
21336A0019N6179J335p3194j7161j8799j565M9547J5434L7186j2174n6203p0070
21324g9466l2265N5768K4220j7870K4500O7834n34J9768k9693m8325p6098Q640
21312h3521L7020o265J052j5395k0387M7101N1343N0109p9999p6501k4982j0173
21300a30598P0110M1099l3729l6323M1677O4448P482k3696p0021j5679J9291J1442
$$ y = [32302, 53862, 91428, 74844, 30328, 26633, -15387, -52543, -45658, -548, 5205, -14849, 22078, 69000, 65474, 35846, 21286, 14732, -23827, -71271, -92648, -55803, -83642, -81435, -36581, -64128, -124955, -93217, -81120, -45844, -46697, -17378, 15177, 8351, -13444, 2265, -30460, -6549, 49901, -1020, 58558, 33919, -6828, 7441, -23413, -54846, -40073, -8656, 10019, 66198, 67533, -5661, -22822, -41621, -43186, 6361, 21795, 58981, 46807, -9396, -79466, -111731, -55963, -31743, -49613, -25113, 42721, 42187, 61955, 32262, -16063, -92161, -83521, -46501, -52766, -51714, -67109, -87496, -40395, 10948, 61057, -18942, -95443, -120425, -130598, -60488, -19389, -53118, -89441, -47764, 16684, 24166, 470, -69551, -85230, -65939, -54497]
21288e4497N6413O6806N1122k5258m2567M156K7127k9833n2119n8296K6011K0599
21276a0336l2817l6422k8713k4263l0408l649J9065J8885L8727K4574M4193r13
21264b2077j817N9941J7788l3769l761J5491m7960M0530K2320m7543m5482j257
21252d7596J1094M7322m3513j5276O126j2117q126j5373N462M7472K0880J2995
21240I350j310O0341K6722k6174L512M38n3684l7973Q68N0298j5422j4195J5053
21227A7824Q822J5945K0608l4583j03508m2139L474J4833n8695P171N6344j2318
21215a06222l1005O7134L3106j4175K2184K2616n0818J5466J8169l616k9918Q959
21203d8120M209J2176N159k0429m4290j3746O5056M0925o2420k3502N3874M4816
$$ y = [-54497, 1916, 68722, 119844, 94586, 52019, 56175, 83302, 53469, 1350, -56946, -30935, -10336, -43153, -79575, -108288, -132551, -162959, -166608, -147543, -128658, -89931, -65357, -21164, -22077, -23894, 36047, 53835, 20066, 16305, 31796, -16164, 24366, 46686, -857, -46339, -47596, -36502, 10820, -32693, -47969, -41843, -53960, -62086, -77459, -71997, -24525, -3645, 9350, 8040, 68381, 95103, 68929, 72441, 72879, 19195, -18778, -17910, 32388, 16966, 2771, 17824, 26646, 42591, 63199, 28616, -74892, -117031, -113557, -98724, -157419, -150248, -93904, -106222, -137227, -70093, -36987, -51162, -28978, -6362, -57180, -41714, -23545, -27161, -57079, -48120, -43911, -31735, -26576, -47005, -91295, -105041, -39985, 940, -61480, -84982, -31108, 13708]
21191A3708P1082K6391q435O8084n4557j03656l3185m380Q1997J6782M10m2464
21179C1777j9875K4525k625m4221j7097M199M1148M5785o6713l3107J8974L2477
21167A5247O958L652j5160m3612L600N704k0481M8553K5864j2743j0540n788l468
21154b214k5907m0352J1001l45J9708p7594K2167L2564O959l735M335k0364L4160
21141c9617k494l877J8262L5917J0155m1296K073M4020L4100o612l0135K1639
21129D2135L3186L948l463r395o1327m0552l6245o5917J1804K5543M4750j776
21117e7309M9333M3141l0378k0646p290l8536Q340L5042K9447o579k5452J662
21105a9225j8568L5998j5279K7345N1565K9145M8934j1652m5744m2491p7084j8551
$$ y = [13708, 84790, 111181, 102746, 170830, 116273, 12617, -20568, -24948, 57049, 73831, 74241, 31777, 11902, 36427, 33802, -10419, -27516, -23317, 17831, 63616, -3097, -36204, -17230, 15247, 22205, 25857, 10697, -32915, -29315, -23611, -44092, 4461, 30325, 17582, 7042, 1254, -2214, -28121, -68473, -57472, -57817, -38109, -115703, -93536, -60972, -54013, -57748, -53413, -73777, -39617, -42111, -45988, -27726, 8191, 18346, -22950, -20877, 23143, 57243, 50631, 20496, 42135, 75321, 79269, 75806, 66411, 5084, -35468, -71713, -137630, -125826, -100283, -55533, -57309, -7976, 35165, 4787, -15859, -23149, -61685, -53345, -18303, 11144, 4565, -20887, -19225, -37793, -1795, -17074, 10271, 61836, 90981, 139915, 128263, 82519, 40028, -37056, -55607]
21093e5607n84O068J8229M3769j3490n22K5301l8314L3322k1652j5758l6774j0344
21080f6356M3065Q077p788K9621N1948J960j02144p0706O5168L5201l901M161
21068a1694K946K9523j6521j5969J0180J3619J3973K7633j2431m0940q8306k3271
21056a11258K5803J1148l1717K780K3426K9126N3861M7971k8171j5009m6870k3496
21044f2406K5190N4851r791k1754n4023j4004K1887k5952L0809J5984O2365l7145
21032a3989K1504N6536K1872m8323m3473p958o585R194R417n6893O618L0158j5142
21019c7064J5340L4927j1233M983k0311J978K7716k0929K365l5848j9620j0150
21007f7846l5639l127l5543J1838Q0996P4243m1730l9912o889N4850P559M643
$$ y = [-55607, -56191, -50123, -31894, 11875, -1615, -2137, 23164, -15150, 18172, -3480, -19238, -56012, -66356, -23291, -15214, -23002, 6619, 58567, 60527, -41617, -112323, -47155, -11954, -15855, -11694, -8748, 20775, 4254, -11715, -1535, 12084, 26057, 53690, 41259, 319, -87987, -111258, -85455, -74307, -106024, -103244, -79818, -50692, 3169, 51140, 22969, 7960, -38910, -62406, -37216, 17635, 7844, -13910, -67933, -81937, -60050, -86002, -55193, -39209, 23156, -13989, 7515, 64051, 85923, 37600, -5873, -13831, -20416, -11222, -1805, -58698, -52080, -21922, -37064, -21724, 13203, 1970, 6953, -13358, -11380, 16336, -4593, -2228, -38076, -57696, -67846, -103485, -106612, -142155, -130317, -49321, 24922, -16808, -56720, -63609, -8759, -1200, 3443]
20995C443n587M6597R041l7374j4330o7221k3152L9198L6209M8100k8221O88M2637
20982E0028M3001J2100p7244l3987M0242j9224n1960j534L2279l0553m671M9851
20970H328N357l6632k515M3422K1132k9347m900p577l0107P9400M3047J8703m388
20957A03923j8047m8553K1439P127k235L5531n273j3185m225O5734M9086K391
20945A93713j5419N3817Q1680L8087L8856p6490j524J36933J24158K14434J97372
20934I85617J17183J43045N3213O0389J2646q0417j11581k23913k07283k04791
20924E44108r4899k2955n2704n9175j3555m0564l0921k0147J2799k1383n1934
20913A48670l7541J3910n1354n6560N0K8855N5911L0946j8056q599m3291m1767
$$ y = [3443, -2144, 44453, 53494, 16120, 1790, -65431, -88583, -49385, -13176, 34924, 6703, 7391, 50028, 93029, 105129, 27885, -6102, 34140, 14916, -37044, -38578, -6299, -36852, -41523, 8328, 13685, -22947, -25462, 17960, 39092, 9745, 4845, -2732, -32839, 46561, 89608, 108311, 103923, 85876, 37323, 58762, 65889, 63654, 99185, 93912, 80727, 76502, 142236, 191322, 193713, 178294, 232111, 313791, 351878, 390734, 314244, 312720, 449653, 573811, 788245, 985617, 1102800, 1245845, 1299058, 1359447, 1372093, 1291676, 1180095, 956182, 748899, 544108, 449209, 426254, 373550, 314375, 300820, 260256, 229335, 209188, 221987, 200604, 148670, 111129, 125039, 73685, 17125, 17175, 46030, 101941, 132887, 114831, 106232, 62941, 21174]
20901B1174n0041K3302L4787J6231j1827J9746j1435K2324J8417j0687j9689j2574
20889C9728J8434l9436l6694N2264L5548j9459M953O078R053k1129m412k0314
20877B4614o1840M5944L0318n5953j009J2652R467q7293k5326j6379N0652M8077
20865b6076j2592L235m6521n893K7378Q547J7264J4081J1415j6076J8903O0226
20853E3891K57J7415M5402K1280m4191p7125j5220j1411J4233K7351N2998k3419
20841F1461q0290j10004k4078L1545P869j4736k1600J1730K9298O9646R880m280
20829c3559L1056p4329m5961m395N2549M8761K9419L627l5858r172J39L2575K0648
20816A5500K455m8453Q18Q540L2575N3236L047n3159l54p103J2147Q191k9921
$$ y = [21174, -28867, -5565, 29222, 45453, 33626, 53372, 41937, 64261, 82678, 71991, 52302, 39728, 58162, 18726, -17968, 34296, 69844, 50385, 55338, 61416, 70469, 49340, 44928, 24614, -37226, 8718, 39036, -16917, -17926, -5274, 4193, -83100, -108426, -124805, -74153, -26076, -38668, -35433, -81954, -87847, -60469, -51922, -34658, -20577, -9162, -25238, -6335, 53891, 54148, 71563, 116965, 138245, 94054, 16929, 1709, -9702, 4531, 31882, 84880, 61461, -18829, -128833, -152911, -121366, -113497, -128233, -149833, -138103, -108805, -39159, -29279, -33559, -2503, -76832, -122793, -127188, -74639, -25878, 3541, 7168, -28690, -37862, -37723, -5148, 15500, 17955, -30498, -29680, -21140, 11435, 64671, 67718, 14559, 14205, 7102, 19249, 27440, -2481]
20803b481k329L8422K7872p876p5955r3795q391K9123K5947K1766L4651n1478
20791f4524K9801L2380m3558l016N2180K2870m18m426n4481K3879N9827m327K5863
20778G2050R029J7246j6069m3489L225j3347N7284j3299k206n1211l010M94l7964
20765b1267j2719k1314L1335L9802j5074L9132P410K533Q972k7383n3239J10j7319
20752c9021N120N2459L7429N9229L0757m3309l0174p4406m3254j1007L1125L680
20740b1372R73K7649j2178k7781J2207P5057k9983n0009j9164O326l6211R00P1084
20727b502K9227J1533m9977J0684L254K8575p638q0809j0630R394K7245K0526
20715a1118j4770P969k8480k0088N4697O5064k2093M4607N7847k8856J8519p352
$$ y = [-2481, -4810, 33612, 61484, 53608, -22347, -116142, -124533, -95410, -69463, -47697, -13046, -64524, -34723, -2343, -45901, -48917, 3263, 26133, 25715, 21289, -33192, -9313, 50514, 46187, 72050, 81079, 98325, 82256, 38767, 41992, 28645, 85929, 72630, 70424, 19213, 16203, 16697, -21267, -33986, -55300, -23965, 15837, 763, 39895, 47305, 49838, 58810, 31427, -21812, -21702, -39021, -33901, 18558, 55987, 115216, 145973, 102664, 72490, -1916, -45170, -56177, -25052, -21372, -20399, 7250, -4928, -32709, -20502, 54555, 24572, -25437, -44601, -38275, -74486, -73586, -2502, 26725, 38258, -11719, -1035, 2219, 30794, 23156, -57653, -68283, -58889, -31644, -11118, -25888, -17919, -46399, -66487, -11790, 53274, 31181, 75788, 133635, 104779, 123298, 115946]
20703A15946k2249r8747l3316M8595O6713l2238l1498l2907o630L3144K6849R188
20691D2850K9414Q768j7014l6923j5851n6910j5256M7447M9565J9539l3424m6444
20679b4239k6775Q016J0427J8689P1588n3155n3682O9771O926K66M692j3290K8106
20666D7340o2302Q470J597K3980j0680k9568l7983l3239O6303Q1189j3679M83
20654D1911K404j5629M0350R1597O1037M1253K6413Q7197P8945N5001m2380j01724
20642C66375r4767o6673j4260N4753K584m9039r2296p1762R074M0464p1971l4428
20630b1946L7399M6973J8039k4450j5146L046l1607j8525K3162M8110Q202j9802
20618E3455M0130L3133P560o3721n3085k5553j8264M301M6528J1999P226N6206
$$ y = [115946, 93697, -5050, -38366, 10229, 76942, 44704, 13206, -19701, -26331, 6813, 33662, 42850, 72264, 81032, 64018, 27095, 11244, -45666, -60922, -13475, 36090, 55629, 22205, -24239, -51014, -42998, -32571, -13882, 57706, 4551, -49131, 20640, 27566, 27832, 32524, 19234, 47340, -14962, -6492, -4895, 19085, 8405, -21163, -59146, -92385, -26082, 55107, 41428, 41911, 44315, 28686, 69036, 160633, 221670, 262923, 289336, 376533, 455478, 510479, 468099, 366375, 271608, 204935, 190675, 245428, 248012, 198973, 106677, 34915, 43989, 84453, 12482, -21946, 15453, 62426, 80465, 56015, 40869, 43915, 12308, -6217, 16945, 65055, 73257, 53455, 93585, 126718, 134278, 70557, 17472, -8081, -26345, -22044, 24484, 36483, 43709, 99915]
20606I9915L1466l8318R788J5000m2879l3930P400K8574K2064Q124j1800N248
20594A00652l7125p1270k3713J3800L5884j4066o375L9457L5607l522L0866N5331
20582A55526K6371l9850N0400P3161m1423k4810O3398j6729P582j496k2352m2984
20570A86794k4507j2862N2200n781o5152j5937l257j0744K0458M0419r1543o9314
20558G74j8774M6241O4229N3146o5968o6185k4495j3308K5564K3558J439l7253
20546a1032J3033O2054M2043k654n9897J8069k1450r376P743k9178Q409N5174
20534G2938J4671J904M4785l4352M2204M1775N4137K0145j4202J1696m2836k0436
20522A92429m3746n5282j9614m0571J1692L1093K959o7251P0877M0338j3222m345
$$ y = [99915, 131381, 93063, 102851, 117851, 74972, 41042, 48442, 77016, 99080, 107204, 95404, 100652, 63527, -7743, -31456, -17656, 18228, 4162, -2213, 37244, 72851, 69329, 100195, 155526, 181897, 142047, 192447, 265608, 224185, 199375, 262773, 246044, 253626, 252130, 229778, 186794, 162287, 149425, 201625, 195844, 130692, 114755, 111498, 100754, 121212, 161631, 70088, 774, -18000, 28241, 92470, 145616, 79648, 13463, -11032, -24340, 1224, 24782, 26221, -11032, 2001, 64055, 106098, 103444, 43547, 61616, 40166, 30790, 38533, 9355, 17764, 72938, 87609, 89513, 134298, 99946, 142150, 183925, 238062, 258207, 244005, 255701, 212865, 192429, 148683, 93401, 73787, 33216, 44908, 76001, 78960, 11709, 82586, 122924, 109702, 105357]
20510A05357N2333K394l3686k3561m0811J7965k0948M8087l3175M0754J9102P924
20498A41735o7015j8640J9201K3428J1201j6993m8359J4884J785K2138Q0778J2234
20486A76377J5449k2957l8823M5937M5811M909k1631r0906j7141p536j2491P9651
20474A56649P3660N7266K8463p057j8307K507j572o8692R431K4071l255J06777
20462C59941P1962j2080j3794j9632J6643J5530j4028k9932J9345M2226R618J6749
20450D62548j4139j5997l0185J4780j7002L3529r3056m7276M5355J1216p404j2862
20438C29507j0773J4306M2247M0323L6197J4092J7307J9043m6264k3549j8076
20427D14360k8355K3640M2251J1933J3779R256k1532m0871k086k474m7782k5190
$$ y = [105357, 157690, 160084, 126398, 102837, 62026, 79991, 59043, 107130, 73955, 114709, 133811, 141735, 74720, 56080, 75281, 98709, 109910, 92917, 44558, 59442, 61227, 83365, 164143, 176377, 191826, 168869, 130046, 175983, 221794, 226703, 205072, 114166, 97025, 89489, 76998, 156649, 230309, 287575, 316038, 308981, 290674, 293181, 291609, 222917, 232348, 256419, 253164, 359941, 431903, 419823, 406029, 386397, 403040, 418570, 404542, 374610, 393955, 436181, 445799, 462548, 448409, 432412, 402227, 417007, 400005, 433534, 340478, 293202, 338557, 349773, 342369, 329507, 318734, 333040, 375287, 415610, 451807, 465899, 483206, 502249, 455985, 432436, 414360, 386005, 409645, 451896, 463829, 477608, 486864, 465332, 424461, 422375, 419901, 372119, 346929]
20415C46929K2914M9359R171k7146O199J7913m467K4102M677k2136L4305P6933
20403E38753M2275O880K2744Q558L5135M2712n6633p4612j1175O8272N2661L8614
20391G14184J012o7630o4307M3144M6757n930L8303M2777N2106N632L5729O5176
20379I06953Q0211J20507J57186J51084J18337J52626J96116K67036K39927J79478
20369B569461J51740J48015P8661K6190K8923m1474l1094J6457Q8029J08075L9959
20358C182942O7069J54384J77444J85623J43320K16521K99208L40830L62695M66063
20348E596099O58591Q15376Q88405J066149J232412J494557J800530K106717K593978
20339A8252814L402863M240910N243586O658851Q588770J1202465J4700769J9561656
$$ y = [346929, 369843, 419202, 428373, 401227, 407426, 425339, 420872, 444974, 449651, 427515, 461820, 538753, 581028, 587908, 610652, 619210, 654345, 697057, 640424, 565812, 554637, 622909, 675570, 714184, 715196, 647566, 583259, 626403, 673160, 667230, 705533, 748310, 800416, 806048, 841777, 906953, 987164, 1107671, 1264857, 1415941, 1534278, 1686904, 1883020, 2150056, 2389983, 2569461, 2721201, 2869216, 2947877, 2974067, 3002990, 2961516, 2930422, 2946879, 3034908, 3142983, 3182942, 3250011, 3404395, 3581839, 3767462, 3910782, 4127303, 4426511, 4767341, 5130036, 5596099, 6254690, 7070066, 7958471, 9024620, 10257032, 11751589, 13552119, 15658836, 18252814, 21655677, 25896587, 31140173, 37799024, 46387794, 57590259, 72291028, 91852684]
20331I1852684K5599784L0609943K9082846K3252628K1754927J8978836L918917
20324B45050565j6040656k0621148j8772900k4072924l1100325k7298786j8671206
20317H8472620j3044236j0250926q394568o890905n769776n007605m426132l714267
20309C0974205l187364k913481k665295k320426k006082j887704j803227j504945
20301A2685681j255202j016394q46784p17064o11049m79091l56482k62068j62363
20292F979184q3508k4500K1209j3467r9420j78242j20351j97635l10330k68348
20282E704592k30401l36482l67783k38239j56563j51926j90741k07928j72462
20273C652067j55151k70874l16900l11362k81589j70322j33763j34838j55412
$$ y = [91852684, 117452468, 148062411, 177145257, 200397885, 222152812, 241131648, 245050565, 229009909, 208388761, 189615861, 165542937, 134442612, 107143826, 88472620, 75428384, 65177458, 56782890, 49891985, 44122209, 39114604, 34688472, 30974205, 27786841, 24873360, 22208065, 19887639, 17881557, 15993853, 14190626, 12685681, 11430479, 10414085, 9567301, 8850237, 8239188, 7760097, 7403615, 7141547, 6979184, 6895676, 6871176, 6892385, 6878918, 6779498, 6601256, 6480905, 6283270, 5972940, 5704592, 5474191, 5137709, 4769926, 4531687, 4375124, 4223198, 4032457, 3824529, 3652067, 3496916, 3226042, 2909142, 2597780, 2316191, 2145869, 2012106, 1877268, 1721856]
20264A721856p9052m1475j28755j26827q3099p0779o4669p0725q9145q4053j29979
20253G53298p3491l1348L0799M1843k0207J8496J1709n2348Q263K1609k5312m0743
20241F42568k7975l2851k4625n1972k0661J8430k8238N652j3947m5339l2362l0679
20229C58001q636O0812M6632l9316m1659P992N9673j8512m8261k1861l0683L5124
20217C59306Q0241K460q0146o0852j9922L9372O0012J433K67j624K2600J2424
20205D15571K2341L8451M4622N3946l2369n4423l8406k431j0606o4703n6867j0480
20193C04646o3771j8082R322P7816K7185l5225K9757M0371n021k0822L1659M5451
20181D23286M4184p7078m7977j3894L8623n707J1951J5208l1517r6433k3907O0040
$$ y = [1721856, 1642804, 1601329, 1472574, 1345747, 1262648, 1191869, 1127200, 1056475, 967330, 883277, 753298, 679807, 648459, 679258, 721101, 700894, 719390, 731099, 678751, 687014, 708623, 683311, 642568, 614593, 581742, 557117, 505145, 484484, 502914, 474676, 480328, 466381, 421042, 388680, 358001, 349365, 410177, 456809, 417493, 375834, 383826, 443499, 424987, 376726, 354865, 324182, 359306, 439547, 442007, 361861, 301009, 281087, 320459, 380471, 381904, 382171, 380547, 403147, 415571, 437912, 476363, 520985, 574931, 542562, 488139, 449733, 447302, 436696, 371993, 315126, 304646, 240875, 222793, 232115, 309931, 337116, 301891, 331648, 372019, 366998, 346176, 377835, 423286, 467470, 390392, 342415, 328521, 367144, 361437, 373388, 388596, 357079, 260646, 236739, 296779]
20169B96779O3549l5321p0037j7714N6781q509p8510p6553N7511j5243N8684L2909
20157B64326n0562r917L7078O937K4181j6835o1830o0996P5910N951j7133m7048
20145A50062J1721j0528n9785m2059J5503J01126l0731l5956K4496M8794k794
20134A69849q403J7689m9264r7410k2776m0000K4335J3515n2767M3845L1343J1727
20122D1683m089k3038L6265J7060L5027L0931N8113K3183n5249K4198K9801L9442
20110B53327n4768r4579J1516M9592j1291K1851k2177q2424K6952R6208j9310
20099A74897q5230l50L5095J1539k9023k9471N7244K0790O426j1042L7338J5266
20087B03479N4196J6328k2368m6969j9891j1315K4512l3314j4261K9762Q6808
$$ y = [296779, 360328, 325007, 254970, 237256, 294037, 285528, 207018, 130465, 187976, 172733, 231417, 264326, 213764, 203847, 240925, 247862, 272043, 255208, 193378, 132382, 208292, 214243, 197110, 150062, 161783, 151255, 91470, 49411, 64914, 166040, 135309, 99353, 123849, 172643, 169849, 161446, 179135, 129871, 32461, 9685, -30315, -5980, 7535, -45232, -1387, 29956, 41683, 37594, 14556, 50821, 67881, 102908, 133839, 191952, 215135, 159886, 184084, 213885, 253327, 198559, 103980, 115496, 165088, 153797, 175648, 153471, 71047, 97999, 194207, 174897, 89667, 89317, 124412, 135951, 106928, 77457, 134701, 155491, 161917, 150875, 188213, 203479, 257675, 274003, 251635, 204666, 184775, 173460, 197972, 164658, 150397, 180159, 266967]
20076B66967k8404n9602J6976K2631k3054k8664l2783M0553P4681l69n0218m1058
20064A57656o23j101O2975K6595l0491p5508k5300M1226m8542j2847J5435P8490
20052A87965J2306m4938q7108k9001K2251M8860R185R90k2317l8746N548J2312
20040G7307k4617k8659m2943K4886P1591N3041j0905j2306L2370J0949M1755L955
20028A96424j9723l1069m232N344m7617l9221K758o0039l0447M6361L0571k7036
20016B2074k3365o7656n6332K4346o346r0032l1263o259O331l3951p3063k1993
20004c57509P3009J01616L805L4579R8425O8185P3035O049o6930j7525O3449L6950
19992A17138l8372n9931j5276Q4819P6731j4408m205o547m0782o643n3728m7081
$$ y = [266967, 238563, 178961, 195937, 218568, 195514, 166850, 134067, 174620, 249301, 248932, 198714, 157656, 157033, 155932, 218907, 245502, 215011, 139503, 114203, 155429, 106887, 94040, 109475, 187965, 200271, 155333, 68225, 39224, 61475, 110335, 119520, 120510, 98193, 59447, 64995, 77307, 52690, 24031, -18912, 5974, 77565, 130606, 119701, 107395, 139765, 150714, 192469, 196424, 176701, 145632, 141400, 146744, 99127, 59906, 62664, 2625, -27822, 18539, 49110, 22074, -1291, -68947, -125279, -100933, -107279, -197311, -228574, -234833, -228502, -262453, -335516, -357509, -284500, -182884, -179079, -144500, -46075, 22110, 95145, 101194, 34264, 16739, 80188, 117138, 78766, 18835, 3559, 88378, 165109, 150701, 146496, 139949, 99167, 92524, 38796, -8285]
19980h285Q1809P3628o5503k2811M2989N641p243r0457k7825N9644N0813K6983
19968A19383k5329o9608l6173j612L3201J3552o367O1921r859j290K3943l9870
19956F1892o1473J1405P9223n2669n0662L0559L0995M8489j9194J1990M340K2254
19944A17149M8362j0314l9428o5653J944K9253J0923l3058o5398N5186j1733o4765
19932b7532l1098O4092L4808l767k4495M4995l5950k418L7312L6112R8172R8p2119
19919A18210r910q894l1479J1840M285L3052R628o7744q806L5614Q7031Q985l9348
19906A42464p674O7643K7269K0768M318J8092J34970J69107J21127J48230K9088
19895H75402M3648M0440n9626j47662p4661p7303j15927r8923l9429M559o2854
$$ y = [-8285, 73524, 147152, 81649, 58838, 101827, 107468, 100225, 9768, -18057, 41587, 92400, 119383, 94054, 24446, -11727, -13339, 19862, 33414, 27047, 88968, 79109, 77819, 101762, 61892, 419, 11824, 91047, 38378, -12284, 18275, 49270, 97759, 78565, 90555, 94895, 117149, 165511, 155197, 115769, 50116, 52060, 81313, 92236, 59178, -6220, 48966, 37233, -27532, -58630, 5462, 40270, 36503, 12008, 57003, 21053, 18635, 55947, 92059, 190231, 190329, 118210, 108300, 99406, 67927, 79767, 84052, 117104, 126732, 58988, 50182, 85796, 172827, 181812, 142464, 134790, 202433, 229702, 250470, 254788, 272880, 407850, 576957, 698084, 846314, 875402, 919050, 959490, 899864, 752202, 677541, 600238, 484311, 385388, 345959, 350518, 287664]
19884B87664m0723J6237p4450k1428j0340J9822n5782J3175n567L407J3390m0335
19872A05070m1800m8991L1201P4202L342k895n4977J1066K7328m7237q386K6827
19860G4750J4205j0934l6468J3247p701l6223M5529q335q0654j5796M9622M2901
19848D4143r287J2760N9116J0463j248N25p127K176P802L2064k6561l6289l1767
19835E6770l3644o5712k7733K6669R9860O4634q8420l2042k5326N0964O3112k7768
19823F1364m3376M895J0971r238k0626k1551K479M9255Q1762L0244m370k6743
19811A15066m3507m3634J1152K4076J503J4293J3979m787K1654j9459o5937J2712
19799C7111l341j7251m4940o956j0245M2234P7726K1549p3478q1805L8850P6483
$$ y = [287664, 246941, 263178, 188728, 167300, 156960, 176782, 121000, 134175, 128608, 132015, 145405, 105070, 63270, 14279, 45480, 119682, 123024, 120129, 65152, 76218, 103546, 56309, 47923, 74750, 88955, 78021, 41553, 54800, 47099, 10876, 56405, 48070, -32584, -48380, 1242, 44143, 34856, 47616, 106732, 117195, 115947, 116472, 109345, 111521, 119323, 151387, 124826, 88537, 56770, 23126, -42586, -70319, -43650, 56210, 120844, 32424, 382, -24944, 26020, 89132, 61364, 17988, 22883, 33854, 24616, 3990, -17561, -15082, 34173, 115935, 146179, 141809, 115066, 71559, 27925, 39077, 63153, 64656, 78949, 92928, 88141, 109795, 90336, 24399, 37111, 33770, 16519, -28421, -35377, -45622, -3388, 74338, 95887, 22409, -59396, -20546, 55937]
19787E5937K7988k0903n2911j3332j1571j97L017O9312P3831L696q0911l6470
19775A7486l910l1628o4894L1060K3869p221M8113N3807o7574m2867m3674M05
19763h7028O9349L393M4066j5237M1624L1405l4518l6088J9619K031k540k9243
19751F833K0089N017m1519n2609K9369N5029j9041p7737O328P5122J7512o722
19739A7671M8772J4457j3912j12359j2471L6715K0664J3500O4589J3368m0450
19728E0544J1866N0023P2437J6521M9031O3948O7076J6828O5900J16270J70945
19717G51389J93691J77593J35563J11405O8067j4833q9333p2827p3576j35282
19707A051857n0252M2711P9118J60908J27149M6714J460P782n4084k59929l29290
$$ y = [55937, 83925, 63022, 10111, -3221, -14792, -14989, -11972, 57340, 131171, 134867, 53956, 17486, 13576, -18052, -82946, -51886, -28017, -35238, 12875, 66682, -892, -43759, -87433, -87028, -17679, -14286, 29780, 14543, 56167, 87572, 53054, 16966, 36585, 38616, 36076, 6833, 26922, 31939, -9580, -62189, -32820, 22209, 3168, -74569, -68241, 6881, 24393, 17671, 66443, 80900, 66988, -45371, -57842, -21127, -463, 13037, 77626, 90994, 50544, 62410, 112433, 184870, 201391, 250422, 314370, 381446, 398274, 464174, 580444, 751389, 945080, 1122673, 1258236, 1369641, 1437708, 1422875, 1333542, 1260715, 1187139, 1051857, 1001605, 1044316, 1123434, 1284342, 1411491, 1458205, 1459665, 1467447, 1413363, 1153434, 824144]
19696H24144r6704n3928l7500j4731j1558Q280N8219J01147J76061K23721J18977
19685A296128j4126j5077p4152j99318k29126j57820p3737j14217p7809n7301
19675B83445J7115J4656m7188j10653m6571J8584j8069k1531k6910j2713P779
19664E7944j0890J2576m415m0014l4597j4967k5445L4561K9372J6367N1387l9918
19652C1961l8983j2739p653J4442O3842M5759j0263k5908j8404l7805J8020K4047
19640D6316j3470j709L5553J5986k7793m5079L5031L5281J9569j7311m1449J4712
19628E5637N3709j9828l1989K5774M3221J5887q595Q754N5332J1595J2244K3888
19616B45629P5640O4674N9092J82338J93577J85540J78984Q4694R2782j1946m3142
$$ y = [824144, 727440, 673512, 636012, 621281, 609723, 618003, 676222, 777369, 953430, 1177151, 1296128, 1282002, 1266925, 1192773, 993455, 764329, 606509, 532772, 418555, 340746, 283445, 300560, 315216, 268028, 157375, 110804, 129388, 111319, 89788, 62878, 50165, 57944, 47054, 59630, 55215, 15201, -19396, -34363, -59808, -25247, 4125, 20492, 71879, 31961, -7022, -19761, -27414, -12972, 50870, 96629, 86366, 60458, 42054, 4249, 22269, 46316, 32846, 31137, 66690, 82676, 54883, 9804, 44835, 80116, 99685, 82374, 40925, 55637, 109346, 89518, 57529, 83303, 126524, 142411, 133816, 142570, 197902, 209497, 221741, 245629, 321269, 385943, 445035, 627373, 820950, 1006490, 1185474, 1270168, 1362950, 1351004, 1307862]
19605A307862o2284r4793j59863k37230j42725j02673n9537p0779k9251o362m4715
19594B97650N943L209m3013r9458j3186J2466p5392j4884r702O1340P0812l065
19582A92720o0550j8352k7955J8865m210p9231o1394N2446O0499j0283j3055k7590
19570B1910l6009J1707L1955J8522j2540n615k3733K6064M5466P515l9918m4278
19558A046j0107K0600K0872m6143j1693L3635k6484J8755L4010k9968N9591R2822
19546A56936K1653J6466o0236q2406j9117j3860l061o415o380P491o821J8937
19534B3187k4429n2876K5400J7264m3699M8321M8777k7663K6389K8859l5537k3471
19522A0522M4891m3214l2028k4522L2379k903M6544M0546K0895m7257k9308p9740
$$ y = [1307862, 1245578, 1150785, 990922, 753692, 610967, 508294, 448757, 377978, 348727, 342365, 297650, 303593, 306802, 263789, 164331, 151145, 163611, 88219, 73335, 63633, 124973, 195785, 192720, 132170, 113818, 85863, 104728, 100518, 21287, -40107, 12339, 72838, 62555, 49500, 21910, -14099, -2392, 29563, 48085, 35545, 29930, 6197, 32261, 77727, 85242, 45324, 1046, -9061, 11539, 32411, -13732, -25425, 8210, -18274, 481, 34491, 4523, 64114, 156936, 178589, 195055, 134819, 52413, 33296, 19436, 16375, 9960, 3580, 11071, 4250, 23187, -1242, -54118, -28718, -11454, -55153, -6832, 41945, 14282, 40671, 69530, 33993, 10522, 55413, 12199, -19829, -44351, -11972, -14875, 31669, 72215, 93110, 45853, 16545, -63195]
19510f3195m193K0547Q507J4330J9081L3159r273j8271m8706J546J5586M6232
19498A5350l0048l1879O1861L8442K1565o3207n1685k8176m367J1574N5678n0972
19486e5864l6577L865N3469M5022j292l5547L470N9084m8153j1219K8958l2956
19474b7740n0647k7608M3119K1476L2049Q344r570j7987p836O9319k4668m1575
19462c3324J6961j6840j4687n8168o864L4617R757n2196j2260N5806N4258L6193
19450A3253L2058p825k8088P1069l7198j8459n750N644Q132m2885P684M4764M4804
19437H7203k0542l3132r3088l4924m8198p423O4287L8231N7253n4305m971J8438
19425c1171K0095l676M1543O953m4417o3428k9767N7274N6908k3788K0668M8584
$$ y = [-63195, -67388, -46841, -38334, -24004, -4923, 28236, 18963, 692, -48014, -46468, -30882, 15350, -14698, -46577, 15284, 53726, 75291, 12084, -39601, -67777, -72144, -60570, -4892, -55864, -92441, -88576, -35107, 9915, 8623, -26924, -23454, 35630, -12523, -23742, 5216, -27740, -78387, -105995, -62876, -41400, -9351, -1007, -10577, -28564, -36400, 32919, 8251, -33324, -16363, -33203, -47890, -106058, -112922, -78305, -68548, -120744, -133004, -77198, -22940, 13253, 45311, 37486, 9398, 80467, 43269, 24810, 19060, 24704, 32836, -10049, -2365, 42399, 87203, 66661, 33529, -59559, -94483, -142681, -150104, -85817, -47586, 9667, -44638, -49609, -31171, -11076, -14752, 26791, 33744, -10673, -74101, -103868, -46594, 10314, -13474, 7194, 55778]
19413E5778j06769l6752K0277P0725K3389l2534j1221j301l324l4958k5077l222
19401h4989M9068K5734K1818P4818r688K8027L1078k1861Q930j2798m348J6114
19389A21903k588n1754o2445l1870O9922P8247r142J7711K0995K9298M6237N9681
19377B86195L9341L0991q174O0049K1561l5716n5097K3949n1252q5679n9134k6321
19365A40713p1496m0084J1324N7989M3801K731m5673r5430m4634K8262N4096k5853
19353A5746K867O8375R900L845m3475K821L1429J6704m6499k3751J2881k2502
19341B8341m6591L1456O4302l8219k3526l7631l8543K4697K8984L3532J6014K7597
19329G0413R609q864j4017m5959p261J6293O0269L3671K7521q035l1982m5685
$$ y = [55778, -50991, -87743, -67466, 3259, 26648, -5886, -17107, -18408, -21732, -56690, -81767, -84989, -35921, -10187, 11631, 86449, 76761, 104788, 135866, 114005, 122935, 110137, 105789, 121903, 119315, 67561, 5116, -26754, 43168, 121415, 112273, 129984, 150979, 180277, 226514, 286195, 325536, 356527, 348353, 408402, 429963, 394247, 339150, 363099, 311847, 226168, 167034, 140713, 69217, 29133, 40457, 98446, 142247, 144978, 99305, 3875, -40759, -12497, 41599, 15746, 18613, 86988, 96888, 100733, 57258, 60079, 91508, 108212, 61713, 37962, 50843, 28341, -18250, 13206, 77508, 39289, 15763, -21868, -60411, -35714, -6730, 26802, 42816, 70413, 80022, 71158, 57141, 11182, 3921, 20214, 80483, 114154, 141675, 133640, 101658, 55973]
19317E5973l2945O5380M7752K8221L8115K9398Q790o828Q5028J0660p4156j8884
19305B36504K509n5388k0245M5080K5552N297J1281k74m4117j16017k0419L4796
19293A04559L6157Q635L6463n4150k6894j9872l0285j0440P778Q166L8450n957
19281I2610M4845M5096K4609o9037M146M6148r033l8911l5795k1177l7170m8707
19269b376L885M0660M1614n673M6881j6147m4058j987L2239j902J9429k0754J4771
19256A06582L4073m4633r049j8388k5010M6948J8703n0276j7655L7740k7700n9468
19244h133K5287j3367l5610L8244J05520J0992L5668r813j9649j05337J0198J4118
19232D8118K327k1861M523J2342L8854L7012j6736N812k2865r474N6086j816m6879
$$ y = [55973, 23028, 88408, 136160, 164381, 202496, 231894, 240684, 233856, 318884, 329544, 255388, 236504, 239013, 183625, 163380, 208460, 234012, 239309, 250590, 250316, 206199, 90182, 69763, 104559, 140716, 149351, 185814, 131664, 104770, 84898, 54613, 44173, 51951, 60117, 98567, 92610, 137455, 182551, 207160, 138123, 142269, 188417, 179384, 140473, 104678, 83501, 46331, -2376, 1509, 42169, 83783, 78110, 124991, 108844, 64786, 62799, 95038, 93136, 112565, 91811, 106582, 140655, 96022, 86973, 68585, 43575, 90523, 109226, 58950, 41295, 79035, 51335, -8133, 17154, 3787, -31823, 6421, 111941, 122933, 158601, 148788, 129139, 23802, 34000, 48118, 50445, 28584, 33107, 45449, 84303, 121315, 104579, 110391, 87526, 78052, 134138, 132322, 85443]
19219H5443j195J156N4561K8465Q936q4408l1416J2661M2564P783L127L9351K9762
19206A96790J0991j5299j0721l1115l2736l2071J3459J7483Q4504N0018j5905
19195B35398L0946P9903J08948L6456O9727J31500J96134K76400K40052J44777
19185A550241J82111J52232J09370q3041k06422j03077j17588k33953k41782j25453
19175H82638j06172j47375j38570l5426L7389j2583p26M2144m4102l4753K2017
19164D64481l1014j6058j7784l6684k8596M6273O830K8039P5207l0015n7694j20353
19152B82632k5474M1555K4139l079P038l9334k7364p668N5428N9188n2602p0338
19140B44121m0884N9660R2464l6492r197K0664J9094J2516K4083M8025N0368K8747
$$ y = [85443, 84248, 85404, 139965, 168430, 177366, 92958, 61542, 74203, 116767, 124550, 127677, 167028, 196790, 207781, 192482, 181761, 150646, 117910, 85839, 99298, 116781, 201285, 251303, 235398, 266344, 346247, 455195, 491651, 561378, 692878, 889012, 1165412, 1405464, 1550241, 1732352, 1884584, 1993954, 1910913, 1704491, 1601414, 1483826, 1249873, 1008091, 882638, 776466, 629091, 490521, 455095, 492484, 479901, 479175, 521319, 477217, 442464, 464481, 433467, 417409, 399625, 362941, 334345, 380618, 387448, 415487, 490694, 460679, 402985, 282632, 257158, 298713, 322852, 319773, 326811, 287477, 260113, 252445, 307873, 367061, 314459, 244121, 203237, 262897, 355361, 318869, 309672, 330336, 349430, 361946, 386029, 434054, 484422, 513169]
19128E13169K2734l7921j0213k2033K325K0698k468L3479L5039N048j04666n9597
19116C95594L2345M9532M1961O4050p992m4045m845J9904j2552J6422J4717N1238
19104F16329N810K9656L7992N3441L8002l1308N8277J13487R6555N4142J52826
19093A225209R1761L4152M4163M6898J10390J14235J55416J35392J79299K58432
19083B395347K78281L58126L97485L97491M42346M21288L65677K39239L96052
19074E691332O03880P29129Q35586J229786J630717K173990K906511L781900M634743
19065B4217574N577726P231782R583774J2841630J7450696K4189299L3302645
19058A34395126L8809094K9725586K3473184K7518392K1629830j0965711k9920295
$$ y = [513169, 535903, 497982, 487769, 465736, 468061, 488759, 486291, 519770, 554809, 559857, 455191, 395594, 427939, 477471, 519432, 583482, 575490, 531445, 526600, 546504, 533952, 550374, 565091, 616329, 622139, 651795, 689787, 743228, 781230, 749922, 808199, 921686, 1018241, 1072383, 1225209, 1316970, 1351122, 1395285, 1442183, 1552573, 1666808, 1822224, 1957616, 2136915, 2395347, 2673628, 3031754, 3429239, 3826730, 4269076, 4690364, 5056041, 5295280, 5691332, 6295212, 7024341, 7859927, 9089713, 10720430, 12894420, 15800931, 19582831, 24217574, 29795300, 37027082, 46610856, 59452486, 76903182, 101092481, 134395126, 173204220, 202929806, 226402990, 253921382, 275551212, 264585501, 234665206]
19051B34665206k1520147j9739751l4621227l8868727k5310690j4991474j1334442
19044F8278748r325438p419938o139826n563015n073089m314387l630905l064971
19036B3747179k613399k137533j852715j619382j349874j207955j189130j180731
19028A0596460j015256r55615q28095p98783p13932o32491n22179m11199l53076
19019D365834l19218l01136l03746k72524k35898j63592j67700j42634q7598j04395
19009B267393j57312j38533o9575j11369j33195r4163j4506m5808k7786n5211
18999A419935r6395l3405m7502M467q8314j20826q0792o4788l7677j1610l780
18988H39313o6103J8470j1019n3150p8544n4698j6798l4264n3101m603l2083k2577
$$ y = [234665206, 213145059, 193405308, 158784081, 119915354, 94604664, 79613190, 68278748, 58953310, 51533372, 45393546, 39830531, 34757442, 30443055, 26812150, 23747179, 21133780, 18996247, 17143532, 15524150, 14174276, 12966321, 11777191, 10596460, 9581204, 8625589, 7797494, 6998711, 6284779, 5652288, 5130109, 4718910, 4365834, 4046616, 3745480, 3441734, 3169210, 2933312, 2769720, 2602020, 2459386, 2371788, 2267393, 2110081, 1971548, 1901973, 1790604, 1657409, 1563246, 1548740, 1502932, 1475146, 1419935, 1323540, 1290135, 1242633, 1247100, 1158786, 1037960, 957168, 892380, 854703, 843093, 839313, 773210, 791680, 780661, 727511, 648967, 594269, 577471, 543207, 490106, 485503, 453420, 430843]
18976D30843P0534M0977k4985K8427k9872j159l9543k1400J6230l5651j2147p1239
18964C51015P479L0734j9331J9806M1486l1623n0428o833l1797J0342N116k1601
18952C04365k7662l1797l2693L9711j830J3826J7030N299L5276k7918n8052J6766
18940B52321M2127k9694l1742N9866P3487J9680Q0073K4275j4580k9859p4862
18929C71092j8362k8099J2097M4238M6478P392k7007m2624j1067m3741j1629K5317
18917C24085q885L7451N1162k04n4216m2228Q554M1123j677l3687k2780q3048
18905B15650k3328o097p772J1672J6939M393k582l7601k8497L2816M5510J0781
18893B31884p011p516Q642j6259m579Q547k2538M599J8084M0210k966j4200r643
$$ y = [430843, 501377, 542354, 517369, 545796, 515924, 514765, 475222, 453822, 470052, 434401, 422254, 351015, 358494, 389228, 369897, 389703, 431189, 399566, 349138, 342305, 310508, 320850, 325966, 304365, 276703, 244906, 212213, 251924, 250094, 263920, 280950, 286249, 321525, 293607, 235555, 252321, 294448, 264754, 233012, 292878, 366365, 386045, 466118, 490393, 475813, 445954, 371092, 352730, 324631, 336728, 380966, 427444, 434836, 407829, 365205, 354138, 310397, 298768, 324085, 315200, 352651, 403813, 403609, 349393, 307165, 315719, 356842, 355165, 321478, 298698, 215650, 192322, 186225, 178453, 190125, 207064, 211457, 208875, 171274, 142777, 175593, 221103, 231884, 224873, 217357, 225999, 209740, 205161, 213708, 191170, 195769, 213853, 254063, 251097, 236897, 227254]
18880B27254R835k9718m0289o792L7935L4468J141m7120m6776M5782K9133J2764
18868B27617j9675o0579r693l775l2769K3957P604K3512n3088m4647J6311N3019
18856A27794J0867L1350j6888M0548N1264m8680l4742R275M7742N6852J15745
18845C91127M8449O8949N4162O5753M1494Q0046J65385J07240O6792O0935L4572
18834A184904j1281r8030r6082k5526j31949q5514n3922q6540j15959m9522j4075
18823D16504n7598J364l590k374n2304n2339p7504p0640o423N3375l3013j5378
18811A00080L4880q380J3327m0849k2090L5537J3877o477O1659M681M3317m590
18799B24972j09207j8962L7342K3591K4533K9622j6514p327p0814j9661k0039
$$ y = [227254, 237089, 207371, 167082, 160290, 198225, 232693, 233834, 186714, 139938, 185720, 214853, 227617, 207942, 147363, 137670, 133895, 101126, 125083, 132687, 156199, 103111, 58464, 74775, 127794, 138661, 170011, 153123, 193671, 244935, 196255, 161513, 170788, 218530, 275382, 391127, 439576, 508525, 562687, 628440, 669934, 749980, 915365, 1022605, 1089397, 1150332, 1184904, 1173623, 1075593, 979511, 953985, 822036, 736522, 682600, 596060, 480101, 430579, 416504, 358906, 360270, 356680, 354306, 302002, 249663, 172159, 101519, 95096, 148471, 115458, 100080, 134960, 126580, 139907, 99058, 76968, 112505, 126382, 119905, 181564, 186245, 229562, 224972, 115765, 96803, 134145, 157736, 182269, 211891, 195377, 188050, 117236, 97575, 77536]
18788G7536L0592L0928L3695J8952l7077k7092j5541m2189K7994P172k0734o3378
18776B0858j8642N0457O2702Q2508P8703L7509N8468N5998j0526k3682K6649n4593
18764C66409p5487q6418j01982p813M3896l2688l1934N4600J4366m6768n3347
18753D2834m4314L086R056l3731l1602j2702J7701k1563K1993O9158k7731k7627
18741c5442j252p7291j01883p1193l3607K1643m5510Q127O3547L0883l5844L4866
18729b42956M1038J27494Q3672J5412k6876j6539j9039R143M0808j9972n8186
18718f6001P2530J8170M2605Q110l0729J1234l4779l2332J4955K7813N6608J0615
18706I8799n4322r8729O5537K2973l5274J0429l4037j8093j3712L361N6268M8525
$$ y = [77536, 108128, 139056, 172751, 191703, 154626, 127534, 111993, 69804, 97798, 104970, 84236, 20858, 2216, 52673, 115375, 197883, 276586, 314095, 372563, 428561, 418035, 394353, 421002, 366409, 290922, 204504, 102522, 94709, 138605, 105917, 73983, 128583, 142949, 96181, 42834, -1480, 1606, 10662, -23069, -54671, -67373, -49672, -71235, -49242, 19916, -7815, -35442, -36694, -113985, -215868, -287061, -320668, -299025, -344535, -336408, -272861, -241978, -277822, -242956, -201918, -74424, 9248, 24660, -2216, -18755, -37794, -28651, 12157, -7815, -66001, 6529, 24699, 67304, 75414, 44685, 55919, 21140, -11192, 3763, 31576, 88184, 98799, 44477, -54252, 11285, 34258, -1016, 9413, -24624, -42717, -56429, -53068, 3200, 51725]
18694E1725K3920M2911m7833q7623k099O3097L3613J2846m6923m4896K0862k665
18682A6935m9932M648m1412n7722M7609M9874L9474N5479J4287N71k2437n3072
18670D302j3967k2822M8930K4949N2031N0138j7946m7627J2926N055m7352m2337
18658F280n0745L6737L9886K75m4879j1879K835j5900J11676m187j1515j0763
18646D7821l5787K8938J1084k2578m8285L5443k471P259K521k4855n6129L0863
18634b6176M2723J4170m642L0205K6780L5234L7083p1773l2129j3555m828m3453
18622a0361m8303l1734O4086K2931k7180m873j7244q261k2326k2893K2235M5832
18610c8091K7491J170j2974M2775M4246J3052k0637m840m1278j2363M1945O8963
$$ y = [51725, 75645, 118556, 70723, -16900, -18999, 44098, 77711, 90557, 43634, -1262, 19600, 16935, -32997, -28349, -69761, -127483, -79874, -30000, 9474, 64953, 79240, 79811, 57374, 4302, -9665, -32487, 16443, 41392, 93423, 143561, 125615, 77988, 90914, 95969, 48617, 6280, -44465, -7728, 32158, 32433, -12446, -24325, -21490, -37390, 74286, 70099, 58584, 47821, 12034, 40972, 52056, 29478, -18807, 16636, 14165, 21424, 23945, -910, -57039, -26176, 16547, 30717, 26075, 56280, 83060, 118294, 155377, 83604, 51475, 37920, 33092, -10361, -58664, -90398, -26312, -3381, -30561, -35434, -52678, -60939, -83265, -106158, -83923, -38091, -10600, -9430, -22404, 20371, 64617, 77669, 57032, 52192, 10914, -1449, 40496, 109459]
18598A09459k1079l2034l0385l8851k3766k7604j2501O1112J0830j8821O1472
18587C7832m6212l5193l7087O0567M3351l957r170K8485K8677K4643n0141n4068
18575a2273k8016m5385P469N0738N5697j1359j4452l2011L632P0639J9948j7915
18563D6712K6116j5372J4421j652j4460L0223n375k1659l5997q462K6091M9791
18551I0377K8233N2188K9014n5109m1422q172O3733L5246m302o9044N349k1781
18539A04310r764R3073J8203k8807K029l4778J3754J5144q2406n2420j35L1814
18527G0017L9892m9586k4947j6261N8940n788O385L4049k4114j7737J5665j7569
18515F8946L262J158J4336J8447K3776L2346L2174n7534k0212r919L3090K5485
$$ y = [109459, 88380, 56346, 25961, -12890, -36656, -64260, -76761, -15649, -4819, -23640, 37832, -8380, -43573, -80660, -20093, 23258, 19301, 10131, 38616, 67293, 91936, 41795, -12273, -40289, -85674, -78205, -27467, 28230, 16871, 2419, -29592, -25960, 44679, 64627, 46712, 72828, 57456, 71877, 70225, 55765, 85988, 80613, 58954, 22957, 14495, 40586, 90377, 118610, 170798, 199812, 144703, 103281, 95109, 158842, 194088, 189786, 120742, 126091, 104310, 94546, 187619, 205822, 177015, 179044, 144266, 158020, 173164, 90758, 38338, 38203, 70017, 109909, 60323, 35376, 19115, 78055, 72267, 78652, 112701, 88587, 70850, 86515, 68946, 72208, 73366, 87702, 106149, 129925, 162271, 194445, 136911, 116699, 106780, 139870, 165355]
18503A65355N2793R9278J07264J18012J32827J52930K50269J83940J40199J14450
18493A517317N800j54357j66227j17247p9452k17027k55749j54456p3046l8037
18483B67519k7810L8285j75j6131J810K3595j9276q4074m4400k4931l4741m0373
18471C9298Q193O7565L5341j3970m9734n7512K1386n4031j0362j9467L7374K0414
18459B4495O013N3745m0966j4409J7063q606M0122m6630q1883O5857p390l1540
18447b4129j1271K5061N3892k226p1696k4345M1226K3622O1262k4486R107M6170
18435A02187J3689L4195J0606p8581m3196N9651K8133M1965J6792J6549M7420
18424B49410j5480j2716j484j5011k3349l0530o372j8340j4278R318j9918p2231
$$ y = [165355, 218148, 317426, 424690, 542702, 675529, 828459, 1078728, 1262668, 1402867, 1517317, 1523117, 1368760, 1202533, 1085286, 1005834, 788807, 533058, 378602, 305556, 267519, 239709, 277994, 277819, 261688, 263498, 287093, 267817, 183743, 139343, 114412, 79671, 39298, 47491, 115056, 150397, 136427, 86693, 29181, 50567, -3464, -13826, -33293, 4081, 24495, 30508, 84253, 43287, 28878, 45941, 37335, 77457, 30827, -51056, 14801, 7411, -24129, -35400, -10339, 43553, 41327, -30369, -54714, -13488, 10134, 71396, 46910, 56017, 102187, 115876, 150071, 160677, 82096, 38900, 98551, 126684, 168649, 185441, 201990, 249410, 233930, 221214, 219730, 204719, 181370, 150840, 144468, 126128, 111850, 121168, 101250, 29019]
18412B9019J954o0005m3119Q0772K9783k9032l1247k0624Q2420K921R552J7586
18400F9980M6141L3234L465j7529J9757K3834R6605n256k8871l7722n9225K6175
18388A70588M4121q3475m5940n5488J0440J1657L5611k0228j6773n450m3423l4820
18376c3180L9399J5318J719o9369J8144K5996L0115n930N210l0482L915L0970
18364C1825K1057N216m1718Q881k681k7964K621o440J7893n689j6270K4937N6145
18351F7813j3694N5844L5907m4509m1756l1084L9955M2455L087j7608k1000j0596
18339F4814j6005J9498J7089j0801Q70K0053j7507j4197n5273J5531M5761K5180
18327I5013R418J3209l3269j3252J905q206j4964j2263N8739M6216n677p3304
$$ y = [29019, 30973, -29032, -72151, 8621, 38404, 9372, -21875, -42499, 39921, 42842, 52394, 69980, 116121, 149355, 152820, 135291, 155048, 178882, 275487, 270231, 241360, 203638, 144413, 170588, 214709, 131234, 85294, 29806, 40246, 51903, 87514, 67286, 50513, 45063, 1640, -33180, 6219, 21537, 23256, -46113, -27969, -1973, 28142, 22212, 27422, -3060, 855, 31825, 52882, 58098, 16380, 25261, 22580, -5384, -2763, -9203, 8690, 3001, -13269, 11668, 67813, 54119, 109963, 145870, 101361, 59605, 28521, 68476, 110931, 114018, 96410, 75410, 64814, 48809, 68307, 85396, 74595, 75465, 95518, 78011, 63814, 8541, 24072, 69833, 95013, 104431, 117640, 84371, 71119, 73024, 64818, 49854, 37591, 96330, 142546, 136869, 63565]
18315F3565l9893o0184M7435L7588K0588K3780l14p251j7232p0359k7331L836
18303b5772M2005M9875K7862m5547o0388p689k7543m7278L9165O9932L6326l7558
18291A3390J3370K285k8034q3643p403P5720L4800L0688P458l4175j5972N9479
18279F7963L5974J1457k3627L6495k8304j6121J0199j9660J2893q506P512L6m7584
18266C8727m6996M1934J4870J2742m9778m1620M0015K3828l3779j2337P5835J16268
18254A79709L9229q2929j7297R284r886k8415J06p5233k1355J0175o350K6326
18242B3364N5336p402L2995O6116N6035j7213j4695Q642m7174N851m2688l4325
18230H4842J0497j8583M137p63j8181R665j1412M4213N3420Q528K4947K15k8164
$$ y = [63565, 23672, -36512, 10923, 48511, 69099, 92879, 92565, 85314, 68082, -2277, -29608, -25772, 16233, 66108, 93970, 48423, -11965, -19654, -47197, -94475, -55310, 14622, 50948, 13390, 26760, 29045, 1011, -82632, -90035, -14315, 20485, 51173, 58631, 24456, 8484, 67963, 103937, 115394, 91767, 128262, 99958, 83837, 94036, 74376, 87269, 78763, 86275, 86311, 38727, -8269, 33665, 48535, 61277, 11499, -30121, 9894, 33722, -57, -12394, 63441, 179709, 218938, 136009, 118712, 127996, 118110, 89695, 89801, 14568, -6787, 3388, -2962, 23364, 78700, 71298, 104293, 170409, 226444, 209231, 194536, 203178, 156004, 161855, 119167, 84842, 95339, 76756, 80893, 80130, 61949, 71614, 60202, 104415, 157835, 166363, 191310, 191525, 163361]
18217A63361J523p25l135K872k1008k0490p397L2694M977l2520l4283K4511L130
18204A13510j3579j7405L7907J5842P050q799o6108K1220j3155j3721K716O7767
18192A33245k864j3014p6067m493R6186L6765K0584n3621o517K245o3819k4762
18180D3868R2282N4349K1453K7798l3299n0577Q590M8673j3588k3647l8033j5213
18168A22656o693N9331P623q8445o5240j9295O8353M3569K9754l2787j0285K0429
18156A28970K4293J3691K7895L0445M5422L2423j0368L1084m7717p471P8461J0852
18144C57980j6149O5238q924j2719J4131N8828N2843R4436O2423J6093R4265M2110
18132H20555N6215J21094P4029L302P5429J96487K36439K76947L89218N08370
$$ y = [163361, 164884, 164159, 161024, 163896, 142888, 122398, 115001, 147695, 152672, 120152, 85869, 110380, 113510, 99931, 82526, 120433, 136275, 143325, 134526, 68418, 89638, 76483, 62762, 65478, 133245, 130381, 117367, 41300, 36807, 132993, 169758, 190342, 136721, 130204, 132449, 68630, 43868, 136150, 190499, 211952, 239750, 206451, 155874, 164464, 213137, 199549, 175902, 137869, 122656, 115963, 175294, 182917, 94472, 29232, 9937, 78290, 121859, 151613, 118826, 108541, 128970, 153263, 166954, 194849, 225294, 270716, 303139, 292771, 323855, 276138, 268667, 347128, 357980, 341831, 407069, 398145, 385426, 399557, 458385, 511228, 605664, 668087, 684180, 778445, 820555, 876770, 997864, 1071893, 1075195, 1150624, 1347111, 1583550, 1860497, 2249715, 2758085]
18122B758085P59498R71633J312510J582955J853232K272304K942155M134394
18114A8586766N943565Q407528J1818749J3882510Q440838J947342N55182k177055
18106F7405425j0532978j5957551j1007001n834077l823600k962805k249835j837398
18098A3200180j698941j570960j334293j054060r34162p88351o71353n92638n30540
18089D024882m18026l96626l16211k99425k37122k34858j92957j81034j24040
18080A624583j56840j27165j04849q0016j39654j18059j08796k6329n800l9041
18070G18034n8627q1326j3815L3763k019o3057q627l5554l6789n2706J0532l2478
18058C77331o2779l0900O966O254N3205O3386j5702j22987o3619j5323m3816o8498
$$ y = [2758085, 3517583, 4489216, 5801726, 7384681, 9237913, 11510217, 14452372, 18586766, 24530331, 32937859, 44756608, 58639118, 67079956, 69027298, 69582480, 67405425, 56872447, 40914896, 29907895, 24073818, 20250218, 17287413, 15037578, 13200180, 11501239, 9930279, 8595986, 7541926, 6607764, 5819413, 5148060, 4555422, 4024882, 3606856, 3210230, 2894019, 2594594, 2357472, 2122614, 1929657, 1748623, 1624583, 1467743, 1340578, 1235729, 1155713, 1016059, 898000, 789204, 762875, 757075, 718034, 659407, 578081, 564266, 598029, 596010, 532953, 524326, 488772, 451983, 399277, 409809, 377331, 314552, 283652, 290618, 296872, 350077, 413463, 397761, 274774, 211155, 195832, 152016, 83518]
18046H3518M977J12474L7436k5268q9519j8848J4094l7986k718k7827j0369m4784
18034d820m7646j8469R4052N5312l7504J9845J7979L0152L4600Q930k6186o2431
18022F3814k0425m5044Q9882R4713m6551p3581q018l680r459L5243K633l0219
18010D9308L6380K9838K4216j2033k8074J0115k7624O766J0335r893o482k448
17998H0404L0415j8047o999l1334J2744P898M2418p645n3543l4348J337L7836
17986F1136J3153j0120M2784K7053n9649o7499J9692L5317o776p6008n1321j7008
17974h9246R7044K0543j5880k5801M7022O6495o1809m8541j7115k8859J5910N5632
17962A5395O5695M4177K8930R243j5531m697p5376J4319r892K8780Q391K0400
$$ y = [83518, 88495, 200969, 238405, 213137, 123618, 104770, 118864, 80878, 78160, 50333, 39964, -4820, -52466, -70935, 23117, 78429, 40925, 60770, 78749, 108901, 143501, 152431, 126245, 63814, 43389, -1655, 88227, 182940, 136389, 62808, 54790, 51110, 41651, 76894, 79527, 49308, 85688, 115526, 139742, 127709, 99635, 109750, 82126, 88892, 99227, 89334, 82852, 80404, 110819, 92772, 85773, 54439, 67183, 75081, 117499, 109854, 56311, 21963, 23300, 61136, 74289, 64169, 106953, 134006, 74357, 6858, 26550, 61867, 55091, -20917, -72238, -89246, 7798, 28341, 12461, -13340, 33682, 100177, 38368, -10173, -27288, -56147, -40237, 15395, 81090, 125267, 154197, 163440, 147909, 143212, 67836, 82155, 72263, 101043, 109434, 129834]
17950A29834j2049n3019j5519J2041j9974o439l7282N186K7793M7896O450o0394
17938B4524J4749M6954m892l7550k8377O6367J4768l3679k8941Q355K8366M3761
17926A14405m5347j8191J5574o240L2993l0245O244j4617J5708k5571K2298n742
17914F1269l6302q527K1119j8324J3283J07556M5547p7277l9451J6580l608M1727
17902A23592m595p931o504J2002l2962j6147j2246J7296N5508l2185m4334J652
17890E3146q421l0344j91l2422j5622k125k545K1227l7358n2147k3789N916M1563
17877h3112K0730p603M2248j1024r482K2089K9833m3646m8335j0850N1061N9963
17865A1872L8469K359N922J7549l9894j2494J3396l571n8828l2234M7438K1627
$$ y = [129834, 117785, 64766, 49247, 61288, 41314, 34875, -2407, 2779, 30572, 78468, 84918, 24524, 39273, 86227, 81335, 43785, 15408, 81775, 96543, 62864, 33923, 42278, 70644, 114405, 69058, 50867, 66441, 60201, 93194, 62949, 69193, 54576, 70284, 44713, 67011, 61269, 24967, 16440, 37559, 19235, 32518, 140074, 185621, 108344, 68893, 85473, 81865, 123592, 118997, 111066, 104562, 116564, 83602, 67455, 55209, 72505, 128013, 95828, 51494, 53146, 44725, 14381, 14190, -18232, -33854, -35979, -38524, -17297, -54655, -106802, -130591, -124675, -83112, -62382, -69985, -27737, -38761, -48243, -26154, 3679, -39967, -88302, -99152, -48091, 11872, 50341, 52700, 58622, 76171, 36277, 23783, 37179, 33608, -25220, -57454, -10016, 11611]
17853A1611j9952k3902L7741l199j1231l2085n7394K3053N3535N79j9773M2937
17841A920O0272K5392r139j6178j0141m2627j7581J6072J9332P683k895j0151
17829B1959p77j5198J9011J6374N273k2196M9958L1n4965N3379j4993k7525k5219
17816E112o3403L172K8227k2362k4175q691K966K6489j5889M9075j9667l731K0383
17803b2494J9604k734j8607m821J2581n7618o464o36m2320m167j0378j8692m125
17790a60871K2224O1551j1201J586L4505l9497K0333j8481J5390N0906J0306o902
17778b0151k6438L8138l5148l1677k2369L8846m652M8664k585m006J4595m0118
17766d6901j694M6665M2592q8663l7792L2422j849p233N5109L818M251M7657j1240
$$ y = [11611, -8341, -32243, 5498, 2299, -8932, -41017, -98411, -75358, -21823, -21244, -41017, 1920, 62192, 87584, 78445, 62267, 52126, 9499, -8082, 7990, 27322, 35005, 32110, 21959, 21182, 5984, 24995, 41369, 46642, 24446, 74404, 74435, 19470, 72849, 57856, 30331, 5112, -58291, -55119, -26892, -49254, -73429, -82120, -79154, -52665, -68554, -19479, -39146, -42877, -22494, -2890, -5624, -24231, -29052, -16471, -74089, -80553, -81189, -123509, -127676, -138054, -156746, -160871, -138647, -77096, -88297, -86711, -52206, -91703, -71370, -89851, -74461, -23555, -13249, -20151, -46589, -8451, -43599, -75276, -97645, -58799, -63451, -14787, -17372, -21378, -6783, -46901, -48595, -1930, 40662, -48001, -85793, -53371, -55220, -62453, -7344, -3526, 725, 48382, 37142]
17753C7142l5665O206P116j861J2660J1156L6198p2260l5198J3393K4441k6081
17741b2753L2921M0426k3389K2040J6458J0756n6630m0269k688Q40L0915o523
17729B104k0281P873M7251j3487m6746k990L3042j8557J439k6458P674k4187m0224
17716i3547k8947M1883Q3965L9630K2056m6518j0451J0326J2333K0224m830n0204
17704d080n0091L4816Q2736Q3720k4451q0173l9354k9454m1554O454K3104j790
17692d0117Q2794K984m1145k4963k4612k975N0239L9805p290K4196k533n6229
17680A54j4790J9525j606M5998J7659j8576k5304j7954K2741J7339j8533l083
17668B3570n75k630K5600k8232n2741L648R253K3977J6930j4721J9509K2274m0677
$$ y = [37142, 1477, 7683, 14799, 12938, 25598, 36754, 72952, 692, -34506, -21113, 3328, -22753, 10168, 50594, 27205, 49245, 65703, 76459, 19829, -20440, -23128, -22288, 8627, 2104, -18177, -10304, 36947, 23460, -23286, -26276, 6766, -11791, -10352, -36810, -29136, -53323, -93547, -122494, -80611, 3354, 42984, 65040, 18522, 8071, 18397, 30730, 50954, 46124, -4080, -54171, -19355, 63381, 147101, 122650, 42477, 3123, -26331, -67885, -61431, -38327, -40117, 42677, 45661, 4516, -20447, -45059, -48034, 2205, 42010, 34720, 58916, 56383, 154, -14636, 4889, 3283, 49281, 66940, 48364, 23060, 5106, 27847, 45186, 26653, 23570, 22995, 20365, 45965, 17733, -35008, -31360, -22107, 1870, 18800, 4079, 23588, 45862, 5185]
17655E185j0115Q8492l414l6782J4818M966n5315k6554J01199L5286j337o331
17643A10098n3861j1346m9071K3159L4968K810j9199m7450L9276j0859l2422N698
17631h199R51k6769l7989n6463J6057J03179L4963Q63J4755M9228R562p0398m0455
17618a0715j6348J163N0558J1165j7987q3259N731Q1947L7562n5740k5656n9595
17606h1174l0337K1582P2154L2921L0765j9613l1804n9464J4851M9081K0039n1988
17594c2987m4896J06991R014k706l4600n9153J948J8231K786O7643M8137m4506
17582C5902k2941P05l0081K7233J7121m7722n1423j9208K8215p025M9831j5412
17570c4805K3001R697K8822K2042N1415j131j0221q1134r4512k347L2371M5830
$$ y = [5185, -4930, 83562, 80148, 43366, 58184, 63150, 7835, -18719, 82480, 117766, 116429, 110098, 56237, 44891, -4180, 18979, 53947, 56757, 37558, -9892, 29384, 18525, -13897, -8199, -7248, -34017, -72006, -128469, -112412, -9233, 25730, 26593, 41348, 90576, 100138, 29740, -10715, -27063, -25900, 24658, 35823, 17836, -65423, -59692, 22255, 59817, 4077, -21579, -81174, -111511, -89929, -17775, 15146, 45911, 26298, -5506, -64970, -50119, -1038, 19001, -32987, -77883, 29108, 38122, 35416, 816, -58337, -56389, -38158, -35372, 32271, 80408, 35902, 12961, 13666, -16415, 10818, 27939, -19783, -71206, -90414, -62199, -69224, -19393, -34805, -11804, -2107, 26715, 48757, 100172, 99041, 88820, 7686, -86826, -89173, -56802, -10972]
17558a0972P934j0786k2307k6218J9150O7877M5907O3780n7529p1160o6638j9453
17546h0415K6077N2167l0157J0031L8458o518j7276k0531K4182k0212J848K1945
17534d01L4315m309l0822n0675p4549n5367M2773R0382L7064k3329M2961J3319
17522B1362l6456J3428K1306q63j5337N1258k4531k363n2473k4686n1965N2077
17510d9243J9640k1921o5291K0366O5972O6654l241l2951K0558Q107l3791k7076
17498c2217J9470P168M7350J9176k2880k8438o2631k2206k1980n788r165N0241
17486f1900P1271j5978k7971K7780K7391K1989P356J9505l6130l8440P748l238
17474f17j3780K4265O0807j6552J8458j7230j1020L8523p9862l2987l2340l971
$$ y = [-10972, -3038, -13824, -36131, -62349, -43199, 24678, 70585, 134365, 76836, 5676, -60962, -80415, -54338, -2171, -32328, -22297, 16161, 9643, -7633, -28164, -3982, -24194, -22346, -401, 33914, 29605, -1217, -51892, -126441, -181808, -139035, -48653, -11589, -34918, 8043, 21362, -15094, -1666, 19640, 18777, 3440, 54698, 30167, 27804, -24669, -49355, -101320, -49243, -29603, -51524, -116815, -96449, -30477, 36177, 32936, -15, 20543, 28650, -5141, -32217, -12747, -5579, 41771, 60947, 38067, 9629, -53002, -75208, -97188, -102976, -112141, -61900, 9371, -6607, -34578, -6798, 20593, 42582, 49938, 69443, 33313, -5127, 2621, -617, -14397, 9868, 70675, 54123, 72581, 55351, 44331, 82854, 2992, -29995, -62335, -66306]
17462f6306M8851N357m464l324K7929K650m5269n4146L1837K3162J7661L0333
17450A4271N6514K0422K503M4750R7611Q8186O411L8037K7630j6811k5751j15163
17438B38610j25982j8609N1736L1766j1263p2058k3122l8444q635M1994N8716
17427A24709J6031q1728l5195l78p572r142K8237K2161k6596j7915N4472k9435
17415C7649m8613R096L4736j4983N075K0268p54q6911j1388K6392L6658K0705
17403B7930l3642l5759k1118q442K2367J0531n9023m000l6186Q1960L2954J0982
17391a1446j8951l48j0210q841j0566k2785J7380K8737J0731M0842J6954J3323
17379D4820p275o7805k3050N6224N2970l263j0773j0792Q466j4435K0326L0150
$$ y = [-66306, -17455, -12098, -16562, -19886, 8043, 10693, -34576, -88722, -56885, -33723, -16062, 14271, 70785, 91207, 93710, 138460, 236071, 324257, 330668, 368705, 396335, 379524, 353773, 238610, 112628, 94019, 145755, 177521, 166258, 94200, 71078, 32634, 23999, 65993, 124709, 140740, 59012, 23817, 23439, 15867, 6725, 34962, 57123, 30527, 12612, 67084, 37649, -10964, -1868, 32868, 17885, 22960, 43228, 42474, -44437, -55825, -29433, 7225, 27930, -5712, -41471, -62589, -71031, -48664, -38133, -97156, -101156, -137342, -55382, -22428, -11446, -30397, -30745, -40955, -49796, -60362, -83147, -65767, -37030, -26299, 14543, 31497, 44820, 37545, -30260, -53310, 2914, 55884, 52621, 41848, 31056, 39522, 25087, 45413, 75563]
17367G5563p8596l7147K867J2538j5671J1772K4825K5814m3289K8524J4385J6674
17355C8259m9550R954P193j0829P3513J2243r2922N74l7097o205N073L6556j0791
17342b4029j9417N6561Q3016J7035q4352j3004K9173k0148n9046p427j7775m767
17330f4180L1298K9445Q54J4538m9386m8220p868k2906L7514P354L5890O8987
17318C3320l4604n1324L9919O4510k8864j3044l5684k1863k6474m637K6646Q3506
17306C1407K1899k940p020j8738k7014N0809M1819n7214r33k0571r850P584O0650
17293F9888J275k9870J661K8704n1142l2687q887n1185k0820J9326O8938M2347
17281C7548m5031m7663M1566K9695J426k5714j1736J6195n0804k8610n3668K5878
$$ y = [75563, -3033, -40180, -37313, -24775, -40446, -28674, -3849, 21965, -21324, 7200, 21585, 38259, -11291, -1337, 5856, -4973, 68540, 80783, -12139, -11565, -48662, -54867, -49794, -13238, -24029, -43446, 13115, 96131, 113166, 28814, 15810, 44983, 24835, -34211, -41638, -59413, -64180, -32882, -3437, -2583, 11955, -37431, -85651, -93519, -116425, -78911, -71557, -35667, 33320, -1284, -52608, -12689, 51821, 22957, 9913, -25771, -47634, -74108, -78745, -52099, 31407, 53306, 50366, 43346, 24608, -2406, 48403, 90222, 33008, 32075, 11504, 1654, 9238, 69888, 71163, 41293, 42954, 71658, 20516, -12171, -21058, -72243, -93063, -73737, -4799, 37548, -7483, -55146, -13580, 16115, 17541, -8173, -19909, -3714, -54518, -83128, -136796, -110918]
17269a10918K0383P1885k7658l464m4178L1726K1262j4241l739N5593Q160n80
17257D231K2563m6127k008K3761K3546k5557o9512J4335J1070l56j4202M054k088
17244e6290o3555K0623L8790Q2304J1999p9862j9127J4884O838L5762K2861o230
$$ y = [-110918, -90535, -18650, -46308, -49772, -93950, -62224, -40962, -55203, -58942, -3349, 4811, 4231, 26794, -19333, -21341, 2420, 25966, 409, -69103, -54768, -43698, -44054, -58256, -54202, -56290, -119845, -99222, -60432, 21872, 33871, -45991, -65118, -50234, -43396, -7634, 15227, 8997]
$$ [...]
##END NTUPLES=NMR SPECTRUM
##END=
