##TITLE=Analysis number 310501
Compound Code mwp 00086
Chemist Name endeavour
##JCAMPDX= 6.0         $$ Bruker NMR JCAMP-DX V2.0
##DATA TYPE= NMR SPECTRUM
##DATA CLASS= NTUPLES
##ORIGIN= Bruker BioSpin GmbH
##OWNER= NMR
$$ XWIN-NMR		Version 3.5
$$ Mon Jun 20 14:10:12 2005 GMT Daylight Time (UT+1h)  MAYBRIDGE\NMR@NMR_250MHZ
##.OBSERVE FREQUENCY= 250.131544655141
##.OBSERVE NUCLEUS= ^1H
##.ACQUISITION MODE= SIMULTANEOUS (DQD)
##.ACQUISITION SCHEME= undefined
##.AVERAGES= 16
##.DIGITISER RES= 18
##SPECTROMETER/DATA SYSTEM= dpx250
##.PULSE SEQUENCE= zg30
##.SOLVENT NAME= DMSO
##.SHIFT REFERENCE= (INTERNAL, DMSO, 0, 16.522)
##AUDIT TRAIL= $$ (NUMBER, WHEN, WHO, WHERE, WHAT)
$$ ##TITLE= Audit trail, XWIN-NMR		Version 3.5
$$ ##JCAMPDX= 5.01
$$ ##ORIGIN= Bruker BioSpin GmbH
$$ ##OWNER= NMR
$$ C:\u/data/dgb/nmr/ADRS/4220/pdata/1/auditp.txt
$$ ##AUDIT TRAIL=  $$ (NUMBER, WHEN, WHO, WHERE, WHAT)
(   1,<2005-06-20 14:09:53.86 +100>,<MAYBRIDGE\NMR>,<NMR_250MHZ>,
      <created by zg, POWCHK disabled, PULCHK disabled
       configuration hash MD5:
       62 19 C7 07 E1 42 D1 B7 37 6C 3D D0 77 39 F9 E6
       data hash MD5: 64K
       F4 E7 43 37 7F 70 8D 67 DF 39 87 43 0A 37 C3 AA>)
(   2,<2005-06-20 14:10:05.60 +100>,<MAYBRIDGE\NMR>,<NMR_250MHZ>,
      <Start of raw data processing
       ef LB = 0.3 FT_mod = 6 PKNL = 1 SI = 32K 
       data hash MD5: 32K
       84 BF 61 A9 B5 A7 27 B5 81 E4 74 8B 49 E4 F4 90>)
(   3,<2005-06-20 14:10:07.30 +100>,<MAYBRIDGE\NMR>,<NMR_250MHZ>,
      <apk 
       data hash MD5: 32K
       39 42 70 41 FB 16 47 3B 64 A3 46 98 C6 31 77 A5>)
(   4,<2005-06-20 14:10:08.02 +100>,<MAYBRIDGE\NMR>,<NMR_250MHZ>,
      <abs ABSG = 5 
       data hash MD5: 32K
       C3 AE 9B 3C 60 C8 E0 E6 CE 58 C5 42 A4 63 C9 1A>)
$$ ##END=
$$ 
$$ hash MD5
$$ 85 DD 64 9C FC 4E 9C D4 EC 99 4E C7 12 4D 7D 86
##$RELAX= 
##$RELAX= 
##$RELAX= 
##$RELAX= 
##$RELAX= 
##$RELAX= 
##$RELAX= 
$$ Bruker specific parameters
$$ --------------------------
##$DU= <C:\u>
##$EXPNO= 4220
##$NAME= <ADRS>
##$PROCNO= 1
##$TYPE= <nmr>
##$USER= <dgb>
##$AMP= (0..31)
100 100 100 100 100 100 100 100 100 100 100 100 100 100 100 100 100 100 
100 100 100 100 100 100 100 100 100 100 100 100 100 100 
##$AQSEQ= 0
##$AQ_mod= 3
##$AUNM= <au_zg>
##$AUTOPOS= <14 >
##$BF1= 250.13
##$BF2= 250.13
##$BF3= 250.13
##$BF4= 250.13
##$BF5= 500.13
##$BF6= 500.13
##$BF7= 500.13
##$BF8= 500.13
##$BYTORDA= 1
##$CFDGTYP= 0
##$CFRGTYP= 5
##$CHEMSTR= <none>
##$CNST= (0..31)
1 1 145 1 1 1 1 1 1 1 1 1 1 1 1 1 1 1 1 1 1 1 1 1 1 1 1 1 1 1 1 1 
##$CPDPRG= <>
##$CPDPRG1= <>
##$CPDPRG2= <>
##$CPDPRG3= <>
##$CPDPRG4= <mlev>
##$CPDPRG5= <mlev>
##$CPDPRG6= <mlev>
##$CPDPRG7= <mlev>
##$CPDPRG8= <mlev>
##$CPDPRGB= <>
##$CPDPRGT= <>
##$D= (0..31)
0 1 0 0 0 0 0 0 0 0.06 0 0 0 0 0 0 0.0002 0 0 0 0 0 0 0 0 0 0 0 0 0 0 
0 
##$DATE= 1119272993
##$DBL= (0..7)
120 120 120 120 120 120 120 120 
##$DBP= (0..7)
150 150 150 150 150 150 150 150 
##$DBP07= 0
##$DBPNAM0= <>
##$DBPNAM1= <>
##$DBPNAM2= <>
##$DBPNAM3= <>
$$ [...]
##$SUBNAM7= <"">
##$SUBNAM8= <"">
##$SUBNAM9= <"">
##$SW= 20.6930455092707
##$SWIBOX= (0..15)
0 0 3 0 0 0 0 0 0 0 0 0 0 0 0 0 
##$SW_h= 5175.983436853
##$TD= 65536
##$TD0= 1
##$TE= 295.16
##$TE2= 300
##$TE3= 300
##$TEG= 300
##$TL= (0..7)
0 120 120 120 120 120 120 120 
##$TP= (0..7)
150 150 150 150 150 150 150 150 
##$TP07= 0
##$TPNAME0= <>
##$TPNAME1= <>
##$TPNAME2= <>
##$TPNAME3= <>
##$TPNAME4= <>
##$TPNAME5= <>
##$TPNAME6= <>
##$TPNAME7= <>
##$TPOAL= (0..7)
0.5 0.5 0.5 0.5 0.5 0.5 0.5 0.5 
##$TPOFFS= (0..7)
0 0 0 0 0 0 0 0 
##$TUNHIN= 0
##$TUNHOUT= 0
##$TUNXOUT= 0
##$USERA1= <user>
##$USERA2= <user>
##$USERA3= <user>
##$USERA4= <user>
##$USERA5= <user>
##$V9= 5
##$VALIST= <valist>
##$VCLIST= <CCCCCCCCCCCCCCC>
##$VD= 0
##$VDLIST= <DDDDDDDDDDDDDDD>
##$VPLIST= <PPPPPPPPPPPPPPP>
##$VTLIST= <TTTTTTTTTTTTTTT>
##$WBST= 1024
##$WBSW= 4
##$XGAIN= (0..3)
0 0 0 0 
##$XL= 0
##$YL= 0
##$YMAX_a= 276075
##$YMIN_a= -272000
##$ZGOPTNS= <>
##$ZL1= 120
##$ZL2= 120
##$ZL3= 120
##$ZL4= 120
##$ABSF1= 16.522
##$ABSF2= -4.171173
##$ABSG= 5
##$ABSL= 3
##$ALPHA= 0
##$AQORDER= 0
##$ASSFAC= 0
##$ASSFACI= 0
##$ASSFACX= 0
##$ASSWID= 0
##$AUNMP= <proc_1d>
##$AZFE= 0.1
##$AZFW= 0.1
##$BCFW= 0
##$BC_mod= 0
##$BYTORDP= 0
##$COROFFS= 0
##$CY= 12.5
##$DATMOD= 1
##$DC= 0
##$DFILT= <>
##$DTYPP= 0
##$F1P= 14.0000005364418
##$F2P= -0.99999901652339
##$FCOR= 0.5
##$FTSIZE= 32768
##$FT_mod= 6
##$GAMMA= 0
##$GB= 0
##$INTBC= 1
##$INTSCL= 1
##$ISEN= 128
##$LB= 0.3
##$LEV0= 0
##$LPBIN= 0
##$MAXI= 10000
##$MC2= 0
##$MEAN= 0
##$ME_mod= 0
##$MI= 0
##$NCOEF= 0
##$NC_proc= -5
##$NLEV= 6
##$NOISF1= 0
##$NOISF2= 0
##$NSP= 0
##$NTH_PI= 0
##$NZP= 0
##$OFFSET= 16.522
##$PC= 1
##$PHC0= -84.25945
##$PHC1= 7.542081
##$PH_mod= 1
##$PKNL= yes
##$PPARMOD= 0
##$PSCAL= 4
##$PSIGN= 0
##$REVERSE= no
##$SF= 250.13
##$SI= 32768
##$SIGF1= 0
##$SIGF2= 0
##$SINO= 400
##$SIOLD= 32768
##$SREGLST= <1H.DMSO>
##$SSB= 0
##$STSI= 32768
##$STSR= 0
##$SW_p= 5175.98343685301
##$SYMM= 0
##$S_DEV= 0
##$TDeff= 65536
##$TDoff= 0
##$TI= <Analysis number 999999
Compound Code 99
Book Reference 9
Project Code 9>
##$TILT= no
##$TM1= 0
##$TM2= 0
##$TOPLEV= 0
##$USERP1= <user>
##$USERP2= <user>
##$USERP3= <user>
##$USERP4= <user>
##$USERP5= <user>
##$WDW= 1
##$XDIM= 32768
##$YMAX_p= 451031817
##$YMIN_p= -637213
$$ End of Bruker specific parameters
$$ ---------------------------------
##NTUPLES= NMR SPECTRUM
##VAR_NAME=  FREQUENCY,     SPECTRUM/REAL,   SPECTRUM/IMAG
##SYMBOL=    X,             R,               I
##VAR_TYPE=  INDEPENDENT,   DEPENDENT,       DEPENDENT
##VAR_FORM=  AFFN,          ASDF,            ASDF
##VAR_DIM=   32768,         32768,           32768
##UNITS=     HZ,            ARBITRARY UNITS, ARBITRARY UNITS
##FACTOR=    0.157963299565203, 1,           1
##FIRST=     4132.6476996994, 0,             0
##LAST=      -1043.33573715361, 0,           0
##MIN=       -1043.33573715361, -637213,     0
##MAX=       4132.6476996994, 451031817,     0
$$ Real data points
##PAGE= N=1
##DATA TABLE= (X++(R..R)), XYDATA
$$ [...]
18026G04846K9115k2873Q5806L05079K44874N4467J05224J41144J21530K79354
18016B048566L34057K98530J55555J10428J94362L72600L99610K81781K22323
18007D417812J47799J82106J68062p7696k71853k80960j23402k37711l87317l64903
17997C171937k71051l63524k76271o4418n687k2724R4489n6936j49086K24264
17987B280993K10414Q4608K7196q8582j31754l8944j11471j00394j62521k04904
17977A764641K19168J57002j97740k43687J85490J18170J66587J75233L3738j10065
17967B268537l8121k2708J49054N5192o1087J70027L0711O7926L001j05688k7634
17956B489210K0119p2694j55200j65982j11001j02612m2407o5000p9781j48047
$$ y = [704846, 733961, 711088, 796894, 1101973, 1346847, 1401314, 1506538, 1647682, 1769212, 2048566, 2382623, 2681153, 2836708, 2947136, 3141498, 3514098, 3913708, 4195489, 4417812, 4565611, 4747717, 4915779, 4838083, 4566230, 4285270, 4161868, 3924157, 3536840, 3171937, 2900886, 2537362, 2261091, 2196673, 2190986, 2168262, 2262751, 2205815, 2056729, 2280993, 2491407, 2576015, 2603211, 2514629, 2382875, 2343931, 2232460, 2132066, 1969545, 1764641, 1983809, 2140811, 1943071, 1699384, 1884874, 2003044, 2169631, 2344864, 2378602, 2268537, 2230416, 2207708, 2356762, 2411954, 2350867, 2520894, 2551605, 2619531, 2622532, 2516844, 2489210, 2509329, 2436635, 2281435, 2115453, 2004452, 1901840, 1859433, 1794433, 1714652, 1566605]
17946A566605P6973J10954J1603j55153j35071n5101J44153J01856n4690J15746
17936A727875R8752k4441N0441p0467k49489k59888j9859R1587j09352p9693k7562
17925A127904j93142j10019l20595j38704J24054M9309Q7962j9818j0583m1670
17915E54698q8387R1311L7384q1795R0600J7801j36954j56455J7229L7341n1990
17904C30783J41402J12145j4571J28103m4464q2445N869q780r704M8324J27800
17893G34462r0384q0624o4989R543J51462M8747Q471j60142M9002j17776N3657
17882E41429j14212j3705k47578N2999J23228n9529j57081Q2420P4868j25918
17872A56921m1500r4166K4460O6474L6595R1327M6271k6903o6805J13395J11873
$$ y = [1566605, 1643578, 1754532, 1766135, 1610982, 1475911, 1420810, 1564963, 1666819, 1612129, 1727875, 1826627, 1802186, 1852627, 1782160, 1532671, 1272783, 1252924, 1344511, 1235159, 1155466, 1127904, 934762, 824743, 504148, 365444, 489498, 538807, 626769, 606951, 596368, 554698, 466311, 557622, 595006, 513211, 603811, 621612, 484658, 328203, 345432, 382773, 330783, 472185, 584330, 569759, 697862, 653398, 570953, 576822, 568042, 558338, 606662, 734462, 644078, 563454, 498465, 508008, 659470, 708217, 716688, 556546, 605548, 487772, 541429, 427217, 413512, 165934, 218933, 342161, 282632, 125551, 207971, 282839, 156921, 115421, 21255, 45715, 112189, 148784, 240111, 286382, 259479, 192674, 306069, 417942]
17861D17942K8813J56653J58442J07292m477M9639j86339n2872j01286j67029
17851D06778N5161J36841r8781K5802O5582P372k228k8682q2694k29058r8740
17840A57353J24552K30884J8222j16755j92042n4794r5935J12022R6740r6414
17830A83833j5868q3754K1943L3654j45867J06413N3014p8771l2477K5504O6049
17819A33673K3098Q4683r6554K0045Q1182Q2612L8464r325j06558k6375J46645
17808C71590J40938l1807n4199J23441j83676j8463O2013j97976n8939P6125K2826
17797B51873n7554N253N6165P0257k4682n9839K2883P2418K0689l525l7246j47985
17785A68707k13842j8037J44188j36410j45938L6857J22048q0598m9482Q9360
$$ y = [417942, 446755, 603408, 761850, 869142, 864665, 914304, 727965, 675093, 573807, 406778, 461939, 598780, 499999, 525801, 591383, 598755, 596527, 567845, 485151, 256093, 157353, 281905, 512789, 531011, 414256, 222214, 167420, 71485, 183507, 280247, 183833, 167965, 84211, 106154, 139808, -6059, 100354, 153368, 74597, 42120, 67624, 133673, 156771, 241454, 144900, 164945, 246127, 328739, 367203, 357878, 251320, 224945, 371590, 512528, 480721, 426522, 549963, 366287, 347824, 409837, 211861, 152922, 229047, 251873, 194319, 199572, 255737, 325994, 301312, 241473, 264356, 336774, 357463, 353938, 316692, 168707, -45135, -63172, 81016, -55394, -201332, -164475, -42427, -123025, -172507, -83147]
17775h3147N897n7501J8307K6686Q6617L9105J87943M1367j00514j2618P251n5681
17763A03712J5248N1166j72904j19867M8377q1332O273O227N1722J70514K24335
17752C03471P8957M1645j62638j32352N429M3814k9310j27262M0360j14779P4022
17741B1357m4885N2240l8394n4109J4978M0369j43639L779J24362q5639l3522
17730a43103K4183J926J35204j94262q0283K38536J06314j4115M9379J64176K1863
17719C09818j36722j49791M8695l7640n658l9767K4222J41721K20004J61981j41864
17708C94999j61923p0928l7161j34437j08608K5669j12315P6672J68531m6621
17698f122R222O6695J91702j90712k17876J17401K3780o2396J5585R3428J42502
$$ y = [-83147, -77250, -134751, -116444, -89758, -3141, 35964, 223907, 265274, 164760, 152142, 159393, 103712, 118960, 170126, -2778, -122645, -74268, -155600, -149327, -143100, -91378, 79136, 303471, 382428, 424073, 261435, 129083, 134512, 178326, 149016, 21754, 62114, -52665, 21357, -23528, 28712, -9682, -63791, -48813, -8444, -152083, -148304, -23942, -109581, -143103, -118920, -116994, 18210, -176052, -256335, -17799, 88515, 74400, 123779, 287955, 309818, 173096, 23305, 72000, 34360, 28702, -11065, 13157, 154878, 374882, 536863, 394999, 233076, 162148, 124987, -9450, -118058, -92389, -204704, -128032, 40499, -6122, 3100, 69795, 261497, 70785, -147091, -29690, -5910, -68306, -52721, 40707, 183209]
17687A83209O8834r711j12378o2041o2885R9006K5432N9912j6151j57473j72754
17676a57000O7300M0692q8288j5152J0630j0884j23661K5117L5811J67823k2853
17665g0465J0517j51445O0386O6659K3113J67683R9963O041j23379r9035n9494
17654f9456j85901j5452P9306j8364j15234N0201J28017l9747L7751o699J35874
17643a9704j748L8651J23865j0536L262l2655j54549n8181o3603J00899J28194
17632E3895j93744j31070Q5137k9983J7104L9765q9460q8125J31961J17571K19891
17621A32942K14952n2491j6028j59340k28143o9272J55339N7565L1773M0193Q425
17610A15915O544q6122q7360m9377J02519K9833j6189J00168M3219r4185j00710
$$ y = [183209, 252043, 242332, 129954, 67913, 5028, 104034, 129466, 189378, 173227, 15754, -157000, -89700, -49008, -137296, -152448, -141818, -152702, -276363, -251246, -215435, -47612, -70465, -59948, -211393, -151007, -84348, -61235, 106448, 206411, 212452, 89073, -9962, -69456, -255357, -270809, -191503, -209867, -325101, -274900, -146883, -186630, -148879, -155578, -19704, -21452, 17199, 141064, 130528, 133790, 101135, -53414, -111595, -175198, -74299, 53895, -139849, -270919, -185782, -215765, -198661, -158896, -248356, -336481, -204520, -86949, 132942, 347894, 295403, 279375, 120035, -108108, -177380, -22041, 35524, 67297, 107490, 115915, 122459, 36337, -51023, -100400, 2119, 31952, 15763, 115931, 159150, 64965, -35745]
17599c5745r6450M2517J10747M5292j08470n5410R216o6904j16983n4016K48521
17588g7685K4365j0081M8785q1861R722K16577J20746K1467j5484k155k47004
17577G392r8983j6328m8451K6848P080q1191m9459n8459o1458J90627l0110j24806
17565c37298O482L7597j0117J31483J34386J05226l4233J01656Q3895j17775j23302
17554b2000L3237J60206P8922p0596p7605j42746R5717Q8822l5672k05313P4009
17543b3019J68083J328p0650J3494j4940K2168P8090Q0563k5417j01346L705J25237
17531B57296j26930j65159N5217J72004r1490l5069l792J21593Q6042j20265r0135
17520E9312j10970j29367K10994P7624L4604j9790N7192N7353j35502j17062k6591
$$ y = [-35745, -132195, -89678, 21069, 66361, -42109, -97519, -88303, -155207, -272190, -326206, -77685, -53320, -63401, -14616, -96477, -86755, 129822, 250568, 272035, 256551, 254396, 7392, -91591, -107919, -156370, -129522, -122442, -203633, -253092, -311551, -373009, -182382, -212492, -337298, -330816, -293219, -303336, -171853, -37467, 67759, 33526, 135182, 219077, 101302, -22000, 11237, 171443, 250365, 179769, 102164, -40582, 55135, 143957, 108285, -97028, -23019, 145064, 146392, 75742, 89236, 74296, 96464, 174554, 255117, 229700, 128354, 132059, 257296, 130366, -34793, 20424, 192428, 100938, 65869, 62077, 183670, 269712, 149447, 59312, -51658, -181025, 29969, 107593, 142197, 122407, 179599, 236952, 101450, -15612, -42203]
17509d2203K00460L7425j16987j54873k9715J30703L9951j03051Q36p4776o6967
17498a79197O8227j9197k2233K38731N4309j44458j14510M7966n2675M1639N44
17487h0854L2586J8845k2621m6171j42501P0238K0834L0823R0546m3527n6353
17476a28155j28178M2033o1424j73150j2846K3671O0375K5329Q8700J64056K019
17465i7570L8608K04734p5628p2723j26912j70547K9185J23375O2901j05121Q0063
17454a09635J40175J42883p2109j13669J29516K2836o1554J11664M6341M48k36869
17443B7l6171J4186N2821N0785p1661P345j32697N8796n628M7664q5283j8386
17431a18202N811l3890m2104K9603P5264k6429j0554J65734J52967l6055q4594
$$ y = [-42203, 158257, 195682, 78695, -76178, -105893, 24810, 64761, -38290, -37454, -112230, -179197, -110970, -130167, -152400, 86331, 140640, -3818, -118328, -70362, -123037, -81398, -80854, -48268, -29423, -52044, -98215, -240716, -170478, -149644, -118821, -28275, -71802, -128155, -256333, -214300, -275724, -448874, -461720, -438049, -377674, -352345, -263645, -99589, -97570, -58962, 145772, 70144, -2579, -129491, -300038, -270853, -147478, -84577, -189698, -109635, 30540, 173423, 101314, -12355, 117161, 139997, 78443, 190107, 236448, 236896, 27, -36144, -21958, 30863, 81648, 9987, 17332, -115365, -56569, -62197, -14533, -99816, -118202, -112391, -146281, -188385, -158782, -83518, -109947, -120501, 45233, 198200, 162145, 77551]
17420G7551l354j56153l3955N8022m9208j2001P3807J02412k5270j86013k18727
17409c72889k96J56309K60339P6505Q4275q2378o9997l7690J9694N7561j55414
17398f3981p3607L6410n007j2647n1946J20816J33964l5053Q479m3047k6263o8330
17386h0212k5958j5989n948J02937J26376K0703r2717r3029L6656Q2847j07544
17375e1878r8679P1001O949o6342L0791N5464k3217o6416J44176J14478O2856
17364A79183j46244R6924Q5996k6640m8049k363p9105N7394q5603r9576K6128
17353d1955o137R8314J22946K9278m3033n5295j46778m9305M6715k7405J1797
17342f0858P6377M5324J23333n3345n8599j33242k9730J07098Q6781N4257p6851
$$ y = [77551, 74197, -81956, -115911, -57889, -107097, -119098, -45291, 57121, 31851, -154162, -372889, -373185, -216876, 43463, 119968, 204243, 121865, 51868, 14178, 33872, 91433, -63981, -137588, -101178, -106185, -118832, -170778, -49962, 84002, 48949, 57428, 14381, -11882, -80212, -106170, -122159, -128107, -25170, 101206, 121909, 29192, -63837, -27181, 55666, -51878, -150557, -79556, -72607, -138949, -108158, -52694, -75911, -142327, 1849, 116327, 179183, 32939, 129863, 215859, 189219, 141170, 138807, 59702, 117096, 31493, -68083, -41955, -48092, 50222, 173168, 202446, 159413, 104118, -42660, -91965, -45250, -72655, -60858, 15519, 60843, 184176, 130831, 72232, -61010, -90740, 16358, 103139, 157396, 80545]
17331H0545J0057k13445n9140L3258J51678K0246n5499M5810P499M7820l4202
17320C4627k41281j4345K07472n6108o722N0574j7759L8872P0767n8382j964p3851
17308f8100L290Q3290r9043r6737k6751O2550J59231P2299j60689k04911k0753
17297b96324N7992L7240L35404P9636p9912k20463n4991R5912J16181J15098m2772
17286A43001o9817j01838J09439M1921O1225j04316L8883m301n5047J701K7238
17275H8089O6766M7743j02649N9860K9796j53326l142J17972k859q6027o6048
17264c825j48567p8140m8164J18631O7007N9330J72761N190j88283O4348J38896
17253A59184r4440j48243N898N2968J67983K0423k30107J6622J83097N7433j36554
$$ y = [80545, 90602, -122843, -181983, -148725, 2953, 23199, -32300, 13510, 21009, 68829, 34627, -206654, -220999, -13527, -69635, -76357, -25783, -43542, -4670, 66097, 7715, 5751, -68100, -64810, 18480, -80563, -177300, -204051, -141501, 17730, 90029, -70660, -275571, -296324, -238332, -201092, 134312, 213948, 134036, -86427, -141418, -45506, 70675, 185773, 143001, 73184, -28654, 80785, 122706, 183931, 79615, 118498, 114197, 59150, 60851, 88089, 154855, 202598, 99949, 159809, 189605, 36279, 33137, 151109, 148250, 62223, -3825, -152392, -230532, -278696, -160065, -93058, -33728, 139033, 144223, -44060, 20288, 159184, 64744, -83499, -77601, -24633, 143350, 163773, -66334, -49712, 133385, 190818, 54264]
17242E4264j57142o3818p3180j22977O0322R4778K12950L9651j25047j1716O6585
17231b5330J89813J13801j05142r7550J00396M7490l10655k08227r738O6287n179
17220b44034J2517O803J40116P7534j41915j9950J2728m017j03765J14577J67646
17209A8240J25860r1737j7947j00995K7153k405o6728N0307N4840m3051N7797
17198A1334n5812N6862J16427m3508J5420k5296j4037L2970j2018k11779m2753
17187a72190M377n4416J4921M2366K20954L2510N1043l4233j12307L7607K4111
17176E4743K6389K2435M3552J1538j97670p2109J30655J19987J00784j98220k05571
17165a63487l0732R5020Q9102j3719n2769Q9689J22883J3750j18018p6174j04675
$$ y = [54264, -102878, -166696, -239876, -362853, -302531, -207753, 5197, 44848, -80199, -91915, -25330, 164483, 278284, 173142, 75592, 175988, 223478, -87177, -295404, -305142, -238855, -244034, -231517, -224714, -84598, -7064, -148979, -168929, -156201, -160218, -263983, -149406, 18240, 144100, 52363, 34416, -66579, -39426, -41831, -108559, -58252, -3412, -46463, 11334, -44478, 12384, 128811, 85303, 100723, 75427, 61390, 94360, 82342, -129437, -172190, -167813, -222229, -207308, -164942, 56012, 88522, 139565, 105332, -6975, 30632, 54743, 81132, 103567, 147119, 158657, -39013, -111122, 19533, 139520, 240304, 42084, -163487, -194219, -99199, -10097, -23816, -76585, 13104, 135987, 149737, 31719, -44455, -149130]
17154a49130o2647J34999R1557K119L9858o8674j06271j58063J7495J82174M8472
17143b8111J9341p2836R4404Q1544j26721K6415M3024j10366l0853k1767j2788
17132a38714j135j11123l8799Q5943R7225j43884N9774J49922K8281K4031N2232
17121F3753q5413j01973Q97j9953j2112j37255K06339J07422m7478Q4248J570
17110F0045j19846M1649j17858j05374J25847j0868j23233J11739J3840n9744
17100a83803p6866r6216O2999K08351l7634l4106j2712k2531O7014O0711j02270
17089a67063J38368q3154O2002j6897p9766J10145R4673j6583J9172K6473j43784
17078e6414j21584q0380Q5578O1873j24212J41295J63308K9194M4300r4479j41220
$$ y = [-149130, -211777, -76778, 14779, 16898, 56756, -11918, -118189, -276252, -258757, -76583, -28111, -8770, -81606, 12798, 94342, -32379, -5964, 37060, -73306, -104159, -125926, -138714, -139849, -250972, -289771, -203828, -106603, -250487, -190713, -40791, -12510, 11521, 63753, -21660, -123633, -122736, -142689, -154801, -292056, -85717, 21705, -25773, 58475, 60045, -59801, -18152, -136010, -241384, -115537, -126405, -249638, -137899, -124059, -183803, -260669, -356885, -293886, -85535, -123169, -157275, -169987, -192518, -125504, -64793, -167063, -28695, -111849, -49847, -66744, -146510, -36365, 58308, 41725, 60897, 87370, -56414, -177998, -258378, -172800, -110927, -235139, -93844, 69464, 98658, 142958, 48479, -92741]
17067i2741j57214P6853J36029K66159N8844j19477j84887j5583J50406n1781
17057F6608n141J80435M1841p8244q1158q2311k1324M480o8975J16423j08493
17046c5859m5633J4772j3616o5566l0429K1600J40263J51793l1438k5782k9513
17035E0592R8370p8255r4745n8220J24773K694j07348J03827N9186o2527m4881
17024f534Q0471N1587q4511M0236o2099j0020m7401m117j6277n1208k28335P8838
17012b59370Q5655n7539K0787J30036J36924Q1365j14007o4013l3305O7500L3219
17001B7252L1131O7363j9010r0041o2125j03115J08582J42210r7343k8434J03701
16990H0171l2927q695j70677o8728M3306J02393J7350K1982j545n2638l7862n2566
$$ y = [-92741, -249955, -173102, -37073, 229086, 287930, 168453, -16434, -32017, 118389, 66608, 61467, 241902, 283743, 205499, 124341, 42030, 20706, 25186, -43789, 72634, -35859, -81492, -66720, -80336, -145902, -176331, -154731, -14468, 137325, 105887, 80105, 50592, 148962, 70707, -24038, -82258, 42515, 45209, -62139, 41688, 100874, 38347, -6534, 73937, 125524, 41013, 81249, 19150, 9130, -38271, -42388, -58665, -109873, -338208, -259370, -173715, -231254, -210467, -80431, 56493, 137858, 23851, -40162, -73467, -5967, 27252, 58383, 125746, 106736, 16695, -45430, -148545, -39963, 102247, 4904, -23530, 80171, 47244, 38549, -132128, -200856, -157550, -55157, -37807, -15825, -17370, -70008, -107870, -160436]
16978a60436k6267R9909K5458p6313J00352J20697j5792j29030N1359N1560k2844
16967A8653L7889J6227L9411j35922j70716O3397J21071n93j53346J6765R7606
16956d9558J44692J00429j27753j01315l5463l689N3165N6576l105l040l9326
16945h387o2196R0578K15624j28355j64005n2713j8026L0948O3700K2124J0691
16934a7m1698J53942j4507j4570j62287L1774k647r730L2284K8853K5393Q4181
16922A10971k2720j61610J8846J625N1767K6281Q4670n7701J78204O5597j53088
16911A42842j26661p4890r4539M1445O0896J74235p8237n8635J09117r4305j31008
16900a29740l3357R3982Q196r2022o2421M4089r2180j00763P3205j6922j402K35079
$$ y = [-160436, -186703, -86794, -61336, -137649, -37297, 83400, 67608, -61422, -10063, 41497, 18653, 56542, 72769, 112180, -23742, -194458, -131061, -9990, -10583, -163929, -147164, -49558, 95134, 195563, 67810, -33505, -68968, -72657, -19492, 37084, 33979, 30939, -8387, -70583, 19995, 235619, 107264, -56741, -109454, -127480, -96532, -32832, -10708, -17, -41715, 112227, 97720, 83150, -79137, -47363, -50010, -59740, -27456, 1397, 26790, 110971, 88251, -73359, -54513, -52888, -1121, 25160, 109830, 52129, 230333, 295930, 142842, 16181, -58709, -153248, -111803, -50907, 123328, 45091, -13544, 95573, 1268, -129740, -163097, -69115, -60919, -152941, -215362, -171273, -263453, -364216, -291011, -307933, -309335, -74256]
16888g4256r45j44737j37920Q4899J28231J34458r375j2815n9503p8881n4324
16877b25168J31762Q7450j63989N4059Q8952O9615j35147J1043O2491k4808M8681
16866D941J825n0011o3832q1046L5508j99118J02653K02002L1590j27209j35456
16855b78153R1081J02174r0770j35587m8566J44421J31222O4885j8632N129Q2524
16844D9728P4279j4353j08798o5258n5152j12289L6824n9563J11969J96875K3950
16833G8212j30921o7868l7738p6116K5995n9070m7243J95552J12934m3171p5850
16822a25284M0173R3821L9870j03667o7709n7561r644O9971k0417o2341p342k9719
16810b39849M8143P3218P8539o2836J588j847j25153j72876m5727N9842P1599
$$ y = [-74256, -75201, -219938, -357858, -272959, -144728, -10270, -19645, -32460, -91963, -170844, -225168, -93406, -5956, -169945, -115886, -26934, 42681, -92466, -81423, -18932, -43740, 4941, 6766, -43245, -107077, -188123, -152615, -351733, -249080, -47078, -15488, -142697, -278153, -187072, -84898, -175668, -311255, -359821, -215400, -84178, -19293, -37925, -32796, 49728, 124007, 109654, 856, -64402, -119554, -231843, -195019, -254582, -142613, 54262, 78212, -52709, -120577, -158315, -234431, -208436, -267506, -314749, -119197, -6263, -49434, -125284, -85111, 8710, 48580, -55087, -122796, -180357, -190001, -120030, -140447, -202788, -210130, -239849, -191706, -118488, -39949, -102785, -101197, -103044, -228197, -401073, -446800, -386958, -315359]
16799c15359J05530J17895M8066m5717J23261j767l8851Q4604j50849j68789J24891
16788a17085J45284p8436j4965J79337L1409r3471l9959J8195n9787p6830M0229
16777f6079o3022J10308Q3l9950M9344l9457k18354L2652J64905m4783j00664
16766b15017K779P5821M7611O7224J0195J02538q5912j05250R3266J5369N215
16755A3839M8928j17009m4030Q2902J39271Q2268o9344k8303o0898j1602J42119
16744A78141K1832l7821Q1002P4592j52202j63116j31350Q3418J53487j80567
16734g2584n4205L3153l3695R7619J96082J9607l1452J0692p2904l5389j49806
16723i2882J24554O9656o5470p5723j11844O3176N1632j3035r8169j9165j0144
$$ y = [-315359, -209829, -91934, -43868, -89585, 33676, 31909, -6942, 77662, -73187, -241976, -117085, 28199, -50237, -65202, 114135, 145544, 52073, 12114, 30309, -29478, -106308, -66079, -129101, -18793, -18710, -58660, -9316, -48773, -267127, -234475, -69570, -114353, -215017, -212238, -136417, -88806, -21582, -11387, 91151, 5239, -100011, -6745, 8624, 13839, 62767, -54242, -98272, -15370, 123901, 206169, 136825, 108522, 47624, 36022, 178141, 199973, 162152, 243154, 317746, 165544, 2428, -128922, -45504, 107983, -72584, -126789, -93636, -127331, -29712, 166370, 185977, 154525, 165217, 92313, 56924, -92882, 31672, 101328, 35858, -39865, -151709, -88533, -36901, -49936, -148105, -167270, -177414]
16712a77414J12602L18218j30121j70337k871R1762m0493K6689p169N9950r2104
16701a1288o9751j09013J67817J93677q4996m8720J45596N4649q3860r1641l870
16690E8600P1663j99489n0307J05893K5819o0025j32122K0530K63090J22514p8025
16679A48141j54656K8966L1674r0246m7169q7444k3541R1651K8221n1430N504
16668a20329J1455J55279P0945j07925r6253j0224J03432M3094o6362k3405Q3429
16657D3136j7624J20835l996j37856k00132j93894P0699J59757J49208q7463j18915
16646b16245j37580L3450Q5201J39508Q6089J7525l9412o1534k872n6847r0208
16635b42925J48998J56886p6822m7079O1019J17222N841n3996n7221p9230j377
$$ y = [-177414, -64812, 253406, 123285, -47052, -49923, 41839, 1346, 28035, 20866, 80816, -11288, -81039, -190052, -22235, 171442, 86446, 37726, 183322, 237971, 154111, 62470, 58600, 130263, -69226, -119533, -13640, 12179, -47846, -179968, -159438, 103652, 226166, 148141, -6515, 22451, 54125, -36121, -83290, -170734, -194275, -102624, -74403, -125833, -120329, -108874, 46405, 117350, 9425, -86828, -97052, 6380, 49474, -16888, -40293, 43136, 25512, 146347, 142351, 4495, -195637, -389531, -318832, -159075, -9867, -97330, -216245, -353825, -320375, -235174, -95666, -9577, 7948, -31464, -92998, -95870, -152717, -242925, -93927, 62959, -13863, -60942, 77, 117299, 123140, 69144, 11923, -67307, -68684]
16624f8684k00855J00946J85294P8744q9873j39187k9154M4858J38470j61985
16614a41426j18149J54535l219j6654K08085k7807q6056p4653l7716k03529N456
16603c41133K2575J62399J76028o4307o7116k9629P6298o4193k71194j07546M3362
16592d64456K19691J27553n1169l7812M8711r5843j0306p5011k4394N8868J01653
16581b02515N2307l309P3074r0152k40484l0092J23953J52179J27555l5151K8611
16570d4024P5945N9645J49694j1798q9140j36290N7058R704q7741j71134M6662
16559a41419m7686K46825J6833o2777j4476m9243L2963J27962M1680j83681j93687
16548b26706J33439P7547j01110m3535r431M3155J12782M9866N2778j9833k12211
$$ y = [-68684, -269539, -168593, 16701, 95445, 5572, -133615, -162769, -117911, 20559, -141426, -259575, -105040, -108259, -124913, 83172, 55365, -30691, -105344, -143060, -346589, -341133, -318558, -156159, 19869, -44438, -111554, -141183, -64885, -129078, -400272, -507818, -464456, -244765, -117212, -168381, -206193, -157482, -253325, -263631, -338642, -363036, -304168, -202515, -150208, -153517, -80443, -170595, -411079, -441171, -317218, -165039, -37484, -72635, -44024, 31921, 91566, 241260, 229462, 140322, 4032, 61090, 70794, -16947, -188081, -141419, -189105, 57720, 74553, 11776, -2700, -51943, -18980, 108982, 150662, -33019, -226706, -93267, -15720, -116830, -160365, -169796, -126641, -13859, 36007, 88785, 68952, -143259]
16537a43259j57827j05476k9115O1507Q0983J4565j1693j9778q0134J8592Q2649
16526b88986P8107k8140J06522J59364j93524p9189J68835K08285P9047j2248
16516A98073r7764r2687n0038N8135P2668m7987k40984Q423M089J95665P1942
16505G9535J9890N1472l5069p6165N4493P389N8152m0568k59592m771M3969j00149
16493b01414j51J36749O0236M4992N8548N5976o8509j65203l3168j44695l2126
16482b88765J89967J14187Q723j22154J725J06790P5183K32198J860j31117j16090
16471G2507m9929l7900j85266j18480m3860n0874J16488L9327R7318J9875P6246
16460f4548k9262j1594J05505M6633K9742N620Q888p152n0246j86787k10134J40159
$$ y = [-143259, -301086, -406562, -435677, -374170, -293187, -278622, -290315, -310093, -390227, -371635, -288986, -210879, -239019, -132497, 26867, -166657, -245846, -77011, 131274, 210321, 198073, 100309, 7622, -42416, 15719, 88387, 40400, -200584, -192161, -188072, 7593, 79535, 99425, 150897, 115828, 39663, 94156, 101545, 159697, 119129, -140463, -145234, -101265, -201414, -201565, -64816, -4580, 40412, 98960, 154936, 86427, -78776, -111944, -256639, -288765, -98798, 15389, 24112, -98042, -96317, 10473, 85656, 317854, 319714, 188597, 72507, 22578, -15322, -200588, -319068, -362928, -413802, -297314, -257987, -160669, -140794, -64548, -93810, -105404, 101, 46734, 76476, 82096, 90984, 83832, 33586, -153201, -363335, -223176]
16448b23176K01121m1596m9556j3635m3389M2871J00967P295m4594n2070o0164
16437a75926O0585p0854o3013l3876l6720Q8034J21412J67032m9516k59760j63129
16426d15731k1310P3811J10835J04874J7367k4951P6267l309j06301j15942j9909
16415c24299N4101J32422R7029Q6027j9591l921R434q3494j07946n3047o6039
16404b79324m1199N4098J15278o3988N0215K6862J60693P6418N9515O944o3033
16393A02479K1656M5631l4847M9833J6330k6460j3185p9886j58463J2774L1271
16382c2867K2568j0507n3260k11784q1517K35065K37L5143L4172Q0204O5329M1130
16370A23913K8194l2144p1989r8138l5354j24248p4303J0643n1404J87154R3598
$$ y = [-223176, -22055, -63651, -113207, -126842, -170231, -127360, -26393, -19098, -63692, -115762, -175926, -115341, -186195, -249208, -283084, -319804, -231770, -110358, 56674, 7158, -252602, -415731, -437041, -363230, -252395, -147521, -130154, -155105, -78838, -82147, -188448, -304390, -324299, -270198, -137776, -40747, 45280, 25689, 21768, 31202, -52292, -160238, -213285, -279324, -320523, -266425, -151147, -215135, -164920, -138058, 22635, 99053, 158568, 165512, 102479, 124135, 169766, 134919, 184752, 201082, 174622, 161437, 81551, -76912, -64138, -32867, -10299, -20806, -74066, -285850, -367367, -132302, -132065, -96922, -62750, 17454, 82783, 123913, 152107, 119963, 47974, -50164, -85518, -209766, -284069, -273426, -324830, -137676, -44078]
16359d4078j57060J18836J48767k8806Q5321p4587L2978r7108j51488O9777K23808
16348A26360J27456j12543j29770n726J8571Q0194q7172q7599j99855j70155p5006
16337e15245J76253J82229r2182P0034m0568m6827m968k1523J01702J92188j7959
16326a6866j76757p0817J9850J58710j23575J20206n3416J1395n3327k2239n730
16315b12566p0304K09013R5167j91632k7923N9392K30684N3063P159m9667P3831
16304A76217J0278L0273j56261k1016R9124q9536r7005l8276L2099Q9130l4171
16293H56M0853n8634N3379k2083j50764j15915k5231J17985P1953L8617L2930
16282a6054N932k36962j18846J68125J76985J45877M5986j74330r3920n380j59866
$$ y = [-44078, -201138, -82302, 66465, 37659, 122980, 48393, 81371, -15737, -167225, -97448, 126360, 253816, 141273, 11503, 5777, 24348, 104542, 17370, -70229, -270084, -440239, -515245, -338992, -156763, -248945, -178911, -219479, -266306, -271274, -292797, -191095, 1093, -16866, -193623, -264440, -244590, -85880, -209455, -89249, -142665, -131270, -184597, -206836, -212566, -282870, -73857, 21310, -170322, -198245, -138853, 91831, 144894, 152053, 102386, 176217, 186495, 216768, 60507, 39491, 138615, 49079, -47926, -86202, -54103, 35027, 856, 41709, -16925, 36454, 14371, -136393, -252308, -277539, -159554, -87601, -48984, -16054, -10122, -247084, -365930, -197805, -20820, 125057, 171043, -3287, -97207, -102587, -262453]
16271b62453J3231O9844k624J25006J05247N9475m0121j15029q9118Q1837J23366
16260F8661P8306k00214q1423K0292Q9668L4593n2448l6526J6124K09085R4090
16249B40208Q4429N2392k17165r7843O3176j72531K2295N4775j01895o8294J4245
16238a26208L726J29587J46993p205k06157j49640k8032J49636N2960J6723J12038
16227I4421l9656l9181o4809r5785j06770n5920L769J11464O8628k1143p7302
16216b22284O1091k1775k5081l3362K1684J51779j9259N7210q9741J01658J85103
16205A67023k2471j71624j14629J07513J42226K8075J2487l7610k5849j65963
16195h0822j49121O4823J55951N266j61408L6183P9258K6217N9316M9676j32296
$$ y = [-262453, -249222, -179378, -182002, -56996, 48251, 107726, 67605, -47424, -136542, -54705, 68661, 146967, -53247, -134670, -114378, -24710, 9883, -42565, -79091, -62967, 146118, 240208, 324637, 377029, 159864, 62021, 125197, -47334, -25039, 29736, -72159, -140453, -126208, -122482, 7105, 154098, 146893, -59264, -208904, -236936, -87300, -34340, -17617, 94421, 54765, 15584, -49225, -145010, -251780, -307700, -303931, -192467, -123839, -144982, -222284, -161193, -182968, -208049, -241411, -219727, -67948, -87207, -29997, -119738, -18080, 167023, 144552, -27072, -141701, -34188, 108038, 136113, 148600, 110990, 85141, -80822, -229943, -165120, -9169, -3903, -165311, -129128, -49870, -23653, 35663, 85339, -46957]
16184d6957N7034Q8244k17788p0975Q2368P2032J67284J8333j5140l3363p1594
16173B9478J9569j29004n8856m6139M8905R1543M7212L1582j5783K286n2227P258
16161b4176M1670q6079O013J71843M5318k47515m0297j48241O7266O0747J173
16150a52278k09196j91283P2621o0400J16328L1366M1432R8995P7765n8455O4682
16139a68423R3113J24602J02525j65109j20152p4689J51986k0647N8917j85542
16129b03419q3334J00692P9497N6174K15404R4521j48223k08378K5338L4754O6186
16118B9212q176Q9856Q246j35214P8898Q579j97949j00464R2209L6387j45182
16107b43598l4177J52754J28876r9594P4Q5798J2635k4038j36496Q6574J9724
$$ y = [-46957, 10077, 98321, -119467, -190442, -108074, -36042, 131242, 149575, 134435, 101072, 29478, 49047, -79957, -138813, -184952, -136047, -44504, 2708, 34290, 18507, 20793, -31434, -24176, 17494, -68585, -62572, 109271, 154589, -92926, -133223, -281464, -214198, -153451, -152278, -361474, -552757, -480136, -540536, -424208, -392842, -351410, -252415, -174650, -233105, -168423, -75310, 49292, 151817, -13292, -133444, -208133, -56147, -76794, -17877, -203419, -286753, -186061, -106564, -50390, 165014, 259535, 111312, -97066, -71728, -36974, 29212, 21036, 110892, 119138, -16076, 62822, 71401, -126548, -227012, -134803, -98416, -243598, -277775, -125021, 3855, -95739, -95665, -9867, 2768, -21270, -157766, -71192, -51468]
16096e1468J0582M4300j37054j07922J00511Q7756K8909J0605K1239o8350J42800
16085H1908P6852J65481J6180j32405k091n906J32878Q864j04237j08784k5790
16074A02950J33778N3291l3249l3623j482m2610Q9177j936M6808q7290m7783l0944
16062A47087o4569K8165J2070k2999J43378k0842j14819l3449j03649J25614J74184
16051B70171j75743p2462l1673k09421l1433J2230L8526K2680P7971J66028j14636
16040d7762j24694K2080J18439k7036m0676J9344J27436O6541j00546r275n4273
16029e0422n3362j10235q5835j4194N6941P4612J622q8700R1456K36343J21012
16018A79238k0087n0548j04623j0711m7109n9777l6507P4270J72218o7458q548
$$ y = [-51468, -40886, 3414, -133640, -241562, -141051, -53295, -24386, -13781, 7458, -60892, 81908, 158760, 324241, 340421, 208016, 205925, 200019, 332897, 341761, 237524, 128740, 102950, 236728, 290019, 256770, 223147, 221665, 179055, 268232, 266296, 313104, 225814, 178031, 147087, 82518, 110683, 122753, 99754, 243132, 222290, 107471, 74022, -29627, 95987, 270171, 94428, 21966, -9707, -219128, -250561, -238331, -199805, -177125, -99154, 66874, -47762, -172456, -150376, -31937, -58973, -99649, -80305, 47131, 113672, 13126, 3851, -50422, -103784, -214019, -299854, -314048, -257107, -182495, -180873, -269573, -178117, 58226, 179238, 159151, 108603, 3980, -6731, -53840, -113617, -150124, -75854, 96364, 28906, 20358]
16007B0358O0135n9585J00129J27916p7118j70404P5959Q8536k1967j05725j63097
15996a24863o8699P4404P6029j5024p6455j09619P4938K1074R1M8196p089p7144
15984a84161L0071L4027P241J14427J45852J28660N4504n0886O880q5195j44414
15973E7006n4038K6300J29093J9829Q6187m4791o9693m6165j20616r8836j0717
15962a26441J17332k6189m0984o9679q9795j08440p6544K12344J83481m2542j66735
15951b34192j31949l931O271N5396J54328M7436r591r1052J19410L5032p1990
15940a24832l8818j925R4683J37497J45608l7796R6113r7671r378q73j37036o8404
15928d2832J05747J01678r182J9589l4725j92600j29385j56217J32530J20430
$$ y = [20358, 80493, 20908, 121037, 248953, 171835, 1431, 77390, 165926, 143959, 38234, -124863, -193562, -119158, -43129, -58153, -134608, -244227, -169289, -148215, -148124, -99928, -107017, -184161, -154090, -120063, -112822, 1605, 147457, 276117, 330621, 279735, 286615, 201420, 57006, 2968, 29268, 158361, 178190, 264377, 219586, 149893, 103728, -16888, -115724, -126441, -9109, -35298, -76282, -145961, -235756, -344196, -420740, -208396, -24915, -67457, -234192, -366141, -370072, -363801, -308405, -154077, -106641, -116232, -207284, -87874, -52842, -124832, -163650, -165575, -70892, 66605, 212213, 174417, 270530, 172859, 163481, 162608, 25572, -42832, 62915, 164593, 155411, 175000, 140275, -52325, -181710, -337927, -205397, -84967]
15918h4967J4771j04792J2157M2302R935N5090j6182M3830K67190P9352p1887
15907B46799k0316j04052r091P7781m7774K9853j37647j73238J5830N9148M9237
15896a3470J61632J00572j51447j41830j61432k1724K2545J09983M3511O1259
15886I599J65827R1476k1429j29433N163J63753j08229j68972k9811Q3787J4551
15875G6282j03098j02498m9579M6343J54314J68719J33083j26025j17767r4811
15865a5037j34295j28399Q4278R2967L2208N440q8376P594p7313j61204J04620
15854b77517K23532k8035j22042l8120p7677Q841K48246o8198p025Q1042o358
15843f3311j7323j0401J23520M3290o2301K4277k2533M8051L8688N1646K1368
$$ y = [-84967, -70196, -174988, -162831, -120529, -110594, -55504, -71686, -27856, 239334, 318686, 246799, 226483, 122431, 113340, 191121, 143347, 173200, 35553, -137685, -121855, -62707, -13470, 148162, 248734, 97287, -44543, -205975, -227699, -205154, -95171, -51660, 9599, 175426, 266902, 245473, 116040, 121203, 284956, 176727, 7755, -22056, 61731, 76282, -26816, -129314, -178893, -132550, 21764, 190483, 323566, 197541, 79774, -15037, -149332, -277731, -193453, -100486, -68278, -62838, -151214, -143620, -220933, -382137, -277517, -53985, -82020, -204062, -242182, -319859, -311018, -62772, -130970, -137995, -56953, -63311, -80634, -91035, 32485, 75775, 13474, 37751, 15218, 63269, 101957, 153603, 174971]
15832A74971k6505k04840j62486J31179J03032n4961l3559N5586J55469M4647
15822A82533k6922L6864J46717O2070j88736j61501n164j27834j7052K7992J8412
15811e2621K5201O0252n1422q388J49350m3231Q700j4515j49092j0948M7639j11688
15799a50763N644J35293M6134l3580K9059j3527J07870m6133q2485k8427R5686
15788F4771q031K647l4433j829q949j62014Q687Q9988N1912o0875n5979J06122
15776g983J27989j28151j29223L1820J47589K3466j37995j13526L9173m6558Q8777
15765a04622J33005K15198J80548j29223k39172o5202J30197Q4468J9135r8344
15755A25988j50160p4846j16889K962O1759P2784o314m3449J30399o1643n8167
$$ y = [174971, 148466, -56374, -218860, -87681, 15351, -39610, -73169, -17583, 137886, 182533, 155611, 192475, 339192, 401262, 212526, 51025, 45861, -81973, -99025, -71033, -52621, -27420, 32832, -18590, -26978, 122372, 79141, 87841, 73326, -75766, -86714, -39075, -150763, -145119, -9826, 36308, 2728, 31787, 18260, 126130, 79997, -2488, -30915, 64771, 56740, 59387, 24954, 23125, 14176, -147838, -139151, -49163, 2749, -58126, -114105, -7983, 120006, -8145, -137368, -105548, 42041, 65507, -72488, -186014, -146841, -193399, -104622, 28383, 243581, 424129, 294906, 55734, -9468, 120729, 205197, 224332, 125988, -24172, -99018, -215907, -212945, -151186, -78402, -84716, -128165, 2234, -59409, -117576]
15744a17576J77474K7764k220m0902k09641j28432K11389O4695K60516n9934o9415
15733A13718l5659o9210o8117p7367j32679J7800n4607m7246M1677R2104M8243
15722a71343o6667n6604M7905J05979P9361N7017J30184P2646j00197j75254M2560
15711c4413J641p9600l9939L08012J63096k8276k28991o4840K01785K02904m3367
15700C58012q1662j15024j75465l0565K30902M6210m093j60353k11487p639J11430
15689c9734m223j02270J32957o6368j23069J15113J15670m8616O6152m326j81812
15678a40526n0123R3348l8959j58269K07136J01921k1856q6120l7871O8223P8424
15667A5328J4239J80186q387j88135m1863P978l4014o8776r810K9558j4731m305
$$ y = [-117576, 59898, 87662, 85442, 44540, -165101, -293533, -82144, -17449, 243067, 183133, 113718, 78059, 8849, -59268, -136635, -269314, -251514, -306121, -353367, -311690, -219586, -171343, -238010, -294614, -246709, -140730, -61369, -4352, 125832, 198478, 98281, -76973, -34413, -32772, -112372, -152311, 155701, 318797, 290521, 61530, -3310, 198475, 401379, 358012, 276350, 161326, -14139, -44704, 186198, 232408, 228315, 67962, -143525, -151164, -39734, -43957, -146227, -13270, -79638, -202707, -87594, 28076, -20540, 45612, 41286, -140526, -190649, -97301, -136260, -294529, -87393, 14528, -7328, -93448, -131319, -63096, 15328, 29567, 209753, 201366, 13231, -28632, -20654, -54668, -123444, -133254, -103696, -118427, -122732]
15655a22732P8918N4157m708R2746q1079j5669Q6023J08609p4799p8737O2093
15644A04822J83261q4159j60867k10120J5345J23718R0223Q4124J31009L5885
15634C13241r0739q3737j6994l8342J8102q9830r8549O8694R2096J2595q0556
15623E981p2367o9641J4052N6291J7379N3580l9503j28501J62004Q4420p1928
15612A1767j40273j23273N3471J99561j24226n3877J63065J3780j21276k2173
15602a43454L1824m1172J05993J67057N7517l5194N4348P8597M6556q6510j43694
15591I1868j70261k7702o5878n2712J05567j62O0926K813K5952j70176J35393
15580f4372N0668j45131n0884Q3147J42894q3905l684J36139r2928J5062M1383
$$ y = [-122732, -43814, 10343, 5635, 98381, 17302, 1633, 87656, 196265, 121466, 42729, 104822, 288083, 203924, 43057, -167063, -151718, -28000, 62223, 146347, 277356, 313241, 222502, 138765, 121771, 83429, 101531, 11701, -86848, -18154, 73942, 86537, 5981, -66386, -136027, -121975, -65684, -48305, 5275, -34228, -162729, -725, 83695, 11767, -128506, -251779, -198308, 1253, -122973, -176850, -13785, -5, -121281, -143454, -111630, -152802, -46809, 120248, 177765, 142571, 196919, 275516, 322072, 235562, 91868, -78393, -106095, -171973, -224685, -119118, -119280, -58354, -55541, -29589, -199765, -64372, -13704, -158835, -209719, -126572, 16322, -67583, -71267, 64872, -28056, -12994, 28389]
15569B8389N5554Q2610j12553L8527P2653k9033l9959J5052k7583n8920j20978
15558i6241o2036J3140n7228J13468J40960L55L2591J4545k774M7810j70760j26838
15546a53008N5722J65111m0674j13514r8961j7956J38866P3135j6301j34485k38721
15535c80786p7844N6606K69699Q3937k2899P5730M7303N5564j31872j40555O3567
15524a01550J29680J6003r0199K0164P7169R6914q235k61155k6338j624R4167
15513e5004J09496q2264k1090K161K808m2886J36462Q2023J3103j09797J41091
15502A76103m0439q6425J26946j13769k07753r1123P990O7304J23548J89099N4827
15491B06308j17452q7091k5373k4079k5658L6439J36511k5308j14120o7871J02261
$$ y = [28389, 83943, 166553, 54000, 92527, 165180, 136147, 96188, 111240, 83657, 24737, -96241, -158277, -145137, -202365, -88897, 52063, 52418, 85009, 99554, 96780, 144590, -26170, -153008, -97286, 67825, 27151, -86363, -185324, -203280, -64414, 8721, -7580, -142065, -380786, -458630, -402024, -132325, -48388, -71287, 4443, 51746, 107310, -24562, -165117, -101550, 28130, 44133, -46066, -25902, 51267, 148181, 139946, -121209, -147547, -149171, -55004, 54492, -27772, -48862, -46701, -43893, -86779, 49683, 131706, 144809, 35012, 176103, 135664, 49239, 176185, 62416, -145337, -236460, -228470, -161166, -37618, 151481, 206308, 88856, 1765, -23608, -47687, -73345, -36906, 99605, 74297, -39823, -107694, -5433]
15480e433O7652M0574J02139L1557j94576l5722N7869r955p5696p8425k12802
15469c12818j48703K07286R3459P3075m2067q6171K419J52978j190n3202j5518
15458a30452o3483l5630P1053q2546l2516K379j14158O3347K22886J19465m0683
15447b0338o9441P800o8469n5276J8896L0464O1472J4798Q0114J3924n644L4327
15435D2627K8372q6711J01940p614p7902p45K19610o3417j74885K3995J13381
15424A18651K0848k06530M3268K6916J46940J27148j1779j22064k05385J6153
15414d5834O0351J80239J4422J16211m5686j63732n7805l6424r1972J30144N5978
15403A15892j13425j06334O803o4673m5101r8199m3462J9836J50071M7502J10176
$$ y = [-5433, 62219, 102793, 204932, 236489, 41913, 6191, 64060, 54105, -21591, -100016, -312818, -461521, -254235, -160776, -87701, -129768, -215939, -213520, -60542, -61732, -114934, -130452, -193935, -229565, -158512, -241058, -273574, -271195, -385353, -322006, -99120, 20345, -20338, -89779, -81979, -150448, -205724, -186828, -156364, -94892, -80094, 20, 13944, 8300, 42627, 70999, -15712, 86228, 78614, 712, -33, 219577, 156160, -18725, 5270, 118651, 139499, -67031, -23763, 3153, 150093, 277241, 265462, 143398, -61987, -45834, 14517, 194756, 209178, 325389, 279703, 115971, 58166, 21742, -70230, 59914, 115892, 2467, -103867, -97064, -161737, -206838, -305037, -348499, -328663, -178592, -131090, -20914]
15392b0914J97105l5071n0719j17125J6531P6223j66621L87O7462L9673n4545
15381d7614L7273N7487J4500j35570P0148J83386l8163k38336j02089J1283n814
15370a93509k959J40622M3960m3599L9677n7110p9884k8036j17904j15022P6956
15359c36808J697O0886K3414O8095n9647j32583O7906j10676M9067J02123J60712
15348a05814N1422k3777N3306q5984n5446j3594k1959J34660J85414O982l8353
15337H6857j96213l2142L9854L5001J09069N2835M1597J31062j1974j07653P4560
15326B22853j07813r3529m4681K3777r5823L7281J11680O5270j67277j19531l1266
15315a99059l4O3636J55192L585j37141j21668L981J13485J34094l4616m855J07784
$$ y = [-20914, 176191, 141120, 90401, -26724, -10193, 66030, -100591, -100204, -32742, 6931, -47614, -10341, 47146, 61646, -73924, -3776, 179610, 141447, -96889, -198978, -187695, -193509, -196468, -55846, -11886, -55485, -15808, -72918, -152802, -180838, -298742, -413764, -336808, -335111, -274225, -250811, -182716, -242363, -374946, -307040, -417716, -368649, -266526, -105814, -54392, -78169, -24863, -110847, -166293, -179887, -201846, -67186, 118228, 125210, 86857, -109356, -141498, -101644, -66643, 42426, 95261, 136858, 267920, 255946, 148293, 222853, 115040, 21511, -23170, 607, -95216, -57935, 53745, 119015, -48262, -167793, -199059, -199093, -135457, 19735, 23320, -113821, -235489, -231508, -118023, 16071, -18545, -23400, 84384]
15303H4384J15582M1988q4031j83420R1731J41477j39783k82987K572M6056J14178
15292e2253L9180o7085N2888J31165N26l3299J4574k6979J03604M3586j42903
15281F3004N9138q6032j16888j28128Q8747J7902J12454r0662j22932L230m4950
15270b45117J03538J06730P5506J79318q3390P0829k7566p2904j58584j1216o0121
15259a22977J00554K49554J75765q8405j38988j12715q0388j88215R5153K01436
15249I0774P822j9442M6755j10717l2267k6255K7846J1790m6474o1590m2907j1326
15237a65991n3619J06926m5848m4095O7181j18974J24704Q6499J93531l1723r6935
15226B1656k1486K8103m8491j33751M5950k3351J36238J15777M1248n3173k9294
$$ y = [84384, 199966, 241954, 157923, -25497, 66234, 207711, 67928, -215059, -212487, -166431, -52253, -13073, -80158, -27270, 103895, 104421, 71122, 85696, 58717, 162321, 205907, 63004, 122142, 36110, -80778, -208906, -120159, -102257, 10197, -80465, -203397, -200167, -245117, -141579, -34849, 40657, 219975, 136585, 207414, 179848, 106944, -51640, -62856, -122977, -22423, 227131, 402896, 314491, 175503, 62788, -17600, -205815, -110662, 90774, 98596, 79154, 125909, 15192, -17075, -43330, -15484, -3694, -50168, -111758, -154665, -165991, -219610, -112684, -158532, -202627, -135446, -254420, -129716, -43217, 150314, 118591, 21656, 170, 28273, -20218, -153969, -108019, -131370, 4868, 120645, 161893, 108720, 79426]
15215G9426k7304J17238j52067l5747L559k7053l8111p8297M6835J27473j12369
15204i6417r8263M0167R1302l7050j04356j01387Q7202Q2694j10673N6527P2702
15193a17552n6722J2487q0232p3439J03236K22919J0507n5511j71345p3229m7801
15182c26682Q5571J88586P6854j61650n4781J3110m3919J3785r6101K6265K05959
15171g3003Q6942N5322K9838O5034o0306j14944p9528j77684j8457J09395K6100
15160a51291M1096l307R6048L5131J44700m0823M334M5765L8272k65074j05881
15149a61030Q7541R4228O1980j08628j03100o3079J61604J02146J08801N773N0980
15138B37216o4721l1919k5533L2578o2746K3182K3019j27686k6076M1447j1061
$$ y = [79426, 52122, 169360, 17293, -18454, -14895, -41948, -80059, -158356, -111521, 15952, -96417, -194680, -154513, -63211, -100261, -204617, -306004, -218802, -136108, -246781, -190254, -117552, -174274, -161787, -242019, -315458, -212222, 10697, 21204, -34307, -205652, -278881, -326682, -241111, -52525, 24329, -137321, -192102, -178992, -222911, -209126, -305227, -278962, -73003, 13939, 69261, 99099, 164133, 103827, -11117, -90645, -268329, -286786, -177391, -151291, -110195, -113502, -17454, 17677, 162377, 121554, 125888, 171653, 209925, -55149, -161030, -73489, 20739, 82719, -25909, -129009, -192088, -30484, 71662, 180463, 186236, 237216, 172495, 140576, 115043, 147621, 84875, 108057, 131076, 3390, -22686, 18761, 7700]
15127G700q0742N122j99090J7901K99475K11835k36967j90902q0817m7276J53359
15116a40402K46658j27935j95750r2631O3235Q4190L6216K5515n8042k3110O4535
15105a17521J25639j15411o1207M8914q3066Q0803J70085K6889n5379j3083L8790
15094D5453k6039m0263O5656j7673l0962P7715L6005J23507K35198j77632j56526
15083A34439j75922J30262j07813p8578j57712j5921J69061J00867j05679R8461
15073h535O5855k20414j1152M9494J3979J24965J73100j6116l3989j56497J515
15062a7795J94204R8774j9984j5957j92756k28835j999L296m5135J72822o1201
15051a14566o3874L118M1022J33124J11462O4071J1388l6036r925R8765j3455
$$ y = [7700, -73042, -67920, -267010, -249109, 50366, 262201, 25234, -165668, -246485, -293761, -140402, 106256, -21679, -217429, -310060, -246825, -162635, -126419, -100904, -158946, -182056, -117521, 8118, -107293, -168500, -119586, -202652, -121849, 48236, 75125, 19746, 6663, 45453, 19414, -20849, 44807, 27134, -3828, 73887, 109892, 233399, 468597, 290965, 134439, -41483, 88779, -19034, -97612, -255324, -271245, -102184, -1317, -106996, -8535, 57320, -163094, -174246, -124752, -110773, 14192, 187292, 171176, 137187, -19310, -17795, 176409, 275183, 255199, 239242, 46486, -182349, -184348, -181052, -226187, -53365, -114566, -178440, -175322, -134300, -1176, 110286, 174357, 185745, 149709, 139784, 238549, 225094]
15040B25094p8897R2415r0752j07758p5990K2498J38866o9220j04326l4776L8356
15029d4490J6793N3158m3455J75033J87661j29030j16220k38820k50214L6514
15019c53070K8423J50620R0825J19619K7604J3529n9610N1878o5500j20253N0123
15008f5812N2912l468m0230J96J3970M1130M2950K1854O6845O5760j1320j57869
14996B6918k57430m064N4653N6169m0917L0890Q4522J3367L892R5301J72198q8086
14984A47413j15064q8809J8474Q8750j67820j8364R2970o229P4726m4606n6195
14973g4754O5047n9484Q7816R7061k498r0681J04912m6904J3061N5456j210K264
14961A50086j7162k26322j85097q7327Q3760J34581n5037P0206N3459J17537N8358
$$ y = [225094, 146197, 238612, 147860, 40102, -35888, -13390, 125476, 56256, -48070, -82846, -44490, -27697, 25461, -17994, 157039, 344700, 215670, 99450, -139370, -389584, -353070, -324647, -174027, -83202, 36417, 64021, 77550, 17940, 69818, 4318, -115935, -65812, -12900, -16368, -56598, -56402, -42432, -1302, 41648, 63502, 130347, 196107, 184787, 26918, -230512, -234576, -179923, -123754, -164671, -133781, -49259, -35892, -32000, 63301, 235499, 147413, 32349, -56460, -37986, 50764, -117056, -135420, -42450, -48679, 26047, -18559, -74754, -9707, -69191, 18625, 115686, 113188, 22507, 127419, 80515, 93576, 149032, 147822, 150086, 132924, -93398, -278495, -365822, -282062, -147481, -202518, -132312, -78853, 38684, 97042]
14950I7042N6602j00865L2493R3000L5968p4597l5095Q6131j19043J06590J5482
14939A93708j80975j28333o3556o1365R0196R6579R0292j51120k09339J81813
14929a42100K47717p1406j57774N413Q9516m866j33962K6094J2050p7386k0191
14918b26895Q8218J34291p601J11729J28433o1229J2596j47146j94581P2112R1133
14907A060M4946R899k9253j4485p3546P5082j9172m4664k9211j4055O0002M909
14895b8488o4971n1992j84613P548O7649j8573P5188Q9078J36503j11630M1798
14884d2503J20264j15009l3773P2953J03803j02903k9164M7485j34413k788k9679
14873a45727K2011K7495m67j26953R5644J1913j38646N9208J05374Q4007k09519
$$ y = [97042, 153644, 52779, 85272, 178272, 214240, 139643, 104548, 190679, 71636, 178226, 193708, 12733, -115600, -179156, -240521, -150325, -53746, 36546, -114574, -323913, -142100, 105617, 34211, -123563, -118150, -28634, -33500, -167462, -141368, -129318, -206704, -226895, -138677, -4386, -11987, 99742, 228175, 166946, 179542, 32396, -162185, -90073, 1060, 46006, 55905, 26652, 12167, -61379, 13703, -5469, -50133, -79344, -93399, -33397, -28488, -93459, -145451, -330064, -322516, -254867, -273440, -198252, -109174, 27329, -84301, -42503, 77761, -37248, -71021, 1932, 105735, 2832, -26332, 21153, -113260, -116048, -145727, -123716, -96221, -96688, -223641, -127997, -116084, -254730, -195522, -90148, -6141, -215660]
14862b15660j7758J42987k4363J27425k2513p5688j27064J50147K39599j24265
14852E2847j15649P1591q4215R4602J09817J47097p1020j42137j55014J88031
14842I5950J96586K2079N3908k05999j72951l7823K4381O496R8801j26234r9682
14831a44488J51485O6881L4138q6500p1243J47621M8878j5265m0098Q4797J16505
14820B92711m7210j83847m7249l0890k4329n4842N6353j9816N9381K5360L8822
14809F4444j40228J4107J31815Q3412J79412R932m0911j87106j08034j78019p5490
14798b46666J60928L4362k8922l5862J95378J6265o4175j87049P3255J93910j0752
14787A00672m6389K8647j61635L0527J18849J01587j68519m9220k3621j9284Q529
$$ y = [-215660, -233418, -90431, -114794, 12631, -9882, -85570, -212634, -62487, 177112, 52847, -62802, 8789, -75426, 19176, 128993, 276090, 205070, 62933, -92081, 95950, 292536, 314615, 368523, 162524, -10427, -48250, -23869, -17373, 81428, -44806, -144488, 6997, 73878, 108016, 21516, -49727, 97894, 146772, 131507, 91409, 176206, 292711, 245501, 61654, 14405, -16485, -40814, -95656, -39303, -59119, 262, 25622, 64444, -75784, -61677, 70138, 153550, 332962, 342894, 301983, 114877, 6843, -171176, -246666, -85738, -51376, -80298, -116160, 79218, 95483, 31308, -155741, -82486, 111424, 100672, 54283, 82930, -78705, -48178, 70671, 172258, 3739, -45481, -69102, -88386, -79857]
14776g9857O9709k506R7681j01147n8996L5408J7044j41886j1749j66744K0904
14765c22139K58322J31098p1714j15581m630J44628M1560O4718J8372q3204k6947
14754C4483m9273q6149j5486j027R318K1431k3172r58P6172J98494J16148p348
14742B72633j5962j03325O3077j75809j37966P7555p7954n0263o3995P0434Q9954
14731e1621R838J5194J21497J58813l6112j03279L0209M8482o0998q3109j65339
14720a16425q4370R578J26583J28625J23575p9214j65955M0012N4510Q3055o049
14709A13925p4137K5199j32575j36055J25405K09914q5605q0111j03108P1317
14699f5831q2241P6020O9683O7305q2279m6308P1759n0869j56277o0696J92848
$$ y = [-79857, -10148, -12654, 85027, -16120, -75116, -39708, -22664, -164550, -176299, -343043, -322139, -63817, 67281, -4433, -120014, -124644, 19984, 61544, 126262, 144634, 61430, 34483, -14790, -100939, -116425, -117452, -108134, -86703, -109875, -110833, -34661, 163833, 279981, 272633, 256671, 153346, 216423, 40614, -97352, -19797, -97751, -148014, -212009, -141575, -51621, -41783, -26589, 94908, 253721, 217609, 114330, 144539, 193021, 132023, 48914, -116425, -200795, -191217, -64634, 63991, 187566, 108352, -57603, -17591, 36919, 119974, 113925, 39788, 64987, -67588, -203643, -78238, 131676, 46071, -34040, -137148, -65831, -148072, -72052, -2369, 64936, -17343, -63651, 8108, -42761, -199038, -259734, -66886]
14688f6886J14886M1593L0185j31014j15850l4976J20560K9430J06712L5625m4887
14677H5378k09712k7908Q9192q4478j049R1275J12643N8572M8877n977R4941J39671
14665C91425j9792j81930r1668j08006n782O9924J16150J39906n1713j18271j09754
14654C0489N2985l3806q3239j83026K2738J10505J25180J4720J9768R7027j83204
14643i863J0797J64258r7090j06635m326J69326J12101j08718j23555k05066q8204
14632b86975K4593J56425J02785P6773j04601P3226J69164R5347q7097k09694
14622I946j26266q719J3929L1739p1672m6700M4201N4505M860Q3839l4038o8361
14610a12737m1892Q140J66133O5445M8786R5777m5635K798J7228l1992l3037o2498
$$ y = [-66886, 48000, 89593, 119778, -11236, -127086, -162062, -41502, -12072, 94640, 130265, 85378, -124334, -152242, -63050, -147528, -148577, -57302, 55341, 113913, 162790, 156813, 251754, 391425, 371633, 189703, 98035, -9971, -15753, 54171, 170321, 310227, 258514, 140243, 30489, 83474, 49668, -33571, -216597, -193859, -83354, 41826, 56546, 76314, 173341, -9863, 934, 165192, 68102, -38533, -42859, 126467, 238568, 129850, 6295, -198771, -286975, -262382, -105957, -3172, 73601, -31000, 42226, 211390, 306737, 219640, 9946, -116320, -125039, -111110, -79371, -151043, -197743, -153542, -99037, -94177, -10338, -44376, -112737, -154629, -146489, 19644, 85089, 133875, 229652, 184017, 186815, 204043, 172051, 139014, 76516]
14598G6516L5620K6916n6615j32442j21928J4583p222L8791q3275k10139L2890
14587c86305R3195o4582m3629j21181N0831J52309K37218L2825o2023J7448P152
14576h6742l434J62739N6751j10519J5693J28635l8409j4742J77528L1120j47286
14565A71334q1264J03961J37295j84678k04414j32484M6824l9802J02696J75499
14555I4967O866k09893N7663R2067p1191N5435J03720R7259l6417l49040p0230
14544b28794J67493J7724m6449K27517n7924j02420J19395L7555j67906j04491
14534a38300K4874J17710J35416j67526j12190p8239J41304Q7323R3049p5926
14524B7495j12660J64768l7219j25463J40707l1052M0126Q212K166o7537p9344
$$ y = [76516, 112136, 139052, 82437, -50005, -171933, -157350, -164572, -125781, -209056, -419195, -386305, -293110, -357692, -401321, -522502, -471671, -319362, -82144, -49319, -111342, -93894, -86742, -90176, 72563, 129314, 18795, 34488, 163123, 124714, 109972, 287500, 318620, 171334, 90070, 194031, 331326, 146648, -57766, -190250, -143426, -183228, -80532, 94967, 101833, -108060, -50397, 41670, -29521, 25914, 129634, 226893, 190476, -158564, -228794, -61301, -43577, -90026, 137491, 79567, -22853, 96542, 134097, -33809, -138300, -113426, 4284, 139700, -27826, -140016, -218255, -76951, 10372, 103421, 27495, -85165, 79603, 42384, -83079, 57628, 26576, 66702, 74914, 77080, 9543, -69801]
14513f9801J44756K6227o5317l5153n951L212j0427J87205R7563o7277R8336P4966
14501C78339p8423j12333J32135R0892K4586J36688J12858L9375q4840L2267k9747
14490F41797o6443j85625n2900k2418k5026k09860q0180J30004O5299l0356N6981
14479B21273L7585J11738j48859K2456J37058k9069k6548R102q4346m6533R0576
14468B94433n9404j23985j6660j14374q4614l742J12784n2799q4815m9476Q8234
14457i4418J77719J29657R0246L3910j05935j38947o4626o2692j65280P7215J5232
14446a07919L2886J3605M6223P9470J15795k7025j08805O79l5875Q3159J39139
14435B31332j23300j92023P0090J44878q0548j07403j21805r6517J40949K85376
$$ y = [-69801, 74955, 101182, 35865, 712, -5239, -2027, -12454, 174751, 272314, 205037, 303373, 378339, 299916, 187583, 319718, 410610, 435196, 571884, 684742, 724117, 639277, 671544, 641797, 575354, 389729, 336829, 314411, 289385, 79525, -655, 129349, 194648, 164292, 221273, 258858, 370596, 221737, 244193, 381251, 352182, 325634, 334736, 250390, 203857, 294433, 235029, 111044, 94384, -19990, -104604, -108346, 4438, -48361, -133176, -182652, -94418, 83301, 212958, 303204, 337114, 231179, 92232, 27606, -35086, -200366, -123151, -107919, -75033, -61428, -15205, 64265, 180060, 153035, 44230, 44909, 9034, 92193, 231332, 108032, -83991, -13901, 130977, 50429, -56974, -178779, -275296, -134347, 151029]
14425A51029O3246J2403o1747j32441o822q7354Q6106j2066j8331P0978L4604
14414I9605j38416q6446j51216l4707J10147P9544K0718N9146r347j4031r7337
14403a62340k5828l5139M5977J60393J89570J54026K8246j14353j18607j33915
14393a1970q8252N5647J26087K3211l6275J7832j16226K4657q2585j4672n9093
14382a61639j1635J88783J75561N437J7657j65835r1957k85l1011M0356J85372
14371A50804j0282p0840r1212k83409j08327J64868P3538p4180J55268J64371
14361G0599N5444O2327j43667m6983N3675R4146K5574L5349j65760K3416j332
14350F2788o5857n3060m0498j35577p7817K03286l8358m7213J16603R9003L7030
$$ y = [151029, 214275, 226678, 164931, 32490, 25668, -61686, 24420, 12354, -5977, 65001, 99605, -38811, -125257, -276473, -311180, -201033, -121489, -100771, -41625, -50972, -65003, -162340, -188168, -223307, -177330, -16937, 172633, 326659, 354905, 240552, 121945, -11970, -100222, -44575, 81512, 104723, 68448, 86280, -29946, -5289, -87874, -102546, -161639, -173274, 15509, 191070, 196507, 214164, 48329, -43628, -43913, -74924, -34568, 150804, 140522, 69682, -21530, -304939, -413266, -248398, -174860, -249040, -93772, 70599, 126043, 188370, 44703, -2280, 51395, 145541, 171115, 206464, 40704, 64120, 62788, -3069, -56129, -96627, -232204, -310021, -106735, -145093, -192306, -75703, 23300, 60330]
14339F0330R131p2828j7904P3200r158j3379j02843J47083K0602n6694l8557m9957
14327e0974O7811q863L5713j52220O728o9414M1656O2385J35083N358j38518o8061
14315a33316L6262L8739k8065j2658J09117k0107P2023r165n5240q7619r5599
14304a85628N6327M2940j16341j794J31612R7749k8527j07836J50512j3324N0587
14293G6277O5568O3500J9180O0516j4917j05366j58326p282o3044p1769M6561
14282h9102o1097j23619R1233R1101k38402n9936J73298J72567O1095p989j58750
14271a49601l0504L0965p4642P0193o674J11127o3461K8119O8026K9926o636R8181
14259A05019M6161J1275M6036o1225j13754j15743P0440O0456p887j6479M3084
$$ y = [60330, 69461, -3367, -21271, 51929, 42771, 29392, -73451, 73632, 94234, 37540, -1017, -50974, 16837, 7974, 43687, -108533, -101805, -171219, -129563, -67178, 67905, 73263, -65255, -133316, -97054, -58315, -86380, -99038, 10079, -10028, 61995, 52830, -2410, -90029, -185628, -129301, -86361, -202702, -204496, -72884, 24865, -3662, -111498, 39014, 25690, 76277, 141845, 205345, 224525, 285041, 270124, 164758, 6432, -850, -63894, -135663, -89102, -150199, -273818, -182585, -91484, -329886, -389822, -216524, -43957, 17138, 9149, -149601, -180105, -149140, -223782, -153589, -160263, -49136, -112597, -84478, -16452, 13474, 6838, 105019, 151180, 162455, 208491, 147266, 33512, -82231, -11791, 48665, 40778, 24299, 67383]
14248F7383m3059M1314J49996q0080j51428j80884O7949L9390R2315L9468j14992
14237g2628m4430J7706q2683K5947P7596n9677j11820J633p3475P9755m629J7319
14225b29386N6740J28J02611O8744J89454J3486l5535n3473r7824J5466n8558
14214b8147j14020o1714j19526m8010J68795K24298K34335Q9541j21730J046j3290
14203B11578j49616j11045L3142L496K3711k3488O8457O7485q3914n5746J6896
14192I56L719o9798n5047k5981J5043m7938K1123M6579J6784K8943L9969l4963
14180f0611O9563J77274L0151j11534r3492k00N7693L7702j92134M1533J01887
14169E7832o1414J7745P8759L160p6312j38768r3989r1129N6772J9790J32591
$$ y = [67383, 24324, 65638, 215634, 135554, -15874, -196758, -128809, -89419, 2896, 42364, -72628, -117058, -99352, -182035, -156088, -78492, -138169, -249989, -248356, -321831, -242076, -246705, -229386, -172646, -172518, -69907, -1163, 188291, 201777, 166242, 112769, 14945, 30411, -28147, -142167, -203881, -323407, -371417, -202622, 21676, 256011, 345552, 223822, 224868, 211578, 61962, -49083, -15941, -12445, 11266, -12222, 56235, 123720, 39806, -15940, 956, 4675, -65123, -120170, -146151, -131108, -179046, -157923, -111344, -94560, -65617, -25648, -60611, 8952, 186226, 216377, 104843, 11351, 11151, 68844, 106546, -85588, -44055, 57832, -3582, 14163, 92922, 96082, 19770, -118998, -212987, -304116, -247344, -227554, -94963]
14158i4963J23067K1213P4684m1168j8543R2851n4393n8061J49325L5157k50203
14147b1034k41671j6818K61239J26664j16678o3958n9098r3029Q957R3956K7807
14136i3663M3533K1856Q8550R8883N0405J8153n5205j2633p0146J14801J83797
14125C88331J3704j34599j37951j35495p4555O0494K57831J68309j6351j50674
14115B39044j71203j91631j4655P904J59708J48177j27930P3359N4234n1358R130
14104A34779k37660j83295J70999R1512n3842P5252Q5932O8508J33000l3396Q7886
14093C39675N2095K470l2779L7344P0316q7330N6121k3977j38448j95316m7744
14082C2427j66266j72070l824J49794K80499J29696l8512j08223r0592m1652l5951
$$ y = [-94963, 28104, 49317, 124001, 82833, 64290, 157141, 102748, 44687, 194012, 229169, -21034, -262705, -279523, -18284, 108380, -8298, -72256, -131354, -224383, -215426, -121470, -93663, -50130, -28274, 60276, 159159, 209564, 227717, 172512, 159879, 89733, 204534, 388331, 402035, 267436, 129485, -6010, -80565, -20071, 237760, 406069, 389718, 239044, 67841, -123790, -138445, -130541, 29167, 177344, 49414, 122773, 177007, 125649, 134779, -102881, -286176, -115177, -23665, -77507, -2255, 83677, 152185, 285185, 251789, 339675, 391770, 394240, 361461, 398805, 469121, 381791, 437912, 413935, 275487, 80171, 32427, -133839, -305909, -309733, -159939, 120560, 250256, 211744, 103521, 12929, -28723, -64674]
14071f4674J0920P3735r4811O7224J6044q916j05008o9011o0558O373j11473n6501
14059c96656P5463P6989j48238J41378J61312J85J0502K03506M2976J02934q4737
14048A85614j95267j33866J16521Q4895q1701l6282M5761J2314j29741O55O921
14037a24176O6531Q5260p0047K8764J31638O8517M1370m7384n3589j32754n4759
14026f0629Q1871J8920p2705j19807j23630L4125J03745K5234l8366O8477J78774
14015I6009K12913j52397j94837J898n7867P8982K6142K27168l5715k3245j27
14004A78924m1174j38015O8663J14580J50010L1106M0667l42218k01903J15870
13994b3490Q8481k4946o8925L41J34569M0126m4237q9791n1201J9728J57488l5417
$$ y = [-64674, -53754, 19981, -74830, -7606, 8438, -478, -105486, -174497, -235055, -228682, -340155, -396656, -321193, -244204, -392442, -251064, -89752, -89567, -79065, 124441, 167417, 270351, 185614, -9653, -143519, -26998, 57897, -23804, -60086, -14325, -2011, -131752, -131097, -124176, -57645, 27615, -42432, -13668, 117970, 186487, 227857, 180473, 126884, -5870, -60629, 21242, 40162, -32543, -152350, -275980, -241855, -138110, -112876, -151242, -82765, 96009, 308922, 156525, -38312, -36414, -94281, -15299, 10843, 238011, 202296, 179051, 178924, 137750, -265, 68398, 182978, 332988, 364094, 404761, 62543, -139360, -23490, 64991, 40045, -28880, -28539, 106030, 146156, 101919, 12128, -39073, -19345, 138143, 102726]
13982A02726k14570j26766J953n8074J06042K60692l0371Q057L8487j24168j28413
13971a64405J39585J32672o6071J06050q420j17766j16517M5519Q0949J19103
13961A50699J1570j20692k965J00936J14705K5486j09437j77991j8673R486J8821
13950A945P4959N0303J7363j31503L2608J09332n6880P5990p1231j65724r6811
13939a59649p124P9949o6936j69735O6187K7108P4376J38087P9754Q2175P0383
13928B14575L3107O6372k1565o6690q2269J7831K733K8046P0623O1276j24154
13917A99885j12757r7719j43986J7083m7285P2982J1795J22500M2841N272J1460
13906H2071J06345O1903j44338k06800j62753J77510J81655L7538j74837l8306
$$ y = [102726, -111844, -238610, -236657, -294731, -188689, 72003, 41632, 49689, 88176, -35992, -164405, -24820, 107852, 41781, 147831, 139411, 21645, -94872, -49353, 31596, 150699, 162269, 41577, 38612, 139548, 254253, 279739, 170302, -7689, -26362, -16876, 1945, 76904, 127207, 144570, 13067, 45675, 155007, 98127, 174117, 102886, -62838, -159649, -166773, -86824, -153760, -323495, -257308, -230200, -155824, -17737, 62017, 144192, 214575, 247682, 314054, 292489, 225799, 143530, 161361, 164094, 192140, 262763, 324039, 199885, 87128, -10591, -154577, -137494, -184779, -111797, -100002, 22498, 65339, 70611, 82071, 188416, 250319, 105981, -100819, -263572, -86062, 95593, 133131, -41706, -80012]
13896h0012O2806O1881J11458q3483q1926K06523l3041j29691n5241J02595l6320
13885D5549K5173N039j00719j36J62158K3456q3302J949O108J0882j7385J4319
13873I3091j0639k6102M9097Q1749M8635q6342j39375l5875r0328j35368J7414
13862b34043m579j578P1636J07275R1187J34464O2130o1313l40616k43819J31782
13851b87474K02518J13701J039J6090r189o3803r2060R0777J25540M1350m7684
13840I0805p2073n3448J8495K3239r455M3828m6026j59925q7223J25318L8608
13829h7857J75755J18293L0804j05071j72015J07705R4421j17014j66290O4250
13819e7019O8432l2698p7680p4433J4998K0488M4318N0653J26846J24511O9917
$$ y = [-80012, -17206, 44675, 156133, 72650, -9276, 197247, 164206, 34515, -20726, 81869, 45549, 70722, 75761, -24958, -25094, 137064, 160520, 77218, 79167, 85275, 96157, 78772, 93091, 82452, 56350, 105447, 187196, 235831, 149489, 10114, -25761, -116089, -251457, -234043, -238622, -240200, -168564, -61289, 29898, 164362, 226492, 165179, -175437, -419256, -287474, -84956, 28745, 29784, 45874, 36685, -27118, -119178, -28401, 97139, 138489, 90805, 18732, -34716, -16221, 7018, -2437, 41391, -4635, -164560, -251783, -126465, -87857, 87898, 206191, 236995, 131924, -40091, 67614, 162035, 45021, -121269, -57019, 11413, -21285, -98965, -173398, -158400, -137912, -93594, -42941, 83905, 208416, 278333]
13808B78333m7212j25052k36307k6746P2805N6035Q3251p9575p9868J25691J16837
13797A38192j17883J6937p621N821l5331L8757j8774R8680N6195K3002k0195N047
13785A82827K846M2083P0169l0083q7842n9881N4690R270q1334o6152j89633j31044
13773b84084Q3892J53952J08718j04208l4950R4024M6839n3753j95213l857K19846
13762C1206J55597O2558q9478j6617J65350P6074k21006j58539N8828J45644N5588
13751B65205q2696N0122J30375j45508j62834p411q0868j54381m0797Q0946R3656
13740e4191O8218o3334J29926J98523m7769j75972k58609p0024N3107O1452j32498
13729b91171j96155R1605J66661J31749K55786O7350n2695o2006n3654j9225o4238
$$ y = [278333, 231121, 106069, -130238, -156984, -84179, -28144, 55107, -24468, -104336, 21355, 138192, 20309, 37246, 29625, 35446, 115, 38872, 20098, 118778, 174973, 197975, 177780, 182827, 185673, 227756, 297925, 267842, 180000, 120119, 174809, 184079, 102745, 36593, -153040, -284084, -200192, -46240, 62478, -41730, -76680, 17344, 64183, 10430, -184783, -188640, 31206, 186803, 249361, 159883, 143266, 308616, 384690, 163684, 5145, 63973, 209617, 265205, 182509, 232631, 363006, 217498, 54664, 47253, -33615, -187996, -228793, -147847, -54191, 14027, -49307, 80619, 279142, 231373, 55401, -203208, -273232, -220125, -158673, -291171, -487326, -395721, -229060, -97311, 158475, 225825, 173130, 111124, 57470, 38245, -25993]
13718b5993o7006Q4250q1N9887P6059n7507P0583j2810o7398j9149o7934J23377
13706I6278Q37j46585m2142O5045N8153J88555k8337j11293q8529p2668M4062
13695c6624n2031J01676n11P5073K7779o3655M8106n137m1334L10j85580o4298
13683a96226K502n1552k1800M4564J41695J72833J4719r0829j21965j02258k8692
13672b37009J3985M8245K50666N0509j77460m4703O9979O2935K8138L6837m278
13661I7844p0953q7577R092J73673k5335J20078o5074p6234j20589K2830Q473
13650a3772j8450n8295J14291K00268j44062k11669K38701J11938m3736j61326
13640A3888K8310m4751O9659O0415J55926Q3219j4515q9091L4696q9315j31416
$$ y = [-25993, -92999, -8749, -8830, 51057, 127116, 69609, 140192, 127382, 59984, 40835, -27099, 96278, 97115, -49470, -91612, -26567, 31586, 220141, 191804, 80511, -8018, -80686, -36624, -88655, 13021, 12510, 87583, 115362, 51707, 99813, 94676, 53342, 53652, -131928, -196226, -193724, -245276, -267076, -222512, -80817, 92016, 106735, 15906, -106059, -208317, -237009, -223024, -174779, 75887, 126396, -51064, -95767, -25788, 37147, 65285, 102122, 97844, 26891, -60686, -51594, 122079, 96744, 216822, 151748, 75514, -45075, -22245, -13772, -32222, -90517, 23774, 224042, 79980, -131689, 107012, 218950, 175214, 13888, 42198, -2553, 67106, 127521, 283447, 366666, 352151, 263060, 297756, 208441, 77025]
13629G7025K9156Q625q974k4083M4160n9538q6720J28885r257p282K5722j50554
13617c2835K9894n1012j28530J8847K57358J71673M0631n1646J344k2631k8180
13606B04913p355k035q4599j53536k04394J62804J41837L4301N5671K56913M6107
13595D50627j39862j22345j66681k33539j76775J17070J34564J19632m2855m587
13585f4751Q3444K420j10406N8899M4946J11869p2850j96519P2027L1853r5684
13574a34752k2933J92490O9954J00132o9082r2191j32481k26885J62218L3764
13564a19766J4080M1948K6094l2811N9909J12765j33091r4265P6234j5110p8551
13553a42564J13783P4489j10361k2175J7659L0831j3073J67352j8672M9232N3657
$$ y = [77025, 106181, 114806, 105832, 81749, 125909, 66371, -20349, 108536, 99279, 91997, 117719, -32835, -2941, -53953, -182483, -163636, 93722, 265395, 306026, 254380, 255724, 233093, 204913, 197558, 195523, 110924, -42612, -247006, -84202, 57635, 91936, 147607, 404520, 450627, 310765, 188420, 21739, -211800, -388575, -271505, -136941, -17309, -60164, -64751, 18693, 21113, -89293, -30394, 14552, 126421, 53571, -142948, -70921, -39068, -134752, -157685, 34805, 104759, 204891, 135809, 43618, -88863, -315748, -153530, -119766, -105686, -63738, -37644, -70455, -10546, 102219, -30872, -125137, -48903, -64013, -142564, -28781, 45708, -64653, -86828, -69169, -38338, -51411, 115941, 97269, 146501, 200158]
13542B00158k5577P471p6514q9494J12556R2077M3453K8581j31736j37329P5142
13531I8788K1116m9489r3304K2659j71741O7588J5694R1836L1881l2451p506p7515
13519h2444q5014r645k9451M0726O7965J10438K3690L3132N2058j1129p4340o2843
13507b6857m5725o1349M2963Q1091r3211J07460M0984O3461r2322J927j05825
13496h7403P2985N9661K9651j50609J6525J03921P1257K18362K3195k6248J9742
13485C51039R6629j5010M84J03070J32868M857p0704k5375J12175k10683j39903
13474C39447n932P1626o3383j26231k9106l2018J47472O6919q2368j75199j16791
13463e564R3214N4038q9101K041p0924L7160j03800N2696J63094j35163k17383
$$ y = [200158, 174581, 182052, 105538, 16044, 128600, 220677, 264130, 292711, 160975, 23646, 98788, 119904, 70415, -22889, -230, -171971, -104383, -88689, 3147, 35028, 2577, -4929, -82444, -167458, -177103, -206554, -165828, -97863, 12575, 36265, 69397, 121455, 110326, 35986, -26857, -72582, -133931, -90968, -9877, -103088, 4372, 45356, 108817, 16495, 18422, -87403, -14418, 45243, 74894, -75715, -59190, 44731, 115988, 334350, 357545, 331297, 351039, 447668, 432658, 433142, 536212, 669080, 673937, 603233, 577858, 690033, 479350, 339447, 333515, 405141, 341758, 215527, 186421, 154403, 301875, 368794, 286426, 111227, -5564, 87650, 141688, 52587, 54628, -16296, 20864, -82936, -30240, 132854, -2309, -219692]
13452b19692M7257O4940M4687K9931O0593K14412N9271j29873p4319O3033L0464
13441A90704l2413j83495j06413l1164O0820Q7166K592N5701J5231r5016K02207
13430A65920J29756P9298o29j52132L7155j02179l4934L7062p4286M2559J26882
13419B54472j59736J4021J32491N9246k16363j13370r511J79819R8556j87024
13409E2601l7286r415M2892k14861K5934J80175k2148l5843M1331J2100p3344
13398c7864O9870n6574M1052N4537q4705j04739l001o315j04763j17006J09798
13387b39710O3759p187L7840l6501Q2933J09542J40410Q5843k8477j88477j50962
13376a30987L2360M0289L0265J92813r2875j42950M317n8090j04060O6207J28586
$$ y = [-219692, -172435, -107495, -62808, -32877, 27716, 242128, 301399, 171526, 97207, 160240, 190704, 158291, -25204, -131617, -162781, -101961, -14795, -12203, 43498, 58729, -36287, 165920, 295676, 374974, 374345, 222213, 259368, 157189, 122255, 159317, 85031, 127590, 254472, 94736, 108757, 241248, 300494, 84131, -29239, -38750, 141069, 239625, 52601, 15315, 5900, 48792, -166069, -140135, 40040, 17892, -17951, 23380, 35480, -37864, 32006, -24568, 16484, 71021, -13684, -118423, -121424, -127739, -232502, -349508, -239710, -175951, -183138, -145298, -181799, -98866, 10676, 151086, 236929, 208452, 19975, -130987, -98627, -58338, -28073, 164740, 71865, -71085, -66768, -124858, -228918, -162711, -34125]
13365c4125L2669O5953N3518k19389j56658O2344K70450L5186l0538k2030M3429
13354A00809J2245M6536l6417r5914Q6378Q3168k34939j02168J9197N3197m3195
13343a11103Q7089p3417K4223J27760N2262K5273j73165k05515k11185j17389
13333e75167M1673J37658K17610K51134j06294m4946R4339o2272k5838Q7024R3907
13322A08828N5979k9009j59968j9782O5916k2297J13568R3032m7333j51116j10467
13311a02649j4194l3762p3096l6357J77989P0771k2159j9824l4976N8595P2183
13300D2521R7373N2746P7099j5861L5533n5553j39135J4214j49728k9848M8874
13289b1765q8112n1377J43391R2492M718J39574P6440p3519j85341J12911J51798
$$ y = [-34125, -1456, 64497, 118015, -101374, -258032, -195688, 74762, 109948, 79410, 57380, 100809, 113054, 159590, 123173, 27259, 113637, 196805, -38134, -140302, -121105, -67908, -111103, -24014, -97431, -73208, 54552, 106814, 132087, -41078, -246593, -457778, -575167, -533494, -395836, -178226, 72908, -33386, -78332, 16007, -46265, -72103, 14921, 108828, 164807, 135798, -24170, -43952, 21964, -333, 113235, 206267, 158934, 7818, -102649, -116843, -150605, -223701, -260058, -82069, -11298, -33457, -53281, -88257, -29662, 42521, 139894, 192640, 269739, 253878, 289411, 233858, 94723, 108937, -40791, -70639, -21765, -109877, -161254, -17863, 74629, 79347, 218921, 295361, 221842, 36501, 149412, 301210]
13278C01210O7797M984n6437r6612j39208K6796P183p7302j72863K2413p032J17004
13266b067R2862L9599Q5881l0121k7776j68528L7857k9626o4702O1326R0320O6882
13254A51907L1973j0222j2973r5162k9075L0320J3670J16912j31444l2924r2920
13243e9938j72929K04151R3449K8412O3105J18625j8508J2396j15768O294j21823
13232C7466P5377K6622n4516n626m3931K895P9125Q1043M7879o1012J23854n4945
13220B54231J0917J25195J3609j13175j42852k56956j32535J05378J1116N0771
13210g4301J93025j0476O3557J14281J7555q6551o8248J8717J84567J6173j50167
13199B18132o927o5675P8008P5067j14607n4235l0749K48298J06858j76257J27639
$$ y = [301210, 369007, 373991, 317554, 220942, 81734, 108530, 115713, 38411, -134452, -112039, -119071, -2067, 90795, 130394, 216275, 186154, 158378, -10150, 27707, -1919, -66621, -5295, 85025, 151907, 183880, 173658, 160685, 65523, 36448, 66768, 80438, 197350, 65906, 32982, -59938, -232867, -28716, 64733, 93145, 156250, 274875, 256367, 268763, 152995, 159289, 37466, 112843, 139465, 84949, 79323, 35392, 38287, 117412, 198455, 246334, 185322, 309176, 254231, 265148, 390343, 403952, 290777, 147925, -109031, -241566, -136188, -125072, -74301, 118724, 108248, 171805, 286086, 303641, 217090, 148842, 167559, 352126, 368299, 218132, 211205, 145530, 223538, 298605, 183998, 129763, 99014, 347312, 454170, 277913, 405552]
13188D05552J79432Q9778j11319m5330K1014O6600O3036J19770m0505J8484L18400
13177A084912J66509K03719J47567J19800J82551Q857J2186k733J5466K3357J7014
13166A979205j03474k31842j13139j50899o5551m906k12683q6053J8825n5371
13156I74112j36704k01735P2628m8140J2986j4368j23214r2970n4357l0749o4749
13145B92740j66267N7520K30369j3709p6225J6904L9779J33895n0065j75850o0334
13134B28757L6871K0082J53092j53599q0553P657j02634j2015k8365p1094K5445
13123B3644N0205L7377k432L6780K120J16540j89620q5823J81853J60681j22227
13112B09098M0405J80586m1946j56698j22793j2963Q9991n0074j9323K22677j45002
$$ y = [405552, 584984, 674762, 563443, 518113, 539127, 605727, 668763, 788533, 748028, 766512, 1084912, 1251421, 1455140, 1602707, 1722507, 1905058, 1913915, 1926101, 1923368, 1938834, 1962191, 1979205, 1875731, 1643889, 1530750, 1379851, 1314300, 1309394, 1096711, 1010658, 1029483, 974112, 837408, 635673, 708301, 660161, 673147, 658779, 535565, 442595, 388238, 357489, 292740, 126473, 183993, 414362, 400653, 324428, 341332, 381111, 515006, 464941, 289091, 228757, 265628, 285710, 438802, 285203, 204650, 212307, 109673, 97658, 69293, -1801, 23644, 73849, 111226, 108794, 145574, 147694, 264234, 74614, -11209, 170644, 331325, 209098, 249503, 430089, 388143, 231445, 108652, 95689, 185680, 135606, 116283, 338960, 193958]
13101A93958j75889l6402m8089N0239N7841R1941r5209J77090J19835j06869k04610
13090B3836L6243L7359M2245l7498j25988K5696Q0603J6199R6626J52757J15286
13079D63364P6094p0338k36381K0855l5207j22312O3859L9171O8381j60925j15637
13068i076K9769J81583M0732l1581J7988l3103j47206k17880j26796J13664K14584
13057C2678J08883R5070J0030m5554j831R339N5532j26321k522O6325R6346j1418
13045B86557R6196k2908k43228o1491L4325o440P0752P8076J02811K9518j97886
13034A66282m7658N2854J45528P9786R3104j3483j17662L1779M2895j61520M4506
13023C16411m9771k6303o081J6517q7059n0981K58721J78386l7461K08889P8412
$$ y = [193958, 18069, -18333, -66422, -16183, 41658, 133599, 38390, 215480, 335315, 228446, 23836, 60079, 97438, 139683, 102185, -23803, 1893, 82496, 98695, 195321, 348078, 463364, 539458, 469120, 232739, 253594, 218387, 96075, 159934, 199105, 267486, 106561, -9076, 20693, 202276, 243008, 211427, 229415, 196312, 49106, -168774, -295570, -181906, 32678, 141561, 236631, 246661, 201107, 199276, 208615, 264147, 137826, 135304, 201629, 297975, 286557, 382753, 359845, 116617, 55126, 89451, 83011, 153763, 231839, 334650, 364168, 166282, 118624, 171478, 317006, 396792, 489896, 476413, 358751, 390530, 433425, 271905, 316411, 266640, 240337, 234256, 250773, 163714, 112733, 371454, 549840, 512379, 721268, 799680]
13012G99680K223j89812o1402r7419O1798N4818k2475j5283p604j34786p7424
13001C12314m4662j26294J79467J24032J75222Q623j75613q049J55595J8070j68452
12990D50253o3992K0965M3962j05220O9277j80879j22679j11390j17007n3755
12980a70465k3958L8176l9306J16185L49916J22988m2135r1393J3938j02840q8367
12969H2739Q3167J14962K8859j9223M3636K3006J12735J43004o701k00004j84623
12958B21557R4256L5558M748J05224j07368j08331J52653n6414k03440J4375K46422
12947C99240K5969n8505n3672j00894j25658M3639J26808j4573r1109l5143Q1508
12936A97610R0237J12841Q6306M8463l9839k2325Q6726K0403Q5553r50j11537
$$ y = [799680, 801903, 612091, 550689, 453270, 515068, 569886, 547411, 532128, 524524, 389738, 312314, 267652, 141358, 320825, 444857, 620079, 628702, 453089, 445040, 600635, 618705, 450253, 386261, 407226, 451188, 345968, 415245, 234366, 111687, 297, -116710, -170465, -194423, -156247, -195553, -79368, 270548, 393536, 351401, 260008, 273946, 171106, 82739, 165906, 280868, 309727, 290504, 334140, 357146, 469881, 612885, 606184, 406180, 221557, 315813, 351371, 356119, 461343, 353975, 245644, 398297, 341883, 138443, 152818, 399240, 425209, 366704, 313032, 212138, 86480, 130119, 256927, 242354, 151245, 116102, 197610, 287847, 400688, 486994, 535457, 495618, 473293, 560019, 580422, 665975, 665025, 553488]
12925E53488n6268l9986j5449m7306m1741L6299n1766J55740O5916P3854J35611
12914G68392j09062j04062J06785N2133j31883j50451N1317N5021J16463J38864
12904G93517p1018l0165j2340j89610O1163J94066K39779k8800j12886j4622l7841
12893G91243p1502m6457m0985J8022M4759q3618p5758p9464k23594p7352P7336
12882B32630N034J2028p7152N480J02239J70681l8565r8327j3914M3773J43309
12871D87216o4195J51484P5040J36518J26948J2909J63230L5756J924r5453L5429
12860A066806J08236o239J4472J19742p3315l5716J47126J79775J88283J27569
12850A836739j20403k6620j7451O9564J50080L9463J52940K27248O0822j44649
$$ y = [553488, 497220, 457234, 441785, 394479, 352738, 389037, 337271, 493011, 558927, 632781, 768392, 659330, 555268, 662053, 714186, 582303, 431852, 483169, 538190, 654653, 793517, 722499, 692334, 679994, 490384, 551547, 745613, 985392, 956592, 843706, 829084, 791243, 719741, 673284, 632299, 650321, 695080, 611462, 535704, 456240, 232646, 155294, 232630, 237664, 249692, 172540, 178020, 280259, 450940, 412375, 314048, 300134, 343907, 487216, 423021, 574505, 649545, 786063, 913011, 925920, 1089150, 1124906, 1126830, 1031377, 1066806, 1175042, 1168803, 1183275, 1303017, 1229702, 1193986, 1341112, 1520887, 1709170, 1836739, 1716336, 1689716, 1672265, 1741829, 1891909, 1931372, 2084312, 2311560, 2372382, 2227733]
12840B227733J07610N0279J9454M9396r3159J1414K06027k4475J57482J70912
12830B882673K7249j6432J45095l7899j20442m4126K01351K37861K16556Q0593
12820C572479J59870K07441r7222q4361Q2936J62899J87191M29846K90520K9310
12810D940909J17690J33608K49145L91692L5912K5444L89750M65711L68394K73037
12800G391292K99899N03057M28995M32284O63627O56225Q31249J008904J300339
12791A3515871J452339J528585J521757J666791J805192J947540J954951K185058
12783B7578084K391508K774446L215193L495877M399659N357595O397097P966378
12775F3575837J0547488J3521387J7525659K2696849K9446308L7395098M5317213
$$ y = [2227733, 2335343, 2385622, 2405076, 2454472, 2361313, 2372727, 2578754, 2554279, 2711761, 2882673, 2909922, 2893490, 3038585, 3000686, 2880244, 2836118, 3037469, 3275330, 3491886, 3572479, 3732349, 3939790, 3842568, 3758207, 3841143, 4004042, 4191233, 4621079, 4911599, 4940909, 5058599, 5192207, 5441352, 5833044, 5868956, 5894400, 6284150, 6749861, 7118255, 7391292, 7691191, 8194248, 8623243, 9055527, 9719154, 10375379, 11206628, 12215532, 13515871, 14968210, 16496795, 18018552, 19685343, 21490535, 23438075, 25393026, 27578084, 29969592, 32744038, 35959231, 39455108, 43854767, 49212362, 55609459, 63575837, 74123325, 87644712, 105170371, 127867220, 157313528, 194708626, 240025839]
12768B40025839N1479330N2364040M5029613L1545727J7831135Q767960L988173
12761D51031817j810759j3207161k8122633m1273070m7950683m7738950m3054345
12754B27874216l6131374k9122313k3149899j8163590j4206050j1168197q905358
12747H7027435p112680n755862m661695m137902l551045l086879k486942k230659
12739E4003771k295698j921751j782940j590473j635479j590853j274812j084843
12731D0826922j302227j195307j065809j126135j077738j286303j283851j121404
12723C1368148j377938j284553j201265j171774j252751j347128j115473j006967
12715B1610299j050014r35909p51072q06534r84366p86635n98344q24602p26836
$$ y = [240025839, 291505169, 343869209, 388898822, 420444549, 438275684, 447043644, 451031817, 449221058, 436013897, 407891264, 366618194, 318667511, 270928561, 227874216, 191742842, 162620529, 139470630, 121307040, 107100990, 95932793, 87027435, 79914755, 74158893, 69497198, 65359296, 61808251, 58721372, 56234430, 54003771, 51708073, 49786322, 48003382, 46412909, 44777430, 43186577, 41911765, 40826922, 39524695, 38329388, 37263579, 36137444, 35059706, 33773403, 32489552, 31368148, 29990210, 28705657, 27504392, 26332618, 25079867, 23732739, 22617266, 21610299, 20560285, 19624376, 18873304, 18066770, 17082404, 16295769, 15697425, 14872823, 14145987]
12706A4145987o36792p23960p05570o45329n18862l78610m21557m90360n30706
12697I094241l85050j67838l38800l89005k85787k96456l16266k65798l05200
12688F344041k61727l40206k49346k7151j26743j97145k60173l19512j68619j66926
12678D226493j32593J3272P3646k30722k90329j25199k13438l09040j58205l5997
12668B817888q1798j96759Q5287m3151j52370M1348Q3840o5345k32322k30464
12658B026154J30808L980p3250j848K4841K6976p104k5033L9770k4500Q7614Q2290
12646B290698J20102J62702J49159j20563k16528K08204O1612q2973j20534N0805
12636B502684L2284n6764j95357j90639k19993k97072j54002q5335r1431j50425
$$ y = [14145987, 13509195, 12785235, 12079665, 11434336, 10915474, 10536864, 10115307, 9624947, 9094241, 8709191, 8541353, 8202553, 7813548, 7527761, 7231305, 6915039, 6649241, 6344041, 6082314, 5742108, 5492762, 5465611, 5338868, 5141723, 4881550, 4562038, 4393419, 4226493, 4093900, 4107172, 4180818, 3950096, 3659767, 3534568, 3321130, 3012090, 2853885, 2817888, 2736090, 2539331, 2624618, 2581467, 2429097, 2470445, 2554285, 2488940, 2256618, 2026154, 2156962, 2160942, 2087692, 2085844, 2110685, 2137661, 2130557, 2105524, 2145294, 2120794, 2208408, 2290698, 2410800, 2573502, 2722661, 2602098, 2385570, 2593774, 2655386, 2572413, 2451879, 2502684, 2534968, 2478204, 2282847, 2092208, 1872215, 1575143, 1421141, 1335806, 1244375, 1093950]
12626A093950q3332Q7902P7815l2137n9467L8615J04708K6048p9614N8082j13571
12615A118999J46117Q6697o9327m8731j02541L8477Q8526m6318p6696K6286q9276
12604A072213o5577l5276J18657p02p1455J22313O1071o4027k05987Q8872J20766
12593A140868k7577k9482J13470J41754p9432p123L3316j16551J7745j15096j74341
12582H97551o6331J59424J4158q6922R674p3632R1247J02915j95764j06686j0220
12571G35414L4186J82388M3536j22961M4348K5890J2965J9237K4099J02041q3154
12560A017989O0950O9324r9872Q9517M8521k5440L2535r6821j01487J2808j00231
12549I07793j45993P2965J04068j9859m3589m863N8226L6881J08586j84115k22352
$$ y = [1093950, 1010618, 1098520, 1176335, 1144198, 1084731, 1123346, 1228054, 1254102, 1174488, 1232570, 1118999, 1265116, 1351813, 1282486, 1233755, 1131214, 1169691, 1258217, 1211899, 1135203, 1161489, 1072213, 1006636, 971360, 1090017, 1089315, 1017860, 1140173, 1201244, 1137217, 931230, 1020102, 1140868, 1113291, 1083809, 1197279, 1339033, 1259601, 1252478, 1285794, 1169243, 1186988, 1071892, 897551, 831220, 990644, 1004802, 917880, 927554, 853922, 945169, 1048084, 852320, 745634, 735414, 769600, 951988, 995524, 872563, 916911, 942801, 955766, 975003, 999102, 1101143, 1017989, 1078939, 1148263, 1048391, 1137908, 1186429, 1160989, 1193524, 1096703, 995216, 1008024, 907793, 761800, 834765, 938833, 918974, 875385, 870522, 928748, 965629, 1074215, 890100, 667748]
12538F67748J82979J21856N9577J14124r628p7875j13997j02227r4990j07430
12528F40137O2642J61928j775j50920M2105P4245n926M325L3381j38185J7733
12517G39690L9804O2016j83712j22190j00624o1827J38344O113J33012l8015r4806
12506E17805k21999n3069k6620Q3453L5973J07229J01221o8209r0595j11790L609
12495B77008K7054m0354P0079K8166R9088o2497J45935M150q7085l3769P85m7708
12483C80852R2430K0632j8284j89916r1967N1943K18794J50125m8520M203j25993
12472D44299j44821L3169l699P0820K3958m4268N451J74653J44435j08010q0407
12461E15580n4459N0871J340q2319o4741O0286J8991j42798J9160L2119L4465
$$ y = [667748, 850727, 972583, 1032160, 1146284, 1136656, 1058781, 944784, 842557, 747567, 640137, 702779, 864707, 862932, 712012, 754117, 828362, 822436, 826761, 860142, 721957, 739690, 779494, 841510, 657798, 535608, 434984, 373157, 511501, 517614, 650626, 612611, 517805, 295806, 242737, 216117, 299570, 335543, 442772, 543993, 475784, 385189, 273399, 277008, 304062, 263708, 333787, 361953, 461041, 398544, 544479, 548629, 461544, 427775, 428560, 380852, 473282, 493914, 475630, 285714, 193747, 245690, 464484, 614609, 566089, 570292, 444299, 299478, 332647, 328948, 399768, 423726, 379458, 384909, 559562, 703997, 595987, 515580, 461121, 511992, 513332, 431013, 366272, 426558, 445549, 302751, 321911, 354030, 388495]
12450C88495m1876j64430K5823J78109K17596j18546M9050K52655K4721J2939
12440H24536L3485j8332L8691m6651Q1160j98126j9684J06147o9683p7355m5995
12429F08193o3881j5455J2066j56666r9497O7196J19562l2846k19376o9488J94092
12418C43900K1986K34344K1105J68056n4068j75321j37361j21993q1792l8088
12408A80768j488k8369J37448R3540Q6730J87204j58637j80207p7315o694K6893
12397B59873j56593m9824J26154J14484N3112J50405Q4630N5685P2071r061l7194
12386F63742k3230p6349j10898j63658j89857J32192P3222k5093Q8589l8084k258
12375C28318R9727R9405M158k9544j5434r5830o5402j0377k663m820K71775K32412
$$ y = [388495, 346619, 182189, 208012, 386121, 603717, 485171, 534221, 786876, 811597, 824536, 858021, 839689, 878380, 831729, 912889, 714763, 695079, 801226, 731543, 654188, 608193, 544312, 528857, 540923, 384257, 284760, 351956, 471518, 438672, 219296, 149808, 343900, 365886, 600230, 621335, 789391, 735323, 560002, 422641, 300648, 218856, 180768, 179280, 150911, 288359, 381899, 468629, 655833, 497196, 316989, 239674, 232980, 259873, 103280, 53456, 179610, 294094, 347206, 497611, 582241, 637926, 709997, 700936, 663742, 640512, 564163, 453265, 289607, 99750, 231942, 305164, 280071, 368660, 330576, 328318, 428045, 527450, 531608, 502064, 486630, 390800, 325398, 315021, 312358, 307538, 579313, 811725]
12363H11725K11455Q6888p24n0595M9015L49414K64176O2693J80437K81975J45566
12352B392025P4151o3846K0040J07831O7102j49914k79014j69439k44204j51978
12342A602754L653j39354k69381j5323k24863j92254p6205R7981p0536M180k6935
12331F93717j39131O0124J45590p7455N6257O0914o1810j98447j4891N8235p7396
12320E05707J02417K03209O3609J21089N920j22228j94759j25824J9279j67371
12310D11048J01391O9266N3516R8186N4803n3527n5773k0167K1379m8725j23582
12299E07815j9003m3046n1601J86795J26556n1523q4819J09498O059l7613j01707
12288E47411p7726l4627l3033p7014j21409J59689K16472J56176r0759n9300K4730
$$ y = [811725, 1023180, 1110068, 1109344, 1058749, 1107764, 1457178, 1721354, 1784047, 1964484, 2246459, 2392025, 2466176, 2402330, 2422370, 2530201, 2597303, 2447389, 2168375, 1998936, 1754732, 1602754, 1606407, 1467053, 1197672, 1182349, 957486, 765232, 689027, 787008, 716472, 720652, 693717, 554586, 614710, 760300, 682845, 739102, 800016, 738206, 539759, 524868, 583103, 505707, 608124, 811333, 874942, 996031, 1001951, 879723, 684964, 559140, 578419, 411048, 512439, 581705, 635221, 733407, 788210, 734683, 678910, 658743, 680122, 631397, 507815, 488812, 445766, 394165, 580960, 707516, 655993, 571174, 680672, 686731, 649118, 547411, 469685, 435058, 402025, 325011, 203602, 363291, 579763, 735939, 645180, 585880, 610610]
12277F10610l4733J7468j13155J05417l3915L9475l5425k20689O8429K30396J01931
12266G35809m645P4723M353j18006k9642j14918j33497k2096J16479m983k6093
12255D77484n1525m7696J2142N6547J0303j8054j6025K6772k5824n1526m3905
12244C28693J3673K81995J13033j17029p0099q7259j83827K6968J83443K45116
12234G34707j2236j03730O7871q5763L0861j94298p874j4918J46045J73837J05957
12223H40459K1433m1504j57494p6022N126m8142N5815O9117M4982j835O656j3359
12211G05232m6752N5307j07705L4961J32024n1908O6878j47288q9105P7293j5440
12200F13497n3385L8268R7369Q4060R60m6734p3911J9074N7795q4064R2326R290
$$ y = [610610, 575877, 593345, 480190, 585607, 551692, 591167, 555742, 335053, 403482, 633878, 735809, 731164, 805887, 810240, 692234, 662592, 547674, 414177, 392081, 508560, 503577, 477484, 425959, 378263, 390405, 446952, 457255, 439201, 423176, 449948, 424124, 372598, 328693, 342366, 624361, 737394, 620365, 550266, 463007, 279180, 306148, 489591, 734707, 722471, 618741, 686612, 600849, 631710, 437412, 429538, 414620, 560665, 734502, 840459, 861892, 820388, 662894, 586872, 591998, 543856, 599671, 668788, 713770, 711935, 718591, 705232, 658480, 713787, 606082, 641043, 773067, 721159, 788037, 640749, 551644, 628937, 613497, 560112, 598380, 695749, 779809, 780769, 734035, 660124, 679198, 736993, 652929, 745255, 754545]
12188G54545n7466j241m2514J84490L0345K05003l7394n2081o6304r5746J1198
12177H32835J04088N9768J9541l1535k17186j16559p474K77727J44783j10575
12167I55413n0986j34666n5611J98909R8887o9627o4386L5897r051o4678j7426
12156H22675J30115R2674j35944j07292O8202p2207L7935Q9654j4131j09195q7386
12145G15100L7456J34268J04261O5694J68891J52776m4021k0396m9719j67027
12135A097283j76429J32398K35096q0194j00269K2116K6280k2815J36119J6450
12125A286035n7111j70444l3634J60429L3412J35302J08399j71098n3376M8062
12115A285976M8576J8270N105J73060J00538j4099K8829j36036n5416N5654k1696
$$ y = [754545, 697079, 695838, 653324, 837814, 868159, 1073162, 1035768, 983687, 917383, 821637, 832835, 936923, 996691, 1016232, 984697, 767511, 650952, 643478, 921205, 1065988, 955413, 904427, 769761, 714150, 913059, 1011946, 942319, 877933, 913830, 904779, 840101, 822675, 952790, 1045464, 909520, 802228, 870430, 798223, 836158, 925812, 911681, 802486, 715100, 752556, 886824, 991085, 1056779, 1225670, 1378446, 1334425, 1314029, 1264310, 1097283, 920854, 1053252, 1288348, 1208154, 1107885, 1130001, 1156281, 1133466, 1269585, 1286035, 1228924, 1058480, 1024846, 1185275, 1218687, 1353989, 1462388, 1291290, 1237914, 1285976, 1334552, 1352822, 1357927, 1530987, 1631525, 1617426, 1646255, 1510219, 1454803, 1510457, 1488761]
12104A488761K90R770m1351p9204K704K8270q1157J29066J47673J25161M9967
12093A779950N2281J7453j26672m8572P9540J18484Q9309k4501q3664k31384M4426
12082A666650O1096o282J43260O2891n2939P250n2104j427q7089P175L11661N2436
12070B112578o4099r5883R8257J32208l0922M3275N4421M2495J4387j77040M7402
12059B177079J69429N1996J03183J65178J04223L7546l9939J7954N5868n4345
12049B788172J57309L6354k47357r9703J68904K32653K73229L4656l2561R1214
12039C402870j31213n5920O6885J47448l7057l3520K32905J37828M0967J7990
12029C789183J35907K55793K34820R7306p6382K04533J70672q1030k43501p5613
$$ y = [1488761, 1489051, 1498821, 1457470, 1378266, 1380970, 1409240, 1328083, 1457149, 1604822, 1729983, 1779950, 1832231, 1849684, 1723012, 1674440, 1753980, 1872464, 1961773, 1937272, 1853608, 1622224, 1666650, 1727746, 1721464, 1864724, 1927615, 1874676, 1881926, 1829822, 1828395, 1741306, 1748481, 2060142, 2112578, 2048479, 1952596, 2050853, 2183061, 2152139, 2195414, 2249835, 2292330, 2306717, 2129677, 2177079, 2346508, 2398504, 2501687, 2666865, 2771088, 2808634, 2768695, 2786649, 2842517, 2788172, 2945481, 2981835, 2734478, 2634775, 2803679, 3036332, 3309561, 3344217, 3311656, 3402870, 3271657, 3215737, 3282622, 3430070, 3393013, 3359493, 3592398, 3730226, 3771193, 3789183, 3925090, 4180883, 4415703, 4513009, 4436627, 4641160, 4811832, 4730802, 4487301, 4411688]
12019D411688P4554J12303N451R8670J16857J66799O0766J60135N7696J14431
12009E379350L47928m6428k0982J55660J52230K34043K30946J24474J49348J50652
11999F857221J17102M6877J08834L01669K34244L07035J33004R6465J75551J8100
11989H396102K76718M66080L08894K75935K25192L5453K56496K73705J64959L13489
11979A0993023L59201K76837K99489K02640J99347M89213M00630M02367O25982
11970A4248729N05709L51321L33640M68392M65269N37916M73221L82927N00987
11961A8268111O16255O82949O27436P36513M52718M63406P97927O39522O50312
11952B3935149P40421P88551Q96656Q35907Q00639Q38541P65135P25149P43295
$$ y = [4411688, 4486242, 4598545, 4603996, 4702666, 4819523, 4986322, 5047088, 5207223, 5264919, 5379350, 5727278, 5680850, 5659868, 5815528, 5967758, 6201801, 6432747, 6557221, 6706569, 6857221, 6974323, 7021200, 7130034, 7431703, 7665947, 7972982, 8105986, 8202451, 8378002, 8396102, 8672820, 9138900, 9447794, 9723729, 9948921, 9984374, 10240870, 10514575, 10679534, 10993023, 11352224, 11629061, 11928550, 12131190, 12330537, 12819750, 13220380, 13622747, 14248729, 14754438, 15105759, 15439399, 15907791, 16373060, 16910976, 17384197, 17767124, 18268111, 18884366, 19567315, 20194751, 20931264, 21383982, 21847388, 22645315, 23284837, 23935149, 24675570, 25464121, 26360777, 27196684, 27997323, 28835864, 29600999, 30326148, 31069443]
11943C1069443P36912R05211Q93356Q91014R15594Q52569N63732O67444O31762
11934C8127037O54484O54951N08732N39303L71468L86349M81281L79852J32857
11925D2236314J53506l3361j77542j20717k37989k42701k79497l05209n70488
11916D0422316n17112l85244n10338m71225o73859o49015o50481o91580o04443
11907C5269019p24882p46535p19155q02476p39726o47744o72167p71248o77208
11898B8767878o62568o87083p05050p13516o07205o60204o36720p15273o56827
11889B2723432n26383m21398m17078m05881o95589p68576n07574m06265n95805
11880A7978883l94861l47497l76935l79946m26923k71486m69572l19934m12645
$$ y = [31069443, 31806355, 32711566, 33604922, 34495936, 35411530, 36264099, 36827831, 37495275, 38127037, 38781521, 39436472, 39945204, 40484507, 40855975, 41242324, 41723605, 42103457, 42236314, 42389820, 42356459, 42178917, 42058200, 41820211, 41577510, 41298013, 40992804, 40422316, 39905204, 39519960, 39009622, 38538397, 37864538, 37215523, 36565042, 35873462, 35269019, 34544137, 33797602, 33078447, 32275971, 31536245, 30888501, 30216334, 29445086, 28767878, 28105310, 27418227, 26713177, 25999661, 25392456, 24732252, 24095532, 23380259, 22723432, 22197049, 21775651, 21358573, 20952692, 20257103, 19488527, 18980953, 18574688, 17978883, 17584022, 17236525, 16859590, 16479644, 16052721, 15781235, 15311663, 14991729, 14579084]
11871A4579084l80085l32248l90415k61868j37013k10058m18356k59436k92443
11862A1897162m70726l69874j91466k64693l72374l02722j45027k45636l04699
11853I229945k20189k80457j57158M0532j0978k06812j51695m7430j36432k11739
11843G847587j61919k16082k13422j31924k42296k24188j8107k57642j24137l3879
11833F223991l51160k40364p5189N3532n979n7187q2091n4715k22342j21659j35183
11822D931654j54765j09716J72781R4432l11333j73977o257j91301j94094p6236
11812C981188K7894J3334j48507j26261P0931P8641j06758j88227K16573r428
11802C809380q7019L8855k1032j30353m6796Q1829j30607q7689n044j47835j59921
$$ y = [14579084, 14198999, 13866751, 13476336, 13214468, 13077455, 12867397, 12449041, 12189605, 11897162, 11426436, 11056562, 10865096, 10600403, 10228029, 9925307, 9780280, 9534644, 9229945, 9009756, 8729299, 8572141, 8612673, 8601695, 8394883, 8243188, 8195758, 8059326, 7847587, 7685668, 7469586, 7256164, 7124240, 6881944, 6657756, 6639649, 6382007, 6257870, 6223991, 5872831, 5632467, 5557278, 5610810, 5604831, 5547644, 5465553, 5410838, 5188496, 5066837, 4931654, 4776889, 4667173, 4839954, 4934386, 4623053, 4449076, 4442819, 4251518, 4057424, 3981188, 4009082, 4022416, 3873909, 3747648, 3818579, 3897220, 3790462, 3602235, 3818808, 3809380, 3722361, 3761216, 3740184, 3609831, 3563035, 3644864, 3514257, 3426568, 3421524, 3273689, 3113768]
11791C113768j33080j69873m454N56l839j45744j25269J65347M0851p4851l5726
11780B627686J9319l8608j30703j29993J1124r9903K02112J91881R3878j31797
11770B614996j56325K7387o2471m8701k36815j04695P3328J98785J3069j21227
11760B197331n8161j97892O0370N7218j57616n304N1988L520Q6505q4430L0787
11749A984316k8773k9175k281K1076l0538j89190m9539J0841J0054l6989l9851
11738A619951r0759p3044o668K58833L4972k58137M08j7442o0411J53898m889
11727A556712l0917j11949k02022r2930O0041K8626O816J20837p840r4311M840
11716A237903J37856R7415q6317j95615n1055m0939L3496j15681j78510J84580
$$ y = [3113768, 2980688, 2810815, 2806361, 2806917, 2803078, 2657334, 2532065, 2697412, 2738263, 2663412, 2627686, 2647005, 2608397, 2477694, 2347701, 2358825, 2258922, 2461034, 2652915, 2746793, 2614996, 2458671, 2486058, 2423587, 2374886, 2138071, 2033376, 2106704, 2305489, 2318558, 2197331, 2139170, 1941278, 2001648, 2058866, 1901250, 1895946, 1947934, 1951454, 2037959, 1953529, 1984316, 1955543, 1926368, 1924087, 1945163, 1914625, 1725435, 1675896, 1686737, 1696791, 1659802, 1619951, 1529192, 1456148, 1449480, 1708313, 1743285, 1485148, 1485556, 1468114, 1407703, 1561601, 1556712, 1525795, 1413846, 1211824, 1118894, 1178935, 1207561, 1214377, 1335214, 1327374, 1233063, 1237903, 1375759, 1473174, 1386857, 1191242, 1140187, 1099248, 1132744, 1017063, 838553, 1023133]
11706A023133K06524L1466n0328p574q9548j0759j25248K44248J20520j06155
11696A236279q0126o1899m2951r1882l8046q4049j32603J6235J66684J42914j6870
11685A013686J9271J00434R7660n9512j66104j95964p2191L0207M714J41460q5209
11674H28452j32522j5936J75692J0034o4469p3655Q2534J67486q8299j41990K6798
11663G74125J72076J5710o6453P4779k6234j91444j70747R944O9442N6091m5417
11652F71872J26418N1312j24885o2243M1154n4422n7207L5954J04947n6541l06
11641F76053N8847J9528j78334j30950J11824K22137l7050n4164p9675J09321
11631G17537r1013j63332L9085J48076O1360Q219Q5107j36223r4005J57211K33554
$$ y = [1023133, 1229657, 1261123, 1210795, 1203221, 1113673, 1102914, 977666, 1221914, 1342434, 1236279, 1156153, 1094254, 1051303, 959421, 921375, 837326, 704723, 720958, 887642, 1030556, 1013686, 1032957, 1133391, 1231051, 1171539, 1005435, 809471, 737280, 767487, 772201, 913661, 828452, 695930, 679994, 855686, 865720, 801251, 727596, 810130, 977616, 889317, 747327, 774125, 946201, 961911, 895458, 970237, 944003, 752559, 581812, 591756, 661198, 717289, 671872, 798290, 849602, 724717, 662474, 703628, 649206, 591999, 627953, 732900, 676359, 676053, 734900, 754428, 576094, 445144, 556968, 779105, 742055, 687891, 608216, 717537, 626524, 463192, 502277, 650353, 711713, 719932, 805039, 668816, 574811, 732022, 965576]
11620I65576k15582p8600J9073j23218m9833J66047L6632j01049J6840K2400o1551
11609E96735j55n5366m5452k7654P2031O2951P9539J46577k8076j27031j05883
11598E68216m8153j54631m3676J15529m8971j31504N9929P9207P2225L6067N078
11587E09316r4190J9869o4599P0671P0295J17354m0810n0355J42343n2197q9055
11576E38642l1316j59909k3751j8025l2192j0030n155J15195R9832J10745K2922
11565F06958k33897k25714R9639K23958J3787L779l8160N3897m1745o9049J60199
11554E53652l2982j38521N6016J46200j123j42803L7912J78978o8549k6792J5811
11543E77799k7365q0965m7113O4467J10774J5137k06683p7640Q9412R9574m477
$$ y = [965576, 749994, 671394, 690467, 567249, 517416, 683463, 720095, 619046, 635886, 658286, 596735, 596580, 541214, 495762, 468108, 540139, 603090, 682629, 829206, 801130, 674099, 568216, 520063, 365432, 321756, 437285, 388314, 256810, 316739, 395946, 468171, 504238, 509316, 415126, 434995, 370396, 441067, 511362, 628716, 587906, 537551, 679894, 627697, 538642, 507326, 347417, 323666, 305641, 273449, 263419, 258264, 373459, 473291, 584036, 606958, 373061, 147347, 246986, 470944, 484731, 488510, 450350, 504247, 462502, 393453, 553652, 520670, 382149, 438165, 584365, 583242, 440439, 478351, 657329, 588780, 561988, 577799, 550434, 469469, 422356, 486823, 597597, 612734, 406051, 328411, 417823, 517397, 512920]
11532E12920J05046l5441j875o3177j04430j36962p6827J25434J79893j7359k33903
11521B53319K7508O116O0593j5532r1788o1285N6100m5025O594J1863J34375O119
11509C48957j58126n7131P6827P9507l4904j7066n8660K0770J95339Q4515r4868
11498C85160M4481R7428j20082J8282J04583j60174j70604L1737l2292M5147j18834
11487A24832l5652J71504l5326Q1512j4086J3401K5k06795p0831J07781J10174
11476B46539O3801j03780o5067M868J17477N5814M9744J07572J25980r4552j21335
11465C87061j04184k5569p6271j44007J09402K85466O4534J0905K3997k51612
11455B79722k03952p4071q6753M0688N8689p0018O4376J51223P3636R4432l01881
$$ y = [512920, 617966, 582525, 580650, 517473, 413043, 276081, 199254, 324688, 504581, 487222, 253319, 280827, 286943, 347536, 332004, 240216, 178931, 235031, 190006, 196600, 208463, 342838, 348957, 190831, 133700, 210527, 290034, 255130, 238064, 179404, 200174, 395513, 480028, 385160, 429641, 527069, 406987, 425269, 529852, 369678, 199074, 230811, 198519, 243666, 124832, 89180, 260684, 225358, 306870, 292784, 306185, 306210, 99415, 28584, 136365, 246539, 310340, 206560, 141493, 146361, 263838, 319652, 369396, 476968, 602948, 508396, 387061, 282877, 257308, 181037, 37030, 146432, 431898, 496432, 507337, 531334, 279722, 75770, 1699, -85054, -44366, 14323, -55695, 8681, 159904, 233540, 327972, 26091]
11444B6091q871P5381m6101r5620Q1628O8378j7397J7723M1921Q0647J63323l0299
11432C56804K0101O194Q051M7552m3434L3980J42308K532k3856o8412n0071j1740
11420D20009r6830k10006l9961J39104P5269K8674r7944L7197n4264j66946O1139
11409I5441O0445O5512J16049J38044j00841k44288K1714J3691l6346P8848Q8626
11398B96895O1634j3093O7253O3759j83988j42157j6877o3350J5143P2743m920
11387A53042O9138P7169N1776k4827J05339j515p9668J572n8507l5982l1087j06591
11375A19859r3483J51939K60079K07851j87564J4348j4410l5963J1356O8995p7094
11364D25913j31021m205J21146K2520l1811q3709J0959P1611j795L9914O4738
$$ y = [26091, 17220, 92601, 46500, -49120, 32508, 100886, 83489, 101212, 143133, 223780, 387103, 356804, 376905, 383099, 391150, 438702, 395268, 429248, 571556, 574088, 550232, 481820, 431749, 420009, 323179, 113173, 73212, 212316, 287585, 316259, 218315, 255512, 201248, 34302, 95441, 155886, 221398, 337447, 475491, 374650, 130362, 152076, 165767, 129421, 208269, 296895, 358529, 345436, 412689, 476448, 292460, 150303, 133426, 70076, 85219, 157962, 153042, 222180, 299349, 351125, 326298, 431637, 430122, 350454, 352026, 293519, 257537, 226450, 119859, 26376, 178315, 438394, 646245, 458681, 473029, 458619, 422656, 434012, 503007, 425913, 294892, 290687, 411833, 434353, 402542, 318833, 329792, 401403, 399608, 439522, 504260]
11353E04260J7722j1451J6178O0907J72009J11323j05344n0520M9028j01671O3258
11342G25699j29194r5276R0213J32693M0775j29657l36487k82186M2175R2931
11332A51686J55278R6569k2279q1546l2001k6478k7414J16828j22347n6647K07192
11321C58841J15552J08485j9335o9579L0670j2091n7268k40324o3369J98127J63210
11310E12919o9854k21845k10654J78543J9908K1709J81161j06594j63696M449
11300A46046K2368L2745P3904P0442L6562n5591k5727j09845j05984K510J32438
11289B19868J21738j61401n8019J24625m5879j8738P8930J87839l2148j33264
11279B83551N004m9456J40964n1436p8154j48960Q0627L5572P9566L1537o3055
$$ y = [504260, 521982, 510531, 526709, 587616, 759625, 870948, 765604, 715084, 764112, 662441, 725699, 596505, 501229, 591442, 724135, 764910, 635253, 298766, 16580, 58755, 151686, 306964, 403533, 381254, 299708, 267707, 241229, 213815, 330643, 208296, 151649, 358841, 474393, 582878, 563543, 493964, 524634, 512543, 455275, 214951, 151582, 349709, 512919, 443065, 221220, 10566, 189109, 209017, 230726, 411887, 305293, 141597, 146046, 168414, 201159, 275063, 345505, 382067, 326476, 300749, 190904, 84920, 87430, 219868, 341606, 180205, 122186, 246811, 200932, 182194, 261124, 448963, 416815, 283551, 288555, 239099, 380063, 328627, 250473, 101513, 182140, 217712, 297278, 328815, 265760]
11268B65760l1635Q2629J61779k2652j96356q8929j7139q412P1593k8003j77193
11257A1442J75323L6805n1494k15804L8269J87466J27602K9687m8051l9412M1766
11246B93599P6634j51124k72609j38843J53581L5275M9628P8119r8368m2196M2559
11235B6255J3857m6057j32675m7746N2780J37953q2796j5299N3116J25637L771
11224H8796j12175K9269L8703P4388O7392J09506q9596J9377J44628m9011K3808
11213C45085m1905m8253p3071K0499j02816J01632J55516r001m8809j00355o1573
11202A36949m7078J16350M4704j89491j16100L553L3080J2169o6207K1053M814
11191d6204j0684J10931O2988n5351O6081J19709r6266o81J48328j24597n7185
$$ y = [265760, 234125, 316754, 478533, 455881, 259525, 170596, 153457, 145045, 216638, 188635, 11442, 186765, 223570, 172076, -43728, -5459, 182007, 309609, 339296, 291245, 251833, 293599, 370233, 219109, -53500, -192343, -38762, -3487, 46141, 124260, 25892, -16304, 26255, 40112, -5945, -138620, -186366, -133586, 4367, -78429, -93728, -40612, 85025, 88796, -23379, 5890, 44593, 118981, 186373, 295879, 206283, 225660, 370288, 321277, 345085, 303180, 254927, 181856, 202355, 99539, 201171, 356687, 347686, 298877, 198522, 136949, 89871, 206221, 250925, 61434, -54666, -51113, -18033, -5864, -72071, -51018, -46204, -56888, 54043, 117031, 61680, 127761, 247470, 151204, 150523, 298851, 174254, 117069]
11180A17069j36771q0518J87587O2667r7770r354J26065N6709j53453j88868J0199
11169a06438j3145O4431L235n067j22993J1911J18844K21865J51168l4049l3140
11158B56622O0826O4832q2374j77657k00521J04447O7170p8378j35429o0878N3365
11147a27975J48621R6693j3804j8920j11144l2436J99122J00027J0010j41865
11137A08329J6872J16631l3143k31920N300K4757R3382J1505m0554J29550q7575
11126A13134j2660N8347L0972m060o920k0743r5708m1369K1663j12478j13550
11115a83372P1809J17594p8184J55154n8198N1561o3586k1472n1201j57003l5425
11104b52323K72290J77050j23382j874K33611r769J09650j4508j19599j00323
$$ y = [117069, -19702, -100220, 87367, 150034, 52264, 42910, 168975, 225684, 72231, -116637, -106438, -119583, -55152, -51917, -56984, -179977, -168066, -49222, 172643, 323811, 289762, 256622, 317448, 382280, 299906, 122249, -78272, 26175, 93345, 14967, -120462, -181340, -127975, 20646, 117339, 103535, 84615, -26529, -58965, 140157, 240184, 250194, 108329, 125201, 241832, 208689, -23231, -17931, 6826, 100208, 111713, 71159, 200709, 113134, 100474, 158821, 189793, 185733, 178813, 158070, 62362, 20993, 42656, -69822, -183372, -111563, 6031, -72153, 83001, 24803, 76364, 12778, -8694, -59895, -216898, -252323, 19967, 197017, 73635, 71761, 305372, 295603, 405253, 390745, 271146, 170823]
11094A70823q766n5076l1012k6386q9312j47638N4180R7976J44961o6236P5137
11083A18651J67335L6433j99659r9009P4879O0288Q0747l262j53223P7515L4393
11072A95088J40162M4158j91008j62332n2422R1858J60372M3000Q43L9466j18186
11061A90999j66825n7306K02860o568j0605l2754k45716J00644J35426J2582M1171
11050A63908O2141J28677n295q0753J26492R7612R3792o0224r8751R484j1329
11039D25754L2321m6138Q8679L03746J76647k2521j0280m0195o2217r6063j6524
11028G33209J20011J15985J63784j8259m2521L7293O3722q2265K0928P8510k1616
11017A168781p1951M4880j52277k32104j04789k7238R5330K53924O5745P121j03188
$$ y = [170823, 162057, 106981, 75969, 49583, -39729, -187367, -133187, -35211, 109750, 43514, 118651, 285986, 322419, 122760, 23751, 98630, 158918, 239665, 236403, 83180, 160695, 195088, 335250, 379408, 188400, 26068, -26354, 65504, 225876, 268876, 269719, 309185, 190999, 24174, -33132, 169728, 163160, 152555, 119801, -125915, -25271, 110155, 122737, 163908, 226049, 354726, 349431, 268678, 395170, 492782, 586574, 526350, 427599, 437083, 425754, 458075, 411937, 500616, 804362, 981009, 958488, 948208, 908013, 845796, 749733, 733209, 853220, 969205, 1132989, 1114730, 1072209, 1109502, 1173224, 1090959, 1111887, 1190397, 1168781, 1096830, 1141710, 989433, 757329, 652540, 625302, 720632, 974556, 1040301, 1047422, 944234]
11006I44234r1318l09677j70351m9286j1834K40486P0756j63088q2119j36314
10996B41489K9802J46092J59473l6949j24625j14427j00508j92423n3360K0504
10986b4932N6280m2105p2900r2434J08919J92073M4949j31529p8176L7347O7500
10975F4992J83839N0136J6514r0657J14018j12955p4657J4301J5525q9701O3974
10964A55329J8418P6829j47407j37321J01601J16194J02155J84504R2872j19004
10954D44170r5493j24655p2185j77767n6564M1607k2025l3425L9906J5907m8931
10943h9455M06953o626j78991K4720q3756o2523m3403K13471J55553o9720j2299
10932B53924k04533N3087J96211J49376k9441o1983Q8465j92827j68236J93j06090
$$ y = [944234, 852916, 543239, 372888, 323602, 311768, 552254, 623010, 459922, 377803, 241489, 271291, 417383, 576856, 539907, 415282, 300855, 200347, 7924, -45436, -24932, 31348, -10757, -83657, -176091, -67172, 124901, 169850, 38321, -39855, -2508, 64992, 248831, 298967, 315481, 224824, 338842, 225887, 151230, 165531, 181056, 91355, 155329, 173747, 250576, 103169, -34152, 67449, 183643, 285798, 470302, 563174, 444170, 348677, 224022, 151837, -25930, -82494, -40887, -62912, -96337, -56431, -40524, -89455, 317498, 310872, 131881, 156601, 72845, 10322, -33081, 180390, 335943, 266223, 253924, 49391, 102478, 298689, 448065, 418624, 356641, 445106, 252279, 84043, 84236, -21854]
10921b1854k1498K20126K4388j29206O2890o5888j63708Q6967J41504R0641M895
10910B29257j10069j51945J2772m5261l606O9973L4274N4571R6147Q2888j33839
10899A35162j17365q9858O0572o0158N4898n666n4020J02623J72220L2380j39113
10888I1675r3428M4492R6057L7783j20291j59202P6888k5941N8281J40049m6742
10877I9621j99727m3758j904K09766K01725j16819k02439n829K9135J5835J42324
10866A27930K0254J118k7181J798q2811N9208L5915j0376j74111J46102J65071
10855B62917m2812J6050Q1717J39730m9463j72656j10223J47044j24133Q4254
10845B32425J9388j44191j014M7868J69955j8459j30402k0507n026n3890q944
$$ y = [-21854, -43352, 176774, 201162, 71956, 134846, 68958, -94750, -7783, 133721, 224362, 229257, 119188, -32757, -19985, -65246, -68852, 1121, 35395, 89966, 186113, 269001, 135162, 17797, -72061, -11489, -71647, -16749, -22415, -76435, 26188, 198408, 230788, 91675, -1753, 42739, 138796, 176579, 56288, -102914, -26026, -51967, 6314, 146363, 99621, -100106, -143864, -145768, 63998, 265723, 148904, -53535, -59364, -30229, -14394, 127930, 148184, 149302, 122121, 123919, 41108, 100316, 136231, 125855, -48256, 97846, 262917, 220105, 236155, 317872, 457602, 408139, 235483, 125260, 272304, 148171, 232425, 251813, 107622, 106608, 154476, 324431, 305972, 175570, 155063, 150037, 96147, 87203]
10834H7203j69896J06313R7990P7707J51112J90966J6851j29234j99970k48836
10824a9794J10638K94256m0625j38587p0643O6436N4448P8045o5074o0464J71574
10813C80210q4779n9357j2047p5754n534L5225J06736l6415j61248j14771J07514
10802G9780Q6765j2201j22654o994o9048n7899Q5348J03939P2822L1382m7509
10791A43731j46531J9460j76375L8188J38116K22250n3798O5294m8670j71996
10781B9669o7695j1726M3903J11414P4432m9764o9773L061J18023K2419p7968
10770A25995n213K1932m5380j57836L9157J58742q0j38962J13987J89217k7928
10759B73631l2464J76383k15436j54355K92359J05834q3628q6012P2197r8773
$$ y = [87203, -82693, 23620, 121610, 199317, 350429, 541395, 558246, 429012, 229042, -19794, 90844, 385100, 344475, 205888, 135245, 201681, 256129, 334174, 269100, 208636, 380210, 295431, 236074, 224027, 148273, 142739, 177964, 284700, 248285, 87037, -27734, 79780, 166545, 154344, 31690, 24696, -44352, -102251, -16903, 87036, 159858, 191240, 143731, -2800, 16660, -159715, -121527, 16589, 238839, 185041, 250335, 201665, 29669, -38026, -49752, -5849, 105565, 179997, 130233, 60460, 63521, 181544, 203963, 125995, 120782, 142714, 97334, -60502, -21345, 137397, 137317, -1645, 112342, 301559, 273631, 241167, 417550, 202114, 47759, 340118, 445952, 362324, 276312, 348509, 249736]
10749B49736j54908k1127P2129M0773J09526n9337m6124j30585R695J06132J30191
10738C06101M2730n5148r5901j86003J49472L4219j29087J08500O7421r6822q1130
10727F4352J00859K00413m0231J7421k7469m6234j09504K3118L4173n2236k38103
10716g3441j10565Q4884K87071P3221j06707k5199j5622j4321P3460R120k9380
10705A52521k15140j36252Q0712K00Q0861N8472O0785O3604K00999K27908K6400
10694F01070M3805Q1012j54257r7370N1612P4539j01057j44293J8254K7328j08515
10683B92128J40262R9995n1056J54975k985K7123m6167R8953J84535J26280n4154
10672I69889m184m6751M5514J18027K38307L8641J18617m4965k40498q5104J20357
$$ y = [249736, 94828, 73701, 145830, 186603, 296129, 236792, 190668, 60083, 69778, 175910, 306101, 348831, 293683, 197782, 11779, 161251, 195470, 66383, 174883, 242304, 145482, 64352, 165211, 365624, 325393, 342814, 315345, 269111, 159607, 182725, 216898, 164662, -73441, -184006, -99122, 187949, 261170, 154463, 129264, 113642, 99321, 172781, 181901, 152521, -62619, -198871, -118159, -117959, -37098, 21374, 82159, 145763, 346762, 574670, 601070, 644875, 725887, 571630, 474260, 525872, 600411, 499354, 355061, 373315, 400643, 292128, 432390, 532385, 481329, 636304, 633319, 660442, 614275, 713228, 897763, 1024043, 969889, 965705, 918954, 964468, 1082495, 1320802, 1359443, 1478060, 1433095, 1192597, 1107493, 1227850]
10661A227850K29658M3692k21168j60113q1201J17233J53367J51755R8792J05596
10651A665461K43824J61129n7554m0705n45o7233J40006M4181N1311K04444J49763
10640B494082r3074k2655L38963K27770K49615L50891L39458L51938M01321L16039
10630D954348L72291O23674O99916O44629Q03500J075223J270594J740396K432343
10621A4616914L011239L765390M807276O127157P230590Q210637Q443319P284984
10613F3497506N289875K868412J055332O33205J382389L241133O138040R351350
10605I3457242J2422059J4739387J4918494J1861857O098131J98267l810750n105100
10597A44779587l590440k68499M353154R888777J4488055J7170000J6224994J0585599
$$ y = [1227850, 1457508, 1501200, 1280032, 1119919, 1038718, 1155951, 1309318, 1461073, 1559865, 1665461, 1909285, 2070414, 2012860, 1972155, 1971610, 1904377, 2044383, 2088564, 2139875, 2344319, 2494082, 2401008, 2378353, 2717316, 2945086, 3194701, 3545592, 3885050, 4236988, 4638309, 4954348, 5326639, 5950313, 6650229, 7294858, 8098358, 9173581, 10444175, 12184571, 14616914, 17628153, 21393543, 26200819, 32327976, 39558566, 47769203, 56212522, 63497506, 68787381, 71655793, 72711125, 73344330, 74726719, 77967852, 84105892, 93457242, 105879301, 120618688, 135537182, 147399039, 153497170, 153695437, 149884687, 144779587, 141189147, 140920648, 145273802, 155162579, 169650634, 186820634, 203045628, 213631227]
10589B13631227J596810p395117j3477172j5156759j3357575r625764m773079
10582A51442571k1515M168946O322790N796424J865790m182899r892462j3206430
10574A42293215j3797908j2484340r500147o422276l517381j234401n24962p37234
10566I4074566k206144m581341o754955q007768q258719p770348o614569n457063
10558D4423659m257992l458282k761243k385029j996553j636441j242486j337436
10550B5348197j362940j138762j029351j009253q36900n84062o32393q64795p13937
10541A7175804n22796o06795o80331n98425o89445n96796n52126o78525n46136
10532A1704429m42368o45722l97878m31601m16888m66996m17758n11881l63460
$$ y = [213631227, 215228037, 207832920, 194355748, 179198989, 165841414, 156215650, 151442571, 151421056, 155590002, 161912792, 167709216, 169575006, 165392107, 155499645, 142293215, 128495307, 116010967, 106510820, 100088544, 96571163, 95336762, 94811800, 94074566, 91868422, 87287081, 80532126, 72524358, 64265639, 56495291, 49880722, 44423659, 40165667, 36707385, 33946142, 31561113, 29564560, 27928119, 26685633, 25348197, 23985257, 22846495, 21817144, 20807891, 19970991, 19386929, 18754536, 17889741, 17175804, 16653008, 16046213, 15365882, 14767457, 14078012, 13481216, 12929090, 12250565, 11704429, 11262061, 10616339, 10218461, 9786860, 9369972, 8902976, 8485218, 7973337, 7609877]
10523G609877k77878l56092l86550l51664k91061j54464k34042j90245j75099
10514E192782j79250m10202j93390j50298k16568k17702k93428k3117o8159r2963
10504C347705j51380l09800l396J82838r8503k29594k65075k94482N0231o443
10494B222101r8478j32180j09719P0294k0955J3894K9676k6728J97913j22179
10484B023639o9961l0102k209j20275j51418k1461j39282m4149J98684J16920
10474A760386j30210j62893l5875j4706J09716R1077l6249o6007k4643L9930J07372
10463A637898l9297p9130o738O5697Q4607P5417M1372j14957j00833n5310k36347
10452A272379j14742n0457n1674o3204K0149N4665l6915l3407M3113o0702r1727
$$ y = [7609877, 7331999, 6975907, 6589357, 6237693, 5946632, 5792168, 5558126, 5367881, 5192782, 5013532, 4603330, 4409940, 4259642, 4043074, 3825372, 3531944, 3508827, 3440668, 3347705, 3196325, 2886525, 2883129, 3065967, 2967464, 2737870, 2472795, 2178313, 2228544, 2222101, 2123623, 1991443, 1881724, 1952018, 1931063, 1944957, 1974633, 1947905, 2145818, 2023639, 1953678, 1923576, 1921367, 1801092, 1649674, 1628213, 1488931, 1444782, 1643466, 1760386, 1630176, 1467283, 1431408, 1416702, 1526418, 1617495, 1581246, 1515239, 1490596, 1530526, 1637898, 1598601, 1519471, 1512733, 1578430, 1663037, 1738454, 1779826, 1664869, 1564036, 1508726, 1272379, 1157637, 1107180, 1055506, 992302, 1012451, 1067116, 1030201, 996794, 1039907, 979205, 887478]
10441H87478j44294J67528m3667o2633K3694J62202J14238l6765p2468j47785
10431H47528r0133K5454O7254k3639j44799N4207N3961j16558j8616k9493l9426
10420E85740j02173J85210J74096j3593L2256J0737L9245p113j50582M6317l1947
10409G68193o9400R4774J43667j11418j58303K8730J4419J48459j5852k8398j50387
10398F64484P373P5322p8571P944M3077k45985j03930J67108J37872Q9512J8166
10387G82372N7542O6751j09801j33001j31180n9058J675p189J97210l7856o3550
10376E63915J4780Q547K9042L4900Q9692N4625k481J14329j79989k20296j38099
10365C68965K5163M9191M9997Q5283r8803k13834k0358J21027J73609P814K973
$$ y = [887478, 743184, 910712, 867045, 804412, 828106, 990308, 1104546, 1067781, 995313, 847528, 757395, 782849, 850103, 826464, 681665, 735872, 789833, 673275, 654659, 625166, 585740, 483567, 668777, 842873, 829280, 861536, 872273, 911518, 904405, 753823, 800140, 768193, 698793, 793567, 937234, 825816, 667513, 696243, 710662, 859121, 843269, 814871, 664484, 671857, 747179, 668608, 676552, 719629, 473644, 369714, 536822, 674694, 764206, 782372, 839914, 906665, 796864, 663863, 532683, 473625, 475300, 468111, 665321, 627465, 563915, 578695, 587242, 616284, 651184, 740876, 795501, 793020, 907349, 727360, 507064, 368965, 394128, 443319, 493316, 578599, 479796, 265962, 245604, 366631, 540240, 548054, 551027]
10354E51027j7476o3739j42082r2382K28428O1364m5514r2264m5394j6133J18225
10343D44060J46342O8734J06382j99053j31333M4279P0418j53659j94606R7608
10333B99172J31700j8228k6276M250p5985O5289j3440M0395L4466j6763P2069
10322D96649P5528j4005k7637j86059k79522J7706N0811J2586J49168O2645j8107
10311C39763L2097j10535k42986M6834q2571O6387K2503K25013R7407m3485o6524
10300B83903J11198n959j4424j41239J2614l99O1739K14956J88607k797k8456
10289F79743j34013J09157O0022J03545l1236J27428J22850K03476J07849L02701
10279A651522L22357M09715M21862P81531J191058J301047J316159J412132J466960
$$ y = [551027, 533551, 469812, 327730, 235348, 463776, 525140, 479626, 387362, 341968, 325835, 444060, 590402, 659136, 765518, 566465, 435132, 479411, 549829, 396170, 201564, 299172, 430872, 412644, 386368, 390618, 314633, 379922, 366482, 406877, 441343, 424580, 496649, 572177, 558172, 530535, 344476, 64954, 82660, 133471, 146057, 295225, 357870, 339763, 371860, 261325, 18339, 65173, -17398, 48989, 71492, 296505, 393912, 350427, 283903, 395101, 389142, 374718, 233479, 246093, 245694, 307433, 522389, 710996, 708199, 679743, 545730, 654887, 714909, 818454, 787218, 914646, 1037496, 1240972, 1348821, 1651522, 1973879, 2383594, 2805456, 3586987, 4778045, 6079092, 7395251, 8807383, 10274343]
10270A0274343J569773J173948O92968M03029R9111m45203q84445j096644j197414
10261A0589466j534953j422325j038662j272120j018842p27384l97261l07864
10253B870055k17380k44587k65773n2547p3971p5183q060j88658q3870R1358p1538
10242A679846q9521j65869p8891k6574j66324l1375M3065L8457O4128j34910N4456
10231A186488O6805j33753j5742j7000r6255P1072o820l4157m6339q7424r6936
10220G89939r6401k1463J5207J58723R4790j13246j42104j72318J8982k9210M8630
10209E51529R5245r7739j13489k0384J4456j12423P9727M121j53708l341N5476
10198B99470J47155l2408k3531r5050L9117j4878m7500L5012p6051j79276l3610
$$ y = [10274343, 11844116, 13018064, 13711032, 14114061, 14213172, 13767969, 12883524, 11786880, 10589466, 9054513, 7632188, 6593526, 5321406, 4302564, 3575180, 3177919, 2870055, 2652675, 2408088, 2142315, 2089768, 2015797, 1940614, 1932554, 1743896, 1660026, 1751384, 1679846, 1590325, 1424456, 1345565, 1318991, 1152667, 1121292, 1164357, 1202814, 1266942, 1132032, 1186488, 1253293, 1119540, 1103798, 1086798, 990543, 1061615, 1054795, 1020638, 974299, 886875, 789939, 693538, 672075, 687282, 846005, 940795, 827549, 685445, 513127, 532109, 502899, 551529, 646774, 549035, 435546, 415162, 429618, 317195, 396922, 401043, 247335, 243994, 299470, 446625, 414217, 390686, 295636, 334753, 319875, 272375, 307387, 231336, 52060, 18450]
10187A8450J23598O4994P1815j7933m8660j08173R4844K72602J43072J8235J88125
10176H20969j80o6571O6052K7711j05429l0544l5343J47557J91418J30887K6462
10165A172989j79346j96178L4139l4169O0791M6334r6774o3166K5351J7894J76372
10154I64237J24766R7665J70262l0881j54679l0653q0030M9376Q1375J0123j70653
10143A030908o6968m8411m5020L7013k08337k46876q7920J14273J84578j41225
10133E22015j2668J49145J00695o0426n8382r9850J6689l8302j28209j06163P9844
10122C64388J4653p3629l1139k2406j41023j60420P7968K43137R7140O4180J12149
10111E44998q9685k8383j40485j22673m718j15834m1087O021r5904o7827J50738
$$ y = [18450, 142048, 207042, 278857, 260924, 212264, 104091, 198935, 471537, 614609, 632844, 820969, 820789, 754218, 820270, 847981, 742552, 712008, 676665, 824222, 1015640, 1146527, 1172989, 993643, 797465, 831604, 797435, 858226, 904560, 807786, 744620, 769971, 787865, 964237, 1089003, 1186668, 1356930, 1326049, 1171370, 1140717, 1060687, 1110063, 1191438, 1201561, 1030908, 963940, 915529, 870509, 907522, 699185, 452309, 364389, 478662, 663240, 522015, 509347, 658492, 759187, 698761, 640379, 540529, 557218, 518916, 390707, 284544, 364388, 379041, 305412, 274273, 251867, 110844, -49576, 28392, 271529, 368669, 432849, 544998, 455313, 426930, 286445, 163772, 159054, 43220, 2133, 8154, -87750, -155577, -4839]
10100d839P79j05944J10706P6356j6038N836M4521k7484j4649o7501J70478N6426
10088B28647R0956P6958Q9973l1084o7430j54189L1444L6405l0591l8090M9390
10077B82389J7009j27468l0017n5123j81178L0806J49008l2911o5241r56l5372
10066d9054o8614n4704L4823Q8147J69511j94687j20144J40435J66177k4581P0250
10055A57559k5087O0864J77828j05293k58647j46800l9601q7840l782J56640J57693
10044D3534M2457l1332J07461r87M8444n9193p2998j26471o557Q1634m1150n4084
10032f9242L4648J49033L821p0556l272r9454M6862m068l6726K13673L2202J20692
10020C17613N0991J46661R7328j75946j75515k52365L0493L2914P1876q90j71505
$$ y = [-4839, -4060, -110004, 702, 77058, 61020, 66856, 111377, 83893, 69244, 1743, 172221, 228647, 319603, 396561, 486534, 455450, 388020, 233831, 265275, 301680, 271089, 232999, 282389, 299398, 171930, 141913, 86790, -94388, -63582, 85426, 52515, -12726, -13682, -49054, -117668, -172372, -137549, -49402, 120109, -74578, -194722, -54287, 111890, 87309, 157559, 132472, 193336, 371164, 265871, 7224, -139576, -179177, -267017, -270799, -114159, 43534, 85991, 54659, 162120, 161133, 209577, 150384, 77386, -49085, -55642, 25992, -15158, -69242, -34594, 114439, 118260, 47704, 44432, -55022, -8160, -12228, -48954, 164719, 196921, 317613, 368604, 515265, 612593, 436647, 261132, 8767, 39260, 72174, 144050, 143160, -28345]
10009b8345j42325J08391l3426k6452K304J1659O7308J37120k734j96840l3219
9998a36559J68349J19746J71855L168k07116k17052O2696N9462M0705K7755j01670
9987h661j6794Q0089j08129N8353L1621J19562P2360K591p2345r7832M018j27980
9975f3147j35788k0172J79548O2502j45439J6840P0907L8580r043L368j4259j4109
9963c0212L0995K1429r7547l923R08L1572k1034R0271P9499J05764J16622p8377
9951B45967k01804k55145J77077J81343j2593O6884r2293q8252N7667L7119n5375
9940F0595J0322K6230J7226O6426l6916L7308p9584j46598P0804P8920n544Q3039
9928A82228M5902J0282m3660p2002j0533J34298j88132n1153n4698o5136J08232
$$ y = [-28345, -170670, -62279, -95705, -122157, -119853, -108194, -40886, 96234, 93500, -103340, -136559, 31790, 151536, 323391, 326559, 119443, -97609, -34913, 24549, 65254, 93009, -8661, -25455, 54634, -53495, 4858, 36479, 156041, 228401, 230992, 158647, 60815, 64833, -63147, -198935, -219107, -39559, 22943, -122496, -105656, -34749, 3831, -5212, -1844, -16103, -30212, 783, 22212, -75335, -79258, -78350, -46778, -67812, 22459, 101958, 207722, 324344, 245967, 44163, -210982, -33905, 147438, 134845, 201729, 109436, 21184, 78851, 115970, 60595, 70917, 97147, 114373, 180799, 143883, 181191, 101607, -44991, 25813, 104733, 99189, 182228, 228130, 238412, 194752, 122750, 112217, 246515, 58383, 7230, -47468, -112604, -4372]
9917d372J30921k0459j11571M9612k5542r1848J25859p0091K0308o8308J07639
9906D2148Q0395J49437J4939p6264P4358n6555k30141m2547J4100n4171M2432
9895d1869O5619l9626l7437N2716P2451M1303j05324j0463k8621n2385J3561J04551
9883C4476q6455k5279P5598J3557N1061J46058m3960q6234K4201l2313p7659p6025
9871h2974K43491n1820j12514o9001K2622J28614K52793m6165p5084R2873j0779
9860B92056j57896j82768j31266J2097O5742O4114q1271J7748J59002P5365q6831
9849D6092n3095J34549l2524j68474j23563N9893K3357L5272J64701O7618P7790
9838B31616j4159J1935M5660j18975M1026p3159j06406j31792J49555l6729J01333
$$ y = [-4372, 126549, 106090, -5481, 44131, 18589, -73259, 52600, -17491, 2817, -65491, 42148, 122543, 271980, 286919, 210655, 285013, 228458, -1683, -44230, -30130, -84301, -41869, 23750, -15876, -53313, -597, 71854, 113157, 7833, -2630, -31251, -83636, -70075, 34476, -51979, -77258, -1660, 11897, 62958, 209016, 165056, 78822, 103023, 70710, -6949, -82974, 160517, 108697, -3817, -72818, -50196, 78418, 331211, 285046, 209962, 302835, 292056, 134160, -48608, -179874, -167777, -102035, -37921, -119192, -101444, 57558, 132923, 46092, -7003, 127546, 95022, -73452, -197015, -137122, -113765, -78493, 86208, 153826, 231616, 217457, 229392, 275052, 156077, 197103, 123944, 17538, -114254, 35301, -1428, 99905]
9827I9905Q557j01495K0001P4361O2157n5865O2543O3940j00354J4489O0586k41722
9815c2897j03493R5949L9231J16860j1226m4148r1164J12445Q4654q897j90825
9804c3511K579p4130R0175N9198q0138J55927J58189q1416j26902n121j09988
9793d5138J7668J47125k6435l618J17474l6126o6791j5628M9155k841O4856l6538
9781A63163O41q280j23621j7866J9055J3649P0431n5645j33237J33920J10988
9770A73198m4105q6015m3572l9461r3036J75904J2045j15192J0440j17431j8801
9759a86026M5888N512m2117q4399P7718J39019K2071Q535K8961K14535R4950L447
9747C28094n9418j93645m5175O2925k07663p3144J21662j1436m1439J49523J09434
$$ y = [99905, 108462, 6967, 26968, 101329, 163486, 107621, 170164, 234104, 133750, 148239, 208825, -32897, -136390, -40441, -1210, 115650, 104424, 60276, -30888, 81557, 166211, 157314, -33511, -30932, -105062, -14887, 44311, -35827, 120100, 278289, 196873, 69971, 64850, -45138, -27470, 119655, 93220, 89602, 207076, 170950, 104159, 88531, 137686, 134845, 199701, 163163, 163804, 155524, 31903, 14037, 33092, 46741, 117172, 61527, -71710, 62210, 173198, 129093, 43078, -494, -39955, -132991, 42913, 54958, -60234, -49794, -167225, -186026, -140138, -134626, -176743, -261142, -183424, -44405, -22334, -13799, 15162, 229697, 324647, 328094, 268676, 75031, 29856, 92781, -114882, -188026, -66364, -77800, -119239, 30284, 139718]
9736A39718k7004K9820j6719P9418j44642m2117j2990O7182j10657M6787m0171
9725c1375n8425j6635K32757J27931n2275k01269j4726N2703J13945J71269j67767
9714A56133l38493N4345Q4950k4918K8346l5787P8342J43590p0822j02621r8226
9703a25161J3469K4255M2863O2815K0802p9645r248n7602J22350o0239p9261p0334
9691a94936n960j22864p4944K05515J97418J4936n9461J5651j11821m3421k5082
9680b04969m8687K11754k1914n7695j19026m4105P0789R6174K6811r4558J43101
9669d2325O6899n040P0805J1709k73334j20430P1524J65698J07490M5987p073
9658I1910m3885n3472P4250K54877n8216k05969j38435n9259J05171K08965R3716
$$ y = [139718, 112714, 142534, 125815, 205233, 60591, 18474, 5484, 72666, -37991, 8796, -31375, -89800, -106435, 126322, 254253, 201978, 709, -14017, 38686, 152631, 323900, 156133, -182360, -128015, -43065, -67983, -39637, -75424, 2918, 146508, 75686, -26935, -125161, -111692, -87437, -44574, 18241, 39043, -40602, -49850, -107452, 14898, -45341, -124602, -194936, -200896, -323760, -398704, -193189, 4229, 19165, -40296, -24645, -136466, -179887, -204969, -253656, -41902, -63816, -121511, -240537, -284642, -213853, -117679, -90868, -185426, -42325, 24574, 19534, 90339, 102048, -171286, -291716, -220192, -54494, 52996, 98983, 91910, 48025, -5447, 68803, 323680, 265464, 59495, -78940, -138199, -33028, 175937, 269653]
9647B69653l23100j09728R2904J24715n8296j63542k01555j8998K20012J77808
9637I873R2531l6903l1732J24341n7467J648j97017j4468P8562k9199J33931p4983
9625h83R852J48853j25626N8936o1438n684O9654k6655j42659m5820K820P1390
9613d7260M274m448M9938j11962o5849R2594O174r7027J51274N1040l58O267j5096
9600A9561N8054J3003q4504r9742Q46M9938j7009m5614J41795r5111j18441K74014
9588I6790j16425J41037L01237j00424l18237j61492L1998J38296P1903K4786
9578A09469J1745J4777Q6315n7125J04610J93803M8405r7448k98977j45706R034
9567b1098l909n2147Q4138J50932j64541j13189P6986K6000n1879P2935J9687
$$ y = [269653, -53447, -163175, -70271, 54444, -3852, -167394, -368949, -387947, -167935, 9873, 102404, 65501, 33769, 158110, 100643, 102291, -94726, -109194, -30632, -59831, 74100, -883, 8969, 157822, 32196, 91132, 29694, 24010, 93664, 67009, -75650, -121470, -118650, -47260, -42986, -47434, 2504, -109458, -175307, -82713, -76539, -173566, -22292, 28748, 28390, 34657, 19561, 77615, 90618, 6114, -93628, -92782, -42844, -59853, -105467, 36328, -58783, -177224, 96790, -19635, 121402, 422639, 322215, 3978, -157514, -125516, 12780, 84683, 109469, 121214, 135991, 222306, 165181, 269791, 463594, 511999, 414551, 115574, -30132, -21098, -25007, -77154, 6984, 157916, -6625, -119814, -42828, -16828, -68707, 4228, 23915]
9556B3915j24089k6170L2001O9460O7236L1800J66501J0613k65380m109k6641
9545d4863j14353N6795K7710m61K06879j24859p4741J264l1936J7896O1875J85638
9533A66844q9693r8402O698O9955m6284p0755m3336j13090K2313J37958J13539
9522E5747N3309K7677O6272j06006K9264j2413n4239Q933j23909o9607N0499K7017
9510d7456p8931q0297J07435R2689J20236K3772J41447P811k2742j22704j31918
9499I342j06607q1097K7299J79037R0088k6954j2160O9237N2454R041L1281J51911
9487C92872K7324j10342j37070R9496n9639j27739M099k1291j42743L1302J45352
9476A01621J69859L4525l2953j90221q0623N0641L1842j56002Q868J56097q7889
$$ y = [23915, -100174, -126344, -94343, -24883, 42353, 74153, 240654, 251267, -14113, -18222, -44863, -159216, -102421, -74711, -75172, 131707, 6848, -67893, -66629, -98565, -80669, -18794, 166844, 77151, -21251, -14553, 55402, 9118, -61637, -104973, -218063, -195750, -57792, 55747, 109056, 136733, 203005, 96999, 126263, 113850, 59611, 68544, -55365, -124972, -74473, -47456, -126387, -206684, -99249, -6560, 113676, 137448, 278895, 286706, 263964, 141260, 9342, -97265, -178362, -151063, 27974, 118062, 91108, 78948, 148185, 200639, 209680, 240961, 392872, 420196, 309854, 172784, 272280, 212641, 84902, 89001, 67710, -75033, -43731, 101621, 271480, 306005, 273052, 82831, 2208, 52849, 84691, -71311, -62443, 93654, 5765]
9465E765q2242J05760j501Q7068N4634j27246r5510Q3694j15689N8013J08549
9454H1295K3436M8960K3775k12758P662j05604K34671J79879p763j81056k5991
9443F6506J57301j16305L8555K55404j5003j68405k65577P4576K51112j8792q5523
9432A73849k472j7495N4390R7022J4157j02226n8708p8578j83457M0427J13143
9421E0052j0407K4597j23371q1512k4745O7230J23131M4464L6363J00529j15081
9410I1250k0264j20337M1780K34537j24668r8639K31520L3077r4883q0810j23093
9399c0530j04641j50487O8053l4692j4837J7651P9248M8414N9905N032K2777M8097
9387A3990m0407k3528J05019m4572m9884k0135j2631k0692o3760N3987l7194j65548
$$ y = [5765, -76477, 29283, 27782, 114850, 169484, 42238, -53272, 30422, -85267, -27254, 81295, 104731, 153691, 177466, -35292, -27630, -133234, 101437, 281316, 273553, 92497, 66506, 223807, 107502, 146057, 401461, 386458, 218053, -47524, 27052, 278164, 259372, 173849, 171377, 153882, 208272, 305294, 319451, 217225, 158517, 79939, -103518, -63091, 50052, 39645, 64242, -59129, -140641, -165386, -98156, 24975, 69439, 105802, 206331, 91250, 70986, -49351, -7571, 226966, 102298, 3659, 235179, 268256, 173373, 92563, -30530, -135171, -285658, -217605, -252297, -267134, -249483, -170235, -121821, -61916, -56884, -34107, 13990, -26417, -49945, 55074, 10502, -39382, -59517, -72148, -92840, -156600, -102613, -139807, -305355]
9375c05355R291m4615R7630J10396O2255l8642J77386J3030j45898J5006n8293
9364a07809M1337K21056n5398j15088p075n1431q6341O019n9801M0097Q9726Q0058
9352d650J24111K63870j306n0426j82736j18210k21064R951J51474J23200J11578
9341B05792m2429l903j651o2554l1624n6465j38162P9594j757K4959p412Q4988
9329D9376j0267P4667J15485j47412k83728O0595J71892L131J53523M4862M0385
9318B72509L5780r2427l0499j440k26031Q1721P5596n3296q0881j70781R4408
9307i5341R3340J38496M1732k071p8104N1619k5461l5328k08173p3508K14203
9296B1404J22170j30646O2301m5504J61672j384j51997j33050O1088J45575O332
$$ y = [-305355, -296064, -340679, -243049, -132653, -70398, -109040, 68346, 81376, -64522, -49516, -107809, -66472, 154584, 99186, -15902, -22977, -74408, -160749, -154730, -214531, -174434, -84708, -4650, 119461, 383331, 382025, 331599, 148863, 30653, -190411, -180460, -28986, 94214, 205792, 163363, 159460, 157809, 95255, 63631, 7166, -130996, -51402, -53159, -28200, -35612, 49376, 39109, 113776, 229261, 81849, -201879, -141284, 30608, 33739, 187262, 232124, 272509, 308289, 215862, 185363, 183923, -42108, 39613, 115209, 61913, -18968, -189749, -95341, -2001, 136495, 178227, 176156, 98052, 149671, 124210, 88882, -119291, -192799, 21404, 143574, 12928, 75229, 29725, 191397, 190013, 38016, -95034, -33946, 111629, 117961]
9285A17961m7580J2604K4865j50675R667J7984J97435o8023p2890j33707N1867
9274d0492N3278l2231k634P7109l9708o4182j58141r9128M5535J1806J04165J18908
9262b5715J14103M054m2803J59341J08058n9344N9105j43775o1585j00228J17543
9251A28754J7573q3860j87895k30906N7192J32147K59495Q1993J6680m1472j3781
9240A35920j0776J3607j47279N9257o5156n8968j58450m7127M5287J81312M1665
9229a0708j0548P0774Q7161m7903j5673N7341L2711R4988p7983M725J21542K1932
9217C28359j10574j19276p642r4019p8430J21737J8822r0586J26944j15425j6646
9206c6736n558l7935n3319K3012j22234l9064q3448J787J40866R8039m0471q4415
$$ y = [117961, 70381, 82985, 107850, -42825, -33158, -15174, 182261, 114238, 41348, -92359, -40492, 12786, -19445, -22079, 55030, 15322, -48860, -207001, -306129, -260594, -248788, -144623, -25715, 88388, 92442, 49639, 208980, 317038, 257694, 316799, 173024, 111439, 11211, 128754, 146327, 62467, -125428, -356334, -299142, -166995, 92500, 174493, 191173, 149701, 135920, 125144, 138751, -8528, 50729, -14427, -73395, -231845, -278972, -233685, -52373, -10708, -21256, 49518, 136679, 88776, 73103, 130444, 163155, 258143, 180160, 184885, 306427, 328359, 217785, 98509, 90867, -3152, -81582, 40155, 58977, -31609, 95335, -20090, -36736, -42294, -80229, -133548, -110536, -232770, -271834, -355282, -353495, -212629, -114590, -155061, -239476]
9194b39476K8935K7861Q4711L4394R4134J65023n3617n8306m1459K1226M9132
9183A12558m7064r388J9637j42725p3875O2488l3282K0229P016j34499J05357
9172a13548O3131r6360O9167J96342K4082M9474M6890q1123n9371R338J8350j1976
9160A14396n0692J49297J08992m3301j20650k04372j81383o4099O6790P2411J5150
9149a37461j7188k9927Q388Q7504K54273n2838j43977J11264L5947j75332n0778
9138a10125K10984J61539N2426P2792q7850j28622n8218L7274O9733j7j09628
9127A10288n7898q8671j11007j4176J02914J24160m295k23598P186J13539R5126
9116E3568j37086P0575r58j57252j48713O704K01673J19659J7358J61728K12436
$$ y = [-239476, -210541, -182680, -97969, -63575, 30559, 195582, 141965, 83659, 42200, 63426, 112558, 65494, 56106, 75743, -66982, -140857, -78369, -111651, -91422, -84406, -218905, -113548, -50417, -146777, -77610, 118732, 142814, 192288, 239178, 158055, 98684, 108022, 126372, 114396, 63704, 213001, 321993, 278692, 158042, -46330, -227713, -291812, -225022, -152611, -137461, -154649, -184576, -176188, -88684, 165589, 112751, -31226, 80038, 115985, -59347, -110125, 100859, 262398, 314824, 387616, 299766, 171144, 112926, 150200, 219933, 219916, 110288, 52390, -36281, -147288, -161464, -58550, 65610, 61315, -162283, -155097, -41558, 53568, -83518, -12943, -13901, -171153, -319866, -313162, -111489, 8170, 25528, 187256, 399692]
9105C99692o1488l9096k64424l04078k00917Q4832J05407Q931L5289M3553J03427
9094h8872O7332J9681N0369l9274m1178M0884j30466p2887M3057J60860r1244
9083h1738q9175R984r421J42828m4316n1674p45K80391J3599r6055j49137l5103
9071a10562o42k8347P228k0414Q778M8723J20080k5672j12157j43349P3918o4573
9059b46989N4031K17680J75078k3259k21817m8066q2241K454J9150j25000K4586
9048b54393J3333L4509Q7115L5706M1483l7891j47445O7718J1894J84832N8857
9037I5718j908o3130m4655O3007J16191j61627l0515l2197m757J8344l3632l5115
9025a14276k4126O8740J28024p3788j92102j127J10551M7136Q0094R8258K0011
$$ y = [399692, 338204, 299108, 34684, -269394, -470311, -385479, -280072, -271141, -235852, -192299, -88872, -21540, -1859, 48510, 9236, -31942, 8942, -121524, -194411, -151354, 9506, -81738, -170913, -160929, -170350, -27522, -71838, -123512, -124257, 156134, 169733, 73678, -75459, -110562, -111204, -139551, -132323, -152737, -143959, -95236, 24844, -828, -112985, -256334, -182416, -246989, -192958, 24722, 199800, 176541, -45276, -93342, -175583, -173129, -153979, -278979, -254393, -241060, -206551, -119436, -83730, -42247, -80138, -227583, -159865, -147971, 36861, 95718, 93810, 30680, -13975, 49032, 165223, 3596, -26919, -59116, -63873, -45529, -79161, -114276, -138402, -69662, 58362, -15426, -207528, -208655, -98104, -50968, 29126, 127384, 147395]
9014A47395p6253r1856O3926P1785j39309j57705Q0638O3298q366J7791n5675
9003h4331j98358l1044J00369J33451N6755j46939N942J31393N5940j87767q9034
8992b53623L4813l4803R8028J21400J60455J98544j52866l4679j30143L9458L5133
8981H1717r6619R3810L5378r352r8601J45904P4987o6314n5930j12168K9825p5216
8969e2579j4075j20952j37364J41227L02613J37824q0907k46513j64259J73218
8959f1767J32265R0506q0383M9141O0926O5624L3469l0488j4596k7228o7565J30984
8947B80888j0401j92567j90609J58513J56025R1965O0143j10065j23924j47049
8937b7081l4903R8372O8272k8632p5528K3988j5545M1216Q0671j6440J5038K8125
$$ y = [147395, 71142, -20714, 43212, 114997, -24312, -182017, -101379, -38081, -46447, -28656, -84331, -282689, -313733, -213364, -79913, -23158, -170097, -164155, -32762, 23178, -164589, -253623, -218810, -253613, -155585, -34185, 126270, 324814, 171948, 137269, 7126, 46584, 81717, -14902, 78908, 114286, 104934, 6333, 152237, 227224, 160910, 104980, -7188, 22637, -52579, -66654, -187606, -324970, -183743, 118870, 256694, 175787, -70726, -234985, -61767, 70498, 161004, 80621, 129762, 190688, 256312, 289781, 259293, 244697, 217469, 149904, 280888, 270487, 77920, -112689, 45824, 201849, 293814, 353957, 243892, 119968, -27081, -61984, 36388, 104660, 76028, 500, 24488, 8943, 50159, 130830, 114390, 129428, 157553]
8925A57553o8253p6546O5432o7201L4034J77795j69641O293K2847R959q4996L7445
8913D4721N8953n21k2571n6981q7377j82637j29305M0125L1430Q8233J70589J00609
8901E5268j35889j24115N5827R0609j64502j69691O5264O968J91091J44054j882
8890A3002l3292Q41K2416J12309j10740j56735l7662l4904L9350K01369R5089
8879A11043j22838k09061K6105r647P1767R7795J35055N3028J4888j78940O4J92922
8867A82181K0721j81296O3361M6176j24861p2887L3015q0085M0470J42240O1878
8856A30913j18310L0041M7887k26830q6170J39694p5052K8813L070j465P7715
8845d9694p2321j15509n1726P6993J13071L8784L9442k94m8297M187j47074m0075
$$ y = [157553, 89300, 12754, 78186, 10985, 45019, 222814, 53173, 59466, 82313, 92272, 7276, 44721, 103674, 103153, 80582, 23601, -63776, -246413, -375718, -335593, -304163, -215930, -45341, 55268, -80621, -204736, -148909, -58300, -222802, -392493, -327229, -320261, -129170, 14884, 13002, -20290, -19449, 2967, 115276, 4536, -152199, -189861, -224765, -185415, 15954, 111043, -11795, -220856, -194751, -204398, -132631, -34836, 100219, 153247, 168135, -10805, -10741, 182181, 202902, 21606, 84967, 131143, 6282, -66605, -33590, -113675, -73205, 69035, 130913, 12603, 42644, 90531, -136299, -222469, -82775, -157827, -129014, -125944, -127409, -49694, -122015, -237524, -289250, -212257, -99186, -60402, -20960, -21254, -69551, -65364, -212438, -252513]
8833b52513J75272P9679k68748O2101K29889P0688q3909k65397m8806J52256J04643
8822d4845K19113J93161P878m5306j65072j27291j48091O8648K13505O772k5295
8811A53177k2421L2586n2453q8631l8559P143Q258m7544l8102L5766N1761l8534
8799c7553O5808J31413J43096p0203m7749j87220M5163J3895m1246l0766J03220
8788H7858l928J08407J6198r6250p4381J36633O5624k26760j27236J1464q2103
8777a84474j0789j4546L1298q1898J94926K1507l5679J15323J52278j537j95593
8766i184j8213L3163N1685o6736p9311J06393J45456K24980k73046k85774k5639
8755a96226M7492k6998K4636J16719R3617j24962J7606Q489Q8104J16835k805
$$ y = [-252513, -77241, 2438, -266310, -204209, 25680, 96368, 12459, -252938, -301744, -149488, -44845, 174268, 367429, 375307, 330001, 164929, 37638, -110453, -41805, 171700, 178472, 153177, 130756, 163342, 110889, 22258, -16301, -9158, -900, -48444, -86546, -50780, 981, -37553, 28255, 159668, 302764, 232561, 184812, -2408, 42755, 56650, 15404, -15362, 87858, 83930, 192337, 208535, 112285, 37904, 174537, 240161, 13401, -113835, -102371, -184474, -195263, -209809, -178511, -260409, -65483, -43976, -79655, 35668, 187946, 186409, -9184, -27397, 5766, 57451, -9285, -88596, 17797, 163253, 388233, 115187, -170587, -196226, -148734, -175732, -151096, -34377, 59240, -65722, -48116, -39627, 48477, 165312, 162507]
8744A62507k11139j94438K5927K12498P005O1120p3582p8192K7p7313N0886Q4356
8732c0338K7774J02733R2427r818j33435p7527n7326p106j3646O4912m1721j53734
8720b36805l5338K43806K2189k47422J81372K03935j44114j37126m0038J37264
8710e2277R8955J6846K8028q9134j70850n7767r9534J03406J00040m359M6510
8699h0136P736L294K78J5085R3041l6798j1075J24364M2600q4389P5880K5542
8687A75422p5649q664J8025j04689N0807o4213m7240K52217J9017j8570j36464
8676E9999j01975j9673J72072J36713K9199j66827q2644N6465q2682o1119k8314
8665h8786j8235l8784J75030J20983j34760j91216n4714P7314o6569M7710J23819
$$ y = [162507, -48632, -243070, -217143, -4645, 2360, 63480, -10102, -88294, -88267, -165580, -114694, -30338, -2564, 100169, 192596, 182778, 49343, -28184, -85510, -92616, -106262, -41350, -83071, -236805, -272143, -28337, -6148, -253570, -72198, 131737, -12377, -149503, -189541, -52277, 46678, 63524, 91552, 2418, -168432, -226199, -325733, -222327, -122287, -126646, -80136, -72400, -69106, -68828, -53743, 39298, 2500, -8575, 115789, 158389, 74000, 149880, 175422, 99773, 91109, 109134, 4445, 55252, -8961, -56201, 196016, 215033, 196463, 59999, -41976, -61649, 110423, 247136, 276335, 109508, 26864, 83329, 647, -60472, -88786, -107021, -145805, 29225, 150208, 15448, -175768, -230482, -153168, -219737, -172027, -48208]
8654d8208K49679j3134j53123m503J10170m0408j60974O3189J54681j03892k0742
8643C2735J17173p8370n0310K3942J47292N2198j43972m2255P9891J00192q32
8632B37684k34965j42842N798K35286O9010j5996j73407O8586J54563O7566k0910
8621B50373n7920J2625o5482j29022j97539p6403M8709j02752L3410J8797O6225
8610a98979J19468j4520q231l1964j6408R3613n140m3916J46375q904j59700p0382
8598a98688L8684Q6044R026J6847J03471o4248M0144K8805j1753J1394r0111J48766
8586A18381J25032p7171j06139j68527J1694J12029J1855q2539j06453n6516r3643
8575c11997K45265J29600j60226k1156j29579n734L0294j4709J49194m3086Q5316
$$ y = [-48208, 201471, 188337, 35214, 30711, 140881, 100473, -60501, 2688, 157369, 53477, 32735, 149908, 71538, 21228, 45170, 192462, 244660, 100688, 58433, 138324, 238516, 237684, 2719, -140123, -134325, 100961, 169971, 153975, -19432, 49154, 203717, 271283, 250373, 192453, 205078, 139596, 10574, -186965, -263368, -214659, -317411, -284001, -265204, -198979, -79511, -94031, -102262, -134226, -150634, -57021, -62161, -106077, 40298, 31394, -128306, -198688, -160004, -73960, -64934, -48087, 55384, -8864, 31280, 60085, 48332, 59726, -30385, 118381, 243413, 166242, 60103, -108424, -96730, 15299, 27154, -55385, -161838, -218354, -311997, -66732, 62868, -97358, -118514, -248093, -253827, -223533, -238242, -89048, -132134, -46818]
8564d6818j10880o8432J73208K498J5489J28556P0287k2745r6620L0764R206N4501
8552A39014k1903j48124r7638O9528j04201K2566L1771q8664q8342J34120L8469
8541a13404l0477J10454M3117j05614j56946q925K1768J62369j7115n8739J50977
8530b535r858m5925k3555N3233J25736k0071m2695j27234J57181M5952K0131O9569
8518A99929k3692q3739j76017r4856J37513J79798n5095j67139j03727n2544K4780
8507b14789J43326M1606P8921K8696O403L0342N2189j9176q7558n4521L2622K31365
8495B69426j15631j08075m9454n6654J44606L6561r5745o5650l9756J7541j11236
8484a74067j96568n1755J45136Q0686p6001K08197J02946k40818O8390P0223m7029
$$ y = [-46818, -157698, -226130, -52922, -50424, -34935, 93621, 163908, 141163, 44543, 75307, 84513, 139014, 117111, -31013, -128651, -59123, -163324, -140758, -108987, -197651, -285993, -151873, -113404, -143881, -33427, 9690, -95924, -252870, -261795, -240027, -77658, -94773, -153512, -2535, -12393, -58318, -81873, -28640, 97096, 77025, 34330, -92904, 64277, 110229, 130360, 199929, 176237, 92498, -83519, -178375, -40862, 138936, 83841, -83298, -187025, -239569, -214789, -71463, -29857, 49064, 77760, 84163, 114505, 166694, 147518, 59960, 5439, 38061, 269426, 153795, 45720, -3734, -60388, 84218, 120779, 25034, -40616, -80372, -62831, -174067, -370635, -422390, -277254, -196568, -272569, -64372, 38574, -202244, -133854, -63631, -110660]
8473a10660Q4617N8362O7441O0103p2681k85098l5128R9099q4417J41093R4376
8462A7107J06264P9661j9089n5891p8007p3098o78J60426J39225j83320j3195
8451G9405k9203j08849O5898J33507J68402J7471k5638N7996j09930j44572j39617
8440c5130j16161j24738P6894J42774J38115j2550o1115O2487o923j64205p1890
8429a72442Q3909l3834J06124J31953j6590n0436L4923N6184l07320Q3999J31117
8418D7587q515n688j60580L3089J59369J30885q6475n4027N0671j2955P8492q081
8406A63772r714J53833o4545p0100Q9179q612j97751j41535j1060K5082Q622r1075
8394a53904R8677J21425o6999J9455J94603j6950l8681j50665K276J07608j03821
$$ y = [-110660, -26043, 32319, 99760, 159863, 87182, -197916, -233044, -133945, -218362, -77269, 17107, 123371, 203032, 183943, 128052, 50045, -23053, -23731, 136695, 275920, 92600, 79405, 50202, -58647, 7251, 140758, 309160, 326631, 300993, 358989, 249059, 104487, -35130, -151291, -276029, -199135, -56361, 81754, 69204, 8089, 70576, 63653, -100552, -172442, -88533, -122367, -16243, 115710, 99120, 48684, 83607, 139791, -167529, -83530, 47587, 39072, 33384, -127196, -94107, 65262, 196147, 109672, 55645, 106316, 93361, 171853, 163772, 154058, 307891, 243346, 173246, 262425, 253813, 56062, -85473, -96533, -71451, -62829, -153904, -55227, 66198, -801, 18654, 213257, 196307, 157626, 6961, 9237, 116845, 13024]
8383A3024N4736O7598L7931j91423q7653j73535L061J26017O2124L6415J11454
8372E9749m5986q3256K6845j58396m512K7872n5570Q6866J07730M615M091J60893
8360A30941n0627r756j00047j14447K491P1269L0740o3323k0478k21753O4112
8349b80878K98472r8491l0234O2156P4977N0213j31875k48818j9543J62875K1069
8338a40077n3177r813m5284j9159L3432O5300J00195K0004l193j5716K6219r1308
8326a32577J2349J11579J09587J56458P0725k22534j74137o3691J0749l9427o5332
8315b26251O8487J04659k3971Q9289R7027o1726o1183O1754J14095j65854j03154
8304a06828p5588J83600J43095J01829J12551r1851j1848j29340j69881j9439
$$ y = [13024, 67760, 135358, 173289, -18134, -105787, -279322, -276261, -150244, -88120, -51705, 59749, 13763, -69493, -42648, -201044, -205556, -177684, -233254, -146388, -38658, -34043, -29952, 130941, 80314, 70558, -29489, -143936, -141445, -70176, -39436, -102759, -123237, -344990, -280878, 17594, -80897, -111131, -48975, 26002, 76215, -55660, -304478, -324021, -161146, -140077, -193254, -203067, -248351, -267510, -234078, -168778, -68583, -48579, -51772, -67488, -41269, -132577, -120228, -8649, 100938, 257396, 328121, 105587, -68550, -132241, -121492, -160919, -226251, -157764, -53105, -77076, 12213, 109240, 47514, -13669, 48085, 162180, -3674, -106828, -182416, 1184, 144279, 246108, 358659, 266808, 254960, 125620, -44261, -63700]
8294f3700l498O870J71169j8297o2482J248M0587M3851j21241J03766k5371j25346
8282e2444J21999P0254j24822L5843P8783k30726l2132L789K08977Q4788j45948
8271A8361l7015O316P0669O3531p9691o1622K2184N1906K7470l9172o7655J33619
8259A08901j2806k34740j30091K8614j2664J88667J91580N3045L5511J24122r2469
8248B47670j17465r5643j51768n5335Q8185j8657O0497Q2195p2741J9141L264
8237a0657j00824k1511j6554m3695j08771J54494M8948o5917k7632L9883n5793
8226b08029J03377j80031M9866J93024R3625j9705O7406J57233k9386j2176l0659
8215A84545n9202j34251m3389r975q2197j11192P2777J04020R7471n4770m3961
$$ y = [-63700, -67198, -60328, 110841, 92544, 30062, 31310, 71897, 115748, -5493, 98273, 72902, -52444, 69555, 139809, 14987, 50830, 129613, -101113, -133245, -129456, 79521, 164309, 18361, -18654, -12338, 58331, 121862, 42171, -19451, 2733, 54639, 82109, 42937, -24718, 108901, 96095, -138645, -268736, -240122, -252786, -64119, 127461, 180506, 216017, 340139, 247670, 130205, 34562, -117206, -172541, -84356, -103013, -42516, 39679, -33062, -13921, -10657, -111481, -132992, -149546, -193241, -302012, -147518, -98570, -164487, -192119, -152236, -208029, -104652, -284683, -234817, -41793, 51832, 32127, 99533, 256766, 227380, 215204, 184545, 125343, -8908, -52297, -62272, -144469, -255661, -182884, -78864, 18607, -36163, -80124]
8204h0124J4157P5122J53101K719k09960j26139j1759Q7368r7773L781L7477J75230
8192B3200O1265j24665q6037p1644j8907K5027o1685J59583J28988j61755J64819
8181C8189K14662J47364j44997k46128j45845r5228p3289J30544K7346K5492j26364
8170b48254l4898P8083J55086P6356j4869Q2767J08344l5628J5132M9851j35005
8159I6965n5074j01010L2768k3791J04114n4585k7882J56250J25423m6268k06474
8148D36n6232m7539j77649j5581N2996J0113J89948J00466n4126N25m7491J14523
8136G0389j6591k6579p7407r9544n074k6996J64330K2263K9516r918j02374k924
8124h0909j3193l9072l1295J05646J15732j8883P419J4508O2887m1531q2697j13302
$$ y = [-80124, -65967, 9155, 162256, 164975, -44985, -171124, -182883, -95515, -193288, -189507, -152030, 23200, 84465, -40200, -126237, -197881, -216788, -191761, -253446, -93863, 35125, -126630, 38189, 252851, 400215, 255218, 9090, -136755, -231983, -305272, -174728, -147382, -121890, -248254, -283152, -205069, -49983, 26373, 11504, 94271, 202615, 166987, 182119, 231970, 96965, 41891, -59119, -26351, -50142, 53972, -613, -28495, 127755, 253178, 206910, 436, -55796, -103335, -280984, -296565, -243569, -233456, -43508, 56958, 2832, 3357, -44134, 70389, 53798, 27219, -50188, -149732, -154806, -181802, -17472, 4791, 34307, 24389, -77985, -80909, -94102, -133174, -164469, -58823, 56909, 38026, 45445, 59953, 122840, 81309, -1388, -114690]
8112a14690J2092N0951J6794J32530N9609M1282j20441o2672N104J43379j25270
8101C8668l6015J0022J9143q397o0284k40114o7017J32071j1998M8640J90662
8090A5381j47565n7207L7499J47308p9803J32184k131N0211J4175k8784j2858
8079F8410L2805J16537O176q4046j26317K03784j6444k3727o8148L1688o3127
8068G7591k37599j00999K03461J08331P2968K1040j97629o3151L5185M7902R4264
8057F1364K8066r2118j07187j33498K8001J88972Q0166J65272P0526k68206j88156
8046a66798J1368J24753J29126n1262j06950k4668p4214k12011j01888Q3541J00824
8035b88179J17872M5533m1475L9961R5973p798k9263J571K44476P5771q8924j64374
$$ y = [-114690, -102598, -51647, -34853, 97677, 157286, 198568, 78127, 15455, 20559, 163938, 38668, 2653, 12675, 31818, 23421, -36863, -276977, -343994, -211923, -223921, -175281, 15381, -132184, -189391, -151892, -4584, -84387, 47797, 45666, 95877, 110052, 81268, 68410, 101215, 217752, 223928, 139882, 13565, 217349, 200905, 177178, 109030, 140718, 77591, -160008, -261007, -57546, 50785, 123753, 144793, -52836, -115987, -80802, -32900, 61364, 89430, -2688, -109875, -243373, -215372, -26400, 53766, 219038, 289564, 21358, -166798, -155430, -30677, 98449, 47187, -59763, -84431, -158645, -370656, -472544, -389003, -288179, -170307, -124774, -166249, -126288, -30315, -38113, -67376, -65805, 178671, 254442, 165518, 1144]
8023A144p8806N6406n01K2628R3272J6228k3545j58906M9821N5216q9709J5561
8011d1191m2633l1377l6696o5385J19140l2061K676p641l9395l9284M1014N1548
7999a21285r9814J5954J61475J79963N45r0522j1184J512n5497p0004p0773K9824
7987a29806K69083k6617j0728l8254k641K7329j36467m9176o0161o5577P5017
7976a47998N7357R8699L7345n566o3324m253M3987n4068o0641n5965J77587J23316
7964A46476M1875j10088k36485J0185J57301P1837k6170l4329j49869o6361J64096
7953c1532n3785J07616J6982l6332J6625r1529k9991K9211K48186P9698j54299
7942A00850k33048Q4649Q1988J18985K23758J1223l7914j28260l4302m6809L1547
$$ y = [1144, -77662, -21256, -21757, 871, 94143, 110371, 86826, -72080, -22259, 32957, -56752, -41191, -83824, -115201, -151897, -217282, -98142, -130203, -127527, -135168, -174563, -213847, -172833, -121285, -221099, -205145, -43670, 136293, 136838, 46316, 35132, 36644, -18853, -88857, -159630, -129806, 139277, 112660, 101932, 63678, 61037, 88366, -48101, -97277, -157438, -223015, -147998, -90641, 8058, 45403, 39837, -23487, -27740, 16247, -37821, -98462, -154427, 23160, 146476, 188351, 78263, -158222, -148037, 9264, 81101, 54931, 20602, -129267, -195628, -31532, -85317, 22299, 39281, 2949, 19574, -71955, -101946, -72735, 175451, 255149, 100850, -132198, -47549, 34439, 153424, 377182, 388405, 350491, 222231, 187929, 141120, 172667]
7931A72667l5572j57979J56095M5256k0872m9925j99907o742k8365O311J33649
7920A4616m1358j6181K09859N5719q0275p6083j52264J02824j03427M6842J54389
7909A14661J8613p7454j28671K0906J49826n6527l7232l2003N6497j24803r0936
7898a87123M5654J06319Q7381M8378J70630n7449o2313j17933k7511J97612J0710
7887B14355r6780j82911j4005J44633N6348Q3661m6397o460P609j20808l4189
7876E056J84291K2373r4314q1825p1720k29445J62771J37425q4126j57307K7162
7865a79659O1445k83213K1280J19582J26630L09293o7165j13921j09711L1933
7855h3506J22604J46646J26750L8611j39029k27255j66063N9274n459J65002o1808
$$ y = [172667, 137095, -20884, 135211, 180467, 159595, 109670, -90237, -96979, -125344, -119033, 14616, -26742, -42923, 166936, 222655, 142380, 66297, -85967, 16857, -86570, -39728, 114661, 133274, 55820, -72851, -51945, 97881, 41354, 4122, -27881, 28616, -96187, -187123, -141469, -35150, 52231, 100609, 271239, 213790, 151477, 33544, 6033, 203645, 214355, 117575, -65336, -79341, 65292, 121640, 205301, 158904, 152444, 160053, 39245, 5056, 189347, 211720, 117406, 35581, -36139, -265584, -102813, 34612, -49514, -206821, -179659, -118214, -401427, -380147, -260565, -133935, 175358, 108193, -5728, -115439, -83506, 39098, 185744, 312494, 351105, 212076, -15179, -181242, -121968, -127427, 37575, -24233]
7844b4233j07868J610J61574J22173j53317k39608j9227k8520O3069L7270Q1332
7833a05745J86209J84530L5941q629L1983k171r5904r5318j09997L9982J8058
7822G8939L5183j23619j94096r9549m2679l3505J40124K42114J26528m0525l2549
7811E6366j07863j4161q0415j21899o2132R1559R7456Q9270R80J5024Q8579j22810
7799g0046k7151k9518N9483P8991O0618j08651k00219j57311L6612L1254J5386
7788c10552k7019n9379O9568J46888Q3642k6156J3262N2918k1055p374l3883N110
7776a14030l4961J08329p8584j72672L1235k3804j1044J25923J18513J02054n9465
7765h506L9254P1607n0337j48046L8865K873m9120J8359P7122m4853O0543R1446
$$ y = [-24233, -132101, -130491, 31083, 153256, -61, -239669, -258896, -287416, -224347, -187077, -105745, 80464, 264994, 300935, 292306, 324289, 322118, 226214, 130896, 20899, 60881, 78939, 114122, -9497, -203593, -303142, -345821, -379326, -239202, 2912, 129440, 88915, 56366, -51497, -65658, -146073, -267972, -330104, -238545, -141089, -51819, -50839, -35815, 52764, -70046, -97197, -126715, -67232, 11759, 72377, -36274, -236493, -393804, -357192, -325938, -310552, -337571, -396950, -327382, -180494, -96852, -123008, -109746, -56828, -77883, -85257, -119140, -114030, -148991, -40662, -119246, -291918, -260683, -284487, -295531, -169608, -51095, 50959, -8506, 30748, 102355, 52018, -96028, -57163, -54290, -103410, -85051, -7929, -52782, 7761, 99207]
7753I9207l5466q213k1032L4213j57340r4078J87802j9995j30373o2837j6138
7742b24250L799n203J08205M9435J3265p9225j85749q5544O5019Q3705K01271
7731e5272K35993J77559r3565p4189n2572r3608K1965j27433M239J65578l6357
7720G2338O1710J72750l6061L5701K3873r9523p0781j09135n4431n3922O2266
7709D785Q7455q6159L9740q4605j21156O6091J15013l398q1998j7132n0559r6607
7697b28530k831P0767K31856J43130p182l5626q931q9504n7692j26671k3802l6056
7685a71072l630K42656N7180p226J10461N3285k6744j57525j20709l2077n0209
7674a05610J22277l8847j09084J332L0983j21310q7729q733K09017P9459k526
$$ y = [99207, 63741, 55528, 34496, 68709, -88631, -182709, 5093, -14902, -145275, -208112, -224250, -220451, -225654, -117449, -68014, -54749, -133974, -319723, -405267, -340248, -256543, -55272, 180721, 358280, 264715, 190526, 137954, 44346, 66311, -61122, -56883, 108695, 72338, 134048, 306798, 270737, 306438, 330311, 230788, 160007, 50872, -3559, -57481, 4785, 92240, 6081, 45821, -38784, -159940, -93849, 21164, 17766, -64232, -81364, -131923, -228530, -231361, -160594, 71262, 214392, 207210, 171584, 162653, 73149, 15457, -111214, -135016, -171072, -174702, 67954, 125134, 117908, 228369, 281654, 254910, 97385, -23324, -55401, -105610, 16667, -22180, -131264, -129932, -98949, -220259, -307988, -316721, -107704, -28245, -30771]
7663c0771J18778j2243p400J8391j25518k07755k0087J79549O0244j37006q9158
7652b52976r3337M9076O7184J16234Q9865m2476l0953K8279J23957Q1595J49756
7641B86204N0735o7074k88461j79163N9220J20286k02142q5609J06791J28395
7631g0818r663J5275P6124L64j83988M0806r5561K5925L06712K5133k56595k0548
7619a46834M3927J5450m1031j0084J37041N0893M936j883o538j0459j15772n9624
7607a39978m1269O8903J94126l533n4760l7328R6001k8597j53325o6513J03746
7596f2527J3152n0992p6276O5795j7230J5869j957L2812J9486J0247J22298L9725
7584A10402o2938J05490P8536k8j28777k1682m6429P3268O6970J4561R417k06477
$$ y = [-30771, 88007, 75764, 68364, 86755, -38763, -246518, -266605, -87056, -26812, -163818, -252976, -346313, -297237, -230053, -113819, -23954, -66430, -97383, -69104, 54853, 136448, 286204, 336939, 269865, -18596, -197759, -138539, -18253, -220395, -306004, -199213, -70818, -80481, -65206, 10918, 11282, -172706, -131900, -227461, -201536, 105176, 130309, -126286, -146834, -102907, -87457, -128488, -138572, -1531, 49362, 54298, 52415, 45877, 35418, -80354, -139978, -181247, -112344, 81782, 78249, 23489, -13839, 82162, 53565, -99760, -166273, -62527, -49375, -100367, -176643, -110848, -128078, -112209, -114166, -81354, -61868, -51621, 70677, 110402, 47464, 152954, 231490, 231462, 102685, 81003, 34574, 107842, 174812, 189373, 198790, -7687]
7572g687j1819k6150M4282L3444o5927p8969J42733k5952J34537L6909j78962
7561c561O079J20332J99709q4164J303J10709j10856k09251r3742P9967J637r0549
7549g2387r3999P3017P0108o4992j58757o828j9034Q6166M8099j6686l1497Q4855
7537a01935k22531j19734N3663N8025J95256J33197n1894j2170J4430M1700l4890
$$ y = [-7687, -19506, -45656, -1374, 32070, -33857, -112826, 29907, 3955, 138492, 175401, -3561, 2518, 122850, 322559, 238395, 239698, 350407, 239551, 30300, -63442, 16525, 18162, -72387, -166386, -93369, -23261, -88253, -247010, -253838, -272872, -186706, -138607, -155293, -186790, -101935, -324466, -444200, -390537, -332512, -137256, -4059, -55953, -68123, -53693, -11993, -46883]
$$ [...]
##END NTUPLES=NMR SPECTRUM
##END=
