##TITLE=Analysis number 311963
Compound Code mwp 00091
Project Code adrs
Chemist Name endeavour
##JCAMPDX= 6.0         $$ Bruker NMR JCAMP-DX V2.0
##DATA TYPE= NMR SPECTRUM
##DATA CLASS= NTUPLES
##ORIGIN= Bruker BioSpin GmbH
##OWNER= NMR
$$ XWIN-NMR		Version 3.5
$$ Wed Jul 20 15:53:26 2005 GMT Daylight Time (UT+1h)  MAYBRIDGE\NMR@NMR_250MHZ
##.OBSERVE FREQUENCY= 250.131544655141
##.OBSERVE NUCLEUS= ^1H
##.ACQUISITION MODE= SIMULTANEOUS (DQD)
##.ACQUISITION SCHEME= undefined
##.AVERAGES= 16
##.DIGITISER RES= 18
##SPECTROMETER/DATA SYSTEM= dpx250
##.PULSE SEQUENCE= zg30
##.SOLVENT NAME= CDCl3
##.SHIFT REFERENCE= (INTERNAL, CDCl3, 0, 16.522)
##AUDIT TRAIL= $$ (NUMBER, WHEN, WHO, WHERE, WHAT)
$$ ##TITLE= Audit trail, XWIN-NMR		Version 3.5
$$ ##JCAMPDX= 5.01
$$ ##ORIGIN= Bruker BioSpin GmbH
$$ ##OWNER= NMR
$$ C:\u/data/dgb/nmr/ADRS/6190/pdata/1/auditp.txt
$$ ##AUDIT TRAIL=  $$ (NUMBER, WHEN, WHO, WHERE, WHAT)
(   1,<2005-07-20 15:52:56.49 +100>,<MAYBRIDGE\NMR>,<NMR_250MHZ>,
      <created by zg, POWCHK disabled, PULCHK disabled
       configuration hash MD5:
       62 19 C7 07 E1 42 D1 B7 37 6C 3D D0 77 39 F9 E6
       data hash MD5: 64K
       BD 8D 30 11 7A 88 86 00 CC 01 8A D9 C2 A3 75 1C>)
(   2,<2005-07-20 15:53:12.66 +100>,<MAYBRIDGE\NMR>,<NMR_250MHZ>,
      <Start of raw data processing
       ef LB = 0.3 FT_mod = 6 PKNL = 1 SI = 32K 
       data hash MD5: 32K
       CE 88 28 09 6D A0 8A 48 2D 5B C9 CC 1A 56 2F 6A>)
(   3,<2005-07-20 15:53:14.57 +100>,<MAYBRIDGE\NMR>,<NMR_250MHZ>,
      <apk 
       data hash MD5: 32K
       09 54 E2 EE 71 40 51 6D 6F 52 AF A3 69 B7 44 A0>)
(   4,<2005-07-20 15:53:15.46 +100>,<MAYBRIDGE\NMR>,<NMR_250MHZ>,
      <abs ABSG = 5 
       data hash MD5: 32K
       E2 86 DD 93 65 02 5D A5 2C 8B 3B 8E 39 02 46 DD>)
$$ ##END=
$$ 
$$ hash MD5
$$ 40 9D 36 87 E0 F2 7D 22 24 D7 80 35 26 FF 2D A8
##$RELAX= 
##$RELAX= 
##$RELAX= 
##$RELAX= 
##$RELAX= 
##$RELAX= 
##$RELAX= 
$$ Bruker specific parameters
$$ --------------------------
##$DU= <C:\u>
##$EXPNO= 6190
##$NAME= <ADRS>
##$PROCNO= 1
##$TYPE= <nmr>
##$USER= <dgb>
##$AMP= (0..31)
100 100 100 100 100 100 100 100 100 100 100 100 100 100 100 100 100 100 
100 100 100 100 100 100 100 100 100 100 100 100 100 100 
##$AQSEQ= 0
##$AQ_mod= 3
##$AUNM= <au_zg>
##$AUTOPOS= <47 >
##$BF1= 250.13
##$BF2= 250.13
##$BF3= 250.13
##$BF4= 250.13
##$BF5= 500.13
##$BF6= 500.13
##$BF7= 500.13
##$BF8= 500.13
##$BYTORDA= 1
##$CFDGTYP= 0
##$CFRGTYP= 5
##$CHEMSTR= <none>
##$CNST= (0..31)
1 1 145 1 1 1 1 1 1 1 1 1 1 1 1 1 1 1 1 1 1 1 1 1 1 1 1 1 1 1 1 1 
##$CPDPRG= <>
##$CPDPRG1= <>
##$CPDPRG2= <>
##$CPDPRG3= <>
##$CPDPRG4= <mlev>
##$CPDPRG5= <mlev>
##$CPDPRG6= <mlev>
##$CPDPRG7= <mlev>
##$CPDPRG8= <mlev>
##$CPDPRGB= <>
##$CPDPRGT= <>
##$D= (0..31)
0 1 0 0 0 0 0 0 0 0.06 0 0 0 0 0 0 0.0002 0 0 0 0 0 0 0 0 0 0 0 0 0 0 
0 
##$DATE= 1121871175
##$DBL= (0..7)
120 120 120 120 120 120 120 120 
##$DBP= (0..7)
150 150 150 150 150 150 150 150 
##$DBP07= 0
##$DBPNAM0= <>
##$DBPNAM1= <>
##$DBPNAM2= <>
$$ [...]
##$SUBNAM7= <"">
##$SUBNAM8= <"">
##$SUBNAM9= <"">
##$SW= 20.6930455092707
##$SWIBOX= (0..15)
0 0 3 0 0 0 0 0 0 0 0 0 0 0 0 0 
##$SW_h= 5175.983436853
##$TD= 65536
##$TD0= 1
##$TE= 295.16
##$TE2= 300
##$TE3= 300
##$TEG= 300
##$TL= (0..7)
0 120 120 120 120 120 120 120 
##$TP= (0..7)
150 150 150 150 150 150 150 150 
##$TP07= 0
##$TPNAME0= <>
##$TPNAME1= <>
##$TPNAME2= <>
##$TPNAME3= <>
##$TPNAME4= <>
##$TPNAME5= <>
##$TPNAME6= <>
##$TPNAME7= <>
##$TPOAL= (0..7)
0.5 0.5 0.5 0.5 0.5 0.5 0.5 0.5 
##$TPOFFS= (0..7)
0 0 0 0 0 0 0 0 
##$TUNHIN= 0
##$TUNHOUT= 0
##$TUNXOUT= 0
##$USERA1= <user>
##$USERA2= <user>
##$USERA3= <user>
##$USERA4= <user>
##$USERA5= <user>
##$V9= 5
##$VALIST= <valist>
##$VCLIST= <CCCCCCCCCCCCCCC>
##$VD= 0
##$VDLIST= <DDDDDDDDDDDDDDD>
##$VPLIST= <PPPPPPPPPPPPPPP>
##$VTLIST= <TTTTTTTTTTTTTTT>
##$WBST= 1024
##$WBSW= 4
##$XGAIN= (0..3)
0 0 0 0 
##$XL= 0
##$YL= 0
##$YMAX_a= 422146
##$YMIN_a= -401683
##$ZGOPTNS= <>
##$ZL1= 120
##$ZL2= 120
##$ZL3= 120
##$ZL4= 120
##$ABSF1= 16.522
##$ABSF2= -4.171173
##$ABSG= 5
##$ABSL= 3
##$ALPHA= 0
##$AQORDER= 0
##$ASSFAC= 0
##$ASSFACI= 0
##$ASSFACX= 0
##$ASSWID= 0
##$AUNMP= <proc_1d>
##$AZFE= 0.1
##$AZFW= 0.1
##$BCFW= 0
##$BC_mod= 0
##$BYTORDP= 0
##$COROFFS= 0
##$CY= 12.5
##$DATMOD= 1
##$DC= 0
##$DFILT= <>
##$DTYPP= 0
##$F1P= 14.0000005364418
##$F2P= -0.99999901652339
##$FCOR= 0.5
##$FTSIZE= 32768
##$FT_mod= 6
##$GAMMA= 0
##$GB= 0
##$INTBC= 1
##$INTSCL= 1
##$ISEN= 128
##$LB= 0.3
##$LEV0= 0
##$LPBIN= 0
##$MAXI= 10000
##$MC2= 0
##$MEAN= 0
##$ME_mod= 0
##$MI= 0
##$NCOEF= 0
##$NC_proc= -2
##$NLEV= 6
##$NOISF1= 0
##$NOISF2= 0
##$NSP= 0
##$NTH_PI= 0
##$NZP= 0
##$OFFSET= 16.522
##$PC= 1
##$PHC0= -79.93482
##$PHC1= 5.963184
##$PH_mod= 1
##$PKNL= yes
##$PPARMOD= 0
##$PSCAL= 4
##$PSIGN= 0
##$REVERSE= no
##$SF= 250.13
##$SI= 32768
##$SIGF1= 0
##$SIGF2= 0
##$SINO= 400
##$SIOLD= 32768
##$SREGLST= <1H.CDCl3>
##$SSB= 0
##$STSI= 32768
##$STSR= 0
##$SW_p= 5175.98343685301
##$SYMM= 0
##$S_DEV= 0
##$TDeff= 65536
##$TDoff= 0
##$TI= <Analysis number 999999
Compound Code 99
Book Reference 9
Project Code 9>
##$TILT= no
##$TM1= 0
##$TM2= 0
##$TOPLEV= 0
##$USERP1= <user>
##$USERP2= <user>
##$USERP3= <user>
##$USERP4= <user>
##$USERP5= <user>
##$WDW= 1
##$XDIM= 32768
##$YMAX_p= 271521977
##$YMIN_p= -61606
$$ End of Bruker specific parameters
$$ ---------------------------------
##NTUPLES= NMR SPECTRUM
##VAR_NAME=  FREQUENCY,     SPECTRUM/REAL,   SPECTRUM/IMAG
##SYMBOL=    X,             R,               I
##VAR_TYPE=  INDEPENDENT,   DEPENDENT,       DEPENDENT
##VAR_FORM=  AFFN,          ASDF,            ASDF
##VAR_DIM=   32768,         32768,           32768
##UNITS=     HZ,            ARBITRARY UNITS, ARBITRARY UNITS
##FACTOR=    0.157963299565203, 1,           1
##FIRST=     4132.6476996994, 0,             0
##LAST=      -1043.33573715361, 0,           0
##MIN=       -1043.33573715361, -61606,      0
##MAX=       4132.6476996994, 271521977,     0
$$ Real data points
##PAGE= N=1
##DATA TABLE= (X++(R..R)), XYDATA
$$ [...]
18761B73477l2324k2495q480j1930J641O834J9857L0207O24j1626k1020j8841
18749B05924k7455k8809j7058m250m310j6342m334j3480m520o343L22P794r240
18736G7899K948J4372Q694k406k3n899J020p75N01P183J0418R285N310N297J47
18721A33971J2579k861j1537k2011l594J1298N784k253J6836K425N478j2423j4661
18708A19031n239k19P461p416N962K6038O304n048j859j3822j6477j3841m816
18695I6059Q485J5417K573l3589j1164L613m490j5457n40j2810j698J7700R65
18682F5064k0j5141j5123k960q523k2311p94K0747N768O497J3274r993j5833N909
18668B6561O732N964R001o155r127j8731J56N584j3504Q243j2104o583J2826J2303
$$ y = [273477, 241153, 218658, 210178, 198248, 199889, 206723, 226580, 256787, 257411, 245785, 224765, 205924, 178469, 149660, 132602, 128352, 124042, 107700, 103366, 89886, 85366, 79023, 79345, 87139, 77899, 80847, 95219, 103913, 101507, 101484, 95585, 96605, 95830, 96331, 103514, 113932, 123217, 128527, 133824, 133971, 146550, 143689, 132152, 110141, 106547, 117845, 123629, 121376, 138212, 140637, 146115, 133692, 119031, 113792, 113573, 121034, 113618, 119580, 145618, 151922, 146874, 145015, 131193, 114716, 100875, 96059, 104544, 119961, 122534, 88945, 77781, 81394, 76904, 61447, 60907, 48097, 46399, 64099, 65064, 65044, 49903, 34780, 31820, 23297, 986, 192, 20939, 26707, 33204, 46478, 36485, 20652, 26561, 33293, 39257, 48258, 42103, 32976, 14245, 14401, 19985, 6481, 14724, 2620, -3963, 8863, 21166]
18654B1166q219p637J3432J3621J1931O434P935k4147o447O379j15p371K371J5928
18640D5261L534r948q421Q756R072p467r767n480J4342R56j5790k453K130j572
18626B3153L960Q514J286q253j0398J385Q092K651l531mj159M840M739J3326J2704
18611F1305L554j274M302N40m520Q975J2314m869j2549j746k078q010J852l804
18597E3992J354r213Q761j1069N358o649k0418j6467K249N471J6987J2768p092
18584C6032r170L949K1704N98j7682j1150J395J2833M270M743l407o433J414j040
18570C8056K651r959j3058Q830K4581L184j8398k2502q90K957n157J2006Q330
18557C0631m998M916m78j1435L335M159j838Q692m02R030Q057K399l334q516j4175
$$ y = [21166, 12947, 5310, 18742, 32363, 44294, 50728, 58663, 34516, 28069, 34448, 34333, 26962, 29333, 45261, 48795, 38847, 30426, 39182, 48254, 40787, 31020, 25540, 39882, 40838, 25048, 22595, 24725, 23153, 27113, 35627, 36913, 28660, 18262, 19647, 27739, 30390, 26859, 26855, 25696, 30536, 35275, 48601, 61305, 64859, 63585, 67887, 68427, 63907, 72882, 85196, 80327, 67778, 66032, 63954, 55944, 57796, 53992, 55346, 46133, 54894, 43825, 49183, 42534, 22116, 5649, 7898, 13369, 30356, 43124, 36032, 26862, 30811, 52515, 53113, 35431, 24281, 25676, 38509, 42779, 47522, 44115, 37682, 39096, 38056, 40707, 30748, 17690, 26520, 51101, 54285, 35887, 13385, 12495, 15452, 10295, 22301, 30631, 25633, 30549, 30071, 18636, 21971, 26130, 24292, 32984, 32582, 41612, 49669, 52068, 48734, 40218, 26043]
18542B6043P488K2634M206j5039R081O20o811r090n287J932k84J0742j1238J17
18528C5114k03k22k1921k620K2256J4550P745Q07j1608j4115m724N675k950j4324
18514A3460K875o83r160Q197L655k033N753J453k125l923K606K745j684J959R16
18499B4011J550N23J9336K0975k086j8614m267J2580J9892q33j0993o07L593K214
18485F7274P856J3237L170R19j2071j5403L332l85r447j1930j820R960p190L712
18471E1214J5230q284q688K647R592R073k4818j047R491j7779m585l637j6143
18458A2266n353J7534J5777L1596J3734j6858j5172O775K1134J0890k089R399
18446I9633J661l956J5201J039m912j4761k2201O755k089O549K8436O323j0463
$$ y = [26043, 33531, 56165, 60371, 45332, 54413, 55033, 48222, 39132, 33845, 35777, 35493, 46235, 34997, 35114, 34911, 34689, 12768, 10148, 32404, 46954, 54699, 55506, 43898, 29783, 25059, 30734, 27784, 13460, 16335, 15652, 6492, 14689, 18344, 16311, 22064, 23517, 21392, 17469, 20075, 22820, 21136, 23095, 24011, 25561, 26084, 45420, 66395, 64309, 45695, 41428, 54008, 73900, 73067, 62074, 61467, 65060, 67274, 75130, 88367, 91537, 92456, 80385, 64982, 68314, 67929, 58482, 46552, 44732, 54692, 47502, 51214, 66444, 58160, 49472, 52119, 61711, 70784, 45966, 44919, 54410, 36631, 32046, 28409, 12266, 6913, 24447, 40224, 71820, 85554, 68696, 53524, 60299, 81433, 92323, 90234, 99633, 101294, 97338, 112539, 113578, 108666, 93905, 71704, 78459, 76370, 82919, 111355, 117678, 107215]
18433A07215n273N013J3071p014J5764J4995p883l916k375P582K256P00P297O0
18419A47492j1831k690M768K2306L0949L4878K6770K1267J7791R553j2109k2814
18407B66330k2611k2498l1908j0116P669J2080O635j0603J1502J8560J0055J6463
18395B51558R672K0891K9181K9304L0869M4606N9582M5414K7760K7278N8308O8442
18383G02865O8929P6699P6319O6648P1604O6629P4393Q2032J00668R5920J18192
18372A600898J61094K15311K64068L56320M72332O28534R02077J323837K035823
18363G960294L045366L780412L849348L709102L845469L969995M379545M500240
18355C9039771L405928K156632J607389K53535j686102k948442l865705m352857
$$ y = [107215, 101942, 106955, 120026, 113012, 128776, 143771, 135888, 131972, 129597, 137179, 139435, 140135, 147432, 147492, 135661, 132971, 137739, 160045, 190994, 225872, 252642, 273909, 291700, 301253, 289144, 266330, 243719, 221221, 189313, 179197, 186866, 198946, 205581, 194978, 206480, 225040, 235095, 251558, 261230, 282121, 311302, 340606, 371475, 416081, 475663, 521077, 548837, 576115, 634423, 702865, 771794, 848493, 924812, 991460, 1063064, 1129693, 1204086, 1286118, 1386786, 1482706, 1600898, 1761992, 1977303, 2241371, 2597691, 3070023, 3698557, 4600634, 5924471, 7960294, 11005660, 14786072, 18635420, 22344522, 26189991, 30159986, 34539531, 39039771, 42445699, 44602331, 46209720, 46463255, 44777153, 41828711, 37963006, 33610149]
18347C3610149l930575l634070l942852m071495l899228l477645k722810j887701
18339F043773j290104q85261o08325m36288l26092k89656k40373k02695j78280
18330A586699j38793r3577p0825l5947n2522l6204l5712n8861o8757q0851p8696
18319H35954p3972q3925o1960m2235k4083k1136k2444j2183j1340l3572k5163
18308D23941p604k8648j1718j8564j1946j877R686p174j0136K026j4802j7244
18296C05940j536j7540k1787j3240K347K575J3352r53P919k891k2101r480N269
18283B47874J5248J088J5272M1071K4741L6300L0276J4352J5655l700r893o693
18271D21591J0836J3442J4564J7003L8660N6686Q3303P0385N8347R3136Q5863
$$ y = [33610149, 29679574, 26045504, 22102652, 18031157, 14131929, 10654284, 7931474, 6043773, 4753669, 3868408, 3260083, 2823795, 2497703, 2208047, 1967674, 1764979, 1586699, 1447906, 1354329, 1283504, 1247557, 1195035, 1158831, 1123119, 1064258, 995501, 914650, 835954, 761982, 678057, 616097, 573862, 549779, 528643, 506199, 494016, 482676, 449104, 423941, 416337, 387689, 375971, 357407, 345461, 343584, 353270, 346096, 335960, 337986, 323184, 305940, 304404, 286864, 265077, 251837, 254184, 256759, 270111, 269158, 277077, 274186, 252085, 242605, 247874, 263122, 264210, 279482, 320553, 345294, 381594, 411870, 426222, 441877, 438177, 428284, 421591, 432427, 445869, 460433, 477436, 516096, 572782, 656085, 726470, 784817, 877953, 963816]
18260I63816O7747O7500J01027J25316J92669K30091L57974M71833O86387J066579
18250D330939J741543K963596M157518L654955K305220J884694O43128j665346
18242B0016247k682848k933604k947626k066735p39731O64207K260289L428653
18234A4998852K745444J654022J310853j70503k259607l017565l298636l257698
18226H705162k489467j648765j054107o79310m90953l51190k71544k05231j51383
18217A363212j15774p3463l6551l3901l7587j9249r277n650P02J7623J5236L4098
18205A099419N0496O9463R4080J49986K17649K76982L73418N24548Q13848J326567
18195D996456K258494L398497L290505K088818J674036Q81645j126703k249364
$$ y = [963816, 1031563, 1099063, 1200090, 1325406, 1518075, 1748166, 2106140, 2577973, 3264360, 4330939, 6072482, 9036078, 13193596, 16848551, 19153771, 21038465, 21681593, 20016247, 17333399, 14399795, 11452169, 9385434, 8645703, 9309910, 11570199, 14998852, 17744296, 19398318, 20709171, 20538668, 18279061, 15261496, 11962860, 8705162, 6215695, 4566930, 3512823, 2833513, 2342560, 1991370, 1719826, 1514595, 1363212, 1247438, 1173975, 1137424, 1103523, 1065936, 1046687, 1037410, 1031760, 1032462, 1050085, 1065321, 1099419, 1149915, 1219378, 1313458, 1463444, 1681093, 1958075, 2331493, 2856041, 3669889, 4996456, 7254950, 10653447, 13943952, 16032770, 17706806, 18588451, 17461748, 15212384]
18187A5212384k487559k582426j971698q51630L13110J674823K904071K573743
18179A4784818J537658J242274K24512j709671k593115k826578k910324k330201
18171E419373j560212r90213o36086m23589l11558k37803j78696j09624o4554
18162I07038n6329l8968n4866m8648o0572o8774p5505p3309n4785l0797j0842
18151C33643K2910J1125k194k7344j1719p416J251j804N436j8544o705Q635p910
18138B99364J141J0255l992O370J482J1956K5869K7071P637J6482J5556J9999
18126D39190L6454K7647L8552O1073R9518J14479J30128J29007J92631K86783
18116A555462L83651N06388P06352J030173J649517K974004N606610R392028P931202
$$ y = [15212384, 12724825, 10142399, 8170701, 7319071, 7632181, 9307004, 12211075, 14784818, 16322476, 17564750, 17789262, 16079591, 13486476, 10659898, 7749574, 5419373, 3859161, 2868948, 2232862, 1809273, 1497715, 1259912, 1081216, 971592, 907038, 850709, 811741, 756875, 708227, 647655, 578881, 503376, 430067, 375282, 344485, 333643, 356553, 367678, 365484, 338140, 326421, 319005, 320256, 318452, 323888, 305344, 298639, 307274, 299364, 300505, 310760, 306768, 313138, 314620, 326576, 352445, 379516, 387153, 403635, 419191, 439190, 475644, 503291, 541843, 602916, 702434, 816913, 947041, 1076048, 1268679, 1555462, 1939113, 2445501, 3151853, 4182026, 5831543, 8805547, 14412157, 23804185, 31735387]
18107C1735387J055487l049225n959527p613032n849493l587098k076835j243409
18099C412255q23509n45379l87563l05980k44006j95739j51153q1898p3187n7966
18089E45875n0960n1846o1036n1924l2354j2663j1307k0170k6759k5102q386m127
18077A89241J1039j7713j8685j6690q772l408N897N686n038m792J1540k305j6962
18064A29038j6961j4226N539J6224K566q146j3260j1925L323J2647j1330k6287
18052F7202J7004Q49o954j5837O36k007n291q405J0685L799p747m51j0783p069
18038C5631o551K0460N642n130J2193j4250j8621J3335K5090j4249k8901k070
18026B2579N139J0441J0154J0203M809r746N202q675j9000j0409j2033J0348J855
$$ y = [31735387, 32790874, 29741649, 23782122, 16169090, 10319597, 6732499, 4655664, 3412255, 2588746, 2043367, 1655804, 1349824, 1105818, 910079, 758926, 677028, 603841, 545875, 494915, 443069, 382033, 330109, 297755, 285092, 273785, 253615, 226856, 201754, 193368, 189241, 200280, 182567, 163882, 147192, 138420, 135012, 140909, 146595, 141557, 136765, 148305, 146000, 129038, 112077, 97851, 103390, 119614, 122180, 114034, 100774, 88849, 92172, 104819, 93489, 67202, 84206, 85055, 78101, 62264, 62900, 60893, 55602, 47197, 57882, 61681, 53934, 53483, 42700, 35631, 29080, 49540, 55182, 50052, 62245, 47995, 29374, 42709, 67799, 53550, 24649, 22579, 27718, 38159, 48313, 58516, 63325, 53579, 58781, 50106, 31106, 20697, 8664, 19012, 20867]
18013B0867k432L726J0218j653K646J3742N300n409m873k1168j4107j305r24M254
17999H882Q501k518Q228K981j972M014j1574K831J6740R77r164m504J9619O259
17985D9300Q071q250j0077L916J9852j915j6105q046n016j1522j0141O274J3407
17972B9748o018j8133j966J8790Q767r360J914J1118o84K334P023o378j5253J23
17958B2025M863L430m001j1005n971r11J8530P902k0062l080J0471m410j1886
17945E895N199J3446r386O981j1501l0481J0051O504r187R0j099L489N688N254
17931I43o551K4635J1830M363R103J0679p763j5948j9151j2541m627j1247q310
17918b4585J7058R284J143j0024n634j0211O642O357j8252L196J1920K1411J03
$$ y = [20867, 18435, 22161, 32379, 30726, 33372, 47114, 52414, 47005, 42132, 20964, 6857, 5552, 4628, 8882, 17383, 14865, 23093, 26074, 24102, 28116, 16542, 19373, 36113, 37090, 27926, 23422, 43041, 49300, 57371, 49121, 39044, 42960, 62812, 60897, 44792, 36746, 31730, 20208, 10067, 16341, 29748, 23730, 5597, 3631, 22421, 31188, 21828, 23742, 34860, 34176, 36510, 43533, 37155, 21902, 22025, 26888, 30318, 26317, 15312, 9341, 8430, 26960, 34862, 14800, 11720, 22191, 17781, 5895, 11094, 24540, 15154, 22135, 10634, -19847, -9796, -3292, -12479, -12389, -13488, -9999, -4311, 943, -5608, 19027, 30857, 35220, 44323, 55002, 47239, 31291, 12140, -401, -5028, -16275, -24585, -7527, 1757, 2900, -7124, -12758, -22969, -16327, -9970, -28222, -25026, -13106, 8305, 8408]
17905H408r818J106j903r743o012J6069O787M617N554m566J0575l254j9554k0160
17891b1894k0372Q544Q586P319J5850R079J4136R461r624j2072o172k200p833
17878g192N423o113o022K6088J2046j4124j9892j3284J0904J0214J0310J2828
17866B1186N303l153k200O026k961K080n614j7130o304M496K551n021j4359j342
17852a6442K216J5734P178R52j132j8819q302L617j865m012J2006l222j773j2523
17838b6387K530J7057l9q333L734R931N28J652J9961j3007N3O912K933j0490n769
17823A266N722n467k1841m288J2676K7716k756L433O915L064K305j2602j8940
17810b797P31J5249j0177r783n212q243j1806J1991M843p336J0885N033m289L32
$$ y = [8408, -1410, -304, -2207, -11950, -17962, -1893, 4894, 9511, 15065, 10499, 21074, 17820, -1734, -21894, -42266, -33722, -25136, -17817, -1967, 7112, 21248, 30709, 21085, 9013, 2841, 641, -7192, -1769, -7882, -13904, 12184, 24230, 10106, -9786, -23070, -12166, -1952, 8358, 21186, 26489, 23336, 21136, 27162, 24201, 26281, 20667, 3537, -2767, 1729, 4280, -741, -15100, -16442, -14226, 1508, 8686, 9638, 8506, -10313, -18615, -14998, -16863, -20875, -8869, -12091, -13864, -26387, -23857, -6800, -6839, -15172, -11438, -1507, -979, 673, 20634, 7627, 7680, 14592, 17525, 7035, 1266, 6988, 1521, -20320, -24608, -11932, 15784, 13028, 16461, 23376, 26440, 28745, 16143, -2797, -2066, 13183, 3006, -6777, -11989, -20232, -32038, -20047, -15204, -22540, -11655, -6622, -10911, -10579]
17796a0579k84O139j404N426j0449M874O75J6684j2713l231J6151M758M390j1277
17782I160M218J0833J0974N937K5944K9771J9555K0694J0889J6387J0174J9231
17770A93767L8536K6289m82j9499m341j3375j8651l0942k4210j3224j9253l3881
17758H0734k1798J494K830j6789j5564p130k0682j4480q414P822L713K0685l5
17745A2386j878j1149K447J463q464k4011J606J0054M467j2812J217Q495M224
17732a1955m347k157J1207J7146k383j1580m610J4864K455j4914l748O683J3973
17719A0634Q077J0975L7634K5804O744q886P099q498j8972L917j3136L614P575
17706G2581P160O538R384J874R370m992k2634j7990p166k2210j359J2876j206
$$ y = [-10579, -10863, -4724, -6128, -702, -11151, -6277, -5602, 11082, -1631, -4862, 11289, 16047, 20437, 9160, 13378, 24211, 35185, 41122, 67066, 96837, 116392, 137086, 147975, 164362, 174536, 193767, 232303, 258592, 258110, 238611, 234270, 220895, 202244, 171302, 147092, 133868, 114615, 80734, 58936, 60430, 63260, 46471, 30907, 23777, 3095, -11385, -19799, -11977, -8264, 12421, 12386, 10508, -641, 1806, 3269, -5195, -29206, -27600, -17546, -13079, -25891, -24674, -16179, -11955, -16302, -18459, -7252, 9894, 7511, -4069, -8679, 6185, 8640, -6274, -10022, -3339, 10634, 18711, 29686, 67320, 93124, 99868, 90982, 98081, 89583, 70611, 74528, 61392, 65006, 72581, 79741, 86279, 95663, 97537, 106907, 101915, 79281, 61291, 54125, 31915, 30556, 43432, 42226]
17693D2226q363L57q27r882l114o06l333j883m689J6061j697r60n654p241j4736
17678d341N678J3540Q313O048L439M823r239j587k108J3447n971j904L504P462
17664D1104K9344K3855j186L076J0074N531r494j8230j9300p622j0275l59J2884
17651E9402J9012K043L803J2011m927k5255n463p221q816k3286O467R426l480
17638C3716r787N661j663k0801k3891R198O117l794j6683K4725J1111J486J891
17625A7286O82O643m088o015m175P89k695Q64O500P117n618j7419Q398J2721j0162
17610A0828K009J9414p847n622K276L752K89R4j7635m307O429p136L317P587P354
17595B0802Q902j4862j0574l188J355j3283K705J2934K914L70j4692p352n348
$$ y = [42226, 33863, 34220, 33393, 23511, 20397, 19791, 16458, 14575, 9886, 25947, 24250, 23290, 17636, 10395, -4341, 1337, 14877, 23190, 29238, 32677, 37500, 28261, 26674, 24566, 38013, 32042, 30138, 33642, 41104, 70448, 94303, 93117, 96193, 106267, 111798, 102304, 84074, 64774, 57152, 46877, 46518, 59402, 78414, 80457, 84260, 96271, 91344, 66089, 60626, 53405, 44589, 21303, 27770, 37196, 33716, 23929, 29590, 27927, 7126, -16765, -7567, -1450, -5244, -21927, 2798, 13909, 15395, 17286, 17968, 24611, 20523, 14508, 10333, 11122, 8427, 9291, 15791, 22908, 17290, -129, 8269, 20990, 10828, 12837, 32251, 24404, 18782, 21058, 24810, 25099, 25193, 7558, 3251, 9680, 2544, 5861, 13448, 20802, 29704, 14842, 4268, 1080, 2435, -10848, -8143, 4791, 7705, 8075, -6617, -13969, -19317]
17582a9317j347j070R187R434J235L593r626Q850P50N42N820l396J0420J935p284
17567I726r900j3952Q425k24O903j130j3385P385J757J836L220J3681K586K063
17553A8991r324j0148j3541n81J7956R528o036j5635j637N290P499j8051J669
17540a4020K253l734j962M788Q298P898N388J2021N178j5608j0745p578j626L98
17526i051p657j4132j7168J0815N485O010m166J3949J0533Q97L689J9698l244
17513A5658j655n473q929m467j0022L496M475j6058o87K379l376R253k739n389
17499b3534m917M406J1585P044P56k513K787n462j12r719j3761L51K330K5070
17485e689N694j5686J931O053O513j2844K363J2654K9777M66o559n280m985m566
$$ y = [-19317, -20664, -21734, -12547, -3113, -1878, 1715, -7911, 939, 1689, 2231, 8051, 4655, 15075, 17010, 9726, -174, -14126, -5701, -5925, 978, -152, -13537, -6152, -4395, -2559, 661, 14342, 16928, 18991, 9667, -481, -14022, -14603, 3353, 12881, 6845, -8790, -10427, -5137, 2362, -15689, -14020, -11767, -15501, -17463, -12675, -4377, 3521, 8909, 20930, 26108, 10500, -245, -7823, -9449, -9051, -16708, -30840, -48008, -37193, -31708, -25698, -29864, -15915, -5382, -4485, -796, 18902, 15658, 14003, 8530, -399, -4866, -14888, -11392, -6917, -22975, -23662, -21283, -24659, -15406, -18145, -23534, -28451, -24045, -12460, -5416, -4660, -7173, -4386, -9848, -9960, -19679, -33440, -33089, -30759, -5689, 5, -15681, -13750, -7697, -1184, -14028, -11665, 989, 30766, 31232, 24673, 19393, 14408, 9842]
17471I842j4852Q025R587l933L255J0484l66R99k2010R29J3854q434k8197o444
17457b7261K533Q577L122j343P568J6086R218J4931l059m278K480k338P654K9867
17443F3757M0506M6361L1133j848l8965m4543l3233k6760p790j5970k4618n347
17431a7317o215J3925N186p433J610m76J6756k956k882J2755Q410r755j2021p237
17417g650J644p121K003l257q127N88K1827N921l882K932M531j0826j0826M239
17403h004J0832R92M990J319p201k73O733R594j1503k3073O495o541N364J1052
17389G76j6797j2796j334p71J1205Q281J0337J1446j3144q963M363O182J4522
17376A3307R087j2145o129Q025j036n210J327k61n640r104j5323NJ3140J8248
$$ y = [9842, -5010, 3015, 12602, 8669, 11924, 22408, 22042, 23041, 1031, 1960, 15814, 7380, -20817, -27261, -24728, -16151, -13029, -14372, -6804, 9282, 18500, 33431, 30372, 26094, 28574, 26236, 33890, 63757, 104263, 150624, 181757, 179909, 140944, 96401, 63168, 36408, 28618, 12648, -11970, -17317, -23532, -9607, -4421, -11854, -10244, -10720, 6036, 3080, 198, 12953, 21363, 11608, -413, -7650, -6006, -13127, -11124, -14381, -22508, -21920, -93, 5828, 1946, 4878, 9409, -1417, -12243, -8004, 2828, 3820, 8810, 10129, 2928, 2655, 9388, 18982, 7479, -15594, -9099, -15640, -10276, 776, -16021, -28817, -30151, -30922, -19717, -11436, -1099, 10347, -2797, -11760, -7397, -1215, 13307, 22394, 10249, 4120, 12145, 11109, 5899, 7226, 6965, 1325, -7779, -23102, -23097, -9957, 8291]
17362H291j439L021P534q193M233n533r428R493K771N017k550m45L979K933j258
17347A8426M4O90j1586n038p090N498L199q040k1242n922q2p6L3097m262q627
17332a1011J0423J481k1198J2820J8645K573m266p986n575O86N561M848o16R29
17318G314j2312j0754j281J8295N231K449L04J0453O705j0395l839r137O300p155
17304B178k2169j3723m164J268J5124J9745j06l695J1289J0652J564r828r102
17291i67l829j3965R149J0566r356J2780O061n263L461R876p83J07J117j3219
17277E735p999l687R013J7352P385k0090j0475J561k977J8326J5215K566j0740
17264B1185l166o577m502m850J0612R754j1144j1075p310M43j234j2381q093J5539
$$ y = [8291, 6852, 9873, 17407, 9214, 13447, 7914, -1514, 7979, 10750, 15767, 13217, 12772, 16751, 19684, 18426, 18470, 19160, 7574, 2536, -4554, 944, 4143, -3897, -25139, -31061, -31143, -31219, 1878, -2384, -11011, -588, 893, -20305, -7485, 11160, 13733, 9467, 1481, -4094, -3408, 2153, 7001, 6385, 7314, -4998, -15752, -17033, 1262, 6493, 8942, 9246, 19699, 26404, 16009, 12170, 3033, 9333, 2178, -19991, -33714, -37878, -36610, -21486, -1741, -1847, -5542, 5747, 16399, 17963, 8135, -967, -4796, -18761, -9612, 954, -8402, 4378, 10439, 5176, 8637, 18513, 17730, 17837, 18954, 5735, -2264, -5951, 3062, 20414, 27799, 7709, -2766, -1205, -4182, 14144, 29359, 31925, 21185, 18019, 11442, 6940, 2090, 12702, 22456, 11312, 237, -7073, -6630, -7864, -20245, -28338, -12799]
17250a2799K3549R180P873k469k41n933O972O188k3213q407M758l132j5306j153
17236a4133J2059J8750q250j4166m08J1329K1303j5864l0671o386N288J5762L844
17223a543q207j1007j1371j6318q12K6665K2181M716j0074j1819r963J2228M751
17210a0573n200K619J2870N654J060K247j8237l742J7926O374m565r562l592l398
17196a0119j1694J2357J6707M394p556k05k2550k5910n264J4229K3555K6274J6116
17183C0334k082o385j0896j8213j7968J7173J2114N471J094J940l581k0367q394
17170a9760m667J3786O113P71Q867L10M084r770l952N27j1797o913j0299m040
17156c6740J1646j609K0091J2405r40M225j3340k320L2894J0166j6565Q80m682
$$ y = [-12799, 10750, 19930, 27803, 25334, 25093, 19160, 26132, 32320, 9107, 700, 5458, 2326, -12980, -14133, -2074, 16676, 8426, -5740, -6148, 5181, 26484, 10620, -20051, -26437, -21149, -5387, -1543, -9750, -20757, -32128, -48446, -49258, -22593, -412, 4304, -5770, -17589, -27552, -15324, -10573, -15773, -13154, -284, 5370, 6430, 8677, -9560, -13302, 4624, 10998, 6433, -3129, -6721, -10119, -21813, -9456, 7251, 11645, 4089, 3884, -18666, -44576, -49840, -35611, -12056, 14218, 30334, 28252, 21867, 10971, -7242, -25210, -8037, 4077, 9548, 10642, 12582, 9001, -11366, -19760, -24427, -10641, -4528, -3757, 5110, 5420, 9504, -266, -4218, -3691, -15488, -22401, -32700, -36740, -25094, -26703, -6612, 5793, 4853, 9078, -4262, -6582, 26312, 36478, 19913, 20793, 16111]
17143A6111O944j1509j9620J525J3119k427j2563o664j169q325l644K3316L542
17130a364j1457j240J6938L792k996j1369p398J3809K1158J2678j833j3880j3017
17117C821M641N074N120k938j5625Q155o645j1256m167O407J3340l06R413q48
17103A4186k133q10j4882j1796M677K1952l84p550m313N592k1969j5292n897q110
17089d6729J1459K1864K976R940N963K1659n362k6800K94K3775K2209j008j3789
17076B6451k3767j6922n271J3840J0242M415l1560m356J6685K378j1381J3334
17064e912J1804R931m551J816N369J831j0375j8548j078N213M459j8346j561m038
17050b3986K610J82Q010N986J6391j524j2182J216P335p8J4520m679q638q399
$$ y = [16111, 23055, 11546, -8074, -6549, 6570, 4143, -8420, -15084, -16253, -24578, -28222, -4906, -1364, -12821, -14061, 2877, 6669, 3673, -7696, -15094, -1285, 19873, 32551, 30718, 16838, 3821, 8462, 13536, 18656, 15718, 93, 8248, 1603, -9653, -13820, -7413, 5927, 5621, 15034, 14186, 12053, 11243, -3639, -15435, -10758, 11194, 10810, 3260, -1053, 4539, -17430, -32722, -38619, -46729, -35270, -13406, -10430, -490, 5473, 27132, 21770, -5030, -4736, 19039, 41248, 40240, 26451, 2684, -14238, -19509, -5669, 4573, 8988, -22572, -26928, -10243, -7865, -19246, -5912, 5892, 15823, 11272, 13088, 18457, 20288, 9913, -8635, -9713, -4500, -41, -18387, -19948, -23986, -21376, -21194, -13184, -7198, 9193, 7669, -4513, -3297, 4038, 3960, 18480, 13801, 5163, -3236]
17036c236O068Q652j0515N935n79q711n613K520k496M023m480m151j0643n022
17022b8248J4721J5890q924j4300j1124J4976J255O143M899M622l474r531L35
17009a2760k364q744J0287J6233N836K2500L750m797K10j0513k2019k026O978
16996B571k706k48j0889m992J1538O382k186q993j4281N11J4006O61p561o987
16982b3174o108J3975J8005q671q574Q279J1191J057p006j6477Q21p8J8962k698
16968d96j2000J4337J69j1009j1662O173J3816j816m80J0407K6532o252p388j0771
16954I560j7772l544R408o31K97k3816J8163K0396j9024m588L67N293j4367N785
16940a4473k384L35n928Q339J1169j1973r849P955J7555N004R332J387k0582k0077
$$ y = [-3236, 2832, 11484, 969, 6904, 6325, -2386, -7999, -5479, -7975, -3952, -8432, -12583, -23226, -28248, -13527, 2363, -6561, -20861, -31985, -17009, -15754, -9611, -4712, -90, -3564, -13095, -12760, -15124, -23868, -13581, 2652, 8488, 30988, 34738, 29941, 30151, 19638, -2381, -4407, 2571, -135, -383, -11272, -16264, -4726, 1656, -530, -9523, -23804, -23293, -9287, -8626, -16187, -23174, -29282, -15307, 2698, -5973, -14547, -6268, 4923, 5980, -1026, -17503, -16682, -16760, 2202, -496, -12496, 1841, 2010, -8999, -20661, -14488, -672, -2488, -2968, 7439, 33971, 27719, 20331, 9560, -8212, -11756, -2348, -2979, -2682, -26498, -8335, 12061, -6963, -11551, -11184, -5891, -20258, -14473, -16857, -16522, -22450, -14111, -2942, -14915, -24764, -16809, 746, 5750, 15082, 16469, -4113, -24190]
16926b4190k283J1398J1415P267J5775j479l337m183m339q655j7841j5060Q967
16913b6545m177O665J1598P171O441N857j972n569J4443L380m705k170J928n632
16899F713j7224r895O068J2667j8080k2434M778J0018J6440j124O817m175r889
16886a9320q936q431K526J796J8247Q149Q904l304m843q062N468J1077n659q647
16872a1035M406J5372k533k1531j144K463l925k723P489Q72N779l178j0034j5617
16858c5339j1635J0048K139J1138N055l595k045K292J2265K1291R742o707m699
16845I950p644J2952N807j2046j0735J072Q692L094j4976m51K0014j2197r024
16832e492O752l485p778J6067p001m61m832q77L594j2752q27j794J6j0304M242
$$ y = [-24190, -26473, -15075, -3660, 3607, 19382, 17903, 14566, 10383, 6044, -2611, -20452, -35512, -26545, -30722, -24057, -12459, -5288, 1153, 7010, 5038, -531, 13912, 17292, 12587, 10417, 12345, 6713, -10511, -20406, -14338, -1671, -19751, -42185, -37407, -27389, -10949, -12073, -5256, -9431, -19320, -28256, -36687, -34161, -32365, -14118, -5969, 2935, -369, -5212, -13274, -7806, 3271, -2388, -11035, -6629, 8743, 6210, -15321, -16465, -14002, -17927, -20650, -13161, -12289, -6510, -9688, -19722, -35339, -46974, -36926, -34787, -23649, -18594, -22189, -24234, -21942, -9677, 11614, 21356, 14649, 9950, 2306, 15258, 21065, 9019, -1716, -644, 8048, 11142, -3834, -4285, 15729, 3532, -5492, 1260, -2225, -10003, 6064, -937, -1398, -6230, -7107, -3513, -16265, -17092, -18886, -18870, -29174, -24932]
16817b4932K4402m45m702j7150J2144J8242J865Q253J0226n72r853k1231j7026
16804b0779J1648J1104J4623J0044j3571k3163j3987P354J3294j4683m142M322
16792a7936L326J5055J4804m913L193o225r683k2941m013J7475j0301J079J5982
16779e098O968j6732K077J2118Q756j5489j1154m032J0032K1117K1533r892j6465
16766C739o474j951l39P442N195P351k0092m726m232K2745J510j0683P72j0315
16752a0058N793R54p512K079J4369J1834N4o102r705j47J0801k549p982M524O40
16737F993J079L712J4354q023j0594l621l279j2674L510P386K934J4253O859j718
16723B1171m942k0426j8897j1711M833R425J9233P781K362L188p957p814l410
$$ y = [-24932, -530, -975, -5677, -22827, -10683, 7559, 9424, 17677, 27903, 27331, 17478, -3753, -20779, -9131, 1973, 16596, 26640, 13069, -10094, -24081, -16727, -3433, -18116, -22258, -17936, -14610, 445, 15249, 10336, 13529, 7304, -2379, -25320, -29333, -11858, -22159, -21080, -5098, 1870, -14862, -12785, -667, 8089, -7400, -18554, -22586, -12554, 8563, 30096, 20204, 3739, -2735, -4686, -5025, 2417, 7612, 14963, -5129, -9855, -14087, 8658, 10168, -515, 257, -10058, -4265, -3311, -10823, -8744, 5625, 17459, 17513, 11411, 1706, 1559, 12360, 9811, 1829, 6353, 6993, 8072, 11784, 26138, 18115, 7521, 3900, 621, -12053, -8543, -1157, 1777, 16030, 22889, 21171, 16229, -4197, -23094, -34805, -29972, -20547, -1314, 6467, 8829, 12017, 4060, -3754, -7164]
16710g164p087q773m870P560R560p033J3250M506k177Q697J8586Q990m632k896
16696B6517o442k2494n363J66j0656P912J0497k759J5018P198n533o055R99j1819
16682b814o774J480J8313j396j447O140N077m880k8129l765M706Q946r313l237
16668a7093j4543j7022J181J6757P441J653J8056N674j4514j2483q377k863j934
16655c8067J1440k584o691J6352R076r34l120j7566r88J3782J8739j4797p653
16642b3011J460Q768q577j4015m878O065l295J9863K850j3760K0652M001j4556
16629a8433J749N136m99J4851m95j5061J2543J5388j209M84j239P579j2177j6539
16615g922M049L123j7392J9358K0822j6179Q404L166j7282l181l242N156K696
$$ y = [-7164, -14251, -23024, -27894, -20334, -10774, -17807, -4557, -51, -2228, 6469, 25055, 34045, 29413, 26517, 20075, -2419, -7782, -7616, -18272, -10360, 137, -2622, 12396, 19594, 14061, 8006, 9005, -2814, -9588, -8108, 10205, 8809, 7362, 13502, 18579, 13699, -14430, -18195, -13489, -4543, -13856, -17093, -31636, -48658, -47477, -30720, -23279, -21626, -3570, 2104, -12410, -24893, -33270, -36133, -38067, -26627, -29211, -35902, -19550, -10474, -11408, -14528, -32094, -33082, -19300, -561, -15358, -23011, -21551, -12783, -21360, -35375, -40253, -34188, -37483, -17620, -14770, -28530, -7878, -3877, -18433, -16684, -11548, -12047, 2804, 2309, -12752, -209, 15179, 13970, 14454, 13215, 20794, 8617, -7922, -3873, -750, -18142, 1216, 22038, 5859, 14263, 17429, 147, -3034, -6276, -1120, 1576]
16602A576j1245j743J1071j7155q816M943J854J4997j758q019q605M320O128j374
16588a3826l003K6466j0875k3132K345K0265N129K260o152j1175j2544K623J617
16575b0002L300q523Q62J4807Q977q813R250R439o10J309o554j5606j1281O627
16561a6818J8148J3494l539O082K939k673r502p285L750J2360m633j2164m434
16548d275l642K294J768j051J1160M80m655k278M057r928l437Q367r454o696J7048
16533b42j351r083l15J394J297J8477j726n031m508l27P0Q447J712P726j3809
16518B731L813Q650m062j1683j4603O716Q140j4227k344J3383J1129m391K984
16505F236r495r934J4490J7541p338o730P819M657n2J68J1006j636q592j3346
$$ y = [1576, -9669, -11412, -341, -17496, -26312, -21369, -19515, -4518, -6276, -14295, -22900, -18580, -12452, -13826, -16829, 9637, -1238, -24370, -22025, -1760, 3369, 5629, -523, -11698, -24242, -21619, -20002, -16702, -25225, -24363, -9556, -579, -9392, -142, 9297, 8687, 9996, 3442, -12164, -23445, -16818, 1330, 14824, 11285, 17367, 20306, 17633, 8131, 846, 4596, 16956, 12323, 159, -4275, -7917, -5623, -3855, -4906, 6254, 6734, 2079, -199, 3858, -6070, -9507, -1140, -10594, -17290, -242, -1593, -10676, -10991, -9597, -8300, 10177, 8451, 3420, -1088, -1415, -1345, 7102, 8814, 16540, 2731, 6544, 15194, 11132, -551, -15154, -8438, -298, -14525, -16869, -3486, 7643, 3252, 6236, -3259, -13193, 1297, 18838, 11500, 4770, 12589, 17246, 17194, 17362, 28368, 26732, 18140, 4794]
16491D794j265J8693j4286k315O986m720j9796r369J0017K305K471j3273o075
16478b5833J993L002J956J8957M197o758k544J6309k036j7960O016J2022j0115
16465g94K084j23j1803M738n46j6674k733k726k1176O695J9991J3873R427m772
16451d539q264K2119l824m748J1502o781l820PK3173J9795r16k1151p346j5009
16437A98Q454P875m266j3326l255j4971P754k152J6665R629r96j639j6146k1570
16423b7746J2127J8301k170p436r993k397N542j1655J3089J7984O775O216j0846
16410G791N561R409j431k918p4o215q454p352M720J430j8571K418m605n58j52
16395a9001J9494r44j5j2704j4020j5941j5962K2474K3894J7493J3535j605p596
$$ y = [4794, 3529, 22222, 7936, 5621, 12607, 7887, -11909, -21278, -11261, -8956, -6485, -19758, -25833, -23840, -20838, -18882, 75, 4272, -2486, -5030, 11279, 9243, -8717, -2701, 9321, -794, 1290, 1167, -10636, -5898, -6444, -23118, -25851, -28577, -49753, -43058, -23067, -9194, 233, -4539, -12803, 9316, 5492, 744, 12246, 5465, 1645, 1652, 24825, 44620, 43704, 22553, 15207, 198, 8652, 16527, 12261, -1065, -4320, -19291, -11537, -13689, 2976, 12605, 11609, 9970, -6176, -27746, -15619, 2682, 512, -6924, -16917, -19314, -13772, -25427, -12338, 5646, 12421, 18637, 7791, 13352, 22761, 21330, 18412, 18338, 12123, 3669, -3683, 1037, 2467, -16104, -13686, -18291, -18849, -19001, 493, -451, -466, -13170, -27190, -43131, -59093, -36619, -12725, 4768, 18303, 16698, 9102]
16382I102k854j6006j6012J0819J285L257M063j3982k8394L834J031O755L0383
16369f719J6447j1578j9423j4996J0254K6082J3670n973R026o59j4868n841R293
16356D715N98p731N255J0414j6444m864L950j0387K491J2925R903j3918p55K0434
16342A6586J807l222J266j05o81M89m342L518j1942j6340J9646J9172m778k0394
16328F80j8130R147J3238O556J0582q550j205k006n277q851L065J5051P31j1595
16314C436p378Q257N728r27r085J246K453k310O689J70p952r303P688J291m955
16299d952n78j926M081m840j5800J2810K5156M599O993n695j5787k11m340Q3n568
16284e975N720m121r977O326n920j4850N52R082J0629P833q143k2724L709N640
$$ y = [9102, 6248, -9758, -25770, -14951, -13666, -10409, -6346, -20328, -48722, -44888, -43857, -37102, -6719, 9728, -1850, -21273, -36269, -26015, 67, 13737, 7764, 16790, 16131, 1263, -4578, 4715, 5313, -2418, 2837, 13251, -3193, -8057, -4107, -14494, -12003, 922, 10825, -3093, -3848, 16586, 18393, 15171, 16437, 16332, 15651, 16140, 11798, 15316, 3374, -12966, 6680, 25852, 21074, 680, -17450, -8303, 4935, 11491, 22073, 13523, 12318, 10312, 5035, -3816, -751, 14300, 15031, 3436, -3942, 4315, 10043, 9116, 31, 1277, 3730, 1420, 8109, 8279, 327, -8976, -1288, 3, -4952, -5530, -7456, -3375, -8215, -24015, -11205, 13951, 18550, 25543, 19848, 4061, 3850, -490, -407, -5975, -255, -4376, -14353, -8027, -13947, -28797, -28245, -19163, -8534, -701, -8844, -31568, -27859, -22219]
16270b2219O510M613Q743k508p819j8416o643p004K2388K3458j92j4044j0458
16257b3591O579P3j546l309k31j4341J903P639J1796J5827q995k281J1871M84
16243A878L876n116J204n572O951J8299l404q85M470m312k768m276q801J1056
16229A2600N60P420o569j5927j5960O278K505k441o42n935K130L923j678m205
16215a7941J0568qJ7819Q072j5557j7619M452J1742Q077J6884p232j4466l2966
16202b8175n771m550M994J9289J0793Q813Q528P787l342K670m916j7543p674Q798
16188b99j2552L177J8107j637j0569l702k913K839J059n732n073o514k53J3527
16174a0535R943l874J544K821m136J4038N44q194O762n74j0855M394J185j0189
$$ y = [-22219, -15709, -11096, -2353, -4861, -12680, -31096, -37739, -44743, -22355, 1103, 911, -13133, -23591, -17012, -16939, -18485, -21794, -22025, -36366, -34463, -26824, -15028, 799, -8196, -10477, 1394, 1878, 5754, 638, 1842, -3730, 3221, 21520, 18116, 17231, 21701, 17389, 14621, 10345, 1544, 12600, 13160, 20580, 14011, -1916, -17876, -11598, -9093, -11534, -12176, -18111, -15981, -12058, -13736, -17941, -7373, -7381, 10438, 18510, 2953, -14666, -10214, 1528, 9605, 26489, 19257, 4791, -28175, -33946, -38496, -33502, -14213, -3420, 5393, 13921, 21708, 18366, 21036, 16120, -1423, -9097, -299, -12851, -9674, 8433, 6796, -3773, -7475, -10388, -7549, -6490, -12222, -17295, -23809, -24062, -10535, -592, -4466, -2922, -101, -4237, 9801, 10345, 2151, 8913, 8339, -2516, 1878, 3063, -7126]
16160g126J1716L675k3099m164M382M770R313j6355J2658P082j4075m942K3005
16147F840J0384K69j0908M25j0804j0925K25J7337Q964k533j238j2385o092l163
16133a3604j0216j898o419J1142R841J6424J7586j3619j1881Q045J092K83J136
16120G912J24m530N664j3148j6427n550J526p621k240K961L466J6799R168m179
16106f075J596J3749p38O220o538k110j0284L24K098J814j2217j3280k268J6192
16092a1517P51K110j1707J6656N661P721L429j1576o513J0629j2231m732O538
16079d781K834K432M27p8m578P22M763n494j042j2819M302K256K397k000J042
16064i617j1297O36J9K0387J2784k4242J3403J353q692l578M933K322p348o194
$$ y = [-7126, 4590, 8265, -14834, -18998, -14616, -9846, -533, -16888, -4230, 2852, -11223, -16165, 6840, 17224, 17493, 6585, 7010, -3794, -14719, -14494, 2843, 11807, 9274, 8036, -4349, -10441, -13604, -23820, -25718, -32137, -20995, -11154, 5270, 22856, 9237, -2644, 5401, 6493, 6776, 7912, 8036, 3506, 9170, -3978, -20405, -25955, -24429, -32050, -34290, -31329, -27863, -11064, -1896, -6075, -4479, 9270, 8532, 14752, 8214, 6104, -4180, -3856, -1758, 56, -12161, -25441, -27709, -11517, -10766, -8656, -20363, -3707, 1954, 9675, 13104, 1528, -4985, 5644, -6587, -11319, -4781, -1947, 485, 912, 834, -3744, -3022, 1741, -3753, -4795, -17614, -13312, -11056, -8659, -10659, -9617, -20914, -20278, -20259, 128, 12912, -11330, 2073, 3426, -5266, -8844, -3911, -1589, -8937, -15131]
16050a5131K888R194r80J5365P626j5840m204j982R858l986M891j224j563l962
16036I50k947j544j3576o511Q365m788q814R932J6844l854j5013j652p163P493
16022b2278J6561p187K470J3703L852L888q85j4265K68J7455k723o583j0144o379
16008a2247Q43J0407P835J2141p365j7405p829l881P962J9816J3102J8660j0609
15995C1430j1627j7307j0985P199K785o282J0486k7n958J0003J0859O500K225
15982B9301j3573j7224J0102K464J7080p197j2254p692J7969J1588l165n622j2139
15969I638j3169j3148N900j648o837J2747J272Q098J8384n806j0287p078L39L946
15955B351o289j8643j3706J5720J2903Q168r022O156J391l057q939K508n15R222
$$ y = [-15131, -12243, -3049, -4029, 11336, 18962, 3122, -1082, -3064, 6794, 2808, 7699, 6475, 4912, 950, -1997, -3541, -17117, -23628, -15263, -20051, -28865, -18933, -2089, -5943, -20956, -22608, -29771, -22278, -5717, -12904, -10434, 3269, 7121, 11009, 10124, -4141, -3873, 13582, 10859, 4276, -5868, -12247, -11404, -997, 6838, 18979, 11614, -5791, -13620, -17501, -9539, 10277, 23379, 42039, 31430, 19803, 2496, -8489, -1290, 1495, -4787, 5699, 5672, -286, 9717, 20576, 27076, 29301, 15728, -1496, 8606, 11070, 28150, 20953, 8699, 1007, 18976, 30564, 27399, 21777, 9638, -3531, -16679, -10779, -12427, -19264, -6517, -5245, 2853, 21237, 15431, 5144, -1934, -1595, 2351, -3938, -22581, -36287, -20567, -7664, 504, -8518, -2362, -971, -4028, -12967, -10459, -10974, -1752]
15941a752j544j3363n409R29M264N034Q22K804n626N979n109j3059N254l630K2389
15926b017J8581L432l676j546o944l368r603N156J1671L258j0822j3081O82N459
15912b818j0732j6450k896p261J3044J7844J5556R149j6239k1060k0695N864J5481
15899b1213M096j5236j0994J0070O356L662R489p86k456j4217P207Q204Q9m098
15885a9827J636j7268o125j2221K1399J9224J0422R506M314R9r086j9774j2560
15872c0261o453P605k692R893j0170O078L8942J6707j2948k0645n148J6011N87
15859G506m109j0722l161m996J3808j290j2968O189J7045M589j1520k503l130
15846e262l033j2818p451K1023K38K564j3745j290M939o180j0876J4462J6045
$$ y = [-1752, -3296, -16659, -22068, -21139, -16875, -11841, -11019, -8215, -13841, -7862, -12971, -26030, -20776, -24406, -2017, 16564, 19996, 16320, 14774, 7830, 4462, -5141, 15, 11686, 14944, 4122, -8959, -8277, -2818, -13550, -30000, -32896, -40157, -27113, -9269, 6287, 15436, -803, -21863, -42558, -36694, -21213, -17117, -32353, -43347, -33277, -26921, -23259, -13770, -14556, -17012, -31229, -24022, -15818, -15729, -19827, -18191, -35459, -41584, -53805, -32406, -13182, -2760, 6746, 11060, 11159, 2073, -17701, -30261, -36714, -29109, -31801, -21908, -32078, -26000, 12942, 29649, 16701, -3944, -9092, 6919, 7506, 3397, -7325, -10486, -15482, -1674, -2964, -15932, -9743, 7302, 11891, 371, -2132, -5262, -8295, -21113, -28564, -7541, -7303, -4739, -18484, -19774, -14835, -21015, -31891, -17429, -1384]
15833a384R434o617j0160k738m167R996O035n052l681p008p79J448q216J4101
15819h788J6279R380N285j0240k0478p847k0807j1184J9704K6269J7449p963j3163
15806f104J0969q094k743N274q997O035J4231R38P849J963k258L270L343l013
15792B2663M01j5478o299O431m041L674J2190N032j0195j1845j164K527l051O953
15778G798Q99K402p979k449r339r069Q544R078L720M005o693n894L69j1548p097
15763b3253K6291J9947L098r591o782m130J61j039r816R33j0742O322K103P323
15749H25m617o154j545J090P012J913j580L740O60M012Q430m678m637j4557P053
15734c033j042p947k275P433j0391L422K5737Q034j5137m443j4184q135K098J1567
$$ y = [-1384, 8050, 1433, -8727, -11465, -15632, -5636, 399, -4653, -8334, -15342, -16121, -14673, -22889, -8788, 7491, 16871, 22156, 11916, -8562, -16409, -37216, -48400, -28696, -2427, 15022, 7059, -6104, 4865, -3229, -5972, -698, -9695, -3660, 10571, 11509, 19358, 21321, 19063, 22333, 25676, 22663, 23064, 7586, 1287, 7718, 3677, 7351, 19541, 24573, 14378, 2533, 1369, 3896, 845, 7798, 8697, 11099, 3120, 671, -8668, -17737, -9193, -115, 3605, 7610, 917, -4977, -4608, -16156, -23253, 3038, 22985, 26083, 16492, 9710, 5580, 5741, 4702, -5114, -4181, -14923, -8601, -6498, 825, -3792, -9946, -11491, -10401, -3389, -1476, -3056, 684, 1344, 5356, 13786, 9108, 4471, -10086, -3033, -4075, -12022, -14297, -6864, -17255, -13833, 11904, 19938, 4801, 358, -13826, -21961, -19863, -8296]
15720h296J4764J1464q030j8041l674P156J0477N675P381o821r728J5575l95r293
15706H214n278o943p00J187k428J3908J6161p153j0503j4141N20j789p346N290
15692a1001O638N74M388R909Q879k0812j2196N422n552o601j872O519J0357L027
15678b321m155J5420Q239J339r190O242j629r241J2678p380l099k6108J733L3431
15664A5959J1391j790j9658p216r910Q459k409k154J746J498R499N464M612q524
15650F967j107J0411L233J6865P485Q343K9119L8673N2867L7620R719J2305J2293
15637B44793N645j8512m0137l0297m3809k7336m0482k5433j4476k5989p743K5284
15625A508J8624M432N273k3455p223N319N925p040j5807N569K1557K500j0726
$$ y = [-8296, 6468, 17932, 9902, -8139, -11813, -4657, 5820, 11495, 18876, 12055, 2327, 17902, 17507, 8214, 2936, -4007, -4707, -3520, -5948, 7960, 24121, 16968, 6465, -7676, -7156, -8945, -16291, -11001, -4363, -3789, 599, 10508, 19387, -1425, -13621, -8199, -13751, -20352, -22224, -15705, -5348, -2321, -6476, 8944, 17183, 18522, 9332, 15574, 13945, 4704, 17382, 10002, 6903, -19205, -17472, 15959, 27350, 25560, 5902, -1314, -11224, -2765, -5174, -7328, -5582, -4084, 5415, 10879, 15491, 6967, 5860, 16271, 19504, 36369, 43854, 52197, 81316, 119989, 172856, 210476, 220195, 232500, 244793, 250438, 231926, 191789, 161492, 117683, 90347, 49865, 24432, 9956, -16033, -23776, 1508, 20132, 24564, 29837, 6382, -841, 4478, 10403, 3363, -12444, -6875, 14682, 17182, 6456]
15612F456J055J721J984n657m231n510J0054J6491j0233j5793O000R682r946j8262
15598a6189j050q485K375J3337J3433J1360k5424j2827K2357K1906j6678j1315
15586g200L216M746N20Q106J4589q017j3287m178j1924P601K389O478J1066j2840
15572A265j3300o495L8J0280K888R363k021K010J8771p975j7306K707j5026J129
15558a3672K9792L481l706o55j1401j050R375O671P885j4818j8111k0814k35J0911
15544a6347j661L398j94J7377R763M188O024J179r593j563J513J726k2756K32
15530f714N833N786K970J062Q959p039k6824p912K697L755K157J195J0733Q193
15516D851Q969k0058j5022J0905j475j6044P994O569L444L722j0669j3336k839
$$ y = [6456, 7511, 9232, 11216, 5559, 1328, -4182, 5872, 22363, 12130, -3663, 2337, 12019, 2073, -16189, -17239, -25724, -23349, -10012, 3421, 14781, -10643, -23470, -1113, 20793, 4115, -7200, -3984, 762, 1282, 9388, 23977, 15960, 2673, -1505, -13429, -5828, -3439, 3039, 14105, 1265, -12035, -18530, -18492, -8212, -5324, 4039, 2018, 4028, 22799, 14824, -2482, 225, -14801, -13672, 16120, 19601, 15895, 15240, 3839, 2789, 12164, 18835, 26720, 11902, -6209, -27023, -27258, -16347, -18008, -14610, -14804, 2573, 12336, 16524, 22548, 23727, 14134, 12571, 14084, 15810, -6946, -6714, -881, 4905, 7875, 8937, 17896, 10857, -15967, -23879, -21182, -17427, -15270, -14075, -3342, 4851, 13820, -6238, -21260, -10355, -11830, -27874, -19880, -13311, -9867, -6145, -16814, -30150, -32989]
15503c2989K866Q184J1878k850n986K818J9307o662r521j0887m880J5703J2829
15490a90n810N826n910j19r380J0420k503j4895o978r5J4962l552o276l7Q093
15475a6444L590k982q98K772O582J6804J236M004q031n442j6759r498J4123N379
15461e564P139j4J077o886p057P697Q850m232M172J153r326j1763M076r69m335
15446a5982q166j595m08J5138J1372j1747P314M241m299l297J2307J634o126k255
15432a869N887m244q187m964P858L436n496L984L190m842j440n957o228k059M698
15417a6233Q211O649N242l724k2752j1763L112R291J8004J0018K245O535O18O417
15403B1870L850p102J921M944j8313p688K957j512K0194m140j4396r682j2472
$$ y = [-32989, -30123, -21939, -10061, -12911, -18897, -16079, 3228, -3434, -12955, -23842, -28722, -13019, -190, -6000, -174, -6084, -6203, -15583, -5163, -7666, -22561, -29539, -29634, -14672, -18224, -24500, -24537, -16444, -12854, -15836, -16734, -13962, -7380, 9424, 10660, 14664, 6633, 1191, -15568, -25066, -10943, -5564, 1575, 1561, 2638, -4248, -11305, -3608, 5242, 1010, 5182, 6335, -2991, -14754, -10678, -11647, -15982, -24148, -25743, -26151, -11013, 359, -11388, -4074, 167, -4132, -7429, 4878, 6512, 386, -1869, 4018, -226, -8413, -13377, -5519, -2083, -7579, -3595, -405, -5247, -6687, -12644, -18872, -20931, -16233, -8022, -1373, 3869, 145, -22607, -34370, -31258, -21967, -3963, 6055, 8300, 14835, 15453, 21870, 25720, 18618, 20539, 25483, 7170, -518, 2439, 927, 21121, 16981, 2585, -7097, -19569]
15390a9569K362J6055K495J0725p07n809R340k2362j597n594O614J950N91O984
15376A478j2849o435N709n674j547j088Q994j973l950m335l851j6896m852J3836
15362c3433K6264K5006O920k630k312j0374J097L102J886r921k519k0189n390
15349b2493k581j842K2789J2803q524j6137K860J5473J8455j362p227p563j3004
15336h353J5290R498j317n877k387J7340q373j4759L532J7539J2825M524r715
15323B9767l831j80q623j4141j870J1550P526k628k4639r528P8j283J8179N560
15309E937o849q621N993J5078j906n183j8204P267L838O780k61p91N429m064l010
15294A433N114K817j1625K386Q213j877l303l690M805J3953r974q41P287J932
$$ y = [-19569, -17207, -1152, 1343, 12068, 11361, 5552, 14892, -7470, -9067, -14661, -8047, -6097, -5506, 1478, -11371, -17806, -12097, -17771, -19318, -20406, -11412, -13385, -17335, -21670, -25521, -42417, -47269, -33433, -7169, 17837, 24757, 22127, 19815, 9441, 10538, 13640, 15526, 5605, 3086, -17103, -22493, -25074, -26916, -4127, 8676, 152, -15985, -13125, 2348, 20803, 19441, 12214, 4651, -8353, 6937, 16435, 15118, 9241, 6854, 24194, 15821, 1062, 4594, 22133, 34958, 39482, 29767, 25936, 25756, 17133, 2992, 1122, 12672, 20198, 17570, -7069, -16597, -16519, -17802, 377, 5937, -912, -9533, -3540, 11538, 9632, 4449, -13755, -6488, -2650, 4130, 3869, 3078, 8507, 4443, 1433, 6547, 9364, -2261, 125, 8338, 6461, 3158, -532, 4273, 18226, 8252, 7411, 14698, 16630]
15280A6630j3042j6335r337J0694J7218M289J1991r495j1506n181N785J3972j2047
15267C636J2477K2889j128k9355k0579r189O90k900J4615j1931j577Q550O91q748
15253b1859L600K5689K0559P95j6838j8231r02j7337j3273J6903J5416r526J6523
15240A519j3480k3789q482N28J1808M032J5750R339L361O578M737j0312q285J0179
15226C483J0600q851j3000o55j523j2441J0561Q225L469m706o460J2540j2454
15213a1212l097P551m015m516M622J9841J486K321j721O128J1854P649q459J1773
15199D0205k5880k8693l556P546m188P18J6467o0P890J0994P877O342q186K166
15185B9642q924l7J2863j0442j7610q488M539k810j424P747l144j9219N332O499
$$ y = [16630, 3588, -12747, -22084, -11390, 5828, 10117, 22108, 12613, 1107, -4074, 1711, 15683, 3636, 16113, 39002, 37874, 8519, -12060, -21249, -20559, -23459, -8844, -20775, -22352, -13802, -13111, -21859, -18259, 7430, 27989, 28784, 11946, -6285, -7187, -24524, -37797, -20894, -5478, -15004, 1519, -11961, -35750, -44232, -43704, -31896, -27864, -12114, -2775, 586, 7164, 11901, 1589, -6696, 3483, 14083, 5232, -7768, -8423, -9946, -22387, -11826, -3601, -132, -4838, -11298, 1242, -11212, -14309, -6758, -10773, -15289, -10667, 9174, 10660, 12981, 11260, 17388, 29242, 36891, 28432, 40205, 14325, -14368, -17924, -10378, -14566, -13848, 2619, 2559, 10449, 21443, 29320, 35662, 27476, 29642, 20718, 20681, 33544, 23102, 5492, -2996, 1543, -1267, -2691, 5056, 1912, -17307, -11975, -5476]
15171e476P542n289n880J255M940P981j317J310P139m733l513j248j2840K868
15157g261l790k2995M912J1865K139M978R684k48Q984j8702p692J1677K3321Q787
15143B5659K2m588L338r76o474J306m485p233L20J429J46j3939J68J4001J073
15128I767k1510j2708J6367J1442k890J8606K0160j0297o54N474J628J1270j8443
15115B8212j9622N340M059R302j0576O232j1132q283J156K66M571q187q773o773
15101a4208q148L229Q431O092L182L304J5199p068j3237j2471K634J660j969N613
15087g757n309J7015l017K467N21p146P320R104l907n638j7526J0372N953j742
15073G10J6377Q640J0857l441q162k1246k745O904K626j0653q899m564K2938J4826
$$ y = [-5476, 2066, -3223, -9103, -7848, -2908, 5073, 3756, 5066, 12205, 7472, 3959, 2711, -10129, -7261, -11051, -34046, -29134, -17269, -15130, -10152, -468, -716, 8268, -10434, -18126, -6449, 16872, 25659, 25681, 21093, 24431, 23455, 16981, 18287, 13802, 6569, 6889, 8318, 8464, -5475, -5307, 8694, 9767, -11743, -24451, -8084, 3358, 468, 19074, 39234, 28937, 28283, 33757, 35385, 46655, 28212, 8590, 13930, 17989, 27291, 16715, 22947, 11815, 3532, 4688, 4954, 9525, 1338, -7435, -14208, -22356, -19127, -10696, -4604, -1422, 1882, 17081, 10013, -3224, -15695, -13061, -11401, -13370, -7757, -13066, 3949, 932, 3399, 3920, -3226, 4094, 13198, 9291, 3653, -13873, -3501, 2452, 710, 17087, 25727, 36584, 33143, 24981, 3735, 990, 7894, 10520, -133, -9032, -13596, 9342, 24168]
15059B4168j7367R109N319j7259n355P599l798k958k272q007j0156M751N058q230
15045a9398J733J5796Q922r664J3807r309l192R691n985r690Q993R279k193m837
15031C953n520o201o943p222j2820R492Q082l893m343J1306j227q531J6873J2989
15017E995j474L283J223L32p974J875N261k496q811J03N58m015K108L284j9535
15002b0283P033K9414P927l56K543j393p511k0421q528J1381q07J0357j719m391
14988C246N244O882o962j608k17N533r011o705J962J800Q115J2765k523k7954
14974i433n262k470r48m677m126K707J6J3502m38J878J3079m542O407L458n235
14959C916M541J0410j5853k662J8407r760j958R049n8K3058L771j5600O383Q153
$$ y = [24168, 6801, 15910, 21229, 3970, -1385, 6214, 2416, -542, -2814, -10821, -20977, -16226, -11168, -19398, -17665, -1869, 7053, -2611, 11196, 1887, -1305, 8386, 2401, -7289, 1704, 10983, 8790, 3953, -1567, -7768, -14711, -21933, -34753, -25261, -17179, -21072, -25415, -14109, -15336, -23867, -6994, 5995, 4521, 7804, 9027, 9359, 1385, 3260, 8521, 6025, -2786, -2683, -2125, -6140, -4032, -748, -20283, -13250, 16164, 24091, 23735, 26278, 24885, 17374, -3047, -11575, -194, -1001, 9356, 7637, 3246, 8490, 15372, 8410, 6802, 6585, 12118, 3107, -3598, -1636, 164, 8279, 21044, 18521, -9433, -14695, -17165, -18113, -22790, -26916, -24209, -24193, -10691, -11129, -9251, 3828, -714, 5693, 9151, 3916, 8457, 18867, 3014, 352, 18759, 8999, 7041, 16090, 16032, 39090, 42861, 27261, 33644, 41797]
14945D1797q128k9637j7210J2794J3916p251m779j4376J148n84J767k482M521
14932h504p32j1619P919j1178q817Q577M248J224M74l432J405J5811q307q261
14918b1192J9839K120N519L435J189j2404r539J0379J2311P780n818j199J416
14905A3836L606N418j0321r126K503L715K304o208r608q918N160l547L688M112
14891c386l464M974J193K3387Q45r440j0208p52l3401n12J9510M260k507j2339
14877b1840k375J6719J0090k788j860R738J741n156l623k527k663J672J1296M418
14863A2842j898p442o286J100J376n840k6125j3213m986J461L5766K4820l409
14850H166j1242R209Q966N74j0495M457P569M064Q555j1676m468j3472K204k703
$$ y = [41797, 33669, 4032, -13178, -384, 13532, 6281, 1502, -12874, -11726, -12310, -10543, -13025, -8504, -9236, -20855, -12936, -24114, -32931, -24354, -20106, -18882, -18408, -21840, -20435, -4624, -12931, -21192, -1353, 767, 6286, 9721, 10910, -1494, -11033, -654, 11657, 19437, 13619, 12420, 13836, 17442, 22860, 12539, 3413, 5916, 9631, 11935, 5727, -3881, -12799, -7639, -11186, -7498, -3386, -6850, -1876, -683, 22704, 23549, 14109, 3901, 3149, -30252, -30764, -11254, -6994, -9501, -21840, -24215, -7496, 2594, -194, -2054, 7684, 9425, 4269, 646, -1881, -4544, -2872, 8424, 12842, 10944, 3502, -2784, -1684, -308, -6148, -32273, -45486, -50472, -49011, -13245, 11575, 8166, -3076, 6133, 15099, 15673, 5178, 9635, 17204, 21268, 29823, 18147, 13679, 207, 2411, -292]
14836b92J432R79j0845j3663k500K3187J4318p40j974J0619j0933r677j1481r901
14822b1471J2417J2190L073m073j0514Q587l251j0774J1185K084J6888M415l0851
14809a0095k9317J2301J9991J4592J085p449O760P743m797M76j5088n895j0606
14796b0299J7077J4892P466k086J1045n549q126m046J584p391j8069K725J2464
14783A687P828j472p396K054j7965l255N226p512J1079J0026m625n156p302J961
14769a4822K0214n863k1660M736M338j3687m602J3797J6564K2500m529k3151p48
14756f913R27K899K265K649J330K187N011r10k423j5144r937J2792M672K056J0063
14741A1524O360J486p279j220J6368J0605j0696n794m33j589j5273j5956j0711
$$ y = [-292, 1140, 2119, -8726, -22389, -24889, -1702, 12616, 11876, 9902, 20521, 9588, -89, -11570, -21471, -9054, 3136, 6209, 2136, -8378, 209, -3042, -13816, -2631, -547, 16341, 20756, -10095, -39412, -27111, -7120, 7472, 8557, 1108, 7868, 15611, 10814, 11290, -3798, -9693, -20299, -3222, 11670, 19136, 17050, 28095, 22546, 14420, 10374, 11958, 4567, -13502, -10777, 1687, 9515, 8043, 647, 2701, -15264, -18519, -13293, -20805, -9726, 300, -4325, -9481, -16783, -14822, 5392, -471, -22131, -17395, -13057, -26744, -31346, -17549, -985, 21515, 16986, -6165, -6913, -5986, -3087, -822, 1827, 3157, 5344, 10355, 9445, 7022, -8122, -18059, -5267, -595, 1461, 11524, 17884, 19370, 12091, 10871, 27239, 37844, 27148, 21354, 20921, 19332, 4059, -11897, -22608]
14728b2608K209N292j2968j2642O085R181l540K4949K896j1647Q836K436r751
14715a1272q2J5104J3271P283k5121k0778j7294K134J0342J7105Q06L593R413
14702D504O005j3205q809J0771K696r833j6805J2175J4289J64m013j6605q10k42
14688a9718l354J1599j9304P848K2246J7798p765j2168k2044j0690Q531N110J4407
14675g504O627N979J5376K341l4098j0744Q348n71J4000L098J708j541P155K2034
14661C2208J1764p787j5454j3366k998r598r77R145r528j4784j1262J4341K3595
14648E299M573k088r278N769L152q257r992j5954k7606L0487K6642r606Q025N240
14634F406j874N838m578j1343j4149k327K5284J0422M24q798m006J6100j9718
$$ y = [-22608, -20399, -15107, -28075, -40717, -34632, -25451, -28991, -4042, -1146, -12793, -3957, -1521, -11272, -11354, 3750, 17021, 24304, -817, -21595, -38889, -36755, -26413, -9308, -8502, -4909, 4504, 10509, -2696, -11505, -734, 1962, -7871, -24676, -12501, 1788, 1952, -2061, -18666, -19476, -19718, -23072, -11473, -30777, -22929, -683, 17115, 9350, -2818, -24862, -35552, -27021, -21911, -7504, -877, 5102, 20478, 22819, -11279, -22023, -13675, -14246, -246, 2852, 4560, 3019, 10174, 32208, 43972, 36185, 20731, 7365, 4367, -5231, -6208, 2937, -6591, -21375, -32637, -18296, 5299, 9872, 7784, -1494, 4275, 7427, -830, -10822, -26776, -54382, -23895, 2747, -6859, 1166, 6406, 4532, 10370, 5792, -5551, -19700, -22027, 3257, 13679, 14103, 5305, 1299, 17399, -2319]
14621b319m869j844Q15J5239o431o163J1488n512j2192k871K1852J6395J620j2421
14607A2787j4240k345j1134M43J8354K0457L531k6444r601P243n10n586O167J387
14593E09j0509p767n16O945Q576Q419k7531j4002J8856J3723Q260q584k403j3792
14579a9816J5921o157j7912j4679K5036J1728j6786L071K7646K7926J6242k8874
14567B3346k2776j0617l575L939J4256J4735j4587l4960L500L807J6645Q87n704
14554a1104O400J2457N494l635Q379p631q279k0124n400L409J4490L593k493L929
14540e15J2693J0406J2182j3108j0155k3660j1838q761J966K0688O784L553j4788
14527a4553r389L55R421K789K2754L457m045jq29k301P433j442m778j7114J9044
$$ y = [-2319, -7188, -9032, -8217, 7022, 591, -5572, 5916, 404, -11788, -14659, 7193, 23588, 25208, 12787, -1453, -3798, -14932, -14489, 3865, 24322, 27853, 1409, -8192, -949, -1459, -7045, -878, 509, -10000, -17767, -18283, -11338, -2762, 5657, -21874, -35876, -17020, -3297, 4963, -3621, -6024, -19816, -3895, -10052, -27964, -42643, -17607, -5879, -22665, -19594, 8052, 35978, 52220, 23346, 570, -10047, -13622, -9683, 4573, 19308, 4721, -30239, -26739, -22932, -6287, -5400, -11104, -4704, 7753, 13247, 9612, 17991, 10360, 2081, -18043, -23443, -20034, -5544, -1951, -4444, -515, 12178, 22584, 34766, 21658, 11503, -12157, -23995, -32756, -30790, -10102, -3318, 235, -14553, -23942, -23587, -14166, -11377, 11377, 14834, 10789, 10788, 9959, 7658, 15091, 13649, 8871, -8243, 10801]
14512A0801n561q125j5493p056J8114O842J6556l728q011q655k590r216k915K895
14498a6142Q382J6451J0164l141j3010m381j6376q85J6200J7634k859o576k071
14485C390N532L010k2063P408R094L244j656K982M90j0962q438M84Q276o487j2216
14470a7912jJ7304R672j359J081K776j8451R270R512m542r952Q080R00p368J4382
14455A3392J8731n194j7397m318K8831m13k0638J2341q143j7059j6333l279J7828
14442a651K0965M884q602o958j5724J064J5900J3380l21m552K626M643K58O077
14428C1989p064j7447j4530Q46k48J957j871j2797m746K374K543P455K652J126
14414g761N056j0430j1025J40L870K3557R162k373j1565l949j45M472O517N905
$$ y = [10801, 5240, -2885, -18378, -25434, -7320, -478, 16078, 12350, 4339, -4316, -6906, -16122, -19037, -16142, -7760, 8691, 18855, 15714, 2704, -1677, -18053, -18938, -2738, 14896, 12037, 5461, 3390, 8922, 11932, -10131, -2723, 6371, 9615, 7959, 10941, 11431, 469, -7969, -7485, 791, -5696, -17912, -17913, -609, 9063, 7704, 8785, 11561, -6890, 2380, 11892, 7350, -2602, 5478, 6378, -990, 13392, 32123, 26929, 9532, 5214, 34045, 33632, 12994, 25335, 17192, 133, -16200, -19479, -1651, 19314, 24198, 15596, 8638, -7086, -6022, 9878, 23258, 22937, 18385, 21011, 25654, 25912, 31989, 24925, 7478, -7052, -6206, -6454, -4497, -6368, -19165, -23911, -21537, -18994, -11539, -8887, -7761, -2705, -13135, -24160, -24020, -20150, 3407, 12569, 10196, -1369, -5318, -5463, -991, 5526, 11431]
14400A1431J152q397N87o540r429m833L105J0473K088P95O369q120J4147L713
14386A6541J8419K0187j4015j1460j4923j9503q652J0698l130m893L272P391j1822
14373a1890l67N387Q597j010k114n764p100k1222k084N053Q404O736R177Q18k890
14358a0269P782j072J0817M427p584P750R147K476j6971l378O566O489p288j0480
14344a588O368m558P369n014j1930j3255O26N393K0680K434k5136k3402O048J4019
14330b1946J5657J8113j271j1005Q931N100k575P887N560r535j1823j3732J5413
14317D774K2539J2082k0370j1450J863N355O787j4129j3805j0348J0202J3869
14305G369l10r615K632o231n604k372o363j3838k671J8294J4924J793o611k698
$$ y = [11431, 12583, 4186, 4773, -1767, -11196, -16029, -12924, -2451, -363, 432, 6801, -1319, 12828, 16541, 34960, 55147, 41132, 29672, 14749, -4754, -13406, -2708, -5838, -10731, -7459, -68, -11890, -12257, -6870, 1727, 717, -1397, -7161, -14261, -35483, -37567, -32514, -24110, -17374, -8197, -7379, -10269, -2487, -3559, 7258, 11685, 4101, 11851, 20998, 23474, 6503, 3125, 9691, 16180, 8892, -1588, 4780, 222, 7591, 2577, -9353, -22608, -21982, -16589, 4091, 6525, -18611, -42013, -35965, -21946, -6289, 11824, 10553, -452, 8479, 13579, 11004, 18891, 24451, 14916, 3093, -10639, 4774, 27313, 39395, 19025, 7575, 9438, 14793, 21580, 7451, -6354, -16702, -6500, 7369, 7059, -2556, 76, -6155, -11759, -14131, -20494, -34332, -37003, -18709, -3785, -1992, -8603, -11301]
14291a1301M335P897J191K494p557n402L750N117k999M315j4072p777r25r299
14277c0233n860J3832J8401o980J4463J860L307r38k1454L853M51O656Q134P460
14263A2952J0885j7735Q881N4p473j2134M937j66J2162R994L671j7165q173R06
14249A596o889r377J7545O591j3190j816j2928o81J284j8448J0526K5690o055
14236f152l490M44J3415O651n584j0970L617Q966K0120R338P313j964r603j2170
14222A9931N820j061K692j734j0898m514q269m102J9084j1376m483P78Q329J6134
14208B6331o544j4214l958k500m319q78J9867J0783r536p628J4686J3949q961
14195B7078r747K356K509r222j0641L435J9865Q599o145m978j8657j0722q551
$$ y = [-11301, -6966, 931, 2122, 4616, -2941, -8343, -4593, 524, -2475, 1840, -12232, -20009, -20934, -30233, -36093, -22261, -3860, -10840, 3623, 5483, 8790, 7852, -13602, -9749, -9298, -2642, 5492, 12952, 23837, 6102, 14983, 15037, 7564, -4570, 367, 201, 12363, 22357, 26028, 8863, 690, 1596, -5293, -14670, 2875, 9466, -3724, -5540, -18468, -19149, -17865, -36313, -25787, -97, -6152, -9642, -9198, 4217, 10868, 5284, -5686, -2069, 6897, 27017, 36355, 43668, 41704, 32101, 19931, 25751, 24690, 27382, 25648, 14750, 10236, 1967, -2135, 16949, 5573, 1090, 1868, 10197, 26331, 19787, 5573, 1615, -885, -5204, -6082, 13785, 24568, 15032, 7404, 22090, 36039, 27078, 17331, 19687, 22196, 12974, 2333, 5768, 25633, 34232, 28087, 23109, 4452, -6270, -14821]
14182a4821J9365J2730k3773q336J9545J6942Q936J967j6978j2854N339J4529
14170B2591j607M622q463J4265k133Q320k2108k8169M170l698R519J4967J2671
14157B4947P531o458N00m77j396r910r527j9576p325j712J5223L510J006Q710
14143E046r963k541l12r404J1626O96Q363J1189n623r402j500p442q05Q640P919
14128F487q172l715J9500K807l463j440p141j7707j7127K978K9521R312j2695
14115h55N268j0401j4950Q175k432P238R625m532J1951p792p004q808P605N927
14101i85j1583j2247l629O047J4408J1550r732m134J4237M638J2937k4991p799
14088a1283J6532J5139K0898j8801m476J3448J5256q397k9371p280K832O853P928
$$ y = [-14821, 4544, 17274, -6499, -14835, 4710, 21652, 30588, 32555, 15577, 2723, 8062, 22591, 20984, 25606, 17143, 31408, 29275, 37595, 15487, -12682, -8512, -12210, -2691, 12276, 24947, 32478, 26020, 26520, 26043, 24647, 14737, 5210, -14366, -21691, -23403, -8180, -4670, -3664, 5046, -4917, -7458, -7770, -17174, -5548, -4852, 3511, 14700, 9077, -325, -1825, -9267, -10072, -1432, 6487, -1685, -5400, 14100, 16907, 13444, 12004, 4863, -12844, -29971, -26993, 2528, 11840, -855, 4413, -5988, -20938, -12763, -15195, -7957, 1668, -2864, 9087, 1295, -5709, -14517, -6912, -985, -12568, -24815, -28444, -22397, -7989, 3561, -6171, -10305, 3932, 8570, 21507, -3484, -11283, 5249, 20388, 41286, 22485, 18009, 31457, 46713, 38316, 8945, 1665, 4497, 11350, 19278]
14075A9278J2983l708N255p659j7696J0141J464k2508j162O638o092j0456J7306
14062C784J512j1888j4425n46L096R435J5075Q417j90j1383M61L153M22J1503
14048A8426o944j3810P83J595m206O346K33o783L846m13r502J5256N298j5348
14034e223j444J7218Q330o526M304j0010j3341r978K495K925J1568J4351N057
14021A9726j1771j5586j6201Q25O759k789J4145J2306j576j654J0817R646p104
14008A7543j102m708L871P839k4879j9670M531J4332k02O559J340L150R279L085
13994B0968k765R589J3101j5372r085K0637m52l1229k9977N718O525Q586m532
13981h288j3491J2540K808r686N347P447J7287N381j8279J140Q19p130L149K2769
$$ y = [19278, 32261, 28553, 33808, 26149, 8453, 18594, 20058, -2450, -3612, 3026, -3066, -13522, 3784, 5296, -6592, -21017, -21563, -18467, -9032, 6043, 14460, 14270, 2887, 3348, 6501, 6923, 18426, 11482, -2328, -1545, 50, -4156, 2190, 2423, -4360, -514, -927, -10429, 4827, 10125, -5223, -6667, 10551, 18881, 12355, 16659, 6649, -6692, -16670, -14175, -11250, 318, 14669, 19726, 7955, -7631, -23832, -23007, -16248, -19037, -4892, 7414, 5838, 4184, 15001, 24647, 17543, 16441, 11733, 15604, 23443, -1436, -21106, -16575, -2243, -2445, 4114, 5454, 8604, 17883, 20968, 18203, 27792, 40893, 25521, 16436, 37073, 36621, 5392, -24585, -18867, -12342, -3756, -8288, -21779, -9239, -6431, -16117, -10770, -3323, 13964, 19345, 1066, 2206, 3025, -4105, -956, 21813]
13967B1813J204o173k0351l289j1362o948J2432J0832j7171m405L242q834J4656
13954a4354Q703J5319n29L603j14l419q100q749P525J0238p728k0570P938J4725
13940D488l452R07n713j8093j4693R468J0799K0530J427N098l645j255Q550p021
13926G395p468J054j7114j3260o345J2195M228J4963J394J344M125p612r741Q997
13912e845J5978P342j3186J1218J6496J533j2185n980j9052j4631n598J0965m635
13899a7580J927J5428M646j815j0275N91p338O273j5842J951K1103O454R19O501
13885A2943r256p788r968J1285R26o046k26J5643O01k258o222m886K781q101j232
13870a1804p944J4003J2396J3192J3604l832k420k2474k081L811P754n393r166
$$ y = [21813, 23017, 16844, -3507, -6796, -18158, -25106, -12674, -1842, -19013, -23418, -20176, -29010, -14354, -5651, 9668, 9139, 12742, 12628, 9209, 1109, -7640, -115, 10123, 2395, -18175, -10237, 4488, 1036, 1943, -3770, -21863, -36556, -27088, -16289, 4241, 5668, 10766, 7121, 5866, 14416, 7395, -73, 981, -16133, -29393, -35738, -23543, -19315, -4352, -2958, -1614, 2511, -5101, -14842, -5845, 10133, 17475, 4289, 15507, 32003, 33536, 21351, 15371, -3681, -18312, -23910, -12945, -17580, -15653, -225, 4421, 2606, -7669, -7078, -14416, -8143, -23985, -22034, -931, 5523, 6442, 12943, 3687, -4101, -14069, -2784, -1858, -7904, -8130, 7513, 8114, 5856, -366, -5252, -2471, -10572, -11804, -19748, -5745, 6651, 19843, 33447, 29615, 27195, 4721, 2640, 6451, 14205, 8812, -354]
13857c54L39N040O53j3633m884m21l730N428K2274M140j8243q932P523j538L321
13842c017n390q511J3892K496L007O743L06n331o904R227P818J367R84o828j2909
13827c050L404Q265l341j6099j1176P47J1595N313j2806Q438K1341J128m007N851
13813A5603K929m351j297j7908Q221P868l452P589n992n627n903O611j29l228
13799I34n82J3076K0721Q510P772l653l0692j8340l337o615J0039O331J0749J1384
13785B6297J5931n210n107P793J1441j3703o212o769o175r550J865P044j545r188
13771F912l242P776P785r530n020M734j968o388r444Q343N687l35J866l654j2235
13756h713o584Q502q428L823J9438m535q358R510K4114L731j3200j2703j7423
$$ y = [-354, -15, 5025, 5678, -7955, -12839, -13260, -16990, -11562, 10712, 14852, -3391, -12323, -4800, -6338, -3017, -8407, -16918, -3026, -530, 2477, 9220, 9526, 4195, -2709, 6518, 14336, 15703, 16687, 9859, -3050, 354, 8619, 5278, -10821, -21997, -21250, -9655, -4342, -17148, -8710, 12631, 13759, 9752, 15603, 18532, 14181, 12884, -5024, 3197, 11065, 7613, 15202, 9210, 3583, -2320, 4291, 4162, 934, 352, 13428, 34149, 42659, 50431, 46778, 16086, -2254, -5591, -12206, -2167, 4164, 14913, 26297, 42228, 37018, 31911, 39704, 51145, 37442, 31230, 24461, 18286, 8736, 10601, 17645, 16100, 6912, 3670, 11446, 19231, 9701, 4681, 9415, 7447, 1059, -8385, -42, 5645, 5310, 7176, 3522, -8713, -15297, -6795, -15223, -11400, 8038, 3503, -4855, 4655, 28769, 32500, 19300, 6597, -10826]
13743a0826K421M631r07J571J2224R132n099p475P385J462j0233J4832L231K278
13729B4627j38J597j3055o984k692q36N223m734o875m223m102l86Q038k74k318
13714g132O355R267J1357l684j9853J2475l280l908P805O976j9986j7378O556
13701a4430L359K151M848n139N141K3120J3788J8488l043l1074j5954q267J065
13688e947L600o026R230o583K597L671J4637l399j8812N130P574j4j3723n228
13674a3293J4330p579o166L171j2673p559p973J3783O8J582N810k315R388M567
13660d859k393J2136j4685r257O660R569o048P955J5687P2j3079J417Q796J0069
13646B2040J4768J785j1879k7898j999J4475L853p276j2921q408O239L811K506
$$ y = [-10826, -8405, -3774, -4681, -3110, 9114, 18246, 13147, 5672, 13057, 14519, 4286, 19118, 22349, 24627, 24489, 26086, 13031, 6047, 3355, 2519, 7742, 3008, -3867, -8090, -12192, -12578, -4540, -4814, -7132, -777, 8490, 19847, 16163, -3690, 8785, 5505, 1597, 9402, 16378, -3608, -20986, -14430, -11071, -8920, -4072, -9211, -4070, 19050, 32838, 51326, 48283, 17209, 1255, -7012, -5947, -2347, -8373, 857, -5726, -3129, 542, 15179, 11780, -7032, -1902, 5672, 5658, -8065, -13293, 1037, -6542, -12708, -9537, -22210, -29769, -37742, -23959, -23891, -22309, -16499, -18814, -9426, -4859, -7252, 4884, -9801, -19058, -12398, -2829, -8877, -922, 14765, 14837, 1758, 3175, 11971, 22040, 36808, 38593, 26714, -1184, -3183, 11292, 15145, 7869, -5052, -13460, -7221, -3410, -904]
13633i04l802j0397L21K588j0879J4194R416J039J5278J247j0800r8N126J594
13619A3923j4977l15M583M210l080k421l783M547j8295j1435Q479P211M247J0632
13605C526J8366l456o788m453L979l899k2951Q793R266N921N296j3337j6062Q532
13591g267j4280k314P756o744J0845J0879r897j2542J339K1683P202m637j6849
13578a4826J937J8822P84m799j96J4452K358n30m946k731q972j0918j5176j1403
13564c6144Q059Q947J1514l046p276n506k731J7645O53j1195J1637p758q288j8847
13550d2336J5677K1053R94q745P890Q638l929p863K109j9685j0578P291J5543
13537a3941M877m695K183Q907k1k103J630n599q966j906p145r426O963J494N408
$$ y = [-904, -4706, -15103, -14782, -12194, -23073, -8879, 537, 1576, 16854, 18101, 7301, 7203, 12329, 13923, -1054, -1369, 3214, 7424, 4344, 1923, -1860, 2687, -15608, -27043, -18564, -11353, -7106, 3526, 21892, 18436, 11648, 7195, 11174, 7275, -15676, -6883, 2383, 8304, 13600, 263, -15799, -7267, -21547, -23861, -16105, -22849, -12004, -1125, -11022, -23564, -22225, -542, 6660, 2023, -14826, -12889, 5933, 6717, 1918, 1722, 16174, 18532, 18002, 13056, 10325, 1353, -9565, -24741, -36144, -28085, -19138, -7624, -10670, -17946, -23452, -26183, -8538, -7885, -19080, -7443, -15201, -23489, -42336, -26659, -5606, -4612, -13357, -5467, 3171, -758, -8621, -6512, -26197, -36775, -29484, -13941, -9064, -13759, -11576, -2669, -2690, -4793, -3163, -8762, -17728, -19634, -26779, -36205, -29242, -27748, -22340]
13522b2340j3486J6772L5140N195m12j5884m713l340N801j941j1057O933J4472
13509A1140L648p148n644k517j3060o181K633L772L252L042J5477j362N62k463
13495E151L175l041m040P859p913N032k106K339J4653k762K277Q941l693N398
13481C1270N140o815J6222L7827K6692O255j290j7751l6497l1539j022n495j9680
13468C317O302l731q945j2093J9936N942j3930j5644o893J6613K7333j3738L27
13455D796M709j9204j0164q847J2573J9045M080j431L075l624L341R260J105j8503
13441B11m436N436K085j0578K504P300K0799N344j3487m690P240J2849j0714q233
13427A1630n42R510N226N737J1470m544l1908p259L067P587j352O058P620N716
$$ y = [-22340, -35826, -19054, 16086, 21281, 20869, 4985, 272, -3068, 2733, 792, -10265, -3332, 11140, 14788, 7640, 1996, -521, -13581, -19762, -17129, -13357, -10105, -7063, 8414, 7052, 7614, 5151, 8326, 5285, 1245, 9104, 1191, 6223, 4117, 6456, 21109, 18347, 20624, 29565, 25872, 31270, 36410, 29595, 45817, 83644, 110336, 116591, 115301, 97550, 61053, 29514, 28492, 22997, 3317, 9619, 5888, -3057, -15150, 4786, 10728, -3202, -18846, -25739, -9126, 18207, 4469, 4796, 9505, -9699, -19863, -28710, -16137, 2908, 6988, 5557, 8632, 5008, 8349, 17609, 18714, 211, -4225, 1211, 3296, -7282, -4778, 2522, 23321, 28665, 15178, 10488, 17728, 30577, 19863, 11630, 11088, 20598, 25824, 31561, 43031, 38487, 6579, -680, 2387, 9974, 8622, 14680, 22300, 28016]
13413B8016k79j2675L527L055n112M397R254q378k371q313j1430l941j937K480
13399c707l806J251N643j981j0442Q363K519n456M615J3194J7836K42p686j847
13385A8738J3235J517j2025j6151Q086J921j8615L922L676K659Q373j1656J959
13372E639j0572m020j319J838j693n681m078N661O008J1958j2124r234q186J7316
13358h487M369J2904J1744j451o066J91O671j1296N108N363M504P624o573k987
13344B1618j9962k2210O980J7968J6858k578j5989j1201N317O323J5674K1685
13332D0483n30j208o36K975j3828q491Q726p560j3523j5396L663J3131J6971j440
13318B3337j9378n087m922K331j3006k174J5282p248J2975r368K232Q672K63l640
$$ y = [28016, 27737, 15062, 18589, 21644, 16532, 20929, 30183, 21805, 19434, 11121, -309, -4250, -6187, -3707, -7513, -6262, -619, -2600, -13042, -4679, -2160, -7616, -3001, 10193, 28029, 28271, 20585, 18738, 31973, 33490, 21465, 5314, 13400, 15321, -3294, 628, 4304, 6963, 15336, 3680, 5639, -4933, -8953, -10272, -8434, -10127, -15808, -19886, -14225, -8217, 3741, -8383, -17617, -25803, -8487, -4118, 8786, 20530, 19079, 13013, 13204, 19875, 8579, 13687, 19050, 23554, 31178, 24605, 21618, 1656, -20554, -13574, 4394, 21252, 18674, 2685, -8516, -3199, 3124, 18798, 40483, 39953, 38745, 38109, 41084, 27256, 18765, 27491, 19931, 6408, -8988, -5325, 7806, 24777, 23337, 3959, -1128, -6050, -3719, -16725, -18899, -3617, -10865, 2110, -7258, -5026, 3646, 3909, 269]
13304B69L282o029j3250P94O710J0227j235j6210J0736k722O630J0422j0190O909
13290F343q040J0839J5041j849M465O88p608k4824p09R385K221o652k1770R328
13276a3142J2988l079O282n922O3k383j533J1383Q905J1096K783j2719j3608m865
13262c751J5015M109m226j9628k863m112l715l20Q984J4860J2712j0666K664J444
13248A0507O053j7340j5276q331K883J3094J1723Q21j788K104N863j1611q428
13235i726l36R757J8248k7441K779O755o915Q865M827o35j3784L695J7205l833
13221I461p791o471n106Q206q38M661K0169M897j8450j0170J2404P979J275j2172
13207H054J1314J0793j1433k417l839j23j0535O246n467O443P664j5466Q0o50
$$ y = [269, 3551, -2478, -15728, -14934, -8224, 2003, 768, -15442, -4706, -7428, -798, 9624, -566, 6343, -1697, 9142, 24183, 22334, 26799, 27487, 19879, -4945, -5654, 3731, 5952, -700, -22470, -13142, -154, -3233, 3049, -2873, -2810, -5193, -6726, 4657, 13562, 24658, 27441, 14722, 1114, -3751, 11264, 15373, 11147, -8481, -11344, -15456, -19171, -19491, -10507, 4353, 17065, 6399, 9063, 10507, 16560, -780, -16056, -24387, -21504, -8410, 3313, 4134, 2346, 4450, 10313, -1298, -9726, -10062, -305, 17943, -9498, -6719, 36, -6879, 1986, 6813, 6178, -7606, -3911, 13294, 9461, 1670, -4801, -9907, -1701, -2539, 2122, 22291, 27188, 8738, -1432, 10972, 18951, 20226, 8054, 19368, 30161, 18728, 16311, 12472, 12349, 1814, 8060, 2593, 9036, 16700, 1234, 1314, 664]
13193F64J2622q642Q179K469P893L496l790j7796j2993l868K6772Q410l285K035
13179B2166l236o22P109R025m124n640J850j1415q928n907j2174j5832J8285r002
13165a8445J761L1806K0455j0147K272Q208n92P842N783k4149j9244q39j1829
13152g118r574O354J1175N572J7556N653J145O591m880j7470J1592O028J0702
13139D3326r723J7835R173R17j9500k6232J67J1915l619j4089j117K342q457q09
13125B129M90m379R280J5286o874O012R620O868l749J6360l707j1012j2553m756
13111A9015Q333J0731N905N721P865J2603P445P243k232j6894J0027J8046K2810
13098A16618O4597O4840N4059O9721Q1202N7424J4294J6518J0783J3155p919l0167
$$ y = [664, 13286, 4644, 12823, 15292, 23185, 26681, 22891, 5095, -7898, -11766, 15006, 23416, 20131, 22166, 18930, 18308, 25417, 34442, 30318, 24678, 26528, 15113, 6185, 278, -11896, -27728, -9443, -18445, -16684, 15122, 35577, 25430, 27702, 35910, 35318, 43160, 48943, 24794, 5550, 4711, -7118, -16692, -10338, 837, 6409, 23965, 29618, 30763, 37354, 32474, 15004, 26596, 32624, 43326, 33603, 51438, 60611, 61528, 42028, 15796, 15963, 27878, 24259, 10170, 9053, 11395, 2938, 2129, 2619, -1760, 7520, 22806, 15932, 21944, 31564, 38432, 34683, 51043, 47336, 36324, 23771, 19015, 27348, 38079, 43984, 49705, 57570, 70173, 77618, 84861, 82629, 65735, 75762, 93808, 116618, 181215, 246055, 300114, 369835, 451037, 508461, 522755, 539273, 550056, 563211, 555292, 525125]
13086E25125m8524p5785q0127q5310o6013m0472k8923l6083M914q191j5336M696
13074D9971K3602K631j0527j6211m299M567J490R251p024p680r993N729o774k323
13060C2410j7610R196k003m979j664k952R303L983J6822q728J840N431o408P81
13046C5422k670K6280K631j1776k0538J994K170J4850K003l718o073M179n952
13033C8802P724O563m091q931J1538K9271J2328J4284J7313M5158O0821K5713
13021B56493p780k1648k3238l7198m3859l3617k5214r294j0137n234l135n309
13009C0830j184O532j74K0887R909j2717M639m073j1266j4271K88Q610k197p207
12995B8606O846J88l871L782k119J3123J2288j2708K339K4073K4141K1313O9117
$$ y = [525125, 476601, 400816, 320689, 235379, 169366, 128894, 99971, 63888, 68802, 60611, 45275, 49971, 73573, 76204, 65677, 49466, 45167, 49734, 51224, 60475, 53451, 45771, 35778, 41507, 34733, 32410, 14800, 23996, 21993, 17014, 15350, 12398, 21701, 25684, 42506, 33778, 35618, 41049, 34641, 35422, 32752, 59032, 61663, 49887, 29349, 31343, 33513, 48363, 50366, 46648, 40575, 44754, 38802, 46526, 53089, 48998, 40067, 51605, 80876, 93204, 107488, 124801, 169959, 230780, 256493, 248713, 227065, 203827, 166629, 122770, 89153, 63939, 54645, 44508, 39274, 36139, 30830, 29646, 36178, 36004, 56891, 66800, 54083, 58722, 54649, 43383, 29112, 29400, 38010, 35813, 28606, 35452, 35640, 31769, 35551, 33432, 46555, 58843, 46135, 48474, 72547, 96688, 118001, 187118]
12982A87118J25297J58277K35900L26460K92153J20142p5164k01714k67269k63781
12972F37419j94378j22254p4350l9177l3334k6425m0954j9100n721j6088j7831
12961D7807p617j4764M872m606o861Q298Q520q178K865J0351j325o480m303J303
12947B9882r060O238O257L3705K2452L9240M4479L8305K4437J311j8544l2460
12935A86242k6592j5474p833M284j5749j8006j2838r869q496j5332N090N918o08
12922G0737q880k445J420O106L706j1928q921R043p705p250O808j2805r654m391
12908B3841J5258J2447K613J989l866o222j5106o617J782P182J5296J2522R86
12895F2105j1092k986p441J6050J2410J6498K6108L7395K0930P493P465l944k8838
$$ y = [187118, 312415, 470692, 706592, 1033052, 1325205, 1445347, 1370183, 1168469, 901200, 637419, 443041, 320787, 246437, 207260, 173926, 147501, 106547, 87447, 81726, 65638, 47807, 40190, 25426, 30298, 25692, 18831, 27129, 35649, 27471, 30336, 40687, 39362, 32882, 28579, 29882, 20822, 27060, 33317, 67022, 89474, 128714, 173193, 211498, 235935, 237246, 218702, 186242, 159650, 144176, 136343, 140627, 124878, 106872, 94034, 84165, 75669, 60337, 65427, 71345, 70737, 61857, 59412, 60832, 66938, 70644, 58716, 49795, 58838, 51133, 43883, 50691, 37886, 28232, 23841, 39099, 51546, 54159, 56148, 52282, 46060, 30954, 24337, 26119, 33301, 48597, 61119, 62105, 51013, 48027, 40586, 56636, 69046, 85544, 111652, 149047, 169977, 177470, 184935, 180991, 152153]
12882A52153l6245l2316j5603N795j683p738j6799p038l733k492J802J8148Q953
12869F3204o768K0062J832J294P927J8914o365j3546K456P635N078j0057l00m282
12855H7084j900J3758M078K785K4547J9757n575l9890k0945j1837j9684n963j210
12842D5005j1232j4133k938J2409k828n240j9692j9339j3762R052K0092J3238
12830A0632J1932J7164J7647P399M788m349p102j0510l214k252l193K733J4147
12817E5822L2266J7985K3011J7699K0783J735R202l507K72k650r170j2936M332
12804A54844J4884J6224j1316k8650j3745r448J418j1260p290L615j4629k7586
12792F7061J4495N240m748M218J1306L37m661J1776N133L700q029M193J607N916
$$ y = [152153, 115908, 83592, 67989, 73784, 72101, 64363, 47564, 40526, 36793, 34301, 36103, 54251, 63204, 56436, 76498, 78330, 79624, 87551, 106465, 100100, 86554, 89010, 96645, 101723, 91666, 91366, 87084, 85184, 98942, 103020, 105805, 130352, 150109, 144534, 104644, 83699, 71862, 52178, 46215, 45005, 33773, 19640, 16702, 29111, 26283, 21043, 1351, -17988, -31750, -22698, -2606, 10632, 22564, 39728, 57375, 64774, 69562, 65213, 58111, 47601, 44387, 42135, 38942, 41675, 55822, 88088, 106073, 129084, 146783, 167566, 169301, 178503, 174996, 175268, 172618, 163448, 150512, 154844, 169728, 185952, 174636, 145986, 132241, 122793, 124211, 112951, 105661, 109276, 94647, 67061, 81556, 86796, 82048, 86266, 97572, 97909, 93248, 105024, 110157, 113857, 105828, 110021, 111628, 117544]
12778A17544N360j1526J1349J3034K8509J2875R169K326J2795L8273L5058j78
12766B74588l463k4726m0902k2215j7031j6012M965K3364n057J271M053J4639
12754A93474J8700J861J0312J5916J2890J9951K3043Q08k7721j3015J7698Q460
12742B82377k1120K419Q843O809J9851J9027L2959K6901P967J1432J8739K0970
12730D37174K4951K8183J3418m589O901J3697J3810L1982L6006M9924N8906N3197
12718G63560L9802M5701R2461J11696R2198J30127J67981J85444K21858K48460
12708B099288K56088K80280K93815L05120K55577K34480K27890K97375L53553
12699D603466L95658M41497N18407O02253P79195J072315J529184K204592L214492
$$ y = [117544, 122904, 111378, 122727, 135761, 164270, 177145, 186314, 188640, 201435, 239708, 274766, 274588, 271125, 246399, 205497, 183282, 166251, 150239, 155204, 178568, 173511, 174782, 178835, 193474, 212174, 214035, 224347, 240263, 253153, 273104, 296147, 296955, 269234, 256219, 273917, 282377, 261257, 263676, 272519, 279328, 299179, 318206, 351165, 378066, 386033, 397465, 416204, 437174, 462125, 490308, 503726, 499137, 506038, 519735, 533545, 565527, 601533, 651457, 710363, 763560, 803362, 849063, 941524, 1053220, 1145418, 1275545, 1443526, 1628970, 1850828, 2099288, 2355376, 2635656, 2929471, 3234591, 3490168, 3724648, 3952538, 4249913, 4603466, 4999124, 5440621, 5959028, 6561281, 7340476, 8412791, 9941975, 12146567, 15361059]
12690A5361059M834444P623988J1989824J6857079J8967502J5677135Q297831
12683I9608862J320029j425457K82404K813345J741416l836886j0902491j6004107
12675G3597115j7457352j5469852j1662837p949837n224341l461110k338137j622358
12667H411291j154899q42959o58633n24754m46485l74003k70775j97279j74570
12658C766934j89026k74306k90810k90538k67369k26292k21825k03344j79678
12649A623746j66810j13719o9379k2955j4557j9873m8866n9896m6431o8439q4870
12638I07951q8217o7810m8463k5618j9389j3467m7013o7750n8933q329p827j7800
12626D37335j5000J076n184Q605k111R626j214L246j9602k3933k9738j7974q374
$$ y = [15361059, 20195503, 27819491, 39809315, 56666394, 75633896, 91311031, 99608862, 100928891, 99503434, 99785838, 102599183, 104340599, 100503713, 89601222, 73597115, 56139763, 40669911, 29007074, 21057237, 15832896, 12371786, 10033649, 8411291, 7256392, 6413433, 5754800, 5230046, 4783561, 4409558, 4138783, 3941504, 3766934, 3577908, 3303602, 3012792, 2722254, 2454885, 2228593, 2006768, 1803424, 1623746, 1456936, 1343217, 1273838, 1250883, 1236326, 1216453, 1167587, 1107691, 1061260, 992821, 907951, 819734, 751924, 703461, 677843, 658454, 644987, 597974, 530224, 471291, 462962, 455135, 437335, 422335, 423411, 418227, 426832, 424721, 434347, 433133, 436379, 416777, 392844, 363106, 345132, 336758]
12613C36758j4005j4280o898J2890J7486P784J6087K0300P703j0561m207j3645
12601C55412j5450j0627o778L50r458q503r756n632Q331o926R33K9764J5730N169
12587C42559L263j0148r342Q941R293K2232j406q1Q077M274P313O449K8775K5809
12573D46008K0552L287M125L4667K1682L5433J6702M79J4330K7152J5149L011
12561F42577L5284L4415L9406N7587N1665J9898L91O058L3129N9180Q2146R5777
12549A157513J02695R5196R7604J18050J12153P8670O4419Q9469R4253J33998
12539B144020J84551K08024K10632K56310L00505L70149M58964N87592P61962
12530E482709R83530J241684J456696J584521J799462K286544L065361M259946
$$ y = [336758, 322753, 308473, 301575, 314465, 331951, 339735, 355822, 376122, 383825, 373264, 369057, 355412, 339962, 329335, 322557, 322907, 313449, 304946, 295190, 289558, 297889, 290963, 291896, 321660, 337390, 342559, 345822, 335674, 326332, 335273, 344566, 366798, 365392, 365311, 373388, 377662, 384975, 391424, 420199, 446008, 466560, 469847, 473972, 508639, 530321, 565754, 582456, 582935, 597265, 624417, 639566, 642577, 677861, 712276, 751682, 809269, 860934, 880832, 881223, 887281, 920410, 979590, 1061736, 1157513, 1260208, 1355404, 1453008, 1571058, 1683211, 1761881, 1826300, 1915769, 2010022, 2144020, 2328571, 2536595, 2747227, 3003537, 3304042, 3674191, 4133155, 4720747, 5482709, 6466239, 7707923, 9164619, 10749140, 12548602, 14835146, 17900507, 22160453]
12522B2160453O108671R128306J4581756K4830537M2020141O0236058O0620000
12515B39685922L1836055o063055l5446638n2293102n2750428m0890188k6852295
12508E7226271j6597067j0428511o847643m681123l288036k417577j929561j643716
12500I393037j390432j209811j003879p93737o30218n02638m32619l79776l07021
12491B742906k24435j98123k08783j91012j70497j61990j33500j04584r2395r5632
12481A161955o8684l2969N965R267j2334l5290o1725o6125p3438l9749m357K322
12469G84838k3950k9301l1235m5668m3176l7420k4538m64Q003j7384k3838q095
12457E07772l304r91j7632j6596j0987j9576l4769j7299n791q989j100k0079j625
$$ y = [22160453, 28269124, 37397430, 51979186, 76809723, 118829864, 179065922, 239685922, 271521977, 265458922, 230012284, 177719182, 124968754, 84078566, 57226271, 40629204, 30200693, 23353050, 18671927, 15383891, 12966314, 11036753, 9393037, 8002605, 6792794, 5788915, 4995178, 4364960, 3862322, 3429703, 3049927, 2742906, 2518471, 2320348, 2111565, 1920553, 1750056, 1588066, 1454566, 1349982, 1257587, 1161955, 1093271, 1060302, 1066267, 1075534, 1063200, 1027910, 966185, 900060, 826622, 786873, 782516, 784838, 760888, 731587, 700352, 654684, 611508, 574088, 549550, 549086, 557089, 539705, 515867, 507772, 504468, 503477, 485845, 469249, 458262, 438686, 403917, 386618, 380827, 371838, 370738, 350659, 349034]
12444C49034j4761m897J1448J21j5291q330q456J8480J2118j2901k1888j7180
12432B87497Q919k399k499k0730n093k1298o913J5335O217m213k5963j9209j0004
12419A99647J3802J3548P830j1L273j0222l792o223k9206j5612p537N503J4113
12406A85113K642R229P891j4634j2128Q778K5982J2617J15j0554n896R230L9788
12393B58173L1547K8974L3292K6005J3334J0706l0434l4803l4767n0640l7288
12382B14099k5815n898J419j8656k8078k2791n953k846J4453K7860J1441J0615
12370A69850j0045k5071j8333j1771R698p660P277L5531L4526K7842J7799O789
12358B36432j4405j2648l1801m5007l0643k8676j5103J086m797K326J0593m378
$$ y = [349034, 334273, 329376, 340824, 340945, 325654, 317324, 308868, 327348, 339466, 326565, 304677, 287497, 296416, 294017, 291518, 270788, 265695, 244397, 237484, 252819, 259036, 254823, 228860, 209651, 199647, 213449, 226997, 234827, 234816, 238089, 227867, 224075, 217852, 188646, 173034, 165497, 171000, 185113, 187755, 196984, 204875, 190241, 178113, 186891, 212873, 225490, 225605, 215051, 209155, 218385, 258173, 289720, 318694, 351986, 377991, 391325, 402031, 371597, 336794, 302027, 251387, 214099, 188284, 182386, 183805, 165149, 137071, 114280, 108327, 105481, 119934, 147794, 159235, 169850, 159805, 134734, 116401, 104630, 114328, 106668, 113945, 149476, 184002, 211844, 229643, 236432, 222027, 209379, 177578, 132571, 101928, 73252, 58149, 59235, 54438, 56764, 67357, 62979]
12346F2979j3973P237Q65j3629j2352J9513j6745j0097m488j1651q342j6725k4916
12333d2324j7788J3509O138K2997K6995K8388K1108O668J1688J6705l018j9170
12321G1896k3374j4302j0275j1676j1603J2677j3063j6623M909L434M50R63K7418
12308B0831J9383N572k210K508J4975n34j8157r696J0638J5377J1813K573j4644
12295E8429P837J2466Q402K3266J496j0140J035j0780j3705j9815K756n099k16
12282E5932R866l920J8979J8700J5369J3371J3797L5450O1886Q9672R6079P5898
12270E01079M3780P440k812m20m042j776k3580n3408n6445o6473p5816m9298l6725
12257A81504m5609k6194r751k097j7894N736n944j3212p513k3762j0083J0943
$$ y = [62979, 49006, 56243, 57108, 43479, 31127, 50640, 33895, 23798, 19310, 7659, -683, -17408, -42324, -60112, -46603, -40465, -17468, 9527, 37915, 59023, 65691, 77379, 94084, 91066, 71896, 48522, 34220, 23945, 12269, 666, 13343, 280, -16343, -11434, -8000, -7550, -6587, 20831, 40214, 45786, 43576, 46084, 61059, 60525, 42368, 32672, 43310, 58687, 70500, 73073, 58429, 66266, 78732, 87134, 110400, 111896, 101756, 102791, 92011, 78306, 58491, 61247, 56148, 55932, 65798, 61878, 80857, 99557, 114926, 128297, 142094, 177544, 239430, 329102, 425181, 501079, 544859, 552299, 549487, 549067, 545025, 543249, 519669, 466261, 409816, 343343, 267527, 218229, 181504, 135895, 109701, 99950, 97853, 79959, 85695, 79751, 66539, 59026, 35264, 25181, 36124]
12245C6124L102J0560J9924o081n792p847o468q288j755M3p16J7264j1432J433
12231D0071O233o559N301j0920r295o041r167m805L052O284J2795j94o082R93
12217B1666J5063k725O220J0675o338k645P500j595m847J923r223p752m275l755
12203A9892j0595N885J080J0343J861L369J2195K1016N548O655l863k6924n409
12190D1053n378k6530j146Q787J5626k632j8743j5950j5726j4989k0509J6433
12178c9704J6742J5766P709k427p841Q052J951M490j946Q548o183N327n661p414
12164b591m77J708Q83k616J3802J5341L978n725p777L1003J0373l815j5102p043
12150C1942j5744n010k557j5437J052J7284J6744J2116K39j6372k94K66j6345
$$ y = [36124, 39226, 49786, 69710, 63629, 57837, 49990, 43522, 35234, 33479, 33522, 32806, 50070, 38638, 40071, 46304, 39745, 45046, 34126, 24831, 18790, 9623, 4818, 7870, 14154, 26949, 26755, 20673, 21666, 36729, 34004, 40224, 50899, 44561, 41916, 49416, 47821, 42974, 44897, 35674, 27922, 23647, 19892, 9297, 15182, 16262, 26605, 28466, 31835, 44030, 65046, 70594, 77249, 73386, 46462, 41053, 35675, 9145, 7999, 16786, 32412, 29780, 11037, -4913, -20639, -35628, -56137, -39704, -22962, -7196, 513, -1914, -9755, -1703, 248, 4738, 2792, 11340, 5157, 10484, 4823, -2591, -3068, -1360, -477, -3093, 10709, 26050, 30028, 24303, 16526, 47529, 57902, 54087, 38985, 31942, 16198, 11188, 8631, -6806, -5754, 11530, 28274, 40390, 40629, 24257, 23963, 24229, 7884]
12137G884n851M991J5142N440r441j0764K649Q608K969k765O545J531j4879r357
12123B702j676Q564o120p244R080K2937p668p91j7658p4P700k1560m476R684R070
12108B470K019q473L059J659J2088j711J3796P126j2132q05k355M034J1261K518
12094C4554N82j164J058P727J774p808n127J0973j0942j1818p798j3436J292J7464
12080A7331J4263J2781r432j6324J680n56j1220q577J0419Q580j1198L561N303
12067A6611o311l561N641J1171j201p582J2943K338M68J6709j437n457K6439J1560
12053G8331M331L9454N5022R1735J41213K03034K95054L16783J97605n650j55939
12042A260973k53175k79350k25101j36456q1364o2442k9829k4456j8852j9782
$$ y = [7884, 2033, 7024, 22166, 27606, 18165, 7401, 10050, 18658, 21627, 18862, 25407, 26938, 12059, 2702, 1026, 9590, 3470, -3774, 5306, 28243, 20575, 19784, 2126, 2052, 9752, -11808, -16284, -6600, 2470, 4489, -3984, -925, 734, 12822, 11111, 24907, 32033, 19901, 19096, 16741, 20775, 32036, 34554, 35136, 33972, 35030, 42757, 44531, 36723, 31596, 42569, 31627, 19809, 12011, -1425, -133, 17331, 31594, 44375, 34943, 18619, 20299, 19743, 8523, -54, 10365, 18945, 7747, 11308, 16611, 10300, 6739, 12380, 23551, 22350, 14768, 27711, 30049, 30517, 47226, 45789, 40332, 66771, 78331, 82662, 122116, 177138, 268873, 410086, 613120, 908174, 1224957, 1422562, 1416912, 1260973, 1007798, 728448, 503347, 366891, 285527, 223085, 193256, 168800, 149948, 130166]
12032A30166k5546j8272j3429j4077o040r438j8527r803j762K1202m404k130n502
12019B2438o592j0384R551J4078o888K253J2296q633r167J046l06k283j40n855
12005A1414q538J2262m696R37N494K420j0829j3563P11J1501r297q606L781M676
11991b333L640J7341O26O252J748o045J3203J5125j4361j7264k445q676O39k769
11977D681N40j927k0534L592M089j0590j0432M714K4626K1352J0448j51p574j3781
11963I053R151M776j2576M301l048k255l10k756J2777j3727j5085j865K0041N856
11949A4333r181j1794L628O881Q113n254l369Q546j562q275K986m943J5301J8578
11935C3988L921o634l288K634k892j9381k0977K706r529k29N374M754n007O013
$$ y = [130166, 104620, 86348, 72919, 58842, 52802, 43364, 24837, 15034, 13272, 34474, 30070, 27940, 22438, 15846, 5462, 15013, 29091, 22203, 24456, 36752, 28119, 18952, 19998, 19692, 17409, 17269, 11414, 2876, 15138, 10442, 11379, 16873, 19293, 8464, -5099, -4388, 7113, -2184, -10790, -7009, -2333, 1307, 18648, 19274, 25526, 27274, 21229, 34432, 49557, 35196, 17932, 15487, 6811, 7450, 4681, 5221, 3294, -17240, -13648, -9559, -20149, -30581, -25867, -1241, 20111, 30559, 30408, 22834, 9053, 18204, 22980, 10404, 14705, 11657, 9402, 9092, 6336, 19113, 5386, -9699, -11564, 8477, 14333, 5152, -6642, -3014, 3867, 11980, 6726, 3357, 11903, 10341, 2066, 5052, 109, 15410, 33988, 37909, 31275, 27987, 30621, 27729, 8348, -12629, -9923, -19452, -19681, -14307, -9553, -14560, -8547]
11921h547M727K86M739p411j1612M010J9123Q467j2484m94K538J509Q305j8948
11907e792k7588r392J3356K2127K2818Q103m039j4844q018P935J3096j627j933
11894A4202o147j2331J2628K0671j0884j7348N864O488n408r139o184J559J3625
11881G596J2576R61M912J003J185j9298j4032l810R210J1155n439m805M051J37
11867E402p894j2058P553J0131N247R47M018r95m698k210J0658K168j5709O776
11853I336L828m630l266n244J5583K459p925m089J403l49L01K1394J267j2605
11839A7463j4060J3174K630j0494j7081O654J8473J013j1411j1607q773j3462
11827b7481R471K1343N74k791q139M579J214l731O617m452R182J5379q691k4380
$$ y = [-8547, -3820, -3534, 1205, -6206, -17818, -13808, 5315, 13782, 1298, 804, 3342, 4851, 13156, -5792, -33380, -42772, -29416, -7289, 15529, 23632, 19593, 4749, -3269, 4666, 17762, 16135, 14202, 8055, -4276, 8352, 29023, 18139, 791, 6655, 13143, 7735, -1404, -7588, -6029, 7596, 20172, 21133, 26045, 27048, 28233, 8935, -5097, -8907, 303, 11458, 6019, 1214, 5265, 5402, -2492, -14550, -6997, 3134, 8381, 9328, 13346, 12351, 7653, 5443, 16101, 18269, 2560, 9336, 13164, 8534, 5268, 24, 15607, 18066, 10141, 6052, 7455, 7106, 7407, 28801, 30068, 17463, 3403, 16577, 19207, 8713, -8368, -1714, 16759, 17772, 6361, -5246, -14019, -27481, -18010, 3333, 3907, 1116, -7023, -2444, -1230, -4961, 1656, -2796, 6386, 21765, 13074, -11306]
11813a1306j4542p901P865K7256J5882k655p712p068j595n528N294K441J8921
11800A9352O293k725j9253L928J6663j446o134q253q593J3297J7714j382k4232
11787E229p117j3160j622J9057K916k167K16k952n483o541M247P998j0434M841
11773d972q30J2283J2878k916k6895k862p321Q503J3383M070J672m403k242j8246
11759a7898k600J1055J2675j1166j1515J3948M300P464K433j4437j3842l130J1622
11746a1091P190P271O425J216L107N810j1071j2757M471k862j679j0654k532J28
11732a7028J1689j0094k922M44O494l063o506q171J455Q031J0915l437p061L569
11718a5685l621O534J6513M7Q890O185q873M218l701l860N08J0829q460K267p428
$$ y = [-11306, -25848, -33749, -25884, 1372, 17254, 14599, 6887, -181, -1776, -7304, -2010, 431, 19352, 25645, 22920, 3667, 7595, 24258, 22812, 16678, 8425, -168, 13129, 30843, 29461, 5229, -1888, -15048, -16670, 2387, 5303, 3136, 3352, 400, -5083, -11624, -7377, 621, -9813, -4972, -5802, 6481, 19359, 16443, -10452, -13314, -20635, -12132, 1251, 5321, 6993, 2590, 348, -17898, -20498, -9443, 3232, -7934, -19449, -5501, -1201, 6263, 8696, -5741, -19583, -22713, -11091, -3901, 3370, 9795, 11011, 14118, 19928, 8857, -3900, 571, -2291, -3970, -14624, -17156, -17028, -5339, -15433, -18355, -17911, -11417, -14480, -20986, -29157, -27702, -19671, -8756, -12193, -19254, -15685, -19306, -12772, 3741, 3788, 12678, 18863, 9990, 14208, 10507, 6647, 7155, 17984, 9524, 11791, 4363]
11703D363j507l161j1523n980k988K777J0902K86l857j77q274N911J6192J8259
11689B1223Q821J5988o733k1785r348j7907m009J6618J0054j625J2005o596o045
11676A0661j471j2245J78N243k244o699k2700J1799P292l547j2961q208l376J57
11662c8121L79J5297M035Q576J5068j785j3174k3463j1557n303J1902K5166J1724
11649a256m839m601L191P686R257L954m367J359O896j4431O626J812J996m977
11635H306o460Q326R088N657o480N383J6020k30k6572k150J2931j414k6020j2406
11621a6021J5158J1160J2318j174j9020m061p749o015k412M03q672L520J3626
11608h939J4824J1255N992r770K634J1545k4887l283J6390l441O779M759j6492
$$ y = [4363, 2856, -305, -11828, -17808, -20796, -18019, -7117, -6831, -10688, -10865, -19139, -13228, 2964, 21223, 30044, 46032, 39299, 17514, 8166, -9741, -13750, 2868, 12922, 11297, 23302, 16706, 10661, 9190, -3055, -2877, 2366, 122, -6577, -29277, -17478, -10186, -13733, -26694, -34902, -38278, -38121, -37742, -22445, -18410, -9834, 5234, 3449, -9725, -33188, -44745, -50048, -38146, -12980, -1256, -6095, -10696, -7505, 181, 9438, 13392, 9025, 10384, 17280, 2849, 9475, 11287, 13283, 8306, 1846, 10172, 19260, 24917, 18437, 23820, 39840, 39610, 13038, 10888, 23819, 22405, -3615, -16021, -863, 10297, 22615, 21441, 2421, -1640, -9389, -15404, -17816, -17413, -26085, -22565, -8939, 5885, 17140, 23132, 13362, 15996, 27541, 2654, -629, 15761, 12320, 19099, 23858, 7366]
11595G366o27j1070l651P145j59L010R790k561q952l691m594K1291Q177j9765
11581A709j5531k1665J969K3462J3438r059M916P17J1527N554j1144j564J0394
11568A4723P144n802l012j6k318O02j417j6797j0778P78J980J0193J1971O788
11554A4039j1886k503J861P22k0395L530N73K286K306K2167j3129j2650r036K753
11540a9362J2691J0631o01l348m040J1565Q252j865o579N237j1388M550l112M218
11526F849J0335K479m488j443k3907j6389N93M474O836O720m489J6353l31O54
11512D246P924m325j0199J1247l213n235k101j4627K0291K5127j0190J820O361
11499B7126j2601J100j7128k4505J0376P589n523J4538j140O350L170j2567M932
$$ y = [7366, 6739, -4331, -7982, -837, -996, 2014, 11804, 9243, 291, -3400, -7994, 13297, 21474, 1709, -13822, -35487, -33518, -10056, 3382, -5677, -761, -44, 11483, 17037, 5893, 4329, 14723, 21867, 16065, 13053, 13037, 10719, 11321, 9904, -6893, -17671, -16893, -14913, -4720, 7251, 14039, 2153, -350, 1511, 2233, -18162, -14632, -14059, -11773, -9467, 12700, -429, -13079, -22115, -19362, -6671, 3960, 3359, 11, -4029, 7536, 15788, 13923, 7344, 12581, 1193, 5743, 2631, 6849, 17184, 19663, 15175, 13732, -10175, -26564, -25971, -21497, -14661, -7941, -12430, 3923, 3592, 4246, 12170, 7845, -2354, 8893, 5680, 445, -1656, -16283, 4008, 29135, 18945, 20765, 27126, 14525, 15625, -1503, -26008, -15632, -8043, -13566, 972, -168, 6182, 9352, -3215, 1717]
11486A717J4482j510k0215k457k386m301J2766n371m947N254J2606j153K133N069
11472A1687l50j2274j0669Q851J531L0402Q075k140o136m644m651J1049R733j3295
11458B7169l1685j2905n837J408M850k0336L61Q438Q221J2208l45J575o600m725
11444a8203K317K704J0344J0038Q683J6525j1343j0427k277k773J2280J984M6
11431A9898l975j4348q116O475R483q66M846l310p271j8689j3074R866K1486L212
11417E617p601O156j670m164J2263J1788o999k0270J020K5768O438L9j8742P829
11403A7472q924j1687J636j355n179J1969k948L529J6093m616j7958N034j4161
11390a1095j3139P724L952J6757J136N488Q239q945k375j2928n593p299k732J1749
$$ y = [1717, 16199, 14689, -5526, -7983, -10369, -14670, -1904, -7275, -12222, -6968, 5638, 4485, 6618, 11687, 11337, -937, -11606, -2755, -1224, 29178, 37253, 35113, 28977, 24333, 19682, 30731, 40464, 27169, -4516, -17421, -23258, -21850, -17000, -37336, -36975, -28537, -20316, -8108, -8453, -6878, -13478, -18203, -15886, -13182, -2838, 7200, 15883, 32408, 21065, 10638, 8361, 5588, 17868, 19852, 19898, 15923, 1575, -6541, -66, 9417, 8551, 13397, 10087, 2816, -15873, -28947, -19081, 2405, 5617, -1984, 4172, 2502, -1662, 10601, 22389, 15390, -4880, -3860, 21908, 28346, 28385, 9643, 17472, 8548, -3139, -1503, -2858, -8037, 3932, 984, 4513, 20606, 15990, -1968, 3066, -11095, -24234, -16510, -12558, 4199, 5335, 10823, 19062, 10117, 7742, -5186, -10779, -18078, -20810, -9061]
11376i061K586O857K0790J0524j5560j1241j0955L899O390k0294j0858n033q639
11363d0595N815J6929R244J0187L575k969q303J0456j276q147j3014L411l056
11350a7743l362J7850P120m450j7873n3o568j627K692K6332J2940j1973J1300
11337A4585J5672p104R923O234j5510j8514j2063o804L046N104Q346Q600o50m41
11323A0424j2597k0568J1426J3700Q321l711j238K22J372j4251M276Q261o233
11310e96K442j4098j4829m081J5339L1298j248m600M043p291l393M258J2597J980
11296B1821K844j5908k0298Q815M532J4659O40K948k3458m658J2282l323p624
11283f728j0515M261J0885J5029j4165L116J2559j1496J2959K21q638j8206j958
$$ y = [-9061, -6475, 382, 21172, 31696, 16136, 4895, -6060, -2161, 4229, -16065, -26923, -31956, -40595, -34780, -17851, -8607, 1580, 5155, 2186, -6117, 4339, 3063, -5084, -18098, -14687, -17743, -21105, -3255, 3865, -585, -18458, -18511, -25079, -26706, -24014, 2318, 15258, 3285, 14585, 30257, 23153, 33076, 39310, 23800, 5286, -6777, -13581, -10535, -5431, 2915, 11515, 10865, 10424, -2173, -22741, -11315, 2385, 10706, 6995, 5757, 5979, 7351, -6900, -2624, 5637, -596, 1846, -12252, -27081, -31162, -15823, 15475, 14227, 9627, 13670, 6379, 2986, 7244, 19841, 21821, 24665, 8757, -11541, -2726, 1806, 16465, 17105, 20053, -3405, -8063, 4219, 896, -6728, -17243, -12982, -2097, 12932, -1233, 1883, 14442, 2946, 15905, 16126, 7488, -10718, -12676]
11270a2676q44O061o139L901M514J6509N459j1406n494Q300J280p224J455o450
11256b754J0878J1973m985r857J443Q951l513o228J0482J4592m530p945M701l756
11242A9452q308J716K96p589k0444J0633J0508L005q58J075j0634n34K576J942
11228B836j642n811R883M965j178j4669j3253N149O298Q493n77j6374q548L44
11214b4084P600J0842j0605j8968Q258J7374L802J666K7327J6237j3936L665p238
11201B1940j6211J22P735o758k087M206o112l29J183j1547N929J2070J4774n972
11187A8943j3074j4915k756J6233M036j6149j843o74J5395J8577m843j6721k098
11174A11Q892P436j2002k0054L65J6810J3392K725K635k3140K851P548O876K2632
$$ y = [-12676, -13520, -7459, -13598, -9697, -5183, 11326, 16785, 5379, -115, 8185, 9465, 2241, 3696, -2754, 8124, 20097, 15112, 5255, 6698, 15649, 12136, 5908, 16390, 30982, 26452, 18507, 23208, 19452, 11144, 12860, 13156, 5567, -14877, -4244, 6264, 9269, 8411, 9486, -1148, -1682, 894, 2836, 1194, -4617, 5266, 10231, 9053, -5616, -18869, -13720, -7422, 1071, 494, -15880, -24428, -24084, -16484, -5642, -16247, -35215, -26957, -9583, -5781, -4115, 23212, 39449, 25513, 29178, 21940, 5729, 5851, 13586, 6828, 4741, 8947, 2835, 2506, 3689, -7858, -1929, 10141, 24915, 18943, 5869, -9046, -11802, 4431, 8467, -7682, -9525, -10199, 5196, 23773, 18930, 2209, 111, 9003, 16439, 4437, -15617, -15252, 1558, 14950, 17675, 20310, -2830, 21, 7569, 14445, 37077]
11160C7077o838l7655k1173M153N826Q354k728J0097J0322O858j4371j041k2698
11147b3817j2837k958K750J7707J693J313P286J4027q01j3654j689L061k679j5430
11133b6028K697j0910M306Q909N743P349R549j60k939K494J455j139R513K826
11119A3665q469N097J0675j0405l577M940k0307m690K4841P143j0795m899j130
11106B089o278l737J566J8059j759r7k9633J694J1328k208R11J448P361r004K035
11091f225K906l507j4956q409L319N116P353K670l070J338K1270J8701J2362j3606
11077B5262k4847Q382P786M888J6700j2169o547l553j4680J0296L282q481l418
11064B901O082m227j5296J2036j604j2930L1129J3025j5613k5378p334J4213Q470
$$ y = [37077, 30239, -7416, -28589, -24436, -18610, -10256, -12984, -2887, 7435, 14293, -78, -1119, -23817, -36654, -39612, -36862, -19155, -17462, -16149, -8863, 5164, 4363, -9291, -10980, -7919, -10598, -26028, -23331, -34241, -29935, -21026, -15283, -7934, 1615, 1455, -1484, 1010, 2465, 1326, 10839, 13665, 5196, 10293, 20968, 10563, 6986, 11926, -8381, -13071, 11770, 18913, 8118, 3219, 2089, -4189, -7926, -6360, 11699, 9940, 9843, -19790, -18096, -6768, -8976, -8065, -6617, 744, -8260, -6225, -3319, -6826, -21782, -30191, -26872, -21756, -14403, -11733, -14803, -13465, 7805, 26506, 38868, 25262, 415, 8797, 16583, 21471, 38171, 26002, 19455, 15902, 1222, 11518, 14800, 6319, 2901, 8983, 4756, -10540, 1496, -108, -13038, 18091, 31116, 15503, -9875, -17209, -2996, 5474]
11051E474k035o604j892k160j5278Q412P057P157K641k7929J09J6189J4425J9473
11037B5039j8226j7497J2194J8470J383O274r333j8864J1238l261j4477l071O866
11024c265J0528k581j9380q100N190J1268J0048k287k546Q804j4707j4010K7015
11011E977L785l367J3169N954r622k4007r502R759Q543j5983J0104J8835j722
10998A1923j607O235K153R333L886J5861m294k2021l4313j2149K633J9893O001
10985C534L978K674L117k943j1707P29J643r702q611n699J910J1303J719J0267
10971B212O435Q49q52l40r259j1409j0139p503j4059j4670O890P932N831J0942
10957b7140J7114N800J4284Q110J5976j7689k2317J0064K88r71J0012k610Q142
$$ y = [5474, 3439, -3165, -5057, -7217, -22495, -14083, -7026, 131, 2772, -25157, -25048, -8859, 5566, 25039, 6813, -10684, 1510, 19980, 21363, 27637, 18304, -560, 10678, 7417, -7060, -10131, -3265, 7263, 4682, -14698, -22798, -17608, -6340, 3708, 1421, -1125, 7679, -7028, -21038, 5977, 9762, 6395, 19564, 25518, 15896, -8111, -17613, -7854, 689, -15294, -5190, 13645, 11923, 10316, 16551, 18704, 28037, 31923, 47784, 43490, 21469, -12844, -24993, -22360, -2467, 3534, 7512, 10186, 13303, 10360, -1347, -618, 1025, -8677, -17288, -22987, -21077, -9774, -8055, 2212, 8647, 9496, 8644, 8304, -955, -12364, -22503, -30006, -44065, -58735, -51845, -43913, -38082, -27140, -10026, -4226, 10058, 18168, 34144, 16455, -5862, 4202, 4490, 3519, 13531, 10921, 19063]
10944A9063p117n869N969Q699R686q454j5546m47n947q888m278j0426L215Q318
10930a2022m16J0916J5946k926q131O092J113J5527k23p828o736N106m616j3910
10916b108q426o753J6984J3154K07j1098P582M702p525m198j7773p664O922L498
10902a2496o887m769l340K1972J9646k3075M375M840L677j9033j6630O052R349
10889a6319J3767j843j2148j086j3323n42l358J3961O471M972J3618k560j725
10876a15j606J423j0649J1649m251j2391K348J0015J2390K265J579J700J1558
10863B5915M198k7546O194J1430j2157j3023p747N069P106l728P45M95j4370q211
10849b5630L0103J1310j2297n088j31q72j87J3994j310j0104j4076M317l478j4768
$$ y = [19063, 11946, 6077, 12046, 20745, 30431, 21977, 6431, 5984, 37, -8851, -13129, -23555, -20340, -12022, -12438, -1522, 14424, 11498, 3367, 9459, 10572, 26099, 25876, 18048, 11312, 16418, 11802, -2108, -10534, -17287, -303, 12851, 13058, 1960, 9542, 14244, 6719, 2521, -15252, -22916, -15994, -12496, -19383, -24152, -27492, -5520, 14126, -8949, -4574, 266, 3943, -15090, -31720, -25668, -16319, -2552, -4395, -16543, -17629, -30952, -31494, -34852, -20891, -14420, -9448, 4170, 1610, -115, -1721, -298, -10947, 702, -3549, -15940, -13592, -3577, 8813, 11078, 12657, 14357, 25915, 30113, 2567, 8761, 20191, 8034, -4989, -12736, -7667, -561, -4289, -3544, -3049, -17419, -25630, 4473, 15783, 3486, -1602, -1733, -2605, -2792, 11202, 9892, -212, -14288, -9971, -13449, -28217]
10835b8217N262J9703J9813J866o405k849J915K29l818q80Q362j7391o508n072
10821a3990MJ1259o028n229K030j2053j3382J5863J2482J4986J496l96L07r228
10807a879j7095L322l979j923J8082J7435j7661n464q098j2135j2617l725n522
10794e1259K4590K4093P273l25m299J0995R647j3759l612J5162J787J4039m475
10781B9857N294k2325l6280m811n821J7235O966N236J2208J0996m706m514m495
10768D840k643N964J0702j4038j1661j009k549l949L896J1464q385o231M041J6073
10754F515O538o430j3886q430J4028N176p37j5686J3802J300l072K759L213Q487
10740A3577k3884j7535M749O122k100j434j2872n226j28N576J512J1265J8554
$$ y = [-28217, -22955, -3252, 16561, 18427, 12022, 9173, 11088, 11317, 7499, 6619, 14981, -2410, -8918, -13990, -13986, -2727, -8755, -13984, -11954, -24007, -37389, -21526, -9044, 5942, 7438, 7042, 7349, -1879, -18974, -15652, -19631, -21554, -3472, 13963, -3698, -9162, -17260, -29395, -42012, -45737, -51259, -26669, -2576, 4697, 4372, 73, 11068, 20715, 6956, 3344, 18506, 20293, 34332, 29857, 35151, 12826, -23454, -28265, -34086, -16851, -9885, -4649, 7559, 18555, 13849, 9335, 4840, 2197, 8161, 18863, 4825, -6836, -7845, -10394, -14343, -10447, 1017, -7368, -13599, -9558, 6515, 13053, 6623, -7263, -15693, -1665, 3511, 2774, -12912, 890, 2190, -882, 1877, 5090, 13577, -10307, -27842, -23093, -16971, -19071, -20505, -33377, -38603, -38731, -33155, -31643, -20378, -1824]
10727a824j1435p753R55j8893M107J6330k659J0538N514R232N404j4461p837j79
10713a2961O564L353j571j0551m389Q108p61l726K028l031M328q267N726n406
10699b0556k56L039K523N680M616k923q982j4431l895k778k54K846M473n482J3029
10684b3351J9039Q571n206j785n476J0956K49o053J2569K360j3144j3680k299
10671a7250K405P210O397J417Q31l367L359J6604k659m945N638j7218j4502M205
10657a1875K2198L063J796o361j8466L63K6557K4122n47k2314j8215O50L037j2251
10643h243m799j959K3012R48j547m113P537j0248r231K49N695j4485J3419J868
10629a897Q087L719j080m325l084P007j669o402n887J3842N200N710m55j6470
$$ y = [-1824, -13259, -21012, -20057, -38950, -34843, -18513, -21172, -10634, -5120, 4112, 9516, -4945, -12782, -12961, -6397, -3044, -4615, -15166, -19555, -11447, -12208, -15934, -13906, -16937, -12609, -20876, -15150, -20556, -20812, -17773, -15250, -9570, -4954, -7877, -16859, -31290, -35185, -37963, -38217, -35371, -30898, -36380, -23351, -4312, 4259, -947, -2732, -8208, 2748, 2997, -3056, 9513, 11873, -1271, -14951, -17250, -14845, -7635, -1238, 179, 1010, -2357, 1002, 17606, 14947, 10002, 15640, -1578, -16080, -11875, 10323, 13386, 15182, 8821, -9645, -9282, 17275, 41397, 40850, 18536, 321, 971, 4008, -8243, -13042, -15001, 8011, 8959, 7412, 3299, 10836, 588, -8643, -8394, -2699, -17184, -3765, -1897, 6190, 9909, 8829, 4504, 1420, 8427, 6758, 356, -5531, 8311, 13511, 19221, 18766, 2296]
10615B296k4134L565n72P540p113j2479n899L686N260r758J621J635P027q90m664
10600c2879N727k552n650Q38J2919K231J1720l136p822o092P38J0875R172k913
10586f824R363q118j3342J4778J2653q259j2325j2415l028M308L673J451J7880
10573b05J7948L234k9933n965O441r388p230L547j0661qL280J1902J6766m105
10559d377n349p628K0954Q312n138l860j335P577K2337m081n007K28r967l7444
10545b4778n622K6159P590q241L883J4037j315O443j5115j1176P87J4617O464
10532A3733j2315O04J3704l808l875K563R850K500j9029q375J5740J1818L197
10519B6307q517j3383p545L979R080k7285j1510M496J4999P237q6m154p514m275
$$ y = [2296, -21838, -18273, -18845, -11305, -18418, -30897, -36796, -33110, -27850, -37608, -35987, -34352, -27325, -28215, -32879, -27152, -29704, -35354, -34516, -21597, -19366, -7646, -10782, -18604, -24696, -23958, -13083, -3911, -6824, 2539, -5579, -18921, -4143, 8510, 251, -12074, -24489, -27517, -23209, -19536, -18085, -205, 17743, 20977, -8956, -14921, -8480, -17868, -25098, -21551, -32212, -32220, -28940, -17038, -272, -4377, -9726, -17354, 3600, 11912, 6774, 2914, 1579, 9156, 31493, 27412, 22405, 22633, 12666, -24778, -30400, -4241, 3349, -4892, -1009, 13028, 11713, 18156, 3041, -8135, -7348, 7269, 13733, 1418, 2022, 15726, 11918, 8043, 10606, 20456, 22956, 3927, -4448, 11292, 23110, 26307, 17790, 4407, -3138, 841, 9921, -17364, -28874, -24378, -9379, -2142, -2228, -6382, -13896, -18171]
10505a8171j0303J3196J2851r031l648m490Q48j9981K75J2083J0912K2977l567
10492C951j1289j4073n868K0087K4520N443j284k073j9723j7493L488J4476L4972
10479C5134l037k373j1945J711k582o73j3056l964j1551J843J6076n007q785j1724
10465a9933j9566L470K0576J9716J2143n245m616k914j0495J2395K0114o01J4734
10452C9778m06l900j0975M527j3720L969K650m254M150r890j9887k293k131R118
10438c264L955N576J6684J746j9033k869o268j3124k776O646N801J1766L70J162
10424F372O053j9403k9402j006J2617J6470J5474k1890p913J4237m331J2121P3
10411e28o354j554r536M044j0217J162J4454p989q008M269k534n069J3278R443
$$ y = [-18171, -28474, -15278, -2427, -11458, -15106, -19596, -18748, -38729, -38454, -26371, -15459, 7518, 3951, -7338, -21411, -27279, -7192, 17328, 22771, 21487, 19414, -309, -17802, -14314, 162, 35134, 32097, 29724, 17779, 19490, 16908, 16235, 3179, -785, -12336, -10493, 5583, 576, -8209, -19933, -39499, -36029, -15453, 4263, 16406, 11161, 6545, 3631, -6864, 5531, 25645, 25044, 39778, 39372, 35472, 24497, 29024, 15304, 19273, 21923, 17669, 21819, 11929, -7958, -10251, -12382, -3264, 691, 6267, 22951, 24697, 5664, 2795, -3473, -16597, -19373, -12727, -6926, 4840, 5210, 6372, 12425, -6978, -36380, -37386, -24769, -8299, 7175, -14715, -22628, -8391, -12722, -601, -528, -6882, -8436, -17972, -13928, -24145, -22983, -8529, -16518, -24526, -20257, -22791, -27860, -14582, -5139]
10397e139n884l564M361P028R345P584L146k215N362k212m10O839K534p767k3598
10382d590q75K898m041o362j4727m563o579R450J5107J1297N402n115m3R31q148
10367i958o520p598k441R984J0655m962m705M281O352n443M963N587R105j4571
10353e271J2909O74p850j2801r235j093J9423J6359j6352M252J3259l134k001
10340I139j5903P52l904j348M41n432J6065L474K356O463Q740n534j4428p21j9736
10325a9576p758J6176P931L459l18J281m272L012M042m707p99m030k788M523n052
10310h876L186j256M719K940q240p653j064L684J5346J9199r63j9873j3127O039
10296e939m1O850R310l362P989N287j0667J432N156q403j2267L145P710n253j5270
$$ y = [-5139, -11023, -14587, -10226, -3198, 6147, 13731, 16877, 14662, 20024, 17812, 17402, 24241, 26775, 19008, -4590, -5465, -2567, -6608, -12970, -27697, -32260, -38839, -29389, -14282, -2985, 2417, -2698, -2741, -1810, -9958, -16478, -24076, -26517, -16533, -5878, -10840, -15545, -11264, -4912, -10355, -5392, 195, 9300, -5271, 7638, 8312, 462, -12339, -21574, -22667, -3244, 13115, -3237, 1015, 14274, 11140, 9139, -6764, -6012, -9916, -11264, -10823, -16255, -190, 3284, 5640, 12103, 20843, 15309, 881, 160, -19576, -27334, -11158, -3227, 232, -86, 1195, -3077, -65, 3977, -730, -1529, -5559, -8347, -3824, -8876, -5690, -6946, -2227, 713, -7527, -15180, -16244, -12560, 2786, 21985, 21022, 1149, -11978, -5939, -5980, 870, 10180, 6818, 14807, 20094, 9427, 10859, 16015, 7612, -4655, -1510, 6200, 947, -14323]
10281a4323j1068k985Q410J0987K1750K685n460O622k648J6252K4144j0449n4
10268D3863p680l110k150j5101o205r614m461K634J166K138J2127K102j0204n82
10254D923L760p622r467K0309J0371K816j6507j2383m344K922J0356J8053j969
10241B1218p223l046l713p433J1194l115m400j1781J1960r9r137j657j203K090
10227f345J0757P515J117l151J329J0694n82j3574j6563l855K6078J2435j0530
10214A5325k044R578j248j9073q149J1707j520n678j336q309M024R093J7402n206
10200A4566j7642Q287J42r343N899O629l770N168j838n322o341Q876R548R57J147
10185A6963j4995r063j4323M736J3484K5141p053k0061J9526J8062j3574k9968
$$ y = [-14323, -25391, -28376, -19966, -8979, 12771, 15456, 9996, 16618, 13970, 30222, 54366, 43917, 43863, 36183, 33073, 30923, 15822, 9617, 3, -4458, -1824, -658, 1480, 13607, 15709, 5505, 4923, 8683, 1061, -8406, 11903, 22274, 25090, 8583, -3800, -8144, -5222, 5134, 23187, 21218, 13995, 10949, 7236, -197, 10997, 7882, 3482, -8299, 3661, 3562, -5575, -7232, -8435, -6345, 4412, 11927, 13044, 9893, 11222, 21916, 21334, 7760, -8803, -12658, 13420, 25855, 15325, 13281, 22859, 21611, 2538, -5611, 6096, 4576, -1102, -2438, -10747, -6723, 2370, 19772, 14566, -3076, 5211, 5353, -3990, 1909, 8538, 4768, 9936, 8098, 2776, -3565, 5311, 14859, 15816, 16963, 1968, -7095, -21418, -16682, -3198, 21943, 14890, -5171, 14355, 32417, 18843, -11125]
10173a1125o593P202l699L658O026m937j2914J1137J199r248r00J1002J5545M413
10159A0766L106N773l438j0295J423k585j228N051P242n427l422P294l485O006
10145A6781P861o902r016K118R855j2322q340Q356J88k2777l249R066Q686J8832
10131A9137P471K411R793j959j441K54j3031j6800k5898K57J5469l0j3465K134
10117a5698J0787N532J806R981p17k2282K000J8828N662m876j742l803p745j0365
10103a2632J0796K5459J962j347j2984J013l708Q702J0926O69k1389O258J2838
10090B6563O974P378l567N746J1844J054j1230J28K1164Q901J5399P922L588L605
10076A05469M00q975J4100J2696J0243L6205L3405J5444L2008K9400K6630K1583
$$ y = [-11125, -17718, -10516, -14215, -10557, -4531, -9468, -22382, -11245, -10046, -19294, -20194, -9192, 6353, 10766, 13872, 19645, 16207, 5912, 7335, 4750, 3522, 8573, 15815, 10388, 6966, 14260, 10775, 16781, 24642, 17740, 8724, 10842, 20697, 8375, 35, 8391, 8579, -14198, -17447, -8381, 305, 19137, 26608, 29019, 38812, 36853, 35412, 35666, 22635, 5835, -20063, -19806, -4337, -4367, -17832, -15698, -4911, 621, 2427, 12408, 11691, -10591, -8591, 10237, 15899, 11023, 9281, 5478, -2267, -12632, -1836, 23623, 25585, 24238, 11254, 12267, 8559, 17261, 28187, 28856, 7467, 13725, 26563, 33537, 40915, 37348, 43094, 54938, 55992, 44762, 44890, 66054, 74955, 90354, 98276, 101864, 105469, 105869, 96894, 110994, 123690, 133933, 170138, 203543, 218987, 250995, 280395, 307025, 328608]
10064C28608K3137M7772O9428Q1925J30177J78788K28412L14682M57302P89163
10054B649394J430040K745253M468879L159270J969j591552k897836l385028k405092
10045D175297j408795q29303n19945l35994k29623j89007j40765q9308p6739o5103
10035B90715k2203k821K823l502j0602k4184l9620k8298k5761j2370L222k8160
10023I9239m2293j4108P295l188n839m650O022J1138M180L1l760M412k540j3025
10009D2914r865j0507J0701O486l374K90o265j4829Q46j7051l769J1033j6655
9996a0045J0837J4684J5686L28o29P518k002J0898n262l406k889p952j9600k6709
9982a8543l057n038K0685R889K42q935n484J4612O2L342N954J602L906P052k662
$$ y = [328608, 351745, 399517, 468945, 550870, 681047, 859835, 1088247, 1402929, 1860231, 2649394, 4079434, 6824687, 11293566, 14452836, 14454805, 12863253, 9965417, 6580389, 4175297, 2766502, 1937199, 1417254, 1081260, 851637, 662630, 521865, 432557, 355818, 290715, 268512, 265691, 268514, 265012, 254410, 230226, 190606, 162308, 136547, 124177, 127399, 99239, 56946, 42838, 50133, 46945, 41106, 36456, 42478, 53616, 57796, 57827, 54067, 58479, 55939, 42914, 33049, 22542, 33243, 39729, 36355, 36645, 30380, 15551, 16397, -654, -4423, 6610, -10045, 792, 15476, 31162, 31490, 30861, 38379, 36377, 47275, 42013, 38607, 35718, 27766, 8166, -18543, -21600, -26638, -5953, 3936, 4178, -4757, -10241, 4371, 4433, 7775, 13729, 15331, 19237, 26289, 23627]
9967B3627k4554q891J7096n925J249j397J341n453Q112o594j4741J7113J2267
9954A3250K635r97J179N51L364L02p811J0770j8147q904j2300K681m407J6305
9940a529O991q19L567k5176n463O269K6060J3130j2121k0417L305K3520Q533l371
9926B2479n91L674k3877o888K666J2937P309Q198J2412j6906j7002q566o317N518
9912d954J302J4723R463l599m706q87N429J89k412J622n148P949p269r490K692
9897D904P225p251J2303J5541k4028j7311j902l314K8430J2252j0291p251J250
9884A0557k572K954j0752J116l055j0252l336J19J2227K038j1104M480O493L555
9870B468p682p347J650k119L758k702n990o76K0709L060o102M159J9727Q166J0458
$$ y = [23627, -927, -9818, 7278, 1353, 2602, 1205, 2546, -2907, 5205, -1389, -16130, 983, 13250, 15885, 14888, 16067, 16618, 19982, 20284, 12473, 23243, 5096, -3808, -16108, -13427, -17834, -1529, 5462, 4643, 8210, -16966, -22429, -16160, 9900, 23030, 10909, -9508, -6203, 17317, 25850, 22479, 21888, 25562, 1685, -5203, -2537, 10400, 17709, 25907, 38319, 21413, 4411, -4155, -10472, -4954, -3652, 11071, 20534, 16935, 12229, 11342, 16771, 16960, 14548, 16170, 11022, 18971, 11702, 2212, 4904, 12129, 4878, 17181, 32722, 8694, -8617, -10519, -13833, 14597, 26849, 16558, 9307, 10557, 7985, 10939, 187, 1303, -1752, -12004, -15340, -15221, -2994, -956, -12060, -7580, -1087, 2468, -5214, -12561, -10911, -13030, -9272, -11974, -17964, -18640, 2069, 5129, -973, 3186, 22913, 31079, 41537]
9855D1537J4299J5818K1531j091k8680j9775j9894n693O184j5361j6412m925J0004
9842b458R396N243o8n73n301L152j5639L551J9480J5446k88j5677p099j1416j3995
9827a6246J0646O116q762j928o236m954J3357P991q994j9179j3362O140J1269
9814b4142p193J1154J2579j8376k2678M696K720K2958J1067p782M84j7807m715
9801c7035k554K796L0994K1040k324q458J476N71k112J1684L784j3103k6696j0834
9787c0771J9478J3513K505j632n211j2657K137J9929J2584J046j93Q887O12J13
9773C0340J0116j2003k6846j4407J19J9006j080k416k37p755J2420J7595n888
9760A8964k837K470k509r735o26j3068k2529j1250J7390J5407l136l601J51R376
$$ y = [41537, 55836, 71654, 93185, 92094, 63414, 43639, 23745, 18052, 24236, 8875, -7537, -12462, -2458, 6938, 12181, 12113, 11540, 6239, 9391, -6248, -2697, 16783, 32229, 31941, 16264, 9165, -2251, -16246, -5600, 516, -8246, -10174, -16410, -21364, -8007, -16, -9010, -28189, -41551, -35411, -24142, -31335, -20181, -7602, -25978, -48656, -43960, -41240, -18282, -7215, -14997, -14513, -32320, -37035, -39589, -36793, -5799, 15241, 12917, 4459, 5935, 6506, 4394, 16078, 19862, 6759, -19937, -30771, -11293, 2220, 4725, 3093, -2118, -14775, -12638, 7291, 19875, 20921, 20728, 29615, 30227, 30340, 40456, 28453, 1607, -12800, -12681, 6325, 5245, 2829, 2592, -5163, 7257, 24852, 18964, 16127, 18597, 16088, 6353, 5727, -7341, -29870, -41120, -23730, -8323, -11459, -15060, -14909, -5533]
9746e533p841M585J0726O038P94k0652n712J7048N602J7909O529j405j5340k1654
9732h906q171p819J4635J0442m373l541L577k775l777R059L808k548J3444q274
9718D781j4l974q256P664P4l308o77k2113o795K3649M609r743Q945J4574n727
9703C689Q122j1106q442J3194P339n494j124p932q537O191P572O44o244j367r527
9688a3022M38J2696J787J6592J823k330J1481l3k1762q146J545K989l744m948
9674d634q320m103L242J3613M755j713j3M465j827M399J3653J618j2498j327o838
9659D472p465J8057K918j3619j411J9681P75j338j09J1699J4017N552j475P386
9645E9140m176q533j8411j1496k976o354l33J676j0782j0367p812k149K0421j5575
$$ y = [-5533, -13374, -8789, 1937, 7975, 8769, -11883, -17595, -547, 5055, 22964, 29493, 28088, 12748, -8906, -17077, -24896, -10261, 181, -4192, -7733, -4156, -6931, -10708, -1649, 2159, -389, 13055, 4781, 4767, 793, -7463, 201, 275, -3033, -3710, -25823, -32618, -8969, -4360, -14103, -5158, 9416, 3689, 11811, 705, -7737, 5457, 12796, 7302, 6178, -1754, -10291, -4100, 3472, 4116, -2128, -3495, -13022, -12584, 112, 1899, 18491, 20314, 17984, 29465, 29432, 7670, -476, 1069, 4058, 314, -4634, -12954, -17057, -13815, -202, 4553, 2840, 2827, 7292, 5465, 9864, 23517, 25135, 12637, 11310, 4472, -2993, 15064, 17982, 4363, 2952, 22633, 23408, 22070, 21961, 33660, 47677, 53229, 51754, 59140, 54964, 46431, 28020, 16524, 13548, 7194, 6861, 8537, -2245, -12612, -20424, -22573, -2152, -17727]
9631a7727P048J8544J308j5794r862j0253j301K0384P458q522Q263K8016J5122
9618D2684j2562j7680p581r394q833j0882J7019O486o753j559O554J3793l735
9605G557K422J109R383O014l832q407j3580o241P620J963j5255k0409m23J9580
9591a2499J1605J0923m491q654J5524k0152q825J0784N164O227R860j1631m413
9578e78q272k234R265j986j2167M523N273j7939l592P228L5049J475j6547o553
9564g055m99P576K894J098J0435j267j8935k0906k900R233M791O283N875J6054
9550A2677J580k8488k127P508j8980p017j2896J2414L908J5849K309k371O251
9537i383N702L714L905M363L630R647P836r653j5159j437Q718L12m917o666J9785
$$ y = [-17727, -10679, 7865, 9173, -6621, -16483, -26736, -28037, -7653, -195, -8717, -454, 27562, 42684, 30122, 12442, 4861, -4533, -13366, -24248, -7229, -743, -7496, -9055, -2501, 11292, 7557, 9979, 11088, 20471, 26485, 22653, 14246, 666, -5575, 2045, 4008, -11247, -31656, -32079, -12499, -894, 10029, 5538, -3116, 12408, -7744, -16569, -5785, -621, 5606, 15466, 3835, -578, -8850, -11084, -1819, -3805, -15972, -11449, -6176, -24115, -27707, -20479, 14570, 16045, -502, -7055, -7554, 22, 2916, 4014, 14449, 13182, -5753, -26659, -29559, -20326, -15535, -9252, -3377, 12677, 14257, -14231, -16358, -8850, -27830, -34847, -47743, -35329, -31421, -15572, -13263, -15634, -9383, -3681, 33, 3938, 8301, 11931, 21578, 29414, 19761, 4602, 3165, 11883, 12195, 7278, 612, 20397]
9522B0397J027r201j5338j6673J1368K0300l810N63K957o467N46O811M521p764
9508I237m066J548P201o087j765j34k600l517j5332r802K627J425j5629q008l332
9493d8234N210K5466J3342q331J7555k102j2471p261j1224o668L785O772O957
9480a7204k513K062j0929n654L3155K3263J118Q54j2828k4564o232J0591J0794
9467A913J1817j6959p561N422K5189o491j9945j1681K737J2606j0345j6771m290
9454c4359O062J7961J0238p481l157k414J2674J4508j0426j9053R607K0095N84
9441A4839j8058o01M360k310N988j295o061Q930J8343R130m114m908q656j8417
9427b830Q0P095K1081J227j8402j2279R730M860k7335k6403J0087J9919n800l554
$$ y = [20397, 21424, 12223, -3115, -19788, -8420, 11880, 8070, 8633, 11590, 5123, 5669, 12480, 17001, 9237, 5171, 6719, 13920, 7833, 6068, 5934, 3334, -183, -15515, -25317, -22690, -21265, -36894, -44902, -48234, -43024, -17558, -4216, -12547, 5008, 2906, -9565, -16826, -28050, -34718, -30933, -24161, -17204, -19717, -17655, -28584, -34238, -1083, 22180, 23298, 24152, 11324, -13240, -19472, -8881, 1913, 13730, -3229, -10790, -5368, 19821, 13330, -6615, -18296, -15559, -2953, -13298, -30069, -34359, -28297, -10336, -98, -7579, -10736, -13150, -476, 14032, 3606, -15447, -5840, 14255, 14839, -3219, -3820, 540, -1770, 4218, 2923, -3138, 5792, 24135, 33265, 29151, 24243, 15587, -2830, -2750, 4345, 25426, 26653, 8251, -4028, 5702, 10562, -16773, -43176, -33089, -13170, -18970, -22524]
9413b2524J9148R422j3588o844L392K740N204M377J061j3072r095J3842N384r015
9399i568K651N929M493P63N64K301J070N241j4632j0775O665N046k834n179Q888
9384F23j0614J115j0013j5393J805L626J4703K567M423J6027N599R144o881j9783
9370c052j6892K493J0232J4583N07l744l08O960N846M100j1707Q260O319r75O770
9355B9392K111r378K579Q34J104P58n384k4978n352q840Q247K734m707l997J0614
9340d263L109q649n916M231L878q006m068J9879L317r258j0680J2825R31j1894
9326a4564L182M973N717N659j5937o14K1878m612j3803m460L329m318N326J6239
9312G995L311l235j1794j0233r516P916J5600L48K4573R495j1308j8862o08p245
$$ y = [-22524, -3376, 6046, -7542, -14386, -10994, -8254, -3050, 1327, 2388, -10684, -19779, -5937, -553, -9568, -6917, -988, 3505, 4268, 4832, 7133, 8203, 13444, -1188, -11963, -5298, -252, -3086, -8265, 623, -9991, -8876, -18889, -34282, -32477, -28851, -14148, -11581, -7158, 8869, 14468, 23612, 16731, -3052, -19944, -17451, -7219, 7364, 7871, 4127, 3819, 10779, 16625, 20725, 9018, 17278, 23597, 22622, 29392, 31503, 22125, 24704, 25538, 26642, 27400, 22016, -2962, -8314, -17154, -8907, -6173, -10880, -14877, -4263, -1154, -9803, -15719, -11488, -7610, -15616, -19684, 195, 3512, -5746, -16426, -3601, -2670, -14564, -11382, -6409, -692, 4967, -10970, -11584, 10294, 5682, -8121, -12581, -9252, -13570, -8244, 7995, 11306, 8071, -3723, -13956, -23472, -15556, 44, 392, 24965, 34460, 23152, 4290, 3682, -3563]
9298c563O24J2966M38j7254j3405k445J1172P279r866o21J2408N150Q152J1203
9284B2238P615m401O807q754n543j5757J86P574O384n986q989L605K401Q218P646
9269B3244l849J269m39J06k5481P250L003M361J1082N820M845r312p234q038j0278
9254c651j1127R725O937L543j173m861j2495l770J256Q475J920L740l436j3852
9240a8769k206p472M578K0437m808J0159j853J0009L584J205q752m386Q795O006
9226A6527R647M256j1017j0730P784J3539r011k374m866J9855J1824n868m495
9213C5071k3781j1112j128J9223J5011n45q757j1119k2034p040J8114J4014L890
9200A9807N978p471j9214J9469J8278J9199r192j8854q74o076l646p383N925j311
$$ y = [-3563, -2939, 10027, 10465, -6789, -20194, -22639, -11467, -4188, -14054, -14675, -2267, 2883, 11035, 22238, 29853, 25452, 32259, 23505, 17962, 2205, 2391, 9965, 16349, 10363, 1374, 4979, 7380, 15598, 23244, 19395, 20664, 20225, 20331, -5150, 2100, 5103, 9464, 20546, 26366, 31211, 21899, 14665, 6627, -3651, -14778, -5053, 1884, 5427, 4254, -607, -13102, -16872, -15616, -7141, -5221, -1481, -4917, -18769, -20975, -28447, -23869, -3432, -8240, 1919, 66, 10075, 13659, 14864, 6112, 1726, 10521, 16527, 26174, 30430, 19413, 8683, 16467, 30006, 20995, 18621, 13755, 33610, 45434, 39566, 35071, 11290, 178, -950, 18273, 33284, 32739, 23982, 12863, -9171, -16211, 1903, 15917, 19807, 25785, 18314, -900, 18569, 36847, 56046, 46854, 28000, 27126, 21050, 17404, 10021, 15946, 14635]
9186A4635J554q047p09o311r7k057J0058Q911J062o575j4903O346J2551J8192
9172C4610j1926j5507j1188J3623J9907J140j2876N849K585R742j4739k542J8080
9159C6758R560N278L32r727o355n44Q933J8312p505l414P076r644j2097J3273
9145E0236J6268L645n948R002R572n207K890k795j2172J0479J5060K4365J1975
9132A27370R717j2492L897J8924K8970O598J1590J7101J8025R31J1810L3078K7492
9119C03011K6625K2063M0159O4590N5722Q2150Q5864J00827J29808J62534K08468
9108A281821K67325L58119M75532O56477R31044J426034K243845L458883M473399
9099A5572479L702566J106753j296036k996290l836982l459069k517989j687637
$$ y = [14635, 16189, 8142, 7433, 1122, 1025, -1032, 9026, 17937, 18999, 12424, -2479, 3867, 16418, 34610, 22684, 7177, -4011, 9612, 29519, 30659, 17783, 23632, 26217, 35959, 21220, 18678, 36758, 46318, 51596, 51928, 42201, 35846, 35302, 44235, 62547, 55042, 51628, 58704, 49060, 36963, 50236, 66504, 70149, 64201, 73203, 82775, 77568, 80458, 77663, 65491, 75970, 91030, 115395, 127370, 137087, 124595, 128492, 147416, 176386, 182984, 194574, 211675, 229700, 230631, 242441, 275519, 303011, 329636, 351699, 391858, 456448, 512170, 594320, 680184, 781011, 910819, 1073353, 1281821, 1549146, 1907265, 2382797, 3039274, 3970318, 5396352, 7640197, 11099080, 15572479, 19275045, 20381798, 19085762, 16089472, 12252490, 8793421, 6275432, 4587795]
9091D587795j128501p81446n43517m10420l11137k48075j91952j38093r7669q0517
9081F56468o6625o6632n2448n1991n8204m3830l5970j6999k0406k4543k4210K191
9069A96801p204j9092j4055j8510r617j2071q073M996N060k1153Q222p914p528
9056H9862l438M065j0057r548J5769l333q509J0605Q525j9089r948l659k346L954
9042F2853j099n612l73L222p846q733N728j2141j609Q115k567L828M041J1446
9028E9253L061r949o270j9120k0374J534J111J2054J1563p646l551l207P876p509
9014A8826k694q430m335R123J6850P346j7248l0747K355P376O996N786Q089M403
9000B3696r99j6737Q403r199M446K2653j3451r479J6914N695q138J0092j015k305
$$ y = [4587795, 3459294, 2677848, 2134331, 1723911, 1412774, 1164699, 972747, 834654, 736985, 656468, 589843, 523211, 470763, 418772, 360568, 316738, 280768, 263769, 243363, 218820, 194610, 196801, 189597, 170505, 156450, 137940, 128323, 116252, 108179, 113175, 118235, 97082, 105304, 97390, 89862, 86424, 90489, 80432, 70884, 86653, 83320, 74811, 85416, 93941, 74852, 64904, 61245, 58899, 62853, 61754, 56142, 55769, 58991, 51145, 42412, 48140, 35999, 34390, 42505, 39938, 43766, 47807, 59253, 62314, 52365, 46095, 26975, 6601, 8135, 9246, 21300, 32863, 25217, 21666, 18459, 26335, 18826, 16132, 7702, 3367, 12490, 29340, 36686, 19438, -11309, -8954, -1578, 5418, 11204, 19293, 23696, 22697, 5960, 14363, 5164, 9610, 32263, 18812, 9333, 26247, 31942, 23804, 33896, 32881, 30576]
8986C0576Q152L607j8932l374pJ0078j9714r258K099q809J1638K3552m810j3408
8972A1390j831Q449J8750o752m466j210K153j2251q940r014l686K0618q821n226
8958h37n423l750J7957J2714K817j4539K927J387L89q190J472J411n612p316l379
8943g972j788k809l000R508J3773J3402R642j0991k539j8625j0957J9928M944
8930A2516j5910k261j5813J4474O818l45Q618o345j1086n602M517M245N49m414
8916a0039j2689q654n71J7094Q380k807J2507Q178j3106O356R88M835R44j6108
8902d692R822L1338l683k1905J346r150p892m495M596r824j6421J489J1389J5187
8888b895K4499M885L396k914m898n224J6002J8168P890j864J2817K4913K1380
$$ y = [30576, 38728, 42335, 23403, 20029, 20022, 30100, 10386, 1128, 3227, -5582, 6056, 29608, 24798, 11390, 9559, 18008, 36758, 30006, 25540, 24330, 26483, 14232, 5292, -3722, -7408, 13210, 4389, -837, -6260, -10010, 7947, 20661, 23478, 8939, 11866, 13253, 13642, 5452, 6924, 8335, 2723, -4593, -7972, -9760, -12569, -15569, -6061, 7712, 21114, 30756, 19765, 17226, -1399, -12356, 7572, 12516, -3394, -5655, -21468, -6994, -176, -521, 8097, 1752, -9334, -14936, -10419, -6174, -5625, -10039, -22728, -31382, -31953, -14859, -6479, -9286, 3221, 11399, -1707, 4649, 5637, 10472, 11416, -4692, 5130, 36468, 32785, 10880, 12226, 3076, -4816, -9311, -4715, -14539, -30960, -29471, -18082, -2895, 21604, 26489, 29885, 26971, 22073, 16849, 32851, 51019, 58909, 57045, 69862, 94775, 116155]
8875A16155M2742N2531R5455R9344N0671J0934k8612p2352q5555p6097o1067l0215
8863A13934n242k1861l1772k1571M80K3652n365r857j7115k0288j7925l908J6857
8850A9J8114l201m456J6567J8005j9954j1044p237q298Q114R348j4296j1332M091
8836e560o059L327P955J039J6405Q024k2255N517K2806P730J122j6830r848j1697
8822A676l629J5292O116J214J3391o267j4003J691J8156l122M070Q086j7642j8235
8808F794N091J1267o954j8884k911Q735l151Q690J3992q384M719j3437j2568m588
8794a1589Q576P880J0541p735r036J029p00j1747o078J0404J0280J0209j457O367
8780A6944k84L148j3321J0944R122m47N657r252j2504l795M907L208m963L784
$$ y = [116155, 158897, 211428, 306883, 406227, 456898, 467832, 439220, 366868, 281313, 205216, 144149, 113934, 108692, 86831, 55059, 33488, 33968, 57620, 52255, 42398, 25283, 4995, -12930, -16838, 19, 18133, 14932, 10476, 27043, 45048, 25094, 14050, 6813, -1485, 6629, 15977, 1681, -9651, -5560, -11619, -8292, -337, 702, 17107, 25131, 2876, 8393, 31199, 38929, 40051, 23221, 13373, 1676, -1953, 13339, 19455, 20669, 34060, 27793, 13790, 15481, 33637, 30515, 34585, 42671, 25029, 6794, 11885, 23152, 16198, -2686, -5597, 3138, -13, 8677, 22669, 14285, 19004, 5567, -7001, -11589, -3013, 4867, 15408, 7673, -1363, -334, -1034, -12781, -18859, -8455, 1825, 12034, 10577, 16944, 16660, 19808, 6487, 17431, 26553, 26106, 31763, 22511, 10007, 6212, 11119, 14327, 9364, 13148]
8766A3148j4411J30J4465r104p321J099M544M465p432R103N441m83j3846J276
8752A074P737q743Q639K529j040j1061n031J6034r180o504j896m573q0l077K5602
8737A0430J5642L189p381m465l691p918o076j6186M833Q843j0940p57j2149K869
8723b3757J7264Q361p565j2487J2477J5541N345J4501l320r101o500j963l448
8710E348J0851J236p541j7289N218Q932j2276M843j8843o562R779J3269Q649J322
8696F936k829M683r785m411k634o310J4198K164N28J5319P479J0076j731O656
8682D0339j5562l1163q460J2070L910q440l856R208R414J3733L392J2013q53k0559
8668A5186p92L872P772O3J115j6386m952J9521O960j7229j4306O239J0011j2335
$$ y = [13148, -1263, -1133, 13332, 4228, -3093, -1994, 2550, 7015, -417, 8686, 14127, 13644, -202, 1074, 8811, 68, 8707, 11236, 10196, -865, -5896, 10138, 958, -5546, -7442, -12015, -12095, -15172, 10430, 26072, 29261, 21880, 17415, 13724, 5806, -270, -16456, -11623, -2780, -13720, -14477, -26626, -23757, -6493, 1868, -5697, -18184, -5707, 9834, 15179, 29680, 26360, 17259, 10759, 8796, 5348, 16199, 17435, 9894, -7395, -2177, 6755, -5521, -678, -19521, -26083, -16304, -3035, 5614, 6936, 4107, 8790, -995, -5406, -8040, -14350, -152, 2012, 2540, 17859, 25338, 35414, 33683, 40339, 24777, -6386, -14846, -2776, 1134, -7306, -11162, -1954, 7460, 21193, 24585, 36598, 35745, 15186, 14394, 18266, 26038, 26101, 27216, 10830, 5878, 25399, 32359, 15130, 824, 7063, 17074, 4739]
8654D739m370J8408O201m034k295r462q457j004k749J351j651o107m032r40j129
8639a5531o650L761n83N927K6012K2613m694j4249q921j4757J194J2336L113l569
8625F002n735N474J0950P589O65j1443o864Q928n306l321j1963J6628J556o234
8611F926J5899R579M951N892R858R576J3334j458k6647k0227q042R368n130O062
8597B9941J1374n161l604K644j2531j6928R789K987j2671r876Q584R934J7774
8584C2256p132j3861o555r646p624J1283N321K38p025q358J2614O19O552n721
8570B961j0633M30J1745M16K654P95j7281p199J288Q050K5458j798m800l834J0110
8555A8362N047j4473r499m734J0069K896P60J4719q629M52p630l9q94K610L257
$$ y = [4739, 369, 18777, 24978, 20944, 18649, 9187, 730, -274, -3023, -1672, -3323, -9430, -13462, -14402, -15531, -22181, -18420, -19003, -13076, 12936, 35549, 30855, 16606, 7685, -7072, -5878, 6458, 9571, 6002, 267, 5741, 16691, 24280, 24945, 13502, 6638, 15566, 10260, 6939, -5024, 11604, 13160, 6926, 22825, 32404, 37355, 43247, 53105, 62681, 76015, 74557, 47910, 27683, 19641, 29009, 23879, 29941, 41315, 36154, 32550, 35194, 22663, 5735, 15524, 18511, 5840, -4036, 4548, 14482, 32256, 25124, 11263, 4708, -4938, -12562, -1279, 4042, 4280, -2745, -11103, 1511, 2130, 8682, 2961, -7672, -7242, 4503, 4919, 7573, 8368, -8913, -16112, -14824, -6774, 18684, 16886, 12086, 8252, 18362, 23409, 8936, -563, -5297, 4772, 7668, 8428, 23147, 14518, 14970, 7340, 7301, 6407, 9017, 12274]
8540A2274N115J0467j2552r659j2185r345K4j001K591P015O750m695o108M745
8526f564J330J1645P763p497R501l849j3003L39M302r899l211l953Q924J1693
8512G521J9013J6175n862r542o551q709N981O89r642P15K272k4074r502j3118
8498c4634K284K50J9516j791J041N810J4349P397o226Q610L374r017j2386P058
8484E635J925p930k2165l324K3222K7166M91J72r527q246j3166L552j502L889
8470A92j1875j6551r163J5105K4353O997j3110j0998L898l784o268p338l415P58
8456c1199J0209J7714j2469n198J8249j879Q625R244m548l401j0160N70j1710
8443a5953L243J3034J8077j638k474j3535J2536Q703j1393k509k198J655j4440
$$ y = [12274, 17389, 27856, 15304, 5645, -6540, -15885, -15861, -16862, -14271, -7256, -506, -5201, -11309, -6564, -5234, 6411, 14174, 6677, 16178, 12329, -674, -335, 3967, -5932, -9143, -13096, -4172, 7521, 26534, 42709, 36847, 27305, 20754, 12045, 18026, 18715, 9073, 9788, 12060, -12014, -21516, -34634, -32350, -32100, -12584, -14375, -13334, -7524, 6825, 14222, 7996, 16606, 19980, 10963, -1423, 5635, 7560, -370, -22535, -25859, -2637, 24529, 25020, 25192, 15665, 7419, -5747, -2195, -3697, 192, -11683, -28234, -37397, -22292, 2061, 9058, -4052, -15050, -11152, -14936, -21204, -28542, -31957, -31199, -20990, -3276, -15745, -20943, -2694, -4573, 4052, 13296, 8748, 5347, -4813, -4243, -15953, -12710, 324, 18401, 16763, 14289, 754, 13290, 21993, 10600, 8091, 5893, 7548, -6892]
8430f892J9027N667j0082p211O230q498J2406J4822n360k2092j4912P894j0847
8417a9848J0122R231J1546J1237n808k4470o349R4j090L303J6826J8097M414q768
8403A8537j6812o665m153O642O080k1049r797K169O555P905O378J2988J0888j837
8389A7829n685j283L138j5780J0545K294m882J582l911o518n459J0202J3939j366
8375A4645n384J78r544n55m38k2768q488J1788j04N047m136p247R210P397Q210
8360b189K9093L15j0618j5650j0665R833K683P416K971o292l934n478J5852O116
8346A9453m409j4634J8293l034j3625J7409M996j0058j2783J6368o422j2251L208
8333B511j1808M264N006J4053j4652K893J2461j7764r94m072l582O962l249O02
$$ y = [-6892, 12135, 17802, 7720, 509, 6739, -1759, 10647, 25469, 20109, -1983, -16895, -9001, -19848, -9726, -495, 11051, 22288, 16480, -7990, -14339, -14245, -15335, -12032, 4794, 22891, 27305, 18537, 1725, -4940, -9093, -2451, 3629, -17420, -27217, -25048, -18493, -10588, -4210, 8778, 19666, 17829, 12144, 10861, 13999, -1781, 8764, 11058, 6176, 7758, 3847, -2671, -8130, 2072, 16011, 14645, 9261, 9439, -105, -660, -1098, -23866, -32354, -20566, -20670, -15623, -19759, -27006, -17796, -10399, -2189, 26904, 27219, 16601, 951, -9714, 119, 2802, 10218, 13189, 6897, 2963, -2515, 13337, 19453, 15044, 410, 18703, 15669, 2044, 19453, 24449, 14391, 1608, 17976, 11554, -697, 2511, -9297, -5033, -27, 14026, -626, 2267, 14728, -3036, -4030, -8102, -11684, -4722, -7971, -7369]
8319g369q786j604J0756J0697M859P741j473O681r871l594p196m224R619j254
8305D982k9978n033K1094J3187l429j382J3619J6190j6511l4132R86K9521j195
8292G919j265j4708l0535M308J3459r539j902J7929J4272l997J2742J712M953
8279A5348p140Q73j5066k2162j3258R207J7256N802J0126n738n764j751K551j329
8265a1045N699k666j5189J0645J1025P315J745n555k426l054n470J4851K2712
8252B8587j5445l5344j4516J2709K0482j4772q684J2337n064P198P658N973J0968
8239A2087J0904l154J462r623q456M586J456j0869j6917M342R101J7293o950m231
8225A031J1396N630j1596o808p622j21J4563N453j145o660P402j1804l714L771
$$ y = [-7369, -16155, -17759, -7003, 3694, 8553, 16294, 14821, 21502, 11631, 8037, 841, -3383, 6236, 4982, -24996, -30029, -8935, 4252, 823, -559, 13060, 29250, 12739, -21393, -20407, 9114, 7919, 6654, -8054, -38589, -34281, -20822, -30361, -32263, -14334, -62, -4059, 8683, 10395, 15348, 8208, 9081, -5985, -28147, -41405, -32198, -14942, -9140, 986, -4752, -10516, -12267, -9716, -11045, -5346, -8012, -23201, -12556, -1531, 5784, 7529, 1974, -452, -3506, -8976, 5875, 28587, 13142, -22202, -36718, -24009, -3527, -18299, -26983, -14646, -19710, -12512, -4854, 1119, 12087, 22991, 19837, 21299, 11676, 3220, 7806, 9262, -1607, -18524, -14182, -5081, 12212, 5262, 1031, 12427, 18057, 6461, -347, -7969, -8090, 6473, 11926, 10781, 4121, 11523, -281, -3995, -224]
8211b24L085m551r572r807o499M459O028M9l64J3911J1605j7415k647Q311J027
8196b604Q191R789j1257j4591r46R821K246J1539M647j0219r756j3042k6436J815
8182d0803Q069n432M834P616J6916R946j0659j5613Q774k777P067J8723j0046
8169c385p137O28K369J3064j4891j3485N479R931R181M641n562O746o785J910
8155B704K724J524L111q965j562R5k849n364L364J0633J560R038N109o941p970
8140F211j0321P44R24j256K977p705J4961Q919m601r218j7046p028J0948N986
8126e505J294K978R348J1880j5529k5621j0098Q237K5355N272k639j6264j3546
8113b4838J458N362j3015l240M935j133K474N169J9574J9930j9235j1948L005
$$ y = [-224, 2861, -1690, -11262, -21069, -27568, -23109, -17081, -17032, -17396, -3485, 8120, -9295, -11942, -3631, -2604, 5587, 15376, 4119, -10472, -11418, -1597, 649, 12188, 16835, 6616, -3140, -16182, -42618, -40803, -32734, -38166, -33332, -25716, -8800, 1146, -9513, -25126, -16352, -19129, -12062, 6661, -3385, -10522, -9894, -7525, 5539, -9352, -22837, -17358, -7427, 1754, 6395, 833, 7579, 794, 2704, 5428, 6952, 10063, 1098, -464, -369, -3218, -8582, -5218, 5415, 6975, 16013, 21122, 14181, 6211, -4110, -3366, -2442, -3698, -721, -8426, 6535, 15454, 10853, 1635, -15411, -22439, -11491, -5505, -4211, -1233, 8115, 19995, 4466, -21155, -31253, -23016, 2339, 7611, 4972, -11292, -24838, -23380, -18018, -31033, -34273, -29338, -30471, -27997, -22828, -3254, 16676, -2559, -14507, -11502]
8100a1502N645r671n708K742J1738j4108Q100J2344L22J0724m623k4100j537K2796
8086C162O332n969r871m880P481j889p191l258P357j4001N139j96r008J6111m105
8071a4786M587J3600P44P22J3076M700l412j2116j6652L287m801q067M921M451
8057i746k510N406K0499l003j1395m931J1964M053J557J0560l68j3802m157J7917
8043B2044j7940j0476k41J5142Q26j1298Q368q517p598J3244N978N466p290Q068
8029A5776n19j9502l215J3953K591J3486J6217n512k4141j1191K170k257K610
8016D66J8724N406l4877k514O125R464J050J362j09J0027L984r173l381j7106
8002a0552l506j1434K5101J1073k1298L77J1467J4228N451j640l112n426k153
$$ y = [-11502, -5857, -15528, -21236, -18494, -6756, -20864, -12764, -420, -98, 10626, 6003, -18097, -19634, 3162, 9494, 3525, -6346, -11226, -3745, -5634, -12825, -16083, -8726, -22727, -17588, -17784, -26792, -10681, -14786, -10199, 3401, 4145, 4867, 17943, 22643, 19231, 7115, -9537, -6250, -11051, -19118, -14197, -9746, -12256, -6850, 13649, 10646, -749, -5680, 6284, 10337, 11894, 22454, 22086, 8284, 4127, 22044, 4104, -6372, -6613, 8529, 9355, -1943, 6425, -2092, -9690, 3554, 9532, 14998, 7708, 15776, 15257, -4245, -7460, 6493, 9084, 22570, 38787, 33275, 9134, -2057, 113, -2144, 466, 19190, 24596, -10281, -12795, -6670, 2794, 3844, 5206, 5097, 15124, 19108, 9935, 6554, -10552, -14058, -25492, -391, 10682, -10616, -10239, 1228, 15456, 20907, 19267, 16155, 10729, 8576]
7989H576r219J3280N268j6974P984J0533j2980l874j0655j4792O554J3330J8667
7976A5698P423q927q809j62j7212R84J9144R683J0458J2776K384k8865k0041q15
7962f281N927J0265J2132J1754j0932k0479j4431J568L464R081j066j97J3460
7949A4265j1920j676m502N990J9116j0896j8552K4506L6714M720j6218j8994o296
7936A6257j185K1511N912j6605m684M182Q095Q562r371j9858j7215o18R266J3813
7922A8062r351j7182Q60M382Q292J7433N192q348k1194L153K555K261N277j1749
7908c57J7410m544L242m083n897p274k1147k968J4289O821J3860J0060o665o775
7894E972j5921k706L702J0872J1948K019j1576l914J1402l455J325k924l172K323
$$ y = [8576, -643, 12637, 17905, 931, 8915, 19448, 6468, 2594, -8061, -22853, -16299, -2969, 15698, 23121, 14194, 5385, 5223, -11989, -11005, 8139, 17822, 28280, 41056, 43440, 14575, -5466, -6281, -354, 9911, 22043, 33797, 22865, 2386, -12045, -10477, -7013, 2068, 1002, 805, 14265, 2345, 669, -3833, 2157, 21273, 10377, -8175, 16331, 53045, 57765, 41547, 22553, 16257, 15072, 36583, 42495, 25890, 21206, 25388, 33483, 42045, 32674, 12816, -4399, -5017, 4249, 18062, 8711, -8471, -7611, -3229, 5063, 22496, 27688, 19340, -1854, 1299, 3854, 6115, 11392, -357, 17053, 12509, 15751, 11668, 5771, -1503, -22650, -25618, -11329, -4508, 9352, 19412, 12747, 5972, -9949, -12655, -8953, 1919, 13867, 15886, 4310, 396, 11798, 8343, 9668, 6744, 3572, 5895]
7880E895j5709J282p399O059O957K759q22j5758R745K0998Q745q173j1273K579
7866E885J606p587j6715j5562L609K7457N338k989l70p517j5604J0178R892J5765
7852A3386L759L159k092k0344n968j96R099J0212j2731j0456j0973L478J1483
7839h184P482q733n461n642j2755K353J5735K3547J3960j2096k7939J940O007
7826i786j790L62P068J1955M531n647p895P485K248k0094n593o310j0079Q625
7812b4920N944M725n483R337J8692P219P396p246j0464l635O211n51o820r1l520
7797c206n749J4100O254q807j3579P616q361o345j5530J2068L856r759J595k2
7783b5869K1935K0443P038j7111r024M794m003n729j1136J0201J5349Q020j1937
$$ y = [5895, -9814, -8532, -15931, -9872, -2915, -156, -978, -16736, -6991, 14007, 22752, 14579, 3306, 5885, 7491, -96, -16811, -32373, -28764, -1307, 4031, 1042, 672, -6845, -22449, -12271, -2379, 13386, 17145, 20304, 18212, -2132, -8100, -8296, 803, 11015, -1716, -12172, -23145, -19667, -8184, -702, -9435, -14896, -20538, -33293, -30940, -15205, 8342, 22302, 10206, -17733, -15793, -9786, -11576, -11214, -4146, 7809, 12340, 6693, -1202, 6283, 8531, -11563, -17156, -23466, -33545, -24920, -18976, -14251, -19734, -10397, 8295, 15514, 22910, 15664, 5200, 1565, 7776, 7225, 405, 314, -3206, -8955, 5145, 11399, 2592, -10987, -3371, -11732, -18077, -33607, -21539, -17683, -27442, -25847, -25869, -3934, 16509, 23547, 6436, -2588, 2206, -1797, -7526, -18662, -8461, 6888, 14908, 2971]
7770B971Q965m531q969K462L873n57q02J1656j609l283l249P45n199K636N221
7755A0330m707p547J1684P668l367r752o192J96P046O326k0148k668Q940O831
7741D640j6489o786J3427J1763J659j0797n557M197k860K024Q983k226n761r741
7727a3524J6966Q796p088Nn284j0953o9N412J4520J4096r030l821m16j6876p575
7712a4841j0309p014m198L670J4559J6688M084O405J1765Q390l429o946j7109
7699A715p605J2803J3089M662j6464j7387p844J1461P630k0695j1241j2269J8885
7686b3260J4658j5785m462M829N847k53J2794Q721K09n875n496k450q777j2561
7672c1861K851J6924k388L028J0947r61l672N740J8542j6265n507L3K68P579K344
$$ y = [2971, 11936, 7405, -1564, 898, 4771, 4214, 3412, 15068, 13459, 10176, 6927, 7672, 2473, 5109, 10330, 5623, -1924, 9760, 17428, 14061, 4309, -1883, -1687, 5359, 11685, -8463, -11131, -2191, 4640, -11849, -18635, -5208, 6555, 8214, -2583, -8140, -3943, -6803, -4779, 4204, 1978, -3783, -13524, 3442, 12238, 5150, 5155, -129, -11082, -11151, -5739, 8781, 22877, 13847, 10026, 9610, -7266, -14841, -25150, -32164, -36362, -32692, -18133, -1445, 2639, 9044, 20809, 29199, 25770, 18824, 1715, -5890, 6913, 20002, 24664, 8200, -9187, -17031, -5570, 2060, -18635, -29876, -42145, -23260, -8602, -24387, -28849, -24020, -18173, -18426, -5632, 3089, 3298, -2577, -8073, -10523, -19300, -31861, -29010, -12086, -14474, -11446, -499, -1460, -5132, 608, 19150, 2885, -2622, -2589, -2321, 5258, 7602]
7657G602l134P96J485M296K5000k051n552J0255n165j924k8712j4048n632n775
7643b2559j830J3361J3587k6128j900O244m305j860N476r442j8533j3717K5573
7630c6033K1607L255n958N150J5262q789j0467n664j657J665l485J679k575J8536
7616g474J6814J387l048j0338j345J696J0533L818k627l739j3548r447M43M054
7602a2821m403j4268L94J469J1197N462O699J989p819o082J08l709L101J7138
7588a545r419j5668L140J5618J4390r22r421N527j832l735N370l191j7119l881
7574b2688q48O09l743q977K83K2591L260m341j025K037p845j7537o567N366M858
7559c4567J3453J213o208L864J7423k140K657j135j5116N356J3086J138q088J039
$$ y = [7602, 4468, 5264, 6749, 11045, 36045, 33994, 28442, 38697, 33532, 31608, 2896, -11152, -16784, -22559, -24389, -11028, 2559, -23569, -25469, -19225, -23530, -25390, -19914, -29356, -47889, -61606, -36033, -14426, -11171, -17129, -11979, 3283, -5506, -15973, -21637, -23294, -21629, -25114, -23435, -26010, -7474, 9340, 10727, 7679, -2659, -4004, -2308, 8225, 12043, 9416, 5677, -7871, -17318, -16875, -12821, -17224, -31492, -31098, -29629, -18432, -12970, -6271, -4282, -12101, -18183, -18075, -21784, -18683, -1545, -10964, -26632, -23492, -7874, 6516, 5594, -3827, 1700, -132, -3867, 1503, -1688, -18807, -22688, -23536, -22927, -26670, -35647, -35364, -12773, -9513, -13854, -14879, -12842, -20687, -38224, -44791, -39425, -34567, -21114, -19901, -26109, -22245, -4822, -6962, -4305, -5440, -20556, -15200, -2114, -976, -9064, -8025]
7545h025L491O238j612p447k8806j3337J0776J4016r075K287M257l29j584o94
7531b9844J1012J512p549P123O567P878n80j0910r019R836O905j6239j4625O526
7517c1407J1298o09J9168J6419p890p36o58k9431j1752q755J1130K647K127R872
7503a8577q412j25O988k812M695K0585p75k381j7985N080J7510r77k6399m160
7489b7745O636J7547J2205n071K599q459j1132J8571J6033Q966k485j3548L912
7476A8029L601j1162j2863k007l805j1761O560P162K634J06m552R387J9761R365
7462C0455r218j6061O907K769p393J1094j5334j3148j0555n193J3614P307n843
7449a0599O47l642j013J0330J687J1808O882j6267j8549L813J63O938j7825j834
$$ y = [-8025, -4534, 1704, 92, -7355, -36161, -49498, -38722, -24706, -33781, -31494, -27237, -27566, -29150, -29844, -18832, -17320, -24869, -17746, -11179, -3301, -3881, -14791, -23810, -13974, -7069, -23308, -37933, -31407, -20109, -20718, -1550, 14869, 6979, 6243, 5585, -23846, -35598, -44353, -33223, -30576, -28449, -18577, -26989, -27114, -20126, -22938, -18243, 2342, 1567, -814, -18799, -13719, 3791, 2814, -23585, -27745, -21109, -3562, 8643, 3572, 6171, -2288, -13420, 5151, 21184, 30150, 27665, 14117, 18029, 21630, 10468, -2395, -4402, -8207, -19968, -13408, -6246, -3612, -3506, -8058, 1329, 21090, 30455, 21237, 5176, 12083, 14852, 7459, 18553, 3219, -9929, -20484, -25677, -12063, -4756, -10599, -9952, -13594, -14607, -4277, -2590, 9218, 16100, -167, -18716, -14903, -14740, -7802, -25627, -27461]
7435b7461J8118J4003j545l183q782R818J9064p028j1608o477m199k22n044p952
7421b2498j4926N455L077N982K1702k561O04l23K412r64K51j1037J4747K4482
7407B6403j5527n072r075P241l201l991M457j0282P899M095R23j253j8469r545
7393b5397J288P446K279J1980o42r906R713J3480Q979k1378n979K20k164j0063
7379b0144o077O609K5582K506k2159j049J8090J2652l939j3472m094l534L610
7366e419O868O751r468j6082j903K0029J4795K058n228j1215j9644N365O523k473
7352i043L064M705j6131K081K657P04J4258j813p584J3250J085m049R432R385
7338B2001l980q703J844j6319K994R719o103p243k75J0579N095M270o366n203
$$ y = [-27461, -9343, 4660, 3115, -68, -8850, 968, 20032, 13004, 1396, -5081, -9280, -9502, -14546, -22498, -37424, -31969, -28892, -22910, -1208, -3769, -3165, -3488, -1076, -2040, -1789, -12826, 1921, 26403, 10876, 5804, -3271, 3970, 769, -3222, 1235, -9047, -1148, 2947, 3870, 2617, -15852, -25397, -24109, -16663, -14384, -2404, -3046, -12952, -3239, 10241, 19220, -2158, -8137, -7917, -10081, -20144, -26221, -19612, 5970, 8476, -13683, -14732, 3358, 16010, 12071, -1401, -5495, -9029, -5419, 1449, 8200, -1268, -17350, -19253, 776, 15571, 17629, 12401, 1186, -18458, -13093, -6570, -9043, -5979, -1274, -17405, -15324, -12667, -11963, 2295, 482, -7102, 6148, 7233, 3184, 12616, 22001, 18021, 9318, 11162, -5157, -2163, 7556, 1453, -5790, -6065, 4514, 9609, 13879, 7513, 2310]
7324B310P889k4966r608J0440M555k109j60J3299p643J6499n902J451l78j0964
7310e287o478J857p906j6035l14K3549M278j3144j3192K206n792k086K7396O087
7296d861j289J936J277o524R076j67l745r042N118N278N083m800j1919K141L152
7281i286Q64J172L577J562R204n541k159J143L753J2802m819r688L382J0342q343
7266G965q539j6375r731l23Q27J1293r768R054k99N307O176j1480j6627N646R976
7251a6898o514N797K615M003j34p832M5J6679J4158j2868j8377k1770o783L4828
7237a3051J4928M429k991r578j6330O643P313N958L693P099O853k0129k0496J1889
7223a3770O039j331p977O93k788r417n504J519J8057Q259m3013m210J9137J9824
$$ y = [2310, 10199, -14767, -24375, -13935, -9380, -11489, -11649, 1650, -5993, 10506, 4604, 6055, 5677, -5287, -11765, -9908, -17814, -33849, -34163, -10614, -6336, -19480, -32672, -30466, -36258, -38344, -10948, -4861, -6150, -4214, -2937, -9461, -385, -552, -4297, -13339, -8221, -2943, 2140, -2660, -14579, -12438, -9286, -8422, -7250, -3673, -2111, 7093, 1552, -607, 536, 4289, 17091, 12272, 2584, 5966, 16308, 7965, -574, -16949, -26680, -27003, -26176, -14883, -24651, -15597, -15896, -10589, -4413, -15893, -32520, -26874, -16898, -23412, -17615, -15000, -10997, -11131, -18963, -18918, -2239, 11919, -949, -19326, -41096, -47879, -13051, 1877, 6306, 3315, -6263, -22593, -15950, -8637, -2679, 1014, 8113, 14966, -5163, -25659, -13770, -7731, -9062, -17039, -16346, -19134, -28551, -34055, -32536, -14479, -6220, -49233, -53443, -34306, -14482]
7209a4482J0167Q362j281R387p182j6812M641M241j8859J0927Q926j1159K069
7196a1055J2300j713J739J7319J8827J5585j0848l1637j844j0754J0300L253r231
7183B241K746q68m461O879m25j4169j2431J9396J0111r48j0051L82J665K389j3039
7168a0583j1237O330Q752J1576n763j3913r266R684Q000o621K009J4070P930r918
7154A050n369q062K105N541O908J1149J1028k608O582j6482k041L726n860r239
7140a572n360j1105o540J0948Q139Q806O337p691o38p864o869J2921j809j9794
7126b2091J110Q039K0329k763n268n925M073p339P516o368K822J1698j729j1272
7112g168m919P132l804j2704j981Q224m450o346J0634J4443j215L991p365n793
$$ y = [-14482, -4315, 4047, 2766, 12153, 4971, -11841, -7200, -2959, -21818, -10891, -1965, -13124, -11055, 1245, -468, 1271, 18590, 37417, 53002, 42154, 10517, 8673, -2081, 8219, 11472, 2241, 4987, 4119, -342, 6537, 6112, -8057, -20488, -1092, 9019, 8071, -1980, -1598, 67, 2456, -10583, -21820, -15490, -6738, 4838, -925, -14838, -24104, -14420, -6420, -13041, -11032, 3038, 10968, 1050, -4319, -12381, -10276, -4735, 2173, 13322, 24350, 21742, 28324, 11842, 9801, 13527, 7667, -1572, -6932, -18037, -24577, -13629, -5490, 3316, 9653, 1962, 1324, -6540, -13409, -488, -2297, -22091, -20981, -12942, 7387, 4624, -644, -6569, -2496, -9835, -2319, -8687, -5865, 5833, 4104, -7168, -12087, -4955, -8759, -21463, -23444, -15220, -19670, -26016, -15382, -939, -2154, 1837, -5528, -11321]
7098a1321p297J6426O413j2019N00J1701K549j8918J6382J3765p294O242R876
7085B7005k574o151k6087k2648j1097R556R136L573j479K873r274J6629K0322
7072I784l491n305j0349R556m64j7566P59O681P129r956N923K0633p366p781M278
7057B465j1225k0962R132K0248l923p938J74j0419K0140O455k0416l82J3759J8967
7043A6075j3382J1471R658J0704J2529O369j9718l7118j9821j810J9024J1240
7031E221p257m160j166j6207N024K5816K1641K477q347k4338q809J1163J2406
7018A3464N989j068j0734k4367k0246J5230j595q11O194k574m666N941l968Q570
7004a4641m80j1267J8274J6323l590K35J1831N667o382j441N81L405L357m270
$$ y = [-11321, -18618, -2192, 4221, -7798, -7298, 4403, 6952, -11966, 4416, 18181, 10887, 17129, 27005, 24431, 18280, -7807, -30455, -41552, -31996, -22860, -19287, -20766, -17893, -27167, -10538, 9784, 6293, 988, -9361, 195, -269, -17835, -17076, -10395, -3266, -13222, -7299, 13334, 5968, -1813, 2465, -8760, -29722, -20590, -342, -4265, -12203, -12029, -22448, -2308, 4147, -16269, -16651, -2892, 16075, 2693, 14164, 23822, 34526, 47055, 53424, 33706, -3412, -23233, -25043, -6019, 5221, -2036, -6196, -7362, -23569, -18545, 7271, 28912, 31389, 23042, -1296, -10105, 1058, 13464, 19453, 18385, 7651, -16716, -36962, -21732, -23327, -24138, -17944, -20518, -25184, -19243, -23211, -14641, -15121, -26388, -8114, 8209, 4619, 4854, 16685, 22352, 15970, 14529, 15110, 18515, 21872, 17602]
6990A7602j3988J759O587J3104O457j3975j9302j2809j8231K09J0514K2519O942
6977G388k3581k016j0832q821J5966K4862n420k0245J175R171j44J1355O803J735
6963G396j044m019p071N064P204J2001K548j7967l772P586R998l321k490j0436
6949A677N172j2368j0467K4407L480n495q727N149J1548L683M675j0647l855L39
6935H571Q16j9085N871K0956p877r515k487n33j0170j3970m420J2638L1961J4736
6921B7492L209k7844k8585Q960K1757J3333Q398k789k554r686o083n66K066j781
6907E327J2580j6275m50Q782K614m824k0050j4008J2263O792r95j2255j7823m054
6893d2376L557P203o524Q84J7796J2709Q06j4133K347J9481J9386R46j8029k2954
$$ y = [17602, 3614, 5373, 11960, 25064, 31521, 17546, -1756, -14565, -32796, -32587, -22073, 446, 7388, -16193, -18209, -29041, -37862, -21896, 2966, -2454, -22699, -21524, -12353, -12497, -1142, 5661, 7396, 6352, 2333, -4738, 326, 7530, 19531, 22079, 4112, 340, 7926, 17924, 14603, 12113, 1677, 6849, -5519, -15986, 8421, 11901, 6406, -2321, 2828, 14376, 18059, 22734, 12087, 8232, 8571, 9387, -9698, -3827, 17129, 9252, -263, -2750, -3283, -13453, -27423, -31843, -19205, 12756, 27492, 30701, 2857, -25728, -16768, 4989, 18322, 26720, 23931, 21377, 11691, 5608, 5042, 7108, 5327, 17907, 1632, 1182, 9964, 12578, 7754, -12296, -26304, -14041, -7249, -8244, -20499, -38322, -42376, -38819, -31616, -38140, -37256, -19460, -6751, -5945, -20078, -17731, 1750, 21136, 22082, 4053, -18901]
6879a8901j8897R495K0686L0332n98o775O50K718j5099j7580q02J4210J8298K880
6865B0617J135Q226q866J258m121j0826L587l118k0250q190L332J1848J1451K486
6851H569o109R932J2355j2228k961o070j5182j786P903k01P517M530J091Q911
6837A6271R114k3294j41M694Q411p136q217q365j2104j815J2208J54O779M431
6823I90n030O073P099q669q162j6509L596J5681j244j4602K942J5671J4964J7270
6809C0070p105j2068r525j5023J0131l637k655n837j2287M894m67J9913J1543
6796G947R513J0059k407M332q630n373q555k203L524Q877R369l215j0074r967
6782C197q566j35N24P509m848p561m118J0587Q883p396p011M199r87j1371K832
$$ y = [-18901, -37798, -28303, -7617, 22715, 22117, 15342, 15992, 18710, 3611, -13969, -14771, -561, 17737, 20617, 21752, 29978, 21112, 22370, 18249, 7423, 11010, 7892, -12358, -20548, -17216, -5368, 6083, 8569, 2460, 12392, 24747, 12519, 9558, 3488, -11694, -13480, -5577, -5778, 1739, 6269, 7360, 16271, 25385, 2091, 1950, 6644, 15055, 7919, -298, -8663, -20767, -22582, -10374, -10220, -3441, 990, -4040, 2033, 9132, 463, -7699, -24208, -20612, -4931, -6175, -20777, -17835, -2164, 12800, 30070, 22965, 10897, 1372, -13651, -3520, -7157, -9812, -15649, -27936, -23042, -23509, -3596, 7947, 17460, 27519, 25112, 29444, 20814, 15441, 6886, 4683, 8207, 17084, 26453, 23238, 13164, 3197, -5369, -5504, -4980, 2529, -2319, -9880, -13998, -3411, 5472, -1924, -8935, -4736, -5723, -17094, -14262]
6767a4262j174O744K581j662L177j2672j8747J2515K287j3029J4798k516Q021
6754a3939L896n686K621R933J2507j448j3713J309j3495j8490o21R773L0871O575
6740A0093p133j6840K1566J1617o929m960j1916j4840j849J7474J3720K0104R944
6727D0051J0897q692j2111J0098l013k3517J958J7497M869q241k296J722p372
6714B1850q511l493k888m400o587q403J1497R138Q740j1416j1027p265Q359m429
6700h835r483O501K0407K511k574p508j523N362m292q01j1743q023J0045r6K464
6685g588O193j5413j9757n406K3037L4061J3568P10Q879J2293j2126n421l26r045
6671B3659r207j1086M488K134l21j320J2089J2650n311j920j4800k5322n377J1951
$$ y = [-14262, -15436, -8692, -6111, -7773, -4596, -17268, -36015, -23500, -21213, -34242, -19444, -21960, -13939, -10043, -15729, -13108, -3175, 9332, 7884, -5829, -4520, -18015, -36505, -37126, -27353, 3518, 10093, 2960, -13880, 7686, 19303, 12374, 7414, -4502, -19342, -21191, -3717, 10003, 30107, 40051, 50948, 42256, 30145, 40243, 37230, 13713, 15671, 33168, 38037, 29796, 27500, 29222, 21850, 13339, 9846, 6958, 2558, -4029, -12432, -935, 8203, 16943, 5527, -5500, -12765, -4406, -8835, -18318, -11817, 8590, 11101, 8527, 1019, -504, 4858, 566, -235, -11978, -20001, -9956, -10052, -7588, -1395, -16808, -36565, -41971, -18934, 15127, 28695, 29405, 38284, 50577, 38451, 33030, 32704, 23659, 14452, 3366, 7854, 9988, 9667, 8347, 20436, 33086, 27775, 25855, 11055, -14267, -19644, -7693]
6657g693P062j556p839L699R844N99p979r91K700N45K963O97j6065j2988m9P04
6641b6347J5391Q132n476p641J0743J4472Q470j9066p09J735J1821N250j4552
6628B223p090n205K0094J9047j2350k9575j180N402k52j682q507J8144P384k219
6614D234L127p567l602l624q967R220R979J1970J1627n175j4123k4743j0188J9278
6600h554K8702l654r541r495j1411K063J2370R343P548r408l76j7572j0174j2021
6586c2180M268J8713L120N944P419R208p309l612N945K0323j4736j6467j8721
6573a8085k5166R131K3230j812J5627J7889j3969p309P55o385n969j0708j6827
6560c9598K1772K0316n826K023L958K874J5158m73l069r744j0527j49L408J567
$$ y = [-7693, -631, -2187, -10026, -6327, 3517, 4116, -3863, -4854, -2154, -1609, 1354, 2051, -14014, -27002, -27051, -26347, -10956, -2824, -8300, -15941, -5198, 9274, 17744, -1322, -2031, -296, 11525, 16775, 2223, -4867, -10072, 10022, 29069, 16719, -12856, -14036, -8634, -8886, -10568, -19075, -931, 6453, 4234, 7361, -206, -3808, -7432, -16399, -7179, 2800, 14770, 26397, 21222, 7099, -17644, -27832, -8554, 20148, 16494, 6953, -2542, -13953, -11890, 480, 9823, 17371, 7963, 7587, -9985, -20159, -32180, -27912, -9199, -6079, -135, 7284, 16492, 9183, 5571, 11516, 31839, 17103, 636, -18085, -43251, -34120, -10890, -12702, 2925, 20814, 6845, -464, 291, -6094, -12063, -22771, -39598, -17826, 2490, -3336, -1313, 2645, 5519, 20677, 20204, 17135, 7391, -3136, -3285, 123, 1690]
6546A690J9466j2210j1022o395K724J1192j140j0888O786J1700O789q206N865
6533A6351l634O146r395O209j0919j5777l384P31J013J8628n022p353J3949n724
6519A819k5782Q943J1156Q536j0867j854o314k893O770L920r932j0996J238j0
6505b6266K275K0137K024q295J3852R329M067r788J2003m539j6604m383J2874
6492F686m899j1686J5336r337j849P724j2054j2479j3815L0663K2059P756L540
6479B7645k0994p47L685j3591j1830m514p92k0001Q13J4059J4780Q282K574j68
6465g99Q735j946j484K221n739j0524j5397n216P065J0122K650O616O552n676
6451b820r015j3409M776R211Q665j940k099J8988k410j5234k249o732j150k120
$$ y = [1690, 21156, 8946, -2076, -8471, -5747, 5445, 4305, -6583, 203, 11903, 18692, 10486, 16351, 12717, 18863, 9468, 15677, 4758, -11019, -14403, -13672, -12659, 5969, 947, -6406, 7543, 1819, -23963, -15020, -3864, 4672, -6195, -8049, -14363, -17256, -10486, -6566, -16498, -27494, -26256, -26266, -23991, -3854, -1830, -10125, 3727, 13056, 17123, 7335, 19338, 14799, -1805, -6188, 6686, 1787, -9899, 5437, -3900, -5749, 1975, -10079, -22558, -36373, -5710, 16349, 24105, 27645, 6651, 5904, 9589, -4002, -15832, -20346, -21138, -41139, -40326, -26267, -11487, -3205, -631, -799, 7936, 5990, 4506, 6727, 988, -9536, -24933, -30149, -23084, -12962, -10312, -3696, 2856, -2820, -11835, -25244, -20468, -11257, -2592, -4532, -6631, 12357, 9947, -5287, -7536, -14268, -15418, -17538]
6437a7538k153k040O405j6396j8916J9895P126N022J3269J9921j2182P684r581
6424E16n630p000K0398n501j3232o282l355J803P958k574L389M71n429J4206L016
6409B754k256J1276J0685j0682p896k1645j7221O697J5232J0546J5462k683q837
6396A432J656R40o343n380J125n069O276j101O004J3459N918K381q485o617r544
6381c348L671R943k05K613k48R066P982j2728K797q438r706j0822L462P954J8538
6366B0531K64K934q772O443n135j3000o212r985j3782p01l752J1095J1258K1081
6352A2267J6745k439n218k704p366M730L667R848L293j2903k1548j0878m492n07
6338a7505J4661l297j857p850N190k793p829R99P173K550k350o97J879L853J4792
$$ y = [-17538, -19691, -21731, -15326, -31722, -50638, -30743, -23617, -18595, -5326, 14595, 2413, 10097, 516, -5114, -12114, 8284, 2783, -10449, -16731, -20086, -18283, -10325, -12899, -9510, -9039, -14468, -262, 2754, 498, 11774, 22459, 11777, 3881, -17764, -34985, -28288, -13056, -2510, 12952, 10269, 1432, 3088, 4028, -2315, -7695, -6570, -11639, -5363, -6464, -460, 12999, 18917, 21298, 12813, 6196, -3348, 323, 10266, 10061, 12674, 12426, 21492, 29474, 16746, 19543, 11105, 1399, -9423, -5961, 1993, 20531, 20795, 23729, 14957, 21400, 16265, 3265, -2947, -12932, -26714, -27415, -31167, -20072, -8814, 12267, 29012, 26573, 21355, 18651, 11285, 16015, 19682, 29530, 32823, 19920, -1628, -12506, -16998, -17505, -2844, -6141, -7998, -15848, -10658, -13451, -21280, -20281, -13108, -10558, -12908, -13605, -11726, -7873, 6919]
6323F919N68m982j2237M230J3148K02J1825J2476j6235m907l325m688j28j457
6309A409N614o30j3368j867O818n634K986q432K098K1101Q961k782l565k1765
6295i056p746P839P284P620j7849l293K384l019j2606m381K8608K5127j5058j0402
6281d548j5730p835m264o440J3929J5666M392M682R014m098j0012o76J4904l808
6267E176m616j9185j6024k558J1242O985O522k856j0582P603K1759O736q751o462
6253e011k374J5194l502k5470n779R720J1826J0375l917o962l852L500P753J224
6239B725J0602r435r85m266J1108j0540j1288m213k539n679k204Q784K446K685
6225a2799L839J4910P083o065j4524o717j0044J4303J8218n108L119J1344j1179
$$ y = [6919, 7487, 2505, -9732, -5502, 7646, 7848, 19673, 32149, 15914, 11007, 7682, 2994, 2866, 1409, 7023, 6393, -6975, -8842, -2024, -7658, -4672, -13104, -11006, 10095, 19056, 16274, 12709, -9056, -16802, -8963, -1679, 5941, -11908, -15201, -12817, -15836, -28442, -32823, -4215, 20912, 5854, -4548, -20278, -28113, -32377, -38817, -24888, -9222, -4830, -148, 8866, 4768, -5244, -5920, 8984, 5176, 560, -18625, -34649, -37207, -25965, -18980, -12458, -15314, -25896, -18293, 3466, 10202, 1451, -5011, -7385, 7809, 4307, -21163, -26942, -17222, -5396, 4979, 1062, -5900, -9752, -6252, 1501, 2725, 13327, 3892, 2907, -1359, 9749, -791, -12079, -16292, -18831, -24510, -26714, -17930, -15484, -12799, -8960, 5950, 13033, 6968, -7556, -14273, -24317, -10014, 8204, 3096, 6215, 17559, 6380]
6212F380J175J0990L443l06j751J0817l775n058P57j2329M919Q589j469N827J4950
6197D3159J2787j5610k0645k6465j294J9918J6265r355k2255j8149j791J2592
6185a0843J1232K2655O102n361j744l92l3311k0518j649l610K1230K9878N440
6172A9109m677Q855k081L751Q326j4587j1337k6527p908J4084Q469k819m83j3296
6158b1121l277Q98o512p81M97J1525J0114j3255r592L57J3065J0287K873o85k622
6143h229J9247Q338J061j769q207k5952q942K2249K5718j8608j0016L274L324
6130A488Q004q850l08r917k520R148n966n114q65m451l917r177Q224O066p007
6115b5162P976J0868M171j0561q455L737J4330P248k061j4573j1230q131p02K3878
$$ y = [6380, 7555, 18545, 21988, 21682, 19931, 30748, 26973, 21915, 22672, 10343, 15262, 23851, 22382, 28209, 43159, 55946, 40336, 19691, -6774, -8068, 11850, 28115, 18760, -3495, -21644, -23435, -10843, 389, 23044, 29146, 23785, 22041, 21649, -11662, -32180, -33829, -37439, -16209, 13669, 19109, 14432, 23287, 21206, 24957, 33283, 18696, 7359, -19168, -27076, -12992, -4523, -7342, -7825, -21121, -24398, -23500, -30012, -30793, -30296, -18771, -8657, -21912, -31504, -31147, -18082, -7795, -4922, -5607, -8229, 11018, 19356, 20417, 18648, 10441, -15511, -24453, -2204, 23514, 4906, -5110, -1836, 1488, 9492, 642, 334, -9583, -12103, -2955, -8921, -14035, -14900, -19351, -23268, -32445, -24221, -18155, -25162, -17186, -6318, -2147, -12708, -21163, -17426, -3096, 4152, 2091, -12482, -23712, -31843, -32545, -8667]
6101h667N203N92j4002q590J192Q273k456m317j1425L596o671P325J9508N359
6087e080k845p131M812n2j0084r10K2172j1390r193P548M302L19o91r557L293
6072a4487r686n766M034K9339K7294j637j3291m961M017P194j1019J698n92n957
6058F180M082N8j7484k788P421L109O172j2630q510K913m392J765J6680J3726
$$ y = [-8667, -3464, -2872, -16874, -25464, -24272, -15999, -18455, -22772, -34197, -30601, -37272, -29947, -10439, -5080, -7925, -15056, -10244, -10296, -20380, -21290, 882, -10508, -19701, -12153, -7851, -7532, -8223, -17780, -14487, -24173, -29939, -25905, 3434, 30728, 29091, 15800, 10839, 14856, 22050, 11031, 12729, 12137, 6180, 10262, 10320, -7164, -9952, -2531, 578, 6750, -5880, -14390, -11477, -15869, -14104, 2576, 16302]
$$ [...]
##END NTUPLES=NMR SPECTRUM
##END=
