##TITLE=Analysis number 310865
Compound Code mwp 00226
Project Code adrs
Chemist Name fudan
##JCAMPDX= 6.0         $$ Bruker NMR JCAMP-DX V2.0
##DATA TYPE= NMR SPECTRUM
##DATA CLASS= NTUPLES
##ORIGIN= Bruker BioSpin GmbH
##OWNER= NMR
$$ XWIN-NMR		Version 3.5
$$ Fri Jun 24 11:56:36 2005 GMT Daylight Time (UT+1h)  MAYBRIDGE\NMR@NMR_250MHZ
##.OBSERVE FREQUENCY= 250.131544655141
##.OBSERVE NUCLEUS= ^1H
##.ACQUISITION MODE= SIMULTANEOUS (DQD)
##.ACQUISITION SCHEME= undefined
##.AVERAGES= 16
##.DIGITISER RES= 18
##SPECTROMETER/DATA SYSTEM= dpx250
##.PULSE SEQUENCE= zg30
##.SOLVENT NAME= DMSO
##.SHIFT REFERENCE= (INTERNAL, DMSO, 0, 16.522)
##AUDIT TRAIL= $$ (NUMBER, WHEN, WHO, WHERE, WHAT)
$$ ##TITLE= Audit trail, XWIN-NMR		Version 3.5
$$ ##JCAMPDX= 5.01
$$ ##ORIGIN= Bruker BioSpin GmbH
$$ ##OWNER= NMR
$$ C:\u/data/dgb/nmr/ADRS/4810/pdata/1/auditp.txt
$$ ##AUDIT TRAIL=  $$ (NUMBER, WHEN, WHO, WHERE, WHAT)
(   1,<2005-06-24 11:56:13.38 +100>,<MAYBRIDGE\NMR>,<NMR_250MHZ>,
      <created by zg, POWCHK disabled, PULCHK disabled
       configuration hash MD5:
       62 19 C7 07 E1 42 D1 B7 37 6C 3D D0 77 39 F9 E6
       data hash MD5: 64K
       C4 DE 2C A2 68 B9 B1 AC 0E 64 B1 2D 95 C2 16 70>)
(   2,<2005-06-24 11:56:26.68 +100>,<MAYBRIDGE\NMR>,<NMR_250MHZ>,
      <Start of raw data processing
       ef LB = 0.3 FT_mod = 6 PKNL = 1 SI = 32K 
       data hash MD5: 32K
       A3 18 C4 8B DD 0F D3 FC 5D 31 66 DB 4F 31 3A 08>)
(   3,<2005-06-24 11:56:28.43 +100>,<MAYBRIDGE\NMR>,<NMR_250MHZ>,
      <apk 
       data hash MD5: 32K
       C6 7E B5 14 20 7E 3F C7 74 44 28 27 F1 AD BC A3>)
(   4,<2005-06-24 11:56:29.18 +100>,<MAYBRIDGE\NMR>,<NMR_250MHZ>,
      <abs ABSG = 5 
       data hash MD5: 32K
       D6 18 82 82 B3 2E 1B E7 8E 0F 52 28 E3 7D 39 49>)
$$ ##END=
$$ 
$$ hash MD5
$$ FC 63 45 2A 35 D5 4D 99 0E 21 CC 21 5A 57 24 B0
##$RELAX= 
##$RELAX= 
##$RELAX= 
##$RELAX= 
##$RELAX= 
##$RELAX= 
##$RELAX= 
$$ Bruker specific parameters
$$ --------------------------
##$DU= <C:\u>
##$EXPNO= 4810
##$NAME= <ADRS>
##$PROCNO= 1
##$TYPE= <nmr>
##$USER= <dgb>
##$AMP= (0..31)
100 100 100 100 100 100 100 100 100 100 100 100 100 100 100 100 100 100 
100 100 100 100 100 100 100 100 100 100 100 100 100 100 
##$AQSEQ= 0
##$AQ_mod= 3
##$AUNM= <au_zg>
##$AUTOPOS= <23 >
##$BF1= 250.13
##$BF2= 250.13
##$BF3= 250.13
##$BF4= 250.13
##$BF5= 500.13
##$BF6= 500.13
##$BF7= 500.13
##$BF8= 500.13
##$BYTORDA= 1
##$CFDGTYP= 0
##$CFRGTYP= 5
##$CHEMSTR= <none>
##$CNST= (0..31)
1 1 145 1 1 1 1 1 1 1 1 1 1 1 1 1 1 1 1 1 1 1 1 1 1 1 1 1 1 1 1 1 
##$CPDPRG= <>
##$CPDPRG1= <>
##$CPDPRG2= <>
##$CPDPRG3= <>
##$CPDPRG4= <mlev>
##$CPDPRG5= <mlev>
##$CPDPRG6= <mlev>
##$CPDPRG7= <mlev>
##$CPDPRG8= <mlev>
##$CPDPRGB= <>
##$CPDPRGT= <>
##$D= (0..31)
0 1 0 0 0 0 0 0 0 0.06 0 0 0 0 0 0 0.0002 0 0 0 0 0 0 0 0 0 0 0 0 0 0 
0 
##$DATE= 1119610572
##$DBL= (0..7)
120 120 120 120 120 120 120 120 
##$DBP= (0..7)
150 150 150 150 150 150 150 150 
##$DBP07= 0
##$DBPNAM0= <>
##$DBPNAM1= <>
##$DBPNAM2= <>
##$DBPNAM3= <>
$$ [...]
##$SUBNAM7= <"">
##$SUBNAM8= <"">
##$SUBNAM9= <"">
##$SW= 20.6930455092707
##$SWIBOX= (0..15)
0 0 3 0 0 0 0 0 0 0 0 0 0 0 0 0 
##$SW_h= 5175.983436853
##$TD= 65536
##$TD0= 1
##$TE= 295.16
##$TE2= 300
##$TE3= 300
##$TEG= 300
##$TL= (0..7)
0 120 120 120 120 120 120 120 
##$TP= (0..7)
150 150 150 150 150 150 150 150 
##$TP07= 0
##$TPNAME0= <>
##$TPNAME1= <>
##$TPNAME2= <>
##$TPNAME3= <>
##$TPNAME4= <>
##$TPNAME5= <>
##$TPNAME6= <>
##$TPNAME7= <>
##$TPOAL= (0..7)
0.5 0.5 0.5 0.5 0.5 0.5 0.5 0.5 
##$TPOFFS= (0..7)
0 0 0 0 0 0 0 0 
##$TUNHIN= 0
##$TUNHOUT= 0
##$TUNXOUT= 0
##$USERA1= <user>
##$USERA2= <user>
##$USERA3= <user>
##$USERA4= <user>
##$USERA5= <user>
##$V9= 5
##$VALIST= <valist>
##$VCLIST= <CCCCCCCCCCCCCCC>
##$VD= 0
##$VDLIST= <DDDDDDDDDDDDDDD>
##$VPLIST= <PPPPPPPPPPPPPPP>
##$VTLIST= <TTTTTTTTTTTTTTT>
##$WBST= 1024
##$WBSW= 4
##$XGAIN= (0..3)
0 0 0 0 
##$XL= 0
##$YL= 0
##$YMAX_a= 293488
##$YMIN_a= -372385
##$ZGOPTNS= <>
##$ZL1= 120
##$ZL2= 120
##$ZL3= 120
##$ZL4= 120
##$ABSF1= 16.522
##$ABSF2= -4.171173
##$ABSG= 5
##$ABSL= 3
##$ALPHA= 0
##$AQORDER= 0
##$ASSFAC= 0
##$ASSFACI= 0
##$ASSFACX= 0
##$ASSWID= 0
##$AUNMP= <proc_1d>
##$AZFE= 0.1
##$AZFW= 0.1
##$BCFW= 0
##$BC_mod= 0
##$BYTORDP= 0
##$COROFFS= 0
##$CY= 12.5
##$DATMOD= 1
##$DC= 0
##$DFILT= <>
##$DTYPP= 0
##$F1P= 14.0000005364418
##$F2P= -0.99999901652339
##$FCOR= 0.5
##$FTSIZE= 32768
##$FT_mod= 6
##$GAMMA= 0
##$GB= 0
##$INTBC= 1
##$INTSCL= 1
##$ISEN= 128
##$LB= 0.3
##$LEV0= 0
##$LPBIN= 0
##$MAXI= 10000
##$MC2= 0
##$MEAN= 0
##$ME_mod= 0
##$MI= 0
##$NCOEF= 0
##$NC_proc= -4
##$NLEV= 6
##$NOISF1= 0
##$NOISF2= 0
##$NSP= 0
##$NTH_PI= 0
##$NZP= 0
##$OFFSET= 16.522
##$PC= 1
##$PHC0= -86.34406
##$PHC1= 3.106969
##$PH_mod= 1
##$PKNL= yes
##$PPARMOD= 0
##$PSCAL= 4
##$PSIGN= 0
##$REVERSE= no
##$SF= 250.13
##$SI= 32768
##$SIGF1= 0
##$SIGF2= 0
##$SINO= 400
##$SIOLD= 32768
##$SREGLST= <1H.DMSO>
##$SSB= 0
##$STSI= 32768
##$STSR= 0
##$SW_p= 5175.98343685301
##$SYMM= 0
##$S_DEV= 0
##$TDeff= 65536
##$TDoff= 0
##$TI= <Analysis number 999999
Compound Code 99
Book Reference 9
Project Code 9>
##$TILT= no
##$TM1= 0
##$TM2= 0
##$TOPLEV= 0
##$USERP1= <user>
##$USERP2= <user>
##$USERP3= <user>
##$USERP4= <user>
##$USERP5= <user>
##$WDW= 1
##$XDIM= 32768
##$YMAX_p= 370674308
##$YMIN_p= -220493
$$ End of Bruker specific parameters
$$ ---------------------------------
##NTUPLES= NMR SPECTRUM
##VAR_NAME=  FREQUENCY,     SPECTRUM/REAL,   SPECTRUM/IMAG
##SYMBOL=    X,             R,               I
##VAR_TYPE=  INDEPENDENT,   DEPENDENT,       DEPENDENT
##VAR_FORM=  AFFN,          ASDF,            ASDF
##VAR_DIM=   32768,         32768,           32768
##UNITS=     HZ,            ARBITRARY UNITS, ARBITRARY UNITS
##FACTOR=    0.157963299565203, 1,           1
##FIRST=     4132.6476996994, 0,             0
##LAST=      -1043.33573715361, 0,           0
##MIN=       -1043.33573715361, -220493,     0
##MAX=       4132.6476996994, 370674308,     0
$$ Real data points
##PAGE= N=1
##DATA TABLE= (X++(R..R)), XYDATA
$$ [...]
$$ plain form
15762 -78087 -27921 24167 67719 59756 23039 17490 99165 80450 -12706 34239 96943 31300
15750 31300 -22044 -73092 -100281 -67251 -69303 -37638 -27600 -12424 1981 -532 -17108 -21792
15738 -21792 12496 -7409 -17516 -36489 -38636 -43394 -30753 32874 34888 -35019 -61697 -27187
15726 -27187 24212 31626 10559 -47652 -27185 49658 33123 -33514 -101942 -109734 -81119 -43281
15714 -43281 -441 22985 52476 36120 19967 3370 -2947 -8101 -53226 -7625 -31026 25938
15702 25938 85069 99079 53657 9465 37145 112587 112992 66913 20161 -44152 -40519 -23375
15690 -23375 60630 69098 -7476 -95734 -100414 -71139 -83649 -31454 -31404 11032 -7131 -17355 -15878
15677 -15878 -40247 -20926 30327 48877 28420 16206 16190 46490 76607 78323 63155 16646
$$ packed form
15762g8087N0166N2088M3552p963l6717n549Q1675j8715r3156M6945O2704o5643
15750C1300n3344n1048k7189L3030k052L1665J0038J5176J4405k513j6576m684
15738b1792L4288j9905j0107j8973k147m758J2641O3627K014o9907k6678L4510
15726b7187N1399P414k1067n8211K0467P6843j6535o6637o8428p792K8615L7838
15714d3281M2840K3426K9491j6356j6153j6597o317n154m5125M5601k3401N6964
15702B5938N9131J4010m5422m4192K7680P5442M05m6079m6752o4313L633J7144
15690b3375Q4005Q468p6574q8258m680K9275j2510N2195N0M2436j8163j0224J477
15677a5878k4369J9321N1253J8550k0457j2214j6L0300L0117J716j5168m6509
$$ plain form
15665 16646 11017 -3026 38282 44914 9621 -13256 -29260 -18865 23861 54344 45917 -4706
15653 -4706 -25541 -47327 -34355 10271 -8295 -50655 -78680 -94637 -77311 -46815 23431 -19164
15641 -19164 -38099 7128 43375 13880 4862 36560 44717 7 -21738 -65428 -83831 -104620
15629 -104620 -118430 -111820 -157829 -128111 -50348 45907 40535 20370 25300 74286 53249 -3717
15617 -3717 -3200 16207 13803 23183 15257 -22472 -49140 -22884 15102 2037 48115 69387 33848
15604 33848 60335 129368 115932 84727 65944 94208 132933 109890 45243 -11309 -3814 27719
15592 27719 48355 89933 62222 22807 7132 -11923 -35660 -77550 -113896 -89393 -12956 50360
15580 50360 40311 -3555 27513 72830 96707 82164 -3112 -43567 -97232 -75415 -44274 -18726
$$ packed form
15665A6646n629j4043M1308O632l5293k2877j6004J0395M2726L0483q427n0623
15653d706k0835k1786J2972M4626j8566m2360k8025j5957J7326L0496P0246m2595
15641a9164j8935M5227L6247k9495r018L1698Q157m4710k1745m3690j8403k0789
15629a04620j3810O610m6009K9718P7763R6255n372k0165M930M8986k1037n6966
15617c717N17J9407k404R380p926l7729k6668K6256L7986j3065M6078K1272l5539
15604C3848K6487O9033j3436l1205j8783K8264L8725k3043o4647n6552P495L1533
15592B7719K0636M1578k7711l9415j5675j9055k3737m1890l6346K4503P6437O3316
15580E0360j0049m3866L1068M5317K3877j4543q5276m0455n3665K1817L1141K5548
$$ plain form
15568 -18726 -12531 -75103 -78747 -83103 -60687 -60522 -22093 13156 -24237 -30977 17938 32692 -1945
15555 -1945 -52907 33229 77950 62354 16738 3672 39230 35273 1388 9358 -18424 -13790
15543 -13790 -6459 14588 16702 20741 23886 56218 60861 -11200 -58615 -110260 -67806 -8948 -9152
15530 -9152 344 39414 14819 22258 4094 -17447 -27469 -12365 -3263 -6569 -4159 17613 28441
15517 28441 -7746 12227 22083 77168 156437 166431 151461 155560 26279 -59388 -53618 -4768
15505 -4768 20689 49582 112606 107797 90469 107109 58204 48490 54277 45223 45185 59430 21651
15492 21651 -8459 -10995 6831 7258 61095 41153 15678 31786 49725 1515 1555 35324 17517
15479 17517 -44970 -49534 -52365 -30867 9433 3491 6798 -33687 -42390 -8412 44402 80035 45778
$$ packed form
15568a8726O195o2572l644m356K2416J65L8429L5249l7393o740M8915J4754l4637
15555a945n0962Q6136M4721j5596m5616j3066L5558l957l3885P970k7782M634
15543a3790P331K1047K114M039L145L2332M643p2061m7415n1645M2454N8858k04
15530i152R496L9070k4595P439j8164k1541j0022J5104R102l306K410K1772J0828
15517B8441l6187J9973R856N5085P9269R994j4970M099j29281q5667N770M8850
15505d768K5457K8893O3024m809j7328J6640m8905r714N787r054l8J4245l7779
15492B1651l0110k536J7826M27N3837j9942k5475J6108J7939m8210M0L3769j7807
15479A7517o2487m564k831K1498M0300n942L307m0485q703L3978N2814L5633l4257
$$ plain form
15466 45778 23650 35058 50558 417 -18910 29731 21755 7218 -60711 -85887 -57737 -80842
15454 -80842 -29064 -21621 -27827 -20970 4721 18699 -8923 -29226 -21818 -12353 -11120 -40905 -63598
15441 -63598 -89539 -151594 -113308 -63374 -60796 -6471 -19803 -10692 2259 444 9621 -18724
15429 -18724 -43313 -53680 -71596 -2306 13698 12254 -31952 -108403 -47968 -5972 -9974 -60387
15417 -60387 -121709 -117122 -68972 -53553 -45551 -5383 13171 -29716 -27879 -39659 -21196 74864
15405 74864 129340 136347 127277 84671 32640 23494 58385 34347 23093 43955 33551 -62951
15393 -62951 -57616 -14086 -27443 -27947 -46480 -91139 -89834 -16019 30520 -270 -4020 17361 7769
15380 7769 22837 34249 10425 -11084 -68175 -78668 -71377 -39028 -8186 25585 38660 41009
$$ packed form
15466D5778k2128J1408J5500n0141j9327M8641p976j4537o7929k5176K8150k3105
15454h0842N1778P443o206O857K5691J3978k7622k0303P408R465J233k9785k2693
15441f3598k5941o2055L8286M9934K578N4325j3332R111J2951j815R177k8345
15429a8724k4589j0367j7916O9290J6004j444m4206p6451O0435M1996m002n0413
15417f0387o1322M587M8150J5419Q002M0168J8554m2887J837j1780J8463R6060
15405G4864N4476P007r070m2606n2031r146L4891k4038j1254K0862j0404r6502
15393f2951N335M3530j3357n04j8533m4659J305P3815M6539l0790l750K1381r592
15380G769J5068J1412k3824k1509n7091j0493P291L2349L0842L3771J3075K349
$$ plain form
15368 41009 3978 -26653 24299 49422 -8850 -4593 31002 24848 -29645 -1433 12219 19301
15356 19301 31020 20892 20663 -3233 -14228 -32796 -43254 -3416 20610 -11781 -59257 -29331
15344 -29331 62627 73390 109770 85286 72525 72179 -17429 -57429 -69191 -94746 -86902 -32037
15332 -32037 98449 144963 51857 10137 32686 8504 14969 -38581 -15768 -10513 -31094 -41260
15320 -41260 24665 47743 -27102 -94110 -107401 -21243 36764 16777 29039 28492 -21919 8998
15308 8998 103859 104733 72487 58548 64780 59242 39371 11485 -68165 -67827 -47921 -54872 -78383
15295 -78383 -3492 53474 53277 29334 -43825 -64665 -41852 -35565 12748 21681 84810 108996
15283 108996 38811 47565 64648 15207 -13582 -31651 -44233 -98335 -66699 -26962 1181 34394
$$ packed form
15368D1009l7031l0631N0952K5123n8272M257L5595o154n4493K8212J3652P082
15356A9301J1719j0128k29k3896j0995j8568j0458L9838K4026l2391m7476K9926
15344b9331R1958J0763L6380k4484j2761l46q9608m0000j1762k5555P844N4865
15332c2037J30486M6514r3106m1720K2549k4182O465n3550K2813N255k0581j0166
15320d1260O5925K3078p4845o7008j3291Q6158N8007j9987J2262n47n0411L0917
15308H998R4861Q74l2246j3939O232n538j9871k7886p9650L38J9906o951k3511
15295g8383P4891N6966j97k3943p3159k0840K2813O287M8313Q933O3129K4186
15283A08996p0185Q754J7083m9441k8789j8069j2582n4102L1636L9737K8143L3213
$$ plain form
15271 34394 90716 112820 77396 -15320 -56119 16895 32809 -37613 -16059 66998 75646 40849
15259 40849 -30218 -41156 -77735 -28362 -13055 19339 38695 15953 -23256 -52936 -16527 -6314
15247 -6314 -79656 -119884 -105332 -144217 -171989 -131686 -85329 -6793 -4401 -24574 -5270 -20291
15235 -20291 -42695 -27332 -3365 -22823 -70298 -68589 -40805 10287 28106 -29044 -64442 -12863
15223 -12863 52414 -17172 793 57320 84001 121995 136862 7222 -83888 -42162 -17403
15212 -17403 2258 -44060 -71431 -2860 48097 36941 66729 112537 120045 70597 -24645 -42112
15200 -42112 -36678 -20977 -20105 -26509 -22414 -31924 15902 22684 22922 16272 65609 55799 55748 37175
15186 37175 65722 76220 61861 19509 -13371 -20892 -70057 -62350 1029 11723 40020 62271
$$ packed form
15271C4394N6322K2104l5424r2716m0799P3014J5914p0422K1554Q3057Q648l4797
15259D0849p1067j0938l6579M9373J5307L2394J9356k2742l9209k9680L6409J0213
15247f314p3342m0228J4552l8885k7772M0303M6357P8536K392k0173J9304j5021
15235b0291k2404J5363K3967j9458m7475J709K7784N1092J7819n7150l5398N1579
15223a2863O5277o9586J7965N6527K6681L7994J4867j29640r1110M1726K4759
15212a7403J9661m6318k7371O8571N0957j1156K9788M5808P508m9448r5242j7467
15200d2112N434J5701Q72o404M095r510M7826O782K38o650M9337r810n1j8573
15186C7175K8547J0498j4359m2352l2880p521m9165P707O3379J0694K8297K2251
$$ plain form
15174 62271 25143 17300 -8706 -18059 -39372 -27919 -5516 -7060 -41388 -65129 -43291 -68394
15162 -68394 -91912 -61022 -29001 -51802 -94678 -48879 -5118 31693 5015 -109085 -74480
15151 -74480 -50622 -17277 24728 9568 -14560 10980 12763 -12716 31147 68739 43276 -35291
15139 -35291 -103867 -81993 -67463 -40218 11919 24899 19521 41434 3309 46944 69114 81299
15127 81299 124910 111691 66953 87908 76588 69457 47552 4217 10485 -28854 -37924 -44805
15115 -44805 -67710 -49564 -70386 -68143 -16046 23188 22235 7948 -23358 8137 -5567 -17433
15103 -17433 -39087 -6742 71579 23378 -10786 -6984 52693 78755 81637 21379 -49089 -67921
15091 -67921 -78046 -51935 25819 6018 9377 64632 133731 113244 54870 -2867 -8673 23781
$$ packed form
15174F2271l7128p843k6006r353k1313J1453K2403j544l4328k3741K1838k5103
15162f8394k3518L0890L2021k2801m2876M5799M3761L6811k6678j14100L4605
15151g4480K3858L3345M2005j5160k4128K5540J783k5479M3863L7592k5463p8567
15139c5291o8576K1874J4530K7245N2137J2980n378K1913l8125M3635K2170J2185
15127H1299M3611j3219m4738K0955j1320p131k1905m3335O268l9339r070o881
15115d4805k2905J8146k0822K243N2097L9234r53j4287l1306L1495j3704j1866
15103a7433k1654L2345P8321m8201l4164L802N9677K6062K882o0258p0468j8832
15091f7921j0125K6111P7754j9801L359N5255O9099k0487n8374n7737n806L2454
$$ plain form
15079 23781 6896 -38740 -9774 5558 52051 77724 78323 18426 -37875 -924 65117 63238
15067 63238 11926 43107 69909 25270 -19160 -25110 -11782 -4338 -61727 -110064 -69164 -53281
15055 -53281 11902 34280 4331 49022 42994 53363 -148 -25413 23953 29998 43620 53332
15043 53332 82480 97416 104535 31631 -274 -31855 -14226 31194 20431 -24987 -40440 5637
15031 5637 25345 65193 46867 52184 28109 1319 565 -21366 -44921 5199 17764 45319
15019 45319 13192 -61210 -43301 -38436 -10534 13342 16376 25425 11402 -20444 -8708 52222
15007 52222 45230 6770 -15933 -30290 -45645 -99246 -2609 52844 37123 12765 22455 -30252
14995 -30252 -28935 -16240 -18397 -23316 12442 36686 22738 25452 47070 10435 -8704 18629
$$ packed form
15079B3781j6885m5636K8966J5332M6493K5673N99n9897n6301L6951O6041j879
15067F3238n1312L1181K6802m4639m4430n950J3328P444n7389m8337M0900J5883
15055e3281O5183K2378k9949M4691o028J0369n3511k5265M9366O045J3622R712
15043E3332K9148J4936P119p2904l1905l1581J7629M5420j0763m5418j5453M6077
15031E637J9708L9848j8326N317k4075k6790p54k1931k3555N0120J2565K7555
15019D5319l2127p4402J7909M865K7902K3876L034R049j4023l1846J1736O0930
15007E2222o992l8460k2703j4357j5355n3601R6637N5453j5721k4358R690n2707
14995c0252J317J2695k157m919L5758K4244j3948K714K1618l6635j9139K7333
$$ plain form
14983 18629 33141 62384 54972 65682 31290 6670 -3603 -46443 -49072 -89748 -95317 -84423
14971 -84423 -57646 -18755 -2432 -27604 -53883 -83072 -53111 -19010 13885 32859 27170 16216
14959 16216 27074 -19817 1390 -1816 -72886 -90197 -50653 -25940 -9225 -38733 -23175 7217
14947 7217 -4660 -27254 20795 103775 93123 -3829 -34245 -21842 16351 54858 39737 36543
14935 36543 86522 99327 84552 84472 90162 75071 4032 -13509 -28750 -33912 -27970 9296 33404
14922 33404 4183 -1493 -41885 -47440 -54140 -4869 20265 17544 -2225 -16954 -37966 -34367 -70245
14909 -70245 -85300 -90819 -84517 -54972 -26009 11324 41503 3710 -10279 8449 -1372 -32002
14897 -32002 -71062 -84642 -97854 -59792 -103801 -92483 -58251 -14796 45449 66601 115631 120570
$$ packed form
14983A8629J4512K9243p412J0710l4392k4620j0273m2840k629m0676n569J0894
14971h4423K6777L8891J6323k5172k6279k9189K9961L4101L2895J8974n689j0954
14959A6216J0858m6891K1207l206p1070j7311L9544K4713J6715k9508J5558L0392
14947G217j1877k2594M8049Q2980j0652r6952l0416J2403L8193L8507j5121l194
14935C6543M9979J2805j4775q0N690j5091p1039j7541j5241n162N942L7266K4108
14922C3404k9221n676m0392n555o700M9271K5134k721j9769j4729k1012L599l5878
14909g0245j5055n519O302K9545K8963L7333L0179l7793j3989J8728r821l0630
14897c2002l9060j3580j3212L8062m4009J1318L4232M3455O0245K1152M9030M939
$$ plain form
14885 120570 124551 78158 1489 11361 108829 135234 67433 23510 -10398 -29037 -28475 -12819
14873 -12819 -28429 -5066 -16086 -77984 -109459 -43225 -42807 -7254 36293 -39457 -34287 12806
14861 12806 46738 8577 21972 37785 24175 18442 24625 -10346 -24687 -53204 -60117 -104030
14849 -104030 -68575 -10240 44577 66349 68189 89779 40479 700 14082 29844 -13718 -10966
14837 -10966 19579 43694 41583 31846 65512 53651 44435 8620 -7228 -64218 -31435 -5240
14825 -5240 4217 20965 -7108 -18927 4966 -2928 -15758 11132 -27284 -38492 -22134 9089
14813 9089 36932 71224 55872 58808 1375 -24027 2288 41721 81281 124314 105060 112034
14801 112034 62398 -11263 -43574 -95278 -45397 315 54736 78669 43855 -24690 -10128
$$ packed form
14885A20570L981m6393p6669R872R7468K6405o7801m3923l3908j8639N62J5656
14873a2819j5610K3363j1020o1898l1475O6234M18L5553M3547p5750N170M7093
14861A2806L3932l8161J3395J5813j3610n733O183l4971j4341k8517o913m3913
14849a04030L5455N8335N4817K1772J840K1590m9300l9779J3382J5762m3562K752
14837a0966L0545K4115k111r737L3666j1861r216l5815j5848n6990L2783K6195
14825e240R457J6748k8073j1819K3893p894j2830K6890l8416j1208J6358L1223
14813I089K7843L4292j5352K936n7433k5402K6315L9433L9560M3033j9254O974
14801A12034m9636p3661l2311n1704M9881M5712N4421K3933l4814o8545J4562
$$ plain form
14790 -10128 33759 -25886 -70998 -98179 -72018 -59214 21153 82825 86506 85830 148171 149741
14778 149741 125202 102748 92772 87125 111961 94149 62294 57143 31655 -27475 -2879 34128
14766 34128 9246 -30293 -29122 37376 36970 53689 12016 -32987 -60689 -43246 -19466 26859
14754 26859 18032 37804 -15577 7525 31972 2690 -19473 2796 -1662 51684 27822 -7329
14742 -7329 23100 65268 63142 53567 -9953 -34041 -19582 19175 976 -23784 -19317 -10837 -17720
14729 -17720 -36942 -22603 -39368 -25299 -43524 -26758 -7817 -14738 2428 -9512 -24199 14968
14717 14968 56740 52927 54050 45858 5806 37765 12094 -28308 -51452 -23502 -39470 -27903
14705 -27903 -28051 -2419 35247 -1407 -51137 -9899 26870 2372 -40171 -19248 6018 2913
$$ packed form
14790a0128M3887n9645m5112k7181K6161J2804Q0367O1672L681o76O2341J570
14778A49741k4539k2454r976n647K4836j7812l1855n151k5488n9130K4596L7007
14766C4128k4882l9539J171O6498m06J6719m1673m5003k7702J7443K3780M6325
14754B6859q827J9772n3381K3102K4447k9282k2163K2269m458N3346k3862l5151
14742g329L0429M2168k126r575o3520k4088J4459L8757j8199k4760M467Q480o883
14729a7720j9222J4339j6765J4069j8225J6766J8941o921J7166j1940j4687L9167
14717A4968M1772l813J123q192m0052L1959k5671m0402k3144K7950j5968J1567
14705b7903j48K5632L7666l6654m9730M1238L6769k4498m2543K0923K5266l105
$$ plain form
14693 2913 9595 23175 40176 364 -43315 -83591 -108412 -117147 -112983 -133408 -63090 -25294
14681 -25294 -29233 1135 -11550 -54850 19030 98098 72195 12465 -3065 38174 41218 16201
14669 16201 17361 44911 17148 -15792 -35114 -62229 4813 17656 378 59068 40052 21119
14657 21119 31769 15803 23715 -19444 -13666 11522 4407 143 -18969 -16375 51351 89371 91689
14644 91689 79124 75755 83134 70531 73718 70726 79320 35278 -35359 -27330 20786 -736 12025
14631 12025 66137 69927 22549 -15379 -27900 -5708 56565 52211 69543 69442 9776 -22874
14619 -22874 -16637 13231 10109 33476 -18553 -29435 -38553 -34444 16066 33125 -12891 -122361
14607 -122361 -138794 -86023 -45286 30871 56020 86586 69706 52276 55493 67833 7123 -10136
$$ packed form
14693B913O682J3580J7001l9812m3679m0276k4821q735M164k0425P0318L7796
14681b5294l939L0368j2685m3300P3880P9068k5903n9730j5530M1239L044k5017
14669A6201J160K7550k7763l2940j9322k7115O7042J2843j7278N8690j9016j8933
14657B1119J0650j5966P912m3159N778K5188p115m264j9112K594O7726L8020K318
14644I1689j2565l369P379j2603L187k992Q594m4042p0637Q029M8116k1522J2761
14631A2025N4112L790m7378l7928j2521K2192O2273m354J7332j01n9666l2650
14619b2874O237K9868l122K3367n2029j0882r118M109N0510J7059m6016j09470
14607a22361j6433N2771M0737P6157K5149L0566j6880j7430L217J2340o0710j7259
$$ plain form
14595 -10136 8184 -14011 -29361 -23437 -34803 -61880 -8326 60951 74286 71017 136645 206686
14583 206686 179321 144805 114983 81392 54393 43418 18271 -33749 -35112 -22987 -16068 29719
14571 29719 49305 59767 76950 42165 -52751 -33682 40040 43546 27054 69438 50512 -7494
14559 -7494 -56225 -28081 26123 16838 -40356 -50802 -87299 -58490 27440 26738 -12110 -9875 -17518
14546 -17518 -31222 -32897 -75449 -96244 -47094 -10722 6328 37288 41139 57380 69427 111898
14534 111898 123439 124669 106134 96331 29273 -18544 -65905 -51879 -29047 -21721 -6062 -14542
14522 -14542 -17546 -8913 -9332 8523 18049 35082 79345 45089 40765 118394 123445 84109 43750
14509 43750 40458 6698 32924 9684 34815 70989 99454 105332 46426 -39135 -8396 19114
$$ packed form
14595a0136J8320k2195j5350N924j1366k7077N3554O9277J3335l269O5628P0041
14583B06686k7365l4516k9822l3591k6999j0975k5147n2020j363J2125O919M5787
14571B9719J9586J0462J7183l4785r4916J9069P3722L506j6492M2384j8926n8006
14559g494m8731K8144N4204r285n7194j0446l6497K8809Q5930p02l8848K235p643
14546a7518j3704j675m2552k0795M9150L6372J7050L0960L851J6241J2047M2471
14534A11898J1541J230j8535r803o7058m7817m7361J4026K2832P326J5659q480
14522a4542l004Q633m19J7855R526J7033M4263l4256m324P7629N051l9336m0359
14509D3750l292l3760K6226k3240K5131L6174K8465N878n8906q5561L0739K7510
$$ plain form
14497 19114 -47773 -59728 -11332 45042 49083 29329 26785 -26956 -38605 -11235 -6863 -57356
14485 -57356 -37787 -545 390 -10913 62246 102022 84673 37677 -22188 -42390 -11819 -6705
14473 -6705 38079 16440 -8920 -13959 -29549 28765 58520 66401 58650 76008 69882 22758 -33337
14460 -33337 -64907 -59269 -38201 -40838 -34335 20307 4167 -9390 33571 82369 81863 42109 77736
14447 77736 97316 58836 -12717 12020 10292 27294 91634 79633 71658 76873 39511 -5933
14435 -5933 -31924 3398 75262 65686 71480 9119 -33288 -30001 1251 -3819 895 16133 -19326
14422 -19326 -11015 13674 6691 24573 -4013 -9557 -25263 3114 62590 60882 60918 66174 75718
14409 75718 58879 52266 37393 9501 81534 66428 71705 83334 102122 59753 32354 23542
$$ packed form
14497A9114o6887j1955M8396N6374M041j9754k544n3741j1649K7370M372n0493
14485e7356J9569L7242R35j1303P3159L9776j7349m6996n9865k0202L0571N114
14473f705M4784k1639k5360n039j5590N8314K9755P881p751J7358o126m7124n6095
14460c3337l1570N638K1068k637O503N4642j6140j3557M2961M8798n06l9754L5627
14447G7736J9580l8480p1553K4737j728J7002O4340j2001p975N215l7362m5444
14435e933k5991L5322P1864r576N794o2361m2407L287L1252n070M714J5238l5459
14422a9326Q311K4689o983J7882k8586n544j5706K8377N9476j708L6N256R544
14409G5718j6839o613j4873k7892P2033j5106N277J1629J8788m2369k7399q812
$$ plain form
14397 23542 5950 -26242 -14900 2459 37688 133346 145713 137183 175059 182967 122648 61169
14385 61169 11569 21174 -7655 -39011 5442 12985 -1637 -47567 -33957 -28237 -4928 33027
14373 33027 -11520 -8128 -8730 -39155 -22990 -14506 -69360 -71448 11206 -28443 -8630 22967 15338
14360 15338 3525 -28222 -32090 -19848 -20695 -47560 -58551 -22127 -27309 -28099 -37639 -19329 1275
14347 1275 -6039 11796 22619 16094 15131 5191 -10512 -61123 -114975 -62307 -51991 26960 72643
14334 72643 110760 130550 101581 65931 36805 52078 4597 -12699 -5005 -9161 -15281 -18693
14322 -18693 23052 58262 78601 3448 -20929 -50927 -44139 -38101 -52592 -24136 41182 82421
14310 82421 107942 67887 105673 138064 141916 123998 76602 71502 135370 150194 94535 68175
$$ packed form
14397B3542j7592l2192J1342J7359L5229R5658J2367q530L7876P908o0319o1479
14385F1169m9600R605k8829l1356M4453P543j4622m5930J3610N720K3309L7955
14373C3027m4547L392o02l0425J6165Q484n4854k088Q2654l9649J9813L1597p629
14360A5338j1813l1747l868J2242q47k6865j0991L6424n182p90r540J8310K0604
14347A275p314J7835J0823o525r63r940j5703n0611n3852N2668J0316P8951M5683
14334G2643L8117J9790k8969l5650k9126J5273m7481j7296P694m156o120l412
14322a8693M1745L5210K0339p5153k4377k9998O788O038j4491K8456O5318M1239
14310H2421K5521m0055L7786L2391L852j7918m7396n100O3868J4824n5659k6360
$$ plain form
14298 68175 132530 174521 122578 65113 64769 45579 21746 3770 -1062 -20184 -21406 12144
14286 12144 -11158 8223 28255 61182 47147 64175 107628 115651 88354 109527 115904 87868
14274 87868 39167 10027 8378 28229 9857 30405 75160 106010 74594 65317 121967 142516
14262 142516 100962 51306 69469 51348 53139 77436 122720 108271 95217 63878 68558 57628
14250 57628 27229 -31784 -104454 -123834 -90962 -16884 621 10903 47845 -3134 6034 84116
14238 84116 121245 94937 82836 46432 -713 37283 66537 50819 101313 118679 129340 93414
14226 93414 63973 96733 79811 18421 -19568 -6936 29305 59862 120711 139920 76153 19314
14214 19314 -54357 -82684 -55656 -30929 18940 46043 15962 42352 44908 50753 63503 46661
$$ packed form
14298F8175O4355M1991n1943n7465l44j9190k3833j7976m832j9122j222L3550
14286A2144k3302J9381K0032L2927j4035J7028M3453Q023k7297K1173O377k8036
14274H7868m8701k9140j649J9851j8372K0548M4755L0850l1416r277N6650K0549
14262A42516m1554m9656J8163j8121J791K4297M5284j4449j3054l1339M680j0930
14250E7628l0399n9013p2670j9380L2872P4078J7505J0282L6942n0979R168P8082
14238H4116L7129k6308j2101l6404m7145L7996K9254j5718N0494J7366J0661l5926
14226I3414k9441L2760j6922o1390l7989J2632L6241L0557O0849J9209o3767n6839
14214A9314p3671k8327K7028K4727M9869K7103l0081K6390K556N845J2750j6842
$$ plain form
14202 46661 25996 39249 17176 -37125 -33935 -15506 -22141 22243 53409 141782 90480 34584
14190 34584 40738 28082 8422 -7294 -21705 -6583 34483 67080 22826 57194 70274 59053
14178 59053 35415 21324 16740 49529 24336 33599 35265 70134 68484 19500 88008 148550
14166 148550 138454 152743 121472 42355 22111 29145 96637 76006 42404 48448 1642 8983
14154 8983 45993 69733 62060 76097 107238 72704 59769 21867 -2569 -19990 -22723 15975
14142 15975 5516 -16247 -71950 -49436 5883 18402 3898 39056 77023 31210 502 14482
14130 14482 57057 63731 22459 12562 22179 36753 35207 23899 30549 5225 -46619 -71587 -30252
14117 -30252 44745 145144 171950 165007 182828 179244 124594 140369 103619 40523 63347 90383
$$ packed form
14202D6661k0665J3253k2073n4301L190J8429o635M4384L1166Q8373n1302n5896
14190C4584O154j2656j9660j5716j4411J5122M1066L2597m4254L4368J3080j1221
14178E9053k3638j4091m584L2789k5193R263J666L4869j650m8984O8508O0542
14166A48550j0096J4289l1271p9117k0244P034O7492k0631l3602O044m6806P341
14154H983L7010K3740p673J4037L1141l4534j2935l7902k4436j7421k733L8698
14142A5975j0459k1763n5703K2514N5319J2519j4504L5158L7967m5813l0708J3980
14130A4482M2575O674m1272r897R617J4574j546j1308O650k5324n1844k4968M1335
14117c0252P4997J00399K6806o943J7821l584n4650J5775l6750o3096K2824K7036
$$ plain form
14105 90383 58234 78319 35877 13914 -46804 -37440 -34021 18679 93894 77697 87159 42828
14093 42828 50698 70807 61659 44786 42651 18696 3595 6214 67649 91579 36243 -12380
14081 -12380 -21765 16415 8463 38368 55898 29734 47594 50009 22159 58766 110239 149797
14069 149797 149416 113430 80125 77472 89130 68228 100307 105723 110939 88707 53028 40301
14057 40301 26773 8248 -13581 -79335 -75131 -46270 -14026 43595 51455 18060 -48674 -63524
14045 -63524 -39372 30036 54713 61788 49082 65418 9085 38769 74681 50728 32381 23715
14033 23715 13759 -18991 23561 91936 95357 95169 46513 8043 29306 39705 92212 99503 78834
14020 78834 52058 44955 35344 63783 106162 101729 66665 58305 98040 95414 99679 152447 125687
$$ packed form
14105I0383l2149K0085m2442k1963o0718R364L419N2700P5215j6197R462m4331
14093D2828P870K0109r148j6873k135k3955j5101K619O1435K3930n5336m8623
14081a2380r385L8180p952K9905J7530k6164J7860K415k7850L6607N1473L9558
14069A49797l81l5986l3305k653J1658k0902L2079N416N216k2232l5679j2727
14057D0301j3528j8525k1829o5754M204K8861L2244N7621P860l3395o6734j4850
14045f3524K4152O9408K4677P075j2706J6336n6333K9684L5912k3953j8347q666
14033B3715r956l2750M2552O8375L421j88m8656l8470K1263J0399N2507P291k0669
14020G8834k6776p103r611K8439M2379m433l5064q360L9735k626M265N2768k6760
$$ plain form
14007 125687 109540 114423 121612 115560 91755 50875 19120 -74565 -15867 28912 -5898 48473
13995 48473 68852 46368 67566 137552 176087 178062 127574 52370 46424 81605 114757 75755
13983 75755 69150 105255 70406 49587 44633 47087 48886 35659 7821 37871 57890 70681
13971 70681 48931 40797 39353 15603 12401 56253 36873 27033 56509 46764 51730 95005 97310
13958 97310 123126 138958 108911 114911 116858 37511 5885 57392 94925 139115 101373 65493
13946 65493 47566 36071 -37440 -37596 46290 68033 -8879 -17664 13733 81139 114635 115656
13934 115656 108810 50624 9173 29530 87242 115219 127543 156316 152963 207636 212607 128380
13922 128380 74078 54128 73813 87570 74292 47554 63234 111630 170117 149951 134242
$$ packed form
14007A25687j6147M883P189o052k3805m0880l1755r3685N8698M4779l4810N4371
13995D8473K0379k2484K1198O9986L8535J975n0488p5204n946L5181L3152l9002
13983G5755o605L6105l4849k0819m954K454J799j3227k7838L0050K0019J2791
13971G0681k1750q134j444k3750l202M3852j9380r840K9476r745M966M3275K305
13958I7310K5816J5832l0047O000J947p9347l1626N1507L7533M4190l7742l5880
13946F5493j7927j1495p3511j56Q3886K1743p6912q785L1397O7406L3496J021
13934A15656o846n8186m1451K0357N7712K7977J2324K8773l353N4673M971q4227
13922A28380n4302j9950J9685J3757j3278k6738J5680M8396N8487k0166j5709
$$ plain form
13911 134242 76167 34322 71352 107729 132602 98738 91644 21226 -34455 -32094 -13705 49946
13899 49946 66214 73414 88128 75247 89437 99437 102095 93165 75893 129741 117492 95432
13887 95432 5950 14573 69158 27091 9296 14638 22377 -6345 -41936 -54427 -2065 54854
13875 54854 66301 81431 11941 8547 48859 58069 71263 69002 28065 40416 73147 68223
13863 68223 67374 36772 59598 73769 58511 90103 135618 127399 103773 99229 52996 57359 61036
13850 61036 39650 44574 45768 84803 126563 179647 160021 120580 74444 81825 99869 77490
13838 77490 77552 -30820 -26376 57581 92769 117351 75606 33221 9539 -6597 23390 61302
13826 61302 74847 80543 113578 91725 46846 49042 34129 -11150 36304 49279 69072 87331
$$ packed form
13911A34242n8075m1845L7030L6377K4873l3864p094p0418n5681K361J8389O3651
13899D9946J6268P200J4714j2881J4190J0000K658q930j7272N3848j2249k2060
13887I5432q9482Q623N4585m2067j7795N342P739k8722l5591j2491N2362N6919
13875E4854J1447J5130o9490l394M0312R210J3194k261m0937J2351L2731m924
13863F8223q49l0602K2826J4171j5258L1592M5515q219k3626m544m6233M363L677
13850F1036k1386M924J194L9035M1760N3084j9626l9441m6136P381J8044k2379
13838G7490O2j08372M444Q3957L5188K4582m1745m2385k3682j6136K9987L7912
13826F1302J3545N696L3035k1853m4879K196j4913m5279M7454J2975J9793J8259
$$ plain form
13814 87331 65222 31111 72736 111405 155018 183365 154894 182374 163881 89731 78961 50568
13802 50568 56015 107395 115076 97429 140198 161247 143554 42920 -12806 -17428 11873 9351
13790 9351 15685 44237 67114 69713 101450 94099 100520 104486 77748 79931 103965 77554 64499
13777 64499 61072 129073 169646 93998 56784 23115 15891 50609 63256 44995 63828 74511
13765 74511 76399 126358 91970 60600 77669 77338 87859 118090 113324 129879 117616 75433
13753 75433 25575 16805 29338 32125 25384 38819 136470 142721 106329 189793 166087 148949
13741 148949 130412 129791 103524 31208 34139 45360 72037 105206 93488 99499 27033 32776
13729 32776 75173 74539 76646 86467 99176 68951 59417 124201 141237 145338 111406 139897 105618
$$ packed form
13814H7331k2109l4111M1625L8669M3613K8347k8471K7480j8493p4150j0770k8393
13802E0568N447N1380P681j7647M2769K1049j7693j00634n5726m622K9301k522
13790I351O334K8552K2877K599L1737p351O421L966k6738K183K4034k6411j3055
13777F4499l427O8001M0573p5648l7214l3669p224L4718J2647j8261J8833J0683
13765G4511J888M9959l4388l1370J7069l31J0521L0231m766J6555j2263m2183
13753G5433m9858q770J2533K787o741J3435R7651O251l6392Q3464k3706j7138
13741A48949j8537o21k6267p2316K931J1221K6677L3169j1718O011p2466N743
13729C2776M2397o34K107R821J2709l0225r534O4784J7036M101l3932K8491l4279
$$ plain form
13716 105618 134811 196751 156702 71798 51870 47291 39011 52897 51637 58488 56831 -231
13704 -231 -29757 39745 14307 33317 79395 76422 57828 63330 91669 165679 174330 153522 168891
13691 168891 113429 68490 103184 112660 112527 136338 165396 117403 132698 135594 142515 163558
13679 163558 179077 157486 128166 125190 109825 133898 144176 135006 118314 95824 133104 156588
13667 156588 179522 150086 112683 46900 9616 59303 54795 36776 40810 64924 66186 103528
13655 103528 132413 99644 34060 23614 31780 54086 103892 82722 155749 176739 177461 178175
13643 178175 171713 162095 100266 101988 105934 66529 103417 110208 58537 68073 85080 112938 151496
13630 151496 127284 92707 72624 64632 74588 80088 112651 64596 42809 38716 72553 83871
$$ packed form
13716A05618K9193O1940m0049q4904j9928m579q280J3886j260O851j657n7062
13704b31k9526O9502k5438J9010M6078k973j8594N502K8339P4010Q651k0808J5369
13691A68891n5462m4939L4694R476j33K3811K9058m7993J5295K896O921K1043
13679A63558J5519k1591k9320k976j5365K4073J0278r170j6692k2490L7280K3484
13667A56588K2934k9436l7403o5783l7284M9687m508j8019M034K4114J262L7342
13655A03528K8885l2769o5584j0446Q166K2306M9806k1170P3027K0990P22P14
13643A78175o462r618o1829J722L946l9405L6888O791n1671R536J7007K7858L8558
13630A51496k4212l4577k0083p992R956N500L2563m8055k1787m093L3837J1318
$$ plain form
13618 83871 64868 95286 114509 159928 187731 142327 89592 99383 79146 53463 33723 -12330
13606 -12330 -25644 34040 43849 61642 37060 17247 61058 167613 203820 146010 63901 39993
13594 39993 14553 6014 27489 78946 149679 130827 147482 160552 129199 123464 138286 135290
13582 135290 84949 82184 143760 144188 101360 77272 29531 20194 31993 94497 107601 56953
13570 56953 52456 96246 110248 107466 144978 161556 137039 119723 124907 145717 151423 164325
13558 164325 186287 139591 124120 134563 130931 122088 109428 133187 170041 150607 104713 66509
13546 66509 79976 116986 139154 94711 99559 91947 89435 76339 97090 123512 133751 105861
13534 105861 152711 201860 162072 123326 123973 107009 155612 144445 116729 115987 92508 141060
$$ packed form
13618H3871j9003L0418J9223M5419K7803m5404n2735R791k0237k5683j9740m6053
13606a2330j3314N9684R809J7793k4582j9813M3811J06555L6207n7810q2109k3908
13594C9993k5440q539K1475N1457P0733j8852J6655J3070l1353n735J4822k996
13582A35290n0341k765O1576M28m2828k4088m7741r337J1799O2504J3104n0648
13570E6953m497M3790J4002k782L7512J6578k4517j7316N184K0810N706J2902
13558A64325K1962m6696j5471J0443l632q843j2660K3759L6854j9434m5894l8204
13546F6509J3467L7010K2168m4443M848p612k512j3096K0751K6422J0239k7890
13534A05861M6850M9149l9788l8746O47j6964M8603j1167k7716p42k3479M8552
$$ plain form
13522 141060 186109 209563 242567 217138 186541 208834 219201 202544 208016 230232 180845 133446
13510 133446 164444 213999 251784 214813 120342 128428 125081 121725 131345 179989 199366 139399
13498 139399 126348 122224 115825 118183 157158 175842 161176 150806 132815 90301 89191 161245
13486 161245 152103 94027 70121 70606 56930 62384 58229 56079 120500 194985 177997 174496 193795
13473 193795 185166 157288 171419 212200 248317 263890 240007 218235 225367 212668 207312 185793
13461 185793 181154 135399 143358 150482 97658 141514 127736 109458 123421 137553 114568 87780
13449 87780 125015 180497 177011 178572 188997 213944 223061 230344 225920 216722 181179 223824 224868
13436 224868 154087 137470 169674 122509 65185 66165 139373 183782 163252 104744 134778 190480
$$ packed form
13522A41060M5049K3454L3004k5429l0597K2293J0367j6657N472K2216m9387m7399
13510A33446L0998M9555L7785l6971r4471Q086l347l356R620M8644J9377n9967
13498A39399j3051m124o399K358L8975J8684j4666j0370j7991m2514j110P2054
13486A61245r142n8076k3906M85j3676N454m155k150O4421P4485j6988l501J9299
13473A93795q629k7878J4131M0781L6117J5573k3883k1772P132j2699n356k1519
13461A85793m639m5755P959P124n2824M3856j3778j8278J3963J4132k2985k6788
13449H7780L7235N5482l486J561J0425K4947R117P283m424r198l5543M2645J044
13436B24868p0781j6617L2204m7165n7324R80P3208M4409k0530n8508L0034N5702
$$ plain form
13424 190480 181957 127817 90677 67107 81801 78923 69230 65453 93476 95148 80476 109189
13412 109189 176615 193649 169676 196432 234182 221141 188938 200838 222074 166330 172571 182158
13400 182158 196286 236254 256962 269513 245602 193419 216092 258848 193493 209399 225946
13389 225946 195064 164971 126245 131912 151411 143807 176443 249494 282781 239051 175219 163347
13377 163347 176538 215875 241262 270227 301388 257645 214570 182854 197428 169515 169001 224137
13365 224137 215187 201104 168492 147567 158399 187126 159521 142469 153607 217980 184575 152626
13353 152626 172167 175391 166781 139253 92988 114783 186384 190928 215916 233152 182219 197415
13341 197415 192814 150713 107548 155718 189939 236263 278261 291929 243283 204129 227773 188024
$$ packed form
13424A90480q523n4140l7140k3570J4694k878r693l777K8023J672j4672K8713
13412A09189O7426J7034k3973K6756L7750j3041l2203J1900K1236n5744O241R587
13400A82158J4128L9968K0708J2551k3911n2183K2673M2756o5355J5906J6547
13389B25946l0882l0093l8726N667J9499p604L2636P3051L3287m3730o3832j1872
13377A63347J3191L9337K5387K8965L1161m3743m3075l1716J4574k7913n14N5136
13365B24137q950j4083l2612k0925J0832K8727k7605j7052J1138O4373l3405l1949
13353A52626J9541L224q610k7528m6265K1795P1601M544K4988J7236n0933J5196
13341A97415m601m2101m3165M8170L4221M6324M1998J3668m8646l9154K3644l9749
$$ plain form
13329 188024 122152 55943 86967 195995 240379 207854 202947 273818 286814 259480 228473
13318 228473 271153 313314 275875 258444 182188 134769 125759 149716 174634 185072 227491 285820
13306 285820 267207 238049 237121 228111 234104 220234 207696 209231 206915 196329 168261 176194 203666
13293 203666 225754 251418 292485 326092 309145 212607 223969 194807 184362 246387 232893
13282 232893 214654 220832 253435 235982 232357 243857 270258 316818 338333 269042 204501 158455
13270 158455 154378 214751 216178 184572 198484 197318 199859 158114 169201 162401 203379 179023
13258 179023 192790 207495 167381 204320 229020 258871 255831 228985 220528 234031 228046 179492
13246 179492 176722 225329 279695 273329 252454 252052 268944 250392 262965 292416 278501 314719
$$ packed form
13329A88024o5872o6209L1024J09028M4384l2525m907P0871J2996k7334l1007
13318B28473M2680M2161l7439j7431p6256m7419r010K3957K4918J0438M2419N8329
13306B85820j8613k9158r28r010N993j3870j2538J535k316j0586k8068P933K7472
13293B03666K2088K5664M1067L3607j6947r6538J1362k9162j0445O2025j3494
13282B32893j8239O178L2603j7453l625J1500K6401M6560K1515o9291o4541m6046
13270A58455m077O0373J427l1606J3912j166K541m1745J1087o800M0978k4356
13258A79023J3767J4705m0114L6939K4700K9851l040k6846q457J3503n985m8554
13246A79492k770M8607N4366o366k0875m02J6892j8552J2573K9451j3915L6218
$$ plain form
13234 314719 325653 353848 346580 328810 346802 372571 387663 433714 478250 468741 506618 581768
13222 581768 681073 699805 772079 831874 932422 1027221 1065383 1123906 1108013 1117904 1064671
13211 1064671 1045437 1040320 1000258 921226 826026 777537 804743 784933 707920 668091 608276
13200 608276 567478 536338 454474 440005 480453 489534 434492 460427 540426 609750 599607 559810
13188 559810 598657 521953 478542 504573 495472 477633 462823 440254 409470 396466 383962 336503
13176 336503 310798 324068 298157 297423 265103 292402 317846 324710 352796 331641 296488 290913
13164 290913 333868 358224 348555 331308 321046 325994 380833 381390 318120 272785 236032 276930
13152 276930 275655 240434 264823 332986 366331 343438 302235 261439 229936 226627 220784 225310
$$ packed form
13234C14719J0934K8195p268j7770J7992K5769J5092M6051M4536r509L7877P5150
13222E81768R9305J8732P2274N9795J00548R4799L8162N8523j5893R891n3233
13211A064671j9234n117m0062p9032r5200m8489K7206j9810p7013l9829n9815
13200F08276m0798l1140q1864j4469M0448R081n5042K5935P9999O9324j0143l9797
13188E59810L8847p6704m3411K6031r101j7839j4810k2569l0784j3004j2504m7459
13176C36503k5705J3270k5911p34l2320K7299K5444O864K8086k1155l5153n575
13164B90913M2955K4356r669j7247j0262M948N4839N57o3270m5335l6753M0898
13152B76930j275l5221K4389O8163L3345k2893m1203m0796l1503l309n843M526
$$ plain form
13140 225310 213709 224806 277265 313496 356069 414388 380622 353812 313653 315204 319667 331599
13128 331599 352530 287882 246192 308934 319712 283669 236954 217450 214062 219708 215308 221580
13116 221580 320721 397556 397147 418193 456706 444151 448162 484915 465556 480091 463586 430327
13104 430327 363071 358333 394625 355883 395429 383882 399805 402746 406108 427883 434388 424113
13092 424113 381892 382759 307316 284068 352110 352753 292273 284360 300863 354141 376598 331792
13080 331792 302488 290845 293222 350997 330535 329382 346546 357717 401986 449540 440515 454712
13068 454712 538815 577462 563928 615379 629527 620217 609247 642960 656635 644433 638665 686119
13056 686119 677612 635883 623818 578628 559095 595557 547813 485670 456969 444518 473865 423195
$$ packed form
13140B25310j1601J1097N2459L6231M2573N8319l3766k6810m0159J551M463J1932
13128C31599K0931o4648m1690O2742J0778l6043m6715j9504l388N646m400O272
13116B21580R9141P6835m09K1046L8513j2555M011L6753j9359J4535j6505l3259
13104D30327o7256m738L6292l8742L9546j1547J5923K941L362K1775O505j0275
13092D24113m2221Q67p5443k3248O8042O43o0480p913J6503N3278K2457m4806
13080C31792k9304j1643K377N7775k0462j153J7164J1171M4269M7554r025J4197
13068D54712Q4103L8647j3534N1451J4148r310j0970L3713J3675j2202n768M7454
13056F86119q507m1729j2065m5190j9533L6462m7744o2143k8701j2451K9347n0670
$$ plain form
13044 423195 351260 397754 395208 391822 446496 428122 329190 342347 388162 420828 405209 385134
13032 385134 385863 371215 426785 442675 450190 390755 368177 402835 428799 404839 358145 392321
13020 392321 385540 407038 411888 356694 346838 336674 383806 475701 506916 455144 463676 488911
13008 488911 547837 635107 659022 657245 733055 853181 942492 981950 1021181 1037505 1031686 1042602
12996 1042602 969130 931589 864725 835802 778968 783818 795027 801458 822177 747274 625373
12985 625373 555993 570222 613321 643992 666476 648916 593336 615355 626651 616457 584618
12974 584618 461661 447334 476143 499419 481676 481544 500143 492080 530254 604146 631722 573332
12962 573332 551483 566418 512505 563175 645746 648218 613348 591140 624009 683826 661347 626390
$$ packed form
13044D23195p1935M6494k546l386N4674j8374r8932J3157M5815L2666j5619k0075
13032C85134P29j4648N5570J5890P515n9435k2578L4658K5964k3960m6694L4176
13020C92321o781K1498M850n5194r856j0164M7132R1895L1215n1772Q532K5235
13008D88911N8926Q7270K3915j777P5810J20126Q9311L9458L9231J6324n819J0916
12996A042602p3472l7541o6864k8923n6834M850J1209O431K0719p4903j21901
12985F25373o9380J4229M3099L0671K2484j7560n5580K2019J1296j0194l1839
12974E84618j22957j4327K8809K3276j7743j32J8599q063L8174P3892K7576n8390
12962E73332k1849J4935n3913N0670Q2571K472l4870k2208L2869N9817k2479l4957
$$ plain form
12950 626390 586317 563951 620988 588944 559327 597714 656628 676339 758242 838691 937908
12939 937908 889996 887442 905297 915713 902130 891955 823513 746835 750574 780503 757373 713380
12927 713380 671596 654459 687175 722229 705205 663151 583514 553735 589870 611151 609369 652664
12915 652664 673139 707615 724057 695554 721746 710532 699672 688492 745850 774918 804904
12904 804904 823946 844465 842173 926358 997965 1019724 1044208 1092777 1162163 1232135 1321497 1363461
12892 1363461 1391858 1435956 1429503 1384464 1427326 1514098 1538154 1600226 1669166 1697621 1762375
12881 1762375 1800709 1807428 1808409 1852655 1902185 1940852 1945402 2017515 2092340 2108296 2122277 2100236
12869 2100236 2142438 2184247 2270343 2327672 2366094 2349665 2365121 2391568 2512674 2560691 2524596
$$ packed form
12950F26390m0073k2366N7037l2044k9617L8387N8914J9711Q1903Q0449R9217
12939I37908m7912k554J7855J0416j3583j0175o8442p6678L739K9929k3130m3993
12927G13380m1784j7137L2716L5054j7024m2054p9637k9779L6135K1281j782M3295
12915F52664K0475L4476J6442k8503K6192j1214j0860j1180N7358K9068K9986
12904H04904J9042K0519k292Q4185P1607K1759K4484M8569O9386O9972Q9362M1964
12892A363461K8397M4098o453m5039M2862Q6772K4056O2072O8940K8455O4754
12881A762375L8334O719R81M4246M9530L8667M550P2113P4825J5956J3981k2041
12869B100236M2202M1809Q6096N7329L8422j6429J5456K6447J21106M8017l6095
$$ plain form
12858 2524596 2553948 2630075 2720148 2756262 2778252 2844373 2977413 3079112 3156023 3202556 3237605
12847 3237605 3378614 3501972 3682616 3832936 4003365 4144269 4314669 4531304 4766384
12838 4766384 5021631 5302647 5638753 5960379 6370438 6887809 7475599 8102516 8751424
12829 8751424 9392259 10111366 10803652 11662830 12642085 13812229 15173220 16804950 18760051
12820 18760051 21057777 23994149 27690765 32338275 38178944 45549211 54900065 66684294
12812 66684294 81036382 98147322 117694046 138718360 159533689 177708405 191135499
12805 191135499 198681641 199855487 194632766 183642115 168515693 151456452 134498926
12798 134498926 118947153 105426852 94125462 84795455 77270232 71161746 66106557
$$ packed form
12858B524596K9352P6127R0073L6114K1990O6121J33040J01699P6911M6533L5049
12847C237605J41009J23358J80644J50320J70429J40904J70400K16635K35080
12838D766384K55247K81016L36106L21626M10059N17371N87790O26917O48908
12829H751424O40835P19107O92286Q59178R79255J170144J360991J631730J955101
12820A8760051K297726K936372L696616M647510N840669P370267R350854J1784229
12812F6684294J4352088J7110940J9546724K1024314K0815329J8174716J3427094
12805A91135499P546142J173846n222721j0990651j5126422j7059241j6957526
12798A34498926j5551773j3520301j1301390r330007p525223o108486n055189
$$ plain form
12791 66106557 61921882 58416333 55443886 52902896 50764305 48872533 47230990 45774997
12783 45774997 44535503 43436570 42425095 41527218 40710848 39992925 39318319 38635908 37987586
12774 37987586 37308812 36607548 35881588 35042493 34099819 33186957 32253044 31243573 30141321
12765 30141321 28966415 27810962 26664825 25574063 24415159 23253973 22119804 21071639
12757 21071639 20084585 19150360 18302230 17490292 16648681 15834591 15070039 14337749 13770311
12748 13770311 13182123 12579060 12048207 11495655 10900760 10374762 9966796 9595396 9204415
12739 9204415 8829004 8376766 8034937 7741133 7443365 7151327 6837748 6593944 6289905
12730 6289905 6019607 5804914 5573717 5359394 5260325 5044182 4811613 4652590 4478894 4341431
$$ packed form
12791F6106557m184675l505549k972447k540990k138591j891772j641543j455993
12783D5774997j239494j098933j011475q97877q16370p17923o74606o82411o48322
12774C7987586o78774p01264p25960q39095r42674r12862r33913j009471j102252
12765C0141321j174906j155453j146137j090762j158904j161186j134169j048165
12757B1071639r87054r34225q48130q11938q41611q14090p64552p32290n67438
12748A3770311n88188o03063n30853n52552n94895n25998m07966l71400l90981
12739I204415l75411m52238l41829k93804k97768k92038l13579k43804l04039
12730F289905k70298k14693k31197k14323r9069k16143k32569j59023j73696j37463
$$ plain form
12720 4341431 4177617 4065669 3908438 3792799 3731084 3663975 3576314 3412372 3220038 3186154
12710 3186154 3154482 3050932 2927618 2799976 2718412 2652786 2596753 2588675 2566425 2491649 2361199
12699 2361199 2277329 2224919 2182846 2140137 2156853 2123765 2106039 2155050 2192607 2156003 2138845
12688 2138845 2097829 2063172 2052187 2117736 2223669 2261424 2183553 2064600 2011631 1981971 1984370
12677 1984370 2013442 1958491 1857071 1793896 1720324 1619130 1565181 1520258 1423492 1340915 1307791
12666 1307791 1275017 1226039 1214094 1225019 1253524 1252832 1218799 1162472 1141708 1133241 1051492 1059606
12654 1059606 1127340 1193957 1204761 1192927 1215058 1180232 1152001 1193294 1256427 1251525 1256648 1329204
12642 1329204 1342217 1309973 1326577 1434248 1484336 1459269 1440065 1428011 1448772 1494897 1517296
$$ packed form
12720D341431j63814j11948j57231j15639o1715o7109q7661j63942j92334l3884
12710C186154l1672j03550j23314j27642q1564o5626n6033q078k2250p4776j30450
12699B361199q3870n2410m2073m2709J6716l3088j7726M9011L7557l6604j7158
12688B138845m1016l4657j0985O5549J05933L7755p7871j18953n2969k9660K399
12677A984370K9072n4951j01420o3175p3572j01194n3949m4923r6766q2577l3124
12666A307791l2774m8978j1945J0925K8505o92l4033n6327k0764q467q1749Q114
12654A059606O7734O6617J0804j1834K2131l4826k8231M1293O3133m902N123P2556
12642A329204J3013l2244J6604J07671N0088k5067j9204j2054K0761M6125K2399
$$ plain form
12631 1517296 1546024 1561296 1560184 1581209 1577137 1533617 1511655 1462939 1481891 1461115 1470652 1496390
12619 1496390 1546702 1535380 1493076 1498638 1489075 1520802 1592531 1643514 1635868 1639122 1604899 1615229
12607 1615229 1591859 1588333 1592456 1546155 1484713 1510183 1580569 1601402 1603807 1560896 1541974 1507726
12595 1507726 1423539 1425205 1407312 1411860 1477365 1488342 1416270 1387796 1389362 1354166 1352776 1338751
12583 1338751 1329157 1280055 1286027 1302635 1309840 1265937 1235104 1290461 1328753 1287280 1281997 1283725
12571 1283725 1306576 1270031 1263703 1268999 1246594 1191523 1195994 1212325 1189504 1170402 1184055 1159575
12559 1159575 1106736 1132492 1203498 1213820 1185378 1158106 1158958 1216204 1202612 1246240 1262079 1246172
12547 1246172 1276825 1247088 1215970 1188132 1158800 1082841 1099161 1109425 1045700 1010036 1009962 1054464
$$ packed form
12631A517296K8728J5272j112K1025m072m3520k1962m8716J8952k0776R537K5738
12619A496390N0312j1322m2304N562r563L1727P1729N0983p646L254l4223J0330
12607A615229k3370l526M123m6301o1442K5470P0386K0833K405m2911j8922l4248
12595A507726q4187J666j7893M548O5505J0977p2072k8474J566l5196j390j4025
12583A338751r594m9102N972J6608P205m3903l0833N5357L8292m1473n283J728
12571A283725K2851l6545o328N296k2405n5071M471J6331k2821j9102J3653k4480
12559A159575n2839K5756P1006J0322k8442k7272Q52N7246j3592M3628J5839j5907
12547A246172L0653k9737l1118k7838k9332p5959J6320J0264o3725l5664p4M4502
$$ plain form
12535 1054464 1080128 1109280 1095033 1080238 1121175 1119830 1093858 1076273 1036461 1009433 999356
12524 999356 1013884 1010767 1015137 1009695 1019030 1000953 967421 942539 997821 1005514 997521 1013569 1073260
12511 1073260 1089161 1057102 1023558 999057 996380 987714 1032177 1097018 1026943 974569 973239 988541
12499 988541 998079 1050819 1097303 1152170 1121023 1165555 1147682 1108777 1079663 1087976 1137863 1204832
12487 1204832 1153523 1107776 1073828 1009643 1008780 1061770 1113784 1195629 1195563 1155270 1183795 1167889
12475 1167889 1147216 1174062 1158373 1111604 1135717 1122660 1076259 1100410 1136978 1163646 1166078
12464 1166078 1174242 1184837 1177394 1189799 1210166 1211407 1208048 1258061 1250565 1164413 1091818 1093963
12452 1093963 1092612 1067013 1107929 1151790 1169127 1224366 1245430 1223936 1250109 1197533 1201112 1228226
$$ packed form
12535A054464K5664K9152j4247j4795M0937j345k5972j7585l9812k7028j0077
12524I99356J4528l117M370n442R335j8077l3532k4882N5282P693p993J6048N9691
12511A073260J5901l2059l3544k4501k677q666M4463O4841p0075n2374j330J5302
12499I88541R538N2740M6484N4867l1147M4532j7873l8905k9114Q313M9887O6969
12487A204832n1309m5747l3948o4185q63N2990N2014Q1845o6m0293K8525j5906
12475A167889k0673K6846j5689m6769K4113j3057m6401K4151L6568K6668K432
12464A166078Q164J0595p443J2405K0367J241l359N0013p496q6152p2595K145
12452A093963j351k5599M0916M3861J7337N5239K1064k1494K6173n2576L579K7114
$$ plain form
12440 1228226 1247974 1200896 1191030 1180863 1212189 1137021 1106205 1142567 1172838 1185558 1210337
12429 1210337 1243823 1220088 1195234 1167188 1243781 1282641 1325249 1402176 1477459 1540544 1650393
12418 1650393 1798113 1988573 2166377 2370655 2653668 2836179 2839448 2656797 2364424 2119426
12408 2119426 1988129 1968693 1925094 1844621 1828519 1811835 1751182 1767526 1793163 1786484 1776836
12397 1776836 1786332 1864083 1941155 2032181 2183594 2265199 2320769 2318532 2327698 2342927 2257945 2123055
12385 2123055 2024706 1991347 1978623 1942931 1909226 1904593 1825447 1788129 1762306 1773549 1765258 1715137
12373 1715137 1640411 1594300 1624198 1622109 1608841 1597433 1604156 1650549 1640453 1592401 1531909 1509048
12361 1509048 1518574 1442634 1417963 1464753 1472611 1403702 1387697 1457796 1493494 1454056 1416045 1440445
$$ packed form
12440A228226J9748m7078r866j0167L1326p5168l0816L6362L0271J2720K4779
12429A210337L3486k3735k4854k8046P6593L8860M2608P6927P5283O3085J09849
12418A650393J47720J90460J77804K04278K83013J82511L269j82651k92373k44998
12408B119426j31297j9436m3599q0473j6102j6684o0653J6344K5637o679r648
12397A776836R496P7751P7072R1026J51413Q1605N5570k237R166J5229q4982j34890
12385B123055r8349l3359j2724l5692l3705m633p9146l7318k5823J1243q291n0121
12373A715137p4726m6111K9898k089j3268j1408O723M6393j0096m8052o0492k2861
12361A509048R526p5940k4671M6790P858o8909j6005P0099L5698l9438l8011K4400
$$ plain form
12349 1440445 1422791 1366035 1330125 1332342 1320965 1322621 1323143 1313453 1315079 1311684 1365303 1360671 1349319
12336 1349319 1353666 1357589 1363344 1317811 1284159 1259904 1262497 1296142 1347840 1333255 1329535 1389010
12324 1389010 1371286 1355605 1376496 1372065 1387632 1381679 1352788 1377960 1399567 1401847 1353886 1315969
12312 1315969 1270173 1253411 1311382 1308835 1271249 1207028 1199577 1275281 1284847 1246500 1336225 1374541
12300 1374541 1359160 1385194 1421891 1421751 1389911 1364769 1331076 1324141 1321824 1311264 1275468 1247775
12288 1247775 1211959 1241881 1278797 1316157 1366928 1384525 1345147 1342520 1321429 1344752 1400813
12277 1400813 1433619 1420985 1378793 1339322 1375946 1368017 1338345 1308656 1265483 1263605 1318623 1339176
12265 1339176 1361095 1407673 1395664 1351318 1337518 1337638 1329601 1339598 1368579 1391240 1385173 1355071
$$ packed form
12349A440445j7654n6756l5910K217j1377J656N22r690J626l395N3619m632j1352
12336A349319M347L923N755m5533l3652k4255K593L3645N1698j4585l720N9475
12324A389010j7724j5681K0891m431J5567n953k8891K5172K1607K280m7961l7917
12312A315969m5796j6762N7971k547l7586o4221p451P5704R566l8347Q9725L8316
12300A374541j5381K6034L6697j40l1840k5142l3693o935k317j0560l5796k7693
12288A247775l5816K9922L6916L7360N0771J7597l9378k627k1091K3323N6061
12277A400813L2806j2634m2192l9471L6624p929k9672k9689m3173j878N5018K0553
12265A339176K1919M6578j2009m4346j3800J20q037R997K8981K2661o067l0102
$$ plain form
12253 1355071 1367599 1412203 1426495 1374386 1360778 1354914 1382618 1421237 1427282 1403049 1427592 1466190
12241 1466190 1459631 1423035 1410354 1391401 1430936 1436054 1428129 1468113 1434904 1427454 1450764 1454733
12229 1454733 1502146 1511405 1453201 1428765 1422084 1379465 1356552 1378398 1398073 1411787 1412147 1412131 1480658
12216 1480658 1492280 1449408 1418813 1427537 1422841 1401972 1424769 1447061 1381948 1393720 1396831 1449705
12204 1449705 1505201 1532808 1577902 1526805 1529318 1533435 1557701 1577902 1605096 1610366 1559812 1566518
12192 1566518 1504666 1448915 1403122 1447043 1476225 1441922 1443808 1471179 1424767 1425610 1458953 1455333
12180 1455333 1512889 1526501 1496968 1482609 1491535 1467872 1507466 1536104 1508691 1528727 1488076
12169 1488076 1458412 1486853 1466101 1484404 1541592 1570128 1517988 1496613 1515777 1535621 1509579
$$ packed form
12253A355071J2528M4604J4292n2109j3608n864K7704L8619O045k4233K4543L8598
12241A466190o559l6596j2681j8953L9535N118p925L9984l3209p450K3310L969
12229A454733M7413R259n8204k4436o681m2619k2913K1846J9675J3714L60j6O8527
12216A480658J1622m2872l0595Q724m696k0869K2797K2292o5113J1772L111N2874
12204A449705N5496K7607M5094n1097K513M117K4266K0201K7194N270n0554O706
12192A566518o1852n5751m5793M3921K9182l4303J886K7371m6412Q43L3343l620
12180A455333N7556J3612k9533j4359Q926k3663L9594K8638k7413K0036m0651
12169A488076k9664K8441k0752J8303N7188K8536n2140k1375J9164J9844k6042
$$ plain form
12158 1509579 1435951 1455413 1480359 1553477 1564320 1522077 1517883 1524049 1558927 1579626 1586389 1566747
12146 1566747 1530602 1530398 1562728 1543091 1512114 1508231 1484016 1512113 1487484 1547267 1566430 1573152
12134 1573152 1602255 1580996 1575750 1559154 1523409 1588975 1674428 1696526 1678245 1660875 1606010
12123 1606010 1582827 1635845 1588646 1539073 1513229 1513056 1602710 1593169 1586083 1569019 1559751 1587246
12111 1587246 1571468 1543021 1542848 1542092 1525208 1507116 1488234 1565770 1606679 1577378 1577653 1561534
12099 1561534 1618667 1628525 1591254 1556387 1532083 1511384 1510959 1545767 1538018 1586579 1574357 1597458
12087 1597458 1607884 1634048 1634096 1590269 1609642 1644450 1662219 1675147 1655716 1641780 1641639 1601485
12075 1601485 1557012 1618525 1683670 1761233 1798366 1761536 1686912 1689228 1647920 1641629 1618013 1613028
$$ packed form
12158A509579p3628J9462K4946P3118J0843m2243m194O166L4878K0699O763j9642
12146A566747l6145k04L2330j9637l0977l883k4215K8097k4629N9783J9163O722
12134A573152K9103k1259n246j6596l5745O5566Q5453K2098j8281j7370n4865
12123A606010k3183N3018m7199m9573k5844j73Q9654r541p086j7064r268K7495
12111A587246j5778k8447j73p56j6884j8092j8882P7536M0909k9301K75j6119
12099A561534N7133R858l7271l4867k4304k0699m25L4808p749M8561j2222K3101
12087A597458J0426K6164M8m3827J9373L4808J7769J2928j9431j3936j41m0154
12075A601485m4473O1513O5145P7563L7133l6830p4624K316m1308o291k3616m985
$$ plain form
12063 1613028 1661899 1632448 1599409 1553612 1534851 1510027 1510195 1516751 1566490 1570788 1606272 1625204
12051 1625204 1634210 1657720 1693903 1737737 1682697 1639610 1660962 1675746 1693086 1707911 1729288
12040 1729288 1745605 1729920 1731571 1721419 1678140 1652453 1645069 1629613 1674627 1662363 1656602 1678727
12028 1678727 1727569 1711760 1681020 1698986 1724820 1668937 1651980 1626464 1637063 1606988 1585043
12017 1585043 1639720 1677955 1622359 1586584 1620706 1576776 1591927 1601830 1614704 1598907 1601711 1571806
12005 1571806 1543712 1522569 1566502 1574297 1636627 1688833 1712046 1655115 1628304 1619494 1644864 1663393
11993 1663393 1603604 1553415 1568825 1586927 1567478 1561650 1642787 1627629 1646811 1681447 1658790
11982 1658790 1659102 1666277 1672843 1607748 1635347 1663751 1632134 1586645 1626546 1650123 1599591 1591966
$$ packed form
12063A613028M8871k9451l3039m5797j8761k4824J68O556M9739M298L5484J8932
12051A625204R006K3510L6183M3834n5040m3087K1352J4784J7340J4825K1377
12040A729288J6317j5685J651j0152m3279k5687p384j5456M5014j2264n761K2125
12028A678727M8842j5809l0740J7966K5834n5883j6957k5516J0599l0075k1945
12017A585043N4677L8235n5596l5775L4122m3930J5151R903J2874j5797K804k9905
12005A571806k8094k1143M3933P795O2330N2206K3213n6931k6811q810K5370J8529
11993A663393n9789n0189J5410J8102j9449n828Q1137j5158J9182L4636k2657
11982A658790L12P175O566o5095K7599K8404l1617m5489L9901K3577n0532p625
$$ plain form
11970 1591966 1654510 1684003 1591359 1514543 1547062 1590903 1569263 1526801 1498913 1543133 1576044
11959 1576044 1552646 1547177 1571944 1555125 1529929 1522237 1535050 1480806 1440584 1487611 1518823 1539705
11947 1539705 1525686 1489840 1514369 1509557 1555773 1576024 1660648 1649384 1595631 1597455 1556789 1533603
11935 1533603 1559485 1662323 1669781 1622971 1536878 1545014 1591350 1546072 1603614 1645290 1651833 1612813
11923 1612813 1596776 1587186 1551288 1487558 1498542 1512734 1503068 1505551 1494482 1565019 1620283 1635395
11911 1635395 1584763 1543266 1571576 1625461 1647854 1641851 1598915 1579569 1563371 1525291 1466913
11900 1466913 1465302 1492197 1478136 1414012 1415052 1478733 1490511 1506949 1526236 1524287 1497985 1494385
11888 1494385 1470539 1509516 1571204 1575600 1584545 1581861 1544879 1525410 1529289 1510492 1496375 1424811
$$ packed form
11970A591966O2544K9493r2644p6816L2519M3841k1640m2462k7888M4220L2911
11959A576044k3398n469K4767j6819k5196p692J2813n4244m0222M7027L1212K0882
11947A539705j4019l5846K4529m812M6216K0251Q4624j1264n3753J824m0666k3186
11935A533603K5882J02838P458m6810q6093Q136M6336m5278N7542M1676O543l9020
11923A612813j6037r590l5898o3730J0984J4192r666K483j1069P0537N5264J5112
11911A635395n0632m1497K8310N3885K2393o003m2936j9346j6198l8080n8378
11900A466913j611K6895j4061o4124J040O3681J1778J6438J9287j949k6302l600
11888A494385k3846L8977O1688M396Q945k684l6982j9469L879j8797j4117p1564
$$ plain form
11876 1424811 1414735 1502216 1523566 1530818 1548456 1519988 1507951 1506674 1533377 1539865 1554525 1606483
11864 1606483 1658377 1608573 1483054 1450151 1476718 1459796 1438288 1465968 1445132 1435829 1468531
11853 1468531 1472434 1465021 1437069 1421160 1389758 1375609 1394713 1419058 1344971 1353049 1353503 1351758
11841 1351758 1339492 1410765 1432003 1469712 1425444 1379654 1411397 1444661 1437737 1390134 1416805
11830 1416805 1436222 1342757 1316984 1297446 1283898 1300046 1314504 1315608 1281411 1335765 1385054
11819 1385054 1422464 1436966 1444898 1450132 1410035 1405396 1405420 1405266 1343704 1325344 1359417 1340115 1299799
11806 1299799 1349902 1441595 1460320 1438079 1380311 1356097 1326664 1378954 1432115 1415808 1440167
11795 1440167 1403930 1399493 1372734 1307659 1268279 1243012 1301157 1351974 1326671 1265896 1253078
$$ packed form
11876A424811j0076Q7481K1350P252J7638k8468j2037j277K6703O488J4660N1958
11864A606483N1894m9804j25519l2903K6567j6922k1508K7680k0836r303L2702
11853A468531L903p413k7952j5909l1402j4149J9104K4345p4087Q078M54j745
11841A351758j2266P1273K1238L7709m4268m5790L1743L3264o924m7603K6671
11830A416805J9417r3465k5773j9538j3548J6148J4458J104l4197N4354M9289
11819A385054L7410J4502P932N234m0097m639K4j54o1562j8360L4073j9302m0316
11806A299799N0103R1693J8725k2241n7768k4214k9433N2290N3161j6307K4359
11795A440167l6237m437k6759o5075l9380k5267N8145N0817k5303o0775j2818
$$ plain form
11784 1253078 1291255 1309286 1282988 1204342 1182001 1216212 1278581 1259990 1190623 1184915 1243448
11773 1243448 1251140 1261816 1249283 1222534 1236936 1230896 1289645 1274841 1204059 1208481 1224818 1232133
11761 1232133 1184456 1146447 1176832 1221876 1229060 1207135 1190119 1182498 1196421 1294154 1293464 1234402
11749 1234402 1225483 1240596 1199260 1192939 1199689 1151268 1197880 1250662 1215981 1158930 1171079 1194874
11737 1194874 1211962 1231176 1240179 1211674 1208941 1195143 1151400 1178786 1131560 1098645 1096782 1156745
11725 1156745 1212899 1165341 1135052 1131620 1156592 1185829 1244812 1273609 1209884 1148091 1132042
11714 1132042 1139566 1163894 1197897 1191294 1148921 1150819 1101136 1073318 1065482 1073875 1109128 1146473
11702 1146473 1127179 1088664 1010691 1053152 1074712 1077558 1113137 1136668 1150435 1101527 1041892
$$ packed form
11784A253078L8177J8031k6298p8646k2341L4211O2369j8591o9367n708N8533
11773A243448P692J0676j2533k6749J4402o040N8749j4804p0782M422J6337P315
11761A232133m7677l8009L0385M5044P184k1925j7016p621J3923R7733o90n9062
11749A234402q919J5113m1336o321O750m8421M6612N2782l4681n7051J2149K3795
11737A194874J7088J9214R003k8505k733j3798m3743K7386m7226l2915j863N9963
11725A156745N6154m7558l0289l432K4972K9237N8983K8797o3725o1793j6049
11714A132042P524K4328L4003o603m2373J898m9683k7818p836Q393L5253L7345
11702A146473j9294l8515p7973M2461K1560K846L5579K3531J3767m8908n9635
$$ plain form
11691 1041892 1062975 1063613 1069935 1073267 1147466 1142095 1065344 995340 1011682 1044509 1091148 1087142
11679 1087142 1062428 1125333 1156775 1109480 1088522 1084646 1035381 1053610 1075040 1088247 1081450 1048548
11667 1048548 1019815 1018943 1070075 1104081 1118149 1114682 1073578 1110524 1133913 1111767 1061427 1032115
11655 1032115 1014441 975056 1004492 1019063 1008064 1002693 1012150 1064257 1087799 1104116 1069137 1028111
11643 1028111 1004775 982631 968447 973502 1035343 1053055 1019671 1018004 1020547 969303 892274 915363
11631 915363 916582 928784 984184 1027735 1010559 1006654 978642 976116 1020047 1014193 990067 934012
11619 934012 891893 869697 875706 910322 963269 990331 978208 980635 981422 960930 955229 956293 939893
11606 939893 938652 887158 839979 950206 977747 942056 919185 917586 905999 937076 923789 886989
$$ packed form
11691A041892K1083O38O322L332P4199n371p6751p0004J6342L2827M6639m006
11679A087142k4714O2905L1442m7295k0958l876m9265J8229K1430J3207o797l2902
11667A048548k8733q72N1132L4006J4068l467m1104L6946K3389k2146n0340k9312
11655A032115j7674l9385K9436J4571j0999n371R457N2107K3542J6317l4979m1026
11643A028111k3336k2144j4184N055O1841J7712l3384j667K543n1244p7029K3089
11631I15363J219J2202N5400M3551j7176l905k8012k526M3931n854k4126n6055
11619I34012m2119k2196O009L4616N2947K7062j2123K427P87k0492n701J064j6400
11606I39893j241n1494m7179J10227K7541l5691k2871j599j1587L1077j3287l6800
$$ plain form
11594 886989 912627 869477 818211 820255 876841 866259 848215 827584 865269 860686 881218 903487
11582 903487 890944 874346 896823 888129 924552 966971 963794 928489 934042 922516 896968 918961
11570 918961 909359 916496 915036 949175 893927 831054 821220 863799 897580 924215 948837 878350
11558 878350 852309 868691 880764 880947 835608 742365 772907 830341 862827 857971 833183 848389
11546 848389 859672 873874 910561 925414 927635 887069 862831 832040 792132 823225 876049 874594
11534 874594 908346 944667 915277 857435 841643 897663 882618 858265 860700 822372 841257 868681
11522 868681 850226 842487 859659 835719 854439 891394 867220 836975 844508 789469 724954 714932
11510 714932 697786 752288 765742 795693 806238 793633 741655 743232 791141 790880 741815 729225
$$ packed form
11594H86989K5638m3150n1266K044N6586j0582j8044k0631L7685m583K0532K2269
11582I03487j2543j6598K2477q694L6423M2419l177l5305N553j1526k5548K1993
11570I18961r602P137j460L4139n5248o2873r834M2579L3781K6635K4622p0487
11558H78350k6041J6382J2073J83m5339r3243L0542N7434L2486m856k4788J5206
11546H48389J1283J4202L6687J4853K221m0566k4238l0791l9908L1093N2824j455
11534H74594L3752L6321k9390n7842j5792N6020j5045k4353K435l8328J8885K7424
11522H68681j8455p739J7172k3940J8720L6955k4174l0245P533n5039o4515j0022
11510G14932j7146N4502J3454K9951J0545j2605n1978J577M7909k61m9065j2590
$$ plain form
11498 729225 799959 791909 756489 786058 772037 729824 720071 727046 752978 699793 685295 702866
11486 702866 707750 663445 652796 649399 673685 695550 743553 717811 702424 709025 732879 699627
11474 699627 678831 690224 685460 678119 695434 691041 661291 675424 678360 699783 663335 708419
11462 708419 720777 667831 611770 533993 504384 509815 553026 665103 683990 607378 566119
11451 566119 592603 595369 666042 704938 612196 545544 534965 570728 502151 476386 548083 618305
11439 618305 615245 598413 646254 663554 623421 635439 614232 614986 647687 671429 662001 683310
11427 683310 675392 685184 703387 657539 615557 622813 626432 574498 565959 540159 590928 670806
11415 670806 709935 711314 650763 583268 581127 605542 659917 676974 685888 710819 656413 577851
$$ packed form
11498G29225P0734q050l5420K9569j4021m2213r753O975K5932n3185j4498J7571
11486G02866M884m4305j0649l397K4286K1865M8003k5742j5387O601K3854l3252
11474F99627k0796J1393m764p341J7315m393k9750J4133K936K1423l6448M5084
11462G08419J2358n2946n6061p7777k9609N431M3211J12077J8887p6612m1259
11451E66119K6484K766P0673L8896r2742o6652j0579L5763o8577k5765P1697P0222
11439F18305l060j6832M7841J7300m0133J2018k1207P54L2701K3742r428K1309
11427F83310p918R792J8203m5848m1982P256L619n1934q539k5800N0769P9878
11415F70806L9129J379o0551o7495k141K4415N4375J7057Q914K4931n4406p8562
$$ plain form
11403 577851 544828 557350 561773 549891 537689 573805 631454 650846 649382 623814 637420 665328
11391 665328 625182 565925 573032 582492 580438 606631 568578 545469 544073 499648 559468 608599
11379 608599 552897 525914 520130 512419 515717 515676 558298 587715 586542 552848 570900 572857 598318
11366 598318 592837 539822 522693 535687 516880 503530 502739 499135 475793 495503 516530 541032
11354 541032 523196 532798 479804 526793 544493 510690 534626 573909 587346 604497 532182 421475
11342 421475 463129 507143 509926 570688 601620 578392 578416 583315 592932 570261 540916 504698 434910
11329 434910 445267 492043 506100 530487 510707 478240 511173 546621 497371 377417 376818 446403
11317 446403 453428 439568 455078 493543 546411 530727 490460 523280 523984 460389 453370 530595
$$ packed form
11403E77851l3023J2522M423j1882j2202L6116N7649J9392j464k5568J3606K7908
11391F65328m0146n9257P107R460k054K6193l8053k3109j396m4425N9820M9131
11379F08599n5702k6983n784p711L298m1M2622K9417j173l3694J8052J957K5461
11366E98318n481n3015j7129J2994j8807j3350p91l604k3342J9710K1027K4502
11354E41032j7836R602n2994M6989J7700l3803K3936L9283J3437J7151p2315j10707
11342D21475M1654M4014K783O0762L0932k3228K4M899R617k2671k9345l6218o9788
11329D34910J0357M6776J4057K4387j9780l2467L2933L5448m9250j19954n99O9585
11317D46403P025j3860J5510L8465N2868j5684m0267L2820P04o3595p019P7225
$$ plain form
11305 530595 603883 630900 639608 623866 576098 509899 466204 452695 438820 446588 451084 463399
11293 463399 473876 524594 522420 536793 481081 454986 472559 470289 432805 402961 400988 338128
11281 338128 320990 361173 375180 421944 403980 431559 479521 446177 431471 418147 398037
11270 398037 401211 465332 506103 443532 381589 375980 378484 367620 362385 365735 362818 363796 407032
11257 407032 365059 349342 318330 416771 465104 475587 503944 480496 404998 350289 303376
11246 303376 302100 358778 412894 440152 437597 401309 397102 395640 398092 405610 405722 413159 393632
11233 393632 393700 416461 392897 344518 387489 451193 478899 503368 524803 527959 512943 469601
11221 469601 449412 459758 468061 453311 437820 418205 460083 436029 420120 413312 388041 389266
$$ packed form
11305E30595P3288K7017Q708j5742m7768o6199m3695j3509j3875P768M496J2315
11293D63399J0477N0718k174J4373n5712k6095J7573k270l7484k9844j973o2860
11281C38128j7138M0183J4007M6764j7964K7579M7962l3344j4706j3324k0110
11270C98037L174O4121M0771o2571o1943n609K504j0864n235L350k917R78M3236
11257D07032m1973j5717l1012R8441M8333J0483K8357k3448p5498n4709m6913
11246C03376j276N6678N4116K7258k555l6288m207j462K452P518J12P437j9527
11233C93632O8K2761k3564m8379M2971O3704K7706K4469K1435L156j5016m3342
11221D69601k0189J0346Q303j4750j5491j9615M1878k4054j5909o808k5271J225
$$ plain form
11209 389266 406432 344618 236991 198571 209187 339783 440385 416336 348265 404848 449077
11198 449077 441781 467646 489480 453296 396070 375955 303661 226223 214797 270305 300955 327873
11186 327873 319147 324359 325625 316651 296445 349594 376816 354209 306290 252072 279886 377518
11174 377518 383238 318862 363491 382082 348425 292229 298499 326787 405595 424765 455637 386792
11162 386792 317722 347645 423882 445112 439284 414277 394052 358059 276235 288170 331653 356921
11150 356921 405236 369295 292481 270440 265714 301135 357001 369958 337710 340253 367707 358457
11138 358457 377480 421524 435778 366386 345170 305924 259041 210783 184935 253521 311332
11127 311332 339778 345319 371031 390024 356264 345580 331576 336051 290470 250585 258071 272990
$$ packed form
11209C89266J7166o1814j07627l8420J0616J30596J00602k4049o8071N6583M4229
11198D49077p296K5865K1834l6184n7226k0115p2294p7438j1426N5508L0650K6918
11186C27873q726N212J266q974k0206N3149K7222k2607m7919n4218K7814R7632
11174C77518N720o4376M4629J8591l3657n6196O270K8288P8808J9170L0872o8845
11162C86792o9070K9923P6237K1230n828k5007k0225l5993q1824J1935M3483K5268
11150C56921M8315l5941p6814k2041m726L5421N5866J2957l2248K543K7454r250
11138C58457J9023M4044J4254o9392k1216l9246m6883m8258k5848O8586N7811
11127C11332K8446N541K5712J8993l3760j0684j4004M475m5581l9885P486J4919
$$ plain form
11115 272990 279296 241444 256796 284716 265137 267735 254785 242213 212070 242935 300860 311896
11103 311896 309976 265627 265060 362327 355103 338387 372642 374236 338938 375907 357928 351686 316179
11090 316179 336773 365154 294827 285044 315159 356894 369375 330664 270493 274256 319721 345559
11078 345559 362065 395767 378579 327026 285056 292863 311146 298724 217810 186275 226196 238672
11066 238672 204341 238047 243534 236454 248009 239356 273170 273341 301023 337813 318144 293303
11054 293303 297210 268644 252959 253593 309788 328631 356443 340459 280297 272799 364619 387875
11042 387875 444938 423389 411487 464313 467317 460858 461720 454637 545865 603099 593209 565405 528718
11029 528718 517729 467562 446976 475862 535894 545768 602946 618022 552553 570170 591989 558912
$$ packed form
11115B72990O306l7852J5352K7920j9579K598j2950j2572l0143L0865N7925J1036
11103C11896j920m4349n67R7267p224j6716L4255J594l5298L6969j7979o242l5507
11090C16179K0594K8381p0327r783L0115M1735J2481l8711o0171L763M5465K5838
11078C45559J6506L3702j7188n1553m1970P807J8283j2422q0914l1535L9921J2476
11066B38672l4331L3706N487p080J1555q653L3814J71K7682L6790j9669k4841
11054B93303L907k8566j5685O34N6195J8843K7812j5984o0162p498R1820K3256
11042C87875N7063k1549j1902N2826L004o459Q62p083R1228N7234r890k7804l6687
11029E28718j0989n0167k0586K8886O0032R874N7178J5076o5469J7617K1819l3077
$$ plain form
11017 558912 515219 480847 483526 490300 546789 640034 666009 629603 588858 584717 509252 472199
11005 472199 515884 495284 444190 452796 469937 451905 480794 505884 520354 544372 509201 519762
10993 519762 538730 532425 524644 520028 516895 469088 427718 459402 444978 390328 410665 375705
10981 375705 324479 343440 355222 383502 387556 386309 413455 378906 381981 435084 408666 384992
10969 384992 404398 382938 378644 403147 433943 418647 394838 415294 424753 395730 375965 398051
10957 398051 442971 437626 402097 389212 468483 478276 378538 320690 297292 356397 365373 337689
10945 337689 290079 245465 240504 290867 323135 315354 337417 324982 327644 332620 335035 311519
10933 311519 271543 305690 355268 374934 474471 474640 508340 578488 609535 655722 698999 769845
$$ packed form
11017E58912m3693l4372K679O774N6489R3245K5975l6406m0745m141p5465l7053
11005D72199M3685k0600n1094Q606J7141j8032K8889K5090J4470K4018l5171J0561
10993E19762J8968o305p781m616l133m7807m1370L1684j4424n4650K0337l4960
10981C75705n1226J8961J1782K8280M054j247K7146l4549L075N3103k6418k3674
10969C84992J9406k1460m294K4503L0796j5296k3809K0456R459k9023j9765K2086
10957C98051M4920n345l5529j2885P9271R793r9738n7848k3398N9105Q976k7684
10945C37689m7610m4614m961N0363L2268p781K2063j2435K662M976K415k3516
10933C11519l9976L4147M9578J9666R9537J69L3700P0148L1047M6187M3277P0846
$$ plain form
10921 769845 799843 857301 1014031 1140275 1282563 1474295 1677226 1917073 2283733 2802377
10911 2802377 3498034 4422956 5530637 6719346 7503697 7558339 6803369 5771905 4838188
10902 4838188 4115524 3516690 3086979 2784673 2532838 2321503 2191531 2097077 2002922 1935735
10892 1935735 1821457 1681731 1631052 1617516 1603345 1633572 1650095 1679213 1626715 1501331 1409953
10881 1409953 1418136 1415169 1347121 1286051 1334300 1391180 1351340 1326037 1344043 1317574 1262706 1192108
10869 1192108 1156702 1104917 1107749 1107648 1040922 952897 920639 867871 909682 971742 906423 849092
10857 849092 794916 791461 701374 693375 749591 691518 621882 625780 676897 639082 560363 583752
10845 583752 614000 616064 567497 489114 489562 470709 473048 504736 481735 505449 475418 430143
$$ packed form
10921G69845K9998N7458J56730J26244J42288J91732K02931K39847L66660N18644
10911B802377O95657R24922J107681J188709P84351N4642p54970j031464r33717
10902D838188p22664n98834m29711l02306k51835k11335j29972r4454r4155o7187
10892A935735j14278j39726n0679j3536j4171L0227J6523K9118n2498j25384r1378
10881A409953Q183k967o8048o1070M8249N6880l9840k5303J8006k6469n4868p0598
10869A192108l5406n1785K832j01o6726q8025l2258n2768M1811O2060o5319n7331
10857H49092n4176l455r0087p999N6216n8073o9636L898N1117l7815p8719K3389
10845E83752L0248K064m8567p8383M48j8853K339L1688k3001K3714l0031m5275
$$ plain form
10833 430143 377852 361351 373208 398227 341025 312823 302280 372439 366585 303136 372557 404019
10821 404019 363752 378416 362502 330952 304871 398856 422823 363587 406532 416545 376713
10810 376713 413872 440702 424895 367218 356247 296803 263696 222079 217011 237571 238398 224265
10798 224265 236375 293081 270149 272235 331442 257520 251912 271876 274401 214581 225466 263681
10786 263681 213790 254389 309624 336960 347807 371229 313031 260398 250707 288291 242374 220271
10774 220271 232024 267935 262134 302677 314262 251720 250233 225002 218859 265436 265962 228024
10762 228024 212042 196778 188967 146964 136506 208421 259717 314877 309593 311477 332618 289235
10750 289235 200425 200679 266408 272436 298177 265544 261090 322795 381494 381182 372505 328423 276860
$$ packed form
10833D30143n2291j6501J1857K5019n7202k8202j0543P0159n854o3449O9421L1462
10821D04019m0267J4664j5914l1550k6081R3985K3967n9236M2945J0013l9832
10810C76713L7159K6830j5807n7677j0971n9444l3107m1617n068K0560Q27j4133
10798B24265J2110N6706k2932K086N9207p3922n608J9964K525n9820J0885L8215
10786B63681m9891M0599N5235K7336J0847K3422n8198n2633r691L7584m5917k2103
10774B20271J1753L5911n801M0543J1585o2542j487k5231o143M6577N26l7938
10762B28024j5982j5264p811m2003j0458P1915N1296N5160n284J884K1141m3383
10750B89235q8810K54O5729O028K5741l2633m454O1705N8699l12q677m4082n1563
$$ plain form
10737 276860 228806 252864 260423 267884 289569 277684 262197 218819 286248 367824 383419 392918
10725 392918 373557 388532 356377 342031 343085 316714 383528 340772 306325 334283 397350 379812
10713 379812 329555 309237 286113 307951 313000 344252 324404 303144 266173 286126 279766 268849
10701 268849 269929 306464 394201 436389 409480 364851 342526 335461 348654 379660 325840 377074
10689 377074 441406 432077 363210 389395 395693 431129 420930 382493 407388 438445 546986 641265
10677 641265 645858 655185 636093 643444 667465 668534 683186 764906 816536 854833 822406 736121
10665 736121 694343 725538 730050 733239 766307 854366 951829 963410 950163 1008181 1124403 1211849
10653 1211849 1339037 1458343 1596154 1713421 1885135 2127285 2387505 2612571 2787492
$$ packed form
10737B76860m8054K4058P559P461K1685j1885j5487m3378O7429Q1576J5595R499
10725C92918j9361J4975l2155j4346J054k6371O6814m2756l4447K7958O3067j7538
10713C79812n0257k0318k3124K1838N049L1252j9848k1260l6971J9953o360j0917
10701B68849J080L6535Q7737M2188k6909m4629k2325p065J3193L1006n3820N1234
10689C77074O4332r329o8867K6185O298L5436j0199l8437K4895L1057J08541R4279
10677F41265M593R327j9092P351K4021J069J4652Q1720N1630L8297l2427q6285
10665G36121m1778L1195M512L189L3068Q8059R7463J1581j3247N8018J16222Q7446
10653A211849J27188J19306J37811J17267J71714K42150K60220K25066J74921
$$ plain form
10644 2787492 2914270 2943920 2981118 2899151 2723463 2566637 2385568 2230652 2269954 2259601
10634 2259601 2220831 2255133 2351678 2487523 2566617 2655106 2830177 3100658 3345031 3690618
10624 3690618 4274159 5032985 5931064 7045832 8480396 10308347 12565982 15087124 17566078
10615 17566078 19547517 20707932 21012550 20882644 20848342 21404849 22692927 24861561 28065519
10606 28065519 32355701 37279954 41926131 45029534 45885555 44742406 42724063 41072172
10598 41072172 40505135 41374129 43745608 47604360 52864097 58835578 63969490 66458815
10590 66458815 65331554 61452505 56626407 52315375 49307965 47827177 47830238 49157259
10582 49157259 51533799 54313042 56272885 56325463 54064084 50134688 45777713 42094824
$$ packed form
10644B787492J26778K9650L7198q1967j75688j56826j81069j54916L9302j0353
10634B259601l8770L4302R6545J35845P9094Q8489J75071K70481K44373L45587
10624C690618N83541P58826Q98079J114768J434564J827951K257635K521142K478954
10615A7566078J981439J160415L04618j29906l4302N56507J288078K168634L203958
10606B8065519M290182M924253M646177L103403Q56021j143149k018343j651891
10598D1072172n67037Q68994K371479L858752N259737N971481N133912K489325
10590F6458815j127261l879049m826098m311032l007410j480788L061J327021
10582D9157259K376540K779243J959843N2578k261379l929396m356975l682889
$$ plain form
10574 42094824 39435270 37663674 36722066 36409785 36505253 36705676 36587126 35709753 33906442
10565 33906442 31467358 28963572 26700643 24763639 23180799 21866610 20723315 19722661
10557 19722661 18871979 18082286 17329780 16737861 16206570 15691330 15123571 14663062 14192523
10548 14192523 13706913 13203668 12705163 12234423 11818097 11352086 10917390 10527469 10152065
10539 10152065 9785215 9356671 8921127 8537612 8141275 7779549 7449991 7124863 6773808
10530 6773808 6470215 6188861 5853412 5566270 5343891 5120840 4918322 4666685 4404535
10521 4404535 4206533 4041015 3860820 3686241 3558755 3448285 3340357 3204018 3041136
10512 3041136 2962406 2923916 2844185 2741142 2620764 2515793 2482881 2455376 2405513 2357778 2251603
$$ packed form
10574D2094824k659554j771596r41608l12281R5468K00423j18550q77373j803311
10565C3906442k439084k503786k262929j937004j582840j314189j143295j000654
10557A9722661q50682p89693p52506n91919n31291n15240n67759m60509m70539
10548A4192523m85610n03245m98505m70740m16326m66011m34696l89921l75404
10539A0152065l66850m28544m35544l83515l96337l61726l29558l25128l51055
10530F773808l03593k81354l35449k87142k22379k23051k02518k51637k62150
10521D404535j98002j65518j80195j74579j27486j10470j07928j36339j62882
10512C041136p8730l8490p9731j03043j20378j04971l2912k7505m9863m7735j06175
$$ plain form
10501 2251603 2217481 2197671 2128461 2101680 2109922 2079382 2032032 1960914 1861894 1766238 1663154
10490 1663154 1537173 1469046 1416497 1364684 1317081 1258341 1217489 1215904 1197438 1113637 1075961
10479 1075961 1022049 1004974 952419 923744 874203 928875 931768 852557 835004 833724 806382 830341
10467 830341 885101 800114 735903 736783 708559 668095 642796 603703 636247 643210 640500 635373
10455 635373 598016 593144 611684 544137 526337 517518 520363 540827 567182 492306 438756 450911
10443 450911 494970 491340 495739 494319 445695 441653 458599 431914 417686 507611 518019 510413
10431 510413 525765 537244 513003 488327 500941 498142 518884 505609 514336 601620 613191 585015
10419 585015 536525 530152 565573 587447 581486 573219 574213 561883 547276 570794 564888 567088 670703
$$ packed form
10501B251603l4122j9810o9210k6781Q242l0540m7350p1118r9020r5656j03084
10490A663154j25981o8127n2549n1813m7603n8740m0852j585j8466q3801l7676
10479A075961n3912j7075n2555k8675m9541N4672K893p9211j7553j280k7342K3959
10467H30341N4760q4987o4211Q80k8224m0464k5299l9093L2544O963k710n127
10455F35373l7357m872J8540o7547j7800q819K845K0464K6355p4876n3550J2155
10443D50911M4059l630M399j420m8624m042J6946k6685j4228Q9925J0408p606
10431E10413J5352J1479k4241k4676J2614k799K0742j3275Q727Q7284J1571k8176
10419E85015m8490o373L5421K1874n961q267R94j2330j4607K3518n906K200J03615
$$ plain form
10406 670703 694238 625769 597067 623145 621805 566945 585849 678282 721754 759519 826682 801204
10394 801204 778273 808863 777796 764204 795376 864366 898989 874517 801409 773665 727073
10383 727073 737738 836301 905362 938392 986470 999760 1037169 1124664 1148013 1146925 1217059 1243632
10371 1243632 1200894 1167272 1089581 1032062 958332 891724 821024 772505 734601 708830 747993
10360 747993 729678 646727 590108 587153 604278 608409 647405 747779 787422 722223 701754 768675
10348 768675 800844 787113 804774 893201 930497 940503 945994 1014138 1077092 1088373 1114869 1182593
10336 1182593 1233262 1297351 1352411 1419563 1476588 1504957 1537283 1603383 1723171 1827660 1891539
10325 1891539 1849511 1824257 1826999 1892334 2018291 2104901 2117594 2160250 2170898 2223628 2282233
$$ packed form
10406F70703K3535o8469k8702K6078j340n4860J8904R2433M3472L7765O7163k5478
10394H01204k2931L0590l1067j3592L1172O8990L4623k4472p3108k7744m6592
10383G27073J0665R8563O9061L3030M8078J3290L7409Q7495K3349j088P0134K6573
10371A243632m2738l3622p7691n7519p3730o6608p0700m8519l7904k5771L9163
10360G47993j8315q2951n6619k955J7125M131L8996J00374L9643o5199k0469O6921
10348G68675L2169j3731J7661Q8427L7296J0006N491O8144O2954J1281K6496O7724
10336A182593N0669O4089N5060O7152N7025K8369L2326O6100J19788J04489O3879
10325A891539m2028k5254K742O5335J25957Q6610J2693M2656J0648N2730N8605
$$ plain form
10314 2282233 2323204 2403934 2514347 2512175 2513997 2463899 2450245 2492639 2529182 2616758 2715100
10303 2715100 2784207 2844127 2875432 2944852 3015965 3055928 3096566 3082248 3109415 3206400 3295135
10292 3295135 3391969 3428418 3459906 3559254 3635174 3665070 3797479 3944380 4096142 4208519
10282 4208519 4333226 4482107 4673174 4930305 5163405 5429003 5815878 6274384 6775708
10273 6775708 7460775 8164075 8880976 9679889 10498993 11416566 12395347 13420027 14494939
10264 14494939 15704309 17024353 18485751 20008729 21627922 23444076 25656094 28439838
10256 28439838 32000772 36636378 42688882 50478543 60629524 73930660 91476154 114581433
10248 114581433 144517497 181746669 225285169 272306397 318111304 354417234 370674308
$$ packed form
10314B282233M0971Q0730J10413k172J822n0098j3654M2394L6543Q7576R8342
10303B715100O9107N9920L1305O9420P1113L9963M0638j4318K7167R6985Q8735
10292C295135R6834L6449L1488R9348P5920K9896J32409J46901J51762J12377
10282D208519J24707J48881J91067K57131K33100K65598L86875M58506N01324
10273F775708O85067P03300P16901P98913Q19104R17573R78781J024680J074912
10264A4494939J209370J320044J461398J522978J619193J816154K212018K783744
10256B8439838L560934M635606O052504P789661J0150981J3301136J7545494K3105279
10248A14581433K9936064L7229172M3538500M7021228M5804907L6305930J6257074
$$ plain form
10241 370674308 361782278 333559158 296387160 257472162 220917394 189425853 163897728
10234 163897728 143925973 128506720 116489265 106944305 99288213 92968989 87644447
10227 87644447 83252044 79591965 76479366 73775354 71278330 68923711 66742971 64630015
10219 64630015 62725594 61103627 59743591 58628939 57635028 56799679 56094672 55407287 54610388
10210 54610388 53684431 52577844 51324421 50027831 48700956 47327883 45862174 44183675
10202 44183675 42385161 40546835 38628826 36764136 34952071 33232431 31566029 29974491
10194 29974491 28429511 26996859 25605262 24269736 23027241 21870334 20846038 19798381
10186 19798381 18813679 17916110 17118484 16364971 15644846 14873125 14157091 13474168 12912128
$$ packed form
10241C70674308q892030k8223120l7171998l8914998l6554768l1491541k5528125
10234A63897728j9971755j5419253j2017455r544960p656092o319224n324542
10227H7644447m392403l660079l112599k704012k497024k354619k180740k112956
10219F4630015j904421j621967j360036j114652r93911q35349p05007o87385p96899
10210E4610388r25957j106587j253423j296590j326875j373073j465709j678499
10202D4183675j798514j838326j918009j864690j812065j719640j666402j591538
10194B9974491j544980j432652j391597j335526j242495j156907j024296j047657
10186A9798381r84702q97569p97626p53513p20125p71721p16034o82923n62040
$$ plain form
10177 12912128 12385025 11839968 11351012 10845547 10368845 9882034 9434074 9051770 8724303
10168 8724303 8434530 8111285 7774266 7478027 7186059 6898750 6622873 6355968 6060099
10159 6060099 5751710 5487182 5280540 5164800 5013442 4837772 4672323 4560558 4421003
10150 4421003 4220980 4051001 3904731 3728108 3584701 3446328 3394365 3341235 3217522 3057888
10140 3057888 2928564 2856250 2821568 2727501 2623900 2499953 2463565 2432822 2397064 2369174 2390103
10129 2390103 2321814 2289703 2306480 2318468 2380677 2417247 2423796 2505734 2528458 2528019 2494413 2405964
10117 2405964 2349419 2290902 2216071 2137813 1971056 1838164 1686857 1521680 1379496 1321361
10107 1321361 1248452 1174681 1069807 1013111 994604 956521 904751 896986 898140 855625 817388
$$ packed form
10177A2912128n27103n45057m88956n05465m76702m86811m47960l82304l27467
10168H724303k89773l23245l37019k96239k91968k87309k75877k66905k95869
10159F060099l08389k64528k06642j15740j51358j75670j65449j11765j39555
10150D421003k00023j69979j46270j76623j43407j38373n1963n3130j23713j59634
10140C057888j29324p2314l4682r4067j03601j23947l6388l0743l5758k7890K0929
10129B390103o8289l2111J6777J1988O2209L6570O549Q1938K2724m39l3606q8449
10117B405964n6545n8517p4831p8258j66757j32892j51307j65177j42184n8135
10107A321361p2909p3771j04874n6696j8507l8083n1770p765J154m2515l8237
$$ plain form
10096 817388 771738 772106 743184 753466 729157 694540 687983 768138 818410 873211 910509 928889
10084 928889 963917 1000770 998096 1070875 1115706 1191071 1254406 1216734 1243541 1306865 1372037 1371657
10072 1371657 1431336 1428973 1360199 1385733 1425990 1399100 1355306 1380558 1429918 1454772 1480919
10061 1480919 1513511 1516695 1468990 1421803 1407624 1395646 1393638 1388065 1357803 1403399 1473828 1444294
10049 1444294 1436673 1421528 1421243 1444555 1419802 1378820 1289311 1258456 1258596 1216314 1193738 1161738
10037 1161738 1123344 1083818 1066546 1066917 1037191 1062826 1090343 1086559 1050892 1014318 1044153 1086389
10025 1086389 1036470 996036 931784 881204 832684 834211 895908 827596 793744 775193 735875
10014 735875 729095 724212 755711 734372 730435 763062 825298 825722 735595 670936 668800 680802 666314
$$ packed form
10096H17388m5650L68k8922J0282k4309l4617o557Q0155N0272N4801L7298J8380
10084I28889L5028L6853k674P2779M4831P5365O3335l7672K6807O3324O5172l80
10072A371657N9679k363o8774K5534M0257k6890m3794K5252M9360K4854K6147
10061A480919L2592L184m7705m7187j4179j1978k008n573l0262M5596P0429k9534
10049A444294p621j5145k85K3312k4753m0982q9509l0855J40m2282k2576l2000
10037A161738l8394l9526j7272L71k9726K5635K7517l784l5667l6574K9835M2236
10025A086389m9919m0434o4252n0580m8520J527O1697o8312l3852j8551l9318
10014G35875o780m883L1499k1339l937L2627O2236M24r0127o4659k136J2002j4488
$$ plain form
10001 666314 685573 674866 673284 631758 646744 686745 659708 631396 657436 613402 639479 674962
9989 674962 717311 681058 599687 604956 573343 537514 519426 518179 577207 587228 573897 585765
9977 585765 596179 569685 488928 483838 484419 413634 397600 360740 327412 298822 304950 330310
9965 330310 355750 307436 266091 329807 423823 398035 327694 296677 292125 292066 272372 285595
9953 285595 331395 289862 291157 350913 446463 368032 294160 231027 181311 184751 182883 220001
9941 220001 253108 229452 238487 278601 283732 268773 284791 332704 314057 292964 370090 414020
9929 414020 399830 399069 385696 386293 342187 370628 350496 318558 356950 409706 447542 410488
9917 410488 427077 401132 419015 418919 456472 491790 478895 448159 439827 461503 425798 446107
$$ packed form
10001F66314J9259j0707j582m1526J4986M0001k7037k8312K6040m4034K6077L5483
9989F74962M2349l6253q1371N269l1613l5829j8088j247N9028J0021j3331J1868
9977E85765J0414k6494q0757n090N81p0785j6034l6860l3328k8590O128K5360
9965C30310K5440m8314m1345O3716R4016k5788p0341l1017m552n9j9694J3223
9953B85595M5800m1533J295N9756R5550p8431p3872o3133m9716L440j868L7118
9941B20001L3107k3656R035M0114N131j4959J6018M7913j8647k1093P7126M3930
9929D14020j4190p61j3373N97m4106K8441k0132l1938L8392N2756L7836l7054
9917D10488J6589k5945J7883r6L7553L5318j2895l0736q332K1676l5705K0309
$$ plain form
9905 446107 482974 457408 430057 417166 449887 473445 417096 348761 341317 350230 365884 375766
9893 375766 384103 381607 382666 350896 314420 302161 289237 248053 298088 371798 365463 382971
9881 382971 382675 333849 317110 285427 276113 275502 251138 230581 232565 254177 283406 311117 329319
9868 329319 272002 304123 330395 329605 326064 324336 282242 280878 301439 290028 264882 295185 268789
9855 268789 309925 318249 349447 362957 415353 414442 404944 383760 434749 526757 583756 610799
9843 610799 621000 786388 938770 1120560 1289626 1564415 1803747 1994198 2104969 2080327
9833 2080327 1969660 1812438 1595995 1465622 1297666 1138978 1007198 881263 830584 822928
9823 822928 788220 696435 662844 687997 631426 529704 522417 598839 618156 584081 474198
$$ packed form
9905D46107L6867k5566k7351j2891L2721K3558n6349o8335p444Q913J5654R882
9893C75766Q337k496J059l1770l6476j2259j2924m1184N0035P3710o335J7508
9881C82971k96m8826j6739l1683r314o11k4364k0557J984K1612K9229K7711J8202
9868C29319n7317L2121K6272p90l541j728m2094j364K0561j1411k5146L0303k6396
9855B68789M1136Q324L1198J3510N2396r11r498k1184N0989R2008N6999K7043
9843F10799J0201J65388J52382J81790J69066K74789K39332J90451J10771k4642
9833B080327j10667j57222k16443j30373j67956j58688j31780j25935n0679p656
9823H22928l4708r1785l3591K5153n6571j01722p287P6422J9317l4075j09883
$$ plain form
9812 474198 427506 427768 403610 403255 457051 428345 421669 450506 472716 474065 546255 523655 462788
9799 462788 448758 483932 477774 469409 484423 464027 456744 477917 474522 417997 366000 324312
9787 324312 283057 317894 336556 314678 262999 196312 246483 317301 297635 205178 202183 214998
9775 214998 234209 216180 228285 234395 254577 285806 284287 234506 216810 252965 239030 198644
9763 198644 189475 203285 174892 127127 165199 176475 164436 238438 312936 338895 240776 184332
9751 184332 238666 232467 177482 126083 136425 169514 113157 131038 183335 207323 168337 125536
9739 125536 199701 236315 208457 235862 199816 142871 104519 105450 125654 110506 163730 197985
9727 197985 195288 186609 172665 120466 103673 147105 141908 131407 122168 107048 106330 151425 186936
$$ packed form
9812D74198m6692K62k4158l55N3796k8706o676K8837K2210J349P2190k2600o0867
9799D62788j4030L5174o158q365J5014k0396p283K1173l395n6525n1997m1688
9787C24312m1255L4837J8662k1878n1679o6687N0171P0818j9666r2457k995J2815
9775B14998J9211j8029J2105O110K0182L1229j519m9781j7696L6155j3935m0386
9763A98644r169J3810k8393m7765L8072J1276j2039P4002P4498K5959r8119n6444
9751A84332N4334o199n4985n1399J0342L3089n6357J7881N2297K3988l8986m2801
9739A25536P4165L6614k7858K7405l6046n6945l8352R31K0204j5148N3224L4255
9727A97985k697q679j3944n2199j6793M3432n197j0501r239j5120p18M5095L5511
$$ plain form
9714 186936 166733 180969 150987 118061 102089 132645 121647 93230 36014 16962 51674 103381
9702 103381 85682 34686 41147 78091 75758 52976 54351 63963 118339 184752 149051 121316
9690 121316 119527 95572 48136 57370 80001 97489 145991 78622 19570 50735 118207 154969
9678 154969 101302 73511 102878 111520 139965 130866 75801 94431 186838 166586 107394 117759
9666 117759 173332 177003 88321 85053 82758 96930 90539 118317 160271 232737 258024 249077 221254
9653 221254 215331 176038 161644 217939 270385 226995 186105 165832 130137 116409 170367 191488
9641 191488 215041 231657 186996 124846 110141 122073 150117 151378 179044 148915 125391 181949
9629 181949 163510 58520 39897 98825 116696 160927 221418 182316 145259 186926 184277 171045
$$ packed form
9714A86936k0203J4236k9982l2926j5972L0556j0998k8417n7216j9052L4712N1707
9702A03381j7699n0996O461L6944k333k2782J375R612N4376O6413l5701k7735
9690A21316j789k3955m7436R234K2631J7488M8502o7369n9052L1165O7472L6762
9678A54969n3667k7791K9367Q642K8445r099n5065J8630R2407k0252n9192J0365
9666A17759N5573L671q8682l268k295J4172o391K7778M1954P2466K5287q947k7823
9653B21254n923l9293j4394N6295N2446m3390m0890k0273l5695j3728N3958K1121
9641A91488K3553J6616m4661o2150j4705J1932K8044J261K7666l0129k3524N6558
9629A81949j8439j04990j8623N8928J7871M4231O0491l9102l7057M1667k649j3232
$$ plain form
9617 171045 193346 224153 261523 239753 168264 127528 163665 124561 112734 95936 66330 54436
9605 54436 19392 41606 44656 24649 -6509 455 104203 157827 154752 135992 145898 118031
9593 118031 94171 127806 136383 127914 118470 126251 164046 154880 82004 75771 58101 20541 69961
9580 69961 94836 64569 86246 124221 95422 126175 84330 31552 10174 21604 3583 29787
9568 29787 92186 61829 23754 50524 66033 73735 57666 78326 79436 6407 -69269 -33548
9556 -33548 25743 57648 62410 106534 84448 19557 -7138 6403 -13080 7406 31253 61486
9544 61486 55912 30894 -14397 -35599 -22890 36600 42735 72187 85180 45538 19996 10014
9532 10014 95960 158538 140483 122541 69636 88916 110419 102200 47550 63762 45671 41367
$$ packed form
9617A71045K2301L0807L7370k1770p1489m0736L6137l9104j1827j6798k9606j1894
9605E4436l5044K2214L050k0007l1158O964J03748N3624l075j8760R906k7867
9593A18031k3860L3635Q577q469r444P781L7795r166p2876o233j7670l7560M9420
9580F9961K4875l0267K1677L7975k8799L0753m1845n2778k1378J1430j8021K6204
9568B9787O2399l0357l8075K6770J5509P702j6069K0660J110p3029p5676L5721
9556c3548N9291L1905M762M4124k2086o4891k6695J3541j9483K0486K3847L0233
9544F1486n574k5018m5291k1202J2709N9490O135K9452J2993l9642k5542r982
9532A0014Q5946O2578j8055j7942n2905J9280K1503q219n4650J6212j8091m304
$$ plain form
9520 41367 31460 48624 68472 72903 83413 122676 120521 36482 52895 55648 107454 126986 111804
9507 111804 81796 92953 40828 75947 53141 31546 22536 22057 72474 109082 150156 152264
9495 152264 176860 156860 71999 65065 45556 47531 -6675 -2856 69230 84329 74280 61030
9483 61030 69303 68050 53033 27993 -4901 -9340 19143 84677 155707 110996 110487 109504 34007
9470 34007 7685 53736 115764 97026 81480 118676 110829 117384 116207 98438 27744 36926 93798
9457 93798 98022 144328 130163 108117 65937 3421 8176 36583 63161 79921 129596 185695
9445 185695 198145 200867 140488 59858 108620 150497 109563 83340 81313 17630 -15980 6587
9433 6587 31136 41863 76093 85288 98327 66164 -30993 -9487 44627 160469 218032 176051
$$ packed form
9520D1367r907J7164J9848M431J0510L9263k155q4039J6413K753N1806J9532j5182
9507A11804l0008J1157n2125L5119k2806k1595r010m79N0417L6608M1074K108
9495A52264K4596k0000q4861o934j9509J975n4206L819P2086J5099j0049j3250
9483F1030Q273j253j5017k5040l2894m439K8483O5534P1030m4711n09r83p5497
9470C4007k6322M6051O2028j8738j5546L7196p847O555j177j7769p0694R182N6872
9457I3798M224M6306j4165k2046m2180o2516M755K8407K6578J6760M9675N6099
9445A85695J2450K722o0379q0630M8762M1877m0934k6223k027o3683l3610K2567
9433F587K4549J0727L4230R195J3039l2163r7157K1506N4114J15842N7563m1981
$$ plain form
9421 176051 124228 86746 110428 141229 102869 60939 26003 22308 70610 79168 117534 93661
9409 93661 96314 133207 100234 68558 37112 17964 15403 17614 8978 53621 89221 81036 72232
9396 72232 66079 59782 99272 93478 92953 77617 79092 136464 121386 116944 135683 109994 97953
9383 97953 44719 47508 59188 63451 45353 14714 -30646 -59736 -50331 -8045 12538 31384
9371 31384 27727 56829 26583 95050 152839 151718 117233 27526 -90 35655 19833 31984
9359 31984 39113 68263 42071 37775 48905 103981 167791 181050 184191 168486 128836 106034
9347 106034 113455 57907 4592 -30844 -18468 93286 101896 35362 7227 39656 59432 63876
9335 63876 40168 123401 175270 106382 135032 171511 166073 130168 133862 76365 26620 26776 25794
$$ packed form
9421A76051n1823l7482K3682L0801l8360m1930l4936l695M8302Q558L8366k3873
9409I3661K653L6893l2973l1676l1446j9148k561K211q636M4643L5600q185q804
9396G2232o153o297L9490n794n25j5336J475N7372j5078m442J8739k5689j2041
9383I7953n3234K789J1680M263j8098l0639m5360k9090R405M2286K0583J8846
9371C1384l657K9102l0246O8467N7789j121l4485q9707k7616L5745j5822J2151
9359C1984P129K9150k6192m296J1130N5076O3810J3259L141j5705l9650k2802
9347A06034P421n5548n3315l5436J2376J11754Q610o6534k8135L2429J9776M444
9335F3876k3708Q3233N1869o8888K8650L6479n438l5905L694n7497m9745J56r82
$$ plain form
9322 25794 46127 108843 55630 42846 28461 65281 73573 104764 113616 122063 100741 127220
9310 127220 113707 116718 106504 59057 81772 106226 80805 90984 73359 14784 21339 41401
9298 41401 79831 69851 59716 43933 70412 126945 199420 139334 106892 49304 45656 44731 82541
9285 82541 120320 81079 22407 40188 44135 23820 -5788 32301 105477 36264 -8160 80211
9273 80211 98356 60361 57820 60544 56121 22219 42776 29965 -83847 -72977 -43690 -49683
9261 -49683 -52549 -41186 -72551 -71359 3768 40071 35145 67804 18615 48728 110231 103561 69829
9248 69829 56324 111600 32779 29750 53553 77942 77740 54900 81634 99355 149408 121129
9236 121129 48680 -18014 -337 -11090 -37491 15794 62174 49446 50959 71192 86870 71804
$$ packed form
9322B5794K0333O2716n3213j2784j4385L6820Q292L1191Q852Q447k1322K6479
9310A27220j3513L011j0214m7447K2715K4454k5421J0179j7625n8575O555K0062
9298D1401L8430r980j0135j5783K6479N6533P2475o0086l2442n7588l648r25L7810
9285H2541L7779l9241n8672J7781L947k0315k9608L8089P3176o9213m4424Q8371
9273H0211J8145l7995k541K724m423l3902K0557j2811j13812J0870K9287n993
9261d9683k866J1363l1365J192P5127L6303m926L2659m9189L0113O1503o670l3732
9248F9829j3505N5276p8821l029K3803K4389k02k2840K6734J7721N0053k8279
9236A21129p2449o6694J7677j0753k6401N3285M6380j2728J513K0233J5678j5066
$$ plain form
9224 71804 38253 28960 81754 74201 52873 37220 11358 8639 62448 74807 81233 61045 49684
9211 49684 69282 128348 110504 98942 48770 11500 20727 86411 87100 49964 -34264 -26344 49292
9198 49292 47839 33695 60472 41288 12556 70099 109299 73236 74891 79060 71132 77181 112984
9185 112984 87245 65066 8175 -29885 4789 35650 23445 39126 46268 81654 99223 81812
9173 81812 76949 75291 34350 -84 -15037 3112 35969 45340 74380 64347 23660 -67473
9161 -67473 -113951 -107895 -101498 -63072 -69421 -54388 -32513 -14703 -26231 -23655 21668 -11909 -21936
9148 -21936 -36221 -15875 -7502 11336 24129 39821 47461 11500 -33546 -52468 -16641 17719
9136 17719 8278 28593 58850 46744 63519 77799 100483 74655 25290 -39126 -43639 59837
$$ packed form
9224G1804l3551r293N2794p553k1328j5653k5862k719N3809J2359O426k0188j1361
9211D9684J9598N9066j7844j1562n0172l7270R227O5684O89l7136q4228P920P5636
9198D9292j453j4144K6777j9184k8732N7543L9200l6063J655M169p928O049L5803
9185A12984k5739k2179n6891l8060L4674L0861j2205J5681P142L5386J7569j7411
9173H1812m863j658m0941l4434j4953J8149L2857R371K9040j0033m0687r1133
9161f7473m6478O056O397L8426o349J5033K1875J7810j1528K576M5323l3577j0027
9148b1936j4285K0346Q373J8838J2793J5692P640l5961m5046j8922L5827L4360
9136A7719r441K0315L0257j2106J6775J4280K2684k5828m9365o4416m513J03476
$$ plain form
9124 59837 82837 -20663 -80910 -105680 -43132 4040 44490 58136 25731 -16954 -20024 -6553
9112 -6553 -32973 -34125 5213 29683 13363 18745 10815 -30132 -21445 -18335 -45946 -44153 9571
9099 9571 -16682 -18296 70151 79021 10040 29512 28285 25408 67703 78880 68306 55718 7053
9086 7053 -6356 9904 22365 39495 4851 33410 85851 43472 9127 59721 86446 20375
9074 20375 4417 -8638 47976 88966 124134 82235 25271 -26322 -1438 9796 25291 93447
9062 93447 86824 90220 34483 -89381 -95725 -36320 -9120 -43581 -138421 -164238 -150600 -140721
9050 -140721 -107112 -6357 683 9821 34278 29150 21150 -1166 -49089 -77981 -63775 -35405
9038 -35405 -46346 -16525 800 3239 -11072 -14954 -61091 -43777 -82995 -76197 -33136 -32012 -47899
$$ packed form
9124E9837K3000j03500o0247k4770O2548M7172M0450J3646l2405m2685l070J3471
9112f553k6420j152L9338K4470j6320N382p930m0947Q687L110k7611J793N3724
9099I571k6253j614Q8447Q870o8981J9472j227k877M2295J1177j0574j2588m8665
9086G053j3409J6260J2461J7130l4644K8559N2441m2379l4345N0594K6725o6071
9074B0375j5958j3055N6614M0990L5168m1899n6964n1593K4884J1234J5495O8156
9062I3447o623L396n5737j23864o344N9405K7200l4461r4840k5817J3638R879
9050a40721L3609J00755P040R138K4457n128q000k2316m7923k8892J4206K8370
9038c5405j0941K9821J7325K439j4311l882m6137J7314l9218O798M3061J124j5887
$$ plain form
9025 -47899 -50575 14705 26031 -8011 -13310 -21774 -43256 -60431 -53787 21799 15559 -13030 -31395
9012 -31395 -50015 -70422 -46884 -8244 -12389 -17872 -91127 -55470 -6192 48491 30867 -36698
9000 -36698 -85477 -55120 -50249 -36297 810 11726 39969 731 -84648 -92433 -45391 -36747
8988 -36747 -11614 14666 68052 67309 15653 -5170 -3521 16611 3314 -9583 -7027 -17364 -45048
8975 -45048 -99423 -99260 -68884 -83009 -34991 18374 54474 29285 -29510 -49692 -7199 28423
8963 28423 57066 39277 53582 102182 87428 46756 10550 24666 44694 64547 -9331 -6030
8951 -6030 2662 10351 4674 20844 64930 102048 107294 89976 64874 1864 -15201 26381 79369
8938 79369 97115 71577 32132 5617 19752 -15247 -29235 16709 55221 34585 48514 78065
$$ packed form
9025d7899k676O5280J1326l4042n299q464k1482j7175O644P5586o240k8589j8365
9012c1395j8620k0407K3538L8640m145n483p3255L5657M9278N4683j7624o7565
9000c6698m8779L0357M871J3952L7107J0916K8243l9238q5379p785M7042Q644
8988c6747K5133K6280N3386p43n1656k0823J649K0132j3297j2897K556j0337k7684
8975d5048n4375J63L0376j4125M8018N3365L6100k5189n8795k0182M2493L5622
8963B8423K8643j7789J4305M8600j4754m0672l6206J4116K0028J9853p3878L301
8951f030Q692P689n677J6170M4086L7118N246j7318k5102o3010j7065M1582N2988
8938G9369J7746k5538l9445k6515J4135l4999j3988M5944L8512k0636J3929K9551
$$ plain form
8926 78065 62347 56120 41048 -28412 -46636 11866 35876 19475 11367 -8814 21021 23832
8914 23832 -2961 -20069 -36115 -64646 -84598 6770 68143 12515 10437 -10845 2958 -24586
8902 -24586 -49048 -44821 -5937 -17161 -45767 -25195 -10654 -5256 18296 52855 71819 136700
8890 136700 106298 94954 146386 145926 101914 90366 90266 24299 17944 65510 52858 51115 3823
8877 3823 -35048 -42507 30659 90207 112770 64997 43786 63143 95080 103320 129359 152429
8865 152429 184063 173294 164552 84001 38689 -980 12369 51716 51529 30599 28089 11263
8853 11263 -4906 -34495 -2766 11233 -1090 69735 68032 31303 41778 31866 4688 57778
8841 57778 84285 3887 -69593 -138 96954 144747 93148 64407 3504 14909 57853 76095
$$ packed form
8926G8065j5718o227j5072o9460j8224N8502K4010j6401q108k0181K9835K811
8914B3832k6793j7108j6046k8531j9952R1368O1373n5628k078k1282J3803k7544
8902b4586k4462M227L8884j1224k8606K0572J4541N398K3552L4559J8964O4881
8890A36700l0402j1344N1432m60m4012j1548j00o5967o355M7566j2652j743m7292
8877C823l8871p459P3166N9548K2563m7773k1211J9357L1937Q240K6039K3070
8865A52429L1634j0769q742q0551m5312l9669J3349L9347j87k0930k510j6826
8853A1263j6169k9589L1729J3999j2323P0825j703l6729J0475r912k7178N3090
8841E7778K6507q0398p3480O9455R7092M7793n1599k8741o0903J1405M2944J8242
$$ plain form
8829 76095 51634 -19824 -41258 11468 25503 106020 99159 82177 57892 52756 63109 58823
8817 58823 72469 65276 42205 6717 -16859 -52079 -82725 -89685 -30829 -10784 -38983 -14620
8805 -14620 -9904 -57245 -73160 -39810 -60814 -68950 -53174 -17379 -6869 40422 31678 57470
8793 57470 83068 51155 -32175 -71910 -40460 15103 -46040 -26377 33471 42851 24281 49633
8781 49633 104544 85421 53929 14723 1515 30004 54746 73495 14068 22510 -7633 -3077
8769 -3077 -5839 22462 31725 36316 50603 63863 51647 19307 14375 80906 116208 87771 65508
8756 65508 43950 37085 11169 -10196 -1715 24694 42191 37660 57961 66940 71704 41854 17064
8743 17064 -18536 -11252 9208 4078 -6852 7838 18779 19285 -4861 10725 16756 -756 -8593
$$ packed form
8829G6095k4461p1458k1434N2726J4035Q0517o861j6982k4285n136J0353m286
8817E8823J3646p193k3071l5488k3576l5220l0646o960N8856K0045k8199K4363
8805a4620M716m7341j5915L3350k1004q136J5776L5795J0510M7291q744K5792
8793E7470K5598l1913q3330l9735L1450N5563o1143J9663N9848R380j8570K5352
8781D9633N4911j9123l1492l9206j3208K8489K4742J8749n9427Q442l0143M556
8769c077k762K8301R263M591J4287J3260j2216l2340m932O6531L5302k8437k2263
8756F5508k1558o865k5916k1365Q481K6409J7497m531K0301Q979M764k9850k4790
8743A7064l5600P284K0460n130j0930J4690J0941N06k4146J5586O031j7512p837
$$ plain form
8730 -8593 -23490 -5323 -26737 20214 36101 -9179 25780 49383 33050 38521 37228 77570
8718 77570 73161 101612 96786 68256 38148 12339 -44441 -58814 -24330 17439 27173 -25897
8706 -25897 -2235 2524 3352 -28277 -25562 38402 54417 -9975 13693 2852 -55997 -87212 -27097
8693 -27097 8456 53192 58539 51850 -11370 -13513 20235 30290 -10022 -27845 3648 -74050
8681 -74050 -84021 -80484 -78822 -53966 -61857 -50155 -11473 -2126 -1632 58084 50217 -6239 -43019
8668 -43019 -17600 -14012 8328 37727 21427 61946 41138 32660 109770 135300 72484 22967
8656 22967 -455 -32827 -29532 11208 19182 64641 74701 89129 97544 103868 106003 77853 17340
8643 17340 -1005 48455 30799 16669 -18249 -11266 -39485 8410 -11064 -10204 -12080 23586 44264
$$ packed form
8730h593j4897J8167k1414M6951J5887m5280L4959K3603j6333N471j293M0342
8718G7570m409K8451m826k8530l0108k5809n6780j4373L4484M1769R734n3070
8706b5897K3662M759Q28l1629K715O3964J6015o4392K3668j0841n8849l1215O0115
8693b7097L5553M4736N347o689o3220k143L3748J0055m0312j7823L1493p7698
8681g4050r971L537J662K4856p891J1702L8682R347M94N9716p867n6456l6780
8668d3019K5419L588K2340K9399j6300M0519k0808q478P7110K5530o2816m9517
8656B2967k3422l2372L295M0740P974M5459J0060J4428Q415O324K135k8150o0513
8643A7340j8345M9460j7656j4130l4918O983k8219M7895j9474Q60j876L5666K0678
$$ plain form
8630 44264 29661 -12595 -45674 -40524 -37366 2595 -16277 6736 28340 57882 63575 51968
8618 51968 57340 69394 89270 92500 57094 15500 -6209 -2029 -9269 -23394 -8567 20328 24926
8605 24926 11824 -38471 -75202 -28617 4913 -44512 -53377 -29068 9697 46891 77263 93780
8593 93780 97540 96382 101334 95162 92466 65092 39522 48680 76010 48785 50177 27252 49691
8580 49691 117834 131103 100605 55841 55494 48326 32490 63824 106453 142498 136864 90816 -4961
8567 -4961 5700 26066 66374 110295 99066 42351 24376 35397 34284 133206 205163 211850
8555 211850 135791 113070 96436 41757 35191 37865 10762 -59720 -63443 23842 86996 100471
8543 100471 87758 76976 64640 57074 18797 35549 43254 10091 -33530 -40092 -36801 -38237 -19522
$$ packed form
8630D4264j4603m2256l3079N150L158L9961j8872K3013K1604K9542N693j1607
8618E1968N372J2054J9876L230l5406m1594k1709M180p240j4125J4827K8895M598
8605B4926j3102n0295l6731M6585L3530m9425q865K4309L8765L7194L0372J6517
8593I3780L760j158M952o172k696k7374k5570R158K7330k7225J392k2925K2439
8580D9691O8143J3269l0498m4764l47p168j5836L1334M2629L6045n634m6048r5777
8567d961J0661K0366M0308M3921j1229n6715j7975J1021j113R8922P1957O687
8555B11850p6059k2721j6634n4679o566K674k7103p0482l723Q7285O3154J3475
8543A00471j2713j0782j2336p566l8277J6752P705l3163m3621o562L291j436J8715
$$ plain form
8530 -19522 184 -35427 -89866 -71279 15195 -8345 -32695 16678 66875 82529 71979 27972
8518 27972 73850 70086 52596 97978 138443 90899 45560 33088 19704 -6471 10247 -45703
8506 -45703 -8322 -19157 -65262 -58795 -63433 -45353 28672 16089 10143 -31239 -45382 -44515 -13809
8493 -13809 7657 52092 30594 31278 13081 27623 58386 53567 13338 -13694 5121 -44819
8481 -44819 -93213 -38570 7630 10627 -20371 8985 15140 44808 27804 2430 -16881 3472
8469 3472 -52824 -50211 -75844 -62231 -6842 46978 102064 179162 157366 121754 50352 25787
8457 25787 38018 11149 -8303 -5461 41793 64918 77546 62531 15871 26041 63791 73808
8445 73808 12159 11775 -2491 -24271 14160 26930 -6973 -61991 -63691 -44929 3874 18514
$$ packed form
8530a9522J9706l5611n4439J8587Q6474k3540k4350M9373N0197J5654j0550m4007
8518B7972M5878l764j7490M5382M0465m7544m5339j2472j3384k6175J6718n5950
8506d5703L7381j0835m6105O467m638J8080P4025j2583n946m1382j4143Q67L0706
8493a3809K1466M4435k1498O84j8197J4542L0763m819m0229k7032J8815m9940
8481d4819m8394N4643M6200K997l0998K9356O155K9668j7004k5374j9311K0353
8469C472n6296K613k5633J3613N5389N3820N5086P7098k1796l5612p1402k4565
8457B5787J2231k6869j9452K842M7254K3125J2628j5015m6660J0170L7750J0017
8445G3808o1649l84j4266k1780L8431J2770l3903n5018j700J8762M8803J4640
$$ plain form
8433 18514 -33493 -65450 -55466 -47968 -56228 -52771 1507 -190 -43302 -4481 27938 46148 69428
8420 69428 62950 17076 35484 17805 -18714 -50762 -6599 73392 30641 6925 42934 -5961
8408 -5961 -15179 -16173 65364 49928 59196 88634 93408 94853 81321 97722 125297 59079 18257
8395 18257 7035 30332 64105 88730 66360 108742 152036 85797 60253 27598 -60308 -5442
8383 -5442 -1543 -25116 7311 -10715 -42777 -50855 -12909 -14329 -84650 -133464 -104239 -66076 -70610
8370 -70610 -101030 -19488 31183 36999 -17832 -7741 -48134 -62467 -46885 -31815 -72571 -48609
8358 -48609 -75290 -25769 41245 25859 34509 26759 34107 31753 -6164 -19860 -4636 -6160 -21735
8345 -21735 -9461 3961 -24169 -37514 26277 34996 33936 81310 51517 17864 16954 24091 8936
$$ packed form
8433A8514n2007l1957R984P498q260L457N4278j697m3112L8821L2419J8210K3280
8420F9428o478m5874J8408j7679l6519l2048M4163P9991m2751k3716L6009m8895
8408e961r218r94Q1537j5436R268K9438M774J445j3532J6401K7575o6218m0822
8395A8257j1222K3297L3773K4625k2370M2382M3294o6239k5544l2655q7906N4866
8383e442L899k3573L2427j8026l2062q078L7946j420p0321m8814K9225L8163m534
8370g0610l0420Q1542N0671N816n4831J0091m0393j4333J5582J5070m0756K3962
8358d8609k6681M9521O7014j5386Q650p750P348k354l7917j3696J5224j524j5575
8345b1735J2274J3422k8130j3345O3791Q719j060M7374k9793l3653r10P137j5155
$$ plain form
8332 8936 -30537 -69018 -81841 -14815 11845 -19416 -74082 -63669 -54670 -61252 -20617 -18070 -27155
8319 -27155 3709 28514 37853 53682 54034 -43057 -90665 -26828 8300 -18879 -48394 -30839
8307 -30839 -3766 30039 34624 66774 300 -30760 -10550 27009 -4755 -24681 27784 73429
8295 73429 28695 -4969 -8849 -41295 -54967 -52560 -35618 -39490 -28952 -39313 -12914 29831
8283 29831 30400 -16020 -33259 -28849 -18871 30636 64531 26954 45127 5730 1061 18513 -5139
8270 -5139 -10511 13909 -34243 -23403 12837 82260 45727 68188 74105 8273 17149 39623 58243
8257 58243 59153 15053 -24914 -39672 -37701 -17124 4358 27135 66949 -15621 -37695 -42889 -15744
8244 -15744 4570 -26372 -698 51506 7740 -50773 -32215 42852 44964 117 -5656 -14086
$$ packed form
8332H936l9473l8481j2823O7026K6660l1261n4666J0413Q999o582M0635K547r085
8319b7155L0864K4805R339J5829L52r7091m7608O3837L5128k7179k9515J7555
8307c0839K7073L3805M585L2150o6474l1060K0210L7559l1764j9926N2465M5645
8295G3429m4734l3664l880l2446j3672K407J6942l872J0538j0361K6399M2745
8283B9831N69m6420j7239M410R978M9507L3895l7577J8173l9397m669J7452k3652
8270e139n372K4420m8152J0840L6240O9423l6533K2461N917o5832Q876K2474J8620
8257E8243R10m4100l9967j4758J971K0577K1482K2777L9814q2570k2074n194K7145
8244a5744K0314l0942K5674N2204m3766n8513J8558P5067K112m4847n773q430
$$ plain form
8232 -14086 -29325 35253 55262 5196 19285 38532 21554 38695 52533 93910 116399 -19732
8220 -19732 -73477 -1093 -14482 -10982 -10527 14026 43833 52187 58665 81871 95937 23959 4519
8207 4519 -10305 -31517 -46980 -75896 -18890 55872 23451 22674 88720 126387 136885 105705
8195 105705 89295 31301 1580 -15112 7786 11317 -17958 -43968 -27405 -40922 -42736 -48925
8183 -48925 -27964 -22934 18230 34350 35433 40476 54823 14286 -1351 -40017 -5375 37364
8171 37364 10299 -15931 -72687 -98631 -76104 -31652 -58942 -88540 29768 76810 99351 72881
8159 72881 45437 14774 55279 128287 133728 55286 34013 10166 10904 7446 -24770 -76018 -66060
8146 -66060 -49184 -29606 -50433 -43330 7533 40528 26268 -30419 -18026 -6459 -77744 -92959
$$ packed form
8232a4086j5239O4578K0009n0066J4089J9247j6978J7141J3838M1377K2489j36131
8220a9732n3745P2384j3389L500M55K4553K9807Q354O478K3206J4066p1978j9440
8207D519j4824k1212j5463k8916N7006P4762l2421p77O6046L7667J0498l1180
8195A05705j6410n7994k9721j6692K2898L531k9275k6010J6563j3517j814o189
8183d8925K0961N030M1164J6120J083N043J4347m0537j5637l8666L4642M2739
8171C7364k7065k6230n6756k5944K2527M4452k7290k9598J18308M7042K2541k6470
8159G2881k7444l0663M0505P3008N441p8442k1273k3847P38l458l2216n1248R958
8146f6060J6876J9578k0827P103N0863L2995j4260n6687J2393J1567p1285j5215
$$ plain form
8134 -92959 -26221 -41657 14988 45741 30400 -41378 -48185 -43085 -32904 5876 29080 44919
8122 44919 67829 76321 74367 72852 25580 31200 36372 -13234 -23315 -41375 28233 105456 72954
8109 72954 -807 -72615 -91325 -129017 -84900 -21269 -45232 -66527 -41374 -28658 20081 -6372
8097 -6372 -20772 8062 -19339 -12368 9309 19447 -7718 10105 10363 15149 60181 53156 37026
8084 37026 18021 12552 14342 41502 5602 -6857 -13138 -49602 -70147 5357 47797 58970
8072 58970 85339 59253 -4605 5976 74630 80862 55818 11566 42960 5047 -40728 -52507
8060 -52507 -22820 2857 -11292 -10498 5190 52596 52914 51090 21497 4508 -14318 -8315 84635
8047 84635 100762 61864 94099 128605 133449 42911 8404 16275 27375 13260 -8809 5562
$$ packed form
8134i2959O6738j5436N6645L0753j5341p1778o807N100J0181L8780K3204J5839
8122D4919K2910Q492j954j515m7272N620N172m9606j0081j8060O9608P7223l2502
8109G2954p3761p1808j8710l7692M4117O3631k3963k1295K5153J2716M8739k6453
8097f372j4400K8834k7401O971K1677J0138k7165J7823K58M786M5032p025j6130
8084C7026j9005n469J790K7160l5900j2459o281l6464k0545P5504M2440J1173
8072E8970K6369k6086o3858J0581O8654O232k5044m4252L1394l7913m5775j1779
8060e2507K9687K5677j4149P94J5688M7406L18j824k9593j6989j8826O003R2950
8047H4635J6127l8898L2235L4506M844r0538l4507P871J1100j4115k2069J4371
$$ plain form
8035 5562 27777 27393 12851 5193 -8010 -1421 3313 37847 33031 36838 43493 34597 29677 39302
8021 39302 49358 71549 87173 63942 56685 72363 68056 47780 93135 58789 40990 59151
8009 59151 68489 90990 70143 59876 69992 83363 121950 158368 170323 205094 183642 131451
7997 131451 66729 92052 137157 126352 75163 118541 168238 124196 84767 98936 131079 164702
7985 164702 137742 77223 28430 50704 108497 113627 100465 60171 34823 69559 96003 71989
7973 71989 38818 6061 39099 37465 48170 34025 -12920 29484 97849 42878 22694 33283
7961 33283 32768 -5449 -23597 -46006 -88254 -79361 -37917 -22442 22280 79293 10854 -43680
7949 -43680 13637 21497 37495 57550 85820 134990 185743 216981 138355 81180 80016 86505
$$ packed form
8035E562K2215l84j4542p658j3203O589M734L4534m816L807O655q896m920R625
8021C9302J0056K2191J5624k3231p257J5678m307k0276M5355l4346j7799J8161
8009E9151R338K2501k0847j0267J0116J3371L8587L6418J1955L4771k1452n2191
7997A31451o4722K5323M5105j0805n1189M3378M9697m4042l9429J4169L2143L3623
7985A64702k6960o0519m8793K2274N7793N130j3162m0294k5348L4736K6444k4014
7973G1989l3171l2757L3038j634J0705j4145m6945M2404O8365n4971k0184J0589
7961C3283n15l8217j8148k2409m2248Q893M1444J5475M4722N7013o8439n4534
7949d3680N7317P860J5998K0055K8270M9170N0753L1238p8626n7175j164O489
$$ plain form
7937 86505 64323 46307 73964 107782 102949 79708 75769 78637 86628 69529 85850 69085 81254
7924 81254 94465 64542 80696 113772 76891 7097 -13518 18258 34475 26147 56236 71360
7912 71360 52621 63213 36469 38052 24453 67725 133235 116701 129821 137889 103120 32639
7900 32639 12343 50319 38347 -19563 -11676 56666 53782 66600 95445 36168 -45804 30492
7888 30492 31522 21418 34205 42131 33048 -25922 -28359 -76754 -82034 -44312 1262 24764 38879
7875 38879 39849 -24475 -37732 14046 21445 5482 15171 58863 52894 104739 169506 129697 31876
7862 31876 -20759 -24847 -25140 1467 -20805 5607 81280 53595 21499 11809 11156 -8470 -10466
7849 -10466 38069 50061 31386 -6133 -284 26590 82188 48217 46484 24837 5523 -38873
$$ packed form
7937H6505k2182j8016K7657L3818m833k3241l939K868P991j7099J6321j6765J2169
7924H1254J3211k9923J6154L3076l6881o9794k0615L1776J6217q328L0089J5124
7912G1360j8739J0592k6744J583j3599M3272O5510j6534J3120Q068l4769p0481
7900C2639k0296L7976j1972n7910P887O8342k884J2818K8845n9277q1972P6296
7888C0492J030j0104J2787P926r083n8970k437m8395n280L7722M5574K3502J4115
7875C8879R70o4324j3257N1778P399j5963R689M3692n969N1845O4767l9809r7821
7862C1876n2635m088k93K6607k2272K6412P5673k7685l2096r690o53j9626j996
7849a0466M8535J1992j8675l7519N849K6874N5598l3971j733k1647j9314m4396
$$ plain form
7837 -38873 -52109 -26096 -7890 -53375 -75706 -52597 -17587 -35728 -82712 -64438 -7723 -2679
7825 -2679 -51210 -55700 3032 15805 8736 -37444 -50015 -71415 -103557 -53005 -27754 -23734 -1431
7812 -1431 36478 37543 48045 40115 29942 -2627 29087 44132 56412 79674 91465 53221
7800 53221 1886 -67799 -125936 -153304 -121730 -25217 22422 37366 67456 95154 140490 166222
7788 166222 169496 100598 -24287 -46005 -4053 11148 17430 -44714 -76987 -44366 -33975 -23623
7776 -23623 -32582 -43105 -50174 -58232 -57254 -6273 -5522 -14666 22942 -22026 -7509 63288 75384
7763 75384 36659 8425 59143 32645 59229 91313 90798 7131 -55018 -93530 -92383 -16977
7751 -16977 12772 -16687 -68565 -106558 -92104 -115647 -83919 -94782 -96195 -65102 -75248 -71257
$$ packed form
7837c8873j3236K6013J8206m5485k2331K3109L5010j8141m6984J8274N6715N044
7825b679m8531m490N8732J2773p069m6180j2571k1400l2142N0552K5251M020K2303
7812a431L7909J065J0502p930j0173l2569L1714J5045J2280K3262J1791l8244
7800E3221n1335o9685n8137k7368L1574R6513M7639J4944L0090K7698M5336K5732
7788A66222L274o8898j24885k1718M1952J5201O282o2144l2273L2621J0391J0352
7776b3623q959j0523p069q058R78N0981P51r144L7608m4968J4517P0797J2096
7763G5384l8725k8234N0718k6498K6584L2084n15q3667o2149l8512J147P5406
7751a6977K9749k9459n1878l7993J4454k3543L1728j0863j413L1093j0146L991
$$ plain form
7739 -71257 -54067 -14193 -4587 -27869 -22820 -37946 -42380 -20010 -14266 -24683 -13419 -19463 -42523
7726 -42523 -117027 -109002 -44485 -25312 -27453 -74219 -143984 -171519 -138731 -40553 -23490 -19964
7714 -19964 -26889 -38960 -88755 -89112 -37864 9456 -8927 -37770 -25339 -7380 28492 513
7702 513 18897 42378 24578 47171 33062 -49430 -97904 -78039 -61573 -88817 -115357 -95808
7690 -95808 -77083 -68148 -7723 25521 2237 13432 55510 32802 4243 -1804 23696 80483
7678 80483 102484 76949 -11275 -37839 -68846 -117603 -112499 -104823 -126257 -155380 -178855 -154284
7666 -154284 -72578 -62618 -103064 -67873 -76294 -114133 -89042 -82900 -83187 -49175 -50227 -785 16497
7653 16497 -7549 -42300 -26440 -24783 -11204 1550 -50931 -84673 -51625 -32070 -8188 9700
$$ packed form
7739g1257J7190L9874R606k3282N049j5126m434K2370N744j0417J1264o044k3060
7726d2523p4504Q025O4517J9173k141m6766o9765k7535L2788R8178J7063L526
7714a9964o925j2071m9795l57N1248M7320j8383k8843J2431J7959L5872k7979
7702E13J8384K3481j7800K2593j4109q2492m8474J9865J6466k7244k6540J9549
7690i5808J8725Q935O0425L3244k3284J1195M2078k2708k8559o047K5500N6787
7678H0483K2001k5535q8224k6564l1007m8757N104P676k1434k9123k3475K4571
7666a54284Q1706R960m0446L5191q421l7839K5091O142k87L4012j052M9442J7282
7653A6497k4046l4751J5860J657J3579J2754n2481l3742L3048J9555K3882J7888
$$ plain form
7641 9700 9652 21645 27821 36782 -1208 -8360 -37701 -83126 -37371 -31313 -39862 -78618 -104881 -79223
7627 -79223 -35770 -21929 -22592 3931 -15736 -23812 -34157 -29208 -30106 -6963 -2481 -19695 6085
7614 6085 -19088 -89599 -107560 -67041 -34937 -17524 -17012 -11815 -22225 -51042 3517 58199 60165
7601 60165 49913 50348 38128 31730 38259 61410 59874 -22948 -89477 -80718 -104577 -84759 -82341
7588 -82341 -72652 -83185 -106748 -43644 7007 25039 48200 54741 60633 67183 106242 165312 148544
7575 148544 77248 10864 -52508 -41030 -53283 -50103 -36317 25483 33060 32086 33566 10672 11272
7562 11272 -7585 -47154 -53912 -41003 -96104 -109033 -88607 -78894 -35507 -39479 -16247 2117
7550 2117 -20529 -65026 -115581 -113488 -58469 -32120 298 -25939 -22740 18807 -42340 -23687
$$ packed form
7641I700m8J1993O176Q961l7990p152k9341m5425M5755O058q549l8756k6263K5658
7627g9223M3453J3841o63K6523j9667q076j0345M949q98K3143M482j7214K5780
7614F085k5173p0511j7961M0519L2104J7413N12N197j0410k8817N4559N4682J966
7601F0165j0252M35j2220o398O529K3151j536q2822o6529Q759k3859J9818K418
7588h2341R689j0533k3563O3104N0651J8032K3161O541N892O550L9059N9070j6768
7575A48544p1296o6384o3372J1478j2253L180J3786O1800P577r74J480k2894O00
7562A1272j8857l9569o758J2909n5101j2929K0426R713M3387l972K3232J8364
7550B117k2646m4497n0555K093N5019K6349L2418k6237L199M1547o1147J8653
$$ plain form
7538 -23687 -80809 -58081 -11123 9824 -19289 -88160 -82647 -33985 -9635 -39322 -46164 -47791
7526 -47791 -8972 -12887 -60097 -30517 81378 97185 25305 -57307 -66805 -19259 4172 -60133
7514 -60133 -91176 -90499 -71138 -22704 -30338 -6248 -50358 -67611 -39795 -4164 -26542 1243
7502 1243 -36706 -43493 3599 -11874 -9904 -25126 -24576 -1296 13445 -21113 -64473 -81972 -39
7489 -39 58498 11589 -32957 -76516 -74109 -80804 -52752 -63911 -40984 -41818 -53135 -88425 -88182 -92640
7475 -92640 -78406 -76412 -46556 8024 440 9906 12242 27194 -22968 -72514 -81875 -36676 -56133
7462 -56133 -46204 -332 -16351 -45406 -52793 -71424 -67659 -50111 -82820 -87803 -107944 -106969 -89108
7449 -89108 -133183 -115192 -83424 -100571 -84955 -48976 27628 61379 6518 -32345 -87382 -115651
$$ packed form
7538b3687n7122K2728M6958K0947k9113o8871N513M8662K4350k9687o842j627
7526d7791L8819l915m7210K9580J11895J5807p1880q2612r498M7546K3431o4305
7514f0133l1043O77J9361M8434p634K4090m4110j7253K7816L5631k2378K7785
7502A243l7949o787M7092j5473J970j5222N50K3280J4741l4558m3360j7499Q1933
7489c9N8537m6909m4546m3559K407o695K8052j1159K2927q34j1317l5290K43m458
7475i2640J4234J994K9856N4580p584R466K336J4952n0162m9546r361M5199j9457
7462e6133R929M5872j6019k9055p387j8631L765J7548l2709m983k0141R75J7861
7449h9108m4075J7991L1768j7147J5616L5979P6604L3751n4861l8863n5037k8269
$$ plain form
7437 -115651 -39249 -10747 -55199 -79608 -99533 -7043 34957 25248 -15358 23008 6918 -58256
7425 -58256 -84963 -73395 -70815 -78667 -61263 -66317 -59012 -66637 -57108 -78482 -87769 -51734 -36592
7412 -36592 -27371 -53699 4725 -579 4997 -5601 -24017 9168 12774 26278 3226 10542 83219
7399 83219 55132 -17272 -20768 9256 -11432 -66685 -114276 -52515 5681 64738 66520 52793
7387 52793 59804 102353 141379 103238 56476 17482 -54490 -38228 5625 -76392 -153191 -142808
7375 -142808 -111232 -73991 -48473 -18315 -27427 -47309 -46606 -45764 -46145 -76332 326 30729 67650
7362 67650 93421 62021 41587 37920 36033 -4581 -41832 -50287 -39514 -16949 -35780 -31018 -60629
7349 -60629 -13753 20469 -6222 -84865 -100993 -72003 -24657 33863 28227 4739 949 -35402
$$ packed form
7437a15651P6402K8502m4452k4409j9925R2490M2000r709m0606L8366j6090o5174
7425e8256k6707J1568K580p852J7404n054P305p625R529k1374r287L6035J5142
7412c6592R221k6328N8424n304N576j0598j8416L3185L606J3504k3052P316P2677
7399H3219k8087p2404l496L0024k0688n5253m7591O1761N8196N9057J782j3727
7387E2793P011M2549L9026l8141m6762l8994p1972J6262M3853q2017p6799J0383
7375a42808L1576L7241K5518L0158r112j9882P03Q42l81l0187P6658L0403L6921
7362F7650K5771l1400k0434l667j887m0614l7251q455J0773K2565j8831M762k9611
7349f0629M6876L4222k6691p8643j6128K8990M7346N8520n636k3488l790l6351
$$ plain form
7337 -35402 -52517 -49580 -87118 -29083 -21650 -29159 -46517 -87368 -110814 -103491 -90344 -73917 -80410
7324 -80410 -80672 -98479 -48472 -11716 -33379 -4464 23837 -30262 -18391 29330 31502 19501
7312 19501 81116 90528 8754 -12429 19590 11298 35409 62826 2718 -4567 -26493 -5486
7300 -5486 -14756 -41002 -7555 45760 -1792 -10435 -46458 -37901 2400 -15359 22899 25200 25662
7287 25662 12914 -18556 -26991 -49304 -55001 -3014 61088 35498 10130 -6909 -5695 -9254 -69252
7274 -69252 -77315 -34150 20821 -21617 -17836 -27215 -51766 1874 60132 51651 12602 -32609 12505
7261 12505 29447 22903 60499 33113 17465 1518 -23012 -43653 -59116 -31459 -6559 -9583
7249 -9583 -33867 -28230 -54449 -64571 -92066 -61815 -21509 -19076 -58497 -75914 -64693 -69007 -62625
$$ packed form
7337c5402j7115K937l7538N8035P433p509j7358m0851k3446P323J3147J6427o493
7324h0410k62j7807N0007L6756k1663K8915K8301n4099J1871M7721K172j2001
7312A9501O1615R412q1774k1183L2019q292K4111K7417o0108p285k1926K1007
7300e486r270k6246L3447N3315m7552q643l6023Q557M0301j7759L8258K301M62
7287B5662j2748l1470q435k2313n697N1987O4102k5590k5368j7039J214l559n9998
7274f9252q063M3165N4971m2438L781r379k4551N3640N8258q481l9049m5211M5114
7261A2505J6942o544L7596k7386j5648j5947k4530k0641j5463K7657K4900l024
7249i583k4284N637k6219j0122k7495L0251M0306K433l9421j7417J1221m314O382
$$ plain form
7236 -62625 -19252 10706 10748 -11161 -29367 -90859 -39740 -8247 -22704 -55659 -75949 -51894
7224 -51894 -57310 -56612 2867 -16109 -5263 -30702 -6694 3258 -67395 -77814 -92636 -56678 -10436
7211 -10436 20677 24521 20180 9904 50200 64263 72092 17242 33799 59967 43082 22242
7199 22242 16830 -78931 -148652 -139561 -46880 318 -61895 -101392 -113305 -89298 -95496 -79437
7187 -79437 -58010 -19699 -37396 -51567 -25351 -17816 -38572 -28478 25715 23128 39756 -4252
7175 -4252 62282 71251 10417 39863 48325 4318 3822 -3821 38432 49815 20464 -12652 -20137
7162 -20137 5016 37979 -41732 -89789 -65215 -99028 -130878 -125721 -110499 -89071 -85237 -122115
7150 -122115 -98034 -68053 -9819 -14257 -29206 -5643 8982 12074 -7184 -49479 -42151 -16062
$$ packed form
7236f2625M3373K9958M2k1909j8206o1492N1119L1493j4457l2955k0290K4055
7224e1894n416O98N9479j8976J0846k5439K4008R952p0653j0419j4822L5958M6242
7211a0436L1113L844m341j0276M0296J4063P829n4850J6557K6168j6885k0840
7199B2242n412r5761o9721R091R2681M7198o2213l9497j1913K4007o198J6059
7187g9437K1427L8311j7697j4171K6216P535k0756J0094N4193k587J6628m4008
7175d252O6534Q969o0834K9446Q462m4007m96p643M2253J1383k9351l3116p485
7162b0137K5153L2963p9711m8057K4574l3813l1850N157J5222K1428L834l6878
7150a22115K4081K9981N8234m438j4949K3563J4625L092j9258m2295P328K6089
$$ plain form
7138 -16062 -24072 12495 -2005 13935 37173 24704 -10537 -54483 -6804 12530 -694 -88805
7126 -88805 -98000 -46855 -39719 -53968 -52828 -76584 -31544 468 -22422 5080 34545 31318 45395
7113 45395 49559 62972 12183 35663 50096 18041 26645 20719 20584 -7769 -50082 -57710 -51530
7100 -51530 -226 4508 -2073 21168 10372 -8446 26842 70414 56569 64917 31941 17228
7088 17228 -12458 40745 -2228 -37772 -28514 -39031 -88669 -78133 -66108 -55182 -55071 -48193 -60875
7075 -60875 -27240 9626 41882 -12061 -11492 -51264 -78362 -75079 -68160 -36020 -74192 -51027 -95978
7062 -95978 -97766 -58435 -30145 1910 3474 -54381 -76582 -83433 -53356 19399 29604 56998
7050 56998 65544 -13562 -26213 -79170 -68206 -321 26352 -588 -1953 -30371 -33533 -24988 -23640
$$ packed form
7138a6062q010L6567j4500J5940K3238j2469l5241m3946M7679J9334j3224q8111
7126h8805r195N1145P136j4249J140k3756M5040L2012k2890K7502K9465l227J4077
7113D5395M164J3413n0789K3480J4433l2055Q604n926j35k8353m2313p628O180
7100e1530N1304M734o581K3241j0796j8818L5288M3572j3845Q348l2976j4713
7088A7228k9686N3203m2973l5544R258j0517m9638J0536J2025J0926J11O878j2682
7075f0875L3635L6866L2256n3943N69l9772k7098L283O919L2140l8172K3165m4951
7062i5978j788L9331K8290L2055J564n7855k2201o851L0077P2755J0205K7394
7050E6998Q546p9106j2651n2957J0964O7885K6673k6940j365k8418l162Q545J348
$$ plain form
7037 -23640 -30505 -35338 -55854 -84662 -83575 -9217 39050 56655 96464 104333 71995 16180 37141
7024 37141 82845 70243 31462 61961 50069 10189 -6837 21395 70058 76656 8444 -50286
7012 -50286 -95337 -54426 7239 80626 46213 -35841 -11405 -6725 -33724 -75256 -106620 -46730
7000 -46730 -27668 -21894 1099 -23803 -44142 -27410 -39721 -76967 -42700 -52648 -38632 23081
6988 23081 -2245 -63467 -51046 -65275 -39990 -27290 -57422 -22643 -9986 -11385 8299 -21635
6976 -21635 -67232 -97261 -87182 -30413 -5630 -36895 -82294 -59125 3186 29119 42609 44534
6964 44534 36858 -5690 -11705 -33485 -59187 -61349 -38382 -17436 -55720 -97998 -101804 -163179 -180449
6951 -180449 -174118 -148201 -85244 -10412 4742 -40863 -46870 -21005 28738 40483 22220 41331
$$ packed form
7037b3640o865m833k0516k8808J087P4358M8267J7605L9809P869l2338n5815K0961
7024C7141M5704j2602l8781L0499j1892l9880j7026K8232M8663O598o8212n8730
7012e0286m5051M0911O1665P3387l4413q2054K4436M680k6999m1532l1364N9890
7000d6730J9062N774K2993k4902k0339J6732j2311l7246L4267r948J4016O1713
6988B3081k5326o1222J2421j4229K5285J2700l0132L4779J2657j399J9684k9934
6976b1635m5597l0029J0079N6769K4783l1265m5399K3169O2311K5933J3490J925
6964D4534p676m2548o015k1780k5702k162K2967K0946l8284m2278l806o1375j7270
6951a80449O331K5917O2957P4832J5154m5605o007K5865M9743J1745j8263J9111
$$ plain form
6939 41331 74894 46879 38119 -17943 -64151 -41841 40370 33601 -41722 -92524 -108865 -53596
6927 -53596 -24222 -49662 -54540 -75795 -78353 -31940 52115 25968 -22342 -1765 33721 2703
6915 2703 -39589 -74394 -89053 -94425 -66716 -76640 -92561 -104979 -112836 -120534 -52721 4755 -8950
6902 -8950 -27737 -6556 -696 -51816 -108076 -107439 -124132 -119529 -113651 -51523 -39925 -4422 55136
6889 55136 85447 111468 65438 7253 2930 867 -41876 -50917 -56280 -40773 -51847 -37209 -68638
6876 -68638 -77278 -47533 -51152 -74794 -61252 -27273 -46789 -56739 -28510 -6908 4214 -6256
6864 -6256 -72068 -108094 -136135 -105981 -54760 -9068 -12504 -66390 -27199 6125 -12892 -16408
6852 -16408 60479 90362 53232 71747 12371 -33029 -92831 -118047 -74723 -26119 9730 30063
$$ packed form
6939D1331L3563k8015q760n6062m6208K2310Q2211o769p5323n0802j6341N5269
6927e3596K9374k5440m878k1255k558M6413Q4055k6147m8310K0577L5486l1018
6915B703m2292l4805j4659n372K7709r924j5921j2418p857p698O7813N7476j3705
6902h950j8787K1181N860n1120n6260O37j6693M603N878O2128J1598L5503N9558
6889E5136L0311K6021m6030n8185m323k063m2743r041n363J5507j1074J4638l1429
6876f8638q640K9745l619k3642J3542L3979j9516r950K8229K1602J1122j0470
6864f256o5812l6026k8041L0154N1221M5692l436n3886L9191L3324j9017l516
6852a6408P6887K9883l7130J8515n9376m5400n9802k5216M3324M8604L5849K0333
$$ plain form
6840 30063 -26621 9920 17541 43001 -3249 3260 39771 26382 14980 -1718 61595 3044
6828 3044 -22886 10694 43926 -34721 -40890 6227 79069 100081 60880 2920 -45252 -77408
6816 -77408 -53068 -7576 -15264 -64213 -42691 -48421 -51089 -46123 -72217 -23027 36149 30115 38684
6803 38684 -13169 4984 21211 -51584 -142457 -171973 -79962 -43830 -65871 -77992 -80215 -86459
6791 -86459 -89653 -63195 -58672 -56711 -40484 -27327 -57171 -97765 -146100 -133104 -95871 -66263
6779 -66263 -22729 17937 16033 -58720 -72807 -1282 -14274 -54544 -38208 -49125 -26197 11365
6767 11365 44864 58165 89099 82186 74176 43636 19740 49815 74733 60987 51837 37745
6755 37745 -6129 -21370 17769 52267 53662 80955 30540 -54559 -107853 -124408 -127079 -154063
$$ packed form
6840C0063n6684L6541P621K5460m6250O509L6511j3389j1402j6698O3313n8551
6828C044k5930L3580L3232p8647o169M7117P2842K1012l9201n7960m8172l2156
6816g7408K4340M5492p688m8949K1522n730k668M966k6094M9190N9176o034Q569
6803C8684n1853J8153J6227p2795r0873k9516R2011L6132k2041j2121k223o244
6791h6459l194K6458M523J961J6227J3157k9844m0594m8335J2996L7233K9608
6779f6263M3534M0666j904p4753j4087P1525j2992m0270J6336j0917K2928L7562
6767A1365L3499J3301L0934o913q010l0540k3896L0075K4918j3746r150j4092
6755C7745m3874j5241L9139L4498J395K7293n0415q5099n3294j6555k671k6984
$$ plain form
6743 -154063 -94987 -14853 32847 28035 20001 39899 30900 7022 -35771 -55080 -25216 59686
6731 59686 14126 -114210 -119293 -108922 -44627 -37775 -35641 3158 1448 -51103 -93712 -66019
6719 -66019 12845 67865 39044 -44899 -87426 -108864 -66293 -50444 -80073 -98799 -118238 -126155
6707 -126155 -84273 -57708 -48973 -32609 4825 18045 -9913 -38487 -75232 -42872 -30093 -94451
6695 -94451 -47759 -15470 -9459 -59474 -71435 -53697 -70234 -57273 -6274 4473 133 -23837
6683 -23837 -21166 -14662 -45147 -42880 -15145 -44367 -63694 -20793 -22994 -5970 -80164 -79552 -73749
6670 -73749 -100059 -116022 -65106 -34929 -38221 -73349 -72769 -55048 -40685 -21726 -14174 26456 37489
6657 37489 -7568 -8189 -23298 -40345 -37461 -11600 9263 47806 49237 1365 -35819 -39939 -13327
$$ packed form
6743a54063N9076Q0134M7700m812q034J9898q999k3878m2793j9309K9864Q4902
6731E9686m5560j28336n083J0371O4295O852K134L8799j710n2551m2609K7693
6719f6019P8864N5020k8821q3943m2527k1438M2571J5849k9629j8726j9439p917
6707a26155M1882K6565Q735J6364L7434J3220k7958k8574l6745L2360J2779o4358
6695i4451M6692L2289O011n0015j1961J7738j6537J2961N0999J0747m340k3970
6683b3837K671O504l0485K267K7735k9222j9327M2901k201J7024p4194O12N803
6670g3749k6310j5963N0916L0177l292l5128N80J7721J4363J8959P552M0630J1033
6657C7489m5057o21j5109j7047K884K5861K0863L8543J431m7872l7184m120K6612
$$ plain form
6644 -13327 -10807 17611 9512 -18795 -45364 -76927 -80323 -45313 -92777 -53379 32605 1201
6632 1201 -47147 -57908 -44990 -72114 -109703 -112020 -17350 47074 20664 19152 -24393 -26748 -4583
6619 -4583 4746 8449 -901 -49084 -36041 -65750 -108180 -86835 -110588 -72584 -41820 -35787 -20703
6606 -20703 -8568 11089 -33097 -12618 2070 -1262 -56439 -85051 -65809 -105507 -89481 -50045
6594 -50045 -75988 -23401 17828 -48864 -30887 10136 -11037 -15836 12141 38030 -8135 -55060
6582 -55060 -68859 -36695 -22645 22622 94147 74796 15774 17623 158 -4473 18759 16617
6570 16617 38370 70380 65110 27449 29520 26004 24813 -33903 -46901 -3840 11551 8900 -33094
6557 -33094 -61863 -52064 -21988 47542 51760 -19753 -80481 -85092 -60355 -37114 -20268 -29364 -37746
$$ packed form
6644a3327K520K8418q099k8307k6569l1563l396L5010m7464L9398Q5984l1404
6632A201m8348j0761J2918k7124l7589k317R4670O4424k6410j512m3545k355K2165
6619d583R329L703r350m8183J3043k9709m2430K1345k3753L8004L0764O033J5084
6606b0703J2135J9657m4186K0479J4688l332n5177k8612J9242l9698J6026L9436
6594e0045k5943N2587M1229o6692J7977M1023k1173m799K7977K5889m6165m6925
6582e5060j3799L2164J4050M5267P1525j9351n9022J849j7465m631K3232k142
6570A6617K1753L2010n270l7661K071l516j191n8716j2998M3061J5391k651m1994
6557c3094k8769R799L0076O9530M218p1513o0728m611K4737K3241J6846r096q382
$$ plain form
6544 -37746 -33952 -10747 45610 80443 50694 27927 476 -51756 -46107 -15855 -37614 -73878
6532 -73878 -64838 -90822 -85082 -32764 -44574 -35425 -44848 -46708 -7717 -60729 -99097 -12859 3936
6519 3936 -25834 -66104 -115388 -98476 -114088 -88679 -63918 -50160 -30264 -5638 -32209 -48481
6507 -48481 -41908 -46585 -29473 -49048 -54043 -54693 -43281 -4850 16313 -11531 -29068 -3173 12313
6494 12313 51564 74069 72975 54734 -18573 -98987 -129430 -139518 -100093 -35736 13211 1323
6482 1323 29524 49548 1221 -23686 35957 42882 21932 -53733 -92711 -67037 -26485 -34704
6470 -34704 -917 16731 -13014 -28442 3843 8130 70396 68874 26972 17410 49909 31008
6458 31008 18994 -12060 -35204 -48054 -15514 11642 6748 6150 -12120 -38308 -32572 -50430 -32377
$$ packed form
6544c7746L794K3205N6357L4833k9749k2767k7451n2232N649L0252k1759l6264
6532g3878R040k5984N740N2318j1810R149r423j860L8991n3012l8368Q6238J6795
6519C936k9770m0270m9284J6912j5612K5409K4761J3758J9896K4626k6571j6272
6507d8481O573m677J7112j9575m995o50J1412L8431K1163k7844j7537K5895J5486
6494A2313L9251K2505j094j8241p3307q0414l0443j0088L9425O4357M8947j1888
6482A323K8201K0024m8327k4907N9643O925k0950p5665l8978K5674M0552q219
6470c4704L3787J7648k9745j5428L2285M287O2266j522m1902r562L2499j8901
6458C1008j2014l1054k3144j2850L2540K7156m894n98j8270k6188N736j7858J8053
$$ plain form
6445 -32377 -48039 -92980 -19389 61357 58682 -6323 -52788 -42952 -72398 -40173 -37673 -39010 -46938
6432 -46938 -39472 -9772 8132 20596 -26561 -67341 -44886 -48253 -64261 -29560 4079 53404
6420 53404 103558 107613 92793 49025 38509 36051 43022 30088 397 -505 -30231 -48830 -64031
6407 -64031 -68290 -119664 -122161 -36497 -9798 -67843 -114714 -144473 -186157 -148267 -87239 -65458
6395 -65458 -49714 -46986 -86802 -61680 -20877 -6217 13868 16393 -41600 -88767 -36469 -24570
6383 -24570 -20313 18981 -46181 -96317 -74494 -59975 -32100 -9037 15631 17904 75523 60332
6371 60332 3020 -2058 -41334 -11610 -55725 -40826 -2756 -12668 -121498 -167111 -125959 -46182
6359 -46182 -24124 -17576 4629 23080 41646 69146 69223 70612 24517 -6453 -31350 -70253 -80358
$$ packed form
6445c2377j5662m4941P3591Q0746k675o5005m6465R836k9446L2225K500j337p928
6432d6938P466K9700J7904J2464m7157m0780K2455l367j6008L4701L3639M9325
6420E3404N0154M055j4820m3768j0516k458O971j2934k9691r02k9726j8599j5201
6407f4031m259n1374k497Q5664K6699n8045m6871k9759m1684L7890O1028K1781
6395f5458J5744K728l9816K5122M0803J4660K0085K525n7993m7167N2298J1899
6383b4570M257L9294o5162n0136K1823J4519K7875K3063K4668K273N7619j5191
6371F0332n7312n078l9276K9724m4115J4899L8070r912j08830m5613M1152P9777
6359d6182K2058O548K2205J8451J8566K7500P7J389m6095l0970k4897l8903j0105
$$ plain form
6346 -80358 -78323 -76815 -59775 -32734 18268 27276 -27694 -49311 -47003 -30610 -55217 714 -1849
6333 -1849 -3871 47348 78654 47140 -7273 -8701 39223 29148 26596 25432 16934 21961 59445
6320 59445 64384 59246 34823 386 -40995 -32590 -28498 -53302 11094 -5469 -32121 -26429 -39959
6307 -39959 38921 58517 -47727 -71958 -37272 -9058 13337 58832 50885 -17079 -53579 -83829
6295 -83829 -40062 13498 -36385 -19460 4499 409 15208 -37526 -74207 -55831 -115066 -60470
6283 -60470 -37670 -3801 8146 33581 22374 -7340 -48604 1661 44385 95585 46439 -13567
6271 -13567 11225 6797 45032 44192 40987 67863 51733 21258 15878 32876 62181 85443 64071
6258 64071 2947 -52464 -96149 -47826 -29889 -16865 -7816 -46578 33883 54 -19685 6857
$$ packed form
6346h0358K035J508J7040K7041N1002R008n4970k1617K308J6393k4607N5931k563
6333a849k022N1219L1306l1514n4413j428M7924j0075k552j164q498N027L7484
6320E9445M939n138k4423l4437m1381Q405M092k4804O4396j6563k6652N692j3530
6307c9959P8880J9596j06244k4231L4686K8214K2395M5495p947o7964l6500l0250
6295h3829M3767N3560m9883J6925K3959m090J4799n2734l6681J8376n9235N4596
6283f0470K2800L3869J1947K5435j1207k9714m1264N0265M2724N1200m9146o0006
6271a3567K4792m428L8235q40l205K6876j6130l0475n380J6998K9305K3262k1372
6258F4071o1124n5411m3685M8323J7937J3024R049l8762Q0461l3829j9739K6542
$$ plain form
6246 6857 34208 18384 26084 65739 52164 -49810 -109858 -144579 -158339 -161323 -89565 -28688
6234 -28688 -6852 27463 53790 17094 -43781 -20451 -46380 -58662 -68450 -36478 -19997 -5657
6222 -5657 12008 34505 70433 -22228 -42019 -19917 -14648 -30679 -37123 -55967 -68847 -81352
6210 -81352 -76441 -40840 -57179 -35393 -19377 -51948 -15445 -25173 -62204 -87448 -123605 -115854
6198 -115854 -105896 -86069 -46611 -27933 -28354 -46666 -90297 -92810 -59688 -26925 -15844 17755
6186 17755 75352 128719 143700 132241 47235 -32687 -37926 -44232 -62862 -53576 -53716 7160 52153
6173 52153 79609 -5829 -61134 -57266 -44720 -36130 -15120 -9520 -14182 26605 23856 -38448 -58309
6160 -58309 -70739 -28296 1880 1183 -2068 -39623 -12659 28876 50360 82278 49204 63298
$$ packed form
6246F857K7351j5824P700L9655j3575j01974o0048l4721j3760k984P1758O0877
6234b8688K1836L4315K6327l6696o0875K3330k5929j2282r788L1972J6481J4340
6222e657J7665K2497L5928r2661j9791K2102N269j6031o444j8844j2880j2505
6210h1352M911L5601j6339K1786J6016l2571L6503r728l7031k5244l6157P751
6198a15854R958J9827L9458J8678m21j8312m3631k513L3122L2763J1081L3599
6186A7755N7597N3367J4981j1459q5006p9922n239o306j8630R286j40O0876M4993
6173E2153K7456q5438n5305L868J2546Q590K1010N600m662M0787k749o2304j9861
6160e8309j2430M2443L0176o97l251l7555K6964M1535K1484L1918l3074J4094
$$ plain form
6148 63298 83478 135745 138170 130499 72889 44460 19837 40559 5747 -49263 -5137 10109
6136 10109 -3354 -4172 -7509 -72985 -71246 -44960 -16712 -14551 -33602 11045 -7089 -44108 -42056
6123 -42056 -19176 26812 16484 -21661 -34482 -27043 -14432 22644 -8828 -40300 -46962 -55907
6111 -55907 -15187 8825 -874 8317 35660 98750 99795 92985 121796 99948 1300 -40841 -42910
6098 -42910 -36116 -36749 -7325 2005 -31933 -134632 -179689 -171750 -123395 -53702 -36050 -54164 -78562
6085 -78562 -40374 -1372 81110 85738 59223 2895 -42541 -90425 -128254 -182866 -83438 -4789
6073 -4789 -6570 -77985 -119519 -124672 -117812 -179355 -166456 -125266 -57022 -48953 -66932 -79153 -82535
6060 -82535 -46480 -53416 -75944 -107614 -141589 -127369 -79896 -32089 4042 -25101 1380 31024
$$ packed form
6148F3298K0180N2267K425p671n7610k8429k4623K0722l4812n5010M4126J5246
6136A0109j3463q18l337o5476J739K6286K8248K161j9051M4647j8134l7019K052
6123d2056K2880M5988j0328l8145j2821P439J2611L7076l1472l1472o662q945
6111e5907M0720K4012r699R191K7343O3090J045o810K8811k1848r8648m2141k069
6098d2910O794o33K9424R330l3938j02699m5057P939M8355O9693J7652j8114k4398
6085g8562L8188L9002Q2482M628k6515n6328m5436m7884l7829n4612R9428P8649
6073d789j781p1415m1534n153O860o1543J2899M1190O8244Q069j7979j2221l382
6060h2535L6055o936k2528l1670l3975J4220M7473M7807L6131k9143K6481K9644
$$ plain form
6048 31024 26154 -14657 -24527 -21330 -43748 -22848 -6517 -33216 -15959 -38586 8576 -9969
6036 -9969 -21886 37364 54374 69174 72683 10435 -28101 -53335 -1751 9081 59115 105214
6024 105214 89541 21985 -38154 -17477 2514 -24939 -49867 -17518 -9965 2171 30703 42631
6012 42631 54834 17590 16050 -4340 -57151 -80991 -99039 -108425 -24038 -11400 -34283 -31003
6000 -31003 41769 34252 52229 22264 24046 16609 -8893 -24847 28594 -3442 -1695 10670 -41506
5987 -41506 -41699 -31542 10433 64171 61231 32630 -29509 -63505 -65910 -43529 -57301 -68165 1273
5974 1273 25419 6115 -43429 -76596 -81437 -59037 -38919 -9967 -14012 55218 25151 -4804
5962 -4804 -13376 -29905 6318 28362 -9206 -43251 6589 1888 25249 39990 53773 23952
$$ packed form
6048C1024m870m0811r870L197k2418K0900J6331k6699J7257k2627M7162j8545
6036i969j1917N9250J7010J4800L509o2248l8536k5234N1584J0832N0034M6099
6024A05214j5673o7556o0139K0677J9991k7453k4928L2349P553J2136K8532J1928
6012D2631J2203l7244j540k0390n2811k3840j8048r386Q4387J2638k2883L280
6000c1003P2772p517J7977k9965J782p437k5502j5954N3441l2036J747J2365n2176
5987d1506j93J0157M1975N3738k940k8601o2139l3996k405K2381j3772j0864O9438
5974A273K4146j9304m9544l3167m841K2400K0118K8952m045O9230l0067k9955
5962d804q572j6529L6223K2044l7568l4045M9840m701K3361J4741J3783k9821
$$ plain form
5950 23952 -4246 41430 111785 149266 123518 94088 63111 -27841 5981 12011 29429 613
5938 613 -39018 -75645 -25468 42671 36908 65355 11862 -42699 -37666 -11610 62649 66966 15475
5925 15475 -58908 -57251 -86900 -14104 -41703 -64164 -100893 -108281 -131571 -93631 -84806 -92494 -134412
5912 -134412 -156632 -117235 -95347 -40660 3253 78267 113934 33454 -50938 -32099 3370 48959
5900 48959 68775 31517 12776 1605 -36366 -81258 -95886 -83947 186 19317 -25396 18141
5888 18141 42428 14519 -6414 -22750 -41582 -45825 -22921 -25483 -76685 -117249 -113321 -119497 -86718
5875 -86718 -43704 -38349 -37782 -76500 -111258 -119064 -88197 -83990 -3648 80093 57417 32038 18657
5862 18657 25197 115444 78651 26418 753 -38916 -96180 -98528 -43697 -22637 -31418 -58699
$$ packed form
5950B3952k8198M5676P0355L7481k5748k9430l0977r0952L3822O030J7418k8816
5938F13l9631l6627N0177O8139n763K8447n3493n4561N033K6056P4259M317n1491
5925A5475p4383J657k9649P2796k7599k2461l6729p388k3290L7940Q825p688m1918
5912a34412k2220L9397K1888N4687M3913P5014L5667q0480q4392J8839L5469M5589
5900D8959J9816l7258j8741j1171l7971m4892j4628J1939Q4133J9131m4713M3537
5888A8141K4287k7909k0933j6336j8832m243K2904k562n1202m0564L928o176L2779
5875h6718M3014N355N67l8718l4758p806L0867M207Q0342Q3741k2676k5379j3381
5862A8657O540R0247l6793n2233k5665l9669n7264k348N4831K1060q781k7281
$$ plain form
5850 -58699 -79100 -73910 -65462 -54398 -87254 -63439 -89687 -59943 -14319 -36886 -11131 23013
5838 23013 26633 7040 -44147 -77457 -132523 -165426 -131301 -63431 14138 12626 -21606 -36764
5826 -36764 -4004 -8771 -20747 -35244 -61397 -55075 -47387 9758 43922 42639 20537 -25735 13630
5813 13630 30414 -7554 -97574 -121564 -110718 -117617 -20309 -14194 -9761 16630 37055 63426
5801 63426 73093 69392 60238 56050 64478 27963 -12187 -5665 -906 -24844 -54195 -51976 -91093
5788 -91093 -62823 -26910 -10547 -30986 -34539 -69886 -80775 -78062 -72187 -22193 -21408 -58471 -85619
5775 -85619 -86856 -53604 -93925 -161035 -141913 -82208 -43426 -41101 -52455 -68292 -61322 -55895 -87085
5762 -87085 -39974 -40843 -33502 -23494 -15065 -14586 -67489 -72508 -19976 10802 39143 14418 20231
$$ packed form
5850e8699k0401N190Q448J1064l2856K3815k6248K9744M5624k2567K5755L4144
5838B3013L620j9593n1187l3310n5066l2903L4125O7870P7569j512l4232j5158
5826c6764L2760m767j1976j4497k6153O322P688N7145L4164j283k2102m6272L9365
5813A3630J6784l7968r0020k3990J0846o899R7308O115M433K6391K0425K6371
5801F3426R667l701r154m188Q428l6515m0150O522M759k3938k9351K219l9117
5788i1093K8270L5913J6363k0439l553l5347j0889K713N875M9994P85l7063k7148
5775h5619j237L3252m0321o7110J9122N9705L8782K325j1354j5837O970N427l1190
5762h7085M7111q69P341J0008Q429M79n2903n019N2532L0778K8341k4725N813
$$ plain form
5749 20231 -20066 -22801 -20072 42613 64790 28814 -721 26111 44305 13057 -5236 9778
5737 9778 36847 34071 -22049 -22933 -28118 16448 19273 -4244 -26131 -86692 -52713 -30469 -12904
5724 -12904 -16312 -26961 -39778 -54078 -52162 -18260 18390 11678 -19278 -23563 -44086 8296 33347
5711 33347 2919 -62329 -89832 -83396 -32395 -8424 -23568 -31347 -25111 -13887 -6939 5462 -29575
5698 -29575 -36212 -90353 -55053 -40253 -41044 -63098 -103671 -74476 -71135 -48740 -31783 -94222 -90350
5685 -90350 -59451 -58503 -44361 -30398 33500 48272 -7640 -61502 -135988 -201312 -143486 -41763
5673 -41763 -15769 -3275 33684 64184 -305 -47320 -27175 -9321 -19549 56109 41079 14944
5661 14944 -14782 -17349 -59723 -115106 -87656 -38631 -30515 -59804 -100906 -86448 -87267 -90846 -95429
$$ packed form
5749B0231m0297k735K729O2685K2177l5976k9535K6832J8194l1248j8293J5014
5737I778K7069k776n6120q84n185M4566K825k3517k1887o0561L3979K2244J7565
5724a2904l408j0649j2817j4300J916L3902L6650o712l0956m285k0523N2382K5051
5711C3347l0428o5248k7503O436N1001K3971j5144p779O236J1224O948J2401l5037
5698b9575o637n4141L5300J4800p91k2054m0573K9195L341K2395J6957o2439L872
5685i0350L0899R48J4142J3963O3898J4772n5912n3862p4486o5324N7826J01723
5673d1763K5994J2494L6959L0500o4489m7015K0145J7854j0228P5658j5030k6135
5661A4944k9726k567m2374n5383K7450M9025Q116k9289m1102J4458q19l579m583
$$ plain form
5648 -95429 -37006 34619 35641 31093 75725 80755 31405 -18988 -84893 -87595 -56299 -35274 -26865
5635 -26865 -25537 -2591 -654 23685 46149 74689 119074 72999 20821 -53085 -60684 -28690
5623 -28690 60522 112948 68491 77257 70752 58635 52320 47297 17454 2688 -3120 -27459 -37946
5610 -37946 -20659 19792 -707 -31247 -22376 9666 -28157 -72423 -61480 -13846 13044 -15684
5598 -15684 -55752 -66568 -33747 11082 -28882 -40914 -53414 -42714 -45846 -126767 -120857 -75691
5586 -75691 -64209 -30339 -6073 -29696 -96215 -78071 -49564 -64171 -93573 -58700 -49254 -91835
5574 -91835 -81637 -58197 -26847 -17245 -42367 -93755 -112172 -129010 -68889 871 132 -129 5758
5561 5758 -530 -20005 -7882 -3464 -2236 -923 25774 46012 80957 55060 83629 83845 45481
$$ packed form
5648i5429N8423P1625J022m548M4632N030m9350n0393o5905k702L1296K1025Q409
5635b6865J328K2946J937K4339K2464K8540M4385m6075n2178p3906p599L1994
5623b8690Q9212N2426m4457Q766o505j2117o315n023k9843j4766n808k4339j0487
5610c7946J7287M0451k0499l0540Q871L2042l7823m4266J0943M7634K6890k8728
5598a5684m0068j0816L2821M4829l9964j2032j2500J0700l132q0921N910M5166
5586g5691J1482L3870K4266k3623o6519J8144K8507j4607k9402L4873R446m2581
5574i1835J0198K3440L1350R602k5122n1388j8417j6838O0121O9760p39k61N887
5561E758o288j9475J2123M418J228J313K6697K0238L4945k5897K8569K16l8364
$$ plain form
5548 45481 -1485 -15328 -41649 -89405 -144714 -161879 -118882 -61048 -57522 -37323 9849 -14349
5536 -14349 -45165 -35600 5794 35329 35581 11978 28229 48186 82089 79961 -16985 -61435 -27033
5523 -27033 2629 -23384 -75646 -74464 -65019 -103198 -118905 -110318 -136063 -126793 -91811 -116502 -92253
5510 -92253 -74364 -83642 -24460 14998 55111 77838 97507 112451 85723 91783 156926 128047
5498 128047 45767 41865 49625 61074 96938 124442 79582 13958 7084 -2261 29358 9045
5486 9045 12452 -7121 -21682 -3400 -80510 -73360 -36805 -48451 -18334 37882 13381 17785 58113
5473 58113 39166 49408 -20303 -56214 -50965 -24067 -8862 -25701 -46576 -37598 -54805 -85463
5461 -85463 -54079 -70989 -110864 -59816 -88134 -108316 -169619 -133593 -56045 -30131 -44773 -93225
$$ packed form
5548D5481m6966j3843k6321m7756n5309j7165M2997N7834L526K0199M7172k4198
5536a4349l0816R565M1394K9535K52k3603J6251J9957L3903k128r6946m4450L4402
5523b7033K9662k6013n2262J182R445l8179j5707Q587k5745R270L4982k4691K4249
5510i2253J7889r278N9182L9458M0113K2727J9669J4944k6728O060O5143k8879
5498A28047q2280l902P760J1449L5864K7504m4860o5624o874r345L1619k0313
5486I045L407j9573j4561J8282p7110P150L6555j1646L0117N6216k4501M404M0328
5473E8113j8947J0242o9711l5911N249K6898J5205j6839k0875Q978j7207l0658
5461h5463L1384j6910l9875N1048k8318k0182o1303L6026P7548K5914j4642m8452
$$ plain form
5449 -93225 -63255 6199 -8780 -40975 -68180 -54600 -1070 -25405 -26458 -28795 -6891 -33267
5437 -33267 -4818 -5121 -25868 -18613 5104 66710 48026 59172 44466 18131 -28009 -28181 -26435
5424 -26435 -41082 -57854 -6379 -26784 21109 29457 -22154 -32164 -818 3696 -65934 -34977
5412 -34977 -43847 -93212 -65056 -2724 77673 54979 -10758 -58523 -70572 -46973 -23162 -57772
5400 -57772 -33782 10654 21688 -4381 -43460 -56461 14445 29973 -26951 -119739 -140439 -44647
5388 -44647 29001 40220 15999 17918 14234 10470 -15411 -17680 6148 28223 -14474 -52395 -63838
5375 -63838 -66492 -80404 -102892 -110704 -109250 -27212 -10071 -3691 -15590 -15804 29175 -13178 -33014
5362 -33014 -21925 20160 -20510 -66662 -64729 -74824 -58210 -41649 -103045 -104450 -34460 21095
$$ packed form
5449i3225K9970O9454j4979l2195k7205J3580N3530k4335j053k337K1904k6376
5437c3267K8449l03k0747P255K3717O1606j8684J1146j4706k6335m6140j72J746
5424b6435j4647j6772N1475k0405M7893Q348n1611j0010L1346M514o9630L0957
5412c4977q870m9365K8156O2332Q0397k2694o5737m7765j2049K3599K3811l4610
5400e7772K3990M4436J1034k6069l9079j3001P0906J5528n6924r2788k0700R5792
5388d4647P3648J1219k4221J919l684l764k5881k269K3828K2075m2697l7921j1443
5375f3838k654j3912k2488p812J454Q2038J7141O380j1899k14M4979m2353j9836
5362c3014J1089M2085m0670m6152J933j0095J6614J6561o1396j405O9990N5555
$$ plain form
5350 21095 17261 120 -37529 -127021 -147582 -111847 -15226 -24821 -52726 352 18151 -29671
5338 -29671 -37594 -18278 -18156 41380 80457 47127 55017 16836 -10600 -25025 -101453 -120495 -80047
5325 -80047 -54473 -51856 -46206 -39755 -23938 45379 60506 47182 42487 39043 63048 9719 -29292
5312 -29292 -2089 -7688 -15327 -86062 -40226 29012 -18348 -39466 -21872 -17618 -18688 -8323 3332
5299 3332 -7299 -10373 -30457 -38626 -41863 -14999 4919 29894 -10985 -35488 -6920 -5208 -8860
5286 -8860 -58240 -68470 -8771 56201 56702 68552 62294 32046 24653 -2901 -37489 10422 41207
5273 41207 40661 50330 79323 48604 65590 80753 46772 30220 38984 80708 90091 52873 16660
5260 16660 3473 -73593 -48329 -18619 -36930 -26694 -53716 -23790 74734 111555 86694 64937
$$ packed form
5350B1095l834j7141l7649q9492k0561L5735R6621r595k7905N3078J7799m7822
5338b9671p923J9316J22N9536L9077l3330P890l8181k7436j4425p6428j9042M0448
5325h0047K5574K617N650O451J5817O9317J5127j3324m695l444K4005n3329l9011
5312b9292K7203n599p639p0735M5836O9238m7360k1118J7594M254j070J0365J1655
5299C332j0631l074k0084q169l237K6864J9918K4975m0879k4503K8568J712l652
5286h860m9380j0230N9699O4972N01J1850o258l0248p393k7554l4588M7911L0785
5273D1207n46R669K8993l0719J6986J5163l3981j6552Q764M1724R383l7218l6213
5260A6660j3187p7066K5264K9710j8311J0236k7022K9926R8524L6821k4861k1757
$$ plain form
5248 64937 69075 62791 49400 52388 40184 13725 48177 77960 47838 -2864 -15338 -52388
5236 -52388 -58229 -32970 17751 10808 -25208 -35492 3816 7314 -44911 -115217 -81164 -26782
5224 -26782 -43634 -42824 -59482 -16857 646 15205 33106 90267 92644 80256 29079 54932
5212 54932 60487 44503 40972 -16811 -33219 -47528 -53024 -69870 -65764 -25349 -10479 -36766 1719
5199 1719 54725 91632 70883 10252 14191 -3225 27883 -8484 -15981 -25051 -58016 -72074 -84659
5186 -84659 -70139 -83809 -84037 -30506 -27206 -22024 -38026 -27474 -22913 -25435 -7137 31475 -32031
5173 -32031 -12479 14337 59850 91394 29021 -19941 -12951 -6766 -19877 -41061 19491 45330
5161 45330 69440 57324 1200 -8877 17476 58433 89738 58538 61911 33355 20854 8054
$$ packed form
5248F4937M138o284j3391K988j2204k6459L4452K9783l0122n0702j2474l7050
5236e2388n841K5259N0721o943l6016j0284L9308L498n2225p0306L4053N4382
5224b6782j6852Q10j6658M2625J7503J4559J7901N7161K377j2388n1177K5853
5212E4932N555j5984l531n7783j6408j4309n496j6846M106M0415J4870k6287L8485
5199A719N3006L6907k0749o0631L939j7416L1108l6367p497r070l2965j4058j2585
5186h4659J4520j3670k28N3531L300N182j6002J0552M561k522J8298L8612o3506
5173c2031J9552K6816M5513L1544o2373m8962O990O185j3111k1184O0552K5839
5161D5330K4110j2116n6124j0077K6353M0957L1305l1200L373k8556j2501j2800
$$ plain form
5149 8054 9759 34788 9865 -81822 -86058 -59649 3320 11876 -12242 -5079 14426 37418 75497
5136 75497 72547 29584 32116 66276 75514 117501 105522 71537 56035 58637 29087 36052 -13914
5123 -13914 -86218 -113841 -44663 -23972 -32213 -29342 -31278 47393 73088 39086 28305 63318
5111 63318 19274 -6518 16072 36234 -5651 -49921 -34775 -28738 -21069 -14887 -51439 -61173 -66906
5098 -66906 -22135 -7271 -37300 -27746 16883 581 -27260 -39436 -5896 -26019 -32402 4486
5086 4486 -18756 -56383 -66330 -20541 20329 -4005 -8653 -48002 -97377 22578 67226 35233
5074 35233 -31353 -58081 -51895 -60582 -69389 -42467 -56570 -52910 969 -16245 -15968 11170 25733
5061 25733 -49582 -97636 -65978 -47501 -67482 -93383 -46334 -11340 1248 -27214 -33149 -5380
$$ packed form
5149H054J705K5029k4923r1687m236K6409O2969Q556k4118P163J9505K2992L8079
5136G5497k950m2963K532L4160R238M1987j1979l3985j5502K602k9550O965m9966
5123a3914p2304k7623O9178K0691q241K871j936P8671K5695l4002j0781L5013
5111F3318m4044k5792K2590K0162m1885m4270J5146O037P669O182l6552r734n733
5098f6906M4771J4864l0029R554M4629j6302k7841j2176L3540k0123o383L6888
5086D486k3242l7627r947M5789M0870k4334m648l9349m9375J19955M4648l1993
5074C5233o6586k6728O186q687q807K6922j4103L660N3879j7214K77K7138J4563
5061B5733p5315m8054L1658J8477j9981k5901M7049L4994J2588k8462n935K7769
$$ plain form
5049 -5380 -8242 -40741 -12896 2382 -18065 -35539 -19235 22524 -17573 -84556 -117470 -91371
5037 -91371 -73596 -66355 -51739 -35609 1811 38007 5983 47981 89044 21830 -66822 -39457
5025 -39457 1221 -15969 56979 74698 62263 23562 7899 11051 -25770 -25071 -23723 -37046 -24551
5012 -24551 -1493 35730 46610 -6108 -11460 1920 10055 20110 48762 44432 -5289 -9865 -102294
4999 -102294 -128746 -76602 -70814 -88141 -47040 -51117 -66062 -26068 -36556 -12808 -37501 -102515
4987 -102515 -92004 -79350 -38329 -28136 14675 31809 23566 15130 2898 -14456 -31529 31592
4975 31592 31408 33114 4142 1 -14359 -42968 18595 41300 50867 46911 25805 -15422 16017
4962 16017 119157 164851 102264 70902 38319 -34326 -32493 -75660 -134353 -79816 -40229 -26985
$$ packed form
5049e380k862l2499K7845J5278k0447j7474J6304M1759m0097o6983l2914K6099
5037i1371J7775P241J4616J6130L7420L6196l2024M1998M1063o7214q8652K7365
5025c9457M0678j7190P2948J7719j2435l8701j5663L152l6821O99J348j3323J2495
5012b4551K3058L7223J0880n2718n352J3380Q135J0055K8652m330m9721m576r2429
4999a02294k6452N2144N788j7327M1101m077j4945L9994j0488K3748k4693o5014
4987a02515J0511J2654M1021J0193M2811J7134q243q436j2232j7354j7073O3121
4975C1592j84J706k8972m141j4360k8609O1563K2705R567l956k1106m1227L1439
4962A6017J03140M5694o2587l1362l2583p2645J833m3167n8693N4537L9587J3244
$$ plain form
4950 -26985 -27613 -49636 -77717 -46154 -50280 -83492 -39950 -24299 -13066 23807 -8345 -20730
4938 -20730 -25506 -20508 10627 6596 11542 26724 29452 30496 47614 -40716 -80301 -121781 -115478
4925 -115478 -93100 -79492 -60505 1825 15139 53140 63604 61362 52968 45830 63100 74984
4913 74984 63792 32315 1799 30140 -24423 42736 44431 -18477 -25440 992 28167 -13024
4901 -13024 -17676 -710 -30716 -50648 -47307 2310 32987 -21189 -45787 -24319 -705 19936
4889 19936 6814 -15046 -33894 -32293 -75419 -63954 -9335 27360 34011 -41735 -41309 -12707 -17585
4876 -17585 12236 -22565 -38931 -21799 -31719 -68307 -88820 -86634 -11785 -63660 -60125 -18916
4864 -18916 -17980 -41781 -21836 -51926 -136045 -114668 -104875 -88729 -56053 -39146 -32566 -32194 -17808
$$ packed form
4950b6985o28k2023k8081L1563m126l3212M3542J5651J1233L6873l2152j2385
4938b0730m776M998L1135m031M946J5182K728J044J7118q8330l9585m1480O303
4925a15478K2378J3608J8987O2330J3314L8001J0464k242q394p138J7270J1884
4913G4984j1192l1477l0516K8341n4563O7159J695o2908o963K6432K7175m1191
4901a3024m652J6966l0006j9932L341M9617L0677n4176k4598K1468K3614K0641
4889A9936j3122k1860j8848J601m3126J1465N4619L6695O651p5746M26K8602m878
4876a7585K9821l4801j6366J7132r920l6588k0513K186P4849n1875L535M1209
4864a8916R36k3801J9945l0090q4119K1377R793J6146L2676J6907O580L72J4386
$$ plain form
4851 -17808 -9192 -34788 -58494 -90203 -17751 42792 51258 18372 17335 -16348 -75691 -106335
4839 -106335 -67663 -54300 -47031 -49903 -19129 2177 -11791 13323 19239 -27865 6927 -29764
4827 -29764 -59000 -91917 -77501 -62900 4357 32265 15409 -65072 -105478 -116068 -78528 -59150
4815 -59150 -23517 28289 76146 45899 16817 17703 -14393 -988 17908 48666 54331 61941 69542
4802 69542 6620 -36658 -55176 -85318 -114215 -73599 28178 127874 135796 65819 11708 -1743
4790 -1743 -29015 -4742 -5737 19684 57707 41068 -28035 -70656 -107754 -87641 -65134 -92616
4778 -92616 -82163 -63547 -53093 -44000 -16716 -13901 15340 38529 45336 31143 -28915 -69530
4766 -69530 -85191 -64710 -22020 -13449 5988 25656 36033 7629 -37786 -59915 -34831 -21476
$$ packed form
4851a7808Q616k5596k3706l1709P2452O0543Q466l2886j037l3683n9343l0644
4839a06335L8672J3363P269k872L0774K1306j3968K5114N916m7104L4792l6691
4827b9764k9236l2917J4416J4601O7257K7908j6856q0481m0406j0590L7540J9378
4815e9150L5633N1806M7857l0247k9082Q86l2096J3405J8896L0758N665P610P601
4802F9542o2922m3278j8518l0142k8897M0616J01777R9696P922o9977n4111j3451
4790a743k7272K4273r95K5421L8023j6639o9103m2621l7098K0113K2507k7482
4778i2616J0453J8616J0454R093K7284K815K9241K3189O807j4193o0058m0615
4766f9530j5661K0481M2690Q571J9437J9668J0377k8404m5415k2129K5084J3355
$$ plain form
4754 -21476 1410 -5878 -625 13052 4929 -19665 14584 54280 68073 59750 7247 -5019 35877
4741 35877 40204 3792 24824 -19055 -39684 -14121 10849 1246 14645 57496 44680 79045
4729 79045 103195 89807 16713 3076 2957 -31280 -62282 -40551 -61830 -136977 -66286 38477
4717 38477 74061 76548 89909 93808 115742 75607 -20791 -35617 2298 -30139 -55374 -24972
4705 -24972 7285 1735 -41118 8934 29679 -19189 -31177 53302 92515 123834 91900 56509
4693 56509 48316 1937 -15571 -36419 -55341 -59261 -14192 31094 -17636 -32620 -18658 -57860
4681 -57860 -111306 -63302 -75751 -84324 -40541 -43256 -66194 -62177 -93655 -99507 -66369 -37907 -3020
4668 -3020 7480 -13964 2972 -57466 -66971 50571 90405 59361 34526 12434 -56149 -93237
$$ packed form
4754b1476K2886p288N253J3677q123k4594L4249L9696J3793q323n2503j2266M0896
4741C5877M327l6412K1032m3879k0629K5563K4970r603J3399M2851j2816L4365
4729G9045K4150j3388p3094j3637j19l4237l1002K1731k1279p5147P0691J04763
4717C8477L5584K487J3361L899K1934m0135r6398j4826L7915l2437k5235L0402
4705b4972L2257n550m2853N0052K0745m8868j1988Q4479L9213L1319l1934l5391
4693E6509q193m6379j7508k0848j8922l920M5069M5286m8730j4984J3962l9202
4681e7860n3446M8004j2449q573M3783k715k2938M017l1478n852L3138K8462L4887
4668c020J0500k1444J6936o0438r505J17542L9834l1044k4835k2092o8583l7088
$$ plain form
4656 -93237 -24831 -23108 -34801 -36357 -30388 20513 -9546 -20193 -14458 -7357 -682 65393 78018
4643 78018 30453 24518 27060 26093 27858 34555 68209 57025 48321 44404 23677 20739 -14672 -49880
4629 -49880 -28721 -7626 35117 44489 44074 55455 69442 84849 51325 53256 42792 -23461 -59887
4616 -59887 -35672 -45368 -69676 -61413 -58757 -31646 -26281 -33422 -81021 -74384 -52810 -53022 -120936
4603 -120936 -142905 -123718 -49833 -6954 34348 62371 89151 111322 94585 103511 67605 36401
4591 36401 35941 60791 105350 91934 41148 51506 83849 53424 -19658 -81611 -44488 -21023
4579 -21023 -28618 -19165 15467 -20715 -34654 -27525 -59576 -63473 -74423 -16385 -7376 -22207 -72535
4566 -72535 -69772 -113532 -99145 -79953 -93930 -69754 -63748 -95259 -88361 -63701 -47578 -395
$$ packed form
4656i3237O8406J723j1693j556N969N0901l0059j0647N735P101O675O6075J2625
4643G8018m7565n935K542r67J765O697L3654j1184q704l917k0727k938l5411l5208
4629d9880K1159K1095M2743R372m15J1381J3987J5407l3524J931j0464o6253l6426
4616e9887K4215r696k4308Q263K656K7111N365p141m7599O637K1574k12o7914
4603a20936k1969J9187P3885M2879M1302K8023K6780K2171j6737Q926l5906l1204
4591C6401m60K4850M4559j3416n0786J0358L2343l0425p3082o1953L7123K3465
4579b1023p595R453L4632l6182j3939P129l2051l897j0950N8038R009j4831n0328
4566g2535K763m3760J4387J9192j3977K4176O006l1511O898K4660J6123M7183
$$ plain form
4554 -395 29230 52175 94099 87875 54150 37277 31165 30362 -13692 -16262 -42776 -23115 25683
4541 25683 67013 34756 -14270 -72352 -39930 -14588 -64625 -77846 -34511 -57868 -104708 -59445
4529 -59445 -7827 29167 29449 8556 7813 -7093 -29812 -24240 16077 13191 -27810 -94953 -133923
4516 -133923 -139339 -81250 -33645 -22496 -31867 -55751 -47887 -84951 -104374 -55662 1251 29488
4504 29488 68702 42587 -23461 1733 47855 54999 76682 37963 -14850 38889 39208 6270
4492 6270 29415 22969 28168 68987 29727 -49465 -54758 -32029 -49654 373 -5785 -26803 -40444
4479 -40444 7269 7983 34225 77735 -4480 -38261 -1153 72597 62252 -23372 -99568 -86835
4467 -86835 -78740 -108070 -53673 -17619 -50486 -53670 -81951 -63481 -6217 20017 34418 -25646
$$ packed form
4554c95K9625K2945M1924o224l3725j6873o112q03m4054k570k6514J9661M8798
4541B5683M1330l2257m9026n8082L2422K5342n0037j3221M3335k3357m6840M5263
4529e9445N1618L6994K82k0893p43j4906k2719N572M0317k886m1001o7143l8970
4516a33923n416N8089M7605J1149r371k3884P864l7064j9423M8712N6913K8237
4504B9488L9214k6115o6048K5194M6122P144K1683l8719n2813N3739L19l2938
4492F270K3145o446N199M0819l9260p9192n293K2729j7625N0027o158k1018j3641
4479d0444M7713P14K6242M3510q2215l3781L7108P3750j0345q5624p6196J2733
4467h6835Q095k9330N4397L6054l2867l184k8281J8470N7264K6234J4401o0064
$$ plain form
4455 -25646 -72599 -87096 -145803 -185815 -147855 -54368 -28784 26595 4048 1187 -2668 -37157
$$ packed form
4455b5646m6953j4497n8707m0012L7960R3487K5584N5379k2547k861l855l4489
$$ [...]
##END NTUPLES=NMR SPECTRUM
##END=
