##TITLE=Analysis number 313023
Compound Code rdp 00246
Project Code adrs
Chemist Name prosynth
##JCAMPDX= 6.0         $$ Bruker NMR JCAMP-DX V2.0
##DATA TYPE= NMR SPECTRUM
##DATA CLASS= NTUPLES
##ORIGIN= Bruker BioSpin GmbH
##OWNER= NMR
$$ XWIN-NMR		Version 3.5
$$ Tue Aug 23 12:52:19 2005 GMT Daylight Time (UT+1h)  MAYBRIDGE\NMR@NMR_250MHZ
##.OBSERVE FREQUENCY= 250.131544655141
##.OBSERVE NUCLEUS= ^1H
##.ACQUISITION MODE= SIMULTANEOUS (DQD)
##.ACQUISITION SCHEME= undefined
##.AVERAGES= 16
##.DIGITISER RES= 18
##SPECTROMETER/DATA SYSTEM= dpx250
##.PULSE SEQUENCE= zg30
##.SOLVENT NAME= CDCl3
##.SHIFT REFERENCE= (INTERNAL, CDCl3, 0, 16.522)
##AUDIT TRAIL= $$ (NUMBER, WHEN, WHO, WHERE, WHAT)
$$ ##TITLE= Audit trail, XWIN-NMR		Version 3.5
$$ ##JCAMPDX= 5.01
$$ ##ORIGIN= Bruker BioSpin GmbH
$$ ##OWNER= NMR
$$ C:\u/data/dgb/nmr/ADRS/8400/pdata/1/auditp.txt
$$ ##AUDIT TRAIL=  $$ (NUMBER, WHEN, WHO, WHERE, WHAT)
(   1,<2005-08-23 12:51:43.61 +100>,<MAYBRIDGE\NMR>,<NMR_250MHZ>,
      <created by zg, POWCHK disabled, PULCHK disabled
       configuration hash MD5:
       62 19 C7 07 E1 42 D1 B7 37 6C 3D D0 77 39 F9 E6
       data hash MD5: 64K
       DB 2A F4 8F C6 5E E8 29 3A DD 48 40 83 2C 40 65>)
(   2,<2005-08-23 12:52:00.08 +100>,<MAYBRIDGE\NMR>,<NMR_250MHZ>,
      <Start of raw data processing
       ef LB = 0.3 FT_mod = 6 PKNL = 1 SI = 32K 
       data hash MD5: 32K
       03 0B C1 DD E2 AA 06 66 1D 11 71 50 48 3B 39 E2>)
(   3,<2005-08-23 12:52:04.97 +100>,<MAYBRIDGE\NMR>,<NMR_250MHZ>,
      <apk 
       data hash MD5: 32K
       4C 47 23 50 06 69 AC F9 5B FE 8E AE A6 D7 CE 7D>)
(   4,<2005-08-23 12:52:06.44 +100>,<MAYBRIDGE\NMR>,<NMR_250MHZ>,
      <abs ABSG = 5 
       data hash MD5: 32K
       AF 6D CF 63 E8 DC 8D 6D 3B BF 27 3C 98 C5 21 E6>)
$$ ##END=
$$ 
$$ hash MD5
$$ 74 3F A3 89 79 53 61 25 1D EA E0 3E 25 D1 FC 21
##$RELAX= 
##$RELAX= 
##$RELAX= 
##$RELAX= 
##$RELAX= 
##$RELAX= 
##$RELAX= 
$$ Bruker specific parameters
$$ --------------------------
##$DU= <C:\u>
##$EXPNO= 8400
##$NAME= <ADRS>
##$PROCNO= 1
##$TYPE= <nmr>
##$USER= <dgb>
##$AMP= (0..31)
100 100 100 100 100 100 100 100 100 100 100 100 100 100 100 100 100 100 
100 100 100 100 100 100 100 100 100 100 100 100 100 100 
##$AQSEQ= 0
##$AQ_mod= 3
##$AUNM= <au_zg>
##$AUTOPOS= <23 >
##$BF1= 250.13
##$BF2= 250.13
##$BF3= 250.13
##$BF4= 250.13
##$BF5= 500.13
##$BF6= 500.13
##$BF7= 500.13
##$BF8= 500.13
##$BYTORDA= 1
##$CFDGTYP= 0
##$CFRGTYP= 5
##$CHEMSTR= <none>
##$CNST= (0..31)
1 1 145 1 1 1 1 1 1 1 1 1 1 1 1 1 1 1 1 1 1 1 1 1 1 1 1 1 1 1 1 1 
##$CPDPRG= <>
##$CPDPRG1= <>
##$CPDPRG2= <>
##$CPDPRG3= <>
##$CPDPRG4= <mlev>
##$CPDPRG5= <mlev>
##$CPDPRG6= <mlev>
##$CPDPRG7= <mlev>
##$CPDPRG8= <mlev>
##$CPDPRGB= <>
##$CPDPRGT= <>
##$D= (0..31)
0 1 0 0 0 0 0 0 0 0.06 0 0 0 0 0 0 0.0002 0 0 0 0 0 0 0 0 0 0 0 0 0 0 
0 
##$DATE= 1124797902
##$DBL= (0..7)
120 120 120 120 120 120 120 120 
##$DBP= (0..7)
150 150 150 150 150 150 150 150 
##$DBP07= 0
##$DBPNAM0= <>
##$DBPNAM1= <>
##$DBPNAM2= <>
$$ [...]
##$SUBNAM7= <"">
##$SUBNAM8= <"">
##$SUBNAM9= <"">
##$SW= 20.6930455092707
##$SWIBOX= (0..15)
0 0 3 0 0 0 0 0 0 0 0 0 0 0 0 0 
##$SW_h= 5175.983436853
##$TD= 65536
##$TD0= 1
##$TE= 295.16
##$TE2= 300
##$TE3= 300
##$TEG= 300
##$TL= (0..7)
0 120 120 120 120 120 120 120 
##$TP= (0..7)
150 150 150 150 150 150 150 150 
##$TP07= 0
##$TPNAME0= <>
##$TPNAME1= <>
##$TPNAME2= <>
##$TPNAME3= <>
##$TPNAME4= <>
##$TPNAME5= <>
##$TPNAME6= <>
##$TPNAME7= <>
##$TPOAL= (0..7)
0.5 0.5 0.5 0.5 0.5 0.5 0.5 0.5 
##$TPOFFS= (0..7)
0 0 0 0 0 0 0 0 
##$TUNHIN= 0
##$TUNHOUT= 0
##$TUNXOUT= 0
##$USERA1= <user>
##$USERA2= <user>
##$USERA3= <user>
##$USERA4= <user>
##$USERA5= <user>
##$V9= 5
##$VALIST= <valist>
##$VCLIST= <CCCCCCCCCCCCCCC>
##$VD= 0
##$VDLIST= <DDDDDDDDDDDDDDD>
##$VPLIST= <PPPPPPPPPPPPPPP>
##$VTLIST= <TTTTTTTTTTTTTTT>
##$WBST= 1024
##$WBSW= 4
##$XGAIN= (0..3)
0 0 0 0 
##$XL= 0
##$YL= 0
##$YMAX_a= 417339
##$YMIN_a= -392724
##$ZGOPTNS= <>
##$ZL1= 120
##$ZL2= 120
##$ZL3= 120
##$ZL4= 120
##$ABSF1= 16.522
##$ABSF2= -4.171173
##$ABSG= 5
##$ABSL= 3
##$ALPHA= 0
##$AQORDER= 0
##$ASSFAC= 0
##$ASSFACI= 0
##$ASSFACX= 0
##$ASSWID= 0
##$AUNMP= <proc_1d>
##$AZFE= 0.1
##$AZFW= 0.1
##$BCFW= 0
##$BC_mod= 0
##$BYTORDP= 0
##$COROFFS= 0
##$CY= 12.5
##$DATMOD= 1
##$DC= 0
##$DFILT= <>
##$DTYPP= 0
##$F1P= 14.0000005364418
##$F2P= -0.99999901652339
##$FCOR= 0.5
##$FTSIZE= 32768
##$FT_mod= 6
##$GAMMA= 0
##$GB= 0
##$INTBC= 1
##$INTSCL= 1
##$ISEN= 128
##$LB= 0.3
##$LEV0= 0
##$LPBIN= 0
##$MAXI= 10000
##$MC2= 0
##$MEAN= 0
##$ME_mod= 0
##$MI= 0
##$NCOEF= 0
##$NC_proc= -3
##$NLEV= 6
##$NOISF1= 0
##$NOISF2= 0
##$NSP= 0
##$NTH_PI= 0
##$NZP= 0
##$OFFSET= 16.522
##$PC= 1
##$PHC0= -77.56197
##$PHC1= 5.961473
##$PH_mod= 1
##$PKNL= yes
##$PPARMOD= 0
##$PSCAL= 4
##$PSIGN= 0
##$REVERSE= no
##$SF= 250.13
##$SI= 32768
##$SIGF1= 0
##$SIGF2= 0
##$SINO= 400
##$SIOLD= 32768
##$SREGLST= <1H.CDCl3>
##$SSB= 0
##$STSI= 32768
##$STSR= 0
##$SW_p= 5175.98343685301
##$SYMM= 0
##$S_DEV= 0
##$TDeff= 65536
##$TDoff= 0
##$TI= <Analysis number 999999
Compound Code 99
Book Reference 9
Project Code 9>
##$TILT= no
##$TM1= 0
##$TM2= 0
##$TOPLEV= 0
##$USERP1= <user>
##$USERP2= <user>
##$USERP3= <user>
##$USERP4= <user>
##$USERP5= <user>
##$WDW= 1
##$XDIM= 32768
##$YMAX_p= 385280526
##$YMIN_p= -236106
$$ End of Bruker specific parameters
$$ ---------------------------------
##NTUPLES= NMR SPECTRUM
##VAR_NAME=  FREQUENCY,     SPECTRUM/REAL,   SPECTRUM/IMAG
##SYMBOL=    X,             R,               I
##VAR_TYPE=  INDEPENDENT,   DEPENDENT,       DEPENDENT
##VAR_FORM=  AFFN,          ASDF,            ASDF
##VAR_DIM=   32768,         32768,           32768
##UNITS=     HZ,            ARBITRARY UNITS, ARBITRARY UNITS
##FACTOR=    0.157963299565203, 1,           1
##FIRST=     4132.6476996994, 0,             0
##LAST=      -1043.33573715361, 0,           0
##MIN=       -1043.33573715361, -236106,     0
##MAX=       4132.6476996994, 385280526,     0
$$ Real data points
##PAGE= N=1
##DATA TABLE= (X++(R..R)), XYDATA
$$ [...]
17004a0199J4315j2034n135k2353O903K3408m8871j4804L6864K2376K5724k871
16992A3323l5736J1259N85J0326J6671P885J6925J8703j6747j1508l1334k2550
16980b2198J9010M095R208Q331J9882j1570k4122R627J0147K5405J0152N114j9570
16967D3511r915J991k0467j0369N351j9902j7185K6240J1031j2104k8139J6178
16955a3779j5484j9362Q474k589J6790k222j1574j2685j1417M6315L8874J665
16943B3006K0801j1650k3112j5780M08q395k5080r042j1143J3998L3194j6456
16931b9251L20M1311K9358o444m4432n6047m8092L1988N1185L2109J5189k0251
16919c057q080J8782J03k0250K9576M790j9668k811r097J7397J3795J3963n080
$$ y = [-10199, 4116, -7918, -13053, -35406, -28503, -5095, -53966, -68770, -31906, -9530, 16194, 13323, -22413, -11154, -10569, -243, 16428, 24313, 41238, 59941, 43194, 31686, 352, -22198, -3188, 907, 10115, 18446, 38328, 26758, 2636, 12263, 22410, 47815, 57967, 63081, 43511, 33596, 35587, 15120, 4751, 10102, -9800, -26985, -745, 10286, -1818, -29957, -13779, -29263, -48625, -40151, -42740, -25950, -28172, -39746, -52431, -63848, -17533, 21341, 23006, 43807, 32157, 9045, -6735, -6327, -14722, -39802, -48844, -59987, -45989, -12795, -29251, -28931, 12380, 41738, 35294, -9138, -65185, -113277, -81289, -30104, 2005, 17194, -3057, -11137, 7645, 7748, -12502, 17074, 21864, 2196, -615, -9712, 7685, 21480, 35443, 30363]
16906C0363p959r000J9684J9604M547j7202J528j2588j4689K359q907k8964j4146
16893c5370M406k3973j3791M9580L4786o960k7191J1830O119P026j26q774K4124
16880B1686L4701j3967m7249j6717P744j5641k9772j8584K5613L8117K3094K7619
16868C6644o207n0327j5226j5113L436K5408l704q564Q341L0862J4586l700j7504
16855a068l2644j3696J6174M0069m476p891j613l66O2260Q843k6677q914L1996
16842F1997m683j7315k2530j2248j538j0799J389o943J5289j4604m458k8543j9191
16829f4177L0696K7306K8081k6498k1273K6628k92p464k3234l2174L3720M238
16817b4443j5447J2779k135q625m85L3456O599J134K1436K1405J693j2005J9099
$$ y = [30363, 22404, 13404, 33088, 52692, 57239, 40037, 41565, 28977, 14288, 16647, 7740, -21224, -35370, -30964, -54937, -68728, -19148, 15638, 8678, -18513, -6683, -564, 6462, 6336, -2438, 21686, 56387, 42420, -4829, -21546, -13802, -29443, -59215, -77799, -52186, -14069, 9025, 36644, 30437, -19890, -35116, -50229, -46793, -21385, -25089, -33653, -25312, 5550, 20136, 16436, -1068, -33712, -47408, -31234, 8835, 4359, -3532, -5145, -5511, 56749, 65592, 38915, 30001, 61997, 57314, 39999, 17469, 5221, 3683, -7116, -5727, -12670, 2619, -11985, -16443, -44986, -64177, -33481, -6175, 21906, -4592, -25865, 763, 471, -6993, -30227, -62401, -28681, -24443, -39890, -27111, -29246, -37871, -38356, -4900, 1699, 2833, 24269, 45674, 47367, 35362, 54461]
16804E4461R548j9982L824K723J0768K1179j5313o638j1531k6223j7224J1015
16792A6607K2153k4469l3463l127K8743J3376j434J5051J0631k4462o780R386
16780B2212K0608J0143l8588l643j8971q16J4315J8872K2417J5245K2492m0584
16768D3702k7141q425K3089q966j9169J6307j3934K4850K262j5354J3717j355
16756B9583J5969l1300l9442m565N533K866J9112K1628R468l6037n01K4981j2179
16743E116j7571m173j3375l4327O214o953K5235Q852K9708J1904N073j7907l0
16730b234k7467k8434J8311J0687K2520K4447J8858j5384L979M879j1897l4890
16718a6625J0346J2082p232j5470O008K3128N676J0949k9894k7639j8501K1028
$$ y = [54461, 64009, 44027, 47851, 50574, 61342, 82521, 67208, 60570, 49039, 22816, 5592, 16607, 38760, 14291, -19172, -22299, 6444, 19820, 18386, 33437, 44068, 19606, 12826, 22212, 42820, 52963, 14375, 10732, -8239, -9055, 5260, 24132, 46549, 61794, 84286, 43702, 16561, 8136, 31225, 22259, 3090, 19397, 5463, 30313, 32575, 17221, 30938, 29583, 45552, 14252, -25190, -29755, -24222, -21356, -2244, 19384, 28852, -7185, -7686, 17295, 5116, -12455, -16628, -30003, -64330, -58116, -65069, -39834, -30982, -1274, 10630, 15703, -2204, -2234, -29701, -58135, -39824, -29137, -6617, 17830, 36688, 21304, 25283, 30162, 18265, -16625, -6279, 5803, -1429, -16899, -10891, 12237, 17913, 28862, -1032, -28671, -47172, -26144]
16706b6144M887K1389k9976j1358L341j4691J4636K7198K9395J2170J119l5815
16694c849J523k1229J3190J8139n784J0802J3530k5773K928j5061J4334M6296
16682D9046P386k9493l7579M4304J5633r04J5390O68k9668K749J2506k4965m1291
16669a6218k8948P410J0287J5323O160K1208J8686j1017o334K396l9221j8208
16657c8476j0743J4227P800L6258J2038J5765q642j8039k0255j5574l5059j40
16645f0840J8619J867K1213L1032Q225j906l6951l055J1991Q390K5574M495l6756
16632h102M916P044k4186L380l949N868M985K0678J3361q061J5654J0840k4123
16619A8305q430k128L0441J2397Q688j3521k7159M324l6018K9754o862j4541k7097
$$ y = [-26144, -21257, 132, -29844, -41202, -37861, -52552, -37916, -10718, 18677, 30847, 31966, -3849, -2326, -23555, -10365, 7774, 1990, 12792, 26322, 549, 3477, -11584, 2750, 49046, 56432, 26939, -10640, 33664, 49297, 48393, 63783, 64451, 34783, 37532, 50038, 25073, -16218, -45166, -37756, -27469, -12146, -5986, 15222, 33908, 22891, 16557, 18953, -20268, -38476, -49219, -34992, -27192, 9066, 21104, 36869, 28227, 10188, -10067, -25641, -60700, -60840, -42221, -40354, -19141, 11891, 20116, 18210, -18741, -21796, -9805, -1415, 24159, 28654, -8102, -3186, 3858, -20328, -16948, -20897, -15029, -10044, 10634, 23995, 15934, 31588, 42428, 18305, 9875, 7747, 38188, 50585, 59273, 45752, 18593, 22917, -13101, 16653, 9791, -4750, -31847]
16606c1847J0971J8194J3257j0194k4400L5265J4016l3961q348n497j9470L9255
16594b759K3674M274k5646o06K9257J9131r629k0667j3691k2555J809L3484N4
16581A6130l5468l1313o112K5030L6487P498k9462j2683J676K81J3285n249o317
16568b6217N3894K4286l4790k8448k6734J1764o55o339j6115j0717J1778N7709
16556I416J1488N064J9730k579p227p413n5151k0583K1897P742Q014J4091j0853
16543f364k6398J3705k8124j7720K3349L0027j4338J1163J7070L141o454L0651
16531B9708L4536j535j6757n1636l4408r992N360K9829j6557J6945K9931R51J2466
16518B8841k2805R204K1489p367l1683j040J946l8737j4738L2646N842J0699L4504
$$ y = [-31847, -20876, -2682, 10575, 381, -24019, 11246, 25262, -8699, -17047, -22544, -42014, -2759, 20915, 25189, -457, -1063, 28194, 47325, 37696, 17029, 3338, -19217, -17408, 16076, 16130, -19338, -50651, -56763, -31733, 4754, 12252, -17210, -29893, -28217, -27936, -14651, -19900, -26217, 27677, 51963, 17173, -11275, -38009, -26245, -26900, -33239, -49354, -60071, -48293, 9416, 20904, 25968, 45698, 43119, 35892, 28479, -26672, -47255, -25358, -17616, -9602, 4489, -6364, -32762, -19057, -47181, -64901, -41552, -11525, -25863, -14700, 2370, 5511, -943, 29708, 64244, 62709, 45952, -5684, -40092, -50084, -44724, -14895, -31452, -14507, 15424, 16375, 28841, 6036, 15240, 36729, 29362, -2321, -3361, -1415, -40152, -54890, -22244, -16402, -5703, 28801]
16505B8801J8709m4164p857J8390o495J3444P501j7915m395m537q946L862j4164
16492a7766p806k3521m341M6451K4549N143k7423j7362o056n162J5375J7161l180
16479c938L780j4172l793N340K1210j1518k3497j8246J1712K0541m12N646M1134
16466C3787n762o0771j0859M882R69K5903P755Q918j5236J0351j2392j3386J847
16453b3994Q369N0118J1702j6220k3184l5287q220j6284l086L9903j9140k2988
16441e8311p608m027M0989L2535K5824n937R319j8336j2316p006j7831n3228K0866
16428e5067J9529K9113J6259o035O573N69k3369j4406K5948K8878P675l3419j4314
16415a2066J2412M828K802K7330j6749m1890j5326K108O708J9706J7010J2174
$$ y = [28801, 47510, 3346, -4511, 13879, 7384, 20828, 28329, 10414, 6019, 1482, -7464, -3602, -17766, -25572, -49093, -53434, -6983, 17566, 22709, -4714, -22076, -28132, -33294, -17919, -758, -3938, -158, -14330, -18123, -12783, 8427, -3091, -26588, -44834, -33122, -12581, -12993, -7347, 33787, 28025, -32746, -43605, -38723, -37754, -11851, -4096, 4822, -10414, -63, -12455, -25841, -23994, -15625, 34493, 46195, 29975, 6791, -28496, -36716, -53000, -56086, -16183, -35323, -58311, -65919, -69946, -28957, 3578, 29402, 23465, 32784, 14448, 2132, -4874, -22705, -75933, -55067, -35538, -6425, 9834, 3799, 10372, 10941, -12428, -26834, -886, 27992, 35667, 2248, -12066, 346, 5174, 7976, 35306, 18557, -23333, -38659, -36551, -29843, -10137, 6873, 19047]
16403A9047l6212k4257K0186k5478J280j8201r180k0583n025Q139N92L5903L0735
16390b3054J5186J7459L7597k8884n0068k0953J8435K4009N8l443L1486k8626
16378a0798n869J9550j0363L483K755J1857j0072j2079r563j2721q212j2981L151
16365e1862L8351J9209j4416q890o627K3996L5963q472l5412M0181J702j9453
16353A4270J1866m517k2125R824N683k5839K1316P585R079k0228n268J8263j1515
16340H394J436L420j2035j3614k2690k7114J0919K5505K4228j6969p487K3267
16328b740O994k6792q739L2493J0032k6108K7446q73j5253r853q050O701K9124
16315A4382k8162k4578k672q073l0045J4285J9944n35J6647L3819L9753j0998
$$ y = [19047, -17165, -41422, -21236, -46714, -45434, -63635, -72815, -93398, -98423, -90284, -89692, -53789, -23054, -7868, 9591, 47188, 18304, -31764, -52717, -34282, -10273, -10215, -13658, 17828, -10798, -16667, 2883, -7480, -3997, -1242, 10615, 543, -11536, -21099, -33820, -42032, -55013, -51862, -13511, 5698, -8718, -17608, -24235, -239, 35724, 27252, -8160, 32021, 33723, 14270, 26136, 21619, -506, 9318, 15001, -10838, 10478, 18063, 27142, 6914, 1646, 19909, 8394, 9830, 13250, 1215, -12399, -35089, -62203, -51284, -25779, -1551, -18520, -26007, -2740, 4254, -22538, -31277, 1216, 11248, -14860, 12586, 11713, -3540, -13393, -21443, -14742, 14382, -13780, -38358, -41030, -49103, -79148, -64863, -44919, -45454, -28807, 5012, 44765, 33767]
16303C3767j5360j4292Q605J6245J7150L8596J4958k4392m3375l8780q04p944
16291a5626j0103J5627J1258j7109j8054J1530J7260k3308N597Q872m825j1772
16279c0653o585J4289j6932J8286L9318l4428k7715J0881J1457j977r944J4279
16267a9724k7382j0786R265K2664O914K256j0011r723J8429l221j12L5785j6979
16254b625k4270r862J7076J8711J126m985j8421j7716N835J3423M297j0327J5598
16241a2140Q95J1007K3606m0260j8211k6848j190L904J435K1172K1033r431j7710
16228d2738J5510M2671L5501j4798m2064k4436k8024J3828k640P538K9873J7497
16216G718P830P960k330n749j5814J1599K2075R123l2825j7472o503P272N1150
$$ y = [33767, 18407, 4115, 12720, 28965, 46115, 84711, 99669, 75277, 31902, -6878, -7682, -15626, -25729, -10102, 1156, -15953, -34007, -22477, -5217, -28525, -22928, -14056, -18881, -30653, -37238, -22949, -39881, -21595, 17723, -16705, -44420, -33539, -22082, -24059, -34003, -19724, -47106, -57892, -48627, -25963, -19049, -16793, -26804, -36527, -18098, -21319, -21431, 14354, -2625, -26895, -36757, -19681, -970, 156, -4829, -23250, -40966, -35131, -21708, -17411, -27738, -12140, -11245, -238, 23368, -16892, -35103, -61951, -63141, -59237, -57802, -36630, -15597, -25028, -42738, -27228, 15443, 50944, 36146, -5918, -30354, -58378, -44550, -47190, -39652, -9779, 7718, 15548, 23508, 21178, 15429, -385, 11214, 33289, 42412, 9587, -7885, -14388, -7116, 44034]
16203D4034n68j1060k2952k6412J631m477l2073K2493m353K4372R894k1678m0571
16190f1720J2867J4136L0441K1494J4890P315J9114k9937m9726Q361K7430K5099
16178C9764J0051r851r548J463j6022j153j2584j0690l014J7603j583n3418j2174
16165f1156j3902L1330J5651J2713j1676j2044M4313J183J5415k0296l759j3019
16153a5247j4055J2427k9329L456k143j3125j9753R291K5686M2272M4051O617
16141E0148k7028l3933J4570R933L0698j5209l926p008k1915l822p9r834k0744
16128c8149j1983R386J2440p863j6144J274K8103J1851j301k0335L37L4105J7601
16115A9322j661k437j3533p178q13J5554M3004J7135M395k2554l6880k5760J2292
$$ y = [44034, 43466, 32406, 9454, -16958, -15327, -19804, -51877, -29384, -33737, -9365, 529, -21149, -61720, -48853, -34717, -4276, 17218, 32108, 39423, 58537, 28600, -21126, -12765, 14665, 39764, 49815, 39964, 30416, 31879, 15857, 14704, 2120, -8570, -11584, 6019, 4436, -48982, -61156, -75058, -43728, -28077, -15364, -27040, -39084, 5229, 6412, 21827, 1531, -2228, -15247, -29302, -16875, -46204, -42748, -44891, -58016, -77769, -68478, -42792, -520, 43531, 50148, 23120, -10813, 3757, 13690, 44388, 29179, 25253, 18245, -3670, -7492, -7571, -17405, -38149, -50132, -40746, -28306, -36169, -52313, -51039, -22936, -11085, -12386, -32721, -32384, 1721, 19322, 17661, 15224, 1691, -5487, -6300, 9254, 52258, 69393, 73788, 51234, 14354, -11406, 886]
16102H86J1492k8959M0051O402j5154l2657k4311l599L1947K5571n276j7674J0200
16089a081N018L3644P553m2810M743q162R875j3089j0730J4330J145Q488k93m313
16075D318J1041P754N914j2541J3367K1652l99j1879K2824N1861l027K532k8706
16062H4711l7730m0103J0807K3057k678n850q222k4848j0915O344Q363O757J0914
16049B0607L794j0622L693P68n0J0756k1395j8057P543j7974M667m530J3547K2901
16035A5648k1138j9948j083J073L4158K3661j5036k3337Q63K077m279K8478j2173
16022H964j6948J9156J7795J6670J56q995P425l215J694k1127l9880l953j1424
16009c3682j31J3398M2268R468O361J1614k2327m7343n17M2587l17j1976M253
$$ y = [886, 12378, -16581, 23470, 29872, 14718, -17939, -42250, -45849, -13902, 11669, 6393, -11281, -1081, 3937, 37581, 45134, 2324, 7067, -1095, 8780, -4309, -15039, -709, 436, 8924, 8631, 4318, 15359, 23113, 29027, 16486, 29853, 51505, 51106, 39227, 62051, 113912, 110885, 113417, 84711, 46981, 6878, 17685, 40742, 38064, 32214, 23992, -856, -11771, -5427, 2936, 9693, 20607, 24401, 13779, 17472, 18240, 18190, 28946, 7551, -10506, -2963, -20937, -16270, -20800, -7253, 15648, -5490, -25438, -26521, -25448, 8710, 32371, 17335, -6002, -5139, -3062, -7341, 21137, 8964, -7984, 11172, 28967, 45637, 45793, 36798, 44223, 41008, 42702, 21575, -18305, -22258, -33682, -33813, -20415, 21853, 31321, 37682, 49296, 26969, -20374, -20891, 21696, 21379, 9403, 13656]
15996A3656J2145j1954j8923L370k61J2609n717k982m573O303O419j2621j0329
15983a2858j9627j1459Q390L0824J45J155p074N608K3438L0849j7128k9272J6116
15970A9107P040J7171K769j226R847o973j7705l5000k7876L5914r759j1811J4096
15957d406N267K3205q606j6390J8029M1118K0164l1683m2044M162K4531J7948
15945E1295k5516k6733l9777J2000K5191R983J5378j0258k5536j6156K5703J6167
15933A1741k1108k1108j6425o271J5646O893L5821M0272M445J1805j1084j3045
15921C7582P437R28k6264k0682l2141l399Q038q448j7133R196L766J1582K5522
15908d016J6809l8468j1169J9068o146o092J928j3861K8585L1944k9858k1800
$$ y = [13656, 25801, 13847, -5076, -1706, -1967, 10642, 4925, 1943, -2630, 3673, 10092, -2529, -12858, -32485, -43944, -35554, -4730, -4585, -3430, -10504, -4896, 18542, 49391, 32263, 2991, 19107, 26147, 43318, 46087, 44861, 54708, 47735, 30030, -4970, -32846, 3068, -6691, -18502, -4406, 861, 24066, 15460, -930, 17099, 58217, 78381, 46698, 4654, 8816, 33347, 51295, 25779, -954, -40731, -28731, -3540, 6443, 21821, 11563, -13973, -30129, -4426, 11741, -9367, -30475, -46900, -53171, -37525, -30632, 5189, 45461, 49906, 61711, 50627, 37582, 45019, 45947, 19683, -999, -33140, -36539, -28501, -36949, -54082, -44886, -41120, -29538, -4016, 12793, -25675, -36844, -17776, -23922, -30014, -28086, -41947, -13362, 18582, -11276, -33076]
15896c3076K4298j2512J8891J5151k2789J6908K9259O394j3058j9886p022K5177
15884B7735m767j3538j4304Q340j771M8k3037j9727j148j2734L7973J5173q567
15871a0324m1137k2600L6574J8039k968l606L30J9635O690j3912l8359J2610R694
15858b9334j0974j3469m453N0854Q310Q863K0542J6940k2863j2624N949l362k5936
15845a1557j3237n744o076P67K1254K717o989j0784j0287L0622r48K062K5495
15832A7295j554K539j85k5544j8341l633M210j3351L51J8241J8676Q008r065j4305
15818a6658p184K8266J7005j544j0787l810j383j8313k6889l3573O66L6018L8744
15805E58J5292m7665r664K8376J2729J1126L304J4870r888k5730k1461p603l290
$$ y = [-33076, -8778, -21290, -2399, 12752, -10037, 6871, 36130, 42524, 29466, 9580, 2558, 27735, 22968, 9430, -4874, 3466, 1695, 1743, -21294, -41021, -42169, -54903, -16930, -1757, -10324, -51461, -74061, -37487, -19448, -22416, -26022, -25692, -6057, 633, -13279, -51638, -39028, -29334, -40308, -53777, -58230, -7376, 934, 9797, 30339, 47279, 24416, 11792, 17741, 14379, -11557, -24794, -30538, -36614, -35847, -14593, -11876, -18865, -29649, -39936, -9314, -10262, -8200, 17295, 15741, 18280, 18095, -7449, -25790, -29423, -25213, -38564, -38213, -19972, -1296, 6712, -2353, -16658, -23842, 4424, 21429, 19885, 9098, 5288, 3905, -14408, -41297, -74870, -74204, -38186, 558, 15850, -31815, -41479, -13103, -374, 10752, 14056, 28926, 19038, -6692, -28153, -35756, -39046]
15792c9046P914R191M956M735O422Q166j9417M2361J2276N506l2542j8669j2958
15779b1105n123J4735j2630k077k9779J9647l184K113k1367K40M7468K9382j6441
15766A879k5137j615m138J7312o931O728m570j534p441K4473m187k4778K2427
15753g512N3079L70P578j5623l9484r673p093J468L9930L698j5698N914K5628
15740D2582J92j04j6254K848j6637j1478j6811j7111o615K0149L8028p712l2310
15727b1233j5497j8914N4583q2J385K2609k943m0367m8015J9715K3125K2268p414
15714a0780j6744K7193l096j110j5360p44O338j7542q783K4143R90M953r601L9255
15700A9112N895m4509P934J6395P070j5711k5218m498L589L8101q415m0755k303
$$ y = [-39046, -31132, -21941, -16985, -12250, -5828, 2338, -17079, 25282, 37558, 43064, 10522, -8147, -21105, -26228, -11493, -24123, -26200, -55979, -36332, -39516, -37403, -58770, -58530, -11062, 18320, 1879, -23258, -24873, -29011, -11699, -18630, -11902, -16472, -18006, -25447, -974, -5161, -29939, -7512, 45567, 45937, 53515, 37892, -1592, -11265, -18358, -16890, 23040, 26738, 11040, 16954, 42582, 42774, 42670, 26416, 29264, 12627, 1149, -15662, -32773, -39388, -19239, 18789, 11077, -21233, -36730, -55644, -1061, -1143, 242, 22851, 19908, -20459, -68474, -48759, -25634, -3366, -10780, -27524, -331, -3427, -4537, -19897, -20641, -14303, -31845, -40628, -16485, -15495, -10542, -20143, 19112, 25007, -19502, -11568, 4827, 11897, -3814, -29032, -33530, -29941, 8160, -255, -41010, -43313]
15687d3313L961N101r510K1793J5290j1728n422k738J3265M792p942L1441J8181
15674C3171k5665l9024k0305k6876L9432M0171J7059o141j6304k6937k492N265
15662b8646P842L582j6410J7995j77l3801J2582K9289P82k4013k8330M281J4122
15649d0902K216K568j1411J7495o477J7516M9654J5796m7424k449O834J3567p322
15636I661m9347k8O937K148L9951j1548j4486J0544P296Q516K0232k1286k2839
15623a4249K5746L1226K979j0227j227L6311K760j8151O908J1745k9062J9730
15611F4489j2602l8411l1810j3680o467L401n597q07L4257J6615K5552L919k6042
15598A2817K2305M853j7163l1588j5459j1611Q708R894K344l0362J4302K3079
$$ y = [-43313, -39352, -34251, -43761, -21968, -6678, -18406, -23828, -26566, -13301, -8509, -16451, 14990, 33171, 7506, -31518, -51823, -78699, -39267, 904, 17963, 11822, -4482, -31419, -33911, -28646, -20804, -17222, -33632, -15637, -15814, -49615, -37033, -7744, -6962, -30975, -59305, -55024, -40902, -38686, -36118, -47529, -30034, -36511, -18995, 30659, 46455, -969, -3418, 3416, 16983, 9661, -39686, -39714, -32777, -30629, 9322, -2226, -16712, -6168, 1128, 9644, 29876, 8590, -14249, 11497, 42723, 45702, 35475, 34248, 70559, 73319, 55168, 62076, 73821, 44759, 64489, 51887, 13476, -18334, -32014, -38481, -35080, -40677, -41484, -7227, 9388, 34940, 38859, 12817, 35122, 39975, 22812, -8776, -24235, -35846, -27138, -17244, -14900, -45262, -30960, -7881]
15586g881J7681K5690J2681r283o0582n7560J2448M0413L7969K2073j8553j5317
15574b21l4129k1305J0562J8157j2696j231K6566J9323j3234j9345K2276J5095
15562I818p354K4877L6963J1120j5580j5058k0753J7105j3934j3832q567n084
15550b79L5437J5421K4209n186M958j6749m8449k8898J122L98k1871J1031K9954
15537A098K0562o916j8852k8215m729l1589J2816j4990J5356L6436J8544K2727
15525B2248j8132j2073L6700m868j9316k0386j4454l0003j1436L3995J2412k735
15513b8048O461k5720j8925K9354K1262j4286l9349K0231M1619K5319n843n358
15501F717n888Q506k4450k9321Q427J3281j6238J3560M8646J0598l2590j1445
$$ y = [-7881, 9800, 35490, 48171, 38888, -21694, -79254, -66806, -26393, 11576, 33649, 15096, -221, -34350, -55655, -45093, -26936, -39632, -40863, -14297, 5026, -8208, -27553, -5277, 9818, 2464, 27341, 64304, 75424, 59844, 44786, 24033, 41138, 27204, 13372, 4805, -279, 35158, 50579, 74788, 69602, 74560, 57811, 9362, -19536, -18414, -18016, -39887, -28856, 1098, 21660, 14744, -4108, -32323, -37052, -68641, -55825, -70815, -55459, -19023, -479, 22248, 4116, -7957, 28743, 23875, 4559, -15827, -30281, -60284, -71720, -37725, -25313, -28048, -21587, -47307, -66232, -36878, -15616, -29902, -69251, -49020, -7401, 17918, 12075, 6717, 829, 9335, -15115, -44436, -36009, -22728, -38966, -25406, 23240, 33838, 1248, -10197]
15489a0197J4540L3149K8715k770K693k2522Q294j00k2090k4181j5065m1310P209
15476d3635J0079K4602K8009k3958J3611r390n94j1966k4225q625J4197L5687
15464C792L2312J1143j765j5363k0585j9321J9827j1249M852J5996L8263J364
15452E9266k2513j6040L850M57k5692k3891m361J0479R613r098R798L3115q238
15439A6745K1190l5868j5114J2319K7492j7160l6823j9961J9975Q384L1567J0725
15427B3471j0195L1011p024l8509O72Q24J6989O011l4022j1487k3220R441L1879
15414d159K710k3775j0845J3920J8259P798m366J5734j589l926m417j4868j5013
15401b4537j8054L7160J2545l2643j6515l382K1667J9087j6694L125J5396J1288
$$ y = [-10197, 4343, 37492, 66207, 63437, 66130, 43608, 51902, 51802, 29712, 5531, -9534, -50844, -43635, -33556, -8954, 19055, -4903, 8708, -682, -1276, -13242, -37467, -46092, -31895, 3792, 36104, 47247, 45482, 30119, 9534, -9787, 10040, -1209, 3643, 19639, 57902, 59266, 36753, 20713, 24563, 25020, -672, -24563, -28924, -18445, -8832, -17930, -8132, 24983, 16745, 37935, 2067, -13047, -728, 26764, 9604, -27219, -47180, -27205, -18821, 12746, 23471, 13276, 44287, 37263, -1246, -574, 250, 17239, 23250, -10772, -22259, -45479, -36038, -4159, -1449, -25224, -36069, -22149, -3890, 3908, -458, 15276, 13687, 9761, 5344, -9524, -24537, -42591, -5431, 7114, -25529, -42044, -45426, -23759, -4672, -21366, -18241, -2845, 8443]
15389H443q3J0713J2550k3194o154q124p047K2549k3560j4294M1210n126J956
15376I839J300J878m4602k9225r520J3207J6212L1251K6238j1483j8042J6195
15364C248K6670J0208k9133r285n291J5245J0911j3275Q47k7799k612P685J978
15351a0603L897K1120J514L134M369m448j9311L696k1071J929J4291L397K1761
15338B3675J8815l2003k2541M944j7644J0430k7927J880p427k0802R7Q903L4022
15325b5578P800J5952j0605M964m227j409K4751J2410l1349J8373p455J7347L0261
15312E1235l6713k545j1541N525M344j2156M663Q607K275K318j7805o70n343R781
15298A975p683J0399j1622l5733k2287K6404K0993n144J6922q880J0529L472P78
$$ y = [8443, 8360, 19073, 31623, 8429, 2275, -5849, -12896, 9653, -13907, -28201, 13009, 7883, 9839, 11139, 13017, -31585, -60810, -70330, -57123, -40911, -9660, 16578, 5095, -12947, 3248, 29918, 40126, 10993, 1708, -3583, 11662, 22573, 9298, 10145, -17654, -20266, -12581, -10603, -6706, 14414, 15928, 19062, 23431, 18983, -328, 3368, -17703, -15774, -1483, 1914, 23675, 42490, 10487, -12054, -7110, -24754, -14324, -42251, -40371, -47798, -68600, -68503, -59600, -25578, -17778, -1826, -12431, -7467, -11694, -13103, 11648, 24058, -7291, 11082, 3627, 20974, 51235, 14522, 11977, 436, 5961, 10305, -1851, 2812, 11419, 13694, 16012, -1793, -2463, -7806, 1975, -5708, 4691, -6931, -42664, -64951, -38547, -17554, -22698, -5776, -14656, -4127, -655, 123]
15285A23o398Q351j7038k1436K3307L933j5210J5833l4715p741M1901M1819N548
15272C8277k3236J0819q318j8289l711K4966o781k7413j7399l060j139m538P938
15259c1884J0629k6600j6195M2823J8546J7639K4316k1808j9765j3412K0942J7585
15247B2816J1042n648q47j8252J3321k8583k438l9787p242L115J4724O521l3596
15234f4854q838o308J7464m814K5758K7048k3452p006j665j8311L5861K4195J1667
15221F745k803K335o311q850k7271k6105L082K2046K2519Q815L5956n358n360
15208A9440j0133k7596k5440K0896J0817k1049k5531L4275L6087J4796k287q63
15196B3412j9054J078m1155l0520K6978j675n465M792L3367K7946j2461J5385
$$ y = [123, -6275, 2076, -14962, -36398, -13091, -9158, -24368, -8535, -43250, -50991, -9090, 32729, 38277, 15041, 25860, 17542, -747, -4458, 20508, 13727, -13686, -31085, -34145, -35284, -39822, -31884, -21255, -47855, -64050, -21227, -2681, 14958, 39274, 17466, -2299, -15711, 5231, 22816, 33858, 28210, 27363, 9111, 22432, -6151, -8589, -48376, -55618, -52503, -37779, -31258, -64854, -73692, -80000, -62536, -67350, -41592, -14544, -37996, -45002, -46667, -64978, -29117, -4922, 6745, 3942, 6277, -34, -8884, -36155, -62260, -59178, -37132, -14613, -5798, 30158, 24800, 19440, 9307, -18289, -43729, -22833, -12016, -33065, -58596, -24321, 11766, 26562, 24275, 23412, 4358, 5436, -35719, -66239, -39261, -40936, -46401, -41609, -8242, 19704, 7243, 22628]
15184B2628P10k5594j4646M958L4071P262o561M271j2845l1178q613J2749K5163
15171A2375j147l6762j3644J0241k770N3519K4293l7375j3056K5311P997n375
15159B3607k227m2530l387q942R819J6885j9940j1539o636M4336L4151j5487R81
15146A9091k2820K8949k006j3061k2058J7448K8188j9092O551j6638l3951R175
15134b0224O97R625J7143R169K608j2297j6006k5585o860J1106O598J761L378
15121a8887J7728l552J7793J0572J0149j0426k8827k6324m873l2110J6605L5591
15109a6561k7786j1849L1416K5798k30J9890J278k2767l920K0466l1683K652q903
15096b2199k3393m0269o720M20K9044J0079o302l295L050o643L9150L9572K2477
$$ y = [22628, 23338, -2256, -16902, -11944, 22127, 29389, 22828, 27099, 14254, -16924, -25537, -12788, 12375, 11228, -25534, -39178, -28937, -31707, 21812, 46105, 8730, -4326, 20985, 28982, 23607, 21380, -21150, -24537, -33479, -23660, -6775, -26715, -38254, -44890, -554, 33597, 18110, 19091, -3729, 25220, 23214, 10153, -11905, 5543, 33731, 14639, 21190, 4552, -29399, -20224, -19527, -9902, 7241, 16410, 19018, 6721, -9285, -34870, -41730, -30624, -24026, -22265, -18887, -1159, -4711, 13082, 23654, 33803, 23377, -5450, -31774, -36647, -68757, -52152, -16561, -44347, -56196, -24780, 1018, 788, 20678, 21956, -811, -4731, 15735, -15948, -13296, -22199, -45592, -85861, -92581, -92161, -63117, -53038, -59340, -62635, -59585, -66228, -27078, 12494, 34971]
15083C4971R616k9687j6184j2659K1163J9730j0401J5982J2801j736K41m654j3312
15070B5871K2061m7175j6982L254j2488O126m71J1831L4676M474j7981j9048K7990
15057B2138O655n799k0036n981L64k2832r996j7518K1516K7851K0070j5309j6929
15044a5806o46q864Q195n976J1116R231j8153N05K9188K9326j0894m4198k0434
15031c7410k1684j0364J3170J3752J9634N731j0971o806Q019N088L7214K67j9376
15018c736k947r01L5924J1864k4080p942J3620j9881j8952j6240K1558l42k137
15005a4192j4780l968Q167K2343J7019q94j7234J483j5545J348k5223L3656J6163
14992H343R283J756k7033k5729l6601j5774L4683M4175K1364J4159O20R229l7668
$$ y = [34971, 44587, 14900, -1284, -13943, 7220, 26950, 16549, 32531, 45332, 43596, 43837, 39183, 25871, 47932, 757, -16225, -12971, -25459, -19333, -19804, -7973, 26703, 31177, 13196, -5852, 22138, 28793, 22994, 2958, -3023, -2659, -25491, -35487, -53005, -31489, -3638, 16432, 1123, -15806, -16452, -25316, -17121, -23097, -11981, -2750, -20903, -20398, 8790, 38116, 27222, -16976, -37410, -59094, -69458, -56288, -42536, -22902, -17171, -28142, -34948, -26929, -21841, 15373, 15640, -3736, -6683, -7584, 28340, 40204, 16124, 8182, 21802, 1921, -17031, -33271, -11713, -12055, -14192, -28972, -32940, -24773, -2430, 14589, 13695, -3539, -2056, -17601, -16253, -41476, -7820, 8343, 17626, 19382, -7651, -33380, -69981, -85755, -51072, -6897, 14467, 28626, 29246, 38475, 807]
14979H07j7532N4636K4568M474j9906p244L5157J613k3302k3277k56k7692j4772
14966a2726n820j5737K1318J6429Q089J2298k5998n144j5223L7764J1574l0813
14954c989M069J131P933P543M139l3261m7544O009M6809Q614k2501K791L051j6554
14940c1760J0830O000j3523l878K1650J7931j0194l9246J3635M4070L5703K5855
14928G7073l468j2287J827m4643j1199j5525O505j5691j9019k299O437O507K4075
14915a707m05K787j4953p068J0841k221k1883l0353L47q793j6575J9733N4565
14902a5685J9360J2402l824l2369j5768Q721J4802k2766J8994L9634J159L2012
14890E6672L772n4647l1772l837J0488l4869l2321M4886K5664K8961k7203P004
$$ y = [807, -16725, 37911, 62479, 66953, 47047, 39803, 74960, 76573, 53271, 29994, 29738, 2046, -12726, -18546, -34283, -12965, 3464, 11553, 23851, -2147, -7291, -22514, 15250, 26824, -3989, 80, 1211, 9144, 16687, 20826, -12435, -59979, -53970, -7161, 1453, -21048, -18257, -15206, -31760, -20930, -14930, -28453, -32331, -10681, 7250, -2944, -42190, -28555, 15515, 51218, 77073, 73605, 61318, 63145, 18502, 7303, -8222, -1717, -17408, -36427, -38726, -32289, -25782, -1707, -2112, 675, -14278, -21346, -10505, -12726, -34609, -64962, -64615, -73408, -89983, -70250, -15685, 3675, 16077, 12253, -20116, -35884, -27163, -12361, -35127, -16133, 23501, 24660, 56672, 60444, 5797, -25975, -29812, -19324, -54193, -86514, -41628, -15964, 12997, -14206, -7202]
14878g202R748J6381n9343j8257L9832N510j9500J7983K4692j1243M73n112j5632
14865b1670L6968R470K4218l7171k172l807m8752O334K5826j0929Q748J9954J8023
14852B5040Q18J64j7715k033l2743j2548K0792J5633J3958J7090j7958L63M742
14839A5603j0620l853M0055j6986k4899l984k9701j3477M3911M5048j1585l5557
14827f045J7011L0890K3417o293k146k6554l4415o537k703R44K1905o043q935
14814e504P056p0q625n417M744R362p980q918J0249j8545j4599p362j0620j6066
14800g2295K4309L8879J9373j6537j485l780K8669m816j3803O755N801j6979k6499
14787c2408O238N789O706k8504l0734j9389P339K445k10M0992L2175j6108j3107
$$ y = [-7202, 2546, 18927, -40416, -58673, -18841, -13331, -32831, -14848, 9844, -1399, -926, -6038, -21670, 15298, 24768, 48986, 11815, 9643, 5836, -42916, -36582, -10756, -21685, -12937, 7017, 25040, 25858, 26022, 8307, 6274, -26469, -39017, -18225, -2592, 11366, 28456, 10498, 10861, 15603, 4983, 1130, 41185, 24199, -700, -4684, -34385, -47862, -3951, 41097, 29512, -6045, 10966, 41856, 65273, 58980, 56834, 30280, -4135, -10672, -13375, -12431, 9474, 3431, -5504, 1552, 1482, -7143, -12560, -7816, 1546, -6434, -15352, -5103, -23648, -38247, -45609, -56229, -72295, -47986, -9107, 10266, -6271, -7756, -11536, 17133, 12317, -1486, 5269, 11070, -5909, -32408, -26170, -20381, -13675, -42179, -72913, -92302, -84963, -82518, -82728, -41736, -9561, -25669, -38776]
14774c8776j5125J7760M6283O042j6892P667j9736l3905L6393M492k2563k9456
14762e7816O905J5838R762O168L962L7159N1563j0503m9906j3078K3464k9310
14750e792l5626K6836N718n028R117j3521K3087K1007J603m5728j5212J9312P055
14737g172j7572J4054k906J3394N922J2499L288M623j5326q706k4357k4049J7677
14724b8631m934J3306P565p448j4462J6375L3431j4635k4531K6389J7681j5096
14712E010q161M0658J1572j4254J8949j8372l5405J4075r245J8284L1532j2866
14700D1777m6310Q784j4309j5677L2704K9340k2503j9177n617L787p37N241R561
14687F864O612p877k6466k2003J9279L0293J3747O002q966J210L8719K5039P408
$$ y = [-38776, -53901, -36141, 10142, 16184, -708, 6959, -12777, -46682, -10289, -5797, -28360, -57816, -50911, -35073, -25311, -19143, -15181, 21978, 73541, 63038, 13132, 54, 23518, -5792, -41418, -14582, -8864, -13892, -4775, -18296, 4791, 25798, 27401, -18327, -33539, -14227, -7172, -24744, -10690, -13596, -202, 5720, 18219, 21507, 26130, 10804, 2098, -22259, -46308, -28631, -33565, -20259, -12694, -20142, -34604, -18229, 15202, 567, -23964, 2425, 20106, 5010, -3151, 37507, 49079, 34825, 53774, 35402, -3, 14072, 4827, 23111, 54643, 41777, -4533, 4251, -10058, -25735, 6969, 36309, 13806, -5371, -10988, -7201, -7938, -2697, 6864, 13476, 5599, -20867, -42870, -23591, 6702, 20449, 26451, 17485, 18695, 57414, 82453, 89861]
14674H9861j4448l4243o466N619j9192n411R00L567p634k1q95M500j8513J1908
14660I532K3677k3623n197O708J1131j1717m3329K9243K3607M339J5705J1146
14648E1222l9775k8485k5561N1235J253j8127J8302K9491j0445m4526l359K5301
14636F526J2585k4362k3466L7620J0436j4182J5581j9093j5344j084M367N544
14624d872M481O996K859J1209k5354j9406k5964n414j0575N0595J1584K0176j170
14611A5145n0293n661M2829p99m026M0548K5389k4111p367k25j2509k6837J4755
14598F838M2167n422j5163K3438l671m8790l9756K6017j3891m319M2783j0821
14586e90j4395J6073o245j0155K570J3507K7826L95q870J5652k1549p879j1704
$$ y = [89861, 75413, 41170, 34704, 40323, 21131, 15720, 16620, 20187, 12553, 12532, 11637, 16137, -2376, 9532, 33209, 9586, 4389, 11097, 22228, 10511, -32818, -3575, 20032, 24371, 40076, 51222, 11447, -17038, -42599, 8636, 9889, -8238, 10064, 39555, 29110, -15416, -18775, 6526, 19111, -5251, -28717, 8903, 19339, 5157, 20738, 1645, -13699, -14783, -10416, -4872, -391, 6605, 9464, 20673, -4681, -24087, -50051, -55465, -66040, -15445, -3861, 16315, 15145, -35148, -40809, 2020, 1221, -2805, 37743, 63132, 39021, 31654, 31429, 18920, -7917, 6838, 49005, 43583, 28420, 51858, 48187, -603, -40359, -14342, -28233, -32552, 10231, -590, -14985, 1088, -5157, -15312, -12742, 765, 28591, 28986, 20116, 35768, 14219, 6340, -5364]
14573e364k3948J114K6060Q789m575j3384k1290l6807k58M3611q544l512R937
14560b8171O816o168p635N152K6665K8139k9239j7990K1970K7524j2615j2781
14548A667k2400j3312k373j6953Q718J6340J6422P583j2968j0954j1577J6073
14536b3734R99k0039k651M4767K6245K7997K6645L47j7982j411K2915k4993l4735
14523B4370J6668j9542k5023j6887J5263k363J5972j3145j3246N176K3583j449
14511I377j3923j1662L0742P478L9229j2660l1466n3956q811L7322N532L4250
14499C1452o335l2895J0021P810j3898J4642K4272K6118j0078m757j5587l3767
14487c002N92Q794k512L074j3511r341J1390P617k6706j7677l984K7255K053K9948
$$ y = [-5364, -29312, -28198, -2138, 6651, 2076, -11308, -32598, -69405, -69663, -26052, -34596, -38108, -28171, -21355, -27523, -35158, -30006, -3341, 24798, -4441, -22431, -461, 27063, 14448, 1667, -20733, -34045, -36418, -53371, -44653, -28313, -11891, -4308, -17276, -28230, -39807, -23734, -22735, -42774, -45425, -658, 25587, 53584, 80229, 80576, 62594, 61183, 84098, 59105, 24370, 41038, 21496, -3527, -20414, -5151, -7514, 8458, -4687, -17933, -12757, 10826, 9377, -4546, -16208, 14534, 22012, 61241, 48581, 17115, -36841, -45652, -8330, -2798, 31452, 25117, -7778, 2243, 10053, -3845, 10797, 35069, 61187, 51109, 46352, 30765, -3002, -2410, 6384, 3872, 6946, -6565, -15906, -4516, 3101, -23605, -41282, -45266, -18011, -15958, 13990]
14473A3990k909j8142J4854L940j6897l8595J4091Q764l000l770K6024M7591K4833
14460G0774P984j0460m2800l9117k7728j69n857Q450m178K0429J5927K6987n698
14447A4544j5946k3998k707L8795n341J4549j537j1819j2307j2718J4824O60j0083
14434a3084K4392Q451J2877J8376j8040l6551k0011n158o408J4295N242M970k4418
14421c5067J6186K1488K5915k1244P017K8537n618O02M0468L6056j0916n0693
14409E2731k3273P342j3031j1654J7465k6903k5118N622N613J4361K0275J8717
14397D2147L5452j5333k4875l2619K2321j0051n0355J3812M6756k2153j3927j7325
14385b6150K7450J9613l7396m3533p243K9472O874j3019k9671K1790J6577k811
$$ y = [13990, 11081, -7061, 7793, 11733, -5164, -43759, -29668, -20904, -23904, -27674, -1650, 45941, 70774, 78758, 68298, 25498, -13619, -41347, -41516, -47373, -38923, -43101, -22672, -6745, 20242, 14544, -1402, -25400, -28107, 10688, 5347, 19896, 18359, 6540, -5767, -18485, -3661, -3001, -13084, 11308, 19759, 32636, 51012, 32972, -3579, -23590, -28748, -35156, -20861, -15619, -10649, -35067, -18881, 2607, 28522, 7278, 14295, 42832, 37214, 37816, 78284, 114340, 103424, 52731, 29458, 36800, 23769, 12115, 29580, 2677, -22441, -16819, -11206, 3155, 23430, 42147, 77599, 62266, 37391, 4772, 27093, 17042, -33313, -19501, 27255, 5102, -8825, -26150, 1300, 20913, -16483, -60016, -67259, -37787, -30913, -43932, -73603, -51813, -35236, -38047]
14373c8047K4472L1204J246j6938K3917K4329m2985l5420j3173j1463J7047J6791
14361a9020m572R844R215K7566j4801J2204K4661m1228j3371o072K1098J4156
14349A9680N741K1294K418L885K5385j0104j3776n0430O31J8991L865J1381m5
14336C8916j7685l4975K243m786j1684M351k874j5497o040L7280j250J264J0539
14323a98K1033l951j5202l71r23K8022K4369p889k4157J0915j9815l0181K9117
14310A0769M2046J1958j4696j2034n4743n0936J0952M1037J1078l880J045M1918
14298C4514N056j9867K4769J2243r259j5601O310k3973k8973K5085J3457k8698
14286d937j4683M8817k823j0327k8412k1894k0928k803L1469m480m0595K0242
$$ y = [-38047, -13575, 17629, 18875, 1937, 25854, 50183, 7198, -28222, -41395, -52858, -35811, -19020, -23592, -13748, -4533, 23033, 8232, 20436, 45097, 3869, -9502, -15574, 5524, 19680, 25421, 46715, 49133, 53018, 78403, 68299, 54523, 4093, 4724, 23715, 27580, 38961, 38916, 21231, -13744, -11501, -16287, -27971, -23620, -26494, -41991, -48031, -10751, -12001, -10737, -198, 20835, 16884, 1682, 1311, 388, 28410, 52779, 44890, 20733, 31648, 11833, -18348, 10769, 52815, 64773, 50077, 38043, -16700, -67636, -56684, -15647, -4569, -8449, -7404, 34514, 39570, 19703, 44472, 56715, 47456, 31855, 38165, 14192, -14781, 10304, 23761, -4937, -19620, 29197, 26374, 16047, -12365, -34259, -55187, -57990, -26521, -31001, -71596, -51354]
14274e1354N0043K93j9566P613K6169L7045M571P527O712k3503l754J0921L323
14261E6040j1203K894n2800n8391J7103K3133K7104J3961q555K073K0227k3188
14249H398k745K954J1310J3201Q038j4052J7045K424J3315j3418j2029l8782J077
14236c264K0639l859j9618J0875n091j2609K825P053J2751j306L185m347p236
14223bM86j3453k5523N171L4179n573k00l160k4395m592O986K0737k52J2310q376
14208e657J5069j4551K0610K4987r753n325N002J3242l1059j8565l507j13P201
14195b419K2317R889k8563l4706k7666N815r411J4880J0865J4243L1009J2354
14183A8607p498O641j1066p307K1182p71k4570L1031K0868k6826j8395j2395o70
$$ y = [-51354, -1311, -1018, -20584, -12971, 13198, 50243, 54814, 62341, 69053, 45550, 41796, 52717, 56040, 44837, 47731, -5069, -63460, -46357, -23224, 3880, 17841, 9286, 11359, 31586, 8398, 5653, 8607, 19917, 33118, 41156, 27104, 44149, 46573, 59888, 46470, 34441, -4341, -3264, 17375, 13516, -6102, 4773, -318, -12927, -10102, -3049, 9702, 8396, 11581, 7234, -2, 484, -12969, -38492, -33321, 858, -4715, -4915, -8075, -32470, -37062, -30076, -9339, -9591, 2719, -5657, 9412, -5139, 15471, 40458, 30705, 25380, 30382, 43624, 12565, -6000, -9507, -9620, -2419, 19898, 29787, 1224, -33482, -61148, -55333, -64744, -49864, -38999, -24756, 6253, 18607, 11109, 17750, 6684, -623, 20559, 19788, -4782, 26249, 47117, 20291, 1896, -10499, -11169]
14170a1169k9634O691m06M113j4114J8086K2305j1038k8311J1430N0433J5256
14158C3642j0818j0554L8608n111k9266l4010k6105j7744J0817J6026K3668M460
14146f387J6837m2529j1516M552q553j2322M0818J2366m3627Q76K8360r344k9481
14133e9950k610J3346L4336m378r051r772K1052p561L9593k7905k0714k1277J2235
14120d2656k462K4369J0133k6732k2219j261j2039K9100K9790M39m403N758L704
14107h479M721R538n362J7557j6198l8107m4481J9848Q984Q682M6420J9400q643
14094A3880J209K774n109j1553O210r468k2177K9680J3918n1296l0057J925K9571
14081c0493J8539K0405K791n23J946n728l0432J735l192J5287K0388J0550m325
$$ y = [-11169, -40803, -34112, -34518, -30405, -44519, -26433, -4128, -15166, -43477, -32047, 18386, 33642, 22824, 12270, 50878, 45767, 16501, -17509, -43614, -61358, -50541, -34515, -10847, -6387, 10450, -32079, -43595, -39043, -47596, -59918, -19100, -6734, -50361, -49485, -21125, -30469, -59950, -62560, -49214, -14878, -19256, -28307, -38079, -17027, -24588, 15005, -12900, -33614, -54891, -42656, -45118, -20749, -10616, -37348, -59567, -60828, -72867, -43767, -13977, -13538, -17941, -12183, -8479, -3758, 5780, 418, 17975, 1777, -36330, -80811, -60963, -51979, -43297, 3123, 22523, 13880, 15089, 17863, 12754, 1201, 7411, -2057, -24234, 5446, 19364, -31932, -61989, -60064, -30493, -11954, 8451, 11242, 10719, 12665, 6937, -23495, -21760, -24952, -9665, 10723, 21273, 16948]
14068A6948O834K0623r26k185O401m4833n6550J4685M7879J7015l2993j3557j1810
14055c2469K4192J0135k0078K4716L0356M1775m2378o4362K6764L1912Q412N061
14043D4036l7250J51K4028k3571k0059N569l859o546l4113P832L0064K3461J0133
14030A9876m38n010k310L72q505L8839O015j3161l7453P944j9954j7788L654J2226
14016a5693J786K270j6899l293K6895O659L845p664j531p253K796j4626K5708
14003C000R056P27m011p806j23m4309K295L0156O776M948K7971Q036M6424k0528
13989F2612n0905M498j4202j5380O064J0178j8529r379J6459N952J0468J3838
13977B1674K131m745O570L361l339l4047m5564J7458J9917J7822P057l0255l7917
$$ y = [16948, 23782, 44405, 43479, 41294, 47695, 2862, -53688, -39003, 8876, 25891, -7102, -20659, -32469, -8277, 1858, -18220, 6496, 36852, 78627, 36249, -28113, -1349, 30563, 38975, 44036, 6786, 6937, 30965, 7394, -12665, -7096, -10955, -17501, -51614, -43782, -13718, 9743, 19876, 19438, 14428, 12118, 12490, 3985, 42824, 48839, 35678, -1775, 6169, -13785, -31573, -27919, -15693, -13907, -11637, -28536, -31829, -4934, 1725, 5570, -2094, -3625, -10878, -8082, -22708, 3000, 12056, 12783, 8772, 966, 843, -43466, -41171, -11015, -4239, 709, 28680, 36716, 83140, 62612, 11707, 16205, 2003, -13377, -7313, 2865, -15664, -25043, -8584, -2632, 7836, 21674, 23805, 19060, 25630, 28991, 25652, -8395, -53959, -36501, -16584, 1238, 8295, -21960, -59877]
13964e9877J4664L208L3693j0292J0807O512l1284m020M4178J0270k078k732K2238
13951C5287J470K946l8936m3717N841L2240M3103J6789l1279m8996m168k4491
13939e3911r794L908O151Q781L6439l897j4765K458M968J0957N28K5732L0295
13926D7850j0981k9290m1236N17J8062N972j6068j5622m417J1761K4007O517l5403
13913c8331p255J7720J8825m67j4085M4474J0010n810k668r463K1686n971l9229
13900a0564J9375J4840Q332J370j3939k0200m745J8141l3384M888L7112L1196
13888E2422j969j3865j0813j7349l3964J400J5414p002K0437j728n992j1155n289
13875a9453J0677L458J985p689j709K514n826j0315J480k1235r902J9323k2512
$$ y = [-59877, -45213, -42005, -8312, -18604, -7797, -1285, -32569, -36589, 7589, 17859, 15781, 13049, 35287, 36757, 39703, 767, -42950, -37109, -4869, 38234, 55023, 23744, -25252, -29420, -53911, -63705, -59797, -53646, -44865, -8426, -12323, -27088, -24630, -19662, -8705, -8177, 17555, 47850, 36869, 7579, -33657, -33140, -15078, -9106, -25174, -40796, -45213, -33452, -9445, -2928, -38331, -45586, -27866, -9041, -9508, -23593, 20881, 30891, 25081, 22413, 12950, 34636, 28665, -10564, 8811, 23651, 31983, 33353, 19414, -786, -5531, 12610, -20774, -15886, 21226, 52422, 50453, 36588, 25775, 8426, -25538, -24138, -8724, -15726, 4711, 2983, -3009, -14164, -19453, -8776, -5318, -3333, -11022, -12731, -10217, -16043, -26358, -24878, -46113, -56015, -36692, -59204]
13862e9204j7273M9858N2588K696l1660j7077o21k2559l097L286R772J6321O55
13849a6315l297p567K8672J0911k2590l4252l3255M392K8647P860j8859k482k8987
13836h7122J2084K1993K5904J4413j8399j7297j4807q323J4574Q458O271k1769
13824f4020K039K2457L3936J8093j7230M377L1493k899r661j1814j0977k3392
13812b7598l303K3033K7206J1039M32j7587K205K4731r258k8072o015l96k9865
13799c3448K6030K0698j0659p34P082p717l2118k3155J5289K5675L9304k603m9040
13786b5396k6881N644q023M14P193j816l584J3007j5290j9816M2139M0464r105
13773a050k1717k2313K3327p161J8505J2331J973j428j3115J5268J4895j1095
$$ y = [-59204, -76477, -26619, 25969, 28665, -2995, -20072, -20693, -43252, -46349, -43063, -33291, -16970, -16315, -19612, -27179, 1493, 12404, -10186, -44438, -77693, -73301, -44654, -36794, -55653, -58135, -87122, -75038, -53045, -27141, -12728, -31127, -48424, -63231, -71554, -56980, -48522, -42251, -64020, -61981, -39524, -5588, 12505, -4725, -348, 31145, 28246, 18585, 6771, -4206, -27598, -30901, -7868, 19338, 30377, 30809, 13222, 15427, 40158, 30900, 2828, -3187, -3583, -33448, -7418, 13280, 2621, 1887, 8969, 1252, -30866, -54021, -38732, -13057, 26247, 23644, -25396, -52277, -46633, -54656, -54242, -47049, -48865, -52449, -39442, -54732, -74548, -32409, 8055, -1050, -22767, -45080, -21753, -28914, -10409, 1922, 3895, 2467, -10648, 4620, 19515, 8420]
13761H420j6393K7708K5800l0263Q595r459j7438J4327k1335j984o355J4061O468
13748B152j6921J9844L611l103q277k7580j0507N8344J9652j4302k0275N777j5298
13735f883J3320R502j0987j1742J7792l630j0451j2090N825k4214k7339O085L7694
13722a7118L9419J0216j3252k7097j0805M6607J7470k3131l807l6107m0051O806
13710e0850L3027K0229K1901L7069j5848l3518P992o665R076j2546k8575j6034
13698c4742J4364N6064J3034l9892l7336k64j1080R744M5400L2414r253k0042
13686A8411m739J7941P905j1071j1616j5884l384o825k2957k7394M021M493R260
13673d1839K4995J5531K1533k4794j3205L982j916l913l3148n972L4066j54k5579
$$ y = [8420, -7973, 19735, 45535, 15272, 23867, 14408, -3030, 11297, -10038, -12022, -18377, -4316, 2152, -14769, 5075, 8686, 5583, -2694, -30274, -40781, 17563, 37215, 22913, 2638, 8415, -6883, 6437, 15939, 4952, -6790, 11002, 7372, -3079, -15169, -9344, -33558, -60897, -54812, -17118, 22301, 32517, 19265, -7832, -18637, 27970, 45440, 22309, 18502, -17605, -57656, -50850, -17823, 2406, 24307, 61376, 45528, 12010, 20002, 13337, 22413, 9867, -18708, -34742, -20378, 35686, 48720, 8828, -28508, -28772, -39852, -30108, 15292, 47706, 38453, 18411, 13672, 31613, 39518, 28447, 16831, 947, -2437, -9262, -32219, -59613, -55592, -51099, -41839, -16844, -1313, 20220, -4574, -17779, -13797, -15713, -19626, -52774, -58746, -24680, -24834, -50413]
13660e0413k218L9767R523k3919j1071q336L0287n957j1795j7418M338j2367l0503
13647i0082K9185M3026L179k4497n283J1786K1336N967J1273o3P191j247k80j6899
13633e408R461j2066J1009K7117l412o078r751J503j2442k8961N630M1594Q52
13620A9048O64J650j3924l779k6627R223K1459J003j6336o303R089J6125J0313
13607B1605P776L8248L25m4401k4989r384j5420j4162L0206K7216K4701k2864
13595A8857l3917n025j709p598J944j103j0759J1800K2532K2526M381K4496j0780
13582C5645k3536l3449K2308O176N702j1108J0495L949m6184j2042K218P270K1015
13569a1541K4779N683J3761k7862n127l0039j9238L347M3334J0599j955M276o91
$$ y = [-50413, -52631, -12864, -3341, -27260, -38331, -46667, -16380, -22337, -34132, -51550, -47212, -59579, -90082, -60897, -17871, -14692, -39189, -44472, -32686, -11350, -5383, 5890, 5827, 13018, 11771, 11491, -5408, 4053, -8013, 2996, 30113, 26701, 20623, 10872, 12375, -67, -29028, -23398, 18196, 19048, 19712, 21362, 7438, 3659, -22968, -13745, 7714, 8717, -7619, -13922, -4833, 11292, 21605, 29381, 67629, 67954, 23553, -1436, -10820, -26240, -40402, -10196, 17020, 41721, 18857, -15060, -20085, -21794, -29392, -27448, -28551, -39310, -27510, -4978, 17548, 21929, 46425, 35645, 12109, -21340, 968, 7144, 12846, 1738, 12233, 16182, -30002, -42044, -39826, -32556, -11541, 13238, 18921, 32682, 4820, -307, -30346, -49584, -46237, -2903, 7696, 5741, 10017, 9326]
13556I326j785j2977k7546j6055l118k837m503R386J1375J2760O576J7244K5466
13543B3312j0833j0861j8825n908J8364J5467O920N675k1717K6749q568p03K1836
13530D0908p453j5072l4202k7030L4028J5347l468k170q97j3439j0443L9005j6571
13517a457m8563O995M7077K6420p749j2362l270j5197j471K1700r10n448k3890
13504a8125j3180j704J1525J3893K5591K2274O872l0100j5076J1528l197o034
13492D267l9322J1231K0775J0044n215l0528r561j6618K215O816K4658K9529M154
13479A2445j6364o899J0550J4668n830m156l2672l4723q410J6183L8282J9004
13467B078Q637J7445l714J5563Q923k3618l203l769o902m457M505r871m730l5189
$$ y = [9326, 7541, -5436, -32982, -49037, -52155, -54992, -59495, -50109, -38734, -25974, -19398, -2154, 23312, 12479, 1618, -17207, -23115, -4751, 10716, 17636, 23311, 1594, 28343, 19775, 19072, 40908, 33455, 18383, -15819, -42849, -8821, 6526, 3058, 888, -9, -13448, -23891, 15114, -1457, -50020, -43025, 4052, 30472, 22723, 10361, 7091, -8106, -9577, 12123, 11213, 5765, -18125, -31305, -33009, -21484, -7591, 18000, 40274, 47146, 17046, 1970, 13498, 10301, 4267, -35055, -23824, -3049, 6995, 1780, -28748, -38309, -54927, -52712, -45896, -21238, 8291, 12445, -3919, -10818, -268, 14400, 8570, 4414, -28258, -62981, -71391, -55208, -16926, 2078, 10715, 28160, 24446, 40009, 48932, 25314, 22111, 18342, 11440, 6983, 11488, 1617, -3113, -38302]
13453c8302l1284J474K7765L392j2751k3528j2266L9361L2497M6355J3985J5380
13441F2078N080n4558J3633K1141l017m3567j576J7990r365p891j93K8744J518
13428C0017r281k0689j7521J8067J5786J3831j634k635n498k4807m1598j3208
13416e9170J6892K4615P512O73k223p908J299K0497r120l573K2554K7655K1101
13403F0804j8878J602N7j4872l6320K1073R302n173m824n0500o917R526k803k8747
13389f6670J5950K0656J3523Q843j9123O578L5690J8292J305k7371n686R895l2837
13376b0955n855R155M229o724k7628j4709n139K1210M1902k024m756n866k3543
13363d0703m870J8746J4148J672R011j1500K6947L0622j0110J2673o347k6610
$$ y = [-38302, -69586, -68112, -40347, -36955, -49706, -73234, -85500, -46139, -13642, 32713, 46698, 62078, 67158, 12600, 26233, 47374, 44357, 790, -786, 17204, 7839, -52, -245, 28499, 30017, 20736, 47, -17474, 593, 16379, 30210, 28576, 25941, 20443, -4364, -45962, -59170, -42278, -17663, -10151, -9478, -11701, -19609, -18310, 2187, -6933, -10506, 12048, 39703, 60804, 41926, 43528, 43585, 28713, -7607, 13466, 22768, 17595, 12771, -37729, -44646, -35120, -37923, -66670, -50720, -30064, -16541, -7698, -26821, -20243, 15447, 33739, 35044, 7673, 1987, 11882, -20955, -26810, -17655, -13426, -20150, -47778, -62487, -67626, -46416, -4514, -6538, -11294, -17160, -40703, -45573, -26827, -12679, -11007, -1996, -13496, 13451, 44073, 33963, 46636, 40289, 13679]
13351A3679k8092L951K1115J2838K3792m395l4573j1289p081J0030L519j2253
13339h759k7544n5041J9595M9756K4141l0522j2261K4957L0382K2390P00J8669
13327E6463n297k8193J8970o192j1456L1636m4714n4166n974q304K8552N8220
13315B9545L4785k6317k5507J7959o388J2622j6807k0381k6733R467m2935k3359
13303h4049K4182L2442K1268J6553J495k2614j6447j9207O924M5352N5919l1336
13291C0482j0730J2917k8456j26N915k8091j785O883K9046M0588K70j8191l9116
13278c94k2977L412j3449N17J4146K3533k8299k391N4446k196J6867M138j7274
13265C0079m384j5261m0202L773L4090J7931L6064K7632J2794j0072k4198j66
$$ y = [13679, -14413, -10462, 10653, 23491, 47283, 42888, 8315, -2974, -10055, -25, 3494, -8759, -36303, -91344, -71749, -21993, 2148, -28374, -40635, -15678, 14704, 37094, 37794, 56463, 51166, 22973, 41943, 35751, 24295, 55931, 11217, -42949, -48923, -57227, -28675, 29545, 64330, 38013, 12506, 30465, 24077, 36699, 19892, -489, -27222, -17755, -60690, -84049, -59867, -27425, -6157, 10396, 11891, -10723, -27170, -46377, -39453, 5899, 61818, 30482, 19752, 32669, 4213, 4087, 10002, -18089, -19874, -12991, 16055, 56643, 56913, 38722, -394, -23371, -19959, -33408, -32891, -18745, 4788, -23511, -25902, 28544, 26348, 43215, 47353, 30079, 25695, 10434, -29768, -25995, 8095, 26026, 62090, 89722, 102516, 92444, 68246, 68080]
13253F8080k4953k1514l3545j8238L7260K7215p760j0660n5859K041Q980N922
13241b3031J2900j3620K0355P948K240q368J8803J1084p9j7939k1760q534Q890
13228a1111J1112P685J7186J9848k3491p380k6368K6396J2506q445o663l1022
13216a9747l7001J7338O0101q887l5494l290L3410R665o670L082N044K1516m770
13203C4297k6209p120L40j7610k6328J4858J989o462j630K7475j6078Q912K262
13190a1304j3215P629j8637k4090L2042P171L945J9179j47J2269L0796J2003m0493
13177A7148k0098k8593j1487L0823N56K007J9224L0620m49l294K9626Q354k1210
13164E3227o96r260k7970M789K1395n304k1296j757P610J1325J9932j0726j5537
$$ y = [68080, 43127, 21613, -11932, -30170, 7090, 34305, 26545, 15885, -39974, -37933, -28953, -23031, -10131, -23751, -3396, 4552, 6792, -1576, 17227, 28311, 28232, 10293, -11467, -20001, -11111, 1, 7686, 24872, 44720, 21229, 13849, -12519, 13877, 26383, 17938, 11275, -19747, -56748, -39410, 20691, 11804, -23690, -26980, 6430, 16095, 9425, 12507, 17551, 39067, 34297, 8088, 968, 1308, -16302, -42630, -27772, -25783, -32245, -33875, -6400, -22478, -13566, -11304, -24519, -16890, -35527, -59617, -27575, -20404, -16459, 2720, 2573, 14842, 45638, 57641, 17148, -2950, -31543, -43030, -12207, -11651, -9644, 9580, 40200, 39751, 36457, 66083, 74437, 53227, 52531, 43271, 15301, 20090, 41485, 36181, 14885, 13128, 20738, 32063, 51995, 41269, 25732]
13151B5732J6151j1015J939o719j2792l5034K1001J3104r556J4154J4007L110
13139C4082R449L2432L0448l0557k3620n522J008k8546J2801J7218q229R258N562
13126E5784k2385l9264l172L5157j6342j757K5675M324j8362p73o325k7270m712
13113a9422j6399k2429J0702J8726R584N768N321K3107J5313l1663l5993j537
13101c8922K8345J8766m508J5135r426o003k4051J8230J9026j2408j4195l586
13089a3597k584N37J9022j187J2895J2015M83M930R566K519p639L916j282l6866
13075B728J5352r401m6471l342J6258K9576K6226J6714l6943J2002O251J739p055
13062B3634M958j1530j3719Q679J7326K0107k4440k6511N386L391O646O048M999
$$ y = [25732, 41883, 30868, 32807, 26088, 13296, -21738, -737, 12367, 2811, 16965, 30972, 34082, 43531, 75963, 106411, 75854, 52234, 46712, 47720, 19174, 31975, 49193, 40964, 50222, 55784, 33399, -5865, -9037, 26120, 9778, 8021, 33696, 38020, 19658, 18885, 12560, -14710, -19422, -35821, -58250, -47548, -28822, -19238, -13470, -8149, 14958, 30271, -1392, -37385, -38922, -10577, 8189, 3681, 18816, 9390, 3387, -20664, -2434, 16592, 4184, -10011, -13597, -16181, -15644, 3378, 2191, 15086, 27101, 27584, 32514, 42080, 44599, 36960, 40876, 39594, 2728, 18080, 8679, -37792, -41134, -24876, 4700, 30926, 47640, 10697, 22699, 28950, 30689, 23634, 28592, 17062, 3343, 12022, 29348, 49455, 25015, -1496, 3890, 7281, 13927, 19975, 24974]
13049B4974o908r902J3292j835k4323j5985J1039M4715J4206k7877N35k0278J983
13036C636j1069q546j2321q415K5236M6348L147j1708N520K2461J1295j5346l922
13023D6316j5969J0750J4767m468l4689j4010O15j7439o3772J5245N1809J4078
13011C233l3588K647L8616K8479o368k7416n919J4182K1126m894k1788J2058K6706
12998D7074j2250k4174L0077j5194l5064M2028j6399l2522J034M1443j0765q475
12986F813j9835j8254J8434L4360J1243j4566k6039L1436N7066j667j5723m5883
12974A7385l4439K85R096J0593R11k7901J7805K0956j5762j2414j9734l0885o927
12961g1031K7493J6731O707P710P536l882K9049K4358m034q876m058M978m6788
$$ y = [24974, 18066, 8164, 21456, 19621, -4702, -20687, -9648, 35067, 49273, 21396, 21931, 1653, 3636, -7433, -15979, -28300, -36715, -11479, 34869, 38016, 26308, 31828, 54289, 65584, 50238, 46316, 30347, 41097, 55864, 51396, 16707, 2697, 3312, -14127, -77899, -62654, -10845, 3233, -30355, -27708, 10908, 39387, 33019, 5603, -316, 13866, 34992, 30098, 8310, 20368, 47074, 34824, 10650, 40727, 25533, -9531, 32497, 16098, -16424, -15390, 26053, 15288, 6813, -13022, -31276, -12842, 21518, 32761, 18195, -7844, 23592, 80658, 78991, 63268, 17385, -17054, -16769, -7673, 2920, 3831, -24070, -6265, 14691, -1071, -13485, -33219, -64104, -71031, -43538, -26807, -20100, -12390, -4854, -8736, 20313, 44671, 40637, 31761, 27703, 32681, -14107]
12948a4107n004P147k5921j7370L0989J5981O838J4614J4467r753j0550j535J2564
12935A8360K4286j8847r036K1565j4050k3237j5435j027J9954K0341J2781J0487
12923D6142J5440p038l2304k8025J327k8664J915K616N427J1029n048j1203K95
12910b8091l789J6034l1356o942R105J1502R550R770P045q735k382k047N598J1955
12896b783l156J6472J5207j1174k718k882J1265j0383J292j1097k0649k6419K5815
12883b1210K6892n159j3556K0067J404J445k3439J2577L6622k4400k531O147m1723
12870b6864l887k869Q348J1810R72J0602j6620J2875J0368j4731M48L382P838
12857A672k5429J1568P441J263J28J1541P111K9037K8084Q67j4729k4783j1405
$$ y = [-14107, -19111, -11964, -37885, -55255, -24266, -8285, -1447, 13167, 27634, 17881, 7331, 5796, 18360, 42646, 23799, 14763, 36328, 22278, -959, -16394, -17421, 2533, 22874, 35655, 46142, 61582, 54544, 22240, -5785, -4458, -33122, -31207, -28591, -23164, -12135, -17183, -28386, -28091, -31880, -15846, -47202, -54144, -45039, -33537, -23987, -14217, -7172, -15907, -18289, -20336, -14738, -2783, -5939, 10533, 25740, 14566, 11848, 8966, 20231, 9848, 11140, 43, -20606, -47025, -21210, 5682, 523, -13033, 7034, 8438, 9883, -13556, -979, 35643, 11243, 8712, 14859, -26864, -30751, -33620, -25272, -13462, -12490, -1888, -18508, -5633, 4735, -9996, -9548, -6166, 1672, -23757, -12189, -4748, -3485, -3357, 8184, 15295, 44332, 72416, 73283, 58554, 33771, 22366]
12844B2366q746l973J0553M513l488j9694K641o828j1351j3808j4524J6487O3901
12831C8049M822L2469j964o93l7471m1859j289N735j2769l9044j3253J2701M6971
12818g595J213N119L577l304l0626K8008J8112j3225k5418o683q668l1139k6180
12805i6809J9217N3595M7840R863r587j3217j7196K1949Q965k4166l6657R505
12793b6698J7783M1570j7736l5220M3546k4902m6790L038j7737J4750L6784N051
12781f561q096j221K705N229q938k4226K7679K3546k434r626r777J5458J4771
12768A8509k4362l6404q831L3211J6780Q767M565k2969l938J8711J7058K676j5260
12755H513k7166p8302O180O0682L3957p713Q506M372k555k3088k091N4973J5969
$$ y = [22366, 13620, 9647, 20200, 24713, 21225, 1531, 4172, -2656, -14007, -27815, -42339, -25852, 38049, 42871, 75340, 73376, 72683, 35212, -6647, -7936, -2201, -14970, -54014, -67267, -54566, -7595, -6382, -1263, 2314, -990, -31616, -3608, 14504, 1279, -24139, -30822, -39490, -70629, -96809, -77592, -23997, 23843, 33706, 24119, 10902, -6294, 15655, 24620, 454, -36203, -26698, -8915, 32655, 14919, -20301, 23245, -1657, -48447, -45409, -63146, -48396, -11612, -6561, -14657, -15878, -13173, -7944, -16882, -41108, -13429, 10117, 7683, -1943, -11720, 3738, 18509, -5853, -42257, -51088, -17877, -1097, 7670, 12235, -10734, -14672, 4039, 21097, 23773, 8513, -18653, -96955, -90775, -30093, 3864, -3849, 4657, 9029, 6474, -16614, -18705, 36268, 52237]
12742E2237j7512j4584l1378L3978J2254l1285j1211J5571o282j3830O925L074
12730b043k0324J4073M8840J8696k4178m3061K0205J8960l1913j4688Q848j4454
12718b1039l6030K1778N8474J4697k1615j4860k0340j5888j858R003K0906k107
12706h879k1438K9423J6079j5487n223L472n923l390O027N014K706J3088l498
12693A1971J8751R92j0210k1074j4586J3656j7124R812L9138p873N848j7072K670
12680A4899m364p40q513j991J6858l78j7136J0758k5525O189O856j5045K3222
12667E090J8612L9483n641l7649p052J3043m1840N673J0161l061k2787k2240J5394
12654c2814O725j0387r674J0476L6464j5968O129J3795m184j8056Q340L4886j2959
$$ y = [52237, 34725, 20141, -11237, 22741, 34995, 3710, -7501, 8070, 1788, -12042, -5117, -2043, -22367, -8294, 40546, 59242, 35064, -7997, 12208, 31168, -745, -15433, -6585, -21039, -57069, -35291, 23183, 37880, 16265, 1405, -18935, -34823, -36681, -27678, -6772, -8879, -30317, -894, 15185, -302, -5525, -2053, -7976, -11366, -5339, -325, 2381, 15469, 11971, 30722, 31714, 21504, 430, -14156, -500, -17624, -7812, 31326, 23453, 29301, 12229, 14899, 10535, 9795, 1282, -709, 16149, 15771, -1365, 9393, -16132, -9943, -3087, -18132, 5090, 23702, 63185, 57544, 19895, 12843, 25886, -15954, -10281, -120, -3181, -25968, -48208, -32814, -26089, -36476, -46150, -35674, 790, -15178, -9049, 4746, 562, -17494, -9154, 25732, 12773]
12641A2773J4461J9290k2556O513l6433l369p08N098J5926J607l2098l7713K4462
12628c2747L1666j6115J0330N357K1380O980j7043n851K5834j4994k1179k3273
12616b9655M0823J2344K690j6205P276N405Q304o683k472j651K2967k5806k8890
12603a1553j7572K26m12R195K4421O762j520j2141k6563K590L421N55J995L3021
12589A2425l2587m442J9613L921m4449j5408J7072j9836K2027K2356j5653j5346
12577e0307N374O839J1552r209J6906K2934q11o436J3783Q100J0894M22r061J4857
12563C5837K5237j0460m8337l9384j064n096J6938k504j7323K5006L1102k348
12551G604k7014K7524o185K4905M201k5899m932p395L296l8896K800r155J8072
$$ y = [12773, 27234, 46524, 23968, 30481, -5952, -9321, -10029, -4931, 10995, 12602, -19496, -57209, -32747, -1081, -17196, -6866, -1509, 19871, 26851, 9808, 3957, 29791, 14797, -6382, -29655, 11168, 23512, 26202, 9997, 17273, 22678, 30982, 24299, 21827, 20176, 43143, 17337, -11553, -29125, -28899, -29311, -20116, 4305, 11067, 9547, -2594, -29157, -26567, -23146, -22591, -20596, 12425, -20162, -24604, -4991, -1070, -45519, -60927, -43855, -63691, -41664, -19308, -34961, -50307, -44933, -38094, -26542, -35751, -18845, 4089, 3278, -3158, 10625, 18725, 29619, 30041, 20980, 35837, 61074, 50614, 2277, -37107, -38171, -43267, -26329, -28833, -46156, -21150, 9952, 7604, -19410, 8114, 1929, 26834, 31035, 5136, 204, -7191, -3895, -42791, -39991, -49146, -31074]
12538c1074J3135k7537j7498K8304M7454J2997j3062k9002P170N900K2648K120
12526B1555K826j4464j2024j0295j8689J9796j1600k4821J59j9996J3168M3079
12514a1306K8017N228n242m307q991o853J0782k94J1192l454r874R236k046K49
12500A2337l1085l7559j2113l496p570Q082M4267J3049J3477P551Q584J5071J5414
12487D6009J9429O752l2946k4002k0119k3997j823J1335r106j9658q903n172K4602
12474c7599P908M4835K0862k1285l9506O688K6344J1201l1133o872o460q175q90
12461c4082L6965J2516j8528J1632j5066j705L1735P725m4107j9195Q179L5836
12449A1905R335K2105M9267k3376o4966q920k3178L9568J1425l3220l4630K481
$$ y = [-31074, -17939, -45476, -62974, -34670, 12784, 25781, 12719, -16283, -9113, -3213, 19435, 21555, 24381, 9917, -2107, -12402, -31091, -11295, -22895, -47716, -47557, -67553, -54385, -11306, 16711, 21939, 16697, 12390, 3399, -3454, 7328, 7034, 18226, 14772, 4898, 14134, 12088, 12337, -18748, -56307, -68420, -71916, -79486, -71404, -27137, -14088, -611, 6940, 15524, 30595, 46009, 65438, 72190, 39244, 15242, -4877, -28874, -30697, -19362, -28468, -48126, -57029, -62201, -37599, -29691, 15144, 36006, 14721, -24785, -18097, 8247, 19448, -11685, -18557, -25017, -33192, -34082, 2883, 15399, -3129, 8503, -6563, -8268, 23467, 31192, -12915, -32110, -23931, 11905, 21240, 43345, 92612, 69236, 4270, -4650, -27828, 11740, 23165, -10055, -44685, -42204]
12437d2204K1525j1458K5588L6678j7100r727j4873j9064M554J7325L211l5629
12425d1174k4704L3314J6694k1508j6006M265J3169J5977k3867m169k853K4556
12413b6306L0119p915m716K4077M3822R037j8921j3945k5804j4712j6345k3886
12401d5495J5903L3027J1859J4137j0261k6059K2009k732J3664j5393K407K3134
12389C6200j2616q0068j4303N9773K3718m986J3441l241O972q168o4j2199m975
12376e16l1936k974M291K597q819N092j7727l6719J7304J4919L4195J8982J62
12363a149J7301m37L169L39N029l0423j458K5095k2001o317K7598L6558J2045
12350F5349k1023m3584j2216K911q892O082k6238j1810M6498K9218j965l165p294
$$ y = [-42204, -20679, -32137, -6549, 30129, 13029, 3302, -11571, -30635, -26081, -8756, -5545, -41174, -65878, -32564, -15870, -37378, -53384, -49119, -35950, -19973, -43840, -48009, -50862, -26306, 3813, -4102, -8818, 15259, 59081, 68118, 49197, 35252, 9448, -5264, -21609, -45495, -29592, 3435, 15294, 29431, 19170, -6889, 15120, 12388, 26052, 10659, 13066, 36200, 23584, -56484, -70787, -11014, 12704, 7718, 21159, 17918, 24890, 16722, 16658, 4459, -516, -32452, -35426, -31135, -28538, -37357, -32265, -49992, -86711, -69407, -54488, -20293, -1311, -1149, 16152, 15715, 18884, 19223, 24252, -6171, -7629, 17466, -4535, -10852, 16746, 53304, 65349, 44326, 742, -11474, -8563, -17455, -11373, -37611, -49421, -2923, 26295, 24330, 21165, 13871]
12337A3871k0750R00J7155k655k8722k44J3468j3058P519K6070m090L978m66k811
12323A0165j7793j5571j2357l2427L724K4447r430K2800K3195J1979J6189K2j7016
12310G927j3939m599L4022o869j9636J8397k3500q774j240j6258j5942J7308p004
12297d0107l741K1526K4144J8362p143j3554r268J0018j5775k5755K477L5498
12285c318K7153R74j6777m7877j5101K7249r448K3242q30j7089K4673J4381j138
12272F094l0691J5460j5348j965q446l803j7059o658K2187J7140n165J4701L1714
12259A8161j1879j0497M7692L853j1253j3159q791k9554j2426L8696l0899m3267
12247f3323j9962L8267K2363j3932l187J5551j2872k831N769K3760J1108p692
$$ y = [13871, -6879, -5979, 11176, 8521, -20201, -20445, -6977, -20035, -12516, 13554, 9464, 13442, 12976, 10165, -7628, -23199, -35556, -67983, -64259, -39812, -49242, -26442, -3247, 8732, 24921, 24943, 7927, -6012, -10611, 23411, 16542, -3094, 15303, -8197, -16971, -18211, -34469, -50411, -33103, -40107, -43848, -22322, 1822, 20184, 13041, -513, -9781, 237, -15538, -41293, -38816, -3318, 23835, 24809, 8032, -39845, -54946, -27697, -37145, -13903, -14733, -31822, -7149, 7232, 6094, -24597, -9137, -24485, -26450, -34896, -38699, -55758, -62416, -40229, -23089, -28254, -13553, 18161, 6282, -4215, 43477, 47330, 36077, 22918, 14127, -15427, -27853, 10843, -20056, -63323, -83285, -45018, -22655, -36587, -39774, -24223, -37095, -39926, -34157, -10397, 711, -6981]
12235f981o947J6730p460L252J5659j101J0719o087R350K5784k3425l0167j5801
12222a6475J1497L0496N406j7607l7227L950l761r851R774J4785K1352k489n837
12209D013J054M536j3632k5654R20l313K4810p072o339k8800l619Q144k674j619
12195d9245L9338K1292O934R239M036J6108l5371j7471j2774J068o024J5601K5053
12182A7784j3403K7941o888j7820N180J306j9392j61K2892J5816J9537P844m2959
12169A7677j6217l7545j3591L8222J4786J3120L092j5886q818n899P770n504n393
12156a4186J0069K366J3809j4043K637J5744J5881k2327k6425k2K3674J9277j6580
12143I874l054j063j7287J096K7137K0375J8169j9686n3116k7781J0759J6519
$$ y = [-6981, -13928, 2802, -4658, -1406, 14253, 13152, 23871, 17784, 27134, 52918, 29493, -674, -16475, -4978, 25518, 30924, 13317, -23910, -19960, -23721, -33572, -23798, -9013, 12339, 9850, 4013, 5067, 9603, -4029, -29683, -28763, -32076, -7266, -14338, -20677, -49477, -53096, -44952, -47626, -49245, -9907, 11385, 18319, 27558, 31594, 47702, 12331, -5140, -17914, -16846, -22870, -7269, 17784, 4381, 32322, 25434, 7614, 12794, 14100, -5292, -5453, 17439, 33255, 52792, 60636, 17677, 1460, -36085, -49676, -11454, 3332, 16452, 19544, 3658, -5160, -11059, -3289, -8793, -14186, -4117, -1751, 12058, -1985, 652, 16396, 32277, 9950, -16475, -16497, 7177, 26454, 9874, 6820, 5757, -11530, -10434, 16703, 37078, 55247, 35561, -17555, -45336, -34577, -18058]
12131a8058O371J1866l0134N756o346L1001L7797l8953k5587j8540k7343K536
12119f9634K9679L3393J1948j2077j6087J7328L061J5021J9397j5104p169p543
12107B213j4168J679K3951J7015q541j894l8515l2893N3231M5499R087M723k3541
12094C7846N821r877l4643k5155J3525J4359k0920m4288P811J9512M311K7928
12082c770m654n264q930p46j7904l897N715R06L9528J8431j0169K010J9426J4695
12068D5377m255L907K6059p951j7220k6910P61j9041l0571Q142J1496J4890j2909
12055h225L8766M169k3821k727K2208J9954k3150k1630k6228j1727K7928K8759
12043B4276p98Q571K9875k4207n0486m918k263p457L9134j3854N41j6216J7730
$$ y = [-18058, -11687, 179, -29955, -24199, -30545, 456, 38253, -700, -26287, -44827, -72170, -69634, -39955, -6562, 5386, -6691, -22778, -5450, -2389, 12632, 32029, 16925, 9756, 2213, -11955, -10276, 13675, 30690, 22149, 20255, -18260, -51153, 2078, 47577, 56664, 61387, 37846, 43667, 33790, -853, -26008, -12483, 1876, -19044, -63332, -55521, -36009, -31698, -3770, -8424, -13688, -22618, -23364, -41268, -45165, -39450, -38544, 984, 19415, 9246, 11256, 30682, 45377, 41122, 45029, 71088, 63137, 45917, 19007, 19768, 727, -29844, -21702, -10206, 4684, -8225, 30541, 34710, 10889, 8162, 30370, 50324, 27174, 5544, -20684, -32411, -4483, 24276, 23478, 32049, 61924, 37717, -12769, -17687, -19950, -27407, 11727, -2127, -1586, -17802, -72]
12030g2K0783J2472M601q7k9803k6180l553J7280j049n395q704j7550L2179J1679
12016F601k4403J0280m530j0456J6033K1583j9461p499J9411P893k861k596K2598
12003C2593L535j0580R81R290k4191K2004j1314J3385L0227J3659r976m5310k9464
11990e161r97K5463J7629l567j9126j156j8082N417K2101J8813r252k6046O892
11977A2928l4248r552N3446L9855n581l2810j9817K6296j6904k761J1687K4506
11965D7045J6891K0959q790l0423K3649J276l9860J761M217J8961J3877k0006
11953D9557k3428k475j2799j8102J8618J7828j9537n901N0603n728l8287l615
11941F734m291K717k9418O562L7081K0431K238J2392O813k1458j109M072k8539
$$ y = [-72, 20711, 33183, 37784, 37697, 7894, -18286, -21839, -4559, -5608, -11003, -19707, -37257, -5078, 6601, -17802, -7522, -12052, -22508, -6475, 15108, -4353, -11852, 7559, 15452, 12591, 9995, 32593, 36128, 25548, 26529, 35819, 11628, 33632, 22318, 35703, 65930, 79589, 69613, 24303, -5161, -6158, 19305, 36934, 33367, 14241, 13085, -4997, 420, 22521, 41334, 32082, 6036, 12928, -21320, -30872, 22574, 62429, 56848, 24038, 4221, 30517, 13613, 10852, 22539, 47045, 63936, 84895, 76105, 45682, 69331, 70607, 30747, 32508, 36725, 55686, 69563, 49557, 26129, 23654, 10855, -7247, 11371, 29199, 9662, 3761, 54364, 48636, 10349, 6734, 2443, 5160, -24258, -17696, 19385, 39816, 42054, 54446, 61259, 39801, 38692, 42764, 14225]
11928A4225J611K8052J8342j2853l1566k0434k1935j8945P675L5843J1797j990
11916I822n45q345J0689j5610j8669k6205L589R729K0332J1867j8655J6084j1194
11903a7111L5388j857j4534l8837K9378R956k0934j2165K6995J1985r051l1713
11891c2500m2246K1633J3702J4135L2312K0994J244K0968N90l8110k726l6664
11879b6668o667R145J8150J3179L1172j3899j9653q876K0307r304J0033k3759
11867f840j0886K8532K5381j9689m408l479Q025j0343J0806k2424M284R920j8734
11854i855k0370L6695J5898Q857q348j9736k069j860n569q032L2864K358l72J7701
11840C8162P494n872k5384l1253p268j569j2876j1876k0672J8846J3692o697Q583
$$ y = [14225, 15836, 43888, 62230, 49377, 17811, -2623, -24558, -43503, -35828, 15, 11812, 9822, 9277, 932, 11621, -3989, -22658, -48863, -45274, -35545, -15213, -3346, -22001, -5917, -17111, 18277, 16420, 1886, -36951, -7573, 2383, -18551, -30716, -3721, 8264, -787, -32500, -74746, -53113, -39411, -25276, 7036, 28030, 29274, 50242, 50832, 12722, 9996, -26668, -33335, -24190, -6040, 7139, 38311, 24412, 4759, -4117, 16190, 6886, 16919, -6840, -17726, 10806, 36187, 16498, 12090, 8611, 16636, 6293, 17099, -5325, -1041, 8879, -9855, -30225, 6470, 22368, 31225, 22877, 3141, 1072, -788, -6357, -14389, 18475, 20833, 20461, 38162, 45656, 39784, 14400, -16853, -24121, -25690, -38566, -50442, -71114, -52268, -38576, -45273, -36690]
11827c6690J9049m925p280L372R232J753o427O637j2949K8028L3654Q767J4899
11814E7120K8492J5000j7684j5786j7635j9890k8001K3826J8301O664k6827M995
11802B8575J4372K4726k1145k8158n247q312k6829o001L818K1806J5290j486J8362
11789B9771j698l4204K71N7578j7976k0918L8791K6288J4118q479j1455l9561
11777C2526l7012k9061K7557L3541k986K5012L597n413k646l6687P070K986J5457
11764C3941J5002N143r278l3095k096r662l672l523Q620j6893J930K366J8900
11751G683P622J2792j509l4866L186K3896o98J079J9450m441L205k8673j5711
11738f985k0928J6526r639k1631J9201L3626J0006K3621O760k1158K9133K404
$$ y = [-36690, -17641, -22566, -29846, -26474, -17242, -15489, -21916, -15279, -28228, -200, 33454, 42221, 57120, 85612, 100612, 82928, 67142, 49507, 29617, 1616, 25442, 43743, 50407, 23580, 28575, 42947, 67673, 46528, 18370, 13123, 4811, -22018, -28019, -24201, -2395, 12895, 11409, 29771, 28073, -6131, -5860, 51718, 33742, 12824, 51615, 77903, 92021, 83542, 72087, 32526, -4486, -33547, -5990, 27551, 24565, 49577, 53174, 47761, 45115, 8428, 15498, 18484, 33941, 48943, 54086, 44808, 11713, 9617, -45, -3717, -7240, 1380, -15513, -13583, -11217, 7683, 15305, 28097, 26588, -8278, -5092, 18804, 18106, 19185, 38635, 34194, 37399, 8726, -6985, -27913, -11387, -21026, -42657, -23456, 10170, 20176, 43797, 50557, 29399, 58532, 60936]
11726F0936k3828m7714k4350L169J1379j1008j2692L6023K6189M427j4606K744
11714A0669R481J9309k2020m2201J779J7009K3535L6740l3457m2619J2714J9429
11702A0368n978j701o804P202J0759j854j4432K688M0704R237k11j7814o9480
11689c7316m401L6105L9849k6215k2102R396J2384J152j6688q037q967j6136J7767
11676b3209L735p303k451R266K1908l451J4117L5928j658m5479J4131j8538m0225
11663d3229J8255L6599K1881l4857j2295j9550J6485J0367k58L0898K6966o052
11651D5210l2489j2077J3186l508o575j754j0733k3716J6305M7071k232J3035
11639D1723J7271K0421M861o3598O492L854q288k0184j0200j6197m204j0591O963
$$ y = [60936, 37108, -10606, -34956, -31787, -20408, -31416, -44108, -8085, 18104, 22531, 7925, 10669, 20150, 39459, 17439, -24762, -22983, -5974, 17561, 54301, 20844, -21775, -9061, 10368, 4390, 2689, -4115, 3087, 13846, 11992, -2440, 248, 40952, 50189, 49978, 32164, -37316, -41717, -5612, 34237, 8022, -14080, -4684, 7700, 8852, -7836, -15873, -24840, -40976, -23209, -19474, -26777, -29228, -19962, 1946, -1505, 12612, 48540, 46882, 1403, 15534, -3004, -43229, -24974, 11625, 33506, -1351, -13646, -33196, -16711, -6344, -6602, 24296, 51262, 45210, 12721, 644, 13830, 10322, 3747, 1993, -8740, -32456, -16151, 30920, 28688, 41723, 58994, 79415, 84276, 20678, 27170, 31024, 22736, 2552, -7648, -23845, -28049, -38640, -31677]
11626c1677J3449L7871Q581m696Q550n0339j7744L8454Q030k1558J3401K1607
11614B3929j4166q99J6219Q298k9063K6101M909j790q580j1950j6053J7627J2092
11601B6674K2326M93J528k1806m390J549o942J5853J6505L088J8389J663p873
11588F7057k5101K0148j3001m0853m1069m0863n52M6570L1174q973P576K6038
11576B8151l34k6809k1718k0290o409L8092L9933k9363J1616k6212J0261j5051
11564a8133k4193j868J3179K1414M527R946j7952l685J2420J5453J0381K7891
11552D9380L6072j2031m0000P878l5002J376J5235n851J1817J6723j7594J9715
11540D7718L038j6230j7746m4687J1827J0234m920J5652j1848j161K06K0077K3054
$$ y = [-31677, -18228, 19643, 28224, 23528, 32078, -18261, -36005, 2449, 10479, -11079, 2322, 23929, 9763, 8864, 25083, 33381, 4318, 30419, 35328, 33538, 24958, 13008, -3045, 14582, 26674, 49000, 49493, 51021, 29215, 24825, 26374, 19432, 35285, 51790, 54878, 73267, 74930, 67057, 41956, 62104, 49103, 8250, -32819, -73682, -74234, -27664, 3510, -5463, 2113, 28151, 27817, 1008, -20710, -41000, -47409, -9317, 30616, 1253, 12869, -13343, -3082, -18133, -42326, -44194, -31015, -9601, -5074, 4872, -13080, -16765, -4345, 11108, 21489, 49380, 85452, 73421, 33421, 41299, 6297, 7673, 22908, 17057, 28874, 45597, 28003, 47718, 50756, 34526, 16780, -27907, -16080, -5846, -10766, 4886, -6962, -8123, -7917, 12160, 35214]
11527C5214K6856j1006n0516j3747K2433J5495j8910j2859J6098J5270o214Q208
11515B6322l367l01n094L547j5309N784j576K2821K8050J0582l2263k4441K3008
11502C7763P521j1125J7175J8168r857k0407Q6p852K15J7277O6631K429l9316
11489G8708k107j5082k2978J3046q133n830j3464o677K4420P860p102J9751L9644
11476A02056l010m801R892p924m6939k9566J6718L4241J7836j0918j2407k7639
11464C7539j4512r112l1763n8638j1716j9015l9359J9743j1072m0818k8093j109
11452b07925R169K4705J3534K3672L5081M0457K5299L978o139l283O8992J8580
11440D6120l5814k9488P348K4155j0600J131N784l141M748l755n215J4983j7935
$$ y = [35214, 62070, 51064, 548, -13199, 9234, 24729, 5819, -7040, 9058, 24328, 18114, 26322, 22955, 22654, 17560, 21107, 5798, 11582, 10006, 32827, 60877, 71459, 39196, 14755, 37763, 45284, 34159, 51334, 69502, 59645, 39238, 39324, 31472, 31687, 48964, 115595, 118024, 78708, 76601, 61519, 38541, 51587, 43454, 37624, 24160, 17483, 41903, 49763, 42661, 62412, 102056, 99046, 94245, 104137, 96213, 49274, 19708, 36426, 70667, 88503, 77585, 65178, 37539, 23027, 13915, -17848, -76486, -88202, -107217, -146576, -126833, -137905, -178723, -206816, -207925, -198756, -174051, -160517, -136845, -101764, -61307, -36008, -32030, -38169, -41452, 27540, 46120, 10306, -19182, -11834, 12321, 1721, 2852, 8636, 5495, 10243, 6488, 1273, 16256, -1679]
11427a679K2294L7645p637q987N667K236J4788j9062J7925K2753J0282M3852N1062
11414A91139J612J3754K485N977L2211P6894M5799O9562J05560J27815J45470
11403H18278J89514K24788K50337K13878J97519J40106Q8281K4683l3535j36047
11393A977802k28956k25657k04605k21452j80155j74042j43878j12587q1271p4485
11383C30714j6157m5992l2358J1424L0148j988j7094j7923j9704k0313j4434J8216
11371B04539J3602j477q700j6782j2325p180L61k6872k6302P732M004j3397L275
11358A20478k348K1154k2965j7483j856r230l094K3501l7150l5926k0838K1916
11346C6159K0450J3061P992M418K956j2788n5639J0892L3132J0116P616L0598
$$ y = [-1679, 20615, 58260, 50623, 41636, 47303, 49539, 64327, 45265, 63190, 85943, 96225, 140077, 191139, 192751, 206505, 208990, 214967, 247178, 324072, 369871, 439433, 544993, 672808, 818278, 1007792, 1232580, 1482917, 1696795, 1894314, 2034420, 2122701, 2147384, 2113849, 1977802, 1748846, 1523189, 1318584, 1097132, 916977, 742935, 599057, 486470, 405199, 330714, 314557, 268565, 236207, 247631, 277779, 275791, 258697, 240774, 221070, 200757, 186323, 204539, 218141, 216664, 207964, 191182, 178857, 171677, 172038, 145166, 118864, 126596, 130600, 117203, 120478, 118130, 139284, 116319, 98836, 96980, 87750, 84656, 108157, 71007, 35081, 14243, 36159, 56609, 69670, 77662, 82080, 85036, 72248, 16609, 27501, 60633, 70749, 78365, 108963]
11334A08963O897l4071k5484j8461R299L1492J4597p857j5119l7228J8596K5889
11322G7513J2402M996o62p918l1958J085L4796N6864O791n7877J2272K4711j7752
11309A15263l3036l037K1323o187L549j2231m7331j03j4901m3230l1032j4367
11297f5320n7900m1994O526q38P009O56L4196J0721k420k3377l631r83J0814K2364
11283a04177K7154L6040l198l073L2125K2605M324J7309L0113l6438j2236j730
11271H818j8348J6851j4699q862j5387J7111J4251J6149P810j4172J1717R702
11259C0941k5561P745P469M4566J1041j4430J5132J3714J0351M1302M9186L8382
11247B29838M3918N0501j1987K5968P4125N8766l0517l8751K5773P779j1225j0490
$$ y = [108963, 115860, 81789, 56305, 37844, 47143, 78635, 93232, 85375, 70256, 33028, 51624, 77513, 89915, 94911, 94249, 86331, 54373, 55458, 90254, 147118, 153909, 96032, 108304, 133015, 115263, 82227, 79190, 100513, 94326, 97875, 85644, 38313, 38210, 23309, -19921, -50953, -65320, -123220, -165214, -158688, -159526, -152517, -151861, -117665, -106944, -109364, -132741, -136372, -137355, -126541, -104177, -77023, -40983, -44181, -47254, -15129, 7476, 11800, 29109, 59222, 22784, 10548, 8818, -9530, 7321, -7378, -16240, -31627, -14516, -265, 15884, 23694, 9522, 21239, 30941, 5380, 13125, 20594, 65160, 76201, 61771, 76903, 90617, 100968, 142270, 191456, 229838, 273756, 324257, 312270, 338238, 412363, 471129, 440612, 401861, 427634, 435413, 424188, 413698]
11235D13698k8283m9781l3637m1748m2401m0488k2887Q11j0131n3481k6304P192
11223G2560K7107J33q04n455k125j8809k4521L735k886O293l2958K7680M6339
11210I6289K088j7082k6940k3329L5064J7856L663K0511n050k2686Q463O776o980
11197H8643L4284J5898j7157k4087N046J7389J5533M1347R303L37K4306M2425
11185B53267P39p610l1552k1064q589K4696M5552k4051m1511r905n0040n2831
11173G7101l975K1375R414l0061l6126J7465M799K3759j1967j5823O443K525J460
11160F6389L4308J1916K0362M3199L0960j292n368j1563L47K4577J5793J4363
11148B43991l7519p1869p3547o1019o9820q1913m3728j1296k9386K2700R174M4958
$$ y = [413698, 385415, 335634, 301997, 260249, 217848, 177360, 154473, 155284, 145153, 91672, 65368, 72560, 99667, 99800, 98996, 93541, 91416, 72607, 48086, 51821, 48935, 55228, 22270, 49950, 96289, 98377, 81295, 54355, 31026, 66090, 83946, 87609, 108120, 103070, 80384, 88847, 95623, 88643, 122927, 138825, 121668, 97581, 102627, 120016, 135549, 176896, 186199, 186536, 210842, 253267, 254006, 246396, 214844, 193780, 185191, 209887, 255439, 231388, 189877, 179972, 129932, 77101, 73126, 94501, 103915, 73854, 37728, 55193, 59992, 83751, 71784, 55961, 62404, 64929, 66389, 100697, 112613, 132975, 176174, 207134, 205842, 200474, 188911, 189258, 213835, 229628, 243991, 206472, 134603, 61056, 37, -69783, -151696, -195424, -206720, -236106, -213406, -204232, -159274]
11136a59274J0002N1440N8945P4596N0898K9473K5357L4474J5505K7545L2108
11125B51069M7473M7576L3266N7268P2741N5573Q5290L5281K3116L1739j4868
11114G25524l6434n7531r4348n2702o6693o6630o6165n3869k222L132o228k8518
11102A97316J6559K7644k025K4763J6767J6729q076N55L036L4280O5162L7951
11090D30661n720J5690M7914Q3146K3251j081L4000K1525J4631M0588M0947L9302
11078G84854K4352L601J0194K7812J233K7074P1P062M4626P4097Q1828K7192R662
11065A123658n811J8365J4703j0929j631K7140R524P37p855O4875O1289N0676
11053A344741O5082J06156P1279P827O6864O2068M3699N9830O7477O6579O1533
$$ y = [-159274, -149272, -97832, -38887, 35709, 86607, 116080, 141437, 175911, 191416, 218961, 251069, 298542, 346118, 379384, 436652, 509393, 564966, 650256, 685537, 708653, 740392, 725524, 689090, 631559, 537211, 484509, 417816, 351186, 285021, 231152, 228930, 232062, 225834, 197316, 213875, 241519, 239494, 264257, 281024, 297753, 289677, 290232, 293268, 327548, 392710, 430661, 424941, 440631, 488545, 571691, 594942, 593861, 627861, 649386, 664017, 704605, 745552, 784854, 809206, 812807, 823001, 850813, 852046, 879120, 879191, 886253, 930879, 1004976, 1086804, 1113996, 1123658, 1117847, 1136212, 1150915, 1139986, 1138355, 1165495, 1175019, 1175756, 1167901, 1232776, 1294065, 1344741, 1409823, 1515979, 1587258, 1595085, 1661949, 1724017, 1767716, 1827546, 1895023, 1961602, 2023135]
11042B023135O7857Q5147N8325J00947R0975P9423Q1968Q6259J39635J28919J42265
11031C084855J36153J47248J91644J62190K30424J99356K93425L00182L72635
11022E118112M22203M41606N10016N59891O65014Q05192R32156J044046J263757
11013A1761993J503246J721495J918511K187808K422125K648739K874948L145973
11005C0184838L450989L801118M336166N109581O143852P622961R697029J2642277
10997H2988811J6756724K2177420K8840550L5552635L9946168M2203062L9561139
10990C08026509L2640116K5531956J5639566L442379j2803611k6655668l6727931
10983C09093316m0212612m0900082l9733405l7534957l3169748k4058032j5751122
$$ y = [2023135, 2090992, 2176139, 2234464, 2335411, 2426386, 2505809, 2587777, 2674036, 2813671, 2942590, 3084855, 3221008, 3368256, 3559900, 3722090, 3952514, 4151870, 4445295, 4745477, 5118112, 5540315, 5981921, 6491937, 7051828, 7716842, 8522034, 9454190, 10498236, 11761993, 13265239, 14986734, 16905245, 19093053, 21515178, 24163917, 27038865, 30184838, 33635827, 37436945, 41773111, 46882692, 53026544, 60649505, 70346534, 82988811, 99745535, 121922955, 150763505, 186316140, 226262308, 268465370, 308026509, 340666625, 366198581, 381838147, 385280526, 372476915, 345821247, 309093316, 268880704, 227980622, 188247217, 150712260, 117542512, 93484480, 77733358]
10976G7733358j0353648p001413m947991l618696k756710k177944j824231j482906
10968D3569819j304900j193564j175306j208746j166963j157687j209153j338949
10960C3814551j457494j542377j575559j587759j591797j602066j530280j432268
10952B1494951j404284j261708j169963j068448r88014r12055q35527p68851p08703
10943A2377398o39219o33500o27941n88488n28929n02012m74570m41293m25688
10934G515758l84260l34058l57979l18518k84313k89535k80069k49287k28017
10925D789722k04169j97170j94719j68207j24719j54012j36786j52308j57270
10916C300362j46162j31791r0700j30351j49161j27838q9591q9688r2611p9807
$$ y = [77733358, 67379710, 60378297, 55430306, 51811610, 49054900, 46876956, 45052725, 43569819, 42264919, 41071355, 39896049, 38687303, 37520340, 36362653, 35153500, 33814551, 32357057, 30814680, 29239121, 27651362, 26059565, 24457499, 22927219, 21494951, 20090667, 18828959, 17658996, 16590548, 15602534, 14690479, 13854952, 13086101, 12377398, 11738179, 11104679, 10476738, 9888250, 9359321, 8857309, 8382739, 7941446, 7515758, 7131498, 6797440, 6439461, 6120943, 5836630, 5547095, 5267026, 5017739, 4789722, 4585553, 4388383, 4193664, 4025457, 3900738, 3746726, 3609940, 3457632, 3300362, 3154200, 3022409, 2931709, 2801358, 2652197, 2524359, 2434768, 2345080, 2252469, 2172662]
10906B172662r4463r4542o5850q3033n9366m8543o5762o6061r4513o8531l9695
10895A392303p2535n3411l1638n5695j0483j8243j9600l1097o2815n3354R358
10884I92790K0325p654j4544j4592j0699m0733l3035l2439J5117M2483l127r274
10872I04618r145K2538M7914j2360K875l608K9345K2939l7675J415Q012k7692
10860I49176n4764o0799k4739j2345n7454l4741k2742k9735n0212k7101l447q62
10848E70235J3679K0812J2682O877M2605K3091O707O948M1948M431M1105L7079
10836H28199M2225K3530l5j2252k1098m1066p8797n5308n9204p3885k2732j0449
10824E19128k2811J6012J4271M6951J805q497m12K744J9619K4160J94j4702M140
$$ y = [2172662, 2078199, 1983657, 1917807, 1834774, 1775408, 1726865, 1661103, 1595042, 1500529, 1431998, 1392303, 1319768, 1266357, 1234719, 1179024, 1168541, 1150298, 1130698, 1099601, 1036786, 983432, 992790, 1013115, 1005461, 990917, 976325, 965626, 924893, 891858, 859419, 874536, 917019, 913892, 904618, 895473, 918011, 965925, 953565, 956440, 952832, 982177, 1005116, 967441, 968856, 976868, 949176, 894412, 833613, 808874, 796529, 739075, 704334, 681592, 651857, 601645, 574544, 571097, 570235, 583914, 604726, 617408, 624285, 666890, 689981, 696688, 703636, 745584, 750015, 791120, 828199, 870424, 893954, 893919, 881667, 860569, 819503, 740706, 685398, 626194, 552309, 529577, 519128, 496317, 512329, 526600, 573551, 575356, 566859, 566447, 569191, 588810, 612970, 613164, 598462, 602602]
10811F02602R514j1671j3142Q765k0486K2201L383l434m9591l4200q895k063k6172
10798D76811k9613l6755m469m5866l6085j3313J7747N778J9921m022j2770j9258
10786C18106K1495L15k7393o875l575j1509j3853q515j2456O218J157L627m6696
10773B20046j5194J7657J890K2281K911K9404J8120n946J5948L483k4403j0225
10761B75972N000j502o314n478k8510J4281j5730l3543l934P379q726m0435R489
10748A67949K0911l168Q480Q097j5534m6032k841L1365K3498M0536K7554q024
10736B52791k8406j403k1044m573K5491L1525k8899k4592J4474J745k3422k4662
10724A69025p374j9727k8229K3734m24k4551M87L8321O351n410j0743O73j9257
$$ y = [602602, 612116, 600445, 587303, 596068, 575582, 597783, 601166, 597732, 548141, 513941, 505046, 502983, 476811, 447198, 410443, 405974, 360108, 324023, 310710, 328457, 334235, 354156, 350134, 337364, 318106, 339601, 339916, 312523, 305648, 302073, 290564, 276711, 268196, 255740, 261958, 263115, 266742, 220046, 204852, 222509, 224399, 246680, 249591, 278995, 297115, 291169, 307117, 310600, 286197, 275972, 280972, 279470, 273156, 267678, 239168, 253449, 237719, 204176, 200242, 207621, 198895, 158460, 167949, 188860, 185692, 194172, 202269, 186735, 140703, 137862, 169227, 192725, 233261, 260815, 252791, 224385, 222982, 201938, 197365, 222856, 254381, 225482, 200890, 215364, 217109, 193687, 169025, 161651, 141924, 113695, 137429, 137005, 112454, 112941, 151262, 157613, 152203, 141460, 142133, 122876]
10711A22876m0567p686M4895L5840K3664k8266k1353l866Q020L2400j7200o062
10699A42695J8458K4587j4383k784O570L1198N141K4106K5333N310n658j7021
10687B43552K1815P172J7275p923M948J5756N747j8332k2094J6680J5274p240
10675B92630j8209l2228j7221j5939o1302j4376r301r511K0395o355r260j6897
10663A02426J9792K5667p609j2522J1306q710K452j8392j458J5675j2260J0840
10651A27207j5179J6058K9003J3998j5946p037m02j6296n892k377J408j7083j8666
10638H8796o490r762j5799k8858O83J9693j357P18j9373P679L6281L3633k23M114
10624A09735K5780k8574j3848p553j7589j7966P034K3392Q594o485j209N106j5836
$$ y = [122876, 82309, 74623, 119518, 155358, 179022, 150756, 129403, 125537, 133557, 165957, 148757, 142695, 161153, 185740, 171357, 168573, 175143, 206341, 211482, 235588, 260921, 266231, 260573, 243552, 265367, 272539, 289814, 281891, 286839, 302595, 308342, 290010, 267916, 284596, 299870, 292630, 274421, 242193, 224972, 209033, 147731, 133355, 124054, 114543, 134938, 128583, 119323, 102426, 122218, 147885, 140276, 127754, 139060, 130350, 132802, 114410, 112952, 128627, 116367, 127207, 112028, 128086, 157089, 171087, 155141, 148104, 147702, 131406, 125514, 123137, 124545, 107462, 88796, 82306, 72544, 56745, 27887, 28570, 48263, 46906, 47624, 28251, 35930, 72211, 105844, 105621, 109735, 135515, 106941, 93093, 85540, 67951, 49985, 57019, 80411, 89005, 82520, 81311, 86417, 70581]
10611G0581k942P82K476K1768k2890o988o882L3826J8847N43J4640O66j5024N6623
10597A66026K3114k761K5275K0083J2609L2339K3252O673R315R968K9143K8558
10585C83594J0075K9721O5393Q7887J04887J55275K27226K71756K41672K00343
10575A777829J72514J54459O6691k9355r1360k02119k45109j97261k15572k07567
10565I83150j93671j50515j00567o5933p5341m5983j5358j5063N478k0798l915
10554C01484J5171M191j1349l7420k1587J3948J483o140O473r264k0755K2859
10542B59094R286J104r987J2031j3758m2833j6455j1018r487J9578P154j5035
10530A89674K2476K2275l117L5682J9134P524J0754M450q903K1881k2674j1023
$$ y = [70581, 67639, 68421, 70897, 92665, 69775, 62787, 55905, 89731, 108578, 109121, 123761, 124427, 109403, 166026, 189140, 186379, 211654, 231737, 244346, 276685, 299937, 306610, 315925, 325893, 355036, 383594, 393669, 423390, 488783, 576670, 681557, 836832, 1064058, 1335814, 1577486, 1777829, 1950343, 2104802, 2171493, 2142138, 2050778, 1848659, 1603550, 1406289, 1190717, 983150, 789479, 638964, 538397, 472464, 397123, 351140, 335782, 320719, 326197, 305399, 301484, 316655, 320846, 309497, 272077, 250490, 264438, 265921, 259781, 266254, 256990, 236235, 259094, 268380, 269484, 259497, 271528, 257770, 214937, 198482, 187464, 177977, 197555, 204709, 189674, 212150, 234425, 231308, 266990, 286124, 293648, 304402, 308852, 299949, 321830, 299156, 288133]
10518B88133N394k6957l6891n9398m7956J5752k7828m8030J0009O982N1j5634
10506F3627J0252J3226K8106n678j1032o498q512k2430n3498l764l1765J932L9236
10493A3202K671J6700J2465K2106J8680L783r320j8208o369l3380j8652K6536
10481C0214J994m296P530k1673q737j1550J6710O997l702L6929l888l4375k408
10468I745K470m566K2435j5769l886j3079q026K0757O036k5577l678J6208M964
10455H034j0917M618K2941K6431o296l316L468r590j2680j1421m468k6636q687
10442b8519J4833J0549j2413j3743n907J1982L2768N135J5339J8010M097j3640
10430C8491m0472L220L0907R888J0176l7422l321J715Q350L71K9518N926j7403
$$ y = [288133, 293527, 266570, 229679, 170281, 122325, 138077, 110249, 62219, 72228, 79210, 79261, 63627, 73879, 87105, 115211, 109533, 98501, 92003, 83491, 61061, 7563, 3799, -27966, -26034, 13202, 15873, 32573, 45038, 67144, 85824, 89607, 80287, 62079, 55710, 22330, 3678, 30214, 32208, 27912, 35442, 13769, 5032, -6518, 10192, 17189, 13487, 50416, 46528, 12153, 9745, 12215, 7649, 30084, 14315, 10429, -2650, -10676, 10081, 16117, -9460, -13138, 3070, 8034, -2883, 1735, 24676, 51107, 44811, 41495, 44963, 35373, 22693, 11272, 6804, -19832, -28519, -13686, -3137, -15550, -29293, -35200, -23218, 9550, 14685, 30024, 48034, 52131, 38491, -1981, 1239, 32146, 42034, 52210, 14788, 11467, 13182, 21532, 21903, 51421, 57347, 39944]
10417C9944l5456j1523k6710K5416J9430Q773K1508Q125o756k6968J1068J3031
10405C9882j5649m1252K5103L4699K1730R566k6571l1359K7894M6151n431j6583
10393F8180j6261J488M6377K0943k1088Q372k411o9487k4187J9126O830j4562
10381B3320o562j0251k9845q978k399J5780L8217K2939K1731j6801l5870j3663
10369b382r439K3739K1007k3159p845j1541j8809j8519K2249L1996K2685K016
10357C1998j3283k001L4216J0763j5659J8282j3976l1625k944k0209j3708J4289
10345c857K879q489M397R833N379K6425J9875N700j7551j9744J6618J8855k2392
10332C7928K417l2344p505K3501n5424k9420K6452K4912J7434J5776K2023j032
$$ y = [39944, 4488, -7035, -33745, -8329, 11101, 19874, 41382, 49507, 42751, 15783, 26851, 39882, 24233, -17019, 8084, 42783, 64513, 74079, 47508, 16149, 44043, 90194, 84763, 68180, 51919, 53407, 99784, 120727, 99639, 108011, 105600, 36113, 11926, 31052, 37882, 23320, 16758, 6507, -23338, -32316, -34715, -18935, 19282, 42221, 63952, 47151, 11281, -2382, -11821, 11918, 32925, 9766, 1921, -9620, -28429, -46948, -24699, 7297, 29982, 31998, 18715, 16714, 50930, 61693, 46034, 64316, 50340, 18715, 15771, -4438, -18146, -3857, -978, -9467, -5070, 4763, 10142, 36567, 56442, 62142, 44591, 24847, 41465, 60320, 37928, 40345, 8001, 496, 23997, -31427, -60847, -34395, -9483, 7951, 23727, 45750, 44718]
10320D4718l0940j9742q03N221M867M726J5432L31k9216k9408Q948l933j9585
10307d9384P305R612N9293K2211m410k6490n904j2764l370M975J7152L663j221
10294B0668l091K7781L0114k1187j6358p734P164r230j0429m0732j1807j2470
10282d7311J7408J4605R94J4055M3978J7608J1186P463Q510m5115k3232J7575
10270C7724o21k8102O782P7Q492J3816j4260O986k0634l1189N552j6755j4272
10257d6404k739J3135J6655J0743p533p389N4949L2121n929p4n5371P38L6687
10244C9589J2829L4752k4537J2512k1330k2444n519q670q670J3782K4304l5615
10232A0983l3893m2388J906R03J8170J5918J4944Q008j9894k4878M68J9741N1376
$$ y = [44718, 13778, -5964, -6767, -1546, 3321, 8047, 23479, 23810, -5406, -34814, -25866, -29799, -49384, -42079, -32467, 26826, 49037, 44627, 18137, 12233, -531, -3901, 1074, 18226, 21889, 20668, 17577, 45358, 75472, 54285, 37927, 30193, 37357, 28127, 17698, -23034, -34841, -47311, -29903, -15298, -14304, -249, 43729, 61337, 72523, 79986, 88496, 43381, 20149, 37724, 37103, 9001, 15783, 15860, 24352, 38168, 23908, 30894, 10260, -20929, -15377, -32132, -46404, -49143, -36008, -19353, -8610, -16143, -23532, 31417, 63538, 57609, 57535, 2164, 2902, 39589, 52418, 87170, 62633, 75145, 53815, 31371, 25852, 17182, 8512, 22294, 46598, 10983, -22910, -65298, -63392, -62489, -44319, -28401, -13457, -5449, -25343, -50221, -49753, -30012, 21364]
10219B1364K0764j4223q183N316j957j2520k296K424l0732M557J9062J2097j0315
10206E358j3953l1247j5595J9585o240j947L756K6252J3102R679O259J4105j3787
10193A5327l9147k555M4330j6040m1862l2306k2925K7868M8348J7367L2868k9908
10181A365j1866N19J0976M565k7643J0939J5768L266k1233j5562R842J2731l84
10168f717M3274L1315j3364j243j6347J0181q096j2342j4610j4553l708j0345
10156a6555J3197m608k015J2218j4727j8071K1908P723j5631j014J6285J9912
10144A8622q826K665Q398K2913j7959j6177K5344j934l3636k0681m005O983M1549
10131B3256L1364k6401L1082K9562r070M626J9460N911K819Q381l579l2166K291
$$ y = [21364, 42128, 27905, 19722, 25038, 23081, 10561, 8265, 10689, -20043, -15486, 3576, 15673, 5358, -8595, -39842, -55437, -35852, -42092, -44039, -40283, -14031, -929, 8750, 15009, 29114, 15327, -23820, -26375, 17955, 1915, -39947, -72253, -95178, -67310, -18962, -1595, 31273, 1365, -10501, -9982, 994, 5559, -22084, -11145, 4623, 7889, -13344, -28906, -19064, -6333, -6717, 36557, 67872, 54508, 53265, 36918, 47099, 39003, 26661, 12051, -2502, -6210, -16555, -3358, -7966, -9981, 2237, -12490, -30561, -8653, -930, -16561, -17575, -1290, 18622, 9796, 12461, 20859, 43772, 25813, 9636, 34980, 33046, -590, -21271, -25276, -18293, 23256, 54620, 28219, 59301, 88863, 79793, 84419, 103879, 109790, 112609, 120990, 117411, 85245, 87536]
10118H7536j8941p52j9393j5885Q077Q560n48k9875l8920K8636J7401j60j3750
10105A1986K543J0717N660k442q562j1948l2864K4507Q954j1255l560J8804K2040
10092C4580j9034O784o03K6424k4952j0979J4977J4019P022Q01k7266J6497N345
10079D3615M680R968j6336J3836M541k1393l096R342o7958l1309M6460L052j3777
10066a8375j0420J7375J6443K5742n910J6198k586p639m2030R526Q243q592j3339
10053a5364R115J7719J8307j4916o865K549j2931K4100R90j4418p032J2242p342
10040F154K0508o015r525j8610j4567M6385l304l5240j6830O018J7138K1862J7328
10027C1302O58o755P591j428J4872M487m236L822j6930l50j573J0256j3844k8904
$$ y = [87536, 68595, 67843, 48450, 32565, 40642, 49202, 48654, 18779, -20141, 8495, 25896, 25736, 11986, 14529, 25246, 30906, 28464, 19902, 7954, -24910, -403, 8551, -2704, -6264, 12540, 34580, 15546, 22330, 21727, 48151, 23199, 12220, 27197, 41216, 48238, 49039, 21773, 38270, 43615, 48295, 58263, 41927, 55763, 60304, 38911, 35815, 45157, -22801, -54110, -7650, -4598, -18375, -28795, -11420, 5023, 30765, 24855, 41053, 38467, 30828, -11202, -1676, 6567, -2025, -15364, -6249, 11470, 29777, 14861, 7996, 10545, -2386, 21714, 22704, 8286, 1254, 13496, 6154, 26662, 20647, 11122, -7488, -22055, 24330, 21026, -14214, -31044, -25026, -7888, 13974, 31302, 31960, 25205, 32796, 31368, 46240, 50727, 46491, 50313, 33383, 33033, 31460, 41716, 27872, -1032]
10013a032J3410j0726j153J6609Q787Q049k8690k1805K9196J8900K2519l0859
10001B3205j4731J3668N36k5969M792K7084p609k3985J6576j9831k2626J719J7373
9988i798J4594Q054J4357L7847k7705j3065j8459J2027q012q330j1140K2123J0624
9975B3117j0600p326J967j3477O330J2827k3478j8098l909k8408J5984M0990m885
9962h966j4141Q58K6781K7776r672j1115J6572l994q221k4297n4317k3607K2025
9949f4318K5052J6813J4156M580J9632L1408k580J5135m137k6050l0141n909n4641
9936f1000n981K1621P857j8481J6671J7788JQ033J724k7967q034J1962K6848J1760
9922B802m092K6833j3351J9534J4967N849o978R435K7761j3087o4982k6424l579
$$ y = [-1032, 12378, 1652, 499, 17108, 25895, 33944, 5254, -16551, 12645, 31545, 54064, 23205, 8474, 22142, 22678, -3291, 1501, 28585, 20976, -3009, 13567, -6264, -28890, -27171, -9798, 4796, 12850, 27207, 65054, 37349, 24284, 5825, 17852, 9840, 1510, -9630, 12493, 23117, 12517, 5191, 7158, -6319, 11, 12838, -10640, -28738, -32647, -61055, -45071, -4081, -8966, -23107, -22249, 4532, 32308, 22636, 11521, 28093, 24099, 15878, -8419, -62736, -86343, -64318, -39266, -22453, -8297, -3717, 15915, 47323, 44743, 59878, 55741, 29691, -450, -6359, -61000, -66981, -45360, -37503, -55984, -39313, -21525, -21524, -13491, -11767, -39734, -47768, -35806, -8958, 2802, -1290, 25543, 12192, 31726, 46693, 52542, 45564, 54999, 82760, 69673, 4691, -21733, -25312]
9909b5312l020p968K3200J3718j2346J3004O37j8955N32K2771m791p298L747k341
9895d422J2686J4046L4970p540k7871m716j4529j1500J5556p783J3629K2915K1780
9882E7221J4646k0625m8206k0288q178m9260K1367N6432O035k6237J5469J6732
9870A5108l39K320k0097J461M9069L179n3360r913M994L3075J7885K469j7722
9857B8129n549O508J0986j8409j2321k0382j1785J5207K6991P901L7281k5218
9845C9339k9460K9592J5187k3095j1688m293k7533j9669j5660J3598j365k767
9833c7814J1039M8116p931j5545l1600J2526J1767J3589J2572K9611R401L033
9821E8764k0338l3743j8532J7370J7078J679q694O300M129j559J0905j4395j5524
$$ y = [-25312, -28332, -36300, -13100, 618, -11728, 1276, 1913, -17042, -16510, 6261, 1470, -5828, -2081, -4422, 8264, 22310, 57280, 49740, 21869, 17153, 2624, -8876, 6680, -1103, 12526, 35441, 57221, 71867, 51242, 3036, -17252, -25430, -74690, -53323, 3109, 9144, -17093, -1624, 15108, 14769, 17089, -3008, -1547, 47522, 50701, -2659, -12572, -7578, 25497, 43382, 45851, 28129, 22580, 29088, 40074, 21665, 9344, -11038, -22823, -7616, 19375, 27276, 64557, 39339, 9879, 39471, 54658, 31563, 19875, 15582, -11951, -31620, -47280, -33682, -35047, -37814, -26775, 21341, 13410, -2135, -33735, -21209, -9442, 4147, 16719, 46330, 55731, 58764, 38426, 4683, -13849, 3521, 20599, 22278, 13584, 19884, 24013, 22454, 33359, 18964, 3440]
9808C440n144k101j1648k6489j0383J9767l289O054J2631j9462k4296N1011M5760
9795C5851j4697k3331o494L299J9749k535l766k1299J3952J414K623K1039j23
9782B5682l905l0864k8175j0034m458n455M7362O4194r325o4100k6163M800J4168
9769b6273Q426k9141J9641N9619J8309n9857l5096J490K9896K745L1183J957j7773
9756E126J2442k0079j3269J2144L2292l079j1021l030l6078l951K4144o795K0519
9743I365K2353J9209p296l5101k3983j0222L0174o496l3064k9281R975M8748J2847
9730G228o035J9177k6627O604L1652n2843m3943J9838J1010O807P398j293M0573
9717A9546O080k2499R71L9844j3088m761k0547p743k5269q568P341J9430J1045
$$ y = [3440, -1704, -3805, -15453, -41942, -52325, -32558, -35847, -29793, -17162, -36624, -60920, -9909, 35851, 21154, -2177, -8671, -5372, 14377, 11842, 8076, -13223, 729, 2143, 4766, 25805, 25682, 21777, -9087, -37262, -47296, -51754, -57209, -9847, 54347, 45022, -19078, -45241, -40441, -26273, -17847, -46988, -27347, 32272, 50581, -9276, -44372, -42882, -12986, -10241, 20942, 22899, 5126, 17568, -2511, -15780, -3636, 28656, 25577, 14556, 11526, -24552, -28503, -4359, -11154, 9365, 31718, 50927, 43631, 8530, -15453, -25675, 4499, -1997, -35061, -64342, -54367, -5619, 7228, 1193, 20370, -6257, 347, 31999, -20844, -64787, -44949, -33939, -27132, -19734, -21027, 19546, 25626, 3127, 4098, 43942, 30854, 26093, 5546, -2197, -27466, -36034, -28693, -9263, 1782]
9704A782k1760j3599K032R50J9995L4739L0653K471j8132k6103O471n821j8887
9691e209j9728j766N049J6323J0301o516Q084k1884j0484K0271q090L4856j1286
9678I921j435J1160m445p569M421k0081J4115K1300K2098k2645n4610k5443L185
9665e0028M7429j4317j0567J22K8570K0727j2084K7664m232k8898n801M3j9392
9652b0764j7221M072P735n287n42j1530K0820M1285m400k2066j665o065k1314
9639c6942J2103J3634J579j5957l0964k7780J7141M3933L0167O911R537k5442
9627b080j3753M612M3815M184k189j9964j6727J088K9138m38j5492k3355J7811
9614F650M4K4408k1536J5772K8068J1305k9713k0179j9602n081j7396k3501J4832
$$ y = [1782, -19978, -33577, -31545, -30595, -10600, 24139, 54792, 57263, 39131, 13028, 19499, 13678, -5209, -24937, -26703, -21654, -5331, 4970, -1546, 6538, -15346, -25830, -5559, -13649, 21207, 9921, 8486, 19646, 15201, 7632, 12053, -8028, 6087, 27387, 49485, 26840, -27770, -53213, -50028, -2599, -16916, -27483, -27361, 1209, 21936, 9852, 37516, 33284, 4386, -1415, -1372, -20764, -37985, -33913, -26178, -31465, -32007, -43537, -22717, 18568, 14168, -7898, -9563, -15628, -36942, -24839, -11205, -9626, -25583, -56547, -84327, -67186, -23253, 6914, 13825, 23362, -2080, -15833, -11221, 32594, 36778, 34589, 14625, -2102, -1014, 28124, 27686, 12194, -11161, 6650, 6694, 31102, 9566, 25338, 53406, 64711, 34998, 14819, -4783, -9864, -27260, -50761, -35929]
9601c5929R159o00j5021J0326o28K6819Q064L8082L1776j124n8029m2060L4283
9588E118K100j6382m7010j2003J9252J9069L4085J1044k0749l8712J6518J952
9576b5718j0188J0554K2156K348K6294K789k6183R101L0009K4429j2683n5012
9564b104k7056P297R958J505j5779j9495L1741M1274Q059k1625k3231j9294Q95
9551b7855l2569K979J6039k580M036J9135m513J521J8800R72j9161j5353J3749
9538b4800K1719J6531J1337N763k1727l375j5207m187r7R990M684k6055K590j8928
9524d1762K6905K8982K3534k300j8157k408j3664n63J014r2m526K371k0852P926
9510a3592L3068o743l5668j1663o197Q622J1654k9093K5906m441j6654M5886J7587
$$ y = [-35929, -26770, -27370, -42391, -32065, -32693, -5874, 2190, 40272, 72048, 70924, 12895, -29165, 5118, 7218, -9164, -56174, -68177, -48925, -29856, 4229, 15273, -5476, -44188, -27670, -25718, -35906, -25352, -3196, -848, 25446, 28235, 2052, 11153, 41162, 65591, 52908, -2104, -29160, -21863, -11905, -10400, -26179, -45674, -13933, 27341, 35400, 13775, -9456, -28750, -27855, -60424, -57445, -41406, -43986, -39950, -20815, -25328, -23807, -5007, -4035, -23196, -38549, -24800, -3081, 13450, 24787, 30550, 8823, 5448, -9759, -13946, -14043, -4053, 631, -25424, -22834, -41762, -14857, 14125, 37659, 35359, 17202, 14794, 1130, 567, 1581, 1489, -3037, -666, -21518, -13592, 19476, 12733, -22935, -34598, -40795, -32173, -20519, -49612, -23706, -28147, -44801, 1085, 18672]
9497A8672j4351l0298n180O036J7948m354K6654J5123j5468l4327J4387k2225
9485b7383k1487Q248N3819J1340n981k0358j7336M0268L470l5902J0897L0520
9473C0115J5735K4257k562l4189k7547j2029K854p626J06K7635Q066j0205j0172
9460D438j898J6482K783n0370P149J3973J4074K1300j6782n517R245K565o325
9447A1117l1326o85P424J7179K9214j9650n698J0556J1647M3200J1154k9686j5664
9434C8782K614k7129k0000M423k149K1095J6084n317m0724k1306M746N288R170
9421a4423L3646M9874L296r949o980j8256J0352K0344l8885o2385o552N952L2164
9408a802L1812O465k2628k6100k4704K0350N3850L4442r686K6293J0372j5546
$$ y = [18672, 4321, -25977, -31157, -25121, -7173, -11527, 15127, 30250, 14782, -19545, -5158, -27383, -48870, -40622, 13197, 24537, 18556, -1802, -19138, 21130, 24600, -11302, -405, 30115, 45850, 70107, 67545, 33356, 5809, -6220, -3366, -10992, -10886, 16749, 24815, 14610, 4438, 2540, 19022, 21805, -28565, -21416, -7443, 6631, 27931, 11149, 5632, 14877, 17442, 11117, -20209, -20894, -13470, 3709, 32923, 13273, 7575, 18131, 29778, 72978, 84132, 54446, 38782, 41396, 14267, -5733, -1310, -3459, 17636, 33720, 28403, -12321, -33627, -28881, -23593, -14423, 19223, 69097, 72393, 62444, 55464, 37208, 47560, 67904, 29019, -33366, -39918, -33966, -1802, 30010, 36475, 13847, -12253, -36957, -16607, 37243, 71685, 61999, 88292, 98664, 83118]
9396H3118L091k0777j1724j7662r70l360l3435j5681j885N091j1827J2006K8219
9383A4204j4639L9961P626k8927l0895O543q922L6644L3958p239j3557L520j5197
9370B3080K030J804j3119p671J579K00k9645j5801Q420J7536n261j331N409R962
9356b808k9079N131J0531J4122J1986m309j1485n28J643O183J1218Q743j4668
9343F680o644j4842m521J5685K9876J552J6090j3532K5499M0281l4455j8388m428
9330C8853K7432k2371m3675j910J3317q912J347K0039L2381M757r682p543K817
9317D6850O391q083j8656l1245j1998N618J5504p363O229J0336j2796R370k380
9304G777j167N28K730K2574k0900j5334k1068j2218P966K3104r557L9896K8130
$$ y = [83118, 86209, 65432, 53708, 36046, 35076, 31716, -1719, -17400, -19285, -14194, -26021, -14015, 14204, -435, 39526, 47152, 18225, -12670, -6127, -15049, 21595, 55553, 48314, 34757, 38277, 23080, 25110, 26914, 13795, 6124, 7703, 7903, -21742, -37543, -29123, -11587, -16848, -18179, -12770, -2808, -31887, -26756, -16225, -2103, 9883, 5574, -5911, -6439, -4796, 1387, 12605, 21348, 6680, 36, -14806, -19327, -3642, 26234, 27786, 43876, 30344, 55843, 96124, 61669, 43281, 38853, 66285, 43914, 239, -1671, 11646, 2734, 4081, 24120, 56501, 61258, 51576, 44033, 46850, 53241, 45158, 26502, -4743, -16741, -11123, 4381, -2982, 3247, 13583, 787, 10157, 7777, 6610, 7138, 9868, 32442, 11542, -3792, -24860, -37078, -29112, -6008, -15565, 24331, 52461]
9291E2461K8956q840m7303l7499k0300k74J6485J7364J8100K6698k2376m6556
9279b3084m89k2333K5166M4260K9559k7963k1289m153J7412J0749J4127j7830
9267B4132j2364R923O114J7839K954o879l0513j39K011L3135K2078k0552k243
9254D5496K1975K5296l6845m8160P796J4805j4220l0322J6825J7229l2625N27
9242a2223L4797K319k5521j1484J8986o763k1369J1013K9456K047L4790M0698
9230I6746J7792k9210j5470k2281k0539k4359J2601j1492k1362O6596K6543k7818
9218D7747j4182r609N892K3657K2148J7125J7790j6528m5438k6042j188K043j8387
9205E028k1650r220j078p99L062R348K4288J7974J141k3368K2089N725K398k3447
$$ y = [52461, 81417, 72577, 25274, -12225, -32525, -32799, -16314, 1050, 19150, 45848, 23472, -23084, -23573, -45906, -20740, 23520, 53079, 25116, 3827, -326, 17086, 27835, 41962, 24132, 11768, 21691, 27805, 45644, 48598, 41719, 11206, 11067, 13078, 46213, 68291, 47739, 45496, 67471, 92767, 55922, 7762, 15558, 30363, 16143, -14179, 2646, 19875, -12750, -12223, 22574, 24893, -628, -12112, 6874, 111, -21258, -10245, 19211, 21258, 56048, 96746, 114538, 85328, 69858, 47577, 27038, 2679, 15280, 3788, -17574, 49022, 75565, 47747, 33565, 23956, 29848, 53505, 75653, 92778, 110568, 94040, 48602, 22560, 21372, 23415, 5028, -16622, -25842, -26920, -27719, -24657, -15309, 8979, 26953, 28094, 4726, 26815, 32540, 34938, 11491]
9191A1491L132J1725j1091l4833J048L6920K0361k2260L983N336M4046m029l6143
9178B9686P151R554k404J9130J6970J5455k330J0288q239j9125m873m6121N415
9165C0557K0681Q583Q948J2739L86J5814p352j3025J1215R019k1092m654J8488
9152I0307k5754P284l962l776J6154J0875K2836P153p547o534l1897J5249J7238
9139A07626K1105l341OK1602Q607j3916K1120Q107j5792j593k980K4082L2870
9126B07503J6641N262j9020j2200Q544L3005K8571K0926j6489K5645p885j9723
9114B70780O778N4934N7595M7380M9874K8650K1451k40M1093R7508N3416M6541
9102G75760M3273P3135Q1124R8855Q4607J24303J26857J64944J69689K02166K52205
$$ y = [11491, 14623, 26348, 15257, -19576, -18528, 18392, 38753, 16493, 20476, 25812, 69858, 65829, 29686, 36837, 46391, 43987, 63117, 80087, 95542, 93212, 103500, 95261, 76136, 71263, 25142, 30557, 51238, 59821, 68769, 81508, 81894, 97708, 90356, 77331, 88546, 97565, 76473, 71819, 90307, 64553, 71837, 67875, 64099, 80253, 91128, 113964, 121117, 113570, 107036, 75139, 90388, 107626, 128731, 125390, 125396, 146998, 155605, 141689, 162809, 170916, 155124, 153531, 150551, 174633, 207503, 224144, 229406, 210386, 198186, 206730, 239735, 268306, 289232, 272743, 298388, 290503, 270780, 277558, 332492, 390087, 437467, 487341, 515991, 537442, 537202, 578295, 675803, 729219, 775760, 819033, 892168, 973292, 1072147, 1156754, 1281057, 1407914, 1572858, 1742547, 1944713, 2196918]
9091B196918K94652L02545L77146M64189N16039N29433N62314N47649N33095M88736
9081F812716L76309J82005p9695m27695o70297p69527p30254o31687n46245m66774
9071C048856l43458k50269k47472k01289j37880j28982j38936j48995p8527m6105
9061A326943r8873o4871k1090r0311k4513o989l9554m7540k3125O03j3035m544
9049H93101k7376l7122l9355m6137l8219o915N435k7350o0008o7064l4258q393
9037E06339l2853j5777k0774k9479k9751k7724j0784k8152k2996j901j5337l2803
9025B38008k6918M51L085J1595J1186k8514N173M187k2524l2010L4114m591l453
9012A89789m84k3246M98q884j3990L792m123j0317R484j5372j7797j5716J8198
$$ y = [2196918, 2491570, 2794115, 3171261, 3635450, 4151489, 4680922, 5243236, 5790885, 6323980, 6812716, 7189025, 7371030, 7291335, 6863640, 6193343, 5423816, 4693562, 4061875, 3515630, 3048856, 2705398, 2455129, 2207657, 2006368, 1868488, 1739506, 1600570, 1451575, 1373048, 1326943, 1228070, 1163199, 1142109, 1051798, 1027285, 1020296, 980742, 933202, 910077, 910680, 897645, 893101, 865725, 828603, 789248, 743111, 704892, 697977, 703412, 676062, 616054, 548990, 514732, 506339, 473486, 457709, 436935, 407456, 377705, 349981, 339197, 311045, 288049, 286148, 270811, 238008, 211090, 211541, 214626, 226221, 237407, 208893, 214066, 218253, 195729, 163719, 197833, 193242, 189789, 189305, 166059, 166557, 157673, 143683, 147475, 143352, 133035, 142519, 127147, 109350, 93634, 111832]
8999A11832p057k6002k8466K6147K6951J2553n669j8944l2649m711j3959J5664
8987E5690K9331K7012n748k7161m960M664J3950o224k7626o306M2936J153k0812
8974G5899j2392j0041J7185L524k6701j2176k463Q294k019K7976J1451j1793J1076
8961G7820n994p309m855N48j8213r891n313l583k2903K7115K5510K3028K337O265
8947H4562K3059j7987n993n8055L968K0566j3859J068j6482p135M7141j3369o308
8934D1176j9356J4041J4924p625j9564J0547J9913J5118k9237j1137K5646J4087
8922F8533m696j5359m8294m413k299K4248K0782P77q562j7203l818r157K0973
8909B1512L2749J472J7280K5796J0486o53j5783l6528j9276O187J9795j9042k5670
$$ y = [111832, 104775, 78773, 50307, 76454, 103405, 115958, 110289, 91345, 58696, 53985, 40026, 55690, 85021, 112033, 106285, 79124, 74164, 78828, 92778, 86554, 58928, 52622, 95558, 96711, 75899, 63507, 53466, 70651, 74175, 47474, 35298, 32835, 41129, 39110, 67086, 78537, 66744, 77820, 71826, 64517, 59662, 60210, 41997, 32106, 26793, 23210, 307, 27422, 52932, 75960, 78297, 84562, 107621, 89634, 83641, 25586, 29554, 50120, 36261, 37329, 20847, 13712, 60853, 47484, 41176, 21820, 35861, 50785, 43160, 23596, 34143, 54056, 69174, 39937, 28800, 54446, 68533, 63837, 48478, 184, -4229, -6528, 17720, 38502, 39279, 30717, 13514, 9696, 539, 21512, 54261, 55733, 73013, 98809, 109295, 108642, 92859, 56331, 37055, 43242, 63037, 43995, 18325]
8896A8325m527N479L5976q734k7090j8208o058J6928n099k0511K1082J2450j7071
8883B942j2825J2532j126m7934K0122L9218J5011n153q041J0278r316J6627L4163
8870F6498K142l2938j4716K8507M0346J4265K193j1142Q999J2132k4200l8057
8858E4029j7508J3423o969j9432K6588K2480N942m5336l2322M566Q112k0069Q119
8845A623l3759J0444J9642J20K0310J2662M759n860P091J970k5096k6880j4958
8832b7932p771q822M0150L0263N32j8914K034J7595K7759O105r342k7414k8717
8819d474p793k8758J7662L9689k6325k4155J3917q374N687K2183N343n135M8552
8806D8019L4506J7483p282k1367j4748K83j1616n737J4000J1104k7640j1690j1303
$$ y = [18325, 13798, 19277, 55253, 46519, 19429, 1221, -4837, 12091, 6992, -13519, 7563, 20013, 2942, -9883, 2649, 1523, -46411, -26289, 12929, 27940, 22787, 14746, 25024, 15708, 32335, 66498, 68640, 35702, 20986, 49493, 89839, 104104, 106297, 95155, 104154, 116286, 92086, 54029, 36521, 49944, 42975, 23543, 50131, 72611, 78553, 33217, 895, 5461, 13573, -6496, 1623, -32136, -21692, -2050, -1930, 18380, 31042, 35801, 29941, 37032, 39002, 13906, -12974, -27932, -35703, -44525, -4375, 25888, 26420, 7506, 9540, 27135, 54894, 60999, 51657, 24243, -4474, -12267, -41025, -23363, 16326, -9999, -34154, -20237, -28611, -22924, -741, 4602, -533, 48019, 82525, 100008, 92726, 71359, 56611, 56894, 45278, 39541, 53541, 64645, 37005, 25315, 14012]
8793A4012O24k0351n776o47J857k1250J7022K9240K3506M463k91J2508j8320l0692
8779E905k8193K978J0762J7157J300r533M1947j4811j1056n238J7762j7359L702
8766A5323j3526j8298K8427L4997L5694K0993n6581p9201L838L8864k721j0733
8754b924j3801k056P200N709q888K9157J616j5887r872L308j3861N378K0453J3398
8740A8930K9344j262m0083l4681j4670K1308M3268j9108n3074K7193N3941L0759
8728F1865J7428j7158j7288j9485R004r654P883K1361j5966j8868o76J4615R71
8715C4032L5970L1778j1545K1930J3583j9027O090j6533j364j7654m846n190j3958
8702E3266j2788J2324k1393M431J8737j8886l918K5759q586J5357K2058M704L1705
$$ y = [14012, 14636, -5715, -11491, -12138, -10281, -31531, -14509, 14731, 38237, 42700, 42409, 54917, 36597, 5905, -22288, -19310, -8548, 8609, 9909, 376, 42323, 27512, 16456, 11218, 28980, 11621, 15323, 1797, -16501, 11926, 46923, 82617, 103610, 47029, -32172, -28334, 10530, 7809, -2924, -16725, -18781, -11581, -5872, -14760, 14397, 16013, 126, -9746, -6438, -20299, -14921, 5532, 18930, 48274, 47012, 6929, -27752, -42422, -21114, 22154, 3046, -50028, -22835, 31106, 61865, 79293, 62135, 44847, 25362, 34366, 24712, 32595, 53956, 37990, 19122, 18446, 33061, 34032, 70002, 101780, 90235, 112165, 125748, 106721, 112811, 96278, 94914, 77260, 72414, 67224, 53266, 40478, 52802, 31409, 35840, 54577, 35691, 31773, 57532, 48946, 64303, 86361, 91065, 122770]
8689A22770K1394K201l2507k8774m123J3134Q067l288M227o729j4592J4923k993
8676I3710P361j6122m7376n829L0988K2416l0693k793J5862L8206K237l376k505
8663A02086k5677j0321M223J2524j7163j5066L7509M260k3514J8125K1573n715
8651A02844j9180Q603M024J411J6590o378j1242n134M0933L8702j4697n4523j1954
8638H9999n27J8047M1060o828j0645M7645K0485m847q974n675K868M380n790n928
8624A75270M937M1948J3118O371K5700k701J283K7936L030o369N731K8971j2477
8611C12748k5230l3989j3471J1924P657n262j4480J5515J6435J2652k1279k7702
8599B35518k9413k671J196M742R251K6046l243j7178q999l4649k7641k6206O825
$$ y = [122770, 144164, 146365, 113858, 85084, 80961, 94095, 102162, 98874, 103101, 96372, 81780, 96703, 93710, 101071, 84949, 37573, 31744, 62732, 85148, 54455, 51662, 67524, 105730, 107967, 104591, 102086, 76409, 66088, 70311, 82835, 65672, 50606, 88115, 92375, 68861, 86986, 108559, 102844, 83664, 92267, 96291, 97702, 114292, 107914, 96672, 91538, 132471, 171173, 156476, 101953, 89999, 89472, 107519, 148579, 141751, 131106, 178751, 199236, 194389, 185415, 179740, 182608, 186988, 181198, 175270, 180207, 222155, 235273, 241644, 267344, 264643, 265926, 293862, 296892, 290523, 296254, 325225, 312748, 287518, 253529, 240058, 251982, 259639, 254377, 239897, 255412, 271847, 284499, 263220, 235518, 206105, 203434, 204630, 209372, 218623, 244669, 241426, 224248, 215249, 180600, 152959, 126753, 133578]
8586A33578M988l6478J9480K475k3606j3069J3313N328m30k0041l1857m17L1964
8573H5228L8857q588j81p231l166p043j1199m4127l9822L590L9474L0775J5101
8560I1668l1916P063N069J4938J9043J5807j8775l5686j2737j522K843J7858R549
8547H3202r976l9017J3178l073P458m487l0313l9845k280L7692K7281n204k0843
8534A3773M066P015j4529J5736K0113q868R869K1338p668k6372J0465k976j3744
8521B8218j7769j8872P039K4124j432j820J8058J7417J4688r161j6017m4590j8303
8508a8420j6268L759O00j251k0830M0690J6834K629M592N657K926J368J0179k5970
8494F495l853J0057k3917L2256q903l547k4287k7429J1975K2427N566q597K6733
$$ y = [133578, 138566, 102088, 121568, 124043, 100437, 87368, 100681, 106009, 105579, 85538, 53681, 53264, 85228, 124085, 115497, 115316, 108085, 104919, 97876, 86677, 42550, 2728, 6318, 45792, 76567, 91668, 59752, 66815, 71884, 86822, 105865, 121672, 102897, 67211, 54474, 52952, 55795, 73653, 83202, 73226, 34209, 47387, 44314, 51772, 47285, 16972, -22873, -25153, 12539, 39820, 34616, 13773, 17839, 24854, 10325, 26061, 46174, 37306, 47175, 68513, 60845, 34473, 44938, 41962, 28218, 10449, -8423, -1384, 22740, 21308, 19488, 37546, 54963, 69651, 60490, 44473, -117, -18420, -34688, -30929, -30329, -31580, -52410, -11720, 5114, 7743, 12335, 17992, 20918, 22286, 32465, 6495, 2642, 12699, -11218, 21038, 12135, 8588, -15699, -43128, -31153, -8726, -3160, -11757, 14976]
8481A4976L0346n072l2130r246N98M595K6513j3564k1058j0139M0652K0328j2034
8468C4765r000j2441j9407j1037j1148N287n144L3864l776j1961J1746L2452J2296
8455D6496J0323j3582j1281k6337o1437k5081N610J3077L9816O5519J0474l1704
8443B1893r415n075p197L2138l341m856j5948q249j5040J4551K9080J5880l6254
8430H167k8074m5613L991N0330M4425p242m2623j7121P623K4666Q065K1219O809
8417C4622j6732l0487j3924n606o885J4541K7597K5987j3874N564K066J2886J7152
8404E2907j2117l0753L314j709k0362J5561L6774m97j4988K9991N788k1554Q503
8391E0858K4246J2934j6452m212L4688K7270k6715l8070l929j56j7548J674j1448
$$ y = [14976, 45322, 40250, 8120, -1126, -528, 4067, 30580, 17016, -4042, -14181, 26471, 46799, 34765, 25765, 13324, -6083, -17120, -28268, -22981, -28125, 5739, 1963, -9998, 1748, 34200, 46496, 56819, 43237, 31956, 5619, -55818, -80899, -75289, -62212, -22396, 43123, 53597, 21893, 12478, 7403, 206, 32344, 29003, 24147, 8199, -50, -15090, -539, 28541, 44421, 8167, -19907, -65520, -61529, -11199, 33226, 25984, -16639, -33760, -26137, -1471, 6594, 27813, 34622, 17890, -12597, -26521, -32127, -39012, -24471, 3126, 29113, 15239, 20803, 22869, 35755, 52907, 40790, 10037, 13351, 11642, -8720, 6841, 43615, 43118, 28130, 58121, 63909, 42355, 50858, 75104, 88038, 71586, 67374, 102062, 129332, 102617, 64547, 60618, 60462, 42914, 44588, 33140]
8378C3140j8284j1057p048j4622K5270K84K9682k2785M0226N668m5106k2017j6145
8365b2794L359J4913J6591J7802j1417j5363K7170k6075k3731p725j0677J5582
8353b2365K9789M5327K8909m746l6124m1184k2850J8034R342M043J7696r45j0457
8340A4469J3987q96k5979n981K8758N747k8280j5407j1814J3620p632j6597P262
8327b8743M4317M0329p315k1033j0341J821k9501j4594j4160M580K0100o781k3319
8314d4640K5979L6745k1398k5812P268J2452j2040J835n688K8901K3059j1564
8302A5097j7334k2566J4726j600J3634R138O14M175L1159K093j5184j7650p636
8289H666O001j2538k3819k2038j2361j3656K0380k575k0251j8596J1094O3792
$$ y = [33140, 14856, 3799, -3249, -17871, 7399, 7683, 37365, 14580, 54806, 60474, 15368, -6649, -22794, -19435, -4522, 12069, 29871, 18454, 3091, 30261, 4186, -19545, -27270, -37947, -22365, 7424, 52751, 81660, 76914, 40790, -394, -23244, -5210, 4132, 8175, 25871, 24926, 14469, 28456, 27560, 1581, -4400, 24358, 30105, 1825, -13582, -25396, -11776, -19408, -36005, -28743, 15574, 55903, 48588, 27555, 17214, 19035, -10466, -25060, -39220, -34640, -14540, -21321, -44640, -18661, 18084, -3314, -29126, -21858, -9406, -21446, -19611, -25299, 3602, 26661, 15097, -2237, -24803, -10077, -11677, 1957, 11095, 11709, 15884, 47043, 49136, 33952, 16302, 8666, 14667, 2129, -21690, -43728, -56089, -69745, -49365, -51940, -72191, -90787, -79693, -15901]
8277a5901M1429l3953n2269j3064J2747k101J5834j5157M821P207K7086J0021
8265a3300L0991L8648l939k7812k1874k8054q057J5287q589k0746K3226P601L4238
8252A7620J2531j8221j9545J7442J2327o379j7460o577K9616J833M332K6346K0412
8239G4277l0715k5374K7786k4872n2787k4810J7275M6295j120l0711m325J1187
8227a7894m903J5015j3384K577J269o864K3586J5532j8154m679J1131K7191j0430
8214A9993p861J6766L8321L70l8861K798k7035l8382P401J141p617L3708M0994
8201D1736q262l123l0008l056n150l575Q440m892k113O569K055K30k7746j229
8187c0124L4830J6292k1300j2699j1332p382M0290K1725m300K0546r539j2229
$$ y = [-15901, 25528, -8425, -60694, -73758, -61011, -63112, -47278, -62435, -57614, -50407, -23321, -13300, 17691, 56339, 52400, 24588, 2714, -25340, -33397, -18110, -26699, -47445, -24219, -16618, 17620, 30151, 11930, -7615, 9827, 22154, 15775, -1685, -8262, 21354, 23187, 27519, 53865, 74277, 43562, 18188, 45974, 21102, -31685, -56495, -39220, 7075, 5955, -24756, -29081, -17894, -22797, -7782, -21166, -18589, -17320, -24184, -598, 14934, -3220, -7899, 3232, 30423, 19993, 12132, 28898, 67219, 67589, 28728, 31526, 4491, -33891, -26490, -25349, -32966, 742, 41736, 33474, 30351, 343, -2713, -7863, -11438, -2998, -7890, -10003, -3434, -1379, -1149, -28895, -30124, 4706, 20998, -302, -13001, -24333, -31715, 8575, 30300, 26000, 46546, 37007, 24778]
8175B4778o186j8399j1036j8883j0424n897N651L7243L4017R754j0189l067K704
8162C0066K7509q541j2003J1905k1886L0756K2324j472m2720j9016J4239Q467
8150C9628k557j3190K886o597r161m087o42J6885O239p720k3977j5077o267J0362
8136a3275K2865R386m912j5420J8113p886p013j0732R954n604k152J945j9799
8123b4530L3559J5380n196M0882M300p840K6754K0405l2904k0988j1905M351J1772
8110E4040m2956k3200J2591j1699l358J3310k247j0506j234j8892K6658J0707
8098C214j7452j4640J0007o926Q11M3710J3481l5637k7048J8176J6143P720n587
8085E972L690j4492n592l248J7031J1123K6071J6418l1567k9849j5086J8762O959
$$ y = [24778, 18592, 193, -10843, -29726, -40150, -46047, -40396, -3153, 30864, 40618, 30429, 27362, 30066, 57575, 49034, 37031, 48936, 27050, 57806, 80130, 78658, 35938, 16922, 31161, 39628, 37071, 23881, 26767, 20170, 11009, 6922, 6280, 23165, 29404, 21684, -2293, -17370, -23637, -13275, 9590, 18976, 14064, -1356, 16757, 8871, 1858, -8874, 1080, -4524, -6676, -4731, -24530, 9029, 24409, 19213, 60095, 64395, 56555, 83309, 103714, 70810, 49822, 37917, 42268, 54040, 11084, -12116, 475, -11224, -14582, -1272, -3519, -14025, -15259, -34151, -7493, 3214, -14238, -28878, -18871, -25797, -24986, 18724, 32205, -3432, -30480, -12304, 3839, 11559, 5972, 9662, -4830, -10422, -13670, 3361, 14484, 40555, 56973, 25406, -4443, -19529, -767, 6192]
8072F192n228N274m08J7746j8591j6118J2905J123J1549J9724J9526k4536O552
8059C5710R163J5510K4235K1815J7394n775j2633m7466k4774M321K7911Q276K3257
8046I6944J5511J2927N541j1528J9928o20M602q597J2164M279o142J646j2991
8033A33664K1752Q107l8525j9975J5718l865J0856L1552K2806j1676K458Q411
8021A81283L6375r173m3835l4255K0816j4805k0012M695N4765O8457L0075N24
8009B74910j3944L7688N5726N1561L2809q400J873q228m2453p4379l4612q678
7997B63873J3044j3032L177L4333J4980k5397n098j8031n800j8168n9483l9737
7985A44661O668O05j3685l5150P689J5693Q154m473n903k3873Q691J9197K5360
$$ y = [6192, 964, 6238, 5830, 23576, 4985, -11133, 1772, 2895, 14444, 34168, 53694, 29158, 35710, 44873, 60383, 84618, 106433, 123827, 118052, 105419, 57953, 33179, 37500, 65411, 73687, 96944, 112455, 125382, 130923, 119395, 139323, 138703, 143305, 134708, 146872, 151151, 145009, 146655, 133664, 155416, 163523, 124998, 105023, 120741, 116876, 127732, 159284, 182090, 170414, 172872, 181283, 217658, 208485, 164650, 130395, 151211, 136406, 116394, 121089, 175854, 244311, 274386, 274910, 260966, 298654, 354380, 405941, 438750, 430350, 432223, 423995, 381542, 307163, 272551, 263873, 276917, 263885, 267062, 301395, 316375, 290978, 285880, 267849, 262049, 243881, 184398, 144661, 151329, 151934, 138249, 103099, 110788, 126481, 134635, 130162, 124259, 100386, 109077, 128274, 153634]
7972A53634L2612O151j8860m1134k6340l758N1455L5494K5048L0192K0929L2595
7960B98018K4860J3188n3359j9097J1670K978q416J656L4160j9248o305j0570
7948B69535l1755m1615k9395J057k777m7042j9373j7955l5627j0048j7910N984
7936B3079L9761L0659K766p721o648j4892j9233K0759J493Q826J6201j4614P088
7923H7524o387q414M0620j0112l6968K4518J7316K306k4792m765P938k5086M228
7910F7926j7826j8925N166R334J0732K7651j5147L768P491J1246l1631j4361J1311
7897E6735J4310j4181p979j6259l2810p759L8437L0161k2963k446r854l0600Q354
7884C146K4487k1285p80L0405L1523j3600m1651L351K812j5111o735J3539l7026
$$ y = [153634, 186246, 192397, 173537, 132403, 106063, 102305, 153760, 189254, 214302, 244494, 265423, 298018, 322878, 336066, 282707, 263610, 275280, 278258, 269842, 271498, 305658, 286410, 280105, 269535, 237780, 196165, 166770, 167827, 165050, 118008, 98635, 80680, 45053, 35005, 17095, 23079, 62840, 93499, 96265, 88544, 81896, 67004, 47771, 68530, 70023, 78849, 95050, 80436, 87524, 81137, 72723, 113343, 103231, 66263, 90781, 108097, 110403, 85611, 80846, 88784, 63698, 67926, 50100, 31175, 36341, 45675, 56407, 84058, 68911, 72679, 80170, 91416, 59785, 45424, 56735, 71045, 56864, 48885, 32626, -184, -7943, 30494, 60655, 37692, 35246, 25392, -5208, 3146, 27633, 6348, 5568, 35973, 67496, 53896, 12245, 15596, 18408, 3297, -3438, 10101, -26925]
7871b6925l5210l460L9225J5818n287j4720p352L5372J0520K20K0962L1058N75
7858F0796l2861j0622l513K9206K390J0205K60m4635m401M0739M553k5529k7458
7845h70J6416J0405J0369j1233j1569J535J5455l186l5947K2265K9751J6998j5101
7832D5288k0053K612q347l8355q146j2196J8861J5171r992l7694k6503P970J0033
7819f1351M8465Q027j0414L1729M4009m4643m16j8646m812J2688J4427k0130k0087
7806b1154K5744J327k2830M763p070p402K8005J6350r666k926j4892J8520K261
7793A1030q629R741m841l4532K171K9019k1353q508R181J3565j0678l505q891
7780b6230k0515n211P224P920q847J4056L81j7696L0117L2016k4067m405J3390
$$ y = [-26925, -62135, -65595, -26370, -10552, -15839, -30559, -37911, -2539, 7981, 8201, 29163, 60221, 60796, 27935, 17313, 13800, 43006, 45396, 55601, 55861, 11226, 6825, 47564, 52117, 26588, -870, 15546, 25951, 36320, 25087, 13518, 15053, 30508, 27322, -8625, 13640, 43391, 60389, 45288, 25235, 27847, 19500, -18855, -27001, -39197, -20336, -5165, -15157, -52851, -79354, -71384, -61351, -12886, -4859, -15273, 16456, 60465, 15822, 15406, -3240, -8052, 4636, 19063, -1067, -21154, 4590, 5917, -16913, -12150, -19220, -26622, 1383, 17733, 8067, 5141, -9751, 8769, 11030, 2401, 12142, 7301, -27231, -25060, 3959, -17394, -25902, -16721, -3156, -13834, -17339, -26230, -46745, -51956, -44732, -36812, -45659, -31603, -31222, -48918, -18801, 13215, -10852, -15257, -1867]
7767a867J5718j6580k2590q172j1952J8676j6277j513P78l5298J5757J8739K0886
7754b3695J2524j135K0713J0397J2554k3813o000O528J3885J2569l613J0271j6445
7741B4740j9116k177J6122K8542K5203j649J4252j8873l4982J460k6337l4627
7729b7442q718P945n004O985L6143J7602k6550j9056J0384J3063j6624J2716K1140
7716B2584K2947k9576l9472m729L0460K4854L226j0842q943k956L7063j2777k7944
7703C895J0110n971j517P651j9279N273p147j2729l4423R126K0889P177r981j97
7689b7123J202n015L2203k645l584j452K181N175J3978P878j1732j5875M385K341
7675A917k7379j0711L344j746k7962J8005J6862K4448J6226K3522k1336j4207
$$ y = [-1867, 13851, -2729, -25319, -33491, -45443, -26767, -43044, -44557, -43779, -79077, -63320, -44581, -23695, -11171, -12306, 8407, 18804, 31358, 7545, 1545, 8073, 21958, 34527, 30914, 41185, 24740, 5624, 3447, 19569, 48111, 73314, 71665, 85917, 67044, 32062, 33522, 7185, -27442, -36160, -28215, -33219, -26234, 9909, 27511, 961, -18095, -7711, 5352, -11272, 1444, 22584, 45531, 15955, -23517, -28246, 2214, 27068, 30294, 19452, 10509, 7553, 44616, 31839, 3895, 14005, 8034, 6517, 14168, -5111, 162, -6985, -19714, -54137, -45011, -24122, -16945, -26926, -27123, -25921, -30936, 1267, -1378, -4962, -6414, -4233, 942, 14920, 22798, 11066, -4809, -424, 1917, -25462, -36173, -32829, -34575, -62537, -44532, -27670, -3222, 13004, 36526, 15190, 983]
7663I83q149k7303j250J329L0486j05j9469k751j566L1844J4509L2363n8952j6319
7649b4350J6670R497m1003o984P98L5664J972j1049l737J7856k3159j9317J3608
7636c3534K0900k822o893R202p267K0752k994j9965q968r096J3734L0910L0260
7623C4219l438J1447k9946m1255p344J341q444L3017K1033L730k8650k9410K6815
7610a6885N3267j216j0156K412j9654J4927K5986j5320j2107k3892K3922K4755
7598D6039l152l8063r312J860o564K0587n120l1933J5273Q250o525j2140k440
7585b3240j899K8634J3552m4932q500K6083q735j4512r917J3754J4971L105L6859
7572B5223j8473l4718k92J9765J7160J3719k9765p679k617K0013J3858k5757o248
$$ y = [983, -7166, -34469, -35719, -34390, -3904, -4009, -23478, -26229, -27795, 4049, 18558, 50921, -8031, -24350, -7680, 1817, -39186, -46170, -45372, -9708, -7736, -18785, -22522, -4666, -27825, -47142, -33534, -12634, -15456, -22349, -13147, -20414, 338, -2656, -22621, -31589, -40685, -26951, 3959, 34219, 30781, 42228, 12282, -28973, -36317, -34976, -43420, -10403, 10630, 14360, -14290, -43700, -16885, 36382, 35166, 25010, 27422, 7768, 22695, 48681, 33361, 21254, -2638, 21284, 46039, 42887, 4824, -4488, -2628, -9192, 11395, 6275, -25658, -10385, -2135, -8660, -20800, -23240, -25139, 3495, 17047, -27885, -36385, -10302, -19037, -33549, -43466, -29712, -14741, -11636, 25223, 6750, -27968, -28260, -8495, 8665, 22384, -7381, -15060, -17677, 2336, 16194, -9563, -15811]
7559a5811P13J6461J1459j1695M76n780n2028K0057P2451R579K978l7420k0806
7546i366P5L3361L081k4276M466j5090P641M1419o816l483m995j6549n461o300
7532b293j8881j9162m533K1458n438k0511j0528K7118M152j538L8856r394j9252
7519a9946j249J5684K017J0375o104R42M0928k1478j3935K1094o769J7473k0553
7506A8479j2754L1675K3714j4342n440J4120r805L837O001l0742l5043K057n097
7493a3340j013n074J6351J3679M237l7109N546K799L2916J9461k2916J2659p056
7480B1140L0008j0306j0815l5350j017K6912L4165j2199o518j7177Q732j5343
7468A2232L647j0898j8362l281R012J392N61l637q630j4905n894k5613k284J1349
$$ y = [-15811, -15098, 1363, 12822, 1127, 1603, -4177, -56205, -36148, 36303, 45882, 48860, 11440, -9366, -9291, 24070, 27151, 2875, 7341, -7749, -108, 41311, 34495, 31012, 26017, 9468, 4007, -2293, -21174, -40336, -44869, -23411, -28849, -49360, -59888, -32770, -28618, -30156, 8700, -694, -19946, -21195, -5511, -3494, 6881, 777, 1719, 42647, 21169, 7234, 28328, 21559, 39032, 18479, 5725, 37400, 61114, 46772, 41332, 55452, 45647, 49484, 55485, 24743, -10300, -8243, -13340, -14353, -19427, -3076, 10603, 14840, -22269, -16723, -13924, 18992, 38453, 15537, 28196, 21140, 51148, 40842, 30027, -5323, -6340, 20572, 54737, 42538, 36020, 18843, 27575, 12232, 15879, 4981, -13381, -16662, -7650, -6258, -5697, -9334, -17964, -32869, -38763, -64376, -66660, -55311]
7454e5311O750j8687P131J0664l444J4293J428j9161J1462R429j0571K6426J7796
7441a795J5547Q051P395j3784o48j00m620q162q481J1507j2906j6821l947J3055
7427a5709J897M190J9340o061r042k045j1153M031j8028k6008j8992q827K466
7414h3941l254j5546K3924M1774L7561J7557k334j6152J994j9769j4117K5200
7402g103L1820L1786R669k3525k3680o229K167j3570l8330K5263J891j1608j5119
7389c6568J6598L9347K514p176j9987K5498n245k8559k216o212j0610J5458J7725
7376E67K7810R639k7807j4741k9424j9099N990K0205j6811J1739Q778j7226p744
7363d8124O779K7776J5397j1070j5486j8699j6196J8444L8657J1775J4870R664
$$ y = [-55311, -48561, -67248, -60117, -49453, -52897, -38604, -37176, -56337, -44875, -35446, -46017, -19591, -1795, 13752, 21803, 29198, 15414, 14766, 14666, 10046, 1884, -6597, 4910, -7996, -24817, -28764, -15709, -13812, -9622, 9718, 3657, -5385, -7430, -18583, -14552, -32580, -58588, -77580, -86407, -83941, -87195, -102741, -78817, -37043, 518, 18075, 15741, -411, 1583, -18186, -32303, -7103, 24717, 56503, 66172, 42647, 18967, 12738, 14905, 1335, -36995, -11732, -9841, -21449, -36568, -19970, 19377, 21891, 14715, -5272, 20226, 14981, -13578, -15794, -22006, -32616, -17158, 567, 28377, 38016, 10209, -4532, -33956, -53055, -47065, -26860, -43671, -31932, -23154, -40380, -48124, -41345, -13569, 1828, -9242, -24728, -43427, -59623, -41179, -2522, 9253, 24123, 33787]
7351C3787j2771k10l547n008J7114r089k0521j3566J5928K5067j0916r996P720
7338A3992r547m244l9179k2443J6763J671J6896M6297o490j9953o442J4675m384
7325b388k5943o382J4266K4614J9978k0796n38j754m338m259p951J0392R006m978
7311a071J707L2896J140J6182J1809k5006n5650j1514k0978j6288j4792m090O254
7298g9401O712K1719K577J6106j8888N286K3576L0053n994l6120N925k3966j070
7285e3485j314r268q148L8501L7966J3150Q662k1654k0022o328m514J061J2626
7272a2767K0933J8024L4830m440k9449q966l141J584J5410M575m6181J610K8542
7259B0564J0755k5849J4301k8018p154j18L162M978J6575J8879J6639r368j3386
$$ y = [33787, 21016, 20806, 17259, 12251, 29365, 20276, -245, -13811, 2117, 27184, 16268, 6272, 13992, 4445, 201, -38978, -61421, -44658, -42987, -26091, 20206, 13716, -6237, -12679, 1996, -2388, -28331, -34713, -20447, 4167, 24145, 3349, 2811, 1057, -3281, -7540, -15491, -5099, 3907, -1071, 636, 33532, 34672, 50854, 62663, 37657, -17993, -29507, -50485, -66773, -81565, -85655, -79401, -72689, -50970, -48393, -32287, -51175, -45889, -22313, 7740, 1746, -34374, -28449, -52415, -53485, -54799, -64067, -72215, -33714, 4252, 17402, 26064, 4410, -15612, -21940, -26454, -25393, -12767, 8166, 26190, 61020, 56580, 27131, 18165, 15024, 16608, 32018, 36593, -9588, -7978, 20564, 31319, 5470, 19771, -8247, -15401, -15519, -12357, -7379, 9196, 28075, 44714, 35346, 21960]
7246B1960K5002n1525k7086J8743o520J0358j9642j9121J8546j866p455J1266
7234b7340J2508q320k9556N371J4712J4821N493Q337k593K0554J0476j3546k9958
7221a9041k0068J3203n786J8519L473j5386Q685J678K1321N800l5569n923k9251
7208e8345j2865K7254J7838q8j811J5307J3610j075l523L994j0660J993k3247
7195c1618p665k0662K2819M8060l16k6404j1342J5500M1144l2952j1412M3648
7183B8800j1049l1450j0142k088o668r269M8502J4380j6650m628j8005M1016K7566
7170E0315p266j5294l0327k2420j7346j4200j6689l039L4233L2402L4245J7212
7158D1826R6j1277k347J0052K2650Q397m7283r162j9335j1264L9724J084k5093
$$ y = [21960, 46962, -4563, -31649, -12906, -19426, -9068, -28710, -47831, -29285, -31151, -38606, -27340, -14832, -23152, -52708, -47337, -32625, -17804, -12311, -3974, -6567, 13987, 24463, 10917, -19041, -39109, -25906, -31692, -13173, -9700, -25086, -16401, -14723, 6598, 12398, -23171, -29094, -58345, -71210, -43956, -26118, -26206, -28017, -12710, 900, -175, -3698, 296, -10364, -8371, -31618, -39283, -59945, -37126, 10934, 10618, -15786, -27128, -11628, 29516, -3436, -14848, 28800, 17751, -13699, -23841, -25929, -32597, -41866, 6636, 21016, 4366, -262, -18267, 22749, 50315, 43049, 27755, -2572, -24992, -42338, -56538, -73227, -76266, -42033, -9631, 24614, 41826, 41922, 30645, 28298, 38350, 61000, 69397, 22114, 12952, -6383, -17647, 22077, 23161, -1932]
7145a932J655J3595j1472R623k2791j2457j5605J2690j9792l406K7077M1840l613
7132A5412J7688K7293p680l2269p930j7228k189L3952R320m3330n766p37N436
7119h028K262k0858L847k948K7783L4630J0973k160k7719M997J4238O664j8742
7106B4939j7193K8775K6110k9028k4945m9106k846L5530j6469j639J1314K7196
7094A2638p849r33m401J3354K09J1428J5138k0938m259l0313l0228k8328P590
7081f6892L0519j8044K33K9665K2660P069l157K1651R178j2956k0764k3413n665
7068b9916K542o04M379J1036j2545L358J1446j1763m914K0163L09J4492K531j5235
7054d721j7388K315M755n420J3193J0890K303j9723L4493k0836j8927j7245j947
$$ y = [-1932, -277, 13318, 1846, 11469, -11322, -23779, -39384, -26694, -46486, -49892, -22815, 19025, 15412, 33100, 60393, 52713, 20444, 12514, -4714, -6903, 27049, 36369, -6961, -12727, -13464, -8028, -5766, -26624, -22777, -25725, 2058, 36688, 47661, 45501, 17782, 22779, 37017, 43681, 24939, 7746, 36521, 62631, 33603, 8658, -40448, -43294, -7764, -24233, -25872, -14558, 12638, 4789, 3856, -545, 12809, 13018, 24446, 39584, 18646, 14387, -15926, -46154, -74482, -66892, -36373, -54417, -54184, -24519, -1859, 5210, 2053, 23704, 32882, 19926, -838, -24251, -29916, -27374, -27978, -23599, -12563, -25108, -21750, -10304, -22067, -26981, -6818, -6509, 7983, 10514, -4721, -22109, -19794, -15039, -20459, -7266, 3624, 5927, -13796, 20697, -139, -19066, -36311, -38258]
7041c8258j2235r222k748J4203J7229J5847j7253L275N94N265J4956l942J4176
7028A887J7224L280j5614j415p583q744j534k7319J1605K42p372L4794L4289J557
7014C5297l94k8931l532J5636m5596l6636P63K0739M2842L6766p702J1273l0053
7001A0472l1698L4912l627m0555K3166k7880k0936L0657P7692J9248m5397n985
6989B0069j3990j8915J068R060k396j2108j4504j276p427J6468K4713J4377o691
6976H448l826K1767j0695J3850J3447k2444j1879k8177K9814K6775N843q100l3391
6963A432l68j6802K076L7860j208m03J3023j8900J5323K570J3271k1715k4348
6950A811j1705k9276k2171N000J2756L5112J4084l1365J4031j9250j1012K7470
$$ y = [-38258, -50493, -59715, -62463, -48260, -31031, -15184, -32437, -29162, -28568, -23303, -8347, -12289, 1887, 19111, 22391, 6777, 5362, -2221, -10965, -12499, -39818, -28213, -27971, -35343, -549, 33740, 35297, 34903, 5972, 2440, 18076, -27520, -64156, -63393, -42654, 188, 36954, 29252, 40525, 10472, -21226, 13686, 10059, -30496, -7330, -35210, -56146, -25489, 52203, 71451, 26054, 20069, 6079, -12836, -11768, -2708, -5104, -17212, -31716, -32992, -40419, -23951, 762, 15139, 8448, 4622, 26389, 15694, 29544, 42991, 20547, 8668, -19509, 10305, 37080, 42923, 34823, 1432, 1064, -15738, -13662, 24198, 22990, 22587, 35610, 16710, 32033, 34603, 47874, 26159, 1811, -9894, -39170, -61341, -56341, -43585, -8473, 5611, -25754, -11723, -30973, -41985, -14515]
6938a4515n374R776j1688J3459J9006P032l6540j5344M7097N3306K3199k2049
6926F7365m0738m7429L774L8238R081M960k425l101j2838L518N180k8261m4746
6913d7422j696J216K0971j6825J8295K8152J982J319J2324Q941j9119j6715J3984
6900E407J7330K3484N746j5412m8391n902K7078J2905K1477J0730p0307L108J1057
6887a690j996m5044K8397R868J2444K060l06J1544K758K2899q748l3378j0949
6874a2141j5796j1380K3630K2484O871l7077M797J9677k250Q20L039J5535j6506
6861A703j9166Q664q853m451J2169J885J2900l587J1205J7835k2839l0565k2526
6848d5626J8465P181K1165P452k4804k943O555Q992Q931j5529n4463o210J0214
$$ y = [-14515, -19889, -10113, -21801, -8342, 10664, 17696, -18844, -34188, 12909, 66215, 89414, 67365, 26627, -20802, -17028, 21210, 30291, 35251, 32826, 29725, 16887, 20405, 25585, -2676, -47422, -49118, -47902, -26931, -43756, -25461, 2691, 4673, 5992, 18316, 27257, 8138, -8577, 5407, 22737, 46221, 51967, 36555, -11836, -17738, 9340, 22245, 43722, 54452, -15855, -12747, -1690, -3686, -48730, -20333, -10465, 1979, 4039, 3733, 15277, 18035, 40934, 32186, -1192, -12141, -27937, -39317, -15687, 6797, 13668, -23409, -18612, 1065, -1185, -365, 2674, 18209, 1703, -17463, -8799, -17652, -22103, -9934, -8049, 4851, 1264, 12469, 30304, 7465, -23100, -45626, -27161, -19980, 1185, 8637, -16167, -19110, -12555, -3563, 5368, -10161, -64624, -70834, -60620]
6835f0620N6482K5260j0762j3708J6871R014J5109K6226l5731j6636L90M6362
6823E8257r086j6277o067j2835M671j7110j3816k1408r28k444K5116o3k635Q736
6809e889M4987l8210p5913L859J6755l447L034K440O89Q372R309j7437O402j415
6795d6464o782R640P68N005L4852k3781j9111j5132K4521K4742j3816M2737j2522
6782D657N502K3074p209j4463n955j4294K747M636j5115L924p469l923n828K7947
6768a769J0564p726J5873j0362J0354l039L319k7344l2343J9751J7858Q827q457
6755d494K5758j1022q124L3023R407j5075l4943p557j1823K1084k900j7078R679
6742a4065J343J452K5481L656K7283K354j4805J344J6540j7167m6962K177P3611
$$ y = [-60620, -4138, 21122, 10360, -3348, 13523, 22537, 37646, 63872, 28141, 11505, 11895, 58257, 49171, 32894, 26827, 13992, 18663, 1553, -12263, -33671, -34599, -37043, -11927, -11990, -14625, -5889, 39098, 888, -75025, -71166, -54411, -57858, -54824, -52384, -51695, -43323, -34014, -51451, -45049, -46464, -53246, -43606, -42838, -37833, -2981, -26762, -45873, -61005, -36484, -11742, -25558, 17179, 4657, 10159, 33233, 26024, 11561, 5606, -8688, -5941, -1305, -16420, -12496, -19965, -23888, -29716, -1769, 8795, 1069, 16942, 6580, 16934, 13895, 17214, -10130, -42473, -22722, -4864, 3963, -4494, 21264, 10242, 2118, 35141, 44548, 29473, -5470, -13027, -24850, -3766, -6666, -23744, -14065, -12722, -11270, 14211, 17867, 45150, 47504, 32699, 34043, 50583, 33416, -13546, -11369, 62242]
6729F2242K2385m1835l0822k2930j1186K883k6401J070K9189L9881J5583k8111
6717A1948p638p251k5208j7592o975L3421L9391J2033J3734M774M89k8375m5300
6704b2549k57M8300R609k8638l4708J6423K2029J030M829l0299l6723M653K7217
6691a9084K6260N513J2618J9884J167J9904j2493j9631k5285j3445J1182k371
6679D219p051J1772J4996O909k7900k899J2686K0198k149k5732j3382K220j3126
6666a9239J0356r451j6513o10j1209m595O3481N7567n990l7936k4164k1322J352
6653a8273l152L9388o953Q456K1577l5790j2728j510J8376K2494k7247m23j4392
6640a0177K821J4011K102K53J7849k9069j5228q817R781k8002k3552J6143K8581
$$ y = [62242, 84627, 42792, 11970, -10960, -22146, -19263, -45664, -44594, -15405, 24476, 40059, 11948, 4310, -2941, -28149, -45741, -52716, -19295, 20096, 32129, 45863, 50637, 51126, 22751, -22549, -22806, 25494, 35103, 6465, -28243, -11820, 10209, 11239, 16068, -14231, -50954, -46301, -19084, 7176, 12689, 25307, 45191, 46358, 66262, 53769, 34138, 8853, -4592, 6590, 4219, -2832, 8940, 23936, 30845, 2945, 46, 12732, 32930, 30781, 5049, -8333, -6113, -19239, -8883, -18334, -34847, -35457, -46666, -51261, 12220, 69787, 63797, 25861, 1697, -19625, -18273, -21425, 17963, 11010, 19466, 41043, 5253, -7475, -8985, 9391, 31885, 4638, 4215, -10177, -7356, 6655, 8757, 9010, 26859, -2210, -17438, -26255, -16474, -44476, -68028, -51885, -23304]
6627b3304o328q836m715K3616K8910k1017j3060j0538Q25k6139p931K1274k489
6614d9732j230M0545L3954k1898k0387j4912m130K4520K1518M283K5284j1306
6602B6509K265j575K490j4943k2168K778k0756M840K0545K0702m451l6958k7994
6589d8716Q04K8403K9878J1582q954J4749J3912N595P322j0311R911M471o713
6576E1933j2629n0612j6293j2350m138J958K487l278K1572J7835j560j3569J8937
6563B93R098Q080k9116m65l2580k2262L5042j343j6133j2752J7246P224k0032
6550e7700r397m533K0629L0179L8435k2060m3790K6653K2796k3338l295R441p95
6537a6775J2073r92l196o847J1567k2187j0472o435J9900L3324O312K8046p690
$$ y = [-23304, -29632, -38468, -43183, -19567, 9343, -11674, -24734, -35272, -34447, -60586, -68517, -47243, -49732, -50962, -10417, 23537, 1639, -18748, -33660, -37790, -13270, 8248, 12531, 37815, 26509, 28774, 27199, 29689, 14746, -7422, -4644, -25400, -20560, -15, 20687, 16236, -20722, -48716, -47912, -19509, 10369, 21951, 12997, 27746, 41658, 47253, 54575, 44264, 54175, 58646, 51933, 39304, -11308, -27601, -39951, -44089, -42131, -39644, -42922, -21350, -3515, -5075, -18644, 293, 9391, 17471, -11645, -12110, -44690, -66952, -31910, -33253, -49386, -62138, -44892, -37668, -57700, -67097, -71630, -51001, -20822, 17613, -4447, -48237, -21584, 1212, -22126, -25421, -15980, -16775, -4702, -5694, -8890, -15737, -4170, -26357, -36829, -43264, -23364, 9960, 16272, 44318, 36628]
6524C6628m1404j5690k5709j4427J2024p61K405J7059J726M1043J4988k6259k569
6511i46p68m358j5822L659j1752j8246K2808k7003j3381K0504K6074q711j022
6498b8964P30J9911n071L0760q605j3748n0444K7269J5107k0006k2645k370L853
6485e4223P859J8674J2762j971k7497l5526J925L6621L4356k5566m0655J6425
6473e6816L1289K8113j2821j389j3145R226K1978m650K0289j1289j4953m5847
6461e0015m988Q020L282r507k3938J0885J8269l342M3030j2788j8511k3391N194
6448e7800L4374R730J2906j4532J0646l35K1737K0393m500J184j2447J3749L4782
6435F9887j3509k7082p462J9129j2148r778k4452j265n87r641J2806K2308J8802
$$ y = [36628, -4776, -20466, -46175, -60602, -48578, -49339, -46934, -29875, -28149, 12894, 27882, 1623, -946, -1714, -6072, -21894, -18235, -29987, -48233, -25425, -52428, -65809, -45305, -19231, -27942, -28964, -28234, -8323, -13394, 17366, 8761, -4987, -55431, -28162, -13055, -33061, -55706, -58076, -54223, -46364, -27690, -14928, -16899, -44396, -79922, -77997, -41376, -7020, -32586, -73241, -56816, -25527, 2586, -10235, -11624, -24769, -15543, 6435, 1785, 22074, 10785, -4168, -50015, -55003, -46983, -43701, -53208, -77146, -66261, -47992, -51334, -8304, -21092, -39603, -62994, -57800, -23426, -13696, -790, -15322, -4676, -5011, 16726, 37119, 32619, 33803, 21356, 35105, 69887, 56378, 29296, 21834, 40963, 28815, 19037, -5415, -6680, -7267, -16908, -4102, 18206, 37008]
6422C7008l3741k3794j254L2914L368p704l410J2624j3461L33J8938M724r684
6409A6861j0624k9J8516K9775J7343j3575k1755l0130r056K9606j2083l939K1592
6396C2502n914J1471M572J7036j9094k200J3520l3400m2715l7200j0577j3275
6384h5274O461m230J8302L1952K6729J1365K0403k1607k8071O558J6693n37N801
6371D545M1J0950J1844Q066L675p571m638k0175n3944l698L330J6174K0008N0938
6357C9545r000j3904l3685K095N024p762J699l1326j0495M0235K0432Q726j3145
6344a561k7232j9623l930N552l804j8494l017J5398J4182P776R789r963K8272
6331f655Q844k8267l366K3189K3166J0713k2810Q824j067k1905p438K284L364
$$ y = [37008, 3267, -20527, -21781, 11133, 14501, 6797, 3387, 16011, 2550, 2883, 21821, 26545, 16861, 6237, 6208, 24724, 54499, 71842, 58267, 36512, 6382, -2674, 26932, 14849, 10910, 32502, 26588, 38059, 42631, 59667, 40573, 38373, 51893, 18493, -24222, -61422, -71999, -85274, -78813, -83043, -64741, -32789, -6060, 5305, 25708, 4101, -23970, -17412, -719, -1256, 4545, 4586, 15536, 27380, 35446, 39121, 31550, 26912, 6737, -47207, -50905, -47575, -31401, -11393, 39545, 30545, 16641, -17044, -14949, -9925, -17687, -15988, -47314, -57809, -17574, 2858, 11584, -1561, -28793, -48416, -52346, -46794, -50598, -69092, -72109, -56711, -42529, -34753, -24964, -34927, -6655, 2189, -26078, -29444, -6255, 16911, 27624, 4814, 13638, 12571, -9334, -16772, -14488, -11124]
6318a1124j0844P006K2570J9043j5351J0872K4557j6266k6012Q055j656p632j2536
6305i318k5506n569K9948p11n148o628k4982J6137J5768j4700j993K4309K4496
6292A6103o215o68K3171P731n037j5909j4579j8034M996J3714J4321j6968j6800
6279a4174k2449K8241L3867n1366j859p135L285J0646k4550o528k88K323J9036
6266c0951N016J1715K0926m959j9382R13j673K3489k445l8884k2220K2985J2327
6253b3143n102j8900O974J1156J6586L0590j1500j2994n097r489J4288O631j237
6240a237l796j5030j0018J6627K8718l553j6203M30Q723l69j3619j8957R623m129
6226b2790o19J2116j1594N299k8186k1645P709M2172J956K288q847k3104L9548
$$ y = [-11124, -21968, -14962, 7608, 26651, 11300, 22172, 46729, 30463, 4451, 12506, 10850, 3218, -9318, -34824, -40393, -10445, -11156, -16304, -22932, -47914, -31777, -16009, -30709, -32702, -8393, 16103, 9888, 9220, 32391, 40122, 35085, 19176, 4597, -13437, -8441, 5273, 19594, 2626, -14174, -36623, -8382, 25485, -25881, -27740, -34875, -31590, -20944, -45494, -52022, -52310, -49987, -30951, -25935, -14220, 6706, 1747, -17635, -16722, -18395, 5094, 2649, -36235, -58455, -35470, -23143, -28245, -47145, -40171, -29015, -12429, 18161, 6661, -6333, -11430, -20919, -6631, 0, -1237, -5033, -20063, -30081, -13454, 15264, 11711, -4492, -4062, 4661, 4292, -9327, -28284, -18661, -22790, -23409, -11293, -22887, -17588, -45774, -67419, -59710, -17538, -15582, -13294, -22141, -45245, -5697]
6213e697M9716L7756k8506l1806l900K0835j5749k0957k1942K6104J3316j3727
6201E443j4450n267K8461m798k1492q376J06L706M906K8673K095L5431R660j7257
6187D6841o1463k9634l221K2850K1945K7142O377k7004j1153K4977j6567l2976
6175c1886R144J2205K1455K3417k9056J1954R089j5549o715P043n742n544j6094
6162a6279J1814K6241l416k3258j0664J6433N503j0007p286l651j885K89M072
6149a2094k5875K881J7474K9196N05l3963j7578l797j2862M868O029K6843M6123
6136B7750j2390R26j0183k1552k4644M43J8383K2959q744n807J4167K9134J793
6123C2235K399M0274L358m0060o572L903p123k3463M878k209n0510j6088K1935
$$ y = [-5697, 44019, 81775, 53269, 21463, 17563, 38398, 22649, 1692, -20250, 5854, 19170, 5443, -9007, -14274, 14187, 9389, -12103, -20479, -20373, -16667, -11761, 16912, 19007, 54438, 64098, 46841, -14622, -44256, -47477, -24627, -2682, 24460, 30837, 3833, -7320, 17657, 1090, -31886, -22742, -10537, 10918, 34335, 5279, 17233, 26322, 10773, 4058, 11101, 5359, -185, -16279, -4465, 21776, 18360, -4898, -15562, 871, 6374, -3633, -10919, -14570, -16455, -16166, -12094, -37969, -35088, -17614, 11582, 12087, -21876, -39454, -43251, -56113, -51245, -45216, -18373, 27750, 15360, 16286, 6103, -15449, -40093, -39650, -21267, 1692, -7052, -12859, 1308, 30442, 32235, 34634, 74908, 78266, 38206, 31634, 35537, 28414, 4951, 9829, 7620, -42890, -58978, -37043]
6110c7043N1982J6545m2195l2964j0422O895Q209K3082K086J3044j3448J6998
6098B769J5244k8113k5348K3729L5282Q718j4053J4183J3304p329n881j3118k6449
6085g062j2774o957Q095j4502L6776j9065l3695J5448K2930K2942K0113r485j0115
6072A2649k3575L079l793Q491Q875J0232j6627J2686J8813K024k9269j0663j3274
6059b0352k0402K3005K0289M096j7151P004J4285K1420j7229K440l10L0024J2898
6046F0017k6265n4787q229M524k5098m0279J1484K5623L225Q829n545J3392L2033
6033a076J7335k917L144j4838Q988K3947m55k7855k6838R916O685J2763j4477
6020e678j8986O086n873j0985k0021j3901J0399M2957M7287L2703o187m5279l9
$$ y = [-37043, 14939, 31484, -10711, -43675, -54097, -47202, -38993, -15911, -13825, -781, -14229, 2769, 18013, -10100, -35448, -11719, 23563, 32281, 18228, 32411, 45715, 38386, 32505, 19387, -7062, -19836, -26793, -18698, -33200, 3576, -15489, -49184, -33736, -10806, 12136, 32249, 22764, 12649, -10926, -7847, -11640, -3149, 5726, 15958, -669, 12017, 30830, 32854, 3585, -7078, -20352, -40754, -17749, 2540, 6636, -10515, -3511, 10774, 32194, 14965, 17405, 17095, 47119, 60017, 33752, -21035, -29264, -24740, -49838, -90117, -78633, -53010, -49785, -40956, -46501, -33109, -1076, 16259, 13342, 16486, 1648, 10636, 34583, 34128, 6273, -20565, -10649, -3964, 8799, -5678, -24664, -18578, -24451, -35436, -55457, -69358, -58959, -16002, 31285, 63988, 57801, 12522, 12483]
6007A2483k1551k616O1M791j610K3239k0198o276k6852J4175P649K3156j0486
5994d035L544K6614N760k6216M482J0057K0028l1210m4475j1518J0761J0995L0286
5981E073L799L758m2550P052J214O622p784K1754J3293k7538l8760q760n057J6372
5967e1512J5413K2005J745K3613j70j4327n971Q380k8410k1832J9055N5337J0960
5954C4286J676j6190l3450R076j9128n65k5419k2264J1814K6392o840L749p672
5941d4535M756K3393J7716K6675Q708O895k1541l0258l5578j4664J8594N2139
5929A2300R13j7720M388k4597l3950j2663L563k914K5467Q729k4509m818K273
5916f3538L4824L084P472L508j533j7302K3165L2361l0957k1529k4408q802j286
$$ y = [12483, -9068, -11684, -11623, -6832, -8442, 14797, -5401, -11677, -38529, -24354, -16705, 6451, -4035, -491, 26123, 31883, 5667, 10149, 20206, 40234, 9024, -35451, -46969, -36208, -25213, 5073, 8872, 12630, -29920, -22868, -21654, -15032, -22816, -1062, 12231, -15307, -54067, -62827, -67884, -51512, -36099, -14094, -12349, 11264, 11094, -3233, -9204, -824, -29234, -51066, -32011, 23326, 34286, 35962, 19772, -13678, -4602, -23730, -24295, -49714, -71978, -60164, -33772, -40612, -36863, -44535, -39779, -16386, 1330, 28005, 36713, 43608, 22067, -8191, -43769, -58433, -39839, 12300, 13213, -4507, -119, -24716, -58666, -71329, -67766, -70680, -45213, -36484, -60993, -65811, -63538, -28714, -25630, -18158, -14650, -16183, -33485, -10320, 22041, -8916, -30445, -54853, -63655, -64941]
5903f4941J1647p671M0597J0198L5935J1835j1630k2288k1759j3492L6465K1622
5891B6518O750l9887k0188J481J7777K533M129L617J7425j8108j0450k6457j2454
5878d7314j979J2023O603K8421K1173J6158j7872l531k8877l473J4329K4549K23
5865B0433l9486J6424L0694O449k1326l7887O06L7696J5992J3032j6648q659k1281
5852c961k892K0542r596j6999O739k6455m904J0320J2350K2349J1998J7192J3113
5839D9796K6032L665l5666m7475J5182R273K296o571k1395j8108n506J8674k6013
5826c5816j2206j3189J6220K5947J0619L6011J4538j8763j2616K9595j1466k2758
5814F116k8471P52J4972q67q135N817L1796j575j5619R95k9343J3735Q100j7827
$$ y = [-64941, -53294, -60965, -20368, -10170, 25765, 37600, 25970, 3682, -18077, -31569, 4896, 26518, 33268, -6619, -26807, -25326, -7549, -5016, -887, 2730, 20155, 2047, -8403, -34860, -47314, -49293, -37270, -30667, -2246, 18927, 35085, 17213, 13682, -15195, -18668, -4339, 20210, 20433, -19053, -2629, 28065, 34514, 13188, -24699, -24093, 13603, 29595, 42627, 25979, 17320, -3961, -6853, 13689, 4093, -12906, -6167, -32622, -37526, -27206, -14856, 7493, 19491, 36683, 49796, 75828, 79493, 43827, -3648, 11534, 20807, 23103, 16532, -4863, -22971, -28477, -9803, -35816, -48022, -61211, -44991, -19044, -8425, 27586, 42124, 23361, 10745, 40340, 28874, 6116, -22355, -21603, -6631, -7498, -15633, -9816, 21980, 20405, 4786, 5781, -23562, -9827, -1727, -19554]
5800a9554m568K0369j2654j0296R072K5493k0000j4772J1422L5925k878j1274
5788F285K2643J169l1365l1607J7854J9574l3110j5380L5190P791p691K3436M787
5775A9576k9244N292L5980R960J6896j8115q317Q8l426k4159J7346j367j9402
5762A108K0946J1010J3398J0710k4023k1408p289o442j7160l137j577k5965K2631
5749b7198L8188L1736P867k6951l084J1636K354l6672k8179J0929L3890J2877
5737B7393Q706j1494j3817j5305K948o674j3284J21L071l167K4789n099k6516
5724b8328j8622k380l897r074Q412K1278O470J7640J8273j712k5789k1779l111
5711d2619M575M1866J4908j3224l3659j3735P051K7499K64o471j1103J9733r551
$$ y = [-19554, -24122, -3753, -16407, -26703, -17631, 7862, -12138, -26910, -15488, 20437, 17559, 6285, 28928, 30097, -1268, -32875, -15021, 4553, -28557, -43937, -8747, -956, -8647, 14789, 19576, -9668, -4376, 31604, 41564, 58460, 40345, 32028, 32116, 28690, 4531, 21877, 20510, 1108, 22054, 33064, 46462, 57172, 33149, 11741, 4452, -1990, -19150, -22287, -23864, -49829, -27198, 10990, 42726, 50593, 23642, 20558, 32194, 34548, -2124, -30303, -19374, 14516, 27393, 36099, 24605, 10788, -4517, -1569, -8243, -21527, -21406, -18335, -21502, 3287, -1812, -28328, -46950, -49330, -53227, -62301, -53889, -32611, -26141, -8501, 9772, 8060, -17729, -39508, -42619, -38044, 3822, 18730, 5506, -28153, -41888, -34837, -7338, -7074, -13545, -24648, -4915, -14466]
5698a4466J1889M1397j1974k4045J1145j8372J0648M4764K4426k8589k7204q914
5686A0705J8235n397j5752j1652Q010j6942j3857J4848K8032r152m581j0060j3760
5673b1323j3853J213J958o630K1885J4738m813L207l0556K178j0980m465j5986
5660f3427Q696K7157L2085o669k7840M46L1506L851k2152L637j5439q342j5464
5647e1955L864P237k026j671J4474P120Q629n560J0014n581M2395K0375l9106
5634H209k460K4452J3344m233M901J9214R916k6401k6736p455j289j7085k4479
5621c0102l7371M097M2934L5573L69k1415K0748l120Q404k8279j6199J963K4645
5608B247j9612Q421L876K0276K1385j7546k6238n963q137j131K3353R337j0222
$$ y = [-14466, -2577, 38820, 26846, 2801, 13946, -4426, 6222, 50986, 75412, 46823, 19619, 10705, 28940, 23543, 7791, -3861, 4149, -12793, -26650, -11802, 16230, 7078, 2497, -7563, -21323, -35176, -33963, -32005, -38635, -16750, -2012, -6825, -3618, -34174, -31996, -42976, -47441, -63427, -54731, -27574, 4511, -2158, -29998, -29552, 1954, 5805, -16347, -12710, -28149, -36491, -51955, -48091, -40854, -42880, -44551, -30077, -22957, -14328, -19888, -9874, -15455, 26940, 47315, 8209, 5749, 30201, 43545, 39312, 44213, 63427, 73343, 46942, 20206, 12751, 11462, -5623, -30102, -67473, -63376, -20442, 15131, 15500, -5915, 14833, 11713, 20117, -8162, -24361, -22398, 2247, -17365, -8944, -5068, 15208, 36593, 19047, -7191, -13154, -21291, -22422, 931, 10268, 46]
5595D6k474J1447k7102m3374L9824K9637j036J486l1959K0576N7964r384m4547
5582A104r14K3434J7700r02k5563j7828o858j4649k3432n507L1484K5644J647
5569E360j4917l664K5860l966j3342J208J3981K0968q757j5586j4611k8991j0200
5556d6657J4478O2402P191k4506k4805k3417n313J5475j9735j0276N553M741N00
5543d4369J6205K6870J3845k1581M265J3589l0911P506J0617R75j7927j7444J1552
5530b6808J7739L398K384K2360J2141j3294j0251J0630J5431P169k2015k3474
5518d590O71L0188j7159O489M4735j5745k2803l655J984J5862j593k1985j9269
5505f870k0117K9433J5089j822l0568O858M5563O375J995J3262p166n4935k7348
$$ y = [46, -2428, 9019, -18083, -61457, -21633, 8004, 6968, 8454, -23505, -2929, 55035, 45651, 1104, 190, 23624, 41324, 40422, 14859, -2969, -9827, -24476, -47908, -53415, -21931, 3713, 5360, -9557, -13221, 12639, 8673, -4669, -3461, 10520, 31488, 22731, 7145, -7466, -36457, -46657, -32179, 30223, 37414, 12908, -11897, -35314, -40627, -25152, -44887, -55163, -49610, -44869, -44369, -28164, -1294, 12551, -9030, -4765, 8824, -22087, -14581, -3964, -2989, -20916, -38360, -26808, -9069, -5671, -3287, 19073, 31214, 17920, 7669, 18299, 33730, 40899, 18884, -4590, -3919, 26269, 9110, 15599, 60334, 44589, 21786, 18131, 20115, 35977, 34384, 12399, -6870, -26987, 2446, 17535, 15713, -14855, -7997, 37566, 43941, 45936, 59198, 52032, -2903, -30251]
5492c0251m877p683M1583J3556J1882P969J660j4938l2437J4203k766o508M83
5479h124o586j4191k2514P673K1804k692q473K764N31p211L6447m037j9897k312
5465b6818o142L7295J3537k6206M527L1063l5395Q97q193O538J9274L5757j5971
5452C0163k4468n425L0913R749j1586j401j33k6854M334K0888p214R048J8321
5439D6335o67k4532L879K7332L5794k1306j4926m6076j1648J407j4777j606j0540
5426c1331R573P727n76n107N710J586Q761k5010M048J1564M4319K481J394k9074
5412F065k2591K1541m604k1146k4493p218L2243J0180j3446J1538J5935l3239
5400b9235j4386M9214r619j464O950M463j3361M234j1133j4459P929l4545m171
$$ y = [-30251, -35128, -42811, -1228, 12328, 24210, 32179, 33839, 18901, -13536, 667, -2099, -8607, -8124, -14710, -28901, -51415, -43742, -21938, -24630, -33103, -30339, -29808, -37019, -572, -4609, -24506, -26818, -32960, 4335, 17872, -8334, -3807, 27256, -8139, -7242, -15435, -8897, 10377, 46134, 30163, 5695, 270, 31183, 40932, 29346, 27945, 27812, 958, 5292, 26180, 18966, 28014, 46335, 45668, 21136, 25015, 52347, 88141, 66835, 51909, 5833, -5815, -4408, -19185, -20791, -31331, -21758, -14031, -14607, -19714, -14004, -12418, -3657, -28667, -24619, -13055, 31264, 33745, 35139, 6065, -16526, 5015, 411, -20735, -45228, -52446, -20203, -10023, -23469, -11931, 4004, -29235, -43621, 5593, -4026, -5490, 1460, 5923, -7438, -3204, -14337, -28796, -20867, -55412, -59583]
5387e9583M8829J2884j0762p289j3471K426o425K0618J1706J6323K382j0066K4193
5374C1765Q027L562j581J1009K4727J4030k0511j8465j9503j8442l2925k9956
5362d8263J8977L6082q941q811k962K1697k460j7031m7175N142L6272J7776Q878
5349I181k432J4495n275K9389q675k1028J4644q726m6010p239k0911R742N81M643
5335c7621O532o736O817K722j6362n902l376J2417K9040j0903p285p887j5962
5322e4506M4647j7773j8608J4643Q168N146l181J2376N0700j7936O501K291k7633
5309D835P2J648K1154r517j5823J7412Q152k0070N872K8948k5278l2966J2930
5296b631L9131k7628k0160J6979J6314l1217j6855K4918L3806k2533Q367k6070
$$ y = [-59583, -10754, 2130, -8632, -15921, -29392, -26966, -33391, -12773, -1067, 15256, 17638, 7572, 31765, 39792, 43354, 41773, 52782, 77509, 91539, 71028, 52563, 33060, 14618, -18307, -48263, -29286, 6796, -2145, -10956, -13918, 7779, 5319, -11712, -58887, -53745, -17473, 303, 9181, 6749, 21244, 15969, 45358, 36683, 15655, 30299, 21573, -24437, -31676, -52587, -42845, -42264, -37621, -31089, -37825, -31008, -28286, -44648, -50550, -53926, -41509, -12469, -23372, -30657, -38544, -54506, -9859, -27632, -46240, -31597, -23429, -18283, -21464, -9088, 41612, 23676, 30177, 32468, 4835, 4907, 6555, 27709, 18192, 2369, 19781, 27933, 7863, 13735, 42683, 17405, -15561, -2631, 36500, 8872, -11288, 5691, 22005, -9212, -26067, -1149, 32657, 10124, 18491, -7579]
5284g579k958N105j7386J0780K30n029K3J1412j1732j1780j6451o858J4087O606
5270c1530J0763K439L551L958l0909r65j7621M2335K9444L1485O202n0890m3524
5257d5262P019K0683J8495J5439k6952m840l226k1467P688L7740J675j5489o635
5244a5132J0918J9763l15o030J8453J8360o330k8282m3654l968Q892n361K0397
5231a2289L5389q370j0543q236k1664p926L6175K6430n383j7045n1724J4977k643
5218c2852k4757l5614K6563M1637j2727K3097J5830n203q462P41m9836J3581N924
5205d2078J6240L5042L6532O293k1735k7167j8059k8711n103J4677R561p856J6592
5192a5772J0841L8521O220L0021m659r323j3165l6847j2540P558J8277J278n054
$$ y = [-7579, -10537, -5432, -22818, -12038, -11808, -16837, -16814, -5402, -17134, -28914, -45365, -52223, -38136, -31530, -20767, -18328, -14777, -10819, -41728, -42693, -60314, -17979, 11465, 42950, 49152, -1738, -45262, -38243, -17560, 935, 16374, -10578, -15418, -18644, -40111, -32423, 5317, 6992, -8497, -15132, -4214, 15549, 15234, 9204, 27657, 46017, 39687, 11405, -32249, -36217, -27325, -32686, -12289, 23100, 14730, 4187, -4049, -25713, -33639, 2536, 28966, 23583, 6538, -45186, -30209, -32852, -57609, -93223, -66660, -25023, -37750, -14653, 1177, -4026, -12488, -11747, -61583, -48002, -42078, -25838, 9204, 45736, 52029, 30294, 3127, -14932, -43643, -48746, -34069, -24508, -32364, -15772, -4931, 33590, 39810, 69831, 65172, 55849, 42684, 5837, -6703, 855, 19132, 20410, 15356]
5179A5356k5371k4054o512q665M0920J7653l3031K6547j3281R172j513K2150K1659
5166D1030K044j300j43J0883k1159m1421M140P508L946J1383l01k3216j4825L5435
5152A4004K1115K802l132k3188j3330J8266J2210l4502j481q423K4514K3459J6603
5139D8917j7580j8183k0625o111J8840M440n8r550l0766q597K6416o762K852K3297
5125F530r012J5948O980l4211j6365J2644R653l0549j3121L1538J7489Q317l392
5112B449j1954j4142k1155J1012K1444K832k969M320J2954J9157k216j4983p914
5099a165j3157J3629K2530J201j6676K458L1253R816r814j1252J050K3095r080
5086D3888J2333K3331j1512j5682J462k2883j1739j0965J788J2543K8961j8709
$$ y = [15356, -10015, -34069, -40581, -49246, -8326, 9327, -23704, 2843, -10438, -1266, -2779, 19371, 41030, 43074, 41774, 41631, 52514, 31355, -10066, -5926, 1582, 5528, 16911, 16610, -6606, -21431, 14004, 35119, 37921, 34789, 11601, -1729, 16537, 28747, -5755, -7236, -15659, 8855, 32314, 48917, 31337, 13154, -7471, -13582, 5258, 9698, 9640, 90, -30676, -39273, -12857, -19619, -16767, 6530, -2482, 13466, 20446, -13765, -30130, -17486, -7833, -38382, -51503, -19965, -2476, 5841, 2449, -9505, -23647, -44802, -33790, -12346, -9514, -12483, -8163, 4791, 23948, 21732, 6749, -1165, -14322, -693, 21837, 23038, 6362, 8820, 40073, 49889, 40075, 28823, 29873, 52968, 43888, 56221, 79552, 68040, 52358, 53820, 30937, 19198, 8233, 10021, 22564, 51525, 32816]
5074C2816l0870l566j5975j9775j3565K6792L6812j1862k30Q885p812j4722J0546
5061b526j655l1829l737L8803Q306J5494O086l617N076o54r590q678p356m1783
5047c7660j0871J9492L6895M3270k4857o458k9322N178L5683J866m307q010k1532
5034f33J2910L5092m86L905k6092o620n557j5586m0157o219L9420K0352J2629
5021B2958n67k2714k1363j8081j733J8572K6787R720m462K130j8194j7094O888
5008a7153j3542k1135J8391M0285R003o271j6931N515r584n4403P183L4748L399
4995b0495J2016L9701j2956n2375p971L1011K4964K5243j6627m9966k5661J1917
4983d1199k9321j0857L567m531K5333M9320k5261n857r90L0846R718N348L0042
$$ y = [32816, 1946, -1620, -17595, -37370, -50935, -24143, 12669, 807, 577, 9462, 1650, -13072, -2526, -4181, -36010, -39747, -944, 7362, 22856, 28942, 25325, 30401, 29747, 20157, 11479, 4123, -37660, -48531, -29039, 7856, 51126, 26269, 19811, -9511, -4333, 31350, 33216, 28909, 20899, -633, 12277, 47369, 46883, 50788, 24696, 18076, 12519, -3067, -43224, -49443, -10023, 10329, 22958, 22391, -323, -21686, -39767, -41500, -22928, 3859, 13579, 9117, 11247, -6947, -24041, -17153, -30695, -51830, -33439, 6846, 15849, 9578, -7353, -1838, -11422, -65825, -58642, -23894, -20495, -8479, 31222, 18266, -34109, -42080, -11069, 13895, 39138, 22511, -27455, -53116, -41199, -70520, -81377, -77810, -82341, -57008, -7688, -32949, -38806, -39796, -8950, 768, 6116, 36158]
4970C6158k7551j0408L60K7768k5163n8200j7868M2623N5938j0099k0225l7652
4958d4319l0532L4651N7538L622J8559K4584l641j869j538R390j4747j9259l7333
4945d894m461m4984j5480J5198K1814J6376K1082l6890j3145J5651L512j1026
4933c7247L9849L3914l5027l2097q344M8243L2789p034J3224N836j5914j6689
4921B1503k0616K2240n278l5608J4482M031j9914P857j3060J5276j1324k8069
4909d8480k4986M435K0599p133K2556J4922J4735J6465N126j6517j0321p806j7695
4896c4100j0217J1286J0573K2217K6235J3305k4136k9587r758L884J1275M7351
$$ y = [36158, 8607, -1801, -1441, 26327, 1164, -57036, -74904, -32281, 23657, 13558, -6667, -44319, -74851, -40200, 17338, 20960, 39519, 64103, 60462, 58593, 57055, 66445, 51698, 32439, -4894, -9355, -54339, -69819, -54621, -32807, -16431, 4651, -32239, -45384, -29733, -26221, -37247, 2602, 36516, 1489, -30608, -38952, 9291, 42080, 35046, 48270, 54106, 38192, 21503, 887, 23127, 17849, -17759, -3277, 754, -19160, -11303, -24363, -9087, -20411, -48480, -73466, -69031, -48432, -55565, -33009, -18087, -3352, 13113, 18239, 1722, -8599, -16405, -34100, -44317, -33031, -22458, -241, 25994, 39299, 15163, -14424, -24182, -20298, -9023, 38328]
$$ [...]
##END NTUPLES=NMR SPECTRUM
##END=
