##TITLE=Analysis number 313695
Compound Code cc 06309
Book Reference 440/62/1
Project Code adrs
Chemist Name craigr
##JCAMPDX= 6.0         $$ Bruker NMR JCAMP-DX V2.0
##DATA TYPE= NMR SPECTRUM
##DATA CLASS= NTUPLES
##ORIGIN= Bruker BioSpin GmbH
##OWNER= NMR
$$ XWIN-NMR		Version 3.5
$$ Mon Sep 19 10:07:21 2005 GMT Daylight Time (UT+1h)  MAYBRIDGE\NMR@NMR_250MHZ
##.OBSERVE FREQUENCY= 250.131544655141
##.OBSERVE NUCLEUS= ^1H
##.ACQUISITION MODE= SIMULTANEOUS (DQD)
##.ACQUISITION SCHEME= undefined
##.AVERAGES= 16
##.DIGITISER RES= 18
##SPECTROMETER/DATA SYSTEM= dpx250
##.PULSE SEQUENCE= zg30
##.SOLVENT NAME= CDCl3
##.SHIFT REFERENCE= (INTERNAL, CDCl3, 0, 16.522)
##AUDIT TRAIL= $$ (NUMBER, WHEN, WHO, WHERE, WHAT)
$$ ##TITLE= Audit trail, XWIN-NMR		Version 3.5
$$ ##JCAMPDX= 5.01
$$ ##ORIGIN= Bruker BioSpin GmbH
$$ ##OWNER= NMR
$$ C:\u/data/dgb/nmr/ADRS/9610/pdata/1/auditp.txt
$$ ##AUDIT TRAIL=  $$ (NUMBER, WHEN, WHO, WHERE, WHAT)
(   1,<2005-09-19 10:07:02.78 +100>,<MAYBRIDGE\NMR>,<NMR_250MHZ>,
      <created by zg, POWCHK disabled, PULCHK disabled
       configuration hash MD5:
       62 19 C7 07 E1 42 D1 B7 37 6C 3D D0 77 39 F9 E6
       data hash MD5: 64K
       35 A2 65 8B 26 90 93 99 74 FD D9 AD 10 EE 62 E1>)
(   2,<2005-09-19 10:07:13.72 +100>,<MAYBRIDGE\NMR>,<NMR_250MHZ>,
      <Start of raw data processing
       ef LB = 0.3 FT_mod = 6 PKNL = 1 SI = 32K 
       data hash MD5: 32K
       D2 2B 8C C9 26 75 BB 8F 0B 44 25 B2 2E F8 F4 00>)
(   3,<2005-09-19 10:07:15.30 +100>,<MAYBRIDGE\NMR>,<NMR_250MHZ>,
      <apk 
       data hash MD5: 32K
       58 7A 90 44 4B 18 35 AD D4 3A 13 26 46 8E 68 07>)
(   4,<2005-09-19 10:07:16.03 +100>,<MAYBRIDGE\NMR>,<NMR_250MHZ>,
      <abs ABSG = 5 
       data hash MD5: 32K
       94 3B 41 19 11 09 90 EF 03 22 26 32 79 C4 BB AA>)
$$ ##END=
$$ 
$$ hash MD5
$$ 36 40 11 1D DC 4C 00 D9 8C AE 06 A1 CE 8E D9 9C
##$RELAX= 
##$RELAX= 
##$RELAX= 
##$RELAX= 
##$RELAX= 
##$RELAX= 
##$RELAX= 
$$ Bruker specific parameters
$$ --------------------------
##$DU= <C:\u>
##$EXPNO= 9610
##$NAME= <ADRS>
##$PROCNO= 1
##$TYPE= <nmr>
##$USER= <dgb>
##$AMP= (0..31)
100 100 100 100 100 100 100 100 100 100 100 100 100 100 100 100 100 100 
100 100 100 100 100 100 100 100 100 100 100 100 100 100 
##$AQSEQ= 0
##$AQ_mod= 3
##$AUNM= <au_zg>
##$AUTOPOS= <6 >
##$BF1= 250.13
##$BF2= 250.13
##$BF3= 250.13
##$BF4= 250.13
##$BF5= 500.13
##$BF6= 500.13
##$BF7= 500.13
##$BF8= 500.13
##$BYTORDA= 1
##$CFDGTYP= 0
##$CFRGTYP= 5
##$CHEMSTR= <none>
##$CNST= (0..31)
1 1 145 1 1 1 1 1 1 1 1 1 1 1 1 1 1 1 1 1 1 1 1 1 1 1 1 1 1 1 1 1 
##$CPDPRG= <>
##$CPDPRG1= <>
##$CPDPRG2= <>
##$CPDPRG3= <>
##$CPDPRG4= <mlev>
##$CPDPRG5= <mlev>
##$CPDPRG6= <mlev>
##$CPDPRG7= <mlev>
##$CPDPRG8= <mlev>
##$CPDPRGB= <>
##$CPDPRGT= <>
##$D= (0..31)
0 1 0 0 0 0 0 0 0 0.06 0 0 0 0 0 0 0.0002 0 0 0 0 0 0 0 0 0 0 0 0 0 0 
0 
##$DATE= 1127120821
##$DBL= (0..7)
120 120 120 120 120 120 120 120 
##$DBP= (0..7)
150 150 150 150 150 150 150 150 
##$DBP07= 0
##$DBPNAM0= <>
##$DBPNAM1= <>
$$ [...]
##$SUBNAM7= <"">
##$SUBNAM8= <"">
##$SUBNAM9= <"">
##$SW= 20.6930455092707
##$SWIBOX= (0..15)
0 0 3 0 0 0 0 0 0 0 0 0 0 0 0 0 
##$SW_h= 5175.983436853
##$TD= 65536
##$TD0= 1
##$TE= 294.16
##$TE2= 300
##$TE3= 300
##$TEG= 300
##$TL= (0..7)
0 120 120 120 120 120 120 120 
##$TP= (0..7)
150 150 150 150 150 150 150 150 
##$TP07= 0
##$TPNAME0= <>
##$TPNAME1= <>
##$TPNAME2= <>
##$TPNAME3= <>
##$TPNAME4= <>
##$TPNAME5= <>
##$TPNAME6= <>
##$TPNAME7= <>
##$TPOAL= (0..7)
0.5 0.5 0.5 0.5 0.5 0.5 0.5 0.5 
##$TPOFFS= (0..7)
0 0 0 0 0 0 0 0 
##$TUNHIN= 0
##$TUNHOUT= 0
##$TUNXOUT= 0
##$USERA1= <user>
##$USERA2= <user>
##$USERA3= <user>
##$USERA4= <user>
##$USERA5= <user>
##$V9= 5
##$VALIST= <valist>
##$VCLIST= <CCCCCCCCCCCCCCC>
##$VD= 0
##$VDLIST= <DDDDDDDDDDDDDDD>
##$VPLIST= <PPPPPPPPPPPPPPP>
##$VTLIST= <TTTTTTTTTTTTTTT>
##$WBST= 1024
##$WBSW= 4
##$XGAIN= (0..3)
0 0 0 0 
##$XL= 0
##$YL= 0
##$YMAX_a= 358689
##$YMIN_a= -403447
##$ZGOPTNS= <>
##$ZL1= 120
##$ZL2= 120
##$ZL3= 120
##$ZL4= 120
##$ABSF1= 16.522
##$ABSF2= -4.171173
##$ABSG= 5
##$ABSL= 3
##$ALPHA= 0
##$AQORDER= 0
##$ASSFAC= 0
##$ASSFACI= 0
##$ASSFACX= 0
##$ASSWID= 0
##$AUNMP= <proc_1d>
##$AZFE= 0.1
##$AZFW= 0.1
##$BCFW= 0
##$BC_mod= 0
##$BYTORDP= 0
##$COROFFS= 0
##$CY= 12.5
##$DATMOD= 1
##$DC= 0
##$DFILT= <>
##$DTYPP= 0
##$F1P= 14.0000005364418
##$F2P= -0.99999901652339
##$FCOR= 0.5
##$FTSIZE= 32768
##$FT_mod= 6
##$GAMMA= 0
##$GB= 0
##$INTBC= 1
##$INTSCL= 1
##$ISEN= 128
##$LB= 0.3
##$LEV0= 0
##$LPBIN= 0
##$MAXI= 10000
##$MC2= 0
##$MEAN= 0
##$ME_mod= 0
##$MI= 0
##$NCOEF= 0
##$NC_proc= -3
##$NLEV= 6
##$NOISF1= 0
##$NOISF2= 0
##$NSP= 0
##$NTH_PI= 0
##$NZP= 0
##$OFFSET= 16.522
##$PC= 1
##$PHC0= -70.5078
##$PHC1= 3.788328
##$PH_mod= 1
##$PKNL= yes
##$PPARMOD= 0
##$PSCAL= 4
##$PSIGN= 0
##$REVERSE= no
##$SF= 250.13
##$SI= 32768
##$SIGF1= 0
##$SIGF2= 0
##$SINO= 400
##$SIOLD= 32768
##$SREGLST= <1H.CDCl3>
##$SSB= 0
##$STSI= 32768
##$STSR= 0
##$SW_p= 5175.98343685301
##$SYMM= 0
##$S_DEV= 0
##$TDeff= 65536
##$TDoff= 0
##$TI= <Analysis number 999999
Compound Code 99
Book Reference 9
Project Code 9>
##$TILT= no
##$TM1= 0
##$TM2= 0
##$TOPLEV= 0
##$USERP1= <user>
##$USERP2= <user>
##$USERP3= <user>
##$USERP4= <user>
##$USERP5= <user>
##$WDW= 1
##$XDIM= 32768
##$YMAX_p= 533044769
##$YMIN_p= -193937
$$ End of Bruker specific parameters
$$ ---------------------------------
##NTUPLES= NMR SPECTRUM
##VAR_NAME=  FREQUENCY,     SPECTRUM/REAL,   SPECTRUM/IMAG
##SYMBOL=    X,             R,               I
##VAR_TYPE=  INDEPENDENT,   DEPENDENT,       DEPENDENT
##VAR_FORM=  AFFN,          ASDF,            ASDF
##VAR_DIM=   32768,         32768,           32768
##UNITS=     HZ,            ARBITRARY UNITS, ARBITRARY UNITS
##FACTOR=    0.157963299565203, 1,           1
##FIRST=     4132.6476996994, 0,             0
##LAST=      -1043.33573715361, 0,           0
##MIN=       -1043.33573715361, -193937,     0
##MAX=       4132.6476996994, 533044769,     0
$$ Real data points
##PAGE= N=1
##DATA TABLE= (X++(R..R)), XYDATA
$$ [...]
$$ plain form
18773 170424 165618 147607 158736 176707 195496 223040 247200 278645 284237 234247 169418 148070
18761 148070 128645 106973 107847 134101 170979 198394 221521 241117 238502 262685 307933 336275
18749 336275 340319 331099 329159 328333 308142 288780 264906 233250 199075 193354 173729 150734 132407
18736 132407 142437 152843 144995 129704 123708 113456 89488 81983 78523 72175 72115 45502 38696
18723 38696 31958 24901 46392 68209 73155 70189 96009 124106 101257 79577 70330 79866 100523
18710 100523 124284 133252 121157 146477 172120 206350 248380 270570 301359 329967 332259 363704
18698 363704 415237 465007 462034 412908 393369 367866 336977 304391 265805 245451 222438 185540
18686 185540 159377 128506 102942 85787 77308 54415 31690 39217 47837 49428 65351 60456
$$ packed form
18773A70424m806j8011J1129J7971J8789K7544K4160L1445N592m9990o4829k1348
18761A48070j9425k1672Q74K6254L6878K7415K3127J9596k615K4183M5248K8342
18749C36275M044r220j940q26k0191j9362k3874l1656l4175n721j9625k2995j8327
18736A32407J0030J0406p848j5291n996j0252k3968p505l460o348o0k6613o806
18723C8696o738p057K1491K1817M946k966K5820K8097k2849k1680r247R536K0657
18710A00523K3761Q968j2095K5320K5643L4230M2030K2190L0789K8608K292L1445
18698C63704N1533M9770k973m9126j9539k5503l0889l2586l8586k0354k3013l6898
18686A85540k6163l0871k5564j7155q479k2893k2725P527Q620J591J5923m895
$$ plain form
18674 60456 61242 44255 19791 20558 16540 24979 29212 21116 47764 61584 47838 60106 64362
18661 64362 60023 52865 52444 56308 54905 54426 67791 65314 69735 63734 58430 70875 59256 31676
18647 31676 30325 45711 41235 31163 10959 -6798 -3463 21468 39987 35383 28144 32295 35062
18634 35062 23126 10142 21937 44340 51911 49037 50851 45489 33895 23755 44588 70576
18622 70576 68322 58898 50078 55838 56539 52429 43347 47423 43980 50455 36520 24808 21151 18870
18608 18870 28372 37852 44516 54590 53400 55976 54905 42151 49090 48911 46210 37398 47050 59191
18594 59191 70172 51689 44560 40034 34319 44528 60751 74792 79318 64811 45020 48034 75503
18581 75503 74941 78088 74181 75956 65255 57291 46910 45136 42859 50898 51080 46536 58178 72541
$$ packed form
18674F0456P86j6987k4464P67m018Q439M233q096K6648J3820j3746J2268M256
18661F4362m339p158m21L864j403m79J3365k477M421o001n304J2445j1619k7580
18647C1676j351J5386m476j0072k0204j7757L335K4931J8519m604p239M151K767
18634C5062j1936j2984J1795K2403P571k874J814n362j1594j0140K0833K5988
18622G0576k254r424q820N760P01m110r082M076l443O475j3935j1712l657k281
18608A8870R502R480O664J0074j190K576j071j2754O939j79k701q812R652J2141
18594E9191J0981j8483p129m526n715J0209J6223J4041M526j4507j9791L014K7469
18581G5503n62L147l907J775j0701p964j0381j774k277Q039J82m544J1642J4363
$$ plain form
18567 72541 58542 44439 65495 82464 67671 55163 35801 19987 33862 44326 39781 30603
18555 30603 26814 26289 53867 72835 79658 74863 50705 42381 36444 32523 41943 44053 49073 78141
18541 78141 93547 70006 57018 53158 36525 44066 58177 66000 64952 72148 76532 72909 63959
18528 63959 68364 77633 66008 57408 61989 63388 51520 53825 55237 57968 49967 56367 75832 76901
18514 76901 67003 42046 45062 67111 88278 112757 126562 114605 133963 141428 145427 171454
18502 171454 191473 204061 224745 229188 221537 203323 194963 180719 158755 155793 158279 183624
18490 183624 181313 187729 201884 219077 202763 214967 232320 249235 274624 258789 234302 243845
18478 243845 269196 305662 322019 317021 298905 273537 251307 250576 262383 262381 256074 241754 231021
$$ packed form
18567G2541j3999j4103K1056J6969j4793j2508j9362j5814J3875J0464m545r178
18555C0603l789n25K7578J8968O823m795k4158q324n937l921R420K110N020K9068
18541G8141J5406k3541j2988l860j6633P541J4111P823j048P196M384l623q950
18528F3959M405R269j1625q600M581J399j1868K305J412K731q001O400J9465J069
18514G6901r898k4957L016K2049K1167K4479J3805j1957J9358P465L999K6027
18502A71454K0019J2588K0684M443p651j8214q360j4244k1964k962K486K5345
18490A83624k311O416J4155J7193j6314J2204J7353J6915K5389j5835k4487R543
18478B43845K5351L6466J6357m998j8116k5368k2230p31J1807ko307j4320j0733
$$ plain form
18465 231021 216706 212547 193829 190645 221889 264277 288675 335598 343143 334810 302213 309371
18453 309371 323458 356441 395731 424160 414882 390688 337315 300260 272945 261261 237845 228731
18441 228731 202707 203480 218738 214227 216448 215027 204677 229525 260608 284196 307640 326191
18429 326191 341402 355527 406621 458581 499910 495002 466677 435868 422569 412460 416054 420797
18417 420797 411121 381474 353051 341414 358292 403771 464610 518676 567469 603743 594595 557479
18405 557479 543974 560326 575721 605483 643927 673510 682679 671252 649155 646639 657662 676233
18393 676233 705093 739427 790923 871554 973442 1079873 1204431 1343832 1528891 1786545
18383 1786545 2138485 2610006 3349136 4530425 6474148 9439530 12557607 14319022 14300481
$$ packed form
18465B31021j4315m159j8718l184L1244M2388K4398M6923P545q333l2597P158
18453C09371J4087L2983L9290K8429r278k4194n3373l7055k7315j1684k3416r114
18441B28731k6024P73J5258m511K221j421j0350K4848L1083K3588K3444J8551
18429C26191J5211J4125N1094N1960M1329m908k8325l0809j3299j0109L594M743
18417D20797r676k9647k8423j1637J6878M5479O0839N4066M8793L6274r148l7116
18405E57479j3505J6352J5395K9762L8444K9583R169j1427k2097k516J1023J8571
18393F76233K8860L4334N1496Q0631J01888J06431J24558J39401J85059K57654
18383A786545L51940M71521P39130J181289J943723K965382L118077J761415j8541
$$ plain form
18374 14300481 13002582 11471177 11251217 12709825 14548897 15082315 13892470 11328371
18366 11328371 8343469 6071512 4591021 3643568 3022398 2604347 2328248 2122269 1963621
18357 1963621 1837704 1753207 1733283 1742769 1788123 1831898 1863212 1881120 1934684 2071223 2252290
18346 2252290 2421557 2611234 2795475 3020164 3373372 3878854 4598504 5674023 7384341
18337 7384341 10130671 13688425 16526518 17525021 16923117 15448306 14734209 15896830 18483661
18328 18483661 20929298 22403772 23523563 25632725 29972783 34475342 36081797 34391908
18320 34391908 30554694 27283247 27523236 31117249 34539703 34465315 30674967 24232502
18312 24232502 17595304 12777044 9633640 7595867 6238582 5344231 4724994 4270551
$$ packed form
18374A4300481j297899j531405k19960J458608J839072N33418j189845k564099
18366A1328371k984902k271957j480491r47453o21170m18051k76099k05979j58648
18357A963621j25917q4497j9924R486M5354M3775L1314J7908N3564J36539J81067
18346B252290J69267J89677J84241K24689L53208N05482P19650J075519J710318
18337G384341K746330L557754K838093R98503o01904j474811p14097J162621K586831
18328A8483661K445637J474474J119791K109162M340058M502559J606455j689889
18320C4391908l837214l271447K39989L594013L422454p4388l790348o442465
18312B4232502o637198m818260l143404k037773j357285q94351o19237m54443
$$ plain form
18304 4270551 3918834 3647916 3427030 3286999 3246062 3285352 3333241 3374717 3463868 3617677
18294 3617677 3852475 4181394 4523471 4905681 5421860 6120445 7072036 8480035 10616031
18285 10616031 13963998 19422885 27855235 37441459 43660261 44379576 40863406 35758280
18277 35758280 33697740 36560909 41634658 43916243 41236209 34417362 25583163 18198291
18269 18198291 13216502 9993456 7864106 6414049 5402496 4707648 4201656 3838472
18261 3838472 3615433 3500702 3437632 3404413 3392863 3412792 3512915 3720096 3993638 4273197
18251 4273197 4499124 4705127 4966694 5347116 5891839 6588065 7480153 8604307 10060471
18242 10060471 12227157 15656353 21091249 28655725 36347456 41464355 43398898 43628960
$$ packed form
18304D270551l51717k70918k20886j40031m0937L9290M7889M1476Q9151J53809
18294C617677K34798L28919L42077L82210N16179O98585R51591J407999K135996
18285A0616031L347967N458887Q432350R586224O218802P19315l516170n105126
18277C5758280k060540K863169N073749K281585k680034o818847q834199p384872
18269A8198291m981789l223046k129350j450057j011553o94848n05992l63184
18261C838472k23039j14731o3070l3219j1550J9929J00123K07181K73542K79559
18251D273197K25927K06003K61567L80422N44723O96226Q92088J124154J456164
18242A0060471K166686L429196N434896P564476P691731N116899J934543K30062
$$ plain form
18234 43628960 45317678 51316313 60702267 69568730 73517026 70473239 62682510 54486728
18226 54486728 49825481 49342041 49237365 46051400 39375329 30539293 22217471 16126651
18218 16126651 12108283 9440101 7602086 6302305 5333121 4591177 4045321 3664280 3408676
18209 3408676 3221929 3035824 2839091 2636416 2464608 2364456 2318069 2288478 2259485 2248238
18199 2248238 2258080 2289810 2324331 2393315 2508992 2679492 2934508 3233653 3609453 4110603
18189 4110603 4841158 5960121 7785672 10691815 14525115 17979745 19766065 19934280
18181 19934280 19464607 20008423 22519188 25850781 28054731 27832463 25077944 21206546
18173 21206546 17902527 16243825 15914546 15512712 14113766 11745005 8927304 6515237
$$ packed form
18234D3628960J688718N998635R385954Q866463L948296l043787p790729q195782
18226E4486728m661247m83440j04676l185965o676071q836036q321822o090820
18218A6126651m018368k668182j838015j299781r69184p41944n45856l81041k55604
18209C408676j86747j86105j96733k02675j71808j00152m6387k9591k8993j1247
18199B248238R842L1730L4521O8984J15677J70500K55016K99145L75800N01150
18189D110603P30555J118963J825551K906143L833300L454630J786320J68215
18181A9934280m69673N43816K510765L331593K203950k22268k754519l871398
18173B1206546l304019j658702l29279m01834j398946k368761k817701k412067
$$ plain form
18165 6515237 4829860 3746229 3015913 2512918 2142426 1864846 1632666 1459702 1360447
18156 1360447 1285725 1212761 1141079 1050788 951182 886379 833422 793605 760300 698899 652251
18145 652251 606570 560258 535328 527340 523282 511252 520390 529709 518091 516564 533322 553710
18133 553710 581303 602152 625154 648713 699324 754829 820473 886887 958190 1028509 1106412
18122 1106412 1199587 1318936 1474071 1654024 1884735 2125063 2409966 2804348 3361684 4154066
18112 4154066 5450396 7618244 11605379 18791890 27324815 31934896 30770512 25340700
18104 25340700 17342266 11211313 7472711 5199423 3733830 2782401 2152872 1706659
18096 1706659 1403540 1186516 1026442 918297 811664 738807 693711 694201 728919 718671 670696
$$ packed form
18165F515237j685377j083631p30316n02995l70492k77580k32180j72964r9255
18156A360447p4722p2964p1682r0291r9606o4803n2957l9817l3305o1401m6648
18145F52251m5681m6312k4930p988m058j2030R138R319j1618j527J6758K0388
18133E53710K7593K0849K3002K3559N0611N5505O5644O6414P1303P0319P7903
18122A106412R3175J19349J55135J79953K30711K40328K84903L94382N57336P92382
18112D154066J296330K167848L987135P186511Q532925M610081j164384n429812
18104B5340700p998434o130953l738602k273288j465593r51429o29529m46213
18096A706659l03119k17024j60074j08145j06633p2857m5096M90L4718j0248m7975
$$ plain form
18085 670696 627597 557579 497778 478420 468340 449714 414754 383704 363484 356979 344082 338574
18073 338574 318735 318557 321382 327540 330427 328864 312345 291300 265157 239858 220071 218041 225429
18060 225429 223967 231374 221007 232138 221701 218807 228086 220856 210754 195407 201079 200881 206354
18047 206354 222408 213951 241349 260494 257443 262556 270378 295109 350481 430713 491844 563138
18035 563138 617222 637898 590253 531468 484595 460405 455776 457526 478214 506431 532111 554026
18023 554026 582191 608136 633909 683664 762980 830978 884770 938347 973318 948974 942855 964100
18011 964100 1040642 1157666 1264507 1336477 1401603 1465469 1561439 1719568 1887628 2105987
18001 2105987 2411915 2757870 3165612 3676180 4313102 5190336 6543865 8620546 11945220
$$ packed form
18085F70696m3099p0018n9801j9358j0080j8626l4960l1050k0220o505j2897n508
18073C38574j9839j78K825O158K887j563j6519k1045k6143k5299j9787k030P388
18060B25429j462P407j0367J1131j0437k894R279p230j0102j5347N672j98N473
18047B06354J6054q457K7398J9145l051N113P822K4731N5372Q0232O1131P1294
18035E63138N4084K0676m7645n8785m6873k4190m629J750K0688K8217K5680K1915
18023E54026K8165K5945K5773M9755P9316O7998N3792N3577L4971k4344o119K1245
18011I64100P6542J17024J06841P1970O5126O3866R5970J58129J68060K18359
18001B105987L05928L45955M07742N10568O36922Q77234J353529K076681L324674
$$ plain form
17992 11945220 17306020 24200933 29644632 31234838 29297393 25196897 21773795 21182549
17984 21182549 23705734 27591624 29557544 28083181 23695819 17812557 12767967 9323192
17976 9323192 7081079 5578053 4550932 3847350 3350166 3014338 2803454 2687097 2646378
17967 2646378 2684483 2752304 2787677 2845462 2910942 2990684 3090221 3275405 3537246 3854147 4222636
17956 4222636 4692107 5309164 6208278 7575261 9702369 13263989 18683185 24276252 27365637
17947 27365637 27271300 24896669 22072153 21384153 23890525 29325928 35875839 41704273
17939 41704273 45041196 43834667 38968470 32672428 26718395 23316779 23285733 25850569
17931 25850569 28271688 28034929 24933818 19772019 14486048 10576640 7986018 6270565
$$ packed form
17992A1945220N360800O894913N443699J590206j937445m100496l423102n91246
17984B1182549K523185L885890J965920j474363m387362n883262n044590l444775
17976I323192k242113j503026j027121p03582m97184l35828k10884j16357m0719
17967B646378L8105O7821L5373N7785O5480P9742R9537J85184K61841L16901L68489
17956D222636M69471O17057Q99114J366983K127108L561620N419196N593067L089385
17947B7365637r4337k374631k824516o88000K506372N435403O549911N828434
17939D1704273L336923j206529m866197o296042n954033l401616l1046K564836
17931B5850569K421119k36759l101111n161799n285971l909408k590622j715453
$$ plain form
17923 6270565 5121494 4365865 3850691 3468330 3159161 2931014 2764863 2672663 2626735 2594980
17913 2594980 2576384 2576752 2577254 2602745 2655996 2746322 2880800 3081039 3362554 3779633 4371923
17902 4371923 5287143 6722712 9089068 13019366 18160856 22160661 23181931 21567670
17894 21567670 18357284 15805876 15479484 17579932 20656308 22122257 20889336 17485145
17886 17485145 12963020 9182724 6658485 4974711 3818215 3005791 2437116 2034827
17878 2034827 1753511 1546229 1371609 1256957 1166888 1087507 1031618 1007258 998495 995906 972279
17867 972279 934941 890474 877340 876545 849117 808051 741748 686155 657444 632356 605986 567373
17855 567373 523664 466116 428897 403764 398840 414250 451176 485694 503968 497160 489500 487090
$$ packed form
17923F270565j149071p55629n15174l82361l09169k28147j66151r2200m5928l1755
17913B594980j8596L68N02K5491N3251R0326J34478K00239K81515M17079N92290
17902D371923R15220J435569K366356L930298N141490L999805J021270j614261
17894B1567670l210386k551408l26392K100448L076376J465949j232921l404191
17886A7485145m522125l780296k524239j683774j156496q12424n68675m02289
17878B034827k81316k07282j74620j14652r0069p9381n5889k4360q763k589k3627
17867I72279l7338m4467j3134p95k7428m1066o6303n5593k8711k5088k6370l8613
17855E67373m3709n7548l7219k5133m924J5410L6926L4518J8274o808p660k410
$$ plain form
17843 487090 477727 435010 405469 374336 343096 323393 302212 292847 296393 311722 332291 348219
17831 348219 370469 346774 307515 305124 303570 289333 293835 299419 292172 278982 259021 246168
17819 246168 252269 272967 279500 300710 308383 303485 311179 312466 301810 282124 262484 258820 261856
17806 261856 285927 347122 382336 389220 367228 349237 327736 332916 350295 358113 353941 358375
17794 358375 369244 364812 343337 323499 300246 280802 269711 257388 235700 208132 175217 160009
17782 160009 160529 161660 148441 151079 157068 155594 168889 169463 168303 179797 188063 181457 170406 173077
17768 173077 175435 177293 162922 150879 164523 174395 179416 176115 189652 182883 162013 161029 164043
17755 164043 171300 203315 243654 273649 282552 280664 271616 247197 239923 236470 220258 196236 199771
$$ packed form
17843D87090r363m2717k9541l1133l1240j9703k1181r365L546J5329K0569J5928
17831C48219K2250k3695l9259k391j554j4237M502N584p247j3190j9961j2853
17819B46168O101K0698O533K1210P673m898P694J287j0656j9686j9640l664L036
17806B61856K4071O1195L5214O884k1992j7991k1501N180J7379P818m172M434
17794C58375J0869m432k1475j9838k3253j9444j1091j2323k1688k7568l2915j5208
17782A60009N20J131j3219K638N989j474J3295N74j160J1494Q266o606j1051K671
17768A73077K358J858j4371j2043J3644R872N021l301J3537o769k0870r84L014
17755A64043P257L2015M0339K9995Q903j888r048k4419p274l453j6212k4022L535
$$ plain form
17742 199771 217677 210821 191878 188617 174528 160823 168851 170621 152410 141717 146720 155057 150441
17729 150441 133289 139423 178533 215978 261020 285509 294278 279611 274824 312702 352549 379347
17717 379347 369282 336387 327093 303313 261136 215915 173817 149903 122343 99781 64410 61489
17705 61489 84219 75245 42186 30288 30290 37767 39697 19281 21622 27489 19507 10025 23226 43734
17691 43734 57714 77343 57020 63313 74922 65571 48178 45356 21980 39096 59510 41202
17679 41202 44652 51165 61448 67481 67645 78940 109915 139751 182779 218766 224196 229199 242077
17666 242077 275810 300810 291141 258883 219438 206983 208183 192021 167690 142458 110077 91048
17654 91048 70499 56244 31748 8087 22550 42481 44972 23118 25361 42473 51251 49866
$$ packed form
17742A99771J7906o856j8943l261j4089j3705Q028J770j8211j0693N003Q337m616
17729A50441j7152O134L9110L7445M5042K4489Q769j4667m787L7878L9847K6798
17717C79347j0065l2895r294k3780m2177m5221m2098k3914k7560k2562l5371k921
17705F1489K2730q974l3059j1898KP477J930k0416K341N867p982r482J3201K0508
17691D3734J3980J9629k0323O293J1609r351j7393k822k3376J7116K0414j8308
17679D1202L450O513J0283O033J64J1295L0975K9836M3028L5987N430N003J2878
17666B42077L3733K5000r669l2258l9445j2455J200j6162k4331k5232l2381j9029
17654I1048k0549j4255k4496k3661J4463J9931K491k1854K243J7112Q778j385
$$ plain form
17642 49866 54442 48268 23961 47934 62056 54147 47325 31707 32906 35523 15932 10771 44839
17629 44839 73582 71864 42490 19613 19249 37904 32823 22076 12734 18977 35205 17728 10831
17616 10831 17764 23765 32707 24886 22052 14795 1172 1899 12621 18115 7407 -6135 -17385
17603 -17385 -40317 -45034 -15427 490 8970 22969 15739 7800 19944 31146 34475 15004 5730
17590 5730 11255 7650 238 9389 23827 20903 1340 6145 8557 3955 -3892 -19 883 -15442
17576 -15442 -16720 -2211 -1372 -17109 -24209 -4031 -3871 5501 4300 -10752 -13190 3346 28508
17563 28508 39996 22987 -3130 9573 20296 16507 15107 -3208 -37825 -18371 5319 -5215
17551 -5215 12532 12582 14799 -9643 -29350 -20588 -5552 7770 17310 15939 -4201 8573 29715
$$ packed form
17642D9866M576o174k4307K3973J4122p909o822j5618J199K617j9591n161L4068
17629D4839K8743j718k9374k2877l64J8655n081j0747r342O243J6228j7477o897
17616A0831O933O001Q942p821k834p257j3623P27J0722N494j0708j3542j1250
17603a7385k2932m717K9607J5917Q480J3999p230p939J2144J1202L329j9471r274
17590E730N525l605p412R151J4438k924j9563M805K412m602p847L873R02j6325
17576a5442j278J4509Q39j5737p100K0178J60R372j201j5052k438J6536K5162
17563B8508J1488j7009k6117J2703J0723l789j400j8315l4617J9454K3690j0534
17551e215J7747N0K217k4442j9707Q762J5036J3322R540j371k0140J2774K1142
$$ plain form
17538 29715 19150 12720 -1572 4984 8363 17933 33146 29417 17003 25615 32299 26662 19741
17525 19741 9824 7932 6216 -1858 -23080 -36883 -38405 -20538 2832 2822 -8000 -10712 -18971 -24391
17511 -24391 -12722 -6736 850 -9331 -5592 18070 20962 21926 22851 19855 9911 21135 22754 14434
17497 14434 19970 12706 8000 10290 6008 -3921 -6852 -11324 -256 -11812 712 8366 16492 47120
17483 47120 92040 99915 120243 142931 158198 159967 141781 109215 100515 114607 118304 124814 130820
17470 130820 102928 72724 59898 40254 28929 14725 32621 31632 27953 19126 33906 23995
17458 23995 6644 11517 -559 -4954 24326 39722 40041 42283 41305 39832 31029 33216 62138 85242
17444 85242 116612 150630 180194 232499 260783 274264 259963 209308 174255 161812 156153 160883
$$ packed form
17538B9715j0565o430j4292O556L379R570J5213l729j2414Q612O684n637o921
17525A9741r917j892j716q074k1222j3803j522J7867K3370j0j0822k712q259n420
17511b4391J1669N986P586j0181L739K3662K892R64R25k996r944J1224J619q320
17497A4434N536p264m706K290m282r929k931m472J1068j1556J2524P654Q126L0628
17483D7120M4920P875K0328K2688J5267J769j8186l2566q700J4092L697O510O006
17470A30820k7892l0204j2826j9644j1325j4204J7896r89l679q827J4780r911
17458B3995j7351M873j2076m395K9280J5396L19K242r78j473q803K187K8922K3104
17444H5242L1370L4018K9564N2305K8284J3481j4301n0655l5053j2443n659M730
$$ plain form
17432 160883 180131 214481 248941 251412 261837 254835 236747 208199 180855 186781 183348 164837
17420 164837 150189 154897 119011 64365 28391 10831 20001 37857 60886 53542 34221 17332
17408 17332 6439 6527 -236 8554 19015 25788 24817 23614 20435 27181 28022 22414 14071 8629 158
17393 158 5334 19699 39687 58842 77573 99522 119254 147839 142275 122725 125456 142561 136810
17380 136810 141984 148473 145849 123752 90310 70391 49281 37649 19063 8699 3295 1927
17368 1927 6787 4094 -3437 10306 17192 30598 22975 25768 34407 26700 19682 3979 5452 3195
17354 3195 -2377 27354 24675 22932 26844 11553 6132 2160 1512 -5139 -2939 -11553 -16922 1783
17340 1783 12037 16246 7624 -638 -1964 -3879 -2724 13305 26546 17070 6584 9258 9161 5785
$$ packed form
17432A60883J9248L4350L4460K471J0425p002j8088k8548k7344N926l433j8511
17420A64837j4648M708l5886n4646l5974j7560R170J7856K3029p344j9321j6889
17408A7332j0893Q8o763Q790J0461O773r71j203l179O746Q41n608q343n442q471
17393A58N176J4365J9988J9155J8731K1949J9732K8585n564j9550K731J7105n751
17380A36810N174O489k624k2097l3442j9919k1110j1632j8586j0364n404j368
17368A927M860k693p531J3743O886J3406p623K793Q639p707p018j5703J473k257
17354C195n572K9731k679j743L912j5291n421l972o48o651K200q614n369J8705
17340A783J0254M209q622q262j326j915J155J6029J3241r476j0486K674r7l376
$$ plain form
17326 5785 13283 16782 5549 2324 -8687 -17572 -23997 -13981 2860 6981 -2272 -5716 12676
17313 12676 29715 26685 37210 29379 25510 24391 22571 9095 -1365 2483 17880 26197 10207
17300 10207 24338 22309 20366 25216 32377 31359 50477 50509 54897 44308 51067 55078 53964 30340
17286 30340 28329 35649 34099 29510 43338 20616 2453 -2740 2630 -18897 -1851 20969 25304
17273 25304 34340 28173 31360 48913 72786 107717 115559 92447 83957 74523 71597 83220 100155
17260 100155 103729 104907 98098 76522 79058 71212 43027 35380 37991 50656 51437 49504 50372 16864
17246 16864 -4780 1755 1711 3112 18787 28398 30545 27590 44121 37076 39394 48236 72396 82695
17232 82695 91135 102990 115646 136123 158278 180903 193749 206268 231932 263327 313877 396564
$$ packed form
17326E785P498L499j1233l225j1011q885o425J0016J6841M121r253l444J8392
17313A2676J7039l030J0525p831l869j119j820j3476j0460L848J5397Q317j5990
17300A0207J4131k029j943M850P161j018J9118L2M388j0589O759M011j114k3624
17286C0340k011P320j550m589J3828k2722j8163n193N370k1527J7046K2820M335
17273B5304R036o167L187J7553K3873L4931P842k3112q490r434k926J1623J6935
17260A00155L574J178o809k1576K536p846k8185p647K611J2665P81j933Q68l3508
17246A6864k1644O535m4J401J5675R611K147k955J6531p045K318Q842K4160J0299
17232H2695Q440J1855J2656K0477K2155K2625J2846J2519K5664L1395N0550Q2687
$$ plain form
17220 396564 451453 492533 536990 526680 475433 410646 366078 330910 299551 266627 219465
17209 219465 170040 146251 124136 113411 97746 78647 75571 61065 48895 58901 44677 36331
17197 36331 36872 43843 43466 43351 60653 75382 75199 59631 55934 58513 51654 43976 59924 70806
17183 70806 59575 70460 92203 106863 130914 158052 184304 195977 215791 210790 240780 289870
17171 289870 360512 407030 414749 397205 337989 251268 194469 177168 146115 107751 84251 82884
17159 82884 70501 43896 23868 2974 3796 2413 -5452 -498 -14835 -8827 -7228 -12924 -15990
17146 -15990 -4353 12120 16375 12761 30446 28822 19958 15219 4286 3701 -5292 -6780 -1126 -8561
17132 -8561 -16169 -14120 -12522 5528 16921 9484 11021 21570 25698 154 -15885 -1740 -10740
$$ packed form
17220C96564N4889M1080M4457j0310n1247o4787m4568l5168l1359l2924m7162
17209B19465m9425k3789k2115j0725j5665j9099l076j4506j2170J0006j4224q346
17197C6331N41O971l77j15J7302J4729j83j5568l697K579o859p678J5948J0882
17183G0806j1231J0885K1743J4660K4051K7138K6252J1673J9814n001K9990M9090
17171B89870P0642M6518P719j7544n9216q6721n6799j7301l1053l8364k3500j367
17159H2884j2383k6605k0028k0894Q22j383p865M954j4337O008J599n696l066
17146a5990J1637J6473M255l614J7685j624q864m739j0933n85q993j488N654p435
17132h561p608K049J598J8050J1393p437J537J0549M128k5544j6039J4145r000
$$ plain form
17119 -10740 -18379 8459 1801 -16598 -29010 -37524 -36292 -33825 -17886 -11070 -15899 2856 10556
17106 10556 11749 21161 18505 7022 9252 16681 30225 22087 2997 -9357 5668 22191 27952
17093 27952 24587 22164 8080 12042 9016 -11284 -20086 -11195 -18009 -30712 -31686 -19792 -6596
17080 -6596 -8590 -1459 -16599 -18552 -6431 -7915 -5491 -6567 -4693 1070 -5779 7019 5392 -7380
17066 -7380 -14879 -9592 -6198 -9812 -10911 -17082 -670 9398 -2225 -5616 -3788 -2336 4835 -6936
17052 -6936 -29990 -45315 -42432 -32522 -41821 -35005 -24113 -22052 -23227 -12543 8350 5750 -11252
17039 -11252 -20986 -2932 8972 5567 9068 18608 7778 -5982 -12101 -10818 -8732 -24092 -20194
17026 -20194 -33377 -43945 -44768 -42621 -24763 -21413 -26120 -7413 12190 23566 25377 27038 16824
$$ packed form
17119a0740p639K6838o658j8399j2412q514J232K467J5939O816m829J8755P700
17106A0556J193R412k656j1483K230P429J3544q138j9090j2354J5025J6523N761
17093B7952l365k423j4084L962l026k0300q802Q891o814j2703r74J1894J3196
17080f596j994P131j5140j953J2121j484K424j076J874N763o849J2798j627j2772
17066g380p499N287L394l614j099o171J6412J0068j1623l391J828J452P171j1771
17052f936k3054j5325K883R910r299O816J0892K061j175J0684K0893k600j7002
17039a1252r734J8054J1904l405L501R540j0830j3760o119J283K086j5360L898
17026b0194j3183j0568q23K147J7858L350m707J8707J9603J1376J811J661j0214
$$ plain form
17013 16824 8915 1773 7770 6918 26505 60079 75305 73602 69052 63141 59594 54893 73928 81474
16999 81474 86681 67424 62520 62054 62771 83668 83735 79841 74575 74116 85889 99164 107643 114045 97477
16984 97477 76258 76437 57979 58942 64349 56876 44803 51887 50822 68665 67420 65448 82745 92872
16970 92872 86723 66163 65763 83445 94481 68786 43855 21970 16125 22806 2189 2310 20827
16957 20827 18665 13952 14119 16315 10700 6991 22499 22885 19511 6554 -11817 -17830 -9307 -4299
16943 -4299 14304 -1705 -20782 -22202 -2387 15557 6844 7073 -1354 -15642 -34263 -34026 -25698
16930 -25698 -13758 3424 -16594 -28958 -22356 -16582 -14069 -15794 -30354 -19003 -9684 -20168 -22753
16917 -22753 -27347 -18518 -16755 -9684 -10562 -14575 -13412 -9694 1101 -2227 -10088 -25070 -22933 -2587
$$ packed form
17013A6824p909p142N997q52J9587L3574J5226j703m550n911l547m701J9035P546
16999H1474N207j9257m904m66P17K0897O7l894n266m59J1773J3275Q479O402j6568
16984I7477k1219J79j8458R63N407p473j2073P084j065J7843j245j972J7297J0127
16970I2872o149k0560m00J7682J1036k5695k4931k1885n845O681k0617J21J8517
16957B0827k162m713J67K196n615l709J5508L86l374j2957j8371o013Q523N008
16943d299J8603j6009j9077j420J9815J7944q713K29q427j4288j8621K37Q328
16930b5698J1940J7182k0018j2364O602N774K513j725j4560J1351R319j0484k585
16917b2753m594Q829J763P071q78m013J163L718J0795l328p861j4982K137K0346
$$ plain form
16903 -2587 854 -19563 -31497 -11769 8954 8746 22681 38383 37137 27152 18981 28017 19776
16890 19776 10703 3296 -8547 -11073 -14798 -22398 -30298 -19659 -11111 -25056 -23664 -19428 -14372 -30170
16876 -30170 -27364 -12065 -8041 3302 -12550 -16751 -24555 -42441 -48443 -52088 -51163 -50138 -29848
16863 -29848 -24124 -21651 -41154 -44177 -32032 -8885 -11606 -3076 18690 14359 -6682 -18001 -8518
16850 -8518 -2088 -18649 -41673 -50293 -42259 -29839 -24984 -23123 -23376 -12238 -11806 -568 -3435 -2918
16836 -2918 -8141 -6877 -20394 -44586 -64479 -52513 -42836 -36206 -39682 -26857 -20416 -18026 -16218
16823 -16218 -130 5282 8240 6340 -741 3306 14723 26221 10477 -14809 -4619 9496 2220
16810 2220 -12915 -6348 -10573 -13301 -2908 14243 1172 2696 4936 4333 11256 10110 3708 -898
$$ packed form
16903b587L441k0417j1934J9728K0723k08J3935J5702j246r985q171R036q241
16890A9776r073p407j1843k526l725p600p900J0639Q548j3945J392M236N056j5798
16876c0170K806J5299M024J1343j5852m201p804j7886o002l645R25J025K0290
16863b9848N724K473j9503l023J2145K3147k721Q530K1766m331k1041j1319R483
16850h518O430j6561k3024q620Q034J2420M855J861k53J1138M32J1238k867N17
16836b918n223J264j3517k4192j9893J1966R677O630l476J2825O441K390J808
16823a6218J6088N412K958j900p081M047J1417J1498j5744k5286J0190J4115p276
16810B220j5135O567m225k728J0393J7151j3071J524K240o03O923j146o402m606
$$ plain form
16796 -898 -11263 -14507 -4567 9025 10584 4577 22344 31042 11670 182 4831 -2129 -15377
16783 -15377 -24831 -12463 -2341 -13153 -34041 -39328 -22811 7695 -1150 -814 9515 673 -5818
16770 -5818 9486 17831 26528 22042 2380 -7634 -16843 -24897 -2862 13172 17854 16371 15372 21772
16756 21772 27885 20031 15075 8342 14551 34525 39135 33284 13028 -12799 -22441 -17275 7340
16743 7340 2776 -11155 -7889 -6590 3101 -20698 -32389 -42251 -56999 -48597 -30435 -14721 -6370
16730 -6370 -11693 -18541 -19116 -19383 -729 3595 -1919 -19994 -16522 -23308 -19606 4966 7855 16984
16716 16984 -1374 13089 15769 -8270 -12428 -13867 -17578 -15248 4028 5057 -21223 -35451 -25204
16703 -25204 -28369 -26192 -22651 -12710 -11340 4367 11028 -2762 -4947 4580 17937 -846 -8260
$$ packed form
16796h98j0365l244R940J3592J559o007J7767Q698j9372j1488M649o960j3248
16783a5377r454J2368J0122j0812k0888n287J6517L0506q845L36J0329q842o491
16770e818J5304Q345Q697m486j9662j0014r209q054K2035J6034M682j483r99O400
16756B1772O113p854m956o733O209J9974M610n851k0256k5827r642N166K4615
16743G340m564j3931L266J299R691k3799j1691r862j4748Q402J8162J5714Q351
16730f370n323o848n75k67J8654M324n514j8075L472o786L702K4572K889R129
16716A6984j8358J4463K680k4039m158j439l711K330J9276J029k6280j4228J0247
16703b5204l165K177L541R941J370J5707O661j3790k185R527J3357j8783p414
$$ plain form
16690 -8260 -5833 -6975 8924 21658 22437 23162 3977 -5583 -5241 -1052 -9005 -9272 -7996 -1939 -5319
16675 -5319 -2334 24395 28261 21425 24154 12756 425 -24398 -32355 -19768 -9746 -10241 -18278
16662 -18278 -18940 -14066 -7957 -24217 -15527 -12655 -25680 -16900 -3255 4848 13607 39723 51672
16649 51672 38378 19556 27440 22897 7866 20774 33353 19461 23656 8134 3131 11874 5095
16636 5095 -585 9129 14623 13348 16725 15627 20822 13612 7702 2215 -4236 4122 15740 22995
16622 22995 13171 24289 12681 10353 6992 -5902 -1668 13834 24230 11611 -7740 -14305 -6581
16609 -6581 -5217 -13760 -1044 5737 -4630 5059 4023 -11712 -16361 -22732 -21756 -27375 -26971 -31129
16595 -31129 -29904 -13407 -14336 -10481 1109 19564 20572 14347 14056 11790 -5288 -12814 -13056 -6646
$$ packed form
16690h260K427j142J5899J2734P79P25j9185r560L42M189p953k67J276O057l380
16675e319K985K6729L866o836K729j1398j2331k4823p957J2587J0022m95q037
16662a8278o62M874O109j6260Q690K872j3025Q780J3645Q103Q759K6116J1949
16649E1672j3294j8822P884m543j5031J2908J2579j3892M195j5522n003Q743o779
16636E095n680R714N494j275L377j098N195p210n910n487o451Q358J1618P255
16622B2995r824J1118j1608k328l361j2894M234J5502J0396j2619j9351o565P724
16609f581J364q543J2716O781j0367R689j036j5735m649o371R76n619M04m158
16595c1129J225J6497r29L855J1590J8455J008o225k91k266j7078p526k42O410
$$ plain form
16581 -6646 -9977 -20186 -11282 -4231 -10171 -17584 -9335 -2755 7662 -1787 -722 8997 2858 -17242
16567 -17242 -38445 -21540 -21025 -30169 -9985 -13623 -5372 3304 -12505 -19426 -16227 -11625 11679
16554 11679 13031 17031 18975 18631 14157 5076 -1902 -8466 -10132 -15164 -10186 -5693 -4155 -15790
16540 -15790 265 19443 19837 2662 -2052 -14822 -23837 -11118 9469 31757 29645 14548 8457
16527 8457 8667 -1478 -17467 -18443 -21612 -20229 -6836 4677 1190 12626 18847 10518 7340 -21789
16513 -21789 -28243 -20795 -9881 -15632 -24001 -25101 -15211 -26116 -11766 -10125 2463 13607 -3945
16500 -3945 -30559 -30353 -26657 -13730 -278 -4017 -1449 -745 4920 -19387 -55070 -64708 -51764 -21702
16486 -21702 2288 15392 26461 15820 10332 8642 1502 -9506 -10301 -6828 10222 18419 23185
$$ packed form
16581f646l331j0209Q904P051n940p413Q249O580J0417r449J065R719o139k0100
16567a7242k1203J6905N15r144K0184l638Q251Q676j5809o921L199M602K3304
16554A1679J352M000J944l44m474r081o978o564j666n032M978M493J538j1635
16540a5790J6055J9178L94j7175m714j2770r015J2719K0587K2288k112j5097o091
16527H457K10j0145j5989r76l169J383J3393J1513l487J1436O221q329l178k9129
16513b1789o454P448J0914n751q369j100R890j0905J4350J641J2588J1144j7552
16500c945k6614K06L696J2927J3452l739K568P04N665k4307l5683r638J2944L0062
16486b1702K3990J3104J1069j0641n488j690p140j1008p95L473J7050Q197M766
$$ plain form
16473 23185 11287 3776 5423 10830 17777 9815 -2126 -32603 -47229 -24732 -21070 -17272 -10273
16460 -10273 -14147 -21759 -23449 -20662 -7193 -2982 17263 39767 44946 38973 28456 27307 16107
16447 16107 19871 32069 12467 4431 -6333 -7393 -851 -16284 6363 9363 -58 -13628 -7126
16434 -7126 -16281 -2101 16910 20041 25435 34790 11525 -11636 -9512 -3149 -262 3398 -5733 -3754
16420 -3754 -1617 10668 14655 13752 15558 4292 1043 -8970 -2476 -5590 -25616 -20754 -10655 -53
16406 -53 6566 -2065 -13177 -12662 4277 -6360 -2922 -29276 -32063 -3910 16437 19709 3780 9032
16392 9032 5405 -11537 -13834 -2054 -16980 -1199 12825 21227 14006 6205 727 -5508 -17528
16379 -17528 -15237 -1943 2632 -5911 -10312 -4308 7994 1888 -5188 11048 17186 29472 18429
$$ packed form
16473B3185j1898p511J647N407O947p962j1941l0477j4626K2497L662L798O999
16460a0273l874p612j690K787J3469M211K0245K2504N179n973j0517j149j1200
16447A6107L764J2198j9602q036j0764j060O542j5433K2647L000r421j3570O502
16434g126r155J4180J9011L131N394R355k3265k3161K124O363K887L660r131J979
16420c754K137J2285L987r03J806j1266l249j0013O494l114k0026M862J0099J0602
16406e3O619q631j1112N15J6939j0637L438k6354k787K8153K0347L272j5929N252
16392I032l627j6942k297J1780j4926J5781J4024Q402p221p801n478o235j2020
16379a7528K291J3294M575q543m401O004J2302o106p076J6236O138J2286j1043
$$ plain form
16366 18429 -668 -9175 8618 18217 7947 -7627 -10889 -2537 -13039 -26203 -23038 -26662 -23854
16353 -23854 -30643 -31487 1680 22117 7420 15560 10700 8668 1961 13548 23676 26078 25976 6145
16339 6145 1655 10168 10143 2569 1415 10238 9513 17533 5385 -10575 -16638 -23244 -34140 -25088 -21616
16324 -21616 -19109 -13580 -583 -8560 5902 -12786 -20303 -17119 -9523 -14576 -9963 -12034 -11071 -11209
16310 -11209 -17929 -8473 -6854 -7213 1968 34473 36738 36030 33432 24174 17674 16306 23691 39956
16296 39956 31384 -2075 -4872 -1745 -2601 6093 20246 8852 -9603 -15642 -22076 -5009 -17853
16283 -17853 -23454 -3207 -1660 -9506 -23097 -23106 -14081 -12298 -16887 -24072 -17593 -1389 18426 9751
16269 9751 -5049 -12750 -12186 -9300 -9311 -17107 -25167 -25805 -17452 4469 17863 17618 17344 20901 11385
$$ packed form
16366A8429j9097q507J7793R599j0270j5574l262Q352j0502j3164L165l624K808
16353b3854o789q44L3167K0437j4697Q140m860k032o707J1587J0128K402j02j9831
16339F145m490Q513k5p574j154Q823p25Q020j2148j5960o063o606j0896R052L472
16324b1616K507N529J2997p977J4462j8688p517L184P596n053M613k071R63j38
16310a1209o720R456J619l59R181L2505K265p08k598r258o500j368P385J6265
16296C9956q572l3459k797L127q56Q694J4153j1394j8455o039o434J7067j2844
16283a7853n601K0247J547p846j3591rR025J783m589p185O479J6204J9815q675
16269I751j4800p701N64K886j1p796q060o38Q353K1921J3394k45k74L557r516
$$ plain form
16254 11385 22261 13368 8914 7119 18007 17622 -2653 -13524 -2873 -8576 -20170 -17548 -7642
16241 -7642 6438 5129 -1962 -17261 -36424 -33638 -38343 -49551 -25886 -23103 -13153 2769 3051
16228 3051 -2150 -3075 4499 18539 15945 20433 13478 8092 8031 8874 11342 18869 9299 3347 -416
16213 -416 -4777 -3785 1526 -2613 -12379 -36372 -43276 -19351 1540 -4974 -11358 -21791 -20120 -18721
16199 -18721 -11059 -19742 -41053 -27508 -17666 -14505 -13510 -16028 -18275 -9650 -11178 -10972 17095 7762
16185 7762 -4179 6569 -4006 -22308 -14887 -9956 -16551 -25409 -20233 -7246 -19011 -25008 -44125
16172 -44125 -51172 -42016 -21346 7151 2489 -19586 -38505 -24015 -4324 -16159 -10931 3974
16160 3974 17613 22974 6994 -5799 4861 9050 -2227 -3892 6964 -1923 7780 22772 21145
$$ packed form
16254A1385J0876q893m454j795J0888l85k0275j0871J0651n703j1594K622R906
16241g642J4080j309p091j5299j9163K786m705j1208K3665K783R950J5922K82
16228C051n201r25P574J4040k594M488o955n386o1Q43K468P527r570n952l763
16213d16m361R92N311m139r766k3993o904K3925K0891o514o384j0433J671J399
16199a8721P662q683k1311J3545R842L161R95k518k247Q625j528K06K8067r333
16185G762j1941J0748j0575j8302P421M931o595q858N176J2987j1765n997j9117
16172d4125p047R156K0670K8497m662k2075j8919J4490J9691j1835N228J4905
16160C974J3639N361j5980j2793J0660M189j1277j665J0856q887R703J4992j627
$$ plain form
16147 21145 12196 3221 -4885 10138 10935 10451 4202 -9926 -7812 15122 6518 1227 4248 11950
16133 11950 25660 35099 23392 1141 13873 -3415 -24940 -16206 -8145 -11259 -10720 -19914 -34000
16120 -34000 -22468 -6296 9867 1043 6812 14722 -11856 -28853 -10694 -8238 -2871 12456 9918
16107 9918 15113 19360 27772 3382 -2731 1716 -8126 -10455 -4521 4050 3260 -9307 -14355 -6271
16093 -6271 -368 14432 17661 18596 23168 10656 5214 -11214 -20222 -6200 -7643 -20707 -15652 645
16079 645 2873 -98 -21058 -19218 -5229 3417 3731 -12557 -17993 -23832 -6014 10116 5324 -8558
16065 -8558 -6992 -3131 3848 -1203 -7598 -5400 -7815 -3531 -18204 -15843 2700 12796 8159 -3435
16051 -3435 1984 9785 9515 8830 24889 28812 4994 16776 20859 24998 31047 27790 23314 -1031
$$ packed form
16147B1145q949q975q106J5023P97m84o249j4128K114K2934q604n291L021P702
16133A1950J3710R439j1707k2251J2732j7288k1525Q734Q061l114N39r194j4086
16120c4000J1532J6172J6163q824N769P910k6578j6997J8159K456N367J5327k538
16107I918N195M247Q412k4390o113M447r842k329N934Q571p90j2567n048Q084
16093f271N903J4800L229R35M572j2512n442j6428r008J4022j443j3064N055J6297
16079F45K228k971k0960J840J3989Q646L14j6288n436n839J7818J6130m792j3882
16065h558J566L861O979n051o395K198k415M284j4673K361J8543J0096m637j1594
16051c435N419P801k70o85J6059L923k3818J1782M083M139O049l257m476k4345
$$ plain form
16037 -1031 -10884 2603 6533 10529 17630 2024 818 9586 240 -11432 -12306 -11749 -18028 -7926
16023 -7926 -15497 -18375 -6633 -20381 -2785 11098 20309 18021 11157 9353 4132 3995 23710 24091
16009 24091 30745 24661 -6199 -9604 14363 22227 -17979 -39127 -38407 -10719 -3081 8253 15089
15996 15089 -4032 4802 12559 3278 -5869 -13481 -13703 4193 24035 28544 29873 25175 8194 -4365
15982 -4365 -5704 -10279 6328 4742 -12963 -11490 2415 12381 19774 25029 12367 9212 11485 -6874
15968 -6874 -15925 -3204 -3679 -8577 -843 7408 19501 15525 24668 26832 2888 -14306 -24639 -5695
15954 -5695 -475 -8697 -7446 -13708 -9743 -26129 -34917 -48571 -49215 -18818 7599 17353 11819 10096
15940 10096 15187 16940 8388 -18726 -23147 -20631 -8111 6639 1227 6809 10781 6412 11805 23257
$$ packed form
16037a031r853J3487L930L996P101j5606j206Q768r346j1672q74N57o279J0102
16023g926p571k878J1742j3748J7596J3883R211k288o864j804n221j37J9715L81
16009B4091O654o084l0860l405K3967P864m0206k1148P20K7688P638J1334O836
15996A5089j9121Q834P757r281r147p612k22J7896J9842M509J329m698j6981j2559
15982d365j339m575J6607j586j7705J473J3905R966P393N255j2662l155K273j8359
15968f874r051J2721m75m898P734Q251J2093l976R143K164k3944j7194j0333J8944
15954e695N220q222J251o262L965j6386q788j3654o44L0397K6417R754n534j723
15940A0096N091J753q552k7114m421K516J2520J4750n412N582L972m369N393J1452
$$ plain form
15926 23257 24497 17719 21725 35298 27829 15788 11677 -3490 -8259 -15071 -12643 525 7452
15913 7452 21112 33148 15758 22789 46979 39958 23469 968 -7902 11847 14499 15536 17346
15900 17346 -5343 -7571 5065 6013 4413 -4040 -11979 -11240 -19816 -23163 -3041 -5648 4692 15833
15886 15833 -1703 -6204 -5559 -13376 -4143 4873 11647 -1523 -16447 -30898 -27599 -13780 -7010
15873 -7010 -7353 -8655 -10611 -24717 -9323 -13070 -12211 -6805 -6717 -7156 -7627 -21154 -7308 -8013 -13867
15858 -13867 -515 12373 9249 -5090 -23497 -27943 -30882 -43142 -42235 -47641 -37939 -27720 -24992
15845 -24992 -18907 -20831 -4890 -24480 -35399 -31474 -28930 -26195 -28971 -8356 1308 677 1455 -489
15831 -489 4020 15876 8840 -19824 -17517 -8477 -22475 -15759 6421 25376 27162 18614 7229
$$ packed form
15926B3257J240o778M006J3573p469j2041m111j5167m769o812K428J3168O927
15913G452J3660J2036j7390P031K4190p021j6489k2501q870J9749K652J037J810
15900A7346k2689k228J2636R48j600q453p939P39q576l347K0122k607J0340J1141
15886A5833j7536m501O45p817R233R016O774j3170j4924j4451L299J3819O770
15873g010l43j302j956j4106J5394l747Q59N406Q8m39m71j3527J3846p05n854
15858a3867J3352J2888l124j4339j8407m446k939j2260R07n406R702J0219K728
15845b4992O085j924J5941j9590j0919L925K544K735k776K0615R664o31P78j944
15831d89M509J1856p036k8664K307R040j3998O716K2180J8955J786q548j1385
$$ plain form
15818 7229 -173 3986 -2785 -22253 -17556 -30144 -33508 -13109 -8596 -9564 -18088 -15307 -25455 -42377
15804 -42377 -51440 -36072 -28670 -28627 -19402 -29532 -37242 -28134 -29257 -25879 -24646 -18451 -5012 3656
15790 3656 2867 12057 9932 11732 -9319 -30874 -35206 -25286 -33047 -22341 -10532 -13674 -168 3805
15776 3805 -15689 -18410 -21381 -21020 -16792 -20524 -14488 -7650 4671 11498 -1763 -7873 1612 -3331
15762 -3331 10518 3653 7007 12667 13583 14765 17342 25017 22707 5851 -19286 -28026 -32659 -25377
15748 -25377 -25834 -9435 -1123 6196 6645 -1131 -15851 -32168 -17347 -4526 -20724 -27618 -13174
15735 -13174 -5932 -3452 -10608 -9118 6575 -15279 -28677 -16152 -19420 -24450 -16387 -8577 -13995
15722 -13995 -15416 -11088 -10381 -4591 -3444 12303 15772 19571 4829 -14994 -24524 -19616 -15569 -18411
$$ packed form
15818G229p402M159o771j9468M697j2588l364K0399M513r68q524K781j0148j6922
15804d2377r063J5368P402M3R225j0130p710R108j123L378J233O195J3439Q668
15790C656p89R190k125J800k1051k1555m332R920p761J0706J1809l142J3506L973
15776C805j9494k721k971L61M228l732O036O838J2321O827j3261o110R485m943
15762c331J3849o865L354N660R16J182K577P675k310j6856k5137q740m633P282
15748b5377m57J6399Q312P319M49p776j4720j6317J4821J2821j6198o894J4444
15735a3174P242K480p156J490J5693k1854j3398J2525l268n030Q063P810n418
15722a3995j421M328P07N790J147J5747L469L799j4742j9823r530M908M047k842
$$ plain form
15708 -18411 -5805 20908 15597 -848 -5118 -13443 -11565 -5760 496 6442 2621 -990 6404 6209
15694 6209 1962 -8440 -6644 -9081 -40940 -25771 -16439 -18724 7001 23237 28874 13170 4636
15681 4636 26660 30036 28628 20933 14674 26865 12138 5345 13930 6982 -1593 10538 19281 15080
15667 15080 -963 -27282 -27559 -5614 -4688 -3011 9890 21492 30975 13078 -4332 -22657 -15702
15654 -15702 -11612 -17515 -11007 -8942 -21112 -18709 -13606 -10052 1342 13571 11992 18115 8599 -16776
15640 -16776 -15199 -20102 -23787 -19035 -10770 2503 6143 18113 14955 12954 1894 10073 15361 15368
15626 15368 6176 3655 -5745 -21837 -24676 -24586 -18906 -2693 3036 19897 26550 20804 34087 43667
15612 43667 25898 -5298 -17471 -9254 -13328 -12852 4114 13379 14950 13482 18319 29847 13229
$$ packed form
15708a8411J2606K6713n311j6445m270q325J878N805O256N946l821l611P394j95
15694F209m247j0402J796k437l1859J5169R332k285K5725J6236N637j5704q534
15681D636K2024L376j408p695o259J2191j4727o793Q585o948q575J2131Q743m201
15667A5080j6043k6319k77K1945R26J677J2901J1602R483j7897j7410j8325O955
15654a5702M090n903O508K065j2170K403N103L554J1394J2229j579O123r516k5375
15640a6776J577m903l685M752Q265J3273L640J1970l158k001j1060Q179N288P
15626A5368r192k521r400j6092k839R0N680J6213N729J6861O653n746J3283R580
15612D3667j7769l1196j2173Q217m074M76J6966R265J571j468M837J1528j6618
$$ plain form
15599 13229 -11454 -35321 -19934 -14234 -14562 -14048 -6072 6031 -1114 -4010 -24138 -42289 -41020
15586 -41020 -43424 -22343 -11145 3640 1370 810 4816 6640 4759 2660 11447 4374 6201 -4186
15572 -4186 -26364 -26349 -16700 8005 16392 -2214 -1670 16613 24597 14732 4361 -2941 4459 -3567
15558 -3567 -3289 -9555 -8486 4528 14235 18334 19214 -1547 -30467 -23117 684 12009 9123 4030
15544 4030 8965 -409 8667 3704 -20248 -33592 -27662 -18189 -15196 -25650 -21528 -3581 -1448 2508
15530 2508 -6240 -17302 -30454 -35828 -14173 10337 30977 40542 31361 24275 21314 22800 17348
15517 17348 -6482 -3866 -7329 -31988 -47773 -30725 2072 3538 2359 -14295 -21787 -25220 -24812
15504 -24812 -23733 -17912 -11029 -7789 12501 6417 -9788 -1952 12738 12064 -1690 -19263 -19769 -19741
$$ packed form
15599A3229k4683k3867J5387N700l28N14P976J2103p145k896k0128j8151J269
15586d1020k404K1081J1198J4785k270n60M006J824j881k099Q787p073J827j0387
15572d186k2178J5R649K4705Q387j8606N44J8283P984r865j0371p302P400q026
15558c567K78o266J069J3014R707M099Q80k0761k8920P350K3801J1325k886n093
15544D030M935r374R076m963k3952j3344N930R473K993j0454M122J7947K133L956
15530B508q748j1062j3152n374K1655K4510K0640R565r181p086k961J486n452
15517A7348k3830K616l463k4659j5785J7048L2797J466j179j6654p492l433M08
15504b4812J079N821O883L240K0290o084j6205P836J4690o74j3754j7573n06K8
$$ plain form
15490 -19741 278 24822 21328 16585 27767 26499 21825 30483 30720 36401 38850 37691 49253 68069
15476 68069 57357 42194 35761 25897 30218 6085 -26203 -40472 -19964 9751 18833 2338
15464 2338 -15030 -27324 -31683 -17299 -4227 13114 18988 12267 15052 1760 -19166 -14157 -5354
15451 -5354 6134 26046 20763 27206 33337 13044 -4507 -4040 18586 31136 37875 33632 24502
15438 24502 5603 -4748 806 20332 28690 45383 35554 18710 16295 18438 -3076 -23418 -41186
15425 -41186 -51464 -15459 5125 -2098 860 -8171 -7381 -5513 4312 8675 13084 21498 29563 28986
15411 28986 19411 12209 -965 -5670 19435 29578 55419 42736 25020 18512 32286 33162 2599
15398 2599 6809 19745 16005 2185 2152 11621 15 -3164 7044 29419 20565 2125 17589
$$ packed form
15490a9741K0019K4544l494m743J1182j268m674Q658K37N681K449j159J1562J8816
15476F8069j0712j5163o433r864M321k4133l2288j4269K0508K9715R082j6495
15464B338j7368j2294m359J4384J3072J7341N874o721K785j3292k0926N009Q803
15451e354J1488J9912n283O443O131k0293j7551M67K2626J2550O739m243r130
15438B4502j8899j0351N554J9526Q358J6693r829j6844k415K143k1514k0342j7768
15425d1186j0278L6005K0584p223K958r031P90J868R825M363M409Q414Q065n77
15411B8986r575p202j3174m705K5105J0143K5841j2683j7716o508J3774Q76l0563
15398B599M210J2936l740j3820l3R469j1606l179J0208K2375q854j8440J5464
$$ plain form
15385 17589 -668 -17225 -35234 -40851 -23851 2401 11258 9749 -19760 -19613 -867 -1496 10593
15372 10593 15142 21239 6984 4670 19821 30645 34596 11597 -23281 -39058 -38882 -17805 4379
15359 4379 -8149 -14173 -11195 -12363 -8646 -306 14061 5913 208 758 19692 17982 -4542 -4964
15345 -4964 -7136 -5867 -5130 -1441 2060 -5144 1454 -2127 -10407 -20008 -13454 -5665 -3967 -3442 -3251
15330 -3251 -12032 -9337 -5761 -12702 -21898 -26618 -18960 -13124 -4557 13075 14953 -10850 -20097 -17253
15316 -17253 -11007 -10970 11040 27307 13352 17583 28821 34559 21964 20238 18920 2686 119
15303 119 23008 48852 44924 14849 -2495 6308 5467 478 5102 15894 16829 20440 16291 23628
15289 23628 30018 33495 43010 30147 5793 -4548 -5259 22859 37750 35107 26430 30038 38975
$$ packed form
15385A7589j8257j6557j8009n617J7000K6252Q857j509k9509J47J8746o29J2089
15372A0593M549O097j4255k314J5151J0824L951k2999l4878j5777J76K1077K2184
15359D379j2528o024K978j168L717Q340J4367q148n705N50J8934j710k2524m22
15345d964k172J269P37L689L501p204O598l581q280r601O554P789J698N25J91
15330c251q781K695L576o941r196m720P658N836Q567J7632J878k5803r247K844
15316a7253O246L7K2010J6267j3955M231J1238N738j2595j726j318j6234k567
15303A19K2889K5844l928l0075j7344Q803q41m989M624J0792R35L611m149P337
15289B3628O390L477R515j2863k4354j0341p11K8118J4891k643q677L608Q937
$$ plain form
15276 38975 37771 25505 26089 39204 38090 36435 31321 29147 39547 40869 33526 57953 88664
15263 88664 95796 129089 180556 226707 259490 278960 267738 262015 201852 147697 103918 57518
15251 57518 32313 8543 24277 28396 20221 17585 15500 10417 -11285 -3427 33036 27784 14379
15238 14379 24404 6787 3840 6708 21970 19286 19384 7166 3708 751 -8411 -14560 -6386 2224
15224 2224 10533 13862 10886 11403 19481 20866 28433 32146 24828 -1108 -18862 -11532 13857 9997
15210 9997 1290 7297 16252 -9002 -19224 -2343 -11171 -2134 16626 26561 25240 20822 18237 10299
15196 10299 -242 2708 24596 19925 15057 27902 35172 32542 31022 28757 31161 31835 28437 25702
15182 25702 19431 -3965 -6650 19640 30016 29714 15907 23298 29882 30919 11986 -14062 -16420
$$ packed form
15276C8975j204j2266N84J3115j114j655n114k174J0400J322p343K4427L0711
15263H8664P132L3293N1467M6151L2783J9470j1222n723o0163n4155m3779m6400
15251E7518k5205k3770J5734M119q175k636k085n083k1702P858L6463n252j3405
15238A4379J0025j7617k947K868J5262k684R8j2218l458k957r162o149Q174Q610
15224B224Q309L329k976N17Q078J385P567L713p318k5936j7754P330K5389l860
15210I997q707O007Q955k5254j0222J6881q828R037J8760R935j321m418k585p938
15196A0299j0541K950K1888m671m868J2845P270k630j520k265K404O74l398k735
15182B5702o271k3396k685K6290J0376l02j3807P391O584J037j8933k6048k358
$$ plain form
15169 -16420 -2631 4960 9470 16411 14259 -2206 3297 17944 23753 29936 29515 -1234 -2828 27533
15155 27533 38158 42478 52969 56297 50147 50498 56354 40065 29597 34176 45851 47020 44956
15142 44956 30459 20632 4106 -2817 -9388 -8119 -7176 -12408 -3838 -5552 913 18149 20748 22171
15128 22171 27970 25125 19492 30175 27124 28706 21506 421 4175 27488 32013 15119 10567
15115 10567 23023 24152 23529 34482 31215 34100 32924 23735 19053 33694 28750 10130 16656 35861
15101 35861 41546 29115 23733 36943 37952 17784 4919 17396 12425 15415 14780 18110 17788 30873
15087 30873 46427 46040 48007 42184 28462 32885 25482 20569 18314 18452 24121 1295 2359 12957
15073 12957 12702 21906 30955 39544 42784 53735 72459 55823 31714 15148 4603 16000 31175
$$ packed form
15169a6420J3789P591M510O941k152j6465N503J4647N809O183m21l0749j594L0361
15155B7533J0625M320J0491L328o150L51N856j6289j0468M579J1675J169k064
15142D4956j4497r827j6526o923o571J269R43n232Q570j714O465J7236K599J423
15128B2171N799k845n633J0683l051J582p200k1085L754K3313M525j6894m552
15115A0567J2456J129o23J0953l267K885j176r189m682J4641m944j8620O526J9205
15101C5861N685j2431n382J3210J009k0168j2865J2477m971K990o35L330l22J3085
15087C0873J5554l87J967n823j3722M423p403m913k255J38N669k2826J064J0598
15073A2957k55R204R049Q589L240J0951J8724j6636k4109j6566j0545J1397J5175
$$ plain form
15060 31175 26906 27547 29756 32876 17797 31288 54651 55361 43464 54526 53975 37988 45767 64451
15046 64451 77474 78511 76753 74589 70448 75671 80343 83345 82000 103595 108818 131310 140631 142222
15032 142222 139478 189157 240604 268227 307775 348642 386926 418881 473007 495052 476465 470720
15020 470720 461180 424008 380394 349843 302091 261217 222614 204790 205244 187135 170322 154319
15008 154319 151024 156304 166874 172492 183392 166385 150077 150457 150705 153278 155052 178507 204967
14995 204967 216297 239203 260576 284487 326736 356973 413544 474195 499267 515403 500835
14984 500835 462544 412758 367247 326903 275114 229550 182621 160140 116338 86549 81570 57749
14972 57749 57903 71534 80274 81631 64210 55251 45264 42146 33102 29791 22762 19704 25634 20930
$$ packed form
15060C1175m269O41K209L120j5079J3491K3363P10j1897J1062n51j5987P779J8684
15046F4451J3023J037j758k164m141N223M672L002j345K1595N223K2492R321J591
15032A42222k744M9679N1447K7623L9548M0867L8284L1955N4126K2045j8587n745
15020D70720r540l7172m3614l0551m7752m0874l8603j7824M54j8109j6813j6003
15008A54319l295N280J0570N618J0900j7007j6308L80K48K573J774K3455K6460
14995B04967J1330K2906K1373K3911M2249L0237N6571O0651K5072J6136j4568
14984E00835l8291m9786m5511m0344n1789m5564m6929k2481m3802k9789m979k3821
14972E7749J54J3631Q740J357j7421q959r987l118r044l311p029l058N930m704
$$ plain form
14958 20930 8887 25381 44963 59266 53826 29345 9618 11185 25520 42896 34700 36496
14946 36496 30017 17427 12142 19815 23665 9163 -6542 2100 17448 26815 22277 31082 27367
14933 27367 31855 23730 6986 -4044 -9593 11805 28613 32570 42001 52700 43992 40366 35151
14920 35151 19421 27252 43719 39963 27541 23358 36329 34905 24935 26198 27843 27810 30946 24793
14906 24793 29275 20175 13871 22310 23993 21553 22570 13365 18530 22908 22720 17590 25888 46985
14892 46985 49183 17204 1651 8026 13572 21552 23496 17861 24491 37577 37118 40501 30701 25483
14878 25483 30022 16309 2686 15965 19066 21585 30219 31638 33230 36219 26062 24595 27917
14865 27917 29826 28255 42187 48125 31785 18892 18269 16651 4565 3168 10380 38428 24752
$$ packed form
14958B0930j2043J6494J9582J4303n440k4481j9727J567J4335J7376q196J796
14946C6496o479j2590n285P673L850j4502j5705Q642J5348R367m538Q805l715
14933B7367M488q125j6744j1030n549K1398J6808L957R431J0699q708l626n215
14920C5151j5730P831J6467l756j2422m183J2971j424r970J263J645l3L136o153
14906B4793M482r100o304Q439J683k440J017r205N165M378j88n130Q298K1097
14892D6985K198l1979j5553O375N546P980J944n635O630J3086m59L383r800n218
14878B5483M539j3713j3623J3279L101K519Q634J419J592K989j0157j467L322
14865B7917J909j571J3932N938j6340j2893o23j618j2086j397P212K8048j3676
$$ plain form
14852 24752 13082 6045 -6952 6050 28751 43599 43571 34865 30825 31851 42398 47592 41034
14839 41034 44526 46411 55966 58601 69039 69147 57052 54120 66291 77302 95987 121520 121887
14826 121887 105463 99311 106567 102114 98392 108977 96228 85190 68181 54897 52499 59201 53870
14813 53870 64716 71970 72170 79378 74597 50888 48725 52161 51673 53642 73546 87096 96467 103858
14799 103858 107870 94915 96577 95350 105228 108598 108452 120056 135807 154434 154963 155117 142699 129135
14785 129135 144066 145550 131558 105587 101569 92938 86236 77761 74402 82620 83543 83489 73716 68157
14771 68157 82836 89422 101479 122748 125858 125366 126855 131735 129037 110149 112524 122256 142438
14758 142438 151717 157144 139989 138134 134680 126187 123672 140746 162696 163912 135772 106226 112976
$$ packed form
14852B4752j1670p037j2997J3002K2701J4848k8q706m040J026J0547N194o558
14839D1034L492J885R555K635J0438J08j2095k932J2171J1011J8685K5533L67
14826A21887j6424o152P256m453l722J0585j2749j1038j7009j3284k398O702n331
14813E3870J0846P254K00P208m781k3709k163L436m88J969J9904J3550R371P391
14799A03858M012j2955J662j227R878L370j46J1604J5751J8627N29J54j2418j3564
14785A29135J4931J484j3992k5971m018q631o702q475l359Q218R23n4r773n559
14771F8157J4679O586J2057K1269L110m92J489M880k698j8888K375R732K0182
14758A42438R279N427j7155j855l454q493k515J7074K1950J216k8140k9546O750
$$ plain form
14745 112976 125519 133018 142994 144513 141542 134329 120410 117502 117784 129673 138761 149236 162925
14732 162925 186380 169082 144746 148564 168714 179224 189203 205173 200406 204117 176768 155792
14720 155792 183340 215933 225575 242086 251839 256646 265562 259350 252229 261665 271940 290255 297458
14707 297458 304149 312411 312791 314387 313616 317042 321681 303064 277102 247966 229514 218568 212328
14694 212328 201568 180568 193316 198598 183761 171008 151454 150244 153366 160657 179407 185091
14682 185091 177788 178250 195768 211532 216065 232217 250823 246637 244359 238372 258707 275818 286524
14669 286524 301255 318358 334314 348588 351610 336914 316291 283106 267699 263323 239397 205230
14657 205230 183737 199077 211482 209436 203743 194173 184483 186018 196835 198144 188556 210269 229674
$$ packed form
14745A12976J2543P499R976J519k971p213j3919k908K82J1889R088J0475J3689
14732A62925K3455j7298k4336L818K0150J0510R979J5970m767L711k7349k0976
14720A55792K7548L2593R642J6511R753M807Q916o212p121R436J0275J8315P203
14707B97458O691Q262L80J596p71L426M639j8617k5962k9136j8452j0946o240
14694B12328j0760k1000J2748N282j4837j2753j9554j210L122P291J8750N684
14682A85091p303M62J7518J5764M533J6152J8606m186k278n987K0335J7111J0706
14669B86524J4731J7103J5956J4274L022j4696k0623l3185j5407m376k3926l4167
14657B05230k1493J5340J2405k046n693r570r690J535J0817J309r588K1713J9405
$$ plain form
14644 229674 241803 261807 292105 302351 292501 295504 315288 339247 374254 392563 404489 421786
14632 421786 430945 464302 499526 504457 521714 545528 548117 574918 633460 667765 710647 749559
14620 749559 793167 826745 869231 925939 966487 1006101 1081537 1156766 1206293 1279160 1358862
14609 1358862 1458327 1546997 1658556 1785491 1898962 2015124 2146822 2281873 2461184 2662414
14599 2662414 2903880 3198667 3507980 3858269 4266216 4737053 5280596 5907094 6633707
14590 6633707 7464916 8422914 9531512 10828471 12353245 14138621 16245505 18783870
14582 18783870 21849494 25647786 30373436 36246396 43477907 52197697 62118666 72498063
14574 72498063 82117732 89472830 93304989 93081593 89135993 82481838 74406152 66057590
$$ packed form
14644B29674J2129K0004L0298J0246r850L003J9784K3959L5007J8309J1926J7297
14632D21786R159L3357L5224M931J7257K3814K589K6801N8542L4305M2882L8912
14620G49559M3608L3578M2486N6708M0548L9614P5436P5229M9527P2867P9702
14609A358862R9465Q8670J11559J26935J13471J16162J31698J35051J79311K01230
14599B662414K41466K94787L09313L50289M07947M70837N43543O26498P26613
14590F633707Q31209R57998J108598J296959J524774J785376K106884K538365
14582A8783870L065624L798292M725650N872960P231511Q719790R920969J0379397
14574G2498063R619669P355098L832159k23396l945600o654155q075686q348562
$$ plain form
14566 66057590 58256213 51401648 45624220 40863550 36999316 33906525 31462349 29533837
14558 29533837 28046922 26923008 26121940 25606550 25359516 25397393 25700315 26291909 27145984
14549 27145984 28309974 29791331 31652284 33924907 36741639 40155164 44306567 49422658
14541 49422658 55618820 62910507 71104486 79587417 87329254 92932692 95118989 93180635
14533 93180635 87311231 78491662 68134202 57586853 47878427 39486324 32546045 26930418
14525 26930418 22441212 18856425 15980230 13678814 11799691 10261831 8960271 7867132
14517 7867132 6938606 6154825 5497378 4897284 4399266 3993998 3630585 3310367 3037952
14508 3037952 2800767 2590044 2401017 2210410 2056940 1917967 1807305 1686004 1567337
$$ packed form
14566F6057590p801377o854565n777428m760670l864234l092791k444176j928512
14558B9533837j486915j123914q01068n15390k47034L7877L02922N91594Q54075
14549B7145984J163990J481357J860953K272623K816732L413525M151403N116091
14541D9422658O196162P291687Q193979Q482931P741837N603438K186297j938354
14533I3180635n869404q819569j0357460j0547349r708426q392103o940279n615627
14525B6930418m489206l584787k876195k301416j879123j537860j301560j093139
14517G867132r28526p83781o57447o00094m98018m05268l63413l20218k72415
14508C037952k37185k10723j89027j90607j53470j38973j10662j21301j18667
$$ plain form
14499 1567337 1471823 1383974 1310599 1234356 1166325 1132342 1083609 1008935 963319 935720 886340
14488 886340 874952 859362 830378 802112 785081 766461 707694 676656 654766 635898 632693 619561
14476 619561 598686 585620 586838 575506 550733 530446 520699 520502 532401 538095 518326 497328
14464 497328 480615 481076 465094 457067 458772 452632 443993 460545 472288 464476 450293 437266 426775
14451 426775 425530 423485 424747 417453 402612 355251 334012 319803 296890 274156 252899 212615
14439 212615 187466 180185 190827 199183 209630 200905 197587 201563 182735 164697 150408 150052 168204
14426 168204 183876 179372 169147 178165 178635 172348 141329 134054 135119 136724 149281 165676 164974
14413 164974 153218 127696 111391 116398 104044 89247 53689 46678 28781 6611 -11438 -39870
$$ packed form
14499A567337r5514q7849p3375p6243o8031l3983m8733p4674m5616k7599m9380
14488H86340j1388j5590k8984k8266j7031j8620n8767l1038k1890j8868l205j3132
14476F19561k0875j3066J218j1332k4773k0287r747j97J1899N694j9769k0998
14464D97328j6713M61j5982q027J705o140q639J6552J1743p812j4183j3027j0491
14451D26775j245k045J262p294j4841m7361k1239j4209k2913k2734k1257m0284
14439B12615k5149p281J0642Q356J0447q725l318L976j8828j8038j4289l56J8152
14426A68204J5672m504j0225R018M70o287l1019p275J065J605J2557J6395p02
14413A64974j1756k5522j6305N007j2354j4797l5558p011j7897k2170j8049k8432
$$ plain form
14401 -39870 -60194 -69477 -58752 -40096 -26703 -14497 -7558 -5700 -8740 1562 3542 9128 -11065
14388 -11065 -18448 -16915 -4131 14223 23333 7495 -13671 -8924 -1894 -5199 -2580 -1903 -6496 -640
14374 -640 2879 11466 12100 -1997 -10918 -7064 -2729 2779 1539 9088 9260 12509 23960 17447 3371
14359 3371 789 -15126 -38973 -31736 -18632 -20857 -14050 -14853 -31623 -41613 -14907 -3244 -10819
14346 -10819 -9211 18558 47668 52799 43575 37284 31341 35165 64054 80473 80964 84618 89739 87980
14332 87980 76902 58635 46735 43589 37114 31551 26508 34998 14696 17836 8956 2373 24497
14319 24497 54906 73937 60687 35798 20418 37095 45151 27974 29914 43952 49959 41191
14307 41191 44529 35376 23579 25193 17651 24794 57343 71995 57045 23142 15273 27981 24120
$$ packed form
14401c9870k0324r283J0725J8656J3393J2206O939J858l040J0302J980N586k0193
14388a1065p383J533J2784J8354R110j5838k1166M747P030l305K619O77m593N856
14374f40L519Q587O34j4097q921L854M335N508j240P549J72L249J1451o513j4076
14359C371k582j5915k3847P237J3104k225O807q03j6770r990K6706J1663p575
14346a0819J608K7769K9110N131r224o291n943L824K8889J6419M91L654N121j759
14332H7980j1078j8267j1900l146o475n563n043Q490k0302L140q880o583K2124
14319B4497L0409J9031j3250k4889j5380J6677Q056j7177J940J4038O007q768
14307D1191L338r153j1797J614p542P143L2549J4652j4950l3903p869J2708l861
$$ plain form
14294 24120 17708 16281 16889 25705 58552 72399 59236 51887 47378 47258 42891 52409 55238 72053
14280 72053 64980 52169 38193 36303 40797 55965 61237 54900 37813 33354 46686 60418 67547
14267 67547 76580 67476 68971 75169 81287 64025 41521 47750 68417 82581 87928 73676 67392
14254 67392 37809 11342 16840 -1862 13660 17393 17168 35412 47829 49144 47606 39170 46631
14241 46631 38678 36013 25917 16400 26705 33813 34720 38862 30714 27585 41207 49055 36049 52733
14227 52733 62161 55245 36019 25918 32352 38500 29495 23575 35992 61394 66897 58086 37671
14214 37671 53364 63885 36072 10755 13827 11907 1296 204 11741 13342 13554 22792 13403
14201 13403 -19592 -16161 -14328 -621 22305 19769 11970 22558 29858 38073 41862 41267 14406
$$ packed form
14294B4120o412j427O08Q816L2847J3847j3163p349m509j20m367R518K829J6815
14280G2053p073j2811j3976j890M494J5168N272o337j7087m459J3332J3732P129
14267F7547R033r104J495O198O118j7262k2504O229K0667J4164N347j4252o284
14254F7392k9583k6467N498j8702J5522L733k25J8244J2417J315j538q436P461
14241D6631p953k665j0096r517J0305P108R07M142q148l129J3622P848j3006J6684
14227E2733R428o916j9226j0101O434O148r005n920J2417K5402N503q811k0415
14214C7671J5693J0521k7813k5317L072j920j0611j092J1537J601K12R238r389
14201A3403l2995L431J833J3707K2926k536p799J0588P300Q215L789n95k6861
$$ plain form
14188 14406 19920 29894 40394 48795 45992 33935 12574 5031 2368 4377 -2710 4933 13746 6407
14174 6407 9252 25792 42541 34391 26038 15309 5472 10511 21540 52639 43416 50310 51981
14161 51981 20855 24405 40795 49927 52099 46645 44341 30151 39834 34803 30568 30229 32663 38714
14147 38714 42230 33146 29215 24634 26725 30350 32583 40298 55057 61630 73931 78208 62602 46072
14133 46072 53312 72570 70332 53194 54931 62786 89202 112913 120735 150271 187936 208386 232382
14120 232382 269807 320849 364338 405723 434456 473119 486911 490026 468972 421398 376769 341832
14108 341832 300193 277776 263941 240589 228727 223138 193161 174707 163843 146811 141637 139284
14096 139284 137197 155062 158689 141269 142576 176517 184593 166699 195707 239239 250858 252620
$$ packed form
14188A4406N514R974J0500Q401k803j2057k1361p543k663K009p087P643Q813p339
14174F407K845J6540J6749q150q353j0729r837N039J1029L1099r223O894J671
14161E1981l1126L550J6390R132K172n454k304j4190R683n031m235l39K434O051
14147C8714L516r084l931m581K091L625K233P715J4759O573J2301M277j5606j6530
14133D6072P240J9258k238j7138J737P855K6416K3711P822K9536L7665K0450K3996
14120B32382L7425N1042M3489M1385K8733L8663J3792L115k1054m7574m4629l4937
14108C41832m1639k2417j3835k3352j1862n589k9977j8454j0864j7032n174k353
14096A39284k087J7865L627j7420J307L3941Q076j7894K9008M3532J1619J762
$$ plain form
14084 252620 268672 289958 348973 384380 426056 459298 499422 510140 485091 454370 411504
14073 411504 350872 296949 248577 186991 157236 127665 105090 122303 118574 102917 95838 81828
14061 81828 78429 78871 81559 68899 45931 29189 32025 37525 40247 38822 53158 59707 41382
14048 41382 46867 47000 49929 36121 32025 45842 37422 32173 24818 17955 23983 17800 3984 -2805
14034 -2805 25661 52115 53773 46275 38092 30239 29815 56550 61046 47572 63236 81624 96180
14021 96180 100210 93324 99462 105334 131775 168132 186017 190579 206061 236319 253417 262599 285841
14008 285841 290680 283800 301368 295596 291082 281782 295173 290121 290726 271526 235780 231350 247580
13995 247580 236942 209232 198499 196982 218768 223191 224370 243798 258681 267988 259344 250419 272401
$$ packed form
14084B52620J6052K1286N9015L5407M1676L3242M0124J0718k5049l0721m2866
14073D11504o0632n3923m8372o1586k9755k9571k2575J7213l729j5657p079j4010
14061H1828l399M42K688j2660k2968j6742K836N500K722j425J4336O549j8325
14048D1382N485J33K929j3808m096J3817q420n249p355o863O028o183j3816o789
14034b805K8466K6454J658p498q183p853m24K6735M496j3474J5664J8388J4556
14021I6180M030o886O138N872K6441L6357J7885M562J5482L0258J7098R182K3242
14008B85841M839o880J7568n772m514r300J3391n052O05j9200l5746m430J6230
13995B47580j0638k7710j0733j517K1786M423J179J9428J4883R307q644q925K1982
$$ plain form
13982 272401 282679 279538 311262 325066 312983 299894 300581 312715 315889 311837 291746 244246
13970 244246 217404 174000 162816 158473 146610 143949 119488 88180 84085 83277 81997 74282 64991
13957 64991 70555 49710 19559 23101 42651 46082 43389 47289 44101 22401 25994 21397 28961
13944 28961 40020 51683 47647 46527 51988 50835 44423 35607 20146 14526 14169 3209 -13750
13931 -13750 -1476 -1705 -1008 -8451 -13820 -8027 -6629 -540 -8658 -11625 -5302 15198 2994 -17657
13917 -17657 -22564 -14035 6000 14092 41099 35865 33498 19756 8531 19104 23233 22859 38810
13904 38810 39150 28605 24362 34101 41656 23730 -9885 8 24270 6923 1903 -251 15475
13891 15475 23547 13517 -9417 292 16031 19047 -1234 -30851 -23537 -9195 -2611 19704 30428
$$ packed form
13982B72401J0278l141L1724J3804j2083j3089O87J2134L174m052k0091m7500
13970B44246k6842m3404j1184m343j1863k661k4461l1308m095q08j280p715r291
13957F4991N564k0845l0151L542J9550L431k693L900l188k1700L593m597P564
13944B8961J1059J1663m036j120N461j153o412q816j5461n620l57j0960j6959
13931a3750J2274k29O97p443n369N793J398O089q118k967O323K0500j2204k0651
13917a7657m907Q529K0035Q092K7007n234k367j3742j1225J0573M129l74J5951
13904C8810L40j0545m243R739P555j7926l3615R893K4262j7347n020k154J5726
13891A5475Q072j0030k2934R709J5739L016k0281k9617P314J4342O584K2315J0724
$$ plain form
13878 30428 40584 31553 28318 18271 24713 34167 28455 2505 9759 20630 18316 15363 10307
13865 10307 9012 19772 42338 42480 34596 31326 35819 17276 29980 28564 19057 9630 -3928
13852 -3928 6741 24217 25458 8703 8524 28700 17188 9933 17978 19997 18259 34413 46678
13839 46678 30391 -3785 -3963 -1592 2312 4004 9356 38994 63028 57112 38091 39900 46422
13826 46422 13733 -11620 -3291 -3509 -3520 -1590 -3655 -434 10897 7828 12590 5185 -855 1895
13812 1895 -7423 -4109 254 12456 16759 8202 1239 -12294 -7773 -146 10766 18380 24510 36636
13798 36636 29719 24981 33367 23934 40490 45490 39259 25357 -6655 -10761 -15066 4732 12791
13785 12791 408 4691 6138 10808 8747 17776 25639 23166 20141 20930 12216 -7741 -23927 -5961
$$ packed form
13878C0428J0156r031l235j0047O442R454n712k5950P254J0871k314k953n056
13865A0307j295J0760K2566J42p884l270M493j8543J2704j416r507r427j3558
13852c928J0669J7476J241j6755j79K0176j1512p255Q045K019j738J6154J2265
13839D6678j6287l4176j78K371L904J692N352K9638K4034n916j9021J809O522
13826D6422l2689k5353Q329k18j1J930k065L221J1331l069M762p405o040K750
13812A895r318L314M363J2202M303q557o963j3533M521P627J0912P614O130J2126
13798C6636o917m738Q386r433J6556N000o231j3902l2012m106m305J9798Q059
13785A2791j2383M283J447M670k061R029P863k473l025P89q714j9957j6186J7966
$$ plain form
13771 -5961 9274 15687 2823 4320 8660 4972 -5240 -5182 -1075 3931 -7853 -7740 -9820 -13754
13757 -13754 6093 15046 7683 -365 -2159 -2502 5598 4169 7550 3697 6091 29254 13106 5202
13743 5202 9532 2428 22471 29409 37418 26413 28591 17794 1100 8655 12958 15475 10764 1004
13729 1004 -10584 887 8936 11871 23592 9566 17233 18689 10458 22098 32146 37140 36707
13716 36707 29035 19925 19499 10227 9895 17294 10405 20797 22033 31082 19904 8328 14254 1709
13702 1709 -10766 8436 22285 19970 44665 51227 45774 22705 1921 9639 11160 25599 27224
13689 27224 28232 30224 39179 64978 63745 36880 22541 25575 17401 1256 16654 14552 4367
13676 4367 1119 21 -21983 -12356 6512 20427 28181 5748 -5547 -8231 5446 1755 -7235
$$ packed form
13771e961J5235O413j2864J497M340l688j0212N8M107N006j1784J13k080l934
13757a3754J9847Q953p363q048j794l43Q100j429L381l853K394K3163j6148p904
13743E202M330p104K0043O938Q009j1005K178j0797j6694P555M303K517m711r760
13729A004j1588J1471Q049K935J1721j4026P667J456q231J1640J0048M994m33
13716C6707p672r110m26r272l32P399o889J0392J236R049j1178j1576N926j2545
13702A709j2475J9202J3849k315K4695O562n453k3069k0784P718J521J4439J625
13689B7224J008J992Q955K5799j233k6865j4339L034q174j6145J5398k102j0185
13676D367l248j098k2004R627J8868J3915P754k2433j1295k684J3677l691q990
$$ plain form
13663 -7235 -5354 -14040 -15098 2582 2997 5235 16002 37359 31103 14313 9882 20873 29600 34062
13649 34062 60513 48832 30041 26837 7372 4779 29506 44070 33038 13223 11009 26866
13637 26866 22385 20976 19750 18553 18212 26219 20219 22209 28920 7353 -4153 -4746 8232 19574
13623 19574 20528 19215 23674 12589 11115 -14183 -31642 -13162 13626 16754 25008 13402 6765
13610 6765 31323 55273 55732 40274 37285 38698 29917 12573 -2672 18028 37697 38423 34286
13597 34286 36969 33319 19089 1285 -7309 -15575 -22625 2574 5661 8933 687 11206 6280
13584 6280 -12501 -7136 -6949 -11696 -3092 -13916 -11027 594 4789 -4535 -21926 -22213 -12439 11062
13570 11062 27586 24639 24366 31683 37244 24351 30510 47843 57991 63012 42039 5175 5932
$$ packed form
13663g235J881q686j058J7680M15K238J0767K1357o256j6790m431J0991Q727M462
13649C4062K6451j1681j8791l204j9465k593K4727J4564j1032j9815k214J5857
13637B6866m481j409j226j197l41Q007o000J990O711k1567j1506n93J2978J1342
13623A9574R54j313M459j1085j474k5298j7459J8480K6788L128Q254j1606o637
13610F765K4558K3950M59j5458k989J413q781j7344j5245K0700J9669P26m137
13597C4286K683l650j4230j7804q594q266p050K5199L087L272q246J0519m926
13584F280j8781N365J87m747Q604j0824K889J1621M195r324j7391k87R774K3501
13570A1062J6524k947k73P317N561j2893O159J7333J0148N021k0973l6864P57
$$ plain form
13557 5932 16222 -4436 -3671 -11632 -9229 11921 20506 11944 5776 4668 22349 46701 47014 42942
13543 42942 33406 21677 27008 30756 26078 25032 33696 34412 20794 1053 8319 25811 18692 3786
13529 3786 22974 46912 34890 37867 39557 20085 15121 16272 14509 31935 39354 45394 39857
13516 39857 35396 40808 36606 48754 66030 65473 65125 55293 47452 63613 72682 79382 79383 55253 40713
13501 40713 24543 4751 -8163 6133 22292 40800 45537 28373 22754 18901 30302 33576
13489 33576 41390 33587 23484 19523 15833 22000 44968 63123 53316 27072 25629 40415 42583
13476 42583 27537 16953 26990 32201 14868 10520 16622 39619 46514 26839 28383 26632 51961
13463 51961 51313 61479 37417 26144 17905 40528 54985 52923 36838 38830 50657 62020 74514
$$ packed form
13557E932J0290k0658P65p961K403K1150Q585q562o168j108J7681K4352L13m072
13543D2942r536j1729N331L748m678j046Q664P16j3618j9741P266J7492p119j4906
13529C786J9188K3938j2022K977J690j9472m964J151j763J7426P419O040n537
13516C9857m461N412m202J2148J7276n57l48r832p841J6161R069O700Jk4130j4540
13501D0713j6170j9792j2914J4296J6159J8508M737j7164n619l853J1401L274
13489C3576P814p803j0103l961l690O167K2968J8155r807k6244j443J4786K168
13476D2583j5046j0584J0037N211j7333m348O102K2997O895j9675J544j751K5329
13463E1961o48J0166k4062j1273q239K2623J4457k062j6085J992J1827J1363J2494
$$ plain form
13450 74514 66455 53189 57073 56128 69193 91223 55085 24805 24532 40803 64829 64939 57576
13437 57576 41196 32812 47047 35405 14830 8619 28541 34219 24152 21702 24943 52772 60170
13424 60170 63591 60290 40419 46429 54621 52524 38493 53840 62653 58731 64767 72623 74059 75075
13410 75075 70359 60789 73421 79514 64137 65798 58697 70074 73524 64044 47986 54808 77509
13397 77509 85295 95508 94216 69697 66604 56895 35011 31429 42878 42089 29128 30062 41890
13384 41890 26822 31433 49229 50962 47373 55163 43067 35601 56247 66967 55542 47802 64701
13371 64701 82714 76080 53993 60441 77950 91945 81221 80913 77369 84609 98311 85999 80445
13358 80445 95171 86782 59690 65710 78741 71695 53666 44693 56046 61027 45813 58707 72296
$$ packed form
13450G4514q059j3266L884r45J3065K2030l6138l0280k73J6271K4026J10p363
13437E7576j6380q384J4235j1642k0575o211J9922N678j0067k450L241K7829P398
13424F0170L421l301j9871O010Q192k097j4031J5347Q813l922O036P856J436J016
13410G5075m716r570J2632O093j5377J661p101J1377L450r480j6058O822K2701
13397G7509P786J0213j292k4519l093r709k1884l582J1449p89j2961R34J1828
13384D1890j5068M611J7796J733l589P790j2096p466K0646J0720j1425p740J6899
13371F4701J8013o634k2087O448J7509J3995j0724l08l544P240J3702j2312n554
13358H0445J4726q389k7092O020J3031p046j8029q973J1353M981j5214J2894J3589
$$ plain form
13345 72296 65823 71107 88323 113506 135322 137850 142597 142786 128514 143777 163534 163718 148889
13332 148889 136064 154994 195608 229804 265363 301928 364971 446242 540857 705862 981980
13321 981980 1391548 1945761 2449952 2727210 2643742 2251014 1743584 1265088 919278 689920
13311 689920 533417 431528 347872 283207 236755 201510 171754 148063 135230 119805 108348
13300 108348 111269 118660 106071 87031 94442 87826 72616 83416 96312 92225 92038 91371 92547
13287 92547 92413 129274 157978 184085 228429 291996 358120 406905 430847 386325 315162 262019
13275 262019 217344 159072 125958 131881 132838 133384 137301 158137 179570 195272 174327 151556 128530
13262 128530 124729 135554 128683 138815 152753 148480 136347 117568 138165 137186 123715 120532 104022
$$ packed form
13345G2296o473N284J7216K5183K1816K528M747J89j4272J5263J9757J84j4829
13332A48889j2825J8930M0614L4196L5559L6565O3043Q1271R4615J65005K76118
13321I81980M09568N54213N04191K77258q3468l92728n07430m78496l45810k29358
13311F89920j56503j01889q3656o4665m6452l5245k9756k3691j2833j5425j1457
13300A08348K921P391j2589j9040P411o616j5210J0800J2896m087j87o67J176
13287I2547j34L6861K8704K6107M4344O3567O6124M8785K3942m4522p1163n3143
13275B62019m4675n8272l3114N923R57N46L917K0836K1433J5702k0945k2771k3026
13262A28530l801J0825o871J0132J3938m273j2133j8779K0597r79j3471l183j6510
$$ plain form
13249 104022 81798 75994 83050 83347 69363 49036 53197 55339 64833 68242 56371 59709 78223
13236 78223 70989 64903 64019 56186 53790 62336 84586 88591 72907 56596 69418 88116 86337
13223 86337 82628 81628 80425 96538 120600 128429 126707 106163 98174 104753 104260 96349 91740 108246
13209 108246 119410 133046 126651 127779 127054 131464 126597 123037 114452 95436 110272 119567 109682
13196 109682 100514 98426 95546 65515 48796 28151 25315 19451 -2246 18457 68583 80354
13184 80354 85861 97433 101183 107527 110647 87791 93166 109212 115543 119761 109646 115276 127781
13171 127781 135549 128645 116794 106804 93620 91719 77584 62121 80251 84502 71842 57705
13159 57705 67645 94574 121114 120200 121918 121566 108629 105567 104353 108397 120079 136523 137789 127715
$$ packed form
13249A04022k2224n804P056K97j3984k0327M161K142R494L409j1871L338J8514
13236G8223p234o086q84p833k396Q546K2250M005j5684j6311J2822J8698j779
13223H6337l709j000j203J6113K4062P829j722k0544p989O579m93p911m609J6506
13209A08246J1164J3636o395J128p25M410m867l560q585j9016J4836R295r885
13196A09682r168k088k880l0031j6719k0645k836n864k1697K0703N0126J1771
13184H0354N507J1572L750O344L120k2856N375J6046O331M218j0115N630J2505
13171A27781P768o904j1851r990j3184j901j4135j5463J8130M251j2660j4137
13159E7705R940K6929K6540r14J718l52j2937l062j214M044J1682J6444J266j0074
$$ plain form
13145 127715 122447 130520 143430 161721 189541 204203 223311 247124 275080 305817 347013 392854
13133 392854 374786 307893 261144 236288 211508 173088 145716 138649 129974 136962 137200 142771 151446
13120 151446 154278 142244 130695 110597 116757 119041 121030 135232 143084 132978 116250 112378 107328
13107 107328 122604 143416 167554 155329 139993 133092 147354 154416 168925 179588 185415 211993
13095 211993 226022 227459 220152 221429 202302 188843 161701 119450 88813 56022 39346 54189
13083 54189 43668 22461 16226 35535 81508 142224 182623 203714 230713 279216 311471 342055
13071 342055 351229 343198 314113 292475 298247 289918 281618 273407 294606 303261 311199 317350 314613
13058 314613 311032 300199 287374 296294 302670 304431 314543 326132 357190 410886 467914 508693
$$ packed form
13145A27715n268Q073J2910J8291K7820J4662J9108K3813K7956L0737M1196M5841
13133C92854j8068o6893m6749k4856k4780l8420k7372p067q675O988K38N571Q675
13120A51446K832j2034j1549k0098O160K284J989J4202P852j0106j6728l872n050
13107A07328J5276K0812K4138j2225j5336o901J4262P062J4509J0663N827K6578
13095B11993J4029J437p307J277j9127j3459k7142m2251l0637l2791j6676J4843
13083E4189j0521k1207o235J9309M5973O0716M0399K1091K6999M8503L2255L0584
13071C42055R174q031k9085k1638N772q329q300q211K1199Q655P938O151k737
13058C14613l581j0833j2825Q920O376J761J0112J1589L1058N3696N7028M0779
$$ plain form
13046 508693 531338 554459 532725 504730 501831 511734 505487 515036 553760 618734 717628 826427
13034 826427 876435 864386 802574 691145 607554 531372 471838 455898 480186 480091 471736 467631
13022 467631 483810 493855 517319 545740 589326 634692 682706 746283 822271 912944 982857
13011 982857 1038858 1026657 953034 831576 661899 457846 253473 88299 28180 2569
13001 2569 -20542 -17610 -25004 -28254 -18921 24152 48240 64087 98853 151653 160440 141132 138407
12988 138407 161177 181123 204049 240007 240172 241252 238253 245037 261173 279494 284735 304437 340297
12975 340297 367559 378334 400270 417506 413400 402841 406458 409659 416603 424498 440725 451426
12963 451426 466199 489480 504451 484503 488314 490700 489794 487115 515747 537146 526833 531709 565954
$$ packed form
13046E08693K2645K3121k1734k7995k899R903o247R549L8724O4974R8894J08799
13034H26427N0008j2049o1812j11429q3591p6182n9534j5940K4288r5q355m105
13022D67631J6179J0045K3464K8421M3586M5366M8014O3577P5988R0673O9913
13011I82857N6001j2201p3623j21458j69677k04053k04373j65174o0119k5611
13001B569k3111K932p394l250R333M3073K4088J5847L4766N2800Q787j9308k725
12988A38407K2770J9946K2926L5958J65J080k999O784J6136J8321N241J9702L5860
12975C40297K7262J0775K1936J7236m106j0559L617L201O944P895J6227J0701
12963D51426J4773K3281J4971j9948L811K386r06k679K8632K1399j0313M876L4245
$$ plain form
12950 565954 616097 637529 649979 687033 712233 742156 772128 784565 799770 829594 865349
12939 865349 898026 916400 946215 980516 1008887 1040237 1080837 1145494 1205287 1298745 1395379
12928 1395379 1493211 1609217 1701131 1815074 1949894 2080419 2202849 2325094 2429211 2576330
12918 2576330 2732947 2891018 3077319 3254124 3408412 3552530 3703327 3869509 4129387
12909 4129387 4473233 4881933 5372521 5932055 6556312 7243381 8041684 8966786 10028948
12900 10028948 11229186 12620374 14227579 16083898 18223448 20750575 23808023 27538142
12892 27538142 32099631 37701825 44704780 53706423 65573666 82031021 106701497 146363445
12884 146363445 211236119 306761224 417738346 505208330 533044769 492888174 403263307
$$ packed form
12950E65954N0143K1432J2450L7054K5200K9923K9972J2437J5205K9824L5755
12939H65349L2677J8374K9815L4301K8371L1350M0600O4657N9793R3458R6634
12928A395379R7832J16006R1914J13943J34820J30525J22430J22245J04117J47119
12918B576330J56617J58071J86301J76805J54288J44118J50797J66182K59878
12909D129387L43846M08700M90588N59534O24257O87069P98303R25102J062162
12900A0028948J200238J391188J607205J856319K139550K527127L057448L730119
12892B7538142M561489N602194P002955R001643J1867243J6457355K4670476L9661948
12884A46363445O4872674R5525105J10977122Q7469984K7836439m0156595q9624867
$$ plain form
12877 403263307 298727655 209511972 146267909 104782009 77369581 58551592 45168856
12870 45168856 35456700 28417197 23322666 19575352 16692974 14351476 12404880 10769460
12862 10769460 9446651 8396238 7548405 6845904 6251146 5734513 5280126 4884844 4546504
12853 4546504 4249209 4005504 3765265 3483634 3190080 2889937 2624353 2436436 2291647
12844 2291647 2165155 2046173 1943728 1855101 1762277 1673644 1593333 1532917 1470916 1430882 1409716
12833 1409716 1405711 1393255 1363509 1348944 1334373 1321143 1298103 1263770 1215751 1173928 1137469
12822 1137469 1109029 1107029 1064177 1038112 1016268 962961 910097 879385 861903 843010 814842
12811 814842 788131 769333 758401 736587 730938 708376 674457 666078 657407 645590 614455 565328
$$ packed form
12877D03263307j04535652q9215683o3244063m1485900k7412428j8817989j3382736
12870D5168856r712156p039503n094531l747314k882378k341498j946596j635420
12862A0769460j322809j050413q47833p02501n94758n16633m54387l95282l38340
12853D546504k97295k43705k40239k81631k93554l00143k65584j87917j44789
12844B291647j26492j18982j02445q8627r2824q8633q0311o0416o2001m0034k1166
12833A409716m005j2456k9746j4565j4571j3230k3040l4333m8019m1823l6459
12822A137469k8440k000m2852k6065k1844n3307n2864l0712j7482j8893k8168
12811H14842k6711j8798j0932k1814n649k2562l3919q379q671j1817l1135m9127
$$ plain form
12799 565328 537300 521436 519307 511310 505058 502221 510943 501856 491793 472262 464340 461489 453992
12786 453992 444074 431660 437965 427899 423209 443753 455245 456284 469330 469226 491954 521258 558513
12773 558513 582461 571070 531478 522080 523562 546601 545635 565189 587055 609417 625825 646695
12761 646695 673432 686501 690156 728353 782129 807006 734934 572815 334257 106835 -86995
12750 -86995 -180981 -193937 -176462 -144010 -101242 -81523 -49656 -34358 -19226 -34719 -16725 15246
12738 15246 33756 36550 27823 22776 23765 31413 40997 48464 34797 3856 9908 11775 -121 -36303
12724 -36303 -59858 -56214 -25924 -28345 -40190 -31373 -18627 9322 23855 29509 47043 53399 66854
12711 66854 88258 115575 141367 148609 137809 124872 114128 108661 78488 69620 54217 17930
$$ packed form
12799E65328k8028j5864k129p997o252k837Q722r087j0063j9531p922k851p497
12786D53992r918j2414O305j0066m690K0544J1492J039J3046j04K2728K9304L7255
12773E58513K3948j1391l9592r398J482K3039r66J9554K1866K2362J6408K0870
12761F46695K6737J3069L655L8197N3776K4877p2072j62119k38558k27422j93830
12750h6995r3986j2956J7475L2452M2768J9719L1867J5298J5132j5493J7994L1971
12738A5246J8510K794q727n047R89P648R584P467j3667l0941O052J867j1896l6182
12724c6303k3555L644L0290k421j1845Q817J2746K7949J4533N654J7534O356J3455
12711F6854K1404K7317K5792P242j0800j2937j0744n467l0173q868j5403l6287
$$ plain form
12699 17930 -1040 1040 11538 15282 13486 16570 17395 2460 -11425 -28344 -18200 -7581 15995
12686 15995 32317 46332 66507 103147 143392 191647 248762 277675 270827 268447 257352 244496
12674 244496 227633 205911 188987 133474 91193 77001 59900 29034 -3826 -17687 -24760 -34257
12662 -34257 -33169 -14814 -7956 -2722 26580 35734 2895 22206 55293 67391 64967 55408 75537
12649 75537 76914 83956 87964 87988 97486 84270 85175 71976 62548 65134 58740 49291 41094 57246
12635 57246 82595 103240 121612 123174 124249 117512 121060 133006 127326 106192 60376 48421 61098
12622 61098 71105 72986 67100 44775 44668 50429 53936 63736 90880 97219 75780 60021 63390
12609 63390 48307 30183 45774 53068 45885 42802 52258 46235 41499 46213 68028 96680 92518
$$ packed form
12699A7930j8970K080J0498L744j796L084Q25j4935j3885j6919J0144J0619K3576
12686A5995J6322J4015K0175L6640M0245M8255N7115K8913o848k380j1095j2856
12674B44496j6863k1722j6924n5513m2281j4192j7101l0866l2860j3861p073r497
12662c4257J088J8355O858N234K9302R154l2839J9311L3087J2098k424r559K0129
12649G5537J377P042M008K4R498j3216R05j3199r428K586o394r449q197J6152
12635E7246K5349K0645J8372J562J075o737L548J1946n680k1134m5816j1955J2677
12622F1098J0007J881n886k2325j07N761L507R800K7144O339k1439j5759L369
12609F3390j5083j8124J5591P294p183l083R456o023m736M714K1815K8652m162
$$ plain form
12596 92518 80495 75303 70287 58137 43741 32256 23760 20224 28832 9423 8856 16953 34704
12583 34704 38378 44051 41597 57500 64448 43852 55619 83265 106162 125997 115081 130718
12571 130718 120237 91340 83565 95958 97465 91535 76973 51789 52476 63435 84718 76484 41152
12558 41152 8853 -6971 -395 8995 8583 1965 427 16126 25957 39255 53403 57049 64675
12545 64675 58387 56850 49025 59768 47997 48105 57216 44368 44264 41218 21176 -3508 2330 17902
12531 17902 38220 39616 28355 10146 14257 47710 67932 62224 56568 30313 23274 36749 50162
12518 50162 66818 68689 64408 78926 87838 73481 62491 46135 41079 30552 21583 23135 16733
12505 16733 21626 39077 78419 63191 47629 56941 66463 55925 63728 96365 101285 95051 95289
$$ packed form
12596I2518j2023n192n016j2150j4396j1485q496l536Q608j9409n67Q097J7751
12583C4704L674N673k454J5903O948k0596J1767K7646K2897J9835j0916J5637
12571A30718j0481k8897p775J2393J507n930j4562k5184O87J0959K1283q234l5332
12558D1152l2299j5824O576R390m12o618j538J5699R831J3298J4148L646P626
12545F4675o288j537p825J0743j1771J08R111j2848j04l046k0042k4684N838J5572
12531A7902K0318J396j1261j8209M111L3453K0222n708n656k6255p039J3475J3413
12518E0162J6656J871m281J4518Q912j4357j0990j6356n056j0527q969J552o402
12505A6733M893J7451L9342j5228j5562R312R522j0538P803L2637M920o234K38
$$ plain form
12492 95289 90675 78358 69024 57541 48170 64357 99434 106665 103841 103497 115316 112062 119362
12479 119362 119692 116172 117789 134393 144352 156298 164312 164043 173388 210027 261187 283058 316841
12466 316841 372669 421565 456305 481318 492538 509963 500687 473565 436947 415799 393439 399965
12454 399965 411902 413710 426279 455682 476031 528660 581973 628294 688307 761882 835039 913554
12442 913554 1020953 1193917 1485360 1933983 2504622 3035603 3305239 3223985 2867890 2387086
12432 2387086 1921236 1595516 1399798 1307573 1276220 1278604 1268084 1220144 1168592 1112606 1045465
12421 1045465 955250 878149 830242 795793 756171 704081 667984 641702 594883 563082 545809
12410 545809 542836 546912 537471 508261 511587 498410 464418 431715 420425 406551 389525 373734
$$ packed form
12492I5289m614j2317r334j1483r371J6187L5077P231k824l44J1819l254P300
12479A19362L30l520J617J6604R959J1946Q014k69R345L6639N1160K1871L3783
12466C16841N5828M8896L4740K5013J1220J7425r276k7122l6618k1148k2360O526
12454C99965J1937J808J2569K9403K0349N2629N3313M6321O0013P3575P3157P8515
12442I13554J07399J72964K91443M48623N70639N30981K69636q1254l56095m80804
12432B387086m65850l25720j95718r2225l1353K384j0520m7940n1552n5986o7141
12421A045465r0215p7101m7907l4449l9622n2090l6097k6282m6819l1801j7273
12410E45809k973M076r441k9210L326j3177l3992l2703j1290j3874j7026j5791
$$ plain form
12398 373734 371180 376708 405651 406492 403046 407142 435126 464927 487522 508689 507023 462837 427531
12385 427531 373549 332141 289948 263138 238580 211650 182093 158844 124032 96444 99595 108332
12373 108332 97866 92545 85239 75133 75003 88741 84765 84182 74505 71178 86145 92059 59411
12360 59411 35566 27330 10815 21192 49431 66431 57133 49800 60714 54556 40356 23393
12348 23393 15607 11851 20532 33069 32738 19076 13914 20130 22723 19960 31462 25906 2604 8923
12334 8923 7386 10195 15264 6678 22 14791 32812 43266 59089 56255 56970 43019 52317 40200
12320 40200 8452 -8960 -10347 -9211 -308 10900 41 -11788 -574 6157 4543 7175 3873
12307 3873 11690 -6775 -9839 -12050 -242 3132 1087 10846 18979 19771 4451 -6230 -5975 -13560
$$ packed form
12398C73734k554N528K8943Q41l446M096K7984K9801K2595K1167j666m4186l5306
12385D27531n3982m1408m2193k6810k4558k6930k9557k3249l4812k7588L151Q737
12373A08332j0466n321p306j0106j30J3738l976n83r677l327J4967N914l2648
12360E9411k3845q236j6515J0377K8239J7000r298p333J0914o158j4200j6963
12348B3393p786l756Q681J2537l31j3662n162O216K593k763J1502n556k3302O319
12334H923j537K809N069q586o656J4769J8021J0454J5823k834P15j3951R298j2117
12320D0200l1748j7412j387J136Q903J1208j0859j1829J1214O731j614K632l302
12307C873P817j8465l064k211J1808L374k045R759Q133P92j5320j0681K55p585
$$ plain form
12293 -13560 -5924 3068 -15857 -15684 -3186 5700 -16375 -23397 -21440 -17067 -11112 -5091 0 -9559
12279 -9559 -11504 -17221 -23976 -14421 -11870 -21206 -21061 -14217 -10489 -19494 -1603 10776 5959 5791 9886
12264 9886 22454 25109 25065 13674 -2526 -8393 -18466 -7414 -10604 -34015 -18895 9917 9618
12251 9618 -17157 -22517 2286 8168 -9768 -3883 -1709 -17165 -7077 -7105 -13313 13420 45993
12238 45993 53950 26800 -9517 -22151 -23865 -29721 -28971 -21435 -31790 -37004 -31281 -8129 -7694 -4313
12224 -4313 24596 22800 12584 -7016 -801 12265 23227 24445 30360 18595 14166 7439 -1089
12211 -1089 -13987 -38116 -43402 -21693 -30267 -18254 3773 16786 10605 -14807 -26664 -21718 -32274
12198 -32274 -14088 -4673 -8276 -4508 -7416 278 5917 -12292 -11250 -10900 -19498 -27814 -19664 -21465
$$ packed form
12293a3560P636Q992j8925J73J2498Q886k2075p022J957M373N955O021N091r559
12279i559j945n717o755R555K551r336J45O844L728r005J7891J2379m817j68M095
12264I886J2568K655m4j1391j6200n867j0073J1052l190k3411J5120K8812k99
12251I618k6775n360K4803N882j7936N885K174j5456J0088k8o208K6733L2573
12238D5993P957k7150l6317j2634j714n856P50P536j0355n214N723K3152M35L381
12224d313K8909j796j0216j9600O215J3066J0962J218N915j1765m429o727q528
12211a089j2898k4129n286K1709q574J2013K2027J3013o181k5412j1857M946j0556
12198c2274J8186R415l603L768k908P694N639j8209J042L50q598q316Q150j801
$$ plain form
12184 -21465 -15473 -4515 -377 10807 9503 228 -4491 -12298 -6288 -1278 -13791 -30023 -36734
12171 -36734 -17945 -11 11177 13147 13233 19798 12998 765 -4177 -11811 -15555 -17790 -17152 -11780
12157 -11780 3507 12720 5804 4038 -16490 -12685 -12471 -12772 -15923 -25170 -34984 -29731 -33703 -53395
12143 -53395 -46847 -32368 -23880 -19673 -18581 -29684 -36381 -21056 -9643 -6944 -5782 -30877 -41581
12130 -41581 -38327 -23815 1511 20523 37927 29682 14984 -4675 -18724 -13947 -20674 -25684 -23920
12117 -23920 -19488 -25423 -30033 -17519 -13782 -18296 -32194 -31357 -18158 3492 -9664 -21449 -38616
12104 -38616 -36875 -24447 -25467 -21594 -15986 -11963 -15081 -463 4482 5771 7324 5788 2757 -2923
12090 -2923 -4179 -20183 -20737 -10665 -12495 -18057 -33727 -20953 -10273 -521 19326 23082 18477
$$ packed form
12184b1465N992J0958M138J1184j304r275m719p807O010N010j2513j6232o711
12171c6734J8789J7934J1188J970Q6O565o800j2233m942p634l744k235O38N372
12157a1780J5287R213o916j766k0528L805K14l01l151r247r814N253l972j9692
12143e3395O548J4479Q488M207J092j1103o697J5325J1413K699J162k5095j0704
12130d1581L254J4512K5326J9012J7404q245j4698j9659j4049M777o727n010J764
12117b3920M432n935m610J2514L737m514j3898Q37J3199K1650j3156j1785j7167
12104c8616J741J2428j020L873N608M023l118J4618M945J289J553j536l031n680
12090b923j256j6004n54J0072j830n562j5670J2774J0680R752J9847L756m605
$$ plain form
12077 18477 6511 -757 721 19709 22394 9697 -2296 11029 7760 -5407 -12051 -15688 -17615
12064 -17615 -31726 -47195 -37398 -21201 1080 6023 7803 7783 6973 11239 5775 -477 7668 17936
12050 17936 17213 10126 8566 9346 2305 -29175 -27996 -27439 -33691 -24445 -12975 -3511 5188 -5959
12036 -5959 -7391 4849 -4721 -7989 -23088 -20780 -15749 -10262 242 28082 27047 18541 -8895
12023 -8895 -31519 -20910 -7859 5853 -2493 1293 5251 7256 3406 -424 4850 10520 -4893
12010 -4893 -8682 -5741 -13216 -21426 -4341 4627 -4167 -17260 -26463 -36501 -31814 -29228 -8717 4502
11996 4502 1219 -2622 -17655 -6562 -7913 -10609 20910 16396 7597 -16456 -30364 -15389 -1008
11983 -1008 2506 -5017 -17502 -8303 -8657 -15138 -4368 7100 4412 6886 5076 15962 7892 178
$$ packed form
12077A8477j1966p268J478J8988K685j2697j1993J3325l269j3167o644l637j927
12064a7615j4111j5469R797J6197K2281M943J780k0q10M266n464o252Q145J0268
12050A7936p23p087j560P80p041l1480J179N57o252R246J1470R464Q699j1147
12036e959j432J2240r570l268j5099K308N031N487J0504K7840j035q506k7436
12023h895k2624J0609J3051J3712q346L786L958K005l850l830N274N670j5413
12010d893l789K941p475q210J7085Q968q794j3093r203j0038M687K586K0511J3219
11996D502l283l841j5033J1093j351k696L1519m514q799k4053j3908J4975J4381
11983a008L514p523j2485R199l54o481J0770J1468k688K474j810J0886q070p714
$$ plain form
11969 178 -2298 -9363 -37076 -27079 -18337 5736 17499 19306 2053 -7653 6040 5573 3934 8133
11955 8133 5978 -1894 -7515 9817 11027 13406 16481 18231 11748 -20554 -34512 -25729 -8579 -6864
11941 -6864 -14477 -26436 -20019 -33394 -22338 -7007 13317 8625 -11186 -18156 -11109 -13261 -5047
11928 -5047 3693 -3472 12731 17304 -1741 -27794 -28975 -19344 -31977 -36879 -19618 -12660 -15903
11915 -15903 -8752 2201 -659 -17131 -4654 -11279 -9040 -14254 -14200 -2584 7430 4442 -15176
11902 -15176 -9227 6771 -1880 -7524 236 13347 4085 7080 19594 29700 44687 26049 27017
11889 27017 40020 19686 8554 22415 13350 23671 17869 20862 23693 30070 40739 35529 22103
11876 22103 16163 21559 20806 10296 -5949 -10061 -4356 8636 14293 27545 35980 43060 29908
$$ packed form
11969A78k476p065k7713R997Q742K4073J1763J807j7253r706J3693m67j639M199
11955H133k155p872n621J7332J210K379L075J750o483l2302j3958Q783J7150J715
11941f864p613j1959O417j3375J1056J5331K0324m692j9811o970P047k152Q214
11928e047Q740p165J6203M573j9045k6053j181R631j2633m902J7261O958l243
11915a5903P151J0953k860j6472J2477o625K239n214N4J1616J0014k988j9618
11902a5176N949J5998q651n644P760J3111r262K995J2514J0106J4987j8638R68
11889B7017J3003k0334j1132J3861r065J0321n802K993K831O377J0669n210j3426
11876B2103n940N396p53j0510j6245m112N705J2992N657J3252Q435P080j3152
$$ plain form
11863 29908 33173 18024 3775 15935 26081 19626 16377 -6806 -22639 -8162 -2201 6188 -12169
11850 -12169 -14307 -14017 1966 2593 -10127 -23853 -23089 -34071 -31296 -28699 -14528 791 6278 29410
11836 29410 32742 21252 15704 13332 585 -11219 -24002 -20585 -26684 -21550 -6737 14780 11446
11823 11446 16566 33594 35050 22798 14153 -2761 -9999 -23383 -14441 14527 18125 341 -13058
11810 -13058 -19536 -15510 -14628 -13785 -12203 -15231 -16116 -18195 -23949 -14407 1338 33777 35610 18464
11796 18464 8014 3413 10975 -3641 -8744 -4384 27595 37793 22306 8487 -3416 -6107 -773
11783 -773 3185 -8741 -15219 -15178 -3111 2949 170 6778 6017 9842 132 -16789 4047 18409
11769 18409 30741 30846 19194 21426 17056 -585 -17779 -10043 -4270 -851 1862 -16921 -26467
$$ packed form
11863B9908L265j5149j4249J2160J0146o455l249k3183j5833J4477N961Q389j8357
11850a2169k138K90J5983O27j2720j3726P64j0982K775K597J4171J5319N487K3132
11836B9410L332j1490n548k372j2747j1804j2783L417o099N134J4813K1517l334
11823A1446N120J7028J456j2252q645j6914p238j3384Q942K8968L598j7784j3399
11810a3058o478M026Q82Q43J582l028q85k079n754R542J5745L2439J833j7146
11796A8464j0450m601P562j4616n103M360L1979J0198j5487j3819j1903k691N334
11783g73L958j1926o478M1J2067O060k779O608p61L825r710j6921K0836J4362
11769A8409J2332J05j1652K232m370j7641j7194P736N773L419K713j8783r546
$$ plain form
11756 -26467 -21327 12356 26473 20228 24039 23515 24069 11325 7011 27844 47542 55548 16840
11743 16840 -11956 -39248 -38807 -16367 -4677 -3978 -10552 -5197 5258 -5606 -19488 -24552 -13749
11730 -13749 11632 26175 18367 11157 10823 32480 32619 33611 17466 5912 9321 -11712 -21939
11717 -21939 -11676 984 4825 -13507 -27460 -22902 -21728 -14864 -6468 6621 -6370 10610 15093
11704 15093 4911 -2259 -15236 -20115 -27481 -32096 -29596 -31069 -31077 -13056 -2594 1226 -13410 -44517
11690 -44517 -23914 2702 16884 24902 8338 -9921 -17085 -8248 -6171 18402 39243 34442 36235
11677 36235 41351 33600 30738 31051 24236 22567 21974 34244 24712 3638 -11196 -12338 -4948 2251
11663 2251 6986 -5355 1110 7201 434 4941 18533 18526 15142 10191 25848 37043 39023 49876
$$ packed form
11756b6467N140L3683J4117o245L811n24N54j2744m314K0833J9698Q006l8708
11743A6840k8796k7292M41K2440J1690O99o574N355J0455j0864j3882n064J0803
11730a3749K5381J4543p808p210l34K1657J39R92j6145j1554L409k1033j0227
11717b1939J0263J2660L841j8332j3953M558J174O864Q396J3089j2991J6980M483
11704A5093j0182p170j2977m879p366m615K500j473qJ8021J0462L820j4636l1107
11690d4517K0603K6616J4182Q018j6564j8259p164Q837K077K4573K0841m801J793
11677C6235N116p751k862L13o815j669n93J2270r532k1074j4834j142P390P199
11663B251M735j2341O465O091o767M507J3592pl384m951J5657J1195J980J0853
$$ plain form
11649 49876 39496 28653 17752 -958 -5320 -6224 -18975 -28747 -18581 -23537 -21127 -27848 -34472
11636 -34472 -27478 -25208 -35073 -39023 -32090 -41734 -50834 -51957 -38838 -36447 -27083 -15480 -8591 2855
11622 2855 -3117 13511 38690 21776 14949 11235 11383 35347 23368 3152 2417 6577 25907
11609 25907 37764 24162 10524 11052 19885 29710 12929 -392 10587 12288 26963 19716 21149
11596 21149 25063 29775 18547 14400 17489 20832 13624 16531 17611 10341 10877 10261 -242 -18250
11582 -18250 -18375 -29567 -35099 -31132 -16534 -5250 -12772 -1348 1196 -13239 -37977 -31978 -29794
11569 -29794 -18991 6422 12786 1170 -17333 -4422 -3965 -9477 -24147 -24141 7049 9449 25649
11556 25649 32296 28769 37402 19185 11775 17112 -3127 -13286 -20766 -26584 -35112 -10738 754
$$ packed form
11649D9876j0380j0843j0901j8710m362r04j2751r772J0166m956K410o721o624
11636c4472O994K270r865l950O933r644r100j123J3119K391R364J1603O889J1446
11622B855n972J6628K5179j6914o827l714J48K3964j1979k0216p35M160J9330
11609B5907J1857j3602j3638N28Q833R825j6781j3321J0979J701J4675p247J433
11596B1149L914M712j1228m147L089L343p208K907J080p270N36o16j0503j8008
11582a8250j25j1192n532L967J4598J1284p522J1424K544j4435k4738N999K184
11569b9794J0803K5413O364j1616j8503J2911M57n512j4670OL1190K400J6200
11556B5649O647l527Q633j8217p410N337k0239j0159p480n818q528K4374J1492
$$ plain form
11543 754 20337 22344 10757 1057 859 -1405 4863 25741 46417 30572 28988 28804 19822 28333
11529 28333 32176 31899 29727 27592 18657 12479 11816 -5064 -22761 -14671 -16557 -24628 -24787 -7526
11515 -7526 3549 1890 -5270 -12022 -2444 3206 -1255 17121 26876 25346 8458 -8411 -19586
11502 -19586 -4317 -5268 -13939 -2278 10544 -1060 -4090 -8293 -4261 19206 30278 32970 22609
11489 22609 20664 30991 9786 4225 7143 9993 -14409 -13602 11017 15132 26616 32105 30823
11476 30823 23539 3902 -18457 -9633 -8543 241 8906 -290 -21070 -22024 -4734 1280 3375 -4698
11462 -4698 -10020 15353 13501 9390 11529 -2587 6067 8722 -2433 -4542 -3505 2856 13493 32777
11448 32777 30859 29573 25980 13006 5629 22410 31545 28479 24798 11347 -13082 5299 22615
$$ packed form
11543G54J9583K007j1587r700j98k264O268K0878K0676j5845j584j84q982Q511
11529B8333L843k77k172k135q935o178o63j6880j7697Q090j886q071j59J7261
11515g526J1075j659p160o752R578N650m461J8376R755j530j6888j6869j1175
11502a9586J5269r51q671J1661J2822j1604l030m203M032K3467J1072K692j0361
11489B2609j945J0327k1205n561K918K850k4402Q07K4619M115J1484N489j282
11476C0823p284j9637k2359Q824J090Q784Q665r196k0780r54J7290O014K095q073
11462d698n322K5373j852m111K139j4116Q654K655j1155k109J037O361J0637J9284
11448C2777j918j286l593j2974p377J6781R135l066l681j3451k4429J8381J7316
$$ plain form
11435 22615 2701 423 19552 36495 49713 58006 28600 12411 13843 29803 38172 36087 52763
11422 52763 44524 44448 51260 52956 48451 41039 47492 55267 53329 46399 43653 59272 64220 55518 49600
11407 49600 53798 45974 44925 45805 49728 42294 35546 28826 33548 52532 43291 54232 69605 68200
11393 68200 63452 52406 58072 52262 44174 54820 47092 31456 34329 53709 66474 68942 61205
11380 61205 60150 71050 87630 78133 74403 70944 63814 79786 91686 97069 100313 97318 94391
11367 94391 95192 83870 68605 35111 23201 14308 24288 36969 50494 49481 47879 66835 72150
11354 72150 82246 79806 83008 84361 87727 102768 101031 88003 60609 57994 84486 84892 84399 74462
11340 74462 84151 79505 86551 94900 104652 116215 119436 112552 107696 102128 97381 96953 105210 101210
$$ packed form
11435B2615j9914k278J9129J6943J3218Q293k9406j6189J432J5960Q369k085J6676
11422E2763q239p6O812J696m505p412O453P775j938o930k746J5619M948q702n918
11407D9600M198p824j049Q80L923p434o748o720M722J8984r241J0941J5373j405
11393F8200m748j1046N666n810q088J0646p728j5636K873J9380J2765K468p737
11380F1205j055J0900J6580r497l730l459p130J5972J1900N383L244k995k927
11367I4391Q01j1322j5265l3494j1910q893R980J2681J3525j013j602J8956N315
11354G2150J0096k440L202J353L366J5041j737j3028k7394k615K6492M06m93r937
11340G4462R689m646P046Q349R752J1563L221o884m856n568m747m28Q257m000
$$ plain form
11326 101210 77943 80847 82870 69837 71415 74407 70306 88867 100063 85878 86831 116517 128381
11313 128381 132901 136261 142960 155055 160062 151300 154120 143044 139065 134825 124826 133137 131832 142727
11299 142727 159502 146478 143096 165039 168324 162598 158759 144316 157532 171631 150128 153432
11287 153432 162811 172139 171831 163267 155495 159258 159518 145324 144653 151650 165636 159956 168973 162289
11273 162289 148801 135435 155013 174919 161522 148703 174487 180419 154647 155154 166149 176512
11261 176512 201400 214265 207310 227255 221920 220109 231671 225186 233441 234052 260226 280923 269961
11248 269961 260475 253282 247038 247408 253661 253215 242243 234261 243345 245210 247135 221143 209057 204504
11234 204504 201977 205185 208509 238275 247484 250034 269059 288379 294810 302917 297640 286626 303882
$$ packed form
11326A01210k3267K904K023j3033J578K992m101J8561J1196j4185R53K9686J1864
11313A28381M520L360O699J2095N007q762K820j1076l979m240r999Q311j305J0895
11299A42727J6775j3024l382K1943L285n726l839j4443J3216J4099k1503L304
11287A53432R379R328l08q564p772L763K60j4194o71O997J3986n680R017o684
11273A62289j3488j3366J9578J9906j3397j2819K5784N932k5772N07J0995J0363
11261A76512K4888J2865o955J9945n335j811J1562o485Q255O11K6174K0697j0962
11248B69961r486p193o244L70O253m46j0972p982R084J865J925k5992j2086m553
11234B04504k527L208L324K9766R209K550J9025J9320O431Q107n277j1014J7256
$$ plain form
11221 303882 319613 330749 339160 331084 346858 355377 359657 393151 428522 415487 401473 407455
11209 407455 427568 443408 455439 489222 532189 545470 557255 561301 562693 594037 637598 652063
11197 652063 674682 715716 764339 789977 823866 886061 939134 993045 1049340 1088081 1154269
11186 1154269 1204714 1270294 1367885 1471417 1567410 1672435 1807152 1950244 2114613 2308462
11176 2308462 2528260 2755454 3014817 3305847 3649935 4041546 4473273 4971256 5572700
11167 5572700 6252585 7045390 7949727 9031745 10264471 11627232 13124025 14694202 16223156
11158 16223156 17570280 18586056 19130512 19159903 18692784 17817692 16698904 15490563 14273086
11149 14273086 13149914 12125914 11204958 10414115 9775425 9307320 8929124 8643613 8481173
$$ packed form
11221C03882J5731J1136Q411q076J5774Q519M280L3494L5371j3035j4014N982
11209D07455K0113J5840J2031L3783M2967J3281J1785M046J392L1344M3561J4465
11197F52063K2619M1034M8623K5638L3889O2195N3073N3911N6295L8741O6188
11186A154269N0445O5580R7591J03532R5993J05025J34717J43092J64369J93849
11176B308462K19798K27194K59363K91030L44088L91611M31727M97983O01444
11167E572700O79885P92805R04337J082018J232726J362761J496793J570177J528954
11158A6223156J347124J015776N44456K9391m67119q75092j118788j208341j217477
11149A4273086j123172j024000r20956p90843o38690m68105l78196k85511j62440
$$ plain form
11140 8481173 8402324 8401886 8489208 8651415 8908495 9262846 9726951 10302750 11020532 11873242
11130 11873242 12896255 14144342 15626211 17393391 19515072 22012976 24908726 28178880
11122 28178880 31676752 35158447 38179569 40233310 40949726 40173137 38077623 35032707
11114 35032707 31520821 27959067 24587466 21551282 18937772 16732627 14882559 13360155
11106 13360155 12099645 11079851 10265694 9588137 9028067 8570892 8235180 7997741 7849378
11097 7849378 7783544 7799644 7889046 8039163 8301251 8648233 9069542 9601668 10231468 10972587
11087 10972587 11857131 12851227 13902855 14986379 16043182 16904399 17446028 17561838 17195682
11078 17195682 16375152 15209667 13855172 12396524 10977784 9659916 8459606 7422250
$$ packed form
11140H481173p8849m38Q7322J62207K57080L54351M64105N75799P17782Q52710
11130A1873242J023013J248087J481869J767180K121681K497904K895750L270154
11122B8178880L497872L481695L021122K053741P16416p76589k095514l044916
11114C5032707l511886l561754l371601l036184k613510k205145j850068j522404
11106A3360155j260510j019794q14157o77557n60070m57175l35712k37439j48363
11097G849378o5834J6100Q9402J50117K62088L46982M21309N32126O29800P41119
11087A0972587Q84544R94096J051628J083524J056803Q61217N41629J15810l66156
11078A7195682q20530j165485j354495j458648j418740j317868j200310j037356
$$ plain form
11070 7422250 6510410 5712937 5041234 4477406 3985980 3579066 3207962 2885107 2627895
11061 2627895 2400810 2215658 2035023 1886393 1767397 1653235 1546308 1465548 1364681 1259031
11051 1259031 1194249 1133687 1065320 1009111 952164 912615 847288 766399 739051 712986 685160
11040 685160 683255 644603 618374 617307 602783 569605 549184 549349 540989 524796 513809 508351 478908
11027 478908 463366 429597 401832 378193 382071 392845 388941 376706 362804 373094 370891 378984
11015 378984 389520 380183 367835 356679 350915 324526 309163 299265 288280 258606 238194 243437
11003 243437 219041 201498 206308 234377 232541 217329 205073 199913 190560 187071 195572 198927 166482
10990 166482 163870 160786 137631 118543 106664 100450 104762 111469 118685 123694 133886 140180 145763
$$ packed form
11070G422250r11840p97473o71703n63828m91426m06914l71104l22855k57212
11061B627895k27085j85152j80635j48630j18996j14162j06927q0760j00867j05650
11051A259031o4782o0562o8367n6209n6947l9549o5327q0889k7348k6065k7826
11040F85160j905l8652k6229j067j4524l3178k0421J65q360j6193j0987n458k9443
11027D78908j5542l3769k7765k3639L878J0774l904j2235j3902J0290k203Q093
11015C78984J0536r337j2348j1156n764k6389j5363r898j0985k9674k0412N243
11003B43437k4396j7543M810K8069j836j5212j2256n160r353l489Q501L355l2445
10990A66482k612l084k3155j9088j1879o214M312O707P216N009J0192O294N583
$$ plain form
10977 145763 143408 125720 128825 140081 128441 139293 127873 96069 79324 82230 93050 98048
10965 98048 96525 85395 100841 97690 89799 82022 69123 68801 69525 79255 88881 74486 65557 74437
10951 74437 75808 65610 78025 76524 62747 50444 37834 39147 44309 58500 42324 41090 39371
10938 39371 40479 36167 33845 49743 50272 40762 48313 46368 34255 23401 15870 36128 41081 30627
10924 30627 25627 23346 21055 16024 12866 16727 25818 44975 54138 48203 40999 51486 55768 55144
10910 55144 48111 36975 41295 38696 54913 61459 73242 61095 50052 42488 39700 25671 34950
10897 34950 32478 31856 36201 47364 37705 49897 31966 44719 39248 41582 59423 87005 76085
10884 76085 56654 64272 68656 71777 75847 75452 62269 41268 21088 30368 57919 48172 20615
$$ packed form
10977A45763k355j7688L105J1256j1640J0852j1420l1804j6745K906J0820M998
10965I8048j523j1130J5446l151p891p777j2899l22P24R730R626j4395q929Q880
10951G4437J371j0198J2415j501j3777j2303j2610J313N162J4191j6176j234j719
10938C9371J108m312k322J5898N29r510P551j945j2113j0854p531K0258M953j0454
10924C0627n000k281k291n031l158L861R091J9157R163n935p204J0487M282o24
10910E5144p033j1136M320k599J6217O546J1783j2147j1043p564k788j4029R279
10897C4950k472o22M345J1163r659J2192j7931J2753n471K334J7841K7582j0920
10884G6085j9431P618M384L121M070l95j3183k1001k0180R280K7551r747k7557
$$ plain form
10871 20615 22248 27139 7578 -12475 -8973 7816 16145 19524 19772 21130 16978 23665 30255 41375
10857 41375 47825 33887 24474 17832 -3741 -3340 9585 24437 30728 30187 34572 35307 36131 40344
10843 40344 25663 14311 18220 34770 48754 40351 29333 27437 24086 22480 20320 21554 33069
10830 33069 23586 25630 43516 38804 24845 18168 9110 26591 35927 21199 -4386 4275 22160
10817 22160 32742 31864 17187 29776 52012 50856 58534 68675 68171 33863 -7801 -16505 -4901
10804 -4901 8430 4328 1457 4448 22222 22734 5661 1436 6413 -6484 -11047 -8963 5521 17910
10790 17910 9901 629 14190 15718 19656 7782 23137 17130 3874 8626 24362 42591 37734
10777 37734 30852 9347 3532 31409 37296 39701 37742 37666 39457 37811 32667 20216 9803 4678
$$ packed form
10871B0615J633M891j9561k0053L502J6789Q329L379K48J358m152O687O590J1120
10857D1375O450j3938r413o642k1573M01J2925J4852O291n41M385P35Q24M213
10843D0344j4681j1352L909J6550J3984q403j1018j896l351j606k160J234J1515
10830C3069r483K044J7886m712j3959o677r058J7481R336j4728k5585Q661J7885
10817B2160J0582q78j4677J2589K2236j156P678J0141n04l4308m1664q704J1604
10804d901J3331m102k871K991J7774N12j7073m225M977j2897m563K084J4484J2389
10790A7910q009r272J3561J528L938j1874J5355o007j3256M752J5736J8229m857
10777C7734o882k1505n815K7877N887K405j959p6J791j646n144j2451j0413n125
$$ plain form
10763 4678 12149 15797 8220 -17163 -25419 -25984 -19851 1321 11692 8571 4432 -9988 -9166 20268
10749 20268 28778 14033 -52 -13983 -8416 -7810 -1838 -2730 11717 18895 19641 17089 36411 63876
10735 63876 66003 66374 68828 51512 33529 36311 27565 19438 33757 39222 44442 60033 53318 43092
10721 43092 22703 38398 20591 2287 55 16265 27185 39960 33057 12222 19101 29197
10709 29197 38263 31390 36980 47909 42984 39288 25896 24479 39511 36633 34999 32950 33581 29313
10695 29313 25607 23601 22939 16169 32145 30388 15909 32263 51090 53384 47153 44838 48758 50481
10681 50481 60880 46210 36761 23331 13587 26605 34848 45667 62114 77313 64509 35664
10669 35664 34250 53743 60443 87245 91227 73385 69844 79146 97692 116656 128845 136116 116921
$$ packed form
10763D678P471L648p577k5383q256n65O133K1172J0371l121m139j4420Q22K9434
10749B0268Q510j4745j4085j3931N567O06N972q92J4447P178P46k552J9322K7465
10735F3876K127L71K454j7316j7983K782q746q127J4319N465N220J5591o715j0226
10721D3092k0389J5695j7807j8304k232J6210J0920J2775o903k0835O879J0096
10709B9197R066o873N590J0929m925l696j3392j417J5032k878j634k049O31m268
10695B9313l706k006o62o770J5976j757j4479J6354J8827K294o231k315L920J723
10681E0481J0399j4670r449j3430r744J3018Q243J0819J6447J5199j2804k8845
10669C5664j414J9493O700K6802L982j7842l541R302J8546J8964J2189P271j9195
$$ plain form
10656 116921 115741 109205 108455 90499 70080 66467 67584 54333 49726 38830 55178 73809 71609
10643 71609 71269 81674 96645 105863 97686 92407 101915 125073 126036 109671 115974 120858 109357 93393
10629 93393 93010 96753 81027 83013 91391 99416 118506 117346 104359 105064 111615 108681 94190 77790
10615 77790 78428 70758 85317 94318 80394 70436 80716 90238 114124 109360 104698 114100 123841 115722
10601 115722 114831 102644 104605 108330 112724 102103 116725 127976 141675 135005 120068 109246 113326
10588 113326 123636 119713 121678 126489 126992 135001 127489 127362 122214 111209 102849 93469 96092 96466
10574 96466 93760 119678 126873 122914 132240 118336 104424 99652 100047 86374 81970 82193 78632 79163
10560 79163 91700 92493 92698 98332 102281 114940 116946 111866 110378 93489 92934 100700 100335 85303
$$ packed form
10656A16921j180o536p50j7956k0419l613J117j3251m607j0896J6348J8631k200
10643G1609l40J0405J4971R218q177n279R508K3158R63j6365O303M884j1501j5964
10629I3393l83L743j5726J986Q378Q025J9090j160j2987P05O551k934j4491j6400
10615G7790O38p670J4559R001j3924r958J0280R522K3886m764m662R402R741q119
10601A15722q91j2187J961L725M394j0621J4622J1251J3699o670j4937j0822M080
10588A13326J0310l923J965M811N03Q009p512j27n148j1005q360r380K623L74
10574I6466k706K5918P195l959R326j3904j3912m772L95j3673m404K23l561N31
10560G9163J2537P93K05N634L949J2659K006n080j488j6889n55P766l65j5032
$$ plain form
10546 85303 69246 67448 83239 109394 120395 108879 97661 103801 99414 87069 84216 85950 85848
10533 85848 61328 62863 74122 78639 100237 106288 95565 106899 113787 106629 97410 95636 110942
10520 110942 107946 96640 86982 99671 101242 107120 88255 78089 85987 92799 86909 87707 81085
10507 81085 75446 84885 87723 74449 74185 83673 91229 111535 128648 110579 89956 78750 83034
10494 83034 101634 97015 78013 62617 77067 77269 58552 65810 66364 59799 35680 21502 36942
10481 36942 48370 49158 64421 50476 54413 58258 63436 44533 36195 26629 19610 11731 21454 21637
10467 21637 19728 35387 48063 50028 45929 29875 28407 35158 40710 39714 36026 15678 -5035
10454 -5035 3593 12138 22633 32743 35960 27616 22274 18316 -2182 -14482 1189 16143 22303
$$ packed form
10546H5303j6057j798J5791K6155J1001j1516j1218O140m387j2345k853J734j02
10533H5848k4520J535J1259M517K1598O051j0723J1334O888p158r219j774J5306
10520A10942k996j1306r658J2689J571N878j8865j0166P898O812n890P98o622
10507H1085n639R439K838j3274k64R488P556K0306J7113j8069k0623j1206M284
10494H3034J8600m619j9002j5396J4450K02j8717P258N54o565k4119j4178J5440
10481C6942J1428P88J5263j3945L937L845N178j8903q338r566p019p879R723J83
10467B1637j909J5659J2676J965m099j6054j468O751N552r96l688k0348k0713
10454e035Q628Q545J0495J0110L217q344n342l958k0498j2300J5671J4954O160
$$ plain form
10441 22303 23113 24958 34862 20440 -10222 -11719 2527 -7276 1753 28492 21127 -7465 -21980
10428 -21980 -20936 -38542 -34081 -37015 -37826 -25074 -39073 -35997 -19936 -2379 -9063 -10194 -305
10415 -305 -695 8397 3444 -774 9204 2395 -2135 -7703 -8618 -7353 444 -5838 -2965 3966 21831
10400 21831 25568 24141 21018 18902 4441 -1624 -8856 -12998 -20071 -25910 2699 16775 7279 -11509
10386 -11509 -16730 -16422 -11801 12865 10291 -2400 -7089 -22641 -20038 -18374 -6123 1657 7072 2236
10372 2236 9538 13686 6631 -2692 2496 3949 12987 2313 -1707 8779 9645 -8195 -17200 -13055
10358 -13055 4658 10971 4514 -6966 -4720 5473 -13561 -6154 5108 -15838 -26609 -15434
10346 -15434 21341 46605 24075 896 -1934 14924 24920 10650 4162 1165 5597 13360 9378
$$ packed form
10441B2303Q10J845R904j4422l0662j497J4246r803R029K6739p365k8592j4515
10428b1980J044j7606M461k934q11J2752j3999L076J6061J7557o684j131R889
10415c05l90R092m953m218R978o809m530n568r15J265P797o282K873O931J7865
10400B1831L737j427l123k116j4461o065p232m142p073n839K8609J4076r496j8788
10386a1509n221L08M621K4666k574j2691m689j5552K603J664J2251P780N415m836
10372B236P302M148p055r323N188J453R038j0674m020J0486Q66j7840r005M145
10358a3055J7713O313o457j1480K246J0193j9034P407J1262k0946j0771J1175
10346a5434L6775K5264k2530k3179k830J6858R996j4270o488k997M432P763l982
$$ plain form
10333 9378 2163 -2850 -5636 5449 -9944 -28445 -15053 7115 3459 -3241 -1504 17686 15647
10320 15647 594 -1045 -6736 1073 12155 7509 3335 22583 40975 27265 6314 54 -13843
10307 -13843 -13560 5597 4915 12737 17775 8194 1066 -2459 2041 -5356 -7467 4312 7652 -2341
10293 -2341 -11869 -17402 -10746 15892 52075 47448 39335 34480 22683 1470 -7660 -19475 -17804
10280 -17804 -18885 -25419 -20404 -14132 -985 15951 -4734 -28582 -35936 -36991 -28941 -11834 8785
10267 8785 17297 25883 27142 34414 43223 29776 10231 6905 9694 787 -7518 -17503 -21817 -24324
10253 -24324 -26418 -28275 -11135 12349 41827 50446 59612 62701 54236 40475 37259 32414 8726
10240 8726 -989 -3044 -27165 -23348 -4496 -6595 -10951 -4095 7024 -9171 -16731 -8306 -16687 -17577
$$ packed form
10333I378p215n013k786J1085j5393j8501J3392K2168l656o700J737J9190k039
10320A5647j5053j639n691P809J1082m646m174J9248J8392j3710k0951o260j3897
10307a3843K83J9157o82P822N038r581p128l525M500p397k111J1779L340r993
10293b341r528n533O656K6638L6183m627q113m855j1797k1213r130j1815J671
10280a7804j081o534N015O272J3147J6936k0685k3848p354j055Q050J7107K0619
10267H785Q512Q586J259P272Q809j3447j9545l326K789q907q305r985m314k507
10253b4324k094j857J7140K3484K9478Q619R166L089q465j3761l216m845k3688
10240H726r715k055k4121L817J8852k099m356O856J1119j6195p560Q425q381q90
$$ plain form
10226 -17577 -2313 8541 -12456 -18110 -12311 5870 -20971 -48066 -39972 -20269 -11696 -31437
10214 -31437 -30502 -24988 -34234 -18821 3328 -5756 -3154 5231 11486 -6549 -29895 -54246 -52222
10201 -52222 -2358 18235 22550 29071 17160 6918 1285 1931 -199 -4990 -2630 5848 3697 175
10187 175 -2058 -2416 2306 7664 15456 4172 -2511 5003 20573 32309 30443 26212 8048 28698
10173 28698 46753 47853 28084 1554 -671 -3760 -16979 -13133 -23011 -34560 -38783 -34920 -27951
10160 -27951 -2997 -2407 -21011 -21677 -21670 -35744 -32946 -18559 -8842 -14963 -13325 4037 3617 -13573
10146 -13573 -3831 -23494 -27514 -31840 -13862 8142 23652 41768 28874 17682 21094 -6694
10134 -6694 -29087 -39652 -38120 -9688 5700 20335 22764 8146 20644 20618 17650 22431 20400
$$ packed form
10226a7577J5264J0854k0997n654N799J8181k6841k7095Q094J9703Q573j9741
10214c1437R35N514r246J5413K2149r084K602Q385O255j8035k3346k4351K024
10201e2222M9864K0593M315O521j1911j0242n633O46k130m791K360Q478k151l522
10187A75k233l58M722N358P792j1284o683P514J5570J1736j866m231j8164K0650
10173B8698J8055J100j9769k6530k225l089j3219L846r878j1549m223L863O969
10160b7951K4954N90j8604o66Pj4074K798J4387R717o121J638J7362m20j7190
10146a3573R742j9663m020m326J7978K2004J5510J8116j2894j1192L412k7788
10134f694k2393j0565J532K8432J5388J4635K429j4618J2498k6k968M781k031
$$ plain form
10121 20400 36586 40849 42170 33391 14887 -2192 -15127 -12289 -16039 -12243 -7117 606 19236
10108 19236 13329 10289 12250 31184 45459 56258 49484 21211 15747 45451 65187 72066 72436
10095 72436 75043 59189 45094 41895 31738 25134 25245 24701 27751 56320 39032 15156 -1110
10082 -1110 -11575 5217 42489 60096 48131 51349 65540 66837 50632 58368 43133 17086
10070 17086 2326 -568 -5222 24085 41704 46630 59276 58873 32112 16714 17663 24388 22767
10057 22767 26568 32766 34976 34655 40389 42379 38667 35124 45109 57831 67487 63054 54115 66862
10043 66862 85759 76197 59546 75393 73052 70303 78120 71538 61591 49518 62081 55365 49215
10030 49215 45173 31260 22158 20769 29192 30539 38348 42988 30153 26373 14277 11648 13570 21489
$$ packed form
10121B0400J6186M263J321q779j8504j7079j2935K838l750L796N126P723J8630
10108A9236n907l040J961J8934J4275J0799o774k8273n464K9704J9736O879L70
10095G2436K607j5854j4095l199j0157o604J11n44L050K8569j7288k3876j6266
10082a110j0465J6792L7272J7607j1965L218J4191J297j6205P736j5235k6047
10070A7086j4760k894m654K9307J7619M926J2646m03k6761j5398R49O725j621
10057B2767L801O198K210l21N734J990l712l543R985J2722R656m433q939J2747
10043F6862J8897r562j6651J5847k341k749P817o582r947j2073J2563o716o150
10030D9215m042j3913r102j389Q423J347P809M640j2835l780j2096k629J922P919
$$ plain form
10016 21489 34090 27701 40 2034 5786 12513 36304 36523 37117 37422 19979 12929 11885 -2087
10002 -2087 -2 3057 7408 1861 8921 45094 61000 54575 42544 47897 46521 36429 1981
9989 1981 -10880 13162 18668 15848 13353 15128 35785 38846 21892 14871 23135 5649 9833 11336
9975 11336 19265 16338 -1998 -16658 -28217 -12855 -1638 17156 23098 15901 16771 -5630 -11490
9962 -11490 -5143 -12000 6577 8872 -2194 -6976 -11527 -7524 -7313 9825 35839 27948 20052 20079
9948 20079 22414 22143 22071 25168 21032 34239 39269 44125 20476 -898 -15188 -13354 13429 35975
9934 35975 54893 60388 59918 59078 80079 137553 212411 305622 399330 459426 486095 445219 340103
9921 340103 233173 171269 99643 65447 51827 26386 -115 2749 6936 8558 381 1142 10980
$$ packed form
10016B1489J2601o389k7661J994L752O727K3791K19N94L05j7443p050j044j3972
10002b087K085L059M351n547P060L6173J5906o425j2031N353j376j0092l4448
9989A981j2861K4042N506k820k495J775K0657L061j6954p021Q264j7486M184J503
9975A1336P929k927j8336j4660j1559J5362J1217J8794N942p197Q70k2401n860
9962a1490O347o857J8577K295j1066m782m551M003K11J7138K6014p891p896K7
9948B0079K335k71p2L097m136J3207N030M856k3649k1374j4290J834K6783K2546
9934C5975J8918N495m70q40K1001N7474P4858R3211R3708O0096K6669m0876j05116
9921C40103j06930o1904p1626l4196j3620k5441k6501K864M187J622q177P61R838
$$ plain form
9908 10980 17809 20168 2336 -1292 28793 20531 24782 37832 13497 11853 15097 4060 -1070
9895 -1070 6081 1139 2638 -933 -1045 4562 20381 20903 47474 40547 27056 2731 -13031 -12658
9881 -12658 6482 16814 10794 8541 5493 346 -17805 -26340 -21525 -1658 6813 14813 8617 -8695
9867 -8695 -5477 8129 -361 -13517 -6147 -566 -7143 -1783 3297 21445 25689 26163 11966 13844
9853 13844 35698 25975 20401 19213 15945 22630 30611 32657 38617 43440 17410 28336 36214 36440
9839 36440 23520 10933 6592 3291 11925 20968 19367 2935 5050 7336 18659 26744 19551 11070
9825 11070 14935 18875 19248 24879 35889 31197 11558 9035 -11060 -17887 3185 25694 9200
9812 9200 -3207 -20634 -15089 -4850 -14523 -10847 -7176 3723 -588 -12834 -3024 1232 -18324
$$ packed form
9908A0980O829K359j7832l628L0085q262M251J3050k4335j644L244j1037n130
9895a070P151m942J499l571j12N607J5819N22K6571o927j3491k4325j5762L73
9881a2658J9140J0332o020k253l048n147j8151q535M815J9867Q471Q000o196j7312
9867h695L218J3606q490j3156P370N581o577N360N080J8148M244M74j4197J878
9853A3844K1854r723n574j188l268O685P981K046N960M823k6030J0926P878K26
9839C6440j2920j2587m341l301Q634R043j601j6432K115K286J1323Q085p193q481
9825A1070L865L940L73N631J1010m692j9639k523k0095o827K1072K2509j6494
9812I200j2407j7427N545J0239r673L676L671J0899m311j2246R810M256j9556
$$ plain form
9799 -18324 -6333 8281 2448 -6692 894 10133 23077 28252 5111 -7050 -15404 -2499 24414
9786 24414 27576 21512 16083 14863 14047 11056 16112 25262 28565 30699 16424 8466 27973 43236
9772 43236 41575 38241 24654 5358 4297 21608 36359 26670 19665 1926 -7384 -3829 -806
9759 -806 -2551 -148 16986 9788 17213 20161 19932 27223 28429 6235 15574 37064 35478 23846
9745 23846 13595 9049 2309 10130 4626 12407 -7440 -15013 -9183 15375 21652 14117 19704 18095
9731 18095 12063 -7720 -4350 3166 432 218 15899 13908 -10622 2063 30954 42986 28428
9718 28428 14409 32072 30140 15278 14218 10309 13716 21738 32991 36765 45265 55652 75604
9705 75604 66628 49184 42932 39636 32167 42786 49113 19247 -53 -2168 -10752 2018 4388
$$ packed form
9799a8324J1991J4614n833r140P586R239J2944N175k3141j2161q354J2905K6913
9786B4414L162o064n429j220q16k991N056R150L303K134j4275p958J9507J5263
9772D3236j661l334j3587j9296j061J7311J4751r689p005j7739r310L555L023
9759h06j745K403J7134p198P425K948k29P291J206k2194R339K1490j586j1632
9745B3846j0251m546o740P821n504P781j9847p573N830K4558O277p535N587j609
9731A8095o032j9783L370P516k734k14J5681j991k4530J2685K8891J2032j4558
9718B8428j4019J7663j932j4862j060l909L407Q022J1253L774Q500J0387J9952
9705G5604q976j7444o252l296p469J0619O327k9866j9300k115q584J2770K370
$$ plain form
9692 4388 -11472 -16856 -5512 3178 23396 33781 35439 30708 22039 22302 17570 35611 45163 48437
9678 48437 59641 53173 47541 42663 46671 50443 46832 46034 50300 69941 91685 85600 79082 80677
9664 80677 81459 95428 92397 79819 67794 74249 77290 87329 92609 84911 64603 60496 71812
9651 71812 84844 77814 84983 78022 76966 81599 83426 89854 97579 93353 86752 97775 123633 152119
9637 152119 147256 152591 145587 131638 134791 143770 146975 138934 142614 144584 151776 156976 168019 189530
9623 189530 204928 210748 216951 225273 229418 228916 243004 272587 295007 295160 305577 323573 393071
9610 393071 431857 439676 443548 456324 505717 546754 569514 616908 678839 731037 779333 839585
9598 839585 916033 998384 1085306 1202318 1304839 1414951 1550219 1708543 1894029 2091685
$$ packed form
9692D388j5860n384J1344Q690K0218J0385J658m731q669K63m732J8041R552L274
9678D8437J1204o468n632m878M008L772l611p98M266J9641K1744o085o518J595
9664H0677P82J3969l031j2578j2025O455L041J0039N280p698k0308m107J1316
9651G1812J3032p030P169o961j056M633J827O428P725m226o601J1023K5858K8486
9637A52119m863N335p004j3949L153Q979L205q041L680J970P192N200J1043K1511
9623A89530J5398N820O203Q322M145n02J4088K9583K2420J53J0417J7996O9498
9610C93071L8786P819L872J2776M9393M1037K2760M7394O1931N2198M8296O0252
9598H39585P6448Q2351Q6922J17012J02521J10112J35268J58324J85486J97656
$$ plain form
9588 2091685 2332654 2617288 2914964 3264064 3624527 4024805 4450936 4869026 5249987 5552955
9578 5552955 5768430 5858144 5787967 5556153 5215297 4805208 4380478 3948189 3500314 3099279
9568 3099279 2753099 2453270 2185247 1948178 1743166 1574217 1411900 1264554 1149426 1046364
9558 1046364 968832 888909 828290 760813 711637 660636 610879 566751 514680 485177 456853
9547 456853 428660 401227 376087 346742 323788 294102 289863 286965 270530 258627 251002 247557
9535 247557 252861 249364 227316 216426 213265 186471 176134 160420 173166 173570 158826 132764 112751
9522 112751 119369 125422 123775 109551 123357 113430 95334 95822 121959 129059 106437 88297 90770
9509 90770 90719 73185 81566 101992 105994 115245 122883 121267 120674 137435 135195 143977 156880 138146
$$ packed form
9588B091685K40969K84634K97676L49100L60463M00278M26131M18090L80961L02968
9578E552955K15475Q9714p0177k31814l40856m10089m24730m32289m47875m01035
9568C099279l46180k99829k68023k37069k05012j68949j62317j47346j15128j03062
9558A046364p7532p9923o0619o7477m9176n1001m9757m4128n2071k9503k8324
9547D56853k8193k7433k5140k9345k2954k9686m239k898j6435j1903p625l445
9535B47557N304l497k2048j0890l161k6794j0337j5714J2746M04j4744k6062k0013
9522A12751O618O053j647j4224J3806r927j8096M88K6137P100k2622j8140K473
9509I0770n1j7534Q381K0426M002R251P638j616n93J6761k240Q782J2903j8734
$$ plain form
9495 138146 120742 129588 128472 109672 103933 100981 85771 73839 67231 59190 60046 52854 50876 51733
9481 51733 12462 -1929 -1275 6901 15766 28607 23221 19046 30792 38519 37130 48627 65898
9468 65898 94275 109261 114902 122716 135431 142456 137568 134775 127578 117716 102041 107592 108617 85354
9454 85354 68876 68824 78175 70407 56555 52803 37423 9957 12980 12420 14007 17610 16016 26256
9440 26256 27452 12900 4174 20043 21224 15565 -52 3241 32701 57520 60217 74222 103072
9427 103072 87705 57296 47316 52619 59567 77947 59352 43095 21934 3002 -15140 -26983
9415 -26983 -39833 -39426 -16692 6133 15040 18598 5191 -12380 4532 28173 29571 32074 25197
9402 25197 18471 13407 2478 2787 2566 1012 12064 20654 9799 1137 13735 15402 26790 32028
$$ packed form
9495A38146j7404Q846j116j8800n739k952j5210j1932o608q041Q56p192j978Q57
9481E1733l9271j4391O54Q176Q865J2841n386m175J1746P727j389J1497J7271
9468F5898K8377J4986N641P814J2715P025m888k793p197r862j5675N551J025k3263
9454H5354j6478n2R351p768j3852l752j5380k7466L023n60J587L603j594J0240
9440B6256J196j4552q726J5869J181n659j5617L293K9460K4819K697J4005K8850
9427A03072j5367l0409r980N303O948J8380j8595j6257k1161j8932j8142j1843
9415b6983j2850M07K2734K2825Q907L558j3407j7571J6912K3641J398K503o877
9402B5197o726n064j0929L09k21j554J1052Q590j0855q662J2598J667J1388N238
$$ plain form
9388 32028 33335 44635 43334 24958 6035 4368 11782 16566 585 -5407 5801 12580 12994 -6687
9374 -6687 -16649 -21675 -13253 6842 8456 7593 6711 5671 -54 -14789 -12540 -3471 2609 9440 20785
9359 20785 42022 46004 59855 50140 15023 8393 19765 27658 42745 45004 29886 32905 30814
9346 30814 33198 43936 38521 23226 14609 -2825 -24244 -12003 -5692 -10305 -10358 -1520 13757 15967
9332 15967 28213 22905 18578 24546 44706 37422 41186 54514 53859 49527 22210 26837 28735 16015
9318 16015 9322 13567 16175 973 12102 49435 39083 18770 4495 -5915 9870 17647 16184
9305 16184 11107 23168 16582 25049 45304 61573 83138 99321 98462 115956 130399 129631 139810
9292 139810 170200 207539 248209 311688 405623 550020 664666 704784 654277 556241 441502
$$ packed form
9388C2028J307J1300j301j8376j8923j667P414M784j5981n992J1208O779M14j9681
9374f687r962n026Q422K0095J614q63q82j040n725j4735K249R069O080O831J1345
9359B0785K1237L982J3851r715l5117o630J1372P893J5087K259j5118L019k091
9346C0814K384J0738n415j5295q617j7434k1419J2241O311m613n3Q838J5277K210
9332A5967J2246n308m327N968K0160p284L764J3328o55m332k7317M627J898j2720
9318A6015o693M245K608j5202J1129L7333j0352k0313j4275j0410J5785P777j463
9305A6184n077J2061o586Q467K0255J6269K1565J6183q59J7494J4443p68J0179
9292A39810L0390L7339M0670O3479R3935J44397J14646M0118n0507r8036j14739
$$ plain form
9281 441502 341365 287930 230799 199914 200799 237746 260546 288406 336486 410286 491381 562214
9269 562214 623300 651217 641439 624567 610170 579804 549437 504249 476014 459876 465074 470411
9257 470411 469676 482454 508399 563688 676004 864056 1121145 1429205 1662243 1733358 1651594
9246 1651594 1417728 1127549 844460 643151 518040 455844 445790 433481 418134 429187
9236 429187 437552 461227 487720 522623 544403 576612 601159 623038 628850 594088 523627 457517
9224 457517 376126 322725 289951 261502 242245 237365 247936 261256 290767 351805 455949 572819
9212 572819 639031 657481 621010 531115 414926 314353 238978 192021 145182 83686 60850
9201 60850 63160 59446 66326 61399 63720 56980 32235 15870 15258 -1418 -23697 -26308 -6275 11473
$$ packed form
9281D41502j00137n3435n7131l0885Q85L6947K2800K7860M8080P3800Q1095P0833
9269E62214O1086K7917r778j6872j4397l0366l0367m5188k8235j6138N198N337
9257D70411p35J2778K5945N5289J12316J88052K57089L08060K33038P1115q1764
9246A651594k33866k90179k83089k01309j25111o2196j0054j2309j5347J1053
9236D29187Q365K3675K6493L4903K1780L2209K4547K1879N812l4762p0461o6110
9224D57517q1391n3401l2774k8449j9257m880J0571J3320K9511O1038J04144J16870
9212E72819O6212J8450l6471q9895j16189j00573p5375m6957m6839o1496k2836
9201F0850K310l714O880m927K321o740k4745j6365o12j6676k2279k611K0033J7748
$$ plain form
9187 11473 12929 9428 29287 42782 33552 17340 18188 22491 13227 3063 5840 14238 19910 35501
9173 35501 58780 62904 44675 32643 24654 18233 5268 1707 11424 34223 43777 42374 40800
9160 40800 25182 10999 2274 8942 10919 30478 41360 22964 9187 22912 23244 26228 22950
9147 22950 16447 13623 831 13524 9123 5534 -592 -8246 -6028 11071 13082 15934 19761 15707
9133 15707 10242 5757 -1308 -8353 6618 14023 22732 9486 898 6608 20408 12665 -7398 -10112
9119 -10112 -17888 -15732 532 10623 11066 2521 3019 12628 5367 7701 402 -6470 -8450 -17999 -38305
9104 -38305 -41016 -41955 -28696 -31597 -31373 -29566 -36451 -29087 -8515 27897 23577 11607 2685 -13083
9090 -13083 -12021 -7218 10633 12267 4586 -4747 -15980 -30479 -33698 -18904 -14686 -27855 -26092
$$ packed form
9187A1473J456l501J9859J3495r230j6212Q48M303r264j0164K777Q398N672J5591
9173C5501K3279M124j8229j2032p989o421j2965l561R717K2799R554j403j574
9160D0800j5618j4183q725O668J977J9559J0882j8396j3777J3725L32K984l278
9147B2950o503k824j2792J2693m401l589o126p654K218J7099K011K852L827m054
9133A5707n465m485p065p045J4971P405Q709j3246q588N710J3800p743k0063k714
9119a0112p776K156J6264J0091M43q545M98R609p261K334p299o872j980r549k0306
9104c8305k711r39J3259k901K24J807o885P364K0572L6412m320j1970q922j5768
9090a3083J062M803J7851J634p681r333j1233j4499l219J4794M218j3169J763
$$ plain form
9077 -26092 -8158 5510 4801 14906 21373 10197 64 10747 14739 23349 23054 13180 2693
9064 2693 -13927 -28658 -34287 -34823 -20001 -20097 -28115 -19413 -17636 -2332 11763 -6990 -10673 -3864
9050 -3864 1549 -1 -990 -8289 -29057 -40680 -35341 -15747 -13435 2203 4183 -6830 -2171 -23156
9036 -23156 -41319 -40026 -40887 -31902 -10428 -16304 -20299 -14006 -9292 -16996 -7843 11020 12385 -8294
9022 -8294 -20353 -25980 -32553 -34515 -19229 -7926 -6898 1863 11243 20317 13342 1312 -15425 -16009
9008 -16009 5065 24490 39597 39141 30667 15604 9054 -122 -16056 -20652 -1374 -3003 -18568
8995 -18568 -15499 -13756 11512 20128 35919 22153 22853 21762 6684 9464 17645 6929 -3920
8982 -3920 1272 5454 6874 4674 8218 2914 4500 10508 12525 -1361 -11045 -3753 -1355 -11333 -19636
$$ packed form
9077b6092J7934J3668p09J0105O467j1176j0133J0683L992Q610k95r874j0487
9064B693j6620j4731n629n36J4822r6q018Q702J777J5304J4095j8753l683O809
9050c864N413j550r89p299k0768j1623N339J9594K312J5638J980j1013M659k0985
9036b3156j8163J293q61Q985K1474n876l995O293M714p704R153J8863J365k0679
9022h294j2059n627o573j962J5286J1303J028Q761R380R074o975j2030j6737n84
9008a6009K1074J9425J5107m56q474j5063o550r176j5934m596J9278j629j5565
8995a8568L069J743K5268Q616J5791j3766P00j091j5078K780Q181j0716j0849
8982c920N192M182J420k200L544n304J586O008K017j3886r684P292K398r978q303
$$ plain form
8967 -19636 -28710 -38562 -10067 -2707 -21821 -22974 -15301 -14461 -11048 -18745 -17213 -9615 -10329 -4888 6115
8952 6115 17662 3417 -17878 4809 13550 -6312 -13229 -12708 -12831 -18596 -9658 1405 -1383 -5938
8938 -5938 -11227 -730 869 -2994 -11771 -9262 -20426 -26411 -22159 -12030 -28268 -18748 -14107 -3725
8924 -3725 23715 38154 25218 10091 -3036 -21659 -2147 15567 23445 5910 -19750 -30604
8912 -30604 -14606 -1882 -5657 -24102 -24576 -18056 -27841 -23979 -19118 -23211 -16882 -9367 -17771 -14050
8898 -14050 -17819 -11476 1506 965 5824 24995 38508 39778 23735 18901 20056 10479 1540 -15517
8884 -15517 -8774 6859 -7078 -19000 -3482 -5352 -9783 -370 -10521 -33516 -51345 -46542 -43049
8871 -43049 -45714 -38174 -31774 -46696 -45922 -31156 -11892 -7443 -18573 -24325 -39296 -16334 -18591
$$ packed form
8967a9636r074r852K8495P360j9114j153P673Q40L413p697J532P598p14N441J1003
8952F115J1547j4245k1295K2687Q741j9862o917N21j23n765Q938J1063k788m555
8938e938n289J0497J599l863q777K509j1164n985M252J0129j6238R520M641J0382
8924c725K7440J4439j2936j5127j3127j8623J9512J7714P878j7535k5660j0854
8912c0604J5998J2724l775j8445m74O520r785L862M861m093O329P515q404L721
8898a4050l769O343J2982n41M859J9171J3513J270j6043m834J155r577q939j7057
8884a5517O743J5633j3937j1922J5518j870m431R413j0151k2995j7829M803L493
8871d3049k665P540O400j4922P74J4766J9264M449j1130n752j4971K2962k257
$$ plain form
8858 -18591 -5709 11761 30077 42655 49722 40716 29933 19475 12409 4411 10773 1784 -20291
8845 -20291 -3564 14176 2611 -18476 -39392 -24088 -14379 -11918 -3652 -20570 -26983 -27428 -15040
8832 -15040 -31264 -22590 15130 38516 50022 27887 25186 21859 22277 19792 13322 -3981 -17060
8819 -17060 -32905 -37025 -26028 -24988 -16742 -21581 -29510 -36016 -35994 -33060 -32310 -18802 -20074 -10464 -7228
8804 -7228 -7737 -8554 -18188 -13702 -9797 -8997 4300 9940 1774 -10528 -24594 -32680 -10929 -19929 -34385
8789 -34385 -23413 -34388 -19856 -17894 -14839 -20200 -12170 -13398 -37620 -31000 -33869 -36810 -29898 -21656
8775 -21656 7009 25546 9686 -2968 -3125 1853 10267 18107 8383 -9249 -18703 -14976 -14415 -11956
8761 -11956 -24246 -31221 -27380 -26771 -34898 -24905 -9989 9141 25176 30001 21395 13195 16391 9057
$$ packed form
8858a8591J2882J7470J8316J2578P067r006j0783j0458p066p998O362q989k2075
8845b0291J6727J7740j1565k1087k0916J5304R709K461Q266j6918o413m45J2388
8832a5040j6224Q674L7720K3386J1506k2135k701l327M18k485o470j7303j3079
8819a7060j5845m120J0997J040Q246m839p929o506K2K934P50J3508j272R610L236
8804g228n09q17r634M486L905Q00J3297N640q166j2302j4066q086K1751r000j4456
8789c4385J0972j0975J4532J962L055n361Q030j228k4222O620k869k941O912Q242
8775b1656K8665J8537j5860j2654j57M978Q414P840r724j7632r454L727N61K459
8761a1956j2290o975L841O09q127R993J4916J9130J6035M825q606q200L196p334
$$ plain form
8747 9057 8392 12000 1896 -7582 -19495 -21880 -15625 -21835 -11119 -17138 -15623 -6478 3475 -20008
8733 -20008 -16916 -13893 -7892 -10071 -4606 22932 15826 -1985 667 11726 -4455 -734 -703 -7076
8719 -7076 -13850 -23787 -21134 -17027 -12276 -24136 -11982 3807 12798 10187 -1931 -18040 -16205 -9693
8705 -9693 1112 -19313 -11716 11992 -1146 -3940 -11171 -16623 -19868 -21306 -23882 -16933 -17133 -20204
8691 -20204 -8850 -9156 -13079 -34288 -27267 -15776 -2530 411 -1313 4474 -18098 -28263 -20657
8678 -20657 -12848 3686 -470 -12195 -27101 -11404 8347 14556 17320 19961 22209 6948 9976
8665 9976 -2758 -9262 -141 11304 10405 19702 20455 15017 1328 15607 26165 10634 15556 2778
8651 2778 -1666 18554 18896 25578 25633 32401 34651 35002 27681 20345 27214 23331 15989 12214 37739
$$ packed form
8747I057o65L608j0104r478j1913k385O255o210J0716o019J515R145R953k3483
8733b0008L092L023O001k179N465K7538p106j7811K652J1059j6181L721L1o373
8719g076o774r937K653M107M751j1860J2154J5789Q991k611j2118j6109J835O512
8705i693J0805k0425P597K3708j3138k794p231n452l245j438k576O949k00l071
8691b0204J1354l06l923k1209P021J1491J3246K941j724N787k2572j0165P606
8678b0657P809J6534m156j1725j4906J5697J9751O209K764K641K248j5261L028
8665I976j2734o504R121J1445q99R297P53n438j3689J4279J0558j5531M922j2778
8651B778m444K0220L42O682N5O768K250L51p321p336O869l883p342l775K5525
$$ plain form
8636 37739 49085 38256 21509 33308 14460 1351 6211 20733 11222 15267 26464 18963 28576
8623 28576 15798 6937 9409 29149 34922 34833 38382 45817 33005 35022 27721 16354 19035 13311
8609 13311 12249 24832 35415 60352 63311 71040 84490 91007 88966 83356 79371 83889 85342 84301
8595 84301 74182 64377 59781 47110 38849 33108 25675 26184 28746 31718 22096 18616 17804 14018 31315
8580 31315 16658 -2779 -4745 -6793 -6391 -5785 -10089 725 23309 29681 29804 28024 20067 4219
8566 4219 -1998 8189 9566 14063 11384 6187 2205 -1878 -21700 -27686 -23715 -10974 -32522 -10196
8552 -10196 5440 -12674 -6848 -7810 8411 12746 609 -4762 4061 3942 7380 7984 1483 -13326
8538 -13326 -22287 -33184 -18776 -14403 -19798 -9749 -2772 -5260 -15182 -19078 -17956 -1369 8219 3228
$$ packed form
8636C7739J1346j0829j6747J1799j8848j3109M860J4522r511M045J1197p501R613
8623B8576j2778q861K472J9740N773q9L549P435j2812K017p301j1367K681n724
8609A3311j062J2583J0583K4937K959P729J3450O517k041n610l985M518J453j041
8595H4301j0119r805m596j2671q261n741p433N09K562K972r622l480q12l786J7297
8580C1315j4657j9437j966k048M02O06m304J0814K2584O372J23j780p957j5848
8566D219o217J0187J377M497k679n197l982m083j9822n986L971J2741k1548K2326
8552a0196J5636j8114N826r62J6221M335j2137n371Q823j19L438O04o501j4809
8538a3326q961j0897J4408M373n395J0049O977k488r922l896J122J6587R588m991
$$ plain form
8524 3228 8962 4332 18112 13637 9152 8694 -12647 -22384 -31379 -25919 -17177 -6492 69 14225
8510 14225 33708 22138 -10156 -10459 -10898 -17439 -17017 -10528 -7588 6824 8930 4289 -8108 -14629
8496 -14629 -17654 -27552 -3063 2446 16329 22251 15128 12214 -4547 -20724 -26710 -20045 -15648 -13669
8482 -13669 -6425 -1148 -22091 -32609 -23646 -17337 6024 11217 2401 6500 -440 2221 6517 -1722
8468 -1722 692 2541 13737 6894 -1332 -10543 -22233 -21372 -9600 5661 4777 1671 4328 10058
8454 10058 6853 5638 5874 17090 27611 37697 35758 23268 14374 7966 -2270 -8461 2414
8441 2414 4070 -12224 16326 41681 36945 26227 11599 3494 8177 2748 11189 12273 19070 18956
8427 18956 12638 16096 17891 -5967 -633 -4787 -951 9341 15923 19788 4057 -12821 -20975 -11660
$$ packed form
8524C228N734m630J3780m475m485m58k1341r737q995N460Q742J0685O561J4156
8510A4225J9483j1570l2294l03m39o541M22O489K940J4412K106m641j2397o521
8496a4629l025r898K4489N509J3883N922p123k914j6761j6177n986O665M397J979
8482a3669P244N277k0943j0518Q963O309K3361N193q816M099o940K661M296q239
8468a722K414J849J1196o843q226r211j1690Q61J1772J5261q84l106K657N730
8454A0058l205j215K36J1216J0521J0086j939j2490q894o408j0236o191J0875
8441B414J656j6294K8550K5355m736j0718j4628q105M683n429Q441J084O797j14
8427A8956o318L458J795k3858N334m154L836J0292O582L865j5731j6878q154R315
$$ plain form
8413 -11660 24016 25142 9214 16154 25065 6424 -800 19317 24750 27140 19438 -1858 -16927
8400 -16927 -12758 -18565 -27907 -8139 9673 -2982 -10749 -12049 4926 -644 -8317 -13433 -10860 1312
8386 1312 9178 7984 -6882 3251 3557 16062 30654 28118 20082 11058 -4504 -8761 -143 -2888
8372 -2888 -20771 -25181 -15259 -27409 -23262 -1035 14639 -328 4361 15940 -2998 -6718 1940
8359 1940 -1740 -20788 -34141 -35372 -39850 -24246 -29460 -38954 -28395 -15527 -19482 -6536 -10985
8346 -10985 -13633 -5762 -15709 -18927 -17119 -3575 13326 20424 29355 39445 29011 23551 5229
8333 5229 -8361 -1508 -4743 -3748 20461 44373 27904 13905 10452 5166 22994 22074 9485 230
8319 230 -7067 -12273 -13778 -18427 -26823 -9876 -14005 -42465 -62894 -53747 -33942 -17565 -12301 -23035
$$ packed form
8413a1660L5676J126j5928O940Q911j8641p224K0117N433K390p702k1296j5069
8400a6927M169n807r342J9768J7812j2655p767j300J6975n570p673n116K573J2172
8386A312P866j194j4866J0133L06J2505J4592k536q036r024j5562m257Q618k745
8372b888j7883m410R922j2150M147K2227J5674j4967M689J1579j8938l720Q658
8359A940l680j9048j3353j231m478J5604n214r494J0559J2868l955J2946m449
8346a0985k648P871r947l218J808J3544J6901P098Q931J0090j0434n460j8322
8333E229j3590O853l235R95K4209K3912j6469j3999l453n286J7828r20j2589r255
8319B30p297n206j505m649q396J6947m129k8460k0429R147J9805J6377N264j0734
$$ plain form
8305 -23035 -31115 -36165 -33709 -25034 -16821 -1053 16143 18868 -6926 -13088 646 -9485 -29383
8292 -29383 -40824 -36873 -29724 -22969 -11889 -23305 -34273 -15175 -7543 -8779 -12084 -13116 -12396 -8544
8278 -8544 -6269 -12973 -11351 15084 26624 18499 17920 5442 -11753 -13063 4782 16050 18740 7793
8264 7793 -8672 -3724 14806 28161 32338 20711 11657 -5875 -694 7892 -10077 -18165 -8554
8251 -8554 -18859 -26050 -34545 -23930 -20053 -22372 -25635 -24150 -18880 -19604 -2325 4123 8725 14009
8237 14009 17364 11581 -3107 -7386 -10978 -18675 -10216 8846 7024 16281 12646 -10238 -13925 605
8223 605 -3259 -16590 -1915 6330 -1163 -6036 439 -646 5525 22222 29676 30614 20304 579
8209 579 -5118 -13801 -17155 -5689 -10065 -17242 -2822 1811 15623 2313 -11906 -7123 -13724 1992
$$ packed form
8305b3035q080n050K456Q675Q213J5768J7196K725k5794o162J3734j0131j9898
8292b9383j1441L951P149O755J1080j1416j0968J9098P632j236l305j032P20L852
8278h544K275o704J622K6435J1540q125n79j2478j7195j310J7845J1268K690j0947
8264G793j6465M948J8530J3355M177j1627r054j7532N181Q586j7969q088R611
8251h554j0305p191q495J0615L877k319l263J485N270p24J7279O448M602N284
8237A4009L355n783j4688m279l592p697Q459J9062j822R257l635k2884l687J4530
8223F05l864j3331J4675Q245p493m873O475j085O171J6697P454R38j0310j9725
8209E79n697q683l354J1466m376p177J4420M633J3812j3310j4219M783o601J5716
$$ plain form
8195 1992 -8726 -33753 -39739 -37799 -21987 -19405 -21641 -4298 -8174 -15403 -5479 -4408 12360 17715
8181 17715 28308 18547 11906 16178 -4814 -15122 -1371 -1551 -3664 -15747 -9773 -15988 -34181
8168 -34181 -31169 -29985 -13623 -1758 -7115 -27359 -27517 -26373 -17667 3621 22856 26241 22756 7346
8154 7346 -17141 -24264 -16146 -12629 -4387 5905 920 -15284 -25319 -15040 -29005 -29760 -15383
8141 -15383 8598 25341 33124 14813 2211 14270 22071 9498 22335 10689 1310 -12454
8129 -12454 -2819 4439 2141 -5162 -308 11193 5043 -4486 8287 405 -8760 -22170 -22872 -7677
8115 -7677 -1558 -7218 -9445 -23715 -25355 -21590 -8253 -19390 -26795 -35390 -41800 -18631 -2871 2438
8101 2438 3598 6486 3154 -12408 -18678 -25843 -18613 11118 17245 28221 33886 37871 33988 10700
$$ packed form
8195A992j0718k5027n986J940J5812K582k236J7343l876p229R924J071J6768N355
8181A7715J0593r761o641M272k0992j0308J3751j80k113j2083N974o215j8193
8168c4181L012J184J6362J1865n357k0244j58J144Q706K1288J9235L385l485j5410
8154G346k4487p123Q118L517Q242J0292m985j6204j0035J0279j3965p55J4377
8141a5383K3981J6743P783j8311j2602J2059P801j2573J2837j1646r379j3764
8129a2454R635P258k298p303M854J1501o150r529J2773p882r165j3410p02J5195
8115g677O119n660k227j4270j640L765J3337j1137p405q595o410K3169J5760N309
8101B438J160K888l332j5562o270p165P230K9731O127J0976N665L985l883k3288
$$ plain form
8087 10700 -3932 -11907 -26400 -14280 15663 26205 -2330 -8942 14879 9405 3629 27114 33807
8074 33807 36700 29815 11992 -635 -8899 -8962 -2622 6960 -7335 -2581 3574 -11958 -20696 -20896
8060 -20896 -6108 8578 10336 24398 17992 13244 24250 14982 7844 -11178 6958 14325 541
8047 541 1927 713 2290 1842 19745 45506 48583 22863 -121 -9128 10838 22438 25774 22976
8033 22976 39671 36359 17206 2816 -5402 -14421 -3917 608 7548 -37 -5905 -8037 -11825 -1929
8019 -1929 20457 35016 27801 14768 -4941 -11596 2559 -10149 -13333 -29028 -36802 -28489 -20156
8006 -20156 -17592 -6427 -9487 266 25156 24426 28717 7941 12717 25382 22311 10083 11856 24615
7992 24615 15481 11796 10292 10744 15688 20894 31612 32776 32039 33868 38217 39075 29504 19726 10294
$$ packed form
8087A0700j4632p975j4493J2120K9943J0542k8535o612K3821n474n776K3485O693
8074C3807K893o885j7823j2627q264o3O340R582j4295M754O155j5532q738k00
8060b0896J4788J4686J758J4062o406m748J1006r268p138j9022J8136P367j3784
8047E41J386j214J577m48J7903K5761L077k5720k2984r007J9966J1600L336k798
8033B2976J6695l312j9153j4390q218r019J0504M525O940p585n868k132l788R896
8019a929K2386J4559p215j3033j9709o655J4155j2708l184j5695p774Q313Q333
8006b0156K564J1165l060R753K4890p30M291k0776M776J2665l071j2228J773J2759
7992B4615r134l685j504M52M944N206J0718J164p37J829M349Q58r571r778r432
$$ plain form
7977 10294 17702 27406 36346 30823 18970 12313 -66 9815 -1839 -2975 646 2408 -7388 5152
7963 5152 16558 25657 20557 14678 21849 21268 7544 13252 9721 6004 14158 14077 12534 14075 19694
7948 19694 13585 6475 8109 -1454 -10316 -15257 -29226 -14416 -2050 8887 11916 7952 11210 23760
7934 23760 35423 38678 37345 27697 23374 30201 33662 17590 -3100 3360 11878 19647 12462 -5154
7920 -5154 -13649 -16253 -26545 -31655 -20080 -7912 502 -6794 1843 6564 17471 23895 28250 25887
7906 25887 32914 23517 6707 8770 17425 2717 -2641 -9354 -18173 -8358 -3149 -357 7045 -12792
7892 -12792 -26598 -40200 -48389 -43457 -30170 -22055 -23310 -30233 -11790 353 2827 -12977 -6160
7879 -6160 20564 27480 27612 27742 7798 14340 17028 -8758 -17315 -524 9879 -5340 -16252 7397
$$ packed form
7977A0294P408R704Q940n523j1853o657j2379R881j1654j136L621J762r796J2540
7963E152J1406R099n100n879P171n81j3724N708l531l717Q154q1j543J541N619
7948A9694o109p110J634r563q862m941j3969J4810J2366J0937L029l964L258J2550
7934B3760J1663L255j333r648m323O827L461j6072k0690O460Q518P769p185j7616
7920e154q495k604j0292n110J1575J2168Q414p296Q637M721J0907O424M355k363
7906B5887P027r397j6810K063Q655j4708n358o713q819R815N209K792P402j9837
7892a2792j3806j3602q189M932J3287Q115j255o923J8443J2143K474j5804O817
7879f160K6724O916J32J30j9944O542K688k5786q557J6791J0403j5219j0912K3649
$$ plain form
7865 7397 10376 7236 3588 -11022 -16093 -15252 6771 6690 11097 8485 -7942 -31342 -36031 -36316 -27220
7850 -27220 -10627 7928 21001 6381 3052 1637 12725 20085 12485 7421 -1020 -17006 -26212
7837 -26212 -13913 -21464 -29904 -33325 -11741 11831 12287 -5898 -9677 -25389 -3092 -1334 -3385
7824 -3385 11156 17032 19642 25962 27200 20973 12368 15225 15009 14413 12319 4360 -15790 -3787 -9342
7809 -9342 -39605 -28562 -13501 -13486 -16630 -4484 -3978 -13432 -22290 -33333 -38324 -10773 -3091 12809
7795 12809 12819 -8567 -10286 -643 549 2079 25689 31939 16626 -22895 -43376 -37132 -35063 -9338
7781 -9338 -10046 -1686 3059 -1900 -4842 -12283 -21386 -22556 -7519 -9601 -26152 -36933 -25858 9030
7767 9030 13913 13287 -27 13641 23477 3375 -985 4749 -10532 -31021 -26960 -25665 -10272 -3060
$$ packed form
7865G397K979l140l648j4610n071Q41K2023q1M407k612j6427k3400m689k85R096
7850b7220J6593J8555J3073j4620l329j415J1088P360p600n064q441j5986r206
7837b6212J2299p551q440l421K1584K3572M56j8185l779j5712K2297J758k051
7824c385J4541N876K610O320J238o227q605K857k16n96k094p959k0150J2003n555
7809i342l0263J1043J5061J5l144J2146N06r454q858j1043m991K7551P682J5900
7795A2809J0k1386j719R643J192J530K3610O250j5313l9521k0481O244K069K5725
7781i338p08Q360M745m959k942p441r103j170J5037k082j6551j0781J1075L4888
7767I030M883o26j3314J3668R836k0102m360N734j5281k0489M061J295J5393P212
$$ plain form
7753 -3060 -4122 -10406 17154 12048 -14576 -23208 -21646 -31764 -28749 -15650 68 11734 10669
7740 10669 -4200 -23326 -37126 -42228 -28294 -10239 2729 6906 5381 4558 12815 19903 6657
7727 6657 -6344 -7477 -4281 6165 -2915 -11502 -11441 -9473 -20937 -25200 -16196 -35033 -41525 -34387
7713 -34387 -15852 -28284 -20528 -2934 2585 5418 -16574 -21062 -30447 -26359 -18842 -21014 -13461 -21111
7699 -21111 -17324 -17490 -21427 -31504 -24376 -14211 -21293 -19523 -13991 -13580 -21032 -5256 11637 6735
7685 6735 14818 23895 22397 -4770 -12826 -6063 -12076 -9048 -27069 -30171 -24394 -19428 -11722 -3588
7671 -3588 23168 22637 4838 11235 10502 16797 10240 -5979 -18849 -24639 -23473 -3909 -4874 -3520
7657 -3520 -12245 -6701 -3965 6427 13223 23658 34087 1338 1630 5467 20538 13919 -8454 -10826
$$ packed form
7753c060j062o284K7560n106k6624q632J562j0118L015J3099J5718J1666j065
7740A0669j4869j9126j3800n102J3934J8055J2968M177j525q23Q257P088j3246
7727F657j3001j133L196J0446r080q587O1J968j1464m263R004j8837o492P138
7713c4387J8535j2432P756J7594N519K833k1992m488r385M088P517k172P553p650
7699b1111L787j66l937j0077P128J0165p082J770N532M11p452J5776J6893m902
7685F735Q083R077j498k7167q056O763o013L028j8021l102N777M966P706Q134
7671c588K6756n31j7799O397p33O295o557j6219j2870n790J166J9564r65J354
7657c520q725N544K736J0392O796J0435J0429l2749K92L837J5071o619k2373k372
$$ plain form
7643 -10826 -10349 -29353 -29104 -30713 -29437 -15681 -2208 -10356 -25220 -18864 -25582 -20114 -24611 -10772
7629 -10772 5875 -5589 -1842 2369 -7897 -13303 -5678 507 -15734 -8711 4210 5288 11246
7616 11246 8031 -9542 -18167 2026 6149 4465 -4863 -16650 -32417 -28328 -27054 -1886 8055
7603 8055 -5605 5352 3376 4115 895 1082 -11644 -7566 9842 17766 21522 25796 13177 1280
7589 1280 -12019 -23775 -27291 -22406 -13418 -4746 -5326 9432 30700 28777 31630 35623 21757 202
7575 202 -14663 -8612 -6275 -1032 -6621 -12928 -11175 -23057 -24907 -29301 -29037 -16426 -375 -10047
7561 -10047 -9256 -8952 -8970 2449 -14272 -15118 -15690 -10476 -7731 -7856 3818 11066 4940 -20911 -15172
7546 -15172 2980 -5272 -14723 -18464 -20743 -24567 -14463 7202 11792 9311 4927 -4887 9447 20342
$$ packed form
7643a0826M77j9004K49j609J276J3756J3473q148j4864O356o718N468m497J3839
7629a0772J6647j1464L747M211j0266n406P625O185j6241P023J2921J078N958
7616A1246l215j7573q625K0193M123j684r328j1787j5767M089J274K5168R941
7603H055j3660J0957j976P39l220J87j2726M078J7408P924L756M274j2619j1897
7589A280j3299j1756l516M885Q988Q672n80J4758K1268j923K853L993j3866k1555
7575B02j4865O051K337N243n589o307J753j1882j850m394K64J2611J6051r672
7561a0047P91L04j8J1419j6721q46n72N214K745j25J1674P248o126k5851N739
7546a5172J8152q252r451l741k279l824J0104K1665M590k481m384r814J4334J0895
$$ plain form
7532 20342 26669 14308 3705 17664 23579 745 267 9417 -404 8979 5120 -5878 -12736 555
7518 555 -19301 -32917 -34228 -18668 -10826 -32331 -39643 -31629 -38911 -31527 -19864 -7459 -12605 -3315
7504 -3315 15188 8094 10893 11604 -8765 -14118 -18960 -22710 -29109 -32238 -37454 -29978 -21233 -18881 -22135
7489 -22135 -16455 -7482 -13538 -13552 -12490 -26931 -41796 -35846 -14083 19972 26420 21539 5653 8601
7475 8601 8397 6963 17308 24051 25866 16470 17145 10600 11336 -883 -3983 -2881 -8448 -19353 -16177
7460 -16177 -27623 -20992 -26903 -41999 -41622 -41553 -25959 -20154 -24622 -11953 -11928 -1220 9877 9628 16650
7445 16650 21365 22971 24199 11032 -10674 -26804 -40065 -34967 -29587 -23338 -19259 -9999 -2472 -1076
7431 -1076 -22204 -23920 -12842 -16642 -13659 -346 15818 14002 11034 5127 -4669 -1896 -9530 -29544
$$ packed form
7532B0342O327j2361j0603J3959N915k2834m78R150r821R383l859j0998o858J3291
7518E55j9856j3616j311J5560P842k1505p312Q014p282P384J1663J2405n146R290
7504c315J8503p094K799P11k0369n353m842l750o399l129n216P476Q745K352l254
7489b2135N680Q973o056j4J062j4441j4865N950K1763L4055O448m881j5886K948
7475H601k04j434J0345O743J815r396O75o545P36j2219l100J102n567j0905L176
7460a6177j1446O631n911j5096L77O9J5594N805m468J2669K5J0708J1097k49P022
7445A6650M715J606J228j3167k1706j6130j3261N098N380O249M079R260P527J396
7431a076k1128j716J1078l800K983J3313J6164j816k968n907r796K773p634k0014
$$ plain form
7417 -29544 -37446 -43138 -23473 -11418 11176 14755 8482 -6718 -19758 -13404 2262 11169 25587
7404 25587 12283 -14735 -9007 -30248 -30487 -16078 -9064 4946 5517 28151 27323 14975 -5025
7391 -5025 -18857 -46438 -36647 -12226 -5826 -5311 4300 4459 -3301 -3737 -23917 -21810 -2491 -4052
7377 -4052 -14407 -22475 -18533 -373 -1622 3768 12924 -5092 -6663 1816 22659 20273 4497 1048
7363 1048 8505 16297 17775 26298 17476 23666 39739 29129 19080 8242 -2758 8450 2175
7350 2175 -4654 4094 1484 -4076 7132 25126 8006 1619 -1893 -1846 5560 -514 -15350 -23983
7336 -23983 -16877 -20646 -16765 -7569 -2694 -5246 -6393 -10588 -96 1391 -9406 -14815 -11838 -9809
7322 -9809 -12015 -9402 -3915 10970 33571 20293 10198 18312 33081 15743 17076 7948 8565 3401
$$ packed form
7417b9544p902n692J9665J2055K2594L579o273j5200j3040O354J5666Q907J4418
7404B5587j3304k7018N728k1241k39J4409P014J4010N71K2634q28j2348k0000
7391e025j3832k7581R791K4421O400N15R611J59p760m36k0180K107J9319j561
7377d052j0355q068L942J8160j249N390R156j8016j571Q479K0843k386j5776l449
7363A048P457P792J478Q523q822O190J6073j0610j0049j0838j1000J1208o275
7350B175o829Q748k610n560J1208J7994j7120o387l512M7P406o074j4836q633
7336b3983P106l769L881R196M875k552j147m195J0492J487j0797n409K977K029
7322i809k206K613N487J4885K2601j3278j0095Q114J4769j7338J333r128O17n164
$$ plain form
7308 3401 6455 5812 -14726 -35139 -29201 -16416 3786 20573 30188 38849 39399 43795 65224 43327
7294 43327 33362 25535 -1129 -19991 -16946 -1733 5113 2380 -10990 -28689 -33136 -13810 -25931
7281 -25931 -37375 -37930 -26611 -31542 -42362 -18535 -5736 -3886 -2532 -499 4717 4588 -8651 -7656
7267 -7656 -12089 -9482 -16560 -21308 -7254 -11050 -28109 -33311 -36896 -40228 -56867 -58315 -38959 -33315
7253 -33315 -47449 -44680 -39383 -25527 -31804 -27809 -44996 -35048 -27163 -24540 -14096 -14874 -8312 -24803
7239 -24803 -37328 -27186 -2077 4644 -1418 -20735 -31574 -35287 -35566 -23788 -17358 -457 4256
7226 4256 313 -15903 3096 5026 21113 23193 -4853 10689 1738 2849 -5157 -8540 -10738 -9082
7212 -9082 -17237 -10191 -17818 -9424 -3816 -13009 -15092 -19975 -21561 -22425 -23705 -23309 -29687 -11201 -14881
$$ packed form
7308C401L054o43k0538k0413N938J2785K0202J6787R615Q661N50M396K1429k1897
7294D3327r965p827k6664j8862L045J5213O846k733j3370j7699m447J9326j2121
7281b5931j1444n55J1319m931j0820K3827J2799J850J354K033N216j29j3239R95
7267g656m433K607p078m748J4054l796j7059n202l585l332j6639j448J9356N644
7253c3315j4134K769N297J3856o277L995j7187R948P885K623J0444p78O562j6491
7239b4803j2525J0142K5109O721o062j9317j0839l713k79J1778O430J6901M713
7226D256l943j6216J8999J930J6087K080k8046J5542q951J111q006l383k198J656
7212i082q155P046p627Q394N608r193k083m883j586q64j280L96o378J8486l680
$$ plain form
7197 -14881 -35520 -40240 -27485 -24019 -15084 -4193 2309 -7318 -18576 -10398 -11893 -11171 -8277 -14888
7183 -14888 -16508 -8289 15400 37385 24751 20796 7589 14791 -3742 -12264 -23809 -16691 -21007
7170 -21007 -21006 -15767 -11757 -27822 -46754 -50818 -18402 3625 14715 8523 20930 31889 19399
7157 19399 10761 5111 -15371 -8979 -9798 -16992 -35068 -25313 -29683 -23670 -10194 -40225 -44497 -34100
7143 -34100 -52415 -61743 -34724 -12534 -10131 -14635 -6295 -9876 -13308 -3107 2539 6368 6715 -1309
7129 -1309 -20452 -26284 -19798 -15579 -25657 -34090 -22952 -17960 -21480 -14422 -27971 -41404 -38123 -21966
7115 -21966 -16519 -14557 -878 13506 5506 4947 -4543 -10476 -19162 -28703 -31886 -16650 217 13632
7101 13632 10920 -3723 -16721 -18767 -17898 -25916 -27919 -16818 447 -5469 -7737 -12844 -17933 -2637
$$ packed form
7197a4881k0639m720J2755L466Q935J0891O502r627j1258Q178j495P22K894o611
7183a4888j620Q219K3689K1985j2634l955j3207P202j8533q522j1545P118m316
7170b1007JN239M010j6065j8932m064L2416K2027J1090o192J2407J0959j2490
7157A9399q638n650k0482O392q19p194j8076R755m370O013J3476l0031m272J0397
7143c4100j8315r328K7019K2190K403m504Q340l581l432J0201N646L829L47q024
7129a309j9143n832O486M219j0078q433J1138M992l520P058j3549j3433L281J6157
7115b1966N447J962J3679J4384q000n59r490n933q686r541l183J5236J6867J3415
7101A3632k712j4643j2998k046Q69q018k003J1101J7265n916k268n107n089J5296
$$ plain form
7087 -2637 22156 24538 -707 -8306 -16901 -1829 -823 -1460 5092 -11751 -18393 -12458 -11551 -17294
7073 -17294 -41072 -31550 -13814 11611 12703 -33 -8251 -12232 -15012 -30605 -35668 -42038 -27843
7060 -27843 -11282 -3544 -6349 -794 -4559 4425 11154 -3285 -28807 -16451 -2186 1162 6214
7047 6214 -13631 -36098 -40655 1230 27947 16723 415 508 12871 20707 9680 -4441 3078
7034 3078 1255 -18069 -32502 -34886 -25708 -38261 -41002 -11521 15377 21331 16127 6970 -3670
7021 -3670 7345 8730 8010 -5808 -2626 -7803 -10432 1240 -7562 -1528 8159 7550 20324 25182
7007 25182 18284 3825 -14469 -9904 2684 2260 -15273 -19906 -15668 -10291 -8727 7797 7896 8809
6993 8809 6042 63 -6581 -24055 -49818 -49292 -40967 -29795 -23691 -7634 -12442 -21755 -20072 -12978
$$ packed form
7087b637K4793K382k5245p599q595J5072J006o37O552j6843o642N935R07n743
7073a7294k3778R522J7736K5425J092j2736q218l981k780j5593n063o370J4195
7060b7843J6561P738k805N555l765Q984O729j4439k5522J2356J4265L348N052
7047F214j9845k2467m557M1885K6717j1224j6308R3J2363P836j1027j4121P519
7034C078j823j9324j4433k384R178j2553k741K9481K6898N954n204r157j0640
7021c670J1015J385p20j3818L182n177k629J1672q802O034R687o09J2774M858
7007B5182o898j4459j8294M565J2588m24j7533m633M238N377J564J6524R9R13
6993H809k767n979o644j7474k5763N26Q325J1172O104J6057m808r313J683P094
$$ plain form
6979 -12978 3251 177 -12273 -7358 4719 -325 -9607 -7806 -9472 -30760 -20460 -7448 -14320
6966 -14320 -32165 -21283 -5210 11741 19375 17617 19998 -5903 -6299 2672 -6091 -6563 2820 -3184
6952 -3184 3275 4537 95 -14435 -12319 -1818 14747 21845 13884 22360 6187 -19277 -14738 -7106
6938 -7106 -4379 -14894 -29847 -25171 -11040 -5730 -9957 16054 21497 17729 14468 10022 18172 26376
6924 26376 29592 30203 14936 -14873 -20105 -14464 -9303 2062 -23672 -29762 -16512 -21048 -31821
6911 -31821 -24368 -5010 -14896 -4065 17563 15369 50 3390 9411 4141 23254 11052 -7575
6898 -7575 5968 9545 27836 24895 -557 1914 5006 6712 -12441 -10187 -3273 3583 24156 21309
6884 21309 6466 10855 39987 33483 22776 23507 9931 8965 22106 14016 -21561 -35804 -30226
$$ packed form
6979a2978J6229l074j2450M915J2077n044r282J801j666k1288J0300J3012o872
6966a4320j7845J0882J6073J6951P634j758K381k5901l96Q971q763m72R383o004
6952c184O459J262m442j4530K116J0501J6565P098p961Q476j6173k5464M539P632
6938g106K727j0515j4953M676J4131N310m227K6011N443l768l261m446Q150Q204
6924B6376L216O11j5267k9809n232N641N161J1365k5734o090J3250m536j0773
6911c1821P453J9358r886J0831K1628k194j5319L340O021n270J9113j2202j8627
6898g575J3543L577J8291k941k5452K471L092J706j9153K254O914O856K0573k847
6884B1309j4843M389K9132o504j0707P31j3576r66J3141q090l5577j4243N578
$$ plain form
6871 -30226 -6086 5966 7386 3135 12027 16337 19199 13116 5518 24123 13967 -4970 -397
6858 -397 10323 2987 10582 10631 15046 32933 47703 51812 42235 22677 12250 18834 200 4401
6844 4401 14836 7234 3626 26327 38910 32643 28798 34401 30768 33625 30173 15172 26599 39022
6830 39022 31325 4987 5786 22014 27933 23805 3485 -12864 -13715 -12849 -15918 -12589 -6088 863
6816 863 3215 -2625 6393 -20846 -30220 -10827 11655 29171 16849 -10817 -17082 6675 4462
6803 4462 14538 3293 -125 9794 20040 780 -396 3876 -4758 -16805 -6820 7390 4984
6790 4984 11757 12102 18672 28042 26993 17571 -4591 -19969 -21893 -19712 -15630 -27429 -30295 -21424
6776 -21424 -32514 -43570 -29021 -6330 13947 33716 29461 30538 22731 21556 10498 24992 34790
$$ packed form
6871c0226K4140J2052J420m251Q892M310K862o083p598J8605j0156j8937M573
6858c97J0720p336P595M9M415J7887J4770M109r577j9558j0427O584j8634M201
6844D401J0435p602l608K2701J2583o267l845N603l633K857l452j5001J1427J2423
6830C9022p697k6338P99J6228N919m128k0320j6349q51Q66l069L329O501O951
6816H63K352n840R018k7239r374J9393K2482J7516j2322k7666o265K3757k213
6803D462J0076j1245l418R919J0246j9260j176M272q634j2047R985J4210k406
6790D984O773L45O570R370j049r422k2162j5378j924K181M082j1799k866Q871
6776b1424j1090j1056J4549K2691K0277J9769m255J077p807j175j1058J4494R798
$$ plain form
6763 34790 18681 6001 1925 1661 -6124 -18322 -4294 -148 -7261 1660 8933 -5776 -2905 5852
6749 5852 -2484 -13594 -18505 -11021 -19268 -19113 -6708 -8256 -30678 -15408 -4357 -18475 -27105 -21654
6735 -21654 -28419 -26156 -13675 -11955 -13270 -5035 -2609 -13487 -22973 -19022 -10497 -6622 -8545 -19153
6721 -19153 -11081 -19148 -17063 -22691 -119 5126 -3492 -4083 -3285 766 18112 15893 16301 27728 13164
6706 13164 -9084 -6422 3358 -2370 -21046 -30672 -29167 -3191 16194 12551 1510 405 -4084
6693 -4084 -5504 -14703 -9039 14144 19284 6897 -10962 -2009 8371 -16752 -28163 -21206 -33576
6680 -33576 -41249 -18952 971 -4739 -19926 -9372 -15919 -40160 -51732 -35790 -27033 -23781 -18302
6667 -18302 -28319 -17952 -21807 -21540 -7069 -746 -97 739 6378 -230 -412 -7198 -23358 -15008 -25874
$$ packed form
6763C4790j6109j2680m076k64p785j2198J4028M146p113Q921P273j4709K871Q757
6749E852q336j1110m911P484q247J55J2405j548k2422J5270J1051j4118q630N451
6735b1654o765K263J2481J720j315Q235K426j0878r486L951Q525L875j923j0608
6721a9153Q072q067K085n628K2572N245q618n91P98M051J7346k219M08J1427j4564
6706A3164k2248K662R780n728j8676r626J505K5976J9385l643j1041j105m489
6693d084j420r199N664K3183N140j2387j7859Q953J0380k5123j1411O957j2370
6680c3576p673K2297J9923n710j5187J0554o547k4241j1572J5942Q757L252N479
6667a8302j0017J0367l855K67J4471O323O49Q36N639o608j82o786j6160Q350j0866
$$ plain form
6652 -25874 -32120 -24119 -18883 -29461 -41373 -46288 -34855 -45397 -42218 -38439 -37848 -36473 -32496 -41251
6638 -41251 -29099 -25778 -14942 411 20558 6310 1390 12211 15102 9562 -4054 -15754 -30764
$$ packed form
6652b5874o246Q001N236j0578j1912m915J1433j0542L179L779N91J375L977q755
6638d1251J2152L321J0836J5353K0147j4248m920J0821K891n540j3616j1700j5010
$$ [...]
##END NTUPLES=NMR SPECTRUM
##END=
