##TITLE=Analysis number 314075
Compound Code cc 06346
Book Reference 440/72
Project Code adrs
Chemist Name craigr
##JCAMPDX= 6.0         $$ Bruker NMR JCAMP-DX V2.0
##DATA TYPE= NMR SPECTRUM
##DATA CLASS= NTUPLES
##ORIGIN= Bruker BioSpin GmbH
##OWNER= NMR
$$ XWIN-NMR		Version 3.5
$$ Tue Oct  4 14:25:57 2005 GMT Daylight Time (UT+1h)  MAYBRIDGE\NMR@NMR_250MHZ
##.OBSERVE FREQUENCY= 250.131544655141
##.OBSERVE NUCLEUS= ^1H
##.ACQUISITION MODE= SIMULTANEOUS (DQD)
##.ACQUISITION SCHEME= undefined
##.AVERAGES= 16
##.DIGITISER RES= 18
##SPECTROMETER/DATA SYSTEM= dpx250
##.PULSE SEQUENCE= zg30
##.SOLVENT NAME= CDCl3
##.SHIFT REFERENCE= (INTERNAL, CDCl3, 0, 16.4502)
##AUDIT TRAIL= $$ (NUMBER, WHEN, WHO, WHERE, WHAT)
$$ ##TITLE= Audit trail, XWIN-NMR		Version 3.5
$$ ##JCAMPDX= 5.01
$$ ##ORIGIN= Bruker BioSpin GmbH
$$ ##OWNER= NMR
$$ C:\u/data/dgb/nmr/ADRS/10440/pdata/1/auditp.txt
$$ ##AUDIT TRAIL=  $$ (NUMBER, WHEN, WHO, WHERE, WHAT)
(   1,<2005-10-04 14:25:39.10 +100>,<MAYBRIDGE\NMR>,<NMR_250MHZ>,
      <created by zg, POWCHK disabled, PULCHK disabled
       configuration hash MD5:
       62 19 C7 07 E1 42 D1 B7 37 6C 3D D0 77 39 F9 E6
       data hash MD5: 64K
       96 25 9B F9 42 6E BC 25 17 9E E4 5E DE 19 29 2A>)
(   2,<2005-10-04 14:25:49.77 +100>,<MAYBRIDGE\NMR>,<NMR_250MHZ>,
      <Start of raw data processing
       ef LB = 0.3 FT_mod = 6 PKNL = 1 SI = 32K 
       data hash MD5: 32K
       E9 6E 7D 89 CF 85 8D C6 7A 33 C3 F3 21 92 57 33>)
(   3,<2005-10-04 14:25:51.38 +100>,<MAYBRIDGE\NMR>,<NMR_250MHZ>,
      <apk 
       data hash MD5: 32K
       07 CD EB 6C 63 85 08 47 89 F9 62 EF 2B FD 0B D6>)
(   4,<2005-10-04 14:25:52.05 +100>,<MAYBRIDGE\NMR>,<NMR_250MHZ>,
      <abs ABSG = 5 
       data hash MD5: 32K
       A1 D7 DE 01 E7 42 A8 3C DF 0A F6 3B CE 2E A3 6B>)
$$ ##END=
$$ 
$$ hash MD5
$$ 8F 76 E6 33 FD B7 A6 C1 9C 30 C6 11 18 FF F2 D9
##$RELAX= 
##$RELAX= 
##$RELAX= 
##$RELAX= 
##$RELAX= 
##$RELAX= 
##$RELAX= 
$$ Bruker specific parameters
$$ --------------------------
##$DU= <C:\u>
##$EXPNO= 10440
##$NAME= <ADRS>
##$PROCNO= 1
##$TYPE= <nmr>
##$USER= <dgb>
##$AMP= (0..31)
100 100 100 100 100 100 100 100 100 100 100 100 100 100 100 100 100 100 
100 100 100 100 100 100 100 100 100 100 100 100 100 100 
##$AQSEQ= 0
##$AQ_mod= 3
##$AUNM= <au_zg>
##$AUTOPOS= <42 >
##$BF1= 250.13
##$BF2= 250.13
##$BF3= 250.13
##$BF4= 250.13
##$BF5= 500.13
##$BF6= 500.13
##$BF7= 500.13
##$BF8= 500.13
##$BYTORDA= 1
##$CFDGTYP= 0
##$CFRGTYP= 5
##$CHEMSTR= <none>
##$CNST= (0..31)
1 1 145 1 1 1 1 1 1 1 1 1 1 1 1 1 1 1 1 1 1 1 1 1 1 1 1 1 1 1 1 1 
##$CPDPRG= <>
##$CPDPRG1= <>
##$CPDPRG2= <>
##$CPDPRG3= <>
##$CPDPRG4= <mlev>
##$CPDPRG5= <mlev>
##$CPDPRG6= <mlev>
##$CPDPRG7= <mlev>
##$CPDPRG8= <mlev>
##$CPDPRGB= <>
##$CPDPRGT= <>
##$D= (0..31)
0 1 0 0 0 0 0 0 0 0.06 0 0 0 0 0 0 0.0002 0 0 0 0 0 0 0 0 0 0 0 0 0 0 
0 
##$DATE= 1128432337
##$DBL= (0..7)
120 120 120 120 120 120 120 120 
##$DBP= (0..7)
150 150 150 150 150 150 150 150 
##$DBP07= 0
##$DBPNAM0= <>
##$DBPNAM1= <>
$$ [...]
##$SUBNAM7= <"">
##$SUBNAM8= <"">
##$SUBNAM9= <"">
##$SW= 20.6930455092707
##$SWIBOX= (0..15)
0 0 3 0 0 0 0 0 0 0 0 0 0 0 0 0 
##$SW_h= 5175.983436853
##$TD= 65536
##$TD0= 1
##$TE= 296.16
##$TE2= 300
##$TE3= 300
##$TEG= 300
##$TL= (0..7)
0 120 120 120 120 120 120 120 
##$TP= (0..7)
150 150 150 150 150 150 150 150 
##$TP07= 0
##$TPNAME0= <>
##$TPNAME1= <>
##$TPNAME2= <>
##$TPNAME3= <>
##$TPNAME4= <>
##$TPNAME5= <>
##$TPNAME6= <>
##$TPNAME7= <>
##$TPOAL= (0..7)
0.5 0.5 0.5 0.5 0.5 0.5 0.5 0.5 
##$TPOFFS= (0..7)
0 0 0 0 0 0 0 0 
##$TUNHIN= 0
##$TUNHOUT= 0
##$TUNXOUT= 0
##$USERA1= <user>
##$USERA2= <user>
##$USERA3= <user>
##$USERA4= <user>
##$USERA5= <user>
##$V9= 5
##$VALIST= <valist>
##$VCLIST= <CCCCCCCCCCCCCCC>
##$VD= 0
##$VDLIST= <DDDDDDDDDDDDDDD>
##$VPLIST= <PPPPPPPPPPPPPPP>
##$VTLIST= <TTTTTTTTTTTTTTT>
##$WBST= 1024
##$WBSW= 4
##$XGAIN= (0..3)
0 0 0 0 
##$XL= 0
##$YL= 0
##$YMAX_a= 403645
##$YMIN_a= -421736
##$ZGOPTNS= <>
##$ZL1= 120
##$ZL2= 120
##$ZL3= 120
##$ZL4= 120
##$ABSF1= 16.45018
##$ABSF2= -4.242992
##$ABSG= 5
##$ABSL= 3
##$ALPHA= 0
##$AQORDER= 0
##$ASSFAC= 0
##$ASSFACI= 0
##$ASSFACX= 0
##$ASSWID= 0
##$AUNMP= <proc_1d>
##$AZFE= 0.1
##$AZFW= 0.1
##$BCFW= 0
##$BC_mod= 0
##$BYTORDP= 0
##$COROFFS= 0
##$CY= 12.5
##$DATMOD= 1
##$DC= 0
##$DFILT= <>
##$DTYPP= 0
##$F1P= 14.0000005364418
##$F2P= -0.99999901652339
##$FCOR= 0.5
##$FTSIZE= 32768
##$FT_mod= 6
##$GAMMA= 0
##$GB= 0
##$INTBC= 1
##$INTSCL= 1
##$ISEN= 128
##$LB= 0.3
##$LEV0= 0
##$LPBIN= 0
##$MAXI= 10000
##$MC2= 0
##$MEAN= 0
##$ME_mod= 0
##$MI= 0
##$NCOEF= 0
##$NC_proc= -3
##$NLEV= 6
##$NOISF1= 0
##$NOISF2= 0
##$NSP= 0
##$NTH_PI= 0
##$NZP= 0
##$OFFSET= 16.45018
##$PC= 1
##$PHC0= -61.8895
##$PHC1= 5.810089
##$PH_mod= 1
##$PKNL= yes
##$PPARMOD= 0
##$PSCAL= 4
##$PSIGN= 0
##$REVERSE= no
##$SF= 250.130017963499
##$SI= 32768
##$SIGF1= 0
##$SIGF2= 0
##$SINO= 400
##$SIOLD= 32768
##$SREGLST= <1H.CDCl3>
##$SSB= 0
##$STSI= 32768
##$STSR= 0
##$SW_p= 5175.98343685301
##$SYMM= 0
##$S_DEV= 0
##$TDeff= 65536
##$TDoff= 0
##$TI= <Analysis number 999999
Compound Code 99
Book Reference 9
Project Code 9>
##$TILT= no
##$TM1= 0
##$TM2= 0
##$TOPLEV= 0
##$USERP1= <user>
##$USERP2= <user>
##$USERP3= <user>
##$USERP4= <user>
##$USERP5= <user>
##$WDW= 1
##$XDIM= 32768
##$YMAX_p= 390160130
##$YMIN_p= -74494
$$ End of Bruker specific parameters
$$ ---------------------------------
##NTUPLES= NMR SPECTRUM
##VAR_NAME=  FREQUENCY,     SPECTRUM/REAL,   SPECTRUM/IMAG
##SYMBOL=    X,             R,               I
##VAR_TYPE=  INDEPENDENT,   DEPENDENT,       DEPENDENT
##VAR_FORM=  AFFN,          ASDF,            ASDF
##VAR_DIM=   32768,         32768,           32768
##UNITS=     HZ,            ARBITRARY UNITS, ARBITRARY UNITS
##FACTOR=    0.157963299565203, 1,           1
##FIRST=     4114.68383233751, 0,            0
##LAST=      -1061.2996045155, 0,            0
##MIN=       -1061.2996045155, -74494,       0
##MAX=       4114.68383233751, 390160130,    0
$$ Real data points
##PAGE= N=1
##DATA TABLE= (X++(R..R)), XYDATA
$$ [...]
23544 -5540 14177 14222 10546 7856 4089 -11149 -23280 -25622 -14463 5937 2568 12314 5024 19783
23530 19783 19477 7044 10091 -8389 -29021 -34744 -6508 35308 58399 43764 9140 -20196
23518 -20196 -24268 -20781 -8421 5075 17692 44902 47946 34026 24038 22161 18020 2631 -17513
23505 -17513 -1916 8968 3588 347 454 -10795 -26844 -32423 -26643 -19501 -5540 16281 -3824
23492 -3824 3193 11888 5587 1819 -11412 -5735 -7382 -17148 -15655 -10391 -17005 -4904 9994 15109
23478 15109 21427 34352 21784 24291 23544 13834 7070 11380 24617 16972 7526 2810 -201 32
23464 32 10460 5782 1512 -13948 -19158 -17936 -20315 524 14548 -3362 -14853 -22038 -27761 -21287
23450 -21287 -2787 -10755 1065 5294 -8364 -32223 -39181 -37724 -15452 -2455 3691 101 -13675
23437 -13675 -14844 -8939 -3342 -8605 -2784 20974 14006 20887 29038 27131 18411 25214 35769 19577
23423 19577 1476 4316 15286 21241 -1716 -6672 -12295 -30170 -33605 -28374 -25559 -20983 -16946
23410 -16946 -422 10878 12577 4122 -10279 -20756 -10712 -20420 -19345 9510 11027 -7377 -12232
23397 -12232 -7072 8924 27557 33043 27095 30365 24619 4452 -14741 -17910 -13271 -22276 -21440 -16483
23383 -16483 1106 21781 14875 16107 16417 7836 -21566 -40722 -30119 -17546 -2682 9582 9975
23370 9975 -6551 8874 6316 13539 32626 48239 34365 12225 -3447 2443 1782 -1819 9824
23357 9824 17791 26587 31677 5686 -18392 -37897 -33034 -13782 539 -6646 -11020 -4311 -5447
23344 -5447 -17189 -15941 -15621 -2021 2666 -11458 -23871 -30309 -31356 -35208 -25849 -10724 -6191 -1130
23330 -1130 -15689 -26382 -42283 -46295 -43245 -52155 -34267 -31737 -30016 -14659 1190 -7219 -3012
23317 -3012 3334 31244 41162 24394 27247 31506 30476 30399 32894 19798 5214 -4708 -5439 -2487
23303 -2487 -2193 -5552 -4543 7449 282 -5891 -9664 -19507 -24393 -27610 -12423 -17786 -29591 -14809
23289 -14809 -14376 2406 4710 6630 13027 23616 13733 3019 14585 -2467 -33551 -38421 -46899
23276 -46899 -32817 -186 -3996 -24792 -31143 -27222 -12701 -22596 -26327 -20315 -20761 -11602 -12561 -8821
23262 -8821 7108 9938 8700 4396 7911 24427 29398 6294 7599 27597 22497 8929 11247
23249 11247 11251 -13803 -12604 -14443 -16777 -32853 -28220 -28035 -14342 -16583 -28405 -26633 -29827 -5825
23235 -5825 -4658 -21074 -32141 -11817 13409 10454 11382 -2387 -4295 -14982 686 7123 4049
23222 4049 11241 15354 10393 4600 9617 16580 16780 2645 -11966 -1288 6455 -9292 1118 14871
23208 14871 22205 22769 36325 37260 21846 35130 57423 46795 23977 2695 16262 25300 11583
23195 11583 17349 26813 28162 16379 12484 8901 12435 23323 11263 1020 19786 36289 28920
23182 28920 30370 11264 -17888 -41804 -52818 -45101 -42023 -15612 -20128 -26651 -8048 -6111 -17479
23169 -17479 -26561 -8250 -4483 7249 10576 3031 20362 18608 -11528 -19211 -16349 -25353 -22991
23156 -22991 -8925 -4123 4218 -247 2098 -16712 -24058 -20627 -18969 -12176 3784 8540 10723 8455
23142 8455 11519 24043 31314 6279 -4693 960 4348 -241 4437 5018 2176 9021 -212 -7547
23128 -7547 -11888 -7227 -13036 -818 8811 8588 11630 13978 10212 16894 -184 -555 -16617 -16226 -27414
23113 -27414 -28116 -21042 -22610 -27725 -38867 -17506 12780 25500 30750 46571 27159 12052 -2544
23100 -2544 -4258 -10737 -17727 -16190 -22695 -25431 1367 8466 -402 -1895 -22294 -22373 -2410 -21592
23086 -21592 -34949 -24511 -5617 10505 2079 4509 -2347 -10725 -9686 -4796 -8794 -14114 -3532
23073 -3532 5965 20224 36917 33169 24894 27072 6422 -7344 1649 1122 13631 14419 -3635 -680
23059 -680 -7281 -19854 -25240 -31051 -17972 -1915 16408 21273 20368 14034 -7737 -33449 -44682
23046 -44682 -42371 -44655 -36348 -19645 -12828 -18275 -29293 -41934 -47091 -26050 -11959 -5961 -8657
23033 -8657 -20774 -20898 -15130 -23325 -27766 -3167 28910 26346 21149 15750 12615 4760 -13262 -13774
23019 -13774 -357 -18844 -24347 -6119 2683 4192 9643 -7191 -7616 -1615 -10329 804 3163
23006 3163 -4787 -7570 -7511 -16715 -14694 -11174 1292 8996 14524 4486 17173 12327 5646 -23088
22992 -23088 -24361 3102 11303 14637 5134 -1535 -12605 -21538 -14462 -751 5627 -514 -826 -2814
22978 -2814 12648 23776 20287 8251 16930 34396 45748 42269 7992 -6158 3434 10193 9335
22965 9335 -1548 11560 17842 11909 499 1120 -9349 -7443 -2037 -5391 770 4071 8238 -1202
22951 -1202 -2563 24520 26325 18011 2248 -77 10324 8688 16792 5664 -17942 -22118 -25877
22938 -25877 -8273 2076 2291 -267 10967 26023 19213 -3090 -10236 1907 4649 -2221 -3036
22925 -3036 -22971 -36179 -20593 6751 -401 -18923 -7258 -2774 4273 -5770 -14976 548 -1695
22912 -1695 -1319 -883 5373 4013 -4814 -5285 -10505 -30470 -28455 -23972 -33221 -29842 -21086 7196 12999
22897 12999 -5047 -8328 -25358 -33787 -35876 -38857 -30920 -31997 -22882 -7832 -10045 -2299 3037 -7776
22883 -7776 1682 -454 7744 -3121 4913 -4366 -592 1959 6395 -2284 -11147 8448 6340 15576
22869 15576 34432 30739 12777 2117 -6853 -11776 -7808 -1058 -11795 -27491 -16550 1449 -1612
22856 -1612 -7534 -5686 2817 7029 -7139 -6596 -10392 -2029 -8816 -18414 -24280 -19707 -16579 2323
22842 2323 15670 8282 -7645 -8311 -5605 -10995 -12906 -26245 -21743 -23642 -36256 -22226 -30026 -24102
22828 -24102 -21710 -26074 -4353 6713 15843 25550 21337 11357 -5685 -3593 -8270 -13499 -6169 -1526
22814 -1526 10370 16022 -165 -7414 -15025 2984 2625 -19278 -27489 -22597 -24022 -24066 -39762 -53843
22800 -53843 -34549 -20448 -26551 -37745 -6686 12178 9687 19493 23118 1001 -7055 -19062 -23676
22787 -23676 -19349 -25548 -15191 -27386 -35044 -15450 -5974 -22036 -3435 23725 35212 36932 30586
22774 30586 26554 30962 13667 -9097 -13562 -15762 -5040 4381 -13046 -11162 11529 12882 785
22761 785 -22441 -25676 -19231 -10762 -1380 -8961 -17713 2262 15283 14271 13888 -19128 -34295 -16876
22747 -16876 -11037 -33295 -24817 -10512 2619 8261 10619 7426 6641 23159 16245 -16719 -8439
22734 -8439 11105 5260 3154 20457 16296 9913 1200 -20397 -9133 18184 13128 4691 84
22721 84 1709 2985 13539 9227 9740 2489 1094 13276 16735 -4697 -16739 -17802 -23161 -20517
22707 -20517 -14096 -24896 -10140 -1557 3926 -10020 -8037 -2621 -7961 -3738 -9715 2443 -1983
22694 -1983 -4103 26649 29953 17770 8244 -11575 -7602 -2771 -3372 -10733 2869 12023 5076 -4452
22680 -4452 -897 9209 10276 -10232 -6145 4823 20927 28421 25533 9566 2858 15598 16127
22667 16127 -2184 -10691 -23741 -30240 -27317 -28177 -20999 6 7892 11023 27841 24429 28831 18714
22653 18714 -16570 -7512 12111 9488 -654 -2243 977 6418 25031 20825 4379 7339 7624
22640 7624 5787 -11534 -12239 -18204 -9785 16384 31198 20541 14431 21220 26968 10314 4499 -282
22626 -282 2570 -8250 -16479 -8928 -2504 4599 8278 6094 -4736 -19455 -11035 -4799 -10424 -10970
22612 -10970 -10414 -20443 1731 25529 25660 -554 -5797 -998 577 3398 -5053 -6246 9560 15793
22598 15793 11962 16952 19131 -1672 -666 -4816 -17166 -12494 -1317 855 -4138 -19001 -18479 14581
22584 14581 11268 4097 8578 5821 -6168 -14776 -1805 2921 -8242 22778 33937 18736 -15182
22571 -15182 -29131 -13804 -13414 -8015 -6475 -5286 -19002 -15829 -10484 -12702 -15867 -16276 -20972 -34162
22557 -34162 -42307 -37130 -23494 -21396 -4558 -11457 2636 -1253 -4811 -2476 14584 11865 843
22544 843 3776 8362 24533 18906 18729 28745 9477 -9657 -19175 -18246 2251 11709 21020 18828
22530 18828 20381 9773 6235 18663 27019 13974 9588 1541 -21251 -32235 -21542 -11397 -16123
22517 -16123 -24727 -24923 -3348 -10231 -23850 -5686 -6686 -18507 -17383 -19827 -34073 -31716 -19335
22504 -19335 -5247 -12907 -17366 -20519 -27068 -16067 -7680 6460 26609 15893 2904 -4381 -13173
22491 -13173 4639 15431 16219 -3418 -19328 9094 25542 22791 11078 -8078 -9778 3832
22479 3832 12776 6044 -3303 -10384 -25789 -31809 -22037 -9096 -9638 -26567 -17409 -1166 -600 -10717
22465 -10717 7654 25007 11830 -12263 -27391 -10608 -12610 -4439 -939 11214 9851 8049 14154
22452 14154 19924 29131 27615 7675 -8009 -10343 -18228 -17239 -1500 7385 -5012 -9688 -586 11430
22438 11430 -5563 -1967 7919 -2110 -9691 -3447 16334 18183 -2898 -14108 -14955 -13625 -17285
22425 -17285 6771 7663 6704 23320 4555 -10976 -27460 -43447 -31124 -17954 -18336 2 12115
22412 12115 9412 5377 -4317 -9724 -8514 -13231 -18600 1849 25906 11479 6624 9885 14128 4490
22398 4490 15348 14877 -2817 -20088 -5363 1643 3480 6508 -10046 -14381 -10247 1807 -5460
22385 -5460 -10381 1933 12115 12835 6300 -1638 -16452 3964 5322 -17408 -15752 7362 2369
22372 2369 -11381 -23199 -20730 -20285 -31468 -27683 -32689 -25379 -8429 5329 15514 9410 -6984
22359 -6984 -19286 -42306 -29519 -1349 16897 35088 33179 35480 22885 11597 4529 -5021 -8459
22346 -8459 -7377 -20201 -9751 2427 -736 1847 14141 15804 3896 2337 1092 6467 15976
22333 15976 14575 -260 -9506 -18937 -13050 184 -4093 -5073 12308 -7732 -21325 -17499 -5870
22320 -5870 14939 17385 2530 -18261 -31886 -12157 -9458 -20543 -45613 -57872 -51265 -37315
22308 -37315 -42136 -28596 -29444 -28405 -15469 5971 10214 14319 -2345 -11223 -13013 -17444 -27655
22295 -27655 -10708 10207 7077 423 -7837 -18513 -3797 -10467 -15662 4877 10887 2995 12750
22282 12750 -8174 -6840 6882 9346 20466 9747 -4014 -16485 -14106 -15535 -13235 -14473 -21854
22269 -21854 -23119 -12845 -566 8955 23031 43550 62112 49110 17916 2046 -2510 -15369
22257 -15369 -33041 -39012 -10129 -9801 5064 11914 4004 -9977 -16649 -34704 -23473 -13630 -5216
22244 -5216 -11402 -19331 -31878 -23453 -4940 -11128 1891 5946 27433 18745 7034 7936 -13751
22231 -13751 -33949 -29810 -24817 -20648 -27076 -47551 -48538 -33869 -16017 -16953 -15448 -10648 -26190 -12773
22217 -12773 7669 13537 11636 -13646 -33718 -31681 -17308 -6307 -1748 -562 3003 1522 -4394
22204 -4394 -9928 -18152 -11747 12147 9930 547 -278 12879 12845 17037 3344 -14790 -15493 -18357 -11099
22189 -11099 -8294 -20994 -14621 -24306 -29453 -23972 -18665 -22610 -25663 -37472 -45615 -35231 -16148
22176 -16148 -17500 -29928 -26687 -40028 -44484 -42737 -37849 -28173 -15336 -12898 9596 28200 12355
22163 12355 5352 7036 -4616 -20174 -12180 18164 23380 14500 7741 -6875 -4163 -3876 3563 13508
22149 13508 11184 7368 12755 9800 -2238 869 16465 19895 -2890 -6009 -4680 2381 14312
22136 14312 10356 -12353 -12122 -1393 7771 8425 14015 8295 6150 -9186 -4343 7394 1300 -4011
22122 -4011 4060 15867 -3347 -9039 -3522 -4283 -14689 -18402 -8860 -5732 -10769 -17613 -18632 -23379
22108 -23379 -35195 -18827 4985 -4027 -2030 -3708 -24920 -30975 -30028 -25287 -22730 -17899 -12043 -14735
22094 -14735 -10991 -13458 -16331 -9920 -14663 -9909 -7122 -16969 -16479 -782 11606 -12264 -3675 -261
22080 -261 -5653 -11057 -12477 -6101 -9129 -31096 -23179 -28831 -22948 -2882 11994 10561 2967 -8981
22066 -8981 11973 28765 29211 11107 12458 -3348 -18832 -2817 9411 1236 7867 10530 4049
22053 4049 16505 22254 16025 223 296 -5296 9176 28419 33370 27395 4224 -7946 -1753 -25226
22039 -25226 -23902 5798 22659 33106 20865 9934 5366 3673 -4755 -6355 -4790 -5713 -11251
22026 -11251 -31235 -29312 5391 17913 1806 4410 -354 3503 23236 26359 17039 21712 23361
22013 23361 16589 10550 6530 -13478 -7215 -8926 -9095 -6141 -2093 5246 8245 -4053 -19045 -14231
21999 -14231 262 -3033 -13996 -19897 -25501 -13020 -18296 -13461 -1853 -3584 14424 -1341 -22569
21986 -22569 -8182 -5550 6935 -10211 -21181 -19498 -5121 5566 4620 -2619 1266 8931 -5990
21973 -5990 -13867 -13284 -6502 24264 25909 7305 24169 34535 20095 14464 5172 3866 7830 15715
21959 15715 16313 21134 -472 -20280 -22373 -29973 -30145 -19017 -8048 -5693 -4523 13245 13858 9602
21945 9602 -10190 -3433 -1453 -13988 -10891 -11080 -1217 8042 12042 15699 13286 18720 30802 12980
21931 12980 -11695 -17063 -14458 -18798 -13046 4545 13403 22361 28511 26806 24576 18459 14829 4405
21917 4405 11127 38807 26485 1854 1876 6551 -17102 -37149 -18349 -11307 -5407 574 5388 3593
21903 3593 -15156 50 12385 -1734 -645 11701 24490 9311 -7872 -3462 4500 -6353
21891 -6353 -20521 -38226 -36457 -40298 -37622 -14016 4683 1010 -731 -2406 -7314 -7729 -27088 -44596
21877 -44596 -34203 -1958 6066 -2038 -7541 2006 9428 -1230 -9667 8325 24600 19468 15539
21864 15539 18136 15350 -5561 -4750 5420 10492 -6775 -30689 -24261 -8147 -3402 -20415 -19726
21851 -19726 -18600 -12343 -19750 -18033 -16116 -13653 5588 2385 -3653 1348 -332 4385 7222 5659
21837 5659 12496 17994 15022 15558 5952 -1934 1366 -927 -6962 -4557 -6470 1102 12270 8787 8598
21822 8598 -4090 -1327 -16411 -12858 -6209 4079 -1429 -14335 -33241 -36559 -28448 -21883 -30657
21809 -30657 -25615 3994 13293 8098 18114 26220 4005 -18888 -11203 -11589 -19152 -23331 -44095
21796 -44095 -40277 -20285 -7109 -2808 -15691 -6146 -1213 -24461 -40336 -15527 5128 -16634
21784 -16634 -34340 -29339 -15413 -8530 820 13101 7769 -9749 -20415 -14305 -21853 -20508 -26198
21771 -26198 -25731 -36329 -17795 -8491 -3477 -2175 13604 19828 1343 1614 -6451 3120 -1499 -13578
21757 -13578 -32160 -32543 665 13934 12237 5374 -13451 -25904 -32592 -16893 -2317 -12648 -25660
21744 -25660 -34491 -32666 -30380 -19741 -16490 -15833 -9819 9919 19495 9534 -1928 -10425 -4182 -13920
21730 -13920 -8969 -4292 -4831 1159 7260 13695 -12194 -15660 -7432 6368 8839 6291 14389 5807
21716 5807 12784 -1433 -6542 -206 -8814 -26636 -24317 -20783 -20120 -15978 -8963 -23806 -29825 -16443
21702 -16443 2821 5496 -14407 -21506 -25427 -34782 -38397 -33608 -26747 -21440 -7524 1267 -4636 -8382
21688 -8382 -6212 -11177 -14048 -5029 -5507 -6316 8947 14619 -137 -11861 -13921 -6351 -5057 -5685 -14586
21673 -14586 -20851 -14441 -6453 -8778 11281 19646 1811 -8003 2817 8443 12402 10445 2599 -4125
21659 -4125 11100 24239 12506 -3213 -6386 -8904 12308 21774 6709 -12406 -8744 9382 13900
21646 13900 628 4975 30291 41229 36950 31874 13937 18068 12805 17058 -5062 -23241 -41743
21633 -41743 -40114 -27602 -12481 -7122 -4514 -19906 -41202 -36204 -28364 -9566 23316 21682 1569
21620 1569 10021 4583 13963 14159 6448 -2322 11661 20292 4257 -16349 -18294 -9194 -6465 -21932
21606 -21932 -32670 -31616 -19236 1307 4014 4260 -9031 -24153 -18706 -4783 4604 13546 12209
21593 12209 981 -10227 -8444 -6433 -11389 -10150 -15054 -12746 -1637 8404 2578 5794 7158
21580 7158 10244 3910 -6297 -7585 10870 7976 -10832 -24205 -26253 -40374 -31870 -26063 -27183
21567 -27183 -20458 164 -10048 -32322 -26862 4933 7465 -12808 -28922 -33127 -21545 -27515 -15420
21554 -15420 1059 7177 -2802 -11754 -3784 -3489 -21881 -34584 -28820 -10232 11440 10967 14646 18647
21540 18647 11061 -12630 -16757 -20511 -31813 -25483 -19544 -19856 -13436 -14051 -4587 -9740 -40238 -45716
21526 -45716 -20367 -8523 -4363 893 -11735 -4273 1386 8094 19690 6611 9115 7215 -9612
21513 -9612 -12253 5544 23802 1747 -11585 757 9347 6175 -4280 -22252 -20137 -13849 -8933
21500 -8933 -10423 -23551 -8615 16196 30959 24513 8155 5784 12724 12405 7553 3052 2917 10696
21486 10696 13325 12141 853 -13073 -16872 -1848 12640 3049 5387 4371 27150 26184 20552
21473 20552 11337 4146 -22067 -43515 -26798 -17650 -327 -3331 7358 3603 3702 -7072 -7747 -9901
21459 -9901 -11544 1374 -5709 -8017 -24827 -20583 -29945 -25026 -4977 8240 17078 5701 -522
21446 -522 409 -13267 -10490 2087 21024 21193 4879 -1754 1597 7765 9190 -261 3454 -18912
21432 -18912 -30046 -19950 -1183 9703 12605 5588 1872 -9865 -20472 -4605 -15914 -18709
21420 -18709 -22787 -26572 -28485 -19183 -7170 -10790 -24453 -20438 -8680 -11994 1091 12264 -910
21407 -910 10029 7661 -6362 -26177 -44811 -30495 -12989 -15245 -24836 -30120 -21045 -17659 4477
21394 4477 22364 22840 24389 11652 -3579 -7106 -3430 -3458 3866 22789 23401 15169 -7761 -3731
21380 -3731 11434 23616 22281 25128 3659 -2063 5328 -15915 -28406 -23581 -29081 -22708 -19132
21367 -19132 -35962 -26507 -26273 -27808 -25493 -32004 -30837 -28383 -3529 11211 -1356 -8758 1830
21354 1830 10423 4328 6295 6971 1950 -20365 -21229 -12624 -1088 -4012 -5497 12564 14978 22585
21340 22585 13479 -2290 -17727 -4525 15520 8969 -2236 -11981 -496 -17255 -15971 -7559 -19070
21327 -19070 -16247 -4447 -5387 819 10163 7616 -959 -2746 1776 6502 -6319 -19428 -32196 -31546
21313 -31546 -40108 -46495 -50048 -45280 -44223 -27639 -19099 -36822 -18742 6588 11081 13798 14992
21300 14992 -2101 -12619 -4443 13713 20635 19111 14121 -11213 -11137 970 11213 21603 17064
21287 17064 3806 -14774 -10186 6873 -2041 -1257 -1707 -17548 -19079 -1212 -12884 -16437 -6030
21274 -6030 -8087 -17449 -17989 3281 11410 23120 2846 -9743 -2907 6728 5975 5795 4212 -2531
21260 -2531 -157 -6114 -4572 117 -1804 16171 15080 11329 3499 -5017 -3446 16817 34482 24183
21246 24183 5450 -3154 1504 -17183 -10186 -13699 -14186 -5690 12706 -13249 -34829 -34774 -3817 1970
21232 1970 -16864 -41569 -44483 -27076 -16839 -25230 -18830 8913 24639 23412 10450 -16619 -20644
21219 -20644 605 11027 15694 -1861 -23590 -40269 -20922 -13043 -17005 -7752 -14163 -16227 -11753
21206 -11753 -3086 -5857 -7660 -21522 -22164 -16385 -11397 -4014 4319 14955 13003 1821 14223 27152
21192 27152 24316 26091 6484 14231 2789 -18654 -24870 -24656 -19319 -18847 -14433 -10944 -10971 8042
21178 8042 -7749 -24650 -14848 -17435 -31530 -30802 -18883 -1316 -16484 -18782 -6136 -6697 12833
21165 12833 18345 4534 -14798 -27824 -23384 -36067 -48662 -42615 -50921 -65100 -52968 -24126
21153 -24126 -12717 -20546 -14983 2231 -9422 -26986 -15043 -7630 4596 -7700 -15300 -34744
21141 -34744 -28213 -19637 1828 -309 -1080 -2066 -1508 9910 3825 -981 4644 6826 10115 -11428
21127 -11428 -11555 11931 16580 2342 -2212 10555 3821 -4281 9081 9168 -4570 2877 3674 5140
21113 5140 6466 -19791 -42035 -37048 -31739 -37673 -38702 -23670 5248 8889 -1045 -7278 8283
21100 8283 11471 -4979 -13895 -10362 -32086 -49298 -40366 -36077 -44264 -42072 -41895 -41065 -19287 -8530
21086 -8530 3198 9336 -17212 -27107 -21303 12470 21774 -1183 -15762 -8026 -19932 -36787 -21878
21073 -21878 -32293 -54476 -58428 -48678 -30862 -28546 -38890 -47077 -45917 -41026 -37775 -39861 -38462
21060 -38462 -41796 -29220 -24993 -42151 -35993 -15679 -25977 -33710 -21762 -23776 -16642 -7235 12149
21047 12149 2626 -3214 -917 -2452 9720 -4301 3012 16252 -2469 1115 2260 -134 9484
21034 9484 17924 20155 810 -13140 -6320 1005 -2860 -1081 -11937 -13372 -8046 -9639 -26215 -4318
21020 -4318 5716 460 -7070 -1745 5395 -15802 -28905 -31332 -28578 -22835 -26040 -25338 -5653 2446
21006 2446 1710 33 -7044 -11175 -1007 7443 855 2769 11142 19133 19510 8606 -2185 1805
20992 1805 27894 17387 -2201 -8915 1539 21944 17996 15194 10895 549 -28253 -23402 -10195
20979 -10195 -4058 -3171 10908 7074 6832 10304 2734 10386 5136 8565 11419 -8874 -28374 -32134
20965 -32134 -38031 -27605 -14200 -9293 -1821 11355 5686 3467 17240 20084 14953 17717 15391
20952 15391 6767 3816 16214 10829 17939 9196 7549 6868 19095 28753 19617 9491 -2453 -5401
20938 -5401 -17293 -18282 -33771 -40239 -22818 -22848 -24833 -23854 -23754 -28601 -27700 -40002 -25994 -22392 -27876
20923 -27876 -24024 -11841 -4148 -9648 -11415 -2337 6507 2642 4331 -2236 6973 23072 30052 10084
20909 10084 17155 25278 16752 -3437 -21421 -20596 -18341 -11218 -3466 -2781 -1087 -6579 10398 12303
20895 12303 17345 23533 27376 13339 -979 22159 11677 -5556 5754 11797 7864 6693 -8199
20882 -8199 -19884 -9375 8563 15468 19612 13596 1214 -17093 -13193 5265 14027 9925 9501
20869 9501 27644 24658 18908 4507 12048 15547 20191 21371 8042 1764 19403 26622 29190 24268
20855 24268 22006 14151 -4780 -31269 -40711 -42961 -41994 -30593 -20117 467 4214 -12846 -27947
20842 -27947 -31148 -23679 180 407 6403 -11970 -31500 -9642 -7656 -13477 -8887 8923 14157
20829 14157 16708 14245 1731 -19124 -16420 -845 10298 1816 -10123 -5497 -5146 -17825 -7958
20816 -7958 -13398 -21284 -12834 -1438 4178 348 13880 25554 2372 -16795 -14450 -4285 6069
20803 6069 -6371 12 18861 24137 2103 -16687 -31358 -21090 -17488 177 3809 -4898 -6018
20790 -6018 -20371 -30025 -18225 -8510 -3355 8642 -2054 -211 9659 4146 1191 5686 -4439
20777 -4439 -7712 46 4871 -5545 1378 -246 -22321 -38490 -25730 -16495 -16963 3337 7446 25013
20763 25013 30216 20202 14169 12789 12845 9660 14353 11488 -10689 -23420 -17591 2836 9818 16775
20749 16775 -10749 -8228 -19425 -9409 9981 27085 32558 13508 -9179 -14536 -8864 -7449 -4553
20736 -4553 5608 4644 365 4176 -2946 261 -2085 -3268 -28624 -53423 -41976 -33095 -30962 -3004
20722 -3004 7482 -10692 -10937 -7356 -5234 17037 26099 -3718 -13364 -15167 5524 13911 11631 24577
20708 24577 8897 2334 -2544 -19286 -27887 -20944 97 16247 24422 27980 20908 11872 11538 12232
20694 12232 3154 2056 10491 -2807 -14563 -28573 -17380 409 14526 28127 26808 13621
20682 13621 6372 3088 117 1447 12050 11387 26103 28248 -1617 -16656 -6857 15183 13867
20669 13867 7097 9245 195 -21986 -15800 -14896 -32519 -29241 -18439 -13246 -34801 -45117 -15368
20656 -15368 9319 26174 29379 16024 -9916 -19932 -7270 2612 4612 -1431 11279 23659
20644 23659 13637 14125 5062 -16829 -25114 -11650 12435 20759 9805 12637 -214 -8490 -18875
20631 -18875 -18552 -10124 -17179 -19347 4175 11655 3089 5071 6935 19354 15060 -2448 -6206 -16783
20617 -16783 -9287 13223 -1532 -29377 -30351 -28219 244 13276 -6162 -2440 5979 2404 -22360
20604 -22360 -35536 -41460 -29495 -29796 -17086 -9494 -19640 -23139 -25847 -3191 6962 8231 5884
20591 5884 -10971 -28084 -34824 -33894 -4635 -958 -6744 385 4437 -6716 -12575 -10856 -25769 -28242
20577 -28242 -24677 -18370 -4443 -3057 -11278 -14786 -14271 -10958 -15488 -20570 -11741 -10933 -16451 -3195
20563 -3195 10777 1446 -14906 -21972 -10110 4878 15214 7813 2481 15757 -1116 4708 19977
20550 19977 2022 1073 10003 25785 37120 31888 10982 -1378 -8189 -25179 -15408 1161 1925
20537 1925 -1880 -7241 -5066 -12887 -19819 -2883 3183 -550 -9146 -28607 -28580 -7795 -3887 -20633
20523 -20633 -18618 -22792 -13227 -12278 -10083 -4656 -10263 -22320 -18290 -13379 -9763 -18334 -20221 -9457
20509 -9457 -22526 4687 16017 20179 26144 10317 1068 -20661 -14559 1422 25879 34916 22364
20496 22364 21159 20961 17975 2435 -253 -2286 6378 14872 10226 12938 16856 9887 434 803 12368
20481 12368 12851 5937 -3768 -23448 -5185 1416 -7085 -15057 -5448 3337 5849 31334 30912 23098
20467 23098 -6011 -10531 -15267 -12146 2460 9110 10221 5000 -9631 -10127 8399 24890 528
20454 528 -5249 1036 -2814 -4952 -11687 -14281 -19671 -30852 -28394 -12871 -1529 -1831 1825 7459
20440 7459 7595 12012 7080 -2566 -28 -476 7224 5687 -355 -22119 -27792 -16884 -6392 8805
20426 8805 14213 6862 -1169 14150 21867 8974 -3325 -952 -2349 7495 13352 16612 -3646 -10160
20412 -10160 -22148 -26132 -20207 1058 27903 36826 14204 -14083 -28027 -12670 3689 19541
20400 19541 17954 -253 10467 -1522 1366 14760 14055 5258 7944 18508 7892 -649 5383
20387 5383 21372 16790 -4095 -16832 -6773 -5289 -12305 -16409 -28636 -34737 -5436 1320 4174
20374 4174 20936 27627 17600 264 -15376 -8141 -12525 -18881 -25335 -28333 -29303 -50396 -51167 -29775
20360 -29775 -16072 2001 -1821 -21784 -51060 -45201 -5432 5097 14161 13344 7638 2586 -24690
20347 -24690 -26707 -22681 -14536 -17127 -11637 -11228 -14395 -13425 -4824 -18365 -29337 -16404 -6593 -7376
20333 -7376 -20575 -11330 -12481 7067 13151 -1823 -25304 -22842 -20231 -8301 -13967 -22621 -4594
20320 -4594 13597 -738 2007 -2617 4741 6417 10810 24252 26033 27430 27933 20885 2183 -20075
20306 -20075 -11013 -1181 10939 13857 29588 44590 40695 39375 23028 18423 191 -9727 -14522
20293 -14522 -10024 -1857 9192 12721 -5336 -6811 -9697 -27684 -23629 -14307 -17388 -12511 9741
20280 9741 22307 5114 125 -13088 -24230 -16546 -21303 -5591 -6352 -10266 296 -1834 -14243
20267 -14243 -5700 -15848 -30038 -37648 -34573 -21229 -13432 -1122 -4033 -17045 -10438 -7002 -9710
20254 -9710 -4797 -3912 -5175 637 5763 6784 -3029 -6176 -7369 -8264 1668 -2036 -10960 -5382 -14153
20239 -14153 -12932 -8837 124 12841 11262 2567 3666 15106 31393 38576 54817 41543 29037
20226 29037 24875 11396 7901 20478 11524 13910 16279 -2115 -15907 -1079 -17698 -20018 -18695
20213 -18695 -15141 -9445 -24186 -25232 -13588 -10166 -7156 -12264 -31009 -46933 -53072 -52359 -44528 -33178
20199 -33178 -26839 -11338 939 -9862 -18816 -36303 -24087 -19555 -20216 -32805 -11063 792 -34819
20186 -34819 -43689 -35199 -26361 -13155 -6477 9176 6110 -20109 -23356 -19776 -13106 9674 17162
20173 17162 16564 -5257 -20132 -14670 1862 -6619 -14643 -8637 -17995 -23348 -12805 1206 15019
20160 15019 11758 -11417 -6225 12578 31588 39439 20697 24368 39520 36588 10115 -11930 -22929
20147 -22929 -15079 -24755 -22619 -14508 -11523 -6402 10629 8115 -1252 -2669 7163 9517 16454 16840
20133 16840 5579 5719 -9703 -11488 -5251 -29800 -50260 -51792 -55304 -38334 -12489 -6944 -5061
20120 -5061 -18841 -22997 -38756 -45693 -47766 -41242 -7416 -7637 -24942 -38167 -27024 -3672 -2120
20107 -2120 -1117 -13367 -31460 -46619 -35618 -11647 -2930 4161 9066 9591 8984 8654 22565 43919
20093 43919 39137 13084 5969 7626 22200 17465 18794 33823 30450 28532 18250 -7027 -27925
20080 -27925 -22639 -16112 -22306 -18985 -8909 -24285 -24238 -12832 251 11762 3306 -25775 -29621
20067 -29621 -12344 -207 21130 11752 -2447 -24486 -33457 -23726 -19819 -31329 -29735 -35028 -32305
20054 -32305 -33112 -38790 -24771 2590 12541 -498 2971 20395 33655 15984 2292 4028 3002
20041 3002 -3710 795 -2494 2760 20891 14226 24387 19073 -629 -273 -4040 10054 10916 23761
20027 23761 27782 33997 37095 17803 1749 -2942 -12339 647 -944 16471 8420 -7997 -23914
20014 -23914 -7890 5254 14459 23324 26811 24348 23172 -1664 -9186 -8443 -410 1770 17725 17285
20000 17285 12342 9406 1810 7441 15137 9595 -7720 6791 22739 22579 3813 -7320 -7044 -6582
19986 -6582 -19381 -7516 -19171 -3071 -7665 -19008 -34228 -28595 -12997 -8053 -13243 -19258 -18468
19973 -18468 -29377 -23205 -22839 -32535 -29176 -16104 -7559 -5796 -20867 -28666 -5518 9921 7753
19960 7753 20905 21007 14502 14509 665 4308 39447 53674 53882 35422 16478 39949 59313 44035
19946 44035 28649 17123 20356 26010 23193 15197 9245 13185 19362 3808 -16067 -11466 2039
19933 2039 -2635 -8139 -15697 -4722 -2274 -13171 6331 1082 -4624 -27204 -37021 -31813 -18145
19920 -18145 8990 10688 -4937 6777 7822 -8424 -24748 -21706 -1484 6120 4741 7483 -2755
19907 -2755 -18161 -23065 -30355 -9225 2200 13034 -1003 -2938 -725 -10277 -24986 -20594 -3238
19894 -3238 1152 7752 4777 -11600 -12089 -9990 -2703 -9681 9000 27917 12233 -13733 -33849
19881 -33849 -27341 -6100 2868 1842 -2452 -6112 -18389 -3721 357 -17425 -3291 8210 6515
19868 6515 -7094 -16465 -25988 -21124 -24864 -37950 -30009 -32351 -11555 -4169 -9129 1200 -15009
19855 -15009 -12530 -7231 2964 6897 -1408 -7480 3335 -5838 -3527 -5110 -6408 22517 34045
19842 34045 12497 8643 22452 18996 11687 7976 1336 7457 20480 14005 28555 41245 55201
19829 55201 34090 14557 1654 9713 23551 35699 13853 6937 29985 26044 13868 28666
19817 28666 19837 15152 7137 10723 28417 31136 26638 23745 20298 20315 17379 10384 1276 -8471 -20253
19802 -20253 -24502 -24847 -24469 -3555 -2355 -159 17005 22475 -2407 -22780 -19303 -11122 247 10559
19788 10559 10563 11089 -13976 -27824 -18671 5132 11605 -16859 -21034 -18320 -23633 -14683 12209 13697
19774 13697 2358 -6715 9619 16825 1935 -5946 -11320 -4307 6289 2993 15197 9367 7143
19761 7143 6778 16842 24161 22580 9029 -5604 -8591 -6271 6878 22084 23951 21118 10142
19748 10142 12713 30341 33129 7192 10689 13507 9873 25347 13739 5825 12585 -2344 -432
19735 -432 6233 1980 2485 3660 6910 616 -23987 -18968 5449 11921 16073 12825 -7229 -18203
19721 -18203 -21175 -12863 -4683 6869 -4779 -11056 -532 9644 20904 37479 37797 21305 3523
19708 3523 -3914 -4118 17470 21376 28821 20778 -7820 -14108 -31 -4664 -13382 -28483 -21876 -37052
19694 -37052 -33663 -16300 -23536 -24109 3724 -417 -9219 -3083 1312 -2939 -12653 -7639 14844 17649
19680 17649 -11117 -22630 -21189 -15175 8551 46080 50623 29106 18478 11504 9807 3273 14113
19667 14113 12677 15541 11871 13102 12224 10226 18485 23642 8385 -8707 -5676 -4416 -18109 -6889
19653 -6889 25200 34015 20303 -2137 -9698 -5501 -13720 -21422 -26221 -6145 -3908 857 577 -21836
19639 -21836 -45782 -31990 -23333 -23602 -22641 -16582 1147 14632 25691 27899 17304 3879 -5849
19626 -5849 -30343 -30893 -12454 837 15148 5322 840 20651 21575 14299 2803 -11395 -12048 -12325
19612 -12325 -5265 -5730 -11489 -487 5990 -1545 -8159 -7330 23868 36891 11477 533 2453 27666
19598 27666 18972 6529 -22078 -25455 -21516 -18578 -17757 -8329 -2717 6764 332 7287 15037 -899
19584 -899 1999 20747 23831 7267 -9956 -20704 -21573 -35144 -34167 -30124 -34242 -27902 -7446 2957
19570 2957 9693 12778 12972 761 -3796 -2889 1972 18081 37021 49038 44212 7228 1838 6905
19556 6905 17322 25750 11883 9917 12967 15745 21582 9055 -6201 18405 7235 3363 6287
19543 6287 15250 19546 15227 30270 26134 37946 38201 40050 22979 3931 26255 20981 13530 19247
19529 19247 14334 9695 11638 11478 15143 17950 29819 38410 11274 414 10028 3604 -10455 3970
19515 3970 -6401 -26624 -34926 -30967 -33085 -22091 -34789 -46596 -38096 -17372 6202 27665 32651
19502 32651 25247 20284 6297 8823 5014 8752 12784 1410 6498 29482 37088 19270 12051
19489 12051 31617 19169 10160 2729 -1832 1123 -9876 -18902 -6569 -3502 8217 4010 -1433
19476 -1433 17234 21624 15174 -4093 -19138 -14284 1249 23251 50786 46031 16260 -10049 -6183
19463 -6183 12515 17806 19495 27008 35125 34472 56871 77523 104929 114034 114559 109774 131967 157716
19449 157716 182814 201248 186730 168367 148697 123232 128207 136502 132687 116691 95172 70323
19437 70323 37829 36374 42148 47847 43855 24262 16394 23646 22724 14497 19211 25065 12546 10986
19423 10986 17041 14718 14595 -13906 -12623 23689 35460 24931 19210 34817 46473 53976 45900
19410 45900 46090 54773 50816 58647 67448 95489 124699 134668 131568 141979 150824 180069 207318
19397 207318 224880 225247 217659 194517 164879 155752 155380 147028 116244 89942 76782 64248 51121
19384 51121 28571 7336 11299 20746 36731 39995 37467 13170 18434 9448 -19249 -30120 832
19371 832 21257 11385 15415 22444 15075 6176 4286 9602 7060 14055 21109 25963 28680 23295 34118
19356 34118 33152 9803 5301 11572 16047 14932 -13782 -13494 -11254 -4574 17541 16034 11909 19852
19342 19852 14622 11797 -1815 -228 11515 31058 17745 18642 26118 20840 9279 -4506 -6567
19329 -6567 1396 3371 4511 16816 14930 -649 -9878 6913 18964 25075 21680 22553 25112 13201
19315 13201 2410 10974 14800 11613 6668 -2976 -8822 -8801 -25113 -11736 2426 11811 3696 -6844
19301 -6844 -3817 -1508 6010 9836 17516 18997 1157 -14063 -13792 -57 2872 2117 6334 17412
19287 17412 29070 22915 5196 -3448 16781 15266 5143 -6781 -19100 -2537 8152 -7696
19275 -7696 4712 2736 -2334 5321 1922 -10435 -7789 6575 33641 26231 4337 1434 17660
19262 17660 30889 33127 27468 33442 29925 40683 39692 41072 63569 56064 28417 12412 6600
19249 6600 5365 16310 19800 18358 9352 3123 5643 27566 29376 20718 13485 7014 -2409 -2306
19235 -2306 5238 5210 -13920 1761 3752 -8070 -8995 6475 15684 1415 -12719 -5612 -13377 -4921
19221 -4921 14158 41876 56746 63070 57108 50195 42732 26097 23474 17265 10914 9814 9675 3839
19207 3839 25296 36286 20816 23232 17750 24876 32065 44218 35603 56607 56955 52253 49119 64222
19193 64222 75709 56301 62132 55898 55905 60928 52064 61560 66369 57975 60953 59654 39541 21036
19179 21036 -3088 -362 21261 20340 17928 29797 28150 33536 12765 -7562 6398 -1007 -10311
19166 -10311 4916 21836 27464 28384 25709 34078 43194 47572 35104 42052 25074 32343 44648
19153 44648 40530 42063 52977 70852 85454 81028 82521 75126 82486 93256 103396 109884 127156
19140 127156 136618 140803 134371 112534 85620 75363 75861 71395 66335 57583 51688 55825 60036 47659
19126 47659 32542 33586 19741 17402 38311 40127 48826 57900 32063 29836 33670 26749 28141
19113 28141 32241 14638 14646 39228 52394 54760 42247 40945 38085 51546 55585 56681 42356 41429
19099 41429 56382 61687 58564 68237 61371 82318 114047 110478 114742 111037 118863 126103 137476
19086 137476 151013 172370 150145 119268 113191 99210 93341 100499 124216 131198 145109 181746
19074 181746 192287 205390 225907 260889 299493 311081 323377 327552 353160 336388 325580 310550
19062 310550 294118 272216 269353 251071 230464 223551 204647 182680 155714 143184 135136 112281
19050 112281 103780 93707 88625 77237 84942 80199 77916 70232 84201 99258 94391 112890 119136
19037 119136 143770 169901 160026 145049 151317 147965 155478 155113 153558 175031 184127 200077 208238
19024 208238 220057 219835 260423 315807 362804 386749 413976 444567 468040 482213 508404 531150
19012 531150 533970 532268 503309 483595 460477 444220 428870 398201 368513 315002 275584 254388
19000 254388 248993 256158 256888 278476 298777 315343 337483 374187 398413 403857 407252 426386 453356
18987 453356 470124 497890 505701 489652 483388 490362 502979 530688 545348 530844 554649 582110
18975 582110 620147 668102 747506 855007 942035 1005391 1086175 1191836 1308671 1424656 1531489
18964 1531489 1623608 1704201 1823565 1982569 2175069 2377880 2622295 2954833 3380994 3942660
18954 3942660 4690816 5733370 7312924 9786246 13612774 18335678 21376731 22409290
18946 22409290 23400860 25184227 28343229 33571180 37952886 37906867 35414476 32652830
18938 32652830 29583217 27450584 26756182 24822764 21619044 18523594 15169782 11518753
18930 11518753 8561327 6571369 5247555 4346013 3722572 3265704 2924157 2701415 2540457
18921 2540457 2430036 2377578 2343688 2326488 2358791 2399266 2436429 2481295 2535313 2591274 2660057
18910 2660057 2766280 2853523 3002350 3226297 3504745 3888550 4423627 5126331 6105207 7532583
18900 7532583 9759474 13292501 18352302 22846699 24642958 25520035 27094274 29723875
18892 29723875 34666725 40691052 42544606 40205354 37199191 33886242 30718225 29371050
18884 29371050 27942838 24779370 21295479 17817309 13818561 10174982 7606322 5915006
18876 5915006 4760258 3940877 3327014 2825207 2422887 2122391 1907851 1745369 1644204
18867 1644204 1544872 1417707 1314180 1224983 1149102 1059102 976185 922497 878319 813306 760191
18856 760191 700310 654792 617691 574331 518460 472665 439410 432002 430299 421610 413454 395136
18844 395136 378857 375094 381737 367791 364716 374136 374091 360165 348696 326606 320678 313790 316064
18831 316064 300968 275080 259322 260300 264074 256819 259262 257527 284394 304569 319037 334705 339661
18818 339661 341973 348193 351689 353988 377847 390154 397795 360422 319885 306368 278062 268885 248367
18805 248367 212671 208780 214527 194791 194881 228130 264443 265092 253427 241766 252093 242976 226730
18792 226730 234194 258272 284957 291649 301252 292773 282515 295872 328087 344702 355887 359838
18780 359838 368752 381271 399960 424606 409486 394033 379481 361023 369163 383178 394530 396487
18768 396487 410669 390048 390821 436756 498910 536786 539017 517007 475158 420983 371966 348697
18756 348697 318017 290993 253524 223770 191696 167360 159890 181340 191159 189292 201547 214544
18744 214544 227486 216551 211170 194281 186230 210450 226206 221616 200409 173572 174044 176040 174021
18731 174021 194022 218878 224411 212096 225690 243517 263548 284924 297224 274615 284585 311084
18719 311084 302457 279821 265893 251723 236154 212648 175903 152824 139301 128058 131539 154714
18707 154714 164513 157331 153215 131960 104410 110756 120117 91136 72946 71696 71827 73885 66494
18694 66494 84624 91438 83622 62755 45621 63048 92383 113196 113055 119100 116359 92082 62350
18681 62350 53487 43266 37918 36271 42335 53589 61930 67948 56874 43202 44014 66252 69822
18668 69822 68854 71809 72593 42604 25771 29504 50555 64263 72900 79612 78115 80114 88707 85964
18654 85964 62844 48628 43599 27403 22914 13374 24430 36797 48755 27854 42690 52390
18642 52390 45721 39621 53007 41846 29561 38213 27159 21025 47373 64820 66227 64084 44379
18629 44379 34934 49324 54048 44922 42692 44645 63343 101949 95993 66084 57052 57013 44733 30344
18615 30344 38189 29278 21232 18523 26577 19627 21445 31969 44762 67065 77785 57310 50325
18602 50325 46709 37380 32511 28899 29116 59663 57860 51202 37799 37659 27283 24974 45265 54846
18588 54846 30149 26774 22869 45927 62603 52113 40806 39002 28744 19835 14529 18164 30171
18575 30171 37402 45144 55553 56458 53315 40826 45181 38900 34699 24723 23068 11622 -13270 -26112
18561 -26112 -3743 9343 9962 18176 36758 36975 43267 58533 64130 66470 40188 24413 48400
18548 48400 60919 54562 44250 46994 70769 81177 91887 107509 103646 79797 58404 64269
18536 64269 77627 74160 57844 47584 49647 52524 54045 70339 73981 64808 59227 45901 47914
18523 47914 35454 29121 54396 62823 50296 56580 50738 45908 54889 73490 79405 99021 110878
18510 110878 101917 98211 99007 88133 110677 122949 129729 126992 117464 103966 97873 100715 108881
18497 108881 113017 116161 104324 105667 115133 97302 67614 62614 84469 85634 88933 96905 101897
18484 101897 99636 99304 91968 91666 105459 104046 94637 119289 112715 93569 101448 119736 135387
18471 135387 127682 98186 78087 74221 81025 90323 78295 84569 68785 58117 60890 74820 72501
18458 72501 78486 100875 111410 110947 99199 96704 96060 98650 92715 103723 122153 123472 127117 115660
18444 115660 129270 157392 181183 201520 219334 240184 278825 309364 329682 329581 312626 326814
18432 326814 332034 346636 367922 379757 371365 374182 370583 378715 421656 456459 483035 499402
18420 499402 499584 495724 470105 444360 412092 394227 402353 385747 381196 369648 364027 363890 368152
18407 368152 376271 387601 386903 378075 358740 337225 299258 286420 300476 288087 279263 284469 292077
18394 292077 315725 329950 366406 399246 466491 541760 614717 700597 773683 868358 946038
18383 946038 993583 1051709 1105121 1172335 1232325 1246577 1272110 1290716 1311304 1339704 1365965
18372 1365965 1334344 1271394 1207303 1143177 1065207 1015954 991507 969475 941582 921310 893078
18361 893078 905433 961766 1051088 1151967 1288157 1484031 1764424 2171240 2795400 3793784
18351 3793784 5241621 6578792 6957593 6771191 6557991 6311078 6333176 7003776 7565260
18342 7565260 7235328 6507341 5702595 4664535 3611915 2854296 2392793 2117141 1930220
18333 1930220 1774384 1677275 1593305 1524223 1478707 1433219 1434982 1463572 1507395 1527076 1562059
18322 1562059 1624146 1729529 1847115 2000318 2191474 2438196 2783762 3302946 4085741 4912368
18312 4912368 5263830 5260323 5242577 5227489 5334379 5758354 6244301 6447033 6612936 6924856
18302 6924856 7391170 8296021 10078367 13186864 18154175 24445231 28558649 28979061 28213920
18293 28213920 27409388 26699315 27823167 30837717 31669147 29282794 26021158 22159542
18285 22159542 17431449 13269814 10500773 8812954 7786936 7160327 6754614 6501529
18277 6501529 6402354 6470344 6630541 6874618 7224225 7674284 8289965 9137528 10261816 11808974
18267 11808974 13988255 17129189 21779693 28743567 38077227 47654286 56398041 65770870
18259 65770870 73160168 75955971 77517523 78168173 76533428 76397182 79692935 82159582
18251 82159582 82472724 80607877 74622479 66320583 59198344 54627135 52879244 51147392
18243 51147392 46570532 40632924 34477710 27693568 21202495 16234939 12778852 10405814
18235 10405814 8739647 7564006 6689857 5969959 5376420 4850087 4390382 3978124 3638224
18226 3638224 3376041 3160663 2976791 2862898 2778498 2711152 2658134 2657773 2669461 2727922 2852719
18215 2852719 3023435 3258267 3625316 4222486 5232322 6793059 8569167 9562727 9668116
18206 9668116 9564015 9561934 9796310 10214419 10065725 9240826 8305093 7354689 6407820 5695800
18196 5695800 5126946 4573310 4145869 3854565 3699414 3670346 3505506 3160212 2799092 2413040
18186 2413040 1982612 1595391 1323720 1147282 1015994 931819 877797 841598 781378 749792
18176 749792 709529 662890 631273 603592 583232 585630 604339 622741 642502 616691 574813 537988
18164 537988 522900 496480 498377 499682 485960 480044 447284 417556 401874 392731 381140 361578
18152 361578 391635 401361 387243 375456 378997 402616 412140 416856 423651 417806 431185 461661 499207
18139 499207 513705 547206 594731 654288 712364 793421 858376 914434 962674 1013139 1041312
18128 1041312 1029403 1044013 1064585 1091369 1156150 1203891 1222788 1224951 1229599 1256025 1321398 1460350
18116 1460350 1614492 1795612 2018357 2324652 2771484 3382343 4268510 5691860 8133165
18107 8133165 12451682 19853712 27203206 27523024 24536963 21697282 17129368 11568837
18099 11568837 7572723 5231445 3830226 2968993 2398175 1971785 1642078 1414488 1223424
18090 1223424 1043863 897482 801375 727988 653973 583337 528673 480668 457117 431748 419493
18079 419493 425951 420129 395383 384933 376135 370690 365786 396101 419959 432271 445955 441024 416253
18066 416253 383574 374731 366880 348308 332159 328931 337807 334551 357593 377653 386224 381397 345326
18053 345326 310279 274825 268958 264825 269282 257994 254663 249595 237221 231888 230613 229078 230574
18040 230574 225768 241384 244942 256275 281223 291911 303662 297714 314575 314365 325945 328401 276230
18027 276230 255373 253624 254417 273665 310595 346236 411732 440202 447125 455915 449689 419709 405723
18014 405723 375376 353521 324942 321876 334888 342573 383475 423548 439107 446397 447799 458412
18002 458412 484914 524738 577710 702052 904807 1144543 1254914 1207491 1137000 1028423
17992 1028423 848712 682470 588129 535173 487859 473699 469464 477999 509727 529934 563757
17981 563757 596261 605775 619566 659342 706076 759620 781398 792615 812274 849547 865522 868923
17969 868923 894189 933587 980060 1017741 1054466 1067788 1087248 1137497 1193635 1286824 1394047
17958 1394047 1538693 1711217 1909214 2174616 2532665 3017101 3681636 4586118 5931199
17949 5931199 8039305 11363456 16102014 20488267 21772564 20733322 18941808 16280832
17941 16280832 13157732 10777251 9537938 9334257 10180521 12272404 15633213 18680950
17933 18680950 19134214 17720929 15734382 13023473 9943937 7462736 5803233 4742239
17925 4742239 4097182 3686734 3466158 3356950 3330294 3321984 3348575 3404542 3553118 3807727
17915 3807727 4192054 4754498 5645091 7113628 9545423 13280252 17087410 18374340 17543136
17906 17543136 16182923 14234473 11866434 10169329 9570382 9970998 11394751 14140483
17898 14140483 18612727 24032807 28445839 31548109 32128295 29418978 25217426 20861848
17890 20861848 16550023 13058274 10892614 9896684 9905467 10986138 13346427 16464364 18115370
17881 18115370 17370499 15693004 13581086 10822608 8174925 6264139 5022539 4232347
17873 4232347 3711561 3346721 3139671 3034189 2972356 2938931 2957613 3011334 3118823 3351027
17863 3351027 3758077 4415355 5514715 7374980 10349437 14020093 15987904 15535813 14243207
17854 14243207 12518403 10190138 8127277 6952062 6611847 7039761 8323961 10704986
17846 10704986 13831920 15614241 15037176 13512213 11587045 9021917 6521869 4715734
17838 4715734 3533919 2760934 2246650 1872893 1580190 1369648 1209178 1091626 1028325
17829 1028325 978826 953163 948731 951149 911392 872202 838946 828818 821687 809844 832538 850316
17817 850316 833209 784749 714115 640834 583656 530172 498138 448921 427564 424011 428258 419094
17805 419094 424057 415555 393887 374780 356042 332714 352288 410404 501745 584181 638805 645537
17793 645537 600119 557430 484901 422026 393729 365749 345575 334848 348103 361907 368313 374632
17781 374632 369941 379274 388853 374153 382904 418469 423881 429278 425086 435099 443290 417366 420039
17768 420039 460442 484772 500912 507345 466735 402419 351377 322978 290140 289730 297284 310722
17756 310722 326164 355559 392256 403323 399947 402315 403901 400972 397581 398687 371633 347951 319598
17743 319598 304883 298882 287113 269212 262586 266901 261758 258442 245588 232502 244735 244759 252255
17730 252255 268224 265731 267070 272039 254270 226274 238744 233371 227187 216623 195117 190579 195175
17717 195175 215319 213260 195383 167234 157205 160212 148076 132278 135724 137207 128925 136056 137922
17704 137922 151513 168350 184525 198643 197325 203919 206714 227130 257080 286447 295736 283268
17692 283268 242237 231732 221147 208755 187334 168769 148791 135004 119380 97617 94135 85749
17680 85749 87750 72628 77196 81715 81564 81737 82104 93661 72687 66357 74515 67131 45450 39651
17666 39651 39536 39037 38940 49252 49664 39945 37301 37117 34074 33071 11670 2022 6964 3824 -17093
17651 -17093 -3990 33013 46683 49833 39802 23376 9539 9098 5248 4844 24907 33809 27382
17638 27382 8095 9889 27958 55184 62889 36601 26513 26890 34710 32263 11279 25674 39753
17625 39753 39977 30525 9066 18204 42744 48413 31147 9010 4929 25956 52941 40978 2489
17612 2489 -31124 -32887 -8991 11631 20748 32731 37204 30925 26899 13872 19171 34725 32949
17599 32949 18669 18058 29199 24953 29648 36317 32860 25466 5695 211 5208 12946 -1092 -2935
17585 -2935 7697 2324 -13239 -7083 8793 20544 39205 45996 52801 61847 62475 54393 37202
17572 37202 45435 62052 58655 41708 32580 36817 43257 45222 39884 46982 55972 44090 26729
17559 26729 30356 48434 40408 21221 22568 25961 27445 8002 7637 40740 57490 44480 22754
17546 22754 18825 26345 12735 8596 -1770 -6498 -3721 -6875 -20364 -31022 -16104 6956 18965
17533 18965 25591 35131 19571 5224 -15729 -7015 9993 30736 29975 29191 33162 42038 46072 50638
17519 50638 33743 18305 39750 63133 70492 76515 75330 77673 60247 31077 45302 51547 20236
17506 20236 9463 17274 17870 12703 19289 18220 7748 7038 13477 13573 -1497 -6959 -27076 -12663
17492 -12663 -888 6153 4850 27978 51602 37111 8526 1290 12170 26211 16467 -3916
17480 -3916 5866 12004 -17578 -32608 -14852 -1984 18138 59523 63786 41893 27312 24294 44750
17467 44750 46600 30572 26698 8779 11506 14838 6476 -4842 -525 -1925 11839 27074 14338
17454 14338 4918 21712 14790 -6655 15183 5466 2109 3881 16757 23550 9107 22473 36826
17441 36826 53156 97055 164890 199708 202864 204812 181320 124093 87491 79866 68208 61965
17429 61965 57517 63450 63795 79145 56056 50833 44981 31714 17932 11189 22404 16289 25531
17416 25531 25579 15233 20087 33552 19683 5880 9753 17671 14621 8004 4995 -3955 6217 7238
17402 7238 8884 35531 43868 56889 65610 69869 80517 73711 73067 74780 79020 97159 88403 104272
17388 104272 144506 159547 177322 185320 179307 162971 144077 130967 107238 112553 110052 95265
17376 95265 96304 105029 114870 101488 94258 69496 33959 372 -3719 905 8070 24400 14622
17363 14622 5577 -8104 -12750 -3400 6570 11851 -3074 -10453 -6709 9792 16016 -10658 -11285 11745
17349 11745 32409 69071 81352 79258 66222 42925 47733 49079 40019 38833 47908 44504 37088
17336 37088 41775 62008 60000 49644 40287 33733 17736 -477 -1505 -11985 -10082 -3613 -3613 -2719
17322 -2719 -2003 17136 7927 -24915 -35427 -16684 -9660 -7358 -8437 -21753 -14345 -1001 7678
17309 7678 2392 10612 22180 25519 7716 -8495 -6170 -13092 -12032 -4341 -3364 -2197 6585 -9668
17295 -9668 -18765 -16 5789 6871 -9439 2879 18985 25211 23470 4448 -7942 -1035 9643
17282 9643 3495 9304 14496 25071 32656 9057 9598 20929 31005 18883 26859 33141 21098
17269 21098 6844 24810 14847 -12186 -1673 18411 16831 7372 13782 15928 16105 26451 36705
17256 36705 31766 38046 43897 38332 31132 18031 13060 11612 8541 3990 13211 22219 32982 32653
17242 32653 10974 4521 224 5538 9626 12272 251 -13712 -6802 -3660 -32377 -40257 -9016
17229 -9016 7066 -9967 3939 18961 42646 51876 38663 36124 67536 72996 64138 52195 52988
17216 52988 43258 51966 69372 74690 67184 66458 52585 49535 66167 65586 61554 30092 16753 6629
17202 6629 793 7004 14667 9202 12018 15675 7078 5766 16213 27987 19563 6076 1987 -2449
17188 -2449 -677 9577 16276 32045 39116 19129 11634 -633 -19173 -10365 11363 30369 31538
17175 31538 33994 32130 12802 12837 20673 26884 42925 67418 62610 54564 62202 68166 65954 74779
17161 74779 86740 101643 91743 88545 85895 81150 53844 51813 40103 -5733 -7010 1410 4947
17148 4947 1211 -6601 -2815 -15332 -29898 -11162 -3823 11888 5097 26023 24682 25195 30447 16948
17134 16948 7848 6511 3466 13484 26486 7780 -14978 -10482 6986 16412 15172 16998 25584
17121 25584 15171 6813 -8881 -8921 -11597 14458 29470 47618 36897 34876 45933 49880 45356
17108 45356 45539 38487 20328 23540 24391 34232 52977 55653 43463 18144 -14683 -25853 -15091
17095 -15091 1022 19399 11662 -12021 -16400 -18873 -17647 -15051 -26087 -29651 -27037 -25932 -27039
17082 -27039 -10998 -19064 -20391 -11472 -7823 -3804 -13370 -2921 6621 2550 -1696 1479 -6559 -37754
17068 -37754 -39420 -32501 -13266 -17570 -18606 -20828 -10282 3459 -15270 -23914 -46917 -41311 -12358
17055 -12358 1182 -19528 -35731 -30508 -10270 23262 39760 17251 -6816 -5099 -11261 -7952
17043 -7952 6296 25261 41672 66523 64138 49042 39785 39455 37256 42254 47507 45012 48102 48293
17029 48293 32075 21924 9088 16863 27032 19425 -21048 -24397 -22800 -14830 -8421 1120 16801
17016 16801 41620 21120 3854 -2364 -17424 -10174 -6889 -3663 12569 12651 -4196 -11787 -18722
17003 -18722 -16371 2573 -9435 -16147 1515 2896 -819 16885 29963 26556 22161 28246 18565
16990 18565 622 15470 23926 28722 37707 19292 11339 20276 29194 25735 24279 13855 9367
16977 9367 9156 8607 4060 -6386 -17920 -4071 6599 -16566 -39766 -39043 -20919 -6245 3525
16964 3525 12867 26061 37810 17796 -16956 -30105 -32702 -20788 -14968 -17879 -15722 -5931 273
16951 273 -1429 973 -723 -8217 -13544 -23410 -20353 -21547 -22294 -5655 8386 8573 3545 2028 -3058
16936 -3058 -14517 -13730 -17152 -19868 -7692 -16299 -14651 -22846 -32291 -27613 -15425 -8773 -5185 10722
16922 10722 20799 15271 17449 33555 49572 28218 12649 15023 544 1508 12655 24163 22756
16909 22756 4219 459 -10976 -22763 -26051 -10208 1503 -6770 -14391 788 2468 -14650 -32354
16896 -32354 -33204 -31483 -22073 15859 24319 2888 -9586 -5126 -9686 -11037 -11068 -9662 7936 15252
16882 15252 18204 18847 8660 -1326 -3042 -13062 -12792 11079 17457 1610 17577 15382 4775
16869 4775 6969 -6809 -1208 7755 -10115 -22488 -6389 15627 17918 23977 9503 -6664 -17219
16856 -17219 -4238 784 -7425 -13817 -19175 -28233 -24063 -22765 -32129 -8659 -9296 -31324 -37437 -26405
16842 -26405 -19713 -17817 -12142 -17577 -4485 -18318 -33971 -18936 -34878 -54752 -42341 -29727
16830 -29727 -23966 -3540 8176 -8791 -10370 -4039 -5799 -1585 3096 13399 8040 -7884 -12129
16817 -12129 7604 15248 14878 10413 -14632 -17201 -8258 -11940 -36696 -38787 -33778 -32691 -20917 -27900
16803 -27900 -19693 -6318 -767 967 12458 -10226 -16981 -23087 -12310 -6277 -17258 -7104 15706
16790 15706 9081 -552 160 53 9211 21668 21540 21439 15857 12000 4452 -12940 -9311 -2554 -5359
16775 -5359 -975 -2885 -16817 -25692 -36507 -54887 -43103 -52003 -33906 -35186 -33057 -35657 -34717 -19599
16761 -19599 -3490 8496 -6778 -27534 -25081 -24140 -22702 -1990 12227 9794 16440 7379 -5635
16748 -5635 -944 9619 4029 3623 17090 9866 -8738 -24797 -36777 -31061 -37211 -41026 -44423 -45590
16734 -45590 -47538 -30318 -12385 1566 -9153 -9839 -22514 -11351 -13921 -10227 -13254 -571 16432
16721 16432 21975 14852 11452 20718 3179 -20392 -40167 -31107 -10577 -2996 1952 -14313 -29454
16708 -29454 -11203 -486 5457 -4746 -7070 -4749 -5163 -15463 -9983 16066 13259 19022 32606
16695 32606 30748 15033 9468 -5035 -10308 -21594 -31395 -49865 -33301 -24006 -27775 -18872 -7466
16682 -7466 -17729 -19438 -25189 -12966 5303 18804 5955 -10220 -18487 -11691 -3881 -3189 -9156
16669 -9156 -16006 -7543 -3062 -8452 2143 -49 -9221 -20769 -26327 -26507 -19294 -3668 -4057 -3035
16655 -3035 -7065 -17393 -11637 -9773 1434 -7159 -25919 -28404 -4086 -9440 -17982 -13820 -15934 -21108
16641 -21108 -31145 -35002 -21528 -13321 -9683 -21520 -30646 -29758 -28639 -22957 -10496 -19488 -16404 -23423
16627 -23423 -33985 -9446 7379 10425 14838 24425 24995 19400 -5337 -23599 -15231 -21103 -21905 -2358
16613 -2358 29016 55037 78893 142683 142864 93424 100208 93893 75231 36394 9058 4937 -2321
16600 -2321 7910 4215 -24482 -34889 -22562 -8839 -3462 1594 4034 -22434 -23038 -17223 -16456 -26062
16586 -26062 -32605 -45534 -41820 -29047 -33580 -37245 -26926 -11889 3191 5123 11779 -14827 -25659
16573 -25659 -7797 -32 2234 -12319 -19807 -32399 -26642 -10976 -17175 -10755 -403 7897 2104
16560 2104 -7332 -34299 -50047 -58841 -53641 -38627 -1434 9475 -7798 -24939 -19439 2294 28318
16547 28318 24485 23131 26037 39227 54990 32635 12155 21640 21009 14809 -3178 -2327 -9855 -22536
16533 -22536 -34438 -33081 -34228 -39554 -27480 -24722 -10497 -14210 -18426 2503 6672 10465 3188
16520 3188 -5082 676 18548 17969 226 -6180 9332 1112 -1078 -10785 -22560 -17937 -24717 -16382
16506 -16382 9282 8798 18047 21775 -9329 -23349 -26683 -21665 -10536 -1122 -941 -15388 -20246 -13356
16492 -13356 -8969 1549 -6051 -486 11393 16649 -3709 -17066 -32508 -49437 -39458 -28289 -23884
16479 -23884 -32457 -22524 -3756 -5673 -4425 -4939 -8401 -7091 13413 1127 7170 20794 13024 13540
16465 13540 9052 -5661 -11886 -19044 -16480 -18096 -25392 -23658 -20560 -17757 -13439 -1675 3725 6508
16451 6508 -6062 -21647 -33393 -20838 -15037 -11277 -7960 6016 -6679 -26726 -25005 -20263 -104
16438 -104 24640 18600 -14694 -27824 -39472 -62425 -63739 -55237 -58096 -42247 -14016 -10639 -35985
16425 -35985 -25358 -8479 66 -14915 -15303 -24675 -34719 -39919 -37120 -29917 -34562 -16749 -12515
16412 -12515 -31933 -44212 -39187 -30742 -32042 -37763 -18316 -5518 -10410 -11207 -2560 -12013 -17538 -11916
16398 -11916 -17092 -23108 -27192 -19065 -22526 -33426 -32001 -27678 -26926 -23024 -14696 -1691 3247 -7095
16384 -7095 -9337 -6923 -14739 -13089 -12862 -4456 -2440 -11047 -22634 -11942 -30986 -36174 -25997 -29615
16370 -29615 -43005 -26963 -10124 -10072 -14657 -14141 -10957 -31048 -21806 -13125 -2843 -8926 -13588 -16633
16356 -16633 -5698 4783 -3818 -22461 -19003 -8854 -25882 -42262 -43881 -40311 -38056 -37765 -31073
16343 -31073 -27340 -34734 -30147 -15777 -13092 -12006 -24559 -29350 -6988 -544 5077 11261 29922
16330 29922 14993 -6079 -29793 -41544 -29915 -12499 -20079 -18260 -7605 -31004 -25490 -18815
16318 -18815 -17027 -14836 -20845 -32495 -26347 -18487 -4137 8987 7357 -4374 -20429 -26373 -21472
16305 -21472 -20675 2411 8137 10740 23409 13113 -4474 -3642 -17566 -38465 -27739 -11449 4437
16292 4437 9144 877 -3116 8511 26905 28438 15701 9914 -587 -14940 -23968 -28661 -20881
16279 -20881 -25119 -20289 -38330 -55408 -42690 -36500 -48234 -39376 -14803 -8146 -17687 -19337 -18515
16266 -18515 -11731 -16658 -13160 -5451 -15563 -26454 -12366 -12541 -10115 -9031 -1267 753 -5664 -24763
16252 -24763 -22636 -26189 -18699 4065 10421 4818 -7196 -26106 -18768 290 11320 11569 10812 -9767
16238 -9767 -9885 7405 10476 21150 20940 16807 -7547 -11590 -14966 -23394 -25262 -21294 -2965 -4342
16224 -4342 -4330 -9779 -1043 17252 27988 26129 17394 4209 -6353 -20308 -17280 -9079 997 -5160
16210 -5160 -26308 -27928 -23356 -7318 -22911 -30989 -34830 -31171 -30497 -17951 -16198 -19638 -4734 -2715
16196 -2715 -3117 1310 11381 16672 -1038 -19382 -24987 -24686 -30539 -35807 -46493 -30361 -20129 -10381
16182 -10381 -20444 -39587 -31343 -19695 -1683 -9558 -24175 -23013 -3887 -9753 -8528 4232 -18503
16169 -18503 -25918 -46602 -57388 -51033 -47470 -39364 -30631 -25431 -22450 -24073 -21313 -23030 -18719 5122
16155 5122 18085 15224 9177 4869 -5281 -13068 -24839 -19426 -22593 -31912 -34092 -20710 -24959 -25044
16141 -25044 -7975 -4496 -5954 8452 3435 15426 -5314 -18123 -14439 -10281 -3432 2918 -10847
16128 -10847 -29711 -50107 -37107 -19886 -1659 -4714 4702 16256 9572 1102 -2156 -5674 -19539
16115 -19539 -27472 -35365 -34232 -12635 -7360 5062 10873 9605 -1881 -3278 3395 25016 27630
16102 27630 9702 1187 10171 15397 22713 15010 14453 10236 -10008 -12751 -46 -1280 -1473 2984
16088 2984 -21658 -18867 -15382 -19397 -7544 4131 6645 4437 2456 -14453 -10375 -14966 -24891 -32233
16074 -32233 -18815 -11210 -9959 -9811 -8760 6568 2509 -3525 8155 718 -8745 -19127 -15825 -9946
16060 -9946 -4614 -21769 -24679 -35279 -32946 -4708 -11819 -39376 -38919 -40331 -36014 -29809 -14292 -9548
16046 -9548 -31097 -23457 -39882 -32695 -21045 -22603 -26815 -32613 -29163 -11405 -8757 346 -590 -23081
16032 -23081 -21066 -22926 -3012 760 -16265 -20329 -6444 2169 6008 10741 4691 10954 14024 2051
16018 2051 17624 35613 26616 4977 -19009 -29405 -14193 -3055 -12743 -4153 -16338 -26432
16006 -26432 -31051 -30446 -30472 -31602 -25766 -28148 -13538 -2232 -6467 -1168 2927 -4817 -4694 2126 24023
15991 24023 15355 4323 3934 -9713 -27462 -26455 -25556 -1508 15294 22666 18146 -2399 -7869
15978 -7869 -11701 -6085 9317 18427 24882 6861 8841 8363 9495 -8376 -25992 -20830 -25792 -37876
15964 -37876 -28816 -13343 7549 2949 9556 16870 5406 -10614 6830 16657 6824 2638 4667
15951 4667 28346 27756 6165 -5723 -2349 -17975 -11393 1891 11569 4459 939 -4524 -18291
15938 -18291 -23449 -10877 -12394 -20778 -16528 -7528 -5098 -5554 927 12915 -1831 5760 8676 -14058
15924 -14058 -33575 -21081 -11125 -9563 10108 15781 -7349 -12583 -4674 6796 16029 16302 15413 28529
15910 28529 27243 15102 7368 -5011 -27294 -8802 5430 15420 6939 12075 -255 3723 18164
15897 18164 11759 12653 7573 19175 7782 1574 10996 33469 24444 10335 29000 28977 15619 -15404
15883 -15404 -26039 -34062 -29856 -33392 -34038 -20725 -15674 -11833 -23748 -16572 -23246 -20612 -8404 -17930
15869 -17930 -20097 -15977 -11772 -17902 -15106 -11406 -11973 -30475 -25218 -3698 -918 -23382 -3463 14858
15855 14858 22542 17476 -10495 -38585 -43108 -34867 -14188 -3146 -13975 -32888 -35271 -23067 -4873
15842 -4873 4990 7465 366 6648 11432 17822 30336 15686 13734 31465 19440 24138 17438 844
15828 844 2477 10912 -6457 -14139 -8550 -14595 -16982 -1230 -12522 -12579 -9358 -2199 -7373 468 -5954
15813 -5954 -16321 -26455 6710 12508 2949 -2715 3637 10276 -6355 -21388 -21682 -12914 2196
15800 2196 -7824 -24588 -7618 10336 13184 15147 6993 -6304 -13497 -17797 -33681 -27008 -10913
15787 -10913 -10099 -16493 -14955 -5806 -17977 -17130 -23758 -41519 -33221 -6389 -7989 -18401 -4151 -11105
15773 -11105 -9760 -1302 -16905 -33078 -17317 -10896 -6966 -37605 -25622 1188 4174 15672 -13150
15760 -13150 -7624 -7183 -10979 -468 -6795 -26912 -13158 -7292 4093 4360 8211 614 3677 8984
15746 8984 6398 12352 6286 17747 28766 25516 21119 3056 -15197 -4703 -957 -3648 -863
15733 -863 -1956 -13877 -12602 5458 -1289 -5304 -6931 -23132 -16130 -35513 -33835 -25581 -24056 -7834
15719 -7834 862 -5235 5282 14347 27896 26500 34882 29558 23938 36246 44555 34447 11383
15706 11383 -1258 5252 11047 4079 2229 14327 10896 -9579 -3703 -3725 -3848 -6956 -19217 -13648
15692 -13648 -26030 -24749 -37282 -40958 -49062 -41642 -29740 -29140 -19854 -5245 -1239 -22924 -24903
15679 -24903 -18735 -15145 -15914 -18035 -6049 -278 -11653 -15020 -2723 -3432 -6128 -21277 -34390 -28409
15665 -28409 -644 9680 -7244 -40923 -47087 -21019 -18075 2041 3105 -10325 -14828 -26886
15653 -26886 -22275 -13056 -11974 -11655 -19666 -22465 -21353 -34679 -36651 -31791 -22054 -8209 -11850 -19166
15639 -19166 -19516 -17998 -23146 -22783 -23615 -17417 -14227 4627 22753 16323 760 -5883 -11058 4334
15625 4334 -10759 -10440 2797 -5116 -11125 2715 11148 -4598 -4299 -7097 -10722 -24663 -19324 -12546
15611 -12546 -19552 -17413 -9251 3123 12483 5424 -9157 -13068 -19558 -17062 -38849 -34329 -13023
15598 -13023 -15847 -27484 -38195 -31865 -29468 -16775 -16362 -15578 -11880 -8230 -6911 -15086 -36740 -34755
15584 -34755 -35549 -29043 -24990 -32549 -32444 -18303 3379 19029 3347 -1547 -9286 -13411 -19895 -27351
15570 -27351 -37189 -35913 -21126 -10980 -3212 8110 6778 1210 -22505 -24323 -24630 -25634 -11699
15557 -11699 -6650 6241 18949 31943 29649 36081 29721 12964 -10038 -22900 -21538 -20531 -22800
15544 -22800 -21389 -18139 -8608 -2492 28968 32199 5870 -3115 -2988 -9582 -14500 -20802 -20024 -11037
15530 -11037 -6003 -2166 9121 17028 15885 -1779 -8787 -828 4083 -16085 -21846 -26924 -28037 -9791
15516 -9791 -10685 -15751 7093 33452 50784 65069 55927 28708 -3022 -16801 -21187 -20691 -9259
15503 -9259 -8822 -10514 -14035 -12130 -22241 -15175 -14018 -13469 -7864 -8677 -21157 -29225 -21190 -29677 -10109
15488 -10109 -6563 -24008 -21916 -21713 -5924 -13360 -11430 -12014 -23374 -34032 -39696 -22701 -8126
15475 -8126 -12680 -12775 -13298 -28197 -58493 -43202 -22862 -21397 -28811 -19360 -9382 -6233 -14735 -19385
15461 -19385 -12919 -13860 -5977 10719 8778 -11492 -7724 1482 16301 15183 -3084 8507 13663
15448 13663 -5899 -19609 -31740 -19666 -20608 -26299 -39956 -36560 -25609 -14042 6982 -12407
15436 -12407 -6516 15425 30224 29536 22071 4634 -13317 -22669 -22992 -8085 4888 -8908 -19879
15423 -19879 -13473 -8319 -10404 -33896 -47909 -16054 -2344 548 2610 -1883 1386 -4803 -18521
15410 -18521 -12001 -15900 -17620 -10925 -15311 -20346 -25739 -21202 -14405 -29043 -21541 -9624 -10785 927
15396 927 15728 14172 -15795 -14785 -18734 -22945 -17600 -11329 -3148 3919 -4274 -18033 -16597 -5568
15382 -5568 -8160 -10352 -832 25448 26228 33807 53928 67118 51168 18489 -34200 -54636 -50764
15369 -50764 -45056 -46911 -50641 -35525 -16081 -13957 -7086 -2699 12 -4580 399 13878 12281 7996
15355 7996 8559 -5208 -6448 -4000 -2378 -26724 -26309 -20521 -25575 -24027 -32226 -26584 -13532 -2368
15341 -2368 14668 17854 16081 5123 -24417 -23929 -22049 -21588 -14524 -18120 -24275 -31972 -20725 -13944
15327 -13944 -7312 -13742 -13343 -26220 -14464 -6417 -2616 5839 12796 -12579 -31080 -26978 -27963 -33625
15313 -33625 -58570 -49769 -23267 -20549 -30936 -25179 -27259 -30562 -42045 -29009 -15623 -15492 -8562
15300 -8562 9649 -6019 -8368 6378 8039 3501 6573 1798 14188 9677 -5296 4690 13752
15287 13752 13201 19570 19208 19089 19569 21229 18737 23738 9088 -9013 1246 16559 19343 1945
15273 1945 -6840 6994 3125 -11494 -19429 -26867 -31229 -29220 -34948 -24715 -11264 -6140 -18702
15260 -18702 -10562 -15622 -6123 -572 -6879 1650 16866 -11163 -23925 -31011 -25137 -33114 -27568 -11997
15246 -11997 10870 17730 -1106 565 -10297 -186 -1268 3943 2134 -3442 -6033 1488 -7971
15233 -7971 -11693 -6706 -13934 -27820 -40819 -49651 -35261 -33432 -28231 -2647 33780 29114 13799
15220 13799 4167 3706 5479 -13964 -23325 -27158 -26313 -30374 -29040 -18681 -2894 5698 5818 1283
15206 1283 7580 5537 290 -6435 -14419 -15225 -21314 -29579 -19481 -7909 9670 17159 21697 9786
15192 9786 1679 3148 2569 -6847 1475 -2461 -7575 -9403 -5492 -16007 -17769 -18378 -25873 -28088 -16167
15177 -16167 12960 16719 29482 45315 40325 25239 25923 23575 20631 24103 16522 1419 -2924
15164 -2924 3559 -11402 -40927 -23903 -3888 1053 -6606 -8326 3307 8233 887 -8795 -6939
15151 -6939 -12281 -9091 -8237 -2848 -209 -7729 -5052 -4758 -9688 -2246 -14626 -20789 -8039 -5354 -2721
15136 -2721 -9900 5994 9828 10490 16116 3557 3013 -8775 -22310 -21696 -14213 3554 15053 10096
15122 10096 -14136 -43750 -35179 -21402 -17474 11489 10962 12974 2164 13084 26630 12278 3336
15109 3336 13390 22114 17134 7523 -282 2032 -3231 5480 -3807 -2049 -2172 -3659 -25282 -8184
15095 -8184 4313 -8654 -809 -4680 -8376 -19038 -19782 -15234 9191 24947 -2171 -17314 -28976
15082 -28976 -39566 -31124 -34083 -30740 -30736 -42137 -28670 -20737 -34391 -20227 4175 11489 20532 20761
15068 20761 12042 11156 6421 -1229 15779 9028 4620 -7176 -22404 -26484 -19992 -20057 -16330 8018
15054 8018 8621 20655 11879 -3209 -5333 -9534 -18698 -19142 -21775 -17903 -18751 3427 18817 27436
15040 27436 2362 -21514 -20129 -10280 -6169 -2764 6769 -1213 3883 2952 15319 5749 -17879 -11129
15026 -11129 16809 15333 -10184 -9791 -7064 3613 -1380 -2873 -19480 -30048 -15993 -13442 -14775
15013 -14775 -12016 -16459 -7036 -6242 6159 14265 4307 -8734 -4042 -8408 -13138 5297 17522 13496
14999 13496 6376 -6657 1485 23985 20115 17252 7628 510 -580 3458 3158 4000 10823 12488
14985 12488 10875 30129 20577 23737 49942 97636 109028 106551 100312 78148 53928 41629 19353
14972 19353 599 -8488 -6902 617 5210 23100 16092 11105 6348 921 4166 11931 -5881 -10986
14958 -10986 -33476 -35768 -22210 -6069 8044 16768 25650 13803 1454 1419 4788 8894 17510
14945 17510 11351 -787 -14431 -6065 -15504 -20804 1801 12229 1384 -12158 -16890 4328 12820
14932 12820 6884 799 25433 37185 26272 11188 -1895 -21597 -19930 -21144 14469 30400
14920 30400 45503 42534 41746 46590 17602 -15344 -9509 2890 18742 24185 32570 36380 8973
14907 8973 3085 -1439 -7025 9644 13964 12208 18820 -12089 -27608 -13939 85 -22942 -25566
14894 -25566 -18136 -6355 -4503 -3111 -214 2876 -11897 -14666 -28802 -23441 -25139 -26105 -31559 -25560
14880 -25560 -19450 -31639 -27598 -30147 -27722 -18595 -13755 -19918 -587 12921 -2882 -14253 -12100
14867 -12100 -5483 -1702 1902 5523 -10652 -20871 -26733 -31453 -16165 -1698 -8898 -20582 -28189
14854 -28189 -20952 -17725 -7908 -12852 5091 26309 40363 20900 -5103 -16054 -40701 -33061 -41389
14841 -41389 -39986 -28767 -22952 -16994 -16075 -22939 -30433 -19880 -11256 -9067 -9450 3392 11651 16220
14827 16220 -145 -28407 -23441 -12653 -27578 -30309 -18542 -3736 21954 4728 -20155 -11938
14815 -11938 -17382 -17779 -35379 -39696 -11085 290 -7845 -19592 -9566 -15625 -11495 -14531 -6695
14802 -6695 -6420 8223 8696 1446 -1125 -18714 -22716 -14478 -1559 23305 9137 -16034 -25146 -30039
14788 -30039 -20321 8683 23164 18333 13384 21168 23404 -5703 -8391 521 292 -2653 -8596 -1477
14774 -1477 14447 6272 3983 -484 -8221 -7794 -14329 -9708 -12432 -4813 16871 20774 7185 -20978
14760 -20978 -18145 -83 -2376 2669 6611 -568 -6887 2791 1762 -7168 -3527 762 7914 2562
14746 2562 14345 23028 17013 9987 -5506 4390 13891 5216 3062 1441 -3626 -6745 1912 3335
14732 3335 -15215 -13300 -23850 -14855 -14051 -13247 -21830 -22313 -32760 -31404 -29936 -20767 -8954 8630
14718 8630 9063 23346 9657 7444 10692 -4982 -4991 -714 -8804 -20502 -34707 -25536 -3565 7299
14704 7299 9211 -23524 -32564 -8496 368 4932 12945 18281 8025 7446 -2535 -22495 -30493 -21124
14690 -21124 -1234 12081 17472 20367 -1647 -16337 -24272 -19756 -34405 -21600 -8574 -1322 16310
14677 16310 18838 14992 12242 25109 12809 -878 -21272 -33209 -34699 -20447 -4285 47 8945
14664 8945 11749 17131 21330 12941 -404 2082 30466 35200 -4568 -19289 1065 -17105 -11201
14651 -11201 -5517 1841 9965 -19509 -52278 -43492 -24619 -24018 -13025 -9488 -15642 -19918 -18385 -18843
14637 -18843 -22550 -18962 8948 7817 -9087 -26193 -29926 -30385 -28587 -22675 -11280 -13601 3045
14624 3045 31012 28070 4639 -3123 -24538 -14392 -4814 4386 -2629 -17573 -17741 -21152 -17336 2111
14610 2111 16017 12774 8480 3068 9905 14533 11398 19216 16516 20824 3826 -24195 -32318 -32073
14596 -32073 -19800 -13526 -22305 -31418 -28143 -34678 -46864 -36898 -15557 -18470 -12677 10269 3264
14583 3264 -13524 1808 12140 8953 2750 2990 10676 19331 22906 38532 37424 44298 41638 49302
14569 49302 52021 63048 86490 96231 126387 192139 256778 333736 451262 614861 790160
14558 790160 932913 983931 939734 832567 687723 522005 394265 280222 194777 165446
14548 165446 143726 134086 125676 82964 61046 50048 46632 44443 36625 43424 46582 41609 41176
14535 41176 29639 17376 3685 -11686 3942 11336 10020 17746 34991 13910 -4543 -18113
14523 -18113 -22677 -13357 4106 -3379 -8297 -7289 -4646 -16503 -14057 -12819 5756 -1825 -9580 -10485
14509 -10485 -17657 -27793 -31328 -19328 19195 28269 14550 -439 6183 19021 26448 35121 31118
14496 31118 29636 32317 20073 9985 -1549 -11986 -12821 -15203 2871 30001 34782 22671 2414
14483 2414 -6945 -16428 -10399 -3381 10612 32713 22929 9461 505 5280 9940 11892 15888 33464
14469 33464 34815 32236 18049 -6432 10163 14457 23750 26712 34162 40433 27906 21755 24469
14456 24469 226 -1728 6201 14699 33901 36703 31217 20470 146 -13589 -7278 2843 16715
14443 16715 15099 22587 22446 6337 -753 -3624 -11377 -2017 -1620 10877 20246 8767 -735 -8658
14429 -8658 -9199 -5218 -3253 11650 16273 -578 -17757 -26218 -25469 -7071 -17129 -22519 -10594 -1775
14415 -1775 13119 18888 9088 6754 -4941 -2038 4397 -5481 -4915 10735 12050 4953 18736 35488
14401 35488 33542 19211 8917 14943 33783 30495 23697 -3688 -21405 -25553 -3950 -8550 -1978
14388 -1978 17042 19786 21580 27474 27441 35990 26675 26500 18881 13722 19959 23853 10501 6502 22017
14373 22017 10723 5133 7189 20600 34470 31108 3796 -1931 7275 2140 -4119 -13209 -4652
14360 -4652 9381 5053 -1249 -4569 -3978 8904 17694 13556 -1631 -4852 -1872 -3970 17532 13871
14346 13871 -5075 -14897 -10459 1747 8175 7628 16135 23133 41044 37984 25333 44495 38769
14333 38769 25317 6390 5730 -6412 -1856 4537 -2944 13710 13307 -12006 -31934 -35232 -41007
14320 -41007 -29084 -20830 -27441 -34634 -30967 -8528 5929 8952 -7408 -28093 -14425 8969 30620
14307 30620 29553 18298 15133 5669 -4717 -14025 -27764 -22063 -11734 15312 24029 5828 -1400
14294 -1400 22590 40831 27617 14321 19409 729 -14286 404 1378 -7635 3081 1582 4430
14281 4430 -11606 -14242 -3012 4214 2154 18158 22927 10286 9047 10983 481 -2527 -4981
14268 -4981 -15653 -1181 -2089 8939 7511 -4454 -11920 -10450 -1253 6337 8976 8734 3174 -5985
14254 -5985 -2331 2966 1119 -8062 -15574 -15278 -17208 -1010 16416 3091 -15153 -16566 6739 14273
14240 14273 33920 43383 29950 35392 21769 9327 3789 25037 9697 8014 -6583 4712
14228 4712 17704 20414 27623 41231 34363 24404 28479 2403 -997 22259 6017 -17439 -34501
14215 -34501 -29613 -19234 1355 -10424 -19922 -16223 -5318 18207 39225 48636 57826 52250 32031
14202 32031 13609 16925 7388 -2375 7343 11890 16556 27397 20900 2415 -28265 -30301 -15514
14189 -15514 -28855 -17160 6180 3207 1805 6224 -12918 -16033 -16026 7856 15311 -3000 11561
14176 11561 30514 17522 9915 13042 -3735 -25178 -30707 -35629 -34316 -26022 -7488 269 -9993
14163 -9993 -27622 -25877 -8140 -18220 -30642 2299 22508 36456 28862 18860 16809 3864
14151 3864 8947 18063 13432 6772 -517 8236 13061 7326 27574 42023 36620 22819 25355 33269
14137 33269 23302 23352 16790 12288 6341 -15129 -695 21495 19930 10549 5757 7829 14518 8750
14123 8750 -4346 -20808 -26579 -19321 -20351 -17390 -7438 -5760 -21764 -31587 -26118 -17319 -1845 5658
14109 5658 14860 12579 9482 -1340 -10571 -60 -7827 -8077 -8553 -7509 -21736 -19895 -23327 -21654
14095 -21654 -13912 -14509 -5849 507 14817 4736 13099 11705 3715 616 -3101 -7656 -2908 -8410
14081 -8410 1205 -14451 -11001 -1930 17189 25483 30308 24039 29631 18388 11529 12966 23361 31467
14067 31467 27790 1879 -19493 -13400 4409 10068 9893 -760 -8897 8731 11692 -2928 -8798
14054 -8798 -2464 5605 -3461 -14903 -6393 84 5923 18316 23681 15577 23707 20444 6914 -3361
14040 -3361 11792 25689 38888 35579 44049 42198 29657 31323 6043 17300 33999 32345 26139
14027 26139 10348 -1625 13987 16484 28016 34858 30689 22152 13248 13052 18876 9245 21971
14014 21971 18337 18501 6941 11828 29263 41689 36087 44689 49740 66635 65063 55999 51699 36597
14000 36597 20383 6582 13738 23842 36439 40357 35642 11902 -5165 -16475 -13429 9484
13988 9484 24588 33425 47849 40089 16329 39505 28963 11343 9128 -65 4742 10544 25292
13975 25292 21825 24085 28593 29437 26131 30232 37920 22474 17128 10694 -22 18760 32041 39346
13961 39346 22800 25215 26134 19524 16720 29313 38653 33977 15426 -6337 -11536 -7301 -2227 23410
13947 23410 33475 25060 11573 15933 24909 16392 9784 20131 25126 14122 -11 -7876 -17146
13934 -17146 -11601 15617 20201 2386 253 18765 39028 40616 39293 55790 59217 51406 35509
13921 35509 13846 13159 24359 21469 12004 6749 -2604 11709 21938 11256 13311 22937 16194
13908 16194 26711 29414 10277 3504 7143 14652 21706 43890 55193 54282 49390 44274 30975
13895 30975 14254 24271 26286 23719 11651 4781 4116 3750 -2239 -3544 -3361 2352 7998 13549
13881 13549 12619 6907 1243 6593 20901 16196 7147 -3302 -2481 9956 16255 16030 20799 30187
13867 30187 14907 19023 8675 12295 26132 23253 24794 12842 1875 -1133 2769 19678 47015
13854 47015 42177 41650 44635 24618 13684 406 -662 8639 15390 16049 26773 27623 21068 7745
13840 7745 14582 8450 2378 -13034 -7996 -3826 -5956 -1517 4962 -6578 1064 5914 -5123 -8799
13826 -8799 -1194 16930 29017 27184 8030 6053 19687 17749 11699 12432 3241 6273 422 11730
13812 11730 20436 36636 24812 23623 -1056 3971 17820 32990 19175 3475 16603 27672
13800 27672 40356 51624 69906 64521 45018 29902 23493 31181 33523 21259 18715 28310 32691
13787 32691 30809 35893 36449 41984 38425 34454 46861 62151 61007 53376 51105 43550 38387 46883
13773 46883 51021 36335 21769 26704 51742 49404 24305 -1714 -5714 7963 22030 27597 40390
13760 40390 22000 -16682 -15466 2071 7518 -14239 -28801 -19283 9453 26939 25421 20187 13502
13747 13502 -3125 -16394 -5880 -2140 -13296 -14617 -10677 -12858 15602 20817 31809 44703 53265
13734 53265 57796 38913 33132 24845 -81 1716 19274 26249 22335 24991 40272 37383 26210
13721 26210 14465 7670 23714 25451 29192 33568 39671 37352 39454 60792 61806 50052 54306
13708 54306 38838 29819 40945 42784 31215 42294 59302 50329 49974 49914 42264 19845 26394 31770
13694 31770 40818 35870 50267 77559 84569 85883 84423 66158 62830 49562 35376 36932 47458
13681 47458 41131 41788 33699 16483 18066 20128 28603 30120 33648 23302 30148 26337 34546 53789
13667 53789 58163 54474 34897 41274 45436 22627 27319 37624 19390 23423 16028 1325 19841
13654 19841 33578 27985 39162 50666 68182 56617 30663 23564 5843 11002 28217 36068
13642 36068 55479 67697 51584 35484 29300 1029 -15340 -20171 -998 20568 23287 27880
13630 27880 48459 50075 36688 23161 19894 30656 22851 19764 22996 18270 23636 32547 31763 27230
13616 27230 22700 13657 28006 22441 10617 17638 24660 31669 14149 14517 15829 -7214 -5112 13812
13602 13812 25637 31836 37196 44204 42445 40340 30866 20933 38131 53645 51242 52836 59949 68803
13588 68803 59374 46590 47645 48961 57000 47644 41180 35368 30578 34966 43289 48777 52891 33824
13574 33824 34667 57022 61089 70623 70102 75915 77733 64416 58479 63842 67325 86015 73622 74598
13560 74598 72894 96953 85368 74129 81207 110816 132187 136958 128081 142975 173502 180668 200158
13547 200158 259558 318066 364058 438639 589084 771463 970924 1139013 1238406 1246900 1162829
13536 1162829 995549 802371 621420 487528 369955 281913 240216 197477 168996 152047
13526 152047 140744 135309 133250 143153 139049 133490 105016 66812 56787 46195 41789 61928 39425
13513 39425 34889 71475 86469 84976 94852 82998 60872 54823 57652 61988 83740 80072 87385
13500 87385 70213 54797 43162 30921 26249 36326 43979 54703 46589 62671 53552 47561 41859
13487 41859 44001 34331 34150 41750 44246 34669 48471 70318 73786 79713 97392 96876 92010 74196
13473 74196 54348 52722 67385 67724 84847 76537 71232 59203 53182 37906 30819 50575 64086
13460 64086 76534 44787 21999 42625 51766 59413 53245 64190 48822 39513 60025 61861 55545
13447 55545 56647 55039 78639 92978 88986 90910 80047 100560 113969 116821 117944 114755 97399
13434 97399 103594 123390 132200 135914 151486 161254 185970 219781 239829 274258 366798 500810
13422 500810 683142 955805 1336378 1743136 2015433 2062955 1901917 1635543 1321965 1003700
13412 1003700 746560 571766 469851 381005 321694 270336 228693 186296 163099 171362 167485
13401 167485 141188 132335 138205 134589 117385 112282 117712 93028 89246 80001 62317 67786 89749
13388 89749 84000 72772 80310 73102 66614 66422 73297 84513 79981 71596 78680 94308 94583 119471
13374 119471 115311 116393 138111 153228 182768 216837 241813 268473 288605 272342 254413 244180
13362 244180 224021 199688 187903 154587 125441 105534 93744 92272 81039 81877 93787 76455
13350 76455 68237 68014 66496 74773 74682 105090 117463 110238 124488 142082 130940 107582 89137
13337 89137 77394 80177 85048 70466 56715 76115 83719 81113 96018 97642 94049 69606 65395
13324 65395 71497 76853 69758 61610 48190 47012 61638 91013 98694 107945 96299 97937 107526
13311 107526 114322 122030 119802 111930 109522 102220 114260 135350 167515 196800 210563 212047 219489
13298 219489 225893 234305 242009 273451 303165 346149 423527 450479 422781 395034 362317 310666
13286 310666 248033 220414 192156 174689 173610 176674 180781 194039 194551 196414 185611 175729 185389
13273 185389 190997 166734 162717 161587 183579 202102 211333 208294 202302 215122 267039 302548 319601
13260 319601 327720 327026 338623 317975 314081 322054 323597 344902 342507 354292 378093 439173 527126
13247 527126 660490 834142 1037220 1253827 1477648 1692276 1879877 1995193 2041699 2012455
13237 2012455 1948210 1777083 1552549 1409258 1294638 1170536 1071795 976852 874926 779343
13227 779343 689472 612845 546694 520602 495735 470776 477521 468317 436141 423267 409851 378603
13215 378603 382287 396925 399619 404876 418116 430962 426209 432919 442180 468700 487296 507720 509504
13202 509504 492934 486624 497040 491742 501318 501617 502606 492441 508855 513427 506489 490611 491830
13189 491830 500795 501226 489224 472731 470048 484660 516223 526718 529513 549404 587484 656811
13177 656811 723445 755776 764499 783136 789067 791549 818399 846898 885576 922819 979667 1035910
13165 1035910 1084352 1152897 1211236 1260077 1309599 1360938 1417214 1466897 1508469 1568385 1654984
13154 1654984 1733578 1829030 1939650 2047737 2154568 2315679 2492792 2672236 2888215 3118336
13144 3118336 3373271 3676032 4021565 4421705 4854824 5361199 5930931 6618452 7458505
13135 7458505 8452548 9561214 10742978 11999953 13335113 14849518 16657531 18907422
13127 18907422 21792158 25547489 30505849 37296927 46929147 61152603 82349087 112440910
13119 112440910 150324448 189288928 218863414 230681585 222879385 199468388 166974035
13112 166974035 131907361 99912768 74500139 56299747 43963832 35643994 29833014
13105 29833014 25574396 22274888 19546224 17195780 15092130 13257249 11677324 10279960
13097 10279960 9008760 7864241 6855967 5992639 5298952 4764656 4357592 4025324 3731717
13088 3731717 3481994 3290849 3129173 2969244 2859474 2778083 2656650 2530609 2392943 2287499
13078 2287499 2181050 2088644 1986729 1896492 1793952 1734482 1689633 1651393 1604771 1567383 1538440
13067 1538440 1493265 1437467 1398184 1380486 1349772 1321098 1313771 1303215 1281861 1263381 1246393
13056 1246393 1227895 1231089 1227659 1229728 1238811 1229112 1203999 1202043 1208654 1200451 1196490 1218063 1230165
13043 1230165 1227929 1259854 1289230 1329164 1339898 1364888 1388949 1399376 1408431 1437382 1469483 1504782
13031 1504782 1537000 1582851 1620447 1668994 1723165 1769548 1846192 1921300 1999052 2101612 2200189
13020 2200189 2300693 2447570 2638904 2853322 3032054 3156538 3281979 3414264 3587602
13011 3587602 3826153 4094086 4377658 4721342 5137451 5640693 6217864 6858814 7560287
13002 7560287 8344798 9196692 10182747 11302969 12600421 14013540 15571844 17423065 19707016
12993 19707016 22610109 26403594 31469481 38220912 47080371 58721207 74762776 98643905
12985 98643905 136293523 194770161 272713604 348882226 390160130 385889629 349858000
12978 349858000 295186178 230250173 168142102 119862197 87109528 65812783 51609790
12971 51609790 41603993 34144305 28370723 23806411 20099354 17078118 14593085 12542064
12963 12542064 10828819 9392472 8210963 7245124 6478731 5851084 5327466 4918408 4594962
12954 4594962 4324945 4086929 3863707 3671745 3504256 3356441 3230428 3127088 2991160
12945 2991160 2838765 2695863 2566670 2418508 2263985 2102828 1976927 1852268 1749394
12936 1749394 1653722 1566614 1496511 1433805 1404047 1364099 1323511 1302662 1285293 1278998 1250357
12925 1250357 1214928 1161901 1095679 1040881 988341 941216 950766 956053 954961 950467 939723 909359
12913 909359 895456 870422 852517 829867 807001 781114 768716 741489 672307 619338 599958
12902 599958 609867 597837 571462 557458 552478 544755 531654 503045 487572 461997 444205 457186
12890 457186 477639 483139 508846 514411 506000 504867 514337 510532 494279 483374 489449 511170 530065
12877 530065 551718 593595 607348 644543 685039 713424 742450 773184 780556 782737 779036 776588
12865 776588 804475 862758 907056 1002906 1121436 1251005 1401027 1556420 1742442 1973103
12855 1973103 2247452 2500499 2600674 2503273 2221118 1813938 1409162 1070767 837292 695107
12845 695107 618386 564990 512180 464700 438643 380457 337096 312047 268376 241866 225334
12834 225334 194954 217034 249530 277460 303405 322837 318548 312800 314106 319757 318924 313699 308680
12821 308680 298371 280911 264200 251451 245263 228077 215141 225910 223892 203540 194545 170348
12809 170348 161143 155285 150683 155536 135582 122331 138746 151793 142020 131421 120285 110498 90759
12796 90759 83065 86334 106858 109706 112702 136616 165897 170177 155312 136110 147224 149223 153850
12783 153850 174169 180003 186376 222147 224760 225771 247505 254184 247929 231057 222487 210876 174951
12770 174951 171983 181070 156887 134715 125782 107813 93126 103648 114201 112035 110907 126916
12758 126916 124509 122001 115642 120144 126216 141509 124234 122463 118104 108602 112513 117099 120222 111410
12744 111410 121583 126770 129095 131311 115559 115818 121958 154103 141724 126607 127989 118890 118151
12731 118151 128879 122766 110603 104035 127673 158163 175535 179280 175812 168885 186858 194304 172539
12718 172539 140074 129782 149128 168588 174391 158234 150458 139649 144506 143105 127833 154961
12706 154961 153950 137679 115905 99062 104691 109727 116252 151608 180197 208680 227720 258503
12694 258503 315263 385352 478890 613740 786323 997343 1156111 1194264 1140268 1012561
12684 1012561 866647 705160 540483 390343 309112 254987 240311 195095 164060 162432 157254
12673 157254 124650 94845 89519 128491 147283 120304 89524 69562 58446 68631 69134 39805
12661 39805 39134 43827 69168 74978 75404 63228 44988 59159 69991 63969 60716 62755 74786
12648 74786 71986 66543 57296 50451 45511 46493 74652 81226 72144 78073 98441 83149 85272 107280
12634 107280 119889 138664 167354 185065 225440 287094 331406 384381 434208 473087 487740
12623 487740 473312 443944 379487 298016 246547 198661 162392 130997 128279 107030 80162 62704
12611 62704 51676 59852 69119 74521 76070 70088 68422 56126 62073 91960 108041 96410 75629
12598 75629 69811 69972 51095 45539 32486 45646 49991 57592 59130 40862 47800 56783 66320 87119
12584 87119 91625 91168 94392 87038 78033 80555 104591 124644 143534 167870 186251 183341 196094
12571 196094 221793 262162 297848 282204 250647 232884 227038 213792 203892 186341 173580 162269
12559 162269 137858 134335 129153 127304 118621 118725 120746 118060 115367 133040 153391 195867 219386
12546 219386 243055 311503 400013 512219 690950 971103 1350531 1776467 2112655 2228345
12536 2228345 2119638 1895042 1586954 1253555 941402 711960 574832 458518 367961 319825
12526 319825 276990 234966 189301 160770 133859 114039 99364 83620 87869 89427 73648 58419
12514 58419 37538 16380 16763 15542 24862 38483 35618 17933 32743 58639 51942 32824 28561
12501 28561 44879 63615 74954 60102 53490 43196 65798 68943 46232 58930 53989 20542
12489 20542 16215 25719 19334 9311 15806 28031 40334 47029 47902 42779 38661 31700 30341 42534
12475 42534 37325 30940 42680 56264 39785 35400 39165 22589 32812 40158 29428 32083 12177
12462 12177 -15038 -19091 -22427 410 4722 -356 8278 2709 7527 13335 4906 19387 23852 20593
12448 20593 39230 55719 48155 39018 53786 55828 59854 43505 26404 10328 2195 -4269 1014
12435 1014 5408 11750 35190 44363 44358 21866 5687 4795 238 1892 15823 8566 -11186 -9630
12421 -9630 10907 18956 21266 16813 30351 32350 23762 13205 3520 12258 13310 4855 5602 1200
12407 1200 -1097 4305 3714 6207 6031 -13324 918 19656 5485 10736 19662 17545 23115 30799
12393 30799 14234 31483 20470 18500 38725 33390 26952 36981 39018 33077 27559 1170 -22952
12380 -22952 -20360 3842 12020 20496 39195 44574 40585 25687 27284 37488 28605 20437 2211
12367 2211 6135 27816 31213 24968 29015 19706 26363 20429 9446 3747 5762 13216 1624 19295
12353 19295 27939 26786 28585 25110 5195 -4268 555 9442 1421 8023 24168 16533 17065 26303
12339 26303 10530 9152 5706 -463 -7303 -9788 -618 -10664 -9361 -14931 -11959 -9131 -1593 7293
12325 7293 12761 -2416 -1017 12514 21189 16572 7326 -10039 -25646 -4255 -3889 -4964 15193
12312 15193 13381 -3866 -22002 -30861 -28469 -25393 -31871 -19020 8685 7132 5525 6496 -19129
12299 -19129 -29154 -18750 -3582 -13191 -9602 3158 3970 -8910 -11533 -17680 -16478 -20335 -14798
12286 -14798 -6669 -11233 1699 21108 28132 -852 -7204 -6357 -1993 596 -3265 -2110 6231 18140
12272 18140 37194 36985 17052 -1955 -16487 -14586 -21115 -23238 -1040 7166 10336 1976 8322
12259 8322 6562 -1754 4686 -361 -11591 -10738 -7808 7850 10318 2322 -4664 240 3185 9185
12245 9185 18156 12586 -7386 -9319 -87 792 13576 9946 1676 -20295 -35618 -15127 8816
12232 8816 15001 8349 19223 20648 1257 -8948 -9652 -18850 -30036 -41014 -51564 -52258 -40795
12219 -40795 -27721 -12697 4973 -9352 -12998 -8932 6928 12178 20700 31428 30400 20282 -10048
12206 -10048 -12558 -16576 2633 19454 7889 3685 14681 12253 11666 -524 -4173 -2695 -9460
12193 -9460 -41636 -30331 -16244 -7669 -8310 -16222 -5884 6484 7400 18191 32507 25188 32818
12180 32818 13359 9314 27126 22988 7455 -6265 -5279 2773 9046 5023 -12353 -18064 -23926
12167 -23926 -15539 -1449 655 -2967 -16105 -22061 -18656 -155 519 21827 23949 22474 15660 5491
12153 5491 -6564 -17779 -23848 -17456 -20162 -16135 -35370 -16850 11223 7047 9071 1089 4764
12140 4764 21852 18752 3593 -2291 9270 16576 -13517 -28230 -37438 -51477 -40360 -20215 27744
12127 27744 37224 14706 -3639 958 15375 4572 17531 16293 -217 5833 788 9032 17718
12114 17718 10744 4022 13024 27987 25296 12685 11291 13919 14177 19785 12179 35261 19724 21855
12100 21855 20020 14652 -3312 -12370 -10433 1877 8426 12139 9563 25183 29233 26032 24757 29025
12086 29025 23850 28541 24187 28524 23360 15084 8310 8974 25808 32354 34514 63737 74021 110192
12072 110192 156234 161598 135387 119647 103677 70941 35367 17636 33147 40700 26422 10648
12060 10648 -7065 -12555 -2988 21788 33390 21979 9176 -576 5934 16642 5911 -13395
12048 -13395 -29409 -13138 -6805 1813 4693 -257 -18922 -29307 -23981 -22836 -21304 4982 21123
12035 21123 12010 10815 15488 24916 24380 12252 9237 14969 3791 14697 33994 37788 40289 14950
12021 14950 -9888 -6638 5891 4405 -9532 -17017 -24617 -30593 -28948 -15265 -7919 -10614 880
12008 880 3184 -3229 -3035 -3941 -10417 -23534 -36639 -31911 -17338 -6572 -22728 -23243 -20572 -3504
11994 -3504 2191 7802 19428 -3519 -25034 -10479 -5567 -4373 8450 11909 19095 22711 20535
11981 20535 27484 22955 4420 -11129 -2139 -4624 -5008 5333 -1545 3204 1696 2883 11169 23940
11967 23940 31467 23250 -6609 -22017 -19018 -867 4566 6351 10841 5457 -2273 -7477 -30853
11954 -30853 -44489 -40837 -17370 17648 29789 31642 28191 33741 27435 23230 4272 7919 24248
11941 24248 33984 39588 47626 35907 40439 40972 44339 48695 41409 49951 43135 25512 33710 29110
11927 29110 2354 9584 27829 43979 34418 16690 10808 9596 5583 -5699 -12882 -22908 -32811
11914 -32811 -31712 -17272 -5292 -982 -4180 -2601 14104 14522 3118 -8586 -10498 6631 13259
11901 13259 10291 7537 6311 3963 -7624 -7549 15885 34464 22703 1654 206 757 14264 -4805
11887 -4805 -15608 -11421 -10163 -7051 -17410 -7188 -144 -7079 -14138 -9992 -13514 -8451 16679 28447
11873 28447 30723 32705 15135 7378 30188 26895 25671 23038 5967 8678 12076 13218 -15624
11860 -15624 -31389 -26005 -21118 -21363 -9337 -25785 -15940 -13536 -24239 -9149 -6192 -12290 -10208
11847 -10208 -24219 -26056 6594 19394 20370 15717 22715 28170 695 -1007 -99 3904 12797 5802
11833 5802 4249 -6851 2484 10472 525 1230 5413 18481 18511 24530 31188 23173 18453 33756 32120
11818 32120 11013 -6625 -23086 -26640 -17392 -11772 3272 -4019 -12097 -9054 827 -1654 -11430
11805 -11430 -4383 8320 12017 10186 21999 32908 10165 -5046 6903 26571 11140 13206
11793 13206 1784 -16626 -22987 -27770 -5553 -1623 -15973 -7218 826 -11284 -9464 -4469 79
11780 79 -5498 11359 2038 -278 -6053 -3513 -1290 -20042 -22284 -29630 -25732 8994 25213 8186
11766 8186 -825 -17923 -32155 -17780 -1471 -13102 -6624 3209 8478 6716 6647 6701 -8685 -20515
11752 -20515 9228 18336 12649 25250 27437 41637 27276 19697 9521 -9662 3645 -1026 6969
11739 6969 24482 19553 5757 1676 -21238 -26599 -34139 -18684 -4717 -8175 -3185 -8494 -11353
11726 -11353 345 -2413 -7895 -22346 -21692 4295 4547 -657 -7497 -5334 -9857 -2966 -5277 -14320
11712 -14320 -5776 -3175 -7623 -5454 -7132 9983 30752 34218 29447 31690 14499 5870 -3603 -2974
11698 -2974 -11158 -21074 -22845 -17104 -8530 -15013 -5891 -2886 -5757 -15623 -19779 -15113 -15130 -30296 -29101
11683 -29101 6675 8446 3774 6463 -4591 -211 -14213 -16438 -10183 -14390 -4692 4369 -4538 2191
11669 2191 964 7344 3514 20847 31461 24493 9920 17173 29297 15349 6150 25688 30927
11656 30927 41997 65642 90179 111553 127713 155815 190495 209148 212760 189053 172994 166802
11644 166802 147072 120037 105735 86322 50552 26589 28646 49360 66518 56785 54707 39463
11632 39463 36864 23380 20625 39103 31710 9561 -1915 -10825 7042 9258 14674 23086 34940
11619 34940 41221 34988 19767 15653 17717 -125 -6551 -9928 -2093 -1173 15885 14397 22774 26401
11605 26401 10464 8053 27604 37370 27772 30177 33026 31164 4892 8304 17428 2307 -13070
11592 -13070 -15172 -15851 -3512 -7384 -16637 -20781 -5158 -6932 -18098 -20870 -21972 -10615 1099
11579 1099 7868 11547 8581 -10486 -27909 -18385 -16833 -19373 -25680 -24090 -9901 8299 18478
11566 18478 23345 20034 419 -24084 -18874 -16392 -40118 -50468 -40888 -13100 518 -11912 -4152
11553 -4152 -14238 -28216 -25171 -8633 -5076 -17263 -982 -3552 -13699 -11463 -1647 4107 19736
11540 19736 15587 9306 13057 -6076 -29258 -14249 6654 7127 18421 23470 6374 17591 24096
11527 24096 29975 27217 25971 29755 40116 27169 13537 20896 27645 10474 -11360 -19365 -19359 -3112
11513 -3112 18579 28349 25183 17899 8116 939 5864 12964 28674 30815 33840 16614 3623 8456
11499 8456 -3664 -21615 -27234 -16753 -8681 5269 -2329 -10079 -14044 -31623 -35998 -19673 -13232
11486 -13232 -3317 -9846 -28150 -30013 -3068 18779 14105 19658 10588 1520 -8088 -4891 11846
11473 11846 -854 -8275 -11378 10720 27167 24614 4994 11225 12399 14201 10654 21163 28899
11460 28899 17891 16532 23510 30720 21859 10083 -5772 -438 -30 -22978 -31847 -43210 -27672
11447 -27672 -14150 -7465 -2520 932 16908 20547 4434 -8429 -1607 -227 -4274 1942 -4828
11434 -4828 -23962 -27379 -15726 -14535 -4823 -12918 -13860 -17266 -25559 -23682 14878 21090 -12438 -18045
11420 -18045 -9424 -12895 -25298 -9647 9334 25722 24271 2483 -10497 -18577 -7040 8526
11408 8526 16378 10070 18347 39613 26441 17277 10896 15258 16046 19790 6566 -5037 8695 1579
11394 1579 9388 13289 17500 14551 -7289 -14181 -616 -2492 -1411 -6980 -6235 692 12136 -1170
11380 -1170 -3926 -3417 10664 10040 1636 -5522 -4804 -7555 15766 37401 27133 21760 2172 -20186
11366 -20186 -19486 -5800 9242 -5456 -17399 3389 21455 16923 -11398 -7742 -5965 -14770 -4605
11353 -4605 6006 351 3175 14058 11260 3981 15602 5422 5805 20631 23975 20900 -6191
11340 -6191 -2014 11975 27492 35019 47038 36803 22843 19298 19788 17454 4271 -1085 10616
11327 10616 6838 14935 27334 20810 5410 5098 4656 -2955 -3616 -13775 1987 15863 3508 4030
11313 4030 2510 -3473 -9228 16170 16380 2727 18770 21746 24242 5870 325 25177 28289 22184
11299 22184 24990 30764 19048 20937 27465 15717 10676 11784 13263 11100 13364 23888 30943 23123
11285 23123 17056 8724 7181 11142 -296 -818 13029 23535 15780 -2176 3862 8751 9961 23507
11271 23507 37362 51642 53691 36012 28636 22324 30423 43247 49562 49409 32166 41807 24686
11258 24686 3260 -8989 -40047 -20021 7964 -896 -8612 14753 25925 4232 -14876 -4579
11246 -4579 11565 13788 14871 3150 5393 -8957 -11160 -3766 -3357 -13266 -25342 -25434 -5894 23854
11232 23854 20506 21064 27686 19105 16132 30676 26550 29223 35128 44699 40683 30672 18577 14140
11218 14140 15540 14351 24449 14342 25170 33718 34441 40988 44071 41810 34340 44248 61125 45450
11204 45450 22333 17858 14737 4774 -23920 -16657 -10462 5835 37057 66681 72689 43268 12284
11191 12284 16034 20828 25919 33472 14394 159 -1948 -6019 -10091 3687 10421 26820 34936
11178 34936 27329 31072 27641 15140 10352 2348 -7598 -6066 7934 18278 20840 17067 15412 21023
11164 21023 19894 28156 32352 42886 51028 46857 63271 83459 83399 65513 37008 11458 2451
11151 2451 -17200 -21788 -16874 10101 21850 13280 7281 3766 1050 5922 -8657 -14788 -4842 -1476
11137 -1476 -4266 970 -2340 6002 13483 21778 19588 24791 38629 38076 35349 21590 5068 18403
11123 18403 19069 9673 22458 40963 40373 24625 9035 -51 7488 16252 11163 12453 10594 4266
11109 4266 -8556 -20437 -6034 4616 9469 32454 28900 22418 1890 -6897 -13602 -2113 20934
11096 20934 14665 1983 1600 29090 34469 45916 51500 39578 21966 21859 30740 27946 30587 29856
11082 29856 34009 49956 52902 52991 57725 32165 20612 27552 38918 30574 25453 21921 13689 20980
11068 20980 40116 40535 14976 2615 26043 35442 32367 25490 7197 -5271 12122 20912 38701
11055 38701 30623 38244 49667 50792 38998 23021 3160 5551 12173 10400 36160 35786 44186
11042 44186 49005 48709 40136 41978 37043 50678 56569 40347 15004 7269 18292 37748 59302
11029 59302 57501 52227 48803 45159 62411 84000 96320 115616 134397 136011 143651 136506 147280
11016 147280 171795 203587 244964 302139 390287 492968 630470 843881 1149603 1583055
11006 1583055 1966963 2097158 2010593 1799123 1493286 1156032 855055 620138 470380 369039
10996 369039 295854 251414 218230 172806 144357 145159 151931 135113 112002 108553 93420 85499
10984 85499 74464 75846 84513 80097 76013 62245 52035 41396 57174 63935 53706 51697 59054
10971 59054 58968 66313 53441 48922 71590 81011 64143 53720 56513 86539 97640 84254 73110
10958 73110 61068 51537 51299 62958 61547 66937 48869 26902 30522 47791 46527 46411 32505
10945 32505 34285 37247 26872 18537 23387 18267 28980 24236 23622 32357 26481 10836 18114 22679
10931 22679 25111 39161 45460 42507 36617 33263 40340 40949 46075 34451 50892 64414 51435
10918 51435 45996 31953 45837 41418 46976 61169 45012 35206 36175 29602 42991 53507 65525
10905 65525 88322 95749 81507 79056 82146 64461 50883 46284 35737 25546 18675 31086 49400
10892 49400 62629 56399 34030 43601 58272 72320 63796 64364 85611 76043 84501 108131 106798
10879 106798 80811 82516 96190 104009 101996 88983 80871 75768 81901 89396 77575 79923 97430
10866 97430 83859 79089 80671 81865 73402 46639 31348 29571 21776 41454 43366 53757 46827
10853 46827 34056 31907 52896 53359 48819 51919 65702 85802 96654 99082 108085 138854 161020
10840 161020 199881 253984 317096 377318 388790 369748 339765 283625 231136 186131 145919
10829 145919 123124 106393 105634 104130 84506 85784 103833 98602 80720 68095 72410 55045 48391
10816 48391 55359 53533 51597 58262 62471 68679 78054 73050 80169 86046 75166 62342 71926 84004
10802 84004 82112 81123 94828 95879 77361 78827 82665 83542 51972 12060 -5304 -24211 -23886 -146
10788 -146 10492 25766 18091 24412 61111 79006 108258 110470 117669 95369 64822 65604 86434
10775 86434 115318 160424 183362 172901 168829 167621 166117 177621 174596 183705 175744 187410 204498
10762 204498 199212 202009 198901 204829 221461 204600 183180 149517 133694 145335 161760 146824
10750 146824 144974 159696 160689 142137 134872 125595 97098 70372 46821 46089 79711 120412 153313
10737 153313 176325 189530 200656 244618 287738 298915 300076 296145 306107 319156 319640 341054
10725 341054 362392 365974 389238 418113 413635 437893 482713 596611 813154 1085014 1366204
10714 1366204 1687162 2099103 2501997 2810982 3004393 3017997 2809811 2423299 1932390 1518734
10704 1518734 1253895 1088452 949060 839023 765089 714380 654756 614810 589784 559756
10694 559756 543555 528233 520683 528074 526210 554704 572767 549726 553781 566328 560989 553813 539594
10681 539594 535298 555325 588863 615968 675327 728540 748817 761379 774918 766868 747083 729023
10669 729023 707738 690318 684519 679335 689327 690708 697298 708437 705908 688110 698565 730275 743066
10656 743066 760065 763385 776261 783676 805058 844537 895317 927694 955126 1016935 1050087 1115147
10644 1115147 1180528 1218578 1241084 1269141 1302008 1351496 1409171 1461506 1510798 1564201 1625282
10633 1625282 1686695 1724262 1744652 1796158 1846994 1910761 1969390 2025298 2111849 2189799 2285237
10622 2285237 2405032 2568231 2736844 2947235 3221048 3518886 3862946 4239018 4644724
10613 4644724 5101264 5612836 6220271 6937019 7720985 8613140 9664597 10882163 12105448
10604 12105448 13218759 14262743 15406462 16781614 18497662 20740766 23673987 27539901
10596 27539901 32634728 39364374 48367038 60756263 78503491 105112270 146384413
10589 146384413 209476573 292893114 365662892 388265702 366932958 325651043 268646699
10582 268646699 202405245 144590183 103544701 76453754 58466365 46131059 37353830
10575 37353830 30917724 26106682 22372922 19394634 17073502 15287001 13865958 12553562
10567 12553562 11227083 9970394 8822754 7756364 6834398 6099648 5556624 5138294 4779195
10558 4779195 4470081 4217542 3991636 3809943 3642090 3474727 3299293 3137195 2956378
10549 2956378 2781380 2625158 2458513 2280058 2156453 2057233 1939716 1814565 1717898 1630555
10539 1630555 1589771 1532713 1456778 1429943 1401513 1367444 1303206 1250065 1209177 1161488 1103976
10528 1103976 1049285 1008381 965845 939153 913696 896997 885316 870503 855966 837342 836348 832203
10516 832203 792115 782516 790678 760436 742805 752852 775281 803839 816871 816351 809117 786695
10504 786695 738869 680955 633094 615828 619313 613324 619437 656623 740189 836894 922819 964088
10492 964088 944377 901866 823323 725770 625670 566172 531452 513422 498070 502377 503624 520732
10480 520732 527533 545783 572844 579517 580469 585022 616225 632191 647014 674468 709283 777777
10468 777777 866976 971291 1086669 1216322 1356868 1499820 1674469 1940499 2231688 2443470
10458 2443470 2504492 2338836 1973240 1579137 1264792 1008048 832452 774274 783554 813582
10448 813582 850140 876047 833487 771571 673083 543899 435211 346977 282491 259505 246643
10437 246643 222679 268509 323358 351974 349707 344863 314859 308227 316653 301233 280869 265881
10425 265881 236938 211413 213921 196481 197790 217251 215371 199319 178429 165433 119048 89996
10413 89996 95867 110137 104734 104811 106629 100145 92955 77308 71693 87733 89605 93138 83228 53887
10399 53887 30584 39335 97795 144612 168237 148013 122219 116874 131668 137234 137614 140687 167605
10386 167605 185491 202961 217128 220410 228808 228778 227463 215609 187442 177482 159909 148869 138340
10373 138340 139674 127363 114018 107999 111066 120853 117114 96438 88898 100530 120423 125150 107821
10360 107821 89113 99164 115249 119201 135694 152199 157176 141166 141570 137209 128957 118868 105554
10347 105554 111957 105412 122355 115836 102724 101189 111604 104687 86140 82704 86799 78510 71056
10334 71056 58640 64816 90514 88803 84178 96257 124065 119349 113919 123361 140337 141402 126653
10321 126653 103592 68066 58753 68369 64651 61663 72370 79010 93897 95580 93512 89975 73801
10308 73801 65628 77868 85440 68770 67093 51951 45867 57507 75089 47007 54220 81521 91611
10295 91611 88785 95991 87962 96467 95664 113051 122375 144835 182403 197970 222688 249483 295645
10282 295645 342497 421119 504244 609529 722342 826411 910220 937873 949762 978181 1020813
10271 1020813 1101003 1243623 1444131 1633105 1720766 1642098 1448503 1228370 969209 737951
10261 737951 564618 431490 339033 279506 231304 218812 200263 163981 120377 111015 112279
10250 112279 99128 110639 113577 105113 95032 101467 87058 69694 70963 74311 68822 77027 85346
10237 85346 73553 65647 63621 67997 46603 42061 51001 48438 52609 42151 33969 41174 49288 45394
10223 45394 59595 79563 66801 44542 55471 62042 57789 53470 31899 26679 13478 9527 19417
10210 19417 15608 27471 34494 33347 32410 42392 51746 50199 27388 27665 31096 41361 40388 36397
10196 36397 32977 25049 43948 61606 63342 58542 45832 48403 58567 36812 40348 62486 86952
10183 86952 98390 89294 91685 97582 83824 84639 122477 145134 153580 158830 170041 167222 203592
10170 203592 238616 289290 359621 457204 573677 756286 1043191 1436102 1843325 2055387
10160 2055387 2010769 1818839 1515573 1166635 858951 615596 448525 350092 270789 224717
10150 224717 198706 167023 139661 120052 132745 136200 143881 155436 128659 113963 118834 105576
10138 105576 82096 68851 62900 54822 32324 36042 39023 47644 53451 68204 88067 98753 93896
10125 93896 81433 66810 57925 56500 53327 46460 35172 20400 22585 22222 29397 28060 11845
10112 11845 21446 24421 24727 36739 48895 50145 27365 20101 17320 26744 38153 34893 12966
10099 12966 -2871 1512 1685 17848 46668 68346 64215 48297 52254 48105 38292 42406 56376
10086 56376 61487 47446 26709 11637 21124 26323 1099 -5464 5069 30386 41784 25873
10074 25873 4196 1920 18799 45122 44625 24933 30962 49702 45088 54667 73227 89915 123662
10061 123662 148421 144244 125890 106816 88557 69355 56477 42698 34163 31916 37267 34051
10049 34051 27699 16372 6851 17542 37000 52934 55652 41309 22735 12409 13710 18234 20815
10036 20815 7149 16392 19352 14453 9737 11454 23070 25783 24616 33125 35688 40725 36305 25635
10022 25635 18925 16853 24849 28753 27841 23223 18558 579 -2411 7756 16862 36116 42000 48000
10008 48000 46208 40035 44723 48289 38625 34013 34261 31145 20053 19374 20568 25972 17901 4753
9994 4753 11246 32236 35034 43592 34595 6666 2484 4587 -326 -17722 -30867 -34975 -26770 -18487
9980 -18487 -8759 5149 25152 26490 26623 30165 26164 30085 30861 35036 38237 32232 30872 11061
9966 11061 19734 28669 20711 14111 14316 6799 14773 23270 25741 30064 29079 44073 23349 13852 11555
9951 11555 22783 21802 17367 23843 31151 43415 45171 32299 28679 26160 22274 11388 20452 14161
9937 14161 4210 -2942 13436 43491 55207 60074 58194 60059 50602 48680 44078 34022 23395
9924 23395 25503 11966 9693 5164 -3574 -9012 4409 12001 14804 8513 628 8906 17277 13394
9910 13394 15796 20758 1744 -9451 -25147 -2637 -2162 5202 19086 11160 -4718 -10029 6451
9897 6451 19140 21269 21794 9975 15546 13785 12637 20638 16759 14417 30854 30227 35209 37524 28592
9882 28592 16892 9387 15355 27474 18506 25263 27069 21697 19650 31575 17574 -6698 4999
9869 4999 26397 24979 5842 6143 18419 17420 13867 3676 5406 863 7292 10927 11648 6130 9697
9854 9697 15046 2219 -4105 345 -6586 -7130 7175 7738 5471 13095 11631 12621 28667 54248 40751
9839 40751 39610 53225 65151 68775 61570 31157 390 8794 22307 9229 -56 12880 5889
9826 5889 -3713 13078 17074 6614 18317 13498 -3363 -1733 -7473 -26901 -15945 -5196 9557
9813 9557 2498 -751 18314 25119 8765 9567 16304 12400 10162 21068 20886 16032 14855 4500
9799 4500 10600 15555 20779 17513 26660 32170 39571 30086 17567 9256 16807 13343 -9213 -10757
9785 -10757 10639 25777 33346 27995 2547 3803 31968 49728 45154 33272 44481 36578 14476
9772 14476 3771 3342 24643 24412 20238 19672 17915 11822 15923 22669 7373 -3446 7134 3755
9758 3755 -689 11530 26427 26086 27095 22665 36031 57563 36238 24029 20624 14367 -4924
9745 -4924 -32582 -40454 -37794 -33689 -12385 -14622 -12825 11091 18521 9001 31245 26088 10021 8250
9731 8250 14588 27886 28484 27263 13498 16015 24381 28414 29982 48672 58311 60757 62263 52187
9717 52187 59315 64810 39024 13457 -463 6835 30791 37078 46586 59859 52734 38756 29612
9704 29612 34869 43321 44988 28635 28799 22901 18283 13423 9707 11009 14760 18420 5312 -13122
9690 -13122 -17053 -13103 7203 26487 62099 79958 74555 64408 52642 40484 17818 20295 27558
9677 27558 17254 -1493 2326 10870 9734 20262 30688 48416 45757 33503 27259 10212 7067
9664 7067 10894 4321 1438 20350 37135 33166 16239 7319 12417 9186 12037 -1265 -13177 -1140
9650 -1140 21139 33930 21267 19605 11905 10429 7210 6927 -14333 -4981 3522 5399 -1011 -10748
9636 -10748 8877 33163 28007 7088 19232 21852 24742 4249 -10961 5529 22920 30886 49467
9623 49467 52185 45714 36429 38585 42797 28919 5461 5490 -4464 157 22466 28066 36279 38774
9609 38774 33394 15326 22474 35709 36266 17825 3185 24879 45346 61895 62595 53545 51046
9596 51046 51474 56164 43060 24411 27905 33530 32988 32729 25142 38759 45853 24567 18019 28837
9582 28837 37891 44483 48152 38040 28120 25897 37268 57162 65758 58917 42394 51696 41971 45791
9568 45791 37607 18796 22732 38074 38649 26235 28933 34063 36614 47622 67543 85103 66533
9555 66533 40659 8504 9902 17125 10123 -6143 19748 47431 44332 46060 47758 62568 60115
9542 60115 42321 40243 45362 25432 -5667 8803 44362 49715 44965 36733 38943 28207 10225
9529 10225 13319 18314 40789 53926 41116 36695 23227 386 12811 20473 16794 32388 37757
9516 37757 32922 21818 25720 33880 19123 17433 32872 31552 24112 27932 34059 38258 37077 28013
9502 28013 34860 39919 45060 53305 52332 33369 38199 41756 35971 39601 45602 54368 64850 63368
9488 63368 49849 56375 59214 56004 76201 69451 56458 52329 35637 35346 68480 75012 56076
9475 56076 51931 54277 54313 54011 52911 57205 60784 64547 85239 81110 78249 75397 82591 69352 76362
9460 76362 76847 68238 60312 70130 73612 66408 52252 49950 64179 78947 84217 101482 117628 115711
9446 115711 122340 129799 131176 129664 134428 140003 133135 136332 140720 140968 116535 92859 92858 82458 84508
9431 84508 80283 68693 76354 81639 88875 86648 80480 77374 81430 84032 85790 88136 92758 94495
9417 94495 87995 97261 92941 76890 82805 96072 100192 110926 103442 118976 117399 82701 61188
9404 61188 72538 76017 84482 94192 114554 117447 116686 104316 89908 94727 103325 88086 89096 111585
9390 111585 116746 121674 112053 99866 115262 135403 154829 171415 148360 120692 127618 132000 141266
9377 141266 173491 181167 180634 166316 145382 155815 173622 181282 180368 170218 180847 197722 207863
9364 207863 206339 203143 198807 185280 186810 196145 194442 205930 203815 207154 207341 209431 196816 185257
9350 185257 195411 193657 209417 221761 210113 197363 219206 235290 259852 273767 256025 254403
9338 254403 290337 299501 311182 315499 318267 343335 357180 386861 398233 412181 446649 479830
9326 479830 529942 589233 618574 644539 685745 701526 726026 716722 721004 728915 717150 689932
9314 689932 651436 631784 614166 586833 560262 556069 555069 543484 530671 523836 513759 513822 485930
9301 485930 462875 472269 473186 480714 502819 502210 493519 481141 486301 505734 530584 557526 550856
9288 550856 532601 521128 539035 560765 557476 568356 583740 575190 588035 612873 623995 633262
9276 633262 643661 669757 702281 724502 745741 763204 782819 791044 796119 813127 816740 815652
9264 815652 835402 865565 911564 948923 985178 1013099 1052184 1064137 1080718 1129454 1159659 1188540
9252 1188540 1216642 1255469 1307196 1364585 1399409 1439980 1495500 1556747 1624657 1707140 1778341
9241 1778341 1849788 1920716 2010153 2094546 2188118 2279356 2395035 2529613 2646901 2774953 2917880
9230 2917880 3075935 3247456 3440109 3663318 3894702 4145103 4429062 4739388 5080547 5435684
9220 5435684 5816207 6254032 6755170 7299454 7904965 8581478 9332591 10175135 11149891 12231643
9210 12231643 13470986 14901685 16531090 18395119 20557423 23041793 25878585 29095546
9202 29095546 32715514 36695814 40958860 45341108 49538109 53184843 55895181 57349146
9194 57349146 57363614 55962712 53351127 49806753 45696902 41384558 37108631 33087624
9186 33087624 29414548 26120888 23227837 20676556 18446050 16513337 14831530 13370181
9178 13370181 12093919 10975738 9988880 9115123 8356211 7677723 7061101 6519993 6030754
9169 6030754 5628848 5275122 4917117 4579032 4300518 4066320 3856489 3643768 3431570 3236002
9159 3236002 3074025 2929282 2784083 2666298 2562816 2427818 2311873 2184035 2067120 1961365
9149 1961365 1877029 1816923 1746271 1696429 1635740 1571703 1519408 1461598 1411318 1346676 1284014
9138 1284014 1250807 1220230 1182793 1125529 1094874 1040018 1011230 970833 935153 914237 886298
9127 886298 870744 875110 872866 852871 814204 780271 751773 750762 738456 719857 692641 669975
9115 669975 627721 617047 607189 596319 576999 556196 527014 522480 521303 526702 513595 498353
9103 498353 492615 468480 451167 465037 475510 476351 476148 469074 453151 437757 442499 452095 439371
9090 439371 439560 415208 424246 450289 465239 461432 463619 476038 464790 464170 484771 496394 509172
9077 509172 521988 538959 574088 590780 600773 611465 637106 655912 655516 636653 614490 608446
9065 608446 601024 583712 549523 530448 491253 421710 398537 380333 368688 341550 314589 295980
9053 295980 289135 278956 281555 266085 262019 256450 249368 242534 236255 249095 237721 223877 205140
9040 205140 218714 234498 246493 215527 183048 194593 199507 174077 169792 155728 139984 139891 148909
9027 148909 164052 165787 148867 139637 148610 158836 145289 143163 138895 142391 164321 146863 118132
9014 118132 122204 131668 131094 118180 121255 117635 112067 117410 128035 127520 121501 107869 101439 91188
9000 91188 98242 112878 132953 124681 98823 102813 118491 109444 125160 131374 147626 148762 134051
8987 134051 132013 131725 125109 118342 117119 116441 106173 105224 106520 118043 117075 88421 69202 76031
8973 76031 75088 83333 65172 56141 80966 114353 120593 87285 60371 71370 80090 72608 98388
8960 98388 117039 130400 112643 94639 69865 66410 73774 82947 78858 76960 83280 86935 73255
8947 73255 70964 76123 73279 77284 70702 68404 78714 71904 80634 84602 86841 72609 69918 74191
8933 74191 78595 66562 58243 52269 47902 61924 88755 91304 62306 53957 48353 41582 31829 44233
8919 44233 69775 87720 71943 50449 23952 10100 16038 35125 40150 33381 20037 26561 25580
8906 25580 40294 54484 50317 40963 19201 27177 34783 52864 65345 68094 57885 41098 36246
8893 36246 24252 17406 10939 33319 50559 62926 75201 70858 62218 58116 56564 46937 45808
8880 45808 47062 45385 34102 37425 36780 24128 10030 14036 9432 14502 28621 31888 40422 32458
8866 32458 23787 27101 37403 28055 35639 35697 35702 30271 32470 29112 24072 28671 21628 8735 19540
8851 19540 22221 21957 6328 31582 60327 46084 32717 25463 35334 40339 38291 39563 35566 19695
8837 19695 21374 31563 21834 12859 34795 42954 34225 17505 21062 39175 31711 39739 53239
8824 53239 63513 54353 48558 53001 53021 41257 33601 43894 43771 40349 33138 27766 34449 45258
8810 45258 41701 48916 59932 63223 49711 45915 37292 4645 6221 26405 43194 48191 56433
8797 56433 63301 57431 62934 49856 36083 37954 31636 18554 18688 22590 27595 41379 40093 48043
8783 48043 53558 45287 29030 23732 37121 31797 12580 7383 20612 32782 47921 57915 32152
8770 32152 17346 27824 33256 20504 12843 29974 26031 35041 66168 68964 47807 37121 36387
8757 36387 50262 30675 22327 36011 40283 40320 32396 25375 11686 20076 23513 17124 18960 46629
8743 46629 58711 52988 29944 23171 23820 33754 56646 62885 55550 51066 62617 70533 72021 64808
8729 64808 44831 35994 47109 66479 50313 36715 41983 40369 41112 41732 54926 52301 39141
8716 39141 29547 25630 28576 26351 22399 42071 57201 44396 47403 62669 58758 47940 50933
8703 50933 69081 75735 46882 30817 39437 45059 46360 57912 70932 96137 96124 75157 75304 67868
8689 67868 49777 30698 8941 8944 16230 46698 47673 39729 26021 28369 43837 37966 15542 18379
8675 18379 25663 34503 38330 31964 24256 25590 32237 22112 20078 42513 51495 45572 22007 5534
8661 5534 6728 17421 24390 26507 39399 38707 35156 39385 69132 52873 45630 18548 -26034 -31544
8647 -31544 -19396 -2069 -1900 -81 28848 44422 39076 30829 26397 28561 26893 29262 32607 36064
8633 36064 20535 19998 36896 32530 32128 49130 34961 28484 35769 66063 65184 42061 32967 58818
8619 58818 70661 57450 42937 25630 19005 25729 23073 13588 2593 -2100 13097 -2567 -15084
8606 -15084 -13814 -6237 16827 40655 45714 44044 43733 27380 26083 42858 44014 43779 44977 52418
8592 52418 53612 32188 31915 30377 30227 40887 44951 53511 55939 67793 64885 55468 33661 27277
8578 27277 27250 25021 28876 29414 47564 46584 28583 33041 10336 6494 19595 24783 25373 24822 16037
8563 16037 20243 28083 26824 43658 28559 23894 19701 18983 24333 19729 11239 1384 2384 10278
8549 10278 14816 26187 42928 36362 22162 27722 20422 16069 18132 26738 5509 13 5368 9027
8535 9027 1674 3000 2820 1500 -8180 -16194 -14815 -2888 2477 13004 31999 22684 21522 34905
8521 34905 39249 6527 -10334 -8060 11124 43035 25756 4852 -3043 -3609 -128 -2936 -18199
8508 -18199 -20102 -6299 -11426 -8702 -5401 3968 18595 8999 -3612 6296 12702 1610 3041 -7305
8494 -7305 -19347 -7025 -8679 2056 18930 16758 28138 32639 17333 12839 27434 11201 -14354
8481 -14354 751 28383 27474 -5160 6192 8118 10040 9397 4178 -7071 -4072 32524 29274 11513
8467 11513 10666 -15664 -17823 -31402 -36579 -28936 -26760 -7522 -13343 -21466 -18322 -17400 -2902 13653
8453 13653 13690 5334 26530 42432 51445 42316 10003 -4970 2475 8400 -11706 -13550 3281 10477
8439 10477 3833 -15162 -10602 -1428 -4723 1949 9208 1733 -1569 8427 9023 -11667 -17682 -10931
8425 -10931 5305 5762 -2961 1378 6232 19562 23343 36816 69256 75098 95552 112823 98552
8412 98552 81104 63944 48548 31552 40956 33402 25086 12419 4198 -6320 -5958 -343 2965
8399 2965 17850 15946 -1706 -14892 -20476 -18762 -29578 -22967 3354 1863 3251 11521 20200 31341
8385 31341 41116 31024 27934 23970 26242 32257 34735 15899 13632 27927 44144 48217 42424 44798
8371 44798 53066 58638 46087 46753 22223 25880 20637 30798 31089 20728 241 -3371 -5119 -1229
8357 -1229 20304 26627 27178 12709 30775 36419 36669 23795 6694 2850 -8648 -11101 -1835 1567
8343 1567 10034 7759 1242 5612 5543 9119 -8155 -25230 -34776 -21523 -5336 -8621 -11182 -20304
8329 -20304 -40659 -39270 -24374 -209 -4639 11586 43062 30148 16156 12578 3092 -6668 9001
8316 9001 4239 7179 7739 5907 -20845 -28232 -11070 -4283 4757 1067 -12413 -27952 -15595 8720
8302 8720 15172 25601 15411 -1299 5559 18297 -6652 -31966 -34283 -31492 -3615 20377 18916
8289 18916 6019 14470 21813 11478 10276 6691 -33 -1836 6373 8317 -10344 -10047 1819 -1199
8275 -1199 -5257 -92 22432 22402 25278 18252 -13393 -23788 -16174 -24013 -19909 -10042 -690 -12014
8261 -12014 -12577 -8384 10249 29187 22523 9338 13602 -3350 -7949 -28006 -18413 -19626 -30805
8248 -30805 -37809 -34399 -30733 -29971 -30576 -33555 -27685 -29760 -33500 -33775 -4026 5230 9424 -4580 9528
8233 9528 21419 22028 14483 13722 11617 -15747 -30922 -19163 1804 1863 -5056 -6981 -25186 -21678
8219 -21678 -17025 -14779 -28976 -15903 11709 15547 -13831 -25968 -13059 -2595 2156 -4393 -10752
8206 -10752 -4367 -22830 -13666 17982 36003 24544 -1646 -24130 -30136 -7762 16403 36031
8194 36031 37464 49828 38266 51405 62709 38855 -11884 -31359 -24703 -3237 4538 3586 5431
8181 5431 16556 35313 38407 31724 16807 -6389 -18966 -17223 -520 -7510 -15960 -11557 -443
8168 -443 2316 11344 16457 12823 12539 12167 26073 13434 -4234 -7893 -12759 -14155 -13890 -7268 -25241
8153 -25241 -7382 13651 9947 4984 -288 -9318 -21105 -16555 -14562 -15121 -22586 5290 7229 -13485
8139 -13485 -36294 -48345 -40302 -47200 -41508 -24813 -27540 -31124 -17116 -3179 -1140 -18659 -3142
8126 -3142 25883 20235 21057 8917 -10125 3337 13617 -5132 -29176 -20423 -6445 -7602 -6714
8113 -6714 -420 13479 42177 53366 47065 62394 70645 54903 47900 41178 35040 30587 11857
8100 11857 -8782 -10700 -4086 340 -16843 -30348 -7311 31736 31831 11850 22548 26358 19994
8087 19994 27776 -4232 -7852 -4910 -10444 -6450 -6302 -5895 -6846 -23536 -32956 -25690 -30175 -21943 -12003
8072 -12003 -716 -13088 -34756 -31399 -5774 22087 1153 3351 26750 31188 45300 57821
8060 57821 60565 55095 63965 79542 82225 64371 41621 35778 45791 30353 17885 24732 14386
8047 14386 15290 28097 32435 4633 -2711 14791 26145 26466 9082 9495 4444 15498 29391 10295
8033 10295 -589 8571 8783 5183 26646 40181 33678 28723 34565 46705 38422 26831 44128
8020 44128 71797 63904 47393 40917 31990 23667 35117 32466 11920 467 -6268 54 13731
8007 13731 5360 4914 17025 7945 -10175 -7137 9409 35510 25821 16041 -10703 -22260 -15779
7994 -15779 -8509 -18385 -25768 -7088 9058 9577 12162 1082 16017 28926 27533 24538 17865 6978
7980 6978 -2289 -3047 23773 36934 42351 38902 40228 39504 35018 39152 42181 34750 31796 20362 2482
7965 2482 4768 20060 25082 23200 13446 928 -1578 11609 6980 -2487 -12431 -38936 -42213 -16974
7951 -16974 10688 22614 28438 27594 14600 11155 16220 21778 19112 19643 22848 12013 6099 16395
7937 16395 17627 7391 6742 -130 -6872 -601 2451 -16330 -26740 -40695 -26561 -6967 4337
7924 4337 17779 17381 22559 17201 12023 15380 12613 13395 -6693 -14200 -11170 2535 19737 11452
7910 11452 11642 15338 7340 -8629 -30509 -31405 -16490 1634 10342 4757 -11731 -12268 -12660 -13768
7896 -13768 7365 22258 33980 26141 14742 11247 15325 1384 -4829 -18771 -13687 -776 16002
7883 16002 16973 19876 29290 28709 8760 12669 25642 21086 17907 6854 688 7776 20239 14130
7869 14130 550 -11750 -5551 9931 -1879 849 6189 18952 2010 -22069 -32811 -23250 -26168
7856 -26168 -21605 -19776 -9713 4589 5673 -7923 -16335 -8060 6461 2011 -6307 -1637 -6233 -1184
7842 -1184 5253 -2153 5820 5863 31733 41856 32753 25416 12773 -800 15436 16047 19237 15376
7828 15376 -3703 -11602 -22908 -29056 -32164 -17686 -14722 -17850 -7199 1637 167 -10021 -5275
7815 -5275 6260 8685 2492 -560 4780 705 15247 16806 -5359 -4858 -17387 -34485 -29394 -25493
7801 -25493 -18991 -12587 -15036 -11086 -1090 687 -7520 -8398 -21241 -28609 -23575 -11669 -9297 -9103 -3586
7786 -3586 3968 4545 3009 -14420 -19051 -11778 -26966 -19620 -21150 -16246 -3195 -7397 -16711 -13322
7772 -13322 4951 -714 -4111 -9006 -763 13341 -6374 -11741 -8525 -6176 19 -1765 1106 -2678
7758 -2678 -4989 -2598 -2150 15091 11167 -9514 -21103 -26499 -21323 -18430 -26446 -4656 699 -21833
7744 -21833 -15057 -18349 -24178 -16613 -9636 -10126 2772 3507 5211 -3950 7292 17710 12701 11352
7730 11352 8330 -578 -17327 -12458 -17510 -13025 -16401 -23146 -15167 -26493 -17981 -4863 -9341 -34034
7716 -34034 -18489 -3648 -7179 -15235 -8401 -14220 -2970 6833 21385 16778 29571 26996 4555
7703 4555 3263 15543 18398 -4877 -6196 -16772 -22196 -7804 6039 19646 5567 -3704 -1825
7690 -1825 15617 17916 -5211 -17971 531 9271 -1483 12817 12527 14224 8946 6300 18761
7677 18761 26640 12327 16189 4365 -1279 -3852 3173 10151 220 -9071 -25941 -21835 3769 20486
7663 20486 30377 15967 6435 14478 4718 -12121 -20272 -15759 -15231 -4629 -9494 -5856 -22778 -31098
7649 -31098 -16080 -6195 5902 10353 14167 32969 29157 10749 8120 588 -8168 -5887 -4452 -9054
7635 -9054 -12886 -24873 -21827 -18730 -3675 21329 30402 27019 4289 -6246 -150 1060 2324 6276
7621 6276 -1617 -3694 -3756 -9672 -17199 -11431 -3692 -16034 -33736 -51184 -53353 -48476 -29886 -20262
7607 -20262 -13464 -10311 -14965 -8360 -16445 -10645 -22636 -32572 -27660 -33064 -32686 -15805 7717 -1385
7593 -1385 -7897 -11871 -34124 -28226 -12422 6536 14569 7812 -3895 4353 7568 -3223 -9935 10195
7579 10195 18468 17536 12865 10144 16100 25129 9264 -1173 -11645 -8903 -1757 -10750 -1455 -12
7565 -12 -13829 -3082 -13903 -24756 -7371 -3844 -4776 -2030 -11010 -9026 9823 23948 35383 23275
7551 23275 -14149 -24154 -8592 -11504 -24359 -5121 -7157 -13365 -29945 -18587 -8355 -28875
7539 -28875 -48266 -53870 -27032 -17855 -7539 -2392 3759 -796 -810 2327 -7448 -11211 -36731 -26820
7525 -26820 -12397 -5251 -12393 -33516 -8135 4019 3326 -13658 -17152 -16270 -9761 19 -19218 -25179
7511 -25179 -23718 -31137 -9919 9687 22352 -4380 -11137 -6803 -15244 -34773 -37615 -34026 -30331
7498 -30331 -26121 -16993 -2189 14660 18021 9037 -3108 -1851 16536 27828 27686 26945 -2830 509
7484 509 27667 24596 653 -13186 -21046 -18551 -24042 -29792 -10411 11595 6535 -8226 -18223 -19570
7470 -19570 -9262 4087 -3787 -12088 -8397 14417 23190 11619 -4472 -25187 -36911 -34722 -18041
7457 -18041 968 23175 30586 27645 11567 3760 1310 11156 23513 29579 15309 13448 30749
7444 30749 26234 7841 -18825 -34625 -23156 -23968 -37550 -33429 -25971 -9191 -9162 -21356 -20994 -12751
7430 -12751 -17622 -19064 -21378 -25653 -32367 -22339 -24059 -30503 -20263 -18547 -28832 -16205 -24354 -29251
7416 -29251 -23477 -7754 -9063 1883 -3007 -13799 -11600 -21075 -29163 -21463 -13472 -13951 -18676 -21771
7402 -21771 -13763 -2206 1921 5046 -9591 -34568 -31919 -20004 -20053 -12659 -22462 -14961 -2891 -6381
7388 -6381 -4856 -10690 -16242 -3779 5257 17888 18356 21885 19454 13549 15898 6645 1908 5040 10131
7373 10131 10684 19641 6728 -1841 -1867 -12799 -12814 1679 2301 7878 -4097 -4011 -1842 -1740 -13450 -29758
7357 -29758 -32770 -10260 -699 -6982 -5595 -193 -8651 -20297 -26495 -17445 -8903 2518 -2033 2543
7343 2543 14976 22973 2230 1123 16260 3847 -4417 13171 8643 7740 1043 -9295 -19723
7330 -19723 -35079 -16394 -2589 4144 12053 11698 -11895 -12788 2952 -3352 98 23229 8746
7317 8746 -5646 -12536 -10081 -8423 -17846 -1684 8315 10207 10101 13198 16594 20766 966 1479 -5169
7302 -5169 -28990 -4744 11994 6683 1038 13408 20946 21824 20922 3534 6013 -857 -14893 -13147
7288 -13147 -15175 -25809 -42374 -31990 -25959 -23198 -17060 -21437 -32659 -46915 -55377 -48873 -20163
7275 -20163 -11211 -3726 6172 -27164 -30733 -6557 12978 1800 -9738 -21847 -22126 -13289 9718
7262 9718 2371 -13039 -13262 -17927 -5223 -1588 -6293 -102 3128 -7931 -1772 -10409 -8946 6345
7248 6345 -8213 -31295 -23193 -27900 -32685 -18972 -1829 5933 4197 -8217 -15151 -19562 -20333 -16898
7234 -16898 -10681 7234 -2094 -2204 -18246 -22096 -22366 -23784 -21978 -23304 -16783 2901 5849 18421
7220 18421 18714 12977 -10371 -49882 -40855 -9104 13776 -3918 -21607 -20496 -20834 -20402 -21349 -23791
7206 -23791 -21056 -18091 -17289 -13733 -20686 -25115 -31405 -27078 -11894 -24795 1187 13354 4961 -3261
7192 -3261 -2032 -1769 9297 18756 4179 970 6353 17814 16147 10105 -19384 -28427 -42626 -33678
7178 -33678 -22858 -21739 -42551 -48719 -11309 14511 16454 848 -1381 -7970 -11482 -10562 -22378
7165 -22378 -26008 -25483 -21184 3713 25608 26355 5813 1335 9590 8173 5872 -1354 -15026 -9293
7151 -9293 -30607 -36077 -37805 -44103 -33037 -24667 -30718 -15688 -10793 -6508 -19789 -29976 -20142 -3212
7137 -3212 13985 9578 17541 24285 16760 2040 -4199 -4929 -11861 -31614 -21336 -9698 -512 -7187
7123 -7187 4322 11665 1173 7929 21884 22100 18138 13614 24085 21061 17602 25274 21383 4070
7109 4070 -10902 -28004 -27438 -3999 13784 12615 -4041 -20007 -19752 -13030 3409 361 -13157
7096 -13157 -7033 4533 -12652 -23420 -16581 -5540 -5037 -8163 -17662 -4270 4469 -9521 -4803
7083 -4803 4516 8235 2318 -19196 -23654 -17294 -6 16137 6651 -4995 -13733 -7272 -5284 -15369
7069 -15369 -7662 -10275 -2494 -18331 -25914 -23854 -19853 -5023 3715 3319 -21365 -29849 -22887 -19330
7055 -19330 -19554 -11873 -14075 -17533 -11640 -4320 8463 -2359 -8820 1672 5684 9755 7197 16071
7041 16071 18528 -148 3054 11292 -6238 -5501 5978 -1644 9979 12753 9185 25895 42765
7028 42765 38123 9618 -10225 -6294 -4842 -12545 -15837 -11497 -5712 -12719 -11641 2134 3562 -6645
7014 -6645 -7810 -18323 -19436 -23589 -22109 -7047 -1813 -8047 -12170 -12871 -8672 -4052 -7885 -17951
7000 -17951 -9071 -762 -2684 -12267 -24758 -22008 -13928 -13891 -14777 -4887 -1580 -19509 -37304 -25607
6986 -25607 -2877 8651 15676 23136 8916 329 8380 4446 2838 -231 -1688 -12328 7239
6973 7239 30819 20421 -7989 -23837 -22713 -19339 -26992 -28109 -28476 -28981 -25650 -35548 -52169 -31358
6959 -31358 -7479 -5998 -72 -12887 -24053 -27340 -24214 -18328 -4387 -3061 3555 10510 -4422
6946 -4422 -31152 -51395 -47914 -30876 -22272 -20365 -19869 -24278 -33156 -17396 -18865 -14430 -13880 -20184
6932 -20184 -29958 -29913 -40635 -56042 -42424 -23462 -9899 -15627 -6362 -8671 -1922 -3413 -3695 -10612
6918 -10612 -2799 -7552 -22958 -38873 -32728 -4003 -4767 -4992 210 17378 10480 -3209 -6166 9237
6904 9237 5655 16957 11666 10202 6959 -1407 4649 13700 20576 -6499 -20284 -13941 -21867 -26922
6890 -26922 -19618 -37784 -36102 -11998 -11242 -20054 -27744 -34079 -16454 3190 7557 6742 -2268 -7304
6876 -7304 203 5676 6296 8285 12362 19169 10063 -9857 -17609 -16096 -8899 3961 -7035 -4118
6862 -4118 5964 16160 -5972 -17883 -4968 4270 -15429 -11533 -1873 -1055 -19714 -16813 -4482
6849 -4482 -3366 -6159 -19318 -21032 -16572 -5764 -14649 -4968 2596 -3389 -4356 -837 -5876 107 18923
6834 18923 11945 8038 -3774 -7039 -5527 -10264 -26244 -31201 -38016 -49400 -40819 -20443 -20331 -20534
6820 -20534 -29833 -33705 -20440 -15222 -7439 17374 3414 -10044 -14351 -32571 -25204 -13491 7568
6807 7568 2367 17101 18281 9100 9161 14213 6715 -3708 -17580 -22118 -11973 -26363 -20513 -16529
6793 -16529 -18863 -20838 -16389 -16322 -24131 -19133 -17478 -23074 3664 2431 2363 10687 16685 22251 25451
6778 25451 27020 4196 3318 2137 3091 11613 19606 13318 34901 26953 5970 -1455 1085 14465
6764 14465 10102 19733 32713 28654 24008 28027 38261 24474 5842 6075 10463 13082 -513 8965
6750 8965 26321 39327 47532 42693 34805 24490 9931 7634 18424 -168 -13048 -14151 -7010
6737 -7010 16454 22845 5938 -4360 3846 9908 -9920 -10841 -5349 -15861 9021 34693 44802
6724 44802 52399 61929 103670 149172 196550 228576 210889 182513 157945 132383 94921 61891
6712 61891 26710 24425 23626 5103 8858 15475 29277 40772 40060 40173 30128 20905 -1783 8550
6698 8550 3591 3752 15367 24378 23718 15338 -8264 -25093 -35307 -36262 -22223 -9028 -11555 -5142
6684 -5142 -11174 -16910 -15166 -5970 15223 21212 3963 -13261 -15703 -17164 -18680 -2914 -10665 -16952
6670 -16952 -6256 16778 30021 25324 13958 19703 -891 -10138 -17466 -19057 -9559 2772 8249
6657 8249 -3695 -2386 -1514 -4096 1558 -5310 -9866 -13702 -5151 11712 7171 -1657 -12304 -23142
6643 -23142 -20626 -13326 -19390 -14519 -12452 -28409 -20391 -11889 -27589 -31202 -30216 -16813 4226 24088
6629 24088 27519 26396 23812 12542 8279 24128 17414 -569 13073 20815 28280 16238 -7191
6616 -7191 -28476 -27063 -12881 -26929 -18187 -7243 4859 3766 12797 9853 10349 6875 -9120 717
6602 717 -12102 -9954 -12932 -16319 -6197 -8025 -17430 -3542 13660 13014 -4045 -12888 -11421 -11431 -20105
6587 -20105 -40775 -38363 -30271 -13306 5015 19645 19427 8994 275 6693 441 -4633 -20045
6574 -20045 -20450 -30277 -6611 7930 1119 -10117 -6736 50 4567 8856 -18220 -16668 -18780 -9989
6560 -9989 -8856 -22979 -15120 11304 12039 2448 -23212 -24217 -1235 25980 20603 12848 -1813 -16429
6546 -16429 -29311 -30407 -19562 -10367 -14200 -13255 -10505 -8764 3012 -5497 -21269 -30418 -26229 2527
6532 2527 9278 -2368 -1718 7406 424 10972 784 -6675 -9763 -8120 -5309 12466 4897 -2872
6518 -2872 1020 -7759 -18692 -19674 -24039 -9839 37 5541 -7559 -27053 -27645 -24166 -18954 -16172
6504 -16172 -22630 -23782 -26476 -30267 -29935 -18708 -28168 -34237 -25485 -6573 -3229 9795 13605 -7142
6490 -7142 -23479 -19746 -24028 -28002 -20381 -8680 4372 -705 -14799 -14696 -14529 -7655 4371 -10862
6476 -10862 -20123 -22314 -26922 -27350 -29930 -21098 -14734 -4357 -5316 -13980 -25747 -30646 -42433 -22214
6462 -22214 -12172 -11537 -27474 -46447 -59338 -45934 -37539 -28134 -11625 -19144 -25992 -12599 2391
6449 2391 14078 20912 3317 5831 22007 10722 10179 3166 -7770 -17887 -29488 -13694 1277
6436 1277 7042 1398 -3197 -8477 -19672 -18685 -1962 5393 7607 -4032 -22610 -31535 -28391 -27026
6422 -27026 -36189 -30382 -17160 -34481 -14888 10451 9935 12126 5671 -9062 -16387 -25237 -21464 -5270
6408 -5270 1008 2387 8159 5799 -3922 8419 12168 27103 6350 -7360 3149 17325 36591
6395 36591 38152 16171 5030 -9670 -16602 -17010 -10196 -4205 -7143 -1059 -5319 -13302 -30975 -24351
6381 -24351 -24745 -14188 6399 2727 -8736 -27857 -37993 -32890 -21532 -41417 -60176 -45651 -17682
6368 -17682 -9353 -12243 -33285 -28082 -20690 -22366 -7730 17534 20131 -7217 -16077 -15388 -18500 -26135
6354 -26135 3483 10239 -5919 -16713 -32260 -15670 -6639 -23794 -7056 3268 -983 -3548 4998
6341 4998 -9486 -33825 -47450 -48639 -50629 -27804 -21672 -11135 -7433 -7501 666 1588 414 -6401
6327 -6401 3479 17103 22568 13096 7550 -4561 -11047 -24656 -38269 -12093 4852 1831 -258
6314 -258 -2686 191 -27930 -54260 -59313 -46190 -16904 -8128 -3092 11839 2075 -16409 -16973 -23272
6300 -23272 -10809 6357 15939 3560 11939 16233 7126 -1508 -13056 -11811 443 4523 -12273
6287 -12273 -10587 -5822 -8465 -25579 -24705 -19468 -19107 -5811 1547 -14379 -6215 -12967 -10891 -3009
6273 -3009 -6354 -4492 -3400 -3010 -4306 1870 -6067 -10620 -23108 -25942 -8353 -8261 -6008 -13031 -17120
6258 -17120 -15951 -16615 -14582 -5693 -31273 -36730 -18478 -14159 -14403 4382 8142 8148 16363 20076 9277
6243 9277 -13288 -7558 13986 12949 13499 694 -1408 1547 -3956 -7651 280 10466 3630 -4832
6229 -4832 -305 12192 3486 -14029 -10971 6167 14155 -6987 -18657 3391 15151 23939 4115
6216 4115 -13051 -15473 -4882 30 -15994 -22802 -22364 -25852 -18837 -20394 -8096 3926 23187 19933
6202 19933 11876 9777 4857 359 1109 8835 10904 18773 15513 -2933 -8330 3465 20276 12136
6188 12136 1880 -6681 1927 12046 14240 -3592 -10820 -2311 -7533 -8247 -9342 -22233 -35726 -5996
6174 -5996 2236 -7435 -21870 -24003 -31123 -16776 5464 8535 20246 19724 21348 19469 15780 3800
6160 3800 12423 21521 11298 -22202 -41318 -14942 -19526 -24052 -17331 -9665 -6304 -7453 19197 27506
6146 27506 5546 -8209 -9319 -21260 -35457 -10148 7399 7769 -3107 -6226 -11266 -21136 -22848
6133 -22848 -20988 -21366 -21054 -18227 -24797 -19070 -13753 4783 13427 7896 7747 -3294 -7993 15948 11841
6118 11841 -9155 -5710 2389 6327 38021 38747 19754 4223 9 6098 8972 -2793 -25949
6105 -25949 -34379 -25438 -14636 -401 19349 17224 -5926 -18916 -8523 31176 32083 22611 4362
6092 4362 -13579 -28483 -26707 -11634 -4276 -4206 -1978 3253 4576 238 3923 1679 20164 8395
6078 8395 3731 8122 12515 16428 16543 14287 7369 4933 17750 19325 12743 5463 9735 6028 -8908
6063 -8908 -16262 -9007 -677 -18735 -18707 -5262 21289 38811 26052 8582 9466 5151 -4655 -3195
6049 -3195 22977 11984 -13707 -24208 -34102 -42342 -33795 -17735 9214 12754 -4498 -10854 224
6036 224 27446 26070 17118 31104 45189 14602 -15147 -17385 -1130 -7647 2331 11274 -9084
6023 -9084 -24760 -14573 -5828 -6642 -14797 -13137 -5007 7471 16366 7993 13140 20046 15272 -13643
6009 -13643 -15794 -8233 -21586 -15993 -11656 6592 1665 -21213 -7158 -5203 1654 -8353 -26382
5996 -26382 -25562 -32491 -22898 -16480 -24483 -17976 -9046 -17525 -15815 -6280 819 8235 2883 -1092 -2690
5981 -2690 -14952 -27570 4301 14690 9640 23482 35277 22920 9430 9403 12072 51 1703
5968 1703 2565 13963 470 7979 4906 2901 -13091 -1652 13135 20670 -2676 -1049 18471
5955 18471 26717 14374 1901 -12191 -14343 -13477 -15762 -17683 -10211 656 2040 -18380 -23142 -23950
5941 -23950 -27163 -26727 -18220 -2592 1948 13212 15630 17870 36794 39218 26794 4055 9133 11272
5927 11272 7872 974 -12559 -3560 13893 11505 9824 20812 6819 11439 11865 1377 2870 11156
5913 11156 -4233 -4677 3763 6872 3973 3260 3180 -991 -3063 -829 -11110 -22880 -22458 -18927 -5200
5898 -5200 22280 9794 696 -11942 -20545 -10553 -11725 -24299 -17316 -3858 -4451 -9029 -16548 -23821
5884 -23821 -36383 -28393 -27213 -17390 -19332 -16239 -19584 -19184 -14694 -1903 -17384 -45990 -44337 -28391
5870 -28391 -4955 -2956 -10614 -14366 -10661 5078 33880 40730 10015 -8379 -1698 -4176 -15748
5857 -15748 -5463 -2386 -1327 -3818 -10310 -15406 -20335 -13566 6291 3034 -7565 -13282 -17572 -15760
5843 -15760 -20503 4070 6687 -4041 -11014 -7137 2049 1961 -1361 3814 13434 -1209 -5084 6562
5829 6562 -1712 -10962 -3812 -5535 -21255 -41434 -49792 -32873 -859 -6484 -20385 -22291 -17700 -27932
5815 -27932 -23075 -7423 19169 16757 -7507 -18659 -26272 -32348 -45343 -42231 -6378 2887 -12050
5802 -12050 -20553 -14189 -27815 -35086 -19024 -13679 -9520 -17682 -21964 -27004 -22822 -16698 -6615 8603
5788 8603 1813 12310 18427 14429 -6131 -1326 -3193 -10631 -3960 12255 4336 -32260 -31295 -21555
5774 -21555 -16882 -20793 -21315 -6243 -11606 -10078 -11419 -10202 -29242 -22344 -16763 -10016 -25697 -13194
5760 -13194 3871 2727 2435 968 8390 -14952 -13834 4401 1334 -710 -9747 -20180 1867 16845
5746 16845 18336 -7634 -25018 -6126 6814 13376 15860 5891 -14577 -25744 -33278 -21856 -17161
5733 -17161 -11500 -29951 -18075 -3713 -3239 3942 1707 -3820 -14810 -20945 -3859 -9710 -8960 68
5719 68 4186 3837 -5842 -9924 -2827 -8272 -15944 -21445 -25316 -20141 -23109 1912 22118 28329 31201
5704 31201 24781 22562 17610 -1599 -17649 -13117 -11299 -23554 -25894 -17146 -3558 920 6512 -13066
5690 -13066 -9116 -4368 6207 16670 23073 25721 4403 -3758 -7463 12339 13968 -4391 11294
5677 11294 11095 -25389 -23381 -14753 -2474 18458 13381 257 12675 7325 2712 -9808 -2432
5664 -2432 -15565 -33712 -33080 -33987 -31897 -20487 -24458 4333 8446 -11943 -11751 -901 -20681 -38192
5650 -38192 -21425 -7067 -6716 -12144 11447 18182 9049 -6465 -2002 1605 -1124 -5626 -14464 -10990
5636 -10990 22190 17101 1092 -11695 -6577 1071 -12855 1968 11458 23388 12207 5511 316
5623 316 -11796 -11504 -9040 -492 -23554 -32480 -10122 -3990 -18447 -18626 -5394 -184 2719 3561 -9856
5608 -9856 -19047 -15796 -14049 -8521 3008 15926 9615 778 -9231 -6710 -4080 -1617 -13576 13364
5594 13364 3232 -18539 -8358 10871 -1677 -7994 -8999 -11877 -16804 -15049 -2003 4147 1813
5581 1813 791 -7305 -22961 -35166 -27307 -24243 -11378 -2989 5164 5930 -1684 -8137 -11100 -13289
5567 -13289 -21547 -17467 -16036 -27836 -14572 2645 3580 10696 39791 51892 27198 1358 -25115
5554 -25115 -12782 -2231 -17122 -23370 -34600 -31407 -22819 -2810 -14463 -26290 -22389 -14701 -13993
5541 -13993 -19822 -30926 -40985 -40907 -38717 -40379 -25053 -25679 -24691 -25699 -37725 -33254 -1557 -15193
5527 -15193 -36341 -27026 -38003 -32871 -18639 -26022 -19336 -16452 -9664 -3590 -10303 -11504 -24812 -26192
5513 -26192 -4775 -5755 -29429 -31320 -20746 16 -5441 -7258 8489 11886 16313 14949 16680 14531
5499 14531 -10789 -17729 9817 16879 13841 10127 25535 37127 11560 14001 15714 -3913 -12415
5486 -12415 -12657 -17277 -22656 -30049 -26826 -13094 7785 10508 3693 -8108 7373 13552 3333 -767
5472 -767 -886 -4960 -1515 -11294 -20855 -6336 11109 -4934 -12798 -7119 5018 -9828 -22451 -10973
5458 -10973 -13022 -17855 -14860 -2062 15250 7865 2076 1021 -560 9807 18580 25788 25907 25461
5444 25461 21008 14477 3583 814 -9334 434 2813 -253 12762 37322 15469 -13911 -12658
5431 -12658 -2529 10946 7080 15644 22308 8393 7373 3600 8833 921 -20865 -21435 -17001 -4350
5417 -4350 1735 2315 -7744 3752 12906 2737 -4502 -1293 14081 35505 30527 22360 4421 4136
5403 4136 972 5090 2357 3431 -11986 -16697 -17820 -20551 -17346 -21785 -14660 -14757 -9363 4819 5031
5388 5031 -3009 5378 -2406 8253 -2281 -22920 -9182 14692 14823 12217 14847 6851 14798 23653
5374 23653 19729 1118 -12913 -4677 3504 44 -7999 -3725 -14383 -17111 -11208 -1450 -5391 8790
5360 8790 18935 21835 27047 5355 -4259 8780 24215 24525 3669 5518 6371 -9176 -8262 -3812
5346 -3812 -4464 -12110 -9737 11950 26144 36626 34770 11343 -3048 2983 4644 14822 36447
5333 36447 31907 3577 3122 85 8279 7080 -7119 -15783 -16963 -5846 11258 23410 27253 14661
5319 14661 9627 17090 18347 26526 19374 18310 7832 30110 16180 -15181 -20514 -6643 4335
5306 4335 -666 -9126 -8584 -26307 -40367 -29518 -23006 -18853 -31220 -20229 -19367 -18170 -12183 -26686
5292 -26686 -31274 -33709 -31393 -24777 -1560 18851 40597 42687 25057 3362 -5750 3344 8503
5279 8503 11042 12596 13840 13347 12371 19955 7955 9101 21874 24621 8965 1873 -2197 -5718 998
5264 998 4307 24710 15660 -7210 2220 3787 -6043 -10276 -2409 -13425 -27195 -8013 -3374 -12786
5250 -12786 -10549 -13229 -8981 -10487 -21957 -23804 -18549 -3289 -12045 -1854 12067 25822 9915
5237 9915 -9811 -17680 -12754 -27625 -24902 -9854 758 -7312 -21940 -10800 1726 243 8138
5224 8138 -3277 1835 21272 41086 49221 28727 9137 4739 31621 20226 4718 -10392 -6743
5211 -6743 1373 3512 -1910 -1629 -3931 -2219 -11190 -3800 -4538 3182 16136 24839 33287 10126 -9911
5196 -9911 -25865 -9626 -14106 -14508 -24372 -23445 -16162 -3525 17877 18785 18988 31892 8400 -11187
5182 -11187 -16164 -20131 -17854 6834 -2277 3739 2431 -6095 -19390 -28216 -32047 -31393 -24704 -26357
5168 -26357 -10994 -3110 -1253 -279 -16650 -30482 -32124 -16399 -4088 1701 -13652 -34349 -38337
5155 -38337 -44623 -43114 -28707 -3768 5672 25347 23330 -9851 -24408 -2343 16508 14871 -481
5142 -481 -6094 171 -7352 3177 9012 -3702 3990 14600 2778 5958 11127 5480 2637 -1878
5128 -1878 -3365 -9174 -16424 -6256 5696 -6996 -2039 7215 3855 -12853 -17185 -11549 123 -9069
5114 -9069 -22976 -29558 -29308 -30843 -12867 -11839 -16480 -3445 14949 -12192 -11100 -17216 -15812 -5489
5100 -5489 -5828 -14983 -9895 4579 1160 -20788 -44202 -50749 -31123 -1196 7305 1225 -5086 -11320
5086 -11320 -19879 -16270 -5230 15030 24313 20493 -355 -1171 -4619 -5547 -3218 -18058 -21284 -2907
5072 -2907 8864 -8827 -1260 -7438 15641 13718 -4889 -15135 -14820 -865 2518 -9062 -16319
5059 -16319 -14052 -10102 3041 12045 20662 25492 18585 8073 2941 7708 14005 2520 -7375 2357
5045 2357 10740 15375 25977 20795 8855 16747 37385 31810 17303 -6007 -29996 -25530 4875
5032 4875 -10001 -4819 -4059 -9339 -42 -1058 3951 24061 18215 8684 -6711 -22329 -15533 -5320
5018 -5320 -18449 -18416 -8781 -11955 -23542 -20981 -18752 -24184 -32973 -22731 -4114 -13610 -14198 -19286 -36516
5003 -36516 -16449 -17130 -19135 -17668 -14977 -23701 -25068 -25241 -35379 -53999 -57692 -29842 -6677 -13089
4989 -13089 -16016 -13302 7030 2763 939 -12921 -12781 -21191 -4303 6180 6653 5177 9465 1346
4975 1346 -15973 -11071 -38576 -54423 -16854 9895 4569 6549 7630 8731 9011 9202 2619 -11335
4961 -11335 4790 1491 -4902 7977 -9461 -20819 -12743 8774 6880 -6637 -1266 9076 -4075
4948 -4075 9809 6263 -3862 -12879 -9990 -15028 -12626 -4006 -5890 -14189 -11143 -23029 -32240 -33582
4934 -33582 -15187 887 -3654 8064 8084 10615 13686 4174 -9645 -4119 11367 -4811 -1893 8165
4920 8165 16197 -3240 -2766 -1765 -19331 -4742 21394 21504 13778 992 -6455 -16039 -14267 -15516
4906 -15516 -18724 -27551 -28551 -22497 4535 3683 -12 4837 7051 -12501 -1642 10905 16020 -7360
4892 -7360 -32793 -19258 459 -7640 -16160 -18703 -9158 -15109 -12507 2527 1564 -1884 11233 11681
4878 11681 -27429 -30768 -22870 572 12539 -3092 -23251 -17694 -5557 -8895 -13845 -19558 -14274
4865 -14274 1913 6329 9613 -10815 -28574 -26341 -12329 -3977 3868 12142 16783 15079 14158 12052
4851 12052 13683 1529 -19466 -13016 -20653 -29096 -20911 -8093 -892 12469 19441 12208 8544 4731
4837 4731 -2262 -20576 -26529 -22941 -21542 -13257 -617 7434 17776 10688 6535 -2886 -15233 -14160
4823 -14160 -25194 -24741 -17415 -8732 -20724 -35544 -21231 -23555 -24140 -10928 13624 5596 -5416
4810 -5416 1509 -2967 -13191 -9907 7301 10488 -4238 -11065 -8458 -1587 9632 -7092 7506
4797 7506 21441 21285 3688 -8757 -4649 8904 -4666 -16147 -11089 -2457 -10927 -24818 -28654
4784 -28654 -20116 -26991 -10054 -206 12369 -1251 -8398 -986 -2044 -11382 -23528 -10703 -9114
4771 -9114 -17641 -6104 10255 431 -9778 -21845 -26032 -14331 -7844 -4353 1047 -2690 -2452 -2321
4757 -2321 -15766 -16492 4674 711 -7051 499 14411 18892 6219 -6315 -396 6869 9338 -3005
4743 -3005 -222 9370 -9601 -20099 -19264 -13432 -16480 -14426 1538 -3919 -17014 -36215 -34033 -7858
4729 -7858 2412 9093 3552 5653 -5022 -31736 -27249 268 7698 6947 5149 5920 14267 17845
4715 17845 16782 12553 20179 37648 35841 19095 14278 -6858 -12688 1970 31435 15351 10653
4702 10653 5177 1104 6566 8435 15153 25575 10590 -11894 -5437 9115 -5747 9723 38082
4689 38082 35847 26666 24553 26966 18440 -4165 10870 20943 18432 21338 39339 25674 7555
4676 7555 -3378 -5947 -10857 -8986 -14427 -16642 -10419 -7826 3247 817 -17827 -35565 -38164 -29919
4662 -29919 -48299 -60779 -73292 -54976 -52577 -74494 -50419 -29326 -29461 -20628 -16228 -21486 -21402 -24039
4648 -24039 -23194 -18952 20807 21153 20063 27809 29369 -169 -20354 -5880 5665 16452 7078 24815
4634 24815 13587 -3120 8257 1042 4698 4976 -1661 13039 10995 33160 24307 16224 16929 7718
4620 7718 -20256 -9828 -3480 -8555 1194 -4347 2982 5886 21559 36395 19647 -1363 -11745
4607 -11745 -7032 17731 6854 -9274 -9299 10953 17501 9229 5892 -15934 -1177 14978 1317
4594 1317 -2755 -13322 -9783 -5148 5442 12447 1969 -3225 6751 6112 10044 39841 45337 37656
4580 37656 32918 28635 4847 -10903 -12978 -18192 -4848 7835 6760 -5068 -2880 5911 -11252
4567 -11252 -16742 -23261 -35061 -34633 -19172 -25032 -29659 -16156 -16905 -14531 6256 16835 721 -12919
4553 -12919 2020 4054 -12485 -24076 -35877 -8408 8155 14615 8452 -1650 8743 4743 -7884
4540 -7884 -16826 -38472 -28230 -19186 3769 18288 19437 5130 -1942 1380 15051 31225 29007
4527 29007 21526 9136 -2683 17065 25176 3912 -1668 -14151 -2811 20084 29445 41253 35837
4514 35837 20699 -2872 -8673 -9653 -12408 -12279 6869 6426 -7156 -2806 5949 3776 -11600 -17077
4500 -17077 -21406 -13731 -4476 -13539 -26359 -36316 -41637 -13808 2095 -5178 -4325 1794 871 421 -17544
4485 -17544 -25310 -15705 -23599 -35354 -24346 -5214 -7278 -40364 -31022 -16565 -1476 15855 13185
4472 13185 -1198 -22141 -19862 -3786 5279 -2753 -15778 -15031 -24154 -9058 -12052 -8786 11695
4459 11695 3132 3277 9113 24867 20039 23991 21352 -4618 -4769 4402 -7737 -13172 -10289 -5770
4445 -5770 -19811 -21679 -19975 -28279 -33737 -51986 -29759 -11351 -17447 -25443 -25474 12403 12263 3884
4431 3884 14191 24707 28860 15699 6000 1002 4193 -26455 -12009 16183 31220 17420 3469
4418 3469 3312 13447 11156 -3462 -20444 -15363 2401 16001 14535 10346 21954 8803 6713
4405 6713 17332 10222 -2931 -11121 -39167 -53299 -46412 -31137 -33380 -12356 12525 9246 -4259
4392 -4259 -2305 17979 25325 15704 -8485 -9341 6437 5347 -6796 -12597 -12257 1692 7483 -2231
4378 -2231 -9849 -14035 -3244 -2787 -22414 -22053 -20815 1389 11245 -8961 -29577 -27085 -14781 2842
4364 2842 8807 -8974 -9612 -22686 -17881 -22461 -31436 -26241 -22297 -10737 -12821 -4600 7013 6033
4350 6033 9624 11003 -2494 -8949 -4060 -8275 -21918 -14304 -9365 -17127 -24326 -16739 -16356 -14232 -1300
4335 -1300 6253 17127 8430 1239 868 -7549 -8215 1299 9121 -8220 -10855 -3136 1326 9103 28421
4320 28421 39106 41741 10701 6240 6105 -252 -9255 2874 4662 -2556 -6194 -10265 -13390 -5938
4306 -5938 -3155 -11083 -21811 -11409 -11585 -16413 -8655 12370 19397 14365 5604 8450 631 -11819
4292 -11819 18547 2011 -8426 -6746 -963 12792 37972 44767 20934 -365 12290 29809
4280 29809 14816 -15071 -26677 -12636 2470 4513 -8439 -29499 -29805 -19829 -22177 -25307 -23022
4267 -23022 -25507 -7816 -6168 -19732 -21533 -16574 -8896 14096 31660 26548 9742 -2361 -10767
4254 -10767 -21338 -24754 -15902 -2291 -7969 -9336 -4526 -19637 -39495 -26203 -26372 -39416 -32599
4241 -32599 -22117 -24192 -23744 -32108 -29116 -8509 19716 44594 17314 4497 18761 23097 15092
4228 15092 16863 19953 27020 21507 12048 23287 20304 18230 5644 10345 4815 -8448 -16315 -2114
4214 -2114 12242 18093 13921 -5299 -30394 -39727 -24719 -9954 -7908 -21246 -12668 -15813 -14158
4201 -14158 -4565 -461 -8431 -11423 -9828 15653 29908 4547 -10861 -5788 924 2511 19826
4188 19826 28273 26622 8016 -12417 -24105 -22306 -9335 -10210 -15716 -7063 -4575 6447 19448
4175 19448 28826 33142 15745 1191 -29717 -25635 2987 18990 24196 13283 9730 10646 20368
4162 20368 28969 24837 31747 32596 15194 7164 5671 20358 20957 -3017 2527 -575 -14433 -24147
4148 -24147 -41148 -43189 -28203 -19988 -1435 3662 13726 7682 -17847 -25443 -16002 -9315 6644
4135 6644 21202 10959 -14539 -17198 -23554 -31139 -32057 -38624 -48618 -34241 -12420 -4705 -11189 -11223
4121 -11223 -23875 -16606 -3096 17068 36818 32372 11009 6953 13742 7705 -3113 -16824 -20815
4108 -20815 -15432 -15484 -25360 -23590 9406 7370 -8533 -18691 -10497 5659 9882 6468 -4377 -3596
4094 -3596 1835 378 749 -26050 -25268 -12858 -12742 -12702 -9165 -4981 -16756 -23835 -16229 -16302 826 30598
4078 30598 37878 10506 -16772 -12954 7037 11030 11695 8637 -6918 -17570 -16659 -11514 -10025 -3800
4064 -3800 396 -4578 1315 16842 23736 16733 13018 698 -22156 -4688 23489 24076 4775 11091
4050 11091 11541 11517 3300 -3433 4845 -2051 -2598 1813 -4863 12670 41283 42947 48900 52120 30778
4035 30778 12650 8305 -5151 -1981 -9773 -13945 -9314 -11139 -13647 -17637 -11234 1043 10129 9672
4021 9672 8233 -7482 -9179 -13347 -4179 13462 18685 31788 20458 7950 4867 -4301 -14388
4008 -14388 -3385 844 7408 3578 5337 -4725 -17283 -21843 -30355 -34366 -30507 -16934 -4690
3995 -4690 -24633 -28415 -32420 -32975 -13968 -2780 -14806 -15402 -19218 -27307 -28080 -32691 -31032 -33646 -32545
3980 -32545 -21048 -20055 -20813 -3601 5253 3817 -631 9936 20070 15535 7599 8419 8860 -1407
3966 -1407 -26916 -38413 -33010 -28370 -11615 1339 6898 7683 9780 15710 20029 24665 9708 -755
3952 -755 -2793 2583 13555 13927 2125 11415 9173 25857 12196 17771 27347 21436 14449 11848
3938 11848 28777 39014 32505 6176 -4742 3341 -3876 -15859 -15903 -248 20051 36437 32544
3925 32544 10441 6877 -17712 -18508 -20993 -27821 -4739 6323 -8381 -20999 -31194 -26777 -4572
3912 -4572 -2537 -4406 -15062 -40414 -33621 -29016 -25972 -28175 -30272 -22985 -14914 -1158 5307 -8693
3898 -8693 2885 22889 13738 15909 9166 -1537 -5283 3986 8702 4746 5123 -981 10262 21093
3884 21093 14635 9844 14379 27671 33431 33495 8473 -10394 -14861 -10607 2838 33487 23519 20188
3870 20188 3319 322 -642 13006 1037 4991 -1152 -495 4708 5215 6800 4552 5919 20302
3856 20302 29717 18881 8410 -3405 -13479 -4388 468 31884 47403 32613 10134 -8636
3844 -8636 -17051 -20213 -30526 -20613 6123 29133 15881 16810 10433 -11665 -30635 -33145 -27821 -22553
3830 -22553 -18581 -13461 8258 -13643 -47999 -31441 -12604 -14344 -11332 -7588 -10534 1115 8149
3817 8149 15064 7833 -23282 -16329 -14926 -30890 -29353 -30262 -7524 -3887 9700 13478 19815 3292
3803 3292 3466 4780 -10686 -8103 21912 42660 33242 7428 -2613 17 7604 -12283 -4200 21
3789 21 2285 1832 -6062 -15803 -22911 -35311 -22966 14954 14298 -3996 -5938 808 12498 5549 -15115
3774 -15115 -17351 -1256 -9059 -18628 -16003 -11980 -18771 -32617 -13676 -17658 -35881 -29394 -15164
3761 -15164 1552 -10275 -11251 -15577 -26886 -360 -806 -1626 -10273 -16315 -24785 -18691 -4077 -15758
3747 -15758 -21792 -31442 -29572 -20956 -29562 -4948 19793 19521 5707 -1374 -905 -10318 -16016 -13629
3733 -13629 -9600 7882 2401 -4700 -6867 6456 -4414 -9843 -1490 -4006 9441 12560 21826 27043
3719 27043 10444 536 20777 33728 36865 28214 6506 1750 -1618 -8435 -13412 -18476 -2754
3706 -2754 -825 -13331 -11232 1875 4022 2284 -19496 -41535 -35524 -24005 -5282 10608 13362
3693 13362 -2148 2465 24556 9662 -11266 -32055 -33441 -18215 10022 13505 3244 112 -13442
3680 -13442 -20243 -695 5265 11662 19232 21379 20655 21907 27538 39921 21998 17395 23802 3752
3666 3752 -5661 7705 26172 20821 18041 9582 6945 7713 7505 8748 -483 -652 19757 13686 14023
3651 14023 19064 24190 2735 -22633 -28767 -16330 -3320 -1054 6542 -13442 -17295 -1407 -4550
3638 -4550 -16022 -20123 3470 631 -21119 -21639 -14784 -9649 13374 15977 4837 1118 5052 4422
3624 4422 14129 27938 34162 34049 23159 -5907 -21230 -3354 3681 10740 12762 13027 333 -33559
3610 -33559 -29025 1201 3145 -1260 4858 18198 12844 2178 -969 -8519 -5437 7395 5160 17649
3596 17649 33341 29008 21478 8791 -3992 5952 17619 2110 -29964 -34305 -29583 -6552 6932
3583 6932 -10118 1286 31607 31320 19956 7149 -3748 12924 14949 128 -7564 -27729 -23788
3570 -23788 -6734 -12784 -19934 -16571 -18926 -11800 -14592 -32153 -25927 4819 7288 -2409 -7348 7732
3556 7732 12875 21279 28744 20818 3946 6112 -12741 -22635 -14719 -2929 -3274 1794 25227 24458
3542 24458 10493 -6125 61 29141 35639 38568 11884 -5124 -10704 -4032 889 -2721 -11035
3529 -11035 -9878 -12151 -7380 -11573 10116 32800 31824 36880 38241 20347 5528 -7183 -3121 -13865
3515 -13865 -37170 -27119 -26221 -17981 8433 4246 12040 5999 7923 14011 9945 21415 20806 1013
3501 1013 -1907 2919 -15546 -27347 -24388 -14355 -16505 -28248 -12717 -6395 -15224 -21245 -23832 -3363
3487 -3363 -10846 -6874 6399 12238 8506 25709 26406 22144 23531 33473 30603 36404 43519 26362
3473 26362 10543 12895 11937 5306 3993 17363 31298 31637 32721 32955 19181 -2069 -16334 -12897
3459 -12897 -20723 -1853 -675 -14593 -14611 -12945 -6219 5309 8929 11711 4004 6725 11913 20800
3445 20800 28508 22225 5373 14955 10987 15936 22638 15557 -1621 2066 22357 10245 10105 -7832
3431 -7832 -16020 -11318 -3093 11305 16565 3091 1362 17251 21978 31403 16010 -3947 -1676 -12111
3417 -12111 -17960 -11117 4448 -152 -241 -22682 -16921 871 23576 16987 18178 21648 8660 12247
3403 12247 -14222 -16409 -5846 -13161 -14544 -11127 -26200 -14523 -10764 1270 -5729 -25327 -39779
3390 -39779 -15350 -5119 -1013 15627 5534 -12103 4888 18108 10305 -6912 -17541 -3028
3378 -3028 6308 892 -16962 -22584 -12607 -5929 -24187 -34295 -19621 147 9869 3547 -3105 2014
3364 2014 1516 -1526 -6878 -1710 -303 -9566 -13224 15029 19108 9789 13809 9552 7239 -2126 -18243
3349 -18243 -21568 -15229 -26088 -22596 -20117 -6123 -11965 -25017 -3939 14843 21971 12257 -7162
3336 -7162 -12090 -13763 -7302 294 -8589 -19369 -3836 -4312 -24888 -29324 -24981 -15954 -6104 14392
3322 14392 16341 24018 32538 10718 -6924 5132 8623 3782 -1383 -11066 -4923 547 -1150 -4002
3308 -4002 -11960 -12898 -3037 -8296 -9590 -25916 -30426 -15894 -4193 -1463 -71 -6428 8580 -643
3294 -643 2449 10134 17938 22745 24810 23375 20287 6059 -884 -19216 -15375 -12564 399 8935
3280 8935 15391 7564 12411 18204 -4195 -16125 -25996 -22081 -3111 -1416 -14455 1532 8183 -9900
3266 -9900 -5177 910 5132 2806 6002 8019 -8243 -11253 -3967 4544 17500 16951 -273 11737
3252 11737 -3761 -13924 -11070 -4499 830 -22484 -15732 582 -12300 -4260 6373 697 8834
3239 8834 14585 12540 14311 7910 26196 14161 6109 -5311 -8089 8987 15196 2973 -8061
3226 -8061 -21307 -17972 -13237 -1695 -7784 -8192 -6894 3503 -5745 -16860 -8808 5876 5010 4240
3212 4240 2387 11450 33784 19440 8121 -1423 -12380 -1339 12228 10992 17734 8735 13170
3199 13170 16977 31289 30421 5731 -4993 -8938 -7587 -31245 -29920 -19005 -11898 5027 15771
3186 15771 23960 20047 4538 -10380 -3344 1762 6170 13057 -10280 -24323 -16747 2735 -6262
3173 -6262 -12800 -7055 -9555 -5842 3419 -7784 -6102 16964 22612 5178 -3969 -18258 -19108 -9495
3159 -9495 -4616 -14091 -35206 -14799 4430 3269 -7818 -6995 1981 15570 -14222 -6590 6613
3146 6613 -1744 -13881 -16800 -18720 -20879 -32788 -27775 -2456 -4957 13655 30119 22510 2452
3133 2452 -15784 -6514 -14589 -26278 -22315 -8564 -15102 -30701 -13404 -754 -8942 -18125 -22947
3120 -22947 -25661 -38178 -15211 -966 -10789 7868 5833 14534 15727 12433 19522 23861 2848
3107 2848 1238 9528 11136 6802 -13841 -15542 17488 22365 16129 17374 -3204 -16476 -12201 -8051
3093 -8051 -5271 -7697 -26664 -37657 -33822 -30208 -19586 -23905 -15730 -8026 3879 27926 43104
3080 43104 21426 875 -8849 -9404 -3522 -9670 4230 15700 37669 46640 19339 6080 18260
3067 18260 42371 27267 14628 -4568 -10369 740 -4289 -8435 -7852 9282 885 -4883 5820
3054 5820 6633 -4510 -848 7819 11688 16424 27028 26537 8350 -11267 -37868 -39797 -40662 -41022 -11467
3039 -11467 -9694 -12818 3511 13452 876 750 -672 -603 1230 11283 16356 -5222 -5609 -4855 16759
3024 16759 25110 19543 7503 -1373 -1869 -7101 -19027 -4298 -3760 -9818 -10194 10658 1534 -7753
3010 -7753 -4418 8367 9750 -338 13765 25747 -1521 -30427 -24492 -16945 -2776 1188 21833
2997 21833 15423 1394 2243 4948 -3773 1586 4899 6816 26599 20780 1614 1794 -17424 -5442
2983 -5442 20502 39656 22953 8210 -7351 -14279 -3733 14292 5581 -3430 6561 3145 -11368
2970 -11368 -18827 -28151 -15546 -22380 -34362 -30838 -17885 3163 14733 15861 3108 -893 -16116
2957 -16116 -30169 -29124 -7517 -7535 -26352 -19581 -6832 -2755 11953 17787 540 -16411 -29547
2944 -29547 -19607 -7145 2282 3185 852 10493 12782 8256 -4781 -12413 -27087 -32440 -24660 -21004
2930 -21004 -19420 -691 7545 4941 -11668 -12356 4518 10271 4174 5525 -7902 -12826 1947 22692
2916 22692 31215 34986 27988 31175 17994 -3506 -21317 -9977 3059 132 1338 -10394 -18875
2903 -18875 -11008 5615 24049 29238 22178 42239 48808 46792 40420 36755 6007 7208 22710
2890 22710 37350 50040 48432 37599 16285 1802 6123 3800 8327 -5184 -9320 -7477 5774
2877 5774 12532 22741 11490 -10803 -15279 -18931 -12359 419 -784 18502 48 -5472 -4528 10865
2863 10865 27202 54210 42768 33148 28833 4611 5851 15421 19606 22767 22672 19036 22050 17223
2849 17223 13709 4146 -8734 10086 8124 -6575 -13691 -24767 -21134 -11019 12848 33536 19473
2836 19473 7627 -1593 -10684 -13282 11417 14062 6018 2429 8614 -3255 628 24482 24953 15591
2822 15591 22666 29429 25931 30420 29827 42760 26764 8406 -7048 -9095 2388 690 -5448 -6018
2808 -6018 -19660 -34707 -25503 -15944 520 -1818 -8063 -7595 5032 15953 23309 9836 -11668
2795 -11668 -10200 -15274 -9556 986 -5041 -909 -5516 -12885 -7803 -14366 -15870 -2279 3727 -3485
2781 -3485 -937 -10233 -15921 -30853 -18741 -11304 -7943 -2183 2930 3071 -1087 -12299 -16824 -9756
2767 -9756 7734 18771 930 13066 10996 -492 2322 8076 -4876 -2812 3321 -1487 -2053 -9871
2753 -9871 -16815 -19751 -18812 -15190 -13671 -12448 -14131 -16204 -20529 -30767 -32426 -28421 -37017 -35485 -37528
2738 -37528 -14687 -1417 -16044 -20409 1483 18454 9991 8331 -511 -7821 -949 24723 18607
2725 18607 -485 -2408 183 -14329 -10229 -7584 8482 10402 23724 14224 239 -8571 1596
2712 1596 11070 6952 5855 -10038 -23398 -6390 6586 -1585 -24241 -16206 -277 -6156 -19298
2699 -19298 -9415 -16514 -21596 -19453 -23196 -29797 -16703 -1518 5025 8887 2444 -15388 -19679 -33517
2685 -33517 -53373 -48665 -33368 -10619 5195 -11165 -27180 -20869 -24614 -11856 10772 13887 2277
2672 2277 11206 23375 11114 21687 19702 5667 -7291 -10414 -2003 12058 14501 20633 22564
2659 22564 9784 7759 5367 9391 14964 15008 -5913 -13552 -1744 7189 2426 16713 10205 178
2645 178 -5137 -4643 -22788 -31312 -17400 -10384 -3342 6530 -3818 -6948 -11604 -10581 -22060 -23817
2631 -23817 -21695 -25380 -15597 1995 11928 -566 -8513 -21658 -14247 -17087 -5652 -2284 16152
2618 16152 16783 17255 25722 29525 35631 10346 -6447 1480 -787 9982 24761 23125 21249 -271
2604 -271 6857 7465 3343 -18736 -24604 -2862 1988 -8628 4745 28637 24513 13519 10438 28933
2590 28933 30390 33738 21466 7831 3448 -13430 -28258 -24608 -21813 -14086 -23583 -17692 17575
2577 17575 42374 43082 38388 20885 13744 27448 20351 -2074 1790 -7354 -4749 12664 17861 11110
2563 11110 14605 25316 23431 18343 6184 -12777 -15116 -7351 -6683 -22951 -14126 -9507 3987 22791
2549 22791 6552 -11253 -27239 -20015 -4051 5765 6154 -2519 -3219 26397 17340 -6615 -5508 2912
2535 2912 9199 12227 17886 17638 19704 10451 -23018 -26137 -18399 -11698 -24165 -26906 -15899 -24922
2521 -24922 -34287 -35658 -34492 -16670 -1222 -2794 -7818 -19610 -19325 -14855 -13306 -16600 -6336 10107
2507 10107 -12676 -16882 -8861 -6892 -815 -375 7470 4259 -5277 2598 9960 11536 14650 986
2493 986 -14842 -26477 -29700 -17866 -5057 3849 20031 9171 -6949 -22455 -9804 1333 3621
2480 3621 5487 -8506 -17664 -34988 -25167 -23034 -14103 -6374 -9158 -11825 -1966 -2328 -1111 11412
2466 11412 5201 -6271 -20982 -27235 -11602 -5337 3478 14369 11807 19055 6838 -4246 -8325
2453 -8325 -1965 -2374 8545 -1549 -3449 -19024 -24750 12455 22194 10858 1252 166 -12188 -4341
2439 -4341 4129 5964 -3133 9163 12547 -1018 249 -1145 -11770 -30289 -16573 -22256 -25449 -18622
2425 -18622 -17929 -19741 -18144 10975 17875 -7960 -14199 -4400 -1322 -16696 -18786 -24376 -19994 -23121
2411 -23121 -31036 -7598 -2834 -3297 -19131 -23548 -18375 2850 -3414 -21193 -3489 10241 11829
2398 11829 21282 34658 32431 30858 24301 14236 9945 6947 17357 29401 25570 14383 17951
2385 17951 25130 30806 37278 28191 30646 24359 27932 26101 18833 14780 20083 17728 4298 -1185
2371 -1185 3736 -29 -5137 -13034 -14468 -2733 -4396 -12414 -25409 -20240 -8599 -18955 -34936 -26134
2357 -26134 -29753 -27515 -2483 5297 17495 12783 5607 26595 28848 14790 9109 5081 2273 5977
2343 5977 -10196 -7574 2135 5698 -3047 9466 7769 6662 2062 10880 -2847 -6309 -15748 -28185
2329 -28185 -4006 6026 -826 -5992 -4484 -11032 -2365 18567 33404 -177 -36173 -30606 -2947
2316 -2947 3378 -7274 9290 19313 14971 6474 16989 21492 20852 19377 19355 8998 -9190 -17360
2302 -17360 1502 5112 -4705 -5329 -5330 8296 3480 7222 17345 1926 -21605 -37393 -27251 -1192
2288 -1192 21118 10307 10144 13096 9170 3174 -1132 13796 18316 -15485 -18377 -3948 15064 32880
2274 32880 16062 6687 4648 -3355 8025 11211 15451 18511 9251 -15356 -23476 -28472 -14877 2713
2260 2713 6910 -9312 -9959 3123 17381 17274 10364 -7943 5356 3317 -11146 11745 7477 12198
2246 12198 14666 3910 -8118 -21374 -27136 -4612 3804 -1921 6360 14892 10077 7918 19612
2233 19612 17396 9296 17953 6907 -5257 8602 14236 24525 26097 24100 22583 24534 19491 5227
2219 5227 -29656 -10179 28991 57619 41177 48725 50146 37141 41252 50969 23613 23143 10577
2206 10577 -8595 -3983 -6341 -2239 15379 24411 36854 24733 24218 12237 -3073 -1975 12222
2193 12222 19873 22023 21774 -4806 -23409 -16659 -13042 -11804 877 -13107 -4781 18397 15004 9101
2179 9101 6110 -4144 -18862 -12102 -8388 -10572 -5066 55 -2283 3374 10473 8414 -7263 -11894
2165 -11894 -9517 -8882 3689 11787 15415 10825 1305 1473 -3789 6280 1537 2124 27859 15613
2151 15613 3837 941 270 -850 -577 -287 10260 3647 7159 -10376 -3149 16068 16839 -1377
2137 -1377 5497 11864 14249 -4073 -32272 -10337 16161 16162 7530 -8289 -17675 -7506 4556 21441
2123 21441 7930 -3439 2862 21000 6581 5551 17139 15338 3849 -364 -1565 1286 2357
$$ [...]
##END NTUPLES=NMR SPECTRUM
##END=
