##TITLE=Analysis number 320432
Compound Code ac 35899
Project Code adrs
Chemist Name cuschem
##JCAMPDX= 6.0         $$ Bruker NMR JCAMP-DX V2.0
##DATA TYPE= NMR SPECTRUM
##DATA CLASS= NTUPLES
##ORIGIN= Bruker BioSpin GmbH
##OWNER= nmr
$$ XWIN-NMR		Version 3.5
$$ Mon Jun 26 09:13:46 2006 GMT Daylight Time (UT+1h)  MAYBRIDGE\nmr@NMR_250MHZ
##.OBSERVE FREQUENCY= 250.131544655141
##.OBSERVE NUCLEUS= ^1H
##.ACQUISITION MODE= SIMULTANEOUS (DQD)
##.ACQUISITION SCHEME= undefined
##.AVERAGES= 16
##.DIGITISER RES= 18
##SPECTROMETER/DATA SYSTEM= dpx250
##.PULSE SEQUENCE= zg30
##.SOLVENT NAME= DMSO
##.SHIFT REFERENCE= (INTERNAL, DMSO, 0, 16.522)
##AUDIT TRAIL= $$ (NUMBER, WHEN, WHO, WHERE, WHAT)
$$ ##TITLE= Audit trail, XWIN-NMR		Version 3.5
$$ ##JCAMPDX= 5.01
$$ ##ORIGIN= Bruker BioSpin GmbH
$$ ##OWNER= nmr
$$ C:\u/data/dgb/nmr/ADRS/1390/pdata/1/auditp.txt
$$ ##AUDIT TRAIL=  $$ (NUMBER, WHEN, WHO, WHERE, WHAT)
(   1,<2006-06-26 09:13:24.24 +100>,<MAYBRIDGE\nmr>,<NMR_250MHZ>,
      <created by zg, POWCHK disabled, PULCHK disabled
       configuration hash MD5:
       E2 DF 36 D8 04 B2 41 60 5A D7 A3 38 5A 4B D0 FE
       data hash MD5: 64K
       4D FC 55 EC 16 DD E0 38 D6 D9 95 B6 73 BB 4A BE>)
(   2,<2006-06-26 09:13:36.99 +100>,<MAYBRIDGE\nmr>,<NMR_250MHZ>,
      <Start of raw data processing
       ef LB = 0.3 FT_mod = 6 PKNL = 1 SI = 32K 
       data hash MD5: 32K
       78 6B 74 66 BE 8A EB 31 09 E7 35 26 A5 B4 E7 58>)
(   3,<2006-06-26 09:13:38.67 +100>,<MAYBRIDGE\nmr>,<NMR_250MHZ>,
      <apk 
       data hash MD5: 32K
       9F A8 27 7F 33 AA 82 A8 4C B0 E5 97 EA 33 CD DB>)
(   4,<2006-06-26 09:13:39.42 +100>,<MAYBRIDGE\nmr>,<NMR_250MHZ>,
      <abs ABSG = 5 
       data hash MD5: 32K
       42 C3 98 99 8E 7C AE EE EB 4B 9D 0D E0 35 2D 51>)
$$ ##END=
$$ 
$$ hash MD5
$$ DF BB A2 64 ED FD 9F 80 8E 2B E5 F1 22 41 FC DD
##$RELAX= 
##$RELAX= 
##$RELAX= 
##$RELAX= 
##$RELAX= 
##$RELAX= 
##$RELAX= 
$$ Bruker specific parameters
$$ --------------------------
##$DU= <C:\u>
##$EXPNO= 1390
##$NAME= <ADRS>
##$PROCNO= 1
##$TYPE= <nmr>
##$USER= <dgb>
##$AMP= (0..31)
100 100 100 100 100 100 100 100 100 100 100 100 100 100 100 100 100 100 
100 100 100 100 100 100 100 100 100 100 100 100 100 100 
##$AQSEQ= 0
##$AQ_mod= 3
##$AUNM= <au_zg>
##$AUTOPOS= <5 >
##$BF1= 250.13
##$BF2= 250.13
##$BF3= 250.13
##$BF4= 250.13
##$BF5= 500.13
##$BF6= 500.13
##$BF7= 500.13
##$BF8= 500.13
##$BYTORDA= 1
##$CFDGTYP= 0
##$CFRGTYP= 5
##$CHEMSTR= <none>
##$CNST= (0..31)
1 1 145 1 1 1 1 1 1 1 1 1 1 1 1 1 1 1 1 1 1 1 1 1 1 1 1 1 1 1 1 1 
##$CPDPRG= <>
##$CPDPRG1= <>
##$CPDPRG2= <>
##$CPDPRG3= <>
##$CPDPRG4= <mlev>
##$CPDPRG5= <mlev>
##$CPDPRG6= <mlev>
##$CPDPRG7= <mlev>
##$CPDPRG8= <mlev>
##$CPDPRGB= <>
##$CPDPRGT= <>
##$D= (0..31)
0 1 0 0 0 0 0 0 0 0.06 0 0 0 0 0 0 0.0002 0 0 0 0 0 0 0 0 0 0 0 0 0 0 
0 
##$DATE= 1151309603
##$DBL= (0..7)
120 120 120 120 120 120 120 120 
##$DBP= (0..7)
150 150 150 150 150 150 150 150 
##$DBP07= 0
##$DBPNAM0= <>
##$DBPNAM1= <>
##$DBPNAM2= <>
##$DBPNAM3= <>
$$ [...]
##$SUBNAM6= <"">
##$SUBNAM7= <"">
##$SUBNAM8= <"">
##$SUBNAM9= <"">
##$SW= 20.6930455092707
##$SWIBOX= (0..15)
0 0 3 0 0 0 0 0 0 0 0 0 0 0 0 0 
##$SW_h= 5175.983436853
##$TD= 65536
##$TD0= 1
##$TE= 296.16
##$TE2= 300
##$TE3= 300
##$TEG= 300
##$TL= (0..7)
0 120 120 120 120 120 120 120 
##$TP= (0..7)
150 150 150 150 150 150 150 150 
##$TP07= 0
##$TPNAME0= <>
##$TPNAME1= <>
##$TPNAME2= <>
##$TPNAME3= <>
##$TPNAME4= <>
##$TPNAME5= <>
##$TPNAME6= <>
##$TPNAME7= <>
##$TPOAL= (0..7)
0.5 0.5 0.5 0.5 0.5 0.5 0.5 0.5 
##$TPOFFS= (0..7)
0 0 0 0 0 0 0 0 
##$TUNHIN= 0
##$TUNHOUT= 0
##$TUNXOUT= 0
##$USERA1= <user>
##$USERA2= <user>
##$USERA3= <user>
##$USERA4= <user>
##$USERA5= <user>
##$V9= 5
##$VALIST= <valist>
##$VCLIST= <CCCCCCCCCCCCCCC>
##$VD= 0
##$VDLIST= <DDDDDDDDDDDDDDD>
##$VPLIST= <PPPPPPPPPPPPPPP>
##$VTLIST= <TTTTTTTTTTTTTTT>
##$WBST= 1024
##$WBSW= 4
##$XGAIN= (0..3)
0 0 0 0 
##$XL= 0
##$YL= 0
##$YMAX_a= 402926
##$YMIN_a= -519288
##$ZGOPTNS= <>
##$ZL1= 120
##$ZL2= 120
##$ZL3= 120
##$ZL4= 120
##$ABSF1= 16.522
##$ABSF2= -4.171173
##$ABSG= 5
##$ABSL= 3
##$ALPHA= 0
##$AQORDER= 0
##$ASSFAC= 0
##$ASSFACI= 0
##$ASSFACX= 0
##$ASSWID= 0
##$AUNMP= <proc_1d>
##$AZFE= 0.1
##$AZFW= 0.1
##$BCFW= 0
##$BC_mod= 0
##$BYTORDP= 0
##$COROFFS= 0
##$CY= 12.5
##$DATMOD= 1
##$DC= 0
##$DFILT= <>
##$DTYPP= 0
##$F1P= 14.0000005364418
##$F2P= -0.99999901652339
##$FCOR= 0.5
##$FTSIZE= 32768
##$FT_mod= 6
##$GAMMA= 0
##$GB= 0
##$INTBC= 1
##$INTSCL= 1
##$ISEN= 128
##$LB= 0.3
##$LEV0= 0
##$LPBIN= 0
##$MAXI= 10000
##$MC2= 0
##$MEAN= 0
##$ME_mod= 0
##$MI= 0
##$NCOEF= 0
##$NC_proc= -5
##$NLEV= 6
##$NOISF1= 0
##$NOISF2= 0
##$NSP= 0
##$NTH_PI= 0
##$NZP= 0
##$OFFSET= 16.522
##$PC= 1
##$PHC0= 164.1169
##$PHC1= 9.51784
##$PH_mod= 1
##$PKNL= yes
##$PPARMOD= 0
##$PSCAL= 4
##$PSIGN= 0
##$REVERSE= no
##$SF= 250.13
##$SI= 32768
##$SIGF1= 0
##$SIGF2= 0
##$SINO= 400
##$SIOLD= 32768
##$SREGLST= <1H.DMSO>
##$SSB= 0
##$STSI= 32768
##$STSR= 0
##$SW_p= 5175.98343685301
##$SYMM= 0
##$S_DEV= 0
##$TDeff= 65536
##$TDoff= 0
##$TI= <Analysis number 999999
Compound Code 99
Book Reference 9
Project Code 9>
##$TILT= no
##$TM1= 0
##$TM2= 0
##$TOPLEV= 0
##$USERP1= <user>
##$USERP2= <user>
##$USERP3= <user>
##$USERP4= <user>
##$USERP5= <user>
##$WDW= 1
##$XDIM= 32768
##$YMAX_p= 390041273
##$YMIN_p= -659352
$$ End of Bruker specific parameters
$$ ---------------------------------
##NTUPLES= NMR SPECTRUM
##VAR_NAME=  FREQUENCY,     SPECTRUM/REAL,   SPECTRUM/IMAG
##SYMBOL=    X,             R,               I
##VAR_TYPE=  INDEPENDENT,   DEPENDENT,       DEPENDENT
##VAR_FORM=  AFFN,          ASDF,            ASDF
##VAR_DIM=   32768,         32768,           32768
##UNITS=     HZ,            ARBITRARY UNITS, ARBITRARY UNITS
##FACTOR=    0.157963299565203, 1,           1
##FIRST=     4132.6476996994, 0,             0
##LAST=      -1043.33573715361, 0,           0
##MIN=       -1043.33573715361, -659352,     0
##MAX=       4132.6476996994, 390041273,     0
$$ Real data points
##PAGE= N=1
##DATA TABLE= (X++(R..R)), XYDATA
$$ [...]
23304e1456O4796O224k56424j31381J61905J52459P3544J9168K2055j72677m8643
23293a60430n675M2835J09777J0063j15747j40856K580K09682P6887j8438J18908
23282A29586J12743q6222L1303N0219j79734j0792k44828j08464J37690k888Q0048
23271i1339K5680R4299J04886K2215Q6783m5100j6239K319q3382j17344J7102
23260a20Q9108K2141l5232k27226P3929J47033R2567M4943l1791P256N7952j36627
23248A03933k3427J44358j31019j30324p6303N5337k9633k18232k4828Q2333K07130
23237d0675k2921j23534p6737o7006M7848L7686K4056K54535J82600j49019j65838
23226i9005L5727j0972o0342r9591K0148K10364J23528K4096j05251j15154O4549
$$ y = [-51456, 13340, 19564, -236860, -368241, -206336, -53877, 19667, 38835, 60890, -111787, -160430, -166105, -123270, -13493, -3430, -119177, -260033, -257453, -47771, 29116, 10678, 129586, 242329, 156107, 187410, 237629, 57895, 47103, -197725, -306189, -168499, -171387, -91339, -65659, 28640, 133526, 155741, 242524, 197424, 181185, 183504, 100122, -17222, -120, 88988, 111129, 75897, -151329, -77400, 69633, 162200, 207143, 175352, 182608, 240560, 103933, 80506, 224864, 93845, -36479, -112782, -57445, -87078, -305310, -330138, -247805, -40675, -63596, -187130, -263867, -330873, -283025, -245339, -221283, 33252, 215852, 66833, -99005, -63278, -74250, -134592, -234183, -214035, -3671, 119857, 143953, 38702, -76452, -11903]
23215a1903L8971q9080O7107Q4115R067J7867l5674j0492n010L012j9319J5355
23203F4016J20030M3297O6310j14573J85029j39734n644J58186n8383J1240K3913
23192C53687k1165j06653q9916m6933L68l9460j04723L4052R1454J7274J282J1613
23180A00880j43729L4140j20072j08972J22043J02638J53809m351j22920l7178
23170b3712k8484L0345l0291J09659j12884n7624M9490q226L2657R9337J04365
23159A64632n279l0545J66472J3581M8242N2830P0631j64458j21883r1313k941
23148I9969P5648M3538l4173k5492j43489j67347j5899P1083J97991R9775M5057
23137B46661j73455j51964q9114p1628p1460R2040J28569J85288j09391r809J6703
$$ y = [-11903, 27068, -62012, 5095, 89210, 98277, 116144, 80470, 69978, 64968, 67980, 48661, 64016, 184046, 227343, 293653, 179080, 364109, 224375, 218731, 376917, 318534, 329774, 353687, 332522, 225869, 135953, 89020, 89388, 49928, -54795, -20743, 70711, 87985, 89267, 100880, -42849, -8709, -128781, -237753, -115710, -13072, 140737, 136386, 13466, -23712, -52196, -21851, -52142, 57517, -55367, -112991, -63501, -71727, -39070, 60267, 164632, 159353, 128808, 295280, 308861, 357103, 409933, 480564, 316106, 194223, 102910, 99969, 175617, 219155, 184982, 159490, 16001, -151346, -167245, -96162, 101829, 201604, 246661, 73206, -78758, -167872, -239500, -310960, -218920, -90351, 94937, -14454, -24263, -7560]
23126g560L8390J205Q2667R4559k189q6413p017j22949n3583P8218R9016N0337
23114A64681j00925R2364L3446q6752j19844N1063J15452j21762r6181o0640p9715
23103b08813n202K8889J12966n8491J22978P1139p9572q1251p642j25554l1125
23092b61678M0444n9107M8477O4026J45981J00117J9360j27601l5382Q726j34912
23081a91549q9385J69688J14038P8405M5758j41287p1894r6344M6328l1239K04
23070a67277J00231J00975R2769o7832J13147q7093j23211p1844J82300p8771
23060f606m4542P2098k8132M2640j6151o0880J94657P102j63268q5473N8177q8180
23048a18558j4930o3646j0231j04760K0938k0N2470Q524J42835O9307p6338R432
$$ y = [-7560, 30830, 32035, 114702, 209261, 207072, 120659, 113642, -9307, -62890, 15328, 114344, 164681, 63756, 156120, 189566, 102814, -17030, 34033, 149485, 27723, -68458, -129098, -208813, -214015, -185126, -72160, -130651, -7673, 63466, -16106, -97357, -104999, -230553, -261678, -221234, -280341, -231864, -167838, -21857, 78260, 97620, -29981, -65363, -56637, -191549, -280934, -111246, 2792, 81197, 126955, -14332, -86226, -182570, -136242, -167481, -167277, -67046, 33929, 126698, 58866, 172013, 84920, -38291, -110135, 72165, -6606, -51148, 20950, -7182, 35458, 19307, -41573, 153084, 160186, -3082, -88555, -30378, -118558, -133488, -197134, -207365, -312125, -291187, -291207, -238737, -230213, -87378, -18071, -94409, -84977]
23036h4977M2182j10622p7231J35320J55202K1014k5885N6981m6018n0964r1647
23025g6645j18122N4307j28289J25631K09111L6998K3328L9099m9789m1236J70647
23014B45040j74458j27697p751L3437P3785o5873j40104P1468K4862L9944N1350
23003B4003L6600n3311o6896n7056L5521j28178O2025J97508J28066j81160j00591
22992a03469N6883R2715P5025q7731J22500J06739q0268k50060j64367K5682K8375
22981a77976J13823P1185J8157J38187l1634J6179r2338q7759r8467k16829q3105
22970d30577J14527J17102J71143K12310j14653n2439M670O4648p7334n6392k4866
22959g1861J95803J76232p453j53147j22595N167j45685Q0741L7798N187q9721
$$ y = [-84977, -42795, -153417, -230648, -95328, 59874, 80888, 55003, 111984, 65966, 15002, -76645, -194767, -140460, -268749, -143118, 65993, 102991, 126319, 165418, 115629, 74393, 245040, 70582, -57115, -64866, -31429, 42356, -23517, -163621, -92153, -67291, -27347, 24003, 60603, 7292, -59604, -116660, -81139, -209317, -147292, 50216, 178282, -2878, -103469, -46586, 46129, 121154, 33423, 155923, 262662, 182394, -67666, -232033, -206351, -177976, -64153, 7032, 25189, 163376, 131742, 147921, 55583, -32176, -130643, -347472, -430577, -316050, -198948, -27805, 184505, 69852, 17413, 22083, 86731, 9397, -46995, -71861, 123942, 300174, 292721, 139574, 16979, 22146, -123539, -42798, -5000, 187, -89534]
22948h9534l456K43770m496l55482j30739J26725J26353J15652J75929L0998j8506
22937B17214Q4313k0651m8411r8569L1252P9650K1762j04731j30908k3271J25947
22926A33597p9508j28170M8721J81217P3580Q2280j04544m0976j43933j18354
22916i6090p5283N6413J937R7639m99j04650j6330K18814N7164k17516j26268
22905b04669M040J17277l8505r7696j555N0378J31911Q0563k9059k5398q3963
22894i6676P447o7089o6283J33518O8093J11744M9444R3770J167j19655n4645
22883F0835p6230j12229o3140o5867J15449K84992K96894N7195k71162k47375
22873b0638J39990J50286K641J2651p7657m9457q0378J93315L5163j22354o4052
$$ y = [-89534, -92990, 150780, 146284, -209198, -339937, -213212, -86859, 28793, 204722, 235720, 217214, 301527, 280876, 232465, 133896, 165148, 244798, 266560, 161829, 30921, 7650, 133597, 54089, -74081, -25360, 155857, 229437, 311717, 207173, 166197, 22264, -96090, -171373, -114960, -113023, -15384, -15883, -120533, -136863, 81951, 139115, -78401, -204669, -200629, -83352, -121857, -219553, -221108, -170730, -38819, 41744, 12685, -12713, -96676, -89229, -156318, -222601, -89083, -20990, 90754, 140198, 233968, 235135, 115480, 60835, -15395, -127624, -190764, -256631, -141182, 143810, 440704, 497899, 226737, -20638, 119352, 269638, 272279, 284930, 207273, 157816, 77438, 270753, 305916, 183562, 119510]
22862A19510o7664q769L8480J20422M071m8340K6905o4156q8842N3514L0658Q342
22850A24131K3226N628p0100O0011K7489K1708m0097q2981j21685J90162m9510
22839H7982m0796Q825O5858j13878j01560j12554N3330J4184Q2025J40161n1129
22828C2448Q8228P4188N5455r8608L9981N8448n1447k8803M0551M9506L4560p723
22816B86784q3898p4507j9365j3644n4317r121l7018q8778r7857q5406P2999j3949
22804b18077K7761K23512q886j30184p0354j62300p6439O7751J51183K677m2573
22793b35929J4744J65003J55612O8491Q8690r6416R809o4793o4770J35373J63523
22782C39337o3986r7105n0679n6380j4950R592N9932l1841j22976r905p2572k2719
$$ y = [119510, 51846, 43077, 81557, 201979, 206050, 157710, 184615, 120459, 31617, 85131, 115789, 124131, 147357, 152985, 82885, 142896, 170385, 192093, 151996, 69015, -52670, 137492, 87982, 47186, 56011, 121869, 7991, -93569, -206123, -152793, -138609, -56584, 83577, 32448, 120676, 194864, 250319, 151711, 191692, 250140, 198693, 169890, 210441, 259947, 294507, 286784, 202886, 128379, 109014, 95370, 41053, 31932, -5086, -93864, -191721, -277127, -204128, -218077, -190316, 33196, 24310, -105874, -176228, -338528, -414967, -347216, -196033, -193356, -235929, -221185, -56182, 99430, 167921, 256611, 160195, 170004, 105211, 40441, 175814, 339337, 275351, 178246, 127567, 71187, 56237, 65829, 125761, 93920, -29056, -38961, -111533, -134252]
22770a34252N0577K2613Q5636Q8557p7065j36172j21278j26152M6284K00137N8861
22759d2254O7018m9941j15610K5235q2722j07580J28817K4987L4439J36640J06021
22748A25050n1430l4908m4044p2162j10694j1669J10406J56549p0893J15471P630
22737A19306q0719j23856J55875k160j22756r3889j3953J5964Q0538J02652j44015
22726a07013q5393J10728J12350J27904j96999l9451Q0253O9291j14197m7724
22716i0251Q6078q7901R2741J73471j31736j7322J1665j11810J4766j03277K38
22705a63338J40658J20131n9694k2296m1332p6096O7733p0877R2468J22957j7471
22694I2843j43043k4867P7469n807k1754k55594L3711m7930P7283J07253l4346
$$ y = [-134252, -83675, -61062, 24574, 113131, 36066, -100106, -221384, -347536, -301252, -101115, -42254, 24764, -25177, -140787, -115552, -198274, -305854, -177037, -152050, -117611, 19029, 125050, 73620, 38712, -5332, -77494, -188188, -199857, -89451, 67098, -3795, 111676, 119306, 38587, -85269, 70606, 68446, -54310, -148199, -162152, -146188, -65650, 37002, -107013, -192406, -81678, 30672, 158576, -38423, -77874, 2379, 71670, -42527, -90251, -4173, -92074, 667, 174138, 42402, 25080, 36745, -75065, -60299, -163576, -163338, -22680, 97451, 37757, 15461, -25871, -101967, -34234, -105111, -12643, 110314, 92843, -50200, -75067, 2402, -3405, -25159, -280753, -247042, -294972, -217689, -110436, -144782]
22683a44782r2723K21093O2028J9552P910M6744o9000M4240j32718P2347j9062
22672A5629M8191j31311P2681J07414j06814K56123j23344j95888K07995M8080
22662A98756M0047R5897r7313k54239k25929r7865N4477N844j2170j8898K54554
22651e6839K52958r9667j06884r877R896p9446J33963j38928n8725J72648j25917
22640a06818k35885J11431L09939J5151L8576Q6322j24767j57829k4605j84245
22630b72730k14417P7843K42841J64765Q6599j9699k4531N5323j75198n7017j2254
22619a48475J61462J24926j25287q0318r7094o6253J69359q3908m7127j28085
22609c20800Q734J51894O0196M6949k1728O6525K2594m5284J13615n1311n4846
$$ y = [-144782, -237505, -16412, 45616, 65168, 73078, 119822, 50822, 95062, -37656, 34691, 15629, 63820, -67491, 5190, 112604, 5790, 261913, 138569, -57319, 150676, 198756, 238803, 334700, 237387, -16852, -242781, -340646, -286169, -280325, -292495, -311393, -56839, 196119, 96452, -10432, -20309, -10413, -89859, 44104, -94824, -153549, 19099, -106818, -342703, -231272, 78667, 93818, 132394, 218716, 93949, -63880, -88485, -272730, -487147, -409304, -166463, -1698, 84901, 65202, 40671, 95994, -79204, -136221, -148475, 12987, 137913, 12626, -67692, -164786, -231039, -61680, -145588, -192715, -320800, -312066, -160172, -99976, -53027, -74755, -8230, 14364, -30920, 82695, 31384, -23462]
22598b3462l4721k02370l7519j27808R9038J46894K2045m15J43925j49379n7205
22587b20977J9825Q8201J11708l3101J84939O7648j20525k29864j93128k6489
22577c51763o1961N0522J7885P8871Q7818N0481r959K29518J5433j12475j6094
22566b1724J64140J1089j663j21604O368l3293r0863M688o1749J956R0190J65779
22554A13314m7199j7637Q1502q3039m3840J24861r1215j8827L8287M7564p5431
22543B8340L6745K28401M898k8078j98964j64142Q2565J81405J27488j63419j39991
22532d752l9350J92747n3733j49246n9285o175J66797O5844n2027M3719n2812
22521E1727j1377M1687j12325j54361N7848R8414o9234j1115j7450M170J19925
$$ y = [-23462, -58183, -260553, -298072, -425880, -326842, -179948, -157903, -158318, -14393, -163772, -220977, -201152, -112951, -1243, -34344, 150595, 218243, 97718, -132146, -325274, -351763, -413724, -363202, -345317, -266446, -178628, -128147, -138106, 91412, 106845, -5630, -21724, 142416, 153505, 151842, 30238, 36606, 3313, -87550, -82862, -144611, -142655, -52465, 113314, 66115, 48478, 129980, 46941, 3101, 127962, 36747, 17920, 56207, 103771, 28340, 65085, 293486, 298384, 270306, 71342, -92800, -10235, 171170, 298658, 135239, -4752, -44102, 148645, 94912, -54334, -113619, -119794, 47003, 112847, 60820, 104539, 51727, 40350, 82037, -30288, -184649, -126801, -28387, -97621, -108736, -126186, -122016, -2091]
22510b091J078p347m719p007P3278L6815m112O0315p126j00731n3352J04931P4032
22497A63964j04692M8705q1856R9177o0515p0399R8537l1118l38834o0504R0204
22486b47331P2722L8771P4385j553J43412J48068K0495p5183j49856j04454p023
22475h7547N2233M0456Q8123j51163j67387j62996n7950P3956K12402J67147J15044
22464A22318j53072j34777R9391l6408q4824M1367J26552J29039q9437n0311r8750
22453a28912K901Q6509j88055o4746J01529J77061Q4938p4397r1411M3477N0329
22442g77J2599o9377l187J03804J00511j327n923n2842k05257p2226m0848L1045
22430b03805J91068J9393L8167n2883n9209P8961O593m2537r4503n7616j63875
$$ y = [-2091, -1013, -8360, -13079, -20086, 53192, 90007, 85895, 146210, 139084, 38353, -14999, 89932, 163964, 59272, 107977, 26121, 125298, 64783, -5616, 92921, 61803, -277031, -337535, -247331, -174609, -135838, -61453, -63006, 80406, 228474, 248969, 173786, 23930, -80524, -87547, -35314, 5142, 93265, -57898, -225285, -388281, -446231, -372275, -159873, 7274, 122318, -30754, -165531, -66140, -102548, -187372, -146005, -19453, 109586, 20149, -30162, -128912, -126011, -39502, -227557, -292303, -190774, -13713, 71225, -3172, -94583, -51106, -777, 11822, -57555, -60742, 43062, 143573, 142246, 136323, 83481, -121776, -194002, -234850, -203805, -12737, 6656, 44823, -8060, -67269, 11692, 18285, -24252, -118755, -176371, -340246]
22419c40246r8605K1352J00503K00632J12816K21584L6045k19960k12378o4944
22409b43201J72720J93582k26719l3907L8873j37607P2953J39801j17524L6469
22399a04560Q8617p6869l1454j43901O7150M7901J8939J5096J49130p4295q562
22388e2808R2690J9209o5987Q0684J28014o7412j92404j22851J47469M0337j22887
22377a15946k26768J63571J73742M9311r2375j40987L513J02393J05638J13572
22367A35664n0450n7867j54454j21082R2942J39567J8834n1145q4424k3720J00019
22356e6116M4637r4194j22095o2789l9035J45292q465J68490J46544M3650k764
22345A63155p1481L9695J65307j38595L9128K4728r5227k21992j10379j8676J8074
$$ y = [-340246, -438851, -417499, -316996, -116364, -3548, 218036, 254081, 34121, -178257, -243201, -70481, 123101, -103618, -137525, -98652, -236259, -163306, -23505, -141029, -104560, -15943, -92812, -124266, -268167, -201017, -153116, -134177, -119081, 30049, -44246, -52808, 39882, 59091, -6896, 73788, 201802, 134390, -58014, -180865, -33396, 6941, -115946, -342714, -179143, -5401, 43910, -48465, -189452, -185939, -83546, 22092, 135664, 85214, 27347, -127107, -248189, -155247, -15680, 3154, -47991, -132415, -156135, -56116, -11479, -105673, -227768, -290557, -329592, -184300, -192765, -24275, 122269, 165919, 163155, 91674, 131369, 296676, 158081, 197209, 221937, 126710, -95282, -205661, -224337, -206263]
22334b06263l1034K55512K3341k02850n2486M1808N7106p6989P0343J62235l2049
22323H674Q7030P2012k5417j30515j54681k66412j69387m4573K76543J97760m2808
22312a91774q4119Q4030J19301P2983o7557j04496j14946j06135K51886J81716
22302D0889j47093Q2310p3727O0525L58141k2417m2436j30101k5592r8466K9059
22291C1092Q8304j13473j33865J2964K0509j0846J75612J51953M9537j86343j27132
22280d1688N4404J90052o1454q0939P8735j51636j27560M4768J32036j06151r132
22269g8565J35420J9219o7502m3601P087P3993L0992q5405j00646j8662r3689
22258b21359J65841N0184O4896K8821N1040L4355j05425J55293J29635o5757j22641
$$ y = [-206263, -237297, 18215, 41556, -161294, -213780, -171972, -114866, -191855, -121512, 40723, 8674, 95704, 167716, 142299, 11784, -142897, -409309, -578696, -623269, -346726, -148966, -191774, -275893, -191863, -72562, 421, -67136, -171632, -286578, -392713, -140827, 40889, -106204, -23894, -97621, -37096, 321045, 298628, 256192, 126091, 100499, 2033, 31092, 119396, 5923, -127942, -114978, -94469, -105315, 70297, 222250, 271787, 85444, -41688, 12716, 202768, 141314, 60375, 139110, -12526, -140086, -95318, 36718, -69433, -78565, 56855, 76074, 8572, -35029, -27942, 46051, 77043, -8362, -109008, -127670, -221359, -55518, -5334, 59562, 88383, 139423, 173778, 68353, 223646, 353281, 287524, 164883]
22247A64883K3634p2155j58212k02998o0917R4893l10J02615L782j6512m1195
22236a62492n3550O8893J50827M2991J69121Q0874j22092j64408n7819J52389
22226A04734J53900k07666k28911L5874K16530r4863j2216J20772r21j69180R8976
22215A7029J05212k1515n8664k3621q5109p9657M2435J31067M0270Q7992j25412
22204C0027q2482o6769j3142L6932N2399J90172P193j55891m0362P5498J31767
22193A65342J14916K5421j62653m9751O5632j59920n90j53072j53137J53199K432
22182a52181M5945K7829R0110J71232j68532K6815n5913J27226O302m9847j08325
22171c9339n86J5047j30748n8411j574J73764J20199j50645m3717J72777J82532
$$ y = [164883, 188517, 116362, -41850, -244848, -305765, -210872, -211182, -108567, -104785, -121297, -162492, -216042, -147149, 3678, 46669, 215790, 296664, 174572, 10164, -47655, 104734, 258634, 50968, -177943, -142069, 74461, -20402, -32618, 88154, 87233, -81947, 17029, 122241, 100726, 42062, 18441, -66668, -146325, -103890, 27177, 67447, 155439, 30027, -52455, -119224, -132366, -95434, -43035, 147137, 154330, -1561, -41923, 33575, 165342, 280258, 305679, 143026, 93275, 158907, -1013, -1603, -154675, -307812, -154613, -152181, -106236, -78407, 11703, 182935, 14403, 41218, -14695, 112531, 118833, 68986, -39339, -39925, -24878, -155626, -214037, -215611, -41847, 78352, -72293, -116010, 56767, 239299]
22160B39299l2371j02180Q0282p8315j60206K1467L8644N6947r8615N1475O8595
22149H5022m5809j52006N4790J59447M5548J21388j18742k60065J3053P4567o1793
22138h4600J36101J82519k60192n0825o101j00969J17415J56439K5287n1241j69839
22127a06006n3909L4304P2717J64928p8580j79183m1772R797J7276l5597J8325
22116a77700L0961l4298k5492K3518M3193L3749J12368o0102o6681l0460O081
22105a44863Q7276n0031j20523p629q6410k9124K21872j6716j17751p2799Q9573
22094b47125K36433R6364Q1034N5436r9543r6542j2039n0532n3077J46391O9802
22083A26602j94099k00802L8094M4915J5644O3408O4182M9401r3810q2665j89280
$$ y = [239299, 206928, 104748, 185030, 106715, -53491, -32024, 6620, 63567, -35048, 16427, 85022, 39213, -112793, -58003, 101444, 146992, 268380, 149638, -110427, -97374, -22807, -84600, 51501, 234020, -26172, -76997, -83098, -184067, -66652, 89787, 115074, 63833, -106006, -159915, -125611, -52894, 112034, 33454, -145729, -187501, -177704, -160428, -196025, -177700, -146739, -181037, -206529, -183011, -139818, -106069, 6299, -53803, -120484, -150944, -144863, -57587, -107618, -228141, -235770, -322180, -351304, -129432, -146148, -263899, -336698, -247125, -10692, 85672, 166706, 222142, 122599, 26057, 14018, -36514, -89591, 56800, 126602, -67497, -268299, -230205, -185290, -169646, -106238, -42056, 7345, -86465, -169130, -358410]
22072c58410P1321n4027J1700J45326J6924J6854L8345n0994L2177J21477K24790
22061B15483m2074j74985k29276R3529j1105J34092K50855N6760M1779P7897j19880
22050B93075j89440j38357q9874J1838K10192J65268p2402N767K0650j67878k15662
22039a66823N365J20059J34521j14374p0530j35344r236K74998R0792j38177j8212
22028b6961N2406j20323j50477J9517J51246K982L6657J23370j7848m2869n0446
22017b2746J9718j15431j00821J43032J82832m878k58910j28841K81859J2125
22007G939j88391m8433J08247J71285q4404q9486N8018o2639j20773k4931k3014
21996b96582L141L4347M9052J66166n7363j26158j02179p7865K45989K17615k7555
$$ y = [-358410, -287089, -341116, -329416, -184090, -167166, -150312, -111967, -162961, -130784, -9307, 215483, 173409, -1576, -230852, -137323, -148428, -14336, 236519, 293279, 335058, 412955, 293075, 103635, -34722, -124596, -112758, 97434, 262702, 190300, 196067, 216717, 48839, -166823, -161458, -41399, 93122, -21252, -91782, -227126, -236362, 38636, 129428, -8749, -26961, 25445, -94878, -245355, -225838, -74592, -71610, -34953, 88417, 70569, 27700, -22746, -3028, -118459, -219280, -76248, 106584, 101706, -157204, -286045, -4186, 7939, -180452, -228885, -120638, 50647, -33757, -123243, -65225, -127864, -248637, -273568, -296582, -293441, -259094, -210042, -43876, -101239, -227397, -329576, -407441, -161452, 56163, 28608]
21985B8608k8324P4984q6946j00529M7234J60004j16240R1903J29889j02954k60119
21974a62490j41721J70286Q7202N5446J15457P3849p5588N1556J35428L7695j31642
21963B15478j23711n7099r9805l5014J08643j252j41878k2054j36231j349J18886
21952a75386K1869P281K5195r4748j0669P6836J06101r584n6076j0766J21266
21941A319q8112r0585J52773K9774q3358j225m7766j5404K8702M0692o5883J26416
21929a2657r202r9958J1283J36029L3750p5624j35555j65403J04656n3750K16248
21918e0183K63521J42112k28232r4523K4518m2543j02564o8619J44452J14749
21908A02688K7970k8840k3888p2513j31001n4710m4131o3104J66666J20366J1762
$$ y = [28608, 284, 75268, -11678, -112207, -64973, 95031, -21209, 70694, 200583, 97629, -162490, -304211, -133925, -46723, 8723, 124180, 198029, 122441, 173997, 309425, 347120, 215478, 91767, 34668, -65137, -100151, 8492, 7240, -134638, -156692, -292923, -294272, -175386, -153517, -146236, -121041, -215789, -226458, -149622, -43521, -53105, -109181, -119947, 1319, -86793, -177378, -24605, 5169, -78189, -79414, -127180, -142584, -113882, -73190, -139073, -12657, -21859, -121817, -110534, 25495, 59245, -16379, -151934, -317337, -212681, -266431, -50183, 213338, 355450, 127218, 32695, 57213, 14670, -87894, -156513, -12061, 102688, 130658, 101818, 77930, 5417, -125584, -180294, -224425, -287529, -120863, -497, 11265]
21897A1265N0254J65818k53195n9344J9759J52742N9816r2169M784r1714j95666
21886b27650M1761o5170l8378J37405P4732m000M5131k5710P2821r3890p7439
21875a60387k1226P4755J85644m8103q056l6585Q2239j04483j00441j7496J40452
21864a3687J10051q2566k6224J64679j40503q9332K6876R6185n0473j9307K1804
21853b497k7629J2116J4546O9027J1230o1284l8985N5952J15445M3746M547o8946
21841A27268k6976M1078j39796k24579k5710J2519J69124K19533K4615o4510j02122
21830A0444M2026m7082m5759l1464l6112l6035M3129m1285k6141O0036j9647j02213
21818b30103J12692j4615K8597J29830M9337o9155q2313n4662N7412M7551J07546
$$ y = [11265, 61519, 227337, -25858, -85202, -65443, 87299, 147115, 54946, 59730, -31984, -227650, -185889, -251059, -289437, -152032, -77300, -81300, -36169, -61879, 10942, -82948, -160387, -181613, -106858, 78786, 30683, 22627, -13958, 68281, -36202, -136643, -154139, -13687, 96364, 13798, -12426, 152253, 11750, -77582, -50706, 45479, -4994, -24301, -2497, -30126, -18010, -3464, 65563, 76793, 15509, -23476, 32476, 147921, 191667, 196214, 127268, 100292, 141370, 1574, -223005, -248715, -236196, -67072, 152461, 177076, 112566, 10444, 52470, 5388, -40371, -71835, -107947, -143982, -100853, -142138, -168279, -108243, -127890, -230103, -117411, -132026, -103429, 26401, 75738, 6583, -75730, -130392, -72980, -25429, 82117]
21807H2117K0726j91928o5809J31771N0223j19958o7429L1313L5534k1921j07804
21796b23165N9503J19857j07391J05747K51900L811j45099N9025j77227j55464
21786b08503k9862o950M9601Q4100Q4912J9065O2138J36904J64678q3618j53471
21775A18994J54389P6906r1308M5563M4288j26419k63862O4655O4443N9278r1104
21764E5823Q7063k3123L071j54471j00984J3058R2484Q4830N1837J05875n5703
21753A59760j96375l8104q088j34041q1638P9994M4589K1328J6326J3641M6856
21742g5752R8001j9690r5949n6401m3728p6484J4252J07480L0408K9828K0043
21731f7992j85268n0272P3059Q1193J06716q9053K01080J79460n8626j74136k30409
$$ y = [82117, 102843, -89085, -154894, -23123, 27100, -92858, -160287, -128974, -93440, -115361, -223165, -163662, -43805, -151196, -45449, 206451, 210262, 65163, 124188, -53039, -208503, -238365, -245315, -195714, -111614, -26702, -7637, 54501, 191405, 356083, 272465, 118994, 273383, 350289, 258981, 304544, 348832, 222413, -41449, 23206, 87649, 146927, 55823, 142886, 119763, 122834, -31637, -132621, -119563, -27079, 57751, 109588, 215463, 159760, -36615, -74719, -82807, -216848, -298486, -218492, -173903, -152575, -136249, -122608, -75752, 22249, 2559, -93390, -149791, -193519, -270003, -255751, -148271, -117863, -88035, -67992, -253260, -303532, -230473, -149280, -42564, -131617, 69463, 248923, 190297, 16161, -214248]
21720b14248p5011P5212j36923P2100J07940m3348J6863J98198J86396j04671
21710H2508j52801j69856J87928J87705n8581n3174j5117k6817r6648o0567J78701
21699C281J52934o6284o749j1206L2151P1805M0015k40290o0246J16630n9870
21688b7829r1309j79649j2480J38212P3514J81030J18038K7441k13326j2106N1428
21677E2964j21929l5168J40828R8766j54374j4919J82748q121n1342m7409K616
21666D4660o0218j14106N0503N3981o9412r795R7098l5678j28707L9719r9223
21655b31178j42636J47428K24295m5524q489L1573j19859N5321L1370k286O6212
21644F227q3943j77836j49387L1037J11072M4755q082J35002j57350k06760m0177
$$ y = [-214248, -289259, -214047, -350970, -278870, -170930, -214278, -197415, 783, 187179, 82508, -70293, -240149, -52221, 135484, 76903, 23729, 8612, -18205, -114853, -175420, 3281, 156215, 89931, 83182, 71976, 104127, 175932, 215947, -24343, -84589, 32041, -27829, -119138, -298787, -311267, -173055, -99541, 81489, 199527, 226968, 13642, 1536, 52964, -68965, -104133, 36695, 135461, -18913, -33832, 148916, 140795, 89453, 42044, 44660, -15558, -129664, -79161, -25180, -94592, -104387, -7289, -42967, -171674, -131955, -231178, -373814, -226386, -2091, -47615, -56104, -24531, -144390, -89069, -57699, -59985, 6227, -77716, -255552, -404939, -373902, -262830, -218075, -226157, -91155, -248505, -455265, -495442]
21633d95442j7008K81203L3962Q6556q5341N9016J25367J28182k8337o5142o5400
21622d2384p1349r725p7853L7517j24441r5675J68505J31446l7386j1608r9643
21611b32596J75645J68102n0638K2708N3939Q0884O3423k33321j59912K1270R0310
21600a86j0415o3049J3155P6480j16560j1164o7165n1069O7203q2008K15416p6346
21588a05708j69019Q7316R3884Q5624j9685M2928o4099P089M2648k9160j51706
21577a79888o7246P0254J41742Q5919R8335J10809j23865l122J71815k06965q9315
21566H473l8942j61489J60706J6480k0574J88105J24560j4638p3644k19716k37443
21555b68122K2076L0233l2217K6689l0597k7880r2674P0994K36623J79973n3485
$$ y = [-495442, -512450, -231247, -197285, -110729, -196070, -137054, -11687, 116495, 88158, 23016, -42384, -113733, -123458, -201311, -163794, -288235, -383910, -215405, -83959, -121345, -132953, -232596, -56951, 111151, 60513, 83221, 137160, 218044, 281467, 48146, -111766, -90496, -186, -10601, -73650, -60495, 15985, -100575, -111739, -178904, -229973, -162770, -244778, -29362, -105708, -274727, -187411, -93527, -7903, -27588, 15340, -48759, -41670, 978, -28182, -179888, -247134, -176880, -35138, 50781, 149116, 259925, 136060, 132938, 304753, 97788, 8473, -30469, -191958, -31252, -14772, -35346, 152759, 277319, 262681, 189037, -30679, -268122, -246046, -215813, -248030, -221341, -251938, -279818, -372492, -301498, -64875, 115098, 61613]
21544F1613r5920j009R8922K1813n5333Q1412J41983M9145j32868k49737N4481
21533b5498m574J96461J52028P746k47481p4059J2468p6572j41028j3182j6831
21522b30522r430m9914N8708J73921J25848J31368J19781N6989j67082j66004
21512D3663L1962p431J61425J052j34512k1226r4246O1824J68038j44291n1455
21501A4803R6328J17459q6556j20202j12173m5282l9828J09038R1565L023R6688
21490A24863J51166m2226j16109j80883p6796J59129N0069j51129M9219J43373
21480A10676J09796L4828j96081r7808j6333P2852J56763Q2143N256M4242Q8943
21469C95277j11931j87312L2028J11011n3993J05150j64933k09922m6470J20576
$$ y = [61613, -34307, -35316, 63606, 85419, 30086, 111498, 253481, 302626, 169758, -79979, -25498, -30072, 166389, 318417, 326163, 78682, 4623, 17091, -59481, -200509, -213691, -230522, -239952, -289866, -231158, -57237, 68611, 199979, 319760, 376749, 209667, 43663, 75625, 68194, 229619, 230671, 96159, 74933, -19313, 42511, 210549, 66258, 14803, 111131, 228590, 142034, 21832, -90341, -135623, -175451, -66413, 25152, 28175, 124863, 276029, 233803, 117694, -63189, -139985, 19144, 69213, -81916, -32697, 110676, 220472, 255300, 59219, -38589, -54922, 17930, 174693, 256836, 262092, 306334, 395277, 283346, 96034, 128062, 239073, 185080, 290230, 125297, -84625, -131095, -10519]
21459a0519J97512J78204N0749m949P3839j92331j87422K7203J4035j06660j77551
21448a37890P0567J11654J88790m5451j04561o0176l3544k6099p4653M2731L5819
21437c2813P1899R7395J04248n4332k3028L4728j58776o4497J22329l660p32j9154
21425G3607J03855j3718m9535Q9219k9818n582j55295j79506N0183J88393J1720
21414H3523L1710L994k4325p3599j2885Q4274n79q309q5824K7721O1670L4105
21402A21476N8607N4342j01674N8457n7948j19563R2927J76643n4820j58625p8196
21391h374J12426J69807o679k12343k43349N1487M5236k07303K7414Q0261K05754
21380A4337J39891N3494j52230j07812R0853r684R5217Q4250L878m5947m2357
$$ y = [-10519, 186993, 365197, 415946, 410997, 484836, 292505, 105083, 132286, 146321, 39661, -137890, -67323, 44331, 233121, 187670, 83109, 22933, -10611, -36710, -111363, -68632, -32813, 39086, 136481, 240729, 186397, 163369, 198097, 39321, -25176, 97153, 93493, 92761, 73607, 177462, 163744, 114209, 203428, 173610, 168028, 12733, -166773, -116590, 71803, 83523, 115233, 119227, 94902, 21303, 8418, 92692, 92113, 83804, -2020, 25701, 87371, 121476, 180083, 234425, 132751, 191208, 133260, 13697, 106624, 283267, 228447, 69822, -8374, 104052, 273859, 267180, 54837, -188512, -137025, -91789, -299092, -271678, -191417, 14337, 154228, 207722, 55492, -52320, 38533, 28849, 124066, 208316, 212194, 166247, 123890]
21369A23890k29697j2934K1605j04229J09180M4495J12256J40302j32792n4767
21359A7309j06430j20174p8788Q6687J53866Q2870K7188p1019Q577k078N5659
21348E3667O1311R9325Q9399j83846j78790R4777Q9876m9994n47q5926o4441m2756
21336a17945O3706P5415L749j41410R251P377K6945J56373J48079j03861m0979
21325H6700J39551q5601j25317L83j66520L1904J52059p1163p9100J69153p5725
21314b3676j02664l8137O4854j03136k4149K01677r0986j82597j2543J13075K23435
21303B5153R4688j35599M6090p7048j17106J88615P2049n8835n339l1379Q5770
21292H7059j54697j29599m1200Q3534K18419J67620J27466j52010j77974r8331
$$ y = [123890, -105807, -118741, -97136, -201365, -92185, -47690, 64566, 204868, 72076, 17309, -89121, -209295, -288083, -201396, -47530, 35340, 62528, -8491, 86, -1992, 53667, 114978, 214303, 303702, 119856, -58934, 35843, 125719, 75725, 75178, -10748, -75189, -117945, -54239, 21176, 24925, -116485, -107234, -99857, -72912, 83461, 231540, 127679, 86700, 226251, 140650, 15333, 15716, -150804, -118900, 33159, -38004, -117104, 52049, -23676, -126340, -164477, -99623, -202759, -226908, -25231, -116217, -298814, -311357, -198282, 25153, 119841, -15758, 30332, -46716, -163822, 24793, 96842, 38007, 32668, 1289, 87059, -67638, -197237, -238437, -154903, 63516, 231136, 358602, 206592, 28618, -69713]
21282f9713j942J5387O0338j64668N2854O8487j7437k32315j6334J41781J47189
21271a6373M8709p3787m6958j07488k2710J03326J29153M1222j5681M344J6138
21260E9895j9201k5680j43794m7737j5446J197L568o9249k7870L85112K17247
21249C18042M7311j06823P6387J11008o1447n6413J5200j02647J59651q5682j3562
21238C01025R0477k9672j74398o5790p8360r8079p5645P4220K62062k8712j57750
21227A9378j33607j0867K42991R0821j00707j15295Q2730L6872J00117j03825
21217A08608L936j4667j52616p6849K2640M6208K7890o3697K14750R922j32664
21206f539R072J61133L4708j18818M524K9959k51037K700Q6493J489N1553J1284
$$ y = [-69713, -71655, -56268, 4070, -160598, -107744, -39257, -56694, -289009, -305343, -163562, -16373, 32336, -41451, -88409, -195897, -218607, -115281, 13872, 55094, 39413, 43757, 59895, 40694, 15014, -128780, -176517, -191963, -190766, -187198, -256447, -284317, 100795, 318042, 365353, 258530, 334917, 445925, 384478, 328065, 343265, 240618, 400269, 314587, 301025, 391502, 361830, 187432, 121642, 43282, -54797, -130442, -56222, 205840, 177128, 19378, -114229, -125096, 117895, 208716, 108009, -7286, 75444, 112316, 212433, 108608, 112544, 97877, -54739, -131588, -108948, -62740, -34850, -98547, 116203, 126125, -6539, 2533, 163666, 198374, 79556, 84080, 114039, -136998, -134298, -47805, -46316, 5237, 16521]
21194A6521q1154k07318p5970Q3657K25155J48008J73625o5886j49588K21j74178
21183a06907m9481q654N1631J28422p6334j26474q3999R3172K40048O2009k2240
21172A01193j8515L7077n1867m5332n6867O8811J07708J32385O5385M9493j62630
21161B26841M0318K54419l9600n3884l0553n0951j25058j80090q4J63550l9831
21150A65077r3365p7728K7941J08078K624J8636l5242J0195N9557p5927o1334
21139D8512N1625Q8193L5690j32920n5426j18946O6446P4189J44199n6591m1453
21128A03518L0264j25857O7691K62463n2320j89018j83874q5084R7130m644J30128
21117E0397Q7165N2912M0003j40730k31670L1953O9885l3884o6919R5042K5805
$$ y = [16521, -64633, -271951, -347921, -264264, -39109, 108899, 282524, 216638, 67050, 67271, -106907, -156388, -165042, -113411, 15011, -61323, -187797, -271796, -178624, 61424, 123433, 101193, 82678, 119755, 67888, 22556, -34311, 34500, 142208, 274593, 339978, 389471, 226841, 267159, 521578, 481978, 428094, 397541, 346590, 221532, 41442, 41358, 204908, 165077, 71712, -6016, 21925, 130003, 132627, 151263, 116021, 126216, 185773, 109846, 48512, 100137, 188330, 224020, 91100, 35674, -83272, -16826, 57363, 201562, 144971, 103518, 133782, 7925, 75616, 338079, 285759, 96741, -87133, -172217, -75087, -79731, 50397, 137562, 190474, 230477, 89747, -141923, -109970, -40085, -73969, -140888, -45846, -20041]
21106b0041J583p7772L6903j79062P263r5793M5973J97513J36290M0725m7987
21095D5595R8592M4546p1293j01394r5572J3294O8784N0061K21650J10162j98086
21084A86339k84181K7862K23114j665j32754M5799N3071P9212J0146j82587K2260
21073D6616P7686j7832j39480l1044J14343J30866R2149Q3290o0672p872j61964
21062A26086j44182J1811J5485J45784q7393r4004N1706p5512K8032J65392Q7281
21051B30486j29054o1063K05208j047q2957m9619o3367K943n7826j21802L1161
21040i6937m0851R7816L2451J19859n250m2992M5952N8607J3125l7839J3810j16613
21028D1138k93401O468J44574J7388N0413N265j4012q7673r3918O7299R0367J2259
$$ y = [-20041, -18458, -96230, -59327, -238389, -231126, -326919, -280946, -83433, 52857, 93582, 45595, 144187, 188733, 117440, 16046, -79526, -66232, 2552, 52613, 274263, 384425, 186339, -97842, -69980, 153134, 151469, 18715, 64514, 117585, 196797, 206943, 24356, 46616, 124302, 106470, -33010, -64054, 50289, 181155, 273304, 356594, 295922, 288050, 126086, -18096, -6285, 9200, 154984, 67591, -26413, 25293, -50219, -22187, 143205, 230486, 101432, 40369, 245577, 244530, 161573, 111954, 48587, 51530, -6296, -128098, -96937, -137788, -39972, -7521, 112338, 107088, 64096, 110048, 168655, 181780, 143941, 157751, 41138, -252263, -245795, -101221, -83833, -33420, -28155, -42167, -129840, -223758, -156459, -66092, -53833]
21016e3833P5847Q4363j36725K8159K3193p7607j14828Q0384j77190j45657m6765
21005d60659J00214K32238K09028j71785m3020m8702M5283K79224N393j27892
20995A9322r4180K1060K9167p461j32767j71954J3815M2654m9169L2902R2797
20984b03814J51274Q3970j6981o6613J04513o6367m8506j0998R9489Q12J59124
20973A85903m4026P0653K292K2767j7527j65553J0352J34665P5391j16289l27255
20962a68627r9979K29264K39398l3760l0967J08676k7957k3391L9524m9563n137
20951A77481l1570K7254q9558M856O5621J2708k0787p9715K6974o8845j67816
20940a43397q916K66288J44213o4892l929K1983j30090n5406r176J6356n8612
$$ y = [-53833, 22014, 106377, -30348, -2189, 21004, -56603, -171431, -91047, -268237, -413894, -460659, -360445, -128207, 80821, -90964, -133984, -182686, -137403, 141821, 147214, 19322, -74858, -53798, -24631, -32092, -164859, -336813, -322998, -280344, -329513, -296611, -203814, -52540, 31430, 14449, -52164, 52349, -14018, -62524, -73522, 25967, 26779, 185903, 141877, 212530, 214822, 237589, 220062, 54509, 64861, 199526, 274917, 158628, -168627, -268606, -39342, 200056, 166296, 135329, 244005, 216048, 192657, 232181, 182618, 177481, 145911, 173165, 83607, 88463, 154084, 166792, 146005, 66290, 93264, 24419, -143397, -152313, 113975, 258188, 193296, 189367, 211350, 81260, 25854, 16678, 33034, -25578]
20929b5578k32423o4161O5769O8738J47180P7611j42148m7306L6682M184j45559
20918b57011L9926O1200M6075J25625L8695l8687M6828K1117l5688M2493r9991
20907i418p1901K0425J4222K822L5388J8833j0061l5710R9635M5428q5049p563
20895A7051k4132j02343j01457J23352P1501N336r1703l1956Q8517J35452m1413
20884D8205M8972N0434k9452p2435m667m4530J42430P7931r9029l9947r8469L8146
20872A7589K60389J13295n7506r8581o3988n0758p3635j1655J7814O2887J57528
20861B73379j16800l9657j05856l2918n0797Q037N8819J24899J26497k812k00375
20850D2416K4620J97735M9879K7418M4635N5034j69689j28671R7943M9769j40680
$$ y = [-25578, -258001, -322162, -256393, -187655, -40475, 37136, -105012, -152318, -115636, -111452, -257011, -217085, -155885, -109810, 15815, 54510, 15823, 62651, 83768, 48080, 90573, -9418, -81319, -60894, -46672, -43850, -8462, 10371, 310, -35400, 64235, 109663, 24614, 17051, -7081, -109424, -210881, -87529, -16028, -10692, -102395, -134351, -45834, 89618, 48205, 97177, 147611, 118159, 45724, 41057, -3473, 138957, 216888, 117859, 77912, -20557, 17589, 277978, 391273, 333767, 235186, 171198, 120440, 46805, 35150, 52964, 115851, 273379, 156579, 116922, 11066, -21852, -72649, -64612, -5793, 119106, 245603, 242791, 42416, 67036, 264771, 314650, 342068, 386703, 441737, 272048, 143377, 241320, 291089, 150409]
20839A50409o6460n6332j25829O9351k1874O0696Q0967r671m696j46363J1611
20828e8191m6056l1503J28112J08307K5419O0295j41072j03172J38307m2124r8444
20817f0122J07776K7396m0150O854O6505p0959j27961P5385J74795J32126j32494
20806A59151q5814k00916k8747o2392N7990J39216k1527j21097k883l1820j90014
20795c88853P0151K06226J37815n1737Q1049N4521n672R131N0907m1527l8849
20784H3162o0979j19096j3511j34306J04911K61076P9565p5497n4135j3234M2652
20773A00608J7272p1582r8345m4647J06971J11138L409j29854l168N2507J59132
20762B03441J2734J06261N8872j20860R5464J27545O1508q9924j25563j32127
$$ y = [150409, 83949, 27617, -98212, -28861, -50735, 9961, 90928, 81257, 76561, -69802, -58191, -104247, -135750, -7638, 100669, 126088, 186383, 45311, -57861, 80446, 38322, -60122, 47654, 75050, 34900, 41754, 108259, 37300, -90661, -15276, 159519, 291645, 159151, 73337, -127579, -156326, -218718, -160728, -21512, -43039, -164136, -167019, -198839, -388853, -318702, -112476, 25339, -26398, 54651, 109172, 103500, 112631, 163538, 122011, 83162, 22183, -96913, -110424, -244730, -139819, 121257, 200822, 125325, 71190, 57956, 100608, 117880, 46298, -52047, -96694, 10277, 121415, 124824, -5030, -8198, 44309, 203441, 216175, 322436, 381308, 260448, 355912, 483457, 544965, 455041, 329478, 197351]
20752A97351j02900j90881j33985J8079Q2741m0665J54349J18676M7973N0869
20742B01607j5986j04522p7742P7561j7821m3979J41851J14875P224n7841L7738
20731B62965n554Q1405j3212j17279m8338J20882P0382k19175l21001K0547K7379
20720a40999R6655r7861J6457o6943J0666L6065J79424K9031j3532J10603N7313
20709B16879k73530L0609K08644p3155j02207q8164L6688J56701k7458R1492J66428
20698C42927L370j11303q96J48814J11113m6184o1256j14958j43805m1964M0297
20687A26155N8450P1421J08296P2972p8174j05982j10347N6269j24463j63046
20677h8449j0225P5176O6061m7275M838M242O3719R281O2288J9534k64312N4961
$$ y = [197351, 94451, -96430, -230415, -212336, -129595, -170260, -15911, 102765, 150738, 201607, 185621, 81099, 3357, 80918, 63097, 19118, 160969, 275844, 283068, 225227, 262965, 257411, 338816, 325604, 208325, 159987, 280869, 351251, 132076, -188925, -168378, -140999, -44344, -142205, -125748, -192691, -182025, -145960, 33464, 62495, 48963, 159566, 216879, -56651, -26042, 182602, 109447, 7240, -80924, -44236, 112465, 85007, 176499, 342927, 346297, 234994, 234098, 382912, 494025, 447841, 386585, 271627, 127822, 85858, 126155, 184605, 256026, 364322, 437294, 359120, 253138, 142791, 199060, 74597, -88449, -98674, -23498, 42563, -4712, 126, 4368, 68087, 77368, 139656, 159190, -105122, -50161]
20665e0161J82235J81734m3415k51806J22866J03298l5207L5838m4198j15765
20655H5419q2332J10184k6704r5180r6308O1939J90965J05627j54069r7258j09457
20644a07174P6260Q4584J38394J65684J37524J19454j57154K7924N2866j23912
20634D14450j88498r3217J80305M2028o3706n824J7820J01714r5175n2408J44409
20623D01898K3012k13534k61515l0316J67717J01703j02402o6681p800J06042
20613A18124K34389N7283K8656L6854k31152j93265M0603r1105r0565L3223N8429
20602A474Q3848l1811m0494Q0498K3841J33678K13952j4786k0020l8708r6865
20591B94607J48464Q7046j52087r5791Q452J58123j31670J8530J02105J00323
$$ y = [-50161, 132074, 313808, 270393, 18587, 141453, 244751, 209544, 245382, 201184, 85419, 3087, 113271, 86567, -8613, -104921, -42982, 147983, 253610, 99541, 2283, -107174, -30914, 53670, 192064, 357748, 495272, 614726, 457572, 485496, 538362, 414450, 225952, 132735, 313040, 355068, 291362, 285538, 303358, 405072, 309897, 257489, 401898, 424910, 211376, -50139, -80455, 87262, 188965, 86563, 19882, 12082, 118124, 352513, 409796, 438452, 475306, 244154, 50889, 91492, 387, -90178, -56955, 1474, 85322, 53511, 13017, 93515, 117356, 251034, 464986, 450200, 430180, 391472, 294607, 443071, 530117, 378030, 282239, 290691, 448814, 317144, 335674, 437779, 538102]
20581E38102o8151k29138j09989q4967J29312P2564K3007l8150N0522k40160K5576
20570F8528J18849O5306M5854M7690l6821J23457k529j42099j30922k248L7580
20559A92645N2473J30269n5102l39800k5928N0196J39307J09595Q0196K9762L0854
20548C94467K6762O608j60860r1708r4175K1929J34050J7158M6560R4644j01272
20537B94163k5591j08992L3378J43155L4857j07282L0514n2010P154K5126q1384
20526A93088J7973J18824r0729j61847J36125J15944J30803l8504j34379L95o6237
20515B21456K623J55269o2103j26541k0277q8772P3504K36083J38093N8638n9256
20504E28717q9322K8909q4301n1235M4682j12282m6950R5779M4214j03790p8975
$$ y = [538102, 469951, 240813, 130824, 45857, 175169, 247733, 270740, 232590, 283112, 42952, 68528, 187377, 252683, 298537, 346227, 309406, 432863, 430334, 288235, 157313, 155065, 192645, 245118, 375387, 320285, -19515, -45443, 4753, 144060, 253655, 333851, 363613, 394467, 421229, 427837, 266977, 175269, 81094, 103023, 237073, 254231, 300791, 395435, 294163, 268572, 159580, 192958, 336113, 370970, 263688, 294202, 242192, 249346, 274472, 193088, 211061, 329885, 239156, 77309, 213434, 329378, 460181, 421677, 287298, 287693, 221456, 224079, 379348, 317245, 190704, 170427, 81655, 155159, 391242, 529335, 587973, 528717, 439395, 468304, 384003, 332768, 377450, 265168, 218218, 313997, 358211, 254421, 175446]
20493A75446O1765m5092j14313O5113J56096M6215J0041j7815p2768k0373L0170
20482B74485K2018j53231N3692N0257m0934J2120L8913K24344Q9608p6559Q9352
20471E84065j48423k33608j21472p799K36388j45913O9761Q7344O946j51498O496
20460A82287J04543J38131k6266k11687j30031N5437N8244K5929J8030p7607J02743
20449B39753J21863q510p1611j08271n377k8520l4215L8609k9686J28090K32673
20438D74798o5674p9963N4285j189j32262k7726J45862K50947K31415j1096r1350
20427G48047j20863K8526l34o8016k54585j06122J40499j0253l6081j70692J63665
20416C13791J67008m3709j58692r7516Q5897m3181N5175K5719J41552O9320J87154
$$ y = [175446, 237211, 192119, 77806, 142919, 299015, 345230, 355271, 337456, 264688, 244315, 274485, 296503, 143272, 196964, 247221, 206287, 218407, 257320, 481664, 571272, 494713, 584065, 435642, 202034, 80562, 72763, 309151, 163238, 232999, 320343, 327289, 175791, 182287, 286830, 424961, 398695, 187008, 56977, 112414, 170658, 196587, 214617, 137010, 239753, 361616, 353106, 281495, 173224, 167847, 139327, 105112, 143721, 114035, 242125, 474798, 409124, 329161, 383446, 382257, 249995, 222269, 368131, 619078, 850493, 839397, 748047, 627184, 655710, 655376, 587360, 332775, 226653, 367152, 356899, 320818, 150126, 313791, 480799, 437090, 278398, 180882, 266779, 223598, 278773, 304492, 446044, 515364, 702518]
20405G02518l7171j39562j31809k930N3750q2817k6296n2961J43783m7988K7826
20394D06343J84343Q1489L2416j76023r1813j01142m1862O7400P8682o4821J6133
20383C91145O9863N048l7923J46458M5942P4338m663n9600j76238j7252O2700
20372D99818k2395K0786n2591j71158j46767k959k8782K14965K08912O0978n552
20361E75255j54174M5819m637n9928r5839J23260K26657l1745j57801j82204m2300
20350B42363J57702P7766n1392O6065n0019o0935K130K44966n1483j63211j8490
20339C95462j06944q1311P3051R732k6934j4262J45260Q9598J1269j04536j15181
20328B75204J14337J28897J05956j53122j85311R5416p5202O7995j0063o495J12046
$$ y = [702518, 665347, 525785, 393976, 391046, 444796, 361979, 335683, 282722, 426505, 378517, 406343, 590686, 672175, 704591, 528568, 436755, 335613, 293751, 361151, 439833, 375012, 391145, 461008, 466056, 428133, 574591, 620533, 694871, 690208, 630608, 454370, 437118, 499818, 477423, 498209, 445618, 274460, 127693, 124734, 95952, 310917, 519829, 580807, 575255, 421081, 466900, 462263, 402335, 306496, 429756, 656413, 624668, 466867, 284663, 242363, 400065, 477831, 426439, 492504, 442485, 381550, 383680, 628646, 577163, 413952, 395462, 288518, 207207, 280258, 289990, 263056, 248794, 394054, 483652, 494921, 390385, 275204, 389541, 518438, 624394, 471272, 285961, 381377, 306175, 374170, 364107, 357612, 469658]
20317D69658N2122r1768j57037n8239J22146N7037J4786l5465J11620K6845P856
20306E19561j148k0540J01443O1108O0652K0602j97071r0016r3393j7531K44832
20295E88499L8266O2783P4232j48208q3041m3697l4759O9487J80807M1637j19692
20284F26314j06746K0119j40900P3013J29274j06942m8105R0721P1771j88052
20274D20467j60515J92080K36318J66697J168j66670L1556p5120r4730j1554J30772
20263F70469J63797j13241m5802J3089j30523J8657n6972j25767o9477J60763
20253D84993J68814P2302j9964j04109N8033o2862r9848k9604j26520J71888J73073
20242F86196P0614J34440m6501j12359p0341q6633l8109j25595Q2631J69316l2303
$$ y = [469658, 521780, 430012, 272975, 214736, 336882, 393919, 408705, 373240, 484860, 511705, 519561, 518413, 497873, 599316, 660424, 721076, 741678, 544607, 454591, 361198, 343667, 588499, 626765, 689548, 763780, 615572, 532531, 488834, 454075, 523562, 704369, 746006, 626314, 519568, 539687, 398787, 471800, 601074, 494132, 446027, 536748, 608519, 420467, 259952, 452032, 688350, 855047, 856215, 689545, 721101, 645981, 551251, 539697, 670469, 834266, 721025, 675223, 688312, 557789, 576446, 519474, 393707, 324230, 484993, 653807, 726109, 706145, 602036, 660069, 597207, 497359, 467755, 341235, 513123, 686196, 756810, 891250, 844749, 732390, 662049, 575416, 537307, 411712, 494343, 663659, 631356]
20231F31356R8840j20735k3842K01424K3247l0952J5877N9358r6119j3991q83
20220G43580n9732l8011j8092J37138J34711k04005j34918P6551J02536K10512
20210I50270J50247L6090K2629q8519l7381M1349P7471o225j27137k16206j19300
20199F83288Q5422k2702J41739L9506j19963r1952L244L33264J7081k57840q3576
20188G27511J77470J16898P7569J29763p4255k00810p5596o2730r3381o8203N5999
20177G10235J28643j51119m551R789K2929j1850J85265J07238M107q6609k51725
20166F62352n8679j532J21236K55975P8055N9610j4246j2034K15477Q2641n3879
20155A334976n4866j76641j1605j66677j02023J25578R9114R1942j6291j78915
$$ y = [631356, 730196, 609461, 585619, 787043, 810290, 779338, 795215, 854573, 758454, 744463, 743580, 683848, 645837, 627745, 764883, 899594, 695589, 560671, 637222, 739758, 950270, 1100517, 1136607, 1159236, 1070717, 1033336, 1074685, 1152156, 1145931, 1018794, 802588, 683288, 768710, 746008, 887747, 927253, 807290, 715338, 718582, 1051846, 1068927, 811087, 727511, 904981, 1021879, 1099448, 1229211, 1154956, 954146, 878550, 815820, 722439, 654236, 710235, 838878, 687759, 683208, 692997, 715926, 704076, 889341, 996579, 1000686, 914077, 662352, 603673, 602141, 723377, 979352, 1057407, 1117017, 1102771, 1090737, 1306214, 1388855, 1334976, 1280110, 1103469, 1091864, 925187, 823164, 948742, 1047856, 1139798, 1123507, 944592]
20145I44592j37489P9179P7078J22355K35075M7555P852J34863k00662N235P2925
20134A388558K1239k176J3343M6990j36745k01091N2050K15312K1750M0221k0196
20123A439255q1429q377m2235m3312O1642j19646K0012L6503j38927j27995P1704
20112A067195J18278n9338L8340J40702k149r2095l8413p21K6519N7398R0071
20101A345787J52163j79307o8629J83833Q7770K2232J06444l2731j2116k8264
20091A577182l452K5138J2091j19131q1410K3455J20058J51797J39380J24104
20081A969212p2448k31319o3303j14972p5485Q5158k3746O3144O8570J45389J54390
20070A904590J51608k1032L8394o5505q3457q3041m4265o6029j1842J72886J36062
$$ y = [944592, 807103, 886282, 963360, 1085715, 1320790, 1368345, 1376197, 1511060, 1310398, 1315633, 1388558, 1409797, 1407621, 1420964, 1467954, 1331209, 1130118, 1182168, 1397480, 1419230, 1459451, 1439255, 1357826, 1349449, 1307214, 1263902, 1325544, 1205898, 1225910, 1262413, 1123486, 995491, 1067195, 1185473, 1126135, 1164475, 1305177, 1303028, 1210933, 1172520, 1171799, 1198318, 1255716, 1345787, 1497950, 1318643, 1250014, 1433847, 1521617, 1543849, 1650293, 1617562, 1605446, 1577182, 1573730, 1598868, 1610959, 1491828, 1410418, 1433873, 1553931, 1705728, 1845108, 1969212, 1896764, 1665445, 1602142, 1487170, 1411685, 1496843, 1473097, 1536241, 1604811, 1750200, 1904590, 2056198, 2035166, 2073560, 2008055, 1924598, 1841557, 1797292, 1731263, 1719421, 1892307, 2028369]
20059B028369j18139j27010l813J9710J6824R8246l6951O7313N8217R9860p327
20048B095299m3192o9727K4184J51191m7582K9533K859K8249R0872P8500L7229
20037B377415r8982L6412K03803M2784J81147J90523O3111j1494j42335j906n1006
20026B789472m0604r7994o4011P4534L3843o8676R1281J93664M5836j75546M5652
20015B827451N0920N1943J35677K3694J3844M2536K7247J10701K6776o0286N1476
20004C301979P7632j64904l0389j2859O9560J84690J56091J26573P5041j24377
19994C659037j45801j74922J14597K94635M1869O514J91378J24623R0119j33925
19984D068124n6914J1593L3057J6462J55276J39236q730N2915J30552p73R3422
$$ y = [2028369, 1910230, 1783220, 1779407, 1799117, 1815941, 1914187, 1877236, 1944549, 2002766, 2102626, 2095299, 2052107, 1982380, 2006564, 2157755, 2110173, 2139706, 2142565, 2170814, 2261686, 2340186, 2377415, 2278433, 2314845, 2518648, 2561432, 2742579, 2933102, 2996213, 2984719, 2842384, 2840478, 2789472, 2748868, 2650874, 2586863, 2661397, 2695240, 2626564, 2717845, 2911509, 2957345, 2781799, 2827451, 2878371, 2930314, 3065991, 3089685, 3103529, 3146065, 3173312, 3284013, 3310789, 3250503, 3301979, 3379611, 3214707, 3184318, 3171459, 3241019, 3425709, 3581800, 3708373, 3783414, 3659037, 3513236, 3338314, 3452911, 3747546, 3789415, 3795929, 3987307, 4111930, 4202049, 4068124, 4011210, 4022803, 4055860, 4072322, 4227598, 4366834, 4358104, 4411019, 4541571, 4540798, 4634220]
19973D634220J33638M3584O8409p9422j16797j28778J73646R0743J7669o3764
19963D773148N5142M3336R0979P5103N3006J13930J02923J65768K14292K9960
19953E717587M1852j75607O0981J15721R6142J2612J0918J53012R8381O753j4827
19942F123525J15479K07707J82346n6078l05651l685J5711J30789K55567J19817
19932F785527P7577J39410J41132R0571N1990r0114j82926J30040K16923K30783
19922G590913Q3446J59188L04636J59047l6624L7096J51451J54395J51863J47547
19912H902958P5264R7080j8334J23428J50615K49607K58588K07954M0422J45962
19902A0233544K08993P213J27617J05281K37554K31705K76186J88404j4527J25198
$$ y = [4634220, 4767858, 4811442, 4879851, 4800429, 4683632, 4554854, 4728500, 4819243, 4836912, 4773148, 4828290, 4871626, 4962605, 5037708, 5090714, 5204644, 5307567, 5473335, 5687627, 5717587, 5759439, 5583832, 5644813, 5760534, 5856676, 5869288, 5880206, 6033218, 6131599, 6138352, 6123525, 6239004, 6446711, 6629057, 6572979, 6267328, 6263643, 6279354, 6410143, 6665710, 6785527, 6863104, 7002514, 7143646, 7234217, 7286207, 7196093, 7013167, 7143207, 7360130, 7590913, 7674359, 7833547, 8138183, 8297230, 8260606, 8297702, 8449153, 8603548, 8755411, 8902958, 8978222, 9075302, 9056968, 9180396, 9331011, 9580618, 9839206, 10047160, 10087582, 10233544, 10442537, 10449750, 10577367, 10682648, 10920202, 11151907, 11428093, 11616497, 11601970, 11727168]
19892A1727168K48683L64925K72903J63627J22324J45878K36782J74818J82581
19883A3639689J78839K27474L54878L88531M09573M22662K50772K99118M68077
19874A6639613K76912J61455K60867J99162L20777M75018M88186M12168L40421
19865A9574579N20353M66115M53034O16499N77755M45512N73580Q08638O45110
19856B4681175N46987O08857P31926O23217O70405O90475P43895Q72195Q85569
19847C1054701P67361P71077R28836R07561J024482J171152J048778J180111J149166
19838D0003225J315058J353630J229493J371733J610120J719161J746549J596278
19830E1945247J735444J789165J878153K094211K019763K132867K252057K285244
$$ y = [11727168, 11975851, 12340776, 12613679, 12777306, 12899630, 13045508, 13282290, 13457108, 13639689, 13818528, 14046002, 14400880, 14789411, 15198984, 15621646, 15872418, 16171536, 16639613, 16916525, 17077980, 17338847, 17538009, 17858786, 18333804, 18821990, 19234158, 19574579, 20094932, 20561047, 21014081, 21630580, 22208335, 22653847, 23227427, 24036065, 24681175, 25228162, 25837019, 26568945, 27192162, 27862567, 28553042, 29296937, 30169132, 31054701, 31822062, 32593139, 33521975, 34429536, 35454018, 36625170, 37673948, 38854059, 40003225, 41318283, 42671913, 43901406, 45273139, 46883259, 48602420, 50348969, 51945247, 53680691, 55469856, 57348009, 59442220, 61461983, 63594850, 65846907, 68132151]
19822F8132151K561113K627251K567484K932701L057444L059071L246986L397278
19814I1581479L578438L738365L646069L801116L886625L986268M140498M278610
19806A22637468M401971M350728M430163M440720M466909M252019M148180M111573
19798A57239731L911777L965281L844132L351971K888476K431610K225311K025823
19790A81884112J525359J120295M88768M4635l42353q69909j094169j424283j920484
19781A79411971k318985k574790k725927l005637l221704l399384l504439l727733
19773A54933372l836398l907223l725796l792885l913335l737564l481812l586354
19765A24952005l676842l353036l434222l375356l088495l004538l121659l017710
$$ y = [68132151, 70693264, 73320515, 75887999, 78820700, 81878144, 84937215, 88184201, 91581479, 95159917, 98898282, 102544351, 106345467, 110232092, 114218360, 118358858, 122637468, 127039439, 131390167, 135820330, 140261050, 144727959, 148979978, 153128158, 157239731, 161151508, 165116789, 168960921, 172312892, 175201368, 177632978, 179858289, 181884112, 183409471, 184529766, 185018534, 185063169, 184720816, 183850907, 182756738, 181332455, 179411971, 177092986, 174518196, 171792269, 168786632, 165564928, 162165544, 158661105, 154933372, 151096974, 147189751, 143463955, 139671070, 135757735, 132020171, 128538359, 124952005, 121275163, 117922127, 114487905, 111112549, 108024054, 105019516, 101897857, 98880147]
19757I8880147k869433k737363k751470k539609k345817k379301k335212k290490
19749G8631452k156536k134293k114854j874037j798217j900142j764031j660503
19741F3228839j735866j739965j539730j360572j333015j293097j277742j412723
19733E1536129j325713j420614j334183j131387j042584r53173j007273j288854
19725D2032348r22405q45249q24835r08419q85253q42967q29017r53366p98785
19716C4222052p19766o96798q25605m72793n44875o68586o68256o76829o78097
19707B8270447n58812o28008m68273o50824o10616n08784l28505m63695m17535
19698B3635395m72880l41765m50326m97610m44086m16216j86394k86982l99033
$$ y = [98880147, 96010714, 93273351, 90521881, 87982272, 85636455, 83257154, 80921942, 78631452, 76474916, 74340623, 72225769, 70351732, 68553515, 66653373, 64889342, 63228839, 61492973, 59753008, 58213278, 56852706, 55519691, 54226594, 52948852, 51536129, 50210416, 48789802, 47455619, 46324232, 45281648, 44328475, 43321202, 42032348, 41109943, 40264694, 39439859, 38531440, 37646187, 36803220, 35974203, 35020837, 34222052, 33502286, 32805488, 31979883, 31507090, 30962215, 30293629, 29625373, 28948544, 28270447, 27711635, 27083627, 26615354, 25964530, 25353914, 24845130, 24516625, 24052930, 23635395, 23162515, 22820750, 22370424, 21872814, 21428728, 21012512, 20826118, 20539136, 20140103]
19689B0140103l21260l51990l83717l34226m58166k95807m44287n00039k82706
19680A6767905j29319l26881j34625k83479k24261k44363m04018l04540l36383
19671A4380036k70596o9155j50752j86412j07976l26019m30069j45138k30695
19662A2463224j82816j12112K5850k04343j48133j95785k16520k24390j61765
19653A1043210k05117j22805k40327l12066j34914r626l9667k37917j0733q6692
19643I643346k34420l92012j86709o1858o3282r6521j14071j39084o3826j81392
19633H110171k65083k43692j11541N4616J34034N081k22410k79717j71134j31129
19623F879196j13694K8661J31277j93043k29099N0403q7402j21263o2906j6260
$$ y = [20140103, 19818843, 19466853, 19083136, 18748910, 18290744, 17994937, 17550650, 17050611, 16767905, 16638586, 16311705, 16177080, 15893601, 15669340, 15424977, 15020959, 14716419, 14380036, 14109440, 14040285, 13889533, 13703121, 13595145, 13269126, 12839057, 12693919, 12463224, 12280408, 12168296, 12194146, 11989803, 11841670, 11645885, 11429365, 11204975, 11043210, 10838093, 10715288, 10474961, 10162895, 10027981, 10018355, 9978688, 9740771, 9730038, 9643346, 9408926, 9016914, 8830205, 8768347, 8705065, 8608544, 8494473, 8355389, 8291563, 8110171, 7845088, 7601396, 7489855, 7544471, 7678505, 7683586, 7461176, 7181459, 7010325, 6879196, 6765502, 6794163, 6925440, 6732397, 6503298, 6553701, 6466299, 6345036, 6282130, 6265870]
19613F265870k6525j45357j76298j68340n6519p2492j28747j2815j04939m805
19603E369033j6522L8067m5842m793k8359j66281p3017R8101j06825k86831J11497
19592D888228K07833k5059n6901k07767l06798L0374J1598m3718r9252m8017J23361
19581D473882q3158k55589q5387J7219n4566j86417J77214K605K9190n0287j16086
19570C868620o1914K0601J8105j57815j33822o1492j38390q0338j06107J76396
19560C343844J8345q2633M516P5817q5561K428K9195M9985j02328j47109j02154
19549C004345K0219j3607O9099k0110j40966M9406o2363R1585O3219M8389j03076
19538C006140J0618j11378j70964J9911L5920j12066n5039j43358J46962J27073
$$ y = [6265870, 6239345, 6093988, 5917690, 5749350, 5692831, 5620339, 5491592, 5478777, 5373838, 5369033, 5352511, 5390578, 5344736, 5339943, 5311584, 5145303, 5072286, 5170387, 5063562, 4776731, 4888228, 5096061, 5071002, 5014101, 4806334, 4499536, 4529910, 4541508, 4497790, 4398538, 4350521, 4473882, 4390724, 4135135, 4049748, 4066967, 4012401, 3825984, 4003198, 4005803, 4034993, 3984706, 3868620, 3806706, 3827307, 3845412, 3687597, 3553775, 3492283, 3353893, 3273555, 3167448, 3343844, 3362189, 3279556, 3284072, 3359889, 3274328, 3276756, 3305951, 3355936, 3253608, 3106499, 3004345, 3024564, 3010957, 3080056, 3059946, 2918980, 2968386, 2906023, 2997608, 3060827, 3109216, 3006140, 3016758, 2905380, 2734416, 2754327, 2790247, 2678181, 2623142, 2479784, 2626746, 2753819]
19528B753819j66794r0177j04445J3353K01597J22856k1332l4882j8418P7397
19518B732974m3765j01385j27065j33512R3193L9766j04825k28197j16301O7033
19508B077916m6361p9426k636R5138r1787O1336O2252L7881p7945J61568j1237
19497B186699k0602k54773j32776J37681n4655q9042q671p368N0406m2288N0193
19486A814804Q8816p6686Q5348K31606k65669j34555K3602J64301l4228j56574
19476A740765k01170m1436R9385J55852J28165m9257M7942l0001j80279k17341
19466A452625P1200l8645j1040p387n3703k9187j99274J0571J63473N4404Q1549
19455A494586L9181j5396j83381o2762k4531L1871j60195K3994J20230r4074R121
$$ y = [2753819, 2587025, 2496848, 2392403, 2405756, 2607353, 2730209, 2708877, 2673995, 2655577, 2732974, 2689209, 2587824, 2460759, 2327247, 2420440, 2460206, 2355381, 2127184, 2010883, 2077916, 2031555, 1952129, 1949493, 2044631, 1952844, 2014180, 2076432, 2114313, 2036368, 2197936, 2186699, 2166097, 1911324, 1778548, 1916229, 1861574, 1772532, 1763861, 1756493, 1806899, 1764611, 1814804, 1903620, 1826934, 1912282, 2143888, 1878219, 1743664, 1767266, 1931567, 1897339, 1740765, 1539595, 1498159, 1597544, 1753396, 1881561, 1832304, 1880246, 1850245, 1669966, 1452625, 1523825, 1485180, 1474140, 1466753, 1413050, 1383863, 1184589, 1195160, 1358633, 1413037, 1494586, 1533767, 1518371, 1334990, 1272228, 1247697, 1279568, 1119373, 1143367, 1263597, 1169523, 1178644]
19444A178644o9300M4451Q0139q4556j10705K7468J91056Q7592O7603j02441N363
19433A315314j6071L6374n4378O1192k240o4368M124l0180r4567Q0768K6640j48518
19421A114090N6577Q1925N768n8507J37559j2897k38588o570o0491K8826P3125
19410A120817J5413j7587N821n2125J17956o3883o6493j01391K9727j8303P4127
19399A044079J2004o1511K2190m0153K9383J39434K38757p5334k6452J44557O0696
19388A487650k86955j65040J72265J48836j7164j44318j71039Q221q2805N255
19378I54906m4358R8755n3650K9781R128n6949M7647K18565O7890p5925j66599
19367A029191l4281j37703J15666q4258R2211R1895j2512j15588k9253R9200Q606
$$ y = [1178644, 1109344, 1153795, 1233934, 1149378, 1038673, 1066141, 1257197, 1344789, 1412392, 1309951, 1315314, 1299243, 1335617, 1281239, 1342431, 1340191, 1275823, 1279947, 1249767, 1155200, 1235968, 1262608, 1114090, 1170667, 1252592, 1258360, 1199853, 1337412, 1324515, 1085927, 1079357, 1018866, 1047692, 1120817, 1136230, 1118643, 1124464, 1072339, 1190295, 1126412, 1059919, 958528, 988255, 969952, 1044079, 1056083, 994572, 1016762, 976609, 1005992, 1145426, 1384183, 1308849, 1282397, 1426954, 1487650, 1200695, 1035655, 1207920, 1356756, 1339592, 1195274, 1024235, 1032456, 949651, 954906, 910548, 1009303, 955653, 985434, 994562, 937613, 985260, 1203825, 1271715, 1195790, 1029191, 994910, 857207, 972873, 888615, 980826, 1072721, 1060209, 944621, 915368, 1014568, 1023174]
19356A023174R1922J4535L6921K5992K9175p6206j49648K41571J56346p0824j88674
19345A134284p9873j7836L2372J5615J53544J28434k9152o6907P0818q8754L0952
19334A283497J00205l6075j61323J2268L9981j19084j47903k0247R689L6319J47547
19323A144874L6723o6729j9997K5626J47623O077j66694k3506j6468R2020M1381
19312A200930j96871k14207q4829J27656K7652j37736n6132n6779N0144j11329
19302E48499l5733K39059J37777k1878r6185m0960q9058n2693Q0414l5763m4009
19291E89470J10182J25046K69788j6360j8442K0256j73958q6597L6597Q261j09424
19280G54819j33132R1602O3241k85672m9141O1986J2256N0201o4423J71513J73992
$$ y = [1023174, 1115096, 1129631, 1166552, 1192544, 1221719, 1145513, 995865, 1237436, 1393782, 1322958, 1134284, 1054411, 1036575, 1068947, 1084562, 1238106, 1366540, 1337388, 1270481, 1341299, 1252545, 1283497, 1383702, 1347627, 1186304, 1198572, 1238553, 1119469, 971566, 951319, 961008, 997327, 1144874, 1181597, 1114868, 1094871, 1120497, 1268120, 1274197, 1107503, 1083997, 1067529, 1159549, 1200930, 1004059, 789852, 705023, 832679, 860331, 722595, 666463, 609684, 659828, 548499, 512766, 751825, 889602, 867724, 771539, 730579, 641521, 588828, 669242, 633479, 589470, 699652, 824698, 1094486, 1078126, 1059684, 1079940, 905982, 819385, 855982, 864243, 754819, 621687, 713289, 776530, 490858, 441717, 503703, 515959, 566160, 501737, 673250, 847242]
19269H47242J13939O6724j1782p6470m2129j02439n8609J03094l2241j22424k2575
19258F62330O7705K82715R9479j53642j32357l9488j17768l6456J36942P7576
19248H47036o0671o6779K0429M7370K4330r7602j3123M6198j2614q3612J37369
19237G88331J20491M1486j71704J1421J06967j60955l9925m4622r2461L49465
19227I08494O4567j90161k27024j10912Q1465R2798J88436j0967P2625l5780r9859
19216G33682q7809j22656Q9403J08368P1934p3849r3524R3934K0986L9727j43138
19205F37058k00355L0019O3220l3075p8051j39129R3788K04273M8969q7644J74998
19194G14071J32251n3991j86447j7162R601r5604Q6135L6323J01706K23107K7768
$$ y = [847242, 961181, 1027905, 1016123, 939653, 897524, 795085, 736476, 839570, 807329, 684905, 662330, 730035, 1012750, 1112229, 958587, 826230, 786742, 668974, 632518, 769460, 847036, 786365, 719586, 740015, 787385, 811715, 714113, 700990, 747188, 734574, 650962, 788331, 908822, 950308, 778604, 790025, 896992, 736037, 696112, 651490, 559029, 908494, 973061, 782900, 555876, 444964, 526429, 619227, 807663, 796696, 869321, 833541, 733682, 645873, 523217, 612620, 720988, 792922, 719073, 625549, 719483, 740469, 780196, 637058, 436703, 466722, 529942, 496867, 418816, 279687, 373475, 577748, 626717, 539073, 714071, 846322, 792331, 605884, 588722, 598323, 502719, 588854, 625177, 726883, 949990, 977758]
19183I77758K10083l690K8876p9941j25585j78624j20711N0532l3219P9588m8185
19172G56882k32123K842J17288J59662J40414q2953j09591j41561o9118O2848
19162F04590J22253Q2466J12423J18248l1886j35241J6470K23853K9471P1340
19152A213987l7854M6178J88937R0714n548J05002J2748M948K8853j0705l3954
19141A603306M6787J98442L70171K49369N74717N38683L26477M77023P30996Q31495
19131E947466J081351J183542J071070R07208R73854J146109P85665O50911P32635
19122A4479811N49193N49440L58673P8185m1519k25260l74969l50897n16368o86632
19112A3819657n65512m84118m94553l85096l47648n81575q67909r60692j297087
$$ y = [977758, 1187841, 1184151, 1213027, 1133086, 1007501, 828877, 708166, 758698, 725479, 805067, 756882, 524759, 527601, 644889, 804551, 944965, 862012, 752421, 610860, 541742, 604590, 726843, 809309, 921732, 1039980, 1008094, 872853, 889323, 1113176, 1142647, 1213987, 1176133, 1222311, 1411248, 1501962, 1496414, 1601416, 1614164, 1619112, 1647965, 1637260, 1603306, 1650093, 1848535, 2218706, 2468075, 3042792, 3581475, 3907952, 4384975, 5115971, 5947466, 7028817, 8212359, 9283429, 10190637, 11164491, 12310600, 13096265, 13747176, 14479811, 15029004, 15578444, 15937117, 16015302, 15973783, 15748523, 15373554, 15022657, 14506289, 13819657, 13254145, 12770027, 12275474, 11890378, 11542730, 10961155, 10093246, 9132554, 7835467]
19103G835467q79048m62091k88481m01875m62789j62590j33998k5035J33104j55706
19093D996958L7406L86621K55400L67629O27613R78547J004829J009996J209586
19084A0874585J322084J329264J219719J405899J060455P32591M61749M91443
19076A8897789L54993J51794r7568l86578n96335r55424q58782q38391o56229
19067A5015269n88797p37181o98792n55057q77759j220457j047435j174051j147989
19058F967751p98529n92404m61479l37826l31471k62991n8832o2386j42087j82905
19048C736841k20659p2782j58599j58961q9601j12703j71264Q0344J0122k39781
19038B602957l01026j28424N1023L6594k1168j11684O283J23710k5004M9330l2278
$$ y = [7835467, 6956419, 6494328, 6205847, 5803972, 5341183, 5178593, 5044595, 5019560, 5152664, 4996958, 5034364, 5420985, 5676385, 6044014, 6671627, 7650174, 8655003, 9664999, 10874585, 12196669, 13525933, 14745652, 16151551, 17212006, 17944597, 18406346, 18897789, 19252782, 19404576, 19307008, 18920430, 18324095, 17368671, 16509889, 15671498, 15015269, 14426472, 13689291, 12990499, 12435442, 11557683, 10337226, 9289791, 8115740, 6967751, 6169222, 5576818, 5115339, 4777513, 4446042, 4183051, 4124219, 4061833, 3919746, 3736841, 3516182, 3443400, 3284801, 3125840, 3036239, 2923536, 2752272, 2832616, 2842738, 2602957, 2301931, 2173507, 2224530, 2261124, 2239956, 2128272, 2134555, 2258265, 2233261, 2282591, 2250313]
19027B250313q2605Q430o9718m9658q0274j26380l1042R2171j28847j79188k2921
19016A580281o3557r5377p9941n3794L40955J36803p1509p6867j04934l24617
19006A187443j33589K62728N1856k5810L6576M0803j22817o9501K8962j37824
18996A118827m8603J6907p7323k1289M7269J22065K5414j60404M1646o500M8243
18985A106252J98190j75563j7303J35976M6900O6836j33336j0257n5492P5435
18975A237638L2810J17749j2615j27896j33236j44063L7201p3887R0808J48957
18965A173466k5910m5951j50227p5130j5118J87782Q8705j38185j58711J05186
18955I45907j97470n7361L06155J24871l4439j20635o7855j35390J62775J04999
$$ y = [2250313, 2167708, 2176138, 2106420, 2056762, 1976488, 1850108, 1819066, 1911237, 1782390, 1603202, 1580281, 1516724, 1421347, 1341406, 1287612, 1628567, 1765370, 1693861, 1616994, 1512060, 1187443, 1053854, 1316582, 1368438, 1342628, 1379204, 1420007, 1297190, 1227689, 1256651, 1118827, 1070224, 1087131, 1009808, 988519, 1035788, 1157853, 1183267, 1022863, 1064509, 1058009, 1106252, 1304442, 1128879, 1111576, 1247552, 1294452, 1361288, 1227952, 1217695, 1162203, 1237638, 1270448, 1388197, 1375582, 1247686, 1114450, 970387, 1007588, 933701, 1024509, 1173466, 1147556, 1101605, 951378, 876248, 861130, 1048912, 1137617, 999432, 840721, 945907, 748437, 691076, 997231, 1122102, 1087663, 967028, 899173, 763783, 926558, 1031557]
18945A031557k7917K7477K238J74111L6462j1724N2322N9609q8149J30721K2583
18934A409290q8229j24602n324l9798q6370j24087P9345R1773j2789j19260N6761
18923A036710J18579l3388j02474j06873o6107j22156k4603K2939j19426j17469
18913D85732J39825j5025M1282r152N6784l9263n6944j9124j1588K1883P1624
18902F66034O4110N9068L8341j34062o3562J20780J56219o9763K8741J82565J02983
18891A151454p972j08718p76R8812J08643J68367J02227L7739j95256j31427j11734
18880A111359Q8906L8499j26984k23615j9435K02501J5535l40631l02129J0856
18870D54862J23353K1799J49794J62699j9043j22916j57536J4357o574j70875
$$ y = [1031557, 1003640, 1031117, 1033355, 1207466, 1243928, 1232204, 1284526, 1344135, 1255986, 1386707, 1409290, 1321061, 1196459, 1191135, 1151337, 1064967, 940880, 1020225, 1111998, 1099209, 979949, 1036710, 1155289, 1121901, 1019427, 912554, 846447, 724291, 699688, 722627, 603201, 485732, 625557, 610532, 651814, 642662, 699446, 660183, 603239, 584115, 572527, 594410, 666034, 730144, 789212, 827553, 693491, 629929, 750709, 906928, 837165, 865906, 1048471, 1151454, 1143482, 1034764, 1033988, 1132800, 1241443, 1409810, 1512037, 1549776, 1354520, 1223093, 1111359, 1200265, 1238764, 1111780, 888165, 868730, 1071231, 1086766, 746135, 444006, 454862, 578215, 600014, 749808, 912507, 893464, 770548, 613012, 627369, 620795, 449920]
18860D49920j33987J0948J49989R6736N4147j42200l4572J56793P7428N0616J48473
18849H84291P9960M8668K03069R2778q5395k3404J23698J92583p0688K4938O6875
18838A537373n7442k24406n4254J58698q1733n0903p597O3630J97603k0525l5636
18827A424808j457O7577J41833m6132j08344J80247J99342K71995J44848K39525
18817B514242j37726M3950J57138P5241o6022n921K6489N3614J66504L81176J99522
18806C408207J96718j77226k58655l77270k45711j48253j01822Q77j39634j41249
18796B015982j98836R3632m5198n087m8389k99277j45309j33409o4807k9872Q3637
18785A223067p0557n488l2083l8764M0558K13980J63035m6107K28190J61079L28360
$$ y = [449920, 315933, 326881, 476870, 573606, 627753, 485553, 450981, 607774, 685202, 735818, 884291, 964251, 1012919, 1215988, 1308766, 1223371, 1199967, 1323665, 1516248, 1445560, 1470498, 1537373, 1479931, 1255525, 1201271, 1359969, 1278236, 1227333, 1219736, 1283366, 1480969, 1460444, 1424808, 1423351, 1490928, 1632761, 1586629, 1478285, 1658532, 1857874, 2129869, 2274717, 2514242, 2376516, 2420466, 2577604, 2652845, 2586823, 2580902, 2607391, 2661005, 2827509, 3208685, 3408207, 3604925, 3427699, 3169044, 2791774, 2546063, 2397810, 2295988, 2296865, 2157231, 2015982, 1817146, 1910778, 1865580, 1860493, 1812104, 1512827, 1367518, 1234109, 1169302, 1139430, 1223067, 1152510, 1147022, 1114939, 1076175, 1116733, 1330713, 1493748, 1447641, 1675831, 1836910, 2165270]
18774B165270K93156K20080M16195L15861L0041m0436R740K2638J3381m0588j09615
18763C295723J15256J52250j6864M7888J80334m8399j28344m6731j32223k00986
18753C217904k8465j72031l39691k76538j14727j82443o1936k53199j28896k10991
18743A448987j33592r4586r1300q0487j2924k7265r5723O7343J42114J31457p5099
18732A178925j44305Q9109Q5597R5015j34458m153j9697j58278J22281O6490l7311
18721A139215M4661J29736K64018K42478P7002k9619O1368R5226J70377L2969
18711B227431o1947j33536K8421J59888K29390l0519m9002K2920J18308J27826
18701B639180k33931l81966k35455l22411k27092N427j03149q0073R1985R0688
$$ y = [2165270, 2458426, 2678506, 3094701, 3410562, 3440603, 3400167, 3409907, 3432545, 3445926, 3405338, 3295723, 3410979, 3563229, 3546365, 3594253, 3774587, 3726188, 3597844, 3551113, 3418890, 3217904, 3189439, 3017408, 2677717, 2401179, 2286452, 2104009, 2042073, 1788874, 1659978, 1448987, 1315395, 1220809, 1129509, 1049022, 1036098, 1008833, 913110, 980453, 1122567, 1254024, 1178925, 1034620, 1123729, 1209326, 1304341, 1169883, 1165730, 1146033, 987755, 1110036, 1176526, 1139215, 1183876, 1313612, 1577630, 1820108, 1897110, 1867491, 1928859, 2024085, 2194462, 2227431, 2165484, 2031948, 2060369, 2220257, 2449647, 2419128, 2370126, 2393046, 2511354, 2639180, 2405249, 2023283, 1787828, 1465417, 1238325, 1243752, 1140603, 1060530, 1152515, 1243203]
18691A243203N5723Q6174j25333k42460j76266J12367n8529j29692m6411j08362
18681F10414l3206K10650P8725J3818N0886J26169L14642O5225k67875j96413
18671I73035p8343J26642J06190J52160K0933j02478j3361p7462N4626J87445
18661A349387M7240O819J30186P6534q7474M1239K2032L0479r1867N374n8157
18650A471792j41892p9282O2634J23868N8158p2550j40022k05726l1571q5264
18640I60145j32006K65216Q3680l7731N772j27604r2332Q3913l8945p4571L8342
18629I33879R4399K9051n1082O7009J9986j4368Q1182N5183k898K05027J11953
18618A529321J25505j00291k60694j07191j6144R3337M782o7353j03146J24246
$$ y = [1243203, 1298926, 1385100, 1259767, 1017307, 841041, 953408, 894879, 765187, 718776, 610414, 577208, 787858, 866583, 880401, 931287, 1057456, 1372098, 1437323, 1169448, 973035, 894692, 1021334, 1127524, 1279684, 1300617, 1198139, 1184778, 1107316, 1161942, 1349387, 1396627, 1403446, 1533632, 1610166, 1522692, 1563931, 1585963, 1616442, 1524575, 1529949, 1471792, 1329900, 1250618, 1313252, 1437120, 1495278, 1422728, 1282706, 1076980, 1045409, 960145, 828139, 1093355, 1177035, 1139304, 1145076, 1017472, 925140, 1009053, 970108, 895537, 933879, 1028278, 1057329, 1006247, 1073256, 1093242, 1078874, 1160056, 1215239, 1212341, 1417368, 1529321, 1654826, 1554535, 1293841, 1186650, 1170506, 1263843, 1268625, 1201272, 1098126, 1222372]
18608A222372o459k5192K45443j13901k45948l3714j23921j45417k08991j3051
18598E51221j19081L3136L95149J26215j58223q0066o4667m1483M95R4802J0335
18587G47833J47327J45053r4365j58111j7748K3242K32N5363k8746N0661m2606
18576H28135k4076J14937o4274K5509K4184J1346j20710k8124N5910l9877L1315
18565H14275J21866q1090k17897j59511P5109P6309K24751l9838o4035N1059n5716
18554G45282j21972J03921m8468j20061O7208K1621J69874q639O3893J69531l2247
18543A009943L1801J09152k5778L2284J05759J76728O0707J7230K212r7474j27475
18532A295089j09786k7359J19462M2907P1977J33582J45030m6131j11877j13728
$$ y = [1222372, 1215913, 1190721, 1436164, 1322263, 1076315, 1042601, 918680, 773263, 564272, 551221, 432140, 465276, 860425, 986640, 828417, 748351, 683684, 642201, 642696, 737498, 747833, 895160, 1040213, 945848, 787737, 769989, 793231, 793463, 848826, 820080, 870741, 828135, 804059, 918996, 854722, 880231, 904415, 915761, 795051, 766927, 822837, 782960, 814275, 936141, 855051, 637154, 477643, 552752, 629061, 853812, 813974, 749939, 800998, 745282, 623310, 727231, 678763, 558702, 625910, 647531, 817405, 808766, 872659, 1042190, 1009943, 1041744, 1150896, 1125118, 1157402, 1263161, 1439889, 1500596, 1517826, 1520038, 1422564, 1295089, 1185303, 1157944, 1277406, 1320313, 1392290, 1525872, 1670902, 1624771, 1512894, 1399166]
18522A399166m856k835L1486L3728p1991j26643P9843J11708o0351J2500q8991
18511A312764Q2078J31348j29055q6767o2687k54R2114M9739K3845J51001q462
18500A555664j04043n7066M5494K2563L1261J96164P2858L6103R2836m7260j0202
18489A834372J12638N1825J33768m0089j09368P0340n6863M1421M3613J8637l5402
18478B064892R1015J05036J4905j3355K8199Q6770O7019J02365q1912k10229k02579
18467B052126n9024n8210j6630J09018O5709q3846m2706J0783P1680j13196j2780
18456A922924k4876J3886k949M095O5872m5443J49589j06759K1360J72122J34777
18445B304598l8329J61238J18316J05310J49970j0649J42354J25708J3337J10295
$$ y = [1399166, 1394310, 1391475, 1422961, 1456689, 1384698, 1258055, 1337898, 1449606, 1389255, 1401755, 1312764, 1394842, 1526190, 1397135, 1310368, 1247681, 1247427, 1339541, 1389280, 1413125, 1564126, 1555664, 1451621, 1394555, 1440049, 1462612, 1493873, 1690037, 1762895, 1798998, 1891834, 1844574, 1834372, 1947010, 1998835, 2132603, 2092514, 1983146, 2053486, 1996623, 2038044, 2081657, 2100294, 2064892, 2155907, 2260943, 2275848, 2262493, 2290692, 2377462, 2444481, 2546846, 2464934, 2254705, 2052126, 1993102, 1934892, 1918262, 2027280, 2092989, 2009143, 1966437, 1977220, 2048900, 1935704, 1922924, 1898048, 1911934, 1908985, 1913080, 1978952, 1933509, 2083098, 1976339, 1997699, 2169821, 2304598, 2266269, 2427507, 2545823, 2651133, 2801103, 2790454, 2932808, 3058516, 3071853, 3182148]
18435C182148K40030J34994J15930J11212l10127p3179Q2109J75487J52905L3877
18425C845386P4936R8567k206M4696j5981K10658K67594P1746K27950K44713J20311
18414E188370J44873K65453K06676L93938M13388L80757L87754L90151M55601
18405H226961P59389P96623R18112R75773J273570J730293K366297L533245N083607
18396B5663870O797675Q009762P884663O656689N885460O265264Q092060R280331
18388H4535774P556614O595400P863687O550324M276783M501960N946133N269052
18380A33095727l811450j5568301j4506898o471009j310726q63777j091147k95745
18372H9176674O45034r81051q278352j4184726j2287620p874957m731955k880635
$$ y = [3182148, 3422178, 3557172, 3673102, 3784314, 3474187, 3401008, 3483117, 3658604, 3811509, 3845386, 3920322, 4018889, 4016683, 4061379, 4045398, 4256056, 4523650, 4595396, 4823346, 5068059, 5188370, 5333243, 5598696, 5805372, 6199310, 6612698, 6993455, 7381209, 7771360, 8226961, 8986350, 9782973, 10701085, 11676858, 12950428, 14680721, 17047018, 20580263, 25663870, 32461545, 40471307, 48355970, 55012659, 60898119, 67163383, 75255443, 84535774, 92092388, 98687788, 106551475, 113101799, 117378582, 121880542, 127826675, 133095727, 129284277, 113715976, 99209078, 92738069, 91427343, 90563566, 89472419, 89176674, 89821708, 88840657, 80562305, 66377579, 54089959, 46215002, 41483047, 38602412]
18364C8602412k102045j634214j095892m30574j69619N6185M26242J064550J946698
18355C6663743L129332M774032P111384J0105531J2422875J3022814J2343928
18348I9573639J3065385J5232251J6001124J1441669J721129l902448o297O180394
18340A59306846N327089k315711n706408j647853M984400J0598145J0564562R90583
18332A82101653r856190j1308675p480540m173791o886215j7111706k2870877
18325A02413659j8750023j2394918q042240n384156m199875k952244j863447j189430
18317D7637326p49656p63293o01976l94542j09326l3701j57476N6790P99918J459937
18307D7144001J987666K667906L845750N112784N359569M379636K027995R74109
$$ y = [38602412, 36500367, 34866153, 33770261, 33339687, 33170068, 33226253, 33652495, 34717045, 36663743, 39793075, 44567107, 51678491, 61784022, 74206897, 87229711, 99573639, 112639024, 127871275, 143872399, 155314068, 157035197, 153132749, 153126452, 159306846, 164633935, 162318224, 156611816, 154963963, 159948363, 170546508, 181111070, 182101653, 172245463, 160936788, 153456248, 149282457, 142396242, 125284536, 102413659, 83663636, 71268718, 63226478, 57842322, 53642447, 50690203, 48826756, 47637326, 46887670, 46124377, 45522401, 45127859, 45018533, 44984832, 44827356, 44884146, 45684064, 47144001, 49131667, 51799573, 55645323, 60758107, 66117676, 70497312, 72525307, 73499416]
18299G3499416J306243J036765j680448n356096n015217k906575j542327q05654
18291E8536107j00111R44161K327727M220135O897664J1018563J7307153K6287002
18283A27438401L5579505L7618928K8465410J8933832J8339708K2451510K4821611
18276C13648905P885930j6229327q069421Q938382Q439648K011670L706911R213235
18268C29545933J1462691j4481889n8127603n5965328l1231423j2798680M54853
18261A68858554J2332745K2528047K6073318K0877248J6112394J9967831K8775472
18254C15525609L3926874J4747510j5031732j1014067J0826618K3833520J7226941
18247C90041273q336321k3794974j4644375l772477j6205834m5339402m3383003
$$ y = [73499416, 74805659, 75842424, 74161976, 68805880, 63790663, 60884088, 59341761, 58536107, 58435996, 59380157, 61707884, 65928019, 72825683, 83844246, 101151399, 127438401, 163017906, 200636834, 229102244, 248036076, 266375784, 288827294, 313648905, 321534835, 305305508, 297236087, 306174469, 314614117, 316625787, 320332698, 329545933, 341008624, 326526735, 268399132, 212433804, 181202381, 168403701, 168858554, 181191299, 203719346, 229792664, 250669912, 266782306, 286750137, 315525609, 349452483, 364199993, 349168261, 338154194, 348980812, 372814332, 390041273, 381704952, 357909978, 343265603, 339493126, 323287292, 277947890, 234564887]
18240B34564887k0667030j948807O468466M160398l46528r5939L148661L952000
18232B29236108q742150l1611368l4231364k2684640j3478285j0233287r225570
18225I9029444o944895m338922k693328j874680o58259J087352K794211M214627
18217I0615550L206237Q61954j23892J88772Q35307k4538n771759r992559q174444
18208G1620628m812398k805556j410421o04074N40160K418929M591999O510939
18200G6050206O191344M584688M105948N350620P609516R558973P900254R611148
18192A30962697J5428211J4834274R613521Q543621J0142096R899326J30900k3345115
18184A76209531l2304230k2755292j6383123j4750590j0328690n395750j781186
$$ y = [234564887, 213897857, 211949050, 218417516, 222577914, 222231386, 222135447, 225284108, 229236108, 220493958, 188882590, 154651226, 131966586, 118488301, 108255014, 99029444, 92084549, 87745627, 85052299, 83177619, 82519360, 83606712, 86400923, 90615550, 93821787, 94683741, 94559849, 94748621, 95583928, 95559390, 89787631, 79795072, 71620628, 66808230, 64002674, 62592253, 61988179, 62528339, 64947268, 69539267, 76050206, 82241550, 86826238, 90932186, 96282806, 103892322, 113451295, 121351549, 130962697, 146390908, 161225182, 170838703, 179382324, 189524420, 199423746, 199554646, 176209531, 143905301, 121150009, 104766886, 90016296, 79687606, 74291856, 72510670]
18177G2510670k68791k36495K66515J484406L010349M170219L519983M995802
18169H9452658Q656279Q719742M473047K055415K676381M302524L907129p193050
18161A17050125j4863699p519877j14835J707142O91343J027073K164382L066354
18153A03208008n62910q560740q635398j457272O269823J0253465Q499452L960522
18145A12974950K724750L854174N360680L29489j5109697k0199514j3064831n662462
18137G1207539o30146K119465K254325P45404Q42124K551285N008198N702400
18129H9800594J188114j335899j516227j659071j93338J845365K982972l985010
18121H7127500j5830430j4481656q049249m488012k380956l29663J588683L817498
$$ y = [72510670, 72241879, 72005384, 72271899, 73756305, 76766654, 80936873, 84456856, 89452658, 98108937, 106828679, 111301726, 113357141, 116033522, 120336046, 124243175, 117050125, 102186426, 94666549, 94551714, 96258856, 96950199, 97977272, 100141654, 103208008, 102645098, 94084358, 85448960, 83991688, 90261511, 100514976, 109014428, 112974950, 115699700, 119553874, 124914554, 125244043, 110134346, 89934832, 76870001, 71207539, 70577393, 72696858, 74951183, 75696587, 76538711, 79089996, 84098194, 89800594, 90988708, 89652809, 88136582, 86477511, 86284173, 88129538, 91112510, 87127500, 71297070, 56815414, 48766165, 44278153, 41897197, 41567534, 43156217, 46973715]
18113D6973715N342823N062743L146045J524013J675073K051863J168322n104364
18105F1840233j0448886q510485n808199l993796k455070j507126r10368m76993
18097B7729310L13367J233254K604761M302465N082025L384584J251385Q38973
18089D6740124J529179J981420j224404q103053r220323n776680l421901k401941
18081B0102421j524747r69652p23533q64653n33813n02431m63963o60916n06870
18072A3351843m60417m83202m89639m20200j43148j65215l20345n6006K19404
18063A1033075L25016O3494j42314l423p337q9603m22182r63993p49091n42889
18053H500753m29271l25648l95769k68313j85457j69674j49841m7463J6795k93955
$$ y = [46973715, 52316538, 57379281, 60525326, 62049339, 63724412, 65776275, 66944597, 61840233, 51391347, 42880862, 37072663, 33078867, 30623797, 29116671, 28206303, 27729310, 28042677, 29275931, 31880692, 36183157, 41265182, 44649766, 45901151, 46740124, 48269303, 50250723, 49026319, 40923266, 31702943, 25926263, 22504362, 20102421, 18577674, 17608022, 16884489, 16019836, 15486023, 14983592, 14519629, 13858713, 13351843, 12891426, 12408224, 11918585, 11498385, 11355237, 11190022, 10869677, 10813671, 11033075, 11358091, 11421585, 11279271, 11275848, 11268511, 11178908, 10756726, 9792733, 9043642, 8500753, 8071482, 7745834, 7350065, 7081752, 6896295, 6726621, 6576780, 6529317, 6546112, 6252157]
18043F252157j81467k14631j18185k14141j00602k45746l28369j78325r1512R1951
18033D671130r7015j69857k09187j37304m3219J07808L3150p1790M4750j84176
18023C944290j25680j09103j42996j31327k7670J1535j56978K5720N329j90419
18013C102701k53894j88149K0163J1657p230n0650k67267j36303R8787K37165
18003B566980P7187K4957r4415J7179j43555k01290j35450M48K09189o4850K3898
17992B280278j25472l699o6611M9368n7455j19848N7988m8265j04920j49527J4674
17981A726511l6527n2023n7306n8170l3814n8722j37108j03323o1588P0326L4573
17970A232829q8749k1120K3579J6488j16521j3728P6441j30258j33725J04576
$$ y = [6252157, 6070690, 5856059, 5737874, 5523733, 5423131, 5177385, 4849016, 4670691, 4579179, 4671130, 4574115, 4404258, 4195071, 4057767, 4014548, 4122356, 4155506, 4083716, 4128466, 3944290, 3818610, 3709507, 3566511, 3435184, 3407514, 3419049, 3262071, 3287791, 3293120, 3102701, 2848807, 2660658, 2680821, 2692478, 2685248, 2634598, 2367331, 2231028, 2329815, 2566980, 2644167, 2669124, 2574709, 2591888, 2448333, 2247043, 2111593, 2112041, 2321230, 2256380, 2280278, 2154806, 2151107, 2084496, 2133864, 2076409, 1956561, 2014549, 1966284, 1861364, 1711837, 1726511, 1689984, 1637961, 1580655, 1522485, 1488671, 1429949, 1292841, 1189518, 1127930, 1198256, 1232829, 1144080, 1122960, 1146539, 1163027, 1046506, 1032778, 1109219, 978961, 845236, 949812]
17960I49812p786P678N4526Q51K8600P1009l9254j22481j79033M3966M5000M168
17948H57056Q0740L0315N3197J24849l1760k2208j62106j45303p4109j21771n0019
17937E38881J07038K20201j0543k4531o2387j309J29260J6136p1637o5816L6256
17926H11549J35516o1092J09633r1804j98904l4108m1872k8654L9523O2312j6890
17915F85209M7288K6758M5253j5513J16762j21775k61071O6599m5334J563L1654
17904E77393N606N4804L2555k0056j38287J47826K2861L5988j85358j38045O8074
17893D63361k8856p8518L713K33666L8950J05850k5603j26669J57561K20039J33160
17882A096654J94382l5354n9193N5836j61885o4747Q3467L8481L5877J09321k8560
$$ y = [949812, 942026, 949704, 1004230, 1005081, 1033681, 1104690, 1065436, 942955, 763922, 807888, 852888, 857056, 937796, 968111, 1021308, 1146157, 1114397, 1092189, 930083, 784780, 710671, 588900, 538881, 645919, 866120, 855577, 831046, 768659, 767350, 896610, 912746, 841109, 775293, 811549, 947065, 885973, 995606, 903802, 704898, 670790, 628918, 600264, 639787, 702099, 685209, 732497, 759255, 804508, 788995, 905757, 783982, 522911, 589510, 544176, 545739, 577393, 582999, 637803, 670358, 650302, 512015, 659841, 682702, 718690, 533332, 395287, 463361, 434505, 355987, 359700, 593366, 632316, 738166, 712563, 585894, 743455, 963494, 1096654, 1291036, 1255682, 1196489, 1252325, 1090440, 1025693, 1109160, 1147641, 1183518, 1292839, 1264279]
17871A264279n3609J32284j3926o9054L5866j20881J9325J5890j23933j19613
17861I66628j55273R6848j01086j02251O0880n1121J08380n1724j80394j10788
17851D80099K79k056Q2313j69504R9388O8992l7218J53965M4702O3021O9370k7976
17839H25375j02301l914j41656L3469J84865n1527N7139J79500J50506n3027k3966
17828A054463K216k3783j57434q6804j4480P2503J76337J05628j08288l8510O8483
17817A050331R730j69484j23322J8950j14280j03745k00498j59190J13819R701
17807C32012j25283N4203O8101l0064O355P2484j11778K997J21817r7314k08901
17796H4629o4393P4652J36316o1999q5528J58116J60383K52035J44787j6579K4356
$$ y = [1264279, 1210670, 1342954, 1329028, 1259974, 1295840, 1174959, 1194284, 1210174, 1086241, 966628, 811355, 908203, 807117, 704866, 765746, 714625, 823005, 771281, 590887, 480099, 480378, 478322, 560635, 391131, 490519, 559511, 522293, 676258, 720960, 783981, 853351, 825375, 723074, 719160, 577504, 610973, 795838, 744311, 801450, 980950, 1131456, 1078429, 1054463, 1056679, 1032896, 875462, 788658, 774178, 846681, 1023018, 1128646, 1020358, 981848, 1050331, 1060061, 890577, 767255, 786205, 671925, 568180, 367682, 208492, 322311, 332012, 206729, 260932, 329033, 298969, 305324, 377808, 266030, 269027, 390844, 293530, 84629, 20236, 94888, 231204, 169205, 83677, 241793, 402176, 654211, 798998, 782419, 806775]
17785H06775J59606N7827N4437k1241o7643N8191Q8421j05037r8084R6941K35877
17774A266070K53139j53482j16739L6089K94568J20473m8747j26791j60301j1193
17764A353086O3733O2529l4738o0652n5912j77123k17392N3987l130k22486j59628
17753F02274J38022j1941L9479n1885j00221p0696L5060p5343J92402J56482O1321
17742I14954O8998P0457P8206Q5591m3775k80401O4349J43397p0133p7705J16577
17731A070515P0220O7060J46262J0398n8111j13903N9669R6728L7071J45361O1508
17720A592778K7488j27536J45325J11685j09170j58214j81461j08947j68445k1990
17710A001513j17059o1913p9280j6211J10077p6085k6935K1296j98545J4725n5232
$$ y = [806775, 966381, 1024208, 1078645, 1057404, 989761, 1047952, 1136373, 1031336, 933252, 1030193, 1266070, 1519209, 1365727, 1248988, 1285077, 1579645, 1700118, 1651371, 1524580, 1364279, 1353086, 1416819, 1479348, 1444610, 1383958, 1328046, 1150923, 933531, 987518, 984388, 761902, 602274, 740296, 728355, 767834, 715949, 615728, 545032, 580092, 504749, 697151, 853633, 914954, 983952, 1054409, 1132615, 1218206, 1174431, 894030, 958379, 1101776, 1031643, 953938, 1070515, 1140735, 1207795, 1354057, 1364455, 1306344, 1192441, 1252110, 1348838, 1385909, 1531270, 1592778, 1620266, 1492730, 1638055, 1749740, 1640570, 1482356, 1300895, 1191948, 1023503, 1001513, 884454, 822541, 743261, 727050, 837127, 761042, 734107, 755403, 556858, 571583, 516351]
17699E16351J41730p3587j44282l7789J352M4888K09877K09343p464j48818j5794
17688F95807J04232J49319R335q2816M5877j12205j11406j8707M1897J5836r4158
17677F43011N8637j17495o6640P3172P4202o9753m0244N7358Q3062l7990m8366
17666F08954j42116j06621J15231N0640m5520O5559J25525J65555J79306M6490
17656A063003r7107k02755Q7825p2938j15168K137p4866j2774K3613o4400j16226
17645D20344m6378m2902o1611M1080J01510J48719p1982m053r0846J36340m1250
17634D88971K0410Q4141k3368l0165j44029m9587N0819l1444Q448j71822m9598
17623A52776q8633j39984R8712K76425M4967l6492N7108L4986r1549l369M1517
$$ y = [516351, 658081, 584494, 440212, 402423, 403775, 448663, 658540, 867883, 860419, 711601, 695807, 800039, 949358, 958693, 875877, 921754, 809549, 698143, 679436, 721333, 737169, 643011, 701648, 584153, 517513, 590685, 664887, 595134, 554890, 612248, 695310, 657320, 608954, 466838, 360217, 475448, 526088, 480568, 546127, 671652, 837207, 1016513, 1063003, 965896, 763141, 850966, 778028, 662860, 664997, 590131, 577357, 600970, 536570, 420344, 373966, 331064, 269453, 310533, 412043, 560762, 488780, 484727, 393881, 530221, 488971, 509381, 593522, 570154, 539989, 395960, 346373, 397192, 365748, 374196, 202374, 152776, 64143, -75841, 22871, 299296, 344263, 307771, 364879, 399865, 308316, 304947, 346464]
17612C46464Q6687J09994J52281J61386o1702j39121n8230J9677j00543j38452
17602C78441q8825n1892k3010j5174P7448N7767k7666l1047l3052r6256j14930
17591C1804l9948Q2017Q3186K06740O7700J27491J57330l6200l50041k03539J09775
17580B36315J39559J5761p3363j91219l5926j10967j45310J30764Q8651O8556
17570A22821j11704r1574J1002K4105o7709J60417P4051M986j20100n7872J77717
17559A26140Q7373p2032J26374K1990l22706j41285K33154j1316j39642k9278
17549a21228O2495k6929k8406K9887k7849K58628K26232j9632M0144J00600k2456
17538D71486k20964k25046j12189j02449P4329M5449l8928J97728K84416p4110
$$ y = [346464, 433151, 543145, 695426, 856812, 795110, 655989, 597759, 617436, 516893, 378441, 289616, 237724, 214714, 199540, 276988, 334755, 307089, 276042, 242990, 146734, 31804, -8144, 73873, 157059, 363799, 431499, 558990, 716320, 680120, 330079, 126540, 236315, 375874, 391635, 318272, 127053, 91127, -19840, -165150, -34386, 54265, 122821, 11117, -80457, -69455, -45350, -113059, 47358, 121409, 126395, 6295, -51577, 126140, 213513, 141481, 267855, 289845, -32861, -174146, 59008, 47692, -91950, -121228, -58733, -85662, -114068, -84181, -112030, 146598, 372830, 353198, 393342, 493942, 471486, 250522, 25476, -86713, -189162, -114833, -69384, -108312, 89416, 373832, 299722]
17528B99722m01339j26495K03029J52000n994j39710L2735J0927Q9629P9698j43358
17517E0844j07193j09870L1102R5974J80908J01466m0503k9104k2837N200N7062
17506B13049j33541q9211J78109j02312k17585J02609J84238k7197m0448k4833
17496D2878J26211p1107k0684q9098k10896j3887K54762k9223j79716l1057J51533
17485g0284Q6743L5101Q2609p4467R159O5041P2620j6667p7150j22821j50124
17474a60240k7462q1724K4201J74810J71570j20224M074L468K7241Q5048M7432
17463A48194j02228K05481L4631j02028j00141R7394j7492k06356j26259n274
17453a74078p550N6120j48577K9048K2106M3240J20196K8417J32269m8869n2013
$$ y = [299722, -101617, -228112, -25083, 126917, 120923, -18787, 13948, 24875, 114504, 194202, 50844, -56349, -166219, -135117, -39143, 141765, 243231, 202728, 173624, 150787, 155987, 213049, 79508, -9703, 168406, 66094, -151491, -48882, 135356, 108159, 67711, 42878, 169089, 97982, 77298, -11800, -222696, -236583, 18179, -11044, -190760, -221817, -70284, 16459, 51560, 134169, 59702, 68861, 133902, 206522, 189855, 112705, -10116, -160240, -187702, -269426, -245225, -70415, 101155, -19069, -14995, -11527, 15714, 100762, 148194, 45966, 251447, 286078, 184050, 83909, 181303, 163811, -42545, -168804, -174078, -181628, -125508, -274085, -245037, -222931, -179691, -59495, -31078, 101191, 52322, 309]
17442C09O6855o0445k6024P851p1077n3495q0416J16933R2978j61428j45219N8015
17430b55163P7476J08030L6010J19389K6214j98588q7837R0764J18269r5810n0274
17419a11520L0247P0668p5842j60021J02643M5030L7370N3203n2865L9789J25517
17408A04219K5691M308r1808j64747n5396K05957j29093l9558J14831l2616q3508
17397a41720n2611J64107J53691J57072o2254j39564m3545p5001j07361j09426
17387b56612O6126q0307j37290K46770O8084L9561m9333n1832K39534Q0271j95524
17376c0552k35061M5694L0495m1572o2646j12147J18858K35365N2193j0864M0000
17365B9763N2072M4350j22378k6061L4348J10103J1809O7007r2701j34237M3317
$$ y = [309, 67164, 6719, -19305, -11454, -82531, -136026, -216442, -99509, -6531, -167959, -313178, -255163, -177687, -69657, -33647, 85742, 111956, -86632, -174469, -83705, 34564, -61246, -111520, -81273, -10605, -86447, -246468, -143825, -98795, -61425, -8222, -61087, -21298, 104219, 129910, 134218, 42410, -122337, -177733, 28224, -100869, -140427, -25596, -58212, -141720, -194331, -30224, 123467, 280539, 218285, 78721, 35176, -39825, -147186, -256612, -190486, -270793, -408083, -161313, -93229, -53668, -103001, -154833, 84701, 164972, -30552, -265613, -219919, -189424, -230996, -293642, -405789, -286931, -51566, 627, -10237, 29763, 81835, 126185, 3807, -22254, 12094, 122197, 134006, 201013, 108312, -25925, 17392]
17354A7392j2405o0275k2534R9376Q0092O6106j76787l3214M8698J15824o4352
17343E7921P0879N5069M016j426j79705K2367P6336J30517r9518J1241J01890
17332B49587K9157k2025M746q2854j58114R7861J41745m2823k06678j45825R0674
17321d4549j50614p2920K15694J77775j11903q5920q2856O4771O469p8555m2851
17310b05459J30891M6179j13871p0546M6515J62068J8400k22210J3447J38924
17300e5662j19091q6380l9818p681P0315J27463J7158O6400n6889R4398J57060
17289A67273J41386j36042j87308j32788P298R7605m1734O7150J30499m479J37131
17278B45991j38883k0366r0691N8914J5066j16715o9846n721m413J47109J32182
$$ y = [17392, 4987, -55288, -77822, 21554, 101646, 167752, -9035, -42249, 6449, 122273, 57921, 128800, 183869, 187885, 186459, 6754, 29121, 105457, 235974, 136456, 147697, 249587, 278744, 256719, 261465, 178611, 20497, 118358, 260103, 217280, 10602, -135223, -44549, -195163, -268083, -52389, 125386, 13483, -72437, -155293, -90522, -84053, -162608, -205459, -74568, -28389, -142260, -212806, -166291, -4223, 14177, -208033, -194586, -55662, -174753, -261133, -300951, -308632, -238317, -110854, -93696, -27296, -84185, 10213, 167273, 308659, 172617, -14691, -147479, -140181, -42576, -84310, -17160, 113339, 108860, 245991, 107108, 86742, -3949, 54965, 70031, -46684, -116530, -122251, -126664, 20445, 152627]
17267A52627L6100N1703j22794j82485L2404J13488J57584K9569q6097o1219M0864
17256A61744j525j49326l4078J11764N0484l1573P1493o1240l1389J33116m8114
17245A71356J3834N8854j05133j07700m2018k1862k6339p9912M813q687J36222
17234f572R59J47616J10837j67595Q1640P6870r2051j41357M4567r2662o8785
17223a06533l2589K11676Q3218q4391P0133L3009j81422j96118J37827L04389
17213B39199K21058k3872j85086J5360l1451J1440j5402N3874q1249k75175j21184
17202a92488Q3130n1506M7909J10845l5800j53321J62713Q6915L1993r3135L3309
17191C0564J460M4356J87031Q4236o1796j59269n1663r3894j74893j68895R8067
$$ y = [152627, 188727, 240430, 117636, -64849, -32445, 81043, 238627, 268196, 182099, 120880, 161744, 160219, 10893, -23185, 88579, 139063, 107490, 178983, 117743, 86354, 219470, 171356, 185190, 244044, 138911, 31211, -10807, -32669, -59008, -138920, -134107, -142794, -6572, -5613, 142003, 252840, 85245, 166885, 243755, 151704, 10347, 54914, -37748, -106533, -139122, 72554, 155772, 71381, 141514, 174523, -6899, -203017, -65190, 239199, 460257, 436385, 251299, 266659, 235208, 246648, 231246, 285120, 203871, -71304, -192488, -109358, -160864, -112955, -2110, -37910, -191231, -28518, 58397, 90390, -2745, 30564, 32024, 76380, 263411, 347647, 285851, 126582, 74919, -18975, -193868, -362763, -264696]
17180b64696O3459R3465K44322J95750P8518j00456j13670k6547J51461n9709
17170B61897j82326k05948K4479l3612J31217J52311l1024j69085j64K04000J44422
17159B96167j81391k20668N663K0621J47641M3395k6711j59932Q2247N5491l6257
17148B6266J12140L298J63742o2833j49263j36139M9995J19920J06799O7737n1433
17137B50229j76132k79471o2238J00610L7532J02374K3059j83867j8172J8130
17127a87946J39385r6429j35382J50200J10721J06981N9938j27484j25588J20029
17117A4425P3735N7509K0092N937k9822j51197Q4106P9973j20782M374P6161P8193
17105A92704q1065J1808q365L169l6053j5839J06225J85632l451m0985k1828k5674
$$ y = [-264696, -201237, -107772, 136550, 332300, 410818, 310362, 196692, 170145, 321606, 261897, 79571, -126377, -101898, -135510, -4293, 148018, 116994, -52091, -52255, 151745, 296167, 114776, -105892, -100229, -79608, 68033, 111428, 84717, -75215, 7032, 62523, 26266, 138406, 141704, 305446, 242613, 93350, -42789, 7206, 127126, 233925, 301662, 250229, 74097, -205374, -267612, -167002, -129470, -27096, -4037, -187904, -206076, -187946, -48561, -144990, -280372, -130172, -19451, 87530, 147468, 19984, -105604, 14425, 88160, 145669, 165761, 171698, 141876, -9321, 74785, 154758, 33976, 38350, 114511, 192704, 111639, 123447, 115082, 118251, 82198, 66359, 172584, 358216, 354765, 313780, 291952, 266278]
17093B66278q5932R0045N4074R8126j24952q5732o1032k1472q1286m2021Q8570
17082I4666P2862r8112L6783N4920m0348Q5410O5317L0412J8409J3624q9342k448
17070B42153J03668R56O0330L7537q1435j57346M18j38073L5026Q7826P2102Q3951
17058C47113K2120R4908p1127k20776M2073k0253q2631J38212q7837n3552J45823
17047B54073M9935J46157P50k25233l0962O9333q593J51655J30597p9663J1284
17036D69333K4902K0009K7245q7755j6495Q5580Q2497q3264J00623o0889R1174
17025F52960M8038o0020l9617R170Q994P3790j29927m4870K9888K4094o1296J33673
17013F44877o4393m6341J61469l5690j8000M861J33210J10522j61451j93387j70677
$$ y = [266278, 180346, 270391, 324465, 422591, 297639, 211907, 150875, 129403, 48117, 6096, 94666, 167528, 69416, 106199, 161119, 120771, 206181, 271498, 301910, 320319, 333943, 244601, 242153, 345821, 346777, 407107, 444644, 363209, 205863, 206281, 68208, 103234, 191060, 263162, 347113, 369233, 464141, 393014, 172238, 214311, 194058, 111427, 249639, 161802, 108250, 254073, 304008, 450165, 450915, 225682, 194720, 264053, 255460, 407115, 537712, 458049, 469333, 494235, 514244, 541489, 453734, 437239, 522819, 605316, 522052, 622675, 561786, 652960, 700998, 640978, 601361, 610531, 619525, 693315, 563388, 518518, 548406, 572500, 511204, 644877, 580484, 534143, 695612, 659922, 641922, 646783, 779993, 890515, 729064, 535677, 365000]
17002C65000J07714J07243Q4689R8586M1539l8414q4537M6150N3152o1968l7576
16991F81578P0022k7565J25652R5784J07884j48227K8273M4052N0122j44906j38642
16980G44027L5874p1874O2518m6364j44215N2238Q3211J5603J17083p0146P8249
16969H56204p6132j41296Q3343J16483o0446j06436r4602J04353k2339j1095l9521
16958F08516J2138l1031p5711J00433N5317N5057j08480k6236j3881m1977J9586
16947E53731q1007L0862J14980K33337J69770j04768j89895j09686j42462q3409
16937C91453p6613K985l154K7257L1723J01776P917j79272J16614J33806j78988
16926C75504j34863J53273J1467L451R6374M8771j08023j99331N2275Q2306j35788
$$ y = [365000, 472714, 579957, 664646, 763232, 804771, 766357, 681820, 727970, 781122, 719154, 681578, 751600, 724035, 849687, 945471, 1053355, 905128, 933401, 977453, 1027575, 882669, 744027, 779901, 708027, 770545, 724181, 579966, 632204, 715415, 731018, 848101, 777955, 856204, 780072, 638776, 722119, 838602, 778156, 671720, 577118, 681471, 659132, 648037, 608516, 620654, 589623, 513912, 614345, 669662, 724719, 616239, 590003, 576122, 534145, 553731, 472724, 503586, 618566, 851903, 1021673, 916905, 727010, 617324, 474862, 391453, 314840, 317825, 314671, 341928, 373651, 475427, 483344, 304072, 420686, 554492, 375504, 240641, 393914, 405381, 408832, 505206, 553977, 445954, 246623, 298898, 381204, 245416]
16915B45416j18791K16111J41364r4382j69781o4351K11610J58825j50643j65675
16905B09703o6139n821K01390J14274l0298j61970M8176Q6998N278j07844j10622
16894A83125k1113J16291R3173O6532j59700j30369Q3414P313K98168J22735j47588
16883E11981o1541r0011O9409Q5114j73966q8126K53552O4230r9737j02764j3964
16872C54177J5216j70537M0914J1320J1048q1833P3392K26529Q6782r3347l7041
16861D36620n2776q5263l2931k327j95715n541L6270j75115m2482J08258j41031
16850a52033P5045P2165O9515j3833M9704J75840N9474m0017J9052R3087k9966
16839C78033o1298r5043j64250j3947Q6480k8501Q5696J6422Q0565L8933l1969
$$ y = [245416, 126625, 342736, 484100, 389718, 219937, 155586, 367196, 526021, 375378, 209703, 143564, 137743, 339133, 453407, 423109, 261139, 309315, 396313, 401591, 293747, 183125, 162012, 278303, 371476, 438008, 278308, 147939, 231353, 238666, 536834, 659569, 511981, 450440, 360429, 429838, 514952, 340986, 252860, 506412, 570642, 470905, 368141, 354177, 369393, 198856, 239770, 251090, 262138, 180305, 253697, 480226, 567008, 473661, 436620, 383844, 298581, 265650, 263323, 67608, 62067, 98337, -76778, -119260, -11002, -152033, -76988, -4823, 64692, 50859, 100563, 276403, 335877, 295860, 314912, 407999, 378033, 316735, 221692, 57442, 43495, 129975, 101474, 187170, 203592, 284157, 323090, 291121]
16828B91121r8900o751J41419j75436j95471m3615j28371k5786M4258R4913K48456
16817A45837Q4172j04949k7562K6898k63634j9641J17902J518L3169J56431J77975
16806C28116L316j52629R4214N8450Q7334j4956j22737j77531q3947n1845j53803
16795a86018n0204m7120K5022P6685l1514J13846J28825o3438j33637Q0582k8754
16784a15725k5974P4675J77797j13571N1833N1060J59322j5921j24572o6605n9520
16773g201k1859n3084j14969J26207J52681k0148k7122j4639L1305o6419l9562
16762e4810j663J40858m3721J70953J5735P0096o2914j37256r9617R3582J0195
16751A01438q8971J9340J1878j82602k5183Q7397j35009J60566J70807J05898
$$ y = [291121, 192221, 185470, 326889, 151453, -44018, -87633, -216004, -241790, -197532, -102619, 145837, 230009, 125060, 97498, 124396, -139238, -158879, -40977, -39459, -6290, 150141, 328116, 331432, 178803, 273017, 331467, 418801, 403845, 281108, 103577, 19630, -32215, -186018, -236222, -283342, -258320, -181635, -213149, -99303, 29522, -33916, -167553, -86971, -115725, -141699, -67024, 110773, -2798, 49035, 100095, 259417, 243496, 118924, 52319, -7201, -29060, -82144, -197113, -70906, 81775, 61627, 34505, 19866, 51171, -15248, -54810, -56473, 84385, 40664, 211617, 227352, 297448, 234534, 97278, -2339, 91243, 101438, 12467, 31807, 43685, -138917, -164100, -76703, -211712, -51146, 119661, 225559]
16741B25559L409j42782j8195K3555j03551j04893n4183J0883o7432R6749L42792
16730B11911J5278k9604k5103o4832P8305j11933j51501K877K14514J80201N5228
16719C75341n3448q8275J58914r7698m2687N5035o914P348L0167R119Q402j18435
16707B36869k03904m6326q7085j51707J37112J33249J2107Q7383R483j63271j04323
16696a40413o5003K95792p329J4670J3562J02762j32889r2863j56469M8571J23295
16685C686O7788M8380j66294J35624P524n2162J8445q4822n9873p3859j03944
16674b59507J7152J1467p8729P2795K43338N0287j42053M5629O0733k4661p8254
16663h1803M8674p2502Q225R0916J20110j3519M9400l3509R1695J47600m6996
$$ y = [225559, 228968, 86186, 67991, 91546, -12005, -116898, -171081, -160198, -227630, -130881, 211911, 227189, 197585, 172482, 107650, 185955, 74022, -77479, -74602, 139912, 320113, 375341, 321893, 233618, 392532, 294834, 252147, 307182, 300268, 307616, 337783, 346902, 355304, 236869, 32965, -13361, -100446, -252153, -115041, 18208, 30315, 117698, 127181, -36090, -140413, -205416, 90376, 83047, 97717, 111279, 214041, 81152, -11711, -168180, -119609, 3686, 71474, 119854, -46440, 89184, 96708, 44546, 62991, -21831, -81704, -155563, -259507, -242355, -230888, -309617, -236822, 6516, 56803, -85250, -39621, 21112, -3549, -81803, -33129, -105631, -97406, -6490, 113620, 100101, 149501, 115992, 207687, 355287, 308291]
16652C08291J2293j23060l8963P424k01106j5975j3101N490K3531O2161J21148
16641A48133R7579j80461m9378R3500N1538Q539n4281n9563o7571j1342o8076
16630i1383J3880J28258m2568q2796j4431R0171p996P9163R2724q7802j49995
16619g2775p5186o5186n1613j0545J32793J09953O3064n1976Q0760q665j0975
16608C9649N0525j1944P4405L6899l0743j41840j92928K0160N4773k1387o3891
16597a86322K5054n0781m6129M7504K02963P4969N5749o2723o6869Q9231j1513
16586G1133k9574n186J8223J42400k08550o8341L2724O3547O857o950K6803k9113
16574A3973j10544q2264J03490O24j3827J88124J72705m613j97683Q0045L033
$$ y = [308291, 320584, 197524, 158561, 165985, -35121, -51096, -64197, -58707, -35176, 26985, 148133, 245712, 65251, 15873, 109373, 160911, 169450, 115169, 55606, -11965, -23307, -91383, -77503, 50755, 8187, -74609, -89040, 1131, -6865, 72298, 165022, 77220, -72775, -147961, -213147, -264760, -275305, -142512, -32559, 30505, -21471, 59289, 50624, 39649, 90174, 78230, 152635, 189534, 158791, 16951, -175977, -155817, -101044, -122431, -186322, -161268, -212049, -258178, -210674, -7711, 67258, 123007, 60284, -6585, 82646, 71133, 41559, 36373, 54596, 196996, -11554, -79895, -47171, 16376, 23233, 16283, 43086, 13973, -96571, -178835, -75345, -74721, -88548, 99576, 272281, 267668, 69985, 150030, 153063]
16563A53063K9859N4462q3643k38367N8298J0633l4681O3045j9256p3664L4062
16552d6189j26550j30495R583n3917J01933J05021K2691o8108k0162M1637N7332
16541a07224P4548R7729K70307l5542k70557n7194L1989p1062j63578r3571K6491
16530b97664R4144O6587J75396L614q9834j0267o7077o6299M6284m3931k5620
16519b14667k266O8457o0422N6023R940j54231l5761O4857J12161p7460j12606
16508c45975J27782Q4461J17029O4521O0811k7533Q6380k484j05958j72347j00046
16497b13359L8560J7448R6706j18107j10319J18782J42022p3623m7104J08500
16487d0494Q5618p2676j39436j6136K46748J52160j90118J00964J38409k30372
$$ y = [153063, 182922, 237384, 153741, -84626, -26328, -15695, -50376, 12669, -6587, -80251, -46189, -172739, -303234, -293651, -347568, -245635, -140614, -117923, -186031, -206193, -164556, -107224, -32676, 65053, 335360, 299818, 29261, -27933, 4056, -67006, -230584, -324155, -297664, -203520, -136933, 38463, 42077, -47757, -58024, -125101, -191400, -145116, -189047, -214667, -216933, -148476, -208898, -152875, -142935, -297166, -332927, -268070, -155909, -233369, -345975, -218193, -133732, -16703, 47818, 108629, 81096, 167476, 164992, 59034, -113313, -213359, -174799, -157351, -60645, -178752, -289071, -170289, -28267, -101890, -148994, -40494, 45124, -27552, -166988, -183124, 63624, 215784, 25666, 126630, 265039, 34667]
16477C4667P201P7954k4426k15251k16233j01838j9485K82227J47684L9274m2519
16466c0745n8243n4548M3659O1027J10597j7699j6273q7162p4086Q3786P9831
16455D0144n7492J4231N9676j5942j0028J69324J21858L130L2808m0185m2368
16444B75156l7085j27365N532j4118q9328o972j0016q2268j58070p4144M8408
16433b70270Q0100J17808j07187k77649R8911J21916j8910l3236J22620J74229
16423H332K17171J4120L5894o086q9844l8272n2328j14515j30461j9138J51625
16412b3502j30856j4780N9783L7087N7588o4967k0070j0710K6830J14121j22336
16401i1812k84501j3660N0515J00003p1194J3478j67374J00964K11903o5868J17336
$$ y = [34667, 41868, 119822, 95396, -119855, -336088, -437926, -457411, -175184, -27500, 11774, -30745, -88988, -143536, -99877, -38850, 71747, 54048, 37775, -49387, -123473, -39687, 40144, -17348, -3117, 56559, 40617, 30589, 199913, 321771, 324901, 357709, 317524, 275156, 238071, 110706, 116238, 102120, 12792, 5820, -4196, -86464, -244534, -318678, -270270, -190170, -72362, -179549, -457198, -358287, -236371, -255281, -288517, -165897, 8332, 225503, 239623, 275517, 269431, 179587, 141315, 88987, -25528, -155989, -175127, -23502, -154358, -169138, -109355, -72268, -14680, -79647, -99717, -110427, -83597, 30524, -91812, -376313, -389973, -339458, -239455, -310649, -297171, -464545, -363581, -151678, -217546, -100210]
16390a00210J90893L1954o8527k5577J52330K5486O655J328k20342l32087n4893
16379c92990K05319P3898M8399j59562o5878J69155J20759Q7273k5479j70952
16369a10058Q5464O3205o2287p987L4894J97040o2657n2397j77679j07374N5141
16358a44695R4257M806m1205j8079M3106J29385j16391j04815j12863k8744L5298
16347b59940J05210K33203m2642M393J52910N2571j06614p4613L6652j5590k7849
16336E7691J16534r1514j07422Q2697P0896n2854j43057K7083N6981L63j69880
16325a52482o3912P6781J40633L00j19385K9878M3401J38241J15664J79417N0799
16314D39335j07885j14395j03433k5742l4026o3731M8228J01266k162n5922j30562
$$ y = [-100210, 90683, 122637, 54110, 28533, 180863, 206349, 213004, 214332, -6010, -338097, -392990, -187671, -113773, -65374, -224936, -290814, -121659, -900, 86373, 60894, -110058, -24594, 38611, -23676, -31663, 3231, 200271, 137614, 85217, -92462, -199836, -144695, -50438, -45632, -86837, -104916, -61810, 67575, -48816, -153631, -266494, -295238, -259940, -154730, 78473, 35831, 40224, 193134, 245705, 139091, 64478, 101130, 85540, 57691, 174225, 82711, -24711, 57986, 128882, 76028, -67029, -39946, 17035, 17398, -152482, -216394, -139613, 1020, 1320, -118065, -88187, -44786, 93455, 209119, 388536, 439335, 331450, 217055, 113622, 87880, 53854, -9877, 38351, 139617, 137455, 81533, -49029]
16303d9029p6456j45627n9302K1952J64593j7372k03177l1827J88914J93717J54739
16292A41125N6642p8227K6351J7947J46300j59879o4319O6230k3224j06709J66375
16281A88612M9645j16526K6677o7328j28410j04036j23752N076J72812K30860
16271A33630M832o7100m4828N1198n5183J5609r7527j45630M4405J46446j08444
16260a22592k05554O1018J06807O1231k2380o3417n1824n5889j10911M5236Q0574
16249b77701J31312K5892r5783K2035l8509R5877J14238J24475p1041O747K4824
16238F2366m1796N2368k20664j55767L7600M0864K6576J18340n6332j46160K7120
16227b55485J15345p3230j891r679P3875J6215m9855j8878P6297J84037R7994
$$ y = [-49029, -125485, -271112, -330414, -308462, -143869, -161241, -364418, -396245, -207331, -13614, 141125, 197767, 119540, 145891, 163838, 310138, 150259, 85940, 152170, 128946, 22237, 188612, 238257, 121731, 148408, 81080, -47330, -151366, -275118, -270042, -97230, 133630, 138462, 71362, 26534, 77732, 22549, 38158, -59369, -204999, -160594, -14148, -122592, -328146, -267128, -160321, -99090, -121470, -184887, -236711, -292600, -403511, -358275, -277701, -146389, -120497, -216280, -194245, -232754, -136877, -22639, 101836, 30795, 37542, 62366, 20570, 72938, -147726, -303493, -265893, -225029, -198453, -80113, -136445, -282605, -255485, -140140, -213370, -215261, -224940, -151065, -134850, -184705, -203583, -127286, 56751, 154745]
16216A54745m3310k16174M034j20394k7032K35198J26337K2678j89120m512l3266
16205i0816N1177K19526J2704j22624J1978p1189k30543L28726J56266O0722q3157
16194B42770l4783r4371l1591P1851o0470j42067j15269o6344N3650o4279m2215
16183b83118k7382L9120J31110K29143p7780m4033J1411n8032j59075r6101m6926
16172c81663J44067O5077n3293Q9766P7004L6380o0669j87418O720K47995L05224
16161B89190l7547j12005k1749j07443j52512p6952k5056Q3200n2737J83481J14799
16150H4669k01305j14792J23118J02240P3894P6095R3627j15168k03315M6743
16140c4194M3574K6589o5433m146L9000q8554k49632q7628j1344j7244J67829
$$ y = [154745, 111435, -104739, -100705, -221099, -248131, -12933, 113404, 136082, -53038, -57550, -90816, -39639, 179887, 192591, 69967, 81945, 10756, -219787, 108939, 265205, 325927, 242770, 207987, 113616, 82025, 153876, 93406, -48661, -163930, -230274, -176624, -240903, -283118, -310500, -271380, -140270, 88873, 11093, -32940, -21529, -79561, -238636, -334737, -381663, -237596, -172519, -225812, -136046, -59042, -22662, -83331, -270749, -264029, -16034, 289190, 251643, 139638, 117889, 10446, -142066, -219018, -244074, -160874, -213611, -30130, 84669, -116636, -231428, -108310, -6070, 67824, 143919, 237546, 122378, -80937, -34194, 9380, 35969, -29464, -33610, 5390, -83164, -332796, -420424, -431768, -449012, -281183]
16129b81183J32196K5626k301j31591O7510J43278J5445Q6991m917k1988Q0301
16118A09367l1607q2983m3133J50368L2381M824n5887j17282M6572r8003q8883
16107a74266N436J49542j37258M0188O4401n4679j523M4078K93665O6220j00034
16096A95770j51031j54341L4768k5599r1025P4251J51112N9431J26378N354j45081
16085G9987L9357O2122J05093J3138j18762k71645k22191K17760J40903K3543
16075F9305q6440n7307Q061J6642L54j31673j91487P6752J9160N4560L6839j54859
16063c40093M3772N3437n7176J66785l1455l6495J0207R0616J44215q8048l6191
16052h0426P5759K7279M0635j6063j6733K3233j12989L2249P3521P2435J6418
$$ y = [-281183, -148987, -123361, -125662, -257253, -189743, -46465, -31020, 55971, 51054, 29066, 109367, 77760, -5223, -48356, 102012, 134393, 139217, 83330, -33952, 12620, -85383, -174266, -168830, -19288, -156546, -116358, -51957, -106636, -108159, -64081, 229584, 295804, 195770, 44739, -109602, -74834, -100433, -191458, -117207, 33905, 93336, 219714, 225068, 79987, 119344, 181466, 286559, 299697, 180935, -90710, -312901, -95141, 45762, 69305, -17135, -74442, -66381, -49739, -49385, -181058, -372545, -295793, -276633, -222073, -185234, -340093, -296321, -242884, -300060, -133275, -164730, -201225, -191018, -100402, 43813, -44235, -80426, -4667, 22612, 63247, 47184, 30451, 53684, -59305, -27056, 46465, 118900, 135318]
16041A35318R6182p0880J8332J54429N6264k78346j84585J44093M6731k47763
16031a30225M051Q7369R0995j69808r9029j0632j08983L557R8371N4770m4477
16020b24041o0943N0668N7146O8210J3899p2604K6209r3049o9015P1531J25800
16009a06189P8490k4827j06197j6993P8863L4349k11043k6031J02836O1157l0649
15998a66234r9082J77172J51136l2006q5791j02252k5584J03807J1236J4099j36697
15987a90196J8513J11621Q1463j04533j03350j69405J42198l5816q8613P0307
15977b67811N8019N4406P3507O1780J91262j05717r4265p416P2653j70393o7912
15966b01887J50608K40297J8857j27502r4513p953L9408q5941k02901N2648J35892
$$ y = [135318, 231500, 160620, 178952, 333381, 389645, 111299, -73286, 70807, 117538, -130225, -126174, -38805, 52190, -117618, -216647, -227279, -336262, -332705, -234334, -179564, -224041, -284984, -234316, -177170, -108960, -95061, -167665, -141456, -234505, -303520, -231989, -106189, -27699, -52526, -158723, -175716, -96853, -62504, -273547, -299578, -196742, -135585, -166234, -265316, -88144, 62992, 30986, -54805, -157057, -182641, -78834, -67598, -53499, -190196, -171683, -60062, 21401, -83132, -186482, -355887, -213689, -249505, -338118, -267811, -209792, -155386, -81879, -20099, 171163, 65446, -28819, -36235, 36418, -133975, -201887, -51279, 189018, 207875, 80373, -14140, -22093, 17315, -68626, -271527, -218879, -82987]
15955h2987P294j11209O781K04286J12778k2311j47034j09908p5581L3516P470
15944a76905M7189o6973J10431k693k9998L0271k5965J1527J95240j48492j44981
15933b01349J07263l9619n5760O7339J03777L7283J81569j11287q1195n5844k7311
15922g5134J95620q544l7154J1847j687k9441R3162P471k41122n869M3006j14521
15910a62366L3671J07825O7010R7044K833j94804j118n2451k4622n632J8432R4532
15898a9646n2753j69713L2565J08128L890j94838R2013K37532J07116n0389j28381
15887c4476j9806O3432J06864k05253m2718n0205L6890L6678j90388R4911Q0796
15876a23275j25464p7953J91904O0540J123j76022J3858J89575P331j17131o8138
$$ y = [-82987, -75693, -186902, -180121, 24165, 136943, 114632, -32402, -142310, -217891, -184375, -176905, -129716, -196689, -86258, -88951, -118949, -88678, -114643, -103116, 92124, -56368, -201349, -94086, -133705, -189465, -122126, -18349, 18934, 200503, 89216, 8021, -47823, -75134, 120486, 111942, 74788, 86635, 84948, 55507, 148669, 156140, -84982, -90851, -47845, -162366, -128695, -20870, 46140, 143184, 146017, -48787, -49905, -102356, -126978, -132610, -114178, -19646, -72399, -242112, -209547, -101419, -97529, -292367, -200354, 37178, 144294, 93905, -34476, -54282, 9150, 116014, -89239, -131957, -182162, -145272, -108594, -298982, -204071, -123275, -248739, -326692, -134788, -74248, -73125, -249147, -235289, -45714, -38383, -155514, -223652]
15865b23652J3816k1773M3714Q1864O9565o6921J14628o8388n775R0682n5762
15854b8002Q3785J02509M4140o1002J90621J09060j40334k15936j02151J71304
15844A53994J33501P211N1441m9188j90006j31050m9050M212J61607j8079k37526
15833a62933r6749Q7378j15132k9603k606p1831l7494J68513N5912l7001L5153
15822b06393R6927L074L1221R3693L0612Q3904P9438j28889q3163r4062o9240
15811a62878o2368k9930J76966J01425J22067J997m9031J22677K5807j04108q5123
15800E7501p6001j6438m0940k7756o370L7600l740m2989L2852L928j23128K0313
15788a85168m5134M8150J23322J37075o3618O924L0898P7024k11655j42424J9382
$$ y = [-223652, -209836, -231609, -187895, -106031, -36466, -103387, 11241, -57147, -62922, 27760, -28002, 55783, 158292, 202432, 141430, 332051, 441111, 300777, 84841, -17310, 153994, 287495, 294706, 346147, 296959, 106953, -24097, -73147, -68935, 92672, 74593, -162933, -259682, -172304, -287436, -317039, -319645, -391476, -428970, -260457, -204545, -241546, -206393, -109466, -106392, -75171, 18522, 49134, 133038, 212476, 83587, 424, -93638, -162878, -225246, -255176, -78210, 23215, 145282, 147279, 98248, 220925, 246732, 142624, 57501, -18500, -34938, -75878, -103634, -110004, -72404, -76144, -119133, -86281, -82353, -205481, -185168, -230302, -182152, -58830, 78245, 14627, 21551, 52449, 129473, -82182, -224606, -205224]
15777b05224P4267J88089R4200p2187j42583Q639K5724M5412J14617j41626Q741
15766a931L9702p2683k87271N7316K09302J05261j46831j32781k5065k3499Q7480
15755a91000O6727j30626l705K52831J95915p075K0631j36263j41094Q5552R1969
15744A03862O6376Q450j24341j0121p290N023k5005j08198m0195p9789r7511J7860
15732b90879L0849j40433J61920J25771O2357r390J14477N656m0785k5066k5783
15721c1306M0257J62241l475j35359r6854q5110j54553J44084J47953J6394j97936
15710a93664j10424J42402K06020P5215j66929r1722n34j06775J17624J01478
15700b7309q0325k39358L5478O4025K24876k53756p1191N4758l5781K7348r4424
$$ y = [-205224, -130957, 57132, 151332, 79145, -63438, -54799, -29075, 16337, 130954, -10672, -1931, 37771, -34912, -322183, -264867, -55565, 49696, -97135, -229916, -254981, -278480, -191000, -124273, -254899, -258604, -5773, 190142, 183067, 203698, 67435, -73659, 11893, 103862, 170238, 178688, 54347, 44226, 36936, 41959, 16954, -91244, -131439, -211228, -308739, -290879, -260030, -400463, -238543, -112772, -50415, -59805, 54672, 60328, 19543, -5523, -31306, 8951, 171192, 167717, 32358, -64496, -149606, -304159, -160075, -12122, 4272, -193664, -304088, -161686, 44334, 119549, -47380, -139102, -139636, -246411, -128787, -27309, -107634, -346992, -311514, -247489, -22613, -276369, -347560, -292802, -328583, -301235, -395659]
15689c95659R3801R6791Q455r1413m93J5068O5223q616O9033J94594L4582L7428
15677A18794O2376j62834j29786J6885L6877K1663n5043j74673P4601J43218j20958
15666a68880O9503J82535J61744k1490l1218r8566o1895p9094P7068N5668p0420
15655A4955O4174l0140l8274j32634l6615J97686k4779k06955q3185J66894K2293
15644h6580l0837m3484j30148j33183l0642q4378J97812K4924k486n85M4593J62580
15632a12414O1886o2450j65392J31255K00775J18970k0904l3446L9030L0600j8866
15621A69044r7243n8293m0499r2463j16935P6768N5565L6684J12819M0394k1926
15610F3915k28284l1920P7063J44694J43517N2974o0998L2645M7642l924k58915
$$ y = [-395659, -301858, -205067, -196612, -288025, -288518, -273450, -208227, -216843, -147810, 46784, 81366, 118794, 181170, 18336, -111450, -94565, -57688, -36025, -91068, -265741, -191140, -47922, -168880, -99377, 83158, 244902, 223412, 192194, 93628, 31733, -47361, 29707, 85375, 14955, 79129, 48989, 10715, -121919, -158534, 39152, 14373, -192582, -275767, -108873, -86580, -117417, -160901, -291049, -424232, -454874, -539252, -341440, -316516, -319002, -319587, -274994, -112414, -50528, -112978, -278370, -147115, 53660, 172630, 151726, 118280, 157310, 187910, 169044, 71801, 13508, -26991, -119454, -236389, -159621, -104056, -67372, 45447, 85841, 63915, -164369, -196289, -119226, 25468, 168985, 221959, 160961, 193606, 241248, 237324, -21591]
15599b1591o5870R1590J887L8099j06145j45918q4859K090K05359N0058j8600
15588e3900N0644J0940P1052Q8887l2920j2969l5986O5776j2283l6182l9354k2158
15576D1547L0669j32231J0815J49536j07017L419o3304p5138m2280N9355J3970
15565a10659J5083J85113J84110p8920k44219p3209P9272J1908O1608k339j0175
15554A7573O7538J7917K018O0438L4098o9344m7701K03983k4321j13362m9834
15543I9003K0873j03065r6783n5212j21573j65434N7452P5436O1206J32346J24964
15532B9213K2627O8549P8575j4495p5747k08398j07782Q0120P8233K17765m0128
15521A28532k09710m458J44075l5029L3370J0278k0899p7733n4543K3425l6013
$$ y = [-21591, -87461, 4129, 6016, 44115, -62030, -207948, -292807, -290717, -85358, -35300, -53900, -3256, 7684, 78736, 167623, 134703, 121734, 85748, 151524, 139241, 103059, 63705, 41547, 72216, -60015, -49200, 100336, -6681, -3262, -66566, -141704, -183984, -124629, -110659, -95576, 89537, 273647, 194727, -49492, -122701, -43429, -31521, 30087, 27748, 17573, 85111, 103028, 105046, 165484, 199582, 130238, 82537, 286520, 262199, 148837, 99003, 119876, 16811, -79972, -135184, -256757, -422191, -364739, -289303, -228097, -95751, 29213, 51840, 120389, 198964, 184469, 108722, -99676, -207458, -127338, -49105, 168660, 128532, -81178, -85636, 58439, 23410, 56780, 67058, 46159, -31574, -86117, -62692, -98705]
15510i8705l9600m0272m4699l215M8844j631R095k197r8834p1498K210L4108L4230
15497b72164n8547J24417J94379M2672o362o0499j55968r953n797O9966k0153
15486a58009J11122j31513m1948o7113o0270j23792J29466K6325L4566p0643J2894
15475c38915J0485j3179o2536R6727J11308J84688K7065o7905m9179K458O9429
15464b9554l900J06016N4714o5571o0497p437k4065j58248j34834q5588o4523
15453d73487J64060L48322o0841l9587R8574o0264k0976R1733r2726j6320J58996
15442I7484l7021o1394P4490k0043j2444j46506j51665n1806N7443L7090l6486
15431b50858j71743q3661J76059K83301R8456Q0956j54229j76763J11097O7044
$$ y = [-98705, -138305, -178577, -223276, -226491, -177647, -179278, -170183, -172380, -271214, -342712, -340502, -306394, -272164, -330711, -206294, -11915, 30757, 24395, -36104, -192072, -202025, -207822, -137856, -158009, -46887, -178400, -220348, -287461, -347731, -471523, -342057, -315732, -281166, -351809, -338915, -328430, -341609, -404145, -307418, -196110, -11422, 15643, -52262, -101441, -98983, -29554, -33454, 72562, 127276, 61705, 1208, -6229, -30294, -188542, -323376, -408964, -473487, -309427, 38895, -21946, -61533, 37041, -23223, -44199, 47534, -45192, -61512, 97484, 60463, -931, 73559, 53516, 41072, -105434, -257099, -308905, -251462, -214372, -250858, -422601, -506262, -330203, -46902, 51554, 132510, -21719, -198482, -87385, -20341]
15421b0341J46208j39285n5573R4738P056j30219j62050j02193J6480M4573j3781
15410c14387P793N0262j16087R2441R8656J14491K12745j35787M8093J16882m2216
15399A32886j84976j64702k6819J26055Q0746q5073J16140k9101M8775j54386
15389a40455j09011J52897J55907k6012j08486r1937L5743J88812M7341j10672
15379e873K9688m3733j31837n6801N0462M5127p7380j24572q2559m4278J55575
15368b86181K59446K52229K1718j11994j18639p664n1678j26139P9735j33753
15358b22920O2187K53220O2607j25265k7138j00412n77L7811m6468p5172P302
15347a74825l7797M3442R6127J60747n0153l1722k6679n2506K0712Q0967k51419
$$ y = [-20341, 125867, -13418, -68991, 25747, 32803, -97416, -259466, -361659, -345179, -300606, -314387, -306594, -256332, -372419, -279978, -181322, -66831, 145914, 10127, 58220, 175102, 132886, -52090, -216792, -243611, -117556, -36810, -121883, -5743, -34844, 13931, -140455, -249466, -96569, 59338, 33326, -75160, -167097, -131354, 57458, 104799, -5873, 23815, -19918, -151755, -208556, -158094, -112967, -190347, -314919, -397478, -441756, -286181, -26735, 225494, 247212, 135218, 16579, 8915, -42763, -168902, -89167, -222920, -160733, 92487, 155094, 29829, 2691, -97721, -98298, -60487, -106955, -182127, -174825, -212622, -169180, -73053, 87694, 37541, 5819, -20860, -73366, -52654, 28313, -223106]
15336b23106q6325J90954Q4197J38695J1323q4562L9204j65199l1270j23018k2130
15325b71237L11372J24984j51257j77673m5786l9155m8273R9871R1675P9423K69955
15314B43899l322m5572j48506Q7806j20537q6095P4356q5976p8378O251J37975
15303a8099r0471n9200K29260k5561j53153O0904L9951m9899k5911p6810j05590
15292b74579R8167K7155L2962R8883l3318N0150J44765p1954n1112l3359k6093
15281c8333j22772j34731p025K24292J42118K6778m9697l2406P3209q0630L32
15270A135p2841k2613l0765J3297P9410N9138j01184q1423m8299R538M9620O0211
15258h4776Q989J01796J16009J9386j04019K4587N2172p3613k12130m833J18178
$$ y = [-223106, -309431, -118477, -34280, 104415, 115738, 31176, 70380, -94819, -126089, -249107, -271237, 40135, 165119, 13862, -163811, -209597, -248752, -297025, -197154, -105479, -26056, 243899, 240577, 195005, 46499, 134305, 13768, -72327, 2029, -83947, -162325, -156074, -18099, -108570, -167770, 61490, 35929, -117224, -56320, -16369, -66268, -92179, -168989, -274579, -176412, -149257, -116295, -17412, -50730, -580, 144185, 72231, 21119, -12240, -38333, -161105, -295836, -302861, -78569, 63549, 90327, 40630, 8224, 81433, 803, 1135, -71706, -94319, -125084, -111787, -32377, 26761, -74423, -155846, -204145, -194607, -144987, -84776, -75787, 26009, 142018, 161404, 57385, 81972, 134144, 60531, -151599, -156432, -38254]
15247c8254j3799J49297O9789j70755L4626p2387l7262j0337P8591j51537n4245
15236b16273R1090L6404m1576j6863r3298R5739N1293R9015Q0419L1466j30677
15225a3261m1533k2600k730r6777k0441K30782N1563J5658q5035M6319l7644m6712
15213b2411o5264p7166N4841N0383L9353O0738m0189k4455L3839r7294M0233J51729
15201A04337p5064j91291j12874j2016N3094J90608K54553j17127n0089J48936
15191A93067J1826k26452K678O6279J58301k02975k40799p5346J78508J83859
15181D8946j27682j45617j34665L3236J63461n7291O062k0319K40465O4812r1464
15170b0056j0202J8781j23614k14357J25389M7410j17132J76005L13184j09347
$$ y = [-38254, -52053, 97244, 167033, -3722, 30904, -41483, -78745, -89082, -10491, -162028, -216273, -125183, -88779, -130355, -147218, -240516, -144777, -93484, 5531, 85950, 117416, -13261, -54794, -77394, -80124, -176901, -197342, 33440, 85003, 100661, 15626, 61945, 24301, -22411, -87675, -164841, -110000, -59617, -20264, 40474, 285, -24170, 9669, -87625, -47392, 104337, 29273, -162018, -274892, -286908, -233814, -43206, 211347, 94220, 44131, 193067, 204893, -21559, -18881, 47398, 205699, 2724, -238075, -313421, -134913, 48946, -78736, -224353, -359018, -325782, -162321, -219612, -213550, -233869, 6596, 71408, -20056, -30258, -11477, -135091, -349448, -224059, -176649, -293781, -117776, 195408, 86061]
15160H6061J6606j46254n1530j5565J3174k11482N1030K54981N972o7192N0578
15149a3621N9172M9527o0233q7837r5993N5905P0669R966j7053R919P2810o1279
15137h048n7339r6643p9795K8285k44J18706P2124j17612o0512r1333j56681L4306
15125d14786J61025L3676n2068l7243n9460q0214J86336J99346J59755J08811
15115B05178J7415J436j29983l56248j1550M3127o7699J08373K4583M9553J0097
15104a05718O6594J41647J0881M2184n3395j18497P0725J9846q6655q165j24545
15093a45098j30594J45287J73186Q7677o8591L639J8022J12166O288p1718K3323
15082A53587n2742k2344J22040j4614n2922n9810j54408p8522j22659q7574j29349
$$ y = [86061, 102667, -43587, -95117, -110682, -97508, -308990, -257960, -2979, 2993, -64199, -13621, 45551, 95078, 34845, -52992, -148985, -93080, -22411, -12445, -29498, -19579, 53231, -8048, -65387, -162030, -241825, -213540, -213784, -95078, -22954, -140566, -201078, -292411, -449092, -414786, -253761, -220085, -272153, -309396, -368856, -449070, -262734, -63388, 96367, 205178, 222593, 224029, 94046, -262202, -273752, -230625, -298324, -189951, -165368, -115815, -105718, -39124, 102523, 113404, 155588, 102193, -16304, 54421, 74267, -12388, -20553, -145098, -275692, -130405, 42781, 130458, 61867, 65506, 83528, 195694, 201982, 130264, 153587, 100845, 78501, 200541, 185927, 133005, 73195, -81213, -159735, -282394, -369968, -499317]
15071d99317K07279N2617N8120J6930R2817m8560m1675o5510L8493R3780M2921
15060e2105Q1342j27850q9360J044J71170m1520l0168O7738Q2969j25704j89687
15049b52131R0248O0799o5172J46911Q5461j4977J01369j47987j46128m6299O7301
15038a20605K1751j6263J5073n5952N2223R4509j1282L2705R1517L6960k19571
15027g8935j29746J32078J02174j4346P419K3082O834j1011P2012j85011O13J7094
15015e7743J79344O351n5260N631j73467L1290J08886R4156q3569o3305J3779
15004F093J7428j48936j53014J26076J06772L0559j80876K911M7270J47029l8732
14993c7420L4374J34981n6792q9056R7815L419R9364j04128M9939l6743M917k5235
$$ y = [-499317, -292038, -239421, -181301, -164371, -71554, -120114, -161789, -227299, -188806, -95026, -52105, 29237, -98613, -187973, -186929, -15759, -57279, -87447, -19709, 63260, -62444, -252131, -161883, -101084, -166256, -19345, 66116, 51139, 152508, 4521, -141607, -187906, -120605, -98854, -115117, -100044, -155996, -103773, -9264, -20546, 12159, 103676, 140636, -78935, -208681, -76603, 25571, 11225, 18644, 41726, 48560, 37549, 109561, -75450, -74837, -57743, 121601, 127952, 72692, 78323, -95144, -63854, 45032, 139188, 55619, -7686, 6093, 23521, -125415, -278429, -152353, -45581, -15022, -195898, -192987, -145717, 1312, -37420, -3046, 131935, 75143, -13913, 83902, 87321, 186685, 82557, 132496, 95753, 100670, 75435]
14981G5435O3687J09265j98315j27698n7528N4066j6279L4542p2668P2195J19806
14970E6508J3900q3061K2524J10282j0018R4822k45191k18738O1076K03460O9889
14959G5453J8576M1710J2927n7508J54947n4683r2201j19390k08737r544n2253
14948b90703K9464K05208J1137r5051r458N7300j02004m7714R3412j26299j0181
14937b84889K20391J90352O6922M8548M2104o2859j15714L935O8544p6234m4910
14926E6190j53598j58112J11592n5834M3834O0929j96564J06210J08256Q2532
14916E435K1598Q0607k3984q0380k316j87029k2241k9086P9222J36405O583m8804
14904f3990p3483J00346O8307j02768j01442k2981R7291N8595m313J32729J12988
$$ y = [75435, 139122, 248387, 50072, -77626, -135154, -81088, -97367, -62825, -135493, -63298, 56508, 70408, -12653, 9871, 120153, 110135, 204957, -40234, -258972, -197896, 5564, 75453, 94029, 135739, 148666, 91158, 246105, 191422, 99221, -20169, -228906, -238450, -290703, -261239, -56031, -44894, -139945, -149403, -92103, -194107, -241821, -148409, -274708, -284889, -64498, 125854, 192776, 241324, 283428, 220569, 104855, 108790, 177334, 101100, 56190, -97408, -255520, -143928, -199762, -155928, -94999, -291563, -185353, -77097, 5435, 27033, 107640, 83656, 3276, 960, -186069, -208310, -237396, -158174, -21769, -15186, -63990, -137473, -37127, 31180, -71588, -173030, -196011, -98720, -40125, -44438, 88291, 201279]
14893B01279r4920k23006j03049j22948o9718J86135J28897O1404P9151M9179
14883I2404q8578j13006m7169P0533J90826J18752k5011k19557j52269L3704J53182
14872A3811R1678L896q0327l50934k56579P3243P8844P5339J46978p9476L3207
14861b50320J54970j77579L5250J91557J08774o842j14263J9550P5820J00761
14851A37678J16320j629o170j17006j6114n8571L5684J10740n3896k78726j54330
14840b86020O4393J43259J69062r764k19318j53463k8607J34744O4393Q1967J17104
14829G7750L5196j41525p6260J24126L7809M8438l2297r3358j30040j05732Q6531
14818a69362J12491M9988o3141m8626L6926k9811J6153m8569k15720P8949K82193
$$ y = [201279, 106359, -116647, -219696, -342644, -412362, -226227, -97330, -35926, 43225, 92404, 3826, -109180, -156349, -85816, 105010, 223762, 198751, -20806, -173075, -139371, 13811, 105489, 109385, 29058, -321876, -578455, -505212, -426368, -351029, -204051, -283527, -250320, -95350, -272929, -237679, -46122, 62652, 55810, -58453, -38903, 36917, 137678, 253998, 252369, 246199, 129193, 113079, 54508, 90192, 200932, 147036, -131690, -286020, -221627, -78368, 90694, 80930, -138388, -291851, -320458, -185714, -121321, -39354, 77750, 112946, -28579, -104839, 19287, 57096, 105534, 73237, -20121, -150161, -255893, -169362, -56871, -6883, -70024, -118650, -81724, -111535, -95382, -143951, -359671, -280722, 1471]
14807A471j07463j2650j43054k7367J30986J24816j8532m7873p6302J00035K34838
14796A58905m4677n8546j6567K2342p5904j02756J0519q4205j66973J07546J65634
14785h4682L6472j0520N1595n3950n5994J45231l9341N1635J22170K34704R6731
14774D94051k48501k29345j94062L4423j01365N6558N3185N1862o3534J69888
14764B3160j12335j27477N3736O7728r9883j26620J6688J01103P9987N1202m5969
14753a18680j29369L5070J02714K08476k1802K4799m9709k653P6556k6798m1250
14742E7354q6604n8085L674o3216q5116J26963j1471R0836q2913n2989J31079
14731c0488R4026R8833j01329j56426l0788k5833K27897o9482k01660j04535K17792
$$ y = [1471, -105992, -118642, -261696, -289063, -158077, -33261, -51793, -99666, -175968, -75933, 158905, 114228, 55682, 39115, 61457, -14447, -117203, -106684, -190889, -357862, -250316, -84682, -48210, -58730, -7135, -61085, -117079, 28152, -11189, 40446, 162616, 397320, 494051, 245550, 16205, -177857, -143434, -244799, -188241, -135056, -83194, -146728, 23160, -89175, -216652, -162916, -95188, -195071, -321691, -305003, -203900, -123913, -72711, -118680, -248049, -212979, -110265, 98211, 76409, 101208, 51499, 48846, 125402, 98604, 57354, -29250, -87335, -83661, -146877, -231993, -105030, -116501, -25665, -108578, -161567, -30488, 63538, 162371, 61042, -95384, -126172, -152005, 75892, 6410, -195250, -299785, -81993]
14720h1993j03163L7789L4674J04791J22235J083R1906N7366q9009k19598j8413
14709f2332N6304P5339m5686M167J06395q3831j51861J01913K14193R331m3853
14698A80079k89317k70518Q0987K03533m8843J0006O7297l6238K1626n2608j51318
14687b85314L8051J24445J13414J07210j51169K1140K18233L4925k20386j4853
14677a4304J34598n373R573K3016j30464l4755J51427O8893j32046m3995m159
14666B2411j53399o6197j04954q0730R9386N7934P9853J54771Q294k4295j1787
14655a8713M7829l6484q6844J55587Q0845K7936j8752q4118o8021j14052J95743
14644H0956K02071j36388j36106J4751K0226j66297L7025M5830q5679o4367M756
$$ y = [-81993, -185156, -147367, -112693, -7902, 114333, 115416, 207322, 264688, 175679, -43919, -62332, -6028, 69311, 23625, 27792, 134187, 50356, -101505, 408, 214601, 223932, 180079, -109238, -379756, -298769, -95236, -144079, -134073, -66776, -103014, -81388, -133996, -285314, -247263, -122818, -9404, 97806, -53363, -32223, 186010, 220935, 549, -14304, 120294, 114921, 124494, 147510, 17046, -17709, 133718, 202611, 70565, 26570, 22411, -130988, -197185, -302139, -382869, -283483, -225549, -145696, 9075, 17369, -6926, -18713, 29116, -7368, -94212, 61375, 142220, 170156, 151404, 67286, -735, -114787, 80956, 283027, 146639, 10533, 25284, 45510, -120787, -83762, -37932, -123611, -187978, -183222]
14633a83222J00876K65913J96997j97828k08545K5030m2880o076m1010p3863J16132
14622d8476J60646j73665J61262n3813j38062l6386j01439o8377j7460Q876N5649
14611b51245J34355J27759J19105J267l1261N2593o5851N9523q8512j19380j9985
14600h1632P080J11031p8228l6635r4456J19915P7055j52762r8940P6064J4527
14589a36981L1519Q9801J8658R8371J03538j36488m1172P2132m8631r1947K11754
14578A70554R7335k33408j30016l1352k8979R963K41359J99436p6585J075l7041
14567A82341k40016R4082n4750o5754m747l0193j6583K37005J00586o9300p5047
14556E7624j91225m4911q5111p8193J15613J17987n1192J17802J37262o2309K4203
$$ y = [-183222, -82346, 183567, 380564, 182736, -25809, -779, -43659, -49735, -90745, -164608, -48476, 112170, -61495, 99767, 45954, -92108, -128494, -229933, -298310, -315770, -306894, -251245, -116890, 10869, 129974, 131241, 99980, 152573, 86722, 146245, 57733, -61647, -81632, -74552, 36479, -41749, -78384, -172840, -52925, 24130, -128632, -227572, -151508, -136981, -105462, -15661, 2997, 101368, 204906, 68418, 27246, 99378, 50747, -41200, 170554, 267889, 34481, -95535, -126887, -155866, -145903, 95456, 294892, 218307, 219382, 182341, -57675, 36407, -18343, -84097, -88844, -119037, -135620, 101385, 201971, 132671, 57624, -133601, -178512, -263623, -341816, -226203, -108216, -159408, -41606, 95656, 33347, 57550]
14545E7550p4650q5029l2656R1243m5429j67471P3771j0906L3259K3344N8020
14534g8954L1580j79067J250o2026l3804N6462Q2046J99196N7465p4906J32473
14523A31715p3515q9519P0262j12235j54668j2686R2886n3132J25665N5924n0327
14512f9630J32492o0490j78386M6211K22645n4115j48463J11642J15887j9429
14502I8364j89730j75687Q7809J09557M131R500P9174j4580m68K6498l0987J0733
14490A4314Q8891M1136j02951j07327N854m6693R4569j1859j7359M9462l0164
14479b2127q7575j0705J8290J16631o2896r4778Q8334p9988J18667J68494j63245
14468a0898j05876j09257J24647J13366n3550j74348k04606o1933J26165K42130
$$ y = [57550, -17100, -102129, -134785, -43542, -88971, -256442, -182671, -193577, -160318, -136974, -78954, -47374, -226441, -225191, -287217, -321021, -264559, -182513, 16683, 74148, -758, 131715, 58200, -31319, 38943, -73292, -227960, -240646, -147760, -200892, -75227, -19303, -69630, 62862, 2372, -176014, -129803, 92842, 38727, -109736, 1906, 117793, 98364, -91366, -267053, -179244, -69687, -65556, -56056, 23118, 8538, 8070, 34568, 3581, 14314, 103205, 144341, 41390, -65937, -60083, -106776, -12207, -24066, -41425, 8037, -22127, -109702, -120407, -102117, 14514, -48382, -143160, -54826, -134814, -16147, 152347, -10898, -116774, -226031, -101384, 11982, -41568, -215916, -420522, -482455, -356290, -114160]
14458a14160M0159j24832j06371N1643M8217R3714J64781O3236k23277j58609
14448b65499M9802R9254J82902l2156P7539m2930j59869N395M8751P2506L5314
14437G1009J28721p4312j17950J818J12933M9862r6457j38156Q6317J4435q2370
14426d4150N2258Q1145q6111r4321k4841j69713q8137L3043L5175j4155M8682
14415b71125R1266q4292k3855R6366m1373j7304p8781J84646J73948N1799o7694
14404A3601M3606M6913j18192K0360o1257j08966L2590J31809J8685m1222J8813
14393c260j31234j0855R9203k4499Q7451J6856n4043P6972o1815n0407O5032n7337
14381d7936J06040J40577K20148R8104j82485j82943k52416J84376K2611j27305
$$ y = [-114160, -74001, -198833, -305204, -253561, -205344, -111630, 53151, 116387, -106890, -265499, -215697, -116443, 66459, 34303, 111842, 68912, -90957, -85562, -36811, 35695, 71009, 199730, 125418, 7468, 9286, 122219, 172081, 75624, -62532, 23785, 38220, -44150, 8108, 89253, 3142, -91179, -116020, -285733, -373870, -340827, -305652, -319807, -271125, -179859, -264151, -288006, -191640, -233013, -250317, -329098, -144452, 29496, 81295, 13601, 57207, 104120, -14072, 6288, -54969, -163935, -131345, 464, 19149, -22073, -3260, -134494, -145349, -46146, -70645, 16806, 33662, -20381, 56591, -5224, -55631, 9401, -47936, 58104, 198681, 418829, 516933, 334448, 151505, -100911, 83465, 106076, -21229]
14371b1229q3206j5166J24689j57989j20574J59308L25911q1245n8089n0159M5163
14360F7414p6999m1733r6156j26663K4483L6672J29512L8810m7248P2861R090
14349i957k00093K02237O5264P9932k7303r9421l3354Q075J10827j9829j76193
14338i9815m3940J49008q452j12795j02000j17107L0556J50594Q039l0324N6220
14327a20016J20017j8008L3396J32221q1327K0741l0009j9074j4053n0183N2116
14316B5821J37345J0060M6766L5372j31682K3668q7270n1660l5501p3386n6675
14305a57142J81549L5686j02673p4532k30934j38192j45691q879K00950K96594
14295a43264Q0J8381J11706m0655o161J37533j19n6333j4091P2429j23450j22394
$$ y = [-21229, -104435, -119601, 5088, -152901, -273475, -114167, 211744, 130499, 72410, 22251, 67414, -9585, -51318, -147474, -274137, -249654, -212982, -83470, -44660, -91908, -19047, -9957, -210050, -7813, 57451, 137383, 110080, 10659, -22695, -14620, 96207, 76378, -99815, -143755, 5253, -3199, -115994, -217994, -335101, -304545, -153951, -145912, -176236, -120016, 1, -18007, 15389, 147610, 66283, 87024, 57015, 37941, 23888, -26295, 25821, 163166, 173226, 219992, 255364, 123682, 147350, 60080, 8420, -27081, -100467, -157142, 24407, 60093, -42580, -117112, -348046, -486238, -631929, -640808, -439858, -143264, -143184, -124803, -13097, -53752, -59913, 77620, 77501, 21168, 7077, 79506, -43944, -166338]
14283a66338l0355J13560Q0852J31856o4922k24989j8269o3645L14725J11308
14273A83783k527p3493j10190j09467K2605J67480P3001r5117q2934L9301k7472
14262a5030R8511j9543j72803j12535N7842K52388M5124k03256j09154m7123Q7881
14251a37698j44763Q7990J50402J61765j8026j92763N3485J49021o4561n4085
14241i233l0563o0947K9400J02997J33158P5903j8167j03967p4169k4901k39697
14230b20186o7439J31642O1024l8108k1102N9260j07751p876J13306L5281P4955
14219A3006J15665R275p9292m4433K09585O6170k74640m0938N9072M0018q7119
14208a3631j80625P2074J05616J34135j45632n3656o696j05914k9152J45898M1387
$$ y = [-166338, -196693, -83133, -2281, 129575, 64653, -160336, -178605, -242250, 72475, 183783, 181256, 107763, -2427, -111894, -89289, 78191, 151192, 56075, -26859, 12442, -15030, 83481, 63938, -108865, -221400, -163558, 88830, 133954, -69302, -178456, -225579, -137698, -282461, -194471, -44069, 117696, 99670, -93093, -39608, 109413, 44852, -9233, -39796, -100743, -71343, 31654, 164812, 240715, 222548, 118581, 44412, 19511, -220186, -287625, -155983, -94959, -133067, -154169, -94909, -202660, -210536, -97230, -61949, 13006, 128671, 137946, 58654, 14221, 223806, 289976, 15336, -25602, 33470, 73488, -13631, -194256, -122182, -16566, 117569, -28063, -81719, -88415, -194329, -223481, -77583, -36196]
14197c6196J56901J10049l7875K900j88138p6404J36359k4330o1852o5261n0004
14186a33851n7662J32479K1071j91491m7251N2951L307j03039L08168J37047j40387
14175a8658l0337n4218O9554J7551j14893J01244J68383O4403M4847j29575j59956
14164d1655j00688m0784m5385m2399R7367J0333o3466J46207J82232l6628P4409
14153A39543k2595r6067R8866j07932j34850p0569J33958m7545m8205M0553J4917
14142i9926n1183N9787M2176J20528J16604j58545j25499O9940j3515J46919m9942
14131E7344k57715j63250J15212N2087j6562Q0966R072j55815j80464n5636K725
14120e12036K77375K64089Q2743r9724p6923n934K8543J83631j32397n8787k6659
$$ y = [-36196, 120705, 230754, 192879, 195779, 7641, -68763, 67596, 43266, -18586, -83847, -133851, -191513, -59034, -37963, -229454, -276705, -223754, -220447, -323486, -15318, 121729, -18658, -48995, -103213, -33659, -16108, -131001, -29757, 138626, 203029, 247876, 118301, -41655, -142343, -183127, -228512, -270911, -173544, -163211, -226677, -80470, 101762, 65134, 139543, 116948, 20881, 119747, 11815, -123035, -193604, -59646, -107191, -155396, -114843, -99926, -151109, -91322, -49146, 71382, 187986, 29441, -96058, -26118, -39633, 107286, 57344, -200371, -363621, -248409, -196322, -212884, -131918, -122846, -278661, -459125, -514761, -512036, -234661, 29428, 112171, 12447, -64476, -70410, -41867, 141764, 9367, -49420, -76079]
14109g6079j24978K957l8093J14679Q8576J00930j46976k20565o022K00255J06965
14098A649J2390O0712P419j18324j99618J77788Q3778k1965O961M846M6449Q9209
14086A51294J2875q026p2217k9130o9199l9285J25086O6531m9314k9296K1976
14075H1295M0733k4958P8008j09856j07981P5350r2811j6826P3499j05322j42622
14064b51491j08092J75660J71367J09188l6216l8891j69776k7339M103K02547
14054C1060k6484r9136j94005P2811K69656R6699J39296j02519n8155J16698k0898
14043B25023j86908m2296K29435j482k5187j29212j01609r9843O716k7984L8970
14032a14377O9858o4833M6853P6974j48783J3937J83025P6497m0579m9481p8167
$$ y = [-76079, -201057, -198100, -236193, -121514, -32938, 67992, -78984, -299549, -305571, -105316, 1649, 14039, 74751, 82170, -36154, -235772, -57984, 25794, 3829, 10790, 15636, 62085, 151294, 164169, 156143, 83926, 54796, -14403, -53688, 71398, 137929, 88615, 59319, 81295, 122028, 97070, 175078, 65222, -42759, 32591, -60220, -77046, -3547, -108869, -251491, -359583, -183923, -12556, 96632, 60416, 21525, -148251, -175590, -171487, 31060, 4576, -94560, -288565, -215754, 53902, 150601, 289897, 187378, 129223, 245921, 225023, 38115, -4181, 225254, 223772, 198585, 69373, -32236, -132079, -125363, -153347, -114377, -44519, -109352, -62499, 14475, -134308, -120371, 62654, 139151, 98572, 49091, -29076]
14021b9076K7444K05004J8609l9010j78705L65j6529K0418m2270j94718K12806
14010a5662J47567o9038j980M0581N774l3701k24883Q8294K3430N8768Q569p1652
13998d3933o011m4403J81326O1972j02167k5571J8953q2777j26502J24592N9412
13987A4891j24866K6347q0629j09938J2598m751k4J372O3831K69065j10101k51325
13975b93530k1735N7961K00718K00461o7204K0127J32051k13015n474k3838j29140
13964a42618P3463L7473j94238o9966L9425R0831Q8185M7272j28701j46036L519
13953c01391P8917J58743J29318J88377o0100j33663J3468p1931q7121p4523L6515
13942a23391j02271l4322J70196K02392O3148j40357m7570n7545L2536j17948
$$ y = [-29076, -1632, 203372, 221981, 182971, 4266, 4631, -11898, 8520, -33750, -228468, -15662, 131905, 62867, 60887, 101468, 107242, 73541, -151342, -63048, -39618, 19150, 27719, -43933, -49944, -94347, 86979, 148951, 46784, 21213, 40166, -42611, -169113, -44521, 14891, -109975, -83628, -164257, -274195, -261597, -266348, -266372, -265000, -201169, 67896, -42205, -293530, -315265, -257304, -56586, 143875, 76671, 96798, 228849, 15834, 10360, -13478, -142618, -69155, -31682, -225920, -295886, -256461, -165630, -77445, -30173, -158874, -304910, -301391, -222474, -63731, 65587, 253964, 193864, 60201, 73669, 1738, -85383, -159906, -123391, -225662, -259984, -89788, 112604, 175752, 35395, -12175, -69720, -37184, -155132]
13932a55132J67709Q4182J20458j8637j45406p8066n4231o2977J2456L5622l627
13921i7649J38053L6688M7341k38544o2454k6336J19525L2884J5700J69720Q2298
13910B17226k03263L2728M5977p8983R4061l366p7866K6046P4098j35220j21892
13899a30454K8259J12015K6614O0563n8420r8863j01732J65629K60590j09493
13889A54708j20950j38323j8090J7549J06904q1435j23209J02249l0099M1142
13879h9554n6435p8898r8993J31465J94990l6715j45850L0959o4752j0661J05222
13868a19222J35832J25137p058m9711r110R0984r9375K4298j21721l9607J8372
13857e1181J66498j1810p8333L5481o4203k9721n2575K4413n4936o2126L4257
$$ y = [-155132, 12577, 96759, 217217, 198580, 53174, -24892, -79123, -142100, -129644, -94022, -97649, 40404, 77092, 124433, -114111, -176565, -202901, -83376, -50492, -34792, 134928, 217226, 13963, 46691, 92668, 13685, 107746, 104380, 26514, 52560, 126658, -8562, -130454, -102195, 9820, 36434, 96997, 38577, -60286, -162018, 3611, 264201, 154708, 33758, -104565, -122655, -105106, 1798, -79637, -202846, -100597, -130696, -89554, -145989, -224887, -323880, -192415, 2575, -34140, -179990, -149031, -213783, -224444, -119222, 16610, 141747, 134689, 84978, 75868, 166852, 67477, 91775, -29946, -69553, -51181, 115317, 103507, 25174, 60655, -3548, -33269, -85844, -61431, -116367, -178493, -144236]
13846a44236J34185J89510J17584l8791j79961r4324p1667r1604j19289M1437
13836b57156J3934J15804N9243j0730m3311l544l8050Q4274p0876o8400j45195
13825c64007J74804J45423N8877j14113j28553K4070J15655N3280o1853k554K03596
13814A04625N2037K4818j58598j8241k9332j11298L4262j996j24759J43561j5549
13803a00470L0437r8575L7792K4387l6679o2741J46452J20439J23353l4729j53025
13792c359j91210n8218k1622J55695K1257M4383J03919p9078l2727J07180L2280
13781G8500J13044K0006l8939O7564r2220p9677J20093P8099j08111j35490j5686
13770G183l3300P1709J26809r9386p3904R4703M012K1028l0727p1129J5322K9850
$$ y = [-144236, -10051, 179459, 297043, 258252, 78291, -16033, -87700, -179304, -298593, -257156, -243222, -127418, -68175, -78905, -122216, -125760, -163810, -79536, -150412, -218812, -364007, -189203, -43780, 15097, -99016, -227569, -203499, -87844, -34564, -96417, -98971, 104625, 156662, 181480, 22882, 4641, -24691, -135989, -101727, -103723, -228482, -84921, -100470, -70033, -168608, -130816, -106429, -143108, -205849, -59397, 61042, 184395, 149666, -3359, -194569, -252787, -274409, -118714, -97457, -53074, 50845, -28233, -60960, 46220, 78500, 191544, 211550, 172611, 240175, 147955, 68278, 188371, 266470, 158359, 22869, 7183, -26117, 45592, 172401, 73015, -889, 93814, 97826, 118854, 88127, 16998, 32320, 62170]
13758F2170N2074J55184J0911k6540j24355J1291j91659j66725O2055N8998K4806
13747g1790K1489q81J26892K4999j03537j44578j02113P0005J51995J77969n5047
13736I5403j32511n6673K6533J8541j08261J24439j9288k3124N0450J75463j26582
13725B4390j75122m7584k610j56134N3494J08287O292p6148K9077m071P1423J11546
13713e7160k7409K89109J28519j98109l9667Q975j05161J38813R9507J312r3552
13702A45177j03514j75408J83536L5703o5725q7504j22318K3464Q5341M8752q7417
13691a19913J3189m224Q3211J03142K232j62724j27122J17601J00089J7897j8001
13680E377j0533k22561J6076q6695o6321M3546J86463O2672N7682M1340o2454
$$ y = [62170, 114244, 269428, 280339, 253799, 129444, 140735, -50924, -217649, -155594, -96596, -71790, -50301, -51182, 75710, 100709, -2828, -147406, -249519, -179514, -27519, 150450, 95403, -37108, -93781, -67248, -48707, -156968, -32529, -51817, -74941, -24491, 150972, 24390, -150732, -198316, -200926, -357060, -303566, -195279, -188987, -265135, -236058, -240129, -168706, -57160, -84569, 204540, 333059, 134950, 95283, 104258, -903, 137910, 237417, 238729, 145177, 41663, -133745, 49791, 85494, 19769, -67735, -190053, -166589, -81248, -32496, -119913, -106724, -110948, -27737, 75405, 77637, -85087, -212209, -94608, 5481, 23378, 5377, -5156, -227717, -211641, -298336, -364657, -321111, -134648, -71976, -14294, 27046, -35408]
13669c5408o8824N6330k07665q1955L9105J58262J66309o7343J7314n6355l5171
13658a15401J46579L9220K3545q180j42263o5243m1228J33207L5738j41752p5389
13647b11167L4178J21115o765q0991j02155k617j4977J58929J73459O0820j53897
13636b4068O6222l2694R0420N8467j2844J930k1649j42768l6447n7805p001j44664
13624b62901l7364P9994L7112J49756K01035j31271n1907P4906J0715L3160k05237
13613a02002O0470J06513M4360j22886R696P2897k49910n3225K32783J37154k742
13602A33108K6709j43123l2234L8643j8450j24802M9032Q246N7479l1816P3078
13591C5870j03274j49262j01736J74573J21181n2049l8183p1101N3118J72851
$$ y = [-35408, -104232, -47902, -255567, -337522, -298417, -140155, 26154, -41189, -23875, -80230, -115401, 31178, 70398, 93943, 85763, -56500, -121743, -162971, -29764, 5974, -135778, -211167, -176989, -55874, -62639, -143630, -245785, -248402, -263379, -104450, 69009, 129829, -24068, 42154, 9460, 99880, 158347, 145503, 147433, 125784, -16984, -53431, -111236, -118237, -262901, -300265, -220271, -183159, -33403, 167632, 36361, -15546, 59360, 70075, 103235, -102002, -41532, 64981, 109341, -13545, -3849, 69048, -180862, -234087, -1304, 135850, 133108, 159817, 16694, -15540, 23103, 4653, -120149, -71117, -62871, -5392, -37208, 35870, -67404, -216666, -318402, -143829, -22648, -74697, -112880, -183981, -130863, 41988]
13581D1988j57j05734r1365O0433J29704Q2138k15877k9192J54442L4856p0019
13570h783J9909R2547o3455L7120m3536m5726K7028j83153k25207m808K75214
13559a22850K18761K9206j93853l9710O9355p4406l2213K3161N2389J61207o2845
13548B8202n8341m5030R5440Q1880j15111j07414r2055q446J14055J01303J12853
13537A07336Q9902k22233r28J00806k905j78736p2837K6505k5933K0143J44758
13526a4122Q7584J01768j20153j16894q8771j00631j6985J94173l1256n6843J52636
13515i494R2345N1533o3219N1848K5527o8297q0882l2270q5564j09208K0805j22104
13503c28980M0608n8815o0958l755J99463K04042m9582p2884K028j15830O1774
$$ y = [41988, 41831, -63903, -155268, -94835, 34869, 117007, -98870, -128062, 26380, 61236, -8783, 11126, 103673, 40218, 77338, 33802, -11924, 15104, -168049, -393256, -398064, -122850, 95911, 125117, -68736, -108446, -39091, -113497, -145710, -122549, -70160, 91047, 28202, -30139, -75169, 20271, 102151, -12960, -120374, -212429, -220875, -106820, -5517, 107336, 197238, -24995, -25923, 74883, 71978, -106758, -179595, -153090, -179023, -158880, -14122, 73462, 175230, 55077, -61817, -150588, -251219, -268204, -74031, -105287, -162130, -9494, 82851, 134384, 71165, 123013, 148540, 80243, -639, -32909, -118473, -227681, -206876, -328980, -288372, -347187, -408145, -411900, -212437, -8395, -57977, -130861, -128833, -244663, -182889]
13492a82889N2254Q5459J16660P391p128q159K9315q9230k28960n801O7540P5819
13480h7729J0518J29778j30804o3732J16245R5666j28553j32148M5997q7048L306
13469b28504J2384j2496j0889K23593K8577k3254j27733j34137M4761J0370n1679
13458b69007P273l1939N1072Q3782P9353j64094K7708K1948o562j053R7123M0603
13446f3793J9688J38258M884K061o4492l7703k08404J580J11817j46757n6333
13435b99194K2248K21187J52328L7047L6319J7836L800M4235k4164j51473l9048
13424B1121J17081K7964o8167j56460j12932N3702J67023l7130l9679j12191q7759
13413b27427K761Q4118J09781N9337J08733J87970N3285j75752r1399j26566p8567
$$ y = [-182889, -130635, -45176, 71484, 78875, 71747, 63588, 92903, 3673, -225287, -231088, -163548, -87729, -77211, 52567, -78237, -141969, -25724, 69942, -58611, -190759, -144762, -231810, -228504, -216120, -228616, -239505, -15912, 12665, -10589, -138322, -272459, -227698, -217328, -269007, -261734, -293673, -242601, -158819, -79466, -243560, -215852, -193904, -200466, -201519, -104396, -63793, -44105, 94153, 99037, 101098, 36606, -1097, -209501, -207921, -96104, -242861, -299194, -276946, -55759, 96569, 133616, 169935, 187771, 191571, 235806, 211642, 60169, 21121, 138202, 166166, 97999, -58461, -171393, -117691, 49332, 12202, -27477, -139668, -227427, -224666, -140548, -30767, 28570, 137303, 325273, 378558, 202806, 111407, -15159, -93726]
13402i3726P6787K57768Q7792m3041K7968k15047j33573j0391n7046j22859k4573
13391b49941K6203J21951k1718J41954R4404r1756j74563j59000J97668J38705
13381B3907j46767m0992Q3397m6502j3343N4485J69700K13432j99279j95159M1417
13370e5704P5954J5749l3233k3890J9659j07038p8709J2451R3023J75389J5073
13359A08724J04259J14781r9464k12405N828J47492k18079l5304j1323L8220Q9902
13348C2631J19517K2429j13637k7926l4430q0297l2954m4117M0066R3011O238
13337a9469j51092N6396M3290K03359J34786j30449k47788O301K80983L4235r9697
13326A10855j90089k3369Q7169O5715L5131J30466j220q3810j11960o9307l625
$$ y = [-93726, -16939, 240829, 328621, 285580, 313548, 98501, -35072, -45463, -102509, -225368, -249941, -223738, -101787, -123505, 18449, 112853, 21097, -153466, -312466, -114798, 23907, -122860, -163852, -80455, -126957, -140300, -85815, 83885, 297317, 98038, -97121, -55704, 20250, 35999, 2766, -21124, -1465, -108503, -187212, -174761, -81738, 93651, 108724, 212983, 327764, 228300, 15895, 21723, 169215, -48864, -84168, -95491, -57271, 32631, 152148, 174577, 60940, 33014, -1416, -81713, -114667, -158784, -118718, -25707, -19469, -170561, -114165, -70875, 132484, 267270, 136821, -110967, -104666, 176317, 210552, 110855, -79234, -102603, -15434, 50281, 85412, 215878, 214658, 130848, 18888, -50419, -54044]
13315e4044M5252L2994L4158O4643L4934L2620K07255j47984n1803j80240k4322
13304f537P1582N7817n4526j15793j07380m0723K9706K87802J18987j97333l6588
13293G014j4536p475J20972n0961k4445J2549j38127j46470P5278m3698Q2275
13282a27624J507l9196M2059J55591k1587L1650L1894n389N9756M2946j18227
13271E3380K6762j6897r1781K5231j27363L6291J86111R9775O2603J66636R5807
13260E16555j7751j12012j02579M101j13051k5727j18934l6237K4423m024K5514
13249D0278l1772j10659p1104M2124p807J87230J18907r43N9360p8035j17286
13238C0293R371j1386J43587r377j70354J4465N6764j3230L8564J62558r6344
$$ y = [-54044, -8792, 24202, 58360, 123003, 157937, 190557, 397812, 249828, 198025, 17785, -6537, 65045, 122862, 68336, -47457, -154837, -195560, -165854, 121948, 240935, 43602, 7014, -7522, -14997, 105975, 55014, 30569, 43118, -95009, -241479, -166201, -209899, -127624, -126117, -165313, -123254, 32337, 10750, 42400, 74294, 68905, 128661, 171607, 53380, 80142, 63245, -28536, -3305, -130668, -94377, 91734, 191509, 254112, 420748, 516555, 498804, 386792, 284213, 288314, 175263, 149536, 30602, -5635, 18788, 14764, 40278, 8506, -102153, -173257, -131133, -138940, 48290, 167197, 166254, 225614, 147579, 30293, 39664, 28278, 171865, 162488, -7866, 6599, 63363, 50133, 88697, 251255, 154911]
13227A54911o5539k6459l6496j46003l502P4943O7884m6282j6225j24512l7905
13216b05185M9050R0790J90518J06467Q2975l2354n3064j96784j09928j17778
13206a95293L9347K83426J65542j85325j20759j0763J62673J33490J57069K4715
13196D54122o1758j64027j76128O3614M1491j64846Q3292k29724P604J52998L55
13185F993K2761P7955O5796o566q3081j25130J32857J22489k567l846J902j53180
13173E6383p5892R4545O3984n7721P5686O7810m8015P5164r7892j00446j66775
13162a13169J6273J19108O0316k4586R8417Q2250J2843l8461k97551k816K874
13151h4502J13808N636k2512M6225n8053o8506o292o2079N2228Q613M2574O1114
$$ y = [154911, 89372, 62913, 26417, -119586, -123088, -48145, 19739, -26543, -42768, -167280, -205185, -156135, -65345, 125173, 231640, 314615, 282261, 229197, 32413, -77515, -195293, -155946, 127480, 293022, 107697, -13062, -23825, 138848, 272338, 429407, 454122, 392364, 228337, 52209, 115823, 157314, -7532, 75760, -153964, -146360, 6638, 6993, 29754, 107709, 173505, 166939, 83858, -41272, 91585, 214074, 211507, 207661, 209563, 56383, -19509, 75036, 139020, 81299, 156985, 224795, 176780, 251944, 154052, 53606, -113169, -96896, 22212, 82528, 57942, 156359, 238609, 251452, 212991, -84560, -87376, -84502, 29306, 34942, 12430, 58655, 602, -67904, -74196, -136275, -84047, -75434, -32860, 28254]
13139B8254N4327R3666N8679Q0121q3089k03512j39030p9058R8496r666O647M3468
13127e0697K62886J09021r0253L886K4562L4996J4253R032k01075k3193j65934
13116g2516j34692q7717J95660J46787Q8155l1467j40451P7199N8599j2395J5697
13105A02859L4131o936p106j8956O205j939N394J49929l791k47288l178J02753
13093A12077O6686l2619q8794q5585R9775k17217k40433J58629N5529N7190J35978
13082B1216j32801j00741K28001J61400p1319q3830N4365N086j20660Q7015J48887
13071A96619J943l4813K6842o6907l3765j09610N6190P4892j71749q7144K6573
13060a20929o1651n8649J14240J18022r8945L7335p99R3395P2806J6924p7161
$$ y = [28254, 82581, 176247, 234926, 315047, 231958, 28446, -110584, -189642, -91146, -100812, -94165, -50697, 212189, 321210, 230957, 234843, 259405, 294401, 308654, 317686, 116611, 93418, -72516, -207208, -294925, -99265, 47522, 135677, 104210, -36241, 40958, 99557, 87162, 102859, 136990, 130054, 122948, 103992, 110197, 108258, 113652, 263581, 259790, 12502, 9324, 112077, 178763, 146144, 57350, -28235, 71540, -145677, -386110, -227481, -171952, -114762, 21216, -111585, -212326, 15675, 177075, 105756, 21926, 76291, 81377, -39283, 47732, 196619, 198562, 163749, 190591, 123684, 89919, -19691, 36499, 111391, -60358, -147502, -120929, -182580, -241229, -126989, -8967, -107912, -70577, -71376, 22019, 94825, 111749, 34588]
$$ [...]
##END NTUPLES=NMR SPECTRUM
##END=
