##TITLE=Analysis number 318280
Compound Code cc 07210
Project Code adrs
Chemist Name avocado
##JCAMPDX= 6.0         $$ Bruker NMR JCAMP-DX V2.0
##DATA TYPE= NMR SPECTRUM
##DATA CLASS= NTUPLES
##ORIGIN= Bruker BioSpin GmbH
##OWNER= nmr
$$ XWIN-NMR		Version 3.5
$$ Wed Mar 22 11:16:58 2006 GMT Standard Time (UT+0h)  MAYBRIDGE\nmr@NMR_250MHZ
##.OBSERVE FREQUENCY= 250.131544655141
##.OBSERVE NUCLEUS= ^1H
##.ACQUISITION MODE= SIMULTANEOUS (DQD)
##.ACQUISITION SCHEME= undefined
##.AVERAGES= 16
##.DIGITISER RES= 18
##SPECTROMETER/DATA SYSTEM= dpx250
##.PULSE SEQUENCE= zg30
##.SOLVENT NAME= CDCl3
##.SHIFT REFERENCE= (INTERNAL, CDCl3, 0, 16.522)
##AUDIT TRAIL= $$ (NUMBER, WHEN, WHO, WHERE, WHAT)
$$ ##TITLE= Audit trail, XWIN-NMR		Version 3.5
$$ ##JCAMPDX= 5.01
$$ ##ORIGIN= Bruker BioSpin GmbH
$$ ##OWNER= nmr
$$ C:\u/data/dgb/nmr/ADRS/1130/pdata/1/auditp.txt
$$ ##AUDIT TRAIL=  $$ (NUMBER, WHEN, WHO, WHERE, WHAT)
(   1,<2006-03-22 11:16:11.82 +000>,<MAYBRIDGE\nmr>,<NMR_250MHZ>,
      <created by zg, POWCHK disabled, PULCHK disabled
       configuration hash MD5:
       84 BC 41 DB A1 6E 1D 46 DA 25 12 A5 C1 ED C5 3A
       data hash MD5: 64K
       B0 84 73 6F 79 1C D7 3B AF 64 4A 18 8F 55 42 8F>)
(   2,<2006-03-22 11:16:32.73 +000>,<MAYBRIDGE\nmr>,<NMR_250MHZ>,
      <Start of raw data processing
       ef LB = 0.3 FT_mod = 6 PKNL = 1 SI = 32K 
       data hash MD5: 32K
       49 93 FC DC 50 53 AD 89 A4 B1 6E E9 1E B7 69 7B>)
(   3,<2006-03-22 11:16:41.33 +000>,<MAYBRIDGE\nmr>,<NMR_250MHZ>,
      <apk 
       data hash MD5: 32K
       B3 5B 4C A6 91 AC DB 55 16 4F 67 C2 1F EC 25 CB>)
(   4,<2006-03-22 11:16:44.40 +000>,<MAYBRIDGE\nmr>,<NMR_250MHZ>,
      <abs ABSG = 5 
       data hash MD5: 32K
       AA B8 A9 A7 75 3A 3A CF E4 53 E9 04 CD 17 DD A8>)
$$ ##END=
$$ 
$$ hash MD5
$$ 9B F5 65 68 0B 09 B9 ED 97 D5 76 3C 50 00 D6 D3
##$RELAX= 
##$RELAX= 
##$RELAX= 
##$RELAX= 
##$RELAX= 
##$RELAX= 
##$RELAX= 
$$ Bruker specific parameters
$$ --------------------------
##$DU= <C:\u>
##$EXPNO= 1130
##$NAME= <ADRS>
##$PROCNO= 1
##$TYPE= <nmr>
##$USER= <dgb>
##$AMP= (0..31)
100 100 100 100 100 100 100 100 100 100 100 100 100 100 100 100 100 100 
100 100 100 100 100 100 100 100 100 100 100 100 100 100 
##$AQSEQ= 0
##$AQ_mod= 3
##$AUNM= <au_zg>
##$AUTOPOS= <23 >
##$BF1= 250.13
##$BF2= 250.13
##$BF3= 250.13
##$BF4= 250.13
##$BF5= 500.13
##$BF6= 500.13
##$BF7= 500.13
##$BF8= 500.13
##$BYTORDA= 1
##$CFDGTYP= 0
##$CFRGTYP= 5
##$CHEMSTR= <none>
##$CNST= (0..31)
1 1 145 1 1 1 1 1 1 1 1 1 1 1 1 1 1 1 1 1 1 1 1 1 1 1 1 1 1 1 1 1 
##$CPDPRG= <>
##$CPDPRG1= <>
##$CPDPRG2= <>
##$CPDPRG3= <>
##$CPDPRG4= <mlev>
##$CPDPRG5= <mlev>
##$CPDPRG6= <mlev>
##$CPDPRG7= <mlev>
##$CPDPRG8= <mlev>
##$CPDPRGB= <>
##$CPDPRGT= <>
##$D= (0..31)
0 1 0 0 0 0 0 0 0 0.06 0 0 0 0 0 0 0.0002 0 0 0 0 0 0 0 0 0 0 0 0 0 0 
0 
##$DATE= 1143026168
##$DBL= (0..7)
120 120 120 120 120 120 120 120 
##$DBP= (0..7)
150 150 150 150 150 150 150 150 
##$DBP07= 0
##$DBPNAM0= <>
##$DBPNAM1= <>
##$DBPNAM2= <>
$$ [...]
##$SUBNAM7= <"">
##$SUBNAM8= <"">
##$SUBNAM9= <"">
##$SW= 20.6930455092707
##$SWIBOX= (0..15)
0 0 3 0 0 0 0 0 0 0 0 0 0 0 0 0 
##$SW_h= 5175.983436853
##$TD= 65536
##$TD0= 1
##$TE= 294.16
##$TE2= 300
##$TE3= 300
##$TEG= 300
##$TL= (0..7)
0 120 120 120 120 120 120 120 
##$TP= (0..7)
150 150 150 150 150 150 150 150 
##$TP07= 0
##$TPNAME0= <>
##$TPNAME1= <>
##$TPNAME2= <>
##$TPNAME3= <>
##$TPNAME4= <>
##$TPNAME5= <>
##$TPNAME6= <>
##$TPNAME7= <>
##$TPOAL= (0..7)
0.5 0.5 0.5 0.5 0.5 0.5 0.5 0.5 
##$TPOFFS= (0..7)
0 0 0 0 0 0 0 0 
##$TUNHIN= 0
##$TUNHOUT= 0
##$TUNXOUT= 0
##$USERA1= <user>
##$USERA2= <user>
##$USERA3= <user>
##$USERA4= <user>
##$USERA5= <user>
##$V9= 5
##$VALIST= <valist>
##$VCLIST= <CCCCCCCCCCCCCCC>
##$VD= 0
##$VDLIST= <DDDDDDDDDDDDDDD>
##$VPLIST= <PPPPPPPPPPPPPPP>
##$VTLIST= <TTTTTTTTTTTTTTT>
##$WBST= 1024
##$WBSW= 4
##$XGAIN= (0..3)
0 0 0 0 
##$XL= 0
##$YL= 0
##$YMAX_a= 388219
##$YMIN_a= -400877
##$ZGOPTNS= <>
##$ZL1= 120
##$ZL2= 120
##$ZL3= 120
##$ZL4= 120
##$ABSF1= 16.522
##$ABSF2= -4.171173
##$ABSG= 5
##$ABSL= 3
##$ALPHA= 0
##$AQORDER= 0
##$ASSFAC= 0
##$ASSFACI= 0
##$ASSFACX= 0
##$ASSWID= 0
##$AUNMP= <proc_1d>
##$AZFE= 0.1
##$AZFW= 0.1
##$BCFW= 0
##$BC_mod= 0
##$BYTORDP= 0
##$COROFFS= 0
##$CY= 12.5
##$DATMOD= 1
##$DC= 0
##$DFILT= <>
##$DTYPP= 0
##$F1P= 14.0000005364418
##$F2P= -0.99999901652339
##$FCOR= 0.5
##$FTSIZE= 32768
##$FT_mod= 6
##$GAMMA= 0
##$GB= 0
##$INTBC= 1
##$INTSCL= 1
##$ISEN= 128
##$LB= 0.3
##$LEV0= 0
##$LPBIN= 0
##$MAXI= 10000
##$MC2= 0
##$MEAN= 0
##$ME_mod= 0
##$MI= 0
##$NCOEF= 0
##$NC_proc= -3
##$NLEV= 6
##$NOISF1= 0
##$NOISF2= 0
##$NSP= 0
##$NTH_PI= 0
##$NZP= 0
##$OFFSET= 16.522
##$PC= 1
##$PHC0= 181.3867
##$PHC1= 0.9379137
##$PH_mod= 1
##$PKNL= yes
##$PPARMOD= 0
##$PSCAL= 4
##$PSIGN= 0
##$REVERSE= no
##$SF= 250.13
##$SI= 32768
##$SIGF1= 0
##$SIGF2= 0
##$SINO= 400
##$SIOLD= 32768
##$SREGLST= <1H.CDCl3>
##$SSB= 0
##$STSI= 32768
##$STSR= 0
##$SW_p= 5175.98343685301
##$SYMM= 0
##$S_DEV= 0
##$TDeff= 65536
##$TDoff= 0
##$TI= <Analysis number 999999
Compound Code 99
Book Reference 9
Project Code 9>
##$TILT= no
##$TM1= 0
##$TM2= 0
##$TOPLEV= 0
##$USERP1= <user>
##$USERP2= <user>
##$USERP3= <user>
##$USERP4= <user>
##$USERP5= <user>
##$WDW= 1
##$XDIM= 32768
##$YMAX_p= 303730511
##$YMIN_p= -158874
$$ End of Bruker specific parameters
$$ ---------------------------------
##NTUPLES= NMR SPECTRUM
##VAR_NAME=  FREQUENCY,     SPECTRUM/REAL,   SPECTRUM/IMAG
##SYMBOL=    X,             R,               I
##VAR_TYPE=  INDEPENDENT,   DEPENDENT,       DEPENDENT
##VAR_FORM=  AFFN,          ASDF,            ASDF
##VAR_DIM=   32768,         32768,           32768
##UNITS=     HZ,            ARBITRARY UNITS, ARBITRARY UNITS
##FACTOR=    0.157963299565203, 1,           1
##FIRST=     4132.6476996994, 0,             0
##LAST=      -1043.33573715361, 0,           0
##MIN=       -1043.33573715361, -158874,     0
##MAX=       4132.6476996994, 303730511,     0
$$ Real data points
##PAGE= N=1
##DATA TABLE= (X++(R..R)), XYDATA
$$ [...]
26063e7785K8657K4991j0052J8078L7591K6528J88l1613l0127J1425J7693l9141
26051c567J2462K9867j6731l1868n052N0647K5387p4212n5233L3373P0349k9154
26039F268m1589K8015L738j5419k5285m4684J1925Q420J9328K9551K5963m067
26027B164J8232k6261k5845K9115N314q483k1249p677J1988L9840L8211p494j7264
26014C0591j9716R611L7513j6743k4740m677M087K9476J6234k0706j8384Q115
26002C0661j1359N925j9549l8228L1047J3184P993M1264k621o6552k9044L6075
25990a204Q7136K2042k0730l9275l0913L8388l1703l2436N43N5888k2513k8985
25978c762l5412P3L8417M3659L7158m817l0778K5932J2273l555p315j0651m6638
$$ plain form
26063 -57785 -29128 -4137 -14189 3889 41480 68008 68196 36583 6456 17881 35574 -3567
26051 -3567 8895 38762 22031 -9837 -14889 35758 61145 -13067 -68300 -34927 35422 6268
26039 6268 -35321 -7306 -3568 -18987 -44272 -88956 -77031 -68611 -49283 -19732 6231 2164
26027 2164 20396 -5865 -31710 -2595 2719 -5764 -27013 -34690 -22702 17138 55349 47855 30591
26014 30591 10875 20486 57999 41256 16516 11839 15926 45402 61636 40930 22546 30661
26002 30661 19302 25227 5678 -32550 -1503 11681 19674 60938 58317 -8235 -37279 -1204
25990 -1204 85932 107974 87244 47969 17056 55444 23741 -8695 -8152 47736 25223 -3762
25978 -3762 -39174 -39101 -684 42975 80133 75316 44538 70470 82743 79188 71873 61222 14584
25965A4584o767k040j1449j3297K9656N255P765M0559k7256K056K8574l9045r697
25952A8898J8964k6616j39P862k7761O310k0919m0011K3183J2330k5434k9298
25940h2631K4909J8436K5769o3778K6276K6870O379r104J5983K3211K8313k0179
25928B0454j5575J2825k1833R730L3971k2781j2411j4245k2816m570L2277m4198
25916d9172m737K7125O593J4138J9187J0589J2554J4736q255j0949J2050J0750
25904E4609m0347k8580n328n527j9095K6666R679L0098K036k4150r633K0795J6547
25891B7770M1048k7604m8315L3065J1299n1163q856j9228L0344j4882j0341K7993
25879h870j3262L367j6172j0844N7030K686J7913j7650m2529r142K3891L4667
$$ plain form
25965 14584 7817 5777 -5672 -18969 10687 15942 23707 64266 37010 39066 67640 28595 18898
25952 18898 37862 11246 11107 18969 -8792 -2482 -23401 -63412 -40229 -27899 -53333 -82631
25940 -82631 -57722 -39286 -13517 -77295 -51019 -24149 -17770 -26874 -10891 12320 40633 20454
25928 20454 4879 17704 -4129 5601 39572 16791 4380 -9865 -32681 -37251 -4974 -49172
25916 -49172 -53909 -26784 -20191 -6053 13134 23723 36277 51013 42758 31809 43859 54609
25904 54609 14262 -14318 -19646 -25173 -44268 -17602 -7923 22175 24211 61 -9572 11223 27770
25891 27770 68818 41214 -7101 25964 37263 -13900 -22756 -41984 -11640 -26522 -36863 -8870
25879 -8870 -22132 -18765 -34937 -45781 11249 13935 31848 14198 -28331 -37473 -13582 21085
25867B1085m7423l1807Q046J8409O1310M1519o214m1721J2719l215l9842L02L987
25854b845k7457M7595K5692k6726l6057l369N294J5066J322J317J1656O15K9635
25841D1738j4318p804k0245k4699n2544n12J9534L2392j12l3726K8425r417l2949
25828g4237j1359L7944L0938M1228O5134m311n4312n8459K591K7890J063k2676
25816a8566M932o898J3485P700m1579q964N6026L6198K0247k6445k3229Q005r34
25803A9978p250o983j0491K2095K7228q008J1594k819k4119j4802O813r512L5672
25790C9396l618J6611K650k9873p068j6105R390k0354m3843j3892J4604L3407
25778a8695N649j7359J5958J6601n983J4304J8944j2179j143m0158J7070J5728
$$ plain form
25867 21085 -26338 -58145 -50099 -31690 29620 71139 64925 23204 35923 32708 -7134 -6832 -2845
25854 -2845 -30302 17293 42985 16259 -19798 -23167 -17873 -2807 -1485 -168 11488 12103 41738
25841 41738 27420 19616 -629 -25328 -77872 -78384 -58850 -26458 -26570 -60296 -31871 -41288 -74237
25828 -74237 -85596 -47652 -16714 24514 89648 85337 31025 -27434 -24843 3047 4110 -18566
25816 -18566 -13634 -20532 -7047 653 -40926 -49890 6136 42334 62581 36136 12907 20912 19978
25803 19978 12728 5745 -4746 17349 44577 36569 48163 45344 21225 6423 13236 3724 39396
25790 39396 35778 52389 55039 25166 18098 1993 11383 -8971 -52814 -66706 -52102 -18695
25778 -18695 -13046 -30405 -14447 2154 -3829 10475 29419 17240 16097 -24061 -6991 8737
25766H737Q866m0912l6255J0756j5558J2882J3733J3145J6679J0447P57l7998
25754c4721M4844J8095k8374J0100j8190K3852K9493l0103j742n592L36Q211l2007
25741a5798K3172n620K1634n7936k4155k2L9275O5424M7699l4915n6405p0713
25729f8360M921L5032K7402N321J9036j486L881K2693N5738J1641n5193n4297
25717F329l5981m463K9646r168l9710K8417K1236k4644J5289j9760J2050K4925
25705D166N122r894L392J5908k6186P385J1280j6067j2338k4145K0011J4317O748
25692c01K4728Q130p054k0004k0869O2J9553p610k4265N4543J0707k2322k7552
25679a2254m3579j3000K1163L5309k8358J0249L1923j3705m04k3791k5325k0783
$$ plain form
25766 8737 17603 -23309 -59564 -48808 -64366 -51484 -37751 -24606 -7927 2520 3277 -34721
25754 -34721 10123 28218 -156 9944 -8246 15606 45099 14996 13254 7662 7998 16209 -15798
25741 -15798 7374 1754 23388 -34548 -58703 -58725 -19450 45974 93673 58758 2353 -68360
25729 -68360 -63439 -28407 -1005 4316 23352 21866 25747 48440 104178 115819 60626 6329
25717 6329 -29652 -34115 -4469 -13637 -53347 -24930 -3694 -28338 -13049 -32809 -20759 4166
25705 4166 9288 -606 2786 18694 -7492 -107 11173 -4894 -17232 -41377 -21366 -7049 -301
25692 -301 24427 32557 25503 5499 -15370 -15308 4245 -3365 -27630 26913 37620 15298 -12254
25679 -12254 -55833 -68833 -47670 -12361 -40719 -30470 1453 -12252 -12656 -36447 -61772 -82555
25667h2555k1456K6696M6315N2848K9910j6983q863k5829L970K1978j1670o318
25655H043l7084L4012J7042k2300k3226K3407j3272n0990l85L8919l379L3890
25643D677N1281P068l9260k0471m9765j0357J3100l5207P910K9180K6412K2151
25631F719M052j9164J8061j1085K226k5365j0487M65Q144L2770K8250j899q378
25618B4309l098k7601k0409r189L8586n93j5939k7384j3055P144M2169k5947k1622
25605e2629J5113L2431k1543M212L8981r727r275K5521j232j2928R746L86L707
25592B2763p979J8229r845K4591j8236o5221j3219J4055K5902K2332j4250m5024
25580d5902n816K650R143l2490J3744L9119J4259j3181j0780m130J5128J6689
$$ plain form
25667 -82555 -104011 -77315 -31000 21848 51758 34775 25912 83 4053 26031 14361 8043
25655 8043 -29041 4971 22013 -287 -23513 -106 -13378 -64368 -64753 -25834 -29213 4677
25643 4677 55958 63026 23766 3295 -46470 -56827 -43727 -78934 -71024 -41844 -15432 6719
25631 6719 10771 -8393 9668 -1417 809 -24556 -35043 -34578 -26434 6336 34586 32687 24309
25618 24309 21211 -6390 -26799 -35988 2598 2005 -13934 -41318 -54373 -47229 -5060 -31007 -52629
25605 -52629 -37516 -5085 -26628 -22416 16565 6838 -2437 23084 21852 8924 18670 19056 22763
25592 22763 14784 33013 23168 47759 29523 -35698 -48917 -34862 -8960 13372 -878 -45902
25580 -45902 -51718 -49068 -39925 -72415 -58671 -19552 -5293 -18474 -29254 -33384 -18256 -1567
25568a567M3040K6299k559j6343j7427k9616k4677N409q138Q924K042L47o965
25555b1231L4844K3971k3563J144l0514j1817q531k7372J7123J5025Q281K421
25543b0219M561L3021o484K5629M928J2668k9584j3950N046L1623M139j7589r428
25530B4361j3585J4332j0794j3148j4945l29J6613j9883K8790J3359J6423L0805
25518G1999J2801l8915j1735k907l6096j4179L6179J373n0612k9099r16J9808
25506d2299M8140j8026j7617j2759o5900M52J0095j1404P751P0314N1485j5257
25494D975l5355p972j1970j9608K7502j0693K0374L1673j5539J6084L4640k5015
25482I096k8234j6287J0977M2695K1808l6987o0690n5097j1647J0807R7705p342
$$ plain form
25568 -1567 41473 67772 65213 48870 31443 1827 -22850 -17441 -25579 -16655 -14613 -14266 -21231
25555 -21231 13613 37584 14021 15165 -15349 -27166 -35697 -63069 -45946 -30921 -22640 -20219
25543 -20219 -15658 17363 10879 36508 41436 54104 24520 10570 15616 47239 51378 33789 24361
25530 24361 10776 25108 14314 1166 -13779 -14108 2505 -17378 11412 24771 41194 71999
25518 71999 84800 45885 34150 31243 -4853 -19032 17147 18520 -32092 -61191 -62107 -42299
25506 -42299 5841 -12185 -29802 -42561 -108461 -108009 -97914 -109318 -101567 -31253 20232 4975
25494 4975 -30380 -38352 -50322 -69930 -42428 -53121 -32747 -1074 -16613 -529 34111 9096
25482 9096 -19138 -35425 -24448 18247 40055 3068 -57622 -112719 -124366 -113559 -15854 -23196
25470b3196k689N0725J8186n083n5860J971o763r851j0079j0057q841o71K1065
25457d1143L7920l0266l189J8800k4728R747j2097m2803J3857J9731j201K889
25445e2483k3741M0348K1102Q632K7374k1185l6312J8088J9824m9406j8511K5399
25433d0871N6539J6192m5518P727J1355N916J374K1621j8905n796o920k0774L2318
25420A4258L2110k4220j9507j0085l7650l4320K8271Q920j1016L6349P324J6880
25408G314j805j5919l477k8876j9374J3997J1472J2173P0824L9271o1557o8303
25396d4260K2392K3899m484j394Q934J0370j9201L3569m5291K5614J4670J3699
25384C8517M7528j5120R89l4212M708j1179k5027k9961L3386J5044n155K1225
$$ plain form
25470 -23196 -25885 24840 43026 37943 -17917 -15946 -22709 -32560 -42639 -52696 -61537 -62208 -41143
25457 -41143 -3223 -33489 -36678 -17878 -42606 -32859 -44956 -87759 -73902 -54171 -55372 -52483
25445 -52483 -76224 -35876 -14774 -6142 21232 47 -36265 -18177 1647 -47759 -66270 -40871
25433 -40871 15668 31860 -13658 -5931 5424 11340 12714 34335 15430 9634 2714 -18060 14258
25420 14258 46368 22148 2641 -7444 -45094 -79414 -51143 -42223 -53239 -16890 -9566 7314
25408 7314 5509 -10410 -13887 -42763 -62137 -48140 -36668 -24495 46329 85600 24043 -44260
25396 -44260 -21868 2031 -2453 -3847 5087 15457 -3744 29825 -15466 10148 24818 38517
25384 38517 86045 70925 71914 37702 42410 31231 6204 -23757 9629 24673 19518 40743
25372D0743M084K0934J23j4529l7279m649K7693K2617p418m6364k4394j1093O544
25359b2988k4794r119L548L1193k1454j5235M3113K3568R220j5706l2688k3273
25347e4615L4609N31O024J6931n000K160K1858k0982k619j1660K9803j4633j6654
25334a4247l5344k0350L1424J5107J0609K6014q642o0938n118L7340k9990k696
25322e6831K1588J0914L499p844J4681M4840K3226l0556J226j94N906j6393k3104
25309i042L6447k0926l3170m4416r560j2008K4196L4932K8537n6763j9280M4180
25297c6873K2466k2541K6396O54N087N421O4541j7056o2476K4747K4193L824k1062
25284A7321k4027m2564k7510L7069L9023P015j4948M029m258J0447K6540j7597
$$ plain form
25372 40743 44827 65761 65884 51355 14076 9427 37120 59737 52319 5955 -18439 -29532 -22988
25359 -22988 -47782 -56901 -53353 -22160 -43614 -58849 -15736 7832 17052 1346 -31342 -54615
25347 -54615 -20006 -19475 -13451 3480 -1520 640 22498 1516 -1103 -12763 17040 2407 -14247
25334 -14247 -49591 -69941 -38517 -23410 -12801 13213 4571 -56367 -61485 -24145 -54135 -56831
25322 -56831 -35243 -24329 -20830 -28674 -13993 30847 54073 23517 24743 24549 30455 14062 -9042
25309 -9042 27405 6479 -26691 -71107 -80667 -92675 -68479 -33547 -5010 -61773 -81053 -36873
25297 -36873 -14407 -36948 -10552 -9898 -4811 610 65151 48095 -14381 10366 34559 38383 17321
25284 17321 -6706 -49270 -76780 -39711 -688 6327 -8621 -4592 -8850 1597 28137 10540
25272A0540n3853K8304M0730j6726N199m825r093M7140l6180k0523k401q816L6090
25259A5586L7412M3137k8842l8840q4926k0988L2961K2043K996k6646J5538M8925
25247A8356K1710m1319j5718J6634r715j2166L3904k0573j8582K3149r867L9707
25235B5520O176n399j3933J7474J0113k6391k1290j0856j0290O205J1050L1096
25223A9475k1641l826J2001N518j8281K5357N0603j5530m0588o205J9259l9319
25211a3177J3320N0333L6381k2272l6196l8186N77K4812Q294p301n9p666J8102
25198B6962j955J3783J2894m599J9033l7252j998j4723j6007j4862J7781L611
25186B668l6388L3N418J4576J8566J7922j1254k6566M464J836j1216j7763J580
$$ plain form
25272 10540 -43313 -15009 25721 8995 14194 9369 276 47416 11236 -9287 -11688 -20504 15586
25259 15586 52998 96135 67293 28453 -56473 -77461 -44500 -22457 -19461 -46107 -30569 18356
25247 18356 40066 -1253 -16971 -337 -10052 -22218 11686 -8887 -27469 -4320 -14187 25520
25235 25520 31696 26297 12364 29838 39951 13560 -7730 -18586 -28876 -22671 -11621 19475
25223 19475 -2166 -5992 6009 11527 -6754 18603 69206 53676 13088 6883 26142 -13177
25211 -13177 143 50476 86857 64585 28389 -9797 -9220 15592 23886 16585 16526 8860 26962
25198 26962 25007 38790 51684 47085 66118 28866 26868 12145 -3862 -18724 -943 2668
25186 2668 -33720 -33687 -28269 -13693 4873 22795 11541 -15025 -10561 -8725 -19941 -37704 -36124
25173c6124M6940N617j6103j5498n177M624P298M4724Q712m2445k2376M4046N9158
25160H3396j7812k8860k0386p9396J4979K3983M244P100o544L1098M7520L411
25148F2733j1214k9547n8326j649K2023m1824j5091K182R335N518J613L1460n689
25135b8476l3909n079j1161K5733J4353K4949J7446l999m815L7591j38m6913k9308
25122d3726O312l2810K296j6740J8054L3158J6730R180J6026O782k4787j8153
25110b7678L7847j9038K1565N5112k0526l0223k3412K7796K1353j4716J6982J3365
25098E8427k6335q2458n2127R136L2961k4376r690L5335M8473o092R654j8124
25086b5216j5512L1614O790l4999K9675l933J0164m009k4063m691J8890K8988
$$ plain form
25173 -36124 10816 16433 330 -15168 -20345 -15721 -8423 36301 45013 2568 -19808 24238 83396
25160 83396 65584 36724 16338 -63058 -48079 -24096 -19852 -12752 -19296 11802 59322 62733
25148 62733 51519 21972 -36354 -38003 -15980 -57804 -72895 -70713 -61378 -55860 -54247 -22787 -28476
25135 -28476 -62385 -67464 -78625 -52892 -38539 -13590 3856 -143 -4958 32633 32495 -14418 -43726
25122 -43726 -37414 -70224 -67928 -84668 -66614 -33456 -16726 -7546 8480 15262 -9525 -27678
25110 -27678 10169 -8869 12696 67808 47282 17059 -6353 21443 42796 28080 45062 58427
25098 58427 32092 -50366 -102493 -93357 -60396 -84772 -94462 -59127 -10654 -16746 -7092 -25216
25086 -25216 -40728 -9114 -2324 -37323 -7648 -11581 -1417 -5426 -29489 -34180 -15290 13698
25074A3698j9330k9372M1665N720l7696k422q918R494K2972O5268J8329k1403
25062E8005l9699M876L0882N090J9315l4683m9290l1234O552K2189J6763J7562
25050B6328L516n3722p3260m5847K4240L8842R0856O0617q269J9846k2768K2036
25038H2415J2563j5507j7186j8511p734k9691j6507J1413m6971j0078M4126M5465
25026C3797J687K5544J4725j7948M91J0923l9444k1437J4661J6550J0181m8202
25014A528j2173J8014j5408j9749J2124L1039K8989K9357r114k4777j9142p267
25002A3421N1737J7454m714l9830l7000l4232J103K1829K9246n941J225p763j8427
24989a1892K4781L5270Q718R038l3982j4282L7750m861p030j0025l3701m6148
$$ plain form
25074 13698 -5632 -35004 6661 12381 -25315 -27737 -36655 -27161 -4189 61079 79408 58005
25062 58005 18306 23182 54064 59154 78469 43786 -5504 -36738 -30186 -7997 8766 26328
25050 26328 29844 -23878 -97138 -142985 -118745 -79903 10953 71570 63301 83147 60379 82415
25038 82415 94978 79471 62285 43774 36040 6349 -10158 1255 -45716 -55794 -11668 33797
25026 33797 35484 61028 75753 57805 58296 69219 29775 8338 22999 39549 49730 1528
25014 1528 -10645 7369 -8039 -27788 -15664 15375 44364 73721 64607 39830 20688 13421
25002 13421 65158 82612 77898 38068 1068 -33164 -32061 -10232 19014 13073 14298 6535 -11892
24989 -11892 12889 48159 56877 65915 31933 17651 55401 50540 43510 33485 -216 -46364
24977d6364L1245K6783l8593m5242L3195O4591L0932k4535j2230j5777p830J8102
24965A4277K9753o432j5043l1470J9789K4885J1541j3190l858L6989L71j4352
24953E3260Q515J2822l5313p6523J487j7727J1461k129L4347M864K0055J189J4614
24940C0922r321m440j1554L6507N7612l8276l1999l2286r012l3831k8206m374
24928g8258K8795J4693l7252n373N7500J6183J3517m733L5539K5724J6048p8361
24916D022l4933L3598k0867J745k0073k6177R001L4843L8770m902p91m3451p906
24903c7121Q768J4833k6200J098L9457K6688m0013q773J8166L1692J5417m3109
24891I03k0931J4238K832m0J1149k9750l2458J0247L1683K2267j3466n5830L4028
$$ plain form
24977 -46364 -15119 11664 -26929 -72171 -38976 25615 56547 32012 19782 4005 -3825 14277
24965 14277 44030 37598 22555 -8915 10874 35759 47300 34110 30252 67241 67612 53260
24953 53260 61775 74597 39284 -37239 -35752 -53479 -42018 -44147 -9800 -4936 15119 16308 30922
24940 30922 21601 17161 5607 42114 99726 61450 29451 -2835 -11847 -45678 -73884 -78258
24928 -78258 -49463 -34770 -72022 -77395 -19895 -3712 9805 5072 40611 66335 82383 4022
24916 4022 -30911 2687 -18180 -16435 -36508 -62685 -53684 -18841 19929 15027 14236 -29215 -37121
24903 -37121 -28353 -13520 -39720 -38622 835 27523 -12490 -21263 -3097 28595 44012 903
24891 903 -20028 -5790 -2958 -2998 8151 -21599 -54057 -43810 -12127 10140 -3326 -59156 -25128
24878b5128J7748k2776R411Q331L1712m299j0772J8781L6447L57m1798k5325m5622
24865e2933J6927R639j348J5121l5209K4268J3512j060k9155O637J065j4078J2984
24852c3630J3356j7252l7345J6516L2186M2123K678J3370j0063J167m6510m0424
24840f3828j2908N2434L5573j3502m96m0861j5566N073l4210K9068K6491L346
24828b9386M5806m950k9077J7767L8239l5186m9465m040M0659N2251K0653l2253
24816C1018l2582K3434j6943l0942P750M1741L2739j6769k0256j2065O097L7227
24804E0449P653j0619p540j4059r771j9549l4398k7265K0176K1103l2440j8162
24792g4422K4880L8728K40k1862m5016m2146Q499L1867N0711K4151l218l0243
$$ plain form
24878 -25128 -7380 -30156 -20745 -12414 19298 14999 4227 23008 59455 59812 18014 -7311 -52933
24865 -52933 -36006 -26367 -27715 -12594 -47803 -23535 -10023 -11083 -40238 -33601 -32536 -46614 -33630
24852 -33630 -20274 -37526 -74871 -58355 -26169 15954 18632 32002 21939 23106 -23404 -63828
24840 -63828 -76736 -24302 11271 -2231 -2727 -43588 -59154 -54081 -88291 -59223 -32732 -29386
24828 -29386 16420 11470 -17607 160 38399 3213 -46252 -50292 -9633 42618 63271 31018
24816 31018 -1564 21870 4927 -26015 -18265 23476 56215 39446 19190 7125 13222 50449
24804 50449 58102 47483 39943 25884 16113 -3436 -37834 -65099 -44923 -23820 -56260 -74422
24792 -74422 -49542 -10814 -10574 -32436 -77452 -119598 -111099 -79232 -28521 -4370 -7588 -37831
24780c7831m276N0616N3349j1123m0997K4957Q06j5532m3987K0509J9278k3265
24768g496m6229k0103O146J0099J2027j618J9930J8393J7555J3446m0130L001
24756a4979K2741L145J2677k9151m580n234J4246P940M5321J3884k5396l6972
24744C642p706k9802K410K7640N448K3847J0539r1753q096p367j4663K6373k181
24731f1669M9765L3799o367k2946J726K896Q674J2021l2124j0096o6386k9615
24719a20322J0404L7322M4164J7171J9866L579j2095j4673K2370M114J9077m1197
24707a0220Q422K105l1j715J2723K7841J0132o9777O919r350M161K8470J7566
24694B7246m8778K7504K3559j3893k3954l5243M024J9805K4331J6984L9366L765
$$ plain form
24780 -37831 -42107 8509 61858 50735 9738 34695 35501 19969 -24018 -3509 15769 -7496
24768 -7496 -53725 -73828 -67682 -57583 -45556 -47174 -27244 -8851 8704 22150 -17980 -14979
24756 -14979 7762 10907 23584 -5567 -10147 -15381 -1135 6805 52126 66010 40614 3642
24744 3642 -4064 -33866 -31456 -3816 1632 25479 36018 -55735 -63831 -71198 -85861 -59488 -61669
24731 -61669 -11904 21895 15528 -7418 -5692 -2796 5878 17899 -14225 -24321 -90707 -120322
24719 -120322 -109918 -72596 -28432 -11261 8605 12184 89 -14584 7786 11900 30977 -10220
24707 -10220 -1798 307 276 -1439 11284 39125 49257 -20520 -13601 -22951 -18790 9680 27246
24694 27246 -21532 5972 29531 15638 -8316 -43559 -39535 -19730 4601 21585 60951 64716
24682F4716K0966l400j7808j2085n3241l3082k673j7774J2083N7286N6746J4742
24670H6476l7908m446j8185j0125J0577m146k4458L9365K1048L0343m2850l0780
24658A4911N9424q587j7724q486K343k0570j8577p057J1736R099J9391j9039o001
24645A0863M1425R74j164p0197l6030P220L265J491L4669R384j9133M7997K3282
24632E4046l844l5122p2424k5330J7188M2647M471m827n670J6409J8863j4859
24620h452j3018J7911j6150k1583l2445J1833M0375O8466N7377l3915m2980J4870
24608D2289P540K0918o927l0433l0390N5326O412m450q924j3328m373Q112j5498
24595B6274k4588l8587J3729O664L4344L8766k2258l4738k524K7807L6672K5460
$$ plain form
24682 64716 85682 82282 64474 52389 -852 -33934 -36607 -54381 -42298 14988 71734 86476
24670 86476 48568 44122 25937 15812 26389 22243 -2215 37150 58198 88541 45691 14911
24658 14911 74335 65748 48024 39538 41881 21311 2734 -4323 7413 16512 35903 16864 10863
24645 10863 52288 53262 52098 -18099 -54129 -46909 -43644 -42153 -7484 1900 -17233 30764 54046
24632 54046 50202 15080 -57344 -82674 -65486 -22839 -18368 -23195 -28865 -12456 6407 -8452
24620 -8452 -21470 -3559 -19709 -41292 -73737 -61904 -21529 46937 104314 70399 27419 42289
24608 42289 49829 70747 63820 33387 2997 58323 64735 60285 51361 38033 33660 41772 26274
24595 26274 1686 -36901 -23172 -16508 17836 56602 34344 -394 -2918 24889 61561 87021
24583H7021n0886n1739m168j8248K2516J3848L6608N0050k6655r5154K318j785
24571c6274N326k1237L082L2044J6832J9588l5275L6216l664m2479K703L240k663
24558b2561J5090j18R721P08p633J7147l9233j5938O089k656m58K928J6766K6022
24544E874L9826M1313j9191N986r629l502l5275n71K7344n264o2742J1653n388
24531i566J2880N662n9296m1414j0471O0013O2340k9115m877K0950K8498n934
24519B9670m299K3975n794k6959l46M1577K0581l3971l1329J3269K2528l1436
24507A7466k0447m3767n058K9670J2065n040P718K7353R303j1281m0472m5052
24495f7542j8675O608N7602K7850J0152J880K0433k5433n0165J8943L8501k712
$$ plain form
24583 87021 36135 -15604 -19772 -38020 -15504 -1656 34952 85002 58347 -36807 -34489 -36274
24571 -36274 -30948 -52185 -49103 -17059 -227 19361 -15914 20302 16638 -25841 -23138 -19898 -22561
24558 -22561 -7471 -7589 2132 2840 -4793 12354 -26879 -42817 -36728 -39384 -39842 -36914 -20148 5874
24544 5874 45700 87013 67822 73808 64179 60677 25402 24831 52175 46911 -15831 -4178 -9566
24531 -9566 3314 8976 -50320 -91734 -102205 -42192 20148 -8967 -13844 7106 35604 29670
24519 29670 25371 49346 43552 16593 16247 57824 78405 44434 13105 26374 48902 17466
24507 17466 -2981 -46748 -51806 -22136 -10071 -15111 -7393 19960 29263 17982 -22490 -67542
24495 -67542 -86217 -79609 -22007 5843 15995 17875 38308 12875 -37290 -18347 20154 17442
24483A7442K7446n595l3309p404M780L598R529M653M20q131j3946r014p215M4211
24469B7465M9961r164l9406k9010P418K5246p203l8435o462j9076J8304M9395
24457B9033K3085K1003r63k935l7642k4301K767L364q010J4257j5741J4855R133
24444B7905m3473k6685M9795M8007P257j1296j2493L6249l807j3423j8635j0928
24432B8473J7737j9379k9970k2316o473Q984k2690K0791M6050J6100k9707j5806
24420h206K2054M0574K6492J0653j7612o9109m8456J2309J6344Q640j3040L2104
24408A2747j1854k763k8941m816M5811J393n387O860N685L6834P254j9187N127
24395D8763j0451k8197m409n2501k8102O123L4378O3258J210K3147J1168m7360
$$ plain form
24483 17442 44888 39293 5984 -1420 3360 6958 16487 21140 21560 13429 -517 -9531 -16746 27465
24469 27465 77426 68262 28856 -154 7264 32510 25307 -13128 -19590 -38666 -20362 29033
24457 29033 52118 73121 72158 69223 31581 7280 10047 13411 5401 19658 3917 18772 27905
24444 27905 -15568 -42253 7542 55549 62806 51510 39017 75266 71459 58036 39401 28473
24432 28473 46210 26831 -3139 -25455 -31928 -22944 -45634 -24843 21207 37307 7600 -8206
24420 -8206 13848 54422 80914 91567 73955 4846 -43610 -31301 -14957 -6317 -19357 12747
24408 12747 893 -1870 -30811 -35627 10184 11577 6190 13050 18735 55569 62823 43636 48763
24395 48763 38312 10115 5706 -46795 -74897 -68774 -34396 28862 30072 53219 64387 17027
24383A7027j7188j426m5135N523j2930K4600L2557L0264J5955K7130l017j7387
24371E5973M08k3223n9265l03J013l0168L0925M360k5651j7730J5171L5293M0594
24358B7397j3547l569m8850m0972O171M7425R266n288k167nK378q983K1324k1089
24344c0509J4890P350j3389J7828K7212J0159l4310l0552k140M3086j5920K1219
24332A4924K6711j6334k2694j4749j0360L0615L762K923L5797l5134m593K8709
24320C9577K0154K4578J919k7250q760Q007l2556j1321J7075k5280k6064l4917
24308e4838J3969J4769j4678j9696K1743M5849P775j6180L135q218l561j5998
24296b5929J4105m071l6361j8621j4411j0438M6161L7169J1835j0557K195l2300
$$ plain form
24383 17027 -161 -1587 -46722 -41199 -54129 -29529 3028 33292 49247 76377 73360 55973
24371 55973 56381 33158 -26107 -26410 -25397 -55565 -24640 -20280 -45931 -63661 -48490 -13197 27397
24358 27397 13850 10281 -38569 -79541 -73370 -25945 -16679 -21967 -24134 -24139 -21761 -30744 -9420 -30509
24344 -30509 -15619 -8269 -21658 -3830 23382 33541 -769 -31321 -33461 9625 -6295 14924
24332 14924 41635 25301 2607 -12142 -22502 8113 11875 14798 50595 15461 10868 39577
24320 39577 59731 84309 86228 58978 50218 58225 25669 14348 31423 6143 -19921 -54838
24308 -54838 -40869 -26100 -40778 -60474 -38731 7118 14893 -1287 1848 -6370 -9931 -25929
24296 -25929 -11824 -15895 -52256 -70877 -85288 -95726 -49565 -12396 -561 -11118 -8923 -41223
24284d1223j9041l1174j2651N1861K1133j7901j140L7736L0308L089m1j196J387
24271B1147N24l687K6590J1968K1411q416k6275l8967l6414J9978K217j2606K1258
24258a272J4348R100M983n313P532j4937Q201J8229p827j6907J6966j2839l1862
24245a1598M8589O691k5965R363k8127m5834K691M601L5238M3955L7508l2290
24233D4822l4983k6605k634L8024j2124k3453l1679l4621k7912K1312O4132L7234
24221A1513n4224j2044L8488L619J8181p890J0506Q472l3870J410P3195L3159
24209I0515k6595p3994o0787m607O0829J4476j2689J0678m1156j0980Q3348L1973
24197F1011j0909l4562k7851k5631K1925J6962J399k1845L4490k6624l7988J893
$$ plain form
24284 -41223 -60264 -91438 -104089 -52228 -31095 -48996 -50136 -12400 17908 20997 20956 19760 21147
24271 21147 21671 17984 44574 56542 77953 69537 43262 4295 -32119 -12141 -9924 -22530 -1272
24258 -1272 13076 22176 27159 21846 29378 14441 22642 40871 33044 16137 33103 20264 -11598
24245 -11598 36991 43682 17717 27080 -1047 -46881 -44190 -39589 -4351 39604 77112 44822
24233 44822 9839 -16766 -19400 18624 6500 -16953 -48632 -83253 -111165 -89853 -25721 11513
24221 11513 -42711 -54755 -16267 -12648 5533 -2357 8149 16621 -17249 -15839 57356 90515
24209 90515 63920 -10074 -70861 -75468 -14639 -163 -12852 -2174 -43330 -54310 29038 61011
24197 61011 50102 15540 -12311 -37942 -16017 945 2344 -19501 14989 -11635 -49623 -47730
24185d7730n749J4504l772O0812O945l0831n4778k466J4085J6072k5554J9013
24173c9449J2039K0043N349m399J744L3953k3424L281j6047m7908n254K8188K2353
24160i531J4896K4537l2426k6068l441K6723K5756k4288n4591J7116L7903J3679
24148A0265k7140J3440m921N388J0862j9482r092j4434J7341L1822n927K2010
24136C0132K5151l4878M5492k400r456j2343q666n8137m6996l3317N5155j02O932
24123d3433l684K5188J622j7959K4518k0107J3968l949M871q093k3886L0121K0367
24110d56r554J5548k3932J9575K8564k9514l0250K509K4817L8615J0907k0472
24098B6357m0888k9767l0136K8943N0183K110J8787j1388m3044j36k0091Q037
$$ plain form
24185 -47730 -53479 -38975 -42747 18065 25010 -5821 -60599 -63065 -48980 -32908 -58462 -39449
24173 -39449 -27410 -7367 -2018 -6417 -4673 29280 5856 9137 -6910 -54818 -60072 -31884 -9531
24160 -9531 5365 29902 -2524 -28592 -32033 -5310 20446 -3842 -58433 -41317 -3414 10265
24148 10265 -16875 -3435 -8356 -2968 7894 -11588 -20680 -35114 -17773 14049 8122 30132
24136 30132 55283 20405 65897 63497 54041 41698 33032 -25105 -72101 -105418 -50263 -50365 -43433
24123 -43433 -47117 -21929 -20307 -38266 -13748 -33855 -19887 -23836 -18965 -27058 -50944 -20823 -456
24110 -456 -10010 5538 -18394 1181 29745 231 -30019 -27510 -2693 35922 46829 26357
24098 26357 -14531 -44298 -74434 -45491 4692 6802 25589 14201 -28843 -28979 -49070 -41033
24086d1033K7518P787J2700j8871m8765K1235K2006j992J8989P974m8121K1237
24074a9336M7841j6552j1554k704n311L3206Q778m2301J5501L3748k941j8394
24062A9981j7850j0502M3305j8624J2018j2682n451J0925q338L7484k099J557
24050D9724R248p051q751N495l1888k0896K5327j3444q068J2820n6182j3239L7477
24037a9428N545R841L4461j7931L938k9735j4336j8015K5298K2954j9618j6017
24025c3043N8985L3949j3068k1534l5187L979K6461L97n306K7980n243l6359m20
24012A591K7967k3560O643J4421R325k9042o1791j7353n892L3003j1882K613K1588
23999c2369n502J497J8096J9904J4092J169m723m422l655l8678l0047J795k3138
$$ plain form
24086 -41033 -13515 -5728 6972 -11899 -60664 -39429 -17423 -19415 -426 7548 -40573 -19336
24074 -19336 28505 11953 399 -2305 -7616 25590 34368 -7933 7568 41316 38375 19981
24062 19981 2131 -8371 34934 16310 28328 15646 10195 21120 12782 50266 48167 49724
24050 49724 58972 51921 43170 48665 16777 -4119 21208 7764 -304 12516 -43666 -56905 -19428
24037 -19428 -13883 -4042 30419 12488 16426 -13309 -27645 -45660 -20362 2592 -17026 -33043
24025 -33043 25942 59891 46823 25289 -9898 -5919 20542 20939 15633 43613 38370 2011 1591
24012 1591 29558 5998 12641 27062 36387 7345 -54446 -71799 -77691 -44688 -56570 -53957 -32369
23999 -32369 -37871 -36374 -18278 1626 15718 16887 12164 7742 4087 -34591 -64638 -62843 -85981
23986h5981J8923P3400M2666j8660M253K2948J3469J1436R247j7922p6662o3483
23974f6366o0898N3159N0615J82L0246J0040m3216j4913k7564K2l3749p146K9191
23961h0397L4678K105K5597J2823J371k5497K3372K2857K1059K1463k8774j318
23949B9339M1259k5954k265m0922l1437j5657J697p925O3091k995l455l5735j9738
23936e0697L5779J440l7973M681M8868k5858l075L203J8127J0561j359p328k0337
23923b3968M2501j828m4329m1563k985K2323Q8175M9930J9394M865j3327j0645
23911H8543j4788o3737m9031j7362M2570K8761l4560l7666j3116M3591L8420K1170
23899C2795k0299k7144k218k310Q432O1461R89k4190k9075k4838k6118j9424M8335
$$ plain form
23986 -85981 -67058 6342 49008 30348 34601 57549 71018 82454 91701 73779 -2883 -66366
23974 -66366 -127264 -74105 -23490 -23308 6938 16978 -26238 -41151 -68715 -68693 -102442 -109588 -80397
23961 -80397 -45719 -43614 -18017 -5194 -3823 -29320 -5948 16909 37968 59431 30657 29339
23949 29339 70598 44644 42379 1457 -29980 -45637 -43940 -51865 11226 8231 4776 -30959 -50697
23936 -50697 -14918 -13478 -51451 -46770 2098 -23760 -26835 -23632 -5505 5056 3697 -3631 -23968
23923 -23968 18533 16705 -27624 -69187 -72172 -49849 38326 88256 107650 112515 99188 88543
23911 88543 73755 10018 -39013 -56375 -13805 14956 -19604 -57270 -70386 -26795 11625 32795
23899 32795 12496 -14648 -16866 -19176 -10744 50717 51706 27516 -1559 -26397 -52515 -71939 -23604
23886b3604N6992l40k1235k2628k1336r661j237N6086L0759j0416l8625m3060
23874d8305k2505r174L6716L5992j1152l3474O101K0372N0292N0059k8053n7136
23862a0267o0864L6088O4948M1331J3628m4868J551j9602l2390q786j5070j591
23850c5892m143K0252n076N9310J7604K575j2534n7813m1000K3386O4911N191
23838C6771j6352k1991k4027j0242k9521j0454k6995O543R375K4037L1948k7965
23826e8873m3005j316N614k9456N7628M9711p362n928K8184L756j0521L6298L202
23813B7932j9548j703R976j2166J477k7966L462K7293J7591L304k7568j0590J6522
23800H016P348Q714m079j6293j2625k139r67j1909k136l6939l846K2690L87K363
$$ plain form
23886 -23604 33388 33048 11813 -10815 -32151 -41812 -43049 13037 43796 33380 -5245 -48305
23874 -48305 -70810 -79984 -43268 -7276 -18428 -51902 -45801 -25429 24863 74922 46869 -10267
23862 -10267 -71131 -35043 29905 71236 84864 39996 41547 21945 -10445 -19231 -34301 -35892
23850 -35892 -40035 -19783 -24859 34451 52055 54630 42096 -15717 -56717 -33331 31580 36771
23838 36771 20419 -1572 -25599 -35841 -65362 -75816 -102811 -96268 -86893 -62856 -30908 -58873
23826 -58873 -101878 -103194 -97580 -127036 -69408 -19697 -27059 -32987 -4803 -1047 -11568 24730 27932
23813 27932 8384 6681 16657 4491 5968 -21998 -18536 8757 26348 29652 2084 -8506 8016
23800 8016 15364 24078 19999 3706 -8919 -11058 -12025 -23934 -26070 -63009 -66855 -44165 -43778 -41415
23786d1415J4798j7296j819k8480j0149L6654j922K7641o707m460K710K232j3751
23773d1964p943L8947O684k8283m5404m2054K0149K1973O6747k7388l0497j5529
23761h4562j411K6900M190K5294p96J5444Q410k9315k0049L4198k884p4893j8297
23748a17771K9148K3159K5389K2002L785J9042N3442k6636o1353m818M0419K7228
23736C3036k159p89R826J3042p667K7297M3962j3719k8729j5512j5666m4620p4094
23723g5792o404o442N7561K5857k1698l2446j9026J4166j1956K5648J1910R599
23711b9023p871J0782L6077k3389j3964K5033L5642J5760O445L4343k9113k3003
23699C7719L8796J4940l171j6983p6632m524p76n097m2923j5597K6743k6697O638
$$ plain form
23786 -41415 -26617 -43913 -45732 -74212 -84361 -47707 -49629 -21988 -28695 -33155 -30445 -28213 -41964
23773 -41964 -49907 -10960 -4276 -32559 -77963 -120017 -99868 -77895 -11148 -38536 -69033 -84562
23761 -84562 -85973 -59073 -54883 -29589 -30385 -14941 -6531 -35846 -55895 -21697 -24581 -99474 -117771
23748 -117771 -88623 -65464 -40075 -18073 -14288 4754 58196 31560 -29793 -34611 5808 33036
23736 33036 30877 30088 39914 52956 45289 72586 116548 102829 74100 58588 42922 -1698 -75792
23723 -75792 -82196 -88638 -31077 -5220 -26918 -59364 -78390 -64224 -76180 -50532 -38622 -29023
23711 -29023 -36894 -26112 9965 -13424 -27388 -2355 33287 49047 55492 89835 60722 37719
23699 37719 76515 91455 88284 71301 -5331 -9855 -10631 -15728 -58651 -74248 -47505 -74202 -67564
23686f7564q681P529M9571K0760J5593j8721m4355r759O865L229n772K7912L0406
23673G013k1789o3595j9266K1289L3004M4485K952K665m3734k4289K557Q758N9631
23660I681P8701K9616l5043j3397j5205k7509j4797J0178k4075m3187j9441N8590
23648e888J2741l5640l689O124K5885Q980r123O254N7646P601n8400o6554J6051
23635c8012N1136K5076o69o8583J2234L3013m716j9613J3833r739k2082K0071
23623h051m862l2573k5217J0042K1847J9223m139l1611o679o338J492M7303K7055
23610G492j4280Q945K8859n351O802J5575K0941j6057m3799j9394l1622k9704
23598g1593M2798O0137l417m6728j7512L9215M7696k9002j0445j1840j9429n2293
$$ plain form
23686 -67564 -76245 -68716 -19145 1615 17208 -1513 -45868 -55627 -48762 -45533 -51305 -23393 7013
23673 7013 -14776 -78371 -97637 -76348 -43344 1141 4093 6758 -36976 -61265 -58708 -49950 9681
23660 9681 88382 117998 82955 69558 54353 26844 12047 22225 -1850 -45037 -64478 -5888
23648 -5888 6853 -28787 -32476 -26352 -467 8513 -610 5644 63290 70891 12491 -54063 -38012
23635 -38012 13124 38200 37531 -31052 -18818 14195 9479 -10134 3699 -6040 -28122 -8051
23623 -8051 -12913 -45486 -70703 -60661 -38814 -19591 -23730 -55341 -62020 -68358 -66866 -19563 7492
23610 7492 -6788 2157 31016 25665 32467 48042 68983 52926 9127 -10267 -41889 -71593
23598 -71593 -28795 31342 27925 -18803 -36315 2900 50596 21594 11149 -691 -20120 -72413
23586g2413p147K9609P711N405J2794l6917m9396O293P1765K4152k4065J5065
23574a7144k2322N3520M4759n614n0063k8762n135l5587j0509J7715k6781k0081
23562a06004J2177N8340M5965J8972P25q838J9069m5823o2380M6382M256n3713
23550g0872K726J9049J4129J4625L4383O4908J4768l0094m0471l4373J3129n3732
23538e1825j2778K5271p953k3317n1756L8043K4351J9690p2J2902K2330L801J8544
23525A7231K4793k4958J697K8576O609k2050j4591J4762R780J2289j5229k8968
23513I941l1719m4424k6307L4595O1460M0555l4749m6981k5806L4391K7990j5466
23501a6520j2202J3288L0275n242p897L0607p395n3545J9352o690J1122L0093
$$ plain form
23586 -72413 -79560 -49951 -42240 -36835 -24041 -60958 -110354 -104061 -32296 -8144 -32209 -17144
23574 -17144 -39466 14054 58813 53199 3136 -25626 -30761 -66348 -76857 -59142 -85923 -106004
23562 -106004 -93827 -35487 10478 29450 30175 21337 40406 -5417 -67797 -21415 -17159 -70872
23550 -70872 -68146 -49097 -34968 -20343 14040 78948 93716 63622 23151 -11222 1907 -51825
23538 -51825 -64603 -39332 -47285 -70602 -122358 -84315 -59964 -40274 -40346 -27444 -5114 -1313 17231
23525 17231 42024 17066 18763 47339 53948 31898 17307 32069 41849 54138 38909 9941
23513 9941 -21778 -66202 -92509 -57914 3546 44101 9352 -37629 -63435 -29044 -1054 -16520
23501 -16520 -28722 -15434 14841 9599 1702 32309 24914 -28631 -9279 -15969 -4847 25246
23489B5246j0572j9191l124K0J0891K5879k5384j2955M4770k1090m7797j0211
23477d3518K479k5120K5179J7805O38K9706p612j8679M110J4062k749R803k6050
23464a9946J023p544J5275N0860K2404q802l086j8866o6584K2431O0355L9908
23452H7428j3167j9990l5459j5016r455k9120r985L8730M6271K454l251J0390
23440D9830n1951o1861P323Q6694p941j851J5555k2840L6626j6953l0589k8650
23428b6608r774j8233L21K3686N3584r275l0167k348j8844K0423K0646j0066m767
23415a1422K0466L5970J1076k6488n1490K2989M168R596O969j3759k6360P275
23403a1010J1317O419l2715L1821o280Q241L933J9848l2594m1908j5533J5330
$$ plain form
23489 25246 14674 -4517 -7641 -7621 3270 29149 3765 -9190 35580 14490 -33307 -43518
23477 -43518 -41039 -66159 -40980 -23175 -22537 7169 -443 -19122 -15012 -950 -3699 6104 -19946
23464 -19946 -18923 -26467 -11192 39668 62072 53270 50184 31318 -35266 -12835 47520 87428
23452 87428 74261 54271 18812 3796 -5659 -34779 -44764 -6034 40237 42691 39440 49830
23440 49830 -2121 -63982 -56659 30035 22094 20243 35798 12958 49584 32631 2042 -26608
23428 -26608 -36382 -54615 -54294 -30608 22976 13701 -16466 -18814 -37658 -17235 3411 -6655 -11422
23415 -11422 9044 45014 56090 29602 -21888 1101 5269 14865 21834 8075 -18285 -11010
23403 -11010 307 6726 -25989 5832 -448 7793 11726 31574 -1020 -42928 -58461 -43131
23391d3131L1750Q070k729J0369o054O074j879k5935l3331M014L738k433L5543
23378a5934J729m331k259L2206l736l3739J5725K8602N6992n524k3918j2569o5196
23365c1952l4812L1053P642J472K9253J5023J2410O062q155J9404l7486m5622
23353c5708m9840j6850O0910M3892J0854k6419J8785M3700k8612k3992J8767j9931
23341d444J3468K3705J1976j2032K7186L8901N734l7729m5460j260L1536M6925
23329I8506J0478l1703p1252m2169l4423k6029L3414l985J7423M4011K8278J1630
23317C4179l6525j8745j1030l9179r695J3716m541j3403J2077P0085J2372j1118
23305a807l293j826q553K7404J3655k5605J1571k4660K5360L916P375k5279k2215
$$ plain form
23391 -43131 -11381 -3311 -6040 4329 -1725 4349 2470 -23465 -56796 -52782 -49044 -51477 -15934
23378 -15934 -14205 -18536 -20795 11411 7675 -26064 -10339 18263 75255 69731 45813 33244 -31952
23365 -31952 -66764 -35711 -28069 -26597 2656 17679 30089 36151 27996 47400 9914 -35708
23353 -35708 -85548 -102398 -41488 2404 13258 -13161 5624 49324 20712 -3280 15487 -4444
23341 -4444 9024 32729 44705 32673 59859 98760 104494 66765 21305 20045 51581 98506
23329 98506 108984 77281 6029 -36140 -70563 -96592 -63178 -67163 -49740 -5729 22549 34179
23317 34179 -2346 -21091 -32121 -71300 -80995 -67279 -71820 -85223 -73146 -3061 9311 -1807
23305 -1807 -5100 -6926 -15479 11925 25580 -25 11546 -13114 12246 16162 23537 -1742 -23957
23292b3957L1576K380j2184m8074l3416O906J4825j3586J5721l63j1349l5514
23280a07035m781J5632L8279L3011J935j4660j5401L4821J2223o751L2060L1053
23268E0386J9610l2085m6086m2037K5683K1968K4263R934k397j1328p924L666
23256A3653j3716J059k9152J3277Q481o38J1160j3912K5082j1204k415k1437r883
23243b9645J4004K9896k5401K6838j5696k1555l8719l2774L4680N8023J8941p164
23231A1428J7898J5023M54k8496j0695J5560j2436q349j2346M6486M9027l0887
23219E2667n0273m2893R768J650J0195n65k151K8991R392k8693k8518j1385r82
23206e2797l573L0639J002j8120P648L5177P126k3558k792J6131J7587m6701k9130
$$ plain form
23292 -23957 7619 9999 -2185 -50259 -83675 -76769 -61944 -75530 -59809 -60172 -71521 -107035
23280 -107035 -111816 -96184 -57905 -24894 -22959 -37619 -53020 -18199 -5976 -12727 19333 50386
23268 50386 69996 37911 -8175 -50212 -24529 -2561 21702 31636 29239 17911 9987 13653
23256 13653 -63 996 -28156 -14879 -6398 -7036 4124 -9788 15294 4090 1675 -19762 -29645
23243 -29645 -15641 14255 -11146 15692 -4 -21559 -60278 -93052 -58372 -349 18592 11428
23231 11428 29326 44349 44803 16307 5612 21172 8736 387 -11959 34527 83554 52667
23219 52667 2394 -40499 -30731 -29081 -18886 -19451 -21602 7389 16781 -11912 -40430 -51815 -52797
23206 -52797 -56370 -25731 -24729 -42849 -35201 -24 7102 -16456 -19248 -3117 14470 -32231 -61361
23193f1361L8411m90j2153k1624l2447J0335L5560K6892L3225K0902l9477l3570
23181c5797K3681J9532K0748J8597L9517j7401k7908k8132j8791K8872L621M0363
23169F6902J3312k1228l5315l3360L1541N744j9667j2713L5012M228m4407L657
23157f294L0355R645k7226l7986l7583N730N5558L2245k0976P471n842J871m6927
23144c9959Q797M0298L3997m4137q3075j04L5004N250K2695J0422L0251J5939
23132C5378j5236L2883J1133k5621n5147l2024r713K548K7010O650L0761j8370
23120i748j5963k8296j6383Q3174J7785l4571m8401M3236L167k2138K4320p286
23108a1104M032n925J2724M326Q749j5070K782L148k5044J8091K3323K4161m2151
$$ plain form
23193 -61361 -22950 -23440 -35593 -57217 -89664 -79329 -43769 -16877 16348 37250 -2227 -35797
23181 -35797 -12116 7416 28164 46761 86278 68877 40969 12837 -5954 22918 26539 66902
23169 66902 80214 58986 23671 -9689 21852 27596 7929 -4784 30228 34456 -9951 -6294
23157 -6294 24061 33706 6480 -31506 -69089 -63359 -7801 24444 3468 10939 5097 6968 -39959
23144 -39959 -31162 9136 43133 -1004 -84079 -84183 -49179 -43929 -21234 -10812 19439 35378
23132 35378 20142 53025 64158 38537 -16610 -48634 -58347 -55799 -28789 -22139 8622 -9748
23120 -9748 -25711 -54007 -70390 12784 30569 -4002 -52403 -9167 -6000 -28138 -3818 -11104
23108 -11104 -7072 -12997 -273 4053 12802 -2268 514 3662 -21382 -3291 20032 44193 2042
23095B042l5840l6452R403K8414P234m3026j2572J1750J749l097J7799l1306K7646
23082e6256J7126o370m19k4698j875J7441m820M1749j318M03j7860k2473N881
23069e3489J3260J0904l4422j168j7058K7711J6346J1662N1385J8786k5259R163
23057B7821M644l2260N412J4572p4027J0295R174L260j0325L1492K2202l1435
23045a9175l1597k3116k4290P3611M2955j1197L8916J5466j8945j059K0836N839
23033F8244l9386k0878j9989J1655r288K47j8825N119j6279J6109J0157k1123
23021c4237J0940O0791J9332q893k2715k3704j1995k7878m5316M3667M8393j984
23009F401n4679k4829M2273J5060M1759j4833J8463J588k6981J5824k3470q433
$$ plain form
23095 2042 -33798 -70250 -60847 -32433 -25199 -68225 -80797 -69047 -67298 -70395 -52596 -83902 -56256
23082 -56256 -39130 -45500 -45919 -70617 -72492 -55051 -59871 -18122 -19440 -19037 -36897 -59370 -53489
23069 -53489 -40229 -29325 -63747 -64915 -81973 -54262 -37916 -26254 25131 43917 18658 27821
23057 27821 32465 205 5617 20189 -53838 -43543 -34369 -31109 -41434 -9942 12260 -19175
23045 -19175 -50772 -73888 -98178 -24567 18388 7191 46107 61573 42628 41569 62405 68244
23033 68244 28858 7980 -12009 -354 -9642 -9395 -28220 -23101 -39380 -23271 -13114 -34237
23021 -34237 -23297 37494 56826 47933 25218 1514 -10481 -38359 -83675 -40008 8385 6401
23009 6401 -48278 -73107 -30834 -15774 25985 11152 29615 31203 4222 20046 -3424 -11857
22997a1857R387J4626J6042n2020q6L7806K5255L457l305m2474J6401L6089L3502
22984H2823j2469j6779k6240k9184k0734L8019M9782o093o5857l3669J458J4642
22972b4301J6050l4545o53K1408K4092L813m854j5738J77K6619L289q927L5447
22959D1877j6141r896k346J2368j1128L5454j8077k087k1530k434j3707L361k3281
22946b7567k2618q816K3864J4026K4164N54j3145J588J075j753K1523J354m635
22933I614j5496j7198q725l0442N204k689j0196L7497N9491J8766j1666p4025
22921c9865m3426K858J7650K1776k4641k9140J3138J1551K7638K4855r902K6108
22909a400J7234J0438m456l3051k8382J5997L2808K9009k510n0808p938J6384
$$ plain form
22997 -11857 -2470 12156 28198 -23822 -23908 13898 39153 42610 39305 -3169 13232 49321 82823
22984 82823 70354 53575 27335 -1849 -22583 15436 65218 59125 -6732 -40401 -38943 -24301
22972 -24301 -8251 -42796 -43449 -22041 2051 5864 1010 -14728 -14551 12068 15357 6430 41877
22959 41877 25736 15840 13494 25862 14734 50188 32111 30024 8494 6060 -7647 -4286 -27567
22946 -27567 -50185 -59001 -35137 -21111 3053 3607 -9538 -7950 -6875 -8628 12895 14249 9614
22933 9614 -5882 -23080 -31805 -62247 -57043 -59732 -69928 -32431 27060 45826 34160 -39865
22921 -39865 -83291 -80433 -62783 -41007 -65648 -94788 -81650 -70099 -42461 -17606 -27508 -1400
22909 -1400 15834 26272 21816 -11235 -39617 -23620 9188 38197 35687 -15121 -23059 -6675
22897f675J9173J9159J9519k0682k9070M0338P82j7368J9720k4783l0158J4657
22885D612q74n34k1567k4937m3553q156J0829M3067O3264L858k7858q458O92K0052
22871A0437L4293k478r809k1612k1565j1764K7893J5292K579j0194K3416L5669
22859G2157J7801m0715m762j6430J4093J3784j0516m5175p454k1504J2750p462
22847b3433n514p511J1959L8872L282j4713l421o045k9938m4300j4969O6690P8641
22834D9600J3268K2391j824o4800m0896K0283L2932nl1883n685K9857J8916j8513
22821B3641l0103J4384J8356J0390M3662K4741m1758p2405R050K9103M0167j1387
22809E7841N397J2041m2830j8934L6500n700J2202k3469j3824k3050j1758r517
$$ plain form
22897 -6675 12498 31657 51176 30494 1424 41762 42544 25176 44896 20113 -10045 4612
22885 4612 3738 3204 -18363 -43300 -86853 -95009 -84180 -41113 22151 26009 -1849 -10307 -9615 10437
22871 10437 44730 42252 32443 10831 -10734 -22498 5395 20687 23266 13072 36488 72157
22859 72157 89958 49243 44481 28051 42144 55928 45412 237 -7217 -28721 -15971 -23433
22847 -23433 -28947 -36458 -24499 14373 17655 2942 -479 -6524 -36462 -80762 -95731 -29041 49600
22834 49600 62868 85259 83435 18635 -22261 -1978 30954 30949 -934 -6619 23238 42154 23641
22821 23641 -6462 7922 26278 36668 80330 105071 63313 -9092 -42 29061 69228 57841
22809 57841 63238 75279 32449 13515 50015 44315 56517 33048 19224 -3826 -15584 -25101
22797b5101j1796j0180j021J3975K1684k9003l8789M3778P2627J3922L408j5939
22785C7565j5840K4998J6533k0873J4234n096k5112k4002l3222l919L4814K1730
22773B1810m9080m3219L4673L0522n036J9660J3682J4521j5816j7890k0769l437
22761b0379j7879K7400K9033n2751l3478K9163P1680q602j5817J1409k6056j3402
22749a9679k8619J5282J4609j9191k7632m598L7082N7680Q139l3071k5933J9673
22737f258k5888L0222j0691J2112N349j2164M1467p247j4745J3309k8582l8531
22725d1647K793l854J6431j6352J7449J8857L8539J6039n50K2065O849p6215o2809
22712f2405j4674J4955o509L3523K4890J2749K2145N6083J7435j421L7124l5415
$$ plain form
22797 -25101 -36897 -47077 -48098 -34123 -12439 -41442 -80231 -36453 36174 50096 53504 37565
22785 37565 21725 46723 63256 42383 56617 51521 26409 2407 -30815 -34734 80 21810
22773 21810 -27270 -70489 -35816 -5294 -10330 9330 23012 37533 21717 3827 -16942 -20379
22761 -20379 -38258 -10858 18175 -34576 -68054 -38891 32789 24187 8370 19779 -6277 -19679
22749 -19679 -48298 -33016 -18407 -37598 -65230 -69828 -32746 24934 33073 2 -25931 -6258
22737 -6258 -32146 -1924 -12615 -503 4846 -7318 34149 26902 12157 25466 -3116 -41647
22725 -41647 -38854 -42708 -26277 -42629 -25180 -6323 32216 48255 47705 69770 76619 404 -62405
22712 -62405 -77079 -62124 -68633 -35110 -10220 2529 24674 80757 98192 96771 133895 98480
22700I8480q6167o062l8872J2621J5237L0348M195Q99j7132k3309l0505K5900
22688a4367j626q92j0699k0271L3680J2253j6005k3090j4607M6199j9157l4912
22676f3494J3310J250j1227J0063J4233K1911M7685L187l217m4659m0536k0180
22664g1674J0489j8487K3396r451K5465N4370L41k1152O762j0612K4263p765j8449
22651a2504J9487m552l8590J1826k31m2815P857L3289L064j632j3487K9906M282
22638d100L9627Q96L0824j1313k7936p842Q339N2276N687k1998l387n511j4523
22625D1039j5573Q830m2187j3799K8249Q070M3421N3393J4333j7136m7861m3601
22613A7178l6587J2837K816j0281m0024k0259k5261J0911L3094J5310n295n2955
$$ plain form
22700 98480 12313 6251 -32621 -20000 -4763 25585 29780 30679 13547 -9762 -40267 -14367
22688 -14367 -15993 -16885 -27584 -47855 -14175 -1922 -17927 -41017 -55624 -9425 -28582 -63494
22676 -63494 -50184 -48934 -60161 -50098 -35865 -13954 33731 36918 33701 -10958 -51494 -71674
22664 -71674 -61185 -79672 -56276 -65727 -40262 14108 14449 -6703 59 -10553 13710 5945 -12504
22651 -12504 6983 2431 -36159 -24333 -24564 -67379 -59522 -26233 -23169 -24801 -38288 -8382 -4100
22638 -4100 35527 36423 67247 55934 27998 20156 28495 80771 86458 64460 61073 55562 41039
22625 41039 25466 34296 -7891 -21690 6559 14629 58050 111443 125776 108640 60779 17178
22613 17178 -19409 -6572 -3756 -14037 -54061 -74320 -99581 -88670 -55576 -40266 -45561 -98516
22601i8516j8001L4238M8888O1480J6898j6317l7399j5812J2881P3368K6288j7801
22589G0195m0772m2642J1746J3911N041k8501k6199k7365J0383L2795K6382J1891
22577A6865n602M867L1773M695j9200k4823n7338m2720L2676K8061J3776M8939
22565C1969J1185j1155R093j6673l9649l3627k3847K2512K0422m3998R145K3310
22553d1313J6883K1763l0233m435K9857N7067J6454l2270q068j6605n0499j0937
22541e2336K1219n380k0327m796O831J9019m496j8245j6308L7237N4493J7197
22529C4108k9644k3628k3923N813O7507p973k9677O178o181L3495L8033L788m5891
22516B2005m5196J9232j527l1911K0213K1880L871q806K7368J12m8489j9221j3966
$$ plain form
22601 -98516 -116517 -82279 -33391 28089 44987 28670 -8729 -24541 -11660 61708 87996 70195
22589 70195 29423 -13219 -1473 12438 17479 -11022 -37221 -64586 -54203 -21408 4974 16865
22577 16865 11263 16130 47903 52598 33398 8575 -48763 -91483 -58807 -30746 -16970 31969
22565 31969 43154 31999 41092 24419 -15230 -48857 -72704 -50192 -29770 -73768 -64623 -41313
22553 -41313 -24430 -2667 -32900 -37335 -7478 49589 66043 33773 25705 9100 -41399 -52336
22541 -52336 -31117 -36497 -56824 -61620 -54789 -35770 -40266 -58511 -74819 -37582 16911 34108
22529 34108 4464 -19164 -43087 -37274 30233 22260 -7417 -1239 -7420 26075 64108 67896 22005
22516 22005 -23191 -3959 -5486 -37397 -17184 4696 8567 -239 27129 27241 -21248 -40469 -54435
22503e4435J1004K1441O8304J3897m3817m5232l7919J4749M5387j2899k5321O0837
22491A5996K7993m7798R294J2088l6182J1234J8933M367r33j696j5224o250l1518
22478c9696j3897J0217M103M629m114M8465J625j4715p038k1259k1394q277n234
22465f6585m4984K7021n03P529M5811p363L4326M2019P097m5327J1775l6509l3046
22452e8739j7988K2420L5385J2801k2968j446K9922Q217k8236n2670K2313K7499
22440b3490O0446K4306J1094k7511j5989K1246j1017k1405L029j5958j3015j0462
22428a8726j1288L969J5353J1371n0Q688L066m8146k9584O739m3694l528K3869
22415h1961K6N4879j3391k5556K4018J2781Q028l6851j7127l173J0828J3236N4653
$$ plain form
22503 -54435 -43431 -21990 46314 60211 16394 -28838 -66757 -52008 -6621 -19520 -44841 15996
22491 15996 43989 -3809 5485 17573 -18609 -7375 11558 15925 14992 13296 -1928 -8178 -39696
22478 -39696 -53593 -43376 -39273 -34644 -38758 9707 11332 -3383 -10421 -31680 -53074 -61351 -66585
22465 -66585 -111569 -84548 -85051 -77522 -31711 -39074 -4748 37271 44368 -959 10816 -25693 -58739
22452 -58739 -76727 -54307 -18922 -6121 -29089 -30535 -613 7604 -20632 -73302 -50989 -23490
22440 -23490 36956 61262 72356 44845 28856 50102 39085 17680 20709 4751 -8264 -18726
22428 -18726 -30014 -26045 -10692 679 629 9317 12383 -35763 -65347 -58608 -102302 -105830 -81961
22415 -81961 -81935 -27056 -40447 -66003 -41985 -29204 -21176 -58027 -75154 -78327 -67499 -54263 390
22402C90L9019J0300j7199l5012o0157m3162M1445O4224O578O423j5598j5451
22390a8200J0983k0889K0712K4410j2331k7861k498q604R10L3310J2449j3322
22378i31N330J0102O999J4756l6954j2724J7114J5496M3786k0332l8085k0832
22366a6275J5668L0346M9782L0047n1058n1390j076N224j6401l766J794j2826
22354a9931k5383K7996J1924o851Q214L984k562K427K6995L337P185P896o045
22341C9186r440j3307j397M0549j2769J8398K457m3279k1357n257k8327K6207
22329h336J3868l8029k3859K6977M809K823k2639L8176K7668j7888m1973k2850
22317f1253K4485K8592m227k6256j9694k88R782L462J1083M7431j8576m6413j5109
$$ plain form
22402 390 39409 49709 32510 -2502 -62659 -105821 -64376 -152 6426 12849 -2749 -18200
22390 -18200 -7217 -28106 -7394 17016 4685 -23176 -25674 -34278 -33368 -58 12391 -931
22378 -931 4399 14501 21500 36256 -698 -13422 3692 19188 62974 42642 4557 -16275
22366 -16275 -607 29739 79521 109568 58510 7120 6044 11268 -5133 -8899 -7105 -19931
22354 -19931 -45314 -17318 -5394 -12245 -4031 -47 -2609 -182 26813 30150 37335 45231 39186
22341 39186 29746 16439 15042 55591 42822 61220 63677 20398 -959 -6216 -34543 -8336
22329 -8336 5532 -32497 -56356 -29379 -24570 -21747 -44386 -6210 21458 3570 -38403 -61253
22317 -61253 -36768 -8176 -12403 -38659 -58353 -58641 -48859 -45397 -34314 13117 -5459 -51872 -66981
22304f6981r298K3890K9491k1326J0681J4392M797j3780o879L4604J4613K873
22292A7077J4747L0380q927j5962r05K0998k8601Q10o36J119L5645P531m2275
22279C1001k3731J6730l1182l9617M0958N5746j9193j5400j235j4956k4916j9039
22267d4834j4778L5296O2054K147l632j2675M8355m3511k8344L6261j8881P178
22255B4636K5425j5579k4962m2049n0018Q865J8342r641m659N738J4320j7173
22243f6755k0979q702J2868J0748k6308N1913Q993l0627L559L9365K7356K6721
22231B8152K3587j3916k4043o6000l2788L2371N8007J2454j4305R59J556K7095
22219C3129j4876j0716L8364l5543J2571O169k5707k2844N9469L970o6152o3760
$$ plain form
22304 -66981 -76279 -52389 -22898 -44224 -33543 -19151 -14354 -28134 -35013 -409 14204 17077
22292 17077 31824 62204 53277 37315 36410 57408 28807 29617 28981 30100 65745 73276 31001
22279 31001 7270 24000 -7182 -46799 -5841 49905 30712 15312 14077 -879 -25795 -44834
22267 -44834 -59612 -24316 37738 39885 36253 23578 71933 28422 78 36339 17458 24636
22255 24636 50061 34482 9520 -32529 -82547 -73682 -55340 -64981 -69640 -63902 -49582 -66755
22243 -66755 -87734 -96436 -83568 -72820 -99128 -47215 -38222 -68849 -65290 -25925 1431 28152
22231 28152 51739 37823 13780 -52220 -85008 -52637 5370 17824 3519 4478 6034 33129
22219 33129 18253 7537 45901 10358 22929 29098 3391 -19453 40016 43986 -22166 -85926
22207h5926M4962J0561n558J8157o030R64j048R068L0708N731J288k0330n6749
22194e4202o6311j8686M7792M6924J9428J5805p31K0108O1577K0716M056k9419
22182F7057m0381l8459J2679j3063J4074k3913j8956J9794j5893l8703J80k3444
22170i9028j6255K5425J4598N1947K0602j9862K2749L557J4087m6989m719j012
22158c4900j2279k7328M1726N7605K337j6093r181k6264m7047k7974K1073L9153
22146c9172o113o06K027l107N065j1092L2037J0997p297Q825K5566Q874k5305
22133F99l6289J0057P025K6360J1271J286K0461K134o91P386n292M2680p137o3473
22119A6477p694j101O887k5817R455K691J1802L82J1431j3918m553l646K6742
$$ plain form
22207 -85926 -40964 -30403 -35961 -17804 -23834 -22870 -23918 -14850 15858 21589 22877 2547 -54202
22194 -54202 -120513 -139199 -91407 -44483 -25055 -9250 -9981 10127 71704 92420 96476 67057
22182 67057 26676 -11783 896 -12167 1907 -22006 -40962 -21168 -37061 -75764 -75584 -99028
22170 -99028 -115283 -89858 -75260 -23313 -2711 -22573 176 3733 17820 -29169 -33888 -34900
22158 -34900 -47179 -74507 -32781 24824 27161 11068 1887 -24377 -71424 -99398 -78325 -39172
22146 -39172 -45285 -45891 -43864 -46971 -41906 -52998 -20961 -9964 -17261 -8436 17130 26004 699
22133 699 -35590 -25533 -18508 7852 19123 20409 40870 43004 42313 49699 44407 87087 79950 16477
22119 16477 8783 7682 14569 -11248 -1793 898 12700 13082 24513 10595 6042 2396 29138
22106B9138j7427m25J0445j413k1429m0652p232J9915J5822K5930l0344l5623
22094e3295k3824k0685n73M2168L7960J6213j7632j4287L225m8565K4837J1505
22082d2953k6434r259J4341L805L6330L4575R008j2448l8907j1155j787O980K4761
22069a3143J4155M7180L5122k9611m8740j2823j6186L5996J3946K0189l2464l9428
22057b5807L7581M071j1626k8255L4203L8442j6143J2405J0732o133j2330J2435
22045D9575j5126l5984J3755q874k9068k3387K336M5251L7317J1183J895k1539
22033B7334J6492Q997k2228m3566K824K7114j0756L3204J9787l280j061k8935
22021B5926P224j4243l0436j3488Q901l5491J6052O185j1537J8686K9076L3494
$$ plain form
22106 29138 11711 11286 21731 20318 -1111 -41763 -48995 -29080 -13258 12672 -17672 -53295
22094 -53295 -77119 -97804 -98377 -56209 -18249 -2036 -19668 -33955 -30730 -79295 -54458 -42953
22082 -42953 -69387 -78646 -64305 -60500 -24170 10405 19413 6965 -31942 -43097 -44884 -37904 -13143
22069 -13143 1012 48192 83314 53703 4963 -7860 -24046 11950 25896 46085 13621 -25807
22057 -25807 11774 15845 4219 -24036 10167 48609 32466 44871 55603 49470 37140 49575
22045 49575 34449 -1535 12220 3346 -25722 -49109 -46773 -1522 35795 46978 48873 27334
22033 27334 43826 52823 30595 -12971 -10147 16967 6211 39415 59202 55922 54861 25926
22021 25926 33150 18907 -11529 -25017 -16116 -51607 -35555 -29370 -40907 -22221 6855 40349
22009D0349j7132j9963o3273n2086m1052N2840N1457N4477l126k1146K350J4134
21997b171M732K6788J3657l6165J6008k8850j5727J0828J2552j6939P608J8940
21985A1261j381J6010p541O201O129l8633K369Q119M175N27o517p060k1048J660
21971b5729N0573K0005P205k2845l4718J1458k9602k8037M100L2337r748l8368
21959f3369L91M1083L8709P210O208m352L5441m2341l0330n644j1366K8541M016
21946D197J8578J0240p994q084k720k4239o27K5587p082L409J9193L658L936p7637
21932c9585l2822K761K1996J5193q651k2681K9494q901l6649M038R168R074J1489
21919d6076o066j1675l8282j6577K5609K2611L0918J779o660M8345j0848q520
$$ plain form
22009 40349 23217 3254 -60019 -112105 -153157 -100317 -48860 5617 2491 -18655 -16305 -2171
21997 -2171 2561 29349 43006 6841 22849 -6001 -21728 -10900 1652 -15287 -7679 11261
21985 11261 9880 25890 18349 24550 30679 -7954 -5585 2534 6709 7236 719 -6341 -27389 -25729
21971 -25729 24844 44849 52054 29209 -5509 5949 -23653 -51690 -47590 -15253 -25001 -63369
21959 -63369 -62978 -21895 16814 24024 30232 25880 61321 18980 -11350 -16994 -28360 181 4197
21946 4197 22775 33015 25021 16937 14217 -10022 -10649 14938 7856 11265 30458 34116 38052 -39585
21932 -39585 -72407 -69646 -47650 -32457 -41108 -63789 -34295 -43196 -79845 -75807 -66639 -57565 -46076
21919 -46076 -52142 -63817 -102099 -118676 -93067 -70456 -39538 -37759 -44419 3926 -6922 -15442
21907a5442j6241o259L189j9456M3960M660K0698L0503j5145j9338R91p37r766
21894A617Q135j8755l5440n444j6849l059O60L7128N8843O396N609l1359k1698
21881a4216j4285Q656J5233j0175p537L4460R412J1162j2425j8128k7459K5184
21869a18M5799l4123j3882L998k718j0045m6661m7950M9L3954K6185p330M9248
21856c594M0399m005n416m9119k3654m547j1086M1750K4080J0557K0608l1446
21844D527j6341j3687j8816J4276M8873m594n1330N5085L9387L949o494m5042
21832I793l8876j0335q562J7303J5177J0129l4529J5557K6584k7604M2928L6994
21820E4559j4637J5954o183l0901n6821K0564N328j0464K1381J6933j6773j9436
$$ plain form
21907 -15442 -31683 -37942 -34753 -54209 -10249 -5589 15109 45612 30467 11129 12120 11383 1617
21894 1617 9752 -9003 -44443 -49887 -66736 -69795 -69135 -32007 26836 33232 38841 7482 -14216
21881 -14216 -28501 -19845 -4612 -14787 -22324 12136 21548 32710 20285 2157 -25302 -118
21869 -118 45681 11558 -2324 1674 -1044 -11089 -57750 -105700 -105651 -71697 -45512 -52842 -3594
21856 -3594 36805 32800 27384 -21735 -45389 -49936 -61022 -19272 4808 15365 35973 4527
21844 4527 -11814 -25501 -44317 -30041 18832 14238 -37092 17993 57380 61329 54835 9793
21832 9793 -29083 -39418 -47980 -30677 -15500 -5371 -39900 -24343 2241 -25363 17565 54559
21820 54559 39922 55876 49693 18792 -38029 -17465 -12137 -22601 -1220 15713 -1060 -20496
21808b0496K7798N992k7729l4920j7359N2726L5612J9720j9167k3760j7926J4293
21796e216K0903j2115k4246k8781j2992O7515P018l4429m8273n9112L1299N4217
21784d4212q19j4011j6543N083J5307K5405m240K9610K0291o588o431J3298j0776
21771E374j0619o206k1137N050q503n4434q601L3259l596K6472K4705K4990k190
21758D564L96j2584L8731j1044k6016j1261J0309j78j0925j4336j5807O4242M2451
21745E8542j4322j6225j0992n567l633j5625M4152r369j1337P548L1596k9439
21733B5329k6975j3889k0850n092k599O0423K2572k1285n7945l6405M4213K8340
21721d163J7942K4062l1842j4591k9291j2853m569K9094M921j280L2881J4520
$$ plain form
21808 -20496 7302 13294 -14435 -49355 -66714 -13988 21624 41344 22177 -1583 -19509 -5216
21796 -5216 15687 3572 -20674 -49455 -62447 5068 12086 -22343 -70616 -129728 -98429 -44212
21784 -44212 -45031 -59042 -75585 -70502 -55195 -29790 -34030 -4420 15871 9283 2852 16150 5374
21771 5374 -5245 -11451 -32588 -27538 -36041 -90475 -99076 -65817 -69413 -42941 -18236 6754 4564
21758 4564 4960 -7624 31107 20063 -5953 -17214 -6905 -7083 -18008 -32344 -48151 16091 58542
21745 58542 44220 27995 17003 11436 7803 -7822 36330 26961 15624 23172 54768 25329
21733 25329 -1646 -15535 -36385 -41477 -44076 16347 38919 17634 -40311 -76716 -32503 -4163
21721 -4163 13779 37841 5999 -8592 -37883 -50736 -55305 -26211 -21290 -22570 10311 24831
21709B4831R809j8585k8717l2381O741k8084J8840j757j7385L4095K1105J7390
21697E902J6876K2190J9300n149p562m8006L6261K9541l054o518n808k5682L1984
21684F0275J9369l2686m8860j7532l2204j0534q89L2281K3197J5606O060r221
21672D862l7144K6000L8128m5106K3197L1395Q890m8165L093K6182j311P129l3325
21659C825m6097N9379N9890j4744n7125j6060o81j5449j924M3756l2412m793j7219
21646c9654l8170J228J6289K1594J0K8030J5368K2224j518K425q2l2079K6313
21633B1978K1399K0417k5670k2474j2320q070L1020J5318J0437J0992L408l2616
21621C3819j4113k5459P777R414l9686j0861J0102j5706J749J2732j2318j1677
$$ plain form
21709 24831 34640 16055 -12662 -45043 -38302 -66386 -47546 -49303 -66688 -32593 -11488 5902
21697 5902 22778 44968 64268 59119 51557 3551 39812 69353 66299 59781 53973 28291 60275
21684 60275 79644 46958 -1902 -19434 -51638 -62172 -63061 -30780 -7583 8023 14083 4862
21672 4862 -32282 -6282 31846 -13260 9937 41332 50222 2057 5150 31332 30021 37150 3825
21659 3825 -42272 17107 76997 62253 5128 -10932 -11613 -27062 -28986 14770 -17642 -22435 -39654
21646 -39654 -77824 -76596 -60307 -38713 -38703 -10673 4695 26919 25401 27826 27744 -4335 21978
21633 21978 43377 63794 38124 15650 3330 -4740 26280 41598 52035 63027 66435 33819
21621 33819 19706 -5753 2024 11438 -28248 -39109 -29007 -44713 -42964 -30232 -42550 -54227
21609e4227p621j1605K0798k597O104K9833l795M0913j9608k9416L6926J2396
21597A8101K3409l7501l3840l6038p534L1739N836k4491j1077L664l9342J7355
21585h9719j0247K0518O0596k549J7094j1922K7058L7729N204J1933l9664N547
21573C1578p276J718K2349J2303m9450l2037j8079p508J9470k7410M580K954j5056
21560f1864q372K0743J5240O59L794r247K696J3128p842L5079K5173j7681j4886
21547c380k0128n2153J8831J8629j3244K1662L0014j3484M488K2999K5716n773
21535C4177J0952L1199K9511m8133N262K047l6187k240M242O316j5203j6658j970
21522C315K988J4122J4462j8534l273J1435M224k140K2884j826o318K7503R207
$$ plain form
21609 -54227 -61848 -73453 -52655 -55252 -49148 -19315 -23110 17803 -1805 -31221 5705 18101
21597 18101 41510 4009 -29831 -65869 -73403 -41664 -35828 -60319 -71396 -67732 -107074 -89719
21585 -89719 -99966 -79448 -18852 -21401 -4307 -16229 10829 48558 53762 65695 26031 31578
21573 31578 24302 26020 48369 60672 11222 -20815 -38894 -46402 -26932 -54342 -49762 -46808 -61864
21560 -61864 -70236 -49493 -34253 -33594 -29800 -39047 -36351 -23223 -31065 4014 29187 11506 -3380
21547 -3380 -23508 -75661 -56830 -38201 -51445 -29783 231 -13253 -8765 14234 39950 34177
21535 34177 45129 76328 105839 57706 62968 65015 28828 26588 30830 37146 21943 5285 3315
21522 3315 6303 20425 34887 16353 13080 24515 28739 26599 49483 47657 41339 68842 78049
21509G8049k0651l1143n4208m6926Q682K6931K0348p129L0060L7938J3970K809
21497E8730k2045J1530O708j6449o717j596m1889j2453J664J5089J5821J1996
21485B0389J5875k3441j3851L0859K3914J0433m0894l3469j1427J9933J4751q003
21473E069j8681L827O202o747K6856Q427K1115K1115l3771M83q043j6686k1814
21460a2648J4400j02J4889o454O480Q485P984j7301O624q077l1876j6445j0073
21447d4114M1306k1124k1239J7286J6593m005Q908k4101J0163j174J0926j2689
21435b3264j3303L2688N26Q137l1388l4226K6168N5405J2329j9271m96j0279l685
21422f59k3552J3762m5419l2495M3966M7730L6634j3846l0406o562r86O64j0344
$$ plain form
21509 78049 57398 26255 -27953 -74879 -66197 -39266 -18918 -26047 4013 41951 55921 58730
21497 58730 36685 48215 54923 38474 31757 30161 -11728 -24181 -22517 -7428 8393 20389
21485 20389 36264 12823 -1028 29831 53745 64178 23284 -10185 -21612 -1679 13072 5069
21473 5069 -13612 -9785 -3583 -10330 16526 24953 46068 67183 33412 33895 25852 9166 -12648
21460 -12648 1752 1650 16539 10085 16565 25050 33034 15733 22357 14280 -17596 -34041 -44114
21447 -44114 -2808 -23932 -45171 -27885 -11292 -15297 -6389 -30490 -20327 -21501 -10575 -23264
21435 -23264 -36567 -3879 -3353 4784 -26604 -60830 -34662 20743 33072 13801 13305 3026 -659
21422 -659 -24211 -10449 -55868 -88363 -44397 3333 39967 26121 -4285 -10847 -11833 -11169 -21513
21409b1513p030J2178K4784l1069J5577l7792j6193L1046J8061N498J2368m1026
21397c5111j0118K2702K0196m3435J4845o560r811p97K922O141k539L3006P219
21384a340j6243l5373m130J2046N4393R842L139j691k5235p959K457L3300L1272
21371E4478N4951k084p6612j3637L2635K7156J2027j6663l00p1760L166J7540
21359B0897R328j1508k291P1260n170l779l4919j8095J6034j995L645k0888O531
21346B9050l0914J7313L1388l7154k8145k3668j4804L8002M5391J4175j3974j3801
21334A2859L6877N7463J50l6005K3329l7012J2905r527l977m543j712J2550m949
21321E8408l8175r492J9895J3050P973j2171k7963o174k1248p529J6420P828K9008
$$ plain form
21409 -21513 -28543 -16365 8419 -22650 -7073 -44865 -61058 -30012 -11951 -6453 5915 -35111
21397 -35111 -45229 -22527 -2331 -45766 -30921 -37481 -47292 -48089 -45167 -39026 -41565 -8559 -1340
21384 -1340 -17583 -52956 -57086 -45040 9353 19195 22334 20643 -4592 -12551 -10094 23206 54478
21371 54478 109429 107345 30733 17096 49731 76887 88914 72251 71951 191 3357 20897
21359 20897 30225 18717 16426 87686 82516 78737 43818 25723 41757 39762 43407 22519 29050
21346 29050 -1864 15449 46837 9683 -18462 -42130 -56934 -18932 26459 40634 26660 12859
21334 12859 49736 107199 107349 71344 94673 57661 70566 61039 57062 52519 50807 63357 58408
21321 58408 20233 10741 30636 43686 51659 39488 11525 5351 -15897 -23426 -7006 822 29830
21308B9830j4847M1994K043m6035l7107j6490m37K2058O060j0222L7030k7186
21296a3309l0052J9330J7871l452j2371J5840j3214l5475j4074J4165L8219L6948
21284B0426l0580j3822o443j988M1926J9103J4777l6300l4900J3697K3127j6312
21272g289Q682l403K7065K7620l3414k0744j1778j4358n106K7645L751L3624J9546
21259E1841k7760j1432J2515j3153m48k1215l0530K5221J9563k7430m17J8663
21247d582M4948Q238R861J2257m4115M66P20m6800l6011j4507j9706m288K6992
21234f6527l18J5841K1440J6719J5962J313k7260N225m448K7153j0o8048J949
21221f1009N4381M3620j3658j5388K1959m242m9385l3279j6302K0679j5631Q62
$$ plain form
21308 29830 14983 56977 59020 12985 -24122 -40612 -41049 -18991 -12931 -23153 13877 -13309
21296 -13309 -43361 -24031 -6160 -9612 -21983 -6143 -19357 -54832 -68906 -54741 -16522 20426
21284 20426 -10154 -23976 -30419 -32407 9519 28622 43399 7099 -27801 -14104 9023 -7289
21272 -7289 1393 -2010 25055 52675 19261 -1483 -13261 -27619 -32725 -5080 -1329 32295 51841
21259 51841 24081 12649 25164 12011 11563 -9652 -40182 -14961 4602 -22828 -23245 -4582
21247 -4582 40366 48604 58465 70722 26607 27073 27793 -19007 -55018 -69525 -89231 -93519 -66527
21234 -66527 -66845 -51004 -29564 -12845 3117 4430 -22830 -17605 -22053 5100 5090 -62958 -61009
21221 -61009 -6628 36992 23334 7946 29905 25663 -23722 -57001 -73303 -52624 -68255 -67393
21209f7393M0802M1076L1589j0715k1126r446J0993N7591l839l6096J7113K0329
21197G0878K8358o764l2041j4951j3372L0240N699m4014n3062k8144K6516J2819
21185a7838M0637J0153K2255m5863n8475M0391J628k0325J5637p266j2361k802
21173c4229l65N507M9576m97K4413J9149l9519l0184L1577p435J567n513K34j4194
21159H7J30J5015l2533q322J0249K4601K0285J3310j1680j4025n7384k986k5057
21146f8310j5481J9784Q9333K4548k6143M2476L89L7541L7977j9388J4305q865
21134A28166j3328k0129m8554m0557L2315K7408m3836l9495l8204j837J5065J0359
21122c2627l882L3648K274k5099M593l068k6674J7568L2280L6719M110r683K710
$$ plain form
21209 -67393 -26591 14485 46074 35359 14233 4787 15780 73371 69532 33436 50549 70878
21197 70878 99236 92472 60431 45480 32108 62348 68047 24033 -29029 -57173 -30657 -17838
21185 -17838 22799 32952 55207 9344 -49131 -8740 -7112 -27437 -11800 -19066 -31427 -34229
21173 -34229 -34594 -29087 20489 19992 44405 63554 24035 -6149 25428 17993 19560 14047 14281 87
21159 87 217 15232 -17301 -25623 -15374 9227 29512 42822 31142 17117 -40267 -43253 -68310
21146 -68310 -83791 -64007 25326 49874 23731 66207 66596 104137 142114 122726 137031 128166
21134 128166 114838 94709 46155 5598 37913 65321 21485 -18010 -56214 -58051 -42986 -32627
21122 -32627 -36509 -2861 -587 -25686 -21093 -24161 -50835 -33267 -987 35732 39842 30159 32869
21109C2869J5908J75l0897m1611k3943K3368J8484p278m1173k2495L6124P8630
21097C8161j0948o980r601j7735J839k5902j3073K1681o797j4230l4951N0262
21085b8274K6441j9753R033J9446L1318Q351m1933j2996J4976L4665k2554J7126
21073C5846K7476j0413P615l7470J0046n501j7506k5689r9J9798p493L6527k362
21060C0775j5901j5130N3988L884m2385n0793k3964J7487K9735j0656q387J6911
21048a4436K3346J9119j2024k8843j1605k9413R432K3279j5653l608K7844K5296
21036A2734K1009L3677K2720p15K93l7914m8326L967K5468j2137l272l9134J8903
21023b727M4446L8268p031n2623k1826N428J1591k1277k2396K4063M3904q583
$$ plain form
21109 32869 48777 48952 18055 -23556 -47499 -24131 -5647 -12925 -54098 -76593 -40469 38161
21097 38161 27213 20233 10632 -7103 -5264 -31166 -44239 -22558 -29355 -43585 -78536 -28274
21085 -28274 -1833 -21586 -12553 6893 38211 46562 4629 -8367 6609 41274 18720 35846
21073 35846 63322 52909 60524 23054 33100 27599 10093 -15596 -15695 4103 -3390 33137 30775
21060 30775 14874 -256 53732 57616 15231 -35562 -59526 -42039 -12304 -22960 -31347 -14436
21048 -14436 8910 28029 16005 -12838 -24443 -53856 -44424 -21145 -36798 -40406 -12562 12734
21036 12734 33743 67420 90140 89425 89718 51804 3478 7445 32913 20776 17504 -21630 -2727
21023 -2727 41719 79987 72956 20333 -1493 3935 15526 -5751 -28147 -4084 39820 31237
21011C1237j4307l82K9653j637l3567l5782j4772p272L0071R095l2199o0028L6322
20998f3568N8161L1164K52k9184j6597K788K3132o074l8467p261N961k683L5600
20985f776L4150k3494j6386j1065p163J6013j9498O5238M9567j5455k5568j7324
20973B2239K7004Q965k9896l46k851J6301K2553k7236m4723q876J1802p584K7739
20960A5091l546L6350k6699l343k7796l8512N5185N1387J7944k8584J830n0457
20948a150m0458K8794K9179N1282R197j3292l2239K560M4735J1781m4850j4126
20936C1413l3098k7214L1931R046j5651L467J2236J8520N6068p780n8726o3519
20924d3307k3167N1366N7282j7466J4464l089n317l5740J0360k665K6347L3198
$$ plain form
21011 31237 16930 16548 46201 44564 10997 -24785 -39557 -46829 -16758 -7663 -39862 -99890 -63568
20998 -63568 -5407 25757 26009 -3175 -19772 -16984 6148 74 -38393 -45654 -39693 -42376 -6776
20985 -6776 27374 3880 -12506 -23571 -30734 -14721 -34219 31019 80586 65131 39563 22239
20973 22239 49243 58208 28312 27966 25115 41416 63969 36733 -7990 -16866 -5064 -12648 15091
20960 15091 11545 47895 21196 17853 -9943 -48455 6730 58117 76061 47477 49307 -1150
20948 -1150 -41608 -12814 16365 67647 76844 63552 31313 33873 78608 90389 45539 31413
20936 31413 -1685 -28899 3032 12078 -3573 -106 12130 30650 86718 78938 20212 -43307
20924 -43307 -66474 -15108 42174 24708 39172 36083 30766 -4974 5386 2721 29068 62266
20912F2266j1363n1946l1015m4721k3570M5128O8924O899m9922k8101L946L2510
20900b0965M7165K006l3380J7160J8958K1006J0850Q774j7994j2600m023N3660
20888I0617J7263J4992j1555m8042j3052k5511j4706J8202L9491M6917r297o017
20876I9302m1292j2077J3501j0226n6110j3569j102k1275K8953O971N0229L188
20864D6493m0237L1672K2383K1497j9563J9109j8913J3947j2154l4409L0621l0841
20852B9605L7789J3405j9817N716Q0J5694L0849j2891k4498p596L1452K6478j4816
20839A11450p597j9457L6j2364J1176J3346j3160J0323K8079o550n0776j1119
20827E3387p982K2624j8447K1993L4297Q001j8883m725M382j6523r760K0967J1866
$$ plain form
20912 62266 50903 -1043 -32058 -76779 -100349 -55221 13703 20602 -29320 -57421 -53475 -20965
20900 -20965 26200 28206 -5174 11986 30944 51950 62800 71574 53580 40980 36957 90617
20888 90617 107880 122872 111317 63275 50223 24712 10006 28208 67699 114616 105319 99302
20876 99302 58010 45933 59434 49208 -6902 -20471 -21573 -42848 -13895 -6924 43305 46493
20864 46493 6256 37928 60311 81808 62245 81354 62441 76388 64234 29825 60446 29605
20852 29605 67394 80799 60982 66698 66778 82472 113321 100430 75932 68336 99788 126266 111450
20839 111450 103853 84396 84432 72068 83244 96590 83430 93753 121832 115282 64506 53387
20827 53387 45405 68029 49582 71575 105872 113873 94990 90265 94647 78124 68364 89331 101197
20814A01197K7280M9058L9270L8267K9646O7968M9454Q7364J02858R3983R9153
20803G85498J0398o2526p2647q9406j09785p0942n1812n79M066r75L8088Q7863
20791D67241K4247P8238R9160J07332J13512M5545l1774l4530p3435j06662r1882
20780E96992l6531L4562M4309N8511Q1684R4569N7551K9275p5807j20409j32119
20769F32587p3393k3345p3594q7253j7423N5432L9516M6642O1340P4852P1210
20758G06571J09131Q7345j0852K0009l5968j45415j45527r2076r8331m6092k7878
20747C20917n7903n0714K918J0005j5162n173j2297J6047J1155k1196l9860j0146
20735A48591M723K317n8150K5866L458J072K5529k5589l9464K1636J8921K9172
$$ plain form
20814 101197 128477 177535 216805 255072 284718 352686 402140 489504 592362 686345 785498
20803 785498 795896 733370 660723 571317 461532 390590 338778 338199 342265 341290 379378 467241
20791 467241 491488 569726 668886 776218 889730 935275 903501 868971 795536 688874 596992
20780 596992 560461 595023 639332 697843 779527 874096 931647 960922 885115 764706 632587
20769 632587 559194 535849 462255 375002 357579 413011 452527 499169 560509 635361 706571
20758 706571 815702 903047 892195 912204 876236 730821 585294 493218 394887 348795 320917
20747 320917 263014 212300 215218 225223 210061 204888 192591 208638 219793 198597 158737 148591
20735 148591 153314 155631 97481 123347 126805 127877 153406 127817 88353 109989 128910 158082
20723A58082M813m6718o2875j1274M7695O645l4511J8684J7624J3834j7107l0123
20711F4769L1812K8411J0992k1037k589k7456m9026p9380J7824K4235J6051k7800
20699a3194k7992P821k6641N181O9178L5043j4413O375j4540l6448l536J6706
20687C540q776o6063k7999Q589j460j2938j8513R461K2022K7564L83L2225K8939
20674c026K696l3526J0845M5578P2784J7787l9190l1459J2377K6450K3274k5725
20662G8865k5687M4731J4932j0606k5234l4662m6649k8962P4362o649l7534k642
20650e735o473k739k8456k7238Q038M9700P543j712L8039O2761L7582M4463K0203
20637A95976m4597m3083j7752n7057m2701L903M6422O1588m960l7542n0432O764
$$ plain form
20723 158082 162895 116177 53302 42028 89723 96368 61857 80541 98165 111999 94892 64769
20711 64769 96581 124992 135984 114947 112358 84902 35876 -43504 -25680 -1445 14606 -13194
20699 -13194 -41186 -33365 -60006 -54825 14353 49396 34983 41358 26818 -9630 -13166 3540
20687 3540 -5236 -71299 -99298 -90709 -92169 -105107 -123620 -114159 -92137 -64573 -64190 -31965 -3026
20674 -3026 -330 -33856 -23011 22567 95351 113138 73948 42489 54866 81316 104590 78865
20662 78865 53178 97909 112841 102235 77001 42339 -4310 -33272 41090 34441 -3093 -5735
20650 -5735 -12208 -14947 -43403 -70641 -62603 -12903 -5360 -7072 30967 93728 131310 175773 195976
20637 195976 151379 108296 90544 33487 -9214 -5311 41111 102699 97739 60197 9765 16529
20625A6529J0766j0628q869Q887O1913j9053J9206L5515j0389K1611q580k4428
20613I2480K2821q342J6065M226j1865k3259j2489j9439N231K4803M1942j3144
20601A19030m787q658j3013J160j3767J3832J1773o003l4309m5120K2332Q480
20589E0950L1j0405L0146J0396q669j4357L1199J9255o6770M551j9576l6621K1191
20576A1321L8946N84K2418J6331m01l0434J2736M590L247m245K2744K103L4524
20563A34464O960K6845q34j0902n5336Q107O442k1585k7948l2001J2059j0952
20551C5319K1426K0950K9270K7644K8887q357n2683J5372J1980j1434J1490j9972
20539A09892J0581j1326k1160L3610j5204j0712J7437m2213k2806l3662J5545
$$ plain form
20625 16529 27295 16667 7798 16685 78598 59545 78751 114266 103877 125488 116908 92480
20613 92480 115301 106959 123024 127250 115385 92126 79637 60198 65429 90232 132174 119030
20601 119030 114243 105585 92572 93732 79965 93797 105570 99567 65258 20138 42470 50950
20589 50950 50981 40576 70722 81118 72449 58092 89291 108546 41776 46327 26751 -9870 11321
20576 11321 50267 50851 73269 89600 89199 58765 71501 76091 79338 75093 97837 99940 134464
20563 134464 141424 168269 167435 156533 101197 109304 115746 94161 66213 34212 46271 35319
20551 35319 56745 77695 106965 134609 163496 155139 102456 117828 129808 118374 129864 109892
20539 109892 120473 109147 87987 121597 106393 95681 113118 70905 48099 14437 29982
20528B9982J0098L6256K3140l2173P554J4495M670k6173q799L3456L4792k84k043
20515A24971j5165l736j7777l8628j7236M6101Q7636K6770n6735j9870J7099N236
20503A38666n3015j652m978j889j5492n754O989J3495M77K6491P0082M7849N9713
20490B80982j5907j4710J133K9083m0171j5234J7267K2281J4572J1293Q602l133
20478B96058J7507l5593l9017o2J9423N0924J8451M02O4607N2415k5457K311K4938
20465D46907K5766P214l6539K9963o1252m9067l2793j5256J1652K2879l5845m9681
20453B63948j3113j1918k1939j3591j1621p815J3825N1698N2255L0923M1413L3294
20441D07359K4675O1178l2J4878m0230L4740L6539m4796P884j9797m0553J2139
$$ plain form
20528 29982 40080 76336 99476 67303 74857 89352 94022 67849 59050 92506 127298 127014 124971
20515 124971 109806 106070 88293 49665 32429 78530 166166 192936 136201 116331 133430 138666
20503 138666 85651 83999 79021 77132 61640 55886 62875 76370 76847 103338 173420 221269 280982
20490 280982 265075 250365 251498 280581 240410 225176 242443 264724 279296 290589 299191 296058
20478 296058 313565 277972 238955 238893 258316 309240 327691 328093 392700 445115 419658 421969 446907
20465 446907 472673 479887 443348 473311 412059 362992 330199 314943 326595 349474 313629 263948
20453 263948 250835 238917 216978 203387 191766 183951 197776 249474 301729 332652 374065 407359
20441 407359 432034 493212 493180 508058 467828 502568 539107 494311 502195 482398 441845 453984
20429D53984j9236m55N935k0882n0373m2774l2392J5488J3554j9259j5677N0223
20417C38136K1600Q775J2264j7442o00J2197M364k5399J453M2836P909J7723M3631
20404D67447J5302n0774o4215o3119m4733k3696j5740L0248q60k8366R627n02
20392B30619j3398Q6629P692n0214j4874J8640K4338K3586O676q955J2065m0816
20380B81988J1153J7227J7307J2820j7868J1154P209L0748k6472q9426q4103j4909
20368A56828j4072J9775N9725R6929J10647P5660J00706P2200O945l1685l420
20357F50238J9475K3064M817K4331n316Q526M2808J2217L70O814j32N6881K7344
20344H71437K8447Q0902J4691m9281j22338j15961o2319m5601L1463R2519Q7457
$$ plain form
20429 453984 434748 434293 440228 419346 368973 326199 293807 309295 322849 303590 287913 338136
20417 338136 359736 368511 380775 363333 362733 374930 379294 353895 355348 398184 406093 423816 467447
20404 467447 482749 431975 367760 304641 259908 236212 220472 250720 249860 221494 231121 230619
20392 230619 217221 303850 311542 261328 246454 265094 289432 313018 319694 310739 322804 281988
20380 281988 293141 310368 327675 340495 322627 333781 340990 371738 345266 255840 171737 156828
20368 156828 142756 162531 222256 319185 429832 505492 606198 678398 685343 653658 650238
20357 650238 669713 692777 697594 721925 716609 725135 767943 780160 780530 787344 787212 844093 871437
20344 871437 899884 980786 995477 946196 823858 707897 645578 599977 631440 723959 811416
20333H11416P0245M2764N6192Q7076P8216J5566J2490L2988P1824P4776O8914
20322A422467J19937J39015K21427K75440L37017L97942M14889L14790J72478
20313C815402l8475k86868l54078l26242l15984k81610k21686r6733l8165p7993
20303A777568o0040j7057K2589L3322M4685m1951J3553L6785N5410R3668Q5728
20292B044260R4188J19058J76678J81213K52391L60013M37523L91978K28899L8513
20282D324714k30029l37271k98696k68154j95063o7456p4070q0789Q529K6689
20272B808404K7383J9019J2088Q0008N3643M8306R0505R0465J22084J19497K00823
20261C672225K28650K90209L15738L16672L07251K66594R0299m5316r7045j39690
$$ plain form
20333 811416 881661 924425 980617 1067693 1145909 1161475 1173965 1206953 1278777 1353553 1422467
20322 1422467 1542404 1681419 1902846 2178286 2515303 2913245 3328134 3642924 3815402
20313 3815402 3776927 3490059 3135981 2809739 2493755 2212145 1990459 1893726 1855561 1777568
20303 1777568 1717528 1700471 1723060 1756382 1801067 1759116 1772669 1809454 1864864 1958532 2044260
20292 2044260 2138448 2257506 2434184 2615397 2867788 3227801 3665324 4057302 4286201 4324714
20282 4324714 4094685 3757414 3458718 3190564 2995501 2928045 2853975 2773186 2781715 2808404
20272 2808404 2835787 2854806 2866894 2946902 3000545 3048851 3139356 3229821 3351905 3471402 3672225
20261 3672225 3900875 4191084 4506822 4823494 5130745 5397339 5487638 5442322 5345277 5205587
20251E205587j25412J1408P8556J29356K28235L02159L29473M13232M87943N42092
20241G602629O67322O39030N53011N47608N79028O16474O34388O55187O70693
20232A3165370Q30295J114443J412256J725286K077162K459185K902278L387158
20224B9073433L964013M757597N859174P523077R801802J2872045J7116202K3039152
20216A14006495L0839690L9550995M4583616L8349384J8044999r871049l4104680
20209B41399450m3343039l8415230k9119585k0974890j5087923j1120109q481211
20202G4857463o576046n053063l666402k486020j541700o34313K34914J210746
20194E6345579K167498L236488M452849O002485Q028734J0662981J4255284J9212304
$$ plain form
20251 5205587 5080175 5091583 5170139 5299495 5527730 5829889 6159362 6572594 7060537 7602629
20241 7602629 8269951 8908981 9461992 10009600 10588628 11205102 11839490 12494677 13165370
20232 13165370 13995665 15110108 16522364 18247650 20324812 22783997 25686275 29073433
20224 29073433 33037446 37795043 43654217 51177294 60979096 73851141 90967343 114006495
20216 114006495 144846185 184397180 228980796 267330180 285375179 275504130 241399450
20209 241399450 198056411 159641181 130521596 109546706 94458783 83338674 74857463
20202 74857463 68281417 63228354 59561952 57075932 55534232 54899919 55134833 56345579
20194 56345579 58513077 61749565 66202414 72204899 80233633 90896614 105151898 124364202
20186A24364202K6065738L4746144M2589257M3027884K9404268L533018k5179732
20179B78550779m3847954m5189830l6667053k7192543j9865222j4655185j1158127
20172G9974865q773761p042601n722327m746359m041286l548435l038994k547615
20164D0513487k157341j843144j552918j423954j327657j193778j151226j096883
20156B8766586j152699j260543j338734j319865j268134j213625j203919j268040
20148A8741027j227221j159451j075940r22089q27529p33108n87211m48159m52104
20139A1308215m04561n02546n87877o00868n83931n43873m86736m75939m30364
20130F691520m13636l97620l50679l09727k86414k02944j96012k28573j70557
$$ plain form
20186 124364202 150429940 185176084 227765341 270793225 300197493 303730511 278550779
20179 278550779 234702825 189512995 152845942 125653399 105788177 91132992 79974865
20172 79974865 71201104 64158503 58436176 53689817 49648531 46100096 43061102 40513487
20164 40513487 38356146 36513002 34960084 33536130 32208473 31014695 29863469 28766586
20156 28766586 27613887 26353344 25014610 23694745 22426611 21212986 20009067 18741027
20148 18741027 17513806 16354355 15278415 14356326 13528797 12795689 12208478 11760319 11308215
20139 11308215 10903654 10401108 9813231 9212363 8628432 8084559 7597823 7121884 6691520
20130 6691520 6277884 5880264 5529585 5219858 4933444 4730500 4534488 4305915 4135358
20121D135358k07520k19616j48939j34977j33862j04395r3816j24084j39734j07654
20111B720761o3718q1560j36683p1753r1452p2605r7442r8538q2107l2586k7997
20100A864320l6927q4635k2169q126o1053n3521j9025j4367L2278K9770l4548
20089A591997p9189m3074j01364j32273j17934j04416o4694n5637o9890n7310
20079G66216p984l0450q0793j1394L3891j7289j1614L4847N2179k3391k1602m9089
20067F33527m8734j094M3254R8271K8274Q54O7963Q3050J03896J33931R3801N7455
20055A294448J34q7417j08397q1496j49508j17360k2771l0674j7656k441k8329
20044F48533l8044l3764j3748K6625J2013k0j0720L69l1928k9587J6112J00796
$$ plain form
20121 4135358 3927838 3708222 3559283 3424306 3290444 3186049 3092233 2968149 2828415 2720761
20111 2720761 2657043 2575483 2438800 2367047 2275595 2202990 2105548 2007010 1924903 1892317 1864320
20100 1864320 1827393 1742758 1720589 1712463 1651410 1597889 1578864 1564497 1596775 1626545 1591997
20089 1591997 1512808 1469734 1368370 1236097 1118163 1013747 949053 893416 823526 766216
20079 766216 758232 727782 646989 635595 669486 652197 640583 675430 727609 704218 682616 633527
20067 633527 584793 583699 626953 725224 753498 754352 822315 905365 1009261 1143192 1236993 1294448
20055 1294448 1294582 1207165 1098768 1017272 867764 750404 727633 696959 679303 676862 648533
20044 648533 610489 576725 562977 589602 601615 601595 590875 591244 559316 529729 545841 646637
20032F46637M1087L2338M8660O7847J21658J00966L9027N8906M8717m7593j05846
20021A052404r9254r6616n5821l6844p655l3318k0290K7536M6823l138n3057o2001
20009F58769n5004p3616J3519K1294L3055N4269j164l087J322L685J6216k1715
19997F47543p3776j9656J7654l3723l0637l7163p6016l1151l3867n6023L6483
19986C09668O2711J8501n0480o2807j3142j6885q268L0072N7087K3570L6620N663
19974C92310k8181L0481j0477m3165m2768k9316n9J1655K814j9441Q044j1734
19962B60163L1235L8797L66J8635o89k9387m7597m1754l709K7399p351j0193k4188
19949B11727J6341J0649K1944k7855p535l1518L02m1092N697L0202N0222J2733
$$ plain form
20032 646637 687724 720062 768722 836569 958227 1059193 1098220 1157126 1205843 1158250 1052404
20021 1052404 953150 856534 800713 763869 756214 722896 702606 730142 776965 773827 720770 658769
20009 658769 603765 530149 543668 564962 598017 652286 651122 648035 649357 653042 669258 647543
19997 647543 573767 554111 571765 538042 507405 470242 394226 363075 329208 273185 309668
19986 309668 372379 390880 340400 277593 264451 247566 239298 269370 326457 350027 386647 392310
19974 392310 364129 394610 384133 340968 298200 268884 268825 280480 283294 263853 271897 260163
19962 260163 291398 330195 330561 349196 348507 319120 271523 229769 226060 253459 246108 235915 211727
19949 211727 228068 238717 260661 232806 225271 193753 194055 152963 158660 188862 239084 251817
19937B51817K260k0252k9731m7908J9978J4604J0324j4279n393K8547p237o229
19925A96501K1184j5609m5949j468K4962K6633J3764K1207K2706O179j4135l2031
19913B23944k0533o5321k1957K2403K4018n713J0288k254j2622j6128l0365L4066
19901A39826N1135P825Q185r37K6709k1167l2074k0828K9908K6308M8440m74l065
19888B59791L772k406l4026m5855m0118K3084O3797L1151J7361o066m4186k7626
19876A98673k4816M4851K5816J8875J4985k3163m9928J4253K9281K6372k6317
19865B48882l8845m5439k6044P6193j3842l4918k6778R313K1356K3682O066k0773
19853A78853P128J865n365L242K2173l088j9041n800J0438K7724j7655L559J6182
$$ plain form
19937 251817 254077 233825 204094 156186 176164 190768 201092 186813 181420 209967 202730 196501
19925 196501 217685 202076 156127 154659 179621 206254 220018 241225 263931 270110 255975 223944
19913 223944 203411 138090 116133 138536 162554 156841 167129 164875 152253 136125 105760 139826
19901 139826 190961 198786 206971 206034 232743 211576 179502 158674 188582 214890 263330 262856 259791
19888 259791 263563 261157 227131 181276 141158 164242 228039 259190 276551 270485 226299 198673
19876 198673 173857 218708 244524 263399 278384 255221 205293 219546 248827 275199 248882
19865 248882 210037 164598 138554 214747 200905 165987 139209 148522 169878 193560 199626 178853
19853 178853 185981 187846 182481 185723 207896 204808 185767 179967 190405 218129 200474 204033 220215
19840B20215m5498n4885k264K4553R636j7772n6301q053l3255n321j1318M8510
19828F8247M4652O954l1839j3486J2904k550m1511R777N7106K0714K2460J5733
19816A69161m8449l1927K4056O275q805O620K2324J2856J1347k4920p643k1377
19804A09518O591j3064k0938l0402N910M5411K5229M966j4968L320Q586J5366
19792A45525j3335l6125J928j4559j8615o691J6177N639m6237r446K3446K7609
19780G5316J2872K4155k4168j3003J9376J047K0892L2265k5203k8031m69n3866
19768D1183k3759K0613M7615k7908K1072Q316J9870N3049l0812k1797l6598q157
19756F2687m917M2671K9752j5341P205L1343L2480j0757n786J7057n42j5042j6061
$$ plain form
19840 220215 174717 119832 117568 142121 151757 133985 77684 69631 36376 31055 19737 68247
19828 68247 112899 119853 88014 74528 87432 84882 43371 53148 110254 130968 153428 169161
19816 169161 120712 88785 112841 119116 110311 116931 139255 152111 163458 138538 130895 109518
19804 109518 116109 103045 82107 51705 57615 103026 128255 133221 118253 121573 130159 145525
19792 145525 132190 96065 97993 83434 64819 58128 74305 79944 33707 24261 47707 75316
19780 75316 88188 112343 88175 75172 94548 95595 116487 148752 123549 95518 95049 41183
19768 41183 17424 38037 85652 57744 78816 87132 107002 160051 129239 107442 70844 62687
19756 62687 57770 100441 130193 114852 122057 153400 185880 175123 169337 186394 185852 170810 154749
19743A54749J6855q617l2078k8929K0119J9199O2954K4803m8953n9900J3953N2213
19731A86368k4963l4456j6207J0121N4280N94k2955J7191J9462o3765M7371k77
19719A72764r812J2609k655j8538L9698M6111l888k2953m7020j8357k3664k7867
19707I6428m53m127K1034L2246n579k3265R798j1180q208j9210J2469J0457j4779
19694I5631K06J2624r258j1868p335K8820j4769j5806K9475L1372j5878p182K1431
19681A37463K7030m9380j8361L1895j7701l4020r965K2257L2325J8562k0362j1087
19669A08656j7242J5931m1010k7604K0646J0407M0054J809J3751o0898j8098M6048
19657I2450J9137J8905J9070O258J1007m268p2093n6098p91L4423J4971K7124
$$ plain form
19743 154749 171604 162987 130909 101980 122099 141298 204252 229055 180102 120202 134155 186368
19731 186368 161405 126949 110742 120863 175143 175737 152782 169973 189435 125670 173041 172764
19719 172764 162952 175561 172906 154368 194066 240177 236289 213336 166316 147959 124295 96428
19707 96428 95975 91848 112882 145128 139549 116284 126082 114902 106694 87484 99953 110410 95631
19694 95631 95837 108461 99203 87335 80000 108820 94051 78245 107720 139092 123214 116032 137463
19681 137463 164493 115113 96752 128647 110946 76926 66961 89218 121543 140105 119743 108656
19669 108656 91414 107345 66335 38731 59377 69784 109838 111647 125398 64500 46402 92450
19657 92450 111587 130492 149562 155820 166827 162559 90466 34368 33577 68000 82971 110095
19645A10095K5816O2553L0812l4122K9903J4400K9789K2282P927j2676J3518J24232
19633D24529J85910J33936R7996Q3202J6957m8679r4341j09077j00528p6427p0753
19622D42725k8099J3697K6635J9865j2326L5614J37856J09021J05809M0911L3591
19611I25299k2812r6364r7348j3438k8923O400k9576M8115P6993Q2074J03337
19600I53757P5291J4226o6934p9113j08122j22985o5896p393Q459p1172n3048
19589D77070P050J5068J8750Q0251R4182J13649J20271N9882j8832o8735r0599
19578H08007r3257q7119q1911p2498n9389m4021o4347N346L5138m0430m3265j6566
19566B45688n0164L466L167m666k2912J2164q391k9554J1380n976J1863j1903
$$ plain form
19645 110095 135911 198464 229276 195154 225057 239457 269246 291528 299455 286779 300297 424529
19633 424529 610439 744375 842371 925573 942530 893851 799510 690433 589905 513478 442725
19622 442725 414626 428323 454958 474823 462497 498111 635967 744988 850797 891708 925299
19611 925299 902487 806123 708775 695337 666414 672814 643238 691353 768346 850420 953757
19600 953757 1029048 1043274 976340 897227 789105 666120 600224 592831 601290 530118 477070
19589 477070 484120 499188 517938 598189 692371 806020 926291 986173 967341 898606 808007
19578 808007 714750 627631 545720 473222 413833 369812 305465 310811 345949 305519 262254 245688
19566 245688 195524 198990 202157 197491 174579 186743 178352 148798 160178 154202 166065 154162
19554A54162j8569m3980m1496j0737J5881k1786l0356m072K7857L8269m477K8618
19542H9314O1334N179l3173l9202j1267L5724Q369k0829J3881n094l0177J8889
19530I2948L8546o476l6127k221j8617R882k7957L5993K9811J7404J7499k1207
19518A29478k7656j8228l5122j3683k5563J5648K43p668l2669K842j3820k5851
19506e2049K5009N3016O3810K1060k9281k1648O67j4599P16J9898j8922k3286
19494B4391j5045L1303k4609j7067N5012N3170l4036k2752J7386R903Q598j2964
19482G3290j152J7527k901L488n315ml3115m4463J5373k2472k8257J666K7874
19469A539r366k1035j3443K4359L3285j4832m273L3978J942n931l365L041K5899
$$ plain form
19554 154162 135593 91613 50117 39380 55261 33475 3119 -953 26904 65173 60696 89314
19542 89314 150648 155827 122654 83452 72185 107909 116278 95449 109330 104236 74059 92948
19530 92948 131494 125018 88891 86670 68053 77935 49978 85971 115782 133186 150685 129478
19518 129478 101822 83594 48472 34789 9226 24874 25117 17449 -15220 -12378 -26198 -52049
19506 -52049 -27040 25976 89786 110846 81565 59917 60584 45985 46701 66599 47677 24391
19494 24391 9346 40649 16040 -1027 53985 107155 73119 50367 67753 77656 86254 73290
19482 73290 72138 89665 86764 90252 84937 84933 51818 7355 22728 256 -28001 -26335 1539
19469 1539 -7827 -28862 -42305 -17946 15339 507 -3766 30212 32154 26223 22858 25899 51798
19456E1798K904L3364j7460o2332n8551K2482K5306P288L9605K3136l327m575
19444E9638L3492k3896k1626L7688j10J1150q43k3543m11l9878k4966q327l9159
19431d0791K3905j386O0044M5634n332j5562J3418J4642j1845j7042o716m072
19419E4897k544k8813p590J4898J2545P725p550o4q201l2905K4844r696m2407
19406b4861j1883P0180L0484K1873M445k7289k2394o342J1308N476j3120j4274
19394B3603k541n254l753k0742p30N196J6221j620M995N001R497K681j9461n935
19380G158J2253k1385k8858R518N1211M9208k259J7583r322n8764K0700J2672
19368E9715m4372N800M7143j5762o2319j4811O727K6616M1736j4929k424K6191
$$ plain form
19456 51798 54702 88066 70606 8274 -50277 -27795 -2489 4799 44404 67540 64213 59638
19444 59638 93130 69234 47608 85296 85186 96336 95493 71950 71539 31661 6695 -1632 -40791
19431 -40791 -16886 -18272 41772 87406 82074 66512 79930 94572 82727 65685 58969 54897
19419 54897 52353 23540 15950 30848 43393 51118 43568 43504 35303 2398 27242 17546 -24861
19406 -24861 -36744 33436 63920 85793 90238 62949 40555 34213 45521 50997 37877 23603
19394 23603 21062 15808 12055 -8687 -9417 -4221 12000 10380 15375 20376 29873 32554 13093 7158
19380 7158 19411 -1974 -30832 -21314 29897 79105 76846 94429 85107 26343 47043 59715
19368 59715 15343 21143 68286 52524 -9795 -24606 -17879 8737 50473 35544 33120 59311
19356E9311K1674r214q894r791q296K2081N5901l0684n5739k4970L3384M8753
19344I3516J6341o1982j4700j4929J661L8119O0461Q061k0283j4326j8253K1372
19332I5058j4792n3658M419R005m4874K466k1263j418R80O496n258o577p859K0780
19318a6495j893m5460J1164L5968K8237L2355q504K6748j7466k8351j5431j8325
19306a7453M5448J5415j2444K3402l50O73J83n859k6853m6853J4159N3458L8811
19293H1737m972k1019k066j7777n4725j5930J2753M0630M2898J1388J1916m6492
19281C8341p4083k499J2036j2749J5949J0442K156K2386j8408O245J2070j9024
19269g138P655J7974N5978J8871l504m9009k1181M727k4792P261N2944j2080l2510
$$ plain form
19356 59311 80985 71771 62877 53086 44790 66871 122772 92088 36349 11379 44763 93516
19344 93516 109857 47875 33175 18246 19907 58026 118487 126548 106265 91939 73686 95058
19332 95058 80266 26608 31027 40032 -4842 -2376 -23639 -25057 -24077 -17581 -22839 -29416 -37275 -16495
19318 -16495 -18388 -63848 -52684 -16716 11521 43876 35372 62120 44654 16303 872 -17453
19306 -17453 27995 43410 30966 54368 54018 54691 54874 49015 22162 -24691 -10532 42926 81737
19293 81737 76765 55746 53680 35903 -18822 -34752 -21999 18631 61529 72917 84833 38341
19281 38341 -35742 -38241 -26205 -38954 -23005 -12563 -10407 11979 -6429 -184 11886 -7138
19269 -7138 517 18491 74469 93340 89836 40827 19646 24373 -419 6842 59786 47706 15196
19256A5196q777L1564K3425k0540m0953m0344L0551K3148k432J4095M9332L7376
19244A11641k6920n3076k1538K080j2913K5874n79l2575P432K1047J5362l522
19232C2313j1155j8657k3941O8769J399m9806j8754M45O272J2453j4846k4337
19220c9845L9683K8648j7212k5618L561J3646L3184J1483j0498m8963j1601N656
19208a7876j9447K4014J8400J9371R456j2063N6647L0953k7616j78j2456m7878
19196B1327L15M2531M0611k4049k6918n4761n075R765m3114M723K0965J6779J2951
19183A6050l0133m4099M7739m133l501n5314M333L0970N7027M7135k2368n7095
19171a3389n888J3706K7742J5948k7202j0252j6881l0988K291j747j4260J1025
$$ plain form
19256 15196 6419 37983 61408 40868 -85 -40429 -9878 13270 10838 24933 74265 111641
19244 111641 84721 31645 10107 12187 -726 25148 24569 -8006 -574 20473 35835 32313
19232 32313 21158 2501 -21440 47329 48728 -1078 -19832 -19387 -13115 -662 -15508 -39845
19220 -39845 -162 28486 11274 -14344 -10783 2863 36047 47530 37032 -11931 -23532 -17876
19208 -17876 -37323 -13309 5091 24462 33918 21855 78502 109455 81839 81661 69205 21327
19196 21327 21642 64173 104784 80735 53817 -944 -6019 3746 -39368 -34645 -13680 3099 16050
19183 16050 -14083 -58182 -10443 -14576 -18077 -73391 -69058 -38088 18939 66074 43706 -13389
19171 -13389 -19277 -5571 22171 38119 10917 665 -16216 -47204 -44913 -46660 -60920 -49895
19159d9895R855l981n228n411m2683K7747L6939O777K6931J7039l2306n0462K043
19146f2635J7037R797Q951N7069M8900L6713k6536l5971j4740K3631J6594j5373
19134F3437j1485L8090J5143n627k1122p8204l3588J0112j3959K5732M5198n726
19122B8001j7479j322K0257L0496k1097k5709Q670K522M8177J858k4651j9581
19110C0142j7397l3720j2183N6459J7831j9654R560l1361j7840L5066L2068M9932
19098I8903j1250k3950l0975K133j1096l922l671m0929j6128Q625m017N7388m953
19085A6158k1371r67k532k260L1431k4477L187l7312J5865j0451J0698K5324l16
19072B977O299M6230m8399k4578j5238J7801k51r021J1850K1093N1545j8654k2098
$$ plain form
19159 -49895 -40040 -44021 -49249 -54660 -97343 -69596 -32657 -25880 1051 18090 -14216 -64678 -62635
19146 -62635 -45598 -35801 -26850 30219 79119 115832 89296 53325 38585 62216 78810 63437
19134 63437 51952 90042 105185 99558 78436 232 -33356 -23244 -37203 -11471 33727 28001
19122 28001 10522 9200 29457 59953 38856 13147 21817 24339 72516 74374 49723 30142
19110 30142 12745 -20975 -33158 23301 41132 21478 31038 -323 -18163 16903 48971 98903
19098 98903 87653 63703 32728 34861 23765 19843 16172 -24757 -40885 -32260 -36277 21111 16158
19085 16158 -5213 -6180 -8712 -10972 20459 -4018 -831 -38143 -22278 -32729 -22031 3293 2977
19072 2977 9276 55506 7107 -17471 -32709 -14908 -15159 -24180 -12330 8763 60308 41654 19556
19059A9556K0632k0031m557m545j2318K7465l3377k2985L3486O1358L2740m4020
19047E3404r3451l8622K5812K4180k5399N412N4709K7045K7747j0049j3681l5446
19035A661K6485L5713J1495k8107k3390l9154l7437M699j942K9095J9260J8829
19023A7207j2786j7366R793J4141j651k688k8111l8949J5431O0802K5418k2423
19011A8818J1609L0542J6228K4425p489m1419L6969m4084k4969k4813M5512K0592
18999F1921k4126k5673m959k8560j7736k3940J415L0960J1999J0749J2336o59
18987C727j1556J1948K0571J1798o9802m1511K3388L5547J0087Q025m372J5409
18975A3259j2891j7960j4277P720K2180K7240J2256j3726q993N103O699m1708
$$ plain form
19059 19556 40188 20157 15600 11055 -1263 26202 -7175 -30160 3326 64684 97424 53404
19047 53404 -40047 -78669 -52857 -28677 -54076 -48664 6045 33090 60837 50788 37107 1661
19035 1661 28146 63859 75354 47247 23857 -15297 -52734 -48035 -49977 -20882 -1622 17207
19023 17207 4421 -12945 -3152 10989 9338 6650 -21461 -60410 -44979 15823 41241 18818
19011 18818 30427 60969 77197 101622 94133 52714 89683 45599 20630 -4183 41329 61921
18999 61921 37795 12122 7163 -21397 -39133 -63073 -61658 -30698 -18699 -7950 4386 3727
18987 3727 -7829 4119 24690 36488 -33314 -74825 -51437 -15890 -5803 2222 -2150 13259
18975 13259 368 -17592 -31869 -24149 -1969 25271 37527 23801 14808 19911 26610 -15098
18963a5098O164K9267j8141k1202R504M1547J7675n8895j5857o265k941J2187
18951b2055Q0711L7858p2544l4363j4460L794K1060N8069M9972n4813k5607m8017
18939b0395J0347L1577J0036k851R565k7875l8910o555K2546L5122j9656l08K3909
18926B6552l0985l034m469l901j4676J3927M2711L1754J0518j2984J0779J7753
18914H3945k8671n926J4546k3138l4812p619J53K3194N1377k6398l6170K0840
18902C1321K3101q950L0438J2313k1721o873j5637o755m1133m6394J3542J1970
18890b4778K3876L2426k0559k8714K2099O1911k9376n9628k7361K8170K0927k1862
18878b2869M8930P1112J1085j8334L04J4633k4951m642K9578n3143j5330M462
$$ plain form
18963 -15098 -8934 20333 2192 -19010 -9506 32041 49716 -9179 -25036 -31301 -34242 -22055
18951 -22055 58656 96514 23970 -10393 -24853 -21059 1 58070 108042 53229 27622 -20395
18939 -20395 -10048 21529 31565 28714 38279 10404 -28506 -35061 -12515 22607 2951 2643 26552
18926 26552 -4433 -7467 -11936 -15837 -30513 -16586 26125 57879 68397 55413 66192 83945
18914 83945 55274 49348 63894 40756 5944 -1675 -1522 21672 73049 46651 10481 31321
18902 31321 54422 45472 75910 88223 66502 59629 43992 37237 -3896 -50290 -36748 -24778
18890 -24778 -902 31524 10965 -17749 4350 66261 36885 -22743 -50104 -21934 -1007 -22869
18878 -22869 26061 97173 108258 89924 90228 104861 79910 75268 104846 51703 36373 40835
18866D0835r747K6113L096k749N360o678j2292L2318p697k0395j4103k6699M486
18853A1848J8151K3885O061l1931J346K8304q941J3223k551k7559j1184K6153
18841D6805L5900J8037j1076n1132k1270N260l1163k5448m290J7298R956j728
18829a2851K1086J9523J490k4450k6856n272L2898J219J0696K0051L6889K3539
18817I7962m9845L0556N1186j4121l5219j3786k7231j7488K8178J3666j9120J827
18805D6565M490J2389K4354J5601k903L3861J3015m4015k5964K9464J7393n795
18793A18455q038J2797n2056m9281r691L7359Q68K5470l6230l5677L5270N3903
18781I3149M1511O540J6917L7145R9626J49134J29440O0545q4781j35925j23332
$$ plain form
18866 40835 31088 57201 60297 57548 62908 56230 43938 76256 68559 48164 34061 7362 11848
18853 11848 29999 53884 59945 28014 29360 57664 48723 61946 59395 31836 20652 46805
18841 46805 82705 100742 89666 38534 17264 22524 -8639 -34087 -38377 -21079 -11123 -12851
18829 -12851 8235 27758 29248 4798 -22058 -27330 5568 6787 17483 37534 74423 97962
18817 97962 48117 78673 129859 115738 80519 66733 39502 22014 50192 63858 44738 46565
18805 46565 51055 63444 87798 103399 100496 134357 147372 103357 77393 106857 124250 118455
18793 118455 110417 123214 71158 21877 12186 49545 50413 75883 39653 3976 39246 93149
18781 93149 134660 141200 158117 195262 294888 444022 573462 634007 549226 413301 289969
18770B89969k6635j6115j9299k880L2966L5186L6703O9912L6923m4177p4835n7568
18758B60150k8293l5623l3854L6303J6372K9482p612L581K0011J16500J17445
18747D94462J31606J60895K03789J01186n6113k12167k11148j52959p3555P72
18737C86768n3757p8610o2191l3448j1014l7650l1219J3418L2311M9157K645j1046
18725A65364K9296J4306k9343o7514q800N3681J5407N0997P1440N7055Q9644O8019
18713E09552l3586p5579r9147q5087n5694J7532q30m5460l888l104K6804o819
18701A44694k745K031k2290J658K523j4813m1136R082K1058r526j4022J5082k645
18688H8951k6129J2985j5362Q850M389L721p497k4639j7180k6321K9596L721k5756
$$ plain form
18770 289969 263334 247219 227920 225040 258006 293192 329895 399807 436730 392553 317718 260150
18758 260150 231857 196234 162380 198683 215055 244537 236925 240506 260517 377017 494462
18747 494462 626068 786963 990752 1091938 1035825 823658 612510 459551 385996 386768
18737 386768 333011 254401 192210 158762 147748 110098 78879 92297 124608 173765 176410 165364
18725 165364 194660 208966 179623 112109 103309 156990 172397 223394 294834 351889 441533 509552
18713 509552 475966 400387 301240 216153 160459 177991 177161 131701 127813 124709 151513 144694
18701 144694 141949 143980 121690 123348 125871 111058 69922 79004 100062 90536 76514 91596 88951
18688 88951 62822 75807 60445 69295 73684 77405 69908 45269 28089 1768 31364 35085 9329
18675I329m4777J5366M4349O0351l1382J3008K9676l3045m7979J8135M4755J2283
18663I0069J4208l6081L8048l0843o2848q988J6786K8189k1507j0905j53J3379
18651B9354j0527P908J4729k5599p1256k0280L4882N3801M9629J5569J117r424
18639F9903n8437j7997L1558j2748j0032M2560J0744k7783J232J2279l802n6485
18627a9008k7941k538J7635L4182m483K1243L8845K5262L1517k6065n1915o179
18615C0555j230n6974o483L5460K8474J8820J2995K410j833N358j3323J4383j9191
18602D9421l627J8384k4997l329J2192J2295k1892p734M1585K9084o490m9494
18590D5398K5673Q640k2034K0972M2370J0471l4557m067l7156j1522j017p640
$$ plain form
18675 9329 -35448 -20082 24267 84618 53236 66244 95920 62875 14896 33031 77786 90069
18663 90069 104277 68196 106244 75401 12553 3565 20351 48540 27033 16128 15975 29354
18651 29354 18827 26735 41464 15865 -55391 -75671 -40789 13012 62641 78210 79327 69903
18639 69903 11466 -6531 25027 12279 2247 44807 55551 27768 29000 41279 37477 -19008
18627 -19008 -46949 -49487 -31852 2330 -2153 19090 57935 83197 114714 88649 36734 30555
18615 30555 29325 -27649 -34132 1328 29802 48622 61617 64027 62194 67552 54229 68612 49421
18602 49421 45794 64178 39181 35852 48044 60339 38447 30713 72298 101382 94892 45398
18590 45398 71071 79711 57677 78649 121019 131490 96933 92866 55710 44188 43171 35531
18578C5531J7172O459K2506j3186J6937P003j9250j5101J6138J5424J5502J1150
18566A16285J3771k8360k1589j5729N335J0537k3160n6896J8939N0809j3977j4456
18554D1509M645J4172L8375l1021l6047N7277K3262l9664m5551m225K4451j1476
18542C5707l0323J8153J0043K0721k9780n907N5896L7575K3035n9032o1336J3603
18530B8355K4329M5216m39J0253R413k0762l6471k0577m554J0431L009L1273n1900
18517B7576m8215j228K1321M9589l3555J1831K1321j7914j8054N2832L3237K987
18505A01728K4321j994j322K7685r59O087l1729J3698K2365L68J096k9700J3736
18492A45380M2303J5479q038j5755j7956j7074K0109m779N68j9404P93j8756K1540
$$ plain form
18578 35531 52703 59162 81668 68482 85419 92422 73172 58071 74209 89633 105135 116285
18566 116285 130056 101696 80107 64378 69713 80250 57090 194 19133 69942 55965 41509
18554 41509 46154 60326 98701 67680 31633 88910 112172 72508 26957 22732 47183 35707
18542 35707 5384 23537 33580 54301 24521 18614 74510 112085 135120 76088 14752 28355
18530 28355 52684 97900 97461 107714 117127 96365 59894 39317 34763 45194 48203 79476 27576
18517 27576 -20639 -21867 -546 49043 15488 27319 48640 30726 12672 65504 98741 101728
18505 101728 126049 124055 122733 150418 149459 155546 123817 137515 159880 160248 161344 131644 145380
18492 145380 187683 203162 195124 179369 161413 144339 164448 159669 160237 140833 141626 122870 144410
18479A44410J6636k160k0038j3148J004J9023N930M4859l1551k0854N2528K3577
18467B20216M450L329K2899J7634M385K0423L412L5469m1653l3917m4306m5752
18455A66589j6486j6768L5764L7935j6137J4902j5385m5780n049N2261J4367j1910
18443A94303Q929k3133n1289J4142J4176K0247J6256N3942j4066m1509J0705N1395
18431B54098O0559k464l6140n0344o2583p807J7270j6477K0311l0682m2573l965
18419I9203J0203L094J4015k6009K0982J7015J8113K7672l406j7570J5928J3683
18407A92923j0036r612k4861J6279L2427n883L6892l3033n6475n4234p113n794
18395G1480l3877K615j6565L6231R0305J9279M478M2388O976k3933m4210J2170
$$ plain form
18479 144410 161046 158886 138848 125700 126704 145727 151657 196516 164965 144111 196639 220216
18467 220216 224666 227995 250894 268528 272913 293336 296748 332217 290564 256647 212341 166589
18455 166589 150103 133335 169099 207034 190897 205799 190414 144634 139585 191846 206213 194303
18443 194303 203232 180099 128810 142952 157128 177375 193631 247573 233507 191998 202703 254098
18431 254098 314657 312193 276053 225709 163126 155319 172589 156112 176423 145741 103168 99203
18419 99203 109406 112500 126515 100506 121488 138503 156616 184288 180882 163312 179240 192923
18407 192923 182887 173275 148414 164693 197120 191237 228129 195096 138621 84387 77274 71480
18395 71480 37603 40218 23653 59884 150189 169468 173946 216334 223310 199377 155167 167337
18383A67337M0853M0558k670k4689Q971L9309j2297k3477K6186K1331K2788L6379
18371C40579m06j3778p4334n7380r5567j19975m5961K3919L3899P6113Q8103M2789
18359A98001n911L469Q3235J01149L5446J4251n3682l2729O779L1251j1309j5888
18347C54062K3238j6155j3179M6034M8334P0038K0565J2924k5390k1723n15o2610
18335D35623q0029o2912r785J6424M2127M5670M3176J215k3322L1208k767k7838
18323D08790M7346K7011J7677L7243R199j2243j8852o920L954K7904L0253N3740
18311F25102K2413J9842l548N932O068J7916K3746j2326R61p154j7136p120L7247
18298G11943L4953o287P981N245j5705K6037K8771l0449N0918N4090M6700N1390
$$ plain form
18383 167337 208190 248748 246078 221389 230360 269669 257372 233895 260081 281412 304200 340579
18371 340579 340173 326395 252061 194681 99114 -20861 -66822 -42903 -9004 67109 155212 198001
18359 198001 192090 195559 278794 379943 415389 429640 375958 343229 350008 381259 369950 354062
18347 354062 377300 361145 347966 394000 442334 512372 532937 545861 520471 498748 498233 435623
18335 435623 355594 292682 282897 299321 341448 387118 430294 431509 408187 439395 436628 408790
18323 408790 456136 483147 500824 538067 547266 535023 516171 509251 513205 541109 571362 625102
18311 625102 647515 667357 663809 669741 675809 693725 717471 705145 706106 698952 681816 674696 711943
18298 711943 746896 740609 748590 753835 738130 764167 792938 762489 813407 867497 914197 965587
18286I65587K9767k3113K5275O3316o259l4749M0234M6727K0923L3945N4949J3226
18274A229828L7915N5903M0338R6974O8991P2234O4864L7666N0241Q9268J06302
18263A950524J27674J81418J72839J33584J96084K42289L33244M43890M51944
18254D233490N39920N92575P41931R60681J231591J511813J725355K113210K768308
18245A6418874L788816N386605P896092J2181775J8093586K0903120J4102323
18238I8771191Q06623j4204276k2165961j6999658j0600781o629830m357575k971107
18230B1648626k025381j373090q43171m04947j72952j03905N3473L28644P46941
18221A7854238J202899J691913K190464K746269L482282M406764N847574Q351720
$$ plain form
18286 965587 995354 972241 997516 1060832 1054573 1019824 1060058 1106785 1127708 1161653 1216602 1229828
18274 1229828 1267743 1323646 1363984 1460958 1529949 1602183 1667047 1704713 1754954 1844222 1950524
18263 1950524 2078198 2259616 2432455 2566039 2762123 3004412 3337656 3781546 4233490
18254 4233490 4773410 5365985 6107916 7068597 8300188 9812001 11537356 13650566 16418874
18245 16418874 20207690 25594295 33490387 45672162 63765748 84668868 98771191
18238 98771191 99577814 85373538 63207577 46207919 35607138 28977308 24619733 21648626
18230 21648626 19623245 18250155 17406984 17002037 16829085 16725180 16778653 17107297 17854238
18221 17854238 19057137 20749050 22939514 25685783 29168065 33574829 39422403 47774123
18213D7774123J2144022J8429688K8473255L8525538L5545582J5050220j2714444
18206A83227984l8673029m0162541k6974403j6913523j1045687p447769n226975
18199C6784057l844444k869247k092756j577787j346286j222921j127529p66127
18191B1936960l36352J11955M88959Q48369J182244J529438K066999K914438M275589
18182C5018599O518711J0411856J5948401J8925157J3052139O90857j3523300
18175H7042420k1743619j7145354j0865065p042876m807537l366545k466368j944861
18167A7660195j558543j206323j016260r63987r05278q14438o46311m99424l41099
18158I708532k86560k34674j68817n7553k4450j99791m67347o30547o54843n44009
$$ plain form
18213 47774123 59918145 78347833 106821088 145346626 180892208 195942428 183227984
18206 183227984 144554955 104392414 77418011 60504488 49458801 42011032 36784057
18199 36784057 32939613 30070366 27977610 26399823 25053537 23830616 22703087 21936960
18191 21936960 21600608 21712563 22201522 23049891 24232135 25761573 27828572 30743010 35018599
18182 35018599 41537310 51949166 67897567 86822724 99874863 100565720 87042420
18175 87042420 65298801 48153447 37288382 30245506 25437969 22071424 19605056 17660195
18167 17660195 16101652 14895329 13879069 12915082 12009804 11195366 10549055 10049631 9708532
18158 9708532 9421972 9187298 9018481 8960928 8936478 8736687 8269340 7638793 6983950 6439941
18148F439941m47010l55960k97348k91667k79368l43525l66008k80090k26786
18139C552179j65271j93399j82898j35712j60830j03905p9658p8582m8496m4374
18129B359054l9154r570N1556R0347J33321J69450J66493J59661M5662o7737k7092
18118C031991N8413K19906L26606M19037N44161O96046R74616J383137J944173
18109I598086K867093M369856P029830J0056143R737235M405650k852126j0139753
18101C5072014j0780286o933115m151285k570826j666624j190118r48350p80731
18093F050679n72967m77059l88724k88645k09272j46750j47814j51595q0957o6215
18083C520681p4802j31253k11533k10963k10402j78513j82087q8215n9950p7138
$$ plain form
18148 6439941 5992931 5636971 5339623 5047956 4768588 4425063 4059055 3778965 3552179
18139 3552179 3386908 3193509 3010611 2874899 2714069 2610164 2530506 2451924 2403428 2359054
18129 2359054 2319900 2310330 2361886 2452233 2585554 2755004 2921497 3081158 3126820 3059083 3031991
18118 3031991 3090404 3310310 3636916 4055953 4600114 5296160 6270776 7653913 9598086
18109 9598086 12465179 16835035 23864865 33921008 43658243 48063893 45211767 35072014
18101 35072014 24291728 17358613 13207328 10636502 8969878 7779760 6831410 6050679
18093 6050679 5477712 5000653 4611929 4323284 4114012 3967262 3819448 3667853 3586896 3520681
18083 3520681 3445879 3314626 3103093 2892130 2681728 2503215 2321128 2232913 2172963 2095825
18073B095825j15025j23734j17645j80162j75768r4388j08398n5075k4234q8439
18063A012957p8536n4397l3367m621J3373l0374j8066K5931K2122O4559P5136
18052I94717Q4192P2692j07309j54471j51677p8420n2229j8817j7098j04360j01663
18041C65557L210M6121L5367K9480j3990o6065j1575l6230L5532J2075k1814l9277
18029C38391l3247l625J5942K7810J26015O2929L0235Q8502O5627k2911r9313
18018E96355r6402o8134p6703l382n801Q140l913M280j9960q093j4233k2351q566
18005B81237k4439k190O843L0966m142l0541r796k1267o847R495m433j0969K5082
17992B38999N318M610L2985k550p4837j7602k6154l7542n4190n945k1428J2467
$$ plain form
18073 2095825 1980800 1857066 1739421 1559259 1383491 1289103 1180705 1125630 1101396 1012957
18063 1012957 934421 880024 846657 842036 855409 825035 806969 832900 855022 919581 994717
18052 994717 1078909 1151601 1044292 889821 738144 659724 607495 588678 571580 467220 365557
18041 365557 368767 414888 450255 479735 465745 399680 388105 351875 387407 399482 377668 338391
18029 338391 305144 301519 317461 345271 471286 534215 564450 652952 718579 695668 596355
18018 596355 499953 431819 355116 351734 345933 354073 350160 354440 334480 326387 312154 289803 281237
18005 281237 256798 254608 261451 292417 288275 257734 247938 226671 219824 229319 224886 213917 238999
17992 238999 244317 248927 281912 279362 204525 186923 160769 123227 69037 63092 41664 54131
17980E4131K2219J9890O851n721o0182J7004J3859K4837M905j8030Q719M7971
17968A36453M24r991N146l8253j0460K3778o880m83j1194k6201l466K6752N0718
17955A36343J4479R631k534k6137r268K7822P3434j0122L1q774j7664l5566p315
17942A44360j5507L6768p543j9477o467k1745J170K0742K4466k4050k4757m878
17930A03082L1647O135j4215J0244J8615k1599j5378m2517l7949J8291L5551N4499
17918A46406K7999m1527l5800J7481j5824m1862n1313l3527M3068K2090L017k174
17906C8034J5774j0390M4719K5185O38n356j6781k2328n4710M741L2171L3235
17894H4932j4193m9157N070K1525Q6M8682K8632k2950m6525n146q400l8519r844
$$ plain form
17980 54131 76350 96240 103091 97370 37188 54192 68051 92888 97793 79763 88482 136453
17968 136453 136877 126886 132032 93779 83319 107097 100217 99734 88540 62339 58873 85625 136343
17955 136343 150822 160453 157919 131782 122514 150336 223770 213648 213679 204905 187241 151675 144360
17942 144360 128853 165621 158078 138601 132134 110389 111559 132301 156767 132717 107960 103082
17930 103082 134729 140864 126649 136893 155508 133909 118531 76014 38065 56356 91907 146406
17918 146406 174405 132878 97078 114559 98735 56873 5560 -27967 15101 37191 40208 38034
17906 38034 53808 43418 88137 113322 113960 108604 91823 69495 14785 19526 51697 84932
17894 84932 70739 21582 26652 48177 48263 96945 125577 102627 56102 50956 42556 4037 -5807
17881e807L8288K6930L6308N0271m838p9568j3838J7668m524L4607L1828Q462
17869A35787j7790j7979K0913m0603j8224J0094Q743R208l5223k4956q234j5564
17857F172J8408L7799M0629k572L0101k8188R07J1133j8003k2060m3472J0006
17845D0860N1601J1185m0323o3513k6021M5861M4091K0615k3155j143q537j309
17833E0212r913k0963k349n422M1172o990J0080j0785k926r192K3395O198j9094
17820D3423j2900j5102k2583r874L5336M3151J5591m2296k4047K6376O733K2059
17808F5867L1583k1268l0133N621n5802k6264M390K8157J3203m370J6528K6258
17796E3770m186j3482m5983k4639J705K3927M9177p019n896j6311L903L0540j3124
$$ plain form
17881 -5807 32481 59411 95719 145990 141152 61584 47746 65414 60890 95497 127325 135787
17869 135787 117997 100018 120931 80328 62104 72198 80941 90149 54926 29970 21736 6172
17857 6172 24580 62379 103008 100436 130537 102349 103256 114389 96386 74326 30854 40860
17845 40860 92461 103646 63323 -190 -26211 19650 63741 84356 61201 60058 51521 50212
17833 50212 40299 19336 16987 11565 52737 45747 55827 45042 42116 32924 56319 62517 43423
17820 43423 30523 15421 -7162 -17036 18300 61451 77042 34746 10699 37075 43808 65867
17808 65867 97450 76182 46049 51670 -4132 -30396 -26006 2151 15354 10984 27512 53770
17796 53770 49584 36102 -9881 -34520 -32815 -8888 40289 33270 27374 11063 14966 45506 32382
17783C2382j7686j9412j0808J3906K2911m1111M5120K1218L1454L9245m617k4337
17771H8265O372j4080r921L424L439l0189l8837J2585L7377J7964j6650o818M053
17758E6984j1800M640j8140p7540O065N0072K0187k9257l8079K6308Q86P344M1224
17745C8894L595J9877J4093J4200k165J9317K3884l1787m8032j7823j4215n1500
17733c1662k2131K1973K6820M6940K9125M5966l3927o6128r521P057L0326p850
17721C6988k5973j4420K0528J7091J1361J8137P9896Q661n3618n6338K9734K6945
17709I8992j9147k6677N439L4083K5542O427K0086P840M0961O1060R2293O1607
17697D08506Q9516O0210K0314n4765j13050j01347n1559l9185l2750j3397p142
$$ plain form
17783 32382 14696 -4716 -15524 -1618 21293 -19818 25302 46520 77974 117219 112602 88265
17771 88265 94637 80557 70636 74060 77499 47310 8473 21058 58435 76399 59749 52931 56984
17758 56984 45184 49824 31684 -45856 -39791 10281 30468 1211 -36868 -10560 -9674 -2330 38894
17745 38894 42489 62366 76459 90659 88494 107811 131695 99908 51876 34053 19838 -31662
17733 -31662 -53793 -31820 -5000 41940 71065 117031 83104 16976 7455 14512 44838 36988
17721 36988 11015 -3405 17123 34214 45575 63712 143608 152269 98651 42313 72047 98992
17709 98992 79845 53168 58607 92690 118232 124659 144745 152585 193546 254606 346899 408506
17697 408506 498022 558232 578546 523781 410731 309384 257825 218640 185890 172493 165351
17686A65351j6101J9416J1065k1525L19j9483l690K4734M7709K0682j1734n842
17674B10901j4101k4347L6616M6124N5584J03911J57610J79650J87694J01253
17664A040895j4148j37353j87937j78765j18662n3982o3035j05465p011L4140
17654B08677P751n3565k1354J600J6550L6271k8242j6834m242L2212L8085l8546
17642A78363m6959N4554L7868L9670Q2544R9960R0747N7826N009o1887j32089
17631D05606j26538m5873N888J2342p6479n9297j7867K2201k2299R257K7506K1706
17619A56153L967J3431j6392l6864m8499K5319K0792j4038j9632k3524J1689J1955
17607H4357r157j6971k1087k9917j0300k0110N0329J3362J1215l890j4340o469
$$ plain form
17686 165351 149250 168666 179731 158206 158525 139042 135352 160086 207795 228477 216743 210901
17674 210901 196800 172453 209069 255193 310777 414688 572298 751948 939642 1040895
17664 1040895 1026747 889394 701457 522692 404030 350048 287013 181548 174537 208677
17654 208677 216428 162863 141509 143109 159659 195930 167688 150854 146612 178824 216909 178363
17642 178363 131404 185958 223826 263496 346040 446000 536747 594573 599582 537695 405606
17631 405606 279068 233195 239083 251425 174946 115649 97782 119983 97684 106941 134447 156153
17619 156153 160120 173551 157159 120295 71796 97115 117907 103869 84237 60713 72402 84357
17607 84357 75200 58229 37142 7225 -3075 -23185 27144 40506 51721 47831 33491 27022
17595B7022j5569k0129Q213J7535M4595J8400k4521l1760j7152l414l9629q823
17583d5232L5835L1631j4687j3580n588q429K976M0447M8783K9710k4396j9699
17571E7771L736N2079k6941l1309L537L3994j5271k4467n8883k5626J5378J869
17559a4133l0702j2928N6358O5355l4571l5068j1672J5574k7664k3587L247J8358
17547c1433K82M391j4167K4037N740o326J494J0678J448K4644J4379j8547j3454
17534C166k2565R86l1465J576K5537L3094p492k2066P923p501K1456j8581l2970
17521d8902L5434J1927l3164q217p211q350N215n480N8679L9524k0570n726R513
17508B2672k1002K5567R540n538P8854j6909n8821m5906J2117L6940K1692m7615
$$ plain form
17595 27022 11453 -8676 -463 17072 61667 80067 55546 23786 6634 3220 -36409 -45232
17583 -45232 -9397 22234 7547 -6033 -11621 -20050 -17074 23373 72156 101866 77470 57771
17571 57771 61507 113586 86645 55336 58873 92867 77596 53129 -5754 -31380 -16002 -14133
17559 -14133 -44835 -57763 -1405 63950 29379 -5689 -17361 -1787 -29451 -53038 -49791 -31433
17547 -31433 -31151 -26760 -40927 -16890 -11150 -17476 -15982 -5304 -3856 20788 35167 16620 3166
17534 3166 -19399 -18413 -49878 -48302 -22765 10329 2837 -19229 -11306 -18807 2649 -15932 -48902
17521 -48902 -13468 -1541 -34705 -42922 -50133 -58483 -53268 -58748 -69 39455 18885 13159 22672
17508 22672 1670 27237 36777 31239 110093 93184 34363 -11543 574 37514 59206 11591
17496A1591j6192j4424N756j9677J6289j1749N3384R735N184K3485k0232p9484
17484c6334k0611k619M8843n569J3496L0025n998m4291r374j187L0371N370n9976
17471e7854k1248L8920K2641J6785J8678K3620l060L0978k2285l5549n517m545
17459A564j8568k4353m579L8264J1422L300J8854J6315k8614l1336m546k1571
17447d3848k759M5514J6872m9582M4330P8489J7721K1261P6437P5064M9971j3514
17435C15956p5497p6262n2098k7734m1082n4613k5590L6832Q664l5509j6802M4608
17423H73r629j4034P632J1097R779J4690j892K0296K464L6399j3875l8404l543
17410B1853j976J5657o962q419m4568r200l743J0361R194L0977r104n923k77q977
$$ plain form
17496 11591 -4601 -19025 -13269 -32946 -16657 -28406 24978 34713 39897 63382 43150 -36334
17484 -36334 -56945 -59564 -10721 -16290 -2794 27231 21233 -23058 -32432 -33619 -3248 2122 -57854
17471 -57854 -79102 -40182 -17541 -756 17922 41542 38482 69460 47175 11626 6109 1564
17459 1564 -17004 -41357 -45936 -7672 3750 7050 25904 42219 13605 -17731 -22277 -43848
17447 -43848 -46607 -1093 15779 -33803 10527 89016 106737 127998 204435 279499 329470 315956
17435 315956 240459 164197 112099 84365 43283 -11330 -36920 -88 8576 -26933 -43735 873
17423 873 -8756 -22790 -15158 -4061 5718 20408 18516 38812 41276 77675 63800 25396 21853
17410 21853 19877 35534 28572 20153 -24415 -33615 -37358 -26997 -17803 13174 4070 -1853 -2130 -11107
17396a1107N75j6748K1226K745m8469r616L9899K4058K7059p100K1862N2276n1988
17383D4672n3386k5710J14L723j3294R335J6971J2978Q768O968L1463J7458j3150
17370D6910q973Q743K8845m4663l6486K2432K3346o3036n0608k1482j5161N1341
17358e8792O3442J8005l595q54J1606j9444J9655l9207O338J8614j7775j1914
17346a3921J3171O2883J450m1804N353q75n491k696j1382K0789l4881j9498k51
17333b7153L340m0499K7713j775K695J9823M430k7475j3585M5234M9666j8272
17321B4142n0630l1687O0N8016L934l1527j9224K9523L300j2973k875o70l527
17308c4138J1049K0030m2493j8163K3744K6086l29j2541N885m677N653K1075j1691
$$ plain form
17396 -11107 -10532 -27280 -6054 -3309 -51778 -61394 -21495 2563 29622 22522 44384 96660 44672
17383 44672 -8714 -34424 -34310 -30587 -43881 -34546 -17575 -4597 4171 11139 42602 60060 46910
17370 46910 37937 46680 75525 30862 -5624 16808 40154 -22882 -73490 -94972 -110133 -58792
17358 -58792 4650 22655 19060 18206 29812 10368 30023 -9184 -2846 15768 -2007 -13921
17346 -13921 -750 62133 63583 21779 27132 26257 20766 18070 6688 27477 -7404 -26902 -27153
17333 -27153 -23813 -64312 -36599 -38374 -35679 -15856 -11426 -38901 -52486 -7252 42414 24142
17321 24142 -26488 -58175 -58115 -99 3835 -27692 -46916 -17393 -14093 -27066 -29941 -30611 -34138
17308 -34138 -23089 -3059 -45552 -63715 -39971 -13885 -14214 -26755 -20870 -25547 -19894 1181 -10510
17295a0510N733J9852K0991j5199J5874k0273j8193N906j5659l644J1611L4709
17283C1198K4273j3958k01M4211j3881k9104L506m5334k3512j3572j7692K064
17271e2002N973M1N66M4571L4923j6526K2265J8565L191L314l6723l370j4243
17258A0545J663K9944N734K2721P727m2085o9645m7118o266J1828J9696L4826
17246b0430K2403J5914k3025J586M0456j9131m991p792J0463o330k5874O239J1237
17233G25P866j1578n787j2273J493j0037J7055j506k1663J4100M776l9267J7276
17220c8820K5132n91l9416Q872r127J7316K1537N2228L604J1780k3938k0699p320
17207E58J2132j8351m8116J730k0336R399N692L8319L6239Q753k2520k749J1416
$$ plain form
17295 -10510 -4777 15075 36066 20867 36741 16468 -1725 4181 -11478 -15122 -3511 31198
17283 31198 55471 41513 41312 85523 71642 42538 46044 710 -22802 -36374 -54066 -52002
17271 -52002 -46029 -45988 -45422 -851 34072 17546 39811 58376 61567 64881 28158 24788 10545
17258 10545 12208 42152 47886 70607 78334 36249 -33396 -80514 -86780 -74952 -55256 -20430
17246 -20430 1973 17887 -5138 -3552 36904 17773 12782 4990 15453 9123 -16751 -10512 725
17233 725 8591 -2987 -8774 -21047 -19554 -29591 -12536 -14042 -35705 -21605 -16829 -56096 -38820
17220 -38820 -13688 -14279 -53695 -44823 -53950 -36634 -15097 37131 40735 52515 28577 7878 558
17207 558 12690 -5661 -53777 -52047 -72383 -62984 -57292 -18973 17266 26019 3499 750 12166
17194A2166m769o480m6492O687L6900K200j0011n448N3368M2297j4859m8740p9119
17181f2300j868L9520J5170k7597k6619L9971L2567K6893J3221r155J4064J7616
17169G1483k4206l6457l4900m438J009l2028j1748M6554R886j704K0793p24r06
17156B614k3427m6542K1654J2021O448J0417k4498j674K7156K3691P274K9802
17144D4936M311k3192m567k9887K0247n377r220j324K0013o663k5593K070M9821
17131C5575n150j4817L1276m400K5906k1470J383k989R465l9492l8550O107J2313
17118d843N597N847J5578j4544l6732k4009M9268M6707k6543j9795K581L2196
17106C1308l4827n9741p0L9951k0758J1552J5655J557k7879r142M3461N2752j7250
$$ plain form
17194 12166 7397 917 -45575 -38888 -1988 212 -9799 -15247 38121 80418 65559 16819 -62300
17181 -62300 -64168 -24648 -9478 -37075 -63694 -23723 8844 35737 48958 39803 53867 71483
17169 71483 47277 10820 -24080 -28518 -27509 -59537 -71285 -24731 -14845 -16549 4244 3520 2614
17156 2614 -20813 -67355 -45701 -33680 -27232 -16815 -41313 -42987 -15831 7860 15134 44936
17144 44936 49247 26055 21488 -8399 11848 6471 -2749 -4073 15940 9277 -16316 -14246 35575
17131 35575 30425 15608 46884 42484 68390 46920 48303 45314 54779 15287 -23263 -17156 -4843
17118 -4843 754 6601 22179 7635 -29097 -53106 -3838 42869 16326 -3469 -888 31308
17106 31308 -3519 -63260 -63330 -23379 -44137 -32585 -16930 -15373 -43252 -52394 -8933 43819 26569
17093B6569k4038O964O607j2662j9310K8049J9814o856l2633l1895K5347K9628
17081A5584m600K7498J4973n8445j3902O396K8078O707p753M345N522q2766l2854
17068i1217P0199O8702J096m1538r268L0203J7450j6103m2718j9494j913K5256
17056i345J5442m044M0242j3703K6367M5926m2226j5389l172K6425K4911l3072
17044E8362m5993j2117M0973N092M570Q893n2270k2856K3568j799j79J5764L0508
17031E2516k605m0078m6209J6020j7083k3099J4495j9415j0631J5795J3836J3901
17019c2557K6358L2708k1772J9633N251k1650l4758j4735L6213K4889r429J1096
17007B1247J1555r777K5958M5666l109l6508m4811j4451q003r404k1680J8877
$$ plain form
17093 26569 2531 9495 16102 3440 -15870 12179 31993 25137 -7496 -39391 -14044 15584
17081 15584 10984 38482 53455 -4990 -18892 -12496 15582 22289 14536 18881 24403 -58363 -91217
17068 -91217 -21018 47684 48780 7242 -2026 28177 45627 29524 -13194 -32688 -34601 -9345
17056 -9345 6097 2053 42295 28592 54959 100885 58659 43270 40098 66523 91434 58362
17044 58362 12369 252 41225 46317 50887 59780 7510 -15346 8222 6423 6244 22008 52516
17031 52516 49911 9833 -36376 -20356 -37439 -60538 -46043 -65458 -76089 -60294 -46458 -32557
17019 -32557 -6199 26509 4737 24370 29621 7971 -26787 -41522 -5309 19580 10151 21247
17007 21247 32802 23025 48983 94649 91540 55032 10221 -4230 -12233 -21637 -43317 -24440
16995b4440K4863L0562l482n009l892K3659J1495k2268j4781q107n3917j332K3060
16982b3589r560J38j9206J1286K0901J1221R008L7988R262L487l2754L513K1114
16969D2809l644j3654p723j1047j026R330k2192j8793j8495P465o62M354N659
16956b7619q307K9620L3432L721K0691J6890n6964m2673j8502l1442K9519J2852
16944c8782O402L8862L4543j3344n9239m4345j6029L0739R5892M1718R544n3019
16932C2942l9346j2568n051J4320k1652l5322J1415L426j7J4357L9308P014k0017
16919a1191j3603k952K311k14m339J6820L4877J7242j9154Q132N52j8967l7741
16906b8227j302J5448N831K0953p57l3025r264M7060L1142j4172m724J3237j9741
$$ plain form
16995 -24440 423 30985 27503 22494 18602 42261 53756 31488 16707 8600 -45317 -46649 -23589
16982 -23589 -33149 -33011 -52217 -40931 -20030 -8809 199 38187 47449 50936 18182 21695 42809
16969 42809 39165 25511 17788 6741 5715 15045 -7147 -25940 -44435 -36970 -37632 -33278 -27619
16956 -27619 -35926 -6306 27126 30847 51538 68428 11464 -31209 -49711 -81153 -51634 -38782
16944 -38782 -32380 6482 41025 27681 -31558 -75903 -91932 -61193 34699 76417 85961 32942
16932 32942 -6404 -18972 -24023 -9703 -31355 -66677 -55262 -51836 -51853 -37496 1812 8826 -11191
16919 -11191 -24794 -27746 -25435 -25649 -29988 -13168 21709 38951 19797 27929 28481 9514 -28227
16906 -28227 -29529 -14081 -8250 12703 11946 -21079 -30343 16717 47859 33687 28963 42200 22459
16893B2459o1765J2578N444J6188J9411K7740K2272r366N2475j0087r2803m8673
16881d4127Q957J2259M4822N092o1531J1078P577R85O182j403k1449L063k1182
16868d9677k4175j7268J8805O7692j0599j3523m8j5499K9081K6979k4042k2929
16856c5203J932K667K2710k8937k2667M1128J7587m5951m3967k9267J5977Q523
16844i5468N1272M0821j176o1009l4366J0098M7344N4243R837l1553n189j2797
16832b7943k73M6797l2718k0754l5134O2567N5327o981P223Q66n9096P874o466
16819h711J3639j6075n7444L0587L5325K0569k3912K754o7307k1675L5413J7806
16807c9031k2717r000K3079M0635k0046m2376j459L6453k1164K974o002L8498
$$ plain form
16893 22459 -39306 -26728 -21284 -5096 14315 42055 64327 54961 107436 97349 4546 -44127
16881 -44127 -35170 -22911 21911 27003 -34528 -23450 -15873 -14888 -8706 -10109 -31558 -28495 -49677
16868 -49677 -73852 -91120 -72315 -4623 -15222 -28745 -28793 -44292 -15211 11768 -12274 -35203
16856 -35203 -33271 -30604 -7894 -36831 -59498 -18370 -783 -46734 -90701 -119968 -103991 -95468
16844 -95468 -44196 -3375 -4551 -65560 -99926 -89828 -42484 11759 21596 -9957 -15146 -27943
16832 -27943 -28216 18581 -14137 -34891 -70025 -7458 47869 40888 48111 48977 -10119 -2245 -8711
16819 -8711 4928 -11147 -68591 -38004 -2679 17890 -6022 -3268 -70575 -92250 -56837 -39031
16807 -39031 -61748 -70748 -47669 -7034 -27080 -69456 -70915 -34462 -55626 -52652 -58654 -20156
16795b0156K0034j2132Q023J1897P977k4119J3149L1794k973k9184m9429l9150
16783h4269n675k693M5652N0356j5660k9006J3066K3487O689l7676j4341L8340
16771a1730j0516l5497n663k799l176K5547k3248j260J0645J3350k707k2080q624
16758g7758L7842J9933K391M8906j0967j5001k6680j6666m562k8741L9096K8734
16746c473P040J0717m307J4637j0788j6102m6627l042O811O560j4287K233J7808
16733c2820p186L438q910N953J7945k1027j5644L7202L5097J1988Q534n439K081
16720C1212n1504k8915K0123J765j9889o4431j8732M2318K3688M98M0494o40j3303
16707c7316k1488K5609K0271n784j8187l6740j1632M0797j397n0179J1583Q279
$$ plain form
16795 -20156 -122 -12254 -4231 7666 15643 -8476 4673 36467 33494 4310 -45119 -84269
16783 -84269 -89944 -92637 -46985 3371 -12289 -41295 -28229 -4742 1947 -35729 -50070 -11730
16771 -11730 -22246 -57743 -63406 -66205 -69381 -43834 -67082 -68342 -57697 -44347 -47054 -69134 -77758
16758 -77758 -39916 -19983 -17592 31314 20347 5346 -21334 -38000 -42562 -71303 -32207 -3473
16746 -3473 3567 14284 9977 24614 13826 -2276 -48903 -51945 -45134 -38574 -52861 -50628 -32820
16733 -32820 -40006 -36568 -45478 -39525 -21580 -42607 -58251 -21049 14048 26036 34570 29131 31212
16720 31212 -20292 -49207 -29084 -27319 -47208 -111639 -130371 -88053 -64365 -63867 -23373 -24013 -37316
16707 -37316 -58804 -33195 -12924 -18708 -36895 -73635 -85267 -44470 -45867 -96046 -84463 -76184
16695g6184J0368K5282J4433L4470M6j8353M2320m4943p2980m9639R953M2484
16683h2743J7048J2272j1466M7586r768M66k9949k1534l591J926L776M3749L2403
16670A75J0258M2502L4811K4654l5310j7884l6727m9289p585N7115K26r376k9004
16657a5434k5001l5006k049O475j479k5226O2666L6996j8446j8015k028L801L1387
16644a359Q0104n6486m5632L567K7230r077N331L110n800J184l7068k0743M2442
16631a3197J8530j07L186j6126P568o629o15j6046k2255K3169L833J2045K3983
16618A7339k2319k6962J4932l2513K602L3243P78n708J95L8061K0231n905n229
16605B8745l842o231k6132p197J3446L0759K3122k3864l0287J1570J3606L1099
$$ plain form
16695 -76184 -65816 -40534 -26101 8369 8415 -9938 32382 -12561 -85541 -135180 -125227 -82743
16683 -82743 -65695 -53423 -64889 -17303 -27071 -26605 -56554 -78088 -81679 -79753 -75977 -32228 175
16670 175 10433 52935 87746 112400 77090 59206 22479 -26810 -34395 22720 22946 13570 -15434
16657 -15434 -40435 -75441 -77490 -71015 -72494 -97720 -35054 1942 -16504 -34519 -36547 -32746 -1359
16644 -1359 78745 22259 -23373 -19806 7424 -1653 3678 6788 988 2172 -34896 -55639 -13197
16631 -13197 5333 5226 8412 -7714 -146 -6775 -7390 -23436 -45691 -22522 -18689 -6644 17339
16618 17339 -4980 -31942 -17010 -49523 -46921 -13678 -12900 -18608 -18413 19648 39879 33974 28745
16605 28745 24903 18672 -7460 -14657 -1211 29548 52670 28806 -1481 10089 23695 54794
16593E4794r47j6046l7568l8980Q972P4154R965k50l5l0232j5331j0571j3667
16580a5742p74M3797J7693q796k5682j8084N950r223K7609L395l5315J7538j7275
16567a4909l0041m4262j9894J6705L6093J0370J0080J2567J6144n814m1106K8724
16555b5343Q281k8065J0518M3853M1476p185q579j5975j6981r810l6914J378M3006
16542c40L3883j8391J2166m0659l1915K568j2636q163K3605m621j5547O1750Q449
16529A0149k8129k2944L2252j7141m356K6356J2589K2218L2952k9207m5251j9739
16517c0251k1241m3302m2589O2583N1454l107L6219L2667k7861o9394l1138J2271
16505g3689O7060N6175K0031k5048l1641L9408l864o0164q302R687K0819j2807
$$ plain form
16593 54794 53847 37801 233 -38747 -29775 44379 54344 54094 54059 23827 8496 -2075 -15742
16580 -15742 -16516 27281 44974 36178 10496 -7588 -1638 -10861 16748 20143 -15172 2366 -14909
16567 -14909 -44950 -89212 -109106 -92401 -56308 -45938 -35858 -23291 -7147 -12961 -54067 -25343
16555 -25343 -17062 -45127 -34609 9244 50720 43535 34956 18981 2000 -7810 -44724 -43346 -340
16542 -340 33543 15152 27318 -13341 -45256 -42688 -55324 -63487 -39882 -44503 -60050 1700 10149
16529 10149 -17980 -40924 -8672 -25813 -30169 -3813 8776 30994 63946 34739 -10512 -30251
16517 -30251 -51492 -94794 -137383 -74800 -23346 -26453 9766 42433 14572 -54822 -85960 -73689
16505 -73689 -6629 49546 69577 44529 12888 52296 48432 -11732 -20034 -10347 10472 -2335
16493b335k0277K8746K6154l4179k2653l545p459L2360N0060K7481m7014n004
16481B2335K4872J6643q322m8832n1994J769k8756o7828N5707k1725k2885N2321
16469g6695O7117J4685j2210o0835O49K8211J7744n462n101J2530K2222o645J2823
16456I033Q453j7255p309M814J307k0033j3490k4734k265L5248K6079m7872n2406
16443a00430J89N2729j0602l5961O4121J5957l7633l25K9997K7191k1375L604
16431a2538K9186N912m6804K1542R197q549N3287n770j4319l787k8278k6716k8898
16418e6535N3393Q239J9112M2936Q5l3616j5173j8531L0494J5010j764r988J2797
16405D6459k0697j2261J2018L3421k992k0253k5744m5936J0247K2458M015R032
$$ plain form
16493 -2335 -22612 6134 32288 -1891 -24544 -28089 -35548 -3188 46872 74353 27339 22335
16481 22335 47207 63850 55528 6696 -45298 -43529 -72285 -140113 -84406 -106131 -129016 -76695
16469 -76695 -9578 5107 -7103 -67938 -67289 -39078 -21334 -26796 -31897 -19367 2855 -3790 9033
16456 9033 17486 231 -7078 -2264 -957 -20990 -34480 -59214 -61479 -26231 -152 -48024 -100430
16443 -100430 -100241 -47512 -58114 -94075 -29954 -13997 -51630 -51955 -21958 5233 -16142 -12538
16431 -12538 16648 22560 -24244 -2702 6495 -2054 51233 45463 31144 27357 -921 -27637 -56535
16418 -56535 -3142 5097 24209 67145 67230 33614 18441 -90 30404 45414 43650 33662 46459
16405 46459 25762 13501 25519 58940 55948 35695 9951 -35985 -25738 -3280 735 9767
16393I767L3462N3896J0663m9016l6669n6910J7399M8465K5853p432k5858k5951
16381b331j7330q560j374m095M0817j5801Q27K5598j1186m7189m827K3892J4127
16368g432K6612j349K2708L7071k210p47K4211p492l3091k5115P012K658j5846
16355B6990j9412M043K0526l7977j6741K6374J512J515N8620P986j7060m2253
16343A4123K7812J8224j8160l293J0291j2099k7090L273k3423k3830L7017K712
16331E557J4204j2127q531Q096l9488J3151L5037N0010J7192m1809l4601j6054
16319i363K100m008k9070L364J2303J9059Q471J5501J3086m19R47J2404L5879
16306H0254l48m1654k1578k5447J6497j5353m3381L0065J1049j5546j2797j0487
$$ plain form
16393 9767 43229 97125 107788 58772 22103 -34807 -17408 31057 56910 49478 23620 -2331
16381 -2331 -19661 -28221 -29595 -33690 7127 -8674 -7847 17751 6565 -40624 -45451 -21559 -7432
16368 -7432 19180 17831 40539 77610 75400 74653 98864 91372 58281 33166 40178 42836 26990
16355 26990 7578 11621 32147 -5830 -22571 3803 5315 6830 65450 73436 56376 14123
16343 14123 41935 60159 41999 38706 48997 36898 9808 13081 -10342 -34172 2845 5557
16331 5557 19761 7634 -897 7199 -32289 -19138 15899 65909 83101 41292 6691 -9363
16319 -9363 -7263 -11271 -40341 -36977 -24674 -5615 2856 18357 31443 31024 31971 44375 80254
16306 80254 79906 38252 16674 -8773 7724 -7629 -51010 -20945 -9896 -25442 -38239 -48726
16294d8726j2596J5551m617j7454J9373J9748j3324L4576L9953l7388j8256M8692
16282B5532K3974J7730o447k8960k7211l841l5334r883l0386M10m326J2964N1829
16269a3949O0959L9789l5124k7101q051j4777j5274l8884l7889J0486M0679p645
16257d6781J4365L171K3922q710m520M050Q077J8589M160m0285j0666m004M272
16244c4360K8291O185l5626k9436P290k3681K0571N4481L670k3058j0778K4058
16232a2393o002J567J1376K7076J0446J3617n7856j6584O7010J4094p532m4453
16220C66r888o166J9445P053N697o858r991L3224M0906M996l8143l2278j6660
16207h297J0214M5443j6159j0716k092l8221j0722l6608J4938N2197p741Q358
$$ plain form
16294 -48726 -61322 -45771 -50388 -67842 -48469 -28721 -42045 -7469 32484 -4904 -23160 25532
16282 25532 49506 67236 60789 31829 4618 777 -34557 -44440 -74826 -74416 -78742 -65778 -13949
16269 -13949 47010 86799 51675 24574 16523 1746 -13528 -52412 -90301 -79815 -39136 -46781
16257 -46781 -32416 -29245 -5323 -14033 -18553 -14503 -6426 12163 16323 -23962 -34628 -38632 -34360
16244 -34360 -6069 116 -35510 -64946 -57656 -81337 -60766 -6285 -2615 -25673 -36451 -12393
16232 -12393 -18395 -16828 -5452 21624 32070 45687 -12169 -28753 38257 52351 44819 366
16220 366 -9522 -15688 3757 10810 16507 9649 -342 32882 73788 78784 40641 8363 -8297
16207 -8297 1917 47360 31201 20485 18393 -19828 -30550 -67158 -52220 -23 -7764 594
16195E94K6944o761j2073l8984l8498Q579J1560M2685P62k2730K665j966l9480
16182f6703K8314L5026j1197J0250j9879o8483L9233N2049K4883J1253m5009m0847
16170e1110J3015J3065l9532J2265M7574k8581N884K0457l2310n4818J405L8363
16158e4323O2177k871k2944J9441K5213l456j2519L1134O181k0370N638o445q5007
16145e8151l5413L9487O7318K4384j0517j2546J8703K0319K0200j1182n8061r115
16133d574L4902M4146K137l4296l4953k2877J3479l2988k8245J3499k8240J130
16121g6880K0256J8208L5994j2230j999j1636J7900j499J6065J8520M4441l2528
16109C4612m3307l4094L9619M0329K4227K7406J0970l3468k4773J0672j716m2035
$$ plain form
16195 594 27538 20777 8704 -30280 -68778 -60199 -48639 -5954 -5192 -27922 -25257 -27223 -66703
16182 -66703 -38389 -3363 -14560 -4310 -24189 -92672 -53439 -1390 23493 34746 -10263 -51110
16170 -51110 -38095 -25030 -64562 -52297 -4723 -33304 -27420 -6963 -39273 -94091 -92686 -54323
16158 -54323 7854 4983 -17961 1480 26693 23237 10718 41852 48033 27663 33301 26856 -58151
16145 -58151 -93564 -54077 13241 37625 27108 14562 33265 53584 73784 62602 4541 -4574
16133 -4574 30328 74474 76611 42315 7362 -15515 -2036 -35024 -63269 -49770 -78010 -76880
16121 -76880 -56624 -38416 -2422 -14652 -16651 -28287 -10387 -11886 4179 22699 67140 34612
16109 34612 -8695 -42789 -3170 37159 61386 88792 99762 66294 41521 52193 50477 8442
16097H442n9353J466K6644M7888q24J050k5971m0405O037L6192P439o4316J6363
16084c9348Q2855M790k867M1988j830j8801n214k2161L3968J6177k6344n376N25
16071E8362l312m2566m0613K1269L1106M180j4238M5937P84k2053o966R247O738
16058D7875K4948m3602j1828J3226n291j7048j641N2477j8760j1446j0025J6085
16046C4970m3771l5686K7418r64O45k437r4J9640j4949l9568J3284K8469r550
16033b2593P849K7802k0682j112N584j4257M3107N4433j2324l2842l4156j0974
16021a0165j6197J3428r45R73L7232L9397m857k2428l538J65j3496m4440K100
16008b2771N8482p94l4922J4302N436K4824k3789j5561Q089N844o017n229N2055
$$ plain form
16097 8442 -50911 -49445 -22801 25087 24263 25313 -658 -41063 -35026 1166 8605 -55711 -39348
16084 -39348 43507 48297 45430 87418 85588 66787 61573 39412 73380 89557 63213 57837 58362
16071 58362 55050 12484 -28129 -6860 24246 28426 14188 60125 60909 38856 31890 41137 47875
16058 47875 72823 29221 17393 30619 25328 8280 6639 59116 40356 28910 18885 34970
16046 34970 -8801 -44487 -17069 -18033 -17388 -19825 -19919 -279 -15228 -54796 -41512 -13043 -22593
16033 -22593 -14744 13058 -7624 -8736 -3152 -17409 25698 80131 67807 34965 809 -10165
16021 -10165 -26362 -12934 -13879 -12906 24326 63723 58866 36438 32900 33065 19569 -24871 -22771
16008 -22771 35711 34917 -5 14297 19733 44557 20768 5207 13296 19140 13123 7894 59949
15995E9949P633j8796k998J8640q238m8687k3255O05j9307l9030J6002j0779m1438
15982a09699j6381O1250M3289p063L0611K740L4737j1522J1321o639k0692k4548
15970a2596J8129P1758L4538k2856j689N964j3025j0553k4135k4209k7373m5069
15958e1116q763K0495j4051K1988K640m8838k1518j4562N3017N5930L9929J8135
15946E3286K0175n3660j2011j148R378J7011k064l9930K340P164N951K2128j608
15933B7012K2587J8652n3496n6964O779L7972M9425q081j7363k9544k2686m021
15921b9728k6174K1582J813j2838n220K5872K9203j6820O114J2515j410L4066
15909C8975J7465l3420N19j2248o806J4786K6392M369m7839p1011l8343L1957
$$ plain form
15995 59949 67582 48786 45788 64428 56190 7503 -15752 -15147 -34454 -73484 -57482 -68261 -109699
15982 -109699 -126080 -64830 -21541 -28604 2007 4747 39484 27962 39283 32644 11952 -12596
15970 -12596 5533 77291 111829 88973 87284 93248 80223 69670 45535 21326 -6047 -51116
15958 -51116 -59879 -39384 -53435 -31447 -28807 -77645 -99163 -113725 -60708 -4778 35151 53286
15946 53286 73461 19801 7790 6642 16020 33031 30967 -8963 -6623 541 6492 28620 27012
15933 27012 49599 68251 14755 -42209 -35430 2542 51967 43886 26523 -3021 -25707 -29728
15921 -29728 -55902 -34320 -32507 -45345 -50565 -24693 4510 -12310 -6196 6319 4909 38975
15909 38975 56440 23020 23539 11291 4485 19271 45663 50032 2193 -68818 -107161 -75204
15897g5204P3112l3439p2665o268L1151K7769R874q244k003J1218M4593O8911
15885F8805J7753m0867m0905k4491r006k692m032M540K2279J3238J906l6290r798
15872c9560K9059J8161m9636K6533j4834j8178N017N08j9761K8650L8745j596
15860C108r161o1766n055M6206J0986k8801O003k3799j9876k2437L9663K6057
15848c8872K2204L0532l190j1808j1034J7013L831L0747j2133n9464l905N5320
15836A9241L7209k2216j1475L6787J6985j3775k6966l3711k112l5143L967K7810
15824c399l1293q312N152Q717K2206K6798p319j232j7493R935p092n1846j732
15811e6910L6274k333k587j1211J2290M1197K1947r750n5079M2576N9456l2933
$$ plain form
15897 -75204 -2092 -35531 -108196 -114464 -83313 -55544 -45670 -53914 -55917 -44699 -106 68805
15885 68805 86558 45691 4786 -19705 -28711 -31403 -35435 -30895 -8616 4622 6528 -29762 -39560
15872 -39560 -10501 7660 -41976 -15443 -30277 -48455 -43438 -42930 -62691 -34041 4704 3108
15860 3108 -6053 -67819 -72874 -26668 -15682 -44483 -38480 -62279 -82155 -104592 -64929 -38872
15848 -38872 -16668 13864 10674 -1134 -12168 4845 8676 39423 27290 -32174 -36079 19241
15836 19241 56450 34234 22759 59546 76531 62756 35790 2079 -33 -35176 -31209 -3399
15824 -3399 -34692 -43004 -37852 -29135 -6929 19869 12550 11318 -6175 3760 -3332 -55178 -56910
15811 -56910 -20636 -22969 -25556 -36767 -24477 16720 38667 28917 -26162 16414 75870 42937
15799D2937m3336J1873m2809J1526R517j4648N0536J2397l9287L519J8410k0996
15787c61P570k0524K4871L0842k241k5860M0946k6504n0018j340R944l372j6065
15774c2112r678L0931K4951k1756m3189K2968K9265P795n936j6110l1030l9m99
15761d4439j4227J7063R739j493k39K853L7313l0033k2850R200P502L3611K6740
15748C0740k530k0932k1771J355j3991Q030l1064k4226O6528J4181k0892k2009
15736c6581j3303J0514K0107k3497J3102J0674J9694J4155j6194j3768P486J8740
15724A1129K4465j0255k6669j6737J2366K0709O736l703J0893P629m575p609K4443
15711D8822K0470k0717M664j2331n2256K0032k197n2156L9564L4676j0670j7704
$$ plain form
15799 42937 -399 11474 -31335 -19809 -10292 -24940 25596 37993 -1294 2225 20635 -361
15787 -361 7209 -13315 11556 42398 40157 14297 55243 28739 -21279 -22619 -12675 -16047 -32112
15774 -32112 -41790 -10859 14092 -7664 -50853 -27885 1380 9175 3239 -12871 -43901 -43940 -44439
15761 -44439 -58666 -41603 -31864 -33357 -33596 -30743 6570 -23463 -46313 -37113 -29611 4000 30740
15748 30740 28210 7278 -14493 -13138 -27129 -19099 -50163 -74389 -7861 6320 -14572 -36581
15736 -36581 -49884 -39370 -19263 -42760 -29658 -18984 710 14865 -1329 -15097 -7611 11129
15724 11129 35594 25339 -1330 -18067 -5701 15008 21744 18041 28934 36563 31988 24379 48822
15711 48822 69292 48575 53239 40908 -11348 8684 6487 -45669 -6105 28571 17901 197
15699A97r243k2025k8479J1228K8594K266k2722k2649J1920K1915Q595L658L8503
15686B1758j7654p302J017K0317J1891q036j0832l2311R197J2130j3697N359K430
15673e733l1078L8114J0823k4727j559L164J5811o761n5415j0449L3234j8337
15661e2913L5225J6748j4506l1345j5648K5020J8665j5681k410L5046M9998n300
15649D2899l5203J7J2126k550K0534M8711k0859n4858j2344j7128P547j4191j3111
15636c8410k7285l7812M2109O9818K2185j7994j1610J7034M0030K8566k6309l4359
15624B5963J9973k743k8430n982j8475j6236q127K577K0326J8990o901j4670J1005
15611b730j0741O734O201J0198j7612M5173j9993p415O734j868l4897j2224K8260
$$ plain form
15699 197 -9046 -31071 -59550 -48322 -19728 -17462 -40184 -62833 -50913 -28998 -20403 -16745 21758
15686 21758 4104 -3198 -2181 18136 30027 21991 11159 -21152 -11955 175 -13522 -8163 -5733
15673 -5733 -36811 1303 12126 -12601 -14160 -10996 4815 -1946 -57361 -67810 -34576 -52913
15661 -52913 -17688 -940 -15446 -46791 -62439 -37419 -18754 -34435 -36845 -1799 48199 42899
15649 42899 7696 7713 19839 17289 37823 86534 65675 10817 -1527 -18655 -11108 -25299 -38410
15636 -38410 -65695 -103507 -61398 8420 30605 12611 1001 18035 58065 86631 60322 25963
15624 25963 45936 43193 14763 8781 -9694 -25930 -34057 -31480 -11154 7836 935 -13735 -2730
15611 -2730 -13471 -6737 -536 9662 -7950 37223 17230 9815 16549 14681 -20216 -32440 -4180
15598d180M8947j2845N17j4798Q107O255k9309M5140k7728k4098K5233N23j8046
15585C718K523q189j6045J3725O375M42n96j2743J253m4826l100L532K5925P9337
15571E1331K9343L726N970l4672k1820J2357k8206j3709l9028j1288L7574K3118
15559A4696p370j2112Q855o2J1811k3997k3115J9370L3343n053k7210p342j2414
15546c0600k3419j7322K6324L6221k1416J0627L4524k5721K513M1710J2954j0839
15534C5556k9099n1805J3690M4898n00k9202k2589L4164O873m957K3835m2465
15522b1601K965L4144L5967j5253m0090k3919m008K4684R851J9133L7546o4360
15510d941p5192J6263Q600L2466K3891Q175J0721j7928J0881k5311K2408j5467
$$ plain form
15598 -4180 44767 31922 32439 17641 25748 32003 2694 47834 20106 -3992 21241 21764 3718
15585 3718 6241 -1948 -17993 -4268 2107 2549 1953 -10790 -9537 -54363 -57463 -53931 -28006 51331
15571 51331 80674 84400 90370 55698 33878 46235 18029 4320 -34708 -45996 -8422 14696
15559 14696 7326 -4786 4069 4007 15818 -8179 -31294 -11924 21419 16366 -10844 -18186 -30600
15546 -30600 -54019 -71341 -45017 -8796 -30212 -19585 14939 -10782 -8269 33441 46395 35556
15534 35556 6457 -45348 -31658 13240 12740 -16462 -39051 -4887 1986 -2971 20864 -21601
15522 -21601 -18636 15508 51475 36222 -3868 -27787 -31795 -7111 2740 21873 59419 -4941
15510 -4941 -80133 -63870 -55270 -22804 1087 9262 19983 2055 12936 -12375 10033 -5434
15498e434j6229l105L51m6230m880J1638J2716M9116L8853R192j4575j0844P218
15485B7787N006L671P99k5766j6214k6111j0525j7381L5625Q831Q583m311k3308
15472c3314k8646K0597Q5173J9176p500j3057l5521o274L1982k7289J2169k13
15460A7283l6053k1580P98N530K050k4054N9081J3943Q904M2747R406n4987k8976
15447e908J8923l726m989p600O562L2953K5395k5803l1195k878l820L5170K3704
15434E6788J6911m1731p23M3165K878R251n991l8313m7750k2898j9347n605M6908
15421f457r166K591J9687K3817P193k1548l4827K0642L0159M56K0294M209K944
15408E9994P814L1642m065o4133j3424L7190K4802j8020N831J7852j5685l1440
$$ plain form
15498 -5434 -21663 -24768 -24417 -70647 -75527 -63889 -51173 -2057 36796 45988 31413 20569 27787
15485 27787 32793 36464 37263 11497 -4717 -30828 -41353 -58734 -23109 -14278 -5695 -10006 -33314
15472 -33314 -61960 -41363 43810 62986 55486 42429 6908 634 32616 5327 17496 17283
15460 17283 -18770 -40350 -39552 -34022 -31972 -56026 3055 16998 25902 68649 78055 23068 -5908
15447 -5908 13015 9289 4300 -3300 3262 36215 61610 35807 4612 1734 -2086 33084 56788
15434 56788 73699 31968 31245 74410 77288 86539 80548 42235 -5515 -28413 -47760 -53365 -6457
15421 -6457 -15623 -13032 6655 30472 37665 16117 -18710 1932 32091 32547 52841 57050 59994
15408 59994 67808 99450 95385 31252 17828 55018 79820 61800 67631 85483 69798 38358
15396C8358K8032J6047j4306M857p030n5511l5889k1501J1016J4011N6988J0684
15384D5756j2260J0080j5504M371K139M757n4941l2887J8532P374K531J558K9601
15371A1107J1699L1855r263m2253l8241M1163o341K8528L2237j9667J2916m9709
15359D031o2949j2037n290J53L0736L0480J9093n341N453r056k1234K2934Q043
15346E016M0332L7537M77m5978j1695k4066m6598M0624K4017j1706m5337j8769
15334e6146J6963M169o195J1025J1558J3123k0939m8317n95N1825K6557j5364
15322a2336L3272M4218j5700J1428p759l0847k7145j5467M1108N0332k6005m8083
15310b984K602J3186K3093l4469q159n35o758M6001J9653n9640k9184K8374L3663
$$ plain form
15396 38358 66390 82437 68131 72988 65958 10447 -25442 -46943 -35927 -21916 35072 45756
15384 45756 33496 43576 28072 32443 34582 39339 -15602 -48489 -29957 -22583 -20052 -18494 11107
15371 11107 22806 54661 45398 3145 -35096 6067 -274 28254 60491 40824 53740 4031
15359 4031 -58918 -70955 -76245 -76092 -45356 -14876 4217 -1124 4329 -4727 -25961 -3027 5016
15346 5016 45348 82885 83362 37384 25689 1623 -44975 -4351 19666 7960 -37377 -56146
15334 -56146 -39183 -35014 -41209 -30184 -18626 -5503 -26442 -74759 -75354 -23529 3028 -12336
15322 -12336 20936 65154 49454 60882 53123 22276 -4869 -20336 20772 71104 45099 -2984
15310 -2984 -382 12804 35897 1428 -6731 -7266 -14024 31977 51630 -8010 -37194 -8820 24843
15297B4843P160p577o460J0069J3096J8816j9285k0671M4722n597j6611K6460
15285F8965k0663n5308k8204p401M912J8478J292O710p902l81J8589M1983j837
15272C9233o627k4190K1477p153j4383l9108J0801j7980L1173M699j7407k729
15260b2194J5793K7033j4343J4908l4887n3201k1179m084q062J2071P919K3322
15248e6904j5317R283K2430L5577K1840K1674J9955k226r080j7043q611l3613
15236a2035K718K212K4084O1923L3n051k9515k3725J2555n263N788L654l2409
15223D969L111m0946j4762j593O892L6402k187m2222R453L1731K1610q050j9095
15210a4687k134L5297L600J5843K2113k0795L485J6025L8927k6189l2824k7807
$$ plain form
15297 24843 32003 24426 17966 28035 41131 59947 40662 19991 64713 59116 42505 68965
15285 68965 48302 -7006 -35210 -42611 -37699 -19221 -17929 -11219 -19121 -19502 -913 41070 39233
15272 39233 32606 8416 29893 22740 8357 -30751 -19950 -37930 -6757 -2058 -19465 -22194
15260 -22194 -6401 20632 6289 21197 -13690 -66891 -88070 -92154 -100216 -88145 -80226 -56904
15248 -56904 -72221 -62938 -40508 -4931 16909 38583 58538 56312 47232 30189 21578 -12035
15236 -12035 -9317 -7105 16979 78902 78935 73884 44369 20644 33199 27936 33724 37378 4969
15223 4969 8080 -32866 -47628 -49221 -42329 -5927 -8114 -50336 -40883 -9152 12458 4408 -14687
15210 -14687 -16821 18476 22076 37919 60032 39237 42722 58747 97674 71485 38661 10854
15198A0854k0903k5328L1362L4964j0683p802k862j3114j7218j444l6263N135
15186e3302K4436N668M1142M6433J7817j1548j9426k0968j5850m511j3791R731
15174E831k386l8239L2280q614j3638J949j6577j189r666r272j036MJ3924K4809
15160b1820k5885K7413J352k487K0030l1397j0023j586K3433j067L1708j1913
15148b242j9481J064K1408n1686m507J3424L0886n650K1827j1479J2561J9652
15136B5777L0608m8491l4522M7878j0201k0119j5210J2766L4521J0117J360l627
15124C0857J3373j3973K2195k3812k8042M2331Q806L7303N5l4453m358m0260o6977
15111e6955L663L4561K7038J6511k2864j7206m9687j1832L4790M9313j8464k1262
$$ plain form
15198 10854 -10049 -35377 -4015 30949 20266 12464 9602 -3512 -20730 -22174 -58437 -53302
15186 -53302 -28866 -23198 17944 64377 82194 70646 51220 30252 14402 9891 -3900 5831
15174 5831 3445 -34794 -2514 -11128 -24766 -22817 -39394 -40583 -50249 -59521 -60557 -60553 -46629 -21820
15160 -21820 -47705 -20292 -18940 -21427 -1397 -32794 -42817 -44403 -20970 -22037 9671 -2242
15148 -2242 -21723 -20659 749 -50937 -55444 -42020 -11134 -16784 5043 -6436 6125 25777
15136 25777 56385 7894 -26628 21250 11049 -9070 -24280 -11514 23007 33124 34484 30857
15124 30857 44230 30257 52452 28640 598 42929 51735 89038 89093 54640 50282 10022 -56955
15111 -56955 -53292 -18731 8307 24818 1954 -15252 -64939 -76771 -41981 7332 -11132 -32394
15099c2394M4063k05q641N585j3071k6149j0275J9315O546m6949p274L4727K8093
15086f629K861k6269j3101k0949O55L9064K0852j5878M428M3246p860k3478p221
15073a0279l7100J5679L7126m1737j2822l268J684L5618Q1704J0458l6780m8024
15061g741J7750N1331L6416m0776q1568N764n900l1786k2723M197R558N872lL3036
15047b6573M4357P837j9576Q178K8578M353M1007N481n0253j9092M850L0218k6766
15034C2599J2816K1543n5867m4350J390K1272j0864j7863o87n742M4224L5091
15022C3562l0959p21K0080J2734j4872q440J6152l7745j9302n491j0175J7973
15010b7204J6226J3407J3206R634j6037l0048K0933K1218l1589l9241K3064K8065
$$ plain form
15099 -32394 11669 11464 2823 8408 -4663 -30812 -41087 -21772 -15226 -62175 -69449 -34722 -6629
15086 -6629 -3768 -30037 -43138 -64087 -63432 -24368 -3516 -19394 -14966 28280 20420 -3058 -10279
15073 -10279 -47379 -31700 5426 -36311 -49133 -52401 -50717 -15099 66605 77063 40283 -7741
15061 -7741 10009 61340 97756 56980 -24588 -18824 -24724 -56510 -79233 -75036 -65478 -59606 -59609 -26573
15047 -26573 17784 25621 6045 14223 42801 47154 88161 93642 43389 24297 29147 59365 32599
15034 32599 45415 66958 11091 -33259 -31869 -10597 -21461 -39324 -40011 -45753 -1529 33562
15022 33562 2603 1882 21962 34696 19824 11384 27536 -10209 -29511 -35002 -45177 -27204
15010 -27204 -10978 2429 15635 25269 9232 -20816 117 21335 -10254 -49495 -26431 1634
14998A634k0432k0942K8979K4640j3979O0578M3748J5395l6256l6021k0855K1136
14986D7625k833j7580K665j1340j5375J9878J6002J4521l1713m5799n1048K832
14974g2165k7750N7089K4152k5222K7893L0290Q716L5535n882l4767L7699L49
14962E5937j5117p303K6099j670l7115K9109K3369n54M9588k1702m1028l5663
14950B3950j0916j7780m3346j3061M5778K0573R347J2679K8963k6105m1412j685
14938a3015j6891J5530K633Q094L9840k1784m7883K9269J9627l3602l9832L3682
14926b4332J3398k3959N0356L916n2542K6345J3837j9329L9536l4078k7074J0688
14914b3238M6845J0928j876L3357L2095o639p4738k6416J7459p359J4504P7691
$$ plain form
14998 1634 -18798 -39740 -10761 13879 -100 60478 104226 119621 83365 47344 26489 47625
14986 47625 44792 27212 29877 18537 3162 23040 39042 53563 21850 -23949 -74997 -72165
14974 -72165 -99915 -42826 -18674 -43896 -16003 14287 23003 58538 52656 17889 55588 55937
14962 55937 40820 33517 59616 57946 20831 49940 73309 72755 122343 100641 59613 23950
14950 23950 13034 -4746 -48092 -61153 -15375 5198 14545 27224 56187 30082 -11330 -13015
14938 -13015 -29906 -14376 -11743 -3649 36191 14407 -33476 -4207 15420 -18182 -58014 -24332
14926 -24332 -10934 -34893 15463 19379 -33163 -6818 7019 -12310 27226 -6852 -33926 -23238
14914 -23238 23607 34535 32659 66016 98111 91472 16734 -9682 7777 418 14922 92613
14902I2613J3300o8856j0545k4912j0941P3925J1904m9383j7106j5426k663L9144
14890C1054K9546M958l4874k6957N650j6224m897K1092J0675K1106j9780j2949
14878H400J9713j9661k6951k196j9823L8931K4436n1363J376j1720M954j558N2611
14865A7149K4776n943O420J3183K385n2198j4134K0465J5220l0402m9118J721
14853e0476K2180J8689m450J6038P087k8979n1115L9092K7931k8616J0584L6607
14841A4572P10k0262j7852l2417q988L8268J6306j3288K0076O340k5258K011O689
14828a3093M4252R670Q474R987p67l8047l4661L6479K3258k6377p2171l1682K0701
14815f3977N0753k730n7428N715K3264O26L8296j9440n9162J9383M6626J3204
$$ plain form
14902 92613 105913 37057 26512 1600 -9341 64584 76488 27105 9999 -5427 -8090 31054
14890 31054 60600 65558 30684 3727 9377 -6847 -11744 9348 20023 41129 21349 8400
14878 8400 28113 8452 -18499 -20695 -40518 -1587 22849 -28514 -27138 -38858 -33904 -35462 17149
14865 17149 41925 35982 42402 55585 57970 5772 -8362 12103 27323 -3079 -52197 -50476
14853 -50476 -28296 -9607 -14057 1981 9068 -19911 -71026 -31934 -4003 -32619 -22035 14572
14841 14572 15282 -4980 -22832 -55249 -64237 -25969 -9663 -22951 -2875 3465 -21793 -19782 -13093
14828 -13093 31159 40829 49303 59290 58523 20476 -14185 22294 45552 19175 -52996 -84678 -63977
14815 -63977 -13224 -15954 -73382 -67667 -44403 -43777 -5481 -24921 -84083 -64700 -18074 -4870
14803d870j5767q491L5075J6331l2359P89J76M364o505o0758J4471L1385n983
14790c2142J1221k7045K9323K5474r944o655K190k0454J5136J8265K5764P152
14778C8285l9602r581O08o923m9610j6965O7941M1712k2467p197J0855r06j4187
14765h037p923k3667K185l760j672K8468J0805j3804k348n336J6206R854j359
14752c88Q814l6987J6533J0811l33K6l2786p082N676N4798P1151m0004L342R561
14738F3132J1413J8827p386j4514l5350j8743j2181j5236l0169j0112M2555J4918
14726G154q409K9702j4183j8172k8498J5733J3079j4700j0333J2485L0948q210
14714F596o28J3422L1403j1941J6343K259j1171n0654k4721k831j8373M0850q315
$$ plain form
14803 -4870 -20637 -29128 5947 22278 -10081 -9292 -9116 -4752 -11257 -72015 -57544 -26159 -32142
14790 -32142 -20921 -47966 -18643 6831 -3113 -9768 -7578 -28032 -12896 5369 31133 38285
14778 38285 -1317 -10898 -10290 -17213 -66823 -83788 -15847 25865 3398 -3799 7056 6150 -8037
14765 -8037 -15960 -39627 -37442 -41202 -42874 -14406 -3601 -17405 -19753 -25089 -8883 971 -388
14752 -388 8426 -28561 -12028 -1217 -1550 -1524 -34310 -41392 -35716 19082 90233 50229 53571 63132
14738 63132 74545 93372 85986 71472 36122 17379 5198 -10038 -40207 -50319 -7764 7154
14726 7154 -1255 28447 14264 -3908 -32406 -16673 -3594 -18294 -28627 -16142 14806 6596
14714 6596 5968 19390 50793 38852 55195 57454 46283 -4371 -29092 -31923 -50296 -9446 -17761
14701a7761o882J334M8119k059m9909j0372l7874J7567N1282k854q111n3496J6630
14688e4386J5085J0137K272K477K4757j9265N481J5749l4414L02q225J474K1046
14675a7510N2828m3738O947k208P675M986n898K2671l10l1584j5126l3485o406
14662f1158L7334l266j547Q846j5352Q171J6676j4903j5316k9624k759J8080L3997
14649b0821k6272O73N3067J7491P327j505N619j1572J9759L480J5472J7790M310
14636H4818l8367l0389N88K2936l0599j6494J6068j828k291o911j0885m043j7620
14623c5017q143j1359R179L7813j8879J0485k0612p107j0635k1830k0525L1508
14611f5122K6130K7179J608l2186K9908K1877K476N566M254J7602m943M3220K450
$$ plain form
14701 -17761 -24643 -23309 24810 22751 -27158 -37530 -75404 -57837 -6555 -9409 -17520 -71016 -54386
14688 -54386 -39301 -29164 -26892 -24415 342 -18923 -13442 2307 -32107 -31805 -40030 -38556 -17510
14675 -17510 35318 -8420 -1473 -3681 3994 8980 3082 25753 25443 -6141 -21267 -54752 -61158
14662 -61158 -23824 -27090 -28637 -19791 -35143 -26972 -10296 -25199 -40515 -70139 -72898 -54818 -20821
14649 -20821 -47093 -46420 6647 24138 31465 29960 35579 24007 43766 47246 62718 80508 84818
14636 84818 46451 16062 16650 39586 8987 -7507 8561 6733 4442 -2469 -13354 -17397 -35017
14623 -35017 -43160 -54519 -45340 -7527 -26406 -15921 -36533 -43640 -54275 -76105 -96630 -65122
14611 -65122 -38992 -11813 -10205 -42391 -12483 9394 11870 17436 21690 39292 34349 77569 80019
14598H0019k801n4188m5647j0268O3524P3179l271m5729m9747j4754r301l7768
14586e6752k3017l27K1492L2378q849J6834m282k0649l9858R334L2856K765L3084
14573d991L5744J450K0162j5571k5681J5449L001k7746m0573k7963j3535N4672
14561b5582J3092k3507K6598j0774Q84M1563j5792K1157M9137j2420m6142K247
14549B0461J7187n0386j6812J343J1435j3738j4759L097K4267O1611l220l9461
14537A025l2971q688Q993J678K1611L0491l4599m1819K4137L4462J9228q236j7896
14524b584k2973J3171j7347j4009Q283O3517M1743k8026l1489p200k363k4326
14512b3603j7754j5335j2234J8476j4086j9249L3905J3181n906K8726j4797l438
$$ plain form
14598 80019 77218 23030 -22617 -32885 30639 103818 100547 54818 5071 -9683 -18984 -56752
14586 -56752 -79769 -80096 -58604 -26226 -35075 -18241 -22523 -43172 -83030 -73696 -40840 -38075 -4991
14573 -4991 30753 32203 52365 36794 11113 26562 29563 1817 -38756 -66719 -80254 -25582
14561 -25582 -12490 -35997 -9399 -20173 -19289 22274 6482 27639 76776 64356 18214 20461
14549 20461 37648 -12738 -29550 -28207 -16772 -30510 -45269 -42172 -17905 43706 40486 1025
14537 1025 -31946 -40634 -31641 -29963 -8352 22139 -12460 -54279 -30142 4320 23548 15312 -2584
14524 -2584 -25557 -12386 -29733 -43742 -35459 28058 69801 41775 10286 3086 723 -23603
14512 -23603 -41357 -56692 -68926 -50450 -64536 -83785 -49880 -36699 -42605 -13879 -28676 -32114
14500c2114K3534J9426j0748M7039N7393p576m3942m5703l1477K1812k8278J4515
14488a6119k1476j6411K1525O8727P748n243k0563n7550m150o54M7888M0739J9867
14475F4328j4762j0573j689k6626l0031j0800p202K1268M2168M7168p072l5481
14463C0696K0232J3290k1550j1354k5975k6446m490J3010P604N248J8805K1464
14451D0534j531l3097l5230l1778N4182N7310p903m2634m575J3949J5663p514
14439A7376j5969l5733n2671k5634K1602N5355j54K4667j0876m188k9826Q191
14427d7860O7372K1980k5941k610J832o459O2292N204j7438m4945r001L5269O853
14414D6548J7202K6237R573N734j525m4155n5364k246K1169p498L8188L9962m8862
$$ plain form
14500 -32114 -8580 10846 98 47137 104530 96954 53012 7309 -24168 -2356 -30634 -16119
14488 -16119 -37595 -54006 -32481 36246 43994 38751 18188 -39362 -43512 -44166 3722 44461 64328
14475 64328 49566 38993 37304 10678 -19353 -30153 -37355 -16087 26081 73249 66177 30696
14463 30696 50928 64218 42668 31314 5339 -21107 -25597 -12587 -4983 265 19070 40534
14451 40534 39003 5906 -29324 -61102 -6920 50390 42487 -147 -4722 9227 24890 17376
14439 17376 1407 -34326 -86997 -112631 -91029 -35674 -35828 -11161 -22037 -26225 -56051 -47860
14427 -47860 19512 41492 15551 12941 14773 8314 70606 75810 58372 13427 4426 39695 46548
14414 46548 63750 89987 99560 105294 103769 59614 4250 2004 23173 15675 53863 93825 44963
14401D4963k9660k5442j4960j4259l4387J273J64P046K7000j2578j0632m812J1751
14388e4533p10r44k1161l2064M3127N1022l576M8171J9279r905j1769k5404r995
14375h462N264J6075j9607J3696M195L1635j1169N642l3222K4733k4612k2344
14363a8176k2707r045k0054J1700K8401J568M147M3657N3530k7033o0723k3708
$$ plain form
14401 44963 15303 -10139 -25099 -39358 -73745 -72472 -72308 -65262 -38262 -50840 -61472 -66284 -54533
14388 -54533 -55243 -56187 -77348 -109412 -66285 -15263 -18839 29332 48611 38706 26937 1533 -8462
14375 -8462 -3198 12877 -6730 6966 11161 42796 31627 37269 4047 28780 4168 -18176
14363 -18176 -40883 -49928 -69982 -58282 -29881 -28313 -24166 19491 73021 45988 -14735 -38443
$$ [...]
##END NTUPLES=NMR SPECTRUM
##END=
