##TITLE=Analysis number 320098
Compound Code cc 00802
Project Code adrs
Chemist Name fudan
##JCAMPDX= 6.0         $$ Bruker NMR JCAMP-DX V2.0
##DATA TYPE= NMR SPECTRUM
##DATA CLASS= NTUPLES
##ORIGIN= Bruker BioSpin GmbH
##OWNER= nmr
$$ XWIN-NMR		Version 3.5
$$ Tue Jun 13 11:31:53 2006 GMT Daylight Time (UT+1h)  MAYBRIDGE\nmr@NMR_250MHZ
##.OBSERVE FREQUENCY= 250.131544655141
##.OBSERVE NUCLEUS= ^1H
##.ACQUISITION MODE= SIMULTANEOUS (DQD)
##.ACQUISITION SCHEME= undefined
##.AVERAGES= 16
##.DIGITISER RES= 18
##SPECTROMETER/DATA SYSTEM= dpx250
##.PULSE SEQUENCE= zg30
##.SOLVENT NAME= CDCl3
##.SHIFT REFERENCE= (INTERNAL, CDCl3, 0, 16.522)
##AUDIT TRAIL= $$ (NUMBER, WHEN, WHO, WHERE, WHAT)
$$ ##TITLE= Audit trail, XWIN-NMR		Version 3.5
$$ ##JCAMPDX= 5.01
$$ ##ORIGIN= Bruker BioSpin GmbH
$$ ##OWNER= nmr
$$ C:\u/data/dgb/nmr/ADRS/660/pdata/1/auditp.txt
$$ ##AUDIT TRAIL=  $$ (NUMBER, WHEN, WHO, WHERE, WHAT)
(   1,<2006-06-13 11:31:27.83 +100>,<MAYBRIDGE\nmr>,<NMR_250MHZ>,
      <created by zg, POWCHK disabled, PULCHK disabled
       configuration hash MD5:
       E2 DF 36 D8 04 B2 41 60 5A D7 A3 38 5A 4B D0 FE
       data hash MD5: 64K
       53 A4 CF 80 A1 3A C9 72 93 D6 FD 0B 38 42 5D FB>)
(   2,<2006-06-13 11:31:41.31 +100>,<MAYBRIDGE\nmr>,<NMR_250MHZ>,
      <Start of raw data processing
       ef LB = 0.3 FT_mod = 6 PKNL = 1 SI = 32K 
       data hash MD5: 32K
       D9 5E 1F 02 9C AD 7C 3D 46 6A 1B 35 A4 76 0C D4>)
(   3,<2006-06-13 11:31:43.08 +100>,<MAYBRIDGE\nmr>,<NMR_250MHZ>,
      <apk 
       data hash MD5: 32K
       7A 81 D9 9E 4B 04 7E AA A6 BC 50 25 79 7A F9 D7>)
(   4,<2006-06-13 11:31:44.11 +100>,<MAYBRIDGE\nmr>,<NMR_250MHZ>,
      <abs ABSG = 5 
       data hash MD5: 32K
       7D 86 5B 55 CF E3 D2 0C 7D 78 CE 53 A0 FB 31 09>)
$$ ##END=
$$ 
$$ hash MD5
$$ 68 35 AB FE 31 9C 7D E5 6A AB F8 71 8D 6A 8A 81
##$RELAX= 
##$RELAX= 
##$RELAX= 
##$RELAX= 
##$RELAX= 
##$RELAX= 
##$RELAX= 
$$ Bruker specific parameters
$$ --------------------------
##$DU= <C:\u>
##$EXPNO= 660
##$NAME= <ADRS>
##$PROCNO= 1
##$TYPE= <nmr>
##$USER= <dgb>
##$AMP= (0..31)
100 100 100 100 100 100 100 100 100 100 100 100 100 100 100 100 100 100 
100 100 100 100 100 100 100 100 100 100 100 100 100 100 
##$AQSEQ= 0
##$AQ_mod= 3
##$AUNM= <au_zg>
##$AUTOPOS= <20 >
##$BF1= 250.13
##$BF2= 250.13
##$BF3= 250.13
##$BF4= 250.13
##$BF5= 500.13
##$BF6= 500.13
##$BF7= 500.13
##$BF8= 500.13
##$BYTORDA= 1
##$CFDGTYP= 0
##$CFRGTYP= 5
##$CHEMSTR= <none>
##$CNST= (0..31)
1 1 145 1 1 1 1 1 1 1 1 1 1 1 1 1 1 1 1 1 1 1 1 1 1 1 1 1 1 1 1 1 
##$CPDPRG= <>
##$CPDPRG1= <>
##$CPDPRG2= <>
##$CPDPRG3= <>
##$CPDPRG4= <mlev>
##$CPDPRG5= <mlev>
##$CPDPRG6= <mlev>
##$CPDPRG7= <mlev>
##$CPDPRG8= <mlev>
##$CPDPRGB= <>
##$CPDPRGT= <>
##$D= (0..31)
0 1 0 0 0 0 0 0 0 0.06 0 0 0 0 0 0 0.0002 0 0 0 0 0 0 0 0 0 0 0 0 0 0 
0 
##$DATE= 1150194685
##$DBL= (0..7)
120 120 120 120 120 120 120 120 
##$DBP= (0..7)
150 150 150 150 150 150 150 150 
##$DBP07= 0
##$DBPNAM0= <>
##$DBPNAM1= <>
##$DBPNAM2= <>
##$DBPNAM3= <>
$$ [...]
##$SUBNAM7= <"">
##$SUBNAM8= <"">
##$SUBNAM9= <"">
##$SW= 20.6930455092707
##$SWIBOX= (0..15)
0 0 3 0 0 0 0 0 0 0 0 0 0 0 0 0 
##$SW_h= 5175.983436853
##$TD= 65536
##$TD0= 1
##$TE= 295.16
##$TE2= 300
##$TE3= 300
##$TEG= 300
##$TL= (0..7)
0 120 120 120 120 120 120 120 
##$TP= (0..7)
150 150 150 150 150 150 150 150 
##$TP07= 0
##$TPNAME0= <>
##$TPNAME1= <>
##$TPNAME2= <>
##$TPNAME3= <>
##$TPNAME4= <>
##$TPNAME5= <>
##$TPNAME6= <>
##$TPNAME7= <>
##$TPOAL= (0..7)
0.5 0.5 0.5 0.5 0.5 0.5 0.5 0.5 
##$TPOFFS= (0..7)
0 0 0 0 0 0 0 0 
##$TUNHIN= 0
##$TUNHOUT= 0
##$TUNXOUT= 0
##$USERA1= <user>
##$USERA2= <user>
##$USERA3= <user>
##$USERA4= <user>
##$USERA5= <user>
##$V9= 5
##$VALIST= <valist>
##$VCLIST= <CCCCCCCCCCCCCCC>
##$VD= 0
##$VDLIST= <DDDDDDDDDDDDDDD>
##$VPLIST= <PPPPPPPPPPPPPPP>
##$VTLIST= <TTTTTTTTTTTTTTT>
##$WBST= 1024
##$WBSW= 4
##$XGAIN= (0..3)
0 0 0 0 
##$XL= 0
##$YL= 0
##$YMAX_a= 295398
##$YMIN_a= -428776
##$ZGOPTNS= <>
##$ZL1= 120
##$ZL2= 120
##$ZL3= 120
##$ZL4= 120
##$ABSF1= 16.522
##$ABSF2= -4.171173
##$ABSG= 5
##$ABSL= 3
##$ALPHA= 0
##$AQORDER= 0
##$ASSFAC= 0
##$ASSFACI= 0
##$ASSFACX= 0
##$ASSWID= 0
##$AUNMP= <proc_1d>
##$AZFE= 0.1
##$AZFW= 0.1
##$BCFW= 0
##$BC_mod= 0
##$BYTORDP= 0
##$COROFFS= 0
##$CY= 12.5
##$DATMOD= 1
##$DC= 0
##$DFILT= <>
##$DTYPP= 0
##$F1P= 14.0000005364418
##$F2P= -0.99999901652339
##$FCOR= 0.5
##$FTSIZE= 32768
##$FT_mod= 6
##$GAMMA= 0
##$GB= 0
##$INTBC= 1
##$INTSCL= 1
##$ISEN= 128
##$LB= 0.3
##$LEV0= 0
##$LPBIN= 0
##$MAXI= 10000
##$MC2= 0
##$MEAN= 0
##$ME_mod= 0
##$MI= 0
##$NCOEF= 0
##$NC_proc= -5
##$NLEV= 6
##$NOISF1= 0
##$NOISF2= 0
##$NSP= 0
##$NTH_PI= 0
##$NZP= 0
##$OFFSET= 16.522
##$PC= 1
##$PHC0= 174.9403
##$PHC1= 9.303361
##$PH_mod= 1
##$PKNL= yes
##$PPARMOD= 0
##$PSCAL= 4
##$PSIGN= 0
##$REVERSE= no
##$SF= 250.13
##$SI= 32768
##$SIGF1= 0
##$SIGF2= 0
##$SINO= 400
##$SIOLD= 32768
##$SREGLST= <1H.CDCl3>
##$SSB= 0
##$STSI= 32768
##$STSR= 0
##$SW_p= 5175.98343685301
##$SYMM= 0
##$S_DEV= 0
##$TDeff= 65536
##$TDoff= 0
##$TI= <Analysis number 999999
Compound Code 99
Book Reference 9
Project Code 9>
##$TILT= no
##$TM1= 0
##$TM2= 0
##$TOPLEV= 0
##$USERP1= <user>
##$USERP2= <user>
##$USERP3= <user>
##$USERP4= <user>
##$USERP5= <user>
##$WDW= 1
##$XDIM= 32768
##$YMAX_p= 502309306
##$YMIN_p= -811755
$$ End of Bruker specific parameters
$$ ---------------------------------
##NTUPLES= NMR SPECTRUM
##VAR_NAME=  FREQUENCY,     SPECTRUM/REAL,   SPECTRUM/IMAG
##SYMBOL=    X,             R,               I
##VAR_TYPE=  INDEPENDENT,   DEPENDENT,       DEPENDENT
##VAR_FORM=  AFFN,          ASDF,            ASDF
##VAR_DIM=   32768,         32768,           32768
##UNITS=     HZ,            ARBITRARY UNITS, ARBITRARY UNITS
##FACTOR=    0.157963299565203, 1,           1
##FIRST=     4132.6476996994, 0,             0
##LAST=      -1043.33573715361, 0,           0
##MIN=       -1043.33573715361, -811755,     0
##MAX=       4132.6476996994, 502309306,     0
$$ Real data points
##PAGE= N=1
##DATA TABLE= (X++(R..R)), XYDATA
$$ [...]
23153 61805 -19039 -3684 -57445 -266975 -249838 -284357 -226026 -132265 146921 162277 -70053
23142 -70053 -118815 -72159 49649 29466 -120848 -35916 111421 134469 236850 148550 206595
23131 206595 208810 85032 77261 130887 126314 163824 167794 104485 64375 44052 81008 -2588
23119 -2588 -11932 -83565 -179133 -266516 -24311 161517 210924 235018 120899 -120402 -126665
23108 -126665 46490 18037 33773 -172695 -253407 -78582 -91217 -77264 -105114 97983 130263
23097 130263 85756 -10719 130216 220670 177039 75891 62704 -42119 -27431 -190743 -182368
23086 -182368 -72190 -131462 -85608 49109 73942 -17916 -253976 -182940 16786 53633 -134372
23075 -134372 -19564 -27761 -182155 -214057 -234775 -245653 -149213 -199335 -151744 -185387 -297849
23064 -297849 -220925 -159110 -145588 60612 108974 -182031 -294586 -105494 79993 135335
23054 135335 5515 -58151 -90928 -337110 -354142 -262346 -106169 12394 -8182 -212584
23044 -212584 -379968 -402797 -324386 -89698 27451 154118 78653 -69961 5406 65130
23034 65130 -23070 -66664 16602 -8727 33394 127204 98909 -15848 17165 -21678 -71828
23023 -71828 -182026 -372102 -385515 -395898 -314234 -343885 -199511 -161106 -20393 39033 224500
23012 224500 186048 93933 22795 -21475 51155 163368 24148 154720 259206 209712 236718
23001 236718 291620 261001 194820 95646 -71916 -360541 -381403 -142721 9261 56043 279155
22990 279155 276345 329757 364679 298823 73618 -98886 -159887 -275275 -293974 -170942 -288769
22979 -288769 -443736 -546034 -485546 -236431 -145486 -38820 -60110 -151895 117830 299320
22969 299320 220228 217667 285870 290519 68219 -59238 64945 -107734 -128475 -81726 -262464
22958 -262464 -250518 31885 189706 117842 162244 129398 36773 -17146 997 -59480 -119493
22947 -119493 -179 48480 30755 73786 13825 171580 165520 -43953 -127794 -223892 -359012
22936 -359012 -165663 -45602 -111848 -150258 -193797 -59639 58300 29718 44358 157998
22926 157998 118801 118236 -96458 -275309 -278457 -129731 -209264 -276465 -313793 -388199 -150287
22915 -150287 4373 107630 148733 -21945 -265996 -459059 -321263 -273591 -156737 -27710
22905 -27710 83509 -30356 135875 200728 65992 -191693 -119320 50785 167024 132754
22895 132754 282844 287005 116687 71858 86794 -2489 -190801 -303930 -512179 -564031 -373326
22884 -373326 -176967 -91828 -184808 -232538 -171842 -224130 -115416 -170637 -230829 -124733 116745
22873 116745 322877 293872 103000 -7221 -83742 -107669 -352358 -262606 -261488 -211090 -145215
22862 -145215 -69600 -28212 -2023 -99524 -60403 11013 93367 -86617 -159474 83461 253391
22851 253391 108130 -50231 6064 95274 139688 204639 40164 100349 260302 -23977
22841 -23977 -260826 -337007 -200664 -175189 -52992 73496 -114057 -343143 -236805 -69190
22831 -69190 -91560 -97397 -12505 47844 100878 53766 -156975 -404984 -477660 -435563 -345663
22820 -345663 -327990 -252859 45509 -2557 -68810 -17196 -29465 -182886 -150870 -125308 139637
22809 139637 189806 -4688 -72318 97162 -104451 -376587 -543040 -371556 -86066 90052
22799 90052 -50361 -222766 37828 88327 68233 10306 -84828 12954 150188 136397 128327
22788 128327 172889 -105855 -254673 -382739 -242334 -5392 113340 120921 107610 -22362
22778 -22362 -256138 -150398 -148361 17899 216117 76300 4968 -143267 -142998 -79029 15876
22767 15876 46352 79652 134163 151850 -28659 -24852 82283 189881 80107 -15967 -7780
22756 -7780 60474 14019 113579 -31686 -58243 116602 170566 71215 -40924 -89005 -223388
22745 -223388 -211026 -208868 -216929 -151280 -307210 -442589 -265145 -127532 -253509 -58751 146327
22734 146327 329022 376819 224925 126877 202347 165999 183345 258137 5165 40985 220845
22723 220845 314164 188590 240630 118865 -91391 -171087 22429 -19878 -24413 8592 -138767
22712 -138767 -16215 -8647 -133932 -88543 129953 83650 48558 143913 -1826 -202028 -104556
22701 -104556 113653 -13998 -99495 -286752 -239069 17140 156621 338977 379931 164805
22691 164805 143444 162512 140800 -52663 -304448 -130226 36970 -176319 -399865 -307018
22681 -307018 -135266 -117997 -37194 43505 -109742 -30106 -38214 40235 72965 35335 124695
22670 124695 3633 -114638 10419 142719 179521 159387 -41390 -49896 -4810 -135094
22660 -135094 -88093 -32857 35135 24825 -249370 -342041 -269218 -31206 114163 -28894 -142873
22649 -142873 -19660 130853 101804 102657 84372 79163 -154011 -216588 43829 226600 71420
22638 71420 46800 -634 -202655 -81243 92384 144991 -140273 -146114 -11290 -38838 -92495
22627 -92495 -224964 -101677 192185 293802 168629 178577 112073 106314 71481 126410 89011
22616 89011 55179 17604 -125842 -88203 76796 18184 -152491 -251584 -190391 -89119 3018
22605 3018 25206 11795 -171130 -197958 18771 361063 389939 484608 578558 537654 376597
22594 376597 258169 276752 32874 22638 1948 -139065 -238534 -239947 -202339 -263190 -117000
22583 -117000 -142737 -63331 214772 377044 437615 341704 313500 409466 364189 384698 340214
22572 340214 246002 -64270 -84590 -43208 -83617 -68387 81754 50439 -73436 -51089 157296
22561 157296 225146 171388 61421 32398 92626 175228 55381 -74935 -8364 227253 180239
22550 180239 -187537 -143447 -205610 -234846 -98516 202102 416493 200582 -29909 -282932
22540 -282932 -278935 19405 218243 75017 54573 -96978 -278057 -113510 -73663 35719
22530 35719 108099 83887 125700 180966 19585 -32807 47178 142580 37017 -91348 -61070
22519 -61070 -236498 -139071 87809 245144 195476 -42451 -182807 -83560 -158895 -225646 -480514
22508 -480514 -723647 -624455 -451821 -177723 -89361 -88751 -90100 -129880 -347642 -531614 -456222
22497 -456222 -322260 -293218 -69976 104482 13047 -45130 54137 -18184 -173217 -216859 -202951
22486 -202951 -259059 -162496 -67125 -64069 -245049 -375543 -311640 -242579 -206009 -26933 -63937
22475 -63937 118214 66363 7248 47110 181934 45494 24768 112724 128652 90344 249887
22464 249887 299983 184575 80265 132496 186898 192141 123740 -60157 7090 -38533 -205375
22453 -205375 -235871 -222984 -326818 -72895 21514 -78888 -42614 -17672 150545 176637 -77724
22442 -77724 -170494 -105497 -46707 59063 26916 -64948 -73143 -142862 -346568 -367851 -300038
22431 -300038 -91009 -8458 -132315 -204368 -169122 -73114 -73971 -86481 -56154 -108243 -134514
22420 -134514 -181845 14782 154818 222391 370661 453746 302868 141328 217410 329979
22410 329979 240306 50562 -48564 -110014 -142548 -160473 -31635 -40068 -18234 -10144 -73506
22399 -73506 -58561 78189 -105415 -339688 -292248 -289810 -288576 -293371 -93697 60186 -72290
22388 -72290 -195739 -280230 -216295 -275513 -109376 36636 -99266 -27988 -24698 -97103 -51320
22377 -51320 -46673 -94743 -66783 44192 79959 71103 -74054 -225169 -109127 -153428 -252523
22366 -252523 -206751 -38085 193732 211988 144576 -23219 -113790 19551 -18401 -238363
22356 -238363 -205747 -69865 -160505 43986 129148 121428 181913 3880 25726 83238 17664
22345 17664 -89010 -79090 44764 119327 35870 35903 36609 63032 65292 -67556 -192281 -285823
22333 -285823 -245490 -210581 -397814 -415027 -440473 -511798 -378382 -24399 208816 108748
22323 108748 -24423 84289 55606 85495 217052 371436 258539 82538 -109745 -235925
22313 -235925 -44070 83737 -152292 -162374 -115429 92297 208774 46485 27366 -133659
22303 -133659 6803 -93363 -196207 -162364 -38225 18152 130673 264442 190252 18029
22293 18029 321109 339721 135287 138311 293682 173359 116010 235367 187127 181955 264965
22282 264965 68043 -8351 93809 93793 82503 -76607 -146592 -349603 -457385 -407486 -348623
22271 -348623 -290428 -255440 -234750 -125078 -62618 -40987 -205802 -313365 -367188 -259552 -12373
22260 -12373 -10478 -42551 -138852 48851 230031 300633 249663 94720 2137 -112014 -138891
22249 -138891 -144796 -167678 -224886 -225422 -56784 -85083 -384100 -257468 -99240 29853 168003
22238 168003 305472 286977 153121 13099 22705 -87278 74 -30891 -140289 -200413 -106945
22227 -106945 128633 148579 -66566 -226367 -259765 -203591 -136272 -123983 -258040 -404857
22217 -404857 -258253 -194052 -212268 -219899 -204528 -222967 -337421 -323917 -321505 -255442 -262840 -118330
22205 -118330 83687 -14741 -171160 151365 195284 42914 -62539 -26592 62667 -18758
22195 -18758 -108541 -201629 -143075 8729 -152428 -358210 -361080 -204584 -53207 -164480 -228940
22184 -228940 -140552 -99571 -119972 -112165 -14271 -98307 -195590 -72155 67751 -71592 -4607
22173 -4607 118437 182840 169529 20378 -10925 103253 173062 -92818 -37949 125255 246677
22162 246677 109910 76327 111198 47582 -9899 18625 -248485 -482498 -368781 -261444
22152 -261444 -339778 -347533 -361370 -272386 -57484 97444 94997 71463 -82970 -98235 72524
22141 72524 115867 -52390 -95343 -77308 27327 236507 254684 31425 -20204 237577 371046
22130 371046 372390 185089 147136 216570 401357 541935 532543 341306 354613 334419 342801
22119 342801 220631 -19898 -61499 -65063 125817 165452 59349 -97150 -41678 143537
22109 143537 97057 -40519 -42164 -21253 102798 -8116 -54812 87998 444293 549387
22099 549387 180518 -57464 -251667 -350700 -172571 20958 99527 150031 174141 109210
22089 109210 -230440 -260973 -246221 -201935 -98876 41612 157291 62625 -49713 -289985
22079 -289985 -213457 -54833 2923 -33259 -118056 -148556 -195593 -194668 -239831 -98074 -184632
22068 -184632 -216467 -139444 60639 366471 465808 459535 161806 -68184 -48612 -20318 -48668
22057 -48668 46823 -75703 -189417 -259324 -137345 -75304 -99850 -82671 -65894 -169696 -208475
22046 -208475 -139044 10099 -10359 -47585 -109264 -67830 -43953 -108263 57430 308940 389430
22035 389430 591045 524597 330516 111299 138036 245455 135020 145753 215692 106098
22025 106098 -60723 -222744 -143505 -157913 -220738 -283868 -344123 -383639 -147619 157201 -25978
22014 -25978 -171309 -19148 -60398 -219423 -77342 -132577 -168176 -181694 -40577 114408
22004 114408 145714 -34324 -161680 -172161 -119308 98597 198889 77943 -19154 -190346
21994 -190346 -243332 -252102 27816 39072 -24298 -101316 -298398 -307375 46045 200325 264024
21983 264024 88047 63189 178519 208921 48678 -181612 -122996 21491 106104 105294 -127829
21972 -127829 -246522 -330841 -333782 -127014 27551 93984 210691 307897 -4025 41633 206730
21961 206730 159156 -143115 -200494 -364274 -294527 -167472 -274667 -347621 -447059 -381555 -305066
21950 -305066 -234816 -165552 -141939 -16300 -42421 -48137 -149226 -254151 -68741 -96797 66495
21939 66495 274347 135727 59700 58805 -20704 17878 -21631 48665 75722 115872 143260 96622
21927 96622 -9014 138837 234332 209188 47235 -158399 -157278 -174134 -218297 -104110 -8852
21916 -8852 -56594 -169778 -154282 53426 209918 300970 202759 -120637 -240730 -358351 -446712
21905 -446712 -482219 -261701 64817 -18044 -176197 -143136 -338118 -421320 -283900 -434793
21895 -434793 -456130 -219461 -122540 -289265 -616932 -687687 -321169 -243525 -189420 -244717 -72480
21884 -72480 29530 116216 400225 348364 140087 -39409 -13266 -16738 13984 39235 98796
21873 98796 163593 253216 296333 252637 240765 213504 191057 128717 118044 140152 253784
21862 253784 47636 -170274 -185211 -272579 -106171 -189581 -213674 -256411 -201981 190756 284519
21851 284519 262152 170884 218139 79449 -22519 169391 167815 281584 232050 143190 189219
21840 189219 -136731 -205592 -250122 -369035 -320650 -167642 157050 343211 224106 36189
21830 36189 -88260 66977 161440 247011 187334 100756 18708 -26082 14550 39137 105874
21819 105874 38247 -160758 -230805 -153528 -244614 -183382 76049 159678 55588 72338 264303
21808 264303 18097 -272350 -330952 -304814 -326983 -52534 75719 -45979 -90146 77543
21798 77543 155122 264993 216335 224031 113488 -53985 -14933 -68994 -109514 -212688 -348375
21787 -348375 -280906 -353551 -425929 -366685 -411367 -330812 -262628 -52548 -221955 -268779 -203579
21776 -203579 -273456 -150674 140651 193114 3379 28959 -164289 -299219 -341632 -252693
21766 -252693 -400754 -285071 -414606 -427533 -374795 -204419 -138069 -178889 1468 226005
21756 226005 319100 163006 -49829 -132004 -179233 -106448 -301490 -385723 -274286 -108446
21746 -108446 -81171 -265894 -297877 -171959 -229780 -301136 -155241 52045 141172 115779 81408
21735 81408 126758 185020 67375 44 -1891 -111720 -187061 -253372 -119239 -63403 -120840
21724 -120840 -140048 -273256 -320662 -175811 -33501 3783 -76996 44946 110794 -29288
21714 -29288 -229047 -172413 15841 122889 90500 66925 154085 137802 -38976 -131415 -54310
21703 -54310 -191004 -234357 -137887 -35647 104892 -49422 -253361 -67896 33768 -16747
21693 -16747 -232379 -85233 125434 188646 10814 124943 440807 199033 -54782 109390
21683 109390 147238 -33052 -199060 2740 -40538 -20028 207756 86140 -209723 -368932
21673 -368932 -195961 88584 119946 31289 182114 369629 141026 -161918 -210726 -291269
21663 -291269 -196892 -107407 1911 110490 50758 -10986 -84113 -53847 -3650 73955 967
21652 967 174396 298987 288905 88128 -23451 -108680 -254807 -145294 134719 299414
21642 299414 202626 -45155 -179033 -4292 283167 176411 -6873 -73159 -104167 -54815
21632 -54815 -108463 37466 293066 156518 28030 172228 240283 16972 -56347 142281
21622 142281 168606 155592 186056 85062 -104610 -203953 -15385 -162260 6274 182070
21612 182070 61956 -146990 -218083 -215591 -32208 3631 -60636 -142601 -277205 -462352 -397322
21601 -397322 -310399 -97757 101583 75977 8768 -229528 -282468 -248309 -367008 -386866 -264194
21590 -264194 -31058 -218229 -268774 -139942 9209 79581 35304 965 -141218 -108173
21580 -108173 -119758 17605 124583 124140 -12691 111498 242961 231559 20718 -42802 -106325
21569 -106325 -62477 17055 26056 -29718 101449 312422 481929 443278 252607 207410 215721
21558 215721 67080 -160246 20268 9428 -136813 -94156 -53912 -100085 90831 136905
21548 136905 325117 369702 189950 -74865 27080 219750 63132 -28291 68744 100192
21538 100192 113832 47867 -92838 -29085 242172 273455 80591 -104427 -173287 -169360 -55685
21527 -55685 -116354 -178337 -43860 155558 160332 217044 255455 187798 33197 -60552 -240781
21516 -240781 -326030 -338192 -260964 -130660 -32773 -62019 143476 481322 369382 63543
21506 63543 -64397 -219304 -170462 95267 67248 51380 109799 68148 66855 31921 -32747
21495 -32747 -14502 97525 53888 171725 153521 107108 72834 114376 -42495 -63429 97861
21484 97861 19362 -196312 -160631 17259 -67560 -81907 -54731 47224 147037 266973 171389
21473 171389 153280 248932 262051 95351 -7560 -69591 -130807 -126118 118044 107436 46179
21462 46179 58808 -31642 25154 -23342 -55883 -111358 -106224 78522 120466 215188 117200 155878
21450 155878 206036 197884 338976 253410 151439 110119 -36640 -376458 -356024 -290022 -257926
21439 -257926 -71782 -33606 -145204 -164358 33539 -22910 -88510 -100606 83395 138571 148041
21428 148041 92999 -57387 -36914 -141633 -128002 -84726 -79416 -136983 -185336 -162977 140875
21417 140875 355839 388597 148500 -194947 -243020 -86219 108933 -75937 -292442 -392823
21407 -392823 -524231 -487055 -318559 -116182 -17651 95652 140497 151562 13932 -116229
21397 -116229 -114728 -162455 -329205 -327340 10017 19372 27366 290817 374488 323094 107200
21386 107200 116827 64750 61744 2416 122665 66098 -116634 -186579 71558 260431 155129
21375 155129 48629 214157 199462 93539 -63850 -178228 -253142 -330369 -434451 -334469
21365 -334469 -233588 -57295 164162 133428 -52318 -363652 -465817 -480741 -349423 -128414
21355 -128414 -128444 109507 173871 105053 42961 97687 -3004 -19331 -50317 -145828 -198559 -107931
21343 -107931 -5917 74922 52843 -31261 2981 82853 244229 145624 -181514 -280748 -199120
21332 -199120 -91460 -111045 -87494 24525 53796 201879 296788 115981 -54960 21460
21322 21460 86701 316238 181822 -53454 -147721 -163890 48494 140687 9409 -101458
21312 -101458 -105532 -206255 -89103 155855 63278 -67854 39223 217748 284583 -18800
21302 -18800 -19781 20537 17628 38410 -12611 38564 76199 5243 -142495 -280074 -335643 -486700
21290 -486700 -373987 -81457 -215711 -300451 -163605 -308101 -381764 -87374 -17333 -228869
21280 -228869 -374912 -298446 -353757 -485189 -292245 -231501 -366365 -274852 -227468 -238647 -204572
21269 -204572 -103788 4284 -39327 -116244 -26559 -42241 -10325 -98289 -100936 116124 -56480
21258 -56480 -99396 -229058 -367790 -138339 104393 19176 -90652 -39592 234071 129857
21248 129857 76865 45113 136282 226298 323775 231857 280961 49126 75101 -45849 -67128
21237 -67128 127823 258642 243804 74003 9332 -21211 -71589 -61128 27961 -46274 -234575
21226 -234575 -195147 -331998 -321201 -157631 -96670 47069 161048 -78619 -85736 -43537 -154014
21215 -154014 -257389 -161218 -112071 -264174 -399072 -465357 -358977 -149307 -182860 -93931
21205 -93931 59419 144301 -17630 -85447 -33113 63612 28683 -200360 -400947 -279076 -179411
21194 -179411 -106072 9348 -105573 -133114 -69678 -245761 -469375 -583899 -557031 -287573
21184 -287573 -297155 -324869 -136740 32779 -63533 -270563 -261709 -190357 -131244 -78349 -137067
21173 -137067 -117002 -98202 128369 301724 87286 86117 183504 449573 467602 169831 88242
21162 88242 46147 -194106 -326475 -95211 61213 21428 -155907 -346845 -459283 -450040
21152 -450040 -541373 -261348 -227232 -194477 -199714 -144149 76930 81985 -69445 -316403 -368812
21141 -368812 -314724 -394020 -413451 -349223 -257923 -30746 74406 122722 122467 142277 82027
21130 82027 168576 214792 245965 140297 -15030 115794 207142 -32575 -42173 -142183 -132228
21119 -132228 1276 -45673 -156387 -194432 -146425 -235341 -254123 207858 279582 304394 414839
21108 414839 240341 -17298 -337427 -66186 199543 317458 209612 -16452 -60592 -58585
21098 -58585 -90296 18900 87085 134117 228199 318359 243902 57755 85346 322288 423246
21087 423246 400244 315733 85370 52700 -137679 -250758 -22097 134985 266326 87464
21077 87464 -209724 -334661 -279883 -185819 -330157 -479909 -468701 -151763 30266 214473
21067 214473 211187 -8555 -214711 -260352 -264535 -65692 64549 44979 39196 7815 -120839
21056 -120839 -289484 -365362 -492550 -472920 -374932 -195240 -59461 -230863 -382181 -401502
21046 -401502 -311604 81690 74270 -114206 -239321 -207120 -192299 -147786 -288716 -398773 -331985
21035 -331985 -436425 -595283 -710513 -388774 -30594 -102788 -351603 -376145 -252856 22807
21025 22807 110022 90021 54489 156142 31905 -206539 4334 303317 372702 -79365
21015 -79365 -272430 -119534 55336 45587 6134 44048 34851 67950 104379 157136 4506
21004 4506 106873 144224 71070 145291 120084 88076 267475 164140 -126752 -231470 -112599
20993 -112599 80558 15224 31514 149437 233994 236197 223812 138702 74221 111821 323371
20982 323371 215927 170281 147730 113097 13481 -33612 199271 305794 353157 250673 65060
20971 65060 66358 78844 54826 115501 61143 -216332 -424949 -169013 58364 179857 223429
20960 223429 70392 47626 -73274 -192020 -237957 -412892 -420687 -223659 -57145 -14731
20950 -14731 8786 142248 183990 24656 -172014 -237084 -64439 -26653 -59075 14942 96705
20939 96705 289060 431697 414973 360856 297331 232823 195638 -64312 -56494 -53816 -602
20928 -602 74736 96501 -105749 -142467 -152960 25800 197060 82122 -114396 -190151 -102608
20917 -102608 132392 261813 313288 291264 141661 47802 3059 -100117 -122799 -211808 -217809
20906 -217809 -258197 -216623 -286609 -341376 -341321 -172904 -80728 39057 134881 -173089 -147027
20895 -147027 -177356 -154415 -33668 -53573 -107823 -138518 22633 80183 54792 -67009 -328098
20884 -328098 -193928 -169767 35924 71494 -183865 -290845 -276960 -103204 -43615 -188014
20874 -188014 -268478 -435630 -435784 -257598 -192033 -340434 -484241 -176385 115747 129182 -56187
20863 -56187 -182834 -288455 -259926 -294721 -45073 -1444 -192832 -122847 -71854 -161622 -300432
20852 -300432 -185634 -60517 54530 86046 114889 165279 230721 133911 126000 5837 -62498
20841 -62498 125359 57814 -23580 60644 25936 53967 267283 313977 255125 240517 396898
20830 396898 485509 269585 37100 234925 210704 14797 -85742 -47149 -102691 -165561
20820 -165561 9464 127018 57909 -129341 -197616 -200559 -292939 -253647 -100691 -11414 135926
20809 135926 -32004 -415709 -408635 -222125 158156 196483 105385 -71034 -109563 12296
20799 12296 65913 -18607 -1051 80756 -24170 -328085 -450393 -393704 -250938 -94923 -128862
20788 -128862 -249374 -213441 -401003 -396388 -279731 -301932 -219582 -229867 -288428 -356970 -400835
20777 -400835 -261399 -94961 -47878 -14452 140169 346154 214512 120610 55704 75817
20767 75817 -239266 -434903 -463357 -285450 -186633 -129832 -20390 372351 233497 21679
20757 21679 -34691 -110487 11341 -91361 -129228 -138177 -59761 -108763 -144383 6473 100298
20746 100298 63441 81732 92981 34239 21975 -112315 33567 91066 128223 151163 -8997
20735 -8997 88445 45507 -41352 -42853 -39883 -97865 37348 -16650 -180323 -309553 -104761
20724 -104761 -135620 -221766 -160834 38725 332997 389111 430153 469811 461363 316634 329207
20713 329207 305237 437645 507709 304045 331785 123131 -93319 -276468 -118371 114024
20703 114024 278274 336671 224993 62976 -98453 -182246 -205449 -41859 29576 -179911
20693 -179911 -455863 -118005 -72962 -117386 -186525 -119028 -116727 122346 112688 -62794 -32108
20682 -32108 32591 -43786 -189616 -257540 -265372 -188252 -39633 -152806 -197406 -3409 177201
20671 177201 206808 -8433 -10784 -42134 -15755 40519 -7263 -81087 13439 -23832 -188713
20660 -188713 -168094 -3226 97260 11585 2775 -51584 -225566 -119544 -90118 -106743 40399
20649 40399 46940 -110519 -94959 -134818 -80529 30086 -39452 -43014 -106778 -98391 -138949 -171542
20637 -171542 -198892 -301187 -127568 -124716 -256543 -279292 -74583 -67290 23418 128603 123901
20626 123901 137308 90745 -85031 42014 -14252 140601 379128 454033 265136 171820
20616 171820 309036 308354 304040 106734 5207 468 -69628 -159317 -117209 -95454 -159126 -209424
20604 -209424 -275045 -48569 194260 175201 63331 -28188 21741 103017 35842 -27372 -96539
20593 -96539 -225116 -232048 -66890 -62008 -72035 70352 145065 16902 49775 15964 -113465
20582 -113465 83824 183581 136982 342432 309062 341624 220191 31759 -58917 -145089 -129133
20571 -129133 -59205 -173541 -268170 -115278 -33745 2122 -78977 -375365 -264638 43791
20561 43791 121067 186932 361578 230634 98488 -51018 106382 295845 186005 -36757
20551 -36757 -34456 64188 155497 179214 92691 131290 53307 -235815 -309330 -224622 -231527 -351846
20539 -351846 -243041 29591 -61220 -302320 -376328 -237727 -99735 -39548 -29851 -7005 -160579
20528 -160579 -89487 157669 132310 24122 -162268 -226672 42729 -79927 -201848 120638
20518 120638 160434 -14529 10193 -105339 -223210 -49716 -160133 -133269 -121482 19298
20508 19298 -135939 -202545 -450769 -563045 -250188 857 176988 215638 321629 159122
20498 159122 95262 276833 231236 83284 53125 88324 -53949 -50710 120933 236460 218219
20487 218219 184186 261545 159059 119120 -24955 -96789 -123675 -113114 -137469 -85825 -25319
20476 -25319 57468 184112 221082 162293 -21667 -243486 -166801 -252411 -336633 -414103 -379115
20465 -379115 -293949 -353707 -444791 -356307 -318316 -365518 -292030 -183052 -70321 -83935 -46177
20454 -46177 -66632 55668 -52184 -272246 -411081 -303993 -209391 -189649 -198922 -197636 -11976
20443 -11976 201433 290349 50014 -1331 -60293 -102614 -29239 21908 52789 162032 154909
20432 154909 242269 64130 -110360 -243727 -270450 -153589 -72176 -97093 -197367 -65806
20422 -65806 -74707 -221701 -317766 -342631 -272290 -381227 -194916 17395 55428 171906 348126
20411 348126 96151 174032 219040 27626 19653 145843 189782 6975 -176994 -309480
20401 -309480 -52386 1607 75358 225073 236036 241740 177132 54511 86512 188161 180600
20390 180600 43786 -99915 -66710 -95767 -258893 -252077 -164204 -83227 -43123 189541 218601
20379 218601 202107 102524 60286 -113580 -368187 -383130 -339304 -215752 -66426 136990
20369 136990 166276 -2199 -58669 56393 -20390 114529 283548 244264 218351 125497 20101
20358 20101 63466 121039 252104 242836 -7954 -232895 -74814 30308 -104551 -121652 8748
20347 8748 100947 159301 304971 151486 223358 170442 38049 -216077 -195837 -250807 -308639
20336 -308639 -431458 -362827 -247266 -75051 -86253 -256163 -477355 -372582 -347447 -278853
20326 -278853 -9819 39985 85633 -119897 -261427 -113064 -199750 -188368 -179412 -32329 185806
20315 185806 275955 36883 -89425 -61792 -6773 120518 -1486 40494 12989 -193351
20305 -193351 -72439 205592 198241 95746 21184 -1528 -139145 -287393 -395677 -156150
20295 -156150 -50071 -28750 -85949 -250667 -244143 -15361 -68946 -225104 -204996 -159522 -81403
20284 -81403 -69684 -99952 -277315 -127535 -19309 43975 -226277 -297319 -434479 -311595
20274 -311595 -257104 -253293 -225744 -146883 -131486 -349556 -485488 -439316 -397488 -159406 65316
20263 65316 4313 -52099 -70180 -252472 -470644 -495637 -198924 70068 64846 -153101 -135381
20252 -135381 -15636 67770 -20337 -87024 -39202 -117096 -47561 12009 -149392 -156037 -138027
20241 -138027 40653 -13425 -210576 -356283 -373011 -148007 -65820 12285 137469 251447
20231 251447 350819 172792 98777 150312 204795 129621 -79800 -6119 126411 190903 198657
20220 198657 100803 162146 307449 291547 307204 407414 320801 75836 -24051 -114940 -182369
20209 -182369 -110623 83772 199756 170911 81775 35251 -89869 -135156 36545 -39440 -4500
20198 -4500 325 3189 -259394 -382425 -358625 -243129 -231215 -434439 -557737 -387864 -335774
20187 -335774 -324310 -302471 -233899 -7131 72126 -38370 -25851 150636 249212 21244 -143975
20176 -143975 -141528 -110904 -51649 -83035 -29669 -66051 -1627 -258736 -505696 -366569 -199548
20165 -199548 -45552 -20487 -116406 -35088 -11537 -14223 -189623 -330194 -329327 -46916 39224
20154 39224 -7609 -154709 -193666 -102610 166926 140527 164267 158243 230704 132435 148928
20143 148928 57041 43833 51901 208253 221571 120792 168917 328188 320745 213437 91404
20132 91404 123383 156395 -37285 -127136 -100618 -21472 -26032 -70551 -42062 17983 -178225
20121 -178225 -225481 -203686 -176971 -151083 -111853 -19401 -181877 -295967 -123655 -104282 -193385
20110 -193385 -139601 -60427 -124070 -203339 -200628 50332 227934 122335 -92383 -70739 -34668
20099 -34668 50908 148043 -47202 -152809 -216868 -360003 -524467 -471215 -236993 -73040
20089 -73040 -216962 -234820 -268876 -202601 -98046 -83060 60572 322246 395283 227313 647
20078 647 -155715 -188041 -103609 -19868 -126505 -162416 -185012 -235407 -211748 -234755 -283567 -301839
20066 -301839 -297645 -232183 -197668 17575 197362 172988 -212256 -334648 -311673 -380783 -439453
20055 -439453 -148510 260646 298448 399175 469453 395196 391662 301032 228977 372313 612908
20044 612908 717540 885203 919494 1026128 1008420 815958 706774 786899 827514 1028854
20034 1028854 1059932 978752 1034258 1098440 1063919 1036408 788628 670750 651144 424248 442550
20023 442550 409016 366921 183300 -1399 -19402 -72400 12232 -166653 -250005 -377804 -284254
20012 -284254 -82521 104634 123014 163775 189700 -108981 -182229 -154628 105209 35318 -233930
20001 -233930 -267294 -188564 27360 278683 201302 -6235 -54182 -66425 -107338 -148570 -275906
19990 -275906 -365536 -235971 -12425 159415 59557 106414 -17701 -320545 -272985 -207688
19980 -207688 -233295 -39086 173529 414436 450550 368105 219998 249064 423980 466618
19970 466618 400014 382943 248098 102321 69410 90848 276249 116721 -22264 -87410
19960 -87410 -100333 -103502 -63060 -20305 -100690 -44475 -50191 -18796 137587 64374 -58083 -229889
19948 -229889 -339173 -280502 -105413 22834 -155938 -279031 -327118 -223492 -91948 -1662
19938 -1662 77830 -113480 -132156 -114297 -226137 -175123 -229325 -381558 -244817 -70925 -172566
19927 -172566 -77014 -79020 -114011 -79297 -35886 -87311 160988 66353 197528 259023 350710
19916 350710 652860 651771 471222 384138 292746 167790 91812 154578 235434 81466 -245040
19905 -245040 -421949 -335874 -155416 89991 140404 94268 62771 104212 73909 31464 43457
19894 43457 26487 140295 246608 90668 -104742 -105095 -190402 -94605 106942 146246 63477
19883 63477 -14048 86219 43518 -64989 -152811 -164664 -164967 3645 -72838 -97457 -24717
19872 -24717 41888 -9816 90069 156761 169584 185740 228807 290552 270685 176968 224489 204542
19860 204542 304764 273826 114139 93516 129520 -98401 -9463 -54066 -394599 -294704 -100115
19849 -100115 94789 271074 337833 213234 183878 269266 329403 270124 320806 183322 -63873
19838 -63873 -110480 -89685 -54371 8300 -1698 -19181 -17004 -88571 -215841 -353620 -372378 -475048
19826 -475048 -505574 -462453 -362395 -133579 68839 148195 284861 336272 285527 152033
19816 152033 15038 156082 238676 311609 278876 329944 350852 271183 520093 422435 387926
19805 387926 253564 83724 264136 543316 531487 426082 531236 896229 1014533 877900
19795 877900 707193 905364 1063576 902982 736994 647977 550451 415887 684006 847791
19785 847791 808515 636321 499620 740859 814700 776586 657162 615923 557256 667949
19775 667949 819778 920241 654276 404292 313791 364617 130241 -129459 -224597 -339106
19765 -339106 -281010 118764 181180 84388 79844 10772 56133 211526 240584 179341 294344
19754 294344 267122 229104 318603 414216 534194 533401 527231 571061 768925 999654 1329094
19743 1329094 1430666 1579436 1634600 1748415 1792094 1922430 1904313 1925875 2092412 1919946
19733 1919946 1835251 1982275 2026281 2005861 2055610 1931902 1833848 1706524 1552466 1588622
19723 1588622 1501250 1157200 876091 765255 652640 413442 534796 719498 624194 568720
19713 568720 389991 199257 144970 360039 138528 170835 149859 216816 326355 396450
19703 396450 206370 267466 236124 124614 67377 53337 195243 241758 215109 384192 359067
19692 359067 260636 191327 296710 328467 297150 262179 270922 261665 167910 110694 152619 106541
19680 106541 207014 212998 298230 494116 413001 172039 404561 347906 189482 46503
19670 46503 39850 -76581 6388 -69399 -69866 -109648 -256458 -100703 58528 173497 167326
19659 167326 139630 -96720 -321164 -273862 4726 -300758 -588839 -534969 -425655 -153924
19649 -153924 175793 287653 162832 50390 161502 237196 246811 288031 141418 -1733
19639 -1733 -23751 147576 35287 -57504 -80465 -79282 -199854 -295278 -203507 -73627 -311656
19628 -311656 -305582 -247132 -207371 -181057 53313 226570 124894 -171118 -82159 -34269 -105155
19617 -105155 57148 22235 -161429 -324839 -244738 -135824 199941 252014 48892 -142671
19607 -142671 -261476 117242 178829 59570 -100497 -49965 9067 -20242 -65309 127768
19597 127768 161661 141906 142367 167143 118668 205814 -58430 -149693 -103421 163369 229837
19586 229837 224711 234387 333190 294085 306453 263681 180362 -120737 -112114 -43340 -178396 -83988
19574 -83988 113896 208800 194952 253608 190777 114163 251940 517724 447786 209035 34614
19563 34614 10630 -9700 -109907 -125796 45758 316226 379260 464982 521775 375430 238225
19552 238225 12656 219328 269207 259944 245751 95132 131716 221251 275962 -19748 -31137
19541 -31137 240313 376323 322383 58647 106182 136093 145451 234131 390175 354524 236267
19530 236267 254488 367544 560666 525177 562696 556801 437840 489801 291535 135229 246263
19519 246263 307218 75524 -74182 237281 413846 409062 260276 129128 129483 77332 169420
19508 169420 215982 336710 243924 -104472 -239971 -24797 55072 197672 301634 287312
19498 287312 196615 105814 101287 119211 163021 29259 -107890 96380 156938 198033 218348
19487 218348 328310 256614 265817 376992 231840 124792 258249 426309 653776 605295
19477 605295 498269 575822 725027 515445 628830 678293 724201 569769 445484 590871
19467 590871 744040 766093 745135 664673 811688 931038 738420 620945 559164 480258
19457 480258 777234 832008 777885 759629 626083 540357 691970 667173 257245 187849 259431
19446 259431 106086 91867 -24470 26621 15109 171116 240357 74258 -72348 64882
19436 64882 171349 153031 213729 347868 537970 377985 250879 312207 300289 121163
19426 121163 -35860 -143493 -56872 -74366 -78808 -152195 -134453 -333981 -332157 -104398 155752
19415 155752 279748 364398 618083 925279 972170 885053 943906 992822 791082 776179 759209
19404 759209 490833 412586 283961 365225 492245 760359 942919 952667 854008 855120 705354
19393 705354 574044 530545 486727 575248 621519 465574 486987 534679 579848 606094 663399
19382 663399 523468 447269 427188 502302 557548 652565 557818 644669 536887 654631 850564
19371 850564 744237 582446 579498 713550 817806 700232 726013 837294 617361 417105
19361 417105 601304 745083 732680 656351 522685 510212 510006 675521 856554 1003175 1323051
19350 1323051 1376433 1365637 1562484 1792123 1772937 1681483 1689009 1658124 1740950 1906189 2031146
19339 2031146 1960031 1955271 2048556 2068332 2038813 1925974 1835405 2075927 2193411 2222922 1998372
19328 1998372 1699825 1823246 2001593 2216205 2524877 2474440 2388743 2425381 2565790 2685652
19318 2685652 2751889 2812558 2832914 3010407 3028923 2981368 3191331 3362257 3439587 3662565
19308 3662565 3902114 4231489 4375615 4558984 4857035 5089667 5333910 5563555 6049401
19299 6049401 6381143 6925696 7537564 8110254 8811654 9869685 11610468 14367652 18295890
19290 18295890 24151120 31634659 39800947 47715750 56459437 67828592 80135820 88262494
19282 88262494 89633740 89215993 92457737 97383826 98378885 94652937 95420639 101639618
19274 101639618 108355746 114024209 123765307 137483572 146512805 145144583 139395074 137986931
19266 137986931 138346703 130483349 109565705 90613929 79613810 71595151 60830209
19259 60830209 49799888 42245279 37752507 34634226 32478424 30748605 29272074 28320460
19251 28320460 27631867 27044321 27012814 26898358 26833892 27085830 27759586 28484562 29353176 30759498
19241 30759498 32707125 35335944 39789382 46779732 56336493 67569176 77961980 85978465
19233 85978465 93302351 103526113 119952691 144146843 176321442 217559425 260412440
19226 260412440 290248210 307674859 330151073 373202109 434341099 484996745 493957272
19219 493957272 473867166 454201915 453796738 472176664 484626035 448721315 383777936
19212 383777936 330254990 296365452 276921234 257634136 227749087 191810712 161729150
19205 161729150 140910481 126086674 115550147 107894011 100610019 90662646 79877805
19198 79877805 71277590 65227118 60698652 56802804 52952665 49471475 46329906 43718736
19190 43718736 41348967 39057004 37027794 35527149 34056694 32607921 31055045 29563084
19182 29563084 28138016 26913626 25527097 24493002 23657306 22703723 21683563 20732337
19174 20732337 20140228 19664457 19043295 18171517 17258068 16252396 15579893 15131754 14664904
19165 14664904 14102768 13568956 13171834 12705372 12314204 11867229 11472503 10862824 10186262
19156 10186262 9439220 9047888 8934879 9007304 8739625 8540971 8632758 8556671 8137619 7887945
19146 7887945 7626890 7632896 7478080 7396333 7099431 6843165 6759535 6534946 6373701 6168638
19136 6168638 5859952 5660949 5320182 5167116 5081289 4738411 4637071 4493528 4291719 4154589
19126 4154589 3835896 3488760 3153898 2852849 2842978 2651086 2718980 2762801 2638385 2242283
19116 2242283 1963926 1879712 1620960 1793789 1879909 1713897 1528944 1616217 1536939 1291358
19106 1291358 1150969 1142332 1384548 1383204 1414220 1296529 1302661 1386300 1264463 1240842 1144700
19095 1144700 1140613 1252957 1348017 1300945 1377432 1394188 1386314 1270524 1311838 1296781 1212676
19084 1212676 1182063 1347337 1485551 1317908 1094913 1252294 1336334 1209454 1205637 1263308
19074 1263308 1214024 1308593 1314301 1357103 1138201 800729 774113 1030181 1073428 979142 819435
19063 819435 809849 865276 971817 817685 748546 725215 794936 858331 950788 1076663 1070370
19052 1070370 967962 1032389 1166932 1274584 1166948 1006510 1138623 1130165 963053 1042085
19042 1042085 1124427 960109 790471 775029 897666 896057 831507 917211 800275 874061 993783
19031 993783 804067 862425 934528 933873 726417 428928 436584 503260 354399 442817 596795
19020 596795 712741 630794 388201 238245 447140 861082 891318 886855 817097 799682 477130
19009 477130 215015 370292 634640 483645 424848 341600 316107 499389 486510 451611
18999 451611 659673 721814 586717 590890 473956 337117 269995 183918 199036 351071 261046
18988 261046 365395 463619 444925 500320 475833 540421 562636 508793 428177 403789 287327
18977 287327 121984 130664 223200 473590 659055 327448 94311 140789 63059 -41659
18967 -41659 -65541 -14769 37136 152579 127196 19782 -152263 -43612 85515 233624
18957 233624 143617 95342 93389 139125 161590 133255 162909 340322 233657 105643 204747
18946 204747 435508 289039 132049 -43809 -152707 72295 226329 378143 367422 148065
18936 148065 51828 16056 -18122 18346 279549 244897 118126 19202 -24587 -70719 15014
18925 15014 192519 266013 213338 74986 170770 334709 266364 156102 197693 329949 244273
18914 244273 116432 -48938 99722 318702 345479 327478 276466 470769 553924 622681
18904 622681 671619 623537 724533 946817 1077963 1235703 1221662 1248670 998441 725060
18894 725060 730472 670283 547260 389234 452456 507661 660614 752757 846551 783101 927870
18883 927870 1162206 1178354 1170947 927755 855350 592007 377074 340942 222311 347822
18873 347822 530747 423199 362313 36308 -5075 -38869 -83655 225214 318466 395801 458033
18862 458033 306255 195930 184353 101222 229517 319861 331749 266608 9303 -7397 -20530
18851 -20530 10930 -54362 -225765 36104 121848 85597 -72137 -28142 125531 102573 -106378
18840 -106378 -293847 -53195 99656 -35107 -91432 -49272 -93038 -129531 -124642 -15777 29483
18829 29483 24753 74203 71585 143863 231813 113889 177225 36661 36633 80619 -132845 -276438
18817 -276438 -234953 -154698 -160714 -23540 -234910 -357740 -154178 -220396 -278163 -61107 140676
18806 140676 -7393 -112852 -103250 -27908 33565 -84548 -27662 47346 164172 172396 84046
18795 84046 115543 80409 117577 132543 -50690 -94660 115915 -6582 -41621 8449 25746
18784 25746 32947 131014 247077 314568 282571 143340 46435 -158255 -61982 45198 363305
18773 363305 860517 1142589 1204219 1057282 910491 913908 1025104 1135258 946042 563676
18763 563676 463655 613634 833085 975869 958397 940551 736803 680287 770243 547283
18753 547283 517471 437559 383040 436603 477153 529897 831219 799814 547397 691623 577404
18742 577404 540058 509588 412109 295830 262385 218901 150418 93954 -58367 11541 238755
18731 238755 312536 490081 437288 378942 277658 450367 470689 360920 215508 232234
18721 232234 307715 316627 287883 279072 311651 421659 645883 831405 641628 764398 805430
18710 805430 774247 932081 1151680 1144587 1253791 1487868 1634950 1661215 1591549 1719118
18700 1719118 1802086 1852181 1806670 1766306 1705342 1946997 2246774 2512664 2117263 1876223
18690 1876223 1956503 1854561 1672200 1510481 1571424 1524125 1282990 990565 878923 823898
18680 823898 815154 1025837 917764 788717 627426 579039 325364 348218 539838 858355
18670 858355 1021475 968209 867043 941704 1141411 1106229 1089337 1132418 1116998 1085259 770118
18659 770118 619202 548176 630558 602070 604365 683280 530648 450188 403512 321834 232483
18648 232483 177248 176127 144675 132357 181956 153170 154684 295217 331554 338754 244967 286053
18636 286053 148619 193360 383975 403571 102886 -96844 -198703 -85511 138738 296075
18626 296075 289081 124812 234250 177167 156127 188287 142282 154850 142803 241158 210253
18615 210253 190522 480170 489443 513883 312492 268818 384900 339088 408357 533418 368703
18604 368703 323991 387661 482907 442799 315602 225641 335161 334416 212377 34444 -2710
18593 -2710 -124152 -226366 -39539 12464 -38608 763 54551 41436 40757 77335 24196 163590
18581 163590 157694 211058 226632 178372 36354 -43425 -21650 -46383 75441 168949 40287
18570 40287 -149589 -180668 -274547 -183445 48969 166934 212940 279396 249805 170610 35740
18559 35740 -97291 -71463 -132792 -115215 -72661 -347626 -394370 -378911 -250956 -20963 84796
18548 84796 45089 68229 89797 -10061 178726 169943 247911 89988 -248316 -348218 -201374
18537 -201374 36730 -50419 -75933 -35808 -16174 106720 240967 95930 -189191 -264362
18527 -264362 -140649 -130312 -131589 -136939 -69067 -15217 11781 -5974 13293 -79992 -329493
18516 -329493 -258803 -46362 -55280 -196160 -200368 -252610 -174451 -142147 -36822 -7776 185531
18505 185531 343616 459199 416479 212613 20000 -130851 94743 179594 342125 208710
18495 208710 142032 -5528 -154502 -317457 -147817 -69788 -71799 -2539 -23147 -215047 -363769
18484 -363769 -323545 -293008 -25169 156765 244343 87326 54251 57818 10410 -12158 -19793
18473 -19793 28271 -143698 -292917 -273938 -175805 -258681 -79700 61330 83416 244307 406341
18462 406341 273152 121418 -85576 -123452 35310 9911 -141176 -92031 -110818 -116832 71794
18451 71794 215063 168524 69669 157627 201879 226865 323536 316136 279624 190385 303391
18440 303391 399528 492045 195125 175747 181118 68472 -39642 57721 7463 -20160 -39345
18429 -39345 -77488 -196334 -250386 -202222 -198556 -219114 -102853 -23113 71011 -25004 -15162 -22538
18417 -22538 -18975 -25526 45625 -77590 -154536 -33149 -1540 -105933 -186668 -232267 -165990
18406 -165990 -147310 -278319 -331102 -463864 -274875 -308804 -435894 -479089 -275446 -189406
18396 -189406 -87714 -302631 -228981 -40251 -101929 -171242 -178780 -314720 -385607 -257664 -120113
18385 -120113 -81828 -138928 -106914 -30300 -97311 -295267 -299141 -475994 -407457 -326357 -217155
18374 -217155 -102544 90422 389041 549500 585532 478737 324541 219223 317126 162896
18364 162896 117297 139146 156442 105100 245155 149808 111403 -7953 -187263 -87928 -101309
18353 -101309 52917 21484 -56042 -96121 -67786 -57665 -206012 -179606 -49844 49162 76395
18342 76395 -33190 -218180 -242056 -95075 76441 -155198 -199468 108604 98707 52191 93955
18331 93955 209077 271010 102454 100276 133614 1115 -42394 -33790 -16526 14912 -57334
18320 -57334 -204874 -156646 90756 46692 -115652 -162888 -34288 -66286 -153827 -176335 97419
18309 97419 172152 176360 117161 -34787 -35931 -239778 -191282 -11562 -12038 66066 84728 63496
18297 63496 177683 133462 -89698 -131329 -270418 -342050 -383124 -367416 -358101 -297574 -300431
18286 -300431 -242392 -283867 -279772 -192800 -90652 -24595 76941 -8458 -124960 -46709 83427
18275 83427 -62568 -25345 -97384 -81019 -127619 -154477 -298253 -416065 -126263 -146998 -46185
18264 -46185 -9251 -51472 -233937 -222983 -32300 -156920 14236 207567 226648 287146 -36894
18253 -36894 -252400 -292008 -232356 -201524 -26663 161988 259561 101794 147401 196710 -42
18242 -42 -48391 140703 254905 138025 7723 60194 151535 166404 245136 387877 209054
18231 209054 -13161 52443 231549 350061 548596 612236 445316 158111 60583 29075
18221 29075 121082 210926 256309 329514 286220 330207 334081 409620 259151 189322 89305
18210 89305 86437 117854 268140 268407 263142 236974 237662 385204 345751 194147 185452 211794
18198 211794 268872 285127 206233 254390 315173 302368 285007 365302 292744 100864 199849
18187 199849 334091 379712 288937 330554 232988 155792 328010 489386 528351 337639 364426
18176 364426 197571 233203 511599 598503 685890 726670 759432 859836 598347 414630
18166 414630 153570 -60950 -57331 18899 216380 134567 199761 171632 220456 353057 484410
18155 484410 549495 335098 292269 239214 344361 472980 460185 687290 902821 959133
18145 959133 1104588 1178867 1071495 1001659 978690 1064661 1102822 1431222 1684629 1713835 1783523
18134 1783523 2143073 2639401 2765831 3040236 3234172 3627864 3973219 4563663 5538445
18125 5538445 6551442 7571762 9162113 11330024 14282950 18220781 24483097 35050173
18117 35050173 53304975 83859383 127095643 168139471 182228342 172970499 162397166
18110 162397166 162905063 170658556 153319491 100458232 64205214 46940546 38763363
18103 38763363 34170076 30628017 26961445 23613739 20771029 18586747 17004509 15458159
18095 15458159 13960337 12677740 11750881 10902991 10244699 9695420 9186944 8474084 7937487
18086 7937487 7692248 7200169 6944379 6621599 6176650 5944131 5670606 5500472 5579704 5311349
18076 5311349 5160291 5106324 5061526 4971160 4817954 4904924 4729835 4585272 4406249 4080659
18066 4080659 3525544 3327800 3152537 2982128 2853222 2774921 2874328 2883785 2939117 3085249
18056 3085249 2922092 2455530 2310227 2382185 2428127 2371534 2270754 2250784 2136697 1973746
18046 1973746 1963482 1937754 1762646 1530973 1491982 1474441 1429130 1526158 1458078 1454580 1562055
18035 1562055 1430812 1278706 1127072 1050382 949661 716558 733876 621692 421956 489009
18025 489009 506511 651875 793542 838042 667437 731205 881013 890271 888322 760011 475321
18014 475321 445039 560483 575740 453755 217717 247748 192831 192654 320757 546905 705215
18003 705215 901371 947032 1050383 1026766 1153625 1207207 1233889 1402677 1373355 1378024 1160037
17992 1160037 1203613 1243182 1091311 966482 785198 834474 926164 946657 1024378 953008 825743
17981 825743 800025 756326 453485 407874 623216 456372 340513 367956 367015 286858 406528
17970 406528 430256 238791 141594 331300 378222 328521 446032 442343 323518 283743 -84481
17959 -84481 -95405 7232 90656 199268 138745 331136 445888 494390 530456 471518 643369
17948 643369 709921 800717 920126 977996 1019415 1257635 1448383 1457433 1393265 1375116 1316902
17937 1316902 1302778 1060492 880120 628944 631640 692956 771262 597257 396098 442717
17927 442717 477266 379449 161672 233880 287732 335036 275578 165323 78197 321121 444769
17916 444769 374547 355840 250356 209453 94197 39941 154658 182206 137059 142491 85533
17905 85533 27951 229124 371180 333697 216781 79635 48868 208414 338791 402463
17895 402463 308978 106931 152643 21004 -24128 113822 74662 -159156 -49713 -160435
17885 -160435 -210902 -75755 15303 144017 86834 19764 260140 281681 124488 151539 99914
17874 99914 20452 30790 127245 218736 193547 -52756 -95969 -214383 -304336 -435194 -465803
17863 -465803 -570272 -333815 -56480 -97633 -4513 121813 77331 109377 39473 -80398
17853 -80398 -149514 -328581 -202471 -4708 -48470 -24463 115589 136723 -72828 -270713
17843 -270713 -278805 -270103 -93285 -104584 111209 433438 339322 -57555 -301523 -273337 -161491
17832 -161491 -245142 -268809 -207688 5463 54941 -131330 -131767 69409 116414 103804 -70040
17821 -70040 42951 -55255 156068 324954 202138 162438 255979 178749 -109180 -27043 -34871
17810 -34871 6504 11634 33479 97652 36322 -80350 -241507 -224533 -361862 -385827 -301588
17799 -301588 -250989 -279196 -288380 -216084 -87763 88649 138294 96933 -67578 -318378 -245375
17788 -245375 235722 417579 246518 57069 -31301 -161224 -146452 -2653 -28866 -66863
17778 -66863 44513 278014 348210 425892 162502 -204704 -295641 -151025 -154352 -205186 -22516
17767 -22516 151501 202802 220257 356837 195273 144704 13432 -62907 15449 -72540 -117199
17756 -117199 -95640 -48870 -2910 15106 -132257 -179727 -153091 -208528 -41786 -112547 -36393
17745 -36393 76870 72608 59360 -32883 -90888 46789 114375 -20633 -171566 -99362 49787
17734 49787 83716 137579 71206 -4080 -4153 5372 -82794 41773 235219 282265 327884 501881
17722 501881 428911 474847 374296 373425 331852 181212 251446 367458 466923 352336 411178
17711 411178 419253 401855 315283 95607 -11533 85424 239197 35914 -48291 -204352 -222345
17700 -222345 -137560 -360 175381 111865 -75072 57594 170476 369403 395568 176442
17690 176442 37205 -6349 -28333 82555 222461 58592 -98883 -33731 55503 241362
17680 241362 109314 106570 224568 208253 166157 59412 -220693 -229267 -25203 151620 381492
17669 381492 327477 318265 326208 294528 124816 36785 242305 384253 229836 111138 103242
17658 103242 124366 234444 95326 -123646 -85376 102508 104147 41669 -11526 -61336 94695
17647 94695 184727 238525 168504 105595 227395 11895 36460 -60011 -33004 149656 -139194
17636 -139194 -473017 -399208 -121654 -74840 30069 142274 158294 74497 179690 327260
17626 327260 444535 398821 479031 477572 378317 204067 -51694 -338262 -393874 -221755 -98442
17615 -98442 -111671 -83175 -27494 9588 48523 -39891 17873 67387 87423 250415 345872
17604 345872 378725 428696 417164 344548 382640 382494 505787 565840 523845 579681 524186 594253
17592 594253 609746 475093 380621 360618 501550 656216 484607 369255 419288 435361
17582 435361 368435 392911 640569 557097 631373 740866 802838 642752 554496 639987 772027
17571 772027 601913 428475 759703 1177350 1110479 1142338 1354097 1513947 1490423 1109144
17561 1109144 992383 1247195 1294427 1099289 1067355 1417724 1485265 1288761 1127726 1058824
17551 1058824 1118416 1368994 1580890 1500002 1285260 1227132 1323936 1562985 1620792 1366826
17541 1366826 1310548 1219851 1155556 1213268 1350774 1361327 1301918 1105641 1117661 1113852 1104761
17530 1104761 1184945 1090192 782661 829652 754071 844170 1112697 1091426 1106341 1114346 1183893
17519 1183893 1187978 1227164 1456108 1594620 1612890 1616993 1638223 1644319 1635158 1661756 1747580 2047393
17507 2047393 2218839 2347713 2557362 2833701 3154063 3666923 4006759 4394988 4578552
17498 4578552 4736196 5055412 5640316 6297700 7028658 8079423 9484599 11135185 13255056
17489 13255056 15826989 18753796 22068005 26064056 31868728 39920359 49155595 59160483
17481 59160483 72045119 89873999 111537285 133937136 152956949 166205630 177288234
17474 177288234 186351990 188991428 187087464 182230374 171596638 160914249 147137490
17467 147137490 130155212 118091563 110419658 100924153 85553560 71580224 62430038
17460 62430038 55472558 48065625 40782335 35205610 31303066 28405173 26269888 24553955
17452 24553955 22992735 21928022 21137033 20570281 19779424 19172669 18600028 18033454 17803665
17443 17803665 17818304 17570988 17257639 17212181 17418724 17855725 18533167 19571333 20907036
17434 20907036 22644022 25561319 30254650 37590953 48730257 65015871 84946543 103920413
17426 103920413 116855127 124119873 132011616 144494101 158008371 166919378 167269764 163726757
17418 163726757 161110509 159979843 156774549 152703427 148365301 136032531 120318212 104576920
17410 104576920 89137476 78430056 71525714 62675098 50594602 41297257 35609150
17403 35609150 31784955 29047569 26621695 24431760 22715915 21323451 20190297 18881944
17395 18881944 17481617 16541739 15894719 15174922 14445874 13859919 13100867 12418537 11768188
17386 11768188 11346113 10993980 10700249 10402359 9750642 9254038 9108866 8936298 8517634
17377 8517634 7873631 7616828 7290862 6931315 6630853 6538390 6421286 6255632 5905635 5375947
17367 5375947 5023985 5020601 5009435 4961203 4539184 4380307 4069545 3849825 3589683 3297562
17357 3297562 3189940 3017248 3174840 3202206 3031453 3001806 2819071 2623929 2577452 2388424
17347 2388424 2455156 2666844 2506962 2408285 2609569 2417792 2465360 2421616 2336807 2388251
17337 2388251 2414778 2359943 2284206 2252917 2099750 1876519 1591590 1450801 1552373 1425218
17327 1425218 1345581 1392711 1559081 1620102 1569476 1512991 1273119 1201871 1159039 1069376 995862
17316 995862 968138 822265 788103 666694 589215 633009 774928 720748 649346 508842 570817
17305 570817 625657 643972 625598 675251 506012 586714 733395 453784 627405 818041
17295 818041 799995 594633 591567 645730 739630 729455 522057 463545 708570 813752 1009827
17284 1009827 936327 998535 1084450 869499 679525 800717 717773 562068 539366 582726
17274 582726 704224 640032 635026 573306 511658 415288 427382 624579 828868 766760 492136
17263 492136 479831 557274 555954 465355 420515 506503 491927 453172 465930 782366 826391
17252 826391 585055 537936 410797 461543 537156 551863 390473 220191 208324 537696
17242 537696 511227 340739 216622 336200 514153 486707 217377 137079 98284 286459
17232 286459 442666 381851 295897 409706 320025 186534 448941 414338 217045 42061
17222 42061 -15613 76594 331731 450845 308464 345938 466207 424784 295145 393968 338051
17211 338051 292871 299734 202745 42001 -80064 24051 5728 188706 203269 125805 195033
17200 195033 378323 437926 593659 576322 199719 150659 292396 253087 39764 51319
17190 51319 165654 422447 302408 344561 293232 184089 174731 107929 10383 -85764 -76177
17179 -76177 184222 203296 181140 50909 124964 325523 580370 513182 76126 -123836
17169 -123836 -110771 -164456 -153776 26404 19553 -143308 -63942 46135 119054 280269 196036
17158 196036 -117072 -145472 -175891 -324670 -363011 -298551 -90552 -16309 -79963 22290 -13252
17147 -13252 -180580 -182657 -64832 80665 228188 313462 133681 -40876 -123977 -149555 43116
17136 43116 -51417 -104954 102715 161159 313424 269759 247650 18953 -157614 -237259 -198120
17125 -198120 -128918 -120673 -55430 -17712 -93640 -198179 -84066 81944 91896 104773 172276
17114 172276 96542 23656 110784 321271 302454 110929 62405 212281 201644 263005 234562
17103 234562 228469 31203 -159098 41869 87500 -32392 -176328 -281277 -259072 16473
17093 16473 109021 47550 25557 189873 207754 300007 246522 59617 37770 4128 -153231
17082 -153231 -135985 -23680 116882 72388 52298 76577 121149 210327 413575 358711 459037
17071 459037 252683 367006 363282 99750 -72588 -30327 -2814 -76198 -28831 8237 86079
17060 86079 121219 116811 97000 43443 71863 231099 70777 -100505 28609 -56991 -267726
17049 -267726 -349975 -135946 -77790 29463 321972 179568 106942 1095 176584 180483
17039 180483 70351 128253 67457 82155 79423 32865 -29850 -24735 167757 479334 785534
17028 785534 386252 123275 -158706 -225446 -48221 20733 -120356 -66473 11298 -134888
17018 -134888 -245303 -94711 127059 260207 106675 97599 205808 233759 181388 143481
17008 143481 42843 -104939 -149362 -284315 -282005 -414605 -409031 -319975 -267099 -251071 -91674
16997 -91674 174633 15900 88795 144051 220800 267089 209891 235711 196843 125139 62797
16986 62797 -24366 44888 165556 226145 133521 182471 326159 205755 11581 36147 205345
16975 205345 228545 268641 330437 209554 37391 74306 146583 134501 -533 -174506 -194799
16964 -194799 24497 -51351 128713 84962 -26941 -48610 -7932 50046 145318 139417 51749
16953 51749 112135 275454 474769 793164 1095795 1010740 980673 1054227 1098727 1130944 1048174
16942 1048174 979673 1014989 1067895 1095307 931182 739928 734001 647969 476094 494346 611061
16931 611061 694787 558971 363804 274366 414465 246056 127144 92242 214557 339347
16921 339347 359763 55752 -119533 10369 271948 287110 47181 -91654 -246521 -331241
16911 -331241 -355803 -373322 -307577 -254104 -163438 194798 288690 310920 364273 218816 319942
16900 319942 234534 240177 347903 398569 466133 373225 343389 556586 748889 835922 917004
16889 917004 1171552 1289504 1107918 997326 750237 504592 566421 622396 700726 598911
16879 598911 302665 156416 132425 173822 143957 274188 189307 150513 153348 146667 42595
16868 42595 120156 56888 37623 92507 177519 14939 -1574 54403 263332 419472 308306
16857 308306 176106 157452 181505 194492 72306 108210 284608 39787 -183186 -177044 22557
16846 22557 258692 246263 -7470 -139167 -225012 -363004 -247173 -183330 997 -887 -51004
16835 -51004 -67921 6379 62864 15276 91023 135885 158541 256895 159275 -100376 -252369
16824 -252369 -332890 -478327 -382357 -334646 -130572 1529 -11678 -45955 -196719 -128679 -75169
16813 -75169 -231498 -274580 -183056 -311716 -281975 -269275 -278186 -247152 -203484 -75120 -73280
16802 -73280 44726 151912 502133 447982 175415 5768 -46434 -219101 -110245 -136203
16792 -136203 -289732 -363429 -375583 -338899 -281799 -253156 -381304 -313151 -232661 -76174 19008
16781 19008 25727 -190578 -280249 -70225 90928 -20022 136853 -7629 -128582 47354
16771 47354 177840 -26704 -178986 -271918 -240203 -253901 -162815 76669 128551 -48597 -51479
16760 -51479 -91218 3350 -69974 -424915 -703452 -556370 -327180 -102890 -84907 -33219 -39203
16749 -39203 -93592 61556 197284 125058 -2929 -86117 -122909 -45186 -131033 -140083 -75666
16738 -75666 16082 21569 78304 181706 138455 74921 169429 80367 -107536 -31093 -47538
16727 -47538 72300 116207 189285 136067 113018 145144 86972 109694 117249 65847 99686 145183
16715 145183 -68161 -103334 -224147 -318248 -226053 1765 89016 96192 61639 -67070 -168474
16704 -168474 -155882 -148613 -80670 13730 169467 271780 238377 3326 -136600 -166327 -265761
16693 -265761 -316747 -197560 -180170 -540820 -629838 -455820 -337153 -272513 -207059 -80170
16683 -80170 -136969 -159525 -266060 -296929 -193825 -151751 -189942 -145084 -198820 -210202 -181700
16672 -181700 19982 160542 57980 -88991 -157489 -137419 -75023 -339 -99872 -62836 -93460
16661 -93460 -94240 119376 225210 -31753 -201686 -343985 -347896 -68413 -17085 193554 128375
16650 128375 -116518 -225909 -317247 -317853 -331829 -477882 -392001 -302970 -252843 -139992 -232753
16639 -232753 -376962 -90292 96525 85940 -16659 -265215 -247264 -170230 -76668 -80827 -172644
16628 -172644 -327908 -327497 -292129 -212677 -321094 -287027 -204682 -257281 -218446 -143512 -20327
16617 -20327 35750 156038 112409 76752 3815 -181208 -213180 -315311 -368906 -242116 -224702
16606 -224702 -213504 -327356 -333892 -642623 -711993 -414243 -311253 -330935 -210241 -46228
16596 -46228 2999 23917 -18506 -20794 -190959 -75173 -52707 -205784 -187033 -128836 -79304
16585 -79304 -196178 -321374 -333402 -473239 -356883 -364200 -401186 -580098 -529441 -496062 -411440
16574 -411440 -451902 -366455 -396364 -225039 -166002 -2737 98765 288307 211566 238852 376085
16563 376085 344652 150979 119129 -25179 -234335 -153071 -20686 -97937 -238352 -159112
16553 -159112 -560 92784 -68349 -91541 -213013 -493041 -538164 -426503 -347365 -323468
16543 -323468 -344071 -475049 -435058 -183634 -124884 -281193 -535329 -435589 -172567 66151
16533 66151 -28103 -73583 50800 30183 -22661 145574 268159 207590 -23914 -136952 -10990
16522 -10990 298460 343851 356310 208105 241418 252522 263173 223617 -25012 -271514 -153728
16511 -153728 -40466 72358 -20862 -6388 21161 -130947 -139592 -251427 -246555 -293872 -316384
16500 -316384 -207036 -99242 12625 -25191 -201713 -230768 -164866 -97121 -197119 -435160
16490 -435160 -389081 -299328 -212045 -162058 -84574 -50529 -62429 687 184829 73908 -50404
16479 -50404 -34688 70331 46769 17614 7204 -50096 -102598 -277194 -214633 -44177 -13992
16468 -13992 35318 -103025 -416235 -374207 -288995 -144293 50871 219733 2957 -161504
16458 -161504 -264312 -399192 -406100 -342734 -160324 -21610 168474 53577 -98784 -196429
16448 -196429 -243883 -9264 45584 -148289 -166263 -256953 -359122 -101812 -121642 -331458
16438 -331458 -529943 -451363 -378045 -350414 -474152 -317258 -100869 -75323 138165 188773
16428 188773 184019 250543 372913 301183 159845 77220 48506 -26705 -25605 144541 206536
16417 206536 201045 193279 86778 -16206 -386218 -650859 -506546 -312653 -201174 -227318
16407 -227318 -186021 -233346 -186296 -51634 -141765 -57091 -27855 -106340 -42646 -191971 -148572
16396 -148572 -148557 -330693 -393792 -378815 -208653 -131900 -69043 25140 -72450 -399205 -406186 -227799
16384 -227799 -227446 -175411 27564 101292 102369 -4751 -130179 -167617 -68261 -79 -99976
16373 -99976 -160864 -256614 -241368 -41198 -86525 8120 113667 179294 -10202 -118712 -12065
16362 -12065 -55065 89830 267685 160143 33010 -37962 -122031 -294364 -508708 -396684
16352 -396684 -252698 -84640 -34216 -268210 -198554 -115691 -151244 -333142 -361104 -151369
16342 -151369 -152230 -186813 22958 84209 -45503 111595 247413 207929 27362 -49926 -8599
16331 -8599 103375 284005 299935 488383 492139 225539 260325 397008 436281 318010 200551
16320 200551 -22255 9407 58314 9775 41992 124820 125835 178032 74312 -61076 63253
16309 63253 83165 204080 28251 -192932 -147257 -101525 -125904 -291760 -417082 -510963 -331804
16298 -331804 -306113 -89381 47078 -113356 -119235 -52347 155476 357880 361846 218936 126353
16287 126353 249217 372834 273448 288944 167310 -2369 -258852 -296402 -174487 -194748
16277 -194748 -340817 -251681 -76670 43437 11200 8370 -163841 -138830 123051 2504
16267 2504 -200804 -320629 -312872 -238930 -150485 -186661 -164603 -137447 -96621 -138220 -376258
16256 -376258 -475546 -176115 1674 104232 154554 285175 390447 199015 33527 -116083
16246 -116083 -110352 -97351 -315469 -223705 19013 -76995 -26163 87964 67675 -44161 -145413
16235 -145413 -196708 -299600 -187638 -196411 -147761 -86276 -107823 -431175 -386401 -381915 -261367
16224 -261367 -294926 -196524 7294 -93705 -179588 -306652 -214531 -183584 -340549 -415712 -148258
16213 -148258 -80272 -60999 96716 192830 156114 54261 -58408 -11908 174848 46494
16203 46494 48517 -132929 -125265 -124112 -72514 27064 -181801 -342967 -104715 -85752 -158403
16192 -158403 -294597 -253280 -59266 215562 72860 58525 27109 41721 -62660 -59061 -25413
16181 -25413 -60037 70786 -160063 -273833 -259705 -236440 -170377 -88393 87170 143365 -14025
16170 -14025 -25238 32079 116472 17729 -69986 -236876 -123146 90309 17504 -7128 -19967
16159 -19967 -240420 -211682 -38314 95608 159202 149322 162046 6154 -201195 -217822 -215239
16148 -215239 -23224 -25409 -308608 -465549 -327931 -359551 -411415 -165375 202130 191088
16138 191088 -23372 -319754 -499770 -566934 -428948 -368902 -401716 -207761 -88820 -94390
16128 -94390 33325 5501 -249388 -224946 -92470 -153479 -119824 -164413 -207081 -286754 -474962
16117 -474962 -500925 -496888 -410516 -418559 -324095 -216457 -32814 127216 192036 86415 183982
16106 183982 -59523 -87551 -113389 -121035 -134179 -131187 -188861 -138999 -168600 -119233 88624
16095 88624 -121175 -207375 -130997 -142566 -63647 72366 207138 172390 147585 154121 299974
16084 299974 288501 115266 -57977 -82539 -71342 59509 -136125 -243359 -210991 36043
16074 36043 -44522 53998 110153 122453 14238 -66525 -295108 -203645 -102651 -68771 -146251
16063 -146251 -236543 -104928 -35208 112057 268979 299943 153692 147796 50407 56469 117747
16052 117747 184827 147064 285841 144320 179740 105872 -1570 -9670 -36964 -55098 -158645
16041 -158645 -120803 -160602 -214113 -84905 -229234 -319851 -199229 -97950 -82546 -55519 27259
16030 27259 56797 -4081 91991 73741 24765 25440 -25023 -5817 27691 64662 114218 241143
16018 241143 139670 -15866 -142459 -324809 -187446 -173801 -85994 52373 -29710 417
16008 417 65866 274064 343248 351448 182070 305696 172708 139594 111413 278947 395363
15997 395363 386262 217443 218757 123415 -17632 -375027 -317478 -137073 -227369 -306573 -198153
15986 -198153 -197566 -153598 -132087 -104246 -245758 -245140 -275711 -192067 22956 125723 -40370
15975 -40370 -235457 -216186 -166868 -12534 -21015 -272618 -401581 -437639 -444917 -518743 -378637
15964 -378637 -400851 -134665 -27576 -270477 -144100 -121017 -99930 -96586 -153843 -74637 -74316
15953 -74316 -130464 -275973 -299276 -224233 -68008 -20183 -158309 -274564 -166404 10505
15943 10505 -95614 -275998 -362292 -232435 -64078 108120 54791 163941 331974 509520
15933 509520 586367 311915 216665 315377 106617 61801 26737 41581 -148181 -220477 -275490
15922 -275490 -320763 -272635 -170762 -347518 -351011 -381579 -147406 109439 65353 -94264 -129621
15911 -129621 -11109 -46744 -219995 -389517 -306480 -155154 156387 262525 219977 213565
15901 213565 247742 -37076 -162521 -246732 -249311 -109719 -83781 -99367 -236737 -284780 -139152
15890 -139152 -27585 91030 176763 229062 164961 21862 -148603 -70355 -51916 -143824 -133796
15879 -133796 -178008 -112979 95962 -29226 78281 251064 159667 106360 73292 100984 -113838
15868 -113838 -171997 -13654 103814 333208 357716 304720 153927 268593 95336 43939
15858 43939 261991 183839 30654 49358 73301 -15386 -199757 -141213 -120333 -188374 -259902
15847 -259902 -334998 -211239 -77131 -105434 1669 39569 -7785 -62349 -42587 -22690 153010
15836 153010 242469 102144 -136568 -172050 -37478 -74821 8359 31621 140992 50851 -35162
15825 -35162 7443 211573 205647 46292 -193640 -142075 -169999 -173941 16628 -40091 -98204
15814 -98204 -49417 -43633 97657 -57037 -189540 -52151 -55514 14136 -33135 80714 62129
15803 62129 108133 -68294 -174887 -351319 -388503 -133189 43080 36212 -49520 -142082 -46358
15792 -46358 -116233 -93246 -84201 -70400 -123919 -224774 -106745 -95391 -142971 -35859 -37508
15781 -37508 -115803 -29917 109911 816 -239022 -391250 -223297 -212365 -162722 -6203
15771 -6203 98225 58946 61342 19096 -169085 -167468 -191 -31142 -34436 -39792 -448 172386
15759 172386 55644 -47810 -173376 -217100 -202020 -139402 86052 7074 -322312 -264522
15749 -264522 -212999 -254640 -353616 -327560 -211394 -40847 144394 69786 104239 -76981 -227033
15738 -227033 -116998 19166 155881 29253 -72026 50113 -29861 -236693 19341 88378
15728 88378 70479 99809 -1487 -113725 -60594 -18753 -56446 220499 307050 123232 -9410
15717 -9410 183303 187095 113230 -738 25895 -65842 -15998 65428 105679 10066 10598 -74714
15705 -74714 60003 106365 -29029 -69017 3135 -156480 -299664 -476666 -405119 -248947
15695 -248947 -198938 -263462 -121582 -109708 -190870 -85329 -91286 -173648 -60205 -60957 -100690
15684 -100690 -11424 -123753 27180 58940 111588 212195 44609 -102100 -205735 -289967
15674 -289967 -298854 -119770 -92978 -72327 131696 7204 -87818 -203912 -137975 -12524 71219
15663 71219 50606 -202849 -345238 -276734 -195387 -21341 -29260 -303475 -320081 -74609 -94069
15652 -94069 -52979 330944 254532 164451 290833 102378 9697 37744 -46061 -337266 -349054
15641 -349054 -407028 -374028 -147700 378 -65292 -25379 -42570 -55551 -117050 -100249 -161522
15630 -161522 -86863 -30898 -105902 -91732 -106077 -35987 68183 -217086 -463124 -220263 -74672
15619 -74672 -117846 153 -16810 -128070 -184993 -58143 26734 205 28986 -36407 177930
15608 177930 80591 284017 409287 116377 -29990 -1527 -89554 -255545 -229946 -28880
15598 -28880 267187 -41163 -157822 -80555 10624 -69829 29170 231962 243673 251603 240756
15587 240756 -62374 -287702 -151487 -54530 -40080 -174444 -142943 -112786 83813 -104920
15577 -104920 -217174 -101936 -70081 -272743 -135946 -151287 23541 148934 226478 170191
15567 170191 115033 62924 -205062 -123017 81825 226477 16758 75311 46362 97731 33818
15556 33818 -27961 46264 312623 307145 135143 232321 177112 85004 -59548 -134516 -249063
15545 -249063 -187611 -191734 -276909 -335147 -178520 -291585 -268958 -151571 -54704 108251 196880
15534 196880 293982 39281 -188772 -145964 -71117 -196346 -196587 -232100 -243182 -172510 -138670
15523 -138670 -226688 -32932 -35716 -11593 -64658 81853 -17120 -252602 -126275 115661 150572
15512 150572 68520 19601 175046 284591 267106 -59043 -169450 -263659 -51730 283612
15502 283612 174771 127652 -140734 -657285 -709990 -327649 -272075 -295935 -257937 -30922
15492 -30922 -279 -22243 -87044 57923 79004 201956 258292 21609 6574 -14107 -37175
15481 -37175 -95816 -110682 -63804 -47843 -34010 -212258 -422994 -270339 -85247 56311 174011
15470 174011 147142 80530 129206 163952 30873 203010 365087 350923 407594 309195 242116
15459 242116 242754 347930 373563 242381 265713 117829 57136 2102 -21244 64468 76958
15448 76958 81334 191065 417692 454520 321607 158019 293599 64896 -15904 -6128 -112112
15437 -112112 -229101 25601 28500 8786 8569 34064 7602 -3894 5589 4080 -83292 -62182
15425 -62182 61175 142322 166699 -100358 -292482 -224260 -165375 -15254 -6395 -207578 -76539
15414 -76539 -9106 -123624 -270302 -170965 98692 106792 -67152 -72786 -74635 -208927 69635
15403 69635 152106 -87638 -332444 -376170 -275548 -214223 -8410 -18219 -66048 -47365 -146373
15392 -146373 -127544 -163481 -82500 16446 -277738 -541119 -523060 -440327 -384141 -301688 -11999
15381 -11999 238753 345382 231901 110538 -13832 -91851 -51136 70634 -29370 -33506
15371 -33506 227398 325874 295422 -31355 -212862 -194618 -230354 -248683 -138488 26795 146395
15360 146395 101506 58495 -142506 -115317 14938 86537 73540 52538 130515 148939 107247
15349 107247 94517 336 -97193 -227555 -177437 -28184 112133 192735 -15323 -92697 -168765
15338 -168765 -46890 -112174 -26770 14637 -71961 -85554 -209379 -153583 -121848 -72395 -118667
15327 -118667 -151880 -43263 -96084 106631 290084 150195 -209423 -272520 -43440 -119871
15317 -119871 -177762 -219690 -109865 92635 190689 362859 346438 10714 -98357 25104
15307 25104 127186 195809 -8549 -272924 -306404 -359558 -404634 -167684 65942 40611 18333
15296 18333 7269 -75501 -111085 -113159 50196 -19574 34976 37264 -118035 -280239 -72376
15285 -72376 21755 -31379 -63609 11895 116848 222714 275278 153602 13117 -164899 -130954
15274 -130954 -164673 -229674 -300690 -326663 -283754 -259096 -285076 -328712 -391255 -282390 -101554
15263 -101554 -183213 -358233 -184965 -131626 -300543 -470983 -393482 -78780 -70618 -75255 2946
15252 2946 72241 -46680 -140257 -38548 113606 209880 73744 71602 -39305 -195020 -148349
15241 -148349 -105775 93723 -197716 -510745 -477981 -545662 -311372 -31133 95784 88131
15231 88131 -886 -181960 -238391 -170435 66469 285682 196934 145242 156494 -71259 -172366
15220 -172366 -167265 -92503 -210583 -242546 -270805 -411066 -491354 -508767 -468342 -429492 -303541
15209 -303541 10729 110592 26475 102483 235616 65893 -159188 -181101 -133653 -87388 -80822
15198 -80822 -90459 -141535 -225694 -87309 -36415 -118415 -77217 95856 105123 -21793 -130611
15187 -130611 -103357 -151507 -290584 -132679 -12746 173049 320440 431252 254952 -51596
15177 -51596 -245234 -139580 -2699 -10483 -202578 -242830 -40537 -151392 -242359 92332
15167 92332 111799 17337 111169 -17904 -48632 -166179 -260048 -114280 -148364 -50536 -88182
15156 -88182 1755 50356 184047 186239 211522 147739 168113 -10386 31027 -23726 39892
15145 39892 42062 -103390 -208422 -228195 -46506 -65473 -199666 -121312 -143624 -305613 -409508
15134 -409508 -421431 -389030 -217362 -110032 32188 54896 -26573 -168877 -254930 -65270
15124 -65270 -130658 -172553 -259038 -244791 -469049 -301613 -106958 135794 264876 293275 257266
15113 257266 241729 301327 299207 222385 178017 131945 12104 -30198 -40888 83157 87103
15102 87103 -148993 -163198 -58302 -55235 93899 134067 -124465 -464336 -344937 -195935
15092 -195935 -41501 -8041 74014 43272 124548 54995 -214182 -323261 -234299 -242169 -358951
15081 -358951 -447714 -208082 -40911 -36860 -29899 -56383 -147540 -125249 -103597 -47985 -76177
15070 -76177 -163255 -120062 29566 26957 142280 63955 -128565 -103999 -51100 84545 50092
15059 50092 -77790 -114925 32364 284392 309122 116057 33815 28898 105702 -16979 -100793
15048 -100793 -59865 186113 102508 55600 236785 223244 284620 133409 -27015 -133063
15038 -133063 -232052 -161479 -275980 -370577 -206423 -93182 92162 -30511 -375799 -226283
15028 -226283 -132300 16093 40701 -221314 -166151 -219607 -200341 -134522 -138084 22162 -5015
15017 -5015 -61771 -101970 -84368 192879 -3360 -201141 -237554 -342107 -284980 -218225 -177876
15006 -177876 -141744 -142381 -177976 -368203 -264292 -158958 -172438 -257091 -391499 -483090 -267381
14995 -267381 -38471 -8908 -133969 -133523 -65446 80849 64420 86395 3766 -242033 -190021
14984 -190021 -249656 -273755 -10258 71515 162199 23558 -191717 -145647 -45330 -95638 -172760
14973 -172760 -410093 -433535 -259316 -85621 -166277 -52030 114582 -58305 -54725 166803
14963 166803 73757 181358 276827 217402 2403 -158764 -151828 -162156 -177830 -209320 -125243
14952 -125243 -237028 -228352 -305379 -408280 -388157 -234106 -170396 -173791 -88982 -51738 -50041
14941 -50041 96473 232154 204435 169818 23509 46791 161099 149265 27556 -212009
14931 -212009 -213045 56323 463815 404002 204108 184972 113928 185851 -70031 -107328 -148326
14920 -148326 21776 94661 109388 167627 134034 219593 235700 203075 -494 57241 117891
14909 117891 -55290 21313 41954 109020 276191 154562 126093 -6038 -211799 -218531 -251343
14898 -251343 -255308 -73344 187097 269799 229494 221292 210653 144952 -10971 -56037 -138270
14887 -138270 -90989 120876 97455 -38083 -162707 -202544 -69811 -186430 -303843 -353241
14877 -353241 -248758 -131636 -18285 100504 120429 34908 -178533 -252145 -153410 -222368
14867 -222368 -132720 136173 268865 90558 50385 -119247 -340518 -353796 -339793 -299212
14857 -299212 -128210 149164 77182 -158145 -505428 -398340 -104782 -28336 5051 -16419
14847 -16419 98307 145683 146970 100192 87114 207442 253028 39273 -149246 -265543 -346695
14836 -346695 -222878 -325662 -380396 -102385 140655 -2547 -305358 -308555 -334076 -462441
14826 -462441 -429033 -212661 -81081 85981 -2296 -2350 68030 -94047 11346 73750 -37304
14815 -37304 -212121 -66318 -131827 -214523 -48948 88895 122662 -176162 -251949 -256317 -307264
14804 -307264 -294372 -156499 -149054 -120147 -118276 -157340 -181933 -62122 -58412 -59424 -63497 -92818
14792 -92818 -270839 -322848 -139104 -44214 -145350 -393502 -330805 -291025 -103182 63252
14782 63252 65517 -48594 -73878 -160142 -202741 -36783 41857 -167694 -405204 -709700 -577530
14771 -577530 -376449 -204257 -22162 -270257 -340981 -262133 -229938 37857 190182 106668
14761 106668 -28978 -21604 -46767 -11676 123742 265640 191008 84576 180688 392137 320223
14750 320223 269073 207587 96905 36447 69400 143857 181301 162739 61656 136897 33618
14739 33618 -42701 -31285 42221 85323 -5047 -180756 56452 196773 184925 187925 217346
14728 217346 85554 49187 97218 321319 286396 116521 -163976 -407774 -398809 -23170
14718 -23170 211881 63355 -149333 -198690 -248569 -403097 -62636 72280 291769 298993
14708 298993 79617 211096 168439 48273 -36486 -227299 -168404 60939 -13484 -102451
14698 -102451 -121035 -77564 -12097 117614 348760 187969 94210 -30276 -74191 19105 -110155
14687 -110155 -424513 -401446 -229522 -100621 -82395 -22919 -218873 -240107 -146592 -190266 -177765
14676 -177765 -172007 -156672 -33125 287107 535727 473846 83885 -249382 -171540 -125001 505
14665 505 -105535 -27780 131139 206941 125704 220128 193969 187135 16064 -49211 75572
14654 75572 247982 422503 372473 259245 222307 77909 110968 74261 -79751 -99304 25448
14643 25448 71960 -52647 -118331 -220611 -400905 -482734 -326668 9433 155319 -65315
14633 -65315 92746 241096 59733 106270 386318 589587 889536 1124723 1459419 1387572
14623 1387572 1386676 1427570 1506702 1586237 1420805 977471 690045 471489 443664 558258 297919
14612 297919 88032 -53025 -90760 -217206 -89189 69729 273737 304972 253021 223873
14602 223873 59301 164321 13456 -56231 -231143 -283637 -139410 -19722 -69357 -55539
14592 -55539 -40105 -3235 -69702 28562 -109391 -197201 -160084 -96784 -5530 -13465 -76317 -34573
14580 -34573 -193493 -222547 -10992 151513 345986 585807 779191 811878 1290783 1699912
14570 1699912 1986782 2026019 2057728 2233989 2382957 2538409 2189104 1760780 1431308 1116111
14560 1116111 1190548 1140269 875268 745151 711812 540169 511824 306535 265530 303529
14550 303529 298841 346273 239191 130087 -154018 -194865 -48532 -26864 -3184 5944 124659
14539 124659 242380 214319 254545 191452 153980 171881 70142 -97454 -21663 29023 -28412
14528 -28412 108527 241902 287211 122593 73827 30431 177858 466733 556044 474321 461220
14517 461220 385579 416405 643440 818005 1047190 1144397 1162773 1265601 1418152 1373163
14507 1373163 936392 630668 397487 392040 274487 172680 188889 302798 340006 408320
14497 408320 310683 293582 154360 108023 18427 222139 376614 238964 248933 164600 189703
14486 189703 27370 -268650 -450981 -451648 -427000 -153434 -84671 101 -74163 -234557 -267888
14475 -267888 -179955 -202795 -174107 -431269 -423541 -405636 -349126 -275127 -254023 -327883 -194801
14464 -194801 122234 277090 131472 -8324 212339 200038 -190833 -540009 -332423 -62949
14454 -62949 130652 216820 92578 -123924 -90421 -135293 -283410 -354462 -305424 -115467 156832
14443 156832 86787 61650 -25892 -20438 -14576 18130 -92892 -196833 -158488 -40535 11646
14432 11646 -96581 -4296 179045 178824 148743 -172785 -205636 12425 50215 -118443 -309808
14421 -309808 -382059 -421841 -250584 23868 -28152 -131959 -98553 -301492 -366269 -355175 -185607
14410 -185607 -24157 99521 149372 -159626 -178743 -118067 54777 274559 71547 -27326
14400 -27326 57598 55168 56993 117548 350834 432024 507796 456700 379345 315073 192615 163063
14388 163063 122134 101671 -119460 153662 321226 215824 87223 -63517 -43628 107450
14378 107450 254202 314218 120312 -45520 34859 117530 88462 -85844 -112795 -248463
14368 -248463 -377202 -416992 -317113 -168081 -128566 -199772 -198779 -254396 -233180 21793 11383
14357 11383 -21224 -19676 -134649 -95070 619 -96427 -221454 -167117 -37546 84977 174069
14346 174069 56176 -212396 -203420 -103460 32222 144033 15649 83442 367664 182962
14336 182962 -92196 -244466 -99309 179254 10410 -72749 -134771 -86441 -30466 -94748
14326 -94748 54305 203161 269266 80565 -72792 44375 79991 61658 121288 80462 110138
14315 110138 173174 42642 34075 -83606 -148071 -6841 132801 45077 -78017 8421 109288
14304 109288 86511 82717 -166421 -53160 73605 -15398 127526 228133 316131 342433 289123
14293 289123 218809 157088 195290 24835 111374 219012 292426 360621 183644 160970 170726
14282 170726 215217 335294 223279 261736 410205 471315 546876 585682 461833 325038
14272 325038 313699 245737 236461 383840 390577 192970 257373 439613 514658 468931 487011
14261 487011 663909 495929 422705 484432 642678 539287 492618 664198 653401 627466
14251 627466 947724 837210 733721 582848 578759 743282 735603 599545 286978 221024
14241 221024 206927 326405 491055 429047 244159 136742 139602 162248 123636 58214 -78555
14230 -78555 -42502 -106017 -90627 7660 8337 47714 373932 619464 881898 1217197 1429916
14219 1429916 1469359 1401479 1470096 1149889 1103711 1143044 1235833 1218012 1121110 1154308 1183594
14208 1183594 1336608 1398682 1398546 1363289 1378097 1347861 1295431 1218599 1363213 1349089 1436552
14197 1436552 1307203 1230877 1130027 995667 1206318 1212055 1357870 1449996 1421384 1470261
14187 1470261 1687874 1655994 1605701 1711768 1859748 1882182 1998969 2254876 2471198 2772312
14177 2772312 2730558 2448953 2484744 2912706 3105278 3362704 3644679 4067972 4329101 4744135
14167 4744135 5272837 5880993 6969649 8133150 9296236 10737838 12637907 15172966
14159 15172966 18549634 22684492 27766640 34706296 44829848 60380586 84430203 120443367
14151 120443367 166708817 211839360 240181628 247188242 242862348 239639166 236135161
14144 236135161 216384056 177040239 132381144 99581303 80650473 70330321 63767516
14137 63767516 58048982 52206288 46619982 41973140 38414943 35291547 31785949 28463577
14129 28463577 25950042 23979691 22493077 21474766 20426493 19512714 19130394 18597078
14121 18597078 18127496 17718352 17556945 17606150 17560541 17721571 18208670 18138114 18162785 18658176
14111 18658176 19367821 20523647 22245837 24154542 26468082 29538779 33677905 39044313
14103 39044313 45860134 54480834 66217956 82821375 107785357 146616414 205807945
14096 205807945 285370642 368653004 429550398 462108896 482424830 499060474 502309306
14089 502309306 469121883 397892511 327020558 274023099 222647732 173311602 140007279
14082 140007279 118789729 103533568 91360674 81555509 72991328 65574295 59281611
14075 59281611 54212539 49945826 46438657 43325599 40557264 38226397 36370856 34705335
14067 34705335 33130889 31839688 30582594 29689571 28816286 27924140 27270279 26865646 26602130
14058 26602130 26279432 25954288 25901393 25975526 26126881 26652010 27818996 29447061 31900106
14049 31900106 34952075 38058186 41330719 45298829 50884906 58841753 70153409 87185504
14041 87185504 114943572 157511851 211116209 258911904 282299045 281386529 273259636
14034 273259636 270062488 265636112 237869274 185129001 135448745 103600480 85323769
14027 85323769 74167660 66063649 59012560 52523159 46884632 41848225 37648881 34563026
14019 34563026 32033417 29705056 27789223 26053116 24361416 22959405 21773069 20560410
14011 20560410 19534624 18689214 17953795 17403962 16854293 16075323 15274992 14710515 14398455
14002 14398455 14340761 14051086 13284566 12545769 12133843 11579724 11103730 10603834 10083455
13993 10083455 9798560 9512691 9132735 8675645 8329155 8044352 7595398 7318338 7043686
13984 7043686 6812293 6563542 6382103 6201148 6049512 5703955 5546621 5405530 5315945 5118313
13974 5118313 4673048 4538712 4523674 4475695 4523354 4387126 4327309 4277742 4213138 4142747 4162599
13963 4162599 4183197 3972938 3852069 3823683 3645574 3685698 3874758 3931042 3925147 3810268
13953 3810268 3849341 3558785 3432032 3343695 3304752 3168009 3201997 3035994 3031379 3112191 3148056
13942 3148056 2988676 2673477 2365958 2309583 2181803 2376522 2457420 2336287 2231701 2202623
13932 2202623 2492422 2400360 2040190 1872612 1782935 1713955 1498990 1300152 1217693 1301885
13922 1301885 1411625 1574361 1636350 1498247 1364446 1430740 1617768 1613394 1503363 1471298
13912 1471298 1516104 1706809 1711732 1750336 1801050 1382695 1090673 1148163 1150568 1371119 1274595
13901 1274595 1131311 1303987 1407582 1419228 1329659 1333026 1151152 1231759 1471479 1542412
13891 1542412 1526852 1346536 1227604 1121790 1165556 1255414 1088361 961661 940477 1108264
13881 1108264 1321673 1259891 1208682 1239340 1202459 1131820 1183261 1075033 838679 712389
13871 712389 710294 775126 715689 920134 1019149 880334 885734 816412 686449 624240 711134
13860 711134 802024 907674 905710 969934 890352 845376 701126 776494 767970 818083 721313
13849 721313 714671 687653 546334 330491 162782 291468 441915 368159 444081 460382 569919
13838 569919 634518 730515 803888 760277 673416 693685 491843 325824 400973 474833 697535
13827 697535 817014 580240 619615 689762 721904 692788 393298 217867 223258 355516 519891
13816 519891 484117 536863 415012 442271 661815 732304 661910 638910 358803 214224 234071
13805 234071 334797 324280 444115 558552 613658 688423 646791 436750 242453 187604
13795 187604 222165 -30748 -16069 -9297 48199 227411 326356 417921 293997 114680 82745
13784 82745 50209 18232 -57640 80835 297983 591578 497389 397933 316648 247551 171664
13773 171664 258162 242058 203319 261803 413932 647105 855373 708085 511949 339131
13763 339131 363273 410634 327744 361031 507280 529479 344333 77577 89566 216390 328181
13752 328181 340520 379505 172886 102303 190185 412833 312135 277650 295584 103378 -8372
13741 -8372 -63988 80629 89173 162029 267075 183877 58168 182337 407668 496769 588976
13730 588976 496586 297823 125277 64287 3035 -69702 -123002 73462 286188 123540
13720 123540 179237 325604 251586 192912 226191 101778 36664 -42978 -9462 71475 5829
13709 5829 124609 338698 252809 176056 98908 102769 87534 350313 407404 289619 60987
13698 60987 243861 413522 569252 454248 413080 597728 676899 647178 586207 510778 419560
13687 419560 151648 -8482 -83918 71703 -141532 -323655 -27079 238527 401636 325410
13677 325410 5269 -128044 46040 332199 353262 365119 587774 501018 513438 535808
13667 535808 797929 1121639 1198400 1251266 1281877 1198536 1362610 1262920 948527 554805
13657 554805 462168 433575 371138 358482 478929 341462 248254 390504 204487 21848
13647 21848 34103 93430 280935 128226 -122752 24454 59101 146671 340266 519304
13637 519304 395895 400818 291613 299244 152918 200550 260869 144115 39663 -38791 -77500
13626 -77500 40211 78399 30532 -42751 146670 234173 142938 154331 312693 492965 609575
13615 609575 519354 727423 1079911 1522788 2064041 2244961 2271457 2368370 2667519 2745695
13605 2745695 2522575 2040029 1532103 1337335 1223995 1056618 931042 540995 555296 636847
13595 636847 441501 243562 235704 142894 -104521 -8445 393436 358728 145628 -27050
13585 -27050 925 123054 240549 186455 -154096 -355103 -89917 108899 288716 402435
13575 402435 437512 470200 345873 418510 348344 285654 61058 35158 195442 472067 456579
13564 456579 542983 540934 645046 554286 666441 788296 1167398 1231255 1225668 1436618 1549689
13553 1549689 1560367 1686745 1472335 1248817 1137569 1054705 1032003 743466 414668 410774
13543 410774 501065 543761 432372 574149 497153 283551 409490 467216 440055 154806
13533 154806 135124 230254 336390 163021 139926 297594 346849 410051 278480 224752 176307
13522 176307 206418 219777 126771 200282 177571 -33566 125606 316777 174004 -9857
13512 -9857 -54717 -286740 -110982 -85183 -272806 -247666 -167052 -43310 -41699 -20758 142791
13501 142791 23657 26507 73457 -13405 -29066 -261946 -319774 -121581 -90994 -69726 88906
13490 88906 244377 131355 190961 161116 206841 261967 299955 210037 188121 116513 73886
13479 73886 -34636 -154828 -117367 31823 81650 144733 -14107 -281434 -215775 -252292 -188673
13468 -188673 -81371 76336 47081 -45169 44001 -80412 -68897 -63234 59433 207803 237084
13457 237084 19027 63076 -38359 -3168 48345 111473 171214 108213 233747 326611 309937
13446 309937 324407 230360 248111 43637 8930 173951 204302 129164 -88948 -149410 -151880
13435 -151880 88069 107926 68118 7508 85658 172454 191989 117759 56986 46834 -163268
13424 -163268 -182514 -59777 45319 244259 311163 137972 109059 273472 212814 161806
13414 161806 117870 197831 221498 140118 -143353 -54119 121890 29583 -22886 256125 322641
13403 322641 515528 490207 177492 -9306 27544 -211939 -287709 -132674 23262 59873
13393 59873 205727 181633 106913 129584 77321 -133850 -124087 -12023 48039 75068 132192
13382 132192 287587 302830 330077 261640 219726 10440 21766 -53777 -34201 210184 9401
13371 9401 124471 260759 228498 193566 203490 131746 -15372 -134761 -244330 -325959 -306901
13360 -306901 -298348 -133208 85824 102723 115006 -11416 25180 110712 9241 13647 -5981
13349 -5981 147402 165527 110582 70978 131918 1262 -7394 -166358 -165881 43253 239024
13338 239024 348573 373026 405441 157341 77754 131366 290754 261132 184870 219285 341227
13327 341227 429382 393031 78320 11218 -179555 -352930 -208508 -206583 -171143 22946 86148
13316 86148 142517 147428 323982 176026 805 -171138 -181740 -27446 177371 195385 131136
13305 131136 55213 36771 74276 193538 63902 1752 -146344 -135968 185948 148807 164484
13294 164484 134543 185263 2312 -154899 -169568 -12226 -8290 -123420 -156221 -15113 153596
13283 153596 50208 139796 135137 57166 26364 -90169 -203566 -291785 -180190 16935 63014
13272 63014 67707 26343 -143787 -201197 -144265 236872 315604 196140 148833 70927 27757
13261 27757 49739 105308 145219 305534 200802 49559 -113617 -84929 10319 106097 -58851
13250 -58851 -107191 5119 31933 121399 187576 293555 297453 -21009 -42715 163129 263387
13239 263387 259358 172477 119741 9118 -165750 -223279 -171533 -128641 -108805 -86368 -40706
13228 -40706 -4181 16676 -39209 -108725 -269986 -229853 -104452 3874 295840 399653 433628
13217 433628 299273 267028 316419 306768 223909 -69406 -187918 -132526 -134695 -128919 -221162
13206 -221162 -234699 -292261 -351992 -276115 -326390 -178981 -271959 -354553 -158784 48227 263930
13195 263930 229693 192035 -41888 81216 138240 61421 214384 158661 -13598 -87576 -208645
13184 -208645 -134868 110024 124728 -35577 48232 102485 -17384 -248850 -124782 -140726
13174 -140726 -203302 -178454 -105121 -62415 54830 -139875 -187254 -241104 -257728 -311624 -268125
13163 -268125 -18231 78962 124018 317888 118861 6409 95237 170228 172510 45414 158781
13152 158781 159906 -117822 -372068 -220718 -128011 -77503 -20065 108552 101586 39606 -86181
13141 -86181 -73948 -73425 -145983 -206727 -109363 10817 144248 124163 67875 206071 360196
13130 360196 58545 -90592 -230941 -423861 -360078 -251908 -133185 -94148 12766 -33294
13120 -33294 -40307 83255 291438 173841 -30163 -190478 -175683 -17419 196187 205107 180080
13109 180080 74832 -78661 40040 71926 71012 -45380 -27545 18626 211697 354880 303458
13098 303458 181580 -6770 -29292 -92931 -213260 -257820 -301476 -256420 -248606 -326044 -213707
13087 -213707 -18735 -50543 -42884 55430 -142773 -164542 -194199 -182787 44187 254779 176036
13076 176036 76880 -149090 -225850 -188042 105353 98499 -56403 115611 169615 -46289 -250265
13065 -250265 -354636 -344917 -133943 -12690 32655 69688 -217239 -304279 -319021 -145818 -82151
13054 -82151 -175476 -342088 -488805 -545134 -237289 -232760 -263244 -26761 -21522 -29052 71582
13043 71582 184873 83548 25359 -29849 -76448 -129373 -117468 -22194 -58003 -15510 3980
13032 3980 -24228 -147312 -383604 -245835 -2045 -45083 -43193 -26950 283407 319688 40183
13021 40183 137546 255662 133651 -7977 202281 259244 340912 61142 -13727 39076 97732
13010 97732 -123464 -112248 -120873 -229254 -299725 -188457 127763 399273 349956 212880 -15772
12999 -15772 -133679 -220202 -256128 -276020 -207940 -189351 -104692 200221 35075 54154 270709
12988 270709 450092 359651 169054 75334 120515 74119 -9020 -80089 64216 45654 111309
12977 111309 135076 136602 191805 352342 411091 229475 83551 -99053 -143771 67335 179949
12966 179949 142950 -105175 -114545 1225 -67755 -167005 117570 94927 77082 73878 51717
12955 51717 -8937 -115742 -261992 -161879 -278077 -252383 -328910 -351358 -385481 -488069 -554505
12944 -554505 -452907 -331512 -219445 -4295 -43526 -27318 203924 265601 254809 158880
12934 158880 207658 148745 8006 -72871 52882 -19980 -127081 -252272 -325205 -193210
12924 -193210 -137072 -282054 -201040 -192565 -98451 -28999 86517 189015 102865 95646 174973
12913 174973 85141 -70696 34258 208406 254903 150430 246331 166433 61348 -24542
12903 -24542 96548 6207 -145720 -236154 -247870 -513785 -575938 -314762 -194746 -105627 -117209
12892 -117209 214458 166634 -827 44589 157744 132514 130906 194173 240658 31409 51033
12881 51033 -80643 -55474 69261 87210 5714 -131921 -196143 -42140 -63734 -358998 -293405
12870 -293405 -77995 -62855 -28626 57925 107237 -16487 -150896 -283991 -143691 -213
12860 -213 27783 -117823 -127415 -27733 87231 427 10226 -47850 -137043 -148507 20143 14771
12848 14771 75929 57548 79887 115917 68645 34183 -94603 -230803 -473246 -480882 -433421
12837 -433421 -310784 -304391 -315947 -296483 -162266 -124154 -188231 -62397 64494 215042 324833
12826 324833 445070 359760 -26095 -283884 -56824 285455 241417 44806 -244736 -131850
12816 -131850 165177 198456 66384 198649 135480 125510 -93014 -37235 -21684 61728 161006
12805 161006 95530 196355 270226 185698 135683 275069 273924 254956 157414 177021 165976
12794 165976 40065 39437 8072 -80099 -112834 -171974 -95163 -142070 -303910 -362195 -325514
12783 -325514 -192351 -233464 -292380 -213114 -134213 -50836 -95957 -197939 69798 -72438 -185076
12772 -185076 -210779 20554 105855 98846 22779 118483 45375 40469 -120515 -96013 -218852
12761 -218852 -300379 -328807 -326623 -162923 -31682 193571 170411 101422 -74560 133517 36719
12750 36719 -74741 -99185 -22986 64256 -10954 -163104 -188511 -46757 142286 199331 129031
12739 129031 132661 188775 50072 74499 -14144 48097 70840 -28961 -168520 -434674 -274366
12728 -274366 -171704 -90481 -21781 69075 -145672 -150137 10460 77576 83678 179148 -253507
12717 -253507 -207118 -74939 -11105 150820 128664 192627 270667 266551 330279 294139 109732
12706 109732 -32750 -7805 108490 123809 -1655 -93333 -217618 -409394 -169295 -11536
12696 -11536 32149 -13679 -42264 -124365 -69159 4522 -31578 -13825 -185630 -476616 -487477
12685 -487477 -331253 -254628 7446 54289 -274 36354 -106837 -243284 -77876 121428
12675 121428 95109 266098 301275 429550 208550 -44465 -88412 78151 66516 -77260
12665 -77260 -65631 30975 24807 -92370 -67870 128965 132991 208846 84505 20614 -51911
12654 -51911 -190999 -181796 -136056 -244704 -338831 -114541 74283 164568 5062 -39416 -12117
12643 -12117 5616 42759 97615 -35951 -5183 -137615 -97622 -47984 -170099 -18254 110718
12632 110718 80218 45855 177111 115013 -122699 -76571 136667 309957 222701 -34796
12622 -34796 -173097 -322291 -443294 -313201 -139533 -131828 -43871 -30211 -117350 -33327 -150133
12611 -150133 -356053 -279616 -268446 -144480 -33136 -95147 -69997 -46337 83744 153184 221231
12600 221231 316772 188932 212357 184560 42845 -2334 77666 298905 237120 107524 4662
12589 4662 82082 -48251 -150829 -229499 -263248 -218747 -103792 -126495 -171947 -305267 -186469
12578 -186469 239332 236609 -37921 -100708 -130347 -210469 -423990 -486149 -369264 -164389 92453
12567 92453 191648 328527 318800 -100998 -244212 -343944 -444191 -513541 -558054 -435641 -105874
12556 -105874 -25523 90624 65902 -203146 -191211 -185161 -412004 -335748 -32278 264417 336960
12545 336960 112813 98677 -35103 -228816 -178433 -55067 -152889 -382801 -328104 -298724
12535 -298724 -296836 -260679 -173692 5315 132238 -77083 -211119 -237469 -133301 -157709 -220549
12524 -220549 -202067 -195775 -115099 -143205 -95342 204797 333819 113291 -224067 -328378 -344993
12513 -344993 -241445 -340073 -439901 -442201 -360609 -234341 26715 214494 223577 180032 161639
12502 161639 203925 296349 109829 -32708 -105118 69206 219497 94157 78813 241940
12492 241940 329981 346720 196079 195610 247874 308711 135640 108599 158216 -38921 -169504
12481 -169504 -166432 -119101 -126403 -152420 -33900 77249 -8275 -42749 -274685 -286147 -185530
12470 -185530 -151698 -184388 89017 54362 -119295 1972 75559 346872 588876 438499
12460 438499 376782 280236 117501 -107791 -47116 40134 -56202 18604 52010 326474 366873
12449 366873 354781 346192 234908 86796 -268752 -230297 3149 50762 80982 -12866 111714
12438 111714 62364 -18276 77718 144983 205799 496821 426655 249102 180451 166689 -107358
12427 -107358 -29714 16403 146378 3783 -70272 11386 -107320 -207373 -338302 -499209
12417 -499209 -384051 -194669 40141 -40473 -93180 -81734 -118060 -122700 -158396 -157889 -168439
12406 -168439 -139859 -42735 -98550 -168251 -101939 -24437 -223024 -260796 -207993 -184272 -364597
12395 -364597 -82380 139780 99860 48918 -12792 21325 6701 -51715 -360458 -266275 -67225
12384 -67225 7696 -2876 -221769 -139200 -90961 21178 117449 -45508 -169949 -202748 959
12373 959 -103391 -128321 16599 184466 135668 173311 83573 99048 10207 -23374 184502
12362 184502 255497 199578 60457 -97469 -308714 -393868 -436025 -414165 -263675 -318426 -237347
12351 -237347 -116709 -138111 -288740 -354307 -295877 -87052 -120985 -186895 -417195 -413761 -358346
12340 -358346 -316322 -216822 -110857 -29712 23808 2530 94301 126018 -12214 -96522 40442
12329 40442 65642 -116601 -267415 -375049 -257345 -64597 -48485 188325 333121 317863
12319 317863 -17015 -28141 10041 58861 -59155 -68259 -88119 -168990 -32703 -139906 -405998
12308 -405998 -175467 -5832 -22454 -13896 135423 328894 475214 688978 650181 483849
12298 483849 538470 494967 614445 763787 710441 771573 695692 768987 670953 756959 872511
12287 872511 958118 859088 742324 685660 477384 290596 132562 166154 196225 221974 140973
12276 140973 205227 80752 -29188 -103297 -290871 -227716 -224450 -316372 -185220 -78188 -57725
12265 -57725 9492 -77466 -326818 -387215 -445884 -305324 -57153 77833 115991 124497 67647
12254 67647 20793 152976 109446 -16993 42450 299200 524564 643440 738092 708463 857513
12243 857513 1196061 1247123 1323070 1519002 1731099 1796307 1746426 1816095 1820938 1499337 1443480
12232 1443480 1396738 1293466 1322204 1103748 855428 492534 478635 630438 458157 431784
12222 431784 389138 254886 249815 234738 250034 125154 19055 234055 569822 526582 280267
12211 280267 167108 66607 -52369 23409 694 164339 125393 78125 -55526 3262
12201 3262 -120361 -341852 -200672 38197 2699 -302038 -239495 -240405 -192132 -7345 342479
12190 342479 458093 501203 654134 564766 525400 768358 908776 949088 947126 944668 1037850
12179 1037850 1064856 956303 820990 837381 705484 721765 697180 613420 595061 540158 332138
12168 332138 194956 139368 -52057 -18828 92970 200621 8857 21718 -37346 -259042
12158 -259042 -518437 -335200 -46560 96021 139326 6756 179570 166574 139642 -63794
12148 -63794 -222564 -108881 -25469 85299 255204 347451 383981 306071 183336 52601
12138 52601 -85786 -239665 -134464 -32719 34180 -173710 -257936 -361765 -230632 -210541
12128 -210541 -222057 -17866 38010 -4323 3261 191436 105933 128889 222315 358262 557581
12117 557581 507269 537765 668662 422631 301064 357142 126913 -76208 -147230 -236780
12107 -236780 -142842 78599 -68401 -132041 127269 214455 59592 13748 -82667 -200843
12097 -200843 -62008 68002 46463 289281 261869 158042 251759 222566 185013 251550 195090
12086 195090 70872 3160 -76478 -147192 -119137 -231922 -314882 -334721 -234158 -98543 19689
12075 19689 151503 264225 118412 179939 199742 234432 386584 343389 288418 443743 559593
12064 559593 542632 582133 509466 413112 360743 258019 260028 285727 146403 -7019 177579
12053 177579 282810 199397 91749 99967 92055 37118 -107151 -363196 -587583 -564059 -419161
12042 -419161 -392733 -250699 -84084 -42822 -285536 -352025 -231035 -245579 -341175 -208431
12032 -208431 -93350 51425 72780 -136604 -354844 -521325 -649034 -645412 -553753 -498623
12022 -498623 -344373 -399710 -334868 -226379 -285521 -291653 -53235 -158716 -115100 -148362 -404009
12011 -404009 -348874 -300912 -200747 -139482 -100146 -44975 -114862 28318 149005 114715 148845
12000 148845 59184 -8063 -20953 -169757 -188751 -242275 -186122 84623 338654 527352 562356
11989 562356 420570 650174 937572 871272 692491 574459 396929 276110 270781 282908
11979 282908 83590 18103 124068 264992 328740 424554 635865 688676 705933 566930
11969 566930 538518 501158 317803 168776 254325 409388 532161 440086 527362 454783 127542
11958 127542 162794 301361 340362 196924 197942 161935 204544 187906 444521 607938 501735
11947 501735 460980 686577 627171 591717 875379 984170 959279 1132516 1289281 1153045
11937 1153045 903769 799584 886239 1075988 1071531 1082967 1076749 1016514 1092352 894819 769406
11926 769406 880537 958564 1104394 1264893 1135285 964923 970751 1014367 1061618 1131228 1161447
11915 1161447 1116429 1406446 1403706 1196305 1071123 1247286 1493623 1658719 1596850 1464954
11905 1464954 1622824 1959755 2264376 2332349 2440942 2503895 2640225 2756653 3077653 3699744
11895 3699744 3951657 4197112 4541726 5001150 5400193 6084582 6944354 7848597 9070782
11886 9070782 10587056 12493425 14957557 17714498 21582545 26973531 34936977 45668235
11878 45668235 58856152 73174716 87615862 102292900 117026723 130843148 143150155
11871 143150155 155171177 168164590 179313138 183254315 181061803 178361333 178234257 176930151
11863 176930151 168390840 152870041 136140130 121317545 108080974 95900240 84253383
11856 84253383 72298690 61493923 53289849 47360505 42838686 39005215 35684780 32905401
11848 32905401 30467033 28107977 26294262 24984503 23927047 23071279 22271868 21593473
11840 21593473 21186955 21213697 21311896 21445655 21999206 22674089 23353158 24354344 25947048
11831 25947048 27640176 30149250 33533977 38017239 44405924 53557585 65704699 80568650
11823 80568650 98761272 121277064 146876838 173375503 199177425 224904759 251275267
11816 251275267 275795450 294784118 309657051 324524743 337942519 341999329 334622148
11809 334622148 322346787 311406011 299497709 279339321 249919468 220054050 193367150
11802 193367150 169031380 147550113 128467135 109963888 93664611 81566801 72692268
11795 72692268 65859876 60118476 55154482 50895991 47324827 44139045 41323406 39048449
11787 39048449 37256489 35501369 34021806 32911817 31828849 31060761 30506288 29965048
11779 29965048 29657758 29513310 29693000 30152366 30775991 31981355 33370757 34935935 37387887
11770 37387887 41194771 46219565 53408091 63129276 74602027 87104779 99746814 112082065
11762 112082065 124145990 135435572 145806002 155829896 165531078 172662280 174295286
11755 174295286 171905218 168962483 166838988 162422823 152973676 138528291 122878481 108884865
11747 108884865 96697367 85238562 74437617 63838887 54434897 47092911 41787448
11740 41787448 37822178 34590187 31919351 29672469 27589253 25642098 23907803 22761963
11732 22761963 21711635 20473568 19403863 18239276 17325440 16609580 15873376 14930700 14191154
11723 14191154 13651281 13060328 12616685 12120505 11909330 11594131 11221104 10806685 10384606
11714 10384606 10073186 9820428 9396119 9012111 8735548 8512349 8157868 7931901 7622953
11705 7622953 7350704 6999831 6647632 6288022 5980561 5871602 5823368 5634342 5351424 5236483
11695 5236483 5325289 5136436 4985118 5022453 4935393 4762426 4657900 4533789 4421771 4162463
11685 4162463 3896385 3897816 4028747 3984900 3820742 3830479 3810798 3715193 3670267 3419050 3182614
11674 3182614 3189298 3211050 3186033 3061435 3041691 3021784 2915061 2738937 2780263 2803332 2720190
11663 2720190 2686415 2617473 2558895 2590375 2450376 2355911 2240483 2489786 2433229 2203220
11653 2203220 2142156 2058511 2006701 2007657 1959739 1923158 1890192 1957017 1958188 1898410 1842395 1755327
11641 1755327 1658683 1615207 1542606 1506441 1528211 1576491 1518183 1347078 1360052 1461585 1638386
11630 1638386 1870144 1883394 1707934 1692028 1467846 1335871 1315942 1459462 1358969 1160724
11620 1160724 1143115 1398302 1410038 1144371 1148329 1044306 997436 972031 1006989 1166794 1250735
11609 1250735 1128611 1087818 1044318 942259 1012373 939778 870429 799199 1023590 1094892 1028585
11598 1028585 964469 902422 762743 612782 677791 1044595 1129995 1034710 738090 687273
11588 687273 826767 726400 1004668 1241595 1141968 1040028 794431 710519 888936 973254
11578 973254 1068809 1022464 893415 911181 1275564 1212622 959050 724038 512903 304114
11568 304114 312815 347319 358033 573213 732745 695615 900318 1085451 1009120 868269 684999
11557 684999 732002 906846 758429 560088 597971 708537 760172 693684 482364 440908
11547 440908 630896 710041 685263 356998 329940 265441 506106 783831 767829 685286 495256
11536 495256 308469 411098 552092 625515 514537 491011 580844 569454 378133 254293
11526 254293 240174 278569 462149 491853 371920 309934 339699 207050 255712 268401 183280
11515 183280 216435 230522 186777 323227 344825 356434 392791 430601 371777 285767 173775
11504 173775 302788 463226 720610 765448 666985 586419 422586 94979 40475 126000
11494 126000 -42671 169818 346430 154833 264689 253320 196786 235154 341044 240589
11484 240589 103245 88035 109336 151394 285683 381338 242904 139812 175617 106136 287549
11473 287549 425682 186871 143068 120360 150040 239684 176139 308110 373044 405389 190913
11462 190913 299466 420110 636736 615215 317799 215604 224522 328173 391114 302425
11452 302425 196285 173619 349372 521404 573888 492768 434259 755999 1043623 1308643
11442 1308643 1261590 1094507 1200733 1286715 1434118 1296066 1221544 1154689 1098820 1315501
11432 1315501 1339168 1172108 802743 754586 893242 617383 570523 484337 430910 220877
11422 220877 171001 391058 692220 659452 521465 470565 121848 21979 182101 179373 463449
11411 463449 315562 279689 257928 322323 426364 471118 426605 460751 355111 174124 18543
11400 18543 97002 282042 272633 308692 296754 406010 306548 561299 859063 924393 873034
11389 873034 929559 975505 1308727 1671889 1843985 1907203 1744791 1828755 1921405 1813751
11379 1813751 1782802 1670759 1909672 1857253 1604813 1261428 1231046 1225425 1049988 834817
11369 834817 637650 562881 561207 641969 396288 281251 173829 293051 457880 330269
11359 330269 350787 308208 94602 27425 285824 280866 111581 100256 218944 316171 349989
11348 349989 408201 457446 300317 519355 473022 321488 292124 385167 421960 307619 240951
11337 240951 415815 565951 508483 424943 447662 547122 620215 745460 940709 1275707
11327 1275707 1416575 1284647 1167526 1077751 1037425 957200 837594 994847 945211 700109
11317 700109 531747 452548 303593 198384 170888 224213 290972 395415 529768 512345
11307 512345 191915 152780 283488 204168 181603 11974 15353 102173 53242 -99832 -125751
11296 -125751 -102291 -57244 243995 378142 412606 439612 299991 377398 373075 111162 -6364
11285 -6364 -4717 105173 149062 233593 231851 137463 196727 14034 -130494 -228201 -90321
11274 -90321 84424 225280 97890 3908 139276 206703 427329 416931 193503 97007
11264 97007 -75268 -95941 -76716 -98624 -12757 131307 268454 159069 184218 412057 434701
11253 434701 235231 -59194 -12351 126040 143249 276877 388067 457620 409789 154884
11243 154884 92930 52470 47763 77262 212723 393399 453073 344779 234507 -1862 -184749
11232 -184749 -258157 -304513 -156861 -154275 -114857 -97235 -74293 -5284 -66877 185278 104278
11221 104278 -94343 -11010 224986 228925 250571 207434 303266 638786 639580 610762 393568
11210 393568 392620 300332 164354 132550 101425 130369 139238 -35754 -200690 -156133 -233863
11199 -233863 -168401 -51605 -49969 -25002 -281 -46042 -53676 -96829 -91778 -20639 107218 144358
11187 144358 199838 245165 149343 50099 -32489 -14200 -51387 -79361 -2112 109633 208204
11176 208204 102433 -109793 -240902 -345932 -251604 3095 155392 135705 238419 153118
11166 153118 146141 193921 200765 88913 159575 294875 238485 125438 313576 368887 436882
11155 436882 269259 -7234 -16675 154995 199299 -61708 -5793 91533 36453 -67147 -60711
11144 -60711 7859 -2765 -32998 -227361 -319089 -123770 -27431 -61893 -67536 -49260 15603
11133 15603 10533 -58924 -62684 220713 240694 45471 -71237 -279 72261 136645 154826
11122 154826 170602 236625 26650 -6729 107698 -18698 -230058 -64859 201598 202902
11112 202902 -59172 70357 135187 53401 119355 139678 181008 426822 399874 416267 261006
11101 261006 -66822 -19991 397202 581422 695026 321825 214611 386359 410558 257263
11091 257263 187468 160377 15106 -209514 -297362 -357006 -375540 -363577 -320559 -221528 -144602
11080 -144602 -157361 -112491 -128666 -220345 -63375 81753 96656 45573 96736 86152 12533
11069 12533 46132 58136 100764 -151174 -181825 -33421 -41710 -311834 -508485 -551048 -157217
11058 -157217 80342 321416 509724 637222 395315 239706 34456 -98646 -162683 -7461
11048 -7461 84063 -64093 -213209 -165663 -157838 -15605 103692 13832 -107991 -285130 -453706
11037 -453706 -540762 -300162 -127226 6949 236783 206611 270482 368783 160121 88454
11027 88454 195973 109125 32510 -12695 17063 20556 -9837 -35133 -148234 -389357 -258744
11016 -258744 -17136 94881 -16074 94315 164440 -5218 69087 277462 303666 359231
11006 359231 419451 225907 20424 -170086 -104028 -167736 -202619 -115888 65523 25318 -130785
10995 -130785 -255859 -203785 -246528 -106823 11028 79726 89514 -5963 117256 78758 61577
10984 61577 117805 87130 -30848 -102918 -207963 -174137 -62538 -2038 2838 -157739 -305654
10973 -305654 -293277 -6591 -60972 -207975 -239801 -166801 33608 -246186 -418548 -414452 -223336
10962 -223336 -232114 -294399 -297058 -241502 -130530 -54501 156647 295887 222933 202600 83204
10951 83204 -11138 100887 8721 100099 222763 297954 434600 294383 219193 254813 201572
10940 201572 48312 -22720 66869 198330 -21842 -46134 -6719 79916 65549 181875 327940
10929 327940 269632 171212 -15372 127009 197541 251843 346051 27012 32312 -13997 -124298
10918 -124298 -252953 -20087 224486 279996 132127 94143 305389 226428 86970 215611
10908 215611 382170 332785 324462 141056 262254 87581 -41612 -78347 -151268 -359306
10898 -359306 -467136 -252368 -1073 110731 28855 809 -51064 -25748 -104787 33472
10888 33472 176546 106011 -139766 111425 191787 30819 -112863 -194629 -124663 -40881 102713
10877 102713 96202 111024 22494 2198 142620 52469 64047 210192 364761 259967 -10330
10866 -10330 -112350 -46450 -44585 -45775 129802 233192 224024 101295 -92279 -4655 125409
10855 125409 173633 7500 -141593 -202051 -85498 -112508 30567 216838 -53385 -8931
10845 -8931 204913 -65842 -245531 -239453 -116741 -107838 148578 111908 73163 102065 197107
10834 197107 88290 -153687 -134212 17008 127053 43436 -161080 -248463 60622 210706
10824 210706 185909 101723 50589 201577 115044 77129 133757 142193 97645 150933 58847
10813 58847 223469 -13691 7236 116929 229438 412469 127842 -29002 -60212 -226555
10803 -226555 -170684 -120302 47612 -43719 -156992 -132290 55935 -63240 -268475 -409259
10793 -409259 -362628 -220867 13647 93081 139877 291681 366329 290401 107170 302688
10783 302688 382101 388777 358468 478393 545580 411372 39297 -109123 -119469 33658 122118
10772 122118 122662 179343 181650 133377 135992 -99180 -235582 -180059 -56676 46408 -36857
10761 -36857 -85549 49502 -23458 -213873 -111775 224432 357487 -42592 -148356 -69042
10751 -69042 174825 83233 -83122 100182 190096 31939 -110138 -66273 2359 -44285 -118742
10740 -118742 -152649 -127221 -174054 -268477 -119735 45336 -88563 -101196 -265401 -479793
10730 -479793 -530761 -316017 -162536 -28048 117626 112377 -223390 -303282 -113290 85936
10720 85936 43853 -8566 -106975 -103463 -67767 -73596 -37015 -100268 -89080 -189087 -188645 -3400
10708 -3400 -26724 -150276 -90281 231664 324063 95296 -43903 93891 -15575 -2307 -114190
10697 -114190 -132309 -73085 -171194 -374936 -404354 -357610 -301291 54817 15965 21408 148121
10686 148121 141352 -102179 21625 29616 59495 -22 -392952 -431537 -135122 293084 413492
10675 413492 142664 -225900 -298896 -311358 -156453 50070 203494 248926 401383 359708
10665 359708 251566 71362 17038 48544 -56628 -236883 -245344 -266632 -457636 -442580 -269719
10654 -269719 28895 123276 34273 119676 118971 23583 -69226 21135 178005 164082 51678
10643 51678 -170590 -57504 146112 200829 225992 376138 352158 451523 372014 410655 505623
10632 505623 168103 -124617 -170081 -89982 -197540 -423588 -459512 -382772 -312216 -278585 -219361
10621 -219361 -281736 -282551 -81370 -160402 -236617 -3002 25129 -113513 -97354 -25141 11397
10610 11397 -102306 -182537 -170148 -125910 -63052 48505 225292 315229 435773 263203 -135622
10599 -135622 -188641 -270247 -99904 -71040 -181858 -160172 40548 -24473 -172676 -32974
10589 -32974 -45711 -54774 748 -13627 15386 110642 -75069 20680 64730 184861 272667
10578 272667 307979 83134 102409 23211 -95100 -74934 17302 -132795 -195789 -210226 -151677
10567 -151677 -104170 30117 -20143 102599 -121895 -216982 -238438 -190853 -19776 84843
10557 84843 207014 197895 216523 1098 55102 336474 428137 386475 286336 118120 137745
10546 137745 248621 93820 -30369 78405 339826 390239 364725 112825 53448 224654
10536 224654 72850 -206453 -225105 -284225 -87811 30261 -262 6978 17586 109286 -49359
10525 -49359 45987 3345 -184106 19407 179829 137786 48931 -35177 -67639 -48559 162736
10514 162736 224696 52533 28285 -30406 -44301 -154885 -153226 -319949 -312776 -59192 -78012
10503 -78012 -328765 -359784 -353372 -202755 -128350 -35696 108247 -60877 -278138 -286929 -372437
10492 -372437 -308815 -272684 -436682 -475032 -182766 -59900 -64269 16707 8279 -8074 -116847
10481 -116847 -106141 -21585 -83811 -29288 -66875 -94822 5500 -4064 -104023 -151975 -118765
10470 -118765 -90831 -156729 -393643 -212738 -117666 -74130 -4899 -169369 -171491 -14093 35059
10459 35059 -50180 3613 265876 221788 -2988 -2159 7169 -86647 -114444 -39076 216784 130768
10447 130768 148133 -577 45782 21266 132894 29865 -84949 1646 78178 -129339
10437 -129339 -252881 -126683 2018 46406 -33441 -134019 -46405 100611 320831 334797
10427 334797 389726 386930 318638 130061 65384 352 134626 213461 188847 -154521 -197495
10416 -197495 -52405 55746 -152343 -264173 -200780 -125184 122131 119046 -57634 -311896
10406 -311896 -166687 -62871 -196129 -290562 -240566 -9202 -22936 -157753 -167843 -65529
10396 -65529 -182135 -178176 -82738 -94317 -212374 -126867 -85703 -68852 130523 64465 46572
10385 46572 -208743 -234207 -325752 -286882 -224049 -207187 58154 241094 66990 35024 -15822
10374 -15822 -78297 -117232 -3221 9737 -16940 58322 237677 151908 -113047 -298038 -313993
10363 -313993 -285350 -7696 229362 249691 53688 -56029 -15451 27344 -109173 -123557
10353 -123557 -52456 103462 -31361 -187085 -144682 -140503 -97976 -246670 -457615 -292524
10343 -292524 -221243 -48841 118917 -75933 -101310 -244402 -339137 -239150 -5127 -48628
10333 -48628 -39287 42223 8627 173179 -14936 59113 47746 -52716 -39793 -263566 -201292
10322 -201292 -67295 -92198 -99418 135663 99358 200479 375533 283894 398278 315110 336609
10311 336609 115347 23499 183987 160652 68690 -3837 2820 -92437 -89506 -49819 -45188 -76597
10299 -76597 -52821 -99904 -187204 -265185 -279698 -302177 -278809 -103596 -54070 10152 118046
10288 118046 171750 289682 37059 -171227 -65015 -223399 -103463 214240 235212 250216
10278 250216 541876 562917 444582 248047 22634 -47487 -208413 -187885 -9442 -151274
10268 -151274 -196457 -164221 18911 47967 237390 405014 402541 330372 230774 289284 333696
10257 333696 207514 202035 78193 189648 143529 140551 181321 94464 28980 14990 36468
10246 36468 113296 211941 485263 479912 315428 250237 235397 59246 -29359 -99638 -56227
10235 -56227 -119461 -123151 -171802 -194905 44187 31664 -21183 -85295 -58099 -50852 -17416 132017
10223 132017 244669 373136 539727 385619 200508 103594 126874 67663 46584 4424
10213 4424 25984 250284 157015 -74524 -269618 -240670 -93246 146169 160845 23217 -155347
10202 -155347 27383 165868 107032 -58074 -223831 -393730 -430811 -339147 108185 69891
10192 69891 -232356 -420897 -493592 -414336 -173291 -130687 -175245 -2188 99283 -38458
10182 -38458 -248358 -309052 -333130 -374790 -414453 -12917 111115 -148447 -121927 -6932 -220134
10171 -220134 -120109 -17951 -74697 14583 27367 158040 136808 -268429 -351490 -214321
10161 -214321 -142552 -35012 257002 410269 169076 -124670 -218332 -301895 -116957 37269
10151 37269 88169 182690 174893 72007 192160 99381 5928 40160 120112 -4995 17783
10140 17783 -76386 -190843 -193667 -145410 -259614 -244398 -246888 -362687 -256845 -296231 -232849
10129 -232849 -119571 -261213 -288124 -296488 -233825 -187566 -257929 -281616 -203043 -114213 -249424
10118 -249424 -240714 -216381 -446888 -346077 9873 134312 292303 59378 -290588 -378662
10108 -378662 -220463 -175740 112911 242089 342670 404097 178405 -37158 68164 234763
10098 234763 295797 224020 249890 165704 -82861 -133613 -181962 -13103 81822 113582 -1743
10087 -1743 34760 103938 143964 22777 -205476 -195187 -151059 -177044 -102722 44134 174704
10076 174704 181174 77355 -52629 95809 194060 225408 147734 112780 42405 80480 135802
10065 135802 118079 -146192 -308325 -178942 -156335 -383334 -270348 -83480 -40699 -87677
10055 -87677 -133536 -58744 72441 267562 95576 -127613 -246721 -148396 54486 161608
10045 161608 50312 -44751 -47447 87295 58834 -124965 -100497 -143486 -99488 -73705 -84458
10034 -84458 -99593 -126293 -128729 -156678 -254281 -119218 46176 20594 -72798 -112313 -135343
10023 -135343 -35093 -15838 -55950 14937 5163 -145926 -243720 -137510 -194604 45832 166368
10012 166368 -216701 -429359 -395201 -391656 -358179 -458901 -331623 -32877 46847 -36775 2426
10001 2426 -95213 -18666 149934 227642 463009 362605 207376 352808 296089 160277 4265
9990 4265 -224276 -279992 -370635 -350824 -351106 -373055 -251984 -242833 -503183 -242411 166395 329853
9978 329853 329250 207074 15962 -141950 8835 181697 190257 -19084 76360 19110 11716
9967 11716 52883 215580 164410 22817 -237831 -311206 -242121 -193907 -84022 467 223316
9956 223316 220438 1816 -131356 -192904 -258679 -226699 45198 154814 360007 329356 349977
9945 349977 195407 97403 163215 138214 145145 84840 8405 -12581 60703 147600 3662
9934 3662 -170102 -168538 -239860 -268701 -240128 -337811 -140809 168776 655 -270660 -273537
9923 -273537 21106 61263 109252 199871 259886 54367 -17419 88207 148979 126583 59961
9912 59961 242163 366347 289717 135876 70371 116501 129021 123072 -23083 72063 86502
9901 86502 119003 110237 -110 23727 96432 270719 337407 255227 269620 254801 220406 222700
9889 222700 148128 162054 256149 58343 55855 182353 77576 -70053 -230800 -124792 158409
9878 158409 278665 256291 273751 252200 161617 252544 232057 196446 -57031 -424 31251
9867 31251 445 -30813 103217 291601 374580 338171 186377 191531 314316 280306 250001
9856 250001 258890 186811 113735 88384 72965 85173 32000 -113562 -118124 -113945 36742 155475
9844 155475 314323 321201 280947 308727 192636 17477 153117 250286 162105 122947 72887
9833 72887 1403 61245 113938 124278 337179 196812 247620 172278 128725 46371 -34070
9822 -34070 107260 84666 -101112 71557 301574 402533 352023 116138 180153 283422
9812 283422 442358 485960 429280 324148 210945 37057 -193266 -285698 -339915 -272554 -25299
9801 -25299 95163 311135 341464 235019 213994 160141 147125 326934 249272 85547 222922
9790 222922 186151 149338 -63131 -116555 2888 139655 -49886 85353 161446 -40007
9780 -40007 -68333 -98416 61237 206220 90683 -167334 -250783 -152795 -6539 -202026 -142823
9769 -142823 -1050 227222 296211 175200 -114116 -261691 -56803 97760 -99909 -144247
9759 -144247 -230727 -353264 -305934 -185792 -190693 -168467 7120 125644 175511 43609 -103079
9748 -103079 -146500 830 -16880 -190108 61714 214794 187319 61423 196 -234591
9738 -234591 -267164 -62376 -10396 -174840 -180041 -186878 -164029 -97932 -61637 -113330 -103675 62602
9726 62602 200369 312583 176974 10880 -34487 -104564 -61579 3476 -11122 -40730 -76035
9715 -76035 -140917 -89191 -155150 -390601 -427145 -54408 131358 130704 -3153 -59605 -149798
9704 -149798 -273480 -132986 52033 -215790 -296328 -57402 81499 74397 107594 222197
9694 222197 149394 116615 -74420 -148462 -24630 108647 61762 59468 -73694 -294580 -392280
9683 -392280 -469101 -224034 -60005 -26279 -29983 -36314 -107328 31037 189743 133954 109037
9672 109037 29506 16563 211082 201552 122086 34210 72140 221744 282950 118034 -94433
9661 -94433 -102288 -35806 29672 193075 221627 327467 247472 184171 365973 270829 240982
9650 240982 53747 187180 107100 -7164 31046 99842 45030 3738 -80540 -139084 -112059
9639 -112059 185273 209356 146737 251017 305554 211662 163757 43191 42167 91959 -54532
9628 -54532 -17119 -25700 -9363 4465 42834 -70188 -266928 -55739 49029 174458 -15503
9617 -15503 -300179 -196324 -200538 -160817 -63420 -20007 64901 65157 53793 -27274 54479 46258
9605 46258 87115 116815 232418 151284 -130995 -509306 -635652 -406349 -99147 96496
9595 96496 180206 116418 -15244 -234156 -309664 -84018 96571 162995 118270 -1035 132585
9584 132585 167597 16830 -66792 -23221 67936 -32010 -17231 91347 237878 39771 -169793
9573 -169793 -67651 -168035 -345306 -199997 127522 326241 388982 362645 148662 184916
9563 184916 217249 311 -223904 -246829 -241220 -101940 -151683 -337668 -474790 -242732 -115655
9552 -115655 -36375 -92750 -212729 -431433 -497316 -314457 -236390 -110448 58675 60022 -43723
9541 -43723 -126485 -25743 17307 156537 206742 -30417 -80099 -57740 -178649 -165038 -321661
9530 -321661 -68523 110253 321895 195509 237515 277816 24508 -230211 -358205 -281343
9520 -281343 -277587 -127602 164133 271919 216094 81708 14245 170823 249265 -77819 -249121
9509 -249121 62582 235061 143761 48895 -89388 76910 298840 301351 268054 143596 22522
9498 22522 110183 209861 104799 -44061 -90952 -83154 220955 305338 -2269 -257442 -456353
9487 -456353 -496377 -238304 -104272 -334396 -311345 -17469 77137 -64030 -55404 47322 -134418
9476 -134418 -7972 -54056 21869 -10257 65422 247277 272410 218173 130995 104591 -1193
9465 -1193 -86114 -98942 -67176 -118707 -145017 -246460 -383264 -590506 -381492 -243205 -174612
9454 -174612 -202916 -42623 158840 8719 -90798 -129086 -205873 -194261 -71197 22722 123875
9443 123875 37601 52982 70673 57424 35977 27958 -109049 124602 288429 218885 141766
9432 141766 184307 53088 193904 137522 55394 177283 255269 123958 108706 97806 135178
9421 135178 15130 4018 128932 58838 -86980 -99104 -35289 7975 321649 86938 -80802
9410 -80802 8810 210118 207335 -39066 -94577 -18988 -286548 -323028 -126011 215018 346554
9399 346554 72147 -83623 -29726 -35460 3458 334904 425169 518300 512617 394523 63964
9388 63964 83135 190664 239050 150702 60511 153729 240184 87085 -19409 -123123 -317744
9377 -317744 -180566 -224098 -305050 -203144 168266 283510 220120 185963 308241 139032
9367 139032 98153 165021 180238 233407 87860 115677 56224 131988 114429 248351 385410
9356 385410 215640 88629 123085 2916 7540 -43077 -140783 -121980 127556 189140 260111
9345 260111 260466 -58244 -135167 -239514 -236600 80758 292382 351989 236467 -16220 125367
9334 125367 80339 80889 283263 269720 217798 100570 188465 394595 468069 389438 295990
9323 295990 40154 175236 59626 -3104 229972 221021 226042 342319 94743 -259155 -635401
9312 -635401 -393443 -163768 -106999 -86819 -122331 18421 -16722 -26263 -45394 34262 -113589
9301 -113589 -267381 -267042 -204898 37349 -84450 -204512 -224158 91605 224103 146525 -8294
9290 -8294 146457 53530 1257 121326 24223 -222660 -200819 -50325 77860 164745 81052
9279 81052 -58898 157841 137057 203441 121993 167179 266892 444010 544071 655096 516131
9268 516131 546435 627388 365532 67112 -145206 -128074 -143515 3009 90228 141889 156936
9257 156936 229551 222157 56642 52052 103075 178554 186032 110977 216268 337564 497750
9246 497750 490147 357554 99447 162928 176818 190304 133612 -2093 -194941 -245971 -159032
9235 -159032 -24658 -16695 -78015 -103384 26069 -14069 -66426 -163889 9456 207370 -11772
9224 -11772 188656 305963 213557 82689 61704 149201 363909 422264 464307 306883 67930
9213 67930 -157367 -123323 -259857 -224207 -3261 217998 380614 418079 557131 777862
9203 777862 641921 384859 267091 204272 297329 306879 183643 284147 44002 39736 250678
9192 250678 346949 34847 53170 263849 165406 231923 299132 67175 -63689 -16437 58848
9181 58848 44165 -14226 102 121316 -52216 -121631 9462 -179812 -156124 10940 -33895
9170 -33895 -61919 126646 13939 134861 176713 214623 6314 -157997 -266852 -51735
9160 -51735 220420 189538 304843 344518 258878 206100 207671 193564 248486 319728 325315 345713
9148 345713 333818 228089 298874 281610 131401 429478 501681 551434 465229 548963 381583
9137 381583 283392 403794 484971 675442 505271 332411 195221 363709 448704 538585
9127 538585 603336 560884 677792 904496 974483 904028 885538 889799 743449 662184 679749
9116 679749 800610 833507 931594 1044234 1129526 1153388 1186066 1293492 1440953 1486464 1692631
9105 1692631 1736666 1975941 2236928 2464233 2601877 2736519 2908429 3278331 3752270 4318959
9095 4318959 4764742 5345657 6040685 6780210 8058101 9542137 11196148 13245814 15881502
9086 15881502 19215551 23564143 28603085 33962923 39108522 43211221 46106324 47453979
9078 47453979 47418738 45934258 43365926 39641897 35233715 30661310 26577881 23013535
9070 23013535 20110660 17684835 15741866 14048567 12531184 11415160 10470329 9468020
9062 9468020 8656576 8259193 7756349 7028024 6419709 6025649 5789080 5578682 5184138 4847084
9052 4847084 4628429 4398271 4390200 4060409 3812995 3615383 3526695 3368525 3026276 3050001
9042 3050001 2895938 2873771 2901241 2732011 2779493 2544091 2281895 2101299 2066239 1941846
9032 1941846 2068355 1846452 1608273 1462625 1393019 1254602 1183782 1208541 1424424 1460617
9022 1460617 1400366 1272948 1189817 1087952 995072 1149632 1114450 1042926 960739 1085405 1115181
9011 1115181 839955 672105 394279 340421 532092 577999 773718 935260 774509 729619
9001 729619 502642 671923 852253 870301 714848 658916 802448 819557 787981 754780 584707
8990 584707 331649 341043 423538 483730 448365 498906 677253 446692 411248 412994 341705
8979 341705 435732 477612 541649 703093 451632 418733 511990 261655 206811 376344 311105
8968 311105 324642 296447 54307 -71959 -138864 -106944 -76057 -30322 -81868 -26209 95380
8957 95380 170144 43742 3002 -105963 -170430 -38079 128648 113835 290954 178573 370685
8946 370685 389290 281894 235561 -4234 -96863 -59012 131415 188816 329516 244251 -158906
8935 -158906 -286469 100191 226133 112453 -131528 -247618 -86747 76870 50151 -177564
8925 -177564 -10700 -56262 -30296 40525 156565 197251 92427 169035 212095 56944 134310
8914 134310 127884 -49342 75595 180411 89263 48064 140841 420656 289194 360456 276948
8903 276948 141104 28471 24289 232179 263660 45166 -183417 -118608 -73539 -73488 -3915
8892 -3915 40815 217011 59549 -131358 -55932 137410 179065 181483 189861 -129193 -294049
8881 -294049 -6215 165247 81943 -41258 -23499 143049 82483 30538 23627 59682 -88526
8870 -88526 -145655 155370 442266 352299 62631 40265 33483 -117039 -289525 -50066 46151
8859 46151 9268 -35200 -211637 -217477 -160697 -44389 18477 94978 120819 231487 178783
8848 178783 161798 -88472 -3708 327417 460722 343202 156452 221174 243986 258921 277269
8837 277269 209054 -13956 -76379 -288372 -417837 -126380 42746 -52053 -59098 -68894 34821
8826 34821 -120180 -126472 27916 7826 -110903 -50224 183770 208852 126797 -59756 -30211
8815 -30211 -60545 -69904 -55782 93168 46563 114605 62807 136758 69782 65471 114707 45930
8803 45930 -20217 -144469 -105237 -230953 -271166 -66099 161095 158432 271860 128121 -79463
8792 -79463 10773 222857 39000 -195968 -113526 114750 142404 -5584 -151146 -226280 -189633
8781 -189633 -352931 -194283 -65120 38458 136167 126151 162366 241089 304311 174587 -3831
8770 -3831 -173241 -150399 -39391 -30605 -3743 254599 343900 141747 312812 403685 176810
8759 176810 21895 -67745 -103203 -946 108536 -57470 -154370 -226872 -207704 -94386 -34717
8748 -34717 47540 169691 48655 -21647 29570 -422870 -397992 -9694 25889 71099 251790
8737 251790 1811 -85527 -158732 -90227 -172491 -289629 -339422 -207623 -174440 -188414 -179330
8726 -179330 -18764 41290 -211433 -288383 -80353 -55370 -32121 -24843 -141016 -169739 -65245
8715 -65245 -59749 -139845 -96470 -45143 49766 80548 687 1740 -259827 -295279 -311362 -264530
8703 -264530 -244611 -129478 294875 380337 494140 420570 493363 435494 219217 110656 113612
8692 113612 65730 -55900 -10143 366880 449599 310917 344690 445891 457489 140471 41607
8681 41607 332245 518280 431426 454270 356809 104807 -84109 -120092 18391 -24529 -29032
8670 -29032 48290 -157459 82680 -1538 -154664 -232980 -313017 -151260 61571 171829 318065
8659 318065 586001 563548 226304 110312 200452 154977 135243 327457 205744 202376 177023
8648 177023 150564 115603 -28733 50102 199645 -73533 -199015 -195182 -16448 110819 214379
8637 214379 294524 215580 148430 350792 478317 338530 207276 -83478 -371939 -495876
8627 -495876 -548870 -314977 -165789 -121999 -111629 -115331 -62667 -10073 -103318 106128 238808
8616 238808 112765 31537 -22416 52301 233607 325394 539927 526676 427685 221547 77400
8605 77400 60885 188928 360218 256381 194250 381286 445515 409343 315340 317151 398353
8594 398353 391527 357483 270307 201073 242796 178568 292692 329581 136420 54189 -43886
8583 -43886 -118705 136575 118133 49108 84126 125361 171827 89564 -109868 43195 194888
8572 194888 210289 210824 258668 205856 12275 -46677 -73360 -114233 -227018 -193505 -95857 -60764
8560 -60764 -86032 -126304 -56904 -73282 -44257 -154331 -137039 -70055 -142730 -81968 -66743 174261
8548 174261 75568 -53211 -128692 -43900 -85746 -173312 -261058 -210311 -260976 -20327 8205
8537 8205 -10476 -25683 64980 185992 204596 229004 90149 -60555 -54725 101434 67751
8526 67751 -260490 -625610 -589323 -396789 -123471 190985 226734 230175 151053 138605 4582
8515 4582 -18372 -128953 -252386 -240678 -110540 90907 263553 315820 324397 335958 405712
8504 405712 234255 189614 115155 203918 247451 170148 120130 302710 231147 29861 -51303
8493 -51303 12714 19543 125098 -105439 -184671 -34255 47438 213241 262029 159574 -1501
8482 -1501 -58933 -96762 -100460 -128450 149971 329291 264673 113074 73280 59535 116169 184474
8470 184474 151439 -55812 -66280 -24530 -222024 -374039 -296928 20022 44512 9433 214604
8459 214604 178319 111276 272218 359145 214218 108532 31448 -26983 55652 133597 192772
8448 192772 201812 78642 9330 98118 137349 14926 -161157 -151567 -97206 -137614 -81366
8437 -81366 -35841 -30059 87443 110835 99121 53625 169428 77397 65975 -1238 -209710
8426 -209710 -224490 -187744 -466868 -320935 -86348 34455 -62645 16951 113979 91267 74494
8415 74494 -22397 -32214 124385 164166 20761 126607 143252 -40450 -182068 -63107 -112270
8404 -112270 51764 226911 231452 221116 245504 235769 -99385 -333309 -259161 -79823 -154637
8393 -154637 37954 372553 465579 369422 404747 242258 13680 56152 88884 -124128 -199834
8382 -199834 10126 193201 -88554 -58689 19842 1411 18695 -21636 -126375 -119822 -139836
8371 -139836 1236 197923 86072 68070 -79955 -89861 -41411 12338 -89711 -220658 -248363
8360 -248363 -35143 76699 -41025 -134418 -215539 -130748 -66692 17110 -82631 -105569 -71885
8349 -71885 59567 246576 149595 108764 188055 124849 16318 -137156 -95476 36513 141106
8338 141106 206929 181270 120395 98015 24097 -13367 156979 91473 -149688 -219890 -174794
8327 -174794 -356613 -355133 -196145 39987 106350 109445 167578 -31218 -123884 24167 237990
8316 237990 183049 120697 -96156 -192134 -66912 2112 -79539 -70190 -16489 45306 -184480
8305 -184480 -349188 -343415 -168629 -8140 -87501 -131333 -1717 47956 204736 381645 467393
8294 467393 556918 575354 603364 348869 96484 23055 -174896 -65557 -18373 -214097 -28108
8283 -28108 265460 349461 399861 305016 52127 3865 -78098 38278 187055 32643 -22814
8272 -22814 10302 -92735 -69174 -96020 -122588 -266802 -382732 -435936 -354107 8373 -2940
8261 -2940 -104522 -72730 -233769 -300250 -194605 -131904 -90577 -73681 -80492 -214803 -258525
8250 -258525 -251439 -74175 56217 162600 187322 570 -245138 -306327 -342007 -290771 -236232
8239 -236232 -78303 100435 -34207 -215740 -310544 -105256 73855 35 -65994 -101792
8229 -101792 89400 163166 208098 207837 309849 101725 29927 13425 -161976 -141313 26424
8218 26424 64846 4813 145343 203714 139427 32006 169159 29003 -54016 68240 104679
8207 104679 51753 109877 200700 180135 316533 475049 267070 250143 211627 85335 8280
8196 8280 36765 52211 -57599 -274385 -181600 33898 178542 109075 45688 102383 117236
8185 117236 112863 5949 -53243 -19263 79498 131161 128123 174495 133654 80183 309532 348175
8173 348175 328579 326796 117093 96345 316533 282189 48848 -297008 -99919 18046 124701
8162 124701 191975 222143 -41357 -165479 -70459 -129301 59509 104551 173237 226790 -138566
8151 -138566 -225822 32541 -4681 -169888 -44371 148378 16083 160845 399475 532758
8141 532758 563878 524963 388076 382036 262635 207964 45894 -80136 5216 118848 190477
8130 190477 209211 -30795 -413009 -451035 -434114 -204402 -182942 -158084 -66263 -82402 -77345
8119 -77345 177573 97935 -168205 -331191 -139188 2830 30578 -41821 -25771 1211 5499
8108 5499 -157905 -247234 -183988 -38579 123621 249864 184505 292957 315384 222960 240916
8097 240916 215552 386649 35625 -183605 -260022 -139388 -174077 -298046 -194740 -155445
8087 -155445 8672 -15799 -68574 -103149 -266821 -193150 -203323 -406525 -257740 -7499 -130004
8076 -130004 -253384 -371576 -477175 -402228 -272626 86531 161162 -49099 227100 505100
8066 505100 294816 123521 84047 216968 176056 79632 16957 65439 -28031 -22977 116214
8055 116214 216205 377319 253266 98169 -15337 -134130 -157550 267981 385566 211749
8045 211749 109943 91068 82020 -42002 -26196 97164 -15201 4177 -61045 51463 65723
8034 65723 -12209 55680 187693 161738 -29539 51181 -24712 -185134 -342791 -220975 -99509
8023 -99509 -119874 91456 182369 176409 295268 453504 520302 409089 319619 360180 162217
8012 162217 11216 71241 1706 78232 56309 -36426 195564 24497 -279684 -338199 -327660
8001 -327660 -133398 148309 83968 70433 38705 -2444 60647 7733 61973 10545 -10051
7990 -10051 -131212 -196410 -128664 -45725 -151363 -61339 164060 127379 -58261 -54737 -229330
7979 -229330 -242802 -228307 -279578 -165102 42192 279686 376009 476249 571936 501040 380299
7968 380299 277652 476018 388108 375281 413376 459842 372486 123598 57884 200934 222045
7957 222045 265886 336424 280528 85693 93366 39155 259571 369286 328047 319850 286038
7946 286038 439049 330541 298503 385427 231731 159545 197650 327927 310412 95049 20361
7935 20361 142951 312616 212676 308537 321695 419378 374952 207032 -7493 219691 390872
7924 390872 340300 194794 164914 125491 162788 164339 45543 -25751 -79976 2208 57725
7913 57725 148539 221446 221357 309637 153761 176209 109157 170650 165221 222388 337855 212574
7901 212574 264364 213351 189569 112816 118704 157525 168787 143234 129953 9417 93952 -43041
7889 -43041 -14296 20493 174048 124787 -102956 -224062 -175871 7385 -39998 -165614 -183367
7878 -183367 -112827 -222373 -184048 9990 199360 299998 205311 134029 197635 142504 90786
7867 90786 183473 226766 -41780 -183279 -66934 70481 165000 113255 99899 42717 -63149
7856 -63149 -145321 -20838 18158 85628 218590 277037 264671 284767 44660 274029 221478
7845 221478 -108247 -250877 -196954 -85780 20863 99087 41320 69010 76741 10470 111133
7834 111133 69897 233648 313714 150547 72988 76148 -106453 -204406 -86096 90902 106140
7823 106140 -46424 -59075 82320 116755 152502 -41376 5279 97248 54993 -14062 122851
7812 122851 118412 110916 19149 60783 115626 105920 256583 131155 -35489 -223807 -58340
7801 -58340 -45716 2988 43442 23122 -112428 -148954 -49003 -15485 22467 36985 13114 -159761
7789 -159761 -148964 286131 371435 242125 237666 222833 205677 25322 55245 187438 264327
7778 264327 176880 52088 -117513 -156846 -121417 -275009 -370052 -437633 -282291 -303317 -57491
7767 -57491 252961 114995 52714 105358 231944 319585 269292 184671 163894 99008 193927
7756 193927 113743 -110343 -113434 -68899 134670 233021 142770 154660 87102 -161896 -181018
7745 -181018 -150889 -222092 -101671 -44727 -53771 28821 140941 168932 127548 -11373 -152414
7734 -152414 -60532 -289814 -222315 -144309 -199938 -419253 -503108 -377219 -105342 -173512 -212948
7723 -212948 -388000 -441310 -313724 -73517 140918 161600 166674 191846 35332 -54811 30906
7712 30906 -206339 -290792 -325465 -401433 -279899 -215644 -279820 -236794 -40317 117127 14097
7701 14097 -20788 187292 214154 152116 252758 131855 11931 -32106 -62769 -56064 -141948
7690 -141948 -131979 116323 403781 451774 320703 147406 277661 181732 147055 -86323 -257594
7679 -257594 -233284 13740 -10858 -13336 23815 -72857 14092 -52721 8279 163545 115715
7668 115715 62305 -22560 69070 29616 -199406 -358947 -221074 -62655 5940 53937 -51463
7657 -51463 -103511 40847 -14583 11509 30773 24756 -11032 15220 -204695 -314216 -308789 -343481
7645 -343481 -225364 -185330 -202191 -133511 -185401 -44538 -122014 -272481 -212027 -371195 -285755
7634 -285755 -139300 -143684 -168017 9019 133501 87574 97127 72463 -65867 -258182 -381588
7623 -381588 -400853 -273668 -229399 -50792 141798 233906 69086 -33521 -47056 -67414 -40718
7612 -40718 39726 144940 124963 94725 76339 -94585 -138142 33247 106762 37812 151079
7601 151079 278459 286525 207668 -160034 -117185 -122544 -197973 -19333 144524 168923 228682
7590 228682 57130 43294 56375 134128 44845 -63509 95119 64552 -160187 -199304 91878
7579 91878 -72814 -284228 -213662 -51872 -7889 -51301 -225513 -327630 -290208 -262938 -312447
7568 -312447 -434162 -311455 -197132 -21465 57088 -171046 -303140 -379169 -386432 -249799
7558 -249799 -136403 -45189 -118757 -330103 -329489 -179775 13329 196754 80318 -71267 -68882
7547 -68882 232746 75569 -184385 -223483 -48209 -256577 -424975 -291669 -78699 -102656
7537 -102656 -129037 113652 147478 41191 -80919 -581 -10477 -9789 47419 38279 -188264 -352146
7525 -352146 -330831 -293882 -273047 -130648 -65185 -92954 -161976 -514891 -482031 -345557 -260136
7514 -260136 -266071 -183861 -118336 -38492 53834 125723 237089 109169 -117229 -231301 -246710
7503 -246710 -352736 -247239 -274803 -242487 -27425 -87137 -158480 -73087 -12318 -45256 -60811
7492 -60811 -97736 -202902 -221319 -33106 271946 112344 -33108 -11701 55422 8071 15433
7481 15433 -157365 -274354 -322081 -238262 -299863 -337028 -406928 -273724 -252538 -293952 -403
7470 -403 54240 114078 155846 -64140 -75371 -68678 -88872 -9520 -66058 -50886 106145 -108902
7458 -108902 -200687 -79419 137286 280494 354335 293849 72024 29193 79267 168398 193229
7447 193229 127673 -49322 -24312 -22306 -20792 35117 10722 240405 253197 -63151 -47238
7436 -47238 166593 223422 154962 206065 229843 349628 486980 528178 361404 148891 236356
7425 236356 136795 -82086 -107693 -180872 -13689 97100 145066 124449 309130 161901 45471
7414 45471 169093 321679 280130 248475 112117 105459 336188 271789 167822 243243 261825
7403 261825 134429 88792 197591 367582 284507 323807 211069 237081 73473 -31439
7393 -31439 27250 -92913 -596092 -447446 -317755 -367614 -357412 -341264 -148205 -172092 -53257
7382 -53257 -65311 18799 -157682 72446 302352 164876 303952 360934 251174 442807
7372 442807 305564 92505 -159355 36492 9597 -90596 191157 15050 -385856 -536610
7362 -536610 -538935 -304817 -50464 -119935 -125778 -47656 169254 45687 -240598 -425512 -461037
7351 -461037 -316743 -277885 -377086 -104301 -13927 -92666 -81070 45731 86641 43351 -68055
7340 -68055 -76759 32736 50398 -86681 -102357 -140496 -118772 -201724 -167282 -174159 -138217 60281
7328 60281 127916 6633 62282 -50580 -159481 143466 234009 126292 3167 -140473
7318 -140473 -249234 -178440 -158996 -34366 -126529 -99502 -157913 -215990 77408 256108 174449
7307 174449 191071 -125966 -330902 -99282 45299 291294 440464 459595 384105 258411
7297 258411 409338 435833 255502 121044 175849 20579 -41272 -143881 -297093 -59434
7287 -59434 -56358 -28213 -231083 -345967 -297961 -51739 64418 -42787 -81597 33648 71596
7276 71596 35314 -43284 -164381 -179703 -132476 -183982 -55815 -77317 -90318 -98276 -117107 -157036
7264 -157036 17269 -51369 -66870 -178628 -124861 -69691 -393556 -453277 -387674 -193866 -340819
7253 -340819 -381456 -425562 -378366 -272181 -205617 -294272 -299966 -266011 -31697 65394 33247
7242 33247 42944 -45966 -58934 -134434 -20416 97557 84821 129104 -51210 -47795 81078
7231 81078 117788 -62982 -217440 -127092 -12194 48491 7580 -218917 -301921 -351891 -358116
7220 -358116 -297456 -236414 -306330 -475663 -258745 -41154 -122892 -162902 -125637 65424 324386
7209 324386 100916 53249 17351 7497 -86515 -81652 -37526 -54680 -165333 -129266 -162931 -225129
7197 -225129 -233375 -135147 -108869 -205390 -53406 219895 16645 -109395 -1477 -127967 -193292
7186 -193292 -187800 -139696 -184047 -165001 -171946 -193803 -238306 -341291 -308676 -202025 -144085 -167314
7174 -167314 -58536 -14785 27920 37411 -81080 -170508 -266714 -231415 -240978 -239045 -245145 -203147
7162 -203147 -160427 -218973 -118652 -78716 -192704 -138664 -94208 61757 -20556 83594 46132
7151 46132 58924 -59375 -112066 52853 55832 -22702 2201 142166 214852 106562 84779
7140 84779 61478 -18339 70434 76230 -53339 -184503 -169790 -194954 -235726 -92092 240407
7129 240407 40008 -264747 -307014 -293461 -238504 -58424 -163063 -243221 -325278 -291237 -111419
7118 -111419 -99186 -37592 -2525 -175846 -250845 -175864 -52199 -65071 -54105 -61745 43035
7107 43035 1677 -71885 -127494 45187 214382 10670 18011 298359 372906 212747 189775
7096 189775 75242 35331 -144714 11673 31462 123085 -19052 -46235 73904 5256 76760
7085 76760 250270 142673 206915 195039 74950 4426 -148615 32108 127664 47387 -107776
7074 -107776 -22539 -186671 -344345 -360621 -331760 -287282 -9521 55259 58527 300430 328518
7063 328518 76164 34497 92150 -30528 -35196 24916 164701 135925 -100207 -137572 -16565
7052 -16565 -94304 -246897 -37334 214915 217157 89711 -26686 -131897 -194903 -211833 -197266
7041 -197266 -159896 -20226 119966 100213 -2545 30256 -65798 -152294 -135009 -190360 -225226
7030 -225226 -63559 160926 235774 66715 -158477 -288672 -185198 97804 268804 414246
7020 414246 259757 47224 281338 207459 169878 174960 160246 160623 259289 95602 -52819
7009 -52819 35401 191664 258680 78953 38931 -208814 -42291 261531 200301 77819 -12224
6998 -12224 -68122 -84179 -208962 -179577 -78100 183880 147651 -136197 -320102 -226046 -74014
6987 -74014 -8074 -125049 -329484 -271123 -67235 -164075 -176109 -177702 -92084 -4351 -148770
6976 -148770 -62083 118307 29149 16137 24973 281153 357967 171882 -3824 -50710 -61120
6965 -61120 -166521 -113864 14857 36093 187075 17524 -67247 -53084 42375 128349 161575
6954 161575 285835 457622 548616 361475 223261 28546 -75234 -88182 81911 156968
6944 156968 115932 -134352 -189388 4324 15595 38629 372558 505199 554242 472653 164319
6933 164319 50437 -111051 -247218 -179988 -10575 215400 208514 125241 47618 -295869 -383757
6922 -383757 -166186 -37670 -113581 -129503 -160641 -50748 93886 55788 8641 -14469 -139427
6911 -139427 -174554 -108287 43380 -31245 -135074 -90713 -124193 -160465 -148914 -120757 41699
6900 41699 36652 -124245 -222681 -147309 -27318 162726 226766 145622 30904 19901 -194734
6889 -194734 -316413 -121631 33319 152801 35465 -173605 -30915 103346 172579 252457
6879 252457 169658 168879 270970 130538 79103 224417 305662 89763 -74896 -78204 -99331
6868 -99331 88282 350211 435074 454021 138833 -81397 -20329 -107641 -59633 -101089 -113390
6857 -113390 19237 243621 246462 203582 150997 36797 -70326 -126150 -248752 -399061 -291347
6846 -291347 -194091 -107284 -16024 -141497 -228959 -216558 -197303 -166523 -202699 -240364 -117868
6835 -117868 -229150 -163316 36713 140689 47894 -114967 -305544 -145605 -31752 60176
6825 60176 -8815 -135975 -262587 -191137 -305299 -319176 -214736 -262244 -330255 -277678 -230634
6814 -230634 -171433 -174327 88385 117370 -29966 -211346 -235435 88923 176950 -91112 -71247
6803 -71247 -220352 -334747 -368392 -92718 316474 255609 71109 -124769 -297007 -225612
6793 -225612 -174264 44344 43018 -127818 -355147 -407925 -296883 -350262 -310845 -257792 -145721
6782 -145721 -118134 -185663 -304946 -175266 -64294 17197 -85122 -293772 -383726 -267915
6772 -267915 -97370 100839 210946 79274 91402 76501 -163094 -158642 -152698 -123166 -185185
6761 -185185 -322126 -259647 -24487 -103449 -205037 -245436 -223646 -99469 -106104 32190 -120023
6750 -120023 -423376 -549675 -317498 13343 101507 158872 145307 -214199 -191347 -61839
6740 -61839 -32600 58893 -53929 149839 212043 192582 337916 245151 -144384 -267988 -221087
6729 -221087 -70792 39320 -160327 -286737 -227727 -167819 -32604 -11840 -35098 -98925 -212940
6718 -212940 -216274 -153775 121110 75722 -43124 49098 149834 166303 138365 76169 86061
6707 86061 207219 327104 319212 152793 56597 33737 163900 -24299 -285484 -232575 -3691
6696 -3691 98162 227721 229563 346668 173723 131958 134921 86557 -123875 -394741 -332831
6685 -332831 -181713 61261 115052 147189 164353 246181 308527 199742 131834 219860 117516
6674 117516 75393 121882 148636 166096 343035 416271 138709 -98039 -66489 -96822 -191242
6663 -191242 -98145 -102713 93544 79943 88817 253019 217493 59249 84634 4085 -54213
6652 -54213 -357662 -375202 -183583 -100771 -116296 -51884 -72252 -132344 -178043 -206646 -257876
6641 -257876 -305804 -398784 -240861 164290 226837 145181 62881 78592 202176 175650 29835
6630 29835 -225630 -109119 15300 35614 -270883 -259169 -82985 -143071 -24925 124397
6620 124397 84796 66409 39873 213183 242449 57575 -113316 -104432 102941 86800 22303
6609 22303 -35146 -215972 -219591 -203323 49673 78294 143331 -19451 -72420 -38970 62144
6598 62144 -24369 -70620 118092 214889 145536 187415 -79778 -174984 -314502 -477214 -335766
6587 -335766 -95174 39826 57424 94553 162268 225118 105689 68807 157314 368179 446175
6576 446175 419265 332579 73068 42501 251251 357464 250591 160060 99674 -47176 -215119
6565 -215119 -227973 -265550 -463740 -363609 -293156 -362818 -206046 -155642 -3419 115826 171849
6554 171849 332245 276043 83537 -82873 -188645 -144021 -39461 66136 119568 -33250
6544 -33250 -248067 -320886 -133574 95736 231595 437943 357128 404190 282839 36248
6534 36248 -1096 25535 74995 -82596 -190923 -112108 -131348 -126062 -116487 -188745 -219525 -188495
6522 -188495 25950 235070 285600 8375 208809 283196 33483 -215444 -207762 73002
6512 73002 169682 -72513 -233197 -336589 -127313 -139168 -173386 90799 183288 -32929 20139
6501 20139 -28702 -216449 -297259 -139540 -240316 -253907 -303014 -221795 -267380 -212161 -294300
6490 -294300 -452839 -362889 -445658 -494367 -441808 -347582 -134263 -28958 -4675 -35199 -273075
6479 -273075 -392061 -240224 -264316 -317750 -236470 -236397 -197005 -103415 234172 335804 98754
6468 98754 -60323 -29714 93211 -39615 -143547 -101239 -43930 -192223 -116714 -183286 -189300
6457 -189300 -189780 -216050 -117398 -106734 -122408 21065 104098 40015 13750 -99108 34236
6446 34236 117636 173533 167793 195225 67730 -48323 101627 483280 516432 181063 168100
6435 168100 174375 -41845 -159355 -178115 -85098 -140195 5389 -85713 -124845 -261277 -355541
6424 -355541 -227162 -148818 182455 171199 167310 58638 87466 193853 158070 52959 228561
6413 228561 431714 275523 71415 71539 166192 124871 123766 221397 144131 -138692 -324001
6402 -324001 -284282 -253554 -85791 -37131 54982 154603 225775 70542 -32309 -53453 6103
6391 6103 91827 271948 312399 83198 -44213 -166836 -214805 -28086 104916 449 49687
6380 49687 120361 105769 107215 -122278 -165039 -120164 -187189 -55248 85715 204183 124273
6369 124273 106751 -68166 -192039 -237768 -289961 -151728 44972 137476 202604 216731 314417
6358 314417 173869 140774 12296 -12300 50218 -66380 -234206 -265352 -73628 95920
6348 95920 157048 -930 -391292 -320258 -166457 -46381 -55334 -217037 -368460 -200188 34840
6337 34840 394036 493080 428157 302664 110581 18194 36713 269817 298956 100799 211716
6326 211716 138479 -24076 -95561 -62333 -29747 -41864 13923 -58742 -258415 -202635 -211360
6315 -211360 -61264 -121909 89044 35782 -79630 -38810 -47568 -134704 -240056 -194585 -187957
6304 -187957 -192676 -291388 -469646 -309726 -84676 49224 6235 -104678 -263847 -118934
6294 -118934 160718 114464 4269 86315 8699 -98183 9974 139597 28467 -140723
6284 -140723 -179656 -286871 -207937 -55187 -24422 -208389 -92938 201685 399213 373887
6274 373887 341688 225814 27808 188994 338621 365871 332120 383922 486006 257268
6264 257268 35599 111182 105083 74901 54218 29583 3044 76918 13960 -76616 -21385 50081
6252 50081 103939 93206 -50239 -246231 -220458 -47711 -25050 61343 -3167 3014 -774 -53647
6240 -53647 -14449 -37987 -111361 -221133 -174257 -134124 -30184 -113873 -157227 -152540 18369
6229 18369 199189 129353 869 -85344 -84490 27995 294975 409229 192929 112104 62227
6218 62227 128664 152993 -1012 -156211 -236429 -188386 -129596 -48714 -153660 48458 251883
6207 251883 432090 360046 169640 2150 -96032 -21483 -64089 -87724 -79458 -63243 79016
6196 79016 349549 677064 384222 202281 5133 -5402 -32003 -71695 -128953 -102046 -158633
6185 -158633 -142697 -28647 -172514 -286898 -410074 -339363 -34203 -21532 -54943 86432
6175 86432 167314 -3367 37736 1131 -223569 -369995 -246242 -109859 -236437 -296311 -247796
6164 -247796 -32016 -2044 -142658 -308390 -266114 -131067 -61714 -4758 163937 88781 -99190
6153 -99190 -143382 -62922 -68358 -124954 -106538 -36773 14051 101058 111612 117569 122169 13108
6141 13108 -103000 -42202 68608 210841 166691 112654 78338 -142724 -388985 -329404 -196954
6130 -196954 -31447 -26540 -36326 -140977 -159080 -111462 -198624 59928 121044 -74994 -88910
6119 -88910 -60716 -124555 -195900 -26213 -116879 -171334 -89478 30999 -23608 -228983 -222998
6108 -222998 -175515 -182641 -202664 -69782 -125894 -34292 -203173 -256076 -161063 -271623 -445718
6097 -445718 -375334 -240224 -65396 -221334 -309933 -171423 -51409 -53062 -137428 -14007 72687
6086 72687 -117797 -492793 -473446 -427304 -271408 -138869 -26089 28913 80673 164413 3179
6075 3179 -159523 -348925 -267175 -253886 -332996 -320234 -257470 -203695 -172879 -165624 -104425 -121371
6063 -121371 30611 5156 -149219 -233766 -324358 -156544 -64638 -156198 -140684 -76729 12745
6052 12745 42095 -63281 -98491 116925 -35781 -93940 -82752 -46740 -106503 -95620 2915
6041 2915 8224 -224303 -233644 -242793 -316659 -443114 -323000 7412 106116 8424 33841 91352
6029 91352 252374 121312 -196447 -449087 -442295 -335439 -120801 -214379 -11074 51991 -97240
6018 -97240 -86155 -32968 -310528 -337088 -259394 -116318 48072 145674 74159 -81477 -138213
6007 -138213 70777 74592 282207 399939 422638 474292 382186 290125 449200 533052 474068
5996 474068 448405 387065 218122 208429 222275 48963 -251299 -373188 -435620 -374697 -372326
5985 -372326 -388763 -439187 -314906 -187136 -29463 68186 137863 -9653 -211014 -273741 -236453
5974 -236453 -284496 -434141 -399780 -371750 -34292 151889 89112 182675 246319 156694 119429
5963 119429 84097 14346 190571 259572 94759 17069 -126378 -106021 -14569 52426 -46235
5952 -46235 -125732 -161498 -49458 -96967 -107290 -65285 -79792 103694 151453 117002 36985
5941 36985 4 -104218 -208065 -278825 -198790 -167543 -181795 -298056 -253914 -36036 -11406
5930 -11406 10948 -84963 60496 147171 130766 -6376 69299 -84386 48089 87505 43614
5919 43614 110461 108252 167781 123611 -23981 -175566 -122863 -39693 -19632 -161050 -192486
5908 -192486 -951 108638 158673 62123 68287 119153 -48343 -87551 -95469 138971 41824
5897 41824 -266527 -481157 -378727 -322516 -278164 -156482 -141372 31986 223542 91754
5887 91754 -11488 39085 47621 19330 -110822 -114412 108514 167761 122522 234756 90059
5876 90059 130504 222243 139567 23818 -217177 -260731 -175714 -24058 -58755 -24114 26883
5865 26883 339 -116544 40009 57081 -63879 -195473 -248917 -255150 -271255 -185716 -152102
5854 -152102 -65046 -24261 -64369 -160868 -93760 148397 298387 309533 265249 140308 21148
5843 21148 24286 219169 404671 303240 -140248 -116628 -41179 168414 187182 147681 19260
5832 19260 -14702 -57328 -288327 -90068 169832 46058 -111920 -124765 -35300 -79470 45055
5821 45055 80490 219831 303929 187820 -166713 -78166 -12049 -144420 -262251 -93380 251263
5810 251263 21815 -31314 191372 170047 -9044 -128808 -112611 -143294 -38647 18562 24660
5799 24660 -163958 -100490 -59115 49278 -46941 -56753 -104170 26828 352231 276969 -29816
5788 -29816 46154 199251 232647 258688 46117 -57796 -102144 -123464 -44803 -71882 2976
5777 2976 -8783 31770 -136038 -281735 -290662 -219324 -100110 -74193 -105862 -54824 -47625 205582
5765 205582 235683 155790 -1238 95 50044 -99398 -285366 -325433 -58475 -5585 -60310
5754 -60310 -44483 41688 -20891 34383 -240671 -526565 -519235 -360427 -373388 -162236 -88844
5743 -88844 -164128 -190432 -94259 36628 252262 171734 -33881 -91124 -117996 -196102 56240
5732 56240 206716 102416 101202 31690 113825 182284 140777 204778 90589 -64364 -154392
5721 -154392 -130964 -150853 -127477 -31194 -107934 -183368 -231519 -133772 -71064 -71112 89258 269036
5709 269036 2397 12768 20227 57105 105034 157729 164712 294448 391514 240308 190430
5698 190430 -7102 3274 146743 213557 304642 112816 -24678 -56459 5303 82302 9424
5687 9424 153825 67546 33252 156142 223459 183066 178904 65825 86391 -67672 20421
5676 20421 158528 -13190 -239955 -437176 -387313 -175303 -162773 -110291 -151096 -250206 -242128
5665 -242128 -331392 -191790 -38468 1462 -129070 -33634 2618 31397 -21529 64380 -35265
5654 -35265 -145470 -277073 -281623 -319107 -232409 -233151 -215085 -338571 -364348 -137703 -125046 -245299
5642 -245299 -228541 -176511 -107438 -157920 -151770 -105061 -105204 -126581 -51115 135615 287481 265796
5630 265796 133065 149089 180923 194020 178129 155140 50190 77070 -64067 -124579 -113222
5619 -113222 -139761 -55647 -65721 -239519 -263365 -161454 -68047 44946 -35636 -373262 -527315
5608 -527315 -522905 -246399 -268101 -224697 -347448 -403291 -277319 -139680 -337859 -304804 -89510
5597 -89510 70587 -5590 -55325 45448 -15343 -132830 -20292 223366 279115 151414 30587
5586 30587 96776 -61909 -15722 3150 -62876 -197936 -199610 -276820 -78429 -185504 -274602
5575 -274602 -109864 142156 258131 309492 365967 226419 236822 190514 36650 71773 119146
5564 119146 -171007 -348890 -305191 -112390 221457 66742 -29307 -11454 127435 21023
5554 21023 -17133 87272 149486 151282 181357 115772 131704 205008 294894 355560 211403 19362
5542 19362 -26965 63376 81854 311957 177538 -6529 -63559 63454 160307 64532 -143750
5531 -143750 -321558 -203866 16168 57740 174624 237570 277345 263315 157640 103032 54154
5520 54154 35091 -47141 -110605 -314382 -338372 -229747 -225480 -220422 40649 139098 -630
5509 -630 233898 278442 149348 163202 243712 34640 58716 126780 -55102 -272685 -149570
5498 -149570 107396 185836 37529 -83230 -52720 -107604 -189771 -240171 -207847 -121852 -94862
5487 -94862 -211099 -161523 28579 -55710 -177036 -124426 -99667 -104161 -22752 11824 50579
5476 50579 -22287 -50583 83391 243753 57138 15455 150106 256632 126466 119436 20345
5465 20345 42298 108834 296455 279318 131818 85377 -25791 -130524 -127166 -72283 -61786
5454 -61786 -61939 -83014 23171 26790 -185130 -79617 -58711 -90080 13684 21380 -76502 155483
5442 155483 294210 165247 101712 22656 -21426 48503 99704 248020 234872 -24138 -127333
5431 -127333 -85339 15190 40833 -77170 -315404 -64489 96840 91326 110292 150081 -229034
5420 -229034 -548495 -513281 -206851 -128454 -247140 -183578 -144683 -44217 -140165 -185278 -145784
5409 -145784 -214918 -308180 -264960 -165731 -133528 -310859 -413476 -236085 -131358 -17092 -28160
5398 -28160 -69414 -135210 79198 196711 -32401 -125405 -172380 -82444 22509 -117500 -53863
5387 -53863 -99086 -301864 -302343 -426146 -547935 -588176 -407504 -169138 -157634 -219254 -343028
5376 -343028 -470913 -398605 -204206 -27228 57953 64102 175062 34877 152775 266331
5366 266331 182436 -47332 -83232 23694 -119252 -125351 91427 297639 414811 391851 133285
5355 133285 151669 163793 44470 -10651 -95250 -322839 -379338 -324181 -153674 -83769 35920
5344 35920 26660 -72498 -124303 -159232 -177162 -279741 -225534 -116641 61834 152064 127891
5333 127891 177951 150223 -139934 -100826 -17019 47664 95422 127584 -33994 -48512 117211
5322 117211 236133 210062 -18498 113358 64347 -97240 -7432 111127 27434 89298 6628
5311 6628 -104872 -179585 -90491 -108319 -52855 -112501 -397358 -557186 -426252 -374037 -253525
5300 -253525 -230019 -25954 -11692 -134128 -203185 -404260 -354042 1386 32474 -69963 -212806
5289 -212806 -215158 -204257 -258567 -308847 -257030 -241123 2336 97327 113566 39454 31398 68262
5277 68262 143741 -41237 -69779 72186 172678 147487 24759 -124839 -133781 49201 80634
5266 80634 -133988 -11884 6696 -88719 -238612 -254472 -234911 -197485 8209 63115 96730
5255 96730 61890 -116307 -152353 -294158 -360797 -448346 -326354 -256717 -31725 54724 12629
5244 12629 60805 58105 149332 211069 16573 -260241 -294210 -9468 79984 131115 174988
5233 174988 154657 -17865 -33959 -11989 -138552 -210967 -364597 -274670 -89255 88968 150202
5222 150202 59545 -99438 -81505 -92455 -33191 106316 22931 -220359 -300693 -235362 -240332
5211 -240332 -257522 -65943 36465 7846 -65416 -92759 -323544 -301398 -260621 -289819 -175308
5200 -175308 -7081 -161301 -175830 -83988 -154148 -2666 32368 145700 223444 113512 -81729
5189 -81729 -172447 55577 156912 106346 44803 -18036 -165201 -147861 106257 117664 -138807
5178 -138807 -406640 -275776 -279103 -174615 -168219 -90221 -1700 104818 203825 236600 185296
5167 185296 -33962 -58913 23282 108587 252925 235972 173618 -100594 -200212 -71030 110048
5156 110048 33908 126055 194498 110313 292406 332634 104852 -58496 175810 213638 129082
5145 129082 69026 40162 19112 65713 -18312 81698 203332 324193 261414 -72766 -354971
5134 -354971 -330437 -374942 -205499 -16365 -73028 154007 269459 211642 87256 54160 -170619
5123 -170619 -123952 -149178 -196024 -182952 -71493 -42433 129456 285622 132798 11871 89222
5112 89222 44105 -97344 -166344 25124 3557 -34799 -85803 -113335 55342 -7317 12783
5101 12783 42157 36696 -54426 -68576 -46327 -76486 -82859 68176 11962 17591 59123 -43504
5089 -43504 -80092 -170705 -149920 19276 148468 -54796 -161966 -136794 276716 512229 288149
5078 288149 196551 142454 -35710 33788 297692 96854 -94909 -160502 -50964 124513
5068 124513 313097 142367 37043 -27304 -144843 -475557 -447848 -428979 -327079 -54091
5058 -54091 218813 136489 56187 73239 172723 100277 102553 148293 229250 391720 406497 182942
5046 182942 132263 143687 49855 141659 199310 52385 89075 142851 188517 194223 110083 126723
5034 126723 309159 223036 106147 -114241 -300126 -317553 -74541 72497 28949 131884
5024 131884 235962 411790 501642 241994 -13327 98883 123336 63285 4900 -53479 -70378
5013 -70378 -30155 31814 -2045 198958 137830 -64473 -128303 -56838 92391 332869 140164
5002 140164 -163260 -125864 -91096 31130 27073 125375 6874 -195016 -207242 -91754 -36027
4991 -36027 -147519 -28800 -12198 -124076 -44347 158997 187293 106406 30129 72164 226849
4980 226849 91581 243057 47251 -119306 -230754 -177126 29006 95430 2873 76571
4970 76571 274737 45724 54024 241595 -48989 -353636 -208027 120826 243932 426542
4960 426542 489967 239869 240812 106218 111386 234328 161611 235794 382085 97782 43883
4949 43883 25691 29895 11796 151072 218911 272017 128871 224102 102316 -124792 -172022
4938 -172022 -188341 -324929 -228251 -127285 -151475 -169115 -167624 -213762 -65628 -43736 -153959
4927 -153959 -209400 -74826 116414 -5443 -96312 -262916 -195543 -271369 -604245 -515589 -132057
4916 -132057 -92369 -100214 -119647 45463 114595 65295 26829 212833 354504 426043 479507
4905 479507 379216 84158 -209424 -240595 -25991 30837 155342 -13154 -172394 -271509
4895 -271509 -267812 -247761 -338929 -323332 -200393 -109317 52015 -547 29226 -118854 41801
$$ [...]
##END NTUPLES=NMR SPECTRUM
##END=
