##TITLE=Analysis number 320059
Compound Code cc 09505
Project Code adrs
Chemist Name fudan
##JCAMPDX= 6.0         $$ Bruker NMR JCAMP-DX V2.0
##DATA TYPE= NMR SPECTRUM
##DATA CLASS= NTUPLES
##ORIGIN= Bruker BioSpin GmbH
##OWNER= nmr
$$ XWIN-NMR		Version 3.5
$$ Mon Jun 12 11:46:27 2006 GMT Daylight Time (UT+1h)  MAYBRIDGE\nmr@NMR_250MHZ
##.OBSERVE FREQUENCY= 250.131544655141
##.OBSERVE NUCLEUS= ^1H
##.ACQUISITION MODE= SIMULTANEOUS (DQD)
##.ACQUISITION SCHEME= undefined
##.AVERAGES= 16
##.DIGITISER RES= 18
##SPECTROMETER/DATA SYSTEM= dpx250
##.PULSE SEQUENCE= zg30
##.SOLVENT NAME= CDCl3
##.SHIFT REFERENCE= (INTERNAL, CDCl3, 0, 16.522)
##AUDIT TRAIL= $$ (NUMBER, WHEN, WHO, WHERE, WHAT)
$$ ##TITLE= Audit trail, XWIN-NMR		Version 3.5
$$ ##JCAMPDX= 5.01
$$ ##ORIGIN= Bruker BioSpin GmbH
$$ ##OWNER= nmr
$$ C:\u/data/dgb/nmr/ADRS/530/pdata/1/auditp.txt
$$ ##AUDIT TRAIL=  $$ (NUMBER, WHEN, WHO, WHERE, WHAT)
(   1,<2006-06-12 11:45:44.48 +100>,<MAYBRIDGE\nmr>,<NMR_250MHZ>,
      <created by zg, POWCHK disabled, PULCHK disabled
       configuration hash MD5:
       E2 DF 36 D8 04 B2 41 60 5A D7 A3 38 5A 4B D0 FE
       data hash MD5: 64K
       FB 3F 82 74 63 DF F2 3F 84 4D DF EE 84 96 83 1F>)
(   2,<2006-06-12 11:46:03.79 +100>,<MAYBRIDGE\nmr>,<NMR_250MHZ>,
      <Start of raw data processing
       ef LB = 0.3 FT_mod = 6 PKNL = 1 SI = 32K 
       data hash MD5: 32K
       67 3E 4D 05 98 22 50 78 74 84 3E 08 37 1C DF 9F>)
(   3,<2006-06-12 11:46:08.20 +100>,<MAYBRIDGE\nmr>,<NMR_250MHZ>,
      <apk 
       data hash MD5: 32K
       1D 4E B2 27 3D 10 0B AD AD 73 E9 CE 7B A0 6E 46>)
(   4,<2006-06-12 11:46:09.92 +100>,<MAYBRIDGE\nmr>,<NMR_250MHZ>,
      <abs ABSG = 5 
       data hash MD5: 32K
       8C 7D 7F A2 AF 4D 41 F7 99 F9 AE 73 F1 94 8A F7>)
$$ ##END=
$$ 
$$ hash MD5
$$ 9D 23 32 8C DE EB 3F DC 89 CC 86 06 15 06 6D 6C
##$RELAX= 
##$RELAX= 
##$RELAX= 
##$RELAX= 
##$RELAX= 
##$RELAX= 
##$RELAX= 
$$ Bruker specific parameters
$$ --------------------------
##$DU= <C:\u>
##$EXPNO= 530
##$NAME= <ADRS>
##$PROCNO= 1
##$TYPE= <nmr>
##$USER= <dgb>
##$AMP= (0..31)
100 100 100 100 100 100 100 100 100 100 100 100 100 100 100 100 100 100 
100 100 100 100 100 100 100 100 100 100 100 100 100 100 
##$AQSEQ= 0
##$AQ_mod= 3
##$AUNM= <au_zg>
##$AUTOPOS= <18 >
##$BF1= 250.13
##$BF2= 250.13
##$BF3= 250.13
##$BF4= 250.13
##$BF5= 500.13
##$BF6= 500.13
##$BF7= 500.13
##$BF8= 500.13
##$BYTORDA= 1
##$CFDGTYP= 0
##$CFRGTYP= 5
##$CHEMSTR= <none>
##$CNST= (0..31)
1 1 145 1 1 1 1 1 1 1 1 1 1 1 1 1 1 1 1 1 1 1 1 1 1 1 1 1 1 1 1 1 
##$CPDPRG= <>
##$CPDPRG1= <>
##$CPDPRG2= <>
##$CPDPRG3= <>
##$CPDPRG4= <mlev>
##$CPDPRG5= <mlev>
##$CPDPRG6= <mlev>
##$CPDPRG7= <mlev>
##$CPDPRG8= <mlev>
##$CPDPRGB= <>
##$CPDPRGT= <>
##$D= (0..31)
0 1 0 0 0 0 0 0 0 0.06 0 0 0 0 0 0 0.0002 0 0 0 0 0 0 0 0 0 0 0 0 0 0 
0 
##$DATE= 1150109142
##$DBL= (0..7)
120 120 120 120 120 120 120 120 
##$DBP= (0..7)
150 150 150 150 150 150 150 150 
##$DBP07= 0
##$DBPNAM0= <>
##$DBPNAM1= <>
##$DBPNAM2= <>
##$DBPNAM3= <>
$$ [...]
##$SUBNAM6= <"">
##$SUBNAM7= <"">
##$SUBNAM8= <"">
##$SUBNAM9= <"">
##$SW= 20.6930455092707
##$SWIBOX= (0..15)
0 0 3 0 0 0 0 0 0 0 0 0 0 0 0 0 
##$SW_h= 5175.983436853
##$TD= 65536
##$TD0= 1
##$TE= 296.16
##$TE2= 300
##$TE3= 300
##$TEG= 300
##$TL= (0..7)
0 120 120 120 120 120 120 120 
##$TP= (0..7)
150 150 150 150 150 150 150 150 
##$TP07= 0
##$TPNAME0= <>
##$TPNAME1= <>
##$TPNAME2= <>
##$TPNAME3= <>
##$TPNAME4= <>
##$TPNAME5= <>
##$TPNAME6= <>
##$TPNAME7= <>
##$TPOAL= (0..7)
0.5 0.5 0.5 0.5 0.5 0.5 0.5 0.5 
##$TPOFFS= (0..7)
0 0 0 0 0 0 0 0 
##$TUNHIN= 0
##$TUNHOUT= 0
##$TUNXOUT= 0
##$USERA1= <user>
##$USERA2= <user>
##$USERA3= <user>
##$USERA4= <user>
##$USERA5= <user>
##$V9= 5
##$VALIST= <valist>
##$VCLIST= <CCCCCCCCCCCCCCC>
##$VD= 0
##$VDLIST= <DDDDDDDDDDDDDDD>
##$VPLIST= <PPPPPPPPPPPPPPP>
##$VTLIST= <TTTTTTTTTTTTTTT>
##$WBST= 1024
##$WBSW= 4
##$XGAIN= (0..3)
0 0 0 0 
##$XL= 0
##$YL= 0
##$YMAX_a= 452060
##$YMIN_a= -504763
##$ZGOPTNS= <>
##$ZL1= 120
##$ZL2= 120
##$ZL3= 120
##$ZL4= 120
##$ABSF1= 16.522
##$ABSF2= -4.171173
##$ABSG= 5
##$ABSL= 3
##$ALPHA= 0
##$AQORDER= 0
##$ASSFAC= 0
##$ASSFACI= 0
##$ASSFACX= 0
##$ASSWID= 0
##$AUNMP= <proc_1d>
##$AZFE= 0.1
##$AZFW= 0.1
##$BCFW= 0
##$BC_mod= 0
##$BYTORDP= 0
##$COROFFS= 0
##$CY= 12.5
##$DATMOD= 1
##$DC= 0
##$DFILT= <>
##$DTYPP= 0
##$F1P= 14.0000005364418
##$F2P= -0.99999901652339
##$FCOR= 0.5
##$FTSIZE= 32768
##$FT_mod= 6
##$GAMMA= 0
##$GB= 0
##$INTBC= 1
##$INTSCL= 1
##$ISEN= 128
##$LB= 0.3
##$LEV0= 0
##$LPBIN= 0
##$MAXI= 10000
##$MC2= 0
##$MEAN= 0
##$ME_mod= 0
##$MI= 0
##$NCOEF= 0
##$NC_proc= -2
##$NLEV= 6
##$NOISF1= 0
##$NOISF2= 0
##$NSP= 0
##$NTH_PI= 0
##$NZP= 0
##$OFFSET= 16.522
##$PC= 1
##$PHC0= 168.2953
##$PHC1= 5.7426
##$PH_mod= 1
##$PKNL= yes
##$PPARMOD= 0
##$PSCAL= 4
##$PSIGN= 0
##$REVERSE= no
##$SF= 250.13
##$SI= 32768
##$SIGF1= 0
##$SIGF2= 0
##$SINO= 400
##$SIOLD= 32768
##$SREGLST= <1H.CDCl3>
##$SSB= 0
##$STSI= 32768
##$STSR= 0
##$SW_p= 5175.98343685301
##$SYMM= 0
##$S_DEV= 0
##$TDeff= 65536
##$TDoff= 0
##$TI= <Analysis number 999999
Compound Code 99
Book Reference 9
Project Code 9>
##$TILT= no
##$TM1= 0
##$TM2= 0
##$TOPLEV= 0
##$USERP1= <user>
##$USERP2= <user>
##$USERP3= <user>
##$USERP4= <user>
##$USERP5= <user>
##$WDW= 1
##$XDIM= 32768
##$YMAX_p= 312712850
##$YMIN_p= -54109
$$ End of Bruker specific parameters
$$ ---------------------------------
##NTUPLES= NMR SPECTRUM
##VAR_NAME=  FREQUENCY,     SPECTRUM/REAL,   SPECTRUM/IMAG
##SYMBOL=    X,             R,               I
##VAR_TYPE=  INDEPENDENT,   DEPENDENT,       DEPENDENT
##VAR_FORM=  AFFN,          ASDF,            ASDF
##VAR_DIM=   32768,         32768,           32768
##UNITS=     HZ,            ARBITRARY UNITS, ARBITRARY UNITS
##FACTOR=    0.157963299565203, 1,           1
##FIRST=     4132.6476996994, 0,             0
##LAST=      -1043.33573715361, 0,           0
##MIN=       -1043.33573715361, -54109,      0
##MAX=       4132.6476996994, 312712850,     0
$$ Real data points
##PAGE= N=1
##DATA TABLE= (X++(R..R)), XYDATA
$$ [...]
25042 -5038 -642 7083 6819 12116 28218 8400 -9615 -3904 11977 8916 6809 6255 -2647 1360
25028 1360 -14350 -19224 -162 2648 -5398 -7671 12201 18368 27807 22152 15310 22739 22180 10552
25014 10552 8785 7766 1719 -481 -10514 -17309 -17915 -14265 -5893 4958 -2899 -9207 -1652 -12618
25000 -12618 -15379 -21315 -21838 -7314 -2313 4282 -3554 -2685 13273 19061 11196 4297 8207 2514
24986 2514 -3245 -4806 -5163 -842 5866 -2192 -842 -6367 -3981 2257 3358 -661 7325 -457 2318
24971 2318 9686 6977 -6661 -29205 -15226 -14930 -5716 -2512 -5225 3957 -1890 3896 -954 -12393
24957 -12393 -13204 -11473 -2284 -20348 -25507 -10767 -823 -8360 -8708 -1363 -4099 -8303 -23036 -22603
24943 -22603 -20044 -12948 2187 10954 1514 12783 12145 3613 2079 4279 9022 7392 6717 3671
24929 3671 -9674 -19647 -20008 -19596 -14671 8385 1179 1090 4967 6188 8943 4685 -11876 5784 10156
24914 10156 -8369 -14339 -15707 -15853 -4669 5426 -112 -2149 -3917 -5232 11482 15824 -260
24901 -260 -16633 -11844 2444 10313 3463 -3638 -5967 5973 3783 -4597 3757 -6531 16146 25392
24887 25392 12490 7769 -723 -13303 -14518 -27812 -37833 -37124 -28543 -16770 -10871 -11861 -16196 -14958
24873 -14958 -9825 -24781 -24901 -7055 16094 8581 11716 13026 21004 20725 979 -18454 -21399 -17163
24859 -17163 -7666 2078 1493 14666 20749 17711 8588 14739 16023 4067 -2038 -16770 -12575 16242
24845 16242 13044 3322 -9273 4864 7258 -4306 4727 13837 3870 -15428 -25447 -25995 -29947
24832 -29947 -8725 5587 10529 11803 9361 5150 6968 17226 13543 9942 11176 12634 10096 -1805
24818 -1805 -6319 -19350 -21093 -11483 -7100 9998 16902 26564 30474 25805 31365 12547 18025 22275
24804 22275 15610 14736 28546 27956 19221 1431 4000 12433 11864 3 -5609 -12075 -16981 -18306
24790 -18306 -16531 -21868 -27275 -19731 -14937 -22236 -10642 4402 21613 -3194 -22934 -19719 -1797
24777 -1797 4966 8093 -2306 -12950 741 16185 12679 12251 6242 7642 8842 7969 7317 539
24763 539 -5482 13443 28792 19546 12841 5515 -7249 4013 9680 11619 3098 -766 -9049 -4907
24749 -4907 -3241 -15457 -22024 -15127 -12901 -3214 10977 12207 -2070 -12127 -11734 3174 3193 -2715
24735 -2715 354 7436 17753 5411 4867 8133 2092 -1320 -261 1213 -16743 -22376 -19163 -13205
24721 -13205 -5696 236 -7701 -13069 -5613 -10405 -17801 -26112 -37020 -7228 25869 9764 -8271
24708 -8271 -11239 -5738 -5496 -13499 -13595 10690 12846 -177 -14397 -5645 2114 20458 22889 14006
24694 14006 9705 -1344 -8820 -10484 -7603 -7178 -1604 -916 7448 8832 10957 9828 8000 9155 22289
24679 22289 31677 35409 29239 23900 14362 8599 16778 24609 13834 -10939 -20039 -11989 5189 10519
24665 10519 15985 11980 10669 23278 28680 24794 1926 -1677 5220 -2989 -8275 1674 6412 -12199
24651 -12199 -24981 -17356 -1762 -6690 -17079 -17827 -17490 -19710 -9831 -13560 -5865 3506 -3946 -2120
24637 -2120 -4950 -12704 -15869 -5245 7584 9199 3671 -11536 -15988 3947 993 -6557 -10487 -242
24623 -242 16293 20545 8743 -8708 -14824 -20754 -11467 -5745 -10836 1683 11883 -8142 -16563
24610 -16563 -25148 -26145 -39366 -35602 -39603 -39977 -27001 -8443 671 -175 15311 15729 -1792 6794
24596 6794 18752 32331 19909 7188 -2742 -7106 -13379 -10538 10254 18778 31913 22315 10224
24583 10224 -14279 -28374 -17169 -14071 -14995 -10311 -11760 -19430 -24276 -19196 -4058 -415 -2909 3945
24569 3945 5996 11729 7799 11180 7010 2081 7905 4067 71 -16624 -14882 -11085 -14776 -12916
24555 -12916 -13463 -3660 -5803 -8569 -18165 -32167 -14023 51 -3461 -13713 -23746 -12998 -7551
24542 -7551 -9214 -1109 54 4206 1815 -899 -9453 -14361 -16247 -6825 -2814 -18715 -25342 -19595
24528 -19595 -16005 -12507 -15173 -19780 -19545 -7019 12636 9340 8667 14955 20614 4532 -9410 -14759
24514 -14759 -9099 6647 16069 13730 22688 21654 7101 -10369 -26763 -29236 -11985 -6861 -3276
24501 -3276 8254 12033 14748 11851 -6751 -11324 -6985 -7418 -10694 -9700 -6224 3036 -7573 -12375
24487 -12375 -10668 -2223 -2239 11906 16761 7526 11940 31704 22405 20362 15447 15340 8942 7807 1443
24472 1443 7273 9121 7853 8614 12219 928 8788 12312 1397 -9798 -10270 -15705 -7529 681
24458 681 -11071 -6455 8863 24095 30622 9340 22517 23525 15920 2833 -2023 12135 7830
24445 7830 -11825 -33874 -35665 -33827 -22706 -8510 -7945 -3481 -3853 -8077 -16044 -16928 -11177 -18073
24431 -18073 -11237 -21687 -13862 -14932 -11977 -7253 -7739 -9197 -10612 -5130 -3770 -10331 -7722 5736
24417 5736 5184 12626 16040 6008 -15943 -16107 -9600 -2305 -5604 -12485 -10180 -10462 163 13282
24403 13282 23900 21004 17592 5543 3103 -9007 -4713 -3914 -7692 -915 363 -13241 -23957
24390 -23957 -11545 -7833 -4866 -5504 -12561 -7283 -12029 -8256 -13139 -16778 -12827 -21584 -24430 -23403
24376 -23403 -23042 -22943 -26570 -29829 -25472 -17950 -9509 4541 -15637 -8795 2918 8748 8705 4729 -6119
24361 -6119 -10753 -13949 -25565 -12069 818 2262 7017 -4103 -14697 -3661 14 2780 6199
24348 6199 4434 -6668 -9916 -10036 -16016 -4082 1350 -10602 -17581 -24355 -26397 -12525 -12166 -22248
24334 -22248 -19879 -17965 -16403 -9675 530 5376 14646 13293 12199 7459 23 547 9950 15146
24320 15146 -2471 -4710 -2919 1677 9375 7206 9783 14599 2593 5355 11208 -3273 -19402
24307 -19402 -24856 -16081 -23940 -11368 1443 -5450 -6819 -11756 -12597 -3233 1072 177 14281 15146
24293 15146 665 4861 2663 -8334 -5715 -79 3372 5674 -9836 -12844 -9395 2605 -10337
24280 -10337 -10381 -1406 -4738 9464 19913 12509 7704 8043 2671 -1996 -15029 -27018 -15981 3552
24266 3552 -9393 -16682 -13524 -8729 1106 5591 -424 -7916 -7677 -8052 -6422 -3704 -7341 -14407 -13538
24251 -13538 1061 5140 -9015 -22511 -16681 -127 8037 3098 -12858 -13620 471 5681 -6194
24238 -6194 -12493 -14304 -5648 -9825 60 -4383 129 5873 3627 -14194 -22402 -28338 -27785 -23163 -22029
24223 -22029 -11719 -2075 16182 12537 705 -8827 10782 10678 11483 20924 20938 10564 3537 753
24209 753 14608 21690 15309 8112 4735 2140 13751 21980 18784 -349 -3020 6192 13875 -791
24195 -791 -7873 -22208 -25842 -29708 -13962 -8582 -9486 -4891 -9637 342 6766 22702 23467 17005 18664
24180 18664 20476 14537 9471 17751 20397 11217 1607 -6107 -9353 -14741 -14244 -22690 -32985 -23789
24166 -23789 -18387 -7252 2570 -2066 -9165 8757 17302 22855 11603 415 2287 -15531 -17961
24153 -17961 -21705 -26227 -27835 -28619 -23150 -17236 -8863 -14143 -21092 -21371 -18102 -4203 -647 11161
24139 11161 -6330 -16813 -6983 -4719 -7854 -7537 -3126 -4933 693 -6711 -6372 -2764 -7078 -4141
24125 -4141 -470 -14171 -28652 -28197 -12122 -25917 -26049 -11111 -6502 -12637 -27170 -18209 847
24112 847 12516 3535 -8867 -25420 -24095 -10542 2217 7187 -2154 -11483 -13105 445 14816
24099 14816 18680 19189 26609 28090 23161 13986 9162 23503 8470 6395 9676 25697 18831 33860
24085 33860 50720 46752 30305 21536 18324 15099 3224 5699 11485 9495 10764 8402 534 1615
24071 1615 -3067 -5823 -2202 -3861 -4466 -14380 -17127 -16606 -8384 -5364 -10929 -4106 -5896 -14862 -18194
24056 -18194 -11461 -12437 -14064 -871 7826 13789 7400 -9374 -11078 -6837 -2819 3685 14787 15125
24042 15125 -2768 -19197 -25053 -14296 -13402 -10792 -8050 -7148 -15266 -9702 -4868 -10837 -20332 -11210
24028 -11210 -8601 -15648 -2268 25858 36147 28092 18195 22993 26292 8668 -2998 -266 -648
24015 -648 10763 6948 -5018 -7376 3542 8129 7381 -6231 -3433 -1107 -2860 -4468 -3691 1002
24001 1002 9953 58 -4084 -8404 -5958 -8527 -20574 -13299 -5002 -3833 -485 5543 14952 5309
23987 5309 2886 16462 27152 15389 -5352 -10855 -15991 -4494 4181 -755 1213 621 351 -8826
23973 -8826 -2127 1958 -13469 -19107 -13356 -11973 -14834 -17903 -17731 -3136 -20846 -30079 -22570 -7701
23959 -7701 -1117 -66 -5551 -10636 -3110 -12854 -17934 -18191 -26503 -26241 -1019 11315 -1690 -13457
23945 -13457 -8896 -8683 1494 4252 1512 -3474 -10233 -18946 -14287 3486 21394 8075 -9217
23932 -9217 -15013 -758 14026 3995 3012 -328 4416 -2441 2753 6806 -3894 2010 -1164 -6635
23918 -6635 -11857 -3776 4025 1647 1029 7071 6361 -1540 3738 15997 13396 9872 -5467 -12377 -14637
23903 -14637 -14472 -13913 -18892 -15586 -6290 -5019 -1770 -556 3121 16642 6159 -1560 -12801 -1574
23889 -1574 15718 10476 17102 18340 7991 -1932 -12102 -7768 -15460 -31792 -22535 -16284 -15375 -22297
23875 -22297 -19949 -21623 -16619 -4501 2515 -7088 -17931 -8196 -1053 4926 7060 4578 1314 -11360
23861 -11360 -9129 6112 7285 6641 2062 -12862 -11516 386 -7691 -19423 -15984 -23341 -28155 -21986
23847 -21986 -3882 9022 2457 232 8789 17530 13092 3820 12631 15137 -2304 -13498 -6539
23834 -6539 -10252 -249 6090 2622 -2077 6108 17461 24968 16389 334 2620 14821 7219 11098
23820 11098 11765 -1661 -2157 -1298 -9351 -6424 7656 16755 12753 539 -3072 3198 4770 11835
23806 11835 11622 24251 30914 10380 5129 14494 17181 17046 13220 3134 11682 -6717 -15507 -3950
23792 -3950 2658 1687 168 -1371 -2217 327 9383 14310 4872 -12624 -11919 -6793 -1837 16344 25913
23777 25913 1632 -3967 1983 4802 8596 -518 -11718 -19303 -17124 -5955 -6692 -10615 10391 28469
23763 28469 27088 5933 -14802 -24187 -880 17897 20696 2969 -3823 -2042 -1652 10703 12175
23750 12175 8892 19692 25334 25361 23963 24689 20932 14304 5118 -6112 9770 25767 27825 27528
23736 27528 15430 2594 -7336 -11219 -4352 -3684 562 12421 11739 -7056 -15386 -7766 -4665 -5014
23722 -5014 -4417 -7059 -7754 -25800 -40094 -26991 -13497 -9888 -9860 8313 6718 10447 9783 6066 2299
23707 2299 -8593 -11539 -7508 -8189 4829 10684 1051 -17965 -38327 -32320 -10586 -11151 -16684 -7785
23693 -7785 -1547 -2144 -1972 -6582 -11795 -10693 637 18430 21312 27197 -3496 -22753 -9448 460
23679 460 8335 3704 -10515 -9965 -11581 -10396 -7649 7005 13663 -3270 -19750 -21851 -5789 -4175
23665 -4175 2566 6726 7574 -5122 -20634 -36190 -38173 -35642 -21774 -17469 -12624 -2088 -6461 -10748
23651 -10748 -6644 -20219 -19673 -5559 418 -9114 -11627 -7126 -24715 -37983 -29995 -11180 -10583 -12135
23637 -12135 -13597 -19757 -41211 -25477 -11155 -18074 2975 15645 16693 14617 6931 9569 5708
23624 5708 -15241 -16021 -5594 17838 11294 -9290 -27979 -19967 -5538 360 6302 -5937 3609
23611 3609 4440 6909 11637 3964 596 -8348 -11742 -22185 -20191 -18783 -24926 -17490 -11924 -25358
23597 -25358 -25346 -18989 -9471 -13826 -8287 -2125 -722 -16321 -12832 -950 6012 6660 19997 28223
23583 28223 21942 10169 -3537 -11036 -15380 -6056 -11201 -13366 -5654 5792 18859 18510 22982 23364
23569 23364 16935 26309 26209 32505 38608 27216 14182 -435 2722 27657 13962 2267 45
23556 45 17767 28939 15930 -15711 -15694 85 6688 -5647 -5401 4841 14056 10160 -2606 -8685
23542 -8685 -10533 -11226 -10733 -5053 -8802 -5062 3868 -5166 -12528 14244 22819 23381 34515 29714 15798
23527 15798 15792 18071 15409 7078 8935 12652 14071 9032 5512 11505 5747 -4456 -7985 14392 18608
23512 18608 5503 5364 2164 9670 25939 25490 17627 9388 -11000 -29251 -20522 -10424 -5827 -8392
23498 -8392 -14773 -14214 -15504 -14318 -16064 -14424 -9070 -9719 -6303 7311 8753 -10803 -9167 5985
23484 5985 8573 13269 -2132 -8694 -9177 -17236 -26645 -27188 -27702 -28911 -19254 -23426 -12849 -3449 11569
23469 11569 9768 8796 11467 -4060 -17987 -26002 -18684 -13823 -10266 1897 -16153 -27822 -15901
23456 -15901 -11887 -19944 -10409 -4937 -5248 3882 1659 -7565 -1109 -7641 -18702 -10111 -6944 -1207
23442 -1207 1923 -1853 9030 11951 18993 16890 21562 4114 -8058 -23701 -19468 -15862 -12904 -7936
23428 -7936 69 4894 18167 15548 64 1524 -693 -8947 -11201 -1164 10717 10605 5669 -2078
23414 -2078 -7071 -7969 -10212 -2846 -254 -15362 -26997 -19491 -3753 -2852 -10157 -25910 -26420 -15176
23400 -15176 -3217 494 8375 4592 4964 2374 2899 7882 -7255 -26003 -18508 -9628 2291 2043
23386 2043 108 -4374 -11349 -14143 -25649 -23018 5604 20531 25870 23117 36230 40319 25902
23373 25902 15154 8538 -14151 -11527 -8405 -9852 431 9208 11989 -13720 -21656 -14292 -10658
23360 -10658 -16800 -22444 -22645 -13766 -12681 -4550 5564 -724 -3074 -419 7291 4364 -1058 -7467
23346 -7467 -14646 -17081 -11487 -5502 -7904 -5665 3702 4493 2032 -6365 -4879 2579 -8036 -13989 -5904
23331 -5904 10198 12465 5063 -4575 -344 6537 9188 6784 -38 -191 4644 10841 6415 -2160 -18932
23316 -18932 -20649 -442 23176 21725 7989 -4946 -6580 2989 8247 363 -2189 -12434 -10588
23303 -10588 -22 -3720 1018 20344 18013 27778 10603 -1343 11938 2752 3223 16381 16434 15789
23289 15789 6615 8942 4563 -1002 20439 5937 -815 489 3208 9157 13404 15976 13665 19307
23275 19307 19181 1010 -7848 -6669 2959 -14229 -18616 -20138 -29950 -21330 -12359 -8849 -10775 -17939
23261 -17939 -8211 -11890 -19440 -555 20649 27943 9630 -15282 -19151 -19511 -31940 -17379 -8330
23248 -8330 -7479 -7320 -12853 -13362 -12391 -9753 -12967 1757 3685 3506 -888 13761 1989 -6705 -8860
23233 -8860 -3452 1804 1606 -5228 -2657 -2587 -5525 4699 5882 4927 2186 -1019 10294 -11471 -19625
23218 -19625 -1898 2774 -2897 -8865 -7418 -10013 -12081 -18906 -9099 5356 7991 12335 15516 14654
23204 14654 1353 -926 6390 12552 15910 8560 3347 6131 -2879 -2660 4904 -4086 -3863 -8671 -16640
23189 -16640 -11813 -10702 -6725 -13108 -24991 -31632 -25334 -8940 -7682 -10825 821 -2490 -16016
23176 -16016 -2239 -21 -6984 -4443 -4644 38 -3120 -6069 -13050 -18873 -18893 -18093 -15706 -23640 -25776
23161 -25776 -15058 -23302 -20618 -11197 -16376 -42140 -52604 -20119 -12685 -24037 -22948 -23729 -1471
23148 -1471 2937 2609 -736 -753 9972 15955 -2669 -3039 8410 9742 -100 -2920 -7345 -16943 -5691
23133 -5691 2955 9966 7602 -1884 -13745 -13336 -16082 -15451 8921 12316 -1031 -14074 -18910 -15401
23119 -15401 -8530 -14263 -15573 -21273 -15191 -8409 -22331 -23408 -29973 -33948 -39366 -17352 -2343 -19897
23105 -19897 -13867 -8102 -8854 5500 7778 -3615 -7989 -2466 10460 1236 7366 12387 6317 9611
23091 9611 6219 18289 35411 9969 4545 3643 -15673 -24372 -22370 -19258 -14487 -20303 -12603 -9917
23077 -9917 836 574 -10332 -16725 -20537 -20787 -19091 -8528 -16614 -23304 -14741 -7133 -18831 -21443
23063 -21443 -11413 -12706 -18333 -25208 -22659 -17683 -18371 -10761 -7265 519 2286 -12920 -20746 -17662
23049 -17662 -23846 -37328 -22474 -4718 8322 3760 -909 -13519 -18561 -5006 -4243 -6111 1555
23036 1555 7182 18719 20710 27245 17820 10815 3258 -4292 -2159 21097 33099 27605 20099 14929
23022 14929 -2022 -13215 -9368 -7228 -20828 -9652 6060 4087 -5235 -3267 5146 13357 11745
23009 11745 12232 2982 4844 18998 25761 35285 32656 7364 -5258 -8767 -2799 -2059 8053 11011
22995 11011 -500 7073 11268 12027 9319 7938 -2217 -19456 -2397 6782 801 -3534 13145
22982 13145 19074 12389 -8124 -17820 -1803 -1735 -723 -8551 -264 -1999 -13544 -12262 -1503 12672
22968 12672 2991 -5845 1817 1174 -8945 -15141 -14419 -13740 -12987 -12530 -1084 -2228 2638 -298 -12556
22953 -12556 -17454 -3307 -662 -1011 -8727 -13756 -13626 1062 9946 -3865 -20075 -29215 -16941 -1276
22939 -1276 -5687 -15549 -9405 994 -2156 1075 14628 21700 17880 6494 4604 8729 7493 18063
22925 18063 1324 -2470 5925 7882 13583 19325 9533 3691 5555 1062 13031 1848 -2826 4504
22911 4504 8430 3012 11540 21084 19758 14778 -1175 -1720 17316 26848 28117 34788 18301 3425
22897 3425 -1489 3684 5209 9504 5693 -7727 -21980 -29133 -24506 -17879 -25856 -30606 -14692 2649
22883 2649 9233 3332 -5944 -9623 -1327 5340 10369 5912 738 -15880 -22507 -29648 -31545 -27217
22869 -27217 -26990 -27149 -34414 -10409 22408 19433 4597 -1628 8748 8788 -2178 -1444 4165 8616
22855 8616 24134 36314 29786 18777 3500 -10162 -9145 -14330 -6688 1353 3164 1962 18543
22842 18543 16331 6957 -2370 -6936 -11879 -29070 -24710 -13485 -9838 -3839 -5736 -15145 -13982 -2890
22828 -2890 -293 -6500 -5049 -4644 -662 10108 10562 24537 25987 21649 14437 7180 11139 15624 15607
22813 15607 8718 12350 12700 1741 -8363 -19804 -24991 -36308 -46877 -30540 -21469 -12394 6985
22800 6985 24781 28354 15716 2672 -8682 -11999 -18700 -7304 -3206 -14193 -14267 -18379 -29181
22787 -29181 -17507 -17579 -16268 -13375 -9807 4438 -3305 -6595 4243 6658 13382 7427 15109 25281
22773 25281 19698 -549 -16043 -277 16240 11816 15782 16800 24189 17575 26211 18950 15062
22760 15062 1589 621 1216 -9165 -13102 602 4507 -5740 -15816 -15207 -8051 -13463 -19466 -18255
22746 -18255 -260 1651 1200 7607 4953 20191 29113 12152 1723 -3710 -1478 -6292 -14014 -10906
22732 -10906 -10943 -8374 -12926 -21676 -27225 -29493 -33597 -33631 -11149 -10824 -15178 -2600 9310 4185 8858
22717 8858 13406 4540 -6578 -13467 -16886 -9260 -18647 -12456 -2609 2609 -2275 -8890 -5897 3147
22703 3147 2862 121 -10353 -15417 -2040 9142 14773 11210 3488 -12281 -10164 -2798 4261 26070
22689 26070 30897 15029 9860 5002 -11110 -9485 -7794 -4694 4978 4898 -3951 -1340 -1272 2423 12600
22674 12600 30395 18597 3452 1227 -2773 -12545 -19993 -14461 -2542 421 -21950 -13787 -6448
22661 -6448 2276 -8472 -5675 7064 21609 23387 20321 6283 -8869 -13664 -13969 -6002 -9437 -17736
22647 -17736 -13480 -9733 4272 5278 -1957 -3980 -404 -2076 -9505 -3319 5289 5387 -3291 -21622
22633 -21622 -22952 -13074 969 11718 23386 21006 -10357 -19626 -26957 -38089 -22848 -22661 -23590
22620 -23590 -16888 -6271 -331 -5706 2840 -14064 -27720 -25632 -28105 -23375 -10340 8071 5085
22607 5085 -8811 -14909 -15536 -7180 -12670 -33768 -25989 -3777 -13782 -20655 -21006 -6334 12819 8519
22593 8519 -10940 -15583 -5526 -5662 -3615 -2383 -3447 -17054 -13658 -1610 -5506 -13421 -11038 1079
22579 1079 9433 15472 1615 -7633 -12497 -13774 -15118 -13896 -9979 6529 19561 7688 4898 1478
22565 1478 1104 7024 4644 5677 7905 11482 21946 24107 18142 17816 4466 -4813 -14196 -8741 -10696
22550 -10696 -8694 -3465 7050 -2711 -11038 476 -2360 -5736 -14625 -21703 -10471 -1983 -14589
22537 -14589 -14557 -8739 -7436 -5941 -17534 -19163 -9057 -22594 -22965 -19639 -22402 -11467 -212 -7227
22523 -7227 -19525 -21656 -5688 -13627 -20205 -14806 -8649 -3461 1977 7010 -1238 -10120 -3376 -3576
22509 -3576 -10472 -3657 4373 -4901 -12941 -13206 -2993 1354 1053 -1918 -7511 -12770 -22641 -16555 3654
22494 3654 15674 29733 33194 35686 23578 19319 10517 2496 14419 23795 12220 5081 7643
22481 7643 -3609 -13322 -3793 -8924 -13571 -7206 -5372 10701 7983 -9298 -20591 -12364 5957
22468 5957 12494 -16378 -18526 -11483 1008 18013 25986 11293 -5998 -6429 -10463 -14702 -20192 -21303
22454 -21303 -20102 -7746 8838 17405 21473 15921 21583 16165 7352 2919 -7277 493 8911 -6040
22440 -6040 1291 1287 53 7016 3036 -1409 4144 14554 8965 -7663 -11611 -17841 -25067 -14839 -11481
22425 -11481 -14888 -16094 -16586 -14744 -21048 -27634 -22653 -11534 -5043 -860 13142 25844 12143 -2060
22411 -2060 -13876 -10675 -5914 537 5559 5478 12970 10692 -7281 -12938 4167 9540 -3683 -22064
22397 -22064 -28691 -28751 -23017 -20232 -3725 -8133 -10905 13731 31423 22794 12934 484 -15556 -28890
22383 -28890 -30930 -30643 -41666 -37492 -30550 -24998 -24064 -10632 139 -937 -7084 -10277 12398 29004
22369 29004 12629 3194 10273 31327 29933 15224 9465 8298 843 9122 9832 6303 28260 32737
22355 32737 16315 12092 6679 -7495 -2336 2382 4538 -2254 -6696 -6499 -1276 2214 7162 7777
22341 7777 158 -15142 -19289 -7353 -15984 -16842 -21278 -29333 -17288 -18421 -20834 -20136 -25991 -10428
22327 -10428 -3537 -4211 -1247 -6885 -16851 -14270 -15469 -23338 -15012 -16956 -22049 -24496 -15437 -16562 -24135
22312 -24135 -29593 -27501 -17372 -13867 -25835 -25324 -17243 -18895 -13718 5500 15761 17391 23731 23465
22298 23465 7979 6877 -2100 2711 -3413 -4421 2446 -5642 -2074 3885 -1317 -11572 -19765 -16396
22284 -16396 -13729 -24494 -25414 -27597 -21152 -12706 -3166 4483 5552 8837 2296 17130 20009 8596
22270 8596 -679 -2507 -195 15377 16566 13370 8538 2036 -1037 -878 -1421 -5221 772 -8624 -19313
22255 -19313 -22513 -7579 800 4759 6102 -734 -9514 -4638 16941 18652 10408 -11147 -10206 -1752
22241 -1752 4699 -11704 -1998 8765 147 -9647 -14490 -6020 -9613 -3500 -29391 -35176 -26098 -4599
22227 -4599 -1838 3022 5722 425 1400 11796 17329 6106 -8942 -19068 -24630 -22007 -20146 -22800
22213 -22800 -23030 -3067 6192 3177 12725 9912 1416 9184 -272 -4571 18746 15712 10363 27249
22199 27249 15968 11000 6509 -5035 -9256 -4835 -3739 -7061 746 3327 -2614 -719 2356 -1067
22185 -1067 2916 5296 7471 5862 934 -7034 -2730 24630 14547 10124 10208 19277 30019 17639
22171 17639 16649 10242 17397 11021 -1420 -18040 -35733 -24217 -3482 11021 -1071 -28646 -14815
22158 -14815 -7404 -22406 -20690 -15970 -11394 750 6118 13300 6781 8212 5310 -11976 4539
22145 4539 15016 17654 4588 779 3225 -801 -6497 -8845 -5179 4328 15846 15725 14906 2775
22131 2775 -963 -12713 -17217 -929 14945 7657 6255 6388 -7407 -22504 -34758 -27472 -15195
22118 -15195 -8327 9542 -179 -6243 -16391 -17797 -3171 -826 -5244 -16556 -28655 -28147 -20131
22105 -20131 -17986 -15580 -11616 2426 4552 1802 14385 27203 23376 17281 3375 -7798 -15753
22092 -15753 -13712 -14601 -15948 -22848 -19510 -20974 -1514 6619 5267 -4699 -8789 -13759 -5724 966
22078 966 -4412 -11327 -2190 -4739 -14007 -25232 -16415 -9648 -20160 -24834 -27824 -38673 -38615 -26870
22064 -26870 -18927 -9721 -9044 2527 -9866 -9244 706 -8490 -17313 -28446 -16362 -3827 8141
22051 8141 7445 8279 5981 4040 4118 -5709 -18862 -22100 -18285 -11615 -3138 -1764 2373 -7761 -24217
22036 -24217 -27501 -25517 -17802 -11608 -8965 -7102 2597 -10676 -20197 -8947 8235 3607 5462 4630
22022 4630 17446 25942 13721 6923 1166 454 -5555 -1864 -2434 5420 7290 -9305 -921 4847
22008 4847 12815 12702 3420 -3071 -22638 -25745 -18395 -906 11013 22419 9490 -5196 -12333
21995 -12333 -17564 -19147 -7978 -12527 -10564 -3904 -4087 -7392 -5221 -13021 -27906 -34362 -32701 -26159
21981 -26159 -15368 -5008 696 3466 10854 23937 17646 11492 10311 -2873 -8049 -498 -5420
21968 -5420 -15344 1902 14333 7223 -5679 -6305 -14358 -17128 -22650 -29510 -32472 -33250 -25891 -15968
21954 -15968 -12050 -21435 -17170 8751 22174 32987 25277 360 -13970 -14973 -15990 2292 11600
21941 11600 10367 14399 16480 20289 29377 24315 10230 -328 7637 7366 1280 -2610 -7612 -13533
21927 -13533 -863 -7707 -16434 -14413 -759 11133 7901 2137 17214 19156 13511 358 -7444
21914 -7444 -14462 -21798 -36526 -38900 -45018 -28348 -9139 1718 8004 10253 10723 2168 14544 25770
21900 25770 14203 -7769 6124 -944 -9282 827 2307 14024 38148 27242 20764 18610 -53
21887 -53 -9081 -845 1864 -6801 -8927 -10678 -15574 -23704 -18288 -9562 3774 1872 -11836 -1926 9619
21872 9619 4697 -368 3879 1699 17698 20140 26643 18736 8037 -1300 -8029 -4923 -9917 -10282
21858 -10282 2552 17402 20572 1640 2167 5006 12748 3648 3754 5434 3299 12939 -8337 -11934
21844 -11934 -15539 -7901 1786 -7599 -9682 -11932 -21400 -20889 -16933 -11444 -9205 -4483 4617 -12363
21830 -12363 -22839 -36938 -25478 -4687 5508 9005 16508 19172 21708 10720 12888 6326 6224
21817 6224 13465 18704 25461 25842 29041 29987 26238 11734 1793 7735 4890 8348 14021 -4418 -8883
21802 -8883 680 3498 -2717 -13547 -19672 -11994 5142 11328 8381 12502 5140 4518 -3831 -23008
21788 -23008 -21123 -24239 -3013 11599 73 6119 -5274 -19873 -26188 -22197 -18661 -10584 -6519
21775 -6519 -4737 1644 -11174 -13149 -11422 -4389 -7813 -12327 -22219 -22569 -18608 -9481 -7214 -2730 -3496
21760 -3496 2437 662 -1266 1108 -13868 -17629 -15878 -23433 -24917 -30471 -26180 -21830 -310 11792
21746 11792 10236 17126 27928 35735 28289 11771 14216 23210 18645 23784 16567 10431 9574 2893
21732 2893 -8367 -9958 -22010 -24293 -20569 -24159 -27267 -23407 -18380 -17546 -7571 1409 -2168 2725
21718 2725 -15669 -21636 -13330 -24468 -11795 -220 6413 3108 2265 2674 7129 -1776 -11754 -12846
21704 -12846 -18724 -18021 -1655 -4193 -17185 -8882 -3358 271 -41 -4143 -62 -2054 -15953 -14138
21690 -14138 -6383 -15603 -16019 -9710 -2481 -6005 -29601 -36469 -32876 -22338 -19659 -8179 -20680 -24806
21676 -24806 -207 8162 10868 -675 -16003 -22915 -27037 -16581 -11720 -14143 -9194 -3462 -6724
21663 -6724 -10100 -6730 -271 4307 -2844 390 -1098 -13957 -11078 -23401 -11049 -3726 3663 10430
21649 10430 1291 7788 -4068 -26536 -19404 -16920 -29360 -26851 -26632 -21966 -20692 -4245 21619
21636 21619 22918 2944 612 2865 5368 -1031 -14280 -24023 -20532 -17388 -13809 -7428 -9143 5757
21622 5757 9096 -4437 -6390 -18672 -18097 -16496 -9819 -9573 -10025 3683 -6766 -5330 6807 3789
21608 3789 -9966 -26900 -34741 -30915 -37208 -34834 -33228 -17325 -11387 -9122 5516 3209 -5426 -10047
21594 -10047 -26018 -12017 -5405 -9393 -21738 -27339 -26668 -11319 -3042 5582 2283 -7572 -5856 1611
21580 1611 8779 15857 3410 7747 15369 20206 15135 -12670 -22415 -23373 -27478 -27835 -34333 -22110
21566 -22110 -17119 -8321 -7002 -2658 -4293 5271 18280 2732 -3879 -2492 -577 -11819 -14285 -19942
21552 -19942 -12114 3343 21924 17841 2886 -740 -2989 -3210 4664 14745 2810 -18722 -7634
21539 -7634 -3484 -2437 -685 -633 14186 8468 7568 8513 4679 12568 3464 -7200 -3998 -4531 -3388
21524 -3388 3483 -1419 -14853 -20422 2111 38561 32242 1912 -21160 -23902 -21539 4741 32006
21511 32006 32385 33203 15116 15438 19387 13745 10710 22347 11579 18250 13631 6618 16234 16266 20473
21496 20473 12073 18784 -4062 -16856 -15689 1823 7181 -2631 -2280 13758 21973 27810 14130
21483 14130 6159 10897 7682 -616 3951 15400 4919 -10609 -23563 -31035 -34036 -30691 -16749
21470 -16749 -27204 -35027 -27445 -20104 -8357 -6046 -9724 -4102 -2639 -74 -661 -13424 -4611 6587
21456 6587 10593 -1556 -5615 2894 -1302 -9894 -22687 -32780 -32804 -26826 -15422 -20776 -16508 -7305
21442 -7305 9889 10840 4515 -1403 20198 24249 -1337 -17414 -20251 -10082 1828 13921 12449
21429 12449 14385 24737 22433 23097 5533 8185 18452 32818 33026 26418 5800 -2862 10646
21416 10646 14913 17381 20984 33264 31944 5882 -4740 -13878 -8035 -7456 -17058 -26241 -37153 -41216
21402 -41216 -25925 -7108 -4155 4067 27832 25894 8335 4522 -3868 -2241 -1396 3654 -5429 -11308
21388 -11308 -100 18405 23015 14746 1659 -13130 -19412 -12512 2407 15686 24080 32375 23484
21375 23484 4635 -9901 -11706 643 11117 -956 -17189 -20556 -13620 -2931 -1472 -1620 4826
21362 4826 4608 8981 13536 18178 29793 31000 33751 31392 14901 9259 14218 14528 -2512 -22352
21348 -22352 -21805 -9481 4025 -1635 7189 16479 17633 3992 -8903 -8851 -9492 -10569 -29960 -32050
21334 -32050 -19039 -15963 -23669 -27654 -19778 -10304 -12001 -27991 -38375 -10691 -4119 1013 25349
21321 25349 27025 17703 8151 5909 14802 15374 14784 22959 10034 -1979 -9030 -925 5892 16264
21307 16264 19437 -1322 4851 -8708 -10360 -3619 -8582 -15273 -883 5821 442 -4350 -16968
21294 -16968 -25565 -33589 -23946 4533 9304 -2142 -10291 -12642 1042 15714 -434 -8519 -15976
21281 -15976 -16552 -18867 -8983 -704 8210 -2781 -12756 -6534 -4615 6925 2423 8192 8782 728
21267 728 -9445 -18495 -4387 -7555 -5501 -14052 -19996 -1215 3980 -6607 -10194 -9166 -15534 -21719
21253 -21719 -8808 5710 18856 8298 -436 -5010 2436 11736 24622 8190 11326 11515 6741
21240 6741 -1269 -2224 -4180 2422 6773 7164 15700 32261 26696 20134 22038 14322 8112 -7910 -3578
21225 -3578 1824 256 1902 3455 7417 -5197 -7731 -1975 -1014 -8568 -130 3183 8900 -4656
21211 -4656 -5875 -7173 -1701 9856 17953 16067 15016 -286 -34760 -47046 -33042 -31158 -30498 -11846
21197 -11846 -6582 -19735 -26313 -22234 -24614 -24028 -31798 -27426 -15450 -15705 -12492 -12405 -12068 -13349 -6469
21182 -6469 -13096 -13041 -7561 -1719 -16552 -15279 -8986 1785 6504 -6283 2254 8310 19279 5073
21168 5073 -629 -3075 -6026 -15452 -22395 -2284 1843 -11563 -22751 -16239 -9410 -1549 4711 -7362
21154 -7362 -5440 -8302 -28440 -34664 -28617 -17545 -4440 17011 24600 17052 2550 7169 5751
21141 5751 303 11131 -1391 -2888 496 -5313 -5642 -6766 -18847 -22769 -11988 4063 4815 4978
21127 4978 9753 5117 16972 16293 645 -13253 -17130 -21593 -14931 -7875 -10551 64 4089 -9339
21113 -9339 -7489 -5989 -12712 -10585 -4638 -16139 -30531 -29043 -28351 -39106 -26624 -11725 -14684 -13323
21099 -13323 4390 21944 30866 35936 25197 -357 -18845 -15312 -3002 17148 24326 16722 3394
21086 3394 -14318 -18898 -6080 8827 -695 -11420 -4439 10268 5591 4808 5699 -2789 -24894 -590
21072 -590 16682 27250 8377 -6442 7520 17527 24791 41093 28357 18884 -256 -25364
21060 -25364 -19364 7464 4984 -19729 -26017 -5971 2494 -6590 -11987 -11572 -9133 -3939 -1526 3149
21046 3149 1787 -13718 -18311 -1972 11041 20462 14900 5724 -952 9922 4993 -8245 -15034
21033 -15034 -3664 -6568 -8517 -10775 -11677 -5440 1653 -1377 -643 -9182 -5000 -1966 5654 14369 9648
21018 9648 18002 20593 4918 -12223 -12801 -8077 -2260 -5865 -17730 -13941 -4379 4712 6069 6142 11886
21003 11886 17864 22087 12928 1451 14604 21047 3362 -7719 -2899 2784 -531 -8396 -7614 2748
20989 2748 19895 19060 31106 22016 11664 21171 25327 -1598 -19662 -27438 -26893 -11202 5748
20976 5748 15348 372 -2573 -5512 7209 12718 21447 20417 26996 16172 -4748 5387 6700
20963 6700 2518 -1392 -866 20851 28204 24735 2149 -6162 -4224 7969 23166 47552 47485 23225
20949 23225 10415 -455 -1658 -1949 -1880 -261 7832 20172 19746 7088 -6625 1459 11318 6909
20935 6909 2294 9176 8149 6630 -1839 3475 -2563 -2707 13418 8035 -3623 -20946 -13036 -5112
20921 -5112 7920 -1600 -1339 12525 23622 19626 21611 15423 -3629 1288 4760 3310 -3567 -9332
20907 -9332 -7810 -1366 -683 7233 15337 1511 -13197 -9692 -15966 -17121 -5511 -592 -10603 -20530
20893 -20530 -29775 -22240 -22257 -26887 -30000 -16578 -3565 -5842 -13813 -13761 10008 -1416 -9092 4505
20879 4505 4133 -5757 -11020 -18513 -11308 -5154 3609 -6514 -4075 -1407 8933 8871 10185 15185 17551
20864 17551 13912 18598 15230 8320 4406 1973 3858 -17749 -23952 -33265 -27643 -20591 -19793 -17634
20850 -17634 -20681 -11018 -4767 -8061 -6724 -2126 -6385 -20920 -17987 -935 8231 -12744 -13603 -7141
20836 -7141 79 -14398 -9519 -9865 -10001 -1026 3644 -5588 -2293 -6742 -6175 -3071 4051 3763 7214
20821 7214 11988 -5892 -13646 -17373 -2038 -8446 -24015 -23296 -15640 -13342 -3041 3810 -8782 -20868
20807 -20868 -25332 -31357 -38799 -48214 -39123 -26640 -37815 -20268 162 -11926 -20811 -27584 -23006
20794 -23006 -23455 -13903 -8618 -6757 -5332 7086 5293 10047 -1441 3498 11411 -602 -2279 -4554
20780 -4554 -21055 -21176 -21061 -26400 -21681 -11880 7576 15908 20300 16712 13506 -1962 2476 9582
20766 9582 -4420 -16476 -16834 -20224 -24654 -15951 -13613 -6505 -2779 13799 14084 -6984 -21988 -42538
20752 -42538 -35790 -31475 -30170 -11370 -826 -6385 -20466 -24044 -20283 -5946 -9832 -19807 -23893
20739 -23893 -19826 -16623 -2226 2473 9214 10482 17834 18658 10242 -10085 -17448 -2158 -677 -3960
20725 -3960 40 -2152 12852 9487 -6907 -14510 -14070 -12639 -8787 -9380 -16917 -20165 -11323 -7565 -4634
20710 -4634 2547 -3315 -4042 -14703 -18299 -5466 -9608 -12591 -4543 -22946 -18575 -2975 -10413 -15776
20696 -15776 -6677 -943 -231 11455 8983 15230 28034 20875 11277 1923 3831 9984 12038 12361
20682 12361 7407 5722 390 14562 25441 6965 -1424 3143 11920 8450 8133 8469 576 -6233
20668 -6233 5038 14400 97 -14006 -12527 -13124 -15826 -13968 -6774 -227 -11508 -16313 -15764 -15232
20654 -15232 -4680 -9626 -21632 -21980 -14270 -10612 -8592 -16259 -4514 -388 -16214 -34541 -33719 -25847
20640 -25847 -13796 -16293 -7824 -7188 -6022 -1434 -10883 -12981 -21303 -28451 -26303 -9403 -8805 -7891 -10441
20625 -10441 -6860 1362 7119 8335 7748 -9588 -6218 -1791 -5432 250 1075 7308 2060 9904 14631
20610 14631 -1844 -5867 -12846 -6308 3410 2502 9810 18775 14569 2023 -3526 -24937 -22480 -3876
20596 -3876 7713 16764 19082 12687 7425 5799 -8240 -2858 -11298 -26887 -27579 -14792 -5899 -1158
20582 -1158 -2782 2126 -4085 450 -753 -10537 -14188 -1819 -5019 687 13796 19833 9524 -2052
20568 -2052 -12393 -9743 -7687 17517 17228 -641 2788 -5114 -15334 -15961 -15853 -21374 -12806 -10795
20554 -10795 2631 -596 -10824 -17016 -15931 -3346 -350 5106 4382 -5358 -12412 -8938 -2196 5891
20540 5891 6488 7814 19184 18643 19398 14279 -2160 -13161 -7358 5421 12334 9513 8234 7904 4584
20525 4584 5427 3280 -5346 -15133 -9497 175 4168 12707 7019 6076 4942 11387 20608 14199 16979
20510 16979 11468 7432 10968 24268 15990 4024 11968 -5424 161 4618 -2663 -9270 -18651 -25633
20496 -25633 -35503 -47155 -43316 -25018 -17498 -18552 -10493 -8998 -3321 -580 -2297 6837 27513 28856
20482 28856 14666 13134 13544 -10951 -9507 12234 21811 9293 -5762 -8672 17802 34698 31272
20469 31272 12108 5876 -8538 -15416 -22080 -11622 1653 5702 -8643 -3107 -1395 -2773 -7355
20456 -7355 -9164 -7546 -2103 -5273 1266 -3157 -11420 -16507 -14395 -11074 -7775 -3555 748 -1228 -6503
20441 -6503 -15715 -13017 -22763 -21480 -1353 -1230 10768 18636 15367 18416 16593 14238 15251 14535 14083
20426 14083 12218 16137 19179 21148 17683 -3374 -8454 1674 -2829 3065 10099 4032 -9842 3579
20412 3579 16684 18960 6204 -3464 -6171 6129 9035 2197 4805 -3438 -2410 318 -9477 -9346
20398 -9346 -17043 -17312 -13011 -1649 15457 28210 36607 18616 356 -2695 -7410 -5916 -6792 5197
20384 5197 10365 413 -2094 -12997 80 6750 6918 -1402 -8633 -1623 7820 6251 12151 16263
20370 16263 8272 10429 18083 25407 7954 -8027 -2135 9697 18102 12731 2872 -6596 -23706
20357 -23706 -24149 -21966 -12032 -18950 -10375 5079 -983 -8605 -9765 -10839 -8717 -4878 -4106 -13220 -18925
20342 -18925 -13180 -8477 -9403 -14445 -9098 -6945 -10549 1850 376 -10562 -7421 -11458 -16060 -8834
20328 -8834 -3891 -5697 6586 17525 24315 14121 11865 3983 -15191 2494 13299 15471 7724
20315 7724 6005 7717 9388 8514 -9716 -241 -2686 -2902 -7375 -366 8791 6462 7313 -4206 -17506
20300 -17506 -17253 -14089 2087 11775 4024 -12413 -2194 15997 18271 19087 14426 -10460 -13076 -2282
20286 -2282 -15924 -21201 -16878 -27391 -26613 -9662 10517 9344 808 -1939 -5686 -21636 -4575
20273 -4575 -1330 -5990 -9708 -15791 -5814 -1715 9869 11838 15471 17610 26367 27462 22604 26871
20259 26871 21099 15658 12014 13666 15390 11727 11682 11243 1860 -9136 -17947 -11487 -8606 -2388 -400
20244 -400 -19932 -9761 -16531 -19343 -23986 -16007 -8239 -3436 -9207 -8464 -8505 2206 2890 3443 7553
20229 7553 21047 14952 14747 14024 19828 17520 16774 11892 3583 12131 18809 16068 15792 14973 12405 13102
20213 13102 10110 -2351 -10360 -23083 -12512 4327 15729 20350 13021 13890 17762 14704 19970
20200 19970 25501 13598 5080 8853 9526 1812 9557 22554 16271 15774 7984 -9074 -14466 -14162
20186 -14162 -11098 3141 11416 5861 -6113 -5708 -598 6566 14205 19893 7141 -1786 -20587 -33269
20172 -33269 -33131 -28632 -11762 2915 22381 20373 -2760 -14091 -9522 -4096 -5708 -23927 -21503
20159 -21503 -2024 12138 12905 6970 15303 19441 13325 15475 9619 1267 12174 18856 16327 1097
20145 1097 -5117 -5060 -592 7886 9016 14635 15203 -3408 -11005 7935 20207 14961 20366 2350
20131 2350 -5807 -8426 -10519 9364 13611 4729 -4658 24508 41113 27024 11483 9736 24487
20118 24487 43930 33854 19412 20158 16909 5111 -729 -13368 -15814 -5111 12101 16368 24521
20105 24521 20177 12954 4733 6890 16697 17247 14699 17206 2505 -10121 -6726 -2314 -2072 12599
20091 12599 15839 3715 138 17434 32540 33657 28131 17430 -3797 938 632 3195 -5731
20078 -5731 -8610 8115 18703 23932 10390 11121 14438 28757 28544 28094 28736 18157 15128 15828 11274
20063 11274 10599 20927 23685 9949 -5229 -6070 -1578 7725 8976 10755 13193 -1223 -11597 -8932
20049 -8932 14569 31163 41386 43406 39568 36112 34786 37471 26102 36045 23182 20992 20852 4428
20035 4428 5624 11308 10613 -2489 -9900 8462 9590 11289 35285 32910 30127 23303 29320 38081
20021 38081 30901 18259 10913 15225 5473 4017 7545 12832 16598 9268 26017 30848 21234 21519
20007 21519 35099 46643 49239 47147 42542 24442 15551 22994 22460 16379 4999 2903 11781 22990
19993 22990 31844 26507 18363 12439 120 3834 17444 25608 16037 23248 32931 28527 30394 30323
19979 30323 21599 29472 40591 46302 42000 28321 26874 31095 37694 28386 35201 68215 103781
19966 103781 144857 193758 245480 305055 353855 376872 392310 383483 362473 314821 251526 190689
19954 190689 144485 123165 115417 111050 115747 131133 137881 154930 198107 263011 341571 394338
19942 394338 408112 398949 397107 371098 339626 295943 234759 194065 161086 128011 107770 112614
19930 112614 107543 94473 86086 78536 68221 52707 42350 48635 47601 46472 59639 61028 56302
19917 56302 53449 56317 45774 45718 38082 38967 52706 51259 43069 34106 29724 34348 18797 18727 21654
19902 21654 33991 40939 43860 45324 46514 47909 51601 44286 23169 25519 26060 24473 36200 38606
19888 38606 38655 31580 24843 12516 15585 35843 40850 27975 27733 23961 24809 33006 38478 18253
19874 18253 10611 20348 19057 18519 21054 32562 38902 33587 23576 24981 21056 2675 -579 3839
19860 3839 767 3041 5132 15917 7984 -7979 -2195 12553 8636 3328 8594 17174 14913 15841
19846 15841 11063 12228 30164 15610 -4871 -20903 -13828 13049 17332 13746 8457 15247 25308
19833 25308 17951 -2269 1099 1899 -5876 135 6632 9208 -9825 -9605 5526 13477 6890 3419
19819 3419 10602 24527 35409 45637 48923 42975 38998 20029 12141 19794 20912 16938 16099 30088
19805 30088 36034 39652 34127 29939 23788 13955 34718 49297 22957 7329 24197 30390 26994
19792 26994 30312 22477 14735 10458 15444 22690 28426 23167 27523 20490 14478 14769 20111 22629 18051
19777 18051 10103 15306 19956 18105 19646 26664 33188 23868 19616 26955 37361 40188 25325 27461
19763 27461 24348 16326 4899 9094 16230 16577 28735 32153 31430 29486 29243 35269 38968 31905 40517
19748 40517 44627 41276 43689 36346 28496 34805 40069 43445 46004 52132 52853 58321 38850 46348
19734 46348 51383 45737 36843 45397 43745 51815 52965 49219 48127 41219 31564 23076 33224 38271
19720 38271 30020 29563 29263 26924 28773 24724 28939 29594 23317 23392 31146 30694 18697 29184 38379
19705 38379 39533 31859 37312 44524 20688 17895 20464 16080 22203 40824 49900 50898 47445 36441
19691 36441 49238 46172 48600 48064 26200 21645 22167 51377 68883 67877 60590 51911 27755 15475
19677 15475 13060 11958 23237 23026 21119 34573 25868 16734 26071 33042 32320 48290 50964 47039
19663 47039 40453 43537 48964 48264 31957 27014 36175 42526 36374 38081 60704 59087 51923 40092
19649 40092 38005 39232 47028 50529 48757 39505 43195 57075 47954 38685 53614 50446 39088 42720
19635 42720 64701 73895 83159 85994 76104 62995 62675 69020 70987 63104 48354 41818 46645 39435
19621 39435 38602 61073 73631 68153 69640 85771 84803 86176 90943 92731 79969 64791 60463 60333
19607 60333 66349 57366 71757 62564 43053 39896 59761 102469 113565 111917 115153 104246 98286
19594 98286 83429 69817 58805 58962 67221 77462 83648 69942 68709 71286 73922 70117 74092
19581 74092 70765 67789 62434 65119 71257 69308 62686 66785 75348 75753 66538 72636 68360 48605
19567 48605 56092 53734 53133 81790 91360 72697 57520 59620 60107 57667 69060 74280 83998 82481
19553 82481 74651 62497 51525 41855 49109 49422 50326 60971 75927 82480 88412 89714 86747 91450
19539 91450 82964 84573 97958 94272 88690 94108 112665 124722 150756 201856 267340 352110 414567
19526 414567 414381 407145 409272 404830 365537 292735 239384 211426 182913 175159 163460 163148 184970
19513 184970 198790 226163 278810 377690 496939 596987 614432 580907 557506 557286 526146
19502 526146 435684 344055 293696 259867 249144 241428 249432 247581 248531 255104 245758 240965 244200
19489 244200 267256 278063 262329 245548 229309 213431 214083 216432 204880 201812 210655 209126 203599
19476 203599 219638 251068 282883 300508 304439 304028 296285 281476 271060 258881 263898 268107 252472
19463 252472 236020 248490 253307 254752 265857 272331 287453 292204 293288 309553 325935 329031 309991
19450 309991 301215 306152 281837 272671 279766 282087 274312 278121 280648 285825 278766 284192 299668 329772
19436 329772 353063 370764 387983 381336 375417 400269 418514 429007 428693 422525 424845 429291 447911
19423 447911 463285 482520 533203 589269 641104 691278 737917 812366 896735 961748 995597
19412 995597 1026239 1065079 1128414 1165554 1161539 1126226 1099967 1101263 1120061 1122956 1131532 1178990
19400 1178990 1210895 1258452 1345165 1435849 1506979 1558373 1621144 1683319 1741429 1830311 1934216
19389 1934216 2012691 2060420 2112112 2187726 2305057 2424476 2534058 2707742 2926757 3202077
19379 3202077 3573099 4001441 4473763 5037883 5765231 6703013 7906421 9547361 11900246
19370 11900246 15338480 20569373 28675097 40351581 53522612 62417113 64590393 63425021
19362 63425021 62192554 60375729 53293377 41768352 31976717 25692310 22052637 20167134
19354 20167134 19565714 20054758 21668821 24708242 29714835 37674668 49382888 63005827
19346 63005827 72527203 74718469 72861770 70717596 68208004 60404660 47207993 35414269
19338 35414269 27401574 22264917 18919264 16700716 15176181 14132229 13420929 12844625
19330 12844625 12253547 11562337 10837455 10140794 9494342 8905036 8413306 8024913 7713472
19321 7713472 7419078 7119444 6826370 6596836 6406609 6204685 6001004 5833499 5681974
19312 5681974 5514088 5326459 5129094 4933508 4743959 4543639 4326860 4167848 4075644 4029743
19302 4029743 3966111 3852388 3770163 3693155 3608871 3504312 3393980 3316418 3249732 3195259 3125711
19291 3125711 3072631 3018442 2916649 2769723 2628058 2522807 2385743 2269320 2182429 2100616
19281 2100616 2022464 1963535 1898373 1835946 1790602 1761167 1740823 1721820 1717974 1731400 1726797 1692519
19269 1692519 1658686 1608288 1544408 1467844 1391183 1317097 1250792 1225219 1204892 1150480 1117182
19258 1117182 1093749 1070635 1040634 1007023 992098 974438 955286 924994 908566 894418 857804
19247 857804 823557 803241 783031 774693 745587 722688 709612 702032 688669 654589 624272 610138
19235 610138 610009 603078 577999 536122 516803 497136 456501 431212 398653 380222 367734 349389
19223 349389 334530 337318 338585 342420 335653 330359 309050 307810 301249 297350 276665 259735 242290
19210 242290 245373 251944 252390 236021 230693 227044 222357 222160 233686 231051 235981 243020 235075 214552
19196 214552 201791 198764 206651 200589 190353 205327 222707 229454 233213 237546 244345 253495 238441
19183 238441 228886 237438 230809 221692 218367 194585 177889 185512 216784 215932 212563 206176 186233
19170 186233 186473 192571 200337 210287 223107 225305 214312 207265 215579 212799 208038 203161 190414 192870
19156 192870 185783 188664 184050 172136 160867 169866 183609 168190 169605 186135 188300 186023 171086
19143 171086 161404 159358 158355 149314 136960 128519 135984 134232 112482 96094 116663 137055 138291
19130 138291 139714 135885 134139 136171 129102 131796 150704 154208 141138 129012 118505 121176 127919
19117 127919 117508 117114 118062 118392 108919 116466 123286 132910 124752 122203 112409 116993 115858 107675 99846
19102 99846 110317 104127 102812 109215 109217 112075 108015 112046 116982 115234 105872 102706 94199 78448 84180
19087 84180 82281 66850 51049 36457 37615 40870 53403 62165 66683 60156 76124 85814 79561
19074 79561 71659 81573 98243 117879 106192 90927 87100 91310 102370 114304 113313 109025 102148
19061 102148 137632 179662 188441 215048 270571 310730 334719 326426 323287 289211 283942 284390 238665
19048 238665 200405 181236 176902 177203 168345 179291 206779 232220 256158 293041 322028 350917
19036 350917 365036 368473 359459 334655 319639 309105 277787 253210 223555 218301 216535 212754
19024 212754 225520 230249 236501 249767 240626 217389 213404 217380 215168 227221 244215 237503 228978
19011 228978 225489 222010 212618 210814 219738 225606 227201 225497 230506 245746 260008 264780 269900 261027
18997 261027 283506 305799 295569 259219 235793 255762 261189 262451 265174 295185 296536 312152
18985 312152 328699 328931 333757 333795 313275 296930 289571 291534 294293 302390 311262 314602 331417 387224
18971 387224 416354 454308 505269 538073 557631 579259 612093 624549 640657 670523 699629
18960 699629 751075 796563 833625 910854 1039022 1216807 1426007 1653853 1845470 2025416
18950 2025416 2226358 2423927 2578233 2658953 2790614 3016962 3258523 3563781 3994149 4599819
18940 4599819 5385477 6461052 8040942 10331416 13860997 19770927 30227853 47957760
18932 47957760 69695725 81140940 79833001 75479700 74363103 75840345 64281709 43679072
18924 43679072 30109727 22957449 19204609 17370907 16771442 17123989 18501660 21241609
18916 21241609 26090350 34641358 49480072 68723890 79740625 78578450 73993163 72103178
18908 72103178 73151674 63491170 43933577 30314881 22796421 18395813 15737538 14101332
18900 14101332 13012626 12295711 11907673 11628585 11187256 10553327 9874701 9319001 8894365
18891 8894365 8543294 8184162 7805110 7427829 7103486 6795286 6435873 6050039 5729908
18882 5729908 5468738 5238164 5020179 4801770 4610302 4419745 4228020 4066977 3921025
18873 3921025 3770842 3631460 3493155 3408643 3323092 3224454 3119303 3039570 2935878 2850127
18863 2850127 2748995 2654012 2585859 2503171 2419204 2327007 2242499 2172204 2107256 2047350 1983176
18852 1983176 1946622 1897982 1833867 1778821 1728605 1678000 1633865 1572119 1514943 1465878 1424070
18841 1424070 1396920 1365176 1312907 1276505 1247808 1217788 1197463 1174253 1134893 1114246 1095275
18830 1095275 1060735 1050386 1037380 1005470 982135 952293 918853 879756 855544 827111 826686 804957
18818 804957 789232 778671 745997 715408 694971 680400 662743 637489 608269 586232 568170
18807 568170 581115 588068 578859 555415 523548 497528 487261 463503 437447 418394 405587 390807
18795 390807 358246 337650 315796 292997 281032 291759 316820 331746 335133 344443 356687 386374
18783 386374 455968 548536 577538 553691 508811 491147 499109 464499 404313 350545 316420 315608
18771 315608 331132 345036 345065 347499 358721 368936 397730 485144 598695 703503 790244 848128
18759 848128 853315 842159 791502 713193 613868 514227 433255 379545 351195 331347 322215 326543
18747 326543 332441 337813 361021 385636 416043 457588 496129 506650 504321 490513 466021 443432
18735 443432 411980 366605 307381 258771 246294 239702 229688 217373 207512 195830 202680 200093
18723 200093 186498 178205 169618 155925 152339 161080 165777 162154 149656 149604 157948 161016 162636 143331
18709 143331 130370 130383 132233 143182 155165 146618 140824 136543 125549 120164 123883 125499 124399 113432
18695 113432 102813 93604 103224 96701 83855 82097 93710 105556 117700 119925 120610 115145 107345
18682 107345 105210 100434 99837 107375 103989 92979 92804 78855 79111 76713 73536 67813 59717 58732 61499
18667 61499 47410 58549 70248 56306 49331 54495 63936 70453 72964 82516 78785 67688 57753
18654 57753 68998 67414 54405 53852 46892 48449 35244 20215 22220 9072 -6262 2907 3348
18641 3348 1521 5315 6844 1139 4092 17733 23520 23379 29118 16399 12280 13928 16412 2477
18627 2477 6603 28480 31124 27793 23927 29306 24472 14319 -11537 -24714 -18984 -12378 8576
18614 8576 21146 23722 16449 3702 2613 -1158 1955 4618 -10225 -7134 -27 13080 20774 19828
18600 19828 22189 27461 32184 26658 12347 4275 21697 19472 19222 27304 23640 14907 -1123 -1404
18586 -1404 -5111 -10662 -9861 -577 4047 -651 -1062 4961 4115 -14932 -20593 -25001 -5411 6750 21450
18571 21450 28026 21687 30751 37810 37753 26116 17349 25488 48256 42668 25040 18240 15321 16134
18557 16134 17584 25733 16547 2456 13280 15019 11129 4691 4232 27172 28263 3993 -18826
18544 -18826 -18894 -16712 -309 25384 38623 35737 34594 14238 -4792 -12417 -8410 -416 -2926 12382
18530 12382 6533 -3358 3282 6506 18471 11813 19086 16584 14758 1960 1303 13127 22341 17214
18516 17214 -2287 -19850 -8882 1229 2346 3890 12592 15798 19823 25627 20342 14221 12328
18503 12328 4181 2193 -5060 -15486 -15708 5625 8783 9848 -5324 -11220 -9607 -17485 -7852 -1452
18489 -1452 -5586 -1187 -7556 -12134 765 -1186 -3345 -766 3326 2037 4055 1443 -5963 3991
18475 3991 312 -8088 -20864 -17398 -16497 8864 3307 -687 -15935 -19686 -17857 -154 -1446 2727
18461 2727 11037 5934 3475 -6644 -3694 4313 -2361 -7837 -24513 -21864 -20663 -27911 -28738 -24053
18447 -24053 -27846 -15506 -3765 12987 20498 -2462 -8575 -8010 1754 3502 -15439 -17726 -11803
18434 -11803 -6801 -3342 -12049 -14349 1485 4025 1681 926 4828 -5934 -15947 -16534 -13711 -1281
18420 -1281 -6742 -3816 1161 -8704 -20804 -17416 -20786 -17405 -9385 6171 14722 2773 -18059 -16658
18406 -16658 -7394 -717 3857 71 -9058 -20406 -11920 -18563 -13142 -13387 -10103 -10985 -8379 -2411 -9579
18391 -9579 -3690 -4493 -5044 -2889 -1454 13456 25933 31461 10611 75 906 -2101 -16526 -20913
18377 -20913 -5856 3517 4654 -1275 -3944 -3992 749 -5645 -3676 1531 8561 14934 14482 8764 -9019
18362 -9019 -3948 4556 -1095 -3736 -5557 853 12635 1885 -9259 904 923 -9649 -6295 25544
18348 25544 31291 20342 18312 6012 17329 13597 12320 3528 12707 18673 20356 21685 37500
18335 37500 58080 64207 65556 102324 180533 276997 391704 451754 437342 418382 414704 411594
18323 411594 340368 242589 165706 127317 110497 86114 90365 116410 131502 154512 181180 225846
18311 225846 311778 406436 464746 452467 418490 404321 408397 356756 257145 191972 151272 109947
18299 109947 95369 91830 90139 74911 61711 56663 59867 41172 35602 37904 38581 48002 53055
18286 53055 49730 47590 32991 22675 28134 36348 39105 23135 22568 43735 38735 26107 26632 30400
18272 30400 28565 17820 9412 -2612 1615 10328 6260 6497 2443 -8635 -13901 -3443 -518 -1847
18258 -1847 -13021 1383 15676 15703 10802 9488 15563 32989 31254 33817 37294 28063 -750 -8949
18244 -8949 3040 16613 24452 25673 26490 14044 343 19623 28989 26293 11508 3401 6189
18231 6189 10637 8551 -5293 -5576 -3637 962 910 3350 3681 -6381 7471 26023 11934 3874
18217 3874 7263 30128 25203 9234 9432 2407 3854 13015 23575 40757 46859 32748 18421
18204 18421 20495 20508 25176 29556 35002 32234 22126 19619 18740 17149 14440 7657 4769 4132 27877
18189 27877 28061 11312 14326 17340 26294 24345 14475 14348 5232 -7147 1309 23692 33747 22856
18175 22856 17734 14133 27014 39165 34010 30480 19150 14050 17229 19859 19644 9570 15399 29639
18161 29639 16449 7456 10061 18028 21083 21343 30527 40182 36416 32219 38315 50450 51791 56662
18147 56662 51669 49205 52573 56270 59007 82667 87292 81169 81750 92246 112862 127638 135341 141455
18133 141455 163778 183791 204376 232652 270015 318855 338714 366627 409641 482118 580224
18122 580224 690354 844468 1063111 1368885 1823247 2563976 3935401 6491002 10280251
18113 10280251 12939386 12926756 12028594 11604582 12108085 11070054 7293143 4592637 3208846
18104 3208846 2462291 2029385 1792434 1643714 1524080 1465540 1444865 1392981 1301242 1205863
18094 1205863 1117882 1026589 965666 903687 842221 810094 795465 812157 878483 916592 900954
18083 900954 865765 835249 822140 782077 677477 594030 530309 498459 482145 463175 450895
18072 450895 425030 412366 406720 396741 378102 362102 328918 318282 310165 283757 268385 262117
18060 262117 248259 237139 237300 223641 218877 221947 207992 205563 209034 209683 213006 213549 183740 174318
18046 174318 171669 160895 152601 155255 160777 159462 161801 169625 159807 140705 136868 119520 98607
18033 98607 109752 125140 117217 108684 106917 105201 93838 86835 84909 78422 78858 74387 84521 87823
18019 87823 66911 64506 57118 56753 37616 27390 42679 45947 57478 45535 45942 48983 54867
18006 54867 60008 62378 65741 59776 42975 47266 52583 44633 48214 48391 47624 53460 44923 37371 28476
17991 28476 43283 41968 54973 53055 49075 38451 33551 42733 39124 18290 17139 24611 30275
17978 30275 28044 16461 11382 19090 15773 17607 21798 15051 12214 20209 12642 12044 10761 4465
17964 4465 4612 -244 8933 -2342 -9892 -14232 -1085 17035 28745 13176 -5392 6278 24042
17951 24042 21395 4315 -8676 7441 23743 22236 8773 -18935 -12246 -6668 -760 20394 31121
17938 31121 24324 19737 2758 -3071 12055 13600 18186 9127 7208 8399 -224 -11950 -9717 -3921
17924 -3921 -13102 -23700 -1816 9215 3183 9151 10376 -4084 6039 8458 -5001 -6508 7619
17911 7619 18089 24582 26892 22154 5489 -10822 -2226 -16253 -16463 -8533 -9017 -2533 1902 918
17897 918 -2160 -2343 -5044 -3661 -10554 -8501 -1815 -12583 -17671 -5169 20889 18377 14850 10682
17883 10682 -8726 -21062 -20091 -15368 -11634 3019 692 875 4042 5371 17451 14931 10383 13832
17869 13832 28750 14863 19529 17296 8410 17138 16610 8442 -2460 -5212 -959 4841 6862 10547
17855 10547 14602 14755 -476 -20640 -26109 -9902 -6531 -5998 -6450 -32166 -45717 -39768 -18264 -14028
17841 -14028 -6721 -10703 -30988 -29631 -10520 9835 12401 -669 -12139 -21821 -15274 -25571 -43192
17828 -43192 -39436 -36401 -34658 -20731 1593 -4130 -5158 -8570 -9119 -6669 -5540 3783 3569 2653 857
17813 857 -2421 -7188 16410 19698 11552 6689 -1505 -1798 -16256 -16771 -3426 -9115 -14081 -17562 -10330
17798 -10330 6318 20196 28030 10113 3195 19124 6068 -1851 -11351 -2679 9204 2192 3714
17785 3714 -1483 1488 1574 743 18133 27217 8069 4233 -21826 -24706 -13367 -2633 12568 7852
17771 7852 6827 16183 12691 -3021 -12361 -13514 -12253 -15978 -24404 -9774 -2215 -6525 -4847 4290
17757 4290 -3604 2725 1673 1205 5201 -7171 -31848 -15955 -8378 -15129 -10125 -1902 -6878 -13811
17743 -13811 -21086 -6179 8025 4914 2693 2404 8292 2590 -2542 5061 12482 1350 10902 22214
17729 22214 12972 911 13251 -2985 2017 6165 -1450 5688 10630 11536 14973 8199 8466 15459
17715 15459 -1331 -20310 -18736 -9666 -5717 -8089 -3129 -6129 -13482 -19467 -21392 -20482 -7065 -13742
17701 -13742 -15110 -14687 -25597 -36880 -31834 -25498 -26812 -7376 -2349 2850 -3665 -14146 -8403 -8613
17687 -8613 -7930 6950 969 -972 -324 -7542 -5889 -8418 750 -4851 -22680 -23303 -6461 -3081 -4376
17672 -4376 3918 -568 2152 -3439 -13232 7115 6129 10771 18698 25898 30219 27975 21791 14441 22912
17657 22912 7445 -2340 1961 1902 -7125 -7314 -10504 -11896 -221 13878 20718 21381 19979 38600
17643 38600 35274 14998 19868 10886 -502 4466 24059 23752 18983 6679 -3974 -7575 -19814
17630 -19814 -15781 -8396 -5841 -2569 993 778 -8440 -8420 1379 -9270 4890 13072 1404 -6137
17616 -6137 -12700 -5514 5366 17286 15074 9954 3320 -2185 2947 5092 14063 3495 3399 12640
17602 12640 6009 -1008 -7018 -1347 3171 1194 2825 -5525 -9426 1281 -5418 -263 13909 28495
17588 28495 16945 8847 3601 -7928 3271 20432 12131 -5293 1759 4790 1041 13941 9555
17575 9555 -4829 -11459 -3962 -5247 -8958 -9420 -8007 -11013 -7858 -9190 -8166 -16286 -9429 -6106 -15867
17560 -15867 -12549 -12404 -18266 -21223 -16520 -6643 -2964 -5962 -10462 -17250 -12387 -13871 2896 4211
17546 4211 1511 7890 4597 2706 2289 -2263 -6719 -4914 5386 10957 4377 -9255 -10033 -9797 -9195
17531 -9195 -6738 358 15839 22606 16176 6009 -2094 -216 -3976 -9121 -9655 -12949 -4394 -1382
17517 -1382 -4951 6791 10620 4569 2559 4 1010 -11864 -12674 -10104 -617 8777 -3283 -15071
17503 -15071 -1189 -1640 -8783 -6152 -9601 -20891 -17100 -4396 -1221 -2353 -4790 -4315 -8509 -17827
17489 -17827 -24902 -23177 -13058 -20977 -14324 -10709 -17988 -17818 -28552 -29697 -24326 -523 -6124 -20161
17475 -20161 -32451 -27658 -18808 -10101 -5291 -800 -6558 -2274 -5789 -16764 -19290 -21700 -8040 16395
17461 16395 15355 -6984 -18829 -21731 -23110 -15296 -1810 -5577 -8263 5063 24132 29377 19432
17448 19432 37476 65651 75006 68225 64266 61155 40656 13626 3419 6817 14564 13947 17133
17435 17133 14012 -2450 -8681 3047 5627 2200 -7418 -1973 -8656 2231 5764 3759 2379 -11590
17421 -11590 -19908 -13461 -10160 -3180 -1553 -4317 7263 5220 1431 2252 -12471 -27542 -22614 -290
17407 -290 17 -4800 -7757 4407 8186 4229 -6129 -11924 -11365 -5308 -9697 -23029 -21776 -21057 -17827
17392 -17827 -15282 -10393 1563 20485 20300 17082 13660 -902 -5788 -7501 945 -7025 -9119 -3655
17378 -3655 5311 10637 9221 4582 608 8287 4001 -1711 -1847 -5759 -9846 -5512 -20141 -34501
17364 -34501 -24959 -23441 -18427 -16251 -11148 -33558 -37609 -27081 -22412 -24867 -27248 -13983 3885
17351 3885 -7861 -13094 -13740 -7877 -6254 -18937 -16570 -17074 -3745 2774 -4412 -12879 -21135 -9471
17337 -9471 -11642 -22529 -21980 -26464 -4230 9018 6802 11414 -2319 5800 11585 13430 20229 29300
17323 29300 19932 1491 -5610 -311 16736 34010 27437 14245 9193 10389 15374 15178 12810 8187
17309 8187 8821 21326 12552 11437 7498 -17691 -19136 -11836 -14507 -3493 -1663 1839 4931 3449
17295 3449 -1995 9213 2908 -2284 4742 4292 -7576 -33602 -29557 -20326 -21232 -25621 -6592 -10794
17281 -10794 -8063 -792 -5613 -1843 3771 7696 5947 2733 -4536 -16114 -9510 -10771 -23740 -24204
17267 -24204 -28659 -34517 -28675 -20470 -11448 -15819 -14454 -11009 -18120 -36078 -26980 -13424 -14529 -26956
17253 -26956 -8973 -1176 -10150 -15857 -20420 -24391 -24679 -8062 -7117 -7756 3145 2478 -2346 -7183 -25725
17238 -25725 -32779 -20478 -7984 -8947 -8472 -45 17629 12529 -9598 -4477 -7749 -4801 -9804 -7800
17224 -7800 8172 7892 2871 6124 4850 -18011 -24371 -10906 -6247 -14639 -16295 -17089 -21622 -22261 -12106
17209 -12106 -6289 -3722 8923 7022 -4509 -6536 -7745 -1012 8749 1979 -268 -10431 -15099 -13739
17195 -13739 -2450 4233 -5247 -16673 -6852 -661 7010 15586 3653 4221 8823 16485 31141 48957
17181 48957 42919 28770 29384 16919 1462 -13072 -15829 -16998 2661 5124 -214 12830 1838
17168 1838 -1922 1481 -3978 6165 26216 27480 11697 10518 10015 -1263 -1493 5459 4721 3646
17154 3646 -1380 -18850 -10399 2779 -10020 -16960 -8306 -5702 3479 -1689 -5638 -2196 2344 7812
17140 7812 17554 13051 2005 -8796 -3544 -27 -4422 2281 -11269 -18857 -11843 -3883 6487 2123
17126 2123 -162 10302 16684 -10833 -31932 -41374 -30645 -25209 -23954 -13858 -2537 -7792 8371
17113 8371 12281 8728 6362 7860 -14395 -21211 -11200 -6398 -9501 -5362 -1393 -547 9289 2731
17099 2731 -2797 -12875 -21563 -25556 -25819 -26567 -21910 -25008 -24587 -24781 -37011 -39573 -40919 -44261 -46720
17084 -46720 -47099 -31786 -28350 -26550 -18770 -19040 -27841 -32436 -15175 -7595 -13099 -17291 -19582 -22403
17070 -22403 -18378 -23036 -10865 -10152 -18848 -11162 -15337 -22834 -15387 -26867 -19427 -1771 6677 4675
17056 4675 2439 -2872 -5688 -7172 -14561 -22886 -19293 -18557 -20006 -3990 -9631 -3919 -183 -9677 -4522
17041 -4522 635 3243 -4630 -18880 -15580 -5291 3077 4308 10960 -85 3143 9524 7866 21756
17027 21756 14457 12986 -7044 -9450 4604 12410 2953 -16257 -22846 -24666 -15371 -16211 -10232 -16869
17013 -16869 -34973 -24941 -13876 -18319 -18365 -6195 5387 6246 2650 -352 -6757 -15347 -20100 -22463
16999 -22463 -36006 -33110 -21835 -14821 -12329 -12515 -11405 1632 8524 -15943 -11793 -11810 -28783 -18075
16985 -18075 -982 4943 3138 -3983 1846 18098 33717 19414 1580 1565 -13739 -18383 2922
16972 2922 12779 2458 -126 7873 4913 -639 -6846 -4261 3212 3574 10214 11829 22318 23262 17090
16957 17090 454 -8677 -16801 -5453 3158 4485 7839 8183 20164 23191 10589 15516 14737 -769
16943 -769 -15172 -2311 5314 4259 -1897 -9252 6689 19302 20895 18844 11639 5821 7501 -1746
16929 -1746 -9778 -10530 -16355 -16051 -7591 -5987 -6214 -19789 -16075 -16421 -3437 9966 11128 1361 3864
16914 3864 7694 628 8104 14121 15755 2011 8878 17075 17352 15153 2125 11355 13159 5053
16900 5053 -14612 -17096 -16533 -5888 2828 15573 12227 -10085 -17151 -6288 -725 -18835 -16948
16887 -16948 -15029 -8058 2641 -8507 -12803 -17663 -18768 -21113 -19590 -4969 -6993 -4371 -8302 -11405
16873 -11405 -5336 -2114 6423 344 6624 14279 12939 4669 -9447 -3573 -747 1885 259 -53
16859 -53 7805 4382 2166 -7459 -10238 -10750 -10120 -2056 -377 -5791 -4417 -99 -2133 -24 -1515 -11523
16843 -11523 3343 11070 7408 8600 9371 -5458 -12293 -18626 -15732 -422 3688 11025 7712 3060
16829 3060 -11899 -13451 -7075 -8084 -2696 -2786 4047 -4287 1207 4849 2240 -608 8008 567 -2718
16814 -2718 -15916 -27269 -29549 -25270 -6440 5123 -7526 -11371 -10895 -17731 -23655 -37882 -48847
16801 -48847 -44477 -17324 -11487 -17374 -25620 -21512 -15229 -1569 8354 2891 -3474 3479 1579 4339
16787 4339 4253 2146 -2981 -4499 -11717 -27111 -29937 -24868 -17609 -18901 -21337 -21420 -25185 -29303 -14195
16772 -14195 -9539 -19488 -21588 -15922 -2844 7783 -10194 -19388 -8791 -1283 2844 11233 20899
16759 20899 26837 8064 -7276 -5858 -11824 -15256 -19268 -27808 -20451 5867 49 -13568 -24213
16746 -24213 -19614 -2195 5667 5851 6757 11928 475 -14737 -19623 -26888 -18290 6463 -3060 -30558
16732 -30558 -36230 -23929 -4797 10082 2604 11010 17618 8344 -554 -15982 4504 14068 -7193
16719 -7193 -27025 -35840 -37548 -36418 -28042 -10774 -2574 8357 5223 -4192 5548 23554 19518 11152
16705 11152 11221 2915 -12221 -32517 -34057 -28244 -16414 -2173 17853 18486 17134 5087 1743 -3494
16691 -3494 -3210 6923 -1746 -25243 -31065 -21352 -10868 -7015 -6314 -1544 -1092 352 -256 -4754 -1827
16676 -1827 1645 14852 20986 34084 41890 51842 41666 24637 6796 -3180 -171 -5942 4597
16663 4597 10822 8202 26114 27887 12821 11876 5263 7560 5194 -1943 -9747 -6705 5641 13740
16649 13740 18455 3937 -19045 -10267 -4351 -6656 -13505 4169 -7632 -21169 -15998 -7506 -4539
16636 -4539 2859 -25596 -29907 -13017 -16017 -7714 -2950 6154 13333 14925 19404 26812 21221 8764
16622 8764 -1640 -11619 -9394 -5525 508 2031 -593 -12515 -8888 -2409 -1058 13005 9965 3075
16608 3075 -9525 -26166 -40042 -35886 -14280 -9215 -16614 -6659 -3937 407 17924 5160 -1043
16595 -1043 -7794 -1238 -9067 -14171 -21903 -15310 2597 -5516 -2137 14208 8509 -5227 -4856 -16506
16581 -16506 -30637 -28965 -25901 -24535 -16877 -7598 2802 5637 10307 11413 27678 28686 6712
16568 6712 1924 14905 19261 11549 919 11112 10902 10733 19335 9980 -3063 -4682 1632 943
16554 943 -8805 -3717 -471 -4394 -9553 -14241 -16147 -17 490 -7762 -9880 -8111 -11558 1427 7741
16539 7741 -1207 -4998 8258 9774 -6378 -18043 8573 22038 10026 8344 819 -12405 -25031
16526 -25031 -20958 -23983 -24377 -2168 21635 17119 1702 9074 5101 13576 15908 7994 -11693 -1350
16512 -1350 23045 25368 14949 19512 25702 9779 457 -13461 -21025 -17783 -9851 -4995 1772 109
16498 109 2377 9406 3111 -1505 7420 5729 5188 8270 1955 7306 376 -25574 -30211 -26205 -19375
16483 -19375 -17051 -21332 115 9513 -2376 -11382 -23549 -16806 -11157 -26836 -20319 -21859 -26980
16470 -26980 -24102 -13556 5894 -1567 -4267 -19099 -26758 -25723 -27626 -17229 -6189 3556 16232
16457 16232 7554 7900 21029 22703 4109 -7002 -5696 -5076 1994 21200 20323 11495 -949 -6477
16443 -6477 -6129 -3248 -12085 -18295 -15962 -8228 -9097 -5237 -7676 -8749 -19992 -29576 -26016 -9159 -1444
16428 -1444 -211 9308 11679 -8964 -6744 -12865 -22625 -24479 -13467 -7211 -12649 -2392 5725 -11356
16414 -11356 -13251 -4777 2469 9189 768 -9342 -2251 -5126 -17773 -11965 1648 -518 -6247 -5204
16400 -5204 -7934 -5135 1228 10707 14777 1075 -1658 -1804 -11200 -6362 -6744 101 -3592 -4273 5239
16385 5239 11686 18713 175 -6951 -5314 -14281 -15531 -19345 -8583 -808 770 -7100 -6702 -15784
16371 -15784 -19650 -24773 -26936 -11967 -4686 8989 4871 2056 -7580 -7970 -5678 -2160 -623 4920
16357 4920 8217 -10632 -9708 2285 -15833 -27988 -16197 -8150 -7456 -3379 -7714 -2424 2974 -7710
16343 -7710 -14677 -34832 -47030 -33304 -20778 -26360 -20225 -7524 -668 3957 1383 -5974 -3878
16330 -3878 -6845 -24915 -19519 -12829 852 8771 12354 13107 11125 4414 732 -894 9776 248
16316 248 -495 4569 9041 4681 -1299 -1682 -6303 -11158 -9596 -12964 406 7775 18108 21885 24709
16301 24709 10150 -2382 -22838 -32376 -9671 -5582 -176 7183 10183 10244 15704 13442 20209 6557
16287 6557 -11391 -12459 -10483 -13898 -7110 670 11106 16875 6034 10328 5093 -4578 -6676 13217
16273 13217 17558 23660 14989 6310 9945 12228 21008 8593 3109 -8901 -14958 -11149 -6654 13941
16259 13941 21301 30490 38993 29202 18025 2972 -8591 -16073 -9215 -2385 -13007 -14385 -22691
16246 -22691 -21417 3261 -1253 -1774 -3099 -6828 -7393 -14136 -7904 -4311 -5876 -286 -772 -7697 -6663
16231 -6663 8737 15253 6568 3156 -8421 504 104 12644 20874 13039 -1861 -3954 1115 -8950
16217 -8950 -17208 -6554 -4776 7032 17818 23097 19904 10818 1713 16512 30524 14055 460
16204 460 10750 21552 30876 33449 11663 -4176 -15046 -26605 -34166 -10463 4752 10720 14584
16191 14584 18976 4833 2928 7293 1678 -10833 -6005 2049 13360 23033 9749 3209 -17594
16178 -17594 -38608 -53445 -46810 -27333 -20676 -23511 -43089 -30998 -32638 -37677 -19132 -24958 -24246
16165 -24246 7961 17967 6895 2804 5410 13511 2412 -5236 -1671 -740 6583 21540 17399
16152 17399 -13659 -20018 -193 6892 -573 -8184 -7635 -5856 2964 -5508 -17743 -16771 -10056 -12715
16138 -12715 -24144 -21128 -10357 1063 -8218 -13821 -25982 -29125 -13524 -10483 -17326 -11003 -2290
16125 -2290 -7384 -3104 -2123 -7163 13307 9232 -716 -254 -7397 -16862 -20545 -1801 14803 12684
16111 12684 -6025 -8409 4017 4924 1624 6971 -293 -13487 -11729 -1106 -7478 -7544 1466 22294
16097 22294 8329 6059 12367 10926 15049 18246 14308 11364 -7039 -11561 -11316 -510 3036 -1439
16083 -1439 391 12378 15994 10014 -10723 -13354 4478 27955 33561 24259 10842 11300 -2004
16070 -2004 -9877 712 11359 7084 -2483 -17866 -12032 1297 -4454 -11552 -13330 4633 20602
16057 20602 24294 22143 9886 -3655 1041 14818 17542 20119 13566 11859 9021 8234 22124 18467
16043 18467 4924 5784 1443 1265 -496 23657 32785 30564 10601 -12677 -18703 -19920 -20858 -17562
16029 -17562 -12700 -13310 -5527 2177 -2758 -2346 676 3463 9413 1664 -10027 -2305 13949 -986
16015 -986 -10950 -26979 -20503 -6681 18073 14863 21882 26403 3892 -12067 -16508 -11030 -9087 -18616
16001 -18616 -22628 -25464 -36291 -35703 -17459 -7279 5671 9792 899 4230 9416 -12371 -19411
15988 -19411 -13998 -78 19312 19871 6112 -1846 -3091 -5314 -21185 -21080 -7056 -2131 12644
15975 12644 7544 5740 1931 -1025 10516 -5518 -29319 -30279 -11053 9679 -6353 -20356 -15185
15962 -15185 -758 18270 3551 -9861 614 -418 -2252 -6602 1069 6171 4441 -1793 -1313
15949 -1313 1519 -2752 -3680 -3225 1231 10824 9867 9843 7331 -5502 -13813 -8713 3212 -533 -11251
15934 -11251 -25627 -27141 -25751 -22162 -23197 -4521 3694 5831 8016 22173 20673 11396 5232 -5612
15920 -5612 -3799 -7378 -5011 -10827 -6106 3641 2999 -1338 972 2199 12295 11615 7944 7787 5191
15905 5191 -13435 -4790 111 4730 -3282 -4766 -21351 -31633 -25353 -14575 -7881 -9671 -15375 -19081
15891 -19081 -21863 -23697 -12126 -1422 -1300 -2354 187 657 -13559 -19770 -13736 -12769 -13139 -4188 2858
15876 2858 -5917 4769 -2721 -9888 -780 2612 12608 7384 -4642 -3259 -2703 -2777 -6335 324 -13238
15861 -13238 -29810 -20751 1630 5764 9375 22511 8335 -7611 -23691 -26155 -21951 -11665 -8533
15848 -8533 -12618 -11318 9187 16635 11996 4426 3872 11331 8153 -3598 -8824 4385 7224 4721
15834 4721 -2341 1361 -14012 -13946 -25891 -27983 -20596 -36532 -33824 -5102 3265 1551 5816 4001
15820 4001 -1728 -6371 2456 5565 -2939 1835 12137 10010 8134 6638 637 -4788 -9114 -9746 -3702
15805 -3702 5623 2436 3199 16224 17409 4552 -13500 -27215 -33895 -32899 -27070 -21667 -13771 -2261
15791 -2261 10261 -3202 -1517 9456 -2844 -13742 -26704 -32948 -38899 -46473 -40356 -9026 1663
15778 1663 -1572 -3894 6503 20217 27061 22719 1501 -16740 -19516 -10584 457 17980 23078
15765 23078 18222 -2467 219 7560 -1175 -18082 -10705 6448 13016 8193 4052 -10021 3718
15752 3718 11245 2970 -9076 -7761 -2560 -705 983 -3575 -11594 93 5687 10070 -4874 -6509
15738 -6509 -8611 -13619 -5776 -1701 2400 2110 -11587 -15043 -10805 -9139 -16709 -21265 -811 14381
15724 14381 5859 -17631 -22559 -9681 2864 5898 -1311 -5380 -1034 10517 15640 2850 -4037
15711 -4037 14471 24577 17022 10765 17358 20599 18102 1375 5855 1359 2926 -211 -930 5614
15697 5614 19495 19870 17234 9831 17286 25762 14716 -6301 -16930 -19578 -10982 1050 4791 9495
15683 9495 16172 10422 -945 1060 -698 13444 13806 17875 13837 12979 23821 30653 32423 25554
15669 25554 31588 27937 9979 6212 7586 -1236 -7220 -7428 -12778 -18645 -19286 -10983 1214 10686
15655 10686 12711 33016 43854 43057 39247 19268 13454 18258 27273 14157 -2599 -8524 -4380
15642 -4380 -2676 -3926 -5902 -4891 414 10941 14360 13680 -3179 -4704 -4744 -1686 2508 15739 21632
15627 21632 26118 34470 40782 32372 20992 23868 20939 14190 16332 11302 3669 8965 101 -12214
15613 -12214 -9141 -1844 12907 17388 14278 -8602 -16051 -16956 -19083 -6401 -8868 -2595 -2543 -7875
15599 -7875 -6558 -8261 7841 9513 -4013 818 -1160 -29519 -31172 -6489 165 765 2125 12799
15585 12799 11162 17946 1688 -5807 -10082 -20816 -6355 -1611 -9560 -13025 -6148 3527 5757 5788
15571 5788 14780 19132 15889 6262 2477 10329 19432 87 -9281 -4833 -645 4962 4409 -2713 -652
15556 -652 5194 11590 10337 18228 17226 15944 -2288 -8360 -1255 -16723 -13795 -14961 -22872 -29803
15542 -29803 -24713 -9165 162 -3276 -3437 -7605 1421 9669 -254 -4046 7574 7786 -1550 -10326
15528 -10326 6685 3566 4355 5833 8464 13199 12024 29431 19296 -4357 -21736 -28530 -24258
15515 -24258 -22925 -26916 -18075 -13248 -2747 -4353 3373 22833 28055 17358 6203 11227 6300
15502 6300 -2378 12557 16464 7330 -2461 3123 -3789 -4898 -7139 -6241 -6514 -12961 -7318 -2488 -10151
15487 -10151 -727 11516 4367 -14894 -16090 -11705 -10620 -4629 22034 26962 29346 27712 11393
15474 11393 3752 -6759 -15330 -8889 -2217 -6962 11342 21485 26201 23814 26200 32262 17167
15461 17167 -2205 7538 14656 5357 1193 16549 20537 16385 13983 18652 19190 6520 -15490 -14774
15447 -14774 -15074 -5850 -17647 -17727 3002 4482 -12486 -18903 -809 9897 18118 9224 3894 -388
15433 -388 2791 2721 307 -21914 -11947 1058 -7885 -10396 -10178 -13931 -18151 -10966 -6306 4330 10868
15418 10868 22355 24030 15078 9917 -1954 -4542 930 9530 8198 12905 13116 10848 17284 14209
15404 14209 1580 -2018 4778 16874 4346 -16077 -21448 -16579 -14815 -21052 -26985 -32711 -22309
15391 -22309 -4037 7715 10211 13958 10368 672 -1262 -83 -8208 -11373 -13670 -9617 -11629 -7446
15377 -7446 366 -8416 -14211 -6931 8601 11301 14167 15384 23684 24168 17833 17232 16684 10472 5032
15362 5032 -2285 -9123 -13417 -14792 -7070 689 8025 10257 17787 28529 26718 20505 11608 842
15348 842 1072 5502 3178 9834 1650 -13173 -11312 916 877 -9133 -3532 7007 4156 -5334 -21512
15333 -21512 -28818 -11171 -4366 585 15400 14193 3975 4757 -3055 -12597 -5972 2638 3836 8479
15319 8479 8658 12382 19063 15896 11346 7503 2225 -6562 -8345 -12215 -9248 -12845 -11787 -12259 -12459
15304 -12459 5255 16128 10152 15645 11794 12051 17757 11281 2362 -2821 14569 22244 15870 18382
15290 18382 25838 29769 33425 30975 12736 2022 4646 723 -1910 4468 2318 8664 17420 7239
15276 7239 4184 -11160 -8874 10889 30634 43535 28955 14426 10621 2950 -8738 -4289 -4236
15263 -4236 -2201 -119 10157 23301 18212 19393 22947 9601 7887 5169 9947 17250 4779 5186
15249 5186 -536 268 1878 8327 11948 10147 5061 -1227 -5287 5386 29412 36097 22416 265
15235 265 7164 11071 3077 15087 13377 8181 5055 3129 -13406 -15630 3530 -2006 -19891 -22304
15221 -22304 -13010 -21342 -31860 -19966 -2435 -5115 -8623 2283 11830 15058 -1411 -7072 -4172
15208 -4172 -9715 -18914 -17447 -12831 -2910 18467 15986 -4754 826 9279 767 -4307 2070 -4518
15194 -4518 -17852 -16461 -4505 -3004 -2582 3931 -6193 3145 10075 3981 -6088 561 4878 15149
15180 15149 28163 15351 11804 -2730 -12586 1541 9120 16704 4303 -824 -35 -6871 -7974
15167 -7974 -11694 -4994 4157 16675 23771 26552 10320 1189 13307 17494 15048 12361 -432 -10703
15153 -10703 390 8558 -1912 16960 25918 16782 5710 6902 -5794 -13980 -1318 5564 -6251
15140 -6251 -5267 2828 3692 7479 7341 15585 10186 7186 18670 5933 440 1048 19860 18008 2873
15125 2873 -5211 -15527 -28391 -2007 -8237 -21488 -14927 -9979 -1620 -2454 -263 5890 -4423 -16562
15111 -16562 -9044 -4062 3192 10346 19591 6941 2516 -1153 229 -7509 -13745 -18636 -21129 -8463
15097 -8463 6632 25330 12574 -1858 -3122 -6538 -2827 -855 14004 6468 3321 1553 -4853
15084 -4853 -6881 -11483 -445 7861 11612 3272 3005 14292 25429 25274 15437 14922 12115 9464 14860
15069 14860 10961 5692 8984 3726 -4286 -6052 -3297 5363 -956 -9743 -11358 -8660 -8662 5191 13881
15054 13881 11088 -4529 -8693 -12841 -12369 -15403 -17291 -12410 -18303 -23980 -24504 -24920 -8716 -1878 -7771
15039 -7771 -6434 7467 10076 4137 1317 10389 12576 20207 17105 -335 -9264 -7407 -3333 3035
15025 3035 3885 3470 -8835 -12868 -15692 -9816 903 12075 11922 10269 2903 5643 13895 30986
15011 30986 33695 28348 26742 7365 13061 35526 48723 41123 24887 18160 28855 25578 22075
14998 22075 26016 41025 41164 32818 37212 46714 45884 45007 12223 14150 35915 39358 28869 16088
14984 16088 27723 17401 16856 15960 22918 18814 6766 14880 19313 7797 5661 21975 21491 25964
14970 25964 26635 26602 22831 27703 32406 21780 14177 14009 7455 11705 20866 28490 36841 24309 16403
14955 16403 17694 10480 -3258 -11819 -24805 2915 9042 8970 11566 -1134 -6021 3221 -4723 -9681
14941 -9681 -15523 2473 4372 9114 7175 13542 1654 15675 27716 39381 54148 55390 55689
14928 55689 53817 26677 11174 -9664 -19714 -5857 -920 2833 8412 9274 -2236 -13364 -9768
14915 -9768 -8241 -519 20037 24013 21342 11424 15105 20185 20239 15579 12762 15288 20194 23939 16825
14900 16825 11344 11128 13023 22123 25336 20110 8829 8755 8217 -6572 4746 13675 12219 14738 11484
14885 11484 7787 22296 18999 13230 19503 10803 7126 20162 22279 14658 2781 -5030 -4518 21611
14871 21611 35854 40803 25234 20672 25680 26477 14280 16081 15383 14644 13718 20171 14209 29449
14857 29449 40196 39795 26642 20703 13767 25679 15192 20561 20724 32273 32104 24246 14204 16454
14843 16454 10860 -2479 10557 17142 21406 26577 30796 32199 35303 31774 22179 24441 20833 21648
14829 21648 15318 19415 11337 10197 17760 23533 23707 32156 19581 13978 21281 19611 20223 17642 17396
14814 17396 11728 -875 3754 9284 20447 16750 16002 15250 18543 19615 25928 24271 13288 11331
14800 11331 5738 24250 47532 59541 54591 44522 29767 16297 29113 44200 50591 43855
14788 43855 39934 41030 21143 17366 12452 14942 24284 47059 45634 38060 29006 29068 38276 25569
14774 25569 5745 9772 8814 9060 22216 30902 27870 30675 28519 19599 22360 13194 15120 21725
14760 21725 31189 30261 12194 14198 11695 14455 22874 26953 34110 36984 24159 23238 4536 568
14746 568 7823 13600 24688 57278 56974 37749 37388 33365 31192 34096 32204 25424 25473 21225 13497
14731 13497 13956 13672 14119 28515 29835 9226 -6720 -7238 -11936 -8151 -3830 2767 21496 31411
14717 31411 23703 32565 54900 59035 33989 23946 27449 28200 20325 17418 14174 16332 25181 16438
14703 16438 14415 6099 3616 1493 7687 17367 11377 5799 8494 15404 28603 35057 26014 10675
14689 10675 3175 -1871 1772 14840 13865 10390 7660 13138 14269 10745 8239 3962 18400 12905
14675 12905 8386 4063 11495 5456 10265 16180 12532 9278 11270 24621 22951 29828 43394 42003
14661 42003 46195 42749 29429 30151 31534 39205 40489 43063 29674 23254 25651 40506 45016 31998
14647 31998 21631 28051 26801 21473 15855 24506 35229 29490 30681 16775 7058 7640 -1279 -7400
14633 -7400 -10106 -8353 19770 35983 24251 22287 27095 23333 15029 22363 37001 37106 25672 25488
14619 25488 23564 17912 9976 10048 17183 37800 32047 33632 31435 19785 21439 24279 21641 31430
14605 31430 37993 32693 20960 28008 24429 25358 6984 4944 11984 23397 20678 31947 47939
14592 47939 40925 29774 19404 17640 8809 -186 11319 25305 16490 21724 19702 26437 37729
14579 37729 35529 23768 30584 43944 61461 66465 78044 77207 63318 65330 85907 99704 102343
14566 102343 117471 140612 165428 200118 263305 367106 553914 863776 1312968 1678128
14556 1678128 1735343 1653112 1582530 1603630 1499608 1077493 723929 523208 400310 318317
14546 318317 274905 265016 265989 254776 252440 252065 227255 190881 169981 168529 155249 150791 162233
14533 162233 166178 169398 168530 162603 148888 130292 127399 117163 113174 104240 106149 102848 88072
14520 88072 77312 61138 69409 77227 94669 106384 98235 92491 84497 81649 67935 61030 48064
14507 48064 48117 69876 59038 65893 87036 88813 91737 93747 89615 95525 81064 78869 79623 71953
14493 71953 70788 86166 113153 149381 223048 261924 268870 257036 252922 272666 238079 164438
14481 164438 113194 87313 74667 80502 79173 73823 74155 80210 81630 76486 66360 64180 65679
14468 65679 76901 88463 78942 59633 53481 54356 33413 34081 43941 56100 63900 69175 51996
14455 51996 32949 41796 47160 46876 48167 57849 54388 41531 41628 39651 39090 35642 54009 43842
14441 43842 37969 52789 55448 31131 38824 63025 62032 50780 50017 42771 48326 51290 37121 23172
14427 23172 37908 54934 68398 57676 38251 27903 27654 34121 37451 31615 39621 31476 32267
14414 32267 45395 69265 74686 51847 44267 42363 45964 55180 62469 49671 39227 45595 53062
14401 53062 57752 54722 52990 49119 70802 75239 72702 65613 62680 63628 65166 65889 64628 54133
14387 54133 55433 46881 43343 56821 44938 35146 47892 64396 75889 72906 66368 64824 49605
14374 49605 38485 34075 31774 36886 58935 78365 77715 69935 57717 39980 33081 44704 63403
14361 63403 67267 72615 79795 71914 80747 94815 89233 86406 87782 94226 97659 89994 85136 72656
14347 72656 73473 75287 73610 64326 78484 92688 100468 113677 106617 76762 77216 82422 80794 87551
14333 87551 96875 96273 108053 158915 230749 259804 246443 247373 249081 216708 169573 142711 147721
14320 147721 158955 160391 182347 199679 175971 158093 166231 161933 153396 132994 131007 137275 132908
14307 132908 129885 114232 105799 98034 91138 88163 76314 68519 81372 95454 103051 106536 121293
14294 121293 126936 127927 128640 128249 105516 104335 96790 95481 84303 58771 48714 52586 61718 46685
14280 46685 28916 21534 10843 25139 44495 47037 63274 78239 55649 30049 44138 63510
14268 63510 70566 86809 119285 143462 133375 120080 123471 131631 141060 117372 59643 32793
14256 32793 38033 61960 85447 80496 89210 90930 96042 86964 68266 62150 80449 80133 72535 61062
14242 61062 50055 43592 38944 68201 70442 75157 87679 79686 58865 28167 9399 11579 22921
14229 22921 38637 33032 35150 74014 110421 127511 126574 110539 96982 88797 90561 99075 116467
14216 116467 139368 147322 165288 199721 215139 232416 250322 249471 268954 283281 308858 389111
14204 389111 508818 532738 538176 583487 560053 596212 637952 613142 529719 455728 465015 428514
14192 428514 364804 308027 298995 316617 345521 353775 357638 352175 375667 391202 365107 352227
14180 352227 349859 330971 318875 323783 337717 364337 381930 396198 418661 450245 467383 459804
14168 459804 452573 458628 483204 519260 530898 520745 525022 522505 529536 539538 541545 538273 520934
14155 520934 485388 467026 473059 469096 452791 430100 415879 419029 432766 446404 503857 535652
14143 535652 534696 526178 541865 548931 537542 520181 511606 530432 564179 593173 602002 642165 695115
14130 695115 736061 750613 749628 746565 766460 752233 726540 721982 737928 753386 750834 745363 801857
14117 801857 880517 976061 1066369 1150374 1272977 1421300 1543859 1608948 1643277 1680787 1750991
14106 1750991 1867527 1995314 2126578 2228338 2360814 2586660 2860526 3140906 3384782
14097 3384782 3641523 3968617 4347150 4822316 5364040 5992527 6767072 7796260 9176649
14088 9176649 10900900 12751015 14545116 16642230 19387907 23104979 28238974 35472637
14080 35472637 46818187 66033948 101000805 164047266 252944766 312712850 312110513
14073 312110513 291728789 282537215 292278636 263768932 177451539 114119726 80331116
14066 80331116 61891911 51180522 44911435 41265962 39120599 38057934 37510044 36320979
14058 36320979 34159024 31340099 28315810 25772359 23703848 22008670 20610694 19405394
14050 19405394 18349901 17446941 16626707 15940955 15393179 14910147 14413245 13868865 13281243
14041 13281243 12716971 12181041 11689370 11202995 10732295 10276933 9861690 9501490 9218739
14032 9218739 8947141 8670230 8408312 8151326 7914684 7676805 7387156 7097021 6843546
14023 6843546 6606454 6356083 6096089 5864515 5671870 5482797 5292038 5125896 4983490
14014 4983490 4868757 4754525 4617646 4484093 4364794 4251449 4136125 3991875 3847193
14005 3847193 3735325 3643338 3542769 3441076 3341771 3267640 3203827 3127796 3047513 2963938 2861536
13994 2861536 2754276 2660435 2560340 2484097 2407728 2317290 2234219 2169858 2122118 2065231 2035227
13983 2035227 2002896 1954249 1914387 1882975 1836595 1791066 1732894 1675003 1651903 1640775 1638673
13972 1638673 1614931 1589895 1551626 1537776 1527943 1500548 1466470 1444217 1402323 1357383 1321503
13961 1321503 1288881 1238444 1166732 1090504 1039647 995647 937637 874188 834082 838346 856973
13950 856973 816787 759351 750731 672601 620832 655027 608727 546110 474129 424167 389983 359845
13938 359845 321172 288770 276247 282055 283680 302284 328558 348272 350144 353783 353340 343535 312928
13925 312928 304965 288684 270073 262741 294439 342084 369879 372898 376394 373889 382798 392945 368360
13912 368360 328734 305773 292272 305626 319957 321250 322168 319403 322439 318823 315260 314177 297221
13899 297221 271569 256033 238304 225664 232664 254977 271861 273846 274950 282825 274238 254978
13887 254978 230595 219931 205988 191910 186255 178869 169862 194312 229289 236422 252874 249691
13875 249691 232344 227001 221123 216246 207461 217205 232872 237922 238241 251119 252081 238544 230008 224783
13861 224783 211577 190893 184518 181718 173228 161471 156127 140352 128672 139771 158394 171358
13849 171358 175367 165431 169425 183528 181348 167579 165247 168130 174019 158803 154820 157192 150663
13836 150663 154791 157428 152525 146886 142099 134623 123721 110174 106313 106117 112106 138395 149679
13823 149679 157359 148292 138066 150615 181619 187612 186560 147090 104266 95594 90021 60277 48060
13810 48060 64943 75272 74683 62356 56124 57499 42454 32082 31720 27031 16930 10023 2247
13797 2247 440 6606 10009 -16443 -14481 -2377 2680 -11458 -7147 1533 157 -9151 -11505 -5371
13783 -5371 2146 19408 32379 25256 34173 31684 31418 24983 41416 46665 47565 50548 46212 31483
13769 31483 14010 1616 21117 31031 14498 12167 3800 1210 4793 -4679 8500 10898 -4073
13756 -4073 -948 4745 11994 26900 23398 19264 11902 16855 4819 -7030 -4462 -269 25 -4633
13742 -4633 -13483 -9424 -7901 -2208 -1761 253 -6061 -1047 11427 18412 21524 27131 29155 20965 18469
13727 18469 29199 22419 19172 8203 6779 14668 29565 34052 33213 33074 44022 49926 51625 41754
13713 41754 33658 26240 25931 22129 11259 4871 5992 5002 30310 32586 18164 9900 6893 23955
13699 23955 29272 24286 15282 14070 34866 48339 31514 28091 31959 15584 2417 -60 18280
13686 18280 24140 15771 8242 6102 24405 22893 15082 17120 4401 -3677 -1741 -5602 -5221 -2334
13672 -2334 -3558 10531 18187 5409 -8 -4124 3635 6725 -1759 -3788 474 -12864 -17995 -9727
13658 -9727 -9989 -13244 -17397 -22246 -19177 -12206 -1960 -3722 6503 4993 7960 17738 6852 4811
13644 4811 496 7758 6747 14566 18456 15214 20094 13372 1753 -8085 -18795 -14482 -6004 -2282
13630 -2282 -12889 -27421 -23837 -14209 -7846 -5835 2882 16757 21668 10172 4149 12535 358
13617 358 -10431 -18591 -22471 -13450 -4204 -3045 -15751 3192 29564 32559 39185 51075 42556 15194
13603 15194 3524 13574 21957 43830 51055 51543 61666 92452 123995 146347 175715 217609
13591 217609 292363 410569 616486 983922 1456579 1700554 1683373 1606710 1580254 1594564
13581 1594564 1332518 894922 605919 447288 348880 296279 254786 231698 217840 229592
13571 229592 227747 228208 205215 174466 139982 130330 128387 129423 121511 116182 111063 103723 116220
13558 116220 122514 125483 126730 116374 98957 86133 84554 79002 70624 71884 61370 60974 59701
13545 59701 68954 71981 68463 62933 35907 33260 20474 18923 35205 57294 51272 38592 35837
13532 35837 40462 34443 27769 42333 57303 38359 29705 28379 29286 46938 47888 42108 32349 50613
13518 50613 53597 42324 53239 56001 62111 61240 43494 35167 29339 13877 16785 18887 11848 10486
13504 10486 9421 11658 20238 15710 27020 34656 23342 15569 18397 2517 -16094 -14404 -12221
13491 -12221 -2255 524 6246 17829 13971 -3383 4403 -7725 -3389 13143 17355 10545 3912
13478 3912 -4126 -5420 -830 1476 -5566 -5681 10157 2090 10007 5622 1112 3581 4908 -5165
13464 -5165 -4001 -4028 -5641 -4096 4616 6792 6709 2672 11776 23569 24727 3178 -18913 -4973 -4178
13449 -4178 -4907 -5977 -979 3627 15239 31427 23228 5551 -9476 -24069 -14046 -5309 -9320
13436 -9320 -7232 -13787 -17471 -14794 -13894 -6404 915 4536 4062 11126 16704 14218 21360 22423 13815
13421 13815 3941 3001 5822 -2433 -801 -5089 -6494 3085 -4161 -11554 4190 12510 -875 3557
13407 3557 -12910 -12895 5656 6109 9103 14527 2787 -11531 -8100 -13445 4850 19301 20488 2452
13393 2452 -5878 3266 3967 15712 9546 6350 -5441 -16823 -8645 3327 -2529 -6099 -6477 -13481
13379 -13481 -14837 -6024 -17927 -16680 -7743 7853 8181 -5611 -11383 -18642 -20465 2122 -3344 -5942
13365 -5942 -8484 -314 -12489 -14395 -4098 4105 929 -3589 -7968 -7533 -7357 5833 11366 -3632
13351 -3632 -10995 -460 -5081 608 -3196 -16114 -21302 -12061 -551 9659 5584 14591 23061 11173
13337 11173 7070 5359 2239 -4056 -3045 3677 13348 21649 18819 17596 12432 8459 21354 22223
13323 22223 26322 13427 3715 7737 -6073 -11483 1352 -6703 -11490 -5033 -11429 -4382 -2710 7372
13309 7372 6778 -966 -6295 -7109 179 1555 -2427 -10540 -15904 -4820 2970 2858 8793 14582 16075
13294 16075 941 -2604 -2562 -3421 -5744 25 17797 10304 3860 6054 10426 1007 -2621 197 -2818
13279 -2818 -2059 3838 -11985 -10665 4755 11308 27261 34155 20802 -557 9651 13983 8033
13266 8033 8799 21426 31416 29575 12073 -659 -3966 6305 23550 21368 11624 25294 28702
13253 28702 21178 3587 -2715 -7258 -15057 -3761 6850 7629 -9125 -17263 -10477 -18722 -17128 -19392
13239 -19392 -23437 -10522 1394 3285 -5424 4316 4259 6378 9440 12087 -2602 -17428 -18395 6709
13225 6709 8425 8864 5388 749 2746 -1901 3025 4 3584 2211 -8083 -1483 -523 -16302 -11753
13210 -11753 -14696 -20489 -27243 -27730 -19070 4059 517 222 7690 19483 23085 11085 6071 3234
13196 3234 -2339 21475 21148 5125 -4461 -13085 -8678 -1259 -7950 -17415 -11379 2259 13261 21248
13182 21248 19416 9299 -2650 14708 23829 11815 3416 6570 12281 9249 9546 -2815 14902
13169 14902 15008 -9579 -10668 -11449 -10958 845 4190 -9949 -12236 -6697 -1143 -1137 -3848 -15293 -22352
13154 -22352 -10541 -2646 12843 14715 14210 5228 -7763 -16764 -25170 -43360 -37651 -16000 -15179 -6809
13140 -6809 3066 7700 -2953 -22564 -31647 -24452 -26076 -20458 -6308 -723 -5030 -4018 -14711 -22757
13126 -22757 -24655 -4252 16345 15564 1894 3648 17501 28094 18894 12997 8476 -5971 4466
13113 4466 9487 4447 7100 23367 31606 15994 5656 -3174 14755 25172 22718 24456 21844
13100 21844 16955 4029 -17225 -20717 1854 9623 -9182 -24082 -12841 -7413 -10481 7247 10286
13087 10286 10585 5600 10116 18160 7997 7374 4334 -6336 -12557 -5903 -23891 -31660 -25136 -18921
13073 -18921 -17708 -11229 -4416 -11282 -14308 -7570 -1441 5995 11448 455 -12255 -17464 -11658 -14778
13059 -14778 -3444 9799 15864 22631 11661 -80 7919 -2762 -24141 -37618 -28678 -7932
13047 -7932 7240 3570 -3605 1410 -1199 644 2746 9938 1313 -17869 -24149 -20540 -7521 -6537
13033 -6537 -5655 -2308 -6159 -11812 -30990 -26249 -9457 -8148 -9120 -9101 -19272 -13703 -13267 -1995 -235
13018 -235 -352 9636 13848 -5323 -14168 -13582 -7517 5095 6624 -4746 -6726 -1079 1857 -19261
13004 -19261 -19857 -9383 -15724 -19370 -1163 -5962 -51 5873 5222 7599 22992 30557 37975 37421
12990 37421 22920 19495 12997 1728 -758 3216 -1481 6041 1247 2435 1202 1117 -2301 -3443
12976 -3443 -1550 -12155 -31088 -29795 -10485 -8548 -7905 -11447 -4693 1428 -748 328 -2529 1843
12962 1843 2685 775 17424 18061 14498 10586 15412 22944 29672 19581 9159 15575 28432 28641
12948 28641 8332 -8548 -15319 -18456 -19103 -8526 -3683 19562 13398 7181 20376 21447 15388
12935 15388 14563 4164 -5350 -841 -7981 1613 9969 -1298 3967 12049 2322 -86 -2362 4809
12921 4809 10861 13368 12208 6551 -1266 6768 16804 19222 13919 13415 30444 36877 39243 19581
12907 19581 13700 10094 2173 -5064 4230 2047 -1459 -160 -2783 -6447 -7488 -3273 4687 4976 4412
12892 4412 3512 9961 13360 3785 11841 10266 8493 3206 -3960 -17225 -11480 -11210 -6184 -665 443
12877 443 7674 26907 26309 11112 3286 -3939 -243 16517 26631 15672 8913 -3372 -11086 -6543
12863 -6543 17960 34034 34987 17807 5403 6631 5193 14420 -7462 -3223 -3427 -5284 -1010 12919
12849 12919 12144 12792 11296 4300 -4391 -13187 -11279 -4541 -732 -4631 -5793 -574 -10265 -7090 7529
12834 7529 8609 15591 4965 -18538 -6127 7083 8683 4007 985 4407 998 1674 1338 507
12820 507 4190 -5562 -118 13991 15250 -4544 -15779 -18174 218 6304 6833 -5722 -4821 -465
12806 -465 -7116 -15526 -14352 -8636 -10018 -20661 -18437 -12383 -15342 -15901 -6454 -7398 -19233 -19141 -15747
12791 -15747 -34428 -43113 -39689 -41839 -34040 -38540 -35735 -28537 -7216 -2844 -19131 -7153 1362
12778 1362 3994 5081 5010 11012 17697 19620 23487 18413 23691 41581 30058 14349 264 -12855
12764 -12855 -7273 -4045 -4235 -7811 -10895 -28992 -21164 -1596 -2698 -10817 -22973 -17586 -7469 5501
12750 5501 17088 7907 4050 3351 -3394 573 2750 14693 15576 -2645 -7619 -15024 -15881 -3331
12736 -3331 2779 -7360 -29424 -36936 -33526 -24162 -22140 -21442 -24514 -24721 -23058 -20661 -10451 -19447
12722 -19447 -25900 -7550 2971 -7944 -14037 -14848 -5564 -7171 -387 8434 -1725 -8027 -16323 -35913
12708 -35913 -22998 -1335 1570 -1047 11533 15724 13064 26252 24307 18949 15560 17192 13141
12695 13141 1827 -7960 -20635 -21410 -12256 -40 -1554 -8648 -896 -2855 661 6749 2857 -2905
12681 -2905 -1770 -380 6238 5192 707 -857 -12877 -14697 -9008 -12020 -15104 -23828 -28237 -22342
12667 -22342 -21718 -21704 -19534 -5574 -1023 12824 21233 20099 17907 1551 -5673 -9320 379 3446
12653 3446 -703 4569 21564 21215 -7271 -20825 -9336 -3536 1097 -7845 -14181 -9446 8733 12681
12639 12681 4793 -6813 -9780 2012 15567 12113 1326 -12153 -2925 -11135 -11716 -10185 2397
12626 2397 4057 10099 6564 5233 7726 18318 28975 23317 11540 11347 4176 6753 -3744 -299
12612 -299 4765 -144 187 5297 -24 2487 4387 429 -2474 7360 3453 -6720 -16528 -28413 -13674
12597 -13674 -720 -9651 -15747 -18127 -18632 -14914 -2217 6781 6460 -9952 -13124 2474 18196 13465
12583 13465 7111 4861 9567 11361 -4512 -6314 -7374 3592 32972 47261 27187 20751 11150
12570 11150 -1441 -2803 6819 8645 3006 1355 6684 15978 1483 -4083 -659 5259 -3992 -20975
12556 -20975 -23841 -29670 -25511 -28717 -22835 -12932 -11361 -35689 -28517 -31700 -23934 -14852 3608 8630
12542 8630 3657 69 -4879 -10327 -16800 -10776 -5651 -16234 -19512 -17606 -12828 -12210 -14954 -10059 -5259
12527 -5259 -18630 -23949 -11354 -20262 -21916 -20903 -21686 -17338 -14886 -19429 -17425 -5939 7392 -6664
12513 -6664 -19035 -33568 -31626 -12845 -16610 -16952 -22799 -37242 -33317 -28094 -23520 -10864 4518
12500 4518 3005 -13268 -3469 15201 5935 -4948 4287 -3709 -16123 -24110 -28038 -12769 -6387
12487 -6387 -9084 2321 16095 -6687 -21034 -18083 -2738 -1672 -7068 -8774 -3903 18630 15374
12474 15374 12346 3296 -12152 -7945 -2041 -5363 -11154 -8080 -1875 -13618 -26218 -21132 -9370
12461 -9370 -6384 2402 1990 -876 2694 8853 4721 8556 11114 -4587 -15356 -31052 -26706 -11514
12447 -11514 -2691 5014 5655 1661 -10057 -26744 -27878 -24597 -15248 3859 13023 11870 2457 5388
12433 5388 1290 -16712 -12461 -4488 -6698 -6317 -7214 -1670 4081 6666 3332 1668 -7637 -15060 -6615
12418 -6615 5217 9373 5023 -1882 4445 1229 -7054 -28574 -33880 -27028 -9786 10895 10331 15364
12404 15364 13098 15198 23849 6085 -10895 -26056 -12930 -9092 -1664 3117 -3675 -13669 -3213
12391 -3213 -8690 -5160 1944 -51 9683 13547 4132 16955 15239 14043 9180 7458 12723 16243
12377 16243 29264 24503 14482 15971 8501 109 -16298 -14117 -9948 -12186 -19177 -20046 -30306 -35771
12363 -35771 -21040 -18649 -1668 16397 17426 3076 5921 9613 21131 15040 10745 -1550 -5521
12350 -5521 -7366 -24946 -29790 -29256 -24384 -9224 -3810 -5182 -10947 -21578 -12875 8074 6741 3856
12336 3856 -3163 5204 5834 5706 8984 9474 11751 18200 20105 20290 1031 -12961 -25797 -7398 821
12321 821 -8639 3525 9278 4264 8444 3954 -2081 542 8042 13773 5091 6506 12059 13063 4978
12306 4978 -12684 -9727 6458 -1730 -3051 676 -26058 -28787 -15160 -8921 -18632 -15909 3782
12293 3782 -297 -1517 -14701 -19084 -34006 -33526 -17442 3117 -554 -19038 -28471 -41548 -26570
12280 -26570 -14682 -9403 -3105 1514 9707 13313 22170 23046 8420 17985 14869 17419 5483 -7675
12266 -7675 -12226 -3252 -2338 -1370 14903 20852 18290 12270 3242 9984 -1085 -4057 10612 7290
12252 7290 -4268 -9214 -11432 -10582 -3367 9114 2912 -526 12779 20230 11733 17188 10809 334
12238 334 5679 4582 6391 5229 -3707 -1220 3324 8730 3270 -11371 -23697 -22854 -20394 -4633
12224 -4633 -4134 2044 -15962 -15615 2071 3316 3018 9510 6157 10082 7816 6602 -7166 -16781 -14526
12209 -14526 -19889 -18369 1515 3139 -8751 -12949 -7699 -8619 -9797 -7921 2054 10078 25830 15474
12195 15474 -3567 1571 98 -11413 -18962 -22661 -19379 -9801 -8555 -2950 11899 22643 10889
12182 10889 10170 4218 -7550 -10768 -5335 -4200 5105 21473 23827 14622 19765 19925 19725 37682
12168 37682 58453 49621 51829 53593 57922 39595 22509 1048 -273 13755 23300 15778 10775
12155 10775 -2456 -2936 -929 8749 6487 -7481 -5465 -269 -10277 -16005 -18209 -14026 -653 19838
12141 19838 27843 17088 -3540 -20720 -25348 -29597 -6198 10643 21898 31432 33859 29094 33631
12128 33631 42921 69887 105307 140111 174688 176238 159558 151689 153680 141038 105411 77696
12116 77696 66824 71763 75520 59520 34314 5143 -11124 -10854 2278 14527 4328 -2058 -2639
12103 -2639 8883 7871 7713 4804 18121 35491 32899 31358 24193 23911 18440 8205 27987 32250
12089 32250 21975 33547 38489 35754 28294 27725 42488 81864 124281 169279 194088 192758 183745
12076 183745 192200 188179 151931 101377 82613 64494 40056 21834 11750 20845 35773 38455
12064 38455 33277 27891 12052 15427 21893 17365 26493 44700 29787 15121 4466 7977 2942
12051 2942 -11920 -2984 16364 12478 13035 4239 6686 267 -11680 3158 27547 36965 30441 34022
12037 34022 42668 59215 70786 85494 82066 69782 63800 60328 57242 41452 31496 22252 27846
12024 27846 37189 24227 14096 17825 27682 29268 13498 -462 -8104 9795 13619 6695 4537
12011 4537 -7944 -716 4236 4158 9387 -1179 -5071 4140 3082 -8548 -20970 -6159 -1218 2289
11997 2289 -3443 -11810 -6307 -9054 8046 30488 23585 5082 -8897 -17004 -12355 -25830 -39109
11984 -39109 -36451 -8023 -7650 -10949 1380 -2209 -129 7348 8225 12523 13665 13879 -1853 -9772
11970 -9772 -6906 8073 23072 18865 1922 -16185 -10366 -12564 -19469 -26192 -13785 -17867 -18224 -18412
11956 -18412 -20913 -7318 2904 8532 -2841 1130 3213 11582 993 5120 6030 2525 6015 6997
11942 6997 12392 8953 5739 3400 6671 17180 19703 8009 17219 15345 24143 36949 31673 20373
11928 20373 16887 15014 10975 8504 7648 4996 -7234 -14468 -9464 -21350 -28872 -25856 -25065 -15853
11914 -15853 -13783 -2663 9921 11511 11720 14304 381 -8525 -3506 2742 -10119 -143 -6772 -4145
11900 -4145 4734 11793 6933 5290 6784 3816 4914 -8318 -16743 -19101 -23932 -16007 -9036 -12753
11886 -12753 -681 14615 9137 -6854 -9472 -14521 -18168 -14704 1215 4865 17405 33212 41293
11873 41293 37818 21902 7388 -13347 -27449 -23336 -6361 18631 24982 25409 31258 28027 6873
11860 6873 -15853 -12802 -10522 -8966 -8086 -3828 5665 -2309 -2526 991 3837 1731 -19291 -25194 -25101
11845 -25101 -19874 -11459 -5259 -12544 -27668 -17385 -5535 -6054 -11966 -7962 -1283 236 -5184 2778
11831 2778 736 4287 -9528 -23686 -15853 -12476 -19010 -12962 -3011 -4095 1364 1694 -2380 -20872
11817 -20872 -24278 1067 27003 26894 10805 -7709 2150 17922 18533 19696 12193 18845 16129 8883
11803 8883 9368 21484 24927 10204 -8078 -16012 -6259 -4663 -2358 -7067 -14859 -13295 1227 11893
11789 11893 6700 2131 4179 -1220 -9818 -3109 1653 678 -11317 -11758 -10567 -16289 -21580 -27762 -37287
11774 -37287 -34880 -15834 10063 15664 11825 18197 9735 2271 15497 20112 10633 -1715 -18108
11761 -18108 -15751 1124 14756 27403 29944 15106 8011 13172 7006 1666 -12895 -17133 -14019
11748 -14019 -5948 -21597 -28152 -34350 -21261 -17676 -7184 -10531 -14950 -22059 -24663 -20483 -11715 -2333
11734 -2333 -6693 -2339 2628 1295 10298 12733 6540 3124 8387 8494 4667 -7478 -1917 -195 17566
11719 17566 14820 -12633 -22258 -25027 -17208 -4482 1793 10348 12926 11376 16518 -248 -19569
11706 -19569 -19555 -12935 -2337 5771 10018 -38 -440 -1668 -17203 -16258 -15433 -12936 -10558 -8552 -6536
11691 -6536 -6448 -12059 -15098 -26035 -41751 -34106 -10723 6267 26945 33941 17098 12125 13233 10595
11677 10595 6990 1344 -4852 -24154 -34569 -35575 -19775 -9242 -9390 5489 11499 3737 -5819
11664 -5819 -8334 -4042 -758 1434 -3922 8525 8562 4104 -972 -12804 -12296 -22816 -21474 -12477 -8501
11649 -8501 -17666 -32471 -22157 -5527 -814 1881 10432 6775 -5864 -13671 -7587 -7114 694 14787
11635 14787 31210 37940 23084 13601 4815 -10197 -3394 -12774 -21252 -24309 -17162 -7661 -6664 -4888
11621 -4888 -34011 -37879 -28295 -9345 750 -9971 -23157 -15063 -6630 -4670 -3770 -7150 -951 -7581
11607 -7581 -16464 -27268 -30289 -27514 -32572 -21133 -8408 2811 -504 -3530 -10504 -7710 9240
11594 9240 -1319 -11098 -6472 2059 13122 13712 417 -17530 -15380 2356 23315 26073 19935
11581 19935 16921 17150 1630 -7571 2294 8281 17411 17127 2424 -9279 -14860 -5183 447 7047
11567 7047 2780 -16017 -24802 -32212 -26391 -24335 -8076 5376 4483 4864 6297 687 6475 10903
11553 10903 13844 2051 -7950 -12329 -4855 4604 14911 14219 2382 5874 15782 4433 -4260
11540 -4260 -3724 -2604 15059 9636 -1399 9813 12089 9121 18091 22981 5459 -10146 -20019 -17529
11526 -17529 -12854 -29106 -23967 -14051 -9093 -19086 -22299 -19931 -12854 -6153 -8682 -11996 -1049 -532
11512 -532 21082 40143 33541 10915 -8688 -11455 -8677 -9355 -7999 5747 6034 -6851 -21210 -21604
11498 -21604 -17403 -4754 5654 5927 -1700 186 -1516 -11668 -19615 -23842 -17346 -15283 -16127 -13193
11484 -13193 12690 10908 -436 -12441 -18942 -23775 -30158 -19709 -18515 -11194 -17463 -16407 -9345
11471 -9345 -12241 -27160 -26482 -27126 -16503 -2792 13925 19543 9813 10536 2358 -5641 -1511 3748
11457 3748 -19906 -24762 -13075 -10434 -4601 -6890 -928 -4970 -8381 -12398 -13877 -6617 3654 9134
11443 9134 -332 579 11101 20178 20851 16944 8170 916 -2731 -13495 -855 13044 -2096 -6788
11429 -6788 -10474 -1366 2517 5467 9200 10203 7493 1470 -3235 3226 -399 4568 -7026 1518
11415 1518 10283 473 1301 -959 -3961 5568 19050 20203 10845 2751 -10695 -6810 8071 11375
11401 11375 -2723 -7746 -12232 -8376 -10308 11 8962 12935 8515 -6533 -2249 -5722 -5644 -13698
11387 -13698 -6950 5123 -955 -6229 -6313 4005 11488 241 -11033 -9964 -904 -631 -15043 -29370
11373 -29370 -16716 -2803 -12526 3898 8441 -4953 -5971 -7776 -6875 -18426 -8204 -8837 -3153
11360 -3153 7716 6348 3212 -5234 -7581 -8433 -16762 -14182 -8604 -1341 10934 10829 1305 -14192
11346 -14192 -18059 -30601 -25039 -29355 -20667 -20296 -18043 -9018 -12209 -28863 -35501 -23023 -12769 -12860
11332 -12860 13345 4460 -665 3472 -1481 -11890 -11795 -8643 -8749 -3912 -3864 11933 25327 5943
11318 5943 -19631 -20699 -19953 -5843 6155 -3260 -12691 1373 10853 15255 11796 -8075 -9682 -9385
11304 -9385 -23931 -35151 -23738 -24469 490 13852 18661 10980 954 -12136 -17140 -13583 -16702
11291 -16702 -12796 -8189 -13398 -16665 -7794 11840 20686 30130 15396 -546 6177 11659 18108 25886
11277 25886 27766 49189 57024 50348 51305 49324 46407 58882 63255 52110 43769 39910 29030 36204
11263 36204 26540 24350 18953 8440 -17813 -13054 -323 1651 -2956 -8643 -23142 -18315 -6828
11250 -6828 -1445 -665 -10000 -13649 -7045 -8502 -21121 -26446 -6144 2040 6803 603 -2935 1322
11236 1322 -11852 -19714 -23169 -21644 -8266 -6584 -6832 6763 3093 2362 13670 14478 7627 5801
11222 5801 11381 12697 3187 3583 8053 19807 18288 14265 19148 15175 -3231 -8461 8339 11413
11208 11413 2420 -1649 3479 20081 19798 9614 7508 1278 4657 -2680 -9421 -7141 104 6767
11194 6767 617 -5811 -11091 -7405 -7128 4616 1851 -182 -7282 -22052 -12807 -16118 -11275 -7189
11180 -7189 1798 2704 -3291 -5989 -13224 -5112 1346 313 -5787 -9494 -10198 -1138 -8455 -10169 6748
11165 6748 7849 975 4373 4435 -6978 -2342 20671 31588 16499 -3719 -10390 -16701 -24574 -31048
11151 -31048 -32551 -13192 10710 18202 5375 4449 2358 -5262 -11657 -11595 -3857 13985 396 -2132
11137 -2132 15219 18383 14677 -19597 -37226 -37009 -41716 -36267 -21604 -10946 4588 -3722 -13049
11124 -13049 -14618 -12214 -9383 530 -1846 -1707 -3005 -4413 455 -12602 -35758 -34307 -31748 -16294
11110 -16294 -12665 -14407 -22850 -18967 -9393 -1722 4262 9842 5969 3103 7967 -8609 -17726 -20289
11096 -20289 -22427 -15942 702 -315 -8026 -16541 -3469 4155 -248 -5202 -2805 3817 732 -2444
11082 -2444 10619 19475 14834 11358 14844 10981 6799 6184 -1972 -5050 -772 6996 11816 17450 22079
11067 22079 17983 17752 5822 5360 2675 7341 11036 1717 -1179 -8031 -9596 -18313 -12372 -11960 8683
11052 8683 17880 14831 529 1504 15666 1050 -17218 -8945 7877 6012 -3231 3453 6929 14725
11038 14725 6606 3225 6469 3906 4528 7313 -3837 -29829 -29031 -5448 4046 4992 -8372 -24030
11024 -24030 -8878 12134 7445 -9519 -9665 -4074 7173 17711 16132 10735 4753 19806 25913
11011 25913 18982 6339 2409 10832 9389 14377 19613 17007 9151 11558 9171 7787 -1712 -2913
10997 -2913 -10402 -4905 12364 12436 16252 21051 8673 3152 6155 16649 8819 6255 14889 5374
10983 5374 5887 3121 -3568 3612 15293 21748 29586 30313 8691 -8017 -18704 -5798 5733 13564
10969 13564 2285 -9052 -8354 -9470 -16773 -22273 -22689 -11125 -4881 7704 7274 5608 11915 25274
10955 25274 25085 14944 -4148 -29988 -21826 -9072 -4891 2524 13719 20150 20467 32009 30580
10942 30580 44596 48014 50399 56815 57017 60612 57503 50159 51753 74077 97095 119172 156856
10929 156856 209989 304360 465233 742997 1190290 1695576 1903958 1824772 1720419 1723002
10919 1723002 1712120 1338125 863312 569567 401358 320480 267095 232788 224562 221400 215187
10908 215187 213496 209141 196107 159442 141056 135910 129157 115348 123581 116485 101563 102114 107185
10895 107185 97819 95797 80700 78590 89710 71145 58402 58633 53501 60304 69884 90313 89895
10882 89895 84336 60966 53668 47237 47981 49283 42740 45459 51875 44603 33846 34955 26390 21443
10868 21443 23651 28336 35635 31176 17880 23265 28999 25386 35425 40547 32812 25336 11918 10964
10854 10964 14842 12202 7655 -7424 -17891 -12213 -3993 6865 595 -7560 -10875 -1704 -3098 1046
10840 1046 1690 5582 1068 -716 -18149 -21366 -22252 -15820 10242 23772 19534 8642 6155 -6012
10826 -6012 -17412 -11792 10189 18886 23723 20711 18647 23552 25866 21676 17014 16488 11648 5492
10812 5492 -3754 7315 3824 7975 11170 6295 -5109 -4029 -1957 -5210 -1970 2423 -362 -15454
10798 -15454 -14718 -13217 -5099 -7542 -11021 -23716 -14412 -12588 -6354 -5827 -82 -3602 -7490 -19184
10784 -19184 -21306 -15660 -6204 -9021 -25051 -34784 -31902 -27794 -31253 -31845 -29053 -26349 -19586 -14672
10770 -14672 -11110 -19615 -29086 -19832 3381 6851 9232 20160 22678 9713 6695 3777 3942 3519
10756 3519 -798 4936 -7933 -23289 -16029 -6108 5614 2171 -11822 1511 16959 18470 11198
10743 11198 -4297 -11973 -21898 -30230 -19935 3805 -4119 -9487 -14079 -10443 -11267 4701 10337 13176
10729 13176 13265 3987 -6743 1623 16179 23697 7225 -4031 -22226 -23459 -16082 -13795 -16009 -7713
10715 -7713 -7692 -7353 -6093 -8506 -2296 6534 14722 6521 12239 2549 2871 -973 10438 9253 -3966
10700 -3966 -18921 -11867 -5189 -12065 -16836 -13453 -10439 -9876 -3996 5881 14090 -2233 -13177 -16686
10686 -16686 -25993 -26246 -27191 -8909 4405 -2084 -9577 2966 16241 3771 -19267 -31515 -30957
10673 -30957 -24526 -14033 -7711 -3535 -7111 -10168 -14507 -20639 -19734 -25808 -19885 -3938 14614 19210
10659 19210 17051 10454 5653 -3841 -6753 -15204 -12221 -19294 -14084 3508 8410 9582 3738 1305
10645 1305 3206 1859 -15689 -22399 -23670 -10850 9095 9448 -629 196 9487 15959 5487 6007
10631 6007 10541 15588 24224 16456 -1474 8917 10324 -2493 1253 -13198 -21518 -1040 1010
10618 1010 17793 39797 41498 13291 10003 -2380 -8199 -2297 7334 6394 -823 -20724 -23676 -34626
10604 -34626 -30444 -22426 -14376 -9005 -11816 -13942 -27489 -22579 -15071 -21258 -21923 -23357 -17199 -243
10590 -243 7651 13982 10129 2080 -5838 -14546 -17060 -22182 -23027 -16434 -21441 -9706 -3942 -8541 -5048
10575 -5048 -18940 -23990 -29150 -16902 -11483 -14464 -16653 -9720 -4965 11980 14544 -35 -19495
10562 -19495 -23249 -11012 2357 646 9919 26340 21593 1949 -2654 13308 19477 849 -11004
10549 -11004 -15296 -12757 -5515 -3328 426 -1980 -14702 -18098 -14202 -15840 -3017 -3352 -20618 -26902
10535 -26902 -13423 3627 14177 11594 15567 3245 -84 2187 2378 2689 -238 -4180 -6821 -13691
10521 -13691 -18490 -7434 -9854 -8755 -13054 -1224 -3311 2038 19496 27223 37237 25620 6843
10508 6843 11567 33905 37256 20727 6221 5929 -7639 -5137 4957 13902 18990 10256 16360 15563
10494 15563 8195 7985 23221 29216 29685 28548 12258 19750 17363 13596 13296 8006 -288 -787 -8629
10479 -8629 -2566 3002 9944 10104 9937 -4314 -19786 -13976 230 -3316 -4631 -5996 -28196 -35425
10465 -35425 -31282 -38591 -37156 -13315 -6938 -13498 -14351 -5245 2689 -10024 -28438 -31309 -30126 -34073
10451 -34073 -15179 2067 5534 10596 9 -6360 -858 13724 9051 -4217 -14465 -4667 -23484
10438 -23484 -27100 -16433 -9595 -10036 -19798 -23274 -23667 -2243 5263 -4174 -8932 1284 4985 16084
10424 16084 18069 1645 -4563 7019 8171 5314 -13557 -28247 -18589 -7955 4069 14279 10215
10411 10215 1716 -12709 -23560 -19626 -9173 11818 26712 14440 5334 18289 10553 -3745
10399 -3745 -13626 -13210 -22507 -29940 -23456 -19203 -7782 -13353 -19679 -17126 2149 -1709 -2329 -14744
10385 -14744 -17443 -8439 9350 9855 8451 8386 3243 5544 6856 5822 5285 -11611 -5426 -6202 -10953
10370 -10953 -4060 -1435 11646 15341 -4035 -13389 -5616 23347 16129 6569 -502 276 9057 8753
10356 8753 23670 15387 5113 9400 8492 17915 15175 17383 26058 22715 14009 21325 19270 18643 18781
10341 18781 14297 -4375 -10731 -3215 2340 -6234 -14973 -8029 -6764 2551 2920 4123 9164 6194
10327 6194 -1445 -12532 -34243 -26348 -19789 -10602 -2792 -11524 -28482 -17490 1394 -5376 -6808
10314 -6808 -8909 -16991 -34682 -34745 -22122 -4774 9655 12927 17945 17595 32735 15865 6944 766
10300 766 9969 11122 9854 5044 -13995 -12554 -21461 -7478 10684 3566 -8286 -14135 -29820 -31660
10286 -31660 -30902 -39730 -27222 -24981 -17131 587 -10414 -25402 -21784 -7750 1761 14564 17265
10273 17265 -911 -3030 -3915 -5974 660 24662 35376 16810 1055 7548 16867 8595 -7240
10260 -7240 -1678 3051 -10559 -12106 -10876 -12913 -11479 -15136 -24690 -25253 -23077 -30009 -30792 -24955 -11983
10245 -11983 362 2516 3327 9345 20035 8357 5766 -2353 4407 14432 13318 13762 18205 9004
10231 9004 10880 20095 12091 12471 20397 22829 33324 26488 13932 18527 32772 42135 25432 13970
10217 13970 6527 498 7447 8107 24758 31954 18133 4254 -2295 -17660 -6273 3752 -9312
10204 -9312 -4144 6270 -767 -4907 -2787 -4518 -20350 -17374 -11708 -12741 -15583 -13039 -7726 -14628
10190 -14628 -24620 -32250 -27239 -11978 -35 -8436 -11060 -16583 -18625 -15493 -9800 -5614 -5435 -2147
10176 -2147 -3826 4244 -2665 -5552 -624 3263 5064 -4845 -13304 -19065 -15708 -16130 -9128 1479 3577
10161 3577 9482 5423 -2432 -8018 -3172 5 -7009 5004 7532 -5394 -7345 -4071 -3087 7391
10147 7391 4047 18276 17963 16763 24116 6434 -8011 -8090 -11776 -10198 -24397 -13275 -2414 3584
10133 3584 819 4427 17153 29017 15666 12687 4056 -3062 1103 10103 -3570 -23589 -21650
10120 -21650 -19323 -29215 -17596 -21435 -22164 -15652 -14453 -7797 -8330 -14864 -18598 -22678 -25171 -20833 -18923
10105 -18923 -9350 -6914 -3822 876 11356 13811 -6529 -14489 -6854 1789 11929 15751 14032 12481
10091 12481 7269 7142 12421 22175 29918 26003 27230 27993 15226 6767 -2607 -7089 -4465 6610
10077 6610 11686 3452 -8233 -10194 -18139 -39693 -46692 -34307 -33001 -29196 -26494 -28393 -24467 -17632
10063 -17632 -4027 5010 13162 13814 6776 11224 -1744 -29227 -35464 -14390 -14417 -8535 9333 9748
10049 9748 -9649 -13266 -6642 -9078 -28824 -34827 -33120 -22415 -14777 -23556 -26593 -23704 -13317 -6319
10035 -6319 518 3204 -4789 -3707 5671 5049 6213 -8155 -18796 -24354 -20506 -14407 -19716 -12224
10021 -12224 -18816 -30153 -27717 -36024 -42369 -41324 -31316 -23259 -17912 -16327 -16797 -13801 -1640 8195
10007 8195 3052 4146 -1416 1768 6568 -3364 -7731 -6791 -18489 -26941 -35203 -35492 -19345 -13441 -6212
9992 -6212 2438 -6822 -8005 -11472 -1211 -6327 -7196 -10784 -17392 -7694 -2716 20858 39593 34456
9978 34456 9590 7624 25163 28336 12583 10102 14212 2733 -7763 -10518 -19847 -21530 -22417 -24124
9964 -24124 -22139 1995 14588 14551 15359 -10682 -13252 6800 7702 4401 -15349 -19207 -20010 -14894 -22656
9949 -22656 -8172 1805 -12423 -14142 -12499 -769 485 -11523 -14015 -779 2451 7020 342
9936 342 16606 6356 10213 12515 19833 32461 24419 20780 22521 12740 -1785 -8730 -15535 -13927
9922 -13927 -5013 -1087 7106 5093 -5986 -16268 -5672 6437 18194 13366 8142 -360 7559
9909 7559 25187 27092 15814 10655 3491 9538 30534 44145 44432 24287 9178 2357 -1468 -4259
9895 -4259 -5823 -185 9030 16348 2464 -12684 -4599 156 8684 1301 5452 -456 6295 11299
9881 11299 11260 -45 -12592 -10641 196 4489 -5848 -8813 -20198 -33221 -9021 10487 19713
9868 19713 16864 32969 39714 36333 30966 41561 38745 32764 25768 21390 17670 32345 32411 35961
9854 35961 31107 32839 17833 15907 16087 13321 14061 12585 12286 -458 -759 -4069 -13903 -13640 -17363
9839 -17363 1855 6836 12977 12806 12201 6748 2786 -6838 670 7026 11866 5480 -4223 -5816 3929
9824 3929 7249 9392 -2955 -26768 -22469 -22774 -13040 1010 -2240 -2094 -13018 -16817 -3813 7372
9810 7372 -104 5415 -7612 -14027 -7317 -6726 3813 -246 -3456 -2349 -6896 -6766 1874 -1505 -6722
9795 -6722 -5598 -3706 1653 6813 249 -9037 -6771 12363 27924 19652 17636 16782 4492 -22597
9781 -22597 -33347 -33200 -39189 -43078 -34015 -15503 -10024 -7605 -15727 -18955 -28851 -19416 4662 11068
9767 11068 3164 590 -9211 -17969 -22693 -9990 15973 23144 7781 329 6068 -3113 -11634 -15286
9753 -15286 -3097 11142 9701 4886 -1364 -15530 -2001 9687 -6924 -9939 -8751 -2824 1996
9740 1996 -6729 2194 7363 7867 16170 9759 11036 5542 -5724 -19937 -11576 -4596 -15544 -5239
9726 -5239 -4871 5895 9512 -5024 5095 2820 396 -2818 -831 267 3478 -2953 1101 39
9712 39 2494 -4972 -5017 6312 7209 10952 -1059 -18468 -21216 -16822 -12527 -15976 -20232 -11760 7446
9697 7446 16311 8432 8891 -371 267 5403 2869 -10148 9696 15548 12869 5018 -9157 -12864 -14722
9682 -14722 -6284 7177 249 -15583 5055 28783 37617 33569 20328 -7498 -26782 -11247 3412
9669 3412 -5307 -16527 -2052 11740 16609 11522 3810 -3911 -1946 -9991 -20071 -15839 -7301 -2453
9655 -2453 -7688 -6429 8284 3102 2308 11286 1578 2694 4323 8403 8763 11203 14447 12276 23912
9640 23912 35653 26740 14867 16894 16834 14455 4759 -16149 -5893 21018 17326 17807 15082 -336
9626 -336 -5435 1913 16695 24202 8081 -10400 -18793 -25176 -33944 -23441 -23281 -26430 -22960 18
9612 18 5089 4497 7300 890 3851 -6072 -5193 -4241 8509 7674 4048 12998 23063 12617 13165 24313
9596 24313 26003 16037 24447 27542 26167 14439 20815 23745 21937 25528 15299 4097 -5507 -9731
9582 -9731 -9304 -3757 -18193 -15394 -2585 -1934 2449 -9387 -21201 -27934 -32187 -18376 -12072 9275
9568 9275 21740 24960 28409 13985 1887 16949 18434 18294 28860 30609 20395 19011 20184 18988
9554 18988 23143 22319 28845 37553 24699 14885 6832 8854 3713 13512 9347 -15958 -16229 -4814
9540 -4814 -6930 -5452 -10266 -12458 -20778 -13645 108 394 5752 31717 21200 10576 5910 11120
9526 11120 5390 2051 -4810 -16988 -5570 14975 18787 20398 15567 15213 4076 -4873 -5516 5311
9512 5311 20262 27816 14187 11488 13993 15070 2754 12951 37276 41861 17525 910 9737
9499 9737 -1 -2608 3265 6856 6730 -3013 -415 13465 21130 25956 28736 34528 15735 9432 8117
9484 8117 -3 -4532 -1215 27975 26609 24877 22537 18303 6917 6658 10436 19612 11836 -4599
9470 -4599 -6680 -884 17073 23057 2641 -14873 -8376 -1417 5382 9152 16759 18923 24595 26289
9456 26289 40388 39319 40369 26861 37201 32220 12365 -301 -7101 -3128 11575 18708 24443
9443 24443 14670 16636 25675 35743 33159 24816 13547 11498 9889 -6257 -8770 -12188 -693 -8858
9429 -8858 5735 8396 488 7762 13069 22450 20412 18883 18446 25688 25616 17210 13390 13842 1338
9414 1338 -1609 -1742 -6364 1496 -408 -175 29468 34444 36603 26899 24881 37459 29496 15750 11916
9399 11916 9880 14370 25834 24839 33716 39375 44130 34842 26470 29660 31632 30795 20735 32296
9385 32296 38039 30600 25702 33857 47823 35099 35005 41731 42549 46081 49171 50585 53149 52971 53782
9370 53782 45689 41808 36763 33559 29921 34510 30377 22586 38042 25583 32587 37018 35675 25024
9356 25024 13224 31672 47727 56601 46148 46548 47323 46297 42889 32317 38996 53437 55737 47829
9342 47829 43887 35526 16409 9840 10760 18753 35247 48773 53575 53659 42557 38628 52606 61784
9328 61784 51277 43508 42607 53977 58061 45656 25301 27022 37311 45908 60576 63819 75975
9315 75975 72422 63164 68599 66040 60439 61356 71857 91822 92566 89940 101279 105650 95919 85336
9301 85336 92415 105061 99536 93691 90132 87523 104680 119774 128323 116988 103007 97359 99234
9288 99234 119357 124759 156783 170526 156859 154142 150660 159179 172044 183990 204638 227889 226562
9275 226562 236296 240791 240752 261391 287389 313074 348242 386693 404008 416659 439260 480129 505567
9262 505567 537127 576966 622157 674445 735916 806543 873907 965548 1056586 1159873 1286859
9251 1286859 1427690 1579196 1741306 1910492 2078966 2251725 2418544 2570745 2692918 2802462
9241 2802462 2859138 2890781 2877380 2827094 2742707 2632070 2502646 2364060 2204847 2033583
9231 2033583 1869375 1731038 1613711 1488276 1380265 1282240 1180670 1089953 1024861 974631
9221 974631 930888 887015 837316 778352 728998 698803 676050 641432 596929 554223 523018 516582
9209 516582 504696 481727 455153 444592 428638 409900 401084 382294 348634 313179 297865 297120
9197 297120 299632 287024 278737 280777 260370 251271 254446 252984 246091 232921 216865 217572 225876 227982
9183 227982 197279 173057 178362 189564 186788 189629 184617 170990 170139 164304 170429 158321 135865
9170 135865 128162 140290 131827 122316 117879 117571 113968 106472 101938 101148 110470 122355 106457 96965
9156 96965 100031 96890 95602 91694 74707 71670 77569 79918 84162 81008 64952 64115 75118 69873
9142 69873 62764 66026 70349 73746 74156 79379 88128 89084 80747 75134 74117 72869 62131 54771 53087
9127 53087 47126 44887 54544 45217 40380 45866 53478 37445 40157 43798 46881 38700 25442 29851
9113 29851 30431 33259 35529 34592 35254 33635 46842 38901 31765 27273 12390 9200 18810 15908 14539
9098 14539 27160 28293 26465 17267 2455 -121 16600 35072 37425 28133 2547 -2887 1401
9085 1401 1446 3183 1190 -5013 -4995 -13949 -8118 2122 6891 15777 14209 6277 5318 -560 19269 35389
9069 35389 33955 25936 21332 25097 10111 -1656 -2064 8238 34141 39644 38608 34276 34582 27933
9055 27933 16242 18239 9470 12540 39719 46247 37871 30615 29303 38848 37265 43502 42552 34211
9041 34211 39105 51634 43618 44222 33961 20977 11358 7950 12522 14484 30006 36393 36058 44076
9027 44076 50107 52174 52360 46262 25224 16933 9646 24270 38514 22828 18587 14064 3779 -4441
9013 -4441 6697 5487 2709 1664 4613 5094 9483 24537 24674 20239 16172 13389 13646 21747 33910
8998 33910 11759 13021 21700 31413 34833 24290 27341 20997 18544 19215 16585 14618 4685 -1172
8984 -1172 -1869 11434 22376 8218 -8450 -414 6739 9765 24234 22466 14763 -2865 -12555 -4872
8970 -4872 -104 11913 7664 8708 1780 4945 19702 37002 46797 38330 12117 -8236 -26450
8957 -26450 -11760 -315 -11425 -11637 -28725 -29640 -20292 -7595 -4756 -582 2359 -3479 -6004 3916
8943 3916 10202 8647 2963 8424 616 -6586 3031 1992 -16440 -20913 -22332 -17419 -6983 -333
8929 -333 9070 13929 -3973 -8697 -191 -1329 -6099 8836 14927 5200 13921 11809 4514 6160 15493
8914 15493 7662 -6668 1355 18460 25450 25481 19167 26558 17641 1037 -10709 791 21943 33545
8900 33545 28745 22098 12806 2363 10719 1860 -297 8951 26442 33513 40464 30808 14181 14176 18879
8885 18879 11000 -6377 -9418 -8698 -7042 -131 1557 7293 12603 5047 -397 -2222 5870 14595 11301
8870 11301 10090 3437 -12308 -9106 -11858 -19425 -26774 -31814 -33753 -34964 -16023 -1832 -661 -1031
8856 -1031 2739 15485 9805 3730 -10626 -21640 -6639 10097 10182 -8459 9849 19482 15935 7744
8842 7744 6378 7668 6434 12082 7981 13300 9313 -5857 -330 13132 15478 17700 21964 12041
8828 12041 -5219 9320 20848 14412 -4082 -2472 -1471 -11144 -10768 1511 10587 29071 28569 18922
8814 18922 6260 -3151 -10855 -19440 -18387 -9549 -2834 2061 7611 23492 21465 4546 15481 13534
8800 13534 14715 22085 12666 3198 -1856 -7506 -14206 -14142 -6410 -5701 -14127 -15920 -14922 -11915 880
8785 880 2967 156 -913 -3437 11330 17486 4608 343 3722 -4567 -10644 -12186 -7148 -5680 -3878
8770 -3878 -6109 -10678 -15586 -16586 9051 13522 17875 18286 27500 24852 3377 1831 -5353 -20220
8756 -20220 -31202 -24920 -24157 -14976 16815 23243 13689 16840 12171 21820 17138 12603 20257 19390 7626
8741 7626 -2416 2361 9159 12496 8705 14070 2361 1612 3876 7777 13799 25905 18834 21566
8727 21566 16566 5032 -2350 2182 8978 12462 11494 14416 17960 2859 -6062 -4455 -16359 -14072
8713 -14072 -8270 -2247 10806 23717 18674 13281 -8359 -8187 6305 18307 28012 24616 16023 5334
8699 5334 -5224 -8823 -9924 -13688 303 4200 -1716 -10718 -4586 14853 26167 15378 14049 32606
8685 32606 40603 40868 24587 27462 22571 15243 8058 15595 12207 1788 -7751 -13975 -12325 -1637
8671 -1637 17350 21665 48746 35925 17449 12837 15453 7540 13545 33566 35958 19487 26920
8658 26920 18718 2875 -8683 -9273 -10523 -13600 -8630 10682 10946 14399 23465 25998 25811 35387 42286
8643 42286 38984 45982 42965 42327 40304 39580 36408 25886 26866 40684 47901 43575 37555 28029 23894
8628 23894 28236 42241 38893 31814 25872 20530 9383 20212 33513 37394 32436 28441 16056
8615 16056 20069 36296 39768 31819 22056 31268 44136 45510 46663 56530 48736 34250 29522 41549
8601 41549 38732 42499 46087 41889 43590 50808 41201 28356 34083 43794 48726 51109 48416 45328
8587 45328 43191 48833 43552 36116 47241 50903 57481 57658 62674 58003 39437 29918 31093 26965
8573 26965 29590 49982 57406 34701 23837 27780 42618 44411 54970 43382 26239 20716 25963
8560 25963 40409 35512 36037 29232 34689 50756 53795 57246 93232 133703 169424 190872 208805
8547 208805 223395 227413 205495 147656 81923 53286 60475 65050 32975 23949 25472 13311 21724
8534 21724 44859 45714 25228 23068 19647 25154 15481 25039 35637 34309 35696 36484 34091 32266
8520 32266 35950 42363 53018 49024 41397 29913 38509 47318 50244 60100 79385 88990 126344 196644
8506 196644 294209 377703 391498 366674 341254 344752 320345 239571 168242 113398 88344 63709
8494 63709 57432 64565 59957 48250 42931 44791 53883 64898 58271 66532 79587 71779 60877 48416
8480 48416 46031 44746 51558 46700 48721 55184 39403 31757 39380 39254 39755 41346 47333 58145 61115
8465 61115 62914 79482 110932 151447 170889 200352 202544 188817 194113 188431 154504 115014 90827
8452 90827 71691 67781 49217 33130 39518 34292 40857 39789 37416 18615 10914 28790 42964
8439 42964 40986 23154 15355 16800 15384 12149 3839 -4513 3161 -142 7780 12376 8304 5852
8425 5852 -920 1945 6592 12707 20714 26329 24913 12885 3755 5637 18164 21043 10864 22109
8411 22109 45170 32104 20490 21256 17702 19864 24184 34108 22954 17355 11382 17940 18839 27551
8397 27551 19007 21530 21251 9933 14428 21339 24477 29871 30244 25949 14154 1990 -7211 -11670
8383 -11670 2278 21861 20311 4899 -984 9196 16106 14800 8173 5699 21811 29139 22518
8370 22518 9712 -5326 -6753 -7592 -8594 1406 5436 14679 31662 26284 22858 22187 13333 11565
8356 11565 3542 -9809 4765 22826 22533 2758 -2073 -1268 -3169 6332 4377 4230 557 -4638
8342 -4638 -2698 -2012 -2829 -12686 -5487 6613 17370 11595 2815 -5797 5413 12859 -2147 -20567
8328 -20567 -19628 -8084 -10139 -9350 -10587 -4524 5387 8321 11865 3144 -8825 -8187 4990 4912 -8212
8313 -8212 -8344 -9077 -18858 -12141 -10175 -5911 -19597 -7756 15748 12647 -488 -352 -13563 -14832
8299 -14832 -23288 -16202 -30352 -31583 -26749 -6860 7514 14135 25722 27448 20738 8435 1608
8286 1608 3562 9636 15653 21671 19734 23547 38530 31197 10314 961 14067 7994 5788 -497
8272 -497 -8918 -24813 -21814 -4351 -1358 21 -4276 -6242 5436 3113 6452 14338 3819 -4438
8258 -4438 -7277 -16485 -8357 -1539 -9534 -12514 -13183 -16250 -9936 7725 8626 7724 -216 -7979 7053
8243 7053 7404 5059 1853 -4775 -10126 -13678 -9618 -2911 -5031 -15024 -24652 -24166 -9487 -5055 -5414
8228 -5414 223 -6742 -14638 1011 4416 2026 1284 -3098 -19167 -25269 -12343 -10796 -14806 474
8214 474 18632 24404 20386 21214 17866 15635 3825 326 -8715 -5484 2264 -1533 12939 26336
8200 26336 31225 30411 12978 120 5630 1823 -3690 -2808 -4763 -16893 -6119 -5157 -7054 -5315
8186 -5315 -14883 -12865 -11833 -15195 -15806 -7180 2130 1776 -1276 5085 3580 6742 10363 -2115 -16538
8171 -16538 -16110 -18902 -38502 -30778 -24089 -9045 13594 23039 16107 13973 27365 21994 19933 14614
8157 14614 1670 -17513 -24077 -12840 -5602 -4835 -12534 -26826 -20103 -5520 -9388 -12376 3514
8144 3514 10243 20795 22624 8635 5769 2069 2674 85 -3674 -9348 -19025 -5481 1585 11357
8130 11357 14331 4984 12277 6945 -8928 -17148 -27296 -19604 -23909 -9231 -7933 -22329 -30883 -20690
8116 -20690 -26402 -32538 -26501 -6878 9785 12039 -3448 -17912 -10189 -5223 6935 19101 22721
8103 22721 12017 2781 1958 1314 -537 187 17127 18232 11228 2538 2784 11950 10959 11376 12530 16311
8087 16311 6222 -3337 -3864 -5899 -15495 -13101 -14410 -12319 7428 28047 11168 -3424 4984 -13452
8073 -13452 -21893 -20728 -21350 -16388 3295 -598 -179 10261 17396 11551 -3325 -2309 6682 5153
8059 5153 -3297 1923 9452 20315 15149 12766 8348 11677 13492 15736 13912 8166 7136 18666
8045 18666 22146 -2663 -7595 840 22629 42541 31501 4979 -1514 -12502 -17160 -6698 -4747
8032 -4747 7577 7360 2437 9475 28512 45757 38163 22916 14734 11887 17447 38081 46947 49908
8018 49908 40311 39475 42764 49063 51753 47892 50984 51264 37174 28837 26003 31532 34998 37355 47234
8003 47234 32902 27246 26488 26002 28311 21132 16892 32960 37725 37449 46532 29896 43247 67782
7989 67782 92747 104403 102775 95430 94523 82598 72937 72826 81835 79092 89117 118879 151661 166065
7975 166065 155842 143164 142932 143803 127940 103756 85098 79619 82882 72661 64986 53056 43686
7962 43686 50976 63282 62247 56005 49647 44793 50894 70645 83646 87919 76709 68238 55464
7949 55464 56786 58503 67352 79434 86096 81903 88089 89183 100064 116920 131622 135565 141270 157831
7935 157831 178979 193087 187669 176546 164491 167356 151542 133132 122813 114066 97243 83625
7923 83625 82601 68643 52724 35943 24717 31462 52591 48023 48499 39296 38385 51262 36187
7910 36187 27512 28809 40930 60651 72537 77444 71351 73284 69960 51276 47702 55839 62302 68839
7896 68839 59811 56513 53776 68445 60453 45136 58641 55481 38184 27657 23023 20699 36939
7883 36939 50758 40608 44875 54384 49841 42233 38154 41736 38804 31942 16995 7884 5153 10271
7869 10271 24252 26439 19683 19540 17852 27438 39015 36606 20107 13594 15862 11773 25319 25510
7855 25510 21479 5580 4505 3620 6834 10835 20304 31349 12168 2538 9515 19191 13534 4081
7841 4081 1233 4091 9349 3998 -11812 -16478 -5857 1481 -4082 -6971 3682 6035 -3399 -6936
7827 -6936 -14697 -13900 -13166 -6774 1435 -2255 2219 7723 7321 2235 1610 2816 3349 -12784 -9828 -15965
7811 -15965 -20929 -27084 -19286 -2432 -15978 -31536 -28199 -13364 7638 8920 2374 -1510 -25889
7798 -25889 -15884 -2045 -190 -7540 -4144 -14552 -12597 -22186 -22013 -14027 -2609 -1298 -15766 -25228
7784 -25228 -8431 2340 51 522 9363 10950 13317 14307 9350 -1843 -1285 -13115 -14579 -11851
7770 -11851 -627 -6883 -29349 -21783 -21449 -24030 -25599 -20899 -11932 -11014 -9142 -16887 -11506 4467
7756 4467 5580 -1191 -10676 -27296 -32048 -24829 -18667 -17967 -9162 -1554 -5011 -16029 -8214 10461
7742 10461 12701 8957 6387 -4704 -4959 10221 2731 -15512 -22329 -9666 -8475 -14694 -12510 -6010
7728 -6010 4090 15704 12972 1773 -8740 -6063 -6835 -10191 -60 7077 1790 2047 5831 -3520
7714 -3520 -4188 -19433 -9380 3646 -1935 -13400 -12973 -7113 2715 -2055 -17056 -13539 -3365 -5069
7700 -5069 -10717 -11076 -21475 -29377 -15545 -7501 8146 28433 33252 2896 -14206 -20905 -10680
7687 -10680 7817 5023 -2662 -9009 -5601 -8252 -10824 -21098 -16419 488 12496 7102 -13401
7674 -13401 -23281 -12678 -10145 -9279 -87 15227 2337 4513 1395 884 -8528 1745 9594 -3783
7660 -3783 -16737 -19819 -32120 -33876 -6146 7233 -3688 -233 1545 -3477 -1563 26338 26545 8279
7646 8279 1328 7725 15562 6420 -3756 1944 9078 12014 13535 8362 22623 35373 21128 12818
7632 12818 3969 5865 14745 9010 -1577 -18998 -13345 -14893 -7077 1724 -6617 -8331 1807 6215
7618 6215 4739 13688 11132 2275 -8372 -6459 4952 13249 14208 19087 12867 3122 7316 12234 15029
7603 15029 7263 6459 2378 6727 16470 5404 -3909 -4484 -15046 -20784 -18018 -7854 -9989 -13558
7589 -13558 11921 19704 19547 22970 11490 2570 8383 11955 207 356 -1861 7222 18479 20603
7575 20603 21469 18418 1460 -11654 -7140 -10096 -4326 491 2509 -4688 4901 9512 -1886 -4863
7561 -4863 -9978 -16748 -20887 -22063 -26500 -18491 -23013 -10329 -9627 -11384 -14157 -1120 5701 49 -8396
7546 -8396 -6659 -1383 -529 4248 247 -1422 4403 16494 5515 1549 -1191 -5843 -1412 8312 4103
7531 4103 -12946 -8802 13467 15837 14684 23547 14298 6005 -1213 -5354 -10993 -22223 -12803 648
7517 648 3558 7915 5955 7900 16734 13724 538 -2880 -6970 -5347 -2601 301 6885 -4910 -4109
7502 -4109 -3682 -20930 -26489 -14150 -13574 -7740 -4081 -9908 -21982 -14068 -4752 -2742 -5289 -291 -16882
7487 -16882 -12637 -17085 -22062 -8919 2485 8391 1127 -1539 -4458 -2361 -2610 10165 18390 20424
7473 20424 10976 2792 -3571 11465 22311 23011 15803 20036 17467 1572 -15403 -32869 -28002 -25326
7459 -25326 -19291 -18533 -26426 -18183 -15959 -24152 -17363 -15302 -34378 -32235 -25865 -25217 -8714 7661
7445 7661 2427 -2030 -2475 -6755 -9290 -6664 -11568 792 -7903 -29226 -34554 -26560 -13327 -6499
7431 -6499 -6427 -1445 6960 -5485 -2035 -7416 2040 -1024 -27445 -22394 -13305 -15019 -17981 -15045 -18479
7416 -18479 -6922 10274 10476 -8688 -8545 -15964 -15422 -16152 -17537 -20232 -19423 -22703 -30703 -26302 -23633
7401 -23633 -29341 -34609 -25602 -11855 -9330 -11565 -5604 116 -5628 -19621 -27915 -27543 -23688 -26515
7387 -26515 -5377 -9109 -4354 -3668 6765 3082 5712 13697 11256 18715 4200 -6241 -17278 -5222
7373 -5222 -6944 1186 -5697 -19124 -15369 -8777 -3653 -6631 -7712 -4337 -6370 8433 16327 23703
7359 23703 22880 10752 -437 -13975 -22635 -20708 -6919 852 -576 -5294 -3792 -5115 -18995 -30669
7345 -30669 -27190 -23893 -5449 5932 -7291 -13143 7903 5165 -18936 -24554 -1122 13132 14525
7332 14525 -2240 -22742 -31902 -20119 -21356 -26932 -25678 -10362 5024 4655 2706 -710 4677 7836
7318 7836 14561 7860 -7211 -14352 -13118 529 -8364 -6953 -14817 -25006 -14493 -15973 -14582 -9758
7304 -9758 11557 10357 8264 5345 685 -2048 4333 3651 -4401 -1928 -4543 -9047 -14632 -5040 8127
7289 8127 9278 6827 13343 22735 15646 13372 8112 1089 3789 10693 13848 13143 379 2160 -7950
7274 -7950 -22005 -27453 -21099 -17323 -29842 -26930 -4000 4170 901 5687 17599 19758 17036 10770
7260 10770 15616 19871 5247 -7353 -11515 -8450 2507 16189 20501 8008 -4377 -10190 9233
7247 9233 13674 1735 -16543 -16754 -1108 6026 -6471 -7581 3811 4750 -1210 -3355 4449 3051
7233 3051 -4885 -8702 -3433 126 -8747 -2747 21139 28452 25522 15457 12193 -356 -6846 -8333
7219 -8333 -12428 -18062 -15190 -22036 -26844 -23770 -11869 641 9332 6890 2950 2489 4637 -2282 -11034
7204 -11034 -20787 -17015 -14393 -18962 -19027 -19094 -10571 -1817 -3689 -23190 -23955 -33995 -26939 -18917 -20652
7189 -20652 -20892 -14414 -10469 -24212 -10228 5808 502 704 -9642 -13284 -22912 -29980 -39683 -38705
7175 -38705 -36416 -25863 -28015 -35238 -9104 -15255 -20308 -8304 6860 -3470 -5322 -1398 -7743
7162 -7743 -6281 -14516 -15547 -22534 -17621 -16848 -12962 -12373 -10964 -7624 -5383 -8800 -7267 4376 -4731
7147 -4731 -11259 -12713 -15831 -14798 -20135 -165 4194 165 -1898 -1089 8173 13460 4584 6979 9182
7132 9182 8756 4806 -6159 -14310 -4799 -12305 -4969 12002 8959 -4848 -9144 -21301 -13209 -2528
7118 -2528 7415 15005 9618 11293 -9099 -10891 -4661 7476 11192 6299 15458 2426 -3657 10174
7104 10174 14132 7740 16812 21553 -3421 -19736 -6772 20225 36621 42460 41289 20002 6163
7091 6163 -1152 5934 15608 6424 6429 -4403 -4725 8227 4473 8305 3646 8793 24827 23464 13902
7076 13902 1304 -461 -6599 -6286 -13726 -27929 -13729 -5929 503 6980 26928 6092 -13517
7063 -13517 -23494 -15365 1520 -8171 -26522 -15037 -4154 2104 -6830 -13427 -20634 -5706 12733
7050 12733 3742 3338 7709 2339 -1010 -6347 -18168 -12477 -2758 -6483 -25059 -8159 -1209 -8762
7036 -8762 -12275 -15122 -12578 -6757 -13686 -30258 -27990 -10135 -4062 -9324 -2946 -9649 -15049 -7025
7022 -7025 -4294 -3394 -1848 -7773 -12273 -1179 7106 -6546 -2330 8871 250 1129 -2340 3114 -275
7007 -275 -3114 791 -10366 -8908 -3476 7923 17432 9070 -13053 -10303 12038 32404 27042 3843
6993 3843 -2307 11459 12400 8272 5943 25780 28082 31213 32462 18268 11504 8005 6223 -13879
6979 -13879 -20889 -10756 -11450 -24391 -21926 -9171 -11454 -19193 -5319 -4628 -8429 -18918 -18054 -7410
6965 -7410 -2808 -16725 -15386 -14021 -18305 -3630 -5077 -5030 -4813 1585 -3487 -13371 -10314 -5096 513
6950 513 2129 3646 5055 6954 7425 10694 14430 19756 13234 10761 3258 -6752 -5228 -9834 -2427
6935 -2427 9156 5613 6788 6510 3668 -2408 -24086 -35044 -38754 -36933 -22699 -19464 -15206 -1854
6921 -1854 -8168 -587 -3160 -21327 -20976 -17701 -26634 -36255 -40560 -43707 -31070 -21088 -23441 -23938 -33640
6906 -33640 -23936 -12010 -23725 -18873 -19463 -14566 -10827 -15548 -11581 -9276 -10286 -16907 -27205 -23670
6892 -23670 -14784 -12462 -9132 -8717 -13165 375 11676 5457 -14815 -22778 -27067 -29447 -26331 -17131
6878 -17131 -22972 -30875 -27429 -25600 -25813 -16673 -2896 4659 5473 1751 -7105 -16290 1146 7342 3131
6863 3131 3987 10187 -5544 -14580 -279 -5465 -11982 -9165 -12005 -18219 -10780 -1344 257 -8344 2056
6848 2056 -1758 1533 -151 -1364 15583 7192 7836 14275 24786 35722 40243 31120 17261 13679
6834 13679 12587 -2358 -20845 -23317 -13163 -8192 -6817 -758 4993 6379 16926 26011 14077
6821 14077 6740 9427 1446 16350 15821 -137 -2412 8021 28444 22449 22215 34385 35214 37314
6807 37314 32018 21983 14168 -10815 -21718 -7227 217 -15650 -13357 -9772 -12556 -7123 97
6794 97 6219 8872 4616 2332 6677 3050 17772 20823 27572 22141 13881 7760 13392 22634 23016
6779 23016 27308 1237 -4104 6591 -1404 -6404 -11324 -132 10849 -7889 -17099 -5371 16077
6766 16077 13147 -4420 -12962 -12361 -16249 -31596 -27427 -19154 -20163 -17819 -4813 6352 -9033 -13908
6752 -13908 -772 5805 15676 13458 1572 -21444 -16448 -1924 6620 16155 18698 17392 22485 12465
6738 12465 -4120 -20113 -27028 -15151 1247 -6770 12472 24702 16901 21049 5201 -12370 -10541
6725 -10541 -13785 -23534 -27146 -25648 -24191 -24017 -8543 -1650 -12272 -15704 -4871 5286 6391 2442
6711 2442 1270 -5805 -5727 -14993 -13232 -4157 -4354 705 6174 2768 -13161 -20941 -16297 -4937 -596
6696 -596 6300 10462 11885 23 -2981 1794 26063 18528 11679 -5731 -25134 -17377 -16538 303
6682 303 13618 16540 -3581 -24825 -35545 -21454 -8665 678 -663 8560 7350 13618 14585 2830
6668 2830 11809 22376 27484 9234 8235 13963 8315 11505 9495 22496 29878 29701 12011 2024
6654 2024 -8584 -17278 -22367 -8464 2747 -12457 -24526 -14578 -12325 -6894 -4987 -9116 -10701 -17794
6640 -17794 -20408 -18504 -16354 -35192 -49494 -43914 -32793 -24860 -6385 -9691 -16355 -9028 -2866 -14393
6626 -14393 -35707 -26298 -14981 -9628 -2737 3437 6031 684 -11806 -9152 -7252 -2641 148 -7222
6612 -7222 -19796 -19357 -21099 -2245 12812 14114 6660 -18351 -16253 -4090 3532 -5150 -12776 -6057
6598 -6057 -367 2684 -4486 -30793 -30295 -1943 -1810 -12282 -19544 -19706 7032 13148 -7146 -16464
6584 -16464 -5810 -4451 -11344 -25780 -27034 -19281 -4305 9608 22500 17048 13598 9365 5073
6571 5073 2893 -4329 430 1468 -5253 -17289 -19722 -19628 -9057 -17377 -13219 -6851 5300 19245
6557 19245 21590 11758 5839 17203 4604 -8960 -9464 -2329 1958 9910 14624 14155 1096 5421
6543 5421 13039 19106 14161 -12382 7392 26960 12355 15358 13334 3256 4694 -3772 4019 13040
6529 13040 23098 18592 9197 11253 11467 5033 -14419 -28824 -25237 -4927 -100 -5823 711 3149
6515 3149 -1138 -14567 -32541 -26701 -843 -6387 -15353 -16299 -15015 -15917 -11516 -1926 12101 7051
6501 7051 -3028 -7249 7555 26719 14939 13608 26776 23746 7090 10835 22113 21676 7388
6488 7388 10048 22009 3027 -3652 -10495 -13371 -19909 -27738 -36114 -14789 -8347 -3825 -1199 485
6474 485 -11677 -29084 -24714 -15831 -2508 7592 11547 -333 9069 8701 5228 23866 20283 4628
6460 4628 -823 -778 -1509 -19942 -40045 -38876 -23261 -18669 -21294 -20411 -19048 -10138 1946 2022 13516
6445 13516 11054 -15503 -29254 -20503 -16379 -5900 2243 -11113 -20221 -18177 -15741 -8870 -16450 -11752
6431 -11752 -8661 -12530 -13837 2411 -420 -17631 -18749 -12742 -32316 -31056 -24971 -20724 -9809 -13732
6417 -13732 -4186 6600 4987 2748 3378 14579 12746 1639 -6631 9017 11269 3375 -7836 -18917
6403 -18917 -21175 -16217 -7552 -22448 -19198 -15270 -2060 6475 13446 9170 1869 6019 -108 9124
6389 9124 23142 11596 171 -6791 -15530 -15369 -14178 -8276 -11717 -27418 -37251 -19932 -16358 -9843
6375 -9843 -13596 -12080 -8483 -13294 -7741 -3712 1532 -3399 -2342 -12596 -17087 -1599 13580 14212
6361 14212 14970 4846 -12840 -6113 -17812 -23099 -9805 -3083 -11877 -12132 -848 9729 17150 7583
6347 7583 -717 -3363 -2591 -37 -2907 -10856 -8427 -3406 9712 10310 6242 21749 24276 12846 8542
6332 8542 3047 6561 4395 13170 28192 33016 6161 -499 6471 -2150 1767 21250 14128 -700
6318 -700 -3220 6011 10391 20262 20668 13914 11257 -5202 -4542 -459 -9496 -4112 -16535 -14063 -3831
6303 -3831 -16802 -8964 4079 7666 -2424 -4228 -2469 -17404 -12048 -8474 -10429 -34395 -41882 -12844
6289 -12844 5663 -576 -7149 -965 -19275 -19815 -27779 -30804 -19088 -17633 -2813 5563 9853 13740
6275 13740 -6451 -14237 -11459 -4554 7953 -273 -10144 -15281 -10420 4681 9652 -4379 -18277
6262 -18277 -16082 -7352 -10934 -22804 -8228 7137 -1927 -14567 -24759 -15964 -9270 -26262 -20385
6249 -20385 -7646 -6145 -8709 -12015 -21635 -35496 -20055 -11013 -5039 -1714 -12668 -20648 -26023 -40719
6235 -40719 -44952 -33304 -19951 -12491 4713 5298 1688 1745 459 -14537 -20113 -17874 -17221 -7399 -8348
6220 -8348 -1999 4362 -5175 -23314 -18794 -5545 -480 -3586 -9609 -716 2907 -1416 9965 15351
6206 15351 5562 10150 14290 23747 18008 2033 -4709 7218 2551 1373 182 6384 9810 9670
6192 9670 10261 7712 12007 24915 26038 24109 27207 10270 13 5976 10716 6731 -39 -17466
6178 -17466 -21475 -11587 -3925 9688 15489 15677 10359 24317 22495 4117 14247 15858 -3444 -7570
6164 -7570 -18286 -23522 -14192 -2196 4528 1245 -12351 -20067 -9516 -9006 -9881 1336 12850 14840
6150 14840 19705 8947 3064 -3843 -2164 6095 14185 9373 27569 32544 15424 8567 11655 9536
6136 9536 3834 -9154 -13290 -10025 4720 8626 14111 7914 3643 -2329 3324 12762 12923 14086 8427
6121 8427 9485 25719 34870 26337 18490 19131 24365 31704 36712 30717 17137 23373 42109 44512
6107 44512 30402 17433 14727 3814 1983 1043 -3169 -11628 -27150 -23922 -5348 574 1796 -3242
6093 -3242 -8433 -5846 1599 8782 18826 25562 29202 26818 27198 28659 27267 27684 26146 24762 12184
6078 12184 15532 15058 8312 -4045 476 -10473 -17089 -5097 -5236 9001 17119 18209 10663 -5567
6064 -5567 -1460 3464 15749 24772 30321 7517 2468 9664 26430 21974 5511 -4762 -7594 -3163
6050 -3163 916 3706 -4483 -14411 -10823 10148 10658 7458 -6903 -17703 -11504 -15347 -11772 -21364
6036 -21364 -23335 -13117 -6247 6378 5231 -4820 -14373 -8146 -7597 -6329 -24318 -21149 -21948 -23174
6022 -23174 -20381 -16813 -16031 -12936 -18283 -17645 -17629 -19220 -28497 -8835 4338 7237 5065 6374 6970
6007 6970 15264 21356 19101 21439 21398 15310 13710 6622 8288 16479 12782 403 11681 11461 8709
5992 8709 -2832 -3761 4365 5145 8645 -23 -13660 -25082 -5744 1426 -567 -1192 9271 21154
5978 21154 6109 -13791 -12997 -6079 -21513 -12161 9364 18298 26732 10557 2462 -46 -11231
5965 -11231 -8962 -9255 -6327 1513 -9405 792 1913 -20806 -16004 -13339 -20016 -22094 -18674 -20424
5951 -20424 -35106 -13679 -1270 -861 -685 5655 2768 5366 5714 -7371 -11778 -10011 -16441 -19420
5937 -19420 -15175 -5121 -7490 -13661 -21968 -23301 -10182 -3930 1967 3680 5614 3662 6123 4856
5923 4856 -3519 -7849 -5483 -8604 -3970 -12231 -22587 -26972 -26908 -22473 -13324 -17196 -17043 -19145 -17995
5908 -17995 -1214 8489 2168 -1580 838 -81 -3068 -9751 -7883 -11379 -11392 -18121 -26658 -38375 -43837
5893 -43837 -24694 -956 -373 10506 31478 27463 15623 14067 14016 11232 134 3748 -707 6254
5879 6254 2175 -2865 -2625 -2879 3592 -1697 -13426 -7813 -14114 -23529 -8866 -5474 -14690 -11624 6108
5864 6108 9258 -9084 637 13949 11059 -3719 -7357 -4160 -8361 -29345 -27552 -17961 -11765 -14555
5850 -14555 3655 19803 11924 7397 16602 8412 5269 11265 23321 31865 24881 394 -13762
5837 -13762 -12783 -2217 7027 -9321 -10012 -23783 -26849 -18533 -6448 11635 11309 7864 11127 30722
5823 30722 37037 52404 46653 32334 23008 14573 8156 730 -4322 2430 15665 3365 -3454 -4795
5809 -4795 1056 9473 12885 18453 35934 31794 13651 4887 594 3319 2298 -9615 -13931 -8596
5795 -8596 -16748 -16142 1928 15421 10501 664 -4875 -10827 -13183 -16162 -28235 -12679 -5424 1218
5781 1218 -9384 -18395 -12088 -10253 1543 8471 -5818 -13600 -13506 -21914 -29561 -23811 -24438 -19752 -23293
5766 -23293 -2619 1360 859 10515 15700 14859 20429 18108 12224 10684 4287 -8481 -13659 -18008 -15968
5751 -15968 -17376 -7668 -17727 -11299 -3863 -4572 4368 2077 -5271 2939 10978 9339 -8372 -8845 5032
5736 5032 11557 13515 1248 8017 14398 6605 -2666 -3642 -2634 -7874 -9440 -13863 -15012 -11724 -19356
5721 -19356 -593 9472 8714 -3507 -25042 -15908 -2255 14671 3919 4234 10320 3261 -16215
5708 -16215 -24500 -15934 1261 3751 3752 9312 1927 -7986 -3759 -6353 -4434 10146 4504 -6030 5629
5693 5629 24994 25686 15875 8420 5730 13649 11617 14894 28622 24607 28434 12749 4764 1602
5679 1602 480 -512 7966 18915 23383 36647 23568 19745 20011 15981 21214 7320 780 -1612
5665 -1612 -6871 -2592 2660 12256 9453 6334 6274 14078 3462 -782 -13152 -16668 236 9492 9776
5650 9776 2840 -2942 -13640 -4244 9492 14142 18925 15552 3116 3335 -2314 -13887 -16351 -23864
5636 -23864 -15798 -287 -1080 -990 -3371 8149 449 -13899 -22073 -9197 749 -24459 -25200 -29972
5622 -29972 -31555 -25826 -19125 -8571 -11454 -30103 -35345 -22134 -10701 2436 326 -1382 -19979
5609 -19979 -21344 2336 -132 4007 6777 16137 12986 5201 -3563 -1882 2137 -1255 -12558 -3409
5595 -3409 1370 3335 6076 21639 41864 35143 21212 4714 3274 1694 2135 -5174 -14995 2985
5581 2985 9414 21620 13202 -10599 -10887 -188 13039 14465 1966 -14160 -10600 4853 10231
5568 10231 11152 9408 -7018 -10530 -8514 338 -5471 -9266 -10483 -1296 2586 -17937 -21579 -21118 -25671
5553 -25671 -19589 -8674 -1312 10852 5844 -372 -4722 624 9661 4894 -10718 571 19850
5540 19850 16178 -1379 -13926 -17723 -15588 -2967 12256 5142 -7690 -17715 -16174 -14739 -18279
5527 -18279 -21067 -22599 -6550 4 5594 3449 8534 18241 11739 1724 8137 13224 11567 17810
5513 17810 14096 5953 16907 35753 38117 44345 46963 31526 6500 -10382 -8851 3986 11453
5500 11453 -2047 -7222 -7928 1371 1076 4458 10911 -6544 -21188 -35139 -31376 -21697 -15480 -19635
5486 -19635 -16413 -6015 -6187 3399 10423 19117 21872 19753 15326 15110 12724 12575 -3836 -369 1953
5471 1953 2069 -12071 -2327 10262 -5133 -6614 -360 -286 -5139 -16098 -14429 -10196 -9001 -4507 8253
5456 8253 -10595 -25540 -30369 -30824 -8722 10550 6068 -1726 -180 7632 68 -6516 2245 20022
5442 20022 24219 12572 15216 10828 -11257 -12201 180 873 -13956 -4766 6903 7297 -6303 -6762
5428 -6762 -3818 -11700 -15780 -2912 11319 14631 922 -7418 -4492 -7342 -8580 -1825 3119 7075
5414 7075 15105 17560 16679 10308 3118 -6830 -6750 5741 9088 8865 5102 13290 8553 7327 -11391
5399 -11391 -15898 -8197 1610 -7400 -17618 -14359 -19837 -25069 -23703 -11211 9911 10252 8452 3487
5385 3487 8744 20919 17312 15164 8562 3324 7842 19028 30534 26117 25288 1382 -29902 -44329
5371 -44329 -21579 -12943 -12199 -5102 1802 -10429 -6056 -24516 -26857 -22234 -36635 -26350 -11779
5358 -11779 3419 4381 -9956 -6547 -14489 -19641 -25962 -25521 -16943 -10871 -1672 -3597 3109 1955 5254
5343 5254 13154 -2648 -23263 -14273 3535 7838 8289 1347 4764 8899 13463 4885 3054 20944
5329 20944 22481 18535 23524 24193 20638 18615 24613 17585 15721 25222 35437 40122 35538 32893 12585
5314 12585 -1326 -6015 -6482 -5579 -2369 15594 28972 24765 24244 11857 -9252 -17228 -29768 -15165
5300 -15165 -14135 -24465 -14949 -12838 -4827 -5196 -1991 5398 15505 15257 15090 12669 1485 -8297 -8817
5285 -8817 -9505 -15825 -16751 -24534 -17370 -11347 -13595 -19228 -8234 2375 12441 13489 15344 8484 10500
5270 10500 1671 -11491 -33385 -25275 -19577 -14211 -6518 -7041 -3340 -6216 -9517 -8817 7176 13270
5256 13270 5210 2798 1565 7400 34721 41941 22979 1321 -10712 828 -919 -16961 -34005
5243 -34005 -31189 -17929 3749 10190 -1828 4113 16562 10124 -2792 -22703 -26574 -655 1360
5230 1360 -8083 -12583 -7043 -6322 -12884 -12802 1337 9920 10876 17964 23916 27515 25700 27624 50366
5215 50366 35779 17604 3377 7927 -1602 -7630 1566 10826 14580 7841 7699 14616 5847 -1175
5201 -1175 -19824 -16901 -2047 96 13608 1569 -26798 -48669 -45083 -35077 -32921 -30546 -22616
5188 -22616 -2091 8365 12492 -3741 -9975 -2724 4094 -4952 937 2484 -7863 -7188 -3874 -5555
5174 -5555 -10092 -11887 -9328 -5582 -5950 -9467 -21814 -19047 -21395 -27912 -28232 -15458 -12752 -10855 -6042
5159 -6042 3589 3555 7868 5047 -15731 -9338 -3897 -14910 -6136 1017 -6238 -2034 -2604 -13311 -16358
5144 -16358 -12909 -19542 -14478 -2540 10444 10271 -4382 -18464 -17421 -21874 -21970 -25687 -7995 -6008
5130 -6008 16424 25235 24067 25595 13924 20097 13638 11711 10713 14631 -2308 -6015 -9161 -10971
5116 -10971 -20986 -20352 -15469 -14788 -8440 -6771 -6791 -1673 6137 10357 6973 2670 1694 -4758 -15035
5101 -15035 -20060 -12078 -10777 5087 20552 21242 18381 14414 9195 -5658 -18176 -28934 -24429 -13635
5087 -13635 -9988 -3068 -1972 -5017 -14848 -13196 -2194 -1968 -8489 -18073 -21125 -5075 -2645 685
5073 685 2238 2399 -6946 -25315 -31731 -36347 -35449 -11642 5781 -4551 -21159 -26473 -24971 -10231
5059 -10231 4234 -6519 -11633 -6121 1214 5681 1953 4717 10837 10438 22849 13362 150 6583
5045 6583 24082 10193 -676 -13702 -20397 -21465 -6768 -12562 -23265 -9329 -5358 3960 -785
5032 -785 -11251 -15043 -10361 2835 3774 -4877 -19721 -20718 -1536 3903 -3096 -2810 5973 4349 13598
5017 13598 21957 15690 8785 6513 18642 6935 -5238 -3533 -3215 -12738 -6095 -652 13186 18277
5003 18277 6712 1829 3979 2470 2537 13438 16305 -2484 2132 489 -3312 -7789 -15079 -9771
4989 -9771 2372 5804 14902 6232 -6678 -15726 -22089 3903 15327 3642 -5518 14987 25710
4976 25710 25567 15696 9881 12809 11140 16903 16983 14767 13671 -5413 -18743 -20449 -11778 -14689 -23798
4961 -23798 -18163 3247 24499 22547 13166 -6509 -6679 2662 -4966 -12654 -665 6274 -7596 -22557
4947 -22557 -15904 -16590 -20637 -15605 -12335 -21242 -32953 -36992 -27615 -17501 -8406 -1737 1705 9388
4933 9388 3676 -590 -6572 -7928 -5162 -15259 -7042 -213 2369 13493 10432 4434 1699 16448
4919 16448 26106 24838 7237 3724 11297 2063 -2063 4350 6288 1797 -9985 -13067 -13966 1497
4905 1497 5687 12475 12846 4548 1529 -168 -3413 -11090 -20148 -25428 -33241 -29213 -19864 -20098 -15062
4890 -15062 -5254 -2977 4958 3258 10464 12915 1459 -5053 -19217 -27062 -28097 -13616 -12474 -22238
4876 -22238 -11350 -2567 -2987 -7644 -924 -326 -8456 3003 3011 -6348 -10376 -210 4437 -2720 -1335
4861 -1335 6823 3014 22731 38783 34296 26710 16989 14381 18551 11802 13961 20476 19647 6003
4847 6003 8691 -8064 -8884 4010 10160 10704 12589 -3519 -7700 -6925 -12919 -3535 10338 24239
4833 24239 18447 19869 13662 3807 -14462 -22706 -22328 -24005 -12690 -11555 -12331 -10348 -20635 -22187
4819 -22187 10929 8579 -5269 -15489 -18050 -16189 -2347 -185 -1890 -18237 -24106 -34326 -29811
4806 -29811 -13538 -9207 -12201 -7858 13979 16265 11440 28901 18379 1248 -9590 -1533 3873
4793 3873 4232 -1273 -14584 -20942 -2601 9083 -9643 -12075 -11104 -11579 2676 8523 573 -354 4028
4778 4028 -1124 -5271 6383 19894 19873 9153 -7962 -34025 -24731 -36142 -39871 -36525 -40393 -27425
4764 -27425 -7142 -8804 -14246 -3342 4365 -3338 -22236 -27240 -15526 -2183 5454 1883 -5279
4751 -5279 -6773 -805 -9014 -23505 -17771 -21971 -17635 -8017 -1062 -10276 -22602 -23821 -15819 -14789
4737 -14789 -7511 -10939 -12129 -3869 12780 5959 -4707 -11746 -13028 -5048 9993 11178 -2201 -16260
4723 -16260 -13227 -1090 9339 17699 623 8349 23711 24450 25452 31785 20598 13490 -557
4710 -557 -21550 -38605 -18244 -11164 -17732 -13431 -19264 -22491 -23635 -24149 -30490 -15550 -11640 -15193
4696 -15193 -6510 17042 9843 4553 -4138 -10992 -1021 -4465 -5289 -5729 -12822 -13485 -17890 -14468 694
4681 694 -5265 -7892 -8912 -8817 -11089 -18286 -15393 -4335 1356 8433 2096 -3026 3909 19883 20007
4666 20007 18770 11500 3506 -1679 -387 880 956 3864 560 4102 4103 18120 14409 -981 -5147
4651 -5147 -3311 -4726 -5983 718 5822 5484 -2467 -6302 -145 -534 -11228 -23470 -8525 15769
4637 15769 22350 23479 6883 2876 13137 5358 -3634 11779 11759 2629 6088 6776 -1694 -19853
4623 -19853 -24149 -7073 5936 -7661 -9654 -15674 -16182 -3973 -6142 -7137 -641 2965 11261 -4695
4609 -4695 -21930 -12579 -8426 -18454 -24102 -22747 -16090 -191 -15292 -27496 -15536 -9074 -5469
4596 -5469 11341 4592 -5369 -4975 6157 21428 14061 6938 5005 7177 8962 13439 1684 -8872
4582 -8872 -9782 2466 -1053 -5737 3121 -4845 -3073 -10458 -24146 -25245 -11264 10591 13553 6019
4568 6019 -2717 -4837 -163 2838 1053 -2916 2200 -6543 -1423 13235 11064 -27 -4222 12415
4554 12415 10987 -5149 -17311 -10363 1638 13329 10771 9040 20575 28734 19957 25625 15380
4541 15380 4626 -4176 -7873 4488 -711 -10682 -7901 -1153 -2370 2524 27480 33338 21119 22282
4527 22282 16003 5634 -8132 -1813 -16614 -21025 -31214 -28998 -9925 -5024 4419 -10267 -1740
4514 -1740 6210 1615 -2181 6791 -2468 -14735 -16476 -8938 -2236 903 10003 22263 21831 10236
4500 10236 13730 24407 20857 17968 21869 22243 2389 1725 15020 18142 20643 15895 15856 17709 8774
4485 8774 2948 9586 2354 -20537 -26193 -5744 7553 597 -10126 -17522 -17231 -16553 3738 -2256
4471 -2256 -4339 5483 2687 -16017 -17560 -20573 -6303 5104 12220 67 -5681 -9261 -8151 -1357
4457 -1357 2397 -3079 -18999 -9354 7832 13779 11217 5739 -507 -5147 6816 7701 13159 12918 23871
4442 23871 18352 18428 8270 1874 10143 3977 -1883 -4526 -13522 -5987 13934 23936 30769 23297
4428 23297 40308 42974 26867 701 -16454 -8107 -7951 -12344 -3967 2988 7696 15850 13251 4297
4414 4297 6996 15705 13828 10444 9324 -2738 -12736 -14990 -6745 -5807 -7361 -17449 -28919 -17768
4400 -17768 -15058 -12329 -10087 10895 24159 21421 5506 4016 9526 -2740 4789 14114 12592 9541
4386 9541 7267 18255 17687 11414 6106 -1486 -2170 1911 -7165 -1402 17412 22531 17168 9491 14685
4371 14685 4051 -1661 14645 15103 14315 22220 13095 7222 -3777 -312 4564 13697 8524 13558
4357 13558 23853 17752 14722 29481 21538 3893 -2948 -15905 -16339 -611 -1080 -2346 10999 25024
4343 25024 15027 11389 12131 2198 -6114 5417 15098 -2562 -8045 -5926 -3134 7701 9160 5993
4329 5993 -3275 12154 20337 24372 23956 30489 32665 23421 30451 33003 15381 21952 22552 8369 3088
4314 3088 984 -8128 9272 14904 15359 323 10921 2238 -16768 -18995 -9838 -12746 -5291 2257
4300 2257 21242 26572 18489 -662 2246 20781 20646 15822 309 5227 5381 -2683 -6222 -8028
4286 -8028 1823 -2928 -14693 -18718 -5527 6619 -9572 -31707 -44111 -35048 -16606 -4414 11712
4273 11712 7656 6798 11595 4035 -3674 -13278 -20953 -8376 3936 -6119 -17399 -13778 -8503 -14568
4259 -14568 -15023 -5449 -2310 6702 8756 848 -5288 2538 1919 64 4554 10811 11631 13789 10161
4244 10161 9820 13863 6065 -839 -10167 7923 -835 -2034 3878 7099 16763 17758 4379 -5664
4230 -5664 -19525 -19421 -12364 7212 20044 4256 -11833 -15701 -10023 4055 14189 19592 8441
4217 8441 8163 5327 4542 -4568 -16828 -23392 -16906 118 20009 24607 19894 1714 -8299 7281
4203 7281 10953 -14408 -20116 2848 18601 16481 16787 8741 3947 11742 4667 -3737 -2154 -2537 8137
4188 8137 -2339 -7821 -8706 -9372 -23367 -23563 -15699 -8707 15912 28647 17507 14646 23470 25407
4174 25407 23845 13144 13912 5296 2661 7962 -3275 14369 30430 15729 5813 5512 -9733 -3403
4160 -3403 7507 -3589 -9497 -23921 -19062 -5030 10736 25647 15783 13842 12144 -1555 -3575
4147 -3575 -3102 9871 17572 5403 -1383 4549 3413 4144 17489 3418 1995 1856 -8405 -1762
4133 -1762 9783 24411 27407 10882 22608 23489 23848 20807 19670 2499 -509 -627 -6933 -2091
4119 -2091 -12999 -7972 2500 8327 -5249 -28094 -26003 -1167 1594 -3005 -3852 -5102 7304 8599
4105 8599 1922 54 3555 13564 13424 4980 10853 7892 2532 8325 17325 20824 8285 6307 3336
4090 3336 -7641 -8098 -1817 -17506 -21167 -16842 -19186 -21522 -13894 2080 -6047 -4015 -4002 13677 22834
4075 22834 13497 15384 13665 3012 74 735 3098 2784 1742 3798 5384 6570 12812 5338 570
4060 570 2170 10126 17865 5813 -18434 -21722 -16150 -6878 -2434 5822 12533 -1484 -18863 -17988
4046 -17988 12 2577 -9846 -6108 1758 -17066 -19509 -8156 879 -6070 -5941 -24284 -330
4033 -330 11310 18932 18780 11065 -12598 -19309 -5037 -864 -5 50 -3299 -7496 -7573 325 1372 -1552
4017 -1552 11292 13676 19077 23081 25397 24777 12306 8031 18445 29188 20910 5660 -7386 -16233
4003 -16233 -10886 4740 -2290 -5967 -21222 -9678 1177 4665 817 -5245 -7750 -11571 -19028 -24263
3989 -24263 -12220 6837 5779 10541 16707 9988 11587 8386 7615 739 16733 13363 5869 -4010
3975 -4010 -4090 2811 10116 11337 3215 12117 7347 -411 747 -3064 6387 5750 973 -14615 -12832
3960 -12832 15834 21229 16016 8172 10107 5984 -6692 -2880 8142 16781 2754 -18993 -18605 -12458
3946 -12458 -24402 -24592 -20534 -18716 -5929 7258 24077 28223 16341 8895 15612 25407 29552 32199
3932 32199 33196 11476 3663 5467 13301 25077 18549 15439 4757 6475 13027 14423 10149 9876
3918 9876 16194 22037 21591 25873 34794 34307 23677 12485 4239 -5630 2062 8567 26377 39553
3904 39553 32115 2712 -8633 2935 4565 -2854 743 4636 18423 12979 9170 -11766 -6711
3891 -6711 -3321 -6416 1602 3870 10017 17471 16717 1106 -4235 444 4410 6329 -3583 -7065 1457
3876 1457 19498 7467 -11132 -6153 -6162 -2092 -2294 -9383 -8696 -7543 -5076 -6380 -3204 4591 6936
3861 6936 8426 11280 5909 -2469 -13408 -28229 -28437 -19239 -10174 -8413 -4901 6574 16997 18020
3847 18020 28255 26593 6109 1927 4904 -2390 -6864 -15126 -18343 -8985 -13810 -23049 -18657 -2197
3833 -2197 13008 16252 6358 -3077 3020 437 2717 1256 -945 -402 -5687 3176 4200 11963 14042
3818 14042 -3697 -4518 -1833 -4370 -10327 -14026 -31860 -32133 -16050 -6236 -14456 -5158 -8623 -241
3804 -241 8448 10640 -1222 -4603 -9229 -9348 -744 -2551 495 2543 -3893 -7336 -8338 -790 -271
3789 -271 -13158 -8587 -14153 -11960 -10066 -6616 -4737 -4371 -7956 6653 9166 5209 4165 2746 3913
3774 3913 -2407 -6805 -7854 9950 20979 11927 59 8540 16368 12854 -10353 -34809 -24125
3761 -24125 -13330 -11851 427 6614 15354 14642 1800 -4277 -12159 -10066 -8297 1746 17248 26270
3747 26270 12887 -496 -18169 -19442 -1586 18090 11590 8819 12490 16544 7866 16269 4860
3734 4860 -3989 -10420 -23848 -29872 -12095 -14326 -8133 2344 -5434 -7472 -10140 -14259 -19869 -13550
3720 -13550 10350 10602 11084 17345 19261 10665 13076 11238 9282 -6469 -590 -6883 -19716 -15258
3706 -15258 -18312 -9032 -435 23 -9624 -26618 -33387 -15701 -1299 6260 2457 -5324 -5903 -8983
3692 -8983 -671 12057 10112 8196 82 -13017 -8882 -13589 -2320 8909 10214 -6592 -17272
3679 -17272 -8451 -14118 -24247 -31124 -36943 -31138 -10763 -6935 -2588 281 -8190 3353 3658 -11901
3665 -11901 -13789 -14340 -202 -2266 -4895 -8114 -9256 5107 15489 10451 4789 5684 4621 17115
3651 17115 15905 9242 13427 10101 3320 -572 2918 1813 7775 824 13274 18403 23145 20125
3637 20125 12659 6481 10547 14632 16279 16575 10218 3082 -5740 -385 5404 6707 9984 9819 5917
3622 5917 21589 22943 9665 -588 -6956 -5600 3629 -19 8895 3535 732 -11182 -21160 -17877
3608 -17877 -4568 7536 17519 12600 13923 -1208 -6013 15727 26333 25732 25334 11798 17245 2823
3594 2823 -9240 -6121 -1268 -2474 -6890 7553 26163 27179 19400 12676 5183 -2489 -6818 -3099
3580 -3099 2993 3664 -8578 -11621 3051 594 4862 -1068 -1290 -12930 -14808 -26448 -38274 -43723
3566 -43723 -39819 -21214 -10372 -11718 -8631 -17208 -12359 -5847 -11005 -14079 -12264 341 4163 8154
3552 8154 3867 18068 33008 28877 32009 36836 24897 12048 3641 6047 6019 5998 8833 16120 25923
3537 25923 34638 19351 2385 -16125 -13984 -14602 -9540 7311 9292 2420 -3760 -8766 2521 12833
3523 12833 5081 1846 7564 1407 -14560 -469 12541 3117 -7087 -18087 -17844 -16192 -14858 -3199
3509 -3199 3515 7956 2606 9390 27027 31395 6197 -18368 -15881 -9744 -7655 -13009 -15136 -7283
3495 -7283 495 -18152 -12992 -8852 -7086 -15258 -15097 -16183 -6103 -8500 -18742 -16753 -5287 6909
3481 6909 10178 -5357 -23030 -8394 -9110 -5776 3205 4840 11716 3507 -10010 9258 18843 2900
3467 2900 -3775 6143 8233 -7945 -12568 -6940 -8519 -1920 4636 6201 13612 23345 24525 19457 12163
3452 12163 14143 16206 14195 11234 -1684 -15231 -19787 -20987 -20565 -20084 -26586 -20741 -16840 -26435 -33279
3437 -33279 -25382 -25828 -30080 -32947 -11230 -6258 -17468 -14514 -12791 -6280 17378 23280 12261 9530
3423 9530 9636 4768 2876 1197 -6239 -21080 -18692 -13796 1450 17576 10107 -6519 1516 5075
3409 5075 13127 10540 8735 10092 6636 4424 10859 26515 21016 25903 34441 20698 17522 22471
3395 22471 30282 32194 33229 28551 30292 27320 12944 1232 7446 12099 7319 1687 4110 -7000
3381 -7000 -5022 -4669 -122 -322 3224 7050 71 -3973 -9561 -15806 -19031 -8510 -4167 -8536 -18368
3366 -18368 -24086 -27151 -12220 -1115 -3336 3165 11144 19236 30401 22810 -751 -21345 -20395 -10240
3352 -10240 -1433 -14103 -15768 17862 23164 6844 -4465 -3147 -6687 -4001 -9073 -13676 -21678 -13397
3338 -13397 3907 10249 -11926 -17193 -8102 -15602 -11107 17200 18628 9679 11196 15749 11916 6619
3324 6619 6673 15480 22053 18251 5564 -8955 -13702 -16722 -10892 -21958 -21518 -21582 -22347 -16984 -22385 -24441
3308 -24441 -12896 -7952 -9614 -9882 -8832 -24846 -27117 -22668 -26367 -28169 -28323 -18748 -12775 -7681 3357
3293 3357 10661 4505 4774 7634 1493 -5611 -7446 -3840 -18937 -20576 -12628 -4060 -999 11382 8645
3278 8645 12434 14211 3365 -5700 -17793 -17379 -7243 3152 9380 1605 -343 5275 -3060 1045
3264 1045 -728 -854 8614 18669 10117 -6632 -14127 -2806 4831 3048 -11826 -15118 -38861 -30881
3250 -30881 -5263 16793 14523 22777 15659 4839 -12334 -20366 -11829 -5234 -499 -7797 1040 3332
3236 3332 5657 17680 17599 11395 1186 -13046 -1688 41 -1373 -15297 -14792 -14584 -19764 -2668
3222 -2668 12883 -3054 -5198 -1313 -16788 -195 -102 -21180 -16430 -9749 -15298 -22948 -17363 -6676
3208 -6676 -14068 -12738 -16392 -17874 -17092 -7789 -2591 3866 5555 -7897 -3321 698 8498 11401 -642
3193 -642 -14972 -15512 -11579 1060 7890 22313 36547 25043 16373 12798 -5817 -7242 7928 32016
3179 32016 35927 20254 7745 1886 6749 7282 628 -216 9740 10759 6915 2535 8276 16422 25589
3164 25589 28284 11899 -1760 -5009 -5566 1358 -5869 -5653 -6318 -10703 -2879 11053 4938 -1508 -569
3149 -569 661 -2918 -3667 4240 7289 7128 14463 9088 12321 11475 5914 -818 -7188 -12220 2249 -475
3133 -475 -12679 -16961 -12843 -6145 -13886 -14683 -8070 13558 19841 12969 8516 -1685 -23495 -32557
3119 -32557 -19776 -1693 9738 17728 14476 -4582 -6589 3277 -2014 -713 10201 13718 4826
3106 4826 -691 -14450 -13582 -3588 15710 16488 17658 14533 2358 12422 16315 6364 1510 -5625
3092 -5625 -7433 -1312 -3766 8 5863 17126 28775 35240 14391 -8806 -4674 4272 9587 7421
3078 7421 6408 9670 15626 3984 1351 -16666 -15842 -2967 2160 -12237 -12744 4987 2888 -10807
3064 -10807 -21213 -8419 -19384 -17501 -11308 3091 5957 -7581 -5402 -4102 -3142 -9561 -22349
3051 -22349 -23021 -12334 -8997 -18410 -28836 -34714 -25802 -7932 -5196 -26536 -25777 -5483 -4869 -11537
3037 -11537 -14451 -12820 -8859 -11501 2330 13832 -7910 -21382 -19956 -14703 5037 20023 34583
3024 34583 29277 25085 23293 18135 1201 -3772 14894 12232 403 795 -7131 -17694 -20374 -7277
3010 -7277 -10964 -12674 13255 18503 9416 -6540 -13151 -16185 -14144 9493 24235 16391 15970 5092
2996 5092 5314 21396 22041 7064 5396 -3677 2612 8125 6167 6202 8092 7282 12267 10251 8127 1330
2980 1330 -3580 -3715 -1799 -12087 -19075 -263 9653 3021 -7263 -12097 -9573 3865 18420 2046
2966 2046 -20564 -13736 -5026 -11135 -18238 -16760 -21826 -36373 -35820 -14700 -5748 -248 6202 7046 -472
2951 -472 7465 20421 22214 14367 -10330 -26857 -15683 -3615 9127 6686 2555 11405 8596 12402
2937 12402 10091 15328 -95 1145 6807 1412 1690 -5937 -5907 -2271 -7031 -7584 9253 20639 7223
2922 7223 -7424 -19871 -33833 -22589 -15552 -19050 -12501 -16130 -11482 -5229 -14720 -9096 -5764 11635
2908 11635 7368 -411 -290 -9020 -16625 315 18744 37703 30975 5440 6234 -1255 924 -7095
2894 -7095 -6261 -5795 -19099 -24344 -10555 -17174 -17241 -14031 -9000 -4974 -8875 -7672 -5880 -4299 4859
2879 4859 22142 27524 11930 5725 12954 17395 -7706 -20916 7065 13811 245 -14195 -2523
2866 -2523 12082 4160 -6786 -9473 -8074 1504 1578 6812 20105 19046 11448 20984 35615 22716
2852 22716 5845 6229 1584 -8230 -12312 -2042 5991 -487 -9529 -1154 1493 4994 15474 -641
$$ [...]
##END NTUPLES=NMR SPECTRUM
##END=
