##TITLE=Analysis number 318927
Compound Code cc 08804
Project Code adrs
Chemist Name fudan
##JCAMPDX= 6.0         $$ Bruker NMR JCAMP-DX V2.0
##DATA TYPE= NMR SPECTRUM
##DATA CLASS= NTUPLES
##ORIGIN= Bruker BioSpin GmbH
##OWNER= nmr
$$ XWIN-NMR		Version 3.5
$$ Tue Apr 25 11:00:05 2006 GMT Daylight Time (UT+1h)  MAYBRIDGE\nmr@NMR_250MHZ
##.OBSERVE FREQUENCY= 250.131544655141
##.OBSERVE NUCLEUS= ^1H
##.ACQUISITION MODE= SIMULTANEOUS (DQD)
##.ACQUISITION SCHEME= undefined
##.AVERAGES= 16
##.DIGITISER RES= 18
##SPECTROMETER/DATA SYSTEM= dpx250
##.PULSE SEQUENCE= zg30
##.SOLVENT NAME= DMSO
##.SHIFT REFERENCE= (INTERNAL, DMSO, 0, 16.522)
##AUDIT TRAIL= $$ (NUMBER, WHEN, WHO, WHERE, WHAT)
$$ ##TITLE= Audit trail, XWIN-NMR		Version 3.5
$$ ##JCAMPDX= 5.01
$$ ##ORIGIN= Bruker BioSpin GmbH
$$ ##OWNER= nmr
$$ C:\u/data/dgb/nmr/ADRS/2900/pdata/1/auditp.txt
$$ ##AUDIT TRAIL=  $$ (NUMBER, WHEN, WHO, WHERE, WHAT)
(   1,<2006-04-25 10:59:39.51 +100>,<MAYBRIDGE\nmr>,<NMR_250MHZ>,
      <created by zg, POWCHK disabled, PULCHK disabled
       configuration hash MD5:
       84 BC 41 DB A1 6E 1D 46 DA 25 12 A5 C1 ED C5 3A
       data hash MD5: 64K
       0F DA 06 2E 41 63 91 0D 51 61 58 22 64 3B BA 17>)
(   2,<2006-04-25 10:59:54.76 +100>,<MAYBRIDGE\nmr>,<NMR_250MHZ>,
      <Start of raw data processing
       ef LB = 0.3 FT_mod = 6 PKNL = 1 SI = 32K 
       data hash MD5: 32K
       95 CF 95 9D D2 AC 97 68 B3 25 06 30 7A 3D 53 DA>)
(   3,<2006-04-25 10:59:56.44 +100>,<MAYBRIDGE\nmr>,<NMR_250MHZ>,
      <apk 
       data hash MD5: 32K
       23 AB 5E EF 49 AC 23 F2 6F 22 BD C0 7B 21 16 32>)
(   4,<2006-04-25 10:59:57.23 +100>,<MAYBRIDGE\nmr>,<NMR_250MHZ>,
      <abs ABSG = 5 
       data hash MD5: 32K
       5D 87 7D 67 F0 0F 6A 3A 29 77 C3 1D 78 42 15 F1>)
$$ ##END=
$$ 
$$ hash MD5
$$ 2E F1 63 87 AA 5F 70 18 D6 3F 6C 0C FA 02 0E FB
##$RELAX= 
##$RELAX= 
##$RELAX= 
##$RELAX= 
##$RELAX= 
##$RELAX= 
##$RELAX= 
$$ Bruker specific parameters
$$ --------------------------
##$DU= <C:\u>
##$EXPNO= 2900
##$NAME= <ADRS>
##$PROCNO= 1
##$TYPE= <nmr>
##$USER= <dgb>
##$AMP= (0..31)
100 100 100 100 100 100 100 100 100 100 100 100 100 100 100 100 100 100 
100 100 100 100 100 100 100 100 100 100 100 100 100 100 
##$AQSEQ= 0
##$AQ_mod= 3
##$AUNM= <au_zg>
##$AUTOPOS= <18 >
##$BF1= 250.13
##$BF2= 250.13
##$BF3= 250.13
##$BF4= 250.13
##$BF5= 500.13
##$BF6= 500.13
##$BF7= 500.13
##$BF8= 500.13
##$BYTORDA= 1
##$CFDGTYP= 0
##$CFRGTYP= 5
##$CHEMSTR= <none>
##$CNST= (0..31)
1 1 145 1 1 1 1 1 1 1 1 1 1 1 1 1 1 1 1 1 1 1 1 1 1 1 1 1 1 1 1 1 
##$CPDPRG= <>
##$CPDPRG1= <>
##$CPDPRG2= <>
##$CPDPRG3= <>
##$CPDPRG4= <mlev>
##$CPDPRG5= <mlev>
##$CPDPRG6= <mlev>
##$CPDPRG7= <mlev>
##$CPDPRG8= <mlev>
##$CPDPRGB= <>
##$CPDPRGT= <>
##$D= (0..31)
0 1 0 0 0 0 0 0 0 0.06 0 0 0 0 0 0 0.0002 0 0 0 0 0 0 0 0 0 0 0 0 0 0 
0 
##$DATE= 1145959178
##$DBL= (0..7)
120 120 120 120 120 120 120 120 
##$DBP= (0..7)
150 150 150 150 150 150 150 150 
##$DBP07= 0
##$DBPNAM0= <>
##$DBPNAM1= <>
##$DBPNAM2= <>
##$DBPNAM3= <>
$$ [...]
##$SUBNAM7= <"">
##$SUBNAM8= <"">
##$SUBNAM9= <"">
##$SW= 20.6930455092707
##$SWIBOX= (0..15)
0 0 3 0 0 0 0 0 0 0 0 0 0 0 0 0 
##$SW_h= 5175.983436853
##$TD= 65536
##$TD0= 1
##$TE= 295.16
##$TE2= 300
##$TE3= 300
##$TEG= 300
##$TL= (0..7)
0 120 120 120 120 120 120 120 
##$TP= (0..7)
150 150 150 150 150 150 150 150 
##$TP07= 0
##$TPNAME0= <>
##$TPNAME1= <>
##$TPNAME2= <>
##$TPNAME3= <>
##$TPNAME4= <>
##$TPNAME5= <>
##$TPNAME6= <>
##$TPNAME7= <>
##$TPOAL= (0..7)
0.5 0.5 0.5 0.5 0.5 0.5 0.5 0.5 
##$TPOFFS= (0..7)
0 0 0 0 0 0 0 0 
##$TUNHIN= 0
##$TUNHOUT= 0
##$TUNXOUT= 0
##$USERA1= <user>
##$USERA2= <user>
##$USERA3= <user>
##$USERA4= <user>
##$USERA5= <user>
##$V9= 5
##$VALIST= <valist>
##$VCLIST= <CCCCCCCCCCCCCCC>
##$VD= 0
##$VDLIST= <DDDDDDDDDDDDDDD>
##$VPLIST= <PPPPPPPPPPPPPPP>
##$VTLIST= <TTTTTTTTTTTTTTT>
##$WBST= 1024
##$WBSW= 4
##$XGAIN= (0..3)
0 0 0 0 
##$XL= 0
##$YL= 0
##$YMAX_a= 279513
##$YMIN_a= -336709
##$ZGOPTNS= <>
##$ZL1= 120
##$ZL2= 120
##$ZL3= 120
##$ZL4= 120
##$ABSF1= 16.522
##$ABSF2= -4.171173
##$ABSG= 5
##$ABSL= 3
##$ALPHA= 0
##$AQORDER= 0
##$ASSFAC= 0
##$ASSFACI= 0
##$ASSFACX= 0
##$ASSWID= 0
##$AUNMP= <proc_1d>
##$AZFE= 0.1
##$AZFW= 0.1
##$BCFW= 0
##$BC_mod= 0
##$BYTORDP= 0
##$COROFFS= 0
##$CY= 12.5
##$DATMOD= 1
##$DC= 0
##$DFILT= <>
##$DTYPP= 0
##$F1P= 14.0000005364418
##$F2P= -0.99999901652339
##$FCOR= 0.5
##$FTSIZE= 32768
##$FT_mod= 6
##$GAMMA= 0
##$GB= 0
##$INTBC= 1
##$INTSCL= 1
##$ISEN= 128
##$LB= 0.3
##$LEV0= 0
##$LPBIN= 0
##$MAXI= 10000
##$MC2= 0
##$MEAN= 0
##$ME_mod= 0
##$MI= 0
##$NCOEF= 0
##$NC_proc= -5
##$NLEV= 6
##$NOISF1= 0
##$NOISF2= 0
##$NSP= 0
##$NTH_PI= 0
##$NZP= 0
##$OFFSET= 16.522
##$PC= 1
##$PHC0= 159.3906
##$PHC1= 6.949777
##$PH_mod= 1
##$PKNL= yes
##$PPARMOD= 0
##$PSCAL= 4
##$PSIGN= 0
##$REVERSE= no
##$SF= 250.13
##$SI= 32768
##$SIGF1= 0
##$SIGF2= 0
##$SINO= 400
##$SIOLD= 32768
##$SREGLST= <1H.DMSO>
##$SSB= 0
##$STSI= 32768
##$STSR= 0
##$SW_p= 5175.98343685301
##$SYMM= 0
##$S_DEV= 0
##$TDeff= 65536
##$TDoff= 0
##$TI= <Analysis number 999999
Compound Code 99
Book Reference 9
Project Code 9>
##$TILT= no
##$TM1= 0
##$TM2= 0
##$TOPLEV= 0
##$USERP1= <user>
##$USERP2= <user>
##$USERP3= <user>
##$USERP4= <user>
##$USERP5= <user>
##$WDW= 1
##$XDIM= 32768
##$YMAX_p= 358593538
##$YMIN_p= -620254
$$ End of Bruker specific parameters
$$ ---------------------------------
##NTUPLES= NMR SPECTRUM
##VAR_NAME=  FREQUENCY,     SPECTRUM/REAL,   SPECTRUM/IMAG
##SYMBOL=    X,             R,               I
##VAR_TYPE=  INDEPENDENT,   DEPENDENT,       DEPENDENT
##VAR_FORM=  AFFN,          ASDF,            ASDF
##VAR_DIM=   32768,         32768,           32768
##UNITS=     HZ,            ARBITRARY UNITS, ARBITRARY UNITS
##FACTOR=    0.157963299565203, 1,           1
##FIRST=     4132.6476996994, 0,             0
##LAST=      -1043.33573715361, 0,           0
##MIN=       -1043.33573715361, -620254,     0
##MAX=       4132.6476996994, 358593538,     0
$$ Real data points
##PAGE= N=1
##DATA TABLE= (X++(R..R)), XYDATA
$$ [...]
27219G877026j81045R7456J36563J78187J00912O4609k9941J3970j21849k4909
$$ 7877026 7695981 7793437 7930000 8108187 8209099 8273708 8243767 8257737 8135888 8110979
27209H110979o548n088j22211J34046J11733q312r2270q3169J37478J75495J21958
$$ 8110979 8104431 8099343 7977132 8111178 8222911 8214599 8122329 8039160 8176638 8352133 8474091
27198H474091j6630o0633Q3102J58702k2092j51003k0825M869l2327o7156j34081
$$ 8474091 8457461 8396828 8479930 8638632 8616540 8465537 8444712 8449581 8417254 8350098 8216017
27187H216017L7494J22978R5475J14876Q8782j52787l422K03083J05167j51396
$$ 8216017 8253511 8376489 8471964 8586840 8675622 8522835 8519413 8722496 8827663 8676267
27177H676267l0001J63377O2548J71171R2122j33059k26359k81289q082M6623
$$ 8676267 8646266 8809643 8872191 9043362 9135484 9002425 8776066 8494777 8486695 8533318
27167H533318m5250M9531J00797K12656J47910K4802r7200n1670j06937k0371
$$ 8533318 8488068 8537599 8638396 8851052 8998962 9023764 8926564 8874894 8767957 8747586
27157H747586J49354k0803J02189M6089N6110J42370J9585j53979m8046n6550
$$ 8747586 8896940 8876137 8978326 9024415 9080525 9222895 9242480 9088501 9040455 8983905
27147H983905J5527P6024N4006P9246K31949O0472j22237l5958j13780k7647Q828
$$ 8983905 8999432 9075456 9129462 9208708 9440657 9501129 9378892 9342934 9229154 9201507 9210335
27136I210335K2761J19839r7799l979j09245R5430N9493M3763J78656K39589K5045
$$ 9210335 9233096 9352935 9255136 9251157 9141912 9237342 9296835 9340598 9519254 9758843 9783888
27125I783888j14241O880K09m4694p0869p8652J74500K91814J59278j09933m7804
$$ 9783888 9669647 9676527 9676736 9632042 9561173 9482521 9657021 9948835 10108113 9998180 9950376
27114I950376M3879o5192j67295j18760k3274n1162Q1410J80514J40806R9536
$$ 9950376 9994255 9929063 9761768 9643008 9619734 9568572 9649982 9830496 9971302 10070838
27104A0070838j73582j8193o05M3574l1224L7522Q6361J17763p5380r6596J03000
$$ 10070838 9897256 9879063 9878458 9922032 9890808 9928330 10014691 10132454 10057074 9960478 10063478
27093A0063478M4791j70392N4711o1789M497p010K40582J59420n8458p4219J4387
$$ 10063478 10108269 9937877 9992588 9930799 9935296 9928286 10168868 10328288 10269830 10195611 10209998
27082A0209998L1925J2657K1352K23798N5318j77757n0631l6414n6803j37226
$$ 10209998 10241923 10254580 10275932 10499730 10555048 10377291 10326660 10290246 10233443 10096217
27072A0096217N2864J4529j70318J6979M8991J88449N746K16393N3056j10944
$$ 10096217 10149081 10163610 9993292 10010271 10059262 10247711 10253457 10469850 10522906 10411962
27062A0411962J9928J64801j0639n3287j42277j52856J70208K43914L8624k09426
$$ 10411962 10431890 10596691 10586052 10532765 10390488 10237632 10407840 10651754 10690378 10480952
27052A0480952j39938J33536Q3355R061m6629m3671o5817L1870J42044J58343
$$ 10480952 10341014 10474550 10557905 10566966 10520337 10476666 10410849 10442719 10584763 10743106
27042A0743106J5642j02399j509n300K1387J9043J16310l8857J5503J02796n5124
$$ 10743106 10758748 10656349 10654840 10649540 10670927 10689970 10806280 10767423 10782926 10885722 10830598
27031A0830598j58884Q2317j0424J91123J19593J30736L4962o0738k58881o1066
$$ 10830598 10671714 10754031 10743607 10934730 11054323 11185059 11220021 11159283 10900402 10839336
27021A0839336R8790M3450j366J37031k4763O2347m2006k13892j47830j03672
$$ 10839336 10938126 10981576 10980210 11117241 11092478 11154825 11112819 10898927 10751097 10647425
27011A0647425M3965J76791R7268K0474Q4451l5803n6561j573J5044j34701J01823
$$ 10647425 10691390 10868181 10965449 10985923 11070374 11034571 10978010 10976437 10991481 10856780 10958603
27000A0958603M7217j28887K2449J08604K44240L9470j46140l0586M3938m1932
$$ 10958603 11005820 10876933 10899382 11007986 11252226 11291696 11145556 11114970 11158908 11116976
26990A1116976m3235p7543J35618J51511j042K4348j85521j81072j828J13620
$$ 11116976 11073741 10996198 11131816 11283327 11282285 11306633 11121112 10940040 10938212 11051832
26980A1051832J89248m7418j16711j09287K4316l3027O362J196r4607M5853N6120
$$ 11051832 11241080 11193662 11076951 10967664 10991980 10958953 10965315 10966511 10871904 10917757 10973877
26969A0973877K9125J21054p9825o9897N6017J26032Q6724K555o9454o5935J85444
$$ 10973877 11003002 11124056 11044231 10974334 11030351 11156383 11243107 11245662 11176208 11110273 11295717
26958A1295717q4652j88516K1281J6818j3787p8246p1297j40486j60957R9210
$$ 11295717 11211065 11022549 11043830 11060648 11046861 10968615 10897318 10756832 10595875 10695085
26948A0695085J05297P2383J46555M2781j13359l7293q8892r967l5939k25266
$$ 10695085 10800382 10872765 11019320 11062101 10948742 10911449 10822557 10812590 10776651 10551385
26938A0551385o1489J74515Q8086m3555j5639P923j19129k7263J28166M4634k5211
$$ 10551385 10489896 10664411 10752497 10708942 10693303 10701226 10582097 10554834 10683000 10727634 10702423
26927A0702423J9698n1599j00517K9814M2074n5307J6681N6387J11148j38770
$$ 10702423 10722121 10670522 10570005 10599819 10641893 10586586 10603267 10659654 10770802 10632032
26917A0632032r5728J562p3307k75480p4280j8259J54838J55713o844L5804Q63
$$ 10632032 10536304 10537866 10464559 10189079 10114799 10096540 10251378 10407091 10400247 10436051 10436914
26906A0436914j55544j92772K0653M1498N080J7216R4710M3289j03812o9655p5924
$$ 10436914 10281370 10088598 10109251 10150749 10155829 10173045 10267755 10311044 10207232 10137577 10061653
26895A0061653o6969Q1788N5280j27917J1767l8218j19708j73951j8540J43225
$$ 10061653 9994684 10076472 10131752 10003835 10015602 9977384 9857676 9683725 9665185 9808410
26885I808410J05759j02130J10938J28480Q023L9865j1077j30747l07214j55201
$$ 9808410 9914169 9812039 9922977 10051457 10059480 10099345 10088268 9957521 9650307 9495106
26875I495106K3396l6601O6927J19567j81758j72450k3706J22558J52891j22148
$$ 9495106 9518502 9481901 9548828 9668395 9486637 9314187 9290481 9413039 9565930 9443782
26865I443782q4222O9155n7968j24902j2060k2812Q655O355q7531j91001N3967
$$ 9443782 9359560 9428715 9370747 9245845 9233785 9210973 9219628 9225983 9138452 8947451 9001418
26854I001418J80197J37465J5184j59393j67498j81544l1335J29884J29978q888
$$ 9001418 9181615 9319080 9334264 9174871 9007373 8825829 8794494 8924378 9054356 9045468
26844I045468P2490J13592j16647j0157j18974k05922j43138o0404Q3454O1552
$$ 9045468 9117958 9231550 9114903 9104746 8985772 8779850 8636712 8576308 8659762 8721314
26834H721314N6492Q4488m3274j37802r5213p2290J38846K8746k55713j24050
$$ 8721314 8777806 8862294 8819020 8681218 8586005 8513715 8652561 8681307 8425594 8301544
26824H301544J25486N1238j87687m13634n8892L38602J35796J1313j5701j58997
$$ 8301544 8427030 8478268 8290581 7876947 7818055 8156657 8292453 8303766 8288065 8129068
26814H129068j01495j25962K68623J8249K394J9956q0345l6917P2629n983j45163
$$ 8129068 8027573 7901611 8170234 8188483 8190877 8210833 8130488 8093571 8166200 8160217 8015054
26803H015054j82636j11999r4061O9063p1397K861o9506n3141r6514P2444m5809
$$ 8015054 7832418 7720419 7626358 7695421 7624024 7626885 7557379 7504238 7407724 7480168 7434359
26792G434359l4226J34954J48664m9428J17807M4053j84906o3953m0011k48715
$$ 7434359 7400133 7535087 7683751 7634323 7752130 7796183 7611277 7547324 7507313 7258598
26782G258598M1616l1940j89839k2885M6846J29802j5415k6834P9642R052l3274
$$ 7258598 7300214 7268274 7078435 7055550 7102396 7232198 7216783 7189949 7269591 7278643 7245369
26771G245369n9102k64484p7101o9357P7120M3924K3294O7628k5483J29262j40801
$$ 7245369 7186267 6921783 6844682 6775325 6852445 6896369 6919663 6987291 6961808 7091070 6950269
26760F950269n7841m7727l6106O4482o9076j46747r7065J792J07291J51795j5700
$$ 6950269 6892428 6844701 6808595 6873077 6804001 6657254 6560189 6561981 6669272 6821067 6805367
26749F805367k1520N8878n5665J7988j6638q7229k3905j69789J9383p869l6485
$$ 6805367 6783847 6842725 6787060 6805048 6788410 6701181 6677276 6507487 6526870 6519001 6482516
26738F482516l8761m8619m7737j15718j5187L5784K54438J20552l16006M5443
$$ 6482516 6443755 6395136 6347399 6231681 6216494 6252278 6506716 6627268 6311262 6356705
26728F356705m0559k87303N872k244R6606j14649n4146j47393M565O7198J4145
$$ 6356705 6316146 6028843 6034715 6032471 6129077 6014428 5960282 5812889 5817454 5884652 5898797
26717E898797n4637j39767k09330J11241K5953R9753N8819L7387j82762l6253
$$ 5898797 5844160 5704393 5495063 5606304 5632257 5732010 5790829 5828216 5645454 5609201
26707E609201N8924j4825j63396J32583K31894j27374j82536Q23n494M4742j78698
$$ 5609201 5668125 5653300 5489904 5622487 5854381 5727007 5544471 5545294 5539800 5584542 5405844
26696E405844j26913j08072P707Q4203J10612J48913j5215j36297j81682L80m1611
$$ 5405844 5278931 5170859 5178566 5262769 5373381 5522294 5507079 5370782 5189100 5189480 5147869
26685E147869l5839J57260J55030N3562j34614m522Q0285j43133k63151q7362
$$ 5147869 5112030 5269290 5424320 5477882 5343268 5338746 5419031 5275898 5012747 4925385
26675D925385J41322m0800j6144j64870j07056K7239J28509J83359j04128k82393
$$ 4925385 5066707 5025907 5009763 4844893 4737837 4765076 4893585 5076944 4972816 4690423
26665D690423p7460L1524J45447R0913k75124j12739K34105N1502j20517N381
$$ 4690423 4612963 4644487 4789934 4880847 4605723 4492984 4727089 4778591 4658074 4663455
26655D663455O3424n4281p3666n2956j01952J66395K34891j92332k44745P2017
$$ 4663455 4726879 4672598 4598932 4545976 4444024 4610419 4845310 4652978 4408233 4480250
26645D480250J29723K8681K6583j68491j29545J04752j30893p9215M5177J22199
$$ 4480250 4609973 4638654 4665237 4496746 4367201 4471953 4341060 4261845 4307022 4429221
26635D429221j12678k24259P878J1699l2104Q668Q1345K3233j95736p9781Q1907
$$ 4429221 4316543 4092284 4100162 4111861 4079757 4088425 4169770 4193003 3997267 3917486 3999393
26624C999393P3841J01046o1129k00290o2823N9922O068m5467j2459J03413K7830
$$ 3999393 4073234 4174280 4113151 3912861 3850038 3909960 3916028 3870561 3858102 3961515 3989345
26613C989345J7789l0458p4389p364J54658L4007n0978j45789k61396m1561n9355
$$ 3989345 4007134 3976676 3902287 3894923 4049581 4083588 4032610 3886821 3625425 3583864 3524509
26602C524509k5962j89960J58284R9631R9738M6486o1984k19530j31138L7379
$$ 3524509 3498547 3308587 3466871 3566502 3666240 3712726 3650742 3431212 3300074 3337453
26592C337453L9785J98315Q4896K607r0492K4691L4821j40785q7397Q7629J33727
$$ 3337453 3377238 3575553 3660449 3663056 3572564 3597255 3632076 3491291 3403894 3491523 3625250
26581C625250q2020j59584J7179J25452k8852j93708r8701Q0888N7822p4798J3172
$$ 3625250 3543230 3383646 3400825 3526277 3497425 3303717 3205016 3285904 3343726 3268928 3282100
26570C282100K9996j59024J62647J28929K2560m7507q5891k39060P4766J96689
$$ 3282100 3312096 3153072 3315719 3444648 3467208 3419701 3333810 3094750 3169516 3366205
26560C366205J8883j01470J2461L1865j15949L0283q6939L2045R0807K550R0022
$$ 3366205 3385088 3283618 3296079 3327944 3211995 3242278 3155339 3187384 3278191 3280741 3370763
26549C370763R3261j14853k3873j02927j60095o3878j6695j01089j26034j5348
$$ 3370763 3464024 3349171 3325298 3222371 3062276 2998398 2981703 2880614 2754580 2739232
26539B739232Q0186J2205l1469P7539Q4124n1760o4112J9777P619j13751J80614
$$ 2739232 2819418 2831623 2800154 2877693 2961817 2910057 2845945 2865722 2873341 2759590 2940204
26528B940204n7678m2986M6245m8365P2476K3347m8592j5476j37827k6661j71771
$$ 2940204 2882526 2839540 2885785 2837420 2909896 2933243 2884651 2869175 2731348 2704687 2532916
26517B532916J7910O882j44469o1333q7698M1860P2904R6076J07379r4369j18157
$$ 2532916 2550826 2557708 2413239 2351906 2264208 2306068 2378972 2475048 2582427 2488058 2369901
26506B369901k0088J72239J27811l0919J20605K1989J0719L3215j28442j69013
$$ 2369901 2349813 2522052 2649863 2618944 2739549 2761538 2772257 2805472 2677030 2508017
26496B508017j31830J12539J41582q98j63884j4168k2262j9104p2091j00961O2666
$$ 2508017 2376187 2488726 2630308 2629410 2465526 2451358 2429096 2409992 2337901 2236940 2299606
26485B299606J38432R553q9534P6936J51291j61267n7031l7857J9997k1921r5176
$$ 2299606 2438038 2447591 2358057 2434993 2586284 2425017 2367986 2330129 2350126 2328205 2233029
26474B233029J5625M9404P6993n9819j15879m8556J05243P6818j93007r369K25164
$$ 2233029 2248654 2298058 2375051 2315232 2199353 2150797 2256040 2332858 2139851 2130482 2355646
26463B355646j02124j15901p512J024m4937J20869O8332j7803n0167j26210p9922
$$ 2355646 2253522 2137621 2130109 2131133 2086196 2207065 2275397 2257594 2207427 2081217 2001295
26452B001295q2959J3431o3285j25357J4410o6581J23160K44946K6101o2457J97948
$$ 2001295 1918336 1931767 1868482 1743125 1757535 1690954 1814114 2059060 2085161 2022704 2220652
26441B220652j28325k98239k34556N3852K20281K5282M2516P1237j25297l0309
$$ 2220652 2092327 1794088 1559532 1613384 1833665 1858947 1901463 1972700 1847403 1817094
26431A817094J24594O2990q0535L074J3613J1416j50126J30769q1449M5200N6047
$$ 1817094 1941688 2004678 1924143 1927217 1940830 1952246 1802120 1932889 1851440 1896640 1952687
26420A952687n7996j15018j06113O9712q283M2319J36161L1374M4182j81902p1612
$$ 1952687 1894691 1779673 1673560 1743272 1734989 1777308 1913469 1944843 1989025 1807123 1735511
26409A735511j4942j27247O1518l1501J0631Q3135R7376L9240J21269p2283m2400
$$ 1735511 1720569 1593322 1654840 1623339 1633970 1717105 1814481 1853721 1974990 1902707 1860307
26398A860307L4027j27350j09948o2315k9185j16466o8172J60712Q9946r138M6753
$$ 1860307 1894334 1766984 1657036 1594721 1565536 1449070 1380898 1541610 1631556 1622418 1669171
26387A669171M8367j25617l4063O1439n5212j89706j4910P524Q5369m0389n9222
$$ 1669171 1717538 1591921 1557858 1619297 1564085 1374379 1359469 1366993 1452362 1411973 1352751
26376A352751o6565J2395J01394O6600N1625M5770j6944n5471J43310J09496K4322
$$ 1352751 1286186 1298581 1399975 1466575 1518200 1563970 1547026 1491555 1634865 1744361 1768683
26365A768683j84341j44739K1802l0076M7255q6707o8533J22826j718N2646M4296
$$ 1768683 1584342 1439603 1461405 1431329 1478584 1391877 1323344 1446170 1444452 1497098 1541394
26354A541394p7588L5874j177O9746L5067K4231J8487j34825j13873J27278j19093
$$ 1541394 1463806 1499680 1498503 1568249 1603316 1627547 1646034 1511209 1397336 1524614 1405521
26343A405521j75149l5397l2399J13436O9403K4097L3345k9098j21603N973Q1915
$$ 1405521 1230372 1194975 1162576 1276012 1345415 1369512 1402857 1373759 1252156 1258129 1340044
26332A340044l238j0435j66970j28301q7244J74563Q1405l667m1058J3766r78
$$ 1340044 1336806 1326371 1159401 1031100 943856 1118419 1199824 1196157 1155099 1168865 1167887
26321A167887j5726N6836L6524R6404o3855K5433J791J8182l323O7980n8806k31019
$$ 1167887 1152161 1208997 1245521 1341925 1278070 1303503 1305294 1323476 1320153 1388133 1329327 1098308
26309A098308j50792j8663L8319P0796m533L4262P8508p7026j27439M4139J06088
$$ 1098308 947516 928853 967172 1037968 1033435 1067697 1146205 1069179 941740 985879 1091967
26298A091967N6640J83749n3296n5614O2661O6364M1998r2732j59183K0342M9655
$$ 1091967 1148607 1332356 1279060 1223446 1286107 1352471 1394469 1301737 1142554 1162896 1212551
26287A212551J0674r276q9417p4568j01943N3175Q3222M9185r840l0980M207j66393
$$ 1212551 1223225 1213949 1124532 1049964 948021 1001196 1084418 1133603 1123763 1092783 1096990 930597
26275I30597j90488j09912r830J39067K09167O7233r826L2949L8945M3870j35332
$$ 930597 740109 630197 620367 759434 968601 1035834 1026008 1058957 1097902 1141772 1006440
26264A006440n4575q6830n7880M7017k7684Q7006J56983o8204j61295j33466L3736
$$ 1006440 951865 865035 807155 854172 826488 913494 1070477 1002273 840978 707512 741248
26253G41248J51220J6300l4173p4768M6489J81192K2005j81282J6884L3322j14
$$ 741248 892468 908768 874595 799827 846316 1027508 1049513 868231 885115 918437 918323
26242I18323J43329L4685j88775L5931j29004o5074O1840j48049n5115Q0405J19416
$$ 918323 1061652 1096337 907562 943493 814489 749415 811255 663206 608091 688496 807912
26231H07912P3415M5178o4220q197j9454O942R8133j18993l6510R6292J07670
$$ 807912 881327 926505 862285 854088 834634 841576 939709 820716 784206 880498 988168
26220I88168j2429j5246O4087p6078j29724m0144k6663R6191J39024Q0014j68729
$$ 988168 975739 960493 1024580 948502 818778 778634 751971 848162 987186 1067200 898471
26209H98471j76507L5040K1866l9512J2529o9267L8669J1968p0829j45685k01736
$$ 898471 721964 757004 778870 739358 751887 682620 721289 733257 662428 516743 315007
26198C15007O6394M6354N6509J93493O6459o3153m4651J77765n158P7946r1408
$$ 315007 381401 427755 484264 677757 744216 681063 636412 814177 809019 886965 795557
26187G95557j00238o2349P5276J05653O405R031R5989K6627m2429l736j10579
$$ 795557 695319 632970 708246 813899 820304 829335 925324 951951 909522 905786 795207
26176G95207j97760m1681P3095p2099j5221J06706K7226L1638J9903j496k21131
$$ 795207 597447 555766 628861 556762 541541 648247 675473 707111 727014 725518 504387
26165E04387r3368Q5597k2142O1105j25645P6570R9699M0627j25113m6223J77151
$$ 504387 411019 496616 474474 535579 409934 486504 586203 626830 501717 455494 632645
26154F32645J34436J05421M1811O2012j23027k3875o0905j04546o3621l5159P4326
$$ 632645 767081 872502 914313 976325 853298 829423 768518 663972 600351 565192 639518
26143F39518j96193j06998R3098K75580r5143j99413o3362J12206J12587J83845
$$ 639518 443325 336327 429425 705005 609862 410449 347087 459293 571880 755725
26133G55725j46618k14618R9259o410L3479M8307M7780p0857L6050K2638j45638
$$ 755725 609107 394489 493748 487338 520817 569124 616904 546047 582097 604735 459097
26122D59097j15552R930Q847J10659Q8279p4993J28642L4995j45612O5376p7567
$$ 459097 343545 353475 362322 472981 561260 486267 614909 649904 504292 569668 492101
26111D92101o2816Q3556M5944Q1138o5614P9129k5857j7893j18706r0906n5549
$$ 492101 429285 512841 558785 639923 574309 653438 627581 609688 490982 400076 344527
26100C44527m9421k8921j2858l8811J07687J75721P5985J0164J03407M9111q0577
$$ 344527 295106 266185 253327 214516 322203 497924 573909 584073 687480 736591 656014
26089F56014j29352j08703j24913K650k5o927N5923N9420K78865j7034j13775
$$ 656014 526662 417959 293046 295696 295671 288744 344667 404087 682952 665918 552143
26078E52143k9160m458o6991n3506O2680J7136r1102j44034J68965J03606J22016
$$ 552143 522983 518525 451534 398028 460708 477844 386742 242708 411673 515279 637295
26067F37295M3509k62913j79307j20879r4422R5599M2032m7393K07072j2926l4584
$$ 637295 680804 417891 238584 117705 23283 118882 160914 113521 320593 307667 273083
26056B73083l013L829J02844M8815M9694J56527L5962j54657j02262r3699M5577
$$ 273083 270070 273899 376743 425558 475252 631779 667741 513084 410822 317123 362700
26045C62700J05987n9633q7097o7832R5173M5428J04657J67465L4700j79186j36923
$$ 362700 468687 409054 321957 254125 349298 394726 499383 666848 701548 522362 385439
26034C85439j89694j54666J01157M8024j1811O0312l2893K7930Q7647n6185L9806
$$ 385439 195745 41079 142236 190260 178449 238761 205868 233798 321445 265260 305066
26023C05066K88518L8220j37623q0354j12388j15443J57310n8126Q8476p1902
$$ 305066 593584 631804 494181 413827 301439 185996 343306 285180 373656 301754
26013C01754q2968K6801J83769J94054l6604N8652Q4713N9315k45938m8467o3286
$$ 301754 218786 245587 429356 623410 586806 645458 730171 789486 543548 495081 431795
26002D31795j55506Q0979K6975r9188N4556p9984O2772j6404J00536J1599K3953
$$ 431795 276289 357268 384243 285055 339611 259627 322399 305995 406531 418130 442083
25991D42083M399n6067J31570l5856k13997k1900O7750n2033j4532m4953J00798
$$ 442083 446482 390415 521985 486129 272132 250232 317982 265949 251417 206464 307262
25980C07262L6828K1127p6720m6624J27357j9577R1251j64734k2800K1532j3706
$$ 307262 344090 365217 288497 241873 369230 349653 440904 276170 253370 274902 261196
25969B61196K8991J32620L3334J3685o1282j54408J35918n7961j63956m3069j3075
$$ 261196 290187 422807 456141 469826 408544 254136 390054 332093 168137 125068 111993
25958A11993L9705N1413J76533P2186Q3005K0026O8045k01042j15633J77296O4817
$$ 111993 151698 203111 379644 451830 534835 554861 622906 421864 306231 483527 548344
25947E48344j09470q9841o9952p7329J56555K10265Q0224r0732k97159r4418M6441
$$ 548344 438874 349033 279081 201752 358307 568572 648796 558064 260905 166487 212928
25936B12928O4301J45784K7923o9044j70333J7484N9880K20374K33553r3470q6054
$$ 212928 277229 423013 450936 381892 211559 229043 288923 509297 742850 649380 563326
25925E63326k51552p0191J47297J05691P612j41875j54761L0660k9417j1033l9
$$ 563326 311774 241583 388880 494571 502183 360308 205547 236207 206790 195757 195718
25914A95718N0748l2197j48634j1168J20370N4361l3844O8012m614N9461K2464
$$ 195718 246466 214269 65635 54467 174837 229198 195354 263366 258752 318213 340677
25903C40677m3492j4713R4556P4775m3017r9081K3155j634R3507q3491r0898R2023
$$ 340677 297185 282472 377028 451803 408786 309705 332860 331226 424733 341242 250344 342367
25891C42367O8025k09132j31181l2268l1267l672j57788J7499J70833J13291J06842
$$ 342367 410392 201260 70079 37811 6544 2872 -154916 -137417 33416 146707 253549
25880B53549N7935J56303R2453q9342j65512n9385p444o6668l0177R207L6956
$$ 253549 311484 467787 560240 470898 305386 246001 238557 171889 141712 150919 187875
25869A87875J47104J89393K6110j44339l29404o2885J03224J03588j54873N2233
$$ 187875 334979 524372 550482 406143 76739 13854 117078 220666 65793 118026
25859A18026J57816J16314r2804q0468M065K1242L3858r356O2322J37097j12135
$$ 118026 275842 392156 299352 218884 222949 244191 278049 268693 331015 468112 355977
25848C55977k17424N402J43540N4927L8608J76548J298j05136k87569j55680J44386
$$ 355977 138553 143955 287495 342422 381030 557578 558876 453740 166171 10491 154877
25837A54877J11025N1206j22714m4674J247j5369J66304M324r0507j17739P5962
$$ 154877 265902 317108 194394 149720 150967 135598 301902 306226 215719 97980 173942
25826A73942J05237J63244J94426j50904k59494m2661L4065o2702j75238N3836
$$ 173942 279179 442423 636849 485945 226451 183790 217855 155153 -20085 33751
25816C3751R1527q0969j00640o5366O8752K36621R9087l0630j01111j15528q2147
$$ 33751 125278 44309 -56331 -121697 -52945 183676 282763 252133 151022 35494 -46653
25805d6653K8218J70234N960p6911J831j5726j25905P741J76933P7938p7577J12905
$$ -46653 -18435 151799 157759 80848 82679 66953 -58952 -51211 125722 203660 126083 238988
25793B38988l8147L7567k03504n7270Q4554J8192J65891O8782k37521j82777k267
$$ 238988 200841 238408 34904 -22366 62188 80380 246271 315053 77532 -105245 -107512
25782a07512M3210O2786K03132L17291L5251j74796l1689R0002r0511p0914k1662
$$ -107512 -64302 -1516 201616 518907 554158 379362 347673 437675 347164 276250 254588
25771B54588L0313j12148R6129M9431j31382r5727K9996l1472P3639J54477o9126
$$ 254588 284901 172753 268882 318313 186931 91204 121200 89728 163367 317844 248718
25760B48718O1685O9372j54831k44314r6517J23022M6392o7022L988K26722r7193
$$ 248718 310403 379775 224944 -19370 -115887 7135 53527 -13495 -9507 217215 120022
25749A20022j66372J31101j01223O517J42790q5750j71619j54823J01039K25267
$$ 120022 -46350 84751 -16472 -9955 132835 47085 -124534 -279357 -178318 46949
25739D6949j3596N2805J98059J10957j4753l0543m000k23821l07322o6656J36304
$$ 46949 33353 86158 284217 395174 380421 349878 345878 122057 -185265 -251921 -115617
25728a15617r661J16595J08071n2396r9027J05706K44503Q2669l0493J19435l9482
$$ -115617 -125278 -8683 99388 46992 -52035 53671 298174 380843 350350 469785 430303
25717D30303P4843m2415j30242K484J7033m0884l8149m7193n7278Q4852j38556
$$ 430303 505146 462731 332489 334973 352006 311122 272973 225780 168502 253354 114798
25706A14798Q5386k3780r9445p3291j01825N6174J20901M1044J6723K4247p481
$$ 114798 200184 176404 76959 3668 -98157 -41983 78918 119962 136685 160932 153451
25695A53451l0659q0729N375l4224o7586Q0148J68708M5064m0207j07653o1635
$$ 153451 122792 42063 47438 13214 -54372 25776 194484 239548 199341 91688 30053
25684C0053M3769J2583k0251P3942J45100M9344j21544j38431O9505j45173R9333
$$ 30053 73822 86405 66154 140096 285196 334540 212996 74565 144070 -1103 98230
25673I8230j502k34364Q9232Q4654J68942O6618p7279M0416o5733q8101J67698
$$ 98230 96728 -137636 -48404 36250 205192 271810 194531 234947 169214 81113 248811
25662B48811p3552m2766o0296j55965P4510r1500l5670K28515J35657N4225j1975
$$ 248811 175259 132493 72197 -83768 -9258 -100758 -136428 92087 227744 281969 269994
25651B69994p5966O321J09052n854q0000O2394J39334K09652j53934K3575J8834
$$ 269994 194028 200349 309401 303547 223547 285941 425275 634927 480993 504568 523402
25640E23402j71441n8327K8157j80294j99532l2358P1944K04883J7017r3412k5182
$$ 523402 351961 293634 321791 141497 -58035 -90393 -18449 186434 203451 110039 84857
25629H4857R8776J19764q0727k49026r7722J12642K9401q911J17995J52979k3210
$$ 84857 183633 303397 222670 -26356 -124078 -11436 17965 9054 127049 280028 256818
25618B56818r6046o2050j88070j4116J5836k2023m933j90600M9172J59873O3720
$$ 256818 160772 98722 -89348 -103464 -87628 -109651 -114584 -305184 -256012 -96139 -32419
25607c2419o7927J06529Q1733m8817j11702n7457j48160R0125J86460n037j15056
$$ -32419 -100346 6183 87916 39099 -72603 -130060 -278220 -188095 -1635 -6672 -121728
25596a21728N9960J05925N6635k8069j65956j64658k8699N4880n174K44414P8344
$$ -121728 -61768 44157 100792 72723 -93233 -257891 -286590 -231710 -236884 7530 85874
25585H5874k8801L3961P7678p1686q2206J28177L0661R4950j0868j36421q9104
$$ 85874 57073 91034 168712 97026 14820 142997 173658 268608 257740 121319 32215
25574C2215J77629P0507k33069l98J2225J12608L0451r6721q6213m0591P9498
$$ 32215 209844 280351 47282 46884 59109 171717 202168 105447 19234 -21357 58141
25563E8141r2738J87386k7716k31545J7374j3342j24609J9700K46064P4931l8844
$$ 58141 -34597 152789 125073 -106472 -89098 -102440 -227049 -207349 38715 113646 74802
25552G4802m7743J5201k1449Q9239M0921p9263R58p9809o2950O2520k3181M8490
$$ 74802 27059 42260 20811 110050 150971 71708 72666 -7143 -70093 -7573 -30754 17736
25540A7736k5435J10679J3117M4520J0689j15521p4658J05694J97289r6665N6315
$$ 17736 -7699 102980 116097 160617 171306 55785 -18873 86821 284110 187445 243760
25529B43760m2452j09666J05590O9705M5018L5563L3618k0497O7805j90075j87455
$$ 243760 201308 91642 197232 266937 311955 347518 381136 360639 428444 238369 50914
25518E0914N683J04452N7759K039j39389n0196J37091J49027M4000j73346j54158
$$ 50914 56597 161049 218808 220847 81458 31262 168353 317380 361380 188034 33876
25507C3876J844J0651R0646P9266k25608j46108K36128J61965p7756M4655N8430
$$ 33876 35720 46371 137017 216283 -9325 -155433 80695 242660 164904 209559 267989
25496B67989o3015j55729j3010q8609j04086Q7610J34826J19916k918p1825j53025
$$ 267989 204974 49245 36235 -52374 -156460 -68850 65976 185892 182974 111149 -41876
25485d1876m5655l3933j71206O5294J71364m5690Q3965k9575J28471J1019N5847
$$ -41876 -87531 -121464 -292670 -227376 -56012 -101702 -17737 -47312 81159 92178 148025
25474A48025n5082M6576L328n1436N0533P4762o3012k7209Q4281Q6603M3979K6711
$$ 148025 92943 139519 142847 91411 141944 216706 153694 126485 210766 297369 341348 368059
25462C68059J49455J0232j03800j47678j9496j13739j01963j6011l4130J39141
$$ 368059 517514 527746 423946 276268 256772 143033 41070 25059 -9071 130070
25452A30070Q6718J13051O6519r4718o1779r262k42951o0850J42976J68944m4099
$$ 130070 216788 329839 396358 301640 239861 230599 -12352 -73202 69774 238718 194619
25441A94619P0136l0439j88855K2852P5437j39587j93544J05126J21804j53818
$$ 194619 264755 234316 45461 68313 143750 4163 -189381 -84255 37549 -116269
25431a16269j32120l8352R9798O7408j2765O3712O5585p601l8512R0679q87P3377
$$ -116269 -248389 -286741 -186943 -119535 -132300 -68588 -3003 -10604 -49116 41563 40676 114053
25419A14053K6562O64j04008j25409K4601M7410n5071O5352k3765n7453O3757
$$ 114053 140615 141279 37271 -88138 -63537 -16127 -71198 -5846 -29611 -87064 -23307
25408b3307J2298q5688o9342P8300J27933k3232l7602N3823L8177j08228q2713
$$ -23307 -11009 -96697 -166039 -87739 40194 16962 -20640 33183 71360 -36868 -119581
25397a19581J14743J24041o84m7582n3387o3937l0677P0811K92733j32225N6506
$$ -119581 -4838 119203 118519 70937 17550 -46387 -77064 -6253 286480 154255 210761
25386B10761L781j7431k72298j13831P8260O9945o7419N8793J64814Q917P539
$$ 210761 214542 197111 -75187 -189018 -110758 -40813 -108232 -49439 115375 124292 131831
25375A31831k8781m1524M1762J13241L6707j90761k4863j573k07251P823J84901
$$ 131831 103050 61526 103288 216529 253236 62475 37612 36039 -171212 -163389 21512
25364B1512P3988l9953O9379j6610R9382j12522j21007J46818O2100j82532l1536
$$ 21512 95500 55547 124926 108316 207698 95176 -25831 120987 183087 555 -30981
25353c0981L5390P3848J70809J37625J15000j92636n1640r6004L9235L921j84562
$$ -30981 4409 78257 249066 386691 501691 309055 257415 161411 200646 204567 20005
25342B0005r7682k5235K2157K03008r8009n2415p8948m734l196q3649r4832M8770
$$ 20005 -77677 -102912 -80755 122253 24244 -28171 -107119 -111853 -115049 -198698 -293530 -244760
25330b44760K529j06101K50177L5538R3464M1761j91480m8063J58911Q231j86135
$$ -244760 -242231 -348332 -98155 -62617 30847 72608 -118872 -166935 -8024 207 -185928
25319a85928J66620L6798j52093j55434P1021K33774Q1467n5436q0528n931J861
$$ -185928 -19308 17490 -134603 -290037 -219016 14758 96225 40789 -39739 -45670 -43809
25308d3809J33994j9293M7773L1350j5848j96011j0128J18830n2005O3500n4671
$$ -43809 90185 70892 118665 150015 134167 -61844 -71972 46858 -5147 58353 3682
25297C682O646M3861J24885J03301O2468j17289o1012j47366j72546J28198Q6653
$$ 3682 10328 54189 179074 282375 344843 227554 166542 19176 -153370 -25172 61481
25286F1481P0631J37653O6410q2321j29110l23867l8702q9514L4338J55715M8805
$$ 61481 132112 269765 336175 253854 124744 -199123 -237825 -327339 -293001 -137286 -88481
25275h8481q8797J55949N0094j71381q2147o2371l3266Q3336J87844k3187P2496
$$ -88481 -177278 -21329 28765 -142616 -224763 -287134 -320400 -237064 -49220 -72407 89
25264H9J86364q4556k36366l3794j814r1907m2226J7907J31711R5208J10568J36868
$$ 89 186453 101897 -134469 -168263 -170077 -261984 -304210 -286303 -154592 -59384 51184 188052
25252A88052P5718j20169l554q993m4065l3998K4998j52867J6448P787j3589o3002
$$ 188052 263770 143601 140047 131054 86989 52991 77989 -74878 -58430 -50643 -64232 -127234
25240a27234k2502J56432K02306o6954L9818j94512N8629O4229m7915k4896J15973
$$ -127234 -149736 6696 209002 142048 181866 -12646 45983 110212 62297 37401 153374
25229A53374M7441j7812j73505k0986R4778j22541R6210J6739k58610j2254J63349
$$ 153374 200815 183003 9498 -11488 83290 -39251 56959 73698 -184912 -197166 -33817
25218c3817O8482k15764j92113r4952J78202J41638J56073m5109r1641K04119
$$ -33817 34665 -181099 -373212 -468164 -289962 -148324 7749 -37360 -129001 75118
25208G5118p2389k11007j05140K7323Q665P6246J03712J22254O0224q9344r6674
$$ 75118 2729 -208278 -313418 -286095 -277430 -201184 -97472 24782 85006 -4338 -101012
25197a01012l519K01912m8690j32736l3700J2372J1987R5471O5687J5015j41848
$$ -101012 -104531 97381 48691 -84045 -117745 -105373 -93386 2085 67772 82787 -59061
25186e9061Q0248K06025J854k20593J05185K1001N261k04838M3148j2735N4953
$$ -59061 21187 227212 229066 8473 113658 134659 139920 -64918 -21770 -34505 20448
25175B0448N3214Q9321o5744p6391j5055j13264j4556K6495l131j80373m9487
$$ 20448 73662 162983 97239 20848 5793 -107471 -122027 -95532 -98663 -279036 -328523
25164c28523Q0812R1656J60537N7377P9849J6539L7878j8953j53583j81380P3080
$$ -328523 -247711 -156055 4482 61859 141708 158247 196125 177172 23589 -157791 -84711
25153h4711J23969j35037p5852j5401k616o3329J05508J59883Q7925k3131p1705
$$ -84711 39258 -95779 -171631 -187032 -189648 -252977 -147469 12414 100339 77208 5503
25142E503N3199J114k73291L4283J66437p1689j0237N8648M4271l5651j29166
$$ 5503 58702 59816 -213475 -179192 -12755 -84444 -94681 -36033 8238 -27413 -156579
25131a56579K7828o7462O4245J33143k3332J0347j36883j07787K30244k8138j26712
$$ -156579 -128751 -196213 -131968 1175 -22157 -11810 -148693 -256480 -26236 -54374 -181086
25120a81086N0794l8775M5838O3438O7311Q1321k0500k74625o8680N1878N194
$$ -181086 -130292 -169067 -123229 -59791 7520 88841 68341 -206284 -274964 -223086 -217892
25109b17892M2714M3764k3722j4798N2758p479j2598m8898J8971J07622J73555
$$ -217892 -175178 -131414 -155136 -169934 -117176 -124655 -137253 -186151 -167180 -59558 113997
25098A13997N4810p8040n6954j12424P7623J19866j20388j45705Q8346Q3082l7834
$$ 113997 168807 90767 33813 -78611 -988 118878 -1510 -147215 -58869 24213 -13621
25087a3621q4287K5557R1645p5005j75152P6092K4933N8964N6182J9331j10938
$$ -13621 -97908 -72351 19294 -55711 -230863 -154771 -129838 -70874 -14692 4639 -106299
25076a06299m6692J07837k8994j7904l1362o612J72130J08256j22668p1499j04709
$$ -106299 -152991 -45154 -74148 -92052 -123414 -130026 42104 150360 27692 -43807 -148516
25065a48516J0446K13476K15577O5020m1494j08503j21817o7656o7016o3679N4123
$$ -148516 -138070 75406 290983 356003 314509 206006 84189 16533 -50483 -114162 -60039
25054f0039M6920j2907q6161k0658R18n1310J42366J25199r5816J448J5134p2820
$$ -60039 -13119 -26026 -112187 -132845 -131927 -183237 -40871 84328 -11488 -10040 5094 -67726
25042f7726Q3800M8690J3391j14588o5449O0759R9158j5064j84457k1879J23137
$$ -67726 16074 64764 78155 -36433 -101882 -41123 58035 42971 -141486 -163365 -40228
25031d0228M4574j09656p5997l5662J20653J5693l661o3064L9399J01850K5534
$$ -40228 4346 -105310 -181307 -216969 -96316 -80623 -84284 -147348 -107949 -6099 19435
25020A9435p7977K8736L0648j04120m4998j9119J37741L7189L1705j05586q504
$$ 19435 -58542 -29806 842 -103278 -148276 -167395 -29654 7535 39240 -66346 -74850
25009g4850k7514r0229M5551J88775R5686j54249j33513l5439k2939N8112J17483
$$ -74850 -102364 -192593 -147042 41733 137419 -16830 -150343 -185782 -208721 -150609 -33126
24998c3126J70952o5069j0873Q4275n3919L1624j42557k06620K5810R1177n9327
$$ -33126 137826 72757 61884 146159 92240 123864 -18693 -225313 -199503 -108326 -167653
24987a67653K212K4381l3613j81943M1477R5785J43072j40567O1099l9631q3950
$$ -167653 -165441 -141060 -174673 -356616 -315139 -219354 -76282 -216849 -155750 -195381 -279331
24976b79331J91867K6233J19307J97781O3797j30130k03999m2605j12669Q6335
$$ -279331 -87464 -61231 58076 255857 319654 189524 -14475 -57080 -169749 -83414
24966h3414J55530o2204M8699P066n7271m1979l5200j51462m5116Q3697P4987
$$ -83414 72116 9912 58611 65677 8406 -33573 -68773 -220235 -265351 -181654 -106667
24955a06667j20907N232L2571k1628l8405j38516R8141P4872J39609J13584J76757
$$ -106667 -227574 -222342 -189771 -211399 -249804 -388320 -290179 -215307 -75698 37886 214643
24944B14643j64333k15311l6511L3404p5891j07554J43905K35658J36606O8637
$$ 214643 50310 -165001 -201512 -168108 -243999 -351553 -207648 28010 164616 233253
24934B33253Q6781n661l4062j31382j06549m3065J38572m3883j20237O4332P5499
$$ 233253 320034 314373 280311 148929 42380 -685 137887 94004 -26233 38099 113598
24923A13598j5780j44923o9247q8143J87774J13458r0545P2452m7326o830M7937
$$ 113598 97818 -47105 -116352 -204495 -16721 96737 6192 78644 31318 24488 72425
24912G2425M2198J28196j34602k5376N8716j3399j7898l6938r9372j32335j2987
$$ 72425 114623 242819 108217 82841 141557 128158 110260 73322 -26050 -158385 -171372
24901a71372q61K22437J74701q3297p423R1266p9681o5594n1065k4504N9088l3822
$$ -171372 -172233 50204 224905 141608 134185 225451 145770 80176 29111 4607 63695 29873
24889B9873n5567k8074Q5710K3296K0099K7373O8396R779Q856m5024l9358m0138
$$ 29873 -25694 -53768 31942 55238 75337 102710 171106 180885 189741 144717 105359 65221
24877F5221L6906M0167R65k0213m3059o430R3137m1720j07844o9501R6988q9886
$$ 65221 102127 142294 143259 123046 79987 73557 166694 124974 17130 -52371 44617 -45269
24865d5269k00071j23490K43232N8104n9727J06974q2330j42307q9840L6761J09927
$$ -45269 -245340 -368830 -125598 -67494 -127221 -20247 -102577 -244884 -334724 -297963 -188036
24854a88036L4680L723o8741R2762J3794J40200j3336k4164j57867j53431K91604
$$ -188036 -153356 -149633 -218374 -125612 -111818 28382 15046 -9118 -166985 -320416 -28812
24843b8812K31823j11304q9985j04492j04803K7604J37055L9581j81141m8695
$$ -28812 203011 91707 1722 -102770 -207573 -179969 -42914 -3333 -184474 -233169
24833b33169k1530l955M8273K6589n8298n527N9667J26766j22895K5323Q0366
$$ -233169 -254699 -258654 -210381 -183792 -242090 -247617 -187950 -61184 -184079 -158756 -78390
24822g8390K66344O8507j69636l3046O4274L5996P3759M8331p0443L9351k03164
$$ -78390 187954 256461 86825 53779 118053 154049 227808 276139 205696 245047 41883
24811D1883q3258L4905q8092N2335J02749J08641j8149K6140L9005j62010N5859
$$ 41883 -41375 -6470 -94562 -42227 60522 169163 151014 177154 216159 54149 110008
24800A10008Q6011r2030R399j21203R874M4063p9142P5525Q1443M749m0278j10653
$$ 110008 196019 103989 113388 -7815 2059 46122 -33020 42505 123948 128697 88419 -22234
24788b2234O662M8137j5997k6423J86753M4802r0609j06108L3418J09358J43461
$$ -22234 -15572 32565 16568 -9855 176898 221700 131091 24983 58401 167759 311220
24777C11220L2109j17752n3690j26670o0636j54913J17052R3482j4145q0045N8964
$$ 311220 343329 225577 171887 45217 -15419 -170332 -53280 40202 26057 -53988 4976
24766D976o7302j91628L5540L9454p1432K3037K79605Q7167o9298K9976L9248
$$ 4976 -62326 -253954 -218414 -178960 -250392 -227355 52250 139417 70119 100095 139343
24755A39343r8824m1210O6939o5148n7451M4001l9608j3387J986o5111K02864
$$ 139343 40519 -691 66248 1100 -56351 -12350 -51958 -65345 -63359 -128470 74394
24744G4394J0252K2639M195r5975r0312J19938m7142o1364j3357Q2878p035L3414
$$ 74394 84646 107285 111480 15505 -74807 45131 -2011 -63375 -76732 6146 -889 32525
24732C2525J09199n5260j18677l5604P7758L5448M7373p9979k4462R4097Q1694
$$ 32525 141724 86464 -32213 -67817 9941 45389 92762 12783 -11679 82418 164112
24721A64112J0380P6662n819r3747r9804K7808L9819j03451j64002l1024K08658
$$ 164112 174492 251154 245335 151588 51784 79592 119411 15960 -148042 -179066 29592
24710B9592J44660K3159p898j35090m3146j88867j60964j75910k3878O852K44507
$$ 29592 174252 197411 189513 54423 11277 -177590 -338554 -514464 -538342 -531490 -286983
24699b86983J19192J53716M9447L4309P6641q7490q8088K6262O3293r5265N469
$$ -286983 -167791 -14075 35372 69681 146322 58832 -29256 -2994 60299 -34966 -29497
24688b9497J32787J4477k62711m7483j865Q287j09104J65229J63839j43598N4482
$$ -29497 103290 117767 -144944 -192427 -194292 -186005 -295109 -129880 33959 -109639 -55157
24677e5157J62589m9611j59774K22408J92995J6623j08863k43300j62719l8930
$$ -55157 107432 57821 -101953 120455 313450 330073 221210 -22090 -184809 -223739
24667b23739m1136Q8047K58320n593q3678K30739J49145k69995j18447Q706O417
$$ -223739 -264875 -176828 81492 75899 -7779 222960 372105 102110 -16337 -7631 -1214
24656a214J19696j52071j36840K07340j3916N9077J19L8192j25888r7464P3601
$$ -1214 118482 -33589 -170429 36911 22995 82072 82191 120383 -5505 -102969 -29368
24645b9368K06797J1626k14231o5940O0756r5455j25128l5216k9602M263K17841
$$ -29368 177429 189055 -25176 -91116 -30360 -125815 -250943 -286159 -315761 -311498 -93657
24634i3657K8013J75621j57417j12773P125q4582P230K82199J39543j76853l7838
$$ -93657 -65644 109977 -47440 -160213 -153088 -237670 -230440 51759 191302 14449 -23389
24623b3389P9259p0361q8028L7742p6818N0480j39590k4060N1961J48505k8551
$$ -23389 55870 -14491 -102519 -64777 -141595 -91115 -230705 -254765 -202804 -54299 -82850
24612h2850J32260n5671L4842O8733l4662j31954p3433N9383K5784r2304j51397
$$ -82850 49410 -6261 28581 97314 62652 -69302 -142735 -83352 -57568 -149872 -301269
24601c01269P7682J3901j2020J03837j4127J22515k5015J04290J50102J00230
$$ -301269 -223587 -209686 -221706 -117869 -131996 -9481 -34496 69794 219896 320126
24591C20126Q218j31586j71888j94749L8814J42491j8727j4828L9689n7490m0635
$$ 320126 328344 196758 24870 -169879 -131065 11426 -7301 -22129 17560 -39930 -80565
24580h0565j34142n3807O5903K20723J04115k25479p9512K11475M3342J21953
$$ -80565 -214707 -268514 -202611 18112 122227 -103252 -182764 28711 72053 194006
24570A94006j21798k98451J53979Q0701q6821r9714k6685o7007P717R9898L9953
$$ 194006 72208 -226243 -72264 8437 -78384 -178098 -204783 -271790 -264073 -164175 -124222
24559a24222P387J43042K2991j77826k0315j9300L1714N153m2940J56615j04851
$$ -124222 -116835 26207 49198 -128628 -148943 -168243 -136529 -131376 -174316 -17701 -122552
24548a22552p7317p4869J48439K70913Q3279j40727j15623q1452o8963L5367J0263
$$ -122552 -199869 -274738 -126299 144614 227893 87166 -28457 -109909 -178872 -143505 -133242
24537a33242n3873Q1364n1578K04049l6n7276O410Q3162J8862K15144n3395j54960
$$ -133242 -187115 -105751 -157329 46720 46684 -10592 -4182 78980 97842 312986 259591 104631
24525A04631r8250J8514J6869l4799j32310K9370L9706j15917P2629P5228n6641
$$ 104631 6381 24895 41764 6965 -125345 -95975 -56269 -172186 -99557 -24329 -80970
24514h0970m4575j0299M521J56802l9372k8826j507N7423R8945J8490j40293j9304
$$ -80970 -125545 -135844 -131323 25479 -13893 -42719 -44226 13197 112142 130632 -9661 -28965
24502b8965p1809Q7904l1104p5822R8718R4556j18516k19393J56406L4072j03706
$$ -28965 -100774 -12870 -43974 -119796 -21078 73478 -45038 -264431 -108025 -73953 -177659
24491a77659J00076M0909q2920J4784R0890j06790q5019Q8928K27852o303j54604
$$ -177659 -77583 -36674 -119594 -104810 -13920 -120710 -205729 -116801 111051 104748 -49856
24480d9856q4602L0669J61443J17906p6353J1592j12319M3910K1875J45972j0141
$$ -49856 -134458 -103789 57654 175560 99207 110799 -1520 42390 64265 210237 200096
24469B00096j35997j45696p74M1051J25431k1225o9931J38957J18440o4256K6639
$$ 200096 64099 -81597 -82371 -41320 84111 62886 -7045 131912 250352 186096 212735
24458B12735L0210j56226J7596Q8748j5277p2401j30754q323j9015J1868j66440
$$ 212735 242945 86719 104315 193063 177786 105385 -25369 -33692 -52707 -40839 -207279
24447b07279j06584O136J6171K465m5048Q6604J2573K8055P0310m6433l458N5893
$$ -207279 -313863 -307727 -291556 -289091 -334139 -247535 -234962 -206907 -136597 -183030 -186488 -130595
24435a30595Q404o9503l2726O107J02160J48143K0522L9196q171j9995p3701p6439
$$ -130595 -122191 -191694 -224420 -218313 -116153 31990 52512 91708 83537 63542 -10159 -86598
24423h6598K3227l7557j05204R9612j04754P6862r5023j4211k9351j27433K3773
$$ -86598 -63371 -100928 -206132 -106520 -211274 -134412 -229435 -243646 -272997 -400430 -376657
24412c76657J52943Q9612O3801J7570N9435n9163n0612q6355J8099J52455J69803
$$ -376657 -223714 -134102 -70301 -52731 6704 -52459 -103071 -189426 -171327 -18872 150931
24401A50931P0610j28452j45924o701M7970O8649N127r9501J1201l9150L7811
$$ 150931 221541 93089 -52835 -59536 -11566 57083 62210 -37291 -26090 -65240 -27429
24390b7429p3903p2812R408k9922K0242J80328J94090J15393J22267K3327P623
$$ -27429 -101332 -174144 -164736 -194658 -174416 5912 200002 315395 437662 460989 468612
24379D68612j77687j94512P9751J6272l1882j06861P1255J25607j46088k55743
$$ 468612 290925 96413 176164 192436 160554 53693 124948 250555 104467 -151276
24369a51276n8397O5201j3573J04776K20344K7823r0604k9760O1223O9217j032
$$ -151276 -209673 -144472 -158045 -53269 167075 194898 104294 74534 135757 204974 203942
24358B03942n1914q2049j44591j7839n1811N972k9389Q4402q5922l7759R1643
$$ 203942 152028 69979 -74612 -92451 -144262 -138290 -167679 -83277 -169199 -206958 -115315
24347a15315Q3224r5171j03491L9196n5648j0392K20137J93708j0155J9311L3092
$$ -115315 -32091 -127262 -230753 -191557 -247205 -257597 -37460 156248 146093 165404 198496
24336A98496J1605j41075j04072m4578L9009m9513J7473R3267K32600Q4518k46310
$$ 198496 210101 69026 -35046 -79624 -40615 -90128 -72655 20612 253212 337730 91420
24325I1420j27199J05981L9889m2770J62507l0119j40071j0619l6851r233k04980
$$ 91420 -35779 70202 110091 67321 229828 199709 59638 49019 12168 2935 -202045
24314b02045P244J87584K2996k6624j32729J3748k7617o968J38876k5523k57449
$$ -202045 -194801 -7217 15779 -10845 -143574 -129826 -157443 -164411 -25535 -51058 -308507
24303c08507N5050L5036J3199K1911l6126j1383J04964J3950r4028K3941J49425
$$ -308507 -253457 -218421 -205222 -183311 -219437 -230820 -125856 -111906 -205934 -181993 -32568
24292c2568j2329M3904J51788n6634k52335p3649L0553J10224j8634J15087L0931
$$ -32568 -44897 -993 150795 94161 -158174 -231823 -201270 -91046 -109680 5407 36338
24281C6338j37866J64651j1737q8958J63644k18715k2920K17302P4767j13464
$$ 36338 -101528 63123 51386 -37572 126072 -92643 -115563 101739 176506 63042
24271F3042K5112J37280Q4216J12144m1544j76646M680L1819j42593k05722q4637
$$ 63042 88154 225434 309650 421794 380250 203604 208284 240103 97510 -108212 -192849
24260a92849j43707R1965m7478j42221P0512Q1910M1434J39765J69198O1176K9381
$$ -192849 -336556 -244591 -292069 -434290 -363778 -281868 -240434 -100669 68529 129705 159086
24249A59086l3446j50706j77925j24803j4690J79821J04916l8608q7295j15001
$$ 159086 125640 -25066 -202991 -327794 -342484 -162663 -57747 -96355 -183650 -298651
24239b98651Q4985J49002j3690K14273J83136j72495q5503Q5534r4923j92547
$$ -298651 -213666 -64664 -78354 135919 319055 146560 61057 146591 51668 -140879
24229a40879r2919n927J7380K0380J85639J09952j39782R2078P5501R5643o6557
$$ -140879 -233798 -239725 -222345 -201965 -16326 93626 -46156 45922 121423 217066 150509
24218A50509m4420j28020k6049j30186j22878K7483Q9983K10620K3474P4453n8415
$$ 150509 106089 -21931 -47980 -178166 -301044 -273561 -183578 27042 50516 124969 66554
24207F6554j86704K10937P4452m0404J21765k9938K274N8072k31080k6431K8366
$$ 66554 -120150 90787 165239 124835 246600 216662 218936 277008 45928 19497 47863
24196D7863Q8551J42273j33856n1122j81489k452O4173l2136J71409n8873j93126
$$ 47863 136414 278687 144831 93709 -87780 -90232 -26059 -58195 113214 54341 -138785
24185a38785p1745J63774N6132o524p0915k1382O5036N7206l1398j23057k8105
$$ -138785 -210530 -46756 9376 2852 -68063 -89445 -24409 32797 1399 -121658 -149763
24174a49763K4660m3945j04778k6458K6641O5175m3502N6188J65075M1175J18987
$$ -149763 -125103 -169048 -273826 -300284 -273643 -208468 -251970 -195782 -30707 10468 129455
24163A29455P6708p6113j9760m3853K18436m0706k4314M8909r835K2611p7435
$$ 129455 206163 130050 110290 66437 284873 244167 219853 268762 258927 281538 204103
24152B04103q6058O7205j3388k49553q1524L1145o2823P4033J13400J0449j31797
$$ 204103 118045 185250 171862 -77691 -159215 -128070 -190893 -116860 -3460 6989 -124808
24141a24808j7982Q1294R6770k8716p2983K67646n500j32392J00009L9794J41925
$$ -124808 -142790 -61496 35274 6558 -66425 201221 195721 63329 163338 203132 345057
24130C45057k7561j06018J05656q1408K3003m9102M3011p0211L0239j56094J5613
$$ 345057 317496 211478 317134 235726 258729 209627 252638 182427 212666 56572 72185
24119G2185O9779L3896M5958J23253k6811j3293j77961r2616L4680n8636Q1485
$$ 72185 141964 175860 221818 345071 318260 304967 127006 34390 69070 10434 91919
24108I1919k6953j65329J4650M7481J01813m9112j60626j06992J81700J02147
$$ 91919 64966 -100363 -85713 -38232 63581 14469 -146157 -253149 -71449 30698
24098C0698J51390K09261R1060k35676o905N8897N5669j84729o5827R3345m3841
$$ 30698 182088 391349 482409 246733 239828 298725 354394 169665 103838 197183 153342
24087A53342M0711k6591q4697j48271N2633q0623j31982j0903J64066O9829o6338
$$ 153342 194053 167462 82765 -65506 -12873 -93496 -225478 -236381 -72315 -2486 -68824
24076f8824q7960N5757l2614r1982K467O2490J97937n0157o149l7251m2902l755
$$ -68824 -156784 -101027 -133641 -225623 -223156 -160666 37271 -12886 -19035 -56286 -99188 -102943
24064a02943p189p1847l0837q0177Q0596J4740j31520l3913q3716P2249Q1259
$$ -102943 -110132 -181979 -212816 -292993 -212397 -197657 -329177 -363090 -446806 -374557 -293298
24053b93298J94680J14793l5246Q166j10642j65398J4378K32084N1578j28470
$$ -293298 -98618 16175 -19071 -10905 -121547 -286945 -272567 -40483 11095 -117375
24043a17375J78931J24113l5948k05953M1715M5655q3189j7216J10254n9682m0696
$$ -117375 61556 185669 149721 -56232 -14517 31138 -52051 -69267 40987 -18695 -59391
24032e9391K2659J63358k7933j45260j54924k3745P4507J1446J07954r9913j34055
$$ -59391 -36732 126626 98693 -46567 -201491 -225236 -150729 -139283 -31329 -131242 -265297
24021b65297l2069J50128K53987r182j89124j94124K0660J4957O7203q9277q5937
$$ -265297 -297366 -147238 106749 97567 -91557 -285681 -265021 -250064 -182861 -272138 -358075
24010c58075J75390K21623K9418j52812L3926R1294o7534j00829j918q3820R8147
$$ -358075 -182685 38938 68356 -84456 -50530 40764 -26770 -127599 -129517 -213337 -115190
23999a15190m8412K2662Q1488M5224Q0354j39409J43717K5157l24961m6091j9162
$$ -115190 -163602 -140940 -59452 -14228 66126 -73283 70434 95591 -229370 -275461 -294623
23988b94623J35270k6363o8587j846M1194J8828q2757j3643l4970J24196Q8599
$$ -294623 -159353 -185716 -254303 -256149 -214955 -196127 -278884 -292527 -327497 -203301 -114702
23977a14702P571r2465j9884N2348J0112J05423J58220q7890p4591j8941N4199
$$ -114702 -107131 -199596 -219480 -167132 -157020 -51597 106623 18733 -55858 -74799 -20600
23966b0600J00936K2202l7783M86p9865r1180O9004n5367j96315L6827J99617
$$ -20600 80336 102538 64755 65241 -14624 -105804 -36800 -92167 -288482 -251655 -52038
23955e2038J68316L3463N8443l9765j29663r9988P3067M2049Q5127r544L4901
$$ -52038 116278 149741 208184 168419 38756 -61232 11835 53884 139011 129467 164368
23944A64368j3545R0661k01166l6171L6668j15984R2258R9668L5290j25655o136
$$ 164368 150823 241484 40318 4147 40815 -75169 17089 116757 152047 26392 20256
23933B0256j62903j22560n2467j25261K3602j0126J05434J08203J88608M0252
$$ 20256 -142647 -265207 -317674 -442935 -419333 -429459 -324025 -215822 -27214 13038
23923A3038R0448j93859j74242N4018O1308P664P2235m1004Q6354J52559P1512
$$ 13038 103486 -90373 -264615 -210597 -149289 -141625 -69390 -110394 -24040 128519 200031
23912B00031j53222o5406M3686M222m1522M8317o134l7048O4537J39216j1552
$$ 200031 46809 -18597 25089 29311 -12211 36106 29972 -7076 57461 196677 185125
23901A85125q3906o621o693J19538K5588k77017k01125p829n8880J36785m1194
$$ 185125 101219 94598 87905 207443 233031 -43986 -245111 -252940 -311820 -175035 -216229
23890b16229j31456J67529J48391l7362j51137j90986Q8841J66947k2779L1061
$$ -216229 -347685 -180156 -31765 -69127 -220264 -411250 -322409 -155462 -178241 -147180
23880a47180Q5407r1919o0042N2123Q5064J31136r4119N7320l5247o6950q323
$$ -147180 -61773 -153692 -213734 -161611 -76547 54589 -39530 17790 -17457 -84407 -92730
23869i2730j27925R0556J19381j91228j9164Q4156P1710J12212M0123M6375o3369
$$ -92730 -220655 -130099 -10718 -201946 -221110 -136954 -65244 46968 87091 133466 70097
23858G0097l8834J51622j49412j15190J52056l6512q5087K9694P931Q3927l284
$$ 70097 31263 182885 33473 -81717 70339 33827 -51260 -21566 -13635 70292 67008
23847F7008j25082L0102M7809j18983r4363J03060n9353j98146J1128K38042O0851
$$ 67008 -58074 -27972 19837 -99146 -193509 -90449 -149802 -347948 -336820 -98778 -37927
23836c7927m5051J34028m9293Q4116K8748k13371j18168J98035n7151L1128l3502
$$ -37927 -82978 51050 1757 85873 114621 -98750 -216918 -18883 -76034 -44906 -78408
23825g8408M0470M3821o2612p6035J19814O0990L7610N6190q1273L0514j23882
$$ -78408 -37938 5883 -56729 -132764 -12950 48040 85650 141840 60567 91081 -32801
23814c2801j73236M746R2036M2568O9113r1990K700L419N0969j27072j13828j07221
$$ -32801 -206037 -201291 -109255 -66687 2426 -89564 -86864 -83445 -32476 -159548 -273376 -380597
23802c80597n4643K81389J74317m7245j2570J53509P4780J1658J83859p9941j25399
$$ -380597 -435240 -153851 20466 -26779 -39349 114160 188940 200598 384457 304516 179117
23791A79117q9620m0376q8086M7209n3110L0269j51928o8236Q8947J03566J11875
$$ 179117 89497 49121 -38965 8244 -44866 -14597 -166525 -234761 -145814 -42248 69627
23780F9627P4442L732j59054p8866j4024q3382L4550O8409p6489n4628p482N7084
$$ 69627 144069 147801 -11253 -90119 -104143 -187525 -152975 -84566 -161055 -215683 -223165 -166081
23768a66081k0381N5600M5494K3798l1329J01899M6727j70611m3176j2073r1898
$$ -166081 -186462 -130862 -85368 -61570 -92899 9000 55727 -114884 -158060 -170133 -262031
23757b62031k6273R2282J76231J24834Q9430p9329j41999j26526N1907Q806j15114
$$ -262031 -288304 -196022 -19791 105043 194473 115144 -26855 -153381 -101474 -92668 -207782
23746b07782J33565J01400J81210o6634j23645m3120j05225O3121M5345K0466
$$ -207782 -74217 27183 208393 141759 18114 -25006 -130231 -67110 -21765 -1299
23736a299J7201m685j04855j01107k4653M9444K42842J11664j16716j24742j4630
$$ -1299 15902 11217 -93638 -194745 -219398 -169954 72888 184552 67836 -56906 -71536
23725g1536j9598q464o1034J77377R2887j010O545p4534j62601m9411N2413K1620
$$ -71536 -91134 -99598 -160632 16745 109632 108622 115167 40633 -121968 -171379 -118966 -97346
23713i7346p1941J4263k5222R4575m2782J8407J35318n6018J3722q2999o698k7657
$$ -97346 -169287 -155024 -180246 -85671 -128453 -110046 25272 -30746 -17024 -100023 -106721 -134378
23701a34378R4134K1541q8116K7147J05875j278O9853M1986N661j59234j82141
$$ -134378 -40244 -18703 -106819 -79672 26203 24925 94778 136764 142425 -16809 -198950
23690a98950M5990L5491j1082J43995N4285j60269l8591j60216k5522J66949L9025
$$ -198950 -152960 -117469 -128551 15444 69729 -90540 -129131 -289347 -314869 -147920 -108895
23679a08895j61806M7020Q9904J62483O0859l9013m3817J70517M6369p6657j60320
$$ -108895 -270701 -223681 -133777 28706 89565 50552 6735 177252 223621 146964 -13356
23668a3356O490m8559n7322q2940m1127R0513K01614K8739j19864K0860j7007
$$ -13356 -6866 -55425 -112747 -195687 -236814 -146301 55313 84052 -35812 -14952 -31959
23657c1959O2011P934l0259j13821K4472J61867K168r2307q0808K18205m9284
$$ -31959 30052 37986 7727 -106094 -81622 80245 82413 -9894 -90702 127503 78219
23646G8219j79442M678m8150n8284R3588K20969Q5306p9173j3408n1019J4922
$$ 78219 -101223 -96545 -144695 -202979 -109391 111578 196884 117711 104303 53284 68206
23635F8206q5624r2557m9510L5927r7308j20545k3757j50064M2829M4455J33339
$$ 68206 -17418 -109975 -159485 -123558 -220866 -341411 -365168 -515232 -472403 -427948 -294609
23624b94609J64474m4212j00409j85527J26900Q0125K6011N7811r7387P705J04323
$$ -294609 -130135 -174347 -274756 -460283 -333383 -253258 -227247 -169436 -266823 -259118 -154795
23613a54795J61843r1343j12188j4003J8507n2945o1396M3744O3511O6359l500
$$ -154795 7048 -84295 -196483 -210486 -191979 -244924 -306320 -262576 -199065 -132706 -136206
23602a36206l64j9396Q3443q8210M1174J07454P9781r7315k18083p9471J24233
$$ -136206 -136570 -155966 -72523 -160733 -119559 -12105 67676 -29639 -247722 -327193 -202960
23591b02960L8745K7548J30723j08380k46873R5020J68001l3778K4035L7706m006
$$ -202960 -164215 -136667 -5944 -114324 -361197 -266177 -98176 -131954 -107919 -70213 -74219
23580g4219q1369J9981j23162n4340J20639K37417q367k29943m7144q2671n3660
$$ -74219 -155588 -135607 -258769 -313109 -192470 44947 36580 -193363 -240507 -323178 -376838
23569c76838j08276J13809O3672n7404p6526L01166P8222r5103j00176p8630J65736
$$ -376838 -485114 -371305 -307633 -365037 -441563 -140397 -62175 -157278 -257454 -336084 -170348
23558a70348K26386j1446k1660j07837q4964L5203K6237J6589j42108k8807j3383
$$ -170348 56038 44592 22932 -84905 -169869 -134666 -108429 -91840 -233948 -262755 -276138
23547b76138j73993l554O4891K8093J35269R393J78936r1772J34400J35640K145
$$ -276138 -450131 -453685 -388794 -360701 -225432 -216039 -37103 -128875 5525 141165 143310
23536A43310j64785K5190K7676K2321J24275k352j45480k57426j23278M0136J24387
$$ 143310 -21475 3715 31391 53712 177987 175635 30155 -227271 -350549 -310413 -186026
23525a86026J30087J08063J04175j14543l1147q656m8513Q6542p0213n5371J15296
$$ -186026 -55939 52124 156299 41756 10609 1953 -46560 39982 -30231 -85602 29694
23514B9694N9869r0140j42525r631Q0527o62O7759p8481o3338l9986M497o0478
$$ 29694 89563 -577 -143102 -152733 -72206 -72868 -5109 -83590 -146928 -186914 -182417 -242895
23502b42895M7177m7135j30199J92330K08418q9109o3982k7576K2240j2703P9743
$$ -242895 -195718 -242853 -373052 -180722 27696 -61413 -125395 -152971 -130731 -143434 -63691
23491f3691J18896j34608L6466j07773q4047M3600n7807R9618p9011P9457J48297
$$ -63691 55205 -79403 -42937 -150710 -234757 -191157 -248964 -149346 -228357 -148900 -603
23480f03P3661n934r4211K5045J85190k06799j67362N5840n8463l656j60611k07116
$$ -603 73058 67124 -27087 -2042 183148 -23651 -191013 -135173 -193636 -197292 -357903 -565019
23468e65019l386J48523J54558M1580j1397k7041l1028j5505O1000K40491K61962
$$ -565019 -568405 -419882 -265324 -223744 -235141 -262182 -293210 -308715 -247715 -7224 254738
23457B54738q3329q9711k8557k352N7922k01417k00245N7459K65089O4572k10020
$$ 254738 171409 81698 53141 50789 108711 -92706 -292951 -235492 29597 94169 -115851
23446a15851J6801J00995P3398j682k20303j05326J46130N4543L0426j9604n9824
$$ -115851 -99050 1945 75343 73661 -146642 -251968 -105838 -51295 -20869 -40473 -100297
23435a00297m1755p2230Q5338R3548J10887J39400j7840k11470j0403J74824k3733
$$ -100297 -142052 -214282 -128944 -35396 75491 214891 197051 -14419 -24822 150002 126269
23424A26269j70170q8147n193j0242l2885J41258n9114j05754p141J5007J59292
$$ 126269 -43901 -132048 -137241 -147483 -180368 -39110 -98224 -203978 -211119 -196112 -36820
23413c6820N0051j16808j87848q2605P1664L0829N6153K085J8182N3138N6934
$$ -36820 13231 -103577 -291425 -374030 -302366 -271537 -215384 -213299 -195117 -141979 -85045
23402h5045n4597k9385L616k638M5864k0284n3395m2355N9232P7472k8712j4147
$$ -85045 -139642 -169027 -165411 -168049 -122185 -142469 -195864 -238219 -178987 -101515 -130227 -144374
23390a44374P180R0591k4584R8086L69435m4061j2323r6630m674L161m1259Q696
$$ -144374 -137194 -46603 -71187 26899 396334 352273 339950 243320 238646 241807 200548 209244
23378B09244j12047k97033O9221J16198N62J5944J25298j63511L679r5741J08692
$$ 209244 97197 -199836 -130615 -14417 -13855 2089 127387 -36124 -32445 -128186 -19494
23367a9494J16634M9774L0437M1018j0298m0420j52489k04702K91Q0111Q027Q7220
$$ -19494 97140 146914 177351 218369 208071 167651 15162 -189540 -189249 -109138 -101111 -13891
23355a3891m7159q8112O6176K6764k05285l5149m9614J3873J52240J47898p3808
$$ -13891 -61050 -149162 -82986 -56222 -261507 -296656 -346270 -332397 -180157 -32259 -106067
23344a06067L3217R9007m6782M023j6596j09716J29791K4141R1721j659j70066
$$ -106067 -72850 26157 -20625 -16602 -33198 -142914 -13123 11018 102739 101080 -68986
23333f8986j57428N4543Q0138J16105K22137Q2656j42742k19769O4470j0347j69323
$$ -68986 -226414 -171871 -91733 24372 246509 329165 186423 -33346 31124 20777 -148546
23322a48546j45068o791j15330j5879M0526J35559L7663J27006K3273j51136j00443
$$ -148546 -293614 -300405 -415735 -431614 -391088 -255529 -217866 -90860 -67587 -218723 -319166
23311c19166l9957n6813R7800M5952K32274P3745r7118J24231L4663j20318M9196
$$ -319166 -359123 -415936 -318136 -272184 -39910 33835 -63283 60948 95611 -24707 24489
23300B4489P8418k1876p0432P3428P0077k77788k03360Q3836m302j0047j5031
$$ 24489 102907 81031 10599 84027 154104 -123684 -327044 -243208 -247510 -257557 -272588
23289b72588j27852n9570J88482J50966J80975J43783p1146p1016M768L0952N5403
$$ -272588 -400440 -460010 -271528 -120562 60413 204196 133050 62034 66802 97754 153157
23278A53157m5037j42210q4146N4196P2034j48800J12147j2560k7393j7135K04577
$$ 153157 108120 -34090 -118236 -64040 7994 -140806 -28659 -41219 -68612 -85747 118830
23267A18830J54544m0758j57715k65004j9081O6770j05759l1611J1770l6457L154
$$ 118830 273374 232616 74901 -190103 -209184 -142414 -248173 -279784 -268014 -304471 -301317
23256c01317J54993J43920p4168j50450o1787K22687J52540m5152q7699p6270
$$ -301317 -146324 -2404 -76572 -227022 -288809 -66122 86418 41266 -46433 -122703
23246a22703j36664o1520p0475j2916J49881O4478K3861n244o2474j9569J3188
$$ -122703 -259367 -320887 -391362 -404278 -254397 -189919 -166058 -171302 -233776 -253345 -240157
23235b40157J71813J39554m3777j34348L4686L2697O7607O0230o3688j15256P8512
$$ -240157 -68344 71210 27433 -106915 -72229 -39532 28075 88305 24617 -90639 -12127
23224a2127M2375q5606M9156J02448j09265P7747J59690J25931q0820j67434m5827
$$ -12127 30248 -55358 -6202 96246 -13019 64728 224418 350349 269529 102095 56268
23213E6268l6951K7680q0159k2757N5342k5055J7026p3957J29098r192m9504q0573
$$ 56268 19317 46997 -33162 -55919 -577 -25632 -8606 -82563 46535 37343 -12161 -92734
23201i2734L9125m55J54020j93914j90000J30813k88O5490J04048r7732k57207
$$ -92734 -53609 -54064 99956 -93958 -283958 -153145 -153433 -87943 16105 -81627 -338834
23190c38834L3271J74703Q1155j79023O4532N5794R2206R3784q0375P33j5872
$$ -338834 -305563 -130860 -49705 -228728 -164196 -108402 -16196 77588 -2787 -2054 -17926
23179a7926p9963l1787m074J6517j36892n4475K9109J25974q2970r3966J36035
$$ -17926 -97889 -129676 -133750 -117233 -254125 -308600 -279491 -153517 -236487 -330453 -194418
23168a94418J57202m9447J4382J69672J68275m6534n8440Q8270R4913j20296N2683
$$ -194418 -37216 -86663 -72281 97391 265666 219132 160692 248962 343875 223579 276262
23157B76262j24691Q5952L5339j24721j07546n9716j17189J56944J7238k5632
$$ 276262 151571 237523 272862 148141 40595 -19121 -136310 20634 37872 12240
23147A2240j74660M5681Q3338N6940J65977J22573m3241Q1160j18034j75895k30322
$$ 12240 -162420 -116739 -33401 23539 189516 312089 268848 350008 231974 56079 -174243
23136a74243r7595J13197K27434L7209L5509j23032k17534r3107j02064k2789
$$ -174243 -271838 -158641 68793 106002 141511 18479 -199055 -292162 -394226 -417015
23126d17015J73204J33546J03529M5819J369q9840O5847O09J21359j9239Q9051
$$ -417015 -243811 -110265 -6736 39083 40452 -49388 16459 17068 138427 119188 208239
23115B08239N2325k5513j05114r0883j28054l888P3901n9281p1910j26875j16858
$$ 208239 260564 235051 129937 39054 -89000 -92888 -18987 -78268 -150178 -277053 -393911
23104c93911J01772J68378M9772r1740l9841M0357j730L7241J4171J42810N4378
$$ -393911 -292139 -123761 -73989 -165729 -205570 -165213 -166943 -129702 -115531 27279 81657
23093H1657n8001j44806k0860J53732P7439J7986J4284q4588P4431j9173j39162
$$ 81657 23656 -121150 -142010 11722 89161 107147 121431 36843 111274 92101 -47061
23082d7061j4285K5898M4622R4970j58110j53341k3521J3797m3659J30095k3816
$$ -47061 -61346 -35448 9174 104144 -53966 -207307 -230828 -217031 -260690 -130595 -154411
23071a54411j7098N2777J10861j68014j3578K0593j00216N3303J35221L2314r326
$$ -154411 -171509 -118732 -7871 -175885 -189463 -168870 -269086 -215783 -80562 -48248 -57574
23060e7574J64893j9874K5864k1309k4612k9764k6937N5985j29043o6113K00193
$$ -57574 107319 87445 113309 92000 67388 37624 10687 66672 -62371 -128484 71709
23049G1709p9753k59257l158J33310O2006o4645j03143k5590K30707J55897j12482
$$ 71709 -8044 -267301 -270459 -137149 -75143 -139788 -242931 -268521 -37814 118083 5601
23038E601p3574J22695q8159j11349k244n9751K7994K4404J01984J10187j45227
$$ 5601 -67973 54722 -33437 -144786 -147030 -206781 -178787 -154383 -52399 57788 -87439
23027h7439R4091J01686P6391l3745l5543j5650k19141j85750Q2103K59933l7758
$$ -87439 6652 108338 184729 150984 115441 99791 -119350 -305100 -222997 36936 -822
23016h22q3370j6443O8136J16137j01833r6347o4343O6291Q5832Q8311J3246Q193
$$ -822 -84192 -100635 -32499 83638 -18195 -114542 -178885 -112594 -26762 61549 74795 82988
23004H2988O0062q3359j93380o6751O2120K751L2367r1262p0705R7875O0979o0085
$$ 82988 143050 59691 -133689 -200440 -138320 -135569 -103202 -194464 -265169 -167294 -106315 -166400
22992a66400o9552L700O6134R8290o4741r3219J15488J85408k24125m2296J35954
$$ -166400 -235952 -232252 -166118 -67828 -132569 -225788 -110300 75108 -149017 -191313 -55359
22981e5359N4745k7982J83256P6658j54201l6423K7126j55517p5023J45820j9162
$$ -55359 -614 -28596 154660 231318 77117 40694 67820 -87697 -162720 -16900 -36062
22970c6062o5607k3183m605j07192k02188L1252Q3518J67615R7126J13907j68272
$$ -36062 -101669 -124852 -129457 -236649 -438837 -407585 -324067 -156452 -59326 54581 -113691
22959a13691q1224P8114K6668K7846j78453k7242L2434L7350K0790j04442j72751
$$ -113691 -194915 -116801 -90133 -62287 -240740 -267982 -235548 -198198 -177408 -281850 -454601
22948d54601k536Q8536K13367j8716Q0796J91826P4982q1481j43654Q6983M1221
$$ -454601 -457137 -368601 -155234 -173950 -93154 98672 173654 92173 -51481 35502 76723
22937G6723o0703q1768P1137O73m4889N043q9281q0306l5544r677k2330J17965
$$ 76723 16020 -65748 5389 6062 -38827 -33784 -123065 -203371 -238915 -248592 -270922 -152957
22925a52957K01002J54116N6670k39362q846J54941j82644j30810m4377P3176
$$ -152957 48045 202161 258831 19469 10623 165564 -17080 -147890 -192267 -119091
22915a19091J8317K6886p4921J52322j01901J5569m1652j38299O4871Q4727R7812
$$ -119091 -100774 -73888 -148809 3513 -98388 -82819 -124471 -262770 -197899 -113172 -15360
22904a5360J21001j29908k43586n8673J98595J72865K634j25684q2801L7954J64289
$$ -15360 105641 -24267 -267853 -326526 -127931 44934 47568 -78116 -160917 -122963 41326
22893D1326J74272j26575j22702m8740j0247J35913n2305k7652R0102l1476L5556
$$ 41326 215598 89023 -33679 -82419 -92666 43247 -9058 -36710 53392 21916 57472
22882E7472K6922j77750J23593n9463p6959J91251j5799l1066M2622n7739j18016
$$ 57472 84394 -93356 30237 -29226 -106185 85066 69267 38201 80823 23084 -94932
22871i4932n3565J7868J26827J16334L3171k5967o8473n4239o8168M92J89280
$$ -94932 -148497 -130629 -3802 112532 145703 119736 51263 -2976 -71144 -70652 118628
22860A18628N9923j92353r5080j3936k5870l2980l8604K1601N4081l1137n9494
$$ 118628 178551 -13802 -108882 -122818 -148688 -181668 -220272 -198671 -144590 -175727 -235221
22849b35221Q3927J20732p1602o2413R369j07769M8341K8997n5320K18590J40033
$$ -235221 -151294 -30562 -102164 -164577 -155208 -262977 -214636 -185639 -240959 -22369 117664
22838A17664p3423N4163N9225J8362n7286p7663r5595k9389J37495J2392o8206
$$ 117664 44241 98404 157629 175991 118705 41042 -54553 -83942 53553 65945 -2261
22827b261J01855o7276k57048j3971N2060O3454J27134j40380j72360K9893O337
$$ -2261 99594 32318 -224730 -238701 -186641 -123187 3947 -136433 -308793 -278900 -272563
22816b72563J62342L58196j75900k1576J749k4936l8793r2280N9910J06427k2236
$$ -272563 -110221 247975 72075 50499 52248 27312 -11481 -103761 -43851 62576 40340
22805D0340n6655K6018p4919j06598n5032l7144M5221J7164m3671l2238J43468
$$ 40340 -16315 9703 -65216 -171814 -226846 -263990 -218769 -201605 -245276 -277514 -134046
22794a34046K327P0201k9197J5885r7543O3218j2030l3978O4964J60211J7132
$$ -134046 -131719 -61518 -90715 -74830 -172373 -109155 -121185 -155163 -90199 70012 87144
22783H7144j11260j70889J11164K61859o2247j94869j38482R5915m0927l3578
$$ 87144 -24116 -195005 -83841 178018 115771 -79098 -217580 -121665 -162592 -196170
22773a96170O5384J58682J3877K7569J06493k4066k08444j72477o813J77796J30264
$$ -196170 -130786 27896 41773 69342 175835 151769 -56675 -229152 -235965 -58169 72095
22762G2095r0873l4311L6897o959L8240p7757k03852j01321K09813J23137p0719
$$ 72095 -18778 -53089 -16192 -23151 15089 -62668 -266520 -367841 -158028 -34891 -105610
22751a05610j47345Q5287Q6947O9169m2891k879n6545j3097m7802j4659j12143
$$ -105610 -252955 -167668 -80721 -11552 -54443 -57322 -113867 -126964 -174766 -189425 -301568
22740c01568m6642J96327K83586J43502k41409l36183r1073O3581R7668J53980
$$ -301568 -348210 -151883 131703 275205 33796 -302387 -393460 -329879 -232211 -78231
22730g8231r4648m8569L449q672Q4888J15448j1905O8311J36238J27926j25453
$$ -78231 -172879 -221448 -217999 -226671 -141783 -26335 -38240 30071 166309 294235 168782
22719A68782r0627k8025j50693n5859J24435R5954M1456j11237n6120j9161j1219
$$ 168782 78155 50130 -100563 -156422 -31987 63967 105423 -5814 -61934 -81095 -92314
22708i2314j3061k3802L8645K26795O4000q9727p8430k43163o8627j079M019J81074
$$ -92314 -105375 -129177 -90532 136263 200263 110536 32106 -211057 -279684 -280763 -276744 -95670
22696i5670L0165j40029n6278m0622J14687N9041M9860p6932K1941R7588K30046
$$ -95670 -65505 -205534 -261812 -302434 -187747 -128706 -78846 -155778 -133837 -36249 193797
22685A93797Q1393j17358j49418q855L3838k2722m6529Q9970J008n1359j61024
$$ 193797 275190 157832 8414 -441 33397 10675 -35854 54116 55124 3765 -157259
22674a57259J1726l6066j91887R3342J13434N2214j7940J81343K4086j19302k7237
$$ -157259 -145533 -181599 -373486 -280144 -166710 -114496 -132436 48907 72993 -46309 -73546
22663g3546p6218K9063k522j6484J05742k5375J2669M9050R1177j31475p9624
$$ -73546 -149764 -120701 -123223 -139707 -33965 -59340 -46671 2379 93556 -37919 -117543
22652a17543m1663j3863O6898k6858R4993K0019l6465j5848p550K9614l6780J77842
$$ -117543 -159206 -173069 -106171 -133029 -38036 -18017 -54482 -70330 -77880 -48266 -85046 92796
22640I2796O6664M0272k578j81903j36449j582O3289K87662K01318r9730j58638
$$ 92796 159460 199732 197154 15251 -121198 -122780 -59491 228171 429489 329759 171121
22629A71121j00092r9772n429j80099n7120N8342J83937R754n9217P8368J47888
$$ 171121 71029 -28743 -34172 -214271 -271391 -213049 -29112 -19358 -78575 -207 147681
22618A47681P9755P6655k2036j25392J046l0748L7060J8523J50826M680K5542
$$ 147681 227436 304091 282055 156663 157709 126961 164021 182544 333370 338050 363592
22607C63592j01688m6173J69498J83640K23732L47991J21810J0921K11025L66803
$$ 363592 261904 215731 385229 568869 792601 1140592 1262402 1273323 1484348 1851151
22597A851151J13878R2692R1753P8110j55085j01800r5082k62078k69528k53529
$$ 1851151 1965029 2057721 2149474 2227584 2072499 1970699 1875617 1613539 1344011 1090482
22587A090482k20681l38253p9247J56869o7628J01610P9662j23174N0112j5877
$$ 1090482 869801 531548 452301 609170 541542 643152 722814 599640 649752 633875
22577F33875q9161k60942j23406n1828J59978J82162J36046j51924j34153j23063
$$ 633875 544714 283772 160366 108538 268516 450678 586724 434800 300647 177584
22567A77584M5754M8219J03950O9433p7606j62972n4095K1518L4957p36r0580
$$ 177584 223338 271557 375507 444940 367334 204362 150267 171785 206742 206006 115426
22556A15426j74495N4090Q2145J20122N2571j76349o6839k1845j52646j4624J38169
$$ 115426 -59069 -4979 77166 197288 249859 73510 6671 -15174 -167820 -182444 -44275
22545d4275J1306p9585J38204J94943P1765q30j59271j04144K1164M3104o5471
$$ -44275 -32969 -112554 25650 220593 292358 291528 132257 28113 49277 92381 26910
22534B6910k05597J45010J61981J4264j87620J8441J93408J4730J14475j35914
$$ 26910 -178687 -33677 128304 142568 -45052 -26611 166797 181527 296002 160088
22524A60088k8937K7192K7466k11539p9239J27649p2450J61547J59498O0387o1677
$$ 160088 131151 158343 185809 -25730 -104969 22680 -49770 111777 271275 331662 269985
22513B69985P1494J01449n5549L0752L7185j66880j54461j3788P6458l765q9567
$$ 269985 341479 442928 387379 418131 455316 288436 133975 120187 196645 192880 103313
22502A03313K6833J30514m7057O0032j43837l5255j30233J27576J71603l4527
$$ 103313 130146 260660 213603 273635 129798 94543 -35690 91886 263489 228962
22492B28962q7536k0232j13425j20941l7442r2319O1692j20676q2651J26496J03456
$$ 228962 141426 121194 7769 -113172 -150614 -242933 -181241 -301917 -384568 -258072 -154616
22481a54616M5796M6519m4608q0682N8857j6877L263K65235J35635j45012k9075
$$ -154616 -108820 -62301 -106909 -187591 -128734 -145611 -142348 122887 258522 113510 84435
22470H4435P4743O2765r9333k3193L0878j251l934k9893j07180l7325M0023O0455
$$ 84435 159178 221943 122610 99417 130295 129044 125110 95217 -11963 -49288 -9265 51190
22458E1190n370M2666J7981Q7058k26532R2235J41965J7950o6074N5611r6177
$$ 51190 45820 88486 106467 193525 -33007 59228 201193 219143 153069 208680 112503
22447A12503j54266J1792l5592n5548N5106r1981j98294J89194J03219N8241k6598
$$ 112503 -41763 -29971 -65563 -121111 -66005 -157986 -356280 -167086 -63867 -5626 -32224
22436c2224j20894K7210J35628L190j16293o6285j36673o1705m0738J97338K1514
$$ -32224 -153118 -125908 9720 12910 -103383 -169668 -306341 -368046 -408784 -211446 -189932
22425a89932l9050J82008J23149j25993L1856J72900N115K1826j03878J7264n2334
$$ -189932 -228982 -46974 76175 -49818 -17962 154938 160053 181879 78001 95265 42931
22414D2931p3077n9249q1597M1405J60952J37594m4241m8819P2566j31782j39169
$$ 42931 -30146 -89395 -170992 -129587 31365 168959 124718 75899 148465 16683 -122486
22403a22486j31401R1057p7325P4818L1871J7015J05241l1863L4659p4547K6813
$$ -122486 -253887 -162830 -240155 -165337 -133466 -116451 -11210 -43073 -8414 -82961 -56148
22392e6148j62597Q6309J86552j12974J24177Q3192N6194o5184N6155j53286q3975
$$ -56148 -218745 -132436 54116 -58858 65319 148511 204705 139521 195676 42390 -41585
22381d1585J23692L1702k3337k17332l9904J28447P2786r5546J17739Q9573j41776
$$ -41585 82107 113809 90472 -126860 -166764 -38317 34469 -61077 56662 146235 4459
22370D459Q9515N3160M7337j17767j32489J41332K4538j34067Q4447J52975J31139
$$ 4459 93974 147134 194471 76704 -55785 85547 110085 -23982 60465 213440 344579
22359C44579n5692j11764m6597n2886R1127K16193J5428j79184o5183k2540j1769
$$ 344579 288887 177123 130526 77640 168767 384960 400388 221204 156021 133481 121712
22348A21712j62417L2012J79303J06328P1366J88540p3075j05338J5130j40308
$$ 121712 -40705 -8693 170610 276938 348304 536844 463769 358431 373561 233253
22338B33253r8876Q8308O2483p0658m8548p3105n0957k1438j20866J71997M5572
$$ 233253 134377 222685 285168 214510 165962 92857 41900 20462 -100404 71593 117165
22327A17165j6272N9196l1921k13520j57981J59150p165N7212J91965J77215P0882
$$ 117165 100893 160089 128168 -85352 -243333 -84183 -91348 -34136 157829 335044 405926
22316D05926k26436l3718M3551j8398o1570K2761N1472N9766K3952O0032N8275
$$ 405926 179490 145772 189323 170925 109355 132116 183588 243354 267306 327338 385613
22305C85613o2236J811K23945q8877L1423J04668j43862j83431j45552N161N1928
$$ 385613 323377 325188 549133 460256 491679 596347 452485 269054 123502 128663 180591
22294A80591k8907j92393L2017J83852n670n4320N7260O9946o3264Q8166j9448
$$ 180591 151684 -40709 -8692 175160 169490 115170 172430 242376 179112 267278 247830
22283B47830m2505N9335r038p8452n1647P0366N0180q5502L3705J53049N7100
$$ 247830 205325 264660 255622 177170 125523 195889 246069 160567 194272 347321 404421
22272D04421K2649n8550j94636M2900O2019q0749m0843L307k4598j46698J696
$$ 404421 427070 368520 173884 216784 278803 198054 157211 160518 135920 -10778 -9082
22261i082J92669O6681j26485J3893o2194l8723J00836P7507m8722O6372J29620
$$ -9082 183587 250268 123783 137676 75482 36759 137595 215102 166380 232752 362372
22250C62372r488Q8993r9266j22388L7777J23651K10667P2863j07185p9492l14659
$$ 362372 352884 441877 342611 220223 258000 381651 592318 665181 557996 478504 163845
22239A63845j07807L9455K1394q479M9104l899n0807P6885O3447R4795r7674r2875
$$ 163845 56038 95493 116887 108408 157512 153613 102806 179691 243138 337933 240259 147384
22227A47384J51460M9052m8436j45520m2549J68541K28769L2742j27758k2519
$$ 147384 298844 347896 299460 153940 111391 279932 508701 541443 413685 391166
22217C91166J2540p1074K00690P5844k39558j56977N4387J16918M6979J11531
$$ 391166 403706 332632 533322 609166 369608 212631 267018 383936 430915 542446
22207E42446J4973L6629j66360j38546J20760J81136Q4407J29386K30807K9104
$$ 542446 557419 594048 427688 289142 409902 591038 675445 804831 1035638 1064742
22197A064742r1432L3272M644J31154J21385K93444K2699P0632J96133J04558
$$ 1064742 973310 1006582 1011226 1142380 1263765 1557209 1579908 1650540 1846673 1951231
22187A951231L1305q3932J19215J49315J24499J14201q4446r077J91329M8179
$$ 1951231 1982536 1898604 2017819 2167134 2291633 2405834 2321388 2312311 2503640 2551819
22177B551819j22399k25347N3779J75651J4778j42150j53054j08513K5797J34015
$$ 2551819 2429420 2204073 2257852 2433503 2448281 2306131 2153077 2044564 2070361 2204376
22167B204376K4564k7175K1848J11714K656j43089q0046k30956j54196K15980
$$ 2204376 2228940 2201765 2223613 2335327 2337983 2194894 2114848 1883892 1729696 1945676
22157A945676M0481O1673P7817l5010m8999J31039J28671o1226m3629j05793K38404
$$ 1945676 1986157 2047830 2125647 2090637 2041638 2172677 2301348 2240122 2196493 2090700 2329104
22146B329104Q1590P8946R2067M1868n7696J04317K7811J64428L28023K18064
$$ 2329104 2410694 2489640 2581707 2623575 2565879 2670196 2698007 2862435 3190458 3408522
22136C408522J64165L36382K68299K38432K68114J38182O0256j89172k00097j33962
$$ 3408522 3572687 3909069 4177368 4415800 4683914 4822096 4882352 4693180 4493083 4359121
22126D359121j21135m34450k30672j25947j57332n0150J1400L7431N1053Q6390
$$ 4359121 4237986 3803536 3572864 3446917 3289585 3239435 3250835 3288266 3339319 3425709
22116C425709k18584j38610K9905K01571J29962J85306q98p0916J10861m7682
$$ 3425709 3207125 3068515 3098420 3299991 3429953 3615259 3614361 3543445 3654306 3606624
22106C606624P7538K35485J99100J63429L02292K71431K18678K35098K92703M62864
$$ 3606624 3684162 3919647 4118747 4282176 4584468 4855899 5074577 5309675 5602378 6065242
22096F065242O09875O39754N62461M53824L46591J52767J62711J79414L50636
$$ 6065242 6675117 7314871 7877332 8331156 8677747 8830514 8993225 9172639 9523275
22087I523275K36812k22870q6898J82321K09316J43402N01112O12006N93605P27433
$$ 9523275 9760087 9537217 9450319 9632640 9841956 9985358 10486470 11098476 11692081 12419514
22077A2419514P77901Q26159J048682J127393J373536J490626J536494J845555
$$ 12419514 13197415 14023574 15072256 16199649 17573185 19063811 20600305 22445860
22069B2445860K226161K501312K932195L254423L718544M658688N628382O513632
$$ 22445860 24672021 27173333 30105528 33359951 37078495 41737183 47365565 53879197
22061E3879197P858238R763707J2081428J5056692J8538469K2858731K7328988
$$ 53879197 61737435 71501142 83582570 98639262 117177731 140036462 167365450
22054A67365450L1545356L4753468L5461913L3596555K8599089J9664697P607010
$$ 167365450 198910806 233664274 269126187 302722742 331321831 350986528 358593538
22047C58593538m517508j4413944k2707584k9007021l2220213l1965758k9102852
$$ 358593538 354076030 339662086 316954502 287947481 255727268 223761510 194658658
22040A94658658k4899264k0689256j7032290j3818409j1287463r358741p950125
$$ 194658658 169759394 149070138 132037848 118219439 106931976 97573235 89623110
22033H9623110o773522o006219n399577m637969l886686l540028l220019k718679
$$ 89623110 82849588 76843369 71443792 66805823 62919137 59379109 56159090 53440411
22025E3440411k773693k469471k098181j968683j722302j695926j514048j409998
$$ 53440411 50666718 48197247 46099066 44130383 42408081 40712155 39198107 37788109
22017C7788109j369869j411712j265614j099336j053861r24469j095124j175697
$$ 37788109 36418240 35006528 33740914 32641578 31587717 30663248 29568124 28392427
22009B8392427r83571o76187o37754q00764p49294n91909n77167n39590o18562
$$ 28392427 27408856 26732669 26094915 25294151 24544857 23952948 23375781 22836191 22217629
22000B2217629n94626m33308o55662n76864m56241n69830m62496m80814o26532
$$ 22217629 21623003 21189695 20534033 19957169 19500928 18931098 18468602 17987788 17361256
21991A7361256m44555l98941l80384l14443m48546l79791j81467j50639k99184
$$ 17361256 16916701 16517760 16137376 15822933 15374387 14994596 14813129 14662490 14363306
21982A4363306j92192l04016k98361l69513k13336j27145m37116m17583k51263
$$ 14363306 14171114 13867098 13568737 13199224 12985888 12858743 12421627 12004044 11752781
21973A1752781k768p6146l32791j22992j34958p4413n9004o8586m06j44621j08487
$$ 11752781 11750013 11673867 11341076 11218084 11083126 11008713 10949709 10881123 10880717 10736096 10627609
21962A0627609k10415k09409k38689l11938k67858l07100m57715k62065l43911
$$ 10627609 10417194 10207785 9969096 9657158 9389300 9082200 8624485 8362420 8018509
21953H018509j39228J0543k0299k5064r5313K53328K99152R859l6390l20826l24344
$$ 8018509 7879281 7889824 7869525 7844461 7749148 8002476 8301628 8311487 8275097 7954271 7629927
21942G629927m95588l52142k99753q9648j44657k43353k38675j15361P2937J6724
$$ 7629927 7134339 6782197 6482444 6392796 6248139 6004786 5766111 5650750 5723687 5740411
21932E740411m3741o5564j76585K5122L7045j7001l9039J27934J11615k8215K22883
$$ 5740411 5696670 5631106 5454521 5479643 5516688 5499687 5460648 5588582 5700197 5671982 5894865
21921E894865J16602p2058j51541r755q1902j03057j37132o4318K2601j66248
$$ 5894865 6011467 5939409 5787868 5778113 5696211 5593154 5456022 5391704 5414305 5248057
21911E248057k3535r6484j87710j88298r425q3701K5376m6719q9948k6339j75585
$$ 5248057 5224522 5128038 4940328 4752030 4742605 4658904 4684280 4637561 4547613 4521274 4345689
21900D345689m5597m0728l1052m3762J5175k6902l16655j88656J5342Q3332l9125
$$ 4345689 4300092 4259364 4228312 4184550 4199725 4172823 3856168 3667512 3682854 3766186 3727061
21889C727061l21520k56317j12775o554m0954Q6239j00989j49028j0731J63454
$$ 3727061 3405541 3149224 3036449 3029895 2988941 3075180 2974191 2825163 2814432 2977886
21879B977886j25277O809J02257p0692k19034j34232M6238O1629o0476j03344
$$ 2977886 2852609 2859418 2961675 2890983 2671949 2537717 2583955 2645584 2585108 2481764
21869B481764j32693M5671j33295q4915M0838J5382j69766k1224J69490J16797
$$ 2481764 2349071 2394742 2261447 2176532 2217370 2232752 2062986 2041762 2211252 2328049
21859B328049q6955k29345q5515J14044m2330m4726k5126K8752j06182n3479n7665
$$ 2328049 2241094 2011749 1926234 2040278 1997948 1953222 1928096 1956848 1850666 1797187 1739522
21848A739522j32868n8588k474K7842n4939m5573O523J05373j9199k30881k29721
$$ 1739522 1606654 1548066 1545592 1573434 1518495 1472922 1479445 1584818 1565619 1334738 1105017
21837A105017N7598J33907R0188Q085j13473J6168O2528K2904k2311j44706P6176
$$ 1105017 1162615 1296522 1386710 1394795 1281322 1297490 1360018 1382922 1360611 1215905 1292081
21826A292081l5387j25703j39973O1454J4234o5291p3902P5260j5866N7246J1930
$$ 1292081 1256694 1130991 991018 1052472 1066706 1001415 927513 1002773 986907 1044153 1056083
21815A056083O3836n1766j9922l5711o2192k3655j02100k0927j12673J19322n9445
$$ 1056083 1119919 1068153 1048231 1012520 950328 926673 824573 803646 690973 810295 750850
21804G50850n8068q334k3115m1386R125J02649O3281m5960p3036r3832J29706
$$ 750850 692782 684448 661333 619947 629072 731721 795002 749042 676006 582174 711880
21793G11880K39517k10899k13611j43551K3630K646m1268M024J65523O9201R4329
$$ 711880 951397 740498 526887 383336 406966 409612 368344 372368 537891 607092 701421
21782G01421n5100R4936K7498K561O8962j84910k11488J03823J64235P3806Q8907
$$ 701421 646321 741257 768755 771316 840278 655368 443880 547703 711938 785744 874651
21771H74651K6945k0737r5457J82766l4154p9297N4349o5467l6141J8697m6687
$$ 874651 901596 880859 785402 968168 934014 854717 909066 843599 807458 826155 779468
21760G79468m126n1835o0159n0086j20541j45775O9923O9546N4053n6926K1263
$$ 779468 775342 723507 663348 613262 492721 346946 416869 486415 540468 483542 504805
21749E04805k34762N0790q274l6823n8809l5108L8967j04688J9953k5295j5786
$$ 504805 270043 320833 312559 275736 216927 181819 220786 116098 136051 110756 94970
21738I4970K2440j09916J70453J07261p1427p7728k1769q1719J0728J21058J25382
$$ 94970 117410 7494 177947 285208 213781 136053 114284 32565 43293 164351 289733
21727B89733j94389K6693K21545r6729j7694J42506k4939R9767Q7844m486j01402
$$ 289733 95344 122037 343582 246853 229159 371665 346726 446493 534337 529851 428449
21716D28449k73933m0644L7697j03081k5639l650K23666K33827k6408o6898q3391
$$ 428449 154516 113872 151569 48488 22849 19199 242865 476692 450284 383386 299995
21705B99995k06603j20587P3576L0857R9206J00702q5778l7779O4679j76711K7822
$$ 299995 93392 -27195 46381 77238 176444 277146 191368 153589 218268 41557 69379
21694F9379M6477r0482J57174J94323o0570r9091j30754m6099m8675j3647J15442
$$ 69379 115856 25374 182548 376871 316301 217210 86456 40357 -8318 -21965 93477
21683I3477J5355L4360K3596o0066n5570k08270k1984Q1205r5030J32748Q3781
$$ 93477 108832 143192 166788 106722 51152 -157118 -179102 -97897 -192927 -60179 23602
21672B3602O9740K5829q1631j9358Q2629K1672r5153j53913J28164J07916N4923
$$ 23602 93342 119171 37540 18182 100811 122483 27330 -126583 1581 109497 164420
21661A64420m648q9364r6725l4510K4600J61815M2690k33926j54100Q6495M6009
$$ 164420 159772 70408 -26317 -60827 -36227 125588 168278 -65648 -219748 -133253 -87244
21650h7244N7239o4155J10950R5905J43929q7077k11218k03420J84962J49499
$$ -87244 -30005 -94160 16790 112695 256624 169547 -41671 -245091 -60129 89370
21640H9370q5090j39879j15935K73550M6810M2642m1820j06782M1909R1244J21591
$$ 89370 4280 -135599 -251534 22016 68826 111468 69648 -37134 4775 96019 217610
21629B17610j78925p9866O5438N5092Q3772R6524j27271o4476j72209P1850K82685
$$ 217610 38685 -41181 24257 79349 163121 259645 132374 67898 -104311 -32461 250224
21618B50224J1757M301J4254j06238Q0815R9548o7547J1401J9787j4709j4017
$$ 250224 261981 266282 280536 174298 255113 354661 287114 298515 318302 303593 289576
21607B89576p2308J0565j31155k52831j99189M7367K14546K31315J08929o0844
$$ 289576 217268 227833 96678 -156153 -355342 -307975 -93429 137886 246815 185971
21597A85971o6202r9798n0525N7525J32541N8479r4834L6161l9093j98475k36778
$$ 185971 119769 19971 -30554 26971 159512 217991 123157 159318 120225 -78250 -315028
21586c15028J88835Q641p8567l7220j71801o1781Q5299J62799J43190K7055p5879
$$ -315028 -126193 -117552 -196119 -233339 -405140 -466921 -381622 -218823 -75633 -48578 -124457
21575a24457O1791M1584j04567K7146J38595m932R0740m1851k1358J38622L6986
$$ -124457 -62666 -21082 -125649 -98503 40092 35160 125900 84049 62691 201313 238299
21564B38299Q2357p2634O1773M2129j27815K685J25890j57338n9766k01346j46703
$$ 238299 320656 248022 309795 351924 224109 226794 352684 195346 135580 -65766 -212469
21553b12469M9831M7591P3244R5863p2521N7032L0760J0571J83568r9000l19102
$$ -212469 -162638 -115047 -41803 54060 -18461 38571 69331 79902 263470 164470 -154632
21542a54632l304J00917N976j4311M7189O3187l9036M07J42202J33433j9655j03261
$$ -154632 -157936 -57019 -51043 -65354 -18165 45022 5986 6393 148595 282028 262373 159112
21530A59112o764j08112O1993P262J0589K4279l9471P1219n7109J26222J30517
$$ 159112 152348 44236 106229 113491 124080 148359 108888 180107 122998 249220 379737
21519C79737j57638J2227p7668l0603o2233P2989J30091J307N3723O0245j106
$$ 379737 222099 234326 156658 126055 63822 136811 266902 268209 321932 382177 381071
21508C81071p1404Q9554N9567J29868n7717k9292N7095O5579J07536M6540J86991
$$ 381071 309667 399221 458788 588656 530939 501647 558742 624321 731857 778397 965388
21497I65388R8894N5085L06101L27192J52527k41041j60947p7320l0805L2963
$$ 965388 1064282 1119367 1425468 1752660 1905187 1664146 1503199 1425879 1395074 1428037
21487A428037L7736j38891j80623j95071J6699j64068J8373J18459n6113n9769
$$ 1428037 1465773 1326882 1146259 951188 967887 803819 822192 940651 884538 824769
21477H24769j99124k01616j40777j58192j7533L2948J59284Q742q7435m3592Q4835
$$ 824769 625645 424029 283252 125060 107527 140475 299759 308501 221066 177474 262309
21466B62309o9668J12769Q2905O1875j13961M089K6637l9782m6619j38672k10128
$$ 262309 192641 305410 388315 450190 336229 340318 366955 327173 280554 141882 -68246
21455f8246j5342Q7649M306O0388Q4284o1860j62214n4604P070J04720N6034R5047
$$ -68246 -83588 4061 8367 68755 153039 91179 -71035 -125639 -118569 -13849 42185 137232
21443A37232j6180o0392n5768P3225l813k87793J57420J95760P3471m331J14655
$$ 137232 121052 60660 4892 78117 74304 -213489 -56069 139691 213162 208831 323486
21432C23486o2866j62543q9752p1179L4507J46732j69651j68406L5780O2097K26255
$$ 323486 260620 98077 8325 -62854 -28347 118385 -51266 -219672 -183892 -121795 104460
21421A04460O0194P3468k7122j28429j66301j02665P0447K13547J12575j33035
$$ 104460 164654 238122 211000 82571 -83730 -186395 -115948 97599 210174 77139
21411G7139j23028j14752j13840J5746J36723k2360m9472J03552N6783P606N0857
$$ 77139 -45889 -160641 -274481 -258735 -122012 -144372 -193844 -90292 -33509 -25903 24954
21400B4954j0379n8832M0676K3161K9663P906Q8258j06735L3243l2369j76346
$$ 24954 14575 -44257 -3581 19580 49243 57149 145407 38672 71915 39546 -136800
21389a36800j50571j7318q9005j61022Q3425K21090j38701k7636j06720M2618
$$ -136800 -287371 -304689 -393694 -554716 -471291 -250201 -388902 -416538 -523258 -480640
21379d80640P6451K62397L2418j72902J00708J59822J34461j63844k77183Q1475
$$ -480640 -404189 -141792 -109374 -282276 -181568 -21746 112715 -51129 -328312 -246837
21369b46837J05779M4004J16070k7056l6699k3706K5998j21493N5392L1286M4205
$$ -246837 -141058 -97054 19016 -8040 -44739 -68445 -42447 -163940 -108548 -77262 -33057
21358c3057N5516m454m2084l0195P7849k6097j02765J15630J14054o0603n1328
$$ -33057 22459 18005 -24079 -54274 23575 -2522 -105287 10343 124397 63794 12466
21347A2466P2923J25036j53501j5689J04813q7427j07200J2421M0082l4083L9967
$$ 12466 85389 210425 56924 41235 146048 58621 -48579 -36158 3924 -30159 9808
21336I808R2317j0471O4692J13621l3812o8609k18832p8292o30j04569J96339
$$ 9808 102125 91654 156346 269967 236155 167546 -51286 -129578 -130208 -234777 -38438
21325c8438J68990j91664j65598J11141M4461l6964K508R8744J7702J87752k5748
$$ -38438 130552 -61112 -226710 -115569 -71108 -108072 -105564 -6820 10882 198634 172886
21314A72886q9523q2763J24296k7368j00515r571N6283j51581n063Q7335J69628
$$ 172886 83363 600 124896 97528 -2987 -12558 43725 -107856 -112919 -25584 144044
21303A44044n9995j41755j31657j26386j0192J30644Q0475O165p9315q2190P0692
$$ 144044 84049 -57706 -189363 -315749 -325941 -195297 -114822 -108657 -187972 -270162 -199470
21292a99470J2803Q0722K40076j16955k27014N9048J03737M738M1828R4594k16605
$$ -199470 -186667 -105945 134131 17176 -209838 -150790 -47053 -42315 -487 94107 -122498
21281a22498j28933N0770j07257m6181j7327j10409l8479M6735J07602j15328
$$ -122498 -251431 -200661 -307918 -354099 -371426 -481835 -520314 -473579 -365977 -481305
21271d81305J35723K11007k5880q9027K06N3518J14177o0931r002J36489J16618
$$ -481305 -345582 -134575 -160455 -249482 -249276 -195758 -81581 -142512 -151514 -15025 101593
21260A01593L2566j32300M6509j14401j60173L7156j12725p1731J66444P9989
$$ 101593 134159 1859 48368 -66033 -226206 -189050 -301775 -373506 -207062 -127073
21250a27073N775N7393Q1303N1659l6056J3352m917P2290n6392j80532r6278j92192
$$ -127073 -121298 -63905 17398 69057 33001 46353 41436 113726 57334 -123198 -219476 -411668
21238d11668J51925P5170j826P3097p3295p6719l6962O7108N7765N5889J38958
$$ -411668 -259743 -184573 -186399 -113302 -186597 -263316 -300278 -233170 -175405 -119516 19442
21227A9442J17497J1402j16462j00896m2826O9152N9284J94490R5379n4464j72244
$$ 19442 136939 148341 31879 -69017 -111843 -42691 16593 211083 306462 251998 79754
21216G9754j70656k03989O255K09981P7615j34121n3024K5135p8662p2345M5676
$$ 79754 -90902 -294891 -288636 -78655 -1040 -135161 -188185 -163050 -241712 -314057 -268381
21205b68381J14840Q6994m6843J41030n6069j44813j70896O0873l1213P8168Q7323
$$ -268381 -153541 -66547 -113390 27640 -28429 -173242 -344138 -283265 -314478 -236310 -148987
21194a48987R1847J683P9188n0408k1720k04434j05815Q3686m2973L3936J74667
$$ -148987 -57140 -55457 23731 -26677 -48397 -252831 -358646 -274960 -317933 -283997 -109330
21183a09330J40416j23418j70706j64820J13754q520J22995J42546K33021K7861
$$ -109330 31086 -92332 -263038 -427858 -314104 -322624 -199629 -57083 175938 203799
21173B03799o7521k880j73003L5747k5650l4022N9215J59219n3629j20292q9378
$$ 203799 136278 133398 -39605 -3858 -29508 -63530 -4315 154904 101275 -19017 -108395
21162a08395O7141m8730j20349j88977L3826M029K22037Q6962m9345P1990L7785
$$ -108395 -41254 -89984 -210333 -399310 -365484 -361455 -139418 -52456 -101801 -29811 7974
21151G974P0828j7417m927r3090j13439j34092k1498L1795R2126k8194P7666J88804
$$ 7974 78802 61385 56458 -36632 -150071 -284163 -305661 -273866 -181740 -209934 -132268 56536
21139E6536m9096k06639n6927k1344k4729P3420J92818k4059j84363j38963R3925
$$ 56536 7440 -199199 -256126 -277470 -302199 -228779 -35961 -60020 -244383 -383346 -289421
21128b89421J40576J39881J59751J9553J18437m3190k86097N889K05173j7018
$$ -289421 -148845 -8964 150787 170340 288777 245587 -40510 -34621 170552 153534
21118A53534j80693P5012r1415j6794p6120p159M044J22910p6318j84892j00709
$$ 153534 -27159 47853 -43562 -60356 -136476 -143635 -139591 -16681 -92999 -277891 -378600
21107c78600j7291Q9652O9309J6442R7790j8431J10831J74330l5012P1620l3794
$$ -378600 -395891 -306239 -236930 -220488 -122698 -141129 -30298 144032 109020 180640 146846
21096A46846N850R2508J9059J20935r8264k81495q6071K05348P605r731j20761
$$ 146846 152696 245204 264263 385198 286934 5439 -80632 124716 132321 122590 1829
21085A829j39123n8752J10515M2772j09034P839L7743J60025J26673j0861K3384
$$ 1829 -137294 -196046 -85531 -42759 -151793 -143954 -106211 53814 180487 169626 193010
21074A93010j8575Q4697Q8363j59256k76720R1718J77669J15756j82136j17649
$$ 193010 174435 259132 347495 188239 -88481 3237 180906 296662 114526 -3123
21064c123O1054R9414j9821k2146O5828L0435K6724L1127M682k9499p4945j72216
$$ -3123 57931 157345 137524 115378 181206 211641 238365 269492 274174 244675 169730 -2486
21052b486J4721L6653J49401K29551j2467o0340n7447K232m7085O2439n1273k79248
$$ -2486 12235 48888 198289 427840 415373 355033 297586 299818 252733 315172 263899 -15349
21040a5349k3560N5757q8896R9762K05n9354L7064R7342j04024n9361O3140J22950
$$ -15349 -38909 16848 -72048 27714 27919 -31435 5629 102971 -1053 -60414 2726 125676
21028A25676Q6462r3126l3094j17084M8616P009Q7290K439K8208j1348m0747k19908
$$ 125676 212138 119012 85918 -31166 17450 24459 111749 114188 142396 131048 90301 -129607
21016a29607l7632K37183M4300m8046l4623l102j45009Q5709J18140O5458j09584
$$ -129607 -167239 69944 114244 66198 31575 28473 -116536 -30827 87313 152771 43187
21005D3187J4986M7355j40280J3555j6048j62335m1092J28637J31164J4025j12093
$$ 43187 58173 105528 -34752 -21197 -37245 -199580 -240672 -112035 19129 33154 -78939
20994g8939j8592J51944N347M133p7979n1211p0306j80289l4033k821Q4866J51552
$$ -78939 -97531 54413 59760 63893 -14086 -65297 -135603 -315892 -349925 -352746 -267880 -116328
20982a16328K08634q9116j70309j41803m0641O8995R5061K4221Q9322n0735R0401
$$ -116328 92306 3190 -167119 -308922 -349563 -280568 -185507 -161286 -71964 -122699 -32298
20971c2298r1738j74359r0065R5708J8085J65010K76939j4859o6420m1070L4209
$$ -32298 -124036 -298395 -388460 -292752 -274667 -109657 167282 152423 86003 44933 79142
20960G9142Q8767j19629p7529j02091r53R4718N244j73969m6209p8690N8408j46435
$$ 79142 167909 48280 -29249 -131340 -132293 -37575 -32331 -206300 -252509 -331199 -272791 -419226
20948d19226J62866K29658R8218l6362p3754k27827j01787J28693j30038m6246
$$ -419226 -256360 -26702 71516 35154 -38600 -266427 -368214 -239521 -369559 -415805
20938d15805P6590P77q757J77845J64015N8158k6533p7790j16517O6098q1392
$$ -415805 -339215 -338438 -347195 -169350 -5335 52823 26290 -51500 -168017 -101919 -183311
20927a83311L5117j9706p7094j22728l8764o1769J45537L43156J21520j58742
$$ -183311 -148194 -167900 -244994 -367722 -406486 -468255 -322718 20438 141958 -16784
20917a6784m8785r4918O4363M5307o7544k24582M9618Q3273O1847M9314q783R2468
$$ -16784 -65569 -160487 -96124 -50817 -118361 -342943 -293325 -210052 -148205 -98891 -107674 -15206
20905a5206j02084O3656J36536L4972m4930L7391j70987R259j24676j29350R0152
$$ -15206 -117290 -53634 82902 117874 72944 110335 -60652 -51393 -176069 -305419 -215267
20894b15267Q1638J84422J01454p9552P455M2494j0870o2991j66468n80k9559
$$ -215267 -133629 50793 152247 72695 80150 122644 111774 48783 -117685 -118265 -147824
20883a47824l9397Q4054m8540r8169o8242R3582M5541q2312J50743q627r7847
$$ -147824 -187221 -103167 -151707 -249876 -318118 -224536 -178995 -261307 -110564 -119191 -217038
20872b17038j67049p2736J03053J39902N4239n8985J60105L7035l4133O0792k40860
$$ -217038 -384087 -456823 -353770 -213868 -159629 -218614 -58509 -21474 -55607 5185 -235675
20861b35675j44629P778P9292L6943M3000J09064N5080j70322n0320M5410J6871
$$ -235675 -380304 -372526 -293234 -256291 -213291 -104227 -49147 -219469 -269789 -224379 -207508
20850b07508J21460N6463o7870l297R2505L2310K6599N0795M9307M224o7771l0429
$$ -207508 -86048 -29585 -97455 -100752 -8247 24063 50662 101457 150764 154988 87217 56788
20838E6788R9295j18448P3861l1881j5632n743j47825J66K064Q0617J86194N700
$$ 56788 156083 37635 111496 79615 63983 58240 -89585 -89419 -87355 -6738 179456 185156
20826A85156j38116j06080o9059N9148n7737j03951J61851P0556j63922j36261
$$ 185156 47040 -59040 -128099 -68951 -126688 -230639 -68788 1768 -162154 -298415
20816b98415r2026K23634N8923r5388J64378j8561j4120J9747q3911K37641J59384
$$ -298415 -390441 -166807 -107884 -203272 -38894 -57455 -71575 -51828 -135739 101902 261286
20805B61286j27277q2543k6144j34292J2637J23885k8739k7077k16729j29496
$$ 261286 134009 51466 25322 -108970 -96333 27552 -1187 -28264 -244993 -374489
20795c74489N8297J06787M4020J50611J8226j38206P9573l8490k1517n7230q3879
$$ -374489 -316192 -209405 -165385 -14774 3452 -134754 -55181 -93671 -115188 -172418 -256297
20784b56297R2284K11667J46794l0333r9934m2117j34518l466j22606N2022P6213
$$ -256297 -164013 47654 194448 164115 64181 22064 -112454 -115920 -238526 -186504 -110291
20773a10291q115N0785o1641K8472J03517L5786R3840k5805j99652K09025J05518
$$ -110291 -118406 -67621 -129262 -100790 2727 38513 132353 106548 -93104 115921 221439
20762B21439l1224j09547j2609j5160k5162L338j78108R0787O3728j02420k9668
$$ 221439 190215 80668 68059 52899 27737 31075 -147033 -56246 7482 -94938 -124606
20751a24606L7757q435O4428n7771j30705K29680J69775j93265k21244j11742
$$ -124606 -86849 -95284 -30856 -88627 -219332 10348 180123 -13142 -234386 -346128
20741c46128P8449N0658n3079K7603M6625R6665Q0883P9141m423p9133j75262
$$ -346128 -267679 -217021 -270100 -242497 -195872 -99207 -18324 60817 56394 -22739 -198001
20730a98001P8912Q9515K9444l6632n5743j19141M227r2249M3406R2368N6110
$$ -198001 -119089 -29574 -130 -36762 -92505 -211646 -207419 -299668 -256262 -163894 -107784
20719a07784J5544q6689m3718p4108M4554N9573J3953j67165J4487J55223J14238
$$ -107784 -92240 -178929 -222647 -296755 -252201 -192628 -178675 -345840 -331353 -176130 -61892
20708f1892K4240k0277k563N8590o9285J12937K6098O6417P0484o618j59673n2781
$$ -61892 -37652 -57929 -60492 -1902 -71187 41750 67848 134265 204749 198131 38458 -14323
20696a4323J53609L5225m1318l8089j44614j10516J49817n915O8218J50994P3247
$$ -14323 139286 174511 133193 95104 -49510 -160026 -10209 -16124 52094 203088 276335
20685B76335j60647j90082l9831r274j7469p5434m9J42723o138N5143n0811q7498
$$ 276335 115688 -74394 -114225 -123499 -140968 -216402 -216451 -73728 -79866 -24723 -75534 -163032
20673a63032j06081n5172P8460N7529N1907k4870n2909N3564K56284J5549o6845
$$ -163032 -269113 -324285 -245825 -188296 -136389 -161259 -214168 -160604 95680 111229 44384
20662D4384R7900J7260m8436q5425L9949o9830K6039J36427j57417j0523Q6209
$$ 44384 142284 159544 111108 25683 65632 -4198 21841 158268 851 -9672 76537
20651G6537j55877N1058J60792J284k1191j54082J3869j29784p2058K9052j03538
$$ 76537 -79340 -28282 132510 133794 112603 -41479 -27610 -157394 -229452 -200400 -303938
20640c03938O4030l7438J86589M1124K7853k6026j39070j80459Q820K74332L66
$$ -303938 -239908 -277346 -90757 -49633 -21780 -47806 -186876 -367335 -358515 -84183 -83817
20629h3817L9138j40376J18075J65969J57281k13502p3485o1363k8510Q9686q1655
$$ -83817 -44679 -185055 -66980 98989 256270 42768 -30717 -92080 -120590 -30904 -112559
20618a12559j16925R5722Q9086J0259Q9285N4291k12443j88461j46490J41498
$$ -112559 -229484 -133762 -44676 -34417 54868 109159 -103284 -291745 -438235 -296737
20608b96737P8817L584k517J5413l537L0525m824l4061n8093J45072R6988m9498
$$ -296737 -217920 -214336 -216853 -201440 -204977 -174452 -179276 -213337 -271430 -126358 -29370 -78868
20596g8868p5345J81602j6185J6224j69163l64409Q267J25939J4743L5404J56417
$$ -78868 -154213 27389 11204 27428 -141735 -506144 -497877 -371938 -357195 -321791 -165374
20585a65374M8415q9319l857R4476r725j13205l1663Q7283K02177k4496q0518
$$ -165374 -116959 -206278 -210135 -115659 -125384 -238589 -270252 -182969 19208 -5288 -85806
20574h5806j06850j08869N8650k17p7316K1421K80025o8417j53553L6072J57033
$$ -85806 -192656 -301525 -242875 -243092 -320408 -298987 -18962 -87379 -240932 -204860 -47827
20563d7827k1498j38722j74699j45602O6935K41626L35724L3021k04292j58145
$$ -47827 -69325 -208047 -382746 -528348 -461413 -219787 115937 148958 -55334 -213479
20553b13479N6959m6056M6798L0434l4036N5757P9318q0196l3204j0370j8204
$$ -213479 -156520 -202576 -155778 -125344 -159380 -103623 -24305 -104501 -137705 -148075 -166279
20542a66279n5619P2033L630m2051J30664J9750j04163k1399J92043K32016o578
$$ -166279 -221898 -149865 -146235 -188286 -57622 -37872 -142035 -163434 28609 260625 254047
20531B54047L6528l4684j38337j49807r449O8859o8187K08180M5326k03956q4568
$$ 254047 290575 255891 117554 -32253 -41702 27157 -41030 167150 212476 8520 -76048
20520g6048J76158r279L5665j12913j21208n947j51749P5283J73640O3145Q3840
$$ -76048 100110 90831 126496 13583 -107625 -113572 -265321 -190038 -16398 46747 130587
20509A30587M9117q193N2222J40411k27095l20575k3026K40798J29453n7060j53163
$$ 130587 179704 171511 223733 364144 137049 -183526 -206552 34246 163699 106639 -46524
20498d6524j29060j24267O215R0237J22812r3309j67780J57474j3453n6971j03601
$$ -46524 -175584 -299851 -293636 -203399 -80587 -173896 -341676 -184202 -197655 -254626 -358227
20487c58227N828K79166J58387J81099J55277k18302o7342M6977Q801j55140j30246
$$ -358227 -352399 -73233 85154 266253 421530 203228 135886 182863 191664 36524 -93722
20476i3722M9844J0128N3920j12149l4043N0340j6396L8481M1329J9035k2405
$$ -93722 -43878 -33750 20170 -91979 -126022 -75682 -92078 -53597 -12268 6767 -15638
20465a5638n3608k9465O28l4604m3744Q0656N0409N5107r0016N6842k4245j75644
$$ -15638 -69246 -98711 -98083 -132687 -176431 -95775 -45366 9741 -80275 -23433 -47678 -223322
20453b23322J1428r5519k2330J84787L8482j01158r1254J35482J59347J30647
$$ -223322 -211894 -307413 -329743 -144956 -106474 -207632 -298886 -163404 -4057 126590
20443A26590J19302l9379j11847k70358k5862L7898J40948N3554J36903M1915
$$ 126590 245892 206513 94666 -175692 -201554 -163656 -22708 30846 167749 209664
20433B09664m9989k07021q7996J9735n5665j21489K0761J22045j17926j22830
$$ 209664 159675 -47346 -135342 -115607 -171272 -292761 -272000 -149955 -267881 -390711
20423c90711q5905J72393J93038O5593o4555M4131L1252J0619j8806L5755r197
$$ -390711 -476616 -304223 -111185 -45592 -110147 -66016 -34764 -24145 -42951 -7196 -16393
20412a6393k24331L2492J45841p3087j58871M8292J83912Q5807P7916m5702r6583
$$ -16393 -240724 -208232 -62391 -135478 -294349 -246057 -62145 23662 101578 55876 -40707
20401d0707j17553r7831L5234j2545L2767K23894J0010M2539P6708j00930j57003
$$ -40707 -158260 -256091 -220857 -233402 -200635 23259 33269 75808 152516 51586 -105417
20390a05417l4928o832l9572j02741o3871o6312J04582K41086k1299r4737O2412
$$ -105417 -140345 -147177 -186749 -289490 -353361 -419673 -315091 -74005 -95304 -190041 -127629
20379a27629K43660k8279k23376m4451R5252L2282Q9838k0646j69285j30187R540
$$ -127629 116031 87752 -135624 -180075 -84823 -52541 37297 16651 -152634 -282821 -273281
20368b73281J57699J95733O2258K3068m8543j09789q2175P4341J01743j35787
$$ -273281 -115582 80151 142409 165477 116934 7145 -75030 -689 101054 -34733
20358c4733k6145p3325j25690r539J04822J25908J63346l6930q3532R3008P3527
$$ -34733 -60878 -134203 -259893 -269432 -164610 -38702 124644 87714 4182 97190 170717
20347A70717j552k94734k39242q8764q3168J65106K19900P1749j6735O0042r8236
$$ 170717 169165 -125569 -364811 -453575 -536743 -371637 -151737 -79988 -96723 -36681 -134917
20336a34917m8907J75429J43610j7885j47249k69429K651K20312k0136j6913O047
$$ -134917 -183824 -8395 135215 117330 -29919 -299348 -296697 -76385 -96521 -113434 -107387
20325a07387j12760j19367K5264K13846J55804R9713p0808q6366k2044r7671j01371
$$ -107387 -220147 -339514 -314250 -100404 55400 155113 84305 -2061 -24105 -121776 -223147
20314b23147J03844r643N3169M9370j02163M763J06074J25155P9899k57368k54302
$$ -223147 -119303 -128946 -75777 -26407 -128570 -123807 -17733 107422 187321 -70047 -324349
20303c24349j9090K5246J28373J53326k1894o8248M1652K36148R1612m1662j2768
$$ -324349 -343439 -318193 -189820 -36494 -58388 -126636 -84984 151164 242776 201114 188346
20292A88346j42899j51845P0587N5281J1685j14511J1380j4027k4731o1231j58820
$$ 188346 45447 -106398 -35811 19470 31155 -83356 -71976 -86003 -110734 -171965 -330785
20281c30785J92392L11391J52355N9786q445j3532r671k44172q3614P255j30171
$$ -330785 -138393 172998 325353 385139 376694 363162 353491 109319 25705 32960 -97211
20270i7211q3722n5210n097j38563p7645J86690J98156K27887m5511l612J13003
$$ -97211 -180933 -236143 -241240 -379803 -457448 -270758 -72602 155285 109774 106162 219165
20259B19165R5835n9153k07103k43577J469J93895J06123j42792l5003J34024
$$ 219165 315000 255847 48744 -194833 -193364 531 106654 -36138 -71141 62883
20249F2883r1699k40553K1722j2206L9855L8454l8393N824j40443R6334O2846
$$ 62883 -28816 -269369 -247647 -259853 -219998 -181544 -219937 -214113 -354556 -258222 -195376
20238a95376K4589k7834K5923l1631k8854N9416J19133J08244j05851p7768J93494
$$ -195376 -170787 -198621 -172698 -204329 -233183 -173767 -54634 53610 -52241 -130009 63485
20227F3485J26942o0060j0093L8229j00820N2346J02700L1370M1350j2648k17772
$$ 63485 190427 130367 120274 158503 57683 110029 212729 244099 285449 272801 55029
20216E5029j93637N9562P7047J7754M7796j10571j63567M274R2972q4240j32915
$$ 55029 -138608 -79046 -1999 15755 63551 -47020 -210587 -206313 -113341 -197581 -330496
20205c30496L5231J75765k0592N746j7516l7077O6547k2411N7984J8816j05622
$$ -330496 -295265 -119500 -140092 -134346 -151862 -188939 -122392 -144803 -86819 -68003 -173625
20194a73625j7493q6240R5104P8560k5728n8m9447j05806k0517j8118L5431R2641
$$ -173625 -191118 -277358 -182254 -103694 -129422 -129480 -178927 -284733 -305250 -323368 -287937 -195296
20182a95296j85424k4647K6264n5534K05267R0966j06320N8252J3631M3096L0209
$$ -195296 -380720 -405367 -379103 -434637 -229370 -138404 -244724 -186472 -172841 -129745 -99536
20171i9536N1994Q4366m6969o9443m0290O883m0903O4780q3692r924Q050j05605
$$ -99536 -47542 36824 -10145 -79588 -119878 -112995 -153898 -89118 -172810 -182734 -174684 -280289
20159b80289j1644J12882L4980m0782j12591M2757J58993L6727j49815l3623j008
$$ -280289 -291933 -179051 -144071 -184853 -297444 -254687 -95694 -58967 -208782 -242405 -243413
20148b43413J30457m0662j09259m8506J6146K12229P3461J32066L9633l0397p9191
$$ -243413 -112956 -153618 -262877 -311383 -295237 -83008 -9547 122519 162152 131755 52564
20137E2564l0526J16258k8528j57816o6792R4672J47660j5164J3808r595k59505
$$ 52564 22038 138296 109768 -48048 -114840 -20168 127492 112328 126136 116541 -142964
20126a42964j39859p6419K56723k5915n0938K0913N4747q4111M9311o2562M8150
$$ -142964 -282823 -359242 -102519 -128434 -179372 -158459 -103712 -187823 -138512 -201074 -152924
20115a52924R0485p8907J06842J4505k12435J17108Q8818m5084J25331M9627j72129
$$ -152924 -62439 -141346 -34504 -19999 -232434 -115326 -26508 -71592 53739 103366 -68763
20104f8763k09302J014J25880K86748r3171o2258J16587J52425K9741j34814j91198
$$ -68763 -278065 -277051 -151171 135577 42406 -19852 96735 249160 278901 144087 -47111
20093d7111j5839j00988L7817R2382o6354n8962J28222J94645K10729k0748r2728
$$ -47111 -62950 -163938 -126121 -33739 -100093 -159055 -30833 163812 374541 353793 261065
20082B61065j18942j79816K7353M8970p4956N1577j9136L8215K4341j16982J13239
$$ 261065 142123 -37693 -10340 38630 -36326 15251 -3885 34330 58671 -58311 54928
20071E4928R8477k4315j99280J38676p3847n8785J35326l9728j4876J0727Q4811
$$ 54928 153405 129090 -70190 68486 -5361 -64146 71180 31452 16576 27303 112114
20060A12114J34354j29648j22279J10251L1338m9902k65271j41823K9521P5400
$$ 112114 246468 116820 -5459 104792 136130 86228 -179043 -320866 -291345 -215945
20050b15945L1719L0750M7608K41691R878N7298O150r0653j76973j29608P0266
$$ -215945 -184226 -153476 -105868 135823 145701 202999 209149 118496 -58477 -188085 -117819
20039a17819J16602J29230M1947J10115J00801J32165j00070N3786j47771m7695
$$ -117819 -1217 128013 169960 280075 380876 513041 412971 466757 318986 271291
20029B71291n3248j53727o4580j34998m848R350Q7017P0670j07414j58353Q9264
$$ 271291 218043 64316 -264 -135262 -140110 -130760 -43743 26927 -80487 -238840 -149576
20018a49576J60215J33670j6146K3775R8431P9498q8215J5060j23542O3070j62339
$$ -149576 10639 144309 128163 151938 250369 329867 241652 256712 133170 196240 33901
20007C3901m39248J26731J54025J46351J11834j33450k9977j5875L00429J34364
$$ 33901 -405347 -278616 -124591 21760 133594 144 -29833 -45708 254721 389085
19997C89085n769p1588j07114p0257j1710K2501J69377O3505J20501r0798J0052
$$ 389085 383316 311728 204614 134357 122647 145148 314525 378030 498531 407733 417785
19986D17785M0015J82837L4319j74667L0400L3062M4061j8273j63672j8039r1734
$$ 417785 457800 640637 674956 500289 530689 563751 607812 589539 425867 407828 316094
19975C16094m3837j53699p4794O3672o8853N0881Q0027p9645O1759j43097j54218
$$ 316094 272257 118558 43764 107436 38583 89464 169491 89846 151605 8508 -145710
19964a45710O7022J48737M1514M8092K56809J10962j8606o6214j40144j19554
$$ -145710 -78688 70049 111563 159655 416464 527426 508820 442606 302462 182908
19954A82908L4550m7393j22442J64596O6106r2144M5617j31788r9919l3840R9746
$$ 182908 217458 170065 47623 212219 278325 186181 231798 100010 91 -33749 65997
19943F5997J36038J65202J72941K812q0273j84238j00746n6494J38328K32716
$$ 65997 202035 367237 540178 542990 462717 278479 177733 121239 259567 492283
19933D92283r0100j13901j63506m996L7653J44408j37670l3899M352j6757J85617
$$ 492283 402183 288282 124776 119780 157433 301841 164171 130272 134624 117867 303484
19922C03484R4939o163n1982K5648M1323n9864j67299j8364J68726K27170J45606
$$ 303484 398423 392260 340278 365926 407249 347385 180086 161722 330448 557618 703224
19911G03224p4241q7461J9651o8588k06159m5445L18605J66371j01991j74206
$$ 703224 628983 541522 561173 492585 286426 240981 559586 725957 623966 449760
19901D49760m591J3972J65507j00779r5083Q4160J92872J05486J30738k5586r7483
$$ 449760 445169 459141 624648 523869 428786 512946 705818 811304 942042 916456 818973
19890H18973r6519p8606r0546J18864N0179J22896M0243k29120j15482l2823J10439
$$ 818973 722454 643848 553302 672166 722345 845241 885484 656364 540882 508059 618498
19879F18498O2674o2158o1612o8440m8391Q2836M2816R4038M2529J04271j25800
$$ 618498 681172 619014 557402 488962 440571 523407 566223 660261 702790 807061 681261
19868F81261r7879q3684m9986j01135J52599J26976R897P2295J30031J33294j0896
$$ 681261 583382 499698 449712 348577 501176 628152 638049 710344 840375 973669 962773
19857I62773j62543j1014j35851N2730L9579j18302j67256o8935P7773K66786
$$ 962773 800230 789216 653365 706095 745674 627372 460116 391181 468954 735740
19847G35740K78663j6517j03098j34484m129P7278J9192j32201o7849o6305L4876
$$ 735740 1014403 997886 894788 760304 756175 833453 852645 720444 652595 586290 621166
19836F21166n3118j21545J06238K82900R1027j8178P2356J7456O3974J6322j76350
$$ 621166 568048 446503 552741 835641 926668 908490 980846 998302 1062276 1078598 902248
19825I02248o3612k2231J30454J21401r636r2372P594n7657N8358j48668j11186
$$ 902248 838636 816405 946859 1068260 1058624 966252 973846 916189 974547 825879 714693
19814G14693M542J39405J41810j07737J11409N4340j09548j48886j94038q9611
$$ 714693 719235 858640 1000450 892713 1004122 1058462 948914 800028 605990 516379
19804E16379o163L4331J9490J9332j08618O8993J3008j3792J90609J85012j45091
$$ 516379 510216 544547 564037 583369 474751 543744 556752 542960 733569 918581 773490
19793G73490l2956J6181N1940k03895k21553L9097J36734K5458J57221r5313k27549
$$ 773490 740534 756715 808655 604760 383207 422304 559038 584496 741717 646404 418855
19782D18855j11171R0924M4447j6351p8967j26814J79001J42461l2786k5664k2668
$$ 418855 307684 398608 443055 426704 347737 220923 399924 542385 509599 483935 461267
19771D61267L4296K04549q09n2675m4773p6292j4377n4582l7228o4862R5514O4356
$$ 461267 495563 700112 699303 646628 601855 525563 511186 456604 419376 354514 450028 514384
19759E14384P7288j59421j65063q3353k3025K61327O1096j7950r3775k5469k6108
$$ 514384 591672 432251 267188 183835 160810 422137 483233 465283 371508 346039 319931
19748C19931N2321K1091p8320j22109J6414J40656M4115O8920J80227M8319j56893
$$ 319931 372252 393343 315023 192914 209328 349984 394099 463019 643246 691565 534672
19737E34672J5877K09650N3137k45249p2972j6850k18497q6953K32699P7692q6009
$$ 534672 550549 760199 813336 568087 495115 478265 259768 172815 405514 483206 397197
19726C97197K5931K69425O6846k55321j52775R350Q6689P2632R1738o2677l70015
$$ 397197 423128 692553 759399 504078 351303 360653 447342 519974 611712 549035 179020
19715A79020j39279J72014K2482l1980q0185O1063J62167K68544J33492j4288
$$ 179020 39741 211755 234237 202257 122072 183135 345302 613846 747338 733050
19705G33050k36115j34534N9722Q8552N7693J50053L4901M313j01084n3433m6896
$$ 733050 496935 362401 422123 510675 568368 718421 753322 757635 656551 603118 556222
19694E56222L173R7861r0422J17878o8054o5653l25113K880J33192J99684j11455
$$ 556222 559395 657256 566834 684712 616658 551005 225892 228772 361964 561648 450193
19683D50193p0724k23872j09535J58888P1204L4883J06931K2386J94419J12409
$$ 450193 379469 155597 46062 204950 276154 311037 417968 440354 634773 747182
19673G47182n7577l7815k0969M9178k0297K4565j899j15034k2713m3475P8526
$$ 747182 689605 651790 630821 679999 659702 684267 682368 567334 544621 501146 579672
19662E79672J0363k0751Q5126p8279N7039j80798j37374q7782J02949J15656P4005
$$ 579672 590035 569284 654410 576131 633170 452372 314998 227216 330165 445821 519826
19651E19826K1653J21777r8332N8955J5264j13721J2909j193l2183O3262k877
$$ 519826 541479 663256 564924 623879 639143 525422 538331 537138 504955 568217 565340
19640E65340N5384k9863q5697j8353O1554j1982J58963M1613p0070P2460j27964
$$ 565340 620724 590861 505164 486811 548365 536383 695346 736959 666889 739349 611385
19629F11385n761n9062j03694j54573q0949J79812P1600J40874J95320J54465
$$ 611385 605624 546562 442868 288295 207346 387158 458758 599632 794952 949417
19619I49417n3336j31098j893N1626N8126J06845j07635n6139J0427l6253M8638
$$ 949417 896081 764983 763090 814716 872842 979687 872052 815913 826340 790087 838725
19608H38725N4129J77503L5265n3868k64302k19459M6477J49774J62099n5413
$$ 838725 892854 1070357 1105622 1051754 787452 567993 614470 764244 926343 870930
19598H70930o058J74753J01356p9097j70783o5457j07507N4096R8264P0336l7220
$$ 870930 864872 1039625 1140981 1061884 891101 825644 718137 772233 870497 940833 903613
19587I03613Q2412k2059q8778k6993L7392N7647P3192q8285P5105l5979j74540
$$ 903613 986025 963966 875188 848195 885587 943234 1016426 928141 1003246 967267 792727
19576G92727N3734P0437o344j07893J19764n0118n8553R5797L06155P5783j5270
$$ 792727 846461 916898 910554 802661 922425 872307 813754 909551 1215706 1291489 1276219
19565A276219k6049k4460l0928o4747J18991l4268q4143M7815p894L2505N6216
$$ 1276219 1250170 1225710 1194782 1130035 1249026 1214758 1130615 1178430 1170536 1203041 1259257
19554A259257k85477q2814K07345O6844M0224J15101K6197M4170n1410q7925Q8691
$$ 1259257 973780 890966 1098311 1165155 1205379 1320480 1346677 1390847 1339437 1251512 1340203
19543A340203r4364n2717L4879j5729K6766q8529l9117K6048K82352J6275r8051
$$ 1340203 1245839 1193122 1228001 1212272 1239038 1150509 1111392 1137440 1419792 1436067 1338016
19532A338016Q5834o2592J30968P1606k3033N4158j36378P078K54934M6190J07931
$$ 1338016 1423850 1361258 1492226 1563832 1540799 1594957 1458579 1465657 1720591 1766781 1874712
19521A874712R5898m4535j54849k4849j04353R0938K93490R8861L16432J81136
$$ 1874712 1970610 1926075 1771226 1746377 1642024 1732962 2026452 2125313 2441745 2622881
19511B622881L40648O41186O85460N78535L14730M75183K91184q61570j089856
$$ 2622881 2963529 3604715 4290175 4868710 5183440 5658623 5949807 5088237 3998381
19502C998381o30797n04200k36752k7717R169k57316j41397J3025O8487K17087
$$ 3998381 3367584 2863384 2626632 2598915 2608084 2350768 2209371 2222396 2290883 2507970
19492B507970N0471l3939n734N896j63321J01614J52524N2564O5872l7019p8796
$$ 2507970 2558441 2524502 2518768 2524664 2361343 2462957 2615481 2668045 2733917 2696898 2618102
19481B618102M9615J19354p6941j03438j52530J01021N2108m4079R0925O4049
$$ 2618102 2667717 2787071 2710130 2606692 2454162 2555183 2607291 2563212 2654137 2718186
19471B718186k8588j3452J55290J04256m1848r4529O7565J61227P2015l9003N6345
$$ 2718186 2689598 2676146 2831436 2935692 2893844 2799315 2866880 3028107 3100122 3061119 3117464
19460C117464Q8583L2149j40800P6858o6902l071J01594J1644O5556K2409q1663
$$ 3117464 3206047 3238196 3097396 3174254 3107352 3104281 3205875 3217519 3283075 3305484 3223821
19449C223821J36775O7739q8146p8581P9980K47799K17212P5093R7207P879P6974
$$ 3223821 3360596 3428335 3340189 3261608 3341588 3589387 3806599 3881692 3978899 3986778 4063752
19438D063752J18471J04991k3992M391p5890J8501J24910O6037J33948Q9835k0641
$$ 4063752 4182223 4287214 4263222 4267613 4191723 4210224 4335134 4401171 4535119 4624954 4604313
19427D604313P5423N1881K88831P2141n6940J3681J99389J43812Q2717O4223P0029
$$ 4604313 4679736 4731617 5020448 5092589 5035649 5049330 5248719 5392531 5475248 5539471 5609500
19416E609500j0521O6882P3397o4110K79976J63738m1241N7494N1815n3413J33562
$$ 5609500 5598979 5665861 5739258 5675148 5955124 6118862 6077621 6135115 6186930 6133517 6267079
19405F267079K09875Q0595j1742m7192J54797P9219R9325J45605R2455J58349
$$ 6267079 6476954 6557549 6545807 6498615 6653412 6732631 6831956 6977561 7070016 7228365
19395G228365M2498K0567K8624J62765Q2137J10430R4957L98890J75202P3013
$$ 7228365 7270863 7291430 7320054 7482819 7564956 7675386 7770343 8169233 8344435 8417448
19385H417448J14446Q3724O2342O9452K18314K43798K43074J38307L5798J0004
$$ 8417448 8531894 8615618 8677960 8747412 8965726 9209524 9452598 9590905 9626703 9636707
19375I636707K12165J48454L38895K13886J2140K57810J73977k8357J09813L02107
$$ 9636707 9848872 9997326 10336221 10550107 10562247 10820057 10994034 10965677 11075490 11377597
19365A1377597L87902L98519Q0279J31428K82647L47528J84623L57216M48903
$$ 11377597 11765499 12164018 12244297 12375725 12658372 13005900 13190523 13547739 13996642
19356A3996642L11667K78253K08107L21821M21439O75865O25785O52533M83739
$$ 13996642 14308309 14586562 14794669 15116490 15537929 16213794 16839579 17492112 17975851
19347A7975851N07328O59225N54403M69656O67333N54081N34111O92122M55170
$$ 17975851 18483179 19142404 19696807 20166463 20833796 21387877 21921988 22614110 23069280
19338B3069280L76265N12032M95113N45653N76080M10933N13622O12543N86220
$$ 23069280 23445545 23957577 24452690 24998343 25574423 25985356 26498978 27111521 27697741
19329B7697741Q07071R62839Q09474P81856Q44973J003620J197131R54368J223687
$$ 27697741 28504812 29467651 30277125 31058981 31903954 32907574 34104705 35059073 36282760
19320C6282760J169226J139747J322350J204253J361422J513768J559558J454126
$$ 36282760 37451986 38591733 39914083 41118336 42479758 43993526 45553084 47007210
19312D7007210J538811J377772J542338J854295J926373K077911K126954J885064
$$ 47007210 48546021 49923793 51466131 53320426 55246799 57324710 59451664 61336728
19304F1336728J844700J786126J945089K131349J907124K051894K033397K037411
$$ 61336728 63181428 64967554 66912643 69043992 70951116 73003010 75036407 77073818
19296G7073818K203374K212518J852005J663343J683654J486133J366502J249615
$$ 77073818 79277192 81489710 83341715 85005058 86688712 88174845 89541347 90790962
19288I0790962J104652J064488J103675Q67532O16803M36979L03680J65937r3971
$$ 90790962 91895614 92960102 94063777 94931309 95548112 95985091 96288771 96454708 96360737
19279I6360737k71596l84000n08651p80269j054872r43607r52568j079065j167029
$$ 96360737 96089141 95705141 95196490 94416221 93361349 92417742 91465174 90386109 89219080
19270H9219080j441704j402713j463082j306462j346461j454385j487759j397972
$$ 89219080 87777376 86374663 84911581 83605119 82258658 80804273 79316514 77918542
19262G7918542j479511j413113j480856j534558j565621j401393j148217j103812
$$ 77918542 76439031 75025918 73545062 72010504 70444883 69043490 67895273 66791461
19254F6791461j192937j176380j142604j131781j203000j103717j108667r17607
$$ 66791461 65598524 64422144 63279540 62147759 60944759 59841042 58732375 57814768
19246E7814768j072224j051636p54496q45025r02351p06351o37132o38879p38086
$$ 57814768 56742544 55690908 54936412 54091387 53189036 52482685 51845553 51206674 50468588
19237E0468588p50280n88227o71195n04702m18276m63634l94684l49877k10908
$$ 50468588 49718308 49130081 48458886 47954184 47535908 47072274 46677590 46327713 46116805
19228D6116805k64391j33300j74586k52067j86355j86353j07561k68472p1645
$$ 46116805 45852414 45719114 45544528 45292461 45106106 44919753 44812192 44543720 44472075
19219D4472075J01024P1231J17393J85384Q5246L31722L50597K68090L14647M47682
$$ 44472075 44573099 44644330 44761723 44947107 45032353 45364075 45714672 45982762 46297409 46745091
19209D6745091M29597L50135L68782M85998P08532P61315Q36859R35742P62628
$$ 46745091 47174688 47524823 47893605 48379603 49088135 49849450 50686309 51622051 52384679
19200E2384679Q43735R16098J124496R75083J176981J227399J270183J372205
$$ 52384679 53228414 54144512 55269008 56244091 57421072 58648471 59918654 61290859
19192F1290859J452950J656894J636427J683644J766652J861008J857827K106357
$$ 61290859 62743809 64400703 66037130 67720774 69487426 71348434 73206261 75312618
19184G5312618K183542J958591K204187K017860K155155K062560K239124K165346
$$ 75312618 77496160 79454751 81658938 83676798 85831953 87894513 90133637 92298983
19176I2298983K038223K016035J801679J722060J682055J736826J531259J427563
$$ 92298983 94337206 96353241 98154920 99876980 101559035 103295861 104827120 106254683
19168A06254683J227544Q97743M48252J83282N9651N467k17816l57466n19655
$$ 106254683 107482227 108379970 108828222 109011504 109071155 109076622 108858806 108501340 107981685
19159A07981685j069010j402338j249950j422992j509310j796152j794994j930254
$$ 107981685 106912675 105510337 104260387 102837395 101328085 99531933 97736939 95806685
19151I5806685k155745k046825j853110k041019k192383k168168k144541j998383
$$ 95806685 93650940 91604115 89751005 87709986 85517603 83349435 81204894 79206511
19143G9206511k093417j949527j912384j943962j882630j749325j666050j694919
$$ 79206511 77113094 75163567 73251183 71307221 69424591 67675266 66009216 64314297
19135F4314297j550395j697975j678768j793102j546695j451627j449377j194998
$$ 64314297 62763902 61065927 59387159 57594057 56047362 54595735 53146358 51951360
19127E1951360j127651j251649j293986j045170j071859j048965j102140r88956
$$ 51951360 50823709 49572060 48278074 47232904 46161045 45112080 44009940 43020984
19119D3020984q84432r30152p24007p29165q93176q24613p63374p37310o44862
$$ 43020984 42136552 41206400 40482393 39753228 38860052 38035439 37272065 36534755 35889893
19110C5889893p58470p10170p52816o71238p75948q81377o07404m53659o42813
$$ 35889893 35131423 34421253 33668437 32997199 32221251 31339874 30732470 30278811 29635998
19101B9635998p63160o22350o41400p30756o54737o43353l80466k81718l57035
$$ 29635998 28872838 28250488 27609088 26878332 26223595 25580242 25199776 24918058 24561023
19092B4561023l74132m53214n38832m48229m97754m52828n56653k62932m15689
$$ 24561023 24186891 23733677 23194845 22746616 22248862 21796034 21239381 20976449 20560760
19083B0560760m33775k37928k80261k53717l69827l90427l49693l04563m94493
$$ 20560760 20126985 19889057 19608796 19355079 18985252 18594825 18245132 17940569 17446076
19074A7446076l84286k88420q3040q0667j96158l10145k96754j08877p167j07602
$$ 17446076 17061790 16773370 16690330 16609663 16413505 16103360 15806606 15697729 15690562 15582960
19064A5582960l19244m04381l75485r0083j53616m32610k28991j81692r2874j47980
$$ 15582960 15263716 14859335 14483850 14393767 14240151 13807541 13578550 13396858 13303984 13156004
19054A3156004j76239p3732o2420k51912k22548q7826O4336J23510K4501K51427
$$ 13156004 12979765 12906033 12843613 12591701 12369153 12281327 12345663 12469173 12493674 12745101
19044A2745101K65757J76876N4351O293l7066k42149j78003j44784j36210J52014
$$ 12745101 13010858 13187734 13242085 13248378 13211312 12969163 12791160 12646376 12510166 12662180
19034A2662180r4612o26682o52172o17844k65053l05158k23565p2107o7145J07199
$$ 12662180 12567568 11940886 11288714 10670870 10405817 10100659 9877094 9804987 9737842 9845041
19024I845041j18321k86145k10257j28957k46255p3029j20485q1078N8514R8981
$$ 9845041 9726720 9440575 9230318 9101361 8855106 8782077 8661592 8580514 8639028 8738009
19014H738009k44571j43874M5501K1292m8632j94447j48503k2407p647K653q8468
$$ 8738009 8493438 8349564 8395065 8416357 8367725 8173278 8024775 8002368 7994721 7997374 7908906
19003G908906p4546j89625j48076m1324j34382k35962p9488j51784p7553K1302
$$ 7908906 7834360 7644735 7496659 7455335 7320953 7084991 7005503 6853719 6776166 6797468
18993F797468J35357P1455j2665r5339q4703k5510k55413j27759O2254L8475q1098
$$ 6797468 6932825 7004280 6991615 6896276 6811573 6786063 6530650 6402891 6465145 6503620 6422522
18982F422522j61602p2127J15208k03230J17704J03384n2681K10166J8231k2326
$$ 6422522 6260920 6188793 6304001 6100771 6218475 6321859 6269178 6479344 6497575 6475249
18972F475249j8836J2783j62048j81697o6103K23213J09656k69862j08884o3775
$$ 6475249 6456413 6469196 6307148 6125451 6059348 6282561 6392217 6122355 6013471 5949696
18962E949696R3446J33617N169r545l25726k57527l5976J19965P1465p3740n8849
$$ 5949696 6043142 6176759 6181928 6172383 5846657 5589130 5553154 5673119 5744584 5670844 5611995
18951E611995j26483j35280j48610j58834l49044m6870K51974N0491j44909J49587
$$ 5611995 5485512 5350232 5201622 5042788 4693744 4646874 4898848 4949339 4804430 4954017
18941D954017J59227j12628k2164q872J23560M26893L99539L71245O6267J25115
$$ 4954017 5113244 5000616 4978452 4969580 5093140 5520033 5919572 6290817 6357084 6482199
18931F482199M38857M06092K21133K90873L18696J76983J01490N2413R0240j20725
$$ 6482199 6921056 7327148 7548281 7839154 8157850 8334833 8436323 8488736 8578976 8458251
18921H458251l43449l43882l84803k79958l89374m24120m56963l20255l62454
$$ 8458251 8114802 7770920 7386117 7106159 6716785 6292665 5835702 5515447 5152993
18912E152993l67933j18472r1339k39009k44022l17203O6529j25779k06119j99931
$$ 5152993 4785060 4666588 4575249 4336240 4092218 3775015 3841544 3715765 3509646 3309715
18902C309715j05739M1235R7164J00014k8142j56860k76847j69101j66404r8734
$$ 3309715 3203976 3245211 3342375 3442389 3414247 3257387 2980540 2811439 2645035 2546301
18892B546301J08429q4257n9204m758J9216R050O8768R679n3946P5932k7749j24619
$$ 2546301 2654730 2570473 2511269 2506511 2525727 2534777 2603545 2613224 2559278 2635210 2607461 2482842
18880B482842j15793L7353l5388j0925J3058l7406l419j39515j30224n2359Q1807
$$ 2482842 2367049 2404402 2369014 2358089 2371147 2333741 2330322 2190807 2060583 2008224 2090031
18869B090031K22829j26876l1551q272J99642j32632j13043n1479k2873J1668
$$ 2090031 2312860 2185984 2154433 2146161 2345803 2213171 2100128 2048649 2025776 2037444
18859B037444j84054k21196J98513K04142q7366k61542j93293L3560J94746R3529
$$ 2037444 1853390 1632194 1830707 2034849 1947483 1685941 1492648 1526208 1720954 1814483
18849A814483q3239k1746j6789j09951N0597R7921p9174j76157j13720N354J07520
$$ 1814483 1731244 1709498 1692709 1582758 1633355 1731276 1652102 1475945 1362225 1367579 1475099
18838A475099J6350m2636p7092r8915o3451o9630r2559J58553J69159R3119J69579
$$ 1475099 1491449 1448813 1371721 1272806 1209355 1139725 1047166 1205719 1374878 1467997 1637576
18827A637576j06875q8700k28758L399M6330n2221K42683r4384l0781o6946J59335
$$ 1637576 1530701 1442001 1213243 1216642 1262972 1210751 1453434 1359050 1328269 1261323 1420658
18816A420658j8119k7094q0454k2302Q8294p3678j0642k0580j01743J26055K8068
$$ 1420658 1402539 1375445 1294991 1272689 1360983 1287305 1276663 1256083 1154340 1280395 1308463
18805A308463L3251R934l7228J19338K2819j2283L3263m8492m8549p7013n9065
$$ 1308463 1341714 1351648 1314420 1433758 1456577 1444294 1477557 1429065 1380516 1303503 1244438
18794A244438L621K39507p2333j00220r0605P7849J33140K0056j18286j39878
$$ 1244438 1248059 1487566 1415233 1315013 1224408 1302257 1435397 1455453 1337167 1197289
18784A197289p724L3873L9216p4542o0607K4565k23749m2746J36039J3791j00182
$$ 1197289 1189565 1223438 1262654 1188112 1127505 1152070 928321 885575 1021614 1035405 935223
18773I35223j66368M998N8134J13991K4582j58864K3032J93833J05550O3657j4109
$$ 935223 768855 773853 831987 945978 970560 811696 834728 1028561 1134111 1197768 1183659
18762A183659j09373R971j6300m0617j5406R8279J9228j25586j76604L328n3053
$$ 1183659 1074286 1084257 1067957 1027340 1011934 1110213 1129441 1003855 827251 830579 777526
18751G77526m2855J59989J8633n273j62844j01338k5763K30817O2698O92J47559
$$ 777526 734671 894660 913293 908020 745176 643838 618075 848892 911590 912282 1059841
18740A059841J76837J25595j1222Q4385Q1290j77241J15026J14491k3467o1301
$$ 1059841 1236678 1362273 1351051 1435436 1516726 1339485 1454511 1569002 1545535 1484234
18730A484234q7942Q7294O1401O737M6779m2068J1068J71508J6381k49552j82622
$$ 1484234 1396292 1483586 1544987 1551724 1598503 1556435 1567503 1739011 1755392 1505840 1323218
18719A323218k72379k47033M2186j61646l50J37819R3521J2420O7505K1103p4971
$$ 1323218 1050839 803806 845992 684346 683996 821815 915336 927756 995261 1016364 941393
18708I41393p1698J62574Q0271k4929J45029j4069j7180j5445o3198J45897J00889
$$ 941393 869695 1032269 1112540 1087611 1232640 1218571 1201391 1185946 1122748 1268645 1369534
18697A369534l7860P7735r1313j12074l2900m8754J10560R3632j07960j97923
$$ 1369534 1331674 1409409 1318096 1206022 1173122 1124368 1234928 1328560 1220600 1022677
18687A022677j6502J17149J91771n3415j4450L3296p3503j78168R591J11254L648
$$ 1022677 1006175 1123324 1315095 1261680 1247230 1280526 1207023 1028855 1038446 1149700 1153348
18676A153348p2634n347K4084L0325q473p0178j00174n0637J05765P2535L4308
$$ 1153348 1080714 1075367 1099451 1129776 1121303 1051125 950951 900314 1006079 1078614 1112922
18665A112922k9723J18483j8281q988O9152p4412J03396j03664r0516j06107K6163
$$ 1112922 1083199 1201682 1183401 1174413 1243565 1169153 1272549 1168885 1078369 972262 998425
18654I98425l284K47420K23901K15359K06634K17444L24236P8868J15976K1565
$$ 998425 995141 1242561 1466462 1681821 1888455 2105899 2430135 2509003 2624979 2646544
18644B646544K4926K8319j59897j79165r5150Q3488J10339k25504k72991m8225
$$ 2646544 2671470 2699789 2539892 2360727 2265577 2349065 2459404 2233900 1960909 1912684
18634A912684j96757m2210n6764j10150K279j80214j69293o2345L74j83409O8124
$$ 1912684 1715927 1673717 1616953 1506803 1509082 1328868 1159575 1097230 1097604 914195 982319
18623I82319o8276o1042K0898q4970r2058N3996k4136k1307l8097J3139j21714
$$ 982319 914043 853001 873899 788929 696871 750867 726731 705424 667327 680466 558752
18612E58752k07867J50715J76458l5250Q4750l5928m0792K7703k58805J00493
$$ 558752 350885 501600 678058 642808 727558 691630 650838 678541 419736 520229
18602E20229J94172j7147p4139K423L3899n00j20560n1093Q982o4709p40J7236
$$ 520229 714401 697254 623115 625538 659437 658937 538377 487284 496266 431557 430817 448053
18590D48053j05604j725J43939P1230j22493n8986m8293K0293L3276o6931R8377
$$ 448053 342449 340724 484663 555893 433400 374414 326121 346414 379690 312759 411136
18579D11136P7545k0787L14M8412j47541j39891M4007J01932P278J61072J66264
$$ 411136 488681 467894 468208 516620 369079 229188 273195 375127 382405 543477 709741
18568G09741r8389j50125n2797O1778j9340p2864k0531J75263J140j20309j84755
$$ 709741 611352 461227 408430 470208 450868 378004 357473 532736 533876 413567 228812
18557B28812r964N3131J29395K4706q2816k22318q5919M7424K03535n0358n8632
$$ 228812 218848 271979 401374 426080 343264 120946 35027 82451 285986 235628 176996
18546A76996J19902J72135L9500O4601K1530j77206J5112J47482n7004j8251j74547
$$ 176996 296898 469033 508533 573134 594664 417458 432570 580052 523048 504797 330250
18535C30250J02703J54442l5277r356J15945j09287M380m9468k9956p5119J50839
$$ 330250 432953 587395 552118 542762 658707 549420 553800 504332 474376 399257 550096
18524E50096J5840M1941L8107J21726m2129O5571Q3605j34389n1383j11329p5482
$$ 550096 565936 607877 645984 767710 725581 791152 874757 740368 688985 577656 502174
18513E02174Q9444J26898o8150p9860j1422R1048N7380o4742n1330p7473J93507
$$ 502174 591618 718516 650366 570506 559084 650132 707512 642770 591440 513967 707474
18502G07474J5300j20872k6176O9603R1271k1340N8681k5836n4576k7113m9169
$$ 707474 722774 601902 575726 645329 736600 715260 773941 748105 693529 666416 617247
18491F17247j80411k3667J6164M4878K0006K66312Q3090j80095k23320j71540
$$ 617247 436836 413169 429333 474211 494217 760529 843619 663524 440204 268664
18481B68664J6143J53764J23765P6266M254l7637r9397k30113q4667J53774J43157
$$ 268664 284807 438571 562336 638602 642856 605219 505822 275709 191042 344816 487973
18470D87973j15084o4973J36377n2786p6085J13986J5066j5628J04324j2081n5708
$$ 487973 372889 307916 444293 391507 315422 429408 444474 428846 533170 521089 465381
18459D65381R3691P5966o9768P9985m6274q3837n4578r336m173m068n0812J3453
$$ 465381 559072 635038 565270 645255 598981 515144 460566 451230 447057 442989 392177 405630
18447D05630j51613q2932n1487j17687j5769j61319j2959J17714N4926J36343
$$ 405630 254017 171085 119598 1911 -13858 -175177 -188136 -70422 -15496 120847
18437A20847M3044j83749n6762J93553J02851j79534j36630L7343J50981P9481
$$ 120847 163891 -19858 -76620 116933 219784 40250 -96380 -59037 91944 171425
18427A71425K8619j29424M2121O9460j3668O2428O7581P5144j7086j40371q714
$$ 171425 200044 70620 112741 182201 168533 230961 298542 373686 356600 216229 207515
18416B07515J45455p4004q1508l1038m3587J20726l0088P063p7915R536j6139
$$ 207515 352970 278966 197458 166420 122833 243559 213471 220534 142619 152155 136016
18405A36016m6449O9893M8229K173l30j50026k5075Q3084l2419P7700o3487k8750
$$ 136016 89567 159460 207689 209862 209532 59506 34431 117515 85096 162796 99309 70559
18393G0559o8903p2417K6740J67394n2191r1430n2102j44077R7674J72026Q8530
$$ 70559 1656 -70761 -44021 123373 71182 -20248 -72350 -216427 -118753 53273 141803
18382A41803j3806L8113j6362j85557N4606k1796p2717O2016K17333o162q4358
$$ 141803 127997 166110 149748 -35809 18797 -2999 -75716 -13700 203633 197471 113113
18371A13113O2251k2053j68978q9436M3849M1792o053J05598p6072N042L5118
$$ 113113 175364 153311 -15667 -105103 -61254 -19462 -25515 80083 4011 9053 44171
18360D4171r0037J3245J39029J44734j32413M86J20635j756j29690j24858K34973
$$ 44171 -45866 -32621 106408 251142 118729 119215 239850 238094 108404 -16454 218519
18349B18519M7839J8424j14449k77000O2490K14833J4197Q154j38923j07386J74585
$$ 218519 266358 284782 170333 -106667 -44177 170656 184853 193007 54084 -53302 121283
18338A21283J66409j6495m2141J33071q0861k96986Q043J37830L76k1446L3446
$$ 121283 287692 271197 229056 362127 281266 -15720 -7677 130153 130529 109083 142529
18327A42529j84555l1497l2654m6128J23599j07608n0984P3083P0939j50148O5579
$$ 142529 -42026 -73523 -106177 -152305 -28706 -136314 -187298 -114215 -43276 -193424 -127845
18316a27845J3291K9237J44520l2887j72420K17270O6724K1527J72831J7878K5665
$$ -127845 -114554 -85317 59203 26316 -146104 71166 137890 159417 332248 350126 375791
18305C75791m9836j45224k2284J00924r7863k43247j1063j5783N1483Q2110J12035
$$ 375791 325955 180731 158447 259371 161508 -81739 -92802 -108585 -57102 25008 137043
18294A37043L7824q8122o852k6512J09503P7816j48318K2626R2097n8622J7505
$$ 137043 174867 86745 79893 53381 162884 240700 92382 115008 207105 148483 165988
18283A65988J60661J88123j87914j95195R1982J52560J5645r9707P0194J1333
$$ 165988 326649 514772 326858 131663 223645 376205 391850 292143 362337 373670
18273C73670n6074l5492M7069K2366n5954M9198j70119j30651j65082P1765J58033
$$ 373670 317596 282104 329173 351539 295585 344783 174664 44013 -121069 -49304 108729
18262A08729J2062j75979J9223J03009J9784N8671R133O2720j00533N8884q3776
$$ 108729 120791 -55188 -35965 67044 86828 145499 154632 217352 116819 175703 91927
18251I1927J4857K6399j39829N3185m7350l5429j63354n2135J30835O4254J27780
$$ 91927 106784 133183 -6646 46539 -811 -36240 -199594 -251729 -120894 -56640 71140
18240G1140Q8588j05789J7210r3471m2748r08N5046P4330P0901O281J2578Q560
$$ 71140 159728 53939 71149 -22322 -65070 -65978 -10932 63398 134299 140580 153158 161718
18228A61718k2165M3972L9215N6585J6802j80764j55418J41074J53700j12303
$$ 161718 139553 183525 222740 279325 296127 115363 -40055 101019 254719 142416
18218A42416r817O2232M1021k1305o2879m8192k5350n3533J6591M4422M4907j41821
$$ 142416 132599 194831 235852 214547 151668 103476 78126 24593 41184 85606 130513 -11308
18206a1308k46848n4104L9099O7992J7752J78586J18941J5129k09319p1691N0213
$$ -11308 -258156 -312260 -273161 -205169 -187417 -8831 110110 125239 -84080 -155771 -105558
18195a05558K54664J61313O6451j98371k16067J1962J16489J63163j15065k55059
$$ -105558 149106 310419 376870 178499 -37568 -25606 90883 254046 138981 -116078
18185a16078n4001J76680j7855J7472J1150N7474R4649j51457L2105R6625M89
$$ -116078 -170079 6601 -11254 6218 17368 74842 169491 18034 50139 146764 147253
18174A47253O6859k03548o0461R3383J5719O6759p8166q7725P8898J49865M384
$$ 147253 214112 10564 -49897 43486 59205 125964 47798 -39927 38971 188836 193220
18163A93220K235j30101J6555l8213l2523J9134J76316J31682l5495M2342O4888
$$ 193220 195455 65354 81909 43696 11173 30307 206623 338305 302810 345152 410040
18152D10040r3347j41229n6327j1650n3530J40668J3175K3971n2579j82731n9018
$$ 410040 316693 175464 119137 107487 53957 194625 207800 231771 179192 -3539 -62557
18141f2557j65453J31115J00345J79707P2564L895j50812k7275O8878Q2931k09267
$$ -62557 -228010 -96895 3450 183157 255721 259616 108804 81529 150407 233338 24071
18130B4071j52200L5920J27496M3401k15734j53470J44760J76338j7985m5146
$$ 24071 -128129 -92209 35287 78688 -137046 -290516 -145756 30582 12597 -32549
18120c2549R8069J48718k5526k27747j9908K23568J52907j8552j05365p6243o5642
$$ -32549 65520 214238 188712 -39035 -58943 164625 317532 298980 193615 117372 51730
18109E1730P3973O903k24614k74088m8806K47739J56345M1241K7642N4930L8911
$$ 51730 125703 132606 -92008 -366096 -414902 -167163 -10818 30423 58065 112995 151906
18098A51906K8742O204J9757L6135q9636J08062m7944q1885j89385k0171J39989
$$ 151906 180648 186852 206609 242744 153108 261170 213226 131341 -58044 -78215 61774
18087F1774j799J07487k07004J09999J66324K6331j53162l9869Q9348L0973m9923
$$ 61774 59975 167462 -39542 70457 236781 263112 109950 70081 159429 190402 140479
18076A40479n5388J31300m6263j10597j036m4198L2473P0035J49252R8155M7350
$$ 140479 85091 216391 170128 59531 58495 14297 46770 116805 266057 364212 411562
18065D11562j90322j31753j1466j83123n1582K13768P1789o1422J69157R5297
$$ 411562 221240 89487 78021 -105102 -156684 57084 128873 67451 236608 331905
18055C31905K5418j43262P6666J2963p5370j33275N0346J1366J19906K29848q9734
$$ 331905 357323 214061 290727 303690 228320 95045 145391 156757 276663 506511 416777
18044D16777j65668m7329P0332m5508j10694n1054j7910L1400k7669o4036J603
$$ 416777 251109 203780 274112 228604 117910 66856 48946 80346 52677 -11359 -9756
18033i756m8762M1962K47143P5784j6884k29512M9258L99854J19120j80724p5931
$$ -9756 -58518 -16556 230587 306371 289487 59975 109233 509087 628207 447483 371552
18022C71552o2360j79215p6116J2661R4574j7890k56918r1016J92448J25073N185
$$ 371552 309192 129977 53861 66522 161096 143206 -113712 -204728 -12280 112793 117978
18011A17978n1206L1151n3557j45268O8257J74133p6624L8726N4336O1248K2768
$$ 117978 66772 97923 44366 -100902 -32645 141488 64864 103590 157926 219174 241942
18000B41942j64542l4652J6595J19847j31305N5313L4204j469o8404j54361N625
$$ 241942 77400 42748 59343 179190 47885 103198 137402 135933 67529 -86832 -81207
17989h1207M8595k00643j03651J37717J67163J24750J31463N4768j30366J8419
$$ -81207 -32612 -233255 -336906 -199189 -32026 92724 224187 278955 148589 167008
17979A67008O6797M5756O8483k8048m5938L1548R8068J03236M9123n6806l847
$$ 167008 233805 279561 348044 319996 274058 305606 403674 506910 556033 499227 495380
17968D95380L63807J99177L42J02141O810k7305m1982k1353R635r0273j34417
$$ 495380 859187 1058364 1058706 1160847 1167657 1140352 1098370 1077017 1086652 996379 861962
17957H61962j34970j05210N6747N9837P324k52602k47102L2777j3621j39072K5042
$$ 861962 726992 621782 678529 738366 745690 493088 245986 278763 265142 126070 151112
17946A51112N4314N9709l9777o202J25558J15007l720j90900o2250K9797K1339
$$ 151112 205426 265135 225358 219156 344714 459721 456001 265101 202851 232648 253987
17935B53987L787J50627K51240J69188q5573j55584j45409J5537Q5760o8527J25188
$$ 253987 257774 408401 659641 828829 743256 587672 442263 457800 543560 475033 600221
17924F00221q9177j75172j05075j7131l3676j11849K0746m2040N4578P3267K0842
$$ 600221 511044 335872 230797 213666 179990 68141 88887 46847 101425 174692 195534
17913A95534j4940j76053p525L2576o9107J8970K0772J47177R3990M8570j2759
$$ 195534 180594 4541 -2984 29592 -39515 -20545 227 147404 241394 289964 277205
17902B77205o0912N4283j64950j71752K7622J44975q6970j04417K34217O7405
$$ 277205 216293 270576 105626 -66126 -38504 106471 19501 -84916 149301 216706
17892B16706J11143q3102q2367k34625J80067J17517l1346l0849L860Q9123M3819
$$ 216706 327849 244747 162380 -72245 107822 225339 193993 163144 167004 256127 299946
17881B99946J44657j20866j48799k7054p9003M3230J15159K0573P523L2024n1200
$$ 299946 444603 323737 174938 147884 68881 112111 227270 247843 255366 287390 236190
17870B36190l4857o3823O7149J34033J15890j83423k29838K21771J40538k15050
$$ 236190 201333 137510 204659 338692 454582 271159 41321 263092 403630 188580
17860A88580P9035J31163o0036o1013k2938N5895J57544n379K2258R3266l6528
$$ 188580 267615 398778 338742 277729 254791 310686 468230 462851 485109 578375 541847
17849E41847N7719j5384J412j12040j14300L67337K81867J52282J5229N3958K12033
$$ 541847 599566 584182 585594 473554 359254 726591 1008458 1160740 1175969 1229927 1441960
17838A441960K89072J59137M40749O12013O45277R62999J313437J379328J444299
$$ 1441960 1731032 1890169 2330918 2942931 3588208 4551207 5864644 7243972 8688271
17829H688271J429311J319667J094123P02542J97629j64914j26496k47891k16583
$$ 8688271 10117582 11437249 12531372 13233914 13431543 13266629 13140133 12892242 12675659
17820A2675659n16423r97295j568955j656788j368050j009238j098352o80929
$$ 12675659 12159236 11161941 9592986 7936198 6568148 5558910 4460558 3779629
17812C779629l28273k92670k81686j88464k15162k84675l0154n0033j2253J81331
$$ 3779629 3451356 3158686 2877000 2688536 2473374 2188699 2158545 2108512 2096259 2277590
17802B277590m0758k14506m5059j5240j36741l07977j32550J0487k8009n2479
$$ 2277590 2236832 2022326 1977267 1962027 1825286 1517309 1384759 1395246 1367237 1314758
17792A314758k37479k27618J08301J9907k83750j700J38947O8989j15224o9911
$$ 1314758 1077279 849661 957962 977869 694119 692419 831366 900355 785131 715220
17782G15220M4545L9012J43290k6146j57457k7839P2321J1675j86692J5121J22496
$$ 715220 759765 798777 942067 915921 758464 730625 802946 814621 627929 643050 765546
17771G65546N3165o4925j07421j23669J4961k1491L3175J63322j641k2051P6021
$$ 765546 818711 753786 646365 522696 537657 516166 549341 712663 711022 688971 764992
17760G64992J46455P2994j51249J07210L43816N2481m1813J09324J99235J79057
$$ 764992 911447 984441 833192 940402 1284218 1336699 1294886 1404210 1603445 1782502
17750A782502J14248j281M2086j4436n3983J55985l6969q0494j32609m7978n2339
$$ 1782502 1896750 1895469 1937555 1923119 1869136 2025121 1988152 1907658 1775049 1727071 1674732
17739A674732j70439j65414j36383j42909k21554j61480O5856n0393r8818k0584
$$ 1674732 1504293 1338879 1202496 1059587 838033 676553 742409 692016 593198 572614
17729E72614j63426j42203K19180J73347m2821r6213k09302j36370J38261K89909
$$ 572614 409188 266985 486165 659512 616691 520478 311176 174806 313067 602976
17719F02976k2063j21208p8455N1138N5805Q6874R6881k0796j6100M9805K7120
$$ 602976 580913 459705 381250 432388 488193 575067 671948 651152 635052 684857 711977
17708G11977n6350K10406j8965k22736j11393j60687r8737l2429k2961J1735j3699
$$ 711977 655627 866033 847068 624332 512939 352252 253515 221086 198125 209860 196161
17697A96161q217q0105K1570O0147P4274J6627m3690M5374j48092J14026r3192
$$ 196161 187944 107839 129409 189556 263830 280457 236767 282141 134049 248075 154883
17686A54883j07352L9943m8954K1954n1119j73993K5277K5645P130J69837J38186
$$ 154883 47531 87474 38520 60474 9355 -164638 -139361 -113716 -106586 63251 201437
17675B01437k0219K3745k273o8415l7801j61510K2575Q5581J18413Q1967J3007
$$ 201437 181218 204963 202690 134275 96474 -65036 -42461 43120 161533 243500 256507
17664B56507j06500n513r7534j76662j3144K4891J53959P2327J37679J9735p1596
$$ 256507 150007 144494 46960 -129702 -142846 -117955 36004 108331 246010 265745 194149
17653A94149M6550P5468n8521l9211M053j04195j83738j34294l3293o4708K30388
$$ 194149 240699 316167 257646 218435 222488 118293 -65445 -199739 -233032 -297740 -67352
17642f7352O0417j41101m0915Q360O1848J32579J42600M5543J3151J50868L9115
$$ -67352 -6935 -148036 -188951 -180591 -118743 13836 156436 201979 215130 365998 405113
17631D05113J0003k2925j6494q8919j18841j7043m9079o5097J34613K5966q7159
$$ 405113 415116 392191 375697 286778 167937 150894 101815 36718 171331 197297 110138
17620A10138L3732k4162k6529k5008p4998J0937N4778K3085K01948L1726N4654
$$ 110138 143870 119708 93179 68171 -6827 4110 58888 81973 283921 315647 370301
17609C70301J41237k33219j94354J19679N0045K8392m9438m0664m1563R2495j97566
$$ 370301 511538 278319 83965 203644 253689 282081 232643 191979 150416 242911 45345
17598D5345j12270J07322J65265r9257j1450P0451J08620J67891L5312j54354
$$ 45345 -66925 40397 205662 106405 94955 165406 274026 441917 477229 322875
17588C22875r4457l8111m6663j60402j90193P9256K16580O7575J95794j6430Q9938
$$ 322875 228418 190307 143644 -16758 -206951 -127695 88885 156460 352254 335824 425762
17577D25762o389j80079k49483m029p0653J35530q7431o7920n5447M7702j3649
$$ 425762 419373 239294 -10189 -14218 -84871 50659 -36772 -104692 -160139 -112437 -126086
17566a26086L3915M0985j03216J15808n9478j00564O8311L0297Q5487J3718J8327
$$ -126086 -92171 -51186 -154402 -38594 -98072 -198636 -130325 -100028 -14541 -823 17504
17555A7504J25938O2746j40421J2649N3356J12500j04910P9228k8030K4070l7491
$$ 17504 143442 206188 65767 78416 131772 244272 139362 218590 190560 214630 177139
17544A77139o4642M1245K8714r2808m2292R834j19097m0391M5938m0083j62455
$$ 177139 112497 153742 182456 89648 47356 57190 -61907 -102298 -56360 -96443 -258898
17533b58898m2414R3423O3010j3608n7971K4604K18862Q7108n0777o2725J702
$$ -258898 -301312 -207889 -144879 -158487 -216458 -191854 27008 114116 63339 614 2316
17522B316K00730J43066L8970k16840l62630L018J41019J82573J0373j02356l3289
$$ 2316 203046 346112 385082 168242 -194388 -191370 -50351 132222 142595 40239 6950
17511F950j06337K8344Q5123n7854j71287K7807L1117J3415L7571o348r6057P6634
$$ 6950 -99387 -71043 14080 -43774 -215061 -187254 -156137 -142722 -105151 -111499 -207556 -130922
17499a30922J78468p1249K5424k6124J04905M6470J12344N1227r4928q7439J25030
$$ -130922 47546 -23703 1721 -24403 80502 126972 239316 290543 195615 108176 233206
17488B33206o2283k06755Q7576p871n4332m1576j66333J46501J12879l0512j334
$$ 233206 170923 -35832 51744 43873 -10459 -52035 -218368 -71867 41012 10500 9166
17477I166M6551J3253J04247o3086j28553l5999l3291j11512o5192J67417J74096
$$ 9166 55717 68970 173217 110131 -18422 -54421 -87712 -199224 -264416 -96999 77097
17466G7097j08036m7394L1505k3025j88227j4986M7674J25725n1014L814K54094
$$ 77097 -30939 -78333 -46828 -69853 -258080 -273066 -225392 -99667 -150681 -146867 107227
17455A07227J9024k0343j13066j95505l6698J21354j5110n4071N508j40104m2663
$$ 107227 126251 105908 -7158 -202663 -239361 -118007 -133117 -187188 -181680 -321784 -364447
17444c64447J02350J65454J00539m9512j509J1444k4574l8921K04993j201N304
$$ -364447 -262097 -96643 3896 -45616 -47125 -35681 -60255 -99176 105817 104616 109920
17433A09920K2321R8790j37562j1685Q274q5113m981j9498j11228O2823n305j17244
$$ 109920 132241 231031 93469 81784 90058 4945 -36 -19534 -130762 -67939 -73244 -190488
17421a90488P4784M9082M7204R1639j02223l5270L2765K6361k16474j5969J44183
$$ -190488 -115704 -66622 -19418 72221 -30002 -65272 -32507 -6146 -222620 -238589 -94406
17410i4406J70953m1900j30225p8622m817P5610M0361J38226j51500q6494N0005
$$ -94406 76547 34647 -95578 -174200 -179017 -103407 -63046 75180 -76320 -162814 -112809
17399a12809K7409p0547L0467R3764L1990J25569l5492K8057m6554k74630n6585
$$ -112809 -85400 -155947 -125480 -31716 274 125843 90351 118408 71854 -202776 -259361
17388b59361P1456r4408j35803j928O7876R9250J03325Q7522l2108O5975L4193
$$ -259361 -187905 -282313 -418116 -420044 -352168 -252918 -149593 -62071 -94179 -28204 5989
17377E989j15861j50709J67330O5368m8871j13693J20720q596k76002P9249J30903
$$ 5989 -109872 -260581 -93251 -27883 -76754 -190447 -69727 -78323 -354325 -275076 -144173
17366a44173o9637j19048Q6028J07716o1839Q442R1568P4144P6447j28270n8915
$$ -144173 -213810 -332858 -246830 -139114 -200953 -192511 -100943 -26799 49648 -78622 -137537
17355a37537l3142K12818J72461J87224J2207k31346k21216j39551l4044J36475
$$ -137537 -170679 42139 214600 401824 414031 182685 -38531 -178082 -212126 -75651
17345g5651K25152l1749j94927j2010J81705J0639k01649q229J23813m2842j49202
$$ -75651 149501 117752 -77175 -89185 92520 103159 -98490 -106719 17094 -25748 -174950
17334a74950r4958R7157q7436o4772J08138K09496j40883j24477J68668R8478
$$ -174950 -269908 -172751 -260187 -324959 -216821 -7325 -148208 -272685 -104017 -5539
17324e539J13767k5728j24373M2883J40999j0180O4921P6421L7362k22577j08149
$$ -5539 108228 82500 -41873 1010 142009 131829 196750 273171 310533 87956 -20193
17313b0193N8437j88884J2260P0777M2314j8112n2040K5563O7411J71068j11962
$$ -20193 38244 -150640 -138380 -67603 -25289 -43401 -95441 -69878 -2467 168601 56639
17302E6639k36091l4725J578k0125J3899L8713R6673J43732N9803k35761J39089
$$ 56639 -179452 -214177 -212599 -232724 -218825 -180112 -83439 60293 120096 -115665 23424
17291B3424P9161J9245K1584P3777p8035l02020j59919Q5941J82759K0388M6715
$$ 23424 102585 121830 143414 217191 139156 -162864 -322783 -236842 -54083 -33695 13020
17280A3020r5783O8733N5689m4831J10210l5326j02484j63442r8380Q1088J2507
$$ 13020 -82763 -14030 41659 -3172 107038 71712 -30772 -194214 -292594 -211506 -198999
17269a98999j30812n083K26005J65487K10860M3778m2802k01103J5022N1949j17172
$$ -198999 -329811 -334894 -108889 56598 267458 311236 268434 67331 82353 134302 17130
17258A7130k3540J16033n4613k7052N9402K15412J7025j46353k07763j7998N3329
$$ 17130 -6410 109623 55010 27958 87360 302772 319797 173444 -34319 -52317 1012
17247A012r2158k21725N7254M6029J34215J76277k870q0922J5612o0427J00555
$$ 1012 -91146 -312871 -255617 -209588 -75373 100904 98034 17112 32724 -27703 72852
17236G2852j11479p2938K55485P0410j02313l4648L674J990p0246j28166j3102
$$ 72852 -38627 -111565 143920 214330 112017 77369 81043 83033 12787 -115379 -128481
17225a28481j28101j07037p0398K0828K74636J41819P7518q672j01691n8209P6848
$$ -128481 -256582 -363619 -434017 -413189 -138553 3266 80784 72112 -29579 -87788 -10940
17214a0940l8623j8492K12653r6998j91235j47949M2643P8211J45576n8990O3461
$$ -10940 -49563 -68055 144598 47600 -143635 -291584 -248941 -170730 -25154 -84144 -20683
17203b0683K9173j87993j77527k3776J91241j831k2586m1256m0262O9828K33383
$$ -20683 8490 -179503 -357030 -380806 -189565 -191396 -213982 -255238 -295500 -225672 7711
17192G711J66017L3009j23669k05211r448o00J1347K4197K62752K3033l2309M8210
$$ 7711 173728 206737 83068 -122143 -131591 -132191 -120844 -96647 166105 189138 156829 205039
17180B05039j8427q2337r2854n9339J97474J70070k06420r7133J09778k0276K2471
$$ 205039 186612 104275 11421 -47918 149556 319626 113206 16073 125851 105575 128046
17169A28046j88558j28003J74384Q6773p6918o6211J6764M3769o26m8861J53244
$$ 128046 -60512 -188515 -14131 72642 -4276 -70487 -53723 -9954 -10580 -59441 93803
17158I3803q3197m7832O4384k13579m1685J94394q5561K261K05299K11028j08880
$$ 93803 10606 -37226 27158 -186421 -228106 -33712 -119273 -117012 88287 299315 190435
17147A90435m8037J4323j06444m3598k8337l5336K4319K8594n655J289o2440O7991
$$ 190435 142398 156721 50277 6679 -21658 -56994 -32675 -4081 -9736 -8447 -70887 -2896
17135b896J0R2206j7685r2331K8929j14309j00281k9700O9077j2683P4377q947
$$ -2896 -2886 89320 71635 -20696 8233 -106076 -206357 -236057 -166980 -179663 -105286 -114233
17123a14233j52050n0041J43769J17539J58391j09838n4895L0669j28705L1214
$$ -114233 -266283 -316324 -172555 -55016 103375 -6463 -61358 -30689 -159394 -128180
17113a28180J28822n0872k71995M6356O2989L9773N8129R222P3739J63904j13660
$$ -128180 642 -50230 -322225 -275869 -212880 -173107 -114978 -105756 -32017 131887 18227
17102A8227k02831k8062R9724r251K9764J3396j01235j67834K5300K84897J40443
$$ 18227 -184604 -212666 -112942 -122193 -92429 -79033 -180268 -348102 -322802 -37905 102538
17091A02538j50710l8781M4550j24843j57009o7864J92868J9900j68240J3021
$$ 102538 -48172 -86953 -42403 -167246 -324255 -392119 -199251 -179351 -347591 -334570
17081c34570J56665N2846K6326J07721j29996l1330J7488L578K0822Q9668K7138
$$ -334570 -177905 -125059 -98733 8988 -121008 -152338 -134850 -131272 -110450 -20782 6356
17070F356p6674r694l1764L3407n5709j63034l7462J86264J36075J11545o6922
$$ 6356 -70318 -80012 -111776 -78369 -134078 -297112 -334574 -148310 -12235 99310 32388
17059C2388Q8513k1846m2036j56901Q6474J95240N6642m3830k27431j09333J1789
$$ 32388 120901 99055 57019 -99882 -13408 181832 238474 194644 -32787 -142120 -130331
17048a30331M8828j4956J44756R446J01202o3771r6091j02697l118J35871O4778
$$ -130331 -81503 -96459 48297 57743 158945 95174 -917 -103614 -106732 29139 93917
17037I3917Q5413m6668n6498M3835p697o7548j29071r4589J32260J20896p2486
$$ 93917 179330 132662 76164 119999 112302 44754 -84317 -178906 -46646 74250 1764
17026A764L7835J00254P1995N949J4356L4164q1481j42416p1707p1180J1142q6844
$$ 1764 39599 139853 211848 217797 232153 266317 184836 42420 -29287 -100467 -89325 -176169
17014a76169r749O7831J87249k52183j09264K00592J69727L2917r7207K268r9276
$$ -176169 -185918 -118087 69162 -183021 -292285 -91693 78034 110951 13744 16012 -83264
17003h3264J65163o1301K0559l022R6071k1655r6068k4726m4537m5105J04703
$$ -83264 81899 20598 41157 38135 134206 112551 16483 -8243 -52780 -97885 6818
16992F818K6982j72651j12968J26685L9547M9865N2946r8845p8482O6312Q9055
$$ 6818 33800 -138851 -251819 -125134 -85587 -35722 17224 -81621 -160103 -93791 -4736
$$ [...]
##END NTUPLES=NMR SPECTRUM
##END=
