##TITLE=Analysis number 320261
Compound Code cc 18706
Book Reference 464/40/1
Project Code adrs
Chemist Name chrisr
##JCAMPDX= 6.0         $$ Bruker NMR JCAMP-DX V2.0
##DATA TYPE= NMR SPECTRUM
##DATA CLASS= NTUPLES
##ORIGIN= Bruker BioSpin GmbH
##OWNER= nmr
$$ XWIN-NMR		Version 3.5
$$ Tue Jun 20 09:01:35 2006 GMT Daylight Time (UT+1h)  MAYBRIDGE\nmr@NMR_250MHZ
##.OBSERVE FREQUENCY= 250.131544655141
##.OBSERVE NUCLEUS= ^1H
##.ACQUISITION MODE= SIMULTANEOUS (DQD)
##.ACQUISITION SCHEME= undefined
##.AVERAGES= 16
##.DIGITISER RES= 18
##SPECTROMETER/DATA SYSTEM= dpx250
##.PULSE SEQUENCE= zg30
##.SOLVENT NAME= CDCl3
##.SHIFT REFERENCE= (INTERNAL, CDCl3, 0, 16.522)
##AUDIT TRAIL= $$ (NUMBER, WHEN, WHO, WHERE, WHAT)
$$ ##TITLE= Audit trail, XWIN-NMR		Version 3.5
$$ ##JCAMPDX= 5.01
$$ ##ORIGIN= Bruker BioSpin GmbH
$$ ##OWNER= nmr
$$ C:\u/data/dgb/nmr/ADRS/1050/pdata/1/auditp.txt
$$ ##AUDIT TRAIL=  $$ (NUMBER, WHEN, WHO, WHERE, WHAT)
(   1,<2006-06-20 09:01:14.73 +100>,<MAYBRIDGE\nmr>,<NMR_250MHZ>,
      <created by zg, POWCHK disabled, PULCHK disabled
       configuration hash MD5:
       E2 DF 36 D8 04 B2 41 60 5A D7 A3 38 5A 4B D0 FE
       data hash MD5: 64K
       E7 FE DC 61 2B 15 8D EA D4 4E 36 2C 8E 9E 58 40>)
(   2,<2006-06-20 09:01:26.50 +100>,<MAYBRIDGE\nmr>,<NMR_250MHZ>,
      <Start of raw data processing
       ef LB = 0.3 FT_mod = 6 PKNL = 1 SI = 32K 
       data hash MD5: 32K
       18 45 E1 BB 88 7C EC E9 F1 AD 1C DB E2 87 BA 75>)
(   3,<2006-06-20 09:01:28.12 +100>,<MAYBRIDGE\nmr>,<NMR_250MHZ>,
      <apk 
       data hash MD5: 32K
       0F 1A 75 33 71 89 27 98 19 F6 02 42 7C 68 A7 E6>)
(   4,<2006-06-20 09:01:28.95 +100>,<MAYBRIDGE\nmr>,<NMR_250MHZ>,
      <abs ABSG = 5 
       data hash MD5: 32K
       1A 7A E1 A2 3C A3 F7 41 43 60 F8 C1 F5 02 BA 56>)
$$ ##END=
$$ 
$$ hash MD5
$$ DA AE 82 73 E2 68 DC A3 DB 4B DC FA FB 7B 7C 7B
##$RELAX= 
##$RELAX= 
##$RELAX= 
##$RELAX= 
##$RELAX= 
##$RELAX= 
##$RELAX= 
$$ Bruker specific parameters
$$ --------------------------
##$DU= <C:\u>
##$EXPNO= 1050
##$NAME= <ADRS>
##$PROCNO= 1
##$TYPE= <nmr>
##$USER= <dgb>
##$AMP= (0..31)
100 100 100 100 100 100 100 100 100 100 100 100 100 100 100 100 100 100 
100 100 100 100 100 100 100 100 100 100 100 100 100 100 
##$AQSEQ= 0
##$AQ_mod= 3
##$AUNM= <au_zg>
##$AUTOPOS= <2 >
##$BF1= 250.13
##$BF2= 250.13
##$BF3= 250.13
##$BF4= 250.13
##$BF5= 500.13
##$BF6= 500.13
##$BF7= 500.13
##$BF8= 500.13
##$BYTORDA= 1
##$CFDGTYP= 0
##$CFRGTYP= 5
##$CHEMSTR= <none>
##$CNST= (0..31)
1 1 145 1 1 1 1 1 1 1 1 1 1 1 1 1 1 1 1 1 1 1 1 1 1 1 1 1 1 1 1 1 
##$CPDPRG= <>
##$CPDPRG1= <>
##$CPDPRG2= <>
##$CPDPRG3= <>
##$CPDPRG4= <mlev>
##$CPDPRG5= <mlev>
##$CPDPRG6= <mlev>
##$CPDPRG7= <mlev>
##$CPDPRG8= <mlev>
##$CPDPRGB= <>
##$CPDPRGT= <>
##$D= (0..31)
0 1 0 0 0 0 0 0 0 0.06 0 0 0 0 0 0 0.0002 0 0 0 0 0 0 0 0 0 0 0 0 0 0 
0 
##$DATE= 1150790474
##$DBL= (0..7)
120 120 120 120 120 120 120 120 
##$DBP= (0..7)
150 150 150 150 150 150 150 150 
##$DBP07= 0
##$DBPNAM0= <>
##$DBPNAM1= <>
$$ [...]
##$SUBNAM7= <"">
##$SUBNAM8= <"">
##$SUBNAM9= <"">
##$SW= 20.6930455092707
##$SWIBOX= (0..15)
0 0 3 0 0 0 0 0 0 0 0 0 0 0 0 0 
##$SW_h= 5175.983436853
##$TD= 65536
##$TD0= 1
##$TE= 294.16
##$TE2= 300
##$TE3= 300
##$TEG= 300
##$TL= (0..7)
0 120 120 120 120 120 120 120 
##$TP= (0..7)
150 150 150 150 150 150 150 150 
##$TP07= 0
##$TPNAME0= <>
##$TPNAME1= <>
##$TPNAME2= <>
##$TPNAME3= <>
##$TPNAME4= <>
##$TPNAME5= <>
##$TPNAME6= <>
##$TPNAME7= <>
##$TPOAL= (0..7)
0.5 0.5 0.5 0.5 0.5 0.5 0.5 0.5 
##$TPOFFS= (0..7)
0 0 0 0 0 0 0 0 
##$TUNHIN= 0
##$TUNHOUT= 0
##$TUNXOUT= 0
##$USERA1= <user>
##$USERA2= <user>
##$USERA3= <user>
##$USERA4= <user>
##$USERA5= <user>
##$V9= 5
##$VALIST= <valist>
##$VCLIST= <CCCCCCCCCCCCCCC>
##$VD= 0
##$VDLIST= <DDDDDDDDDDDDDDD>
##$VPLIST= <PPPPPPPPPPPPPPP>
##$VTLIST= <TTTTTTTTTTTTTTT>
##$WBST= 1024
##$WBSW= 4
##$XGAIN= (0..3)
0 0 0 0 
##$XL= 0
##$YL= 0
##$YMAX_a= 442828
##$YMIN_a= -734076
##$ZGOPTNS= <>
##$ZL1= 120
##$ZL2= 120
##$ZL3= 120
##$ZL4= 120
##$ABSF1= 16.522
##$ABSF2= -4.171173
##$ABSG= 5
##$ABSL= 3
##$ALPHA= 0
##$AQORDER= 0
##$ASSFAC= 0
##$ASSFACI= 0
##$ASSFACX= 0
##$ASSWID= 0
##$AUNMP= <proc_1d>
##$AZFE= 0.1
##$AZFW= 0.1
##$BCFW= 0
##$BC_mod= 0
##$BYTORDP= 0
##$COROFFS= 0
##$CY= 12.5
##$DATMOD= 1
##$DC= 0
##$DFILT= <>
##$DTYPP= 0
##$F1P= 14.0000005364418
##$F2P= -0.99999901652339
##$FCOR= 0.5
##$FTSIZE= 32768
##$FT_mod= 6
##$GAMMA= 0
##$GB= 0
##$INTBC= 1
##$INTSCL= 1
##$ISEN= 128
##$LB= 0.3
##$LEV0= 0
##$LPBIN= 0
##$MAXI= 10000
##$MC2= 0
##$MEAN= 0
##$ME_mod= 0
##$MI= 0
##$NCOEF= 0
##$NC_proc= -3
##$NLEV= 6
##$NOISF1= 0
##$NOISF2= 0
##$NSP= 0
##$NTH_PI= 0
##$NZP= 0
##$OFFSET= 16.522
##$PC= 1
##$PHC0= 170.9859
##$PHC1= 5.210055
##$PH_mod= 1
##$PKNL= yes
##$PPARMOD= 0
##$PSCAL= 4
##$PSIGN= 0
##$REVERSE= no
##$SF= 250.13
##$SI= 32768
##$SIGF1= 0
##$SIGF2= 0
##$SINO= 400
##$SIOLD= 32768
##$SREGLST= <1H.CDCl3>
##$SSB= 0
##$STSI= 32768
##$STSR= 0
##$SW_p= 5175.98343685301
##$SYMM= 0
##$S_DEV= 0
##$TDeff= 65536
##$TDoff= 0
##$TI= <Analysis number 999999
Compound Code 99
Book Reference 9
Project Code 9>
##$TILT= no
##$TM1= 0
##$TM2= 0
##$TOPLEV= 0
##$USERP1= <user>
##$USERP2= <user>
##$USERP3= <user>
##$USERP4= <user>
##$USERP5= <user>
##$WDW= 1
##$XDIM= 32768
##$YMAX_p= 326925242
##$YMIN_p= -68096
$$ End of Bruker specific parameters
$$ ---------------------------------
##NTUPLES= NMR SPECTRUM
##VAR_NAME=  FREQUENCY,     SPECTRUM/REAL,   SPECTRUM/IMAG
##SYMBOL=    X,             R,               I
##VAR_TYPE=  INDEPENDENT,   DEPENDENT,       DEPENDENT
##VAR_FORM=  AFFN,          ASDF,            ASDF
##VAR_DIM=   32768,         32768,           32768
##UNITS=     HZ,            ARBITRARY UNITS, ARBITRARY UNITS
##FACTOR=    0.157963299565203, 1,           1
##FIRST=     4132.6476996994, 0,             0
##LAST=      -1043.33573715361, 0,           0
##MIN=       -1043.33573715361, -68096,      0
##MAX=       4132.6476996994, 326925242,     0
$$ Real data points
##PAGE= N=1
##DATA TABLE= (X++(R..R)), XYDATA
$$ [...]
$$ plain form
16447 29407 36077 39539 39187 19926 16966 8152 20654 23467 20355 21013 16491 21645 15260 2484
16433 2484 787 3475 8775 8296 12219 28629 40372 31426 13953 11396 9124 3392 -3716 5279
16419 5279 31208 26613 17963 11533 15321 17346 3643 9511 7562 7115 7685 21058 24131 15515
16405 15515 3405 266 11876 17662 20705 19643 11104 7752 -6926 -19751 -8581 5658 7136
16392 7136 6308 9785 9190 -1659 -1391 -8380 -14521 -6027 741 13672 14661 15014 8786 -8971 -12224
16377 -12224 -20416 -13404 4979 20046 13010 5334 -16 -4647 -4053 -3612 4103 10824 7592 10234
16363 10234 12497 10499 17508 19979 3977 10957 16109 22389 26379 18811 16287 2572 8847 12171
16349 12171 7024 4784 12483 5512 6250 13391 17998 18029 13372 14673 19201 25153 34407 38902 35937
$$ packed form
16447B9407O670L462l52j9261k960q814J2502K813l112O58m522N154o385j2776
16433B484j697K688N300m79L923J6410J1743q946j7473k557k272n732p108Q995
16419E279K5929m595q650o430L788K025j3703N868j949m47N70J3373L073q616
16405A5515j2110l139J1610N786L043j062q539l352j4678j2825J1170J4239J478
16392G136q28L477n95j0849K68o989o141Q494O768J2931R89L53o228j7757l253
16377a2224q192P012J8383J5067p036p676n350m631N94M41P715O721l232K642
16363A0234K263j998P009K471j6002O980N152O280L990p568k524j3715O275L324
16349A2171n147k240P699o971P38P141M607L1m657J301M528N952R254M495k965
$$ plain form
16334 35937 26642 26060 14107 -7207 8080 22039 25095 38865 43453 32363 25098 15418 15962
16321 15962 15964 8108 14080 11352 11534 4687 4030 -3728 -4008 -5253 -6757 -10488 -255 2872 -5980 -9446
16305 -9446 -3632 -7104 -17121 -10186 -19031 -21238 -778 10461 -1011 513 -89 701 4788 989
16291 989 -3219 -4127 2508 -6359 -17058 -9011 -1382 -1134 9843 12745 16336 15422 21432 11291 -6940
16276 -6940 -17115 -12461 -5644 -7754 -5501 4 2873 13023 8641 15137 5352 -455 4922 1488
16262 1488 -1536 -5766 -7816 -1642 1360 -4805 -5942 -8699 -10868 -11180 -14236 -5415 4778 12432 12222
16247 12222 18577 18290 6964 -51 -5650 -13632 -9711 188 8106 24473 23274 20126 10176 -2193
16233 -2193 -410 -12048 6235 18463 2402 -7437 2398 18144 18167 2444 -21972 -17843 -645
$$ packed form
16334C5937r295n82j1953k1314J5287J3959L056J3770M588j1090p265r680N44
16321A5962Kp856N972k728J82o847o57p758k80j245j504l731J0233L127q852l466
16305i446N814l472j0017O935q845k207K0460J1239j1472J524o02P90M087l799
16291I89m208r08O635q867j0699Q047P629K48J0977K902L591r14O010j0141j8231
16276f940j0175M654O817k110K253N505K869J0150m382O496r785n807N377l434
16262A488l024m230k050O174L002o165j137k757k169l12l056Q821J0193P654k10
16247A2222O355k87j1326p015n599p982L921R899P918J6367j199l148r950j2369
16233b193J783j1638J8283J2228j6061r839R835J5746K3j5723k4416M129J7198
$$ plain form
16220 -645 3218 -372 19055 26166 16454 17165 3860 -1602 11939 13482 18663 20356 22316 9751
16206 9751 -6488 -15591 -10217 -11496 -18107 -26552 -13408 -7685 -28917 -31437 -16493 1461 20675
16193 20675 22640 12442 11436 13446 25763 36861 38551 23284 25322 5399 -3647 4359 17175
16180 17175 21631 14575 10164 9514 10249 8965 10401 5925 11278 19425 15423 11811 6935 -447 -9805
16165 -9805 4084 14169 11918 20339 8227 6083 12711 16953 11111 7719 579 -5408 -3735 8417
16151 8417 10679 14337 14360 -6588 -25818 -27520 -15127 -6406 -6764 -149 -5619 -10718 -8522 -927 -5241
16136 -5241 -1833 4720 9958 16752 14168 2240 -4459 8412 17881 16929 15120 18146 -1853 -8152
16122 -8152 -13136 1735 6731 3317 11392 17677 18161 15232 17533 17330 22760 34240 33261 28723 27923
$$ packed form
16220f45L863l590J9427P111r712P11j3305n462J3541J543N181J693J960j2565
16206I751j6239r103N374j279o611q445J3144N723k1232k520J4944J7954J9214
16193B0675J965j0198j006K010J2317J1098J690j5267K038j9923r046Q006J2816
16180A7175M456p056m411o50P35j284J436m476N353Q147m002l612m876p382r358
16165i805J3889J0085k251Q421j2112k144O628M242n842l392p140n987J673J2152
16151H417K262L658K3k0948j9230j702J2393Q721l58O615n470n099K196P595m314
16136e241L408O553N238O794k584j1928o699J2871R469r52j809L026j9999o299
16122h152m984J4871M996l414Q075O285M84k929K301k03N430J1480r79m538q00
$$ plain form
16107 27923 14596 6737 7546 3565 -3369 -2310 -6343 -6016 2949 9337 13852 15509 825 -10872
16093 -10872 -15886 -5697 -1725 -508 10297 -5663 -10313 -5124 -8117 8268 26748 34214 19010
16080 19010 -3717 -4397 5275 11711 17047 14070 2503 -3511 3319 -4697 -16086 -8425 -5048 -17955
16066 -17955 -4921 2325 5381 16269 24938 21038 3629 -845 4337 17138 26064 10924 4730
16053 4730 13408 37779 21786 8751 6506 3014 -12325 -4748 -5759 -5592 -5982 -12280 -14079 -11297
16039 -11297 -13427 -27551 -23725 2005 3468 612 -3293 5789 31510 30621 19353 19452 24201 10303
16025 10303 297 2554 11492 4984 -8198 -21279 -19020 -22163 -20260 -13720 -1032 -13072 -15739
16012 -15739 -13408 -2427 -16141 -27573 -20382 -23284 -15219 -9649 -9764 -16699 -33151 -25627 -9506
$$ packed form
16107B7923j3327p859Q09l981o934J059m033L27Q965O388M515J657j4684j1697
16093a0872n014J0189L972J217J0805j5960m650N189k993J6385J8480P466j5204
16080A9010k2727o80R672O436N336k977j1567o014O830q016j1389P661L377j2907
16066a7955J3034P246L056J0888Q669l900j7409m474N182J2801Q926j5140o194
16053D730Q678K4371j5993j3035k245l492j5339P577j011J67l90o298j799K782
16039a1297k130j4124L826K5730J463k856l905R082K5721q89j1268R9M749j3898
16025A0303j0006K257Q938o508j3182j3081K259l143J903O540J2688j2040k667
16012a5739K331J0981j3714j1432P191k902Q065N570j15o935j6452P524J6121
$$ plain form
15999 -9506 11227 11987 2259 7081 17179 16804 6059 14070 18387 14848 8384 16605 30496 35418
15985 35418 18595 29286 47018 37425 20235 1457 -3020 -6095 -6795 -7703 -9835 -3928 -2386 -14108
15971 -14108 -9036 6065 14692 3559 3760 -1552 -8333 5662 17377 10677 -6874 -6393 -4776 2627
15957 2627 18134 20624 15697 15206 13186 4770 8157 16470 19462 18800 17945 1018 -9272 -19390
15943 -19390 -7137 -218 3219 5499 9640 13215 16014 1050 -10513 -11514 -14417 -12318 -10881 -13285
15929 -13285 -17105 -3174 6951 6627 7641 12696 22 -7550 144 -10028 -23516 -12524 -6247
15916 -6247 -3420 312 8206 22992 16868 14649 12564 307 -11707 -24788 -19366 -1983 -9260
15903 -9260 -7334 494 536 -7521 -6316 4240 872 -6885 -446 1849 781 1701 5190 9450 402
$$ packed form
15999i506K0733P60r728M822J0098l75j0745Q011M317l539o464Q221J3891M922
15985C5418j6823J0691J7732r593j7190j8778m477l075p00r08k132N907J542j1722
15971a4108N072J5101Q627j1133K01n312o781J3995J1715o700j7551M81J617P403
15957B627J5507K490m927m91k020q416L387Q313K992o62q55j6927j0290j0118
15943a9390J2253O919L437K280M141L575K799j4964j1563j001k903K099J437k404
15929a3285l820J3931J0125l24J014N055j2674p572P694j0172j3488J0992O277
15916f247K827L732P894J4786o124k219k085j2257j2014j3081N422J7383p277
15903i260J926P828M2q057J205J0556l368p757O439K295j068R20L489M260r048
$$ plain form
15888 402 3237 -1162 -7772 -15942 -16529 -5070 12071 21079 24991 15439 -2877 -17619 -13302 -2357
15874 -2357 -11945 -8925 -680 9218 -3255 -4881 -4113 -16410 -34508 -21887 -1465 -2272 -8150 7094
15860 7094 10250 5504 -1579 3961 37 1828 -656 7896 12276 6952 8960 4581 913 9334 20381
15845 20381 9974 14367 28307 19398 29220 17393 587 -8724 -13077 -10653 -3686 3326 4238 15876
15831 15876 12109 9580 2949 2108 11023 6981 -658 -14922 -16235 -20938 -19566 -12512 -17141 -12735
15817 -12735 -11520 -9115 926 1406 9248 21684 10732 9096 -5290 4105 8132 1829 6767 19536
15803 19536 28657 29816 19211 10363 15235 17968 9152 -3498 -11208 6541 15203 14147 13809 9766
15789 9766 20093 17237 1425 -776 6254 -146 -651 4164 5259 -5258 -13938 -10265 -1958 2063
$$ packed form
15888D02K835m399o610q170n87J1459J7141R008L912r552j8316j4742M317J0945
15874b357r588L020Q245R898j2473j626P68j2297j8098J2621K0422q07n878J5244
15860G094L156m746p083N540l924J791k484Q552M380n324K008m379l668Q421J1047
15845B0381j0407M393J3940q909R822j1827j6806r311m353K424O967P012R12J1638
15831A5876l767k529o631q41Q915m042p639j4264j313m703J372P054m629M406
15817a2735J215K405J0041M80P842J2436j0952j636j4386R395M027o303M938J2769
15803A9536R121J159j0605q848M872K733q816j2650p710J7749Q662j056l38m043
15789I766J0327k856j5812k201P030o400n05M815J095j0517q680L673Q307M021
$$ plain form
15775 2063 8700 4053 -4669 -5620 -9956 -3756 -20101 -15645 -3613 2008 3946 4767 7617 -2852
15761 -2852 -11588 -8404 -5423 -250 -5316 -19040 -28474 -16071 -2552 6145 -170 -12115 -18944 -3301
15747 -3301 8674 7695 -946 -18439 -19496 -12263 -766 -3780 -9074 -3843 -9156 -4209 -2262 -15613
15733 -15613 -33435 -30780 -12149 1867 16568 14215 -1561 -18443 -14070 -4226 -3837 -7599 -207
15720 -207 -1823 -12249 -11481 -15861 -23294 -31181 -20192 -21088 -26073 -16096 -10496 -9131 -4248 -10659 -18081
15705 -18081 -24514 -30799 -36848 -40722 -37265 -26689 -22147 -18099 -18593 -9827 -4190 4203 -19638 -34505
15691 -34505 -41871 -27831 -9201 14019 19673 14361 14555 10451 7247 6303 12787 4613 1264 -8169
15677 -8169 -10936 -13662 -7152 -2785 -7435 -2181 -468 16487 10534 -5638 -18133 -35544 -27207 -17333
$$ packed form
15775B063O637m647q722r51m336O200j6345M456J2032N621J938Q21K850j0469
15761b852q736L184K981N173n066j3724r434J2403J3519Q697o315j1945o829J5643
15747c301J1975r79q641j7493j057P233J1497l014n294N231n313M947J947j3351
15733a5613j7822K655J8631J4016J4701k353j5776j6882M373R844L89l762P392
15720b07j616j0426P68m380p433p887J0989q96m985R977N600J365M883o411p422
15705a8081o433o285o049l874L457J0576M542M048m94Q766N637Q393k3841j4867
15691c4505p366J4040J8630K3220N654n312J94m104l204r44O484q174l349r433
15677h169k767k726O510M367m650N254J713J6955n953j6172j2495j7411Q337R874
$$ plain form
15663 -17333 -5951 -4189 11667 14130 13103 2961 -2543 632 1422 9844 8983 23369 23516 6576
15649 6576 7076 5120 7960 -2636 -9067 -9628 -21330 -21447 -27182 -25293 -28268 -19668 -18547 -10641 12665
15634 12665 23408 3741 -15768 -11747 -1349 5604 7121 3868 2773 1804 -578 -6915 -6569 -13272
15620 -13272 -15890 -15384 -11123 -4647 -4044 453 489 738 1588 950 -4676 -7238 -8610 -17504 -15682 -3545
15604 -3545 12309 6513 1960 -4859 -20086 -16020 -6255 192 6065 803 4138 -5631 -4235 399
15590 399 1961 -6659 1088 8155 12232 9209 2821 -12689 -23693 -15510 -11865 -18056 -2574 5662
15576 5662 7009 4036 12683 5807 5506 7850 10254 5204 -2013 5901 9310 17993 18483 17023 20843
15561 20843 26153 28415 18950 6960 -2648 6019 16685 10487 1264 -4162 -4559 7340 -6620 -9174
$$ packed form
15663a7333J1382J762J5856K463j027j0142n504L175P90Q422q61J4386J47j6940
15649F576N00j956K840j0596o431n61j1702j17n735J889k975Q600J121P906K3306
15634A2665J0743j9667j9509M021J0398O953J517l253j095r69k382o337L46o703
15620a3272k618N06M261O476O03M497L6K49Q50o38n626k562j372q894J822J2137
15604c545J5854n796m553o819j5227M066R765O447N873n262L335r769J396M634
15590C99J562q620P747P067M077l023o388j5510j1004Q183L645o191J5482Q236
15576E662J347k973Q647o876l01K344K404n050p217P914L409Q683M90j460L820
15561B0843N310K262r465j1990r608Q667J0666o198r223n426l97J1899j3960k554
$$ plain form
15547 -9174 14490 2665 -1964 10567 8360 9681 10021 5766 1121 6146 18446 13924 11297 2450
15533 2450 5890 -4641 -17183 -23161 -19407 -15523 -14484 -15244 -4749 -411 -5354 -11253 -3712 6861
15519 6861 -8831 -11821 -10245 -8966 -4189 -5902 -6996 -3456 -3891 1432 5452 -2365 -13684 -27526
15505 -27526 -29326 -22567 -18071 -17299 -16385 -15714 -8766 -6619 4507 6282 812 19511 40653 25324
15491 25324 18324 13125 301 316 2241 4833 8470 4264 6699 23050 29011 20825 15369 16902
15477 16902 14825 15697 -2109 -9438 -3446 169 -3120 -1401 1231 -11816 -11086 -1907 8499 6946
15463 6946 -5634 -15220 -26215 -26731 -8840 -1474 553 -1023 -1377 7486 7815 8712 -1365 -1505 -17069
15448 -17069 -7300 2193 2126 -4234 -17882 -8680 -14722 -17347 -13294 -16039 -20381 -23948 -7642 -4350
$$ packed form
15547i174K3664j1825m629J2531k207J321L40m255m645N025J2300m522k627q847
15533B450L440j0531j2542n978L754L884J039p60J0495M338m943n899P541J0573
15519F861j5692k990J576J279M777j713j094L540m35N323M020p817j1319j3842
15505b7526j800O759M496P72R14O71O948K147J1126J775n470J8699K1142j5329
15491B5324p000n199j2824J5J925K592L637m206K435J6351N961q186n456J533
15477A6902k077Q72j7806p329N992L615l289J719K632j3047P30R179J0406j553
15463F946j2580r586j0995n16J7891P366K027j576l54Q863L29Q97j0077j40j5564
15448a7069R769R493o7o360j3648R202o042k625M053k745m342l567J6306L292
$$ plain form
15434 -4350 -10015 -23507 -35105 -29684 -24007 -16456 -6939 -3646 2039 16514 19294 21412 9633 9198
15420 9198 1315 -3771 2360 4278 12201 9550 8557 7970 -2097 -5771 -10883 -9730 -10430 -12043 524
15405 524 7393 3656 8388 -1309 -12835 -11912 -367 -2620 -9040 -10195 -19402 -23209 -19598 -10283 -6705
15390 -6705 -20303 -33002 -13743 2881 2865 -2532 -20990 -16966 -12964 -13609 -10600 -2165 4202 7163
15376 7163 9964 4860 2885 7349 18269 18656 7553 -763 -10941 -4000 4212 10898 14005 2071
15362 2071 8055 13487 11627 1663 3313 2064 -9970 -7556 -774 -7548 -19408 -17303 -14204 -9366
15348 -9366 -11192 -21559 -9351 29182 39965 9999 -6902 1219 5090 -10837 -4710 4576 19465
15335 19465 14235 13209 4705 -3936 -1436 3405 3254 -722 12694 20967 27251 15960 20120 18462
$$ packed form
15434d350n665j3492j1598N421N677P551R517L293N685J4475K780K118j1779m35
15420I198p883n086O131J918P923k651r93n87j0067l674n112J153p00j613J2567
15405E24O869l737M732r697j1526R23J1545k253o420j155r207l807L611R315L578
15390f705j3598j2699J9259J6624j6n397j8458M024M002o45L009Q435O367K961
15376G163K801n104j975M464J0920L87j1103q316j0178O941Q212O686L107j1934
15362B071N984N432j860r964J650j249j2034K414O782o774j1860K105L099M838
15348i366j826j0367J2208L8533J0783k9966j6901Q121L871j5927O127R286J4889
15335A9465n230j026q504q641K500M841j51l976J3416Q273O284j1291M160j658
$$ plain form
15321 18462 8634 8383 7661 -477 -10482 -8013 -846 3686 -2281 -4849 2019 -5976 -20513 -10881
15307 -10881 8388 7768 -628 -1463 11401 20116 15061 -234 -7045 -1078 -3946 -10879 1075 -3484
15293 -3484 -10607 -7392 4592 -4604 -11888 -6723 -4409 -2525 -972 -13804 -14273 13840 24025 9931
15279 9931 13529 7928 3411 -11550 -31398 -38848 -27997 -9823 -9319 -1101 7533 6820 11627 3446
15265 3446 -6097 -8312 -10086 3396 20662 5331 6479 14085 8748 7735 7436 8680 15966 -2268
15251 -2268 -23164 -20227 -15247 -10687 -22381 -17272 -9396 2283 -1886 -13854 -25061 -26242 -16607
15238 -16607 -7168 7864 14221 21043 19888 -3482 -7615 5778 -1798 -2593 -6746 -7487 -4688 -5231
15224 -5231 -10139 -1877 8097 18764 11507 -8545 -22744 -18145 -3021 -9899 -19461 -12593 -11653 -15304
$$ packed form
15321A8462r828k51p22q138j0005K469P167M532n967k568O868p995j4537R632
15307a0881J9269o20q396q35J2864Q715n055j5295o811N967k868o933J1954m559
15293c484p123L215J1984r196p284N165K314J884J553j2832m69K8113J0185j4094
15279I931L598n601m517j4961j9848p450J0851J8174N04Q218Q634p13M807q181
15265C446r543k215j774J3482J7266j5331J148P606n337j013k99J244P286j8234
15251b268k0896K937M980M560j1694N109P876J1679m169j1968j1207j181R635
15238a6607R439J5032O357O822j155k3370m133J3393p576p95m153p41K799n43
15224e231m908Q262R974J0667p257k0052j4199M599J5124o878r562O868R40l651
$$ plain form
15210 -15304 -2942 -805 -1229 -590 3431 2294 -5054 -12372 -12735 -11288 -24866 -15953 -8134 -13349 -8411
15195 -8411 2571 -1933 -10131 -14378 -9855 -567 5457 19647 22968 14233 7744 890 -3800 -12868
15181 -12868 -19257 -19601 -18195 -12617 -361 -2258 -9865 -3921 153 1567 -2094 7685 15387 13173
15167 13173 14036 15843 13246 12221 11426 10578 9122 4732 -4086 -7133 -7648 6306 13900 22924 20070
15152 20070 17420 19090 15511 11730 4701 -1286 -13981 -13318 229 332 -8815 -13028 -6963 -4083
15138 -4083 -22254 -30702 -10880 821 -10661 -9820 -1339 -5484 -7656 -4567 -10606 -4154 -1041 -9726
15124 -9726 -18559 -12981 -10388 -5690 -918 11448 21258 10214 6455 8739 4634 7053 4537 -1207
15110 -1207 -6053 -2952 -615 -5016 -17366 -22258 -8499 6904 16554 10147 5417 13613 18895 16523
$$ packed form
15210a5304J2362K137m24O39M021j137p348p318l63J447j3578Q913P819n215M938
15195h411J0982m504q198m247M523R288O024J4190L321q735o489o854m690r068
15181a2868o389l44J406N578J2256j897p607N944M074J414l661R779P702k214
15167A3173Q63J807k597j025p95q48j456m390q818l047n15J3954P594R024k854
15152B0070k650J670l579l781p029n987j2695O63J3547J03r147m213O065K880
15138d083j8171q448J9822J1701j1482Q41Q481m145k172L089o039O452L113q685
15124i726q833N578K593M698M772J2366R810j1044l759K284m105K419k516n744
15110a207m846L101K337m401j2350m892J3759J5403R650o407m730Q196N282k372
$$ plain form
15096 16523 6223 5960 7871 15425 13804 -3481 3305 2259 9268 14559 10579 -1051 -12892 -17702
15082 -17702 -7550 -8536 -10428 -18946 -25818 -25905 -12675 -11598 -17368 -18135 -21674 -27918 -28952 -10855 4556
15067 4556 1435 953 7264 669 -8644 -4760 -1264 -9143 -23372 -25383 -16602 -8586 537 8988 6698
15052 6698 1279 -4726 -17087 -20410 -16585 -11127 -15316 -11211 3247 10608 -3015 -8130 -11910 -25069
15038 -25069 -35349 -53006 -59256 -42255 -12781 -415 5558 9921 9202 -3063 -11757 -22223 -12779
15025 -12779 -15685 -6582 -3096 -1807 -3355 -11154 -17514 -17413 -19810 -30967 -28860 -15061 -8892 -8480
15011 -8480 -9574 -10105 -13351 -7425 -2580 -7498 -22587 -21608 -17533 -17389 -21154 -30075 -23727 -18395 -16454
14996 -16454 -10875 -18460 -22629 -8948 -693 -1583 -15785 -19845 -10098 -4390 -5448 2763 53 -2635
$$ packed form
15096A6523j0300k63J911P554j621j7285O786j046P009N291l980j1630j1841m810
15082a7702J0152r86j892q518o872q7J3230J077n770p67l539o244j034J8097J5411
15067D556l121m82O311o595r313L884L496p879j4229k011Q781Q016R123Q451k290
15052F698n419o005j2361l323L825N458m189M105J4458P361j3623n115l780j3159
15038b5069j0280j7657o250J7001K9474J2366N973M363p19j2265q694j0466R444
15025a2779k906R103L486J289j548p799o360J01k397j1157K107J3799O169M12
15011h480j094n31l246N926M845m918j5089R79M075J44l765q921O348N332J941
14996a6454N579p585m169J3681Q255q90j4202m060R747N708j058Q211k710k688
$$ plain form
14982 -2635 12852 15999 19475 26257 26181 6202 7374 -1557 -9732 -19405 -14417 -11480 -13878 -4986 -102
14967 -102 -1666 3594 20685 20775 10677 5688 4691 668 8849 14075 2473 -13400 -7332 -3009 91
14952 91 2225 2786 6712 388 -2642 -971 7153 2288 2208 4116 -8519 -17528 -25937 -25400 -3527 -4815
14936 -4815 -9729 5788 5542 -2400 -9208 -14032 -9929 4044 -1697 -4655 2298 18010 24845 14577
14922 14577 1772 -1628 -4396 -6018 -9698 3126 1519 -2442 -7986 1667 2648 -8407 -17242 -14587
14908 -14587 -10095 -343 5495 -2372 -10218 -10643 -7637 -3030 -2408 -4541 -8861 -11010 4992 411 -2172
14893 -2172 -6996 -7431 9764 6381 -13732 -27245 -23953 -21678 -27464 -13467 -15583 -23339 -26142 -29907
14879 -29907 -18446 -15202 -21678 -22264 -27990 -22234 -20222 -20000 -12040 -1637 9710 2003 -9153 -4769
$$ packed form
14982b635J5487L147L476O782p6j9979J172q931q175r673M988K937k398Q892M884
14967a02j564N260J7091R0j0098m989r97m023Q181N226j1602j5873O068M323L100
14952I1K134N61L926o324l030J671Q124m865q0J908j2635r009q409N37K1873j288
14936d815m914J5517k46p942o808m824M103J3973n741k958O953J5712O835j0268
14922A4577j2805l400k768j622l680J2824j607l961n544R653R81j1055q835K655
14908a4587M492R752N838p867p846m25L006M607O22k133m320k149J6002m581k583
14893b172m824m35J7195l383k0113j3513L292K275n786J3997k116p756k803l765
14879b9907J1461L244o476n86n726N756K012K22P960J0403J1347p707j1156M384
$$ plain form
14865 -4769 -14881 -7387 -4814 2746 20849 7377 9639 -651 -8608 -8428 -21720 -25600 -14105
14852 -14105 -1302 3865 -16966 -31247 -35675 -33163 -15191 -12754 -21726 -12157 7121 -2697 -11486
14839 -11486 -4167 5281 1976 -12572 -21780 -13436 -2616 12070 29090 21122 11259 3806 -13527
14826 -13527 -830 20944 20043 24891 17056 30524 30512 23052 18962 10678 8595 -216 -3401 -2809 3505
14811 3505 4691 10421 5554 -516 2211 -5311 -5596 -10343 -21788 -19966 -23405 -20990 -13644 -9761 11583
14796 11583 18047 9305 8451 8375 13717 3701 7277 11748 7761 -22213 -33716 -28349 -12320 -11880
14782 -11880 1496 10288 -4570 -7528 -12384 -11065 -20757 -10915 -9840 -24059 -11413 -561 -4008
14769 -4008 6371 -7263 -20873 -18121 -12175 -15878 -18251 -10274 -5255 -10516 -14826 -7086 -17884 -29998
$$ packed form
14865d769j0112P494K573P560J8103j3472K262j0290p957J80j3292l880J1495
14852a4105J2803N167k0831j4281m428K512J7972K437q972R569J9278r818q789
14839a1486P319R448l305j4548r208Q344J0820J4686J7020p968r863p453j7333
14826a3527J2697K1774r01M848p835J3468j2p460m090q284k083q811l185N92O314
14811C505J186N730m867o070K727p522k85m747j1445J822l439K415P346L883K1344
14796A1583O464q742q54p6N342j0016L576M471l987k9974j1503N367J6029M40
14782a1880J3376Q792j4858k958m856J319r692R842J075j4219J2646J0852l447
14769d008J0379j3634j3610K752N946l703k373P977N019n261m310P740j0798j2114
$$ plain form
14755 -29998 -34598 -25504 -16043 152 -3826 -11278 -14665 -25132 -15592 -6891 -11487 -26419 -11731
14742 -11731 -4271 -12959 -19872 -19537 -23642 -20571 -3964 -5716 -11851 -11057 611 1662 -253 5017
14728 5017 8935 -6070 -17189 -7015 10421 10973 8030 -681 -10465 -8336 -7825 -13278 -7131 -10956
14714 -10956 -11419 -9564 -13386 -23910 -22995 -10996 7036 7194 -6387 -6600 -4640 -15796 -18576 -2089
14700 -2089 10885 7728 2388 -7189 -12873 -9036 -16488 -21326 3549 17815 9134 -205 -15810 -17783
14686 -17783 -5895 -11994 -8316 -3885 6018 -7726 -10291 -18202 -1516 4587 5902 11336 -936
14673 -936 3940 -4458 -4483 -3786 -13429 -5591 -15728 -20609 -14967 -5275 5925 -7943 -18388 -3931
14659 -3931 -670 -10891 -7582 -2762 -4245 4284 -1317 2934 13507 15217 12252 2696 -9776 -3640
$$ packed form
14755b9998m600R094R461J6195l978p452l387j0467R540Q701m596j4932J4688
14742a1731P460q688o913L35m105L071J6607j752o135P94J1668J051j915N270
14728E017L918j5005j1119J0174J7436N52k943q711r784K129N11n453O147l825
14714a0956m63J855l822j0524R15J1999J8032J58j3581k13J960j1156k780J6487
14700b089J2974l157n340r577n684L837p452m838K4875J4266q681r339j5605j973
14686a7783J1888o099L678M431R903j3744k565p911J6686O103J315N434j2272
14673i36M876q398k5O97r643P838j0137m881N642R692J1200j3868j0445J4457
14659c931L261j0221L309M820j483Q529n601M251J0573J710k965r556j2472O136
$$ plain form
14645 -3640 3394 3734 -1760 -8799 -33268 -41930 -28832 -23497 -19326 -18004 -4890 9940 628 -7814
14631 -7814 1582 -416 6787 -8054 -20908 -2156 -8460 -10884 -10390 -1043 762 -7649 -4749 -5217
14617 -5217 -8684 -10035 -13860 -15672 -18045 -19240 -21277 -29690 -15566 -9883 -15531 -7780 -2578 4040
14603 4040 6862 5951 -18468 -31215 -31895 -35942 -33792 -41500 -30648 -7310 -718 -16249 -6541 -3615
14589 -3615 -9280 -19776 -20695 -18758 -21295 -19807 -15997 -5224 1642 10209 498 -1166 10823 15046
14575 15046 7311 -3136 -17202 -6343 -7375 -15461 -6043 -5239 -25919 -25595 -20751 -22090 -25737 -21471
14561 -21471 -9638 718 8355 -5076 -12123 -5541 -10127 -6820 -1139 -2553 -4505 -5128 -12101 -11862
14547 -11862 4939 16080 11492 13594 -830 -12339 -24401 -14203 -6418 -17860 -14021 -7688 -6143
$$ packed form
14645c640P034L40n494p039k4469q662J3098N335M171J322J3114J4830r312q442
14631g814R396j998P203j4841j2854J8752o304k424M94R347J805q411K900m68
14617e217l467j351l825j812k373j195k037q413J4124N683n648P751N202O618
14603D040K822r11k4419j2747o80m047K150p708J0852K3338O592j5531R708K926
14589c615n665j0496r19J937k537J488L810J0773O866Q567r711j664J1989M223
14575A5046p735j0447j4066J0859j032q086R418Q04k0680L24M844j339l647M266
14561b1471J1833J0356P637j3431p047O582m586L307N681j414j952o23o973K39
14547a1862J6801J1141m588K102j4424j1509j2062J0198P785j1442L839O333J545
$$ plain form
14534 -6143 -6622 -13972 -18865 -20984 -13999 -14818 -11040 -19130 -11883 -1166 4311 -4582 -9346 -21220 -30204
14519 -30204 -23586 -14542 -17979 -23501 -16515 -13955 -22553 -29024 -16986 -5374 6253 28 -7937 -10225
14505 -10225 -7117 7861 7351 5727 -4644 -7708 -18512 -23923 -25741 -32185 -22018 -16413 -24603 -21383
14491 -21383 -9105 -14867 -15438 -19276 -17812 -22790 -19660 -6014 -13537 1735 -9924 -9810 9397 22384
14477 22384 12010 5997 4474 6136 6035 9522 7395 -3434 -21354 -13549 3715 15479 15986 -1051
14463 -1051 -7357 -17002 -4035 5952 7646 8512 16974 16114 15128 13700 -3986 -9385 -15165 -426 16533
14448 16533 8105 -1237 -3124 -3053 -11956 -2189 9031 5211 10219 28507 32858 26482 12090 -17862
14434 -17862 -16844 -16332 -22941 -38116 -41285 -20670 -21747 -21653 -29324 -33001 -39896 -30646 -20098 -22206
$$ packed form
14534f143m79p350m893k119O985q19L778q090P247J0717N477q893m764j1874q984
14519c0204O618R044l437n522O986K560q598o471J2038J1612J1627o225p965k288
14505a0225L108J4978n10j624j0371l064j0804n411j818o444J0167N605q190L220
14491b1383J2278n762n71l838J464m978L130J3646p523J5272j1659J14J9207J2987
14477B2384j0374o013j523J662j01L487k127j0829j7920P805J7264J1764N07j7037
14463a051o306r645J2967R987J694Q66Q462q60r86j428j7686n399n780J4739J6959
14448A6533q428r342j887P1q903R767J1220l820N008J8288M351o376j4392k9952
14434a7862J018N12o609j5175l169K0615j077R4p671l677o895R250J0548k108
$$ plain form
14420 -22206 -18512 -11097 -591 18472 13669 -7823 -10761 -14504 934 9623 3962 -1314 -1641 6844
14406 6844 13236 2519 -18749 -12361 3394 9601 17478 16966 -5778 -17782 -15992 -11280 -5684 -8683
14392 -8683 -13165 5685 3489 -2654 164 4228 2829 543 -12669 -4927 4705 -2389 -14813 -17990
14378 -17990 -22019 -29155 -20200 -12044 -18976 -30223 -17327 -5428 122 6069 -1629 -13185 -11530
14365 -11530 -2323 -6738 -9552 -16657 -16750 -7560 -3807 -3840 6855 8484 -2506 -13867 -13510 -8003 -3971
14350 -3971 -11996 -8173 -11796 -7859 -9929 -7947 -3066 7738 3844 -8065 3150 9291 8660 1403
14336 1403 1554 4380 7608 1600 3499 -2317 -1789 -12150 -17175 -10101 -12865 -15507 -18697 -10258 5407
14321 5407 4637 3264 5368 4474 13593 18897 17142 19158 4515 2817 6384 27448 41538 38446
$$ packed form
14420b2206L694P415J0506J9063m803k1492k938l743J5438Q689n661n276l27Q485
14406F844O392j0717k1268O388J5755O207P877n12k2744j2004J790M712N596k999
14392h683m482J8850k196o143K818M064j399k286j3212P742R632p094j2424l177
14378a7990m029p136Q955Q156o932j1247J2896J1899N550N947p698j1556J655
14365a1530R207m415k814p105r3R190L753l3J0695J629j0990j1361L57N507M032
14350c971q025L823l623L937k070J982M881J0804l894j1909J1215O141o31p257
14336A403J51K826L228o008J899n816N28j0361n025P074k764k642l190Q439J5665
14321E407p70j373K104q94R119N304j755K016j4643j698L567K1064J4090l092
$$ plain form
14307 38446 25229 10631 3974 1418 5554 -2530 -7496 -3541 12900 12152 10003 2020 2565 3975
14293 3975 -4255 5091 7297 9634 12796 14363 6666 -1041 -4931 -12900 -8128 -18820 -28031 -29101
14279 -29101 -15925 -9771 -4329 -6321 -25830 -16532 -6680 -1756 -645 -9764 -8204 -4939 -12636 -16266
14265 -16266 -17712 -10185 -4683 -506 -4276 -9233 -7650 -4343 -2169 -8134 -11951 -15586 -16308 -10975 -1944
14250 -1944 -5006 8943 9006 12942 5063 -8510 -12066 -4040 1627 -17461 -7161 -9282 -17234 -24749
14236 -24749 -18102 -14107 -9297 6010 19734 9949 -11975 -28396 -13126 -8003 -13551 -6903 -2654
14223 -2654 -111 -7314 -19045 -17879 -11495 -13153 -23178 -22906 -21237 -24840 -19587 -14225 -22249 -33075
14209 -33075 -28976 -29818 -22031 -25373 -32037 -19415 -21502 -17162 -6539 -10804 -29462 -13096 -1322
$$ packed form
14307C8446j3217j4598o657k556M136q084m966L955J6441p48k149p983N45J410
14293C975q230R346K206K337L162J567p697p707l890p969M772j0692r211j070
14279b9101J3176O154N442j992j9509R298R852M924J111r119J560L265p697l630
14265a6266j446P527N502M177l770m957J583L307K174n965l817l635p22N333R031
14250a944l062J3949O3L936p879j3573l556Q026N667j9088J0300k121p952p515
14236b4749O647L995M810J5307J3724r785k1924j6421J5270N123n548O648M249
14223b654K543p203j1731J166O384j658j0025K72J669l603N253N362q024j0826
14209c3075M099q42P787l342o664J2622k087M340J0623m265j8658J6366J1774
$$ plain form
14196 -1322 -13254 -19589 -11671 10975 8180 -5539 2858 8744 -7992 -12448 -18364 -21274 -24335 -16516
14182 -16516 -12461 -14564 -8298 -14150 -22907 -34387 -18140 -2242 -2237 -11163 -25452 -11218 -7532 -20339
14168 -20339 -33994 -32338 -8694 -2138 8603 6952 -7277 -13173 -9587 -16210 -32713 -34997 -25464
14155 -25464 -24957 -21205 -9599 -244 -7419 -2331 -5473 -7645 -515 -366 3064 -8035 -9725 -6576
14141 -6576 1727 12627 13468 10724 -11744 -1463 -2101 4559 8549 12580 14498 5503 -4134 13372
14127 13372 14361 10423 1909 -7817 -7456 953 -7956 -15489 -13046 -23170 -18755 -20648 -12088 -5446 7806
14112 7806 -4538 -27705 -27041 -7087 -6909 -5097 -5715 -7850 -6575 -21865 -34121 -30148 -20449 -21623
14098 -21623 -23566 -16178 -17321 -22714 -14575 -6805 -3742 -19891 -21325 -23882 -30198 -35969 -16785 3659
$$ packed form
14196a322j1932o335P918K2646k795j3719Q397N886j6736m456n916k910l061P819
14182a6516M055k103O266n852q757j1480J6247J5898Nq926j4289J4234L686j2807
14168b0339j3655J656K3644O556J0741j651j4229n896L586o623j6503k284R533
14155b5464N07L752J1606R355p175N088l142k172P130J49L430j1099j690L149
14141f576Q303J0900Q41k744k2468J0281o38O660L990M031J918q995r637J7506
14127A3372R89l938q514r726L61Q409q909p533K443j0124M415j893Q560O642J3252
14112G806j2344k3167O64J9954J78J812o18k135J275j5290j2256L973R699j174
14098b1623j943P388j143n393Q139P770L063j6149j434k557o316n771J9184K0444
$$ plain form
14084 3659 6347 -7706 -14605 -15282 -940 -1384 -9745 -6639 -3274 1752 -10665 -22967 -29394 -27236
14070 -27236 -16636 -11031 260 2165 4530 -1389 -494 -6980 -22408 -28801 -18121 -18945 -26879 -43247
14056 -43247 -34502 -18294 -11389 1131 13031 23382 18914 12517 -1105 -13616 -15758 -7745 -12831
14043 -12831 -17057 -12655 -13943 -21068 -3728 -1968 -13460 -2749 -9801 -14356 -7391 -2407 -7676 -19194
14029 -19194 -28496 -28628 -19406 -12537 -18599 -29336 -27351 -14108 -3256 -1503 3797 16319 7394 -5159
14015 -5159 4558 -483 -19476 -19647 -12532 -9682 -12929 -25249 -28994 -21283 -28886 -46452 -43525 -28945
14001 -28945 -23786 -23080 -21353 -9793 -3866 511 -6318 -6119 9574 3841 6550 16228 -3424 -9238
13987 -9238 -7224 -14000 -21049 -18164 -10380 -13756 -20084 -28843 -24345 -8981 -9750 -3737 4826 -3146 2229
$$ packed form
14084C659K688j4053o899o77J4342m44q361L106L365N026j2417j2302o427K158
14070b7236J0600N605J1291J905K365n919Q95o486j5428o393J0680q24p934j6368
14056d3247Q745J6208O905J2520J1900J0351m468o397j3622j2511k142Q013n086
14043a2831m226M402j288p125J7340J760j1492J0711p052m555O965M984n269j1518
14029a9194r302j32R222O869o062j0737J985J3243J0852J753N300J2522q925j2553
14015e159R717n041j8993j71P115K850l247j2320l745P711p603j7566K927J4580
14001b8945N159P06J727J1560N927M377o829J99J5693n733K709R678j9652n814
13987i238K014o776p049K885P784l376o328q759M498J5364p69O013Q563p972N375
$$ plain form
13972 2229 3635 -6322 -8255 -2742 -10918 -7235 3410 15668 9030 3402 -2114 1138 1336 -5422
13958 -5422 1017 2714 4083 10224 1772 5889 1856 2815 2240 -3692 -4121 -3813 10760 15023 -7869
13943 -7869 -14357 -11458 -16264 -17025 -3164 -6671 -17375 -25942 -18445 -13994 -8676 -13231 -17456 -2247
13929 -2247 5741 -9264 -8196 1117 -1142 -6854 -6911 -8452 -5295 -16664 -25791 -20248 -24215 -31700 -30943
13914 -30943 -22079 -16634 -16345 -21279 -22780 -10379 -25227 -25628 -13058 -5066 -10897 -17902 -23807 -27307
13900 -27307 -32586 -30856 -30403 -43701 -28822 -19821 -9413 -2530 1478 -2180 -7488 -17916 -23818 -11229
13886 -11229 -11222 -8290 -3844 -6784 -6873 -4141 -14942 -24417 -15829 -11801 -5887 -13376 -17436 -11301 -11476 -12369
13870 -12369 -20333 -26647 -26927 -27064 -27549 -16460 -13623 -2256 3263 -1117 8588 4627 -166 -5133 -3727
$$ packed form
13972B229J406r957j933N513q176L683J0645J2258o638n628n516L252J98o758
13958e422O439J697J369O141q452M117m033R59n75n932m29L08J4573M263k2892
13943g869o488K899m806p61J3861l507j0704q567P497M451N318m555m225J5209
13929b247P988j5005J068R313k259n712n7j541L157j1369r127N543l967p485P57
13914c0943Q864N445K89m934j501J2401j4848m01J2570P992n831p005n905l500
13900b7307n279J730M53j3298J4879R001J0408O883M008l658n308j0428n902J2589
13886a1229PK932M446k940q9K732j0801r475Q588M028N914p489m060O135j75q93
13870a2369p964o314k80j37m85J1089K837J1367N519m380R705l961m793m967J406
$$ plain form
13855 -3727 7912 11841 3301 7906 15992 15720 15637 9263 7706 17313 24429 6053 -6093 -14369 -12684
13840 -12684 -13605 -8415 -6930 -6586 -11878 -10915 -4865 5428 2827 9926 17188 18007 22718 18336 6488
13825 6488 -3614 6723 2207 -1358 3460 4181 -15010 -13506 11858 23151 14372 14100 14295 11400
13811 11400 6212 -717 1168 7139 2316 -10418 -16453 -10142 -5894 -12608 -9230 10063 7490 -5824
13797 -5824 -1374 2340 -7271 -7613 -362 6898 4784 -7318 456 3822 -527 -20054 -31839 -33502
13783 -33502 -18594 -3668 -6720 2862 10751 2009 -9552 -8279 5452 -5633 -26956 -11876 3843
13770 3843 1574 -5076 2649 3586 -9677 -7373 -787 1344 1922 2635 -7036 -16147 -31831 -29640 -21956
13755 -21956 -26929 -24588 -26597 -30114 -30904 -15798 -2317 -16389 -31546 -27641 -13660 -10180 -8988
$$ packed form
13855c727J1639L929q540M605Q086k72q3o374j557R607P116j8376j2146q276J685
13840a2684r21N190J485L44n292R63O050J0293k601P099P262Q19M711m382j1848
13825F488j0102J0337m516l565M818P21j9191J504K5364J1293q779k72J95k895
13811A1400n188o929J885N971m823j2734o035O311M248o714L378J9293k573j3314
13797e824M450L714r611l42P251P260k114j2102P774L366m349j9527j1785j663
13783c3502J4908J4926l052R582P889q742j1561J273J3731j1085k1323J5080J5719
13770C843k269o650P725R37j3263K304O586K131N78P13r671r111j5684K191P684
13755b1956m973K341k009l517p90J5106J3481j4072j5157L905J3981L480J192
$$ plain form
13742 -8988 2812 3172 1278 -1061 5526 20261 20920 5910 -8861 -24104 -36918 -26134 -23685
13729 -23685 -15012 -13452 -7725 -3710 7542 4548 7318 6294 -4001 -8706 -7156 -10455 -13961 -20070
13715 -20070 -9051 -14558 -16601 -12289 -5514 -5683 -16962 -32239 -31300 -24837 -6036 -10508 -11270 -22461
13701 -22461 -28952 -22813 -16476 -28641 -25201 -24115 -24637 -24194 -10787 199 -21468 -25192 -20601 -15406
13687 -15406 4491 2589 -13073 -17989 -14869 -1810 5185 11627 6109 -3855 -4555 60 931 -12747
13673 -12747 -14598 -113 1065 -4712 1501 8621 -7274 -19366 -16414 -11355 -13115 -15926 -15476 -10681
13659 -10681 -7176 -10478 -15662 -11725 -4669 -5644 -6231 -8244 3446 -2094 -2378 -1487 10509 8912 3385
13644 3385 6990 -3621 -792 6397 -6160 -11437 -4294 6577 8369 10981 15582 -5600 -31085
$$ packed form
13742h988J1800L60j894k339O587J4735O59j5010j4771j5243j2814J0784K449
13729b3685Q673J560N727M015J1252k994K770j024j0295m705J550l299l506o109
13715b0070J1019n507k043M312O775j69j1279j5277R39O463J8801m472p62j1191
13701b2461o491O139O337j2165L440J086n22M43J3407J0986k1667l724M591N195
13687a5406J9897j902j5662m916L120J3059O995O442n518r964p00M615Q71j3678
13673a2747j851J4485J178n777O213P120j5895j2092K952N059j760k811M50M795
13659a0681L505l302n184L937P056r75n87k013J1690n540k84Q91J1996j597n527
13644C385L605j0611K829P189j2557n277P143J0871J792K612M601k1182k5485
$$ plain form
13631 -31085 -31405 -31122 -8911 -10887 -20071 -14333 -21963 -38841 -29788 -32023 -38014 -31889 -19473 -8344
13617 -8344 -1648 -21342 -30367 -25782 -23496 -28754 -34397 -25572 -28006 -15356 -3952 -10384 -6128 -5731
13603 -5731 -9458 -22088 -40250 -34392 -23890 -28820 -22532 -11822 -18465 -29343 -28851 -23560 -21744 -25849
13589 -25849 -38667 -37653 -29562 -33467 -51326 -36436 -15859 5589 10677 10560 -2719 -2909 -9711
13576 -9711 -2940 4890 6968 10180 15849 5886 -9110 -9067 557 -11281 -17723 -14956 -14584 -20905 -21447
13561 -21447 -15301 -2712 5727 991 -4752 -1064 -2388 -8545 -1976 -5576 7040 4120 10577 2698
13547 2698 -311 10650 -381 -16796 -23222 -14719 -4998 -8172 -6434 -7404 -15414 -4068 9239 14397
13533 14397 13626 8104 1453 -5729 -7210 -11530 -13760 -2762 -8010 -8307 -15958 -11485 -3345 2101 15596
$$ packed form
13631c1085l20K83K2211j976r184N738p630j6878R053k235n991O125J2416J1129
13617h344O696j9694r025M585K286n258n643Q825k434J2650J1404o432M256L97
13603e731l727j2630j8162N858J0502m930O288J0710o643j0878M92N291J816m105
13589b5849j2818J014Q091l905j7859J4890K0577K1448N088j17j3279j90o802
13576i711O771P830K078L212N669r963j4996M3R624j1838o442K767L72o321n42
13561b1447O146J2589Q439m736n743L688j324o157O569l600J2616k920O457p879
13547B698l009J0961j1031j6415o426Q503R721l174J738r70q010J1346J3307N158
13533A4397p71n522o651p182j481m320k230J0998n248k97p651M473Q140N446J3495
$$ plain form
13518 15596 20648 8154 8972 14428 1714 -5341 2444 8460 12776 6028 90 -6953 -365 8715
13504 8715 2733 106 8206 14242 6004 -4574 -9158 -7471 -7646 -21427 -19246 -17491 -21915 -4031
13490 -4031 -8611 -25007 -35942 -23587 -9452 3557 7578 3677 5521 -6664 -16362 -25178 -23844
13477 -23844 -16008 1535 -3061 -20 15501 5164 94 -4782 -15304 -14919 -18849 -2283 8547
13464 8547 6333 4134 3308 -1390 6294 9456 4547 3882 -1714 -13914 -9224 -11322 -5260 -3486 -8696
13449 -8696 6861 17580 16723 3353 -5421 -7232 -7116 -2277 -4593 4443 16155 13462 4108 192
13435 192 -3835 -13023 -14020 -11803 -19270 -23699 -27956 -27063 -21599 -16286 -10194 -6939 8353 24889 18500
13420 18500 16641 1728 -8877 -4083 10368 821 -2812 -6055 8924 1705 596 8837 8542 -2527
$$ packed form
13518A5596N052j2494Q18N456j2714p055P785O016M316o748n938p043O588R080
13504H715n982k627Q100O036q238j0578m584J687j75j3781K181J755m424J7884
13490d031m580j6396j0935J2355J4135J3009M021l901J844j2185r698q816J334
13477b3844P836J7543m596L041J5521j0337n070m876j0522L85l930J6566J0830
13464H547k214k199q26m698P684L162m909o65n596j2200M690k098O062J774n210
13449h696J5557J0719q57j3370q774j811J16M839k316R036J1712k693r354l916
13435A92m027r188r97K217p467m429m257Q93N464N313O092L255J5292J6536o389
13420A8500j859j4913j0605M794J4451r547l633l243J4979p219j109Q241k95j1069
$$ plain form
13406 -2527 1857 8211 -76 -10741 -16313 -3125 5050 10360 20633 22228 25956 18348 5020 5648
13392 5648 20868 26929 22525 17686 8884 5799 -3239 -1719 -12192 -7885 -5822 1362 -3662 -3750 1665
13377 1665 7744 2778 -4308 -9476 -8967 -2734 1600 -2000 -11562 -9249 -8360 -9175 -6948 -2022 -4628
13362 -4628 -8751 6015 -1332 -1847 -8037 -7352 -9631 -5578 -14626 -23100 -25713 -24902 -21509 -16797 -8737
13347 -8737 -8189 -16423 -20185 -23416 -31172 -54945 -45951 -33189 -29428 -17741 -1927 833 83 21832
13333 21832 11105 5976 -2522 -12485 -32725 -44783 -39355 -27380 -29516 -9561 17497 15242 4698
13320 4698 4130 -11563 -19887 -26501 -33778 -21182 -12629 -11328 -2332 -17553 -29895 -26498 -24554 -21791
13306 -21791 -14171 -17034 -9982 -6312 -19862 -21725 986 -10796 -27554 -23311 -4861 -2562 -9105
$$ packed form
13406b527M384O354q287j0665n572J3188Q175N310J0273J595L728p608j3328O28
13392E648J5220O061m404m839q802l085r038J520j0473M307K063P184n024q8N415
13377A665O079m966p086n168N09O233M334l600r562K313Q89q15K227M926k606
13362d628m123J4766p347n15o190O85k279M053r048q474k613Q11L393M712Q060
13347h737N48q234l762l231p756k3773Q994J2762L761J1687J5814K760p50K1749
13333B1832j0727n129q498r963k0240j2058N428J1975k136J9955K7058k255j0544
13320D698n68j5693q324o614p277J2596Q553J301Q996j5221j2342L397J944K763
13306b1791P620k863P052L670j3550j863K2711j1782j6758M243J8450K299o543
$$ plain form
13293 -9105 -15796 -13829 -12511 -13988 940 12360 21034 17653 10557 5305 3471 6861 4517 4176
13279 4176 -3624 -7407 -3365 -2261 -3613 -10742 -25203 -22878 -11218 -980 -1714 -3093 -7218 -6634
13265 -6634 -12873 -560 2201 9581 19477 14132 -11457 -21270 -20685 -24817 -36438 -33078 -35597 -35934
13251 -35934 -42304 -31522 -34730 -29265 -32082 -13340 9184 11383 7072 -6207 -11877 -10551 -7331
13238 -7331 3427 9932 5867 7870 -2087 2684 3824 3833 2757 -636 -500 -6413 -4476 -2092 -7546
13223 -7546 -8576 -14455 -29453 -34968 -19634 -19997 -17104 -12171 -930 -325 -13539 -14543 -16130 -18919
13209 -18919 -12031 -11447 -11476 -11038 -7715 -6739 -12672 -19420 -23525 -24796 -14382 -11451 -10045 -22258 -33909
13194 -33909 -23914 -27720 -24755 -29619 -35150 -29988 -20012 -5373 -2495 1046 1604 -14179 -7634 6967
$$ packed form
13293i105o691J967J318j477J4928J1420Q674l381p096n252j834L390k344l41
13279D176p800l783M042J104j352p129j4461K325J1660J0238p34j379m125N84
13265f634o239J2313K761P380R896n345k5589r813N85m132j1621L360k519l37
13251c5934o370J0782l208N465k817J8742K2524K199m311j3279n670J326L220
13238g331J0758O505m065K003r957M771J140Rj076l393J36n913J937K384n454
13223g546j030n879j4998n515J5334l63K893M933J1241O05j3214j004j587k789
13209a8919O888N84k9M38L323R76n933o748m105j271J0414K931J406j2213j1651
13194c3909R995l806K965m864n531N162R976J4639K878L541N58j5783O545J4601
$$ plain form
13180 6967 11150 13928 15302 17912 2236 -13285 -16625 -15188 2711 -6682 -21268 -33145 -6149
13167 -6149 -1906 1023 3228 -973 -7348 -23081 -26852 -26275 -31052 -25357 -28654 -18802 -12197 -23080
13153 -23080 -29897 -31099 -22377 -27263 -23014 -4620 14916 11931 401 -1681 -10065 -2563 -13696
13140 -13696 -19074 -32515 -34665 -26085 -22973 -18657 -15781 909 -1319 -16372 -24584 -15472 970
13127 970 6208 -5512 -10596 -10190 -21902 -32060 -20119 -13696 -20184 -7421 -5017 -5057 323 -15154
13113 -15154 3330 18336 2034 -3234 -7839 -8290 -16598 -11193 -15723 -19291 -33876 -27831 -17804
13100 -17804 -7853 -11926 -9613 -10835 -9357 -3973 -1081 -2460 -1486 -4562 -5965 8864 6439 -3654
13086 -3654 -10692 -18653 -10133 -18186 -23719 -14897 -1467 -12566 -19063 -25159 -20161 -16029 -15596 -15519 -18723
$$ packed form
13180F967M183K778J374K610j5676j5521l340J437J7899r393j4586j1877K6996
13167f149M243K929K205m201o375j5733l771N77m777N695l297R852O605j0883
13153b3080o817j202Q722m886M249J8394J9536k985j1530k082q384P502j1133
13140a3696n378j3441k150Q580L112M316K876J6690k228j5053q212R112J6442
13127I70N238j1720n084M06j1712j0158J1941O423o488J2763K404m0N380j5477
13113a5154J8484J5006j6302n268m605m51q308N405m530l568j4585O045J0027
13100a7804R951m073K313j222J478N384K892j379R74l076j403J4829k425j0093
13086c654p038p961Q520q053n533Q822J3430j1099o497o096M998M132M33P7l204
$$ plain form
13071 -18723 -24653 -23919 -18198 -20148 -24252 -24391 -13420 -10720 -21060 -40702 -26569 -11483 -7187 -1724
13057 -1724 -2431 -14417 -27695 -26815 -18428 -19841 -19670 -8444 -8550 -3830 -3148 -15520 -21594 -6960 686
13042 686 -7033 -18063 -11062 -17290 -37090 -30643 249 11919 -1198 -4301 -4916 0 -5187 -5488
13028 -5488 -1886 -13379 -15414 -17182 -11612 -7165 -4605 -11278 -6553 -13306 -32231 -42282 -33785 -24833
13014 -24833 -11869 -685 1841 -18730 -22757 -9135 8222 10130 -4354 -11758 456 11222
13002 11222 7793 4494 18749 -4712 -11530 -7459 -24686 -25380 -28379 -29094 -21422 -18896 844 16079
12988 16079 11687 3546 3839 1057 9300 8407 -2770 -22010 -38364 -35911 -15432 -25 -6645 -7650
12974 -7650 -128 5473 465 -4650 -8859 -17724 -23412 -24271 -25174 -18905 -19096 -33567 -27849 -19761 -7880
$$ packed form
13071a8723n930P34N721j950m104j39J0971K700j0340j9642J4133J5086M296N463
13057a724p07j1986j3278Q80Q387j413J71J1226j06M720O82j2372o074J4634P646
13042F86p719j1030P001o228j9800O447L0892J1670j3117l103o15M916n187l01
13028e488L602j1493k035j768N570M447K560o673M725o753j8925j0051Q497Q952
13014b4833J2964J1184K526k0571m027J3622J7357J908j4484p404J2214J0766
13002A1222l429l299J4255k3461o818M071j7227o94k999p15P672K526J9740J5235
12988A6079m392q141K93k782Q243q93j1177j9240j6354K453K0479J5407o620j005
12974g650P522N601n008n115m209q865n688q59r03O269j91j4471N718Q088J1881
$$ plain form
12959 -7880 -6825 -3272 -1302 7855 5058 8705 -2144 -11240 2137 -411 -17576 -21784 -17084 -12879
12945 -12879 -5145 -5165 -10168 -14320 -14659 -11806 -6080 4059 8787 5824 10265 10220 12847 4737 2508
12930 2508 4328 1542 -8393 -21775 -32907 -25662 -11031 -4903 -12045 -16631 -16167 -8938 -9888 -9484 -22295
12915 -22295 -30074 -19030 -16891 -17207 -15192 -5166 -1180 -899 -777 -6545 -7581 -20193 -24318 -25413
12901 -25413 -22806 -15126 -9625 -2418 -8435 8874 12362 -693 -13933 -11666 -12970 -13665 -7174 9289
12887 9289 16512 20925 12721 10119 11716 11930 1690 -8501 -3152 7630 30057 23562 -6534 -15984
12873 -15984 -9311 -5215 -973 11300 15179 1513 -19582 -6135 -3679 17779 20272 11871 9850
12860 9850 1216 -6117 -666 885 -2392 1394 5502 -9372 -20587 -7735 368 -852 -11024 -13525
$$ packed form
12959g880J055L553J970R157k797L647j0849r096J3377k548j7165m208M700M205
12945a2879P734k0n003m152l39K853N726J0139M728k963M441m5K627q110k229
12930B508J820k786r935j3382j1132P245J4631O128p142m586M64P229r50M04j2811
12915b2295p779J1044K139l16K015J0026L986K81J22n768j036j2612m125j095
12901b5413K607P680N501P207o017J7309L488j3055j3240K267j304o95O491J6463
12887I289P223M413q204k602J597K14j0240j0191N349J0782K2427o495l0096r450
12873a5984O673M096M242J2273L879j3666k1095J3447K456K1458K493q401k021
12860I850q634p333N451J551l277L786M108j4874j1215J2852Q103j220j0172k501
$$ plain form
12846 -13525 -4812 11886 4576 14133 9951 -8258 -17446 -24365 -34172 -15776 6291 11270 5485
12833 5485 5915 7455 5369 -16514 -20605 -2367 -5418 -10914 -13390 651 10149 21651 31729 30500
12819 30500 25438 8700 -5571 -17050 -17413 -10773 -382 3733 3797 777 -9249 -9496 2948 9133
12805 9133 1072 -14222 -11687 -4021 6272 23637 24078 12554 7477 11438 18762 25148 33620 37494
12791 37494 30922 34762 34960 42665 53858 57221 75986 93857 110207 140126 202323 319587 470966
12778 470966 615948 730546 798638 811957 773457 688697 561709 424473 297612 227093
12768 227093 185121 155864 136086 129866 124941 115721 99106 94641 85806 75811 71586 62818 60803
12755 60803 72759 82651 83288 92530 87959 85982 84489 83049 84092 84912 80127 73911 94592 93134
$$ packed form
12846a3525Q713J6698p310R557m182j8209r188o919r807J8396K2067M979n785
12833E485M30J540k086k1883m091J8238l051n496k476J4041R498J1502J0078j229
12819C0500n062j6738j4271j1479l63O640J0391M115O4l020j0026k47J2444O185
12805I133q061j5294K535P666J0293J7365M41j1524n077L961P324O386Q472L874
12791C7494o572L840J98P705J1193L363J8765J7871J6350K9919O2197J17264J51379
12778D70966J44982J14598O8092J3319l8500q4760j26988j37236j26861p0519
12768B27093m1972k9257j9778o220m925r220j6615m465q835r995m225q768k015
12755F0803J1956R892O37R242m571j977j493j440J043Q20m785o216K0681j458
$$ plain form
12741 93134 88802 80854 70694 73803 70488 65086 67791 68413 60920 57125 61721 57722 46995 47125
12727 47125 46307 44840 42233 34589 28827 46987 51184 52406 56167 56463 50562 47135 36291 31318
12713 31318 26192 41163 44481 41192 53957 62598 57363 71767 74402 68879 64639 54025 60051
12700 60051 68513 70306 55494 37060 25993 21617 17083 14079 21386 31063 37162 24701 23085
12687 23085 15730 15432 30769 20842 24318 31236 21993 23012 25943 33295 32724 34587 27766 3206
12673 3206 13418 8744 2164 4095 6453 10445 174 -12286 -14378 836 6251 1683 -5551 3662
12659 3662 8535 2987 861 7428 12892 13166 17480 31116 43948 48610 33147 37851 35771 27719
12645 27719 25864 20902 9541 22164 21362 20003 34287 32393 29145 27360 31711 32002 42220 34606
$$ packed form
12741I3134m332p948j0160L109l315n402K705O22p493l795M596l999j0727J30
12727D7125q18j467k607p644n762J8160M197J222L761K96n901l427j0844m973
12713C1318n126J4971L318l289J2765Q641n235J4404K635n523m240j0614O026
12700F0051Q462J793j4812j8434j1067m376m534l004P307R677O099j2461j616
12687B3085p355k98J5337r927L476O918r243J019K931P352n71J863o821k4560
12673C206J0212m674o580J931K358L992j0271j2460k092J5214N415m568p234R213
12659C662M873n548k126O567N464K74M314J3636J2832M662j5463M704k080q052
12645B7719j855m962j1361J2623q02j359J4284j894l248j785M351K91J0218p614
$$ plain form
12631 34606 39331 47312 45970 43513 50279 35903 30826 37291 32483 40022 41143 38840 35386 37288
12617 37288 31429 30864 22463 17253 17759 24826 49690 59178 62292 49003 58954 59336 55120 54750 61898
12602 61898 71259 66210 54092 49138 52776 40281 33329 41099 47315 40594 53252 44293 31913
12589 31913 30900 35565 39196 55310 60222 50767 46379 42232 39138 28456 28974 45549 55588 45123
12575 45123 27791 29265 39593 41460 48936 57425 53773 43713 38142 45954 59579 46563 33534
12562 33534 37432 28193 13193 7058 8565 12261 16851 22838 29204 30690 20852 17097 12441 10108
12548 10108 5398 4873 6815 11293 20933 29632 30713 24956 19841 25069 23452 21378 14122 12536 27840
12533 27840 22095 11181 169 -3734 1445 14333 11711 8484 -144 -274 22107 32240 30606
$$ packed form
12631C4606M725P981j342k457O766j4376n077O465m808P539J121k303l454J902
12617C7288n859n65q401n210N06P067K4864R488L114j3289R951L82m216l70P148
12602F1898R361n049j2118m954L638j2495o952P770O216o721J2658q959j2380
12589C1913j013M665L631J6114M912r455m388m147l094j0682N18J6575J0039j0465
12575D5123j7332J474J0328J867P476Q489l652j0060n571P812J3625j3016j3029
12562C3534L898r239j5000o135J507L696M590N987O366J486r838l755m656k333
12548A0108m710n25J942M478R640Q699J081n757n115N228j617k074p256j586J5304
12533B7840n745j0914j1012l903N179J2888k622l227q628j30K2381J0133j634
$$ plain form
12520 30606 23974 25955 31401 41541 30002 23834 13037 12427 -8059 -11585 4550 13723 24838
12507 24838 25693 11124 7209 -3816 83 -2023 -483 1384 -10661 648 12355 21994 24550
12494 24550 11899 5236 3143 13818 13510 7836 7754 -391 -7771 390 17096 14677 5084 -6364
12480 -6364 -6853 2352 3452 -7260 13446 25412 19373 15504 3770 -9284 -6395 -6934 251 5848
12466 5848 12595 6237 12992 10493 5066 4587 -6739 -4659 -9737 -23417 -35371 -16880 812 -5407
12452 -5407 -13544 -21162 -23454 -21594 -20804 -11448 -241 1229 -5052 -10276 1928 787 1799 10386
12438 10386 8775 1502 -1342 -4911 1745 10530 25151 23028 22679 15570 9097 -946 4726 3424
12424 3424 -12543 -22019 -15867 211 14139 22301 18106 23390 29359 19477 4909 14853 14700 8573
$$ packed form
12520C0606o632J981N446J0140j1539o168j0797o10k0486l526J6135R173J1115
12507B4838Q55j4569l915j1025L899k106J540J867j2045J1309J1707R639K556
12494B4550j2651o663k093J0675l08n674q2q145p380Q161J6706k419r593j1448
12480f364m89R205J100j0712K0706J1966o039l869j1734j3054K889n39P185N597
12466E848O747o358O755k499n427m79j1326K080n078j3680j1954J8491J7692o219
12452e407q137p618k292J860P90R356J1207J470o281n224J2204j141J012Q587
12438A0386j611p273k844l569O656Q785J4621k123l49p109o473j0043N672j302
12424C424j5967r476O152J6078J3928Q162m195N284N969r882j4568R944j53o127
$$ plain form
12410 8573 -3295 10092 6311 -5969 -14740 -4800 -7482 8041 12787 16732 12168 13777 7798 12027
12396 12027 18971 21205 9346 -2790 4831 18873 11895 9758 21210 29537 33004 27348 18937
12383 18937 17336 18859 14818 11859 24688 37190 33667 21315 8921 6340 28527 31053 23802
12370 23802 22171 26673 23752 4360 47 13649 23534 29854 23686 12447 -4773 -3320 14740
12357 14740 26920 20249 822 1983 4625 15436 18281 17748 26966 12580 2827 7426 9674 17537
12343 17537 8224 -4222 -4999 1464 2313 -864 2682 9837 6343 19460 25510 9016 18538 35902
12329 35902 31618 39568 35179 29617 30718 21943 19012 19944 14433 16832 29250 32967 34922 35433 28419
12314 28419 20638 14319 33321 41409 44158 28183 25969 29630 30958 34082 29584 16323 3534
$$ packed form
12410H573j1868J3387l781j2280q771R940k682J5523M746L945m564J609n979M229
12396A2027O944K234j1859j2136P621J4042o978k137J1452Q327L467n656q411
12383A8937j601J523m041k959J2829J2502l523j2352j2394k581K2187K526p251
12370B3802j631M502k921j9392m313J3602R885O320o168j1239j7220J453J8060
12357A4740J2180o671j9427J161K642J0811K845n33R218j4386r753M599K248P863
12343A7537r313j2446p77O463Q49l177L546P155l494J3117O050j6494R522J7364
12329C5902m284P950m389n562J101q775k931R32n511K399J2418L717J955N11p014
12314B8419p781o319J9002Q088K749j5975k214L661J328L124m498j3261j2789
$$ plain form
12301 3534 8233 13914 8968 18513 17562 2586 1643 5390 22277 29781 34967 33967 32501 34248 32414
12286 32414 33535 42278 53715 47655 35147 26160 20431 22209 29030 24518 28442 34186 41750 37539
12272 37539 24852 11309 -2601 -2259 2059 10751 14064 14801 24473 24528 16897 14934 26144 17414
12258 17414 12443 10250 16705 30321 35489 30067 30918 19828 18014 23049 26070 20635 9674 6960
12244 6960 9897 20203 28840 26714 19718 21040 15792 13571 15578 19238 31706 30840 28340 24438
12230 24438 20217 15252 19993 34063 20993 20218 30207 30654 23375 22598 26190 35352 40580 35345 19732
12215 19732 14371 22988 20921 14368 31638 36817 28872 23316 21550 28262 22665 22555 27729 38089
12201 38089 31544 29062 31409 27955 26236 24526 2869 -1153 8149 25035 25444 41561 49615 51217
$$ packed form
12301C534M699N681m946R545r51j4976r43L747J6887P504N186j000j466J747j834
12286C2414J121Q743J1437o060j2508q987n729J778O821m512L924N744P564m211
12272C7539j2687j3543j3910L42M318Q692L313P37R672N5p631j963J1210q730
12258A7414m971k193O455J3616N168n422Q51j1090j814N035L021n435j0961k714
12244F960K937J0306Q637k126o996J322n248k221K007L660J2468q66k500l902
12230B4438m221m965M741J4070j3070p75R989M47p279p77L592R162N228n235j5613
12215A9732n361Q617k067o553J7270N179p945n556j766O712n597j10N174J0360
12201C8089o545k482K347l454j719j710k1657m022R302J6886M09J6117Q054J602
$$ plain form
12187 51217 51876 65371 65729 82749 95400 86856 84072 102954 114053 127559 131641 135035 123575
12174 123575 111489 97170 87879 87080 75775 59705 57620 60371 65341 55279 57245 52817 46626
12161 46626 49814 50028 50166 56285 67021 61741 52658 63044 63768 48791 54736 53620 53651 57664 58767
12146 58767 69203 79298 96226 108712 112438 110656 119063 136582 160699 198205 226900 252912
12134 252912 268255 276286 297681 326881 337773 328350 311942 288040 267046 243059 230692 215359
12122 215359 198359 180166 170747 158317 154283 160949 151104 134959 131622 125048 127755 125520 109659
12109 109659 114530 120371 116627 121358 135452 132847 127275 146060 152411 142932 144219 160218 185406
12096 185406 207846 229261 248351 275521 302422 338388 380472 420718 477231 537930 605005
$$ packed form
12187E1217O59J3495L58J7020J2651q544k784J8882J1099J3506M082L394j1460
12174A23575j2086j4319r291p99j1305j6070k085K751M970j0062J966m428o191
12161D6626L188K14J38O119J0736n280r083J0386P24j4977N945j116L1M013J103
12146E8767J0436J0095J6928J2486L726j782Q407J7519K4117L7506K8695K6012
12134B52912J5343Q031K1395K9200J0892r423j6408k3902k0994k3987j2367j5333
12122B15359j7000j8193r419j2430m034O666r845j6145l337o574K707k235j5861
12109A09659M871N841l744M731J4094k605n572J8785O351r479J287J5999K5188
12096A85406K2440K1415J9090K7170K6901L5966M2084M0246N6513O0699O7075
$$ plain form
12085 605005 652785 686546 700413 707149 711765 690551 655964 624154 570646 530075 506879 472116
12073 472116 442794 433502 445447 440768 450974 472737 489835 498256 506978 503723 501161 499207 498607
12060 498607 495394 494646 501325 518244 528099 572234 599324 609914 629867 643795 659562 667982 661754
12047 661754 656177 644385 652188 648724 631843 626862 628645 625681 619672 610430 594364 591102 589759
12034 589759 570419 553260 548210 541017 533817 526170 534455 558625 586370 618835 667150 714015
12022 714015 741196 767299 801316 824082 817469 795600 778102 734241 666366 603917 548111 495554
12010 495554 454264 426563 403396 375799 347131 320258 306038 302965 293145 268475 257583 243849
11998 243849 240695 255928 258600 265117 258785 260941 261436 270352 275696 278903 277121 270267 270198 281263
$$ packed form
12085F05005M7780L3761J3867O736M616k1214l4587l1810n3508m0571k3196l4763
12073D72116k9322r292J1945m679J0206K1763J7098Q421Q722l255k562j954o00
12060D98607l213p48O679J6919R855M4135K7090J0590J9953J3928J5767Q420o228
12047F61754n577j1792P803l464j6881m981J783k964o009r242j6066l262j343
12034E89759j9340j7159n050p193p200p647Q285K4170K7745L2465M8315M6865
12022G14015K7181K6103L4017K2766o613k1869j7498m3861o7875o2449n5806n2557
12010D95554m1290k7701k3167k7597k8668k6873j4220l073r820k4670j0892j3734
11998B43849l154J5233K672O517o332K156M95Q916N344L207j782o854o9J1065
$$ plain form
11984 281263 299889 310183 325387 346735 383971 398693 407943 418850 418513 401767 385227 368708
11972 368708 333392 309666 294563 272104 250771 233068 215789 212719 185952 177399 181536 188695
11960 188695 182361 183684 181428 164767 146418 148025 148229 155563 169304 166761 168819 171569 165880 147462
11946 147462 133489 140796 153297 158627 156600 159921 161641 174947 172207 181009 194843 210120 220216
11933 220216 203505 196725 219296 218683 216376 218827 202697 187495 193318 188118 168445 155590 151273
11920 151273 143056 152122 153379 151522 160381 167195 170770 182089 188746 182882 181553 179606 162927 155577
11906 155577 156259 150052 159381 163467 170048 170295 159109 165952 157450 134894 128205 146210 152722 157803
11892 157803 164756 167847 168563 180310 180196 192290 188521 187039 185770 195279 191303 173949 169536 165540
$$ packed form
11984B81263J8626J0294J5204K1348L7236J4722R250J0907l37j6746j6540j6519
11972C68708l5316k3726j5103k2459k1333j7703j7279l070k6767q553M137P159
11960A88695o334J323k256j6661j8349J607K04P334J3741k543K058K750n689j8418
11946A47462j3973P307J2501N330k027L321J720J3306k740Q802J3834J5277J0096
11933B20216j6711o780K2571o13k307K451j6130j5202N823n200j9673j2855m317
11920A51273q217R066J257j857Q859O814L575J1319O657n864j329j947j6679p350
11906A55577O82o207R329M086O581K47j1186O843q502k2556o689J8005O512N081
11892A57803O953L091P16J1747j14J2094l769j482j269R509l976j7354m413l996
$$ plain form
11878 165540 161906 155484 151810 153987 165675 174342 183641 181348 170854 178475 175760 163473 148447
11865 148447 142850 143661 133320 125446 127389 118644 115601 126597 133307 128265 123264 118469 115938 123998
11851 123998 135858 135150 142380 141188 143928 153822 167757 162441 165739 154863 144169 141239 137023
11838 137023 123847 112605 112057 112108 116951 122082 119881 109851 84523 73207 98742 100686 98450
11825 98450 107463 119849 127927 132573 136640 127084 120815 130714 132977 128872 133792 136559 147314 144703
11811 144703 134458 145042 142972 137055 139896 148237 136876 127891 133452 154583 164858 158394 163771
11798 163771 167896 161370 169235 168685 172824 176475 164575 172888 201091 225228 253497 267309 273324
11785 273324 278168 289730 293828 302758 318454 357271 383590 398429 390791 409958 438327 448246
$$ packed form
11878A65540l634o422l674K177J1688Q667R299k293j0494P621k715j2287j5026
11865A48447n597Q11j0341p874J943q745l043J0996O710n042n001m795k531Q060
11851A23998J1860p08P230j192K740R894J3935n316L298j0876j0694k930m216
11838A37023j3176j1242n48N1M843N131k201j0030k5328j1316K5535J944k236
11825I8450R013J2386Q078M646M067r556o269R899K263m105M920K767J0755k611
11811A44703j0245J0584k070n917K841Q341j1361q985N561K1131J0275o464N377
11798A63771M125o526P865n50M139L651j1900Q313K8203K4137K8269J3812O015
11785B73324M844J1562M098Q930J5696L8817K6319J4839p638J9167K8369R919
$$ plain form
11773 448246 453275 467669 481109 486506 486983 487379 482730 464206 443881 442629 443428 457756 461466 462110
11759 462110 469499 473568 466840 471011 494423 516015 519964 516809 520961 512991 510148 513301 512384 528251
11745 528251 542909 557592 568626 564914 562806 566107 569631 552211 546226 550388 558999 570429 585000
11732 585000 606274 620420 624151 616235 613775 641791 656571 666732 689842 708246 711358 733924
11720 733924 754103 772100 785458 795020 806824 819709 843443 868862 875163 888028 902740 938211
11708 938211 970795 994469 1008951 1041374 1066768 1084345 1103693 1127443 1150772 1191546 1234306
11697 1234306 1260017 1305821 1370289 1446740 1523173 1593422 1680366 1765952 1853839 1938712 2039246
11686 2039246 2155773 2280222 2405299 2536479 2685357 2877445 3112369 3384717 3691836
$$ packed form
11773D48246N029J4394J3440N397M77L96m649j8524k0325j252P99J4328L710O44
11759D62110P389M069o728M171K3412K1592L949l155M152p970k843L153r17J5867
11745E28251J4658J4683J1034l712k108L301L524j7420n985M162Q611J1430J4571
11732E85000K1274J4146L731p916k460K8016J4780J0161K3110J8404L112K2566
11720G33924K0179J7997J3358R562J1804J2885K3734K5419O301J2865J4712L5471
11708I38211L2584K3674J4482L2423K5394J7577J9348K3750K3329M0774M2760
11697A234306K5711M5804O4468P6451P6433P0249Q6944Q5586Q7887Q4873J00534
11686B039246J16527J24449J25077J31180J48878J92088K34924K72348L07119
$$ plain form
11677 3691836 4048440 4479795 4990295 5583234 6274424 7111446 8090122 9245546 10606389
11668 10606389 12242468 14247495 16738211 19861248 23819554 28818571 35059979 42595168
11660 42595168 51173982 60134149 68405913 74925927 78954716 80152368 78437391 74073577
11652 74073577 67804095 60730598 53939275 48196913 43764543 40672961 38864930 38188182
11644 38188182 38515979 39739456 41756484 44450717 47669227 51261687 55029630 58761648
11636 58761648 62253787 65431747 68321955 71002926 73672659 76603616 80000528 83982707
11628 83982707 88399133 92826518 96739625 99541522 100782516 100240599 97963127 94268623
11620 94268623 89678739 84923697 80645159 77268736 74903199 73376353 72372032 71564786
$$ packed form
11677C691836L56604M31355N10500N92939O91190Q37022R78676J155424J360843
11668A0606389J636079K005027K490716L123037L958306M999017O241408P535189
11660D2595168Q578814Q960167Q271764O520014M028789J197652j714977m363814
11652G4073577o269482p073497o791323n742362m432370l091582j808031o76748
11644C8188182L27797J223477K017028K694233L218510L592460L767943L732018
11636E8761648L492139L177960K890208K680971K669733K930957L396912L982179
11628H3982707M416426M427385L913107K801897J240994n41917k277472l694504
11620I4268623m589884m755042m278538l376423k365537j526846j004321q07246
$$ plain form
11612 71564786 70646898 69385530 67639430 65371268 62679485 59788627 56955394 54406865
11604 54406865 52321590 50901563 50336836 50866828 52707579 56014140 60929992 67419782
11596 67419782 75154424 83395820 91062958 96996262 100283890 100466875 97457698 91503669
11588 91503669 83263245 73829514 64391007 55809345 48475444 42415257 37535590 33616334
11580 33616334 30460917 27896788 25758727 23957550 22413025 21066964 19876163 18836601
11572 18836601 17918257 17101237 16349043 15640981 14981856 14376736 13797907 13253289 12744833
11563 12744833 12244058 11780303 11349965 10951954 10573250 10205397 9865859 9537189 9217026
11554 9217026 8916905 8632128 8343471 8081679 7841010 7610304 7375151 7144769 6912995
$$ packed form
11612G1564786r17888j261368j746100k268162k691783k890858k833233k548529
11604E4406865k085275j420027n64727N29992J840751L306561M915852O489790
11596F7419782P734642Q241396P667138N933304L287628J82985l009177n954029
11588I1503669q240424r433731r438507q581662p333901o060187m879667l919256
11580C3616334l155417k564129k138061j801177j544525j346061j190801j039562
11572A8836601r18344q17020p52194p08062o59125o05120n78829n44618n08456
11563A2744833n00775m63755m30338l98011l78704l67853l39538l28670l20163
11554I217026l00121k84777k88657k61792k40669k30706k35153k30382k31774
$$ plain form
11545 6912995 6706459 6510350 6327579 6142872 5944797 5761109 5591485 5453458 5319390
11536 5319390 5176656 5045912 4919513 4804269 4682995 4565742 4439191 4341552 4245915 4134595
11526 4134595 4012824 3893786 3796005 3703653 3621923 3531071 3438957 3333749 3245070 3177782 3113281
11515 3113281 3065055 3006965 2938307 2863071 2795136 2736222 2658380 2605572 2561277 2499722 2439924
11504 2439924 2387688 2339042 2303684 2269935 2222127 2185077 2151991 2120911 2090633 2045325 2000426
11493 2000426 1969853 1929780 1891352 1870673 1840337 1816862 1799838 1789476 1774338 1759141 1744119
11482 1744119 1739475 1735085 1719307 1718961 1712153 1694156 1656833 1622404 1587974 1549952 1500228 1445428
11470 1445428 1377746 1327386 1302015 1273876 1260070 1235204 1207977 1182834 1165075 1137149 1111468
$$ packed form
11545F912995k06536j96109j82771j84707j98075j83688j69624j38027j34068
11536E319390j42734j30744j26399j15244j21274j17253j26551r7639r5637j11320
11526D134595j21771j19038r7781r2352q1730r0852r2114j05208q8679o7288o4501
11515C113281m8226n8090o8658p5236o7935n8914p7842n2808m4295o1555n9798
11504B439924n2236m8646l5358l3749m7808l7050l3086l1080l0278m5308m4899
11493B000426l0573m0073l8428k0679l0336k3475j7024j0362j5138j5197j5022
11482A744119m644m390j5778l46o808j7997l7323l4429l4430l8022m9724n4800
11470A445428o7682n0360k5371k8139j3806k4866k7227k5143j7759k7926k5681
$$ plain form
11459 1111468 1099118 1075150 1050162 1031482 1022945 991814 970092 952072 934198 918298 909144 901564
11447 901564 889552 880650 865995 829688 804059 784938 768339 764032 750703 744191 739801 726649
11435 726649 706040 688479 686328 681312 677243 671203 673495 667540 662573 650754 625471 604285 589713
11422 589713 597161 596192 598809 582436 568440 559491 542403 545144 543658 523915 504395 484035 471381
11409 471381 463336 461091 451572 448137 440799 428554 429573 434762 430494 418689 410712 411083 421533 432280
11395 432280 424021 412165 399131 394083 400686 397060 369598 357414 357577 369346 363896 338580 323725
11382 323725 321187 319985 308209 297443 292335 288527 281850 288260 297885 292029 268490 257736 260316
11369 260316 258265 257253 246061 252948 260235 265730 262194 246194 239117 242924 245089 244212 239715 240016
$$ packed form
11459A111468j2350k3968k4988j8680q537l1131k1722j8020j7874j5900r154p580
11447I01564j2012q902j4655l6307k5629j9121j6599m307j3329o512m390j3152
11435G26649k0609j7561k151n016m069o040K292n955m967j1819k5283k1186j4572
11422E89713P448r69K617j6373j3996q949j7088K741j486j9743j9520k0360j2654
11409D71381q045k245r519l435p338j2245J019N189m268j1805p977L71J0450J0747
11395D32280q259j1856j3034n048O603l626k7462j2184J63J1769n450k5316j4855
11382C23725k538j202j1776j0766n108l808o677O410R625n856k3539j0754K580
11369B60316k051j012j1192O887P287N495l536j6000p077L807K165q77m497L01
$$ plain form
11355 240016 243449 243198 240135 233474 213295 208356 208002 208621 208691 220000 220407 206537 207465 204739 209037
11340 209037 205765 202232 208194 198562 194868 196550 184634 180932 197194 198457 190142 186923 163539
11327 163539 167105 176468 172315 153603 153001 160343 164153 168540 167529 167854 176651 178260 156134 160757
11313 160757 167981 156148 149877 144262 137410 146009 165299 178243 187026 171067 157916 160010 144916
11300 144916 127301 121238 125605 117861 119561 132277 132768 131557 130128 125894 123616 121901 120849 121367
11286 121367 137024 126236 112629 129259 130767 124670 119872 120761 131828 139350 146367 136618 130886
11273 130886 122585 135344 145642 153773 138368 141484 142466 123710 102362 99882 94853 88448 82297
11260 82297 72202 66838 79717 92859 105520 112193 106918 89603 96975 98472 94254 94226 97407 102610
$$ packed form
11355B40016L433k51l063o661k0179m939l54O19P0J1309M07j3870R28k726M298
11340B09037l272l533N962r632l694J682j1916l702J6262J263q315l219k3384
11327A63539L566R363m153j8712o02P342L810M387j011L25Q797J609k2126M623
11313A60757P224j1833o271n615o852Q599J9290J2944Q783j5959j3151K094j5094
11300A44916j7615o063M367p744J700J2716M91j211j429m234k278j715j052N18
11286A21367J5657j0788j3607J6630J508o097m798Q89J1067P522P017r749n732
11273A30886q301J2759J0298Q131j5405L116R82j8756k1348k480n029o405o151
11260H2297j0095n364J2879J3142J2661O673n275j7315P372J497m218k8L181N203
$$ plain form
11246 102610 100027 97817 107896 116033 129829 143571 157821 197492 220964 236321 244960 262251
11234 262251 274499 270688 277381 311038 315725 317641 348020 386816 416430 436386 450185 456818
11222 456818 467436 460092 428929 392787 354772 309288 280973 293339 292644 281197 272882 297355
11210 297355 309482 321015 338099 355304 373986 392756 417739 438435 461921 481908 484563 489747
11198 489747 499768 526094 540597 557422 561278 557384 551046 545731 531246 523933 510546 496054
11186 496054 484492 487394 478123 469186 471632 464264 455368 456061 443069 428628 423023 405060 396172
11173 396172 396279 400647 409433 416779 421453 433621 447272 472609 503366 533868 555063 575684 608750
11160 608750 630113 628286 612187 582338 540098 501990 453371 390366 341693 312895 285364 267023
$$ packed form
11246A02610k583k210J0079Q137J3796J3742J4250L9671K3472J5357Q639J7291
11234B62251J2248l811O693L3657M687J916L0379L8796K9614J9956J3799O633
11222D56818J0618p344l1163l6142l8015m5484k8315J2366o95j1447q315K4473
11210B97355J2127J1533J7084J7205J8682J8770K4983K0696K3486J9987K655N184
11198D89747J0021K6326J4503J6825L856l894o338n315j4485p313j3387j4492
11186D96054j1562K902r271q937K446p368q896O93j2992j4441n605j7963q888
11173C96172J07M368Q786P346M674J2168J3651K5337L0757L0502K1195K0621L3066
11160F08750K1363j827j6099k9849m2240l8108m8619o3005m8673k8798k7531j8341
$$ plain form
11148 267023 251911 225803 206308 201304 200968 190810 193102 189336 182203 179471 182718 191784 184820
11135 184820 176965 191846 180027 165894 183903 187062 177996 188274 190741 189366 191113 183564 187748
11122 187748 205045 216380 226543 254149 293237 336127 376800 428438 477025 520223 557909
11111 557909 580843 588689 566399 537550 501379 458921 420613 390182 368821 365307 366665 374392
11099 374392 360218 354372 363503 381174 396246 401390 407558 405354 421160 436763 458806 470317
11087 470317 467732 454413 443319 461099 493721 542248 577861 603373 610962 603034 597973 607492
11075 607492 600131 573941 556939 532524 521397 508342 496573 489104 472619 458606 441352 422948
11063 422948 420424 406249 385265 353160 343947 336656 340577 336778 344199 367520 380008 406021 436166
$$ packed form
11148B67023j5112k6108j9495n004l36j0158K292l766p133k732L247R066o964
11135A84820p855J4881j1819j4133J8009L159r066J0278K467j375J747p549M184
11122A87748J7297J1335J0163K7606L9088M2890M0673N1638M8587M3198L7686
11111E57909K2934P846k2290k8849l6171m2458l8308l0431k1361l514J358P727
11099C74392j4174n846R131J7671J5072N144O168k204J5806J5603K2043J1511
11087D70317k585j3319j1094J7780L2622M8527L5613K5512P589p928n061R519
11075F07492p361k6190j7002k4415j1127j3055j1769p469j6485j4013j7254j8404
11063D22948k524j4175k0984l2105r213p291L921l799P421K3321J2488K6013L0145
$$ plain form
11050 436166 465389 505071 530482 538514 533388 516944 491609 475263 447754 412950 385969 347844
11038 347844 301299 278428 276901 257298 241678 234381 219581 209234 200961 195957 182565 173662
11026 173662 176840 177170 178063 188103 185536 191325 180788 164518 167534 182894 176670 152217 149806
11013 149806 151708 147458 141761 126090 126618 122552 121235 118801 120675 135000 137680 136715 136355 140592
10999 140592 134724 126197 122276 124703 138249 143086 135986 123699 116941 120684 120278 127082 126735 124037
10985 124037 114418 109819 108649 115076 114374 132038 135367 141175 147230 141583 139543 137703 120579 105800
10971 105800 114065 122919 125147 125327 131405 140038 138103 137845 117907 108706 107824 118421 111307 124228
10957 124228 128286 131006 133012 126755 115227 119974 132983 143784 151038 156963 154734 159867 172943
$$ packed form
11050D36166K9223L9682K5411Q032n126j6444k5335j6346k7509l4804k6981l8125
11038C47844m6545k2871j527j9603j5620p297j4800j0347q273n004j3392q903
11026A73662L178L30Q93J0040k567N789j0537j6270L016J5360o224k4453k411
11013A49806J902m250n697j5671N28m066j317k434J874J4325K680r65l60M237
10999A40592n868q527l921K427J3546M837p100j2287o758L743m06O804l47k698
10985A24037r619m599j170O427p02J7664L329N808O055n647k040j840j7124j4779
10971A05800Q265Q854K228J80O078Q633j935k58j9938r201q82J0597p114J2921
10957A24228M058K720K006o257j1528M747J3009J0801P254N925k229N133J3076
$$ plain form
10944 172943 168053 152363 160159 171429 172103 169643 167996 169330 151171 136675 145090 160322 161490
10931 161490 153223 142024 142088 154209 183117 196916 185376 173773 175219 190223 199720 192834 186209
10918 186209 177696 178292 186852 200426 203427 200384 201832 194065 159461 140191 145874 171619 188948
10905 188948 190155 175661 167717 170115 166543 158889 148643 136560 139066 140293 149105 151919 136616
10892 136616 127737 121641 114119 123488 123614 144346 157151 139238 134099 146941 165606 164414 161169
10879 161169 164296 162053 152666 138890 125312 121910 113004 109299 108460 107496 111345 127214 121307 109672
10865 109672 109745 104783 111128 126778 144347 152979 161233 154447 140070 134741 129014 134743 132119 139003
10851 139003 147960 160706 161318 155459 153673 170520 169542 163459 161330 156001 172070 197321 206574 211674
$$ packed form
10944A72943m890j5690P796J1270O74k460j647J334j8159j4496Q415J5232J168
10931A61490q267j1199O4J2121K8908J3799j1540j1603J446J5004R497o886o625
10918A86209q513N96Q560J3574L001l043J448p767l4604j9270N683K5745J7329
10905A88948J207j4494p944K398l572p654j0246j2083K506J227Q812K814j5303
10892A36616q879o096p522R369J26K0732J2805j7913n139J2842J8665j192l245
10879A61169L127k243r387j3776j3578l402q906l705q39r64L849J5869n907j1635
10865A09672P3m962O345J5650J7569Q632Q254o786j4377n329n727N729k624O884
10851A39003Q957J2746O12n859j786J6847r78o083k129n329J6069K5251R253N100
$$ plain form
10837 211674 203924 208919 215967 208519 206493 215127 230034 242899 240044 236612 243775 266190 290650
10824 290650 285029 289824 303357 312730 337903 362827 387944 405678 410134 416192 419494 439467 469384
10811 469384 483779 532417 577812 625560 644619 659159 667386 673735 688636 689774 666162 637383
10799 637383 621082 605859 594787 588500 577963 581006 591610 601541 602216 608265 613388 609044 612357
10786 612357 614923 615126 599600 599022 600628 615674 618281 618598 622213 637483 658844 658986 662011 669489
10772 669489 654980 644175 632804 627333 653487 667812 687468 704137 720253 740124 757638 767648
10760 767648 789343 814417 845771 870859 897105 913313 934719 948032 967135 1000630 1030031
10749 1030031 1095648 1164676 1222050 1306561 1443974 1619550 1836994 2124930 2440841 2690771
$$ packed form
10837B11674p750M995P048p448k026Q634J4907J2865k855l432P163K2415K4460
10824B90650n621M795J3533R373K5173K4924K5117J7734M456O058L302J9973K9917
10811D69384J4395M8638M5395M7748J9059J4540Q227O349J4901J138k3612k8779
10799F37383j6301j5223j1072o287j0537L043J0604R931O75O049N123m344L313
10786F12357K566K03j5526n78J606J5046K607L17L615J5270K1361J42L025P478
10772F69489j4509j0805j1371n471K6154J4325J9656J6669J6116J9871J7514J0010
10760G67648K1695K5074L1354K5088K6246J6208K1406J3313J9103L3495K9401
10749A030031O5617O9028N7374Q4511J37413J75576K17444K87936L15911K49930
$$ plain form
10739 2690771 2813540 2843405 2852795 2754359 2533245 2287882 2116094 2016879 1961135 1954964 1975284
10728 1975284 2023592 2086890 2161467 2257958 2366122 2475350 2576620 2690631 2830740 2981410
10718 2981410 3149226 3378781 3655383 3974598 4343767 4773541 5258159 5854694 6517801
10709 6517801 7257482 8096659 9068202 10197284 11542901 13183035 15236614 17823002 21132567
10700 21132567 25342525 30716394 37464361 45679154 55212266 65508674 75508843 83865258
10692 83865258 89511598 91956381 91117714 87067320 80284843 72057108 63855600 56660826
10684 56660826 50988253 46989485 44547802 43489583 43580302 44651690 46573096 49175855
10676 49175855 52202504 55391991 58406588 60984791 63033665 64563019 65691638 66641448
$$ packed form
10739B690771J22769K9865R390r8436k21114k45363j71788r9215n5744o171K0320
10728A975284M8308O3298P4577R6491J08164J09228J01270J14011J40109J50670
10718B981410J67816K29555K76602L19215L69169M29774M84618N96535O63107
10709F517801P39681Q39177R71543J129082J345617J640134K053579K586388L309565
10700B1132567M209958N373869O747967Q214793R533112J0296408J0000169Q356415
10692H3865258N646340K444783q38667m050394o782477q227735q201508p194774
10684E6660826n672573l998768k441683j058219R0719J071388J921406K602759
10676D9175855L026649L189487L014597K578203K048874J529354J128619R49810
$$ plain form
10668 66641448 67793966 69543613 72187587 75890862 80608464 86029954 91637428 96751921
10660 96751921 100743456 103100950 103535155 102031284 98913838 94664864 89914013 85367437
10652 85367437 81527882 78503309 76119917 74061753 71968274 69621898 66909013 63781830
10644 63781830 60309356 56723869 53332558 50380608 48051950 46452239 45682597 45814698
10636 45814698 47011344 49450733 53286361 58587409 65255035 72804346 80230703 86302034
10628 86302034 90018597 90901543 88871477 84012859 76746006 68074119 59286269 51350238
10620 51350238 44649224 39159891 34737123 31177189 28286680 25923215 23961515 22293150
10612 22293150 20886449 19682977 18634881 17722800 16906422 16139024 15428254 14789738 14201165
$$ packed form
10668F6641448J152518J749647K643974L703275M717602N421490N607474N114493
10660I6751921L991535K357494M34205j503871l117446m248974m750851m546576
10652H5367437l839555l024573k383392k058164k093479k346376k712885l127183
10644F3781830l472474l585487l391311k951950k328658j599711p69642J32101
10636D5814698J196646K439389L835628N301048O667626P549311P426357O071331
10628H6302034L716563Q82946k030066m858618p266853q671887q787850p936031
10620E1350238o701014n489333m422768l559934k890509k363465j961700j668365
10612B2293150j406701j203472j048096r12081q16378p67398p10770o38516n88573
$$ plain form
10603 14201165 13630278 13082080 12572110 12090109 11626465 11188968 10776606 10391172 10031116
10594 10031116 9686853 9363888 9054517 8767369 8476511 8205448 7953524 7714049 7485011
10585 7485011 7266323 7063541 6862069 6665949 6491773 6316339 6153293 6006637 5852171
10576 5852171 5685894 5549329 5421345 5284516 5136741 4995682 4866810 4715767 4578056
10567 4578056 4463171 4350337 4228776 4113678 3992365 3899459 3817735 3724876 3615536 3529097
10557 3529097 3438128 3342422 3271490 3181672 3093726 3018106 2963588 2898937 2847579 2784887 2715953
10546 2715953 2652930 2581285 2519827 2475069 2418823 2354352 2285124 2229839 2187324 2147836 2112216
10535 2112216 2078652 2051523 2014000 1964041 1912181 1868531 1832686 1782385 1743541 1704689 1663883
$$ packed form
10603A4201165n70887n48198n09970m82001m63644m37497m12362l85434l60056
10594A0031116l44263l22965l09371k87148k90858k71063k51924k39475k29038
10585G485011k18688k02782k01472j96120j74176j75434j63046j46656j54466
10576E852171j66277j36565j27984j36829j47775j41059j28872j51043j37711
10567D578056j14885j12834j21561j15098j21313r2906q1724r2859j09340q6439
10557C529097r0969r5706p0932q9818q7946p5620n4518o4651n1358o2692o8934
10546B715953o3023p1645o1458m4758n6246o4471o9228n5285m2515l9488l5620
10535B112216l3564k7129l7523m9959n1860m3650l5845n0301l8844l8852m0806
$$ plain form
10524 1663883 1638237 1589659 1544495 1521402 1496983 1471313 1475519 1481538 1481008 1484684 1494185 1491399 1499795
10511 1499795 1507885 1493509 1469734 1449741 1419556 1397522 1365142 1324600 1293042 1262609 1233653
10500 1233653 1216771 1192971 1170233 1156141 1149993 1132974 1121529 1111532 1102549 1104025 1089246 1074802
10488 1074802 1049476 1030405 999613 977885 960493 946161 938137 926665 925823 914391 904447 897068
10476 897068 884473 884558 868500 863231 858782 838659 822783 802388 793330 782015 769192 752192 740835
10463 740835 732315 723027 721540 725396 722884 736668 744567 761432 785446 802396 824551 867045 900935
10450 900935 913173 901308 907099 897758 904434 904396 868560 805862 774513 750024 725134 705026 692387
10437 692387 700724 718325 725145 722171 726715 729755 721869 728870 730130 717321 713662 723836 730253
$$ packed form
10524A663883k5646m8578m5164k3093k4419k5670M206O019n30L676R501k786Q396
10511A499795Q090j4376k3775j9993l0185k2034l2380m0542l1558l0433k8956
10500A233653j6882k3800k2738j4092o148j7019j1445r997q983J476j4779j4444
10488A074802k5326j9071l0792k1728j7392j4332q024j1472q42j1432r944p379
10476H97068j2595Q5j6058n269m449k0123j5876k0395r058j1315j2823j7000j1357
10463G40835q520r288j487L856k512J3784P899J6865K4014J6950K2155M2494L3890
10450I00935J2238j1865N791r341O676l8l5836o2698l1349k4489k4890k0108j2639
10437F92387Q337J7601O820k974M544L040p886P001J260j2809l659J0174O417
$$ plain form
10424 730253 748006 756576 756076 749791 750203 741511 738216 749182 755905 767196 773093 771965 767106 760413
10410 760413 769944 784332 779894 758483 748402 761665 768804 758666 741417 734245 751967 772253
10398 772253 776703 792979 805030 828195 841160 834337 812246 830155 827117 809086 812819 817524
10386 817524 822503 849003 854442 849621 868437 890400 922327 936534 965830 1022628 1096021 1179220
10374 1179220 1254230 1334703 1413101 1486557 1538694 1565028 1576121 1559022 1525621 1508928 1517845
10363 1517845 1572079 1650756 1761410 1895609 2045638 2223887 2432341 2641339 2834380 3033345
10353 3033345 3248274 3455066 3617489 3773734 3946012 4173703 4449224 4773072 5186862
10344 5186862 5710979 6392566 7279053 8432316 9808993 11223495 12577352 13959306 15493549
$$ packed form
10424G30253J7753Q570n00o285M12q692l295J0966O723J1291N897j128m859o693
10410G60413R531J4388m438k1411j0081J3263P139j0138j7249p172J7722K0286
10398G72253M450J6276J2051K3165J2965o823k2091J7909l038j8031L733M705
10386H17524M979K6500N439m821J8816K1963L1927J4207K9296N6798P3393Q3199
10374A179220P5010Q0473P8398P3456N2137K6334J1093j7099l3401j6693Q917
10363A517845N4234P8677J10654J34199J50029J78249K08454K08998J93041J98965
10353C033345K14929K06792J62423J56245J72278K27691K75521L23848M13790
10344E186862N24117O81587Q86487J153263J376677J414502J353857J381954J534243
$$ plain form
10335 15493549 17165160 18977683 21230974 24362015 28694293 34541028 42467476 53457254
10327 53457254 69223420 92737550 128618119 181046450 244863299 298356304 322723098
10320 322723098 326925242 326304778 313452556 266549016 199829082 146203796 111253710
10313 111253710 88740212 73603035 62960078 55195396 49374738 44969546 41660749
10306 41660749 39177595 37225312 35512937 33903106 32393130 30967007 29467676 27876256
10298 27876256 26376787 25038124 23823026 22691798 21603660 20538733 19552553 18647765
10290 18647765 17828729 17097898 16446187 15845120 15267181 14710362 14155904 13649175 13191454
10281 13191454 12782785 12376027 11978813 11616086 11268122 10909698 10536644 10162817 9781468
$$ packed form
10335A5493549J671611J812523K253291L131041M332278N846735P926448J0989778
10327E3457254J5766166K3514130L5880569N2428331O3816849N3493005K4366794
10320C22723098M202144o20464j2852222m6903540o6719934n3625286l4950086
10313A11253710k2513498j5137177j0642957p764682n820658m405192l308797
10306D1660749k483154j952283j712375j609831j509976j426123j499331j591420
10298B7876256j499469j338663j215098j131228j088138j064927r86180r04788
10290A8647765q19036p30831o51711o01067n77939n56819n54458n06729m57721
10281A3191454m08669m06758l97214l62727l47964l58424l73054l73827l81349
$$ plain form
10272 9781468 9403324 9050924 8750564 8502093 8306706 8142772 7977460 7801828 7616846
10263 7616846 7441554 7232562 7014749 6789191 6558147 6364427 6169348 5976778 5804008
10254 5804008 5634676 5477589 5339369 5195598 5056839 4926290 4804493 4682493 4576745
10245 4576745 4477109 4378773 4293601 4213806 4129002 4066281 4006974 3926795 3847842 3766914 3700717
10234 3700717 3646973 3595218 3524891 3452905 3389729 3311556 3223805 3139832 3049849 2974390 2912100
10223 2912100 2841499 2783842 2730929 2651457 2569947 2519231 2462618 2404770 2351061 2314725 2269529
10212 2269529 2215634 2154873 2124266 2098872 2077945 2061100 2050737 2044359 2055586 2069366 2082052
10201 2082052 2083462 2056677 2003521 1960698 1916043 1842787 1749887 1679954 1639635 1605983 1539833
$$ packed form
10272I781468l78144l52400l00360k48471j95387j63934j65312j75632j84982
10263G616846j75292k08992k17813k25558k31044j93720j95079j92570j72770
10254E804008j69332j57087j38220j43771j38759j30549j21797j22000j05748
10245D576745r9636r8336q5172p9795q4804o2721n9307q0179p8953q0928o6197
10234C700717n3744n1755p0327p1986o3176p8173q7751q3973q9983p5459o2290
10223B912100p0601n7657n2913p9472q1510n0716n6613n7848n3709l6336m5196
10212B269529n3895o0761l0607k5394k0927j6845j0363o378J1227J3780J2686
10201B082052J410k6785n3156m2823m4655p3256r2900o9933m0319l3652o6150
$$ plain form
10190 1539833 1464798 1409108 1356937 1320007 1305039 1282189 1253586 1241334 1223565 1201610 1170415
10179 1170415 1129658 1087273 1037592 1017770 1025301 1028933 1008775 986877 974450 952391 944583 934516
10167 934516 919901 911884 897464 879469 873084 859824 834214 808564 786165 767725 762048 760457
10155 760457 749258 731167 704548 677424 680596 675852 672008 676848 659420 644806 638417 650967
10143 650967 666885 660182 652372 634501 625624 606652 562965 537907 526621 499123 484407 480238
10131 480238 485759 494547 530762 552280 562726 572062 565535 564274 563239 568960 571829 558704 538142
10118 538142 524342 517964 525958 529258 520401 506549 498414 476688 447037 437007 448828 447794 414253
10105 414253 381812 386717 397052 401129 406598 412926 423885 434900 435834 425832 416910 389093 373622
$$ packed form
10190A539833p5035n5690n2171l6930j4968k2850k8603j2252j7769k1955l1195
10179A170415m0757m2385m9681j9822P531L632k0158k1898j2427k2059p808j0067
10167I34516j4615q017j4420j7995o385j3260k5610k5650k2399j8440n677j591
10155G60457j1199j8091k6619k7124L172m744l844M840j7428j4614o389J2550
10143F50967J5918o703p810j7871q877j8972m3687k5058j1286k7498j4716m169
10131D80238N521Q788L6215K1518J0446R336o527j261j035N721K869j3125k0562
10118E38142j3800o378P994L300q857j3852q135k1726k9651j0030J1821j034l3541
10105D14253l2441M905J0335M077N469O328J0959J1015R34j0002q922k7817j5471
$$ plain form
10092 373622 375995 373821 367882 366832 365214 374201 379991 381293 383774 386330 371939 365415 373511 389006
10078 389006 387168 381437 388118 412575 417863 428191 436388 445982 458706 469204 475603 482288 481766
10065 481766 500818 514966 532983 560966 595586 613389 631018 658166 687986 720113 756445
10054 756445 802022 831484 858263 891533 923927 971167 1019498 1089653 1162866 1200274 1246812
10043 1246812 1296196 1334199 1362060 1391556 1400157 1397887 1391900 1394032 1386640 1337292 1302537 1268665
10031 1268665 1237796 1203170 1158891 1113961 1088548 1053643 1014967 977652 946038 904625 864567
10020 864567 829265 787229 771046 762313 742976 701353 677739 659529 636672 610699 578809 557631
10008 557631 541707 523665 502619 488842 488048 482177 479705 457490 417161 395313 376128 353914
$$ packed form
10092C73622K373k174n939j050j618Q987N790J302K481K556j4391o524Q096J5495
10078C89006j838n731O681K4457N288J0328Q197R594J2724J0498O399O685n22
10065D81766J9052J4148J8017K7983L4620J7803J7629K7148K9820L2127L6332
10054G56445M5577K9462K6779L3270L2394M7240M8331P0155P3213L7408M6538
10043A246812M9384L8003K7861K9496Q601k270n987K132p392m9348l4755l3872
10031A268665l0869l4626m4279m4930k5413l4905l8676l7315l1614m1413m0058
10020H64567l5302m2036j6183q733j9337m1623k3614j8210k2857k5973l1890k1178
10008E57631j5924j8042k1046j3777p94n871k472k2215m0329k1848j9185k2214
$$ plain form
9996 353914 347265 341140 341718 342088 341301 333512 311439 303955 312991 306590 304570 298712 288815 285777 284682
9981 284682 279187 258468 241055 249695 260834 255343 221683 202158 194843 198023 194391 195193 175099
9968 175099 172715 172395 177432 170397 165220 165352 161915 162399 164013 166606 165116 155438 148793 147767 155466
9953 155466 140232 124222 123425 120842 133048 134240 134908 133405 132459 128077 117905 112096 116984 116870
9939 116870 109805 113420 104360 100454 99827 102717 102472 100282 100069 111073 114562 129300 126927 120950 124039
9924 124039 115325 111174 103128 98824 115426 127569 135852 135688 135140 143342 155295 165213 162016 169108
9910 169108 186658 208724 223376 242339 267369 282546 331284 408155 503117 650222 854452
9899 854452 1112240 1395712 1605662 1711561 1743518 1706945 1584515 1344137 1083768 866140
$$ packed form
9996C53914o649o125N78L70p87p789k2073p484R036o401k020n858r897l038j095
9981B84682n495k0719j7413Q640J1139n491l3660j9525p315L180l632Q02k0094
9968A75099k384l20N037p035n177J32l437M84J614K593j490r678o645j026P699
9953A55466j5234j6010p97k583J2206J192O68j503r46m382j0172n809M888j14
9939A16870p065L615r060l906o27K890k45k190k13J1004L489J4738k373n977L089
9924A24039q714m151q046m304J6602J2143Q283j64n48Q202J1953R918l197P092
9910A69108J7550K2066J4652J8963K5030J5177M8738P6871R4962J47105K04230
9899H54452K57788K83472K09950J05899L1957l6573j22430k40378k60369k17628
$$ plain form
9889 866140 707269 584056 495056 420696 366567 351369 334890 294813 279745 273388 263606 246563
9877 246563 237460 238371 229150 231595 224381 201298 178289 166631 162745 159004 161560 149959 142074 147171
9863 147171 150797 148252 136268 131535 136577 141792 150685 152845 126106 121225 105531 98214 90259 86888
9849 86888 88562 95037 107217 109176 95433 84023 101060 118454 128034 118237 109529 107606 93017
9836 93017 87095 98180 103141 95390 103294 101224 106864 96588 79606 77290 64183 73666 81009 78525
9822 78525 70627 60752 63384 68351 57506 61199 69478 75396 62770 61584 61717 54839 48810 52772
9808 52772 56658 68515 75068 69958 48352 31391 22519 36097 42818 40083 47659 48547 43999 46479
9794 46479 58736 61187 62949 56047 57643 69058 70591 70725 52001 35422 31412 44869 52623 52849
$$ packed form
9889H66140j58871j23213q9000p4360n4129j5198j6479m0077j5068o357r782j7043
9877B46563r103R11r221K445p214k3083k3009j1658l886l741K556j1601p885N097
9863A47171L626k545j1984m733N042N215Q893K160k6739m881j5694p317p955l371
9849H6888J674O475J2180J959j3743j1410J7037J7394R580r797q708j923j4589
9836I3017n922J1085M961p751P904k070N640j0276j6982k316j3107R483P343k484
9822G8525p898r875K632M967j0845L693Q279N918j2626j186J33o878o029L962
9808E2772L886J1857O553n110k1606j6961q872J3578O721k735P576Q88m548K480
9794D6479J2257K451J762o902J596J1415J533J34j8724j6579m010J3457P754K26
$$ plain form
9780 52849 46140 56049 61561 49811 45442 51959 51530 58148 53075 59931 53024 45965 35046 34211 34874
9765 34874 40604 30347 28657 26339 26994 36767 42708 36911 30358 34116 37865 46518 50010 41940 32255
9750 32255 28939 29859 22991 27328 30316 32209 31296 22706 29433 27933 24621 16987 21577 37436 36286
9735 36286 33227 31689 18266 13882 9306 15212 25691 21318 8667 11571 14214 9366 11609 21733
9721 21733 18784 22204 21058 29827 39634 43087 43284 31683 23637 14384 20423 42687 38306 36615
9707 36615 42375 39207 34017 35883 27953 42608 43476 30659 35173 53069 52422 41787 36758 27512
9693 27512 37786 51419 71277 73869 82956 77214 58702 41625 34504 25418 24257 13085 14592
9680 14592 33464 36652 23733 6578 -11837 -4466 -1170 12004 31681 36190 41000 39644 28235
$$ packed form
9780E2849o709R909N512j1750m369O517m29O618n073O856o907p059j0919q35O63
9765C4874N730j0257j690k318O55R773N941n797o553L758L749Q653L492q070r685
9750C2255l316R20o868M337K988J893r13q590O727j500l312p634M590J5859j150
9735C6286l059j538j3423m384m576N906J0479m373j2651K904K643m848K243J0124
9721B1733k949L420j146Q769R807L453J97j1601q046r253O039K2264m381j691
9707C6615N760l168n190J866p930J4655Q68j2817M514J7896o47j0635n029r246
9693B7512J0274J3633J9858K592R087n742j8512j7077p121r086j161j1172J507
9680A4592J8872L188j2919j7155j8415P371L296J3174J9677M509M810j356j1409
$$ plain form
9667 28235 25186 28410 34699 37262 38355 35845 19568 19001 29615 47786 41598 44956 50631 36736
9653 36736 39255 42123 35721 19229 12835 24230 26233 20467 14528 -1186 -3100 5243 19234 30867
9639 30867 25670 26666 11717 8550 11065 22931 24951 20459 24356 36148 63980 57869 52831 60773
9625 60773 54963 31533 28949 34992 30172 24535 19330 7139 -4620 2787 24691 35461 25312
9612 25312 14452 -7566 -4561 15770 17727 21623 29758 28787 25505 25680 9723 4611 -3335 148
9598 148 5545 195 5945 -5724 -8186 5271 11963 10302 17851 13061 15501 23676 6804 4362
9584 4362 12256 15868 11463 25742 31494 27497 19975 20033 18385 5283 9995 9747 6632 6879 16043
9569 16043 11244 6461 5755 8653 914 -1938 -3194 10736 12057 17080 12049 -2975 11292 15449
$$ packed form
9667B8235l049L224O289K563J093k510j6277n67J0614J8171o188L358N675j3895
9653C6736K519K868o402j6492o394J1395K003n766n939j5714j914Q343J3991J1633
9639C0867n197R96j4949l167K515J1866K020m492L897J1792K7832o111n038P942
9625F0773n810k3430k584O043m820n637n205j2191j1759P407K1904J0770j0149
9612B5312j0860k2018L005K0331J957L896Q135r71l282J75j5957n112p946L483
9598A48N397n350N750j1669k462J3457O692j661P549m790K440Q175j6872k442
9584D362P894L612m405J4279N752l997p522N8j648j3102M712k48l115K47R164
9569A6043m799m783p06K898p739k852j256J3930J321N023n031j5024J4267M157
$$ plain form
9555 15449 26285 11304 7823 -49 1634 14936 30006 32454 21752 8894 11070 22865 32995
9542 32995 27434 30152 38094 37913 48755 59741 43495 31295 33102 34586 23655 31760 33892 26066
9528 26066 27016 19848 31870 33692 28341 23228 8390 11545 26553 15774 15113 19395 22354 23374
9514 23374 22181 18514 14528 15932 20694 18173 34526 37450 30308 29482 34866 34467 25617 36883 42515
9499 42515 34726 15392 7904 7222 8816 14954 10134 22564 36925 29845 18744 12099 14526 9310
9485 9310 14075 25837 29407 22005 25481 30179 19472 15145 34287 54474 48961 30145 19365
9472 19365 22029 17462 13043 6606 11995 26301 34116 21172 12037 12936 19695 30451 25577 16813
9458 16813 9824 26206 30273 38825 36991 25510 20528 20310 24014 38886 36394 21095 2503 -4767
$$ packed form
9555A5449J0836j4981l481p872J683J3302J5070K448j0702j2858K176J1795J0130
9542C2995n561K718P942j81J0842J0986j6246j2200J807J484j0931Q105K132p826
9528B6066R50p168J2022J822n351n113j4838L155J5008j0779o61M282K959J020
9514B3374j193l667l986J404M762k521J6353K924p142q26N384l99q850J1266N632
9499D2515p789j9334p488o82J594O138m820J2430J4361p080j1101o645K427n216
9485I310M765J1762L570p402L476M698j0707m327J9142K0187n513j8816j0780
9472A9365K664m567m419o437N389J4306P815j2944r135Q99O759J0756m874q764
9458A6813o989J6382M067Q552j834j1481m982k18L704J4872k492j5299j8592p270
$$ plain form
9444 -4767 -7254 188 4556 -529 -9080 4255 27160 27495 20171 15654 6865 -2835 -732 9791
9430 9791 -6290 -10272 4536 13851 19518 10410 18340 16231 25598 23089 18741 25951 10702 13440
9416 13440 21896 20078 14290 26844 22028 3810 -5752 -9615 -2685 9838 3145 3274 14196 14350
9402 14350 24245 27559 15299 15602 19042 19663 11198 3444 16389 19318 22635 24172 22945 15466 23756
9387 23756 30103 36596 43244 45329 39614 39689 23165 17482 13627 25749 30112 24232 20212 6203
9373 6203 10703 -1159 -1456 1167 6622 5457 -3333 4777 5355 1977 1213 4694 5371 14183 27807
9358 27807 30323 31692 39499 33814 22178 5097 -1586 -7316 -10698 -8944 -12615 -7469 5045 1257
9344 1257 -11504 -16909 -9227 5376 10313 10811 6143 1200 -7069 -2622 21206 12525 6834 20131
$$ packed form
9444d767k487P442M368n085q551J3335K2905L35p324m517q789r700K103J0523
9430I791j6081l982J4808R315N667r108P930k109R367k509m348P210j5249K738
9416A3440Q456j818n788J2554m816j8218r562l863O930J2523o693J29J0922J54
9402A4350R895L314j2260L03L440O21q465p754J2945K929L317J537j227p479Q290
9387B3756O347O493O648K085n715P5j6524n683l855J2122M363n880m020j4009
9373F203M500j1862k97K623N455j165q790Q110N78l378p64L481O77Q812J3624
9358B7807K516J369P807n685j1636j7081o683n730l382J754l671N146J2514l788
9344A257j2761n405P682J4603M937M98m668m943q269M447K3828q681n691J3297
$$ plain form
9330 20131 23691 16494 -3460 -19838 -14581 387 4423 5150 1152 9826 8656 5924 5108 13084
9316 13084 6748 -4449 5688 5241 -3356 -12582 -12777 -8775 -13590 -15446 -8731 2030 8184 16618
9302 16618 23173 28518 22390 9423 44 6008 -2742 7976 11229 14673 14077 6953 13219 4683
9288 4683 2175 12568 16168 18268 17584 5800 4735 12611 12328 12293 3514 12429 9685 3784 3059 4957
9272 4957 -5513 4510 6171 -8628 -30148 -12710 19158 25963 20289 13441 6444 1711 11780
9259 11780 19937 13752 7420 4 6982 10373 7504 15031 26537 31400 35466 38661 41798 26819
9245 26819 26049 18495 13642 8773 11929 35731 42860 27715 18131 23434 29465 26506 14533 16571
9231 16571 6631 -6448 1143 -895 1475 4566 17288 14842 7040 -5809 -6429 -2551 3602 16086
$$ packed form
9330B0131L560p197j9954j6378N257J4968M036P27l998Q674j170k732q16P976
9316A3084o336j1197J0137m47q597r226j95M002m815j856O715J0761O154Q434
9302A6618O555N345o128j2967r379N964q750J0718L253L444n96p124O266q536
9288D683k508J0393L600K100o84j1784j065P876k83l5q779Q915k744n901p25J898
9272D957j0470J0023J661j4799k1520J7438L1868O805n674o848o997m733J0069
9259A1780Q157o185o332p416O978L391k869P527J1506M863M066L195L137j4979
9245B6819p70p554m853m869L156K3802P129j5145r584N303O031k959j1973K038
9231A6571r940j3079P591k038K370L091J2722k446p802j2849o20L878O153J2484
$$ plain form
9217 16086 18358 23281 8285 23734 41196 38972 30584 17476 4918 12267 22240 20516 16399
9204 16399 6329 2304 5470 4447 14010 11546 14235 13485 12891 8898 8661 27890 27414 26717 17546
9189 17546 6360 -6596 -6511 784 395 3275 5473 -3337 -4518 4954 7260 11273 3449 -4179 -12092
9174 -12092 -13306 -6481 11472 12642 14770 7909 12888 21021 13798 14425 20751 14528 20959 27531 17790
9159 17790 11423 12520 -2851 -16832 -12597 10863 27495 30372 35993 37807 16847 9760 16168
9146 16168 12016 6450 8861 24120 29091 35259 39404 32888 15870 9422 10505 19978 29548 31976
9132 31976 30766 11087 2085 3600 7609 8834 -631 -4025 -12025 -14336 -11782 719 5142 11971
9118 11971 9099 12746 15649 12315 3474 -5276 -8499 -6779 -3384 7145 14852 17643 7538 -460
$$ packed form
9217A6086K272M923j4996J5449J7462k224q388j3108j2558P349R973j724m117
9204A6399j0070m025L166j023R563k464K689p50n94l993k37J9229m76o97r171
9189A7546j1186j2956Q5P295l89K880K198q810j181R472K306M013p824p628p913
9174a2092j214O825J7953J170K128o861M979Q133p223O27O326o223O431O572r741
9159A7790o367J097j5371j3981M235K3460J6632K877N621J814k0960p087O408
9146A6168m152n566K411J5259M971O168M145o516j7018o448J083R473R570K428
9132C1976j210j9679r002J515M009J225r465l394q000k311K554J2501M423O829
9118A1971k872L647K903l334q841q750l223J720L395J0529P707K791j0105p998
$$ plain form
9104 -460 -190 3697 13633 15967 32538 39526 38135 28269 18761 25683 20241 5052 5756 -3034 -5552
9089 -5552 3170 6798 4440 16964 13413 15293 16776 15641 17940 17546 20297 10780 8064 25340 38912
9074 38912 30197 13133 -5720 -19468 -17277 -4652 20769 23951 16636 24790 8894 5680 13694
9061 13694 20397 24966 22700 27255 21732 12176 28410 30217 29625 37522 46314 41386 28543 19477
9047 19477 11721 267 -7243 -3663 -5116 -25386 -28517 -17419 -12718 -12572 756 -2814 -12538 -10785
9033 -10785 -6206 -1282 -9366 -3007 19650 18420 4301 774 9470 20930 26572 38382 31548 28888
9019 28888 14768 4602 14031 4057 -3980 313 5333 7640 16204 19147 2448 3849 12009 24931
9005 24931 24447 12700 5648 2100 19935 20750 16839 15217 16387 7774 9713 -81 -8865 -10626 -3843
$$ packed form
9104d60K70L887R936K334J6571O988j391r866r508O922n442j5189P04q790k518
9089e552Q722L628k358J2524l551J880J483j135K299l94K751r517k716J7276J3572
9074C8912q715j7064j8853j3748K191J2625K5421L182p315Q154j5896l214Q014
9061A3694O703M569k266M555n523r556J6234J807n92P897Q792m928j2843r066
9047A9477p756j1454p510L580j453k0270l131J1098M701J46J3328l570r724J753
9033a0785M579M924q084O359K2657j230j4119l527Q696J1460N642J1810o834k660
9019B8888j4120j0166R429r974q037M293N020K307Q564K943j6699J401Q160J2922
9005B4931m84j1747p052l548J7835Q15l911j622J170q613J939r794q784j761O783
$$ plain form
8990 -3843 8824 21242 25364 39164 34558 32386 39898 29735 9801 -24 26203 42736 35715
8977 35715 18907 7299 4500 1891 9622 18874 16590 -1331 -12992 -16001 -2338 -34 2998
8964 2998 3096 12298 20767 9585 6274 7906 21036 15811 5452 16231 25626 18621 21319 16622
8950 16622 9872 10427 17785 26406 11287 11991 4561 -1405 -451 3037 -5876 -12040 -14261 -16990 -13120
8935 -13120 -13724 -22340 -16729 -7295 -3064 6329 27527 19366 298 -3309 3737 2944 12137 6619 15097
8920 15097 20689 17979 6852 -11609 -22663 -13685 -15613 2450 -16 -21163 -4624 14119 14462
8907 14462 21867 16826 18141 18894 7238 4332 2523 1506 -7644 -884 11457 12903 51 -8123
8893 -8123 -4115 -3975 -9917 -8035 -9139 -4330 -2514 -3613 -7981 5468 3100 3578 8050 8774 -2311
$$ packed form
8990c843J2667J2418M122J3800m606k172P512j0163j9934r825K6227J6533p021
8977C5715j6808j1608k799k609P731R252k284j7921j1661l009J3663K304L032
8964B998R8R202Q469j1182l311J632J3130n225j0359J0779R395p005K698m697
8950A6622o750N55P358Q621j5119P04p430n966R54L488q913o164k221k729L870
8935a3120o04q616N611R434M231R393K1198q161j9068l607P046p93R193n518Q478
8920A5097N592k710j1127j8461j1054Q978j928J8063k466k1147J6539J8743L43
8907A4462P405n041J315P53j1656k906j809j017r150O760J2341J446j2852q174
8893h123M008J40n942J882j104M809J816j099m368J3449k368M78M472P24j1085
$$ plain form
8878 -2311 -58 8453 22433 14990 7667 14258 15021 25034 26523 27597 10919 -8850 -4112 1530
8864 1530 11150 17262 15348 18863 13220 19114 15044 -1101 -1662 9394 12160 14446 13733 16256 25507
8849 25507 31379 20452 11520 9706 10161 370 7614 -2421 -5017 -4766 1651 -4445 -12465 -5824 1148
8834 1148 4035 -192 -19 7413 -593 6892 3995 -3144 -4142 -187 7403 5275 12457 9659 -12354
8819 -12354 -14149 -14255 -14145 -5271 9507 5850 -13950 -15626 -4029 201 2446 8237 3415 2824 372
8804 372 14657 25932 22626 8164 6412 15104 14496 4662 6306 -9075 -1403 11627 9400 1154
8790 1154 768 967 10913 6428 4978 -9449 -1040 -887 1979 28695 40207 31626 20249 21741 21230
8775 21230 16781 -8924 -22339 -17111 -10698 3554 737 245 6620 9688 17619 22707 25317 22292
$$ packed form
8878b311K253Q511J3980p443p323O591P63J0013J489J074j6678j9769M738N642
8864A530R620O112j914L515n643N894m070j6145n61J1056K766K286p13K523R251
8849B5507N872j0927q932j814M55r791P244j0035k596K51O417o096q020O641O972
8834A148K887m227J73P432q006P485k897p139r98L955P590k128P182k798k2013
8819a2354j795j06J10Q874J4778l657j9800j676J1597M230K245N791m822n91k452
8804C72J4285J1275l306j4462j752Q692o08r834J644j5381P672J3030k227q246
8790A154l86J99R946m485j450j4427Q409J53K866K6716J1512q581j1377J492n11
8775B1230m449k5705j3415N228O413J4252k817m92O375L068P931N088K610l025
$$ plain form
8761 22292 16527 23775 23416 13093 3733 5192 13139 17412 11772 -938 -3224 -15244 -8362 5627
8747 5627 5251 -1038 3392 10230 -2777 -1763 7164 10375 16451 33470 31278 36183 28931 18960 11278
8732 11278 924 -1217 6508 3549 8175 3733 4101 12224 13836 6061 1865 12312 15154 13462
8718 13462 1207 2138 9062 15042 8468 -5857 718 7387 840 9720 22543 32310 30901 22203
8704 22203 21034 14584 5922 3307 1448 2137 8671 5458 16343 35543 37355 37870 32821 23955 17260
8689 17260 21147 33242 40383 26201 12138 15298 16450 4183 5092 -5805 -5425 -1732 -2815 3195
8675 3195 4933 4846 8547 8258 6719 8987 13431 11187 12249 2228 -4312 -13440 -12705 3360 16574
8660 16574 12266 7621 15255 28567 35968 44532 45429 41126 34859 36776 51431 60633 50853 31834
$$ packed form
8761B2292n765P248l59j0323r360J459P947M273n640j2710k286j2020O882J3989
8747E627l76o289M430O838j3007J014Q927L211O076J7019k192M905p252r971p682
8732A1278j0354k141P725k959M626m442L68Q123J612p775m196J0447K842j692
8718A3462j2255R31O924N980o574j4325O575O669o547Q880J2823R767j409q698
8704B2203j169o450q662k615j859O89O534l213J0885J9200J812N15n049q866o695
8689A7260L887J2095P141j4182j4063L160J152j2267R09j0897L80L693j083O010
8675C195J738q7L701k89j539K268M444k244J062j0021o540r128P35J6065J3214
8660A6574m308m645P634J3312P401Q564Q97m303o267J917J4655R202r780j9019
$$ plain form
8646 31834 20362 17932 24577 20576 22453 30750 26378 20309 13102 15015 27832 29016 31596 35434
8632 35434 28434 30590 25029 12056 25142 38938 51975 65190 50354 50319 50777 56902 82293 82393
8618 82393 70837 67051 77412 99480 122387 139407 171564 196636 244358 284834 326395 371925
8606 371925 403963 420167 440159 451059 453113 447986 414115 389357 380582 375767 364688 353288
8594 353288 347766 329165 305094 283158 270881 281001 278194 265258 244625 240656 245745 237381 236455
8581 236455 220325 221822 223892 226303 228844 228035 237926 246830 272474 291088 299229 318224 338175
8568 338175 359730 412437 474977 537177 616407 714181 814651 902304 989538 1048062 1089708
8557 1089708 1088475 1059936 1026651 978335 891368 805767 740615 691421 641727 588646 537913 500347
$$ packed form
8646C1834j1472k430O645m001J877Q297m372o069p207J913J2817J184K580L838
8632C5434p000K156n561j2973J3086J3796J3037J3215j4836l5M58O125K5391J00
8618H2393j1556l786J0361K2068K2907J7020L2157K5072M7722M0476M1561M5530
8606C71925L2038J6204J9992J0900K054n127l3871k4758q775m815j1079j1400
8594C53288n522j8601k4071k1936j2277J0120k807j2936k0633l969N089q364r26
8581B36455j6130J497K070K411K541q09R891Q904K5644J8614Q141J8995J9951
8568C38175K1555N2707O2540O2200P9230R7774J00470Q7653Q7234N8524M1646
8557A089708j233k8539l3285m8316q6967q5601o5152m9194m9694n3081n0733l7566
$$ plain form
8545 500347 480278 461530 430172 403207 386197 381740 386700 381646 357484 344706 333629 318940
8533 318940 304305 301726 308856 309431 304022 308818 322736 328673 341332 355674 381405 424261 467708
8520 467708 511872 563220 637156 711260 773653 848704 915045 961489 997671 1013246 1005822 954015
8508 954015 875417 798365 728470 647233 556872 493561 456141 403804 373839 344885 330110 317241
8496 317241 304309 298016 275044 262872 248575 235015 227365 236345 221631 216707 207849 198445 190339
8483 190339 179677 185108 194888 191046 183652 184391 186625 179531 181983 204039 226418 243154 254663
8470 254663 279885 313452 332825 348558 368685 375481 366009 352386 322882 289794 257816 226137
8458 226137 189281 167522 156197 152471 148506 140718 129007 112424 99155 93032 87875 86228 92870
$$ packed form
8545E00347k0069j8748l1358k6965j7010m457M960n054k4162j2778j1077j4689
8533C18940j4635k579P130N75n409M796J3918N937J2659J4342K5731M2856M3447
8520D67708M4164N1348P3936P4104O2393P5051O6341M6444L6182J5575p424n1807
8508I54015p8598p7052o9895q1237r0361o3311l7420n2337k9965k8954j4775j2869
8496C17241j2932o293k2972j2172j4297j3560p650Q980j4714m924q858r404q106
8483A90339j0662N431R780l842p394P39K234p094K452K2056K2379J6736J1509
8470B54663K5222L3567J9373J5733K0127O796r472j3623k9504l3088l1978l1679
8458B26137l6856k1759j1325l726l965p788j1711j6583j3269o123n157j647O642
$$ plain form
8445 92870 83010 70454 61013 55803 49964 52092 45135 43213 49248 61073 65187 62396 53884 45057
8431 45057 41180 54586 60181 48527 47009 34930 23978 40194 53980 46813 30172 30000 21335
8418 21335 24977 30717 37995 51904 50908 37107 41843 36753 32977 27194 13126 2980 8425 10288
8404 10288 5183 10703 29652 31283 26507 6447 -424 4457 15402 15891 22076 31115 33831 32708
8390 32708 23918 2827 9484 10790 4926 2296 -7214 -6704 -745 14078 43142 40752 31030 26863
8376 26863 28026 31170 16889 11237 6986 11393 13008 20522 13713 282 17525 16194 11583 9802
8362 9802 8322 14178 13270 6160 11462 13796 8103 16960 13224 7596 19424 36508 30823 27006 29164
8347 29164 24714 18186 7800 8141 11059 8011 17423 22769 19032 28077 36595 28919 3411 750
$$ packed form
8445I2870r860j2556r441n210n839K128o957j922O035J1825M114k791q512q827
8431D5057l877J3406N595j1654j518j2079j0952J6216J3786p167j6641j72q665
8418B1335L642N740P278J3909r96j3801M736n090l776n783j4068j0146N445J863
8404A0288n105N520J8949J631m776k0060o871M881J0945M89O185R039K716j123
8390C2708q790k1091O657J306n864k630r510N10N959J4823K9064k390r722m167
8376B6863J163L144j4281n652m251M407J615P514o809j3431J7243j331m611j781
8362I802j480N856r08p110N302K334n693Q857l736n628J1828J7084n685l817K158
8347B9164m450o528j0386L41K918l048R412N346l737R045Q518p676k5508k661
$$ plain form
8333 750 2557 6414 -876 -7924 -10518 -5997 5975 9131 5780 -1203 1387 7518 17867 23902 24144
8318 24144 27327 30988 23164 12118 7807 3862 8780 21756 16909 4335 -2574 -9589 2824 713
8304 713 -6177 3020 4223 -6413 -3771 8985 8755 6158 7181 1680 -3136 -18160 -23610 -118
8290 -118 18803 21329 28288 23824 12314 14272 19418 31133 18259 1428 10953 13358 13496 10096
8276 10096 11095 3155 -13750 -6243 13777 12177 1145 -16921 -20303 -15740 -15884 -2577 -1638 -1644 5049
8261 5049 14669 13687 15098 27375 18172 9796 4358 5027 4882 6410 14089 8674 3542 9101 16187
8246 16187 32406 40058 31169 27458 16024 940 -11081 -21231 -16739 -10441 4233 8256 8750
8233 8750 16974 19711 28129 28443 14223 7244 12232 6701 17757 15669 12226 5968 4862 10288 19841
$$ packed form
8333G50J807L857p290p048k594M521J1972L156l351o983K590O131J0349O035K42
8318B4144L183L661p824j1046m311l945M918J2976m847j2574o909p015J2413k111
8304G13o890R197J203j0636K642J2756k30k597J023n501m816j5024n450K3492
8290a18J8921K526O959m464j1510J958N146J1715j2874j6831R525K405J38l400
8276A0096R99p940j6905P507K0020j600j1032j8066l382M563j44J3307R39oO693
8261E049R620r82J411J2277r203q376n438O69j45J528P679n415n132N559P086
8246A6187J6219P652q889l711j1434j5084j2021j0150M492O298J4674M023M94
8233H750Q224K737Q418L14j4220o979M988n531J1056k088l443o258j106N426R553
$$ plain form
8218 19841 15381 15733 -8082 -19752 -24515 -29452 -21371 -19419 -15438 2040 14157 15399 17358 24644
8204 24644 25652 10034 17960 34572 31871 24492 15857 21334 24743 19351 13405 5770 -2804 -6887
8190 -6887 2085 7606 11800 14182 -806 -3125 -4101 -928 4803 1944 6432 11736 10944 -2632 -5839
8175 -5839 8227 23345 9147 13653 12580 6528 11466 -2122 -13075 -3856 -7171 4218 4124 -3393
8161 -3393 -12828 3106 17518 13425 -3251 -20429 -14392 1277 14953 28928 26593 18089 11036
8148 11036 5003 16182 26857 34239 16461 4084 1719 10030 7010 10332 27750 35997 56435
8135 56435 49200 25825 29025 29261 15092 19584 22251 13305 16084 21247 23193 13230 2727 1141
8121 1141 -4819 4731 -5147 -11647 -12265 -11650 812 -1137 -8647 2705 6800 3199 5218 23110 27228
$$ packed form
8218A9841m460L52k3815j1670m763m937Q081J952L981J7478J2117J242J959P286
8204B4644J008j5618P926J6612k701p379q635N477L409n392n946p635q574m083
8190f887Q972N521M194K382j4988k319r76L173N731k859M488N304p92j3576l207
8175e839J4066J5118j4198M506j073o052M938j3588j0953R219l315J1389r4p517
8161c393r435J5934J4412m093j6676j7178O037J5669J3676J3975k335q504p053
8148A1036o033J1179J0675P382j7778j2377k365Q311l020L322J7418Q247K0438
8135E6435p235k3375L200K36j4169M492K667q946K779N163J946r963j0503j586
8121A141n960R550r878o500o18O15J2462j949p510J1352M095l601K019J7892M118
$$ plain form
8106 27228 20758 20104 10083 11208 22682 22756 14324 10473 12774 14876 6739 6252 -5344 -8057 -44
8091 -44 3006 18055 22617 32050 27193 37974 24914 21268 21446 15903 16468 15870 23394 19313 16730
8076 16730 24034 16518 16196 18362 10102 8611 17077 21729 9036 12104 24145 32181 38473 42375
8062 42375 36452 39733 35963 30155 32148 18346 10837 23702 24417 12784 3458 -5021 -11016 7510
8048 7510 19619 27920 29104 39490 34791 29133 24180 22277 18373 16229 18532 28192 36774 20744
8034 20744 5451 2046 -5366 -6830 7131 9184 5997 2608 10762 8565 6527 7987 -2522 1979
8020 1979 -2909 -12697 -18613 -13639 -12970 -4831 14434 20647 18966 17088 10317 7098 3029 39 -202
8005 -202 2615 4788 20655 22922 17855 11369 10335 6534 24669 25373 6857 5258 2996 -985 -10036
$$ packed form
8106B7228o470o54j0021J125J1474P4q432l851K301K102q137m87j1596k713Q013
8091d4L050J5049M562R433m857J0781j3060l646J78n543N65n98P524m081k583
8076A6730P304p516l22K166q260j491Q466M652j2693L068J2041Q036O292L902
8062D2375n923L281l770n808J993j3802p509J2865P15j1633r326q479n995J8526
8048G510J2109Q301J184J0386m699n658m953j903l904k144K303R660Q582j6030
8034B0744j5293l405p412j464J3961K053l187l389Q154k197k038J460j0509M501
8020A979m888r788n916M974O69Q139J9265O213j681j878o771l219m069k990k41
8005b02K817K173J5867K267n067o486j034l801J8135P04j8516j599k262l981r051
$$ plain form
7990 -10036 3384 23957 36030 31004 33338 35325 32014 25337 21687 29367 33131 25567 19585 640
7976 640 -7391 -8510 -8957 -5087 -8885 -2911 9374 12438 10204 25999 21615 6897 9118 12089 1576
7961 1576 -6596 -1168 16468 15175 3300 29 5153 21269 24381 23849 25218 19277 5874 3840
7947 3840 13321 22711 33366 30244 23872 7210 -10757 -17140 -12686 -4735 -1778 6828 6039 -820
7933 -820 3212 5383 18078 20456 3680 -5014 1392 1432 12864 18286 21423 9421 10206 5526 -1884
7918 -1884 12007 22837 19958 9434 -1982 -3669 -3295 -1397 -2890 -10207 -8032 12562 18536 5544
7904 5544 7041 13386 26938 36851 13091 -4412 -2108 9646 20564 21272 25494 14113 -6501
7891 -6501 -11716 -13720 -9370 -413 7831 7720 17199 17900 5092 6943 8602 -1138 -6451 -11714 -32526
$$ packed form
7990a0036J3420K0573J2073n026K334J987l311o677l650P680L764p564n982j8945
7976F40q031j119m47L870l798N974J2285L064k234J5795m384j4718K221K971j0513
7961A576q172N428J7636j293j1875l271N124J6116L112n32J369n941j3403k034
7947C840R481R390J0655l122o372j6662j7967o383M454P951K957Q606p89o859
7933h20M032K171J2695K378j6776q694O406M0J1432N422L137j2002P85m680p410
7918a884J3891J0830k879j0524j1416j687L74J898j493p317K175K0594N974j2992
7904E544J497O345J3552R913k3760j7503K304J1754J0918P08M222j1381k0614
7891f501n215k004M350Q957Q244j11R479P01j2808J851J659r740n313n263k0812
$$ plain form
7876 -32526 -37644 -24512 -15585 -8963 -2931 -1969 5990 7077 14620 4150 -2641 -6987 -5641 1412
7862 1412 16044 4979 -9765 -21690 -14591 -5229 4363 2686 -561 -1045 483 -3904 3763 4853
7848 4853 10393 19996 14882 16967 11576 -2134 -5084 11761 18260 18019 11824 8784 2613 482 14437
7833 14437 23960 17985 10242 -5851 -18595 -18843 -11717 -5263 3448 7289 8145 13966 11400 -3038
7819 -3038 1894 -2222 9993 4621 3798 -5426 -21662 -23337 -16715 -9906 2340 -2974 -636 6211
7805 6211 -775 -17581 -23701 -24768 -12738 -1063 -5165 -3503 -12537 -9336 -14808 -12868 -1924 9100
7791 9100 5506 -19 -2627 -1321 -2173 -2709 -2349 4060 15426 5628 14230 23682 20681 20936 29514 5630
7775 5630 -9661 -6965 3158 5658 3110 3129 5436 9682 8327 13892 2999 -5669 -13039 -12513 4507
$$ packed form
7876c2526n118J3132Q927O622O032R62P959J087P543j0470o791m346J346P053
7862A412J4632j1065j4744j1925P099R362R592j677l247m84J528m387P667J090
7848D853N540R603n114K085n391j3710k950J6845O499k41o195l040o171k131J3955
7833A4437R523n975p743j6093j2744k48P126O454Q711L841Q56N821k566j4438
7819c038M932m116J2215n372q23r224j6236j675O622O809J2246n314K338O847
7805F211o986j6806o120j067J2030J1675m102J662r034L201n472J940J0944J1024
7791I100l594n525k608J306q52n36L60O409J1366r798Q602R452l001K55Q578k3884
7775E630j5291K696J0123K500k548J9K307M246j355N565j0893q668p370N26J7020
$$ plain form
7760 4507 7710 8327 1024 2359 -2570 957 6379 9973 3250 -2191 -8996 402 12842 13900 -4815
7745 -4815 -14741 -12552 -5709 -7679 -13677 1603 9097 11652 10212 9974 -300 1594 14037 13627 11466
7730 11466 18529 16613 3794 -18980 -27048 -24252 -6562 3706 1511 10616 18691 18948 12262 17849
7716 17849 6968 -616 -2354 -5606 -1973 562 2836 -1575 -27108 -27796 -13953 -7138 -10259 -5521
7702 -5521 1222 4338 -16767 -30799 -26820 -20618 -19781 -27232 -15601 -5121 1516 9810 5899 -4869
7688 -4869 -22493 -12664 -15156 -12723 -2946 -4504 -967 -2141 1299 8608 11221 2846 -6563 -16197 -19487
7673 -19487 -89 1818 -3264 -1074 -8651 -7808 -9900 -8838 -13492 -8743 -5439 -2407 2887 5597 14548
7658 14548 14557 2742 -7394 -16524 -533 17757 4553 -1311 -606 -4498 -8296 4331 8790 7060
$$ packed form
7760D507L203O17p303J335m929L527N422L594o723n441o805R398J2440J058j8715
7745d815r926K189O843j970n998J5280P494K555j440k38j0274J894J2443m10k161
7730A1466P063j916j2819k2774q068K796J7690J0268k195R105Q075K57o686N587
7716A7849j0881p584j738l252L633K535K274m411k5533o88J3843O815l121M738
7702e521O743L116k1105j4032L979O202Q37p451J1631J0480O637Q294l911j0768
7688d869j7624R829k492K433R777j558L537j174L440P309K613q375r409r634l290
7673a9487J9398J907n082K190p577Q43k092J062m654M749L304L032N294K710Q951
7658A4548Rj1815j0136r130J5991J8290j3204n864P05l892l798J2627M459j730
$$ plain form
7644 7060 12521 9823 -3472 -4421 13488 17311 14220 12763 3184 -16388 -19382 -19230 254 15017
7630 15017 1978 -15672 -23046 -30734 -34662 -40236 -33397 -23774 -17418 -4743 -5169 5019 13557 2401
7616 2401 -8447 -1629 8703 11110 6825 -5812 -18319 -20199 -18605 -22758 -27551 -37212 -33352 -18611
7602 -18611 -7487 -8079 -15442 -13982 -6698 2684 15804 8754 -10013 -14493 -6160 11786 6073 -6520
7588 -6520 -4520 -1755 1595 -8820 -13437 -18941 -9762 6997 1206 -10882 -23271 -32844 -24928 -23438
7574 -23438 -20115 -6858 -390 3224 -3279 -2007 -7865 -6919 -5516 -6079 -14450 -20697 -32349 -21604
7560 -21604 -9839 -3699 -116 2127 -2754 -10987 -12858 -16325 -20672 -26623 -20242 -10284 379 2874
7546 2874 4048 4137 -4096 -4338 16417 15844 1431 -10368 -21436 -26905 -29827 -27895 -12503 668
$$ packed form
7644G060N461k698j3295r49J7909L823l091j457r579j9572k994J52J9484J4763
7630A5017j3039j7650p374p688l928n574O839R623O356J2675m26J0188Q538j1156
7616B401j0848O818J0332K407m285j2637j2507j880J594m153m793r661L860J4741
7602a8611J1124n92p363J460P284R382J3120p050j8767m480Q333J7946n713j2593
7588f520K000K765L350j0415m617n504R179J6759n791j2088j2389r573P916J490
7574b3438L323J3257O468L614o503J272n858R46J403n63q371o247j1652J0745
7560b1604J1765O140L583K243m881q233j871l467m347n951O381R958J0663K495
7546B874J174Q9q233k42K0755n73j4413j1799j1068n469k922J932J5392J3171
$$ plain form
7532 668 4882 3959 7267 11499 13495 10092 4313 876 -4291 -2389 -3633 -17738 -22687 -22122 -7657
7517 -7657 6898 7742 10383 16530 15359 13541 14848 13591 11342 18304 6152 1148 10150 24039
7503 24039 34729 41447 35075 24115 16185 1042 24 6855 4698 -2397 -10392 -11031 659 2108
7489 2108 -1738 377 2523 11393 31152 22957 6013 -3732 -13358 -3436 14085 16603 10176 10954
7475 10954 10546 -1410 -17849 -20947 -2430 72 2716 4412 -5587 -13456 -29082 -36794 -23874 -5313
7461 -5313 9159 13787 3335 -2529 -7697 -22526 -25845 -18258 1955 6133 -12135 -29540 -21019
7448 -21019 -16415 -25240 -22793 -28044 -29822 -20481 -15470 -10886 -7771 2164 -2165 -5359 -5084 453 2713
7433 2713 2401 2068 8090 1244 -10992 -6010 2419 -4913 -3589 8110 12641 16902 10911 8260 20124
$$ packed form
7532F68M214r23L308M232J996l403n779l437n167J902j244j4105m949N65J4465
7517g657J4555Q44K641O147j171j818J307j257k249O962j2152n004R002J3889
7503B4039J0690O718o372j0960p930j5143j018O831k157p095p995o39J1690J449
7489B108l846K115K146Q870J9759q195j6944r745r626R922J7521K518o427P78
7475A0954m08j1956j6439l098J8517K502K644J696r999p869j5626p712J2920J8561
7461e313J4472M628j0452n864n168j4829l319P587K0213M178j8268j7405Q521
7448b1019M604q825K447n251j778R341N011M584L115R935m329l194K75N537K260
7433B713l12l33O022o846j2236M982Q429p332J324J1699M531M261n991k651J1864
$$ plain form
7418 20124 23807 16968 12131 21864 17460 3105 -4490 1790 -1186 -3592 840 5316 10681 8888
7404 8888 4063 4694 -901 -13828 -11367 -7978 -6154 -7340 -12747 -10187 -18402 -21740 -11096 -3441 -2959
7389 -2959 803 6758 2929 9306 8377 -5003 -22864 -7163 -13549 -9111 -2925 -2906 -10088 -12840 -15946
7374 -15946 -8318 -10015 -7575 -30 -9621 -28606 -37866 -37088 -33719 -24353 -22324 -13500 2657 1528
7360 1528 -1956 -7512 -11907 -7222 -1729 -2992 -4967 2975 -121 -11373 -11905 -12185 -10777 -6261 11109
7345 11109 27157 15711 -160 -10369 -10936 -9009 -3943 13525 11459 -4736 -9584 2736 17285
7332 17285 25980 11783 918 -9700 -906 13306 2437 -2715 -7394 -4772 -7534 -19811 -33988
7319 -33988 -26032 -13727 -13535 -10245 17924 15824 11988 10622 5280 -9791 -10003 877 9412 20541
$$ packed form
7418B0124L683o839m837R733m404j4355p595O280k976k406M432M476N365j793
7404H888m825O31n595j2927K461L389J824j186n407K560q215l338J0644P655M82
7389b959L762N955l829O377r29j3380j7861J5701o386M438O186J9p182k752l106
7374a5946P628j697K440P545r591j8985r260P78L369R366K029Q824J6157j129
7360A528l484n556m395M685N493j263j975P942l096j1252n32k80J408M516J7370
7345A1109J6048j1446j5871j0209n67J927N066J7468k066j6195m848J2320J4549
7332A7285Q695j4197j0865j0618Q794J4212j0869n152m679K622k762j2277j4177
7319c3988P956J2305J92L290K8169k100l836j366n342j5071k12J0880Q535J1129
$$ plain form
7305 20541 8793 -7773 -855 -6565 -14235 -3316 3190 3609 -4329 -4023 6733 6723 2958 761 -6472
7290 -6472 -18000 -23119 -23439 -18862 -12083 -727 -13 63 -15789 -25660 -19046 -12386 4991 18967 111
7275 111 -4571 8737 -221 -17328 -11151 -15546 -26494 -21899 -10362 -16158 -5704 -4282 -9403 6086
7261 6086 8023 4543 -722 -8805 -25464 -25401 -17407 -6785 -8075 -9165 -4385 -10511 -10256 -22064 -17492
7246 -17492 -2405 2175 -8045 -19763 -20638 -12868 -15473 -21545 -9840 6370 3352 10863 21563
7233 21563 15882 12844 14211 10792 11695 18111 23257 22387 16949 11356 6671 -1332 -2762 -7484 -10333
7218 -10333 -8908 -704 1916 -7614 -8570 -6172 -15891 -20781 -16950 2963 13919 12969 16609 21938 10760
7203 10760 -1495 -37 7172 -2428 -4918 51 -920 4843 12005 23908 15220 4473 300 -2897
$$ packed form
7305B0541j1748j6566O918n710p670J0919O506M19p938L06J0756j0l765k197p233
7290f472j1528n119l20M577O779J1356P14P6j5852r871O614O660J7377J3976j8856
7275A11m682J3308q958j7107O177m395j0948M595J1537n796J0454J422n121J5489
7261F086J937l480n265q083j6659O3P994J0622j290j090M780o126K55j1808M572
7246a7492J5087M580j0220j1718q75P770k605o072J1705J6210l018P511J0700
7233B1563n681l038J367l419R03O416N146q70n438n593m685q003j430m722k849
7218a0333J425Q204K620r530r56K398r719m890L831J9913J0956r50L640N329j1178
7203A0760j2255J458P209r600k490M969r71N763P162J1903q688j0747m173l197
$$ plain form
7189 -2897 -1918 13407 6833 -1166 5398 11909 -1564 2310 9313 11875 -1659 -9932 -12411 -16903
7175 -16903 -19967 -15979 -18442 -27261 -18740 -12481 -11646 -2787 606 2640 -3533 -15098 -19158 -12085 -14317
7160 -14317 -16490 -19044 -9397 -4294 -1947 -3231 6033 -1834 -17791 -22659 -27683 -12252 32 466
7146 466 -6533 1891 932 -3291 -12159 -19791 -23529 -11349 -11036 -7816 -6690 7300 5299 -605 8036
7131 8036 18959 31936 25403 6914 2142 1346 -4245 -6090 -18574 -18708 -18776 -13836 -14919 1007 9719
7116 9719 -2896 -17194 -12979 -5027 -8778 -26627 -38107 -16895 -7630 -7942 3922 23892 16017
7103 16017 4864 -10418 -9585 2543 1274 4844 5901 1966 1684 -756 -15129 -21504 -17069 -12521
7089 -12521 -279 21485 13003 11372 6373 7438 5718 377 -2840 7425 7662 -1688 -17548 -28460
$$ packed form
7189b897R79J5325o574p999O564O511j3473L874P003K562j3534q273k479m492
7175a6903l064L988k463q819Q521O259Q35Q859L393K034o173j1565m060P073k232
7160a4317k173k554R647N103K347j284R264p867j5957m868n024J5431J2284M34
7146D66o999Q424r59m223q868p632l738J2180L13L220J126J3990k001n904Q641
7131H036J0923J2977o533j8489m772p96n591j845j2484j34o8M940j083J5926Q712
7116I719j2615j4298M215P952l751j7849j1480K1212R265l12J1864J9970p875
7103A6017j1153j5282Q33J2128j269L570J057l935k82k440j4373o375M435M548
7089a2521J2242K1764q482j631m999J065j720n341l217J0265K37r350j5860j0912
$$ plain form
7075 -28460 -17901 -8087 -5965 -7706 -363 1217 -9669 -11424 -8405 -11855 -6137 834 -4165 -17469
7061 -17469 -25659 -29863 -20097 -26558 -28416 -31574 -13003 -2628 -12366 -20818 -18791 -12478 -349 14128
7047 14128 23316 18243 24529 21396 -11 -11575 -10944 -8446 -16637 -37646 -30645 -11419 -6388 -4416
7033 -4416 -11933 -22416 -27824 -20037 -14981 -1131 4169 -3337 -19805 -31166 -27224 -10130 -24072
7020 -24072 -22449 -22933 -24026 -13037 -486 4950 1333 -859 4208 -1595 -12771 -6876 821 4155
7006 4155 1500 -6236 -18988 -17864 -7885 -7842 -14285 -1542 5087 -510 6245 4290 -6364 -12241 -6691
6991 -6691 -9435 -15037 -15045 -17604 -10708 -8888 -26641 -42284 -38348 -18640 8725 23448 5148 -5842
6977 -5842 -6377 -8115 14084 25059 16913 6592 4524 -12277 -23529 -14174 -7074 -2350 2437 -664
$$ packed form
7075b8460J0559R814K122j741P343J580j0886j755L019l450N718O971m999j3304
7061a7469q190m204R766o461j858l158J8571J0375r738q452K027O313J2129J4477
7047A4128R188n073O286l133k1407j1564O31K498q191k1009P001J9226N031J972
7033d416p517j0483n408P787N056J3850N300p506j6468j1361L942J7094j3942
7020b4072J623m84j093J0989J2551N436l617k192N067n803j1176N895P697L334
7006D155k655p736j2752J124R979M3o443J2743O629n597O755j955j0654n877N550
6991f691k744n602qk559O896J820j7753j5643L936J9708K7365J4723j8300j0990
6977e842n35j738K2199J0975q146j0321k068j6801j1252R355P100M724M787l101
$$ plain form
6963 -664 13027 8890 -2820 -570 2360 9873 14544 -1288 -12284 -3018 -5341 -4898 -6294 -17665
6949 -17665 -16855 -11055 -5870 -11562 -15680 -19600 -20743 -20004 2517 21958 13123 13691 5731 2450 8264
6934 8264 7643 11082 5915 2629 -7364 -13119 -15576 -2550 -570 -11083 -18593 -22043 -16215 -5073
6920 -5073 -7958 -2503 -6214 -14053 -28986 -35680 -31678 -35121 -17860 -9969 -14317 -28161 -26560 -10141
6906 -10141 -11453 -21072 -31452 -29493 -26207 -26515 -25867 -20998 -18509 -20323 -17692 -6783 4979 12710
6892 12710 5787 6836 18595 18269 -430 -7054 -18633 -9263 -6521 -2602 7111 10510 -1241 -15496
6878 -15496 -22738 -4783 3863 -2590 -16677 -13582 -3661 -7062 -30499 -28280 -16635 -8054 -1891 36
6864 36 -4811 -9472 -13376 3342 15194 7617 8865 107 -10190 -188 1655 -2472 1399 -5562
$$ packed form
6963f64J3691m137j1710K250K930P513M671j5832j0996R266k323M43j396j1371
6949a7665Q10N800N185n692m118l920j143P39K2521J9441q835N68p960l281N814
6934H264o21L439n167l286r993n755k457J3026J980j0513p510l450N828J1142
6920e073k885N455l711p839j4933o694M002l443J7261P891m348j3844J601J6419
6906a0141j312r619j0380J959L286l08O48M869K489j814K631J0909J1762P731
6892A2710o923J049J1759l26j8699o624j1579R370K742L919R713L399j1751j4255
6878a5496p242J7955Q646o453j4087L095R921l401k3437K219J1645Q581O163J927
6864C6m847m661l904J6718J1852p577J248q758j0297J0002J843m127L871o961
$$ plain form
6850 -5562 -408 8448 8466 -5334 -9572 -12143 -4041 -1723 -13546 -8269 -7834 -8560 -6186 -10169 -3357
6835 -3357 -611 9844 12021 6602 2045 496 -811 -4077 -4830 -10403 -12848 -4505 5363 -172 -19396
6820 -19396 -29960 -25146 -9100 3429 14436 13532 3224 -1153 -7663 -25784 -21326 -4560 -17646
6807 -17646 -26622 -9744 8487 8450 -553 -7099 10307 10141 -4447 -13772 -12423 -12011 -1405 3318
6793 3318 1468 6444 -640 -3059 -6938 -21647 -23687 -13713 -4236 -463 -8512 -27545 -21398 -17080
6779 -17080 -15643 -3640 -2062 8113 3335 -5957 -2454 -3 401 -997 -12500 -18579 -20436 -10821
6765 -10821 -6731 1741 10986 16843 13229 -11731 -14030 5373 11448 -11885 -20464 -18944 1876 2980
6751 2980 2219 -3771 8475 4756 -6930 -9161 -4600 -3684 -12016 -16412 -16613 -7299 4938 8646 4300
$$ packed form
6850e562N154Q856J8j3800m238k571Q102K318j1823N277M35p26K374l983O812
6835c357K746J0455K177n419m557j549j307l266p53n573k445Q343R868n535j9224
6820a9396j0564M814J6046J2529J1007r04j0308m377o510j8121M458J6766j3086
6807a7646q976J6878J8231l7r003o546J7406j66j4588r325J349M12J0606M723
6793C318j850M976p084k419l879j4709k040R974R477L773q049j9033O147M318
6779a7080J437J2003J578J0175m778r292L503K451M04j398j1503o079j857R615
6765a0821M090Q472R245N857l614k4960k299J9403O075k3333q579J520K0820J104
6751B980p61n990J2246l719j1686k231M561R16q332m396k01R314J2237L708m346
$$ plain form
6736 4300 9147 2527 -4397 1996 8924 -10045 -2894 12080 29420 26367 4582 -15986 -27250
6723 -27250 -27327 -14608 -12650 -1665 11439 12343 8916 -6887 -9415 -17238 -11840 7809 16499 15685
6709 15685 11551 4833 -8129 -13312 -16956 1988 7552 8786 12450 8807 -6725 660 3007 2548
6695 2548 -11421 -15976 -11891 -2410 10112 8543 6714 5309 7112 10640 15260 10909 14006 3476
6681 3476 -9593 -7687 -2449 -729 -6690 -8357 -6141 4999 12089 22782 10422 6047 -2212 -6886
6667 -6886 -8031 -5073 301 -4378 -12388 -9692 -5735 -13694 -7439 5744 4657 -4430 -12960 -28620
6653 -28620 -26675 -3331 -3020 -5447 -24904 -37604 -16416 2794 -46 1676 7642 -3976 -6589
6640 -6589 -4487 3569 -8862 -9930 7547 7149 4308 3388 -12717 -4400 13223 3966 1766 120
$$ packed form
6736D300M847o620o924O393O928j8969P151J4974J7340l053k1785k0568j1264
6723b7250p7J2719J958J0985J3104R04l427j5803k528p823N398J9649Q690q14
6709A5685m134o718j2962n183l644J8944N564J234L664l643j5532P385K347m59
6695B548j3969m555M085R481J2522j569j829j405J803L528M620m351L097j0530
6681C476j3069J906N238J720n961j667K216J1140P090J0693j2360m375q259m674
6667f886j145K958N374m679q010K696L957p959O255J3183j087r087q530j5660
6653b8620J945K3344L11k427j9457j2700K1188J9210k840J722N966j1618k613
6640f589K102Q056j2431j068J7477l98k841r20j6105Q317J7623r257k200j646
$$ plain form
6626 120 2806 5472 7372 -3362 -13604 -20349 -16957 -9355 -11446 -4719 -19357 -22650 -5985 7113
6612 7113 11366 19174 20830 9829 670 7372 8463 16964 4004 -5889 -5377 -4537 -5450 2605 12453
6597 12453 17432 6497 -11015 -21709 -10354 -5187 -3606 -2155 11117 2303 -4284 -18040 -11573
6584 -11573 -1705 -9609 -3212 -651 -15086 -29819 -38472 -25868 -13568 -1957 573 -613 -15508
6571 -15508 -16214 -14565 -13342 -5746 -7444 5303 14761 6469 133 4018 8004 -1131 8374 -3498
6557 -3498 -10463 2721 6173 -140 -12207 -27018 -27361 -22501 -8601 -10026 -2927 3489 4923 2070
6543 2070 -2987 3078 16391 13355 6125 -5462 -18846 -20289 -728 3376 8472 -7533 -2756 14214
6529 14214 16089 5733 3495 3065 -10701 -18259 -12690 -10429 -10825 -7186 -4558 -481 1363 6877 3069
$$ packed form
6626A20K686K666J900j0734j0242o745L392P602k091O727j4638l293J6665J3098
6612G113M253P808J656j1001r159O702J091Q501j2960r893N12Q40r13Q055R848
6597A2453M979j0935j7512j0694J1355N167J581J451J3272q814o587j3756O467
6584a1573R868p904O397K561j4435j4733q653J2604J2300J1611K530j186j4895
6571a5508p06J649J223P596j698J2747R458q292o336L885L986r135R505j1872
6557c498o965J3184L452o313j2067j4811l43M860J3900j425P099O416J434k853
6543B070n057O065J3313l036p230j1587j3384j443J9561M104N096j6005M777J6970
6529A4214J875j0356k238m30j3766p558N569K261l96L639K628M077J844N514l808
$$ plain form
6514 3069 1721 -16699 -24762 -22886 -25872 -19693 -9877 -4933 -2878 -4387 -11527 -17390 -18729 -26264 -13736
6499 -13736 -21524 -23737 -33801 -27044 -20667 -18363 -15136 -15544 -7702 -5484 -9875 -12468 -1724 7815
6485 7815 11850 -4782 -10960 -15251 -25980 -16287 -10214 -6938 -2464 2858 -2308 528 -2888 -13177
6471 -13177 -18498 -10083 9150 23613 8598 -16158 -19700 -25357 -23484 -13452 1336 8192 14189
6458 14189 10179 -7488 -13752 -11107 -6677 -3353 -12422 -17541 2436 24667 15654 5761 9663 9256
6444 9256 3091 -10243 991 656 -13844 -27820 -18545 -7472 2552 10367 9261 9060 -378 -9170
6430 -9170 -6135 -8994 -10747 -430 202 -5317 -9745 3258 -2285 -17948 -21924 -10344 -12393 -4441
6416 -4441 -1194 -8015 -10151 -11706 -12944 -1914 -3410 -2669 -8345 -6501 -9459 -17939 -10190 -8742 -15773
$$ packed form
6514C069j348j8420q063J876k986O179R816M944K055j509p140n863j339p535J2528
6499a3736p788k213j0064O757O377K304L227m08P842K218m391k593J0744R539
6485G815M035j6632o178m291j0729R693O073L276M474N322n166K836l416j0289
6471a3177n321Q415J9233J4463j5015k4756l542n657J873J0032J4788O856N997
6458A4189m010j7667o264K645M430L324r069n119J9977K2231r013r893L902m07
6444I256o165j3334J1234l35j4500j3976R275J1073J0024P815j106k01r438q792
6430i170L035k859j753J0317O32n519m428J3003n543j5663l976J1580k049P952
6416d441L247o821k136j555j238J1030j496P41n676J844k958q480P749J448p031
$$ plain form
6401 -15773 -3926 -835 2247 12718 6598 -8117 -2865 -3477 -7252 -2601 1013 9960 10208 14365
6387 14365 18215 10453 4999 8533 4477 2865 -98 802 713 6339 9885 -9001 -14005 -6555 -336
6372 -336 -3663 -7497 -19822 -11210 6079 1065 -4751 -7394 -12959 -6102 -7488 -5099 -12121 -2567 5450
6357 5450 7624 303 -2866 566 -9619 -11778 -10626 -18949 -13456 2912 7305 -2876 3985 22616
6343 22616 6883 1473 -11031 -26304 -35601 -34348 -30444 -22783 -17353 -15782 -16906 -18941 -20652 -19368
6329 -19368 4582 8560 -4136 -7975 -1218 -8864 -18058 -4682 -983 -3356 -7228 -9852 -10004 -150
6315 -150 641 -7896 -2872 -7574 -10421 -12962 -9733 -10561 -4310 11032 19727 9651 2286 6829 5421
6300 5421 12393 17628 17376 13591 804 657 6857 -44 -1967 -6432 -3582 -1511 4858 -11632 -13124
$$ packed form
6401a5773J1847L091L082J0471o120j4715N252o12l775M651L614Q947K48M157
6387A4365L850p762n454L534m056j612k963R00q9N626L546j8886n004P450O219
6372c36l327l834j2325Q612J7289n014n816k643n565O857j386K389p022R554Q017
6357E450K174p321l169L432j0185k159J152q323N493J6368M393j0181O861J8631
6343B2616j5733n410j2504j5273r297J253L904P661N430J571j124k035j711J284
6329a9368K3950L978j2696l839O757p646r194J3376L699k373l872k624j52R854
6315a50P91q537N024m702k847k541L229q28O251J5342Q695j0076p365M543j408
6300E421O972N235k52l785j2787j47O200o901j923m465K850K071O369j6490j492
$$ plain form
6285 -13124 -8707 -2993 -3416 3283 17891 14876 17933 12873 13681 30784 23145 4509 -2729 2271
6271 2271 11989 18892 12297 -2781 -22098 -22003 -13472 -16247 -9987 -5583 5991 -3006 -19176 -18325 -21871
6256 -21871 -19722 -5573 6729 12279 14599 14820 3309 3617 -11562 -15135 -3245 -2252 7611 16578
6242 16578 12953 8241 3257 8217 9787 493 4582 3143 -8386 -20281 -10319 -3987 -7901 -6409
6228 -6409 8192 24532 18584 -3813 -17335 -12097 -16651 -22548 -13641 -13220 -19673 -25367 -28676 -30742
6214 -30742 -33254 -19951 -10157 -11796 -21992 -25675 -11194 11644 8457 9532 7699 -11522 -23343
6201 -23343 -27828 -22380 -8739 -10126 -14693 -11212 -5520 -7029 -2432 99 -461 -5359 -6669 -4496 -8578
6186 -8578 -16112 -23339 -17614 -10820 -6694 1288 3639 11950 17741 10983 -14525 -16074 -13007 -16879 -10502
$$ packed form
6285a3124M417N714m23O699J4608l015L057n060Q08J7103p639j8636p238N000
6271B271R718O903o595j5078j9317R5Q531k775O260M404J1574q997j6170Q51l546
6256b1871K149J4149J2302N550K320K21j1511L08j5179l573J1890R93R863Q967
6242A6578l625m712m984M960J570r294M089j439j1529j1895R962O332l914J492
6228f409J4601J6340n948k2397j3522N238m554n897Q907M21o453n694l309k066
6214c0742k512J3303R794j639j0196l683J4481K2838l187J075j833j9221j1821
6201b3343m485N448J3641j387m567L481N692j509M597K531n60m898j310K173m082
6186h578p534p227N725O794M126P982K351Q311N791o758k5508j549L067l872O377
$$ plain form
6171 -10502 -3171 -2302 -16131 -14053 -14863 -22574 -19329 -1860 -358 -11270 -17081 -16132 -2520 9010
6157 9010 794 -5532 -18411 -13375 -1926 10775 12530 4019 -11035 -17952 -11709 -13867 -10065 932
6143 932 -13953 -28258 -36142 -29710 -24563 -8648 -3116 534 3028 -4800 -5462 -8187 -18092 -28142
6129 -28142 -26463 -25244 -26413 -24699 -5327 -3856 -5263 -16514 -25818 -20726 -12479 -4520 -6891 5623
6115 5623 4650 -8857 -20769 -20456 -7129 5399 16263 12380 2843 9893 5653 -860 -8731 -9622
6101 -9622 -12207 -10529 -14035 -5947 5755 8630 13407 9807 13748 7958 1750 -13508 -21783 -14429
6087 -14429 -11805 -9805 -17726 -22048 -23032 -15327 -9200 -14410 -85 -4604 -24145 -27161 -4324 2928
6073 2928 -3570 -7427 -7202 -5606 -14585 -23364 -24663 -12522 -10560 -25585 -22702 -16143 -17898 -13413 -10594
$$ packed form
6171a0502P331Q69j3829K078q10p711L245J7469J502j0912n811R49J3612J1530
6157I010q216o326j2879N036J1449J2701J755q511j5054o917O243k158L802J0997
6143I32j4885j4305p884O432N147J5915N532L650K494p828o62k725r905j0050
6129b8142J679J219j169J714J9372J471j407j1251r304N092Q247P959k371J2514
6115E623r73j3507j1912L13J3327J2528J0864l883r537P050m240o513p871q91
6101i622k585J678l506Q088J1702K875M777l600L941n790o208j5258q275P354
6087a4429K624K000p921m322r84P705O127n210J4325m519j9541l016K2837P252
6073B928o498l857K25J596q979q779j299J2141J962j5025K883O559j755M485K819
$$ plain form
6058 -10594 -11393 -17769 -8043 12612 13910 3871 6667 22214 16668 12063 -4034 -13234 -6104 -165
6044 -165 17853 31356 23043 12017 22699 7495 -5874 -4330 -13862 -21189 -28200 -35051 -25447 -14530
6030 -14530 1112 -10681 -16807 -10353 -16447 -32997 -34980 -20411 -8406 -9853 -12318 -21339 -21753 -30723
6016 -30723 -13614 -2158 1427 6036 1932 -4647 -4618 6318 16502 14522 11152 11008 6953 -3318
6002 -3318 -3174 -7609 -16966 -6132 -10928 -4360 -8773 -18289 -19592 -29772 -26770 -16646 -21083 -19027
5988 -19027 -11961 -441 5060 13338 9025 1307 911 -1992 -4667 -11534 -2451 4590 -5449 -10990
5974 -10990 -9371 -5950 1585 4836 -2630 -8250 1947 -12030 -17369 -3341 -7726 -13904 -2109 11151
5960 11151 13039 12525 1988 -14468 -30099 -43112 -23067 3476 9294 5770 3896 6426 8035
$$ packed form
6058a0594p99o376R726K0655J298j0039K796J5547n546m605j6097r200P130N939
6044a65J8018J3503q313j1026J0682j5204j3369J544r532p327p011o851R604J0917
6030a4530J5642j1793o126O454o094j6550j983J4569J2005j447k465r021m14q970
6016c0723J7109J1456L585M609m104o579K9J0936J0184j980l370j44m055j0271
6002c318J44m435r357J0834m796O568m413r516j303j0180L002J0124m437K056
5988a9027P066J1520N501Q278m313p718l96k903k675o867R083P041j0039n541
5974a0990J619L421P535L251p466n620J0197j3977n339J4028m385o178J1795J3260
5960A1151J888n14j0537j6456j5631j3013K0045K6543N818l524j874K530J609
$$ plain form
5947 8035 17264 20223 -5617 -20628 -6136 13875 14690 -224 -12138 -4702 7709 9612 5794
5934 5794 -3399 -5458 -16503 -27680 -29049 -26345 -23092 -15331 -2614 -9485 -1560 -571 3231 6968
5920 6968 13977 15967 12579 2190 -13156 -32854 -39217 -31820 -24691 -15574 -12005 -11152 1330 6681
5906 6681 61 -4384 -12634 -10206 -9681 -13581 -11797 -9145 -15233 -14079 -19776 -26764 -18910 -16004 -16598
5891 -16598 -14942 -13906 -23258 -22178 -35393 -4951 9058 7987 6232 20133 22824 21165 9662
5878 9662 -1764 -7094 7919 12017 10460 934 -9099 -12503 -6029 -13463 -20600 -16447 4836 9286
5864 9286 689 56 3535 17 2090 -15047 -13981 533 1700 -1264 4884 11036 12243 24134
5850 24134 25715 22589 17011 16512 14407 -2101 551 10595 22530 17089 14924 15820 13102 3903
$$ packed form
5947H035R229K959k5840j5011J4492K0011Q15j4914j1914P436J2411J903l818
5934E794r193k059j1045j1177j369K704L253P761J2717o871P925R89L802L737
5920F968P009J990l388j0389j5346j9698o363P397P129R117L569Q53J2482N351
5906F681o620m445q250K428N25l900J784K652o088J154n697o988P854K906n94
5891a6598J656J036r352J080j3215L0442J4009j071j755J3901K691j659j1503
5878I662j1426n330J5013M098j557r526j0033l404O474p434p137M153K1283M450
5864I286q597o33L479l518K073j7137J066J4514J167k964O148O152J207J1891
5850B4134J581l126n578m99k105j6508K652J0044J1935n441k165Q96k718r199
$$ plain form
5836 3903 -7391 -11506 -8350 -4945 -127 7369 -4459 -14438 -16415 -23997 -31416 -12410 -9661 132
5822 132 -175 -4742 -11365 -8517 -16142 -11164 -10428 -13994 -9472 -14433 -7037 -4171 -12036 -12886 1319 5581
5806 5581 1777 8676 -1162 -6638 -9288 -11772 -25423 -19475 -12833 -14205 -7659 -1501 -4253 -6274 3639
5791 3639 11104 6115 -7174 -20834 -12811 -3229 1469 -1428 -4268 2047 -16554 -26367 -23687 -8675
5777 -8675 6408 27508 12410 392 7701 2009 -3851 -10304 -2898 9318 9693 13904 -2003 -17236
5763 -17236 -24757 -21493 -17714 -13979 -3299 -4576 -8378 -9844 -9511 6080 8606 10831 21075 21623
5749 21623 4243 -1420 -3184 3927 14692 8064 -731 2697 -6946 -10198 -1640 -1746 -260 -5461
5735 -5461 -11027 -4339 -7002 -11354 -5509 -1709 -2027 -7685 -9607 -21768 -11602 -928 3892 -2012
$$ packed form
5836C903j1294m115L156L405M818P496j1828r979j977p582p419J9006K749R793
5822A32l07m567o623K848p625M978P36l566M522m961P396K866p865q50J4205M262
5806E581l804O899r838n476k650k484j3651N948O642j372O546O158k752k021R913
5791C639P465m989j3289j3660Q023R582M698k897k840O315j8601r813K680J5012
5777h675J5083K1100j5098j2018P309n692n860o453P406J2216L75M211j5907j5233
5763a7236p521L264L779L735J0680j277l802j466L33J5591K526K225J0244N48
5749B1623j7380n663j764P111J0765o628q795L428r643l252Q558j06J486n201
5735e461n566O688k663m352N845L800l18n658j922j2161J0166J0674M820n904
$$ plain form
5721 -2012 -7147 -14975 -18238 -17274 -17362 -2644 -6000 -12773 -12174 -5246 -4572 -8858 -191 337 -2641 -885
5705 -885 -636 2678 2882 1707 -6622 -13423 -17027 -14230 -15718 -12362 -11080 -13368 -12993 -19347 -10660 3633
5689 3633 7010 7076 15572 1384 -18579 -26563 -21264 2294 -2396 -12336 -2422 6946 4045 4893 -3489
5674 -3489 -8919 -5347 -5572 5166 7243 6210 -4279 -18510 -30150 -28359 -19549 -18912 -2576 4853
5660 4853 13747 3846 -11569 -14142 -11553 -17500 -9645 12191 9228 2065 9910 -8050 -28178 -16718
5646 -16718 4551 9876 13668 15842 5658 13146 23935 20340 8820 -1928 8730 -3300 -4259
5633 -4259 -2956 -12449 -18943 -26660 -26318 -13716 -11379 -3702 19091 18764 10873 -5446 -3121 -3168 4753
5618 4753 12677 2498 -8955 -16311 -20819 -15648 -1986 -8992 -15208 -18162 -24485 -6170 6556 2062
$$ packed form
5721b012n135p828l263R64q8J4718l356o773N99O928O74m286Q667N28k978J756
5705h85K49L314K04j175q329o801l604K797j488L356J282k288L75o354Q687J4293
5689C633L377O6Q496j4188j9963p984N299K3558m690r940R914R368k901Q48q382
5674c489n430L572k25J0738K077j033j0489j4231j1640J791Q810O37J6336P429
5660D853Q894r901j5415k573K589n947P855K1836k963p163P845j7960k0128J1460
5646a6718K1269N325L792K174j0184P488J0789l595j1520j0748J0658j2030r59
5633d259J303r493o494p717L42J2602K337P677K2793l27p891j6319K325m7P921
5618D753P924j0179j1453p356m508N171J3662p006o216k954o323J8315J2726m494
$$ plain form
5604 2062 11274 8783 -7934 -3202 -9797 -7014 -15346 -10019 -20364 -14234 -18664 -28659 -25979 -20813
5590 -20813 -10912 -9837 2510 4100 -3423 2388 11933 9957 -5726 -20345 -34293 -17453 -17215 -23537
5576 -23537 -17592 -17325 -17722 -4931 -8091 -20604 -19271 -17515 -7657 751 -8534 -24538 -27140 -15230
5562 -15230 -6964 6473 18243 26732 25691 8634 -13482 -25307 -27782 -9915 -2944 -13954 -16916
5549 -16916 -22822 -8886 -2951 5905 3159 7123 16130 10129 -7425 5060 13988 -2055 -13164
5536 -13164 -1039 -9271 2594 4143 -1677 -2991 -3646 1891 -6201 -10809 -3596 14083 23308 20993
5522 20993 16705 632 -4178 -5285 349 11171 -5781 -14747 -12016 -12232 -4447 -6384 -16377 -12130
5508 -12130 -8823 2900 4136 1784 -15727 -16619 -15145 -21208 -17228 -10961 -2059 15250 6416 -3556
$$ packed form
5604B062R212k491j6717M732o595K783q332N327j0345O130m430r995K680N166
5590b0813R901J075J2347J590p523N811R545j976j5683j4619j3948J6840K38o322
5576b3537N945K67l97J2791l160j2513J333J756R858Q408r285j6004k602J1910
5562a5230Q266J3437J1770Q489j041j7057k2116j1825k475J7867O971j1010k962
5549a6916n906J3936N935Q856k746L964R007o001j7554J2485Q928j6043j1109
5536a3164J2125q232J1865J549n820j314o55N537q092m608P213J7679R225k315
5522B0993m288j6073m810j107N634J0822j6952q966K731k16P785j937r993M247
5508a2130L307J1723J236k352j7511q92J474o063L980O267Q902J7309q834r972
$$ plain form
5494 -3556 -659 8971 15641 1966 -5464 9453 1681 -9540 -1288 5798 -631 1363 977 8380
5480 8380 -2949 -8350 -6096 -559 695 6508 10752 -4565 -16056 -12775 -29914 -17375 -1315
5467 -1315 12081 22919 16815 -1260 -8068 -7470 -8270 -13006 2935 3982 -1170 -132 1461 4089
5453 4089 -7200 -15571 -18636 -12500 -752 -1156 -2859 8367 -32 -6999 8298 23456 19515 3519
5439 3519 -6995 -16200 -25169 -17061 5380 2869 -11920 -145 -22 -2456 1835 39 -11359 -17723
5425 -17723 -8199 26672 26431 13815 15936 19950 21050 17040 19186 21846 14188 4170 6175 8564
5411 8564 3591 2612 -3133 -4643 7085 9663 13980 3287 5429 1893 9789 8444 13839 14871 8036
5396 8036 22654 35244 41020 39240 29800 24532 21592 8297 8463 -6225 -18504 -26121 -16741 -5454
$$ packed form
5494c556K897R630O670j3675p430J4917p772j1221Q252P086o429J994l86P403
5480H380j1329n401K254N537J254N813M244j5317j1491L281j7139J2539J6060
5467a315J3396J0838o104j8075o808N98q00m736J5941J047n152J038J593K628
5453D089j1289q371l065O136J1748m04j703J1226q399o967J5297J5158l941j5996
5439C519j0514r205q969Q108K2441k511j4789J1775J23k434M291j796j1398o364
5425a7723R524L4871k41j2616K121M014J100m010K146K660p658j0018K005K389
5411H564m973r79n745j510J1728K578M317j0693K142l536P896j345N395J032o835
5396H036J4618J2590N776j780r440n268k940j3295J66j4688j2279p617R380J1287
$$ plain form
5382 -5454 -16513 -14677 -13735 -14880 -30631 -20959 -10535 -5083 -8467 5931 3139 -8961 -17134 -7888
5368 -7888 -11093 -6580 -107 2457 8045 4146 -207 9466 15426 2194 13594 22109 17961 26014
5354 26014 14447 -7587 -16592 -18512 -27777 -24535 -16246 -7838 -4269 -18821 -18778 -23039 -4180 2542
5340 2542 -66 -1078 709 -7031 -2331 6875 18031 13422 -5380 -18095 -12054 -6407 -10547 -14492
5326 -14492 -17388 -16081 -8712 -11944 -15713 -7844 -11092 -14426 -27460 -39432 -28125 -11195 -14883 -13143
5312 -13143 -841 -2633 -7835 -15348 -27607 -13460 -6187 -1482 -6513 2231 -11438 -32415 -46693
5299 -46693 -35773 -18077 2227 6341 7878 2643 -789 8674 16507 3386 -6621 -7291 1540 8099
5285 8099 15799 35149 37500 24013 22723 5808 14369 21364 15362 13146 11532 12119 19601 13971
$$ packed form
5382e454j1059J836R42j145j5751R672J0424N452l384J4398k792j2100q173R246
5368g888l205M513O473K564N588l899m353R673N960j3232J1400Q515m148Q053
5354B6014j1567k2034r005j920r265L242Q289Q408L569j4552M3m261J8859O722
5340B542k608j012J787p740M700R206J1156m609j8802j2715O041N647m140l945
5326a4492k896J307P369l232l769P869l248l334j3034j1972J1307J6930l688J740
5312a3143J2302j792n202p513j2259J4147P273M705n031Q744j3669k0977j4278
5299d6693J0920J7696K0304M114J537n235l432R463P833j3121j0007o70Q831O559
5285H099P700J9350K351j3487j290j6915Q561O995o002k216j614N87P482n630
$$ plain form
5271 13971 -2969 -4822 -9478 -4270 7290 10253 8031 4734 -11119 -536 11211 13994 2863
5258 2863 -3981 636 2381 753 2453 11739 712 -1828 1966 -8112 -9794 -539 3765 691
5244 691 -5446 -12490 -3565 -9357 -17004 -13262 3407 12640 11855 6384 -1189 -2913 2400 9577 13402
5229 13402 16837 11535 7496 6936 -6182 -14160 -12941 -10450 4385 8942 7041 -11664 -22738 -12503
5215 -12503 -6329 804 -5235 -19212 -25712 -19975 -23780 -28406 -20657 -9274 -1488 14636 11890 15517
5201 15517 20246 4873 8087 93 -1632 -1179 -9221 -1420 -4796 1532 -6376 -4780 -2309 -1325 5059
5186 5059 7730 -753 -11124 -14192 -11817 -12940 -10145 -8189 1113 -9178 -1827 5086 6038 1705 -1091
5171 -1091 -6507 -13228 -11532 -996 10262 22143 19573 8533 1970 -8068 -16393 -19071 -16455 -17524
$$ packed form
5271A3971j6940j853m656N208J1560K963k222l297j5853J0583J1747K783j1131
5258B863o844M617J745j628J700R286j1027k540L794j0078j682R255M304l074
5244F91o137p044Q925n792p647L742J6669R233p85n471p573j724N313P177L825
5229A3402L435n302m039n60j3118p978J219K491J4835M557j901j8705j1074J0235
5215a2503O174P133o039j3977o500N737l805m626P749J1383P786J6124k746L627
5201A5517M729j5373L214p994j725M53q042P801l376O328p908J596K471R84O384
5186E059K671q483j0371l068K375j123K795J956R302j0291P351O913R52m333k796
5171a091n416o721J696J0536J1258J1881k570j1040o563j0038q325k678K616j069
$$ plain form
5157 -17524 -14266 -12745 -27445 -24590 -12653 -2103 3615 7829 12432 12093 3985 12426 15383 10343
5143 10343 551 -5235 -14557 -9047 -2178 9248 17194 4578 -5728 -13849 -6244 -9895 -20249 -19047
5129 -19047 -20444 -1062 7827 12649 21336 26400 23198 8684 2994 -2338 620 -10 -16599 -16591 -15736
5114 -15736 -18715 -10743 -9955 -3450 2593 18079 17248 3919 979 5622 5295 -6948 3873 -1471
5100 -1471 -3894 -5486 4460 10059 1374 599 2731 1908 -720 -8890 -13495 -17366 -17217 -12069 -15077 -7721
5084 -7721 -1031 11265 3876 -6255 -18082 -23616 -16107 -6725 -2671 -2947 -11254 -29618 -43398 -34993
5070 -34993 -29840 -26230 -27488 -20856 -12597 -3971 -6496 -5701 604 8402 4773 1192 4830 -554 -8040
5055 -8040 -10737 -11767 -4638 -12274 -11576 1862 7521 2254 -6063 -2801 4088 26190 15769 -2711
$$ packed form
5157a7524L258J521j4700K855J1937J0550N718M214M603l39q108Q441K957n040
5143A0343r792n786r322N510O869J1426P946j2616j0306q121P605l651j0354J202
5129a9047j397J9382Q889M822Q687N064l202j4514n690n332K958o30j6589QQ55
5114a5736k979P972P88O505O043J5486q31j3329k940M643l27j2243J0821n344
5100a471k423j592R946N599q685p75K132q23k628q170m605l871J49N148l008P356
5084g721O690J2296p389j0131j1827n534P509R382M054k76q307j8364j3780Q405
5070c4993N153L610j258O632Q259Q626k525P95O305P798l629l581L638n384p486
5055h040k697j030P129p636O98J3438N659n267q317L262O889K2102j0421j8480
$$ plain form
5041 -2711 -16504 -13625 -9598 -10554 -11580 -15659 -7517 -1791 -3821 4869 19724 17280 18190 9335 6137
5026 6137 18010 10513 -19312 -21806 -24247 -30120 -34793 -23311 -13031 -15428 -23032 -15296 -7493 -3739
5012 -3739 -16240 -26537 -26620 -20531 -12357 -10033 375 10747 -2813 -13026 -15018 -20633 -11891 -748
4998 -748 6813 10061 14454 370 -8513 2015 1105 -22227 -30387 -21042 -17333 -208 -5763 -11133
4984 -11133 -7625 13355 8279 3523 13814 7711 2353 11997 -8644 -21510 -27281 -28524 -18734 -5918
4970 -5918 -6645 -3521 -6800 -8666 -11595 -7499 -6672 -11281 -12984 -12586 -3093 9726 18759 15172 8749
4955 8749 6745 8794 13446 -4860 3185 -11562 -14743 -8360 -670 2410 718 303 -1440 1706 137
4940 137 -1375 -16101 -34623 -26111 -14497 -19016 -20256 -12164 -7324 -15451 -22053 -35438 -46228 -37559
$$ packed form
5041b711j3793K879M027r56j026m079Q142N726k030Q690J4855k444R10q855l198
5026F137J1873p497k9825k494k441n873m673J1482J0280k397p604P736P803L754
5012c739j2501j0297q3O089Q174K324J0408J0372j3560j0213j992n615Q742J1143
4998g48P561L248M393j4084q883J0528r10k3332q160R345L709J7125n555n370
4984a1133L508K0980n076m756J0291o103n358R644k0641j2866n771j243R790J2816
4970e918p27L124l279j866k929M096Q27m609j703L98R493J2819R033l587o423
4955H749k004K049M652j8306Q045j4747l181O383P690L080j692m15j743L146j569
4940A37j512j4726j8522Q512J1614m519j240Q092M840q127o602j3385j0790Q669
$$ plain form
4926 -37559 -11211 1117 -6548 -18237 -24557 -32584 -37554 -30988 -19617 -20602 -17301 -7336 -8911 -19231
4912 -19231 -14328 -11818 -25851 -19946 -2170 5975 -9060 -13967 -13055 -7273 2810 3776 8974 2767
4898 2767 -7681 -14712 -19072 -15552 1587 17627 18959 14997 -2164 -11097 -11253 -15186 -12214 7872
4884 7872 3833 -13153 -23471 -20937 -9275 7277 6874 -3954 -6132 3075 8261 20593 17866 -459
4870 -459 2290 16686 9646 6121 -1599 -15791 -18635 -11403 -15303 -18061 -17401 -6148 -3131 -17755
4856 -17755 -22360 -24310 -19248 -8364 5236 8941 5739 1946 -23878 -37852 -33093 -18116 -9279
4843 -9279 -6766 1448 -6038 -5575 -12391 -14491 -10594 -8086 -14414 -13801 -1648 -805 473 6203 2229
4828 2229 335 9722 3454 3515 9849 12312 5277 1567 -5847 2247 -1136 -4247 -8449 -9964 5313
$$ packed form
4926c7559K6348J2328p665j1689o320q027m970O566J1371r85L301R965j575j0320
4912a9231M903K510j4033N905J7776Q145j5035m907R12N782J0083R66N198o207
4898B767j0448p031m360L520J7139J6040J332l962j7161q933j56l933K972K0086
4884G872m039j6986j0318K534J1662J6552m03j0828k178R207N186J2332k727j8325
4870d59K749J4396p040l525p720j4192k844P232l900k758O60J1253L017j4624
4856a7755m605j950N062J0884J3600L705l202l793k5824j3974M759J4977Q837
4843i279K513Q214p486M63o816k100L897K508o328O13J2153Q43J278N730l974
4828B229j894R387o268O1O334K463p035l710p414Q094l383l111m202j515J5277
$$ plain form
4813 5313 9697 9755 13993 16249 4885 19622 30241 24181 9216 -14921 -16512 -4600 -6113 -9759
4799 -9759 -13165 -11503 3793 16999 18400 16079 13569 18337 10666 -1581 -8815 3122 12683 -1956
4785 -1956 -185 7713 6730 -7452 -9164 4374 -1086 -10245 -22719 -22064 -6449 -14402 -26709 -27695
4771 -27695 -24696 -22978 -20520 -14613 -23521 -20464 -3573 12621 6180 -2036 -13364 -22198 -11975 -8089
4757 -8089 -9726 1 16068 16356 1958 13460 15589 -6748 -15360 -3996 -13269 -23080 -12998 -6980
4743 -6980 8787 4844 -9471 -12349 -19942 -18354 -16231 -28114 -26243 -24707 -30801 -16457 -4663 7604
4729 7604 9492 3230 11317 16189 7429 -1083 -6200 -8042 -12656 -16637 -2443 4775 -8053 -19629
4715 -19629 -2395 6067 9750 9882 208 -8421 -13323 -4020 787 4414 163 6789 16078 18382 20228
$$ packed form
4813E313M384N8M238K256j1364J4737J0619o060j4965k4137j591J1912j513l646
4799i759l406J662J5296J3206J401k321k510M768p671j2247p234J1937R561j4639
4785a956J771P898r83j4182j712J3538n460r159j2474O55J5615p953j2307r86
4771b7695K999J718K458N907q908L057J6891J6194o441q216j1328q834J0223L886
4757h089j637R727J6067K88j4398J1502K129k2337q612J1364r273r811J0082O018
4743f980J5767l943j4315k878p593J588K123j1883J871J536o094J4344J1794J2267
4729G604J888o262Q087M872q760q512n117j842m614l981J4194P218j2828j1576
4715a9629J7234Q462L683J32r674q629m902R303M807L627m251O626R289K304J846
$$ plain form
4700 20228 13307 12382 12537 3677 2727 16066 8559 -852 3457 6157 -3168 -10898 -11120 -24477 -20582
4685 -20582 -23420 -22654 -14620 -6485 -1511 -5644 3997 -3094 3076 -8091 -17866 -11442 2084 1365 -10393
4670 -10393 -13041 -9626 7487 11389 10313 1937 8403 10245 -653 -8759 -5964 -5839 -1000 3831
4656 3831 -8683 -13721 -18862 -19732 -10975 1761 -8548 -13305 -3922 -5101 -907 449 3886 -1857
4642 -1857 -6935 -601 16366 10439 89 -9575 -18640 -14989 2388 -5963 4085 1849 -1641 -11046
4628 -11046 -6794 -6032 -10029 -18725 -9497 -4324 634 -6457 -4071 -4416 2384 2996 -5287 -3154 4712
4613 4712 4045 -1983 -15288 -19963 -14099 34 8220 4534 9291 27835 16456 -646 -5072 366
4599 366 -2993 -4717 -13687 -22224 -20246 -15866 -4935 1613 -2208 -19829 -20793 -4603 -2516 935 8090
$$ packed form
4700B0228o921r25J55q860r50J3339p507r411M309K700r325p730k22j3357L895
4685b0582k838P66Q034Q135M974m133R641p091O170j1167r775O424J3526p19j1758
4670a0393k648L415J7113L902j076q376O466J842j0898q106K795J25M839M831
4656C831j2514n038n141q70Q757J2736j0309m757R383j179M194J356L437n743
4642a857n078O334J6967n927j0350r664r065L651J7377q351J0048k236l490r405
4628a1046M252P62l997q696R228N173M958p091K386l45O800O12q283K133P866
4613D712o67o028j3305m675N864J4133Q186l686M757J8544j1379j7102m426N438
4599C66l359j724q970q537J978M380J0931O548l821j7621r64J6190K087L451P155
$$ plain form
4584 8090 -2078 -2161 -10030 -7478 3962 11788 6631 4285 9170 19591 10324 3201 2927 9006 17297
4569 17297 15006 14598 15606 9217 -2690 -1530 1033 4162 931 -507 -2666 -15293 -18548 -15110
4555 -15110 -13118 -13133 -13181 -11033 -3671 -4512 -5600 -6696 -5786 -11920 -4055 3411 372 -1687 5858 7364
4539 7364 7893 -9793 -17915 -11287 -3783 -5859 -12079 -12360 -8488 -5007 -14403 -29464 -28618 -19256 -11708
4524 -11708 -20802 -17938 -17107 -11666 -6534 5717 8146 -3011 -4101 2696 13 -3543 123 12291
4510 12291 14525 10252 10898 16726 24263 28048 12961 4423 -4709 -4064 -5785 -10671 -7405 -5885 -10141
4495 -10141 -7510 -7264 -8234 -344 5344 13202 6570 -4530 -4587 -10469 -215 20185 21202 9175 11698
4480 11698 5768 -7097 -7209 -7655 -6659 -7185 -13525 -9647 -13332 -16540 5299 13024 6288 -6000 -5587
$$ packed form
4584H090j0168q3p869K552J1440P826n157k346M885J0421r267p123k74O079Q291
4569A7297k291m08J008o389j1907J160K563L129l231j438k159j2627l255L438
4555a5110J992j5m8K148P362q41j088j096R10o134P865P466l039k059P545J506
4539G364N29j7686q122O628P504k076o220k81L872L481r396j5061Q46R362P548
4524a1708r094K864Q31N441N132J2251K429j1157j090O797k683l556L666J2168
4510A2291K234m273O46N828P537L785j5087q538r132O45j721m886L266J520m256
4495a0141K631K46r70P890N688P858o632j1100n7n882J0254K0400J017j2027K523
4480A1698n930j2865j12m46R96n26o340L878l685l208K1839P725o736j2288M13
$$ plain form
4465 -5587 -12101 -10794 393 11873 16594 8257 10479 10566 3082 3130 -2623 -413 -7905 -10231 1450
4450 1450 -1050 6747 15876 8021 8050 15541 103 -17830 -16423 -15984 -7586 1316 5323 -9559 -24348
4435 -24348 -21620 -28077 -20913 -8359 -9499 -13148 -15188 -9917 -1299 6139 6985 1563 -9539 -1979
4421 -1979 7365 8793 1868 -1892 -19697 -32429 -13144 -12532 -15523 -3323 2106 -169 -8379 -2203
4407 -2203 -140 5901 -7275 -4019 7361 15201 6376 -1912 -5249 -10417 -6763 -6148 655 -12429
4393 -12429 -15845 4042 7640 5695 10382 13153 13896 3620 2767 -3605 -12193 11089 12697 18593
4379 18593 23266 27513 18665 10093 -160 -15191 -8526 -12790 -3763 3018 3302 1400 -14216 -26392
4365 -26392 -35165 -30377 -27287 -15690 -8892 5815 20943 13423 4484 -4927 -12559 -23844 -15045 -10940
$$ packed form
4465e587o514J307J1187J1480M721q337K222Q7p484M8n753K210p492k326J1681
4450A450k500P797R129p855K9P491j5438j7933J407M39Q398Q902M007j4882j4789
4435b4348K728o457P164J2554j140l649k040N271Q618P438Q46n422j1102P560
4421a979R344J428o925l760j7805j2732J9285O12k991J2200N429k275q210O176
4407b203K063O041j3176L256J1380P840q825q288l337n168L654O15O803j3084
4393a2429l416J9887L598j945M687K771P43j0276q53o372q588K3282J608N896
4379A8593M673M247q848q572j0253j5031O665m264R027O781K84j902j5616j2176
4365b6392q773M788L090J1597O798J4707J5128p520q939r411p632j1285Q799M105
$$ plain form
4351 -10940 -6188 -2332 -3370 -2104 -2425 -6125 6545 2755 7834 12101 522 -7577 -8657 -15777
4337 -15777 -8311 -11773 -12491 -8688 -13737 -14545 -10858 -6078 11625 18644 4966 -5890 -4418 3637
4323 3637 5694 11924 16070 19083 6470 -2779 2437 8764 5989 3646 257 1435 1036 5299 26338
4308 26338 16178 2210 1312 -10862 -1605 -5270 -16101 -25643 -23218 -2216 4570 -9842 -11128
4295 -11128 -6440 -12292 -14821 -7476 -9258 -8521 -9365 -4888 258 4594 -1633 -4800 -9711 -2836 3275
4280 3275 -2950 -14044 -9461 -15432 -15384 -13181 -13627 -6676 -2489 -15113 -11848 -7050 -9838 1466 -1688
4265 -1688 -4938 -7542 -10914 -27299 -18172 51 -9398 -32911 -22267 -2569 9774 6784 -3973
4252 -3973 -7105 -12724 -17399 3128 14184 6245 4563 5036 12916 15092 15390 13705 10193 13658 8872
$$ packed form
4351a0940M752L856j038J266l21l700J2670l790N079M267j1579q099j080p120
4337a5777P466l462p18L803n049q08L687M780J7703P019j3678j0856J472Q055
4323C637K057O230M146L013j2613r249N216O327k775k343l389J178l99M263K1039
4308B6338j0160j3968q98j2174R257l665j0831r542K425K1002O786j4412j286
4295a1128M688n852k529P345j782P37q44M477N146M336o227l167m911O875O111
4280C275o225j1094M583n971M8K203m46O951M187j2624L265M798k788J1304l154
4265a688l250k604l372j6385R127J8223r449k3513J0644J9698J2343k990j0757
4252c973l132n619m675K0527J1056p939j682M73P880K176K98j685l512L465m786
$$ plain form
4237 8872 -1029 -6154 -6031 -8661 -3286 5264 3888 7370 16758 16924 -1956 -23220 -21125 -5402 213
4222 213 -8297 -5490 4755 9409 17002 15634 5949 7407 5446 9436 6276 1639 -6638 -4581 367
4207 367 -8624 -9398 21098 30331 9389 -1050 5878 4778 -4210 -7727 -15980 -20183 -17333 -12982 7061
4192 7061 1462 -17881 -16330 -10471 -634 9799 10537 14464 23883 27940 21029 17797 19429 8592
4178 8592 17836 12335 -10285 -1124 -846 -1773 3831 -847 -6076 -10385 -18279 -14833 -2493 6893 -13137
4163 -13137 -21160 -25703 -27443 -15664 -4349 8544 21321 32701 20305 17886 33228 14272 10142
4150 10142 17176 14041 -12009 -12330 4731 8335 -3189 7222 11192 864 -402 -3524 -9718 -10192
4136 -10192 -14185 -11162 -25893 -25069 -18909 -29346 -29186 -10895 -160 8462 36434 34946 29615 30956
$$ packed form
4237H872r901n125J23k630N375Q550j376L482R388J66j8880k1264K095J5723N615
4222B13q510K807J0245M654P593j368r685J458j961L990l160m637q277K057M948
4207C67q991p74L0496R233k0942j0439O928j100q988l517q253m203K850M351K0043
4192G061n599j9343J551N859R837J0433P38L927R419M057o911l232J632j0837
4178H592R244n501k2620R161K78r27N604m678n229m309p894L446J2340R386k0030
4163a3137q023m543j740J1779J1315J2893J2777J1380j2396k419J5342j8956m130
4150A0142P034l135k6050l21J7061L604j1524J0411L970j0328j266l122o194m74
4136a0192l993L023j4731Q24O160j0437J60J8291J0735Q622K7972j488n331J341
$$ plain form
4122 30956 29799 4130 -6168 -3986 -4014 -5354 -3574 3098 10009 12867 13435 -151 -6617 -4525 -2723
4107 -2723 -7165 -24371 -19571 -16494 -4405 2433 -4653 -2552 15494 23864 8679 9029 -2261 -7596
4093 -7596 -9340 -14762 84 7183 6116 -205 3145 9083 -2652 -10500 -13617 -7216 -5497 -8386
4079 -8386 3810 16962 13604 3514 3143 14013 12509 14616 16236 5959 9720 8535 -2773 -12421
4065 -12421 -3366 -1382 1192 3780 10524 15043 5479 -789 -2720 -15619 -19191 -22700 -17277 -22954
4051 -22954 -13660 933 3687 -5932 -5636 3926 914 9210 5436 -3464 -13368 -23005 -23388 -20626 -20935
4036 -20935 -6292 3588 1444 -4750 -9174 5982 9419 4400 6461 -9481 -23594 -26703 -30384 -25259
4022 -25259 -15388 -16893 -17691 -18497 -10264 -13021 -17522 -5520 -5964 157 -868 -6156 -6703 5073 16711
$$ packed form
4122C0956j157k5669j0298K182k8j340J780O672O911K858N68j3586o466K092J802
4107b723m442j7206M800L077J2089O838p086K101J8046Q370j5185L50j1290n335
4093g596j744n422J4846P099j067o321L350N938j1735p848l117O401J719k889
4079h386J2196J3152l358j0090l71J0870j504K107J620j0277L761j185j1308r648
4065a2421R055J984K574K588O744M519r564o268j931j2899l572l509N423n677
4051b2954R294J4593K754r619K96R562l012Q296l774q900r904r637l83K762l09
4036b0935J4643R880k144o194m424J5156L437n019K061j5942j4113l109l681N125
4022b5259R871j505p98q06Q233k757m501J2002m44O121j025n288n47J1776J1638
$$ plain form
4007 16711 14640 15352 222 -13108 -9000 649 -6015 3428 10821 42 -4854 -4107 -1796 -12971
3993 -12971 -7130 12943 5234 3707 1190 5552 4665 1571 11168 12482 8436 -5920 -8500 -19441
3979 -19441 -18887 -11303 -944 9779 187 -8965 4458 3870 -9410 -24319 -24239 -8638 -5259 -23975
3965 -23975 -7777 63 16101 20051 12163 -7124 -17837 -17579 -4328 -4045 -3859 -12842 -18145 -26575
3951 -26575 -20220 -24129 -12396 797 17580 13473 3480 1091 1523 4033 11773 9993 9515 3202
3937 3202 461 7461 3118 -7101 -7396 -19552 -26933 -32539 -23515 -22848 -20442 -29978 -34098 -35349 -24055
3922 -24055 -2979 9922 1707 -5671 -9362 -5189 8925 19516 8395 3548 1845 7291 -466
3909 -466 -5828 -17276 -10136 -1286 -19873 -18480 -7120 -2157 7830 -11094 -16088 8103 23370 5575
$$ packed form
4007A6711k071P12j5130j3330M108R649o664R443P393j0779m896P47K311j1175
3993a2971N841K0073p709j527k517M362q87l094R597J314m046j4356k580j0941
3979a9441N54P584J0359J0723r592r152J3423n88j3280j4909Q0J5601L379j8716
3965b3975J6198P840J6038L950p888j9287j0713K58J3251K83J86q983n303q430
3951b6575O355l909J1733J3193J6783m107r993k389M32K510P740j780m78o313
3937C202k741P000m343j0219k95j2156p381n606R024O67K406r536m120j251J1294
3922b4055K1076J2901q215p378l691M173J4114J0591j1121m847j703N446p757
3909d66n362j1448P140Q850j8587J393J1360M963R987j8924m994K4191J5267j7795
$$ plain form
3895 5575 3318 3523 1257 -3590 -4372 5388 1895 -4300 -3166 -10177 -12294 -7229 -5928 -5303 1325 5913
3879 5913 -5420 -11789 -122 -209 7010 10823 615 -19569 -16628 -18311 -10606 -8347 -7179 -9433
3865 -9433 -10286 7118 10191 2644 -13547 -13938 -12143 -23755 -24836 -18708 813 3322 -1248 -8195
3851 -8195 -1373 -124 1334 -11006 -11686 -6252 -7793 1532 -3235 -16376 -7567 3804 15189 18810
3837 18810 14532 1359 -6349 11601 28969 25746 19012 1746 4229 1960 -18305 -20638 -13602
$$ packed form
3895E575k257K05k266m847p82R760l493o195J134p011k117N065J301O25O628M588
3879E913j1333o369J1667q7P219L813j0208k0184K941j683P705K259J168k254
3865i433q53J7404L073p547j6191l91J795j1612j081O128J9521K509m570o947
3851h195O822J249J458j2340o80N434j541R325m767j3141Q809J1371J1385L621
3837A8810m278j3173p708J7950J7368l223o734j7266K483k269k0265k333P036
$$ [...]
##END NTUPLES=NMR SPECTRUM
##END=
