##TITLE=Analysis number 320542
Compound Code cc 37616
Book Reference 471/80
Project Code adrs
Chemist Name stevep
##JCAMPDX= 6.0         $$ Bruker NMR JCAMP-DX V2.0
##DATA TYPE= NMR SPECTRUM
##DATA CLASS= NTUPLES
##ORIGIN= Bruker BioSpin GmbH
##OWNER= nmr
$$ XWIN-NMR		Version 3.5
$$ Thu Jun 29 10:22:02 2006 GMT Daylight Time (UT+1h)  MAYBRIDGE\nmr@NMR_250MHZ
##.OBSERVE FREQUENCY= 250.131544655141
##.OBSERVE NUCLEUS= ^1H
##.ACQUISITION MODE= SIMULTANEOUS (DQD)
##.ACQUISITION SCHEME= undefined
##.AVERAGES= 16
##.DIGITISER RES= 18
##SPECTROMETER/DATA SYSTEM= dpx250
##.PULSE SEQUENCE= zg30
##.SOLVENT NAME= CDCl3
##.SHIFT REFERENCE= (INTERNAL, CDCl3, 0, 16.522)
##AUDIT TRAIL= $$ (NUMBER, WHEN, WHO, WHERE, WHAT)
$$ ##TITLE= Audit trail, XWIN-NMR		Version 3.5
$$ ##JCAMPDX= 5.01
$$ ##ORIGIN= Bruker BioSpin GmbH
$$ ##OWNER= nmr
$$ C:\u/data/dgb/nmr/ADRS/1780/pdata/1/auditp.txt
$$ ##AUDIT TRAIL=  $$ (NUMBER, WHEN, WHO, WHERE, WHAT)
(   1,<2006-06-29 10:21:39.59 +100>,<MAYBRIDGE\nmr>,<NMR_250MHZ>,
      <created by zg, POWCHK disabled, PULCHK disabled
       configuration hash MD5:
       E2 DF 36 D8 04 B2 41 60 5A D7 A3 38 5A 4B D0 FE
       data hash MD5: 64K
       B8 40 87 D8 46 0F 89 FE 62 F5 F2 A9 18 7E 63 AC>)
(   2,<2006-06-29 10:21:52.84 +100>,<MAYBRIDGE\nmr>,<NMR_250MHZ>,
      <Start of raw data processing
       ef LB = 0.3 FT_mod = 6 PKNL = 1 SI = 32K 
       data hash MD5: 32K
       C6 5A F5 6E A5 DB C7 2A 42 0D DC 33 3D 2D 93 64>)
(   3,<2006-06-29 10:21:54.35 +100>,<MAYBRIDGE\nmr>,<NMR_250MHZ>,
      <apk 
       data hash MD5: 32K
       34 FA 2D D7 EC 3B C3 8C 20 95 42 43 D3 E6 AA 6B>)
(   4,<2006-06-29 10:21:55.12 +100>,<MAYBRIDGE\nmr>,<NMR_250MHZ>,
      <abs ABSG = 5 
       data hash MD5: 32K
       40 EF 0E E5 69 8B 50 D5 8E 93 CE 7E 9F 83 26 4B>)
$$ ##END=
$$ 
$$ hash MD5
$$ 56 72 AA B3 46 79 58 57 45 30 18 B1 FE 50 F4 64
##$RELAX= 
##$RELAX= 
##$RELAX= 
##$RELAX= 
##$RELAX= 
##$RELAX= 
##$RELAX= 
$$ Bruker specific parameters
$$ --------------------------
##$DU= <C:\u>
##$EXPNO= 1780
##$NAME= <ADRS>
##$PROCNO= 1
##$TYPE= <nmr>
##$USER= <dgb>
##$AMP= (0..31)
100 100 100 100 100 100 100 100 100 100 100 100 100 100 100 100 100 100 
100 100 100 100 100 100 100 100 100 100 100 100 100 100 
##$AQSEQ= 0
##$AQ_mod= 3
##$AUNM= <au_zg>
##$AUTOPOS= <14 >
##$BF1= 250.13
##$BF2= 250.13
##$BF3= 250.13
##$BF4= 250.13
##$BF5= 500.13
##$BF6= 500.13
##$BF7= 500.13
##$BF8= 500.13
##$BYTORDA= 1
##$CFDGTYP= 0
##$CFRGTYP= 5
##$CHEMSTR= <none>
##$CNST= (0..31)
1 1 145 1 1 1 1 1 1 1 1 1 1 1 1 1 1 1 1 1 1 1 1 1 1 1 1 1 1 1 1 1 
##$CPDPRG= <>
##$CPDPRG1= <>
##$CPDPRG2= <>
##$CPDPRG3= <>
##$CPDPRG4= <mlev>
##$CPDPRG5= <mlev>
##$CPDPRG6= <mlev>
##$CPDPRG7= <mlev>
##$CPDPRG8= <mlev>
##$CPDPRGB= <>
##$CPDPRGT= <>
##$D= (0..31)
0 1 0 0 0 0 0 0 0 0.06 0 0 0 0 0 0 0.0002 0 0 0 0 0 0 0 0 0 0 0 0 0 0 
0 
##$DATE= 1151572898
##$DBL= (0..7)
120 120 120 120 120 120 120 120 
##$DBP= (0..7)
150 150 150 150 150 150 150 150 
##$DBP07= 0
##$DBPNAM0= <>
##$DBPNAM1= <>
$$ [...]
##$SUBNAM7= <"">
##$SUBNAM8= <"">
##$SUBNAM9= <"">
##$SW= 20.6930455092707
##$SWIBOX= (0..15)
0 0 3 0 0 0 0 0 0 0 0 0 0 0 0 0 
##$SW_h= 5175.983436853
##$TD= 65536
##$TD0= 1
##$TE= 296.16
##$TE2= 300
##$TE3= 300
##$TEG= 300
##$TL= (0..7)
0 120 120 120 120 120 120 120 
##$TP= (0..7)
150 150 150 150 150 150 150 150 
##$TP07= 0
##$TPNAME0= <>
##$TPNAME1= <>
##$TPNAME2= <>
##$TPNAME3= <>
##$TPNAME4= <>
##$TPNAME5= <>
##$TPNAME6= <>
##$TPNAME7= <>
##$TPOAL= (0..7)
0.5 0.5 0.5 0.5 0.5 0.5 0.5 0.5 
##$TPOFFS= (0..7)
0 0 0 0 0 0 0 0 
##$TUNHIN= 0
##$TUNHOUT= 0
##$TUNXOUT= 0
##$USERA1= <user>
##$USERA2= <user>
##$USERA3= <user>
##$USERA4= <user>
##$USERA5= <user>
##$V9= 5
##$VALIST= <valist>
##$VCLIST= <CCCCCCCCCCCCCCC>
##$VD= 0
##$VDLIST= <DDDDDDDDDDDDDDD>
##$VPLIST= <PPPPPPPPPPPPPPP>
##$VTLIST= <TTTTTTTTTTTTTTT>
##$WBST= 1024
##$WBSW= 4
##$XGAIN= (0..3)
0 0 0 0 
##$XL= 0
##$YL= 0
##$YMAX_a= 466161
##$YMIN_a= -542749
##$ZGOPTNS= <>
##$ZL1= 120
##$ZL2= 120
##$ZL3= 120
##$ZL4= 120
##$ABSF1= 16.522
##$ABSF2= -4.171173
##$ABSG= 5
##$ABSL= 3
##$ALPHA= 0
##$AQORDER= 0
##$ASSFAC= 0
##$ASSFACI= 0
##$ASSFACX= 0
##$ASSWID= 0
##$AUNMP= <proc_1d>
##$AZFE= 0.1
##$AZFW= 0.1
##$BCFW= 0
##$BC_mod= 0
##$BYTORDP= 0
##$COROFFS= 0
##$CY= 12.5
##$DATMOD= 1
##$DC= 0
##$DFILT= <>
##$DTYPP= 0
##$F1P= 14.0000005364418
##$F2P= -0.99999901652339
##$FCOR= 0.5
##$FTSIZE= 32768
##$FT_mod= 6
##$GAMMA= 0
##$GB= 0
##$INTBC= 1
##$INTSCL= 1
##$ISEN= 128
##$LB= 0.3
##$LEV0= 0
##$LPBIN= 0
##$MAXI= 10000
##$MC2= 0
##$MEAN= 0
##$ME_mod= 0
##$MI= 0
##$NCOEF= 0
##$NC_proc= -5
##$NLEV= 6
##$NOISF1= 0
##$NOISF2= 0
##$NSP= 0
##$NTH_PI= 0
##$NZP= 0
##$OFFSET= 16.522
##$PC= 1
##$PHC0= 171.7716
##$PHC1= 4.547266
##$PH_mod= 1
##$PKNL= yes
##$PPARMOD= 0
##$PSCAL= 4
##$PSIGN= 0
##$REVERSE= no
##$SF= 250.13
##$SI= 32768
##$SIGF1= 0
##$SIGF2= 0
##$SINO= 400
##$SIOLD= 32768
##$SREGLST= <1H.CDCl3>
##$SSB= 0
##$STSI= 32768
##$STSR= 0
##$SW_p= 5175.98343685301
##$SYMM= 0
##$S_DEV= 0
##$TDeff= 65536
##$TDoff= 0
##$TI= <Analysis number 999999
Compound Code 99
Book Reference 9
Project Code 9>
##$TILT= no
##$TM1= 0
##$TM2= 0
##$TOPLEV= 0
##$USERP1= <user>
##$USERP2= <user>
##$USERP3= <user>
##$USERP4= <user>
##$USERP5= <user>
##$WDW= 1
##$XDIM= 32768
##$YMAX_p= 476575825
##$YMIN_p= -315803
$$ End of Bruker specific parameters
$$ ---------------------------------
##NTUPLES= NMR SPECTRUM
##VAR_NAME=  FREQUENCY,     SPECTRUM/REAL,   SPECTRUM/IMAG
##SYMBOL=    X,             R,               I
##VAR_TYPE=  INDEPENDENT,   DEPENDENT,       DEPENDENT
##VAR_FORM=  AFFN,          ASDF,            ASDF
##VAR_DIM=   32768,         32768,           32768
##UNITS=     HZ,            ARBITRARY UNITS, ARBITRARY UNITS
##FACTOR=    0.157963299565203, 1,           1
##FIRST=     4132.6476996994, 0,             0
##LAST=      -1043.33573715361, 0,           0
##MIN=       -1043.33573715361, -315803,     0
##MAX=       4132.6476996994, 476575825,     0
$$ Real data points
##PAGE= N=1
##DATA TABLE= (X++(R..R)), XYDATA
$$ [...]
$$ plain form
23777 -23822 8804 -96651 -128415 -97185 -74966 -65260 -100485 -73850 -20717 -33172 -151350
23766 -151350 -184146 -83874 -47453 -68699 -122319 -144090 -86488 -71896 -22600 -40239 -32719
23755 -32719 15439 -25557 -80142 -121321 -120532 -110119 -16501 -646 -990 7215 87903 91041 61970
23742 61970 70980 82798 80580 5434 -103570 -62987 9102 27760 70193 105847 91522 62524
23730 62524 64959 107351 125650 6788 -56788 -10755 -48121 -15743 45295 44777 57582 21147
23718 21147 -43923 -76029 -34947 -5357 -18672 -85884 -56057 15460 55670 77822 70797 71268
23706 71268 91899 19125 40748 37623 -34715 -66734 -22612 14682 52612 96473 111588 9825
23694 9825 55888 108192 6654 -84928 -27296 58541 25638 34714 73755 -4272 -32388 -78520
$$ packed form
23777b3822L2626j05455l1764L1230K2219R706l5225K6635N3133j2455j18178
23766a51350l2796J00272L6421k1246n3620k1771N7602J4592M9296j7639P520
23755c2719M8158m0996n4585m1179P89J0413R3618J5855l44Q205Q0688L138k9071
23742F1970R010J1818k218p5146j09004M0583P2089J8658M2433L5654j4325k8998
23730F2524K435M2392J8299j18862o3576M6033l7366L2378O1038n18J2805l6435
23718B1147o5070l2106M1082K9590j3315o7212K9827P1517M0210K2152p025M71
23706G1268K0631p2774K1623l125p2338l2019M4122L7294L7930M3861J5115j01763
23694I825M6063N2304j01538r1582N7632Q5837l2903R076L9041p8027k8116m6132
$$ plain form
23682 -78520 -123194 -161926 -111568 -49553 -57987 -97716 -40068 -44141 -14695 52109 -21603 -19368
23670 -19368 40637 15206 -27064 -9926 64989 60268 54694 81676 62724 -62619 -89881 -102070
23658 -102070 -10483 60749 88480 73526 26386 -100386 -87848 -51760 -46941 -34743 -13099
23647 -13099 -51167 -58173 717 -843 16456 38063 94619 29860 55800 94751 86955 77284
23635 77284 100839 51176 87063 82938 113475 114347 72125 126968 154140 39557 21741 -40527
23623 -40527 -55370 -48792 -73114 -49671 -27819 -33704 -4319 28539 -9754 -4856 78137 55469
23611 55469 6902 -51133 -35931 -26422 1931 48572 -3359 -81312 10756 10833 -37762 -63632
23599 -63632 -88107 -128249 -67905 38470 175339 206978 169100 57911 -10307 17824 24045
$$ packed form
23682g8520m4674l8732N0358O2015q434l9729N7648m073K9446O6804p3712K235
23670a9368O0005k5431m2270J7138P4915m721n574K6982j8952j25343k7262j2189
23658a02070R1587P1232K7731j4954m7140j26772J2538L6088M819J2198K1644
23647a3099l8068p006N8890j560J7299K1607N6556o4759K5940L8951p796r671
23635G7284K3555m9663L5887m125L0537Q72m2222N4843K7172j14583j7816o2268
23623d0527j4843O578k4322K3443K1852n885K9385L2858l8293M898Q2993k2668
23611E5469m8567n8035J5202R509K8353M6641n1931p7953R2068P7m8595k5870
23599f3632k4475m0142O0344J06375J36869L1639l7878j11189o8218K8131O221
$$ plain form
23588 24045 7970 22445 79495 150144 165761 116905 118527 144840 146442 115135 68981 -646
23576 -646 -11394 -11637 -345 -14789 -39208 -23725 -5027 15267 -21088 -35233 -4058 40566
23564 40566 5953 -42697 -12777 38972 21448 17686 -11456 12373 31717 9641 -133930 -191136
23552 -191136 -141954 -24864 39050 169927 164737 68919 -14470 -81886 -134197 -166066 -102455
23541 -102455 -46973 -69524 -148810 -180538 -152463 -130513 -95320 -65278 -112663 -82442 -89553 -12383
23529 -12383 24274 76373 77031 -23165 -35750 3467 19066 -15727 -56284 -87495 -43511 41028
23517 41028 24538 -16001 18474 122342 101971 34800 -37498 -65124 -11509 80933 62008
23506 62008 -14355 22843 21619 54833 46388 70657 78429 127312 40985 9242 11649 8430 -7455
$$ packed form
23588B4045j6075J4475N7050P0649J5617m8856J622K6313J602l1307m6154o9627
23576f46j0748k43J1292j4444k4419J5483J8698K0294l6355j4145L1175M4624
23564D0566l4613m8650K9920N1749j7524l762k9142K3829J9344k2076j43571n7206
23552a91136M9182J17090O3914J30877n190r5818q3389o7416n2311l1869O3611
23541a02455N5482k2551p9286l1728K8075K1950L5193L0042m7385L0221p111P7170
23529a2383L6657N2099O58j00196j2585L9217J5599l4793m0557l1211M3984Q4539
23517D1028j6490m0539L4475J03868k0371o7171p2298k7626N3615R2442j8925
23506F2008p6363L7198j224L3214q445K4269P772M8883q6327l1743K407l219j5885
$$ plain form
23493 -7455 52543 56963 30386 25553 30608 95365 38810 -3320 -11616 -79890 -118382 -109691 -124063
23480 -124063 -144675 -62475 9280 -36439 -46621 -44529 -37135 -10512 15423 9766 -4441 -70800
23468 -70800 -109460 -113148 -114671 1647 93975 42451 -12232 -24545 -13340 -61631 -100644 -96308
23456 -96308 -75117 -12062 -55231 -74035 -3411 27866 -19559 -59893 34 25015 34434 -25780
23444 -25780 -31274 1673 -12200 -50368 -159821 -138393 -114388 -47467 -22662 -12748 22949 68837
23432 68837 42527 -25220 20436 48142 76557 68641 -25175 -5970 80966 44071 313 -21203
23420 -21203 33131 62621 21066 -74236 -92692 -106593 -86688 -18698 39451 46991 31914 -2007
23408 -2007 13373 13797 -8547 -21669 425 30339 -73297 -171045 -115559 3476 38847 10307
$$ packed form
23493g455N9998M420k6577m833N055O4757n6555m2130q296o8274l8492Q691j4372
23480a24063k0612Q2200P1755m5719j0182K092P394K6623K5935n657j4207o6359
23468g0800l8660l688j523J16318R2328n1524n4683j2313J1205m8291l9013M336
23456i6308K1191O3055m3169j8804P0624L1277m7425m0334N9927K4981R419o0214
23444b5780n494L2947j3873l8168j09453K1428K4005O6921K4805R914L5697M5888
23432F8837k6310o7747M5656K7706K8415p916r3816J9205Q6936l6895m3758k1516
23420b1203N4334K9490m1555r5302j8456j3901J9905O7990N8149P540j5077l3921
23408b007J5380M24k2344j3122K2094K9914j03636r7748N5486J19035L5371k8540
$$ plain form
23396 10307 12755 -53790 -77078 -60503 7449 -4332 8351 3396 -16846 -32865 -33740 32617
23384 32617 34910 -43378 -20024 5797 9195 40216 -21445 -42725 11980 62137 47597 39291
23372 39291 39144 43615 114963 116715 34427 -24129 -37315 8809 -40825 -53617 -37689 -21009
23360 -21009 -29475 -32123 15093 19678 -12792 50689 95172 83494 967 47113 133155 149688
23348 149688 125012 83028 74468 36412 23880 36162 112453 127593 128478 63684 -754 -25344
23336 -25344 2522 18087 44073 15794 21299 28120 -24585 -33837 11438 76827 50992 -37750
23324 -37750 -104634 -91668 41510 66272 77799 31708 -26875 -36827 -10682 -77090 -80200 -27554
23312 -27554 -45377 -54570 -19325 -27138 -87261 -4340 54023 35139 66454 127786 136402 104304
$$ packed form
23396A0307K448o6545k3288J6575O7952j1781J2683m955k0242j6019q75O6357
23384C2617K293p8288K3354K5821L398L1021o1661k1280N4705N0157j4540q306
23372C9291j47M471P1348J752q2288n8556j3186M6124m9634j2792J5928J6680
23360b1009q466k648M7216M585l2470O3481M4483j1678q2527M6146Q6042J6533
23348A49688k4676m1984q560l8056j2532J2282P6291J5140Q85o4794o4438k4590
23336b5344K7866J5565K5986k8279N505O821n2705r252M5275O5389k5835q8742
23324c7750o6884J2966J33178K4762J1527m6091n8583r952K6145o6408l110N2646
23312b7554j7823r193L5245p813o0123Q2921N8363j8884L1315O1332Q616l2098
$$ plain form
23300 104304 41529 -20384 -104265 -174601 -179788 -170350 -104743 -44114 -40586 -71304 -82302 -95275
23288 -95275 -82254 -48463 -104035 -90430 -42053 -69011 -89131 -32390 6040 20289 6006 -34027
23276 -34027 -79501 -93055 -62807 3851 -46652 -48489 -8671 -22229 21463 27713 1715 6641
23264 6641 31653 25712 64135 127631 41359 -38231 -138249 -138254 -18021 46872 -26048 -55573
23252 -55573 -86963 -108972 -114758 -55760 41396 29648 -46436 -52332 -30239 -40450 -41161 -7986
23240 -7986 26036 52123 -838 57755 106682 99453 112500 29730 49903 120008 58504 -81777
23228 -81777 -148344 -176962 -109344 -9441 4466 -42072 8229 33732 65855 76613 76967 97667
23216 97667 108390 63452 -34227 -105882 -63977 -6403 -16983 -39124 -52652 -103132 -137771 -16552
$$ packed form
23300A04304o2775o1913q3881p0336n187R438O5607O0629L528l0718j0998j2973
23288i5275J3021L3791n5572J3605M8377k6958k0120N6741L8430J4249j4283m0033
23276c4027m5474j3554L0248O6658n0503j837L9818j3558M3692O250k5998M926
23264F641K5012n941L8423O3496q6272p9590j00018nJ20233O4893p2920k9525
23252e5573l1390k2009n786N8998R7156j1748p6084n896K2093j0211p11L3175
23240g986L4022K6087n2961N8593M8927p229J3047q2770K0173P0105o1504j40281
23228h1777o6567k8618O7618R9903J3907m6538N0301K5503L2123J0758L54K0700
23216I7667J0723m4938r7679p1655M1905N7574j0580k2141j3528n0480l4639J21219
$$ plain form
23204 -16552 116481 96668 -21318 -32238 642 -59957 -141620 -137174 -39853 18193 -27615
23193 -27615 -44570 23605 55146 49148 565 -3987 27015 709 -76491 -87195 -4005 3573
23181 3573 6143 -17766 19391 67513 45973 69903 7294 -75960 -36558 20280 -57305 -39512
23169 -39512 -18115 -15429 -49658 -74045 -45426 -53713 -18356 22928 20390 19174 242 5629 89115
23156 89115 100860 105076 39530 -61849 -88925 16140 77831 115785 45935 -44786 -60208
23145 -60208 -105573 -75121 123522 164393 104904 52032 56866 -13834 -48165 -14831 46452 -25133
23133 -25133 -79807 -61888 35947 80807 6242 -30081 6996 3071 15560 32551 76127 44558
23121 44558 33728 -17434 -15866 8004 -18553 -26549 7582 14595 -851 -66799 -57603 -17788
$$ packed form
23204a6552J33033j9813j17986j0920L2880o0599q1663M446R7321N8046m5808
23193b7615j6955O8175L1541n998m8583m552L1002k6306p7200j0704Q3190P578
23181C573K570k3909L7157M8122k1540K3930o2609q3254L9402N6838p7585J7793
23169c9512K1397K686l4229k4387K8619q287L5357M1284k538j216j8932N387Q3486
23156H9115J1745M216o5546j01379k7076J05065O1691L7954o9850r0721j5422
23145f0208m5365L0452J98643M0871n9489n2872M834p0700l4331L3334O1283p1585
23133b5133n4674J7919R7835M4860p4565l6323L7077l925J2489J6991M3576l1569
23121D4558j0830n1162J568K3870k6557p996L4131P013j5446o5948R196L9815
$$ plain form
23109 -17788 -18159 45700 113625 63968 -27204 -53971 -59035 -59996 -50062 -51386 -30336 -46364 -113059
23096 -113059 -121394 -141666 -89973 3191 -49111 -78884 -80691 -127062 -76542 -76021 -81306 -64707
23084 -64707 -53431 -45346 -46015 -75296 -40504 3232 12068 -34542 -67856 -141944 -159876 -184018
23072 -184018 -138742 -48048 24045 -37519 -53152 -12089 11928 55873 56462 33740 15761 -9984
23060 -9984 -38825 -11325 27894 -2689 -127351 -131118 -44119 -29147 -20119 68396 78818 6103
23048 6103 47509 35968 49911 148333 90118 74558 61931 109872 121038 56827 -14182 14822
23036 14822 37430 123705 76983 -17247 -63983 -79661 -93002 -47159 -47489 -45327 -63115 -35491
23024 -35491 -95889 -108121 -72334 -8169 43308 -49502 -77765 -80616 -9518 28221 -14564 936
$$ packed form
23109a7788l71O3859O7925m9657r1172k6767n064r61R934j324K1050j6028o6695
23096a13059q335k0272N1693R3164n2302k9773j807m6371N0520N21n285J6599
23084f4707J1276Q085o69k9281L4792M3736Q836m6610l3314p4088j7932k4142
23072a84018M5276R0694P2093o1564j5633M1063K4017M3945N89k2722j7979k5745
23060i984k8841K7500L9219l0583j24662l767Q6999J4972R028Q8515J0422p2715
23048F103M1406j1541J3943R8422n8215j5560j2627M7941J1166o4211p1009K9004
23036A4822K2608Q6275m6722r4230m6736j5678j3341M5843l30K162j7788K7624
23024c5491o0398j2232L5787O4165N1477r2810k8263k851P1098L7739m2785J5500
$$ plain form
23012 936 -15886 -62184 -164023 -187752 -122565 -135439 -108366 -91443 -68398 -44648 33497 10089
23000 10089 -24104 -38174 -27100 50285 86661 -14645 -117166 -106285 -76925 2013 -31507
22989 -31507 -90314 -181251 -172562 -138103 -148109 -131170 -69829 13417 660 -102187 -155433 -209587
22977 -209587 -110461 -31971 -91144 -108984 -95196 -15799 -78059 -119700 -68892 -77398 -68632 -31072
22965 -31072 -22628 10421 47045 1419 -75918 -136051 -96606 12493 75539 102840 107437 6347
22953 6347 -44560 -22394 -82699 -90612 5325 42950 49788 63943 73657 95883 18172 -2498
22941 -2498 88757 88702 39940 14506 -17749 -6454 37481 32421 46914 54333 66448 99468 149943
22928 149943 139038 112095 26881 -21640 39950 36367 -69643 -94513 -98358 -121836 -65931 -61194
$$ packed form
23012I36j6822m6298j01839k3729O5187j2874K7073J6923K3045K3750P8145k3408
23000A0089l4193j4070J1074P7385L6376j01306j02521J0881K9360P8938l3520
22989c1507n8807r0937Q689L4459j0006J6939O1341Q3246j2757j02847n3246n4154
22977b09587R9126P8490n9173j7840J3788P9397o2260m1641N0808q506Q766L7560
22965c1072Q444L3049L6624m5626p7337o0133L9445J09099O3046K7301M597j01090
22953F347n0907K2166o0305p913R5937L7625O838J4155R714K2226p7711k0670
22941b498R1255n5m8762k5434l2255J1295M3935n060J4493P419J2115L3020N0475
22928A49943j0905k6943q5214m8521O1590l583j06010k4870l845k3478N5905M737
$$ plain form
22916 -61194 -90479 -35546 -29577 -90170 -124665 -151155 -65647 -114334 -173197 -168082 -167960 -152464
22904 -152464 -70237 -5177 -44331 -83053 -85583 -69479 -67941 -17602 -73979 -91194 14953 122551
22892 122551 93781 -20286 -55573 -50819 -42086 56821 41200 -47321 -71003 23531 29259 -27875
22880 -27875 -48608 -81452 -102676 -46888 -63681 43337 35833 -32451 3224 11393 13075 27684
22868 27684 58771 55368 37997 2341 -13900 -46935 -84311 -84012 -82364 -87804 -92459 -85647 -59593
22855 -59593 -21767 -14315 -61473 -75046 -88482 -78649 -81421 -144787 -165943 -94964 -51406 177
22843 177 31298 -76235 -52669 40099 47793 -9824 -14841 8929 29704 16606 -11769 48617
22831 48617 35944 -41862 -22997 -29011 -13661 -35754 13396 97642 159270 81012 30124 4284
$$ packed form
22916f1194k9285N4933N969o0593l4495k6490Q5508m8687n8863N115J22J5496
22904a52464Q2227O5060l9154l8722k530J6104J538N0339n6377j7215J06147J07598
22892A22551k8770j14067l5287M754Q733R8907j5621q8521k3682R4534N728n7134
22880b7875k0733l2844k1224N5788j6793J07018p504o8284L5675Q169J682J4609
22868B7684L1087l403j7371l5656j6241l3035l7376K99J648n440m655O812K6054
22855e9593L7826P452m7158j3573j3436R833k772o3366k1156P0979M3558N1583
22843A77L1121j07533K3566R2768P694n7617n017K3770K0775j3098k8375O0386
22831D8617j2673p7806J8865o014J5350k2093M9150Q4246O1628p8258n0888k5840
$$ plain form
22819 4284 -38024 -17294 44548 12928 36643 21402 2509 -60489 -10537 -3414 -4236 2792 33494
22806 33494 86380 142127 124296 84411 43625 -41850 -4564 7285 14963 -84045 -90478 -11825
22794 -11825 10715 24368 11339 62990 -13953 -62729 -31396 -44230 -14600 -43926 -66374 -81614
22782 -81614 -34033 29241 42361 51843 -25802 -54908 -53539 -100559 -42292 -53531 13472 97385
22770 97385 -4587 -118003 -87659 -112830 -98081 -62075 -38821 -4888 -7220 -73984 -84094
22759 -84094 -72530 -58064 -84950 -94912 -111476 -116618 -8864 35352 1792 94052 143597 112216
22747 112216 84512 68363 -4062 -29429 11955 -1383 -49483 -76252 -56835 -43416 -45636 -118141
22735 -118141 -138647 -152599 -82080 2623 87154 109782 114064 47286 -9460 -12037 -19644 -708
$$ packed form
22819D284m2308K0730O1842l1620K3715j5241j8893o2998M9952P123q22P028L0702
22806C3494N2886N5747j7831l9885m0786q5475L7286J1849P678r9008o433P8653
22794a1825K2540J3653j3029N1651p6943m8776L1333j2834K9630k9326k2448j5240
22782h1614M7581O3274J3120R482p7645k9106J369m7020N8267j1239O7003Q3913
22770I7385j01972j13416L0344k5171J4749L6006K3254L3933k332o6764j0110
22759h4094J1564J4466k6886r962j6564n142J07754M4216l3560R2260M9545l1381
22747A12216k7704j6149p2425k5367M1384j3338m8100k6769J9417J3419k220p2505
22735a18141k0506j3952P0519Q4703Q4531K2628M282o6778n6746k577p607J8936
$$ plain form
22723 -708 -19780 -45821 -67597 -23491 -62071 -115090 -77948 15510 98356 120880 47248 25630
22711 25630 36841 3712 -47630 -60082 -66410 -10384 17597 56021 62510 50439 -26389 -33711
22699 -33711 5312 -24362 -63129 -216778 -283221 -169543 -42887 101475 94424 -18736 -36806
22688 -36806 25277 39 -5851 -18725 -29810 -64488 -121756 -117140 -48544 -27922 -550 51308
22676 51308 34278 20576 -8325 -22529 -9544 -13474 -42832 -82203 -110497 -41591 -1355 -15274
22664 -15274 -43802 -8578 24564 581 -47896 -106210 -190985 -113069 -30183 -14030 56852 74206
22652 74206 98740 154294 225626 178200 83441 -19323 -101044 -97157 -67712 -1823 -1476 -6943
22640 -6943 76815 66497 -17775 4235 59806 60472 31597 89787 89947 -34552 -60318 20393
$$ packed form
22723g08j9072k6041k1776M4106l8580n3019L7142R3458Q2846K2524p3632k1618
22711B5630J1211l3129n1342j2452o328N6026K7981L8424O489j2071p6828p322
22699c3711L9023k9674l8767j53649o6443J13678J26656J44362p051j13160j8070
22688c6806O2083k5238n890j2874j1085l4678n7268M616O8596K0622K7372N1858
22676E1308j7030j3702k8901j4204J2985l930k9358l9371k8294O8906M0236j3919
22664a5274k8528L5224L3142k3983m8477n8314q4775P7916Q2886J6153P0882J7354
22652G4206K4534N5554P1332m7426r4759j02764q1721L887K9445O5889L47n467
22640f943Q3758j0318q4272K2010N5571O66k8875N8190J60j24499k5766Q0711
$$ plain form
22628 20393 815 71141 120764 134197 104126 19392 -23580 -70104 -145325 -41347 47522
22617 47522 67089 -96226 -93886 -66998 -84975 -108955 -177165 -130941 -51701 18373 32905 15081
22605 15081 -79143 -121174 -82335 -135671 -160385 -148878 -166886 -217640 -180854 -103001 -7612 -25916
22593 -25916 -88235 -55397 45547 52473 70479 54810 88053 127082 185665 206143 92802
22582 92802 129330 180073 92654 44785 -7487 -89396 -75459 -95345 -74696 -35223 -19771 -25704
22570 -25704 -2993 11438 29603 10351 -57989 -106967 -92343 -156567 -153865 -160550 -145911 -57841
22558 -57841 19144 9135 54310 29437 -22785 -60586 -40012 -46524 -29227 -19203 5043 60668
22546 60668 134789 120607 28691 -2582 -6487 -34596 -39511 -25764 -30702 -52713 -37401 -36266
$$ packed form
22628B0393j9578P0326M9623J3433l0071q4734m2972m6524p5221J03978Q8869
22617D7522J9567j63315K340K6888j7977k3980o8210M6224P9240P0074J4532j7824
22605A5081r4224m2031L8839n3336k4714J1507j8008n0754L6786P7853R5389j8304
22593b5916o2319L2838J00944O926J8006j5669L3243L9029N8583K0478j13341
22582I2802L6528N0743q7419m7869n2272q1909J3937j9886K0649L9473J5452n933
22570b5704K2711J4431J8165j9252o8340m8978J4624o4224K702o685J4639Q8070
22558e7841P6985j0009M5175k4873n2222l7801K0574o512J7297J0024K4246N5625
22546F0668P4121j4182r1916l1273l905k8109m915J3747m938k2011J5312J135
$$ plain form
22534 -36266 30588 5440 -32779 -101979 -80541 -101013 -58612 -85018 -124486 -99259 -117927 -131146
22522 -131146 -47488 47948 67932 -5319 3687 -5264 10056 30542 46292 -38820 -46810 48600
22510 48600 93294 76036 34976 -30231 -1757 37162 111705 125026 111131 121669 174122 187272
22498 187272 102997 126739 156704 128528 85754 73234 119644 46448 17828 80714 102786
22487 102786 3525 4207 6909 702 27671 -2515 -12096 13088 14615 -16869 -60181 16137 -7162
22474 -7162 -23088 24295 48724 32393 -27749 -67260 -59913 -61617 -79961 -107927 -81874 -73577
22462 -73577 -89234 -64191 -19363 -66983 -109212 -59328 -50466 21160 67981 66565 40442 29852
22450 29852 294 -19478 -14728 14458 -13863 36817 116310 93949 106781 101032 108852 66772
$$ packed form
22534c6266O6854k5148l8219o9200K1438k0472M2401k6406l9468K5227j8668j3219
22522a31146Q3658R5436J9984p3251R006q951J5320K0486J5750q5112p990R5410
22510D8600M4694j7258m1060o5207K8474L8919P4543J3321j3895J0538N2453J3150
22498A87272q4275K3742K9965k8176m2774j2520M6410p3196k8620O2886K2072
22487A02786r9261O82K702o207K6969l0186r581K5184J527l1484m3312P6318k3299
22474g162j5926M7383K4429j6331o0142l9511P347j704j8344k7966K6053Q297
22462g3577j5657K5043M4828m7620m2229M9884Q862P1626M6821j416k6123j0590
22450B9852k9558j9772M750K9186k8321N0680P9493k2361J2832n749P820m2080
$$ plain form
22438 66772 63264 117175 149132 213148 201489 108248 -54318 -94816 -123871 -120609 -55073 -99413
22426 -99413 -78885 -80817 -52529 621 89632 122917 106388 112899 97751 65058 -37625 -25490
22414 -25490 123188 104535 38804 68875 93247 108236 66006 105855 101311 98279 43137 20373
22402 20373 -55830 -18731 46468 48617 51352 81100 89074 53387 25543 60426 104938 83289
22390 83289 42427 87155 118973 69720 34556 91607 118323 42066 -50511 -55258 -39902 -44595
22378 -44595 -32321 -11911 28711 -46426 -53944 -71048 -90967 -97050 -147244 -107248 -56976 -41052
22366 -41052 15527 88630 55407 21318 21759 45819 39939 -23511 998 -33387 -43319 9769
22354 9769 28444 84467 50609 20341 22023 9266 -8767 -134039 -182560 -167489 -81932 22200
$$ packed form
22438F6772l508N3911L1957O4016j1659r3241j62566m0498k9055L262O5536m4340
22426i9413K0528j932K8288N3150Q9011L3285j6529O511j5148l2693j02683J2135
22414b5490J48678j8653o5731L0071K4372J4989m2230L9849m544l032n5142k2764
22402B0373p6203L7099O5199K149K735K9748P974l5687k7844L4883M4512k1649
22390H3289m0862M4728L1818m9253l5164N7051K6716p6257r2577m747J5356m693
22378d4595J2274K0410M0622p5137p518j7104j9919o083n0194L9996N0272J5924
22366d1052N6579P3103l3223l4089M41K4060n880o3450K4509l4385r932N3088
22354I769J8675N6023l3858l0268J682j2757j8033j25272m8521J5071Q5557J04132
$$ plain form
22342 22200 83417 67458 22025 -52760 -123190 -87478 -66716 -95552 -71145 -74530 -392 -5192
22330 -5192 -82851 -29692 35184 46888 40760 -3111 -105373 -154891 -75127 -34858 95928 97102
22318 97102 16612 -60372 -106590 -74801 -21750 -30880 -18131 349 -61426 -131869 -151858 -116711
22306 -116711 -102427 -114530 -91209 -90407 -132049 -95479 -29183 -7542 11731 46617 53542 70287
22294 70287 104733 87426 61903 127319 117763 74854 30363 -21107 13564 -39878 -43892 -28138
22282 -28138 -2397 12619 4438 -24333 -89292 -140879 -104202 -72264 -11124 -46864 -40255 -156316
22270 -156316 -178071 -119083 -159716 -169455 -60845 86136 74460 -6849 3688 -57429 -2669
22259 -2669 60527 13288 -45214 -75730 -140916 -109779 -63491 7952 21748 -47401 -66590 -86047
$$ packed form
22342B2200O1217j5959m5433p4785p0430L5712K0762k8836K4407l385P4138m800
22330e192p7659N3159O4876J1704o128m3871j02262m9518P9764M0269J30786J174
22318I7102q0490p6984m6218L1789N3051r130J2749J8480o1775p0443j9989L5147
22306a16711J4284j2103K3321Q02m1642L6570O6296K1641J9273L4886O925J6745
22294G0287L4446j7307k5523O5416r556m2909m4491n1470L4671n3442m014J5754
22282b8138K5741J5016q181k8771o4959n1587L6677L1938O1140l5740O609j16061
22270a56316k1755N8988m0633r739J08610J46981j1676q1309J0537o1117N4760
22259b669O3196m7239n8502l0516o5186L1137M6288P1443J3796o9149j9189j9457
$$ plain form
22247 -86047 -76614 -79199 -42535 -15350 17413 83007 59337 -76805 -79020 64406 82912 69131
22235 69131 86979 37571 40675 -90436 -99173 -72232 -14181 47397 -18880 29248 74316 77146
22223 77146 84074 164569 142516 131742 141606 110127 27574 24864 -27828 -77351 -65708 -82064
22211 -82064 -101874 -43034 -69095 -59135 -29445 -89291 -75285 -105382 -75398 -76186 -114152 -54112
22199 -54112 -36659 -76888 -134846 -85894 17110 105267 127134 65881 33035 -13268 -16676 -39941
22187 -39941 -52232 -5377 -8831 -26080 -41864 2287 3393 -17381 -41382 -10625 -1675 24487
22175 24487 42914 33374 23469 -5285 -44462 -47345 -109322 -41810 65788 11603 18118 58668
22163 58668 32543 84827 110662 33739 -885 -10296 -25921 41957 167507 162493 16688 -8378
$$ packed form
22247h6047R433k585L6664K7185L2763O5594k3670j36142k215J43426J8506j3781
22235F9131J7848m9408L104j31111q737K6941N8051O1578o6277M8128M5068K830
22223G7146O928Q0495k2053j0774R864l1479q2553k710n2692m9523J1643j6356
22211h2064j9810N8840k6061R960K9690n9846J4006l0097K9984p88l7966O0040
22199e4112J7453m0229n7958M8952J03004Q8157K1867o1253l2846m6303l408k3265
22187c9941j2291M6855l454j7249j5784M4151J106k0774k4001L0757Q950K6162
22175B4487J8427r540r905k8754l9177k883o1977O7512J07598n4185O515M0550
22163E8668k6125N2284K5835p6923l4624r411j5625O7878J25550n014j45805k5066
$$ plain form
22151 -8378 -24637 -69739 -53996 -29846 -15795 23842 91090 59147 -13667 -20105 -67508 -94219
22139 -94219 3270 48673 24714 47882 48384 98111 83571 97180 81669 113965 38745 -59170
22127 -59170 -113700 -87708 -66127 -29417 69449 53426 33579 43208 5135 29844 52187 18255
22115 18255 -19502 -574 22304 70090 -2414 44768 32424 28647 94414 130433 68412 30220
22103 30220 3773 -95077 -75129 -18137 -29224 27589 12429 -98762 -95564 -63194 -83426 -38099
22091 -38099 -47049 -37547 -76733 -41514 20446 8514 -8172 18346 22137 17521 -32363 -34480 -25883
22078 -25883 9814 -32095 -36674 -17601 19695 89286 79343 80918 56354 54956 35250 -50731
22066 -50731 409 83326 67442 52694 51038 41391 -6722 11285 -1452 -55830 -24788 -11427
$$ packed form
22151h378j6259m5102J5743K4150J4051L9637O7248l1943p2814o438m7403k6711
22139i4219R7489M5403k3959K3168N02M9727j4540J3609j5511L2296p5220r7915
22127e9170n4530K5992K1581L6710R8866j6023j9847R629l8073K4709K2343l3932
22115A8255l7757J8928K2878M7786p2504M7182j2344l777O5767L6019o2021l8192
22103C0220k6447r8850J9948N6992j1087N6813j5160j11191L198L2370k0232M5327
22091c8099q950R502l9186L5219O1960j1932j6686K6518L791m616m9884k117Q597
22078b5883L5697m1909m579J9073L7296O9591r943J575k4564j398j9706q5981
22066e0731N1140Q2917j5884j4748j656r647m8113J8007j2737n4378L1042J3361
$$ plain form
22054 -11427 52416 120769 99494 89691 97712 117847 46823 -23873 23488 10936 -59781 -137760
22042 -137760 -122755 -75772 -58203 -41145 -84150 -108882 -102136 -97638 -70846 -82947 -75168 653
22030 653 11896 -91803 -163547 -158038 -86034 14282 -35126 -83267 -85660 -37105 -64093 -40291
22018 -40291 -21869 -111246 -144607 -121564 -92681 -54433 -1430 -70836 -132788 -198519 -140365 -121762
22006 -121762 -125752 -93945 -36913 -72295 -75752 -107062 -97973 -2870 -73423 -44651 -6602 16726
21994 16726 29894 5726 53445 -18567 -2243 41572 30776 43850 83964 32350 12552 73484
21982 73484 79600 22690 -42674 -48643 -17022 -81621 -43012 -10955 -62913 -29156 13623 -7764
21970 -7764 4954 53076 97630 86609 67672 97519 129326 -8810 -131919 -33105 71555
$$ packed form
22054a1427O3843O8353k1275r803Q021K0135p1024p0696M7361j2552p0717p7979
22042a37760J5005M6983J7569J7058m3005k4732O746M498K6792j2101P779P5821
22030F53J1243j03699p1744N509P2004J00316m9408m8141k393M8555k6988K3802
22018d0291J8422q9377l3361K3043K8883L8248N3003o9406o1952o5731N8154J8603
22006a21762l990L1807N7032l5382l457l1310R089R5103p0553K8772L8049K3328
21994A6726J3168k4168M7719p2012J6324M3815j0796J3074M0114n1614j9798O0932
21982G3484O116n6910o5364n969L1621o4599L8609L2057n1958L3757M2779k1387
21970g764J2718M8122M4554j1021j8937K9847L1807j38136j23109R8814J04660
$$ plain form
21959 71555 98310 47532 47616 70854 22148 -25191 -35098 -27517 -36160 -11942 -28213 -4827 -15031
21946 -15031 -42328 -64631 -99291 -44586 -7497 65169 21969 -2104 -6759 -9153 -1538 2898
21934 2898 20575 49988 187301 134434 24154 14023 20088 26285 35146 4773 22125 97219
21922 97219 171207 152874 80791 16799 29301 32758 38236 -2967 -107921 -80853 891 89755
21910 89755 53097 97061 52199 -16753 -39298 -147947 -180538 -143936 -61424 -82796 -72290
21899 -72290 -15120 -65729 -53553 13487 55762 135416 95385 62091 12461 -20813 -24489 -15698
21887 -15698 -22010 -38411 -35317 -70834 -51820 -88379 -108587 -64782 2455 38529 31915 -16051
21875 -16051 -121686 -208135 -157384 -90926 -126317 -85236 -25526 -4468 -28880 -50947 -133483
$$ packed form
21959G1555K6755n0778Q4K3238m8706m7339r907P581q643K4218j6271K3386j0204
21946a5031k7297k2303l4660N4705L7089P2666m3200k4073m655k394P615M436
21934B898J7677K9413J37313n2867j10280j0131O065O197Q861l0373J7352P5094
21922I7219P3988j8333p2083o3992J2502L457N478m1203j04954K7068Q1744Q8864
21910H9755l6658M3964m4862o8952k2545j08649l2591L6602Q2512k1372J0506
21899g2290N7170n0609J2176O7040M2275P9654m0031l3294m9630l3274l676Q791
21887a5698o312j6401L094l5517J9014l6559k0208M3805O7237L6074o614m7966
21875a6051j05635q6449N0751O6458l5391M1081N9710K1058k4412k2067q2536
$$ plain form
21864 -133483 -146372 -54407 13736 30757 -24891 -23826 -36904 -76822 -112763 -88652 -32724 -91387
21852 -91387 -144683 -135274 -140485 -46015 -14896 -49553 -15879 -85180 -104880 -55038 -113567 -120142
21840 -120142 -102386 -68159 -57271 -55611 -60371 -122288 -165270 -161409 -113861 -78933 2975 48506
21828 48506 2496 -39794 -58625 -50970 -108986 -86968 -68832 -74753 -96359 -97103 -48414 20534
21816 20534 65946 104888 71654 2535 4054 29850 25578 -48911 -124704 -122953 -56375 37151
21804 37151 54906 -3781 35260 87989 37140 -74875 -6918 5736 58267 83180 51123
21793 51123 -13322 -15657 21229 15243 28317 -38494 -52069 -71228 -86100 -51812 -7475 68701
21781 68701 108225 64731 4385 48043 89419 91481 105066 77786 10122 2467 -39409 11645
$$ packed form
21864a33483j2889R1965O8143J7021n5648J065j3078l9918l5941K4111N5928n8663
21852i1387n3296R409n211R4470L1119l4657L3674o9301j9700M9842n8529o575
21840a20142J7756L4227J0888J660m760o1917m2982L861M7548L4928Q1908M5531
21828D8506m6010m2290j8831P655n8016K2018J8136n921k1606p44M8689O8948
21816B0534M5412L8942l3234o9119J519K5796m272p4489p5793J751O6578R3526
21804C7151J7755n8687L9041N2729n0849j12015O7957J2654N2531K4913l2057
21793E1123o4445k335L6886n986J3074o6811j3575j9159j4872L4288M4337P6176
21781F8701L9524m3494o0346M3658M1376K062J3585k7280o7664p655m1876N1054
$$ plain form
21769 11645 28489 -14552 -7618 42373 -25829 -97464 -147671 -102416 -58399 16002 114738 108381
21757 108381 57390 26419 50227 98179 59299 18210 -5048 -68681 -51159 -8074 15483
21746 15483 1449 -23247 13823 5817 54446 76440 64715 39953 12244 8735 -6664 -10267
21734 -10267 103892 123242 41414 -47849 -81035 -59346 -41119 -54078 -11902 15132 46691
21723 46691 -23546 -76690 -56992 -45765 -58858 -85401 -46598 -11813 31153 72015 -12085 -34029
21711 -34029 -37132 -4909 -40143 -55889 37752 65932 56986 41702 90638 66140 69454 85448
21699 85448 66583 25616 -12424 -102786 -124811 -54537 -206 9482 24760 -1249 -3278 -2157
21687 -2157 -32365 5421 20658 22024 24938 28424 95971 85941 37405 43460 26752 21443 -482
$$ packed form
21769A1645J6844m3041O934M9991o8202p1635n0207M5255M4017P4401R8736o357
21757A08381n0991l0971K3808M7952l8880m1089k3258o3633J7522M3085K3557
21746A5483j4034k4696L7070q006M8629K1994j1725k4762k7709l509j5399l603
21734a0267J14159J9350q1828q9263l3186K1689J8227j2959M2176K7034L1559
21723D6691p0237n3144J9698J1227j3093k6543L8803L4785M2966M0862q4100k1944
21711c4029l103L2223l5234j5746R3641K8180q946j5284M8936k4498L314J5994
21699H5448j8865m0967l8040r0362k2025P0274N4331R688J5278k6009k029J121
21687b157l0208L7786J5237J366K914L486O7547j0030m8536O055j6708n309k1925
$$ plain form
21674 -482 -36930 44587 93964 87082 56972 1112 -59639 -110785 -121774 -121119 -127616 -82040 -76156
21661 -76156 -91149 -123619 -73021 -10216 42839 67664 -19039 -88580 -53744 -29088 8966 11802
21649 11802 1107 -38327 -111774 -84205 -22123 -11930 20956 4122 26654 -6146 -16073 11994
21637 11994 51362 96167 180521 173368 160458 82448 28632 8432 10214 45754 52325 29546
21625 29546 18428 -22487 -17259 -77002 -83513 3340 37803 -18006 -63086 -69789 -126740 -95128
21613 -95128 -27362 -7213 -61619 -90837 -21779 -42904 -81268 -93989 -41537 -63737 -110704 -95887
21601 -95887 -141710 -68210 -79210 -108313 -71762 -44915 -2137 26130 28232 26229 51748 30253
21589 30253 -62618 -112655 -57443 15320 47408 52398 13260 -12775 -90362 -86649 3135 28884
$$ packed form
21674d82l6448Q1517M9377o882l0110n5860o0751n1146j0989O55o497M5576N884
21661g6156j4993l2470N0598O2805N3055K4825q6703o9541L4836K4656L8054K836
21649A1802j0695l9434p3447K7569O2082J0193L2886j6834K2532l2800r927K8067
21637A1994L9368M4805Q4354p153j2910p8010n3816k0200J782L5540O571k2779
21625B9546j1118m0915N228n9743o511Q6853L4463n5809m5080o703n6951L1612
21613i5128O7766K0149n4406k9218O9058k1125l8364j2721N2452k2200m6967J4817
21601i5887m5823P3500j1000k9103L6551K6847M2778K8267K102k003K5519k1495
21589C0253r2871n0037N5212P2763L2088M990l9138k6035p7587L713Q9784K5749
$$ plain form
21577 28884 -59112 -85246 -121733 -131582 -73487 -42897 -71171 -93195 -60183 -53655 -124898 -135541
21565 -135541 -133153 -155890 -88202 -43429 -53906 -85071 -77416 -87174 -96567 -19331 14391 28908
21553 28908 27565 7197 68314 63940 18094 10643 16391 -13187 -53048 -53433 -20453 34202 62014
21540 62014 78837 -53142 -114695 -114319 -101307 -29376 -3488 -65965 -85451 -53756 -66001 -73292
21528 -73292 -64745 -45290 -8029 -64352 -141187 -145053 -19071 103868 78356 71437 56477 3274
21516 3274 37818 27877 -70648 -84373 -79401 -112051 -89978 -124610 -119440 -115333 -112977 -71014 -63487
21503 -63487 -83051 -7241 15285 -29570 -58324 -18061 -54582 -30235 -30772 -69940 -146108 -203757
21491 -203757 -251940 -202755 -170292 -108750 -30493 -484 -36731 -89192 -51205 -77969 -112778
$$ packed form
21577B8884q7996k6134l6487r849N8095L0590k8274k2024L3012O528p1243j0643
21565a35541K388k2737O7688M4773j0477l1165P655r758r393P7236L3722J4517
21553B8908j343k0368O1117m374m5846p451N748k9578l9861l85L2980N4655K7812
21540F2014J6823j31979o1553L76J3012P1931K5888o2477j9486L1695j2245p291
21528g3292Q547J9455L7261n6323p6835l866J25982J22939k5512o919j4960n3203
21516C274L4544r941r8525j3725M972l2650K2073l4632N170M107K356M1963P527
21503f3487j9564P5810K2526m4855k8754M0263l6521K4347n37l9168p6168n7649
21491b03757m8183M9185L2463O1542P8257L0009l6247n2461L7987k6764l4809
$$ plain form
21480 -112778 -125570 -90832 -69493 11701 -22242 -115986 -80220 -56450 -77486 -88626 -66637
21469 -66637 -76312 -45550 -64849 -69012 -32415 2412 93149 149356 122528 72930 -12263 41495
21457 41495 50189 -25261 -76433 -84804 -34249 3834 10086 44553 60811 82726 105928 7890
21445 7890 -103251 -109003 -39935 21542 3128 5977 -33853 -16470 -27732 -73805 -116524 -135532
21433 -135532 -109657 -6115 50559 -9712 42456 11045 -39599 -19752 -21253 -16694 -13528 -106238
21421 -106238 -80541 -108108 -121206 -112394 -162042 -77962 -2426 -29441 11916 -63658 -50994 -36997
21409 -36997 -57428 -63978 -43666 21526 74367 110231 117805 58728 30156 -13354 -65501 -102506
21397 -102506 -84936 -41512 -96147 -136899 -115653 -16000 75973 63349 1241 -7181 88067 76133
$$ packed form
21480a12778j2792L4738K1339Q1194l3943r3744L5766K3770k1036j1140K1989
21469f6637r675L0762j9299m163L6597L4827R0737N6207k6828m9598q5193N3758
21457D1495Q694p5450n1172q371N0555L8083O252L4467J6258K1915K3202r8038
21445G890j11141n752O9068O1477j8414K849l9830J7383j1262m6073m2719j9008
21433a35532K5875J03542N6674o0271N2168l1411n0644J9847j501M559L166r2710
21421a06238K5697k7567j3098Q812m9648Q4080P5536k7015M1357p5574J2664J3997
21409c6997k0431o550K0312O5192N2841L5864P574n9077k8572m3510n2147l7005
21397a02506J7570M3424n4635m0752K1246R9653R1973j2624o2108q422R5248j1934
$$ plain form
21385 76133 11530 -64241 -19079 -4723 -26705 -20627 -46640 -36591 -14144 -821 94163 136971
21373 136971 61837 26599 22792 69455 71471 -5855 -140049 -116440 -91196 -74202 -58937 -84235
21361 -84235 -44804 29125 46281 -6925 34873 -63357 -52586 24368 78375 60724 -12527 -51485
21349 -51485 1595 8378 18067 -19732 -86294 -44784 31961 65592 22029 19392 -71820 -56408
21337 -56408 14434 -37302 -104301 -75838 -66878 -71622 -87906 -21592 12412 74947 151736 100145
21325 100145 86723 70253 3328 50987 86669 63928 -9262 -30104 35708 -63105 -161719
21314 -161719 -155174 -160044 -108351 -64653 24799 129777 64349 60355 128030 63475 -6410 -3391
21302 -3391 32841 13203 57959 27029 39103 -13081 -19117 -5397 35779 72010 -21242 -90692
$$ packed form
21385G6133o4603p5771M5162J4356k1982O078k6013J0049K2447J3323R4984M2808
21373A36971p5134l5238l807M6663K016p7326j34194K3609K5244J6994J5265k5298
21361h4235L9431P3929J7156n3206M1798r8230J0771P6954N4007j7651p3251l8958
21349e1485N3080O783R689l7799o6562M1510P6745L3631m3563k637r1212J5412
21337e6408P0842n1736o6999K8463Q960m744j6284O6314L4004O2535P6789n1591
21325A00145j3422j6470o6925M7659L5682k2741p3190k0842O5812r8813r8614
21314a61719O545m870N1693M3698Q9452J04978o5428l994O7675o4555o9885L019
21302c391L6232j9638M4756l0930J2074n2184o036J3720M1176L6231r3252o9450
$$ plain form
21290 -90692 -124494 -121317 -153597 -154959 -159500 -241167 -199937 -182998 -146981 -157111 -110095 -115755
21278 -115755 -75117 1864 -13291 -43060 -71585 -8287 38417 68964 40156 4985 -49987
21267 -49987 -86745 -77162 -115523 -121802 -114765 -88084 -143254 -208574 -220018 -183898 -100166 -85161
21255 -85161 -137042 -73310 -60189 -113929 -55486 -39254 -2456 107597 62096 -85191 -159684
21244 -159684 -109254 -34809 -18327 -72784 -104521 -67071 -43885 -28135 -19673 -4239 -36027 -34836
21232 -34836 -73720 -60836 -4366 46717 27218 -22570 -47404 -84410 -84881 -63030 22202 79601
21220 79601 109560 44411 -31186 -46332 51227 74226 49612 92871 1317 -52389 -51460 3909
21208 3909 18394 -41279 -56059 -11294 63002 78485 30230 -16212 2472 26751 15395 35724
$$ packed form
21290i0692l3802L177l2280j362m541q1667M1230J6939L6017j0130M7016n660
21278a15755M0638P6981j5155k9769k8525O3298M6704L0547k8808l5171n4972
21267d9987l6758R583l8361o279P037K6681n5170o5320j1444L6120Q3732J5005
21255h5161n1881O3732J3121n3740N8443J6232L6798J10053m5501j47287p4493
21244a59684N0430P4445J6482n4457l1737L7450K3186J5750Q462J5434l1788J191
21232c4836l8884J2884N6470N1083j9499m9788k4834l7006m71K1851Q5232N7399
21220G9601K9959o5149p5597j5146R7559K2999k4614M3259r1554n3706R29N5369
21208C909J4485n9673j4780M4765P4296J5483m8255m6442J8684K4279j1356K0329
$$ plain form
21196 35724 43466 34214 -8206 903 1456 38757 17567 87500 166612 131919 116520 99203 21329
21183 21329 -10227 -14658 -29026 -21063 -37288 -44742 -37167 -92373 -2412 101829 69828 36025
21171 36025 5367 -14989 -27359 -13708 -90944 -113463 -146747 -175554 -81694 48273 94097
21160 94097 40099 -38362 -70385 794 -31317 5105 40925 37163 638 19045 -32766 -36670
21148 -36670 2099 30641 41399 30083 70605 106871 79962 89442 43833 -27933 -61095 -86485
21136 -86485 -76291 -56135 -84074 -104973 -64350 47833 40291 -46337 -109809 -130490 -69360 -97433
21124 -97433 -127603 -157292 -145424 -114031 -75463 -105746 -162005 -193100 -192602 -115241 -82915 -9838
21112 -9838 69586 49150 -35035 -53989 -102168 -155546 -132050 -132029 -54178 -40452 -73276 -52143
$$ packed form
21196C5724P742r252m2420R109N53L7301k1190O9933P9112l4693j5399j7317p7874
21183B1329l1556m431j4368P963j6225p454P575n5206Q9961J04241l2001l3803
21171C6025l0658k0356j2370J3651p7236k2519l3284k8807R3860J29967M5824
21160I4097n3998p8461l2023P1179l2111L6422L5820l762l6525J8407n1811l904
21148c6670L8769K8542J0758j1316M0522L6266k6909R480m5609p1766l3162k5390
21136h6485J0194K0156k7939k0899M0623J12183p542q6628o3472k0681O1130k8073
21124i7433l0170k9689J1868L1393L8568l0283n6259l1095M98P7361L2326P3077
21112i838P9424k0436q4185j8954m8179n3378K3496K1P7851J3726l2824K1133
$$ plain form
21100 -52143 35507 35598 -33304 -80049 -126604 -93104 -7420 32644 -1150 -25508 -6343 21808
21088 21808 25794 11191 -44464 -25464 14320 12485 38145 82529 9797 -114512 -110147 -18054
21076 -18054 -65038 -23272 56345 88793 58577 41273 -33943 4740 -9220 -36108 -59733 47203
21064 47203 73516 61951 44386 -30626 -58119 -33729 -97582 -64810 10556 54681 537 2056
21052 2056 -1273 -44618 -42757 -44195 -40891 -42403 -63139 6308 65141 76112 27663 -49194 -30709
21039 -30709 -79383 -89489 -94449 -91946 -79318 -114778 -87011 -117503 -180767 -177125 -61509 -21144
21027 -21144 -41244 -20446 -67503 -106752 -130543 -135655 -173077 -46202 -4873 -33487 -2854 -6753
21015 -6753 4146 5409 21450 -25394 29266 33026 47217 83495 -3439 -9405 -26331 -37721
$$ packed form
21100e2143Q7650R1o8902m6745m6555L3500Q5684M0064l3794k4358J9165K8151
21088B1808L986j4603n5655J9000L9784j835K5660M4384p2732j24309M365R2093
21076a8054m6984M1766P9617L2448l0216j7304p5216L8683j3960k6888k3625J06936
21064D7203K6313j1565j7565p5012k7493K4390o3853L2772P5366M4125n4144J519
21052B056l329m3345J861j438L304j512k0736O9447N8833J0971m8449p6857J8485
21039c0709m8674j0106m960K503J2628l5460K7767l0492o3264L642J15616M0365
21027b1144k0100K0798m7057l9249k3791n112l7422J26875M1329k8614L0633l899
21015f753J0899J263J6041m6844N4660L760J4191L6278q6934n966j6926j1390
$$ plain form
21003 -37721 1588 76201 -8620 -46050 9168 36960 -12461 19201 143698 113411 105203 89086
20991 89086 17027 506 -10336 -94784 -105754 -89522 -50214 8643 42197 46631 -33317 -71192
20979 -71192 -90175 -85079 -105368 -154920 -146639 -145166 -94884 -56423 -72724 -129930 -136140 -45289
20967 -45289 50023 39578 -26753 -32805 11971 13164 48591 110790 32228 -8927 -20218 -2973
20955 -2973 -3228 -40930 -93730 -79786 -88 49969 32979 86821 92205 -5865 -14703 68337 26142
20942 26142 -51424 -94956 -145274 -145143 -122046 -66063 -94908 -74743 -772 31125 -54484 -103108
20930 -103108 -84998 -33157 53927 27129 12819 14095 -67171 -172558 -131623 -86459 -44166
20919 -44166 -52650 -32747 -34682 37156 -10755 -38044 -42411 55956 84860 40314 -2590 -70552
$$ packed form
21003c7721L9309P4613q4821l7430N5218K7792m9421L1662J24497l0287q208j6117
20991H9086p2059j6521j0842q4448j0970J6232L9308N8857L3554M434p9948l7875
20979g1192j8983N096k0289m9552Q281J473N0282L8461j6301n7206o210R0851
20967d5289R5312j0445o6331o052M4776J193L5427O2199p8562m1155j1291J7245
20955b973k55l7702n2800J3944P9698N0057j6990N3842N384r8070q838Q3040m2195
20942B6142p7566m3532n0318J31K3097N5983k8845K0165P3971L1897q5609m8624
20930a03108J8110N1841Q7084k6798j4310J276q1266j05387M0935M5164M2293
20919d4166q484J9903j935P1838m7911k7289m367R8367K8904m4546m2904o7962
$$ plain form
20907 -70552 -93759 -3301 -9586 -53864 -73520 -9344 -13997 -18654 -57415 -95819 -118170 -94410
20895 -94410 -19657 61977 31124 67006 36127 8047 -55925 -111150 -65917 19894 64495 -37444
20883 -37444 -142136 -166338 -87309 -99884 -151044 -160515 -148973 -116987 28958 25367 -40113 -21045
20871 -21045 -106256 -154056 -136913 -109444 -87974 -142271 -80644 6629 34280 -22689 -50823 -47432
20859 -47432 -617 -22694 30655 54161 -7647 -23443 -13400 44119 62325 -750 -89628 -39106
20847 -39106 -38452 -42622 -38160 -64167 -80950 -74233 -39755 -63469 -70322 -24143 -30265 -40482 -81773
20834 -81773 -127451 -85791 -26950 -65579 -78431 -125175 -85047 13846 132475 212105 159685
20823 159685 63243 -58515 53308 145708 121930 128343 116231 89450 18645 -7847 -42325
$$ packed form
20907g0552k3207R0458o285m4278j9656O4176m653m657l8761l8404k2351K3760
20895i4410P4753Q1634l0853L5882l0879k8080o3972n5225M5233Q5811M4601j01939
20883c7444j04692k4202P9029j2575n1160r471J1542L1986J45945l591o5480J9068
20871b1045q5211m7800J7143K7469K1470n4297O1627Q7273K7651n6969k8134L391
20859d7432M6815k2077N3349K3506o1808j5796J0043N7519J8206o3075q8878N0522
20847c9106O54m170M462k6007j6783O717L4478k3714o853M6179o122j0217m1291
20834h1773m5678M1660N8841l8629j2852m6744M0128R8893J18629P9630n2420
20823A59685r6442j21758J11823R2400k3778O413j2112k6781p0805k6492l4478
$$ plain form
20812 -42325 -14448 -37264 -59497 -41433 -47719 -134861 -109964 -162708 -157829 -125897 -144676 -124138
20800 -124138 -22437 -5111 1613 -47966 -65119 -90373 -124568 -25091 79200 99250 78163
20789 78163 74201 -4929 4768 -7977 -33497 -94022 -93203 -106400 -48171 -14661 14314 34376
20777 34376 119869 102826 39445 -115 23980 33552 -15961 -106943 -114115 -145633 -161370 -144111
20765 -144111 -142963 -32752 -31485 -54876 -119048 -160006 -190857 -131725 -131917 -97040 -111111 -78877
20753 -78877 -111768 -100427 -36136 -47514 -153283 -141071 -116210 -119473 -45558 -1218 9323 -6425
20741 -6425 -19824 -530 19755 -10639 -54988 -36836 -60631 -47093 -31687 -56457 -102931 -88796
20729 -88796 -110747 -109772 -57089 -33791 -92727 -115239 -32113 6626 -55608 -93740 -125408 -165870
$$ packed form
20812d2325K7877k2816k2233J8064o286q7142K4897n2744M879L1932j8779K0538
20800a24138J01701J7326O724m9579j7153k5254l4195R9477J04291K0050k1087
20789G8163l962p9130R697j2745k5520o0525Q19j3197N8229L3510K8975K0062
20777C4376Q5493j7043o3381l9560K4095R572m9513r0982p172l1518j5737J7259
20765a44111J148J10211J267k3391o4172m0958l0851N9132j92L4877j4071L2234
20753g8877l2891J1341O4291j1378j05769J2212K4861l263P3915M4340J0541j5748
20741f425j3399J9294K0285l0394m4349J8152k3795J3538J5406k4770m6474J4135
20729h8796k1951R75N2683K3298n8936k2512Q3126L8739o2234l8132l1668m0462
$$ plain form
20717 -165870 -122423 -78572 -17739 13714 8679 12257 90836 139400 149660 79054 159342 153242
20705 153242 50866 -25126 -92829 -149525 -141192 -83942 -48701 -102763 -77337 -74786 -83376 -52193
20693 -52193 -58674 31767 -6678 -25846 7170 50825 69621 50441 7130 -46008 -25411 -55042
20681 -55042 -22781 4551 30949 11286 -7339 -27896 -1491 47111 34494 5830 24856 74199
20669 74199 106119 95292 47612 23813 -22676 -732 13196 -2331 -133776 -142627 -82593 -42033
20657 -42033 64594 48609 -45014 -99827 -73478 -2730 -49266 -30369 -37078 -51685 30210 57978
20645 57978 66022 32822 27375 28257 -51020 -95071 -55580 -117003 -122925 -41544 30367 -15328 -46098
20632 -46098 -91738 -85220 -35725 -66419 -80651 -17777 97520 109651 26294 -41052 -172235
$$ packed form
20717a65870M3447M3851O0833L1453n035L578P8579M8564J0260p0606Q0288o100
20705A53242j02376p5992o7703n6696Q333N7250L5241n4062K5426K551q590L1183
20693e2193o481R0441l8445j9168L3016M3655J8796j9180m3311n3138K0597k9631
20681e5042L2261K7332K6398j9663j8625k0557K6405M8602j2617k8664J9026M9343
20669G4199L1920j0827m7680k3799m6489K1944J3928j5527j31445q851O0034M0560
20657d2033J06627j5985r3623n4813K6349P0748m6536J8897o709j4607Q1895K7768
20645E7978Q044l3200n447Q82p9277m4051L9491o1423n922Q1381P1911m5695l0770
20632d6098m5640O518M9495l0694j4232O2874J15297J2131q3357o7346j31183
$$ plain form
20621 -172235 -166917 -52557 11387 37562 74033 56399 -19072 -104990 -97029 -66659 -126119 -56940
20609 -56940 2164 42331 34512 24619 -23844 -26566 -34033 62069 59668 -27525 -76084 -19581 31297
20596 31297 14899 -6861 36250 33571 24070 39480 -28825 33026 79553 75178 82325 32029
20584 32029 -673 25279 71985 9990 -36568 -14995 63174 77155 -35337 -64915 -18694
20573 -18694 30696 30181 1078 -21244 -30098 -5322 102133 135409 25229 22635 11882 38406
20561 38406 55058 -6756 -10391 -12291 -39504 -123854 -98853 -73416 -3205 12978 41758 48998
20549 48998 7688 -32308 -93131 -188309 -198189 -158288 -125728 -93331 9758 65624 773 -46208
20537 -46208 -86256 -76462 -100298 -120571 -106604 -84408 23891 134964 77064 4614 -52984
$$ packed form
20621a72235N318J14360O3944K6175L6471j7634p5471q5918P961L0370n9460O9179
20609e6940N9104M0167p819r893m8463k722p467R6102k401q7193m8559N6503N0878
20596C1297j6398k1760M3111k679r501J5410o8305O1851M6527m375P147n0296
20584C2029l2702K5952M6706o1995m6558K1573P8169J3981j12492k9578M6221
20573a8694M9390n15k9103k2322q854K4776J07455L3276j10180k594j0753K6524
20561C8406J6652o1814l635j900k7213q4350K5001K5437P0211J6183K8780P240
20549D8998m1310l9996o0823r5178r880L9901L2560L2397J03089N5866o4851m6981
20537d6208m0048R794k3836k0273J3967K2196J08299J11073n7900p2450n7598
$$ plain form
20526 -52984 -71486 -21341 44637 57974 -47519 -141557 -95578 -47751 -38013 -60872 -58723 -36387
20514 -36387 -36522 -76284 -100071 -135996 -136953 -48042 136141 153723 48333 51147 69028 14996
20502 14996 -19099 -49818 -114004 -178152 -123132 -112029 -78545 -12690 -31501 -40080 -2303 -60479
20490 -60479 -101332 -53719 -57184 -10038 7111 -11683 -110474 -207515 -122077 -118810 -84239 44114
20478 44114 15196 22334 -30335 -34507 -58287 -40596 -35763 -91528 -130218 -161324 -106412 -22357
20466 -22357 -65532 -100871 -85984 -64523 -56544 -64948 -105121 -102546 -115141 -130980 -118845 -154355
20454 -154355 -158703 -140461 -57296 -50348 -82870 -114241 -122174 -119333 -173534 -221284 -201503 -136089
20442 -136089 -72239 9505 1946 -6814 14994 -38453 17992 -47975 -112539 -101524 3445 -1707
$$ packed form
20526e2984j8502N0145O5978J3337j05493r4038M5979M7827R738k2859K149K2336
20514c6387j35l9762k3787l5925r57Q8911J84183J7582j05390K814J7881n4032
20502A4996l4095l0719o4186o4148N5020J1103L3484O5855j8811q579L7777n8176
20490f0479m0853M7613l465M7146J7149j8794r8791r7041Q5438L267L4571J28353
20478D4114k8918P138n2669m172k3780J7691M833n5765l8690l1106N4912Q4055
20466b2357m3175l5339J4887K1461P979q404m0173K575j2595j5839J2135l5510
20454a54355m348J8242Q3165O948l2522l1371p933K841n4201m7750J9781O5414
20442a36089O3850Q1744p559q760K1808n3447N6445o5967o4564J1015J04969n152
$$ plain form
20430 -1707 -45961 -100131 -94958 -138200 -164555 -167647 -89673 -40547 -78899 -142758 -91531 -15194
20418 -15194 -76617 -164368 -198117 -171022 -177427 -154615 -108823 -24207 86803 8642 -22520 37625
20406 37625 -19893 -62931 -39395 6939 -2749 10261 -39655 -30795 -11047 1942 8335 -36808
20394 -36808 -157479 -163285 -76539 -47147 58509 54867 23287 53112 28325 -6536 -33445 18737
20382 18737 12943 29366 6793 -2872 17201 145524 144481 57612 -35522 -23660 -7529 41492
20370 41492 90252 67595 -2849 -41614 -25601 -22593 -26535 -14346 -4195 -9663 -65681 5630
20358 5630 62132 29563 6812 19739 41473 71331 48669 34548 -10918 -34499 2050 -50758
20346 -50758 -141800 -134499 -133946 -133152 -137941 -70131 -25453 18591 57032 97332 114931 86256 47494
$$ packed form
20430a707m4254n4170N173m3242k6355l092P7974M9126l8352o3859N1227P6337
20418a5194o1423q7751l3749K7095o405K2812M5792Q4616J11010p8161l1162O0145
20406C7625n7518m3038K3536M6334r688J3010m9916Q860J9748J2989O393m5143
20394c6808j20671n806Q6746K9392J05656l642l1580K9825k4787l4861k6909N2182
20382A8737n794J6423k2573r665K0073J28323j043q6869r3134J1862J6131M9021
20370D1492M8760k2657p0444l8765J6013L008l942J2189J0151n468n6018P1311
20358E630N6502l2569k2751J2927K1734K9858k2662j4121m5466k3581L6549n2808
20346e0758r1042P301N53P94m789O7810M4678M4044L8441M0300J7599k8675l8762
$$ plain form
20333 47494 -4812 -49437 -27103 -58947 -38970 -13321 -37905 -86928 -33801 38669 29128 -70616
20321 -70616 -156407 -155792 -99599 -46085 65692 71501 30937 -29512 -14404 51317 2886 -15783
20309 -15783 13679 51164 44292 12020 -37406 -70949 -35089 -65446 -36224 11972 19222 -32255
20297 -32255 -50354 13724 16858 -57418 -75585 -83093 -95886 -56757 -57141 -54200 4280 53472 55675
20284 55675 35713 -37567 -23826 -25074 -7974 27248 31464 70475 59500 -13160 -63555 -62937
20272 -62937 -84865 -52404 -41197 -26506 -35794 -119733 -75548 70819 134731 120305 61996 24746
20260 24746 -45955 -19141 13848 44425 79613 62905 13665 -29035 -23931 22370 -51668 -73388
20248 -73388 -60112 -95854 -113933 -97303 15212 -18010 -85590 -24256 75363 31173 -463
$$ packed form
20333D7494n2306m4625K2334l1844J9977K5649k4584m9023N3127P2470r541r9744
20321g0616q5791O15N6193N3514J11777N809m0564o0449J5108O5721m8431j8669
20309a5783K9462L7485o872l2272m9426l3543L5860l0357K9222M8196P250n1477
20297c2255j8099O4078L134p4276j8167p508j2793L9129l84K941N8480M9192K203
20284E5675j9962p3280J3741j248J7100L5222M216L9011j0975p2660n0395O18
20272f2937k1928L2461J1207J4691r288q3939M4185J46367O3912j4426n8309l7250
20260B4746p0701K6814L2989L0577L5188j6708m9240m2700N104M6301p4038k1720
20248g3388J3276l5742j8079J6630J12515l3222o7580O1334R9619m4190l1636
$$ plain form
20237 -463 50515 -6879 -16549 15396 28180 42596 31457 11333 37141 51581 -4417 104027
20225 104027 215039 174991 130065 75659 -14394 -16347 16979 -11623 -87450 -47419 -14214
20214 -14214 -40695 49350 75661 14874 20706 163105 172486 167842 190873 133894 121171 102266
20202 102266 141114 136417 54368 76409 144060 142998 156556 179993 156748 116577 146691 199149
20190 199149 341794 511446 621434 631169 645372 688546 579643 413971 306155 245513
20180 245513 192368 224684 244633 254662 317029 410293 503718 601160 606793 660119 805931
20169 805931 905364 988553 985766 855811 749062 715408 645178 520070 441320 331799 204429
20158 204429 167899 158177 188234 227263 335787 478304 620134 679291 704188 770948 773799
$$ packed form
20237d63N0978n7394r670L1945J2784J4416j1139k0124K5808J4440n5998J08444
20225A04027J11012m0048m4926n4406r0053j953L3326k8602p5827M0031L3205
20214a4214k6481R0045K6311o0787N832J42399R381m644K3031n6979j2723j8905
20202A02266L8848m697q2049K2041O7651j062J3558K3437k3245m0171L0114N2458
20190A99149J42645J69652J09988R735J4203M3174j08903j65672j07816o0642
20180B45513n3145L2316J9949J0029O2367R3264R3425R7442N633N3326J45812
20169H05931R9433Q3189k787j29955j06749l3654p0230j25108p8750j09521j27370
20158B04429l6530r722L0057L9029J08524J42517J41830N9157K4897O6760K851
$$ plain form
20147 773799 704042 619668 536257 465121 353846 264560 166060 168030 224490 246213 210184
20136 210184 239122 227884 170064 110722 4363 -28096 99593 216547 134411 52856 52950
20125 52950 -17556 -16097 66509 53339 80741 97033 127923 163944 96825 99978 79856 122087
20113 122087 36985 -33573 -39835 13897 101593 81743 67148 54880 57459 29390 -34000 -107
20101 -107 24123 -35782 -35951 70990 43859 18725 2261 41135 36915 -61769 -128333 -54878
20089 -54878 -93361 -60680 -88262 -139476 -126277 -58239 -2676 -31698 -87245 -121096 -72964 -42323
20077 -42323 2413 13600 49061 87179 41936 -61779 -133185 -65782 -9770 -15577 -11218 38633
20065 38633 102746 100102 30352 33512 115861 149336 60987 2921 -99972 -113210 -61410 -84656
$$ packed form
20147G73799o9757q4374q3411p1136j11275q9286r8500J970N6460K1723l6029
20136B10184K8938j1238n7820n9342j06359l2459J27689J16954q2136q1555R4
20125E2950p0506J459Q2606j3170K7402J6292L0890L6021o7119L153k0122M2231
20113A22087q5102p0558o262N3732Q7696j9850j4595j2268K579k8069o3390L3893
20101a07K4230n9905j69J06941k7131k5134j6464L8874m220r8684o6564P3455
20089e4878l8483L2681k7582n1214J3199O8038N5563k9022n5547l3851M8132L0641
20077d2323M4736J1187L5461L8118m5243j03715p1406O7403N6012n807M359M9851
20065C8633O4113k644o9750L160Q2349L3475q8349n8066j02893j3238N1800k3246
$$ plain form
20053 -84656 -112095 -56307 -39742 3470 -41334 7481 8541 75658 41268 -72835 -159731 -95115
20041 -95115 -37427 14181 -10609 -66441 -82089 -40894 -21525 -20702 42902 44793 -23525 -31871
20029 -31871 -51581 -54990 -16763 -61221 -92224 -107247 -79765 -67923 -106542 -116730 -98696 -30627
20017 -30627 -51065 -79664 -35116 51100 110407 74728 75580 53480 -15654 -99464 -101783 -52005
20005 -52005 -35388 12262 82489 101122 108950 138813 180428 124869 136838 113835 14999 -23514
19993 -23514 -46217 -69925 -2324 31162 -27453 -53132 36498 69525 10867 -111 48292 58225
19981 58225 18750 -20514 56652 97665 36455 -31746 -16749 6871 41461 70917 37942 21490
19969 21490 48459 161444 76118 38777 43843 40304 85563 115802 80217 70781 87457 134311
$$ packed form
20053h4656k7439N5788J6565M3212m4804M8815J060O7117l4390j14103q6896O4616
20041i5115N7688N1608k4790n5832j5648M1195J9369Q23O3604J891o8318q346
20029c1871j9710l409L8227m4458l1003j5023K7482J1842l8619j0188J8034O8069
20017c0627k0438k8599M4548Q6216N9307l5679Q52k2100o9134q3810k319M9778
20005e2005J6617M7650P0227J8633P828K9863M1615n5559J1969k3003r8836l8513
19993b3514k2703k3708O7601L3486n8615k5679Q9630L3027n8658j0978M8403R933
19981E8225l9475l9264P7166M1013o1210o8201J4997K3620L4590K9456l2975j6452
19969B1490K6969J12985q5326l7341N066l539M5259L0239l5585r436J6676M6854
$$ plain form
19957 134311 126881 41333 6485 -29213 -42337 -46717 -33099 -561 78179 6031 792 8936
19945 8936 49750 85668 103031 30977 -58949 -21918 -57605 22549 60116 25462 -15906 20453
19933 20453 -15816 -17212 13403 11722 -5528 26025 48943 54854 84238 92362 126320 50816
19921 50816 8586 -63137 -122002 -83137 -28442 -26622 115081 99658 135549 180375 155086 150591
19909 150591 149564 125725 118887 152151 137107 127599 158641 196060 90131 50546 18131 -17918
19897 -17918 71514 138049 91803 30571 67513 2298 4790 -2555 -64532 -28488 -10784 27379
19885 27379 67392 40207 -19192 20122 94480 110717 45636 -42465 -1922 2837 93449 88098
19873 88098 23666 -74324 -86050 -40581 -30683 -25150 19653 13577 -1643 -217 -18831 -11657 -65749
$$ packed form
19957A34311p430q5548l4848l5698j3124m380J3618L2538P8740p2148n239Q144
19945H936M0814L5918J7363p2054q9926L7031l5687Q0154L7567l4654m1368L6359
19933B0453l6269j396L0615j681j7250L1553K2918N911K9384Q124L3958p5504
19921E0816m2230p1723n8865L8865N4695J820J41703j5423L5891M4826k5289m495
19909A50591j027k3839o838L3264j5044r508L1042L7419j05929l9585l2415l6049
19897a7918Q9432O6535m6246o1232L6942o5215K492p345o1977L6044J7704L8163
19885B7379M0013k7185n9399L9314P4358J6237o5081q8101M0543M759R0612n351
19873H8098o4432r7990j1726M5469R898N533M4803o076j5220J426j8614P174n4092
$$ plain form
19860 -65749 -70746 -93954 -47263 -23647 -18351 -25272 9103 -17691 26834 101934 82519 21585
19848 21585 45367 87037 37835 11383 10993 80454 120111 130160 181594 194808 107142 55800
19836 55800 73679 68989 -3249 -7263 -41735 -15004 57943 141916 113258 110844 23189 6414
19824 6414 125140 176375 96299 76601 65221 2616 35548 74341 59343 24993 17439 55729
19812 55729 133113 99339 23705 -3531 -1880 -48864 -63001 -86868 -101195 -71144 -55768 -2044
19800 -2044 -8331 12700 -51589 -157082 -87382 -47822 -48346 -35174 -80940 -83733 -36938 -15122
19788 -15122 -18064 -57466 -53626 18850 49242 98707 73022 110216 119474 154560 116695 65821
19776 65821 130037 147120 114446 176399 179305 198881 204753 280484 283212 216235 178848 153050
$$ packed form
19860f5749m997k3208M6691K3616N296o921L4375k6794M4525P5100j9415o0934
19848B1585K3782M1670m9202k6452l90O9461L9657J0049N1434J3214q7666n1342
19836E5800J7879m690p2238m014l4472K6731P2947Q3973k8658k414q7655j6775
19824F414J18726N1235q0076j9698j1380o2605L2932L8793j4998l4350p554L8290
19812E5729P7384l3774p5634k7236J651m6984j4137k3867j4327L0051J5376N3724
19800b044o287K1031o4289j05493O9700L9560n24J3172m5766k793M6795K1816
19788a5122k942l9402L840P2476L0392M9465k5685L7194R258L5086l7865n0874
19776F5821O4216J7083l2674O1953K906J9576N872P5731K728o6977l7387k5798
$$ plain form
19764 153050 178490 194544 142046 75390 72310 122752 172186 183231 246302 253925 207588 216876
19752 216876 258507 211990 99654 99899 61644 136245 189192 186685 229811 208336 296749 319625
19740 319625 296017 344181 399622 432389 483090 576492 691370 703714 704904 780382 836710
19729 836710 898869 1024616 1183102 1386130 1667159 2031598 2578601 3259557 3830535 4421560
19719 4421560 4915436 5164264 5206949 5089081 4786158 4413950 3910394 3363506 2929710 2664432
19709 2664432 2592406 2624965 2696322 2841284 3032419 3423542 3933173 4505511 5057431 5481171
19699 5481171 5702667 5821159 5720375 5325930 4817828 4329670 3688992 3079664 2691446
19690 2691446 2448124 2244526 2018338 1799883 1690433 1608239 1488027 1431916 1384769 1380905
$$ packed form
19764A53050K5440J6054n2498o6656l080N0442M9434J1045O3071P623m6337R288
19752B16876M1631m6517j12336K45l8255P4601N2947k507M3126k1475Q8413K2876
19740C19625k3608M8164N5441L2767N0701R3402J14878J2344J190P5478N6328
19729H36710O2159J25747J58486K03028K81029L64439N47003O80956N70978N91025
19719D421560M93876K48828M2685j17868l02923l72208n03556n46888m33796k65278
19709B664432p2026L2559P1357J44962J91135L91123N09631N72338N51920M23740
19699E481171K21496J18492j00784l94445n08102m88158o40678o09328l88218
19690B691446k43322k03598k26188k18455j09450q2194j20212n6111m7147l864
$$ plain form
19680 1380905 1401476 1430388 1367340 1303328 1278669 1216951 1222502 1289296 1271401 1135382 1063681
19669 1063681 1062354 1101283 1058571 1070438 1050204 1017537 1029283 1163179 1256741 1231831 1302932
19658 1302932 1409463 1453730 1607199 1931951 2315323 2749652 3166637 3570772 3886848 4082565
19648 4082565 4041256 3601094 3133651 2877881 2777134 2823262 2715255 2655437 2814662 3024037
19638 3024037 3141240 3270013 3583711 4015716 4369335 4825467 5317093 5749740 6103921
19629 6103921 6392648 6618037 6788040 6910396 7173665 7661919 8354810 9120994 10007113
19620 10007113 11027177 12415981 14174066 16608628 20171642 25521183 33622972 45977524
19612 45977524 63131827 82063401 97115508 106902399 113196077 112088423 97487255
$$ packed form
19680A380905K0571K8912o3048o4012k4659o1718N551O6794j7895j36019p1701
19669A063681j327L8929m2712J1867k0234l2667J1746J33896R3562k4910P1101
19658A302932J06531M4267J53469L24752L83372M34329M16985M04135L16076J95717
19648D082565m1309m40162m67443k55770j00747M6128j08007n9818J59225K09375
19638C024037J17203J28773L13698M32005L53619M56132M91626M32647L54181
19629F103921K88727K25389J70003J22356K63269M88254O92891P66184Q86119
19620A0007113J020064J388804J758085K434562L563014N349541Q101789J2354552
19612D5977524J7154303J8931574J5052107R786891O293678j107654j4601168
$$ plain form
19605 97487255 77623402 62864484 54623710 51012469 50933189 54393701 62099290 74860030
19597 74860030 91625499 107740068 119217803 127451277 132673843 129171837 118430190
19590 118430190 113272584 118224025 127552294 134505571 138170398 138297080 128699250 107707118
19582 107707118 86229814 71636930 63492474 59714294 59568508 63394517 72081857 86200521
19574 86200521 103169560 116984180 125073347 129253706 126868734 110690287 86548301
19567 86548301 66714396 53604154 44929289 38805768 34287318 30921506 28269814 26119663
19559 26119663 24448652 22984634 21593897 20356543 19325575 18550761 17840898 17140811
19551 17140811 16453775 15759272 15003461 14132871 13306414 12652847 12067384 11514487 11068318
$$ packed form
19605I7487255j9863853j4758918q240774l611241p9280L460512P705589J2760740
19597G4860030J6765469J6114569J1477735Q233474N222566l502006j0741647
19590A18430190n157606M951441R328269O953277L664827J26682r597830k0992132
19582A07707118k1477304j4592884q144456l778180j45786L826009Q687340J4118664
19574H6200521J6969039J3814620Q089167M180359k384972j6178447k4141986
19567H6548301j9833905j3110242q674865o123521m518450l365812k651692k150151
19559B6119663j671011j464018j390737j237354j030968p74814p09863p00087
19551A7140811o87036o94503p55811q70590q26457o53567n85463n52897m46169
$$ plain form
19542 11068318 10728661 10266164 9796606 9373344 8941612 8630067 8454110 8398964 8499527
19533 8499527 8730221 8917646 8981034 8932663 8693606 8097669 7290935 6524232 5867454 5291651
19523 5291651 4754803 4384024 4076600 3829385 3628969 3469182 3347060 3220588 3140241 2966636
19513 2966636 2824387 2762375 2607220 2379251 2203280 2094765 1965477 1796983 1649704 1551291
19503 1551291 1492971 1427716 1347708 1294111 1213580 1063922 984865 986168 1014517 899928 875643
19492 875643 885244 815258 829237 846138 811065 673663 603695 581788 610579 595326 517306
19481 517306 524469 483088 531189 510617 435701 391267 404556 493719 503079 500835 538537 503365
19469 503365 457551 456984 451672 441291 455750 559850 601299 662309 639461 643119 727859 653220
$$ packed form
19542A1068318l39657m62497m69558m23262m31732l11545j75957n5146J00563
19533H499527K30694J87425O3388m8371k39057n95937q06734p66703o56778n75803
19523E291651n36848l70779l07424k47215k00416j59787j22122j26472q0347j73605
19513B966636j42249o2012j55155k27969j75971j08515j29288j68494j47279r8413
19503A551291n8320o5255q0008n3597q0531j49658p9057J303K8349j14589k4285
19492H75643R601o9986J3979J6901l5073j37402o9968k1907K8791j5253p8020
19481E17306P163m1381M8101k0572p4916m4434J3289Q9163R360k244L7702l5172
19469E03365m5814n67n312j0381J4459J04100M1449O1010k2848L658Q4740p4639
$$ plain form
19457 653220 609541 527888 593436 693807 678972 635620 600909 593644 649147 663224 597003
19446 597003 565607 595998 595883 615781 556698 517560 515356 479941 436702 352622 329787 309436
19434 309436 407852 446848 568932 650499 615184 547627 633953 563943 562872 623680 607991
19423 607991 585934 496068 437191 414427 534697 581025 522760 476765 519067 513369 545959
19412 545959 540975 534668 494243 455367 500988 493746 494336 454555 428394 523594 534384 404223
19400 404223 359279 359644 315338 367850 427918 472528 410270 420344 415708 387616 413176 448151
19388 448151 409223 328542 320980 324995 324689 357735 306320 240676 249022 319026 258035 166061
19376 166061 162186 134623 97135 87649 176234 220679 250518 185784 167072 224901 305824 336043
$$ packed form
19457F53220m3679q1653O5548J00371j4835m3352l4711p265N5503J4077o6221
19446E97003l1396L0391j15J9898n9083l9138k204l5415m3239q4080k2835k0351
19434C09436R8416L8996J22084Q1567l5315o7557Q6326p0010j071O0808j5689
19423F07991k2057q9866n8877k2764J20270M6328n8265m5995M2302n698L2590
19412E45959m984o307m0425l8876M5621p242N90l9781k6161R5200J0790j30161
19400D04223m4944L65m4306N2512O0068M4610o2258J0074m636k8092K5560L4975
19388D48151l8928q0681p562M015l06L3046n1415o5644Q346P0004o0991r1974
19376A66061l875k7563l7488r486Q8585M4445K9839o4734j8712N7829Q0923L0219
$$ plain form
19364 336043 298820 167392 141400 124691 143550 125406 75678 56943 127583 160567 191717
19353 191717 273452 332772 241925 170677 162304 208625 211702 186535 211614 144613 119646 152342
19341 152342 172638 142493 143610 162407 191747 193697 146543 128927 166061 145418 120091 70640
19329 70640 37964 -8081 34231 175065 266452 153489 98442 117362 148138 162486 122421
19318 122421 73392 117199 160356 212885 246190 206456 156343 164478 164995 158125 137118 75121
19306 75121 15912 -25817 16066 37713 24764 31264 104024 123278 112513 151828 176161 134865
19294 134865 124465 120413 149001 107989 84145 138651 170905 167586 139803 197182 179277 101207
19282 101207 129937 143101 111601 13967 25814 78271 93882 141150 132931 76457 41827 -14442
$$ packed form
19364C36043l7223j31428k5992j6709J8859j8144m9728j8735P0640L2984L1150
19353A91717Q1735N9320r0847p1248q373M6321L077k5167K5079o7001k4967L2696
19341A52342K0296l0145J117J8797K9340J950m7154j7616L7134k0643k5327m9451
19329G0640l2676m6045M2312J40834R1387j12963n5047J8920L0776J4348m0065
19318A22421m9029M3807M3157N2529L3305l9734n0113Q135N17o870k1007o1997
19306G5121n9209m1729M1883K1647j2949O500P2760J9254j0765L9315K4333m1296
19294A34865j0400m052K8588m1012k3844N4506L2254l319k7783N7379j7905p8070
19282A01207K8730J3164l1500r7634J1847N2457J5611M7268q219n6474l4630n6269
$$ plain form
19270 -14442 -1779 36518 93943 92194 182366 253852 224548 183146 193127 165494 136556 138749
19258 138749 68813 50153 47043 -36666 18106 72524 54415 48039 19249 -6269 47310 164731
19246 164731 71739 50033 73876 90467 68276 86460 141082 97432 84399 -9692 -45142
19235 -45142 -38349 22599 106262 123826 67387 28751 30932 10895 24019 28520 -31644 4356
19223 4356 47231 58951 91383 16669 82636 151839 99463 -15531 -19595 -31497 7492 63907
19211 63907 76810 75452 89501 136365 88194 39866 6237 -44883 18641 98143 136531 98796
19199 98796 71462 82641 22877 45666 67997 51692 10903 43505 52264 -15100 -49029 -59620
19187 -59620 -110733 -93499 -34621 -32212 -30947 -51336 4940 15474 12736 61166 43847 -53557
$$ packed form
19270a4442J2663L8297N7425j749R0172P1486k9304m1402R981k7633k8938K193
19258A38749o9936j8660l110q3709N4772N4418j8109o376k8790k5518N3579J17421
19246A64731r2992k1706K3843J6591k2191J8184N4622m3650j3033r4091l5450
19235d5142O793O0948Q3663J7564n6439l8636K181k0037J3124M501o0164L6000
19223D356M2875J1720L2432p4714O5967O9203n2376j14994m064j1902L8989N6415
19211F3907J2903j358J4049M6864m8171m8328l3629n1120O3524P9502L8388l7735
19199I8796k7334J1179n9764K2789K2331j6305m0789L2602Q759o7364l3929j0591
19187e9620n1113J7234N8878K409J265k0389N6276J0534k738M8430j7319r7404
$$ plain form
19175 -53557 -150372 -38564 57764 104442 101498 52870 72899 99658 74721 -33645 -51376
19164 -51376 9219 87339 37057 29791 54364 107579 107736 42307 12239 -2584 -18828 125906
19152 125906 197118 136006 35448 29910 53194 66135 -19720 -96246 -74682 -32933 -23373 -104760
19140 -104760 -71632 -7346 50490 69029 64296 91417 97530 -2206 -25886 -63174 -41258 61135
19128 61135 76151 61430 64938 46467 78018 152975 195860 138723 42173 -28775 -51082 -61446
19116 -61446 -100215 -56003 40355 -20030 33860 35279 -10471 -93121 -102345 -48337 -14505 51505
19104 51505 81891 59352 7690 -62596 -29856 19604 48824 73894 93299 112277 168577 160916
19092 160916 146510 136917 91622 119946 126772 110758 103818 52299 -3549 71329 -31841 3472
$$ packed form
19175e3557r6815J11808R6328M6678k944m8628K0029K6759k4937j08366j7731
19164e1376O0595P8120n0282p266K4573N3215J57o5429l0068j4823j6244J44734
19152A25906P1212o1112j00558n538K3284J2941q5855p6526K1564M1749R560q1387
19140a04760L3128O4286N7836J8539m733K7121O113r9736k3680l7288K1916J02393
19128F1135J5016j4721L508j8471L1551P4957M2885n7137r6550p0948k2307j0364
19116f1446l8769M4212R6358o0385N3890J419m5750q2650r224N4008L3832O6010
19104E1505L0386k2539n1662p0286L2740M9460K9220K5070J9405J8978N6300p661
19092A60916j4406r593m5295K8324O826j6014o940n1519n5848P4878j03170L5313
$$ plain form
19080 3472 48561 109048 84976 6490 -75706 -67900 46309 69242 -25570 -63868 -13521 -8040
19068 -8040 15649 71811 77848 20408 86273 137415 119214 121851 101688 75930 99787 47976
19056 47976 60333 85601 56226 107426 113427 112404 99343 41037 5534 61142 55009 -16945
19044 -16945 -22649 41674 33630 42382 25722 7821 101806 140823 88936 68274 93692 115949
19032 115949 222734 282139 226707 234860 304900 395163 447955 550689 579431 579803 524826 445542
19020 445542 410081 350559 332266 350241 396663 521404 608989 655954 745419 838563 850305
19009 850305 732509 516521 399609 390688 390956 536396 743998 796445 749420 760471 771236
18998 771236 708255 576905 540894 513705 475302 469832 438060 524093 682244 751000 743432
$$ packed form
19080C472M5089O0487k4072p8486q2196P806J14209K2933r4812l8298N0347N481
19068h040K3689N6162O037n7440O5865N1142j8201K637k0163k5758K3857n1811
19056D7976J2357K5268k9375N1200O001j023j3061n8306l5503N5608o133p1954
19044a6945n704O4323q044Q752j6660j7901R3985L9017n1887k0662K5418K2257
19032A15949J06785N9405n5432Q153P0040R0263N2792J02734K8742L72n4977p9284
19020D45542l5461n9522j8293J7975M6422J24741Q7585M6965Q9465R3144J1742
19009H50305j17796k15988j16912q921K68J45440K07602N2447m7025J1051J0765
18998G71236o2981j31350l6011k7189l8403n470l1772Q6033J58151O8756p568
$$ plain form
18987 743432 843480 937208 818451 631978 456742 356677 286215 285378 243452 244316 288779
18976 288779 257094 225095 255852 224283 184010 164998 84342 112500 144927 170615 141339
18965 141339 10002 -20469 -23167 -3376 5532 25332 26560 5732 19906 30897 -25555 -26813
18953 -26813 -48739 -154052 -94642 -13666 41251 -32341 29820 99588 45182 8857 87181
18942 87181 111907 100320 30257 56643 40311 37790 45241 -2459 -29570 11488 -22190 34205
18930 34205 14779 63580 120799 28274 -1479 35121 3201 40076 135678 148009 158749 178449
18918 178449 82898 69790 80377 92315 79485 35484 118124 92586 31486 40555 -17789 -69419
18906 -69419 -69694 -68612 -77400 -18124 5712 62366 90575 130854 149077 150945 111357 7498
$$ packed form
18987G43432J00048R3728j18757j86473j75236j00065p0462q37m1926Q64M4463
18976B88779l1685l1999L0757l1569m0273j9012q0656K8158L2427K5688k9276
18965A41339j31337l0471k698J9791Q908J9800J228k0828J4174J0991n6452j258
18953b6813k1926j05313N9410Q0976N4917p3592O2161O9768n4406l6325P8324
18942H7181K4726j1587p0063K6386j6332k521P451m7700k7111M1058l3678N6395
18930C4205j9426M8801N7219r2525k9753L6600l1920L6875R5602J2331J0740J9700
18918A78449r5551j3108J0587J1938j2830m4001Q2640k5538o1100R069n8344n1630
18906f9419k75J082q788N9276K3836N6654K8209M0279J8223J868l9588j03859
$$ plain form
18894 7498 -106844 -101613 -106852 -31231 20293 -6894 -48810 -72118 41544 180292 122582 32559
18882 32559 24244 46299 96234 81300 53893 114498 167488 116202 70314 123756 97809 74004
18870 74004 110 14035 -7316 1850 82803 27491 -5909 -43340 -71056 5654 61132 55819
18858 55819 84593 122113 23452 1044 97642 67823 9869 -23704 7535 68048 121401 123800
18846 123800 140680 137216 114417 29022 76095 139920 134623 148359 107466 18779 -37657 -50284
18834 -50284 9292 75375 102097 173941 83169 16459 16994 8643 31096 105969 122358 161691
18822 161691 176087 222877 204140 186772 158773 127748 191010 283228 401793 571775 629601
18811 629601 597867 677725 684062 548613 432707 249918 281105 354342 307899 229922 212498
$$ packed form
18894G498j14342N231n239P5621N1524k7187m1916k3308J13662J38748n7710r0023
18882C2559q315K2055M9935j4934k7407O0605N2990n1286m5888N3442k5947k3805
18870G4004p3894J3925k1351R166Q0953n5312l3400l7431k7716P6710N5478n313
18858E5819K8774L7520r8661k2408R6598k9819n7954l3573L1239O0513N3353K399
18846A23800J6880l464k2799q5395M7073O3825n297J3736m0893q8687n6436j2627
18834e0284N9576O6083K6722P1844r0772o6710N35q351K2453P4873J6389L9333
18822A61691J4396M6790j8737j7368k7999l1025O3262R2218J18565J69982N7826
18811F29601l1734P9858O337j35449j15906j82789L1187P3237m6443p7977j7424
$$ plain form
18800 212498 267780 285363 268210 284815 347410 362093 417682 371641 362557 370203 355947 377929
18788 377929 401375 521069 578789 649578 726521 701783 698637 738585 686090 606143 643335
18777 643335 735287 797427 820679 796844 797365 838405 839889 878853 934482 997458 1185089 1341400
18765 1341400 1270233 1037441 900479 867083 798994 816569 882746 913518 986445 1045550 954789
18754 954789 712732 524084 447455 437197 424782 357259 290083 187346 309943 311348 228101
18743 228101 204544 218231 282391 241519 178815 229337 278913 270521 324907 418639 386787 380973
18731 380973 563832 682605 770742 843857 924830 813371 737971 683367 674240 768440 812186
18720 812186 917722 957090 892696 811599 702317 703295 709048 755559 786580 846870 864079 720961
$$ packed form
18800B12498N5282J7583j7153J6605O2595J4683N5589m6041r084P646j4256K1982
18788C77929K3446J19694N7720P0789P6943k4738l146L9948n2495p9947L7192
18777F43335R1952O2140K3252k3835N21M1040J484L8964N5629O2976J87631J56311
18765A341400p1167k32792j36962l3396o8089J7575O6177L0772P2927N9105r0761
18754I54789k42057j88648p6629j0258j2415o7523o7176j02737J22597J405q3247
18743B28101k3557J3687O4160m0872o2704N0522M9576q392N4386R3732l1852n814
18731C80973J82859J18773Q8137P3115Q0973j11459p5400n4604r127R4200M3746
18720H12186J05536L9368o4394q1097j09282R78N753M6511L1021O0290J7209j43118
$$ plain form
18708 720961 656971 523131 453561 455620 490519 368674 214760 272478 325708 280229 231739
18697 231739 230269 182629 127954 143354 100873 38517 29720 99232 140261 114853 152711 246170
18685 246170 294310 183245 10490 -79183 -19387 28264 57383 99881 97226 49477 33751
18674 33751 95962 151852 201875 163353 123064 112652 165195 144165 81212 77894 68146 37932
18662 37932 10326 32157 115150 121521 65642 7845 14706 56713 73600 68852 113866 202756
18650 202756 177003 149528 122989 54744 50096 63658 138570 146432 98268 58084 8369 -10563
18638 -10563 -54299 -64625 -60445 -6787 73913 51748 -17380 -79095 -5963 29766 48693 88071
18626 88071 104554 48814 36098 43090 49610 26949 2792 -17097 -29837 -48822 -75155 1324
$$ packed form
18708G20961o3990j33840o9570K059L4899j21845j53914N7718N3230m5479m8490
18697B31739j470m7640n4675J5400m2481o2356q797O9512M1029k5408L7858R3459
18685B46170M8140j11065j72755q9673N9796M7651K9119M2498k655m7749j5726
18674C3751O2211N5890N0023l8522m0289j0412N2543k1030o2953l318r748l0214
18662C7932k7606K1831Q2993O371n5879n7797O861M2007J6887m748M5014Q8890
18650B02756k5753k7475k6539o8245m648J3562P4912P862m8164m0184m9715j8932
18638a0563m3736j0326M180N3658Q0700k2165o9128o1715P3132L5729J8927L9378
18626H8071J6483n5740j2716O992O520k2661k4157j9889j2740j8985k6333P6479
$$ plain form
18614 1324 27190 -7018 -5791 27165 32776 -13987 5072 33536 -26615 -57139 -4602 44689
18602 44689 -20985 -15521 52102 48808 58621 21986 57105 30841 11690 82670 93253 75391
18590 75391 47882 68370 29403 -16048 48789 54744 31974 20488 44334 30426 103684 171430
18578 171430 119482 93956 101678 56569 121966 185053 123974 74439 28994 108049 171935 219223
18566 219223 155925 69317 -7407 -53382 -85571 -41800 26443 41886 -32057 -63256 -88241
18555 -88241 -57394 -1283 134601 158545 164590 138779 113303 117690 96636 156908 152208 117858
18543 117858 70992 45397 72551 115422 99582 118042 88957 30546 79484 34150 31294 26829
18531 26829 72701 127578 187411 251468 91217 -238 49880 32191 -53515 -60597 22805 9789
$$ packed form
18614A324K5866l4208J227L2956N611m6763J9059K8464o0151l0524N2537M9291
18602D4689o5674N464O7623l294R813l6635L5119k6264j9151P0980J0583j7862
18590G5391k7509K0488l8967m5451O4837N955k2770j1486K3846j3908P3258O7746
18578A71430n1948k5526P722m5109O5397O3087o1079m9535m5445P9055O3886M7288
18566B19223o3298q6608p6724m5975l2189M3771O8243J5443p3943l1199k4985
18555h8241L0847N6111J35884K3944O045k5811k5476M387k1054O0272m700l4350
18543A17858m6866k5595K7154M2871j5840J8460k9085n8411M8938m5334k856m465
18531B6829M5872N4877N9833O4057j60251r1455N0118j7689q5706p082Q3402j3016
$$ plain form
18519 9789 79279 106510 135805 104641 104516 148117 175180 123667 207955 281696 321459 329125
18507 329125 337660 240196 221588 228676 153313 238469 367434 415881 392763 318381 403068 387598
18495 387598 316056 246556 212356 172114 162049 278518 374798 401123 360648 361214 290851 270129
18483 270129 333203 375155 393987 317847 320798 299302 255524 267298 297914 308751 251389 221268
18471 221268 291970 322442 289897 329747 412011 370536 317815 414372 525346 671417 954271
18460 954271 1350916 1995243 2674622 3275869 3824320 4605036 5141520 4837240 4316526 4066759
18450 4066759 3693376 2890231 2140344 1681284 1408760 1187169 1053339 921330 780397
18441 780397 689803 669280 680065 641361 620719 610019 604043 587283 608620 593884 556138 525857
$$ packed form
18519I789O9490K7231K9295l1164j25M3601K7063n1513Q4288P3741L9763P666
18507C29125Q535r7464j8608P088p5363Q5156J28965M8447k3118p4382Q4687j5470
18495C87598p1542o9500l4200m0242j0065J16469R6280K6325m0475N66p0363k0722
18483B70129O3074M1952J8832p6140K951k1496m3778J1774L0616J0837n7362l0121
18471B21268P0702L0472l2545L9850Q2264m1475n2721R6557J10974J46071K82854
18460I54271L96645O44327O79379O01247N48451P80716N36484l04280n20714k49767
18450D066759l73383q03145p49887m59060k72524k21591j33830j32009j40933
18441G80397r0594k0523J0785l8704k0642j0700n976j6760K1337j4736l7746l0281
$$ plain form
18429 525857 541672 570599 601690 528957 507684 560470 506589 428993 426925 415697 407517 480576
18417 480576 548758 577485 668385 694858 661893 706373 755144 744627 676247 797805 981183
18406 981183 1205390 1551587 2083154 2829577 3687516 4365667 5026485 5843634 6283535 5900694
18396 5900694 5429944 5077792 4487293 3405604 2570149 2101259 1801086 1513280 1353927
18387 1353927 1269768 1239884 1204166 1179799 1186589 1133197 1125646 1184133 1253489 1264125 1192678 1202255
18375 1202255 1172560 1219624 1252330 1178475 1167488 1115792 1053455 1012793 1141380 1186782 1231947
18364 1231947 1213914 1207273 1220040 1302505 1425341 1517475 1619455 1729116 1663004 1579495 1507498
18353 1507498 1519750 1560396 1521576 1514257 1459053 1382089 1414842 1434293 1398777 1398339 1402189 1375173
$$ packed form
18429E25857J5815K8927L1091p2733k1273N2786n3881p7596k068j1228q180P3059
18417D80576O8182K8727R0900K6473l2965M4480M8771j0517o8380J21558J83378
18406I81183K24207L46197N31567P46423Q57939O78151O60818Q17149M39901l82841
18396E900694m70750l52152n90499j081689q35455m68890l00173k87806j59353
18387A353927q4159k9884l5718k4367O790n3392p551N8487O9356J0636p1447R577
18375A202255k9695M7064L2706p3855j0987n1696o2337m0662J28587M5402M5165
18364A231947j8033o641J2767Q2465J22836R2134J01980J09661o6112q3509p1997
18353A507498J2252M0646l8820p319n5204p6964L2753J9451l5516m38L850k7016
$$ plain form
18341 1375173 1367874 1374838 1393064 1370516 1317862 1371725 1461286 1499406 1559734 1570088 1684638
18330 1684638 1685043 1675937 1774209 1943561 2019786 2045139 2056594 2043090 2138167 2406065 2601233
18319 2601233 2739445 2958635 3288693 3929650 4827764 6233453 8688872 12439747 16287847
18310 16287847 18381915 19665230 21024259 20390282 15544292 11077509 8577576 7108704
18302 7108704 6219629 5655845 5285201 5064586 4997660 5062365 5213399 5324701 5520109 5761546
18292 5761546 5939077 6133561 6567151 7280688 7922916 8214958 8577256 8858369 8626864
18283 8626864 7956388 7569651 7360457 7378604 7650545 8106137 8723612 9536258 10322187 11191202
18273 11191202 12154308 13058942 14049386 15443420 17207248 19211002 21524563 24242403
$$ packed form
18341A375173p299O964J8226k2548n2654N3863Q9561L8120O0328J0354J14550
18330A684638M05r106R8272J69352P6225K5353J1455j3504R5077K67898J95168
18319B601233J38212K19190L30058O40957Q98114J405689K455419L750875L848100
18310A6287847K094068J283315J359029o33977m845990m466783k499933j468872
18302G108704q89075n63784l70644k20615o6926O4705J51034J11302J95408K41437
18292E761546J77531J94484M33590P13537O42228K92042L62298K81113k31505
18283H626864o70476l86737k09194J8147K71941M55592O17475Q12646P85929Q69015
18273A1191202R63106R04634R90444J394034J763828K003754K313561K717840
$$ plain form
18265 24242403 27470169 31316589 36370610 43739201 54850795 71943923 99294992 140290633
18257 140290633 185470783 215594919 234112750 251975962 253548666 213774690 174914593
18250 174914593 162119988 171292121 195453215 224147251 246402868 260484565 266459127
18243 266459127 254491457 220404136 182305341 157066759 147166965 150860334 168775826
18236 168775826 206026958 266927186 338967370 401036384 446825693 476575825 469911035
18229 469911035 411599055 327812328 244946701 184533879 146415094 122001899 105491340
18222 105491340 93604618 84590731 77577915 71684683 66341771 61310439 56834704 53082035
18214 53082035 50010860 47567480 45449735 43512231 41539545 39299955 37102145 35016506
$$ packed form
18265B4242403L227766L846420N054021P368591J1111594J7093128K7351069M0995641
18257A40290633M5180150L0124136J8517831J7863212J572704l9773976l8860097
18250A74914593j2794605R172133K4161094K8694036K2255617J4081697N974562
18243B66459127j1967670l4087321l8098795k5238582r899794L693369J7915492
18236A68775826L7251132O0900228P2040184O2069014M5789309K9750132o664790
18229D69911035n8311980q3786727q2865627o0412822l8118785k4413195j6510559
18222A05491340j1886722r013887p012816n893232n342912n031332m475735l752669
18214E3082035l071175k443380k117745j937504j972686k239590k197810k085639
$$ plain form
18206 35016506 33032627 31274120 29666365 28207978 27043345 26147403 25316662 24581990
18198 24581990 24168598 24062685 24542816 25752180 27844420 30248049 32047849 32908941 33070221
18189 33070221 31873849 28409313 24072436 20575003 18244283 16715786 15555024 14746616
18181 14746616 14268346 14026463 14138399 14354660 14429452 14359130 14076286 13265506 11895813
18172 11895813 10538622 9493697 8629193 7936964 7299603 6733058 6254988 5837450 5427594
18163 5427594 5098128 4775760 4429864 4187927 4014897 3823721 3668562 3480227 3194211
18154 3194211 2972163 2802441 2601130 2459112 2411396 2395143 2373331 2256126 2105223 2101659
18144 2101659 2141420 2098553 2019190 1983931 2048601 2149143 2187352 2148587 2187101 2212234 2218722
$$ packed form
18206C5016506j983879j758507j607755j458387j164633q95942q30741p34672
18198B4581990m13392j05913M80131J209364K092240K403629J799800Q61092J61280
18189C3070221j196372l464536m336877l497433k330720j528497j160762q08408
18181A4746616m78270k41883J11936K16261P4792p0322k82844q10780j369693
18172A1895813j357191j044925q64504o92229o37361n66545m78070m17538m09856
18163E427594l29466l22368l45896k41937j73030j91176j55159j88335k86016
18154C194211k22048j69722k01311j42018m7716j6253k1812j17205j50903l564
18144B101659L9761m2867p9363l5259O4670J00542L8209l8765L8514K5133O488
$$ plain form
18133 2218722 2291638 2399196 2518158 2654823 2839897 2950634 3049156 3250820 3527232 3835776
18123 3835776 4121685 4390920 4789418 5389351 6151117 6962366 8134938 10023479 13136644
18114 13136644 18256908 27101441 42123861 61944487 75341935 81198545 87223778 91596777
18106 91596777 72039870 46048466 31457014 23884002 19328941 16219852 14033493 12491088
18098 12491088 11338942 10407619 9525560 8771976 8189743 7654440 7243372 6935275 6699920
18089 6699920 6436619 6160288 5896193 5574021 5254069 4913196 4631574 4383696 4270677
18080 4270677 4162190 3968034 3686696 3550701 3445621 3317581 3214509 3151319 3114180 2968851
18070 2968851 2800415 2692408 2699837 2671596 2599050 2470137 2450245 2441750 2356457 2247487 2175927
$$ packed form
18133B218722P2916J07558J18962J36665J85074J10737R8522K01664K76412L08544
18123C835776K85909K69235L98498N99933P61766Q11249J172572J888541L113165
18114A3136644N120264Q844533J5022420J9820626J3397448N856610O025233M372999
18106I1596777j9556907k5991404j4591452p573012m555061l109089k186359j542405
18098A2491088j152146r31323q82059p53584n82233n35303m11068l08097k35355
18089F699920k63301k76331k64095l22172l19952l40873k81622k47878j13019
18080D270677j08487j94156k81338j35995j05080j28040j03072o3190l7139j45329
18070B968851j68436j08007P429k8241p2546j28913j9892q495q5293j08970p1560
$$ plain form
18059 2175927 2172625 2174756 2103154 2134500 2093422 2103629 2088908 2047184 1986529 1853055 1751320
18048 1751320 1633695 1618783 1521995 1364162 1318246 1315888 1256434 1169365 1141238 1086357 1084029
18037 1084029 1097823 1091483 1071958 1028439 1028443 993982 940984 905477 828494 776376 736430 778948
18025 778948 781801 730686 684396 657750 620611 602492 561076 556687 605696 612422 578406 531784
18013 531784 523125 519159 420454 375712 359205 382411 444065 385196 303120 342665 351942 346538
18001 346538 411618 483931 448054 408959 457167 427530 401305 407362 422246 430604 431038 376869
17989 376869 332345 413157 479820 457595 378985 325192 340122 369135 386113 276290 309646
17978 309646 350132 385742 382718 441544 470037 351328 353733 334225 252417 227740 194234 220977
$$ packed form
18059B175927l302K131p1602L1346m1078J0207j4721m1724o0655j33474j01735
18048A751320j17625j4912r6788j57833m5916k358n9454q7069k8127n4881k328
18037A084029J3794o340j9525m3519Ml4461n2998l5507p6983n2118l9946M2518
18025G78948K853n1115m6290k6646l7139j8119m1416m389M9009O726l4016m6622
18013E31784q659l966r8705m4742j6507K3206O1654n8869q2076L9545R277n404
18001C46538O5080P2313l5877l9095M8208k9637k6225O057J4884Q358M34n4169
17989C76869m4524Q0812O6663k2225p8610n3793J4930K9013J6978j09823L3356
17978C09646M0486L5610l024N8826K8493j18709K405j9508q1808k4677l3506K6743
$$ plain form
17966 220977 244476 396399 471625 409587 387118 375389 325324 370544 321705 304353 254532
17955 254532 289898 330295 328875 242784 252536 260238 260564 202614 204732 243803 287443 348146 295731
17942 295731 229041 276012 288333 288405 357856 319235 317397 371046 305734 265818 354229 435406
17930 435406 403171 365832 291727 268472 212190 183040 216625 232481 250615 312264 336919
17919 336919 289989 351663 346823 286399 269676 320449 307777 266618 250594 271876 267286 263904
17907 263904 266848 240751 239192 298491 293319 280750 227467 234265 283462 300253 242737 234276
17895 234276 270598 274238 209726 161076 232581 312061 339962 345938 272511 205893 188724 178736
17883 178736 167974 239435 352279 366635 356961 275262 216329 243265 162464 140028 121880
$$ packed form
17966B20977K3499J51923P5226o2038k2469j1729n0065M5220m8839j7352m9821
17955B54532L5366M0397j420q6091R752P702L26n7950K118L9071M3640O0703n2415
17942B95731o6690M6971J2321P2O9451l8621j838N3649o5312l9916Q8411Q1177
17930D35406l2235l7339p4105k3255n6282k9150L3585J5856J8134O1649K4655
17919C36919m6930O1674m840o0424j6723N0773j2672m1159j6024K1282m590l382
17907B63904K944k6097j559N9299n172j2569n3283O798M9197J6791n7516q461
17895B34276L6322L640o4512m8650P1505P9480K7901N976p3427o6618j7169r988
17883A78736j0762P1461J12844J4356r674q1699n8933K6936q0801k2436j8148
$$ plain form
17872 121880 101309 114277 199420 221440 224116 206354 187871 203762 173931 100825 146961 215311
17860 215311 214327 143992 120040 160635 140464 109221 182000 255717 219022 107896 139956 121052
17848 121052 89046 44731 28710 -2911 -15983 26720 35978 51169 64328 40756 118304 219042
17836 219042 315169 387551 364061 334206 306595 300557 344531 336322 288923 341346 393455 351337
17824 351337 363785 379834 352777 368081 431894 430339 397219 416033 579466 756301 918497
17813 918497 1175779 1530303 1933026 2325489 2755071 3144966 3349344 3286198 3071390 2597199
17803 2597199 1972038 1612972 1357362 1214260 1149948 1091772 1113713 1216265 1312067 1511391
17793 1511391 1834088 2118028 2528549 2976923 3335601 3539918 3495394 3264519 2780674 2266527
$$ packed form
17872A21880k0571J2968Q5143K2020K676j7762j8483J5891k9831p3106M6136O8350
17860B15311r84p0335k3952M0595k0171l1243P2779P3717l6695j11126L2060j8904
17848A21052l2006m4315j6021l1621j3072M2703R258J5191J3159k3572P7548J00738
17836B19042R6127P2382k3490k9855k7611o038M3974q209m7399N2423N2109m2118
17824C51337J2448J6049k7057J5304O3813j555l3120J8814J63433J76835J62196
17813I18497K57282L54524M02723L92463M29582L89895K04378o3146k14808m74191
17803B597199o25161l59066k55610j43102o4312n8176K1941J02552R5802J99324
17793A511391L22697K83940M10521M48374L58678K04317m4524k30875m83845n14147
$$ plain form
17783 2266527 1834026 1610752 1385662 1223391 1088494 897244 828300 790138 790516 803152
17773 803152 865163 1028369 1045999 1009489 1050990 1059818 940441 814165 763545 845772 847922
17762 847922 913178 896230 938296 981933 1073822 1232748 1492848 1791764 2211718 2650127
17752 2650127 2917587 3084723 3160763 3017352 2696844 2372668 2059631 1863098 1845199 1908067
17742 1908067 1948373 2118157 2254221 2300407 2381249 2468158 2629578 2944304 3266430 3594196
17732 3594196 3766296 3756290 3493144 3173786 2746958 2210444 1749718 1458398 1273742 1148847
17722 1148847 991243 995535 1058471 1102566 1143014 1181657 1199930 1123943 1070507 967311 797215
17711 797215 740853 705120 679314 636296 635664 625747 579510 557982 517461 469878 475085 482926
$$ packed form
17783B266527m32501k23274k25090j62271j34897j91250o8944l8162L78J2636
17773H03152O2011J63206J7630l6510M1501Q828j19377j26276n0620Q2227K150
17762H47922O5256j6948M2066M3637R1889J58926K60100K98916M19954M38409
17752B650127K67460J67136P6040j43411l20508l24176l13037j96533j7899O2868
17742A908067M0306J69784J36064M6186Q0842Q6909J61420L14726L22126L27766
17732C594196J72100j0006k63146l19358m26828n36514m60726k91320j84656j24895
17722A148847j57604M292O2936M4095M0448L8643J8273p5987n3436j03196j70096
17711G97215n6362l5733k5806m3018o32r917m6237k1528m0521m7583N207P841
$$ plain form
17699 482926 444340 354209 401456 505269 515780 569076 588912 584178 644804 863755 1017731
17688 1017731 1088563 1137027 1212957 1189231 1110707 1062510 873673 795282 737796 729773 739614
17677 739614 762128 794603 734701 729989 664920 543198 489822 452501 367202 328832 307757
17666 307757 262271 200026 138941 166874 194153 139915 155302 137638 102550 103851 84688 98063
17654 98063 127014 109929 54714 73985 74249 70776 22536 54031 82869 89739 127847 96547
17642 96547 60395 130586 128584 89078 63679 82481 45350 66160 117529 124512 58704 69095
17630 69095 73840 47509 128385 178190 196598 135827 93501 22698 51147 4451 59988 126479
17618 126479 153654 172373 142560 118248 100920 27593 10582 -24047 -4745 19115 24612 13755
$$ packed form
17699D82926l8586r0131M7247J03813J0511N3296J9836m734O0626K18951J53976
17688A017731P0832M8464P5930k3726p8524m8197j88837p8391n7486q023R841
17677G39614K2514L2475n9902m712o5069j21722n3376l7321q5299l8370k1075
17666C07757m5486o2245o1085K7933K7279n4238J5387j7664l5088J301j9163J3375
17654I8063K8951j7085n5215J9271K64l473m8240L1495K8838O870L8108l1300
17642I6547l6152P0191k002l9506k5399J8802l7131K0810N1369O983o5808J0391
17630F9095M745k6331Q0876M9805J8408o0771m2326p0803K8449m6696N5537O6491
17618A26479K7175J8719k9813k4312j7328p3327j7011l4629J9302K3860N497j0857
$$ plain form
17606 13755 61417 93409 71831 60767 2506 41181 52305 125857 130496 98015 62502 96292
17594 96292 85763 -15071 -59692 -59475 -54132 6267 46270 33039 -32280 -68353 -8395 55207
17582 55207 103910 187485 179056 91539 82059 42906 76096 133698 130815 158088 125732 78660
17570 78660 107941 94755 40120 75754 41909 5549 28451 58390 44039 57584 98052 117648
17558 117648 75738 20025 -26645 -9700 -3296 13092 50561 78815 89255 73454 110962 73655
17546 73655 5864 -8392 35515 76435 86240 78555 73073 104534 45967 49880 -19531 -1194
17534 -1194 34348 67399 6721 5232 70229 133279 195484 93025 53607 60596 53330 52145
17522 52145 54845 22825 28510 21739 6688 69265 128224 105094 120186 120810 50460 37086 39402
$$ packed form
17606A3755M7662L1992k1578j1064n8261L8675J1124P3552M639l2481l5513L3790
17594I6292j0529j00834m4621K17N343O0399M0003j3231o5319l6073N9958O3602
17582E5207M8703Q3575q429q7517r480l9153L3190N7602k883K7273l2356m7072
17570G8660K9281j3186n4635L5634l3845l6360K2902K9939j4351J3545M0468J9596
17558A17648m1910n5713m6670J6945O404J6388L7469K8254J0440j5801L7508l7307
17546G3655o7791j4256M3907M0920R805p685n482L1461n8567L913o9411J8337
17534a194L5542L3051o0678j489O4997O3050O2205j02459l9418O989p266j185
17522E2145K700l2020N685o771j5051O2577N8959k3130J5092O24p0350j3374K316
$$ plain form
17509 39402 37138 27135 24664 54821 68012 48232 125712 115530 72297 47088 19490 16209
17497 16209 11532 17541 242 -43147 60166 98627 29360 52877 64309 77802 79989 63255
17485 63255 54334 14431 21187 -467 14000 -35475 -59984 -8324 26051 67595 30802 -6227
17473 -6227 45966 175590 175530 113018 58571 -33770 -53842 -49138 -36573 -14618 43670 28609
17461 28609 68567 40281 -9866 -89974 -108395 -42637 20959 159976 209703 113477 58398
17450 58398 36683 44305 24162 19232 127485 262659 353083 423184 468369 543450 497568 353859
17438 353859 281563 236603 216137 195343 221865 176088 162883 126109 93933 103939 150570
17427 150570 171192 96622 7638 23892 36595 47265 50291 44313 78811 55702 54597 57787
$$ packed form
17509C9402k264j0003k471L0157J3191j9780P7480j0182m3233k5209k7598l281
17497A6209m677O009j7299m3389J03313L8461o9267K3517J1432J3493K187j6734
17485F3255q921l9903O756k1654J4467m9475k4509N1660L4375M1544l6793l7029
17473f227N2193J29624o0o2512n4447r2341k0072M704J2565K1955N8288j5061
17461B8609L9958k8286n0147q0108j8421O5758O3596J39017M9727r6226n5079
17450E8398k1715P622k0143m930J08253J35174R0424P0101M5185P5081m5882j43709
17438C53859p2296m4960k0466k0794K6522m5777j3205l6774l2176J0006M6631
17427A50570K0622p4570q8984J6254J2703J0670L026n978L4498k3109j105L190
$$ plain form
17415 57787 43568 15705 20232 110913 140283 108465 94882 61417 84215 76592 106027 146432
17403 146432 79420 67425 150139 207231 137022 79654 42790 32100 68529 65368 -9217 -23589
17391 -23589 33708 33670 69958 102585 113516 96451 57969 32573 24957 56304 53674 43684 64391
17378 64391 51164 50837 8554 -26969 32917 32681 15599 24445 7845 71953 159882 227077 118223
17365 118223 80116 129843 142543 56048 -2277 17193 5974 -19042 -20881 -36605 -5436 3200
17353 3200 28741 90151 50671 -28268 -70524 -60954 9709 37206 -65570 -89309 -80201 -30229
17341 -30229 -2968 36288 82106 95278 47753 64132 108904 145382 141800 117256 109292 47468
17329 47468 11397 35800 88579 100096 129098 124431 26420 4999 23595 9731 -1482 51854
$$ packed form
17415E7787j4219k7863M527R0681K9370l1818j3583l3465K2798p623K9435M0405
17403A46432o7012j1995Q2714N7092p0209n7368l6864j0690L6429l161p4585j4372
17391b3589N7297l8L6288L2627J0931j7065l8482k5396p616L1347k630r990K0707
17378F4391j3227l27m2283l5523N9886k36j7082Q846j6600O4108Q7929O7195j08854
17365A18223l8107M9727J2700q6495n8325J9470j1219k5016j839j5724L1169Q636
17353C200K5541O1410l9480p8939m2256R570P0663K7497j02776k3739R108M9972
17341c0229K7261L9256M5818J3172m7525J6379M4772L6478l582k4544p964o1824
17329D7468l6071K4403N2779J1517K9002m667r8011k1421J8596j3864j1213N3336
$$ plain form
17317 51854 58224 -13291 -33778 29820 20997 29852 43005 30261 -11354 -55110 -53597 -50085 -65461
17304 -65461 -74437 -61998 -50673 24591 41945 6480 -44562 23380 51853 124440 69843 60813
17292 60813 47215 -25841 5984 50230 85916 116661 101506 141423 94691 34181 -74324
17281 -74324 -149007 -106504 -4232 14796 29694 63297 -36660 -119511 -64223 -29644 16808
17270 16808 97679 119212 105612 96649 51114 26542 78680 100729 33713 30114 -34073 -95891
17258 -95891 -54301 -17119 23049 39475 -1002 44045 62623 83761 26092 14737 16253 62979
17246 62979 69985 112416 43672 -19622 -44101 18312 31220 -62545 -116624 -101747 -101075 -104876
17234 -104876 -81324 8449 115759 127407 37262 -25320 12773 65424 95630 82610 9338
$$ packed form
17317E1854O370p1515k0487O3598q823Q855J3153j2744m1615m3756J513L512j5376
17304f5461q976J2439J1325P5264J7354l5465n1042O7942K8473P2587n4597r030
17292F0813j3598p3056L1825M4246L5686L0745j5155L9917m6732o0510j08505
17281g4324p4683M2503J02272J9028J4898L3603r9957q2851N5288L4579M6452
17270A6808Q0871K1533j3600q963m5535k4572N2138K2049o7016l599o4187o1818
17258i5891M1590L7182M0168J6426m0477M5047J8578K1138n7669j1355J516M6726
17246F2979P006M2431o8744o3294k4479O2413J2908r3765n4079J4877O72l801
17234a04876K3552Q9773J07310J1648r0145o2582L8093N2651L0206j3020p3272
$$ plain form
17223 9338 -36095 -31349 30838 94303 113358 156948 121086 136911 205047 188921 98491 42643
17211 42643 37646 79697 120828 196405 159048 112023 90605 64203 36335 61602 66765 20078
17199 20078 53251 -17185 -62263 -76085 -86389 -86722 -8929 -2078 -5898 60329 66267 -1489 27231
17186 27231 85058 112087 69769 -49217 -38020 -71607 -103615 -46067 70312 43064 3403
17175 3403 36557 32917 19415 53591 24914 8435 67698 138177 130333 138181 139269 143822 133057
17162 133057 124218 66920 40155 12873 -41255 -8184 -37947 -74226 -8085 12040 -6395 -57786
17150 -57786 -91947 -83216 -25721 47191 91959 28444 -32915 -102399 -131121 -135093 -164239 -150859
17138 -150859 -67169 34542 2304 -3180 18503 -3844 -7993 43620 78469 74198 46139 6681
$$ packed form
17223I338m5433M746O2187O3465J9055M3590l5862J5825O8136j6126r0430n5848
17211D2643m997M2051M1131P5577l7357m7025k1418k6402k7868K5267N163m6687
17199B0078L3173p0436m5078j3822j0304l33P7793O851l820O6227N938o7756K8720
17186B7231N7827K7029m2318j18986J1197l3587l2008N7548J16379k7248l9661
17175C403L3154l640j3502L4176k8677j6479N9263P0479p844P848J088M553j0765
17162A33057q839n7298k6765k7282n4128L3071k9763l6279O6141K0125j8435n1391
17150e7786l4161Q731N7495P2912M4768o3515o1359o9484k8722l972k9146J3380
17138a50859Q3690J01711l2238n484K1683k2347m149N1613L4849m271k8059l9458
$$ plain form
17126 6681 -48339 -73470 -41741 -74588 -113547 -99636 -98714 -54791 12070 50680 51403 74676 29143
17113 29143 -51770 -38541 -16527 -40092 -58645 -80059 -76622 -20545 -25196 -73252 -36331 19003
17101 19003 -401 -18692 -6195 -11811 -36474 -13273 -60350 -94104 -104960 -12 147510
17090 147510 161234 111565 80592 50681 36693 92432 98086 70870 110321 100617 58474 58066
17078 58066 31376 -7282 -41033 -14297 30683 61681 49406 14378 42208 118144 77065 -10441
17066 -10441 45062 77795 97181 68293 68083 144802 131791 66054 -117 23318 52746 122225
17054 122225 134030 87622 42409 52936 65818 9982 26224 17206 -43444 -6169 57261 89823
17042 89823 97021 108679 139550 128102 60678 -14087 -18589 16206 5968 -97280 -129581 -92495
$$ packed form
17126F681n5020k5131L1729l2847l8959J3911R22M3923O6861L8610P23K3273m5533
17113B9143q0913J3229K2014k3565j8553k1414L437N6077m651m8056L6921N5334
17101A9003j9404j8291J2497n616k4663K3201m7077l3754j0856J04948J47522
17090A47510J3724m9669l0973k9911j3988N5739N654k7216L9451r704m2143m08
17078E8066k6690l8658l3751K6736M4980L0998j2275l5028K7830P5936m1079q7506
17066a0441N5503L2733J9386k8888k10P6719j3011o5737o6171K3435K9428O9479
17054A22225J1805m6408m5213J0527J2882n5836J6242r018o0650L7275O3430L2562
17042H9823P198J1658L0871j1448o7424p4765m502L4795j0238j03248l2301L7086
$$ plain form
17030 -92495 -85384 -97544 -126137 -101874 -41522 11442 -18609 -25051 42872 22909 -26711 -29567
17018 -29567 -21698 29298 -26865 -82519 -26430 -8134 -715 -4644 85197 149544 136037 128117
17006 128117 122666 116606 59136 20358 87726 107187 107803 13267 24752 32445 6787 -56917
16994 -56917 -62758 9308 50096 7942 -10340 -109065 -138981 -131107 -107017 -94918 -85666 -149286
16982 -149286 -144794 -100341 -39656 -32794 -23034 -18374 28032 23319 25302 33171 35884 -10550 -27315
16969 -27315 -4501 -439 -40306 -14323 -90308 -59655 56048 79768 23668 -22734 -10867 -3
16957 -3 -76114 -70261 -12819 34722 10907 49928 49035 25015 -11846 -60485 -40904 50104 56204
16944 56204 40792 25719 22612 109493 130462 -4707 -85054 -62026 37865 114935 96674 18109
$$ packed form
17030i2495P111j2160k8593K4263O0352N2964l0051o442O7923j9963m9620k856
17018b9567P869N0996n6163n5654N6089J8296P419l929Q9841O4347j3507p920
17006A28117n451o060n7470l8778O7368J9461O16r4536J1485P693k5658o3704
16994e6917n841P2066M0788m2154j8282r8725k9916P874K4090J2099R252o3620
16982a49286M492M4453O0685O862R760M660M6406m713J983P869K713m6434j6765
16969b7315K2814M062l9867K5983p5985L0653J15703K3720n6100m6402J1867J0864
16957cp6111N853N7442M7541k3815L9021q93k4020l6861m8639J9581R1008O100
16944E6204j5412j5073l107Q6881K0969j35169q0347K3028R9891P7070j8261p8565
$$ plain form
16932 18109 82590 128905 92031 124103 123893 115404 43065 -6931 -50079 -75139 9524 43644
16920 43644 12120 15690 57394 35748 57293 78258 53889 22426 66316 49229 31178 70958
16908 70958 57288 97758 114629 160578 105723 72878 59098 20587 -7741 -65239 -93177 -66185
16896 -66185 929 -32834 -72306 -5076 31783 78808 99148 126905 119372 53446 -28610 -88707
16884 -88707 -127594 -63508 -57334 -45901 31309 68958 114707 94942 13086 -50948 11408 82304
16872 82304 34795 8233 -43174 -73530 7929 -1947 35533 22827 -35489 19977 66520 -1927
16860 -1927 1207 76283 81917 33019 96396 93020 37440 -70802 -6457 92503 98700 79699
16848 79699 43398 55550 30944 -15244 -51993 -25625 -30439 -18852 -24626 12830 7818 7608 12493
$$ packed form
16932A8109O4481M6315l6874L2072k10q489p2339m9996m3148k5060Q4663L4120
16920D3644l1524L570M1704k1646K1545K0965k4369l1463M3890j7087j8051L9780
16908G0958j3670M0470J6871M5949n4855l2845j3780l8511k8328n7498k7938K6992
16896f6185O7114l3763l9472O7230L6859M7025K0340K7757p533o5926q2056o0097
16884h8707l8887O4086O174J1433P7210L7649M5749j9765q1856o4034O2356P0896
16872H2304m7509k6562n1407l0356Q1459r876L7480j2706n8316N5466M6543o8447
16860a927L134P5076N634m8898O3377l376n5580j08242O4345R8960O197j9001
16848G9699l6301J2152k4606m6188l6749K6368m814J1587n774L7456n012k10M885
$$ plain form
16835 12493 4788 -23042 -37150 -50835 -86813 -27300 -34548 5653 -10028 -43647 -58037 35135
16823 35135 -46246 -36675 69170 48669 61671 82645 141335 114822 137846 70337 19998 16272
16811 16272 55633 85725 69953 38140 5503 42586 16182 1016 27894 62084 31549 51713
16799 51713 138830 89383 84231 78373 -8584 947 -24374 -5392 -54927 -44012 -64052 -15534
16787 -15534 95754 57726 -44527 -31463 -12588 -26508 16560 -10247 -22877 -9557 10953
16776 10953 62202 84237 81909 70146 37072 -22183 -101021 -42760 -43763 -20906 4603 -8398
16764 -8398 41968 -83917 -146521 -133457 -141684 -101283 -67364 -116164 -99736 -3891 38656 -11385
16752 -11385 -118600 -179334 -111232 -103034 -54012 -78588 -116929 -176171 -167442 -75105 -65141 -27441
$$ packed form
16835A2493p705k7830j4108j3685l5978N9513p248M0201j5681l3619j4390R3172
16823C5135q1381R571J05845k0501J3002K0974N8690k6513K3024o7509n0339l726
16811A6272L9361L0092j5772l1813l2637L7083k6404j5166K6878L4190l0535K0164
16799E1713Q7117m9447n152n858q6957R531k5321J8982m9535J0915k0040M8518
16787a5534J11288l8028j02253J3064J8875j3920M3068k6807j2630J3320K0510
16776A0953N1249K2035k328j1763l3074n9255p8838N8261j003K2857K5509j3001
16764h398N0366j25885o2604J3064q227M0401L3919m8800J6428R5845M2547n0041
16752a1385j07215o0734O8102Q198M9022k4576l8341n9242Q729R2337R964L7700
$$ plain form
16740 -27441 -16353 -9653 -21847 -115413 -163822 -109423 -73028 -63203 -49508 -58713 -66003 -29204
16728 -29204 -70819 -98143 -105850 -96422 -24396 -3163 18819 94666 101448 -2152 -71208 -2176
16716 -2176 27715 13343 -50435 -67843 -64865 -72433 -32886 -61385 -44183 -49995 -16469 -99912
16704 -99912 -105713 27014 104238 46021 30728 19187 40566 30999 -3663 -14961 -48373 -37732
16692 -37732 -1634 12606 69849 5764 -28581 -51857 -83283 -31845 -6993 10223 -19595 -32907
16680 -32907 25182 28361 27903 44258 -9959 46381 -3042 -46182 -128511 -82694 -27915 24473
16668 24473 15889 -42386 21178 91161 31560 -37365 -6341 22327 35581 17731 80720 60465
16656 60465 79770 115442 84705 74360 68933 2493 -9375 -52596 -72400 -91456 -99627 -105820
$$ packed form
16740b7441J1088O700j2194r3566m8409N4399L6395R825J3695r205p290L6799
16728b9204m1615k7324p707R428P2026K1233K1982P5847O782j03600o9056O9032
16716b176K9891j4372o3778j7408K978p568L9547k8499J7202n812L3526q3443
16704i9912n801J32727P7224n8217j5293j1541K1379r567l4662j1298l3412J0641
16692c7732L6098J4240N7243o4085l4345k3276l1426N1438K4852J7216k9818j3312
16680c2907N8089L179m58J6355n4217N6340m9423m3140q2329M5817N4779N2388
16668B4473q584n8275O3564O9983n9601o8925L1024K8668J3254j7850O2989k0255
16656F0465J9305L5672l0737j0345n427o6440j1868m3221j9804j9056q171o193
$$ plain form
16644 -105820 -120797 -83305 -70971 -113816 -75185 -103521 -83641 -30086 -81732 -164698 -123118
16633 -123118 -61406 -53440 37375 63943 52184 67376 103497 72795 79868 107669 72660 58906
16621 58906 92622 111981 128468 20105 -44452 43291 107346 96761 -10510 -43349 -10447
16610 -10447 -50239 -31735 -37285 -32828 -55090 -17657 57874 50193 3968 -53068 -8876 24313
16598 24313 -18317 -40257 -35850 -9643 -58539 -71916 -89632 -36640 -30743 -93562 -38150 20075
16586 20075 34016 72159 59501 35282 -23154 12865 24437 72700 80838 66455 -9937 -103016
16574 -103016 -76418 -58768 -121979 -52840 4683 -31109 -11091 3928 29759 122407 143065
16563 143065 131974 52527 27080 -4403 10331 -46487 8640 -13954 -9129 -44894 -20339 86225
$$ packed form
16644a05820j4977L7492J2334m2845L8631k8336J9880N3555n1646q2966M1580
16633a23118O1712P966R0815K6568j1759J5192L6121l0702P073K7801l5009j3754
16621E8906L3716J9359J6487j08363o4557Q7743O4055j0585j07271l2839L2902
16610a0447l9792J8504n550M457k2262L7433P5531p681m6225n7036M4192L3189
16598B4313m2630k1940M407K6207m8896j3377j7716N2992N897o2819N5412N8225
16586B0075J3941L8143j2658k4219n8436L6019J1572M8263Q138j4383p6392r3079
16574a03016K6598J7650o3211O9139N7523l5792K0018J5019K5831R2648K0658
16563A43065j1091p9447k5447l1483J4734n6818N5127k2594M825l5765K4555J06564
$$ plain form
16551 86225 91451 7139 37908 103262 119670 75364 11019 -73282 -118802 -57411 13343 17470
16539 17470 -45020 -21204 -58144 -115767 -105970 -13142 -18590 -55616 -44653 -7923 -26285 3290
16527 3290 26284 52849 42503 7166 -80198 -65626 3925 8174 6186 -70386 -103706 -17325
16515 -17325 108228 87948 33470 16083 13859 -4603 -9538 13154 -12106 -11921 -59619 -33880
16503 -33880 30027 99158 73364 -33105 -103825 -78958 -114102 -164066 -141670 -78992 -63939
16492 -63939 -105417 -144372 -107868 -90428 -76392 -79642 -48533 -26887 -64640 -64496 -95423 -113575
16480 -113575 -178649 -139094 -106898 -139454 -186018 -98606 -101259 -92761 -93830 -69479 -21509 17352
16468 17352 75916 78787 8709 40545 107991 59576 -45300 -62000 -25625 33521 -1443 -69350
$$ packed form
16551H6225N226q4312L0769O5354J6408m4306o4345q4301m5520O1391P0754M127
16539A7470o2490K3816l6940n7623R797R2828n448l7026J0963L6730j8362K9575
16527C290K2994K6565j0346l5337q7364J4572O9551M249j988p6572l3320Q6381
16515a7325J25553k0280n4478j7387k224j8462m935K2692k5260J85m7698K5739
16503c3880O3907O9131k5794j06469p0720K4867l5144m9964K2396O2678J5053
16492f3939m1478l8955L6504J7440J4036l250L1109K1646l7753J44l0927j8152
16480a13575o5074L9555L2196l2556m6564Q7412k653Q498j069K4351M7970L8861
16468A7352N8564K871p0078L1836O7446m8415j04876j6700L6375N9146l4964o7907
$$ plain form
16456 -69350 -91676 26798 127060 24721 -62845 -45522 -17658 26029 41521 -38166 -66247
16445 -66247 -32305 -11440 -37448 26935 46339 -55212 -61357 -15401 -86454 -70014 -96413 -34676
16433 -34676 -23962 13753 -1080 29740 79526 170251 140849 84963 33397 -14860 -19805 14310
16421 14310 81158 47422 -22267 -55725 -95312 -91648 -17323 76138 94515 147237 172087 211178
16409 211178 207191 75289 -58545 -36074 -22060 -69370 -145037 -144485 -73788 -50893 -44505 -74885
16397 -74885 -30076 28771 13003 -3461 38919 65429 120931 136309 108598 62075 60898 45998
16385 45998 -14370 -59235 -48240 -50590 -9715 24497 22641 -58567 -44184 -65887 -23227 44195
16373 44195 62121 120739 130308 74196 23368 -447 40539 -20948 -24316 -18972 43519 34086
$$ packed form
16456f9350k2326J18474J00262j02339q7566J7323K7864M3687J5492p9687k8081
16445f6247L3942K0865k6008O4383J9404j01551o145M5956p1053J6440k6399O1737
16433c4676J0714L7715j4833L0820M9786R0725k9402n5886n1566m8257m945L4115
16421A4310O6848l3736o9689l3458l9587L664P4325R3461J8377N2722K4850L9091
16409B11178l987j31902j33834K2471J4014m7310p5667N52P0697K2895O388l0380
16397g4885M4809N8847j5768j6464M2380K6510N5502J5378k7711m6523j177j4900
16385D5998o0368m4865J0995k350M0875L4212j856q1208J4383k1703M2660O7422
16373D4195J7926N8618R569n6112n0828k3815M0986o1487l368N344O2491r433
$$ plain form
16361 34086 32986 -77293 -140633 -109910 -23192 19240 65029 105786 81151 8011 -35489 31830
16349 31830 40412 54852 29286 -30347 35765 -36502 -36495 -25688 -57126 -62116 -15041 -17830 -34697
16336 -34697 -26539 41937 99021 75218 -40831 -135403 -112759 -78287 -34270 -33716 -79443 -141144
16324 -141144 -110047 -91878 -127895 -90583 -92092 -65243 16430 -7946 51764 70878 55519 51835
16312 51835 -7194 -73802 -49823 -33346 -55564 -102321 -111024 -47437 -7597 -9502 -60191 -67469
16300 -67469 -24175 -9007 34958 -18706 -147465 -154171 -122602 -77680 -78166 -76447 -40347 12678
16288 12678 43901 -12379 -3927 30303 21872 1729 81138 51651 -21930 -73846 -42398 -72700
16276 -72700 -104498 -133567 -161168 -190280 -118357 -56345 -27349 -74767 -85181 -84149 -82097 -80974
$$ packed form
16361C4086j100j10279o3340L0723Q6718M2432M5789M0757k4635p3140m3500O7319
16349C1830Q582J4440k5566n9633O6112p2267PJ0807l1438m990M7075k789j6867
16336c4697Q158O8476N7084k3803j16049r4572K2644L4472M4017N54m5727o1701
16324a41144L1097J8169l6017L7312j509K6849Q1673k4376N9710J9114j5359l684
16312E1835n9029o6608K3979J6477k2218m6757q703O3587L9840j905n0689p278
16300f7469M3294J5168M3965n3664j28759o706L1569M4922m86J719L6100N3025
16288A2678L1223n6280Q452L4230q431k0143P9409k9487p3581n1916L1448l0302
16276g2700l1798k9069k7601k9112P1923O2012K8996m7418j0414J032K052J123
$$ plain form
16264 -80974 -35104 31627 171351 145658 118639 62596 77863 91214 85292 13262 -30251 -66689
16252 -66689 7737 -10669 -15310 -40891 -23983 30119 80768 86885 9771 -38345 22851 27209
16240 27209 -29615 -94842 -43997 28780 -9299 -18870 -86288 -131343 -137093 -88028 19597 63540
16228 63540 29616 72823 126347 49946 -36015 -41120 30700 16604 27127 31826 -13785 15729
16216 15729 29939 -7761 -73898 -91668 -70321 -21833 -82476 -81170 -53851 -74006 -97767 -80729
16204 -80729 -16526 11403 -44087 -122690 -122162 -54847 -29794 -54145 -36937 -11001 -62741 -135053
16192 -135053 -146521 -121879 -53801 -42630 -58559 22821 57814 95720 65446 2255 -3098 29125
16180 29125 48900 20438 -24583 -8819 8185 50181 89523 -26984 -118558 -110665 -71347 -53285
$$ packed form
16264h0974M5870O6731J39724k5693k7019n6043J5267J3351n922p2030m3513l6438
16252f6689P4426j8406m641k5581J6908N4102N0649O117p7114m8116O1196M358
16240B7209n6824o5227N0845P2777l8079r571o7418m5055n750M9065J07625M3943
16228F3540l3924M3207N3524p6401q5961n105P1820j4096J0523M699m5611K9514
16216A5729J4210l7700o6137j7770K1347M8488o0643J306K7319k0155k3761J7038
16204h0729O4203K7929n5490p8603N28O7315K5053k4351J7208K5936n1740p2312
16192a35053j1468K4642O8078J1171j5929Q1380L4993L7906l0274o3191n353L2223
16180B9125J9775k8462m5021J5764J7004M1996L9342j16507r1574P893L9318J8062
$$ plain form
16168 -53285 -13112 95198 61048 69032 57804 -1712 -102090 -76902 13222 58033 35953
16157 35953 56203 36024 -74711 -86128 29914 47477 49180 20524 -4273 33417 102185
16146 102185 145866 54432 -78777 -61772 -54141 -101408 -49675 21057 16423 7592 -4513 -10681
16134 -10681 10865 51967 11914 -110126 -95929 -61625 -11898 -2321 -105009 -133207 -75873
16123 -75873 -46065 -63183 -65023 20774 74973 -1148 -49940 -41655 -59698 -39810 -57964 -40663
16111 -40663 95704 138869 99403 72844 99553 115437 110912 60879 24735 69110 94093 83582
16099 83582 86496 130697 81402 2146 4557 -109942 -172477 -184608 -174826 -119459 -126471 -162162
16087 -162162 -86136 -105726 -100795 -51810 -35481 -53808 -114533 -176779 -148767 -140331 -94410 -66157
$$ packed form
16168e3285M0173J08310l4150P984j1228n9516j00378K5188R0124M4811k2080
16157C5953K0250k0179j10735j1417J16042J7563J703k8656k4797L7690O8768
16146A02185M3681r1434j33209J7005P631m7267N1733P0732m634q831j2105o168
16134a0681K1546M1102m0053j22040J4197L4304M9727R577j02688k8198N7334
16123g5873K9808j7118j840Q5797N4199p6121m8792Q285j8043J9888j8154J7301
16111d0663J36367M3165l9466k6559K6709J5884m525n0033l6144M4375K4983j0511
16099H3582K914M4201m9295p9256K411j14499o2535j2131R782N5367p012l5691
16087a62162P6026j9590M931M8985J6329j8327o0725o2246K8012Q436M5921K8253
$$ plain form
16075 -66157 -87572 -107291 -92457 -41751 23324 21047 -42636 21305 83745 43733 30670 69364
16063 69364 -4825 -75860 -9304 16532 -6863 -6275 115049 104152 113365 144913 133745 18769
16051 18769 -70669 -55656 -3464 -8995 -28798 -81002 -43840 -51818 -142376 -167724 -100583 -47105
16039 -47105 21164 59845 19926 73786 -41959 -81477 -127077 -105535 -25336 35137 -25529
16028 -25529 -92981 -51221 56481 42361 41113 88379 92358 56451 11815 -75923 -128853 -84778
16016 -84778 16978 25750 -40750 -75344 -35880 -74346 -86075 -72523 -52461 -24220 29133 -6109
16004 -6109 -36677 4393 -73711 -130308 -77767 4054 77937 86921 56960 86724 52261 -57317
15992 -57317 -104324 -14009 -17064 -32162 4542 105332 70617 26946 3138 63047 57675 52071
$$ packed form
16075f6157k1415j9719J4834N0706O5075k277o3683O3941O2440m0012j3063L8694
16063F9364p4189p1035O6556K5836k3395N88J21324j0897R213L1548j1168j14976
16051A8769q9438J5013N2192n531j9803n2204L7162p978r0558k5348O7141N3478
16039d7105O8269L8681l9919N3860j15745l9518m5600K1542Q0199O0473o0666
16028b5529o7452M1760J07702j4120j248M7266L979l5907m4636q7738n2930M4075
16016h4778J01756Q772o6500l4594L9464l8466j1729J3552K0062K8241N3353l5242
16004f109l0568M1070p8104n6597N2541Q1821P3883Q984k9961K9764l4463j09578
15992e7317m7007R0315l055j5098L6704J00790l4715m3671k3808N9909n372n604
$$ plain form
15980 52071 105703 53860 2574 -23681 -47230 41055 140631 118760 111678 3359 -17194 -83267
15968 -83267 -91575 33439 9569 -22861 -17039 -14908 24695 46658 48258 22480 -99227 -75532
15956 -75532 16864 -62443 -117589 -63819 -6534 8647 -34491 -74594 -124606 -58568 -69434 -23381
15944 -23381 15246 636 -56466 -49192 -64078 -92463 -115014 -116443 -115379 -107814 -66140 49398
15932 49398 43601 12960 22855 -42451 -97391 -136653 -157019 -136935 -53989 -78963 -109331 -67421
15920 -67421 -67773 -40114 -91428 -110171 -156328 -171480 -109651 -3760 69569 45931 26258 28535
15908 28535 8891 41698 81633 51063 21963 -30605 -113024 -145597 -44911 -17094 -21696 -71922
15896 -71922 -110243 -123716 -126143 -133618 -110403 3694 25934 -14346 -24352 -97128 -116905 -94988
$$ packed form
15980E2071N3632n1843n1286k6255k3549Q8285R9576k1871p082j08319k0553o6073
15968h3267q308J25014k3870l2430N822K131L9603K1963J600k5778j21707K3695
15956g5532R2396p9307n5146N3770N7285J5181m3138m0103n0012O6038j0866M6053
15944b3381L8627j4610n7102P274j4886k8385k2551j429J064P565M1674J15538
15932D9398n797l0641R895o5306n4940l9262k0366K0084Q2946k4974l0368M1910
15920f7421l52K7659n1314j8743m6157j5152O1829J05891P3329k3638j9673K277
15908B8535j9644L2807L9935l0570k9100n2568q2419l2573J00686K7817m602n0226
15896g1922l8321j3473k427p475K3215J14097K2240m0280j0006p2776j9777K1917
$$ plain form
15884 -94988 -88029 -96710 -19305 29891 -85112 -81376 -59477 -138355 -104375 -102933 -108793 -136234
15872 -136234 -141316 -97503 -25347 -38109 -116510 -169550 -174949 -141070 -148472 -161670 -220017 -257449
15860 -257449 -175425 -168399 -187229 -185567 -102678 -71864 -113426 -97522 -86118 -122004 -67462 -18260
15848 -18260 -2020 -2459 -7751 -18301 93334 196601 192823 113000 24952 -13003 -54364 -89911
15836 -89911 -101222 -45015 3490 -21470 9059 6802 -24035 6777 77153 33665 -44529 -11171
15824 -11171 -9908 -38789 -7451 12165 -61017 -51441 27795 8104 -49006 -19566 83082 81356
15812 81356 -19157 -33723 -32059 -80227 -105300 -54645 -9870 -39749 -76942 -83926 -56512 -25735
15800 -25735 -85682 -113581 -82751 1363 72148 70525 49757 26035 -44894 -78386 -56648 -108526
$$ packed form
15884i4988O959q681P7405M9196j15003L736K1899p8878L3980J442n860k7441
15872a36234n082M3813P2156j2762p8401n3040n399L3879p402j3198n8347l7432
15860b57449Q2024P026j8830J662Q2889L0814m1562J5904J1404l5886N4542M9202
15848a8260J6240m39n292j0550J11635J03267l778p9823q8048l7955m1361l5547
15836h9911j1311N6207M8505k4960L0529k257l0837L0812P0376m3488p8194L3358
15824a1171J263k8881L1338J9616p3182R576P9236j9691n7110K9440J02648j726
15812H1356j00513j4566J664m8168k5073N0655M4775k9879l7193o984K7414L0777
15800b5735n9947k7899L0830Q4114P0785j623k0768k3722p0929l3492K1738n1878
$$ plain form
15788 -108526 -140558 -131580 -53771 33044 78959 38925 -12876 -110693 -147031 -99441 -142423 -63013
15776 -63013 -46426 -2444 56144 54210 27788 1371 -9914 -12674 25691 39546 24484 28961
15764 28961 -12830 -457 23529 -28964 30488 9468 -2330 25120 -32071 -53343 -82039 -105367
15752 -105367 -121803 -123213 -101484 -72779 -117799 -110722 -39687 16668 30239 32979 -34075 -67355
15740 -67355 -74376 -49630 25893 -16234 -69861 -118023 -90511 -23651 -60494 -73252 -48309 -32154
15728 -32154 -71445 -30844 92695 125819 117730 104930 107071 110737 68672 -20678 -46259 -44062
15716 -44062 -47900 -86004 -39345 1617 -41621 -52944 -72280 -35349 17678 113063 38599 -79846
15704 -79846 -73880 -7623 -47137 -13688 -81039 -75210 -8195 29902 36604 -64831 -168600 -153309
$$ packed form
15788a08526l2032Q978P7809Q6815M5915m0034n1801r7817l6338M7590m2982P9410
15776f3013J6587M3982N8588j934k6422k6417j1285k760L8365J3855j5062M477
15764B8961m1791J2373K3986n2493N9452k1020j1798K7450n7191k1272k8696k3328
15752a05367j6436j410K1729K8705m5020P077P1035N6355J3571K740o7054l3280
15740f7355p021K4746P5523m2127n3627m8162K7512O6860l6843j2758K4943J6155
15728c2154l9291M0601J23539L3124q089j2800K141L666m2065q9350k5581K197
15716d4062l838l8104M6659M0962m3238j1323j9336L6931N3027R5385p4464j18445
15704g9846N966O6257l9514L3449o7351N829O7015L8097O702j01435j03769J5291
$$ plain form
15692 -153309 -100784 -3873 43830 28695 -16157 -39436 -35136 -16965 -46261 -76614 -97613 -47211
15680 -47211 24428 3546 -28131 16523 29753 -1825 -36492 14509 -92072 -161122 -143127
15669 -143127 -85770 -53094 22922 135698 60557 -14635 -48232 -61812 -51380 -115379 -122917
15658 -122917 -110121 -40861 -7755 -10443 29570 9770 2762 29562 34884 -32245 -93337 -20518
15646 -20518 2903 -35031 -32294 -12518 -26126 -3913 -7427 19920 72755 64022 1232 -4426
15634 -4426 8898 21309 -82624 -113677 -53283 -37397 -102195 -79818 4280 -50191 -67719 16487
15622 16487 68284 95029 122627 19958 60234 34634 41191 46642 75447 84871 58878 74618
15610 74618 73145 63862 1828 -10220 -70268 -151196 -159742 -82814 31655 -9378 -25458 -1949
$$ packed form
15692a53309N2525R6911M7703j5135m4852k3279M300J8171k9296l0353k0999N0402
15680d7211P1639k0882l1677M4654J3230l1578l4667N1001j06581o9050J7995
15669a43127N7357L2676P6016J12776p5141p5192l3597j3580J0432o3999p538
15658a22917J2796O9260L3106k688M0013j9800p008K6800N322o7129o1092P2819
15646b0518K3421l7934K737J9776j3608K2213l514K7347N2835q733o2790n658
15634d426J3324J2411j03933l1053O0394J5886o4798K2377Q4098n4471j7528Q4206
15622A6487N1797K6745K7598j02669M0276k5600O557N451K8805R424k5993J5740
15610G4618j473r283o2034j2048o0048q0928q546P6928J14469m1033j6080K3509
$$ plain form
15598 -1949 -18059 -38541 23529 48438 47215 -1337 -58166 -7302 14184 37678 5710 54515
15586 54515 122511 95139 19149 60714 52323 -33124 36858 87115 29766 -40924 -55866 -51988
15574 -51988 -35106 34562 46912 49014 -12190 -77163 -60140 -5487 33054 -62795 -29532 59057
15562 59057 54891 27370 -56781 -100700 -122106 -143793 -121193 -41513 32428 42170 91748 85249
15550 85249 39055 67798 97101 59242 -19987 -24907 18394 -4500 12663 -13859 -15554 18739
15538 18739 25005 -8042 -25849 -67490 -157951 -200500 -189929 -142978 -137522 -98469 -147296 -166587
15526 -166587 -89778 -10099 12966 -3356 -79255 29949 70413 45547 -37805 -46922 -118025
15515 -118025 -198137 -217010 -160142 -114173 -53991 -41962 -15525 -12421 47312 57879 -267 -34031
$$ packed form
15598a949j6110k0482O2070K4909j223m8552n6829N0864K1486K3494l1968M8805
15586E4515O7996k7372p5990M1565q391q5447O9982N0257n7349p0690j4942L878
15574e1988J6882O9668J2350K102o1204o4973J7023N4653L8541r5849L3263Q8589
15562E9057m166k7521q4151m3919k1406k1687K2600P9680P3941R742M9578o499
15550H5249m6194K8743K9303l7859p9229m920M3301k2894J7163k6522j695L4293
15538A8739O266l3047j7807m1641r0461m2549J0571M6951N456L9053m8827j9291
15526a66587P6809P9679K3065j6322p5899J09204M0464k4866q3352r117p1103
15515a18025q0112j8873N6868M5969O0182J2029K6437L104N9733J0567n8146l3764
$$ plain form
15503 -34031 16734 99850 50296 -89283 -89366 -37053 8423 25831 17443 54778 54499 60110 100276
15490 100276 90147 58885 14985 -31001 19818 31063 16615 -47719 -40301 -9479 -49196 -27106
15478 -27106 87410 138796 158211 181312 147729 130701 159587 79423 85793 160788 110809 25336
15466 25336 -33520 3276 13069 -46374 -51964 -86385 -143198 -82548 -421 -14253 -91111 -112540
15454 -112540 -132831 -133262 -162180 -176428 -99571 -72881 -31632 -17102 -13589 13715 -8503 -14947
15442 -14947 12083 -10151 -4318 58111 136824 92080 9338 -9946 -17334 814 25083 50523
15430 50523 35048 62018 32614 -15989 -33525 -110493 -187542 -143202 -68033 -79245 -79828 -154041
15418 -154041 -134143 -87049 -11574 30324 109223 123187 27680 -7254 -19205 -31204 -66737
$$ packed form
15503c4031N0765Q3116m9554j39579q3N2313M5476J7408q388L7335k79N611M0166
15490A00276j0129l1262m3900m5986N0819J1245j4448o4334P418L0822l9717K2090
15478b7106J14516N1386J9415K3101l3583j7028K8886q0164O370P4995m9979q5473
15466B5336n8856L6796R793n9443n590l4421n6813O0650Q2127j3832p6858k1429
15454a12540k0291m31k8918j4248P6857K6690M1249J4530L513K7304k2218o444
15442a4947K7030k2234N833O2429P8713m4744q2742j9284p388J8148K4269K5440
15430E0523j5475K6970k9404m8603j7536p6968p7049M4340P5169j1212n83p4213
15418a54041J9898M7094P5475M1898P8899J3964r5507l4934j1951j1999l5533
$$ plain form
15407 -66737 -61318 -73745 -98958 -99347 -64482 -27215 -32906 -83339 -104410 -107316 -82648 -60410 -17071
15394 -17071 -51201 -123146 -94984 -25263 42123 36843 -86655 -155928 -201791 -186555 -106076 -61176
15382 -61176 -59054 -72449 -78751 -25202 36314 54643 7184 10942 125992 154782 63295 -2001
15370 -2001 -37222 -18450 62835 70590 45199 -69470 -136770 -121201 -9818 -18214 -21989 -13417
15358 -13417 -39611 -6836 -20810 -97201 -130024 -98550 -85514 -66751 -107335 -142545 -120342 -138094
15346 -138094 -140459 -141094 -146528 -85626 -75236 -132522 -196354 -150804 127 7525 -79601 -51300
15334 -51300 31916 82186 109100 123041 112702 50283 245 64610 112668 120152 119181 111585
15322 111585 117900 38902 -34473 -84228 -135292 -177799 -202270 -150983 -101147 -83834 -14386 16599
$$ packed form
15407f6737N419j2427k5213l89L4865L7267n691n0433k1071k906K4668K2238M3339
15394a7071l4130p1945K8162O9721O7386n280j23498o9273m5863J5236Q0479M4900
15382f1176K122j3395o302N3549O1516J8329m7459L758J15050K8790r1487o5296
15370b001l5221J8772Q1285P755k5391j14669o7300J5569J11383q396l775Q572
15358a3417k6194L2775j3974p6391l2823L1474J3036J8763m0584l5210K2203j7752
15346a38094k365o35n434O0902J0390n7286o3832M5550J50931P398q7126K8301
15334e1300Q3216N0270K6914J3941j0339o2419n0038O4365M8058P484r71p596
15322A11585O315p8998p3375m9755n1064m2507k4471N1287M9836J7313O9448L0985
$$ plain form
15310 16599 -55691 -137064 -128536 -46894 -24745 -50276 -26347 -38081 -100728 -104753 -28635 -37961
15298 -37961 -14029 8372 -70088 -113220 -112121 -173620 -192633 -28880 54791 43200 -102710
15287 -102710 -135000 -110911 -103915 7282 72141 -46881 -138570 -103466 -47627 39117 28799
15276 28799 -26030 -50867 -108326 -111448 -129890 -123358 -15513 48208 45046 2551 38560 88694
15264 88694 134260 118134 -14229 -73135 -111841 -60646 -12436 -23163 -115506 -177858 -170599 -116276
15252 -116276 -80480 -70003 -59879 12559 5749 -4866 -17115 9730 17218 41602 -37053 -15873
15240 -15873 -29686 2124 -46986 -89359 -115653 -161464 -149032 -112722 -75316 -37064 -90231 -75023
15228 -75023 -164634 -177380 -56345 -16109 -40395 -83250 -34273 -49176 -92905 -120470 -85541
$$ packed form
15310A6599p2290q1373Q528Q1642K2149k5531K3929j1734o2647m025P6118r326
15298c7961K3932K2401p8460m3132J099o1499j9013J63753Q3671j1591j45910
15287a02710l2290K4089O996J11197O4859j19022r1689L5104N5839Q6744j0318
15276B8799n4829k4837n7459l122j8442O532J07845O3721l162m2495L6009N0134
15264H8694M5566j6126j32363n8906l8706N1195M8210j0727r2343o2352P259N4323
15252a16276L5796J0477J0124P2438o810j0615j2249K6845P488K4384p8655K1180
15240a5873j3813L1810m9110m2373k6294m5811J2432L6310L7406L8252n3167J5208
15228g5023q9611j2746J21035M0236k4286m2855M8977j4903m3729k7565L4929
$$ plain form
15217 -85541 -71884 -86698 -100662 -175418 -194845 -163321 -132768 -90874 -66253 -2842 35808 41121
15205 41121 72017 66910 1170 29848 90571 128407 90739 73135 28365 -37800 -64847 17578
15193 17578 -46768 -23043 24179 4549 -64861 -41360 -72715 -97241 -82622 -17940 -23617 -55863
15181 -55863 -3401 107395 174763 86376 55476 35587 -973 -76828 -63512 -93982 -42903
15170 -42903 37754 52263 2906 -52149 -48584 32268 77209 16927 5767 -37869 -57403 -22953
15158 -22953 9041 46602 63446 31398 -40425 -26946 66011 58174 -50062 -102492 -96005 -18075
15146 -18075 35584 -50049 -166512 -107010 -61623 -9264 -53756 -122378 -119820 -14194 59073
15135 59073 70310 98034 59722 62411 45843 -21027 -61392 -72141 -92442 -106526 -144399 -183165
$$ packed form
15217h5541J3657j4814j3964p4756j9427L1524L0553M1894K4621O3411L8650N313
15205D1121L0896n107o5740K8678O0723L7836l7668j7604m4770o6165k7047Q2425
15193A7578o4346K3725M7222j9630o9410K3501l1355k4526J4619O4682n677l2246
15181e5863N2462J10796O7368q8387l0900j9889l6560p5855J3316l0470N1079
15170d2903Q0657J4509m9357n5055L565Q0852M4941o0282j1160m3636j9534L4450
15158b2953L1994L7561J6844l2048p1823J3479R2957p837j08236n2430O487P7930
15146a8075N3659q5633j16463N9502M5387N2359m4492o8622K558J05626P3267
15135E9073J1237K7724l8312K689j6568o6870m0365j0749k0301j4084l7873l8766
$$ plain form
15123 -183165 -120555 -38355 18122 25295 -95038 -119807 -84709 -36737 -10194 -16738 -45270 -83418
15111 -83418 -1830 38427 16857 -51514 -61127 -76221 -110925 -101577 -72546 -59059 -47662 18665
15099 18665 -8959 -55559 -15560 -29891 -49640 11981 55264 32815 22910 63576 50666 53854
15087 53854 -22489 -76413 -36479 -59842 -74946 -113020 -117455 -53389 -47673 -97152 -69359 54726
15075 54726 33751 -29912 11802 53558 4092 -50896 -77343 -78468 -51070 -64555 -52735 -28090
15063 -28090 5334 18741 66490 30000 40569 123709 96666 36100 -55737 -68996 -35966 13581
15051 13581 23392 11604 29733 19100 -54979 -89257 -15448 -9824 -56336 -139481 -111617 -62632
15039 -62632 -31601 -32378 -2139 12980 -14352 -30748 -98258 -119967 -134521 -114940 -11079 -6683
$$ packed form
15123a83165O2610Q2200N6477P173j20333k4769L5098M7972K6543o544k8532l8148
15111h3418Q1588M0257k1570o8371r613j5094l4704R348K9031J3487J1397O6327
15099A8665k7624m6600L9999j4331j9749O1621M3283k2449r905M0666j2910L188
15087E3854p6343n3924L9934k3363j5104l8074m435O4066N716m9479K7793J24085
15075E4726k0975o3663M1714M1756m9466n4988k6447j125K7398j3485J1820K4645
15063b8090L3424J3407M7749l6490J0569Q3140k7043o0566r1837j3259L3030M9547
15051A3581R811j1788J8129j0633p4079l4278P3809N624m6512q3145K7864M8985
15039f2632L1031p77L0239J5119k7332j6396o7510k1709j4554J9581J03861M396
$$ plain form
15027 -6683 -75014 -47226 -91061 -116470 -104850 -92891 -91907 4425 113914 100901 55700 68476
15015 68476 42145 36165 55509 52544 79381 11700 -21266 -5817 10393 75306 156800 170163
15003 170163 106305 76753 -28697 -45582 11469 -11426 -37269 -71579 -25683 68553 17373
14992 17373 -87376 -94451 -66504 -17804 -39284 24191 29918 39822 56969 15201 -49181 1197
14980 1197 5649 -6868 -42652 20909 68196 39110 -28392 2610 -10647 6625 30390 30220
14968 30220 9386 45018 7146 18548 -27505 -49574 -51770 -62837 -116805 -131814 -150457 -135547
14956 -135547 -33188 -11275 -87507 -114203 -79342 35345 91221 57532 10552 -20653 2274
14945 2274 -79036 -135225 -75246 -104971 -123567 -30134 63446 34880 50316 -20753 -55202 -81106
$$ packed form
15027f683o8331K7788m3835k5409J1620J1959R84R6332J09489j3013m5201J2776
15015F8476k6331n980J9344k965K6837o7681l2966J5449J6210O4913Q1494J3363
15003A70163o3858k9552j05450j6885N7051k2895k5843l4310M5896R4236n1180
14992A7373j04749p075K7947M8700k1480O3475N727R904J7147m1768o4382N0378
14980A197M452j2517l5784O3561M7287k9086o7502L1002j3257J7272K3765j70
14968C0220k0834L5632l7872J1402m6053k2069k196j1067n3968j5009j8643J4910
14956a35547J02359K1913p6232k6696L4861J14687N5876l3689m6980l1205K2927
14945B274q1310n6189N9979k9725j8596R3433R3580k8566J5436p1069l4449k5904
$$ plain form
14933 -81106 -57939 -58793 -43980 -50011 -75768 -11162 40491 49827 12271 -6707 -29471 -34206 -67421
14920 -67421 -35748 7334 45206 59321 40192 29919 -45467 -100166 -19142 -54675 -128330 -80552
14908 -80552 -29804 52764 90168 -40755 -54070 -22315 34832 -8549 29940 30279 -8752 16190
14896 16190 29728 16093 -27677 -87932 -48602 -32333 -35229 -29831 18865 66941 79140 26947
14884 26947 37847 -2585 28778 95499 43006 -27214 -16971 47838 86631 112898 53850 3991
14872 3991 67240 28099 -89278 -79956 -30732 1751 14503 8775 23785 55862 59541 19812
14860 19812 4192 -6709 -21400 -51377 -57993 -14526 11170 7522 -33201 -18793 -47139 -83077
14848 -83077 -12546 40944 64891 48394 98437 105674 44437 -14244 -16666 19308 68412 124237
$$ packed form
14933h1106K3167q54J4813o031k5757O4606N1653R336l7556j8978k2764m735l3215
14920f7421L1673M3082L7872J4115j9129j0273p5386n4699Q1024l5533p3655M7778
14908h0552N0748Q2568L7404j30923j3315L1755N7147m3381L8489L39l9031K4942
14896A6190J3538j3635m3770o0255L9330J6269k896N398M8696M8076J2199n2193
14884B6947J0900m0432L1363O6721n2493p0220J0243O4809L8793K6267n9048m9859
14872C991O3249l9141j17377R322M9224L2483J2752n728J5010L2077L679l9729
14860A9812j5620j0901j4691k9977o616M3467K5696l648m0723J4408k8346l5938
14848h3077P0531N3490K3947j6497N0043P237o1237n8681k422L5974M9104N5825
$$ plain form
14836 124237 171399 154273 98096 87433 88281 41457 -9320 -83403 -95221 -8349 20746 29769
14824 29769 3785 43414 92050 162824 128643 76651 35916 15895 -36622 28014 70429 -16931
14812 -16931 -111910 -187942 -181977 -188884 -185827 -102758 -77129 -74127 -53565 -15739 -68164 -134083
14800 -134083 -145961 -137669 -20076 5603 6492 -48580 -84789 -70098 -77224 -127036 -133384 -92482
14788 -92482 7406 98042 107566 85886 30391 -35855 -83279 -55886 -51492 -65996 -21370 62092
14776 62092 13707 -36684 27958 65502 829 12979 22131 14773 85990 142867 62272 63606
14764 63606 158411 210669 196258 139837 100443 66534 53163 -71725 -78108 -61510 -26446 -19082
14752 -19082 -24269 5745 73710 85723 90536 95892 123186 80656 102999 133050 93649 361
$$ packed form
14836A24237M7162j7126n6177j0663Q48m6824n0777p4083j1818Q6872K9095R023
14824B9769k5984L9629M8636P0774l4181n1992m0735k0021n2517O4636M2415q7360
14812a6931r4979p6032N965o907L057Q3069K5629L002K0562L7826n2425o5919
14800a34083j1878Q292J17593K5679Q89n5072l6209J4691p126m9812o348M0902
14788i2482R9888R0636R524k1680n5495o6246m7424K7393M394j4504M4626Q3462
14776F2092m8385n0391O4642L7544o4673J2150R152p358P1217N6877q0595J334
14764F3606R4805N2258j4411n6421l9394l3909j3371j24888o383J6598L5064P364
14752a9082n187L0014O7965J2013M813N356K7294m2530K2343L0051l9401r3288
$$ plain form
14740 361 12822 -34790 -17874 60107 46812 42333 -7292 -78960 -62193 -50229 -99195 -132582
14728 -132582 -94558 -56076 -114373 -168368 -171112 -167713 -122859 -79627 -97845 -52720 -70245 -95852
14716 -95852 -87866 -93119 -171166 -209615 -99171 -64358 -52994 -39154 -2389 -94441 -95061 -35469
14704 -35469 36709 -13343 -104360 -80806 -23087 28769 66730 4042 -111950 -172818 -129264
14693 -129264 -79371 -32393 -91649 -79932 -32312 12842 -15932 -77738 -120278 -129123 -116522 -75888
14681 -75888 -61681 -99133 -91745 -57603 -31178 -86644 -73793 24356 17119 -3264 -115736 -143902
14669 -143902 -60555 -12995 -2472 58220 52454 -8622 15818 44333 -43758 -53455 -23141 -50732
14657 -50732 -4519 -51065 -79471 48838 108932 -76759 -212984 -253905 -181679 -92487 -69109
$$ packed form
14740C61J2461m7612J6916P7981j3295m479m9625p1668J6767J1964m8966l3387
14728a32582L8024L8482n8297n3995k744L399M4854M3232j8218M5125j7525k5607
14716i5852P986n253p8047l8449J10444L4813J1364J3840L6765r2052o20N9592
14704c5469P2178n0052r1017K3554N7719N1856L7961o2688j15992o0868M3554
14693a29264M9893M6978n9256J1717M7620M5154k8774o1806m2540q845J2601M0634
14681g5888J4207l7452P388L4142K6425n5466J2851R8149p237k0383j12472k8166
14669a43902Q3347M7560J0523O0692n766o1076K4440K8515q8091r697L0314k7591
14657e0732M6213m6546k8406J28309O0094j85691j36225m0921P2226Q9192K3378
$$ plain form
14646 -69109 -97935 -118803 -167195 -187237 -147292 -165279 -173300 -119422 -59736 -183 23750 47978
14634 47978 -10514 -17162 -5866 4991 -34818 -84491 -74666 -49817 -54915 -16830 43795 39852
14622 39852 66167 41226 -23799 -12781 8996 -1700 -97174 -156668 -89672 1971 21978 -73627
14610 -73627 -174344 -132364 -78511 -36892 -35545 -48869 -64471 -92078 -67726 -92838 -69565 -177677
14598 -177677 -236860 -198322 -137060 -120988 -96703 -81787 -44601 -81982 -114773 -81304 9015
14587 9015 78626 77740 85261 91884 53888 -24737 -88447 -95000 -39659 -29962 38593 67452 65195
14574 65195 58312 -27878 -147403 -140115 -25700 -38781 -147013 -115612 -114240 -107777 -20084 -4369
14562 -4369 7799 -42447 -49485 18460 -28002 -97583 -75027 -28508 -80646 -83985 -40114 -27174
$$ packed form
14646f9109k8826k0868m8392k0042L9945j7987q021N3878N9686N9553K3933K4228
14634D7978n8492o648J1296J0857l9809m9673R825K4849n098L8085O0625l943
14622C9852K6315k4941o5025J1018K1777j0696r5474n9494O6996R1643K0007r5605
14610g3627j00717M1980N3853M1619J347j3324j5602k7607K4352k5112K3273j08112
14598a77677n9183L8538O1262J6072K4285J4916L7186l7381l2791L3469R0319
14587I015O9611q86P521O623l7996p8625o3710o553N5341R697O8555K8859k257
14574F5195o883q6190j19525P288J14415j3081j08232L1401J372O463Q7693J5715
14562d369J2168n0246p038O7945m6462o9581K2556M6519n2138l339M3871J2940
$$ plain form
14550 -27174 -45310 -124122 -135585 -171172 -125681 -124646 -161225 -139051 -85978 -118550 -112989 -108565
14538 -108565 -163241 -129880 9123 32463 15207 -26842 -11499 49874 114648 138178 128136
14527 128136 111166 105582 57705 58050 55574 55486 11719 8648 -43412 11067 34727 -28517 -79973
14514 -79973 -49251 -56267 -116616 -151176 -121087 -59720 -72159 -16249 54976 33597 16069 36929
14502 36929 62021 99095 31658 -31207 -18318 -44767 -46670 -83526 -114517 -67933 -19951 -49741
14490 -49741 -51173 -2588 11868 27590 9714 40260 72328 95149 87919 79323 -6474 -50870
14478 -50870 -21228 70149 126621 164466 103610 59301 75609 70864 90527 19066 -96260 -35122
14466 -35122 54833 91535 78770 33006 13891 40449 57621 20847 -7103 4770 15460 13717
$$ packed form
14550b7174j8136p8812j1463l5587M5491J035l6579K2174N3073l2572N561M424
14538a08565n4676L3361J39003K3340j7256m2049J5343O1373O4774K3530j0042
14527A28136j6970n584m7877L45k476q8m3767l071n2060N4479K3660o3244n1456
14514g9973L0722p016o0349l4560L0089O1367j2439N5910P1225k1379j7528K0860
14502C6929K5092L7074o7437o2865J2889k6449j903l6856l0991M6584M7982k9790
14490d9741j432M8585J4456J5722j7876L0546L2068K2821p230q596q5797m4396
14478e0870K9642R1377N6472L7845o0856m4309J6308m745J9663p1461j15326O1138
14466c5122Q9955L6702j2765m5764j9115K6558J7172l6774k7950J1873J0690j743
$$ plain form
14454 13717 45910 80827 52017 -17183 -22955 -37084 -69120 8376 83555 116062 45225 3671
14442 3671 -3757 -50808 -44994 -11810 -44351 -76505 -87489 -81126 -137523 -57858 46005 74300
14430 74300 94280 676 -34498 35653 78351 127364 125007 53858 -18638 6510 -11984 -50137
14418 -50137 -62683 -52174 -10625 -15346 -26220 15911 -16937 -1530 17674 -10433 -77420 -62064
14406 -62064 67672 88047 56316 6049 -3703 4381 21091 17180 -28550 -60225 -113658 -95646
14394 -95646 -82086 -90043 -86780 -76661 -33948 35449 -16966 16712 54895 73844 101141 -4144
14382 -4144 -126536 -122247 -88414 -108818 -46371 -17626 -77255 -36486 20096 -2520 -65682 -76886
14370 -76886 -124947 -106616 -24203 -10808 106899 144306 55376 -82157 -157867 -241266 -182395
$$ packed form
14454A3717L2193L4917k8810o9200n772j4129l2036P7496P5179L2507p0837m1554
14442C671p428m7051N814L3184l2541l2154j0984O363n6397P9665J03863K8295
14430G4300J9980r3604l5174P0151M2698M9013k357p1149p2496K5148j8494l8153
14418e0137j2546J0509M1549m721j0874M2131l2848J5407J9204k8107o6987J5356
14406f2064J29736K0375l1731n0267r752Q084J6710l911m5730l1675n3433J8012
14394i5646J3560p957L263J0119M2713O9397n2415L3678L8183J8949K7297j05285
14382d144j22392M289L3833k0404O2447K8745n9629M0769N6582k2616o3162j1204
14370g6886m8061J8331Q2413J3395J17707L7407q8930j37533p5710q3399N8871
$$ plain form
14359 -182395 -166383 -121362 -109084 -92836 -75219 -40121 -291 28942 19283 -8024 8392 -60831
14347 -60831 -76666 -109404 -147451 -209239 -175196 -139876 -104064 -56155 7620 30180 -48365 -16794
14335 -16794 -23734 56061 164236 182835 79069 -52950 -94590 -127187 -52077 22258 35661
14324 35661 -22197 -66394 -172468 -188889 -184557 -96170 -31930 -24690 -29833 -73610 -112158 -71227
14312 -71227 -86034 -142637 -46529 42120 11174 44236 42418 35394 9990 5933 -3411 -29180
14300 -29180 9291 74210 74116 23091 9597 39783 24756 -43672 -17273 -31840 -85333 -61815
14288 -61815 23431 80298 67582 32041 -15710 -56956 -33362 -49892 -37811 -58443 -65353 -39259
14276 -39259 -30254 -64567 -36664 -41769 -94574 -125965 -98940 -7122 47129 16546 -14223 -56107
$$ packed form
14359a82395J6012M5021J2278J6248J7617L5098L9830K9233r659k7307J6416o9223
14347f0831j5835l2738l8047o1788L4043L5320L5812M7909O3775K2560p8545L1571
14335a6794o940P9795J08175J8599j03766j32019m1640l2597P5110P4335J3403
14324C5661n7858m4197j06074j6421M332Q8387O4240P240n143m3777l8548M0931
14312g1227j4807n6603R6108Q8649l0946L3062j818p024k5404m057r344k5769
14300b9180L8471O4919r4n1025j3494L0186j5027o8428K6399j4567n3493K3518
14288f1815Q5246N6867j2716l5541m7751m1246K3594j6530J2081k0632o910K6094
14276c9259R005l4313K7903n105n2805l1391K7025R1818N4251l0583l0769m1884
$$ plain form
14264 -56107 -27187 -34278 -30838 9839 88198 132998 78410 -3018 -31472 -81682 -131976 -163182
14252 -163182 -201529 -178813 -96915 -94117 -40791 -45525 -127462 -126958 -73494 1763 64877 4458
14240 4458 -12367 17426 -10021 -14685 -49512 -105265 -176608 -152387 -123635 -77880 22328 72505
14228 72505 89539 20189 -29376 -19015 -39844 -49986 -85981 -16190 57828 66478 40563 20673
14216 20673 2230 51058 -41063 -53299 -125238 -162844 -95760 -102087 -142524 -144743 -121545 -172658
14204 -172658 -113508 -87127 34530 95255 75539 84255 19901 -52026 -72346 -24399 -51860
14193 -51860 -156096 -200965 -224636 -165337 -104151 -61932 -23040 26667 -42569 -129860 -109308
14182 -109308 -98463 -82981 -113010 -172676 -176163 -136236 -79358 -104318 -119844 -88906 -174720 -244509
$$ packed form
14264e6107K8920p091L440M0677P8359M4800n4588q1428k8454n0210n0294l1206
14252a63182l8347K2716Q1898K798N3326m734q1937N04N3464P5257O3114o0419
14240D458j6825K9793k7447m664l4827n5753p1343K4221K8752M5755J00208N0177
14228G2505J7034o9350m9565J0361k0829j0142l5995O9791P4018Q650k5915j9890
14216B0673j8443M8828r2121j2236p1939l7606O7084o327m0437k219K3198n1113
14204a72658N9150K6381J21657O0725j9716Q716o4354p1927k0320M7947k7461
14193e1860j04236m4869k3671N9299O1186M2219L8892M9707o9236q7291K0552
14182a09308J0845J5482l0029n9666l487L9927N6878k4960j5526L0938q5814o9789
$$ plain form
14170 -244509 -140128 -65608 -53625 -14646 20801 -64386 -144415 -70209 25390 25975 -14826 -45623
14158 -45623 25033 51248 -51338 -72778 -93274 -16000 9137 -55946 -181807 -185564 -102166
14147 -102166 -109894 -121878 -97775 11404 23701 14002 10523 -44939 -58465 -84136 -24320 52703
14135 52703 48300 49252 77438 77902 66976 16620 -11397 -96090 -78999 -31733 -54356 -58720 -63604
14122 -63604 -85852 -64278 -101389 -96559 -84248 -151481 -112705 -86688 -45059 -9481 44258 -10419
14110 -10419 -89623 -27105 17623 -2866 -27210 -85085 -84425 -55966 -16178 -73718 -41133 -54162
14098 -54162 -14723 16849 97347 43509 -16867 32285 20263 -5902 -28146 -38710 -33175 17426
14086 17426 -57502 -56110 74422 144747 152050 124986 42720 -30407 -71958 -61330 -18871 6357
$$ packed form
14170b44509J04381P4520J1983L8979L5447q5187q0029P4206R5599N85m0801l0797
14158d5623P0656K6215j02586k1440k0496P7274K5137o5083j25861l757Q3398
14147a02166p728j1984K4103J09179J2297r699l479n5462j3526k5671N9816P7023
14135E2703m403R52K8186M64j0926n0356k8017q4693J7091M7266k2623m364m884
14122f3604k2248K1574l7111M830J2311o7233L8776K6017M1629L5578N3739n4677
14110a0419p9204O2518M4728k0489k4344n7875O60K8459L9788n7540L2585j3029
14098e4162L9439L1572Q0498n3838o0376M9152j2022k6165k2244j0564N535N0601
14086A7426p4928J392J30532P0325P303k7064q2266p3127m1551J0628M2459K5228
$$ plain form
14074 6357 -52026 -61392 36661 73420 34269 21085 25294 -53428 -19755 40136 7709 -12799
14062 -12799 40667 56682 158357 65474 -217 -5862 -1392 11880 -17616 -122005 -137536 -85374
14050 -85374 -71653 -41568 -19591 -35990 -22357 -72184 -29119 2325 24106 38743 57113 26465
14038 26465 31586 38117 113880 155805 28543 4409 -8974 25314 67467 34313 -17774 -38787
14026 -38787 -100056 -148958 -151228 -85816 -54777 -31275 14423 9879 -667 -17111 23415 40879
14014 40879 33231 1576 -77350 -42804 -15867 35775 95408 46697 59807 -2322 -24461 -59700
14002 -59700 -116903 -114600 -78790 -67110 -44506 -16193 17374 72897 89996 13569 -120187 -82684
13990 -82684 11346 79969 21372 -88121 13591 25058 -14226 1350 608 -37013 -80994 -63308
$$ packed form
14074F357n8383r366R8053L6759l9151j3184M209p8722L3673N9891l2427k0508
14062a2799N3466J6015J01675r2883o5691n645M470J3272k9496j04389j5531N2162
14050h5374J3721L0085K1977j6399J3633m9827M3065L1444K1781J4637J8370l0648
14038B6465N121O531P5763M1925j27262k4134j3383L4288M2153l3154n2087k1013
14026c8787o1269m8902k270O5412L1039K3502M5698m544j0546j6444M0526J7464
14014D0879p648l1655p8926L4546K6937N1642N9633m8711J3110o2129k2139l5239
14002e9700n7203K303L5810J1680K2604K8313L3567N5523J7099p6427j33756L7503
13990h2684R4030O8623n8597j09493J01712J1467l9284J5576p42l7621m3981J7686
$$ plain form
13978 -63308 -50256 -46809 -9091 -12857 -17497 -15489 -111098 -165218 -178852 -191607 -162743 -132736
13966 -132736 -119869 -89474 -61285 -34269 5441 95709 86210 -26676 -1957 20854 -13082
13955 -13082 -57838 -30041 -57151 -50655 -46041 -29948 -66075 -50898 -68777 -107741 -67692 7771
13943 7771 -7845 -43449 -87027 -66544 -58791 -54852 26904 34151 -4779 55591 58399 77069 103715
13930 103715 111847 77166 69826 54839 -10798 -72936 -142556 -124623 -70161 -23532 12037 48001
13918 48001 81706 96855 134251 149070 94826 73482 -7430 33449 81771 94222 40283 -37532
13906 -37532 -97201 -87447 -7184 -9309 8492 15499 20637 14890 -473 62339 63394 110210 264665
13893 264665 125443 -13686 -37040 -78160 15338 104412 74202 -66341 -139667 -160379 -130422
$$ packed form
13978f3308J3052L447L7718l766m640K008r5609n4120j3634j2755K8864L0007
13966a32736J2867L0395K8189K7016L9710R0268r499j12886K4719K2811l3936
13955a3082m4756K7797k7110O496M614J6093l6127J5177j7879l8964M0049P5463
13943G771j5616l5604m3578K0483P753L939Q1756P247l8930O0370K808J8670K6646
13930A03715Q132l4681p340j4987o5637o2138o9620J7933N4462M6629L5569L5964
13918D8001L3705J5149L7396J4819n4244k1344q0912M0879M8322J2451n3939p7815
13906c7532n9669R754Q0263k125J7801P007N138n747j5363O2812J055M6816J54455
13893B64665j39222j39129k3354m1120R3498Q9074l0210j40543p3326k0712K9957
$$ plain form
13882 -130422 -50863 -14882 -33765 -74017 -129121 -161457 -158118 -118218 -96704 -132719 -114525 -139929
13870 -139929 -142354 -114736 -131813 -118129 -106755 -128654 -144925 -151446 -171294 -177841 -115142 -110580
13858 -110580 -161232 -154148 -174166 -56766 -9741 2853 -43536 -60952 -62094 -87976 -72676 -52666
13846 -52666 -72787 -63712 -2929 71166 110431 21953 -104006 -113426 -103663 -69426 -56032 12855
13834 12855 45794 -53762 -110424 -111527 -121299 -114672 -74173 -32024 -46 64024 32986 4406
13822 4406 -5950 -138684 -153590 -65547 -24391 -60331 -94598 -71654 -61755 -51435 -48748 -102295
13810 -102295 -121842 -126049 -86493 -112333 -90658 -99097 -82552 -86422 -81255 -77485 37021 69858
13798 69858 55679 -12340 -47788 30150 45014 11897 -1786 67973 62358 28438 -37680 -79910
$$ packed form
13882a30422P9559L5981j8883m0252n5104l2336L339L9900K1514l6015J8194k5404
13870a39929k425K7618j7077J3684J1374k1899j6271o521j9848o547O2699M562
13858a10580n0652P084k0018J17400M7025J2594m6389j7416j142k5882J5300K0010
13846e2666k0121R075O0783P4095L9265q8478j25959r420R763L4237J3394O8887
13834A2855L2939r9556n6662j103r772O627M0499M2149L1978O4070l1038k8580
13822D406j0356j32734j4906Q8043M1156l5940l4267K2944R899J0320K687n3547
13810a02295j9547m207L9556k5840K1675q439J6545l870N167L770J14506L2837
13798F9858j4179o8019l5448P7938J4864l3117j3683O9759n615l3920o6118m2230
$$ plain form
13786 -79910 -83383 -79221 -58197 -105966 -38798 91142 113148 47364 21415 -14162 26881 7930
13774 7930 9754 -5973 -90571 -57100 -18707 23964 -76496 -123644 -108216 28223 103270 110940
13762 110940 70688 62935 30971 87463 75287 -29570 -113302 -119848 -126734 -123264 -33609 -21530
13750 -21530 -78672 -70441 -83378 -66861 -100576 -133229 -135854 -117001 -66103 -56628 -71684 -51319
13738 -51319 19190 75288 63539 8395 -17631 -77669 -70581 42560 117098 102282 39176 10950
13726 10950 -42225 -110488 -60294 637 -40534 -54683 -52227 -21420 -65166 -157596 -192736 -146310
13714 -146310 -133299 -59159 -15029 -35086 -64316 -43786 35265 63787 39747 52865 -39544
13703 -39544 -56973 -64262 -119552 -51106 -81739 -164734 -111940 -95050 -89846 -140650 -120633 -89119
$$ packed form
13786g9910l473M162K1024m7769O7168J29940K2006o5784k5949l5577M1043j8951
13774G930J824j5727q4598L3471L8393M2671j00460m7148J5428J36439P5047P670
13762A10940m0252p753l1964N6492j2176j04857q3732o546o886L470Q9655J2079
13750b1530n7142Q231j2937J6517l3715l2653k625J8853N0898R475j5056K0365
13738e1319P0509N6098j1749n5144k6026o0038P088J13141P4538j4816o3106k8226
13726A0950n3175o8263N0194O0931m1171j4149K456L0807m3746r2430l5140M6426
13714a46310J3011P4140M4130k0057k9230K0530P9051K8522k4040J3118r2409
13703c9544j7429p289n5290O8446l0633q2995N2794J6890N204n0804K0017L1514
$$ plain form
13691 -89119 -101415 -100785 -88355 -168463 -192713 -121147 -85583 -75701 -111918 -48605 -52278 -77086
13679 -77086 -62359 -20424 1020 71555 133961 109782 30036 -75748 -68511 27859 78278 4520
13667 4520 22510 12240 -42438 6850 -7524 -89919 -108838 -29619 36130 128664 88198 62493
13655 62493 43721 32725 -135835 -243406 -137117 -17946 -78767 -16173 42052 22235 31569
13644 31569 -10615 -33566 50413 26970 -20472 -2902 24504 5584 -12087 -54719 6950 -69537
13632 -69537 -98857 -129663 -193891 -159408 -79169 -63262 -105120 -42728 49916 59339 34907 12005
13620 12005 -78050 -77167 -38840 10012 13417 -15993 -82230 -118728 -40311 7792 -28542 13719
13608 13719 19818 -49315 -47394 10617 32915 -52985 -11291 6553 21734 66113 18321 -1552
$$ packed form
13691h9119j2296O30J2430q0108k4250P1566L5564R882l6217O3313l673k4808
13679g7086J4727M1935K1444P0535O2406k4179p9746j05784P237R6370N0419p3758
13667D520J7990j0270n4678M9288j4374q2395j8919P9219O5749R2534m0466k5705
13655F2493j8772j0996j68560j07571J06289J19171o0821O2594N8225j9817R334
13644C1569m2184k2951Q3979k3443m7442J7570K7406j8920j7671m2632O1669p6487
13632f9537k9320l0806o4228L4483Q0239J5907m1858O2392R2644R423k4432k2902
13620A2005r0055Q83L8327M8852L405k9410o6237l6498P8417M8103l6334M2261
13608A3719O099o9133J921N8011K2298q5900M1694J7844J5181M4379m7792j9873
$$ plain form
13596 -1552 52426 114256 118835 63245 -13084 -29858 -70633 -103565 -14734 -19045 28233 3787
13584 3787 -124255 -207445 -171197 -80586 21530 1051 -41811 -58930 -40769 2045 40277
13573 40277 26169 -6368 -396 -20159 -48365 -71922 -16982 4927 -67942 -101948 -40393 -12634
13561 -12634 -37375 -28448 -31585 -75525 -84255 -36949 574 31719 20954 -63842 -51969 -34393
13549 -34393 22545 53199 42689 79113 36797 -55679 -78520 -87944 -120211 -112652 -65037 -33490
13537 -33490 35615 75871 61866 -62597 -135970 -121349 -94914 -101020 -130011 -100154 -55871 -24370
13525 -24370 -13483 -48861 -70562 -102871 -57082 -46069 -1923 48164 107538 82526 -16853 -89524
13513 -89524 -117504 -84645 -125971 -135365 -89725 -46827 -11821 -55915 -88291 -77267 -103654 -131525
$$ packed form
13596a552N3978O1830M579n5590p6329j6774m0775l2932Q8831m311M7278k4446
13584C787j28042q3190L6248R0611J02116k0479m2862j7119J8161M2814L8232
13573D0277j4108l2537N972j9763k8206k3557N4940K1909p2869l4006O1555K7759
13561a2634k4741Q927l137m3940q730M7306L7523L1145j0765q4796J1873J7576
13549c4393N6938L0654j0510L6424m2316r2476k2841r424l2267P559M7615L1547
13537c3490O9105M0256j4005j24463p3373J4621K6435o106k8991K9857M4283L1501
13525b4370J0887l5378k1701l2309M5789J1013M4146N0087N9374k5012r9379p2671
13513h9524k7980L2859m1326r394M5640M2898L5006m4094l2376J1024k6387k7871
$$ plain form
13501 -131525 -57127 -37052 -58250 14494 60188 46700 -15636 -44591 -35652 -59677 -55742 -47289
13489 -47289 -76781 -69700 -91127 -157074 -157317 -145855 -55289 -52393 -4800 24441 15458 -20191 -68727
13476 -68727 23558 26909 78623 46712 -26682 -91489 -17873 16822 -18045 -18072 -64099 -112840
13464 -112840 -136261 -153260 -155534 -87659 -34608 -103402 -114255 -91704 -157999 -104296 -63684 -58008
13452 -58008 -86856 -112455 -131015 -55084 58434 180073 88801 -6331 -34953 10681 -34078
13441 -34078 -84886 -87450 -123061 -125292 -104568 -55948 -34619 -22699 -71776 -163792 -147343 -49990
13429 -49990 -42111 -47337 -56753 -134634 -129706 -57444 -45195 -100998 -58170 -27108 -10234 6559
13417 6559 -59707 -100973 -30932 5440 -54238 -84916 -106311 -117383 -114056 -95675 -103834 -30486
$$ packed form
13501a31525P4398K0075k1198P2744M5694j3488o2336k8955Q939k4025L935Q453
13489d7289k9492P081k1427o5947k43J1462R0566K896M7593K9241q983l5649m8536
13476f8727R2285L351N1714l1911p3394o4807P3616L4695l4867k7m6027m8741
13464a12840k3421j6999k274O7875N3051o8794j0853K2551o6295N3703M0612N676
13452e8008k8848k5599j8560P5931J13518J21639r1272r5132k8622M5634m4759
13441c4078n0808k564l5611k231K0724M8620K1329J1920m9077r2016J6449R7353
13429d9990P879n226r416p7881M928P2262J2249n5803M2828L1062J6874J6793
13417F559o6266m1266P0041L6372n9678l0678k1395j1072L327J8381q159P3348
$$ plain form
13405 -30486 -21045 -50611 -12562 -87630 -132208 -143574 -107513 -32424 64754 171333 145860 120925
13393 120925 141833 59279 -62174 -114092 -61238 17884 -11067 -66384 -68968 17329 61797
13382 61797 85426 68012 73992 34744 26893 32348 -5597 -55282 -65207 -14198 32569 17063
13370 17063 17131 37162 20022 1325 -13035 -6332 -43289 -31682 -62037 -96112 -81277 21135
13358 21135 32181 -17234 -8541 -33866 -40216 51010 48446 47236 90301 55374 45367 -3370
13346 -3370 -53897 -117391 -169169 -82536 63216 11690 -34596 -54946 -93574 -99691 -24272 46925
13334 46925 50405 -18994 -27761 -39056 -68240 -17764 -13163 -26448 -50546 -105649 -134449 -189092
13322 -189092 -116474 -71389 -21346 -31074 -53916 -65138 -80425 -68847 -97371 -4852 11819 10377
$$ packed form
13405c0486R441k9566L8049p5068m4578j1366L6061P5089R7178J06579k5473k4935
13393A20925K0908q2554j21453n1918N2854P9122k8951n5317k584Q6297M4468
13382F1797K3629j7414N980l9248p851N455l7945m9685r925N1009M6767j5506
13370A7063O8K0031j7140j8697j4360O703l6957J1607l0355l4075J4835J02412
13358B1135J1046m9415Q693k5325o350R1226k564j210M3065l4927j0007m8737
13346c370n0527o3494n1778Q6633J45752n1526m6286k0350l8628o117P5419P1197
13334D6925L480o9399q767j1295k9184N0476M601j3285k4098n5103k8800n4643
13322a89092P2618M5085N0043r728k2842j1222j5287J1578k8524R2519J6671j442
$$ plain form
13310 10377 1238 -43780 -94384 -56482 -16833 -54853 -22125 76752 56944 10224 2491 30973
13298 30973 3581 -43153 -49067 -129260 -48072 17630 -98951 -192641 -171231 -174080 -126616 -103046
13286 -103046 -82384 -133059 -129722 -84019 -77652 -40753 -32866 -48655 -36424 -163013 -146494 -62000
13274 -62000 -5825 67330 53153 37460 -12598 -57487 -81260 -24720 -3280 14770 -60 20355
13262 20355 85794 154529 129206 -4581 -105265 -119611 -90575 -73267 -53438 -15338 70770
13251 70770 35667 -29893 41376 55903 -43393 -23346 -27806 -16114 -20781 -63520 -139320 -85207
13239 -85207 -56596 -168946 -192237 -115573 -33736 8358 -44307 -106840 -21674 46519 -69831
13228 -69831 -154950 -122017 -52453 -43861 -22135 -76469 -159597 -120417 1783 27416 27620 54411
$$ packed form
13310A0377r139m5018n0604L7902L9649l8020L2728R8877j9808m6720p733K8482
13298C0973k7392m6734n914q0193Q1188O5702j16581r3690K1410k849M7464K3570
13286a03046K0662n0675L337M5703O367L6899P887j5789J2231j26589J6519Q4494
13274f2000N6175P3155j4177j5693n0058m4889k3773N6540K1440J8050j4830K0415
13262B0355O5439O8735k5323j33787j00684j4346K9036J7308J9829L8100Q6108
13251G0770l5103o5560P1269J4527r9296K0047m460J1692m667m2739p5800N4113
13239h5207K8611j12350k3291P6664Q1837M2094n2665o2533Q5166O8193j16350
13228f9831q5119L2933O9564Q592K1726n4334q3128L9180J22200K5633K04K6791
$$ plain form
13216 54411 22978 -13452 -76356 -123269 -73594 -83849 -55915 -2411 -11990 14438 21610 -6315
13204 -6315 9875 43451 70801 123175 -19234 12192 30677 56875 49564 97340 187768 111980
13192 111980 2277 -8392 23357 16386 134482 134624 55938 51727 80016 53949 2576 -24374
13180 -24374 -30631 -74550 -81903 -94018 -68789 -35313 -19347 36450 73603 -6743 -69632 -44786
13168 -44786 -83936 -66472 -20464 -102173 -73560 -19629 -17602 -57218 -97971 -62745 13720 87367
13156 87367 55623 -87896 -145253 -140639 -57728 -9524 -10432 -29927 -64040 -61753 -26496 7380
13144 7380 -5499 -13691 16635 -31542 49973 97181 66805 93336 91724 42254 -29794 -61424
13132 -61424 -20289 53015 7786 -39610 -74978 -58151 -41280 -22442 -93044 -39489 -58577 -35657
$$ packed form
13216E4411l1433l6430o2904m6913M9675j0255K7934N3504r579K6428P172k7925
13204f315J6190L3576K7350N2374j42409L1426J8485K6198p311M7776R0428p5788
13192A11980j09703j0669L1749o971J18096J42p8686m211K8289k6067n1373k6950
13180b4374o257m3919p353j2115K5229L3476J5966N5797L7153q0346o2889K4846
13168d4786l9150J7464M6008q1709K8613N3931K027l9616m0753L5226P6465P3647
13156H7367l1744j43519n7357M614Q2911M8204r08j9495l4113K287L5257L3876
13144G380j2879q192L0326m8177Q1515M7208l0376K6531j612m9470p2048l1630
13132f1424M1135P3304m5229m7396l5368J6827J6871J8838p0602N3555j9088K2920
$$ plain form
13120 -35657 -40901 -111716 -120749 -138232 -18105 77741 36291 -33359 -110468 -98041 -70910 -109876
13108 -109876 -77690 -71890 -72529 -86597 -92807 -65133 -43154 -72335 -26269 -3080 -51827 2864
13096 2864 -12797 -20757 60641 30814 -70414 -174055 -146932 -64761 -61090 -32734 38303 49126
13084 49126 57612 4117 -82943 -164755 -226673 -204070 -172754 -97556 -138717 -167460 -67816 -54629
13072 -54629 -98378 -9578 -34400 -28604 -53247 -120172 -73208 -70537 13404 25378 17783 31069
13060 31069 -23778 -36643 -47882 -9989 43267 75780 97116 71997 99274 59706 -38723 -114032
13048 -114032 -168652 -159050 -68206 -31422 -49043 -33947 -49995 -75708 -64526 -13881 -96667 -154331
13036 -154331 -135699 -80553 -76310 -146652 -95844 -78592 -93559 -19819 46143 33124 132505 179264
$$ packed form
13120c5657n244p0815r033j7483J20127R5846m1450o9650p7109J2427K7131l8966
13108a09876L2186N800o39j4068o210K7674K1979k9181M6066K3189m8747N4691
13096B864j5661p960Q1398k9827j01228j03641K7123Q2171L671K8356P1037J0823
13084D9126Q486n3495q7060q1812o1918K2603L1316P5198m1161k8743R9644J3187
13072e4629m3749Q8800k4822N796k4643o6925M6964K671Q3941J1974p595J3286
13060C1069n4847j2865j1239L7893N3256L2513K1336k5119K7277l9568r8429p5309
13048a14032n4620R602R0844L6784j7621J5096j6048k5713J1182N0645q2786n7664
13036a54331J8632N5146M243p0342N0808J7252j4967P3740O5962j3019R9381M6759
$$ plain form
13024 179264 199661 148089 54770 36326 -49640 -77441 -66590 -119297 -175835 -68535 16570
13013 16570 16213 -11092 24895 52209 87596 121706 31451 -48060 -13125 18122 -43873 -33910
13001 -33910 -64309 -113056 -74872 -126442 -91322 -73995 -44448 -23615 -61135 -95264 -80952 -78617
12989 -78617 -106126 -23844 -22128 -43761 -86577 -102486 -92343 -30301 -22848 44675 56561 -44004
12977 -44004 -82872 -27479 21399 11914 -80690 -76185 -172488 -187592 -169591 -196695 -146698 -54141
12965 -54141 -20465 -72928 -95503 -29636 41737 72132 75871 66229 8124 -11085 10045 4721
12953 4721 -72434 -125358 -101958 2175 59445 88829 59998 75309 18438 -49408 -134380 -168966
12941 -168966 -104796 -66878 -96523 -120487 -57442 -54727 -60936 -74283 -55833 -17818 43955 60738
$$ packed form
13024A79264K0397n1572r3319j8444q5966k7801J0851n2707n6538J07300Q5105
13013A6570l57k7305L5987K7314L5387L4110r0255p9511L4935L1247o1995R963
13001c3910l0399m8747L8184n1570L5120J7327K9547K0833l7520l4129J4312K335
12989g8617k7509Q2282J716k1633m2816j5909J0143O2042P453O7523J1886j00565
12977d4004l8868N5393M8878r485r2604M505r6303j5104J8001k7104M9997R2557
12965e4141L3676n2463k2575O5867P1373L0395L739r642n8105j9209K1130n324
12953D721p7155n2924K3400J04133N7270K9384k8831J5311n6871o7846q4972l4586
12941a68966O4170L7918k9645k3964O3045K715o209j3347J8450L8015O1773J6783
$$ plain form
12929 60738 14081 -15663 8062 14356 3100 50471 22146 22865 34103 10014 14104 -43285
12917 -43285 -27305 32824 22376 -9283 38223 86649 48073 5889 -29847 -60605 -42552 -117418
12905 -117418 -78640 -47804 -118273 -95021 -36587 -8704 35427 60275 73125 -20102 -90236
12894 -90236 -113647 -72148 -56450 17816 57572 84393 44198 34188 -14574 -99217 -113096 -107603
12882 -107603 -31945 53385 71304 14532 25148 -24018 20058 -20415 -18533 40032 25697 43273
12870 43273 -15800 7766 74280 41164 58999 36869 -10172 40337 -15131 -162998 -166420 -201253
12858 -201253 -98901 -52792 -122455 -127319 -161743 -83000 36907 20685 -73708 -139476 -126098
12847 -126098 -145985 -148879 -145787 -109591 -114912 -156805 -208878 -251676 -144380 -103919 -83684 4567
$$ packed form
12929F0738m6657k9744K3725O294j1256M7371k8325P19J1238k4089M090n7389
12917d3285J5980O0129j0448l1659M7506M8426l8576m2184l5736l0758J8053p4866
12905a17418L8778L0836p0469K3252N8434K7883M4131K4848J2850r3227p0134
12894i0236k3411M1499J5698P4266L9756K6821m0195j0010m8762q4643j3879N493
12882a07603P5658Q5330J7919n6772J0616m9166M4076m0473J882N8565j4335J7576
12870D3273n9073K3566O6514l3116J7835k2130m7041N0509n5468j47867l422l4833
12858b01253J02352M6109o9663m864l4424P8743J19907j6222r4393o5768J3378
12847a26098j9887k894L092L6196n321m1893n2073m2798J07296M0461K0235Q8251
$$ plain form
12835 4567 76584 116698 10607 -150693 -169199 -101504 -40631 -58661 57278 128947 113413
12824 113413 128585 90630 120658 62220 14155 33369 -3414 -39987 -24782 -44903 -18920
12813 -18920 62852 16968 -12186 14599 29566 47206 59043 65025 56794 -76250 -114713 -87837
12801 -87837 -35710 -42872 8945 -6103 -77954 -60434 -53561 -15967 2741 92448 57794 -23685
12789 -23685 -95160 -38853 30709 -15913 -45063 -36560 -60462 -24474 -26311 -32938 -89458 -42887
12777 -42887 29981 63427 68881 50749 11672 -37285 -24531 -10486 745 -14329 -70448 -101614
12765 -101614 -87192 -11290 15473 76327 74770 50221 38130 -14755 -36236 -27574 45028 56248
12753 56248 81313 139560 88496 80374 113286 119430 54800 -6048 -15972 -43049 -51475 -32967
$$ packed form
12835D567P2017M0114j06091j61300j8506O7695O0873j8030J15939P1669j5534
12824A13413J5172l7955L0028n8438m8065J9214l6783l6573J5205k0121K5983
12813a8920Q1772m5884k9154K6785J4967J7640J1837N982q231j33044l8463K6876
12801h7837N2127p162N1817j5048p1851J7520O873L7594J8708Q9707l4654q1479
12789b3685p1475N6307O9562m6622k9150Q503k3902L5988j837o627n6520M6571
12777d2887P2868L3446N454j8132l9077m8957J2754J4045J1231j5074n6119l1166
12765a01614J4422P5902K6763O0854j557k4549j2091n2885k1481Q662P2602J1220
12753E6248K5065N8247n1064q122L2912O144o4630o0848r924k7077q426J8508
$$ plain form
12741 -32967 -84255 -120319 -123899 -95228 -55224 -33178 -32354 -24722 -21282 -101170 -53026 -9348 11447
12728 11447 13388 56929 38481 76425 114120 77260 68492 30240 44357 7628 -4546 2509
12716 2509 46396 33491 19911 -5391 -59103 -89782 -32775 -85648 -81255 -85377 -143555 -102057
12704 -102057 -33122 -45760 -20092 6593 45839 76828 104286 -34536 -71813 -84679 -28324
12693 -28324 46178 66286 64124 44315 -19029 -51665 -63300 -46734 2453 -28329 1509 72882
12681 72882 11210 3545 30968 45330 85536 71081 9904 45709 29024 -65470 -116005 -59067
12669 -59067 -14167 -41416 -98294 -8595 24734 1015 41806 74683 18885 -18049 2230 17307
12657 17307 11644 -2752 27019 33603 -11790 41297 8648 17530 24566 12992 16675 45670 43540
$$ packed form
12741c2967n1288l6064l580K8671M0004K2046Q24P632L440p9888M8144M3678K0795
12728A1447J941M3541j8448L7944L7695l6860q768l8252J4117l6729j2174P055
12716B509M3887j2905j3580k5302n3712l0679N7007n2873M393m122n8178M1498
12704a02057O8935j2638K5668K6685L9246L0989K7458j38822l7277j2866N6355
12693b8324P4502K0108k162j9809o3344l2636j1635J6566M9187l0782K9838P1373
12681G2882o1672p665K7423J4362M0206j4455o1177L5805j6685r4494n0535N6938
12669e9067M4900k7249n6878Q9699L3329k3719M0791L2877n5798l6934K0279J5077
12657A7307n663j4396K9771O584m5393N3087l2649Q882P036j1574L683K8995k130
$$ plain form
12644 43540 52576 48979 9041 14926 32793 28845 -29347 -21362 -48920 -145528 -190324 -83104
12632 -83104 -7036 2642 -396 -17085 -28196 -103720 -123958 -88323 -20511 9706 -26374 -104887
12620 -104887 -114273 -35094 27235 90995 160728 52081 -45272 -7160 29414 6453 -57768
$$ packed form
12644D3540R036l597l9938N885J7867l948n8192P985k7558r6608m4796J07220
12632h3104P6068R678l038j6689j1111p5524k0238L5635O7812L0217l6080p8513
12620a04887r386P9179O2329O3760O9733j08647r7353L8112L6574k2961o4221
$$ [...]
##END NTUPLES=NMR SPECTRUM
##END=
