##TITLE=Analysis number 329412
Compound Code cc 69608
Book Reference 486/194
Project Code adrs
Chemist Name simons
##JCAMPDX= 6.0         $$ Bruker NMR JCAMP-DX V2.0
##DATA TYPE= NMR SPECTRUM
##DATA CLASS= NTUPLES
##ORIGIN= Bruker BioSpin GmbH
##OWNER= nmr
$$ XWIN-NMR		Version 3.5
$$ Wed Aug 29 13:18:35 2007 GMT Daylight Time (UT+1h)  MAYBRIDGE\nmr@NMR_250MHZ
##.OBSERVE FREQUENCY= 250.131544655141
##.OBSERVE NUCLEUS= ^1H
##.ACQUISITION MODE= SIMULTANEOUS (DQD)
##.ACQUISITION SCHEME= undefined
##.AVERAGES= 16
##.DIGITISER RES= 18
##SPECTROMETER/DATA SYSTEM= dpx250
##.PULSE SEQUENCE= zg30
##.SOLVENT NAME= CDCl3
##.SHIFT REFERENCE= (INTERNAL, CDCl3, 0, 16.522)
##AUDIT TRAIL= $$ (NUMBER, WHEN, WHO, WHERE, WHAT)
$$ ##TITLE= Audit trail, XWIN-NMR		Version 3.5
$$ ##JCAMPDX= 5.01
$$ ##ORIGIN= Bruker BioSpin GmbH
$$ ##OWNER= nmr
$$ C:\u/data/dgb/nmr/ADRS/1310/pdata/1/auditp.txt
$$ ##AUDIT TRAIL=  $$ (NUMBER, WHEN, WHO, WHERE, WHAT)
(   1,<2007-08-29 13:17:28.60 +100>,<MAYBRIDGE\nmr>,<NMR_250MHZ>,
      <created by zg, POWCHK disabled, PULCHK disabled
       configuration hash MD5:
       76 6E 9A 78 1E 09 19 81 EC 84 63 8F B0 6A 59 2D
       data hash MD5: 64K
       32 50 E9 51 51 AC E6 4A 42 36 8D 6E 02 5A 5B 34>)
(   2,<2007-08-29 13:17:58.19 +100>,<MAYBRIDGE\nmr>,<NMR_250MHZ>,
      <Start of raw data processing
       ef LB = 0.3 FT_mod = 6 PKNL = 1 SI = 32K 
       data hash MD5: 32K
       D9 61 24 3D F9 86 18 D7 42 C1 3A E5 D9 EA FC 1A>)
(   3,<2007-08-29 13:18:03.74 +100>,<MAYBRIDGE\nmr>,<NMR_250MHZ>,
      <apk 
       data hash MD5: 32K
       8C 76 06 38 E5 A9 60 CF 07 D7 0A E2 80 C0 80 77>)
(   4,<2007-08-29 13:18:08.39 +100>,<MAYBRIDGE\nmr>,<NMR_250MHZ>,
      <abs ABSG = 5 
       data hash MD5: 32K
       F2 71 D2 5F 49 0C 97 3D 27 3D D7 90 2A 48 38 FD>)
$$ ##END=
$$ 
$$ hash MD5
$$ 0C 4F 4F 0E A9 AC AB 02 51 91 05 35 53 D3 EA 2B
##$RELAX= 
##$RELAX= 
##$RELAX= 
##$RELAX= 
##$RELAX= 
##$RELAX= 
##$RELAX= 
$$ Bruker specific parameters
$$ --------------------------
##$DU= <C:\u>
##$EXPNO= 1310
##$NAME= <ADRS>
##$PROCNO= 1
##$TYPE= <nmr>
##$USER= <dgb>
##$AMP= (0..31)
100 100 100 100 100 100 100 100 100 100 100 100 100 100 100 100 100 100 
100 100 100 100 100 100 100 100 100 100 100 100 100 100 
##$AQSEQ= 0
##$AQ_mod= 3
##$AUNM= <au_zg>
##$AUTOPOS= <22 >
##$BF1= 250.13
##$BF2= 250.13
##$BF3= 250.13
##$BF4= 250.13
##$BF5= 500.13
##$BF6= 500.13
##$BF7= 500.13
##$BF8= 500.13
##$BYTORDA= 1
##$CFDGTYP= 0
##$CFRGTYP= 5
##$CHEMSTR= <none>
##$CNST= (0..31)
1 1 145 1 1 1 1 1 1 1 1 1 1 1 1 1 1 1 1 1 1 1 1 1 1 1 1 1 1 1 1 1 
##$CPDPRG= <>
##$CPDPRG1= <>
##$CPDPRG2= <>
##$CPDPRG3= <>
##$CPDPRG4= <mlev>
##$CPDPRG5= <mlev>
##$CPDPRG6= <mlev>
##$CPDPRG7= <mlev>
##$CPDPRG8= <mlev>
##$CPDPRGB= <>
##$CPDPRGT= <>
##$D= (0..31)
0 1 0 0 0 0 0 0 0 0.06 0 0 0 0 0 0 0.0002 0 0 0 0 0 0 0 0 0 0 0 0 0 0 
0 
##$DATE= 1188389845
##$DBL= (0..7)
120 120 120 120 120 120 120 120 
##$DBP= (0..7)
150 150 150 150 150 150 150 150 
##$DBP07= 0
##$DBPNAM0= <>
##$DBPNAM1= <>
$$ [...]
##$SUBNAM7= <"">
##$SUBNAM8= <"">
##$SUBNAM9= <"">
##$SW= 20.6930455092707
##$SWIBOX= (0..15)
0 0 3 0 0 0 0 0 0 0 0 0 0 0 0 0 
##$SW_h= 5175.983436853
##$TD= 65536
##$TD0= 1
##$TE= 296.16
##$TE2= 300
##$TE3= 300
##$TEG= 300
##$TL= (0..7)
0 120 120 120 120 120 120 120 
##$TP= (0..7)
150 150 150 150 150 150 150 150 
##$TP07= 0
##$TPNAME0= <>
##$TPNAME1= <>
##$TPNAME2= <>
##$TPNAME3= <>
##$TPNAME4= <>
##$TPNAME5= <>
##$TPNAME6= <>
##$TPNAME7= <>
##$TPOAL= (0..7)
0.5 0.5 0.5 0.5 0.5 0.5 0.5 0.5 
##$TPOFFS= (0..7)
0 0 0 0 0 0 0 0 
##$TUNHIN= 0
##$TUNHOUT= 0
##$TUNXOUT= 0
##$USERA1= <user>
##$USERA2= <user>
##$USERA3= <user>
##$USERA4= <user>
##$USERA5= <user>
##$V9= 5
##$VALIST= <valist>
##$VCLIST= <CCCCCCCCCCCCCCC>
##$VD= 0
##$VDLIST= <DDDDDDDDDDDDDDD>
##$VPLIST= <PPPPPPPPPPPPPPP>
##$VTLIST= <TTTTTTTTTTTTTTT>
##$WBST= 1024
##$WBSW= 4
##$XGAIN= (0..3)
0 0 0 0 
##$XL= 0
##$YL= 0
##$YMAX_a= 466582
##$YMIN_a= -306581
##$ZGOPTNS= <>
##$ZL1= 120
##$ZL2= 120
##$ZL3= 120
##$ZL4= 120
##$ABSF1= 16.522
##$ABSF2= -4.171173
##$ABSG= 5
##$ABSL= 3
##$ALPHA= 0
##$AQORDER= 0
##$ASSFAC= 0
##$ASSFACI= 0
##$ASSFACX= 0
##$ASSWID= 0
##$AUNMP= <proc_1d>
##$AZFE= 0.1
##$AZFW= 0.1
##$BCFW= 0
##$BC_mod= 0
##$BYTORDP= 0
##$COROFFS= 0
##$CY= 12.5
##$DATMOD= 1
##$DC= 0
##$DFILT= <>
##$DTYPP= 0
##$F1P= 14.0000005364418
##$F2P= -0.99999901652339
##$FCOR= 0.5
##$FTSIZE= 32768
##$FT_mod= 6
##$GAMMA= 0
##$GB= 0
##$INTBC= 1
##$INTSCL= 1
##$ISEN= 128
##$LB= 0.3
##$LEV0= 0
##$LPBIN= 0
##$MAXI= 10000
##$MC2= 0
##$MEAN= 0
##$ME_mod= 0
##$MI= 0
##$NCOEF= 0
##$NC_proc= -4
##$NLEV= 6
##$NOISF1= 0
##$NOISF2= 0
##$NSP= 0
##$NTH_PI= 0
##$NZP= 0
##$OFFSET= 16.522
##$PC= 1
##$PHC0= -38.46165
##$PHC1= 9.323029
##$PH_mod= 1
##$PKNL= yes
##$PPARMOD= 0
##$PSCAL= 4
##$PSIGN= 0
##$REVERSE= no
##$SF= 250.13
##$SI= 32768
##$SIGF1= 0
##$SIGF2= 0
##$SINO= 400
##$SIOLD= 32768
##$SREGLST= <1H.CDCl3>
##$SSB= 0
##$STSI= 32768
##$STSR= 0
##$SW_p= 5175.98343685301
##$SYMM= 0
##$S_DEV= 0
##$TDeff= 65536
##$TDoff= 0
##$TI= <Analysis number 999999
Compound Code 99
Book Reference 9
Project Code 9>
##$TILT= no
##$TM1= 0
##$TM2= 0
##$TOPLEV= 0
##$USERP1= <user>
##$USERP2= <user>
##$USERP3= <user>
##$USERP4= <user>
##$USERP5= <user>
##$WDW= 1
##$XDIM= 32768
##$YMAX_p= 387400167
##$YMIN_p= -334114
$$ End of Bruker specific parameters
$$ ---------------------------------
##NTUPLES= NMR SPECTRUM
##VAR_NAME=  FREQUENCY,     SPECTRUM/REAL,   SPECTRUM/IMAG
##SYMBOL=    X,             R,               I
##VAR_TYPE=  INDEPENDENT,   DEPENDENT,       DEPENDENT
##VAR_FORM=  AFFN,          ASDF,            ASDF
##VAR_DIM=   32768,         32768,           32768
##UNITS=     HZ,            ARBITRARY UNITS, ARBITRARY UNITS
##FACTOR=    0.157963299565203, 1,           1
##FIRST=     4132.6476996994, 0,             0
##LAST=      -1043.33573715361, 0,           0
##MIN=       -1043.33573715361, -334114,     0
##MAX=       4132.6476996994, 387400167,     0
$$ Real data points
##PAGE= N=1
##DATA TABLE= (X++(R..R)), XYDATA
$$ [...]
##PAGE= N=2
##DATA TABLE= (X++(I..I)), XYDATA
22267 1708339 1720555 1702505 1684956 1637753 1648012 1700284 1771414 1738797 1797288 1785947 1684357
22256 1684357 1634152 1696857 1774687 1718315 1683395 1665824 1665078 1661382 1715245 1690380 1719129 1694725
22244 1694725 1676892 1719831 1725215 1751640 1781736 1829123 1837217 1848377 1778450 1784971 1771315 1803688
22232 1803688 1786379 1813760 1741487 1676706 1665639 1724915 1637506 1655617 1761071 1840623 1829486
22221 1829486 1844830 1777651 1787772 1757939 1737087 1786089 1832773 1787577 1748877 1737848 1832386
22210 1832386 1850933 1818211 1901687 1886540 1804321 1764834 1762569 1721336 1656076 1636826 1661664
22199 1661664 1672312 1717986 1717956 1578019 1568453 1629887 1641242 1648940 1666881 1658492 1675834 1662608
22187 1662608 1683353 1740106 1712137 1708522 1643711 1515344 1531908 1620581 1697662 1675797 1749103
22176 1749103 1756995 1726615 1757941 1794228 1828183 1802119 1814955 1835462 1839057 1810493 1754843 1760919
22164 1760919 1803906 1841318 1795953 1833983 1825339 1783106 1762386 1795632 1803712 1812869 1807699 1803682
22152 1803682 1770537 1716890 1734070 1813608 1902514 1940838 1909265 1956965 1922290 1820326 1715288
22141 1715288 1710306 1733361 1807393 1835296 1851505 1813771 1775641 1843072 1864322 1790866 1781982 1767092
22129 1767092 1765556 1728426 1769842 1712440 1676828 1726906 1767609 1747908 1774497 1694605 1716989
22118 1716989 1794211 1835458 1862666 1858750 1753667 1711881 1704495 1722795 1720802 1807577 1931326
22107 1931326 1931866 1959472 1972816 1951197 1903295 1857112 1928401 1943776 1937666 1852113 1820643 1829143
22095 1829143 1793523 1838498 1856773 1888124 1873660 1816623 1886924 1867859 1849378 1780656 1656846
22084 1656846 1674975 1774764 1831754 1782500 1822413 1817040 1826266 1828231 1870892 1867983 1783340 1777072
22072 1777072 1850877 1842217 1821329 1833895 1868496 1853602 1864050 1873191 1887110 1884119 1836115 1755818
22060 1755818 1768300 1826735 1776934 1790442 1799538 1864096 1784384 1770872 1737383 1709966 1768665
22049 1768665 1741199 1756839 1745681 1722340 1723918 1709063 1667632 1687733 1786091 1848528 1859733
22038 1859733 1839239 1818955 1856609 1860459 1824535 1854974 1821179 1756428 1715840 1744996 1862236
22027 1862236 1869681 1804138 1776072 1799510 1792321 1771254 1749378 1813477 1826483 1818065 1959589 1999331
22015 1999331 1986245 1918506 1842193 1818266 1891433 1864696 1852518 1864829 1824891 1704391 1622652
22004 1622652 1636812 1658463 1610643 1684482 1707176 1684765 1704894 1786026 1820430 1788466 1816445
21993 1816445 1795109 1741509 1723475 1744511 1834669 1833273 1778151 1699192 1781546 1796193 1807576
21982 1807576 1827732 1799569 1770298 1789971 1809185 1752322 1746915 1784510 1856388 1827469 1762526
21971 1762526 1798834 1831221 1946978 1912583 1875159 2013866 2086657 2046463 1909892 1824380 1833100
21960 1833100 1803795 1850330 1790727 1693649 1676054 1732769 1700240 1775929 1904301 1953089 1890575
21949 1890575 1908590 1967363 1963695 1954841 1950223 1897684 1864965 1882258 1949269 1958505 1886406 1913340
21937 1913340 2009174 2046724 1921261 1892480 1939530 1943324 1961579 1896854 1807275 1740340 1787642
21926 1787642 1848251 1856117 1821961 1815450 1887263 1936088 1953525 1904990 1916667 1860833 1795074 1737618
21914 1737618 1813894 1988807 1988957 1983612 1959915 1870929 1794996 1758378 1699814 1679184 1667127 1738618
21902 1738618 1808808 1831826 1878911 1859051 1892000 1850870 1789553 1785671 1803516 1857503 1860629 1805366
21890 1805366 1859243 1942594 1973307 1948986 1896450 1904752 1951139 1945157 1918255 2011474 2020097 1963808
21878 1963808 1891277 1804282 1821574 1848004 1890481 1910812 1894960 1896397 1920237 1891382 1823302
21867 1823302 1874736 1929942 1906754 1850056 1814480 1722626 1605248 1663604 1843389 1969998 2034524
21856 2034524 2033670 1999110 1957364 1991388 2055480 2063910 1975414 1976122 1960174 1965628 2008686 2025177
21844 2025177 2045746 1988048 1978122 1913776 1845653 1870342 1885809 1915011 1914934 1900452 1860177 1783559
21832 1783559 1863235 2010761 2045142 2048398 1916685 1773728 1816690 1924025 1980643 1946723 1900808
21821 1900808 1955858 2017543 1879888 1829822 1908892 1929325 1894554 1939762 1991080 1975563 1898187
21810 1898187 1857225 1805486 1869097 1799986 1780781 1823881 1963948 1961906 1907086 1842272 1839062
21799 1839062 1942833 1996113 2078505 2087584 1978648 1928610 1940000 1851940 1806224 1849266 1902689
21788 1902689 1841319 1905663 1960575 2019902 1929002 1971812 1929136 1959004 1957601 1961728 2115471
21777 2115471 2123764 1999300 1995232 2009024 1975696 1911793 1933354 1944991 2006533 2059853 2080788
21766 2080788 2019164 2002513 1974535 1921373 1907954 1969119 1955976 1893041 1902755 1855899 1872293
21755 1872293 1863534 1939459 2028170 2065561 1989231 1969084 1911335 1896099 1938060 1974149 1997683
21744 1997683 1912662 1861791 1781930 1784891 1756963 1767267 1865413 1911279 1936844 1998619 2024662
21733 2024662 1960895 1907365 1882748 1929533 1897491 1786323 1843569 1934082 1947823 1865158 1858884
21722 1858884 1918808 1940216 1910416 1956717 1978405 1898478 1894660 1891989 1874136 1846108 1902617 1952430
21710 1952430 1991616 1979017 1915338 1978064 2024772 1982835 1883619 1788502 1832649 2000826 2081280
21699 2081280 1981283 1962860 2014167 2028601 1998561 2009700 1977224 1994517 1985659 1960750 1875075
21688 1875075 1855810 1882743 1868046 1852589 1829808 1884640 1982827 2035529 2070215 2030554 1935660
21677 1935660 1933212 2010842 2119548 2046785 1984382 1927635 1899031 1972256 1971157 1958554 1898385
21666 1898385 1914350 1944836 1931154 1946429 2001329 1984742 1984571 1908695 1845593 1916855 1975808 1976037
21654 1976037 1985366 1933020 1988213 2044819 2010360 2037010 2088844 2031402 2037300 2149576 2141936 2105493
21642 2105493 2071594 2005953 1936530 1888656 1916831 1932670 1903843 1902141 1893300 1923595 1877666 1878354
21630 1878354 1956857 1964259 2034415 2113364 2104943 2050523 2060679 2068862 2015583 2007281 2005021 1986059
21618 1986059 1977547 2054538 2103735 2045651 2055021 2049770 1982048 1987338 2015021 1969731 1937827 2062061
21606 2062061 2107235 2105208 2073161 1958569 1926412 1859575 1805561 1858504 1814245 1770126 1763710
21595 1763710 1786563 1899428 1984128 1964930 1915043 1958991 1930844 1834721 1833842 1905900 1967174
21584 1967174 2012417 1962691 1953951 1922969 2037461 2181466 2248100 2244138 2222881 2160537 2168160
21573 2168160 2177763 2178330 2044562 1985492 1910914 1866630 1874506 1772488 1804373 1914798 1948662
21562 1948662 1925990 1928780 2004185 2082684 2128146 1976783 1899510 1920258 1973898 1936579 1909384
21551 1909384 1919141 1963026 1952490 1915508 1942592 1925685 1963841 1955993 1906778 1904504 1977001 2045782
21539 2045782 2054986 2149383 2090697 2036458 2028745 1954508 1946202 2066427 2130332 2095957 2070051 2026947
21527 2026947 2066890 2123799 2029647 1985996 1987514 2010025 2056945 2115923 2176290 2176222 2118366 2165021
21515 2165021 2154228 2104889 1982855 2018006 2081599 2141299 2121276 2053974 1937060 1874293 1948734
21504 1948734 2038208 2109209 2128882 2176713 2200032 2128888 2078297 2089794 2037008 2074354 2048667
21493 2048667 2089131 2099910 2053565 2093249 2165194 2195484 2160508 2042874 1974189 1978109 2022943
21482 2022943 1928134 1922740 1917319 1815895 1867904 1940511 1937037 1960805 2038136 2028229 2012577 2001433
21470 2001433 2001640 2063750 2077282 2068759 2058250 2046933 2012609 2068006 2118566 2022648 1925050 1895287
21458 1895287 1943277 2002165 1982042 2017174 2098100 2165873 2230530 2199552 2120990 2103626 2087971
21447 2087971 2016175 2025656 2112982 2094418 2079978 2101747 2141226 2179936 2096350 2015334 2031816
21436 2031816 2085244 2115426 2078096 2063439 2126619 2100823 2074513 2045768 2055446 2109401 2198031
21425 2198031 2174518 2130100 2043640 1963350 2046388 2100281 2182407 2164220 2150301 2035955 1970598
21414 1970598 1996230 1986871 2006687 2066988 2063990 2091984 2077466 1994949 1957945 1943676 1946268 1998625
21402 1998625 2136474 2163957 2125418 2127813 2121361 2141605 2110370 2052005 2044465 2059456 2061515 2008153
21390 2008153 1980211 2093009 2096578 2093949 2103652 2145523 2158310 2159667 2182214 2177353 2184015 2170399
21378 2170399 2151792 2081161 2044271 2081421 2101429 2159241 2202826 2172126 2149304 2093525 2050022
21367 2050022 2023073 2046847 2125015 2126336 2079017 2088335 2197902 2211869 2129285 2096922 2167556
21356 2167556 2175910 2200606 2227727 2232469 2106487 2053826 2045177 2040861 2057243 2069190 2107649 2083311
21344 2083311 2065820 2065296 2008225 2100940 2141220 2126034 2137097 2105004 2076415 2151376 2199265 2136147
21332 2136147 2122717 2120256 2206889 2253403 2200553 2131342 2179224 2191295 2128536 2099568 2159504
21321 2159504 2186383 2178428 2203357 2198054 2127603 2097102 2066676 2041033 2039200 2066576 2050865 2075702
21309 2075702 2135743 2144449 2176914 2197146 2200936 2201507 2186886 2281202 2233445 2225281 2148300 2114121
21297 2114121 2097493 2074447 2115859 2148645 2061136 2102274 2217831 2291812 2306442 2240380 2260713
21286 2260713 2272791 2247323 2268211 2197299 2167685 2168659 2204691 2263052 2210768 2150193 2106051 2166168
21274 2166168 2202877 2231161 2264950 2309966 2320984 2293214 2300695 2173633 2200016 2191290 2233909
21263 2233909 2257622 2227514 2255256 2185444 2141946 2151076 2173139 2189493 2172491 2039924 2091950
21252 2091950 2192126 2211809 2236522 2298783 2362033 2310807 2284297 2236525 2213587 2199658 2208891
21241 2208891 2211516 2218961 2135896 2158979 2202611 2215235 2241794 2253302 2221289 2307068 2299339 2189536
21229 2189536 2201976 2199731 2231382 2230163 2225507 2270165 2306674 2302249 2262293 2196006 2262912 2327871
21217 2327871 2292866 2335137 2332104 2267478 2226441 2219244 2191032 2139189 2125901 2103097 2114175 2197607
21205 2197607 2274208 2231481 2237389 2244410 2283759 2290878 2237964 2250225 2285814 2309162 2212791 2157611
21193 2157611 2222561 2358865 2402339 2361079 2330055 2239498 2225879 2139703 2165146 2170926 2134597
21182 2134597 2182631 2143847 2139533 2158965 2186974 2157378 2139202 2154002 2113730 2082009 2125829
21171 2125829 2167084 2157528 2175362 2232203 2240139 2179849 2197681 2296036 2345965 2226265 2175785
21160 2175785 2230784 2332228 2351161 2237842 2204598 2167359 2164831 2161661 2218932 2185585 2195155
21149 2195155 2205444 2204199 2180462 2176105 2202873 2220156 2209573 2246639 2263579 2286298 2270295 2237007
21137 2237007 2268493 2247222 2183317 2131209 2169138 2177365 2200645 2247503 2337995 2292410 2239177
21126 2239177 2306764 2289437 2285125 2273066 2262791 2359953 2376438 2297878 2234624 2188220 2282378
21115 2282378 2310186 2348407 2341111 2197166 2157560 2168220 2203778 2206746 2232342 2194090 2196815 2251670
21103 2251670 2309703 2318923 2325499 2217050 2177008 2184850 2203135 2213393 2246864 2252684 2245595 2272985
21091 2272985 2303261 2219316 2202838 2271187 2287538 2255199 2240491 2233775 2188734 2250238 2270443
21080 2270443 2212933 2256201 2249696 2238421 2283228 2289070 2283046 2299255 2333607 2411487 2422455 2394183
21068 2394183 2352741 2343624 2346076 2438601 2446545 2386524 2319880 2234123 2231231 2278668 2252453 2264548
21056 2264548 2221220 2118199 2142880 2209573 2239418 2236967 2251449 2299887 2379468 2342150 2282284
21045 2282284 2271568 2361992 2394420 2317379 2170599 2163803 2226833 2240661 2224403 2202087 2160784
21034 2160784 2191615 2229902 2278804 2314460 2355648 2382380 2404790 2433020 2383702 2441424 2435903
21023 2435903 2425079 2404046 2367767 2360549 2345763 2260246 2198757 2226719 2254002 2315734 2315555 2310871
21011 2310871 2268668 2248919 2300789 2312198 2211269 2200544 2260978 2316456 2222702 2211414 2261332
21000 2261332 2326095 2332783 2356167 2295307 2266627 2299598 2268772 2314450 2193136 2154010 2251360
20989 2251360 2320257 2289244 2380930 2355635 2282764 2291668 2304762 2338907 2293554 2220210 2242565
20978 2242565 2206955 2183047 2151794 2285199 2376656 2373848 2357691 2344600 2417103 2414665 2489879
20967 2489879 2462087 2390851 2438031 2464176 2479754 2464316 2414005 2501842 2550536 2463600 2394077
20956 2394077 2356156 2372082 2407512 2391772 2351524 2306163 2313421 2257357 2314841 2327085 2296559
20945 2296559 2288830 2325042 2303375 2275968 2332402 2295725 2212845 2365937 2429013 2440221 2433072
20934 2433072 2385633 2372314 2435466 2395463 2357273 2361865 2456907 2523676 2523052 2413216 2343857 2324248
20922 2324248 2261426 2285160 2259586 2311603 2253298 2236265 2329211 2310271 2348513 2354498 2295015
20911 2295015 2278532 2219078 2252611 2348361 2366324 2378647 2359062 2293383 2331830 2417263 2450532
20900 2450532 2510928 2432897 2346578 2325232 2326206 2315098 2322555 2384030 2361169 2359777 2371278 2391300
20888 2391300 2341727 2288385 2385344 2339877 2320480 2302052 2326841 2325479 2324564 2387742 2517077 2490832
20876 2490832 2452524 2407183 2365235 2414327 2501783 2527279 2498122 2485174 2583268 2638003 2638668 2564830
20864 2564830 2521691 2525667 2510958 2486083 2425653 2463931 2580672 2671076 2649284 2619338 2683121
20853 2683121 2603242 2624267 2608031 2473591 2416207 2409269 2346397 2408486 2465898 2483448 2476170
20842 2476170 2433724 2422964 2349870 2322452 2345778 2366093 2373758 2322221 2376753 2499708 2449379
20831 2449379 2388252 2399313 2356815 2333500 2455526 2456227 2382763 2351995 2406089 2404455 2379842 2412998
20819 2412998 2420106 2389626 2408821 2457691 2416283 2452294 2513514 2568009 2570961 2548240 2602933 2551936
20807 2551936 2509879 2515823 2456798 2367169 2415605 2466389 2423124 2363429 2397529 2478318 2518940
20796 2518940 2512634 2582790 2540272 2481161 2471942 2500397 2507911 2483637 2469922 2477735 2482740 2532954
20784 2532954 2493240 2461879 2492406 2554538 2611323 2624492 2571480 2551108 2523658 2525526 2564296
20773 2564296 2579214 2622291 2630053 2645470 2709627 2726210 2598724 2625323 2648264 2622638 2592253
20762 2592253 2577947 2637443 2606552 2507290 2533199 2594694 2577526 2524967 2421037 2481725 2543223
20751 2543223 2567317 2568164 2613886 2644373 2556452 2579784 2588945 2535971 2558478 2605978 2688418 2636642
20739 2636642 2599237 2534417 2523109 2538325 2540409 2456204 2449998 2417185 2403426 2502789 2515396 2578751
20727 2578751 2700703 2705211 2614765 2637038 2616708 2610292 2569204 2533777 2566062 2650284 2664259
20716 2664259 2588119 2561394 2515599 2524036 2558774 2605486 2691029 2726035 2767114 2755862 2627497
20705 2627497 2583637 2561601 2570393 2556094 2534506 2602556 2591441 2554658 2528771 2480820 2520725
20694 2520725 2627156 2690920 2664413 2608276 2549818 2589952 2635124 2555777 2539369 2563962 2588353
20683 2588353 2637764 2605869 2520608 2580123 2610510 2572009 2513103 2511556 2544004 2588538 2602906
20672 2602906 2618315 2610656 2606260 2573662 2631947 2706359 2761778 2741864 2731902 2718572 2714389 2665090
20660 2665090 2669764 2611558 2556450 2651428 2671938 2652720 2563013 2591116 2599533 2564818 2509548 2528663
20648 2528663 2609923 2668348 2561196 2474198 2473109 2498627 2448136 2453230 2513568 2586502 2635621
20637 2635621 2577328 2591586 2653647 2731491 2756394 2732474 2684920 2724849 2686468 2600164 2599221 2621804
20625 2621804 2585216 2549359 2583721 2601905 2609875 2586248 2554957 2570036 2610095 2609603 2671649 2742142
20613 2742142 2707712 2732551 2758295 2744615 2701878 2707033 2705052 2624245 2620889 2652369 2687138 2718327
20601 2718327 2761952 2652265 2605663 2594275 2661351 2708712 2736444 2708500 2707902 2613062 2571879
20590 2571879 2602604 2718042 2763587 2828221 2844466 2688299 2660553 2690498 2693014 2753394 2746909
20579 2746909 2653550 2639062 2713991 2744064 2736892 2685942 2643342 2682603 2743796 2704246 2799843
20568 2799843 2875693 2840216 2770437 2729148 2753387 2788717 2776557 2749200 2759507 2684733 2688148
20557 2688148 2823935 2923613 2913137 2901002 2914567 2873131 2802492 2812627 2864344 2865635 2799232
20546 2799232 2663923 2675599 2806339 2841952 2889006 2903159 2857245 2839447 2858432 2903258 2840935
20535 2840935 2818841 2789363 2745128 2730465 2767369 2723165 2727747 2831254 2839497 2775458 2805055
20524 2805055 2809578 2873055 2885382 2893502 2868858 2882882 2932766 2873272 2820787 2788753 2753631 2741343
20512 2741343 2702516 2707754 2712663 2701896 2631199 2672009 2694210 2716080 2781091 2826441 2867662 2843484
20500 2843484 2799820 2761361 2767096 2740436 2705178 2745294 2696741 2710351 2653230 2649619 2707456 2690735
20488 2690735 2695034 2720669 2666026 2674679 2783249 2877929 2889350 2893628 2967889 3101298 3010557
20477 3010557 2918216 2893612 2873377 2859838 2823079 2812652 2711801 2703844 2748645 2778041 2875712
20466 2875712 2997309 2920614 2793468 2667338 2641103 2652551 2665118 2787076 2859927 2903109
20456 2903109 2907784 2806552 2786550 2744660 2658503 2639766 2658239 2697351 2765735 2843579 2836023
20445 2836023 2787459 2794629 2837529 2858887 2903876 2944683 2911538 2885760 2931855 2917397 2883169
20434 2883169 2856748 2785950 2706957 2691557 2755238 2833250 2867828 2857872 2812713 2826885 2902728
20423 2902728 2930150 2853815 2736399 2712096 2765452 2757884 2752493 2770925 2867287 2947319 2968501
20412 2968501 2932096 2908554 2857887 2836616 2875403 2934318 2900735 2892478 2847890 2886692 2909892
20401 2909892 2961964 3044383 3087137 3006334 2958781 2898098 2890643 2982031 3003892 2997746 2920790 2876364
20389 2876364 2987527 3084098 3064580 3081193 3019492 2896166 2825953 2854079 2954944 2950765 2982364
20378 2982364 3034237 3001356 3018456 3052492 3064332 2993044 2950575 3024605 2948401 2999042 2992978
20367 2992978 2991887 2987630 3037946 3037144 2999348 2990317 3069336 3169155 3153344 3058836 3042765 3098795
20355 3098795 3063789 3021841 3025151 3085270 3127411 3063489 2982358 2956680 2992556 3005188 2976877
20344 2976877 3033492 3084790 3114579 3150615 3097223 2994771 2872630 2861528 2884798 2973856 3043433
20333 3043433 3067150 3113001 3091547 3060691 3022866 3031508 3051386 3017865 2988211 2934149 2883029
20322 2883029 2963137 3048055 3082716 3038393 3010749 3077905 3072763 3055656 3017128 2980729 3041832
20311 3041832 3042727 3116861 3155072 3121903 3074469 3045724 3037381 2962553 2989665 3060350 3080955 3052116
20299 3052116 3107804 3145291 3120594 3049119 3019893 2991325 2939387 2966340 2998156 3071599 3104054
20288 3104054 3117665 3032724 3105412 3166051 3105906 3097803 3049851 3013460 2966634 2915531 2904361
20277 2904361 2958070 3035549 3063021 3033731 3076903 3079102 3053358 3075868 3033884 3053029 3023956
20266 3023956 3029320 3082198 3145455 3115555 3083255 3127696 3139913 3090895 3115672 3157002 3092049
20255 3092049 3100332 3165689 3229105 3196643 3185976 3120277 3116563 3197591 3183104 3178860 3301076 3287650
20243 3287650 3192149 3152360 3142966 3124900 3170488 3190655 3213318 3241275 3295400 3215865 3263549
20232 3263549 3258683 3278693 3302531 3195471 3169883 3170102 3255362 3282526 3230997 3237625 3212116 3110208
20220 3110208 3126478 3211609 3207288 3196491 3210114 3213347 3189232 3212683 3198656 3226419 3271319 3277672
20208 3277672 3357429 3311733 3186569 3186614 3181224 3144938 3106983 3065244 3120533 3119777 3184534 3265854
20196 3265854 3208866 3189525 3169539 3202752 3309529 3289257 3227797 3174445 3077010 3071109 3099571
20185 3099571 3069907 3154453 3170309 3213084 3210555 3251494 3193075 3215269 3241843 3288836 3323639
20174 3323639 3338297 3214162 3273328 3306947 3246866 3170184 3149872 3190829 3246024 3259257 3323008
20163 3323008 3306849 3229351 3266604 3355411 3309220 3229556 3217616 3258493 3288367 3288637 3300150 3269201
20151 3269201 3299795 3335609 3322615 3257026 3315609 3357210 3312731 3368095 3357495 3329856 3290435
20140 3290435 3249522 3266631 3343911 3468954 3429011 3370653 3302655 3321728 3349882 3362440 3312561
20129 3312561 3303375 3443560 3401835 3223253 3292484 3397740 3408142 3265322 3220581 3142983 3200390
20118 3200390 3276614 3249781 3232629 3154494 3142952 3186297 3220222 3239241 3255958 3288662 3329268
20107 3329268 3326764 3320184 3436079 3473197 3417096 3474950 3496672 3465009 3524550 3541767 3467203
20096 3467203 3438663 3428244 3428701 3419423 3416946 3462631 3491787 3534049 3535488 3523283 3459962 3363647
20084 3363647 3421454 3524142 3511527 3496752 3441639 3383837 3283039 3288750 3361148 3400406 3377378
20073 3377378 3375215 3389698 3322344 3283882 3235245 3261240 3323271 3410071 3484085 3410468 3449145
20062 3449145 3518879 3480442 3430216 3452714 3523701 3567276 3651507 3653658 3687057 3584834 3512210
20051 3512210 3483367 3507282 3491347 3476749 3433653 3474940 3544459 3544653 3566702 3595591 3577723 3573588
20039 3573588 3507384 3457552 3549395 3653694 3599931 3517926 3487405 3534084 3493100 3499842 3499469 3469831
20027 3469831 3495706 3558464 3565043 3550827 3540105 3587015 3585467 3560068 3631638 3655869 3665169 3670010
20015 3670010 3622586 3587216 3604557 3596527 3484962 3539582 3627418 3614483 3593906 3611985 3609921
20004 3609921 3658685 3676574 3664151 3748368 3737735 3675384 3611588 3594151 3548861 3616940 3696076
19993 3696076 3718535 3642936 3622778 3611663 3600290 3612390 3611240 3576162 3483884 3540469 3611930
19982 3611930 3642826 3594497 3569391 3614636 3672488 3671409 3672205 3612099 3657533 3696745 3656426 3612217
19970 3612217 3568502 3639529 3664515 3614405 3667909 3681680 3674824 3683345 3670702 3615615 3634592 3708964
19958 3708964 3650343 3581988 3592816 3556468 3562702 3626959 3748771 3711084 3727828 3737070 3755769
19947 3755769 3715546 3722254 3737685 3827620 3882394 3873718 3769446 3706153 3550977 3515489 3565467
19936 3565467 3662678 3667226 3701194 3763781 3843928 3910208 3951274 3983562 3874529 3830999 3838900
19925 3838900 3814235 3766408 3757540 3770871 3758394 3768248 3844353 3931292 3899741 3799284 3759587
19914 3759587 3729611 3702390 3816615 3755346 3643586 3659564 3677362 3667691 3691114 3843406 3928914
19903 3928914 3915912 3824601 3770845 3823776 3850286 3868753 3833557 3835989 3837542 3912159 3939743 3903206
19891 3903206 3953653 3993288 3929459 3881510 3879126 3776008 3786374 3907082 3867190 3865668 3872275
19880 3872275 3806488 3756484 3814628 3841539 3883497 3856969 3821598 3877728 3838880 3815750 3839031
19869 3839031 3917230 4006905 4040447 3983618 3932192 3981169 3996309 3972757 3952939 3902070 3873505
19858 3873505 3954116 4026946 3981846 3853301 3822221 3929328 3930642 3890442 3843975 3869642 3902674
19847 3902674 4097047 4203333 4220789 4209134 4142097 4190830 4160426 4043548 4044361 4053918 4024032
19836 4024032 3977123 4016906 4055186 4080876 4062738 4024091 4099965 4125207 4095540 4199030 4166438
19825 4166438 4135776 4098883 4028961 4004235 3972581 3886857 3928012 4025314 4076427 4114538 4115249 4122293
19813 4122293 4160490 4146497 4154206 4179057 4162789 4108510 4087547 4067015 4106435 4166318 4213902
19802 4213902 4186751 4142488 4097824 4129406 4198989 4199045 4215403 4204703 4179910 4224359 4385568 4344174
19790 4344174 4246379 4147383 4126160 4097899 4134062 4178537 4280967 4350381 4362591 4286957 4240355
19779 4240355 4258344 4213570 4273755 4303519 4254200 4238155 4279618 4310429 4340572 4347958 4329806
19768 4329806 4309579 4356938 4339499 4364657 4445890 4389168 4221355 4215550 4243821 4255484 4248827
19757 4248827 4273294 4209076 4210038 4297031 4351444 4437660 4444434 4411347 4433142 4429993 4442842 4402804
19745 4402804 4359813 4299830 4309805 4393298 4473881 4479154 4459935 4483093 4477143 4519017 4513325 4421239
19733 4421239 4390665 4421252 4527380 4482812 4479615 4539214 4524743 4475259 4536899 4624740 4587389
19722 4587389 4520838 4517251 4570076 4617574 4654836 4669937 4720005 4725988 4611980 4541364 4609965
19711 4609965 4637427 4588243 4513513 4566143 4565357 4544994 4557242 4607375 4654066 4693803 4704539 4642731
19699 4642731 4581835 4524079 4450035 4435228 4402860 4449812 4445836 4477293 4458366 4461196 4376941 4461747
19687 4461747 4594407 4599072 4536585 4573540 4560708 4626343 4667020 4645294 4612669 4569129 4490177
19676 4490177 4572831 4746103 4739467 4726965 4758254 4712590 4694386 4658365 4615166 4626500 4619738
19665 4619738 4679301 4707173 4723519 4784417 4836214 4867371 4914637 4899150 4890798 4864861 4748717
19654 4748717 4781909 4813910 4764820 4775832 4790620 4726584 4684357 4632275 4676545 4615351 4574812
19643 4574812 4556299 4637746 4672431 4636385 4668834 4695077 4796517 4880001 4771023 4732396 4772802
19632 4772802 4802519 4810746 4773980 4766275 4824389 4815619 4769553 4746661 4827357 4824540 4743604 4809167
19620 4809167 4776293 4769089 4809670 4769545 4719203 4779008 4754602 4718970 4816821 4861977 4838409
19609 4838409 4801661 4814988 4933779 4903567 4898468 4876920 4794516 4840067 4937793 4987588 4945809
19598 4945809 4983633 5054629 5068962 5101502 5100351 5039358 5075874 5013068 4941830 4915361 5018985
19587 5018985 5111973 5076587 5055552 5060532 5075454 5026489 5011570 4942269 4947284 5027185 5066726 5107193
19575 5107193 5157111 5171256 5218159 5185161 5200924 5262489 5261449 5178015 5137903 5142037 5115587 5121618
19563 5121618 5158488 5257105 5273507 5194904 5180734 5177703 5138237 5194496 5156950 5222044 5312167
19552 5312167 5327533 5381285 5404384 5335272 5343501 5333323 5260739 5195199 5252658 5301857 5395647
19541 5395647 5437058 5427102 5495307 5551149 5549279 5506842 5447226 5404350 5354083 5320826 5270390 5237356
19529 5237356 5228127 5322844 5384443 5323843 5353974 5407493 5454069 5513288 5544903 5567174 5623435
19518 5623435 5646426 5566483 5594803 5612411 5575446 5629602 5769913 5700426 5560973 5586909 5671079
19507 5671079 5602200 5685739 5728179 5644745 5728102 5832023 5761820 5691360 5704492 5626249 5616571
19496 5616571 5645119 5678662 5722002 5798809 5874233 5934923 5920601 5923773 5872109 5802404 5794700 5891605
19484 5891605 5938442 5955352 5875189 5886670 5889032 5907709 5961874 6067612 6003604 5951890 6010669
19473 6010669 6041399 6027074 5995214 6010284 6022799 6103228 6157590 6228330 6247179 6178171 6209458
19462 6209458 6185632 6155908 6116336 6056854 6039957 6070350 6090376 6179124 6172448 6223506 6330345
19451 6330345 6259446 6197542 6166439 6212261 6227511 6279597 6335978 6309795 6267743 6274364 6275504 6151889
19439 6151889 6176051 6291147 6348796 6350910 6328884 6283924 6276423 6305410 6365105 6409355 6407582 6463840
19427 6463840 6514564 6510820 6452154 6432174 6495913 6492809 6477190 6434048 6473912 6527304 6584104 6516200
19415 6516200 6512182 6552939 6669435 6752465 6709365 6721899 6769021 6826429 6834507 6827195 6786125 6747846
19403 6747846 6685901 6608398 6589226 6663021 6765067 6857356 6879564 6869405 6867435 6986181 7016652
19392 7016652 6935276 6989431 7037475 7012834 7052418 7055331 7073704 7083347 7073556 7006583 6978551 6967643
19380 6967643 7046574 7141068 7167127 7203545 7327182 7396697 7364219 7308584 7305999 7324517 7359433
19369 7359433 7434820 7431384 7379916 7361845 7422586 7424071 7432168 7504311 7566807 7625516 7628511 7625293
19357 7625293 7715889 7767401 7742269 7823513 7909488 7863005 7848004 7814426 7782408 7763121 7764378
19346 7764378 7793721 7850753 7863676 7915291 7944408 7948183 7971950 7934692 7970186 7976405 7962959 7888478
19334 7888478 7814233 7929019 8083718 8132368 8162292 8272905 8288526 8259909 8322536 8429389
19324 8429389 8426491 8459370 8469168 8519228 8601792 8639692 8581867 8602372 8655452 8685231 8694872 8774840
19312 8774840 8801810 8747517 8787103 8899152 8956647 8975936 9073387 9155018 9168712 9187551 9217282
19301 9217282 9172005 9071786 9118280 9232793 9281674 9317431 9318220 9316048 9321050 9400874 9462933 9501529
19289 9501529 9455057 9508522 9537840 9631493 9640572 9660934 9642469 9737252 9824561 9893477 9966974
19278 9966974 9938942 10023729 10054047 10078362 10118735 10214595 10373363 10415188 10450307 10626374 10770714
19267 10770714 10867763 10971086 11004313 10945695 10928253 11048944 11269163 11348364 11457398 11523288
19257 11523288 11642369 11750013 11766496 11715682 11813628 11895643 11912911 11937644 11897060 11963883 12053339
19246 12053339 12202350 12266060 12373266 12366622 12470162 12589704 12657317 12657176 12806821 12988606
19236 12988606 13100266 13254888 13492319 13682002 13828197 13933557 14071443 14256397 14431069
19227 14431069 14578230 14751509 14888248 15098033 15355800 15530238 15725851 15874860 16095266
19218 16095266 16294738 16482980 16724900 16933794 17282171 17696089 18162088 18568762 18866127
19209 18866127 19151357 19652487 20019049 20432975 20933093 21355698 21850677 22455279 23160122
19200 23160122 23886301 24746379 25714316 26838750 28112054 29596199 31284155 33273061
19192 33273061 35609275 38551130 41903874 45107410 46929612 45971337 41453913 34641769
19184 34641769 27518154 20324411 14231436 11781195 12761460 14304856 13557776 9153800
19176 9153800 2439072 -4878126 -12603942 -19165753 -22058607 -21259103 -18306677 -14817900
19168 -14817900 -11563994 -8840081 -6527700 -4426407 -2661799 -1070242 427125 1719074
19160 1719074 2799285 3856045 4871428 5815905 6739712 7709940 8630166 9554129 10555647
19151 10555647 11605892 12718014 13933110 15209932 16609040 18173307 19927855 22012969
19143 22012969 24447990 27250275 30573351 34405153 38343855 41323251 41551912 37631098
19135 37631098 29776102 20475006 11015048 3125017 -160895 1234959 4473927 5684353
19127 5684353 2397941 -5161698 -14416286 -24110969 -32733471 -37301043 -37179614 -34112933
19119 -34112933 -30146577 -26288762 -22876335 -19992462 -17538933 -15305195 -13305703 -11540994
19111 -11540994 -10203784 -9343010 -8997299 -8735076 -8205583 -7479390 -7112222 -7541471 -8880867
19102 -8880867 -10048014 -10321301 -9947396 -9426273 -9259200 -9631296 -10032713 -9960810 -9464092
19093 -9464092 -8681676 -7857899 -7099830 -6455983 -5867385 -5341828 -4928443 -4507029 -4076610
19084 -4076610 -3653545 -3374924 -3153027 -2930908 -2565207 -2193109 -1892940 -1683564 -1469259
19075 -1469259 -1201824 -984317 -775664 -462699 -133812 159987 503501 895500 1336333
19066 1336333 1812337 2345131 2904499 3479804 4028038 4247359 3932304 3272284 2737887
19057 2737887 2230519 1560174 658573 -92472 -595056 -922276 -1401207 -2003808 -2654999
19048 -2654999 -3478882 -4317281 -4887258 -4840268 -4305693 -3694098 -3185922 -2670102 -2140041 -1831924
19038 -1831924 -1586311 -1355550 -1172335 -1041338 -897913 -734125 -535452 -322013 -175875
19029 -175875 -39781 66444 159008 293987 366976 569027 655308 730563 855802 1024977
19019 1024977 1209323 1319321 1510022 1631360 1726063 1838705 1980098 2026512 2134955 2196171
19009 2196171 2167997 2113275 2107258 2252880 2326910 2398409 2515606 2614611 2662682 2690387 2728782
18998 2728782 2815905 2863230 2997075 3142181 3191206 3297270 3358300 3350635 3397314 3460140 3491369
18987 3491369 3476607 3429613 3461589 3539649 3659335 3685211 3769139 3765681 3846306 3918432 4004459
18976 4004459 4091934 4113916 4149283 4125336 4127560 4204982 4371994 4439348 4461083 4554657 4560554
18965 4560554 4443795 4333941 4400628 4534362 4664716 4790281 4918442 5043778 5163804 5247584
18955 5247584 5277005 5348352 5396512 5477824 5409903 5405431 5417688 5467508 5518723 5510301 5588700 5689199
18943 5689199 5743957 5838051 5916068 5873555 5884468 5980577 6071287 6225799 6297472 6330966 6359249
18932 6359249 6298752 6209196 6165466 6126275 6079123 6046925 6048491 6125982 6153405 6200239 6269840
18921 6269840 6321808 6447328 6553424 6635179 6676818 6725019 6722923 6839236 6998774 7082754 7154822
18910 7154822 7090107 7033886 7044338 7095859 7169483 7218342 7218160 7302714 7467400 7615360 7735296
18899 7735296 7863664 8039240 8104613 8253658 8370440 8357631 8353619 8293770 8308869 8443177
18889 8443177 8642832 8796927 8764316 8753805 8928090 9111623 9131600 9124357 9053682 9034637 9074349
18878 9074349 9186231 9421703 9558730 9680251 9743068 9769356 9777538 9663681 9660067 9681074 9653346
18867 9653346 9638270 9732526 9875436 10060512 10317478 10375492 10422280 10626517 10818759 10910477
18857 10910477 11011652 11145243 11256692 11414718 11646884 11766331 11828874 11934228 12098952
18848 12098952 12322839 12511300 12639858 12801687 12926772 13095085 13254538 13364991 13501528
18839 13501528 13659900 13808477 13952809 14029957 14211682 14456844 14710709 14956803 15186081
18830 15186081 15386390 15651090 15899783 16225383 16542455 16876955 17128187 17342097 17611573
18821 17611573 17869187 18174364 18525121 18983780 19362697 19938392 20456920 20855797 21343684
18812 21343684 21898633 22603127 23380696 24291561 25400807 26683609 28177831 29950856 31889610
18803 31889610 33550069 34245106 33136758 30253665 26454945 22679255 19144138 16794158
18795 16794158 16732559 18646426 21521588 23836885 24130363 21871950 17139222 11621629
18787 11621629 6170617 1333418 -1031648 -844794 891976 3069773 5306346 7326884
18779 7326884 9124540 10753986 12223755 13500040 14743661 15856463 16941216 18086575
18771 18086575 19232692 20458571 21655752 22919102 24189540 25271779 26145206 27257520
18763 27257520 28838754 30727291 32910465 35478756 38347565 41711047 45696876 50467651
18755 50467651 55588162 60104122 61643090 58050066 48775390 37077286 25798054 14908611
18747 14908611 6417620 3794399 7233010 14056953 19939729 21358179 16604961 6098244
18739 6098244 -6374011 -18478515 -28910235 -34697220 -35065485 -31637409 -26568928 -21481885
18731 -21481885 -16897815 -12775241 -9163555 -5893231 -2700177 447042 3604398 6787089
18723 6787089 9981445 12179745 11485647 8171847 6548436 8669340 12734372 16388917
18715 16388917 17268148 14990530 13215081 12049381 7586478 -981393 -8777019 -11540731
18707 -11540731 -9256316 -4187959 1412704 5301805 5059750 -954601 -11223723 -20155629
18699 -20155629 -24678612 -25273413 -23744944 -21807450 -20291341 -18838913 -17088281 -14948755
18691 -14948755 -12452984 -9778379 -7239429 -5037629 -3688320 -4028209 -5630211 -6373308
18683 -6373308 -5289044 -3359521 -1262967 665824 1627248 1107017 -37975 7865 1700201
18674 1700201 4250659 7328189 10715989 14481654 18757170 23215295 26789628 27080015
18666 27080015 21845806 10761010 -1364831 -9017726 -11543624 -10722605 -8301923 -5582885
18658 -5582885 -5066938 -9289039 -18558632 -28776977 -35564788 -38711200 -39752812 -39342076
18650 -39342076 -37530983 -34792509 -31849228 -29023686 -26498041 -24220146 -22220098 -20539886
18642 -20539886 -19013055 -17549712 -16296136 -15267634 -14470750 -14063425 -13686728 -12950566 -12079502
18633 -12079502 -11121624 -10238592 -9539086 -9056752 -8698440 -8204508 -7337531 -6343665 -5286861
18624 -5286861 -4079180 -2497537 -786171 1070325 3113565 4825436 4897440 2047954
18616 2047954 -3756067 -9987875 -13521153 -13827582 -11936308 -9248984 -7092567 -6658105
18608 -6658105 -8988565 -14053144 -19778597 -23282366 -23982904 -22799913 -21129760 -19473784
18600 -19473784 -18052258 -16775553 -15805387 -14997591 -14192851 -13527764 -12929324 -12323336 -11790124
18591 -11790124 -11386975 -11116223 -10870483 -10570452 -10180859 -9788980 -9442660 -9157885 -8844399
18582 -8844399 -8599055 -8309770 -8020859 -7853331 -7684135 -7509388 -7367336 -7190093 -7088120
18573 -7088120 -6903885 -6580680 -6222768 -5979954 -5826122 -5668735 -5497459 -5246438 -5011922
18564 -5011922 -4827070 -4696177 -4458876 -4331606 -4239865 -3985916 -3720084 -3567867 -3469509 -3376521
18554 -3376521 -3168379 -2986087 -2825973 -2715233 -2574815 -2425207 -2146732 -2081782 -2027170 -1992120
18544 -1992120 -1785343 -1518902 -1455851 -1319693 -1127415 -995127 -832538 -627366 -575878 -569624
18534 -569624 -600445 -608463 -476979 -359845 -238522 -10470 296619 556872 827251 1010054
18524 1010054 1117553 1243898 1402798 1538277 1710167 2053312 2402501 2782114 3234851
18515 3234851 3706456 4137609 4531031 4890118 4940933 4482428 3431412 2169643 1367180
18506 1367180 1050999 1160601 1734206 2355629 2817186 3179065 3554219 4041267 4567036
18497 4567036 5076427 5624313 6172442 6766919 7224673 7412295 7544942 7789225 8019278
18488 8019278 7938888 7634188 7639903 7981697 8286338 8548055 9176024 10118475 11151797 12343221
18478 12343221 13725440 15295693 16783961 18266493 19277946 20148154 21924049 24680514
18470 24680514 26945936 26723953 21910270 12477057 2280708 -3653810 -4429720 -1711350
18462 -1711350 2358505 6306380 9479005 10605448 8189654 1677027 -8105390 -16587583
18454 -16587583 -20912809 -21498394 -19904509 -17607139 -15195486 -12819412 -10590508 -8663059
18446 -8663059 -6929725 -5406313 -4194509 -3250278 -2404382 -1589816 -1009165 -663541 3175
18437 3175 963384 1887914 2754061 3924240 5275724 6705815 8508580 10415077 12512984
18428 12512984 14958724 17689176 20773309 23760985 25489478 24100867 18872190 12516363
18420 12516363 8982752 8145858 6751427 2224018 -4157634 -8221060 -8628811 -7637242
18412 -7637242 -8113147 -11015614 -14175767 -15759210 -17191043 -20673793 -27119247 -33167264
18404 -33167264 -35907823 -35787223 -33804352 -31280733 -28862659 -26596519 -24593418 -22760295
18396 -22760295 -21065244 -19519649 -18265584 -17115555 -16037804 -15112335 -14206641 -13380951
18388 -13380951 -12506748 -11761028 -11031722 -10373386 -9642352 -8836423 -7920940 -6864099 -5729334
18379 -5729334 -4513501 -3172983 -1626270 152494 1917708 3153704 2491179 -1269140
18371 -1269140 -7759361 -13807609 -16591137 -16277170 -14312130 -11839689 -9341736 -7311937
18363 -7311937 -6861968 -9164880 -14457685 -20663855 -24660874 -25704567 -24730833 -23039779
18355 -23039779 -21408384 -20096506 -18914165 -17857402 -16881606 -16209948 -15628457 -14978784 -14405168
18346 -14405168 -14026020 -13760511 -13362876 -13091498 -12865456 -12576833 -12283684 -11987013 -11761876
18337 -11761876 -11524088 -11190217 -10919488 -10735352 -10615700 -10568138 -10513780 -10390416 -10131242 -9889046
18327 -9889046 -9720007 -9610255 -9545407 -9478990 -9268718 -8953449 -8798642 -8694272 -8613650 -8588755
18317 -8588755 -8501543 -8364462 -8161168 -8053524 -7993924 -7894165 -7792277 -7642957 -7473311 -7329841
18307 -7329841 -7313085 -7389216 -7353954 -7138000 -6913652 -6823398 -6756999 -6676596 -6655429 -6597281 -6424864
18296 -6424864 -6325583 -6247877 -6187028 -6183440 -6245235 -6218232 -6170049 -6072741 -5889105 -5767747 -5759719
18285 -5759719 -5600884 -5468862 -5446485 -5335165 -5222147 -5118158 -4965777 -4975877 -4964806 -4999205
18275 -4999205 -5097561 -5108560 -4993604 -4963431 -5004702 -4882018 -4864679 -4877988 -4887652 -4841731 -4830065
18264 -4830065 -4841093 -4850102 -4828199 -4753743 -4709262 -4625108 -4543788 -4452634 -4396659 -4287522 -4175068
18253 -4175068 -4102898 -4072668 -4122714 -4093954 -4059640 -3975896 -3811054 -3787106 -3782928 -3694049 -3614966
18242 -3614966 -3540407 -3435153 -3315357 -3186840 -3068813 -3117511 -3190796 -3116383 -3110822 -3120008 -3082146
18231 -3082146 -2939191 -2834520 -2747828 -2764171 -2773698 -2706977 -2595644 -2625708 -2679355 -2799237 -2907620
18220 -2907620 -2974638 -3062409 -2953651 -2956076 -3020779 -3005860 -2911957 -2801053 -2590191 -2370967 -2286438
18209 -2286438 -2283367 -2273323 -2241571 -2158386 -2092187 -1980093 -1855662 -1711138 -1617233 -1533139 -1434762
18198 -1434762 -1331626 -1258736 -1314494 -1326360 -1215773 -1207949 -1185293 -1125034 -1147614 -1116166 -1013235
18187 -1013235 -922825 -803116 -755067 -664019 -538066 -416176 -356597 -340215 -249267 -88363
18177 -88363 1207 80460 53504 175904 383830 523082 624972 790868 869674 900232 953541
18166 953541 1017715 1148856 1271677 1363742 1554878 1718610 1873406 2046657 2204902 2399059
18156 2399059 2519766 2654592 2872652 3037312 3196144 3370168 3595130 3816856 4002822
18147 4002822 4217171 4447782 4578962 4686137 4927202 5252050 5615308 5860684 6160408
18138 6160408 6501881 6837858 7122504 7535027 7925235 8414084 8992062 9669425 10353067
18129 10353067 11083947 11898952 12726353 13673054 14666886 15737143 16929100 18280416 19965276
18120 19965276 21976162 24179663 26732766 29794093 33518007 38056043 43760260 51126965
18112 51126965 60953180 73918622 87954961 92323633 55223907 -36401119 -97151272
18105 -97151272 -99402927 -84704944 -71237458 -60778890 -52788082 -46707075 -41904054 -37995758
18097 -37995758 -34858258 -32175995 -29907631 -28013111 -26367790 -24972431 -23710530 -22508866
18089 -22508866 -21470589 -20536483 -19720206 -18944416 -18306236 -17686078 -17109000 -16591386 -16137052
18080 -16137052 -15628920 -15207888 -14831973 -14394546 -13966358 -13604906 -13273249 -12983246 -12693013
18071 -12693013 -12351967 -12082145 -11826891 -11582642 -11279766 -11137218 -11016276 -10831559 -10675718
18062 -10675718 -10510896 -10264980 -10142667 -10061409 -9963685 -9789354 -9701756 -9634539 -9510845 -9401584
18052 -9401584 -9334859 -9172909 -8934287 -8781779 -8725362 -8652966 -8642492 -8542843 -8374872 -8270216
18042 -8270216 -8227774 -8152645 -8038527 -7937540 -7848966 -7828747 -7661535 -7550235 -7472275 -7473314 -7502885
18031 -7502885 -7396575 -7329442 -7242996 -7121502 -7151054 -7109070 -7009814 -6917767 -6826145 -6683503 -6591177
18020 -6591177 -6575372 -6525931 -6408119 -6240253 -6289063 -6418222 -6321709 -6380030 -6453476 -6387289 -6307362
18009 -6307362 -6192469 -6205466 -6188161 -6124833 -6028615 -5903651 -5800386 -5728249 -5711517 -5715702 -5667861
17998 -5667861 -5729835 -5705748 -5593642 -5495543 -5469354 -5376478 -5348400 -5382008 -5412890 -5472394 -5380575
17987 -5380575 -5345363 -5377569 -5368603 -5297181 -5194112 -5176253 -5124605 -5065253 -5012235 -4980132 -4881332
17976 -4881332 -4939053 -5026455 -4987503 -4878989 -4818442 -4928163 -4907341 -4849168 -4795581 -4682918 -4654406
17965 -4654406 -4714268 -4719494 -4636962 -4568876 -4544459 -4519686 -4488798 -4477081 -4483015 -4503933 -4469495 -4415386
17953 -4415386 -4315437 -4225683 -4200191 -4213080 -4254728 -4212439 -4172982 -4247090 -4198151 -4163009 -4276707
17942 -4276707 -4373652 -4422561 -4412843 -4412303 -4285310 -4150992 -4129926 -4182640 -4191029 -4165028 -4194365 -4094222
17930 -4094222 -4076696 -4155969 -4176914 -4077966 -3970993 -4009857 -4029926 -3936091 -3854760 -3832652 -3884618
17919 -3884618 -3856550 -3869116 -3969494 -3930635 -3920593 -3864377 -3818047 -3775369 -3748148 -3734596 -3660052
17908 -3660052 -3591620 -3654859 -3568967 -3517847 -3534654 -3546777 -3506018 -3529245 -3572819 -3623890 -3585718
17897 -3585718 -3551211 -3677970 -3717994 -3626485 -3566129 -3601312 -3622079 -3636174 -3632778 -3533211 -3496962
17886 -3496962 -3429906 -3518068 -3598044 -3521660 -3402855 -3358853 -3358113 -3459828 -3543686 -3576772 -3552043
17875 -3552043 -3484390 -3388045 -3362045 -3338002 -3292106 -3382740 -3331871 -3237461 -3249047 -3400885 -3331226
17864 -3331226 -3299950 -3218021 -3126834 -3153744 -3205658 -3256353 -3330283 -3277085 -3225331 -3209947 -3131569
17853 -3131569 -3131785 -3062269 -3084878 -3168251 -3117842 -3059817 -3135346 -3172173 -3157752 -3079534 -3109671 -3117800
17841 -3117800 -3074876 -3132452 -3220837 -3223164 -3169366 -3097275 -3075444 -3003341 -3029657 -3002254 -3013431
17830 -3013431 -3007621 -3043010 -2948841 -2982110 -2977653 -2950631 -3033289 -3070632 -3019091 -2962210 -2971679 -2966487
17818 -2966487 -2947501 -2887990 -2774851 -2780937 -2763577 -2756994 -2779205 -2732632 -2705147 -2710648 -2752916 -2853319
17806 -2853319 -2838027 -2872120 -2890125 -2865464 -2891862 -2826158 -2759014 -2712851 -2702290 -2744792 -2638506
17795 -2638506 -2624038 -2659732 -2598892 -2591275 -2624200 -2627646 -2639824 -2646814 -2614354 -2522772 -2590609 -2587405
17783 -2587405 -2639599 -2665801 -2585118 -2580669 -2554226 -2519671 -2478117 -2478912 -2498026 -2535689 -2527627 -2416068
17771 -2416068 -2383190 -2418948 -2380035 -2387616 -2493236 -2565948 -2476045 -2357379 -2275880 -2270746 -2311825
17760 -2311825 -2245495 -2196970 -2328145 -2395693 -2363938 -2369460 -2370234 -2303932 -2294970 -2260059 -2264939 -2269396
17748 -2269396 -2233994 -2212496 -2242581 -2200888 -2198740 -2300587 -2323867 -2339840 -2342295 -2289798 -2217482
17737 -2217482 -2218437 -2251131 -2216140 -2191369 -2132334 -2103096 -2125667 -2180580 -2132931 -2085548 -2062177 -2035859
17725 -2035859 -2138789 -2118330 -2128215 -2148468 -2162963 -2138333 -2087819 -2119423 -2159481 -2125759 -2136922
17714 -2136922 -2070864 -2038851 -2047765 -2013802 -1987265 -2003668 -2033175 -2007549 -1999034 -1960327 -1907331 -1882550
17702 -1882550 -1896081 -1957885 -2002614 -2037754 -2113790 -2145162 -2189608 -2163823 -2072743 -2061618 -2040670
17691 -2040670 -2046259 -2012228 -2015700 -1988258 -1945896 -1936158 -1846217 -1866541 -2008908 -2017635 -2043870 -1969344
17679 -1969344 -1927615 -1910408 -1967257 -1964439 -1904405 -1865308 -1898736 -1880582 -1890609 -1940671 -1890233
17668 -1890233 -1837469 -1839115 -1834972 -1855548 -1885131 -1904959 -1890685 -1950343 -1880784 -1767719 -1759243 -1827728
17656 -1827728 -1909510 -1886261 -1916495 -1965417 -2024877 -2069522 -2044677 -1885463 -1761381 -1784521 -1838827
17645 -1838827 -1802809 -1822239 -1873584 -1807819 -1734064 -1688752 -1704493 -1767599 -1756459 -1740516 -1780411
17634 -1780411 -1761109 -1762611 -1728967 -1680200 -1691720 -1732450 -1783929 -1681794 -1592583 -1575643 -1591049
17623 -1591049 -1567393 -1620549 -1695157 -1621287 -1560852 -1576351 -1586130 -1557978 -1585900 -1614194 -1593648
17612 -1593648 -1575693 -1587094 -1606706 -1630414 -1541200 -1577608 -1563576 -1640778 -1688307 -1658183 -1626714
17601 -1626714 -1569884 -1526689 -1487198 -1449434 -1469342 -1513100 -1536816 -1621246 -1659832 -1590721 -1546518
17590 -1546518 -1554488 -1560697 -1633579 -1675653 -1652923 -1659163 -1698489 -1673083 -1638919 -1580632 -1570377 -1556466
17578 -1556466 -1576173 -1532555 -1481185 -1497121 -1556548 -1592166 -1550194 -1524735 -1481249 -1445631 -1471795
17567 -1471795 -1512889 -1469889 -1397925 -1380526 -1336667 -1317874 -1314937 -1294505 -1288574 -1389551 -1441762
17556 -1441762 -1440980 -1464187 -1503678 -1456984 -1381286 -1365021 -1328536 -1294663 -1343784 -1392832 -1378662 -1325748
17544 -1325748 -1308672 -1289612 -1249051 -1220161 -1169125 -1206442 -1374682 -1462286 -1456835 -1371959 -1247606
17533 -1247606 -1185732 -1272519 -1311002 -1294088 -1278199 -1268009 -1266278 -1339973 -1338940 -1316288 -1363039 -1324852
17521 -1324852 -1316990 -1364706 -1331121 -1271242 -1224003 -1167732 -1193242 -1142875 -1163952 -1316081 -1264723
17510 -1264723 -1186462 -1163903 -1257330 -1253453 -1261795 -1247603 -1267654 -1295573 -1240961 -1229087 -1172227 -1134032
17498 -1134032 -1207731 -1211069 -1199835 -1089042 -1045447 -1065020 -1061413 -1028502 -1004929 -1095015 -1141041
17487 -1141041 -1182327 -1240423 -1302087 -1265616 -1246798 -1221242 -1113867 -1082527 -1054179 -1094956 -1172445
17476 -1172445 -1184339 -1097107 -991209 -1044345 -1165345 -1192129 -1105316 -1053151 -1034949 -1004581 -937650
17465 -937650 -930461 -871889 -944447 -921843 -872233 -987353 -1062091 -902888 -814795 -782614 -842796
17454 -842796 -913839 -951528 -972352 -972759 -1009731 -991092 -1007404 -937462 -805559 -741040 -587148
17443 -587148 -490164 -515027 -958418 -1405410 -1460218 -1371546 -1346506 -1287247 -1251393 -1263686 -1238467
17432 -1238467 -1253631 -1208613 -1189727 -1207347 -1145362 -1056054 -1073966 -1090393 -1124950 -1078111 -988320
17421 -988320 -882070 -935787 -938638 -851956 -854298 -888555 -987247 -1069675 -1105944 -1113762 -1086130 -1097423
17409 -1097423 -1014077 -1001134 -1074974 -1143197 -1029017 -935609 -953253 -977704 -928492 -921952 -1020855
17398 -1020855 -1050600 -1052129 -1043439 -1008491 -905481 -873964 -768444 -783748 -844901 -804328 -920280
17387 -920280 -999103 -1034721 -902992 -912557 -897245 -907013 -944208 -960286 -929805 -907682 -871130 -870275
17375 -870275 -816989 -811474 -813295 -780154 -801080 -847708 -916918 -873365 -758223 -748997 -798396 -789465
17363 -789465 -763264 -762244 -800086 -764125 -765646 -818777 -814476 -827573 -837701 -879350 -763596 -649194
17351 -649194 -704828 -759385 -809131 -741653 -660416 -672054 -703995 -741794 -789004 -810536 -782193
17340 -782193 -678395 -642843 -610033 -720105 -767115 -798433 -786056 -775707 -783243 -682997 -657048
17329 -657048 -672946 -744311 -749627 -662948 -549374 -518589 -584983 -630161 -647521 -762959 -861563
17318 -861563 -759221 -668116 -675408 -658392 -765825 -807995 -706661 -690871 -771653 -771851 -677447
17307 -677447 -624625 -624101 -600880 -622640 -578059 -602330 -551350 -554865 -545758 -516192 -563126 -549639
17295 -549639 -532187 -610651 -692808 -726133 -733360 -701163 -674902 -678500 -687237 -774181 -690925 -670039
17283 -670039 -627523 -662379 -684014 -715849 -740882 -705252 -574766 -470130 -545426 -604076 -623302
17272 -623302 -557840 -480697 -523353 -556595 -494060 -510404 -528137 -597156 -657483 -703340 -647127
17261 -647127 -527868 -486755 -532692 -553482 -588486 -601444 -566645 -627223 -633318 -664974 -667193 -670876
17249 -670876 -564516 -551281 -595867 -559490 -562084 -605423 -523891 -498133 -447453 -488331 -486358 -483666
17237 -483666 -474742 -461609 -482282 -500594 -451948 -441485 -500001 -531998 -460104 -356009 -429244
17226 -429244 -465260 -412729 -413891 -399270 -337814 -308900 -394982 -361395 -323253 -372397 -349723 -344003
17214 -344003 -433207 -431381 -369701 -366530 -459108 -511778 -528370 -580627 -584259 -526304 -477783 -464432
17202 -464432 -547076 -596323 -593190 -511984 -486701 -563316 -464194 -454742 -458869 -465954 -526944 -486272
17190 -486272 -430653 -383087 -464032 -456589 -444600 -429583 -431377 -428788 -463537 -454119 -442513 -445765
17178 -445765 -435099 -370487 -336854 -346820 -427781 -430383 -462391 -423505 -358654 -307906 -271509 -244787
17166 -244787 -202972 -284282 -319068 -269117 -258574 -247560 -203369 -176751 -203895 -226850 -323137
17155 -323137 -330000 -283633 -227122 -254432 -298984 -243704 -289281 -323886 -297400 -260006 -326712 -424540
17143 -424540 -402147 -360543 -308130 -319496 -320263 -335487 -347242 -266556 -145304 -131779 -206774 -313354
17131 -313354 -382846 -450989 -438793 -452271 -472161 -460297 -405930 -377021 -359760 -413276 -451944
17120 -451944 -383225 -413675 -408518 -371181 -304596 -262335 -268399 -297853 -306575 -298552 -235944 -256677
17108 -256677 -303456 -339547 -335115 -344914 -338406 -268162 -161790 -201288 -191932 -229093 -282688 -364724
17096 -364724 -308327 -156090 -77632 -202116 -311507 -350424 -294706 -252088 -261533 -178945 -141569
17085 -141569 -150061 -243402 -231170 -213476 -237444 -178902 -225820 -275619 -235090 -263880 -275054 -253772
17073 -253772 -257658 -275924 -266273 -108142 -63150 -150233 -138938 -61710 -72021 -105996 -97327 -137168
17061 -137168 -206331 -204202 -227328 -198580 -209256 -144803 -100210 -137691 -105203 -7259 -29042 -125400
17049 -125400 -168523 -257813 -217722 -178345 -151749 -186831 -188398 -234897 -217468 -130155 -140381 -128199
17037 -128199 -75191 -79951 -129837 -127671 -90206 -161387 -142494 -114987 -23476 -23186 -20130 -28695 -50146
17024 -50146 -174314 -203799 -177120 -142414 -118214 -70526 -40440 -78955 -35786 2109 -27843
17013 -27843 -115851 -136924 -158160 -145007 -94608 -82324 -49460 -24975 -68458 -37680 20408 -43954
17001 -43954 -90848 -115855 -70321 -5947 -69119 -115947 -107059 -21528 75311 125308 160113 61095
16989 61095 -47510 -21526 15497 -79833 -150489 -257600 -260648 -254255 -193783 -144206 -107415 -84620
16977 -84620 -77142 -9380 24541 48654 84976 7367 -21940 -14770 -37026 -57653 -25553 -6813
16965 -6813 38328 28699 -126985 -180248 -224585 -151452 -20855 25494 -13521 -29134 3600 9060
16953 9060 -35080 -64852 -87844 -126959 -83221 1547 128138 69147 81178 68887 -59116
16942 -59116 -16777 1410 6278 83635 48917 2846 -155064 -179474 -175562 -95359 -30037 54966
16930 54966 88072 65972 119949 98841 78181 28467 -18319 77986 141333 65756 -36778
16919 -36778 -35017 -4780 -20573 -9837 2761 -27164 -50681 11618 7006 -7217 58226 101728
16907 101728 95237 58208 130869 214372 197716 170123 153195 110638 155151 176649 211582 213637
16895 213637 190133 198156 155327 132943 112349 98101 48721 95656 151107 133665 86601 47211
16883 47211 169396 234916 103339 -26191 -24959 10583 70114 167454 160824 134893 215735
16872 215735 296847 287120 258070 225794 221610 174732 159435 127670 126544 108644 57758 54580
16860 54580 89644 176878 128545 96874 51510 26828 89819 107076 148089 189031 194116 194944
16848 194944 138912 97187 133660 224009 238396 140097 210060 388116 384901 391167 362972 327406
16836 327406 232132 226948 146928 83884 157972 150340 219139 169708 140881 207609 231365 287035
16824 287035 353852 337075 271714 286364 315658 318917 285999 347514 353490 256200 220286 246908
16812 246908 246799 222264 285729 313152 342935 321270 341565 319959 414008 530018 498549 421956
16800 421956 399281 392803 325613 269596 224961 307687 289554 281262 322532 264861 303799 367710
16788 367710 318885 266027 210720 253581 287664 375875 372383 347980 347017 295117 355609 434052
16776 434052 389962 343826 369831 369138 371711 303775 296841 311628 250896 180000 192314 224102
16764 224102 310049 383311 412837 402636 349166 335095 365406 306763 315257 262697 252817 238724
16752 238724 277136 307470 284318 287549 364878 432587 406645 298980 223754 281415 268884
16741 268884 366484 397234 384165 413060 393452 389480 349980 308196 292900 299077 392342 350710
16729 350710 259443 297420 432067 464163 513298 492454 447796 448784 467910 296344 246193
16718 246193 370238 366408 345481 339613 353225 346075 316342 390644 354524 336163 387434 393995
16706 393995 286377 305280 307208 354873 348416 320012 368062 404513 364018 393411 427293 489247
16694 489247 485614 447830 485193 466636 465692 445103 385445 334701 433369 477774 614275 533443
16682 533443 477281 484257 572429 572426 543823 501770 513405 566649 573362 530078 389497 341795
16670 341795 465806 529029 535362 556405 579400 558099 566202 507073 517349 554901 496370 457985
16658 457985 489079 468165 464631 396388 466373 524537 538092 486148 361376 465608 513610
16647 513610 588364 603197 577923 572224 616044 532894 429594 353928 327851 395743 415139
16636 415139 474944 491313 478512 516751 542525 535848 472808 495537 514192 482924 536332 525223
16624 525223 533261 517445 577183 569246 529539 505014 532176 540784 490327 452607 458236 460900
16612 460900 439062 395079 353031 375796 395232 432605 450818 454434 447859 466279 500203 521675
16600 521675 518411 480712 504288 465477 606303 694834 645137 720890 720593 589468 486072
16589 486072 522338 497614 447515 441352 431158 505456 556007 564217 500833 459323 528516 557814
16577 557814 592132 630458 650785 661165 675337 635358 553734 474724 412496 388926 426597
16566 426597 516281 498970 496982 488395 527962 554687 561353 598935 610052 620063 610395 566051
16554 566051 489476 564868 627961 693522 739690 713153 704741 600685 606178 703168 815473
16543 815473 733599 635372 563266 543745 646519 604903 565247 628936 700905 721274 685241
16532 685241 620803 661914 766835 797577 801431 777385 715350 642105 560507 589127 637792
16521 637792 626974 648039 637709 626054 614772 625213 614179 617278 658605 719318 705262 667312
16509 667312 701690 717249 752870 758821 753044 786823 777336 725338 694834 679835 690512 680165
16497 680165 631579 561536 629499 691484 652158 538009 448819 488707 537851 578317 628454
16486 628454 702286 750311 753940 756584 739614 750196 717275 733453 788743 704039 706989 717932
16474 717932 714306 653357 674685 759793 813164 845828 832683 750099 643975 594504 604402 579351
16462 579351 555549 684447 777598 751412 761993 756652 816461 864568 815125 827147 831236 857254
16450 857254 810110 790045 835070 786761 696553 643566 749712 850331 776346 782034 787755
16439 787755 829682 922641 821915 760364 729668 717874 771667 800637 781618 795926 816935
16428 816935 768819 730250 723289 772188 816727 721805 691189 811152 787483 700550 637272
16417 637272 731612 829398 820779 844018 848660 877650 765731 793360 872104 834204 832881 870713
16405 870713 868228 852584 897117 940452 890667 898470 911629 907844 953107 926024 888038 843643
16393 843643 785840 776524 838072 830860 818199 761777 759222 761951 730773 783697 891427 932860
16381 932860 935967 924796 901961 843655 885501 916401 851719 833091 842011 844883 781388 679896
16369 679896 684942 774940 920555 1006423 953754 846295 784376 823963 862857 891779 991924
16358 991924 984827 930296 943304 952363 934282 812561 860991 886751 831084 855425 946149 1004125
16346 1004125 938225 793726 777983 784296 750056 697060 666797 735671 836285 883996 890569
16335 890569 941606 936192 918330 919714 923094 888548 892658 897650 892728 874853 904204 907170 965584
16322 965584 878188 883613 897800 912348 846592 779548 731952 812908 855064 844282 853726 880701
16310 880701 870648 855548 815255 768195 776776 723829 755458 760050 714024 758395 805993 816879
16298 816879 793880 843870 885611 923405 864364 814382 778621 809750 895126 894089 918216 941148
16286 941148 943964 968543 950024 920202 898886 972519 982636 1035780 1055335 924953 897215
16275 897215 860135 838871 845308 895002 952549 966500 994219 1000736 965228 894438 878876 928835
16263 928835 969176 952839 913537 935351 862782 960141 1052204 1056519 1049648 966413 955358 942632
16251 942632 990992 1081240 980043 922214 942511 930333 871851 859768 854881 904725 1019951
16240 1019951 1118947 1042659 973447 949301 1045179 1122258 1137713 1047889 1041241 1049080 1069080 1046180
16228 1046180 1047429 1073374 1056216 1087045 1048591 1039850 1014664 1051843 1018635 928049 965843 898325
16216 898325 973699 1084382 1059405 949871 943961 925084 978985 1027383 1007686 963930 982317
16205 982317 996799 1038466 1040936 993931 953031 967262 1066657 1111845 1144220 1147880 1092526 1054850
16193 1054850 1039112 1035145 1092258 1131416 1089944 1005168 982618 1142525 1212081 1213734 1214256 1217482
16181 1217482 1211506 1190022 1170835 1166515 1169290 1215112 1215634 1171520 1138270 1112210 1131893 1129894
16169 1129894 1095391 1088004 1134196 1227064 1203121 1148274 1121313 1184366 1171098 1126708 1114455
16158 1114455 1068485 1073427 1092825 1148057 1203417 1179548 1138380 1130037 1181302 1137036 1182673 1102609
16146 1102609 1045812 1101289 1065875 1051446 1068415 1017244 954532 1016268 1130329 1097881 1076591
16135 1076591 1107452 1137211 1200580 1227000 1230538 1220941 1237858 1237714 1241544 1174043 1126063 1113442
16123 1113442 1092770 1160459 1252413 1267745 1167909 1203573 1243016 1243489 1185861 1153178 1166068 1238506
16111 1238506 1280675 1257696 1200343 1155730 1172993 1137565 1095354 1172722 1209146 1176149 1217849
16100 1217849 1366061 1440652 1292423 1243504 1227084 1162552 1163469 1203512 1216945 1181596 1171849
16089 1171849 1140991 1181811 1167970 1146710 1150886 1180378 1263352 1408188 1427266 1353639 1367939
16078 1367939 1345756 1283746 1200682 1212913 1190666 1168842 1282739 1315876 1240753 1196922 1188602
16067 1188602 1163747 1163012 1156142 1176827 1221650 1218711 1207008 1215872 1278495 1276957 1353774 1349334 1347362
16054 1347362 1305061 1297871 1239546 1202980 1221601 1332961 1375218 1387545 1392312 1406170 1368224
16043 1368224 1254451 1230575 1344896 1353609 1367825 1301893 1290990 1396802 1403614 1310907 1248571
16032 1248571 1274783 1270339 1240694 1163885 1165299 1225962 1272031 1299563 1412195 1390171 1327131
16021 1327131 1393789 1422824 1407013 1357305 1341694 1382711 1443900 1424676 1382950 1430716 1600464
16010 1600464 1603559 1467959 1356481 1409710 1422756 1380683 1448491 1464921 1399617 1327516 1394407
15999 1394407 1382679 1306752 1274703 1226934 1270456 1303894 1391769 1527176 1503013 1380728 1260293
15988 1260293 1232851 1264290 1274181 1304240 1357128 1392810 1442074 1406019 1369107 1434793 1474445
15977 1474445 1445359 1382846 1419136 1458004 1487491 1468768 1421173 1502397 1541694 1476012 1545785
15966 1545785 1612835 1642919 1532109 1394209 1430704 1465544 1460140 1429067 1473329 1469996 1462065
15955 1462065 1445917 1450099 1428280 1399656 1330345 1278025 1371673 1448252 1455145 1377008 1397482 1443035
15943 1443035 1445404 1458969 1443195 1432861 1369057 1298238 1278428 1300533 1334841 1396949 1397466 1429702
15931 1429702 1419463 1444194 1484821 1445794 1534262 1577952 1498011 1479098 1494153 1538207 1495619
15920 1495619 1475915 1467924 1443845 1486678 1461235 1442886 1455495 1479234 1497286 1592362 1591139 1484383
15908 1484383 1516041 1485138 1330842 1323000 1440991 1491998 1481724 1461189 1533582 1607974 1531300
15897 1531300 1568748 1531736 1475425 1458442 1450796 1469902 1409638 1389212 1411403 1518636 1544556
15886 1544556 1665897 1673936 1510014 1457878 1504819 1491518 1522375 1538677 1657114 1703577 1750626
15875 1750626 1702333 1627436 1575313 1599970 1529183 1423339 1379907 1402802 1444649 1515685 1476691
15864 1476691 1480582 1483679 1516437 1585743 1554152 1581099 1584520 1499643 1519868 1515930 1496111 1528355
15852 1528355 1544451 1573864 1679436 1695051 1623928 1627949 1598012 1598255 1614441 1597357 1696015 1727431
15840 1727431 1669377 1607589 1675613 1704915 1629553 1590269 1668536 1564862 1579209 1649387 1612174
15829 1612174 1527085 1511990 1518181 1580821 1561997 1597263 1673929 1703988 1631711 1601641 1700967
15818 1700967 1705422 1737953 1735863 1783638 1800592 1682563 1601745 1598677 1523146 1505784 1552604 1614976
15806 1614976 1560147 1731252 1720372 1598722 1598682 1699713 1712834 1726283 1719820 1677337 1672338 1716597
15794 1716597 1750242 1812546 1827464 1682123 1586140 1601294 1535390 1565069 1614412 1638184 1685850
15783 1685850 1679871 1726264 1746552 1682562 1674071 1679156 1682924 1738702 1791254 1832331 1797605 1666863
15771 1666863 1532191 1512305 1544983 1551025 1534814 1517982 1505933 1554775 1593097 1631269 1675933
15760 1675933 1710935 1734410 1700301 1698319 1752494 1805478 1815513 1735159 1693958 1776108 1783526 1734591
15748 1734591 1741102 1747355 1729664 1753458 1761652 1796184 1783283 1752461 1718696 1731194 1808703 1794388
15736 1794388 1716340 1702020 1823995 1845437 1712683 1717695 1662204 1776924 1862777 1811483 1730836
15725 1730836 1705833 1775601 1872564 1916998 1932888 1893780 1867705 1822693 1794737 1764050 1753895
15714 1753895 1762489 1721896 1725700 1722306 1711949 1694924 1689324 1736054 1698494 1609036 1703286 1821300
15702 1821300 1800446 1743504 1727315 1716218 1732110 1878245 1952407 1899338 1811922 1757913 1806460
15691 1806460 1834687 1862905 1904604 1950876 1907452 1844070 1756939 1781914 1812884 1840005 1738285
15680 1738285 1689106 1730167 1895516 1866456 1841349 1739409 1721306 1805156 1800870 1791032 1854020
15669 1854020 1872239 1828357 1858037 1887553 1918164 1908624 1861905 1831871 1922671 1850570 1859346 1884587
15657 1884587 1877658 1876725 1847566 1893006 1916370 1937266 1955996 1901799 1905549 1880417 1878718 1890074
15645 1890074 1896244 1927418 1822632 1812960 1863106 1866395 1909629 1893780 1922003 1917257 1858098 1821937
15633 1821937 1848985 1836723 1846506 1895367 1987087 2006983 1940264 1893360 1900743 1991104 2035457 2025055
15621 2025055 1983553 1954445 1996210 2014014 1930373 1883287 1880585 1850445 1853595 1896258 1946003 1862840
15609 1862840 1800311 1715554 1764021 1860299 1934934 1993636 2073842 2006208 1928054 1929191 1896352
15598 1896352 1798356 1725825 1660733 1683908 1836728 1870652 1893107 1963509 2042037 2033490 1920692
15587 1920692 1830974 1855491 1848834 1851976 1996406 2137607 2136333 2116084 2094733 2103606 2071486 2104625
15575 2104625 2044748 2078598 2089832 2047784 2049005 2014084 1930659 1862463 1906922 1888372 1973484
15564 1973484 2024924 1943238 1944510 1989041 2021844 1985947 2018563 2064621 2128227 2222124 2153359
15553 2153359 2066500 2055835 2029160 2023414 2057439 2030960 2016377 2007583 2045669 2026938 2017146 1990401
15541 1990401 2078457 2071933 2040832 2012937 1972527 2001998 2131512 2172558 2216410 2297645 2252405
15530 2252405 2182924 2130001 2085601 2120853 2146428 2137202 2021665 1998827 2009471 1973949 2007875
15519 2007875 2124270 2141408 2105852 2117272 2152520 2168646 2073487 2041581 2018489 2074397 2174255
15508 2174255 2154221 2114871 2161201 2135376 2159941 2192387 2228038 2251471 2162904 2137004 2137817 2109092
15496 2109092 2082746 2068876 2115403 2196808 2231955 2256113 2243899 2250141 2313979 2252251 2244443 2270491
15484 2270491 2228673 2273570 2261935 2239094 2243825 2272639 2236204 2325204 2280349 2095668 2048653
15473 2048653 2105586 2200242 2277359 2258919 2205438 2134435 2135126 2226436 2268108 2258562 2247062 2248495
15461 2248495 2286694 2250468 2098605 2041758 2161298 2209484 2275057 2287813 2242996 2239086 2204711
15450 2204711 2197978 2222053 2242095 2224194 2239675 2338325 2360053 2362867 2409231 2345991 2219891
15439 2219891 2208261 2216894 2267187 2271098 2223937 2190967 2165073 2186581 2275661 2367511 2362649 2416188
15427 2416188 2354775 2367358 2349483 2302010 2321953 2327299 2382091 2405113 2462895 2511482 2423235
15416 2423235 2364551 2356424 2450277 2517759 2526209 2450825 2438352 2370088 2364925 2324737 2291029 2250325
15404 2250325 2194351 2247288 2253979 2280829 2325265 2350758 2445094 2480481 2488876 2509090 2534732 2503190
15392 2503190 2444973 2456653 2404221 2401219 2336811 2330705 2290197 2268615 2314715 2371472 2416284 2347479
15380 2347479 2279199 2361973 2470444 2430740 2376386 2326148 2383636 2406683 2333562 2312429 2320081
15369 2320081 2475401 2502712 2473586 2502530 2505519 2507624 2543905 2509167 2478257 2521439 2523070 2435039
15357 2435039 2412870 2364219 2403101 2473173 2427247 2434637 2478778 2507557 2447074 2379000 2371060 2396128
15345 2396128 2386935 2389146 2407335 2438204 2501318 2502100 2434487 2415106 2464839 2498896 2492775 2485117
15333 2485117 2509998 2522077 2455135 2419504 2422431 2403453 2493899 2479427 2478739 2497965 2571575 2605717
15321 2605717 2650837 2677612 2732590 2660692 2572034 2571975 2580849 2510839 2471206 2543593 2626296 2571349
15309 2571349 2500703 2572097 2598599 2639876 2538821 2507619 2578578 2597937 2585644 2524759 2490456
15298 2490456 2507744 2560746 2602492 2684517 2704422 2662521 2650318 2648726 2628632 2660082 2685950
15287 2685950 2534260 2456003 2500158 2569674 2661285 2696806 2664642 2669191 2742606 2743587 2738713 2691383
15275 2691383 2677391 2684753 2753608 2775004 2770120 2719496 2728443 2751624 2866510 2802906 2640263
15264 2640263 2681840 2778280 2697883 2680145 2695246 2808840 2829457 2792388 2721839 2731541 2711653
15253 2711653 2688265 2715873 2680921 2714260 2858329 2887684 2796152 2765267 2734178 2748037 2759517
15242 2759517 2796038 2842971 2828538 2793008 2760767 2768087 2812047 2857285 2814810 2825044 2761678
15231 2761678 2763469 2784842 2863029 2907187 2911049 2893148 2910743 2869696 2854543 2881743 2899757 2817872
15219 2817872 2772984 2752875 2757085 2697078 2715894 2834123 2859800 2836878 2834338 2842402 2919472 2934027
15207 2934027 2858797 2938906 2996558 2971610 2984501 3047124 3002554 2933345 2871454 2956124 2960865
15196 2960865 2896515 2945732 2919100 2880812 2877045 2848836 2899743 2883267 2807265 2797800 2822069 2840000
15184 2840000 2861600 2869808 2908353 2929550 2863240 2846068 2914310 2975592 3029012 3086106 3115935
15173 3115935 3021158 3016154 3026461 2995028 3016180 3061173 3106693 3104120 3035885 3022257 3034910 3072053
15161 3072053 3124230 3148579 3083954 3105541 3056339 3093059 3138175 3182342 3155249 3123346 2991866
15150 2991866 3003458 3103616 3117121 3083220 3015578 2963208 2979382 3104304 3145903 3019585 3049215
15139 3049215 3042765 3008770 2946992 3025765 3141592 3177038 3179418 3111308 3042167 3038406 3024264 2967584
15127 2967584 3067833 3142090 3131155 3113614 3117997 3131222 3200027 3302563 3302764 3252268 3162492
15116 3162492 3082383 3115962 3101351 3150305 3117193 3050140 3104593 3206230 3337356 3328505 3315730
15105 3315730 3294493 3336089 3330437 3305851 3238630 3264937 3280655 3254172 3242784 3206605 3224316
15094 3224316 3357853 3452000 3395784 3292385 3340482 3351606 3320160 3309735 3353917 3365799 3366832
15083 3366832 3374360 3451697 3472048 3494385 3466297 3442062 3410181 3424557 3469513 3358862 3272290
15072 3272290 3349870 3344343 3338577 3384007 3424698 3425554 3474242 3495399 3466686 3431532 3355584 3299905
15060 3299905 3355877 3382720 3312231 3314985 3414800 3428686 3424249 3464494 3408819 3392824 3365825 3422772
15048 3422772 3555368 3635437 3613489 3604880 3608542 3524189 3537664 3604183 3587682 3610366 3622499
15037 3622499 3629296 3619885 3597786 3630265 3572292 3528957 3539925 3595799 3544906 3490199 3518409 3574197
15025 3574197 3651625 3648611 3622643 3667533 3643443 3609933 3570691 3612397 3662140 3705831 3773672
15014 3773672 3762659 3693724 3663295 3605537 3612738 3693280 3690717 3632082 3645494 3662314 3654421 3663451
15002 3663451 3665825 3698867 3756431 3788776 3722745 3632767 3576312 3582130 3643955 3698318 3750485 3737682
14990 3737682 3763867 3809982 3776709 3774900 3828718 3893765 3932906 3903877 3850358 3934199 4036606
14979 4036606 4021479 4006673 4029686 4013952 3997080 3922295 3918245 3918273 3955123 3927059 3991359 4063178
14967 4063178 4037444 4051563 4046955 4060991 4062182 4109841 4157611 4111681 4127366 4118613 4198422 4172703
14955 4172703 4075132 4123090 4136014 4116825 4131159 4144871 4164621 4160465 4142924 4181322 4262098
14944 4262098 4304724 4316519 4331426 4335576 4301907 4354415 4448570 4513577 4547792 4520029 4488048
14933 4488048 4514992 4624164 4691398 4754059 4855038 4938177 5030287 5053138 4973395 4678407 4228070
14922 4228070 3728419 3397526 3218470 3234492 3288536 3342620 3321272 3311024 3431580 3470147
14912 3470147 3530103 3617308 3660251 3752198 3895165 3986924 4012863 3997037 3866942 3894663 3947147
14901 3947147 4028185 4045332 4150949 4149698 4096715 4046222 4067519 4138574 4173519 4191124 4236970
14890 4236970 4233375 4182272 4188459 4277304 4330415 4330314 4236077 4234313 4224742 4202581 4206225 4239284 4334607
14877 4334607 4328515 4322362 4368217 4381264 4428556 4512675 4545727 4528225 4586308 4462588 4419322
14866 4419322 4447818 4418317 4428009 4432347 4384931 4544461 4677079 4702715 4671145 4680514 4610174
14855 4610174 4571829 4633752 4662297 4666792 4612025 4575442 4596782 4588316 4574998 4561548 4646026 4705021
14843 4705021 4620844 4578588 4551174 4559431 4585697 4678181 4761603 4751936 4702904 4676318 4678251 4621207
14831 4621207 4674741 4761940 4678941 4642466 4612419 4683246 4812419 4914606 4889289 4843168 4875794
14820 4875794 4952906 4977594 4974399 4967503 4976989 4980544 4946823 4860275 4845793 4971244 5029740 5014666
14808 5014666 5068578 5106193 5070312 4938509 4860435 4861514 4851368 4880140 4987047 5032270 5078263
14797 5078263 5009900 5012139 5049016 5071452 5105633 5122324 5176012 5229760 5255214 5273879 5271339 5294596
14785 5294596 5363704 5329691 5285869 5312594 5358557 5424864 5462272 5525038 5462216 5435911 5442441
14774 5442441 5438186 5397757 5479229 5554840 5552665 5579384 5576737 5592546 5545590 5495390 5558608 5617446
14762 5617446 5656515 5663477 5647187 5604257 5641862 5690031 5723077 5684031 5591398 5677520 5790361
14751 5790361 5882286 5870274 5852669 5935033 5915045 5921077 5995825 6009876 5946653 5945591 5875626 5909350
14739 5909350 5931296 5892872 5881045 5987664 5951572 5889636 5974031 6067453 6054122 6082414 6174388
14728 6174388 6179504 6120017 6151265 6150702 6150761 6182687 6232031 6289373 6293875 6302524 6312063 6410941 6518507
14715 6518507 6521009 6472363 6450417 6495119 6456563 6499330 6540674 6506608 6527316 6603350 6551195
14704 6551195 6512890 6588870 6620176 6650357 6803738 6857721 6869155 6820159 6700483 6685630 6709722
14693 6709722 6671696 6713169 6811578 6885319 6888365 6867989 6882815 6857967 6873833 6934197 7007364
14682 7007364 7031219 7078528 7144663 7121922 7153940 7136760 7146826 7220351 7229549 7246213 7250253 7283765
14670 7283765 7379397 7463764 7514616 7446406 7473889 7487056 7529408 7638335 7704459 7819056 7826339
14659 7826339 7803688 7840968 7926816 7856720 7746184 7627242 7679305 7611793 7571534 7471843 7402873
14648 7402873 7414581 7516351 7594513 7608756 7641237 7675959 7792447 7912056 7910405 7901517 7934674
14637 7934674 8010880 8121667 8147168 8099035 8139285 8148880 8221085 8350853 8364716 8358384 8403633
14626 8403633 8520296 8571877 8652397 8741205 8739158 8728732 8688916 8776917 8844790 8829750 8880380
14615 8880380 8927813 8922171 8831623 8840153 8883985 8936613 9111446 9151767 9117960 9130048 9236256
14604 9236256 9233215 9285033 9299007 9471675 9511746 9521356 9617803 9699239 9740329 9877264 9948055
14593 9948055 9944653 9969765 9996306 10049576 10014317 10012313 10089497 10200172 10255942 10302195 10395453
14582 10395453 10420969 10457234 10524219 10561650 10645430 10773370 10840854 10829869 10831287 10963316 11099435
14571 11099435 11180609 11279804 11394292 11537153 11701916 11832294 11823785 11772334 11719188 11718830 11756921
14560 11756921 11822092 11855173 11880706 11850954 11969643 12102995 12157358 12296058 12467953 12564641
14550 12564641 12672524 12761273 12822765 12980092 13164216 13306405 13388079 13461525 13505921 13615447
14540 13615447 13783753 13888130 13939358 14070286 14207324 14330322 14522559 14698630 14853814
14531 14853814 14943765 15168048 15361735 15427220 15490456 15593289 15758668 15946741 16079923 16309657
14521 16309657 16480961 16675532 16857964 17032618 17168620 17405116 17654057 17757342 17957206
14512 17957206 18219202 18429219 18621023 18880857 19141843 19284454 19387450 19494391 19711209
14503 19711209 19945777 20200621 20528216 20925299 21267958 21627263 21935260 22271061 22627397
14494 22627397 22904037 23121342 23434785 23825422 24216439 24610197 25051590 25492853 25980118
14485 25980118 26450679 26902171 27416167 27906305 28426961 28982184 29535433 30125638 30801666
14476 30801666 31583881 32241416 32968689 33817476 34597275 35452531 36414139 37371572 38494437
14467 38494437 39585110 40700204 41906536 43265619 44738728 46350226 48155327 50080416
14459 50080416 52114042 54380087 56833236 59427150 61944093 64470803 67245804 70387523
14451 70387523 74127399 78379484 83131555 88533838 94528165 101602813 110135315 120637831
14443 120637831 133796024 150208712 170194725 193005835 214308794 224331344 209805374
14436 209805374 158762251 72842941 -31637436 -126205687 -188539489 -211982470 -205948737
14429 -205948737 -185639541 -162629246 -142130043 -125137874 -111346128 -100213952 -91371205
14422 -91371205 -84288175 -78460728 -73523441 -68970094 -64557643 -60463395 -56760735 -53603894
14414 -53603894 -50694676 -47843267 -45188502 -42653062 -40235495 -38044675 -35899519 -33931775
14406 -33931775 -32138703 -30652335 -29343836 -28288894 -27526731 -27080224 -26879283 -26944042 -27238603
14397 -27238603 -27645545 -27991390 -28187371 -28102768 -27904266 -27565597 -27074325 -26371187 -25634408
14388 -25634408 -25020125 -24328026 -23545736 -22854914 -22170028 -21583969 -21104458 -20576597 -20045750
14379 -20045750 -19580566 -19088407 -18596093 -18035770 -17468494 -16854278 -16372869 -16009227 -15582431
14370 -15582431 -15119614 -14696015 -14212775 -13718334 -13335104 -13069756 -12717182 -12484965 -12395363
14361 -12395363 -12397983 -12554167 -13035935 -13629504 -14384587 -15444222 -16558416 -17520861 -18367088
14352 -18367088 -19070498 -19411953 -19562683 -19566950 -19439791 -19254728 -18944513 -18570732 -18083019 -17558279
14342 -17558279 -17163954 -16746072 -16409558 -15983252 -15604796 -15246476 -14866326 -14623868 -14422885
14333 -14422885 -14174788 -13959219 -13695048 -13453671 -13166180 -12809923 -12542410 -12402276 -12316699
14324 -12316699 -12273047 -11989775 -11788338 -11612269 -11420243 -11285504 -11165253 -10936436 -10665351
14315 -10665351 -10446766 -10278625 -10178346 -10114238 -10006471 -9839470 -9727933 -9626360 -9566952 -9483844
14305 -9483844 -9384362 -9228524 -9093521 -8985178 -8972936 -8905561 -8755901 -8629630 -8622427 -8561592
14295 -8561592 -8522948 -8410500 -8334353 -8175325 -8026544 -7935111 -7943961 -7886553 -7717317 -7537339
14285 -7537339 -7454020 -7363611 -7272993 -7277928 -7203417 -7101656 -7099253 -6965708 -6845701 -6771098 -6726484
14274 -6726484 -6736318 -6703608 -6695557 -6661349 -6545283 -6487640 -6415825 -6359165 -6342848 -6288969 -6074574
14263 -6074574 -5967699 -5956538 -5913590 -5956658 -5932610 -5880327 -5804292 -5682417 -5574158 -5472128
14253 -5472128 -5403626 -5396949 -5383143 -5391562 -5345125 -5245962 -5201422 -5177912 -5124842 -5197400 -5199087 -5057998
14241 -5057998 -5029543 -5075060 -5061059 -4984635 -4861392 -4742265 -4713050 -4758301 -4698579 -4615130 -4567109
14230 -4567109 -4598834 -4555276 -4504864 -4468983 -4507623 -4444832 -4345061 -4329774 -4370902 -4296579 -4240577
14219 -4240577 -4305439 -4321999 -4244889 -4106692 -4043928 -4194867 -4162618 -4037637 -3891577 -3784421
14209 -3784421 -3715074 -3716661 -3749603 -3783103 -3740643 -3753310 -3675605 -3650214 -3645303 -3632635 -3559151 -3530372
14197 -3530372 -3452561 -3445743 -3414845 -3346542 -3345892 -3422760 -3463970 -3447737 -3458641 -3409397 -3257970 -3114819
14185 -3114819 -3180955 -3223128 -3159830 -3134415 -3157282 -3189251 -3159576 -3174317 -3097017 -3034866 -2934891
14174 -2934891 -2894915 -2878117 -2845376 -2846494 -2814036 -2788921 -2747759 -2767066 -2742535 -2737648 -2746913 -2772811
14162 -2772811 -2739340 -2738626 -2730835 -2615723 -2574836 -2674706 -2677043 -2593028 -2617060 -2504414 -2373041
14151 -2373041 -2356153 -2272056 -2247667 -2282656 -2326784 -2308435 -2267587 -2326025 -2379552 -2351209 -2344228
14140 -2344228 -2309521 -2220272 -2153060 -2216803 -2291556 -2198130 -2048816 -1939957 -1988735 -1971370 -1905513
14129 -1905513 -1905224 -1925750 -1942846 -2017443 -2018845 -2015775 -1917457 -1854643 -1876376 -1835557 -1772437 -1709797
14117 -1709797 -1745637 -1711089 -1674486 -1685074 -1643311 -1657783 -1566415 -1540684 -1585185 -1653201 -1648278
14106 -1648278 -1655703 -1609062 -1645162 -1665024 -1555917 -1495919 -1538735 -1478674 -1399834 -1390137 -1427506
14095 -1427506 -1476401 -1456097 -1345893 -1295343 -1269729 -1288194 -1269751 -1253473 -1258419 -1135231 -1053000
14084 -1053000 -1130232 -1193188 -1206101 -1226882 -1152984 -1117778 -1116335 -1121071 -1135033 -1149340 -1143960 -1175466
14072 -1175466 -1250677 -1216681 -1157463 -1151210 -1059928 -1020402 -1059379 -1092862 -1087912 -1090633 -1071736 -1015728
14060 -1015728 -950397 -870323 -919469 -1026206 -1058442 -1002550 -908704 -931105 -888543 -877247 -864240
14049 -864240 -858289 -913507 -942708 -877293 -861225 -823122 -809834 -836776 -834792 -812922 -800342 -673653
14037 -673653 -648577 -678308 -699958 -601163 -576431 -654757 -696670 -683655 -611320 -598829 -650520
14026 -650520 -731105 -713872 -680109 -587574 -507674 -484907 -495818 -407889 -343999 -245451 -278906
14015 -278906 -334786 -393222 -368912 -368336 -350349 -360628 -398003 -358836 -272975 -274924 -319561 -380999
14003 -380999 -441141 -469778 -489346 -484599 -489340 -571495 -567806 -487292 -416450 -424643 -352779 -343993
13991 -343993 -285287 -307871 -361125 -327702 -252656 -297387 -374220 -308014 -180730 -155218 -220593
13980 -220593 -206203 -89164 -68087 -72037 -21630 46208 95727 119164 119708 114332 56699 -19181
13968 -19181 -30411 42955 96572 170157 215558 224068 282922 270465 251279 289460 295579 368387
13956 368387 346350 401129 457445 457583 484594 523438 629605 767118 935185 1017726 1036381
13945 1036381 1124459 1199152 1227271 1196021 1049208 717720 217494 -304378 -750407 -1030066
13935 -1030066 -1168409 -1123624 -925357 -777202 -687012 -520005 -424242 -425028 -499545 -463354 -429448
13924 -429448 -369026 -302799 -203273 -141073 -40158 38633 -11337 -51133 -2793 42576 52006
13913 52006 20863 7912 4074 25603 -15551 -4939 42422 29229 13045 59389 130459 168181
13901 168181 177233 136609 111019 148839 178449 186884 166599 132282 120952 164204 138097 170958
13889 170958 159487 174910 284519 279834 273872 275478 325253 297110 359016 348717 378452 346367
13877 346367 258720 299095 298283 194305 132907 71491 109411 132342 218195 324697 317379 322130
13865 322130 445854 395262 320769 289860 325831 378147 391693 348715 375821 369692 402535
13854 402535 514566 634656 744640 662703 567124 472219 467568 474118 613739 725204 714606
13843 714606 730966 659299 569493 573163 619145 677137 756844 794711 830218 849095 807984 776896
13831 776896 732546 707864 685487 672792 684636 685987 594233 612486 684505 745692 733601 742502
13819 742502 785090 825626 891117 908138 814366 833371 915804 903314 896839 946851 1007959 1042702
13807 1042702 1020287 1020035 1111000 1109097 998989 927527 998642 941877 865107 871313 946387 973223
13795 973223 945080 921454 927227 912860 955701 977946 962362 969736 1007150 1034966 987970 951259
13783 951259 1053613 1039149 1009246 926804 937191 970198 1053192 1091255 1124811 1135284 1098412
13772 1098412 1092583 1060728 1028463 1019195 1105180 1246202 1215439 1176468 1256793 1258191 1169253 1137325
13760 1137325 1124062 1134819 1183148 1244634 1313749 1275282 1249855 1214721 1216244 1261715 1296674
13749 1296674 1327735 1282518 1251633 1232869 1302722 1330452 1389725 1454014 1486401 1472182 1387127
13738 1387127 1269856 1187848 1269604 1297328 1375907 1324376 1305918 1375505 1434310 1384182 1340383
13727 1340383 1258816 1260736 1311115 1382523 1462201 1453821 1422981 1415049 1439203 1443928 1413585 1381295
13715 1381295 1360348 1404350 1442000 1446471 1448111 1471929 1566395 1668584 1700726 1693061 1573625
13704 1573625 1449915 1436446 1429209 1480409 1581201 1582501 1576261 1630085 1605431 1639661 1675828
13693 1675828 1656315 1637451 1555148 1519356 1594394 1586241 1633915 1714280 1572155 1564495 1634454
13682 1634454 1609523 1604861 1711126 1741132 1701982 1704224 1688720 1669268 1652108 1682299 1685751 1679683
13670 1679683 1710413 1703168 1670759 1693736 1724142 1739618 1737109 1713337 1692493 1779102 1806586 1746063
13658 1746063 1688324 1723059 1762193 1728243 1681256 1629067 1671872 1688098 1782614 1738732 1649381
13647 1649381 1757354 1920365 1914869 1779292 1797672 1861441 1888837 1916875 1927048 1952055 1888547
13636 1888547 1905199 1972421 2000935 2020418 2062031 2075707 2045027 1986889 1984876 2026664 1940250
13625 1940250 1961583 1912380 1891999 1964068 2047709 2087685 2055617 1978519 2084964 2105655 2030878
13614 2030878 2064476 2078755 2095268 2024179 2020534 2024980 2032719 2108293 2092203 2035235 1986777 2008282
13602 2008282 1936132 1971660 2035289 2117661 2164073 2238654 2176266 2180374 2175604 2088338 2025060 2022948
13590 2022948 2098905 2174636 2184634 2215620 2211303 2232112 2243939 2220673 2226119 2193055 2142764 2134082
13578 2134082 2102179 2050752 2088041 2256811 2340695 2322989 2281626 2268537 2328675 2313817 2192902
13567 2192902 2081941 2140877 2193917 2260918 2282315 2326180 2393279 2366584 2392726 2422546 2409877
13556 2409877 2322898 2312883 2335353 2322468 2332860 2371593 2354733 2295441 2267811 2285783 2287383
13545 2287383 2273673 2333991 2399275 2470254 2483124 2394271 2373890 2354541 2386698 2485697 2542509
13534 2542509 2528987 2471734 2518336 2491055 2431025 2513656 2556051 2592572 2614584 2599445 2584974
13523 2584974 2618659 2541101 2462340 2400616 2413610 2521571 2597641 2659749 2664183 2610261 2583705
13512 2583705 2603490 2549559 2573933 2596614 2594607 2636804 2648896 2579839 2596020 2595523 2642548 2655593
13500 2655593 2649690 2749678 2774621 2705324 2623534 2620027 2724204 2734653 2761420 2808436 2793481
13489 2793481 2750494 2735454 2766670 2842272 2856329 2855434 2873194 2870650 2900956 2921076 2873948 2904991
13477 2904991 2936459 2992424 2997805 3056096 2998296 2941679 2926828 2954164 2975144 2934602 2925433 2965718
13465 2965718 2925251 2885027 2775961 2742100 2751692 2846518 2856456 2788087 2779536 2810872 2835342 2879420
13453 2879420 2910613 2975617 3015249 3033604 3041628 2988724 3021860 3015991 3002822 3076920 3116186 3025685
13441 3025685 3058637 3115820 3153928 3071065 3045239 3039695 3032645 2978995 2974825 3058659 3095586 3089899
13429 3089899 3130100 3157560 3106734 3084298 3099884 3191062 3103903 3051197 3066218 3123891 3238195
13418 3238195 3292359 3412162 3385522 3257352 3179669 3195677 3206755 3265653 3312148 3297892 3256225
13407 3256225 3278916 3285071 3302634 3328894 3355081 3277127 3255089 3306464 3376950 3393871 3329282
13396 3329282 3358493 3302947 3295072 3318328 3364935 3372593 3268457 3225073 3301717 3323820 3321849 3310857
13384 3310857 3335900 3319694 3275159 3352117 3483725 3536506 3547857 3502536 3457722 3539302 3515093
13373 3515093 3504066 3554989 3613871 3731135 3652543 3626474 3638467 3610465 3641170 3647253 3638664
13362 3638664 3628082 3695947 3785438 3856609 3839008 3741411 3716874 3680999 3704469 3789740 3763543
13351 3763543 3743582 3703296 3694595 3723795 3716667 3716783 3726128 3734172 3713570 3725951 3703782 3716412
13339 3716412 3747490 3728669 3732692 3783608 3764542 3824110 3822488 3821155 3831253 3851341 3833776 3872313
13327 3872313 3910299 3899659 3893718 3901873 3954814 3907796 3894784 3934598 3981396 3962209 3864825 3865171
13315 3865171 3956004 4012743 3934729 3855612 3769521 3803521 3877782 3933074 3997726 4060356 4135410
13304 4135410 4260460 4186563 4094877 4135728 4126986 4074404 4124193 4173182 4186796 4154109 4154725 4121342
13292 4121342 4125450 4094562 3987877 4023468 4096435 4143094 4252809 4262888 4195703 4188068 4282847
13281 4282847 4381867 4328592 4267631 4277125 4296118 4286011 4255574 4238761 4323823 4343092 4469617
13270 4469617 4508098 4489513 4500845 4428832 4363807 4353811 4346533 4365331 4414319 4387592 4356507 4384507
13258 4384507 4323108 4197164 4218618 4377325 4407376 4419579 4438427 4517789 4500686 4503086 4516190
13247 4516190 4445617 4465999 4526849 4518645 4449496 4398604 4553992 4627524 4683516 4735325 4701106
13236 4701106 4652297 4669000 4661911 4758186 4836013 4695160 4591587 4571531 4672599 4756546 4745386
13225 4745386 4685535 4785810 4814963 4790703 4753067 4792897 4771303 4717585 4766909 4751552 4750900
13214 4750900 4794931 4900877 4859790 4848966 4844678 4881395 4882755 4877155 4841441 4768781 4801264 4928249
13202 4928249 4992208 5042840 5015647 5020887 5003767 4986372 4997263 5111917 5150306 5098989 5156662
13191 5156662 5115608 5168424 5229621 5223556 5147706 5111279 5098843 5149199 5193505 5243642 5223618
13180 5223618 5197270 5221240 5223830 5267034 5152487 5130931 5212761 5209903 5142085 5116511 5194781
13169 5194781 5281249 5273641 5282359 5290128 5342510 5432835 5474681 5420238 5474125 5462274 5483310 5529135
13157 5529135 5533448 5559650 5543247 5551849 5577425 5626430 5591894 5565492 5581875 5578910 5519607 5509268
13145 5509268 5529794 5556977 5620391 5645463 5604075 5619013 5735723 5756670 5767143 5844570 5894127
13134 5894127 5879183 5892353 5884773 5871686 5869845 5930234 5922123 5899622 5958722 6034038 6036559 6013879
13122 6013879 6048112 6078275 6076509 5963619 5953573 5959553 6053674 6197009 6204139 6130866 6170203
13111 6170203 6118808 6113701 6182948 6142523 6072764 6141686 6168100 6229822 6245799 6339335 6461050
13100 6461050 6519656 6441409 6432755 6484338 6580140 6640138 6801521 6908852 6934291 6890695 6762762
13089 6762762 6659553 6575856 6344594 6206894 6126215 6160408 6312062 6323951 6364382 6343983
13079 6343983 6460622 6599199 6785419 6804540 6820380 6846339 6823205 6784288 6726723 6708208 6720353
13068 6720353 6767371 6789537 6697129 6692302 6809879 6895899 6912852 6904952 6850695 6668743 6495277
13057 6495277 6492199 6470140 6537945 6550943 6621859 6668485 6632828 6682654 6637106 6607592 6632227
13046 6632227 6555545 6536261 6637191 6696205 6645226 6670946 6788143 6839734 6852825 6915082 6974782
13035 6974782 7036013 7047912 7095462 7183375 7332130 7282678 7119041 6918984 6697628 6585709
13025 6585709 6480345 6467641 6461537 6423575 6498123 6562588 6664912 6759127 6867838 6875113 6929550
13014 6929550 7039090 7011180 6970653 7049212 7128199 7178146 7157439 7137051 7198919 7200815 7180221
13003 7180221 7225187 7183408 7268987 7378361 7418540 7412080 7437665 7467391 7486466 7515505 7591213
12992 7591213 7546863 7544605 7490239 7517871 7572224 7632845 7655547 7731931 7776650 7847595 7931788
12981 7931788 7860543 7841344 7899922 7927639 7898127 7978423 7980837 7954921 7973028 8084914 8190526
12970 8190526 8252893 8254528 8194742 8249339 8314743 8378358 8382563 8415736 8384696 8369924 8358731 8282779
12958 8282779 8284395 8316439 8330498 8377242 8550473 8647557 8639882 8606179 8632625 8623980 8533434 8579966
12946 8579966 8752888 8853632 8810919 8766385 8730651 8814310 8938816 8887838 8832343 8912232 8965051
12935 8965051 8938472 8995087 9052829 9065933 9149806 9199473 9180951 9261533 9290598 9336042 9389552
12924 9389552 9388768 9446692 9519628 9544903 9616506 9628147 9675040 9701245 9649704 9664208 9727642 9741238
12912 9741238 9826025 9851260 9891649 9971040 9981210 10090327 10144877 10158654 10165982 10130145 10157139
12901 10157139 10227964 10257427 10308625 10345954 10321413 10314246 10337714 10409302 10472365 10455341 10510639
12890 10510639 10586445 10637711 10671087 10778138 10868519 10822492 10713959 10705324 10831610 10975524
12880 10975524 10959550 10969534 11025079 11127747 11306986 11412073 11477856 11510270 11512656 11552683 11643194
12869 11643194 11662623 11656948 11616040 11723881 11932747 12069936 12178095 12201638 12264074 12338865
12859 12338865 12479616 12684172 12809337 12983791 13276314 13626740 14034444 14529057 14923896
12850 14923896 14834276 13420164 10759767 9050507 8938096 9429688 9883463 10171482 10426552
12841 10426552 10688586 10989640 11142591 11337799 11441903 11494679 11624613 11755511 11812485 11893401
12831 11893401 11969034 11984491 12113574 12281108 12367863 12475744 12484380 12650222 12718077 12797373
12821 12797373 12856988 12981075 13057835 13043778 13089213 13181039 13278099 13343175 13428634 13474930 13514150
12810 13514150 13615280 13730553 13846513 13942081 14042465 14077355 14097575 14151567 14225286 14298699
12800 14298699 14456450 14609538 14641650 14812935 14914961 14995918 15135559 15209338 15272580 15371869
12790 15371869 15435167 15406966 15364233 15415418 15583079 15654728 15701442 15797903 15793777 15944123 16015182
12779 16015182 16053233 16122775 16302983 16406986 16466676 16542274 16708345 16794646 16868100 16876663 16938047
12768 16938047 17105967 17294359 17441198 17482904 17578999 17785959 17893476 18005041 18073384 18119736
12758 18119736 18259216 18342502 18469573 18554851 18562241 18633225 18762139 18854199 18927035 19035065
12748 19035065 19132722 19299049 19456147 19584390 19742553 19979263 20129792 20255970 20366681
12739 20366681 20544676 20667165 20750670 20941212 21161533 21367348 21405033 21495871 21699266 21921214
12729 21921214 22075690 22336761 22531118 22654551 22817771 22877159 23154277 23393971 23564127
12720 23564127 23691450 23898876 24077568 24372426 24641801 24804748 24998923 25165566 25419460
12711 25419460 25717018 26058580 26361482 26537819 26771318 27124871 27462997 27682365 27853940
12702 27853940 28082204 28285876 28548565 28820467 29121977 29479330 29831813 30110119 30463095
12693 30463095 30838197 31292680 31672917 32036974 32368253 32716959 33199474 33676859 34100429
12684 34100429 34602790 35099011 35552964 35965350 36482109 37017082 37587746 38168354 38784069
12675 38784069 39369492 39890028 40586044 41370413 42128453 42791684 43499708 44248087 45047502
12666 45047502 45902107 46834052 47850578 48878768 49859661 50869063 52108547 53357271
12658 53357271 54637629 56079145 57675172 59382603 61246785 63175321 65187674 67204102
12650 67204102 69287724 71700221 74361991 77162137 80302203 84080955 88441902 93376202
12642 93376202 99060098 105625217 112994100 120990601 129106329 135667987 137926533 131648707
12634 131648707 111968581 78041399 39294060 8958646 -7298871 -11890882 -8933227
12627 -8933227 -1744510 7065298 16303835 25372434 34263450 42940023 51339352 59429052
12619 59429052 66830694 73001877 76680954 76431167 72496295 66562704 60995077 57393140
12611 57393140 55936587 56696541 59203107 62236653 63639781 60665524 51307253 34946746
12603 34946746 13146103 -9383445 -27099804 -37441987 -41086794 -39861984 -35765744
12596 -35765744 -30424532 -25362002 -21873580 -20622394 -21690455 -25248880 -31236250 -38396164
12588 -38396164 -44129450 -46120929 -43705826 -38027564 -30433267 -21502998 -11707539 -1528102
12580 -1528102 9040349 20108156 31109139 40743706 46557913 44694221 31068527 3170135
12572 3170135 -36643277 -77666378 -106625025 -119411865 -121468282 -119404285 -116389279 -112555390
12564 -112555390 -107531504 -101476560 -95086654 -88687786 -82739300 -77335520 -72436232 -68086683
12556 -68086683 -64184762 -60595249 -57084828 -53714432 -50510045 -47673470 -45490382 -43937510
12548 -43937510 -43043043 -42475230 -41839998 -41004348 -39917643 -38510174 -36949452 -35505903 -34508045
12539 -34508045 -34401601 -35299003 -36943678 -38923795 -40769457 -41847266 -42076565 -41657695 -40669988
12530 -40669988 -39377103 -38134218 -37054317 -36267128 -35925428 -35995838 -36390531 -36982814 -37427195
12521 -37427195 -37389175 -36825077 -35753224 -34367571 -32838860 -31276724 -29622842 -27955672
12513 -27955672 -26258057 -24478231 -22935330 -21749330 -21292221 -22198976 -24804880 -29355575
12505 -29355575 -34812886 -39256825 -41512800 -41831534 -41036997 -39805537 -38427244 -37115114
12497 -37115114 -35891196 -34827973 -33899131 -33067555 -32318273 -31564468 -30862798 -30223140 -29690873
12488 -29690873 -29171000 -28725883 -28342463 -27969642 -27522264 -26995019 -26412077 -25903963 -25519824
12479 -25519824 -25146352 -24743083 -24372618 -23983732 -23638268 -23291224 -22912349 -22550252 -22211322
12470 -22211322 -21867003 -21548963 -21286277 -21028933 -20838334 -20669479 -20469606 -20199034 -19914361
12461 -19914361 -19722928 -19537644 -19358645 -19213642 -19049584 -18842895 -18566733 -18378266 -18240594
12452 -18240594 -18184525 -18122556 -18019332 -17814745 -17633320 -17437272 -17253935 -17049766 -16899785 -16701909
12442 -16701909 -16523903 -16422195 -16238679 -16176104 -15995899 -15747509 -15615613 -15540855 -15359305 -15138849
12432 -15138849 -15105441 -15036527 -14939313 -14841593 -14721068 -14573894 -14491304 -14437627 -14351542 -14142927
12422 -14142927 -14003994 -13947087 -13867692 -13799330 -13654906 -13492048 -13345328 -13241151 -13133419 -13045273
12412 -13045273 -12891572 -12840699 -12774597 -12668592 -12545122 -12479560 -12455015 -12380223 -12289542 -12186870
12402 -12186870 -12077442 -12054869 -12003367 -11935995 -11907934 -11903271 -11890147 -11808986 -11643321 -11507773 -11436157
12391 -11436157 -11367272 -11184519 -11011028 -10979064 -11034185 -11063490 -10961769 -10826256 -10727975 -10634806
12381 -10634806 -10537288 -10462973 -10301007 -10265530 -10246734 -10168441 -10068692 -10058042 -10027145 -9924871 -9904740
12370 -9904740 -9828130 -9805026 -9707041 -9533230 -9458749 -9368169 -9338726 -9178839 -9147984 -9162284 -9141116
12359 -9141116 -9133383 -9138846 -9139833 -9122047 -9075054 -8983556 -8937213 -8840678 -8806564 -8685548 -8634984 -8611424
12347 -8611424 -8448385 -8414718 -8336615 -8239736 -8116856 -8020185 -8055852 -8183954 -8166010 -8100990 -7936542
12336 -7936542 -7726664 -7673607 -7721251 -7627476 -7490495 -7420161 -7345254 -7279035 -7260001 -7263034 -7228281
12325 -7228281 -7193080 -7109230 -7128997 -7112549 -7050010 -6950597 -6897430 -6817948 -6742761 -6739060 -6741613 -6693810
12313 -6693810 -6629007 -6545021 -6488910 -6395826 -6305256 -6349836 -6294568 -6195487 -6139271 -6119604 -6046530
12302 -6046530 -6022582 -6022306 -6009188 -6039822 -6053675 -5928763 -5886789 -5872228 -5795774 -5681634 -5599891
12291 -5599891 -5663491 -5754647 -5707707 -5592359 -5443356 -5372202 -5380888 -5353782 -5254735 -5145219 -5053414
12280 -5053414 -5066725 -5070715 -4982479 -4916593 -4923636 -4870338 -4862952 -4882565 -4891322 -4744532 -4639632 -4602720
12268 -4602720 -4608366 -4670007 -4684435 -4587428 -4479825 -4459009 -4464531 -4392041 -4407303 -4420392 -4383245
12257 -4383245 -4333293 -4322260 -4322740 -4285200 -4314490 -4306129 -4138523 -4064786 -3997415 -4065937 -3945667
12246 -3945667 -3980725 -4028064 -3885641 -3713596 -3680904 -3643514 -3625942 -3590421 -3591135 -3547151 -3493728
12235 -3493728 -3445693 -3362175 -3306402 -3206437 -3198243 -3202542 -3263042 -3275435 -3253982 -3236844 -3330082 -3273490
12223 -3273490 -3100569 -3032367 -2993608 -2929948 -2913345 -2951593 -2938705 -2897926 -2860611 -2779789 -2684339
12212 -2684339 -2761568 -2767641 -2725034 -2659079 -2572580 -2502997 -2502479 -2501270 -2382769 -2298175 -2162934 -2147602
12200 -2147602 -2195276 -2115351 -2098983 -2016754 -2059753 -2072314 -2099461 -2026695 -1922999 -1813621 -1814653
12189 -1814653 -1860878 -1840302 -1781776 -1716025 -1707666 -1596358 -1559798 -1562053 -1458962 -1317488 -1232031
12178 -1232031 -1084125 -1095754 -1123665 -1070824 -959297 -898362 -884014 -982309 -1057803 -1144895 -1278641
12167 -1278641 -1273138 -1233759 -1137726 -1049366 -892615 -812000 -773661 -719686 -736229 -717317 -763963
12156 -763963 -825309 -845310 -862898 -855752 -882519 -965109 -1025106 -1018989 -995573 -839172 -752131 -754463
12144 -754463 -669449 -612392 -725582 -859580 -990343 -1093249 -1152085 -1047943 -945916 -944458
12134 -944458 -796009 -614469 -528845 -590303 -652544 -649404 -738921 -790566 -824037 -859915 -939788
12123 -939788 -953343 -848399 -845700 -796737 -717884 -581005 -583195 -569412 -454726 -455193 -414908 -379228
12111 -379228 -424546 -525916 -689823 -826045 -915480 -842129 -777929 -734264 -725917 -633581 -508887
12100 -508887 -413117 -405482 -488317 -596608 -586168 -616680 -649112 -671611 -709225 -693190 -546305
12089 -546305 -391115 -353004 -276192 -157004 -75159 -62106 -81559 53836 149663 140357 176315
12078 176315 184818 227422 297546 203000 231527 342002 427308 426069 466238 626597 702949
12067 702949 735648 732641 725034 796328 803600 744529 733261 735792 731269 807236 893648 980153
12055 980153 1001156 1024285 981933 948767 1056395 1168979 1232168 1256516 1345037 1335684 1336440 1332814
12043 1332814 1377548 1439056 1504369 1608476 1767290 1788270 1646453 1642663 1680279 1702388 1761464
12032 1761464 1752798 1810628 1841152 1897357 1927981 1996430 2138147 2163391 2144334 2148223 2089306
12021 2089306 2111620 2205714 2206966 2220578 2191038 2300415 2363429 2393170 2502748 2606275 2647840
12010 2647840 2556112 2535284 2624655 2734597 2864706 2867205 2925452 3010543 2985518 3003065 3057237
11999 3057237 3110212 3087467 3117791 3157786 3151569 3164641 3276332 3442348 3460692 3470958 3550718
11988 3550718 3606750 3685554 3677346 3650562 3636652 3641245 3689667 3705726 3707350 3693294 3810683 3952731
11976 3952731 3994447 4012024 4015299 4013139 4039523 4161967 4279311 4339769 4320863 4316096 4398285
11965 4398285 4480612 4568980 4586915 4631149 4706017 4710219 4642055 4657828 4709160 4754535 4796412
11954 4796412 4825427 4872242 4934989 4941799 4971893 5010078 5147468 5136860 5148713 5182615 5286866
11943 5286866 5410783 5490421 5556731 5603195 5577151 5562839 5589294 5514656 5480733 5545541 5666510
11932 5666510 5845687 5875351 5880323 5851544 5942830 5997184 6119095 6198810 6201373 6225049 6406136
11921 6406136 6489879 6541011 6569896 6508191 6589105 6697448 6830473 6928250 6962572 6905154 6871609
11910 6871609 6956548 7104484 7240917 7232135 7308707 7423756 7524348 7594518 7648367 7693822 7792917
11899 7792917 7811403 7819992 7928952 8048357 8124601 8185433 8174386 8255080 8269822 8404512 8442977
11888 8442977 8467773 8546904 8552021 8621489 8787653 8897201 9019339 9122964 9166792 9262737 9331503
11877 9331503 9441109 9525336 9584633 9735537 9909057 10057052 10072269 10070790 10150590 10236564 10333446
11866 10333446 10454215 10483995 10546020 10674382 10765152 10915168 11025763 11103344 11229143 11191386
11856 11191386 11263427 11514129 11770928 11857269 11955077 12120390 12341513 12463408 12599500 12630783
11846 12630783 12655632 12694354 12759521 12827646 12951599 13044427 13111853 13182769 13282101 13355254 13407882
11835 13407882 13506345 13575545 13643627 13805090 14016643 14165270 14318458 14450617 14553463 14655550
11825 14655550 14827921 14980641 15158202 15312005 15521667 15721564 15881678 16054456 16275056
11816 16275056 16522672 16691522 16828144 16966731 17177726 17353568 17552968 17807947 17937651
11807 17937651 18061688 18187495 18390049 18685530 18959877 19253456 19510014 19675246 19867661
11798 19867661 20091226 20349649 20569686 20871323 21119380 21337161 21544510 21898095 22297673
11789 22297673 22516843 22716793 22981259 23238581 23591463 23901602 24307399 24673293 24974606
11780 24974606 25353399 25735283 26076007 26388328 26778695 27237354 27765979 28139144 28628708
11771 28628708 29111131 29492491 29986163 30415287 30989434 31493135 31938765 32484826 33057948
11762 33057948 33668033 34254652 34953349 35716520 36421249 37084209 37880983 38705890 39524704
11753 39524704 40356827 41204066 42174534 43191870 44323828 45478093 46595326 47823179
11745 47823179 49189954 50589714 52182992 53800968 55477069 57275800 59111489 61088296
11737 61088296 63283430 65758358 68381551 71364805 74617033 78322324 82353205 86724010
11729 86724010 91686218 97392895 103976073 111489662 119837925 128457335 136120551 140741310
11721 140741310 138166266 122758581 91708335 51014314 14511833 -9203821 -20792743
11714 -20792743 -23451190 -19779769 -12282342 -2805212 7133360 16983611 26481415 35421088
11706 35421088 44094090 51887800 57327329 58882882 56055730 50006193 42752566 35737618
11698 35737618 30137052 27525385 28942677 34308676 42998828 53182968 62173662 66770654
11690 66770654 63094886 48003227 22136305 -8711733 -36135093 -53903900 -60445618
11683 -60445618 -58454292 -52205151 -45625757 -41301328 -40250973 -42561875 -47777746 -54316343
11675 -54316343 -60833887 -65319420 -65898195 -62381019 -55900784 -47812867 -39249429 -30731146
11667 -30731146 -22212797 -13461383 -4401505 4477798 12404504 18015738 19619725 14557079
11659 14557079 -204781 -26193549 -60434668 -92959826 -113472169 -120095435 -117657904
11652 -117657904 -111045993 -102941492 -94685926 -86997850 -80016777 -73879258 -69059493 -65948802
11644 -65948802 -65089233 -66300786 -68443646 -69928908 -69942995 -68653682 -66554939 -63967557
11636 -63967557 -61080157 -58089337 -55219823 -52546195 -49950539 -47548991 -45324134 -43369494
11628 -43369494 -41634661 -40516415 -40239914 -40548753 -41017763 -41210039 -40932481 -40176774 -38976101
11619 -38976101 -37303210 -35263439 -33200533 -31469532 -30619001 -31102363 -33017490 -36087133
11611 -36087133 -39504015 -42215879 -43350614 -43199824 -42192514 -40779102 -39448826 -38522048
11603 -38522048 -38145221 -38343782 -39085097 -39910168 -40507014 -40502659 -39841328 -38671483 -37304569
11594 -37304569 -35819630 -34310138 -32867193 -31485408 -30145958 -28782797 -27384246 -26246131
11586 -26246131 -25594124 -25542905 -26523637 -28964898 -32754537 -36975266 -40287715 -41870282 -41953343
11577 -41953343 -41250340 -40180697 -38982481 -37758799 -36744858 -35837361 -35046000 -34225424 -33443234
11568 -33443234 -32775125 -32195032 -31721648 -31201044 -30698683 -30265059 -29813075 -29312597 -29056786
11559 -29056786 -28752568 -28262921 -28000562 -27759192 -27399170 -27126281 -26775768 -26435698 -26118775
11550 -26118775 -26021765 -25775867 -25475598 -25141536 -24871882 -24628554 -24339219 -23978339 -23765496
11541 -23765496 -23605606 -23424440 -23236027 -23064237 -22922904 -22791051 -22662421 -22552411 -22476865
11532 -22476865 -22436261 -22436533 -22296926 -22163926 -22040875 -21886840 -21667005 -21502734 -21392185 -21145104
11522 -21145104 -20909280 -20719675 -20585232 -20530795 -20496758 -20375712 -20193723 -19993457 -19846583 -19722881
11512 -19722881 -19647919 -19566690 -19438578 -19314687 -19171824 -19037913 -18892757 -18748336 -18663153 -18588940
11502 -18588940 -18457504 -18455738 -18453363 -18404530 -18260693 -18221468 -18193148 -18154558 -18081241 -17870979 -17771534
11491 -17771534 -17683361 -17609013 -17562302 -17479941 -17365263 -17224769 -17076384 -16999975 -16831402 -16692339
11481 -16692339 -16519494 -16382076 -16231899 -16103319 -15960127 -15786505 -15726073 -15654240 -15678390 -15727735
11471 -15727735 -15736510 -15689716 -15595291 -15501917 -15383003 -15248013 -15099230 -15015799 -14939970 -14835408
11461 -14835408 -14744106 -14621659 -14575861 -14540548 -14477628 -14289134 -14114371 -13967918 -13861179 -13786764
11451 -13786764 -13698914 -13631691 -13519951 -13399419 -13328456 -13296155 -13301885 -13407986 -13480357 -13582292
11441 -13582292 -13678613 -13748338 -13771876 -13867514 -13920898 -13875039 -13875532 -13899747 -13943920 -13926006 -13848324
11430 -13848324 -13830152 -13769771 -13743559 -13662378 -13526678 -13370998 -13307530 -13247251 -13052195 -12931593
11420 -12931593 -12814175 -12698474 -12662727 -12598466 -12538231 -12405468 -12258512 -12082830 -11929825 -11776637
11410 -11776637 -11708993 -11598693 -11522750 -11447166 -11388097 -11331559 -11313277 -11224940 -11119956 -11194030 -11275483
11399 -11275483 -11393379 -11625613 -11902558 -12153068 -12460676 -12720969 -12969639 -13308333 -13530988
11390 -13530988 -13677545 -13808821 -13871052 -13836457 -13796029 -13731043 -13768221 -13699092 -13532789 -13410139
11380 -13410139 -13283696 -13220745 -13224916 -13212643 -13186455 -13047637 -12957609 -12776219 -12664108 -12593753
11370 -12593753 -12500093 -12415690 -12425191 -12524488 -12595111 -12574630 -12483019 -12411537 -12343953 -12335167 -12228252
11359 -12228252 -12167791 -12118526 -12056036 -12076115 -12085387 -12186050 -12284822 -12335688 -12415002 -12404247 -12404835
11348 -12404835 -12519903 -12644505 -12721960 -12705985 -12679243 -12638470 -12561318 -12493510 -12526898 -12520266 -12508636
11337 -12508636 -12522801 -12578027 -12594164 -12628327 -12600536 -12559994 -12480204 -12345890 -12269531 -12318316 -12270036
11326 -12270036 -12166125 -12117123 -12161228 -12170487 -12121356 -11947200 -11868873 -11807621 -11761736 -11718920 -11639775
11315 -11639775 -11659107 -11621924 -11547490 -11507965 -11445412 -11344928 -11246310 -11183067 -11187618 -11165431 -11180011
11304 -11180011 -11158696 -11083542 -11067296 -10995994 -10915706 -10930917 -10840953 -10697223 -10582265 -10546798 -10559965
11293 -10559965 -10534426 -10486885 -10414680 -10438772 -10479300 -10456114 -10469155 -10428618 -10380732 -10335712 -10236428
11282 -10236428 -10153885 -10045168 -9946054 -9944007 -9914488 -9842975 -9815045 -9761360 -9669287 -9754954 -9871635
11271 -9871635 -9961980 -10032655 -10105035 -10221928 -10234390 -10203762 -10216913 -10157367 -10115702 -10043481 -9819360
11260 -9819360 -9722135 -9739030 -9706467 -9697007 -9718020 -9796786 -9749433 -9633313 -9645178 -9661856 -9751020
11249 -9751020 -9745327 -9580821 -9440796 -9406704 -9365801 -9334640 -9386745 -9437866 -9539510 -9612478 -9680706
11238 -9680706 -9739626 -9749892 -9736298 -9761249 -9716939 -9715580 -9759343 -9777554 -9757179 -9780939 -9843017
11227 -9843017 -9859524 -9741315 -9609061 -9527616 -9489893 -9457461 -9380322 -9264873 -9134519 -9145803
11217 -9145803 -9156813 -9102774 -9062008 -9050879 -9154959 -9227046 -9320288 -9418991 -9457623 -9529056 -9495510
11206 -9495510 -9484852 -9462227 -9452684 -9538704 -9488102 -9334380 -9374706 -9324042 -9213099 -9234167 -9307132
11195 -9307132 -9309058 -9252362 -9149828 -9064075 -9082130 -9093144 -9120761 -9077211 -8945565 -8910616 -8914966
11184 -8914966 -8910349 -8820542 -8812733 -8835141 -8813933 -8765052 -8699014 -8742321 -8782285 -8766915 -8678392 -8657406
11172 -8657406 -8695835 -8633110 -8591036 -8621792 -8557630 -8584037 -8572942 -8527957 -8611727 -8643155 -8619266
11161 -8619266 -8612012 -8572514 -8511496 -8507344 -8538463 -8491908 -8463704 -8440080 -8428150 -8429627 -8426228 -8489144
11149 -8489144 -8492009 -8395413 -8377921 -8303758 -8336093 -8332677 -8226561 -8216399 -8241841 -8229474 -8266099
11138 -8266099 -8192129 -8130899 -8162778 -8165875 -8179388 -8214400 -8169585 -8122696 -8074709 -7998230 -7992882 -7982690
11126 -7982690 -7999492 -7991719 -7987712 -7939787 -7961357 -7986221 -7903774 -7877290 -7908910 -7888602 -7857075 -7837317
11114 -7837317 -7754669 -7683070 -7709455 -7698160 -7700551 -7708454 -7711228 -7755744 -7793788 -7732741 -7732123 -7747361
11102 -7747361 -7794617 -7820765 -7729423 -7655661 -7631455 -7574874 -7542935 -7503837 -7465434 -7447704 -7466344
11091 -7466344 -7426747 -7482910 -7569817 -7585616 -7603717 -7601144 -7532710 -7510767 -7464428 -7410551 -7407185 -7426806
11079 -7426806 -7474428 -7498386 -7501185 -7474869 -7410147 -7390182 -7371511 -7397970 -7426209 -7351201 -7332952
11068 -7332952 -7332067 -7305011 -7301207 -7312598 -7316790 -7280854 -7256815 -7281365 -7260067 -7311572 -7308766 -7317685
11056 -7317685 -7375689 -7347814 -7262031 -7198535 -7178318 -7213086 -7198806 -7160321 -7151075 -7150314 -7134891 -7052133
11044 -7052133 -7057226 -7097646 -7066465 -7088262 -7151400 -7159810 -7093818 -7050969 -7058165 -7106387 -7073726 -7066279
11032 -7066279 -7029202 -7027864 -7014977 -7014764 -7019247 -7042555 -7066224 -7072411 -7134766 -6995666 -6800885 -6760062
11020 -6760062 -6900495 -6895747 -6888448 -6928833 -6877470 -6821074 -6844534 -6855454 -6786240 -6765962 -6764909 -6828635
11008 -6828635 -6809038 -6802873 -6847506 -6884272 -6818270 -6790796 -6812232 -6779597 -6672575 -6601628 -6671514
10997 -6671514 -6750462 -6768045 -6719845 -6763447 -6665705 -6611229 -6629342 -6556078 -6557521 -6595359 -6528926
10986 -6528926 -6529095 -6617309 -6607484 -6557485 -6505323 -6484443 -6519597 -6590526 -6524041 -6551730 -6566210 -6529944
10974 -6529944 -6530478 -6525717 -6543494 -6512675 -6519856 -6583543 -6677603 -6722856 -6622479 -6534848 -6486182 -6452918
10962 -6452918 -6392119 -6328920 -6291302 -6381058 -6483450 -6472764 -6397983 -6392377 -6368711 -6323762 -6309169
10951 -6309169 -6377288 -6308433 -6200271 -6188623 -6203229 -6236997 -6238971 -6248327 -6288833 -6330041 -6384932
10940 -6384932 -6389236 -6317477 -6189894 -6212239 -6278615 -6309380 -6232199 -6158800 -6179078 -6224803 -6216020
10929 -6216020 -6186350 -6204411 -6224977 -6272919 -6306320 -6197793 -6129087 -6106007 -6079054 -6059769 -6210747
10918 -6210747 -6293807 -6273939 -6277493 -6271380 -6247098 -6231596 -6264880 -6214827 -6151866 -6126793 -6029371 -5981842
10906 -5981842 -6050744 -6080744 -6118684 -6109752 -6060074 -6048040 -6050811 -6131399 -6093455 -5963542 -5945482
10895 -5945482 -5911395 -5880374 -5953880 -6015479 -5989494 -5972147 -5990053 -5905705 -5859031 -5861505 -5872475
10884 -5872475 -5904148 -5832233 -5798151 -5786153 -5837205 -5899558 -5973975 -5965913 -5918266 -5814914 -5802867
10873 -5802867 -5863513 -5807000 -5762606 -5715809 -5732072 -5744572 -5689733 -5705682 -5730857 -5651881 -5606827
10862 -5606827 -5767191 -5775312 -5794858 -5758861 -5734856 -5711160 -5673314 -5601650 -5614708 -5650861 -5667268
10851 -5667268 -5648915 -5590661 -5584773 -5616066 -5677028 -5672776 -5559740 -5473051 -5426202 -5363661 -5404853
10840 -5404853 -5514887 -5669318 -5607929 -5530489 -5555279 -5536146 -5568473 -5479665 -5429858 -5530687 -5597656
10829 -5597656 -5673363 -5604041 -5553437 -5564766 -5644943 -5660866 -5545754 -5405884 -5372716 -5370807 -5401173
10818 -5401173 -5427539 -5416241 -5456829 -5431567 -5392803 -5457347 -5496643 -5506908 -5512997 -5467949 -5341762
10807 -5341762 -5357095 -5362367 -5467711 -5535318 -5599030 -5636410 -5623750 -5560082 -5499287 -5374196 -5284402
10796 -5284402 -5297918 -5304972 -5293307 -5334877 -5371799 -5327319 -5306370 -5320495 -5389717 -5429655 -5412294
10785 -5412294 -5305201 -5260598 -5264992 -5282157 -5331508 -5266602 -5289299 -5252541 -5248364 -5247162 -5261987 -5249905
10773 -5249905 -5293683 -5313915 -5325033 -5366128 -5351104 -5289340 -5196531 -5161663 -5110333 -5063604 -5110463
10762 -5110463 -5185285 -5250108 -5250006 -5174929 -5153024 -5255955 -5284731 -5232622 -5237625 -5229045 -5269484 -5211653
10750 -5211653 -5221700 -5244783 -5281060 -5355515 -5365595 -5391746 -5308692 -5245941 -5282688 -5360157 -5354055
10739 -5354055 -5286106 -5213290 -5171823 -5152255 -5136046 -5149594 -5122685 -5074040 -5055576 -5156616 -5183371
10728 -5183371 -5125887 -5152052 -5086591 -5053762 -5039661 -5003335 -4952944 -4937930 -4906217 -4920064 -4939565
10717 -4939565 -4948438 -4936495 -4898184 -4948032 -4983152 -4966012 -5003084 -4945788 -4911940 -5009661 -5062437
10706 -5062437 -5063308 -5010890 -4981113 -4904714 -4933713 -5040728 -5047620 -4994301 -4992110 -4960054 -4861166 -4850798
10694 -4850798 -4947911 -4921869 -4981177 -5044083 -5137078 -5103477 -5072028 -5024795 -4963914 -4867105 -4863887
10683 -4863887 -4975251 -5041485 -5044819 -5020323 -4924589 -4888182 -4884032 -4936948 -4964261 -4935511 -4826964
10672 -4826964 -4751514 -4772792 -4820445 -4769063 -4722466 -4732768 -4756090 -4858886 -4844316 -4762728 -4712754
10661 -4712754 -4710776 -4786314 -4764298 -4735847 -4730916 -4696905 -4683053 -4672471 -4707154 -4754255 -4752521 -4709327
10649 -4709327 -4621551 -4480768 -4489788 -4657035 -4694221 -4680746 -4640426 -4646646 -4668672 -4604583 -4562207
10638 -4562207 -4637697 -4685910 -4737458 -4783142 -4800106 -4742088 -4710242 -4696543 -4631613 -4612439 -4648247
10627 -4648247 -4673741 -4643642 -4637064 -4633560 -4581225 -4565825 -4606507 -4569427 -4586881 -4639419 -4626901 -4630281
10615 -4630281 -4589986 -4652359 -4601272 -4564746 -4612584 -4609554 -4612411 -4668595 -4681083 -4691759 -4626936 -4605385
10603 -4605385 -4553075 -4497469 -4551390 -4614758 -4629688 -4597312 -4513066 -4540376 -4571180 -4529369 -4501461
10592 -4501461 -4551951 -4620430 -4579769 -4563435 -4569994 -4584286 -4588336 -4569701 -4590133 -4645782 -4718834 -4736583
10580 -4736583 -4756291 -4699310 -4652992 -4642874 -4646884 -4658922 -4683534 -4660961 -4620456 -4607951 -4704076
10569 -4704076 -4634151 -4501727 -4440769 -4518960 -4595107 -4616171 -4586655 -4613270 -4620396 -4588736 -4572460
10558 -4572460 -4531813 -4617420 -4665178 -4636430 -4555039 -4494576 -4436602 -4505254 -4553130 -4560370 -4530600
10547 -4530600 -4469019 -4458825 -4454067 -4549265 -4540270 -4450695 -4459480 -4468412 -4423214 -4379750 -4291776 -4350679
10535 -4350679 -4357451 -4415736 -4475217 -4452476 -4340243 -4331889 -4397513 -4463233 -4530043 -4523077 -4512650 -4485540
10523 -4485540 -4425099 -4380818 -4379091 -4377485 -4371568 -4376753 -4404681 -4414374 -4384096 -4305645 -4381234 -4422931
10511 -4422931 -4448914 -4419282 -4337180 -4302070 -4308615 -4264982 -4299895 -4325158 -4313294 -4288768 -4317528
10500 -4317528 -4393813 -4329874 -4354744 -4364504 -4354072 -4345262 -4293519 -4222450 -4227566 -4217059 -4274626 -4290194
10488 -4290194 -4276448 -4335656 -4392248 -4427048 -4402877 -4276346 -4222447 -4197361 -4164517 -4156697 -4168764
10477 -4168764 -4140524 -4167030 -4147279 -4176190 -4210146 -4185440 -4175776 -4079453 -4049566 -4054905 -3999951 -3990292
10465 -3990292 -4001954 -4120740 -4163660 -4240850 -4290738 -4232859 -4172594 -4309079 -4344605 -4262920 -4216153
10454 -4216153 -4109105 -4115081 -4122084 -4140051 -4106012 -4131352 -4193136 -4191001 -4129356 -4094935 -4038111 -4021605
10442 -4021605 -4076321 -4113411 -4073303 -4025808 -4127442 -4168061 -4202159 -4211175 -4077574 -3977279 -3994394
10431 -3994394 -3999350 -4035609 -4194873 -4283078 -4198921 -4130359 -4076447 -4049081 -4068012 -4093271 -4071877
10420 -4071877 -4170724 -4142871 -4160428 -4158298 -4120821 -4075266 -4019150 -4053268 -4115627 -4089825 -3893825
10409 -3893825 -3927994 -4048101 -4037464 -3980667 -3915223 -3944605 -3983857 -3902358 -3908749 -3923827 -3909365
10398 -3909365 -3902443 -3902004 -3957511 -3970989 -3973930 -3956807 -4013988 -3995391 -4077282 -4095523 -4130138 -4139427
10386 -4139427 -4083993 -4057738 -3992011 -3985048 -4007236 -4019582 -3996948 -3978665 -3987082 -3977450 -3982884 -4006020
10374 -4006020 -3943948 -3900918 -3965297 -3976572 -3907581 -3904902 -3918470 -3883414 -3914696 -3981339 -4027589
10363 -4027589 -3893592 -3833913 -3903592 -3914941 -3863215 -3816579 -3842178 -3918943 -3857047 -3797299 -3758944
10352 -3758944 -3818323 -3796592 -3764964 -3756615 -3762148 -3801886 -3837276 -3786447 -3741828 -3846040 -3959930
10341 -3959930 -3961390 -3952610 -3925368 -3885817 -3879517 -3862874 -3796908 -3750578 -3804694 -3850144 -3856251 -3840366
10329 -3840366 -3850974 -3873782 -3842503 -3789624 -3831946 -3856204 -3857111 -3858715 -3813117 -3792595 -3853326 -3861416
10317 -3861416 -3856435 -3882843 -3888793 -3837050 -3828762 -3723397 -3675173 -3719159 -3680888 -3667349 -3605898 -3590570
10305 -3590570 -3683767 -3703251 -3746828 -3861479 -3856964 -3784835 -3640082 -3560667 -3592878 -3667508 -3770280
10294 -3770280 -3809611 -3826392 -3782265 -3743551 -3753165 -3727421 -3728647 -3798044 -3845056 -3857141 -3738190
10283 -3738190 -3737067 -3709155 -3640078 -3672085 -3672104 -3709551 -3746039 -3747395 -3730701 -3753362 -3739403 -3758398
10271 -3758398 -3709934 -3675766 -3750728 -3736576 -3699467 -3668047 -3685342 -3684490 -3769757 -3745245 -3723282 -3661567
10259 -3661567 -3659686 -3661751 -3652879 -3624566 -3623411 -3724753 -3797204 -3724557 -3608909 -3642026 -3602474 -3623183
10247 -3623183 -3653181 -3630964 -3538454 -3470209 -3413715 -3441154 -3591304 -3543722 -3490002 -3523958 -3535020
10236 -3535020 -3468038 -3524738 -3543956 -3506169 -3520917 -3518217 -3542374 -3526359 -3519092 -3560564 -3536109 -3561005
10224 -3561005 -3693069 -3706190 -3631901 -3559926 -3521696 -3459205 -3427387 -3470211 -3464539 -3547336 -3612792
10213 -3612792 -3591454 -3556477 -3511037 -3509773 -3465459 -3433049 -3397698 -3384164 -3474572 -3545941 -3508133
10202 -3508133 -3462681 -3452265 -3478388 -3564798 -3549519 -3499787 -3604005 -3606960 -3479243 -3387587 -3438848
10191 -3438848 -3478512 -3395500 -3396864 -3345898 -3327636 -3379907 -3361272 -3419540 -3409608 -3431559 -3423151 -3337230
10179 -3337230 -3408282 -3451278 -3454687 -3468297 -3530508 -3477146 -3507791 -3556394 -3513467 -3380362 -3323018
10168 -3323018 -3354506 -3386824 -3440414 -3408143 -3378061 -3381327 -3458498 -3491890 -3484804 -3553351 -3595588 -3573614
10156 -3573614 -3501293 -3428956 -3395594 -3356852 -3353442 -3444933 -3500720 -3491677 -3427353 -3339410 -3261287 -3283667
10144 -3283667 -3389220 -3402216 -3436891 -3438765 -3300126 -3279221 -3307978 -3313948 -3303026 -3278721 -3345984
10133 -3345984 -3448852 -3475700 -3463718 -3454983 -3425016 -3385629 -3384691 -3413399 -3435630 -3382023 -3322373 -3432913
10121 -3432913 -3426616 -3510699 -3448605 -3398400 -3374189 -3367961 -3401941 -3410873 -3378891 -3430708 -3480072 -3485060
10109 -3485060 -3444534 -3365092 -3330160 -3327108 -3354446 -3386532 -3405950 -3361494 -3354526 -3341750 -3324147 -3309856
10097 -3309856 -3351639 -3296834 -3275855 -3297452 -3284490 -3307249 -3353993 -3313842 -3295674 -3295666 -3310559 -3314757
10085 -3314757 -3300566 -3301815 -3255415 -3301925 -3307884 -3290468 -3279504 -3211104 -3112597 -3109012 -3161318 -3175340
10073 -3175340 -3143549 -3145152 -3098207 -3093756 -3066656 -3094675 -3143250 -3142515 -3080164 -3046560 -3063741 -3122857
10061 -3122857 -3083900 -3083682 -3189728 -3238440 -3316679 -3336823 -3361264 -3391862 -3344662 -3218911 -3125453
10050 -3125453 -3134052 -3233345 -3271278 -3292258 -3399843 -3415030 -3373496 -3293316 -3310111 -3350709 -3368708
10039 -3368708 -3410304 -3411805 -3327047 -3272452 -3280958 -3278625 -3234249 -3210404 -3287702 -3247420 -3258440 -3300991
10027 -3300991 -3219353 -3181153 -3201146 -3263552 -3270768 -3231889 -3170486 -3110541 -3116633 -3139241 -3202018 -3207187
10015 -3207187 -3199577 -3205764 -3186228 -3163730 -3152322 -3095767 -3081758 -3022272 -3035279 -3076097 -3071119 -3043630
10003 -3043630 -3038119 -3064079 -3054436 -3096821 -3114240 -3092848 -3073625 -3091574 -3073804 -3099781 -3150971 -3141965
9991 -3141965 -3142156 -3155647 -3139873 -3099948 -3042354 -3095586 -3131432 -3127753 -3146917 -3156089 -3158938 -3184801
9979 -3184801 -3170813 -3097179 -2977241 -2979593 -2944038 -2898554 -2851498 -2976499 -3009868 -2935548 -2946540
9968 -2946540 -2959663 -2982592 -3128309 -3079270 -2994453 -3095303 -3124642 -3102919 -3122194 -3115892 -3112308
9957 -3112308 -3037029 -3028176 -2992983 -3041154 -3076912 -3015908 -3023915 -3043500 -3054311 -3016344 -3029634 -3046239
9945 -3046239 -3055084 -3021532 -3027498 -3050618 -3012191 -3049270 -3117554 -3125383 -3127264 -3110674 -3089229 -3025362
9933 -3025362 -3021225 -3077743 -3057981 -2951959 -2940732 -2932351 -2923481 -2973501 -2936069 -2909670 -2933333 -2927640
9921 -2927640 -2890297 -2846965 -2878800 -2947634 -3072548 -3055429 -3092163 -3056405 -3019088 -3077105 -2990404
9910 -2990404 -2906693 -2891595 -2906221 -2908722 -2958170 -2957725 -2975583 -2927387 -2920627 -2980432 -2949049 -2826458
9898 -2826458 -2879576 -2882196 -2850856 -2839943 -2890717 -2989701 -2966861 -2894343 -2826398 -2828817 -2892565 -2948823
9886 -2948823 -2940590 -2922879 -3007588 -3049999 -2950845 -2966623 -3033738 -3044514 -2972409 -2936689 -2952058 -2949981
9874 -2949981 -2854389 -2840409 -2920662 -2878699 -2859734 -2741759 -2757928 -2745602 -2772948 -2784270 -2770342
9863 -2770342 -2812101 -2814336 -2743935 -2766671 -2815778 -2802883 -2797967 -2859707 -2938347 -2993885 -3031009 -3016734
9851 -3016734 -2927372 -2899367 -2839145 -2833469 -2860267 -2853018 -2866559 -2908692 -2972255 -3019541 -2941641 -2833741
9839 -2833741 -2745444 -2685732 -2708577 -2702631 -2687117 -2678185 -2699111 -2774998 -2709842 -2699011 -2735831 -2709471
9827 -2709471 -2729177 -2815938 -2784308 -2761903 -2778266 -2717282 -2712855 -2717426 -2776865 -2790114 -2776909 -2763819
9815 -2763819 -2827905 -2867410 -2836958 -2826499 -2759068 -2729395 -2704530 -2654303 -2692152 -2728973 -2742408
9804 -2742408 -2752383 -2765196 -2806310 -2790728 -2828315 -2770822 -2786933 -2791080 -2717923 -2767303 -2837475 -2838232
9792 -2838232 -2763645 -2744437 -2817539 -2798132 -2764602 -2795291 -2852551 -2818713 -2761612 -2766958 -2711093 -2660764
9780 -2660764 -2629339 -2646825 -2611479 -2572805 -2636455 -2595430 -2653560 -2728073 -2725878 -2740707 -2741215 -2732872
9768 -2732872 -2681036 -2705357 -2701944 -2728774 -2658270 -2611328 -2683145 -2656394 -2573048 -2614246 -2679068 -2667031
9756 -2667031 -2653086 -2616479 -2683046 -2718136 -2729500 -2698418 -2801527 -2766281 -2717235 -2794688 -2740038
9745 -2740038 -2645682 -2611963 -2586967 -2560763 -2549814 -2626166 -2681654 -2737551 -2644714 -2607970 -2652768
9734 -2652768 -2713276 -2739948 -2701826 -2736709 -2698932 -2606627 -2570666 -2589321 -2667044 -2681818 -2589315
9723 -2589315 -2545046 -2580611 -2571300 -2555649 -2610257 -2677556 -2602893 -2566879 -2516505 -2503503 -2447940 -2483666
9711 -2483666 -2476186 -2468254 -2536521 -2681754 -2651218 -2530788 -2513136 -2553265 -2609426 -2631455 -2626263 -2558018
9699 -2558018 -2534067 -2612752 -2608821 -2563215 -2565571 -2565662 -2495367 -2477780 -2505858 -2528149 -2541732 -2554662
9687 -2554662 -2544529 -2658429 -2623772 -2486885 -2434592 -2458876 -2533130 -2633289 -2618447 -2573259 -2604566
9676 -2604566 -2613670 -2557788 -2470128 -2493318 -2532842 -2506944 -2521688 -2527381 -2534565 -2484723 -2531182 -2440994
9664 -2440994 -2385816 -2400340 -2443179 -2444410 -2458071 -2482608 -2424771 -2423977 -2422991 -2396505 -2413670 -2440186
9652 -2440186 -2389089 -2376954 -2350958 -2265334 -2291506 -2381447 -2452151 -2534369 -2486761 -2440904 -2409485
9641 -2409485 -2424870 -2467336 -2440325 -2394353 -2370218 -2446631 -2440985 -2397296 -2454142 -2420733 -2397408 -2452677
9629 -2452677 -2467373 -2451171 -2488816 -2504444 -2460400 -2404780 -2410540 -2425899 -2470988 -2457792 -2467986 -2477043
9617 -2477043 -2387019 -2366356 -2320143 -2291262 -2381312 -2327490 -2297142 -2312303 -2335761 -2450043 -2494428
9606 -2494428 -2482355 -2539629 -2515081 -2426869 -2413578 -2356269 -2271441 -2208955 -2215672 -2238245 -2332771 -2388049
9594 -2388049 -2377802 -2394498 -2325899 -2251617 -2146284 -2216746 -2308714 -2301563 -2274103 -2221206 -2243535
9583 -2243535 -2263863 -2327290 -2381331 -2362706 -2330539 -2306136 -2343108 -2405759 -2444243 -2428513 -2345848
9572 -2345848 -2269496 -2311598 -2322908 -2274468 -2224456 -2205251 -2160199 -2188960 -2259778 -2245924 -2175307
9561 -2175307 -2107748 -2195285 -2307100 -2297388 -2249724 -2141003 -2147763 -2183609 -2215528 -2172430 -2157564
9550 -2157564 -2157220 -2166169 -2159948 -2192950 -2227651 -2198397 -2172921 -2123941 -2171431 -2253926 -2233014 -2216757
9538 -2216757 -2267433 -2322590 -2249012 -2172856 -2183792 -2217101 -2160238 -2143274 -2122888 -2068459 -2020128
9527 -2020128 -2084973 -2116818 -2208853 -2245450 -2171644 -2096144 -2078157 -2078239 -2228737 -2260029 -2233160 -2170859
9515 -2170859 -2149601 -2171458 -2165748 -2142094 -2128104 -2218619 -2275281 -2225386 -2174254 -2154618 -2180334 -2256415
9503 -2256415 -2195176 -2199297 -2207670 -2209171 -2155765 -2153384 -2211969 -2203286 -2126670 -2172030 -2301798 -2275659
9491 -2275659 -2117622 -2054668 -2095140 -2090360 -2025673 -2086303 -2107043 -2101322 -2114904 -2099968 -2091262 -2126829
9479 -2126829 -2134286 -2096912 -2073717 -2065701 -2019435 -1966365 -1917462 -1911724 -1944639 -1954613 -2014254 -1955736
9467 -1955736 -1918685 -1927446 -1910439 -1868138 -1874660 -1916516 -1960443 -1981320 -2021685 -2122144 -2099594 -1976186
9455 -1976186 -1931615 -1897839 -1893340 -1955226 -1979464 -1954601 -2004153 -1986687 -1943201 -1975916 -1947964 -1863354
9443 -1863354 -1812158 -1875778 -1867251 -1897900 -1934346 -1883381 -1817614 -1895109 -1927712 -1927661 -1942654 -1910251
9431 -1910251 -1871412 -1822942 -1795759 -1835466 -1820945 -1875547 -1841734 -1820905 -1751728 -1707568 -1828275
9420 -1828275 -1926175 -1883357 -1868351 -1928974 -1877496 -1849212 -1870365 -1785803 -1828229 -1891461 -1835408
9409 -1835408 -1817567 -1835846 -1785948 -1699928 -1682042 -1728345 -1740587 -1704812 -1745462 -1749367 -1768993 -1712713
9397 -1712713 -1623913 -1625755 -1533515 -1559699 -1671064 -1653050 -1674511 -1664634 -1645807 -1654399 -1685635 -1752557
9385 -1752557 -1826483 -1805231 -1774583 -1761282 -1775893 -1753347 -1679820 -1701002 -1662569 -1618171 -1580111
9374 -1580111 -1541956 -1659499 -1703090 -1637626 -1605353 -1626484 -1618273 -1622918 -1554475 -1485280 -1451614 -1474577
9362 -1474577 -1511567 -1542362 -1578886 -1669350 -1747884 -1684903 -1541420 -1571184 -1628223 -1621048 -1607373
9351 -1607373 -1582198 -1552899 -1592908 -1511694 -1515423 -1530388 -1512799 -1550034 -1457440 -1494862 -1479521 -1482088
9339 -1482088 -1506137 -1543458 -1420648 -1454025 -1503118 -1482056 -1475550 -1478122 -1510261 -1535209 -1449618 -1443175
9327 -1443175 -1308167 -1195601 -1226337 -1336208 -1396874 -1469259 -1497065 -1495409 -1513910 -1512443 -1491206
9316 -1491206 -1456039 -1381389 -1354988 -1349808 -1266518 -1294944 -1312731 -1273166 -1380895 -1364617 -1220716
9305 -1220716 -1087352 -1107921 -1116377 -1104550 -1140512 -1177909 -1226816 -1359160 -1419316 -1402150 -1423277
9294 -1423277 -1380870 -1324641 -1324040 -1230928 -1104218 -1085428 -1076629 -1033140 -1051874 -1107769 -1128161 -1088073
9282 -1088073 -1071237 -1095621 -1066687 -1063912 -1124774 -1186710 -1090895 -981422 -985313 -1034004 -1037664 -931463
9270 -931463 -914209 -1028519 -922012 -870443 -875134 -838162 -839715 -901099 -881092 -864971 -883287 -835780
9258 -835780 -874977 -860083 -851698 -768095 -689958 -754140 -791791 -801025 -870889 -868297 -802890 -745086
9246 -745086 -759559 -738488 -781943 -780607 -689890 -583585 -626060 -535793 -509578 -506958 -555279 -491678
9234 -491678 -446163 -511442 -519545 -378148 -304094 -263827 -326648 -381020 -334888 -322062 -382943 -321457
9222 -321457 -344261 -407964 -379258 -331498 -354235 -364559 -300491 -226983 -140764 -133987 -65515 -84164
9210 -84164 -91076 -75560 -73072 -150774 -143260 -103766 -40251 105037 125498 19529 97662 163371
9198 163371 195117 290611 294097 334544 380873 428235 419316 364510 434950 475731 538723 539571
9186 539571 530558 568385 583087 545707 577399 716047 750131 795962 827215 881261 922239 916980
9174 916980 946090 1004245 1077628 1114819 1179303 1256975 1245247 1264152 1371125 1437408 1535495
9163 1535495 1559480 1685952 1704902 1626783 1643504 1799555 1898832 2015086 2097901 2142228 2065221
9152 2065221 2169425 2367291 2450712 2497057 2637838 2739150 2812632 2864647 3053102 3228650
9142 3228650 3323688 3448395 3506376 3534247 3730008 3920903 4079201 4277104 4451333 4620895
9132 4620895 4683570 4836380 5057617 5313382 5614938 5793188 5998167 6196643 6511711 6889153
9122 6889153 7160561 7486567 7953117 8296310 8633288 9094587 9648271 10241204 10832567 11408679
9112 11408679 12019936 12710060 13413907 14274527 15141847 16091031 17155316 18276892 19426957
9103 19426957 20489289 21470305 22189666 22294025 21553836 19382233 15283881 9183627 1529944
9094 1529944 -6714646 -14226597 -19892277 -23550854 -25482727 -26129184 -26051793 -25387812 -24410943
9085 -24410943 -23453198 -22459444 -21386457 -20491101 -19659611 -18852036 -18075074 -17398799 -16712749
9076 -16712749 -16056212 -15382069 -14855820 -14360994 -13899655 -13574826 -13135917 -12732008 -12430672
9067 -12430672 -12077305 -11771179 -11500451 -11247360 -10959997 -10691814 -10464056 -10221742 -9946643
9058 -9946643 -9651734 -9492485 -9387010 -9180064 -8973727 -8797573 -8602920 -8524098 -8332208 -8138289
9048 -8138289 -8107398 -8143986 -8106470 -7966890 -7865867 -7810129 -7710972 -7582318 -7475954 -7387132 -7286035
9037 -7286035 -7139102 -6982572 -6873980 -6793723 -6775143 -6692643 -6661293 -6645780 -6522310 -6387318
9027 -6387318 -6370883 -6339684 -6307737 -6289470 -6284564 -6203524 -6150647 -6217776 -6170520 -5960393 -5837838
9016 -5837838 -5813415 -5761274 -5718241 -5721134 -5702650 -5741919 -5748035 -5649095 -5542647 -5500559 -5508418 -5405989
9004 -5405989 -5323237 -5265313 -5197812 -5160484 -5197516 -5158007 -5123373 -5144156 -5129149 -5079591 -5099961
8993 -5099961 -5150985 -5131427 -5043627 -5029006 -4979104 -4892319 -4799646 -4789893 -4755815 -4741134 -4796782 -4784610
8981 -4784610 -4746277 -4720917 -4718637 -4735298 -4695888 -4658131 -4647668 -4660682 -4617863 -4608170 -4569219 -4521709
8969 -4521709 -4446273 -4347254 -4320471 -4346964 -4400694 -4391278 -4407703 -4471301 -4462542 -4403048 -4399771 -4388137
8957 -4388137 -4354685 -4385268 -4400764 -4349253 -4255831 -4190068 -4173633 -4093877 -4123809 -4134014 -4033161
8946 -4033161 -3999065 -4007274 -4080794 -4121350 -4152278 -4060667 -4028713 -4137204 -4182572 -4139840 -4110578
8935 -4110578 -4160309 -4072518 -4068279 -4004035 -4007639 -4037547 -3962199 -3923052 -3851341 -3871627 -3942666 -3886703
8923 -3886703 -3912108 -4041870 -3930268 -3804336 -3741589 -3699704 -3764340 -3861178 -3900742 -3799109 -3826977
8912 -3826977 -3913623 -3896800 -3872992 -3817711 -3777610 -3744998 -3779835 -3842542 -3773871 -3637364 -3673640
8901 -3673640 -3672031 -3651122 -3702743 -3737191 -3692591 -3647026 -3688884 -3623727 -3541278 -3509741 -3468848 -3451989
8889 -3451989 -3402276 -3401785 -3365069 -3426203 -3485649 -3552498 -3482141 -3470189 -3478100 -3406296 -3428333 -3437842
8877 -3437842 -3389909 -3340671 -3368424 -3421806 -3366602 -3301257 -3290555 -3266912 -3195302 -3144525 -3133212
8866 -3133212 -3098771 -3181666 -3425012 -3783788 -3904696 -3778078 -3689688 -3636718 -3608593 -3605341 -3556189
8855 -3556189 -3492157 -3548460 -3570755 -3593457 -3523919 -3461121 -3414766 -3423846 -3364158 -3247307 -3251995 -3270431
8843 -3270431 -3288294 -3320095 -3367166 -3345207 -3368968 -3372753 -3377640 -3388809 -3380672 -3338371 -3346831 -3300893
8831 -3300893 -3230998 -3260852 -3282709 -3256195 -3236302 -3228343 -3181664 -3214548 -3240443 -3174381 -3090204 -3052883
8819 -3052883 -3092112 -3185503 -3207850 -3213466 -3204119 -3235111 -3268979 -3244328 -3258894 -3249279 -3216481 -3175353
8807 -3175353 -3037268 -2954321 -2977420 -2978483 -3006441 -2973803 -2941014 -3022837 -3084009 -3054387 -3060996 -3131689
8795 -3131689 -3191627 -3180206 -3181195 -3164206 -3182703 -3214262 -3166922 -3111161 -3095463 -3043820 -3036551 -3030492
8783 -3030492 -2927509 -2978605 -3046001 -3052587 -3050892 -3082070 -2974548 -2923580 -2963572 -3009571 -3057422
8772 -3057422 -3071985 -3034363 -2908443 -2948173 -2941109 -2909610 -2894113 -2894674 -2937107 -2982498 -2993829 -2972164
8760 -2972164 -2861001 -2878856 -2853995 -2874702 -2933529 -2955694 -2939115 -2956359 -2939555 -2910623 -2882156
8749 -2882156 -2899244 -2847217 -2830725 -2844914 -2766672 -2714577 -2695125 -2745159 -2839981 -2809111 -2849242
8738 -2849242 -2856845 -2748683 -2695334 -2759155 -2724962 -2696730 -2669190 -2669363 -2754976 -2832336 -2953628 -2908892
8726 -2908892 -2772090 -2708554 -2761859 -2784286 -2793094 -2731470 -2669853 -2717409 -2794671 -2792535 -2814728 -2803426
8714 -2803426 -2863020 -2832509 -2866079 -2898563 -2866228 -2771901 -2704013 -2699582 -2830209 -2936849 -2853467
8703 -2853467 -2799274 -2802577 -2894749 -2993115 -3013549 -2968621 -2888883 -2822309 -2797750 -2735230 -2740302 -2713622
8691 -2713622 -2631453 -2530510 -2618968 -2753339 -2757911 -2671189 -2589707 -2575120 -2612803 -2681980 -2626359
8680 -2626359 -2572110 -2547833 -2595529 -2678577 -2665581 -2604315 -2578819 -2701963 -2808742 -2738307 -2618057
8669 -2618057 -2537403 -2548934 -2541497 -2558762 -2594798 -2527291 -2482145 -2474648 -2417996 -2404519 -2484965 -2531447
8657 -2531447 -2562497 -2530737 -2548542 -2603614 -2572743 -2500770 -2482894 -2487853 -2488892 -2507346 -2556988 -2592627
8645 -2592627 -2572248 -2454965 -2466353 -2572135 -2533651 -2520483 -2544275 -2461743 -2428792 -2431625 -2402496
8634 -2402496 -2417602 -2440305 -2444029 -2444063 -2401373 -2459408 -2460165 -2471010 -2429188 -2380429 -2407455 -2371971 -2353698
8621 -2353698 -2345398 -2400839 -2513124 -2559635 -2540609 -2530782 -2626139 -2680301 -2726053 -2690127 -2723581 -2783530
8609 -2783530 -2786397 -2880335 -3000075 -2933798 -2832885 -2899271 -2857817 -2839007 -2856261 -2837922 -2825701
8598 -2825701 -2894534 -2991104 -3137076 -3161016 -3119086 -3143536 -3173006 -3151782 -3062479 -3061715 -3144309 -3272597
8586 -3272597 -3277689 -3315971 -3271696 -3233278 -3207593 -3178129 -3132090 -3048219 -2968236 -2965742 -2975523 -2938591
8574 -2938591 -2913635 -2916257 -2939808 -3008640 -2956566 -3023188 -3007750 -2942731 -2896786 -3003737 -3075063
8563 -3075063 -3076241 -3002015 -2913239 -2890774 -2935468 -2930751 -2922815 -2860872 -2822351 -2801836 -2837823 -2868805
8551 -2868805 -2843796 -2769639 -2705532 -2686222 -2635771 -2654316 -2724110 -2746903 -2644961 -2597648 -2641062
8540 -2641062 -2729222 -2770780 -2732720 -2781950 -2788577 -2717605 -2709647 -2715017 -2635568 -2590568 -2599890 -2636891
8528 -2636891 -2661827 -2630680 -2691135 -2817139 -2857329 -2969033 -2961881 -2961507 -2948991 -2807184 -2736487
8517 -2736487 -2749588 -2753227 -2781962 -2840967 -2825517 -2788697 -2617063 -2504715 -2563106 -2603180 -2567214
8506 -2567214 -2524850 -2477060 -2507235 -2467253 -2421206 -2411355 -2503712 -2514924 -2501960 -2584900 -2598722 -2643179
8494 -2643179 -2682084 -2682488 -2686506 -2621262 -2484169 -2506941 -2535894 -2503142 -2485266 -2523698 -2520593 -2401008
8482 -2401008 -2470779 -2650053 -2814914 -2870633 -2908763 -2894702 -2787510 -2727856 -2688578 -2799936 -2824414
8471 -2824414 -2827133 -2830842 -2777641 -2633795 -2710702 -2788281 -2744358 -2663839 -2575015 -2569893 -2609401 -2573608
8459 -2573608 -2576563 -2629757 -2683516 -2750072 -2798231 -2733860 -2661036 -2545195 -2480586 -2495477 -2524258
8448 -2524258 -2538295 -2566903 -2568707 -2524591 -2529340 -2472560 -2404841 -2419613 -2444011 -2499150 -2473445 -2496779
8436 -2496779 -2572663 -2620925 -2617753 -2572002 -2602144 -2665460 -2634310 -2614366 -2640310 -2583767 -2610174 -2678215
8424 -2678215 -2622260 -2571953 -2579257 -2606735 -2643827 -2485014 -2428227 -2493781 -2520356 -2546273 -2600680
8413 -2600680 -2611279 -2567228 -2545324 -2633812 -2626936 -2573643 -2576374 -2609021 -2729265 -2773009 -2672775
8402 -2672775 -2638578 -2548313 -2521773 -2628188 -2625612 -2531018 -2494454 -2547492 -2589433 -2615751 -2554400
8391 -2554400 -2506159 -2516442 -2452665 -2433669 -2413757 -2435622 -2411035 -2440976 -2457867 -2471547 -2474732 -2464676
8379 -2464676 -2587259 -2653380 -2656316 -2684895 -2770906 -2784686 -2632482 -2559308 -2593168 -2497030 -2379239
8368 -2379239 -2416168 -2494988 -2463538 -2420388 -2482947 -2489032 -2516904 -2561005 -2549691 -2520923 -2497545 -2575707
8356 -2575707 -2549338 -2423598 -2365916 -2458019 -2396956 -2485109 -2515507 -2537756 -2626739 -2685014 -2702961
8345 -2702961 -2608540 -2553443 -2544624 -2541035 -2537785 -2655524 -2663207 -2591295 -2558881 -2471879 -2417104 -2402710
8333 -2402710 -2486988 -2512863 -2448078 -2388934 -2369039 -2355525 -2346227 -2427497 -2461763 -2467904 -2447401 -2434914
8321 -2434914 -2483434 -2412155 -2311287 -2318772 -2363054 -2399685 -2416145 -2467910 -2414708 -2341761 -2327128
8310 -2327128 -2414541 -2503492 -2386638 -2346756 -2367381 -2356985 -2384257 -2496181 -2499767 -2421048 -2388589
8299 -2388589 -2443350 -2414927 -2428866 -2448278 -2359505 -2322196 -2339915 -2331679 -2379160 -2494470 -2531488
8288 -2531488 -2467345 -2479844 -2484175 -2451695 -2432483 -2408345 -2436483 -2451530 -2378290 -2369103 -2476082 -2487467
8276 -2487467 -2379320 -2259711 -2276523 -2292137 -2340247 -2308036 -2300355 -2227496 -2148997 -2268766 -2297904
8265 -2297904 -2285480 -2379349 -2380976 -2407730 -2390503 -2375436 -2358042 -2321858 -2296768 -2283679 -2242952 -2266956
8253 -2266956 -2332691 -2413465 -2315271 -2221653 -2287976 -2375578 -2385590 -2387445 -2387231 -2276254 -2266438 -2306595
8241 -2306595 -2370329 -2466041 -2435767 -2390514 -2352184 -2328755 -2334205 -2345021 -2333478 -2358254 -2300864 -2270238
8229 -2270238 -2294094 -2311851 -2329944 -2263997 -2224712 -2229845 -2263554 -2275255 -2240457 -2280302 -2285749 -2268459
8217 -2268459 -2268477 -2298081 -2347467 -2289597 -2221607 -2231081 -2235344 -2180419 -2152464 -2138047 -2211751 -2263186
8205 -2263186 -2296810 -2241820 -2236359 -2332600 -2311356 -2274636 -2242522 -2196958 -2253389 -2350141 -2311850 -2267297
8193 -2267297 -2279178 -2244720 -2271084 -2249230 -2228115 -2236454 -2260692 -2268840 -2262586 -2254437 -2180613 -2136285
8181 -2136285 -2187775 -2224901 -2295429 -2391216 -2424719 -2431628 -2312328 -2243423 -2193204 -2117617 -2132578
8170 -2132578 -2220363 -2316188 -2320999 -2315630 -2305746 -2255300 -2208003 -2165247 -2122620 -2129729 -2139720 -2108741
8158 -2108741 -2126044 -2159130 -2264383 -2368127 -2348365 -2321319 -2360777 -2423705 -2427582 -2394928 -2373410
8147 -2373410 -2369545 -2283235 -2215031 -2190659 -2236633 -2240493 -2232618 -2216556 -2166143 -2173856 -2071112 -2111233
8135 -2111233 -2243553 -2277667 -2237947 -2211183 -2155413 -2090242 -2094702 -2184279 -2171908 -2205679 -2211757 -2176827
8123 -2176827 -2110821 -1982614 -1964069 -2107749 -2169131 -2192006 -2174705 -2112750 -2089117 -2194474 -2290263
8112 -2290263 -2364781 -2486235 -2455726 -2348856 -2354124 -2302343 -2295970 -2287112 -2295839 -2253102 -2064387 -2045315
8100 -2045315 -2068851 -2079457 -2103174 -2167618 -2234091 -2213400 -2122304 -2084987 -2065518 -2047775 -2020804
8089 -2020804 -2063594 -2105556 -2165804 -2181683 -2072628 -2019055 -2000383 -1981543 -2070860 -2080433 -2169513
8078 -2169513 -2213238 -2207155 -2084686 -1967619 -1889458 -1925520 -1946741 -2028293 -2001242 -1965950 -2014438
8067 -2014438 -2036251 -2066612 -2022278 -1934654 -1994401 -1980176 -1923724 -1944084 -1935711 -1877087 -1781070 -1749667
8055 -1749667 -1789805 -1794426 -1772406 -1763486 -1750926 -1796061 -1877116 -1883612 -1891935 -1903395 -1932308 -1868367
8043 -1868367 -1852894 -1885133 -1823881 -1779009 -1889724 -1836934 -1861735 -1980472 -1978921 -2011039 -2021969
8032 -2021969 -1952974 -1915092 -1930181 -1949051 -1924005 -2054486 -2043566 -2014119 -1984610 -1961603 -1923214
8021 -1923214 -1878267 -1883130 -1904882 -1861645 -1822947 -1784244 -1717253 -1620635 -1597280 -1604505 -1558217 -1571113
8009 -1571113 -1543726 -1485982 -1514711 -1616380 -1761835 -2031599 -2247078 -2348856 -2440852 -2478661
7999 -2478661 -2469469 -2366744 -2250203 -2074367 -1944482 -1950649 -2025612 -2261478 -2577704 -2756284
7989 -2756284 -2677346 -2539606 -2520603 -2524118 -2453607 -2425629 -2392651 -2336861 -2341487 -2284845 -2239833 -2227427
7977 -2227427 -2172391 -2204783 -2218301 -2179943 -2217210 -2231606 -2048425 -2008023 -2005586 -1905173 -1872121
7966 -1872121 -1874076 -1860258 -1774835 -1720150 -1831868 -2109728 -2278907 -2410829 -2551601 -2600784 -2461610
7955 -2461610 -2329670 -2212497 -2133969 -2158695 -2334936 -2617297 -2735978 -2710769 -2702982 -2775888 -2731516
7944 -2731516 -2653538 -2604605 -2525526 -2551182 -2592216 -2576439 -2563220 -2585350 -2509456 -2406768 -2378653
7933 -2378653 -2380785 -2462770 -2480742 -2388542 -2351809 -2390040 -2353773 -2358399 -2404462 -2389003 -2297624 -2336787
7921 -2336787 -2349266 -2398639 -2432747 -2516704 -2532720 -2383271 -2429263 -2570748 -2651562 -2656449 -2568031
7910 -2568031 -2530214 -2571722 -2488591 -2488251 -2391523 -2298420 -2297806 -2338363 -2412929 -2368325 -2388202 -2391723
7898 -2391723 -2419002 -2482987 -2474973 -2412197 -2364075 -2401980 -2426979 -2375623 -2459500 -2482349 -2450431 -2404339
7886 -2404339 -2416679 -2449886 -2419126 -2377131 -2417268 -2418373 -2403326 -2443160 -2409268 -2476687 -2479701 -2475445
7874 -2475445 -2407209 -2331267 -2256982 -2267748 -2355641 -2425116 -2402519 -2354414 -2410249 -2427753 -2378240
7863 -2378240 -2389040 -2409976 -2423515 -2419974 -2432596 -2449673 -2435400 -2409995 -2396536 -2380451 -2274538
7852 -2274538 -2277629 -2335278 -2364263 -2397808 -2398094 -2438371 -2470551 -2445254 -2451832 -2419781 -2333733 -2307903
7840 -2307903 -2216659 -2162387 -2201589 -2190729 -2189382 -2193010 -2171506 -2192675 -2223150 -2277645 -2295315 -2292477
7828 -2292477 -2238977 -2235762 -2350602 -2306157 -2262094 -2335038 -2402965 -2370893 -2277868 -2266992 -2288576
7817 -2288576 -2212835 -2230851 -2280115 -2266797 -2330384 -2347807 -2373114 -2352005 -2323553 -2291105 -2237240
7806 -2237240 -2196339 -2267694 -2331161 -2301974 -2260847 -2187046 -2102989 -2144874 -2204132 -2284087 -2338088
7795 -2338088 -2226854 -2175756 -2207423 -2251771 -2298972 -2297477 -2238076 -2198457 -2261663 -2336853 -2358493
7784 -2358493 -2310054 -2294859 -2277453 -2236685 -2258357 -2263688 -2219971 -2236880 -2183379 -2258470 -2202797 -2125768
7772 -2125768 -2122804 -2123720 -2177666 -2184719 -2193234 -2204231 -2118734 -2192690 -2299529 -2228532 -2159681 -2132243
7760 -2132243 -2147154 -2169826 -2146909 -2132078 -2180494 -2147160 -2123013 -2181280 -2135648 -2142186 -2157899 -2223000
7748 -2223000 -2210821 -2155734 -2130624 -2065428 -1953825 -2033098 -2121017 -2134675 -2107085 -2158175 -2154734
7737 -2154734 -2183398 -2243374 -2258388 -2267328 -2143884 -2083361 -2072278 -2049991 -2092068 -2133923 -2141759 -2087293
7725 -2087293 -2106647 -2166611 -2169239 -2191118 -2194570 -2188270 -2157800 -2120281 -2167885 -2196396 -2117298 -2044569
7713 -2044569 -2034917 -2091587 -2057502 -2059990 -2085642 -2112689 -2082715 -2109162 -2100653 -2084021 -2113820 -2044269
7701 -2044269 -2053593 -2002746 -1989322 -2033891 -2045043 -2032185 -2116517 -2117323 -2133406 -2113509 -2107116 -2068280
7689 -2068280 -2080663 -2160793 -2151165 -2075653 -2102866 -2133185 -2152715 -2096036 -2099580 -2179804 -2170108 -2100327
7677 -2100327 -2018760 -2047842 -2039475 -2021948 -2070782 -2182384 -2148143 -1983621 -1909239 -1949607 -1992845
7666 -1992845 -2052039 -2126499 -2092753 -2038178 -2131013 -2130459 -2085362 -2081322 -2065400 -2077788 -2049798 -1957217
7654 -1957217 -2019974 -2018779 -1955550 -1993055 -1990115 -2017589 -2059578 -2053886 -2100988 -2111730 -2105626 -2123054
7642 -2123054 -2102707 -1974899 -2005796 -2004702 -1986912 -2006792 -2030313 -2079692 -2121771 -2095183 -2101385 -2041889
7630 -2041889 -1990396 -2099348 -2152875 -2158068 -2044977 -1968985 -2030135 -1996032 -1970483 -1951447 -1961193
7619 -1961193 -1998899 -1991472 -1973684 -2011251 -2049404 -2045036 -1967793 -2069545 -2126147 -2133273 -2164755 -2185011
7607 -2185011 -2129820 -2127261 -2124327 -2090754 -1981514 -1892899 -1866589 -1832523 -1880470 -1901322 -1981631 -2075960
7595 -2075960 -2010121 -1992307 -2008226 -2009099 -2096592 -2166177 -2174656 -2157338 -2127942 -2154748 -2061181 -1984926
7583 -1984926 -2016813 -2015300 -1974320 -1987623 -2070898 -2094680 -2134920 -2100196 -2044842 -1976094 -1980497 -1980902
7571 -1980902 -2035117 -2106456 -2112372 -2159852 -2136427 -2099331 -1999081 -2004470 -2083801 -2053962 -2039246 -2043495
7559 -2043495 -2004100 -1923319 -1912329 -1947607 -2057450 -2171385 -2230560 -2069489 -2029472 -2026706 -2003077
7548 -2003077 -2092120 -2089082 -2043890 -2011894 -1965903 -1924824 -1939089 -1964746 -1976588 -1900245 -1810322 -1872956
7536 -1872956 -1964190 -2056530 -2109128 -2114300 -2201040 -2133381 -2119370 -2073873 -1976365 -2006444 -2023262 -1950443
7524 -1950443 -1958881 -1999003 -2049429 -2024676 -2067518 -2050790 -2029727 -2071549 -2052426 -1988952 -1927739 -1920245
7512 -1920245 -1969582 -2013092 -2091032 -2039855 -2050799 -2102471 -2100924 -2133021 -2120065 -2089515 -2036053 -2024081
7500 -2024081 -2034896 -1987745 -1982928 -2013899 -1978834 -1958715 -1950816 -1894246 -1874455 -1889457 -1883942 -1848795
7488 -1848795 -1962039 -1957030 -1969722 -1919258 -1911167 -1916238 -1942418 -2015733 -1957381 -1964158 -2050933 -2086887
7476 -2086887 -2047783 -2033412 -2080262 -2053401 -2019571 -1922139 -1870358 -1919070 -1943024 -1927421 -1955616
7465 -1955616 -1937839 -1869272 -1890086 -1892347 -1908624 -1951689 -1925080 -1890415 -1778509 -1764610 -1945177
7454 -1945177 -2046063 -2102800 -2065355 -2016866 -2019969 -2064559 -2047660 -2084134 -2139961 -2154075 -2074504
7443 -2074504 -2012060 -1926752 -1805283 -1715796 -1802264 -1864163 -1861988 -1804135 -1851237 -1909639 -1943173
7432 -1943173 -2101193 -2113260 -2072252 -2055332 -1987886 -1993498 -1918012 -1843677 -1863139 -1850249 -1927310
7421 -1927310 -2004544 -1941873 -1911018 -1974418 -2059371 -2167320 -2139287 -2077002 -1982839 -1862499 -1830172
7410 -1830172 -1885160 -1948793 -1906117 -1890759 -1885712 -1947828 -1987730 -1969231 -1976365 -1994900 -1983539 -2007647
7398 -2007647 -1980983 -1947061 -1939583 -1896486 -1884931 -1910321 -1882271 -1884162 -1914980 -1961195 -1971513 -1984784
7386 -1984784 -2022330 -2020905 -1978797 -1951525 -2004876 -2011088 -2043041 -2009341 -1990520 -1939969 -1910632 -1898236
7374 -1898236 -1880977 -1903180 -1954993 -1952181 -1877377 -1875018 -1942385 -1978797 -1988864 -2042296 -1949985 -1977885
7362 -1977885 -1972661 -1911864 -1929871 -1888714 -1915790 -2018709 -1956757 -1952941 -1921435 -1893286 -1867442 -1881297
7350 -1881297 -1922894 -1918021 -1936030 -1999455 -2016834 -1992194 -1981902 -1991148 -1973587 -1932453 -1984792 -2042062
7338 -2042062 -2038632 -2078127 -2119006 -2035365 -1936532 -1906470 -1888039 -1882268 -1861840 -1865318 -1885355 -1928220
7326 -1928220 -1858595 -1868285 -1913017 -1904066 -1940489 -1943374 -1946494 -1822039 -1778796 -1799305 -1817290 -1815245
7314 -1815245 -1899104 -1898051 -1956295 -1936512 -1909387 -1974207 -1948773 -1821304 -1822757 -1796535 -1891779 -1912658
7302 -1912658 -1856155 -1833628 -1846908 -1909525 -1933743 -1925058 -1946246 -1948615 -1897636 -1812496 -1798140 -1921180
7290 -1921180 -1926043 -1953946 -1986475 -1932010 -1923782 -1928998 -1896173 -1909938 -1883188 -1814609 -1848423 -1874581
7278 -1874581 -1885244 -1985643 -1980249 -1935469 -1962109 -2074335 -2097512 -1961625 -1850968 -1863906 -1874766
7267 -1874766 -1932783 -1931211 -1920659 -1932064 -1896291 -1874125 -1828321 -1845585 -1876460 -1897885 -1909523 -1920686
7255 -1920686 -1897308 -1941275 -2017456 -1983309 -1851566 -1864501 -1836731 -1766227 -1784604 -1834690 -1795220
7244 -1795220 -1712684 -1663677 -1745021 -1834200 -1894314 -1931815 -1915638 -1807962 -1832708 -1867785 -1855030
7233 -1855030 -1804887 -1776988 -1745426 -1793584 -1907358 -1977240 -1995875 -1936326 -1792539 -1762188 -1807903
7222 -1807903 -1874131 -1863849 -1788047 -1753702 -1695384 -1604642 -1661056 -1751545 -1797071 -1845777 -1880394
7211 -1880394 -1896872 -1890700 -1836513 -1850615 -1810631 -1803805 -1880200 -1871056 -1857505 -1863877 -1870013 -1862795 -1941980
7198 -1941980 -1910716 -1938802 -1950558 -1933404 -1934727 -1878617 -1826979 -1795997 -1822379 -1888649 -1884771 -1817482
7186 -1817482 -1686792 -1671031 -1697382 -1762267 -1792605 -1769934 -1715313 -1718753 -1784772 -1769570 -1698027
7175 -1698027 -1706670 -1804187 -1803323 -1763223 -1801210 -1864029 -1874577 -1772465 -1857066 -1853808 -1860402 -1909454
7163 -1909454 -1954438 -1967787 -1899350 -1873740 -1892430 -1843212 -1791135 -1830424 -1867141 -1877364 -1897385
7152 -1897385 -1923682 -1869854 -1839749 -1912409 -1956874 -2029293 -2042510 -2017127 -1959054 -1860601 -1845574
7141 -1845574 -1927387 -1910246 -1845329 -1798023 -1819226 -1783685 -1755196 -1741246 -1702604 -1720151 -1694163
7130 -1694163 -1711144 -1748324 -1692531 -1695702 -1812756 -1845868 -1803146 -1819100 -1820534 -1901042 -1948229 -1935561
7118 -1935561 -1884108 -1841385 -1775313 -1741742 -1830001 -1834408 -1878403 -1821597 -1805366 -1809525 -1834056 -1831296
7106 -1831296 -1866581 -1893272 -1869051 -1779503 -1782025 -1818552 -1793104 -1819981 -1821112 -1819408 -1808151 -1780062
7094 -1780062 -1789008 -1789757 -1735777 -1726622 -1740983 -1640917 -1651276 -1683824 -1773913 -1865382 -1872035 -1944946
7082 -1944946 -2024069 -1992304 -1979055 -1922983 -1944540 -2014120 -1981000 -1958565 -1973818 -1873050 -1857056
7071 -1857056 -1770775 -1711833 -1712333 -1624510 -1633768 -1669698 -1694037 -1682249 -1724416 -1729707 -1674716 -1623546
7059 -1623546 -1577050 -1636821 -1652434 -1700497 -1796906 -1734604 -1754537 -1858610 -1849528 -1757908 -1716118
7048 -1716118 -1759646 -1800939 -1844032 -1867005 -1822828 -1770222 -1726558 -1677864 -1682638 -1746309 -1810671 -1862768
7036 -1862768 -1831722 -1775143 -1726250 -1703574 -1645773 -1676671 -1666853 -1759511 -1760742 -1753499 -1784073 -1838668
7024 -1838668 -1896880 -1786106 -1709161 -1680019 -1734929 -1701619 -1650887 -1684215 -1710180 -1722263 -1764991
7013 -1764991 -1790989 -1749897 -1675861 -1637864 -1664009 -1721924 -1721801 -1783524 -1824128 -1829490 -1815685 -1841718
7001 -1841718 -1811545 -1745934 -1752584 -1765146 -1731055 -1713482 -1775331 -1815183 -1802300 -1794235 -1773422 -1743241
6989 -1743241 -1742718 -1796343 -1761348 -1784745 -1790801 -1822632 -1809122 -1797087 -1854084 -1867327 -1809553 -1871187
6977 -1871187 -1927347 -1879071 -1826017 -1739177 -1686641 -1693620 -1702412 -1645200 -1583088 -1707635 -1754771 -1744117
6965 -1744117 -1691373 -1693448 -1666228 -1680978 -1716483 -1660219 -1689701 -1674661 -1689943 -1758790 -1748205 -1745566
6953 -1745566 -1711544 -1766813 -1851667 -1867951 -1840501 -1752471 -1725594 -1808472 -1860539 -1809902 -1801226 -1784059
6941 -1784059 -1702280 -1730172 -1776144 -1790696 -1745628 -1726635 -1773557 -1793234 -1853770 -1893805 -1917073
6930 -1917073 -1838072 -1765951 -1773581 -1809470 -1840384 -1857654 -1866067 -1852272 -1843957 -1863897 -1901188 -1856449
6918 -1856449 -1755504 -1702092 -1742513 -1855780 -1852900 -1744377 -1700300 -1652278 -1656544 -1621388 -1608996
6907 -1608996 -1611378 -1672109 -1656908 -1637056 -1639533 -1672941 -1683266 -1619715 -1703762 -1743038 -1675039 -1700664
6895 -1700664 -1709490 -1661485 -1634114 -1660282 -1676186 -1633455 -1637888 -1653191 -1674775 -1730414 -1789937 -1713135
6883 -1713135 -1666136 -1737423 -1738508 -1694500 -1611219 -1631688 -1718216 -1770184 -1756898 -1732668 -1717336 -1720321
6871 -1720321 -1731051 -1693381 -1638898 -1715114 -1687129 -1659097 -1668714 -1721590 -1721988 -1718051 -1697670 -1690275
6859 -1690275 -1795523 -1870904 -1867291 -1848875 -1790317 -1744437 -1767996 -1833266 -1844782 -1887214 -1840658
6848 -1840658 -1741010 -1668355 -1603299 -1500927 -1504968 -1655989 -1772125 -1789200 -1718545 -1746576 -1769175
6837 -1769175 -1781898 -1777886 -1780959 -1776745 -1868760 -1866531 -1818252 -1745218 -1637659 -1641337 -1596971 -1572275
6825 -1572275 -1582248 -1658721 -1679247 -1691212 -1701942 -1752759 -1764723 -1754388 -1737879 -1730025 -1786071 -1743275
6813 -1743275 -1720383 -1737411 -1700512 -1707523 -1702303 -1626941 -1525963 -1494517 -1538328 -1636032 -1708324 -1770700
6801 -1770700 -1759744 -1673203 -1640205 -1685575 -1705628 -1619843 -1561044 -1509767 -1507428 -1558272 -1621826 -1634812
6789 -1634812 -1673930 -1773356 -1780936 -1786653 -1777470 -1692894 -1554199 -1588349 -1592983 -1556513 -1513552 -1578529
6777 -1578529 -1692858 -1722666 -1648188 -1627132 -1596498 -1606536 -1623864 -1610185 -1641688 -1767366 -1817450
6766 -1817450 -1786847 -1760790 -1745091 -1796783 -1706589 -1684271 -1725509 -1792391 -1808193 -1814601 -1772348 -1681428
6754 -1681428 -1585763 -1547569 -1600708 -1610012 -1605893 -1558696 -1626500 -1638988 -1588959 -1599454 -1549655 -1461945
6742 -1461945 -1408383 -1392706 -1463398 -1570398 -1602960 -1521602 -1483175 -1522438 -1546915 -1582387 -1578139
6731 -1578139 -1635889 -1598385 -1663064 -1733038 -1703602 -1631939 -1619929 -1508822 -1508828 -1552270 -1545004 -1568327
6719 -1568327 -1567752 -1546589 -1607744 -1638110 -1647073 -1653196 -1697656 -1747817 -1794413 -1766831 -1681059 -1624907
6707 -1624907 -1542133 -1640465 -1696043 -1679221 -1676957 -1688777 -1793283 -1836157 -1866567 -1756855 -1659980
6696 -1659980 -1672420 -1617758 -1639877 -1685175 -1660051 -1645622 -1634552 -1775656 -1800236 -1700815 -1634578
6685 -1634578 -1685136 -1721424 -1699314 -1716151 -1742927 -1676574 -1656432 -1608743 -1579123 -1595785 -1589584 -1599683
6673 -1599683 -1602788 -1696175 -1676729 -1668981 -1671629 -1591728 -1667544 -1602151 -1585444 -1700124 -1720721 -1720158
6661 -1720158 -1702952 -1660083 -1568210 -1523132 -1525161 -1587944 -1591213 -1589997 -1568514 -1565528 -1582344 -1628297
6649 -1628297 -1621791 -1627780 -1616188 -1634963 -1675039 -1676665 -1722804 -1776715 -1708687 -1711481 -1712804 -1663704
6637 -1663704 -1678184 -1743941 -1721939 -1675285 -1668709 -1699060 -1673193 -1676822 -1715645 -1691731 -1688164 -1648338
6625 -1648338 -1556114 -1645654 -1676482 -1660370 -1616241 -1597494 -1531862 -1614590 -1658639 -1616642 -1592205
6614 -1592205 -1680546 -1700254 -1718706 -1736709 -1700207 -1653700 -1646948 -1581934 -1553444 -1625561 -1764542
6603 -1764542 -1732447 -1695389 -1736015 -1741761 -1692076 -1711986 -1812863 -1808117 -1812537 -1812008 -1770646 -1703794
6591 -1703794 -1682785 -1676080 -1658704 -1621625 -1558572 -1540766 -1477185 -1515665 -1593990 -1679725 -1682009 -1656653
6579 -1656653 -1599394 -1622950 -1649209 -1688468 -1658363 -1657443 -1711338 -1583583 -1551796 -1527334 -1550432 -1679543
6567 -1679543 -1690496 -1685559 -1664675 -1583458 -1621879 -1652882 -1743495 -1850895 -1794461 -1674825 -1614626
6556 -1614626 -1571219 -1559538 -1548989 -1606941 -1704670 -1715735 -1739386 -1760266 -1665371 -1564228 -1539991
$$ [...]
##END NTUPLES=NMR SPECTRUM
##END=
