##TITLE=Analysis number 328850
Compound Code mo 00895
Project Code adrs
Chemist Name stores
##JCAMPDX= 6.0         $$ Bruker NMR JCAMP-DX V2.0
##DATA TYPE= NMR SPECTRUM
##DATA CLASS= NTUPLES
##ORIGIN= Bruker BioSpin GmbH
##OWNER= nmr
$$ XWIN-NMR		Version 3.5
$$ Mon Jul  9 15:33:40 2007 GMT Daylight Time (UT+1h)  MAYBRIDGE\nmr@NMR_250MHZ
##.OBSERVE FREQUENCY= 250.131544655141
##.OBSERVE NUCLEUS= ^1H
##.ACQUISITION MODE= SIMULTANEOUS (DQD)
##.ACQUISITION SCHEME= undefined
##.AVERAGES= 16
##.DIGITISER RES= 18
##SPECTROMETER/DATA SYSTEM= dpx250
##.PULSE SEQUENCE= zg30
##.SOLVENT NAME= CDCl3
##.SHIFT REFERENCE= (INTERNAL, CDCl3, 0, 16.4489)
##AUDIT TRAIL= $$ (NUMBER, WHEN, WHO, WHERE, WHAT)
$$ ##TITLE= Audit trail, XWIN-NMR		Version 3.5
$$ ##JCAMPDX= 5.01
$$ ##ORIGIN= Bruker BioSpin GmbH
$$ ##OWNER= nmr
$$ C:\u/data/dgb/nmr/ADRS/700/pdata/1/auditp.txt
$$ ##AUDIT TRAIL=  $$ (NUMBER, WHEN, WHO, WHERE, WHAT)
(   1,<2007-07-09 15:33:17.98 +100>,<MAYBRIDGE\nmr>,<NMR_250MHZ>,
      <created by zg, POWCHK disabled, PULCHK disabled
       configuration hash MD5:
       76 6E 9A 78 1E 09 19 81 EC 84 63 8F B0 6A 59 2D
       data hash MD5: 64K
       D4 BC 54 5D 67 4F 6F 4A F0 2C 84 60 43 69 3F 42>)
(   2,<2007-07-09 15:33:30.78 +100>,<MAYBRIDGE\nmr>,<NMR_250MHZ>,
      <Start of raw data processing
       ef LB = 0.3 FT_mod = 6 PKNL = 1 SI = 32K 
       data hash MD5: 32K
       38 91 42 5F AE DA 96 BD 61 E4 37 0B 87 AD 05 BC>)
(   3,<2007-07-09 15:33:32.44 +100>,<MAYBRIDGE\nmr>,<NMR_250MHZ>,
      <apk 
       data hash MD5: 32K
       D2 49 43 58 59 FB 3B FC 1F E7 26 04 CC 27 01 EE>)
(   4,<2007-07-09 15:33:33.14 +100>,<MAYBRIDGE\nmr>,<NMR_250MHZ>,
      <abs ABSG = 5 
       data hash MD5: 32K
       F1 22 9F D4 8D 65 D6 9B 74 99 C9 36 67 7E E6 75>)
$$ ##END=
$$ 
$$ hash MD5
$$ 0B 45 3A A3 9E 1E F3 FA 51 16 1F 8E CA 61 EB 4A
##$RELAX= 
##$RELAX= 
##$RELAX= 
##$RELAX= 
##$RELAX= 
##$RELAX= 
##$RELAX= 
$$ Bruker specific parameters
$$ --------------------------
##$DU= <C:\u>
##$EXPNO= 700
##$NAME= <ADRS>
##$PROCNO= 1
##$TYPE= <nmr>
##$USER= <dgb>
##$AMP= (0..31)
100 100 100 100 100 100 100 100 100 100 100 100 100 100 100 100 100 100 
100 100 100 100 100 100 100 100 100 100 100 100 100 100 
##$AQSEQ= 0
##$AQ_mod= 3
##$AUNM= <au_zg>
##$AUTOPOS= <58 >
##$BF1= 250.13
##$BF2= 250.13
##$BF3= 250.13
##$BF4= 250.13
##$BF5= 500.13
##$BF6= 500.13
##$BF7= 500.13
##$BF8= 500.13
##$BYTORDA= 1
##$CFDGTYP= 0
##$CFRGTYP= 5
##$CHEMSTR= <none>
##$CNST= (0..31)
1 1 145 1 1 1 1 1 1 1 1 1 1 1 1 1 1 1 1 1 1 1 1 1 1 1 1 1 1 1 1 1 
##$CPDPRG= <>
##$CPDPRG1= <>
##$CPDPRG2= <>
##$CPDPRG3= <>
##$CPDPRG4= <mlev>
##$CPDPRG5= <mlev>
##$CPDPRG6= <mlev>
##$CPDPRG7= <mlev>
##$CPDPRG8= <mlev>
##$CPDPRGB= <>
##$CPDPRGT= <>
##$D= (0..31)
0 1 0 0 0 0 0 0 0 0.06 0 0 0 0 0 0 0.0002 0 0 0 0 0 0 0 0 0 0 0 0 0 0 
0 
##$DATE= 1183991596
##$DBL= (0..7)
120 120 120 120 120 120 120 120 
##$DBP= (0..7)
150 150 150 150 150 150 150 150 
##$DBP07= 0
##$DBPNAM0= <>
##$DBPNAM1= <>
##$DBPNAM2= <>
$$ [...]
##$SUBNAM7= <"">
##$SUBNAM8= <"">
##$SUBNAM9= <"">
##$SW= 20.6930455092707
##$SWIBOX= (0..15)
0 0 3 0 0 0 0 0 0 0 0 0 0 0 0 0 
##$SW_h= 5175.983436853
##$TD= 65536
##$TD0= 1
##$TE= 296.16
##$TE2= 300
##$TE3= 300
##$TEG= 300
##$TL= (0..7)
0 120 120 120 120 120 120 120 
##$TP= (0..7)
150 150 150 150 150 150 150 150 
##$TP07= 0
##$TPNAME0= <>
##$TPNAME1= <>
##$TPNAME2= <>
##$TPNAME3= <>
##$TPNAME4= <>
##$TPNAME5= <>
##$TPNAME6= <>
##$TPNAME7= <>
##$TPOAL= (0..7)
0.5 0.5 0.5 0.5 0.5 0.5 0.5 0.5 
##$TPOFFS= (0..7)
0 0 0 0 0 0 0 0 
##$TUNHIN= 0
##$TUNHOUT= 0
##$TUNXOUT= 0
##$USERA1= <user>
##$USERA2= <user>
##$USERA3= <user>
##$USERA4= <user>
##$USERA5= <user>
##$V9= 5
##$VALIST= <valist>
##$VCLIST= <CCCCCCCCCCCCCCC>
##$VD= 0
##$VDLIST= <DDDDDDDDDDDDDDD>
##$VPLIST= <PPPPPPPPPPPPPPP>
##$VTLIST= <TTTTTTTTTTTTTTT>
##$WBST= 1024
##$WBSW= 4
##$XGAIN= (0..3)
0 0 0 0 
##$XL= 0
##$YL= 0
##$YMAX_a= 486997
##$YMIN_a= -447709
##$ZGOPTNS= <>
##$ZL1= 120
##$ZL2= 120
##$ZL3= 120
##$ZL4= 120
##$ABSF1= 16.44894
##$ABSF2= -4.244232
##$ABSG= 5
##$ABSL= 3
##$ALPHA= 0
##$AQORDER= 0
##$ASSFAC= 0
##$ASSFACI= 0
##$ASSFACX= 0
##$ASSWID= 0
##$AUNMP= <proc_1d>
##$AZFE= 0.1
##$AZFW= 0.1
##$BCFW= 0
##$BC_mod= 0
##$BYTORDP= 0
##$COROFFS= 0
##$CY= 12.5
##$DATMOD= 1
##$DC= 0
##$DFILT= <>
##$DTYPP= 0
##$F1P= 14.0000005364418
##$F2P= -0.99999901652339
##$FCOR= 0.5
##$FTSIZE= 32768
##$FT_mod= 6
##$GAMMA= 0
##$GB= 0
##$INTBC= 1
##$INTSCL= 1
##$ISEN= 128
##$LB= 0.3
##$LEV0= 0
##$LPBIN= 0
##$MAXI= 10000
##$MC2= 0
##$MEAN= 0
##$ME_mod= 0
##$MI= 0
##$NCOEF= 0
##$NC_proc= -3
##$NLEV= 6
##$NOISF1= 0
##$NOISF2= 0
##$NSP= 0
##$NTH_PI= 0
##$NZP= 0
##$OFFSET= 16.44894
##$PC= 1
##$PHC0= -48.96527
##$PHC1= 5.720714
##$PH_mod= 1
##$PKNL= yes
##$PPARMOD= 0
##$PSCAL= 4
##$PSIGN= 0
##$REVERSE= no
##$SF= 250.130018273862
##$SI= 32768
##$SIGF1= 0
##$SIGF2= 0
##$SINO= 400
##$SIOLD= 32768
##$SREGLST= <1H.CDCl3>
##$SSB= 0
##$STSI= 32768
##$STSR= 0
##$SW_p= 5175.98343685301
##$SYMM= 0
##$S_DEV= 0
##$TDeff= 65536
##$TDoff= 0
##$TI= <Analysis number 999999
Compound Code 99
Book Reference 9
Project Code 9>
##$TILT= no
##$TM1= 0
##$TM2= 0
##$TOPLEV= 0
##$USERP1= <user>
##$USERP2= <user>
##$USERP3= <user>
##$USERP4= <user>
##$USERP5= <user>
##$WDW= 1
##$XDIM= 32768
##$YMAX_p= 492223129
##$YMIN_p= -75495
$$ End of Bruker specific parameters
$$ ---------------------------------
##NTUPLES= NMR SPECTRUM
##VAR_NAME=  FREQUENCY,     SPECTRUM/REAL,   SPECTRUM/IMAG
##SYMBOL=    X,             R,               I
##VAR_TYPE=  INDEPENDENT,   DEPENDENT,       DEPENDENT
##VAR_FORM=  AFFN,          ASDF,            ASDF
##VAR_DIM=   32768,         32768,           32768
##UNITS=     HZ,            ARBITRARY UNITS, ARBITRARY UNITS
##FACTOR=    0.157963299565203, 1,           1
##FIRST=     4114.37373209659, 0,            0
##LAST=      -1061.60970475642, 0,           0
##MIN=       -1061.60970475642, -75495,      0
##MAX=       4114.37373209659, 492223129,    0
$$ Real data points
##PAGE= N=1
##DATA TABLE= (X++(R..R)), XYDATA
$$ [...]
20906 -27419 -13409 8657 8905 5274 19771 6285 -18162 -48395 -54126 -42068 -22777 -27346 -44775
20893 -44775 -29720 -12831 -19957 -20383 -9790 -6992 -6393 -4236 -9269 -17176 -12164 -23328 -28444 -27626
20879 -27626 -11519 -19055 -23658 -11701 -24873 -22078 -34915 -42052 -31287 -31950 -27977 -3031 10671
20866 10671 12995 15270 15461 -3207 22374 23358 -4711 -12749 -4523 -11899 -645 7977 -3564 -2321
20852 -2321 -1332 -9006 -4497 1965 -4910 -5956 -20524 -47674 -59483 -75495 -61259 -42717 -29528
20839 -29528 -30301 -33527 -15862 -11635 -5479 -13162 -25726 -35556 -20456 -18334 -19902 -12759 -9579 -17942
20825 -17942 -14442 4808 23779 34437 26739 12822 4118 -9767 -12646 461 7090 -5523 6654
20812 6654 -10690 -30325 -6951 8854 371 5993 13644 -1602 -8422 -16651 -22490 -15205 -11922
20799 -11922 -2990 -5192 -5939 -9352 -17602 -20472 -24919 -9063 13166 27157 14012 -8844 3993
20786 3993 -10376 -15532 5393 13046 14137 3567 -27161 -33714 -18393 -10386 -9289 -6397 -5640 -6236
20772 -6236 -14520 -5407 -7335 -13070 -18915 -20049 -29355 -20672 -5475 -2806 -5934 5018 4179 470
20758 470 10038 8931 6829 -7574 -18932 -13695 -2865 -13260 -24746 -21289 -1905 4096 9256
20745 9256 5256 2099 12265 -12623 -24970 -16599 -4138 10053 11032 5662 1866 -5780 -11538 -11595
20731 -11595 -21652 -12836 -16393 -33688 -34288 -21905 -23257 -31519 -26345 -19849 -22760 -26673 -24203 -23981
20717 -23981 -42773 -67775 -45807 -19661 -1481 2827 4829 13391 18335 21341 10567 12692 25053
20704 25053 13802 13580 20442 35207 21125 8492 11265 15713 -14737 -39074 -48546 -18848 7380
20691 7380 -6492 -3566 -7605 -20633 -14839 898 26134 24991 5568 -10394 -3380 10088 2105
20678 2105 -6838 -4017 934 669 7131 6150 5013 -606 -12763 -6336 -15553 -15723 -2746 -11772 -24352
20663 -24352 -40892 -39842 -18938 -5368 6505 17847 18330 4435 -13413 -26600 -16296 -12421
20651 -12421 -11689 -2244 6326 12535 -10061 -8825 -2009 -18252 -25873 -15970 -9077 -384 -12073 -14558
20637 -14558 3100 2888 -5506 -3879 917 3124 -17077 -28838 -25300 -8918 -11248 -24074 -19128
20624 -19128 -12598 -1572 -3723 12939 12910 7133 -8325 -9885 -6592 -6374 -16976 -18605 -24427 -20157
20610 -20157 -7102 6752 -1163 5321 -8077 -179 8358 10724 9409 10280 -2046 -11419 -1005
20597 -1005 -5020 -34195 -36644 -26649 -21680 8572 21637 21447 30444 24829 14394 13770 14331 10345
20583 10345 -9964 -21087 -26986 -23761 -17130 -26117 -28302 -35779 -34442 -27858 -26711 -14877 -5301 -14503
20569 -14503 -22040 -33855 -38611 -35491 -20102 -14770 -37344 -34229 -6372 -1472 -11052 4623 3084
20556 3084 7194 1579 -9469 -8009 -12491 -15746 -5447 -20857 -8842 6135 4271 -15600 -29435
20543 -29435 -10400 -1409 -2164 13203 7242 2761 11867 6709 4364 -13886 -19382 -18087 -5660 10231
20529 10231 -20945 -28018 -24148 -1862 2343 -24559 -18493 -10234 -24793 -3231 -1031 -11913 -10033
20516 -10033 -26488 -21353 -20502 -18457 908 6436 -772 -1671 -15287 -32096 -47281 -40324 -20611
20503 -20611 -26113 -35622 -14452 -9919 -6123 -3296 -767 -2931 16777 33669 33186 21005 -1950
20490 -1950 -14045 -7326 -4796 1477 10712 4495 -20220 -45507 -27592 -19580 -38308 -27568 -15011
20477 -15011 3235 15215 7792 -16844 5612 17012 5195 -825 -16897 -19763 -21650 -21702 -36395
20464 -36395 -39533 -24915 -4708 12788 20971 12022 -2186 1765 3884 18019 28804 38282 12260
20451 12260 -9543 -8458 -907 7268 -4499 -14891 -20 1264 -7317 -13611 -31500 -25141 -12587
20438 -12587 -16854 -18775 -14780 -1720 1882 -12640 -34781 -25655 -29542 -9813 6041 15234 18044
20425 18044 30880 36505 29536 14009 5791 16100 8772 -14341 -27476 -31892 -25123 -28850 -27826
20412 -27826 -5744 -4448 1102 -6684 -10766 -2806 -7423 -6514 -12531 -30016 -51999 -49745 -48569 -46249
20398 -46249 -35169 -44691 -45992 -49061 -34419 -14583 576 2611 -3264 -10144 -19525 -27536 -23247
20385 -23247 -28487 2802 20977 11814 -2553 -14306 -12687 -25399 -33918 -35700 -17540 -7558 -4077
20372 -4077 -6226 -6935 -18782 -23539 1987 2490 -11952 -2597 4658 -1245 -15935 -19223 5398 10214
20358 10214 -14318 -22086 -17896 -14043 -12541 184 -400 -7925 -10454 -20236 -21678 -34090 -35484 -4446
20344 -4446 10526 13544 -9675 -16188 -21674 -13780 -18856 -22872 -28023 -19576 -20970 -5127 2915 14182
20330 14182 -7613 -11575 -13828 -8444 -4550 13354 14427 10386 8962 4028 -1171 6157 1200 -1748
20316 -1748 6034 -14 -3060 -4676 -15408 -28517 -32977 -19906 -19879 -27907 -32321 -21998 -15444 3129
20302 3129 11260 7611 -4167 -23431 -26671 -39191 -42134 -35654 -16592 1771 14569 8759 5649
20289 5649 8372 -7750 -31439 -24655 -21802 -22006 -31096 -27917 -13776 -1778 -4052 3419 15021 22587
20275 22587 25119 24572 26620 8798 22755 35533 10879 -14130 -8270 -4055 4917 -8993 -22245
20262 -22245 -24729 -28347 -22589 -19346 -39779 -38759 -26341 -29679 -28405 -12560 4634 15832 18078
20249 18078 -10650 -11940 -18731 -39902 -39513 -19934 -24939 -16924 -23759 -11578 -1094 -3824 -12078
20236 -12078 -17189 -7948 -13590 -15510 -10933 -13823 -15976 -22030 -28900 -19669 -20303 -45102 -55779 -48460
20222 -48460 -26554 -20161 -29813 -29023 -11345 -3354 -3172 -10877 -26463 -44506 -30317 -20882 -27796 -23426
20208 -23426 -10445 -16666 -26118 -3381 3414 14457 9922 -11183 -13003 -12147 -11894 -16346 -19143 -17223
20194 -17223 13015 24466 1311 -24581 -40114 -40686 -35250 -18896 -5378 -9229 670 -4308 -20495
20181 -20495 -9647 -17848 -11953 17963 24949 -7409 -13708 -11526 -5779 630 4542 -7168 -10547
20168 -10547 -12549 6046 1660 -5555 6496 6588 5336 1080 -2424 3966 -5217 -6271 -3311 -2595 5460
20153 5460 9703 15618 -5288 -43704 -32536 6974 16621 4539 -1835 -4344 -14770 -20123 -11413
20140 -11413 -6845 -12628 -17585 -18119 1261 18835 16091 14192 -8357 -13998 -5452 -143 -7106 -32257
20126 -32257 -43153 -31700 -26477 -13785 7642 -2603 -20747 -19579 -17153 -20369 -16787 -23658 -28189
20113 -28189 -25567 -4666 12274 12948 1979 -3505 -14677 -26212 -26943 -15378 -1770 13014 29390
20100 29390 22524 10350 16446 16458 -3770 817 8886 -1577 -11427 -22530 -14866 -222 -17116
20087 -17116 -21882 -18928 4326 14329 21420 26392 10092 34688 35953 12333 -10504 -8879 -4297
20074 -4297 2677 -1739 -13062 -14734 -15785 -4186 5931 17220 20377 13645 -1229 -11618 -2895
20061 -2895 -16352 -21580 -6910 1754 -9148 -7156 -562 -8447 -16999 -13825 -17302 3907 2034 -3195
20047 -3195 -5320 -7264 -13492 -14276 -17507 -2220 18825 6681 -4838 -5628 8448 3459 13001 20216
20033 20216 1170 1644 -5267 11192 27359 29886 19965 32298 46338 47027 50127 61750 49471
20020 49471 32916 43645 57595 66947 80811 91592 102495 95217 88425 79078 54230 30952
20008 30952 30192 45837 52958 50679 41037 26590 21490 18782 10686 -6725 -16536 -18616 -12850 2721
19994 2721 13592 7982 7869 22446 25814 26011 24892 10801 5979 883 -3280 -16953 -20516 -15209
19980 -15209 -13100 -20862 -34576 -33355 -30672 -29757 -9977 6156 4687 1482 -7915 -16277 -12469 -10339
19966 -10339 -126 1725 -986 804 13503 2763 -6584 -16556 -19745 -32836 -44007 -21703 -2113
19953 -2113 -9182 14778 26901 18549 -599 6500 4048 3231 5665 -11874 -29408 -29466 -24960 -25169
19939 -25169 -15459 -1401 411 -10419 -37314 -42741 -29504 -16803 -16118 -5245 -6225 -2864 2269
19926 2269 -3607 -4806 1814 1076 -4031 -6446 -3668 25783 20783 -5903 -2020 2693 6625 -2008
19912 -2008 -16901 -10449 -10931 -7692 4974 -3205 -10725 15262 13364 6932 -11299 -30461 -36206 -46003
19898 -46003 -31142 1657 15288 14858 15088 30041 32701 20120 6719 4628 10588 17584 21426
19885 21426 18617 1354 -5116 -13694 -18203 -24628 -29584 -26428 -11297 9131 2248 3085 -4562 -8974
19871 -8974 -6360 -12267 -11197 -20712 -5375 6410 10773 9063 -17787 -18479 -28106 -22154 3452 21844
19857 21844 13036 -13034 2260 -1044 -2289 -8457 -21615 -28995 -21747 -32078 -45578 -49177 -42559
19844 -42559 -28515 -12792 9194 4572 -16307 -17906 -11393 6529 28439 40292 49303 32913
19832 32913 -3174 -19405 -19292 -13327 -11511 -10789 -12021 -7145 -4116 -2472 8285 14181 8889 -6861
19818 -6861 -4380 -97 -1136 18170 26718 4272 -2905 13958 31186 34040 56300 55218 66050
19805 66050 101225 115742 120747 118527 103240 101896 111039 134728 161349 190723 237416 269564
19793 269564 264947 248174 228559 199271 169880 181056 174812 185098 232187 267689 285909 275209
19781 275209 267421 232870 206306 172407 151419 127021 120504 116476 117872 117956 104747 84270 84179
19768 84179 55509 25487 12518 5491 -2162 -14807 13201 40310 51460 32315 21169 6631
19756 6631 -7321 -24993 -34713 -31605 -26061 -5864 -8837 -4993 -1457 -22839 -30995 3436 23640
19743 23640 21125 15350 25030 26024 21751 -5278 -25436 -33885 -24129 -12216 -1088 22821 11797
19730 11797 11990 -4965 -24412 -6470 286 -13831 -11613 -21161 -25379 -12930 -839 -2962 3538
19717 3538 -5351 -28325 -33009 -38376 -38698 -22279 -13517 -9594 -6270 -6755 4594 12554 -5867 -25964
19703 -25964 -25008 -20618 -26524 -27929 -3234 5137 -1603 4187 2998 -379 8891 4780 -2493 -1132
19689 -1132 1602 -1924 -18995 -29919 -23218 -7986 -1360 -25399 -15075 -6402 -20130 -11456 -5007
19676 -5007 -6206 8788 12673 17102 12857 -5031 -1439 -2404 -2162 -10530 -13305 82 -175 -7989 -9280
19661 -9280 -15983 -17795 -24037 -17633 145 -1556 -19336 -29335 -27677 -27989 -6151 -7529 -21851 -24221
19647 -24221 -8418 -15287 -30217 -25639 -22363 -14820 -13503 -37056 -31923 1570 12003 17312 13397
19634 13397 1337 7930 10305 -1635 -29195 -36040 -21017 -19732 -13539 -14131 -16112 -1524 318
19621 318 -9942 -10054 -18159 -18689 -19507 -6947 12561 33516 35766 31289 2840 -5727 -14980 -10232
19607 -10232 -14399 -5185 12229 10731 18651 19234 11942 -15362 -34866 -37642 -10906 7913 19653
19594 19653 22458 26206 537 -14352 3806 29820 41448 32683 46843 49492 53681 42745 32043
19581 32043 11744 -6446 -20106 -513 6408 13792 26908 31365 22347 16922 13958 12718 17402
19568 17402 3195 2308 34022 39037 33099 22610 16794 4411 9086 5652 2011 7795 31108
19555 31108 21410 8028 8739 2721 -8377 -17058 -13558 -1181 -6674 1775 11980 -2660 -10924
19542 -10924 -11022 -7683 5506 5236 -454 -1030 1418 86 3156 8590 13294 21717 19199 20780 21400
19527 21400 20346 28324 16538 1597 4537 1823 14692 31306 27918 17738 37564 48015 38913
19514 38913 41605 34953 37308 40329 44210 31825 9302 8675 7616 23631 34196 21235 19801
19501 19801 31755 24083 30029 63077 82719 112560 151880 191697 243229 280269 292414 263364
19489 263364 228883 185686 144328 98443 73026 63225 53729 44441 55933 54758 53008 55262 42265
19476 42265 19422 -1762 -13191 -28901 -16233 1897 -6407 -17328 -12575 -11326 -4015 -5229 -4904
19463 -4904 -12468 -2364 5778 19954 22710 6019 -14078 -7290 -7135 -11113 23359 43454 41204
19450 41204 38249 39061 23111 14725 -9481 -15147 7948 6945 -22711 -25604 -5252 5886 10895
19437 10895 23543 15185 5569 17035 31256 21461 16816 6902 15603 32914 39600 23782 14359
19424 14359 5868 5328 5756 3043 10210 -5492 -18009 5691 19059 35977 33728 18973 18574 17408
19410 17408 14040 15052 17438 31264 40814 30816 20605 17203 14671 13431 14288 25354 16623 2218
19396 2218 4673 19435 565 9318 13406 17562 21905 35804 39650 24780 45408 54088 60603
19383 60603 71547 75425 74395 72864 77291 85354 90465 116772 123076 84975 70363 53341 55612
19370 55612 61880 52924 69218 67867 76175 89505 97234 75611 52716 25996 22126 51556 54360
19357 54360 36747 28613 34482 35574 29126 18793 9435 9670 22115 23444 31317 26178 14408 19600
19343 19600 20013 16058 14463 24219 9335 -6453 -13896 -22605 -13003 3597 11947 3262 -2092 272
19329 272 8464 -1797 -7348 -8034 -21443 -26464 -16964 -16366 -13921 -10379 -3248 165 7525 -6661 -5480
19314 -5480 19256 1982 -9714 -24579 -12880 -8318 -1232 1772 9952 -3982 1949 20600 31450
19301 31450 38270 38305 38840 46928 66955 50045 38028 36438 29921 21476 43559 59471 48492 35086
19287 35086 36392 53116 68644 81648 85312 100390 140780 158035 167650 171761 159970 157811 160358
19274 160358 167485 185696 197668 202109 221751 238991 254522 256732 271246 284132 288797 284730
19262 284730 286592 298751 278314 251353 244979 237859 220797 212033 211332 207511 170290 152936 139420
19249 139420 107526 101500 92179 65854 44046 43683 28185 33073 29775 26185 30924 14796 -3956
19236 -3956 2496 5820 13849 41057 40141 36356 31556 39649 43606 54453 61884 61718 60208 64382 62953
19221 62953 67087 85249 96735 95758 73932 63378 51154 43233 49880 60248 65945 73963 100171
19208 100171 98958 90854 66605 57216 51595 54780 56189 48978 42599 31672 41078 63280 56388
19195 56388 56421 61210 46476 50765 56580 51203 58068 66529 75316 108777 128994 124015 109636 106716
19181 106716 115049 135685 156236 171166 169117 189110 228330 246800 256828 259823 280940 304297
19169 304297 309464 304014 299992 293964 288719 267863 252600 257172 261601 256284 265853 264383 246646
19156 246646 228320 211557 207983 208325 202923 180835 161614 133202 121429 118529 119988 119266 99732
19143 99732 70283 55347 45649 55694 55400 67462 64358 59013 63038 64551 70206 64285 67959 70313
19129 70313 54219 52945 59589 55461 54731 60638 50250 55432 46200 51159 67647 74510 66652 71412
19115 71412 97061 120675 125863 116526 127198 123098 115304 143657 150618 178729 187425 173829 173180
19102 173180 179983 182594 184783 211365 205444 191981 167549 167571 179646 181860 146384 128487 152987
19089 152987 142812 122491 120281 107017 122118 122551 127939 149935 161429 170537 163158 168888 183498
19076 183498 198165 210864 216687 188797 180169 209733 236389 265814 281983 303094 303703 309627
19064 309627 309284 320214 338447 348040 344033 357206 373869 384323 386958 382956 384590 382884 376718
19051 376718 371938 345728 337142 322858 319016 317750 310330 276911 256761 257201 228119 213646 214836
19038 214836 198488 182302 172922 162723 181263 197157 194504 220485 242617 240794 262890 283039
19026 283039 296123 334025 359157 373957 384312 398829 409682 420933 427228 447537 469491 485084
19014 485084 470526 454744 457092 448176 415277 396925 384243 374625 357855 353940 360967 360763 343296
19001 343296 307631 275210 262893 254105 249221 235171 242806 222472 207035 187806 164872 126849
18989 126849 106259 111432 96480 94496 95207 76916 67973 54462 59104 44327 38920 38128 51285
18976 51285 55626 68311 91080 107954 93540 75861 104076 119909 124498 129104 150470 177400
18964 177400 169285 165814 158869 145460 144106 159084 135898 127925 109848 84304 77325 80759 82057
18951 82057 85467 78988 85009 103911 103625 101957 106152 118625 113731 127814 117001 128878 134579
18938 134579 129184 129856 118788 93799 103283 139550 153761 182658 172320 145821 166585 175951
18926 175951 164540 205330 242997 252408 257789 266519 301322 341588 345890 355094 363456 384735 402422
18913 402422 391142 373063 361900 341139 319555 298129 286417 268706 242553 212186 182673
18902 182673 175811 178811 191913 193783 181362 174470 164874 130066 110583 113465 104076 114833 118574
18889 118574 99503 92753 97930 132816 130328 106090 94682 69307 73005 95889 98509 104124 109905
18876 109905 123768 125943 135130 156730 175245 205659 222859 228593 232456 246408 247708 241972 237651
18863 237651 249010 233834 222210 212420 214374 199920 197348 194014 197982 191700 195208 182666 184194
18850 184194 195839 203514 207280 202500 188584 193117 211124 221897 215526 229810 212140 188678
18838 188678 205843 213455 201871 219588 217724 200942 194784 212593 220738 222831 209743 198156
18826 198156 211861 214468 205991 206905 193983 199833 230142 250916 236121 219092 213007 233653 223427
18813 223427 215200 208983 224388 262320 282953 304149 310291 314547 315748 293810 311880 332837
18801 332837 349639 342026 344342 358983 351743 335227 331533 332085 330574 342837 346859 351288 373121
18788 373121 403461 404791 391507 386539 406290 419571 431887 437644 439461 447522 429269 415443
18776 415443 429952 425688 411802 427831 451526 452159 475931 508007 532927 564325 622447 643526
18764 643526 564851 482560 451989 438494 440410 429049 422439 424196 416052 399053 372918 364204
18752 364204 361444 366667 375436 366014 360760 354773 365548 377597 371270 372620 371012 381934 388174
18739 388174 408758 435804 454009 459823 474593 486882 508818 538775 556714 572497 598192 632965
18727 632965 652665 667089 674954 699635 728058 758785 797559 825845 857531 863467 881787 904891
18715 904891 937890 966901 997582 1046152 1071671 1094667 1124771 1180786 1217741 1267575 1330134
18704 1330134 1393565 1429893 1504970 1606042 1700528 1782436 1871533 1992566 2114113 2240948
18694 2240948 2368581 2514215 2688398 2905613 3152412 3446633 3797124 4216009 4788849
18685 4788849 5482641 6300790 7294661 8561256 10073785 11684673 13329434 15211439 17514530
18676 17514530 19942923 22043899 24004921 26385383 29180764 31773064 33996480 36301778
18668 36301778 38860841 41555775 44310669 46834701 48513298 49587144 51035743 52699005
18660 52699005 53175803 52142626 51028413 50470317 49589009 47864560 45989355 44219275
18652 44219275 42133400 39947088 38176911 36336428 33581666 30455237 27895092 25681121
18644 25681121 23030734 19964788 17209504 14970775 12931835 10974294 9264348 7916139
18636 7916139 6885442 6037487 5326417 4749839 4324704 4027036 3795458 3610093 3453804
18627 3453804 3348800 3287068 3232386 3208559 3194741 3183501 3181389 3196850 3244690 3291470 3348814
18616 3348814 3409222 3477235 3565828 3639436 3730603 3841238 3925440 3989153 4050705 4103656 4116728
18605 4116728 4125722 4138700 4134328 4137365 4146978 4150987 4151763 4155379 4201175 4258509 4344641 4465854 4674632
18592 4674632 4981285 5429174 6031513 6769174 7700713 8795605 9910397 11043849 12328345
18583 12328345 13638470 14624628 15444927 16399994 17301190 18022734 18804622 19610504 20271941
18574 20271941 21012815 21847752 22189111 21998010 21879243 21810450 21241780 20329677 19658333
18565 19658333 19183395 18739601 18524791 18579962 18613445 18620155 18839252 19133983 19126570 18933526
18555 18933526 18918005 19053956 19193977 19421723 19847580 20448353 21193368 22003494 22754091
18546 22754091 23436585 24065644 24683581 25256965 25798728 26411358 27113409 27967664 28967128
18537 28967128 30037328 31245025 32612339 34038454 35590685 37444977 39276279 40769959
18529 40769959 42424937 44266934 45313621 45350052 45290668 45125009 43979153 42302083 41104611
18520 41104611 40136137 39063715 38541412 38825276 39203595 39417864 40118054 41232597 42032242
18511 42032242 42561171 43286051 44135491 44731044 44875180 44790233 44716267 44525090 44017943 43466832
18501 43466832 43274989 43278475 43363924 43659104 43992440 43901627 43232380 42165365 40521915 38037623
18491 38037623 35015486 31896031 28706064 25603929 22930727 20718596 18837301 17219594
18483 17219594 15839547 14589073 13318904 12064447 10924606 9881704 8941719 8109201
18475 8109201 7471472 7012373 6685421 6481120 6369887 6338363 6348054 6380318 6467775 6586484
18465 6586484 6703616 6825363 6954287 7113084 7217313 7305434 7389643 7483880 7580282 7752898
18455 7752898 8015013 8410038 9017238 9922804 11229912 13050161 15388587 18191614 21323504
18446 21323504 24795300 28805081 33130809 36919811 39599151 41667864 43605058 44670200
18438 44670200 43646045 40872892 37702877 34675099 31157808 26860703 22506454 18856913
18430 18856913 15944917 13515913 11483497 9935012 8902928 8313040 7956532 7695484
18422 7695484 7504349 7419738 7369101 7249100 7008039 6735960 6528474 6340805 6068308 5757254
18412 5757254 5508335 5377804 5359201 5423597 5612171 6001009 6634370 7546186 8733216 10172705
18402 10172705 11876018 13935195 16403725 19108450 21681130 23953432 26220446 28692834
18394 28692834 30902330 32060658 32120694 31797064 31494779 30684642 28746508 26016630 23285671
18385 23285671 20845056 18393730 15743997 13172200 10994155 9251959 7797989 6586401
18377 6586401 5615371 4894104 4412105 4072722 3832412 3705095 3639765 3620030 3625418 3630836
18367 3630836 3640875 3660484 3645285 3610700 3551985 3502064 3449465 3418843 3406351 3434080 3541389
18356 3541389 3779667 4122728 4631554 5246744 5974310 6841568 7841010 8886975 9776474
18347 9776474 10434495 11018095 11566629 11871768 11709914 11182861 10543726 9894340 9093458
18338 9093458 8096950 7010654 6009736 5158115 4408391 3768678 3225721 2791228 2440522
18329 2440522 2208859 2030831 1874917 1746428 1651820 1593323 1542282 1463946 1404108 1357630
18319 1357630 1287319 1229048 1164738 1091706 1036604 994335 956195 914326 869127 838773 826134
18308 826134 799747 773510 751659 703695 681367 678329 654078 669466 686030 681797 692348 717328
18296 717328 736186 758411 803018 841149 829209 839120 861381 881728 883481 852921 823767 779125
18284 779125 749982 721914 689554 651946 607748 566365 531346 510886 479160 465165 458502 448978
18272 448978 442601 446621 443885 421596 429713 435859 434471 434249 417194 428839 429061 426764 443967 438853
18258 438853 428989 406788 388344 383363 381546 387359 393684 390415 363020 351846 347866 335780 341371
18245 341371 348158 352028 352963 342189 333689 342369 334578 321078 307924 309661 308845 301872 295324 311492
18231 311492 305704 306349 307394 294830 286616 296874 292783 270662 267018 269793 263387 268106 273530 271492
18217 271492 264429 271863 268436 256466 255882 268292 262481 261844 260328 253771 255261 238878 256965 283361
18203 283361 270829 249654 245155 234514 232323 238749 237792 232976 240958 245103 267843 284127 271806
18190 271806 242440 243458 231629 223086 215680 221317 231212 233404 246580 258033 259010 260291 241245
18177 241245 227028 231616 266475 283956 275612 261441 269530 280880 296823 317065 326575 331967
18165 331967 325638 357967 389717 400687 409978 428462 420134 420666 454823 489616 495560 512037 507753
18152 507753 498888 506042 511521 494251 478835 482558 469837 452753 443073 427405 421331 412009 408684
18139 408684 425648 446774 430778 405709 416164 440372 412918 401890 422707 430412 417724 424932
18127 424932 467384 547303 625248 688136 768407 863098 952399 1064545 1211147 1390653 1683204
18116 1683204 2133849 2800067 3760688 5168481 7338213 10625957 15428534 22946667 33595580
18107 33595580 38182001 29017016 17187536 10072790 6362713 4361584 3173974 2416083
18099 2416083 1939133 1622671 1363611 1131969 943229 814681 743866 692739 641280 608417
18089 608417 566521 534799 519000 488190 454073 437264 414997 407362 389813 376199 370126 363671
18077 363671 359274 355275 335441 328774 328959 344887 343367 341602 353061 374104 394874 400972 400464
18064 400464 381286 380182 372605 377209 364797 347407 340900 342461 371832 363823 328218 324785 340383
18051 340383 313690 292077 273307 246112 242562 261205 251001 243336 211479 197009 217231 228368
18039 228368 220998 232988 251023 259326 263653 243271 244263 224891 234496 261773 293357 323993 322132
18026 322132 329656 336437 341657 361454 387196 388931 356775 364273 376687 389243 400264 410234 393317
18013 393317 375359 366430 360513 342292 329268 310817 289018 264942 256490 253582 247447 231784
18001 231784 210786 198533 183623 157129 157189 169539 178868 177558 179331 180514 184545 193346 205762
17988 205762 192586 194856 213451 224231 225773 209308 221206 234883 250679 240716 239021 249803
17976 249803 246876 240609 232501 220273 215238 212261 209691 217789 206574 196613 195993 199720 204673 187207
17962 187207 164640 155079 162948 162267 149375 134446 135323 145037 147624 143500 136172 130478 107067 100585
17948 100585 98517 114504 111361 111439 124010 143657 150120 139450 147673 163539 169920 172973 199685
17935 199685 214569 224759 227544 239188 239212 214074 218493 217626 192990 180854 168184 153713 146097
17922 146097 150558 162481 160889 130609 103314 90531 95113 102531 91544 67662 68717 82556
17910 82556 95240 107081 108766 113148 100777 89933 76938 78164 85697 84534 82055 82689 90764
17897 90764 95093 105888 115489 135582 151272 171432 172970 166984 190940 221702 250351 253760 264735
17884 264735 286947 282368 280090 279656 291143 283778 265385 237083 217047 189793 162630 139953
17872 139953 140677 134830 92081 60273 49608 51058 68877 88924 84853 71508 64197 70231 74767
17859 74767 72333 57368 42953 36690 36144 55112 71063 87099 94070 78677 60238 80953 87900
17846 87900 111928 120303 126298 127551 146967 150822 164339 177933 167499 162512 179580 192919 179704
17833 179704 178040 187220 172850 176148 174674 164894 127944 114534 99726 103695 96719 101956 107602
17820 107602 77818 52982 49416 45495 49792 70719 72887 60661 71487 67099 44795 36278 43830
17807 43830 47560 37321 41626 51913 83166 86881 82058 90401 98047 96533 100316 86176 81445
17794 81445 83656 65678 55776 81050 83883 77487 78443 63870 60017 59486 75247 49004 46067 55210
17780 55210 45139 71288 77537 62498 51494 34383 26534 36298 54912 55101 42410 45291 44612
17767 44612 27515 27254 29342 46106 61718 38061 14728 16363 30403 31533 36379 35651 27325
17754 27325 33752 51681 47566 32484 20631 34774 52797 57710 63156 69079 66184 59878 53198
17741 53198 55140 50539 58883 59881 52519 60600 59818 55100 61327 50220 29908 27721 26776 19710 20383
17726 20383 41550 34412 25480 5873 -6467 -2132 5187 13233 23492 30341 23866 25754 54415
17713 54415 74606 76982 57551 25977 24664 42863 54793 53588 26035 21575 42840 44757 34158
17700 34158 43197 45337 31784 31786 32682 31348 33005 13857 -8286 -7450 4478 3233 10492 43625
17686 43625 58049 45387 30158 21892 28447 32949 44090 50430 55908 41062 13194 3597 4665
17673 4665 -8703 -7940 4051 20042 31339 30519 47451 41581 46931 44693 46764 43710 37839 43806
17659 43806 53394 43638 25005 22001 17917 20665 25977 29522 30762 24018 17565 8878 9269 11473
17645 11473 26272 10305 4314 5500 -6288 -15795 5045 12044 23802 37361 45985 52307 45922
17632 45922 50533 52337 52715 44753 34103 37303 14249 11439 15168 22013 30171 40872 47914 40721
17618 40721 38441 34042 22845 27813 36655 48946 41347 32129 51484 53777 56959 55836 49717 41648
17604 41648 34623 27883 39606 42297 40005 36705 33248 17013 20991 19395 3412 7531 9109 14789
17590 14789 23580 30874 15678 12307 6434 6305 10785 4911 7534 13614 6521 15212 7061 -8080
17576 -8080 -16228 -3946 -3458 4189 -9908 -24097 -30021 -8115 10619 11339 17913 23443 25434 24682
17562 24682 30167 55074 56716 66561 65087 75537 65346 55143 52956 60597 67926 63511 35305
17549 35305 34778 44590 46213 54978 49730 42558 51986 50958 58266 82472 80946 72165 76584 81082
17535 81082 67012 64279 65989 60962 61406 65009 65367 71987 80825 99978 93370 86514 83141 67774
17521 67774 43720 29657 30244 35112 51565 91217 101800 90382 70736 66258 77279 56712
17509 56712 45287 50919 57665 64928 54576 42471 44714 26050 7096 -5602 371 17776 22413
17496 22413 21784 21877 36061 17471 6020 3641 4532 14522 28040 20664 1287 6688 8175 15454
17482 15454 17609 804 16330 22799 32547 50262 37516 13162 5371 6681 26510 37493 55870
17469 55870 71236 68239 55175 59423 83750 78043 66344 58451 61565 51326 49397 56746 57330
17456 57330 63313 59607 45491 70404 90678 84497 62907 54082 68574 85831 87518 93891 97936
17443 97936 122916 184474 234151 216523 144274 86203 62872 54234 36634 29457 14786 13089
17431 13089 3495 12343 41223 49641 45479 31334 15732 4038 -2413 1114 10978 10773 11278 -12073
17417 -12073 -6576 3816 -5566 -7734 -1857 8958 -4521 -5228 -15622 -25599 -6825 -7484 -12283 -5117
17403 -5117 3400 -1584 -12134 5069 24491 11342 17930 20921 6763 14463 14204 414 -10227
17390 -10227 -14351 -2160 16172 5578 16585 15335 -2629 5893 6021 4473 21614 18217 3938
17377 3938 -6085 -3774 38548 46228 27212 24589 40464 47379 30478 39416 49248 40708 25607
17364 25607 14495 18759 17191 19914 36547 54102 36429 17393 22386 34205 53191 47989 44704
17351 44704 26712 14383 15781 13809 14629 23138 -8350 2905 19615 12192 11137 6521 -2242
17338 -2242 -2059 4752 -8976 -11226 -15621 -20227 2806 7746 -2008 -9222 1696 16139 11677 6075
17324 6075 529 -1853 14395 22372 7285 -9942 2792 19087 21258 1875 8270 9545 19953
17311 19953 22684 12911 13964 18479 6697 5531 2144 -6891 -8302 -13056 -5469 18509 19453 30605
17297 30605 28387 19015 2798 -8134 -5089 6722 9179 20145 14629 -10869 -6058 11218 -3023
17284 -3023 -20514 -36798 -32931 -5561 11884 -562 -9475 4648 18877 24415 14922 29489 42118
17271 42118 49937 43320 31297 30618 8779 -6125 -12973 -8325 -8269 -8776 -7573 238 -3788 -3948 3342
17256 3342 14643 34107 35794 23937 15512 22840 26795 25241 7226 -3600 4723 15016 20476
17243 20476 -2065 -20176 -19183 -9066 4834 15184 4408 -18109 -4654 16673 23831 25500
17231 25500 14105 9173 8903 29539 32485 19484 -3362 -12261 -6259 -602 -7752 -3714 -3838 18226
17217 18226 19355 10263 18537 9609 2139 -15476 -23188 -11273 -3619 -12559 -14831 -17916 -7996 -10742
17203 -10742 -661 11038 8750 -1778 -3085 -14495 -17153 -15289 2453 21327 38764 23942
17191 23942 12948 3466 -5445 9746 12985 -664 -1512 308 -13062 -19143 -3581 1212 -12118
17178 -12118 -21528 -13739 12120 22030 14670 1156 1342 -9694 -10004 -12522 -16512 -7839 -1733 -4162
17164 -4162 3190 -1000 -17580 -14080 1088 -4475 -27163 -16919 -3367 10251 10362 -385 -8319
17151 -8319 -28129 -27740 -28139 -27201 -40669 -27696 -4941 -2321 20888 26711 32918 34330 10231 6781
17137 6781 -9186 -34705 -32285 -18516 -9013 -2467 -23685 -25824 -18172 -6428 11134 10932 3795
17124 3795 14965 2503 10813 28158 28320 16856 8117 25943 21954 16396 5529 -600 5135
17111 5135 1940 -19085 -16675 4848 25748 31585 1692 -5888 10165 37276 26181 7170 7181
17098 7181 -3173 -19428 -20765 -15009 19488 26493 -513 -6379 -8565 -3325 -2500 -2421 16611 16611 7710
17083 7710 5753 16152 7233 456 -7127 1786 9562 27356 38210 16524 25778 48005 51150
17070 51150 49253 39201 29471 32786 34523 39433 45189 39365 15935 -3146 -8169 11596 17504
17057 17504 18182 7508 28153 9683 2874 11896 32349 36589 24329 31989 29738 30676 53536
17044 53536 55405 37080 29330 31575 25671 22608 38715 39621 27403 25907 31457 37280 21307 11611
17030 11611 1132 -24908 -23861 -12443 -30646 -28329 -25383 -17730 -9970 6358 12511 20534 31093
17017 31093 30436 25581 -761 -543 2132 -9230 4912 2343 -14036 -16401 -25702 -22259 1587 11578
17003 11578 10755 11884 -10819 -4029 14456 35661 30392 2243 5584 8474 -3457 -7689 14272
16990 14272 9959 -9598 -11211 -4192 3688 -4855 8702 17034 14770 20684 30872 27290 19303 9029
16976 9029 4534 24657 32564 33900 38243 10492 -11062 -26701 -6795 -9563 -14785 -16671 -7969
16963 -7969 -3656 -663 -2832 -8275 -14570 2866 -413 -7080 -19528 -15465 9338 11424 592 12117
16949 12117 23107 14620 11235 2191 -18331 -41891 -50616 -26804 -15613 704 -4260 -2056 13905
16936 13905 17417 2188 -7961 6004 25697 20809 2143 -183 -7198 -18669 4303 12446 28424
16923 28424 34210 33047 7712 1517 6906 -7699 -9641 -16638 -15678 -4361 -15353 -33055 -40071
16910 -40071 -38089 -31828 -14776 -13494 -354 7573 8567 7512 9598 5108 1512 8831 4149 -8907
16896 -8907 6459 5770 24913 33213 47732 38321 15533 9243 19012 32959 34343 21081 29629
16883 29629 30453 8788 23820 28935 14996 13359 19495 12669 -5251 -11508 1659 12605 13492
16870 13492 -7448 -997 19702 16461 1084 -565 10127 236 -10498 7979 -4633 -11228 -2108
16857 -2108 -3809 645 9463 15122 7983 999 14004 37178 16650 3001 2550 11177 10173 10866
16843 10866 5646 13509 30213 20132 2149 4955 3937 1270 17933 33475 34440 23062 11413
16830 11413 15747 645 1297 3695 -13954 -7957 -6379 -9718 -650 12307 5409 3425 -2382 -5190
16816 -5190 23340 43909 36256 30686 28700 15499 11663 2129 -17629 -16835 16894 18432 -3091
16803 -3091 -20545 -20481 -18990 -6444 5120 9525 18070 2733 12028 35781 47230 28925 19666
16790 19666 32442 27454 15717 9963 7822 3891 -525 10044 21415 29675 10259 854 12943
16777 12943 10922 16959 1255 -12231 968 292 7647 10599 7002 14263 13505 19560 20499 16893
16763 16893 16496 12232 -2901 -21206 -40854 -41043 -38716 -20902 -9273 -2293 2456 18051 30263
16750 30263 13451 -15732 -23764 -12179 -1587 12641 13596 -14656 -21402 -9279 6405 21635
16738 21635 25065 8773 11410 23179 20871 6067 -10853 -31282 -28821 -43137 -42979 -39181 -29831
16725 -29831 -21747 -27532 -32032 -3256 4691 11259 18608 999 -10822 -16173 -17112 -28718 -18193
16712 -18193 -8773 -12765 -15172 -10032 2150 15861 21693 4444 10385 10580 -6624 -29309 -6908
16699 -6908 10150 8365 17241 24731 16709 17807 15007 18671 27490 50247 44303 35364 21936 22473
16685 22473 4907 -17719 -7387 -16762 -43970 -38160 -14833 -15592 -22784 -14919 4312 18602 10594
16672 10594 11849 5429 6167 30076 37829 38184 39245 18672 11947 12334 -3373 -10312 -19787 -40034
16658 -40034 -35747 -22853 -9268 -4570 6372 9918 -5365 -17623 -838 -1844 -10509 -17285 -24848
16645 -24848 -23339 -15558 -19608 -33293 -21902 -30099 -32316 -20066 -5099 8483 -4690 -26579 -35955
16632 -35955 -33929 -43277 -43623 -13272 -2194 -13711 -27582 -15708 5086 10722 23872 16655 906
16619 906 -6655 -4248 -787 9471 -2096 -10999 -38475 -45189 -44110 -52133 -41556 -14604 -11534 -22220
16605 -22220 -17744 6686 1874 -19294 -5170 7019 4166 -1215 -11769 -11414 -1122 8116 8395
16592 8395 9328 -691 -11080 -14920 -7234 -21195 -30221 -17665 -17010 -19225 -22820 -20580 -12729 7330
16578 7330 12890 17705 5226 -1267 -6776 -10805 2754 9434 5790 6367 -9528 -18995 -6037 5252
16564 5252 -17599 -39404 -20224 -14317 -17827 -17313 -5642 5093 585 -9618 -22555 -14890 -2401
16551 -2401 -4949 -25564 -39166 -31226 -15047 -8289 -4969 -15243 -6291 2903 3035 14417 8544 5081
16537 5081 -8180 -3727 -1920 -14519 -18473 -15512 -25040 -14580 -12813 -5963 1497 1739 8115 5209
16523 5209 2967 929 6176 2789 -41322 -45995 -20675 -10591 -16645 -7791 -22953 -16840 -10601 -18442
16509 -18442 3014 21219 15856 9178 -2665 -16532 -15626 -5490 14122 20909 21394 34238 46764
16496 46764 31656 23532 15012 -190 -24126 -6844 20351 1804 -9014 -10538 -8930 -8421 -15313
16483 -15313 -14661 -11251 -5487 8097 4150 -14991 -6367 13870 24989 18945 8108 -12668 -20250
16470 -20250 -28779 -30777 -33034 -31259 -25965 -23095 -16335 6228 3804 -5937 -4799 -12136 -10883 -4867
16456 -4867 -4953 -17941 -8539 18644 15095 -14982 -19878 -18061 -36530 -31910 -25021 -12867 -12827 -6319
16442 -6319 -8859 -3321 -3051 -2975 -1809 4170 -5130 -11720 -17068 -17468 -5481 4551 3278 11698 7482
16427 7482 8670 14848 12652 -2407 -123 332 12773 18766 21845 17793 9532 -2577 5035 9112
16413 9112 12845 7331 18024 29261 34938 35858 39831 37667 21444 4506 10967 7652 20006 17382
16399 17382 4506 19363 12831 2230 1860 17622 31544 27656 20829 26153 28666 19843 -18478
16386 -18478 -21075 -26618 -10629 6406 3364 22087 43945 52113 60019 50049 51836 29438 8912
16373 8912 -9289 -22415 -31553 -24052 4961 6619 11370 5749 8648 514 -2203 -3070 11171 13024
16359 13024 16323 13183 9205 16172 15905 -2001 -21692 -14017 -14197 -12258 -4129 7377 -5026 -7840
16345 -7840 3806 20183 11481 -11262 -12274 213 7571 7285 5795 10175 22842 38425 24135
16332 24135 31492 30806 -3777 -27986 -10672 96 3192 -3777 -31545 -43957 -41611 -22103 -31700
16319 -31700 -19368 -7412 3749 -7479 -28409 -17383 6989 23668 26936 11030 13379 16649
16307 16649 13021 4541 5431 -647 -3758 14667 33913 31341 23820 19605 12380 -5446 4016 12811
16293 12811 4798 -13784 -19052 3235 14675 -303 -6083 -2102 11727 4749 19938 67128 71950
16280 71950 54056 14908 -12520 -23346 239 -854 7584 14369 10236 4538 6406 12337 -11251
16267 -11251 -33899 -24401 -22352 -7609 6059 -6849 -17147 -19505 -18477 4228 6040 -5386 -12947
16254 -12947 -25071 -30032 -32995 -16936 -14988 -25629 -41348 -33597 -27791 -16358 -742 5990 6729
16241 6729 -1794 -10416 -4880 -16514 -37638 -18141 2028 763 12831 27520 4691 -15991 -7892
16228 -7892 -12157 -11534 -12655 2024 15456 29746 -390 -40325 -41824 -27871 -2469 3898 4801
16215 4801 -360 19718 23642 16765 20217 12989 23414 14978 9308 11792 -4616 -19698 -45945
16202 -45945 -54041 -31401 -20335 -4959 11951 2002 291 -10600 -7720 2490 26338 15328
16190 15328 -3893 10538 16627 5082 4013 12157 18867 17196 19374 -5134 -16436 -11326 2309
16177 2309 2798 -4431 -5447 -2892 -9998 549 -4838 -44 8246 -7177 -15339 -2394 1902 3857
16163 3857 7970 1619 -25858 -36776 -31658 -40513 -33220 -23456 -28378 -30523 -38939 -42662 -32999 -23372
16149 -23372 -20207 -19575 -20439 -15964 -17974 -36579 -21359 3365 202 -22551 -26283 -11155 -22811
16136 -22811 -32301 -32726 -35006 -30681 -17935 -17017 -24726 -18993 -3222 -10900 -1703 18316 24670 33636
16122 33636 45381 40154 40957 23081 12246 3422 9754 23987 36461 34278 15709 11893 10970
16109 10970 6121 -14725 -23467 -24966 -4440 -12747 -22621 -22440 -13408 1052 8377 8839 9900 7095
16095 7095 12767 11616 728 6209 12469 11195 -1513 -6104 -1009 -5082 -6825 -7812 15341 13403
16081 13403 9488 -1368 -10018 -7501 -3481 -10742 -23463 -16073 -19868 -33878 -20154 -4121 2105
16068 2105 9435 19738 3774 -6202 -1024 20722 33825 34848 29602 22738 19500 8646 4938
16055 4938 -813 -15924 -16131 -22756 -18692 -9097 -12990 -7032 14300 10650 -866 -20277 -22423 -10717
16041 -10717 3798 10370 3267 14198 15855 15170 4910 -2123 -1108 13367 21437 12936 -881
16028 -881 3962 11640 7070 12208 35437 29434 6551 -8197 -21208 -14713 1663 4460 -5632
16015 -5632 1673 2773 2749 -7217 -10436 -13360 -18088 -23692 -25825 -34659 -26250 -23326 -12524 -1648 -1249
16000 -1249 -385 14162 15459 -15794 -31898 -21988 -6632 66 23243 9572 8328 15431 13184
15987 13184 -6064 -30074 -15863 -2364 -4713 -8445 -19124 -19338 -41328 -43800 -14367 -12209 -20698
15974 -20698 -8494 17441 36409 21723 3314 -656 -18960 -37443 -27393 -10220 -7751 -6730
15962 -6730 -7792 -1068 6996 9062 -5774 -19202 -6668 -14161 -12166 -1028 2543 -1938 -6096 -535
15948 -535 28809 29627 10341 3588 5843 -6929 -17496 -25914 -28180 -37277 -50615 -30192 -29549 -14560
15934 -14560 -15304 -22638 -21381 -1723 13914 6132 -19367 -15140 -5247 4968 3649 -7350 -20813
15921 -20813 -14673 -11003 -8868 -213 -3827 -9291 -4932 2972 -14850 -28022 -28803 -32863 -30510 -14918
15907 -14918 -8221 -1398 -17304 -25271 -10155 5226 15033 19432 8249 720 -2373 10031 16368
15894 16368 10079 5613 -503 -8973 -29409 -34237 -9356 9088 -4636 -13496 2318 2923 -14567
15881 -14567 -31339 -34925 -20483 -12777 -14398 -6582 13952 22395 23745 -841 -8570 -170 22028
15868 22028 11843 4899 4050 15761 1434 -4014 4031 16575 13208 -2958 -8162 6115 13245
15855 13245 -4223 -14472 -12558 -15537 -27283 -25000 -21733 -27474 -41548 -48112 -40152 -45398 -29624
15842 -29624 -16883 -10932 -10485 -18664 -32748 -17994 -3100 -16591 -18908 5570 -6239 -15024 -2386
15829 -2386 -7573 -26182 -23427 -17760 -28561 -25950 -12964 5155 17966 -362 -13576 -27110 -8541
15816 -8541 8535 3765 -3738 1586 462 5525 15807 -99 -1135 6302 19667 27757 22712 4713
15802 4713 4910 -11044 -28638 -14949 -20629 -25890 -3996 11885 3249 -20011 -7198 4806 430
15789 430 16487 29098 33769 34348 26872 20740 23682 24894 10155 3184 -31940 -50036 -44304 -38416
15775 -38416 -25455 -16331 -13619 -20770 -26960 -33946 -38573 -36901 -10263 -10544 -22940 -15468 -10472 7440
15761 7440 9745 5276 4953 -9713 -14571 -550 2524 -2246 14382 30350 19159 4417 59
15748 59 -11769 -25019 -25697 -33797 -33385 -22873 -22724 -22595 -17974 -384 -15699 -41364 -20213 -10757
15734 -10757 -17989 -45503 -48734 -46248 -37568 -37546 -26927 -12237 -5788 -594 -16925 -33083 -33904 -22164
15720 -22164 -30589 -16853 -2618 -9186 -17621 -17421 -18630 -10777 -5607 -21942 -39052 -48937 -19330
15707 -19330 -15236 12928 16215 -10117 -15643 -19197 -10659 -8177 -31883 -15279 -6929 -921 -5290
15694 -5290 -4117 13343 19369 4779 7722 7065 -1828 -17173 -45494 -57537 -42567 -31009 -35189
15681 -35189 -39640 -30273 -28772 -32087 -34220 -40997 -21853 -18596 -31052 -31780 -2983 5646 4249 -1760
15667 -1760 -10329 -20207 -21907 -19115 -11593 -2370 -10435 -25242 -1255 15013 15881 -11756 -11706 18263
15653 18263 25304 24228 11590 16836 21121 30744 9551 3895 2327 19463 32447 3958 -6933
15640 -6933 -8400 4342 10652 15058 19939 11679 -4306 -1473 -18587 -22535 -17444 -19829 -13149 2496
15626 2496 8751 -11009 -28310 -27395 -32137 -17893 13962 8470 368 5624 -2173 -11890 -3198 3852
15612 3852 3665 694 10425 23270 28832 18531 -4157 -19814 -33606 -26191 -9150 -17769 -20843
15599 -20843 -40811 -26289 -11539 -14952 -7002 9735 9229 -8732 -20107 -4242 -8789 -25575 -6105
15586 -6105 -9733 -20052 -15176 7850 13099 26273 12633 -14246 -10260 -5240 -14044 -2373 20372
15573 20372 33463 25513 12573 4593 -41 2128 -5328 -8869 -17219 -2123 3337 -16146 -17937
15560 -17937 -14132 -27319 -20246 1 1846 11242 8761 -1738 -6198 -13782 -39013 -57182 -30311
15547 -30311 -33385 -26928 -15395 -7995 -23189 -35620 -32248 -25136 -24587 -29713 -21971 -12300 -25875 -34230
15533 -34230 -17052 -21566 -19863 -14947 2262 4202 12109 -4176 -4786 5527 2513 1918 -9556 -18150
15519 -18150 -7265 -2373 -14251 -21182 -15433 -3778 -8295 -13190 -20693 -9411 8173 16980 10416
15506 10416 -3032 -8947 760 9836 14495 2277 -12299 -28609 -13643 -12211 -6563 8479 25557
15493 25557 30406 12325 -11084 -10415 -4791 -15900 -2834 2322 -10092 -14920 -16653 -6726 1839
15480 1839 -2010 5066 2136 -9122 -11735 -26222 -38260 -20660 -10781 9843 8715 -5519 -2808
15467 -2808 -4415 1515 25788 29072 3234 -15234 -39106 -42263 -34417 -34067 -29202 -17103 -3798
15454 -3798 -734 -12252 -29850 -27909 -13600 3767 -6662 10585 9853 -402 -4957 -24511 -26217
15441 -26217 -13448 -20649 -10330 -1183 5993 8471 33069 43177 34177 18732 15728 25941 28439
15428 28439 22748 -4948 -39826 -39293 -11208 4511 -3625 -24806 -19079 -34515 -34979 -32529 -25731
15415 -25731 -12595 -15912 -12807 -15283 -35841 -46704 -27875 -9149 -13743 -6352 3179 21923 27728
15402 27728 26478 11955 -9487 -16268 6482 16555 13273 -6365 -1041 1764 1148 -14241 -16201
15389 -16201 595 13142 17886 25854 42971 15248 -17836 -35226 -35967 -24280 -16145 -15135 -10110
15376 -10110 4480 -2854 5431 24523 16746 -6454 6844 15016 23242 32685 19040 8487 6595
15363 6595 9401 12528 5216 -10074 -460 -18200 -26583 -18671 -3856 -10984 -25215 -29795 -25357 -3031
15349 -3031 7769 12742 -3701 -25757 -28776 -36958 -39377 -42493 -48310 -60031 -56379 -39198 -31034
15336 -31034 -28243 -19489 -12183 -1705 9570 -4666 -24837 -15751 -3484 -14715 -13207 5728 9904
15323 9904 9555 -3069 -1192 3438 32927 13729 -4556 1053 12813 24616 12046 -8029 -5143
15310 -5143 -26897 -40751 -24631 -8340 -13438 -12028 -1924 -290 -5714 -27131 -35019 -34842 -30185
15297 -30185 -36651 -19743 -6471 -8800 -31604 -30566 -12950 4365 -6232 -21999 -5374 -1810
15285 -1810 -10673 -26822 -39401 -24257 -15121 -21627 -12358 -14622 -29285 -23083 985 1525 -8642
15272 -8642 -21289 -21622 -20604 -21040 -33537 -26997 -6258 -19033 -27997 -28298 -14199 -17208 -16248 -22383
15258 -22383 -13196 -12598 -27669 -36091 -16464 -7163 14458 25207 38092 41508 6322 -17646 -13451
15245 -13451 -4766 -3065 -2593 10817 15755 2120 -7982 -19940 -25457 -30250 -24548 -14855 -3808
15232 -3808 13440 18917 1466 -6379 -10034 -7469 -8624 -11073 -16384 -483 -4092 -14198 6467
15219 6467 17264 4839 -3768 -9471 8509 5055 -3742 -14807 -16013 -14120 -19389 -23423 -20585 -7534
15205 -7534 -3137 3831 2566 -1495 -2653 2200 3830 5196 15270 10513 -14477 -10729 -5839 -10744
15191 -10744 -13242 -25286 -27954 -17077 -16877 -12648 -19457 -18938 -17722 -45157 -43792 -30747 -16539 1512
15177 1512 14647 -8950 -8298 8906 7801 -20986 -27115 -15325 -6650 -23130 -18849 -18474 -34054
15164 -34054 -17967 -12540 -6657 15583 19082 -539 -7002 -14342 -33416 -41341 -49383 -46666 -37827
15151 -37827 -24410 -15776 -4896 -3986 -17810 -19721 -3296 -777 -515 -185 -402 2414 3770 -13449
15137 -13449 -20339 -29284 -44290 -38546 -28144 -20424 -20770 -24143 -16286 3573 3837 -15978 -24235 -4118
15123 -4118 1069 -5158 -14343 -32746 -35855 -22182 -2739 -9363 -7558 -5957 -11450 -9772 -14424 -19615
15109 -19615 -33210 -41136 -41383 -22094 -9652 -9995 -20509 -18445 -13313 -8724 -11266 -13759 -11379 -12495
15095 -12495 -18552 -29875 -37365 -33052 -14291 -7160 3524 -3618 -23159 -19830 -175 13734 -804
15082 -804 -16134 -17000 -14075 -15339 -2612 6458 -4503 -4968 -6560 -1638 1209 -1970 3398 -2290 -4883
15067 -4883 -12088 -28774 -32599 -53736 -52320 -25874 -7095 -4755 -15743 -31912 -31808 -20126 -24878
15054 -24878 -23585 -24593 -25723 -9750 -4570 -4064 -2911 -3786 1640 19703 21501 9497 3631 357
15040 357 -805 3500 -14418 -17840 700 7954 9122 17419 27194 13771 -5107 -544 10793 9987
15026 9987 15206 21468 24285 27434 20266 2819 -3270 -29422 -16618 -8663 -15580 -20541 -15673 -25787
15012 -25787 -8801 3936 744 -16336 -25881 -28154 -18423 -16029 -28712 -13815 7794 11409 6424
14999 6424 10888 15677 15250 10102 -368 -22037 -5644 -4370 13799 33439 32227 25802 14978
14986 14978 6406 10083 -6849 -4762 -662 -13738 -36045 -48290 -47466 -46012 -29710 -10868 -809
14973 -809 -13250 -29391 -10288 4890 -873 -9583 -18358 -8926 -2208 13930 5508 174 -9229 -10171
14959 -10171 -10658 -1168 -11910 -24364 -15979 -19034 -28834 -50244 -49846 -39288 -12935 -14108 -18672 -15979
14945 -15979 -11186 -28660 -34933 -35654 -31707 -17230 -6710 -3549 -4247 1083 -11405 -16631 -9453 -8242
14931 -8242 -21832 -31398 -5808 1721 -17770 -8346 -7380 -11191 -17813 -1708 10115 -5522 -16602
14918 -16602 -26399 -26184 -20501 -17297 -10012 -1573 -6397 -11462 -13087 -18855 -23757 -19178 -24420 -16032 -8258
14903 -8258 -28212 -30066 -39557 -38448 -23182 -24840 -25816 -21039 -29808 -22028 9537 15246 12893 7927
14889 7927 -4834 -13588 -952 12348 2170 1100 1466 -18260 -15576 -4743 -2099 1035 -1598
14876 -1598 -9231 -6035 -7129 -20349 -22743 -5160 4256 6085 2185 -19074 -8002 13090 11227
14863 11227 2047 -4198 -16313 -6784 -7351 -15147 -18565 -16566 -40722 -45544 -45340 -53359 -47575 -34405
14849 -34405 -27335 -24104 -882 -9583 -29529 -37955 -23127 -21558 -13864 8342 33940 35113 18710
14836 18710 19378 -133 -17168 -25445 -11775 1086 14100 21427 16087 10096 25560 21098 12359
14823 12359 5387 9928 1652 -1425 11089 15240 -825 -4730 430 5186 14053 37189 51528
14810 51528 36371 3050 -7648 10262 15006 6057 -5632 -15716 -8459 -9545 14275 35058
14798 35058 34000 32639 8976 12823 12504 5425 -10413 -18469 -8966 1332 4596 9518 17252 5529
14784 5529 -11502 -6219 -8406 -14355 -30033 -39744 -21164 -8296 13659 17546 -9778 -27151 -11114
14771 -11114 -11823 -7907 545 -19605 -19132 -21185 -8409 -7508 -33472 -44714 -49550 -27308 882 -3452
14757 -3452 -9359 -2418 7088 -7342 -11993 -2880 -1021 -13246 -15311 -18968 -5391 -4993 -2014 1515
14743 1515 -11798 -15669 -13832 -13399 -10270 -29234 -33999 -19533 -12937 -19757 -30734 -40450 -39176 -34219
14729 -34219 -28951 -21110 -28432 -13269 -1717 -16392 -26241 -28122 -4141 -5385 -10073 -20515 -21539
14716 -21539 -24903 -19620 -21335 -27220 -30751 -38265 -33526 -26286 -33408 -38850 -26022 -15352 -7300 -6918
14702 -6918 -16968 -22077 -19073 -6233 -16188 -14764 -12653 -9943 -15560 -12045 -1105 -7399 -2330 1996
14688 1996 -12566 -22344 -20249 1503 -860 -15746 9334 -3708 -17832 -10835 5372 -48 -3759
14675 -3759 -3820 1062 13785 12255 -4779 -3430 14511 8820 16299 2285 -12174 -14024 -34186 -24583
14661 -24583 -33476 -36572 -14228 -10260 -11026 -13875 -10040 3157 3810 20192 10910 -2275 6805 17442
14647 17442 8205 12432 10498 -573 557 398 -3255 -12470 -341 -2780 -22647 -26357 -30804 -17552
14633 -17552 -1910 27604 35864 21214 6176 17029 22781 2504 -17433 -16864 -18383 -17393 -18464
14620 -18464 -18717 -10512 -2743 -12182 -16532 -34076 -27095 -14502 -862 8073 7633 12535 14625 13919
14606 13919 14598 -7991 -22341 -6963 13792 17745 15876 24062 5750 -2039 5579 8383 4268
14593 4268 3190 3208 -8640 -12262 3237 4497 -10230 -1434 2677 1130 254 16873 -2009 -18071
14579 -18071 -27876 -15776 -13166 -14372 -13490 -2359 4146 -253 6003 2692 -3228 3632 -103 6970
14565 6970 14500 9587 105 -1085 -8232 -1170 12311 8472 14932 4465 9585 17795 16879 4490
14551 4490 -3872 -7680 -14635 3402 1912 9547 16130 21587 16794 15619 4513 -16752 1363 12032
14537 12032 2490 -23964 -24324 -17336 -11568 -12082 -2437 -3711 -10008 -7240 1079 3504 16358 14141
14523 14141 6997 1550 -12570 -26023 -26626 -24365 -25618 -56404 -56216 -16106 -8230 -711 -6095 -15409
14509 -15409 -22590 -15905 -20443 -14486 -1043 -8397 -16108 -33340 -31675 -1199 -1393 5842 4363 -23697
14495 -23697 -29648 -19061 -21295 -26118 -18263 -23165 -25947 4023 13393 -14346 -9728 -16843 -9831 -2679
14481 -2679 7065 10145 -9719 -2355 11756 17437 9123 17652 310 -19399 -21761 -12947 -23577
14468 -23577 -6443 -372 -15810 1171 12722 18018 28946 27035 18148 12659 20859 37755 40220
14455 40220 22535 -9835 -14231 -10978 -11750 5056 22355 16293 6068 -6428 -19362 -12202 3529
14442 3529 1587 -12059 -4720 -2762 3824 -3829 -2910 12960 -7953 -21418 -42816 -50732 -20241
14429 -20241 -15164 -11020 -12868 -14643 -13469 4667 -11577 -19036 -16149 -9232 13667 24947 2824
14416 2824 -12352 237 21029 43588 36976 23900 25037 3175 -7798 5288 11386 747
14404 747 796 -2298 13724 23698 -3249 -28777 -18179 -13844 -34176 -41433 -23043 -11685 -6614 -2834
14390 -2834 5666 5866 12017 28275 36368 26637 4967 12522 8446 -7729 -7409 11197 20618 20642 20584
14375 20584 21480 30687 22303 16724 9036 -1726 4522 15175 6209 16499 22548 29596 37453 28521
14361 28521 33767 63145 76591 63259 78006 106739 122301 126091 154154 172701 177423 201676
14349 201676 206419 196509 203058 191755 186694 188984 162199 157439 144358 142407 149496 112900 92376
14336 92376 85989 74777 63336 62426 58163 58743 53545 52387 26572 1358 -16992 -14557 -10967 -14592
14322 -14592 2700 13843 3958 -12979 -11563 7648 14646 4592 13830 22191 23790 25146 6043
14309 6043 -10377 -15491 -9279 1355 -6268 -18259 -27464 -24689 -23911 -18422 -4687 3636 565 -6320
14295 -6320 -8111 -4500 1776 -12884 -8603 -6531 -5957 8291 3398 5582 13410 -488 -29543 -44569
14281 -44569 -53532 -49361 -30212 -19956 -1031 10239 14781 4125 8310 18749 5076 -11510
14269 -11510 -26643 -19127 -17298 -9453 3770 10810 -6444 -36983 -31674 -19934 -11481 -6940 -3551
14256 -3551 3967 3802 -10061 -10476 -9459 -6151 -14466 -37439 -37552 -39465 -33323 -25024 -31352 -26325 -18567
14241 -18567 -30593 -40003 -44344 -32756 -39315 -47330 -41875 -41879 -29847 -26889 -26425 -13426 -13349 -33736 -39539
14226 -39539 -26009 -20381 -19903 -15183 -3760 11787 14408 3252 -20035 -35214 -16935 -10697 -19302
14213 -19302 -12208 6561 -10116 -21463 -11395 10070 18089 21029 17208 14281 4656 -14932 -26584
14200 -26584 -23975 -20483 -1826 -6013 -4604 1879 18025 34438 10179 2096 9694 10725 -3654
14187 -3654 -21641 -27997 -17383 -23038 -16964 7099 16917 29265 30389 18545 -805 -19626 -25485
14174 -25485 -8971 -22588 -22710 -6720 -6431 -3126 27240 23345 -8065 -7998 9995 13911 2448 3472
14160 3472 13239 17741 26874 44696 36953 31821 15664 1160 -3084 -2300 6710 12848 22806 12910
14146 12910 16166 7021 5764 -1962 17897 23214 7101 7088 28981 28742 15687 11948 15518 -1563
14132 -1563 4300 11353 20208 22519 32865 45021 68041 80758 79620 81592 74996 103426 116976
14119 116976 128367 135931 169272 204808 229685 280750 377736 483887 598061 742193 940253
14108 940253 1125671 1317489 1525678 1689784 1804126 1865350 1845031 1781411 1671942 1502308
14098 1502308 1307140 1094512 882386 687347 572194 450790 339094 290899 251840 214979
14088 214979 186096 151259 128841 119900 103799 66780 70700 85217 86016 90229 87991 79136 57584
14075 57584 46499 37807 31444 20302 20088 39883 39749 30186 17911 -8204 845 26411 34759
14062 34759 32124 17890 8529 8647 23650 25553 42788 33622 33580 34537 18246 -13399 -47053 -43389
14048 -43389 -10290 7425 4716 4747 20522 34522 34296 26049 26586 27260 52484 52306 45759 20850
14034 20850 -16253 -20101 -15651 -6716 -5539 -2585 5674 -3488 -26058 -28590 -8860 -1842 158 -12648
14020 -12648 -26066 -18249 -2801 -1694 -9533 2949 8909 22602 14308 -16174 -10836 -3049 -12537
14007 -12537 -6555 6969 6909 22554 30742 24343 14852 11757 9301 9005 10778 13036 6830 4052 1938
13992 1938 -4992 -12309 -15947 1022 15670 7857 2330 -5483 11517 14075 -8967 -4874 3611 -7507
13978 -7507 -7922 19 8222 7464 -13393 -16483 -10248 -7218 -28430 -26313 -33182 -20396 4454 14368
13964 14368 9653 17724 575 -4892 -8636 -2252 4586 9008 -15968 -17125 2500 10531 679 1171
13950 1171 3398 3161 -12932 -31959 -27792 -23147 -30716 -29169 -15261 4496 31027 24288 -2574
13937 -2574 -911 9033 1584 -3899 2079 -4411 -6676 -25650 -23348 9538 -3863 -9023 7823 14212
13923 14212 8044 30472 33090 37247 38542 28959 24135 5899 -7916 -13807 -3263 1763 -14175
13910 -14175 -15656 6642 28627 7687 -5115 1697 1617 19202 34080 34120 19990 4781 6792
13897 6792 5158 21233 22015 4606 10673 36309 41633 21307 -274 -1716 457 8074 10186 20751
13883 20751 24729 13604 -6439 -11548 7557 10917 509 8130 -1658 -10801 -5121 5028 1126
13870 1126 376 -7683 -39270 -31756 4045 43578 57236 42685 30012 20408 38493 47689 34831
13857 34831 26570 29217 20898 16139 25502 24992 1249 -20496 -4656 20965 36930 47222 56906
13844 56906 47844 26955 15837 14382 24078 30361 39968 37867 54839 62763 70672 58484 42420
13831 42420 28221 44513 50300 47451 41730 18417 25565 25622 1245 -1744 13686 13702 4278 13354
13817 13354 157 -1143 -9095 -20683 -31300 -26880 -17128 -28518 -31633 -25234 -19671 -17462 -28813
13804 -28813 -28778 -21664 -9097 5175 3384 707 1667 -5377 18493 43524 30752 19369 2291
13791 2291 4502 27541 32026 40909 42304 32981 27968 38140 36625 22468 6836 506 14595
13778 14595 31303 38049 46144 30384 13304 12782 20437 29812 28294 15193 16815 17970 10032 18658
13764 18658 23434 40506 48192 43011 53428 44881 31383 30821 27245 19767 16961 33139 28634 13957
13750 13957 21073 19360 9406 3447 4851 5942 4489 2843 2498 21005 16200 3893 1674 -1611
13736 -1611 6715 28128 6991 467 4514 16852 24303 11226 5022 3782 11748 25276 43992
13723 43992 50705 43167 29055 23332 19917 14107 16189 11427 11485 9627 7875 10389 -3262 -4440
13709 -4440 15604 31280 12334 6412 -6478 -14297 -8135 10202 17949 14092 6300 -4721 -2152
13696 -2152 13892 16620 13099 -2732 4648 11273 4637 -513 -5601 2235 851 11793 12701 9706
13682 9706 1601 -759 7164 17678 17752 8906 -1358 -17938 -13359 -1955 16018 22168 29950 36383
13668 36383 40340 45433 24792 24854 46708 37710 27039 29198 25623 23972 45599 44163 41883 42769
13654 42769 31821 4843 -10342 -3222 6946 8375 -12947 -14291 -37101 -26879 174 7132
13642 7132 -318 7428 17704 10681 24859 24728 8550 1931 9419 -716 4169 4152 -4943 -9065
13628 -9065 2379 5291 588 17737 26665 -1948 -19489 -7945 12930 15574 82 4513 331
13615 331 527 5757 6034 4784 6048 -269 2170 -2652 -20398 -39655 -28700 -6844 -22663 -32677
13601 -32677 -21349 2769 18342 39605 32310 20478 21191 18593 12913 14214 5589 6130 3358 -12458
13587 -12458 -16606 -10341 -1715 6616 -234 -8688 -6545 -35683 -24134 -7444 -4763 4630 19348
13574 19348 22473 20706 25980 24818 26243 19404 28277 30251 23452 17254 4227 8661 12171 5942
13560 5942 -2199 -719 1309 -1331 -5643 -9968 -16338 -8583 -20517 -24001 -16945 -20858 -32530 -38720
13546 -38720 -29945 -21100 -25538 -27309 -14014 -22670 -10338 7961 6914 3327 9072 -13952 -17101
13533 -17101 8077 -68 -10414 1344 14609 20190 10916 -13141 -9718 -20551 -30839 -12527
13521 -12527 -735 -15165 -22071 -7148 13068 13425 22205 30948 26151 11157 4007 11419 20839
13508 20839 12597 -5173 -20937 -22984 -9721 -4084 9804 26189 23196 20460 15298 11558 15855
13495 15855 19723 37033 24748 10266 6407 -10630 -3330 6985 -6470 -10559 -17115 -13821 -3670
13482 -3670 7850 2231 -10615 -16998 -10523 3436 -3930 -15918 -32607 -22282 -3715 1128 -14608
13469 -14608 -29278 -48190 -23508 -2270 21435 8637 10046 16375 3414 -6159 7435 4410
13457 4410 6660 6418 -6462 1859 11769 12707 -8134 -3479 14186 7351 -1867 14962 11397 -6325
13443 -6325 -17703 -10133 -13795 -1336 -1630 8973 15894 764 5142 11586 3691 27803 48289
13430 48289 46569 24277 -13428 -13226 -7154 -13365 -21940 -6108 151 -4076 -3286 -5665 14710 970
13416 970 -16745 -3720 4902 15092 4426 12705 14722 6182 4695 14568 -2260 6517 9370 10519
13402 10519 17609 28184 25648 12997 3847 -4712 12933 12455 12270 31723 28166 18652 7663 8296
13388 8296 7592 6563 12436 11625 12889 51 -6220 -24137 -27388 -18535 -10074 17867 22794 7371
13374 7371 3374 12848 -3454 -2685 -4288 -5234 -8495 -28627 860 8362 3508 1997 -602 8806
13360 8806 15622 1595 -29616 -44468 -30346 -13483 -18240 -17293 -21279 -1536 11413 12087 10668
13347 10668 8127 -3972 -757 -11283 -16391 -25201 -18775 -9311 4738 1216 -2652 -3969 4936 12501
13333 12501 6505 -7436 -14370 4782 16264 32288 40688 21951 33299 32582 25038 19093 17042
13320 17042 2323 -6079 13220 37141 54840 45512 53372 54463 43490 57414 55778 33875 35393
13307 35393 28562 15722 14614 19065 33552 37219 36514 25675 53405 69123 57176 48678 70839
13294 70839 52484 26186 35175 30214 19024 15997 15292 22039 37056 30842 20007 12641 20949
13281 20949 26640 54205 42180 31356 44152 59395 53320 39870 46922 40484 47458 41953 32415
13268 32415 29663 32658 25302 30360 47992 60277 87572 86047 74377 78537 69327 47050 26080
13255 26080 11293 4718 10439 3674 14702 13736 -2170 -17799 -34366 -27012 -232 13174 9339
13242 9339 3748 4150 35715 36833 26446 27743 31591 46882 48776 46626 57700 49453 23189 7599
13228 7599 6676 24164 14037 8382 -281 -4989 -21986 -20943 -25698 -23008 -17869 -12247 19493 24546
13214 24546 37121 39879 35330 22834 30078 49470 53188 37406 27096 18491 13759 32626 34597
13201 34597 45262 41478 35357 21768 12637 15951 34174 42261 23389 -12913 -20712 6926 28732
13188 28732 24436 11177 14215 9146 17773 1923 -6447 6641 15058 21332 6624 19348 15704
13175 15704 14266 25579 13697 8239 7832 14940 30813 37827 28310 24445 8790 -9100 8672
13162 8672 27632 36561 35396 31984 32426 51728 62941 50980 57284 45958 37250 22543 8538
13149 8538 -2244 -8144 11437 19397 9533 -4641 2303 8379 17766 51895 66363 49579 36271
13136 36271 30328 18967 5290 -7155 14762 23342 15914 33678 25737 38134 35887 29395 14084
13123 14084 13703 34751 58074 52365 47872 51922 57459 67648 77396 84101 88518 94118 126494 157430
13109 157430 167219 184937 222277 245032 278805 339027 411732 510141 617506 713208 810797
13098 810797 911523 997960 1033213 1024926 1003138 927460 824014 719823 625155 510680 401420
13087 401420 311778 228835 210374 186956 164872 143572 106401 95238 112762 98938 86520
13076 86520 75046 63669 54261 51436 61029 56749 51537 43924 65241 69955 52903 35674 31157
13063 31157 26896 28129 44821 32625 21656 23060 41966 42995 33605 26023 32279 47376 43624
13050 43624 45625 27911 33773 30140 23101 28977 20152 24491 23174 21971 16871 23046 26446 26491 20871
13035 20871 13937 10614 21672 32743 26282 37060 44660 40338 34123 35166 54090 52241 44353
13022 44353 25353 19163 23042 28001 20911 36375 43939 33467 41235 41450 30735 14380 22541
13009 22541 15563 -4478 3513 8902 35239 43614 50332 62633 55020 42477 34759 42066 41921 38196
12995 38196 50037 35234 38822 49004 42345 42492 32503 34092 46700 59279 80996 89967 117283
12982 117283 162356 217430 269666 310584 333654 350230 332509 265349 202751 154811 128422
12971 128422 100316 101797 117271 114125 92955 63112 59981 68765 64752 94462 98833 72412 61114
12958 61114 60305 51937 38181 60198 72481 79727 88775 87464 81699 66465 76315 70014 69401 76797
12944 76797 81287 86626 101141 98534 82999 96056 109437 96822 82005 68728 92704 118766
12932 118766 105625 90579 115279 120545 138851 158550 145410 122811 104343 126436 126843 129837
12920 129837 124608 146058 168926 158631 132163 100775 84969 101012 96315 78203 59634 61027
12908 61027 67390 56536 62224 70566 72663 67270 62216 48756 41572 35283 35898 25866 24167 43913
12894 43913 43422 48856 65495 88061 92789 80311 77198 80749 73174 74664 93105 112115 114259
12881 114259 87855 71521 66941 57324 76750 101004 100748 99617 87840 85295 85570 104757 112291
12868 112291 123883 129834 121741 104080 90705 97222 95200 106662 122644 137579 145622 120611
12856 120611 111695 119160 115827 128860 132049 147654 173264 195086 187750 200070 203069 197896 191619
12843 191619 201038 210672 224098 220759 216354 198965 185225 191099 212600 238041 246138 259581 267067
12830 267067 257664 253974 289771 278169 273410 270352 270076 252696 230591 242029 250021 245643 235090
12817 235090 235782 257940 279960 296735 297914 298807 319260 349449 367097 383565 373568 377423 368291
12804 368291 375049 385063 401825 411145 408809 389532 375491 380049 360262 320428 300144 305408
12792 305408 307162 286691 263631 259557 271385 287385 284301 275253 304261 296558 277010 292046
12780 292046 318734 317378 343931 369793 396326 393993 374772 355444 376861 416580 435329 427993
12768 427993 447011 468261 501801 521542 532286 530369 527778 531173 533003 540993 552048 551661 551507
12755 551507 567449 567399 580709 593119 614161 645859 677609 691765 704350 710770 725795 755128
12743 755128 781377 814195 826719 818703 816924 825884 828081 862790 891809 901627 923857 957226
12731 957226 975567 1001454 1036552 1066432 1112796 1146661 1157829 1183706 1205632 1254038 1315258
12720 1315258 1368415 1435884 1482897 1523615 1602002 1682712 1749906 1828786 1940458 2038303 2136559
12709 2136559 2237938 2378065 2521734 2661847 2822851 3012718 3219982 3453897 3729531
12700 3729531 4031659 4390230 4821299 5336219 5976588 6747044 7671193 8788384 10084902
12691 10084902 11580232 13249628 15112824 17218553 19671165 22609733 26306835 31163834
12683 31163834 37688500 46542831 58356895 73477202 91679912 112113348 133638345
12676 133638345 154822363 173629126 187712818 195223328 195380739 188214274 174347651
12669 174347651 155349184 133567041 111203664 89920124 71017739 55516395 43752643
12662 43752643 35300431 29348787 25089146 21906767 19429043 17359703 15555676 13944682
12654 13944682 12496466 11170575 9976747 8922249 8002253 7207005 6560266 6028337 5578301
12645 5578301 5170703 4784029 4443249 4168649 3914356 3667924 3457621 3292959 3148721
12636 3148721 2997027 2845082 2729099 2605828 2489913 2392027 2304750 2213843 2113148 2038789
12626 2038789 1971137 1889097 1791219 1744270 1705926 1663411 1621794 1574596 1536618 1496255 1450244
12615 1450244 1399558 1347269 1304495 1262135 1238882 1218081 1186153 1159333 1139507 1140896 1127697
12604 1127697 1108587 1076134 1051117 1021656 983191 954211 921125 893311 869562 854941 841459
12593 841459 843935 832065 836371 805761 766482 736273 699898 668128 653781 653430 645531 640382 635316
12580 635316 636427 628299 632785 629422 622272 597146 571627 575957 573903 575301 574210 570028 549260
12567 549260 550752 563734 557096 554805 564647 570164 574266 555756 566141 559196 544775 533062 537894
12554 537894 532716 536388 548915 543312 551282 524757 490592 480366 487985 480454 481798 500802 495293
12541 495293 505952 493149 472333 439349 428865 411182 372661 341460 332898 347069 343511 349134
12529 349134 362556 364747 363769 356705 326248 281686 281903 282531 274752 285238 294085 284982 266419 263920
12515 263920 273800 302076 293769 273038 242459 233770 239077 248320 245965 237896 228176 227427 206892
12502 206892 191710 196244 206930 215266 218224 213102 209879 225528 229174 230496 221875 228689 248780
12489 248780 268431 266410 260356 262134 248872 243650 258239 253793 234312 222663 217833 212039 215920
12476 215920 219816 210474 219984 237448 255255 256630 276067 285737 292437 291063 285471 278050 281704
12463 281704 272747 282400 280829 319006 358956 389088 406917 417854 442879 458601 452254 465188
12451 465188 487749 480427 461709 464768 453859 429005 399683 391109 392202 369491 353185 350920
12439 350920 367162 378116 385394 390566 414264 447655 482021 524603 557535 600417 682190 770919
12427 770919 865185 985058 1147612 1322812 1562768 1871540 2282516 2782863 3352854 3972415
12417 3972415 4600319 5195521 5688906 6065272 6301451 6352038 6199847 5857230 5355472 4761828
12407 4761828 4110197 3460922 2875945 2355040 1906802 1542946 1285394 1085317 948387
12398 948387 842212 753679 669827 612261 562550 505548 473945 424091 409968 373412 342094
12387 342094 311705 307697 294657 294728 287261 269825 265909 269150 268510 255127 239524 225832 228152
12374 228152 218159 221798 246305 246443 224059 215990 232953 250840 269868 264402 248417 255706 243198
12361 243198 249674 287344 325059 349703 377325 378724 377526 357606 364388 348254 344877 342172 289552
12348 289552 260536 248069 229323 206532 185732 166154 162298 161676 164138 146239 150639 147873 135858
12335 135858 123645 109354 85288 100677 117569 108570 114413 123118 113575 102209 113446 120649
12323 120649 107429 81785 79699 59348 54170 67055 91996 83191 69669 68109 78097 83075 85082
12310 85082 106318 106352 123380 122434 109467 106443 102501 118143 116161 105196 88389 79360 91859
12297 91859 97884 82186 82946 91373 87470 101774 115114 104371 104040 110078 113464 103648 91825 92270
12283 92270 85887 87895 115130 142369 143423 145088 169150 176296 203901 211216 212352 249248 319447
12270 319447 386165 447165 503110 574794 631699 677176 727746 765238 771092 765097 749488 711630
12258 711630 664441 618059 582290 546867 520056 497164 515047 595810 672030 751100 862404
12247 862404 973157 1100882 1193219 1275584 1325956 1339498 1344223 1377783 1435461 1541033 1662747
12236 1662747 1744084 1716567 1525186 1229849 979294 835670 788874 835532 959939 1150236
12226 1150236 1335866 1432603 1359211 1143691 880071 630966 450982 321716 244829 216275
12216 216275 195501 162938 138384 138909 135035 111097 99029 102421 108155 110242 102688 92178 91629
12203 91629 88145 92660 85742 78822 81890 90745 109883 116306 109158 95559 66824 50421 36602
12190 36602 43238 50361 54069 74580 73077 57413 58231 83273 83815 68775 80321 77278 83782 83118
12176 83118 86986 104487 114061 99822 73184 58810 59394 76215 89730 79154 55387 58563 42548
12163 42548 19731 26018 44687 63626 61120 45165 58370 67434 73521 59344 56488 45322 59505
12150 59505 65160 56854 32880 27321 36749 56200 57219 71893 81529 69748 57198 60409 58689
12137 58689 60324 44642 57992 46208 40770 50181 64978 62792 67197 66811 60357 71877 67769
12124 67769 70115 82566 85541 85094 77110 84383 94644 103815 103780 117376 132355 135802 158382 167587
12110 167587 212120 262745 326123 390261 461587 562228 677787 838727 1007689 1163820
12100 1163820 1257596 1329702 1384808 1374859 1313268 1221918 1118363 1008729 940405 906931 916139
12089 916139 968055 975790 843420 627337 439591 336075 267480 209392 181965 176235 151409
12078 151409 140805 146575 135581 115798 101145 107910 112146 98758 95550 84228 72710 61112
12066 61112 56298 47726 38196 30524 20605 30573 52016 61874 56151 54009 60967 49626 50185 60709
12052 60709 62422 55811 40610 35904 44792 49293 35958 30178 25729 19187 19980 16435 15748 15110 17652
12037 17652 26053 14659 21110 29567 40095 40606 35394 33734 29091 30769 33426 35254 35617 27230
12023 27230 24485 11340 34110 48672 47025 60478 37195 14717 25324 30305 23067 21111 18584
12010 18584 34776 52076 55589 42145 29001 46487 29473 19874 31755 34769 32830 24002 47388
11997 47388 44193 35559 23929 24285 27120 37087 38046 45382 57818 63675 60578 42979 47382 59479
11983 59479 51019 34986 46169 48083 30821 16298 7183 20896 25975 34363 42365 50833 32925
11970 32925 22649 10039 -4662 1464 14863 20711 19396 -2955 -9352 13883 22212 16392 13850
11957 13850 20992 10825 19568 30726 43411 44213 42090 30448 34317 28443 16481 17398 12017 10599
11943 10599 27974 53859 56795 45356 34888 38855 28667 21508 32976 31486 31492 29320 19104
11930 19104 5618 885 7480 27828 22262 19205 6647 -3925 -13796 -6344 8437 -1903 8796
11917 8796 27671 18787 3826 12863 30313 42341 33727 33853 33882 25595 18944 10088 -10343 8481
11903 8481 17939 29998 9982 14146 22830 25175 27223 31748 28827 28711 27954 50255 70968 72283
11889 72283 84864 100561 104089 76641 48220 29209 30264 43587 40402 53372 27555 7567
11877 7567 12103 7488 15671 17961 12270 11139 21144 35402 20282 14926 31679 55350 55921 48147
11863 48147 48152 63474 69543 54369 47433 57565 68404 70117 47850 51639 57496 59310 65181 42882
11849 42882 31494 31042 18045 21058 35012 53898 45412 32882 26903 14460 1422 13211 39436
11836 39436 43367 30814 16245 4835 28808 40066 15675 8497 17038 3731 6780 19968
11824 19968 8433 15397 18161 -10197 -19889 -7222 15165 16112 23124 19612 1417 314 5979
11811 5979 5116 6372 4306 5139 17499 25527 31857 31063 34452 33479 24071 14342 24356 13299 8873
11796 8873 12755 19408 26575 22886 -1286 102 4395 -12255 -5523 -8191 -11686 3348 6586 4457
11782 4457 10454 1981 -21268 -31114 -22303 -18177 -12973 -1631 -8245 -11123 13439 11559 2359 -23364
11768 -23364 -19325 1658 35113 35884 13178 12137 2801 11123 15087 26941 46068 36218 36245 33220
11754 33220 25635 28092 34988 12913 -9517 3584 27250 21838 7798 12701 28017 33835 20939
11741 20939 16582 21703 8828 4165 5448 4890 12775 22667 22189 22947 24067 46788 49099 36876
11727 36876 28536 39617 34714 30467 7195 -1229 3651 4625 5550 16251 17345 11447 31213 30620
11713 30620 26735 34689 40002 37682 26000 4327 653 11421 1143 -6777 -9805 177 35405
11700 35405 27223 17823 24341 29210 35477 22605 8186 21417 35533 41380 40349 36213 29470
11687 29470 19699 28653 2584 6752 22865 26204 20564 40244 43299 33394 21128 -1036 8320
11674 8320 25994 43175 42678 32174 27028 9646 -4807 14263 20913 14187 -120 -3791 10967
11661 10967 14647 -3894 3461 10214 21719 23030 15587 3986 10695 6419 -4405 -9362 -1964
11648 -1964 6774 12500 17177 35600 21171 18083 2914 -24684 -16064 8077 9974 -4268 5048
11635 5048 37693 41149 25233 10908 17950 3808 26 -2613 -1666 8579 22513 28152 24443
11622 24443 14815 9679 11245 29767 36118 42708 40520 31507 44105 42867 53851 42000 41513 32532
11608 32532 19612 30837 43014 53076 45875 30852 40009 46058 42348 16311 8020 26139 28677
11595 28677 11360 -5060 -39 15616 57751 88124 82480 92187 119296 146231 144313 141838 148934
11582 148934 135156 133404 127109 109421 78213 71373 59098 41974 25151 12914 2930 30037
11570 30037 26506 25085 36421 17778 6117 -1029 5970 1834 -5411 7020 15577 29071 43483
11557 43483 35466 40520 44820 34981 18167 20795 17916 7850 7881 16440 9482 194 15948 35431
11543 35431 44729 42910 27464 14871 8301 9320 28875 30650 29135 27373 24958 14801 5984
11530 5984 17791 9217 9539 20241 26497 5539 8727 1310 8163 4938 -6267 -6603 17646 28655
11516 28655 28067 23622 15651 23899 29769 33742 38789 56077 57141 48141 40585 37467 24182 25325
11502 25325 19851 25788 34058 51756 73125 86002 90354 79287 71675 75969 68600 75564 64570
11489 64570 81017 79114 63848 45027 28552 25299 27273 24360 9363 12051 24722 24430 21441
11476 21441 33219 54267 67105 70374 61706 57700 63249 63765 46748 41160 34401 43472 54367
11463 54367 48653 30635 26085 37789 55388 66109 51564 61380 100440 112770 112196 98500 87169
11450 87169 81952 74909 90661 111657 125264 128671 150828 159748 154366 178355 227004 269311 320969
11437 320969 371951 413913 481619 583600 694540 815263 976822 1209204 1529665 1979707
11427 1979707 2614910 3400964 4252872 4918911 5025320 4458561 3539557 2636301 1912913
11418 1912913 1395825 1042681 831063 687789 585581 515291 467183 411775 371369 338030
11408 338030 300463 272471 261814 242916 217158 209011 217152 213638 197884 176144 147445 125825
11396 125825 119904 117612 119338 105250 79039 81024 56387 55214 61670 59640 40509 35311 46315
11383 46315 50066 52717 55778 49358 54229 57903 39695 52645 43504 53276 70329 58283 24837
11370 24837 34068 54107 54223 47527 44761 44225 33783 45870 47884 52855 61000 62101 44259 49052
11356 49052 51443 48549 61943 56182 42083 50820 50080 60742 64328 59973 77121 88417 81474
11343 81474 77553 90125 113904 134525 130651 122436 131208 141966 126575 108434 100170 69902 54591
11330 54591 64619 91223 100126 115320 113585 100543 92565 90485 81900 77879 71678 72138 80452 82602
11316 82602 67128 60969 48228 63830 82921 88906 78671 57974 63274 69321 48662 74898
11304 74898 113952 83932 58617 52521 59255 36569 19345 11602 21446 44805 77962 72665 52032
11291 52032 46535 51032 55619 59666 54137 34660 15871 23942 32633 10556 20115 44753 54146
11278 54146 37547 29675 20452 17664 1881 4411 5277 28224 40435 38288 27220 8610 -1809
11265 -1809 3047 24868 25110 24278 28613 29974 27413 32693 34418 43049 53164 45212 35999 26665 18876
11250 18876 15275 16032 16388 13143 22909 30380 15132 2713 20617 16160 25544 31585 41363 32812
11236 32812 32114 27097 22930 29105 21142 11322 12266 15942 23116 32289 42590 40829 42855 56722
11222 56722 78344 74574 34010 15183 10450 -2148 -6218 4854 40584 45718 39396 50722 63286
11209 63286 82446 67151 64918 62994 62979 53610 67756 84307 69448 55656 50562 66296 66464
11196 66464 68588 50589 64050 76718 95737 107820 100815 97095 99961 103479 100665 104271 98606
11183 98606 82406 83873 86475 107980 88993 52220 60543 83884 111883 125458 141846 152126
11171 152126 183991 194770 197220 213477 217030 207637 208898 192904 171507 173298 156639 119770
11159 119770 104286 103756 99027 82399 58086 49222 43700 34026 50099 54516 54878 59970 74131
11146 74131 100286 108521 110089 102579 99198 88652 92518 99502 91029 84165 83405 82001 81185 97395
11132 97395 124964 143968 148210 139512 143624 152519 163249 164354 150604 130675 122689 106065 86317
11119 86317 68553 67063 70173 78530 71297 59661 75376 79798 79811 80607 89328 109351 97834 76432
11105 76432 57787 55493 52484 58978 66582 67733 69147 67307 48467 35340 38120 52046 51461 51615
11091 51615 58277 71159 71560 87153 107861 94788 70154 65796 68386 87528 67093 40150 62901
11078 62901 89407 101549 114020 107591 90117 85397 84155 68549 66190 71541 79373 88551 106234
11065 106234 127762 142164 138205 120037 99053 94011 85143 82761 93520 94794 103058 78059 70881
11052 70881 85358 69221 51105 84485 92936 80308 85428 104302 122884 129500 150138 143279
11040 143279 144908 157549 157600 167343 184940 207255 201134 187568 151153 111924 79582 87349 112007
11027 112007 136851 129405 101322 95116 99868 107222 103936 102330 100282 90577 93196 91908 110929
11014 110929 105069 93017 85291 65709 80841 103082 106878 98461 86873 85499 100365 104333 94314
11001 94314 93120 98563 89581 72072 76077 82552 88383 109255 110807 126237 127436 136222 148073
10988 148073 140340 129165 110644 118737 133702 140925 139874 134952 133642 129736 128199 124884 109108
10975 109108 110854 130506 150657 168120 155997 169329 170656 158389 171956 167527 178982 175091
10963 175091 182798 182647 187364 171716 178107 182403 192337 200519 200544 218673 237781 239457 225011 239798
10949 239798 260216 265379 289429 339603 387421 459666 549810 668656 832053 1073674 1408094
10938 1408094 1856412 2367328 2712426 2603836 2127592 1571967 1132002 862019 695323
10929 695323 571207 487541 424146 373078 327475 305648 304284 293716 283350 256687 229135
10918 229135 231028 236633 224572 218073 233877 228088 206720 205563 199895 189562 187681 182054 175950
10905 175950 165575 182005 177114 159643 177641 189770 193392 196757 182930 183824 176729 168826 156077
10892 156077 147217 148726 156354 163646 167433 172898 177067 186093 180241 171964 163749 183983 185783 171987
10878 171987 174324 163633 159717 172460 199578 200190 188015 187837 207632 217985 222637 232191 242487
10865 242487 277496 274493 233954 222926 248273 277481 289158 279770 261999 257253 253188 244981
10853 244981 233879 225146 206691 194829 194643 189560 191789 212629 225864 219649 210521 219421 223929
10840 223929 224960 234945 244684 243106 215260 201882 215043 210524 192323 192975 206996 209182 213744
10827 213744 226044 240471 239715 235576 244773 235934 227939 222743 233523 231641 219275 231845 241141
10814 241141 261371 275230 253733 251840 234413 211704 194633 229910 233090 215404 217428 261092
10802 261092 310542 319135 310643 315991 320682 302103 296949 311415 343761 361450 354225 344911 349218
10789 349218 339624 357911 411089 411805 417480 415546 424066 457511 470181 482911 474262 450804 474543
10776 474543 488686 508126 515021 528407 541861 542494 557116 552657 565295 584958 610232 607313
10764 607313 596624 604975 621601 636324 629246 596113 569031 563194 551275 536180 541298 549249
10752 549249 540631 540595 539297 547037 533752 543212 563560 572947 578496 549871 545105 569074 568624 560053
10738 560053 578541 600692 610181 608829 621651 654620 669351 676789 681331 689508 683515 686232 685241
10725 685241 688810 686080 674372 673120 677707 683563 692264 690817 717892 744973 775052 804226 847278
10712 847278 895653 928345 960761 997418 1000905 959929 931103 944167 953351 966775 981650 997228
10700 997228 1017089 1066909 1092410 1108708 1126837 1151082 1186463 1211578 1238035 1270889 1321994
10689 1321994 1364527 1409971 1455534 1485138 1499260 1521915 1536508 1559456 1577265 1612747 1646055
10678 1646055 1684539 1727841 1762938 1827852 1889994 1935064 1992921 2075175 2116492 2180018 2268257
10667 2268257 2327572 2381827 2441226 2477848 2533844 2619196 2723100 2821361 2885916 2968936 3097496
10656 3097496 3227552 3377592 3555075 3750456 3906992 4057485 4210235 4398734 4583025
10647 4583025 4774147 4959515 5183120 5447056 5714849 5983538 6271896 6577146 6889494
10638 6889494 7206841 7547774 7955748 8403820 8927955 9525780 10163110 10881406 11677945
10629 11677945 12569277 13560066 14660182 15864204 17186145 18672052 20347732 22193484
10621 22193484 24239894 26486709 28938278 31626099 34508850 37555146 40729687 43946704
10613 43946704 47090558 50010905 52541793 54503605 55714682 56078228 55560489 54208438
10605 54208438 52110402 49456543 46437024 43213916 39941841 36766882 33756777 30946395
10597 30946395 28360356 25987822 23849546 21925829 20187965 18639765 17235766 15972607
10589 15972607 14845412 13850462 12971390 12192899 11477577 10815139 10209550 9694443 9243612
10580 9243612 8817355 8397438 8018390 7662000 7330621 7053778 6808705 6593686 6386472
10571 6386472 6191925 6040925 5912381 5794038 5650121 5525352 5420993 5318770 5269777 5231860
10561 5231860 5214103 5206352 5189182 5151854 5126754 5106599 5104908 5128044 5183080 5258847 5376135
10550 5376135 5480944 5618163 5757501 5903360 6075433 6273309 6498259 6771294 7152479
10541 7152479 7607587 8087423 8624645 9254182 10012850 10915161 12019222 13421150 15136195
10532 15136195 17033558 18857236 20602463 22547931 24976563 28115326 32262528 37910872
10524 37910872 45728124 56717466 72161339 93864724 124527558 167652336 226738179
10517 226738179 304816802 399222166 480715139 492223129 416289268 305816361 213061350
10510 213061350 150019129 109450601 83027950 65174266 52675706 43528537 36541855
10503 36541855 31129205 26928510 23708407 21345244 19742528 18671940 17748029 16542043
10495 16542043 15054987 13569636 12286647 11186577 10263377 9470952 8818653 8261239 7790621
10486 7790621 7369985 6974333 6588359 6205992 5879266 5591121 5338302 5120195 4914035
10477 4914035 4726186 4540557 4364817 4185382 4001490 3814661 3638473 3499599 3371539
10468 3371539 3298962 3221853 3125646 3031853 2955659 2892636 2822424 2736729 2656113 2575590 2502758
10457 2502758 2436249 2396682 2360267 2311457 2248863 2202040 2133244 2080130 2048734 2029630 1992120
10446 1992120 1967441 1923993 1875114 1829634 1791710 1776372 1769759 1720749 1673803 1623553 1573006
10435 1573006 1531994 1486353 1432457 1404400 1390766 1374194 1362688 1343681 1296298 1259860 1231979
10424 1231979 1192762 1164454 1152399 1161028 1163844 1155014 1154843 1159261 1166215 1137127 1116332 1087147 1080100
10411 1080100 1080417 1077529 1066093 1058179 1053161 1047497 1044380 1039425 1029511 1017686 1007793 1014419 1014415 1021701
10397 1021701 1024464 1023116 1053091 1086033 1089670 1068107 1012522 948798 935307 931880 905575 884079
10385 884079 862533 846956 827296 810219 767170 695194 636045 602361 592920 599363 638158 654187
10373 654187 639600 630342 624547 613365 608783 611501 602050 589076 576326 572753 573165 548829 531704
10360 531704 536171 527985 507635 496884 513630 532354 556104 569149 556845 546344 535298 525661
10348 525661 506851 498802 493209 494892 483676 477404 473590 481483 485562 504806 511766 519083 529124
10335 529124 528548 537741 549932 532615 527594 527760 529393 543928 545082 505498 472497 464946 458537
10322 458537 449600 455380 462014 453936 445653 453625 449021 442281 460146 501244 495922 495903 509838 490435
10308 490435 469074 470703 462100 452017 465130 473977 475436 454492 432954 414757 404832 392885
10296 392885 391399 389560 399684 432254 458996 468491 470286 457552 437902 433163 432618 426091 415834
10283 415834 421989 439942 433268 436284 408726 398583 401448 398661 388287 376604 366304 351213
10271 351213 342256 342140 331498 346821 363907 374028 360234 355897 348778 338934 328394 322813 315415
10258 315415 302465 323785 335616 343561 346919 336874 333984 361177 370473 359323 337801 331132
10246 331132 334120 329607 316016 294722 297222 296951 316072 328550 312467 308008 307504 287230 280423
10233 280423 294298 282942 282579 289726 313528 311584 300582 297906 309888 339199 329448 306892 285212
10220 285212 276151 285988 302584 309210 300252 312463 322566 325580 306950 302296 303390 323720 314359
10207 314359 313499 320015 327710 362645 376536 356930 325150 331816 333252 324935 338882 343023 331344
10194 331344 340688 329089 337345 360309 351845 343363 359427 371704 390877 414894 459223 493965
10182 493965 520911 563116 585233 612667 636439 674723 742676 846328 1000022 1222507 1498860
10171 1498860 1907704 2505440 3357371 4517897 5882488 7015842 7220418 6357570 4997160
10162 4997160 3807560 3042152 2659122 2550469 2646270 2938068 3485229 4304931 5444568
10153 5444568 6990002 8957682 11179634 13236634 14492929 14317172 12723868 10363885
10145 10363885 7982351 5969443 4445075 3368331 2638118 2130777 1775542 1499708 1300209
10136 1300209 1161494 1051003 962233 896459 829137 758409 710335 669610 624112 599233 546791
10125 546791 493999 462654 453709 447461 419032 387250 363797 353603 361198 352058 341481 349038
10113 349038 353130 344516 344403 339158 350110 359039 344261 337212 356952 387953 404414 429432 462124
10100 462124 522075 621697 702642 801516 929115 1061721 1200093 1321606 1432516 1591663
10090 1591663 1825929 2166619 2581085 2869768 2753087 2262057 1707792 1251639 943991
10081 943991 746737 619743 527084 456924 407042 386334 371454 360758 356801 339882 301712
10070 301712 288589 270371 261962 268131 263399 259482 271392 277154 294179 299711 281149 260628 239747
10057 239747 228891 217202 223566 212487 200379 176432 182220 191122 201088 214196 203154 179280
10045 179280 188578 197375 230960 269442 321094 433894 575203 671664 580832 405330 294707
10034 294707 232649 219540 212927 195173 189203 161863 146208 158783 155908 156221 142978 126391
10022 126391 121343 120565 127969 120469 123059 131628 148143 149342 152268 146569 129154 126163 140461 170771
10008 170771 179656 182621 188906 199039 189275 170701 170129 164127 158515 157174 145911 122766 101627
9995 101627 105585 134809 134012 121649 140622 156180 162207 178794 180137 191513 193866 190682 191123
9982 191123 208145 221335 236443 263629 291996 320952 384407 448070 554917 683146 822687
9971 822687 979408 1161033 1349635 1495939 1538184 1472051 1320666 1120186 922374 736328
9961 736328 579360 459891 404165 352965 296973 257679 246708 226478 209160 205444 227749
9950 227749 210888 195828 185266 192404 194315 199846 181963 138284 117599 136864 147030 141645
9938 141645 114720 109706 102631 88637 91182 91447 87203 95850 100098 115417 146638 123240 109462
9925 109462 116523 109523 97609 95750 86303 93241 88776 94887 101349 107597 109443 121710 133237 118651
9911 118651 99195 92874 104303 99544 81440 70990 69144 61754 73989 83586 110670 104481 92600
9898 92600 84773 82629 75261 83377 94222 108206 124985 124248 113524 109865 110908 114223 108539 106785
9884 106785 113853 108607 87625 83651 82229 78572 62372 60847 61409 66389 66512 53071 48412 56794
9870 56794 61977 68926 77428 89114 87377 87794 97039 99900 116226 109732 88697 77359 83657 74428
9856 74428 65052 61586 74208 69943 54166 69625 87210 82296 80143 87320 106074 102915 98547
9843 98547 85192 75223 76244 68413 60771 72613 70536 54250 32340 32646 48455 29640 24529
9830 24529 38264 49660 61896 75680 58411 46367 56483 64854 69396 66552 71760 87108 91937
9817 91937 94161 86224 56489 47410 49358 62111 62962 73399 80415 79014 66499 61066 64365 83239
9803 83239 105270 88818 74338 67529 74515 91291 67607 58407 65817 69488 61808 65250 56728
9790 56728 64100 57748 42676 37315 32916 27646 39485 42653 37852 42911 41625 44142 62586 70426
9776 70426 63110 45042 18805 12057 17354 29978 52679 58077 60008 67604 67355 63556 54487 38105
9762 38105 39147 53700 60424 60705 62382 70980 57160 54851 64056 64393 47188 32489 50944 55654
9748 55654 55512 58255 59928 65929 80477 84292 71363 84394 93673 88630 93420 92355 90810 84884
9734 84884 73763 63663 47612 33910 65141 92334 119626 121841 122611 136749 122077 94938
9722 94938 89240 77447 58035 71960 84213 88178 75868 61002 37828 29106 32228 36414 49986
9709 49986 70144 64287 41270 47217 57838 56081 59134 46901 47611 50495 43575 42656 36671 23602
9695 23602 20723 37890 49247 49650 50229 51131 37634 29722 28281 23907 12666 4674 15145 41292
9681 41292 50828 52608 48249 44994 48003 51925 65571 66447 54213 52948 56980 66296 97387 117124
9667 117124 90455 69312 62666 66103 58560 67811 65660 46829 31127 34236 48867 52646 58799
9654 58799 68523 74811 62964 49536 31930 52012 75821 61480 36537 27490 26708 33299 40024
9641 40024 34669 35094 44157 35546 26132 25507 41658 47083 41919 39877 44986 48700 29534 24002 26289
9626 26289 10428 17175 16660 23630 13810 20342 45716 56664 58522 61503 58200 43327 56663 63025
9612 63025 56999 54873 72971 76708 60770 43762 39366 53861 68147 55411 45705 31843 18315
9599 18315 21233 21330 29982 27544 25831 27077 32362 25179 27525 52062 57600 38172 20563 22794
9585 22794 17119 13452 14935 43332 56494 55690 42888 35376 33619 32812 37793 25934 15856 26429
9571 26429 28418 36670 40118 39107 42596 45721 33178 11742 12698 40379 39696 37893 32976 27035
9557 27035 20539 15687 25638 28734 48124 62379 62874 48820 45449 62489 66992 50869 29499
9544 29499 24886 28351 17452 7874 12661 1468 17865 26875 14825 12610 21487 37145 42876
9531 42876 37024 20985 18245 31743 47272 40958 37720 33908 36042 37383 25822 30773 29412 34315
9517 34315 43623 36357 30082 33191 20982 7629 18186 39032 64627 66256 36315 22730 8122
9504 8122 1700 11768 20357 34839 19477 5352 4887 9077 17433 28767 33644 46723 40726 32963
9490 32963 37314 52102 41126 47778 50251 46133 39167 40321 49958 29487 4933 -8640 -12053
9477 -12053 -19463 -6646 9941 14409 15076 24294 41796 29856 32116 22109 16536 18846 37560
9464 37560 36507 28964 13847 16259 15362 4788 12419 23218 24062 33925 31314 11073 11751 8261
9450 8261 15552 27680 39455 44573 36481 35385 18158 20782 25820 13544 -3459 1695 23666
9437 23666 22891 30898 21736 12825 5722 4018 24622 29387 14304 11921 28203 31803 36122 51796
9423 51796 47703 24370 12537 9026 5589 5195 15198 24005 37122 33469 32413 41271 51859 67817
9409 67817 81276 50725 41524 29374 23605 20366 18296 11291 12919 -4200 11977 33668 33811
9396 33811 14116 8642 16987 43036 44722 33732 23945 27369 41739 54589 39371 12024 1913
9383 1913 16316 14018 23916 22436 20725 9347 5539 -8010 -8123 -10186 -4227 7652 40661 44721
9369 44721 26814 27157 1789 -2788 19093 18171 23363 5432 9304 28808 33243 24376 26451 18628
9355 18628 4586 -3984 17093 27285 24938 24044 18185 18502 32732 17068 -12013 8180 28588
9342 28588 29572 36077 27748 17936 19162 15396 15172 17834 1012 5249 3463 20411 27119 30635 41206
9327 41206 48870 48966 37815 24657 32291 24415 25366 36169 29928 10975 9645 12270 4997 9981
9313 9981 27493 34477 45980 58169 45881 45078 45688 29075 18408 31148 39226 26969 25000
9300 25000 31127 24497 28317 34954 16833 15244 43147 53699 64893 38145 24762 34744 53869
9287 53869 53878 36814 32194 32686 34410 37433 26868 39171 38439 44214 52683 44635 42790 56144 78892
9272 78892 67517 44309 21925 11218 1810 2550 -10174 -10834 -2196 -9665 -9289 1413 17173 41567
9258 41567 34368 31610 32988 44679 35981 29041 27497 46381 45890 56716 60897 46077 31805 32314
9244 32314 23370 29228 53894 55952 55779 46520 42338 57872 55271 49455 47375 52677 60052 72012
9230 72012 60121 50224 35762 33067 44724 54046 53234 36983 46578 50948 48724 53122 47127 40082
9216 40082 38608 38900 36170 30175 37980 36913 40418 20807 9037 15179 27901 39001 24343 23722
9202 23722 33780 47554 39504 39936 49756 67917 58579 54378 49383 36799 35967 45590 39431 32473
9188 32473 21721 9350 34887 30765 19246 37314 43859 41535 42415 35524 50888 65207 47148
9175 47148 37383 40923 36947 32676 38034 49262 56796 60494 67767 83022 64750 52608 42870 33380
9161 33380 36901 51058 49044 32303 23562 14913 7562 397 -388 30195 48935 57594 48787 38415
9147 38415 35168 24406 30338 62166 72371 85659 107003 131723 152300 172394 199853 234246
9135 234246 307551 428639 594618 835933 1165764 1520400 1585359 1258218 840074 549165
9125 549165 389010 299668 238845 198319 182701 174368 145184 125404 116156 98989 104168 108207
9113 108207 93496 66731 72945 68718 61693 51659 33215 15336 36631 36741 27312 50594 64312
9100 64312 52728 29778 30318 10753 21815 47336 60402 42502 23334 38170 44502 35580 32292
9087 32292 33265 13273 20670 42450 34306 27008 6315 7229 9180 9022 22962 37044 31319 12231
9073 12231 -2542 -7091 -11397 3430 19824 14860 12867 22593 26453 2643 -15352 -29211 -18528
9060 -18528 -7174 -1262 4917 22946 41249 41413 38508 32209 28611 23253 15325 -362 -4625 11726
9046 11726 25884 22445 16220 38608 49119 42301 17746 -6736 4265 45753 67414 52548
9034 52548 44802 35538 23263 24116 46337 54988 21737 6081 13230 14808 7430 4945 17782 32137
9020 32137 31411 26972 27611 32473 37963 40486 22822 12084 -1581 -6592 6582 6849 21982 15246
9006 15246 12906 17511 27250 19901 5254 595 -2923 19417 3055 -7700 4680 9608 11363
8993 11363 24145 13131 1983 13224 19899 19976 11077 12314 28275 45655 42953 42866 25800 8868
8979 8868 17874 50622 43302 24687 16344 963 -200 -9489 -3512 9802 -3038 -2678 33169 28169
8965 28169 12206 -3185 -840 -3839 -1205 -8462 -743 6456 10338 15947 32994 7370 -3032
8952 -3032 4590 22366 22884 22411 4424 15788 25366 19096 2810 -10365 -4823 21624 41234 34814
8938 34814 28447 11259 8218 8403 15383 24469 25989 14057 985 16578 31780 26580 29770 23356
8924 23356 26017 17682 7551 4433 -3587 869 23368 34969 39799 53503 49196 35015 4584
8911 4584 19491 29653 46434 49243 47703 48063 52015 43459 40719 66823 81192 80396 59341 62671
8897 62671 66186 61672 63134 75948 75768 53594 49048 48722 47542 49205 61021 56474 37037 15795
8883 15795 13549 8510 3399 4420 20849 37190 37465 49562 53199 35514 28838 38848 57631
8870 57631 49051 39476 25962 17445 16355 31773 57127 58559 38654 45840 63219 50709 38732
8857 38732 33400 38187 50133 55621 53112 44006 27819 31828 14070 19013 36810 46117 71218
8844 71218 68562 43245 36923 59153 63605 38351 27125 35066 26010 37855 42617 52861 53433
8831 53433 54181 29629 27868 21112 20773 36242 42903 42488 37380 42303 37119 33034 15942 8043 10183
8816 10183 22756 35339 37406 37050 30490 26866 25256 38494 36489 54084 66222 56853 47605 56439
8802 56439 63892 59482 47910 52628 63433 71633 62294 63022 54057 52715 48995 40471 24137 -5506
8788 -5506 -1371 12343 17887 32082 25944 19866 22912 41317 37676 31235 21260 36589 44709 34348
8774 34348 37929 45053 45849 34553 23002 4683 2896 14798 33197 42700 35355 19407 15620
8761 15620 28895 41398 52037 50501 51923 37807 43805 44157 47693 35072 33613 56321 64079
8748 64079 46532 59384 53663 44330 44577 52717 65686 55766 41073 61667 61216 84574 83820 69461
8734 69461 53586 38313 37556 41581 53979 58563 56733 54933 81296 100073 89923 98980 94745
8721 94745 92632 100148 120276 147560 154838 119254 98231 93754 96854 109911 134017 140772 145773
8708 145773 140394 140827 143264 139791 129165 118671 114565 116590 124239 134259 137772 106192 103721 125255
8694 125255 106553 95613 99241 97895 95266 99067 91904 82928 73953 75449 74366 68629 62621 68870
8680 68870 69416 55962 61504 55579 58420 69031 54991 64695 77039 64019 56913 45062 33230
8667 33230 50306 60816 81302 99907 93207 80987 71001 70795 66187 66975 75029 78724 54426 54466
8653 54466 70167 87522 74596 79520 75670 70144 70343 74827 68799 50924 30547 29942 57052 74464
8639 74464 82804 91787 75836 46462 45005 50826 69459 73524 66360 82297 104628 94703 87850
8626 87850 65682 53093 53797 79679 92672 99736 96179 83653 87637 86942 94271 103019 94851 92918
8612 92918 94769 96687 106964 117033 114749 113276 133048 140922 149317 158352 152154 159298 169563 179340
8598 179340 188164 217157 226472 216357 209178 226944 223040 201488 191785 171374 139097 137518 128701
8585 128701 103067 97044 76062 70204 75296 93087 91815 78030 84497 94886 82288 86661 85319
8572 85319 72113 56225 62783 60656 50594 50026 50835 39220 22131 29837 41533 31896 27189 27915
8558 27915 22256 28606 22291 12229 27159 41614 25881 9116 1389 -6620 1415 9913 14093
8545 14093 22633 40117 35138 17861 6381 25624 54720 50962 53115 53363 46550 32621 28054
8532 28054 42902 60090 66248 64122 48323 50363 58209 59062 44580 19231 34994 38005 33826
8519 33826 35546 49923 55633 40269 42232 31592 32528 36795 32230 35381 43381 59647 55976 38084
8505 38084 30027 37031 38532 49585 56040 53098 41566 27503 34735 45964 43899 45471 48117 36687
8491 36687 19006 16891 20692 27045 50402 55468 51821 42783 14517 -615 18485 17672 23025 30540
8477 30540 34327 40868 36049 21516 25701 12603 15485 17774 7789 9283 -931 4712 -5743 -14892
8463 -14892 -7547 -5466 -1845 -12457 -23749 -20826 -12445 -5977 14924 -241 -22936 -12318 -2748
8450 -2748 10429 15267 32549 29916 29259 23366 33714 26712 20952 6714 19735 27823 26036 26721
8436 26721 21236 16049 2553 -1422 626 7717 8794 -7306 -22112 -8960 13560 13558 -5462 -4962
8422 -4962 -8785 2440 21180 25390 24386 3133 740 -4444 10611 25154 11431 5184 7242
8409 7242 13130 -4588 -29415 -7454 13405 14458 16551 32101 36597 19545 15150 22312 14364
8396 14364 19533 13702 -504 -2568 -3037 9735 23516 15450 -12404 -7164 13697 22954 28073 31430
8382 31430 35621 32293 13675 13194 9981 -8920 -9704 -8567 15472 27005 4293 -5167 -338 2604
8368 2604 26202 22294 17839 23802 20414 22103 41639 63611 67499 67256 80877 76199 76159 67674 47415
8353 47415 41548 22700 12197 20474 18055 7437 1365 -5553 -4568 -11509 -8160 -4898 1533 2103
8339 2103 8964 12666 27394 31075 53673 90550 111324 93946 67383 51799 38319 44428 38889
8326 38889 28670 21961 20077 21288 26211 35660 47897 58920 47544 22741 3473 277 2779
8313 2779 8374 6197 5085 24533 25831 11118 -156 2281 543 14620 11266 -6374 9398
8300 9398 14244 14246 27730 31320 26503 30717 23207 34896 64815 81690 83560 70497 61113 39344
8286 39344 32005 15412 985 -12841 -19129 -27721 1107 15769 16860 19170 4554 -2396 -27072
8273 -27072 -12682 16588 21696 21344 14516 -4299 17606 15664 -4373 -8035 -6451 -11665 -4799 -17169
8259 -17169 -21069 -10952 -3220 17408 12889 10710 2127 -11193 11857 20072 15347 3415 -6099
8246 -6099 7798 30493 39296 43564 39891 27850 13214 5484 -2819 10096 27376 50228 55602
8233 55602 40805 35437 31271 21500 22426 17967 16616 12667 -3672 -1204 -5079 1083 20603 24310
8219 24310 24815 19088 12442 4045 24780 41639 61747 55022 25375 7832 2069 15796 7101
8206 7101 -12594 -7149 -20981 -19959 8166 3549 -2501 -4215 -7802 6579 13832 21543 36945 25919
8192 25919 20164 25080 15283 -4018 -19681 -17781 17152 18976 23715 19319 823 -1158 17745
8179 17745 13610 8230 -10339 -9862 -13690 -5386 -2282 2173 -10085 -33987 -32412 -7933 23136 30963
8165 30963 20379 19816 19272 9664 6330 14045 13316 3019 -14892 698 -8848 -31661 -7781 2250
8151 2250 -3467 17324 37578 13084 -19373 -17074 -9464 -10651 -19581 -10532 -13624 -17556 -17729 -4485
8137 -4485 9093 14715 24681 26426 -4249 -28215 -26744 -19094 -14837 -17107 -21838 -19043 -15143 8173
8123 8173 31035 27428 17701 16747 42781 56739 59998 72124 87882 71913 65783 79378 88068
8110 88068 96806 99044 103565 93319 77674 48417 26268 8072 15243 3737 17954 41655 54559
8097 54559 54027 40741 25589 7523 516 4048 18712 24814 33662 31601 27153 31386 39997 44835
8083 44835 30427 2352 -5196 17976 38248 41491 40656 36172 33679 50558 59957 52443 55289 84086
8069 84086 116735 124786 128950 132020 140393 156779 162629 165104 172260 163694 136054 115269 92602
8056 92602 80295 83290 87174 95189 101839 98429 77800 73010 80901 73085 70759 69567 72643 72273
8042 72273 85947 90297 95829 88505 94002 95562 88914 63528 43027 47632 83942 119470 113909
8029 113909 99517 88353 117215 130557 129753 157883 169417 159182 163506 128007 112365 113274 110318
8016 110318 114218 127154 136580 137127 137817 126186 115942 90714 84866 98159 102229 81077 75175
8003 75175 61824 62328 83856 95546 90349 102801 101998 92821 95008 96086 91271 83531 68639 79296
7989 79296 76732 66063 56890 64684 84385 85958 71687 62061 56587 61122 60202 60821 62705 58723
7975 58723 83346 111827 116631 104135 91054 81562 78590 81179 71187 65077 58654 61551 64788 86207
7961 86207 98947 102299 79017 66753 76304 114123 125185 121748 115308 120467 107285 92214 83307
7948 83307 80031 67370 66743 68165 67157 68773 61707 64143 71390 50095 41370 42876 43972 61990
7934 61990 72800 76067 63983 68677 65027 75076 90376 78512 54104 61146 91255 92084 88695
7921 88695 88857 71151 66724 85109 100935 95199 69876 61241 70033 80396 77962 62963 54840
7908 54840 52161 61728 84406 73559 39332 23659 48936 64375 74085 58149 46759 49845 60123
7895 60123 63688 48138 44098 36707 50465 62305 43819 46452 37001 30656 28323 31955 46068
7882 46068 44936 41974 56023 46020 23104 37383 28317 23536 19995 14279 14642 14221 26441 41120
7868 41120 31902 18310 9972 15550 24326 23228 17956 16338 30900 32811 24552 33059 32232 9692
7854 9692 -24777 -41226 -23949 2294 45357 46637 52363 39849 15966 7379 7110 -4497 -19230
7841 -19230 -6366 -10996 -11355 -11558 -23290 -25289 -12692 -7000 -12303 -10099 -2732 9308 4595 -4529
7827 -4529 -5464 -4286 5414 11345 591 -14349 -14342 -18666 -20703 1064 21673 32088 27187 16361
7813 16361 10681 -6260 -3830 2340 -11485 -30489 -17126 -6609 -12618 -5218 11575 22113 41850
7800 41850 34897 33642 22423 12499 19831 15009 2123 7580 18820 18166 -3994 -3356 12152 12803
7786 12803 -10375 -15329 -7788 -17904 -24858 -19432 1787 1627 -5909 -4454 -4357 -16833 -14549 -5053
7772 -5053 -11496 -9076 -1775 -7863 -18072 -6776 201 -4886 3061 7493 19187 24536 18549 26661
7758 26661 8942 -9488 -14322 -10617 -11614 -2886 3403 3665 -9132 -6982 1729 7352 211 9292
7744 9292 23157 15827 4126 25171 37486 20736 23220 12897 -790 124 -2527 -3370 -15322
7731 -15322 -22565 -19822 -22289 -21508 -23468 -24222 -35428 -25191 -2007 12874 23295 29854 30885 15511
7717 15511 3478 -3640 3933 5294 1405 -19309 -8452 10580 14596 12551 28275 13854 -2935
7704 -2935 1820 9730 3582 -12996 -30813 -16373 -640 -10712 -10057 13793 15631 21557 15887 5468
7690 5468 -5992 -14694 -10499 -4868 -2998 -9878 5853 5030 7406 5591 -9004 -13175 -13019 -10065 -11940
7675 -11940 -8833 -17500 -25766 -29889 -16732 -14214 -22599 -28802 -9886 -10362 -16917 -28088 -9532 5772
7661 5772 9022 7662 -8828 -4191 4923 4539 8762 -11250 -26509 -20775 -15122 1052 592 710 13297
7646 13297 19252 25055 -7823 -29119 -21206 -7069 -15657 -28023 -24023 -17106 -8383 -10868 -370
7633 -370 17737 34470 18261 -2731 4927 15940 27236 11946 -6157 1371 5702 -856 6676
7620 6676 9651 34889 27984 532 -29384 -43039 -39985 -31199 -12928 20900 29760 16635 -15286
7607 -15286 -24037 -11092 657 4751 8355 9554 -6188 -854 5064 7417 11291 9333 -1142 -11310
7593 -11310 -11979 -25372 -13798 -16408 -30044 -21934 -16403 -25770 -29392 -29452 -16811 -16904 -131 4350 8429
7578 8429 3986 10728 8677 6125 -4769 -6984 -8345 -24865 -30533 -27771 -11935 -7497 3158 9977
7564 9977 3683 -1724 -9885 -11899 -19085 -24007 -8622 -18685 -41593 -38860 -19153 -19274 -32240 -30557
7550 -30557 -19341 -29539 -30068 -26732 -21505 -20918 -21374 -4315 10303 14108 7725 3331 -12939 -12912 -12861
7535 -12861 -1401 -18119 -30274 -26208 -15422 -10901 -10628 -11182 -853 10355 -1873 -9050 -22597
7522 -22597 -25060 -8631 27065 11012 -6888 -2085 1589 -421 -30780 -20082 -2183 -2406 -26795
7509 -26795 -40392 -42200 -38909 -28232 -7937 2294 5709 -27893 -60382 -25463 4195 7659 19663
7496 19663 33758 42603 39786 43000 16271 -882 -11837 -26152 -39468 -20359 -19730 3276 21522
7483 21522 9351 -397 -3026 -12222 -19765 -6493 -10865 -13083 -14931 -15395 -21833 -21474 -5800 4590
7469 4590 -3899 4568 4211 9489 16427 21848 25115 9661 47 7554 16170 18409 10431 14246 7979
7454 7979 27318 14887 4124 -5084 -13174 -23835 -14702 4052 9320 4764 -16288 -27986 -7813
7441 -7813 5649 -18111 -35621 -33331 -28491 -453 3169 -6908 -14443 -15913 -32123 -12342 -3266
7428 -3266 -6329 14326 18560 7995 19289 11200 -8951 -7168 -6763 -2646 -5694 4798 13727 11093
7414 11093 -10270 -10869 -9994 -4214 19665 24492 14182 12572 5084 6158 5884 -13319 -29778 -25160
7400 -25160 -11925 -6983 4071 -9616 -22747 -19665 -10815 -12361 -18160 -2253 7806 -17862 -19460
7387 -19460 -15948 -29314 -23548 -22962 -21620 -15842 -17454 -27397 -30466 -27573 -16729 -8056 -3495 9268
7373 9268 24588 12004 -989 10575 4786 -7158 4902 -1773 -6564 2054 24443 16845 31
7360 31 -5633 -11846 -6613 -11835 -12648 -3873 -8385 -25614 -21963 -2731 3036 2310 -11234 -9415 12726
7345 12726 23574 36550 40658 27381 22466 9380 -19692 -18483 -19319 -9604 2284 13951 5956
7332 5956 3984 10004 -5957 -1546 6374 -6762 -779 -3883 -16680 -7838 -9482 -13956 -25807 -19258
7318 -19258 -9699 -7813 -3605 -10923 -6635 5558 -5429 -14030 -2643 -4629 14489 8676 5546 14545
7304 14545 19396 9202 -3728 -17435 -16553 -22980 -25780 -14105 -15938 -24946 -39321 -33681 -12197
7291 -12197 -7339 -8489 21432 18384 4452 17196 19173 21319 24030 28376 23140 8132 6851 11485
7277 11485 14777 20227 23873 32972 26115 19151 15527 9619 6557 3011 -3692 -9264 -14004 -10033 -7676
7262 -7676 -6028 4062 -11441 -26105 -9929 6422 5036 -3219 3754 12631 6507 15423 28075
7249 28075 18094 519 -14749 10277 22981 6136 -8155 -27701 -30766 -18790 -27036 -26775 -7685
7236 -7685 2186 13978 15589 32733 30240 18709 16985 34582 32341 16440 11786 1899 -15139
7223 -15139 -8942 8132 965 -12307 -6986 -440 6457 -566 -16128 -19289 -15875 -8064 3833 2416
7209 2416 -3989 -12433 -10050 -21746 -27090 -19680 -2835 3117 2322 25926 29084 28932 12726 -9533
7195 -9533 8390 23902 27878 10891 979 -12068 -13743 -19737 -15741 1282 -1124 20930 19236
7182 19236 888 7230 -1108 -50723 -63411 -62754 -63603 -52217 -35726 -20248 -24838 -37323 -21750
7169 -21750 -18725 -27784 -28161 -21124 -15957 -5798 -14007 -27122 -37907 -41948 -27974 -8480 3670
7156 3670 -5254 -7494 7694 25210 21273 -8822 -13068 -10336 2063 -5785 -12503 -19002 -35578 -30012
7142 -30012 -24052 -26719 -19810 6778 15546 19676 7177 9669 20658 15058 -4286 -6142 -10544 -3702
7128 -3702 2103 -467 647 -13267 -7662 11137 24497 13769 -6561 -17611 -3284 -6513 -16292
7115 -16292 -13713 9234 -275 -3698 -9827 -9207 -14948 -10414 -17758 -10419 -5598 -15138 -12273 -9204 -14681
7100 -14681 -9860 -8783 -13209 -12684 -9013 -13323 -23532 -24425 -25900 -14246 -8355 -1265 -17300 -59783
7086 -59783 -68155 -41595 -17577 -13987 -5504 15190 40082 40343 33958 1696 -5353 -2629 -6715 2352
7072 2352 8623 -1216 -5983 -22190 -24167 -23029 -18656 -17660 -33850 -24458 -1254 -9942 -35029 -43386
7058 -43386 -29568 -18705 -3542 -24672 -35062 -44218 -43657 -42905 -50835 -30981 -6893 9542 3396
7045 3396 -9438 -13337 -8285 5729 -14580 -22176 1711 -13883 -26076 -21757 -29683 -8304 6935
7032 6935 -2824 3926 -3779 -9789 -21334 -18356 -13290 14033 17700 6751 67 2843 -11191 -24066
7018 -24066 -11569 -4299 -9421 -18255 -15889 -3380 10088 -8550 -15688 -16805 -20222 -25552 -26626 -17887
7004 -17887 -24999 -16496 -5730 5371 13511 23247 16009 8834 7128 6501 14743 4026 -1399 -13846
6990 -13846 -19354 -13850 4965 7825 4050 11215 25609 27587 15012 -8959 -20200 -10379 -9542 -31765
6976 -31765 -32345 -24636 -34891 -6136 14315 20690 3251 -17756 -35074 -23557 -19650 -13358 4801
6963 4801 6046 6898 -10710 -25664 -41499 -28175 -1823 15499 9388 -13247 -23682 -22486 -21695
6950 -21695 -6437 -16329 -30624 -36171 -37301 -11618 -7762 7439 19483 9035 9608 -5760 -11299
6937 -11299 -16825 -30996 -52782 -67341 -64868 -53284 -42441 -46620 -36437 -38731 -58325 -34927 3702
6924 3702 -8812 -10784 -2317 -14028 -9698 -14079 -18913 -19388 -29487 -29822 -12454 4184 9849 7116
6910 7116 3943 6539 14309 11912 19556 684 -23526 -2523 -17207 -4784 2155 -10405 -15774
6897 -15774 -24310 -41824 -28725 -18810 -19416 -17571 -22014 -36250 -53523 -46469 -32988 -34422 -31951 -36812
6883 -36812 -28417 -13191 -17001 -6789 -15485 -26473 -18087 -28672 -23304 -3457 12164 -600 11935
6870 11935 22511 17587 4378 11228 6280 21135 24759 -259 -13733 -7306 4635 2151 8951
6857 8951 21288 18456 -7268 -22627 -17607 9095 10746 -974 -2420 -6903 199 11778 22743
6844 22743 15949 1793 7971 -11941 -27096 -16618 -11160 -13710 -24662 -16044 6120 -8565 -8841
6831 -8841 1626 -6154 -8614 -14242 -34489 -49560 -39049 -22801 -8340 -10980 -10212 3586 -12664
6818 -12664 -16007 -20796 -42202 -50910 -10391 6891 5272 6089 3418 -2162 -6821 8865 14227 12900
6804 12900 18873 23731 19145 7481 -11718 -22941 -38190 -38090 -24392 -26096 -25808 -16050 -18650 -15568
6790 -15568 -19368 -18308 -17914 -3441 2740 -2793 -2484 -5819 6130 -1551 -21441 -39710 -49301 -39402
6776 -39402 -9864 533 -1972 -21818 -3367 5035 -333 -3691 107 -1927 -17576 -24290 -28420
6763 -28420 -32612 -30176 -35483 -48047 -46497 -17869 2888 12474 8953 -710 -4743 -9425 -9924 -5545
6749 -5545 -6870 -3676 -2256 -6245 -9554 4616 -15529 -41917 -24381 864 13129 -2515 -3420
6736 -3420 -4777 -7436 -9510 -7165 7756 20088 36678 52297 46787 30698 39736 57014 92506
6723 92506 129121 171206 201800 187436 121227 58179 18729 10987 11162 14209 11400 6706 -3570
6710 -3570 9075 43251 27679 2893 -5165 -2312 -4510 -20283 -25849 -33641 -39879 -25809 -13892
6697 -13892 -4641 57 3196 591 -15796 -22962 -13323 -13495 -9703 -1429 -5365 -9787 -13207 -10221 -16878
6682 -16878 -20982 -16018 3625 14743 22250 1713 -10727 -913 14420 -1618 -6630 -4127 8381
6669 8381 -4729 -6435 -18670 -8287 13071 12638 -4541 -18850 -23942 -21043 -15981 -23307 -26484 -27298
6655 -27298 -20854 2305 6379 5192 23595 28974 31697 36414 17063 -1481 -17280 -22891 -49204
6642 -49204 -71237 -55274 -33037 -24909 -24661 -20382 -15631 -19434 -22564 -20258 3468 -1869 -19343 -22855
6628 -22855 -29008 -29311 -28328 -19039 -15154 -13275 -20106 -28005 -12864 -15605 -15510 9049 18897 27275 7410
6613 7410 -20137 -15763 -7498 -4966 -14722 -23063 -35826 -33252 -38684 -60555 -57062 -39535 -29179 -22713
6599 -22713 -27520 -40051 -24576 -21897 -26477 -14278 1868 -1053 -37536 -44672 -42113 -18919 -61
6586 -61 2190 -14638 -15301 -22361 -22148 -8969 -2470 9313 5480 -16631 -17173 -12098 -7942 -5547 6620
6571 6620 38408 51615 25354 7253 2777 10916 31214 26217 14670 -1015 -18857 -15226 -6950
6558 -6950 -13560 836 5473 -4887 -3585 2116 11358 3970 -16774 -33274 -46629 -36609 -28877
6545 -28877 -26093 -17702 -5341 1971 53 3325 -3561 8306 12218 16669 24245 15207 4763 -6786
6531 -6786 9539 32534 29818 6059 3895 16138 -3464 -10977 -9393 -9274 -4012 -5433 -9904 917
6517 917 5800 973 -7567 -11959 -16961 -7919 -11263 -6747 3894 18644 17641 7157 -7478 8887
6503 8887 7716 278 -29020 -38278 -24698 -24782 -26436 -22540 -17252 -7057 12641 16816 -808 -5885
6489 -5885 1711 5471 -3852 -12191 -18656 -30828 -28790 -18625 -16367 -22657 -15057 4807 -12749 -29838
6475 -29838 -46269 -44420 -62943 -70411 -61860 -46759 -35164 -37331 -64515 -66951 -50080 -35521 -23901
6462 -23901 -14507 1193 10203 -10923 -15814 5574 -1235 -15360 -12719 1204 18698 1212 -22219
6449 -22219 -30584 -32325 -17586 1352 -713 -5321 -14973 -18230 -4773 14143 -6069 -3250 5510
6436 5510 17047 10656 13841 2530 -16114 -1785 -4149 -5678 -5035 -11203 -20056 -14639 -10951 -5951
6422 -5951 -6909 -10376 -15829 3740 7403 -25315 -26310 -5585 799 -17444 -20022 5400 7375 11517
6408 11517 -2294 -11146 -13520 -32616 -29302 -43459 -44306 -23855 -24277 -23879 -22076 -15215 -9501 -14803
6394 -14803 -16139 -5717 3031 7124 9972 3721 18408 13291 20106 26950 20828 10960 -6169 -13232
6380 -13232 8303 -1351 -25596 -18457 -4568 16140 17228 -6408 -10157 -16902 -11715 -3834 7838
6367 7838 2309 -3241 1955 -2352 -8720 -10055 2547 10758 -5282 -17132 5623 13159 9549 20875
6353 20875 21473 13283 15242 13420 13615 7489 -6225 1329 27989 38196 32303 29821 10540 7690
6339 7690 590 10132 -10649 -22396 -9285 -15056 -24388 -13745 -10823 -10476 5176 18258 28557
6326 28557 20629 17692 14719 33859 34439 15073 16887 19332 12618 9021 -3332 -1039 -1989 2947
6312 2947 8468 1332 -2941 -19748 -17934 11949 3534 5664 -6879 -15989 -13070 471 -1501 -14337
6298 -14337 -6536 5188 23135 29049 23086 10963 1808 -36432 -30924 -23697 -20379 -20335 5984 19725
6284 19725 19399 13945 -14733 -28720 -33822 -40587 -44181 -41429 -16571 -6918 -3770 -5881 -749 -18301
6270 -18301 -32985 -28781 -9530 21757 14483 -665 996 15359 14403 24243 32762 9906 -606
6257 -606 2877 -7282 137 5661 -6643 4183 -9208 -18847 -5099 -1878 -8354 -1705 5598 12366
6243 12366 -11515 -18530 -8087 -24667 -32015 -18593 -12443 -23318 -19714 1416 -18795 -41913 -46754
6230 -46754 -46225 -46633 -33290 -43006 -49782 -26492 -27053 -40893 -33898 -13512 19255 23895 14805 5110
6216 5110 979 15958 30141 32141 18220 14598 9030 -14 -8376 2457 24339 20593 176
6203 176 -5460 -19117 -26292 -25339 -32201 -21369 -28121 -40701 -26830 -28768 -48416 -46174 -32949 -40722
6189 -40722 -28255 -22097 8506 15035 -13167 -565 28470 28025 22663 21464 -15864 -38387 -26759
6176 -26759 -1142 -453 7556 25564 29031 13720 2665 12707 11581 14204 9778 2658 -1456 -3469
6162 -3469 -14869 -47 -14864 -11224 2993 16321 6965 -5255 -5332 -17470 -12472 -6920 -9745 -3948
6148 -3948 -5734 -32658 -46229 -35579 -27044 -22633 -15962 -14632 -35658 -34963 -30258 -32035 -24593 -32197
6134 -32197 -31344 -18802 -2416 -4394 -24662 -30613 -24898 -14584 -28467 -42092 -15453 -14045 -14648
6121 -14648 -6033 7965 16879 17985 -2821 -12913 -10549 -6886 666 -3827 1931 1754 12854 17969
6107 17969 7198 -3566 -7919 -5012 3262 5849 -6159 -10598 -33602 -27415 -6277 10915 4873
6094 4873 7107 21194 20693 14276 12319 1430 -12687 -8843 -11088 -24447 -26701 -5240 2689 4223
6080 4223 7783 10133 12889 9646 867 2742 -4285 6928 -5840 -19261 -27087 -22845 -20688 -20411
6066 -20411 -15270 -39764 -57367 -56966 -71560 -67740 -59269 -52627 -55723 -48900 -20273 -8581 -11692 3468
6052 3468 10608 20898 23467 11835 -16881 -27932 -41151 -25920 -2268 10152 -4002 -11395 -14768
6039 -14768 -11942 -1898 -5099 -13206 -29190 -26147 -16934 -6970 -3644 -22897 -23967 -29883 -24002 -20423
6025 -20423 -25446 -26276 -19156 -23706 -26933 -25351 -36173 -12597 -13429 -11266 -5630 -15873 -31895 -23357
6011 -23357 -14896 -12967 -5336 -22922 -24202 -32071 -27518 -13464 -10673 -9975 -27302 -32050 -17541 -8879
5997 -8879 6966 10264 10142 13053 14263 -10569 -36714 -24578 9693 22004 24209 12198 7377
5984 7377 -3053 -7311 -11910 -15204 -6234 -6280 21458 23362 14600 13533 17753 16000 25744 16901 14396
5969 14396 21865 8461 24667 30120 5156 549 3399 -3156 4597 12914 5756 15114 7284 -12446
5955 -12446 -23270 -9415 -2608 5641 8003 -8725 -15662 -37577 -43884 -28034 -18012 -34713 -35113
5942 -35113 -7226 -3842 -15227 -18018 -15224 -22705 -19597 -15603 -6540 -6642 -8659 -12381 -18819 -12303
5928 -12303 -9783 -11474 -11990 6400 29357 22552 16182 5100 -3437 -1326 -2473 -5865 -11935 96
5914 96 7245 6513 18514 -578 -4965 -16366 -26027 -11579 -24645 -26392 -30943 -27789 -19213 -14107
5900 -14107 -14950 -14618 -13891 -16156 -17344 -27253 -38192 -46122 -42815 -38436 -44459 -28688 -15242 8019
5886 8019 16487 -18552 -32280 -14855 -18539 -7867 5508 -3872 1308 8927 -4680 -18367 -18643
5873 -18643 -31621 -45124 -42053 -44193 -30841 -18911 -28256 -42125 -21096 -3300 -9073 -14318 4687
5860 4687 22939 31040 39755 25820 28775 -5419 -7477 -8903 -17520 -14886 -11584 -1579 6748 6574
5846 6574 -8051 -13458 -16872 -8437 1545 -9992 -13072 -27228 -19405 -27992 -46603 -54953 -40239 -31952
5832 -31952 -42683 -29770 -27852 -20197 -12991 1296 5133 9783 20259 -2754 -17825 -13969 -21098
5819 -21098 -17713 -31766 -43100 -29033 -23420 -26500 -24917 -9440 -28740 -20681 -1762 8073 24644
5806 24644 12843 -7150 -9941 -3692 10691 21602 23001 29891 30743 31878 10379 -5076 9236
5793 9236 8377 -20958 -35056 -28686 -10890 4895 9820 10265 -1080 5111 6817 -189 -7616 -31771
5779 -31771 -38510 -28874 -25218 -9856 -15145 -26964 -28623 -31002 -7432 -737 -12682 -5740 -1970 -6824
5765 -6824 -4530 -4985 -526 13942 14011 -5432 -16753 -31403 -50999 -51904 -45093 -47215 -42013 -30218
5751 -30218 -12443 -9857 2071 13708 1715 -1285 -12006 -24015 -33143 -31058 -13079 4823 11438
5738 11438 14681 12798 -4177 -12102 -22237 -21415 -10388 -20788 -35349 -34431 -21605 -16625 -23992 -17130
5724 -17130 -6642 -2071 -10614 -28990 -24717 -13811 -15378 -6895 -10485 14756 10388 8888 10541 2043
5710 2043 -16303 -34969 -37929 -15391 -16021 -31111 -29177 -20769 -19919 -18741 -17673 -14836 -15565 -32742
5696 -32742 -36943 -11841 15743 28681 21995 10185 14624 7654 -19827 -12362 2162 8695 10818
5683 10818 2744 -1832 324 23445 38999 31557 28285 9641 -19987 -29126 -7515 951 14245
5670 14245 19721 28613 24698 26194 567 -20478 -3327 9159 6231 5236 12383 -1241 14291
5657 14291 5053 -2994 -331 10455 17601 388 -20058 -17129 -14281 -15268 14179 12238 11699 -2278
5643 -2278 -13548 -10537 -23812 -25795 -19726 -6739 -7442 -4087 -5174 -20690 -22913 -17431 -9219 -11672
5629 -11672 -15049 -22155 -23676 -35735 -18300 -303 -99 -22553 -16988 -1134 -7480 -18296 -34119
5616 -34119 -38450 -32646 -16553 401 127 781 -11011 -3254 10996 14870 6743 -4659 -9731 -13533
5602 -13533 -17050 -2367 2435 6590 -2213 -9771 7654 18902 -575 -22311 -22306 -18080 -10181 4098
5588 4098 8321 9771 2877 3059 14766 10200 -8634 -27514 -11466 -10254 -25506 -30003 -48598 -60684
5574 -60684 -45699 -33938 -41271 -36789 -20039 -19483 -34468 -23982 -15324 3590 35183 21895 14469
5561 14469 23561 -189 -18862 -32843 -33034 -4734 -10236 -29328 -37986 -19912 -6778 -15074 -16348
5548 -16348 2983 -694 -12762 -23542 -27635 -28673 -36817 -43375 -23228 -28953 -34448 -24776 -29358 -20034
5534 -20034 -23822 -23363 -12369 -769 14625 2484 -7000 -14126 -29937 -40187 -46358 -43674 -30798
5521 -30798 -33258 -21611 -4701 -21216 -18835 -21143 -26557 -8438 4792 3205 1764 -12305 -10797
5508 -10797 6268 33799 27332 13925 11815 -7120 -28723 -18113 7134 -1848 -24577 -28843 -27902
5495 -27902 -30786 -39559 -39742 -49208 -42354 -24219 -25145 -33924 -29994 -44788 -42710 -26470 -27816 -24943
5481 -24943 -12736 -430 -465 -7788 7083 5628 -8339 -22277 -21080 -4490 10770 17449 26027
5468 26027 16926 3468 -8705 -37272 -38283 -22551 -12914 -5193 9842 -2437 -7361 -4819 -7405
5455 -7405 -17866 -20742 -14723 -20655 -27871 -8008 25424 18009 17040 -4201 -6956 6610 1788 -7091
5441 -7091 -3567 18 -5013 -8351 -15911 -25748 -18372 -6364 -12840 -18511 -20229 -30076 -27939 -40115
5427 -40115 -53048 -48623 -22393 -14489 -14288 -23704 -34267 -27150 -21134 -21320 -25219 -20959 -16338 -39578
5413 -39578 -52189 -41799 -25045 -10623 -10375 -9067 -10282 -14929 -8790 -6433 -15337 -43408 -51441 -46672
5399 -46672 -34900 -33497 -11783 4693 7356 -6905 -1211 19581 -2336 -8218 -16685 -8204 -8405
5386 -8405 -19462 -36466 -35868 -42175 -44679 -40946 -46796 -39172 -29620 -38608 -36144 -21206 192 14267
5372 14267 8624 8517 -6291 1041 6370 13239 4370 -12594 -26598 -16504 -4598 13606 7302
5359 7302 11253 16674 19098 17633 1428 -3656 3030 -9833 -29574 -8507 10823 -1062 13790
5346 13790 10280 12509 -3063 -9017 -8293 -7657 1130 6231 19401 20260 -2693 -19980 -29920 -25988
5332 -25988 -25425 -27730 -38503 -41753 -33774 -21501 -18171 -24997 -23134 -20822 1726 29692 20018 13102
5318 13102 11622 2406 2282 3004 10826 7888 -17905 -17703 -23764 -24567 -8655 -1449 -8752 -20530 -13579
5303 -13579 -35630 -54921 -54018 -35358 -34301 -24060 -26869 -23415 -21949 -12276 -19991 -22092 -28637 -25989
5289 -25989 -15515 2985 -6364 -9375 -17113 -15873 -7380 2136 401 -14699 -13522 -14775 -26426 -17472
5275 -17472 2002 -6779 -21182 -7845 2804 -888 -10306 -17683 -30467 -33665 -26397 -25811 -5115
5262 -5115 3216 10449 3907 -15176 -25759 -30064 -25550 -4986 -1010 -425 1130 5270 -6706 -9592
5248 -9592 1545 4733 -2595 -15695 -9072 3063 5444 -10889 7814 -3091 -28082 -36945 -53444
5235 -53444 -53714 -41768 -37081 -19552 -15814 -22526 -24141 -10614 -6785 -20154 -11237 -21211 -37179 -39035
5221 -39035 -40678 -18204 -4063 -9236 -29924 -36546 -37467 -27812 -19134 -16957 -10049 -3767 -242 -669
5207 -669 -5742 9541 15412 -8287 -17544 -9271 168 1453 10122 11559 3329 4594 18272 28272
5193 28272 20340 4140 4354 -19461 -25551 -29133 -23524 -1395 21476 22718 -7027 -17877 5109
5180 5109 9833 -1607 -13346 -10869 -24021 -25354 -26500 -20597 -10770 3574 11158 7254 -13944 -11394
5166 -11394 -14541 18281 13918 -13195 806 14164 5599 -6980 -5114 -9590 -19023 -26919 -7228
5153 -7228 -12 -11488 -4344 5193 16491 37017 18780 6843 -4490 -8958 1611 -8144 -16169
5140 -16169 -21479 -15144 -5784 5930 -7262 -16946 2006 1453 -10112 -5830 8303 17407 -7189
5127 -7189 -21044 -22713 -24090 -23816 -12738 -5959 -1147 6761 3251 -2453 -9650 -3876 9747 16347
5113 16347 -17274 -33178 -12953 -20277 -26748 -27901 -15531 -10345 -12653 -13523 -7671 -6989 -3933 -10337
5099 -10337 -8324 24628 22635 -4071 -31361 -26081 -12114 -6630 -9403 6483 -290 5625 19970
5086 19970 27194 11586 9338 8782 -6083 -12789 -11295 -29542 -22347 1937 11452 13446 1802 -7143
5072 -7143 -11954 -16840 -32565 -2816 16362 12898 -6906 -22559 -36042 -37295 -44973 -44163 -30033
5059 -30033 -29780 -14012 -15997 -23508 -20544 -19510 -20967 -39845 -28721 -32214 -18202 -8356 -23602 -12819
5045 -12819 -8415 -23236 -8694 9674 15865 16405 -8657 -18104 -35789 -12807 15224 30387 27130
5032 27130 7300 -2115 2946 14723 18130 -3222 -26301 -13037 -2111 849 6139 -6935 -13721
5019 -13721 6531 181 12144 24869 31615 32149 14479 -12051 -15003 3485 13390 14232 4242 19441
5005 19441 9762 11125 17603 10529 2839 -5617 -18412 -17572 -14755 -16031 -27941 -20501 -18366 -4887
4991 -4887 1517 203 2663 267 -9338 -11031 -5514 -7181 -5754 -10584 -7704 -6616 3060 1082 -5893
4976 -5893 14147 33283 21872 18849 -8508 -32662 -22108 -19097 -22988 -31745 -29706 -28021 -20711
4963 -20711 -32933 -24072 -6417 -8477 -4177 -290 -86 -10882 -6358 2518 -4087 -4954 9890 -1160
4949 -1160 -13595 -14912 -9204 -2578 4700 20028 16976 7757 12137 28322 40100 32049 39005 50041
4935 50041 45548 47812 50964 21492 44 -6280 -21163 -11352 -15058 -8022 -16759 -18649 -7424 -3970
4921 -3970 7467 1670 3891 -5085 6248 32595 23052 10822 18624 12678 14435 -2977 -9354 -5172
4907 -5172 968 8735 12365 1639 -678 6949 3258 -93 748 -6090 6854 13056 10876 12883 28412
4892 28412 35598 22234 1614 -5796 -15567 -29707 -29300 -23618 -37015 -47116 -24786 -15748 4972
4879 4972 -10896 -24513 -10628 -12160 1500 7682 8962 9500 36642 35664 20905 6421 9523 11258
4865 11258 7324 -2264 6040 -10367 -26831 -30235 -16760 -6550 7460 -1375 1606 -11603 -21358
4852 -21358 -25942 -28152 -37213 -43292 -39038 -29955 -14468 -21041 -21448 -28107 -32461 -1881 1526 -11283
4838 -11283 -1926 2196 -5124 1010 -13640 -29213 -3877 -1828 -1651 -16806 -33972 -37171 -29657 -28612
4824 -28612 -34837 -29330 -42060 -29775 -31656 -22093 2446 8484 -6504 -23526 -17961 -18230 -16706 -23389
4810 -23389 2817 26870 7714 1659 14143 -397 -10874 2109 -1111 -11946 -7891 -9845 -2816
4797 -2816 10579 10576 8547 333 -8995 4658 14355 6120 -1846 1545 1247 -5205 -6518 -7436 1306 6664
4781 6664 -1456 50 12602 -4113 -5248 -10886 -18285 -24036 -21716 -23591 -32361 -27193 -12849 -11736
4767 -11736 -22895 -24167 -18372 -25002 -8901 -1454 7288 -1459 -18965 -31142 -15613 4094 14412
4754 14412 18270 1528 -11551 -18262 -14066 -13179 -21239 -24856 -14569 -20781 -30842 -9838 -6671 -20177
4740 -20177 -24285 -2509 11787 1700 -7529 -7052 -5121 10180 1105 -15669 -3833 23767 22456
4727 22456 19251 9968 10580 4326 -10922 -16038 -6268 -13005 -17257 -25489 -32705 -24230 -15261 -27387
4713 -27387 -36607 -43525 -26260 -22281 -20186 -31608 -39606 -31587 -22713 -29551 -41750 -27964 -6338
4700 -6338 3937 7866 8540 7071 -12759 -9395 -6449 -8545 -2401 -1301 -10186 -19127 -9957 1101
4686 1101 -1416 -1590 -1609 2390 -2083 -2758 -5496 -20237 -34528 -15173 -3739 7225 4502 8019 20719
4671 20719 9318 -3876 -137 -4779 3662 9658 8977 6509 -4412 -28086 -35064 -21796 -13633 14788
4657 14788 7264 9292 18636 3416 -6777 10702 5111 -22361 -16648 -19458 -10353 -17177 -33801
4644 -33801 -23886 -17153 12671 21226 14695 -6250 -5535 -6030 -1710 -5717 -10355 -23182 -32457 -14453
4630 -14453 12457 23770 6638 -2779 -12195 -25439 -20154 -16473 -8821 -4152 -211 8945 15688 2698
4616 2698 6754 5970 -1160 -1600 5910 -5595 -2224 5670 7605 1728 5022 -1296 -2303 11180 17411
4601 17411 6256 -13024 -19505 -13775 -10438 -2173 -7995 -5263 -11895 -8438 -1503 -10687 -6950 -3095
4587 -3095 9668 19583 2097 -19563 -11635 -27977 -19683 -98 5990 188 -27753 -52857 -27054
4574 -27054 -10652 -11125 -13334 -3310 14073 5115 -8332 -5901 -949 -6278 -5586 -3581 -13456 -30913
4560 -30913 -20125 1054 -371 158 -17463 -22427 -34207 -33528 -26445 -24239 -9309 1535 14090
4547 14090 36321 41427 46193 38943 30627 8717 -17047 -26595 -22146 -20954 -12208 -9252 477 -10634
4533 -10634 -21629 -8717 1665 8698 4697 7312 7365 15084 10566 16894 16570 -9161 -16674 -7124
4519 -7124 -3540 9696 10499 -528 210 -7237 -26912 -33750 -28148 -31590 -37156 -28361 -35300 -33004 -23302
4504 -23302 -22048 -11948 5147 13158 -2170 -33459 -30362 -17466 -11620 -3635 171 11158 7410
4491 7410 563 -6439 -12686 -7735 -582 -4133 768 -6123 -2337 -5847 -11381 -25983 -31088 -23268 -16465
4476 -16465 -14804 -11620 777 -15826 3716 3321 6172 -6240 2309 14198 22916 -5023 -14264
4463 -14264 -10689 -14694 -17382 -16355 -6525 5486 28998 34171 52643 45937 28170 5402 9747
4450 9747 3341 -3886 -6659 -10371 1600 1582 -7091 -827 -7706 -12487 -14222 -5045 -2764 -7245 -3016
4435 -3016 6685 8377 5781 6137 23254 24356 16046 18970 2854 -9728 -2912 -11174 -32329 -33329
4421 -33329 -24717 -23334 -3236 -10145 -22733 -34731 -48415 -41660 -19840 -19181 -28207 -29743 3705
4408 3705 28356 21177 18385 41959 33042 26316 -4183 -1819 3921 4088 2326 -19279 -17710 -4300
4394 -4300 -6526 -6880 6412 -2861 -5119 -2817 -14209 -16512 -2203 6599 -7478 -12544 -17150 -22753
4380 -22753 2307 20374 6129 -16435 -12109 -7704 -19585 -17125 -17155 -15902 -16588 -17807 -14249 1294
4366 1294 22660 12387 -7565 -30079 -46086 -48574 -35644 -22004 -9621 -7469 -13204 -6469 5438
4353 5438 -5942 -6168 26625 40336 18833 13267 17583 2680 27047 42222 21068 15491 7717
4340 7717 8668 7631 1093 8524 2383 -3897 -3909 -2779 -2145 2045 5160 940 -813 -9653 -8942 13458
4324 13458 17055 4990 -6763 -1063 17472 26386 13682 10824 29698 20270 4150 17395 35021
4311 35021 39369 33224 7928 -4048 -24622 -26031 -16487 -2724 -3897 656 1794 -3724 -8559 -26805
4297 -26805 -23393 -12803 -6647 -22859 -15676 -22730 -12026 -6304 -17511 -22967 -16629 7482 22946
4284 22946 18430 14929 15602 13467 -2133 -13461 1508 21931 15527 -887 -6405 -7213 9345 23181
4270 23181 13000 -3754 -15103 -21036 -17359 -12389 4380 5206 5541 16824 22023 29514 27354 8021
4256 8021 1623 7862 18117 -2306 -19438 -33728 -31168 -23008 -16919 -10129 5034 -12592 -21799
4243 -21799 -7731 5480 6864 5920 11705 12954 3424 3156 11656 7242 -7180 -5012 1034 8500
4229 8500 8652 3014 -3743 2048 -2113 -10533 -6880 6631 1533 -14342 -15101 -11651 -9150 -3550 -583
4214 -583 10591 16572 2888 -21281 -38161 -22373 -14959 -27279 -29452 -18935 -25564 -23236 -26302
4201 -26302 -34032 -24480 -15193 -12106 -7941 -6903 2551 9165 9826 -13866 -16593 -24772 -27362 -24033 -16334
4186 -16334 7627 12556 32206 51947 49685 38124 3654 -10841 -23766 -21361 -9375 -12084 -4132
4173 -4132 1934 5541 30226 15164 -4169 -22908 -30898 -35174 -33359 -15240 -8887 -11925 -5748 -4347
4159 -4347 -8684 5343 7945 17297 13082 17930 36288 17584 9829 17746 27207 27585 26405 31413
4145 31413 24649 -10993 -21965 5411 15055 3864 6227 6934 4596 108 -12402 -23379 -20686
4132 -20686 -10164 -13877 -5261 10031 10249 10954 5281 -7796 -9307 -3277 561 -16881 -27228 -10521
4118 -10521 -8571 -4655 -15342 -16287 -19015 -6528 -14687 -34468 -52052 -63730 -49071 -45204 -47961
4105 -47961 -35864 -17755 -15017 -16205 -21220 -25029 -1230 9833 3512 -1180 -7180 -12830 -2065
4092 -2065 4355 -10201 -11071 -6616 -23313 -26514 -40191 -43272 -35416 -35715 -1662 3374 -3872 -20653
4078 -20653 -34348 -23518 -7518 -4588 -13228 -33152 -35612 -4871 6394 -2065 -24558 -34968 -34137
4065 -34137 -48373 -42579 -9100 7304 6915 10076 14017 13544 -3964 -11078 -16348 -16382 -29703 -43397
4051 -43397 -35758 12050 21093 5092 -11313 -25045 -33827 -13694 13057 16388 15387 24401 15418
4038 15418 -3789 -6746 -5628 -8827 -2528 -10840 -8829 -17518 -18857 -20382 -29011 -45566 -43007 -47491
4024 -47491 -54218 -27414 -4381 13574 16706 -3501 797 24488 34725 21019 -260 12738
4012 12738 26705 11704 -21212 -50383 -48670 -42615 -29998 -43130 -37754 -16702 -8728 -15030 -21546
3999 -21546 -8274 -9394 -10744 -9201 -23387 -27054 -29398 -12558 -3064 10442 10753 13072 5286 20419
3985 20419 23285 26461 13210 -5048 -6577 -2166 13562 16629 2126 -1079 -18563 -14652 -2905
3972 -2905 3149 11066 -12234 -14093 -11881 -5739 4176 26049 22301 28835 23185 -2919 520 -4315
3958 -4315 -2652 6126 16728 8978 -4930 -17740 -2470 11172 10550 3559 -4387 -1058 -14852 -9758
3944 -9758 12050 12336 -3469 -2525 -3181 -5640 1612 10518 15153 17651 15461 -4840 -7279 -17889 -24817
3929 -24817 -16717 -16718 -34461 -32851 -22624 -11653 -3451 -9360 -9011 -11599 -10161 -22058 -20128 -7965
3915 -7965 1567 13389 4028 -14922 -49075 -51772 -37095 -29797 -19327 -19618 -14742 -18894 -25546 -41248
3901 -41248 -13770 6865 -1067 -6023 10809 5310 7761 7791 4993 3397 17516 30670 11894 -1029
3887 -1029 -15481 -12701 1884 9303 8402 -2020 1127 -1654 -10564 -22980 -37617 -33599 -25377 -18144
3873 -18144 -9767 9267 19936 25613 13388 -8762 -18442 -30601 -15972 10991 20576 3213 -906
3860 -906 6178 30962 45635 43052 30153 15288 18486 33250 48411 40879 13787 -12672 -31824
3847 -31824 -48241 -24674 -21177 -31872 -24682 -8792 8066 -1627 -37485 -18324 19454 25993 19653
3834 19653 12016 785 -12226 -17662 -17 5721 6127 3256 6187 6976 5986 5378 2724 -6245 3237
3819 3237 3423 -1322 6252 20744 3321 -6728 -5694 -13983 -1020 13840 3372 917 13586
3806 13586 19515 15612 14954 10318 12459 29133 18398 -8373 -13772 -5562 -2699 2255 -5872 126
3792 126 2894 1810 -7747 1548 18598 9964 -12978 6477 14229 2708 -21988 -30833 -10971 25410
3778 25410 28804 6380 18656 15935 -3034 -6485 -3029 -7596 -20342 -36987 -23722 -3109 -1174
3765 -1174 -5836 -198 9261 26819 33490 23143 8231 16416 6702 -10170 -19101 -12840 -16653 -3540
3751 -3540 6302 29340 37739 21386 17003 8351 6678 17271 29293 28728 21279 11748 2372 13599
3737 13599 7893 16016 24591 22118 1184 -12089 -3699 5765 6586 2523 -12850 -10540 18584 25925
3723 25925 8185 -11384 -9097 -12148 -25036 -32859 -20645 -8050 1199 2247 -16919 -28791 -10303
3710 -10303 -1650 -10261 -8166 7587 11968 29143 22150 -7418 -34778 -38994 -24763 -27435 -23564
3697 -23564 -22619 -38030 -26691 -25250 -15981 -12635 -6254 5329 -10068 -14476 -34669 -47431 -45346
3684 -45346 -42259 -38198 -14279 -15190 -24989 -12104 -8867 4952 -5467 2526 7771 1500 6906 8789
3670 8789 8151 11077 -6938 -19642 -15674 -6197 -13062 -6214 -3124 -1066 -4156 -8907 -12952 -1806
3656 -1806 3677 -9869 -32070 -28905 -21704 -8330 -6755 -2084 711 6348 2941 -7044 -8514 4331
3642 4331 3216 15511 28013 22929 18237 -6216 -24386 -11953 -9783 -3800 -9606 1655 1853 -1814
3628 -1814 -6639 -12123 -5187 21489 7328 1741 945 -10870 -37706 -17132 16923 24824 17793 28341
3614 28341 24660 10965 3890 442 8248 2873 -1433 4423 9330 11317 20251 32838 18262 24716
3600 24716 21142 8288 -5491 -19389 -9358 7601 11719 25796 26332 25902 19416 26536 23258 23206
3586 23206 21710 9095 16164 19214 12856 8369 -7642 2126 20960 10675 -6694 3385 7341
3573 7341 -39 -4548 3059 12354 50978 45327 36677 30097 27120 35293 35032 43936 43913 37667 33184
3558 33184 18692 14226 28802 27832 36557 34093 28600 25625 28703 8138 -2333 22753 9774
3545 9774 4960 9323 10888 17140 11731 13392 12159 15843 -13768 -28504 -25406 -37859 -33014 -1905
3531 -1905 16610 21628 13781 1994 13248 29146 22502 30917 19908 -16283 -36699 -29212 -9213
3518 -9213 -273 -3267 -13233 -20135 -17348 -33264 -34074 -11637 14871 13556 16539 -2416 2867 4664
3504 4664 -16416 -10622 4999 12451 13998 -14272 -22762 -5947 -12803 -34267 -34489 -34613 -7897 -604
3490 -604 2901 5496 15226 19660 -734 -4641 11112 10416 -8257 -2105 1615 5911 -3217 -8801 -6013
3475 -6013 -13435 -18257 -28898 -26757 -18319 -3501 -16702 -20619 -23717 -16446 -9416 -563 -10885 -6108
3461 -6108 -4018 1288 3329 -3143 -2577 6420 8925 297 -3249 7783 6590 -1325 -3721 -1287 -4882
3446 -4882 -27076 -39091 -10569 -6091 -1114 9403 9879 22620 6430 -381 9039 5729 1867 -3508
3432 -3508 13979 17757 21841 17859 -9916 -9626 -928 1043 -612 -11266 -4438 1697 -5672 3546
3418 3546 26849 30282 12296 -12441 -13246 -8752 11643 6872 -15841 2661 33467 32522 31865 14716
3404 14716 16256 8271 -2047 -7539 -20119 -11677 -13617 -2021 8410 -6964 -18046 -35260 -39365
3391 -39365 -37816 -22392 8045 12024 -9578 -13252 -11538 -3209 7214 15904 13562 7164 -2500 -4691
3377 -4691 -8280 11411 25085 18152 6723 1492 25309 41629 18660 2681 -336 4434 2442
3364 2442 -13313 -14910 -3398 1952 7860 4882 13314 36314 24742 5664 9167 -11858 -31391
3351 -31391 -21974 -1084 28696 39377 26906 4940 1254 5232 1419 -7562 -14409 -2103 -4840
3338 -4840 -9501 -14011 -20556 -13564 -5088 -12951 -1035 5651 7180 2894 3346 1538 1952 19168 21138
3323 21138 6673 -2591 -3728 -9830 -18634 -15866 -11045 -17411 -12325 -20206 -6717 10305 26567 22365
3309 22365 8186 2350 7731 -154 -16256 -4117 -5472 -1066 -8977 -23664 -11847 7162 13726
3296 13726 6199 1615 11687 11635 5159 -2186 -10912 -18769 -14521 7491 10021 -8886 -26995 -30723
3282 -30723 -29957 -8681 -9170 3812 23576 32088 19268 16314 29033 30576 8626 -22847 -38381
3269 -38381 -40848 -5771 14111 14975 12552 -3853 -16374 -31520 -45792 -25845 -5394 2365 20148
3256 20148 24581 23544 15459 16925 18494 25730 31286 26015 9957 13562 2666 -5684 -10363 -25179
3242 -25179 2411 18799 1927 -4147 1215 2181 13067 5480 -13702 -14879 -10922 -1632 13970
3229 13970 -13889 -29544 -30174 -28414 -26642 -30792 -34644 -35313 -31011 -35015 2422 38095 35098 7769
3215 7769 -3607 7332 10420 -1158 -7219 -29856 -30022 -38084 -37658 -28206 -9775 -7556 2991 15891
3201 15891 -2156 -8360 -17037 -26068 -13304 -14499 -19807 -12790 -4193 -644 25084 26106 18439 11338
3187 11338 19035 28460 3232 -20840 5270 6837 -1393 11802 21808 31577 32000 30912 9805
3174 9805 -1197 3735 -4321 -13506 -3323 5808 20169 6419 -16526 -22277 -22732 -47543 -31662
3161 -31662 -7177 -1238 2621 -7494 13695 32753 19488 16397 -5959 -23495 -15226 -5149 -8423
3148 -8423 438 2935 463 -2733 15812 35410 30889 23093 629 -4727 -3781 1987 739 -14051
3134 -14051 -11590 -13951 -16297 -17475 -26482 -6923 7754 14010 15798 7356 19057 22562 14231 8505
3120 8505 -2216 -14369 -33470 -24634 3894 14553 4032 -25280 -24599 -7868 -12603 -15232 -6915
3107 -6915 1651 -3074 -2766 -4641 16111 1987 -4818 -9150 -13566 -9470 -3551 4501 22444 4173
3093 4173 -14007 -2904 -2406 -12774 -10089 -9984 -13382 12873 4200 -11254 -26740 -32840 -17687 -6256
3079 -6256 12976 27434 24879 14053 3762 -7972 -27313 -34530 -24904 -16971 -24836 -18734 -5370
3066 -5370 -1720 -1624 5635 12097 2906 4209 -7229 -7870 -9921 11142 14644 20803 27401 196 -3880
3051 -3880 -3367 -22946 -26668 -25694 2204 17064 18753 8884 -13207 -27288 -16237 -17466 -5694 1858
3037 1858 20357 38258 38030 16809 -2732 -8379 3083 -8618 -28215 -29317 -29052 -19773 -26411 -26510
3023 -26510 -12056 -4981 -11808 -22675 -22798 -15742 -2151 2335 7815 14978 12923 2889 319 12277
3009 12277 3934 8393 12987 -6944 -15513 -4318 -7419 99 8518 4603 -15650 -8718 5662 8111
2995 8111 1936 -1736 -3891 -10111 -18257 -9668 -7103 5288 -2109 -14971 -31424 -31702 -11940 7201
2981 7201 15258 4665 -5390 1557 14187 8261 9831 13181 -2626 -27806 -34018 -8141 2297
2968 2297 6824 833 -972 -11324 6565 -2906 -29496 -32428 -9915 7348 4202 10109 13688 717
2954 717 -3627 -741 16811 24218 11228 6813 14485 3915 10438 8658 8330 -4825 -21691 -31668
2940 -31668 -31726 -30425 -17872 -17283 -22660 -21470 -8895 2736 5021 -5611 -8642 6015 5555 158
2926 158 -5077 -646 -5427 974 23888 50964 45353 10494 -21724 -11815 10497 10789 -8913 -11817
2912 -11817 -13660 -25277 -24116 -28747 -25978 -3212 625 -8134 -1055 5580 -8852 12756 11318 19200
2898 19200 10087 16801 31194 30065 12758 -3445 14817 19086 4196 -4307 -10340 -4593 -7987
2885 -7987 -11012 -3515 -20891 -32277 -29317 -23862 -12578 -5182 -9457 -18628 590 18053 14895 28370
2871 28370 10580 12060 11280 -132 -4347 -16922 -28491 -17127 5288 6139 19389 16985 17148 24081
2857 24081 31871 38505 31825 22535 30431 42736 31468 5511 19942 23337 27534 34865 17068
2844 17068 7394 18243 11014 4612 -2530 889 14749 19103 -2641 -23852 -34453 -21602 1993
2831 1993 7009 12834 31148 21088 18846 11679 -1897 -19037 -29582 -15636 -12498 -23186 -34328
2818 -34328 -50302 -46081 -25075 490 13976 6300 -1076 6104 12039 24912 9480 -18317 -21592
2805 -21592 -29948 -20644 -6297 -7392 -26502 -20739 -6915 -7268 4898 28492 40349 23820 14643
2792 14643 22609 12462 8576 9507 -16135 -15589 -6452 11646 29604 31909 26854 18189 10121 3327
2778 3327 -11646 4773 28919 34445 21170 28928 17180 3005 5226 9162 14824 15484 22637 19537
2764 19537 24167 17514 11811 11860 19649 21573 26603 1304 -31696 -27956 -3678 2819 12266 10225
2750 10225 5847 -469 -1237 10356 8865 24862 16042 15539 9896 801 7951 1489 2619 14931
2736 14931 14419 -5433 -10022 -8092 -27170 -26776 -17735 -26856 -15009 12549 22379 13949 -5208 -11682
2722 -11682 19 3608 7762 -90 19798 37096 24088 8951 10052 10499 12227 6723 7912 -9916
2708 -9916 -22600 -35742 -34729 -20111 -15700 -20046 -10748 -27073 -33787 -29429 -18592 -2930 -9715
2695 -9715 -13458 2886 18694 11813 15931 23258 5442 -5275 11327 14413 8443 9483 -1981
2682 -1981 8907 9364 1209 9647 10388 22496 25167 12474 7837 -14071 -35243 -27119 -3041 13177
2668 13177 21261 25303 17385 23906 28711 10779 -15787 -17440 -14728 -7811 -8207 -19679 -13385 12009
2654 12009 12049 -5261 -1695 1344 -1253 29181 20611 876 -9152 -18583 -27051 -22527 -10020 -2394
2640 -2394 -11712 -23045 -22650 -13364 10409 15681 27393 19063 -858 -461 3063 15202 3945 -18291
2626 -18291 -6419 15376 4041 -10126 -8403 1559 -6883 -6759 -11418 268 19514 4963 -6082
2613 -6082 -14815 -2387 5029 5915 -7790 -17967 -19243 -20558 -28348 -41694 -29819 -4666 4349 6918
2599 6918 11272 18574 12212 4949 -7465 -19014 -12187 -11646 1879 7019 -1202 4214 30257 40413
2585 40413 41253 25639 6676 1585 25132 40610 47908 40014 27544 15076 -3132 14494 7313
2572 7313 3847 17098 29661 22335 14298 10775 2122 2517 -16658 3121 -2261 -9106 -15947 -34383
2558 -34383 -33302 -4398 -2956 -29315 -50719 -44007 -25419 -11670 -861 -5663 -4676 -10507 -17147
2545 -17147 -6675 2715 11142 -5590 4664 6406 4284 6410 -8364 -7493 10706 6972 -1666 2438
2531 2438 13102 13637 34094 18639 18398 20889 30776 39472 34404 9161 15628 8055 10430 23631
2517 23631 21208 15679 16338 26475 30162 8756 -20911 5763 31989 28930 18869 23639 32822
2504 32822 33107 26817 9958 11505 13644 11995 2242 15108 32059 39575 26938 8370 2949 7756
2490 7756 15397 13589 11191 19805 12317 13451 18582 -2547 -12116 -26794 -20255 -3292 5469 -3100
2476 -3100 -4029 -3641 5413 2518 17073 16552 20966 27084 32283 6631 -6613 -3701 -4496 -14680 5094
2461 5094 12866 26668 43601 33558 23648 16108 14310 19903 18670 19871 18530 -3512 -4214 3477
2447 3477 12131 13795 13326 3334 -353 17120 16722 15903 17221 3160 -10243 -8454 -10264 693 2668
2432 2668 8092 23097 15925 19591 17771 17458 18105 11852 671 9108 10809 20551 12493 5163 15924
2417 15924 34236 46314 36395 20804 -1915 -16973 -23818 -16456 -32311 -27962 -14577 -12912 -592
2404 -592 -6133 8162 19536 28062 25598 22223 28886 40428 31734 5609 -3432 8054 32473 25439
2390 25439 22902 16380 15289 16328 6619 -6580 -18286 -33436 -9518 -556 -3478 -5342 -19595
2377 -19595 -22675 -26879 -2255 32644 42237 40789 38942 39712 23372 13977 23013 38602 42975 24458
2363 24458 24896 31254 18623 12274 9775 15617 7656 -15737 -12994 -5515 -5288 4594 1466 819 -11263
2348 -11263 -434 766 -9438 -20244 -29439 -37989 -30630 -27277 -19534 -12467 -8076 -12161 -894 2360
2334 2360 -2882 5389 11549 -1883 -24434 -34392 -36557 612 9778 11793 -6808 -13340 -20226 -36782
2320 -36782 -30772 -24838 -19505 -27392 -24160 -11239 -13908 -11405 -2499 7189 2167 -1907 1446 -11172
2306 -11172 -14011 -1150 -3331 1115 -19557 -12726 -1677 -18281 -19418 -9362 9926 13712 14430
2293 14430 -13876 -20286 -22643 -43809 -35211 6556 16614 6496 -3587 -187 -12251 -33098 -30408
2280 -30408 -8661 -1661 -3862 -18798 -17476 -3670 -2690 7699 14237 11505 -383 12294 28065
2267 28065 45434 41295 18360 6050 -11364 -17376 -21883 -23855 -4716 -807 -10241 -8021 -1361
2254 -1361 -2746 -208 7208 -3985 6626 18284 20695 14614 15256 8727 9801 3601 1751 21903
2240 21903 9510 1055 5358 16651 14185 12060 12723 21583 30931 31525 13094 -579 -937 11548
2226 11548 10172 23912 15293 1927 4822 10214 10433 12051 6015 193 -9948 -10406 -9300 -19280
2212 -19280 -17617 -15554 -5151 3149 15977 20464 16461 16536 -125 -12399 -19298 -4168 9167 20524
2198 20524 9675 -14385 -19512 -21111 -18459 -17559 -27122 -12426 -3354 -656 24876 26339 25130 27174
2184 27174 23436 7003 -4557 -12157 -9673 -8400 -5881 18212 34430 22848 15335 21752 27223
2171 27223 30117 27617 19148 4409 -151 -1083 4324 4946 6963 9277 -4602 2939 11309 5666 20548
2156 20548 9070 4159 1164 -4698 10132 21337 10546 -8580 -24002 -16125 -11282 -2701 -9133
2143 -9133 -10642 -10050 -18833 -12503 -19 21198 25034 -12158 -20828 -14162 -22346 -21897 -24594 -22541 -3491
2128 -3491 -2435 5050 -12412 -11293 1593 -8640 2988 6565 40 -193 -5419 7128 37709 35964
2114 35964 6147 -11733 -6690 9689 13037 15891 12316 22268 20582 26015 39161 30107 11378
2101 11378 7161 621 -6149 8021 9651 -871 4335 9263 -7711 -11377 4566 14040 -4108
2088 -4108 -11120 -7138 2419 10811 -6915 -1329 10433 10726 -4392 -15589 -9855 -2150 24242 56527
2074 56527 51317 28084 17353 30630 30930 13375 -1791 2901 4035 13315 15387 12771 -6354
2061 -6354 -14049 1105 22074 2340 -15262 -12490 3118 6921 10384 33157 27522 -8252 -13981
2048 -13981 2955 -6050 -2231 16433 19977 21040 15587 23453 39714 34676 24493 19729 3057
2035 3057 -15205 -20484 -16090 -25288 -20782 -13477 -7746 -1750 3670 -1892 6806 22587 13806 10263
2021 10263 14806 19806 25110 14612 10506 21968 29681 16491 3280 9698 23518 31031 29182
2008 29182 5809 5130 20357 -5331 -8424 9519 4408 -6043 -7611 -7982 -2856 -1082 -1986 10172
1994 10172 9104 -1217 -6130 -5747 -17337 -546 9117 35067 53559 42592 20039 -6692 -7347
1981 -7347 5487 -1127 3431 3008 3786 -1550 4150 1032 16576 43204 49181 33341 28953 35136
1967 35136 16576 14200 30125 30504 19455 23549 12674 6422 1564 4831 15597 19380 17027 -2101
1953 -2101 3391 7333 7292 -6001 -20972 -28624 -7324 -13242 -29127 -17618 -12795 -14098 -16432 -34069
1939 -34069 -41821 -16985 12188 22209 14594 6323 -12687 -35167 -3998 -9429 -19965 -4861 -2632
1926 -2632 -18991 -6741 -6940 -3069 26019 11868 -12931 -17179 -23025 -22177 -16723 2228 14734 10222
1912 10222 -1597 -14545 -21007 -12705 -1428 7971 6439 -6421 1964 6181 9445 16368 31064
1899 31064 38012 33661 24848 2400 -20325 -28411 -6407 3188 -12427 193 -13938 -25473 -23549
1886 -23549 -5746 -5044 -15076 -21642 -10618 -1809 -4418 -12971 -3801 10142 10685 5496 -2107 6421
1872 6421 7105 -9982 -15699 -19038 -22558 -32626 -36212 -24980 -11186 790 12129 9232 -5626
1859 -5626 3432 19912 13416 -8065 -8586 6081 6479 5838 10622 -2602 -10183 16434 13570 526
1845 526 -8120 -4196 -16643 1601 2174 -7971 -11691 -1778 -8779 -4624 -10970 -13312 -14117 3077 13484
1830 13484 15306 25455 12510 16266 30760 21127 4718 11173 17363 6370 152 -7672 -1534
1817 -1534 12337 18434 21599 9707 14850 22975 24707 17703 10089 -4832 -2797 7533 20091 26264
1803 26264 10026 -7605 -2047 -3073 -4820 -4668 -18776 -9801 18207 12491 -1503 -5822 -8401 -9175
1789 -9175 4085 6300 -7632 2032 11295 16127 22188 17691 5882 10204 11103 -11829 -25097 -25375
1775 -25375 -14552 -7759 -4470 -8323 -13443 -22112 -18894 -16291 -22362 -22995 416 -7707 -20202 -9818
1761 -9818 -21564 -30787 -14566 10823 8140 957 683 7159 -1339 -4334 1977 14423 16241 22094
1747 22094 21752 5808 -7662 3714 8802 7498 4479 3495 -3586 -9362 -4753 -919 13447 26330
1733 26330 9434 -6317 188 12950 27322 29981 12630 15541 5635 6749 7034 21394 27478
1720 27478 14619 3371 -5085 5185 -2116 -2472 7587 6881 -109 979 -8828 -7781 2679 6005
1706 6005 -3364 13033 26134 34462 25489 -15122 -42954 -36858 -14600 8820 39064 31853 24667
1693 24667 20743 2282 -6516 -8137 -6430 -24205 -11785 5365 1813 16060 36709 29201 14827
1680 14827 10324 5368 4038 1913 -6245 -7301 -9647 -7372 -13016 -13135 -6928 -12449 -21607 -21928 -11457
1665 -11457 -2481 12635 26223 27747 15066 -459 -6621 -13827 -20364 -16110 6310 27266 33805
1652 33805 29779 31323 5902 -10932 -11083 -545 8194 -2834 -18005 -4509 18646 28890 10433
1639 10433 -8033 -22169 -20462 -11189 4843 3790 3524 6645 -12542 -11983 -3053 4236 18733 12169
1625 12169 -6432 -15787 -8243 1873 -7436 -13891 -14697 -18468 848 16444 7090 4233 1238 -4902
1611 -4902 -13259 -10194 8467 11724 21103 24993 22580 13231 -3882 -2494 -16077 -18666 4892 10588
1597 10588 2868 10764 27240 26527 9249 14558 14880 12997 -7431 7786 19996 2669 -5477 -1869
1583 -1869 12895 4504 -12750 -22121 -9498 -3102 -9610 -24929 -12661 -5259 -37624 -19788 -14997
1570 -14997 -20334 -15949 -34690 -23251 -14822 533 29375 37376 49235 46548 34335 23702 3990
1557 3990 5 1621 -4196 -22332 -13838 12290 22632 15640 -4686 -1465 -3297 7475 9751 4108
1543 4108 -17154 -4934 13707 16123 15577 9625 7041 16741 23679 7803 7783 37666 30798 10666
1529 10666 24690 38913 36493 36159 36647 28615 27041 13577 17762 16077 13779 16251 4962 1966
1515 1966 -20794 -25431 -23619 -28427 -28919 -8128 2184 -2780 8575 21704 13317 14618 28257 8591
1501 8591 -2025 -276 -14959 -16492 -2301 5967 -7621 -18693 -16396 -13145 -6165 -573 -6986 -4199
1487 -4199 922 9986 14054 -4041 -18921 -7961 4493 -11202 -4183 229 -4992 -11553 6030
1474 6030 20727 6883 -9257 5635 26001 31233 20005 5189 7899 17365 34385 42314 44284
1461 44284 39548 36161 16354 -3651 -24718 1120 -1592 6286 11025 34759 42551 26448 16668
1448 16668 14189 4268 -6136 -27510 -27983 -17959 -18489 -21253 -20870 -24310 -22568 -26235 -6111 1494
1434 1494 20126 25278 11631 7511 13438 31811 35895 27005 21943 32009 36853 35745 48599 27812
1420 27812 10180 -1305 1077 -6350 -1939 9731 10815 -641 -10068 -2048 -7329 -15025 -22866 -11473
1406 -11473 -6558 5102 13 -1255 12541 13932 -8608 -12241 -7700 7169 22227 32399 24718
1393 24718 766 1518 19059 2130 5399 20611 11943 371 -8647 -3278 5473 5611 13946 6446
1379 6446 -9811 -12319 -15177 -3035 -161 -3170 7809 19061 15693 9291 19823 17456 2351
1366 2351 7459 3350 16002 13298 19453 20670 28458 39558 16911 4640 15214 5844 3223 3067
1352 3067 7774 649 -10004 -14909 2656 14692 19083 28126 22883 22550 4499 -2827 -16930 -20030
1338 -20030 -29254 -41617 -44022 -32925 -21896 -13130 8193 14454 3321 22704 14765 8771 -5442
1325 -5442 -21371 -13826 -21209 -3845 33627 52312 41623 3064 -16791 -16836 -7564 -671 -9973 -12900
1311 -12900 -1410 -5942 -17723 -25723 8209 27870 40794 40826 30344 12310 15839 21337 15423
1298 15423 5968 8169 10706 6302 6453 5734 6457 11414 30552 47473 26484 9751 38771 39374
1284 39374 16249 -144 -8750 -11690 -15094 8325 11986 5471 -3621 8734 14321 20604 21154 11545
1270 11545 15036 30333 26142 5588 -3229 -27328 -34587 -30928 -10604 954 -1807 -13331 -7327
1257 -7327 3145 26298 16537 -299 22069 30373 16565 17115 13910 16316 14110 27248 39768
1244 39768 48599 39416 5453 -231 1075 10092 15983 12205 -8794 -8205 11673 23481 19410 3210
1230 3210 -8218 -21814 -5564 13433 7105 631 6087 10598 15731 17550 13640 6126 -2972 -32718
1216 -32718 -53592 -56100 -64617 -47135 -15838 5285 6651 7818 -4101 -27594 -24055 -24960 -23529
1203 -23529 -6631 -137 18030 23175 6907 13131 25968 25504 27646 15915 4095 -13647 -15872
1190 -15872 -9540 -9615 994 13925 30226 44609 43635 34866 11933 -16703 -24496 -15167 -25426 -33266
1176 -33266 -36992 -36101 -14796 3826 9676 22387 22293 10954 -1976 -5141 201 21654 30795 26132
1162 26132 34451 54608 55592 47114 39529 26081 30267 35030 38956 43757 41629 32213 10244 -15836
1148 -15836 -18825 -10720 -9930 -14125 -26178 -9264 2232 2868 1546 -3407 6327 824 -7047 -12066
1134 -12066 -18776 -15789 -3401 2098 -10934 -24277 -2350 2028 12862 11896 -2205 597 20309
1121 20309 32244 35560 34193 35740 35689 17331 -765 7415 15262 5040 23919 36569 29542 20281
1107 20281 1576 -10255 6115 1748 2016 4256 -3108 -12155 -26107 -22799 -24293 -17905 -14559 -15650
1093 -15650 -8453 -12710 -14341 -13698 -2223 11859 4290 -18416 -11393 -8596 -849 4492 11996 -13653
1079 -13653 -27069 -37885 -18542 -15398 -16042 -11431 24198 26880 9114 8945 8307 -7140 -21648 -17552
1065 -17552 1445 4687 -3407 -4026 8190 11219 9742 24186 36662 32683 18502 -2611 -19050
1052 -19050 -7193 12316 34235 20230 8432 23803 35663 16298 -12659 -14531 -9810 9835
1040 9835 32245 51341 38334 16557 -3677 -14757 -21222 -32064 -17363 -8820 -16851 -18679 -18915
1027 -18915 -13841 -14190 -5207 -3847 2684 29483 35271 21303 6867 -7063 -20037 -32020 -15362
1014 -15362 5833 -10795 -13996 1346 10480 20543 15830 15671 12636 -3962 4357 -4586 -21712
1001 -21712 -20343 -20999 -17404 -4115 -5525 1290 3166 -8649 -2639 14693 18611 -20793 -30267 -16618
987 -16618 -9076 -18740 -6465 11227 23892 21592 12113 -14962 4510 27420 34188 7766 7504
974 7504 -3931 -4361 -6878 -1347 -6955 -3862 9899 24394 24801 34731 39273 31279 27630 19759 -20180
959 -20180 -46392 -35209 -20907 -19362 -357 12088 13742 5624 1343 20280 22629 12937 192
946 192 -9403 -6617 -10950 14785 31068 22180 18991 13814 14372 12497 16629 12047 589 -298 10980
931 10980 21373 31572 21511 15761 19151 13142 6412 12158 10698 12536 6951 -12565 1366 27044
917 27044 32527 16705 30080 45381 28658 -7044 -7852 -16261 -13977 2839 -5981 -6624 -4563 -18202
903 -18202 -39143 -34030 -19677 5937 501 -5315 15719 20889 1569 -18453 -15076 -5816 4242
890 4242 -2272 -11613 -15347 -17069 -14320 -4624 -9814 -6048 -10918 -11275 -6159 93 -7070 -13342 -5058
875 -5058 -500 16586 7431 -5667 7034 23594 24862 19608 30123 38208 29629 28225 11369 -3753
861 -3753 -6182 11780 9865 17246 13714 25042 15147 8693 -5488 -6208 2935 20308 23343 20619
847 20619 12814 16981 24490 37276 51716 36358 14533 4434 5175 11470 6157 2197 9298 17598
833 17598 -8227 -28309 -30689 -24883 -25288 -10649 -1938 -6236 -29018 -35465 -43591 -39279 -16397 -13932
819 -13932 -4139 8839 3520 4193 12071 28210 35959 26827 11108 17071 20409 14073 16939 11439
805 11439 18564 9809 -13093 -18112 -4540 -3455 8252 18307 14396 -7876 7135 -833 -8362
792 -8362 3209 18247 29721 28778 16712 16565 7910 -2575 -12980 -17800 -30971 -6067 1445 -1126
778 -1126 3492 -7813 -2040 -8193 -12204 -12051 -7522 -6885 -10742 13160 11164 264 -5663 -8504 -11557
763 -11557 18141 14404 3603 4227 8816 9157 8891 12301 40637 42988 39607 43533 48414 41005 21052
748 21052 27890 39361 43038 33342 43164 26328 10473 5158 10890 35963 33087 26014 20837 9716
734 9716 -12751 -5063 11886 571 -6180 5404 -7652 -5724 -16068 -22135 -21514 -7347 11553
721 11553 24753 11124 6349 -3890 11639 39454 19563 25271 18738 11281 -13052 -12131 -17009
708 -17009 -21968 -20407 -16956 -11240 -1005 5125 -11268 -7166 5084 17036 34457 33375 18066
695 18066 -9845 -4832 -861 15386 22364 24315 10931 -8219 -24174 -13398 -19015 -25102 -520
682 -520 5222 -11451 -13619 6920 23340 36920 32056 20620 25696 38174 22886 11429 -521
669 -521 -4537 17029 10665 7440 118 -12090 3946 16672 22333 12805 6016 14824 9912 22925
655 22925 21540 26013 14683 -1241 -4420 -8421 -3635 -551 -13284 -13096 6323 18704 16698 15341
641 15341 20051 24966 4106 694 16130 16978 18787 17623 -7650 -15706 2724 10532 4422 10292
627 10292 30188 34128 43544 40618 14789 -4683 -11335 -10804 -8307 8262 9806 4447 -6631 785
613 785 6174 -7392 -7117 -1975 8744 93 -5409 5130 8211 359 -24039 -13516 5575 3272
599 3272 -8965 1931 -786 3067 10441 15961 15434 666 -18947 -26801 -18588 -25117 -10989 -16127
585 -16127 -19598 -17088 -23891 -31161 -15946 12028 24592 15278 -3458 -15830 -7073 3719 15986
572 15986 -11720 -6712 27809 39839 34735 19159 5902 4255 19012 37697 34697 18461 14039
559 14039 19361 38713 29937 23274 17345 7451 13762 15328 12196 15944 34486 39103 51682 59958
545 59958 54530 46109 36457 30485 21033 -5227 -18818 -16546 -4628 7023 24431 34762 17774
532 17774 3934 -7529 -8274 6795 20434 16227 7133 -8167 -2341 12365 35698 32467 10825
519 10825 17447 42047 60059 39244 21431 12319 31674 34591 28242 17024 -76 687 12512
506 12512 16250 29736 29480 16750 9543 4848 6092 1009 -17072 -27072 -29316 -19004 -6974 8536
492 8536 8672 -5689 -12223 -3594 13622 19513 12841 -977 -14521 -16915 -5366 1567 -5615 -8682
478 -8682 -12871 -1172 14877 19527 20255 13794 28660 29693 13703 14417 4093 -5346 -2385 10032
464 10032 -6614 -4485 -11204 -23233 -35555 -22561 -11715 1079 15376 37970 44430 37786 33760
451 33760 36408 37825 23649 9089 17068 4713 7588 474 -8018 1729 12931 11459 -9291 -19084
437 -19084 -7432 -8600 25 251 -2860 917 4975 6864 16602 24568 3591 -201 -6590 2238 -218
422 -218 2320 5467 9739 12344 9314 1226 5389 22753 26327 25997 41626 47320 22399 9524 5860
407 5860 11437 6436 16935 16941 17611 20725 -1245 -8811 -1641 1237 -453 -4436 -2204 777 -8935 7514
391 7514 23611 19697 25544 16222 10317 -2206 -5408 2399 5906 9831 4481 6568 27995 29249
377 29249 31817 29057 21678 13962 4942 -5164 -10480 -4304 -256 5185 21295 19567 6170 16769
363 16769 21975 8178 2645 4461 10104 4457 2729 -12507 -6801 -2151 -7175 -10058 -8574 -2384
349 -2384 345 -9445 -21208 -27765 -21350 -20411 -31590 -30213 -16797 14843 9856 7653 19658 21340
335 21340 15917 4165 -7857 -15816 -2622 557 -19590 -10499 -3511 9141 16686 29985 -1410
322 -1410 -11332 -12811 13286 24401 14868 13266 14115 8332 -6063 -3302 -4876 -5545 7997 12487 15508
307 15508 19381 16514 12461 13749 11193 10469 16928 7530 -1201 12723 27457 13657 6357 1324
293 1324 -3613 4797 6232 -6574 -20470 -20713 -15886 -16358 -13564 -12867 -11470 -9251 -6407 -17552 -23017
278 -23017 -18005 -11636 -8241 -8518 -23737 -25259 -11561 3843 17483 16897 -4887 -7330 1265 16394
264 16394 24378 26218 36882 43784 37231 27392 25932 30039 18791 29179 28611 18964 24578 32296
250 32296 30367 26620 13708 3706 8559 18999 15202 29947 14088 270 -3423 5611 33534
237 33534 37846 37558 31329 20277 21505 4584 4105 20430 38218 35848 22217 20265 15835 2645
223 2645 -20052 -11169 2354 9460 4953 9091 1634 -2603 2346 4178 -5019 -3847 8063 11591
209 11591 12593 26182 24327 29970 23242 20247 14733 1968 -6321 -3101 21271 35848 49597 50300
195 50300 33252 13437 13905 13859 22450 30001 29070 21722 23855 18099 19276 21551 8940 4190 -1932
180 -1932 -12429 -18234 -15758 -10714 -3221 -7637 5242 10719 8179 13779 4242 2211 9255 19071 12814
165 12814 5176 4295 8220 15081 26904 18493 11484 -6656 -19371 132 1749 -15955 -5705 -12966
151 -12966 -11471 -9657 -9769 -812 -1729 4758 492 4429 -3156 -7411 -1771 8215 12359 16776 1841
136 1841 -11289 -2577 1606 -891 1703 -14895 -2933 87 -3200 -558 9737 15263 19867 15181
122 15181 4632 -11359 -23145 -15039 -10953 -2130 2577 9095 13360 16305 6242 22237 20289 19811
108 19811 33794 28528 16734 2910 -5060 -14458 -9534 -6120 -11407 7069 6916 17313 10296 -1066
94 -1066 -6635 3236 18662 16008 12491 16995 15363 18217 16863 13116 21367 16618 1056 4083 14465
79 14465 14899 11461 9899 5063 1968 -14633 -28801 -20169 -9064 9585 7168 10185 11607 -6807
65 -6807 -10099 6104 10894 9563 6315 6778 13501 14227 6205 7500 3928 -6661 -10198 -9571 -2392 8539
49 8539 15159 14379 14619 30226 41982 38824 31293 17256 17299 16250 13497 14907 26021 3888 -6550
34 -6550 7433 24735 3888 -12855 -7266 -2421 3581 5132 8277 -1929 8570 5169 5910 -336
20 -336 -466 -381 4420 11257 19862 22200 27443 26078 26300 21782 12654 12455 -4018 -14899 -5068 1386
4 1386 1317 -6387 -9870 -2907
0 -2907
$$ Imaginary data points
##PAGE= N=2
##DATA TABLE= (X++(I..I)), XYDATA
32767 89646 89587 91962 86757 88630 87990 90663 90409 88985 99595 101057 95348 88238 95865 108566 109710
32752 109710 113947 107516 107862 108401 102281 96961 101677 116134 122566 113586 111328 110671 103576 105814 104960
32737 104960 102138 106641 110419 106872 107669 114610 115653 126048 131748 133790 138735 133575 116018 105585
32723 105585 102311 101897 93361 95350 110043 117181 117345 126297 120510 115590 120799 117474 124513 146636
32709 146636 144250 121971 118936 130213 146341 150561 149298 131520 126347 125899 143700 159051 156705
32696 156705 149291 154875 164711 166861 163053 162216 171246 169096 149248 142247 144235 138973 141158 146934
32682 146934 149230 163792 166566 163368 163630 165339 163379 158543 149245 158502 170232 170565 184411 190319
32668 190319 182210 177765 177123 169125 166954 178279 192021 199822 196740 199887 203375 199497 202942 218886
32654 218886 210502 194879 181624 174758 175104 163850 159690 182102 190331 177811 172456 187403 195155
32641 195155 200017 195082 186724 166776 168543 174536 181396 191711 191864 195307 188973 184409 198494 206175
32627 206175 207224 196439 198762 198159 202576 208488 211713 221200 212297 205533 211265 218374 233458 214832
32613 214832 199498 182068 176587 190580 199330 199096 187588 184475 187207 191399 219728 230428 221426
32600 221426 213345 223104 221018 213231 222641 238486 240861 235652 233023 233909 229319 236798 244215 260760
32586 260760 277229 265779 237781 228832 224890 218544 241411 249703 243401 241594 247832 266370 277049
32573 277049 258732 240196 229474 219539 225162 239686 236534 241015 254283 247341 250860 265367 270583
32560 270583 256475 251199 254235 256001 248851 241554 241111 242283 238056 239682 248994 268282 281598 264863
32546 264863 260861 274101 271167 257447 250296 240270 232210 225616 239951 245920 248000 266727 263266
32533 263266 250969 270034 283458 279879 272600 271097 273864 265127 259717 247847 252666 267013 274875
32520 274875 279547 283609 278861 272801 264879 270991 280380 283143 289726 305512 308245 289716 279204
32507 279204 288498 291127 285142 282507 291516 296851 285601 278244 270896 280296 304984 307875 312729 319739
32493 319739 307617 296426 283874 292861 271146 260712 277473 281263 290204 297017 295445 292067 293598
32480 293598 285847 287943 278477 283154 290328 305023 317554 311737 309665 298802 292923 291305 298706
32467 298706 306072 306254 299448 300198 299176 305112 296270 280431 266735 281248 302439 298256 301385 298995
32453 298995 295271 307793 330992 323154 311355 316550 325854 332581 333233 337539 334651 325089 322099 313712
32439 313712 301907 311633 319690 314996 303174 278012 294573 322024 314923 319195 325853 331712 326166
32426 326166 308192 310797 339565 351106 350268 330907 323976 316431 315172 315306 305139 301482 302480 307951
32412 307951 303034 299612 312696 324040 322160 322836 337240 333020 328662 330048 313138 318880 329599
32399 329599 326290 336009 328438 326975 342184 350870 336931 316664 334954 341289 334675 329488 319242
32386 319242 313989 318303 334549 347088 349553 337229 322803 333349 329246 325732 329980 342787 328696
32373 328696 328464 342028 345993 334373 321738 318846 313601 324821 344001 345624 336756 319552 317509
32360 317509 328860 320726 321588 332581 337216 350121 370393 351688 341154 339639 326439 321507 321057
32347 321057 338296 366443 359679 350567 346088 349128 350965 339271 346553 345270 322590 319247 342637
32334 342637 360322 363282 351394 357562 367918 358978 343502 335983 329479 335890 339760 344745 354402
32321 354402 345587 343595 356611 354967 347780 363883 362940 353072 366925 369383 366832 361326 349672
$$ [...]
##END NTUPLES=NMR SPECTRUM
##END=
