##TITLE=Analysis number 328283
Compound Code mo 07913
Project Code adrs
Chemist Name fudan
##JCAMPDX= 6.0         $$ Bruker NMR JCAMP-DX V2.0
##DATA TYPE= NMR SPECTRUM
##DATA CLASS= NTUPLES
##ORIGIN= Bruker BioSpin GmbH
##OWNER= nmr
$$ XWIN-NMR		Version 3.5
$$ Tue May 22 11:17:09 2007 GMT Daylight Time (UT+1h)  MAYBRIDGE\nmr@NMR_250MHZ
##.OBSERVE FREQUENCY= 250.131544655141
##.OBSERVE NUCLEUS= ^1H
##.ACQUISITION MODE= SIMULTANEOUS (DQD)
##.ACQUISITION SCHEME= undefined
##.AVERAGES= 16
##.DIGITISER RES= 18
##SPECTROMETER/DATA SYSTEM= dpx250
##.PULSE SEQUENCE= zg30
##.SOLVENT NAME= CDCl3
##.SHIFT REFERENCE= (INTERNAL, CDCl3, 0, 16.522)
##AUDIT TRAIL= $$ (NUMBER, WHEN, WHO, WHERE, WHAT)
$$ ##TITLE= Audit trail, XWIN-NMR		Version 3.5
$$ ##JCAMPDX= 5.01
$$ ##ORIGIN= Bruker BioSpin GmbH
$$ ##OWNER= nmr
$$ C:\u/data/dgb/nmr/ADRS/1330/pdata/1/auditp.txt
$$ ##AUDIT TRAIL=  $$ (NUMBER, WHEN, WHO, WHERE, WHAT)
(   1,<2007-05-22 11:16:32.96 +100>,<MAYBRIDGE\nmr>,<NMR_250MHZ>,
      <created by zg, POWCHK disabled, PULCHK disabled
       configuration hash MD5:
       76 6E 9A 78 1E 09 19 81 EC 84 63 8F B0 6A 59 2D
       data hash MD5: 64K
       80 1A 28 FC F8 43 AA 96 59 90 A3 D3 0D 6D 5D AB>)
(   2,<2007-05-22 11:16:57.96 +100>,<MAYBRIDGE\nmr>,<NMR_250MHZ>,
      <Start of raw data processing
       ef LB = 0.3 FT_mod = 6 PKNL = 1 SI = 32K 
       data hash MD5: 32K
       4E 66 3A 78 A4 9F 43 4F B1 5D 8E 57 00 FF F8 56>)
(   3,<2007-05-22 11:17:00.30 +100>,<MAYBRIDGE\nmr>,<NMR_250MHZ>,
      <apk 
       data hash MD5: 32K
       05 4C 3C 39 51 FD C1 8E C2 1A D2 ED A5 47 04 48>)
(   4,<2007-05-22 11:17:01.00 +100>,<MAYBRIDGE\nmr>,<NMR_250MHZ>,
      <abs ABSG = 5 
       data hash MD5: 32K
       46 87 EC FD 4F F2 66 F7 74 97 B6 79 6E 83 09 E4>)
$$ ##END=
$$ 
$$ hash MD5
$$ 00 B5 23 E2 99 B1 13 0E 08 EF ED 4F F0 E7 BA 0F
##$RELAX= 
##$RELAX= 
##$RELAX= 
##$RELAX= 
##$RELAX= 
##$RELAX= 
##$RELAX= 
$$ Bruker specific parameters
$$ --------------------------
##$DU= <C:\u>
##$EXPNO= 1330
##$NAME= <ADRS>
##$PROCNO= 1
##$TYPE= <nmr>
##$USER= <dgb>
##$AMP= (0..31)
100 100 100 100 100 100 100 100 100 100 100 100 100 100 100 100 100 100 
100 100 100 100 100 100 100 100 100 100 100 100 100 100 
##$AQSEQ= 0
##$AQ_mod= 3
##$AUNM= <au_zg>
##$AUTOPOS= <10 >
##$BF1= 250.13
##$BF2= 250.13
##$BF3= 250.13
##$BF4= 250.13
##$BF5= 500.13
##$BF6= 500.13
##$BF7= 500.13
##$BF8= 500.13
##$BYTORDA= 1
##$CFDGTYP= 0
##$CFRGTYP= 5
##$CHEMSTR= <none>
##$CNST= (0..31)
1 1 145 1 1 1 1 1 1 1 1 1 1 1 1 1 1 1 1 1 1 1 1 1 1 1 1 1 1 1 1 1 
##$CPDPRG= <>
##$CPDPRG1= <>
##$CPDPRG2= <>
##$CPDPRG3= <>
##$CPDPRG4= <mlev>
##$CPDPRG5= <mlev>
##$CPDPRG6= <mlev>
##$CPDPRG7= <mlev>
##$CPDPRG8= <mlev>
##$CPDPRGB= <>
##$CPDPRGT= <>
##$D= (0..31)
0 1 0 0 0 0 0 0 0 0.06 0 0 0 0 0 0 0.0002 0 0 0 0 0 0 0 0 0 0 0 0 0 0 
0 
##$DATE= 1179828990
##$DBL= (0..7)
120 120 120 120 120 120 120 120 
##$DBP= (0..7)
150 150 150 150 150 150 150 150 
##$DBP07= 0
##$DBPNAM0= <>
##$DBPNAM1= <>
##$DBPNAM2= <>
$$ [...]
##$SUBNAM7= <"">
##$SUBNAM8= <"">
##$SUBNAM9= <"">
##$SW= 20.6930455092707
##$SWIBOX= (0..15)
0 0 3 0 0 0 0 0 0 0 0 0 0 0 0 0 
##$SW_h= 5175.983436853
##$TD= 65536
##$TD0= 1
##$TE= 683.16
##$TE2= 300
##$TE3= 300
##$TEG= 300
##$TL= (0..7)
0 120 120 120 120 120 120 120 
##$TP= (0..7)
150 150 150 150 150 150 150 150 
##$TP07= 0
##$TPNAME0= <>
##$TPNAME1= <>
##$TPNAME2= <>
##$TPNAME3= <>
##$TPNAME4= <>
##$TPNAME5= <>
##$TPNAME6= <>
##$TPNAME7= <>
##$TPOAL= (0..7)
0.5 0.5 0.5 0.5 0.5 0.5 0.5 0.5 
##$TPOFFS= (0..7)
0 0 0 0 0 0 0 0 
##$TUNHIN= 0
##$TUNHOUT= 0
##$TUNXOUT= 0
##$USERA1= <user>
##$USERA2= <user>
##$USERA3= <user>
##$USERA4= <user>
##$USERA5= <user>
##$V9= 5
##$VALIST= <valist>
##$VCLIST= <CCCCCCCCCCCCCCC>
##$VD= 0
##$VDLIST= <DDDDDDDDDDDDDDD>
##$VPLIST= <PPPPPPPPPPPPPPP>
##$VTLIST= <TTTTTTTTTTTTTTT>
##$WBST= 1024
##$WBSW= 4
##$XGAIN= (0..3)
0 0 0 0 
##$XL= 0
##$YL= 0
##$YMAX_a= 519769
##$YMIN_a= -397322
##$ZGOPTNS= <>
##$ZL1= 120
##$ZL2= 120
##$ZL3= 120
##$ZL4= 120
##$ABSF1= 16.522
##$ABSF2= -4.171173
##$ABSG= 5
##$ABSL= 3
##$ALPHA= 0
##$AQORDER= 0
##$ASSFAC= 0
##$ASSFACI= 0
##$ASSFACX= 0
##$ASSWID= 0
##$AUNMP= <proc_1d>
##$AZFE= 0.1
##$AZFW= 0.1
##$BCFW= 0
##$BC_mod= 0
##$BYTORDP= 0
##$COROFFS= 0
##$CY= 12.5
##$DATMOD= 1
##$DC= 0
##$DFILT= <>
##$DTYPP= 0
##$F1P= 14.0000005364418
##$F2P= -0.99999901652339
##$FCOR= 0.5
##$FTSIZE= 32768
##$FT_mod= 6
##$GAMMA= 0
##$GB= 0
##$INTBC= 1
##$INTSCL= 1
##$ISEN= 128
##$LB= 0.3
##$LEV0= 0
##$LPBIN= 0
##$MAXI= 10000
##$MC2= 0
##$MEAN= 0
##$ME_mod= 0
##$MI= 0
##$NCOEF= 0
##$NC_proc= -4
##$NLEV= 6
##$NOISF1= 0
##$NOISF2= 0
##$NSP= 0
##$NTH_PI= 0
##$NZP= 0
##$OFFSET= 16.522
##$PC= 1
##$PHC0= -56.07152
##$PHC1= 8.691452
##$PH_mod= 1
##$PKNL= yes
##$PPARMOD= 0
##$PSCAL= 4
##$PSIGN= 0
##$REVERSE= no
##$SF= 250.13
##$SI= 32768
##$SIGF1= 0
##$SIGF2= 0
##$SINO= 400
##$SIOLD= 32768
##$SREGLST= <1H.CDCl3>
##$SSB= 0
##$STSI= 32768
##$STSR= 0
##$SW_p= 5175.98343685301
##$SYMM= 0
##$S_DEV= 0
##$TDeff= 65536
##$TDoff= 0
##$TI= <Analysis number 999999
Compound Code 99
Book Reference 9
Project Code 9>
##$TILT= no
##$TM1= 0
##$TM2= 0
##$TOPLEV= 0
##$USERP1= <user>
##$USERP2= <user>
##$USERP3= <user>
##$USERP4= <user>
##$USERP5= <user>
##$WDW= 1
##$XDIM= 32768
##$YMAX_p= 383250827
##$YMIN_p= -124855
$$ End of Bruker specific parameters
$$ ---------------------------------
##NTUPLES= NMR SPECTRUM
##VAR_NAME=  FREQUENCY,     SPECTRUM/REAL,   SPECTRUM/IMAG
##SYMBOL=    X,             R,               I
##VAR_TYPE=  INDEPENDENT,   DEPENDENT,       DEPENDENT
##VAR_FORM=  AFFN,          ASDF,            ASDF
##VAR_DIM=   32768,         32768,           32768
##UNITS=     HZ,            ARBITRARY UNITS, ARBITRARY UNITS
##FACTOR=    0.157963299565203, 1,           1
##FIRST=     4132.6476996994, 0,             0
##LAST=      -1043.33573715361, 0,           0
##MIN=       -1043.33573715361, -124855,     0
##MAX=       4132.6476996994, 383250827,     0
$$ Real data points
##PAGE= N=1
##DATA TABLE= (X++(R..R)), XYDATA
$$ [...]
$$ plain form
23342 6496 -25974 -54067 -39723 -10185 11753 35646 32762 39096 20843 75 -1492 6030 5832
23329 5832 -4454 -29375 -52843 -77056 -71666 -81219 -43167 -27967 -25077 -21428 -20511 1590 8435
23316 8435 12012 1386 -41812 -52914 -41120 -49565 -28455 -7926 -23439 -23070 -11910 7279 516
23303 516 -6047 -18352 -39559 -52161 -70592 -34646 11943 37498 25106 -12271 -29212 -12823
23291 -12823 20075 50006 11834 -29094 -23965 -12809 -16518 -20111 -22385 -12086 -21036 -4283 24449
23278 24449 15970 1002 730 34043 21196 21843 14548 -1405 -18184 1548 3440 -5247 -21639
23265 -21639 -24935 -4437 2952 8351 -1313 -14360 -15120 10849 30883 7637 -26778 -45136 -17590
23252 -17590 -6492 -22818 -14484 -26025 -30807 -11099 -22911 -34977 -11557 -36070 -47916 -36647
$$ packed form
23342F496l2470k8093J4344K9538K1938K3893k884O334j8253k0768j567P522j98
23329E832j0286k4921k3468k4213N390r553L8052J5200K890L649R17K2101O845
23316H435L577j0626m3198j1102J1794q445K1110K0529j5513L69J1160J9189o763
23303E16o563j2305k1207j2602j8431L5946M6589K5555j2392l7377j6941J6389
23291a2823L2898K9931l8172m0928N129J1156l709l593k274J0299q950J6753K8732
23278B4449q479j4968k72L3313j2847O47p295j5953j6779J9732J892q687j6392
23265b1639l296K0498P389N399r664j3047p60K5969K0034k3246l4415j8358K7546
23252a7590J1098j6326Q334j1541m782J9708j1812j2066K3420k4513j1846J1269
$$ plain form
23240 -36647 8023 5716 -16845 -27138 -48504 -48020 -38856 -45112 -61411 -62913 -40793 -25131 -40810
23227 -40810 -68744 -66303 -54333 -30076 2320 518 2008 9799 -9947 -27660 -30133 -50279 -23974
23214 -23974 -5888 -12166 4112 15978 45721 49291 52415 35130 -6494 6197 11791 10038 2862
23201 2862 8138 8586 9730 4266 7582 -1507 -369 -20436 -25215 -18007 -3455 869 12564 8165
23187 8165 -7593 1479 1858 17530 7760 1782 7557 20058 14152 26224 28426 15236 -4753
23174 -4753 -18344 -43881 -69982 -65951 -69392 -53267 -20652 -12865 -10225 -9676 2856 -29480 -39358
23161 -39358 -23500 -22657 -15086 13470 23307 17304 -9131 -24816 -19711 10931 16092 -2393 17652
23148 17652 14568 13676 4446 17832 26462 22893 13997 23178 26109 18841 27709 235 -8924 -29619
$$ packed form
23240c6647M4670k307k2561j0293k1366M84R164o256j6299j502K2120J5662j5679
23227d0810k7934K441J1970K4257L2396j802J490P791j9746j7713k473k0146K6305
23214b3974J8086o278J6278J1866K9743L570L124j7285m1624J2691N594j753p176
23201B862N276M48J144n464L316r089J138k0067m779P208J4552M324J1695m399
23187H165j5758R072L79J5672r770n978N775J2501n906J2072K202j3190j9989
23174d753j3591k5537k6101M031l441J6125L2615P787K640N49J2532l2336r878
23161c9358J5858Q43P571K8556R837o003k6435j5685N105L0642N161j8485K0045
23148A7652l084q92r230J3386Q630l569q896R181K931p268Q868k7474r159k0695
$$ plain form
23134 -29619 -32986 -32152 -35447 -41052 -22399 -3744 -9475 -16724 -32074 -42319 -11799 -3179 -12396
23121 -12396 -12436 -6175 -3355 29517 44850 30857 -5039 -34358 -39843 -6941 11752 -7706 -12649
23108 -12649 30857 61564 69429 32676 28514 36994 44216 44588 39118 39713 28120 5720 -2266 13213
23094 13213 36218 -3662 -24645 3461 19595 8287 -31178 -38634 -38805 -44650 -37725 -37115 -39872
23081 -39872 -24183 -19619 -1519 339 -18544 -19666 -49892 -69388 -17249 27457 31865 31621 36023
23068 36023 31928 -14829 -41381 -53032 -49701 -61332 -17621 19593 39138 26950 18785 15991
23056 15991 10977 -8693 -22758 -15377 -662 22095 11489 -13949 -41772 -21451 2613 2951
23044 2951 13672 32286 22418 2039 -13683 -22529 -9172 -28199 -32558 -19344 -18881 -13491 -4796
$$ packed form
23134b9619l367Q34l295n605J8653J8655n731p249j5350j0245L0520Q620r217
23121a2396m0O261K820L2872J5333j3993l5896k9319n485L2902J8693j9458m943
23108a2649M3506L0707P865l6753m162Q480P222L72n470N95j1593k2400p986J5479
23094A3213K3005l9880k0983K8106J6134j1308l9465p456j71n845O925O10k757
23081c9872J5689M564J8100J858j8883j122l0226j9496N2139M4706M408k44M402
23068C6023m095m6757k6552j1651L331j1631M3711L7214J9545j2188q165k794
23056A5991n014j9670j4065P381J4715K2757j0606k5438k7823K0321K4064L38
23044B951J0721J8614r868k0379j5722q846J3357j9027m359J3214M63N390Q695
$$ plain form
23031 -4796 -7553 -14460 -16349 -18768 -20552 267 -195 14944 17678 -400 -11346 -5467 -7338 -11839
23017 -11839 4788 22763 15865 7646 -2262 2254 -18988 -20660 -15333 -469 21822 7251 -7253
23004 -7253 -46971 -40053 -2895 9856 27557 29329 11795 24313 -1593 -15132 290 -520 -7658
22991 -7658 -23479 -7018 -28201 -19986 -1944 5828 -12729 -26647 -25795 -40323 -26404 14354 19166
22978 19166 -15402 -33684 -49082 -56670 -37799 -22154 -1336 2493 9396 4539 -37536 -79435
22966 -79435 -98333 -79365 -49430 -38427 -29848 -20165 -1376 -10651 544 -15661 -41914 -33232
22954 -33232 -21785 -4679 -3327 -11524 -16527 -22958 -44414 -53516 -41144 -18640 -9071 5206 15266
22941 15266 28404 31141 17502 14889 15286 23285 999 4868 15283 17527 16569 -1525 4705 9322
$$ packed form
23031d796k757o907j889k419j784K0819m62J5139K734j8078j0946N879j871m501
23017a1839J6627J7975o898q219r908M516k1242j672N327J4864K2291j4571j4504
23004g253l9718O918L7158J2751J7701J772j7534J2518k5906j3539J5422q10p138
22991g658j5821J6461k1183Q215J8042P772j8557j3918Q52j4528J3919M0758M812
22978A9166l4568j8282j5398p588J8871J5645K0818L829O903m857m2075m1899
22966g9435j8898J8968K9935J1003Q579R683J8789r275J1195j6205k6253Q682
22954c3232J1447J7106J352q197n003o431k1456r102J2372K2504R569J4277J0060
22941A5266J3138K737j3639k613L97P999k2286L869J0415K244r58j8094O230M617
$$ plain form
22927 9322 3820 -12039 -21576 -33163 -35230 -24543 -15424 -290 -28235 -24773 -12976 -21649 -33931
22914 -33931 -25109 -7476 -5173 10651 -1484 -7220 -18187 -29822 -24340 -9777 -11649 -27581 -37025
22901 -37025 -33296 -58930 -64596 -40702 -26109 -8008 -23588 -65173 -57293 4917 29336 19858
22889 19858 8193 3477 -22868 -19052 -8330 -7332 -30482 -32925 -26632 -19802 -17695 -32206 -34400
22876 -34400 -30564 -40297 -33453 -10811 4535 -12242 -20570 -40305 -41488 -19107 -23609 -49456 -60649
22863 -60649 -25993 10048 8062 -17139 -22756 6020 16436 -1669 -37446 -55636 -24241 17734
22851 17734 35824 33927 12478 21883 -11029 -18344 8346 48930 62759 57342 20186 -5052
22839 -5052 -19289 -16660 -20374 -20461 -54313 -63783 -31189 -10128 -39253 -14732 1238 16464 5752
$$ packed form
22927I322n502j5859r537j1587k067J0687R119J5134k7945L462J1797q673j2282
22914c3931Q822J7633K303J5824j2135n736j0967j1635N482J4563j872j5932r444
22901c7025L729k5634n666K3894J4593J8101j5580m1585P880O2210K4419r478
22889A9858j1665m716k6345L816J0722R98k3150k443O293O830K107j4511k194
22876c4400L836r733O844K2642J5346j6777q328j9735j183K2381m502k5847j1193
22863f0649L4656L6041j986k5201n617K8776J0416j8105l5777j8190L1395M1975
22851A7734J8090j897k1449R405l2912p315K6690M0584J3829n417l7156k5238
22839e052j4237K629l714q7l3852r470L2594K1061k9125K4521J5970J5226j0712
$$ plain form
22826 5752 5218 -714 -13033 -7865 -8751 -42996 -52717 -57816 -35180 -2316 13200 33578 35509 26355
22812 26355 18244 21670 19144 3658 -6807 21932 33897 22270 39031 29502 7015 -4080
22800 -4080 -15551 -14259 -24611 -45481 -51490 -32661 6384 1057 -19104 -42155 -63794 -29816
22788 -29816 -14645 603 10041 -406 -37066 -33649 -7340 7087 21647 43320 54492 30942
22776 30942 11960 26212 23711 4190 -7818 -24774 -16262 7918 30201 34283 12668 -23679
22764 -23679 -27432 -29300 -18668 9422 27631 31135 44916 25426 1422 -18721 -34925 -6029
22752 -6029 7118 -1835 -29260 -52258 -45870 -22980 -11560 -6262 -13614 -8076 -1785 -23442 -26868
22739 -26868 -38139 -21972 -16910 -22716 16648 20231 11308 25164 43078 31998 30605 14999 2349
$$ packed form
22826E752n34n932j2319N168q86l4245r721n099K2636L2864J5516K0378J931r154
22812B6355q111L426k526j5486j0465K8739J1965j1627J6761r529k2487j1095
22800d080j1471J292j0352k0870o009J8829L9045n327k0161k3051k1639L3978
22788b9816J5171J5248R438j0447l6660L417K6309J4427J4560K1673J1172k3550
22776C0942j8982J4252k501j9521j2008j6956Q512K4180K2283M082k1615l6347
22764b3679l753j868J0632K8090J8209L504J3781j9490k4004k0143j6204K8896
22752f029J3147q953k7425k2998O388K2890J1420N298p352N538O291k1657l426
22739b6868j1271J6167N062n806L9364L583q923J3856J7914j1080j393j5606j2650
$$ plain form
22726 2349 -6620 9825 43581 51448 37036 41954 62416 45311 13236 19316 3350 4831 17683
22713 17683 17362 12439 15498 21992 16666 -3333 -1988 -9344 -6277 -14902 -26871 -35181 -43007 -33459
22699 -33459 -29257 -28893 -45223 -33964 -22372 -6402 2311 11349 39727 24482 -16528 -8369 11102
22686 11102 28681 49343 48269 32834 42591 22386 10738 12666 -6917 -18507 -30912 -22809
22674 -22809 1501 2459 26248 49208 42292 29149 11755 5738 -5188 637 11625 34206 34070
22661 34070 19827 20048 20898 29442 7657 -21292 -18595 -208 43266 35492 33956 19699 20214 30355
22647 30355 7330 -6772 -9315 -9111 -8745 6271 -3820 2267 -16686 -12495 -5119 3878 -4501 2350
22633 2350 -22489 316 11798 20557 8715 -26202 -30082 -41582 -25778 -9650 16653 18661
$$ packed form
22726B349q969J6445L3756P867j4412M918K0462j7105l2075O080j5966J481J2852
22713A7683l21m923L059O494n326j9999J345p356L067q625j1969q310p826R548
22699c3459M202L64j6330J1259J1592J5970Q713R038K8378j5245m1010Q159J9471
22686A1102J7579K0662j074j5435R757k0205j1648J928j9583j1590j2405Q103
22674b2809K4310R58K3789K2960o916j3143j7394o017j0926N825J0988K2581j36
22661C4070j4243K21Q50Q544k1785k8949K697J8387M3474p774j536j4257N15J0141
22647C0355k3025j4102k543K04L66J5016j0091O087j8953M191P376Q997q379O851
22633B350k4839K2805J1482Q759j1842l4917l880j1500J5804J6128K6303K008
$$ plain form
22621 18661 21284 -25627 -49178 -41856 -21349 -33466 -31708 -15883 -23358 -21369 -19187 -11547 -19691
22608 -19691 9772 17786 -8325 -15962 -29477 7960 28317 3582 -37313 -56697 -24794 -11657
22596 -11657 -305 9857 14374 30088 30890 11039 14553 23403 17622 -2689 -13117 -26495 -47148
22583 -47148 -25205 -8115 -23138 -33588 -39572 -33255 -17235 8686 36489 24067 31170 27638
22571 27638 15928 18673 11682 9196 -15663 -67601 -63352 -23077 2074 -7591 10715 23648 28579
22558 28579 20772 -418 1802 -2634 -22039 6447 10197 6540 33729 28542 24664 9093 -25050
22545 -25050 -28703 -11224 4289 -3926 19132 32254 14012 -12998 -3940 13205 38272 30414
22533 30414 18366 427 8244 15801 13256 26322 10631 -9845 -25090 -7606 18733 12348
$$ packed form
22621A8661K623m6911k3551P322K0507j2117J758J5825p475J989K182P640q144
22608a9691K9463Q014k6111p637j3515L7437K0357k4735m0895j9384L1903J3137
22596a1657J1352J0162M517J5714Q02j9851L514Q850n781k0311j0428j3378k0653
22583d7148K1943J7090j5023j0450n984O317J6020K5921K7803j2422P103l532
22571B7638j1710K745o991k486k4859n1938M249M0275K5151r665J8306J2933M931
22558B8579p807k1190K220m436j9405K8486L750l657K7189n187l878j5571l4143
22545b5050l653J7479J5513q215K3058J3122j8242k7010R058J7145K5067p858
22533C0414j2048j7939P817P557k545J3066j5691k0476j5245J7484K6339o385
$$ plain form
22521 12348 9293 56307 67818 17061 9661 15586 26678 25758 -16715 -29495 -30825 -5196 7049
22508 7049 333 -16972 -26522 -32582 -27865 -21363 -15548 3987 14262 1959 7745 -6939 -19658
22495 -19658 18758 42852 2464 7080 8011 -15958 -27863 -27392 1760 8525 26162 20530 29275
22482 29275 44688 49151 19587 12068 -432 -5191 -4716 -19662 -30342 -39921 -26708 -26023 -22681
22469 -22681 -28625 11262 47982 56293 30815 -717 -12651 5481 20711 5036 -12716 -32132
22457 -32132 -23721 -12882 -6242 5221 24764 23639 6656 -22548 -59916 -60719 -38107 -25808 -36032
22444 -36032 -41425 -42592 -45633 -72115 -90637 -82246 -73808 -65856 -54312 -32078 -12000 -4875 7462
22431 7462 14491 45067 47803 40003 200 -20997 -7100 14779 9032 -16727 -37396 -16200 -357
$$ packed form
22521A2348l055M7014J1511n0757p400N925J1092r20m2473j2780j330K5629J2245
22508G049o716j7305r550o060M717O502N815J9535J0275j2303N786j4684j2719
22495a9658L8416K4094m0388M616R31k3969j1905M71K9152O765J7637n632Q745
22482B9275J5413M463k9564p519j2500m759M75j4946j0680r579J3213O85L342
22469b2681n944L9887L6720Q311k5478l1532j1934J8132J5230j5675j7752j9416
22457c2132Q411J0839O640J1463J9543j125j6983k9204l7368q03K2612J2299j0224
22444c6032n393j167l041k6482j8522Q391Q438P952J1544K2234K0078P125J2337
22431G462P029L0576K736p800l9803k1197J3897K1879n747k5759k0669K1196J5843
$$ plain form
22418 -357 -12624 7896 -9116 3150 11614 24159 34304 3027 -9220 -15556 -3638 27876
22406 27876 34160 31376 21266 52281 56280 33025 35976 37194 35624 34440 20099 2243 6048
22393 6048 41202 34571 49277 43828 39248 12156 -20201 -48316 -54405 -46810 -57385 -63501 -39710
22380 -39710 -9415 -20854 -13568 -8272 26563 21862 1721 -6040 -18967 -50551 -15604 15810
22368 15810 6130 3762 8889 6102 -12893 -9902 -7170 -345 939 34657 52269 50338 24432
22355 24432 14719 24838 55628 40157 57989 34161 5121 10220 35483 30098 21962 15970 -18158
22342 -18158 -6107 7581 30957 43320 36178 27620 21103 14982 24176 15976 10346 18112 8100
22329 8100 -42091 -26116 16708 9780 -4076 -17006 -43910 -36286 -19223 -12349 9036 17961 27596
$$ packed form
22418c57j2267K0520j7012J2266Q464J2545J0145l1277j2247o336J1918L1514
22406B7876O284k784j0110L1015L999k3255K951J218j570j184j4341j7856L805
22393F048L5154o631J4706n449m580k7092l2357k8115o089P595j0575o116K3791
22380c9710L0295j1439P286N296L4835m701k0141p761j2927l1584L4947L1414
22368A5810r680k368N127k787j8995K991K732O825J284L3718J7612j931k5906
22355B4432r713J0119L0790j5471J7832k3828k9040N099K5263n385q136n992l4128
22342a8158J2051J3688K3376J2363p142q558o517o121R194q200n630P766j0012
22329H100n0191J5975M2824o928j3856j2930k6904P624J7063O874K1385Q925R635
$$ plain form
22316 27596 -2495 -15234 -26140 -44250 -63398 -73888 -53020 -7794 -17787 -28253 -26679 -11329
22304 -11329 15893 28883 -366 -31191 -26455 -29251 -54574 -47024 -7255 19287 29855 26421
22292 26421 -21166 -23937 -30432 -35727 -50773 -72576 -73524 -45837 -33734 -15763 -575 -13107 -20703
22279 -20703 -9339 9960 30325 3068 6085 25978 25412 18651 -5599 -19411 -21023 -12394 12220
22266 12220 23286 32903 20113 19642 31911 23428 15754 19629 16253 -8041 -5298 -15802 -29685
22253 -29685 -38352 -64064 -61444 -25921 4231 20795 23939 5401 4012 9104 -5161 8188 13669
22240 13669 30186 22334 -480 -20221 -8806 952 -7374 -29326 -21017 864 30503 11087
22228 11087 -11743 -28701 -39146 -13368 2499 -12 2479 9196 23272 9567 7605 27721
$$ packed form
22316B7596l0091j2739j0906j8110j9148j0490K0868M5226r993j0466J574J5350
22304a1329K7222J2990k9249l0825M736k796k5323P550L9769K6542J0568l434
22292B6421m7587k771o495n295j5046k1803r48K7687J2103J7971J5188j2532p596
22279b0703J1364J9299K0365k7257L017J9893n66o761k4250j3812j612Q629K4614
22266A2220J1066R617j2790m71J2269q483p674L875l376k4294K743j0504j3883
22253b9685q667k5712K620L5523L0152J6564L144j8538j389N092j4265J3349N481
22240A3669J6517p852k2814j9741J1415R758q326k1952Q309K1881K9639j9416
22228A1087k2830j6958j0445K5778J5867k511K491O717J4076j3705j962K0116
$$ plain form
22216 27721 39513 31341 24799 9167 -66 -27188 -43919 -20847 10405 20976 26700 24140 -3048
22203 -3048 9916 4803 -31085 -26560 -652 12018 31643 25246 2732 -9318 -4416 -21867 -14001
22190 -14001 10880 33243 4725 4215 1944 1984 -2671 3632 26899 44141 20959 -14607 -2620
22177 -2620 2590 9849 -11186 -36156 -27954 -17114 -15311 -12038 -13435 -14997 -3126 -7140 -13886 17697
22163 17697 31313 19699 19614 7990 9176 -3310 -10518 -7537 -24940 -18271 -7366 19800 16411
22150 16411 -5469 -15201 -2560 16587 10493 -6763 -2138 6512 27466 50918 62219 54357 61531
22137 61531 79455 79674 66534 30009 29483 48397 56777 37610 13042 9822 5447 -7539 -9874
22124 -9874 4252 13073 33530 33519 4978 -10640 -11055 -5748 -8268 -12633 6181 20503 29011 26042
$$ packed form
22216B7721J1792q172o542j5632r233k7122j6731K3072L1252J0571N724k560k7188
22203c048J2964n113l5888M525K5908J2670J9625o397k2514j2050M902j7451P866
22190a4001K4881K2363k8518n10k271M0m655O303K3267J7242k3182l5566J1987
22177b620N210P259k1035k4970Q202J0840J803L273j397j562J1871m014o746L1583
22163A7697J3616j1614q5j1624J186j2486p208K981j7403O669J0905K7166l389
22150A6411k1880r732J2641J9147o094j7256M625Q650K0954K3452J1301p862P174
22137F1531J7924K19j3140l6525n26J8914Q380j9167k4568l220m375j2986k335
22124i874J4126Q821K0457j1k8541j5618m15N307k520m365J8814J4322Q508k969
$$ plain form
22110 26042 25007 27122 25407 21175 26254 23251 15110 19086 36983 6297 -4215 -2626 -8177 3711
22096 3711 36135 29360 9979 23857 45163 52613 49336 47792 44277 58537 46575 44279 45961
22083 45961 66579 61336 27873 7373 9406 25598 60437 54673 48888 26385 34503 15211 12680
22070 12680 7433 20044 30346 37315 54353 89976 122776 179149 244407 363591 534778 824914
22058 824914 1007007 885902 595842 355525 246428 163948 93724 69287 61570 52944 44096
22047 44096 61666 45630 29604 35024 71064 56998 50375 57732 64943 56064 41001 4636 5628
22034 5628 3869 28725 44692 25647 28905 15644 17684 62753 95516 114275 125086 103507
22022 103507 82136 79674 71179 72077 102887 172362 234517 276114 400258 583616 856698 1165743
$$ packed form
22110B6042j035K115j715m232N079l003q141L976J7897l0686j0512J589n551J1888
22096C711L2424o775j9381J3878K1306P450l277j544l515J4260j1962k296J682
22083D5961K0618n243l3463k0500K033J6192L4839n764n785k2503Q118j9292k531
22070A2680n247J2611J0302O969J7038L5623L2800N6373O5258J19184J71187K90136
22058H24914J82093j21105k90060k40317j09097q2480p0224k4437p717q626q848
22047D4096J7570j6036j6026N420L6040j4066o623P357P211q879j5063l6365R92
22034E628j759K4856J5967j9045L258j3261K040M5069L2763J8759J0811k1579
22022A03507k1371k462q495Q98L0810O9475O2155M1597J24144J83358K73082L09045
$$ plain form
22010 1165743 1268769 1079437 955753 1109778 1476940 2009488 2184349 1636477 990436
22001 990436 621307 417257 311319 235814 213856 190679 177380 170912 153594 144014 141999
21990 141999 160125 183132 189014 207750 210452 251297 317288 388194 533899 789355 1186346
21979 1186346 1756910 2161587 1818145 1127331 641907 395981 282981 201588 177756 176361
21969 176361 148429 118928 110795 113989 135918 127507 109710 77604 57911 44572 54300 93437
21957 93437 95269 95434 97681 104171 100921 106733 117129 95779 78761 57182 42262 22790 57296
21944 57296 68577 61656 42901 38976 28879 36522 70510 91259 100289 82714 72420 58902
21932 58902 45601 76991 124555 137413 122356 96524 119114 126993 89027 59121 59173 76876
$$ packed form
22010A165743J03026j89332j23684J54025L67162N32548J74861n47872o46041
22001I90436l69129k04050j05938p5505k1958k3177j3299o468j7318r580k015
21990A41999J8126K3007N882J8736K702M0845O5991P0906J45705K55456L96991
21979A186346N70564M04677l43442o90814m85424k45926j13000q1393k3832j395
21969A76361k7932k9501q133L194K1929q411j7797l2106j9693j3339R728L9137
21957I3437J832J65K247O490l250N812J0396k1350j7018k1579j4920j9472L4506
21944E7296J1281o921j8755l925j0097P643L3988K0749R030j7575j0294j3518
21932E8902j3301L1390M7564J2858j5057k5832K2590P879l7966k9906N2J7703
$$ plain form
21920 76876 84804 81451 79173 92604 79729 60639 60310 72104 65419 70635 76929 30172 -6904
21907 -6904 17265 48171 59964 38586 46037 91442 113863 125759 141707 150922 127302 78420
21895 78420 51079 79159 115441 121686 76839 28985 36981 39460 67172 88119 78468 55238
21883 55238 64380 74723 83403 102182 107502 106949 104631 96767 119567 135254 154657 185692 210168
21870 210168 277108 309579 303351 258529 164618 107932 95791 80519 70038 48213 40572 55274
21858 55274 47383 49075 24475 -4770 -1743 1598 11800 31828 20883 24056 55797 120361 150519
21845 150519 229137 283174 293646 298138 242955 168030 117997 102543 99032 88970 88053 93937
21833 93937 88788 114172 156983 177579 148641 76989 25629 17604 11170 18779 19904 49652 57786
$$ packed form
21920G6876P928l353k278J3431j2875j9090l29J1794o685N216O294m6757l7076
21907f904K4169L0906J1793k1378P451M5405K2421J1896J5948R215k3620m8882
21895G8420k7341K8080L6282O245m4847m7854P996K479K7712K0947r651k3230
21883E5238R142J0343Q680J8779N320n53k318p864K2800J5687J9403L1035K4476
21870B10168O6940L2471o228m4822r3911n6686j2141j5272j0481k1825p641J4702
21858E5274p891J692k4600k9245L027L341J0202K0028j0945L173L1741O4564L0158
21845A50519P8618N4037J0472M492n5183p4925n0033j5454l511j0062r17N884
21833I3937n149K5384M2811K0596k8938p1652n1360q025o434P609J125K9748Q134
$$ plain form
21820 57786 59253 83840 78499 75103 64180 55395 65163 69275 47974 29843 25855 37345 31122
21807 31122 50898 81958 78840 78742 121535 151659 107359 51007 14136 11977 36921 52667 103415
21794 103415 137656 164749 167041 143632 109227 111938 117692 91409 61793 65381 77439 90282
21782 90282 97414 109933 111608 101042 95124 67393 58220 44900 31660 27236 9575 3817 36044
21769 36044 69954 78943 61208 21256 -22604 -57282 -43699 9166 21231 18274 21470 18034
21757 18034 5780 38741 46747 34405 34421 18797 32696 18305 17493 37133 22934 14150 22224
21744 22224 41860 69945 67551 63553 45063 22339 -1397 -21575 -692 33512 34786 37890
21732 37890 80936 111037 116977 118736 120962 116458 113037 139335 152574 171141 130056 101165 93886
$$ packed form
21820E7786J467K4587n341l396j0923q785R768M112k1301j8131l988J1490o223
21807C1122J9776L1060l118r8M2793L0124m4300n6352l6871k159K4944J5746N0748
21794A03415L4241K7093K292k3409l4405K711N754k6283k9616L588J2058J2843
21782I0282P132J2519J675j0566n918k7731r173j3320j3240m424j7661n758L2227
21769C6044L3910Q989j7735l9952m3860l4678J3583N2865J2065k957L196l436
21757A8034j2254L2961Q006j2342J6j5624J3899j4391q12J9640j4199q784Q074
21744B2224J9636K8085k394l998j8490k2724k3736k0178K0883L4204J274L104
21732C7890M3046L0101N940J759K226m504l421K6298J3239J8567m1085k8891p279
$$ plain form
21719 93886 57005 70936 95184 85644 67694 69353 71390 54774 79583 75464 79098 115287 153486
21706 153486 172140 171261 150010 143233 171585 152482 110939 100977 83596 81321 43214 30275
21694 30275 68452 104341 128166 103136 90169 88965 133272 159581 129829 100890 99388 97632
21682 97632 118255 157032 177904 174884 151767 114162 92953 98346 123475 146080 127587 113735
21670 113735 100163 94382 70661 39171 68184 69806 85227 95653 120464 119247 132236 145440
21658 145440 115750 65414 42245 55589 75717 65445 62153 93678 91042 94972 105858 123366
21646 123366 158995 196588 212296 193019 181384 153976 109476 94677 106815 110065 95669 104762
21634 104762 121151 96919 102417 95033 78020 71827 63859 22197 -16304 1038 55657 107024
$$ packed form
21719I3886l6881J3931K4248r540j7950J659K037j6616K4809m119L634L6189L8199
21706A53486J8654q79k1251o777K8352j9103m1543r962j7381k275l8107j2939
21694C0275L8177L5889K3825k5030j2967j204M4307K6309k9752k8939j502j756
21682I7632K0623L8777K0872l020k3117l7605k1209N393K5129K2605j8493j3852
21670A13735j3572n781k3721l1490K9013J622J5421J0426K4811j217J2989J3204
21658A45440k9690n0336k3169J3344K0128j0272l292L1525k636L930J0886J7508
21646A23366L5629L7593J5708j9277j1635k7408m4500j4799J2138L250j4396R093
21634A04762J6389k4232N498p384j7013o193p968m1662l8501J7342N4619N1367
$$ plain form
21622 107024 161070 177350 212225 272408 285569 244280 223889 240962 231500 267692 294905 296635
21610 296635 296662 252131 212333 166081 124813 96933 146007 180174 181460 168837 178603 196634
21598 196634 180004 178569 239897 356627 536681 803588 1040842 1048668 800348 604685 493910
21587 493910 453972 508002 499620 430014 358420 332180 283696 234257 232801 183121 146993 141277
21575 141277 157258 142767 132975 153028 157672 186839 184378 236954 314114 387292 441856 460533
21563 460533 442927 436078 441269 440534 424647 410488 413885 419703 460445 517123 635915 778334
21551 778334 1016528 1380377 1920560 2536182 3022691 3257750 3160614 2819288 2305013 1654580
21541 1654580 1147406 852343 700500 631107 552263 502037 490458 492706 501461 510241 553233
$$ packed form
21622A07024N4046J6280L4875O0183J3161m1289k0391J7073r462L6192K7213J730
21610B96635K7m4531l9798m6252m1268k7880M9074L4167J286j2623R766J8031
21598A96634j6630j435O1328J16730J80054K66907K37254P826k48320j95663j10775
21587D93910l9938N4030q382o9606p1594k6240m8484m9439j456m9680l6128n716
21575A41277J5981j4491r792K0053M644K9167k461N2576P7160P3178N4564J8677
21563D60533j7606o849N191p35j5887j4159L397N818M0742N6678J18792J42419
21551G78334K38194L63849N40183O15622M86509K35059r7136l41326n14275o50433
21541A654580n07174k95063j51843o9393p8844n0226j1579K248Q755Q780M2992
$$ plain form
21530 553233 572002 552908 553959 559567 652754 788227 950612 1242714 1670633 2144499 2390624
21519 2390624 2144773 1572051 1102907 855488 738168 704235 707457 707776 693664 666506 684512
21508 684512 728234 778685 783525 799374 808861 794701 785160 813758 844133 902441 923862 930850
21496 930850 933105 965113 1014374 1064651 1135048 1222583 1284392 1324293 1357450 1434289 1561266
21485 1561266 1778954 1998908 2095784 2169166 2229499 2336869 2461222 2642001 3014625 3410593
21475 3410593 3795142 4153783 4603347 5146096 5797253 6711959 7980238 9653852 11704661
21466 11704661 14202302 17793865 23521036 32250055 46338164 70437602 111217250 177222983
21458 177222983 279352135 379578370 354805793 226472204 130079435 79650696 52684204
$$ packed form
21530E53233J8769j9094J051N608R3187J35473J62385K92102M27919M73866K46125
21519B390624k45851n72722m69144k47419j17320l3933L222L19j4112k7158J8006
21508F84512M3722N0451M840J5849R487j4160r541K8598L0375N8308K1421O988
21496I30850K255L2008M9261N0277P0397Q7535O1809L9901L3157P6839J26977
21485A561266K17688K19954R6876P3382O0333J07370J24353J80779L72624L95968
21475C410593L84549L58641M49564N42749O51157R14706J268279J673614K050809
21466A1704661K497641L591563N727171Q729019J4088109K4099438M0779648O6005733
21458A77222983J02129152J00226235k4772577j28333589r6392769n0428739k6966492
$$ plain form
21451 52684204 37358568 28155991 22405323 18677875 16114249 14479309 13644092 13397453
21443 13397453 13617264 14313840 15477378 17268659 19984797 24538807 31905422 43792939
21435 43792939 63930445 98374266 154796109 244738581 357256988 383250827 269771082
21428 269771082 154086682 90488038 57314935 38755651 27633603 20650403 16144522
21421 16144522 12948745 10576460 8976062 7857389 6913878 5988257 5133097 4492545 4011787
21412 4011787 3582387 3233856 3000802 2838811 2575581 2288797 2129049 2040645 1913935 1747761
21402 1747761 1573159 1462614 1458013 1432625 1319151 1241990 1171625 1126117 1029838 929379 856420
21391 856420 816773 763394 738905 711230 674095 658943 646018 617920 566578 515708 449165
$$ packed form
21451E2684204j5325636r202577n750668l727448k563626j634940q35217k46639
21443A3397453K19811O96576J163538J791281K716138M554010P366615J1887517
21435D3792939K0137506L4443821N6421843Q9942472J12518407K5993839j13479745
21428B69771082j15684400o3598644l3173103j8559284j1122048o983200m505881
21421A6144522l195777k372285j600398j118673r43511r25621q55160o40552m80758
21412D011787m29400l48531k33054j61991k63230k86784j59748q8404j26710j66174
21402A747761j74602j10545m601k5388j13474p7161p0365m5508r6279j00459p2959
21391H56420l9647n3379k4489k7675l7135j5152j2925k8098n1342n0870o6543
$$ plain form
21380 449165 401916 444636 485997 480720 452544 438267 497361 532643 530784 572931 661277 801414
21368 801414 1012000 1379203 1922798 2317967 1980296 1336484 906446 651261 526362 419711
21358 419711 349064 331696 337160 333399 309637 292859 349592 371700 346200 316469 350376 372768
21346 372768 407335 457280 559054 695038 915974 1242711 1748864 2123240 1922376 1352912
21336 1352912 920278 687804 595852 550096 484329 427503 367871 304271 255294 197195 188152
21325 188152 171300 130708 114464 119220 147300 199739 221710 197931 200139 195788 184653 163638
21313 163638 140335 133152 159343 190297 195812 208017 221749 176895 119762 106757 124752 89121
21301 89121 76582 96565 107488 75572 67943 84410 96021 153806 176361 183259 188176 186547
$$ packed form
21380D49165m7249M2720M1361n277k8176j4277N9094L5282j859M2147Q8346J40137
21368H01414K10586L67203N43595L95169l37671o43812m30038k55185j24899j06651
21358D19711p0647j7368N464l761k3762j6778N6733K2108k5500k9731L3907K2392
21346C72768L4567M9945J01774J35984K20936L26737N06153L74376k00864n69464
21336A352912m32634k32474r1952m5756o5767n6826n9632o3600m8977n8099r043
21325A88152j6852m0592j6244M756K8080N2439K1971k3779K208m351j1135k1015
21313A63638k3303p183K6191L0954N515J2205J3732m4854n7133j3005J7995l5631
21301H9121j2539J9983J0923l1916p629J6467J1611N7785K2555O898M917j629
$$ plain form
21289 186547 166789 163922 161758 161161 136366 109890 76360 37996 52172 34781 -71832 -103967
21277 -103967 -72564 -55479 -37540 -12237 2979 -21257 -58264 -76359 -68132 -47003 -26808 -26468
21265 -26468 15435 67326 139510 157428 128586 90886 66736 46501 40110 -1998 -10924 -3415
21253 -3415 4301 23076 3559 -41558 -15553 37662 32125 -18036 -64441 -71008 -59309 -46825
21241 -46825 -31484 -23187 -20280 -14955 3877 48114 66537 70421 52485 61164 78963 64736 17692
21228 17692 -5332 -13604 6029 15978 15221 15702 55131 60420 61126 51245 27382 -3104 -16654 -24266
21214 -24266 -4968 7176 9688 780 -26001 -35624 -23561 -13752 1621 -8248 -16093 -4636 38894
21201 38894 33411 52881 91302 96067 90491 77123 58666 68277 77324 23861 -19793 -18807 -21463
$$ packed form
21289A86547j9758k867k164n97k4795k6476l3530l8364J4176j7391j06613l2135
21277a03967L1403J7085J7939K5303J5216k4236l7007j8095Q227K1129K0195L40
21265b6468M1903N1891P2184J7918k8842l7700k4150k0235o391m2108q926P509
21253c415P716J8775j9517m5117K6005N3215n537n0161m6405o567J1699J2484
21241d6825J5341Q297K907N325J8832M4237J8423L884j7936Q679J7799j4227m7044
21228A7692k3024q272J9633R949p57M81L9429N289P06r881k3863l0486j3550p612
21214b4266J9298J2144K512q908k6781r623J2063R809J5373r869p845J1457M3530
21201C8894n483J9470L8421M765n576j3368j8457R611R047n3463m3654R86k656
$$ plain form
21188 -21463 -5195 2783 49873 79556 96657 75836 64925 45347 45404 72562 103117 105572 101758
21175 101758 64076 53505 49695 25350 32501 57425 71684 69424 37628 34095 45695 68468
21163 68468 68459 58920 42752 33182 39541 61193 73984 63520 48892 74334 129635 136615 133858
21150 133858 112439 81481 47043 26080 37696 22053 -11697 -27029 -31265 -1220 13157 31365
21138 31365 15412 25717 38512 26541 1556 -7550 -8557 -12643 -3829 14620 1533 33813
21126 33813 91520 112693 127550 102301 64226 46079 28915 22922 14937 16717 39928 45550
21114 45550 40579 28462 337 2526 13308 7881 11751 22827 23146 37719 51427 48382 18114
21101 18114 12389 -598 7234 1059 -1719 21443 27973 18411 36274 77234 102358 108359 124235
$$ packed form
21188b1463J6268P978M7090K9683J7101k0821j0911j9578N7K7158L0555K455l814
21175A01758l7682j0571l810k4345P151K4924J4259k260l1796l533J1600K2773
21163F8468rr539j6168r570O359K1652J2791j0464j4628K5442N5301O980k757
21150A33858k1419l0958l4438k0963J1616j5643l3750j5332m236L0045J4377J8208
21138C1365j5953J0305J2795j1971k4985r106j007m086Q814J8449j3087L2280
21126C3813N7707K1173J4857k5249l8075j8147j7164n993p985J780K3211N622
21114D5550m971j2117k8125K189J0782n427L870J1076L19J4573J3708l045l0268
21101A8114n725j2987P832o175k778K3162O530r562J7863M0960K5124O001J5876
$$ plain form
21088 124235 108255 84090 77412 49906 29104 18073 25796 27306 18315 6876 -13247 -2773
21076 -2773 1564 -9635 -27395 -36513 -40147 -17831 7900 4571 -2109 -23721 -34135 -28477 4020
21063 4020 -15981 -27819 -1589 39799 34500 3943 -31065 -36800 -11710 -7797 -8127 -23452 -31312
21050 -31312 -44544 -37107 -34722 -20831 -18734 -27384 -7111 10271 18011 18689 477 -2839 -16719
21037 -16719 7594 33543 32050 16928 811 -2856 3186 -6972 -7255 12848 13032 13046 -7309 12690
21023 12690 35872 34835 19358 34631 26329 18134 -15992 -1193 37077 32805 24853 25286 172
21010 172 -687 3063 -8218 -13134 -17862 -261 21426 35325 26598 26328 25036 18765 10624 6254
20996 6254 -7092 -37631 -26988 26363 48709 50541 19017 20822 32041 31077 4471 -4468 -27917
$$ packed form
21088A24235j5980k4165o678k7506k0802j1031P723J510q991j1439k0123J0474
21076b773M337j1199j7760r118l634K2316K5731l329o680k1612j0414N658L2497
21063D020k0001j1838K6230M1388n299l0557l5008n735K5090L913l30j5325p860
21050c1312j3232P437K385J3891K097q650K0273J7382P740O78j8212l316j3880
21037a6719K4313K5949j493j5122j6117l667O042j0158k83K0103J84J4k0355J9999
21023A2690K3182j037j5477J5273q302q195l4126J4799L8270m272p952M33k5114
21010A72q59L750j1281m916m728J7601K1687J3899q727k70j292o271q141m370
20996F254j3346l0539J0643N3351K2346J832l1524J805J1219r64k6606q939k3449
$$ plain form
20983 -27917 -52461 -38246 -36977 -14075 -16286 -14332 -8072 -9126 -4543 4037 43101 32348 -5984
20970 -5984 -30213 -45417 -88890 -84136 -51114 -40518 -30370 -31984 -38324 -21564 -1533 -7946 -32116
20957 -32116 -38654 -19372 -892 780 30262 -2042 -12343 -21044 -49208 -86793 -63626 -51907
20945 -51907 -38306 -25669 -23012 -13206 -6025 21469 16155 1623 -16632 -61805 -74394 -69647 -44818
20932 -44818 -46473 -28394 -17805 -26045 -35314 -21123 -22483 -17415 -13078 -15341 -42192 -20493 439
20919 439 12068 10483 4035 9245 33731 49257 53205 27587 1292 28310 56513 78210 92244
20906 92244 109386 148244 194079 301720 460661 700987 1108338 1686676 2100646 1815451
20896 1815451 1149122 683060 420260 288476 217961 157721 102666 102357 95407 85741 85453 78520
$$ packed form
20983b7917k4544J4215J269K2902k211J954O260j054M583Q580L9064j0753l8332
20970e984k4229j5204m3473M754L3022J0596J0148j614o340J6760K0031o413k4170
20957c2116o538J9282J8480J672K9482l2304j0301q701k8164l7585K3167J1719
20945e1907J3601J2637K657R806P181K7494n314j4532j8255m5173j2589M747K4829
20932d4818j655J8079J0589q240r269J4191j360N068M337k263k6851K1699K0932
20919D39J1629j585o448N210K4486J5526L948k5618k6295K7018K8203K1697J4034
20906I2244J7142L8858M5835J07641J58941K40326M07351N78338M13970k85195
20896A815451o66329m66062k62800j31784p0515o0240n5055l09o950r666k88o933
$$ plain form
20884 78520 94499 103085 103955 121208 123494 150660 192869 264276 405421 636381 983962 1522757
20872 1522757 2055269 1982219 1316101 758331 441049 275891 174259 151032 141353 111003
20862 111003 73938 54533 31467 10692 7267 5864 15448 23408 8458 -7739 6096 23064
20850 23064 10639 2936 6972 9219 13829 -3442 -16790 -3664 2563 3049 14318 -803 20318
20837 20318 32648 7640 11089 6273 -29208 -50409 -57733 -41016 2535 21247 17118 4427
20825 4427 14528 49712 31743 22425 38346 32138 18038 27961 15044 -2006 -12413 -26628
20813 -26628 -27228 6041 30984 34828 32679 32771 26813 17381 28237 46107 40842 55880 71432 70352
20799 70352 62163 10267 -31343 -36644 -28960 -15651 -3844 5906 -5570 -1488 23330 -21183 -25476
$$ packed form
20884G8520J5979Q586Q70J7253K286K7166M2209P1407J41145K30960L47581N38795
20872A522757N32512p3050o66118n57770l17282j65158j01632k3227r679l0350
20862A11003l7065j9405k3066k0775l425j403R584P960j4950j6197J3835J6968
20850B3064j2425p703M036K247M610j7271j3348J3126O227M86J1269j5121K1121
20837B0318J2330k5008L449m816l5481k1201p324J6717M3551J8712m129j2691
20825D427J0101L5184j7969r318J5921o208j4100R923j2917j7050j0407j4215
20813b6628o00L3269K4943L844k149R2n958r432J0856J7870n265J5038J5552j080
20799G0352q189n1896m1610n301P684J3309J1807R750j1476M082K4818m4513m293
$$ plain form
20786 -25476 -28139 -45433 -69634 -23667 -3481 15249 36113 31455 25222 22918 35929 17959
20774 17959 -20490 -36525 -32476 -30136 -19710 10829 27246 30253 34384 30533 23916 30613 25075
20761 25075 18299 21134 9415 17221 21279 21409 27782 1722 14104 25291 43367 41743 48911
20748 48911 62173 54901 49822 47359 35022 4900 -13385 2862 17251 35501 68869 40834
20736 40834 18462 22951 25567 14550 30505 17627 21513 42073 31575 23239 20740 16505 -10232
20723 -10232 -16235 -12643 26364 52197 59949 57153 58667 53429 20409 2612 8 -3304 27771
20710 27771 45263 31991 33369 41230 53857 58529 41946 63485 88615 65354 63408 49276
20698 49276 46027 52168 40346 29271 19673 21615 18875 43514 33375 26287 37081 29819 29956
$$ packed form
20786b5476k663j7294k4201M5967K0186J8730K0864m658o233k304J3011j7970
20774A7959l8449j6035M049K340J0426L0539J6417L007M131l851o617O697n538
20761B5075o776K835j1719P806M058J30O373k6060J2382J1187J8076j624P168
20748D8911J3262p272n079k463j2337l0122j8285J6247J4389J8250L3368k8035
20736D0834k2372M489K616j1017J5955j2878L886K0560j0498q336k499m235k6737
20723a0232o003L592L9007K5833P752k796J514n238l3020j7797k604l312L1075
20710B7771J7492j3272J378P861J2627M672j6583K1539K5130k3261j946j4132
20698D9276l249O141j1822j1075r598J942k740K4639j0139p088J0794p262J37
$$ plain form
20685 29956 17146 18630 37315 46307 49063 41176 48656 59947 59287 76436 64825 40585 61575
20672 61575 87004 106374 105670 92455 77450 72682 57965 61538 74833 75153 72595 57439 63588
20659 63588 59298 40133 54666 103266 106036 129009 133359 102874 62659 53177 49022 31760 21557
20646 21557 41446 85127 122052 142013 138374 125053 119809 130590 126395 118100 139314 173470
20634 173470 160603 124614 106703 112074 108280 121123 140576 132322 125411 117468 137455 142196 134909
20621 134909 130307 150847 160014 188617 174647 167570 179384 194066 190068 200634 204610 188979
20609 188979 197621 249498 318316 366600 425240 480238 564542 713220 1013638 1434980 1870882
20598 1870882 2161064 2158610 1922805 1608587 1466181 1565481 1907730 2507636 3457213 4921160
$$ packed form
20685B9956j2810J484J8685Q992K756p887P480J1291o60J7149j1611k4240K0990
20672F1575K5429J9370p04j3215j5005m768j4717L573J3295L20k558j5156O149
20659F3588m290j9165J4533M8600K770K2973M350l0485m0215r482m155j7262j0203
20646B1557J9889M3681L6925J9961l639j3321n244J0781m195q295K1214L4156
20634A73470j2867l5989j7911N371l794J2843J9453q254o911p943J9987M741p287
20621A34909m602K0540R167K8603j3970p077J1814J4682l998J0566L976j5631
20609A88979Q642N1877O8818M8284N8640N4998Q4304J48678L00418M21342M35902
20598A870882K90182k454k35805l14218j42406R9300L42249N99906R49577J463947
$$ plain form
20588 4921160 7215902 9223833 7957231 4959025 3073284 2131540 1596384 1224094 973057
20579 973057 821092 741104 726482 757698 798421 832029 809542 763499 762297 838965 964234
20568 964234 1089758 1147879 1098325 1039682 1074106 1182572 1480746 1923100 2271284 2337235
20558 2337235 2154487 1818596 1640835 1722459 2160522 2991670 4404730 6716429 8835445
20549 8835445 7740805 4720317 2730487 1711245 1175086 850114 630850 493777 395799
20540 395799 336805 327210 323325 283406 246338 198520 201538 218244 187729 180076 194979 212158
20528 212158 180990 176545 162234 142934 150769 152235 152265 122843 116817 119483 118409 148572 153897
20515 153897 141627 130528 104032 87287 89343 78617 68149 73803 85019 88318 113222 123209
$$ packed form
20588D921160K294742K007931j266602k998206j885741r41744n35156l72290k51037
20579I73057j51965p9988j4622L1216M0723L3608k2487m6043j202P6668J25269
20568I64234J25524N8121m9554n8643L4424J08466K98174M42354L48184O5951
20558B337235j82748l35891j77761Q1624M38063Q31148J413060K311699K119016
20549H835445j094640l020488j989830j019242n36159l24972k19264j37073r7978
20540C95799n8994r595l885l9919l7068m7818L018J6706l0515p653J4903J7179
20528B12158l1168m445j4311j9300P835J466L0k9422o026K666j074L0163N325
20515A53897j2270j1099k6496j6745K056j0726j0468N654J1216L299K4904R987
$$ plain form
20503 123209 122911 119354 100673 107850 119246 113214 78513 75307 72050 87928 90323 70102 109055
20490 109055 129013 125020 104576 74810 90039 112038 96555 81734 74924 89635 120955 143980
20478 143980 139427 127487 155802 166272 182225 184633 151281 133626 132971 122461 114405 96218
20466 96218 133778 134627 110505 79795 102515 91815 87425 106575 128919 109708 91694 107682
20454 107682 90003 68190 71527 106318 147086 145144 137549 151724 140361 115014 102115 107549
20442 107549 112697 132079 180925 189272 209201 275353 356134 468851 497741 407674 276315
20431 276315 185867 162836 179450 205629 234482 303439 394186 484200 483072 386187 278371
20420 278371 189029 143418 141816 123098 114750 99689 110073 121791 110273 92659 63610 64296
$$ packed form
20503A23209k98l557j8681P177J1396o032l4701l206l257J5878K395k0221L8953
20490A09055J9958l993k0444k9766J5229K1999j5483j4821o810J4711L1320K3025
20478A43980m553j1940K8315J0470J5953K408l3352j7655o55j0510q056j8187
20466I6218L7560Q49k4122l0710K2720j0700m390J9150K2344j9211j8014J5988
20454A07682j7679k1813L337L4791M0768j942p595J4175j1363k5347j2899N434
20442A07549N148J9382M8846Q347J9929O6152Q0781J12717K8890r0067j31359
20431B76315r0448k3031J6614K6179K8853O8957R0747R0014j128r6885j07816
20420B78371q9342m5611j602j8718q348j5061J0384J1718j1518j7614k9049O86
$$ plain form
20408 64296 97836 81164 77107 89182 96540 90296 90096 104767 132769 124765 99619 90615 92054
20395 92054 107663 99945 111022 110658 94471 109189 136295 139682 156575 191288 199642 219608 267939
20382 267939 382027 585414 819579 1100785 1359568 1475415 1366338 1035950 741582 567060
20372 567060 493532 492584 497283 545204 616159 648601 637197 614815 570613 544542 607490 740410
20360 740410 769876 610571 419535 315733 279700 293004 318359 344375 436218 547415 631084
20349 631084 637002 587546 493335 397871 363932 358872 417825 551389 734672 907139 1029863
20338 1029863 1020809 838623 574358 385313 281373 208720 147599 110691 106011 91336 86851
20327 86851 84273 86154 75130 107097 121238 136092 120472 98649 79863 69929 53317 44015
$$ packed form
20408F4296L3540j6672m057J2075P358o244k00J4671K8002q004k5146r004J439
20395I2054J5609p718J1077l64j6187J4718K7106L387J6893L4713Q354J9966M8331
20382B67939J14088K03387K34165K81206K58783J15847j09077l30388k94368j74522
20372E67060p3528r48M699M7921P0955L2442j1404k2382m4202k6071O2948J32920
20360G40410K9466j59305j91036j03802l6033J3304K5355K6016R1843J11197Q3669
20349F31084N918m9456r4211r5464l3939n060N8953J33564J83283J72467J22724
20338A029863r054j82186k64265j89045j03940p2653o1121l6908m680j4675m485
20327H6851k578J881j1024L1967J4141J4854j5620k1823j8786r934j6612r302
$$ plain form
20315 44015 64918 95829 106445 120485 107512 119021 127295 132613 133057 155338 163078 177251 157016
20302 157016 173249 179549 191547 228394 233821 226423 200375 176999 172572 207790 205806 195909 232203
20289 232203 244455 251462 278105 293616 302839 283504 257780 261910 231891 224248 257234 260931
20277 260931 273296 241380 220792 211711 217934 247820 254257 269511 276724 274076 280834 293272 302415
20264 302415 292747 287128 288568 302816 331277 353145 361279 336312 332617 314857 267915 231997
20252 231997 247030 280064 329128 356819 346364 314871 306872 312784 302363 283580 285490 283691
20240 283691 304829 302553 243716 198732 177350 163640 178678 209897 206186 216033 237519 249851
20228 249851 261196 275540 296569 318234 336818 359092 371202 367333 369383 343602 364717 375413
$$ packed form
20315D4015K0903L0911J0616J4040j2973J1509Q274N318M44K2281P740J4173k0235
20302A57016J6233O300J1998L6847N427p398k6048k3376m427L5218j984r897L6294
20289B32203J2252P007K6643J5511R223j9335k5724M130l0019p643L2986L697
20277B60931J2365l1916k0588r081O223K9886O437J5254P213k648O758J2438R143
20264C02415r668n619J440J4248K8461K1868Q134k4967l695j7760m6942l5918
20252B31997J5033L3034M9064K7691j0455l1493p999N912j0421j8783J910j799
20240B83691K1138k276n8837m4984k1382j3710J5038L1219l711R847K1486J2332
20228B49851J1345J4344K1029K1665J8584K2274J2110l869K050k5781K1115J0696
$$ plain form
20216 375413 365070 387380 425221 424472 437801 426942 401483 367424 341698 378993 434887 466592
20204 466592 478393 485882 510947 547498 600439 581116 523446 509130 486003 514125 547488 546533
20192 546533 537414 560938 602368 627781 626874 592667 564960 550224 518024 501905 487983 496944
20180 496944 512199 528026 529990 559164 566115 561096 584841 611294 687272 786178 837780 847538
20168 847538 867207 881108 908709 953074 989871 998130 999873 996134 964277 875842 825397 782681
20156 782681 735076 744074 732706 720243 730151 713754 711730 695949 674839 668440 653610 663216
20144 663216 726686 734099 734259 721054 708622 727174 765914 833460 908617 974693 1035335 1032656
20132 1032656 1020709 1082063 1132754 1161874 1124046 1097029 1079604 1064462 1019730 987374 974941
$$ packed form
20216C75413j0343K2310L7841p49J3329j0859k5459l4059k5726L7295N5894L1705
20204D66592J1801P489K5065L6551N2941j9323n7670j4316k3127K8122L3363r55
20192E46533r119K3524M1430K5413r07l4207k7707j4736l2200j6119j3922Q961
20180D96944J5255J5827J964K9174O951n019K3745K6453P5978R8906N1602R758
20168H47538J9669J3901K7601M4365L6797Q259J743l739l1857q8435n0445m2716
20156G82681m7605Q998j1368j2463R908j6397k024j5781k1110o399j4830R606
20144F63216O3470P413J60j3205j2432J8552L8740O7546P5157O6076O0642k679
20132A032656j1947O1354N0691K9120l7828k7017j7425j5142m4732l2356j2433
$$ plain form
20121 974941 970714 992130 1022676 1055798 1069643 1089024 1086035 1099643 1105710 1141319 1149524 1185967
20109 1185967 1228500 1252907 1255434 1283718 1327100 1385289 1443995 1470286 1498907 1509496 1555292
20098 1555292 1605019 1639969 1645597 1727521 1873384 2047167 2170453 2310524 2476491 2696285
20088 2696285 3008631 3555045 4349703 5475517 6969562 8621897 9824057 9866914 8903064
20079 8903064 7392434 6226978 5734526 5850403 6428683 7452503 8729280 9748867 10000501
20070 10000501 9417881 8348264 7361942 6830586 6776535 7099732 7646130 8201400 8625168
20061 8625168 9063260 9714977 10704038 11765255 12563435 13249554 13955302 14733288 15341157
20052 15341157 15746708 16263822 17492135 19690491 22943870 27414979 33656343 42712272
$$ packed form
20121I74941m227K1416L0546L3122J3845J9381k989J3608O067L5609Q205L6443
20109A185967M2533K4407K527K8284M3382N8189N8706K6291K8621J0589M5796
20098A555292M9727L4950N628Q1924J45863J73783J23286J40071J65967K19794
20088B696285L12346N46414P94658J125814J494045J652335J202160M2857r63850
20079H903064j510630j165456m92452J15877N78280J023820J276777J019587K51634
20070A0000501n82620j069617r86322n31356n4051L23197N46398N55270M23768
20061H625168M38092O51717R89061J061217P98180O86119P05748P77986O07869
20052A5341157M05551N17114J228313K198356L253379M471109O241364R055929
$$ plain form
20044 42712272 55612699 73729927 99992848 138593962 190985977 253070465 316190597
20037 316190597 350002418 334084434 277917238 202460274 147028933 119307822 111705472
20030 111705472 119812096 142822812 178176442 209598917 214741773 189895002 144347217
20023 144347217 101646594 73771377 57416516 48098481 43030262 40785286 40713253 42748116
20015 42748116 47541240 56378201 71421892 95634972 131993672 177796655 213614004
20008 213614004 219846809 196316685 156480323 126388329 115365991 121815156 146207090
20001 146207090 192471950 261935502 331530953 362071769 344429551 281912025 208880690
19994 208880690 148510289 102421507 71706671 52419422 40127817 32137732 26704474
$$ packed form
20044D2712272J2900427J8117228K6262921L8601114N2392015O2084488O3120132
20037C16190597L3811821j5917984n6167196p5456964n5431341k7721111p602350
20030A11705472Q106624K3010716L5353630L1422475N142856k4846771m5547785
20023A44347217m2700623k7875217j6354861r318035n068219k244976p2033K034863
20015D2748116M793124Q836961J5043691K4213080L6358700M5802983L5817349
20008B13614004O232805k3530124l9836362l0091994j1022338O449165K4391934
20001A46207090M6264860O9463552O9595451L0540816j7642218o2517526p3031335
19994B08880690o0370401m6088782l0714836j9287249j2291605p990085n433258
$$ plain form
19987 26704474 22770862 19763944 17389068 15585875 14254193 13217236 12391292 11816734
19979 11816734 11525416 11437929 11334363 11083659 10553433 9909008 9341557 9022934 8948113 8894390
19969 8894390 8652613 8171646 7656253 7272037 7238778 7507375 7963128 8345374 8419903 8322856
19959 8322856 8186923 8154895 8157467 8060480 7876387 7479487 7000071 6585104 6222179 5917820
19949 5917820 5655150 5518650 5534449 5591212 5572869 5429165 5216889 5001619 4795443 4674978
19939 4674978 4547003 4434493 4359348 4356643 4501428 4837556 5384549 6249895 7517563 9145589
19929 9145589 10953145 12424825 12936327 12387413 11168406 10021126 9201132 8676494 8565538
19920 8565538 8965491 9881082 10874099 11437868 11262554 10421004 9348804 8256125 7256757
$$ packed form
19987B6704474l933612l006918k374876j803193j331682j036957q25944n74558
19979A1816734k91318q7487j03566k50704n30226o44425n67451l18623p4821n3723
19969H894390k41777m80967n15393l84216l3259K68597M55753L82246P4529r7047
19959H322856j35933l2028K572r6987j84093l96900m79416m14967l62925l04359
19949E917820k62670j36500J5799N6763j8343j43704k12276k15270k06176j20465
19939D674978j27975j12510p5145k705J44785L36128N46993Q65346J267668J628026
19929I145589J807556J471680N11502n48914j219007j147280q19994n24638j10956
19920H565538L99953R15591R93017N63769j75314q41550j072200j092679r99368
$$ plain form
19911 7256757 6431243 5761774 5277285 4935975 4766231 4779608 4921710 5256184 5847431 6743913
19901 6743913 7913043 9022317 9514143 9236162 8417563 7489795 6813807 6513368 6649488
19892 6649488 7285930 8506489 10024462 11017762 11044293 10084738 8647080 7212378 5916381
19883 5916381 4834795 4017894 3452693 3070648 2836567 2683714 2604241 2564560 2578984 2649971
19873 2649971 2777764 2947821 3040171 3019784 2901950 2772970 2671078 2582003 2596554 2736414
19863 2736414 2987564 3281162 3509000 3493965 3266762 2938701 2592655 2281036 2081789 1988337
19853 1988337 1794889 1485156 1226169 1067923 941069 864637 828529 836425 921893 1047085
19843 1047085 1099297 1008372 883630 775887 686061 625972 619756 598279 573152 584175 589480
$$ packed form
19911G256757q25514o69469m84489l41310j69744J3377J42102L34474N91247Q96482
19901F743913J169130J109274M91826k77981q18599r27768o75988l00439J36120
19892F649488O36442J220559J517973R93300K6531r59555j437658j434702j295997
19883E916381j081586q16901n65201l82045k34081j52853p9473l9681J4424P0987
19873B649971J27793J70057R2350k0387j17834j28980j01892q9075J4551J39860
19863B736414K51150K93598K27838j5035k27203l28061l46046l11619j99247r3452
19853A988337j93448l09733k58987j58246j26854p6432l6108P896Q5468J25192
19843A047085N2212r0925j24742j07743q9826o0089o216k1477k5127J1023N305
$$ plain form
19832 589480 595630 639847 680966 710034 748693 812770 856779 865633 787825 656939 552053
19821 552053 476833 465757 489730 576472 691398 870151 1041025 1009753 834241 695222
19811 695222 572062 475019 401717 382957 376520 331920 280296 275966 330783 337842 325450 312387
19799 312387 335844 348031 318827 283563 257014 222542 203753 224778 222991 219973 235708 264997
19787 264997 280125 271700 251916 273349 300476 279301 261862 258591 232840 206279 193759 189454
19775 189454 180391 189132 211568 206876 198123 203512 207875 197406 213190 238083 243162 230284 217713
19762 217713 213303 170870 196495 215158 206165 174953 174699 176609 182182 178578 161763 160517 162395
19749 162395 174362 187595 184031 178900 185907 177708 156552 151823 143421 143004 160948 169819 174808
$$ packed form
19832E89480O150M4217M1119K9068L8659O4077M4009Q854p7808j30886j04886
19821E52053p5220j1076K3973Q6742J14926J78753J70874l1272j75512j39019
19811F95222j23160r7043p3302j8760o437m4600n1624m330N4817P059j2392j3063
19799C12387K3457J2187k9204l5264k6549l4472j8789K1025j787l018J5735K9289
19787B64997J5128q425j9784K1433K7127k1175j7439l271k5751k6561j2520m305
19775A89454r063Q741K2436m692q753N389M363j0469J5784K4893N079j2878j2571
19762B17713m410m2433K5625J8663q993l1212k54J910N573l604j6815j246J878
19749A62395J1967J3233l564n131P007q199k1156m729q402m17J7944Q871M989
$$ plain form
19736 174808 169547 159899 197779 227432 240477 243938 224556 212107 220717 231540 221919 193558
19724 193558 215563 241561 236464 243488 217432 166310 143862 134359 119152 114417 123625 124817 122224
19711 122224 120536 114187 96781 94641 107184 109346 130351 168394 198770 186148 141389 132407
19699 132407 116779 114288 123493 131472 149386 170277 179641 214435 220962 203529 200246 174241 146323
19686 146323 121963 118587 105518 114735 110191 70946 46111 46952 69346 85067 67756 41869
19674 41869 28930 24334 10936 13731 15272 38380 54176 73108 79767 55860 42923 45937 31979
19661 31979 33683 28754 41048 39440 29900 10631 23587 44589 78615 53739 39326 50932
19649 50932 50394 52986 53347 25553 26350 38433 34930 19770 3383 14457 11612 33131 54066
$$ packed form
19736A74808n261r648L7880K9653J3045L461j9382j2449Q610J0823r621k8361
19724A93558K2005K5998n097P024k6056n1122k2448r503j5207m735R208J192k593
19711A22224j688o349j7406k140J2543K162K1005L8043L0376j2622m4759q982
19699A32407j5628k491R205P979J7914K0891R364L4794O527j7433l283k6005k7918
19686A46323k4360l376j3069R217m544l9245k4835Q41K2394J5721j7311k5887
19674D1869j2939m596j3398K795J541K3108J5796J8932O659k3907j2937L014j3958
19661C1979J704m929J2294j608r540j9269J2956K1002L4026k4876j4413J1606
19649E0932n38K592L61k7794P97J2083l503j5160j6387J1074k845K1519K0935
$$ plain form
19636 54066 19388 9452 12332 764 18364 10657 12294 21572 13249 -12163 -5064 31395 40979
19623 40979 31700 34211 8542 -14636 -9182 2976 10887 22525 21287 36953 19973 25485 17251
19610 17251 -1005 20383 14010 32496 39656 31073 35479 66907 68405 40284 -6014 -19264 -10703
19597 -10703 -6982 -14935 6092 17185 15350 4586 9683 1749 5924 6559 -16284 -52045 -50596
19584 -50596 -26090 -14075 1256 14978 15306 25312 16239 47678 50519 19619 32129 37910 24896
19571 24896 19179 9222 940 -7177 4227 -27010 -43242 -28783 13789 30414 14100 -2621
19559 -2621 -19525 -29662 -23398 -27639 -19307 -14061 6267 6075 25291 5638 -30233 -16946 14787
19546 14787 19999 4149 -21010 -32972 -17500 -4838 5453 -11700 -9390 -22974 -43402 -29421
$$ packed form
19636E4066l4678r936K880j1568J7600p707J637R278q323k5412P099L6459R584
19623D0979r279K511k5669k3178N454J2158P911J1638j238J5666j6980N512q234
19610A7251j8256K1388o373J8486P160q583M406L1428J498k8121m6298j3250Q561
19597a0703L721p953K1027J1093j835j0764N097p934M175O35k2843l5761J449
19584e0596K4506J2015J5331J3722L28J0006r073L1439K841l0900J2510N781j3014
19571B4896n717r957q282q117J1404l1237j6232J4459M2572J6625j6314j6721
19559b621j6904j0137O264m241Q332N246K0328j92J9216j9653l5871J3287L1733
19546A4787N212j5850k5159j1962J5472J2662J0291j7153K310j3584k0428J3981
$$ plain form
19534 -29421 -7346 -7188 -10712 -10639 -36624 -56117 -68873 -64865 -25181 8408 4600 6549 2644 3351
19520 3351 17867 32379 23892 20209 28734 30804 32776 60122 74510 72466 52286 43799 39567
19507 39567 52536 23263 13334 16931 18630 13021 -297 3382 -209 -2434 16929 24242 22545
19494 22545 20421 35766 17998 21046 62728 77771 108487 78607 60230 86597 116498 97015
19482 97015 110778 129210 149975 195697 221993 242091 262804 328759 420384 514380 682843
19471 682843 980817 1379887 1798488 2033915 1930620 1531951 1144517 953784 904969 941983
19461 941983 931534 818259 663016 498818 377413 345287 317341 338850 397847 507628
19451 507628 603198 682211 689627 660648 586633 524857 426565 359218 334352 368123 428602 543075
$$ packed form
19534b9421K2075J58l524P3k5985j9493j2756M008L9684L3589l808J949l905P07
19520C351J4516J4512q487l683Q525K070J972K7346J4388k044k0180q487m232
19507C9567J2969k9273r929L597J699n609j3318L679l591k225J9363P313j697
19494B2545k124J5345j7768L048M1682J5043L0716k9880j8377K6367K9901j9483
19482I7015J3763J8432K0765M5722K6296K0098K0713O5955R1625R3996J68463
19471F82843K97974L99070M18601K35427j03295l98669l87434j90733m8815L7014
19461I41983j0449j13275j55243j64198j21405l2126k7946K1509N8997J09781
19451E07628R5570P9013P416k8979p4015o1776r8292o7347k4866L3771O0479J14473
$$ plain form
19439 543075 681405 851449 973140 1004263 1002204 1018698 1176194 1508106 1899509 2105565
19429 2105565 1972213 1566498 1082523 724731 482505 327238 232056 176652 135831 121287
19419 121287 129564 124107 102008 85471 83637 83317 76559 60367 27233 24101 18549 30917 48320
19406 48320 51085 59827 41125 35194 21865 12122 5461 -88 10747 24544 5825 -11622 7638
19393 7638 8441 20484 50892 29232 -8361 7724 24296 12638 -3842 -33299 -54145 -15051
19381 -15051 -3595 13836 24638 9693 -634 -21484 -9755 14526 9856 -22626 -13573 5483
19369 5483 22620 37396 37309 8054 26631 42033 25738 12283 20263 56961 74604 93943 86885
19356 86885 75784 81752 79865 55779 48214 62197 80964 89025 90774 95310 102316 59189 29641
$$ packed form
19439E43075J38330J70044J21691L1123k059J6494J57496L31912L91403K06056
19429B105565j33352m05715m83975l57792k42226j55267r5182n5404m0821j4544
19419A21287Q277n457k2099j6537j834l20o758j6192l3134l132n552J2368J7403
19406D8320K765Q742j8702n931j3329r743o661n549J0835J3797j8719j7447J9260
19393G638Q03J2043L0408k1660l7593J6085J6572j1658j6480k9457k0846L9094
19381a5051J1456J7431J0802j4945j0327k0850J1729K4281m670l2482R053J9056
19369E483J7137J4776q7k9255J8577J5402j6295j3455P980L6698J7643J9339p058
19356H6885j1101N968j887k4086p565J3983J8767Q061J749M536P006m3127k9548
$$ plain form
19343 29641 9168 -2117 10722 21195 24653 45012 81988 99300 76850 54150 67816 66590
19331 66590 67052 69684 77808 98739 93529 104597 102203 112419 112635 87960 61156 60020 32497
19318 32497 19213 22049 35207 29620 9243 15118 12192 -4892 -9772 -20401 -22862 -8975 2357
19305 2357 -14628 -25797 -41909 -14219 19791 10064 -1316 -10924 15630 25780 18765 -6771
19293 -6771 -20989 2579 31544 17623 11614 2696 21243 21819 24457 26793 18252 -21787 -32640
19280 -32640 -10721 -15612 -2624 2105 4751 41923 85978 111724 120098 101504 78631 65888
19268 65888 75478 53346 22192 -5137 -8885 -11855 -25416 -48577 -31361 -29486 -14390 -15497 -17953
19255 -17953 12041 20241 24963 6202 -12385 -13061 -11425 -34376 -54409 -47678 -55448 -49528 -31559
$$ packed form
19343B9641k0473j1285J2839J0473L458K0359L6976J7312k2450k2700J3666j226
19331F6590M62K632Q124K0931n210J1068k394J0216K16k4675k6804j136k7523
19318C2497j3284K836J3158n587k0377N875k926j7084m880j0629k461J3887J1332
19305B357j6985j1169j6112K7690L4010r727j1380r608K6554J0150p015k5536
19293f771j4218K3568K8965j3921o009q918J8547N76K638K336q541m0039j0853
19280c2640K1919m891J2988M729K646L7172M4055K5746Q374j8594k2873j2743
19268F5888R590k2132l1154k7329l748k970j3561k3161J7216J875J5096j107k456
19255a7953K9994Q200M722j8761j8587o76J636k2951k0033O731p770N920J7969
$$ plain form
19242 -31559 -38888 -45458 -33521 -3414 -1107 -28014 -30740 -4065 -6064 -36866 -61179 -27089 -40574
19229 -40574 -46499 -39175 -15577 -8933 -8473 -2012 -43886 -44869 3132 33 -3716 4763 -11078 -30971
19215 -30971 -15831 -14532 -23032 -17755 -11933 12020 -16376 -33326 -38145 -20579 8764 27413 13409
19202 13409 -26072 -78661 -86278 -75330 -97104 -84729 -68231 -28145 -15275 -16843 -28141 -35334
19190 -35334 -38325 -54012 -78052 -46049 -23126 -4434 11010 13830 -13080 -40077 -47337 -31325
19178 -31325 -12768 12351 5658 3021 8587 -42258 -75351 -61128 -18874 7552 19719 3242
19166 3242 -42936 -58610 -71743 -64716 -59865 -41598 -31435 -24998 -23124 -18727 -8937 2566 -3520
19153 -3520 -9791 -14329 -21493 -23538 -269 6966 1659 -21502 -42483 -91399 -124855 -110538 -103230
$$ packed form
19242c1559p329o570J1937L0107K307k6907k726K6675j999l0802k4313L4090j3485
19229d0574n925P324K3598O644M60O461m1874r83M8001l099l749Q479j5841j9893
19215c0971J5140J299q500N277N822K3953k8396j6950m819J7566K9343J8649j4004
19202A3409l9481n2589p617J0948k1774J2375J6498M0086J2870j568j1298p193
19190c5334k991j5687k4040L2003K2923J8692J5444K820k6910k6997p260J6012
19178c1325J8557K5119o693k637N566n0845l3093J4223M2254K6426J2167j6477
19166C242m6178j5674j3133P027M851J8267J0163O437J874M397R790J1503o086
19153c520o271m538p164k045K3269P235n307k3161k0981m8916l3456J4317P308
$$ plain form
19140 -103230 -79151 -72053 -67875 -41781 -53336 -51479 -26126 -11738 -5910 -19514 -40618 -34709
19128 -34709 -35495 -24178 -11372 -8040 -23570 -46849 -50591 -37574 -20406 -16556 -17521 -18063 3913
19115 3913 1305 -16632 -16260 -24268 -16973 8508 28621 27750 -1060 -1585 -3602 -30747 -55082 -50523
19101 -50523 -46792 -24048 6366 15315 2852 -36163 -22746 -22615 -27503 -21611 -32373 -28175 -32244
19088 -32244 -22206 -25955 -50286 -60123 -53108 -42680 -41792 -51774 -37367 -21282 -349 -722 -43902
19075 -43902 -48189 -23094 -36808 -25943 9206 11472 4277 32668 23653 -16533 -35844 -39791 -76575
19062 -76575 -57837 -66903 -45177 -26415 -36499 -34470 -71131 -89024 -73722 -28976 -35527 -44589
19050 -44589 -74435 -77723 -86933 -81490 -67152 -69742 -61620 -52311 -63015 -52311 -30729 -18991 -19888
$$ packed form
19140a03230K4079P098M178K6094j1555J857K5353J4388N828j3604k1104N909
19128c4709p86J1317J2806L332j5530k3279l742J3017J7168L850r65n42K1976
19115C913k608j7937L72q008P295K5481K0113q71k8810n25k017k7145k4335M559
19101e0523L731K2744L0414Q949j2463l9015J3417J31m888N892j0762M198m069
19088c2244J0038l749k4331r837P015J0428Q88r982J4407J6085K0933l73m3180
19075d3902m287K5095j3714J0865L5149K266p195K8391r015m0186j9311l947l6784
19062g6575J8738r066K1726J8762j0084K029l6661j7893J5302M4746o551r062
19050d4589k9846l288r210N443J4338k590Q122R309j0704J0704K1582J1738q97
$$ plain form
19037 -19888 -29829 -40448 -46592 -32571 -29920 -44038 -39096 -18178 8635 -24690 -66513 -49918
19025 -49918 -52984 -49469 -31257 -51939 -67028 -55194 -36742 -39897 -46855 -29281 -23775 -27088 -26400
19012 -26400 -39022 -43901 -52191 -75147 -78325 -52163 -49805 -73874 -44390 -50147 -36616 -27015 -46909
18999 -46909 -54352 -43072 -39506 -15582 -5248 -27560 -57594 -53601 -31609 -25142 -41844 -45243 -53189
18986 -53189 -66261 -31340 -21154 -1663 -2071 -16891 -27002 -34198 -25199 -29793 -30417 -31059 -43165
18973 -43165 -23983 3163 15251 -5470 -27120 -24447 -31207 -30417 -3812 17688 14533 -17045 -45973
18960 -45973 -49350 -15791 28450 49996 70640 70473 37730 -18425 -47815 -57888 -67112 -73441 -71258
18947 -71258 -45223 -21260 -22757 -12698 -25360 -26689 -31430 -25452 5595 39063 32792 23963 27367
$$ packed form
19037a9888r941j0619o144J4021K651j4118M942K0918K6813l3325m1823J6595
19025d9918l066L515J8212k0682j5089J1834J8452l155o958J7574N506l313O88
19012b6400j2622m879q290k2956l178K6162K358k4069K9484n757J3531R601j9894
18999d6909p443J1280L566K3924J0334k2312l0034L993K1992O467j6702l399p946
18986e3189j3072L4921J0186J9491m08j4820j0111p196Q999m594o24o42j2106
18973d3165J9182K7146J2088k0721k1650K673o760P90K6605K1500l155l1578k8928
18960d5973l377L3559M4241K1546K0644j67l2743n6155k9390j0073r224o329K183
18947g1258K6035K3963j497J0059j2662j329m741N978L1047L3468o271q829L404
$$ plain form
18934 27367 20746 997 -27747 -9349 8883 18507 33876 30157 23857 18707 -124 -9571 -22366
18921 -22366 -11300 10335 5016 -12855 -28673 -38506 -26997 -30287 -49887 -70686 -58348 -35253
18909 -35253 -24847 -14749 -40923 -72742 -56750 -47707 -35519 -25925 -40114 -33524 -27580 -47394
18897 -47394 -39102 -20927 -20223 -43445 -19006 -14177 4896 21166 46510 46401 43718 12256 9761
18884 9761 9370 18262 45828 42928 41399 43689 21027 -10334 -14528 -6146 -4351 -26757 -51726 -42768
18870 -42768 -42358 -41994 -30295 -40806 -34719 -42986 -35189 -50413 -53633 -71723 -52462 -24118 -36626
18857 -36626 -33987 -19803 -19316 -24904 -27781 -13349 -23576 -27982 -35256 -48244 -67003 -48117 -41511
18844 -41511 -39409 -51462 -16608 -37167 -69718 -68194 -35770 -7061 -17106 -18083 8742 20504
$$ packed form
18934B7367o621j9749k8744J8398J8232R624J5369l719o300n150j8831r447j2795
18921b2366J1066K1635n319j7871j5818r833J1509l290j9600k0799J2338K3095
18909c5253J0406J0098k6174l1819J5992R043J2188R594j4189O590N944j9814
18897d7394Q292J8175P04k3222K4439M829J9073J6270K5344j09k683l1462k495
18884I761l91Q892K7566k900j529K290k2662l1361m194Q382J795k2406k4969Q958
18870d2768M10L64J1699j0511O087q267P797j5224l220j8090J9261K8344j2508
18857c6626K639J4184M87n588k877J4432j0227m406p274j2988j8759J8886O606
18844d1511K102j2053L4854k0559l2551J524L2424K8709j0045r77K6825J1762
$$ plain form
18832 20504 -3894 -19363 -19157 -556 19960 35808 16136 4644 23508 51986 50511 6481
18820 6481 2567 12723 13455 36755 10154 -27630 -50960 -25033 12254 9798 20517 37939 24822
18807 24822 -33460 -70894 -43612 12602 10886 4592 18249 44722 25356 16053 -9415 -4133
18795 -4133 -4637 -14262 6772 4610 7501 32352 34315 5422 5157 9671 -17410 -39937 -50699 -35877
18781 -35877 -24418 -8501 20732 27318 20848 26262 28475 30369 30994 37770 71289 77915 99287
18768 99287 163891 299657 344715 208634 71093 48324 48936 47974 59675 44681 4785 -32793
18756 -32793 -54067 -31801 -22759 6398 25473 22098 31295 50223 26811 -2377 -16952 -13708
18744 -13708 -35340 -51885 -30674 -41396 -42919 -22089 -1239 5493 -17943 -11612 5213 13084
$$ packed form
18832B0504k4398j5469K06J8601K0516J5848j9672j1492J8864K8478j475m4030
18820F481l914J0156P32K3300k6601l7784k3330K5927L7287k456J0719J7422j3117
18807B4822n8282l7434K7282N6214j716o294J3657K6473j9366r303k5468N282
18795d133n04r625K1034k162K891K4851J963k8893k65M514k7081k2527j0762J4822
18781c5877J1459J5917K9233O586o470N414K213J894O25O776L3519O626K1372
18768I9287O4604J35766M5058j36081j37541k2769O12r62J1701j4994l9896l7578
18756c2793k1274K2266R042K9157J9075l375R197J8928k3412k9188j4575L244
18744a3708k1632j6545K1211j0722j523K0830K0850O732k3436O331J6825P871
$$ plain form
18732 13084 -19776 -17732 -37394 -39241 -20269 16778 48094 31777 28762 16959 27400 24087
18720 24087 9819 -5087 -32259 -51523 -52340 -49778 -32384 -21736 -21609 -32756 -27698 -19889 8838
18707 8838 14772 12755 3142 2707 -8677 -39188 -19417 9416 34897 29487 8342 12039 11701 22697
18693 22697 35371 36800 -1117 -20182 -29869 -35971 -19400 -1011 609 21229 31952 -3043
18681 -3043 -23960 11310 18443 -4883 -23445 -19300 -5007 -2845 -1309 -414 -14172 -12286 -43522
18668 -43522 -46548 15822 19540 -2259 -16644 -20470 -5503 -1358 -26270 -35386 -21393 -9358 17982
18655 17982 -8178 -30489 -43210 -56828 -92866 -88875 -53120 -49100 -44032 -56804 -52191 -17671
18643 -17671 -12333 -5262 -4676 -16360 -17143 -9549 -20941 -50924 -60370 -57294 -52255 -33083 -57511 -68915
$$ packed form
18732A3084l2860K044j9662j847J8972L7047L1316j6317l015j1803J0441l313
18720B4087j4268j4906k7172j9264q17K562J7394J0648J27j1147N058P809K8727
18707H838N934k017r613m35j1384l0511J9771K8833K5481n410k1145L697l38J0996
18693B2697J2674J429l7917j9065r687o102J6571J8389J620K0620J0723l4995
18681c043k0917L5270P133k3326j8562M145J4293K162J536Q95j3758J886l1236
18668d3522l026O2370L718k1799j4385l826J4967M145k4912r116J3993J2035K7340
18655A7982k6160k2311j2721j3618l6038L991L5755M020N068j2772M613L4520
18643a7671N338P071N86j1684p83P594j1392k9983r446L076N039J9172k4428j1404
$$ plain form
18629 -68915 -61986 -35771 -27691 -19068 -12365 -19150 -28203 -20777 -9959 -11683 -2622 10148 1044 -7408
18615 -7408 -9190 -13758 -28981 -22009 -6054 3429 15746 -10329 -22321 -17287 -20414 15457 28822
18602 28822 21730 32929 12924 13884 15917 223 37999 52249 42765 28474 35595 44985 26877
18589 26877 -1512 -45619 -62464 -53388 -31732 -13208 6989 22169 24472 29791 66856 81806
18577 81806 86138 65691 36024 22712 21466 5997 -10126 -28732 -28825 -1174 12938 21465 34408
18564 34408 57504 59405 23285 11848 -8904 3189 -10368 -16604 -11923 -18391 -6738 -14392 -4669
18551 -4669 28397 27677 13233 1873 1486 -1207 3996 20869 2317 -10548 -16944 -39160 -34297
18538 -34297 -27757 21622 28682 8779 11585 22496 5224 -243 -6051 19513 39600 67851 70620
$$ packed form
18629f8915O929K6215Q080Q623O703o785r053P426J0818j724R061J2770r104q452
18615g408j782m568j5223O972J5955R483J2317k6075j1992N034l127L5871J3365
18602B8822p092J1199k0005R60K033j5694L7776J4250r484j4291P121R390j8108
18589B6877k8389m4107j6845R076K1656J8524K0197J5180K303N319L7065J4950
18577H1806M332k0447k9667j3312j246j5469j6123j8606r3K7651J4112Q527J2943
18564C4408K3096J901l6120j1437k0752J2093j3557o236M681o468J1653p654R723
18551d669L3066p20j4444j1360l87k693N203J6873j8552j2865o396k2216M863
18538c4297O540M9379P060j9903K806J0911j7272n467n808K5564K0087K8251K769
$$ plain form
18525 70620 64433 57158 42145 61161 62934 53984 77253 73302 57747 59522 63763 50849 36103
18512 36103 34559 19334 28002 48439 41773 44568 27753 22873 17120 4237 -6245 -36199 -32462
18499 -32462 -13751 -2063 9061 20600 32580 46410 37843 44068 34454 1549 -11560 1667
18487 1667 22615 31891 17607 -1299 10681 7313 -149 -23919 -24539 11206 26992 42601 41902
18474 41902 40723 48373 72840 63735 33416 -3578 10800 22006 56340 66108 37112 11284
18462 11284 3935 13328 30108 35689 45443 50187 54136 36301 29347 40994 49225 75777 62177
18449 62177 41287 35269 37289 32113 41265 29653 22185 28670 28849 21169 53711 54954 61243 55586
18435 55586 37784 18742 24689 20525 14604 2709 -7788 -20831 -15050 -5735 26163 21380 11810
$$ packed form
18525G0620o187p275j5013J9016J773q950K3269l951j5555J775M241j2914j4746
18512C6103j544j5225Q668K0437o666K795j6815m880n753j2883j0482k9954L737
18499c2462J8711J1688J1124J1539J1980J3830q567O225r614l2905j3109J3227
18487A667K0948R276j4284j8906J1980l368p462k3770o20L5745J5786J5609o99
18474D1902j179P650K4467r105l0319l6994J4378J1206L4334R768k8996k5828
18462A1284p349R393J6780N581R754M744L949j7835o954J1647Q231K6552j3600
18449F2177k0890o018K020n176R152j1612p468O485J79p680L2542J243O289n657
18435E5586j7802j9042N947m164n921j1895j0497j3043N781R315L1898m783r570
$$ plain form
18422 11810 -4608 13752 16422 30940 48512 69980 88736 58794 13572 28673 33417 37112
18410 37112 56273 60892 47094 35624 45913 14837 -10086 12792 38736 62740 88251 84009
18398 84009 76458 74693 36624 18488 29571 49883 46342 42337 46537 25502 40381 68403 86229
18385 86229 112016 207164 303598 369447 466356 538385 573176 547929 512448 434167 348657 242896
18373 242896 164618 116205 55793 71962 68591 77732 67693 46354 52164 42373 51362 63809
18361 63809 85822 120491 128167 118016 108435 100875 63946 23768 28851 45535 52725 56782 45086
18348 45086 19064 21612 59001 65191 72134 82931 80411 87941 69162 60635 45099 29883 24569
18335 24569 8877 28343 51237 64882 59442 69668 103269 112703 125147 167879 203433 285988
$$ packed form
18422A1810j6418J8360K670J4518J7572K1468J8756k9942m5222J5101M744L695
18410C7112J9161M619j3798j1470J0289l1076k4923K2878K5944K4004K5511m242
18398H4009p551j765l8069j8136J1083K0312l541m005M200k1035J4879K8022J7826
18385H6229K5787R5148R6434O5849R6909P2029L4791k5247l5481p8281q5510j05761
18373B42896p8278m8413o0412J6169l371R141j0039k1339N810r791Q989J2447
18361F3809K2013L4669P676j0151r581p560l6929m0178N083J6684P190M057j1696
18348D5086k6022K548L7389O190O943J0797k520P530j8779q527j5536j5216n314
18335B4569j5692J9466K2894J3645n440J0226L3601R434J2444M2732L5554Q2555
$$ plain form
18323 285988 400840 555379 761078 924250 958357 940045 912930 795134 608896 449657
18313 449657 386681 409173 504109 599864 633947 626849 579688 519783 446324 370081 298387 240909
18301 240909 199305 196408 209954 207673 226807 289217 399879 524877 659111 755609 765530
18290 765530 767354 804456 775695 720570 735704 872967 1119994 1413304 1651430 1763183 1853834
18279 1853834 2024968 2049665 1775372 1470927 1288630 1214889 1168393 1047617 813533 595612
18269 595612 440842 354803 290613 297738 334175 359789 363013 351563 342696 288804 251612 202891
18257 202891 172488 184282 246961 294627 302013 292781 312389 309234 279213 279309 311573 422432
18245 422432 517889 671905 807081 840031 759036 626729 517956 461867 444372 504948 584243
$$ packed form
18323B85988J14852J54539K05699J63172L4107j8312k7115j17796j86238j59239
18313D49657o2976K2492R4936R5755L4083p098m7161n9905p3459p6243p1694n7478
18301B40909m1604k897J3546k281J9134O2410J10662J24998J34234R6498R921
18290G65530J824L7102k8761n5125J5134J37263K47027K93310K38126J11753R0651
18279A853834J71134K4697k74293l04445j82297p3741m6496j20776k34084k17921
18269E95612j54770q6039o4190P125L6437K5614L224j1450q867n3892l7192m8721
18257B02891l0403J1794O2679M7666P386r232J9608l155l0021R6L2264J10859
18245D22432R5457J54016J35176L2950q0995j32307j08773n6089j7495O0576P9295
$$ plain form
18234 584243 700416 792409 760309 634426 496971 368640 309530 299803 330469 346745 382514
18223 382514 389069 374304 316213 260944 235454 219388 271001 281441 273260 289737 317412 321373
18211 321373 328819 324165 315851 330991 363206 389913 412792 457813 465261 416221 396023 388557
18199 388557 395209 399834 431677 448345 441270 457635 534134 599079 694904 835943 1015681 1153806
18187 1153806 1228621 1320060 1368890 1393839 1385993 1333546 1315407 1255255 1129280 1094514 1211770
18176 1211770 1327159 1374633 1428734 1496377 1546299 1561924 1537114 1486002 1387457 1228380 1059304
18165 1059304 940057 917357 935695 967553 997827 1024720 1040004 1103368 1240307 1389917 1470352
18154 1470352 1505845 1561374 1566957 1558976 1561978 1554676 1551225 1502847 1409945 1396663 1468230 1561178
$$ packed form
18234E84243J16173R1993l2100j25883j37455j28331n9110r727L0666J6276L5769
18223C82514O555j4765n8091n5269k5490j6066N1613J0440q181J6477K7675L961
18211C21373P446m654q314J5140L2215K6707K2879M5021P448m9040k0198p466
18199C88557O652M625L1843J6668p075J6365P6499O4945R5825J41039J79738J38125
18187A153806P4815R1439M8830K4949p846n2447j8139o0152j25975l4766J17256
18176A211770J15389M7474N4101O7643M9922J5625k4810n1112r8545j59077j69076
18165A059304j19247k2700J8338L1858L0274K6893J5284O3364J36939J49610Q0435
18154A470352L5493N5529N583p981L002p302l451m8378r2902j3282P1567R2948
$$ plain form
18142 1561178 1595753 1655297 1731660 1750234 1713630 1617034 1518842 1455897 1329156 1155064 1025609
18131 1025609 991529 987222 964286 974489 994029 1007422 1022162 1057986 1160168 1288937 1399979
18120 1399979 1542161 1760780 2004677 2309444 2714974 3428343 4547568 6319242 9426053
18111 9426053 14856904 24060831 39779786 62612310 69924582 46987467 25160648 14292382
18103 14292382 9015821 6154141 4466750 3380584 2649865 2132727 1755698 1527549 1362575
18094 1362575 1274212 1189667 1085491 1034300 1030709 999850 988365 1039683 1100403 1098000 1126626
18083 1126626 1181533 1187087 1167091 1109601 1045080 967633 867620 772256 674061 583026 519786
18072 519786 503401 526512 558495 643045 761062 864976 917404 911524 923598 925165 872706
$$ packed form
18142A561178L4575N9544P6363J8574l6604r6596r8192o2945j26741j74092j29455
18131A025609l4080m307k2936J0203J9540J3393J4740L5824J02182J28769J11042
18120A399979J42182K18619K43897L04767M05530P13369J119225J771674L106811
18111I426053N430851R203927J5718955K2832524P312272k2937115k1826819j0868266
18103A4292382n276561k861680j687391j086166p30719n17138l77029k28149j64974
18094A362575q8363q4545j04176n1191l591l0859j1485N1318O0720k403K8626
18083A126626N4907N554j9996n7490o4521p7447j00013r5364r8195r1035o3240
18072E19786j6385K3111L1983Q4550J18017J03914N2428n880J2074J567n2459
$$ plain form
18061 872706 768692 628702 522895 449886 383240 361163 361790 349987 375858 385462 402535
18050 402535 418947 458566 493051 484129 500767 530966 553504 608840 698203 818193 904911
18039 904911 949895 935171 971029 963328 864206 722894 642004 602403 564417 573622 607332 671508
18027 671508 741813 829226 950512 1098034 1211748 1261536 1321972 1449619 1630129 1863440
18017 1863440 2261033 2941194 3888535 5033782 6002383 6221965 5873710 5763398 6065331
18008 6065331 6228917 5604968 4494472 3795113 3773742 4101373 4228825 3906843 3567141
17999 3567141 3595152 3767546 3533437 2815859 2075694 1600571 1364322 1265045 1239015 1324476
17989 1324476 1522295 1851701 2385250 3095852 3718967 3841116 3608293 3579957 3908435 4214725
$$ packed form
18061H72706j04014j39990j05807p3009o6646k2077O27j1803K5871R604J7073
18050D02535J6412L9619L4485q922J6638L0199K2538N5336Q9363J19990Q6718
18039I04911M4984j4724L5858p701r9122j41312q0890l9601l7986R205L3710O4176
18027F71508P0305Q7413J21286J47522J13714M9788O0436J27647J80510K33311
18017A863440L97593O80161R47341J145247R68601K19582l48255j10312L01933
18008F065331J63586o23949j110496o99359k1371L27631J27452l21982l39702
17999C567141K8011J72394k34109p17578p40165m75123k36249r9277k6030Q5461
17989A324476J97819L29406N33549P10602O23115J22149k32823k8336L28478L06290
$$ plain form
17979 4214725 4085382 3772723 3924062 4691072 5726388 6195800 5933853 5594230 5667518
17970 5667518 5921730 5542416 4457211 3247964 2282508 1654066 1270770 1023339 852369
17961 852369 732806 667990 617467 557872 501759 486790 499851 490622 473289 443388 458077
17950 458077 508385 529055 508867 475330 484376 522466 544176 526598 507200 506881 538592 558457
17938 558457 557101 520049 499595 472323 437526 404497 419632 444428 439490 433331 430290 425752
17926 425752 415315 391533 415117 411551 393750 414525 422459 461462 493601 499930 516870 518477
17914 518477 505859 528682 546752 514967 495847 496011 475212 478771 502933 524636 555507 567934
17902 567934 562236 575493 554231 521945 500756 496760 507527 515431 511820 524025 481575 473038
$$ packed form
17979D214725j29343l12659J51339P67010J035316M69412k61947l39623P3288
17970E667518K54212l79314j085205j209247r65456o28442l83296k47431j70970
17961H52369j19563o4816n0523n9595n6113j4969J3061r229j7333k9901J4689
17950D58077N0308K0670k0188l3537R046L8090K1710j7578j9398l19L1711J9865
17938E58457j356l7052k0454k7272l4797l3029J5135K4796m938o159l041m538
17926D25752j0437k3782K3584l566j7801K0775P934L9003L2139O329J6940J607
17914E18477j2618K2823J8070l1785j9120J64k0799L559K4162K1703L0871J2427
17902E67934n698J3257k1262l2286k1189l996J0767P904l611J2205m2450q537
$$ plain form
17890 473038 478913 482678 500491 475522 467026 470197 468216 480647 479133 464489 444384 421690 403980
17877 403980 419112 434235 457316 526325 565361 570379 577208 591547 600946 617523 634659 669638
17865 669638 668293 650256 597800 574444 554154 511751 490781 482882 506109 533756 532256 512080
17853 512080 487230 476845 461118 421061 408084 408371 422418 456421 502463 542476 567375 594426
17841 594426 633641 666727 674493 657667 630970 626478 641816 667663 685592 716423 745775 777655
17829 777655 786612 805645 799272 776036 750249 756102 746585 707473 673284 658376 684042 706602
17817 706602 666597 595450 589666 627269 711050 763216 752557 754202 751581 733880 750222 741417
17805 741417 724435 721270 763743 789536 822438 817381 766787 723266 692718 658794 648361 616839
$$ packed form
17890D73038N875L765J7813k4969q496L171j981J2431j514j4644k0105k2694j7710
17877D03980J5132J5123K3081O9009L9036N018O829J4339R399J6577J7136L4979
17865F69638j345j8037n2456k3356k0290m2403k0970p899K3227K7647j500k0176
17853E12080k4850j0385j5727m0057j2977K87J4047L4003M6042M0013K4899K7051
17841E94426L9215L3086P766j6826k6697m492J5338K5847J7929L0831K9352L1880
17829G77655Q957J9033o373k3236k5787N853r517l9112l4189j4908K5666K2560
17817G06602m0005p1147n784L7603Q3781N2166j0659J645k621j7701J6342q805
17805G41417j6982l165M2473K5793L2902n057n0594m3521l0548l3924j0433l1522
$$ plain form
17793 616839 607985 620889 640623 640329 631835 637432 652435 658618 696437 725507 711181 715129 722326
17780 722326 698710 655499 614309 582954 577637 597754 622160 650529 672196 719270 759257 791089
17768 791089 805911 797098 732259 670197 635930 609572 600663 604961 606105 616717 608488 598137
17756 598137 592953 613294 636831 642615 647170 650298 642814 643321 644018 625543 614424 649657 699794
17743 699794 725661 738703 783430 808096 827715 842116 818343 815478 870215 947186 1007540 1061262
17731 1061262 1066488 1074520 1119121 1146196 1158957 1168220 1168999 1219890 1288702 1323880 1363678 1421130
17719 1421130 1482400 1542653 1633577 1719413 1783901 1864071 1971136 2057376 2136644 2248899 2344264
17708 2344264 2455395 2571401 2757731 3012599 3333826 3734575 4211144 4622079 4957386
$$ packed form
17793F16839q854J2904J9734k94q494N597J5003O183L7819K9070j4326L948P197
17780G22326k3616m3211m1190l1355n317K0117K4406K8369K1667M7074L9987L1832
17768G91089J4822q813o4839o2062l4267k6358q909M298J144J0612q229j0351
17756E98137n184K0341K3537N784M555L128p484N07O97j8475j1119L5233N0137
17743F99794K5867J3042M4727K4666J9619J4401k3773k865N4737P6971O0354N3722
17731A061262N226Q032M4601K7075J2761R263P79N0891O8812L5178L9798N7452
17719A421130O1270O0253R0924Q5836O4488Q0170J07065Q6240P9268J12255R5365
17708B344264J11131J16006J86330K54868L21227M00749M76569M10935L35307
$$ plain form
17699 4957386 5358258 5848648 6401191 7098880 7934284 8907064 10028618 10985155 11948094
17690 11948094 13310491 14988942 17114433 20117903 24461161 30894038 40650160 55855687
17682 55855687 80096690 118079732 170310266 231449134 300354245 346348866 337709042
17675 337709042 314542544 275722377 205172152 146569518 119484986 117151529 134902470
17668 134902470 169204636 201050695 206660195 199951428 185345312 145765415 101119998
17661 101119998 71504510 54910732 45836496 41114273 39642292 41162156 45562488 53546340
17653 53546340 67244715 89451891 123606181 168132846 201691145 207810796 205463071
17646 205463071 191566483 155792871 124911506 116409942 130516087 168334001 231475264
$$ packed form
17699D957386M00872M90390N52543O97689Q35404R72780J121554R56537R62939
17690A1948094J362397J678451K125491L003470M343258O432877R756122J5205527
17682E5855687K4241003L7983042N2230534O1138868O8905111M5994621q639824
17675C37709042k3166498l8820167p0550225n8602634k7084532k333457J7750941
17668A34902470L4302166L1846059N609500o708767j4606116l9579897m4645417
17661A01119998k9615488j6593778r074236m722223j471981J519864M400332P983852
17653E3546340J3698375K2207176L4154290M4526665L3558299O119651k347725
17646B05463071j3896588l5773612l0881365q501564J4106145L7817914O3141263
$$ plain form
17639 231475264 296630762 324549357 333504696 326386426 268838965 197242291 140768650
17632 140768650 96093500 66283343 48666873 38157902 31853489 28009363 25561822
17625 25561822 23941430 22771571 21725512 20668266 19490261 18067009 16546606 15118091
17617 15118091 14053345 13439171 13229925 13302521 13617367 14045994 14023890 13513295 12547944
17608 12547944 10908724 9180678 7791487 6763550 6147910 5866006 5874152 6127799 6611453
17599 6611453 7334143 8048742 8511590 8776850 8896913 8851531 8757573 8567825 8383567 8319849
17589 8319849 8391996 8667345 8891406 8985043 8975772 8634128 8103921 7554727 6934795 6243702
17579 6243702 5539971 4889558 4356164 4004339 3833182 3797976 3861824 3987480 4152507 4298932
$$ packed form
17639B31475264O5155498K7918595Q955339p118270n7547461p1596674n6473641
17632A40768650m4675150k9810157j7616470j0508971o304413l844126k447541
17625B5561822j620392j169859j046059j057246j178005j423252j520403j428515
17617A5118091j064746o14174k09246P2596L14846M28627k2104n10595r65351
17608A2547944j639220j728046j389191j027937o15640k81904Q146K53647M83654
17599F611453P22690P14599M62848K65260J20063m5382r3958j89748j84258o3718
17589H319849P2147K75349K24061R3637r271l41644n30207n49194o19932o91093
17579F243702p03731o50413n33394l51825j71157l5206O3848J25656J65027J46425
$$ plain form
17569 4298932 4365622 4404256 4406183 4433503 4544931 4665980 4738554 4827503 4930076 5007413 5050701
17558 5050701 5158742 5282383 5389240 5585642 5711936 5617176 5368323 4886683 4236138 3628605
17548 3628605 3150397 2845312 2677680 2601415 2595131 2577781 2556816 2541109 2457497 2355699 2259650
17537 2259650 2175349 2133238 2106923 2092027 2060310 1994356 1971156 1950560 1986879 2061073 2078157
17526 2078157 2089526 2187310 2156524 1900830 1653650 1545230 1501350 1466773 1481915 1534633 1594676
17515 1594676 1670631 1752111 1677567 1493454 1346134 1246081 1172369 1126425 1090350 1048799 1000988
17504 1000988 953975 960828 973223 1010020 1055183 1088652 1145362 1239180 1305452 1213125 1040095
17493 1040095 922005 879488 855320 853029 861095 927227 1047821 1210929 1260095 1129391 1041398
$$ packed form
17569D298932O6690L8634J927K7320J11428J21049P2574Q8949J02573P7337M3288
17558E050701J08041J23641J06857J96402J26294r4760k48853m81640o50545o07533
17548C628605m78208l05085j67632p6265o284j7350k0965j5707q3612j01798r6049
17537B259650q4301m2111k6315j4896l1717o5954k3200k0596L6319P4194J7084
17526B078157J1369R7784l0786k55694k47180j08420m3880l4577J5142N2718O0043
17515A594676P5955Q1480p4544j84113j47320j00053p3712m5944l6075m1551m7811
17504A000988m7013O853J2395L6797M5163L3469N6710R3818O6272r2327j73030
17493A040095j18090m2517k4168k291Q066O6132J20594J63108M9166j30704q7993
$$ plain form
17482 1041398 1001188 896964 791537 712003 667771 629811 625571 629723 661087 685158 701524
17471 701524 735048 751875 747117 773925 767833 730966 719003 724595 762240 836993 960135 1079174
17459 1079174 1015400 869330 755440 648846 566056 526955 463168 427983 397112 365073 356958
17448 356958 351885 390878 439565 453838 462462 501802 611470 718415 813102 709739 549575
17437 549575 471989 410370 328514 289645 283728 312829 348254 353304 372129 378953 376386 360440
17425 360440 344595 336024 308254 319613 361088 365134 341115 362391 353759 380116 483854 640631
17413 640631 779841 803008 672676 500074 378848 301276 292666 293654 283552 273574 275162 287907
17401 287907 306667 285024 263443 237374 227427 238962 243462 256338 264734 262186 247491 237719
$$ packed form
17482A041398m0210j04224j05427p9534m4232l7960m240M152L1364K4071J6366
17471G01524L3524J6827m758K6808o092l6867j1963N592L7645P4753J23142J19039
17459A079174o3774j46070j13890j06594q2790l9101o3787l5185l0871l2039q115
17448C56958n073L8993M8687J4273Q624L9340J09668J06945R4687j03363j60164
17437E49575p7586o1619q1856l8869n917K9101L5425N050J8825O824k567j5946
17425C60440j5845q571k7770J1359M1475M046k4019K1276q632K6357J03738J56777
17413F40631J39210K3167j30332j72602j21226p7572q610R88j0102r978J588J2745
17401B87907J8760k1643k1581k6069r947J1535M500J2876Q396k548j4695r772
$$ plain form
17389 237719 235745 237486 244357 246288 270098 276805 267558 271678 283341 295562 286017 298042 298694
17376 298694 296801 279013 288783 299987 319657 323360 325236 310956 307441 315768 313651 298222 309478
17363 309478 330261 335449 396185 497603 591463 704577 720318 559939 390326 300332 251851
17352 251851 221881 222754 208948 191066 175817 185284 197247 212926 206890 220258 249227 225484
17340 225484 214432 211364 205390 169127 155133 213493 253563 271346 249023 236250 203967 185302
17328 185302 178046 159123 156430 143833 146308 135128 139838 138037 136341 149853 160082 163095 146591
17315 146591 144063 174793 250700 340113 455747 509188 409740 290448 214967 177827 151442
17304 151442 131415 131383 133566 109072 83304 89985 79851 63405 65798 81981 89000 87951 100786
$$ packed form
17389B37719j974J741O871J931K3810O707r247M120J1663J2221r545J2025O52
17376B98694j893j7788R770J1204J9670L703J876j4280l515Q327k117j5429J1256
17363C09478K0783N188O0736J01418R3860J13114J5741j60379j69613q9994m8481
17352B51851k9970Q73j3806j7882j5249R467J1963J5679o036J3368K8969k3743
17340B25484j1052l068n974l6263j3994N8360M0070J7783k2323j2773l2283j8665
17328A85302p256j8923k693j2597K475j1180M710j801j696J3512J0229L013j6504
17315A46591k528L0730P5907Q9413J15634N3441r9448j19292p5481l7140k6385
17304A51442k0027l2K183k4494k5768O681j0134j6446K393J6183P019j049J2835
$$ plain form
17291 100786 78720 85920 102482 82259 77123 86666 99480 98621 112724 110438 110361 122898 129519
17278 129519 95159 91178 107336 108139 94309 75089 65497 65582 69107 90746 93926 93035 75198 55878
17264 55878 62496 62584 63310 81457 76436 79522 81813 78466 85531 93633 95714 83896 92403 111417
17250 111417 89043 50103 57542 59563 73657 82662 99739 136857 135801 115718 78715 85582
17238 85582 109991 115325 99911 77222 84289 87605 81227 77544 89196 76346 62992 49977 44703
17225 44703 56411 45043 80281 95221 77201 83186 109198 102369 101008 91067 103971 103555 92106
17212 92106 77288 57546 58829 37861 36168 51602 40242 33249 26841 18046 9777 -7982 -19639
17199 -19639 11192 24005 68073 77209 59843 47493 63297 49949 56530 50908 53188 65043
$$ packed form
17291A00786k2066P200J6562k0223n136R543J2814q59J4103k286p7J2537O621
17278A29519l4360l981J6158Q03j3830j9220r592Q5L525K1639L180q91j7837j9320
17264E5878O618Q8P26J8147n021L086K291l347P065Q102K081j1818Q507J9014
17250A11417k2374l8940P439K021J4094R005J7077L7118j056k0083l7003O867
17238H5582K4409N334j5414k2689P067L316o378l683J1652j2850j3354j3015n274
17225D4703J1708j1368L5238J4940j8020N985K6012o829j361r941J2904m16j1449
17212I2106j4818j9742J283k0968j693J5434j1360o993o408q795q269j7759j1657
17199a9639L0831J2813M4068R136j7366j2350J5804j3348O581n622K280J1855
$$ plain form
17187 65043 52819 39664 73273 109285 101793 104809 100738 86017 108163 135365 175929 240819
17175 240819 330529 410235 589368 788510 897523 944738 1022807 1052607 1085523 1093640 1040927
17164 1040927 976006 927808 839317 819028 875272 978875 1033545 1039001 1088698 1096919 1063721
17153 1063721 1003864 971670 880610 699416 543625 412313 324823 291068 278332 294989 329922
17142 329922 375781 468613 626574 826252 953675 1013311 1054097 1098668 1092253 1079550 1055649
17131 1055649 1038957 954578 829101 788499 866329 992001 1045437 1077663 1095057 1059559 1015700
17120 1015700 981571 878212 800784 689078 542952 391142 290464 224815 173081 170322
17110 170322 167654 165330 140520 144741 131326 134309 143891 121937 106267 102090 90750 91665 109904
$$ packed form
17187F5043j2224j3155L3609L6012p492L016m071j4721K2146K7202M0564O4890
17175B40819Q9710P9706J79133J99142J09013M7215P8069K9800L2916Q117n2713
17164A040927o4921m8198q8491k0289N6244J03603N4670N456M9697Q221l3198
17153A063721n9857l2194r1060j81194j55791j31312q7490l3755j2736J6657L4933
17142C29922M5859R2832J57961J99678J27423N9636M0786M4571o415j2703k3901
17131A055649j6692q4379j25477m0602P7830J25672N3436L2226J7394l5498m3859
17120A015700l4129j03359p7428j11706j46126j51810j00678o5649n1734k759
17110A70322k668k324k4810M221j3415K983R582k1954j5670m177j1340R15J8239
$$ plain form
17097 109904 105995 100966 92884 62267 62387 91016 95370 89638 82814 91907 99263 88363 52596
17084 52596 66998 47108 44553 37595 24082 27404 11907 15536 4776 14505 23487 51947 62483
17071 62483 62865 68141 22052 34274 44827 45062 48305 48790 40220 41282 48154 51624 54804 49679
17057 49679 55234 36599 11793 7533 20661 16374 14052 -392 17002 38446 62776 73854
17045 73854 41781 15591 -1200 26118 17503 8958 -2081 1932 26770 57492 72154 52964
17033 52964 33046 23935 25799 45228 37101 42912 22620 1745 -5759 11923 44873 61557 30549
17020 30549 6467 17634 32775 41000 28302 23829 37677 81189 95553 78701 37286 19154
17008 19154 7374 31571 51687 33706 19417 13308 1088 -3173 -11260 -28178 -7534 38293
$$ packed form
17097A09904l909n029q082l0617J20K8629M354n732o824R093P356j0900l5767
17084E2596J4402j9890k555o958j3513L322j5497L629j0760R729Q982K8460J0536
17071F2483L82N276m6089J2222J0553K35L243M85q570J062O872L470L180n125
17057D9679N555j8635k4806m260J3128m287k322j4444J7394K1444K4330J1078
17045G3854l2073k6190j6791K7318q615q545j1039M013K4838L0722J4662j9190
17033E2964j9918r111J864J9429q127N811k0292k0875p504J7682L2950J6684l1008
17020C0549k4082J1167J5141Q225j2698m473J3848M3512J4364j6852m1415j8132
17008A9154j1780K4197K0116j7981j4289o109j2220m261q087j6918K0644M5827
$$ plain form
16996 38293 73183 53236 46194 18400 -7074 15527 23025 12929 15619 15242 14775 23268 19718
16983 19718 15510 -8378 20118 29210 19940 23763 39990 50534 20362 3413 -4487 -6207 -17289
16970 -17289 -11413 -1536 24865 -1988 -16508 6500 17116 -7403 -13806 -1837 -7452 4973
16958 4973 -4104 -5858 -14450 -16097 -29251 -55218 -38695 12626 50809 25669 6660 43687 6310
16945 6310 -29175 -17666 -2786 24089 20783 16188 43214 29524 5042 6124 33624 39372 17080
16932 17080 8987 -20810 -24431 -26210 -22269 -8302 10597 23165 8688 3389 10805 11846 26322
16919 26322 -4448 -13441 4398 6213 17934 14258 25135 39397 42150 38775 37745 52140 53146
16906 53146 31180 1903 118 36908 11624 9825 20334 30831 17756 414 -19425 4460
$$ packed form
16996C8293L4890j9947p042k7794k5474K2601P498j0096K690l77m67Q493l550
16983A9718m208k3888K8496R092r270L823J6227J0544l0172j6949p900j720j1082
16970a7289N876R877K6401k6853j4520K3008J0616k4519o403J1969n615J2425
16958D973r077j754q592j647j3154k5967J6523N1321L8183k5140j9009L7027l7377
16945F310l5485J1509J4880K6875l306m595K7026j3690k4482J082K7500N748k2292
16932A7080q093k9797l621j779L941J3967J8899J2568j4477n299P416J041J4476
16919B6322l0770q993J7839J815J1721l676J0877J4262K753l375j030J4395J006
16906E3146k1966k9277j785L6790k5284j799J0509J0497j3075j7342j9839K3885
$$ plain form
16894 4460 26129 13138 8853 -9343 -14251 2179 7124 20212 32948 33602 4186 -22806 -33715
16881 -33715 -9892 11190 -2857 -22641 -21258 6187 22154 21170 19518 1524 -1190 -13209 -30351
16868 -30351 -37194 -22956 -3099 19356 31097 22323 11559 2025 4361 32522 38707 11496 -17189
16855 -17189 -9260 12973 26835 22813 27214 30052 8086 395 -13348 -19235 -37234 -31240 -4706
16842 -4706 -3139 -7095 17376 57027 79371 113004 153883 188573 204441 199073 175040 127732
16830 127732 65578 36397 47127 50231 46284 55584 57250 42344 3341 -1131 32261 34940 36545
16817 36545 44772 71390 61966 62619 68123 68231 31292 44702 29068 1541 -23001 -60848 -30820
16804 -30820 -21268 -34093 -9281 -6255 -2786 -10525 -6404 6143 25570 48150 80715 93912 47339
$$ packed form
16894D460K1669j2991m285j8196m908J6430M945J3088J2736O54k9416k6992j0909
16881c3715K3823K1082j4047j9784J383K7445J5967r84j652j7994k714j2019j7142
16868c0351o843J4238J9857K2455J1741q774j0764r534K336K8161O185k7211k8685
16855a7189P929K2233J3862m022M401K838k1966p691j3743n887j7999N994K6534
16842d706J567l956K4471L9651K2344L3633M0879L4690J5868n368k4033m7308
16830A27732o2154k9181J0730L104l947R300J666j4906l9003m472L3392K679J605
16817C6545Q227K6618r424O53N504J08l6939J3410j5634k7527k4542l7847L0028
16804c0820R552j2825K4812L026L469p739M121J2547J9427K2580L2565J3197m6573
$$ plain form
16791 47339 27616 41624 33355 22929 21995 2768 17093 25989 28945 46046 69598 67833 86249
16778 86249 99468 114437 128972 158719 163458 144055 124444 101887 44025 28480 2033 -33029
16766 -33029 -43014 -6308 20621 13910 14277 14357 16773 17607 37297 44117 48682 40923 22088 6210
16752 6210 -28480 -73734 -79833 -55436 -34166 -3146 7754 3700 30535 51281 62506 64779
16740 64779 74014 131625 202704 279323 319171 323491 275347 170885 117965 86020 36886 11647
16728 11647 19034 15087 9650 -7434 227 20942 31736 55401 49732 9091 -19097 -5124 7352
16715 7352 14129 7617 26554 19789 -8556 -17623 -31173 -15240 -10378 -17226 14537 -20026 -32686
16702 -32686 -29028 -1565 10469 13744 -14132 -10844 -22092 -21117 -166 -38141 -43259 -17993 -7964
$$ packed form
16791D7339j9723J4008q269j0426r34j9227J4325Q896K956J7101K3552j765J8416
16778H6249J3219J4969J4535K9747M739j9403j9611k2557n7862j5545k6447l5062
16766c3029r985L6706K6929o711L67Q0K416Q34J9690O820M565p759j8835j5878
16752F210l4690m5254o099K4397K1270L1020J0900m054K6835K0746J1225K273
16740F4779R235N7611P1079P6619L9848M320m8144j04462n2920l1945m9134k5239
16728A1647P387l947n437j7084P661K0715J0794K3665n669m0641k8188J3973J2476
16715G352O777o512J8937o765k8345r067j3550J5933M862o848L1763l4563j2660
16702c2686L658K7463J2034L275k7876L288j1248R75K0951l7975n118K5266J0029
$$ plain form
16689 -7964 -9450 -15081 1408 20639 27880 41458 46480 41564 108664 187013 254341 327073 386353
16676 386353 382935 305408 218064 145082 103861 73226 67593 99302 89090 56169 36150 33424
16664 33424 43904 20179 -19453 7149 28566 10357 6044 27885 14784 3508 16406 30250
16652 30250 16169 37844 28196 28228 24872 10428 -6007 -2857 -11556 -20615 -34402 -48697 -39589
16639 -39589 -30870 -38107 -41833 -51524 -63671 -39474 -12289 3322 1725 -3571 -2799 -1562 7580 -12447
16625 -12447 -44154 -31288 -42669 -45809 -30647 -35872 -14822 -89 -6879 -15178 -20860 -27993 -5931
16612 -5931 -10798 -4327 -9404 -17025 -1108 -5058 -33577 -59197 -58743 -28109 -20103 -20725 1472 13938
16598 13938 14169 -3430 -39693 -36983 -30796 -29588 -21054 -11375 1852 9938 1344 5868 7174 2639
$$ packed form
16689g964j486n631J6489J9231P241J3578N022m916O7100P8349O7328P2732N9280
16676C86353l418p7527q7344p2982m1221l0635n633L1709j0212l2921k0019k726
16664C3424J0480k3725l9632K6602K1417j8209m313K1841j3101j1276J2898J3844
16652C0250j4081K1675r648L2l356j4444j6435L150q699r059j3787j4295R108
16639c9589Q719p237l726r691j2147K4197K7185J5611j597n296P72J237R142k0027
16625a2447l1707J2866j1381l140J5162n225K1050J4733o790q299n682p133K2062
16612e931m867O471n077p621J5917l950k8519k5620M54L0634Q006o22K2197J2466
16598A3938K31j7599l6263K710O187J208Q534R679J3227Q086q594M524J306m535
$$ plain form
16584 2639 -2040 -1968 -3306 18271 -11031 -30547 -14929 -12349 11560 18155 4090 35368 53358
16571 53358 61268 75548 116206 158191 211315 325471 426074 468535 445160 375387 278975
16560 278975 216051 178818 158927 121783 95425 93166 126292 107728 58447 50300 44826 52644
16548 52644 59441 50199 25547 31707 27426 7153 -2755 24253 58667 13310 -28247 -21234 -5674
16535 -5674 2631 -2256 -6380 -14152 -15371 13310 25503 9640 1439 -7353 -1116 12867 4197 10011
16521 10011 31206 53763 36845 35029 25733 32452 10805 17261 31983 60498 60334 32466 17546
16508 17546 30960 60296 70337 118285 157150 215320 292791 375212 451966 484351 450800 384344
16496 384344 311439 247394 200864 148578 79255 43203 30678 39222 65038 81823 137987 201185
$$ packed form
16584B639m679P2j338K1577k9302j9516J5618K580K3909O595j4065L1278J7990
16571E3358P910J4280M0658M1985N3124J14156J00603M2461k3375o9773r6412
16560B78975o2924l7233j9891l7144k6358k259L3126j8564m9281q147n474P818
16548E2644O797r242k4652O160m281k0273r908K7008L4414m5357m1557P013J5560
16535e674Q305m887m124p772j219K8681J2193j5863q201q792O237J3983q670N814
16521A0011K1195K2557j6918j816r296O719k1647O456J4722K8515j64k7868j4920
16508A7546J3414K9336J0041M7948L8865N8170P7471Q2421P6754L2385l3551o6456
16496C84344p2905o4045m6530n2286o9323l6052j2525Q544K5816J6785N6164O3198
$$ plain form
16484 201185 263714 326003 405411 415175 380012 292371 192741 140028 100791 104536 99871 71080
16472 71080 49865 45536 47471 52923 24134 -2725 -23612 -12737 49930 89767 101450 85603
16460 85603 95603 96617 78524 72861 52020 33210 12383 17744 37381 38656 29624 24802 14151
16447 14151 13088 19362 20230 38867 79363 85973 65304 75370 58525 72559 125402 164953 240000
16434 240000 321931 364653 344778 276580 188279 113636 69367 61884 54903 46547 18853 14238
16422 14238 18039 26447 21353 24870 28040 8123 -17530 -19266 -19880 -34309 -21269 -11608 -11468 1048
16408 1048 17572 12710 4216 3884 -2216 15743 32499 12001 -2880 -8773 28207 51502 38232
16395 38232 51023 19130 17253 30360 29448 46559 53826 66959 86499 124958 170635 229500
$$ packed form
16484B01185O2529O2289P9408R764l5163q7641r9630n2713l9237L745m665k8791
16472G1080k1215m329J935N452k8789k6859k0887J0875O2667L9837J1683j5847
16460H5603J0000J014j8093n663k0841j8810k0827N361J9637J275r032m822j0651
16447A4151j063O274Q68J8637M0496O610k0669J0066j6845J4034N2843L9551P5047
16434B40000Q1931M2722j9875o8198q8301p4643m4269p483o981q356k7694m615
16422A4238L801Q408n094L517L170j9917k5653j736o14j4429J3040R661J40J2516
16408A048J6524m862q494l32o100J7959J6756k0498j4881n893L6980K3295j3270
16395C8232J2791l1893j877J3107r12J7111P267J3133J9540L8459M5677N8865
$$ plain form
16383 229500 202100 154551 92006 59762 27973 1269 5575 5994 -13463 -16309 -13155 12006
16371 12006 8686 7127 -5401 -24225 -9867 -4867 17099 16260 40061 44304 45415 38767 10749
16358 10749 -3690 -32986 -5620 6940 8787 27003 31537 -2213 -6678 1145 -14880 -22526 7462
16345 7462 4201 2297 1799 -8863 15648 58184 58677 87990 136463 163193 175317 178975 129240
16332 129240 88268 77781 74070 47120 10237 2477 17812 11556 -3923 -19490 -3362 -2021
16320 -2021 16167 23697 12136 11236 12638 15099 7982 7030 3756 -19167 -28441 -27185 3065 35993
16306 35993 20564 -8319 -9274 1996 2809 405 -26365 -55686 -55903 -50027 -32467 -11486 -17509
16293 -17509 -24797 -37086 -20152 -19472 -27627 -44218 -29132 -14856 -10308 30034 33778 7516 -2285
$$ packed form
16383B29500k7400m7549o2545l2244l1789k6704M306M19j9457k846L154K5161
16371A2006l320j559j2528j8824J4358N000K1966q39K3801M243J111o648k8018
16358A0749j4439k9296K7366J2560J847J8216M534l3750m465P823j6025p646K9988
16345G462l261j904m98j0662K4511M2536M93K9313M8473K6730J2124L658m9735
16332A29240m0972j0487l711k6950l6883p760J5335o256j5479j5567J6128J341
16320b021J8188P530j1561r00J402K461p117r52l274k2923r274J256L0250L2928
16306C5993j5429k8883r55J1270Q13k404k6770k9321k17N876J7560K0981o023
16293a7509p288j2289J6934O80q155j6591J5086J4276M548M0342L744k6262r801
$$ plain form
16280 -2285 -27866 -25933 -26900 -31458 -5379 -18192 -37241 -26236 -924 -3975 -24903 -33235 -27697
16267 -27697 -6670 -22363 -32768 -29501 -35878 -19586 26726 26220 -2807 -8561 3629 -11030 -46908
16254 -46908 -22299 -9042 -9595 -9602 -9399 -26903 5178 26598 30559 40412 48161 37187 22676 20978
16240 20978 21208 -15745 -12560 272 5728 2614 -9367 8112 -7568 -4210 12430 11673 -1986
16227 -1986 9661 65 28430 30448 -13331 -5615 22725 36599 41317 37804 59486 85098 68327
16214 68327 39040 12254 -31793 -62662 -66565 -55405 -42291 -28895 17846 24266 4239 -13958
16202 -13958 -7380 19471 28929 24659 21269 61787 84773 91171 54890 21785 31150 55976 52034
16189 52034 42462 36298 34782 31339 -5707 -1100 -16762 -3797 6779 2162 -13496 -7421 -9376
$$ packed form
16280b285k5581J933r67m558K6079j2813j9049J1005K5312l051k0928q332N538
16267b7697K1027j5693j0405L267o377J6292M6312n06k9027n754J2190j4659l5878
16254d6908K4609J3257n53pK03j7504L2081K1420L961R853P749j0974j4511j698
16240B0978K30l6953L185J2832N456l114j1981J7479j5680L358J6640p57j3659
16227a986J1647r596K8365K018m3779P716K8340J3874M718l513K1682K5612j6771
16214F8327k9287k6786m4047l0869l903J1160J3114J3396M6741O420k0027j8197
16202a3958O578K6851R458m270l390M0518K2986O398l6281l3105R365K4826l942
16189E2034r572o164j516l443l7046M607j5662J2965J0576m617j5658O075j955
$$ plain form
16176 -9376 -38953 -34537 -6663 -16755 -43162 -36696 -1773 -362 5363 19115 -9007 -33208 -33035
16163 -33035 -25795 -15114 -11253 -17238 -24400 41452 24349 -7609 -1097 10380 25064 23488 36036
16150 36036 31058 5108 -10100 -15625 -3084 5749 -3195 -5529 16503 33198 2225 -19059 -7267
16137 -7267 -3752 -18497 1160 7344 13790 23383 16889 -8708 -22475 -5347 -8963 -30180 -31612
16124 -31612 -13331 -18315 -7969 26430 31396 24268 13615 745 -10083 -7489 -17898 -28610
16112 -28610 -29624 -20664 -18656 -31804 -29247 6340 33882 20044 39453 24281 26879 11035 2223
16099 2223 24865 25205 15583 12448 4078 10532 27511 23440 -5320 -8118 -12263 -14480 -15613 -12948
16085 -12948 -9693 9151 -2460 -14560 -11300 -30533 -39628 -17673 -993 23407 38146 48411
$$ packed form
16176i376k9577M416K7874j0092k6407O466L4923J411N725J3752k8122k4201J73
16163c3035P240J0681L861n985p162O5852j7103l1958O512J1477J4684j576J2548
16150C6036m978k5950j5208n525J2541Q833q944k334K2032J6695l0973k1284J1792
16137g267L515j4745J9657O184O446R593o494k5597j3767J7128l616k1217j432
16124c1612J8281m984J0346L4399M966p128j0653j2870j0828K594j0409j0712
16112b8610j014Q960K008j3148K557L5587K7542j3838J9409j5172K598j5844q812
16099B223K2642L40r622l135q370O454J6979m071k8760k798m145k217j133K665
16085a2948L255J8844j1611j2100L260j9233r095K1955J6680K4400J4739J0265
$$ plain form
16073 48411 33465 5043 -11016 -14493 -12991 -12280 -2082 14210 8915 7294 6627 14698 8252 -6111
16059 -6111 -20215 -10853 -2215 -12494 -32996 -42869 -43677 -19323 -18866 1091 15588 -7623 -16530
16046 -16530 -447 16900 20807 39969 25596 -3969 -18535 -16128 -13418 -27787 -26135 2100
16034 2100 19664 14066 8548 -12246 -35295 -16631 707 7224 20530 24324 17671 11701 27715
16021 27715 10890 12183 16699 -5460 -8626 -13056 5761 9542 12469 16223 7372 3861 21525
16008 21525 30950 15494 25096 26426 4923 -19276 -41744 -25774 9243 10053 -9398 -18081 -20882
15995 -20882 -15177 -20408 -38399 -10273 31551 34777 -3586 -6831 27046 38892 20819 19951 33692
15982 33692 38513 34618 23167 -3274 12965 7137 11886 -11322 -36625 -24469 -1769 -11744 10663
$$ packed form
16073D8411j4946k8422j6059l477J502P11J0198J6292n295j621o67Q071o446j4363
16059f111j4104R362Q638j0279k0502r873q08K4354M57J9957J4497k3211q907
16046a6530J6083J7347L907J9162j4373k9565j4566K407K710j4369J652K8235
16034B100J7564n598n518k0794k3049J8664J7338O517J3306L794o653n970J6014
16021B7715j6825J293M516k2159l166m430J8817L781K927L754q851l511J7664
16008B1525R425j5456R602J330k1503k4199k2468J5970L5017Q10j9451q683k801
15995b0882N705n231j7991K8126M1824L226l8363l245L3877J1846j8073q68J3741
15982C3692M821l895j1451k6441J6239n828M749k3208k5303J2156K2700r975K2407
$$ plain form
15969 10663 25718 37132 -4543 -13342 -46026 -44303 -32738 -30271 -21893 -41769 -25218 -19792 -16359
15956 -16359 -12071 -24441 -31832 -37103 -20005 616 4496 13983 30294 28529 32589 11574 -26829
15943 -26829 -56875 -52858 -54075 -34771 -14237 -13736 14455 14233 36235 3870 -28769 -27248 -11741
15930 -11741 -12580 -5153 19770 19510 3172 3422 3912 -13292 2204 37703 29454 26859 27917 22391
15916 22391 11353 -37342 -18190 -12057 -53500 -43448 -55619 -49222 -19152 -24859 -35472 -49287
15904 -49287 -44313 -5946 19186 -397 -47178 -36826 19545 27762 25511 34330 23590 25927 3173
15891 3173 -362 24386 25219 -3298 -16196 -5859 1998 -12297 -16885 -7061 7151 -4356 -18014
15878 -18014 2005 16523 19332 -9568 -18133 -16484 6794 12168 10935 -2509 -41698 -55687 -16492
$$ packed form
15969A0663J5055J1414m1675q799l2684J723J1565K467Q378j9876J6551N426L433
15956a6359M288j2370p391n271J7098K0621L880R487J6311j765M060k1015l8403
15943b6829l0046M017j217J9304K0534N01K8191k22K2002l2365l2639J521J5507
15930a1741q39P427K4923k60j6338K50M90j7204J5496L5499q249k595J058n526
15916B2391j1038m8695J9152O133m1443J0052j2171O397L0070n707j0613j3815
15904d9287M974L8367K5132j9583m6781J0352N6371Q217k251Q819j0740K337k2754
15891C173l535K4748Q33k8517j2898J0337P857j4295m588R824J4212j1507j3658
15878a8014K0019J4518K809k8900q565J649K3278N374j233j3444l9189j3989L9195
$$ plain form
15865 -16492 -4897 -18327 -22537 -16562 -8488 5840 19265 2531 -10208 -31436 -45901 -40893
15853 -40893 -15027 -2702 -19800 -16082 -15031 -10491 -1678 988 -7543 6590 6031 -21520 -32930
15840 -32930 -31685 -52184 -41142 -6806 6816 6639 -6910 4876 27399 21341 18162 -10970 -31309
15827 -31309 -18180 -9389 -23142 15708 49433 28536 -2978 -21225 -19651 -1325 5287 288
15815 288 957 36248 54835 24795 -263 -5236 1845 -5111 -7819 -10115 -14217 -11797 -5128 -8313
15801 -8313 -32989 -28202 -18657 -3750 10511 -1044 11492 -15805 -20591 -7252 -27990 -27632 -14624
15788 -14624 -14638 -25571 -22863 -7971 -7999 15796 19439 74 -18028 -7050 19529 44419 27787
15775 27787 22812 10662 -4204 -12130 -6071 -14025 -12024 -15000 -42577 -42059 -45440 -27953 -14056
$$ packed form
15865a6492J1595j3430m210N975Q074J4328J3425j6734j2739k1228j4465N008
15853d0893K5866J2325j7098L718J051M540Q813K666q531J4133n59k7551j1410
15840c2930J245k0499J1042L4336J3622j77j3549J1786K2523o058l179k9132k0339
15827c1309J3129Q791j3753L8850L3725k0897l1514j8247J574J8326O612m999
15815B88O69L5291J8587l0040k5058m973P081o956k708k296m102K420O669l185
15801h313k4676M787R545J4907J4261j1555J2536k7297m786J3339k0738L58J3008
15788a4624j4j0933K708J4892k8K3795L643j9365j8102J0978K6579K4890j6632
15775B7787m975j2150j4866p926O059p954K001k976k7577N18l381J7487J3897
$$ plain form
15762 -14056 -19672 -48545 -35656 -16797 -27236 -23667 -3922 29576 38425 33937 2618 -46356
15750 -46356 -48025 -32745 10193 17893 841 -6736 -1866 -19349 -41722 -42299 -23631 20356 39710
15737 39710 29401 26654 -756 13288 11343 8008 -5362 1661 -6798 -16423 1889 6247 -25654
15724 -25654 -22855 -21084 -23907 -33632 -21536 -18035 -16511 1032 16653 10468 13009 -24521 -31348
15711 -31348 -21067 4713 5347 -26709 -38576 -42723 -32997 -26413 -14619 3215 6667 -22231 -34349
15698 -34349 -11252 -33957 -42681 -22042 -1135 6986 654 7169 -4452 -22492 -15839 1704 9001
15685 9001 -5763 -43150 -46705 -45791 -52863 -60625 -37570 -4184 -15879 -31078 -31783 756 25074
15672 25074 7749 -6733 -17366 -35281 -26362 -13424 20010 30160 34477 5777 -21513 -6600
$$ packed form
15762a4056n616k8873J2889J8859j0439L569J9745L3498Q849m488l1319m8974
15750d6356j669J5280M2938P700j7052p577M870j7483k2373n77J8668M3987J9354
15737C9710j0309k747k7410J4044j945l335j3370P023q459r625J8312M358l1901
15724b5654K799J771k823r725J2096L501J524J7543J5621o185K541l7530o827
15711c1348J0281K5780O34l2056j1867m147R726O584J1794J7834L452k8898j2118
15698c4349K3097k2705q724K0639K0907Q121o332O515j1621j8040O653J7543P297
15685I001j4764l7387l555R14p072p762K3055L3386j1695j5199p05L2539K4318
15672B5074j7325j4482j0633j7915Q919J2938L3434J0150M317k8700k7290J4913
$$ plain form
15660 -6600 17170 18314 9647 -5171 -18942 -20730 -26113 -17570 -28336 -2796 11729 4640 -3694
15647 -3694 11958 -4067 -12592 9485 -511 -24397 -51627 -63328 -7157 19101 21093 -1524
15635 -1524 -36756 -51179 -71338 -45137 -17963 -14783 -10279 -19297 -41270 -31242 -37931 -28481 4895
15622 4895 -9333 -26033 -51429 -41068 -10176 -16246 -46087 -47491 -32114 7648 10593 -17265
15610 -17265 -19106 794 -19155 -30158 -5125 8346 20442 22725 42374 49372 40773 40404 34353
15597 34353 34762 26976 15491 7730 16011 3968 -32032 -17691 873 15478 15622 10495 11560
15584 11560 -69 -5701 -19778 -32331 -74554 -108289 -87940 -41768 -16722 -30451 -48160 -39570
15572 -39570 -27473 -17508 -6474 -19107 -22102 2151 25997 43712 41490 5352 -23283 -22611 -15778
$$ packed form
15660f600K3770J144q667j4818j3771j788n383Q543j0766K5540J4525p089q334
15647c694J5652j6025q525K2077r996k3886k7230j1701N6171K6258J992k2617
15635a524l5232j4423k0159K6201K7174L180M504r018k1973J0028o689R450L3376
15622D895j4228j6700k5396J0361L0892o070k9841j404J5377L9762K945k7858
15610a7265j841J9900j9949j1003K5033J3471J2096K283J9649O998q599l69o051
15597C4353M09p786j1485p761Q281j2043l6000J4341J8564J4605J44n127J065
15584A1560j1629n632j4077j2553m2223l3735K0349M6172K5046j3729j7709Q590
15572c9570J2097R965J1034j2633k995K4253K3846J7715k222l6138k8635O72O833
$$ plain form
15559 -15778 -31437 -27474 -20228 -1503 -14868 -10407 11610 -30306 -82630 -79309 -56206 -28793
15547 -28793 -23866 -22816 -29271 -48908 -70453 -92437 -97626 -75914 -37259 -23601 -29613 -19466 9083
15534 9083 9549 -2404 -20962 -25163 -40094 -16907 7176 18094 -7567 -14887 -46834 -44248 -37190
15521 -37190 -30736 -27685 -259 22201 22493 5145 1082 1754 16127 -9159 -29524 5075 30762
15508 30762 32462 6461 14078 33577 35209 10003 -5924 -22646 -38422 -47709 -41271 -55489 -60408
15495 -60408 -30706 601 10224 3708 -15597 -23933 16426 11045 -13119 -15498 -15871 9968 14551
15482 14551 9934 -2096 -5510 -13181 -44619 -40717 -28142 -26636 -9827 -1279 6527 -4895 -55144
15469 -55144 -46186 -7251 -2990 -3881 -22621 -40645 -62319 -50061 -31159 -31901 -46210 -44878 -28537
$$ packed form
15559a5778j5659L963P246J8725j3365M461K2017m1916n2324L321K3103K7413
15547b8793M927J050o455j9637k1545k1984n189K1712L8655J3658o012J0147K8549
15534I083M66j1953j8558m201j4931K3187K4083J0918k5661p320l1947K586P058
15521c7190O454L051K7426K2460K92j7348m063O72J4373k5286k0365L4599K5687
15508C0762J700k6001P617J9499J632k5206j5927j6722j5776r287O438j4218m919
15495f0408K9702L1307R623o516j9305q336M0359n381k4164k379l73K5839M583
15482A4551m617j2030l414p671l1438L902J2575J506J6809Q548P806j1422n0249
15469e5144Q958L8935M261q91j8740j8024k1674J2258J8902p42j4309J332J6341
$$ plain form
15456 -28537 -10211 -17011 -18557 -36841 -59403 -70310 -63168 -42031 -37809 -54775 -48001 -32012 -2082
15443 -2082 12301 16904 22276 -8301 -25893 -26628 -11923 -12609 1153 13347 4317 3905 26278 17916
15429 17916 -4855 -18458 -19016 -18005 -25473 -38139 -50253 2364 39698 661 -9578 -47 -16171
15416 -16171 1210 22065 3786 10924 -11564 -34887 -42020 -21199 -7822 -26615 -37734 -37045
15404 -37045 -37239 -59113 -51370 -14069 -17968 -16354 -31460 3511 25547 52050 49271 6161 -19950
15391 -19950 -31077 -40021 -28753 -1952 -10762 -27565 -53218 -44407 -24192 -16599 11347 35213
15379 35213 2561 -8216 5652 12171 -18210 -27995 -43486 -21784 -6063 -9479 -6704 7883
15367 7883 -20610 -34759 9966 19094 -3479 -29690 -17989 -3084 -15314 -23539 -32191 -45581
$$ packed form
15456b8537J8326o800j546j8284k2562j0907P142K1137M222j6966O774J5989K9930
15443b082J4383M603N372l0577j7592p35J4705o86J3762J2194r030m12K2373q362
15429A7916k2771j3603n58J011p468j2666j2114N2617L7334l9037j0239R531j6124
15416a6171J7381K0855j8279P138k2488k3323p133K0821J3377j8793j1119O89
15404c7045j94k1874P743L7301l899J614j5106L4971K2036K6503k779m3110k6111
15391a9950j1127q944J1268K6801q810j6803k5653Q811K0215P593K7946K3866
15379C5213l2652j0777J3868O519l0381r785j5491K1702J5721l416K775J4587
15367G883k8493j4149M4725R128k2573k6211J1701J4905j2230q225q652j3390
$$ plain form
15355 -45581 -35710 -14916 -9343 -14609 -21605 -18162 -20704 -23480 -20390 -16348 -24868 -17139 -18184 -25850
15341 -25850 -46448 -72077 -55403 -56513 -55438 -48480 -40856 -10445 19072 51 829 2911 6274
15328 6274 10486 13230 -12493 -13399 -30118 -31468 -19980 -5654 21450 32093 33542 37459 50693
15315 50693 35593 -1418 1511 -26964 -35384 -19749 -11527 -7369 5236 -7463 -19019 -35060
15303 -35060 -27276 -20745 -26891 -62875 -84020 -69517 -40988 -30817 -9573 -11465 -25341 -42733
15291 -42733 -6409 23005 39336 28134 -11935 -33600 -37276 -42154 -32145 -42593 -47153 -30613
15279 -30613 -21035 8372 38307 21582 4623 6949 -18583 -38745 -31845 -25474 -15862 -1160 -34909
15266 -34909 -43237 -35604 -739 24048 8495 -8306 -16271 -13846 655 -14911 -15269 -25666 -27018
$$ packed form
15355d5581R871K0794N573n266o996L443k542k776L090M042q520P729j045p666
15341b5850k0598k5629J6674j110J075O958P624L0411K9517j9021P78K082L363
15328F274M212K744k5723r06j6719j350J1488J4326K7104J0643J449L917J3234
15315E0693j5100l7011K929k8475q420J5635Q222M158J2605j2699j1556j6041
15303c5060P784O531o146l5984k1145J4503K8529J0171K1244j892j3876j7392
15291d2733L6324K9414J6331j1202m0069k1665l676m878J0009j0448m560J6540
15279c0613R578K9407K9935j6725j6959K326k5532k0162O900O371R612J4702l3749
15266c4909q328P633L4865K4787j5553j6801p965K425J4501j5566l58j0397j352
$$ plain form
15253 -27018 -28076 -23277 -20528 -35920 -48136 -44574 -27810 -14300 2951 29889 24055 31611 41792
15240 41792 24021 36895 30006 28596 5770 -3473 -17742 -25748 -13155 -21589 -36213 -47268 -45879
15227 -45879 -18786 -19517 -11986 23363 26617 12073 1555 14992 15381 8665 -11412 -7406 -13177
15214 -13177 -26623 -20534 -19384 -41618 -45375 -42924 -55649 -60619 -74416 -56286 -30413 -22901 -6831
15201 -6831 1957 -6074 -9638 18584 -7476 -49165 -69420 -69255 -72044 -81993 -52674 -54240 -42878
15188 -42878 -31472 -16823 -1199 6821 15093 29814 49953 27323 -3320 -11226 -16096 -28697
15176 -28697 -34016 -1873 8192 -14615 6903 39168 30493 456 6747 25567 38351 49525
15164 49525 42634 51821 25203 -11537 -5395 28419 16805 -10559 -57711 -32896 7051 -1645
$$ packed form
15253b7018j058M799K749j5392j2216L562J6764J3510J7251K6938n834P556J0181
15240D1792j7771J2874o889j410k2826r243j4269q006J2593q434j4624j1055J389
15227d5879K7093p31P531L5349L254j4544j0518J3437L89o716k0077M006n771
15214a3177j3446O089J150k2234l757K451j2725m970j3797J8130K5873P512J6070
15201f831Q788q031l564K8222k6060m1689k0255J65k789r949K9319j566J1362
15188d2878J1406J4649J5624Q020Q272J4721K0139k2630l0643p906m870j2601
15176b8697n319L2143J0065k2807K1518L2265q675l0037O291J8820J2784J1174
15164D9525o891R187k6618l6740O142L3814j1614k7364m7152K4815L9947q696
$$ plain form
15152 -1645 9389 10914 40374 43469 37283 38033 -2572 -11251 -7482 -10771 -22285 -32291 -33703 -22917
15138 -22917 -26454 -42561 -52625 -52081 -38932 -42281 -38297 -23888 -20005 -29344 -30237 -11557 -22062
15125 -22062 -58267 -76766 -63218 -23309 -35309 -51289 -49622 -34414 -43708 -44774 -76981 -58257
15113 -58257 -619 28770 8987 13909 7910 5577 -8195 -18622 -8352 -17885 -32348 -13082
15101 -13082 -27569 -30940 -35990 -44896 -22744 -15378 -22583 -29582 -49669 -20519 13311 19246 -5935
15088 -5935 -19838 -11378 2219 8069 15579 35729 39404 46359 32290 13064 -1353 10624 42853
15075 42853 57222 28490 -19047 -46205 -31013 -12066 -12572 -27293 -17249 7677 4769 -10264
15063 -10264 -13190 4813 3234 -23990 -54564 -37924 -6000 8105 835 10279 7796 -3395 -15718
$$ packed form
15152a645J1034J525K9460L095o186P50m0605q679L769l289j1514j0006j412J0786
15138b2917l537j6107j0064N44J3149l349L984J4409L883r339q93J8680j0505
15125b2062l6205j8499J3548L9909j2000j5980J667J5208r294j066l2207J8724
15113e8257N7638K9389j9783M922n999k333j3772j0427J0270r533j4463J9266
15101a3082j4487l371n050q906K2152P366p205o999k0087K9150L3830N935k5181
15088e935j3903Q460J3597N850P510K0150L675O955j4069j9226j4417J1977L2229
15075D2853J4369k8732m7537k7158J5192J8947n06j4721J0044K4926k908j5033
15063a0264k926J8003j579k7224l0574J6640L1924J4105p270R444k483j1191j2323
$$ plain form
15050 -15718 -20443 -29603 -18184 -12448 3869 -461 17577 22805 9304 12062 320 -20681 -36891
15037 -36891 -45740 -35516 -14933 -5888 -23880 -23093 -19544 -17293 -9349 -3513 8482 6028 7577 27442
15023 27442 19333 12607 34806 30482 34911 51339 46695 19568 6970 -21543 -19927 -6968 13404
15010 13404 -6294 -18822 20271 50745 12528 -12024 -2378 -4349 -19240 -31081 -17208 -10267
14998 -10267 -16328 -12532 -12031 -20631 -36201 -49786 -37530 -32596 -59242 -49481 -39407 -45447 -23044
14985 -23044 -23125 -37846 -27144 -24262 -6877 -3232 -7543 -28084 -30650 -36747 -25954 -41334 -48152
14972 -48152 -42344 -21329 -30468 -30748 -32985 -35447 -37964 610 6809 -20420 -27775 3627 2298 21917
14958 21917 20029 40728 24785 11170 -21271 -37542 -25937 -5591 5175 9298 -15303 -40601
$$ packed form
15050a5718m725r160J1419N736J6317m330J8038N228j3501K758j1742k1001j6210
15037c6891q849J0224K0583R045j7992P87L549K251P944N836J1995k454J549J9865
15023B7442q109o726K2199m324M429J6428m644k7127j2598k8513J616J2959K0372
15010A3404j9698j2528L9093L0474l8217k4552R646j971j4891j1841J3873O941
14998a0267o061L796N01q600j5570j3585J2256M934k6646R761J0074o040K2403
14985b3044q1j4721J0702K882J7385L645m311k0541k566o097J0793j5380o818
14972d8152N808K1015r139k80k237k462k517L8574O199k7229p355L1402j329J9619
14958B1917j888K0699j5943j3615l2441j6271J1605K0346J0766M123k4601k5298
$$ plain form
14946 -40601 -55924 -16306 8402 -22415 -36050 -32069 -23613 -33459 -60724 -41009 -19816 -22364
14934 -22364 -19253 3174 -2026 1166 -8866 -18838 -21446 -27687 -28774 -32220 -61869 -66605 -55809
14921 -55809 -52791 -27631 17636 20987 6788 10742 8270 16124 17365 31400 12963 -13073 -15323
14908 -15323 -3926 -9778 -4626 -3787 -18044 -4319 -7861 -18623 -32335 -27395 -47756 -43020 -29117
14895 -29117 -20940 -15120 -14743 -35573 -54276 -32240 -8504 -10529 423 12191 21276 -5172 -26286
14882 -26286 -31504 -23063 6749 3724 -4251 -21247 -22953 -13617 15375 33993 5887 28540 32873
14869 32873 4469 -20382 -30725 -20756 16909 31812 30732 45335 42309 47585 29646 3409
14857 3409 18839 5186 1369 -10883 -20787 15788 39299 28439 15188 -18551 -36850 -18032
$$ packed form
14946d0601j5323L9618K4708l0817j3635L981Q456r846k7265J9715K1193k548
14934b2364L111K2427n200L192j0032r972k608o241j087l446k9649m736J0796
14921e5809L018K5160M5267L351j4199L954k472P854J241J4035j8437k6036k250
14908a5323J1397n852N152Q39j4257J3725l542j0762j3712M940k0361M736J3903
14895b9117Q177N820L77k0830j8703K2036K3736k025J0952J1768R085k6448k1114
14882b6286n218Q441K9812l025p975j6996j706R336K8992J8618k8106K2653M333
14869C2873k8404k4851j0343R969L7665J4903j080J4603l026N276j7939k6237
14857C409J5430j3653l817j2252r904L6575K3511j0860j3251l3739j8299J8818
$$ plain form
14845 -18032 11225 22546 15697 -15398 -32589 -32034 -42549 -33405 -31772 -24187 -13333 -2669 -13741
14832 -13741 -18197 -28124 4686 -24594 -88886 -65981 -28900 -8448 18535 4259 -19975 -8027
14820 -8027 2438 17413 23329 12199 15479 12852 -6360 -7184 11378 28750 28582 -19172 -23637
14807 -23637 -36829 -49439 -61379 -56899 -48219 -64697 -65982 -45464 -48826 -56958 -44369 -33753 -26068
14794 -26068 -18734 25909 17491 -16089 -20896 -14497 -1699 11453 -5984 -5294 -15603 3234 4250
14781 4250 -13866 -25750 -41280 -19607 17414 -1555 -37638 -35703 -5332 11450 12896 16121
14769 16121 22988 26510 19412 7612 7135 10863 18496 -10196 -16163 -1834 37819 49193 16088
14756 16088 -4495 -11621 -8748 -13828 -39360 -45302 -27514 -24787 -41781 -71304 -78040 -82476 -75915
$$ packed form
14845a8032K9257J1321o849l1095j7191N55j0515R144J633P585J0854J0664j1072
14832a3741m456r927L2810k9280o4292K2905L7081K0452K6983j4276k4234J1948
14820h027J0465J4975N916j1130L280k627j9212q24J8562J7372j68m7754m465
14807b3637j3192j2610j1940M480Q680j6478j285K0518l362q132J2589J0616P685
14794b6068P334M4643q418l3580m807O399J2798J3152j7437O90j0309J8837J016
14781D250j8116j1884j5530K1673L7021j8969l6083J935L0371J6782J446L225
14769A6121O867L522p098j1800m77L728P633k8692n967J4329L9653J1374l3105
14756A6088k0583p126K873n080k5532n942J7788K727j6994k9523o736m436O561
$$ plain form
14743 -75915 -66482 -42097 6497 32321 26123 13568 -31974 -34300 -10183 -8283 18316 7875
14731 7875 -19038 -22160 -33141 -48131 -34947 -25498 -12743 -29833 -40949 -465 1656 -22175
14719 -22175 -9433 2933 5234 -13651 -7449 -4495 -18044 7347 4788 -3778 34042 47631 6612
14706 6612 -12102 -16818 1337 3302 10836 -11712 -23853 -15882 -21642 -30121 -52982 -64403 -55750
14693 -55750 -57145 -24122 -3451 -10000 11850 3024 -6943 -19048 -11145 12964 22699 -14653 -29032
14680 -29032 -3544 -633 -7280 -17722 -29184 -41226 -45778 -64350 -58354 -49611 -54983 -46350 -40944
14667 -40944 -25979 -31336 -43244 -60130 -56486 -66196 -60042 -60054 -46330 -22024 -20877 11787 1986
14654 1986 -12034 -7384 -18389 -25380 -25321 -12733 -28310 -35970 -43398 -17486 25655 28164 25431 26173
$$ packed form
14743g5915R433K4385M8594K5824o198j2555m5542k326K4117J900K6599j0441
14731G875k6913l122j0981j4990J3184R449J2755j7090j1116M0484K121k3831
14719b2175J2742J2366K301j8885O202K954j3549K5391k559q566L7820J3589m1019
14706F612j8714m716J8155J965P534k2548j2141P971n760q479k2861j1421Q653
14693e5750j395L3023K0671o549K1850q826r967j2105P903K4109R735l7352j4379
14680b9032K5488K911o647j0442j1462j2042m552j8572N996Q743n372Q633N406
14667d0944J4965n357j1908j6886L644r710O154j2J3724K4306J147L2664r801
14654A986j4020M650j1005o991N9J2588j5577p660p428K5912M3141K509k733P42
$$ plain form
14640 26173 21453 -642 -13139 -14060 19561 17073 -2278 11762 -1252 29528 37544 28901 4625
14627 4625 -20931 -11824 -31437 -18317 -30504 -33013 -17534 -12150 -18337 -52830 -56576 -45491 -30105
14614 -30105 -28850 14069 22593 8423 -6451 -20731 4034 -15771 -12009 -15384 -14566 12804 3133
14601 3133 -14834 -466 8348 -4961 -18217 -29361 -24950 -5279 12587 -5649 -16105 -24477
14589 -24477 -21108 -5776 -1137 -13834 -3080 11094 277 -28122 -24889 -2939 16947 -5894
14577 -5894 -28965 -28219 -8544 8312 23978 15347 7935 -5981 -22124 -33901 -46138 -59275 -47900
14564 -47900 -11720 -14357 -14209 -13343 -17248 -17845 -8549 19714 33162 4158 -41150 -21712 9132
14551 9132 9783 2212 9960 7267 -20123 -34829 -29098 -21808 -18690 211 8351 13659 -3924 -18216
$$ packed form
14640B6173m720k2095j2497r21L3621k488j9351J4040j3014L0780Q016q643k4276
14627D625k5556R107j9613J3120j2187k509J5479N384o187l4493l746J1085J5386
14614c0105J255M2919Q524j4170j4874j4280K4765j9805L762l375Q18K7370r671
14601C133j7967J4368Q814j3309j3256j1144M411J9671J7866j8236j0456q372
14589b4477L369J5332M639j2697J0754J4174j0817k8399L233K1950J9886k2841
14577e894k3071P46J9675J6856J5666q631p412j3916j6143j1777j2237j3137J1375
14564d7900L6180k637J48Q66l905n97R296K8263J3448k9004m5308J9438L0844
14551I132O51p571P748k693k7390j4706N731P290L118J8901Q140N308j7583j4292
$$ plain form
14537 -18216 -13686 -22012 -8518 -20204 -10183 11479 -9767 -19065 -18410 -22087 -27121 -16626 34720
14524 34720 20779 -2056 -29760 -57576 -34660 -1512 -2255 -18379 7820 12934 -27006 -37269
14512 -37269 379 -8159 7536 3718 15321 16069 17724 10691 -2116 -8126 7420 10815 5670
14499 5670 13167 -27040 -35722 -3100 70 19615 20351 1857 -16316 -34093 -46658 -38348 -37350
14486 -37350 -35460 -7270 15900 -15728 -45256 -45253 -35478 -25902 -9863 -9998 -11346 4731 -7884 4952
14472 4952 3076 -8596 -21413 4430 33276 35297 34115 4600 -41466 -36557 -16916 -29212 -27575
14459 -27575 -17893 -34303 -55517 -54814 -60582 -84788 -95549 -69722 -50455 -17807 -13083 -3408 2305
14446 2305 -5785 4739 1473 10703 22966 8165 -22901 -13662 -10710 -11735 -9237 -1778 19725
$$ packed form
14537a8216M530q326J3494j1686J0021K1662k1246r298O55l677n034J0495N1346
14524C4720j3941k2835k7704k7816K2916L3148p43j6124K6199N114l9940j0263
14512c7269L7648q538J5695l818J1603P48J655p033j2807o010J5546L395n145
14499E670P497m0207q682L2622L170J9545P36j8494j8173j7777j2565Q310R98
14486c7350J890K8190K3170l1628k9528LR775R576J6039j35j348J6077j2615J2836
14472D952j876j1672j2817K5843K8846K021j182k9515m6066M909J9641j2296J637
14459b7575R682j6410k1214P03n768k4206j0761K5827J9267L2648M724R675N713
14446B305q090J0524l266R230J2263j4801l1066R239K952j025K498P459K1503
$$ plain form
14433 19725 9521 6639 -36458 -56968 -45505 -10035 -1557 14365 27018 58950 65672 32967
14421 32967 38339 38908 7619 -15166 -37790 -30756 -31119 -21545 -891 -16643 -38979 -26824 -11923
14408 -11923 -6186 16514 -2763 -12644 -17628 -18224 27663 30963 39196 20803 6409 19755 14707
14395 14707 30350 54007 63441 41552 22378 30124 40983 58702 53461 24803 36497 34093
14383 34093 43840 33578 36267 44661 60030 73642 60198 40281 16262 -2804 -22552 -9298
14371 -9298 -6128 -3145 28924 838 -11801 -8902 11650 14588 3538 -15717 -125 20695 13676
14358 13676 10136 25102 18650 21257 31643 30891 24320 49613 68199 62042 40413 30624 46232
14345 46232 60658 27443 7962 31195 26130 15567 -346 -11060 -1304 16503 38256 56770
$$ packed form
14433A9725j0204k882m3097k0510J1463L5470Q478J5922J2653L1932O722l2705
14421C2967N372N69l1289k2785k2624P034l63R574K0654j5752k2336J2155J4901
14408a1923N737K2700j9277r881m984n96M5887L300Q233j8393j4394J3346n048
14395A4707J5643K3657R434k1889j9174P746J0859J7719n241k8658J1694k404
14383C4093R747j0262K689Q394J5369J3612j3444j9917k4019j9066j9748J3254
14371i298L170K983L2069k8086j2639K899K0552K938j1050j9255J5592K0820p019
14358A3676l540J4966o452K607J0386p52o571K5293J8586o157k1629r789J5608
14345D6232J4426l3215j9481K3233n065j0563j5913j0714R756J7807K1753J8514
$$ plain form
14333 56770 96925 91042 65411 48668 30271 28670 33937 14893 30570 19454 5573 18052
14321 18052 23407 44069 43938 15955 13180 -1465 -8751 10889 32227 17152 1995 -11573 -4718
14308 -4718 -2588 17962 28407 11248 -21193 -42374 -40687 -27713 -28751 -42630 -62735 -32435
14296 -32435 1050 43875 41103 13162 -12058 -13765 -10532 -55905 -45035 -41461 -36212 -33559 -43594
14283 -43594 -57252 -35885 -26419 -18276 -32383 -16702 -2815 -33339 -50858 -35341 -39115 -18676
14271 -18676 29761 19842 4075 8875 -5518 -16543 -33724 -44913 -39698 -31173 -13207 -54224
14259 -54224 -63623 -43283 -46583 -24503 1993 -5033 -31543 -31979 -1136 16157 8046 9539 13198
14246 13198 13153 4078 10535 -8385 -36931 -36887 -53486 -48321 -19060 -37205 -41681 -38218 -22082 -4095
$$ packed form
14333E6770M0155n883k5631j6743j8397j601N267j9044J5677j1116j3881J2479
14321A8052N355K0662j31k7983k775j4645p286J9640K1338j5075j5157j3568O855
14308d718K130K0550J0445j7159l2441k1181J687J2974j038j3879k0105L0300
14296c2435L3485M2825k772k7941k5220j707L233m5373J0870L574N249K653j0035
14283d3594j3658K1367R466Q143j4107J5681J3887l0524j7519J5517l774K0439
14271a8676M8437r919j5767M800j4393j1025j7181j1189N215Q525J7966m1017
14259e4224r399K0340l300K2080K6496p026k6510m36L0843J7293q111J493L659
14246A3198m5r075O457j8920k8546M4j6599N165K9261j8145m476L463J6136J7987
$$ plain form
14232 -4095 -10676 -1501 5984 -2676 -21711 5009 4013 -10013 -27584 -4067 -17817 -38087 -54572
14219 -54572 -50196 -45319 -45543 -41651 -49957 -27580 -36296 -36887 -31333 -30862 -42466 -4035 25863 14128
14205 14128 -9392 1121 43516 62802 41915 12394 3897 20160 22856 15609 4693 12424
14193 12424 20235 -18785 -51138 -54077 -36468 -23891 -11729 -38119 -34642 6415 39474 42984
14181 42984 13807 5501 -5504 -5891 -4562 16587 12473 -16489 -13836 -13824 -21632 -42340 -33867 -6942
14167 -6942 -7510 -37082 -32597 -13192 3566 12227 -12659 -33683 -81069 -43852 10691 28060 18392
14154 18392 41293 44059 41654 37793 49382 34248 21699 15146 5872 -4451 -8792 -5626 12707
14141 12707 15084 4550 -3099 -12154 9729 38800 46302 22178 -1547 -2934 8289 6264 -6173
$$ packed form
14232d095o581R175P485q660j9035K6720r96j4026j7571K3517j3750k0270j6485
14219e4572M376M877k24L892q306K2377q716n91N554M71j1604L8431K9898j1735
14205A4128k3520J0513M2395J9286k0887k9521q497J6263K696p247j0916P731
14193A2424P811l9020l2353k939J7609J2577J2162k6390L477M1057L3059L510
14181D2984k9177q306j1005l87J329K1149m114k8962K653J2p808k0708Q473K6925
14167f942n68k9572M485J9405J6758Q661k4886k1024m7386L7217N4543J7369r668
14154A8392K2901K766k405l861J1589j5134j2549o553r274j0323m341L166J8333
14141A2707K377j0534p649r055K1883K9071P502k4124k3725j387J1223k025j2437
$$ plain form
14128 -6173 -12093 16703 35493 42671 24379 14118 14536 5081 -10653 -9620 -9731 -24966 -39503
14115 -39503 -16476 -1469 29207 37707 23581 12800 -19875 -18752 -2686 1867 6775 8234 9545
14102 9545 10767 13880 31669 26399 17749 7382 8215 -6010 7406 9535 -4483 -38385 -40077
14089 -40077 -2910 -5329 -17031 -29601 -6039 13428 4294 12433 47021 41267 -2659 -19285
14077 -19285 -33087 -46560 -51324 -28574 -29195 -17321 -24890 -41330 -47743 -23467 5574 11778 -6371
14064 -6371 -1931 3235 10321 -16942 -11746 -12053 -12522 -803 14261 23486 28926 39057 47682 33808
14050 33808 14878 10256 4238 -5433 -16848 -17603 -12285 -13255 -5888 -2002 -592 -19494 3980 18968
14036 18968 5270 8144 6716 27625 -6436 -11864 -17769 -49079 -43205 -6873 17664 24173 23803
$$ packed form
14128f173n920K8796J8790P178j8292j0261M18r455j5734J033j11j5235j4537
14115c9503K3027J5007L0676Q500j4126j0781l2675J123J6066M553M908J459J311
14102I545J222L113J7789n270q650j0367Q33j4225J3416K129j4018l3902j692
14089d0077L7167k419j1702j2570K3562J9467r134Q139L4588n754m3926j6626
14077a9285j3802j3473m764K2750o21J1874p569j6440o413K4276K9041O204j8149
14064f371M440N166P086k7263N196l07m69J1719J5064R225N440J0131Q625j3874
14050C3808j8930m622o018r671j1415p55N318r70P367L886J410j8902K3474J4988
14036A8968j3698K874j428K0909l4061n428n905l1310N874L6332K4537O509l70
$$ plain form
14023 23803 -6523 -2657 -177 -14160 -12043 22528 21921 -2535 -16765 13561 44328 22888 -6125
14010 -6125 9859 29036 26250 19827 25127 27790 42055 53431 26415 -21610 -30075 -31562 14328
13997 14328 20356 22938 28676 7129 26699 28543 22376 10103 -20080 -26039 -15854 -5356 -15526
13984 -15526 -6743 26409 56742 61154 48249 25905 25245 31075 19834 28899 8725 -8887 9677
13971 9677 -1120 -20618 -28218 -24136 -1077 -16463 -8496 -27760 -38312 -33887 -14801 25091 15578
13958 15578 14062 26927 21171 14265 37912 63319 67500 58101 22935 -14941 -17783 33814 72077
13945 72077 51959 6809 -2695 28120 39639 37979 55999 55699 27221 12513 16330 5524 24664
13932 24664 30728 34368 47650 58055 56891 53066 76433 72831 57157 31171 44230 25570 -6760
$$ packed form
14023B3803l0326L866K480j3983K117L4571o07k4456j4230L0326L0767k1440k9013
14010f125J5984J9177k786o423N300K663J4265J1376k7016m8025q465j487M5890
13997A4328O028K582N738k1547J9570J844o167j2273l0183n959J0185J0498j0170
13984a5526Q783L3152L0333M412j2905k2344o60N830j1241R065k0174j7612J8564
13971I677j0797j9498p600M082K3059j5386P967j9264j0552M425J9086L9892r513
13958A5578j516J2865n756o906K3647K5407M181r399l5166l7876k842N1597L8263
13945G2077k0118m5150r504L0815J1519j660J8020l00k8478j4708L817j0806J9140
13932B4664O064L640J3282J0405j164l825K3367l602j5674k5986J3059j8660l2330
$$ plain form
13919 -6760 -17845 -20748 -3935 3486 8120 15480 -3237 -24068 -7220 8845 27010 11511 8614
13906 8614 20341 18486 21779 29114 9833 -2658 -8811 18107 42637 19171 8024 -8323 482
13893 482 4701 5666 14121 6741 9214 -9067 -16202 6763 24503 15173 -613 -4686 -9673 -14497
13879 -14497 4542 -23393 -22451 1255 17480 39045 46134 40145 39117 21451 363 -14337 9677
13866 9677 38077 43114 47878 29073 25844 32107 52199 78739 89015 69933 62032 45547 39390
13853 39390 38352 36100 22005 -1929 -18983 -32212 -8247 11973 -6386 -17984 -30619 -24177
13841 -24177 -12429 21921 67706 71918 22960 7452 9409 8580 30949 34565 23564 20201 34511
13828 34511 58515 42701 10544 3001 17574 35075 83736 64542 70099 64334 56111 16618
$$ packed form
13919f760j1085k903J6813P421M634P360j8717k0831J6848J6065J8165j5499k897
13906H614J1727j855L293P335j9281j2491o153K6918K4530k3466j1147j6347Q805
13893D82M219R65Q455p380K473j8281p135K2965J7740r330j5786m073m987m824
13879a4497J9039k7935R42K3706J6225K1565P089n989j028j7666k1088j4700K4014
13866I677K8400N037M764j8805l229O263K0092K6540J0276j9082p901j6485o157
13853C9390j038k252j4095k3934j7054j3229K3965K0220j8359j1598j2635O442
13841b4177J1748L4350M5785M212m8958j5508J957q29K2369L616j1001l363J4310
13828C4511K4004j5814l2157p543J4573J7501M8661j9194N557n765q223l9493
$$ plain form
13816 16618 23544 14972 -19209 -31241 -27332 7457 45733 63725 25625 12184 5204 -23339
13804 -23339 -4896 38733 55320 62268 52707 65178 43273 34989 36298 13012 -17745 -8135 10903
13791 10903 17558 18195 23293 13941 -26009 -45479 -57994 -9238 -2059 -2740 -8376 -20141 -23788 -14719
13777 -14719 -28280 -27500 -18341 -2540 6253 1119 5937 7059 -3561 -24276 -8704 8260 10482
13764 10482 21402 33707 49112 27846 4990 13113 5248 -14670 11381 40593 57996 97510
13752 97510 109493 132689 158499 168661 166193 188850 194274 190615 174954 143777 122564 125796
13740 125796 125848 131524 165227 165365 147655 116872 115153 105435 92083 60450 78338 74767 62224
13727 62224 45525 70833 94670 90227 87080 94289 61495 29950 28892 21165 10806 2222 25603
$$ packed form
13816A6618O926q572l4181j2032L909L4789L8276J7992l8100j3441o980k8543
13804b3339J8443M3629J6587O948r561J2471k1905q284J309k3286l0757R610J9038
13791A0903O655O37N098r352l9950j9470j2515M8756P179o81n636j1765l647R069
13777a4719j3561P80R159J5801Q793n134M818J122j0620k0715J5572J6964K222
13764A0482J0920J2305J5405k1266k2856Q123p865j9918K6051K9212J7403L9514
13752I7510J1983K3196K5810J0162k468K2657N424l659j5661l1177k1213L232
13740A25796N2N676L3703J38j7710l0783j719r718j3352l1633J7888l571j2543
13727F2224j6699K5308K3837m443l147P209l2794l1545j058p727j0359q584K3381
$$ plain form
13714 25603 34685 11083 9954 41536 44759 59614 73061 49996 58694 64106 42732 24713 34559
13701 34559 53737 59059 47558 49617 38816 36039 24218 14960 -6388 -12960 3898 27538 13572
13688 13572 -20891 -16155 7505 12110 25861 18200 -22565 -36712 -51306 -46631 -35674 -17084
13676 -17084 29714 31170 28606 37335 4321 -9609 -16358 492 8778 -13683 -6090 -7362 -3390
13663 -3390 1707 -5861 121 -20 1437 -5795 -11384 3898 6508 -2981 9861 21686 13685 -6335
13649 -6335 -180 -2271 -28818 -32842 -7115 -1500 -16814 1037 -15186 -1352 17013 13901 -5223
13636 -5223 4370 13182 12742 20216 5507 6461 28495 20323 21959 29103 19269 31329 9881 -31894
13622 -31894 -23612 -7400 -3574 16278 2608 -1010 -4240 8102 22 -2315 6025 25049 4885
$$ packed form
13714B5603R082k3602j129L1582L223J4855J3447k3065Q698N412k1374j8019R846
13701C4559J9178N322j1501K059j0801k777j1821r258k1348o572J6858K3640j3966
13688A3572l4463M736K3660M605J3751p661m0765j4147j4594M675J0957J8590
13676a7084M6798J456k564Q729l3014j3930o749J6850Q286k2461P593j272L972
13663c390N097p568N982j41J457p232n589J5282K610r489J2842J1825q001k0020
13649f335O155k091k6547m024K5727N615j5314J7851j6223J3834J8365l112j9124
13636e223R593Q812m40P474j4709R54K2034q172J636P144r834J2060k1448m1775
13622c1894Q282J6212L826J9852j3670l618l230J2342q080k337Q340J9024k0164
$$ plain form
13609 4885 -27983 -7946 28244 22080 29568 36967 21353 30759 57859 51920 24599 22013 30758
13596 30758 20663 43130 38511 23941 20038 43164 25928 28833 23351 24497 41928 56419 55631
13583 55631 44587 48054 30522 30975 54087 28548 21942 43094 32649 21519 32944 59122
13571 59122 53883 39226 35605 47049 41393 36800 54382 68470 70295 68059 55032 64110 58795
13558 58795 71169 82653 110747 73210 58204 48246 54473 49370 49029 52332 54969 55432 43229
13545 43229 54659 63366 36517 -10611 5276 6499 11155 3760 5805 10757 27711 40673 64986
13532 64986 86971 90799 93396 65508 14808 -14324 8386 31632 33624 28637 15244 22676 35493
13519 35493 33351 32884 38679 44923 63757 71402 62788 50775 48079 42488 14166 15144 17513 -75
$$ packed form
13609D885l2868K0037L6190o164P488P399j5614R406K7100n939k7321k586Q745
13596C0758j0095K2467m619j4570l903K3126j7236K905n482J146J7431J4491p88
13583E5631j1044L467j7532M53K3112k5539o606K1152j0445j1130J1425K6178
13571E9122n239j4657l621J1444n656m593J7582J4088J825k236j3027R078n315
13558E8795J2374J1484K8094l7537j5006r958O227n103l41L303K637M63j2203
13545D3229J1430Q707k6849m7128J5887J223M656p395K045M952J6954J2962K4313
13532F4986K1985L828K597k7888n0700k9132K2710K3246J992m987j3393P432J2817
13519C5493k142m67N795O244J8834P645q614j2013k696n591k8322R78K369j7588
$$ plain form
13505 -75 -11896 -9947 21123 27989 38160 28552 7194 16954 31528 26135 31273 17557 15209 4792
13491 4792 14920 18762 17318 28847 55509 74805 67437 39832 12882 16574 -16421 -29176 -2266
13478 -2266 37646 28932 1433 6362 32084 28226 28292 37889 35732 49080 68323 78111 51102 37183
13464 37183 6647 8763 -9266 -20262 -25311 -20071 -53153 -36482 1384 13387 30819 37640
13452 37640 56246 63931 51311 37366 51630 72524 75072 101099 62272 36929 9779 -6957
13440 -6957 19489 5897 18202 36335 35531 38854 23533 44971 54323 72300 78238 69811 44180
13427 44180 40891 77146 98883 81612 71469 52628 63944 93548 97516 112634 119530 107913
13415 107913 117997 127395 142729 150633 152634 167836 209410 230295 258160 273945 308499 335657
$$ packed form
13505g5j1821J949L1070O866J0171r608k1358R760J4574n393N138j3716k348j0417
13491D792J0128L842j444J1529K6662J9296p368k7605k6950L692l2995j2755K6910
13478b266L9912q714k7499M929K5722l858O6R597k157J3348J9243R788k7009j3919
13464C7183l0536K116j8029j0996n049N240l3082J6671L7866J2003J7432O821
13452C7640J8606P685j2620j3945J4264K0894K548K6027l8827k5343k7150j6736
13440f957K6446j3592J2305J8133q04L323j5321K1438R352J7977N938q427k5631
13427D4180l289L6255K1737j7271j0143j8841J1316K9604L968J5118O896j1617
13415A07913J0084R398J5334P904K001J5202M1574K0885K7865J5785L4554K7158
$$ plain form
13403 335657 359651 382881 405154 434177 484559 510608 527476 515450 530372 509717 509046 492291
13391 492291 467001 430377 397880 371545 364406 353109 300624 249423 252751 278883 285054 272019
13379 272019 282577 281798 278305 272690 294409 323535 367599 412887 446484 479759 503346 539381
13367 539381 575480 590904 576775 556899 526067 495625 457277 420148 353645 296880 276745
13356 276745 271503 216200 217875 212603 194377 176634 158433 137312 147104 175355 170212 138096
13344 138096 107554 101094 96451 76553 98439 111205 108747 109374 108264 61746 56119 48408 53973
13331 53973 56462 66946 99871 92475 107340 93312 70779 70246 81009 107370 105912 91342 100638
13318 100638 108474 92414 89637 73293 73886 94243 101667 116652 96547 93893 81074 113317 102192
$$ packed form
13403C35657K3994K3230K2273K9023N0382K6049J6868j2026J4922k0655o71j6755
13391D92291k5290l6624l2497k6335p139j1297n2485n1201L328K6132O171j3035
13379B72019J0558p79l493n615K1719K9126M4064M5288L3597L3275K3587L6035
13367E39381L6099J5424j4129j9876l0832l0442l8348l7129o6503n6765k0135
13356B76745n242n5303J675n272j8226j7743j8201k1121R792K8251n143l2116
13344A38096l0542o460m643j9898K1886J2766k458O27j110m6518n627p711N565
13331E3973K489J0484L2925p396J4865j4028k2533n33J0763K6361j458j4570R296
13318A00638P836j6060k777j6344N93K0357P424J4985k0105k654j2819L2243j1125
$$ plain form
13305 102192 97046 106495 122256 123015 141966 170753 182961 212168 245548 281099 281762 290245 324896
13292 324896 360171 388522 430258 424014 445355 494970 490645 489526 494585 488265 462699 425815
13280 425815 386517 346075 354500 356562 335373 302041 294880 272958 259954 249217 227228 196841
13268 196841 221275 255838 265576 263147 269735 270404 277564 297386 325275 334696 360304 393375 442796
13255 442796 471930 490090 484482 496180 513616 500405 483660 455214 415221 385203 361820 342003
13243 342003 317526 291022 271287 227209 193151 156856 141742 137082 128163 123653 121992 116324
13231 116324 124986 151085 141014 144858 135998 124873 124438 98563 61075 54414 52761 41320 63899
13218 63899 87056 93164 94170 97183 89966 68133 48172 43406 66162 65744 4480 7211 36703
$$ packed form
13305A02192n146R449J5761P59J8951K8787J2208K9207L3380L5551O63Q483L4651
13292C24896L5275K8351M1736o244K1341M9615m325j119N059o320k5566l6884
13280D25815l9298m0442Q425K062k1189l3332p161k1922j3004j0737k1989l0387
13268A96841K4434L4563R738k429O588O69P160J9822K7889R421K5608L3071M9421
13255D42796K9134J8160n608J1698J7436j3211j6745k8446l9993l0018k3383j9817
13243C42003k4477k6504j9735m4078l4058l6295j5114m660q919m510j661n668
13231A16324Q662K6099j0071L844q860j1125m35k5875l7488o661j653j1441K2579
13218F3899K3157O108J006L013p217k1833j9961m766K2756m18o1264K731K9492
$$ plain form
13205 36703 37166 20470 36366 25288 25266 22711 24813 53629 48936 31816 24269 3915 -8458
13192 -8458 28666 63362 65859 46207 19488 4906 23086 18927 16280 37738 43292 19271 21665
13179 21665 21813 6193 18746 18845 31598 52558 63478 56669 30182 40764 92851 125282 104734
13166 104734 79378 42263 40284 78228 88215 101358 128841 139885 117798 129214 117903 99463
13154 99463 117067 126528 161300 188308 163328 174173 201206 220849 291292 408773 564588
13143 564588 799738 1081085 1254300 1227704 982580 683554 470637 351677 301066 252669
13133 252669 232435 210346 212675 191133 179872 205467 201436 176316 155065 124358 115437 135459
13121 135459 115838 100415 106990 104818 75624 79416 94713 90148 51186 54727 76457 81923 95847
$$ packed form
13205C6703M63j6696J5896j1078k2k555K102K8816m693j7120p547k0354j2373
13192h458L7124L4696K497j9652k6719j4582J8180m159k647K1458N554k4021K394
13179B1665J48j5620J2553R9J2753K0960J0920o809k6487J0582N2087L2431k0548
13166A04734k5356l7115j979L7944R987J3143K7483J1044k2087J1416j1311j8440
13154I9463J7604R461L4772K7008k4980J0845K7033J9643P0443J17481J55815
13143E64588K35150K81347J73215k6596k45124k99026k12917j18960n0611m8397
13133B52669k0234k2089K329k1542j1261K5595m031k5120k1251l0707q921K0022
13121A35459j9621j5423O575k172k9194L792J5297m565l8962L541K1730N466J3924
$$ plain form
13108 95847 131140 190098 228377 242705 272051 362824 487950 683167 960102 1422392 2147496
13097 2147496 3029295 3737617 3800388 3162469 2219627 1432506 951352 703851 543288 447906
13087 447906 400911 358024 290427 256118 228397 192940 162855 149575 157927 157803 147201 144221
13075 144221 159145 131467 119348 122072 146215 157046 160071 172353 197040 215728 215261 194182
13063 194182 183513 196456 252257 337562 436697 532849 649858 832182 1086225 1488495 2091588
13052 2091588 2943853 3761620 4031149 3496990 2533034 1651808 1058527 738241 537181
13043 537181 418532 368647 316477 263642 241516 243108 209968 184610 165425 131318 136389 159293
13031 159293 156049 148694 133117 139922 143934 136432 126579 121948 109166 99232 111439 127761 153605
$$ packed form
13108I5847L5293N8958L8279J4328K9346R0773J25126J95217K76935M62290P25104
13097B147496Q81799P08322O2771o37919r42842p87121m81154k47501j60563r5382
13087D47906m6995m2887o7597l4309k7721l5457l0085j3280Q352j24j0602k980
13075A44221J4924k7678j2119K724K4143J0831L025J2282K4687J8688m67k1079
13063A94182j0669J2943N5801Q5305R9135R6152J17009J82324K54043M02270O03093
13052B091588Q52265Q17767K69529n34159r63956q81226n93281l20286k01060
13043E37181j18649m9885n2170n2835k2126J592l3140k5358j9185l4107N071K2904
13031A59293l244p355j5577O805M012p502r853m631j2782r934J2207J6322K5844
$$ plain form
13018 153605 166619 214027 265330 314473 316233 304074 329642 385159 444943 546737 723629
13007 723629 975366 1273877 1442049 1320749 981334 659121 453838 335784 253930 211872
12997 211872 199925 219702 207785 175258 172356 189711 203147 205121 189656 148013 136523 144647
12985 144647 123162 108192 83155 102998 117150 126419 128735 129353 149750 147798 177351 195348
12973 195348 212791 230071 246216 233160 195220 132286 120160 122800 115294 105122 114832 126972
12961 126972 130440 131372 128459 84732 50333 59587 58779 42770 64199 92024 87882 81706 70798
12948 70798 72902 99422 66174 46547 67873 82047 88053 91412 82629 86885 58097 80065 95855
12935 95855 68714 72341 89031 78278 81959 92125 105107 126769 162754 189888 188320 183560
$$ packed form
13018A53605J3014M7408N1303M9143J760j2159K5568N5517N9784J01794J76892
13007G23629K51737K98511J68172j21300l39415l22213k05283j18054q1854m2058
12997B11872j1947J9777j1917l2527k902J7355J3436J974j5465m1643j1490Q124
12985A44647k1485j4970k5037J9843J4152R269K316O18K0397j952K9553J7997
12973A95348J7443J7280J6145j3056l7940o2934j2126K640p506j0172R710J2140
12961A26972L468R32k913m3727l4399R254q08j6009K1429K7825m142o176j0908
12948G0798K104K6520l3248j9627K1326J4174O006L359q783M256k8788K1968J5790
12935I5855k7141L627J6690j0753L681J0166J2982K1662L5985K7134j568m760
$$ plain form
12923 183560 161690 144792 135669 121763 103035 97003 106447 98892 86506 83543 81097 78726 38063
12910 38063 21493 30758 50362 48946 52350 56591 88708 92427 100319 102900 109341 118210 107263
12897 107263 88329 80990 88578 65193 39856 36380 45078 67917 68543 63651 61250 74285 113476
12884 113476 138920 127382 87254 49236 29792 61649 60603 66611 73897 64662 73694 67053 53234
12871 53234 87447 98713 76973 42835 33568 43044 52379 20718 7492 16703 10291 -2880 19315
12858 19315 43438 58953 88503 90424 113356 141104 138552 122509 91997 92925 57509 22021
12846 22021 12413 18493 37901 51478 63988 70946 70727 61441 49788 36158 56527 78085 78650
12833 78650 69620 93046 134764 146090 132992 99043 51710 48911 46585 59382 63154 30475
$$ packed form
12923A83560k1870j6898r123j3906j8728o032R444p555j2386k963k446k371m0663
12910C8063j6570R265J9604j416L404M241L2117L719P892K581O441Q869j0947
12897A07263j8934p339P588k3385k5337l476Q698K2839O26m892k401J3035L9191
12884A13476K5444j1538m0128l8018j9444L1857j046O008P286r235R032o641j3819
12871E3234L4213J1266k1740l4138r267R476R335l1661j3226R211o412j3171K2195
12858A9315K4123J5515K9550J921K2932K7748k552j6043l0512R28l5416l5488
12846B2021r608O080J9408J3577J2510O958k19r286j1653j3630K0369K1558N65
12833G8650r030K3426M1718J1326j3098l3949m7333k799k326J2797L772l2679
$$ plain form
12821 30475 30468 40924 55797 60579 38768 29288 28994 46306 74802 78406 81969 82299 78923 115171
12807 115171 135293 138227 139750 144580 169638 193989 174491 138138 116155 112343 124530 140748
12795 140748 136359 147067 142291 134717 132526 118237 85348 52383 45846 61092 79547 84638 89123
12782 89123 88641 92114 83858 91119 119269 99859 71629 45969 44909 54860 44962 62987 75557
12769 75557 81694 74917 48895 42289 75140 127775 156433 176327 188457 201464 243667 250731
12757 250731 226812 214213 195873 154264 134485 128036 109436 109152 136325 141377 110402 74884
12745 74884 66536 81571 102085 88006 88984 111776 94686 59788 71649 119898 127551 126855 119191
12732 119191 105445 105252 121120 123004 106947 99076 115477 110456 86967 73176 66617 61151 97363
$$ packed form
12821C0475pJ0456J4873M782k1811r480k94J7312K8496L604L563L30l376L6248
12807A15171K0122K934J523M830K5058K4351j9498l6353k1983l812J2187J6218
12795A40748m389J0708m776p574k191j4289l2889l2965o537J5246J8455N091M485
12782H9123m82L473q256P261K8150j9410k8230k5660j060R951r898J8025J2570
12769G5557O137o777k6022o606L2851N2635K8658J9894J2130J3007M2203P064
12757B50731k3919j2599j8340m1609j9779o449j8600k84K7173N052l0975l5518
12745G4884q348J5035K0514j4079R78K2792j7090l4898J1861M8249P653o96p664
12732A19191j3746j93J5868J884j6057p871J6401n021k3489j3791o559n466L6212
$$ plain form
12719 97363 156326 190868 181141 170240 188175 194709 211393 233378 261130 250216 231059 180493
12707 180493 118331 89299 94968 119291 108996 88384 95266 57519 3024 14222 60150 82034
12695 82034 91661 99342 101953 90898 112274 118846 132969 161726 198939 219699 230054 228831 205514
12682 205514 190909 185544 168929 168926 136700 147878 138496 116184 129256 134358 154878 173370 189757
12669 189757 209285 228416 260008 282172 255546 198836 180154 201306 180120 164790 131211
12658 131211 139993 155819 140536 160056 152925 153354 158640 135615 116249 142592 186525 222702
12646 222702 239805 239777 229667 221587 223123 239367 245853 233841 208385 176765 155649 168625 169746
12633 169746 178953 176963 137258 131924 153254 196548 242125 251597 249330 233627 219262 206893
$$ packed form
12719I7363N8963L4542r727j0901J7935O534J6684K1985K7752j0914j9157n0566
12707A80493o2162k9032N669K4323j0295k0612O882l7747n4495J1198M5928K1884
12695H2034R627P681K611j1055K1376O572J4123K8757L7213K0760J0355j223k3317
12682B05514j4605n365j6615ll2226J1178r382k2312J3072N102K0520J8492J6387
12669A89757J9528J9131L1592K2164k6626n6710j8682K1152k1186j5330l3579
12658A31211Q782J5826j5283J9520p131M29N286k3025j9366K6343M3933L6177
12646B22702J7103k8j0110q080J536J6244O486j2012k5456l1620k1116J2976J121
12633A69746R207j990l9705n334K1330M3294M5577R472k267j5703j4365j2369
$$ plain form
12621 206893 205356 226117 249250 263188 257864 232752 214731 217370 213654 196095 186202 204642
12609 204642 222944 242382 287932 314841 300472 272044 230531 200699 199920 168699 159431 136972
12597 136972 114134 155920 168284 140207 142777 174940 221887 218534 179823 185170 190476 194690
12585 194690 198698 207403 207997 204613 214932 211331 215760 204817 230956 268620 245761 271402 327387
12572 327387 329699 269541 233754 212260 180577 171649 171560 156567 160861 137472 120390 133643 164919
12559 164919 150096 144269 113212 97470 80695 102694 119254 136087 158859 129695 116052 151718
12547 151718 134597 129216 158856 159213 142432 123905 143016 147978 126193 91434 83386 101919
12535 101919 114435 132792 141672 115072 111504 138066 131044 144175 153912 130347 111417 97949
$$ packed form
12621B06893j537K0761K3133J3938n324k5112j8021K639l716j7559r893J8440
12609B04642J8302J9438M5550K6909j4369k8428m1513k9832p79l1221r268k2459
12597A36972k2838M1786J2364k8077K570L2163M6947l353l8711N347N306M214
12585A94690M008Q705N94l384J0319l601M429j0943K6139L7664k2859K5641N5985
12572C27387K312o0158l5787k1494l1683q928q9j4993M294k3389j7082J3253L1276
12559A64919j4823n827l1057j5742j6775K1999J6560J6833K2772k9164j3643L5666
12547A51718j7121n381K9640L57j6781j8527J9111M962k1785l4759q048J8533
12535A01919J2516J8357Q880k6600l568K6562p022J3131R737k3565j8930j3468
$$ plain form
12523 97949 95117 99920 118723 123690 135534 133378 129392 103617 83129 75189 72405 62885 49597
12510 49597 65486 93136 108311 109490 150600 149131 137800 131562 125907 124540 126514 104261 67630
12497 67630 55403 36633 45382 65199 98817 113101 125803 112210 110136 89018 76427 84524
12485 84524 101525 109073 132394 154639 160655 178278 149435 125668 118975 111193 80090 64788
12473 64788 54686 61898 91528 108914 111411 113428 131417 143223 148218 164608 215686 291714
12461 291714 325338 309329 258168 184315 141635 133920 84966 66250 88109 105830 90371 60703
12449 60703 59051 108195 140666 141280 136406 114167 108802 129188 133184 141326 132252 103370 94731
12436 94731 93671 105881 77569 70524 58767 46374 50013 86696 115724 102825 103505 148634 140666
$$ packed form
12523I7949k832M803J8803M967J1844k156l986k5775k0488p940k784r520j3288
12510D9597J5889K7650J5175J179M1110j469j1331o238n655j367J974k2253l6631
12497F7630j2227j8770Q749J9817L3618J4284J2702j3593k074k1118j2591Q097
12485H4524J7001P548K3321K2245O016J7623k8843k3767o693p782l1103j5302
12473F4788j0102P212K9630J7386K497K017J7989J1806M995J6390N1078P6028
12461B91714L3624j6009n1161p3853m2680p715m8954j8716K1859J7721j5459k9668
12449F0703j652M9144L2471O14m874k2239n365K0386L996Q142r074k8882q639
12436I4731j060J2210k8312p045j1757j2393L639L6683K9028j2899O80M5129p968
$$ plain form
12423 140666 145186 174050 201185 217700 265075 311957 389647 481899 545899 619127 807116
12412 807116 1073969 1215136 1021969 711084 497845 361945 279235 237694 170819 134785
12402 134785 133011 135674 131816 140739 115670 111426 119706 121353 113674 125571 139778 129016 108270
12389 108270 110890 128563 122542 114626 106277 87348 110085 133814 143609 132610 131721 132622 148199
12376 148199 167097 180778 181387 207121 258243 258877 289748 344934 374075 341537 280081 241491
12364 241491 206596 200406 168061 138293 118026 128187 131954 113646 121476 116238 104684 68670
12352 68670 46898 29450 51068 99691 121960 141309 146696 174790 179180 176883 154600 135594
12340 135594 127220 96254 89952 76687 60872 75323 106543 133075 163171 165354 163619 172467
$$ packed form
12423A40666M520K8864K7135J6515M7375M6882P7690R2252O4000P3228J87989
12412H07116K66853J41167j93167l10885k13239j35900q2710m1541o6875l6034
12402A34785j774K663l858Q923k5069m244Q280J647p679J1897J4207j0762k0746
12389A08270K620J7673o021p916q349j8929K2737K3729R795j0999q89R01J5577
12376A48199J8898J3681O09K5734N1122O34L0871N5186K9141l2538o1456l8590
12364B41491l4895o190l2345k9768k0267J0161L767j8308P830n238j1554l6014
12352F8670k1772j7448K1618M8623K2269J9349N387K8094M390k297k2283j9006
12340A35594q374l0966o302j3265j5815J4451L1220K6532L0096K183j735Q848
$$ plain form
12328 172467 129469 102435 123967 126249 110953 102457 80001 108848 90514 68743 86787 109650
12316 109650 115956 104252 90106 91879 102384 116102 111241 128553 148181 186749 182864 181938 196601
12303 196601 193148 165691 150759 151796 143488 115033 109403 120350 105480 105302 113610 95954 106599
12290 106599 104649 71923 86338 99556 105318 110097 119936 131142 112854 85286 66277 46783
12278 46783 55752 97456 113199 122962 141326 148844 154683 158238 146818 122440 146197 153685 153002
12265 153002 131115 143407 174170 169134 181898 188628 184574 156023 105893 127508 163585 147605
12253 147605 114707 105345 120384 132040 143343 127744 108485 85037 89257 98719 149851 215542
12241 215542 284441 361079 415442 496816 550523 460731 350043 304342 259183 253257 241633
$$ packed form
12328A72467m2998k7034K1532K282j5296q496k2456K8847j8334k1771J8044K2863
12316A09650O306j1704j4146J773J0505J3718m861J7312J9628L8568l885r26J4663
12303A96601l453k7457j4932J037q308k8455n630J0947j4870j78Q308j7656J0645
12290A06599j950l2726J4415J3218N762M779R839J1206j8288k7568j9009j9494
12278D6783Q969M1704J5743R763J8364P518N839L555j1420k4378K3757P488o83
12265A53002k1887J2292L0763n036J2764O730m054k8551n0130K1615L6077j5980
12253A47605l2898r362J5039J1656J1303j5599j9259k3448M220R462N1132O5691
12241B15542O8899P6638N4363Q1374N3707q9792j10688m5701m5159n926j1624
$$ plain form
12230 241633 233829 219590 166872 154247 145245 145233 165661 190219 204953 215175 223363 220295 224585
12217 224585 217928 215981 196567 204794 214607 207259 198401 207701 193881 214174 226849 243035 251218
12204 251218 249154 274644 284804 284612 291131 290881 283891 277295 280573 291819 291864 340202 360697 363945
12190 363945 392269 394846 439777 482273 537911 568808 562112 563936 559691 587414 633145 694158
12178 694158 750588 794073 836609 926254 1106254 1278309 1487480 1697371 1923641 2226898
12168 2226898 2709201 3446101 4571856 6361133 9317644 14058790 21468022 31785241
12160 31785241 39732582 35828314 24296550 15274253 10075044 7194200 5569660 4717014
12152 4717014 4375918 4537414 5241075 6740585 9302419 12884511 15331190 13387962 9239795
$$ packed form
12230B41633p804j4239n2718j2625r002j2K0428K4558J4734J0222Q188l068M290
12217B24585o657j947j9414Q227R813p348q858R300j3820K0293J2675J6186Q183
12204B51218k064K5490J0160j92O519k50o990o596L278J1246M5M8338K0495L248
12190C63945K8324K577M4931M2496N5638L0897o696J824m245K7723M5731O1013
12178F94158N6430M3485M2536Q9645J80000J72055K09171K09891K26270L03257
12168B226898M82303P36900J125755J789277K956511M741146P409232J0317219
12160C1785241P947341l904268j1531764r022297n199209k880844j624540q52646
12152D717014l41096J61496P03661J499510K561834L582092K446679j943228m148167
$$ plain form
12143 9239795 6197467 4453434 3478427 2941288 2661356 2567893 2571497 2636870 2785075 2953593
12133 2953593 3063866 3375080 4026599 5249275 7218989 9836372 11863166 10975535 7982254
12124 7982254 5497114 4037675 3175570 2554146 2141768 1922132 1775835 1546306 1315106
12115 1315106 1117659 987047 864663 799558 793241 770699 724971 728044 765420 776483 803460
12104 803460 851329 902755 943704 1020662 1149391 1311762 1482163 1637996 1750655 1844360
12094 1844360 1960488 2123400 2217307 2095349 1922186 1918997 2164079 2695645 3573544 4981185
12084 4981185 7085446 9675361 11251172 9912199 6989899 4663147 3246053 2398507
12076 2398507 1856840 1535388 1387421 1305757 1242246 1172422 1159558 1204082 1273602 1255500 1120621
$$ packed form
12143I239795l042328j744033r75007n37139k79932r3463L604O5373J48205J68518
12133B953593J10273L11214O51519J222676J969714K617383K026794q87631k993281
12124G982254k485140j459439q62105o21424m12378k19636j46297k29529k31200
12115A315106j97447j30612j22384o5105o317k2542m5728L073L7376J1063K6977
12104H03460M7869N1426M0949P6958J28729J62371J70401J55833J12659R3705
12094A844360J16128J62912R3907j21958j73163l189K45082N31566Q77899J407641
12084D981185K104261K589915J575811j338973k922300k326752j417094q47546
12076B398507n41667l21452j47967q1664o3511o9824j2864M4524O9520j8102j34879
$$ plain form
12065 1120621 998421 909252 863107 873644 931887 1003707 1078108 1107751 1126380 1125620 1088208
12054 1088208 1065610 1080034 1162145 1182223 1145361 1115302 1105327 1144742 1241507 1316761 1233025
12043 1233025 989270 807024 680917 595967 554488 528261 532627 562698 540059 500829 470076
12032 470076 473918 487148 468385 476004 481400 530552 612762 723774 895921 1012456 895054
12021 895054 666248 519822 478765 451205 454175 469337 455955 429119 413367 405770 414993 357563
12009 357563 316872 304531 322187 314927 304044 308373 310008 291138 282024 279555 293627 329156
11997 329156 322977 295839 300146 312541 356941 394949 421923 467484 564467 647076 612252 521599
11985 521599 447310 420983 414811 448547 484896 511371 578036 619268 645701 620536 554200 517732
$$ packed form
12065A120621j22200q9169m6145J0537N8243P1820P4401K9643J8629p60l7412
12054A088208k2598J4424Q2111K0078l6862l0059r975L9415R6765P5254q3736
12043A233025k43755j82246j26107q4950m1479k6227M366L0071k2639l9230l0753
12032D70076L842J3230j8763P619N396M9152Q2210J11012J72147J16535j17402
12021H95054k28806j46426m1057k7560K970J5162j3382k6836j5752p597R223n7430
12009C57563m0691j2341J7656p260j0883M329J635j8870r114k469J4072L5529
11997C29156o179k7138M307J2395M4400L8008K6974M5561R6983Q2609l4824r0653
11985E21599p4289k6327o172L3736L6349K6475O6665M1232K6433k5165o6336l6468
$$ plain form
11973 517732 504111 496103 532049 595611 673342 667652 576052 474639 427027 439369 438524 422335
11961 422335 394317 398735 406552 405437 428874 459935 474529 489645 496402 476527 450961 443308
11949 443308 461942 459681 443965 463652 509463 574420 651501 742747 827305 895797 935707 963798
11937 963798 1045543 1187462 1384081 1624528 1887588 2214341 2566538 3008936 3687928 4773341
11927 4773341 6606597 9641955 14559357 22259585 32798326 40287314 35159290 23142080
11919 23142080 14291971 9278348 6442707 4753001 3679656 2960532 2401507 1991094
11911 1991094 1721214 1545641 1441264 1354273 1193681 1065966 988656 920793 854857 794993
11901 794993 767704 784906 814971 817600 828099 799386 751271 679074 640403 640064 668160 657528
$$ packed form
11973E17732j3621q008L5946O3562P7731n690r1600j01413m7612J2342q45j6189
11961D22335k8018M418P817j115K3437L1061J4594J5116O757j9875k5566p653
11949D43308J8634k261j5716J9687M5811O4957P7081R1246Q4558O8492L9910K8091
11937I63798Q1745J41919J96619K40447K63060L26753L52197M42398O78992J085413
11927D773341J833256L035358M917402P700228J0538741P488988n128024j2017210
11919B3142080q850109n013623k835641j689706j073345p19124n59025m10413
11911A991094k69880j75573j04377q6991j60592j27715p7310o7863o5936n9864
11901G94993k7289J7202L0065K629J0499k8713m8115p2197l8671l39K8096j0632
$$ plain form
11889 657528 670963 638949 602474 586148 600901 587235 577842 557090 508342 463698 461174 476918
11877 476918 517950 528328 547732 562776 573109 625646 701392 803065 967599 1015016 868333
11866 868333 711866 594768 513838 453067 447085 444973 441919 421306 362006 339211 343668 360123
11854 360123 397504 433066 486672 526436 551148 548377 553245 552791 554847 597925 631427 675775
11842 675775 686011 655582 640752 601280 507822 434982 397837 378254 373398 359349 343678 328719
11830 328719 323759 318266 310456 281031 250828 257614 289311 290264 263095 234791 215654 217070 221437
11817 221437 208942 228144 250432 306095 352833 330180 280599 232295 237470 257432 283407 275215
11805 275215 297766 321170 373477 422166 407631 405542 396612 397890 391139 385352 367892 327225
$$ packed form
11889F57528J3435l2014l6475j6326J4753j3666r393k0752m8748m4644k524J5744
11877D76918M1032J0378J9404J5044J0333N2537P5746J01673J64534M7417j46683
11866H68333j56467j17098q0930o0771n982k112l054k0613n9300k2795M457J6455
11854C60123L7381L5562N3606L9764K4712k771M868m54K056M3078L3502M4348
11842F75775J0236l0429j4830l9472r3458p2840l7145j9583m856j4049j5671j4959
11830C28719m960n493p810k9425l0203O786L1697R53k7169k8304j9137J416M367
11817B21437j2495J9202K2288N5663M6738k2653m9581m8304N175J9962K5975q192
11805B75215K2551K3404N2307M8689j4535k089q930J278o751n787j7460m0667
$$ [...]
##END NTUPLES=NMR SPECTRUM
##END=
