##TITLE=Analysis number 329553
Compound Code rh 00924
Project Code adrs
Chemist Name fudan
##JCAMPDX= 6.0         $$ Bruker NMR JCAMP-DX V2.0
##DATA TYPE= NMR SPECTRUM
##DATA CLASS= NTUPLES
##ORIGIN= Bruker BioSpin GmbH
##OWNER= nmr
$$ XWIN-NMR		Version 3.5
$$ Thu Sep 13 09:02:20 2007 GMT Daylight Time (UT+1h)  MAYBRIDGE\nmr@NMR_250MHZ
##.OBSERVE FREQUENCY= 250.131544655141
##.OBSERVE NUCLEUS= ^1H
##.ACQUISITION MODE= SIMULTANEOUS (DQD)
##.ACQUISITION SCHEME= undefined
##.AVERAGES= 16
##.DIGITISER RES= 18
##SPECTROMETER/DATA SYSTEM= dpx250
##.PULSE SEQUENCE= zg30
##.SOLVENT NAME= CDCl3
##.SHIFT REFERENCE= (INTERNAL, CDCl3, 0, 16.522)
##AUDIT TRAIL= $$ (NUMBER, WHEN, WHO, WHERE, WHAT)
$$ ##TITLE= Audit trail, XWIN-NMR		Version 3.5
$$ ##JCAMPDX= 5.01
$$ ##ORIGIN= Bruker BioSpin GmbH
$$ ##OWNER= nmr
$$ C:\u/data/dgb/nmr/ADRS/1420/pdata/1/auditp.txt
$$ ##AUDIT TRAIL=  $$ (NUMBER, WHEN, WHO, WHERE, WHAT)
(   1,<2007-09-13 09:01:57.41 +100>,<MAYBRIDGE\nmr>,<NMR_250MHZ>,
      <created by zg, POWCHK disabled, PULCHK disabled
       configuration hash MD5:
       76 6E 9A 78 1E 09 19 81 EC 84 63 8F B0 6A 59 2D
       data hash MD5: 64K
       42 35 B2 A6 FC 4C 0E 7D A6 FE E2 14 2D C5 16 70>)
(   2,<2007-09-13 09:02:10.85 +100>,<MAYBRIDGE\nmr>,<NMR_250MHZ>,
      <Start of raw data processing
       ef LB = 0.3 FT_mod = 6 PKNL = 1 SI = 32K 
       data hash MD5: 32K
       45 2A CC F7 44 23 6E 50 F4 22 AE DA 6D 8E 2B 3D>)
(   3,<2007-09-13 09:02:12.59 +100>,<MAYBRIDGE\nmr>,<NMR_250MHZ>,
      <apk 
       data hash MD5: 32K
       14 9B AD A2 DB 5A 1A 4F 1A 65 D3 1A 0B AA 20 D9>)
(   4,<2007-09-13 09:02:13.46 +100>,<MAYBRIDGE\nmr>,<NMR_250MHZ>,
      <abs ABSG = 5 
       data hash MD5: 32K
       8D E7 AB 08 A3 2E E4 84 40 AB 0D 21 30 1F 1A 63>)
$$ ##END=
$$ 
$$ hash MD5
$$ 09 D2 7C 19 1E 44 21 37 08 C6 A3 40 EB 04 74 F3
##$RELAX= 
##$RELAX= 
##$RELAX= 
##$RELAX= 
##$RELAX= 
##$RELAX= 
##$RELAX= 
$$ Bruker specific parameters
$$ --------------------------
##$DU= <C:\u>
##$EXPNO= 1420
##$NAME= <ADRS>
##$PROCNO= 1
##$TYPE= <nmr>
##$USER= <dgb>
##$AMP= (0..31)
100 100 100 100 100 100 100 100 100 100 100 100 100 100 100 100 100 100 
100 100 100 100 100 100 100 100 100 100 100 100 100 100 
##$AQSEQ= 0
##$AQ_mod= 3
##$AUNM= <au_zg>
##$AUTOPOS= <51 >
##$BF1= 250.13
##$BF2= 250.13
##$BF3= 250.13
##$BF4= 250.13
##$BF5= 500.13
##$BF6= 500.13
##$BF7= 500.13
##$BF8= 500.13
##$BYTORDA= 1
##$CFDGTYP= 0
##$CFRGTYP= 5
##$CHEMSTR= <none>
##$CNST= (0..31)
1 1 145 1 1 1 1 1 1 1 1 1 1 1 1 1 1 1 1 1 1 1 1 1 1 1 1 1 1 1 1 1 
##$CPDPRG= <>
##$CPDPRG1= <>
##$CPDPRG2= <>
##$CPDPRG3= <>
##$CPDPRG4= <mlev>
##$CPDPRG5= <mlev>
##$CPDPRG6= <mlev>
##$CPDPRG7= <mlev>
##$CPDPRG8= <mlev>
##$CPDPRGB= <>
##$CPDPRGT= <>
##$D= (0..31)
0 1 0 0 0 0 0 0 0 0.06 0 0 0 0 0 0 0.0002 0 0 0 0 0 0 0 0 0 0 0 0 0 0 
0 
##$DATE= 1189670516
##$DBL= (0..7)
120 120 120 120 120 120 120 120 
##$DBP= (0..7)
150 150 150 150 150 150 150 150 
##$DBP07= 0
##$DBPNAM0= <>
##$DBPNAM1= <>
##$DBPNAM2= <>
$$ [...]
##$SUBNAM7= <"">
##$SUBNAM8= <"">
##$SUBNAM9= <"">
##$SW= 20.6930455092707
##$SWIBOX= (0..15)
0 0 3 0 0 0 0 0 0 0 0 0 0 0 0 0 
##$SW_h= 5175.983436853
##$TD= 65536
##$TD0= 1
##$TE= 296.16
##$TE2= 300
##$TE3= 300
##$TEG= 300
##$TL= (0..7)
0 120 120 120 120 120 120 120 
##$TP= (0..7)
150 150 150 150 150 150 150 150 
##$TP07= 0
##$TPNAME0= <>
##$TPNAME1= <>
##$TPNAME2= <>
##$TPNAME3= <>
##$TPNAME4= <>
##$TPNAME5= <>
##$TPNAME6= <>
##$TPNAME7= <>
##$TPOAL= (0..7)
0.5 0.5 0.5 0.5 0.5 0.5 0.5 0.5 
##$TPOFFS= (0..7)
0 0 0 0 0 0 0 0 
##$TUNHIN= 0
##$TUNHOUT= 0
##$TUNXOUT= 0
##$USERA1= <user>
##$USERA2= <user>
##$USERA3= <user>
##$USERA4= <user>
##$USERA5= <user>
##$V9= 5
##$VALIST= <valist>
##$VCLIST= <CCCCCCCCCCCCCCC>
##$VD= 0
##$VDLIST= <DDDDDDDDDDDDDDD>
##$VPLIST= <PPPPPPPPPPPPPPP>
##$VTLIST= <TTTTTTTTTTTTTTT>
##$WBST= 1024
##$WBSW= 4
##$XGAIN= (0..3)
0 0 0 0 
##$XL= 0
##$YL= 0
##$YMAX_a= 340117
##$YMIN_a= -300771
##$ZGOPTNS= <>
##$ZL1= 120
##$ZL2= 120
##$ZL3= 120
##$ZL4= 120
##$ABSF1= 16.522
##$ABSF2= -4.171173
##$ABSG= 5
##$ABSL= 3
##$ALPHA= 0
##$AQORDER= 0
##$ASSFAC= 0
##$ASSFACI= 0
##$ASSFACX= 0
##$ASSWID= 0
##$AUNMP= <proc_1d>
##$AZFE= 0.1
##$AZFW= 0.1
##$BCFW= 0
##$BC_mod= 0
##$BYTORDP= 0
##$COROFFS= 0
##$CY= 12.5
##$DATMOD= 1
##$DC= 0
##$DFILT= <>
##$DTYPP= 0
##$F1P= 14.0000005364418
##$F2P= -0.99999901652339
##$FCOR= 0.5
##$FTSIZE= 32768
##$FT_mod= 6
##$GAMMA= 0
##$GB= 0
##$INTBC= 1
##$INTSCL= 1
##$ISEN= 128
##$LB= 0.3
##$LEV0= 0
##$LPBIN= 0
##$MAXI= 10000
##$MC2= 0
##$MEAN= 0
##$ME_mod= 0
##$MI= 0
##$NCOEF= 0
##$NC_proc= -3
##$NLEV= 6
##$NOISF1= 0
##$NOISF2= 0
##$NSP= 0
##$NTH_PI= 0
##$NZP= 0
##$OFFSET= 16.522
##$PC= 1
##$PHC0= -59.80988
##$PHC1= 4.653022
##$PH_mod= 1
##$PKNL= yes
##$PPARMOD= 0
##$PSCAL= 4
##$PSIGN= 0
##$REVERSE= no
##$SF= 250.13
##$SI= 32768
##$SIGF1= 0
##$SIGF2= 0
##$SINO= 400
##$SIOLD= 32768
##$SREGLST= <1H.CDCl3>
##$SSB= 0
##$STSI= 32768
##$STSR= 0
##$SW_p= 5175.98343685301
##$SYMM= 0
##$S_DEV= 0
##$TDeff= 65536
##$TDoff= 0
##$TI= <Analysis number 999999
Compound Code 99
Book Reference 9
Project Code 9>
##$TILT= no
##$TM1= 0
##$TM2= 0
##$TOPLEV= 0
##$USERP1= <user>
##$USERP2= <user>
##$USERP3= <user>
##$USERP4= <user>
##$USERP5= <user>
##$WDW= 1
##$XDIM= 32768
##$YMAX_p= 300683877
##$YMIN_p= -91468
$$ End of Bruker specific parameters
$$ ---------------------------------
##NTUPLES= NMR SPECTRUM
##VAR_NAME=  FREQUENCY,     SPECTRUM/REAL,   SPECTRUM/IMAG
##SYMBOL=    X,             R,               I
##VAR_TYPE=  INDEPENDENT,   DEPENDENT,       DEPENDENT
##VAR_FORM=  AFFN,          ASDF,            ASDF
##VAR_DIM=   32768,         32768,           32768
##UNITS=     HZ,            ARBITRARY UNITS, ARBITRARY UNITS
##FACTOR=    0.157963299565203, 1,           1
##FIRST=     4132.6476996994, 0,             0
##LAST=      -1043.33573715361, 0,           0
##MIN=       -1043.33573715361, -91468,      0
##MAX=       4132.6476996994, 300683877,     0
$$ Real data points
##PAGE= N=1
##DATA TABLE= (X++(R..R)), XYDATA
$$ [...]
##PAGE= N=2
##DATA TABLE= (X++(I..I)), XYDATA
$$ plain form
13764 1156308 1125693 1122388 1140025 1143337 1140556 1157444 1163407 1172205 1171601 1164309 1146774 1136235 1143087
13751 1143087 1138794 1136862 1155697 1171394 1182195 1200733 1180763 1186323 1208035 1227595 1213434 1204374
13739 1204374 1224324 1231724 1233342 1241824 1222252 1232187 1241465 1243667 1250423 1237456 1248869 1268110 1268021
13726 1268021 1264789 1269886 1307292 1335745 1355251 1366273 1370266 1369063 1391645 1427337 1445695 1452787
13714 1452787 1445053 1434160 1370612 1271942 1200818 1166698 1177994 1192478 1223662 1254044 1256513 1265985
13702 1265985 1278514 1286634 1300935 1329559 1334796 1345418 1356099 1349113 1349195 1378933 1371226 1376930 1388765
13689 1388765 1396931 1417839 1440892 1439999 1441960 1446458 1457032 1462874 1480683 1506581 1545118 1586142
13677 1586142 1605628 1629237 1664694 1703555 1731831 1793489 1850091 1896046 1940673 1917345 1777130
$$ packed form
13764A156308l0615l305J7637L312k781J6888N963Q798o04p292j7535j0539O852
13751A143087m293j932J8835J5697J0801J8538j9970N560K1712J9560j4161r060
13739A204374J9950P400J618Q482j9572R935R278K202O756j2967J1413J9241q9
13726A268021l232N097L7406K8453J9506J1022L993j203K2582L5692J8358P092
13714A452787p734j0893o3548r8670p1124l4120J1296J4484L1184L0382K469R472
13702A265985J2529Q120J4301K8624N237J0622J0681o986Q2K9738p707N704J1835
13689A388765Q166K0908K3053q93J961M498J0574N842J7809K5898L8537M1024
13677A586142J9486K3609L5457L8861K8276O1658N6602M5955M4627k3328j40215
$$ plain form
13666 1777130 1483416 1184808 1009115 976830 1033190 1097600 1156107 1211701 1265369 1270755 1274983
13655 1274983 1294186 1323153 1373263 1396167 1400791 1379944 1347447 1321069 1288743 1285655 1316195 1350471
13643 1350471 1369784 1385398 1395900 1410184 1421209 1417996 1450833 1494656 1538497 1582088 1596936
13632 1596936 1619335 1641796 1680567 1716428 1763105 1810346 1878229 1958351 1995605 1979902 1867097
13621 1867097 1609759 1318852 1145317 1114912 1176974 1249154 1335843 1412574 1442819 1428113 1378485
13610 1378485 1350944 1386113 1464490 1507154 1529064 1461552 1294115 1103681 995828 964840 965706
13599 965706 975891 1002690 1056857 1113842 1152308 1185762 1207577 1218050 1260288 1271343 1279128 1315886
13587 1315886 1357493 1373368 1406730 1442510 1466682 1500440 1525551 1561046 1607394 1640810 1638495
$$ packed form
13666A777130k93714k98608j75693l2285N6360O4410N8507N5594N3668N386M228
13655A274983J9203K8967N0110K2904M624k0847l2497k6378l2326l088L0540L4276
13643A350471J9313J5614J0502J4284J1025l213L2837M3823M3841M3591J4848
13632A596936K2399K2461L8771L5861M6677M7241O7883Q0122L7254j5703j12805
13621A867097k57338k90907j73535l0405O2062P2180Q6689P6731L0245j4706m9628
13610A378485k7541L5169P8377M2664K1910o7512j67437j90434j07853l0988Q66
13599I65706J0185K6799N4167N6985L8466L3454K1815J0473M2238J1055P785L6758
13587A315886M1607J5875L3362L5780K4172L3758K5111L5495M6348L3416k315
$$ plain form
13576 1638495 1587590 1505250 1434622 1408534 1428335 1466339 1527706 1581270 1606637 1597959 1522970
13565 1522970 1468309 1471678 1516557 1576836 1620724 1567133 1391636 1170394 1007650 951568 958973
13554 958973 973308 1003961 1041158 1090595 1128475 1147033 1169337 1198117 1211955 1218534 1243905 1288069
13542 1288069 1313001 1343161 1363790 1377706 1395402 1423296 1441232 1471840 1477477 1490071 1514321
13531 1514321 1500167 1486194 1492437 1479373 1466853 1477246 1518891 1523114 1535517 1528274 1503356 1500822
13519 1500822 1493381 1493724 1503305 1515188 1509285 1489045 1441187 1399040 1386218 1400938 1414326 1416536
13507 1416536 1411200 1444478 1476288 1495114 1513871 1505902 1492399 1505859 1519449 1523166 1542291 1553162
13495 1553162 1547919 1546889 1551227 1551871 1555552 1571098 1575234 1572323 1595278 1609422 1605526 1595570 1590401
$$ packed form
13576A638495n0905q2340p0628k6088J9801L8004O1367N3564K5367q678p4989
13565A522970n4661L369M4879O0279M3888n3591j75497k21242j62744n6082P405
13554I58973J4335L0653L7197M9437L7880J8558K2304K8780J3838O579K5371M4164
13542A288069K4932L0160K0629J3916J7696K7894J7936L0608N637J2594K4250
13531A514321j4154j3973O243j3064j2520J0393M1645M223J2403p243k4918k534
13519A500822p441L43R581J1883n903k0240m7858m2147j2822J4720J3388K210
13507A416536n336L3278L1810J8826J8757p969j3503J3460J3590L717J9125J0871
13495A553162n243j030M338O44L681J5546M136k911K2955J4144l896r956n169
$$ plain form
13482 1590401 1596886 1594089 1615006 1626461 1605704 1600920 1622156 1639487 1653182 1644464 1641977 1646608
13470 1646608 1673131 1692414 1683124 1705064 1705458 1717237 1742913 1760151 1764528 1756198 1746713 1734522
13458 1734522 1727513 1744347 1769026 1776594 1762029 1764286 1768641 1774157 1778664 1769815 1781428 1804308 1823671
13445 1823671 1820237 1805716 1805938 1825881 1850429 1855980 1853752 1856518 1844031 1845489 1870228 1867473 1861860
13432 1861860 1883114 1904767 1900920 1889490 1887857 1901046 1912523 1934448 1937746 1938760 1941805 1951186
13420 1951186 1959277 1986310 2026345 2034215 2031417 2015279 2017816 2023738 2032450 2057083 2072381 2079138 2065343
13407 2065343 2051182 2053749 2054839 2055394 2063658 2062855 2050405 2039234 2063627 2098425 2118990 2134752 2169884
13394 2169884 2195108 2209321 2205698 2219255 2225360 2208835 2183865 2179214 2159145 2126433 2099722 2080214
$$ packed form
13482A590401O485k797K0917J1455k0757m784K1236J7331J3695q718k487M631
13470A646608K6523J9283r290K1940L94J1779K5676J7238M377q330r485j2191
13458A734522p009J6834K4679P568j4565K257M355N516M507q849J1613K2880J9363
13445A823671l434j4521K22J9943K4548N551k228K766j2487J458K4739k755n613
13432A861860K1254K1653l847j1430j633J3189J1477K1925L298J014L045R381
13420A951186Q091K7033M0035P870k798j6138K537N922Q712K4633J5298O757j3795
13407B065343j4161K567J090N55Q264q03j2450j1171K4393L4798K0565J5762L5132
13394B169884K5224J4213l623J3557O105j6525k4970m651k0069l2712k6711j9508
$$ plain form
13382 2080214 2051459 2025993 2006811 2016990 2045770 2060415 2071849 2101145 2139189 2144561 2159840
13371 2159840 2164991 2180684 2181476 2189587 2199563 2226951 2242844 2246934 2252568 2257750 2258571 2256480 2265234 2247475
13357 2247475 2251284 2261064 2291618 2323100 2330778 2355949 2379017 2420966 2452017 2496885 2532469 2553310
13345 2553310 2578846 2576223 2551298 2498834 2415464 2332083 2249446 2160234 2067835 2007629 1995199
13334 1995199 2015494 2041644 2070077 2089530 2100259 2102903 2115863 2134314 2157993 2177465 2193250
13323 2193250 2203918 2236487 2261858 2284785 2285214 2284992 2302959 2311835 2319283 2346512 2352271 2357605 2389674
13310 2389674 2415792 2439818 2474561 2522829 2545789 2549545 2553839 2565822 2595311 2632307 2659328 2680752
13298 2680752 2675334 2652246 2566891 2462996 2367884 2264121 2178365 2118173 2105283 2142255 2168297
$$ packed form
13382B080214k8755k5466j9182J0179K8780J4645J1434K9296L8044N372J5279
13371B159840N151J5693P92Q111R976K7388J5893M090N634N182Q21k091Q754j7759
13357B247475L809R780L0554L1482P678K5171K3068M1949L1051M4868L5584K0841
13345B553310K5536k623k4925n2464q3370q3381q2637q9212r2399o0206j2430
13334A995199K0295K6150K8433J9453J0729K644J2960J8451K3679J9472J5785
13323B193250J0668L2569K5371K2927M29k22J7967Q876P448K7229N759N334L2069
13310B389674K6118K4026L4743M8268K2960L756M294J1983K9489L6996K7021K1424
13298B680752n418k3088q5355j03895r5112j03763q5756o0192j2890L6972K6042
$$ plain form
13287 2168297 2196105 2228036 2257238 2271415 2272941 2289989 2295432 2305192 2294667 2310046 2354420 2375311
13275 2375311 2390824 2398775 2421002 2431458 2421366 2418186 2422496 2453960 2500559 2534734 2556534 2565117
13263 2565117 2578573 2597562 2600791 2619867 2633487 2635150 2627736 2635584 2653918 2666347 2680028 2672299
13251 2672299 2643591 2608262 2601125 2593939 2578848 2557463 2574626 2610338 2636267 2653745 2647760 2645351
13239 2645351 2653698 2687188 2700950 2695295 2686682 2715280 2729845 2741348 2767619 2793528 2815292 2819793
13227 2819793 2818251 2804994 2764064 2749968 2751208 2766928 2800283 2829293 2858483 2862625 2900233 2902235
13215 2902235 2899627 2890929 2881995 2879801 2895948 2917662 2945077 2954247 2964803 2946831 2962553 2980387
13203 2980387 3006125 3040156 3046627 3054616 3085063 3123821 3155882 3180329 3190778 3200817 3219283 3225477
$$ packed form
13287B168297K7808L1931K9202J4177J526J7048N443R760j0525J5379M4374K0891
13275B375311J5513P951K2227J0456j0092l180M310L1464M6599L4175K1800Q583
13263B565117J3456J8989L229J9076J3620J663p414P848J8334J2429J3681p729
13251B672299k8708l5329p137p186j5091k1385J7163L5712K5929J7478n985k409
13239B645351Q347L3490J3762n655q613K8598J4565J1503K6271K5909K1764M501
13227B819793j542j3257m0930j4096J240J5720L3355K9010K9190M142L7608K002
13215B902235k608q698q934k194J6147K1714K7415R170J0556j7972J5722J7834
13203B980387K5738L4031O471P989L0447L8758L2061K4447J0449J0039J8466O194
$$ plain form
13191 3225477 3204609 3170704 3157883 3178876 3219724 3262883 3293777 3314673 3331150 3323097 3273961
13180 3273961 3241219 3223142 3212329 3243781 3278585 3307219 3330178 3361533 3396344 3385818 3384365
13169 3384365 3388431 3410716 3429083 3433754 3438452 3465218 3489801 3497644 3487951 3496485 3510741 3542904
13157 3542904 3568950 3590595 3615024 3643484 3664627 3682706 3719797 3735337 3741284 3746565 3751305 3778703
13145 3778703 3787956 3804912 3819082 3813170 3806506 3816688 3855378 3863685 3839669 3826010 3834880 3848265
13133 3848265 3858633 3867768 3888546 3925809 3942230 3965196 3992366 4011287 4052484 4089325 4108211
13122 4108211 4121944 4144386 4147151 4146296 4157045 4156270 4164557 4184696 4198410 4220905 4270885 4307023
13110 4307023 4333038 4351839 4369909 4389624 4396716 4422133 4458267 4506433 4536616 4552304 4574619
$$ packed form
13191C225477k0868l3905j2821K0993M0848M3159L0894K0896J6477q053m9136
13180C273961l2742j8077j0813L1452L4804K8634K2959L1355L4811j0526j453
13169C384365M066K2285J8367M671M698K6766K4583P843r693Q534J4256L2163
13157C542904K6046K1645K4429K8460K1143J8079L7091J5540N947N281M740K7398
13145C778703R253J6956J4170n912o664J0182L8690Q307k4016j3659Q870J3385
13133C848265J0368R135K0778L7263J6421K2966K7170J8921M1197L6841J8886
13122D108211J3733K2442K765q55J0749p75Q287K0139J3714K2495M9980L6138
13110D307023K6015J8801J8070J9715P092K5417L6134M8166L0183J5688K2315
$$ plain form
13099 4574619 4594787 4629327 4646976 4670611 4691062 4698238 4689091 4692463 4696129 4694557 4704236 4722278
13087 4722278 4741407 4777146 4831097 4864667 4897382 4946721 4991810 5024355 5051871 5085762 5121876
13076 5121876 5111092 5112358 5154377 5177422 5163817 5180523 5231722 5269248 5291073 5327187 5362110
13065 5362110 5386711 5430543 5458321 5490443 5530939 5558640 5582175 5631067 5668592 5685669 5713086
13054 5713086 5749751 5776954 5812799 5867794 5895549 5908027 5923556 5973012 6010845 6047778 6095231
13043 6095231 6137987 6176992 6228904 6269421 6300663 6354051 6395068 6474932 6539584 6583170 6647993
13032 6647993 6697554 6734940 6770001 6813623 6845843 6884225 6919360 6970654 7036260 7081627 7130959
13021 7130959 7193673 7245865 7271094 7317588 7390237 7434571 7489386 7539415 7574535 7622975 7665491
$$ packed form
13099D574619K0168L4540J7649K3635K0451P176r147L372L666j572R679J8042
13087D722278J9129L5739N3951L3570L2715M9339M5089L2545K7516L3891L6114
13076E121876j0784J266M2019K3045j3605J6706N1199L7526K1825L6114L4923
13065E362110K4601M3832K7778L2122M0496K7701K3535M8892L7525J7077K7417
13054E713086L6665K7203L5845N4995K7755J2478J5529M9456L7833L6933M7453
13043F095231M2756L9005N1912M0517L1242N3388M1017P9864O4652M3586O4823
13032F647993M9561L7386L5061M3622L2220L8382L5135N1294O5606M5367M9332
13021G130959O2714N2192K5229M6494P2649M4334N4815N0029L5120M8440M2516
$$ plain form
13010 7665491 7714487 7807310 7908601 7990178 8076451 8158556 8230033 8298584 8378915 8447793 8523397
12999 8523397 8600064 8694011 8764426 8844657 8917081 8994392 9118780 9237823 9345714 9459086
12989 9459086 9565235 9663173 9774566 9873730 9964452 10065801 10163193 10283453 10403695 10501394
12979 10501394 10616807 10756501 10895567 11030065 11160579 11291473 11411600 11550640 11690920
12970 11690920 11819315 11994419 12171401 12339690 12511849 12714797 12922055 13147921 13400186
12961 13400186 13625942 13841087 14099229 14369941 14643896 14935292 15262586 15585156 15913382
12952 15913382 16261623 16633248 17065864 17519241 18003408 18536481 19124228 19770585 20466705
12943 20466705 21237628 22077521 23018362 24047980 25242432 26638003 28246443 30077853
$$ packed form
13010G665491M8996R2823J01291Q1577Q6273Q2105P1477O8551Q0331O8878P5604
12999H523397P6667R3947P0415Q0231P2424P7311J24388J19043J07891J13372
12989I459086J06149R7938J11393R9164R0722J01349R7392J20260J20242R7699
12979A0501394J15413J39694J39066J34498J30514J30894J20127J39040J40280
12970A1690920J28395J75104J76982J68289J72159K02948K07258K25866K52265
12961A3400186K25756K15145K58142K70712K73955K91396L27294L22570L28226
12952A5913382L48241L71625M32616M53377M84167N33073N87747O46357O96120
12943B0466705P70923Q39893R40841J029618J194452J395571J608440J831410
$$ plain form
12935 30077853 32020576 33684167 34248950 32768597 28964079 23554531 17501238 11292427
12927 11292427 5288304 341496 -2453298 -2952632 -1913071 -197649 1640398 3365132
12919 3365132 4955101 6400715 7707758 8920360 10085225 11211376 12328955 13417489
12911 13417489 14504281 15597429 16719846 17877757 19061187 20263290 21502785 22783455
12903 22783455 24151751 25626732 27264364 29065423 31011039 33169109 35577539 38306315
12895 38306315 41370248 44887117 49018218 53947199 59671291 65788514 70904268 71993277
12887 71993277 65384956 50469974 30697642 10107757 -10459408 -30278735 -46224805
12880 -46224805 -54227185 -54216329 -49461987 -43492302 -37908382 -33035593 -28843064 -25237767
$$ packed form
12935C0077853J942723J663591N64783j480353l804518n409548o053293o208811
12927A1292427o004123m946808k794794m99334J039561J715422J838047J724734
12919C365132J589969J445614J307043J212602J164865J126151J117579J088534
12911A3417489J086792J093148J122417J157911J183430J202103J239495J280670
12903B2783455J368296J474981J637632J801059J945616K158070K408430K728776
12895C8306315L063933L516869M131101M928981N724092O117223N115754J089009
12887G1993277o608321j4914982j9772332k0589885k0567165j9819327j5946070
12880d6224805q002380J0856M754342N969685N583920M872789M192529L605297
$$ plain form
12872 -25237767 -22096608 -19259038 -16632129 -14210543 -11950863 -9822436 -7818216 -5889290
12864 -5889290 -4025528 -2230784 -470447 1255801 2949849 4673520 6447492 8303217
12856 8303217 10305821 12451497 14754770 17252527 19989939 23023998 26407214 30249325
12848 30249325 34756265 40111397 46206254 52386668 56911450 56382067 47434687 30612843
12840 30612843 9821273 -11249724 -32105744 -51569394 -66228387 -72425308 -70986904
12833 -70986904 -65559897 -59453815 -53947710 -49242679 -45239729 -41833444 -38857744 -36203623
12825 -36203623 -33765677 -31530869 -29511981 -27679853 -26010159 -24471555 -23047193 -21693463
12817 -21693463 -20443135 -19248635 -18115377 -16999392 -15910390 -14818151 -13708807 -12557106
$$ packed form
12872b5237767L141159K837570K626909K421586K259680K128427K004220J928926
12864e889290J863762J794744J760337J726248J694048J723671J773972J855725
12856H303217K002604K145676K303273K497757K737412L034059L383216L842111
12848C0249325M506940N355132O094857O180414M524782n29383q947380j6821844
12840C0612843k0791570k1070997k0856020j9463650j4658993o196921J438404
12833g0986904N427007O106082N506105M705031M002950L406285K975700K654121
12825c6203623K437946K234808K018888J832128J669694J538604J424362J353730
12817b1693463J250328J194500J133258J115985J089002J092239J109344J151701
$$ plain form
12809 -12557106 -11366145 -10155809 -8906058 -7539431 -6065551 -4459050 -2665012 -659258
12801 -659258 1471915 3397897 4359575 3314764 -254696 -5827428 -12309296 -18929659
12793 -18929659 -25336368 -30823864 -34378920 -35487558 -34673618 -32942296 -31038868 -29268648
12785 -29268648 -27699233 -26331852 -25132304 -24069513 -23092815 -22197134 -21416297 -20695987 -20041340
12776 -20041340 -19466089 -18952840 -18457835 -17987165 -17555781 -17175916 -16814453 -16459992 -16111545
12767 -16111545 -15772532 -15461199 -15174975 -14885575 -14625383 -14391394 -14161631 -13957172 -13772069
12758 -13772069 -13583886 -13394707 -13202439 -13012972 -12837469 -12631348 -12435905 -12239941 -12070052
12749 -12070052 -11909182 -11752304 -11609046 -11471277 -11335741 -11191591 -11037532 -10918715 -10794783
$$ packed form
12809a2557106J190961J210336J249751J366627J473880J606501J794038K005754
12801f59258K131173J925982R61678j044811l569460n572732o481868o620363
12793a8929659o406709n487496l555056j108638Q13940J731322J903428J770220
12785b9268648J569415J367381J199548J062791R76698Q95681P80837P20310O54647
12776b0041340N75251N13249M95005M70670M31384L79865L61463L54461L48447
12767a6111545L39013L11333K86224K89400K60192K33989K29763K04459J85103
12758a3772069J88183J89179J92268J89467J75503K06121J95443J95964J69889
12749a2070052J60870J56878J43258J37769J35536J44150J54059J18817J23932
$$ plain form
12740 -10794783 -10671028 -10546756 -10430094 -10298885 -10165166 -10054827 -9967724 -9894499 -9819153 -9739053
12730 -9739053 -9649573 -9563685 -9503855 -9435922 -9350683 -9262288 -9174571 -9076534 -8973004 -8877259 -8777925
12719 -8777925 -8682870 -8627264 -8570095 -8529748 -8475069 -8423244 -8376421 -8320043 -8284125 -8233458 -8168574
12708 -8168574 -8108563 -8041416 -7952609 -7876777 -7808023 -7744336 -7680947 -7630731 -7555100 -7481877 -7403419
12697 -7403419 -7347381 -7306669 -7257722 -7197251 -7138069 -7083920 -7035711 -6982721 -6949549 -6921553 -6878601
12686 -6878601 -6853154 -6837793 -6793948 -6758828 -6730457 -6687023 -6627454 -6569188 -6515347 -6482691 -6454300
12675 -6454300 -6442665 -6398397 -6334561 -6295355 -6275564 -6256874 -6214384 -6186643 -6143891 -6085982 -6058473
12664 -6058473 -6035537 -5985198 -5949075 -5921906 -5886382 -5831568 -5804319 -5778526 -5767677 -5745883 -5713556
$$ packed form
12740a0794783J23755J24272J16662J31209J33719J10339Q7103P3225P5346Q0100
12730i739053Q9480Q5888N9830O7933Q5239Q8395Q7717R8037J03530R5745R9334
12719h777925R5055N5606N7169M0347N4679N1825M6823N6378L5918N0667O4884
12708h168574O0011O7147Q8807P5832O8754O3687O3389N0216P5631P3223P8458
12697g403419N6038M0712M8947O0471N9182N4149M8209N2990L3172K7996M2952
12686f878601K5447J5361M3845L5120K8371M3434N9569N8266N3841L2656K8391
12675f454300J1635M4268O3836L9206J9791J8690M2490K7741M2752N7909K7509
12664f058473K2936N0339L6123K7169L5524N4814K7249K5793J0849K1794L2327
$$ plain form
12653 -5713556 -5685160 -5657006 -5608999 -5564468 -5510942 -5484871 -5465316 -5448823 -5419382 -5379039 -5321286
12642 -5321286 -5278994 -5261404 -5245446 -5232940 -5196232 -5169326 -5154067 -5115565 -5085976 -5075935 -5041954
12631 -5041954 -5020044 -5017642 -5010872 -4981182 -4966536 -4935900 -4921314 -4895947 -4862750 -4848670 -4825816 -4776766
12619 -4776766 -4751751 -4732137 -4705550 -4674399 -4658632 -4656142 -4651015 -4637535 -4603811 -4581970 -4563054 -4518367
12607 -4518367 -4493747 -4495514 -4481762 -4471457 -4445035 -4425650 -4402912 -4380622 -4365081 -4341532 -4325112
12596 -4325112 -4306436 -4289951 -4246085 -4210663 -4200119 -4199120 -4208978 -4188417 -4180739 -4167579 -4149649 -4135527
12584 -4135527 -4114167 -4088134 -4043150 -4009127 -3992371 -3968514 -3959306 -3971447 -3977617 -3967709 -3952862 -3952341
12572 -3952341 -3944853 -3938298 -3921294 -3892811 -3870832 -3858798 -3835282 -3817518 -3791756 -3776456 -3770670 -3748026
$$ packed form
12653e713556K8396K8154M8007M4531N3526K6071J9555J6493K9441M0343N7753
12642e321286M2292J7590J5958J2506L6708K6906J5259L8502K9589J0041L3981
12631e041954K1910K402O770K9690J4646L0636J4586K5367L3197J4080K2854M9050
12619d776766K5015J9614K6587L1151J5767K490N127J3480L3724K1841J8916M4687
12607d518367K4620j767J3752J0305K6422J9385K2738K2290J5541K3549J6420
12596d325112J8676J6485M3866L5422J0544R99r858K0561P678J3160J7930J4122
12584d135527K1360K6033M4984L4023J6756K3857R208j2141o170R908J4847N21
12572c952341P488O555J7004K8483K1979J2034K3516J7764K5762J5300N786K2644
$$ plain form
12560 -3748026 -3724196 -3697124 -3681847 -3666992 -3658395 -3654061 -3640278 -3630294 -3623181 -3618192 -3615894 -3616289 -3593934
12547 -3593934 -3556913 -3547926 -3539427 -3526012 -3497867 -3470150 -3447200 -3446756 -3456185 -3435565 -3412146 -3392134
12535 -3392134 -3374932 -3371541 -3380940 -3391042 -3424392 -3416373 -3382346 -3346553 -3324219 -3303051 -3298970 -3274989
12523 -3274989 -3278439 -3256769 -3223194 -3219406 -3256560 -3247622 -3224351 -3207891 -3185236 -3178423 -3178268 -3161815
12511 -3161815 -3137143 -3124910 -3117167 -3092506 -3090752 -3092686 -3073919 -3048351 -3039677 -3017738 -3016613 -3023752
12499 -3023752 -3001451 -3002166 -2996842 -2979011 -2976277 -2958121 -2948040 -2930172 -2904490 -2875994 -2884669 -2912777
12487 -2912777 -2939390 -2953281 -2962606 -2936179 -2910806 -2874657 -2854856 -2847149 -2827811 -2800572 -2779012 -2765332
12475 -2765332 -2752567 -2744559 -2729932 -2706497 -2692403 -2692978 -2692909 -2690121 -2701081 -2732845 -2755632 -2759478 -2776439
$$ packed form
12560c748026K3830K7072J5277J4855Q597M334J3783R984P113M989K298l95K2355
12547c593934L7021Q987Q499J3415K8145K7717K2950M44r429K0620K3419K0012
12535c392134J7202L391r399j0102l3350Q019L4027L5793K2334K1168M081K3981
12523c274989l450K1670L3575L788l7154Q938K3271J6460K2655O813J55J6453
12511c161815K4672J2233P743K4661J754j934J8767K5568Q674K1939J125p139
12499c023752K2301p15N324J7831K734J8156J0081J7868K5682K8496q675k8108
12487b912777k6613j3891r325K6427K5373L6149J9801P707J9338K7239K1560J3680
12475b765332J2765Q008J4627K3435J4094n75O9K788j0960l1764k2787l846j6961
$$ plain form
12462 -2776439 -2792995 -2777908 -2760054 -2751350 -2759673 -2748303 -2708837 -2705911 -2696636 -2695122 -2670824 -2637731
12450 -2637731 -2639780 -2638297 -2617775 -2586989 -2569162 -2555048 -2558603 -2561763 -2553869 -2543287 -2552100 -2548850 -2518250
12437 -2518250 -2496808 -2483166 -2456677 -2422116 -2405926 -2403774 -2388547 -2360366 -2318941 -2274241 -2238792
12426 -2238792 -2205797 -2179335 -2160047 -2178691 -2250069 -2363416 -2465225 -2561962 -2659649 -2719233 -2749055
12415 -2749055 -2730901 -2707309 -2688931 -2643688 -2605762 -2575031 -2563267 -2538279 -2518112 -2500163 -2487043
12404 -2487043 -2477086 -2458896 -2438777 -2429152 -2411644 -2393374 -2405008 -2385262 -2337971 -2309449 -2318101 -2306330
12392 -2306330 -2277230 -2235372 -2204152 -2184776 -2180059 -2167438 -2136003 -2108261 -2081065 -2061043 -2022960
12381 -2022960 -1996065 -2003797 -2017378 -2052410 -2157154 -2272932 -2373792 -2483241 -2568319 -2631878 -2630733
$$ packed form
12462b776439j6556J5087J7854Q704q323J1370L9466K926R275J514K4298L3093
12450b637731k049J483K0522L0786J7827J4114l555l160P894J0582q813L250L0600
12437b518250K1442J3642K6489L4561J6190K152J5227K8181M1425M4700L5449
12426b238792L2995K6462J9288j8644p1378j13347j01809r6737r7687n9584k9822
12415b749055J8154K3592J8378M5243L7926L0731J1764K4988K0167J7949J3120
12404b487043R957J8190K0119R625J7508J8270j1634J9746M7291K8522q652J1771
12392b306330K9100M1858L1220J9376M717J2621L1435K7742K7196K0022L8083
12381b022960K6895p732j3581l5032j04744j15778j00860j09449q5078o3559J145
$$ plain form
12370 -2630733 -2600261 -2566420 -2519357 -2475002 -2450502 -2448191 -2426612 -2403254 -2391670 -2368414 -2339902
12359 -2339902 -2313402 -2322177 -2306484 -2295542 -2280429 -2275832 -2272736 -2273459 -2261425 -2254742 -2252309 -2245801 -2208120
12346 -2208120 -2183690 -2167084 -2166462 -2177982 -2163250 -2146225 -2118973 -2094374 -2069958 -2061141 -2051495 -2040063
12334 -2040063 -2041049 -2061635 -2089672 -2112630 -2140703 -2171952 -2192269 -2197058 -2181551 -2181256 -2165826 -2156238
12322 -2156238 -2154241 -2149501 -2132608 -2136891 -2141299 -2113258 -2093479 -2067624 -2060543 -2077378 -2056746 -2041195
12310 -2041195 -2018869 -2014564 -2014807 -2030552 -2033282 -2038414 -2024320 -2013424 -2016661 -2018691 -2003661 -1981947 -1963728
12297 -1963728 -1970411 -1968354 -1973034 -2006835 -1992978 -1964120 -1968211 -1972867 -1956839 -1947881 -1922259 -1919509 -1935368
12284 -1935368 -1944710 -1912496 -1877215 -1867050 -1876201 -1882416 -1867631 -1860357 -1853947 -1864251 -1866420 -1849807
$$ packed form
12370b630733L0472L3841M7063M4355K4500K311K1579K3358J1584K3256K8512
12359b339902K6500q775J5693J0942J5113M597L096p23J2034O683K433O508L7681
12346b208120K4430J6606O22j1520J4732J7025K7252K4599K4416Q817R646J1432
12334b040063r86k0586k8037k2958k8073l1249k0317m789J5507K95J5430R588
12322b156238J997M740J6893m283m408K8041J9779K5855P081j6835K0632J5551
12310b041195K2326M305k43j5745k730n132J4094J0896l237k030J5030K1714J8219
12297a963728o683K057m680l3801J3857K8858m091m656J6028Q958K5622K750j5859
12284a935368r342L2214L5281J0165r151o215J4785P274O410j0304k169J6613
$$ plain form
12272 -1849807 -1830346 -1849152 -1860634 -1852828 -1857838 -1839798 -1849800 -1858212 -1855910 -1850669 -1850345 -1852930 -1845643
12259 -1845643 -1836037 -1819589 -1800833 -1775539 -1763244 -1761021 -1771530 -1771501 -1774634 -1787805 -1791567 -1784939 -1790982
12246 -1790982 -1805565 -1805415 -1792915 -1760687 -1730561 -1723487 -1720133 -1721614 -1733327 -1735487 -1727400 -1707366 -1700443
12233 -1700443 -1708352 -1712046 -1700333 -1694704 -1708209 -1718068 -1702943 -1691005 -1684550 -1684850 -1680835 -1675982 -1672190
12220 -1672190 -1670262 -1664515 -1662742 -1664810 -1658416 -1643629 -1646726 -1648155 -1624375 -1627094 -1648426 -1648956 -1636116
12207 -1636116 -1635559 -1615023 -1626375 -1625076 -1623305 -1613217 -1610292 -1615245 -1602876 -1584636 -1573338 -1580478 -1567015
12194 -1567015 -1569371 -1585184 -1583894 -1570330 -1559381 -1575543 -1576454 -1562843 -1556644 -1552650 -1546417 -1554669 -1555653
12181 -1555653 -1536014 -1530376 -1535313 -1535952 -1532035 -1514296 -1522632 -1532862 -1528615 -1524374 -1525982 -1524458 -1521299
$$ packed form
12272a849807J9461j8806j1482P806n010J8040j0002q412K302N241L24k585P287
12259a845643R606J6448J8756K5294J2295K223j0509K9l133j3171l762O628o043
12246a790982j4583J50J2500L2228L0126P074L354j481j1713k160Q087K0034O923
12233a700443p909l694J1713N629j3505r859J5125J1938O455l00M015M853L792
12220a672190J928N747J773k068O394J4787l097j429K3780k719k1332n30J2840
12207a636116N57K0536j1352J299J771J0088K925m953J2369J8240J1298p140J3463
12194a567015k356j5813J290J3564J0949j6162r11J3611O199L994O233q252r84
12181a555653J9639N638m937o39L917J7739q336j0230M247M241j608J524L159
$$ plain form
12168 -1521299 -1516808 -1513659 -1534650 -1544764 -1530429 -1523051 -1511741 -1509562 -1509094 -1498191 -1494798 -1499533 -1484336
12155 -1484336 -1493151 -1496934 -1470648 -1476109 -1475275 -1476136 -1490881 -1505440 -1489179 -1451498 -1464046 -1478118 -1473920
12142 -1473920 -1457383 -1449990 -1441597 -1453814 -1451414 -1462648 -1450972 -1451394 -1451264 -1431548 -1391988 -1393721 -1422208
12129 -1422208 -1428241 -1432901 -1430579 -1422784 -1426189 -1416783 -1404005 -1419520 -1423975 -1417424 -1417291 -1402234 -1374970
12116 -1374970 -1381316 -1379030 -1373831 -1373602 -1382531 -1363499 -1341647 -1344022 -1342695 -1353413 -1354186 -1352217 -1338496
12103 -1338496 -1342502 -1337788 -1331276 -1315723 -1305210 -1299256 -1316418 -1317755 -1309850 -1318431 -1311130 -1289041 -1295288
12090 -1295288 -1313711 -1327968 -1307911 -1308366 -1317710 -1314268 -1294460 -1285232 -1284101 -1277136 -1280303 -1269996 -1266861
12077 -1266861 -1272711 -1290668 -1319893 -1304624 -1282021 -1277746 -1281985 -1282827 -1270279 -1253310 -1244032 -1253265 -1255110
$$ packed form
12168a521299M491L149k0991j0114J4335P378J1310K179M68J0903L393m735J5197
12155a484336q815l783K6286n461Q34q61j4745j4559J6261L7681j2548j4072M198
12142a473920J6537P393Q393j2217K400j1234J1676m22J30J9716L9560j733k8487
12129a422208o033m660K322P795l405R406J2778j5515m455O551J33J5057K7264
12116a374970o346K286N199K29q929J9032K1852k375J327j0718p73J969J3721
12103a338496m006M714O512J5553J0513N954j7162j337P905q581P301K2089o247
12090a295288j8423j4257K0057m55r344L442J9808R228J131O965l167J0307L135
12077a266861n850j7957k9225J5269K2603M275m239q42J2548J6969R278r233j845
$$ plain form
12064 -1255110 -1257646 -1257459 -1253131 -1240698 -1230916 -1223593 -1238380 -1229106 -1206092 -1217383 -1223429 -1220573 -1212292
12051 -1212292 -1201107 -1195447 -1207163 -1215905 -1210244 -1210877 -1206346 -1209888 -1221125 -1210393 -1216732 -1216974 -1208835
12038 -1208835 -1183987 -1170360 -1184208 -1188002 -1206907 -1201974 -1188258 -1183902 -1191283 -1198153 -1179939 -1189847
12026 -1189847 -1197369 -1182220 -1186956 -1163970 -1137738 -1120917 -1140949 -1158273 -1167377 -1192359 -1189798 -1172844
12014 -1172844 -1150564 -1148223 -1156312 -1175707 -1169826 -1138288 -1137085 -1135343 -1117099 -1099749 -1102173 -1098445 -1121270
12001 -1121270 -1109962 -1114109 -1113966 -1118745 -1121494 -1124457 -1142558 -1144965 -1120450 -1116752 -1112159 -1108192 -1094176
11988 -1094176 -1085844 -1093714 -1095671 -1095384 -1091749 -1087027 -1076153 -1085458 -1089743 -1095793 -1099914 -1104970 -1103541 -1090435
11974 -1090435 -1079837 -1075989 -1065222 -1050095 -1034568 -1015742 -1021544 -1042438 -1051925 -1051322 -1072844 -1084548
$$ packed form
12064a255110k536J87M328J2433R782P323j4787R274K3014j1291o046K856Q281
12051a212292J1185N660j1716q742N661o33M531l542j1237J0732o339k42Q139
12038a208835K4848J3627j3848l794j8905M933J3716M356p381o870J8214r908
12026a189847p522J5149m736K2986K6232J6821k0032j7324r104k4982K561J6954
12014a172844K2280K341q089j9395N881L1538J203J742J8244J7350k424L728k2825
12001a121270J1308m147J43m779k749k963j8101k407K4515L698M593L967J4016
11988a094176Q332p870j957K87L635M722J0874r305m285o050m121n056J429J3106
11974a090435J0598L848J0767J5127J5527J8826n802k0894r487O03k1522j1704
$$ plain form
11962 -1084548 -1095356 -1096130 -1083911 -1066310 -1048805 -1041881 -1038503 -1021699 -1006853 -1001661 -1007446 -1017923
11950 -1017923 -1018632 -1021334 -1035492 -1048016 -1040868 -1049786 -1053263 -1048171 -1043307 -1042763 -1050903 -1024687 -1008412
11937 -1008412 -1002449 -1009913 -1023095 -1020371 -1020131 -1026319 -1025066 -1024589 -1015082 -1011176 -1004955 -989238 -989148 -1014429
11923 -1014429 -1014301 -1009094 -1014691 -1013728 -1012967 -1027744 -1014822 -1025070 -1024520 -1019942 -1007004 -999736 -981583 -980973
11909 -980973 -993452 -977282 -981679 -985530 -978395 -971794 -964271 -977468 -964427 -938176 -935958 -935305 -948732
11896 -948732 -953678 -943072 -952898 -952979 -923438 -906772 -902954 -910486 -924209 -938915 -956447 -954326 -963123
11883 -963123 -976733 -943474 -913114 -922613 -947510 -946860 -945045 -937867 -935858 -932823 -929922 -936471 -931593
11870 -931593 -923706 -931507 -943559 -952896 -944702 -932512 -928824 -925153 -916098 -912448 -909097 -901097 -913896
$$ packed form
11962a084548j0808p74J2219J7601J7505O924L378J6804J4846N192n785j0477
11950a017923p09k702j4158j2524P148q918l477N092M864N44q140K6216J6275
11937a008412N963p464j3182K724K40o188J253M77R507L906O221J5717R0k5281
11923a014429J28N207n597R63P61j4777J2922j0248N50M578J2938P268J8153O10
11909i80973j2479J6170m397l851P135O601P523j3197J3041K6251K218O53j3427
11896i48732m946J0606r826q1K9541J6666L818p532j3723j4706j7532K121q797
11883i63123j3610L3259L0360r499k4897O50J815P178K009L035K901o549M878
11870i31593P887p801j2052r337Q194J2190L688L671R055L650L351Q000j2799
$$ plain form
11857 -913896 -926280 -921383 -914114 -921708 -915573 -908496 -902005 -904137 -917943 -917809 -914344 -923236 -917995 -892612
11843 -892612 -886631 -909646 -945083 -940299 -923355 -892738 -884198 -898433 -902648 -897451 -884157 -877256 -859083
11830 -859083 -852820 -854671 -865832 -866854 -860512 -853562 -859643 -872499 -878828 -862087 -859773 -852337 -829628
11817 -829628 -831480 -850069 -862289 -858055 -854550 -825723 -822788 -847854 -849836 -836374 -831602 -807285 -779741
11804 -779741 -787165 -813075 -823049 -841850 -847053 -835519 -827307 -824642 -816279 -809177 -795115 -815198 -817612
11791 -817612 -823208 -824908 -827196 -820405 -809193 -802370 -811805 -820695 -804678 -800099 -805371 -831151 -847101
11778 -847101 -848023 -817444 -806487 -795951 -805936 -822436 -802187 -795323 -778006 -756066 -760931 -774156
11766 -774156 -770945 -771252 -756962 -759947 -762697 -781454 -787234 -762808 -761606 -777668 -777922 -789986 -787431
$$ packed form
11857i13896j2384M897P269p594O135P077O491k132j3806J34L465q892N241K5383
11843h92612N981k3015l5437M784J6944L0617Q540j4235m215N197J3294O901J8173
11830h59083O263j851j1161j022O342O950o081j2856o329J6741K314P436K2709
11817h29628j852j8589j2220M234L505K8827K935k5066j982J3462M772K4317K7544
11804g79741p424k5910r974j8801n203J1534Q212K665Q363P102J4062k0083k414
11791h17612n596j700k288O791J1212O823r435q890J6017M579n272k5780j5950
11778h47101r22L0579J0957J0536r985j6500K0249O864J7317K1940m865j3225
11766g74156L211l07J4290k985k750j8757n780K4426J202j6062k54j2064K555
$$ plain form
11753 -787431 -780059 -781048 -775484 -782093 -783762 -774197 -762905 -764343 -761901 -734686 -726216 -730405 -743387 -763489
11739 -763489 -766451 -770456 -760079 -739364 -742882 -744771 -737226 -729863 -741539 -751013 -751656 -725973 -705342
11726 -705342 -706577 -716227 -726693 -726403 -703969 -722335 -744566 -744919 -743398 -747076 -749595 -739604 -728687
11713 -728687 -711929 -715449 -730083 -729191 -714975 -704385 -698625 -684926 -680346 -708123 -722246 -730708 -722658
11700 -722658 -720565 -695607 -684705 -676897 -670387 -683528 -684458 -695781 -704836 -710847 -701288 -685085 -683441
11687 -683441 -699653 -711450 -699966 -681323 -672726 -678777 -683400 -669701 -655443 -633728 -632026 -648754
11675 -648754 -656261 -662642 -661220 -648307 -643719 -660731 -664883 -669401 -667327 -667428 -664290 -665465 -656461 -645755
11661 -645755 -652921 -651558 -645248 -644008 -628613 -622881 -648085 -655868 -645342 -637417 -652661 -651517 -644761
$$ packed form
11753g87431P372r89N564o609j669R565J1292j438K442K7215Q470m189j2982k0102
11739g63489k962m005J0377K0715l518j889P545P363j1676r474o43K5683K0631
11726g05342j235r650j0466K90K2434j8366k2231l53J521l678k519R991J0917
11713g28687J6758l520j4634Q92J4216J0590N760J3699M580k7777j4123q462Q050
11700g22658K093K4958J0902P808O510j3141r30j1323r055o011R559J6203J644
11687f83441j6212j1797J1484J8643Q597o051m623J3699J4258K1715J702j6728
11675f48754p507o381J422J2913M588j7012m152m518K074j01L138j175R004J0706
11661f45755p166J363O310J240J5395N732k5204p783J0526P925j5244J144O756
$$ plain form
11648 -644761 -639170 -649357 -638368 -617816 -603973 -613434 -625186 -640076 -639411 -640975 -638227 -657434 -667241
11635 -667241 -644334 -615507 -592047 -582320 -586196 -594180 -579599 -571187 -580080 -585675 -567029 -565153 -589436
11622 -589436 -615287 -620054 -611658 -614236 -608561 -593025 -568533 -580521 -596491 -595874 -585864 -566818 -574746
11609 -574746 -592128 -613553 -619456 -623036 -611720 -599318 -604148 -595350 -583732 -590173 -581109 -570500 -557313
11596 -557313 -542427 -531622 -540467 -548436 -548759 -552788 -546542 -542244 -544689 -541335 -549634 -554539 -563449 -564776
11582 -564776 -572947 -567768 -568827 -555273 -551103 -569276 -563102 -537609 -520667 -513214 -522235 -537459 -538699
11569 -538699 -541879 -560217 -564327 -552742 -553393 -575846 -573730 -575287 -571652 -576174 -593332 -588010 -576103
11556 -576103 -557312 -543263 -546059 -546104 -543668 -538397 -547250 -549827 -532522 -546229 -547844 -534508 -536245
$$ packed form
11648f44761N591j0187J0989K0552J3843r461j1752j4890O65j564K748j9207r807
11635f67241K2907K8827K3460R727l876p984J4581Q412q893n595J8646J876k4283
11622e89436k5851m767Q396k578N675J5536K4492j1988j5970O17J0010J9046p928
11609e74746j7382k1425n903l580J1316J2402m830Q798J1618o441R064J0609J3187
11596e57313J4886J0805q845p969l23m029O246M298k445L354q299m905q910j327
11582e64776q171N179j059J3554M170j8173O174K5493J6942P453r021j5224j240
11569e38699l180j8338m110J1585o51k2453K116j557L635m522j7158N322J1907
11556e76103J8791J4049k796m5K436N271q853k577J7305j3707j615J3336j737
$$ plain form
11543 -536245 -513235 -507621 -501912 -500287 -504847 -524020 -542911 -542074 -535345 -547412 -552196 -542257 -527308
11530 -527308 -522475 -503085 -501971 -508737 -514168 -531341 -513591 -503289 -503337 -513224 -499833 -493432 -505832
11517 -505832 -497449 -489045 -493713 -487530 -485414 -498592 -483466 -476144 -464537 -480388 -506219 -513947 -505423
11504 -505423 -505357 -509717 -489441 -462246 -465302 -477954 -496788 -497436 -489991 -489675 -498239 -500593 -490556 -483184
11490 -483184 -477544 -457904 -464556 -467186 -447701 -462524 -461429 -459640 -471983 -472653 -462513 -459478 -474916
11477 -474916 -485402 -472002 -470288 -461894 -449487 -440883 -435957 -424278 -437612 -456414 -465089 -460038 -460370
11464 -460370 -461700 -453665 -457382 -446321 -454900 -473971 -475437 -474260 -465709 -444884 -424944 -433927 -456438
11451 -456438 -456095 -448273 -468170 -459614 -446895 -425097 -414974 -407621 -419011 -419530 -424223 -413726 -415453
$$ packed form
11543e36245K3010N614N709J625m560j9173j8891Q37O729j2067m784R939J4949
11530e27308M833J9390J114o766n431j7173J7750J0302m8r887J3391O401j2400
11517e05832Q383Q404m668O183K116j3178J5126P322J1607j5851k5831p728Q524
11504e05423O6m360K0276K7195l056j2652j8834o48P445L16q564k354J0037P372
11490d83184N640J9640o652k630J9485j4823J095J789j2343o70J0140L035j5438
11477d74916j0486J3400J714Q394J2407Q604M926J1679j3334j8802q675N051l32
11464d60370j330Q035l717J1061q579j9071j466J177Q551K0825J9940q983k2511
11451d56438L43P822j9897Q556J2719K1798J0123P353j1390n19m693J0497j727
$$ plain form
11438 -415453 -430456 -419775 -398929 -395405 -404490 -403878 -404805 -404906 -418723 -432636 -418750 -422259 -441887
11425 -441887 -453702 -438008 -435231 -426290 -420520 -404747 -394047 -405994 -412085 -419103 -421574 -432243 -430403
11412 -430403 -441182 -438109 -431117 -414920 -416929 -440903 -447213 -420696 -414118 -406971 -413059 -408705 -381424
11399 -381424 -366668 -379389 -392019 -403585 -411198 -388834 -389038 -376412 -376881 -379428 -384570 -387324 -390968
11386 -390968 -379973 -383296 -381233 -363543 -343665 -366026 -388860 -390572 -388735 -371812 -347517 -364494
11374 -364494 -370893 -368895 -368345 -357436 -337605 -344515 -365782 -379384 -371251 -348588 -338768 -340376 -346287
11361 -346287 -330981 -326369 -342412 -354509 -374996 -374427 -363975 -348094 -349973 -346545 -338251 -333030 -334734
11348 -334734 -325935 -315989 -317323 -340319 -337216 -324092 -331473 -337085 -333952 -336104 -346757 -362337 -348446
$$ packed form
11438d15453j5003J0681K0846L524r085O12r27j01j3817j3913J3886l509j9628
11425d41887j1815J5694K777Q941N770J5773J0700j1947o091p018k471j0669J840
11412d30403j0779L073O992J6197k009k3974o310K6517O578P147o088M354K7281
11399c81424J4756j2721j2630j1566p613K2364k04J2626m69k547n142k754l644
11386c90968J0995l323K063J7690J9878k2361k2834j712J837J6923K4295j6977
11374c64494o399J998N50J0909J9831o910k1267j3602Q133K2663R820j608n911
11361c46287J5306M612j6043j2097k0487N69J0452J5881j879L428Q294N221j704
11348c34734Q799R946j334k2996L103J3124p381n612L133k152j0653j5580J3891
$$ plain form
11335 -348446 -329788 -344739 -347318 -350132 -349835 -336694 -322890 -322836 -327997 -334932 -323016 -297132 -282027
11322 -282027 -304567 -315340 -315349 -318789 -323304 -330887 -337062 -333836 -323621 -305473 -292935 -296130 -293667 -279004
11308 -279004 -275833 -282834 -295551 -292860 -297846 -308737 -307321 -297873 -305830 -315116 -305457 -297946 -289010 -295799
11294 -295799 -293892 -290840 -280460 -291466 -296105 -280055 -272111 -272691 -265855 -271871 -290098 -294449 -276601
11281 -276601 -275833 -270340 -271194 -279707 -291695 -305821 -299438 -304640 -297292 -305219 -301225 -289933 -284751 -289672
11267 -289672 -276905 -275376 -258877 -268073 -287701 -278595 -262441 -273288 -276680 -255566 -252254 -252258 -246555
11254 -246555 -235642 -234326 -240996 -262600 -258560 -237108 -228294 -217512 -230042 -235310 -237643 -234228 -219704
11241 -219704 -218476 -224043 -254947 -282041 -257878 -239191 -237767 -219190 -217988 -223743 -211367 -215619 -229272
$$ packed form
11335c48446J8658j4951k579k814K97J3141J3804N4n161o935J1916K5884J5105
11322b82027k2540j0773rl440m515p583o175L226J0215J8148J2538l195K463J4663
11308b79004L171p001j2717K691m986j0891J416R448p957r286R659P511Q936o789
11294b95799J907L052J0380j1006m639J6050P944n80O836o016j8227m351J7848
11281b76601P68N493q54q513j1988j4126O383n202P348p927L994J1292N182m921
11267b89672J2767J529J6499r196j9628R106J6154j0847l392K1114L312mN703
11254b46555J0913J316o670k1604M040K1452Q814J0782j2530n268k333L415J4524
11241b19704J228n567l0904k7094K4163J8687J424J8577J202n755J2376m252j3653
$$ plain form
11228 -229272 -234353 -239609 -228953 -217491 -208157 -197890 -184392 -186209 -195706 -199201 -224459 -255593 -258525
11215 -258525 -257711 -264213 -265399 -272491 -282763 -256275 -235608 -229046 -230600 -241442 -238323 -244453 -254988
11202 -254988 -232459 -231795 -220835 -219530 -228337 -243725 -250045 -253309 -227478 -224958 -249057 -251000 -227330
11189 -227330 -209979 -202304 -201276 -194883 -193086 -206743 -206215 -208466 -205724 -191537 -188548 -217078 -222613
11176 -222613 -216139 -199459 -195813 -195577 -194062 -191229 -188422 -193445 -195495 -204226 -204512 -186713 -190888 -181156
11162 -181156 -192579 -199884 -198815 -187530 -172942 -165693 -165839 -171854 -169543 -170205 -168243 -161239 -158427 -160849
11148 -160849 -160560 -157213 -173832 -179267 -155682 -154019 -163933 -156066 -147483 -153060 -150321 -137950 -140555 -156195
11134 -156195 -157192 -160304 -155180 -173473 -178259 -165946 -144620 -143774 -157867 -186991 -208568 -203224 -180314
$$ packed form
11228b29272n081n256J0656J1462R334J0267J3498j817r497l495k5258l1134k932
11215b58525Q14o502j186p092j0272K6488K0667O562j554j0842L119o130j0535
11202b54988K2529O64J0960J305q807j5388o320l264K5831K520k4099j943K3670
11189b27330J7351P675J028O393J797j3657N28k251K742J4187K989k8530n535
11176b22613O474J6680L646K36J515K833K807n023k050q731k86J7799m175R732
11162a81156j1423p305J069J1285J4588P249j46o015K311o62J962P004K812k422
11148a60849K89L347j6619n435K3585J663r914P867Q583n577K739J2371k605j5640
11134a56195r97l112N124j8293m786J2313K1326Q46j4093k9124k1577N344K2910
$$ plain form
11121 -180314 -167171 -159871 -162017 -171347 -156982 -145974 -141717 -145011 -130151 -130429 -140542 -143458 -141899
11108 -141899 -133124 -115933 -110592 -107197 -121343 -139959 -155931 -145578 -149561 -129776 -111259 -103439
11096 -103439 -105679 -123003 -130820 -120608 -103942 -106423 -102336 -112118 -110533 -122814 -130274 -120204 -106919
11083 -106919 -97046 -82792 -85458 -74341 -64269 -58756 -65296 -73173 -63523 -73518 -91276 -100307 -92857
11070 -92857 -65667 -63992 -77456 -88047 -66464 -68350 -75200 -70349 -64767 -81277 -97311 -106576 -70310
11057 -70310 -88348 -94129 -80135 -55675 -34601 -42941 -45944 -74219 -77130 -68953 -59445 -76801 -66120
11044 -66120 -59250 -62905 -81282 -85177 -91412 -84867 -69806 -58828 -44834 -30852 -49741 -58426 -49674
11031 -49674 -37834 -38017 -57658 -64770 -65502 -55179 -58288 -57746 -55731 -29783 -13039 -10424 -27452 -34565
$$ packed form
11121a80314J3143P300k146r330J4365J1008M257l294J4860k78j0113k916J559
11108a41899Q775J7191N341L395j4146j8616j5972J0353l983J9785J8517P820
11096a03439k240j7324p817J0212J6666k481M087r782J585j2281p460J0070J3285
11083a06919R873J4254k666J1117J0072N513o540p877R650r995j7758r031P450
11070i2857K7190J675j3464j0591K1583j886o850M851N582j6510j6034r265L6266
11057g0310j8038n781J3994K4460K1074q340l003k8275k911Q177R508j7356J0681
11044f6120O870l655j8377l895o235O545J5061J0978J3994J3982j8889q685Q752
11031d9674J1840j83j9641p112p32J0323l109N42K015K5948J6744K615j7028p113
$$ plain form
11017 -34565 -30804 -37732 -41491 -50493 -53251 -41580 -33874 -36405 -19830 -34861 -31691 -17083 -12710
11004 -12710 -24159 -14140 14964 23426 20064 25639 29695 37226 49790 24419 10376 15816 31242
10991 31242 41108 49551 74423 81735 85917 83597 74357 72172 34708 27203 10358 -14760 -27482
10978 -27482 -48094 -57802 -30839 -23262 -11891 -9745 3469 16166 20433 32813 52887 68675
10966 68675 83664 90680 104019 101497 110812 119243 118849 141778 158789 164179 178361 196118 198867
10953 198867 227933 268238 319868 378574 431218 476872 489496 431996 319756 152071 -56675
10942 -56675 -260090 -405941 -506439 -547251 -538853 -477164 -409844 -351355 -325751 -277037 -240431
10931 -240431 -235572 -216342 -205093 -189939 -186527 -204065 -199797 -218209 -201978 -179926 -183576 -167806
$$ packed form
11017c4565L761o928l759r002k758J1671P706k531J6575j5031L170J4608M373
11004a2710j1449J0019K9104Q462l362N575M056P531J2564k5371j4043N440J5426
10991C1242R866Q443K4872P312M182k320r240k185l7464p505j6845k5118j2722
10978b7482k0612r708K6963P577J1371K146J3214J2697M267J2380K0074J5788
10966F8675J4989P016J3339k522R315Q431l94K2929J7011N390J4182J7757K749
10953A98867K9066M0305N1630N8706N2644M5654J2624n7500j12240j67685k08746
10942e6675k03415j45851j00498m0812Q398O1689O7320N8489K5604M8714L6606
10931b40431M859J9230J1249J5154L412j7538M268j8412J6231K2052l650J5770
$$ plain form
10919 -167806 -168572 -160909 -147233 -122641 -107448 -106992 -125360 -131595 -133877 -116034 -119519 -125779 -137924
10906 -137924 -151513 -139550 -126445 -125311 -111649 -81679 -62928 -72222 -69781 -54959 -63223 -74735
10894 -74735 -70707 -52895 -45365 -51026 -55964 -68236 -98595 -94241 -97922 -109396 -124179 -122346 -98440
10881 -98440 -75377 -75314 -63668 -61162 -44562 -41721 -40738 -39169 -23320 -8478 -869 -4027 -26259 -38174
10867 -38174 -36524 -45941 -46736 -46066 -44726 -38761 -31069 -2163 13905 18824 17902 5023 -13885 -41869
10853 -41869 -30042 -38677 -34853 -6792 -10476 -28290 -24037 -3461 5753 -9785 -1314 17570 20049
10840 20049 8249 14126 977 8323 14626 20630 24733 24124 17110 23154 28054 50696 56789 46975
10826 46975 26367 8161 2478 16499 26895 41675 43502 41297 29952 17377 39105 49191
$$ packed form
10919a67806p66P663J3676K4592J5193M56j8368o235k282J7843l485o260j2145
10906a37924j3589J1963J3105J134J3662K9970J8751r294K441J4822q264j1512
10894g4735M028J7812P530n661m938j2272l0359M354l681j1474j4783J833K3906
10881i8440K3063O3J1646K506J6600K841R83J569J5849J4842P609l158k2232j1915
10867c8174J650r417p95O70J340N965P692K8906J6068M919r22j2879j8908k7984
10853d1869J1827q635L824K8061l684j7814M253K0576R214j5538Q471J8884K479
10840B0049j1800N877j3149P346O303O004M103o09p014O044M900K2642O093r814
10826D6975k0608j8206n683J4021J0396J4780J827k205j1345j2575K1728J0086
$$ plain form
10814 49191 35595 33925 69762 63833 42225 39283 32202 22498 32856 49393 58640 48328 35355
10801 35355 32169 32013 48504 40023 22191 16046 9549 3040 -7769 -5772 -8079 -17195 -19312 -2775
10787 -2775 19527 16867 15055 9530 5156 14434 30482 53491 46731 30543 27653 35947 47838
10774 47838 37979 22804 23327 37222 21808 18388 28870 20135 34813 79704 79158 55459 34926
10761 34926 25812 29270 33294 43010 66310 82842 86832 67201 68736 93292 115140 125275 124093
10748 124093 110964 96273 72140 56773 46932 27686 21307 22315 44537 53719 52032 79077
10736 79077 99183 89205 79969 74514 40999 24640 38604 57989 83943 92161 82470 80682 86225
10723 86225 86672 98729 98427 101101 94021 79414 71420 70469 76144 102831 94838 78810 88770 91926
$$ packed form
10814D9191j3596j670L5837n929k1608k942p081r704J0358J6537R247j0312j2973
10801C5355l186j56J6491q481j7832o145o497o509j0809J997k307r116k117J6537
10787b775K2302k660j812n525m374R278J6048K3009o760j6188k890Q294J1891
10774D7838r859j5175N23J3895j5414l420J0482q735J4678M4891n46k3699k0533
10761C4926r114L458M024R716K3300J6532L990j9631J535K4556K1848J0135j182
10748A24093j3129j4691k4133j5367r841j9246o379J008K2222R182j687K7045
10736G9077K0106r978r236n455l3515j6359J3964J9385K5954Q218r691j788N543
10723H6225M47J2057l02K674p080j4607p994r51N675K6687p993j6028R960L156
$$ plain form
10709 91926 83754 92732 105072 107784 101172 95637 100433 103359 99914 115857 126752 130220 115097
10696 115097 108458 100915 114851 133600 131060 124540 125170 110270 88730 78458 80027 69197 68006
10683 68006 84748 100629 96669 101472 109870 123460 123302 105956 112638 125029 128356 114493 109365
10670 109365 124147 107380 94529 102637 112784 119121 124837 133231 155519 139490 110082 96954
10658 96954 108963 116976 139536 144974 143374 113653 108498 108415 111113 114373 132822 138268 151474 149723
10644 149723 133685 149699 156066 140257 138302 128179 131825 148791 180136 175025 166954 152624
10632 152624 147024 146287 135115 135216 136894 115865 98438 111802 133531 135411 136340 148540 152488
10619 152488 149841 159520 169568 182949 178532 176097 178580 188755 184315 178922 181420 180765 187559 188535
$$ packed form
10709I1926q172Q978J2340K712o612n535M796K926l445J5943J0895L468j5123
10696A15097o639p543J3936J8749k540o520O30j4900k1540j0272J569j0830j191
10683F8006J6742J5881l960M803Q398J3590j58j7346O682J2391L327j3863n128
10670A09365J4782j6767j2851Q108J0147O337N716Q394K2288j6029k9408j3128
10658I6954J2009Q013K2560N438j600k9721n155q3K698L260J8449N446J3206j751
10644A49723j6038J6014O367j5809j955j0123L646J6966L1345n111q071j4330
10632A52624n600p37j1172J01J678k1029j7427J3364K1729J880R29J2200L948
10619A52488k647R679J0048J3381m417k435K483J0175m440n393K498o55O794R76
$$ plain form
10605 188535 180171 168359 181798 183693 194983 203331 216994 205978 184644 184980 183174 167742 177361
10592 177361 175657 160320 151995 160237 176058 169380 182320 175036 184003 186353 198229 206054 191924
10579 191924 189092 173752 182641 186025 185706 194280 208539 214442 201419 200612 192322 208670 233236
10566 233236 230528 210395 185404 195322 204283 213234 201446 206914 225775 200085 183713 191438 193523
10553 193523 207431 221951 218843 215856 213536 227477 228489 206452 205533 231294 237813 238334 223661
10540 223661 227310 239773 238637 243901 242375 234968 243066 219337 204950 221243 239304 245494 232960
10527 232960 226343 229272 246876 261838 261353 258013 256871 253132 258832 282807 280537 249918 253330
10514 253330 248534 243531 235808 238716 230568 224518 227440 253226 259187 263759 270667 262723 261746 281988
$$ packed form
10605A88535q364j1812J3439J895J1290Q348J3663j1016k1334L36j806j5432R619
10592A77361j704j5337q325Q242J5821o678J2940p284Q967K350J1876P825j4130
10579A91924k832j5340Q889L384l19Q574J4259N903j3023q07q290J6348K4566
10566B33236k708k0133k4991R918Q961Q951j1788N468J8861k5690j6372P725K085
10553A93523J3908J4520l108k987k320J3941J012k2037r19K5761O519N21j4673
10540B23661L649J2463j136N264j526p407Q098k3729j4387J6293J8061O190j2534
10527B32960o617K929J7604J4962m85l340j142l739N700K3975k270l0619L412
10514B53330m796n003p723K908q148o050K922K5786N961M572O908p944r77K0242
$$ plain form
10500 281988 279373 287569 301750 291322 261790 252550 265708 293673 286347 269731 261299 276816
10488 276816 293141 302212 295880 291996 292199 287094 306652 316597 299857 285708 301230 298434 295998
10475 295998 312689 302281 313584 320836 300659 297230 292020 272860 270020 289463 299532 311506
10463 311506 324767 303307 304356 306606 305260 297150 271242 265690 284849 298222 291427 277393 273076
10450 273076 261957 243975 252931 274728 273248 277278 272542 277507 273037 280789 277650 276080 289793
10437 289793 296223 297752 293298 284693 270435 277152 292840 291737 280208 289254 289825 283754 265680
10424 265680 255850 274457 294262 298499 300400 303482 310548 306046 298562 302656 314316 331329 356209
10411 356209 348596 343423 346673 325710 334146 353443 362754 359877 353079 343445 347603 367591 384361
$$ packed form
10500B81988k615Q196J4181j0428k9532r240J3158K7965p326j6616q432J5517
10488B76816J6325R071o332l884K03n105J9558R945j6740j4149J5522k796k436
10475B95998J6691j0408J1303P252k0177l429n210j9160k840J9443J0069J1974
10463C11506J3261k1460J049K250j346q110k5908n552J9159J3373o795j4034m317
10450B73076j1119j7982Q956K1797j480M030m736M965m470P752l139j570J3713
10437B89793O430J529m454q605j4258O717J5688j103j1529R046N71o071j8074
10424B65680r830J8607J9805M237J901L082P066m502p484M094J1660J7013K4880
10411C56209p613n173L250k0963Q436J9297R311k877o798r634M158J9988J6770
$$ plain form
10398 384361 374376 364362 364749 369651 360578 355965 352115 362486 362068 369423 390773 395996 388606 396120
10384 396120 390193 387733 382769 393313 412268 426829 409943 399940 397181 399758 416303 415274 395285
10371 395285 384879 379389 384468 379074 408822 408830 384346 381027 383921 396686 388470 379559 379632 400074
10357 400074 413742 418679 403637 399767 402972 390474 373459 381864 388745 398791 399377 399217 400352
10344 400352 391843 396999 391191 391327 381429 371778 383800 394903 403655 403830 401393 398300 383249 407877
10330 407877 409606 412084 422231 428730 440059 442259 436697 422330 416985 424526 433879 455698 460578
10317 460578 468953 468641 462905 466470 458404 432998 433336 435932 411879 409117 389230 389280 412393 427066
10303 427066 422101 429158 430341 424440 421560 419258 442581 454768 462959 471854 476352 454730 431906
$$ packed form
10398C84361r985j0014L87M902r073m613l850J0371m18P355K1350N223p390P514
10384C96120n927k460m964J0544J8955J4561j6886j0003k759K577J6545j029j9989
10371C95285j0406n490N079n394K9748Qk4484l319K894J2765q216q911P3K0442
10357D00074J3668M937j5042l870L205j2498j7015Q405O881J0046N86j60J135
10344D00352q509N156n808J36r898r651J2022J1103Q752J75k437l093j5051K4628
10330D07877J729K478J0147O499J1329K200n562j4367n345P541R353K1819M880
10317D60578Q375l12n736L565q066k5406L38K596k4053k762j9887N0K3113J4673
10303D27066m965P057J183n901k880k302K3323J2187Q191Q895M498k1622k2824
$$ plain form
10290 431906 423280 424742 435525 465225 466467 437964 442185 442366 450619 482257 495513 478358 462676
10277 462676 456844 451657 447007 446334 453784 453074 454899 477088 491272 487421 504802 518726 528750
10264 528750 519883 503931 510375 519421 500936 505504 508977 500412 471420 453263 454677 456930 475444
10251 475444 510135 527147 538007 530472 519560 515500 507375 494328 513202 535424 537251 529808
10239 529808 522548 529468 543153 521765 520810 524545 509785 501412 489713 487294 472910 473021 491166
10226 491166 495342 490997 503577 516148 519454 521910 520973 508954 501208 501922 510065 503878 523480 534208
10212 534208 534133 526214 528380 532750 512831 505460 520701 526798 541680 552551 532735 533508 528862 526857
10198 526857 533101 542574 547897 522010 509294 522388 511910 516134 544732 553962 564163 558853 553480
$$ packed form
10290D31906q626J462J0783K9700J242k8503M221J81Q253L1638J3256j7155j5682
10277D62676n832n187m650o73P450p10J825K2189J4184l851J7381J3924J0024
10264E28750q867j5952O444R046j8485M568L473q565k8992j8157J414K253J8514
10251D75444L4691J7012J0860p535j0912m060q125j3047J8874K2222J827p443
10239E29808p260O920J3685k1388r55L735j4760q373j1699k419j4384J11J8145
10226D91166M176m345J2580J2571L306K456r37j2019p746P14Q143o187J9602J0728
10212E34208p5p919K166M370j9919p371J5241O097J4882J0871j9816P73m646k005
10198E26857O244R473N323k5887j2716J3094j0478M224K8598R230J0201n310n373
$$ plain form
10185 553480 555210 564825 562530 566584 569999 568423 564536 564515 561060 569720 590313 581771 583422 585941
10171 585941 576066 581425 580247 570417 583348 586934 572276 562544 571402 595503 594075 586470 564008
10158 564008 565540 577339 580835 580645 591459 599570 614690 610026 600359 592587 590389 583500 600758
10145 600758 601581 598888 598291 594528 601279 621233 625439 610608 596795 588494 589180 596701 603081 612264
10131 612264 626953 630715 622496 631495 627885 617976 621349 619552 624176 632006 628311 633076 628158 623814
10117 623814 631940 634977 648714 638869 626832 638929 648997 631631 637049 653637 645976 662930
10105 662930 677527 660967 663938 672000 687399 726402 711002 676056 644612 619182 636438 634785
10093 634785 630551 636803 667862 697478 708150 702547 693935 688413 692627 683892 697218 701716 702636
$$ packed form
10185E53480J730R615k295M054L415j576l887k1l455Q660K0593q542J651K519
10171E85941r875N359j178r830J2931L586j4658r732Q858K4101j428p605k2462
10158E64008J532J1799L496j90J0814Q111J5120m664r667p772k198o889J7258
10145F00758Q23k693n97l763O751J9954M206j4831j3813q301O86P521O380R183
10131F12264J4689L762q219Q999l610r909L373j797M624P830l695M765m918m344
10117F23814Q126L037J3737r845j2037J2097J0068j7366N418J6588p661J6954
10105F62930J4597j6560K971Q062J5399L9003j5400l4946l1444k5430J7256j653
10093F34785m234O252L1059K9616J0672n603q612n522M214q735J3326M498R20
$$ plain form
10080 702636 707234 692150 703883 708791 691042 670854 665063 677212 687793 702521 707779 715956
10068 715956 729568 731594 756771 756775 735284 704722 683867 690947 720886 734326 739935 754607 778943
10055 778943 803483 829055 832990 850328 836419 757162 668382 624706 630109 663184 671855 664065
10043 664065 671711 678785 692666 705807 699533 678637 665095 652112 672302 698072 710860 700571
10031 700571 686728 703592 719737 739285 748191 749618 753749 751524 747654 737437 743422 751325 746905
10018 746905 736909 731652 738604 733692 750195 762661 775533 787051 787073 792116 787058 781710 795884
10005 795884 798362 786923 769323 765638 761174 752435 766138 784104 797375 785979 792532 783539 776438
9992 776438 795202 815430 814994 802551 796441 803205 815599 818906 824543 831952 833526 811908 824523
$$ packed form
10080G02636M598j5084J1733M908j7749k0188n791J2149J0581J4728N258Q177
10068G15956J3612K026K5177Mk1491l0562k0855P080K9939J3440N609J4672K4336
10055G78943K4540K5572L935J7338j3909p9257q8780m3676N403L3075Q671p790
10043F64065P646P074J3881J3141o274k0896j3542j2983K0190K5770J2788j0289
10031G00571j3843J6864J6145J9548Q906J427M131k225l870j0217N985P903m420
10018G46905r996n257O952m912J6503J2466J2872J1518K2N043n058n348J4174
10005G95884K478j1439j7600l685m464q739J3703J7966J3271j1396O553q993p101
9992G76438J8764K0228m36j2443o110O764J2394L307N637P409J574k1618J2615
$$ plain form
9979 824523 846931 839733 843579 858522 860187 851696 845800 837762 858057 859255 852106 860666 867453 868695
9965 868695 873436 883169 862531 853933 851140 855517 877840 906548 917806 940364 925538 906579 905393
9952 905393 902758 905252 909315 925754 920983 907977 926128 949195 974875 976102 966796 965972 978721
9939 978721 1007904 1025379 1025924 1021283 1060587 1095112 1076775 973555 818288 710844 672122 664072
9927 664072 686370 718329 742367 773047 783401 788769 810238 837458 855186 851259 858033 846723
9915 846723 861227 882072 879903 876240 862691 861995 872404 879435 878167 878023 882114 896368 910244
9902 910244 909189 897375 886856 898911 913794 907562 899448 908929 926356 924116 907010 897081 897011
9889 897011 905235 911511 922348 922162 925468 945709 960504 978024 957322 941879 939172 944367 959670
$$ packed form
9979H24523K2408p198L846J4943J665q491n896q038K0295J198p149Q560O787J242
9965H68695M741R733k0638q598k793M377K2323K8708J1258K2558j4826j8959j186
9952I05393k635K494M063J6439m771j3006J8151K3067K5680J227r306q24J2749
9939I78721K9183J7475N45m641L9304L4525j8337j03220j55267j07444l8722q050
9927F64072K2298L1959K4038L0680J0354N368K1469K7220J7728l927O774j1310
9915H46723J4504K0845k169l663j3549o96J0409P031j268j44M091J4254J3876
9902I10244j055j1814j0519J2055J4883o232q114R481J7427k240j7106r929p0
9889H97011Q224O276J0837j86L306K0241J4795J7520k0702j5443k707N195J5303
$$ plain form
9876 959670 950846 942953 955735 950582 957140 970160 956813 957068 971202 963924 959293 964247 970977 990178
9862 990178 1020377 1049458 1045257 1024283 1014314 1013268 1018116 1020748 1027704 1028741 1032914 1019832 992047
9849 992047 985641 982977 983019 962520 954462 978041 1000383 1019659 1036936 1028899 1006795 1008308 1022518
9836 1022518 1051194 1052083 1051224 1044361 1024866 1016861 1021547 1040842 1035360 1023598 1042245 1046372 1049448
9823 1049448 1066563 1060699 1064724 1055048 1050357 1059069 1070050 1046356 1031367 1033319 1052026 1080435 1092137
9810 1092137 1086322 1099418 1094833 1084973 1083862 1082683 1082612 1085763 1095534 1085097 1073135 1087123 1089739 1082736
9796 1082736 1069001 1075107 1086018 1071449 1065620 1085217 1093099 1090077 1074449 1085467 1116315 1131345
9784 1131345 1151101 1157621 1139205 1119070 1131120 1131198 1134410 1137560 1128575 1121398 1134810 1142678 1151660
$$ packed form
9876I59670q824p893J2782n153O558J3020j3347K55J4134p278m631M954O730J9201
9862I90178L0199K9081m201k0974r969j046M848K632O956J037M173j3082k7785
9849I92047o406k664M2k0499q058K3579K2342J9276J7277q037k2104J513J4210
9836A022518K8676Q89q59o863j9495q005M686J9295n482j1762J8647M127L076
9823A049448J7115n864M025r676m691Q712J0981k3694j4989J952J8707K8409J1702
9810A092137n815J3096m585r860j111j179p1L151R771j0437j1962J3988K616p003
9796A082736j3735O106J0911j4569n829J9597P882l022j5628J1018L0848J5030
9784A131345J9756O520j8416k0135J2050P8L212L150q985p177J3412P868Q982
$$ plain form
9771 1151660 1154334 1152031 1152561 1159158 1140770 1141304 1149146 1137319 1116748 1120336 1124761 1141579 1151220 1153492
9757 1153492 1154000 1145792 1145296 1186555 1200573 1192307 1198525 1190946 1199626 1190428 1176845 1193790 1194654 1191248
9743 1191248 1205676 1209340 1209836 1207993 1207020 1205246 1214917 1226867 1219553 1227337 1212877 1216137 1229961 1224575
9729 1224575 1245003 1278178 1270475 1249382 1242376 1255653 1262711 1263040 1256847 1248845 1264143 1260646 1244151
9716 1244151 1241180 1243023 1261710 1268534 1270516 1282781 1284780 1271628 1267183 1279534 1283485 1298528 1303117
9703 1303117 1281874 1282172 1265543 1243248 1235480 1256129 1287817 1315657 1339986 1325268 1314341 1333998
9691 1333998 1324965 1307301 1302799 1301353 1302100 1315048 1319346 1340058 1334134 1330088 1338523 1371139 1378524
9678 1378524 1375214 1357946 1356310 1348250 1350595 1347422 1344757 1354101 1368778 1367828 1373928 1381278 1380502 1375532
$$ packed form
9771A151660K674k303N30O597j8388N34P842j1827k0571L588M425J6818R641K272
9757A153492N08q208m96M1259J4018q266O218p579Q680r198j3583J6945Q64l406
9743A191248J4428L664M96j843r73j774R671J1950p314P784j4460L260J3824n386
9729A224575K0428L3175p703k1093p006J3277P058L29o193q002J5298l497j6495
9716A244151k971J843J8687O824J982J2265J999j3152m445J2351L951J5043M589
9703A303117k1243K98j6629k2295p768K0649L1688K7840K4329j4718j0927J9657
9691A333998r033j7664m502j446P47J2948M298K0712n924m046Q435L2616P385
9678A378524l310j7268j636q060K345l173k665R344J4677r50O100P350p76m970
$$ plain form
9664 1375532 1374565 1392314 1410071 1406238 1400690 1389970 1397880 1397524 1392558 1392292 1390029 1388929 1381440 1391687
9650 1391687 1409271 1420542 1426063 1426499 1424765 1415602 1420508 1407115 1413695 1437522 1443894 1425738 1434040
9637 1434040 1435144 1438474 1425619 1427891 1439270 1457752 1454792 1441387 1454237 1466518 1463188 1466291 1470989
9624 1470989 1476674 1486840 1478617 1465252 1464955 1493935 1502483 1488944 1474985 1488148 1507146 1515104 1512180
9611 1512180 1500908 1499580 1516627 1524112 1522064 1536839 1552294 1546458 1539055 1552347 1558577 1555778 1554405
9598 1554405 1553389 1555863 1550561 1533456 1537670 1540522 1559525 1578720 1569648 1575373 1577456 1570608 1579731
9585 1579731 1582024 1578058 1596462 1591307 1591935 1596020 1593245 1591035 1598025 1608092 1603594 1606354 1613275 1605163
9571 1605163 1595556 1599747 1636292 1643044 1622644 1626115 1643353 1657847 1663346 1665487 1666404 1663007 1658489
$$ packed form
9664A375532r67J7749J7757l833n548j0720P910l56m966k66k263j100p489J0247
9650A391687J7584J1271N521M36j734r163M906j3393O580K3827O372j8156Q302
9637A434040J104L330j2855K272J1379J8482k960j3405J2850J2281l330L103M698
9624A470989N685J0166q223j3365k97K8980Q548j3539j3959J3163J8998P958k924
9611A512180j1272j328J7047P485k048J4775J5455n836p403J3292O230k799j373
9598A554405j016K474n302j7105M214K852J9003J9195r072N725K083o848R123
9585A579731K293l966J8404n155O28M085k775k210O990J0067m498K760O921q112
9571A605163r607M191L6545O752k0400L471J7238J4494N499K141R17l397m518
$$ plain form
9558 1658489 1637263 1629219 1637000 1659169 1683815 1684849 1684769 1681321 1669387 1668372 1673749 1672134 1696905
9545 1696905 1720254 1718942 1713497 1700183 1694664 1693292 1696747 1700700 1705311 1728453 1746482 1726631 1723884
9532 1723884 1742571 1739208 1725994 1724080 1719896 1740617 1759960 1740474 1735539 1738888 1757293 1763270 1779326
9519 1779326 1773537 1784611 1789743 1792755 1784393 1769213 1780893 1797346 1808401 1809259 1799537 1798490 1808384
9506 1808384 1826720 1835178 1823009 1819706 1832005 1838020 1835188 1835016 1843728 1844740 1856152 1857317 1868811
9493 1868811 1867963 1865095 1849547 1838790 1835788 1847085 1864915 1896454 1917060 1914829 1896584 1881284
9481 1881284 1881997 1891146 1906134 1906742 1914521 1916153 1934736 1947167 1937124 1926443 1928972 1931100 1942326
9468 1942326 1960490 1950229 1942416 1954808 1967463 1963244 1971969 1983942 1976885 1973148 1990551 2008486
$$ packed form
9558A658489k1226q044P781K2169K4646J034q0l448j1934j015N377j615K4771
9545A696905K3349j312n445j3314n519j372L455L953M611K3142J8029j9851k747
9532A723884J8687l363j3214j914m184K0721J9343j9486m935L349J8405N977J6056
9519A779326n789J1074N132L012q362j5180J1680J6453J1055Q58r722j047R894
9506A808384J8336Q458j2169l303J2299O015k832j72Q712J012J1412J165J1494
9493A868811q48k868j5548j0757l002J1297J7830L1539K0606k231j8245j5300
9481A881284P13R149J4988O08P779J632J8583J2431j0043j0681K529K128J1226
9468A942326J8164j0261p813J2392J2655m219Q725J1973p057l737J7403J7935
$$ plain form
9456 2008486 2005409 2014358 2012505 1997071 2008649 2009229 2036269 2060461 2053604 2045665 2037913 2061220 2064144
9443 2064144 2057440 2054592 2063676 2076678 2064895 2060428 2066240 2075437 2091450 2083556 2090056 2091204 2100505
9430 2100505 2113217 2112167 2114754 2131205 2165178 2168189 2162983 2171520 2164188 2164014 2171949 2179186 2174159 2180570
9416 2180570 2175897 2184496 2183349 2181011 2182210 2191087 2202325 2221458 2220903 2224183 2218505 2216655 2220182 2226792
9402 2226792 2236102 2246842 2236622 2242226 2233414 2236676 2249479 2245183 2239844 2239355 2242592 2267122 2288160
9389 2288160 2283333 2268671 2257485 2273168 2276651 2287962 2304682 2322601 2331327 2346045 2351951 2343931
9377 2343931 2340593 2368540 2372105 2362593 2365700 2394815 2397219 2399834 2411280 2403658 2388804 2397315 2404657
9364 2404657 2405659 2401753 2397479 2399022 2405535 2430492 2453408 2465279 2473811 2474003 2485146 2492458 2485419
$$ packed form
9456B008486l077Q949j853j5434J1578N80K7040K4192o857p939p752K3307K924
9443B064144o704k848R084J3002j1783m467N812R197J6013p894O500J148R301
9430B100505J2712j050K587J6451L3973L011n206Q537p332j74P935P237n027O411
9416B180570m673Q599j147k338J199Q877J1238J9133n55L280n678j850L527O610
9402B226792R310J0740j0220N604q812L262J2803m296n339m89L237K4530K1038
9389B288160m827j4662j1186J5683L483J1311J6720J7919Q726J4718N906q020
9377B343931l338K7947L565r512L107K9115K404K615J1446p622j4854Q511P342
9364B404657J002l906m274J543O513K4957K2916J1871Q532J92J1143P312p039
$$ plain form
9351 2485419 2494985 2483052 2488289 2498644 2488724 2481660 2494369 2511644 2527662 2521736 2540272 2555095
9339 2555095 2546153 2554760 2571145 2591858 2596463 2590826 2600990 2600833 2602574 2608576 2615289 2619739 2632734
9326 2632734 2641591 2642158 2652936 2653780 2643942 2638212 2661597 2677935 2669617 2671518 2687828 2695792 2706710
9313 2706710 2724108 2727066 2738700 2729732 2711629 2723480 2749693 2770930 2791129 2794596 2790762 2794898
9301 2794898 2805624 2798910 2806357 2807877 2815509 2839317 2845646 2861665 2872281 2871851 2888077 2909315 2901315
9288 2901315 2899778 2913112 2902742 2918529 2930059 2919968 2924238 2929785 2951595 2978529 3001371 2996662
9276 2996662 2967048 2954352 2965354 2984841 3001327 3006453 3030722 3030605 3028045 3037609 3051193 3051941 3057905
9263 3057905 3066627 3072464 3097900 3095673 3102048 3118259 3115654 3116475 3134624 3150622 3170527 3162986 3170976
$$ packed form
9351B485419R566j1933N237J0355r920p064J2709J7275J6018n926J8536J4823
9339B555095q942Q607J6385K0713M605n637J0164j57J741O002O713M450J2995
9326B632734Q857N67J0778Q44r838n730K3385J6338q318J901J6310P964J0918
9313B706710J7398K958J1634q968j8103J1851K6213K1237K0199L467l834M136
9301B794898J0726o714P447J520P632K3808O329J6019J0616m30J6226K1238q000
9288B901315j537J3334j0370J5787J1530j0091M270N547K1810K6934K2842m709
9276B996662k9614j2696J1002J9487J6486N126K4269j17k560R564J3584P48N964
9263C057905Q722N837K5436k227O375J6211k605Q21J8149J5998J9905p541P990
$$ plain form
9250 3170976 3179382 3179496 3195358 3207255 3235775 3229560 3232058 3234043 3231637 3231191 3239325 3259983 3276297
9237 3276297 3285408 3306070 3327947 3341917 3340919 3341123 3356246 3365739 3369503 3402121 3442054 3434867 3450011
9224 3450011 3466901 3474739 3482459 3501589 3501875 3506596 3529084 3553830 3588338 3613453 3647248 3673049
9212 3673049 3712089 3762423 3797766 3828924 3866226 3926344 3975883 3973570 3891083 3717349 3502671
9201 3502671 3331006 3266067 3266534 3313661 3340619 3383229 3421621 3452236 3484056 3540173 3575342 3589638
9189 3589638 3601899 3621591 3638115 3650912 3659930 3678198 3673577 3686007 3733072 3781185 3821645 3858162
9177 3858162 3887897 3906248 3917325 3942033 3986250 4048239 4066716 4061165 4083342 4140980 4219824 4279099
9165 4279099 4357800 4461028 4559916 4638835 4704181 4692094 4460275 4033645 3585748 3270343
$$ packed form
9250C170976Q406J14J5862J1897K8520o215K498J985k406m46Q134K0658J6314
9237C276297R111K0662K1877J3970r98K04J5123R493L764L2618L9933p187J5144
9224C450011J6890P838P720J9130K86M721K2488K4746L4508K5115L3795K5801
9212C673049L9040N0334L5343L1158L7302O0118M9539k313q2487j73734k14678
9201C502671j71665o4939M67M7127K6958M2610L8392L0615L1820N6117L5169J4296
9189C589638J2261J9692J6524J2797R018J8268m621J2430M7065M8113M0460L6517
9177C858162K9735J8351J1077K4708M4217O1989J8477n551K2177N7638P8844N9275
9165D279099P8701J03228R8888P8919O5346j2087k31819m26630m47897l15405
$$ plain form
9155 3270343 3160793 3177136 3245248 3325386 3390909 3451594 3532828 3596972 3662323 3721338 3761951
9144 3761951 3797798 3825605 3851425 3872807 3907077 3942931 3977548 3993318 4024399 4063066 4076317
9133 4076317 4095028 4129987 4161867 4169917 4198746 4219099 4243115 4277719 4300491 4320602 4370891 4406270
9121 4406270 4444070 4478255 4533492 4600670 4656405 4695699 4678965 4570284 4393654 4193794 4068376
9110 4068376 4051408 4080677 4109209 4144642 4190179 4224448 4259724 4319904 4355642 4365009 4408479 4451788
9098 4451788 4460626 4498239 4530905 4527641 4523656 4532921 4553928 4570462 4598091 4636901 4652414 4678158
9086 4678158 4695768 4726119 4753002 4766911 4776473 4829935 4852968 4869539 4900064 4910175 4931275 4959635
9074 4959635 4991977 5014969 5052296 5072370 5069804 5086739 5131193 5158856 5165113 5164986 5183737 5186503
$$ packed form
9155C270343j09550J6343O8112Q0138O5523O0685Q1234O4144O5351N9015M0613
9144C761951L5847K7807K5820K1382L4270L5854L4617J5770L1081L8667J3251
9133D076317J8711L4959L1880Q050K8829K0353K4016L4604K2772K0111N0289L5379
9121D406270L7800L4185N5237O7178N5735L9294j6734j08681j76630j99860j25418
9110D068376j6968K9269K8532L5433M5537L4269L5276O0180L5738R367M3470M3309
9098D451788Q838L7613L2666l264l985R265K1007J6534K7629L8810J5513K5744
9086D678158J7610L0351K6883J3909R562N3462K3033J6571L0525J0111K1100K8360
9074D959635L2342K2992L7327K0074k566J6935M4454K7663O257j27J8751K766
$$ plain form
9062 5186503 5219848 5247204 5275903 5299670 5307139 5288268 5293445 5303308 5283252 5297989 5337043 5393934
9050 5393934 5418670 5421413 5444572 5488470 5518774 5537369 5550613 5581681 5624507 5653088 5668672 5705691
9038 5705691 5757152 5800651 5811587 5802796 5799395 5826823 5856462 5874343 5910253 5948863 5975828 6014654
9026 6014654 6041020 6065433 6111999 6143575 6157213 6183873 6219704 6267889 6288203 6318490 6333567
9015 6333567 6376145 6418076 6448103 6419179 6379972 6353268 6349971 6367150 6430856 6489913 6529554 6571672
9003 6571672 6609157 6643720 6664895 6695976 6726780 6760901 6809888 6844230 6875718 6914577 6945781
8992 6945781 6978203 6991206 7029811 7078464 7128859 7160455 7181482 7214894 7257639 7300021 7344108
8981 7344108 7382985 7429683 7472102 7514319 7571216 7626017 7671749 7732429 7776462 7803663 7822891
$$ packed form
9062E186503L3345K7356K8699K3767P469j8871N177R863k0056J4737L9054N6891
9050E393934K4736K743K3159M3898L0304J8595J3244L1068M2826K8581J5584L7019
9038E705691N1461M3499J0936q791l401K7428K9639J7881L5910L8610K6965L8826
9026F014654K6366K4413M6566L1576J3638K6660L5831M8185K0314L0287J5077
9015F333567M2578M1931L0027k8924l9207k6704l297J7179O3706N9057L9641M2118
9003F571672L7485L4563K1175L1081L0804L4121M8987L4342L1488L8859L1204
8992F945781L2422J3003L8605M8653N0395L1596K1027L3412M2745M2382M4087
8981G344108L8877M6698M2419M2217N6897N4801M5732O0680M4033K7201J9228
$$ plain form
8970 7822891 7853694 7872918 7894191 7933965 7977806 8028590 8064253 8107076 8150009 8197775 8259753
8959 8259753 8331530 8377472 8421251 8486192 8551939 8633089 8686740 8761746 8835151 8898482 8947762
8948 8947762 8993362 9017557 9051492 9086696 9130163 9202472 9284325 9335677 9406859 9481116 9567415
8937 9567415 9651383 9725681 9789572 9851369 9921455 9995913 10054177 10113763 10216327 10354697 10523413
8926 10523413 10670060 10783700 10834273 10718560 10466855 10262568 10205974 10279205 10385478 10506902
8916 10506902 10641140 10769809 10911007 11032210 11136799 11239242 11371682 11539089 11716378
8907 11716378 11874503 11997877 12105933 12196333 12265666 12365081 12474041 12597791 12720964 12876300
8897 12876300 13049579 13235061 13418263 13588265 13777879 13929146 13946436 13828953 13656311 13505641
$$ packed form
8970G822891L0803J9224K1273L9774M3841N0784L5663M2823M2933M7766O1978
8959H259753P1777M5942M3779O4941O5747Q1150N3651P5006P3405O3331M9280
8948H947762M5600K4195L3935L5204M3467P2309Q1853N1352P1182P4257Q6299
8937I567415Q3968P4298O3891O1797P0086P4458N8264N9586J02564J38370J68716
8926A0523413J46647J13640N0573j15713k51705k04287n6594P3231J06273J21424
8916A0506902J34238J28669J41198J21203J04589J02443J32440J67407J77289
8907A1716378J58125J23374J08056R0400O9333R9415J08960J23750J23173J55336
8897A2876300J73279J85482J83202J70002J89614J51267J7290j17483j72642j50670
$$ plain form
8887 13505641 13460581 13530323 13722911 13989297 14348241 14747662 15129622 15444934 15591909 15369866
8877 15369866 14833839 14352607 14192273 14335618 14588731 14916933 15231130 15536043 15810699
8868 15810699 16040684 16245824 16454214 16671209 16917921 17208492 17511998 17768816 17996003
8859 17996003 18235114 18492305 18765529 19074664 19412087 19746601 20089587 20473501 20896707
8850 20896707 21328386 21788698 22258871 22648689 22849159 22720767 22432407 22255463 22326930 22624071
8840 22624071 23123635 23722707 24404089 25112760 25818427 26482910 27080261 27551878 27903942
8831 27903942 28290569 28843071 29593514 30507586 31512075 32550570 33648908 34785065 35962585
8822 35962585 37202603 38530516 39985953 41617272 43429010 45379558 47414623 49623694
$$ packed form
8887A3505641m5060O9742J92588K66386L58944L99421L81960L15312J46975k22043
8877A5369866n36027m81232j60334J43345K53113L28202L14197L04913K74656
8868A5810699K29985K05140K08390K16995K46712K90571L03506K56818K27187
8859A7996003K39111K57191K73224L09135L37423L34514L42986L83914M23206
8850B0896707M31679M60312M70173L89818K00470j28392k88360j76944P1467K97141
8840B2624071M99564N99072O81382P08671P05667O64483N97351M71617L52064
8831B7903942L86627N52502P50443R14072J004489J038495J098338J136157J177520
8822C5962585J240018J327913J455437J631319J811738J950548K035065K209071
$$ plain form
8814 49623694 52176176 55301381 59124994 63728773 69232321 75818728 83602807 92305958
8806 92305958 100310193 102958169 91921545 60403000 14695542 -26412613 -48979700
8799 -48979700 -53455280 -48466017 -40878254 -33401796 -26704527 -20818271 -15655794 -11083954
8791 -11083954 -7004961 -3344363 -87152 2783874 5348737 7786928 10214971 12737887
8783 12737887 15327502 17930969 20526489 23123793 25770286 28456624 31159578 33979468
8775 33979468 37044668 40403023 44026207 47895029 51927257 56351912 61579538 67906596
8767 67906596 75567946 84784001 95905729 109406567 125644014 143893677 159708298
8760 159708298 160694151 126030927 46349224 -51341534 -124859749 -155518278 -154331743
$$ packed form
8814D9623694K552482L125205L823613M603779N503548O586407P784079Q703151
8806I2305958Q004235K647976j1036624l1518545m5707458m1108155k2567087
8799d8979700m475580M989263P587763P476458O697269N886256N162477M571840
8791a1083954M078993L660598L257211K871026K564863K438191K428043K522916
8783A2737887K589615K603467K595520K597304K646493K686338K702954K819890
8775C3979468L065200L358355L623184L868822M032228M424655N227626O327058
8767F7906596P661350R216055J1121728J3500838J6237447J8249663J5814621
8760A59708298R85853l4663224p9681703r7690758p3518215l0658529J186535
$$ plain form
8753 -154331743 -140622888 -125043620 -110907468 -98752712 -88410884 -79553389 -71864277
8746 -71864277 -65128410 -59273907 -54276460 -50131536 -46659651 -43518479 -40420441 -37260870
8738 -37260870 -34154520 -31226555 -28472783 -25838142 -23347183 -20982033 -18708364 -16457118
8730 -16457118 -14153347 -11692087 -9097414 -6427576 -3661610 -748573 2498652 6244122
8722 6244122 10573201 15606777 21549540 28531892 36528186 44733724 50382535 47187234
8714 47187234 26780809 -12168505 -56133583 -87257117 -98937516 -96993546 -89880033
8707 -89880033 -82149826 -75227490 -69305498 -64271993 -59961000 -56235091 -53003362 -50226195
8699 -50226195 -47882555 -45979635 -44389215 -42910966 -41437056 -39970163 -38578888 -37303402
$$ packed form
8753a54331743J3708855J5579268J4136152J2154756J0341828Q857495P689112
8746g1864277O735867N854503M997447M144924L471885L141172L098038L159571
8738c7260870L106350K927965K753772K634641K490959K365150K273669K251246
8730a6457118K303771K461260K594673K669838K765966K913037L247225L745470
8722F244122M329079N033576N942763O982352P996294Q205538N648811l195301
8714D7187234k0406425l8949314m3965078l1123534j1680399J943970P113513
8707h9880033P730207O922336N921992N033505M310993L725909L231729K777167
8699e0226195K343640J902920J590420J478249J473910J466893J391275J275486
$$ plain form
8691 -37303402 -36138875 -35094772 -34137370 -33264373 -32447758 -31699331 -30971259 -30263991 -29548268
8682 -29548268 -28836661 -28174750 -27577727 -27044782 -26553093 -26096322 -25672753 -25239829 -24800010
8673 -24800010 -24361778 -23987031 -23657585 -23319147 -22996392 -22684625 -22372091 -22093027 -21796879
8664 -21796879 -21455551 -21128211 -20806587 -20486212 -20172589 -19864341 -19606861 -19389616 -19220954
8655 -19220954 -19063758 -18891913 -18728122 -18604776 -18463960 -18260000 -18056924 -17838717 -17630758
8646 -17630758 -17432705 -17252186 -17046313 -16857728 -16660629 -16470379 -16272732 -16088697 -15893950
8637 -15893950 -15714796 -15553655 -15396864 -15282339 -15213319 -15223737 -15241166 -15179609 -15042787 -14838449
8627 -14838449 -14636776 -14483507 -14343392 -14220493 -14102414 -14042710 -14023259 -14004314 -13926846 -13799405
$$ packed form
8691c7303402J164527J044103R57402Q72997Q16615P48427P28072P07268P15723
8682b9548268P11607O61911N97023N32945M91689M56771M23569M32924M39819
8673b4800010M38232L74747L29446L38438L22755L11767L12534K79064K96148
8664b1796879L41328L27340L21624L20375L13623L08248K57480K17245J68662
8655a9220954J57196J71845J63791J23346J40816K03960K03076K18207K07959
8646a7630758J98053J80519K05873J88585J97099J90250J97647J84035J94747
8637a5893950J79154J61141J56791J14525O9020j0418j7429O1557J36822K04338
8627a4838449K01673J53269J40115J22899J18079N9704J9451J8945P7468J27441
$$ plain form
8617 -13799405 -13664682 -13535296 -13405716 -13244948 -13097137 -12969642 -12886735 -12788699 -12707992 -12639958
8607 -12639958 -12597236 -12577598 -12541588 -12450802 -12329561 -12207280 -12109134 -12021469 -11947159 -11870312 -11786021
8596 -11786021 -11702196 -11612011 -11510743 -11426167 -11355046 -11252536 -11153882 -11085508 -11067667 -11160236 -11252743
8585 -11252743 -11244795 -11148601 -11027066 -10902811 -10766939 -10664521 -10611764 -10624411 -10654321 -10676618 -10683876
8574 -10683876 -10664408 -10630314 -10581032 -10521720 -10478123 -10401291 -10281797 -10165817 -10065891 -9991866 -9921689
8563 -9921689 -9852730 -9828159 -9821867 -9792902 -9736896 -9660491 -9582445 -9513390 -9465062 -9418411 -9369269 -9333890
8551 -9333890 -9276147 -9239099 -9216171 -9174684 -9141295 -9101721 -9037086 -8970021 -8934711 -8915124 -8924346 -8915740
8539 -8915740 -8874833 -8814739 -8747902 -8696835 -8658591 -8635809 -8628160 -8635577 -8599376 -8542254 -8497260 -8507053
$$ packed form
8617a3799405J34723J29386J29580J60768J47811J27495Q2907R8036Q0707O8034
8607a2639958M2722J9638L6010R0786J21241J22281R8146Q7665P4310P6847Q4291
8596a1786021Q3825R0185J01268Q4576P1121J02510R8654O8374J7841r2569r2507
8585a1252743P948R6194J21535J24255J35872J02418N2757j2647k9910k2297p258
8574a0683876J9468L4094M9282N9312M3597P6832J19494J15980R9926P4025P0177
8563i921689O8959K4571O292K8965N6006P6405P8046O9055M8328M6651M9142L5379
8551i333890N7743L7048K2928M1487L3389L9574O4635O7065L5310J9587r222Q606
8539h915740M0907O0094O6837N1067L8244K2782P649p417L6201N7122M4994r793
$$ plain form
8527 -8507053 -8532093 -8533530 -8507153 -8460412 -8400746 -8327252 -8271321 -8238142 -8202248 -8160512 -8127822 -8089798
8515 -8089798 -8055607 -7992823 -7939720 -7907643 -7866597 -7838069 -7818745 -7787606 -7770161 -7729361 -7713302
8504 -7713302 -7693851 -7639878 -7609585 -7591545 -7569164 -7529087 -7488878 -7460211 -7414812 -7379371 -7346017
8493 -7346017 -7312002 -7290738 -7270072 -7237237 -7204291 -7192741 -7165218 -7133714 -7119417 -7103148 -7087073
8482 -7087073 -7074755 -7052866 -7017062 -6985951 -6953689 -6918310 -6903461 -6888191 -6834514 -6805306 -6799475 -6784690
8470 -6784690 -6769582 -6747472 -6725090 -6709309 -6670537 -6634595 -6611566 -6590072 -6578340 -6554013 -6536367
8459 -6536367 -6522845 -6512237 -6474894 -6442832 -6412038 -6376898 -6346553 -6309078 -6284046 -6252345 -6209894
8448 -6209894 -6190774 -6178562 -6159873 -6135296 -6109248 -6104229 -6080928 -6049554 -6036475 -6034311 -6029617 -6007714
$$ packed form
8527h507053k5040j437K6377M6741N9666P3494N5931L3179L5894M1736L2690L8024
8515h089798L4191O2784N3103L2077M1046K8528J9324L1139J7445M0800J6059
8504g713302J9451N3973L0293J8040K2381M0077M0209K8667M5399L5441L3354
8493g346017L4015K1264K0666L2835L2946J1550K7523L1504J4297J6269J6075
8482g087073J2318K1889L5804L1111L2262L5379J4849J5270N3677K9208N831J4785
8470f784690J5108K2110K2382J5781L8772L5942K3029K1494J1732K4327J7646
8459f536367J3522J0608L7343L2062L0794L5140L0345L7475K5032L1701M2451
8448f209894J9120J2212J8689K4577K6048N019K3301L1374J3079K164M694K1903
$$ plain form
8436 -6007714 -5983059 -5946883 -5933034 -5934482 -5929810 -5909271 -5894787 -5868224 -5851142 -5829853 -5816093 -5789476
8424 -5789476 -5761691 -5751352 -5719260 -5684613 -5663243 -5640239 -5604007 -5585854 -5590598 -5556145 -5529712 -5509245
8412 -5509245 -5469090 -5434729 -5411724 -5392009 -5368179 -5324410 -5275276 -5221703 -5177254 -5128402 -5081804
8401 -5081804 -5015893 -4967391 -4945883 -5004620 -5150012 -5380384 -5567770 -5645750 -5659767 -5633644 -5585765
8390 -5585765 -5536582 -5494146 -5443354 -5391707 -5343378 -5326636 -5313044 -5293848 -5278956 -5249323 -5221195
8379 -5221195 -5203965 -5176244 -5122159 -5072000 -5045336 -5025446 -4994484 -4966600 -4945211 -4902076 -4875375
8368 -4875375 -4857122 -4818576 -4781195 -4752931 -4705083 -4653619 -4605911 -4576115 -4520315 -4440546 -4373042
8357 -4373042 -4307633 -4195539 -4105142 -4116430 -4320748 -4743709 -5206420 -5528099 -5653527 -5626283
$$ packed form
8436f007714K4655L6176J3849j448M672K0539J4484K6563J7082K1289J3760K6617
8424e789476K7785J0339L2092L4647K1370K3004L6232J8153m744L4453K6433K0467
8412e509245M0155L4361K3005J9715K3830M3769M9134N3573M4449M8852M6598
8401e081804O5911M8502K1508n8737j45392k30372j87386p7980j4017K6123M7879
8390e585765M9183M2436N0792N1647M8329J6742J3592J9196J4892K9633K8128
8379e221195J7230K7721N4085N0159K6664J9890L0962K7884K1389M3135K6701
8368d875375J8253L8546L7381K8264M7848N1464M7708K9796N5800P9769O7504
8357d373042O5409J12094R0397j1288k04318m22961m62711l21679j25428K7244
$$ plain form
8347 -5626283 -5544025 -5467002 -5409335 -5329768 -5278213 -5226155 -5178994 -5116288 -5067911 -5036641 -5014841
8336 -5014841 -4967583 -4932867 -4910593 -4892624 -4864761 -4836896 -4790525 -4759242 -4748800 -4724262 -4701218
8325 -4701218 -4687702 -4670641 -4649752 -4637217 -4609895 -4573430 -4540236 -4511793 -4486743 -4459114 -4427688
8314 -4427688 -4381572 -4332011 -4280465 -4238327 -4207682 -4239405 -4356617 -4544282 -4744621 -4871361 -4907255
8303 -4907255 -4882265 -4857654 -4816194 -4765475 -4727229 -4697070 -4666756 -4648005 -4623349 -4608256 -4597574
8292 -4597574 -4582880 -4545110 -4529640 -4513718 -4497657 -4500363 -4490400 -4474696 -4455399 -4436360 -4419927 -4419608
8280 -4419608 -4407923 -4393228 -4392840 -4362566 -4316683 -4307975 -4313357 -4300414 -4289293 -4291990 -4292975 -4276226 -4243204
8267 -4243204 -4216355 -4228118 -4228823 -4205739 -4196044 -4179165 -4182418 -4174545 -4159985 -4145288 -4140316 -4131930 -4114839
$$ packed form
8347e626283Q2258P7023N7667P9567N1555N2058M7161O2706M8377L1270K1800
8336e014841M7258L4716K2274J7969K7863K7865M6371L1283J0442K4538K3044
8325d701218J3516J7061K0889J2535K7322L6465L3194K8443K5050K7629L1426
8314d427688M6116M9561N1546M2138L0645l1723j17212j87665k00339j26740l5894
8303d907255K4990K4611M1460N0719L8246L0159L0314J8751K4656J5093J0682
8292d597574J4694L7770J5470J5922J6061k706R963J5704J9297J9039J6433L19
8280d419608J1685J4695L88L0274M5883Q708n382J2943J1121k697r85J6749L3022
8267d243204K6849j1763p05K3084R695J6879l253P873J4560J4697M972Q386J7091
$$ plain form
8254 -4114839 -4099718 -4076093 -4080602 -4063119 -4051157 -4069551 -4053513 -4041809 -4047592 -4042071 -4048179 -4058929
8242 -4058929 -4047559 -4026948 -4035534 -4030519 -4010614 -3998976 -3993398 -3970489 -3966845 -3950066 -3950941 -3945944 -3933175
8229 -3933175 -3905562 -3879321 -3867535 -3861920 -3855362 -3875467 -3882832 -3867296 -3856879 -3868938 -3873538 -3847586
8217 -3847586 -3828580 -3817733 -3825565 -3820337 -3806893 -3779912 -3771030 -3776003 -3772594 -3754867 -3747497 -3735431 -3734580
8204 -3734580 -3739199 -3743898 -3737666 -3728902 -3713348 -3696051 -3688276 -3697255 -3712161 -3710995 -3704518 -3698489 -3695497
8191 -3695497 -3683958 -3681462 -3666826 -3648037 -3637839 -3634554 -3625783 -3608877 -3603968 -3619685 -3610064 -3573409
8179 -3573409 -3566220 -3569914 -3572789 -3592246 -3591003 -3588603 -3579182 -3586679 -3570076 -3547632 -3520451 -3517007 -3509095
8166 -3509095 -3503749 -3499405 -3509511 -3507901 -3497696 -3493696 -3490460 -3497057 -3487023 -3486540 -3478111 -3456483 -3446352
$$ packed form
8254d114839J5121K3625m509J7483J1962j8394J6038J1704n783N521o108j0750
8242d058929J1370K0611q586N015J9905J1638N578K2909L644J6779q75M997J2769
8229c933175K7613K6241J1786N615O558k0105p365J5536J0417j2059m600K5952
8217c847586J9006J0847p832N228J3444K6981Q882m973L409J7727P370J2066Q51
8204c734580m619m699O232Q764J5554J7297P775q979j4906J166O477O029K992
8191c695497J1539K496J4636J8789J0198L285Q771J6906M909j5717R621L6655
8179c573409P189l694k875j9457J243K400R421p497J6603K2444K7181L444P912
8166c509095N346M344j0106J610J0205M000L236o597J0034M83Q429K1628J0131
$$ plain form
8153 -3446352 -3438352 -3424669 -3433648 -3445181 -3431434 -3424786 -3427665 -3429116 -3427061 -3408798 -3391141 -3363286 -3372664
8140 -3372664 -3401325 -3387433 -3376805 -3384946 -3363315 -3341071 -3328223 -3312965 -3311032 -3306880 -3291209 -3271052
8128 -3271052 -3272719 -3295953 -3308800 -3308075 -3297511 -3280841 -3280743 -3288945 -3282200 -3280091 -3278726 -3289897 -3292181 -3274967
8114 -3274967 -3264063 -3262532 -3256798 -3265625 -3282779 -3285881 -3260231 -3213898 -3212479 -3229379 -3238416 -3244308 -3249115
8101 -3249115 -3241987 -3226568 -3224703 -3230653 -3219790 -3207504 -3194717 -3193236 -3205197 -3188460 -3161227 -3151437
8089 -3151437 -3144277 -3144153 -3146316 -3159262 -3166874 -3157744 -3164632 -3147704 -3115363 -3089873 -3092752 -3093741 -3092363 -3090299
8075 -3090299 -3088666 -3077643 -3072869 -3079078 -3091072 -3083562 -3067664 -3053397 -3036308 -3039271 -3027396 -3011626
8063 -3011626 -3010195 -3015652 -3050625 -3069712 -3065917 -3080110 -3082675 -3061305 -3049928 -3065037 -3068639 -3074248 -3047208
$$ packed form
8153c446352Q000J3683q979j1533J3747O648k879j451K055J8263J7657K7855r378
8140c372664k8661J3892J0628q141K1631K2244J2848J5258J933M152J5671K0157
8128c271052j667k3234j2847P25J0564J6670R8q202O745K109J365j1171k284J7214
8114c274967J0904J531N734q827j7154l102K5650M6333J419j6900r037n892m807
8101c249115P128J5419J865n950J0863J2286J2787J481j1961J6737K7233R790
8089c151437P160J24k163j2946p612R130o888J6928L2341K5490k879r89J378K064
8075c090299J633J1023M774o209j1994P510J5898J4267J7089k963J1875J5770
8063c011626J431n457l4973j9087L795j4193k565K1370J1377j5109l602n609K7040
$$ plain form
8050 -3047208 -3048573 -3056728 -3053040 -3032438 -3019375 -3011704 -2979461 -2970769 -2967502 -2976006 -2996854 -3002496 -2972873
8037 -2972873 -2971677 -2972270 -2978130 -2965042 -2963797 -2959171 -2946765 -2931690 -2922776 -2913928 -2907480 -2895378 -2886507
8024 -2886507 -2893749 -2904761 -2907150 -2902817 -2898798 -2913098 -2902535 -2881932 -2888113 -2911801 -2934819 -2933879 -2912643
8011 -2912643 -2904842 -2911109 -2918136 -2896811 -2882342 -2868438 -2871911 -2883524 -2872940 -2859157 -2851104 -2843067 -2836906
7998 -2836906 -2854259 -2866380 -2875196 -2868360 -2847517 -2829824 -2836801 -2843656 -2833962 -2825292 -2809993 -2798269 -2798264
7985 -2798264 -2785229 -2779259 -2794795 -2810136 -2800037 -2792938 -2798064 -2805627 -2805566 -2801780 -2792237 -2806689 -2789141
7972 -2789141 -2768322 -2762353 -2765628 -2753246 -2756936 -2752393 -2750021 -2751212 -2742424 -2730781 -2732350 -2742508 -2762473
7959 -2762473 -2748888 -2716772 -2690494 -2694180 -2699919 -2689434 -2678985 -2675230 -2672571 -2676989 -2691382 -2712629
$$ packed form
8050c047208j365q155L688K0602J3063P671L2243Q692L267q504k0848n642K9623
8037b972873J196n93n860J3088J245M626J2406J5075Q914Q848O448J2102Q871
8024b886507p242j1012k389M333M019j4300J0563K0603o181k3688k3018R40K1236
8011b912643P801o267p027K1325J4469J3904l473j1613J0584J3783Q053Q037O161
7998b836906j7353j2121q816O836K0843J7693o977o855R694Q670J5299J1724N
7985b798264J3035N970j5536j5341J0099P099n126p563O1L786R543j4452J7548
7972b789141K0819N969l275J2382l690M543K372j191Q788J1643j569j0158j9965
7959b762473J3585L2116K6278l686n739J0485J0449L755K659m418j4393k1247
$$ plain form
7947 -2712629 -2705858 -2695671 -2703950 -2694021 -2665438 -2654865 -2664595 -2669506 -2681183 -2679620 -2678927 -2656189 -2649610
7934 -2649610 -2645013 -2639982 -2632148 -2624897 -2622047 -2624803 -2618688 -2633172 -2622213 -2619340 -2623052 -2627961 -2625849 -2629823
7920 -2629823 -2618970 -2630415 -2650157 -2641958 -2632710 -2610889 -2606888 -2589067 -2580807 -2592581 -2576743 -2561385
7908 -2561385 -2581015 -2600219 -2621173 -2629300 -2616884 -2615011 -2600593 -2596443 -2585987 -2564017 -2553080 -2558128
7896 -2558128 -2568373 -2566410 -2553146 -2539893 -2535928 -2522497 -2521108 -2516040 -2522350 -2513478 -2526387 -2520562 -2527918
7883 -2527918 -2531334 -2513357 -2503644 -2493853 -2491260 -2482096 -2483476 -2489751 -2486449 -2493056 -2505849 -2511544 -2507829 -2495058
7869 -2495058 -2493006 -2483278 -2480384 -2480121 -2471563 -2469395 -2468171 -2460816 -2462821 -2468751 -2470672 -2483973 -2470520 -2459025
7855 -2459025 -2436406 -2410598 -2407063 -2406612 -2422230 -2437392 -2452298 -2454700 -2449066 -2438588 -2411310 -2384011
$$ packed form
7947b712629O771J0187q279R929K8583J0573r730m911j1677J563O93K2738O579
7934b649610M597N031P834P251K850k756O115j4484J0959K873l712m909K112l974
7920b629823J0853j1445j9742Q199R248K1821M001J7821Q260j1774J5838J5358
7908b561385j9630j9204k0954q127J2416J873J4418M150J0456K1970J0937n048
7896b558128j0245J963J3264J3253L965J3431J389N068o310Q872j2909N825p356
7883b527918l416J7977R713R791K593R164j380o275L302o607j2793n695L715J2771
7869b495058K052R728K894K63Q558K168J224P355k005n930j921j3301J3453J1495
7855b459025K2619K5808L535M51j5618j5162j4906k402N634J0478K7278K7299
$$ plain form
7843 -2384011 -2396541 -2402127 -2395204 -2406089 -2402131 -2410516 -2409659 -2411529 -2407120 -2412949 -2404321 -2385292 -2380025 -2377073
7829 -2377073 -2376162 -2363668 -2356913 -2369567 -2372932 -2386281 -2383511 -2369438 -2374226 -2372640 -2388705 -2378049 -2352569
7816 -2352569 -2341061 -2354403 -2347456 -2330708 -2325934 -2333705 -2360191 -2364075 -2370195 -2372485 -2381923 -2391256 -2384973
7803 -2384973 -2358080 -2358192 -2360268 -2355944 -2328512 -2307026 -2320589 -2339766 -2333278 -2310093 -2302790 -2318565 -2322785
7790 -2322785 -2315856 -2305120 -2316005 -2318952 -2303137 -2265373 -2259591 -2277871 -2269994 -2263834 -2266808 -2282311 -2283696
7777 -2283696 -2287016 -2287942 -2269247 -2273132 -2285228 -2271191 -2250592 -2240260 -2240086 -2231426 -2239697 -2250817 -2247010
7764 -2247010 -2220593 -2230668 -2214961 -2190283 -2186894 -2211877 -2226361 -2224556 -2235139 -2234411 -2225862 -2213601
7752 -2213601 -2196582 -2167749 -2170308 -2184136 -2197325 -2204950 -2203883 -2205878 -2204344 -2184291 -2178216 -2192443 -2201599
$$ packed form
7843b384011j2530n586O923j0885L958q385Q57j870M409n829Q628J9029N267K952
7829b377073R11J2494O755j2654l365j3349K770J4073m788J586j6065J0656K5480
7816b352569J1508j3342O947J6748M774p771k6486l884o120k290r438r333O283
7803b384973K6893j12k076M324K7432K1486j3563j9177O488K3185P303j5775m220
7790b322785O929J0736j0885k947J5815L7764N782j8280P877O160k974j5503j385
7777b283696l320r26J8695l885j2096J4037K0599J0332J74Q660q271j1120L807
7764b247010K6417j0075J5707K4678L389k4983j4484J805j0583P28Q549J2261
7752b213601J7019K8833k559j3828j3189p625J067j995J534K0053O075j4227r156
$$ plain form
7739 -2201599 -2189145 -2189130 -2183649 -2176245 -2172806 -2182449 -2198580 -2194309 -2173531 -2167172 -2167751 -2181964 -2205988 -2218765
7725 -2218765 -2209324 -2177306 -2155696 -2154209 -2145339 -2134279 -2129265 -2119564 -2128023 -2142118 -2141129 -2133611 -2142378
7712 -2142378 -2157187 -2157255 -2166764 -2152730 -2151041 -2138597 -2110541 -2106271 -2104108 -2118079 -2132525 -2120320 -2115681
7699 -2115681 -2130304 -2150060 -2140979 -2140374 -2138520 -2133372 -2138062 -2147974 -2163073 -2151831 -2122537 -2103569 -2104734
7686 -2104734 -2105477 -2101840 -2106054 -2116878 -2107296 -2102835 -2121003 -2133960 -2125279 -2127191 -2128387 -2106409 -2086432
7673 -2086432 -2081270 -2083880 -2071799 -2074870 -2078728 -2086697 -2067251 -2051651 -2035106 -2033791 -2065515 -2084415 -2075357
7660 -2075357 -2043439 -2039347 -2062145 -2068933 -2059865 -2057915 -2062747 -2054609 -2047797 -2038683 -2029391 -2015853 -2015766 -2035123
7646 -2035123 -2051994 -2053756 -2048426 -2040061 -2047847 -2037095 -2043390 -2054291 -2062142 -2058672 -2066228 -2062047 -2056717
$$ packed form
7739b201599J2454J5N481P404L439r643j6131M271K0778O359n79j4213k4024j2777
7725b218765R441L2018K1610J487Q870J1060N014R701q459j4095R89P518q767
7712b142378j4809o8r509J4034J689J2444K8056M270K163j3971j4446J2205M639
7699b115681j4623j9756R081O05J854N148m690r912j5099J1242K9294J8968j165
7686b104734p43L637m214j0824R582M461j8168j2957Q681j912j196K1978J9977
7673b086432N162k610J2081l071l858p969J9446J5600J6545J315l1724j8900R058
7660b075357L1918M092k2798o788R068J950m832Q138O812R114R292J3538Q7j9357
7646b035123j6871j762N330Q365p786J0752o295j0901p851L470p556M181N330
$$ plain form
7633 -2056717 -2040537 -2016499 -2021145 -2038850 -2038506 -2013007 -2015686 -2023369 -2016044 -2019005 -2011823 -2012351 -2018750 -2018954
7619 -2018954 -2028226 -2038836 -2022839 -2023540 -2013523 -2008232 -1988298 -1983702 -1989487 -1999391 -1995974 -1989388 -1995476
7606 -1995476 -1994054 -1999017 -1971664 -1962763 -1960458 -1960549 -1973394 -1968492 -1956715 -1940401 -1934162 -1925256 -1941816
7593 -1941816 -1953953 -1943983 -1952859 -1951330 -1938084 -1941109 -1947310 -1954114 -1941245 -1945755 -1952426 -1927782 -1932461
7580 -1932461 -1953770 -1948363 -1938439 -1946035 -1953659 -1943089 -1928869 -1916446 -1910984 -1908326 -1905150 -1921323 -1939937
7567 -1939937 -1932053 -1915253 -1907371 -1907366 -1917827 -1921896 -1913170 -1915725 -1903150 -1891865 -1907006 -1916010 -1910554 -1916845
7553 -1916845 -1927401 -1912321 -1910944 -1904927 -1897778 -1890863 -1873032 -1878369 -1879184 -1884391 -1872040 -1878582 -1885254
7540 -1885254 -1886159 -1885872 -1889347 -1885691 -1888885 -1888191 -1886343 -1886734 -1870180 -1863264 -1869429 -1878785 -1891530 -1891834 -1891774
$$ packed form
7633b056717J6180K4038m646j7705L44K5499k679p683P325k961P182n28o399k04
7619b018954r272j0610J5997p01J0017N291J9934M596n785r904L417O586o088
7606a995476J422m963K7353Q901K305r1j2845M902J1777J6314O239Q906j6560
7593a941816j2137R970q876J529J3246l025o201o804J2869m510o671K4644m679
7580a932461k1309N407R924p596p624J0570J4220J2423N462K658L176j6173j8614
7567a939937P884J6800P882Nj0461m069Q726k555J2575J1285j5141r004N456o291
7553a916845j0556J5080J377O017P149O915J7831n337q15n207J2351o542o672
7540a885254r05K87l475L656l194O94J848l91J6554O916o165r356j2745l04O0
$$ plain form
7525 -1891774 -1881509 -1864332 -1844377 -1838365 -1839703 -1840013 -1844515 -1846052 -1829557 -1823851 -1841515 -1843364 -1839314
7512 -1839314 -1839701 -1841957 -1844996 -1850871 -1844268 -1850463 -1855839 -1857924 -1857349 -1832885 -1813015 -1837558 -1863295 -1847929
7498 -1847929 -1826595 -1832127 -1837334 -1823242 -1824132 -1827941 -1831668 -1840854 -1835364 -1840701 -1846582 -1845056 -1829794 -1820586
7484 -1820586 -1822222 -1813676 -1816051 -1833701 -1845234 -1847782 -1834868 -1836560 -1833363 -1818890 -1802186 -1799032 -1803863
7471 -1803863 -1796176 -1804738 -1811769 -1798155 -1805149 -1826226 -1825890 -1798153 -1786229 -1790333 -1793078 -1807648 -1803482
7458 -1803482 -1798622 -1792791 -1785360 -1773985 -1771203 -1785740 -1791258 -1779817 -1798603 -1797457 -1781041 -1751834 -1745522
7445 -1745522 -1753054 -1785117 -1793745 -1782102 -1764329 -1764785 -1763141 -1774709 -1770811 -1779403 -1774001 -1774671 -1766157 -1742842
7431 -1742842 -1748452 -1774194 -1792599 -1798780 -1780758 -1762974 -1770278 -1776594 -1765475 -1761233 -1767491 -1758829 -1740958
$$ packed form
7525a891774J0265J7177J9955O012j338l10m502j537J6495N706j7664j849M050
7512a839314l87k256l039n875O603o195n376k085N75K4464J9870k4543k5737J5366
7498a847929K1334n532n207J4092q90l809l727r186N490n337n881J526J5262R208
7484a820586j636Q546k375j7650j1533k548J2914j692L197J4473J6704L154m831
7471a803863P687q562p031J3614o994k1077L36K7737J1924m104k745j4570M166
7458a803482M860N831P431J1375K782j4537n518J1441j8786J146J6416K9207O312
7445a745522p532l2063q628J1643J7773m56J644j1568L898q592N402o70Q514K3315
7431a742842n610k5742j8405o181J8022J7784p304o316J1119M242o258Q662J7871
$$ plain form
7418 -1740958 -1746604 -1742004 -1743900 -1744899 -1733127 -1743172 -1760108 -1749377 -1726830 -1728795 -1724530 -1733350 -1755759
7405 -1755759 -1754075 -1756734 -1718164 -1711525 -1712580 -1707908 -1716438 -1724966 -1720490 -1716100 -1726045 -1720388 -1700705 -1686229
7391 -1686229 -1687626 -1684538 -1707698 -1719952 -1716065 -1718343 -1713132 -1701332 -1722909 -1726790 -1727993 -1724239 -1743811
7378 -1743811 -1752799 -1726943 -1700243 -1690540 -1678538 -1686381 -1700856 -1721120 -1721257 -1710847 -1703164 -1703114 -1706141
7365 -1706141 -1709488 -1693883 -1659983 -1676756 -1694853 -1718304 -1716211 -1712389 -1708343 -1684181 -1675720 -1657502
7353 -1657502 -1642209 -1655119 -1674379 -1678083 -1656193 -1624160 -1625225 -1640378 -1659778 -1683030 -1693796 -1697478
7341 -1697478 -1697696 -1692665 -1689292 -1686847 -1680944 -1668998 -1652962 -1666332 -1679534 -1684983 -1690332 -1672925 -1639333
7328 -1639333 -1637749 -1655826 -1654955 -1657736 -1655832 -1660343 -1671566 -1668397 -1680632 -1692762 -1682480 -1666625 -1654413
$$ packed form
7418a740958n646M600j896r99J1772j0045j6936J0731K2547j965M265q820k2409
7405a755759J684k659L8570O639j055M672q530q528M476M390r945N657J9683J4476
7391a686229j397L088k3160j2254L887k278N211J1800k1577l881j203L754j9572
7378a743811q988K5856K6700R703J2002p843j4475k0264j37J0410P683N0l027
7365a706141l347J5605L3900j6773j8097k3451K093L822M046K4162Q461J8218
7353a657502J5293j2910j9260l704K1890L2033j065j5153j9400k3252j0766l682
7341a697478k18N031L373K445N903J1946J6036j3370j3202n449n349J7407L3592
7328a639333J584j8077Q71k781J904m511j1223L169j2235j2130J0282J5855J2212
$$ plain form
7315 -1654413 -1645196 -1631747 -1615984 -1609464 -1631565 -1661935 -1660430 -1651192 -1628989 -1616659 -1613996 -1619600 -1621965
7302 -1621965 -1621808 -1621101 -1615315 -1624720 -1618637 -1624224 -1622337 -1621840 -1649506 -1638325 -1628687 -1613294 -1614761 -1621012
7288 -1621012 -1619547 -1619496 -1618552 -1623783 -1610752 -1615004 -1613918 -1605037 -1612224 -1621933 -1614207 -1607546 -1616387 -1603260
7274 -1603260 -1587515 -1602546 -1615292 -1606630 -1604505 -1589463 -1588496 -1607376 -1625094 -1638866 -1606390 -1586686
7262 -1586686 -1580202 -1601114 -1605782 -1599484 -1601021 -1597275 -1590235 -1590065 -1575712 -1571714 -1581370 -1591268 -1593930 -1583863
7248 -1583863 -1588137 -1570037 -1566754 -1569512 -1572747 -1587102 -1580587 -1576318 -1581331 -1582749 -1570084 -1564429 -1564648 -1567307
7234 -1567307 -1565950 -1573609 -1578583 -1575459 -1584080 -1579121 -1575182 -1570611 -1556341 -1545562 -1550943 -1575522 -1574317
7221 -1574317 -1575767 -1576119 -1572226 -1567857 -1578208 -1576361 -1555372 -1547434 -1562935 -1571165 -1568344 -1554455 -1545176
$$ packed form
7315a654413R217J3449J5763O520k2101l0370J505R238K2203J2330K663n604k365
7302a621965J57P07N786r405O083n587J887M97k7666J1181R638J5393j467o251
7288a621012J465N1R44n231J3031m252J086Q881p187r709P726O661q841J3127
7274a603260J5745j5031j2746Q662K125J5042R67j8880j7718j3772L2476J9704
7262a586686O484k0912m668O298j537L746P040J70J4353L998r656r898k662J0067
7248a583863m274J8100L283k758l235j4355O515M269n013j418J2665N655k19k659
7234a567307J357p659m974L124q621M959L939M571J4270J0779n381k4579J205
7221a574317j450l52L893M369j0351J847K0989P938j5501q230K821J3889R279
$$ plain form
7208 -1545176 -1548291 -1548777 -1541834 -1536033 -1538515 -1558870 -1562028 -1553946 -1555735 -1546745 -1531398 -1531821 -1525632 -1525980
7194 -1525980 -1529178 -1532564 -1532861 -1526575 -1518109 -1521482 -1521610 -1518308 -1504824 -1522893 -1539524 -1536561 -1512214 -1497063
7180 -1497063 -1507333 -1527939 -1539311 -1549433 -1524172 -1504863 -1505208 -1504337 -1498630 -1485669 -1486079 -1504555 -1517401
7167 -1517401 -1508031 -1511905 -1500430 -1483075 -1494860 -1499044 -1495150 -1475864 -1481781 -1499381 -1505043 -1492182 -1490033
7154 -1490033 -1480887 -1489360 -1491354 -1496149 -1487034 -1481450 -1494802 -1501701 -1510313 -1506646 -1491431 -1468893 -1478003
7141 -1478003 -1497937 -1507570 -1503397 -1503705 -1495851 -1501269 -1498946 -1508940 -1522463 -1500763 -1456891 -1441541 -1450117
7128 -1450117 -1467490 -1483536 -1496068 -1481259 -1496522 -1514689 -1519197 -1504642 -1505199 -1481505 -1465307 -1479287
7116 -1479287 -1478017 -1483485 -1477530 -1462346 -1444858 -1447330 -1469684 -1488467 -1489792 -1472130 -1452076 -1455629 -1480863
$$ packed form
7208a545176l115m86O943N801k482k0355l158Q082j789Q990J5347m23O189l48
7194a525980l198l386k97O286Q466l373j28L302J3484j8069j6631K963K4347J5151
7180a497063j0270k0606j1372j0122K5261J9309l45Q71N707J2961m10j8476j2846
7167a517401R370l874J1475J7355j1785m184L894J9286n917j7600n662J2861K149
7154a490033R146q473j994m795R115N584j3352o899q612L667J5215K2538r110
7141a478003j9934r633M173l08P854n418K323r994j3523K1700M3872J5350q576
7128a450117j7373j6046j2532J4809j5263j8167m508J4555n57K3694J6198j3980
7116a479287J270n468N955J5184J7488k472k2354j8783j325J7662K0054l553k5234
$$ plain form
7103 -1480863 -1482646 -1482319 -1494668 -1470335 -1475295 -1481574 -1486319 -1472495 -1475419 -1463341 -1458843 -1464985 -1470938
7090 -1470938 -1472666 -1456100 -1445433 -1460957 -1469077 -1455016 -1455173 -1467212 -1472339 -1463505 -1454491 -1463269 -1453925
7077 -1453925 -1445462 -1441081 -1444256 -1449079 -1444952 -1440301 -1443029 -1442547 -1441672 -1443205 -1443138 -1431378 -1427883 -1432675 -1434139
7062 -1434139 -1437985 -1436410 -1437844 -1434551 -1426760 -1417958 -1450870 -1448739 -1444553 -1443799 -1441428 -1433478 -1418832 -1419600
7048 -1419600 -1415514 -1394253 -1391218 -1405267 -1427001 -1426681 -1415797 -1415481 -1411305 -1415758 -1428882 -1435016 -1435077 -1441830
7034 -1441830 -1429295 -1428556 -1423000 -1402937 -1416646 -1420909 -1428162 -1426646 -1407771 -1426124 -1432582 -1425832 -1427099
7021 -1427099 -1411293 -1394631 -1408039 -1412340 -1417697 -1416772 -1419446 -1414933 -1418698 -1422775 -1402154 -1406598 -1406902 -1406947
7007 -1406947 -1396506 -1408954 -1406055 -1396901 -1383021 -1382259 -1385086 -1376319 -1393272 -1420907 -1420383 -1409457 -1416970
$$ packed form
7103a480863j783L27j2349K4333m960o279m745J3824k924J2078M498o142n953
7090a470938j728J6566J0667j5524q120J4061j57j2039n127Q834R014q778R344
7077a453925Q463M381l175m823M127M651k728M82Q75j533O7J1760L495m792j464
7062a434139l846J575j434L293P791Q802l2912K131M186P54K371P950J4646p68
7048a419600M086K1261L035j4049k1734L20J0884L16M176m453j3124o134o1o753
7034a441830J2535P39N556K0063j3709m263p253J516J8875j8353o458O750j267
7021a427099J5806J6662j3408m301n357R25k674M513l765m077K0621m444l04m5
7007a406947J0441j2448K899R154J3880P62k827Q767j6953k7635N24J0926p513
$$ plain form
6994 -1416970 -1423282 -1420437 -1419877 -1432480 -1422327 -1408694 -1417255 -1426634 -1416177 -1409830 -1408966 -1399993 -1402698 -1409791
6980 -1409791 -1395917 -1376225 -1382177 -1404528 -1406372 -1405134 -1406199 -1403312 -1421434 -1411672 -1410912 -1391273 -1381840
6967 -1381840 -1371287 -1366954 -1366915 -1355674 -1348827 -1349968 -1374581 -1368651 -1354810 -1354640 -1358622 -1370915 -1378432 -1382340
6953 -1382340 -1374564 -1357718 -1373533 -1353146 -1346590 -1339495 -1357937 -1371128 -1381131 -1361001 -1359528 -1373488
6941 -1373488 -1381739 -1362756 -1357613 -1357197 -1358515 -1351486 -1359198 -1351945 -1313111 -1312439 -1312471 -1299330 -1306358 -1327794
6927 -1327794 -1336625 -1357812 -1374252 -1374064 -1364943 -1359159 -1361547 -1374948 -1359687 -1355874 -1353696 -1355528 -1360269
6914 -1360269 -1354174 -1341527 -1326456 -1329797 -1333707 -1336278 -1346756 -1342420 -1330483 -1316401 -1333513 -1365054
6902 -1365054 -1364852 -1359096 -1341526 -1360506 -1372111 -1356873 -1358286 -1353795 -1344932 -1346485 -1346921 -1353628 -1348470 -1314241
$$ packed form
6994a416970o312K845N60j2603J0153J3633q561r379J0457O347Q64Q973k705p093
6980a409791J3874J9692n952k2351j844J238j065K887j8122R762P60J9639R433
6967a381840J0553M333L9J1241O847j141k4613N930J3841J70l982j2293p517l908
6953a382340P776J6846j5815K0387O556P095j8442j3191j0003K0130J473j3960
6941a373488q251J8983N143M16j318P029p712P253L8834O72l2J3141p028k1436
6927a327794q831k1187j6440J88R121N784k388j3401J5261L813K178j832m741
6914a360269O095J2647J5071l341l910k571j0478M336J1937J4082j7112l1541
6902a365054K02N756J7570j8980j1605J5238j413M491Q863j553m36o707N158L4229
$$ plain form
6888 -1314241 -1311851 -1316140 -1306284 -1316710 -1344961 -1351448 -1322383 -1329661 -1333355 -1325988 -1337440 -1345658 -1362628
6875 -1362628 -1349055 -1338483 -1316446 -1316784 -1343280 -1357397 -1343153 -1326760 -1335489 -1335287 -1318694 -1321380 -1327386
6862 -1327386 -1308283 -1292528 -1293885 -1307020 -1309128 -1314791 -1336860 -1329778 -1315783 -1305552 -1292520 -1305826
6850 -1305826 -1286743 -1287840 -1293500 -1283768 -1295537 -1294221 -1288472 -1274764 -1274069 -1276139 -1282281 -1295682 -1304531
6837 -1304531 -1285072 -1282009 -1302102 -1321197 -1314087 -1311170 -1313867 -1323806 -1305294 -1296218 -1280210 -1296068 -1309539
6824 -1309539 -1313346 -1312760 -1309933 -1312919 -1312789 -1316474 -1317146 -1313677 -1302827 -1285737 -1289776 -1304341 -1280338 -1278274
6810 -1278274 -1281721 -1285156 -1289476 -1292595 -1284313 -1293464 -1293437 -1279795 -1293129 -1286673 -1276828 -1255152 -1253889 -1266142
6796 -1266142 -1274957 -1274025 -1283428 -1285608 -1291652 -1334072 -1325291 -1302566 -1299536 -1285453 -1292958 -1311725 -1292480
$$ packed form
6888a314241K390m289R856j0426k8251o487K9065p278l694P367j1452q218j6970
6875a362628J3573J0572K2037l38k6496j4117J4244J6393q729K02J6593k686o006
6862a327386J9103J5755j357j3135k108n663k2069P082J3995J0231J3032j3306
6850a305826J9083j097n660R732j1769J316N749J3708O95k070o142j3401q849
6837a304531J9459L063k0093j9095P110K917k697r939J8512R076J6008j5858j3471
6824a309539l807N86K827k986J30l685o72L469J0850J7090m039j4565K4003K064
6810a278274l447l435m320l119Q282r151K7J3642j3334O456R845K1676J263j2253
6796a266142q815R32r403k180o044m2420Q781K2725L030J4083p505j8767J9245
$$ plain form
6783 -1292480 -1275805 -1289544 -1302081 -1310704 -1300161 -1295939 -1292306 -1291527 -1269850 -1253930 -1266224 -1288377
6771 -1288377 -1315475 -1320996 -1288655 -1276114 -1270218 -1261080 -1270937 -1296491 -1306235 -1295870 -1272494 -1271095 -1263894
6758 -1263894 -1250119 -1257805 -1250339 -1250073 -1250702 -1236716 -1249053 -1255185 -1240756 -1238876 -1234233 -1244741 -1254056
6745 -1254056 -1252220 -1258036 -1260156 -1249569 -1245050 -1248906 -1237605 -1233801 -1241627 -1230223 -1218870 -1220206 -1235786
6732 -1235786 -1239028 -1242713 -1250825 -1245741 -1252976 -1252697 -1243460 -1227934 -1210864 -1217589 -1227645 -1226964 -1217981 -1233475
6718 -1233475 -1229643 -1224658 -1237619 -1259510 -1268133 -1288797 -1298024 -1292094 -1271565 -1276314 -1274049 -1260824 -1246879
6705 -1246879 -1241291 -1233728 -1237543 -1239782 -1252142 -1274564 -1277713 -1279478 -1262216 -1249175 -1254711 -1251859 -1244669
6692 -1244669 -1236222 -1244841 -1259125 -1252890 -1256688 -1230072 -1238153 -1255124 -1244879 -1252161 -1260117 -1276592 -1277737
$$ packed form
6783a292480J6675j3739j2537q623J0543M222L633P79K1677J5920j2294k2153
6771a288377k7098n521L2341J2541N896R138r857k5554r744J0365K3376J399P201
6758a263894J3775p686P466K66o29J3986j2337o132J4429J880M643j0508r315
6745a254056J836n816k120J0587M519l856J1301L804p826J1404J1353j336j5580
6732a235786l242l685q112N084p235K79R237J5526J7070o725j0056O81Q983j5494
6718a233475L832M985j2961k1891q623k0664r227N930K0529m749K265J3225J3945
6705a246879N588P563l815k239j2360k2422l149j765J7262J3041n536K852P190
6692a244669Q447q619j4284O235l798K6616q081j6971J0245p282p956j6475j145
$$ plain form
6679 -1277737 -1274064 -1242366 -1229870 -1240122 -1239043 -1232398 -1213768 -1228945 -1225106 -1207535 -1207920 -1222741 -1226466
6666 -1226466 -1236467 -1231701 -1226856 -1233008 -1240221 -1249778 -1249500 -1239740 -1241676 -1218314 -1208200 -1207224 -1215730 -1189206
6652 -1189206 -1191535 -1217997 -1214331 -1202972 -1204668 -1201144 -1205570 -1217892 -1230978 -1241155 -1253284 -1254169 -1233587
6639 -1233587 -1241817 -1237562 -1237506 -1222206 -1201820 -1170744 -1166866 -1183597 -1208833 -1238030 -1220932 -1199422 -1201687
6626 -1201687 -1209791 -1209188 -1199831 -1203283 -1198225 -1192880 -1197653 -1203293 -1203129 -1198641 -1203258 -1213107 -1219721 -1211876 -1208924
6611 -1208924 -1194891 -1197813 -1213619 -1212406 -1201386 -1206054 -1225756 -1215261 -1210044 -1212299 -1204256 -1208035 -1220623
6598 -1220623 -1215336 -1210228 -1197046 -1190398 -1189111 -1190914 -1181275 -1191510 -1208912 -1192697 -1186351 -1187478 -1203688
6585 -1203688 -1218116 -1208700 -1194408 -1191267 -1169773 -1165792 -1155742 -1175846 -1160865 -1158337 -1169094 -1182655
$$ packed form
6679a277737L673L1698J2496j0252J079O645J8630j5177L839J7571l85j4821l725
6666a226466j0001M766M845o152p213r557K78R760j936K3362J0114R76q506K6524
6652a189206k329k6462L666J1359j696L524m426j2322j3086j0177j2129q85K0582
6639a233587q230M255N6J5300K0386L1076L878j6731k5236k9197J7098K1510k265
6626a201687q104O03R357l452N058N345m773n640J64M488m617r849o614P845K952
6611a208924J4033k922j5806J213J1020m668j9702J0495N217k255Q043l779j2588
6598a220623N287N108J3182O648J287j803R639j0235j7402J6215O346j127j6210
6585a203688j4428R416J4292L141K1494L981J0050k0104J4981K528j0757j3561
$$ plain form
6573 -1182655 -1183218 -1180163 -1164160 -1176120 -1189272 -1190729 -1198490 -1182909 -1168384 -1163148 -1172280 -1180845 -1188034
6560 -1188034 -1187479 -1194245 -1195681 -1179176 -1186043 -1191751 -1191098 -1170669 -1154739 -1168663 -1171960 -1158819 -1159439 -1163503
6546 -1163503 -1177738 -1192577 -1193786 -1202351 -1200073 -1187092 -1191569 -1190382 -1181735 -1181255 -1184852 -1166060 -1166871 -1169993
6532 -1169993 -1179490 -1175723 -1178078 -1169269 -1145957 -1150546 -1156887 -1163675 -1162338 -1149511 -1133523 -1139994 -1158681
6519 -1158681 -1149675 -1139366 -1152548 -1169521 -1176132 -1165734 -1169731 -1157968 -1150002 -1156989 -1149152 -1153669 -1143627
6506 -1143627 -1132070 -1138763 -1140982 -1149452 -1162687 -1167951 -1167044 -1173148 -1188967 -1175042 -1151307 -1144046 -1148848
6493 -1148848 -1158469 -1145428 -1129493 -1120011 -1115761 -1113123 -1111731 -1127010 -1152710 -1160511 -1140003 -1135445 -1135282
6480 -1135282 -1146407 -1156733 -1166547 -1166730 -1171148 -1184373 -1172555 -1139176 -1131709 -1144259 -1146149 -1157399 -1160407
$$ packed form
6573a182655n63L055J6003j1960j3152j457p761J5581J4525N236r132q565p189
6560a188034N55o766j436J6505o867n708O53K0429J5930j3924l297J3141o20m064
6546a163503j4235j4839j209q565K278J2981m477J187Q647M80l597J8792q11l122
6532a169993r497L767k355Q809K3312m589o341o788J337J2827J5988o471j8687
6519a158681R006J0309j3182j6973o611J0398l997J1763P966o987P837m517J0042
6506a143627J1557o693k219q470j3235n264R07o104j5819J3925K3735P261m802
6493a148848r621J3041J5935R482M250K638J392j5279k5700p801K0508M558J63
6480a135282j1125j0326r814j83m418j3225J1818L3379P467j2550j890j1250l008
$$ plain form
6467 -1160407 -1167873 -1161406 -1140710 -1144388 -1138775 -1121653 -1126723 -1133964 -1154987 -1142096 -1148595 -1149959 -1135893
6454 -1135893 -1133187 -1141492 -1153204 -1136910 -1128957 -1117469 -1131430 -1132688 -1137948 -1154083 -1128884 -1124653 -1135023
6441 -1135023 -1134631 -1132309 -1136346 -1121551 -1117513 -1120363 -1127502 -1134781 -1140870 -1141234 -1120603 -1106948 -1103605 -1099680
6427 -1099680 -1117738 -1140277 -1153925 -1128177 -1120143 -1123459 -1118253 -1122612 -1107375 -1091107 -1076980 -1090178
6415 -1090178 -1110461 -1114626 -1109675 -1101647 -1103140 -1117234 -1127612 -1116216 -1128226 -1137876 -1125964 -1119300 -1095398
6402 -1095398 -1085745 -1102930 -1091363 -1074965 -1088501 -1099340 -1104035 -1108445 -1118404 -1119721 -1116368 -1114835 -1109213
6389 -1109213 -1107403 -1125942 -1132111 -1118403 -1104898 -1088478 -1092065 -1117041 -1129663 -1123282 -1100716 -1089153
6377 -1089153 -1082853 -1073251 -1075303 -1095213 -1112955 -1108398 -1106482 -1117773 -1105428 -1095638 -1095285 -1093172 -1103921
$$ packed form
6467a160407p466O467K0696l678N613J7122n070p241k1023J2891o499j364J4066
6454a135893K706q305j1712J6294P953J1488j3961j258n260j6135K5199M231j0370
6441a135023L92K322m037J4795M038k850p139p279o089l64K0631J3655L343L925
6427a099680j8058k2539j3648K5748Q034l316N206m359J5237J6268J4127j3198
6415a090178k0283m165M951Q028j493j4094j0378J1396j2010r650J1912O664K3902
6402a095398R653j7185J1567J6398j3536j0839m695m410r959j317L353J533N622
6389a109213J810j8539o169J3708J3505J6420l587k4976j2622O381K2566J1563
6377a089153O300R602k052j9910j7742M557J916j1291J2345R790L53K113j0749
$$ plain form
6364 -1103921 -1096793 -1100592 -1096630 -1090425 -1072669 -1091641 -1110443 -1106072 -1089986 -1089011 -1095729 -1093640 -1094082 -1099593
6350 -1099593 -1090700 -1076061 -1101008 -1099124 -1079699 -1082071 -1095616 -1096710 -1095550 -1117684 -1103968 -1092667
6338 -1092667 -1091862 -1091828 -1096608 -1076739 -1072769 -1090168 -1100842 -1102490 -1103641 -1110939 -1082347 -1063408 -1076242
6325 -1076242 -1079810 -1077647 -1077510 -1084288 -1099481 -1096054 -1073403 -1073138 -1076716 -1063990 -1080036 -1086674 -1092640 -1103750
6311 -1103750 -1106166 -1075606 -1058992 -1077857 -1085817 -1077788 -1086284 -1070314 -1050237 -1057110 -1062297 -1075132 -1073003
6298 -1073003 -1071486 -1073428 -1076408 -1099249 -1082663 -1071726 -1078351 -1091946 -1097868 -1082201 -1063096 -1053050
6286 -1053050 -1029026 -1024419 -1036637 -1051586 -1067315 -1058065 -1034575 -1028776 -1039975 -1068523 -1073505 -1059900
6274 -1059900 -1076364 -1084150 -1091489 -1078840 -1087511 -1088879 -1075710 -1067889 -1071096 -1086414 -1084881 -1072610 -1064405
$$ packed form
6364a103921P128l799L962O205J7756j8972j8802M371J6086R75o718K089m42n511
6350a099593Q893J4639k4947J884J9425k372j3545j094J160k2134J3716J1301
6338a092667Q05L4m780J9869L970j7399j0674j648j151p298K8592J8939j2834
6325a076242l568K163J37o778j5193L427K2651K65l578J2726j6046o638n966j1110
6311a103750k416L0560J6614j8865p960Q029q496J5970K0077o873n187j2835K129
6298a073003J517j942k980k2841J6586J0937o625j3595n922J5667J9105J0046
6286a053050K4024M607j2218j4949j5729R250K3490N799j1199k8548m982J3605
6274a059900j6464p786p339J2649q671j368J3169P821l207j5318J533J2271Q205
$$ plain form
6261 -1064405 -1081030 -1058154 -1032883 -1031859 -1035073 -1024164 -1023394 -1038835 -1060011 -1066470 -1072993 -1070414 -1065723
6248 -1065723 -1050574 -1033850 -1021494 -1015429 -1031368 -1028416 -1007984 -995691 -1005703 -1020345 -1029305 -1040101
6236 -1040101 -1033279 -1040789 -1042769 -1036450 -1037359 -1042181 -1036949 -1055633 -1059954 -1058742 -1051049 -1037871 -1036749 -1042382
6222 -1042382 -1043615 -1052064 -1049299 -1039069 -1035076 -1037952 -1031603 -1029178 -1038261 -1039706 -1027319 -1034549 -1047885
6209 -1047885 -1051267 -1045056 -1067199 -1057818 -1035315 -1031930 -1051092 -1066018 -1048905 -1015254 -1005548 -1036028
6197 -1036028 -1054810 -1064091 -1073581 -1068845 -1058458 -1029714 -1007765 -1016774 -1013735 -1000618 -1004733 -1023902 -1024630
6184 -1024630 -1005944 -1000859 -998424 -1014388 -1018904 -1024548 -1040179 -1039641 -1027576 -1033705 -1038182 -1035472 -1033961
6171 -1033961 -1039467 -1046047 -1051946 -1042691 -1043954 -1051521 -1041631 -1028758 -1029848 -1040320 -1038800 -1039381 -1033502 -1030848
$$ packed form
6261a064405j6625K2876K5271J024l214J0909P70j5441k1176o459o523K579M691
6248a065723J5149J6724J2356O065j5939K952K0432J2293j0012j4642q960j0796
6236a040101O822p510j980O319r09m822N232j8684m321J212P693J3178J122n633
6222a042382j233q449K765J0230L993k876O349K425r083j445J2387p230j3336
6209a047885l382O211k2143R381K2503L385j9162j4926J7113L3651R706l0480
6197a036028j8782r281r490M736J0387K8744K1949r009L039J3117m115j9169p28
6184a024630J8686N085K435j5964m516n644j5631N38J2065o129m477K710J511
6171a033961n506o580n899R255j263p567R890J2873j090j0472J520n81N879K654
$$ plain form
6157 -1030848 -1029401 -1032148 -1022441 -1018636 -1014529 -1013037 -1034326 -1063033 -1069682 -1056853 -1033206 -1017643 -1015967
6144 -1015967 -1019297 -1017553 -1013966 -1019500 -1026270 -1022053 -1010528 -1016031 -1020958 -1009193 -1007283 -1021967 -1000400
6131 -1000400 -996913 -1016445 -1018562 -1000919 -990534 -997763 -999941 -1008501 -1025066 -1023267 -1026473 -1020554 -1000858
6118 -1000858 -998534 -1016514 -1023694 -1015104 -1012723 -1004886 -1012614 -997153 -986933 -987547 -982427 -997004 -1009205
6105 -1009205 -1008734 -998964 -1004149 -1030728 -1038508 -1016317 -998031 -1008268 -1007794 -1025312 -1029363 -1024286 -1006535
6092 -1006535 -1002978 -1003344 -1014085 -1027129 -1034479 -1034482 -1048221 -1033846 -1028858 -1032972 -1025835 -1006904 -995464 -1001411
6078 -1001411 -1000800 -1006292 -1011705 -1006002 -985133 -997765 -1013281 -1004402 -985979 -964983 -969973 -989799 -1004735
6065 -1004735 -1013608 -1007808 -996134 -984801 -978514 -989702 -986749 -988081 -988045 -986343 -998799 -1008656 -1004673 -1006686
$$ packed form
6157a030848J447k747R707L805M107J492k1289k8707o649J2829K3647J5563J676
6144a015967l330J744L587n534o770M217J1525n503m927J1765J910j4684K1567
6131a000400L487j9532k117J7643J0385p229k178q560j6565J799l206N919J9696
6118a000858K324j7980p180Q590K381P837p728J5461J0220o14N120j4577j2201
6105a009205M71R770n185k6579p780K2191J8286j0237M74j7518m051N077J7751
6092a006535L557l66j0741j3044p350lj3739J4375M988m114P137J8931J1440n947
6078a001411O11n492n413N703K0869j2632j5516Q879J8423K0996m990j9826j4936
6065a004735q873N800J1674J1333O287j1188K953j332L6J702j2456r857L983k013
$$ plain form
6051 -1006686 -1009262 -982852 -992059 -985248 -991136 -1022858 -1038797 -1028989 -1013382 -996544 -997861 -1005555 -1006960
6038 -1006960 -1016021 -1022165 -1020907 -1015246 -1010390 -1005475 -1007268 -999394 -990290 -980846 -974246 -966501 -972365 -982762
6024 -982762 -998999 -981732 -983593 -992365 -1011134 -1003869 -1005987 -995123 -985212 -977328 -976241 -979269 -961661
6011 -961661 -945894 -955834 -978261 -981874 -984081 -986857 -986501 -982600 -986477 -1009072 -1022407 -1024648 -1012443
5998 -1012443 -1003451 -998803 -976798 -968165 -969612 -980948 -982942 -982314 -977395 -974423 -967423 -975993 -974535 -971880
5984 -971880 -990384 -983460 -990025 -973922 -971938 -978455 -983996 -986513 -968606 -966159 -969163 -982751 -984669
5971 -984669 -977270 -973153 -976851 -981233 -986524 -987460 -985813 -988750 -985055 -978607 -971163 -970908 -970834 -981666 -981259
5956 -981259 -980574 -980193 -972042 -969455 -970825 -983764 -989741 -978966 -966738 -976172 -1000572 -1005196 -996896 -999028
$$ packed form
6051a006686k576K6410r207O811n888l1722j5939R808J5607J6838j317p694j405
6038a006960r061o144J258N661M856M915j793P874R104R444O600P745n864j0397
6024i82762j6237J7267j861q772j8769P265k118J0864R911P884J087l028J7608
6011i61661J5767r940k2427l613k207k776L56L901l877k2595j3335k241J2205
5998a012443Q992M648K2005Q633j447j1336j994O28M919K972P000q570J458K655
5984i71880j8504O924o565J6103J984o517n541k517J7907K447l004j3588j918
5971i84669P399M117l698m382n291r36J647k937L695O448P444K55P4j0832M07
5956i81259O85L81Q151K587j370j2939n977J0775J2228r434k4400m624Q300k132
$$ plain form
5942 -999028 -981034 -973456 -971556 -965950 -976166 -983112 -971553 -965360 -957751 -965173 -978531 -971656 -957810
5929 -957810 -965188 -962856 -984906 -993017 -954203 -921384 -958952 -977657 -978280 -964680 -943206 -947978 -947609
5916 -947609 -938193 -948384 -949615 -958504 -969183 -983793 -986693 -971572 -973094 -984842 -970219 -963110 -940000
5903 -940000 -942013 -953632 -957809 -969358 -964530 -961151 -963305 -955798 -951984 -967057 -950932 -938824 -938725 -942689
5889 -942689 -939307 -956338 -976258 -980725 -985294 -975252 -971319 -975782 -973500 -963875 -951083 -949566 -941721
5876 -941721 -948048 -975440 -990490 -978979 -947401 -931795 -927665 -937378 -942439 -933197 -938435 -927314 -920525
5863 -920525 -927907 -930252 -932592 -938143 -926665 -918148 -934139 -954154 -960127 -960129 -976611 -972990 -954603 -950538
5849 -950538 -947926 -940423 -941903 -941361 -948995 -952752 -963353 -971023 -973351 -955904 -957456 -957816 -965889 -959709
$$ packed form
5942i99028J7994P578J900N606j0216o946J1559O193P609p422j3358O875J3846
5929i57810p378K332k2050q111L8814L2819l7568j8705o23J3600K1474m772L69
5916i47609R416j0191j231q889j0679j4610k900J5121j522j1748J4623P109K3110
5903i40000k013j1619m177j1549M828L379k154P507L814j5073J6125J2108R9l964
5889i42689L382j7031j9920m467m569J0042L933m463K282R625J2792J517P845
5876i41721o327k7392j5050J1511L1578J5606M130r713n061R242n238J1121O789
5863i20525p382k345k340n551J1478Q517j5991k0015n973kj6482L621J8387M065
5849i50538K612P503j480N42p634l757j0601p670k328J7447j552l60q073O180
$$ plain form
5835 -959709 -947687 -950641 -961051 -961024 -965449 -956135 -947657 -951804 -951052 -947280 -940939 -927516 -928047 -931639 -923034
5820 -923034 -919423 -919889 -929284 -925604 -935430 -947495 -945104 -957835 -972697 -974371 -980627 -961757 -959154 -949793
5806 -949793 -933862 -944642 -943792 -951214 -957570 -943837 -930050 -925738 -914985 -910710 -906705 -906502 -917011
5793 -917011 -926738 -932051 -932963 -943344 -954394 -961692 -959750 -945762 -940503 -958096 -959459 -949456 -942185
5780 -942185 -947864 -929903 -924245 -929002 -939377 -949106 -949201 -932229 -932051 -928952 -930552 -912651 -903451 -907177
5766 -907177 -905394 -895350 -913547 -938437 -950641 -953336 -944385 -919960 -913904 -903811 -902430 -913105 -924706
5753 -924706 -937993 -938983 -932314 -916421 -920642 -917274 -925687 -930805 -920392 -899869 -906968 -929301 -930655
5740 -930655 -922273 -918725 -923547 -921862 -895062 -889342 -901564 -902197 -894321 -904982 -923621 -947047 -950162
$$ packed form
5835i59709J2022k954j0410K7m425R314Q478m147P52L772O341J3423n31l592Q605
5820i23034L611m66r395L680r826j2065K391j2731j4862j674o256J8870K603R361
5806i49793J5931j0780Q50p422o356J3733J3787M312J0753M275M005K03j0509
5793i17011r727n313r12j0381j1050p298J942J3988N259j7593j363J0003P271
5780i42185n679J7961N658m757j0375r729r5J6972J78L099j600J7901R200l726
5766i07177J783J0044j8197k4890j2204k695Q951K4425O056J0093J381j0675j1601
5753i24706j3287r90O669J5893m221L368q413n118J0413K0523p099k2333j354
5740i30655Q382L548m822J685K6800N720j2222o33P876j0661j8639k3426l115
$$ plain form
5727 -950162 -935247 -928544 -936451 -921517 -914940 -914296 -911039 -920357 -933616 -937106 -946679 -937783 -928945 -909699
5713 -909699 -905609 -915815 -919349 -910802 -895337 -873658 -896320 -918765 -930870 -930907 -920207 -915238 -910382
5700 -910382 -899419 -896118 -899679 -891349 -882485 -878963 -891379 -892892 -911382 -913468 -910381 -907385 -904091 -883065
5686 -883065 -887724 -892393 -878597 -903863 -918868 -888396 -872127 -874754 -879938 -879725 -890663 -911432 -912506
5673 -912506 -894435 -882703 -873630 -885053 -900069 -903547 -897571 -890915 -882174 -880426 -874091 -882017 -893251
5660 -893251 -902016 -901126 -896496 -900248 -904774 -887245 -887499 -895420 -912792 -914630 -904512 -889978 -879096 -871436
5646 -871436 -879809 -891476 -869394 -862817 -860191 -860611 -865751 -883355 -887854 -903889 -912555 -891497 -889553
5633 -889553 -885973 -883787 -884413 -866162 -862294 -882690 -878141 -864988 -876074 -886863 -900626 -908058 -908924
$$ packed form
5727i50162J4915O703p907J4934O577O44L257r318j3259l490r573Q896Q838J9246
5713i09699M090j0206l534Q547J5465K1679k2662k2445j2105l7J0700M969M856
5700i10382J0963L301l561Q330Q864L522j2416j513j8490k086L087K996L294K1026
5686h83065m659m669J3796k5266j5005L0472J6269k627n184K13j0938k0769j074
5673i12506J8071J1732R073j1423j5016l478N976O656Q741J748O335p926j1234
5660h93251q765Q90M630l752m526J7529k54p921j7372j838J0118J4534J0882P660
5646h71436q373j1667K2082O577K626m20n140j7604m499j6035q666K1058J944
5633h89553L580K186o26J8251L868k0396M549J3153j1086j0789j3763p432q66
$$ plain form
5620 -908924 -904159 -889434 -903870 -910350 -911694 -932935 -925975 -909751 -919067 -910017 -886355 -890603 -894065
5607 -894065 -886684 -876145 -897303 -896781 -894905 -916708 -921675 -915287 -904936 -898454 -868005 -871436 -866091
5594 -866091 -870536 -876526 -885333 -899986 -907664 -915609 -915316 -900909 -864026 -851912 -867702 -871810 -876547
5581 -876547 -879002 -896900 -889832 -892569 -899824 -897052 -869019 -860347 -864043 -878045 -870683 -851865 -857541
5568 -857541 -894415 -918986 -909680 -882536 -862065 -868561 -888635 -891705 -893975 -897325 -887133 -873039 -880238
5555 -880238 -876224 -866897 -855315 -862530 -870088 -888157 -888614 -882023 -895379 -896672 -902212 -896372 -896265 -886683
5541 -886683 -882641 -891390 -860403 -842097 -865135 -884615 -869837 -854579 -865997 -872461 -870943 -871126 -871783
5528 -871783 -880208 -877476 -870229 -874243 -858112 -869903 -858637 -855437 -857062 -896300 -903575 -898839 -906739
$$ packed form
5620i08924M765J4725j4436o480j344k1241O960J6224r316R050K3662m248l462
5607h94065P381J0539k1158N22J876k1803m967O388J0351O482L0449l431N345
5594h66091m445n990q807j4653p678p945K93J4407L6883J2114j5790m108m737
5581h76547k455j7898P068k737p255K772K8033Q672l696j4002P362J8818n676
5568h57541l6874k4571R306K7144K0471o496k0074l070k270l350J0192J4094p199
5555h80238M014R327J1582p215p558j8069m57O591j3356j293n540N840J07R582
5541h86683M042q749L0987J8306k3038j9480J4778J5258j1418o464J518j83o57
5528h71783q425K732P247m014J6131j1791J1266L200j625l9238p275M736p900
$$ plain form
5515 -906739 -886480 -861225 -870725 -889967 -874337 -884190 -904605 -894960 -885387 -870466 -851403 -844989 -859408
5502 -859408 -877485 -892621 -881735 -866200 -861961 -866939 -863129 -869136 -870992 -880251 -885942 -893687 -871310
5489 -871310 -846284 -846882 -862292 -884301 -876307 -870908 -869506 -865114 -854299 -858009 -862212 -880404 -901040
5476 -901040 -895825 -900218 -884040 -882064 -895125 -887860 -884912 -900286 -898270 -872181 -864550 -877016 -876997 -877163
5462 -877163 -867764 -861499 -869741 -857982 -854627 -864816 -868302 -852098 -840748 -828729 -825193 -834295 -845474
5449 -845474 -827001 -819358 -833578 -845716 -868988 -860577 -860474 -871209 -887771 -878242 -852814 -852722 -855378
5436 -855378 -857148 -871679 -880561 -870345 -866158 -874573 -884689 -861570 -856037 -850926 -859325 -869071 -847003
5423 -847003 -840686 -837098 -858818 -856509 -839070 -839613 -828237 -836315 -871215 -884181 -871902 -852689 -849609
$$ packed form
5515i06739K0259K5255r500j9242J5630r853k0415R645R573J4921J9063O414j4419
5502h59408j8077j5136J0886J5535M239m978L810o007j856r259n691p745K2377
5489h71310K5026n98j5410k2009P994N399J402M392J0815l710m203j8192k0636
5476i01040N215m393J6178J976j3061P265K948j5374K016K6089P631j2466J9j66
5462h77163R399O265q242J1759L355j0189l486J6204J1350J2019L536r102j1179
5449h45474J8473P643j4220j2138k3272Q411J03j0735j6562R529K5428R2k656
5436h55378j770j4531q882J0216M187q415j0116K3119N533N111q399r746K2068
5423h47003O317L588k1720K309J7439n43J1376q078l4900j2966J2279J9213L080
$$ plain form
5410 -849609 -876296 -903719 -887732 -853708 -852905 -884597 -885701 -854576 -835355 -832169 -840422 -842047 -821058
5397 -821058 -803686 -810234 -820220 -829733 -837939 -849702 -859417 -861001 -859428 -857242 -877786 -883156 -869498
5384 -869498 -849921 -840964 -834739 -835815 -841997 -846782 -848597 -846888 -844658 -836145 -836513 -850199 -848785 -843279
5370 -843279 -825180 -818193 -827458 -840661 -853397 -847536 -849286 -854395 -845846 -831908 -828778 -828642 -842388
5357 -842388 -854269 -860094 -853605 -854275 -858271 -848754 -847403 -865429 -890772 -888958 -871823 -856537 -859757
5344 -859757 -864605 -869452 -866998 -860722 -851483 -842867 -838226 -830730 -829410 -838271 -835956 -823088 -834349 -840701
5330 -840701 -829399 -833231 -842281 -843419 -844375 -833349 -831810 -818962 -820917 -826281 -832212 -827111 -820846 -822467
5316 -822467 -828000 -827502 -827984 -842842 -826738 -801258 -801062 -791597 -787203 -796207 -809676 -817353 -828452 -823369
$$ packed form
5410h49609k6687k7423J5987L4024Q03l1692j104L1125J9221L186q253j625K0989
5397h21058J7372o548r986r513q206j1763r715j584J573K186k0544n370J3658
5384h69498J9577Q957O225j076o182m785j815J709K230Q513l68j3686J414N506
5370h43279J8099O987r265j3203j2736N861j750n109Q549J3938L130J36j3746
5357h42388j1881n825O489o70l996R517J351j8026k5343J814J7135J5286l220
5344h59757m848m847K454O276R239Q616M641P496J320q861K315J2868j1261o352
5330h40701J1302l832r050j138r56J1026J539J2848j955n364n931N101O265j621
5316h22467n533M98m82j4858J6104K5480J96R465M394r004j3469p677j1099N083
$$ plain form
5302 -823369 -806814 -787303 -787619 -799554 -823913 -843196 -827015 -815516 -834717 -833721 -853104 -860449 -834271
5289 -834271 -820076 -833143 -833288 -815516 -806576 -818043 -821415 -824820 -816048 -811302 -816596 -835338 -828345
5276 -828345 -807589 -806975 -822766 -827281 -829300 -840844 -838359 -821478 -808523 -794933 -780657 -794516 -806375
5263 -806375 -803677 -818295 -845423 -847920 -835525 -843980 -835983 -827712 -815981 -822906 -837327 -827280 -812074
5250 -812074 -801240 -787224 -787925 -786296 -800526 -806341 -818412 -811517 -798024 -798851 -784044 -761609 -768346
5237 -768346 -803741 -810737 -814888 -811702 -824806 -840241 -818070 -807246 -811651 -824970 -840229 -833254 -829519
5224 -829519 -822150 -818084 -818960 -812035 -822389 -816158 -808477 -815041 -824394 -814903 -817697 -822764 -824618 -815610
5210 -815610 -808657 -812219 -842061 -848485 -837443 -852622 -841695 -815642 -785471 -791569 -804291 -828082
$$ packed form
5302h23369J6555J9511l16j1935k4359j9283J6181J1499j9201R96j9383p345K6178
5289h34271J4195j3067j45J7772Q940j1467l372l405Q772M746n294j8742O993
5276h28345K0756O14j5791m515k019j1544K485J6881J2955J3590J4276j3859j1859
5263h06375K698j4618k7128k497J2395q455P997Q271J1731o925j4421J0047J5206
5250h12074J0834J4016p01J629j4230n815j2071O895J3493q27J4807K2435o737
5237g68346l5395o996m151L186j3104j5435K2171J0824m405j3319j5259O975L735
5224h29519P369M066q76O925j0354O231P681o564r353R491k794n067j854R008
5210h15610O953l562k9842o424J1042j5179J0927K6053L0171o098j2722k3791
$$ plain form
5198 -828082 -835260 -821856 -812761 -812389 -810189 -799545 -790329 -771693 -777314 -814063 -820317 -805123 -811603
5185 -811603 -816367 -825349 -814983 -792255 -796871 -807139 -801178 -789090 -798990 -799695 -799790 -800706 -779706 -769606
5171 -769606 -768517 -770424 -766554 -789661 -806964 -804235 -812251 -807142 -806266 -802206 -787352 -805964 -808322 -803376
5157 -803376 -777201 -767405 -781497 -780680 -774813 -779588 -795553 -804094 -813659 -819017 -815812 -798079 -795425 -791936
5143 -791936 -800531 -801279 -816256 -823261 -801999 -784146 -794454 -798322 -778028 -770753 -777964 -781343 -817406
5130 -817406 -818286 -811645 -801948 -819693 -815826 -807106 -793874 -816116 -826682 -826986 -816914 -804246 -811307
5117 -811307 -793299 -782572 -774937 -768005 -767176 -767422 -771382 -789929 -799015 -782370 -780389 -805774 -815808
5104 -815808 -810273 -798225 -797914 -793001 -795219 -789148 -791942 -798992 -806401 -807381 -802829 -799126 -800130 -808738 -814235
$$ packed form
5198h28082p178J3404R095L72K200J0644R216J8636n621l6749o254J5194o480
5185h11603m764q982J0366K2728m616j0268N961J2088r900p05r5r16K1000J0100
5171g69606J089j907L870k3107j7303K729q016N109Q76M060J4854j8612k358M946
5157h03376K6175R796j4092Q17N867m775j5965q541r565n358L205J7733K654L489
5143g91936q595p48j4977p005K1262J7853j0308l868K0294P275p211l379l6063
5130h17406q80O641R697j7745L867Q720J3232k2242j0566l04J0072J2668p061
5117h11307J8008J0727P635O932Q29k46l960j8547r086J6645J981k5385j0034
5104h15808N535J2048L11M913k218O071k794p050p409r80M552L703j004q608n497
$$ plain form
5089 -814235 -801355 -797696 -788495 -784863 -783841 -800897 -807875 -797783 -795833 -787873 -786851 -781474 -770673
5076 -770673 -767520 -784504 -802025 -812082 -802053 -781891 -781043 -792679 -786399 -777929 -790163 -780333 -777177
5063 -777177 -776975 -784259 -797794 -788614 -781064 -791591 -782250 -770752 -760305 -758313 -755136 -779180 -792849
5050 -792849 -785867 -778270 -778242 -794228 -801643 -810327 -813923 -804490 -809715 -797426 -782770 -766139 -781979 -793611
5036 -793611 -806420 -803582 -796539 -805504 -819171 -814143 -798133 -795764 -809275 -812292 -796183 -777241 -796372
5023 -796372 -804053 -790221 -785902 -792569 -786050 -790841 -791516 -789972 -791045 -793871 -800049 -786615 -766788 -753367
5009 -753367 -748501 -747736 -765837 -788898 -803710 -807231 -802223 -788336 -781474 -790650 -802665 -813493 -809367
4996 -809367 -810537 -803144 -797719 -796100 -792912 -773092 -764419 -768083 -778380 -788104 -763621 -751124 -739864
$$ packed form
5089h14235J2880L659R201L632J022j7056o978J0092J950P960J022N377J0801
5076g70673L153j6984j7521j0057J0029K0162Q48j1636O280Q470j2234R830L156
5063g77177K02p284j3535R180P550j0527R341J1498J0447J992L177k4044j3669
5050g92849O982P597K8j5986p415q684l596R433n225J2289J4656J6631j5840j1632
5036g93611j2809K838P043q965j3667N028J6010K369j3511l017J6109J8942j9131
5023g96372p681J3832M319o667O519m791o75J544j073k826o178J3434J9827J3421
5009g53367M866P65j8101k3061j4812l521N008J3887O862r176j2015j0828M126
4996h09367j170P393N425J619L188J9820Q673l664j0297r724K4483J2497J1260
$$ plain form
4983 -739864 -745631 -768012 -775961 -785253 -778583 -761200 -737083 -748667 -769190 -772267 -769737 -771735 -790882
4970 -790882 -768738 -754077 -754267 -766478 -777193 -787470 -804224 -799345 -812878 -816831 -795302 -783687
4958 -783687 -788773 -821102 -819669 -817498 -815673 -813388 -804428 -794262 -768955 -766985 -785483 -779209 -754594
4945 -754594 -775109 -778468 -783765 -772430 -774207 -776477 -782158 -775848 -770770 -762055 -769393 -780389 -765830
4932 -765830 -767402 -775473 -766338 -754124 -760758 -765970 -763940 -780333 -771880 -767283 -756756 -749857 -755569 -771584
4918 -771584 -770214 -756437 -756207 -755153 -774385 -782887 -778218 -781046 -771909 -764718 -768812 -771450 -764317 -773494
4904 -773494 -783417 -783112 -783546 -778388 -777985 -775773 -770576 -758795 -762760 -761405 -772746 -784090 -777344 -783384
4890 -783384 -786019 -781961 -763579 -752220 -750512 -752116 -757063 -768778 -781004 -769963 -750888 -765061 -782801
$$ packed form
4983g39864n767k2381p949r292O670J7383K4117j1584k0523l077K530j998j9147
4970g90882K2144J4661j90j2211j0715j0277j6754M879j3533l953K1529J1615
4958g83687n086l2329J433K171J825K285Q960J0166K5307J970j8498O274K4615
4945g54594k0515l359n297J1335j777k270n681O310N078Q715p338j0996J4559
4932g65830j572q071R135J2214o634n212K030j6393Q453M597J0527O899n712j6015
4918g71584J370J3777K30J054j9232q502M669k828R137P191m094k638P133r177
4904g73494r923L05m34N158M03K212N197J1781l965J355j1341j1344O746o040
4890g83384k635M058J8382J1359J708j604m947j1715j2226J1041J9075j4173j7740
$$ plain form
4877 -782801 -774244 -773135 -775802 -771208 -784867 -789389 -791445 -797066 -775184 -754238 -741659 -748511 -729075
4864 -729075 -726976 -732271 -741204 -738710 -735940 -727862 -721247 -754157 -772320 -757509 -735229 -733582 -737734
4851 -737734 -749044 -756830 -755430 -720732 -715129 -737724 -771977 -781592 -773352 -765500 -755786 -762544 -753331
4838 -753331 -749549 -739091 -740690 -744518 -770971 -757223 -738091 -747855 -765984 -779463 -794089 -790343 -777037
4825 -777037 -780324 -766244 -757095 -759417 -771010 -765188 -739920 -748173 -747956 -739049 -734916 -724137 -720822 -724922
4811 -724922 -730533 -744816 -758434 -767448 -764273 -761683 -759910 -767330 -766647 -775486 -779184 -778346 -780558 -773449
4797 -773449 -758551 -739750 -722559 -710448 -720586 -739509 -755238 -751488 -758307 -761380 -764398 -754304
4785 -754304 -730448 -723161 -726769 -744824 -753176 -744859 -740494 -754654 -767521 -772470 -768759 -756411 -746389
$$ packed form
4877g82801Q557J109k667M594j3659m522k056n621K1882K0946J2579o852J9436
4864g29075K099n295q933K494K770Q078O615l2910j8163J4811K2280J647m152
4851g37734j1310p786J400L4698N603k2595l4253r615Q240P852R714o758R213
4838g53331L782J0458j599l828k6453J3748J9132r764j8129j3479j4626L746J3306
4825g77037l287J4080R149k322j1593N822K5268q253K17Q907M133J0779L315m100
4811g24922n611j4283j3618r014L175K590J773p420O83q839l698Q38k212P109
4797g73449J4898J8801J7191J2111j0138j8923j5729L750o819l073l018J0094
4785g54304K3856P287l608j8055q352Q317M365j4160j2867m949L711J2348J0022
$$ plain form
4772 -746389 -742042 -748816 -736518 -724658 -731736 -733538 -751009 -762530 -748625 -733746 -721938 -714725 -717863
4759 -717863 -724741 -731723 -727619 -706240 -696826 -702569 -716468 -741284 -754970 -749303 -729901 -729988 -757729
4746 -757729 -770875 -782967 -766974 -755426 -740440 -736485 -736785 -746194 -756585 -755441 -763189 -768242 -766576
4733 -766576 -763242 -745986 -751315 -756664 -753687 -755584 -760389 -768863 -756864 -731904 -729771 -720899 -717656 -727642
4719 -727642 -746658 -749409 -748727 -737282 -751291 -760287 -734817 -709158 -720428 -739695 -738658 -733898 -722806
4706 -722806 -728170 -722045 -712935 -717601 -709742 -698292 -727824 -731994 -738133 -738092 -723453 -716411 -715419 -723059
4692 -723059 -720885 -741341 -756023 -746288 -725553 -708934 -704815 -696586 -675545 -659878 -681018 -693337
4680 -693337 -685067 -697079 -714915 -716541 -735426 -762889 -769673 -762452 -775972 -788327 -777298 -743056
$$ packed form
4772g46389M347o774J2298J1860p078j802j7471j1521J3905J4879J1808P213l138
4759g17863o878o982M104K1379R414n743j3899k4816j3686N667J9402q7k7741
4746g57729j3146j2092J5993J1548J4986L955l00r409j0391J144p748n053J666
4733g66576L334J7256n329n349K977j897m805q474J1999K4960K133Q872L243r986
4719g27642j9016k751O82J1445j4009q996K5470K5659j1270j9267J037M760J1092
4706g22806n364O125R110m666P859J1450k9532m170o139M1J4639P042R92p640
4692g23059K174k0456j4682R735K0735J6619M119Q229K1041J5667k1140j2319
4680f93337Q270j2012j7836j626j8885k7463o784P221j3520j2355J1029L4242
$$ plain form
4668 -743056 -726983 -733045 -745977 -768298 -759384 -739974 -747143 -747049 -727937 -730959 -739795 -716506 -720116
4655 -720116 -740963 -746962 -744703 -738358 -743670 -734818 -722849 -738799 -735183 -730634 -745120 -725729 -713371
4642 -713371 -707523 -691806 -712041 -738463 -724273 -700523 -684409 -651331 -668628 -708666 -732846 -737779
4630 -737779 -752755 -758661 -772718 -762281 -729083 -713259 -710515 -723605 -740994 -744122 -740331 -742790 -732863
4617 -732863 -724985 -714214 -700941 -705285 -705576 -701192 -728331 -738035 -717258 -714839 -725099 -728716 -726490
4604 -726490 -722241 -737114 -749436 -730543 -721588 -722811 -702301 -702116 -697862 -695670 -700963 -700385 -709728 -706287
4590 -706287 -703085 -723054 -724914 -732778 -737704 -741249 -738709 -730619 -726998 -729117 -737414 -758005 -759846 -734371
4576 -734371 -714838 -724798 -749979 -755629 -743814 -719713 -696424 -685125 -680102 -703406 -733720 -740447
$$ packed form
4668g43056J6073o062j2932k2321Q914J9410p169R4J9112l022q836K3289l610
4655g20116k0847n999K259O345n312Q852J1969j5950L616M549j4486J9391J2358
4642g13371N848J5717k0235k6422J4190K3750J6114L3078j7297m0038k4180m933
4630g37779j4976n906j4057J0437L3198J5824K744j3090j7389l128L791k459R927
4617g32863P878J0771J3273m344k91M384k7139r704K0777K419j0260l617K226
4604g26490M249j4873j2322J8893Q955j223K0510J85M254K192n293N78r343L441
4590g06287L202j9969j860p864m926l545K540Q090L621k119q297k0591j841K5475
4576g34371J9533r960k5181n650J1815K4101K3289J1299N023k3304l0314o727
$$ plain form
4564 -740447 -733478 -731701 -718469 -719170 -725376 -724730 -734682 -726911 -713842 -733776 -742404 -729758 -719892 -728575
4550 -728575 -725789 -725234 -722197 -722598 -734655 -750340 -753751 -743163 -730791 -732574 -719216 -687750 -691937
4537 -691937 -694557 -695625 -706303 -700413 -702942 -696077 -705088 -718570 -709713 -709449 -687567 -686019 -703942 -716551
4523 -716551 -725163 -733383 -746075 -733265 -698068 -683833 -674176 -673735 -691722 -711261 -720623 -714152 -719020
4510 -719020 -723411 -711502 -723271 -719677 -695985 -699918 -697242 -696670 -706416 -732312 -736793 -716564 -726813
4497 -726813 -724248 -707245 -684174 -672531 -678291 -673747 -687324 -707908 -716195 -726206 -727298 -727665 -708236
4484 -708236 -690886 -706348 -710917 -694650 -699257 -678437 -661246 -670580 -678826 -668996 -664649 -674352 -684439
4471 -684439 -680842 -671772 -671789 -685592 -686784 -678263 -695102 -707596 -702615 -712413 -721318 -708113 -695101 -682977
$$ packed form
4564g40447O969J777J3232p01o206O46r952P771J3069j9934q628J2646R866q683
4550g28575K786N55L037m01j2057j5685l411J0588J2372j783J3358L1466m187
4537f91937k620j068j0678N890k529O865r011j3482Q857K64K1882J548j7923j2609
4523g16551q612q220j2692J2810L5197J4235R657M41j7987j9539r362O471m868
4510g19020m391J1909j1769L594K3692l933K676N72r746k5896m481K0229j0249
4497g26813K565J7003K3071J1643n760M544j3577k0584q287j0011j092l67J9429
4484g08236J7350j5462m569J6267m607K0820J7191r334q246R830M347r703j0087
4471f84439L597R070j7j3803j192Q521j6839j2494M981r798q905J3205J3012J2124
$$ plain form
4457 -682977 -692183 -715530 -703168 -688487 -691268 -694004 -673480 -659392 -658059 -673288 -686593 -692800 -691890
4444 -691890 -689910 -701448 -692924 -688164 -687198 -708846 -703936 -700031 -694655 -696783 -700280 -701572 -689876 -672801
4430 -672801 -670099 -699670 -713793 -703404 -689546 -686568 -692163 -699721 -715023 -720736 -709596 -695370 -686147
4417 -686147 -709436 -699045 -659760 -644977 -661711 -688328 -685880 -680565 -682584 -688241 -702651 -710201 -707073
4404 -707073 -691781 -671145 -678066 -710842 -722420 -705892 -706827 -704918 -713974 -711594 -705844 -694077 -686489
4391 -686489 -691434 -690601 -675795 -665036 -689342 -696316 -692999 -703882 -724061 -724972 -701119 -671845 -638912
4378 -638912 -631105 -640385 -651430 -676458 -695277 -687619 -699261 -686294 -678392 -692270 -693252 -708174 -725695
4365 -725695 -713117 -726409 -729038 -717016 -703291 -697648 -713344 -719327 -732872 -722210 -690570 -687587
$$ packed form
4457f82977r206k3347J2362J4681k781k736K0524J4088J333j5229j3305o207R10
4444f91890J980j1538Q524M760R66k1648M910L905N376k128l497j292J1696J7075
4430f72801K702k9571j4123J0389J3858K978n595p558j5302n713J1140J4226R223
4417f86147k3289J0391L9285J4783j6734k6617K448N315k019n657j4410p550L128
4404g07073J5292K0636o921l2776j1578J6528r35J909r056K380N750J1767P588
4391f86489m945Q33J4806J0759k4306o974L317j0883k0179r11K3853K9274L2933
4378f38912P807r280j1045k5028j8819P658j1642J2967P902j3878r82j4922j7521
4365g25695J2578j3292k629J2022J3725N643j5696n983j3545J0662L1640K983
$$ plain form
4353 -687587 -688847 -680107 -691670 -695497 -718440 -729845 -726849 -715346 -693626 -679585 -689681 -700431
4341 -700431 -710826 -694048 -681504 -682501 -676837 -660942 -658452 -663291 -671445 -693963 -695584 -690271 -688558
4328 -688558 -662668 -651157 -666120 -697546 -708964 -699178 -700689 -698292 -683315 -664791 -653540 -669194
4316 -669194 -678017 -679057 -675596 -671673 -659953 -630745 -648012 -664643 -674124 -673954 -695430 -686818 -691480
4303 -691480 -701708 -690635 -691761 -682875 -679981 -650949 -642103 -653221 -677130 -691264 -707761 -699115 -678185
4290 -678185 -677136 -686762 -699847 -705482 -684426 -690870 -700546 -690331 -678262 -656950 -658234 -652709 -669045
4277 -669045 -682133 -677110 -696029 -711512 -701694 -701942 -706354 -702910 -676458 -661216 -660373 -656322 -671925
4264 -671925 -668783 -668100 -660106 -632887 -633019 -643357 -667526 -687909 -679039 -689410 -680883 -666243 -667174 -670142
$$ packed form
4353f87587j260Q740j1563l827k2943j1405K996J1503K1720J4041j0096j0750
4341g00431j0395J6778J2544r97N664J5895K490m839q154k2518j621N313J713
4328f88558K5890J1511j4963l1426j1418R786j511K397J4977J8524J1251j5654
4316f69194q823j040L461L923J1720K9208j7267j6631r481J70k1476Q612m662
4303f91480j0228J1073j126Q886K894K9032Q846j1118k3909j4134j6497Q646K0930
4290f78185J049r626j3085n635K1056o444r676J0215J2069K1312j284N525j6336
4277f69045j3088N023j8919j5483R818k48m412L444K6452J5242Q43M051j5603
4264f71925L142O83P994K7219j32j0338k4169k0383Q870j0371Q527J4640r31k968
$$ plain form
4250 -670142 -669070 -674143 -660333 -657978 -680526 -685984 -668914 -676180 -681169 -666668 -670844 -676745 -680834
4237 -680834 -679922 -677548 -679974 -694845 -703530 -711435 -699943 -686596 -689185 -702957 -714159 -699564 -677881
4224 -677881 -684286 -675964 -659263 -657932 -668746 -684207 -682632 -682473 -684223 -688436 -681925 -685749 -681943 -691532
4210 -691532 -676848 -678472 -677518 -680279 -673162 -676595 -693381 -701132 -701794 -701046 -688095 -682331 -700992 -715471
4196 -715471 -698496 -692775 -688109 -675448 -672332 -680871 -687073 -692576 -706213 -711679 -697820 -691646 -678426
4183 -678426 -667019 -665059 -671091 -670596 -682524 -703887 -686834 -672776 -656020 -648513 -644060 -661868 -684532
4170 -684532 -684165 -683513 -675756 -665602 -672528 -687099 -692959 -690072 -694396 -687796 -683674 -674641 -677205 -658093
4156 -658093 -651013 -659297 -673832 -689134 -664257 -652783 -648255 -648260 -646542 -645153 -663230 -649688 -651296 -668732
$$ packed form
4250f70142J072n073J3810K355k2548n458J7070p266m989J4501m176n901m089
4237f80834R12K374k426j4871q685p905J1492J3347k589j3772j1202J4595K1683
4224f77881o405Q322J6701J331j0814j5461J575J59j750m213O511l824L806r589
4210f91532J4684j624R54k761P117l433j6786p751o62P48J2951N764j8661j4479
4196g15471J6975N721M666J2661L116q539o202n503j3637n466J3859O174J3220
4183f78426J1407J960o032M95j1928k1363J7053J4058J6756P507M453j7808k2664
4170f84532L67O52P757J0154o926j4571n860K887m324O600M122R033k564J9112
4156f58093P080q284j4535j5302K4877J1474M528nJ718J389j8077J3542j608j7436
$$ plain form
4142 -668732 -673545 -672025 -679665 -683080 -687826 -670966 -667377 -677432 -661380 -681906 -689117 -691080 -679717
4129 -679717 -666789 -649981 -622709 -615627 -625417 -655412 -659304 -640927 -623819 -628633 -633165 -639625 -652580
4116 -652580 -656161 -656385 -665867 -663251 -657854 -645378 -663518 -662858 -665276 -656712 -644986 -654849 -654451 -668960
4102 -668960 -661605 -637907 -632316 -635165 -644442 -657433 -673123 -676448 -683024 -673908 -673791 -677546 -681281 -679886
4088 -679886 -682579 -693075 -678927 -662602 -660125 -663206 -670497 -677520 -679705 -668229 -650008 -630693 -620639
4075 -620639 -627517 -657280 -684391 -689260 -689384 -668802 -657151 -651740 -648475 -665184 -675023 -683999 -673239
4062 -673239 -652383 -634468 -639452 -644433 -653646 -655440 -638685 -637432 -633779 -636393 -643562 -644570 -651022 -665799
4048 -665799 -673398 -663834 -667785 -680398 -664128 -648880 -651023 -654443 -644042 -642809 -657605 -666806 -688650
$$ packed form
4142f68732m813J520p640l415m746J6860L589j0055J6052k0526p211j963J1363
4129f79717J2928J6808K7272P082r790k9995l892J8377J7108m814m532o460j2955
4116f52580l581k24r482K616N397J2476j8140O60k418Q564J1726r863L98j4509
4102f68960P355K3698N591k849r277j2991j5690l325o576R116J17l755l735J395
4088f79886k693j0496J4148J6325K477l081p291p023k185J1476J8221J9315J0054
4075f20639o878k9763k7111m869j24K0582J1651N411L265j6709r839q976J0760
4062f73239K0856J7915m984m981r213j794J6755J253L653k614p169j008o452j4777
4048f65799p599R564l951j2613J6270J5248k143l420J0401J233j4796r201k1844
$$ plain form
4035 -688650 -683856 -669390 -652545 -646749 -640037 -642808 -673613 -679872 -665604 -656710 -644327 -641862 -660359
4022 -660359 -649121 -641008 -635509 -642117 -658621 -657891 -642542 -639818 -641564 -637689 -634935 -633136 -637545 -642048
4008 -642048 -657346 -664275 -671268 -679478 -684847 -686112 -686246 -659919 -662460 -649465 -639201 -647034 -661386
3995 -661386 -670378 -664158 -648525 -651923 -677528 -675457 -671586 -670764 -666102 -677120 -664513 -653432 -640994
3982 -640994 -634764 -624598 -637708 -633114 -634660 -654867 -652314 -635755 -624008 -626138 -647623 -654689 -652110
3969 -652110 -655083 -660514 -650748 -636909 -642178 -643214 -654775 -687114 -697266 -677875 -658597 -644675 -636993
3956 -636993 -637579 -630018 -619427 -638564 -654301 -656852 -645982 -640365 -644387 -643582 -639676 -625477 -617994 -645849
3942 -645849 -662579 -667057 -662883 -665010 -657362 -662536 -653359 -653398 -652317 -650133 -645744 -656386 -659026 -648321
$$ packed form
4035f88650M794J4466J6845N796O712k771l0805o259J4268Q894J2383K465j8497
4022f60359J1238Q113N499o608j6504P30J5349K724j746L875K754J799m409m503
4008f42048j5298o929o993q210n369j265j34K6327k541J2995J0264p833j4352
3995f61386q992O220J5633l398k5605K071L871Q22M662j1018J2607J1081J2438
3982f40994O230J0166j3110M594j546k0207K553J6559J1747k130k1485p066K579
3969f52110k973n431R766J3839n269j036j1561l2339j0152J9391J9278J3922P682
3956f36993n86P561J0591j9137j5737k551J0870N617m022Q05L906J4199P483k7855
3942f45849j6730m478M174k127P648n174R177l9J081K184M389j0642k640J0705
$$ plain form
3928 -648321 -634307 -611453 -615219 -615491 -627808 -638108 -637343 -653194 -654287 -669717 -669975 -659984 -664706 -658427
3914 -658427 -644052 -624014 -617162 -596314 -611864 -637844 -651343 -655377 -663887 -676298 -668384 -655310
3902 -655310 -653067 -645361 -638495 -621194 -624902 -648485 -655802 -637576 -629891 -631214 -637634 -650838 -648340
3889 -648340 -649496 -644872 -653125 -666853 -672135 -658482 -649292 -629037 -634417 -648470 -646992 -628001 -614469
3876 -614469 -619406 -623190 -632532 -637769 -644200 -630733 -621763 -615077 -624483 -634339 -629886 -627730 -641637 -659459
3862 -659459 -647022 -642491 -635462 -625476 -629992 -630369 -645361 -655953 -641932 -634491 -622113 -620178 -616721
3849 -616721 -607519 -599057 -608358 -624808 -639996 -642098 -636035 -618163 -636484 -644028 -631303 -644011 -652306
3836 -652306 -671861 -674381 -635865 -619612 -613314 -621132 -627859 -638101 -630586 -630139 -637752 -662994 -664054
$$ packed form
3928f48321J4014K2854l766k72j2317j0300P65j5851j093j5430k58R991m722O279
3914f58427J4375K0038O852K0848j5550k5980j3499m034q510j2411P914J3074
3902f55310K243P706O866J7301l708k3583p317J8226P685j323o420j3204K498
3889f48340j156M624q253j3728n282J3653R190K0255n380j4053J478J8991J3532
3876f14469m937l784r342n237o431J3467Q970O686r406r856M453K156j3907j7822
3862f59459J2437M531P029R986m516l77j4992j0592J4021P441J2378J935L457
3849f16721R202Q462r301j6450j5188k102O063J7872j8321p544J2725j2708q295
3836f52306j9555k520L8516J6253O298p818o727j0242P515M47p613k5242j060
$$ plain form
3823 -664054 -636197 -624915 -623432 -633884 -629919 -623175 -630644 -645858 -620138 -603485 -595534 -612302 -627740
3810 -627740 -618468 -613007 -615495 -619576 -611839 -623658 -622951 -627394 -617674 -596980 -605215 -625348 -639125 -629763
3796 -629763 -634726 -633421 -594625 -594274 -590102 -603325 -626628 -625671 -610305 -600762 -601835 -590028 -596147 -616556
3782 -616556 -616639 -622803 -626345 -613470 -612417 -632430 -633027 -631606 -615341 -621673 -612629 -615569 -631116 -631093 -627603
3767 -627603 -641157 -628472 -623482 -611572 -601272 -623580 -629641 -620019 -601277 -616077 -628598 -612839
3755 -612839 -607930 -601831 -607714 -609546 -610035 -615451 -616860 -628617 -630903 -620918 -599309 -599454 -635062 -667286
3741 -667286 -665047 -642352 -639711 -636343 -640982 -641279 -624496 -618573 -630440 -617831 -606374 -623985 -636221
3728 -636221 -648272 -652908 -651511 -669457 -661885 -635414 -622818 -632395 -623676 -608714 -605663 -624504 -634156
$$ packed form
3823f64054K7857J1282J483j0452L965O744p469j5214K5720J6653P951j6768j5438
3810f27740R272N461k488m081P737j1819P07m443R720K0694q235k0133j3777R362
3796f29763m963J305L8796L51M172j3223k3303R57J5366R543j073J1807o119k0409
3782f16556q3o164l542J2875J053k0013n97J421J6265o332R044k940j5547K3L490
3767f27603j3554J2685M990J1910J0300k2308o061R622J8742j4800j2521J5759
3755f12839M909O099n883j832m89n416j409j1757k286R985K1609j45l5608l2224
3741f67286K239K2695K641L368m639k97J6783N923j1867J2609J1457j7611j2236
3728f36221j2051m636J397j7946P572K6471J2596r577Q719J4962L051j8841r652
$$ plain form
3715 -634156 -641845 -646234 -644597 -645374 -651354 -637508 -631714 -633289 -639112 -637917 -625667 -612799 -605838 -611592
3701 -611592 -599488 -586852 -574475 -581162 -591726 -590966 -611375 -622629 -621835 -618160 -610159 -603573 -601900
3688 -601900 -616770 -627954 -622742 -609317 -613152 -637962 -648613 -611414 -601548 -608627 -615223 -628748 -618683
3675 -618683 -616238 -632244 -644640 -625978 -619797 -635416 -609266 -585542 -586714 -601959 -618114 -612573
3663 -612573 -605922 -609089 -616267 -616525 -597932 -611811 -632948 -640949 -650131 -634204 -639802 -636141 -645168 -641115
3649 -641115 -640407 -617879 -611210 -619151 -621569 -620053 -621840 -608783 -616087 -624569 -622241 -603743 -596395 -598743
3635 -598743 -602123 -592957 -600838 -615649 -609619 -591550 -570660 -577061 -575001 -594922 -606931 -599951 -588006
3622 -588006 -577856 -574382 -584474 -587402 -606370 -609909 -604433 -601706 -602890 -607977 -614487 -610073 -603277 -598326
$$ packed form
3715f34156p689m389J637p77n980J3846N794j575n823J195J2250J2868O961n754
3701f11592J2104J2636J2377o687j0564P60k0409j1254P94L675Q001O586J673
3688f01900j4870j1184N212J3425l835k4810j0651L7199R866p079o596j3525J0065
3675f18683K445j6006j2396J8662O181j5619K6150K3724j172j5245j6155N541
3663f12573O651l167p178k58J8593j3879k1137q001r182J5927n598L661r027M053
3649f41115P08K2528O669p941k418J516j787J3057p304q482K328J8498P348k348
3635e98743l380R166p881j4811O030J8069K0890o401K060j9921j2009O980J1945
3622e88006J0150L474j0092k928j8968l539N476K727j184n087o510M414O796M951
$$ plain form
3608 -598326 -605336 -614757 -609942 -600192 -585021 -581943 -589836 -578783 -571295 -559334 -564717 -602497 -613315
3595 -613315 -606248 -609910 -624722 -630598 -638799 -625826 -610661 -601594 -625836 -634705 -638435 -636198 -608827
3582 -608827 -594445 -597907 -610584 -613381 -619617 -615165 -622109 -625254 -623830 -623902 -612629 -608618 -615614 -626619
3568 -626619 -624231 -625413 -608296 -607471 -596837 -562744 -561949 -579628 -592400 -605133 -609183 -587156 -597252
3555 -597252 -629634 -628706 -610522 -595607 -586144 -592274 -603576 -587638 -592436 -611351 -624418 -641543 -659027
3542 -659027 -644358 -638523 -631542 -630461 -617266 -628456 -642165 -629121 -632081 -625942 -609405 -602006 -605173
3529 -605173 -605789 -594894 -595914 -581943 -595883 -622101 -632920 -632261 -638882 -635471 -624169 -599143 -592327
3516 -592327 -573238 -585735 -610129 -620243 -609375 -597916 -611126 -597090 -607727 -633185 -631353 -641295
$$ packed form
3608e98326p010r421M815R750J5171L078p893J1053P488J1961n383l7780j0818
3595f13315P067l662j4812n876q201J2973J5165R067k4242q869l730K237K7371
3582f08827J4382l462j2677k797o236M452o944l145J424p2J1273M011o996j1005
3568f26619K388j182J7117Q25J0634L4093P95j7679j2772j2733m050K2027j0096
3555e97252l2382R28J8184J4915R463o130j1302J5938m798j8915j3067j7125j7484
3542f59027J4669N835O981J081J3195j1190j3709J3044k960O139J6537P399l167
3529f05173o16J0895j020J3971j3940k6218j0819O59o621L411J1302K5026O816
3516e92327J9089j2497k4394j0114J0868J1459j3210J4036j0637k5458J832r942
$$ plain form
3504 -641295 -639848 -614621 -605305 -594988 -592646 -582122 -582495 -608223 -620133 -609717 -592506 -594490 -585900
3491 -585900 -580121 -578032 -579396 -598297 -593645 -582939 -562417 -572531 -598101 -584744 -572762 -566733 -562007
3478 -562007 -564437 -571330 -569065 -570610 -573695 -580537 -585463 -596139 -617242 -619892 -611451 -609058 -611577 -608204
3464 -608204 -602708 -611751 -630618 -626435 -616943 -614054 -613935 -601665 -604177 -597539 -581300 -598288 -613472
3451 -613472 -598901 -594216 -585094 -577117 -576055 -566366 -575476 -589644 -586733 -593944 -582550 -590172 -592817 -583373
3437 -583373 -560995 -579954 -592817 -592155 -587510 -586230 -585598 -601889 -602133 -590271 -589422 -581667 -603277 -607940
3423 -607940 -591550 -590856 -587415 -583757 -577761 -588847 -608869 -617776 -590180 -563634 -569913 -590768 -608436
$$ packed form
3504f41295J447K5227R316J0317K342J0524l73k5728j1910J0416J7211j984Q590
3491e85900N779K089j364j8901M652J0706K0522j0114k5570J3357J1982O029M726
3478e62007k430o893K265j545l085o842m926j0676k1103k650Q441K393k519L373
3464f08204N496r043j8867M183R492K889J19J2270k512O638J6239j6988j5184
3451f13472J4571M685R122P977J062R689r110j4168K911p211J1394p622k645R444
3437e83373K2378j8959j2863O62M645J280O32j6291k44J1862Q49P755k1610m663
3423f07940J6390O94L441L658N996j1086k0022q907K7596K6546o279k0855j7668
$$ [...]
##END NTUPLES=NMR SPECTRUM
##END=
