##TITLE=Analysis number 330298
Compound Code ac 14674
Project Code adrs
Chemist Name apollo sci
##JCAMPDX= 6.0         $$ Bruker NMR JCAMP-DX V2.0
##DATA TYPE= NMR SPECTRUM
##DATA CLASS= NTUPLES
##ORIGIN= Bruker BioSpin GmbH
##OWNER= nmr
$$ XWIN-NMR		Version 3.5
$$ Wed Nov 14 13:21:59 2007 GMT Standard Time (UT+0h)  MAYBRIDGE\nmr@NMR_250MHZ
##.OBSERVE FREQUENCY= 250.131544655141
##.OBSERVE NUCLEUS= ^1H
##.ACQUISITION MODE= SIMULTANEOUS (DQD)
##.ACQUISITION SCHEME= undefined
##.AVERAGES= 16
##.DIGITISER RES= 18
##SPECTROMETER/DATA SYSTEM= dpx250
##.PULSE SEQUENCE= zg30
##.SOLVENT NAME= DMSO
##.SHIFT REFERENCE= (INTERNAL, DMSO, 0, 16.522)
##AUDIT TRAIL= $$ (NUMBER, WHEN, WHO, WHERE, WHAT)
$$ ##TITLE= Audit trail, XWIN-NMR		Version 3.5
$$ ##JCAMPDX= 5.01
$$ ##ORIGIN= Bruker BioSpin GmbH
$$ ##OWNER= nmr
$$ C:\u/data/dgb/nmr/ADRS/690/pdata/1/auditp.txt
$$ ##AUDIT TRAIL=  $$ (NUMBER, WHEN, WHO, WHERE, WHAT)
(   1,<2007-11-14 13:21:28.65 +000>,<MAYBRIDGE\nmr>,<NMR_250MHZ>,
      <created by zg, POWCHK disabled, PULCHK disabled
       configuration hash MD5:
       76 6E 9A 78 1E 09 19 81 EC 84 63 8F B0 6A 59 2D
       data hash MD5: 64K
       51 D8 DD D2 EC 91 77 8A 4C 94 F2 ED CC 5C CF E8>)
(   2,<2007-11-14 13:21:48.22 +000>,<MAYBRIDGE\nmr>,<NMR_250MHZ>,
      <Start of raw data processing
       ef LB = 0.3 FT_mod = 6 PKNL = 1 SI = 32K 
       data hash MD5: 32K
       2E CC 57 D5 5D 45 85 78 64 47 1A 26 13 2F 1F AB>)
(   3,<2007-11-14 13:21:50.33 +000>,<MAYBRIDGE\nmr>,<NMR_250MHZ>,
      <apk 
       data hash MD5: 32K
       C8 5C 3A 2D 62 AA B0 C2 58 2C 6D 1E D4 11 92 61>)
(   4,<2007-11-14 13:21:51.16 +000>,<MAYBRIDGE\nmr>,<NMR_250MHZ>,
      <abs ABSG = 5 
       data hash MD5: 32K
       DC 5B 2D 76 D1 95 45 65 DE 52 A0 C3 44 DF 3E 3D>)
$$ ##END=
$$ 
$$ hash MD5
$$ 4F 0A 1B EE 7E A8 58 6E 40 45 4C 38 26 47 0E D1
##$RELAX= 
##$RELAX= 
##$RELAX= 
##$RELAX= 
##$RELAX= 
##$RELAX= 
##$RELAX= 
$$ Bruker specific parameters
$$ --------------------------
##$DU= <C:\u>
##$EXPNO= 690
##$NAME= <ADRS>
##$PROCNO= 1
##$TYPE= <nmr>
##$USER= <dgb>
##$AMP= (0..31)
100 100 100 100 100 100 100 100 100 100 100 100 100 100 100 100 100 100 
100 100 100 100 100 100 100 100 100 100 100 100 100 100 
##$AQSEQ= 0
##$AQ_mod= 3
##$AUNM= <au_zg>
##$AUTOPOS= <30 >
##$BF1= 250.13
##$BF2= 250.13
##$BF3= 250.13
##$BF4= 250.13
##$BF5= 500.13
##$BF6= 500.13
##$BF7= 500.13
##$BF8= 500.13
##$BYTORDA= 1
##$CFDGTYP= 0
##$CFRGTYP= 5
##$CHEMSTR= <none>
##$CNST= (0..31)
1 1 145 1 1 1 1 1 1 1 1 1 1 1 1 1 1 1 1 1 1 1 1 1 1 1 1 1 1 1 1 1 
##$CPDPRG= <>
##$CPDPRG1= <>
##$CPDPRG2= <>
##$CPDPRG3= <>
##$CPDPRG4= <mlev>
##$CPDPRG5= <mlev>
##$CPDPRG6= <mlev>
##$CPDPRG7= <mlev>
##$CPDPRG8= <mlev>
##$CPDPRGB= <>
##$CPDPRGT= <>
##$D= (0..31)
0 1 0 0 0 0 0 0 0 0.06 0 0 0 0 0 0 0.0002 0 0 0 0 0 0 0 0 0 0 0 0 0 0 
0 
##$DATE= 1195046485
##$DBL= (0..7)
120 120 120 120 120 120 120 120 
##$DBP= (0..7)
150 150 150 150 150 150 150 150 
##$DBP07= 0
##$DBPNAM0= <>
##$DBPNAM1= <>
##$DBPNAM2= <>
$$ [...]
##$SUBNAM7= <"">
##$SUBNAM8= <"">
##$SUBNAM9= <"">
##$SW= 20.6930455092707
##$SWIBOX= (0..15)
0 0 3 0 0 0 0 0 0 0 0 0 0 0 0 0 
##$SW_h= 5175.983436853
##$TD= 65536
##$TD0= 1
##$TE= 295.16
##$TE2= 300
##$TE3= 300
##$TEG= 300
##$TL= (0..7)
0 120 120 120 120 120 120 120 
##$TP= (0..7)
150 150 150 150 150 150 150 150 
##$TP07= 0
##$TPNAME0= <>
##$TPNAME1= <>
##$TPNAME2= <>
##$TPNAME3= <>
##$TPNAME4= <>
##$TPNAME5= <>
##$TPNAME6= <>
##$TPNAME7= <>
##$TPOAL= (0..7)
0.5 0.5 0.5 0.5 0.5 0.5 0.5 0.5 
##$TPOFFS= (0..7)
0 0 0 0 0 0 0 0 
##$TUNHIN= 0
##$TUNHOUT= 0
##$TUNXOUT= 0
##$USERA1= <user>
##$USERA2= <user>
##$USERA3= <user>
##$USERA4= <user>
##$USERA5= <user>
##$V9= 5
##$VALIST= <valist>
##$VCLIST= <CCCCCCCCCCCCCCC>
##$VD= 0
##$VDLIST= <DDDDDDDDDDDDDDD>
##$VPLIST= <PPPPPPPPPPPPPPP>
##$VTLIST= <TTTTTTTTTTTTTTT>
##$WBST= 1024
##$WBSW= 4
##$XGAIN= (0..3)
0 0 0 0 
##$XL= 0
##$YL= 0
##$YMAX_a= 229852
##$YMIN_a= -477748
##$ZGOPTNS= <>
##$ZL1= 120
##$ZL2= 120
##$ZL3= 120
##$ZL4= 120
##$ABSF1= 16.522
##$ABSF2= -4.171173
##$ABSG= 5
##$ABSL= 3
##$ALPHA= 0
##$AQORDER= 0
##$ASSFAC= 0
##$ASSFACI= 0
##$ASSFACX= 0
##$ASSWID= 0
##$AUNMP= <proc_1d>
##$AZFE= 0.1
##$AZFW= 0.1
##$BCFW= 0
##$BC_mod= 0
##$BYTORDP= 0
##$COROFFS= 0
##$CY= 12.5
##$DATMOD= 1
##$DC= 0
##$DFILT= <>
##$DTYPP= 0
##$F1P= 14.0000005364418
##$F2P= -0.99999901652339
##$FCOR= 0.5
##$FTSIZE= 32768
##$FT_mod= 6
##$GAMMA= 0
##$GB= 0
##$INTBC= 1
##$INTSCL= 1
##$ISEN= 128
##$LB= 0.3
##$LEV0= 0
##$LPBIN= 0
##$MAXI= 10000
##$MC2= 0
##$MEAN= 0
##$ME_mod= 0
##$MI= 0
##$NCOEF= 0
##$NC_proc= -5
##$NLEV= 6
##$NOISF1= 0
##$NOISF2= 0
##$NSP= 0
##$NTH_PI= 0
##$NZP= 0
##$OFFSET= 16.522
##$PC= 1
##$PHC0= 156.9947
##$PHC1= 22.60161
##$PH_mod= 1
##$PKNL= yes
##$PPARMOD= 0
##$PSCAL= 4
##$PSIGN= 0
##$REVERSE= no
##$SF= 250.13
##$SI= 32768
##$SIGF1= 0
##$SIGF2= 0
##$SINO= 400
##$SIOLD= 32768
##$SREGLST= <1H.DMSO>
##$SSB= 0
##$STSI= 32768
##$STSR= 0
##$SW_p= 5175.98343685301
##$SYMM= 0
##$S_DEV= 0
##$TDeff= 65536
##$TDoff= 0
##$TI= <Analysis number 999999
Compound Code 99
Book Reference 9
Project Code 9>
##$TILT= no
##$TM1= 0
##$TM2= 0
##$TOPLEV= 0
##$USERP1= <user>
##$USERP2= <user>
##$USERP3= <user>
##$USERP4= <user>
##$USERP5= <user>
##$WDW= 1
##$XDIM= 32768
##$YMAX_p= 532834216
##$YMIN_p= -3327660
$$ End of Bruker specific parameters
$$ ---------------------------------
##NTUPLES= NMR SPECTRUM
##VAR_NAME=  FREQUENCY,     SPECTRUM/REAL,   SPECTRUM/IMAG
##SYMBOL=    X,             R,               I
##VAR_TYPE=  INDEPENDENT,   DEPENDENT,       DEPENDENT
##VAR_FORM=  AFFN,          ASDF,            ASDF
##VAR_DIM=   32768,         32768,           32768
##UNITS=     HZ,            ARBITRARY UNITS, ARBITRARY UNITS
##FACTOR=    0.157963299565203, 1,           1
##FIRST=     4132.6476996994, 0,             0
##LAST=      -1043.33573715361, 0,           0
##MIN=       -1043.33573715361, -3327660,    0
##MAX=       4132.6476996994, 532834216,     0
$$ Real data points
##PAGE= N=1
##DATA TABLE= (X++(R..R)), XYDATA
$$ [...]
$$ plain form
15611 31378 245004 278005 213961 102812 -95682 -259109 -192986 -138150 -86617 -1142 -8319
15600 -8319 -70016 -40452 -53738 -45979 12038 53143 30565 -5317 -121168 -67391 -81850 -91867
15588 -91867 -107809 -117397 -29960 -4188 90027 249089 37435 -134209 -125712 -54473 8539
15577 8539 99758 37706 6135 -28361 74571 167463 142116 208120 144755 97683 -89444
15566 -89444 -180327 145245 190035 21647 994 -44194 -222397 -176996 -176166 -134322 -96342
15555 -96342 -68813 -8850 92316 36727 -193053 -358172 -356238 -155963 4221 205603 86914
15544 86914 -187102 -180081 -140976 -226373 -181254 -73035 25536 71009 107000 77146 46878
15533 46878 243855 249200 114912 -80726 -258574 -257017 -155139 51027 12803 -77310 66252
$$ packed form
15611C1378K13626L3001o4044j11149j98494j63427O6123N4836N1533Q5475p177
15600h319o1697K9564j3286P759N8017M1105k2578l5882j15851N3777j4459j0017
15588i1867j5942r588Q7437K5772R4215J59062k11654j71644Q497P1239O3012
15577H539R1219o2052l1571l4496J02932R2892k5347O6004o3365m7072j87127
15566h9444r0883L25572M4790j68388k0653m5188j78203M5401Q30M1844L7980
15555i6342K7529N9963J01166n5589k29780j65119J934K00275J60184K01382j18689
15544H6914k74016P021L9105q5397M5119J08219R8571M5473L5991k9854l0268
15533D6878J96977N345j34288j95638j77848J557J01878K06166l8224r0113J43562
$$ plain form
15522 66252 -130319 -322485 -323220 -260515 -355576 -374373 -437766 -240494 -223497 -207357 -217426
15511 -217426 -205361 -237577 -38223 58237 148638 336109 492945 403408 84868 -311525
15501 -311525 -606623 -692517 -475481 -255950 -261742 -144457 -38552 -279910 -328402 -283715
15491 -283715 -174056 -125051 -111661 -187013 -302290 -332517 -259561 -198430 -144898 123224 110796
15480 110796 -103641 -67328 122181 202452 98319 -73969 -234392 -325241 -281220 -317793
15470 -317793 -479463 -382869 -106675 -147694 -84842 -10107 -73693 -138772 -198011 -234124 -334821
15459 -334821 -251944 -73574 -190690 -222354 -187683 -76835 47466 205384 221313 163666
15449 163666 177358 121317 -16168 81148 175275 234803 340437 184934 147337 6622 -23552
$$ packed form
15522F6252j96571j92166p35O2705r5061j8797o3393J97272J6997J6140j0069
15511b17426J2065l2216J99354R6460R0401J87471J56836q9537l18540l96393
15501c11525k95098q5894K17036K19531n792J17285J05905k41358m8492M4687
15491b83715J09659M9005J3390p5352j15277l0227P2956O1131N3532K68122j2428
15480A10796k14437L6313J89509Q0271j04133j72288j60423r0849M4021l6573
15470c17793j61670R6594K76194m1019O2852P4735o3586o5079n9239l6113j00697
15459c34821Q2877J78370j17116l1664L4671J10848J24301J57918J5929n7647
15449A63666J3692n6041j37485R7316R4127N9528J05634j55503l7597j40715l0174
$$ plain form
15438 -23552 -2564 13674 -83252 66482 148032 94163 -9581 -102403 -26752 62523 158101
15427 158101 199993 252411 135898 -21190 -13201 47734 -53909 -60853 -10581 -125766 -308527
15416 -308527 -205048 -334584 -544654 -349978 -135080 -21442 -72058 -66487 13908 70299
15406 70299 -39980 -286922 -269928 -11794 46658 1315 17401 -28896 -31099 -37197 -2303
15395 -2303 119072 112024 2765 -200155 -93869 -40166 67955 165800 -41011 -120589 -22397
15384 -22397 -66677 -18836 11454 103 -61654 -202912 -159319 -176735 -118251 -127269 -6440
15373 -6440 -21921 -63743 -120410 -258791 -150884 -119717 -187613 -84573 -39919 34692 69433
15362 69433 -59031 -52125 -126830 91094 30918 -144931 -241620 -143135 80610 195760 -30283
$$ packed form
15438b3552K0988J6238r6926J49734Q1550n3869j03744r2822P5651Q9275R5578
15427A58101M1892N2418j16513j57088P989O0935j01643o944N0272j15185j82761
15416c08527J03479j29536k10070J94676K14898J13638n0616N571Q0395N6391
15406G0299j10279k46942J6994K58134N8452m5343J6086m6297k203o098L4894
15395b303J21375p048j09259k02920J06286N3703J08121R7845k06811p9578R8192
15384b2397m4280M7841L0290j1351o1757j41258M3593j7416N8484r018J20829
15373f440j5481m1822n6667j38381J07907L1167o7896J03040M4654P4611L4741
15362F9433j28464O906p4705K17924o0176j75849r6689R8485K23745J15150k26043
$$ plain form
15351 -30283 -168141 -100364 44983 65022 167722 110979 2917 -204587 -280087 -257336 -172126
15340 -172126 -63925 49627 154552 5582 -89617 -179707 -213592 -197058 -79545 -184689
15330 -184689 62950 98229 -167372 -168498 -82742 55913 -151836 -468562 -553917 -546682 -468728
15319 -468728 -274941 -168968 -88262 99106 68234 -101123 -175199 -257706 -235080 -153073 -11198
15308 -11198 -36625 -3699 102424 -60768 -100955 -158551 -164117 -112697 88891 -30393 -157756
15297 -157756 -139285 -112835 -75829 -60666 -8979 -130133 -153153 -163216 -134404 -42928 30374
15286 30374 173308 38010 -55266 -226493 -414947 -307687 -188930 -135404 -102397 -240123
15276 -240123 -332974 -370022 -434996 -347396 -179252 -131344 -197038 -110344 -21222 -24908 59487
$$ packed form
15351c0283j37858O7777J45347K0039J02700n6743j08062k07504p5500K2751Q5210
15340a72126J08201J13552J04925j48970r5199r0090l3885J6534J17513j05144
15330a84689K47639L5279k65601j126Q5756J38655k07749l16726q5355P235P7954
15319d68728J93787J05973Q0706J87368l0872j69357p4076q2507K2626Q2007J41875
15308a1198k5427L2926J06123j63192m0187n7596n566N1420K01588j19284j27363
15297a57756J8471K6450L7006J5163N1687j21154k3020j0063K8812R1476P3302
15286C0374J42934j35298r3276j71227j88454J07260J18757N3526L3007j37726
15276b40123r2851l7048o4974Q7600J68144M7908o5694Q6694Q9122l686Q4395
$$ plain form
15265 59487 -68969 -180623 -230161 -327992 -281486 -153244 -226309 -307651 -284067 -208333 -88420
15254 -88420 -224510 -321565 -414687 -340274 -220845 -261060 -308134 -265210 -345144 -291238 -134092
15243 -134092 -214530 -164812 -241896 -284591 -152648 -145664 -258025 -322550 -121320 -61645 -45029
15232 -45029 -102656 -108485 -204913 -259537 -161198 -35793 67256 133232 232106 111538 67681
15221 67681 -14006 73969 306985 264065 271157 268137 -85066 -292234 -240083 -265807 -150533
15210 -150533 -116616 -250758 -213704 -318984 -481836 -330304 -137316 -84922 -101857 59485
15200 59485 259349 336981 66160 -10315 -23449 26807 -45447 -190966 -254995 -91333 2709
15189 2709 -65517 26082 6169 -130478 -214042 -434237 -400248 -384178 -344224 -192326 -178562
$$ packed form
15265E9487j28456j11654m9538r7831M6506J28242p3065q1342K3584P5734J19913
15254h8420j36090r7055r3122P4413J19429m0215m7074M2924p9934N3906J57146
15243a34092q0438M9718p7084m2695J31943O984j12361o4525K01230N9675J6616
15232d5029n7627n829r6428n4624R8339J25405J03049O5976R8874j20568m3857
15221F7681q1687Q7975K33016m2920P092l020l53203k07168N2151k5724J15274
15210a50533L3917j34142L7054j05280j62852J51532J92988N2394j6935J61342
15200E9485J99864P7632k70821p6475j3134N0256p2254j45519o4029J63662R4042
15189B709o8226R1599j9913j36647q3564k20195L3989J6070L9954J51898J3764
$$ plain form
15178 -178562 -164324 -240463 -126417 -67943 -98777 -88930 -81893 2615 -15584 76585 131284 185648
15166 185648 155191 10942 -8375 -179786 -172564 -151957 -249107 -191405 -133585 -51892 -49633
15155 -49633 -73925 -43376 -78613 21683 -54566 -312109 -321861 -243718 -66856 -92917 -279975
15144 -279975 -528413 -648022 -655968 -582998 -481444 -455455 -453705 -260522 -154129 -106505 53846
15133 53846 117409 48262 -28511 -140063 -69358 75154 -48748 -163174 -176904 -118912 -64187
15122 -64187 -113940 -111116 51232 48721 -128547 -76068 -104152 -159034 -174345 -89912 -200917
15111 -200917 -229047 -151009 -189852 -167152 -125629 -112336 -357463 -422527 -112422 60228 30000
15100 30000 -78952 -107161 -111193 -244456 -176432 -128542 -259293 -195650 -160619 -171198 -228514
$$ packed form
15178a78562J4238p6139J14046N8474l0834R847P037Q4508j8199R2169N4699N4364
15166A85648l0457j44249j9317j71411P222K0607r7150N7702N7820Q1693K259
15155d9633k4292L0549l5237J00296p6249k57543r752P8143J76862k6061j87058
15144b79975k48438j19609p946P2970J01554K5989J750J93183J06393M7624J60351
15133E3846O3563o9147p6773j11552P0705J44512j23902j14426j3730N7992N4725
15122f4187m9753K824J62348k511j77268N2479k8084n4882j5311Q4433j11005
15111b00917k8130P8038l8843K2700M1523J3293k45127o5064L10105J72650l0228
15100C0000j08952k8209m032j33263O8024M7890j30751O3643L5031j0579n7316
$$ plain form
15089 -228514 -200329 -207687 -118300 -171401 -30339 -63532 -89763 -257539 -330921 -259100 -181959
15078 -181959 -189891 -178411 -302008 -405615 -406660 -150461 -6818 -1907 2731 -105863 -208746
15067 -208746 -112314 -123109 -82652 -17850 104048 70841 -27909 -31008 -55651 -102281 -182684
15056 -182684 -40689 179574 72496 -113167 -233153 -127215 -155917 7683 -55185 -168927
15046 -168927 -76239 -82182 -61258 153998 176188 251657 209944 113433 -5204 1692 -125732
15035 -125732 -169609 -161855 -193115 -120027 -7317 -88689 -34440 -18558 45543 144611 40497
15024 40497 -165734 -253513 -36705 -19511 -97580 -245119 -248732 -49791 61768 38274 46114
15013 46114 48243 105776 -3915 169800 297780 125238 -80158 -116991 -52632 -53225 -136468
$$ packed form
15089b28514K8185p358Q9387n3101J41062l3193k6231j67776p3382P1821P7141
15078a81959p932J1480j23597j03607j045K56199J43643M911M638j08594j02883
15067b08746R6432j0795M0457O4802J21898l3207r8750l099k4643m6630q0403
15056a82684J41995K20263j07078j85663j19986J05938k8702J63600o2868j13742
15046a68927R2688n943K0924K15256K2190P5469m1713r6511j18637O896j27424
15035a25732m3877P754l1260P3088J12710q1372N4249J5882O4101R9068j04114
15024D0497k06231q7779K16808J7194p8069j47539l613J98941J11559k3494P840
15013D6114K129N7533j09691J73715J27980j72542k05396l6833O4359n93q3243
$$ plain form
15002 -136468 -204952 -270259 -456783 -502950 -325359 -187242 -90277 -101565 -23153 117216 47188
14991 47188 224110 134926 91947 43698 74936 -76755 -171446 -126015 59431 126278 104288
14980 104288 -1609 -69272 -210754 -148506 79941 255525 184774 249293 184111 -9620
14970 -9620 -117099 -52667 -98192 -102687 -102758 -263527 -213104 -88512 -84707 -35259 -89482 710
14958 710 252771 358417 207901 79198 80432 158106 67512 -38013 -204715 -285398 -276063
14947 -276063 -288355 -246990 -256230 -288500 -121903 -76568 -68700 43234 135605 98859 8937
14936 8937 -91034 -163949 -274704 -213115 -178141 -216241 -131679 -83930 -165178 -74240 -65508 -187120
14924 -187120 -150779 -150144 -59248 68277 44427 -141487 -231682 -187787 -193521 -315258 -283682
$$ packed form
15002a36468o8484o5307j86524m6167J77591J38117R6965j1288P8412J40369p0028
14991D7188J76922q9184m2979m8249L1238j51691r4691M5431J85446O6847k1990
14980A04288j05897o7663j41482O2248K28447J75584p0751O4519o5182j93731
14970i620j07479O4432m5525m495p1j60769N0423J24592L805M9448n4223R0192
14958G10K52061J05646j50516j28703J234P7674r0594j05525j66702q0683R335
14947b76063j2292M1365r240l2270J66597M5335P868J11934R2371l6746q9922
14936H937r9971p2915j10755O1589L4974l8100Q4562M7749q1248R0938Q732j21612
14924a87120L6341O35R0896J27525k3850j85914r0195M3895n734j21737L1576
$$ plain form
14913 -283682 -103709 -126897 -239857 -184041 -62817 -170634 -314985 -306295 -124436 -163514
14903 -163514 -111980 -77173 -182793 -254560 -267066 -133740 -16995 -11985 -80449 -145800 -183554
14892 -183554 -286882 -414717 -497941 -276209 -5129 173013 123932 28902 -127664 -41252
14882 -41252 -266219 -368708 -276612 -169084 -117066 -100824 -35577 68983 66669 44123 66092
14871 66092 187141 147880 114476 123928 -18643 41416 116728 -59278 -155985 -98805 -76177
14860 -76177 13710 -30591 86652 155687 150103 149692 16494 -140451 -206280 -189016 -212989 -371033
14848 -371033 -259384 -68684 -85970 -50717 58895 180631 181691 146620 104228 -16000 -164572
14837 -164572 -121462 -48383 -246410 -90849 -42681 -101886 -160855 -107930 -107239 -50519 -206104
$$ packed form
14913b83682J79973k3188j12960N5816J21224j07817j44351Q690J81859l9078
14903a63514N1534L4807j05620p1767j2506J33326J16745N010o8464o5351l7754
14892a83554j03328j27835q3224K21732K71080J78142m9081r5030j56566Q6412
14882d1252k24967j02489R2096J07528N2018J6242O5247J04560k314k2546K1969
14871F6092J21049l9261l3404R452j42571O0059P5312j76006r6707N7180K2628
14860g6177Q9887m4301J17243O9035n584m11j33198j56945o5829J7264k3973j58044
14848c71033J11649J90700j7286L5253J09612J21736J060l5071m2392j20228j48572
14837a64572M3110P3079j98027J55561M8168n9205n8969N2925O91N6720j55585
$$ plain form
14826 -206104 -401384 -452214 -373359 -211643 -146986 -194244 -212567 -147062 -76684 34564 -126478
14815 -126478 -249064 -244867 -156961 -306014 -374416 -373372 -178414 -91610 -121315 -63695 16281
14804 16281 74817 -66712 -79916 -46223 -128259 -178324 -231346 -143381 -96020 -253218 -56182
14793 -56182 151620 92966 -54550 -163273 -146644 -199439 -130350 -158626 -135084 -52345 -70766
14782 -70766 -62333 -88361 -7763 -40785 -96469 28180 -28543 -70590 -60325 11574 -58393 -229400
14770 -229400 -55151 -67992 -81844 -111671 -100967 -175165 -211009 -164633 -105467 -68298 -176983
14759 -176983 -275044 -397067 -464867 -417944 -205760 -39360 -101574 -223824 -377660 -377182 -180675
14748 -180675 -138745 -299928 -310455 -293028 -277451 -263701 -148166 31175 54935 -117055 -102947
$$ packed form
14826b06104j95280n0830P8855J61716O4657m7258j8323O5505P0378J11248j61042
14815a26478j22586M197Q7906j49053o8402J044J94958Q6804k9705N7620P9976
14804A6281N8536j41529j3204L3693q2036n0065n3022Q7965M7361j57198J97036
14793e6182K07802n8654j47516j08723J6629n2795O9089k8276K3542Q2739j8421
14782g0766Q433k6028Q0598l3022n5684J24649n6723m2047J0265P1899o9967j71007
14770b29400J74249j2841j3852k9827J0704p4198l5844M6376N9166L7169j08685
14759a76983r8061j22023o7800M6923K12184J66400o2214j22250j53836M78J96507
14748a80675M1930j61183j0527J7427J5577J3750J15535J79341K3760j71990J4108
$$ plain form
14737 -102947 -215421 -240582 -246849 -51531 115265 84628 -36890 5567 134897 260665
14727 260665 246058 32450 -47828 18689 -37554 -109089 -312544 -393216 -384995 -152889 -168037
14716 -168037 -205404 -151592 -134608 -379106 -432882 -210578 -14231 -131184 -353422 -343874 -370604
14705 -370604 -317668 -233475 -163745 -186561 -131135 -149469 -89743 -122329 -279624 -453997 -348074
14694 -348074 -160280 30086 98622 122203 47624 3335 122160 158525 76137 -30082 -67334
14683 -67334 -147412 -109092 -71412 103916 103660 64945 96725 -37472 -171243 -188389 -277320
14672 -277320 -321909 -237464 -146424 -92775 8280 -42139 -131001 -95631 -268887 -289620 -110678
14661 -110678 35017 -71509 -200216 -196320 -286665 -232639 -226047 -110838 -11905 94256 -3827
$$ packed form
14737a02947j12474k5161o267J95318J66796l0637j21518M2457J29330J25768
14727B60665j4607k13608q0278O6517n6243p1535k03455q0672Q221K32106j5148
14716a68037l7367N3812J6984k44498n3776K22304J96347j16953k22238R548k6730
14705c70604N2936Q4193O9730k2816N5426j8334N9726l2586j57295j74373J05923
14694c48074J87794J90366O8536K3581p4579m4289J18825L6365q2388j06219l7252
14683f7334q0078L8320L7680J75328k56l8715L1780j34197j33771j7146q8931
14672b77320m4589Q4445R1040N3649J01055n0419q8862L5370j73256k0733J78942
14661a10678J45695j06526j28707L896r0345N4026O592J15209R8933J06161r8083
$$ plain form
14650 -3827 -6233 -43625 92843 202013 279813 231569 177493 205566 99308 91200 -35449
14639 -35449 -121797 1202 69157 4092 71023 -74004 -215529 -300683 -261428 -176168 121804
14628 121804 116387 -107871 -275984 -371126 -316700 -135555 76436 174602 154411 90070 19262
14617 19262 -132860 -100752 -61747 -44979 -108711 -160688 -182749 -290417 -252444 -222366 -89801
14606 -89801 -9931 -173474 -233380 -449880 -483349 -348114 -172948 -171035 24184 284818 160144
14595 160144 -17604 -207435 -78486 28168 93499 15018 -139057 -203464 -192671 -280400
14585 -280400 -334998 -363074 -355956 -274235 -327937 -367729 -443784 -355726 -291697 -221362 -156920 -143624
14573 -143624 -72900 -110559 -167281 -268906 -299641 -242695 -109816 -126974 -173544 -232642 -74702
$$ packed form
14650c827k406l7392J36468J09170P7800m8244n4076K8073j06258q108j26649
14639c5449q6348J22999O7955o5065O6931j45027j41525q5154L9255Q5260K97972
14628A21804n417k24258j68113r5142N4426J81145K11991R8166k0191o4341p0808
14617A9262j52122L2108L9005J6768o3732n1977k2061j07668L7973L0078J32565
14606h9801P9870j63543n9906k16500l3469J35235J75166J913J95219K60634j24674
14595A60144j77748j89831J28949J06654O5331p8481j54075o4407J0793q7729
14585b80400n4598k8076P118Q1721n3702l9792p6055Q8058O4029P0335O4442J3296
14573a43624P0724l7659n6722j01625l0735N6946J32879j7158m6570n9098J57940
$$ plain form
14562 -74702 -93725 -9087 52496 57515 49780 9750 -15466 57980 160989 112712 32387 -56743
14550 -56743 -86877 -97374 69477 289916 244393 208877 221551 157912 159083 163185 148646 -44736
14538 -44736 -145361 -165964 -167485 -137203 -161420 -163803 -198267 -188335 -29519 136409 141665 107168
14526 107168 -43251 -236724 -256802 -258067 -261954 -188977 -105908 -156458 -113153 32123 -7020
14515 -7020 -186875 -158663 -124214 -232439 74512 165812 -98988 -78723 60392 188734 125955
14504 125955 30427 135726 137523 -56650 -62985 -79435 -103021 -94168 -97881 21987 -86335
14493 -86335 -204117 -93576 77133 21717 -120831 -131287 -155446 -261506 -201584 -136824 -110095
14482 -110095 -176095 10685 -97259 -72075 -58720 -105754 -99943 -50473 148368 -26265 -255097
$$ packed form
14562g4702j9023Q4638O1583N019p735m0030k5216P3446J03009m8277q0325q9130
14550e6743l0134j0497J66851K20439m5523l5516J2674o3639J171M102j4539j93382
14538d4736j00625k0603j521L0282k4217k383l4464R932J58816J65928N256l4497
14526A07168j50419j93473k0078j265l887P2977Q3069n0550M3305J45276l9143
14515g020j79855K8212L4449j08225L06951R1300k64800K0265J39115J28342o2779
14504A25955r5528J05299J797j94173o335j6450k3586Q853l713J19868j08322
14493h6335j17782J10541J70709n5416j42548j0456k4159j06060N9922O4760K6729
14482a10095o6000J86780j07944K5184J3355m7034N811M9470J98841j74633k28832
$$ plain form
14471 -255097 -171221 -26731 -81414 -213939 -76246 17663 243493 279187 150459 49757
14461 49757 -35795 -131843 -67513 -207293 -389988 -465893 -369437 -228415 -104241 -100283 -270959
14450 -270959 -245900 -199414 -120120 -47728 64190 222910 165864 128416 84794 -92149 -299414
14439 -299414 -369782 -391044 -396684 -271147 -13599 19071 14250 -164859 -258567 -299367 -197738
14428 -197738 -195542 -212603 -311769 -176959 -250245 -141470 -172424 -269886 -166332 -71547 -41634
14417 -41634 -26037 41629 73221 -29856 -77693 -135267 -108706 31199 126002 199099 213112
14406 213112 222059 153786 55249 -12593 140063 178826 15961 -34857 -46496 -136178 -118700
14395 -118700 -5792 26856 99328 120339 200855 121364 -1205 4998 -18344 15174 -8603
$$ packed form
14471b55097Q3876J44490n4683j32525J37693R3909K25830L5694j28728j00702
14461D9757q5552r6048O4330j39780j82695p5905R6456J41022J24174L958j70676
14450b70959K5059M6486P9294P2392J11918J58720n7046l7448m3622j76943k07265
14439b99414p0368k1262n640J25537K57548L2670m821j79109r3708m0800J01629
14428a97738K196j7061r9166J34810p3286J08775l0954r7462J03554R4785K9913
14417d1634J5597O7666L1592j03077m7837n7574K6561J39905R4803P3097J4013
14406B13112Q947o8273r8537o7842J52656L8763j62865n0818j1639q9682J7478
14395a18700J12908L2648P2472K1011Q0516p9491j22569O203k3342L3518k3777
$$ plain form
14384 -8603 41021 1458 -101030 -13776 25130 -183009 -167598 -44648 -202447 -296733 -214265
14373 -214265 -251223 -228138 -101553 -156678 -241949 -285608 -325923 -257145 -337805 -206055 -225234
14362 -225234 -140407 -159855 -46532 37420 -51920 -64329 -155430 -92180 -39081 -109270 -152081
14351 -152081 -10747 -100833 -108181 -99187 -122379 -145063 -64796 -44223 56646 170252 119102
14340 119102 -126676 -277927 -399652 -311644 -154435 -35546 -65102 33624 -24072 -16381 -23766
14329 -23766 -184332 -241281 -172919 -264079 -140679 -74235 51677 -29999 -75236 16208 29946
14318 29946 -126397 -202937 -233318 -233672 -362210 -503895 -383590 -175721 -67317 -89724 29146
14307 29146 26970 -37865 -5690 131742 -39903 3242 89449 -42194 -94145 -155083 -69876
$$ packed form
14384h603M9624l9563j02488Q7254L8906k08139J5411J22950j57799r4286Q2468
14373b14265l6958K3085J26585n5125q5271m3659m0315O8778q0660J31750j9179
14362b25234Q4827j9448J13323Q3952q9340j2409r1101O3250N3099p0189m2811
14351a52081J41334r0086p348Q994k3192k2684Q0267K0573J00869J13606n1150
14340A19102k45778j51251j21725Q8008J57209J18889k9556R8726n7696P691p385
14329b3766j60566n6949O8362r1160J23400O6444J25912q1676m5237R1444J3738
14318B9946j56343p6540l0381l54j28538j41685J20305K07869J08404k2407J18870
14307B9146k176o4835L2175J37432j71645M3145Q6207j31643n1951o0938Q5207
$$ plain form
14296 -69876 -7860 84999 150614 222449 276764 136669 138866 86594 -80013 -97240 -58509
14285 -58509 -7364 -9197 24992 71770 72775 -69277 -56431 139401 188026 109777 -165112
14274 -165112 -195480 -189605 -199526 -78308 19664 95745 -117064 -216144 -161496 21650 -54444
14263 -54444 -192915 -231671 -177716 -103424 -150806 -333681 -375225 -398263 -322721 -220518 -154447
14252 -154447 -167481 -218889 -102245 -8987 31313 -149712 -241027 -178971 -45831 -57444 -115117
14241 -115117 -53141 73592 48880 59592 26998 82289 178420 209718 142439 14373 -125587
14230 -125587 -22038 -67913 -167879 -58505 -97033 -12252 98350 146408 35037 -148155
14220 -148155 -46006 -39788 1585 -81188 -175401 -327098 -238710 1267 -62482 -74136 77179
$$ packed form
14296f9876O2016R2859O5615P1835N4315j40095K197n2272j66607j7227L8731
14285e8509N1145j833L4189M6778J005j42052J2846J95832M8625p8249k74889
14274a65112l0368N875r921J21218R7972P6081k12809r9080N4648J83146p6094
14263e4444j38471l8756N3955P4292m7382j82875m1544k3038P5542J02203O6071
14252a54447j3034n1408J16644R3258M0300j81025r1315O2056J33140j1613n7673
14241a15117O1976J26733k4712J0712l2594N5291R6131L1298o7279j28066j39960
14230a25587J03549m5875r9966J09374l8528Q4781J10602M8058j11371j83192
14220a48155J02149O218M1373q2773r4213j51697Q8388K39977o3749j1654J51315
$$ plain form
14209 77179 37578 76118 25576 8614 1023 17289 -64816 -18479 147366 139728 9227 -166373
14197 -166373 -70820 -49396 -178516 -132686 -94091 -120627 -111301 -13955 88507 54367 -118716
14186 -118716 69507 142165 -27317 -126502 -125883 -112475 -47806 29159 15794 -11135 -145901
14175 -145901 -52369 -114166 -25323 15403 -152316 -123960 -88400 17523 -97830 -247840 -261122
14164 -261122 -193125 -219465 -259263 -337132 -190946 -25315 -12699 49606 75446 43570 23063
14153 23063 2847 42480 241205 57368 16597 126696 75859 31456 51009 -20031 -68428
14142 -68428 -70192 -22380 -94697 -235846 -128470 88020 149685 101201 98466 -60815 -234827
14131 -234827 -121301 7014 -75226 -119566 -287716 -201892 -11866 83212 243659 202874
$$ packed form
14209G7179l9601L8540n0542j6962p591J6266q2105M6337J65845p638j30501j75600
14197a66373R5553K1424j29120M5830L8595k6536R326R7346J02462l4140j73083
14186a18716J88223P2658j69482r9185O19J3408O4669P6965j3365k6929j34766
14175a45901R3532o1797Q8843M0726j67719K8356L5560J05923j15353j50010j3282
14164b61122O7997k6340l9798p7869J46186J65631J2616O2305K5840l1876k0507
14153B3063k0216L9633J98725j83837m0771J10099n0837m4403J9553p1040m8397
14142f8428j764M7812p2317j41149J07376K16490O1665m8484k735j59281j74012
14131b34827J13526J28315q2240m4340j68150Q5824J90026R5078J60447m0785
$$ plain form
14121 202874 -19498 -78838 -39538 36724 26319 -29684 -42202 -119692 18339 82517 8348
14110 8348 31807 112584 99928 -55018 31286 -24259 -34646 -32229 97884 205168 83906
14099 83906 -34520 3439 4728 16605 -164965 -95237 123578 -316 -117654 8782 35515
14088 35515 111413 50363 77320 31048 -22518 2355 124847 111564 7794 -44405 -22511
14077 -22511 48425 72350 77415 66139 22650 36753 103014 -57790 -222148 -451469 -504473
14066 -504473 -394819 -290627 -329272 -320113 -156089 -17245 67478 65418 -24121 -105899 -154671
14055 -154671 -105000 -122978 -30588 87748 234552 174879 -165106 -149216 -258006 -363426
14045 -363426 -309593 -239284 -61993 47748 96470 211094 241157 192595 100888 -40332 -146101
$$ packed form
14121B02874k22372n9340L9300P6262j0405n6003j2518p7490J38031O4178p4169
14110H348K3459Q0777j2656j54946Q6304n5545j0387K417J30113J07284j21262
14099H3906j18426L7959J289J1877j81570O9728K18815j23894j17338J26436K6733
14088C5515P5898o1050K6957m6272n3566K4873J22492j3283j03770n2199K1894
14077b2511P0936K3925N065j1276m3489J4103O6261j60804j64358k29321n3004
14066e04473J09654J04192l8645R159J64024J38844Q4723k060q9539q1778m8772
14055a54671M9671j7978R2390J18336J46804n9673l39985J5890j08790j05420
14045c63426N3833P0309J77291J09741M8722J14624L0063m8562r1707j41220j05769
$$ plain form
14034 -146101 -84782 -44109 21444 114041 160680 107961 153425 123755 16410 -152854 -120848
14023 -120848 -41336 -49128 -79275 -55994 -164583 -104680 -121443 -5189 -92208 -55365 -16348
14012 -16348 86807 116386 -3177 4684 66379 45983 -52330 -114089 -141489 -248957 -271480
14001 -271480 -184715 -253735 -292834 -354714 -339670 -330235 -255438 -327778 -365196 -259741 -30692
13990 -30692 -11492 102576 102928 101305 250767 402072 299908 123889 47120 37005 5137
13979 5137 61600 130334 122003 -48126 -141497 -46272 73907 207602 280611 60933 27980
13968 27980 189379 204542 24983 131892 159103 50613 40012 67015 -70026 -89007 61522
13957 61522 22572 -34543 -37997 -51629 -107724 -162820 -281071 -308144 -197209 -77121 7435
$$ packed form
14034a46101O1319M0673O5553R2597M6639n2719M5464k9670j07345j69264L2006
14023a20848P9512p792l0147K3281j08589N9903j6763J16254q7019L6843L9017
14012a6348J03155K9579j19563P861O1695k0396r8313o1759k7400j07468k2523
14001b71480Q6765o9020l9099o1880J5044R435P4797p2340l7418J05455K29049
13990c0692J9200J14068L52j623J49462J51305j02164j76019p6769j0115l1868
13979E137N6463O8734q331j70129r3371R5225J20179J33695P3009k19678l2953
13968B7980J61399J5163j79559J06909K7211j08490j0601K7003j37041j8981J50529
13957F1522l8950n7115l454j3632n6095n5096j18251k7073J10935J20088Q4556
$$ plain form
13946 7435 -11739 -104569 -84746 -4417 -12728 -18241 28790 39866 -29574 99651 222106 321139
13934 321139 243000 147407 118780 93101 -1224 7174 54497 115173 70041 26477 -31993 -20260
13922 -20260 90034 188303 -4900 49210 100774 16518 95846 -100737 -243086 -322356 -315417
13911 -315417 -245805 -270756 -181128 -263571 -131166 -42131 9965 2808 167045 152036 95161
13900 95161 261844 281362 217242 -6891 -101087 -164792 -31261 72789 28463 -48050 40019
13889 40019 4414 -5260 10524 -117811 -48972 -26599 -258060 -330043 -181728 106618 176898
13878 176898 -20357 53384 282142 391124 269584 285836 348692 281835 243530 277329 110269
13867 110269 -19676 21971 20657 30756 181586 100193 172089 314703 223947 -15359 -150280
$$ packed form
13946G435j9174r2830J9823Q0329q311n513M7031J1076o9440J29225J22455R9033
13934C21139p8139r5593k8627k5679r4325Q398M7323O0676m5132m3564n8470J1733
13922b0260J10294R8269j93203N4110N1564q4256P9328j96583j42349p9270O939
13911c15417O9612k4951Q9628q2443J32405Q9035N2096p157J64237j5009n6875
13900I5161J66683J9518o4120k24133r4196o3705J33531J04050m4326p6513Q8069
13889D0019l5605r674J5784j28335O8839K2373k31461p1983J48315K88346P0280
13878A76898j97255P3741K28758J08982j21540J6252O2856o6857l8305L3799j67060
13867A10269j29945M1647j314J0099J50830q1393P1896J42614r0756k39306j34921
$$ plain form
13856 -150280 -104311 183275 263245 45286 -123775 -63370 739 -24268 79257 94053 -45501
13845 -45501 -146638 -119360 1005 68500 26208 -50265 -163934 -274388 -217693 -93689 -40480
13834 -40480 -111536 -62664 -28624 -223248 -96621 -78720 -110877 -5407 106243 77715 6147
13823 6147 -40133 -82860 3513 59253 127706 183602 65067 -192059 -282794 -250183 -187335
13812 -187335 7586 122216 -12661 -100055 79833 151540 194170 239897 163572 63006
13802 63006 -74384 -52562 109468 171518 222733 243600 118040 15735 -32980 27163 -7830
13791 -7830 19179 105032 -59921 -79608 45657 -98821 -274141 -438107 -424045 -82577 58620
13780 58620 -84769 5966 62545 -22499 7106 40 15196 -42071 -157280 49032 -14943
$$ packed form
13856a50280M5969K87586P9970k17959j69061O0405O4109k5007J03525J4796j39554
13845d5501j01137K7278J20365O7495m2292p6473j13669j10454N6695J24004N3209
13834d0480p1056M8872L4040j94624J26627J7901l2157J05470J11650k8528p1568
13823F147m6280m2727Q6373N5740O8453N5896j18535k57126r0735L2611O2848
13812a87335J94921J14630j34877q7394J79888P1707M2630M5727p6325j00566
13802F3006j37390K1822J62030O2050N1215K0867j25560j02305m8715O0143l4993
13791g830K7009Q5853j64953j9687J25265j44478j75320j63966J4062L41468J41197
13780E8620j43389R0735N6579q5044K9605p066J5156n7267j15209K06312o3975
$$ plain form
13769 -14943 -92510 -71645 -106630 -113292 -187348 -193624 -138999 -47894 -42400 -38628 -179559 -68074
13757 -68074 -64215 8443 187234 180862 139067 17465 91780 118967 -30788 -210725 -139484
13746 -139484 -15207 37869 156019 167901 234526 75533 144290 213800 281040 322299 72975
13735 72975 -79450 -52173 -40346 -328363 -248958 -194057 11405 124151 135819 174766 292581
13724 292581 274825 196011 139035 36109 18316 42252 -41053 -124907 -23585 1576 80352
13713 80352 81262 -30915 -171697 -210274 -314174 -314532 -180429 -92335 -89931 -45357 -94858 -129754
13701 -129754 -192325 -119766 -137936 -32436 -144171 -151899 -1313 -57521 -76951 38132 109931
13690 109931 51792 93105 84895 133468 273477 217954 50183 -78174 -188570 -152073 -26287
$$ packed form
13769a4943p7567K0865l4985o662p4056o276N4625R1105N494L772j40931J11485
13757f8074L859P2658J78791o372m1795j21602P4315K7187j49755j79937P1241
13746a39484J24277N3076J18150J1882O6625j58993O8757O9510O7240M1259k49324
13735G2975j52425K7277J1827k88017P9405N4901K05462J12746J1668L8947J17815
13724B92581j7756p8814n6976j02926j7793K3936q3305q3854J01322K5161P8776
13713H0352R10j12177j40782l8577j03900l58J34103Q8094K404M4574m9501l4896
13701a29754o2571P2559j8170J05500j11735p728J50586n6208j9430J15083P1799
13690A09931n8139M1313q210M8573J40009n5523j67771j28357j10396L6497J25786
$$ plain form
13679 -26287 17715 176042 306084 222595 246521 313768 337885 307037 244614 9186 -24690
13668 -24690 123541 197965 174111 130219 -25345 53616 219891 279600 232066 283960 337918
13657 337918 461760 448250 131988 765 37648 264273 195041 27348 38720 250333
13647 250333 176999 1039 -117453 -79069 18003 32738 52173 -23546 4181 17776 -72979
13636 -72979 -43186 -13488 -32630 -147566 -41735 -61290 -194356 -282415 -182021 -41275 42327
13625 42327 178392 245145 133771 109294 121385 -27768 2874 -37857 31432 257523 319090
13614 319090 197930 -163626 -104795 102188 177693 156224 251479 145320 161366 22139
13604 22139 65352 192930 294518 288661 191279 98226 -40887 -118604 -162355 -245071 -112026
$$ packed form
13679b6287M4002J58327J30042q3489K3926O7247K4117l0848o2423k35428l3876
13668b4690J48231P4424k3854m3892j55564P8961J66275N9709m7534N1894N3958
13657C37918J23842j3510l16262j31223L6883K26625o9232j67693J1372K11613
13647B50333p3334j75960j18492L8384R7072J4735J9435p5719K7727J3595r0755
13636g2979K9793K9698j9142j14936J05831j9555j33066q8059J00394J40746Q3602
13625D2327J36065O6753j11374k4477J2091j49153L0642m0731O9289K26091O1567
13614C19090j21160l61556N8831K06983P5505k1469R5255j06159J6046j39227
13604B2139M3213J27578J01588n857r7382r3053j39113p7717m3751q2716J33045
$$ plain form
13593 -112026 88823 40570 -77360 -158083 -192588 11275 97827 34220 108091 -26796 -241459
13582 -241459 -205750 -176796 -200414 -75902 -101205 -49960 41124 -13003 30175 -7986 100786
13571 100786 197370 105318 69230 102287 -32864 -158171 -195795 -217842 -16041 82368 139345
13560 139345 116010 19624 -12678 -30400 79318 98788 -15398 177848 195398 47999 60312
13549 60312 39509 -66540 -158110 -90870 -71374 41589 -21039 21058 142850 81329 -59429
13538 -59429 63278 95927 -64958 -191742 -253152 -154435 -248901 -361090 -294317 -298905 -176966
13527 -176966 24733 -7102 -93803 -141596 -2709 -51267 26018 46051 11141 64226 91241
13516 91241 -92702 -44362 -50976 -108767 -92125 122133 64672 24520 200924 257581 230717
$$ packed form
13593a12026K00849m8253j17930q0723l4505K03863Q6552o3607P3871j34887k14663
13582b41459L5709K8954k3618J24512k5303N1245R1084n4127M3178l8161J08772
13571A00786R6584r2052l6088L3057j35151j25307l7624k2047K01801R8409N6977
13560A39345k3335r6386l2302j7722J09718J9470j14186J93246J7550j47399J2313
13549F0312k0803j06049r1570O7240J9496J12963o2628M2097J21792o1521j40758
13538e9429J22707L2649j60885j26784o1410R8717r4466j12189O6773m588J21939
13527a76966K01699l1835q6701m7793J38887m8558P7285K0033l4910N3085K7015
13516I1241j83943M8340o614n7791J6642K14258n7461m0152J76404N6657k6864
$$ plain form
13505 230717 341524 336800 415727 332558 293886 302733 7884 -15809 102260 294145 395706
13494 395706 289755 279922 230703 199220 128864 -142572 -173767 -151654 -35676 107353 98020
13483 98020 81179 106849 -59551 -84062 -8933 37381 131663 214298 184195 155611 191734
13472 191734 -16583 -45101 104522 -13582 -27126 63045 329861 499874 441013 374112
13462 374112 368299 172075 95696 181824 327551 226403 161805 189071 46102 143200 241372
13451 241372 286774 335541 331027 305019 324045 366196 308532 358259 260131 254655 112855 84466
13439 84466 47146 111494 205276 204855 240594 105886 -135191 -117787 -41412 101289 71537
13428 71537 176155 197259 153526 17406 -58581 -132911 -87391 6128 149868 122667 35774
$$ packed form
13505B30717J10807m724P8927q3169l8672Q847k94849k3693J18069J91885J01561
13494C95706j05951r833m9219l1483p0356k71436l1195K2113J15978J43029r333
13483I8020j6841K5670j66400k4511P5129M6314R4282Q2635l0103k8584L6123
13472A91734k08317k8518J49623j18104j3544R0171K66816J70013n8861o6901
13462C74112n813j96224p6379Q6128J45727j01148o4598K7266j42969R7098R8172
13451B41372M5402M8767m514k6008J9026M2151n7664M9727r8128n476j41800k8389
13439H4466l7320O4348R3782m21L5739j34708k41077J7404P6375J42701k9752
13428G1537J04618K1104m3733j36120p5987p4330M5520R3519J43740k7201q6893
$$ plain form
13417 35774 44910 260829 238751 239680 259769 225148 253370 241242 350177 284410 217176 385865
13405 385865 413734 244730 111444 -28503 -16897 -73616 44483 101741 34625 269064
13395 269064 331863 421414 357054 294955 177821 178329 316747 362768 371999 262892 162475
13384 162475 181059 135247 -40718 -137585 58006 239843 235121 280001 348173 280689 107784
13373 107784 71241 76984 60808 134260 190318 6869 92269 355770 309266 124034 142354
13362 142354 310445 403274 296758 172431 103927 -33552 96443 438497 562772 476968
13352 476968 97974 -34805 -66493 -177535 33177 335549 325156 202133 128157 127124
13342 127124 182806 263883 354607 426991 376381 290460 185727 219798 232890 334601 332078
$$ packed form
13417C5774R136K15919k2078R29K0089l4621K8222j2128J08935o5767o7234J68689
13405C85865K7869j69004j33286j39947J1606n6719J18099N7258o7116K34439
13395B69064O2799Q9551o4360o2099j17134N08J38418M6021R231j09107j00417
13384A62475J8584m5812j75965r6867J95591J81837m722M4880O8172o7484j72905
13373A07784l6543N743j6176P3452N6058j83449Q5400K63501m6504j85232J8320
13362A42354J68091R2829j06516j24327o8504j37479J29995L42054J24275q5804
13352D76968l78994j32779l1688j11042K10712L02372j0393j23023p3976j033
13342A27124N5682Q1077R0724P2384n0610q5921j04733L4071J3092J01711k523
$$ plain form
13331 332078 160764 212472 382321 373203 327387 377622 268316 82146 -91902 29652
13321 29652 -90310 -198915 -121964 -226037 -225648 -46261 -13133 80152 108786 101235 202658
13310 202658 330886 262062 80994 92044 111885 176405 307234 351352 212522 74497
13300 74497 44154 206457 162105 140247 15184 5187 132131 149380 379105 268491 198171
13289 198171 135475 5579 -4139 6487 154745 162067 155955 163606 149031 77579 238993 251175
13277 251175 240554 186311 140849 206694 175766 224483 117981 108523 363692 448235 335600
13266 335600 149332 158072 245821 236930 318805 452352 405850 320010 517603 502276 511366
13255 511366 525267 484281 365414 257504 171192 262484 404003 599915 658252 540581
$$ packed form
13331C32078j71314N1708J69849r118m5816N0235j09306j86170j74048J21554
13321B9652j19962j08605P6951j04073L89J79387L3128R3285K8634p551J01423
13310B02658J28228o8824j81068J1050J9841O4520J30829M4118j38830j38025
13300G4497l0343J62303m4352k1858j25063r997J26944J7249K29725j10614p0320
13289A98171o2696j29896r718J0626J48258P322o112P651j4575p1452J61414J2182
13277B51175j0621n4243m5462O5845l0928M8717j06502r458K55169Q4543j12635
13266C35600j86268Q740Q7749q891Q1875J33547m6502q5840J97593j5327R090
13255E11366J3901m0986j18867j07910q6312R1292J41519J95912N8337j17671
$$ plain form
13245 540581 378655 173714 322544 291837 280724 284193 305192 390626 423749 298982 237749
13234 237749 373137 491269 324745 285993 377889 420667 452753 474152 491541 564955 434921
13223 434921 384781 379363 406216 415993 330369 294637 205165 219315 334789 334533 263536 230897
13211 230897 244653 237581 294132 440072 489117 491596 342384 184914 132793 51055 139750
13200 139750 266974 263375 241538 178096 245600 299167 452377 472893 512422 366946 439339
13189 439339 446014 119808 166094 290195 400895 381485 293683 67343 -8327 55555 126428
13178 126428 141445 262714 206319 18665 55122 176850 290412 294887 265677 358343 206869
13167 206869 236725 355889 379894 350249 398721 365990 413085 408191 506616 490546 371391
$$ packed form
13245E40581j61926k04941J48830l0707j1113L469K0999Q5434L3123j24767o1233
13234B37749J35388J18132j66524l8752R1896M2778L2086K1399J7389P3414j30034
13223D34921n0140n418K6853R777q5624l5732q9472J4150J15474k56p0997l2639
13211B30897J3756p072N6551J45940M9045K479j49212j57470n2121q1738Q8695
13200A39750J27224l599k1837o3442O7504N3567J53210K0516L9529j45476P2393
13189D39339O675l26206M6286J24101J10700j9410q7802k26340p5670O3882P0873
13178A26428J5017J21269n6395j87654L6457J21728J13562M475k9210R2666j51474
13167B06869K9856J19164K4005k9645M8472l2731M7095m894R8425j6070j19155
$$ plain form
13156 371391 189790 148278 368735 501331 467420 483137 478557 560966 636560 574346 442651
13145 442651 359140 280670 294445 228755 145452 271240 307789 377522 471698 570425 437245
13134 437245 273546 369070 456756 446655 211757 59132 71194 79224 102540 212016 238249
13123 238249 190788 384137 409727 246694 252772 613546 604558 558990 521264 594640 588619
13112 588619 513324 359257 150121 83679 72209 105826 136940 203893 351131 433568 348682
13101 348682 239621 -30311 -42945 100284 187414 275879 293909 508485 539551 584569 569401
13090 569401 550957 390358 237922 420559 445631 482101 535847 495182 227849 244022 328930
13079 328930 468217 464547 402153 296389 260325 402215 448586 358961 297278 251666 439848
$$ packed form
13156C71391j81601m1512K20457J32596l3911J5717m580Q2409P5594o2214j31695
13145D42651q3511p8470J3775o5690q3303J25788L6549O9733R4176R8727j33180
13134D37245j63699R5524Q7686j0101k34898j52625J2062Q030K3316J09476K6233
13123B38249m7461J93349K5590j63033O078L60774q988m5568l7726P3376o021
13112E88619p5295j54067k09136o6442j1470L3617L1114O6953J47238Q2437q4886
13101C48682j09061k69932j2634J43229Q7130Q8465J8030K14576L1066M5018j5168
13090E69401j8444j60599j52436J82637K5072L6470N3746m0665k67333J6173Q4908
13079C28930J39287l670o2394j05764l6064J41890M6371q9625o1683m5612J88182
$$ plain form
13068 439848 452391 448529 463068 590923 749141 634955 571740 654374 556507 651417 660295
13057 660295 733216 719638 532755 464033 597285 729988 578022 427632 420226 368177 340121
13046 340121 443200 422347 413033 337346 438820 424861 265840 235499 227399 218921 426734
13035 426734 529826 377266 481899 621267 625316 678699 655125 720080 686518 637168 650114
13024 650114 611168 607565 443749 468221 487287 661858 709551 618980 596835 514426 329631
13013 329631 272125 403434 341803 368869 410082 408652 330213 449647 600584 526045 483433
13002 483433 457360 522249 584074 558382 585891 657869 565653 592399 595719 504237 523055 480961
12990 480961 413946 488060 597919 612638 446674 505404 591735 788637 676074 584983 547754
$$ packed form
13068D39848J2543l862J4539J27855J58218j14186o3215Q2634r7867R4910Q878
13057F60295P2921j3578j86883o8722J33252J32703j51966j50390p406n2049k8056
13046C40121J03079k0853r314p5687J01474j3959j59021l0341q100q478K07813
13035D26734J03092j52560J04633J39368M049N3383k3574O4955l3562m9350J2946
13024F50114l8946l603j63816K4472J9066J74571M7693r0571k2145q2409j84795
13013C29631n7506J31309o1631K7066M1213j430p8439J19434J50937p4539m2612
13002D83433k6073O4889O1825k5692K7509P1978r2216K6746L320r1482J8818m2094
12990D80961o7015P4114J09859J4719j65964N8730Q6331J96902j12563r1091l7229
$$ plain form
12979 547754 508797 401698 526142 570569 680911 668626 499445 558749 693205 808509
12969 808509 661455 608792 610288 529934 623882 701324 654503 612029 540732 570976 631308
12958 631308 564244 458166 504666 499007 629230 714361 654579 809697 874496 754688 635164
12947 635164 713815 714360 477765 414926 456903 564124 632304 408025 376312 419346 349550
12936 349550 395198 395314 235522 231925 408480 417365 326898 400338 582306 676101 807338
12925 807338 743730 532585 471518 417707 552063 717975 863574 747402 631546 450226
12915 450226 338515 490157 685238 775890 765244 602409 567158 544170 517772 416032
12905 416032 570007 781485 826829 854723 856142 784365 775823 887975 864164 738903 590501
$$ packed form
12979E47754l8957j07099J24444M4427J10342j2285j69181N9304J34456J15304
12969H08509j47054n2663J496q0354R3948P7442m6821m2474p1297L0244O0332
12958F31308o7064j06078M6500n659J30223Q5131n9782J55118O4799j19808j19524
12947F35164P8651N45k36595o2839M1977J07221O8180k24279l1713M3034o9796
12936C49550M5648J16j59792l597J76555Q885r0467P3440J81968R3795J31237
12925H07338o3608k11145o1067n3811J34356J65912J45599j16172j15856j81320
12915D50226j11711J51642J95081R0652j0646j62835l5251k2988k6398j01740
12905D16032J53975K11478M5344K7894J419p1777q542J12152k3811j25261j48402
$$ plain form
12894 590501 561217 684724 820382 706511 764062 1043897 1199093 1012334 795162 799644
12884 799644 732748 664118 614317 647555 568354 398770 318825 339166 422717 566473 656290
12873 656290 622919 571727 571966 731635 596236 583638 505098 637999 828678 787738 830377
12862 830377 876974 822085 803826 776574 623533 442070 453493 577371 600667 867912 896191
12851 896191 766776 950742 741093 452044 559995 720175 515546 435470 676079 667429
12841 667429 623327 766535 856631 940966 863938 802574 756825 783733 625957 542380 584126
12830 584126 694222 734041 633779 841364 908335 856577 830664 685906 608378 691110 764503
12819 764503 875423 708845 612679 715476 702153 450192 429587 508875 610446 571259
$$ packed form
12894E90501k9284J23507J35658j13871N7551K79835J55196j86759k17172M482
12884G99644o6896o8630m9801L3238p9201j69584p9945K0341Q3551J43756Q9817
12873F56290l3371n1192K39J59669j35399j2598p8540J32901J90679m0940M2639
12862H30377M6597n4889j8259k7252j53041j81463J1423J23878K3296K67245K8279
12851H96191j29415J83966k09649k89049J07951J60180k04629q0076K40609q650
12841F67429m4102J43208R0096Q4335p7028o1364m5749K6908j57776q3577M1746
12830E84126J10096L9819j00262K07585O6971n1758k5913j44758p7528Q2732P3393
12819G64503J10920j66578r6166J02797j3323k51961k0605P9288J01571l9187
$$ plain form
12809 571259 614570 703605 790957 979490 976462 928717 875392 797982 755047 769320 855700
12798 855700 980781 1009750 1050662 987382 949070 925134 979430 822920 662241 560966 660640
12787 660640 673047 696008 693741 855030 1054611 810806 708344 800851 657710 584484 696734
12776 696734 650863 691643 716873 696313 784475 985408 948088 895636 1017290 1126266 1168349
12765 1168349 1095620 1107162 1042204 881787 860683 927287 1226890 1246224 1295389 1258316 1195240
12754 1195240 1127280 1088726 994435 1015657 1174740 1028747 899248 990139 835897 650263
12744 650263 611253 590302 760709 873596 1044518 1024171 967237 1043663 1167243 1157014 1055312
12733 1055312 911759 819816 830601 1007542 1060628 973737 975545 945520 810213 790459 919991
$$ packed form
12809E71259M3311Q9035Q7352J88533l028m7745n3325p7410m2935J4273Q6380
12798H55700J25081K8969M0912o3280l8312k3936N4296j56510j60679j01275R9674
12787F60640J2407K2961k267J61289J99581k43805j02462R2507j43141p3226J12250
12776F96734m5871M0780K5230k0560Q8162K00933l7320n2452J21654J08976M2083
12765A168349p2729J1542o4958j60417k1104O6604K99603J9334M9165l7073o3076
12754A195240o7960l8554r4291K1222J59083j45993j29499R0891j54242j85634
12744F50263l9010k0951J70407J12887J70922k0347n6934P6426J23580j0229j01702
12733A055312j43553r1943J0785J76941N3086q6891J808l0025j35307j9754J29532
$$ plain form
12722 919991 1097084 1219336 1258289 1256871 1172128 1128168 1048870 1140514 1036805 850328 648888
12711 648888 773884 1034662 1078013 1047782 1083708 986473 1007223 1130932 1191456 1199601 1034567
12700 1034567 978486 1143770 1057004 898037 873792 996101 1039118 1085326 1126550 1165150 1187430
12689 1187430 1194734 1292321 1298012 1330186 1266940 1196243 1149927 1228653 1249424 1118209 1137559
12678 1137559 1290902 1361488 1322398 1344148 1367135 1227727 1186717 1280586 1283509 1281970 1430098
12667 1430098 1355083 1414050 1455597 1450595 1297276 1226593 1238192 1438335 1276595 1066957 1043810
12656 1043810 1199840 1320260 1403348 1389030 1373404 1371751 1411788 1317283 1302540 1232563 1086442
12645 1086442 1160328 1296162 1421224 1437034 1430545 1355083 1248835 1218194 1337956 1244827 1156245
$$ packed form
12722I19991J77093J22252L8953j418q4743m3960p9298R1644j03709j86477k01440
12711F48888J24996K60778M3351l0231L5926r7235K0750J23709O0524Q145j65034
12700A034567n6081J65284q6766j58967k4245J22309M3017M6208M1224L8600K2280
12689A187430P304R7587N691L2174o3246p0697m6316P8726K0771j31215J9350
12678A137559J53343P0586l9090K1750K2987j39408m1010R3869K923j539J48128
12667A430098p5015N8967M1547n002j53319p0683J1599K00143j61740k09638k3147
12656A043810J56030J20420Q3088j4318j5626j653M0037r4505j4743o9977j46121
12645A086442P3886J35834J25062J5810o489p5462j06248l0641J19762r3129q8582
$$ plain form
12634 1156245 1170309 1153106 1048054 1038427 1187411 1281208 1261254 1285625 1170889 1044824 992136
12623 992136 1103446 1238676 1177258 1209392 1316025 1457741 1662533 1626494 1454842 1306038
12613 1306038 1259682 1322914 1391535 1528102 1682818 1603610 1430936 1212802 1150901 1171277
12603 1171277 1233165 1305624 1355587 1282817 1147057 953028 1070445 1198638 1371815 1549708
12593 1549708 1564973 1500151 1490617 1585174 1551979 1549002 1538386 1661841 1798002 1792996 1666983
12582 1666983 1510845 1601754 1767763 1687384 1478310 1447681 1446397 1340668 1503472 1491565
12572 1491565 1499650 1468854 1439206 1570690 1563255 1599143 1650144 1565233 1731961 1931004 1916576
12561 1916576 1821646 1794770 1844053 1834317 1604916 1539952 1391925 1601187 1761669 1752819 1730177
$$ packed form
12634A156245J4064j7203j05052r627J48984R3797j9954K4371j14736j26065n2688
12623I92136J11310J35230o1418L2134J06633J41716K04792l6039j71652j48804
12613A306038m6356O3232O8621J36567J54716p9208j72674k18134o1901K0376
12603A171277O1888P2459M9963p2770j35760j94029J17417J28193J73177J77893
12593A549708J5265o4822r534R4557l3195k977j0616J23455J36161n006j26013
12582A666983j56138R0909J66009q0379k09074l0629j284j05729J62804j1907
12572A491565Q085l0796k9648J31484p435L5888N1001q4911J66728J99043j4428
12561A916576r4930k6876M9283r736k29401o4964j48027K09262J60482q850k2642
$$ plain form
12550 1730177 1588987 1538229 1615022 1628367 1705328 1691671 1618651 1706274 1814707 1845314 1835836
12539 1835836 1859742 1794085 1945897 1961923 1974610 2103086 2149943 2008687 1875408 1786278
12529 1786278 1714558 1765450 1697917 1728266 1645376 1679785 1748214 1798820 1850415 1754885 1733558
12518 1733558 1781196 1806695 1879207 1899215 1914697 1856163 1841661 2013563 2189861 2178612 2167896
12507 2167896 2207533 2271384 2295576 2161984 2217904 2339781 2327140 2238015 2272617 2372883 2395425
12496 2395425 2229197 2068431 1965050 1955771 2081421 2139230 2150194 2213001 2053351 1981485
12486 1981485 2049733 2028459 2082364 2061666 2184844 2031713 2100548 2283733 2356864 2372275 2249712
12475 2249712 2312835 2208933 2180184 2058040 1883389 1952131 2008365 2009221 2012849 1970464 2011886
$$ packed form
12550A730177j41190n0758P6793J3345P6961j3657p3020Q7623J08433L0607r478
12539A835836K3906o5657J51812J6026J2687J28476M6857j41256j33279q9130
12529A786278p1720N0892o7533L0349q2890L4409O8429N0606N1595r5530k1327
12518A733558M7638K5499P2512K0008J5482n8534j4502J71902J76298j1249j0716
12507B167896L9637O3851K4192j33592N5920J21877j2641q9125L4602J00266K2542
12496B395425j66228j60766j03381r279J25650N7809J0964O2807j59650p1866
12486A981485O8248k1274N3905k0698J23178j53131O8835J83185P3131J5411j22563
12475B249712O3123j03902k8749j22144j74651O8742N6234Q56L628m2385M1422
$$ plain form
12464 2011886 2045857 2202237 2273064 2120603 2058021 2170215 2114903 2064007 2053465 2065886 2049269
12453 2049269 2007811 2070901 2004489 1961227 2085316 2282009 2180939 1928393 2069852 2053176
12443 2053176 2136687 2237000 2161941 2162908 2108645 2208043 2124524 2114153 2171018 2202285 2116358
12432 2116358 2002610 1882586 1811347 2018744 2013451 1998233 2067740 2154174 2227739 2113200 1902270
12421 1902270 1870369 1881839 1932694 2017795 2093738 2087132 2120741 2150404 2035469 2026641 2111492
12410 2111492 2225383 2355522 2385504 2415584 2305448 2290841 2513988 2442684 2300016 2158274
12400 2158274 2150482 2257557 2432912 2537117 2478140 2428660 2457835 2455571 2242821 2152742 2080249
12389 2080249 2214921 2383690 2404261 2412047 2629845 2585492 2462827 2375744 2331723 2432196
$$ packed form
12464B011886L3971J56380P0827j52461o2582J12194n5312n0896j0542J2421j6617
12453B049269m1458O3090o6412m3262J24089J96693j01070k52546J41459j6676
12443B053176Q3511J00313p5059R67n4263R9398q3519j0371N6865L1267q5927
12432B116358j13748j20024p1239K07397n293j5218O9507Q6434P3565j14539k10930
12421A902270l1901J1470N0855Q5101P5943o606L3609K9663j14935q828Q4851
12410B111492J13891J30139K9982L0080j10136j4607K23147p1304j42668j41742
12400B158274p792J07075J75355J04205n8977m9480K9175k264k12750r0079p2493
12389B080249J34672J68769K0571P786K17798m4353j22665q7083m4021J00473
$$ plain form
12379 2432196 2450682 2383059 2340242 2370476 2241078 2214857 2289505 2564039 2635862 2446697 2437237
12368 2437237 2674950 2773362 2625889 2759420 2929415 2904840 2777801 2781781 2824952 2824227 2854716
12357 2854716 2723843 2499784 2450430 2443512 2558257 2720108 2625065 2573671 2475629 2446119 2604862
12346 2604862 2608126 2646826 2541799 2531746 2543831 2485201 2505853 2480855 2675934 2887455 3037544
12335 3037544 2982465 2899176 2787415 2538670 2389533 2468095 2515789 2707080 2621192 2685726
12325 2685726 2866307 2887285 2764604 2526725 2490298 2597348 2691952 2692318 2783936 2855503 2793966
12314 2793966 2890066 2975551 2932013 2854715 2801181 2937082 2955260 2983090 3040938 2831762 2823754
12303 2823754 2934827 3067221 2975999 2808008 2871043 2921425 3013591 3025116 2980946 3009294 2968761
$$ packed form
12379B432196J8486o7623m2817L0234j29398k6221P4648K74534P1823j89165r460
12368B437237K37713R8412j47473J33531J69995k4575j27039L980M3171p25L0489
12357B854716j30873k24059m9354o918J14745J61851r5043n1394r8042k9510J58743
12346B604862L264L8700j05027j0053J2085n8630K0652k4998J95079K11521J50089
12335C037544n5079q3289j11761k48745j49137P8562M7694J91291q5888O4534
12325B685726J80581K0978j22681k37879l6427J07050R4604L66R1618P1567o1537
12314B793966R6100Q5485m3538p7298n3534J35901J8178K7830N7848k09176q008
12303B823754J11073J32394r1222j67991O3035N0382R2166J1525m4170K8348m0533
$$ plain form
12292 2968761 3020596 2982541 2940826 2962370 2955438 3056371 3155345 3212783 3217958 3322161 3402400
12281 3402400 3373576 3358132 3409177 3300531 3212036 3149415 3240442 3214024 3250008 3234782 3131033
12270 3131033 3276572 3374321 3433642 3480289 3464873 3424574 3480508 3352908 3259936 3297831 3471123
12259 3471123 3371722 3286233 3246614 3240177 3353345 3382802 3263981 3339644 3385174 3343369 3300206
12248 3300206 3346547 3261780 3414841 3546210 3649961 3657012 3638210 3618376 3419530 3432538 3368331
12237 3368331 3301410 3219287 3410689 3435679 3347095 3305403 3390012 3380879 3379408 3286252 3407941
12226 3407941 3592625 3611964 3608215 3687228 3730566 3617483 3466015 3300240 3476931 3578188
12216 3578188 3644376 3639787 3568989 3609121 3678536 3836592 3602306 3368410 3322165 3355955 3541699
$$ packed form
12292B968761N1835l8055m1715K1544o932J00933R8974N7438N175J04203Q0239
12281C402400k8824j5444N1045j08646q8495o2621R1027k6418L5984j5226j03749
12270C131033J45539R7749N9321M6647j5416m0299N5934j27600r2972L7895J73292
12259C471123r9401q5489l9619o437J13168K9457j18821P5663M5530m1805m3163
12248C300206M6341q4767J53061J31369J03751P051j8802j9834j98846J3008o4207
12237C368331o6921q2123J91402K4990q8584m1692Q4609r133j471r3156J21689
12226C407941J84684J9339l749P9013M3338j13083j51468j65775J76691J01257
12216C578188O6188m589p0798M0132O9415J58056k34286k33896m6245L3790J85744
$$ plain form
12205 3541699 3703651 3594601 3448536 3488802 3609109 3732420 3717225 3560489 3673423 3606136
12195 3606136 3630695 3738178 3744231 3858874 3938907 3915576 4034474 4004296 3888851 3980210 3929155
12184 3929155 3867974 3882869 3807454 3874972 3809645 3840675 3845193 3834268 3896565 3893481 4004721
12173 4004721 4038122 3981548 3846487 3817435 3989598 4205595 4264788 4195867 4123618 4124619 4134213
12162 4134213 4097826 4131920 4062491 4045425 4004725 4160954 4398335 4523308 4527868 4553113 4690454
12151 4690454 4624388 4617402 4610276 4841627 4947621 4917831 4901828 4875507 4939655 5153008 5246113
12140 5246113 5206717 5580322 5959805 6264633 6115832 6297398 6532355 6846732 7370603 7951593
12130 7951593 8438769 8745840 9302287 10141260 10998018 12071829 13262979 14911791 16906762
$$ packed form
12205C541699J61952j09050j46065M0266J20307J23311j5195j56736J12934o7287
12195C606136K4559J07483O053J14643Q0033k3331J18898l0178j15445R1359n1055
12184C929155o1181J4895p5415O7518o5327L1030M518j0925O2297l084J11240
12173D004721L3401n6574j35061k9052J72163K15997N9193o8921p2249J001R594
12162D134213l6387L4094o9429j7066m0700J56229K37381J24973M560K5245J37341
12151D690454o6066o986p126K31351J05994k9790j6003k6321O4148K13353R3105
12140E246113l9396L73605L79483L04828j48801J81566K34957L14377N23871N80990
12130G951593M87176L07071N56447Q38973Q56758J073811J191150J648812J994971
$$ plain form
12121 16906762 19156247 22142712 25665339 29857813 34354031 39016097 43084267 45826248
12113 45826248 46833839 46101923 43933090 41115900 37952373 34501257 31695498 29512144
12105 29512144 27581442 26197779 25172029 24346531 24003246 23936734 24067721 24592179 25542316
12096 25542316 27151779 29323492 31975457 35536279 40137150 45668958 51793800 57865947
12088 57865947 62408554 64603262 63919254 60480703 55380675 49790471 44559367 39842463
12080 39842463 35882051 32657778 30217232 28287380 26908575 25977056 25398310 24974247
12072 24974247 24837701 25157445 26036925 27124073 28937464 31567620 35189141 40144456
12064 40144456 46336355 53434268 60935980 67262536 70543931 69951112 65733505 59361892
$$ packed form
12121A6906762K249485K986465L522627M192474M496218M662066M068170K741981
12113D5826248J007591p31916k168833k817190l163527l451116k805759k183354
12105B9512144j930702j383663j025750q25498l43285o6512J30987N24458R50137
12096B5542316J609463K171713K651965L560822M600871N531808O124842O072147
12088E7865947M542607K194708o84008l438551n100028n590204n231104m716904
12080C9842463l960412l224273k440546j929852j378805r31519n78746m24063
12072B4974247j36546L19744Q79480J087148J813391K630156L621521M955315
12064D0144456O191899P097913P501712O326556L281395n92819m217607o371613
$$ plain form
12056 59361892 52481136 46060289 40652562 36528006 33423178 31113793 29544626 28476947
12048 28476947 27978410 27689668 27736901 28221495 29138921 30630205 32429580 34912119 37893612
12039 37893612 41586112 45997138 51305446 56864975 61772983 65052445 66040693 64423142
12031 64423142 60627526 55206834 49287033 43553501 38324963 33855730 30023259 26703622
12023 26703622 24020655 21897904 20329144 18874330 17403359 16248495 15194893 14179902
12015 14179902 13326531 12603547 11973421 11375803 10770226 10400312 9970184 9465740 9158626
12006 9158626 9079117 8909779 8626169 8439825 8326301 8162970 7981816 7918566 7791127 7497588
11996 7497588 7292313 7380636 7409757 7385627 7255902 7129717 7085205 6992049 6781072 6748716
$$ packed form
12056E9361892o880756o420847n407727m124556l104828k309385j569167j067679
12048B8476947m98537k88742M7233M84594R17426J491284J799375K482539K981493
12039C7893612L692500M411026N308308N559529M908008L279462R88248j617551
12031F4423142l795616n420692n919801n733532n228538m469233l832471l319637
12023B6703622k682967k122751j568760j454814j470971j154864j053602j014991
12015A4179902q53371p22984o30126n97618o05577l69914m30128n04444l07114
12006I158626p9509j69338k83610j86344j13524j63331j81154o3250j27439k93539
11996G497588k05275Q8323K9121k4130j29725j26185m4512r3156k10977l2356
$$ plain form
11986 6748716 6646685 6569709 6545544 6428639 6324237 6224908 6297177 6273681 6396521 6350169
11976 6350169 6295382 6241948 6197117 6102877 6118920 5998683 6080632 6153070 6279620 6321121 6251783
11965 6251783 6123522 6124568 6011240 5967312 5969771 5833768 5764656 5830216 5772099 5744876 5666528
11954 5666528 5744073 5725146 5675297 5671714 5582785 5612313 5564210 5449697 5499595 5558812 5584829
11943 5584829 5387483 5283085 5602161 5849787 5939060 5903068 5887789 5787287 5749332 5598884
11933 5598884 5399417 5307828 5226646 5138321 5191412 5329621 5333289 5440034 5377692 5193376 5218942
11922 5218942 5289601 5450328 5470460 5134667 5069040 5167480 5186994 5361017 5417510 5503772 5616224
11911 5616224 5488659 5269473 5280400 5376344 5487480 5624813 5539568 5445988 5589821 5553022
$$ packed form
11986F748716j02031p6976k4165j16905j04402r9329P2269k3496J22840m6352
11976F350169n4787n3434m4831r4240J6043j20237Q1949P2438J26550M1501o9338
11965F251783j28261J046j13328m3928K459j36003o9112O5560n8117k7223p8348
11954E666528P7545j8927m9849l583q8929K9528m8103j14513M9898N9217K6017
11943E584829j97346j04398L19076K47626Q9273l5992j5279j00502l7955j50448
11933E598884j99467r1589q1182q8325N3091J38209L668J06745o2342j84316K5566
11922E218942P0659J60727K0132l35793o5627R8440J9514J74023N6493Q6262J12452
11911E616224j27565k19186J0927R5944J11136J37333q5245r3580J43833l6799
$$ plain form
11901 5553022 5692617 5661667 5726756 5781313 5817143 5845687 5869202 5767789 5812957 5987194 6146411
11890 6146411 6230324 6342626 6814545 7125086 7268993 7455544 7512563 7737091 8150649 8454557
11880 8454557 8824143 9238580 9738829 10337083 11095062 12035581 13186648 14393550 15966323
11871 15966323 17842434 20145612 23048617 26260532 29503495 32871361 36052827 38493132
11863 38493132 40241376 41266311 41915987 42066175 41658446 40289716 38281529 35856137
11855 35856137 33134063 30436939 27956818 25837739 24318426 23096586 22244277 21839020
11847 21839020 21666455 21839974 22144434 22871961 24199457 25969080 28274014 30749166 33292247
11838 33292247 35452020 36678556 37371053 37679556 37650505 37363766 36513259 34677578 32343551
$$ packed form
11901E553022J39595l0950O5089N4557L5830K8544K3515j01413M5168J74237J59217
11890F146411Q3913J12302M71919L10541J43907J86551N7019K24528M13558L03908
11880H454557L69586M14437N00249N98254P57979R40519J151067J206902J572773
11871A5966323J876111K303178K903005L211915L242963L367866L181466K440305
11863C8493132J748244J024935O49676J50188m07729j368730k008187k425392
11855C5856137k722074k697124k480121k119079j519313j221840q52309m05257
11847B1839020j72565J73519L04460P27527J327496J769623K304934K475152K543081
11838C3292247K159773J226536O92497L08503k9051k86739q50507j835681k334027
$$ plain form
11829 32343551 29583975 26555513 23649270 21052171 18973579 17298047 15761229 14541629
11821 14541629 13540374 12707360 11918020 11244402 10568254 10108484 9661390 9265438 9054509
11812 9054509 8990951 8835563 8682602 8427284 8169940 8007520 7835670 7752818 7575400 7447891
11802 7447891 7389552 7371885 7433813 7636784 7746812 7931029 8190074 8307145 8266995 8276773
11792 8276773 8333140 8603146 9044815 9450015 9783955 10136502 10607790 11060207 11692344 12517742
11782 12517742 13468472 14373974 15540387 17191385 18984941 20734594 23067840 26112715
11774 26112715 29760980 33870765 38655977 43468600 47941298 52098489 55367389 57697098
11766 57697098 59468746 60357854 60374215 59632988 57570144 54477227 50903777 47225368 43293484
$$ packed form
11829C2343551k759576l028462k906243k597099k078592j675532j536818j219600
11821A4541629j001255q33014p89340o73618o76148m59770m47094l95952k10929
11812I054509o3558j55388j52961k55318k57344j62420j71850q2852j77418j27509
11802G447891n8339j7667O1928K02971J10028J84217K59045J17071m0150R778
11792H276773N6367K70006M41669M05200L33940L52547M71288M52417O32137Q25398
11782A2517742R50730R05502J166413J650998J793556J749653K333246L044875
11774B6112715L648265M109785M785212M812623M472698M157191L268900K329709
11766E7697098J771648Q89108J6361p41227k062844l092917l573450l678409l931884
$$ plain form
11757 43293484 39839493 36981220 34831868 33127465 32221853 31752573 31831611 32330707 33254561
11748 33254561 34833369 36989892 39465630 42008332 44751110 47246286 49379656 50679705
11740 50679705 51185510 51230492 50642915 49488017 47650586 44949896 41655054 38232169 34694624
11731 34694624 31283960 28365561 25733517 23450032 21448869 19585041 17881904 16498483
11723 16498483 15457880 14379638 13554152 12832479 12159897 11437517 10724332 10276695 9810838
11714 9810838 9262714 8924511 8684435 8423743 7943279 7627938 7413200 7241280 6810233
11705 6810233 6639289 6583388 6528224 6548533 6435486 6395693 6335448 6257503 6060772 5789492
11695 5789492 5557772 5494390 5521291 5388516 5286403 5281165 5287880 5309165 5248198 5194323 5130911
$$ packed form
11757D3293484l453991k858273k149352j704403r05612m69280P9038M99096R23854
11748C3254561J578808K156523K475738K542702K742778K495176K133370J300049
11740E0679705N05805M4982n87577j154898j837431k700690l294842l422885l537545
11731C4694624l410664k918399k632044k283485k001163j863828j703137j383421
11723A6498483j040603j078242q25486p21673o72582p22380p13185m47637m65857
11714I810838n48124l38203k40076k60692m80464l15341k14738j71920m31047
11705F810233j70944n5901n5164K0309j13047l9793o0245p7945j96731k71280
11695E789492k31720o3382K6901j32775j02113n238O715K1285o0967n3875o3412
$$ plain form
11684 5130911 5007766 4884720 5023286 4911741 4731354 4641821 4784153 4751190 4741906 4601805
11674 4601805 4340173 4297604 4201757 4141849 4148439 4157251 4193417 4416905 4557163 4495483 4422855
11663 4422855 4253533 4186200 4136015 4061344 4047663 4208394 4169827 4112959 4067902 3870688 3720655
11652 3720655 3738790 3764969 3672723 3684494 3758577 3793036 3724284 3819916 3846362 3606098 3482091
11641 3482091 3372905 3422582 3453328 3255271 3239053 3318527 3304580 3385023 3459030 3461096 3502433
11630 3502433 3619966 3701785 3763893 3739370 3532064 3407013 3488395 3478108 3467886 3486824 3405750
11619 3405750 3304519 3296313 3102802 3088009 3211467 3478769 3575812 3530599 3374088 3227612
11609 3227612 3110368 3158447 3236594 3318729 3327193 3050075 2919447 3075712 3355071 3424249
$$ packed form
11684E130911j23145j23046J38566j11545j80387q9533J42332l2963r284j40101
11674D601805k61632m2569r5847n9908O590Q812L6166K23488J40258o1680p2628
11663D422855j69322o7333n0185p4671j3681J60731l8567n6868m5057j97214j50033
11652C720655J8135K6179r2246J1771P4083L4459o8752R5632K6446k40264j24007
11641C482091j09186M9677L0746j98057j6218P9474j3947Q0443P4007K066M1337
11630C502433J17533Q1819O2108k4523k07306j25051Q1382j0287j0222J8938q1074
11619C405750j01231q206j93511j4793J23458K67302R7043m5213j56511j46476
11609C227612j17244M8079P8147Q2135Q464k77118j30628J56265K79359O9178
$$ plain form
11599 3424249 3341045 3176129 3117968 3053757 2955038 2913603 2973084 3040124 2955279 2902722 2820762
11588 2820762 2819863 2873490 2973082 2903792 2952379 2954090 2955727 2883254 2849160 2874415 2993055 2932345
11576 2932345 2802955 2585079 2647667 2805452 2682966 2549312 2580519 2671353 2704483 2583014
11566 2583014 2545600 2542687 2450853 2457488 2519309 2670671 2758879 2877767 2688238 2543083 2368108
11555 2368108 2157361 2258404 2470534 2392048 2218755 2256564 2444626 2517359 2464229 2316218
11545 2316218 2230216 2214717 2376895 2339717 2206968 2106456 2168636 2190490 2245596 2162146 2219597
11534 2219597 2154454 1968669 2066051 2193129 2025315 1918868 2262550 2304123 2194030 2101770
11524 2101770 2260783 2299840 2359710 2256492 2039295 1869714 1930082 1871387 1927366 2053949
$$ packed form
11599C424249q3204j64916n8161o4211r8719m1435N9481O7040q4845n2557q1960
11588B820762q99N3627R9592o9290M8587J711J637p2473l4094K5255J18640o0710
11576B932345j29390k17876O2588J57785j22486j33654L1207R0834L3130j21469
11566B583014l7414k913r1834O635O1821J51362Q8208J18888j89529j45155j74975
11555B368108k10747J01043K12130p8486j73293L7809J88062P2733n3130j48011
11545B316218q6002j5499J62178l7178j32749j00512O2180K1854N5106q3450N7451
11534B219597o5143j85785R7382J27078j67814j06447L43682M1573j10093r2260
11524B101770J59013L9057N9870j03218k17197j69581O0368n8695N5979J26583
$$ plain form
11514 2053949 2004669 1934650 1882646 2003408 2060771 1983722 1960120 1943294 1957332 2036856 2202221
11503 2202221 2136788 2109343 2155535 2182049 2117516 1924983 1911399 1991567 1958308 1945141 2098969
11492 2098969 2056735 2008605 2091619 2077702 2067930 2206018 2226219 2182885 2205223 2210443 2059249
11481 2059249 1973676 2102549 2073591 2044232 2154418 2160600 2311291 2489478 2540175 2286272
11471 2286272 2300299 2411395 2399602 2762708 2932992 2814428 2655262 2745621 3020991 3192664
11461 3192664 3107501 3261874 3353346 3444198 3558471 3743601 3864973 4127000 4377747 4724893
11451 4724893 5137932 5652010 6001893 6560580 7079484 7775598 8602810 9232661 10118027
11442 10118027 11026852 12177329 13528322 15285973 17433220 19761169 22762763 26370711
$$ packed form
11514B053949m9280p0019n2004J20762N7363p7049k3602j6826J4038P9524J65365
11503B202221o5433k7445M6192K6514o4533j92533j3584Q0168l3259j3167J53828
11492B098969m2234m8130Q3014j3917r772J38088K0201m3334K2338N220j51194
11481B059249q5573J28873k8958k9359J10186O182J50691J78187N0697k53903
11471B286272J4027J11096j1793L63106J70284j18564j59166R0359K75370J71673
11461C192664q5163J54373R1472R0852J14273J85130J21372K62027K50747L47146
11451D724893M13039N14078L49883N58687N18904O96114Q27212O29851Q85366
11442A0118027R08825J150477J350993J757651K147247K327949L001594L607948
$$ plain form
11434 26370711 30651383 35208214 40000409 44943324 49235545 52842477 55219170 56282216
11426 56282216 56205306 54516450 51573847 47822347 43536245 39174202 35061459 31115164
11418 31115164 27787619 24827899 22283357 20198910 18590053 17096679 15770395 14631709
11410 14631709 13763106 13000753 12261920 11444098 10849610 10455856 10052260 9745435 9468312
11401 9468312 9274986 9180045 9051454 8966472 8841129 8957514 9076604 9221895 9525936 9902972
11391 9902972 10394493 10868128 11444925 12344843 13217311 14186463 15573244 17171897 19351437
11382 19351437 21927877 25045362 28665839 32799991 37292948 41635102 45381465 48042666
11374 48042666 49705463 50252323 49548520 47706329 44941011 41578632 37958122 34227634
$$ packed form
11434B6370711M280672M556831M792195M942915M292221L606932K376693J063046
11426E6282216p6910j688856k942603l751500m286102m362043m112743l946295
11418C1115164l327545k959720k544542k084447j608857j493374j326284j138686
11410A4631709q68603p62353p38833q17822n94488l93754m03596l06825k77123
11401I468312j93326r4941j28591q4982j25343J16385J19090J45291L04041L77036
11391I902972M91521M73635N76797Q99918Q72468R69152J386781J598653K179540
11382A9351437K576440L117485L620477M134152M492957M342154L746363K661201
11374D8042666J662797N46860p03803j842191k765318l362379l620510l730488
$$ plain form
11366 34227634 30353805 26867387 23941354 21620038 19512127 17803718 16423052 15217285
11358 15217285 14204898 13394225 12697486 12260445 11690324 11154384 10995063 10863043 10848232
11349 10848232 10890888 11157311 11480965 11883610 12338424 12968821 13713460 14747178 16208101
11340 16208101 18321875 20834912 23780485 27097730 30598040 34176021 37264332 39710666
11332 39710666 41310953 41921597 41511495 39796867 37185103 33945582 30470829 27104991
11324 27104991 23894821 21055446 18664899 16670141 14978474 13598916 12766527 11966139
11316 11966139 11078957 10485419 9980660 9439502 8866647 8220431 7840944 7494077 7330057
11307 7330057 7221295 6957221 6594026 6460712 6363793 6458632 6678854 6941621 7017306 7059029
$$ packed form
11366C4227634l873829l486418k926033k321316k107911j708409j380666j205767
11358A5217285j012387q10673o96739m37041n70121n35940j59321j32020j4811
11349A0848232M2656K66423L23654M02645M54814O30397P44639J033718J460923
11340A6208101K113774K513037K945573L317245L500310L577981L088311K446334
11332C9710666J600287O10644m10102j714628k611764l239521l474753l365838
11324B7104991l210170k839375k390547j994758j691667j379558q32389q00388
11316A1966139q87182n93538n04759n41158n72855o46216l79487l46867j64020
11307G330057j08762k64074l63195j33314r6919R4839K20222K62767P5685M1723
$$ plain form
11297 7059029 7133242 7197753 7371682 7680389 8204829 8806041 9494239 10219383 11087838 12184872
11287 12184872 13731805 15819115 18294882 21116917 24086202 27046593 29949997 32265428
11279 32265428 34059115 35032704 34993775 34129230 32469910 29944189 27107672 24241428 21268644
11270 21268644 18607764 16283641 14279003 12951277 11747216 10586198 9650860 8826703
11262 8826703 8167219 7692598 7105055 6550599 6153899 5844876 5600667 5214564 4771984
11253 4771984 4558094 4390605 4069371 3925721 3856555 3741130 3705344 3484418 3293092 3105866
11243 3105866 3085097 3040944 2735035 2667502 2615253 2649749 2641673 2580316 2428124 2418092 2271820
11232 2271820 2274336 2401159 2391097 2288858 2048299 2188358 2382076 2281346 2192548 2178326
$$ packed form
11297G059029P4213O4511J73929L08707N24440O01212O88198P25144Q68455J097034
11287A2184872J546933K087310K475767K822035K969285K960391K903404K315431
11279C2265428J793687R73589l8929q64545j659320k525721k836517k866244k972784
11270B1268644k660880k324123k004638j327726j204061j161018r35338q24157
11262H826703o59484m74621n87543n54456l96700l09023k44209l86103m42580
11253D771984k13890j67489l21234j43650o9166j15425l5786k20926j91326j87226
11243C105866k0769m4153l05909o7533n2249L4496q076o1357j52192j0032j46272
11232B271820K516J26823j0062j02239k40559J40059J93718j00730q8798j4222
$$ plain form
11222 2178326 2067552 2081147 2016661 2066319 2155991 1888370 1837108 1917306 1865795 1902989 1919771
11211 1919771 1953682 2002071 1911713 1771239 1738006 1774707 1796858 1677358 1619728 1657857 1564809
11200 1564809 1561669 1614159 1772726 1842358 1823516 1732004 1546398 1499279 1455843 1391713 1375806
11189 1375806 1332043 1250908 1351082 1374970 1376965 1313831 1207410 1161511 1078082 1166996 1242224
11178 1242224 1247277 1306892 1270821 1314615 1391731 1409456 1404500 1379698 1354538 1129120 1113657
11167 1113657 958707 906540 1148726 1121299 1135340 1087178 1110595 1079823 1045253 974823 1136400
11156 1136400 1236918 1370906 1209033 1059259 1132540 1146006 1024881 1037357 1126004 1046191
11146 1046191 818951 664248 710501 882344 822444 796111 842800 794606 775440 733418 725197
$$ packed form
11222B178326j10774J3595o4486M9658Q9672k67621n1262Q0198n1511L7194J6782
11211A919771L3911M8389r0358j40474l3233L6701K2151j19500n7630L8129r3048
11200A564809l140N2490J58567O9632j8842r1512j85606m7119m3436o4130j5907
11189A375806m3763q1135J00174K3888J995o3134j06421m5899q3429Q8914P5228
11178A242224N053N9615l6071M3794P7116J7725m956k4802k5160k25418j5463
11167A113657j54950n2167K42186k7427J4041m8162K3417l0772l4570p0430J61577
11156A136400J00518J33988j61873j49774P3281J3466j21125J2476Q8647p9813
11146A046191k27240j54703M6253J71843n9900k6333M6689m8194j9166m2022q221
$$ plain form
11135 725197 728902 799932 760522 801187 815482 796515 824105 883198 988444 1116309 1052052
11124 1052052 884969 642374 495429 515275 577267 684411 666939 722002 774591 812451
11114 812451 869652 945257 836088 586339 490513 517045 435464 440302 384506 378701 472511
11103 472511 446196 361649 473437 785548 957808 954085 910583 699418 798159 737363 645721
11092 645721 661132 614644 489562 320518 326736 393422 499024 572767 660880 546900 488295
11081 488295 582574 529030 479699 551445 459960 564498 589868 476878 363301 392436 376309
11070 376309 494632 550374 481716 446738 318288 296542 359358 479948 452670 330788 442918
11059 442918 354878 401302 389846 564647 719827 724675 636060 491920 659820 819169 938873
$$ packed form
11135G25197L705P1030l9410M0665J4295j8967K7590N9093J05246J27865o4257
11124A052052j67083k42595j46945J9846O1992J07144j7472N5063N2589L7860
11114H12451N7201P5605j09169k49749r5826K6532q1581M838n5796n805R3810
11103D72511k6315q4547J11788L12111J72260l723m3502k11165R8741o0796r1642
11092F45721J5411m6488j25082j69044O218O6686J05602P3743Q8113j13980n8605
11081D88295R4279n3544m9331P1746r1485J04538K5370j12990j13577K9135j6127
11070C76309J18323N5742o8658l4978j28450k1746O2816J20590k7278j21882J12130
11059D42918q8040M6424j1456J74801J55180M848q8615j44140J67900J59349J19704
$$ plain form
11048 938873 1057682 1224875 1346738 1456139 1437391 1435101 1304872 1234467 1417735 1642815
11038 1642815 1825501 2038630 2287896 2357550 2513278 2403040 2064700 1839361 1762017 1773391
11028 1773391 1833729 2002288 2245761 2604780 3070240 3323278 3245110 3148362 2878993 2397995
11018 2397995 2087569 1912672 1750245 1802423 2001214 2188580 2304042 2446212 2375335 2044763
11008 2044763 1838595 1468326 1230116 1191367 1230065 1081420 956034 1163521 1314170 1329022
10998 1329022 1326410 1128746 880261 578691 552859 523600 418462 398445 464240 325804
10988 325804 278324 256426 407622 483482 679467 575364 408022 387477 289413 259991 210272
10977 210272 231245 257916 313877 366760 286763 173969 246573 474238 409734 311894 418484
$$ packed form
11048I38873J18809J67193J21863J09401j8748k290j30229p0405J83268K25080
11038A642815J82686K13129K49266O9654J55728j10238l38340k25339p7344J1374
11028A773391O0338J68559K43473L59019M65460K53038p8168r6748k69369m80998
11018B397995l10426j74897j62427N2178J98791J87366J15462J42170p0877l30572
11008B044763k06168l70269k38210l8749L8698j48645j25386K07487J50649J4852
10998A329022k612j97664k48485l01570k5832k9259j05138k0017O5795j38436
10988C25804m7480k1898J51196P5860J95985j04103j67342k0545r8064k9422m9719
10977B10272K0973K6671N5961N2883p9997j12794P2604K27665o4504r7840J06590
$$ plain form
10966 418484 383759 213161 87597 37453 36278 122094 183583 216927 252447 91186 84944
10955 84944 141299 177883 218251 2632 -79579 -53403 148677 41065 -22281 -125044 -72515
10944 -72515 33614 269604 280677 243135 207995 182745 194793 165667 171858 189519 50672
10933 50672 -40440 -274185 -227484 -217566 -65617 55997 13475 31070 78552 62758 11610
10922 11610 -33974 -120561 30304 167441 233067 281959 339473 331545 202957 -104749 -362728
10911 -362728 -407349 -294463 -268682 -316361 -325480 -206279 -285270 -358792 -439481 -493541 -544220
10900 -544220 -389932 -235877 -196145 -270934 -212554 -185513 -86531 -114222 -169385 -302932 -232739
10889 -232739 -128359 -141198 -160869 -203974 -186317 -107086 -94919 -90769 -190548 -171017 -212198
$$ packed form
10966D18484l4725j70598j25564n0144j175Q5816O1489L3344L5520j61261o242
10955H4944N6355L6584M0368k15619q2211K6176K02080j07612o3346j02763N2529
10944g2515J06129K35990J1073l7542l5140k5250J2048k9126O191J7661j38847
10933E0672r1112k33745M6701R918J51949J21614m2522J7595M7482j5794n1148
10922A1610m5584q6587J50865J37137O5626M8892N7514p928j28588l07706k57979
10911c62728m4621J12886K5781m7679r119J19201p8991p3522q0689n4060n0679
10900e44220J54288J54055L9732p4789N8380K7041R8982k7691n5163j33547P0193
10889b32739J04380j2839j9671m3105J7657P9231J2167M150r9779J9531m1181
$$ plain form
10878 -212198 -176898 -147985 -123617 -230705 -285415 -263565 -239652 -116352 -211138 -159846 -125521
10867 -125521 -365665 -482502 -571820 -602686 -411444 -325180 -409460 -373078 -330636 -384401 -219288
10856 -219288 -170394 -288970 -331404 -345741 -376975 -286125 -391168 -455612 -551783 -586338 -435003
10845 -435003 -272191 -169565 -148385 -231449 -265351 -314768 -284649 -365195 -269772 -207183 -290626
10834 -290626 -396507 -472321 -506334 -379741 -228435 -275103 -373930 -333120 -247902 -318938 -421103
10823 -421103 -415452 -244464 -334634 -453502 -673400 -707049 -679620 -630307 -486635 -424593 -520951
10812 -520951 -638211 -701582 -669500 -559299 -561211 -628583 -715242 -723153 -694103 -824617 -752473
10801 -752473 -554584 -614252 -764630 -818263 -717449 -638855 -662594 -674203 -639005 -757652 -767077
$$ packed form
10878b12198L5300K8913K4368j07088n4710K1850K3913J23300r4786N1292L4325
10867a25521k40144j16837q9318l0866J91242Q6264q4280L6382M2442n3765J65113
10856b19288M8894j18576m2434j4337l1234R0850j05043o4444r6171l4555J51335
10845d35003J62812J02626K1180q3064l3902m9417L0119q0546R5423O2589q3443
10834b90626j05881p5814l4013J26593J51306m6668r8827M0810Q5218p1036j02165
10823d21103N651J70988r0170j18868k19898l3649K7429M9313J43672O2042r6358
10812e20951j17260o3371L2082J10201j912o7372q6659p911K9050j30514P2144
10801g52473J97889n9668j50378n3633J00814P8594k3739j1609L5198j18647r425
$$ plain form
10790 -767077 -787402 -796068 -637083 -544183 -451452 -352034 -483716 -462103 -471301 -607630 -665926
10779 -665926 -827908 -891614 -768231 -672794 -733287 -744185 -613528 -663501 -915092 -907493 -884863
10768 -884863 -847744 -1018055 -1051212 -890881 -734195 -860027 -792189 -690977 -864466 -694798
10758 -694798 -854506 -1080197 -1081466 -924525 -858894 -733625 -736413 -817860 -792973 -876739 -1039666
10747 -1039666 -1238544 -1249463 -1011887 -1023427 -1156163 -1147795 -1028919 -1066584 -1195020 -1226406
10737 -1226406 -1180678 -1106791 -1024055 -973356 -998421 -1185899 -1217747 -1126578 -1155097 -1138101 -1001458
10726 -1001458 -1157142 -1253288 -1191492 -1136027 -931345 -776006 -690102 -842827 -1023439 -1267780
10716 -1267780 -1433585 -1408711 -1576644 -1678847 -1566177 -1460045 -1538409 -1457233 -1443636 -1519049
$$ packed form
10790g67077k0325q666J58985R2900R2731R9418j31682K1613r198j36329n8296
10779f65926j61982o3706J23383R5437o0493j0898J30657m9973k51591P599K2630
10768h84863L7119j70311l3157J60331J56686j25832O7838J01212j73489J69668
10758f94798j59708k25691j269J56941O5631J25269k788q1447K4887q3766j62927
10747a039666j98878j0919K37576j1540j32736Q368J18876l7665j28436l1386
10737a226406M5728P3887Q2736N0699k5065j87478l1848R1169k8519J6996J36643
10726a001458j55684r6146O1796N5465K04682J55339Q5904j52725j80612k44341
10716a267780j65805K4874j67933j02203J12670J06132p8364Q1176J3597p5413
$$ plain form
10706 -1519049 -1774464 -1990556 -2083416 -2014500 -2088612 -2043057 -1862218 -1731784 -1849062 -2011440
10696 -2011440 -1963429 -1966570 -2045795 -2201138 -2487176 -2379284 -2295103 -2206599 -2317894 -2372880 -2384177
10685 -2384177 -2439978 -2541258 -2598791 -2613377 -2676404 -2693643 -2660588 -2639482 -2616360 -2725740 -2695669
10674 -2695669 -2801606 -2741917 -2652047 -2783688 -2783468 -2789661 -2932659 -3056562 -3006663 -3091383 -2964964
10663 -2964964 -2865369 -2743255 -2704005 -2539182 -2663106 -2874472 -2923409 -2874609 -2782323 -2828089
10653 -2828089 -2907107 -2970583 -3021591 -3158338 -3220395 -3327660 -3210168 -2891367 -2689570 -2812257
10643 -2812257 -2850525 -2766120 -2602456 -2361039 -2136569 -1846560 -1419659 -825341 212158 1516777
10633 1516777 2545218 3028113 3413045 3931154 4598910 5564402 7100675 9273621 12602688
$$ packed form
10706a519049k55415k16092r2860O8916p4112M5555J80839J30434j17278j62378
10696b011440M8011l141p9225j55343k86038J07892Q4181Q8504j11295n4986j1297
10685b384177n5801j01280n7533j4586o3027j7239L3055K1106K3122j09380L0071
10674b695669j05937N9689Q9870j31641K20o193j42998j23903M9899q4720J26419
10663b964964R9595J22114L9250J64823j23924k11366m8937M8800R2286m5766
10653b828089p9018o3476n1008j36747o2057j07265J17492L18801K01797j22687
10643b812257l8268Q4405J63664K41417K24470K90009M26901N94318J037499J304619
10633A516777J028441M82895L84932N18109O67756R65492J536273K172946L329067
$$ plain form
10624 12602688 17780410 25075096 35316372 49592756 68717736 93653680 121758231
10617 121758231 145884269 158154694 157068370 148028100 137901920 131916948 133144099
10610 133144099 143653480 165615053 202116102 253903159 313320849 360310384 374054636
10603 374054636 354113315 317921473 283259668 259798423 251501074 260357325 288298409
10596 288298409 337551802 406691460 481903279 532834216 531805100 483674211 416425045
10589 416425045 354037398 307881573 280142535 270288095 278004415 302652795 340681421
10582 340681421 380244323 400048800 384164335 338997063 284321728 236148344 200711740
10575 200711740 178127914 166700488 164815934 170277986 180307608 189366282 189333873 175810765
$$ packed form
10624A2602688N177722P294686J0241276J4276384J9124980K4935944K8104551
10617A21758231K4126038J2270425j086324r040270j0126180n984972J227151
10610A33144099J0509381K1961573L6501049N1787057N9417690M6989535J3744252
10603C74054636j9941321l6191842l4661805k3461245q297349Q856251K7941084
10596B88298409M9253393O9139658P5211819N0930937j029116m8130889o7249166
10589D16425045o2387647m6155825k7739038r854440P716320K4648380L8028626
10582C40681421L9562902J9804477j5884465m5167272n4675335m8173384l5436604
10575B00711740k2583826j1427426j884554N462052J0029622R058674l2409j3523108
$$ plain form
10567 175810765 151912935 124955027 100722067 81117600 66282686 55440180 47232036
10560 47232036 40866247 35816839 31967082 28883784 26414592 24216834 22324509 20571361
10552 20571361 19023370 17797352 16756963 15724890 14856142 14029064 13149751 12459123 11993209
10543 11993209 11511274 10975798 10749927 10379553 10003494 9638091 9275196 9105554 8911038
10534 8911038 8663245 8543373 8376183 8201360 8074141 7777030 7570104 7366895 7085727
10525 7085727 6919498 6795974 6819186 6831091 6379388 6024578 5954227 6036312 6120317 5954957
10515 5954957 5899152 5704890 5438407 5401427 5360619 5324278 5442891 5366467 5423733 5561556
10505 5561556 5484244 5323557 5253146 5102259 4858502 4676936 4588516 4560559 4604998 4693615
$$ packed form
10567A75810765k3897830k6957908k4232960j9604467j4834914j0842506q208144
10560D7232036o365789n049408l849757l083298k469192k197758j892325j753148
10552B0571361j547991j226018j040389j032073q68748q27078q79313o90628m65914
10543A1993209m81935n35476k25871l70374l76059l65403l62895j69642j94516
10534H911038k47793j19872j67190j74823j27219k97111k06926k03209k81168
10525G085727j66229j23524K3212J1905m51703l54810p0351Q2085Q4005j65360
10515E954957n5805j94262k66483l6980m0808l6341J18613p6424N7266J37823
10505E561556p7312j60687p0411j50887k43757j81566q8420k7957M4439Q8617
$$ plain form
10495 4693615 4661015 4588202 4445009 4218892 4113607 4047416 4022093 4103877 4154126 4209945 4284982
10484 4284982 4264838 4317713 4231825 4044520 3780887 3627680 3461371 3341528 3462925 3631506
10474 3631506 3657100 3575405 3588384 3688623 3676317 3483432 3411244 3176160 2859648 2725452
10464 2725452 2750552 2886951 2940766 2834003 2749910 2605632 2639364 2738299 2817987 2854310 2474387
10453 2474387 2325735 2288484 2349225 2582158 2542654 2522345 2787058 2877179 2617274 2415798
10443 2415798 2402408 2213837 2283879 2321240 2181229 2113992 2114549 2149478 1970222 2068660 2237898
10432 2237898 2313961 2256503 2084779 2029660 1973120 2017716 1989049 2071776 2048134 2007898 2014541
10421 2014541 2172668 2151989 2027885 1905472 1668092 1647388 1573862 1535091 1614613 1783528
$$ packed form
10495D693615l2600p2813j43193k26117j05285o6191k5323Q1784N0249N5819P5037
10484D284982k0144N2875q5888j87305k63633j53207j66309j19843J21397J68581
10474C631506K5594q1695J2979J00239j2306j92885p2188k35084l16512j34196
10464B725452K5100J36399N3815j06763q4093j44278L3732R8935P9688L6323l79923
10453B474387j48652l7251O0741K32933l9504k0309K64713R0121k59905k01476
10443B415798j3390j88571P0042L7361j40011o7237N57L4929j79256R8438J69238
10432B237898P6063n7458j71724n5119n6540M4596k8667Q2727k3642m0236O643
10421B014541J58127k0679j24104j22413k37380k0704p3526l8771P9522J68915
$$ plain form
10411 1783528 2010626 1852620 1633247 1657076 1724503 1742445 1721495 1759773 1755205 1742126 1745698
10400 1745698 1650096 1689161 1676755 1763025 1716335 1580028 1418371 1414103 1562375 1614113 1687905
10389 1687905 1716239 1697790 1740607 1711199 1601272 1550995 1557088 1588388 1523530 1530136 1497503
10378 1497503 1514129 1624762 1452871 1435173 1624621 1736665 1708759 1583310 1566768 1486429
10368 1486429 1483309 1486270 1507066 1551239 1586454 1534125 1598469 1597402 1539256 1513622 1492459 1635726
10356 1635726 1697121 1806463 1561621 1573083 1805613 1872133 1931740 1924102 1814865 1804050 1830379
10345 1830379 1670554 1595440 1498129 1489158 1572721 1653157 1594368 1589300 1379634 1395420 1594968
10334 1594968 1492702 1179762 1264842 1263652 1196786 1250203 1289810 1385036 1511810 1524639 1453276
$$ packed form
10411A783528K27098j58006k19373K3829O7427J7942k0950L8278m568j3079L572
10400A745698r5602L9065j2406Q6270m6690j36307j61657m268J48272N1738P3792
10389A687905K8334j8449M2817k9408j09927n0277O093L1300o4858O606l2633
10378A497503J6626J10633j71891j7698J89448J12044k7906j25449j6542q0339
10368A486429l120K961K0796M4173L5215n2329O4344j067n8146k5634k1163J43267
10356A635726O1395J09342k44842J1462K32530O6520N9607p638j09237j0815K6329
10345A830379j59825p5114r7311q971Q3563Q0436n8789n068k09666J5786J99548
10334A594968j02266l12940Q5080j190o6866N3417L9607R5226J26774J2829p1363
$$ plain form
10323 1453276 1280409 1217224 1200434 1283429 1361363 1212562 1240754 1430042 1447300 1505045 1493109
10312 1493109 1365853 1265180 1130106 1208375 1217304 1210895 1374275 1219053 1213290 1409755 1233544
10301 1233544 1250319 1256153 1210333 1251662 1241407 1123751 1188669 1211995 1201327 1084333 994639
10290 994639 1007971 989682 1155889 1232101 1026038 1123782 1262982 1182040 965832 901068 920532
10279 920532 1039385 1251869 1354183 1348040 1286459 1210532 1281227 1362076 1321507 1216255 1164179
10268 1164179 1189662 1208970 1177529 1100467 1124637 1105236 960989 1044926 1062455 1156849 1197287
10257 1197287 1154059 1118125 1131589 1170856 1020235 963507 954121 1038230 1095919 1030006 973621
10246 973621 978136 936965 846416 719914 642368 538001 640224 784691 669543 738710 787543
$$ packed form
10323A453276j72867o3185j6790Q2995P7934j48801K8192J89288J7258N7745j1936
10312A493109j27256j00673j35074P8269Q929o409J63380j55222n763J96465j76211
10301A233544J6775N834m5820M1329j0255j17656O4918K3326j0668j16994q9694
10290I94639J3332j8289J66207P6212k06063R7744J39200q0942k16208o4764J9464
10279I20532J18853K12484J02314o143o1581p5927P0695Q0849m0569j05252n2076
10268A164179K5483J9308l1441p7062K4170j9401j44247Q3937J7529R4394M0438
10257A197287m3228l5934J3464L9267j50621n6728r386Q4109N7689o5913n6385
10246I73621M515m1171r0549j26502p7546j04367J02223J44467j15148O9167M8833
$$ plain form
10235 787543 867801 1158575 1023714 759805 760593 649528 671540 724049 885311 975781 1050782
10224 1050782 796411 744562 609714 508509 570676 520570 727585 806864 930391 1085373
10214 1085373 1178472 1098387 1004544 1033522 1109931 940103 862064 941601 877229 715421 864286
10203 864286 962183 840914 839830 812631 808451 795181 822567 843617 708025 660051 728594
10192 728594 759657 860655 772126 693903 668953 743911 812563 798368 989903 1421200 1717898
10181 1717898 1804395 1808665 1671251 1533396 1327515 1339612 1441510 1374063 1422058 1494769 1776604
10170 1776604 2318063 2841316 2991513 2977783 2789297 2564573 2398371 2404145 2575234 2558300
10160 2558300 2587001 2908015 3371303 3691392 3716281 3536964 3218251 2827902 2622685 2669675
$$ packed form
10235G87543Q0258K90774j34861k63909P88j11065K2012N2509J61262R0470P5001
10224A050782k54371n1849j34848j01205O2167n0106K07015P9279J23527J54982
10214A085373R3099q0085r3843K8978P6409j69828p8039P9537o4372j61808J48865
10203H64286R7897j21269j084k7199m180j3270K7386K1050j35592m7974O8543
10192G28594L1063J00998q8529p8223k4950P4958O8652j4195J91535M31297K96698
10181A717898Q6497M270j37414j37855k05881J2097J01898o7447M7995P2711K81835
10170A776604N41459N23253J50197j3730j88486k24724j66202N774J71089j6934
10160B558300K8701L21014M63288L20089K4889j79317l18713l90349k05217M6990
$$ plain form
10150 2669675 2411688 2364930 2329414 2466085 2704292 2711464 2639243 2524154 2451162 2083430
10140 2083430 1878224 1823891 1804480 1629697 1451590 1526458 1664949 1718991 1685242 1481463
10130 1481463 1457649 1284537 1033255 1086669 1267329 1060363 835255 768821 838589 780875
10120 780875 631963 590100 530211 585915 670784 706802 616822 561404 597987 657378 517325
10109 517325 539276 786468 948116 774940 742813 789221 848983 805714 1027856 1079251 1001312
10098 1001312 895125 728442 693535 737223 683521 721710 702871 633800 751663 838632 934772
10087 934772 1044622 1021897 981756 734275 512883 510558 560671 672826 652765 587161 624859
10076 624859 735289 634307 614572 598911 559175 616760 631467 756313 795062 782603 862642
$$ packed form
10150B669675k57987m6758l5516J36671K38207P172p2221j15089p2992l67732
10140B083430k05206n4333j9411j74783j78107P4868J38491N4042l3749k03779
10130A481463k3814j73112k51282N3414J80660k06966k25108o6434O9768n7714
10120G80875j48912m1863n9889N5704Q4869L6018q9980n5418L6583N9391j40053
10109E17325K1951K47192J61648j73176l2127M6408N9762m3269K22142N1395p7939
10098A001312j06187j66683l4907M3688n3702L8189j8839o9071J17863Q6969R6140
10087I34772J09850k2725m0141k47481k21392k325N0113J12155k0061o5604L7698
10076F24859J10430j00982j9735j5661l9736N7585J4707J24846L8749j2459Q0039
$$ plain form
10065 862642 861136 814251 632909 594789 577412 574060 607134 721677 724363 744659 554773
10054 554773 366494 303171 354014 440025 372659 326650 468941 598571 601207 606030 648674
10043 648674 644627 444399 378343 443354 496839 539339 533554 512569 652222 671183 599044
10032 599044 570114 603289 605540 478678 482667 363376 204943 272718 577113 590610 531127
10021 531127 467036 449409 382902 386911 265734 262579 507942 601511 601318 481662 505881 672391
10009 672391 678799 639575 761423 734982 573736 490576 394516 331129 540429 571794 713645
9998 713645 616060 429646 455127 578721 552831 521638 523617 621233 674812 720186 647582
9987 647582 562863 731219 756973 650396 531658 721881 874081 826310 832865 772435 805210
$$ packed form
10065H62642j506m6885j81342l8120j7377l352L3074J14543K686K0296j89886
10054E54773j88279o3323N0843Q6011o7366m6009J42291J29630K636M823M2644
10043F48674m047k00228o6056O5011N3485M2500n785k0985J39653J8961p2139
10032E99044k8930L3175K251j26862L989j19291j58433O7775L04395J3497n9483
10021E31127o4091j7627o6507M009j21177l155K45363R3569j93j19656K4219J66510
10009F72391O408l9224J21848k6441j61246q3160r6060o3387K09300L1365J41851
9998G13645r7585j86414K5481J23594k5890l1193J979R7616N3579M5374p2604
9987F47582q4719J68356K5754j06577j18738J90223J52200m7771O555o0430L2775
$$ plain form
9976 805210 601113 573282 608611 554274 420141 516371 553354 595287 497253 373494 475445
9965 475445 586237 600715 632629 506888 350445 222346 306292 427183 511174 651156
9955 651156 662582 606109 630513 759830 523157 292811 231263 223965 196932 251716 377803
9944 377803 352816 445712 610598 666800 640721 427919 284646 318805 376756 533249 415009
9933 415009 429071 499229 659742 530516 456098 428653 276499 312473 368239 359840 311262
9922 311262 258973 244228 386044 333712 305604 493443 614430 573596 501716 541930 383951
9911 383951 438293 445686 289255 296845 263805 336058 378077 352832 315296 447368 558305
9900 558305 450224 504250 649977 494643 321476 276778 279553 266564 383025 522444 472028
$$ packed form
9976H05210k04097k7831L5329n4337j34133R6230L6983M1933r8034j23759J01951
9965D75445J10792J4478L1914j25741j56443j28099Q3946J20891Q3991J39982
9955F51156J1426n6473K4404J29317k36673k30346o1548p298k7033N4784J26087
9944C77803k4987R2896J64886N6202k6079k12802j43273L4159N7951J56493j18240
9933D15009J4062P0158J60513j29226p4418k7445j52154L5974N5766q399m8578
9922C11262n2289j4745J41816n2332k8108J87839J20987m0834p1880M0214j57979
9911C83951N4342P393j56431P590l3040P2253M2019k5245l7536J32072J10937
9900E58305j08081N4026J45727j55334j73167m4698K775j2989J16461J39419n0416
$$ plain form
9889 472028 275179 210523 298671 244671 413613 506713 706673 569827 582955 565763 392994
9878 392994 540707 676776 620569 516342 455669 336338 415109 440065 344114 295423 410671
9867 410671 424046 333922 325916 390773 332427 381347 317917 349166 387651 412443 528760 536610
9855 536610 453941 650353 605539 525001 527494 352106 380192 531506 460624 455891 369913
9844 369913 465568 528168 355758 390441 488858 445387 483156 577067 647908 503311 240118
9833 240118 290421 146729 101578 230896 304737 340697 556230 516326 321780 212741 391688
9822 391688 538833 402939 337100 244109 263163 330157 487348 610771 595143 447762 518509
9811 518509 677707 805772 543751 336881 324244 352894 216360 187071 320471 243348
$$ packed form
9889D72028j96849o4656Q8148n4000J68942R3100J99960j36846J3128j7192j72769
9878C92994J47713J36069n6207j04227o0673j19331P8771K4956r5951m8691J15248
9867D10671J3375r0124q006O4857n8346M8920o3430L1249L8485K4792J16317P850
9855E36610q2669J96412m4814q0538K493j75388K8086J51314p0882m733q5978
9844C69913R5655O2600j72410L4683R8417m3471L7769R3911P0841j44597k63193
9833B40118N0303j43692m5151J29318P3841L5960K15533l9904j94546j09039J78947
9822C91688J47145j35894o5839r2991J9054O6994J57191J23423j5628j47381P0747
9811E18509J59198J28065k62021k06870j2637K8650j36534k9289J33400p7123
$$ plain form
9801 243348 360592 393113 248674 355942 239343 334482 444621 554307 694606 761448
9791 761448 490290 387042 384474 286455 249827 395564 375437 434309 457873 417968 204727
9780 204727 97197 104730 122654 197063 270302 458140 474400 432860 451884 383291 297693
9769 297693 292782 300282 356489 529688 715513 642506 730064 652390 693374 599261 471836
9758 471836 264352 181806 197783 12609 118455 373452 402955 449908 336413 247074 242224
9747 242224 154429 165317 259606 144475 134380 182310 150889 60833 302780 367352 239946
9736 239946 209904 275013 407330 355051 351593 480849 605418 611967 587492 526455 489562
9725 489562 358144 443017 519516 515419 351166 144458 267883 331014 454716 444445 255963
$$ packed form
9801B43348J17244L2521j44439J07268j16599R5139J10139J09686J40299O6842
9791G61448k71158j03248k568r8019l6628J45737k0127N8872K3564l9905k13241
9780B04727j07530P533J7924P4409P3239J87838J6260m1540J9024o8593q5598
9769B97693m911P500N6207J73199J85825p3007Q7558p7674M0984r4113j27425
9758D71836k07484q2546J5977j85174J05846K54997K9503M6953j13495q9339m850
9747B42224q7795J0888R4289j15131j0095M7930l1421r0056K41947O4572j27406
9736B39946l0042O5109J32317n2279l458J29256J24569O549k4475o1037l6893
9725D89562j31418Q4873P6499m097j64253k06708J23425O3131J23702j0271j88482
$$ plain form
9714 255963 178693 154596 252436 159317 141128 155635 216662 209048 114376 233443 230637 274949
9702 274949 298226 431854 378972 163511 41120 154227 47874 -62452 -69538 13477 270106
9691 270106 306224 247942 308816 258725 323682 235263 131877 74960 161949 269852 267222
9680 267222 285422 317396 224129 257959 121348 78917 226216 232528 209270 60049 -25689
9669 -25689 167972 261989 180225 160051 264126 111711 1652 95261 224698 197015 492103
9658 492103 572662 644685 919540 1368471 2414200 3803918 4006756 3073613 2010424 1421468
9648 1421468 1002847 716548 651369 744241 782935 652610 452987 453185 282024 81035 142428
9637 142428 376638 418252 305038 320415 323795 522819 476812 103429 57575 226290 532164
$$ packed form
9714B55963p7270k4097R7840r3119j8189J4507O1027p614r4672J19067k806M4312
9702B74949K3277J33628n2882k15461j22391J13107j06353j10326p086Q3015K56629
9691B70106L6118n8282O0874n0091O4957q8419j03386n6917Q6989J07903k630
9680B67222J8200L1974r3267L3830j36611m2431J47299O312k3258j49221q5738
9669b5689J93661R4017q1764k0174J04075j52415j10059R3609J29437k7683K95088
9658D92103Q0559P2023K74855M48931J045729J389718K02838r33143j063189n88956
9648A421468m18621k86299o5179R2872L8694j30325j99623J98j71161k00989O1393
9637A42428K34210M1614j13214J5377L380J99024m6007l73383m5854J68715L05874
$$ plain form
9626 532164 398156 324109 331441 254466 229180 330197 366022 222204 191992 38932 59836
9615 59836 189147 164607 107916 100981 205995 210379 211799 259536 190674 256556 403778 400263
9603 400263 462285 389190 98741 -35216 33684 55670 -2438 124192 320047 221735 65295
9592 65295 52612 179330 183055 271734 329307 382066 311642 429156 299743 181430 277167
9581 277167 376176 376356 294080 166226 200870 310302 234308 109435 268691 352483 256924
9570 256924 313251 121594 -53619 -32109 37048 56694 149461 24945 -104505 -182445 -116229
9559 -116229 127844 252593 222886 219505 345181 433884 341281 490617 628421 548260 463249
9548 463249 454118 420349 342399 305819 459104 387778 252537 343752 528047 576165 615254
$$ packed form
9626E32164j34008p4047P332p6975k5286J01017L5825j43818l0212j53060K0904
9615E9836J29311k4540n6691o935J05014M384J420M7737o8862O5882J47222l515
9603D00263O2022p3095k90449j33957O8900K1986n8108J26630J95855r8312j56440
9592F5295j2683J26718L725Q8679N7573N2759p0424J17514j29413j18313R5737
9581B77167R9009J80q2276j27854L4644J09432p5994j24873J59256Q3792r5559
9570B56924N6327j91657j75213K1510O9157J9646R2767j24516j29450p7940O6216
9559a16229K44073J24749k9707l381J25676Q8703r2603J49336J37804q0161q5011
9548D63249r131l3769p7950l6580J53285p1326j35241R1215J84295M8118L9089
$$ plain form
9537 615254 497716 489554 267938 90314 106163 227836 89590 46613 144532 171964 17779
9526 17779 112519 360995 534637 298273 201568 221243 161228 145241 -8278 96087 242321
9515 242321 370967 338572 337833 238893 1425 -5908 110021 203477 361103 316844 236697
9504 236697 235501 208841 35530 55317 207712 319198 419571 282541 176090 127540 74631
9493 74631 62928 236197 433801 281200 308701 286682 293591 361289 421477 424236 346239 242934
9481 242934 263860 242404 295045 183904 198167 153950 139398 107799 325932 532002 493658
9470 493658 329630 293387 298996 288460 232383 269935 345693 301498 187145 230996 256760
9459 256760 239366 229253 190649 267210 353722 412374 493867 359431 209343 116790 99926
$$ packed form
9537F15254j17538q162k21616j77624J5849J21673j38246m2977R7919K7432j54185
9526A7779R4740K48476J73642k36364r6705J9675o0015j5987j53519J04365J46234
9515B42321J28646l2395p39r8940k37468p333J15929R3456J57626m4259q0147
9504B36697j196k6660j73311J9787J52395J11486J00373j37030j06451m8550n2909
9493G4631j1703J73269J97604j52601K7501k2019O909O7698O0188K759p7997j03305
9481B42934K0926k1456N2641j11141J4263m4217j4552l1599K18133K06070l8344
9470D93658j64028l6243N609j0536n6077L7552P5758m4195j14353M3851K5764
9459B56760j7394j0113l8604P6561Q6512N8652Q1493j34436j50088r2553j6864
$$ plain form
9448 99926 35077 -48501 -107662 -53455 210482 332133 367849 550234 509513 354007 412942
9437 412942 499897 494652 288449 163925 257251 200121 161959 229159 198274 137429 92187
9426 92187 38681 94595 276358 391980 278375 143996 42349 43333 155829 177112 192608
9415 192608 180412 205803 186542 182535 169919 66053 -41793 -75744 56073 181645 293277
9404 293277 285925 331330 255103 233384 271024 279541 334537 306583 255095 121084 85916 -54227
9392 -54227 123639 257165 160643 -15671 16178 16686 -14405 -84720 -12104 111833 144084
9381 144084 58721 -124787 -55819 -134598 -312197 -333934 -320616 -265375 -88577 -76162 -185544
9370 -185544 -105146 -140035 -67286 -76471 26103 -60490 -215187 -306972 -335365 -230417 78367
$$ packed form
9448I9926o4849q3578n9161N4207K63937J21651L5716J82385m0721j55506N8935
9437D12942Q6955n245k06203j24524R3326n7130l8162O7200l0885o0845m5242
9426I2187n3506N5914J81763J15622j13605j34379j01647R84J12496K1283J5496
9415A92608j2196K5391j9261m007j2616j03866j07846l3951J31817J25572J11632
9404B93277p352M5405p6227k1719L7640Q517N4996k7954n1488j34011l5168j40143
9392e4227J77866J33526r6522j76314L1849N08l1091p0315P2616J23937L2251
9381A44084q5363j83508O8968p8779j77599k1737J3318N5241J76798J2415j09382
9370a85544Q0398l4889P2749r185J02574q6593j54697r1785k8393J04948L08784
$$ plain form
9359 78367 133884 205757 162540 74901 123903 215376 300582 351305 212290 2613 21938
9348 21938 89448 173685 305120 266240 -1234 -84104 -31615 21858 -110609 -7408 217010
9337 217010 218958 181385 142511 -117840 -67106 -1755 7133 150130 240513 253675 332059 321263
9325 321263 175099 92618 110204 71369 -90317 -298401 -278306 -205498 -232549 -188152 32036
9314 32036 190298 203560 182051 60912 25730 -4900 7316 84924 -9711 -47740 -23122
9303 -23122 83465 230846 314804 345705 267249 210690 359948 388564 410902 480546 266436
9292 266436 189457 246894 163281 229832 64981 -25429 50745 33485 64604 75662 114744
9281 114744 278978 293430 319630 353125 291121 193556 154714 205458 133683 10079 -144653
$$ packed form
9359G8367N5517P1873m3217q7639M9002R1473Q5206N0723j39015k09677J9325
9348B1938O7510Q4237J31435l8880k67474q2870N2489N3473j32467J03201K24418
9337B17010J948l7573l8874k60351N0734O5351Q888J42997R0383J3162P8384j0796
9325C21263j46164q2481J7586l8835j61686k08084K0095P2808k7051M4397K20188
9314C2036J58262J3262k1509j21139l5182l0630J2216P7608r4635l8029K4618
9303b3122J06587J47381Q3958L0901p8456n6559J49258K8616K2338O9644k14110
9292B66436p6979N7437q3613O6551j64851r0410P6174j7260L1119J1058L9082
9281A14744J64234J4452K6200L3495o2004r7565l8842N0744p1775j23604j54732
$$ plain form
9270 -144653 -274632 -114490 -117159 5438 147727 234236 150046 128679 286135 252922 206106
9259 206106 336643 140797 64237 139869 196791 49741 136962 308027 357963 337948 136736
9248 136736 39792 -47416 -58329 -5040 88726 238992 241005 98003 78288 -1799 82002
9237 82002 155897 279564 194452 29204 -40643 55482 22571 118537 243229 237865 191413
9226 191413 18946 -43947 230715 239370 73382 149430 200678 210898 229876 180002 91871
9215 91871 206859 275551 361517 357619 269463 235324 141084 241326 173635 135055 19814
9204 19814 40537 85009 -8129 1702 -33449 60649 117093 45693 -42049 -226688 -91956 116361
9192 116361 110921 27962 60134 105914 117062 184803 98042 179786 299044 305359 205482 210132
$$ packed form
9270a44653j29979J60142k669J22597J42289Q6509q4190k1367J57456l3213m6816
9259B06106J30537j95846p6560P5632N6922j47050Q7221J71065M9936k0015k01212
9248A36736r6944q7208j0913N3289R3766J50266K013j43002j9715q0087Q3801
9237H2002P3895J23667q5112j65248o9847R6125l2911R5966J24692n364m6452
9226A91413j72467o2893K74662Q655j65988P6048N1248J0220J8978m9874q8131
9215I1871J14988O8692Q5966l898q8156l4139r4240J00242o7691l8580j15241
9204A9814K0723M4472r3138R831l5151R4098N6444p1400q7742j84639J34732K08317
9192A16361n440q2959L2172M5780J1148O7741q6761Q1744J19258O315r9877M650
$$ plain form
9180 210132 302476 304011 214794 233801 160762 113072 95740 135837 121862 41485 -47378 -8515
9168 -8515 -5388 54545 120832 259265 444437 320236 103541 26924 -12819 7176 93115
9157 93115 -73499 -201947 -219029 -94101 10071 202462 261223 110160 330895 402040
9147 402040 353091 112999 61361 194119 150909 71673 41899 109782 127997 59318 125950
9136 125950 65355 -175127 -286138 -159012 81448 206750 133688 -48291 -35085 65635
9126 65635 189602 306856 149897 -40437 8358 136009 112651 124832 346071 325718 328016
9115 328016 144440 856 -138124 -95507 71431 56756 101588 46203 11834 124851 31661
9104 31661 36195 117545 71736 70921 118934 211527 112524 65359 114867 41639 54613 205783
$$ packed form
9180B10132R2344J535q9217J9007p3039m7690j7332M0097j3975q0377q8863L8863
9168h515L127N9933O6287J38433J85172j24201k16695p6617l9743J9995Q5939
9157I3115j66614j28448j7082J24928J04172J92391N8761j51063K20735P1145
9147D02040m8949k40092n1638J32758m3210p9236k9774O7883J8215o8679O6632
9136A25950o0595k40482j11011J27126K40460J25302p3062j81979J3206J00720
9126F5635J23967J17254j56959j90334M8795J27651k3358J2181K21239k0353K298
9115C28016j83576j43584j38980M2617J66938j4675M4832n5385l4369J13017r3190
9104C1661M534Q1350m5809q15M8013R2593r9003m7165M9508p3228J2974J51170
$$ plain form
9092 205783 190818 265585 239316 101604 96187 170613 162276 67005 -40511 -24833 111822
9081 111822 -28962 -56879 -116959 -216026 -94997 48702 61264 102100 194922 19806 -171706
9070 -171706 -294330 -311794 -297753 -246177 -125988 -41518 250294 356579 405370 368698 312596
9059 312596 104240 133077 24078 -67730 14329 141999 181250 149093 88123 -89891 -230943
9048 -230943 -222702 -86764 -58362 -105142 73070 171141 119840 134192 81328 4470 68583
9037 68583 -8244 -50975 -37402 -23920 61558 262822 409589 446267 256919 72228 -139945
9026 -139945 -264877 -206735 15747 73715 69065 76694 -99075 -86638 -4315 46958 24285
9015 24285 -60375 -90735 64639 320588 374227 296759 203599 193338 132065 66364 53661
$$ packed form
9092B05783j4965P4767k6269j37712n417P4426q337r5271j07516J5678J36655
9081A11822j40784k7917o0080r9067J21029J43699J2562M0836R2822j75116j91512
9070a71706j22624j7464J4041N1576J20189Q4470K91812J06285M8791l6672n6102
9059C12596k08356K8837j08999r1808Q2059J27670L9251l2157o0970j78014j41052
9048b30943Q241J35938K8402m6780J78212R8071n1301J4352n2864p6858O4113
9037F8583p6827m2731J3573J3482Q5478K01264J46767L6678j89348j84691k12173
9026a39945j24932N8142K22482N7968m650P629j75769J2437Q2323N1273k2673
9015B4285q4660l0360J55374K55949N3639p7468r3160j0261o1273o5701j2703
$$ plain form
9004 53661 182574 249342 348001 356459 288270 276763 321515 175669 81493 124253 97071 -26686
8992 -26686 -154835 -145601 -17421 173832 95167 4156 196499 375337 207733 3877 4034
8981 4034 -782 2760 15883 -52472 -40888 108614 235229 198429 81594 124416 78263 34971
8969 34971 -271 10450 -105438 -4820 27521 -101555 -131262 47154 105606 144452 163398
8958 163398 21465 42532 160426 151346 185847 54975 24556 -1746 -20353 48139 73746
8947 73746 -31672 -99742 -82238 -51992 -93991 -61509 -69059 -58517 -42182 19303 109078 154159
8935 154159 183249 112609 149533 126258 140985 160085 73002 -108234 -168603 -70866 -175222
8924 -175222 -105857 -54890 -88747 -108042 101341 174135 135229 168654 303079 227520 83887
$$ packed form
9004E3661J28913O6768R8659Q458o8189j1507M4752j45846r4176M2760k7182j23757
8992b6686j28149R234J28180J91253p8665r1011J92343J78838j67604k03856J57
8981D034m816L542J3123o8355J1584J49502J26615l6800j16835M2822m6153m3292
8969C4971l5242J0721j15888J00618L2341j29076k9707J78416N8452L8846J8946
8958A63398j41933K1067J17894r080L4501j30872l0419k6302j8607O8492K5607
8947G3746j05418o8070J7504L0246m1999L2482p550J0542J6335O1485Q9775M5081
8935A54159K9090p0640L6924k3275J4727J9100q7083j81236o0369R7737j04356
8924a75222O9365N0967l3857j9295K09383P2794l8906L3425J34425p5559j43633
$$ plain form
8913 83887 148282 86599 33954 287546 320985 339278 398457 342875 262326 170144 79425 121792
8901 121792 -28449 -80227 3977 206918 134975 379321 328769 335593 177637 118304 223493
8890 223493 285901 59645 19656 110173 173001 306438 330340 93679 -21065 28429 108290
8879 108290 206081 135309 -17636 73335 50128 111063 46758 290095 468717 423872 393799
8868 393799 472455 369760 204312 137910 180770 124756 55877 -67765 120648 65305 32481
8857 32481 -38551 103228 148804 44277 25228 104291 161774 186623 111807 75615 111472
8846 111472 349236 269419 130182 48696 127015 192959 230452 172715 73792 90547 111402
8835 111402 143143 115960 2268 36383 -33200 -119864 -123464 -210363 -3448 133841 -58449
$$ packed form
8913H3887O4395o1683n2645K53592L3439J8293N9179n5582q0549r2182r0719M2367
8901A21792j50241n1778Q4204K02941p1943K44346n0552O824j57956n9333J05189
8890B23493O2408k26256l9989R0517O2828J33437K3902k36661j14744M9494P9861
8879A08290R7791p0772j52945R0971k3207O0935o4305K43337J78622m4845l0073
8868C93799P8656j02695j65448o6402M2860n6014o8879j23642J88413n5343l2824
8857C2481p1032J41779M5576j04527j9049P9063N7483K4849p4816l6192L5857
8846A11472K37764p9817j39237q1486P8319O5944L7493n7737r8923J6755K0855
8835A11402L1741k7183j13692L4115o9583q6664l600q6899K06915J37289j92290
$$ plain form
8824 -58449 -158853 21508 149336 141839 290310 308678 206633 156986 50711 91625 173101
8813 173101 158556 111336 80135 123688 221565 335378 241579 144065 117415 153186 -3020
8802 -3020 21924 176040 200301 224949 160356 378833 432553 236140 -97110 -252143 -266823
8791 -266823 -104126 5714 59661 -117325 -214654 -156032 -160435 -273998 -126404 -25935 -87722
8780 -87722 9450 90219 30702 164122 234603 178177 209647 275488 259584 127462 165834
8769 165834 94682 111525 114677 -10341 110590 241205 250033 92984 26709 107340 144488
8758 144488 -27195 -33036 150661 337608 285686 269528 228299 17267 26116 190735 164688
8747 164688 159854 101119 255200 309528 221635 -33653 -167275 -245430 -105358 -113980 -114547 -75202
$$ packed form
8824e8449j00404J80361J27828p497J48471J8368j02045m9647j06275M0914Q1476
8813A73101j4545m7220l1201M3553R7877J13813r3799r7514k6650L5771j56206
8802c020K4944J54116K4261K4648o4593K18477N3720j96413l33250j55033j4680
8791b66823J62697J09840N3947j76986r7329N8622m403j13563J47594J00469o1787
8780h7722R7172Q0769n9517J33420P0481n6426L1470O5841j5904j32122L8372
8769A65834p1152J6843L152j25018J20931J30615Q828j57049o6275Q0631L7148
8758A44488j71683n841J83697J86947n1922j6158m1229k11032Q849J64619k6047
8747A64688m834n8735J54081N4328q7893k55288j33622p8155J40072q622n67L9345
$$ plain form
8735 -75202 -5848 66093 86835 100681 46930 78798 201118 208694 239146 169073 36405 13480
8723 13480 159566 155125 193447 78603 141030 120585 49794 65336 79454 178954 186797 228702
8711 228702 207770 301890 275817 218157 151806 -3610 85555 240998 201641 233668 177626
8700 177626 172138 126025 117046 -43160 -183493 -148153 29333 -41111 49494 104080 53023
8689 53023 137105 -49120 -14546 -47666 -127968 -207018 -107482 -59456 113282 99587 50800
8678 50800 77738 196155 134468 139568 141143 101003 131765 111725 74244 48270 225324 358649
8666 358649 307877 361672 115054 -15954 -42475 -53844 73237 214048 295989 193991 202464
8655 202464 270982 393712 301655 198591 104185 126050 164754 70712 1120 76432 256711
$$ packed form
8735g5202O9354P1941K0742J3846n3751L1868J22320P576L0452p0073j32668k2925
8723A3480J46086m441L8322j14844O2427k0445p0791J5542J4118R9500P843M1905
8711B28702k0932R4120k6073n7660o6351j55416Q9165J55443l9357L2027n6042
8700A77626n488m6113q979j60206j40333L5340J77486p0444R0605N4586n1057
8689E3023Q4082j86225L4574l3120q0302p9050R9536M8026J72738j3695m8787
8678E0800K6938J18417o1687N100J575m0140L0762k0040l7481k5974J77054J33325
8666C58649n0772N3795k46618j31008k6521j1369J27081J40811Q1941j01998Q473
8655B02464O8518J22730r2057j03064r4406K1865L8704r4042o9592P5312J80279
$$ plain form
8644 256711 262205 -61407 -207819 105079 267480 316031 234185 195261 109294 40519 -164018
8633 -164018 -103316 234129 283924 447798 401695 227844 104125 146538 174398 257395 415339
8622 415339 370049 232751 77257 45605 166919 300944 308981 398050 299752 210577 -744
8611 -744 -29172 -5092 28469 110007 213391 211214 199922 256783 221767 119561 34270 -14082
8599 -14082 50874 156880 246356 330795 279023 88457 175447 259726 116655 34708 162248
8588 162248 399378 354400 368692 473574 639085 664955 342129 126583 167586 246755 106074
8577 106074 40992 47921 248486 238923 179685 229787 360656 288366 104395 153456 107619
8566 107619 66732 169142 175622 48979 101511 122083 123936 224511 181869 -35312 -45562
$$ packed form
8644B56711N494l23612j46412L12898J62401M8551q1846l8924q5967o8775k04537
8633a64018O0702L37445M9795J63874m6103j73851j23719M2413K7860Q2997J57944
8622D15339m5290j37298j55494l1652J21314J34025Q037Q9069r8298q9175k11321
8611g44k8428K4080L3561Q1538J03384k177j1292N6861l5016j02206q5291m8352
8599a4082O4956J06006Q9476Q4439n1772j90566Q6990Q4279j43071q1947J27540
8588A62248K37130m4978J4292J04882J65511K5870l22826k15546M1003P9169j40681
8577A06074o5082O929K00565r563n9238N0102J30869p2290j83971M9061m5837
8566A07619m0887J02410O480j26643N2532K0572J853J00575m2642k17181j0250
$$ plain form
8555 -45562 -17028 98827 252856 220717 187170 85090 -43995 -9401 20732 19135 7011
8544 7011 -77224 -169391 -272858 -232645 101850 139670 158513 183132 272689 253447 296974 317363
8532 317363 360407 403217 349817 526100 566390 377454 220145 126856 305484 287951 365352
8521 365352 484278 383954 236831 144929 -12570 -120897 14189 -38772 6928 56476
8511 56476 39915 57874 200780 224541 127966 186453 262051 300035 292013 171608 145794 196000
8499 196000 202798 369680 185781 111398 9536 77071 121800 -6581 77433 131268 143031
8488 143031 116588 202458 173370 290941 213553 -2586 -12285 114801 114367 39513 161291
8477 161291 155949 252803 251493 230224 255041 386119 504301 487740 373839 340854 309749
$$ packed form
8555d5562K8534J15855J54029l2139l3547j02080j29085L4594L0133j597j2124
8544G011q4235r2167j03467M0213L34495L7820J8843K4619Q9557j9242M3527K0389
8532C17363M3044M2810n3400J76283M0290j88936j57309r3289J78628j7533P7401
8521C65352J18926j00324j47123r1902j57499j08327J35086n2961M5700M9548
8511E6476j6561J7959J42906K3761r6575N8487P5598L7984q022j20405k5814N0206
8499A96000O798J66882j83899p4383j01862O7535M4729j28381Q4014N3835J1763
8488A43031k6443Q5870k9088J17571p7388k16139r699J27086m34p4854J21778
8477A61291n342R6854j310k1269K4817J31078J18182j6561j13901l2985l1105
$$ plain form
8466 309749 241082 269842 57609 42379 -176922 -16978 210078 303419 322279 184365 49165
8455 49165 9114 106321 193225 230230 220560 265024 198389 106851 71895 38673 89373 103147
8443 103147 190735 444134 386919 254646 208285 221512 230813 168290 144577 214774 56452
8432 56452 115196 68060 73923 138532 144300 108465 31270 160574 303722 207094 197571 335015
8420 335015 453283 256168 119474 206772 201996 87229 68725 -42288 56825 109097 204937
8409 204937 268652 362281 568519 554895 416244 347103 235569 43755 -19297 -30585 20477
8398 20477 75231 -12704 66723 325442 316764 237030 292964 237025 165902 271618 196022 72630
8386 72630 135252 212381 241871 295367 241361 188265 350719 430072 240875 326063 422520
$$ packed form
8466C09749o8667K8760k12233j5230k19301J59944K27056R3341J8860j37914j35200
8455D9165m0051R7207Q6904L7005r670M4464o6635r1538l4956l3222N0700J3774
8443A03147Q7588K53399n7215j32273m6361J3227R301o2523k3713P0197j58322
8432E6452N8744m7136N863O4609N768l5835p7195J29304J43148r6628r523J37444
8420C35015J18268j97115j36694Q7298m776j14767j8504j11013R9113N2272R5840
8409B04937O3715R3629K06238j3624j38651o9141j11534j91814o3052j1288N1062
8398B0477N4754q7935P9427K58719q678p9734N5934n5939p1123J05716p5596j23392
8386G2630O2622P7129K9490N3496n4006n3096J62454P9353j89197Q5188R6457
$$ plain form
8375 422520 354585 280516 288002 116664 83424 243003 376943 260014 96465 60356 97207
8364 97207 -32717 36670 171933 190043 277405 303797 165786 158345 287143 310779 387051
8353 387051 381075 366791 218617 131660 202635 461966 695037 855638 801389 649510 529892
8342 529892 387260 427905 360027 470885 427868 355674 268487 402911 350408 378139 281681
8331 281681 328830 456506 524441 434428 391086 381961 350584 257700 271842 237968 355805
8320 355805 327810 207585 276533 360902 405133 498653 517249 419111 356004 415776 441289
8309 441289 435945 459358 460952 505150 725263 770781 773991 821379 643113 535710 478002 398886
8297 398886 310039 355725 401171 561791 658688 672881 645009 485228 515029 516629 298261
$$ packed form
8375D22520o7935p4069P486j71338l3240J59579J33940j16929j63549l6109L6851
8364I7207j29924O9387J35263J8110Q7362K6392j38011p441J28798K3636P6272
8353C87051n976j4284j48174q6957P0975K59331K33071J60601n4249j51879j19618
8342E29892j42632M0645o7878J10858m3017p2194q7187J34424n2503K7731r6458
8331B81681M7149J27676O7935r0013m3342r125l1377r2884J4142l3874J17837
8320C55805k7995j20225O8948Q4369M4231R3520J8596r8138o3107N9772K5513
8309D41289n344K3413J594M4198K20113M5518L210M7388j78266j07403n7708p9116
8297C98886q8847M5686M5446J60620R6897J4193k7872j59781K9801J600k18368
$$ plain form
8286 298261 164770 242761 73380 -21937 124588 220944 228537 281596 308471 291083 310596
8275 310596 229701 248933 225476 119459 172190 74733 74255 179446 334876 485156 482843
8264 482843 428757 528071 600311 358660 322414 411398 374716 499422 348219 206282 159152
8253 159152 255165 376949 467208 456025 289249 279343 230041 143738 224340 229356 468930
8242 468930 621503 442474 158644 254885 330409 410793 546507 485940 436055 575749 491782
8231 491782 278534 124085 55981 202621 316150 340252 246247 356128 527564 486383
8221 486383 264840 124270 148415 258463 346736 446016 242148 348179 353231 437567 445501
8210 445501 421661 248135 90565 196167 223555 144866 171167 221292 158378 151794 233294
$$ packed form
8286B98261j33491P7991j69381r5317J46525R6356P593N3059K6875j7388J9513
8275C10596q0895J9232k3457j06017N2731r7457m78J05191J55430J50280k313
8264D82843n4086R9314P2240k41651l6246Q8984l6682J24706j51203j41937m7130
8253A59152R6013J21784R0259j1183j66776r906m9302q6303Q0602N016K39574
8242D68930J52573j79029k83830R6241P5524Q0384J35714o0567m9885J39694q3967
8231D91782k13248j54449o8104J46640J13529K4102r4005J09881J71436m1181
8221D86383k21543j40570K4145J10048Q8273R9280k03868J06031N052Q4336P934
8210D45501k3840j73526j57570J05602K7388p8689K6301N0125o2914o584Q1500
$$ plain form
8199 233294 289936 341144 306849 256755 75521 114145 301205 274051 268447 397690 421661
8188 421661 423999 268395 378353 335486 254184 344263 565203 463942 334532 482769 634165
8177 634165 511886 375889 356282 277010 311749 286268 203746 143931 243450 110079 116431
8166 116431 175562 261176 298037 246673 255904 289881 259845 134936 139561 246518 302571 219349
8154 219349 120847 48374 103731 268779 359449 312273 187227 204461 160663 52702 -26595
8143 -26595 102103 364501 273633 129867 152448 123498 134443 250800 175429 91406 141880
8132 141880 284691 387352 338848 300309 225752 164416 156743 162263 129694 281227 326539
8121 326539 204921 328335 292802 66063 -21416 121671 240520 443109 573155 581287
$$ packed form
8199B33294N6642N1208l4295n0094j81234L8624J87060k7154n604J29243K3971
8188D21661K338j55604J09958m2867q1302R0079K20940j01261j29410J48237J51396
8177F34165j22279j35997j9607p9272L4739k5481q2522n9815R9519j33371O352
8166A16431N9131Q5614L6861n1364R231L3977l0036j24909M625J06957N6053q3222
8154B19349r8502p2473N5357J65048R0670m7176j25046J7234m3798j07961p9297
8143b6595J28698K62398r0868j43766K2581k8950J0945J16357p5371q4023N0474
8132A41880J42811J02661m8504l8539p4557o1336p673N520l2569J51533M5312
8121C26539j21618J23414l5533k26739q7479J43087J18849K02589J30046Q132
$$ plain form
8111 581287 503291 293288 327820 332390 336605 364541 234869 183742 -13556 -20944 82698
8100 82698 30363 203480 195581 18248 34239 98836 -5649 86946 228619 183349 272948
8089 272948 303423 52203 4760 -27124 -31370 72680 221363 135585 -132519 -195460 -113521
8078 -113521 -28320 127323 183259 168595 191321 161385 79378 -80826 56311 250571 322672
8067 322672 338943 457511 316066 222126 272379 155609 117626 146468 29423 -52300 -12179
8056 -12179 -114552 30196 170934 120283 192382 236335 157618 -20398 -105069 160728 321385
8045 321385 244559 147388 54244 -40729 -36564 91976 126013 206870 222488 186847 75248
8034 75248 33176 -28833 160808 297783 373003 397682 212799 153955 46066 -138765 -261822
$$ packed form
8111E81287p7996k10003L4532M570M215K7936j29672n1127j97298p388J03642
8100H2698n2335J73117p899j77333J5991O4597j04485R2595J41673m5270Q9599
8089B72948L0475k51220m7443l1884m246J04050J48683q5778k68104o2941Q1939
8078a13521Q5201J55643N5936j4664K2726k9936q2007j60204J37137J94260P2101
8067C22672J6271J18568j41445r3940N0253j16770l7983K8842j17045q1723M0121
8056a2179j02373J44748J40738n0651P2099M3953p8717j78016q4671K65797J60657
8045C21385p6826r7171r3144r4973M165J28540L4037Q0857J5618l5641j11599
8034G5248m2072o2009J89641J36975P5220K4679j84883n8844j07889j84831j23057
$$ plain form
8023 -261822 -233982 -210338 -147433 -118535 58986 138608 174425 284785 379185 331668 175962
8012 175962 139772 115564 -53487 -62350 -52557 -223308 -158220 52352 148015 281735 379301
8001 379301 376557 378023 279138 206384 275773 208568 230133 232788 137600 66817 -31968 13678
7989 13678 36925 36974 -19360 -24331 -90541 -146745 -14494 -91271 -151533 -12656 64745 6058
7977 6058 -80018 -98394 -110441 -64637 44964 67942 80350 36403 -124569 5466 108451
7966 108451 127664 55307 2068 -60421 -76430 -83453 -77593 41987 149038 143295 133619 177754
7954 177754 232946 212724 151162 129044 222403 108316 -60007 -88569 -21303 55224 168554
7943 168554 18750 -1413 -136858 -213415 -140406 48573 63475 232510 320085 291788 214347
$$ packed form
8023b61822K7840K3644O2905K8898J77521P9622L5817J10360R4400m7517j55706
8012A75962l6190k4208j69051q863R793j70751O5088K10572R5663J33720R7566
8001C79301k744J466r8885p2754O9389o7205K1565K655r5188p0783r8785M5646
7989A3678K3247M9n6334m971o6210n6204J32251p6777o0262J38877P7401n8687
7977F058q6076j8376j2047M5804J09601K2978J2408m3947j60972J30035J02985
7966A08451J9213p2357n3239o2489j6009p023N860J19580J07051n743r676M4135
7954A77754N5192k0222o1562k2118R3359j14087j68323k8562O7266P6527J13330
7943A68554j49804k0163j35445p6557P3009J88979J4902J69035Q7575k8297p7441
$$ plain form
7932 214347 61431 95661 64994 89710 72429 18322 97724 105497 36118 201565 320157
7921 320157 276043 287767 225424 94490 -48285 34997 51503 11934 120184 126049 221892
7910 221892 247181 177485 3769 129707 214161 183504 8160 -24989 78095 143158 202547
7899 202547 190177 258774 223960 190840 2746 -75907 -121457 66192 47381 -166190 -86377
7888 -86377 -92692 -206277 -177899 -12529 -118050 -76254 -1982 -12995 -48454 -33963 -1435
7877 -1435 -68176 -25414 -8038 -36932 -50154 61714 189072 145982 -42973 -197 102785
7866 102785 246804 182987 79788 91661 80680 87543 89126 138416 151989 195003 143348 120076
7854 120076 95705 119624 130696 202326 302816 242485 214965 187360 107783 281977 395220
$$ packed form
7932B14347j52916L4230l0667K4716j7281n4107P9402P773o9379J65447J18592
7921C20157m4114J1724o2343j30934j42775Q3282J6506l9569J08250N865R5843
7910B21892K5289o9696j73716J25938Q4454l0657j75344l3149J03084O5063N9389
7899B02547j2370O8597l4814l3120j88094p8653m5550J87649j8811k13571P9813
7888h6377o315j13585K8378J65370j05521M1796P4272j1013l5459J4491L2528
7877a435o6741M2762J7376k8894j3222J11868J27358m3090j88955M2776J02982
7866A02785J44019o3817j03199J1873j0981O863J583M9290J3573M3014n1655k3272
7854A20076k4371K3919J1072P1630J00490o0331k7520k7605p9577J74194J13243
$$ plain form
7843 395220 128991 154714 225573 383297 642019 497151 413829 412555 257295 105887 82200
7832 82200 56198 101467 266770 364098 372473 18329 -160634 -173770 -45384 110408 136617
7821 136617 143712 -19745 -127050 7021 -49178 -31498 -10794 -43875 -78755 -102570 -1292
7810 -1292 45677 -31397 -146225 -217571 -315566 -124949 -88066 -192683 -304596 -209243 -163259
7799 -163259 27753 89943 -80420 -75582 -162929 -112522 -40581 86327 16508 -145321 -166100
7788 -166100 -90845 10286 -53808 67733 141311 64929 63948 141275 141166 20943 -49816 -56983
7776 -56983 141201 160311 141948 168291 67383 -46432 -28395 195317 123194 17385 -88619
7765 -88619 71013 -38658 -198336 -166507 -85008 -41234 1043 38189 3038 59892 87808
$$ packed form
7843C95220k66229K5723P0859J57724K58722j44868q3322j274j55260j51408k3687
7832H2200k6002M5269J65303R7328Q375l54144j78963j3136J28386J55792K6209
7821A36617P095j63457j07305J34071n6199J7680K0704l3081l4880k3815J01278
7810a292M6969p7074j14828p1346r7995J90617L6883j04617j11913R5353M5984
7799a63259J91012O2190j70363M838q7347N0407P1941J26908o9819j61829k0779
7788a66100P5255J01131o4094J21541P3578p6382r81P7327j09j20223p0759p167
7776e6983J98184J9110j8363K6343j00908j13815J8037K23712p2123j05809j06004
7765h8619J59632j09671j59678L1829Q1499M3774M2277L7146l5151N6854K7916
$$ plain form
7754 87808 261579 302883 252353 186557 184099 146602 106339 131137 194011 54285 -83379
7743 -83379 -182215 -212320 -197607 -85765 10470 48625 45807 -17453 2484 99649 101099 189635
7731 189635 328091 245446 83093 -11621 50119 7263 233614 134573 -27763 -96039 10460
7720 10460 97911 175521 235201 434228 516375 494443 253460 213241 223946 116315 156433
7709 156433 219118 93549 -36235 -128770 -100821 51806 199872 321196 116130 63271
7699 63271 7667 -8783 -77811 -63340 -56562 -43679 -155873 -304037 -351119 -219006 -77060
7688 -77060 -25913 38539 128515 63895 115260 182764 56634 -64668 -64467 -24270 24571 90755
7676 90755 47654 -124220 -162252 -155893 3280 121028 94099 148758 39121 -33915 -127127
$$ packed form
7754H7808J73771M1304n0530o5796k458l7497m0263K4798O2874j39726j37664
7743h3379r8836l0105J4713J11842R6235L8155k818o3260J9937R7165J450Q8536
7731A89635J38456q2645j62353r4714O1740m2856K26351r9041j62336o8276J06499
7720A0460Q7451P7610N9680J99027Q2147k1932k40983m0219J0705j07631M0118
7709A56433O2685j25569j29784r2535K7949J52627J48066J21324k05066n2859
7699F3271n5604j6450o9028J4471O778J2883j12194j48164m7082J32113J41946
7688g7060N1147O4452Q9976o4620N1365O7504j26130j21302K01M0197M8841O6184
7676I0755m3101j71874l8032O359J59173J17748k6929N4659j09637p3036r3212
$$ plain form
7665 -127127 -38002 -9195 38860 115252 174556 102326 30370 21427 40553 145315 185124 201946
7653 201946 105143 32055 94707 102730 -24422 -172686 -341529 -253126 -94533 -111968 -56956
7642 -56956 -128884 -100629 14107 3255 -92182 -159731 -203647 -213255 -128353 85835 213674
7631 213674 56022 83743 210904 170570 -42654 -126328 -12100 -26098 -134880 -219444 -80708
7620 -80708 -38833 -2270 38954 90403 57640 110482 45090 -136236 -5207 72567 -34712
7609 -34712 113867 80042 2831 -139472 -171837 -225512 -292252 -164951 -42117 -65823 -119310
7598 -119310 -28425 -100379 -30678 66735 51374 151517 128641 72796 -19567 -231285 -175198
7587 -175198 -153759 27495 164675 237294 289420 247278 104781 -8645 20439 -6676 -27388
$$ packed form
7665a27127Q9125K8807M8055P6392N9304p2230p1956q943J9126J04762L9809J6822
7653B01946r6803p3088O2652Q023j27152j48264j68843Q8403J58593j7435N5012
7642e6956p1928K8255J14736j0852r5437o7549m3916r608Q4902K14188J27839
7631B13674j57652K7721J27161m0334k13224q3674J14228j3998j08782q4564J38736
7620h0708M1875L6563M1224N1449l2763N2842o5392j81326J31029P7774j07279
7609c4712J48579l3825p7211j42303l2365n3675o6740J27301J22834k3706n3487
7598a19310R0885p1954O9701R7413j5361J00143k2876n5845r2363k11718N6087
7587a75198K1439J81254J37180P2619N2126m2142j42497j13426K9084k7115k0712
$$ plain form
7576 -27388 43223 -4730 35038 -40333 -112239 67201 169121 143935 285852 138202 -97079
7565 -97079 -126948 -129997 -263237 -388792 -155087 -36309 -95139 -181503 -315144 -510363 -350032
7554 -350032 -35469 4814 58592 136564 200981 266487 268055 75326 -77459 31182 140230
7543 140230 61780 -197627 -371931 -441934 -405617 -184468 -80048 -37882 196390 273255 231383
7532 231383 -26870 -121832 -69002 -1419 175092 201698 111641 128793 218792 97429 45461
7521 45461 163738 178709 174585 158254 54753 78418 39096 122703 120177 208034 179041 94085
7509 94085 40996 59493 55943 -42216 -148528 49411 191001 74088 -51283 -72502 114437
7498 114437 -8751 -99653 -100643 44394 145264 60689 83510 -111913 -272223 -334030 -183320
$$ packed form
7576b7388P0611m7953L9768p5371p1906J79440J01920k5186J41917j47650k35281
7565i7079k9869l049j33240j25555K33705J18778n8830q6364j33641j95219J60331
7554c50032L14563M0283N3778P7972O4417O5506J568j92729j52785J08641J09048
7543A40230p8450k59407j74304p0003L6317K21149J04420M2166K34272P6865m1872
7532B31383k58253r4962N2830O7583J76511K6606r0057J7152Q9999j21363n1968
7521D5461J18277J4971m124j6331j03501K3665l9322Q3607k526Q7857k8993q4956
7509I4085n3089J8497l550r8159j06312J97939J41590j16913j25371k1219J86939
7498A14437j23188r0902r90J45037J00870q4575K2821j95423j60310o1807J50710
$$ plain form
7487 -183320 -206914 -347080 -240550 -72125 47392 -2681 -111319 -216066 -87480 44299
7477 44299 289052 298085 235746 66766 4672 -91005 -100480 43226 120481 244898 191407
7466 191407 118346 190495 194336 21703 119272 131377 -7701 -106865 -6750 93075 25941
7455 25941 -127776 -124693 -68538 -74477 -120287 -85566 -105113 -195550 -365659 -461535 -491103 -429658
7443 -429658 -434134 -378389 -166121 -106359 -39524 -43472 -258226 -391640 -408392 -189355 -89841
7432 -89841 -54872 94682 50335 -71048 64566 -3647 55008 -148511 -220352 -217496 -193003
7421 -193003 -244099 -171667 201 158317 234060 307048 262247 191470 -100691 -161103 -57074
7410 -57074 26859 -161939 -352050 -300424 -96072 -7192 -81281 -83497 -98336 -79367 -125326
$$ packed form
7487a83320k3594j40166J06530J68425J19517n0073j08638j04747J28586J31779
7477D4299K44753R033o2339j68980o2094r5677r475J43706P7255J24417n3491
7466A91407p3061P2149L841j72633R7569J2105j39078r9164J00115R9825o7134
7455B5941j53717L083N6155n939m5810L4721j9547r0437j70109r5876k9568O1445
7443d29658m476N5745K12268N9762O6835l948k14754j33414j6752K19037R9514
7432h9841L4969J49554m4347j21383J35614o8213N8655k03519p1841K856K4493
7421a93003n1096P2432J71868J58116P5743P2988m4801p0777k92161o0412J04029
7410e7074Q3933j88798j90111N1626K04352Q8880p4089k216j4839J8969m5959
$$ plain form
7399 -125326 -165936 -254314 -188475 -114249 -216958 -208135 -157491 -201479 -225008 -154216 -41845
7388 -41845 -142101 -148868 -127122 -105113 -94285 -80779 -59770 -55949 102934 92102 -120657 -229370
7376 -229370 -176135 -213941 -308750 -151221 -50990 -76295 -90596 -130850 -84284 68175 72521
7365 72521 44667 70202 188470 162625 267277 328980 99725 98777 6785 -121933 -170092
7354 -170092 25095 243598 54566 -101769 -165634 -114226 92766 -65554 -135775 -165605
7344 -165605 -269838 -439671 -413443 -397138 -281036 -104008 -207059 -326761 -277756 -229702
7334 -229702 -267950 -240253 -205542 -155054 -34972 108986 32314 -241700 -184896 -77061 -73281
7323 -73281 -124688 -94330 -128532 21554 75240 78850 104140 173270 242789 142743 113259 146324
$$ packed form
7399a25326m0610q8378O5839P4226j02709Q823N0644m3988k3529P0792J12371
7388d1845j00256o767K1746K2009J0828J3506K1009L821J58883j0832k12759j08713
7376b29370N3235l7806r4809J57529J00231k5305j4301m0254M6566J52459M346
7365G2521k7854K5535J18268k5845J04652O1703k29255r48r1992j28718m8159
7354a70092J95187K18503j89032j56335o3865N1408K06992j58320p0221k9830
7344a65605j04233j69833K6228J6305J16102J77028j03051j19702M9005M8054
7334b29702l8248K7697L4711N0488J20082J43958p6672k74014N6804J07835L780
7323g3281n1407L0358l4202J50086N3686L610K5290O9130O9519j00046k9484L3065
$$ plain form
7311 146324 -209 -113001 30591 34370 -194804 -344111 -304378 -231842 -263700 -282100 -162492
7300 -162492 -4904 96350 88692 -102050 -164831 -287615 -149780 30609 -106889 -290768
7290 -290768 -355530 -253896 -36117 53182 24107 41682 73680 332669 313119 97818 -34167
7279 -34167 -162054 12481 172939 144391 50263 71370 62501 -11742 -67156 -70776 -100033 -221269
7267 -221269 -135862 -184457 -156935 -205868 -247141 -236089 -170773 -206256 -192300 -181700 -247854 -146769
7255 -146769 -76943 -112683 -97590 -123809 -200842 -267751 -242768 -314334 -357252 -216668 -88674
7244 -88674 63974 119256 80027 154063 102029 -11456 -64791 -122468 -190371 -11641 8950
7233 8950 38295 -80017 -56995 -41035 75277 11183 70657 94798 106585 -37107 -278869
$$ packed form
7311A46324j46533j12792J43592L779k29174j49307L9733P2536l1858j8400J19608
7300a62492J57588J01254p658j90742o2781j22784J37835J80389j37498j83879
7290b90768o4762J01634K17779Q9299k9075J7575L1998K58989j9550k15301j31985
7279c4167j27887J74535J60458k8548r4128K1107q869p4243n5414l620k9257j21236
7267b21269Q5407m8595K7522m8933m1273J1052O5316l5483J3956J0600o6154J01085
7255a46769O9826l5740J5093k6219p7033o6909K4983p1566m2918J40584J27994
7244h8674J52648N5282l9229P4036n2034j13485n3335n7677o7903J78730K0591
7233H950K9345j18312K3022J5960J16312o4094N9474K4141J1787j43692k41762
$$ plain form
7222 -278869 -332490 -185790 -149975 -220985 -279801 -169628 -127429 -93236 -187709 -208328 -191889
7211 -191889 -230388 -321282 -193774 -93807 -175962 -135372 -182370 -261803 -312682 -380790 -184921
7200 -184921 21685 672 -120236 -16542 -166263 -261541 -106358 -32731 -52586 -43269 -57393
7189 -57393 -112438 -192888 -17658 116920 167820 109858 68944 85502 132483 206841 73803
7178 73803 -230822 -351167 -357471 -326832 -280049 -111209 -294080 -325638 -108585 -148155 -194863
7167 -194863 -165492 56230 61620 -110287 -228779 -139131 -106607 -96015 149909 133727 234829
7156 234829 284706 162036 -160951 -8602 65327 -49410 -43234 -209549 -331376 -335588 -321089
7145 -321089 -345523 -368040 -323451 -264312 -205035 -242385 -258717 -159108 -58453 44525 -79417
$$ packed form
7222b78869n3621J46700L5815p1010n8816J10173M2199L4193r4473k0619J6439
7211a91889l8499r0894J27508R9967q2155M0590m6998p9433n0879o8108J95869
7200a84921K06606k1013j20908J03694j49721r5278J55183P3627j9855R317j4124
7189e7393n5045q0450J75230J34578N0900n7962m0914J6558M6981P4358j33038
7178G3803l04625j20345o304L0639M6783J68840j82871l1558K17053l9570m6708
7167a94863K9371K21722N390j71907j18492Q9648L2524J0592K45924j6182J01102
7156B34829M9877j22670l22987J52349P3929j14737O176j66315j21827m212J4499
7145c21089k4434k2517M4589N9139N9277l7350j6332R9609J00655J02978j23942
$$ plain form
7134 -79417 -132693 -116952 -119971 -39527 57903 168635 204614 171333 21438 -121873 -82142
7123 -82142 4838 -44215 -75071 -169632 -211641 -260634 -252481 -180009 -77761 -182083 -385977
7112 -385977 -226222 -63637 -14666 -99821 -254167 -254604 -225686 -296712 -422812 -304199 -94967
7101 -94967 -5908 -156508 -102125 14868 78898 50766 -84605 -65444 94070 25601 -87527
7090 -87527 -218505 -435043 -387551 -407291 -447704 -302207 -46653 94581 112818 145740 3826
7079 3826 66804 123792 141415 -6085 -114525 -170170 -124734 -103959 -68884 -135399 -118312 -2248
7067 -2248 -100499 -104040 -47641 -111990 -183072 -304095 -284660 -103292 -2327 46563 -15135 -10176
7055 -10176 5897 75117 107394 110172 114443 139657 19 -30959 -167511 -208115 -255809 -215818
$$ packed form
7134g9417n3276J5741l019Q0444R7430J10732L5979l3281j49895j43311L9731
7123h2142Q6980m9053l0856r4561m2009m8993Q153P2472J02248j04322k03894
7112c85977J59755J62585M8971q5155j54346m37K8918p1026j26100J18613K09232
7101i4967Q9059j50600N4383J16993O4030k8132j35371J9161J59514o8469j13128
7090h7527j30978k16538M7492j9740m0413J45497K55554J41234J8237L2922j41914
7079C826O2978N6988J7623j47500j08440n5645M5436K0775L5075o6515J7087J16064
7067b248r8251l541N6399o4349p1082j21023J9435J81368J00965M8890o1698M959
7055a0176J6073O9220L2277K778M271K5214j39638l0978j36552m0604m7694L9991
$$ plain form
7043 -215818 -14578 -43738 -71324 -97384 -202416 -171676 -193156 -120333 -23125 -55875 -50853
7032 -50853 -54492 -32841 -58598 -88879 -147867 -124268 -74429 -108505 -154653 -171968 -150580 -82277
7020 -82277 -132729 -41563 97005 189821 228027 -74365 -167455 -148494 -40327 -51047 -207641
7009 -207641 -152052 -65367 -110547 -226934 -243350 -245962 -320369 -197637 -59000 71103 50187
6998 50187 15846 89929 285231 182261 29598 53003 142386 79508 23835 -37944 -170654
6987 -170654 -197436 -137495 -88273 -168339 -91188 -170629 -79094 24725 12877 27951 54309
6976 54309 -1428 -84979 -161642 -46791 92450 23027 -65847 -70357 -69976 -43135 -11160 -98209
6964 -98209 -288074 -334870 -283119 -99644 -144290 -78429 -59571 -124391 -329063 -339396 37120
$$ packed form
7043b15818K01240k9160k7586k6060j05032L0740k1480P2823R7208l2750N022
7032e0853l639K1651k5757l0281n8988K3599M9839l4076m6148j7315K1388O8303
7020h2277n0452R1166J38568R2816L8206l02392r3090J8961J08167j0720j56594
7009b07641N5589Q6685m5180j16387j6416k612p4407J22732J38637J30103k0916
6998E0187l4341P4083J95302j02970j52663K3405Q9383o2878n5673o1779j32710
6987a70654k6782N9941M9222q0066P7151p9441R1535J03819j1848J5074K6358
6976E4309n5737q3551p6663J14851J39241o9423q8874m510L81K6841L1975q7049
6964i8209j89865m6796N1751J83475m4646O5861J8858o4820k04672j0333L76516
$$ plain form
6953 37120 126041 61597 -110344 -240034 -93325 69355 102674 90434 182303 46243 30608
6942 30608 -5945 -119096 -94274 -105496 7224 -94922 -126014 -133173 119849 100977 -72260
6931 -72260 -181336 -61065 -45856 -100480 -125525 -11097 93349 79516 90563 -31805 -63459
6920 -63459 -169032 -154824 -25020 8172 -29040 -119314 -71091 12425 -95636 -57833 -163780
6909 -163780 -249661 -58695 100869 102938 -74744 -68213 -75807 -234995 -462582 -323719 -89898
6898 -89898 -55264 31670 -8853 -5908 -56060 -86730 47912 34023 -14987 -140472 -211003 -84660
6886 -84660 49885 224014 391036 212045 145786 -539 -14234 88830 141873 91025 49647
6875 49647 -55441 -288902 -306709 -164226 -223607 -315758 -496850 -401735 -105472 -23645 -119109
$$ packed form
6953C7120Q8921o4444j71941j29690J46709J62680L3319j2240R1869j36060j5635
6942C0608l6553j13151K4822j1222J12720j02146l1092p159K53022j8872j73237
6931g2260j09076J20271J5209n4624k5045J14428J04446j3833J1047j22368l1654
6920f3459j05573J4208J29804L3192l7212r0274M8223Q3516j08061L7803j05947
6909a63780q5881J90966J59564K069j77682O531p594j59188k27587J38863K33821
6898h9898L4634Q6934m0523K945n0152l0670J34642j3889m9010j25485p0531J26343
6886h4660J34545J74129J67022j78991o6259j46325j3695J03064N3043n0848m1378
6875D9647j05088k33461j7807J42483n9381r2151j81092R5115K96263Q1827r5464
$$ plain form
6864 -119109 -160019 -312847 -361136 -186951 -266884 -250432 -17363 73546 -100399 -258979 -145577
6853 -145577 25271 64716 5480 -38129 -75635 -61876 -61747 61609 178952 88507 4346
6842 4346 26365 -42126 -191677 -326872 -230690 -101623 -250931 -395213 -422904 -375011 -382644
6831 -382644 -276002 -279965 -298047 -117676 -130077 -197795 -62499 150106 141349 74864 -146196
6820 -146196 26777 62292 -63653 -47724 -21734 -54294 -168189 -174971 -28398 1658 -312377
6809 -312377 -290867 95638 120493 55285 62884 166263 98834 -16742 -8990 49130 -85127
6798 -85127 -195997 -219158 -202876 -244198 -225060 -248267 -84891 -50076 -21378 -114881 -147247
6787 -147247 -115089 -19730 -72753 -172405 -118512 -81556 -211173 -277200 -186559 -36339 63984
$$ packed form
6864a19109m0910j52828m8289J74185p9933J6452K33069R0909j73945j58580J13402
6853a45577J70848L9445n9236m3609l7506J3759J29J23356J17343r0445q4161
6842D346K2019o8491j49551j35195R6182J29067j49308j44282k7691M7893p633
6831c82644J06642l963j8082J80371j2401o7718J35296K12605q757o6485k21060
6820a46196J72973L5515j25945J5929K5990l2560j13895o782J46573L0056l14035
6809c12377K1510L86505K4855o5208P599J03379o7429j15576P752N8120j34257
6798h5127j10870k3161J6282m1322J9138k3207J63376L4815K8698r3503l2366
6787a47247L2158R5359n3023r9652N3893L6956j29617o6027R0641J50220J00323
$$ plain form
6776 63984 -111259 -289244 -240660 -347915 -389477 -225684 -171704 -228415 -353528 -354314 -199090
6765 -199090 -52986 20720 45627 -140260 -309488 -142144 -42562 -236901 -246920 -138543
6755 -138543 62444 107383 45692 3315 150016 145234 -2987 -80083 -1108 -97386 -141859
6744 -141859 -152232 86883 148576 260817 110295 40329 115972 214445 168258 43592 -15372
6733 -15372 -59244 -266379 -237532 -55774 -92177 -238568 -339573 -226383 -250059 -304186 -359104
6722 -359104 -280937 -377740 -283066 -262817 -500879 -419442 -220961 -212359 -78246 -112208 -275394
6711 -275394 -336992 -206692 -67835 -69488 -67478 -58689 -4924 9502 173439 -95150 -237493
6700 -237493 -100477 18123 -2318 -148119 -103497 -101889 41849 -14337 -140067 -140324 -140437 -260821
$$ packed form
6776F3984j75243j77985M8584j07255m1562J63793N3980n6711j25113p86J55224
6765a99090J46104P3706K4907j85887j69228J67344R9582j94339j0019J08377
6755a38543K00987M4939o1691m2377J46701m782j48221p7096P8975r6278m4473
6744a41859j0373K39115O1693J12241j50522o9966P5643R8473m6187j24666n8964
6733a5372m3872k07135K8847J81758l6403j46391j01005J13190k3676n4127n4918
6722c59104P8167r6803R4674K0249k38062Q1437J98481Q602J34113l3962j63186
6711b75394o1598J30300J38857j653K010Q789N3765J4426J63937k68589j42343
6700b37493J37016J18600k0441j45801M4622J608J43738n6186j25730k57j13j20384
$$ plain form
6688 -260821 -251035 -39727 -101253 -24786 -9235 79946 34083 82995 178797 167639 212362 208890
6676 208890 247866 15803 -151233 -27629 -11350 -88645 -105771 -43782 8736 -30636 -48487
6665 -48487 -128944 -321838 -322082 -196921 -202315 -4703 -53706 -227275 -189421 -69420 -30475
6654 -30475 -127907 -90012 -7085 -35135 -98725 -173541 -213193 -236325 -189361 -58400 -30282 -98915
6642 -98915 -17360 -123097 -50071 -22393 -49634 122608 183803 49091 -175712 -137145 -102555
6631 -102555 -137921 -151486 -149517 -289348 -364744 -313038 -231598 -108324 121514 -17232 -202161
6620 -202161 -183132 -384456 -376248 -131388 -84347 -263440 -408713 -446201 -320239 -212294 -109171
6609 -109171 -9009 154105 135553 53249 -126245 -94770 -209067 -197132 -199921 -130242 14685
$$ packed form
6688b60821R786K11308o1526P6467J5551Q9181m5863M8912R5802j1158M4723l472
6676B08890L8976k32063j67036J23604J6279p7295j7126O1989N2518l9372j7851
6665d8487q0457j92894k44J25161n394J97612m9003j73569L7854J20001L8945
6654c0475r7432L7895Q2927k8050o3590p4816l9652k3132M6964J30961K8118o8633
6642i8915Q1555j05737P3026K7678k7241J72242O1195j34712k24803L8567L4590
6631a02555l5366j3565J969j39831p5396N1706Q1440J23274K29838j38746j84929
6620b02161J9029k01324Q208K44860M7041j79093j45273l7488J25962J07945J03123
6609a09171J00162J63114j8552q2304j79494L1475j14297J1935k789O9679J44927
$$ plain form
6598 14685 32943 -235321 -369404 -316701 -214808 -177102 -133388 -166974 -242973 -155273 -74461
6587 -74461 -136617 -288684 -285607 -154918 44080 109012 -1267 -153715 -175369 -146603 -199839
6576 -199839 -118482 -675 75595 -83649 -235952 -220208 -157570 -243871 -375206 -411155 -322896
6565 -322896 -351556 -190467 -180184 -261900 -180781 -53775 -68138 -174774 -244455 -131607 63811
6554 63811 188638 226375 88192 -102931 -25665 10127 -76350 -265533 -458135 -162011 -155151
6543 -155151 -180036 -265777 -252701 -267263 -291370 -326744 -106175 -35261 10141 63740 202957
6532 202957 116854 31772 54258 54518 -104078 -192042 -25463 -132804 -112473 -218923 -259129
6521 -259129 -187419 97029 233094 143972 90592 152189 88055 -149962 -288069 -295780 -246612
$$ packed form
6598A4685J8258k68264j34083N2703J01893L7706M3714l3586p5999Q7700Q0812
6587g4461o2156j52067L077J30689J98998O4932j10279j52448k1654K8766n3236
6576a99839Q1357J17807P6270j59244j52303J5744O2638q6301j31335l5949Q8259
6565c22896k8660J61089J0283q1716Q1119J27006j4363j06636o9681J12848J95418
6554F3811J24827L7737j38183j91123P7266L5792q6477j89183j92602K96124O860
6543a55151k4885q5741J3076j4562k4107l5374K20569P0914M5402N3599J39217
6532B02957q6103q5082K2486K60j58596q7964J66579j07341K0331j06450m0206
6521b59129P1710K84448J36065q9122n3380O1597o4134k38017j38107p711M9168
$$ plain form
6510 -246612 -456379 -513719 -310502 -198198 -95536 -93959 -85773 -184950 -201810 -72912 9020
6499 9020 50302 -62266 -231957 -236937 -51800 105142 198813 215150 159538 102003 -24661
6488 -24661 -162971 -37689 -164201 -231609 -322215 -474747 -316475 -85553 -150418 -270660
6478 -270660 -202824 -15756 9415 41015 105583 133706 41309 -135464 -75997 -36646 -40426
6467 -40426 27774 167686 108208 27947 -34087 -32323 -94985 -133456 -85727 -89225 -122246 -174406
6455 -174406 -87528 66860 -123776 -310701 -128183 -115896 23988 118244 27224 -54223 -183880
6444 -183880 -89047 -98387 12657 152705 103743 -12511 -3426 901 -184009 -264491 -382654
6433 -382654 -249194 -171293 -153646 -99887 -29543 44044 28702 -34067 8334 -102380 -158411
$$ packed form
6510b46612k09767n7340K03217J12304J02662J577Q186r9177j6860J28898Q1932
6499I020M1282j12568j69691m980J85137J56942R3671J6337n5612n7535j26664
6488b4661j38310J25282j26512o7408r0606j52532J58272K30922o4865j20242
6478b70660O7836J87068K5171L1600O4568K8123r2397j76773N9467L9351l780
6467d0426O8200J39912n9478q0261o2034J764o2662l8471M7729l498l3021n2160
6455a74406Q6878J54388j90636j86925J82518J2287J39884R4256r1020q1447j29657
6444a83880R4833r340J11044J40048m8962j16254R085M327j84910q0482j18163
6433c82654J33460P7901J7647N3759P0344P3587j5342o2769M2401j10714n6031
$$ plain form
6422 -158411 -143654 -51050 38181 -136018 -256884 -146569 -186061 -253564 -110144 129573 206762
6411 206762 178451 96568 52060 -10260 -43671 -112558 -201352 -236828 -218789 -220437 -193055 -333193
6399 -333193 -459347 -410372 -344552 -389213 -303614 -413404 -453569 -180944 172333 271489 154058
6388 154058 22476 -25112 70133 144277 -49139 -265312 -429296 -296485 -43577 -73114
6378 -73114 -197063 -146772 -121351 -156238 -91284 30343 -11230 -292491 -344461 -137510 25764
6367 25764 66532 -37734 -15746 -54359 -183543 -212300 -263359 -104845 -80363 -195659 -351353
6356 -351353 -298834 -302425 -192997 -40773 -129530 -148651 -356469 -273500 -109477 172617 71472
6345 71472 65051 -230 109399 220748 251229 111708 -8983 -245068 -290848 -235594 -191971
$$ packed form
6422a58411J4757R2604Q9231j74199j20866J10315l9492o7503J43420K39717P7189
6411B06762k8311q1883m4508o2320l3411o8887q8794l5476J8039j648K7382j40138
6399c33193j26154M8975O5820m4661Q5599j09790m0165K72625L53277R9156j17431
6388A54058j31582m7588R5245P4144j93416k16173j63984J32811K52908k9537
6378g3114j23949N0291K5421l4887O4954J21627m1573k81261n1970K06951J63274
6367B5764M0768j04266K1988l8613j29184k8757n1059J58514K4482j15296j55694
6356c51353N2519l591J09428J52224q8757j9121k07818Q2969J64023K82094j01145
6345G1472o421o5281J09629J11349L0481j39521j20691k36085m5780N5254M3623
$$ plain form
6334 -191971 -126408 -11340 101907 145860 54679 -32292 -52208 -39652 -85898 -46104 31119
6323 31119 19136 -98139 -208998 -126219 -79567 -95782 -213895 -99699 85379 53041 -7337
6312 -7337 -21600 -6376 33559 -739 -60904 -54715 -157590 -252518 -199279 -8078 14809 -139570
6300 -139570 -309845 -374847 -268394 -46894 -142298 -171867 -25390 18959 174989 110298 108106
6289 108106 92278 -3397 34183 -51241 -151312 -204384 -231209 -181943 -218037 -116972 -149140
6278 -149140 -184387 -169484 -190244 -187537 -228779 -276736 -255084 -294241 -343030 -340836 -281780 -123530
6266 -123530 -71014 -229398 -193115 -171953 -352333 -308072 -168173 -246577 -221642 -143561 -175107
6255 -175107 -156965 -174650 -31205 -26467 -149369 -209074 -109428 -9946 62148 -139788 -97047
$$ packed form
6334a91971O5563J15068J13247M3953r1181q6971j9916J2556m6246L9794P7223
6323C1119j1983j17275j10859Q2779M6652j6215j18113J14196J85078l2338o0378
6312g337j4263J5224L9935l4298o0165O189j02875r4928N3239J91201K2887j54379
6300a39570j70275o5002J06453K21500r5404k9569J46477M4349J56030o4691k192
6289A08106j5828r5675L7580q5424j00071n3072k6825M9266l6094J01065l2168
6278a49140l5247J4903k0760K707m1242m7957K1652l9157m8789K194N9056J58250
6266a23530N2516j58384L6283K1162j80380M4261J39899p8404K4935P8081l1546
6255a75107J8142j7685J43445M738j22902n9705R9646R9482P2094k01936M2741
$$ plain form
6244 -97047 -8808 -73784 -54381 -59903 -63342 -103333 -78754 -99275 -41461 42326 38763 76465
6232 76465 237070 325066 204323 97384 -77901 -217611 -222663 -185258 -54018 38248 38101
6221 38101 145975 11289 -132373 -264187 -331756 -119372 -2353 14881 114499 147734 162302
6210 162302 103435 63141 7228 -50564 -81075 -189742 -236603 -355847 -420802 -358003 -316829
6199 -316829 -124052 -113249 -5133 170444 101963 118682 152599 180977 109728 21964 3413
6188 3413 85220 -66118 -341524 -314324 -281602 -187174 -90224 -88462 -157922 -47624 -38781 -42355
6176 -42355 -73437 -33875 84358 145437 102544 17564 -2247 -111011 -205629 -206198 -174181 -165663
6164 -165663 -115988 -24555 70619 117900 155602 261122 230324 117410 118972 -26494 -206034
$$ packed form
6244i7047Q8239o4976J9403n522l439l9991K4579k0521N7814Q3787l563L7702
6232G6465J60605Q7996j20743j06939j75285j39710n052L7405J31240R2266j47
6221C8101J07874j34686j43662j31814o7569K12384J17019J7234R9618L3235J4568
6210A62302n8867m0294n5913n7792l0511j08667m6861j19244o4955O2799M1174
6199c16829J92777J0803J08116J75577o8481J6719L3917K8378p1249q7764j8551
6188C413Q1807j51338k75406K7200L2722R4428R6950J762o9460J10298Q843l574
6176d2355l1082L9562J18233O1079m2893q4980j9811j08764r4618n69L2017Q518
6164a65663M9675R1433R5174M7281L7702J05520l0798j12914J562j45466j79540
$$ plain form
6153 -206034 -124609 -160603 -87978 95461 146232 104015 17830 10862 29868 -60546 -127547 -83247
6141 -83247 28847 -13812 -205919 -403129 -435983 -510489 -396315 -270685 -258080 -381664 -443109
6130 -443109 -174372 -96729 -254060 -321967 -366526 -280677 -253055 -132207 -134262 -199372 -231591
6119 -231591 -279539 -199423 -232076 -336431 -404873 -382579 -377845 -368071 -272277 -149269 -202858 -304130
6107 -304130 -117391 14386 65355 -45651 -168266 -165079 -196673 -308524 -264720 -225361 -132342
6096 -132342 -169316 -195342 -273849 -281241 -226256 -12328 141226 210594 168125 122927 153360
6085 153360 44535 -157384 -315759 -137405 -164828 -276700 -268256 -195009 -127044 -189037 -360376
6074 -360376 -439269 -345967 -378372 -400459 -212509 -56299 -6713 150774 302269 167432 111368
$$ packed form
6153b06034Q1425l5994P2625J83439N0771m2217q6185o968J9006r0414o7001M4300
6141h3247J12094m2659j92107j97210l2854p4506J14174J25630J2605j23584o1445
6130d43109K68737P7643j57331o7907m4559Q5849K7622J20848k055o5110l2219
6119b31591m7948Q0116l2653j04355o8442K2294M734R774R5794J23008n3589j01272
6107c04130J86739J31777N0969j11006j22615L187l1594j11851M3804L9359R3019
6096a32342l6974k6026p8507p392N4985K13928J53554O9368m2469m5198L0433
6085A53360j08825k01919j58375J78354k7423j11872Q444P3247O7965o1993j71339
6074c60376p8893R3302l2405k2087J87950J56210M9586J57487J51495j34837n6064
$$ plain form
6063 111368 65135 -69564 -288514 -331299 -176745 -145050 -121323 103168 139024 178662 201204
6052 201204 114908 125533 113091 52658 -80784 -161187 -233471 -271910 -187117 -276667 -365798
6041 -365798 -342138 -219966 -29321 -117571 -173032 -132824 -185179 -209403 -159939 -186175 -207017
6030 -207017 -114745 -218392 -258625 -350993 -214433 -219335 -179583 -27379 -48037 57874 77807
6019 77807 152701 200121 113813 135245 240987 263550 92466 -174256 -263728 -230130 -145752
6008 -145752 -133407 -169993 -197456 -112938 -85239 -283271 -171702 -190136 -266208 -329222 -483319
5997 -483319 -326863 -209212 -186373 -60687 -6742 -25674 -55984 -169863 -321781 -325255 -243281
5986 -243281 -253812 -68288 -13507 -110483 -9189 32345 -147513 -290683 -155541 -93056 -1271
$$ packed form
6063A11368m6233j34699k18950m2785J54554L1695K3727K24491L5856L9638K2542
6052B01204q6296J0625j2442o0433j33442q0403p2284l8439Q4793q9550q9131
6041c65798K3660J22172J90645q8250n5461M0208n2355k4224M9464k6236k0842
6030b07017R2272j03647m0233r2368J36560m902L9752J52204k0658J05911J9933
6019G7807P4894M7420q6308K1432J05742K2563j71084k66722q9472L3598Q4378
6008a45752J2345l6586k7463Q4518K7699j98032J11569j8434p6072o3014j54097
5997d83319J56456J17651K2839J25686N3945j8932l0310j13879j51918l474Q1974
5986b43281j0531J85524N4781r6976J01294M1534j79858j43170J35142O2485R1785
$$ plain form
5975 -1271 52912 168109 72612 67027 82777 129119 267122 298299 190659 227123 25807
5964 25807 -95791 -123459 -190103 -60918 -26246 -76919 87830 171227 91759 126865 217159
5953 217159 125044 252439 248779 240659 219121 148791 -138200 -77756 9946 -17427 804 -72209
5941 -72209 -179818 -210324 -341001 -382697 -258027 -213453 -121348 -69450 -83470 -41294 9901
5930 9901 -4994 45975 61416 -67918 -251212 -247294 -86614 -147985 -173662 -172499 -208915 -175052
5918 -175052 -71075 -83692 -176328 -31292 27316 9806 132466 218625 -10939 -219320 -326612
5907 -326612 -140920 -9649 136362 193391 255420 245932 62666 14945 85795 -28855 -117282
5896 -117282 -73606 13914 90503 197670 40155 -15168 -44806 -230624 -303468 -177569 -42845
$$ packed form
5975a271N4183J15197r5497n585J5750M6342J38003L1177j07640L6464k01316
5964B5807j21598k7668o6644J29185L4672n0673J64749Q3397p9468L5106R0294
5953B17159r2115J27395l660q120k1538p0330k86991O0444Q7702k7373J8231p3013
5941g2209j07609l0506j30677m1696J24670M4574R2105N1898j4020M2176N1195
5930I901j4895N0969J5441j29334j83294L918J60680o1371k5677J163l6416L3863
5918a75052J03977j2617r2636J45036N8608j7510J22660Q6159k29564k08381j07292
5907c26612J85692J31271J46011N7029O2029r488j83266m7721P0850j14650q8427
5896a17282M3676Q7520P6589J07167j57515n5323k9638j85818p2844J25899J34724
$$ plain form
5885 -42845 76478 -52366 -132669 -293362 -343821 -281994 -255194 -414797 -265730 -113973 -111576
5874 -111576 -96965 -143151 -118256 -234198 -281211 -281647 -225396 -158018 -173431 -92394 -110212 -233482
5862 -233482 -363115 -309144 63498 220391 198820 51723 -131137 -283199 -152436 -70693
5852 -70693 -73123 -61938 -15051 80744 96886 118129 15189 -25020 -25874 -6845 -50063 -157917
5840 -157917 -319611 -404757 -321444 -206583 -150619 -7021 70394 140199 118844 12564 -35707
5829 -35707 29391 -41509 -108275 -233786 -241111 -192098 -194805 -152053 -149109 -253815 -153245 -126411
5817 -126411 -74473 -157520 -132922 -57182 -109197 -111331 -78020 -154098 -181844 -72426 -80446 -12296
5805 -12296 188777 271725 256348 238294 77373 34526 -127177 -98371 117943 162444 83599
$$ packed form
5885d2845J19323j28844q0303j60693n0459O1827K6800j59603J49067J51757K397
5874a11576J4611m6186K4895j15942m7013m36N6251O7378j5413Q1037j7818j23270
5862b33482j29633N3971L72642J56893k1571j47097j82860j52062J30763Q1743
5852g0693k430J1185M6887R5795J6142K1243j02940m0209q54J9029m3218j07854
5840a57917j61694q5146Q3313J14861N5964J43598P7415O9805k1355j06280m8271
5829c5707O5098p0900o6766j25511p325M9013k707M2752K944j04706J00570K6834
5817a26411N1938q3047K4598P5740n2015k134L3311p6078k7746J09418q020O8150
5805a2296K01073Q2948j5377j8054j60921m2847j61703K8806K16314M4501p8845
$$ plain form
5794 83599 -18790 -156240 -211234 -67938 158 -13485 18193 155237 -14427 -233556 -126226
5783 -126226 -131595 -69685 13917 56331 -12277 -216348 -306526 -154241 -45908 -65464 -28445
5772 -28445 25374 -5941 37999 150464 125527 115285 25171 146869 266065 169834 87262
5761 87262 -10064 -88545 -119845 -17300 -113025 -215015 -385447 -417185 -212643 -148150 -123762
5750 -123762 -129838 -152849 44148 151186 -39502 -115960 -29551 -113607 34401 177949 186259
5739 186259 89935 29508 -198091 -258703 -207699 -141517 19285 130859 68820 156028 95969
5728 95969 88255 48528 191451 180117 -980 -106739 -141285 -35882 -115798 -38104 -23229
5717 -23229 -94205 -251107 -215776 -58795 -72729 -19986 24247 38210 16910 -58269 -271670
$$ packed form
5794H3599j02389j37450n4994J43296O8096j3643L1678J37044j69664k19129J07330
5783a26226n369O1910Q3602M2414o8608k04071r0178J52285J08333j9556L7019
5772b8445N3819l1315M3940J12465k4937j0242r0114J21698J19196r6231q2572
5761H7262r7326p8481l1300J02545r5725j01990j70432l1738K04542O4493K4388
5750a23762o076k3011J96997J07038j90688p6458Q6409q4056J48008J43548Q310
5739A86259r6324o0427k27599o0612N1004O6182J60802J11574o2039Q7208o0059
5728I5969p714l9727J42923j1334j81097j05759l4546J05403p9916P7694J4875
5717b3229p0976j56902L5331J56981j3934N2743M4233J3963k1300p5179k13401
$$ plain form
5706 -271670 -267438 -136974 -46103 -49861 -156414 -228160 -147253 -204166 -154812 -71409 -78771 19021
5694 19021 -12379 -207435 -314380 -196193 -189193 -175595 -18150 -27302 -40697 -104660 -220380
5683 -220380 -254945 -306095 -302714 -198232 -182462 -158915 -1360 -59076 -106084 -28519 58715
5672 58715 5721 28550 -54571 -28491 100699 48294 -76611 -8037 121829 68715 -18033
5661 -18033 -53075 -11723 -139750 -221383 -140019 -149157 -284044 -152984 -114633 -141710 -257328
5650 -257328 -371325 -337392 -224794 -176920 -122481 -50476 -176123 -75243 -60746 -232436 -297324
5639 -297324 -323982 -299527 -125126 -40572 -5611 -88209 -35833 -11209 76650 76350 -22748 -221093
5627 -221093 -208079 -316297 -321310 -319989 -196965 -20776 -16805 -10072 13254 126590 101235 21077
$$ packed form
5706b71670M232J30464R0871l758j06553p1746Q0907n6913M9354Q3403p362R7792
5694A9021l1400j95056j06945J18187P000J3598J57445r152j3395o3963j15720
5683b20380l4565n1150L381J04482J5770K3547J57555n7716m7008P7565Q7234
5672E8715n2994K2829q3121K6080J29190n2405j24905O8574J29866n3114q6748
5661a8033l5042M1352j28027q1633Q1364r138j34887J31060L8351k7077j15618
5650b57328j13997L3933J12598M7874N4439P2005j25647J00880J4497j71690o4888
5639b97324k6658K4455J74401Q4554L4961q2598N2376K4624Q7859l00r9098j98345
5627b21093J3014j08218n013J321J23024J76189L971O733K3326J13336k5355q0158
$$ plain form
5615 21077 -118079 -116012 -59604 16692 49905 -34985 -98739 -105635 -96920 -96724 18754 -55296
5603 -55296 28454 150738 31282 -85038 735 25557 -66615 129579 366984 245779 3337
5592 3337 -79378 -304919 -148207 -94983 -344967 -427724 -384298 -203546 -74380 -97603 -92424
5581 -92424 -57342 -198249 -264558 -119857 -109371 71626 73905 69312 -36472 27484 68572
5570 68572 147105 -34648 -96364 79752 62086 -4187 -29825 -27701 -115546 -55 -21904
5559 -21904 -98826 -148306 -118074 -85332 -59973 52195 168176 265796 71086 -64576 3526
5548 3526 -136839 -135099 -105368 -72415 -67984 2268 -32735 -59018 -108261 -75194 -13375 22811
5536 22811 57927 -18519 45455 -3519 -42723 -53941 -120944 -211917 -375845 -249469 -126221
$$ packed form
5615B1077j39156K067N6408P6296L3213q4890o3754o896Q715J96J15478p4050
5603e5296Q3750J22284j19456j16320Q5773K4822r2172J96194K37405j21205k42442
5592C337q2715k25541J56712N3224k49984q2757M3426J80752J29166k3223N179
5581i2424L5082j40907o6309J44701J0486J80997K279m593j05784O3956M1088
5570F8572P8533j81753o1716J76116j7666o6273k5638K124q7845J15491k1849
5559b1904p6922m9480L0232L2742K5359J12168J15981R7620j94710j35662O8102
5548C526j40365J740K9731L2953M431P0252l5003k6283m9243L3067O1819L6186
5536B2811L5116p6446O3974m8974l9204j1218o7003r0973j63928J26376J23248
$$ plain form
5525 -126221 -108941 -153255 -301724 -345073 -324971 -395445 -367352 -294737 -277948 -141807 -61440
5514 -61440 -191216 -238657 -152701 -221288 -236774 -90246 -12530 119104 320775 88356 933
5503 933 -57553 -36065 -35776 41381 -91424 -124003 -62245 14363 -6159 -64828 -164839 -304266
5491 -304266 -225581 -191360 -135024 -251199 -369083 -466743 -305400 -251405 -256662 -160996 147152
5480 147152 425906 414860 215384 52322 -42191 -74067 -80779 -196901 -170817 -48668 26886
5469 26886 90652 170023 191285 177540 -854 -74040 19420 -99428 20594 141240 249458
5458 249458 319933 237082 158079 31398 -143840 -216434 -215990 -47418 20296 -159412 -118244
5447 -118244 136831 296665 218359 207976 255788 213552 59918 1913 -125083 -82997 -63177
$$ packed form
5525a26221J7280m4314j48469m3349K0102p0474K8093P2615J6789J36141Q0367
5514f1440j29776m7441Q5956o8587j5486J46528P7716J31634K01671k32419q7423
5503I33n8486K1488K89P7157j32805l2579O1758P6608k0522n8669j00011j39427
5491c04266P8685L4221N6336j16175j17884r7660J61343N3995n257R5666L08148
5480A47152K78754j1046j99476j63062r4513l1876o712j16122K6084J22149P5554
5469B6886O3766P9371K1262j3745j78394p3186R3460j18848J20022J20646J08218
5458B49458P0475q2851p9003j26681j75238p2594M44J68572O7714j79708M1168
5447a18244K55075J59834p8306j0383M7812m2236j53634n8005j26996M2086J9820
$$ plain form
5436 -63177 -98392 -331879 -374240 -340277 -194746 -234960 -513070 -466206 -402580 -403387 -319594 -174808
5424 -174808 -258426 -246368 -135002 -31506 -80818 -121988 -262109 -230247 -256036 -388093 -474107
5413 -474107 -547982 -326553 -214824 -261692 -366813 -389424 -254162 -32785 19126 94222 123527
5402 123527 171251 122098 -28206 -116319 -30280 56943 16442 -123848 -9526 -30179 76630
5391 76630 65575 169252 72025 38729 58858 21120 14073 -83758 -124525 -97042 -105647 -99258
5379 -99258 -61032 -37999 -69441 -238367 -318270 -349490 -239562 -144047 -8100 72952 -45052
5368 -45052 -98140 -130529 -146933 -174620 -101661 -13004 11955 -53682 -108968 -107797 86781 18329
5356 18329 5692 -74791 -40723 -113559 -168261 -166280 -179245 -168702 -38713 36743 -48137 -41565
$$ packed form
5436f3177l5215k33487m2361L3963J45531m0214k78110M6864O3626q07Q3793J44786
5424a74808q3618J2058J11366J03496m9312m1170j40121L1862k5789j32057q6014
5413d74107p3875K21429J11729m6868j05121k2611J35262K21377N1911P5096K9305
5402A23527M7724m9153j50304q8113Q6039Q7223m0501j40290J14322k0653J06809
5391G6630j1055J03677r7227l3296K0129l7738p047r7831m0767K7483q605O389
5379i9258L8226K3033l1442j68926p9903l1220J09928R5515J35947Q1052j18004
5368d5052n3088l2389j6404k7687P2959Q8657K4959o5637n5286J171J94578o8452
5356A8329j2637q0483L4068p2836n4702J981j2965J0543J29989P5456q4880O572
$$ plain form
5344 -41565 48741 33117 22411 -117094 -291720 -244851 -291270 -138963 -79691 -74766 -193301
5333 -193301 -343362 -358643 -286094 -268399 -225181 22927 183131 170228 136143 159517 215522
5322 215522 86352 -55827 -76186 1509 154407 155872 132552 91475 -47065 -186199 -85321
$$ packed form
5344d1565R0306j5624j0706j39505j74626M6869m6419J52307N9272M925j18535
5333a93301j50061j5281P2549J7695M3218K48108J60204j2903l4085K3374N6005
5322B15522j29170j42179k0359P7695J52898J465k3320m1077j38540j39134J00878
$$ [...]
##END NTUPLES=NMR SPECTRUM
##END=
