##TITLE=Analysis number 330042
Compound Code ac 16590
Project Code adrs
Chemist Name emka-chemie
##JCAMPDX= 6.0         $$ Bruker NMR JCAMP-DX V2.0
##DATA TYPE= NMR SPECTRUM
##DATA CLASS= NTUPLES
##ORIGIN= Bruker BioSpin GmbH
##OWNER= nmr
$$ XWIN-NMR		Version 3.5
$$ Mon Oct 22 14:05:42 2007 GMT Daylight Time (UT+1h)  MAYBRIDGE\nmr@NMR_250MHZ
##.OBSERVE FREQUENCY= 250.131544655141
##.OBSERVE NUCLEUS= ^1H
##.ACQUISITION MODE= SIMULTANEOUS (DQD)
##.ACQUISITION SCHEME= undefined
##.AVERAGES= 16
##.DIGITISER RES= 18
##SPECTROMETER/DATA SYSTEM= dpx250
##.PULSE SEQUENCE= zg30
##.SOLVENT NAME= CDCl3
##.SHIFT REFERENCE= (INTERNAL, CDCl3, 0, 16.522)
##AUDIT TRAIL= $$ (NUMBER, WHEN, WHO, WHERE, WHAT)
$$ ##TITLE= Audit trail, XWIN-NMR		Version 3.5
$$ ##JCAMPDX= 5.01
$$ ##ORIGIN= Bruker BioSpin GmbH
$$ ##OWNER= nmr
$$ C:\u/data/dgb/nmr/ADRS/1110/pdata/1/auditp.txt
$$ ##AUDIT TRAIL=  $$ (NUMBER, WHEN, WHO, WHERE, WHAT)
(   1,<2007-10-22 14:05:15.95 +100>,<MAYBRIDGE\nmr>,<NMR_250MHZ>,
      <created by zg, POWCHK disabled, PULCHK disabled
       configuration hash MD5:
       76 6E 9A 78 1E 09 19 81 EC 84 63 8F B0 6A 59 2D
       data hash MD5: 64K
       6B A1 0D 1E 5D 83 DF 44 BB C9 18 2B EF B3 70 98>)
(   2,<2007-10-22 14:05:31.63 +100>,<MAYBRIDGE\nmr>,<NMR_250MHZ>,
      <Start of raw data processing
       ef LB = 0.3 FT_mod = 6 PKNL = 1 SI = 32K 
       data hash MD5: 32K
       9A 4F 26 B4 63 8C 3E 2F 8C 97 AD 88 85 14 28 32>)
(   3,<2007-10-22 14:05:33.20 +100>,<MAYBRIDGE\nmr>,<NMR_250MHZ>,
      <apk 
       data hash MD5: 32K
       B7 49 CA 59 93 C0 D2 91 59 CD FC 9B 4F 73 0C 90>)
(   4,<2007-10-22 14:05:33.92 +100>,<MAYBRIDGE\nmr>,<NMR_250MHZ>,
      <abs ABSG = 5 
       data hash MD5: 32K
       9E A7 92 19 C1 27 3E 48 08 58 BA 76 57 42 48 3B>)
$$ ##END=
$$ 
$$ hash MD5
$$ 7A 89 60 22 3B 68 8E A9 62 0F 96 3F 8E 69 52 46
##$RELAX= 
##$RELAX= 
##$RELAX= 
##$RELAX= 
##$RELAX= 
##$RELAX= 
##$RELAX= 
$$ Bruker specific parameters
$$ --------------------------
##$DU= <C:\u>
##$EXPNO= 1110
##$NAME= <ADRS>
##$PROCNO= 1
##$TYPE= <nmr>
##$USER= <dgb>
##$AMP= (0..31)
100 100 100 100 100 100 100 100 100 100 100 100 100 100 100 100 100 100 
100 100 100 100 100 100 100 100 100 100 100 100 100 100 
##$AQSEQ= 0
##$AQ_mod= 3
##$AUNM= <au_zg>
##$AUTOPOS= <37 >
##$BF1= 250.13
##$BF2= 250.13
##$BF3= 250.13
##$BF4= 250.13
##$BF5= 500.13
##$BF6= 500.13
##$BF7= 500.13
##$BF8= 500.13
##$BYTORDA= 1
##$CFDGTYP= 0
##$CFRGTYP= 5
##$CHEMSTR= <none>
##$CNST= (0..31)
1 1 145 1 1 1 1 1 1 1 1 1 1 1 1 1 1 1 1 1 1 1 1 1 1 1 1 1 1 1 1 1 
##$CPDPRG= <>
##$CPDPRG1= <>
##$CPDPRG2= <>
##$CPDPRG3= <>
##$CPDPRG4= <mlev>
##$CPDPRG5= <mlev>
##$CPDPRG6= <mlev>
##$CPDPRG7= <mlev>
##$CPDPRG8= <mlev>
##$CPDPRGB= <>
##$CPDPRGT= <>
##$D= (0..31)
0 1 0 0 0 0 0 0 0 0.06 0 0 0 0 0 0 0.0002 0 0 0 0 0 0 0 0 0 0 0 0 0 0 
0 
##$DATE= 1193058314
##$DBL= (0..7)
120 120 120 120 120 120 120 120 
##$DBP= (0..7)
150 150 150 150 150 150 150 150 
##$DBP07= 0
##$DBPNAM0= <>
##$DBPNAM1= <>
##$DBPNAM2= <>
$$ [...]
##$SUBNAM7= <"">
##$SUBNAM8= <"">
##$SUBNAM9= <"">
##$SW= 20.6930455092707
##$SWIBOX= (0..15)
0 0 3 0 0 0 0 0 0 0 0 0 0 0 0 0 
##$SW_h= 5175.983436853
##$TD= 65536
##$TD0= 1
##$TE= 296.16
##$TE2= 300
##$TE3= 300
##$TEG= 300
##$TL= (0..7)
0 120 120 120 120 120 120 120 
##$TP= (0..7)
150 150 150 150 150 150 150 150 
##$TP07= 0
##$TPNAME0= <>
##$TPNAME1= <>
##$TPNAME2= <>
##$TPNAME3= <>
##$TPNAME4= <>
##$TPNAME5= <>
##$TPNAME6= <>
##$TPNAME7= <>
##$TPOAL= (0..7)
0.5 0.5 0.5 0.5 0.5 0.5 0.5 0.5 
##$TPOFFS= (0..7)
0 0 0 0 0 0 0 0 
##$TUNHIN= 0
##$TUNHOUT= 0
##$TUNXOUT= 0
##$USERA1= <user>
##$USERA2= <user>
##$USERA3= <user>
##$USERA4= <user>
##$USERA5= <user>
##$V9= 5
##$VALIST= <valist>
##$VCLIST= <CCCCCCCCCCCCCCC>
##$VD= 0
##$VDLIST= <DDDDDDDDDDDDDDD>
##$VPLIST= <PPPPPPPPPPPPPPP>
##$VTLIST= <TTTTTTTTTTTTTTT>
##$WBST= 1024
##$WBSW= 4
##$XGAIN= (0..3)
0 0 0 0 
##$XL= 0
##$YL= 0
##$YMAX_a= 537421
##$YMIN_a= -426939
##$ZGOPTNS= <>
##$ZL1= 120
##$ZL2= 120
##$ZL3= 120
##$ZL4= 120
##$ABSF1= 16.522
##$ABSF2= -4.171173
##$ABSG= 5
##$ABSL= 3
##$ALPHA= 0
##$AQORDER= 0
##$ASSFAC= 0
##$ASSFACI= 0
##$ASSFACX= 0
##$ASSWID= 0
##$AUNMP= <proc_1d>
##$AZFE= 0.1
##$AZFW= 0.1
##$BCFW= 0
##$BC_mod= 0
##$BYTORDP= 0
##$COROFFS= 0
##$CY= 12.5
##$DATMOD= 1
##$DC= 0
##$DFILT= <>
##$DTYPP= 0
##$F1P= 14.0000005364418
##$F2P= -0.99999901652339
##$FCOR= 0.5
##$FTSIZE= 32768
##$FT_mod= 6
##$GAMMA= 0
##$GB= 0
##$INTBC= 1
##$INTSCL= 1
##$ISEN= 128
##$LB= 0.3
##$LEV0= 0
##$LPBIN= 0
##$MAXI= 10000
##$MC2= 0
##$MEAN= 0
##$ME_mod= 0
##$MI= 0
##$NCOEF= 0
##$NC_proc= -5
##$NLEV= 6
##$NOISF1= 0
##$NOISF2= 0
##$NSP= 0
##$NTH_PI= 0
##$NZP= 0
##$OFFSET= 16.522
##$PC= 1
##$PHC0= 6.040236
##$PHC1= 4.261495
##$PH_mod= 1
##$PKNL= yes
##$PPARMOD= 0
##$PSCAL= 4
##$PSIGN= 0
##$REVERSE= no
##$SF= 250.13
##$SI= 32768
##$SIGF1= 0
##$SIGF2= 0
##$SINO= 400
##$SIOLD= 32768
##$SREGLST= <1H.CDCl3>
##$SSB= 0
##$STSI= 32768
##$STSR= 0
##$SW_p= 5175.98343685301
##$SYMM= 0
##$S_DEV= 0
##$TDeff= 65536
##$TDoff= 0
##$TI= <Analysis number 999999
Compound Code 99
Book Reference 9
Project Code 9>
##$TILT= no
##$TM1= 0
##$TM2= 0
##$TOPLEV= 0
##$USERP1= <user>
##$USERP2= <user>
##$USERP3= <user>
##$USERP4= <user>
##$USERP5= <user>
##$WDW= 1
##$XDIM= 32768
##$YMAX_p= 487856459
##$YMIN_p= -151805
$$ End of Bruker specific parameters
$$ ---------------------------------
##NTUPLES= NMR SPECTRUM
##VAR_NAME=  FREQUENCY,     SPECTRUM/REAL,   SPECTRUM/IMAG
##SYMBOL=    X,             R,               I
##VAR_TYPE=  INDEPENDENT,   DEPENDENT,       DEPENDENT
##VAR_FORM=  AFFN,          ASDF,            ASDF
##VAR_DIM=   32768,         32768,           32768
##UNITS=     HZ,            ARBITRARY UNITS, ARBITRARY UNITS
##FACTOR=    0.157963299565203, 1,           1
##FIRST=     4132.6476996994, 0,             0
##LAST=      -1043.33573715361, 0,           0
##MIN=       -1043.33573715361, -151805,     0
##MAX=       4132.6476996994, 487856459,     0
$$ Real data points
##PAGE= N=1
##DATA TABLE= (X++(R..R)), XYDATA
$$ [...]
17808C84777p4001m9286o8756m7223k5978k1847N94k0802K3661L1328K4774o141
17796A51100k2560l7407j1160j789j8801k3735m3788j4718m569K6586J2372r439
17784B092j0936j1115j5417K3985J1297J1963j977k916J8889Q724P353k27J3507
17771E5222j250k4065Q11j2116n26J2838K6172K0161J6910J6091j1642k5450j8134
17758E5022j7303j423P738P259j7945q568j0040k5803k0429K5701q28k7036J9139
17745a4516k2K888J8107j5574k871o175j1119J4264K3398j3357O999J4094j2508
17732C608k7550N035K0602J8603j2289R339k2957J0823K1023J7016k044N323k8552
17719A7980k0070J301R037p735N752K4131j3110k9957o104K2491J9471J9602m450
$$ y = [384777, 310776, 261490, 192734, 145511, 119533, 97686, 98280, 77478, 101139, 132467, 157241, 151100, 128540, 91133, 79973, 78184, 59383, 35648, -8140, -22858, -27427, -841, 11531, 2092, -8844, -19959, -35376, -11391, -94, 11869, 9892, 6976, 25865, 34589, 41942, 41715, 55222, 53972, 29907, 30718, 18602, 18076, 30914, 57086, 77247, 94157, 110248, 98606, 73156, 55022, 37719, 36296, 44034, 51293, 33348, 24780, 14740, -11063, -31492, -5791, -6619, -33655, -14516, -14538, -11650, 6457, -9117, -11988, -18163, -29282, -15018, 8380, -4977, 2022, 16116, 3608, -23942, -18907, 1695, 20298, 8009, 17348, -5609, 5214, 26237, 43253, 41209, 46532, 17980, -2090, -789, 8248, 513, 6265, 30396, 17286, -12671, -18775, 3716, 23187, 42789, 38339]
17706C8339P575m90L394j2595k2858l15m218K485Q645J5588r933j4091k2780l2190
17692d3444J0676L2497K4232l244j5219O753Q094K0645J2712k6674k5119R372
17680A1281J8735K1060p113j563n560k4430j1j8324m161M819Q896n198k284k2466
17666b6319Q026K5724P51k4415N733J1438k3980o854O540j1539J1600K4517J5771
17653A6993q005k2783k7120N0862L1681j2102j5698J0715O407K594J258J4810
17641D9612j6654j4142Q063K8287K4923K192k7164P496R958j6035j2620K1698
17629F5614K169j1379j3683k0306K32p933l272J5917J1428J6769j493k5800l099
17616B5164k0521j3651O819N142J8485j785j1058P592P424j843L0265M7630L6070
$$ y = [38339, 45914, 45424, 48818, 36223, 13365, 13050, 8832, 11317, 19962, 35550, 25617, 11526, -11254, -43444, -32768, -271, 23961, 20717, 5498, 12251, 20345, 40990, 53702, 27028, 1909, 11281, 30016, 51076, 43963, 42400, 36840, 12410, 12399, -5925, -10086, -5267, 3629, -1569, -3853, -26319, -18293, 7431, 8182, -16233, -10500, 938, -23042, -29896, -23356, -34895, -23295, 1222, 16993, 8988, -13795, -40915, 9947, 41628, 29526, 13828, 24543, 30950, 33544, 34802, 49612, 32958, 18816, 26879, 55166, 80089, 82281, 55117, 62613, 72571, 56536, 43916, 65614, 67783, 56404, 42721, 22415, 22647, 14714, 11442, 27359, 38787, 55556, 54063, 28263, 25164, 4643, -9008, -2189, 2953, 21438, 19653, 8595, 16187, 23611, 21768, 52033, 99663, 135733]
17603A35733J3584r169M708O024L862L7307O4561R9400J28929R3327Q4642P6460
17591G39368Q8724J19711J01935K8906m8625m7285m2266l2576J526o218k5101
17580H78099j0447j4995l5002m8784m3839J994Q111j1452m4313p7638r3143o3042
17568D45549j02341p8063m6580k1481j7230m3181r680J9994j0241j0262L2990
17557A59474J1145J1026k1858k6632r761Q598P1177R9531J08851J11482R7961
17546F20994M6953J7098J4475N5122Q9037P5433R0968L5693j381J7432P7828J20625
17534A260277J29202M2696j3258q7169q6875j9362l2267j10058j37797j79960
17524G65429j67251j26647p9449n4942o7887n5038k3033j5759j728q041j2190
$$ y = [135733, 149317, 140148, 144856, 150880, 154742, 192049, 256610, 356010, 484939, 578266, 662908, 739368, 828092, 947803, 1049738, 1078644, 1030019, 982734, 940468, 907892, 909418, 903200, 878099, 867652, 852657, 817655, 768871, 725032, 727026, 735137, 723685, 679372, 601734, 508591, 445549, 343208, 265145, 218565, 197084, 179854, 136673, 126993, 146987, 136746, 126484, 159474, 170619, 181645, 159787, 133155, 123394, 131992, 203169, 302700, 411551, 523033, 620994, 667947, 685045, 699520, 754642, 843679, 919112, 1010080, 1045773, 1044392, 1061824, 1139652, 1260277, 1389479, 1432175, 1418917, 1331748, 1244873, 1225511, 1193244, 1083186, 945389, 765429, 598178, 471531, 392082, 337140, 269253, 214215, 191182, 175423, 173695, 165654, 153464]
17513A53464j2344j0046j1037j3230O398K7124L7289L0618O8231P0508P0829P2368
17501D90172M1677j3245l2756J1291M762j7523p2988m6006n9136o2712m1453m8528
17489A53555m987j5307j5587M540j1739k9179j4276K626Q311J1346k8676j4399
17477D6228o171r84N943M010l920J6395j4203k5601N663k9248l726N621j1026
17464a1019J18J983K3962L3669R106j4096j6506L791J7949m071j8968l6577Q802
17451a857K2606L8067K9833j3391k841P657L2375Q8248P8187p279n8423m7718
17439A65464k3343k4132l5112j1681O10j5766J576J5331J9122J894j3584k4603
17427E5776J961K0495J0159n092r176k5377n11O698j5572j22l754o973N283l41
$$ y = [153464, 141120, 131074, 120037, 106807, 113205, 140329, 177618, 208236, 276467, 346975, 417804, 490172, 531849, 518604, 485848, 497139, 501901, 484378, 411390, 365384, 306248, 243536, 202083, 153555, 148568, 133261, 117674, 122214, 110475, 81296, 67020, 69646, 77957, 89303, 60627, 46228, 40057, 39073, 45016, 49026, 45106, 61501, 47298, 21697, 27360, -1888, -5614, 7, -11019, -10901, -8918, 15044, 48713, 57819, 43723, 27217, 31008, 48957, 44886, 25918, -10659, -1857, 20749, 58816, 88649, 75258, 72417, 80074, 112449, 200697, 278884, 271605, 213182, 165464, 142121, 117989, 82877, 71196, 71806, 56040, 57616, 72947, 92069, 93963, 80379, 55776, 57737, 78232, 88391, 83299, 74123, 48746, 48235, 54933, 39361, 39239, 35485, 28512, 33795, 33454]
17413C3454k1764j5023J3374J5156M521N728j911l106j5211J596m733L482q801
17400F762p91q413j1430R267J3648Q775J4277L0341L5044K996R174Q214R353K0797
17386A48014q969Q820l794k03p067k555o097n749j6463k8362l1111j1380j690
17373C3394j0070J9530J4111P872r20j3531P054K1224M1771L6672k0663j0460
17361A25984o688j9214j870J247K082k8354o656J8457J743l887n998k7921n42
17348D8383J2463l143j8442r21J3185K8194L2420K4156L3599M5065L4739K7207
17336B76905J4975N861o821L0263O649l5859j3654J3933j4242l0404j3705J5655
17324B49556p210l61l2672m6559k7089J7773M1596J7721P935L9069K1703o774
$$ y = [33454, 11690, -3333, 10041, 25197, 29718, 35446, 33535, 30429, 15218, 16814, 12081, 15563, 6762, 5971, -2442, -13872, -4605, 9043, 17818, 32095, 62436, 97480, 100476, 109650, 117864, 127217, 148014, 139045, 147865, 144071, 143868, 136801, 134246, 128149, 122400, 105937, 77575, 46464, 35084, 33394, 23324, 42854, 56965, 64837, 63917, 50386, 57440, 78664, 120435, 157107, 136444, 125984, 119296, 100082, 98212, 99459, 101541, 73187, 66531, 84988, 86731, 82844, 76846, 48925, 48383, 60846, 57703, 39261, 38340, 51525, 79719, 112139, 136295, 169894, 214959, 249698, 276905, 291880, 297741, 290920, 321183, 327832, 291973, 278319, 292252, 278010, 247606, 233901, 249556, 242346, 241985, 209313, 162754, 135665, 153438, 195034, 212755, 220690, 259759, 281462, 274688]
17312B74688J3838q121r462j6697K562J4479j9703n2354j8516j8677j2876p910
17300A41251j8594J1374K4394k4114m820J0221K500q797j075L2678L9022M4702
17288B48742K1151j1773J4331L2587J6686k119K7943L1004k1823j8421M743K420
17276C45471J445j1591k4853j8104o096l956K7011o242L5499J0230m3606l2117
17264B73091l42J2723K959n8547k6105l3j0860L576M595k1340k7421k8366l8390
17251H5540k7651J8029J7372J3236k3708j499K5536K6978J4373J7250K7542L5567
17239B28565J5208J985K0013K0230l224n404P20K411q534M423J1208N891J8224
17226C11716J3760k6935l1000j4382n397J160q928j8306R340K1159o772J7183
$$ y = [274688, 288526, 280405, 270943, 254246, 256808, 271287, 251584, 199230, 180714, 162037, 149161, 141251, 122657, 134031, 158425, 134311, 129491, 139712, 142212, 133415, 132340, 165018, 204040, 248742, 269893, 258120, 272451, 305038, 321724, 319605, 347548, 378552, 356729, 338308, 343051, 345471, 346916, 335325, 310472, 292368, 286272, 282316, 309327, 303085, 338584, 348814, 305208, 273091, 272749, 285472, 288431, 229884, 203779, 203746, 192886, 196462, 201057, 179717, 152296, 123930, 85540, 57889, 75918, 93290, 106526, 82818, 81319, 106855, 133833, 148206, 165456, 192998, 228565, 243773, 245758, 265771, 286001, 282777, 277373, 278093, 280504, 271970, 276393, 287601, 293492, 311716, 325476, 298541, 267541, 253159, 247762, 248922, 239994, 221688, 231028, 252187, 245415, 262598]
17214B62598J2835L570M0386L4542L6601K842L1614J0208q248k6538p78K0355
17202D19987j1342l536J4496k614M131k6613j9731m343j6122J4118j7026k9512
17190C21893P427J3273l095L0370L5180K2591j306n27L1394L1970N9164L1529
17178E79863J9457j5103J1641K0703N0277N6928N5103L5173J6993k5520l3367
17167G72148j2086j0340q733P819J9393J5287k6182m7416j3315l941L3948K9281
17155G55863J3000Q494K1421J4275l3249r071L7410M4358N3849J0751j4028J4388
17143I17461K500L0161Q073R072M2326N3926N3345K9405K5658L0499L2600K3453
17131A258479N1962M946j4575K4986N1990O2188O5870P3386N5282O2825Q0426
$$ y = [262598, 275433, 279003, 319389, 353931, 390532, 393374, 424988, 435196, 426948, 400410, 399632, 419987, 408645, 405109, 419605, 416991, 421122, 394509, 374778, 370435, 354313, 368431, 351405, 321893, 329320, 342593, 339498, 369868, 405048, 427639, 426333, 425806, 457200, 489170, 548334, 579863, 599320, 584217, 595858, 616561, 666838, 723766, 778869, 814042, 831035, 805515, 772148, 760062, 749722, 740989, 748808, 768201, 783488, 757306, 709890, 696575, 692634, 726582, 755863, 768863, 777357, 798778, 813053, 779804, 770733, 808143, 852501, 906350, 917101, 903073, 917461, 919961, 950122, 958195, 967267, 1009593, 1063519, 1116864, 1146269, 1171927, 1202426, 1235026, 1258479, 1310441, 1315387, 1300812, 1325798, 1377788, 1439976, 1505846, 1579232, 1634514, 1697339, 1777765]
17120A777765J04631P7512J16368J10813J03669J17185J66559J73974K07261K17524
17110C173261K29040K60542L27716L14323L04510L81003M58667N06947N64768
17101F520777O71080Q63937J102662J477466J962352K583169L543923N096512
17093B3821878P642157J1466979J5758675J7850918J5711884J1816734J1703303
17086A15772528J7632826K5030903K4817118J2560594m014433j3529401j3318467
17079A64951668r094148p833052j2035031j7688244k0191380j9135110j6425092
17072F2549611j3042691r473966o204610l652132j714130k09139J254602K927323
17064C2434868N196871Q889154J5077328K2586660K3113029J0759392l298508
$$ y = [1777765, 1882396, 1959908, 2076276, 2187089, 2290758, 2407943, 2574502, 2748476, 2955737, 3173261, 3402301, 3662843, 3990559, 4304882, 4609392, 4990395, 5449062, 5956009, 6520777, 7191857, 8055794, 9158456, 10635922, 12598274, 15181443, 18725366, 23821878, 31464035, 42931014, 58689689, 76540607, 92252491, 104069225, 115772528, 133405354, 158436257, 183253375, 195813969, 191799536, 178270135, 164951668, 155857520, 148024468, 135989437, 118301193, 98109813, 78974703, 62549611, 49506920, 40032954, 33828344, 30176212, 28462082, 28252943, 29507545, 32434868, 37631739, 46520893, 61598221, 84184881, 107297910, 118057302, 114758794]
17057A14758794p586644l950189L20670j726102r680687j4867008j4486093j2241772
17049E0540969j0026065p476165m941264k915254j448846m15540M29211J314410
17041B5061456K358906L807816N902491R041040J3366627J7532743J8920069J6949057
17033A12940205J5981517K1290310L3531082M5175089M0934149J5834978j0192962
17026B75494368j8555474j1930610l711115o695160k0284358l0216422l0084885
17019A54016344k4359845j6196267m903154Q009117J3766447N180611p334095
17012A28179158j1217393p439670k871503l651570j0118568j4915147j4778467
17005F3186840j2674187j0551362q151257n776357l944600k763387k025399j520107
$$ y = [114758794, 107172150, 103221961, 103542631, 101816529, 92135842, 77268834, 62782741, 50540969, 40514904, 33038739, 28097475, 25182221, 23733375, 23317835, 23747046, 25061456, 27420362, 31228178, 37130669, 46171709, 59538336, 77071079, 95991148, 112940205, 128921722, 150212032, 183743114, 228918203, 269852352, 285687330, 275494368, 256938894, 245008284, 241297169, 234602009, 214317651, 184101229, 154016344, 129656499, 113460232, 108557078, 116566195, 130332642, 135513253, 128179158, 116961765, 109522095, 106650592, 102999022, 92880454, 77965307, 63186840, 50512653, 39961291, 31810034, 26033677, 22089077, 19325690, 17300291, 15780184]
16997A5780184j088524o56534k70178K7037K82921O94055J286922K115221L219466
16988B1390570M873218P720527J2702853J9337962K0943770J1095423j342311
16981I6722012n304411j737065K689764R20603p711134j4311258j4850789j2861770
16973D3555952j0736135q282203n759183l769933k579979j851697j345109j025946
16965H205767q01478o76921n82865n69669n72486n26044m56235l38266k99399
16956C382404k93396k95653k44787k13267j73342j57085j21687j12328j03781
16947A667078r4834p6980r8882p5931o1541o0421r3349p4728n5600m6952p2718
16936H55142l7362k6128k5136j1692j9893j2744m9311l900J030J0163O781k7604
$$ y = [15780184, 14691660, 14035126, 13764948, 13791985, 14074906, 14768961, 16055883, 18171104, 21390570, 26263788, 33984315, 46687168, 66025130, 86968900, 98064323, 96722012, 91417601, 89680536, 92370300, 93290903, 85579769, 71268511, 56417722, 43555952, 32819817, 24537614, 18778431, 15008498, 12428519, 10576822, 9231713, 8205767, 7404289, 6727368, 6144503, 5574834, 5002348, 4476304, 4020069, 3681803, 3382404, 3089008, 2793355, 2548568, 2335301, 2161959, 2004874, 1883187, 1770859, 1667078, 1572244, 1495264, 1396382, 1320451, 1258910, 1198489, 1105140, 1030412, 974812, 927860, 855142, 817780, 791652, 766516, 754824, 734931, 722187, 672876, 668976, 670006, 680169, 686950, 659346]
16924F59346j1372o301j1279J8570K1183j7168j8668j3542k0665l9806j6206k6482
16912E17610m3907k5246o222k4705k3916m901n708q200k3362j8384L849n473j7757
16899C13678K2682L3067J804k1887j2515r795k2526l486J8503k105o600R616J4347
16886C34783j8248j7588j0805J1332j4216l6065l5475k6707K1591j2486l4775
16875A61341l506K3567J7798P657j396j23J0642P791J4708J146j464N039J3927
16862B57127J4196L67p679j0511p957l7102r375o566j1585m600j35k2360j6789
16849A37031k1634p438q47n469R622N600j0840j6183J6807J4872J7269M604j8030
16836A25364k3965n933j1503n299k2858K337J7415P343O588N106k083J4370L0256
$$ y = [659346, 647974, 641673, 630394, 648964, 670147, 652979, 634311, 620769, 600104, 560298, 544092, 517610, 473703, 448457, 442235, 417530, 393614, 388713, 383005, 374805, 351443, 333059, 336908, 331435, 313678, 336360, 369427, 371231, 349344, 336829, 327034, 304508, 301022, 319525, 317420, 310820, 320436, 334783, 316535, 298947, 288142, 299474, 285258, 249193, 213718, 187011, 208602, 196116, 161341, 157835, 181402, 199200, 206857, 205461, 205338, 215980, 223771, 238479, 239625, 238161, 243200, 257127, 271323, 271690, 264011, 253500, 245543, 208441, 199066, 192500, 180915, 176315, 176180, 153820, 137031, 115397, 107959, 107112, 101643, 111265, 116865, 106025, 89842, 106649, 121521, 138790, 143394, 125364, 101399, 95466, 83963, 78664, 55806, 58143, 75558, 82901, 89489, 94595, 92512, 106882, 137138]
16823A37138J8229J2922J0155Q878q076j9746l675K8005L641k1450j9457j9511
16811A27053N082K6791K640j0025l4318j2477J2661j0513R969j8614k1953j2317
16799F3979k1358k1199K218O723J4380p941J1358M633k5429l923m881j1668m2418
16786c5526R993j0205Q593k5935j3428J1315k0112P278L4923L0322K1689r328
16774I579l5858j5829K7886N4526K0547O13j8888P276P683J4509J0351q539N149
16761G9005J0241Q040p578k5188k5275j1586l385j2512k1632j8315j6553K0527
16749b4211r67K2901K1879K597K322M518q210j57o83N39m036m485l04N460j3156
16734D007l1689J073j547o514k6176O971oj2296J2560K7498J033n215q494P526
$$ y = [137138, 155367, 168289, 178444, 187322, 179246, 159500, 155825, 183830, 187471, 166021, 146564, 127053, 132135, 158926, 161566, 151541, 117223, 104746, 117407, 106894, 116863, 98249, 76296, 63979, 42621, 21422, 23640, 30363, 44743, 36802, 48160, 52793, 27364, 23441, 18560, 6892, -35526, -25533, -35738, -27145, -53080, -66508, -55193, -75305, -68027, -33104, -2782, 18907, 9579, -26279, -42108, -14222, 40304, 60851, 61464, 42576, 49852, 57535, 72044, 82395, 73856, 79005, 89246, 97286, 89708, 64520, 39245, 27659, 24274, 11762, -9870, -28185, -44738, -24211, -25178, -2277, 19602, 22199, 24521, 29039, 20829, 20672, 19989, 20528, 16492, 12007, 11703, 17163, 4007, -27682, -26609, -28156, -34670, -60846, -53875, -53881, -66177, -53617, -26119, -25086, -30301, -38795, -31269]
16720c1269J3358J1559L5212L4934L6246J4557o478j4056l4003j3203J8468K9854
16708I5179L2631k4323k1119j7455j8324J1651J0240r129j3987R928M0251l242
16696I2301k5838m329J3234O12p306K030O166k4176j4187J400j1463j5132l3387
16683b0075l029P808J1467J1327K499M617K1171l3632m964J5577j0979J1338N8501
16670G1626J5517J3765j274j2707J164K6107j189J6718J1369j0491q606j2004
16658A09995J0467j1417k4360m0783L330m738j379k6976k0372M926R935K4578
16646C3206K484J3918J0459J4767m955k5054j2984k9060J0501K3056m144j3229
16634A8965l571j2078L8358L6301k4481J272J2686l436j6865J8092J6247j8784
$$ y = [-31269, -17911, -6352, 28860, 63794, 100040, 114597, 108119, 94063, 60060, 46857, 65325, 95179, 127810, 103487, 82368, 64913, 46589, 58240, 68480, 59351, 45364, 55292, 95543, 92301, 66463, 62134, 75368, 75980, 68674, 70704, 76870, 52694, 38507, 39907, 28444, 13312, -20075, -23104, -15296, -3829, 7498, 9997, 14614, 35785, 2153, -2811, 12766, 1787, 13125, 71626, 87143, 100908, 99634, 86927, 88091, 114198, 113009, 129727, 141096, 130605, 121999, 109995, 120462, 109045, 84685, 43902, 47232, 42494, 41115, 14139, -6233, -1307, 8628, 33206, 35690, 49608, 60067, 74834, 69879, 44825, 31841, 2781, 13282, 36338, 32194, 18965, 15394, 3316, 41674, 77975, 53494, 54766, 67452, 64016, 47151, 65243, 81490, 62706]
16622F2706l7962k6567K173j5803k717J5285K8204j622k2800p078L7846L906j6282
16609A9289o208K969j9332k3974L2801K256o721q377j394L696K8487q773m812
16596I907K2006l567J490k4349j3420L090K9309K1587K2774R317j6715m58L9568
16583A00539M512L798N5102J21182P6705R9424J04873P4011N4010Q7774Q5443
16572H67373P3009M2290m9155p5894m8586m9833l7586q8464j28117j21629q3539
16561B99869o0920j7829r068j6387l5192n368N690p061J042k0241k7527k1814
16549H5194k2511R984j942J2058J8682R353Q272l53j0947l383N2233P3788O8654
16536B99082R4400J15410O1999r700r676J2904M1117N62j4887j285l6252j8686
$$ y = [62706, 24744, -1823, 350, -15453, -18170, -2885, 25319, 23697, 897, -6181, 31665, 35571, 19289, 13081, 16050, -3282, -27256, 5545, 7801, 1080, -7297, -8691, -4995, 23492, 14719, 9907, 31913, 28346, 29836, 5487, -7933, -4843, 24466, 46053, 68827, 78144, 61429, 60971, 100539, 105051, 108849, 163951, 285133, 361838, 461262, 566135, 640146, 694156, 781930, 867373, 940382, 982672, 933517, 857623, 809037, 759204, 721618, 633154, 505037, 383408, 299869, 238949, 221120, 212052, 195665, 160473, 155105, 160795, 153734, 154776, 134535, 107008, 85194, 62683, 72667, 70725, 82783, 101465, 110818, 119090, 118737, 107790, 104407, 156640, 230428, 299082, 393482, 508892, 570891, 561191, 551515, 564419, 605536, 606098, 591211, 589926, 553674, 534988]
16524E34988N7148Q1859N3599L5812M2149P6801Q5831L5118m2060o9467m7857
16513H43921o2258m7378m1067m6834p7928o7691k7014k659O3411P0341K6550l1621
16501E99773J129K892K4280j0382n9510n5251m8115m9345k1943L1614Q1638O4307
16489E61087K8165j7619l8923M312J1045k1848l9187p4231p0681p6806p7565k5846
16477A61903l6960k2535k1521m2977j6309j2888J2305J6442J5739Q352q247M254
16465E7558L5713J3203J3086L9618Q1526P7493R3352M2123j5716R314L2449R346
16453D89065k8004m4518o8618o5898n2926o8943p1235j7548o69O711k8776r585
16441C9056J3693k187K113r852J0467k253j3977j7059J1033k5732j7419j5415
$$ y = [534988, 592136, 673995, 727594, 763406, 805555, 882356, 968187, 1003305, 961245, 891778, 843921, 781663, 734285, 693218, 646384, 568456, 500765, 473751, 471092, 534503, 604844, 631394, 599773, 600902, 603794, 628074, 617692, 558182, 502931, 454816, 405471, 383528, 415142, 496780, 561087, 589252, 571633, 532710, 537022, 548067, 526219, 487032, 412801, 342120, 265314, 187749, 161903, 124943, 102408, 80887, 37910, 21601, 8713, 21018, 37460, 53199, 61551, 53304, 57558, 93271, 106474, 119560, 159178, 240704, 318197, 411549, 453672, 437956, 447270, 479719, 489065, 461061, 416543, 347925, 282027, 229101, 160158, 88923, 71375, 70706, 77417, 48641, 39056, 52749, 50562, 52675, 42823, 53290, 51037, 37060, 20001, 31034, 5302, -12117, -27532]
16429b7532L6253P483k0224N685r727l2987j7793Q983J3256J3003J5727j0926
16417a8799O697K2479k5997k1651M595N420j9394K0064m689j3167K9581K3963
16405I102n44j2728j1277m179J5416J6201J7824j0408j5349j2237M419J5488P925
16392A9653k7040K438K1281J5502K9398j717k2586l5067j370l416j5807N403k1148
16379c4476L814J3412N14K510J9102j8862j7096o298K6855K538p41k556j810j963
16365a5057l1232O775L204L785N354o411K4004K0334j03l180k093J5427o1j4579
16351F167l655m916r98l2081m197J1548j9755m22J0209R733J8689l255k1267P687
16337b6513J3550J0061m082L536J7171N034J1111q887j8166j9900j0382j1394
$$ y = [-27532, 8721, 16204, -4020, 1665, -8062, -41049, -58842, -49859, -36603, -23600, -7873, -18799, -12102, 10377, -15620, -37271, -32676, -27256, -46650, -26586, -31275, -44442, -14861, 9102, 8558, -4170, -15447, -19626, -4210, 11991, 29815, 19407, 4058, -8179, -3760, 11728, 19653, -7387, -4949, 16332, 31834, 61232, 59515, 36929, 1862, 492, -2924, -18731, -13328, -34476, -30662, -17250, -16736, -14226, 4876, -13986, -31082, -37380, -10525, -7987, -8728, -11284, -13094, -15057, -46289, -39514, -36310, -32525, -27171, -33582, -9578, 10756, 10653, 7473, 5380, 20807, 20746, 6167, 2512, -2404, -3402, -35483, -39680, -28132, -47887, -48309, -38100, -28367, -9678, -12933, -34200, -26513, -12963, -2902, -6984, -3448, 13723, 18757, 29868, 20981, 2815, -17085, -27467, -38861]
16325c8861n179J0804k1826R58J8055J4657K6450K2987n173j7690j2235j3128
16313b0181J6847o923O941k2449j1866k241n031J2436K6708K3706J4933N19n917
16300B7482j8057k4514q023K7476L8655Q521j7762l5934m1720M678N023K5340
16288h835L1539p045j4512k5003j1422j4415l783J2707J339J5122Q787J1685j0535
16275a4371k339R636K1317J0358J4292j7553k5265m940R673K8038K1903J5628
16263F6377j0040k1604k0371j9372l5408j027K1931Q882k1518j7053K824k4131
16251g0510M072J9143j2820K804J0660J6805K1419J9877M251r820L857k1023K985
16238h300r818j0637n372n702K0388k399k5903k2028L4026J9571L35N048j6240
$$ y = [-38861, -44040, -33236, -55062, -54104, -36049, -21392, 5058, 28045, 22872, 5182, -7053, -20181, -3334, -10257, -3316, -25765, -37631, -39872, -44903, -32467, -5759, 17947, 32880, 33399, 27482, 9425, -15089, -23112, 4364, 43019, 51540, 33778, -2156, -43876, -39198, -34175, -8835, 22704, 15659, 1147, -23856, -35278, -49693, -53476, -40769, -39430, -24308, -15521, -3836, -14371, -16710, -7074, 14243, 24601, 38893, 21340, -3925, -8865, 808, 28846, 50749, 66377, 56337, 34733, 14362, -5010, -40418, -41445, -19514, -10632, -32150, -49203, -46379, -70510, -66438, -47295, -60115, -57311, -46651, -29846, -8427, 11450, 15701, 5881, 9738, -11285, -8300, -18118, -28755, -34127, -39829, -19441, -21840, -47743, -69771, -35745, -16174, -15839, -10791, -27031]
16225b7031K059k308k254q715j6079J705K4768m303j2416j4650J9319K6181J4683
16212I59q11J9158n807P584J6143k9058k7338p207k8813j0028J9151j656R507
16199c8216Q568N315O058k863p540K0095L1071q369m1598m999q784k5114q352
16186g4728L069K2527J2128K2179K2205j8418l544J1900L797k634j6592L775J2211
16173b125j0699j6827m602Q171J9120k221J7711J7531Q16p432j8468k3291L912
16160a8404L181J3339Q507j4597O876K844K167p265k6757q937k3405K4217J9565
16147a8669L53K109k3854J487L485J6907N007r426J3174j870k1381j143m051q828
16133d6700J9578K3324j422k391l1836o977o527M610j2528L6582j0999O64N027
$$ y = [-27031, -24972, -27280, -29534, -38249, -54328, -52623, -27855, -32158, -44574, -59224, -39905, -13724, 959, 148, 19306, 13499, 21083, 37226, 8168, -19170, -26377, -55190, -65218, -46067, -47723, -38216, -29648, -24333, -18275, -21138, -28678, -8583, 22488, 14119, -27479, -32478, -41262, -66376, -74728, -71659, -49132, -37004, -14825, 7380, -11038, -14582, -2682, 1115, -1519, -18111, -14336, -2125, -12824, -29651, -34253, -26082, -6962, -9183, 8528, 26059, 26875, 19443, 975, -22316, -18404, -15223, -1884, 6623, -7974, -1098, 1746, 3913, -3352, -30109, -39046, -62451, -38234, -18669, -18316, -16207, -40061, -38574, -35089, -18182, -13175, -22601, -9427, -11297, -32678, -33821, -37872, -46700, -27122, -3798, -5220, -7611, -39447, -46424, -52951, -48341, -60869, -24287, -35286, -34622, -29595]
16120b9595l856K2306K9570p786j6153l1507k8444k7552K0485K5422k8881l965
16108g9956L5456L2199Q233k3134l796P205p18L445n483J1240P837k217J277n305
16094a3717P330j2610p329J7495j2294n116r797K8310K5534j7778m0132K999J7395
16081a9710j2857K0148L050K452P582j7677O325l52n28j5606N197q847j7045k580
16067e0448J8425k7993k0081L7111K6971J4355J0092J487L036J0649J217n1283
16055b6462m2212O745K0368K5855R283J3034K5819L32l1421l1368J4609J0721
16043d697j0219l915Q922j17N347J684q99N960o391j9850j772q190l245j7624
16029e5006j4110K5019J6389J0843o67q7j5368p709K5906L526K2965j6236l7450
$$ y = [-29595, -33451, -11145, 18425, 10639, -5514, -37021, -65465, -93017, -72532, -47110, -75991, -79956, -44500, -12301, -4068, -27202, -30998, -23793, -24511, -21066, -26549, -15309, -7472, -9689, -8412, -13717, -6387, -18997, -26326, -8831, -21125, -26241, -36038, -7728, 17806, 28, -40104, -37105, -19710, -32567, -12419, -9369, -6917, 665, -17012, -10687, -11039, -11567, -27173, -21976, -30823, -47868, -50448, -32023, -60016, -80097, -42986, -16015, -1660, 8432, 9919, 12955, 23604, 24821, -26462, -68674, -61929, -41561, -15706, -6423, 6611, 32430, 32762, 1341, -30027, -15418, -4697, -14916, -18831, -9909, -10026, -4679, -2995, -3894, 2066, -4325, -24175, -25947, -34137, -37382, -55006, -69116, -44097, -27708, -16865, -17532, -17619, -32987, -40696, -14790, -11264, 11701, -4535, -41985]
16016d1985j5864N594J8598K0226J2536l2614l2507R887P12J3651L6858m744j0857
16003b0509K453J363P219N959j629k837l224k291o177r582Q888j4937j8561K8031
15989b5834J5441L726r568n749j0400k1188k2960J7435K3385r777M794K3799p484
15976b4380k5194k7929k0686J2808Q676L9856L474k4910o387N624J7523j0805
15964e2330O567Q973N130K0545j457j2882n435j0536k2380P208Q767n061M344
15951d8547J2805R046M563m958l515J4266P493j3772M858l4828m041Q560r713
15938e7783j6671j9028R255O0830L7246n179j6000N111R649J0699j8044l1862
15926c1777k0245J0052K8401Q980j3574k05l5537j2318J8254K6411K1319J4407
$$ y = [-41985, -57849, -52255, -33657, -13431, -895, -33509, -66016, -56129, -55417, -41766, -4908, -9652, -20509, -18056, -16693, -9474, -3515, -5144, -7981, -11205, -13496, -19673, -29255, -20367, -35304, -53865, -25834, -10393, -6667, -16235, -21984, -32384, -53572, -76532, -59097, -35712, -45489, -40695, -16896, -24380, -49574, -77503, -98189, -85381, -76705, -36849, -33375, -58285, -64672, -59048, -41525, -52330, -45763, -36790, -31660, -11115, -12572, -25454, -30889, -41425, -63805, -56597, -47830, -52891, -48547, -35742, -26696, -22133, -27091, -30606, -16340, -8847, -22619, -17761, -52589, -56630, -48070, -57783, -74454, -93482, -84227, -23397, 13849, 8670, -7330, -2219, 7430, 18129, 85, -31777, -52022, -41970, -13569, -4589, -18163, -18368, -53905, -66223, -47969, -21558, -239, 14168]
15914A4168j6673k5159k0130K9686l26O704Q176l341J110j1574J7461l118j3805
15901a6821j7050k1577j6192J8411K2329r083J1084J0153O979J4j7096k1120j5222
15888f5191k0517o979K8889K2243P496k1724J9003K0835Q219J0270j0373k3602
15876c1431Q25R308o761l689j1840J3621L484k080K5249K2757j9545l1315K912
15863b8505K0460p697j6502p585J1777j9488j4379q758q88K5020J2417j2335k9962
15850g6425p423K4614L823J3878J7319j4413j1263n284K0430Q589J0217j6103
15838c2041j7054q579j973J4062K1865q984J2215p69j1561J4388J5450j3806R70
15825a5817k7693p717j1025l614K9705k119m17L4855K8787p370m6571k1308m479
$$ y = [14168, -2505, -27664, -47794, -18108, -18434, -11730, -3554, -6895, -5785, -17359, 102, -3016, -16821, -33871, -55448, -71640, -53229, -30900, -39983, -28899, -18746, -11767, -11753, -28849, -49969, -65191, -85708, -92687, -63798, -41555, -34059, -55783, -36780, -15945, -7726, 2544, -7829, -31431, -30606, -21298, -28059, -31748, -43588, -29967, -26483, -28563, -3314, 19443, -102, -31417, -28505, -8045, -15742, -32244, -39829, -28052, -47540, -61919, -70677, -71565, -46545, -34128, -46463, -76425, -83848, -59234, -55411, -41533, -24214, -38627, -49890, -55174, -34744, -26155, -15938, -32041, -49095, -57674, -59647, -45585, -23720, -32704, -20489, -21258, -32819, -18431, -2981, -16787, -15817, -43510, -51227, -62252, -65866, -36161, -38280, -38697, -3842, 24945, 17575, -28996, -50304, -54783]
15812e4783J4630P389J6009O114l7969j1185J8405K1105J5618p620J673l542j2433
15799b6589j589K861J2458J2837J7457k0145j1605l1996p994K5777L3851o32k0204
15786a5513l5497m826J0778N592J7634K9699M859l1548q57p471k758P908k947
15773b4947j75p055p836k750j6880n413J1104L3034R552k0279j842J4587J0593
15760h307j6087j6325N56L286K2160J148j8823r416J954J1134n031j3219M504
15747d2466K9938R953k43j0400j1926j1844r332o389Q363J7143j3241j2987J7713
15734c5718J9609R796L4908j1136k7554j8905J667k482L453n598R250J7420k521
15721g811r034p238k4239L642J4730J4353j5454j2351j2157j5712m999K3703o268
$$ y = [-54783, -40153, -32764, -16755, -10641, -48610, -59795, -41390, -20285, -4667, -12287, -10614, -14156, -26589, -28178, -25317, -12859, -22, 17435, -2710, -14315, -46311, -54305, -28528, 5323, 4691, -15513, -51010, -55836, -45058, -39466, -21832, 7867, 12726, -18822, -19679, -27150, -29908, -22000, -24947, -25122, -32177, -40013, -42763, -59643, -65056, -53952, -20918, -11366, -31645, -33487, -18900, -8307, -24394, -40719, -40163, -36877, -14717, -13569, -32392, -41808, -39854, -28720, -33751, -46970, -42466, -12528, -2575, -2818, -13218, -25144, -36988, -46320, -52709, -44346, -27203, -40444, -53431, -35718, -16109, -6313, 28595, 17459, -10095, -29000, -27333, -29815, -26362, -31960, -22710, -5290, -7811, -16845, -24083, -48322, -44680, -29950, -15597, -31051, -43402, -55559, -71271, -76270, -52567, -58835]
15708e8835J3566K321q94m692l083q320P750J9140J8929p880k4193k2306K1499
15695d6998J5313k670m357j0459P468J6489k3680p879l669K512K2842L0537K2066
15682A7515k4221q951J5853n210m351K6295M4137k1049n7318k9129J4926J6576
15670a4927J1544K916J5539k8835K094L960K103j7216q443K0236j3209n1042j9570
15657i4850J0984K2681j1576j4887R807J6722L308j095K761J9123k379O528K4447
15644h426q205k4823j6488o536K0149P941J022j3555K039J0454j6026Q803K2268
15631b1383J6520j151j5947k0237j410Q39K1007m851J4571J7314N99k7962k3520
15618d5611L921K1449J611J635l146k2417l4386J58R464K087o039J1829K7207
$$ y = [-58835, -45269, -42948, -43842, -48534, -51617, -59937, -52187, -33047, -14118, -21998, -46191, -68497, -46998, -31685, -34355, -38712, -49171, -41703, -25214, -48894, -56773, -60442, -57930, -35088, -4551, 17515, -6706, -15657, 196, -5014, -9365, 16930, 61067, 40018, -17300, -46429, -31503, -14927, -3383, -467, 15072, -13763, -11669, -7709, -5606, -22822, -31265, -11029, -24238, -75280, -94850, -83866, -61185, -72761, -87648, -77841, -61119, -57811, -58906, -56145, -37022, -39401, -32873, -8426, -16631, -41454, -57942, -64478, -44329, -36388, -35366, -48921, -46882, -36428, -52454, -43651, -21383, -4863, -6014, -21961, -42198, -43608, -42769, -21762, -26613, -12042, 5272, 5871, -22091, -45611, -41690, -20241, -18630, -16995, -20141, -42558, -76944, -76786, -67322, -65235, -71274, -59445, -32238]
15605c2238L0060J3877l3769m094L6001p631k6697J4186o765l755K9444J5008
15593B3627J5094o424k4263j0002j1665M134k0419k7301J8398j3533K684J1578
15581c8092J759k648K7415L5022j972o113j4465l0002J4843J5456J4874j0408
15569E669j3375j2673j4397r473N614K2916K6017J2917j1458r076j4320j6619
15557b8258J1288l280j2562J0916p403J7995J9648J091j2155j6031k0009K732
15545c6028L6813j1737l7503j7883L4622l983n522j8904J4235K5155j3800k9507
15533f4042K7069Q967n454j5068m20N312J7174j292q243P425M0125K4842K234
15520C8629l836l8803m2752l3637J4901K7049r780R794J3053O176J4694N548j0729
$$ y = [-32238, -2178, 11699, -22070, -26164, 9837, 2206, -24491, -10305, -17070, -20825, 8619, 23627, 38721, 32297, 8034, -1968, -13633, -9499, -29918, -57219, -38821, -52354, -49670, -38092, -36333, -38981, -11566, 23456, 21484, 15371, 906, -29096, -14253, 1203, 16077, 5669, -7706, -20379, -34776, -44249, -38635, -15719, 10298, 23215, 11757, 2681, -11639, -28258, -16970, -20250, -32812, -21896, -29299, -11304, 8344, 9435, -2720, -18751, -38760, -36028, 785, -10952, -48455, -66338, -31716, -35699, -41221, -60125, -45890, -20735, -34535, -64042, -36973, -28006, -33460, -48528, -48948, -43636, -26462, -27754, -35997, -28572, 11553, 36395, 38629, 34793, -4010, -46762, -80399, -65498, -38449, -48229, -38435, -25382, -19206, -4512, 1036, -9693]
15507i693K8236K082l6172q220m650R972o825j0539Q317K608j9875j2161n337
15494f2257M707J8548n415p587J2476K0720P458Q24j9095l721J4181J6573k997
15481e585o791j4201k6784p236J0224K0330J4704j1222O614j539K688O840n984
15468a7942J2016M714n623R987o757n054n144P38R639m497J0566l4890l0992p368
15454g0607J5026j3848o493K1411K4586k0776j3313M281j3830j819K9150M625
15442d1607J279L974L6953K7416m77l1744J5010J8722K7933l066l6175k9586K960
15429h408k0N380k453j7798k3586j7515k340j3478J0225p62J8962j0757m942K8439
15415c9053J177J174j2737m743j0683J887M174p007J6715l301J3345J2764k309
$$ y = [-9693, 18543, 20625, -15547, -23767, -28417, -18445, -25270, -35809, -27492, -24884, -44759, -56920, -62257, -57550, -39002, -44417, -52004, -39528, -18808, -11350, -10526, -29621, -33342, -19161, -2588, -5585, -12376, -26577, -53361, -60597, -50373, -30043, -15339, -26561, -19947, -21486, -18798, -11958, -17942, -5926, -1212, -6835, 3152, -3605, -8659, -13803, -13065, -3426, -7923, 2643, -32247, -63239, -70607, -55581, -69429, -75922, -54511, -29925, -50701, -64014, -59733, -73563, -75382, -46232, -41607, -40328, -36354, 599, 28015, 27538, -4206, 10804, 29526, 57459, 54393, 18218, -11368, -8408, -8428, -3048, -5501, -23299, -46885, -64400, -66740, -80218, -69993, -70755, -51793, -62550, -67492, -39053, -37876, -36702, -49439, -54182, -64865, -62978, -58804, -65811, -49096, -52397, -39052, -26288, -28597]
15402b8597n840J4869J4018m1162m5314j753R328R148K5755J0837k1509P928j2952
15389f5244p059o11L7938K5019J6884k0861j625N479M43j5425k3989l702J4942
15376c7811m298Q708J0201J3587J2443N90j0921j0742P203Q764J6666r145m0075
15363c4830j1558J85k9693L87J426J5373J0551J8454K0134j560J3235J6052k5644
15350g488j2510N986j413l77k1052J8711K4851l366j9523j7773n459K5708k3375
15337c7080N253J5199j793j5093j382j1044k1415q78L0512J6678N653k1296k2820
15324e9506J5680J6911J1032R798O048L983J7750p878k6538l3572j0522k173J1516
15311d7471j4472R240L0493o89Q940J2095j1691l962M224N5j5636j5752L3428
$$ y = [-28597, -34437, -19568, -5550, -46712, -92026, -93779, -84451, -75303, -49548, -38711, -60220, -52292, -65244, -72303, -72914, -34976, -9957, 6927, -13934, -15559, -10080, -9637, -25062, -49051, -52753, -37811, -42109, -33401, -23200, -9613, 2830, 3420, -7501, -18243, -11040, -2276, 14390, 5245, -34830, -46388, -46203, -75896, -75509, -74083, -58710, -48159, -29705, -9571, -11131, 2104, 18156, -7488, -19998, -14012, -15425, -15802, -36854, -18143, 6708, 3342, -16181, -33954, -39413, -13705, -37080, -31827, -16628, -18421, -33514, -34896, -45940, -67355, -68233, -37721, -21043, -15390, -36686, -59506, -43826, -26915, -15883, -6085, -37, 3946, 21696, 13818, -12720, -46292, -56814, -58987, -47471, -61943, -52703, -22210, -22899, -13959, -1864, -13555, -17517, -13293, -13238, -28874, -44626, -11198]
15298a1198J8317J6836M246k286r814j2306p741o558o845j0544j658r596P679
15285c1468M213N42M901J1491j0586j6000J4760J7659q984k1338p509o77K5777
15272a7219J3387j3464k4457j056L2577N852J9124k8254l5764j1269J9808J4177
15260b6558j2120L0002J9229K945n876j1279j9137j1080P287J8524K95N346M639
15247B217J7496p967j6821j565J1870J0638r932k4062k789N256Q438J4765P37
15234H281J7108L516k5860m1843j3185Q709J0287j3096j4050J6493L1172Q633
15222c835m139q112J0193J3727k995K631J1637k4340l8297L388K8374J3371j4904
15209a3301k0044p896Q371N803J3364J1562K0046L9358k6707j7467J1586l317
$$ y = [-11198, 7119, 23955, 28201, 25915, 16101, 3795, -3946, -10504, -17349, -27893, -29551, -39147, -31468, -27255, -26713, -21812, -10321, -20907, -36907, -22147, -4488, -13472, -34810, -42319, -42996, -17219, -3832, -17296, -41753, -42809, -10232, -4380, 14744, -13510, -49274, -60543, -40735, -26558, -38678, -8676, 10553, 13498, 7622, -3657, -22794, -33874, -26587, -8063, -7768, -2422, 2217, 19713, 11746, -5075, -6640, 5230, 15868, 5936, -18126, -20915, -15659, -7221, 7544, 8281, 25389, 28905, 3045, -38798, -51983, -43274, -32987, -46083, -60133, -43640, -12468, -3835, -7974, -16086, -5893, 7834, 4839, 7470, 19107, -5233, -43530, -40142, -11768, 1603, -13301, -33345, -41241, -32870, -27067, -13703, -2141, 17905, 57263, 30556, 13089, 24675, 21358]
15197B1358m1201l1004k369J7379R853J5937q048m040L1273J6175m868l632p236
15184I577l497O685j5882j5837o097O506j858j2800j929n246L249L0031o815k781
15170a6694m963o184J3949N087k0113k256K6884L1133j1542q794J9260p852j5871
15157B044j605O943P540Q70m320j2310k5045J964j4225q650M297K8220K6297j997
15143A0023j9326J9871R093K977o916M189r611k8712j3714J8069k4174r063J7662
15130b9632K6020J5181j1977q004o612m228J2793K4077k6905j6320J1668L1089
15118A7150l350P455n540k5055k7258j3439Q23L2805J1165q201j9141J2585J2591
15105g410J7998j3384j8761J1618j1488J1751L4475k3851j7065J5843k0731r559
$$ y = [21358, -19843, -50847, -53216, -35837, -25984, -10047, -18095, -22135, 9138, 25313, 20445, 16813, 9577, 6080, 12765, -3117, -18954, -25051, -18545, -20403, -33203, -35132, -40378, -37129, -7098, -13913, -16694, -21657, -27841, -13892, -8805, -28918, -31174, -4290, 26843, 15301, 6507, 25767, 17915, 2044, 439, 7382, 14922, 15792, 11472, -838, -25883, -23919, -38144, -46794, -42497, -14277, 12020, 10023, -9303, 10568, 19661, 22638, 15722, 19911, 10300, -18412, -32126, -14057, -38231, -47294, -29632, -3612, 11569, -408, -8412, -15024, -19252, -6459, 17618, -9287, -25607, -13939, 17150, 13800, 21255, 15715, -9340, -36598, -50037, -49214, -16409, -5244, -13445, -32586, -20001, -7410, 10588, -2796, -21557, -9939, -21427, -9676, 24799, 948, -16117, -274, -21005, -30564]
15093c0564Q070K511j0843m654q14j415k3914l0901K8651L7009J6369O64k890
15080a2721n197Q636O713q376j9459j5936N052L850m06j3963K18p106K9939L2743
15066C987k2760j2304K2013k1713q694l1554k462K182K6435l633K0545o87j9843
15053d8488n021J4268M282J7954J016l1865j5488J0194J9279O325K850q790j6299
15040d9783K2032k89K018J0401l1972K22J9638J6144J4687j5764K222m72J615
15027i301q961o40k1821r853J3481K7896o621j2101J2860j99K4272n495q369j3597
15013a8449K6874J8446o338k5193k0207m694K5485J3795P38j2029o962Q460Q953
15000H879N746p945k1198j4123J1808R891j4586J2508j0303k5633J3818M206l125
$$ y = [-30564, -22494, -19983, -30826, -35480, -36294, -37709, -61623, -92524, -63873, -26864, -10495, -9831, -12721, -17918, -9282, -2569, -10945, -30404, -46340, -41288, -37438, -37844, -51807, -51589, -58695, -28756, 3987, -18773, -31077, -9064, -30777, -39471, -71025, -73487, -71305, -44870, -48503, -27958, -28645, -48488, -53509, -39241, -34959, -17005, -15989, -47854, -63342, -53148, -33869, -27544, -24694, -33484, -49783, -27751, -28040, -26022, -15621, -47593, -47371, -27733, -11589, 3098, -12666, -10444, -10916, -9301, -18262, -18902, -40723, -50576, -37095, -9199, -15820, -27921, -15061, -15260, 9012, 3517, -4852, -18449, 8425, 26871, 20533, -4660, -24867, -29561, -4076, 9719, 10457, -1572, -8534, -74, 8879, 14625, 6680, -14518, -28641, -16833, -6942, -21528, -9020, -19323, -44956, -31138, -26932, -30057]
14987c0057j5240J4735K0551J0196J0771k8216j0490o263o301O770K2339J5818
14975D613K2148j6935j6408k4020J5642J4992j3943r886K4179j0032k6265O241
14963b9674O500j0018l91J7025J7238k3145q038J2166J620J363j4762l161O889
14950b6388L159J2504L7251l311l2446q052O945Q373k0409k7675K867J4785R866
14937b2531L2175j984p491m683k5259m921K878q521P108J1506J7855Q445J5794
14924B0371j7820j6673l1708j4840Q839J7422J8769l935J3919n815K5765Q327
14912B2621l2562l90K3104m572k2140m908l6109r834r229J1111K9581r371N068
14899c7630J5565J1667K270o297j1818l014J5075R18r140j4806j2990J0833J272
$$ y = [-30057, -45297, -30562, -10011, 185, 10956, -17260, -27750, -34013, -40314, -33544, -11205, 4613, 26761, 9826, -6582, -30602, -14960, 32, -13911, -23797, 382, -9650, -35915, -29674, -23174, -33192, -33583, -16558, 680, -22465, -30503, -18337, -16717, -15354, -30116, -33277, -26388, -23229, -10725, 26526, 23215, -9231, -17283, -10338, -1965, -22374, -50049, -47182, -32397, -22531, 9644, 7660, 169, -4514, -29773, -34694, -31816, -40337, -33229, -21723, -3868, 4577, 20371, 2551, -14122, -45830, -60670, -51831, -34409, -15640, -19575, -5656, -11471, 14294, 22621, -9941, -10331, 12773, 8201, -13939, -18847, -54956, -64790, -74019, -62908, -33327, -42698, -37630, -22065, -10398, -8128, -14425, -26243, -29257, -14182, -13264, -22404, -37210, -50200, -39367, -38095]
14886c8095k1901K755K4166j3234l955J0706J9104j631j7419j5177O132M997j0394
14873e3946j2494K74J3570K5756k048o694j2326j3861P298L737K370J163K121
14860d5080k546L569j399J2380K4291k5184p611J8300L1426j3412m9626L350J2842
14847c8700J7794N831o911l527k0676j1170k007K9012M8233J1246L567r58j8602
14834A3132j2044m328K4118N051l471k9278l5441j036J5262M456j723p620J458
14821c1464m022J8547r93k0256L375J3188L743L705j5302l7814j1596K9197K5562
14808b4130M416Q45K489j358K913J2245K0021p272j6666k0145p018j6515L363
14795d6812L9140J2214l428r191j0872q172J5228P04p587r482j4385N62K0102
$$ y = [-38095, -59996, -57241, -33075, -46309, -50264, -39558, -20454, -22085, -39504, -54681, -48549, -43552, -53946, -66440, -66166, -52596, -26840, -28888, -35582, -47908, -61769, -54471, -50734, -48364, -47201, -45080, -47626, -44057, -45456, -33076, -8785, -33969, -41580, -23280, 8146, -5266, -54892, -51542, -38700, -20906, -15075, -21986, -25513, -46189, -57359, -59366, -30354, 17879, 29125, 32692, 31734, 13132, 1088, -3240, 20878, 25929, 22458, -6820, -42261, -43297, -28035, -23579, -25302, -32922, -31464, -35486, -16939, -17932, -38188, -34813, -21625, -17882, -14177, -29479, -67293, -78889, -49692, -24130, -19714, -18869, -16380, -17738, -14825, -2580, 17441, 10169, -6497, -26642, -33660, -50175, -46812, -7672, 4542, 1114, -8077, -18949, -27121, -11893, -11189, -18776, -28258, -42643, -42081, -21979]
14782b1979K5978K2562p939j0598R86J3575P167J526k6738m021O950k8372l761
14769b4664J912j6453m322l648M846J6724J1129P87J264K1409j1239Q725q328
14756a858l5870k567j0871R654K762J4324J4137j2994j0485q242l019J1463K1386
14743a2180r270k7041j3293K8270J5193j2329q451J1248N878R02q102L208K746
14730b3221l0146q753J829J5607O135J3712P599k345k310P700O328p908J1252
14717d521N795N112j2273J3j3077j269Q548k9094n243j8401J9730K1243O613k932
14703a9756J4660Q765P062K019q329r129k7503o031r000N048K6660K277k2650
14690c5907j2392p848J9959L7832j094k3524n734J8158o154q126M806J2136O969
$$ y = [-21979, 3999, 26561, 18622, 8024, 9010, 22585, 29752, 31278, 4540, 519, 7469, -20903, -24664, -22752, -39205, -43527, -47175, -42329, -25605, -14476, -13689, -12425, 8984, -2255, 6470, -1858, -37728, -40295, -51166, -41512, -38750, -24426, -10289, -23283, -33768, -42010, -45029, -33566, -12180, -21450, -48491, -61784, -33514, -18321, -30650, -39101, -27853, -21975, -21073, -29175, -25967, -23221, -53367, -62120, -60291, -44684, -38549, -24837, -17238, -19583, -21893, -14193, -7865, -15773, -4521, 1274, 6386, -5887, -5874, -18951, -20220, -11672, -40766, -46009, -64410, -44680, -23437, -16824, -19756, -5096, 3669, 10731, 12750, 4421, -4708, -32211, -38242, -47242, -42194, -15534, -13257, -35907, -48299, -56147, -36188, 1644, 550, -22974, -28708, -10550, -16704, -24830, -20024, -7888, -919]
14677i19L494r301r879m308j4726L766R599K518L988P252j0606O792j0373j2397
14663c5100K8532j502k4216K1456j5608R256n06l507J1020K3029j5137l2341j1418
14650d6042O785j8844l990L869J3305Q054Q119J0281J3490K9424M52j2446K2717
14637C5174R532j5040j5118j2494j1239l2374j8245P125K5522N164j5578K2041
14625a5530P515O742l705j6234m857J1563J6379O880j7557j527o942k820j867
14612b1960J0096q571L260J1185P799J4400P148J3137j4902k0190k7293q490J9310
14599a5071j0061J360Q750M569J397J958k2096j7538r728K5351K2010L787q155
14586a3467O251L814l8310o607J5370L479O251j6662k0441J2230K8176J3141j4592
$$ y = [-919, 2575, -6726, -16605, -20913, -35639, -31873, -22274, -19756, -15768, -8516, -19122, -12330, -22703, -35100, -6568, -8070, -32286, -10830, -26438, -17182, -17688, -21195, -10175, 12854, -2283, -34624, -46042, -39257, -58101, -62091, -58222, -44917, -36863, -28744, -18463, -4973, 24451, 24903, 12457, 35174, 44706, 29666, 14548, 2054, -9185, -41559, -59804, -52679, -27157, -21993, -37571, -15530, -8015, -1273, -4978, -21212, -26069, -14506, 1873, 8753, -8804, -10331, -17273, -20093, -21960, -11864, -20435, -17175, -5990, 1809, 16209, 23357, 36494, 21592, 1402, -25891, -34381, -15071, -25132, -23772, -15022, -10453, -9056, -7098, -29194, -46732, -56460, -31109, -9099, -5312, -13467, -7216, -3402, -41712, -48319, -32949, -29470, -23219, -39881, -60322, -48092, -19916, -6775, -21367]
14573b1367j8729j0718K0841k016l68J6277J5638l545q878j1431M881l658k768
14560b5841J0053J0607k0872k27P620L6245J0643p161q886j6748l259K2668p545
14547G297j6399k1027O134J1400J9598q509k4238j2519j2232R780o705J1039k127
14534c8508j8668j3642M514L3078J5836N106m20Q52j858M920q492L603J2296r942
14520a1325n088q488m001n087l857O641J0318J7826J3998R571L19n7941m5722
14507h2836j3374J2884R211J4232K6856J9066J3398N296k712J8557n310j731J8715
14494C2252k0881j440nk0411j3269J4778P372J2970j7746j8013k6618q698m2j306
14480f1057L5928J3951O582O429k167j8995N413J8797r877k44j0999p294J599
$$ y = [-21367, -40096, -50814, -29973, -31989, -32357, -16080, -442, -3987, -12865, -24296, -19415, -23073, -25841, -15788, -5181, -26053, -26280, -18660, 17585, 28228, 21067, 12181, -4567, -7826, 14842, 7297, -9102, -30129, -23995, -12595, 7003, -1506, -25744, -38263, -50495, -40715, -47420, -36381, -38508, -57176, -70818, -66304, -33226, -17390, -12284, -12704, -11852, -13710, -8790, -17282, -13679, -1383, -11325, -16413, -24901, -28902, -33989, -37846, -31205, -20887, -3061, 10937, 20508, 20827, -37114, -82836, -96210, -83326, -74115, -59883, -33027, -13961, -563, 4733, 2021, 20578, 15268, 13537, 32252, 11371, 9931, 9926, -10485, -23754, -8976, -1604, 11366, -6380, -24393, -51011, -59709, -59751, -61057, -25129, -11178, -4596, 1833, -334, -19329, -13916, 4881, -4996, -5240, -16239, -23533, -21934]
14467b1934J0252K9716j9269J788L7663N430j0389k5744k8134l008j6999j442
14455d2070K6152k216J6936K4580L0508p5j3808j4442l3369j1888j8037j7822
14443e5551K1575N646j7412N99K3448J6316p996j4574J7478J3544j6874j7731
14431c1532p894k1378J7164L5389l867p455o993J376L018J675n960K4088K3222
14418B0853L656k756j4911k7343q687j5019J397R676K6242k782N037K0044Q285
14405B3692j3854q676O416m389Q4j2911j9430L482R100P078K042J9049R656j6215
14391E124p370o170m702P601q86q561j0265k3741K8990K4047m869n970n543q490
14377b0805J6381J1060N54k0139j429K079k2782k2024O633K270J4739J3333P689
$$ y = [-21934, -11682, 18034, -1235, 553, 38216, 43646, 33257, 7513, -20621, -23629, -40628, -42070, -15918, -18134, -1198, 23382, 53890, 53815, 40007, 25565, -7804, -19692, -37729, -55551, -33976, -28330, -45742, -45143, -21695, -5379, -13375, -27949, -10471, 3073, -13801, -31532, -39426, -60804, -43640, -8251, -12118, -19573, -26566, -25190, -22172, -20497, -26457, -2369, 20853, 24509, 21753, 6842, -20501, -29188, -44207, -42810, -33134, -6892, -9674, -4637, 15407, 23692, 9838, 1162, 7578, 3189, 3273, -9638, -29068, -25586, -16486, -9408, -7366, 11683, 21339, 5124, -2246, -8416, -13118, -5517, -6403, -14964, -25229, -48970, -19980, 4067, -802, -6772, -12315, -20805, -4424, 6636, 7190, -12949, -14378, -12299, -35081, -57105, -50472, -48202, -33463, -20130, -12441]
14364a2441J0404L503O527j3332j5969m715p115M034R678r689j7139q150N688
14351d8716J73L3407p20j7052l144K2084K2895J5792j7275j9612J1116P613j1515
14338d954L460m401R444o78j9699j6275K8921J3646Q11q236j3186O164J9654P49
14324A5420L063J1917J7794R60l5801r728o243K7782M070R680m083Q228r443k2231
14310A1385k0400K5553J4529k9650j3937R263J2041j049k0875p402l5582Q572
14298d7552L0281J6472P608K590L355N450k4638k45R359K824k724J9063j0334
14285A1509j7319j5606J5759O274K7122m5187k0243K0930o00r244J1897K1267
14273F559J1901K7269J8657L760k0616l8289k4848q896J2795J8414j6457L161
$$ y = [-12441, -2037, 1466, 7993, -5339, -21308, -26023, -33138, -29104, -19426, -29115, -46254, -54404, -48716, -48543, -15136, -15856, -32908, -36052, -13968, 8927, 24719, 7444, -12168, -1052, 6561, -4954, -1494, -5895, 3549, 2871, -16828, -33103, -4182, 9464, 10275, 2039, -11147, -4983, 14671, 15420, 18483, 30400, 48194, 49154, 13353, 3625, -2618, 25164, 29234, 38914, 34831, 43059, 33616, 11385, -9015, 16538, 31067, 1417, -12520, -3257, 8784, 7735, -13140, -20542, -56124, -47552, -17271, -799, 6809, 9399, 12754, 18204, -6434, -6679, 2680, 5504, 2780, 21843, 11509, -5810, -21416, -5657, 617, 27739, -17448, -37691, -16761, -17361, -26605, -14708, 6559, 18460, 45729, 64386, 68146, 47530, 9241, -15607, -24503, -11708, 6706, -9751, -6590]
14261f590J9125j7140l643O757j593J2092n114O442J2566J2234k5542j7639K0214
14248A2169J5978J0121J9276r793k0279j6484q523J802J1993n426J8560J4761
14236D4155j3790l9504m483k758o592l623l310J5806J485k0764m979J0120K5185
14223c052K7983Q02j3375L829K4O665j0686J9428O57r087P7j721J0032m41k2246
14208H889J2229L4215J7957j0653m7785l2141K2659L2079q68l2707k287Q988q519
14195B056r125j0752j351j7826j4742J2841K3240J2910J5866j3443J228o344j7054
14182b2496J0225L969J9200K7158k7272j4595J4667k3823k8383l718K8156L2987
14170A6075q5J9646j8457l0127J7200L54J8673m985o423m368o38L611r433k4519
$$ y = [-6590, 12535, -4605, -8248, -1491, -3084, 9008, 3894, 10336, 22902, 35136, 9594, -8045, 12169, 28147, 38268, 57544, 47751, 27472, 10988, 2465, 4267, 16260, 10834, 29394, 44155, 30365, -9139, -13622, -16380, -22972, -26595, -29905, -14099, -12614, -33378, -38357, -28237, -3052, 24931, 25733, 12358, 16187, 16211, 22876, 12190, 31618, 32275, 23188, 23265, 21544, 31576, 31135, 8889, 21118, 55333, 73290, 62637, 14852, -17289, 5370, 37449, 36581, 3874, 1587, 10575, 2056, -7069, -17821, -19172, -36998, -51740, -38899, -15659, -2749, 13117, -326, 902, -5442, -22496, -12271, -8302, 10898, 38056, 10784, -3811, 10856, -12967, -41350, -45068, -16912, 16075, 15990, 35636, 17179, -12948, 4252, 4606, 23279, 18294, 11871, 7503, 6865, 10476, 1043, -23476]
14156b3476R551J2064K110j7839q159N849K8669j0072r703q499J1104K5011K1667
14143C8277n732R87o982P669k2416j9212J9059j7400j4116J5327J1883M57k7570
14130a9769q867l088O131J7860J6810j3617N968P942N891j0j2988l859K0450M481
14116B3335j4801L613J581j972p232j2065J803J6861j2420r669p600J3485p633
14103a2714O265j5908j023K5883k649j955k806M841j2305J2355O201l377R459
14090A2267n375J256Q237j1046r237J347k329K3928J625k2478j826j63O246l154
14076g02J4251j1763k626J3446K206l551N062o227k4612k7564n755K6895k921
14063b3861M684L1358n514r1j1417j925Q792j4834p786L670j318j4479L190N207
$$ y = [-23476, -13925, -1861, 249, -17590, -25749, -19900, 8769, -1303, -11006, -19505, -8401, 16610, 38277, 32545, 33532, 26550, 34219, 11803, -7409, 11650, -5750, -19866, -4539, 7344, 7801, -19769, -28636, -31724, -25593, -7733, 9077, -4540, 1428, 9370, 15261, 15251, 2263, -1596, 18854, 23335, 8534, 12147, 13728, 11756, 4524, -7541, -5738, 11123, -1297, -10966, -18566, -5081, -12714, -6449, -22357, -23380, 2503, -146, -2101, -4907, -66, -12371, -16, 6185, 2808, 12267, 6892, 8148, 16385, 5339, -3898, -2551, -4880, 19048, 20673, -1805, -3631, -3794, 2452, -702, 13549, 1786, -840, 12606, 14812, 11261, 16323, 10096, -14516, -42080, -47835, -20940, -23861, -19177, 12181, 6667, 6576, -4841, -6766, 2026, -12808, -20594, -16924, -18242, -32721, -29531, -24324]
14049b4324o835K971k636j3869P443K5230L1913J442j2228j1852k3074K222j0701
14036c4298j8310K610K5328Q133j4854J8253K8186k0349k6502J048N805o250O246
14023b4954L1378R075m393K7289J174l3844k337j0538m1192o837J5007K3313k476
14010a9335j1734M366J6874K5657J7606k3636M671J1615k0784r277M702q427J895
13997e807n570J8930J2292P211L184l4616J8502J4925k712j3817j8245L301J4424
13984A2002K2600Q760J2769k3013n03M361o182j7753J9498J5198k3533r276K001
13971A6929j1737J0042n284k935N727J6806j7469k5707m308J8626K487n065K0876
13958A8988K4081k6359J9M15j428J105K175j4635n757J9086M194k9738j032J3961
$$ y = [-24324, -31159, -28188, -30824, -44693, -37250, -12020, 19893, 21335, 9107, -2745, -25819, -23597, -34298, -52608, -49998, -24670, -16537, -31391, -13138, 15048, -5301, -31803, -30755, -24950, -31200, -24954, 6424, 15499, 11106, 38395, 39569, 5725, 3388, -7150, -48342, -55179, -40172, -16859, -19335, -31069, -26703, -9829, 15828, 33434, 9798, 14469, 26084, 5300, -3977, 725, -7702, -5807, -11377, 7553, 19845, 27056, 30240, -4376, 14126, 29051, 26339, 12522, -5723, -2422, 12002, 34602, 43362, 56131, 33118, 32615, 36976, 30794, 13041, 32539, 47737, 24204, 14928, 16929, 5192, 15234, 9950, 7015, 12742, 29548, 12079, -13628, -17936, 690, 3177, -1888, 18988, 43069, 16710, 16729, 17144, 15716, 16821, 18996, 4361, -1396, 17690, 21884, -7854, -8886, 5075]
13944E075j227m465m044l297k2220p590M855M474k0058n436K2699J2584J1922
13931f728K309P178k572r15K513O617O952j0862j34J3008j2813k2725j1687L0574
13917G15K7813L828q08j3165j4361l792j9085J0167l37p859j560R532L4761n30
13903B5319N069j2461J914J62m017J9875N372k7023j1802k8453k4170R417J6801
13890b3997K7586j1870p796J0466K211L439J3179J2887j0935k604N985p103K12
13877A1660N695k364p955r82p68j8775m087R167J7591o96r77Q695j5353j1543
13863a0692o140M154J5244J1765p823m418L738L460J2404J6797l359j0397J729
13850B6462p605K029O543J1933J4766L237k4937q359q426J668k1365J569j8718
$$ y = [5075, 3848, -617, -4661, -7958, -30178, -37768, -32913, -28439, -48497, -53933, -31234, -18650, -6728, -4419, 2759, 187, -728, 1785, 8402, 15354, 4492, 4358, 17366, 4553, -18172, -29859, 715, 28528, 32356, 31548, 18383, 4022, 230, -18855, -8688, -9025, -16884, -18444, -8912, 25849, 25319, 30388, 17927, 19841, 20003, 15986, 35861, 41233, 14210, 2408, -26045, -50215, -40798, -23997, 3589, -8281, -16077, -5611, -3400, 39, 13218, 26105, 15170, 12566, 18551, 11448, 11660, 17355, 14991, 7036, 6054, 5286, -13489, -17576, -8409, 9182, 8486, 7509, 16204, 851, -10692, -16832, -12678, 2566, 14331, 6508, 2090, 5828, 9288, 21692, 38489, 35130, 24733, 26462, 18857, 20886, 27429, 39362, 54128, 57365, 32428, 24069, 15643, 17311, -4054, -2485, -21203]
13837b1203k9518N880L8269K8943K4953k0322o683J719Q123L519n079j408p18
13824B6475J659J6446k4616k2604l822J4438k824m840J3889J8989K372k1519j1984
13811B059J4399K4113K1255l0461q280Q27P982L765j3697j4023q098p532L90r529
13797a6830K142L5112K2577J5103j9496k3617O67K0777p784k0957o032J7543o335
13784A2870M150l328J341o61K518j3791J0722L458k2866j4311R648J3627J4079
13771A7456J481P400l68J1607j0266P112r074k1555l607K694j0160J918r917J6058
13757G79J7089K1608j1354j6850K3182P852j1619l2694k7599J8645J9950k1575
13745a2586O278J7010q038j0960j7570J2627K9063K7518K744q316j5332j9898
$$ y = [-21203, -50721, -44841, -6572, 22371, 47324, 27002, 20319, 22038, 30161, 33680, 28601, 27193, 26475, 28134, 44580, 19964, -2640, -6462, 7976, 5152, 312, 14201, 33190, 35562, 14043, 2059, 16458, 40571, 61826, 31365, 23085, 23912, 31894, 35659, 21962, 7939, -159, -7691, -7301, -16830, -14688, 20424, 43001, 58104, 38608, 14991, 15658, 36435, 28651, 7694, 1662, 19205, 12870, 17020, 13692, 15033, 14372, 16890, 3099, 13821, 17279, -5587, -19898, -10250, 3377, 17456, 18937, 26337, 25969, 37576, 27310, 34422, 25348, 3793, 186, 2880, -7280, -5362, -15279, 779, 17868, 39476, 28122, 11272, 34454, 42306, 30687, -2007, -29606, -10961, 8989, -12586, -6308, 10702, 2664, -8296, -25866, -13239, 15824, 43342, 46086, 37770, 22438, 2540]
13733B540J3839L9033j8591j9808k2796J4989k7933k7114j461j489l597L3536
13721a8852K1379j5103N378N001k5145O216K25k677J6229M596l0945L7J3005J6125
13707d531M469J4801j411J0671J0741L728k1976k2932k4541R043J3961M822k59
13694c414J5511l912J244J9590j1623J5607L6056k2k2140j8003k1618k3717m131
13681b0572J4516m699j6736J2266p354L432J6355j0504R651J9579R101P790N845
13668C8670J677L007j5284J7213K1362o03j0451K972K738j8257j3354J3944j1090
13655C2544j6696J3397J0595k9401j702j8043j8364q011N935J3024M138L913J2235
13642C564p276p560R3K9302K784k7985j5027J6467J8990P250j9777o569K4461
$$ y = [2540, 16379, 55412, 36821, 17013, -5783, 9206, -18727, -45841, -47302, -48791, -52388, -18852, 2527, -12576, -7198, -2197, -27342, -21126, -20901, -23578, -7349, -2753, -33698, -33661, -20656, -4531, -62, 14739, 13328, 23999, 34740, 38468, 16492, -6440, -30981, -21938, -7977, -3155, -3414, 12097, 8185, 9429, 29019, 17396, 33003, 69059, 69037, 46897, 28894, 7276, -16441, -20572, -6056, -10755, -27491, -15225, -22579, -19147, -2792, -13296, -3645, 15934, 25035, 32825, 38670, 40347, 43354, 28070, 45283, 66645, 66042, 55591, 58563, 61301, 43044, 29690, 43634, 32544, 15848, 29245, 39840, 10439, 8737, -9306, -27670, -35681, -29746, -16722, -12584, -8671, 3564, -3712, -11272, -11179, 18123, 20907, -7078, -22105, -5638, 13352, 20602, 825, -5744, 18717]
13629A8717L3349j974J7693Q254m2067o722r234j547K3314J2873k5175M170P042
13616C8693O318m337n135K3185r793k4169j8249J5317p82j4829J8506K2132J1026
13603E7883j0192k1056K62J1139R74j7869j5452N557L1829q888l5968l0227j2412
13590d4420J6580L2835M418k1799j7599J3955L252o425K9029k127l841j6124K92
13577a1974Q513J550M354j271J4109J2459M525r180q781R897M257Q646k8828j7060
13563h784k772K8533j7257l8561J653L2165k395o19K1125K5779o002j8418j1140
13550C307R51K1496m781K373l700p070j7864r675K0503l503J9917o66r618j0653
13536A017K522L2063J2976l0132j0520R678K902l427M308l178j9075R840J3516
$$ y = [18717, 52066, 50092, 67785, 76039, 33972, 27250, 18016, 16469, 39783, 52656, 27481, 31651, 38693, 45011, 40674, 35539, 58724, 48931, 24762, 6513, 21830, 21048, 6219, 24725, 46857, 57883, 47691, 26635, 26897, 38036, 39010, 21141, 5689, 11246, 43075, 34187, -1781, -32008, -44420, -27840, 4995, 9413, -12386, -29985, -16030, -12778, -19203, 9826, 7699, 3858, -12266, -11974, -3461, -1911, 2443, 1172, 15281, 27740, 32265, 23085, 14304, 24201, 28458, 37104, 8276, -8784, -11556, 16977, -280, -38841, -37188, -5023, -7418, -8037, 13088, 38867, 32865, 14447, 3307, 4258, 25754, 20973, 23346, 19646, 12576, -5288, -14963, 5540, 2037, 21954, 21288, 11670, 1017, 3539, 35602, 48578, 18446, 7926, 17604, 20506, 17079, 21387, 18209, -866, 8974, 22490]
13523B2490m624Q99K7838J3893M306R517n320l2080q692Q709m550Q107j152k2698
13509A6643K1883j324k6699O634K1811J468l2068J5748m473o866j9677j4876M888
13496a6908J349K3311O806P880l672K321m968K1313J8088P810j4311k5350n714
13483A7955j989k137L033r379p91J4771J302Q400q740j5258J1369N031J9315M814
13469D7696m0620j5849K2413p41K896J3939J6108R577k966k208m270M022j10r128
13455D0759Q141k2539j3709j4785j1206j3194O195K0040L0763K8815J6753j6267
13443E9766l1925k9538M044K0296J5855k3315o010r449o102M236M600J0608K1600
13430C4666p661L240j601O293R833r988J68r166k0112j625m841J1030o540j1269
$$ y = [22490, 17866, 18765, 46603, 60496, 64802, 74319, 68999, 36919, 28227, 36936, 32386, 40493, 39341, 16643, 38526, 37202, 10503, 17137, 38948, 40416, 8348, 24096, 19623, 12757, -6920, -21796, -16908, -15559, 7752, 14558, 22438, 18766, 21087, 16119, 37432, 55520, 63330, 49019, 23669, 17955, 15966, 13829, 16862, 7483, 6692, 21463, 22765, 31165, 22425, 7167, 18536, 23567, 42882, 47696, 7076, -8773, 13640, 12899, 15795, 29734, 45842, 55419, 52453, 50245, 45975, 49997, 49887, 40759, 48900, 26361, 12652, -2133, -13339, -26533, -20338, -298, 30465, 59280, 76033, 59766, 27841, -1697, 2347, 22643, 38498, 15183, 9173, -276, -6378, -2142, 2458, 13066, 34666, 27005, 30245, 28644, 34937, 44770, 34782, 34950, 25784, 5672, 4047, -794, 10236, 3696, -7573]
13416g573J3785M658K1452j455M712J1439k522n313j5385k637J5583k9376J1536
13403A8904J8687P822J9814Q195j6785j0485l518r818o5L3680l40j6746K309p976
13389D3678l7341J9829j94L0559j769l419j0561j2024o675J1973J4051q629n33
13376C8945j1544j3926q749j3784j2925J5059J7551l562j592j0014j3044K2066
13364D481K799J4979P925k0928L038Q637K1366J0509J9167p161o046J4355j3005
13351F0116J684J1338j148l4826j909J8604O278K246P061N778j9603r836L342
13338D9125P039j0982r644J383J720J3227J2371J1632k038j0514k9848L395J0120
13325D6986K7585m489k4706J2945j1292j7243k1544j0590k95J0424r894K307M599
$$ y = [-7573, 6212, 10870, 32322, 30867, 35579, 47018, 44496, 39183, 23798, 21161, 36744, 7368, 18904, 37591, 45413, 65227, 73422, 56637, 46152, 42634, 32816, 32751, 66431, 66091, 49345, 51654, 43678, 6337, 26166, 25972, 56531, 54762, 51343, 40782, 28758, 22083, 34056, 48107, 39478, 38945, 27401, 13475, 4726, -9058, -21983, -6924, 10627, 7065, 5473, -4541, -17585, 4481, 7280, 22259, 30184, 9256, 12294, 20931, 42297, 52806, 71973, 64812, 58766, 73121, 60116, 61800, 73138, 71990, 37164, 35255, 53859, 60137, 62383, 69444, 75222, 55619, 45783, 49125, 56164, 45182, 35538, 36921, 38641, 51868, 64239, 75871, 73833, 63319, 33471, 36866, 46986, 74571, 70082, 45376, 58321, 47029, 29786, 8242, -2348, -2643, 7781, -2113, 194, 4793]
13312D793M477K3000J8093j5043N491M059n617O447O510j2346l782M157K0311
13299F0550j5643j8154K1698P197K7567J4732l4389j1014k0531J2359K0777r701
13287E5448Q795k0487n954M825L95J2696m104j5807p529R279r911l1376K636k808
13273c902O147K8931K1366j413j9799N348J4459l395p94r848P661R516R547j0780
13259E3044k0688J8429n023j5146k297J1346k462J7725r15o247K6741p226l57
13246F6924p98K4677J2311j8607j6501q528j7564L520j3708J5303J3771j7835
13234D2965k2272j1091j7475K316J3493j109L4712J7456q319j1313O266J2651
13222E8280j3533j4801J2016L3616k1707l2440J023J7768r260m925k107l364J9083
$$ y = [4793, 9270, 32270, 50363, 35320, 40811, 44870, 39253, 45700, 52210, 39864, 36082, 40239, 60550, 44907, 26753, 48451, 55648, 83215, 97947, 63558, 52544, 32013, 44372, 65149, 55448, 64243, 43756, 37802, 42627, 43022, 55718, 51614, 35807, 28278, 37557, 27646, -3730, -1094, -3902, 2245, 31176, 52542, 51129, 31330, 36678, 51137, 47742, 46948, 37100, 44761, 54277, 63824, 53044, 32356, 50785, 45762, 30616, 28319, 39665, 37203, 54928, 54013, 47766, 74507, 67281, 66924, 66126, 90803, 103114, 84507, 68006, 59478, 41914, 45434, 31726, 47029, 60800, 42965, 20693, 9602, -7873, -5557, 7936, 6827, 41539, 58995, 50676, 39363, 45629, 58280, 44747, 29946, 41962, 75578, 53871, 21431, 22454, 40222, 30962, 26037, 23930, 20566, 39649]
13209C9649J6323k8072m111L781K8724N628j1398j3641J2341K4232L989Q337m802
13196H0980j4429k6595j015J8612K2253p368o977l0501j2737p221j3803j0061
13184h862n762K1578J5131j3465O504M6432L5417k0698j3565K4272L010o919J836
13171H4909k173l8214J3135J5079J2360q163n49j0072p158M973j5685L97n34J915
13157E0220j01j8730j2707J2379K7381R608j6963K5807Q931P9j3706R869O685
13144H8752j7612k3618k23L9048j8294j05j8032L244K8189k7948Q170N35o193
13131E5913o462L406P733J015r743j8237k3815K0012J7018K5004m171j8485n162
13118D4026J9341K0426q935q080l8985J1715K371k2863n477J2046j9220J6942
$$ y = [39649, 55972, 27900, 23789, 27570, 56294, 61922, 50524, 36883, 49224, 73456, 77445, 85782, 80980, 66551, 39956, 38941, 57553, 79806, 72438, 65461, 34960, 22223, 15002, 1199, -8862, -14624, 6954, 22085, 8620, 15124, 61556, 96973, 76275, 62710, 86982, 89992, 83073, 84909, 82736, 44522, 57657, 72736, 85096, 76933, 76384, 66312, 59154, 64127, 48442, 48839, 48305, 50220, 50119, 31389, 18682, 31061, 58442, 68050, 51087, 76894, 85825, 85904, 72198, 82067, 88752, 71140, 47522, 47299, 86347, 68053, 67948, 49916, 53160, 81349, 53401, 61571, 62106, 55913, 49451, 52857, 60590, 61605, 51862, 33625, 9810, 29822, 46840, 71844, 67673, 49188, 44026, 63367, 83793, 74858, 66778, 27793, 39508, 41879, 19016, 13539, 25585, 6365, 23307]
13106B3307K9830M604k121K244J6083J1488J7938K1829J769j8262j6137L946k409
13093I4109k490K4325l87m6990k7961k926J6440K4155N540j3370k1922o890k302
13080C9331r937J6412j3609Q03q564j315R922n807K0687M406l0734J0089J8580
13067E0264K9166L330j4706k9494k5123Q888k20j5850K3604L1507N10k1992k3169
13054A6715J1117J7871j203j0230M00j7567J3429p02N051K0479j2790p642q501
13041B6427r175J4984J2503P822m338k8633j1961R416K296n154J6855K2456J5470
13028F8968r066q378j0583j9755J7505R394O830l185L5682L7095J4967j3322k3836
13015A02316K726N67Q616j3410k904O217l2241j3044L4475J0559k3485k2874j1098
$$ y = [23307, 53137, 57741, 55620, 57864, 73947, 85435, 103373, 125202, 126971, 108709, 92572, 96518, 94109, 91619, 115944, 115557, 68567, 40606, 37680, 54120, 78275, 83815, 70445, 48523, 41633, 39331, 29394, 45806, 32197, 33000, 24436, 23121, 33043, 27236, 47923, 52329, 21595, 31684, 50264, 79430, 82760, 68054, 38560, 13437, 22325, 22105, 6255, 29859, 61366, 61876, 39884, 16715, 27832, 45703, 44500, 34270, 34670, 17103, 30532, 29830, 34881, 55360, 42570, 34928, 26427, 17252, 32236, 44739, 52561, 48223, 19590, 7629, 17045, 19341, 14187, 31042, 53498, 68968, 59902, 51524, 40941, 21186, 38691, 48085, 54915, 51730, 87412, 124507, 139474, 126152, 102316, 105042, 105609, 114225, 100815, 97911, 104128, 71887, 58843, 93318, 103877, 80392, 57518, 46420]
13002D6420P183K9006K4021P263q224j6236j6299l442k2127N464j149q387J194
12989D4687R860K112J0356j7860k882J2111J5973M068J822k1277p420r694J1505
12976E3361l649J3250L0373k791r996J3717M468j2634L742p704J233l248j601
12963G8521l440l259K3368l332j7440L618j7573m278r934p495r598q920J0666
12950C0904L0717K2259j3933R183J1662j5911k4119R07J0721Q939M184J975n594
12937G1894m838J0928j670N666J3675K6937L992N69J1013k0585o729M666J5630
12924A31148J3243J923l4191m282M774j3753r848j3614M557j0669r508r826N916
12911E5870J1376K5090J7422J2632n378Q096Q038m748K269k0566k4036J1408J8272
$$ y = [46420, 53603, 82609, 106630, 113893, 105669, 89433, 73134, 69692, 47565, 53029, 51880, 43493, 44687, 54547, 56659, 67015, 49155, 46273, 58384, 74357, 78425, 80247, 58970, 51550, 41856, 53361, 49712, 62962, 93335, 90544, 80548, 94265, 98733, 86099, 89841, 82137, 83370, 80122, 78521, 75081, 71822, 95190, 91858, 74418, 78036, 60463, 56185, 46251, 38756, 29158, 20238, 30904, 61621, 83880, 69947, 79130, 90792, 74881, 50762, 51669, 62390, 71329, 75513, 77488, 71894, 67056, 77984, 76314, 81980, 95655, 122592, 126584, 127153, 138166, 117581, 110852, 115518, 131148, 144391, 146314, 112123, 107841, 112615, 98862, 89014, 75400, 79957, 69288, 59780, 49954, 55870, 67246, 92336, 109758, 122390, 117012, 125108, 133146, 128398, 130667, 110101, 86065, 97473, 115745]
12898A15745J4067P558K6541K4638L853O691P543k9775k6257m7528l7489k9115
12886C6472K3819P567L9204O6572J1100q873k6978p072k2815k7166J9027J2968
12874A23825j1744m00k3481k0839k1421n168K4762L4464M6674M8512M3028L8l7202
12861B01048k8375n7K0705l4061m9135k9313J477k9014o050K2025J1606j5895
12849F4961k321k3024P272K9250J4987l21J9248K5395J5541j5972j7323j3244
12837A04449m1405p198R391j250K1819K6028q040K2600J1398q014r66j7676n35
12824A10601j2005J5420K881J705j458J2289p667P876Q82k2343k3771k7527N713
12811F2596J5457n179j1647J192J5844q027n718J256J2343J3777J3502K4740J245
$$ y = [115745, 129812, 137370, 163911, 188549, 192402, 199093, 206636, 176861, 150604, 103076, 65587, 36472, 60291, 67858, 107062, 173634, 184734, 175861, 148883, 141811, 118996, 91830, 110857, 123825, 112081, 111681, 88200, 67361, 45940, 40772, 65534, 99998, 146672, 195184, 238212, 238250, 201048, 172673, 172616, 193321, 159260, 110125, 80812, 82289, 53275, 47225, 69250, 80856, 64961, 62640, 39616, 46888, 76138, 91125, 90804, 110052, 135447, 150988, 135016, 117693, 104449, 63044, 55846, 65237, 63987, 85806, 111834, 103794, 126394, 137792, 129778, 128812, 111136, 110601, 98596, 114016, 116897, 118602, 117144, 129433, 121766, 129642, 130524, 108181, 84410, 56883, 62596, 78053, 72874, 61227, 62419, 78263, 70236, 64518, 65774, 78117, 91894, 105396, 130136, 131381]
12798A31381N008l47j2755k3113j593O065p601J5165L170J5450R640K053k1958
12785A20565n675k1179j005P992j0365J7448J4549N769J5851j705k1724j9728
12773A00793K6672J8488n996J242j5908J0238R482N721R255k5527j9797K764L964
12760A21391J8115O580J9663O003o446j9709J581m727l2903p744J6548J9084r785
12747A27651o438q626r222Q660Q847K4481p253m076J3981l688M317k1999k1233
12734A05402J3786j1839l1197J3553K4605J336n354p638L4910N763l868J6268
12722A55727L6058J6231j4495l9548k5097q34K1273N863j0767j0020J2002J1906
12710A58299P083o609j1009P422M770p099J2256J7293N156M144k1029Q391o15
$$ y = [131381, 136389, 136042, 123287, 100174, 98581, 104646, 97045, 112210, 115380, 130830, 140470, 142523, 120565, 114890, 93711, 92706, 100698, 90333, 107781, 122330, 128099, 143950, 142245, 120521, 100793, 127465, 145953, 139957, 141199, 125291, 135529, 145011, 150732, 159987, 134460, 114663, 117427, 121391, 139506, 146086, 165749, 171752, 165306, 145597, 147178, 142451, 109548, 101804, 118352, 137436, 127651, 121213, 112587, 103365, 112025, 120872, 145353, 138100, 134024, 148005, 144317, 148634, 126635, 105402, 119188, 107349, 76152, 89705, 114310, 115646, 110292, 102654, 137564, 143327, 139459, 155727, 191785, 208016, 193521, 153973, 128876, 128042, 149315, 155178, 144411, 134391, 146393, 158299, 165382, 158773, 147764, 155186, 159956, 152857, 165113, 182406, 187562, 191706, 170677, 179068, 178453]
12697A78453N86j3978J5679K354Q532P323J2801j6182j4252j8152J3489o046N186
12684A75793J0481M006j7649p607R397r413j5943k6175o560J3076K24Q44J5681
12671A46155j2405r554J846O162l46K8061K4810N533k3139j969L0356k206m343
12658A88961q67r631N56P380Q656M643k9267q062J4830K745o720P715j0201j5993
12644A54745j3462M475K5806J3259j557J2642j9799m546k0917J8412m397j3536
12632A51125p954P243j1043j5608M5241J1038q48j6086Q003j0263L3L548J1556
12619A75985J0602k0480l463Q013j304L2583M498k2723j0752j7631j666Q297J6034
12606A77993K6489J0255j2276p156q878j066R621o571Q144R534k0880L11K4614
$$ y = [178453, 179039, 165061, 180740, 183094, 191626, 198949, 211750, 195568, 181316, 163164, 176653, 170607, 175793, 186274, 190280, 172631, 165024, 174421, 165008, 149065, 122890, 116330, 129406, 129630, 130474, 146155, 133750, 124196, 126042, 132204, 131858, 159919, 184729, 190262, 167123, 165154, 195510, 193304, 188961, 188094, 178463, 179019, 186399, 195055, 199698, 170431, 162369, 177199, 179944, 173224, 180939, 170738, 154745, 141283, 145758, 171564, 184823, 183266, 195908, 176109, 171563, 150646, 169058, 164661, 151125, 143171, 150414, 139371, 123763, 169004, 180042, 179194, 163108, 171111, 160848, 160881, 164429, 175985, 186587, 166107, 162644, 170657, 169353, 201936, 206434, 183711, 172959, 155328, 153662, 161959, 177993, 204482, 214737, 202461, 195305, 186427, 185361, 194982, 188411, 196555, 206089, 185209, 185520, 210134]
12593B10134K6406j7236k9714j4091R030L8374K4689j0707k6959p896L600L6548
12581B42178Q709k0989j686Q026j6049J8068L1389J8676j6022j6894p665m069
12569B43672r525j8860k1189J3847m749l40q051L397K0655K9839M625J9872L4001
12556C07194L1790L2275L561K6311N971J9481L2093J6398L4842M0754N8719Q7433
12544F96822J23929J21606J80063K52485L40574L34511K59510J37233n818j59892
12534B281023k56418k59014k36196k06468j73401j30748q0525m0623n912K1049
12524I12767L0844J7828M1894R9871R2399J11207J30633J04883O5555P3222L1486
12513A712589J0290M6292M2580Q7537J46042J82248J90443J83399J19752j2435
$$ y = [210134, 236540, 219304, 189590, 175499, 184529, 222903, 247592, 236885, 209926, 202030, 205630, 242178, 250887, 229898, 228212, 236238, 220189, 238257, 269646, 288322, 272300, 255406, 247741, 243672, 234147, 215287, 194098, 207945, 203196, 202856, 194805, 198202, 218857, 248696, 253321, 273193, 307194, 338984, 371259, 374820, 401131, 407102, 426583, 458676, 475074, 509916, 550670, 609389, 696822, 820751, 942357, 1122420, 1374905, 1715479, 2049990, 2309500, 2446733, 2440915, 2281023, 2024605, 1765591, 1529395, 1322927, 1149526, 1018778, 938253, 897630, 891718, 912767, 943611, 961439, 1003333, 1103204, 1195603, 1306810, 1437443, 1542326, 1607881, 1681103, 1712589, 1722879, 1769171, 1811751, 1899288, 2045330, 2227578, 2418021, 2601420, 2721172, 2708737]
12503B708737j27085k04518k11506j99255j51923p3827l1443j9756J5646L9087
12493A744157L7537q752m4793j14547j37648j42976j45172p8406m7799m3016k1473
12482I97112k6329J7406P6381J16635J51528K11448K35543K79721L04733K12816
12472B576994R3496n5080j68445k60486k92576k77717k34139k15928j79430j41987
12462H44702j02620p5509p8221m4751k1570k7799m2447m0725o259r125j380J2317
12450D06613k3576n380J6158j7609j414k048J3152k2778j5307J4916K229k021
12438C62935j5763r23J337m855j7739k4665p755k0465j994p255J9833Q914M659
12425B96264m555O429J5139J945J8637J7771N36J6693J3676K3645O066L4343L7462
$$ y = [2708737, 2581652, 2377134, 2165628, 1966373, 1814450, 1740623, 1709180, 1689424, 1705070, 1744157, 1781694, 1772942, 1728149, 1613602, 1475954, 1332978, 1187806, 1109400, 1061601, 1018585, 997112, 970783, 988189, 1064570, 1181205, 1332733, 1544181, 1779724, 2059445, 2364178, 2576994, 2670490, 2615410, 2446965, 2186479, 1893903, 1616186, 1382047, 1166119, 986689, 844702, 742082, 666573, 588352, 543601, 522031, 494232, 451785, 411060, 404801, 395676, 394296, 406613, 383037, 377657, 393815, 376206, 374792, 372744, 385896, 363118, 347811, 362727, 364956, 362935, 347172, 346249, 347586, 342731, 324992, 300327, 292572, 272107, 270113, 262858, 282691, 291605, 296264, 291709, 298138, 313277, 315222, 333859, 351630, 352166, 368859, 382535, 406180, 412246, 446589, 484051]
12412D84051R744O278J4252j4520j4411l451M421M960k4160l1881k8070L913Q425
12399D19551J495J3853K2738K4819K2628M769M6075L3761j012L4015O8467P8012
12387G69171J00375J46681J99137K17834L08327M58044M52813J72795j82014l27924
12377B315239l43101l15963k67832j84014j23884n4003n9253n8555k6856q996
12367H72782J7641K8805K0494M6977L0399J0161m302j4609k3199k2687k3624j8933
12355I19905Q737J9613L7271M0482N0321J9415n381k5298k4622J8758J0275j0101
12343A059375l9017j9338n76J1022O915j0090o172l943k0350n623O265J3453J9113
12330A011034J2875k1189k2575k0142k2702n116J0702L8282K4616M5643K5548
$$ y = [484051, 493795, 500073, 514325, 499805, 485394, 481943, 486364, 491324, 467164, 435283, 407213, 411126, 419551, 421046, 434899, 457637, 482456, 505084, 509853, 555928, 589689, 588677, 622692, 691159, 769171, 869546, 1016227, 1215364, 1433198, 1741525, 2199569, 2652382, 2825177, 2643163, 2315239, 1972138, 1656175, 1388343, 1204329, 1080445, 1026442, 967189, 908634, 881778, 872782, 890423, 919228, 939722, 986699, 1017098, 1027259, 1022957, 1008348, 985149, 962462, 938838, 919905, 928642, 948255, 985526, 1026008, 1076329, 1095744, 1090363, 1065065, 1040443, 1059201, 1069476, 1059375, 1020358, 1001020, 1000444, 1011466, 1018381, 1008291, 1002119, 998176, 977826, 972203, 978468, 991921, 1011034, 1023909, 1002720, 980145, 960003, 937301, 932185, 942887, 981169, 1005785, 1051428, 1076976]
12319A076976J1970L0524p316o1181o2771m3361l3658n2935l1377k3762j4623
12308G88486J9965l142l3876k669K8207L7445N4223J6730K3648M3827K4021K2809
12296A019674L6309P405l9213M267j8892k4464j127J2950j4997J6909J826M421
12284A005068k3959l0742j9478m6604j7353j7504j7064J2723J4315j5001m1825
12273H02576l996J8351k1J1973M313Q542J5724J3956R667K9242L3743M974J0648
12260I59692K7084M0847M1182L1670K1173M9485L9824J7182Q062n226N673j0011
12248A226637n999o307o814J2621L3924K5591L1066K9898M2320Q5393P8708J39441
12236A686479J69156J55791J42070Q5601K0726m6219p4037r3193p0197o1540l9055
$$ y = [1076976, 1088946, 1119470, 1112154, 1050973, 988202, 944841, 911183, 858248, 826871, 803109, 788486, 808451, 805309, 771433, 768764, 796971, 834416, 888639, 905369, 929017, 972844, 996865, 1019674, 1055983, 1063388, 1024175, 1028442, 1009550, 985086, 983959, 996909, 981912, 998821, 1000647, 1005068, 981109, 950367, 930889, 884285, 866932, 849428, 832364, 845087, 859402, 844401, 802576, 798580, 816931, 816910, 828883, 833196, 841738, 857462, 871418, 881085, 910327, 944070, 949044, 959692, 986776, 1027623, 1068805, 1100475, 1121648, 1171133, 1210957, 1228139, 1236201, 1230975, 1236648, 1226637, 1220638, 1214331, 1207517, 1220138, 1254062, 1279653, 1310719, 1340617, 1382937, 1468330, 1547038, 1686479, 1855635, 2011426, 2153496, 2239097, 2259823, 2213604, 2139567, 2046374, 1976177, 1914637, 1875582]
12225A875582m0961j7915m1515j9573k425l7012k454R846K7022J2680k224N802
12213A766853m974j422l5156R779M2639K4437K667K4332L3807N9292M8840J4576
12201A985670N425N0937N8453M9127M5109J4570J4493K4980M2488N4944L8384
12190B384580J53J1687K5424O864K9421K639k0818k1063J6217M8323M2878N2483
12178B578788M2070J6356M4859L2984L0133M8192P3500R6319P9258Q0948P3315
12167C196722M8572J8631L5897O9711Q1310R3406Q0780P3360R4710R7760Q5303
12156C976162R9426P4342O4722Q3827J24867J32303J44836J15732J45236J54353
12146E115806J57736J85916K20572J99641K23968K86389L26861L50275L94082
$$ y = [1875582, 1834621, 1816706, 1775191, 1755618, 1753193, 1716181, 1713727, 1723573, 1750595, 1763275, 1761051, 1766853, 1761879, 1760457, 1725301, 1735080, 1777719, 1802156, 1804823, 1829155, 1862962, 1922254, 1971094, 1985670, 1991095, 2042032, 2100485, 2149612, 2194721, 2209291, 2223784, 2248764, 2291252, 2346196, 2384580, 2384733, 2396420, 2421844, 2428708, 2458129, 2460768, 2439950, 2418887, 2435104, 2483427, 2526305, 2578788, 2620858, 2637214, 2682073, 2715057, 2745190, 2793382, 2866882, 2963201, 3042459, 3123407, 3196722, 3245294, 3263925, 3299822, 3369533, 3450843, 3544249, 3625029, 3698389, 3793099, 3890859, 3976162, 4075588, 4149930, 4214652, 4298479, 4423346, 4555649, 4700485, 4816217, 4961453, 5115806, 5273542, 5459458, 5680030, 5879671, 6103639, 6390028, 6716889, 7067164, 7461246]
12137G461246M31839M86437N17418N69241O56891P48998Q23298R39709J077399
12128A3712476J210681J477299J791566K206434K698950L325610M155791N166024
12120C5744831O494412Q247374J0485042J3473122J7393231K2644418L0086120
12113A44568550M0319111N2624697O2924822O2376328M3928593J2099913j9299551
12106C99542463m0220577m9713924n0677359m5827491l7514673k8072574j9411917
12099A28103948j2416578p070309k880346R13060N046526J0024485J5958505K1894172
12091A59573463K5679289K5816193K3274349J9672946J5084888R636394M701214
12084B83438736K297145M330002J1449958K2525039L4613128M2865224M1416710
$$ y = [7461246, 7893085, 8379522, 8896940, 9466181, 10123072, 10872070, 11695368, 12635077, 13712476, 14923157, 16400456, 18192022, 20398456, 23097406, 26423016, 30578807, 35744831, 42239243, 50486617, 60971659, 74444781, 91838012, 114482430, 144568550, 184887661, 237512358, 300437180, 362813508, 406742101, 418842014, 399542463, 359321886, 309607962, 258930603, 213103112, 175588439, 147515865, 128103948, 115687370, 108617061, 105736715, 106649775, 111696301, 121720786, 137679291, 159573463, 185252752, 211068945, 234343294, 254016240, 269101128, 278737522, 283438736, 285735881, 290065883, 301515841, 324040880, 358654008, 401519232, 442935942]
12077D42935942K7350663M401555j9003929l5861745m3800343m3816773l7830721
12070B94374649k7587044j5032709k987853N581083Q755127O729384J679453m228902
12062B67283188j0458639j7174220k2986480k5479996k3860761j9463909j3989760
12055A33869423q305772k723098K777784Q593499J5340917K3735115L4250420
12048B07538288M6522626N8366735O5335074O0978570M0171610O026400k8933196
12041D56006107n3103351o3718226o3719739n6912790m6663523l5811734k6418016
12034A09658728j9258293j4273519j0930299q802879p310282o205076n373473
12027C7504907m649716m047447l498568k967775k523010k105323j782116j480889
$$ y = [442935942, 470286605, 474688160, 455684231, 419822486, 376022143, 332205370, 294374649, 266787605, 251754896, 248767043, 254348126, 263103253, 269832637, 271512090, 267283188, 256824549, 239650329, 216663849, 191183853, 167323092, 147859183, 133869423, 125563651, 122840553, 125618337, 134211836, 149552753, 173287868, 207538288, 254060914, 312427649, 377762723, 438741293, 478912903, 484939303, 456006107, 402902756, 339184530, 275464791, 218552001, 171888478, 136076744, 109658728, 90400435, 76126916, 65196617, 56393738, 49083456, 42878380, 37504907, 32855191, 28807744, 25309176, 22341401, 19818391, 17713068, 15930952, 14450063]
12019A4450063j264864j101556r41829p86122o79217n74101m84535m73399m64300
12010G680140m55099m30743m69907m40834m13415l78133k77260j91843j67159
12001D455747j50611j55444j43726j48406k07461k03118j76016j09882j18485
11992C042598j36149j29088j01240p5786o2410q2353r1176p1946m5727l1389j6771
11981B198563n3568n7788m5719n7747m7187o6770n9851n9068l3753o3672n4044
11970A599396o4498o4650m1785n7582n2692m3128n6296l2821o1112l6578j3382
11959A074872j8412j6001J1266p161k7730k978j2448l3022p018Q363L8845J3926
11947A022502j547l219j7253k5429l8059l4290m426P357k7083m4376k3700n61
$$ y = [14450063, 13185199, 12083643, 11141814, 10355692, 9676475, 9102374, 8617839, 8144440, 7680140, 7225041, 6794298, 6324391, 5883557, 5470142, 5092009, 4814749, 4622906, 4455747, 4305136, 4149692, 4005966, 3857560, 3650099, 3446981, 3270965, 3161083, 3042598, 2906449, 2777361, 2676121, 2600335, 2537925, 2455572, 2364396, 2292450, 2246723, 2215334, 2198563, 2144995, 2087207, 2041488, 1983741, 1936554, 1869784, 1809933, 1750865, 1717112, 1653440, 1599396, 1534898, 1470248, 1428463, 1370881, 1318189, 1275061, 1218765, 1185944, 1124832, 1088254, 1074872, 1056460, 1040459, 1051725, 1044564, 1016834, 1013856, 1001408, 968386, 961368, 969731, 1008576, 1022502, 1020955, 1017736, 1000483, 975054, 936995, 902705, 898279, 905636, 878553, 834177, 810477, 809916]
11935H09916K279n896M3280K4130K2134P351K6515K1501Q3967J43802J78036K09469
11923A566484K48893K27423J43771P6454J7462n9856j89785k56122k44862k35194
11913A294668j77667j05989o6449o1665k8482N830n348k3278n1859o2412o4549
11902F52800n0791n9521o2051l5145j6823k453N1k8655j7598j769K5549M6469
11890D50063K5178M5268N0275M9063j175r979p13l8132l3637k3819m024o35j862
11877E05871k3395j0404R301j4353r454j7639j0917K075j4289j7426j0727k4483
11865C64160k2687r219k824M777j080N593K7694K5224R067J479m764J6933K5466
11852D39819J0209j847O696q70k0473R927k5597j67k0898m477j0318j3596Q413
$$ y = [809916, 812195, 806299, 849579, 873709, 895843, 903194, 929709, 951210, 1035177, 1178979, 1357015, 1566484, 1815377, 2042800, 2186571, 2263025, 2280487, 2220631, 2030846, 1774724, 1529862, 1294668, 1117001, 1011012, 944563, 882898, 854416, 860246, 854898, 831620, 779761, 717349, 652800, 602009, 542488, 480437, 445292, 428469, 426016, 426067, 397412, 379814, 378045, 403594, 450063, 475241, 520509, 570784, 619847, 618672, 608693, 607980, 569848, 536211, 512392, 508368, 507733, 505871, 482476, 472072, 481373, 467020, 457566, 439927, 429010, 431085, 416796, 399370, 388643, 364160, 341473, 332254, 329430, 334207, 333127, 338720, 366414, 391638, 400705, 402184, 397420, 414353, 439819, 450028, 448181, 454877, 454007, 433534, 443461, 417864, 417697, 396799, 392322, 382004, 368408, 376821]
11839C76821j3300p246j2095m3042l7302k1282j8400P076M087N581L299P811L933
11826B55941J584K5153J1997k3568l0988k2489J320p220k6522j8631O843j1550
11814A61870k9496J2501j6165j3013m3637m3500j9080o888l068K9660K9430k063
11802E6551q789J3444J755K2488L4009M0385K6329K1265j4116j3441M67r200k1142
11789A50005k3767k627j3887m568l398K5256J732L82k9337j4741J9836J1625l9793
11776G6718n1255J8846J9595L7987J3324J9442J5775K2820R632p451K2885J0058
11764B08376j71M563J6541K4858m417P635P852J90J2186J5195J0003k1588q112
11751B73111J7617n964m4359o4172j6144Q269N745R403j5992j2555J6814J0958
$$ y = [376821, 363521, 356275, 344180, 301138, 263836, 242554, 224154, 231230, 235317, 240898, 244197, 252008, 255941, 257525, 282678, 294675, 271107, 240119, 217630, 218950, 211730, 185208, 166577, 173420, 161870, 132374, 144875, 128710, 115697, 72060, 28560, 9480, 2592, -476, 29184, 58614, 56551, 47762, 61206, 62961, 85449, 119458, 159843, 186172, 207437, 193321, 179880, 180347, 171147, 150005, 126238, 123611, 109724, 105156, 101758, 127014, 128746, 129128, 99791, 85050, 104886, 116511, 76718, 25463, 44309, 63904, 101891, 115215, 134657, 150432, 173252, 182884, 175433, 198318, 208376, 208205, 212768, 229309, 254167, 249750, 257385, 265237, 265427, 277613, 292808, 302811, 281223, 273111, 290728, 284764, 240405, 176233, 160089, 168358, 174103, 183506, 167514, 154959, 171773, 182731]
11739A82731L5509L7214O0845J3753K9087L9910L9440M2733J1762N401Q710K9554
11727E36649M1420N2049P6736Q8869J03213J23990J58719J93905K31965L17441
11717A924956M08361L68998K35141L0757j36499k39593k68790k95667k71406k24516
11707A531742j76765j23550q5183m3847k9N2696M4193P6901J12904J39810J33871
11696A662743O6924K0953m740l4166m6784m8459j7755Q868M7179Q4819J49034
11685A888616K26193K68587K77461K80087K41683J84245J07213N5964O1524R4664
11675C686237L3443J1218m7599j34090k28155l01802l27911l36295l05027k44502
11665A805517j76352j38532p4846o5074l168K7234P5742J26213K02380K38686
$$ y = [182731, 218240, 255454, 316299, 330052, 359139, 399049, 438489, 481222, 492984, 498385, 507095, 536649, 578069, 630118, 706854, 795723, 898936, 1022926, 1181645, 1375550, 1607515, 1924956, 2333317, 2702315, 2937456, 2968213, 2831714, 2592121, 2323331, 2027664, 1756258, 1531742, 1354977, 1231427, 1146244, 1102397, 1102368, 1155064, 1199257, 1276158, 1389062, 1528872, 1662743, 1729667, 1750620, 1745880, 1711714, 1664930, 1616471, 1598716, 1607584, 1654763, 1739582, 1888616, 2114809, 2383396, 2660857, 2940944, 3182627, 3366872, 3474085, 3530049, 3591573, 3686237, 3719680, 3730898, 3683299, 3549209, 3321054, 3019252, 2691341, 2355046, 2050019, 1805517, 1629165, 1490633, 1415787, 1350713, 1347545, 1374779, 1450521, 1576734, 1779114, 2017800]
11655B017800L10539L55353L70685L24133K26378J56271N9703l5906p3430j01989
11645C609537o2033q0522j46830j79695k54592k80247k44467k34237j92579j68907
11635A765428r9957n2368j8026L5524M9082M6126M7808l878p2646j16471j38870
11624A441752j06446q4163j12548o7202k9121m348L7207O7996J26669J91275K32754
11613A693825K78395L13509L09614K22273N1819q7397k33449l18882l17641l28016
11603A584050k74577j83088j38823j07155p0679n4136k3373m48r494l1921l9195
11592F51161k3949m1726j0717p585k9422l5391k6586l6319q194L2134q36l3335
11580D29235k4307o69J3809O928p169J8981n762j2050M0860J7503j3244o047L3414
$$ y = [2017800, 2328339, 2683692, 3054377, 3378510, 3604888, 3761159, 3820862, 3784956, 3711526, 3609537, 3547504, 3466982, 3320152, 3140457, 2885865, 2605618, 2361151, 2126914, 1934335, 1765428, 1665471, 1613103, 1595077, 1630601, 1679683, 1725809, 1773617, 1769739, 1697093, 1580622, 1441752, 1335306, 1251143, 1138595, 1071393, 1042272, 1037924, 1075131, 1143127, 1269796, 1461071, 1693825, 1972220, 2285729, 2595343, 2817616, 2869435, 2782038, 2548589, 2229707, 1912066, 1584050, 1309473, 1126385, 987562, 880407, 809728, 755592, 732219, 731771, 722277, 690356, 651161, 627212, 585486, 574769, 567184, 537762, 502371, 475785, 439466, 431272, 463406, 462570, 429235, 404928, 404259, 418068, 424996, 417827, 436808, 431046, 418996, 459856, 477359, 464115, 458068, 491482]
11567D91482n54J7552K7852K1580r011l937j564J6472L4342J6552N860j0400j5085
11554E91141j7140L3145M0360L2241L4338K7217O6024P7225N4674l55l1423l3527
11542H73920l1613m7789m1792j5897j3971j1265k7198p222q768J7421K0281R421
11530G15528L6661N4523J0922R769J2234O044n548k3422j5209j3681l3513o178
11518G48130P001L6480J5974J8246K8950R706q336j4912k0941j7139j1215l255
11506G88689Q12l917M261K4124Q539o380p183k4293l4115n1156o8530m1744j4346
11493E74761J3447Q000L7712Q232r96K278J7419j3745J9010M6782L4463N2075
11481G99438N2377L7591K719P786j2849n5585n8750k7961j5352m0643n951J2471
$$ y = [491482, 490928, 508480, 536332, 557912, 548901, 544964, 543400, 559872, 594214, 610766, 616626, 606226, 591141, 574001, 607146, 647506, 679747, 714085, 741302, 807326, 884551, 939225, 938870, 907447, 873920, 842307, 794518, 752726, 736829, 722858, 711593, 684395, 677173, 668405, 685826, 706107, 715528, 752189, 806712, 817634, 827403, 839637, 845681, 840133, 816711, 801502, 787821, 754308, 748130, 755131, 791611, 807585, 825831, 854781, 864487, 856151, 841239, 820298, 803159, 791944, 788689, 789501, 785584, 789845, 813969, 822508, 816128, 808945, 784652, 750537, 699381, 630851, 589107, 574761, 588208, 596208, 633920, 642152, 641156, 643434, 660853, 647108, 666118, 712900, 747363, 799438, 851815, 889406, 892125, 899911, 887062, 831477, 772727, 744766, 729414, 688771, 682820, 695291]
11469F95291n360j1893n526k2127m2197j2465l9876k636J8391K1795M0514L1323
11457F65234L916q737J3675J3738l370k0581N736j2123o019N1353M1899L4921
11445G79642L9271M7405K8193M3275M4914J8296J2456L1881J6868k0353j5377
11434A026471j1693M4191J5119M103k774m401K8179K3657K6471L3776Q4442R7002
11422A364543J03847J37361K02056K82243K94239K79080J99625J27791L7892m8703
11412B979974j74450k01622j99532j75083j49193r6524p2147o7577m3271o3765
11402A736810k0182P08o946p004j3395K5700j2076j8379k6694j3490j165j1092
11390A632795J8489L9325K1131L8861N0268K2216R826M9589K5226M4277P6159
$$ y = [695291, 689931, 678038, 672512, 650385, 608188, 595723, 555847, 553211, 571602, 593397, 633911, 665234, 669150, 660413, 674088, 687826, 684456, 663875, 669611, 657488, 651469, 702822, 744721, 779642, 818913, 866318, 894511, 937786, 982700, 1000996, 1013452, 1045333, 1062201, 1041848, 1026471, 1014778, 1058969, 1074088, 1078191, 1075417, 1071016, 1099195, 1122852, 1149323, 1183099, 1267541, 1364543, 1468390, 1605751, 1807807, 2090050, 2384289, 2663369, 2862994, 2990785, 3028677, 2979974, 2805524, 2603902, 2404370, 2229287, 2080094, 1983570, 1911423, 1843846, 1800575, 1736810, 1716628, 1717336, 1710390, 1703386, 1689991, 1715691, 1703615, 1685236, 1658542, 1645052, 1643887, 1632795, 1651284, 1690609, 1711740, 1750601, 1800869, 1823085, 1832911, 1882500, 1907726, 1952003, 2028162]
11379B028162J7874J6338M9427L4218R572K598K0712L5105K2413K4672M644n411
11367B260324k6820j2303M3511L5352L6289N3432M9229L4716J8627O6761O9976
11356B629094N6230M7485O7823P0217Q9452M9529K2804M5181L0599Q4698J01975
11345C295087R5963Q2093Q0465R2545R4088J08349J09711J27300J59263J72826
11335D417690J60645J58671J38866J47921J65033K04714K28724K34057K22284
11326F078605K53051K89591L05829L58357M34644M74962N42652O02236O89412
11317A0029339P73564Q35456R57670J059714J256123J498792J672142J938071
11309B0020871K230872K538996K851135L275013L938301M973539O562561Q630027
$$ y = [2028162, 2046036, 2062374, 2111801, 2146019, 2155591, 2158189, 2178901, 2214006, 2236419, 2261091, 2265735, 2260324, 2233504, 2221201, 2264712, 2300064, 2336353, 2389785, 2439014, 2473730, 2492357, 2559118, 2629094, 2685324, 2732809, 2800632, 2870849, 2960301, 3009830, 3032634, 3077815, 3108414, 3193112, 3295087, 3391050, 3473143, 3553608, 3646153, 3740241, 3848590, 3958301, 4085601, 4244864, 4417690, 4578335, 4737006, 4875872, 5023793, 5188826, 5393540, 5622264, 5856321, 6078605, 6331656, 6621247, 6927076, 7285433, 7720077, 8195039, 8737691, 9339927, 10029339, 10802903, 11638359, 12596029, 13655743, 14911866, 16410658, 18082800, 20020871, 22251743, 24790739, 27641874, 30916887, 34855188, 39828727, 46391288, 55021315]
11301E5021315J1357765J5021737J9994557K6665780L5538748M7044393O0495476
11294B71139771P2109020P3067669N3745227J7794772j8028921m3612348n8026472
11287C68188718o1686607n6239450m5712289l4071477k3526951j4800344p787297
11280A24364303k006814L178549Q216571J3161183J8259781K3454082K7305355
11273B15933010K7062630K0136413Q324662k393784q453086j0122945p832072
11266B42654828j978395O094567J5510125K6273819L7845377M7856701N0654370
11259D24911392L9769682J5749607j1472693l1388550m0588396m0569996l3664952
11252C22746094k2889338j1549741k384866K279815r8679q808552j8501466k5020071
$$ y = [55021315, 66379080, 81400817, 101395374, 128061154, 163599902, 210644295, 271139771, 343248791, 416316460, 470061687, 487856459, 469827538, 426215190, 368188718, 306502111, 250262661, 204550372, 170478895, 146951944, 132151600, 124364303, 122357489, 125536038, 133752609, 146913792, 165173573, 188627655, 215933010, 242995640, 263132053, 271456715, 269062931, 260609845, 250486900, 242654828, 240676433, 246771000, 262281125, 288554944, 326400321, 374257022, 424911392, 464681074, 480430681, 468957988, 437569438, 396981042, 356411046, 322746094, 299856756, 288307015, 285922149, 288201964, 288103285, 279294733, 260793267, 235773196]
11244B35773196k7754649k7227259k4233464j9863688j4978213j0225959n843433
11237A05646531j680467K530852P131113J2531567J9270602K7681260L7702027
11230B10813485M8725537N7906540N8130229M0721283P162062k6714550m7899718
11223C48844868n6182850n5850981m9627328m0244568l0649351k2568999j6531092
11216G7189699j2257535r338302p280937n819838m821036m099914l562805l196603
11208B6812729k887451k596731k290813k018688j817390j577761j292223j065281
11200A1266391q90574p52994o32811n29377m32432m05290m00411l93982m03983
11191F424537m02159l93786l43839l08123k67037k22821j73823j74903j90941
$$ y = [235773196, 208018547, 180791288, 156557824, 136694136, 121715923, 111489964, 105646531, 103966064, 106496916, 113628029, 126159596, 145430198, 173111458, 210813485, 259539022, 317445562, 375575791, 416297074, 423459136, 396744586, 348844868, 292662018, 236811037, 187183709, 146939141, 116289790, 93720791, 77189699, 64932164, 55593862, 48312925, 42493087, 37672051, 33572137, 30009332, 26812729, 23925278, 21328547, 19037734, 17019046, 15201656, 13623895, 12331672, 11266391, 10375817, 9622823, 8990012, 8460635, 8028203, 7622913, 7222502, 6828520, 6424537, 6022378, 5628592, 5284753, 4976630, 4709593, 4486772, 4312949, 4138046, 3947105]
11182C947105j48420j39036j80929j87932j81318j73432j34572j21316j27573
11173B552577o5077n1923p2255q3462n8708p2027r6967n6759l8539p219l5465
11162A914176l2960j8482m6964n4026o1836o5628o6580m1365m2070j1050k3565
11151A449650l5577n5964n6951o1304o3174n3655k2920m0538m4572l5700k8031
11140I51264r307j042n784j9391k2641P954J7582o283n765k117P882K435k3088
11127H91699p356m7198k4279j8393j6784l7767k3602j4805k8891k8392m0354j6031
11115E87847K1468J2728K3058k5403j7817k3964O815K9709P9241J30362J49408
11104I73452J23703J23736Q5698J1009n9666r3341j13669j12826j09965o9607
$$ y = [3947105, 3798685, 3659649, 3478720, 3290788, 3109470, 2936038, 2801466, 2680150, 2552577, 2487500, 2435577, 2363322, 2279860, 2221152, 2149125, 2052158, 1995399, 1956860, 1949641, 1914176, 1881216, 1862734, 1815770, 1761744, 1699908, 1634280, 1567700, 1526335, 1484265, 1473215, 1449650, 1414073, 1358109, 1301158, 1239854, 1176680, 1123025, 1100105, 1059567, 1014995, 979295, 951264, 941957, 940915, 935131, 915740, 893099, 901053, 918635, 912352, 906587, 904470, 912352, 914787, 891699, 884343, 837145, 812866, 794473, 777689, 739922, 716320, 701515, 672624, 644232, 603878, 587847, 609315, 622043, 645101, 619698, 601881, 577917, 584732, 614441, 693682, 824044, 973452, 1097155, 1220891, 1306589, 1317598, 1257932, 1164591, 1050922, 938096, 828131, 758524]
11094G58524l9857k8607j5553l2997Q984J0780J167n2861n7271n1324p1957m2003
11082C87025j6657k9757o086k2739l4485k2863q591K5424K6592J640K8798M6223
11070C74524M6348K2708J7435j7815m1497m2526n912l0583k2556J8044P661j77
11058C25654q334K990l063J6564K4147j1970j8150k5442l9124m507p326r664j4153
11045B27622J6303J6965K8489K2464O3783M8016M6571Q8533J43143J48516L0041
11034H80446n4062j32571j14038j07973r4171n5010k8199k646k5256k4107k0193
11023B22220J493J0467l2635k2940k3822j8909n251j4948J4052K344q093l1422
11011I2556L605R721j3670J1911P944n123J5526M727M322l0840l6918j5563m4088
$$ y = [758524, 718667, 690060, 674507, 641510, 650494, 661274, 662441, 609580, 552309, 500985, 429028, 387025, 370368, 340611, 334525, 311786, 277301, 254438, 245847, 271271, 297863, 299503, 328301, 374524, 420872, 443580, 461015, 443200, 401703, 359177, 353265, 322682, 300126, 318170, 325831, 325654, 317320, 320310, 317247, 333811, 357958, 345988, 327838, 302396, 263272, 258765, 251439, 241775, 227622, 243925, 260890, 289379, 311843, 375626, 423642, 470213, 558746, 701889, 850405, 880446, 826384, 693813, 579775, 471802, 377631, 322621, 294422, 291776, 266520, 242413, 222220, 223713, 234180, 201545, 178605, 154783, 135874, 130623, 115675, 129727, 132071, 123978, 92556, 96161, 105882, 92212, 104123, 112067, 106944, 122470, 127197, 131519, 100679, 63761, 48198, 4110]
10998D110l699J4933j0254k978J0782j9240j7966o3377l8628k5488N860K0897
10986a25048K0758j7304J4633O959r7M0022M6447J5984N800J8968K4115K414J594
10973E5245j0632l4020l0813J9535O243l065J4752K909j1819j8975N868R399k3648
10960a9021o755M9j3180j9448n180j0376j8600J0507L063J9180J2372M625J2785
10947b9979L6841K5806K0200L3023L8452M23j9575j6072j5424j3753P391L3628
10935A00961J4487Q287r263j9722k6516l0084K205O380k5764k4029k1007l948
10923b8013k7044o932L0555J4283m227L8533O0301L6694R901K6671M5030O819
10911B02571k6697P772M3586L007p779j3083j7913l5369l6779j0245K553j0080
$$ y = [4110, 411, 15344, 5090, 2112, 12894, -6346, -24312, -87689, -126317, -151805, -145945, -125048, -104290, -121594, -106961, -100002, -100099, -60077, -13630, 2354, 8154, 27122, 51237, 53651, 55245, 44613, 10593, -20220, -685, 5558, 2493, 17245, 20154, 8335, -10640, -4772, 4627, -19021, -25776, -25727, -38907, -58355, -63535, -73911, -92511, -82004, -78941, -59761, -47389, -42764, -29979, 6862, 32668, 52868, 85891, 124343, 124766, 105191, 89119, 73695, 59942, 67333, 100961, 115448, 123735, 114472, 94750, 68234, 38150, 40355, 46735, 20971, -3058, -24065, -28013, -55057, -61989, -31434, -17151, -21378, 17155, 77456, 114150, 124051, 150722, 195752, 202571, 175874, 183646, 227232, 230239, 222460, 209377, 191464, 156095, 119316, 109071, 111624, 101544]
10899A01544l122O009J3305l374k170j9450j4097L8997J8432j5557k9194M832
10887I6155O695K1893K7210J2186l86o342j0555J329J3780L858K1990J3770K0260
10874B21843M6872O5647K5351N3607P2466Q3948J26656J90564K24819K89664L36059
10863A737496L26356K44415J10547n9682j93398k65323k82449k58093k20853j75243
10853I63773j32749o9491n0497n0869j4671M1586P4188J00589J42825J66342J32442
10842A303468J00104P5096k661o4089l1812L567L3564M6506O3962J29562J70378
10831A827645K22770K18399J32984L2323p3467j72808j95262j84302j38363j05189
10821A564730l9454l160j2899n527l1691n0640j02656j26316j54120j41761j23429
$$ y = [101544, 98422, 104431, 117736, 114362, 112192, 92742, 78645, 117642, 136074, 120517, 91323, 96155, 102850, 124743, 151953, 164139, 163753, 157411, 146856, 148185, 161965, 165823, 187813, 201583, 221843, 268715, 334362, 359713, 413320, 485786, 569734, 696390, 886954, 1111773, 1401437, 1737496, 2063852, 2308267, 2418814, 2359132, 2165734, 1900411, 1617962, 1359869, 1139016, 963773, 831024, 761533, 711036, 660167, 645496, 687082, 761270, 861859, 1004684, 1171026, 1303468, 1403572, 1478668, 1476007, 1411918, 1380106, 1383673, 1417237, 1463743, 1527705, 1657267, 1827645, 2050415, 2268814, 2401798, 2434121, 2360654, 2187846, 1992584, 1808282, 1669919, 1564730, 1525276, 1522116, 1509217, 1503690, 1471999, 1421359, 1318703, 1192387, 1038267, 896506, 773077]
10810G73077r3554l7070k2315k5921J4742O9032P4912J08653J66424J85699K47220
10799A460899K87979K88107K22944M5927j29879k39935k91807k97987k71294k18309
10789H56645j53150j32763r2971o2922q0910n2660n0725k9658k6866j1083j3286
10778A49651k8049l4595J2943J2359J4431M571j2340N968k799k584l2016j5216
10766G2324p895k4793r383J6489n917L51L193J5406K1026K2398j0732k122q177
10753H2168j013L1459M010k2306k8914o767j5893k2461M321J8923J4160j643k4086
10740C1958L1970k492j6487J3891K0327j6211j0077M606K1603j0687j0668l2781
10728B4952o67J4548J6861J5675o877r331J844M490k7349m1392j6494M0175J5267
$$ y = [773077, 679523, 642453, 620138, 594217, 608959, 677991, 752903, 861556, 1027980, 1213679, 1460899, 1748878, 2036985, 2259929, 2305856, 2175977, 1936042, 1644235, 1346248, 1074954, 856645, 703495, 570732, 477761, 414839, 333929, 281269, 230544, 200886, 174020, 162937, 149651, 121602, 87007, 99950, 112309, 126740, 131311, 118971, 124939, 122140, 119556, 87540, 72324, 64429, 39636, 30253, 46742, 40825, 41176, 44369, 59775, 80801, 103199, 92467, 90345, 82168, 81155, 112614, 116624, 94318, 65404, 58637, 42744, 20283, 24604, 43527, 57687, 56044, 31958, 63928, 61436, 44949, 58840, 79167, 62956, 52879, 57485, 79088, 68401, 57733, 24952, 24285, 38833, 55694, 71369, 64492, 55161, 57005, 61495, 34146, -7246, -23740, 16435, 31702]
10715C1702l4790j9989J2798K6201J4670m672r905m709k037K8308L0981k3045
10703D5513j5061J0866j7584j5133J5264R428L3257J6437n787j4357R44l190M811
10690F5408k154j9907j1488M218k2613J0094J8233j510l7194j4827p113j485j462
10677b1800K8578R057k0154l239J3251J441k1643o916j584M384k338j3922J532
10664c3353j0569j3776M373L067J5163K974L7784J6379Q639J2061O360q135l5572
10651E395k9950r073K2965K1500n490L948K9563j6384j6690j6193N1N697M51K7988
10637B3778K3543j676l019q932P824q273K6588O782j9758R20K0454J412j3758
10624E5885j7266j438k5178Q903o6j1100k4263k726n426L849j0876J7052J6639
$$ y = [31702, -3088, -23077, -10279, 15922, 30592, 25920, 16015, 11306, 9269, 37577, 68558, 45513, 30452, 41318, 23734, 8601, 23865, 33293, 66550, 82987, 77200, 62843, 63787, 60597, 65408, 63254, 43347, 31859, 36077, 13464, 23558, 41791, 40281, 3087, -11740, -18853, -20338, -21800, 6778, 15835, -4319, -7558, 5693, 7134, -14509, -21425, -23009, -18625, -20963, -34885, -33353, -43922, -57698, -53325, -50258, -35095, -32121, 5663, 22042, 30681, 42742, 49102, 40967, 5395, -24555, -33628, -10663, 10837, 5347, 9295, 38858, 22474, 5784, -10409, -10358, -4661, -4210, 23778, 47321, 45645, 42626, 33694, 41518, 33245, 59833, 66615, 46857, 47777, 68231, 69643, 55885, 38619, 37181, 12003, 20906, 20840, 9740, -14523, -17249, -22675, -18826, -29702, -12650, 3989]
10611C989j6569Q917Q675n957J4901K6121m320j979j1404J08J7073L373J4102
10598E7030J4500J1740j4807k0480J627K494J6186J4986Q032o97k3174j7505k2262
10585B7670k3675p069O62l200M037m008j8000Q799K0903j3908p869P588J2981
10572D911k0930m946J4407K8577K5833r320n607J8973M208q430L50J3432K0210
10559H1668J3664j7438j4697O39l304o212k9505j9477j0368K1062j389K324J445
10546A8412J0350L021M293l187m6277k2493N680L1744J0661j4414P635P386j7136
10533d325j0341o684K0069P961r918j2144n512K9589l362N024r086m891J2578
10520H958Q199K6241j2224m621k538N042l4630l4723j4529J5987M4909J7460j2828
$$ y = [3989, -12580, -3663, 5012, -945, 13956, 40077, 35757, 33778, 22374, 22482, 39555, 42928, 57030, 71530, 83270, 68463, 47983, 49610, 52104, 68290, 83276, 91308, 90611, 67437, 49932, 27670, 3995, -3074, -2412, -5612, -1575, -5583, -23583, -14784, 6119, -7789, -15658, -8070, 4911, -16019, -20965, -6558, 22019, 47852, 38532, 32925, 51898, 56106, 47676, 48026, 61458, 81668, 95332, 77894, 63197, 63836, 60532, 54320, 24815, 5338, -5030, 16032, 14643, 16967, 18412, 28762, 31783, 36076, 32889, -13388, -35881, -30201, 1543, 12204, -2210, 5425, 12811, -4325, -14666, -21350, -1281, 6680, -3238, -15382, -20894, 8695, 5333, 10357, 1271, -3620, 8958, 17157, 43398, 31174, 26553, 24015, 29057, -5573, -40296, -54825, -38838, 6071, 23531, 10703]
10507A0703j3865N040m128J2653l937n412J7592j4821j7131L884j5862r08J356
10494b4836M420L682j1072l273J8424R218q874m477l600k9895k3691J0394J7856
10481d5724J0161M4816L9254J5489J677J7333K5731j811j4883O029M165q960l1333
10468F1944n4490n1647n321K1233K0492n064j2947o454J0164J7496k935L2245
10456B4716K951j5081J9392R320k6452m2242n2582k2974M344L7692K9295L2152
10444E31M0596M8334M360k8928k5102j0110N21M342K3861M801p719j1701j1296
10431C2490j1035n319l7555k7634J6676j2579K412J3025m422K0085J6996J3285
10419A6425k1561l8841n456K7041Q707Q350J6063L2984J2197J1208l161k4067
$$ y = [10703, -3162, 1878, -2250, 10403, 6466, 1054, 18646, 3825, -13306, -9422, -25284, -26192, -24836, -20416, -16734, -27806, -31079, -12655, -3437, -12311, -16788, -20388, -50283, -73974, -63580, -45724, -35563, 9253, 48507, 63996, 65673, 83006, 108737, 106926, 92043, 98072, 102237, 93277, 61944, 7454, -44193, -49514, -28281, -7789, -12853, -25800, -32254, -22090, -4594, -7529, 24716, 27667, 12586, 31978, 41298, 14846, -27396, -79978, -102952, -98608, -60916, -31621, 531, 41127, 89461, 93821, 64893, 39791, 29681, 30202, 34544, 58405, 63206, 55487, 43786, 32490, 21455, 16136, -21419, -49053, -32377, -44956, -42544, -29519, -33941, -13856, 3140, 16425, -5136, -43977, -49433, -22392, -13685, -5335, 10728, 43712, 55909, 67117, 63956, 39889]
10407C9889k1737r281k8040q310M691Q111o157o40J9727K2300Q059J108m05k9611
10393b96Q947P268k0077J5223J5147J6182j4857j7605j1936k0692j5102j0564
10381d8362K8460J6068n707m742Q310n053J2136J2491p270k264J3837j425j1352
10368E127J9710K7953q370l3337l0248K076l0160r798L0847L1870J7301j5577
10356G394k0995O087n469K116K177n940L7647J9843l5020k255j0563j398J1108
10343D732J1277j8132J8325M727k3585j2198N908K629J2057k4815p547N028k115
10330b3709k068K5305m486L456L0722K4703p949l2910k4358j5864K195J4657J5677
10317E371J3907J2758R331m411j8414n971l988j757m280l4251p653r404J3569
$$ y = [39889, 18152, 8871, -19169, -27479, -22788, -14677, -20834, -21474, -1747, 20553, 28612, 29720, 29315, -296, 8651, 15919, -4158, 11065, 26212, 42394, 27537, 9932, -2004, -22696, -37798, -48362, -19902, -3834, -9541, -14283, -5973, -11026, 1110, 13601, 6331, 4067, 17904, 16479, 5127, 24837, 52790, 44420, 11083, -19165, -17089, -47249, -57047, -26200, 5670, 22971, 7394, -13601, -7514, -12983, -10867, -8690, -14630, 23017, 42860, 7840, 5585, -4978, -6376, 4732, 16009, -2123, 16202, 20929, -2656, -14854, -8946, -6317, 5740, -19075, -26622, -21594, -23709, -25777, -472, -4958, -1502, 29220, 53923, 45974, 13064, -11294, -27158, -24963, -10306, 5371, 19278, 32036, 41367, 36956, 18542, 12571, 8583, 6826, 2546, -31705, -39358, -48762, -35193]
10304c5193K4124K3916J8955k3406j1191K155L969r451k2701J4144K2410O143
10292A3874m082m598O087J6216o617j7128O344K9235J7847P397j0083j5590q148
10279C0754j1042j5402P839K2640P576k551j7595q340K101l2425p628K3296K1349
10266B0572J9624J877l0276M306J2505J536k739L426j217j1336K5199M1449p348
10253G7578k2066J1062Q991p369m1502K733k897J3338l897j4527j4433n560K0872
10240B2323K9426R49n810j4411k1379k7229N699j123j5165J1053M330J184j891
10227a2044J267j4249R425j1587r451K7453J8009N936k0605J771N328K8075K7411
10214E6739j0260j3520j3996K5540k1487r576K5176m813j5598j5185k9037k038
$$ y = [-35193, -11069, 12847, 31802, 8396, -2795, -640, 3329, -6122, -28823, -14679, 7731, 13874, 9792, 5194, 11281, 27497, 20880, 3752, 10096, 39331, 57178, 64575, 54492, 38902, 30754, 19712, 4310, 12149, 34789, 42365, 39814, 22219, 13879, 15980, -16445, -24073, -777, 20572, 40196, 42073, 11797, 16103, 28608, 30144, 27405, 30831, 29614, 18278, 43477, 84926, 77578, 55512, 66574, 75565, 68196, 26694, 29427, 26530, 39868, 35971, 21444, 7011, 1451, 22323, 51749, 52698, 46888, 32477, 11098, -16131, -10432, -11555, -26720, -15667, -11337, -10153, -12044, -10777, -25026, -15601, -27188, -36639, -9186, 8823, 14759, -5846, -4075, 1253, 29328, 56739, 46479, 32959, 18963, 44503, 23016, 13440, 38616, 33803, 18205, 3020, -26017, -28055]
10202b8055J0932L3128p37K127q956p765J1346Q313M965k3405p257R914J2331
10189A6881n103J4486K40L622l165N909o537J0450P899J4728j3130J365M127J7130
10175F8902N011j6330k2543M040M403j2699J7721p113p694K7847L907m779k750
10162E7923k3376j5749L637l4590L203L9207j409k7187k2397N219K5862J0295
10150B0638Q307J0940n797k5120L78%J3957J8445j4703J0845j6817k720J5795
10137C4148k364k7624k6010k6343q709l649K0537n062J4439J2148R678K9462N756
10124B6407j9968j3009j8864O22M406J8644K7221j8209R097m248j429J2391K3899
10111D6960N872k8291r484L411L227q407O694l524J7522P026n958r510M12Q234
$$ y = [-28055, -17123, 16005, 15268, 17395, 8439, 674, 12020, 20333, 25298, 1893, -5364, 4550, 16881, 11778, 26264, 26504, 30126, 26961, 32870, 26333, 36783, 44682, 59410, 46280, 47645, 51772, 68902, 73913, 57583, 35040, 39080, 43483, 30784, 48505, 41392, 33698, 61545, 65452, 60673, 57923, 34547, 18798, 22435, -12155, -8952, 30255, 28846, 1659, -20738, -15519, 10343, 20638, 28945, 39885, 34088, 8968, 9346, 9346, 23303, 41748, 27045, 37890, 21073, 18353, 34148, 31784, 4160, -21850, -48193, -56902, -60551, -40014, -45076, -30637, -18489, -8811, 20651, 26407, 6439, -6570, -25434, -24812, -20406, -1762, 25459, 7250, 16347, 12099, 10670, 23061, 46960, 52832, 24541, 15057, 18468, 21695, 13288, 19982, 16458, 33980, 41006, 35048, 25538, 25950, 34184]
10097C4184l873j8762J2862P90O71n96j5548k92O702J1903n282j6278o318J1885
10083A2048M454r839k0729J8544J0739N750j059K346J7803J882J813q522M627
10070C9857O117J8916m734j7446l138k2418j8339n67J4379J9269J0759J8762O925
10057F8342j3752L160j0842q958L24K426J5141J268J3500N858k795J8204o769
10044H5107k4425j2212q341Q25j5899k1106J2670L4728K946j5096l532J2813R042
10031E7520j3914j5680R753L800j688Q771l653k5278p407K4789k833n400j1380
10018A7400q437L0014M731l3966p04K1344k3179J7721M527n188R777L482J500
10005C9022K30j1012j5353r120J0229L2753P122N985J6767L62j9430J273n688
$$ y = [34184, 30311, 11549, 24411, 25201, 25872, 25276, 9728, 9436, 16138, 28041, 22759, 6481, 163, 12048, 16502, 6663, -14066, 4478, 15217, 20967, 19908, 22254, 40057, 41939, 43752, 35230, 39857, 45974, 64890, 60156, 42710, 39572, 17154, -1185, -1752, 12627, 31896, 42655, 61417, 68342, 54590, 57750, 46908, 37950, 38274, 40700, 55841, 57109, 70609, 76467, 73672, 91876, 85107, 60682, 48470, 40129, 40954, 25055, 3949, 16619, 51347, 54293, 39197, 35665, 48478, 57520, 43606, 27926, 37679, 41479, 39791, 48562, 44909, 19631, 12224, 37013, 34180, 28780, 17400, 8963, 38977, 43708, 9742, 9038, 30382, 7203, 24924, 29451, 24263, 34040, 37522, 39022, 39252, 28240, 12887, 3767, 13996, 46749, 53871, 59856, 76623, 76985, 57555, 58828, 53140]
9992E3140j258j0588j8492J6819J7744j426L706n871k0149O035L2396J5681n118
9979H2619K3202K6724K4534M0557K4300M9983J02858K08962L96518N27025J00535
9968A607817k78329l00149k33441k38745j99776j15235n4106k6303j1578L662
9958A53817k851L42R772j8127k5581k3864j3575l489O560J2057m4659m940J4379
9945E9841j5664N791n610J2856K6549K4714j4077J8179q446K048N286j3065k6763
9932G1639l1137J5135l427j1689P890K1558J219K8258J3617l2570m2653K199L8214
9919G8253J3549k612Q509k5131j7631R877j018k5725J4727K1906o924j3785K211
9906E6206J4632L3633J1476j5942l0905k1305P055K2692j563j7654n198J4362
$$ y = [53140, 51882, 41294, 22802, 39621, 57365, 55939, 59645, 53774, 33625, 39660, 72056, 87737, 82619, 105821, 132545, 157079, 197636, 221936, 271919, 374777, 583739, 980257, 1507282, 1607817, 1329488, 1029339, 795898, 557153, 357377, 242142, 188036, 161733, 150155, 153817, 150966, 151308, 161080, 142953, 117372, 93508, 79933, 76444, 83004, 95061, 50402, 45462, 59841, 44177, 49968, 44358, 57214, 83763, 108477, 94400, 112579, 104133, 106181, 111467, 98402, 71639, 40502, 55637, 52210, 40521, 48411, 69969, 71188, 99446, 113063, 80493, 37840, 40039, 78253, 91802, 89190, 97699, 72568, 54937, 64814, 63796, 38071, 52798, 74704, 67780, 53995, 56206, 70838, 104471, 115947, 100005, 69100, 47795, 54850, 77542, 75979, 58325, 53127, 67489]
9894F7489n195k0696J5479J269r803j2365J0515K8847K9058J4546j9297l68j0996
9881H8483K784l572r434m182P402P990j0078J0186k126K4912J0933m174l1141
9868H7983j951o297J0388j0204J1852L218K1242K623j5938j9647j1498N743O335
9855H3849J5524J044Q461K8499j917j0289l9o492n3784j6766k544J4455J0074
9842G0075K9558j5077r496Q813J2954J6808j5466j0712J3662J7343M301J0106
9830A32869j714j6548r594M88J2989K034j0799N417J919K1600J1209m282k6684
9817A18904l1030R769J4897J3983K1160o020n030K694O927k0254l389J5563j7956
9804A20218k1917J2958J7498J9722K9888k0765j3270j0396m318L313l197J6902
$$ y = [67489, 62294, 41598, 57077, 58346, 48543, 36178, 46693, 75540, 104598, 119144, 99847, 99479, 88483, 91267, 87695, 78261, 74079, 81481, 89471, 79393, 89579, 87453, 112365, 123298, 119124, 87983, 86032, 79735, 90123, 79919, 91771, 94989, 116231, 118854, 102916, 83269, 71771, 77514, 83849, 99373, 100417, 108878, 137377, 135460, 125171, 125132, 118640, 64856, 48090, 45546, 60001, 70075, 99633, 84556, 75060, 83873, 96827, 113635, 98169, 87457, 101119, 118462, 122763, 132869, 131155, 114607, 105013, 105501, 118490, 120524, 109725, 115142, 117061, 138661, 149870, 145588, 118904, 87874, 97643, 112540, 126523, 147683, 141663, 136633, 139327, 146254, 126000, 122611, 138174, 120218, 98301, 111259, 128757, 148479, 178367, 157602, 144332, 133936, 129618, 132931, 129734, 146636]
9792A46636L0765N77J2419j9252j2230q899l927m538J3601K1520K6388j5511l7159
9779A50390O914J0932Q509K2280l019j452l564L757J4174j0541l8932k0916J0385
9766A48917J0473k0217R804J3575K959N35l3442N125K3390Q648R781J2885J4053
9753B06486Q676J2293l85j9507j4925N041j0783j983J7388o595j9620j4777m983
9740A56326K3042K9613J4831J327l0176j0545K3551K2495K824l9764K90p035m408
9727A82371p235j1350K7103J1124K0028K509r420k3331k5007L1225J7337R468
9715B24822L8260K8681k0620r892K7418N3272O8316N5154j1497l4273l4380m6853
9703C38408k8219n0055j7833r984l804L0252J3309J151n5p093n556K4237j741
$$ y = [146636, 177401, 177978, 190397, 171145, 158915, 150016, 146089, 141551, 155152, 176672, 203060, 187549, 150390, 157304, 168236, 176745, 199025, 196006, 194554, 190990, 194747, 208921, 198380, 159448, 138532, 148917, 159390, 139173, 148977, 162552, 165511, 166046, 132604, 137729, 161119, 169767, 179548, 192433, 206486, 215162, 227455, 227070, 207563, 192638, 197679, 186896, 184913, 202301, 195706, 176086, 161309, 156326, 179368, 208981, 223812, 225139, 194963, 184418, 207969, 230464, 233288, 193524, 193814, 186779, 182371, 175136, 163786, 190889, 202013, 222041, 224550, 215130, 191799, 166792, 198017, 215354, 224822, 263082, 291763, 271143, 261251, 288669, 341941, 410257, 465411, 453914, 419641, 385261, 338408, 310189, 260134, 242301, 232317, 228513, 258765, 272074, 273225, 273170, 266077, 260521, 284758, 283017]
9690B83017q618r518k6236j0171j4039J3157K0881r327p255N522o580m962O160
9677B32031J2916J4239J9262J8150Q135j3706k8832J4116M02J9226K3190L9562
9665C58691J7322q873q931J3855J3652J8156J402J868j3751R879R562n201m425
9652D03206R627L1413J4277J2496k4111k4085l465N173j9278K335J569P199m037
9639D12319j5841j279K1133k977j8870L705J7935J5386K0130Q615j7279M250O943
9626D54170l859k7216J399K5607J1197j656O818J6982J5377r751J7802L2921J0580
9613E50371P070K9151L1133J5323j3063L7387K2421M784n474q751k6252l951j103
9600F39046k0086J427Q441j8356k0994m384j4546r767j7815j499J7598Q95o604
$$ y = [283017, 274399, 264881, 238645, 228474, 214435, 227592, 248473, 239146, 231891, 237413, 230833, 225871, 232031, 244947, 259186, 278448, 296598, 304733, 291027, 262195, 276311, 276713, 295939, 319129, 358691, 376013, 367140, 358209, 372064, 385716, 403872, 405274, 407142, 393391, 403270, 412832, 407631, 403206, 412833, 444246, 458523, 471019, 446908, 422823, 419358, 424531, 405253, 407588, 409157, 416356, 412319, 396478, 395199, 416332, 413355, 394485, 398190, 416125, 431511, 451641, 460256, 442977, 447227, 454170, 450311, 423095, 424494, 450101, 461298, 459642, 466460, 483442, 498819, 489068, 506870, 539791, 550371, 557441, 586592, 617725, 633048, 619985, 657372, 679793, 684577, 679103, 670352, 644100, 640149, 639046, 618960, 620387, 628828, 610472, 589478, 585094, 570548, 560781, 542966, 541467, 559065, 559960, 553356]
9587E53356J5050p472Q40J4303J0028q33J2290o040j3488K672K5053j5066l9919
9574E50774p255K8097P128J9204R513K3096K0160P520j7892O3J3620J5774M543
9561F74345J3853J0602j1945q280J1706Q401J9587K8565J065P092J5804P034o877
9548G70952J1154j179o80L875K7482K2741J7491N033K009k1632J3325J9978J6000
9535H86549K4293L560q0m245Q041J9440J8802J6593K688J2221O794j1864K4735
9522A007527K5003N762L998m223j8283L6556L5067J1313J6539M5320M444K108
9510A171131L1445K5355J5858K7488L0651J8128L1314Q891J9437J7806K2405J7990
9498A437899J8491j6753r321N565M3146L1300K4960M0474L0641K0759J0858P332
$$ y = [553356, 568406, 560934, 561774, 576077, 586105, 585272, 597562, 591522, 578034, 580706, 605759, 590693, 550774, 543519, 571616, 578744, 597948, 607461, 630557, 650717, 658237, 640345, 640408, 654028, 669802, 674345, 688198, 698800, 686855, 678575, 690281, 698682, 718269, 746834, 747899, 754991, 770795, 777829, 770952, 782106, 780927, 780247, 784122, 811604, 834345, 851836, 856869, 858878, 837246, 850571, 870549, 886549, 910842, 914402, 914322, 910077, 918118, 937558, 956360, 972953, 975641, 987862, 994656, 982792, 1007527, 1032530, 1038292, 1042290, 1038067, 1019784, 1056340, 1091407, 1102720, 1119259, 1164579, 1169023, 1171131, 1202576, 1227931, 1243789, 1271277, 1301928, 1320056, 1351370, 1360261, 1379698, 1397504, 1419909, 1437899, 1456390, 1439637, 1430316, 1435881, 1479027, 1510327, 1535287, 1575761, 1606402, 1627161, 1638019, 1645351]
9486A645351K1097M4381L6237J7029K4123L6558K7549M2553K8893L6454O8978
9475B029203L1414J5576L095L4027M0598J4243K9082K0132L9646L3562L1882L3739
9463B356199M6422K2744M2279K4839L0873M3180M7493L5878L6403M5137P7433
9452B808880N7552K3046K7534N6397P8485O9006Q9017R5285Q1563L3211M2229
9441C462205P2317O8205Q5352Q7534J04851R8111Q4214R8188R0670Q2052J10804
9430D444503J37879J11137J23117J39821J27036J28462J37959J22629J40500J75982
9420E789025J98883J73121J99559J82463J85362K24891K48424K20377K61454K65881
9410G949440K52464K56957K97222L47492L57021L51362L76096M05441M24384M46997
$$ y = [1645351, 1666448, 1710829, 1747066, 1764095, 1788218, 1824776, 1852325, 1894878, 1923771, 1960225, 2029203, 2060617, 2076193, 2079288, 2113315, 2153913, 2168156, 2197238, 2217370, 2257016, 2290578, 2322460, 2356199, 2402621, 2425365, 2467644, 2492483, 2523356, 2566536, 2614029, 2649907, 2686310, 2731447, 2808880, 2866432, 2889478, 2917012, 2973409, 3051894, 3120900, 3209917, 3305202, 3386765, 3419976, 3462205, 3534522, 3602727, 3688079, 3775613, 3880464, 3978575, 4062789, 4160977, 4251647, 4333699, 4444503, 4582382, 4693519, 4816636, 4956457, 5083493, 5211955, 5349914, 5472543, 5613043, 5789025, 5987908, 6161029, 6360588, 6543051, 6728413, 6953304, 7201728, 7422105, 7683559, 7949440, 8201904, 8458861, 8756083, 9103575, 9460596, 9811958, 10188054, 10593495, 11017879, 11464876]
9400A1464876M83665N03800N41649N47578N97265O33247O95585P57676P94154
9391A7019495Q41032R14472R81675J066505J154902J256608J337217J452671J622842
9382B7647419J745983J862510K060221K238114K458249K690975K957905L232394
9374D6893770L590319L953786M329022M782601N244751N736365O269979O809100
9366H7609693P328850P831525Q253754Q552985Q712949Q650561Q304424P598527
9358A52843268O545430N154692L415832J485347n00970k490902m298001n816086
9350A56338610o960851p809061q308760q496596q468004q212371p834538p406498
9342I2841931o905781o402579n945355n479509n011863m581508m210445l843809
$$ y = [11464876, 11948541, 12452341, 12993990, 13541568, 14138833, 14772080, 15467665, 16225341, 17019495, 17860527, 18774999, 19756674, 20823179, 21978081, 23234689, 24571906, 26024577, 27647419, 29393402, 31255912, 33316133, 35554247, 38012496, 40703471, 43661376, 46893770, 50484089, 54437875, 58766897, 63549498, 68794249, 74530614, 80800593, 87609693, 94938543, 102770068, 111023822, 119576807, 128289756, 136940317, 145244741, 152843268, 159388698, 164543390, 167959222, 169444569, 168943599, 166452697, 162154696, 156338610, 149377759, 141568698, 133259938, 124763342, 116295338, 108082967, 100248429, 92841931, 85936150, 79533571, 73588216, 68108707, 63096844, 58515336, 54304891, 50461082]
9334E0461082l482459l167930k906286k679900k460808k253739k076945j916432
9326B9516583j744049j596667j474928j361685j277513j188481j117105r99853
9318A8756302r10456q67155q02043p49365p00044o67862o21461n67997n60224
9309A2309695n44451n12738m37203m17040l89985l72392l48775l47810l60137
9300H579164l35512k79993k57368k42349k52680k21378k24928k17231k22538k04421
9290F120766j90481j41984j58363j80144j71540j42698j46847j40474j17045j39380
9280D591810j55998j48314j18288q8280p2273j07853j30736r5789r0239p4794
9270C509246o3792p5542p7710p2148r5052j04552p4762o3905p4626o4164n0135
$$ y = [50461082, 46978623, 43810693, 40904407, 38224507, 35763699, 33509960, 31433015, 29516583, 27772534, 26175867, 24700939, 23339254, 22061741, 20873260, 19756155, 18756302, 17845846, 16978691, 16176648, 15427283, 14727239, 14059377, 13437916, 12869919, 12309695, 11765244, 11252506, 10815303, 10398263, 10008278, 9635886, 9287111, 8939301, 8579164, 8243652, 7963659, 7706291, 7463942, 7211262, 6989884, 6764956, 6547725, 6325187, 6120766, 5930285, 5788301, 5629938, 5449794, 5278254, 5135556, 4988709, 4848235, 4731190, 4591810, 4435812, 4287498, 4169210, 4080930, 4008657, 3900804, 3770068, 3674279, 3584040, 3509246, 3445454, 3369912, 3292202, 3220054, 3125002, 3020450, 2945688, 2881783, 2807157, 2742993, 2692858]
9259B692858m0756m4647m6329l7423n3263o7925m0484n2746k9828m1711l8723
9248B199023m2951m0353m3426l9564l3421k5684o4854k9216m0027m3537m4589
9237A751401l2095q904r420k2482k0746m5282k1998k784l7372k8324k9540j8234
9225A474220k8995m0395L169j5444l9407m2870K98l1042j2110p433k3874j9062
9213A217055l4353j4154K203J5116r588j2176j6418k1069l5724l6106k4317r310
9201A021159j5505k4617M215M442r707l3142m1053L584J4841o428k004k3959j9727
9188H72099k6077j2326k7298J2833M072k4933N881m872l2883k4088P692q498O727
9175G48329N178k3431l5743l566R817j5335J5399J6413j2039J441k5069j6235
$$ y = [2692858, 2652102, 2607455, 2561126, 2523703, 2470440, 2402515, 2362031, 2309285, 2279457, 2237746, 2199023, 2156072, 2115719, 2072293, 2032729, 1999308, 1973624, 1908770, 1879554, 1839527, 1795990, 1751401, 1719306, 1710402, 1700982, 1678500, 1657754, 1612472, 1590474, 1587690, 1550318, 1521994, 1492454, 1474220, 1445225, 1404830, 1407999, 1392555, 1353148, 1310278, 1310576, 1279534, 1267424, 1259991, 1236117, 1217055, 1182702, 1168548, 1170751, 1185867, 1176279, 1164103, 1147685, 1126616, 1090892, 1054786, 1030469, 1021159, 1005654, 981037, 985252, 989694, 979987, 946845, 905792, 909376, 924217, 917789, 915785, 891826, 872099, 846022, 833696, 806398, 819231, 823303, 798370, 804251, 799379, 766496, 742408, 750100, 741602, 748329, 753507, 730076, 694333, 690767, 700584, 685249, 700648, 717061, 705022, 706463, 681394, 665159]
9163F65159m87q968k4329J2591M908o372o343N980q75m844K144k1345l9845o412
9149E70962M495m814J1387J1752P392J697k378m831k7546o089J115K552l620l8199
9135E23875k476j509p343p210j2296k2879L56r759k4760q07m731j0773J1051R245
9121D39984p478P405j3008j0851r017R569Q786l688q326j9846l0445k0190j929
9108C40966O889j1441l3720J3301K0324P775J0114J4710k2567j9098J0572J2843
9096C50668q550N593o268k1403k034M428P593K5986J671p488Q286P090n757l4522
9082C25293l9660J9245o674j432j8663R554J0035n894j6824R6K20l3194j0197
9069B31905J4063K5991J1094m190k5174k1464J1861j7345k1071J603j7764R333
$$ y = [665159, 664672, 655704, 631375, 643966, 648874, 642502, 636159, 642139, 641264, 636420, 638564, 617219, 577374, 570962, 575457, 570643, 582030, 593782, 601174, 602871, 600493, 595662, 568116, 562027, 563142, 565694, 562074, 523875, 521399, 519890, 512547, 505337, 493041, 470162, 470518, 460759, 435999, 435192, 430461, 419688, 430739, 439984, 432506, 439911, 426903, 416052, 407035, 416604, 425390, 421702, 413376, 393530, 363085, 342895, 340966, 347855, 336414, 302694, 315995, 336319, 344094, 354208, 368918, 346351, 327253, 337825, 350668, 342118, 347711, 341443, 320040, 318006, 322434, 330027, 356013, 357684, 350196, 358482, 365572, 359815, 325293, 285633, 304878, 298204, 296772, 278109, 287663, 297698, 291804, 274980, 275076, 275296, 242102, 231905, 245968, 271959, 283053, 278863, 253689, 232225, 244086, 226741, 205670, 207273, 189509, 198842]
9057A98842j565j1144R452n12J9313J4220Q782o43q214J7261J2924R587j4053
9044B54250j4064n564Q727L472k1578L268J7519M973J0099p2K9928l203j4564
9031B73191K405j1904q161K313q765j7326j5573K773J3200K7252J4310J621N280
9018B80616L040l3629p024j2118j3426j916J3765M908j2697j1573l12l602R582
9005B15614J6326r525p833j2978r452M71J0156J6422J2828o651j5573k7989o815
8992A75001L556J1020L599l548l540l036q735R952J1297o047j0862m513M771j13
8978A78802j529l958L836K7885P648j3123j3240k9515K813R471L621L64k3955
8965A49120m705l436J433J2968M911K024m835J528J941n143k6269l0341J0998
$$ y = [198842, 197277, 186133, 195585, 195073, 214386, 228606, 237388, 236745, 228531, 245792, 258716, 268303, 254250, 240186, 234622, 243349, 246821, 225243, 228511, 246030, 251003, 261102, 261030, 290958, 287755, 273191, 275596, 263692, 255531, 257844, 249079, 231753, 216180, 218953, 232153, 259405, 273715, 275336, 280616, 283656, 250027, 243003, 230885, 217459, 215543, 229308, 234216, 221519, 209946, 209634, 206032, 215614, 231940, 222415, 214582, 201604, 192152, 192623, 202779, 219201, 232029, 225378, 209805, 181816, 175001, 178557, 189577, 193176, 189628, 186088, 183052, 174317, 184269, 195566, 189519, 178657, 174144, 178915, 178802, 177273, 173315, 177151, 205036, 212684, 199561, 186321, 156806, 159619, 169090, 172711, 173075, 149120, 144415, 140979, 142412, 155380, 160291, 162315, 157480, 159008, 160949, 155806, 129537, 99196, 110194]
8952A10194K2655J7677j7396o202L7393L1152J730j5847n13l4378q943r427j2396
8939A15699M394k3560R092K0152J8512J1584q404j3676k392J4969J4131q693k7687
8926A24121J655P74K1593j2085m2991l6732o863k087n531K4785J9535J1789J5260
8913A13223k5017j873o843m302J0623J6337k951j1807k771K1505J0130L789R415
8900A29458q256J4560n110j0355P45l102j2140j2134J6120M484O942L520K8947
8887A53679J6169j1277m342k1221k8160J4031J4666k4673j7622K9676L6704j7522
8875A40108J643k1874M25K887n68p811J8K5221J8882J6592l314j1356k5526j6812
8861A18515o035Q029j6365m508J8900N174m804K0688O947m3763o144n803M81Q643
$$ y = [110194, 132849, 150526, 133130, 126928, 164321, 195473, 197203, 181356, 180843, 146465, 137522, 128095, 115699, 120093, 96533, 105625, 125777, 144289, 155873, 147469, 133793, 131401, 146370, 160501, 151808, 124121, 125776, 126550, 148143, 136058, 93067, 56335, 49472, 47385, 41854, 66639, 86174, 97963, 113223, 88206, 86333, 79490, 75188, 85811, 102148, 99197, 87390, 84619, 106124, 116254, 120043, 129458, 121202, 135762, 130652, 120297, 121042, 117940, 105800, 93666, 109786, 114270, 121212, 124732, 153679, 169848, 158571, 154229, 133008, 104848, 118879, 133545, 108872, 91250, 120926, 157630, 140108, 141751, 119877, 120302, 123189, 122621, 114810, 114828, 140049, 158931, 175523, 172209, 160853, 135327, 118515, 112480, 120509, 104144, 99636, 118536, 123710, 118906, 139594, 146541, 102778, 96634, 90831, 91312, 99955]
8847I9955j329k0266k4025R476J0375J3681K1778N815L4589P08l9281l792o759
8834A00925k4424n817j2265j9042Q901K2717k055K319O15j4984j1898J3750J3982
8821G2724K0201q309k9582L37p77j0262J5360r416m460l629J4096P119J858J8771
8807H4031m59J4450j3434K1081L892n884l5894J5176R954j2466k4168m855J1971
8794F3395j393j4387j1119K287j1265j4446K828K4001J8356k6523J0324j9517
8782B2541o694K9955L3798n353q808o060K3507Q367l981k2774m4334M558J0411
8769C5133J2435P018o376k1679J6335L9617QP064R446m4096k9439j504L0878J938
8755E6778R622J8555m49o392j0011r68j6868R093P700j5931r924j1538l461J8271
$$ y = [99955, 98626, 78360, 54335, 63811, 74186, 87867, 109645, 115460, 150049, 150757, 111476, 107684, 100925, 76501, 70684, 58419, 39377, 48278, 70995, 68940, 71259, 71874, 56890, 44992, 58742, 72724, 92925, 84616, 55034, 55371, 54594, 44332, 59692, 50276, 45816, 42187, 56283, 63402, 65260, 84031, 83572, 98022, 84588, 105669, 109561, 103677, 67783, 82959, 92913, 80447, 56279, 51424, 63395, 62002, 47615, 36496, 38783, 27518, 13072, 15900, 39901, 58257, 31734, 42058, 22541, 15847, 45802, 79600, 74247, 65439, 59379, 82886, 91253, 87272, 64498, 20164, 24722, 35133, 47568, 54586, 48210, 26531, 42866, 82483, 82491, 89555, 99001, 54905, 25466, 23962, 54840, 56778, 66400, 84955, 84506, 78114, 68103, 67135, 50267, 59360, 67060, 51129, 41205, 29667, 26206, 44477]
8741D4477j756n37P660M104o169K2240j3691l780P390Q205l930L781Q43K295m377
8726F6755j7054k039K732J1K450o813J221o218q136L743l21q909l917J4161R918
8711D7584J573j640L392n105k0792k3768m609J5101K2090M040R192l141j3254
8698C0663l8425k1270P535o991J0322Q978J3947Q891Q910j3470P543J1304R622
8685C7559j2272j0471K1722k1798J368K311k920p112Q005R485N819O717n297l22
8671C2794L859J2266r215j4179K4520r287j5576O368J524q979N964L3702j2697
8658E1064l149r624q899J109m73P633m672p162K292J6336N169j6179k8903j8936
8644a4394K1653K6110p068J9019L901r6K2918O796j1366j8858j9477l924J2590
$$ y = [44477, 42721, 42184, 49844, 53948, 47779, 70019, 56328, 52548, 59938, 68143, 64213, 67994, 68837, 71132, 66755, 49701, 47662, 50394, 50405, 52855, 46042, 47263, 41045, 32909, 36652, 36331, 27422, 23505, 37666, 47584, 49157, 47517, 50909, 45804, 25012, 1244, -3365, 11736, 33826, 37866, 47058, 43917, 30663, -7762, -29032, -21497, -28488, -18166, -9188, 4759, 13650, 22560, 9090, 16633, 27937, 37559, 25287, 14816, 36538, 14740, 16108, 18419, 15499, 8387, 16392, 25877, 31696, 38413, 33116, 32794, 36653, 48919, 39704, 25525, 50045, 40758, 25182, 31550, 33074, 24095, 30059, 63761, 51064, 47915, 38291, 29392, 30501, 30028, 37661, 32989, 25827, 28119, 44455, 49624, 33445, 4542, -14394, 7259, 33369, 26301, 45320, 49221, 49125, 72043, 78839, 67473, 48615, 29138, 25214, 37804]
8631C7804O792n024j8166l5662J1197J1497J1065J9139J6633N418K1502p435k3396
8618E1364k1708j0378m635j0052k107O482J6333R646Q420j8974j2323j3018M402
8605C452k0678j4734K1466K9129q729l514Q974l361r901j28K0474j386L019m870
8591A9213j8255j2788J151j1808M562m214j483J9943K3884N362o069m813j3176
8578A509k5724J4782K3017O573K5867j0164Q868Q270J0728j5555J246J1293K0996
8565H1706n139k7438k3593L0671Q173j1201k579J0426K587j6209N905J577J5355
8552G0241L0805J2365j786l402m981j5876J3796n29R564j3536K9500L7349J5882
8539A79392p733Q943J4666K462o674j726j3152m0639j8061p910p419j0391m485
$$ y = [37804, 44596, 39572, 21406, -14256, -3059, 8438, 19503, 38642, 55275, 60693, 82195, 74760, 51364, 29656, 19278, 14643, 4591, 2484, 8966, 25299, 34945, 43365, 24391, 12068, -950, 3452, -17226, -31960, -10494, 18635, 9906, 6392, 15366, 12005, 2104, 1976, 22450, 21064, 24083, 19213, 958, -11830, -10679, -22487, -17925, -22139, -23622, -3679, 20205, 25567, 19498, 14685, 1509, -24215, -9433, 13584, 20157, 46024, 35860, 44728, 52998, 63726, 48171, 49417, 60710, 81706, 76567, 49129, 25536, 56207, 64380, 53179, 50600, 61026, 63613, 47404, 53309, 54886, 70241, 101046, 113411, 111625, 108223, 103242, 87366, 101162, 100633, 110197, 96661, 126161, 163510, 179392, 171659, 180602, 195268, 197730, 191056, 189330, 176178, 135539, 117478, 109568, 102149, 91758, 87273]
8526H7273j4094j8011k8059j71J1636j8168L683r957L666J2524l3576k3931O8
8513b7117K6530K2586K7785P147l1832j6014J2785L492P865L4280m019j4281j624
8500D7583J5J7998r52q884l1116q968L8500O6k3282m906j1835j9588k7018k127
8486c4514N807J0945N437k8342J4632L271M818j0358N619R799L444J0034O13L339
8472D544J9476R731k2961J3117Q892j412q655K129m832L426j7115m731L4938q66
8458C5681j571J2799k0246k2506M0590J7689j490k9202j3641n131l177J3469K705
8445B5969j3328L848J0137j2622K439J4736j365q137M041p338J3912k6358m506
8432A428k1481J8214J0421J1714P524M423k4027k978n554N572J1611l587p87K5420
$$ y = [87273, 73179, 55168, 27109, 26938, 38574, 20406, 24089, 14132, 17798, 30322, -3254, -27185, -27117, -587, 21999, 49784, 56931, 25099, 9085, 21870, 25362, 33227, 67507, 63488, 49207, 47583, 47598, 65596, 64644, 55760, 24644, 15676, 54176, 54242, 30960, 26054, 14219, -5369, -32387, -34514, -28707, -17762, -12325, -40667, -26035, -22764, -17946, -28304, -22685, -12886, -9442, 592, 1205, 4544, 24020, 33751, 10790, 23907, 32799, 31387, 22732, 24861, 20029, 23455, 6340, 1609, 36547, 35681, 34110, 46909, 26663, 4157, 44747, 62436, 60946, 31744, 18103, 12972, 9795, 23264, 25969, 12641, 16489, 26626, 14004, 16443, 31179, 29814, 21677, 25718, 18380, 32292, 5934, 1428, -20053, -1839, 8582, 20296, 27820, 32243, 8216, 5238, -316, 5256, 16867, 13280, 12493, 37913]
8418C7913l285J62k7376k3537k8044R755M3310j3535M060j7027m713j279P00p401
8404c0297n271J6671M947M600N84n88L0265r727l1195J6384J4528J1851q625J3998
8390B8125J743p60r856M028n379j4386r682j4047L5444K2366n4854o454P937k771
8376a8546j4628m085J9481J6885K093O827P21j591r55J3149l66j3700J2007R205
8362B6497J0854l550j5807j1445k8546K3858J6888N08l788J3644J373J1587j1542
8349C0531l8453L813L0765k769j2802j7861j446j2480R290K2265R838J4346O0
8336C5097R638J2013R516j5249m1749k4511J6324J816m0915j0729M7435K3377
8324B2063L250L62M442k2598j7852p050M571j3091K7376K9934m718j1768j1307
$$ y = [37913, 34628, 34790, 7414, -16123, -44167, -34412, 8898, -4637, -577, -17604, -22317, -23596, -22896, -30297, -35568, -18897, -13950, -9350, -8766, -9354, 20911, 11184, -20011, -3627, 10901, 22752, 14127, 28125, 29868, 29108, 19252, 23280, 17901, 3515, -6167, -20214, 15230, 37596, -17258, -23712, -15775, -18546, -33174, -37259, -17778, -893, 1200, 8027, 8748, 7157, 6202, 19351, 18985, 5285, 17292, 26497, 37351, 33801, 17994, 6549, -21997, 1861, 18749, 19257, 15469, 29113, 30486, 42073, 30531, -7922, -4109, 26656, 23887, 11085, -6776, -8222, -20702, -11412, 10853, 20691, 35037, 35097, 44735, 56748, 66264, 51015, 9266, -15245, 1079, 2895, -38020, -48749, -1314, 22063, 25313, 25675, 30117, 7519, -10333, -17383, -12812, -25903, 1473, 31407, 26689, 14921, 3614]
8311C614J2281M281Q403J1494P989o044k5150k9793P913J2581k2854O077Q343
8298h65J540R281L200o274O74p815j6765J6606j5944J6775J9647j3360l2167K6605
8284A138M8133n128L299Q439q340l0148j0532j2524q845r261K3371J5833k5264
8271i829k8626P926K0104N3492j685j5556p592l794Q977J28J4284k408m2908l7635
8257d5122o540J8266J4335j3889L643L627m389J2034l165J4173J4811l124j8987
8244a4327K751n904J252O089j5760J1067O305N596k447j4373o168J1837K8297
8231A4215O304q213P331Q717L380j7554l1959J8538j6702j8431R878J8725J6729
8218A0958j3942P985O898O371j449M093j1140p350m1816j8983P975K2848M693
$$ y = [3614, 15895, 20176, 28579, 40073, 48062, 42018, 16868, -12925, -5012, 7569, -15285, -9208, -865, 675, 9956, 13156, 6882, 7556, -259, -17024, -418, -16362, 413, 20060, 6700, -25467, 1138, 49271, 44143, 47442, 55881, 47541, 17393, 6861, -5663, -14508, -23769, -398, 15435, -9829, -38455, -30529, -10425, 43067, 41382, 25826, 18234, 14440, 23417, 23545, 37829, 35421, -7487, -45122, -51662, -33396, -19061, -32950, -29307, -25680, -30069, -18035, -21200, -7027, 7784, 4660, -14327, -11576, -17480, -16228, -10139, -25899, -14832, -8527, -2931, -5378, -19751, -25919, -14082, 14215, 20519, 12306, 19637, 28354, 31734, 14180, -17779, 759, -15943, -34374, -24496, -5771, 10958, -2984, 5001, 11899, 18270, 16821, 20914, 9774, 2424, -39392, -58375, -50400, -27552, -22859]
8205b2859j5091o994K0608K7973m877m777K7051o321l3933p758o20J8676m349
8192a3271j7338j3265j2384J536L4714j1997q613J1011M000m021q923N681N56
8179c2314J8548n209k2421J17J6574K098R500N638j0433j2705J1666M105j4663
8166b9499p06J3514j4195L544P645k1625j1514Q989K5518R017j2976P619r626
8153b4295r369J8695K7185l764n384J3187N530q830j8461k3213L574L0002K8038
8140C2895J2962j5662l56n711K5688r830k0855j7318k2508m168j4874P466K4254
8127h017j3082N642J2998K5775j2226k5176L282J9074K4792j7370k6737k1061
8115c2106l304M997J9635J2112q296J658R951J132J4484J60J507j335J6467L5132
$$ y = [-22859, -37950, -44944, -24336, 3637, -1240, -6017, 21034, 14713, -19220, -26978, -27598, -8922, -13271, -30609, -43874, -56258, -54722, -20008, -32005, -40618, -29607, -25607, -29628, -38551, -32870, -32314, -13766, -18975, -41396, -41279, -24705, -22607, -13107, -7469, -17902, -30607, -18941, -14836, -29499, -30205, -16691, -30886, -27342, -19697, -41322, -52836, -43847, -18329, -9312, -22288, -14669, -24295, -33664, -14969, 12216, 8452, 3068, 16255, 21785, 12955, -5506, -28719, -25145, 4857, 32895, 45857, 30195, 29839, 24128, 49816, 39986, 19131, 1813, -20695, -24863, -39737, -32271, -8017, -21099, -15457, -2459, 23316, 11090, -14086, -10804, 8270, 33062, 15692, -11045, -32106, -35410, -30413, -10778, 1334, -6962, -5304, 4647, 5779, 20263, 20423, 21930, 20595, 37062, 72194]
8101G2194p881l6082j2314j9232k5487q667K1999Q279j4520l298Q329k0538k677
8088c9895o69J0671K4281j8069K5637M2j0206m843J272k616p987O267M398K0059
8074H342J7297j1307j5754n494j6126j0677m270j3726L011J6438j894k8029L435
8061e8754K8208O05J828o372J469K6176K0370K550p487J1148j9242j4430N317
8048h614k7913J1648K2693R41p878N977l0198j8947J4759K1234R104l4574j4144
8035e5912K0134N075J586o647l119K6044p504k0611j0265J0210Q131m480j8577
8022e5935j4554K1155J6332L6259P147O054J098j0910k2847l313o104j3102K3094
8009a5626J2163l510l3333n651J7695K2028K4274M481p613p844k2823J818J7427
$$ y = [72194, 64313, 28231, 15917, -3315, -28802, -37469, -15470, -7191, -21711, -25009, -16680, -37218, -39895, -40564, -29893, -5612, -23681, 1956, 1998, -8208, -13051, -11779, -14395, -22382, -16115, -11717, 8342, 25639, 14332, -1422, -6916, -23042, -33719, -37989, -51715, -48704, -32266, -34160, -62189, -58754, -30546, -29941, -28113, -34485, -33016, -6840, 13530, 16080, 8593, 19741, 499, -13931, -8614, -36527, -24879, -2186, -1245, -9123, -3146, -33344, -52291, -37532, -16298, -7194, -41768, -55912, -35778, -30703, -29117, -35764, -38883, -12839, -20343, -40954, -51219, -41009, -32878, -37358, -55935, -70489, -49334, -33002, 3257, 10404, 16458, 17556, 6646, -16201, -19514, -25618, -38720, -15626, -3463, -6973, -40306, -45957, -28262, -6234, 18040, 22521, 14908, 7064, -15759, -13941, 3486]
7996C486l698l586J0865k2826J658K0091j8236l539J6315o317J82p824j5426l114
7982c1969Q258J6611K38K0954l168j3464n998j9044q297k182m753J1963M537J7209
7968i105K956l191j7982p485J3869J5511J3280J2198j0379l450O089J9640J1938
7955D3889j653j3142k978K971j180q896j6318j4725J0652L6o708j1632L0195J5159
7941B5670k6651j1468K2720O215q668k5996j0316N375K3685j393p88q269j3101
7928b2985J8699K8992k0637k4523l468j3281J4206k244k4524K018K3071O555k4278
7915d2399r154K2151J7502j320K7969M38R387p338j2375J283l796j9839p604K1683
7901c412K8765K0153l371n1887m8236N393J9272J5763j1420k003J880M652l532
$$ y = [3486, -212, -3798, 7067, -15759, -14101, 5990, -12246, -15785, 530, -5787, -5605, -13429, -28855, -31969, -23711, -7100, -6862, 14092, 10924, -2540, -8538, -27582, -35879, -38061, -42814, -30851, -26314, -9105, -6149, -9340, -27322, -34807, -20938, -5427, 7853, 20051, 9672, 6222, 12311, 31951, 43889, 42236, 29094, 26116, 29087, 27907, 19011, 2693, -12032, -1380, -1344, -8052, -19684, 10511, 25670, -981, -12449, 10271, 16486, 7818, -18178, -28494, -23119, 566, -827, -1615, -9884, -22985, -4286, 24706, 4069, -20454, -23922, -37203, -22997, -25241, -49765, -47747, -24676, -18121, -42399, -51553, -29402, -11900, -13220, 14749, 15187, 24574, 17236, 4861, 6144, 2348, -17491, -25095, -3412, 25353, 45506, 42135, -9752, -57988, -52595, -33323, -17560, -28980, -30983, -29103, -24451, -27983]
7888b7983m695P178r042J1256L6404J7638l141j7768J07j8917l0872j052j2146
7875e3033K1123J1676K0505J7431L6115j175k1043p573p403L815k49O590j5769
7862A1010j2062j8496K398r885O768K5850k6191m599Q12J4743j159k0478j5873
7849d7162J8426J1789K0164p492O384J8554j7438k2449k3844q83L2934O724j854
7836f147J4243N091j5329k3833p029K7276K0751o500k2930q377Q068M359m319
7823a4676J993M889K450O083j6039N096K653J4804o083L495K1019L581k851m8724
7809b2310k3950J4941k207J1101J9481n242j081P377j4905j0781K0175l582j2882
7796b3865P292J0520J0351j6650r541P798p955j9415K6653J4850n21K490j1348
$$ y = [-27983, -32678, -25500, -34542, -23286, 13118, 30756, 27615, 9847, 9954, -8963, -39835, -40887, -53033, -31910, -20234, 271, 17702, 53817, 52642, 31599, 24026, 16623, 20438, 20189, 26779, 11010, -1052, -19548, -17150, -27035, -20267, 5583, -20608, -25207, -24395, -9652, -10811, -31289, -47162, -28736, -16947, 3217, -4275, 2109, 20663, 3225, -19224, -43068, -43951, -11017, -4293, -6147, 8096, 13187, -2142, -25975, -33004, -5728, 15023, 8523, -14407, -22784, -14716, -10357, -14676, -12683, -7794, -5344, 739, -15300, -10204, -7551, 7253, 1170, 4665, 25684, 29265, 26414, -22310, -46260, -31319, -33526, -22425, -2944, -8186, -9267, -1890, -16795, -27576, -7401, -10983, -23865, -16573, -6053, 4298, -12352, -21893, -14095, -22050, -41465, -14812, 38, -483, 2007, -9341]
7783i341j0090j7833J1031K7822m552j8411j3421K1460J496M561P175m098q399
7770a2600k9022q258l014k210J4082J1151J3422k870k7410J2229P232M618k5990
7757d8640r785j295j6748P665J2888o141j6215l370O567N276N425J7002O043Q147
7743c3181J5887M545J7680r772l295r813J3336Q055p808j1210L805L3594p276
7730A4547j629J0262l2612k0999K2229L0877k1688m5647j4543J2945K2325j3344
7718c7277n298J5513k0917J6470o520J7838N571j504o249n376q150K1713J7808
7705C622Q356l354N458L698J0508j4914k3268l562J1072J1339o215p065j8076
7692b2401p805P446j754P738L458j9339O311J155O63K568k4756j5377J3431J550
$$ y = [-9341, -19431, -37264, -26233, 1589, -2963, -21374, -34795, -13335, -11839, -7278, -103, -4201, -12600, -41622, -49880, -52894, -55104, -41022, -29871, -16449, -19319, -46729, -34500, -27268, -22650, -48640, -58425, -59720, -76468, -68803, -55915, -62056, -78271, -81641, -75074, -69798, -64373, -47371, -41328, -33181, -17294, -12749, 4931, -4841, -8136, -17949, -4613, 3442, -4366, -15576, -11771, 21823, 14547, 12918, 23180, -9432, -30431, -8202, 22675, 987, -44660, -59203, -46258, -23933, -37277, -42575, -27062, -47979, -31509, -38029, -20191, -14620, -16124, -22373, -27749, -35899, -14186, 3622, 11978, 8624, 14082, 17780, 28288, 13374, -9894, -13456, -2384, 8955, 2740, -4325, -22401, -30206, -22760, -24514, -16776, -13318, -32657, -26346, -25191, -24528, -21960, -46716, -62093, -48662, -47112]
7678d7112K1845l097L2251r013R605j8644k804n453j7720J3762K9119m426j3155
7665a4842o826N415M742R739k8373j8056r606k891l044J74J6269K7281O490k080
7651a5608J337J6868J4046J3345j6188k6130r221j5932J9691K1225J975k2764
7639a7356K957l298P859L052o01J3625k752j5932j3233p506Q532K2501J0702N525
7625A4075l687j0085n540J4347k926p253J5237k1895j6529k7660j1103J6130Q895
7612c7994Q643J4590m113J9879j8640l7276J5253J03l993k464o784j4327m817
7599g1940K4961r842j2831l803K5923R203n663K1448l431k4616j0513J7912O805
7586c6387R705L20M289Q705J2925K164j9371j0363J164j5289k7665J0173K4545
$$ y = [-47112, -25267, -28364, 3887, -5126, 4479, -14165, -16969, -22422, -40142, -26380, 2739, -1687, -14842, -21668, -16253, -11511, -1772, -30145, -48201, -57807, -60698, -63742, -63568, -47299, -20018, -13528, -15608, -14271, 2597, 16643, 29988, 13800, -12330, -21551, -37483, -17792, 3433, 5408, -17356, -14399, -17697, -9838, -6786, -7387, 6238, 3486, -12446, -25679, -33185, -24653, -2152, 8550, 14075, 10388, 303, -5237, 9110, 6184, -1069, 14168, -7727, -24256, -51916, -63019, -46889, -37994, -29351, -14761, -18874, 1005, -17635, -54911, -39658, -39555, -43548, -46012, -52796, -67123, -71940, -46979, -56821, -69652, -73455, -47532, -38329, -43992, -22544, -25975, -50591, -61104, -43192, -36387, -26682, -26362, -22073, -13368, -443, 1721, -17650, -28013, -26849, -42138, -69803, -59630, -35085]
7573c5085J3977q52r259j2410k275M151j0993J3220j3951J4029N650P913n502
7560c1387R835P859k3979L049q236k9795j4297j0162K0436K3932J6122K9246K0350
7547A2973Q869l2712j0772K7448M059j6645m987l018P357o02J777k4880k1034
7534e2167j5486L400K0430l263J7036J6862j6796o716O899n953K1561j601r724
7521b5518j8362j9465Q561J2750o053p712k5439n066J4097J1425J3890L215j5871
7508e9548o085J8590M292J6470K6930O85m562j1064K308J752J0069m564J4663
7495I936j3661k0074K1959J1377r175J5912P011k1272R231P785J7074k7247k8832
7482a9976o589K107k5257J5598L8284J0255j993R490l4720j2576K7653J6417k7406
$$ y = [-35085, -21108, -21960, -31219, -43629, -45904, -41753, -52746, -39526, -53477, -39448, -33798, -25885, -31387, -21552, -13693, -37672, -34623, -42859, -72654, -86951, -97113, -76677, -52745, -36623, -7377, 12973, 21842, -10870, -21642, 5806, 9865, -6780, -11767, -14785, -7428, -8030, -6253, -31133, -52167, -67653, -64253, -43823, -47086, -30050, -13188, -29984, -36700, -29801, -35754, -14193, -15794, -25518, -43880, -63345, -54784, -42034, -48087, -55799, -81238, -86304, -72207, -60782, -46892, -43677, -59548, -65633, -47043, -42751, -26281, 649, 1334, -3228, -14292, -11984, -10232, -163, -4727, 9936, -3725, -23799, -1840, 9537, 362, 16274, 23285, 2013, 11244, 19029, 36103, 8856, -19976, -26565, -24458, -49715, -34117, 4167, 14422, 12429, 21919, -12801, -25377, 2276, 18693, -8713]
7469h713J3278O530j5924q524l3495j3052k2816M559M3477L4692k1412j2153R04
7456c2649K431K0069k389r423j002R64j1063o871K1067N696N566j4724k27O096
7442a6459P849J7906p946k8709m913r691m642j4449Q419J5059K3853J2867M995
7429D139k1092j7350K6845O814J727J014r727k593M63J1955L116l2615j4145Q94
7415d0555m133J413k399L8983J2637J4974j682j8224r890k3289k4909o2j1883
7402f9019L765P067J8787J2471K6181j2530j1309k4163j3217M0027L9613M660
7390B2333j9130k3240r798L816k2345j8784J8448J1006M450J1895J9910M810p05
7377B666q284j7905k9206j1635J6551K4475M151o957P717o022p995J6835J7863
$$ y = [-8713, 4565, 11095, -4829, -13353, -46848, -59900, -82716, -78157, -34680, 12, -21400, -33553, -32649, -30218, -10149, -12538, -21961, -22963, -21999, -33062, -39933, -18866, -13170, -7604, -22328, -22555, -16459, -8610, 9296, 1350, -27359, -32272, -41963, -46605, -61054, -52635, -37576, -13723, -856, 4139, -16953, -34303, -7458, -644, 1083, 2097, -7630, -10223, -9760, 2195, 5311, -27304, -41449, -40555, -44688, -43275, -45674, -6691, 5946, 20920, 19238, 1014, -8876, -32165, -57074, -57136, -69019, -65254, -58187, -39400, -26929, -748, -13278, -24587, -48750, -61967, -21940, 17673, 22333, 3203, -20037, -29835, -26019, -48364, -67148, -48700, -37694, -33244, -21349, -1439, 3371, 2666, -5618, -23523, -52729, -64364, -47813, -23338, -19187, -26144, -18427, -24449, -32444, -15609, 2254]
7364B254N692R646o962j3291m841o216J0306N291M583K8438J176j8109r87q464
7350H516m624K316j9864L102J4679m167j9072k6159K2653K4614k677j1298j4894
7337b6875q778Q483K6533K4897k8767m8945r414K3220J7621N325P500n377P114
7324g463M500j5848j3459k0646O24J3658J4326R528j9412j0451k655J0724J5039
7311b1535L420L2578n279j9372K394j34j6823l857J0091n120K850j3841n986o11
7297d1225K0638K1765j4970K670K4350l387j3393k7106p920J2518L130K308n215
7284b5837l747J6317k107o049J9318K3515j7315k3539J4393M714J865K334k5943
7271b2081p691P546L8675K2062j3327r873m194k3304j6515M895J0192J063p950
$$ y = [2254, 7946, 17592, 10630, -2661, -7502, -13718, -3412, 1879, 6462, 34900, 36076, 17967, 16980, 8516, 3892, 6208, -13656, -10554, 4125, -42, -19114, -45273, -22620, 1994, -683, -11981, -26875, -35653, -27170, -637, 24260, -4507, -53452, -62866, -39646, -22025, -16700, -9200, -14577, -7463, -2963, -18811, -32270, -52916, -52292, -38634, -24308, -14780, -34192, -44643, -47298, -36574, -21535, -18115, 14463, 9184, -10188, -7794, -7928, -24751, -28608, -18517, -23637, -20787, -34628, -40614, -41225, -20587, 1178, -13792, -11122, 13228, 9841, -3552, -30658, -38578, -26060, -22930, -20622, -25837, -29584, -13267, -15374, -21423, -2105, 21410, 4095, -19444, -5051, -337, 1528, 3862, -22081, -29772, -22226, 16449, 38511, 25184, 15311, 11117, -12187, -28702, -23807, -13615, -12552, -20502]
7258b0502R467j7909K3685J6511Q886k376j5247k1390j9703J9629L4875j8736
7246b810j6812p563J1536j6652n619J3334J0466k2463m015J3341N684j5262q822
7233d5657K7048j345l0896k086j8195L617l913J635o734K2197L742M489N944j327
7219d1481J9970L2989J9560l3250k9426j407J5099K0354m871r352J6939L0098
7207C5222O451j649j6568k009k4893l7997O618J5351k5495j1020J5441J9245J6761
7194d542j381j2274k3727R688K1378k645k4548k0097m036p636l211L4480Q900
7181b9651j2141M380J8690M435j5729o223o087m923j4160R347K0417n232L794
7168c3083J2494l225j8191j0095L3967N086J9156J879K310r521m7305p58J0331
$$ y = [-20502, -11035, -28944, -5259, 11252, 20138, 17762, 2515, -18875, -38578, -18949, 15926, -2810, -19622, -27185, -15649, -32301, -37920, -24586, -14120, -36583, -40598, -27257, -21573, -36835, -45657, -18609, -19954, -50850, -52936, -71131, -67514, -71427, -69792, -76526, -54329, -50587, -46098, -40154, -41481, -21511, 11478, 31038, -2212, -31638, -33045, -17946, 2408, -2463, -11815, 5124, 35222, 41673, 40024, 23456, 21447, -3446, -41443, -34825, -19474, -44969, -55989, -40548, -21303, -4542, -5923, -18197, -41924, -32236, -10858, -13503, -38051, -58148, -62184, -69820, -73031, -38551, -29651, -41792, -37412, -18722, -14287, -30016, -36239, -42326, -47249, -61409, -52062, -31645, -36877, -33083, -20589, -23814, -42005, -52100, -18133, -13047, 6109, 7988, 10298, 777, -46528, -47286, -36955]
7155c6955l169q465Q715K0326L112q856k2782k1863K4284L1694L222j6446j0105
7142c7288K7247r692k7183p834J1719J9621o311k4708j0686K3625N97P364Q57
7129c2672r286R235J0121O696l1462O267J3438n067J5715K0322J6236O039k7209
7116a627j924M630J0053K3166o214l2579m8298j2382L876L1126K8931m943j4837
7103b1022j1725k0660j9825J7869J6877J005J4926K4008J3012k2349l4605j2619
7091e5108o787J4566J6437M405l4160K0857j5483j602L8335K4846R285J0528J822
7078B7941r270J533r742J5574R789p772k6152q080o713m411m115J0477J5893P37
7064E689m124M778J7071k1349q440P530O573N679O801M861l2963k1172J4329N572
$$ y = [-36955, -40124, -48589, -39874, -19548, -16436, -25292, -48074, -69937, -45653, -13959, -10737, -27183, -37288, -10041, -19733, -46916, -54750, -43031, -23410, -29721, -54429, -65115, -41490, -40893, -33529, -32672, -41958, -32723, -22602, -15906, -47368, -41101, -27663, -32730, -17015, 3307, 19543, 25582, -1627, -3551, 1079, 11132, 34298, 28084, -4495, -52793, -65175, -61299, -30173, -1242, -6185, -21022, -32747, -53407, -73232, -55363, -38486, -37481, -22555, 1453, 14465, -7884, -42489, -55108, -61895, -47329, -30892, -26487, -60647, -39790, -55273, -56875, -18540, 6306, 15591, 26119, 27941, 18671, 20204, 10462, 26036, 35825, 28053, 1901, -6179, -12892, -17303, -21418, -10941, 4952, 5689, 1565, 6343, 23414, 2065, -6375, 1155, 7728, 13407, 20208, 25069, -7894, -29066, -14737, -9165]
7050i165Q757N877q255l944p755J7855P353k5844p913J118n571j1614n59K8849
7036a0811K0009j0044O703J6239J1948k572J130M395k5544j6356o159J3068r526
7023g520l514j726k095p103j254J2040L666J8408J4569j5978Q667J6635j8818
7010A5977k5147r575O663K1478J2037j2502M062j147p466l464Q959P949r561j2041
6996c778M192j1789P837J8949r856l445l692o853n594k0312l540j39p231k309
6982d7560J5924J9307k168j6180p313K4937J1265l340m330J0212J3215j6945M052
6969A076l0763k3923Q546J1447p334j771n062Q357J7084L797l620N764Q942L695
6955c765J088L331k26l0648k4280K0648j879J3105l647J0419l38J2139N968J5171
$$ y = [-9165, -408, 5469, -2786, -6730, -14485, 3370, 10723, -15121, -23034, -21916, -27487, -39101, -39660, -10811, 9198, -846, 5857, 22096, 34044, 31472, 32602, 36997, 11453, -4903, -11062, 2006, -7520, -11034, -12760, -14855, -21958, -23212, -11172, -7506, 10902, 25471, 9493, 18160, 34795, 15977, -9170, -18745, -12082, 9396, 21433, 8931, 12993, 11846, 4380, 916, 9875, 17824, 8263, -3778, 414, -11375, -3538, 15411, 5555, 2110, -1582, -8435, -14029, -34341, -37881, -38020, -45251, -47560, -31636, -12329, -14497, -30677, -37990, -13053, -1788, -5128, -9458, 754, 13969, -2976, 1076, -29687, -53610, -45064, -33617, -40951, -42722, -47784, -39427, -22343, -18546, -22166, -16402, -7460, -3765, -2677, 654, 428, -30220, -54500, -33852, -35731, -22626, -26273, -15854, -16192, -4053, 1915, 17086]
6941A7086k0626J1976J1066l0118n304J327K3091J0255N080J3061J1278j8975
6929B9197l5373k7529o084J4519M912k6312l0208l511K8532K4418J1990J5719
6917B70j1765j0813j451j0356k0060r268j0736L887J8277K2951J5414Q030m1995
6904d7615J1063M4897J6727k4199k708k7541q679M2241O180j1666J2188j2820
6892a932j9820P476L9999j1709o983j7979k6820N203K3035j1997l1550l993L4139
6879b2931K5759n630r775j1288M012l744r998M934r492Q881J811j1570J1188o020
6865c3863p764J954r406l991J1536K628R88J3773o747l98O255K6257k3174j2627
6851c4579r36R714l236j6531J7860J2231k114J2775j1043k7709k9678J5918K8024
$$ y = [17086, -3540, 8436, 19502, -10616, -15920, -14593, 8498, 18753, 23833, 36894, 48172, 29197, -6176, -33705, -39789, -25270, -20358, -46670, -76878, -80389, -51857, -27439, -15449, 270, -11495, -22308, -23759, -34115, -54175, -63443, -74179, -70292, -52015, -29064, -13650, -5620, -47615, -36552, 8345, 25072, 873, -1835, -29376, -38055, 4186, 10366, -1300, 10888, -1932, -21752, -14276, 25723, 14014, 7031, -10948, -37768, -32565, -9530, -21527, -53077, -57070, -22931, 2828, -2802, -12577, -23865, -19853, -23597, -33595, -28661, -38153, -29272, -27461, -39031, -27843, -33863, -41627, -39673, -49079, -53070, -41534, -38906, -37918, -24145, -30892, -31290, -25035, 1222, -21952, -34579, -35515, -25801, -29037, -45568, -27708, -15477, -17591, -4816, -15859, -43568, -73246, -57328, -29304]
6838b9304P035K251m690K017O322j2671k5008k0510M656K5935J5136Q411j7592
6825c8012J2329L831P006j3617k0684L4815J7720j6216j8365m796P719j2901l450
6812d4621o714Q427L4J5250K0438p254m109o709r222o641N387j7901J3795Q106
6798c1734r456k5415O308N331K6394P50P78k051K4274m151p589j1862j2421q774
6784d9618P470K0335L6740j1972k7986j1746O346J8063J0323K7174j5854j1818
6772b543R28j2443n812J1577M131l838O986k475J2210k213j0879Q357k7233k7797
6758e1044k9782N559L2670M9381O233j0918O668m32j3850k40O542J3095J0032
6745B3914J211j2988m433o892k1785K0978J0361p764j045l56R05O53j044j9943
$$ y = [-29304, -22269, -20018, -24708, -22691, -16369, -29040, -54048, -74558, -69902, -43967, -28831, -20420, -38012, -25683, -21852, -14846, -28463, -49147, -14332, 3388, -12828, -31193, -35989, -28270, -41171, -44621, -51335, -42908, -42874, -27624, -7186, -14440, -18549, -25258, -34480, -41121, -35734, -53635, -39840, -31734, -41190, -66605, -60297, -54966, -28572, -27822, -27044, -29095, -4821, -8972, -16561, -28423, -40844, -49618, -42148, -21813, 14927, 2955, -25031, -36777, -30431, -12368, -2045, 25129, 9275, -2543, -1615, -14058, -19870, -8293, -4162, -8000, -1014, -3489, 8721, 6508, -4371, 3986, -23247, -51044, -80826, -75267, -42597, 6784, 13017, 2099, 8767, 8335, -5515, -5755, 787, 13882, 23914, 25125, 12137, 7704, 812, -20973, 5, 10366, 2602, 1557, 1201, 2106, 2759, 1715, -18228]
6731a8228r068J0768r731J1261J9249K7872N441k5848j828O048l4173N294L1338
6718A8395K4476j8246j4781k5975O325L794j9237l034M236J3519K1133L5485o512
6705C9578j4357R680K051l373j1127r414j2459N204Q023m3837l6514K5341L2735
6692h469k107N287J2189N046J0500k9393l803k706l968m225j8681R21J9317j449
6678b1541P824J3770r489L28O067o227j7810P50P206J989n762j1201L064J3566
6664a7466o741k780j2569Q921J5695j3392j5720j3656K9800L7647m588j8931l936
6651a7716J4912J762R195q255l0837j3798j6868r682L5369L5361o394m576n364
6638a6891j53j6237p467L251K9156J5033q223P447J8732r911k579q396m0351K0463
$$ y = [-18228, -27296, -16528, -26259, -14998, 4251, 32123, 37564, 11716, 9888, 15936, -18237, -12943, 18395, 42871, 24625, 9844, -16131, -9806, -6012, -25249, -28283, -24047, -10528, 10605, 46090, 39578, 25221, 34901, 36952, 33579, 22452, 13038, 579, 5783, 13806, -30031, -66545, -41204, -8469, -10576, -5289, 6900, 11946, 22446, -6947, -10750, -13456, -17424, -21649, -40330, -39409, -20092, -21541, -13717, 53, -9436, -9108, -3041, -9268, -27078, -26328, -19122, -17133, -22895, -34096, -31032, -17466, -24207, -26987, -39556, -30635, -14940, -28332, -44052, -57708, -27908, 9739, 5151, -13780, -17716, -2804, -1042, 8153, -102, -30939, -44737, -61605, -71287, -35918, -557, -6951, -11527, -16891, -17044, -33281, -40748, -37497, -8341, 6692, -1531, 5916, 24648, 14737, 12158, 3762, -36589, -16126]
6624a6126M8754j8013l0982k596J2392J3984J6388k4819p241k600n887K9258k217
6611A0295r672j5792j3045K8245J7690K234J3594O515J0952k4987k7315O654J2656
6598A8024n622j263K403r839j3771K444q066J0627N65J4183l148L572J718r499
6584B328P207J0010J262j864p694N507j1609j1346j3405K197J7091O389j934l1144
6570b7005k0309J5176M0381j483Q5l767P429k6642j4701M603O660R66Q25J250
6556a6532k9860l5183L826L4535K2368J0024m327k3247J2650N86j7910N172M0221
6543B323K2140j1980r018m643K9709k648p975k611J6143k5691l8517L111O316
6530b3341J887k065R508N120O310J9064M83J2522k632j8143j5619l971k976j1722
$$ y = [-16126, 32628, 14615, -16367, -18963, -6571, 7413, 23801, -1018, -8259, -10859, -16746, 12512, 10295, 623, -15169, -28214, 31, 17721, 19955, 33549, 40064, 51016, 26029, -1286, 5368, 18024, 12402, 11139, 13542, 3703, -10068, -7624, -15690, -5063, -4498, 9685, 6537, 10109, 11827, 2328, 9535, 19545, 20807, 18943, 11249, 16756, 5147, -6199, -19604, -17407, -316, 6073, 4139, -27005, -47314, -32138, 8243, 6760, 6845, 3078, 10507, -16135, -30836, -26233, -19573, -18607, -17782, -16532, -46392, -81575, -77749, -43214, -20846, -10822, -15149, -38396, -25746, -25160, -43070, -37898, 2323, 24463, 12483, 3465, -1178, 28531, 25883, 17908, 15297, 31440, 5749, -32768, -29657, -23341, -21454, -23519, -14011, -8891, -2581, 16483, 16966, 29488, 26856, 8713, -6906, -10877, -13853, -25575]
6516b5575n807j2944Q848R067m390Q420J9624K520K09k5951j8396J2120J1291
6503b0964p236l814m263K4499n427J3697P724j7856l771P889K229k1430q756l155
6489d0634j8700K039J9585j1261l2157R304K5635J5729J6203K4160k430k0015
6477a2542j4200q010P528J5964j8556Q029J1006M491j6963N000R987j1805m276
6464b4347o069j0401K603K8204o7j4311k3963j3814K0958R866j2924l2414J7987
6451e8692J2324J3R160j7765M433N109J764J5465K8483j941K602J3307j0229k8169
6437b4136j2326K2322j780q569K3679P715j6644j9172j2443L753M010P216M443
6424b1932j7435J6686L0134J91k4105j2363q476r739o520R994K3982J1245j4880
$$ y = [-25575, -31382, -44326, -35478, -26411, -30801, -22381, -2757, -237, -28, -25979, -44375, -32255, -20964, -28200, -32014, -36277, -11778, -17205, -3508, 4216, -13640, -17411, -9522, -7293, -28723, -37479, -40634, -59334, -57295, -37710, -48971, -81128, -71824, -46189, -30460, -14257, 9903, 7473, -12542, -26742, -34752, -27224, -11260, -29816, -21787, -10781, -6290, -23253, -18253, -8266, -20071, -24347, -30416, -40817, -38214, -10010, -10077, -24388, -48351, -62165, -41207, -31341, -44265, -76679, -58692, -46368, -46355, -37195, -54960, -50527, -45418, -43654, -28189, 294, -1647, 955, 14262, 4033, -24136, -36462, -14140, -15920, -24489, -810, 6905, -9739, -28911, -41354, -37601, -33591, -26375, -21932, -39367, -22681, 7453, 7644, -16461, -28824, -37300, -47039, -53559, -43565, -19583, -8338, -23218]
6411b3218k4042l835O430J710J3921k051p231P223j6821j5381J8695K2637K8205
6398F242M993J0878n377J0735j4105j1366J9557J571r193k1042j3085R398J4623
6385C829K4787P583l995j2978Lr509j8431K971j460P710K528q916j4466o625L793
6370b3176j589O392l10r904J9986P795n279n025J1427J239j2552J3532K4493J8270
6356D5299k3988o366M085J5159j37k0313l3348K116j4219N519L5659L3906j6498
6343B6874l5115r482j7786O613J3416j4524o024J875K0908K280k5040j1025j144
6330d8174N392L0566L188Q598J7859j9767n363k288J4175j3918l1792m446L5412
6317a0558J9755j6444j2188J90J0139L0366L1912L5020J5967j3594l4722q394
$$ y = [-23218, -47260, -51095, -44665, -42955, -29034, -31085, -38316, -31093, -47914, -63295, -44600, -21963, 6242, 11235, 22113, 16736, 27471, 13366, 2000, 21557, 23128, 13935, -7107, -20192, -10794, 3829, 28616, 36199, 32204, 19226, 19229, 9720, -8711, -5740, -7200, 510, 3038, -5878, -20344, -26969, -23176, -24765, -18373, -18683, -28587, -8601, -806, -6085, -11110, 317, 1556, -10996, 2536, 27029, 45299, 21311, 14945, 19030, 34189, 34052, 13739, -19609, -17493, -31712, -26193, 9466, 43372, 26874, -8241, -17723, -35509, -28896, -15480, -30004, -36028, -34153, -13245, -10965, -36005, -47030, -48174, -42782, -12216, -9028, -430, 17429, -2338, -7701, -9989, 4186, -9732, -41524, -45970, -10558, 9197, -7247, -19435, -19245, -9106, 21260, 53172, 88192, 104159, 90565, 55843, 47449]
6305D7449Q886L512k6204r302j8569k6670l9368J575L6886l2172l367R908r8o824
6291e4358q372K2142L7799L1915Q204l5282j3015j7718j762J0755J0856l507n886
6278a8229P117j603J9239J7836p617P76o924l6361j1796j2177k1582k4603J8506
6265g7418J2829J1867K3380O907J1990k113j2199J1018J9887L0214J3348J6700
$$ y = [47449, 56335, 59847, 33643, 24341, 5772, -20898, -60266, -58691, -21805, -53977, -57344, -47436, -47534, -54358, -62730, -40588, -2789, 29126, 37330, 2048, -10967, -28685, -30447, -19692, -8836, -12343, -18229, -11112, -12715, 6524, 24360, 16743, 17519, 10595, -25766, -37562, -49739, -71321, -95924, -77418, -64589, -52722, -29342, -22435, -10445, -12558, -24757, -13739, 6148, 36362, 49710, 66410]
$$ [...]
##END NTUPLES=NMR SPECTRUM
##END=
