##TITLE=Analysis number 329879
Compound Code ac 30928
Project Code adrs
Chemist Name stores
##JCAMPDX= 6.0         $$ Bruker NMR JCAMP-DX V2.0
##DATA TYPE= NMR SPECTRUM
##DATA CLASS= NTUPLES
##ORIGIN= Bruker BioSpin GmbH
##OWNER= nmr
$$ XWIN-NMR		Version 3.5
$$ Mon Oct  8 14:49:42 2007 GMT Daylight Time (UT+1h)  MAYBRIDGE\nmr@NMR_250MHZ
##.OBSERVE FREQUENCY= 250.131544655141
##.OBSERVE NUCLEUS= ^1H
##.ACQUISITION MODE= SIMULTANEOUS (DQD)
##.ACQUISITION SCHEME= undefined
##.AVERAGES= 16
##.DIGITISER RES= 18
##SPECTROMETER/DATA SYSTEM= dpx250
##.PULSE SEQUENCE= zg30
##.SOLVENT NAME= DMSO
##.SHIFT REFERENCE= (INTERNAL, DMSO, 0, 16.5109)
##AUDIT TRAIL= $$ (NUMBER, WHEN, WHO, WHERE, WHAT)
$$ ##TITLE= Audit trail, XWIN-NMR		Version 3.5
$$ ##JCAMPDX= 5.01
$$ ##ORIGIN= Bruker BioSpin GmbH
$$ ##OWNER= nmr
$$ C:\u/data/dgb/nmr/ADRS/390/pdata/1/auditp.txt
$$ ##AUDIT TRAIL=  $$ (NUMBER, WHEN, WHO, WHERE, WHAT)
(   1,<2007-10-08 14:49:20.28 +100>,<MAYBRIDGE\nmr>,<NMR_250MHZ>,
      <created by zg, POWCHK disabled, PULCHK disabled
       configuration hash MD5:
       76 6E 9A 78 1E 09 19 81 EC 84 63 8F B0 6A 59 2D
       data hash MD5: 64K
       C4 C0 7C 79 99 E3 5A CD C1 5A 45 4A C4 59 43 3B>)
(   2,<2007-10-08 14:49:32.98 +100>,<MAYBRIDGE\nmr>,<NMR_250MHZ>,
      <Start of raw data processing
       ef LB = 0.3 FT_mod = 6 PKNL = 1 SI = 32K 
       data hash MD5: 32K
       AF BB F5 1E 11 BE 56 BE AA 6D CC 28 DE A8 CA E6>)
(   3,<2007-10-08 14:49:34.70 +100>,<MAYBRIDGE\nmr>,<NMR_250MHZ>,
      <apk 
       data hash MD5: 32K
       6C 4F 50 CE 6E 78 A4 1B 8E 95 36 FC CE F3 53 46>)
(   4,<2007-10-08 14:49:35.45 +100>,<MAYBRIDGE\nmr>,<NMR_250MHZ>,
      <abs ABSG = 5 
       data hash MD5: 32K
       18 B4 F1 FD 8C F8 98 A3 16 CF 3B FD C2 D6 9E 0D>)
$$ ##END=
$$ 
$$ hash MD5
$$ 23 CF 5A E8 15 F1 E4 BE 4B B4 25 E6 49 6A 46 36
##$RELAX= 
##$RELAX= 
##$RELAX= 
##$RELAX= 
##$RELAX= 
##$RELAX= 
##$RELAX= 
$$ Bruker specific parameters
$$ --------------------------
##$DU= <C:\u>
##$EXPNO= 390
##$NAME= <ADRS>
##$PROCNO= 1
##$TYPE= <nmr>
##$USER= <dgb>
##$AMP= (0..31)
100 100 100 100 100 100 100 100 100 100 100 100 100 100 100 100 100 100 
100 100 100 100 100 100 100 100 100 100 100 100 100 100 
##$AQSEQ= 0
##$AQ_mod= 3
##$AUNM= <au_zg>
##$AUTOPOS= <15 >
##$BF1= 250.13
##$BF2= 250.13
##$BF3= 250.13
##$BF4= 250.13
##$BF5= 500.13
##$BF6= 500.13
##$BF7= 500.13
##$BF8= 500.13
##$BYTORDA= 1
##$CFDGTYP= 0
##$CFRGTYP= 5
##$CHEMSTR= <none>
##$CNST= (0..31)
1 1 145 1 1 1 1 1 1 1 1 1 1 1 1 1 1 1 1 1 1 1 1 1 1 1 1 1 1 1 1 1 
##$CPDPRG= <>
##$CPDPRG1= <>
##$CPDPRG2= <>
##$CPDPRG3= <>
##$CPDPRG4= <mlev>
##$CPDPRG5= <mlev>
##$CPDPRG6= <mlev>
##$CPDPRG7= <mlev>
##$CPDPRG8= <mlev>
##$CPDPRGB= <>
##$CPDPRGT= <>
##$D= (0..31)
0 1 0 0 0 0 0 0 0 0.06 0 0 0 0 0 0 0.0002 0 0 0 0 0 0 0 0 0 0 0 0 0 0 
0 
##$DATE= 1191851359
##$DBL= (0..7)
120 120 120 120 120 120 120 120 
##$DBP= (0..7)
150 150 150 150 150 150 150 150 
##$DBP07= 0
##$DBPNAM0= <>
##$DBPNAM1= <>
##$DBPNAM2= <>
##$DBPNAM3= <>
$$ [...]
##$SUBNAM7= <"">
##$SUBNAM8= <"">
##$SUBNAM9= <"">
##$SW= 20.6930455092707
##$SWIBOX= (0..15)
0 0 3 0 0 0 0 0 0 0 0 0 0 0 0 0 
##$SW_h= 5175.983436853
##$TD= 65536
##$TD0= 1
##$TE= 296.16
##$TE2= 300
##$TE3= 300
##$TEG= 300
##$TL= (0..7)
0 120 120 120 120 120 120 120 
##$TP= (0..7)
150 150 150 150 150 150 150 150 
##$TP07= 0
##$TPNAME0= <>
##$TPNAME1= <>
##$TPNAME2= <>
##$TPNAME3= <>
##$TPNAME4= <>
##$TPNAME5= <>
##$TPNAME6= <>
##$TPNAME7= <>
##$TPOAL= (0..7)
0.5 0.5 0.5 0.5 0.5 0.5 0.5 0.5 
##$TPOFFS= (0..7)
0 0 0 0 0 0 0 0 
##$TUNHIN= 0
##$TUNHOUT= 0
##$TUNXOUT= 0
##$USERA1= <user>
##$USERA2= <user>
##$USERA3= <user>
##$USERA4= <user>
##$USERA5= <user>
##$V9= 5
##$VALIST= <valist>
##$VCLIST= <CCCCCCCCCCCCCCC>
##$VD= 0
##$VDLIST= <DDDDDDDDDDDDDDD>
##$VPLIST= <PPPPPPPPPPPPPPP>
##$VTLIST= <TTTTTTTTTTTTTTT>
##$WBST= 1024
##$WBSW= 4
##$XGAIN= (0..3)
0 0 0 0 
##$XL= 0
##$YL= 0
##$YMAX_a= 330725
##$YMIN_a= -512872
##$ZGOPTNS= <>
##$ZL1= 120
##$ZL2= 120
##$ZL3= 120
##$ZL4= 120
##$ABSF1= 16.51088
##$ABSF2= -4.182293
##$ABSG= 5
##$ABSL= 3
##$ALPHA= 0
##$AQORDER= 0
##$ASSFAC= 0
##$ASSFACI= 0
##$ASSFACX= 0
##$ASSWID= 0
##$AUNMP= <proc_1d>
##$AZFE= 0.1
##$AZFW= 0.1
##$BCFW= 0
##$BC_mod= 0
##$BYTORDP= 0
##$COROFFS= 0
##$CY= 12.5
##$DATMOD= 1
##$DC= 0
##$DFILT= <>
##$DTYPP= 0
##$F1P= 14.0000005364418
##$F2P= -0.99999901652339
##$FCOR= 0.5
##$FTSIZE= 32768
##$FT_mod= 6
##$GAMMA= 0
##$GB= 0
##$INTBC= 1
##$INTSCL= 1
##$ISEN= 128
##$LB= 0.3
##$LEV0= 0
##$LPBIN= 0
##$MAXI= 10000
##$MC2= 0
##$MEAN= 0
##$ME_mod= 0
##$MI= 0
##$NCOEF= 0
##$NC_proc= -2
##$NLEV= 6
##$NOISF1= 0
##$NOISF2= 0
##$NSP= 0
##$NTH_PI= 0
##$NZP= 0
##$OFFSET= 16.51088
##$PC= 1
##$PHC0= 143.8798
##$PHC1= 7.686539
##$PH_mod= 1
##$PKNL= yes
##$PPARMOD= 0
##$PSCAL= 4
##$PSIGN= 0
##$REVERSE= no
##$SF= 250.130002780357
##$SI= 32768
##$SIGF1= 0
##$SIGF2= 0
##$SINO= 400
##$SIOLD= 32768
##$SREGLST= <1H.DMSO>
##$SSB= 0
##$STSI= 32768
##$STSR= 0
##$SW_p= 5175.98343685301
##$SYMM= 0
##$S_DEV= 0
##$TDeff= 65536
##$TDoff= 0
##$TI= <Analysis number 999999
Compound Code 99
Book Reference 9
Project Code 9>
##$TILT= no
##$TM1= 0
##$TM2= 0
##$TOPLEV= 0
##$USERP1= <user>
##$USERP2= <user>
##$USERP3= <user>
##$USERP4= <user>
##$USERP5= <user>
##$WDW= 1
##$XDIM= 32768
##$YMAX_p= 299937412
##$YMIN_p= -118727
$$ End of Bruker specific parameters
$$ ---------------------------------
##NTUPLES= NMR SPECTRUM
##VAR_NAME=  FREQUENCY,     SPECTRUM/REAL,   SPECTRUM/IMAG
##SYMBOL=    X,             R,               I
##VAR_TYPE=  INDEPENDENT,   DEPENDENT,       DEPENDENT
##VAR_FORM=  AFFN,          ASDF,            ASDF
##VAR_DIM=   32768,         32768,           32768
##UNITS=     HZ,            ARBITRARY UNITS, ARBITRARY UNITS
##FACTOR=    0.157963299565203, 1,           1
##FIRST=     4129.86633939369, 0,            0
##LAST=      -1046.11709745932, 0,           0
##MIN=       -1046.11709745932, -118727,     0
##MAX=       4129.86633939369, 299937412,    0
$$ Real data points
##PAGE= N=1
##DATA TABLE= (X++(R..R)), XYDATA
$$ [...]
##PAGE= N=2
##DATA TABLE= (X++(I..I)), XYDATA
$$ plain form
18072 9779603 10327808 10909991 11522152 12185471 12877384 13543287 14157023 14823220 15680538
18063 15680538 16828922 18234189 19898881 21818499 23730340 24832404 23565223 19044197
18055 19044197 12501611 6830159 4436987 5307478 8002853 11318897 14860127 18510799
18047 18510799 21844641 23632165 21467780 13598737 2107594 -8440885 -15015577 -17225883
18039 -17225883 -16321907 -13899218 -11175854 -8662960 -6417526 -4365920 -2415404 -515302
18031 -515302 1371635 3342018 5491498 7893354 10605393 13647527 16895709 19771549
18023 19771549 20733097 17216897 7822543 -4999980 -16198029 -22221123 -23130694 -21140134
18015 -21140134 -18252566 -15435577 -12918881 -10661072 -8608847 -6715876 -4915086 -3153049
$$ packed form
18072I779603N48205N82183O12161O63319O91913O65903O13736O66197Q57318
18063A5680538J148384J405267J664692J919618J911841J102064j267181m521026
18055A9044197o542586n671452k393172Q70491K695375L316044L541230L650672
18047A8510799L333842J787524k164385p869043j1491143j0548479o574692k210306
18039a7225883R03976K422689K723364K512894K245434K051606J950516J900102
18031e15302J886937J970383K149480K401856K712039L042134L248182K875840
18023A9771549R61548l516200r394354j2822523j1198049o023094r09571J990560
18015b1140134K887568K816989K516696K257809K052225J892971J800790J762037
$$ plain form
18007 -3153049 -1345869 551606 2631869 4970714 7595365 10381493 12755036 13273792
17999 13273792 10128283 3267262 -5148435 -12744513 -18294053 -20931451 -20494578 -17915322
17991 -17915322 -14563628 -11342547 -8958139 -8721080 -12128941 -18347711 -23841437 -25969591
17983 -25969591 -25196117 -23327378 -21436852 -19795516 -18434640 -17316895 -16403183 -15645243
17975 -15645243 -15013962 -14445676 -13889770 -13346858 -12830947 -12333280 -11860292 -11400535 -10959599
17966 -10959599 -10503472 -10041506 -9623326 -9217410 -8804699 -8347954 -7840827 -7271241 -6662868
17957 -6662868 -6073064 -5647436 -5815472 -7095741 -9123363 -10719074 -11198775 -10854723 -10268831
17948 -10268831 -9685581 -9168877 -8672176 -8214462 -7874751 -7828374 -8232060 -8922870 -9440162
$$ packed form
18007c153049J807180J897475K080263K338845K624651K786128K373543N18756
17999A3273792l145509o861021q415697p596078n549540k637398M36873K579256
17991a7915322L351694L221081K384408K37059l407861o218770n493726k128154
17983b5969591P73474J868739J890526J641336J360876J117745R13712P57940
17975a5645243O31281N68286N55906N42912N15911M97667M72988M59757M40936
17966a0959599M56127M61966M18180M05916M12711M56745N07127N69586O08373
17957f662868N89804M25628j68036j280269k027622j595711m79701L44052N85892
17948a0268831N83250N16704M96701M57714L39711M6377m03686o90810n17292
$$ plain form
17939 -9440162 -9520820 -9300761 -9005490 -8713608 -8453975 -8219793 -8010407 -7828348 -7660568 -7516180
17929 -7516180 -7384505 -7269744 -7155868 -7051753 -6943964 -6840188 -6746794 -6646446 -6544697 -6455045
17919 -6455045 -6372718 -6292561 -6223318 -6154712 -6078630 -6007524 -5970591 -5911273 -5842122 -5770268 -5712303
17908 -5712303 -5658532 -5597811 -5541259 -5486149 -5426246 -5374321 -5327345 -5274089 -5227082 -5186164 -5151526
17897 -5151526 -5108976 -5055816 -4997882 -4951478 -4917387 -4870790 -4833679 -4806175 -4774975 -4750045 -4725469
17886 -4725469 -4684053 -4629269 -4581802 -4539274 -4504826 -4486872 -4449793 -4411232 -4384336 -4335904 -4298594
17875 -4298594 -4265249 -4240265 -4208530 -4171458 -4152629 -4127729 -4110673 -4099197 -4068596 -4045304 -4026957
17864 -4026957 -4008626 -3995417 -3975833 -3945805 -3909215 -3877050 -3835663 -3796457 -3782608 -3771810 -3749626
$$ packed form
17939i440162q0658K20059K95271K91882K59633K34182K09386J82059J67780J44388
17929g516180J31675J14761J13876J04115J07789J03776R3394J00348J01749Q9652
17919f455045Q2327Q0157O9243O8606P6082P1106L6933N9318O9151P1854N7965
17908e712303N3771O0721N6552N5110N9903N1925M6976N3256M7007M0918L4638
17897e151526M2550N3160N7934M6404L4091M6597L7111K7504L1200K4930K4576
17886d725469M1416N4784M7467M2528L4448J7954L7079L8561K6896M8432L7310
17875d298594L3345K4984L1735L7072J8829K4900J7056J1476L0601K3292J8347
17864d026957J8331J3209J9584L0028L6590L2165M1387L9206J3849J0798K2184
$$ plain form
17853 -3749626 -3722287 -3701587 -3679246 -3649155 -3624934 -3607893 -3578433 -3557456 -3548310 -3542193 -3533670 -3526662
17841 -3526662 -3512037 -3488100 -3461241 -3431934 -3408206 -3383635 -3376839 -3364200 -3339429 -3321386 -3302947
17830 -3302947 -3288856 -3290765 -3269574 -3246682 -3226158 -3195466 -3176688 -3162672 -3153728 -3142465 -3126802 -3117879
17818 -3117879 -3111179 -3102929 -3093226 -3076990 -3049588 -3024230 -3004474 -2986836 -2976460 -2956665 -2937108 -2925636
17806 -2925636 -2902873 -2892669 -2888988 -2886003 -2881071 -2861541 -2850914 -2832910 -2810229 -2803929 -2801019 -2794792
17794 -2794792 -2781308 -2770278 -2760358 -2736166 -2722111 -2728486 -2717832 -2696417 -2684671 -2674490 -2654045 -2646393
17782 -2646393 -2655067 -2648572 -2637698 -2620722 -2608612 -2596967 -2578340 -2561303 -2548897 -2542171 -2544795 -2539236
17770 -2539236 -2531857 -2525874 -2523098 -2500246 -2495777 -2494096 -2490488 -2485107 -2474029 -2462376 -2460124 -2443618 -2424369
$$ packed form
17853c749626K7339K0700K2341L0091K4221J7041K9460K0977R146O117Q523P008
17841c526662J4625K3937K6859K9307K3728K4571O796J2639K4771J8043J8439
17830c302947J4091j909K1191K2892K0524L0692J8778J4016Q944J1263J5663Q923
17818c117879O700Q250R703J6236K7402K5358J9756J7638J0376J9795J9557J1472
17806b925636K2763J0204L681K985M932J9530J0627J8004K2681O300K910O227
17794b794792J3484J1030R920K4192J4055o375J0654K1415J1746J0181K0445P652
17782b646393q674O495J0874J6976J2110J1645J8627J7037J2406O726k624N559
17770b539236P379N983K776K2852M469J681L608N381J1078J1653K252J6506J9249
$$ plain form
17757 -2424369 -2413239 -2398906 -2386241 -2381982 -2368673 -2362061 -2358432 -2346370 -2336747 -2339655 -2333582 -2323732 -2318346
17744 -2318346 -2307787 -2299511 -2284126 -2276375 -2268464 -2266414 -2264066 -2249688 -2249522 -2237579 -2228626 -2233857 -2235348
17731 -2235348 -2232421 -2215865 -2212182 -2210567 -2194045 -2188997 -2181828 -2166160 -2149339 -2140891 -2131643 -2127992 -2126960
17718 -2126960 -2128702 -2124971 -2109883 -2099395 -2094045 -2094911 -2101906 -2094590 -2078570 -2081425 -2073504 -2051258 -2053116
17705 -2053116 -2051363 -2043140 -2029810 -2023854 -2013621 -2013224 -2014810 -2004840 -1986339 -1993104 -1998911 -1987397 -1979140
17692 -1979140 -1982146 -1977187 -1965195 -1961954 -1964444 -1967024 -1945355 -1937983 -1917542 -1905269 -1912568 -1917696 -1902472
17679 -1902472 -1895493 -1890101 -1891834 -1882497 -1866538 -1863233 -1860863 -1860309 -1854989 -1852392 -1846770 -1840664 -1842051 -1832742
17665 -1832742 -1815045 -1811120 -1815535 -1818377 -1819093 -1812049 -1806618 -1813761 -1807528 -1782920 -1777416 -1770609 -1779469 -1782280
$$ packed form
17757b424369J1130J4333J2665M259J3309O612L629J2062R623k908O073R850N386
17744b318346J0559Q276J5385P751P911K050K348J4378J66J1943Q953n231j491
17731b235348K927J6556L683J615J6522N048P169J5668J6821Q448R248L651J032
17718b126960j742L731J5088J0488N350q66o995P316J6020k855P921K2246j858
17705b053116J753Q223J3330N956J0233L97j586R970J8501o765n807J1514Q257
17692a979140l006M959J1992L241k490k580K1669P372K0441J2273p299n128J5224
17679a902472O979N392j733R337J5959L305K370N54N320K597N622O106j387R309
17665a832742J7697L925m415k842p16P044N431p143O233K4608N504O807q860k811
$$ plain form
17651 -1782280 -1773386 -1756912 -1744456 -1737850 -1737439 -1742461 -1732992 -1722328 -1722902 -1715356 -1717782 -1708162 -1686960
17638 -1686960 -1676378 -1675923 -1679696 -1671286 -1662946 -1646609 -1649280 -1665784 -1658836 -1664649 -1671445 -1668280 -1666509
17625 -1666509 -1639657 -1617384 -1614385 -1622226 -1627148 -1633452 -1637019 -1625633 -1628948 -1619975 -1604594 -1605541 -1605601 -1600703
17611 -1600703 -1595305 -1596811 -1594185 -1587010 -1576712 -1561872 -1547165 -1541466 -1531823 -1538051 -1532233 -1516979 -1509292
17598 -1509292 -1510834 -1514645 -1522510 -1508511 -1491204 -1487525 -1492720 -1492157 -1499440 -1493716 -1476529 -1470890 -1471495 -1459353
17584 -1459353 -1444735 -1432658 -1432934 -1437725 -1437226 -1443926 -1446605 -1448146 -1449593 -1465414 -1473497 -1481957 -1479565 -1466868
17570 -1466868 -1458945 -1449197 -1445438 -1445609 -1440431 -1441856 -1432808 -1422609 -1424878 -1423775 -1413768 -1406182 -1396453 -1376238
17556 -1376238 -1370681 -1360580 -1350046 -1352215 -1347386 -1344823 -1343563 -1346238 -1355372 -1364981 -1372003 -1356134 -1350301
$$ packed form
17651a782280Q894J6474J2456O606M11n022R469J0664n74P546k426R620K1202
17638a686960J0582M55l773Q410Q340J6337k671j6504O948n813o796L165J771
17625a666509K6852K2273K999p841m922o304l567J1386l315Q973J5381r47o0M898
17611a600703N398j506K626P175J0298J4840J4707N699R643o228N818J5254P687
17598a509292j542l811p865J3999J7307L679n195N63p283N724J7187N639o05J2142
17584a459353J4618J2077k76m791M99o700k679j541j447j5821q083q460K392J2697
17570a466868P923R748L759j71N178j425R048J0199k269J103J0007P586R729K0215
17556a376238N557J0101J0534k169M829K563J260k675r134r609p022J5869N833
$$ plain form
17543 -1350301 -1362938 -1370925 -1372772 -1362648 -1350924 -1341973 -1337597 -1348633 -1355806 -1356606 -1345643 -1352140 -1348416
17530 -1348416 -1338554 -1355101 -1376295 -1380328 -1376797 -1378674 -1373631 -1367845 -1379234 -1375312 -1373778 -1376577 -1374485
17517 -1374485 -1368152 -1367134 -1357420 -1341723 -1326578 -1313497 -1289535 -1281272 -1274420 -1263022 -1267884 -1267254 -1269541
17504 -1269541 -1281024 -1273154 -1266058 -1274650 -1284513 -1301746 -1323939 -1344663 -1346601 -1346164 -1326987 -1316540 -1317108
17491 -1317108 -1320874 -1317166 -1306653 -1292116 -1278709 -1274640 -1276194 -1295979 -1310253 -1296632 -1288239 -1284855
17479 -1284855 -1296665 -1306878 -1313343 -1310288 -1321317 -1316484 -1312533 -1298535 -1289137 -1271682 -1258671 -1257835 -1268190
17466 -1268190 -1256965 -1249215 -1245673 -1229322 -1219824 -1218178 -1215981 -1214798 -1220618 -1204551 -1185591 -1201259 -1214554
17453 -1214554 -1219079 -1220115 -1216991 -1213505 -1211877 -1222233 -1228989 -1221511 -1224816 -1227510 -1228531 -1238136 -1234693 -1221991
$$ packed form
17543a350301j2637p987j847J0124J1724Q951M376j1036p173q00J0963o497L724
17530a348416R862j6547k1194m033L531j877N043N786j1389L922J534k799K092
17517a374485O333J018R714J5697J5145J3081K3962Q263O852J1398m862O30k287
17504a269541j1483P870P096q592r863j7233k2193k0724j938M37J9177J0447n68
17491a317108l766L708J0513J4537J3407M069j554j9785j4274J3621Q393L384
17479a284855j1810j0213o465L055j1029M833L951J3998R398J7455J3011Q36j0355
17466a268190J1225P750L542J6351R498J646K197J183n820J6067J8960j5668j3295
17453a214554m525j036L124L486J628j0356o756P478l305k694j021r605L443J2702
$$ plain form
17439 -1221991 -1225941 -1217925 -1205433 -1198773 -1201991 -1186767 -1168459 -1169408 -1165227 -1165295 -1157121 -1149891 -1168671 -1184813
17425 -1184813 -1177271 -1149616 -1127377 -1121331 -1131304 -1131151 -1136542 -1134970 -1128723 -1120166 -1113542 -1098928 -1093941
17412 -1093941 -1103962 -1120711 -1128494 -1129683 -1112280 -1090321 -1092868 -1104392 -1115381 -1103149 -1099356 -1111844
17400 -1111844 -1101541 -1087303 -1079711 -1087086 -1092449 -1091126 -1097469 -1101676 -1099964 -1106802 -1100486 -1082398 -1076140
17387 -1076140 -1069763 -1045269 -1042596 -1062398 -1092521 -1098964 -1086080 -1075468 -1077941 -1066582 -1054065 -1052326
17375 -1052326 -1064793 -1070206 -1055381 -1045218 -1047908 -1059339 -1047535 -1034236 -1028484 -1020070 -1015950 -1026738
17363 -1026738 -1009948 -1001538 -1010145 -1010436 -1011888 -1012283 -1013663 -1025009 -1019634 -1021892 -1014492 -1007517 -1002314 -1020001
17349 -1020001 -1025589 -1025684 -1012519 -999751 -999109 -1001372 -1000132 -997571 -989497 -994579 -990911 -980960 -974545 -968766
$$ packed form
17439a221991l950Q016J2492O660l218J5224J8308r49M181o8Q174P230j8780j6142
17425a184813P542K7655K2239O046r973J53n391J572O247Q557O624J4614M987
17412a093941j0021j6749p783j189J7403K1959k547j1524j0989J2232L793j2488
17400a111844J0303J4238P592p375n363J323o343m207J712o838O316J8088O258
17387a076140O377K4494K673j9802l0123o443J2884J0612k473J1359J2517J739
17375a052326j2467n413J4825J0163k690j1431J1804J3299N752Q414M120j0788
17363a026738J6790Q410q607k91j452l95j380j1346N375k258P400O975N203j7687
17349a020001n588r5J3165J2768O42k263J240K561Q074n082L668R951O415N779
$$ plain form
17335 -968766 -977729 -979585 -976219 -976620 -970039 -968916 -970350 -957224 -967520 -970870 -980565 -986031 -970973 -969368
17321 -969368 -967401 -949846 -956418 -950460 -958976 -968095 -964492 -945571 -945359 -946174 -954534 -949368 -939054 -938607
17307 -938607 -943835 -948460 -944502 -937492 -917306 -916307 -922392 -934380 -932643 -917156 -907496 -905006 -913482 -916996
17293 -916996 -917476 -909516 -918939 -927873 -924001 -914047 -906011 -900605 -907347 -910715 -907373 -911052 -910410 -904864 -893659
17278 -893659 -888450 -878400 -886611 -908506 -911193 -900396 -894394 -896326 -897983 -903634 -906384 -907837 -899368
17265 -899368 -895070 -889045 -881466 -875427 -876087 -874406 -881953 -884704 -885173 -882842 -883339 -884760 -883982 -881922 -868937
17250 -868937 -877139 -887302 -875865 -861674 -858806 -860914 -856404 -851791 -853802 -860188 -862854 -863294 -867002 -867436
17236 -867436 -862105 -857710 -859220 -854357 -838721 -834110 -835312 -838065 -843055 -847456 -847058 -844093 -841814 -826952
$$ packed form
17335i68766q963j856L366m01O581J123j434J3126j0296l350r695n466J5058J605
17321i69368J967J7555o572N958q516r119L603J8921K12q15q360N166J0314M47
17307i38607n228m625L958P010K0186R99o085j1988J737J5487R660K490q476l514
17293i16996m80P960r423q934L872R954Q036N406o742l368L342l679O42N546J1205
17278h93659N209J0050q211k1895k687J0797O002j932j657n651k750j453Q469
17265h99368M298O025P579O039o60J681p547k751m69K331m97j421P78K060J2985
17250h68937q202j0163J1437J4191K868k108M510M613k011o386k666m40l708m34
17236h67436N331M395j510M863J5636M611j202k753m990m401L98K965K279J4862
$$ plain form
17222 -826952 -829793 -834451 -842270 -845284 -847654 -829584 -814609 -813106 -809933 -811594 -808389 -810295 -805715 -798049
17208 -798049 -794024 -783761 -765579 -767562 -780800 -781247 -799239 -801046 -808942 -803750 -813744 -817606 -814769
17195 -814769 -800348 -784872 -795495 -787789 -776964 -775825 -776843 -767991 -773569 -774656 -780813 -785547 -793560
17182 -793560 -802834 -813633 -815085 -794127 -777227 -771386 -765041 -767373 -788365 -783741 -785927 -777078 -771580
17169 -771580 -763026 -764917 -763286 -765869 -765094 -757917 -751416 -736719 -738170 -751071 -749248 -746517 -748189 -749130
17155 -749130 -753451 -758703 -775098 -768083 -758760 -741216 -732931 -729872 -728037 -727950 -721144 -729624 -729165 -731925
17141 -731925 -720224 -722478 -730349 -729064 -718299 -714310 -719410 -718657 -715951 -719053 -727934 -744411 -743780 -741892
17127 -741892 -727189 -706987 -707477 -708528 -709859 -711455 -712280 -714415 -726576 -729235 -737730 -736998 -723139 -716950
$$ packed form
17222h26952k841m658p819l014k370J8070J4975J503L173j661L205j906M580P666
17208g98049M025J0263J8182j983j3238m47j7992j807p896N192r994l862K837
17195h14769J4421J5476j0623P706J0825J139j018Q852n578j087o157m734q013
17182g93560r274j0799j452K0958J6900N841O345k332k0992M624k186Q849N498
17169g71580Q554j891J631k583P75P177O501J4697j451j2901J823K731j672r41
17155g49130m321n252j6395P015R323J7544Q285L059J835Q7O806q480M59k760
17141g31925J1701k254p871J285J0765L989n100P53K706l102q881j6477O31J888
17127g41892J4703K0202m90j051j331j596q25k135j2161k659q495P32J3859O189
$$ plain form
17113 -716950 -730122 -743433 -727363 -718959 -711869 -723564 -724556 -713721 -712658 -714737 -716322 -716276 -714287 -708012
17099 -708012 -698224 -695636 -695711 -688079 -687517 -685309 -696627 -689114 -698849 -706146 -696682 -688636 -678142 -672552
17085 -672552 -677046 -686055 -698924 -704654 -679453 -669649 -665847 -675486 -676598 -674948 -662693 -658597 -669707
17072 -669707 -677117 -671478 -664831 -657242 -651449 -648328 -650353 -654807 -660883 -659530 -647621 -642854 -649658 -644150
17058 -644150 -646095 -647909 -638578 -632668 -640187 -653003 -648627 -647401 -655560 -649973 -650225 -636382 -627332 -635115
17044 -635115 -631791 -644159 -651830 -646029 -636051 -628287 -630948 -632818 -619860 -619232 -616162 -628438 -643999
17031 -643999 -651381 -645799 -643572 -651513 -645638 -633341 -621231 -620287 -628803 -637027 -628589 -625928 -623496 -619603
17017 -619603 -612347 -610034 -611270 -617670 -619919 -620575 -618102 -620886 -629463 -627703 -616443 -614871 -614438 -610390
$$ packed form
17113g16950j3172j3311J6070Q404P090j1695r92J0835J063k079j585M6J989O275
17099g08012R788K588p5P632N62K208j1318P513r735p297R464Q046J0494N590
17085f72552m494r009j2869n730K5201R804L802r639j112J650J2255M096j1110
17072f69707p410N639O647P589N793L121k025m454o076J353J1909M767o804N508
17058f44150j945j814R331N910p519j2816M376J226q159N587k52J3843R050p783
17044f35115L324j2368p671N801R978P764k661j870J2958O28L070j2276j5561
17031f43999p382N582K227p941N875J2297J2110R44q516q224Q438K661K432L893
17017f19603P256K313j236o400k249o56K473k784q577J760J1260J572M33M048
$$ plain form
17003 -610390 -619185 -619057 -617042 -601503 -604375 -612191 -626017 -647610 -642062 -622846 -601545 -604713 -617129
16990 -617129 -614157 -609893 -616529 -627811 -629632 -612282 -594368 -597433 -598067 -597210 -601419 -601627 -596842 -598273
16976 -598273 -609458 -611672 -607427 -596031 -583333 -575485 -572048 -570020 -576240 -590254 -590609 -588103 -585946
16963 -585946 -596370 -597513 -589904 -584547 -580964 -576803 -589278 -601161 -594653 -588336 -587494 -583508 -587246 -582398
16949 -582398 -572084 -561315 -564515 -567094 -577048 -574914 -579737 -579898 -569058 -574552 -580670 -565217 -561904
16936 -561904 -556081 -550347 -550514 -554799 -552982 -551023 -563407 -556620 -547772 -522724 -523804 -539709 -545711 -546822
16922 -546822 -544426 -543729 -547541 -564261 -559212 -563995 -563470 -550811 -548302 -558090 -557890 -548037 -549046 -549218 -552614
16907 -552614 -550670 -552608 -554821 -554598 -553395 -533832 -524771 -516942 -522995 -525910 -537318 -538826 -535266 -542531
$$ packed form
17003f10390q795J28K015J5539k872p816j3826k1593N548J9216K1301l168j2416
16990f17129K972M264o636j1282j821J7350J7914l065o34Q57m209k08M785j431
16976e98273j1185k214M245J1396J2698P848L437K028o220j4014l55K506K157
16963e85946j0424j143P609N357L583M161j2475j1883O508O317Q42L986l738M848
16949e82398J0314J0769l200k579r954K134m823j61J0840n494o118J5453L313
16936e61904N823N734j67m285J817J959j2384O787Q848K5048j080j5905o002j111
16922e46822K396O97l812j6720N049m783N25J2659K509r788K00R853j009j72l396
16907e52614J944j938k213K23J203J9563R061P829o053k915j1408j508L560p265
$$ plain form
16893 -542531 -547706 -541631 -530951 -530852 -533591 -528155 -527039 -521488 -527826 -519764 -519050 -519910 -528412 -530148 -533266
16878 -533266 -536697 -528355 -517778 -531444 -541726 -549028 -537658 -536098 -538731 -543555 -550794 -539592 -518643
16865 -518643 -515355 -515859 -523326 -522704 -518791 -522666 -527030 -517695 -508367 -503196 -501947 -508088 -522823 -517943
16851 -517943 -507534 -499333 -496725 -498817 -504811 -506095 -506943 -505364 -509965 -511186 -514488 -514238 -504532 -501348
16837 -501348 -507959 -494175 -497121 -509950 -505659 -498059 -509007 -505014 -500977 -499920 -493996 -487478 -497791
16824 -497791 -509279 -520999 -514209 -507757 -515473 -516457 -497119 -488026 -486214 -478095 -474074 -464847 -470639 -474436
16810 -474436 -474711 -479741 -468524 -472296 -486018 -483649 -485479 -481031 -476669 -479129 -492390 -501288 -487256
16797 -487256 -465972 -458016 -464351 -463203 -466462 -480777 -488688 -491191 -470513 -463331 -457925 -456757 -458779
$$ packed form
16893e42531n175O075J0680R9k739N436J116N551o338Q062P14q60q502j736l118
16878e33266l431Q342J0577j3666j0282p302J1370J560k633m824p239J1202K0949
16865e18643L288n04p467O22L913l875m364R335R328N171J249o141j4735M880
16851e17943J0409Q201K608k092n994j284q48J579m601j221l302K50R706L184
16837e01348o611J3784k946j2829M291P600j0948L993M037J057N924O518j0313
16824d97791j1488j1720O790O452p716r84J9338R093J812Q119M021R227n792l797
16810d74436k75n030J1217l772j3722K369j830M448M362k460j3261q898J4032
16797d87256K1284P956o335J148l259j4315p911k503K0678P182N406J168k022
$$ plain form
16784 -458779 -473159 -483381 -486369 -481622 -463486 -455817 -452401 -457493 -458300 -476458 -482577 -467278 -463801
16771 -463801 -465260 -465077 -469934 -479521 -482884 -479986 -475988 -470127 -471887 -475662 -472708 -473496 -472142 -467964 -458353
16756 -458353 -446188 -443501 -450905 -455190 -460698 -449123 -443891 -443574 -443500 -443915 -452629 -456105 -463986 -459004 -451594
16741 -451594 -443727 -436914 -443096 -447741 -430300 -424425 -430815 -438666 -442906 -431633 -431933 -442359 -431170
16728 -431170 -425283 -427621 -427251 -436742 -433673 -431284 -427432 -427103 -427847 -421957 -408320 -408631 -418298 -413497 -407733
16713 -407733 -407712 -418629 -423425 -428740 -427086 -427998 -428610 -427413 -421171 -435879 -432787 -419737 -417990 -420297
16699 -420297 -423531 -418634 -410774 -421945 -419730 -416891 -410241 -404324 -413983 -414341 -405050 -398246 -404891 -402217
16685 -402217 -403484 -419871 -410575 -399356 -409000 -401734 -399391 -402647 -400385 -400260 -395270 -399259 -399526 -405685
$$ packed form
16784d58779j4380j0222k988M747J8136P669L416n092q07j8158o119J5299L477
16771d63801j459J83m857r587l363K898L998N861j760l775K954p88J354M178R611
16756d58353J2165K687p404m285n508J1575N232L17P4m15q714l476p881M982P410
16741d51594P867O813o182m645J7441N875o390p851m240J1273l00j0426J1189
16728d31170N887k338L70r491L069K389L852L29p44N890J3637l11r667M801N764
16713d07733K1j0917m796n315J654r12o12J197O242j4708L092J3050J747k307
16699d20297l234M897P860j1171K215K839O650N917r659l58R291O804o645K674
16685d02217j267j6387R296J1219r644P266K343l256K262J25M990l989k67o159
$$ plain form
16671 -405685 -401252 -411683 -418480 -410070 -406907 -412185 -410229 -412074 -401727 -404830 -404659 -393883 -389644 -387969
16657 -387969 -381241 -387165 -388740 -390489 -395776 -393742 -396272 -400213 -391300 -378407 -379100 -381650 -391765 -393431
16643 -393431 -383909 -379558 -383210 -387564 -388131 -398177 -390396 -385588 -391156 -402721 -390982 -388446 -393030 -388935
16629 -388935 -393751 -397964 -387192 -388097 -386521 -378699 -375838 -371095 -377077 -375738 -379204 -379840 -373000 -365233
16615 -365233 -354938 -359822 -382485 -380985 -379287 -384835 -383095 -386051 -385054 -379204 -366785 -354213 -341895
16602 -341895 -349195 -346961 -346031 -349590 -349498 -368234 -373962 -366032 -361234 -366599 -382240 -381093 -376839 -372361
16588 -372361 -380818 -370922 -358236 -371791 -385678 -388179 -386556 -375384 -350805 -337499 -325584 -329662
16576 -329662 -336586 -343899 -353654 -363620 -369361 -371537 -363120 -353082 -336561 -341931 -356325 -355298 -342783
$$ packed form
16671d05685M433j0431o797Q410L163n278J956j845J0347l103J71J0776M239J675
16657c87969O728n924j575j749n287K034k530l941Q913J2893o93k550j0115j666
16643c93431R522M351l652m354n67j0046P781M808n568j1565J1739K536m584M095
16629c88935m816m213J0772r05J576P822K861M743n982J339l466o36O840P767
16615c65233J0295m884k2663J500J698n548J740k956R97N850J2419J2572J2318
16602c41895p300K234R30l559R2j8736n728P930M798n365j5641J147M254M478
16588c72361q457R896J2686j3555j3887k501J623J1172K4579J3306J1915m078
16576c29662o924p313r755r966n741k176Q417J0038J6521n370j4394J027J2515
$$ plain form
16563 -342783 -342211 -352769 -350045 -358976 -368744 -355898 -350420 -372032 -380932 -358091 -326982 -338740 -356864
16550 -356864 -352719 -353137 -360906 -366363 -351650 -337281 -329968 -338060 -338285 -334197 -332925 -326664 -322711 -329424
16536 -329424 -327712 -336949 -336624 -342008 -346628 -339118 -314747 -322130 -319987 -308979 -303110 -298785 -307857 -316167
16522 -316167 -323106 -325777 -338228 -340111 -325074 -327286 -329298 -325632 -328536 -328461 -330261 -337109 -327989 -321392
16508 -321392 -335514 -334692 -333186 -333590 -320354 -304833 -297463 -301130 -311055 -300273 -310424 -320741 -321042
16495 -321042 -321352 -316947 -312329 -318122 -319843 -311564 -308749 -309118 -301878 -292630 -303561 -305028 -302143 -308723
16481 -308723 -318138 -315522 -307569 -301688 -312403 -313817 -317362 -312984 -310279 -306810 -309158 -309040 -313514 -300839
16467 -300839 -294652 -292634 -298169 -307635 -310477 -308728 -316525 -328957 -316254 -308913 -323726 -327604 -310572
$$ packed form
16563c42783N72j0558K724q931r768J2846N478k1612q900K2841L1109j1758j8124
16550c56864M145m18p769n457J4713J4369P313q092k25M088J272O261L953o713
16536c29424J712r237L25n384m620P510K4371p383K143J1008N869M325r072q310
16522c16167o939k671j2451j883J5037k212k012L666k904P5j800o848R120O597
16508c21392j4122Q22J506m04J3236J5521P370l667r925J0782j0151j0317l01
16495c21042l10M405M618n793j721Q279K815l69P240R248j0931j467K885o580
16481c08723r415K616P953N881j0715j414l545M378K705L469k348J18m474J2675
16467c00839O187K018n535r466k842J749p797j2432J2703P341j4813l878J7032
$$ plain form
16454 -310572 -302568 -309282 -308455 -319583 -306494 -298277 -300865 -292050 -282049 -292080 -293128 -284856 -280554
16441 -280554 -268201 -283009 -298957 -297914 -303276 -305958 -300266 -295567 -289850 -298971 -301356 -306413 -313203
16428 -313203 -300571 -288398 -288887 -286908 -288101 -284595 -290435 -290405 -288576 -282641 -276538 -278424 -294256 -307916
16414 -307916 -292630 -293329 -291562 -283593 -283637 -279827 -276308 -279107 -280990 -282573 -277526 -276026 -275084 -272111 -291284
16399 -291284 -297586 -287490 -277713 -285479 -289918 -295447 -295715 -284676 -271075 -277813 -273193 -270373 -267671 -264484
16385 -264484 -266976 -275072 -276416 -273784 -269791 -283884 -287555 -275610 -277810 -276029 -268342 -273482 -278841 -274590
16371 -274590 -267370 -265713 -270372 -267688 -265589 -267502 -263569 -258832 -254075 -258735 -262135 -270928 -272056 -276651
16357 -276651 -282702 -268016 -251249 -250931 -260874 -268891 -268588 -272443 -260670 -262096 -269809 -268393 -254005 -255669
$$ packed form
16454c10572Q004o714Q27j1128J3089Q217k588Q815J0001j0031j048Q272M302
16441b80554J2353j4808j5948J043n362k682N692M699N717r121k385n057o790
16428c13203J2632J2173m89J979j193L506n840L0J829N935O103j886j5832j3660
16414c07916J5286o99J767P969m4L810L519k799j883j583N047J500R42K973j9173
16399b91284o302J0096R777p766m439n529k68J1039J3601o738M620K820K702L187
16385b64484k492q096j344K632L993j4093l671J1945k200J781P687n140n359M251
16371b74590P220J657m659K684K099j913L933M737M757m660l400q793j128m595
16357b76651o051J4686J6767L18r943q017L03l855J1773j426p713J416J4388j664
$$ plain form
16343 -255669 -268615 -265889 -262864 -258119 -253308 -248819 -252885 -250700 -242803 -250329 -242577 -241822 -243586 -240337
16329 -240337 -245709 -251376 -259836 -264125 -267524 -264531 -260983 -248028 -236827 -237699 -238581 -239528 -235322 -224115
16315 -224115 -216584 -226435 -234100 -241541 -240006 -232164 -238735 -238945 -233659 -233078 -236877 -241749 -237820 -232552 -233927
16300 -233927 -233920 -238404 -237272 -239657 -242079 -245670 -255213 -255583 -233830 -236149 -242119 -234051 -248072 -261426
16286 -261426 -268904 -261428 -245939 -229151 -241828 -264272 -256601 -237282 -231923 -231092 -227405 -230606 -230867
16273 -230867 -238337 -238341 -233134 -244256 -248134 -239468 -232955 -231141 -227581 -233000 -241639 -230729 -206073 -196105
16259 -196105 -212000 -231263 -238840 -230909 -226107 -229201 -231204 -224665 -206142 -190751 -197120 -225312 -241842
16246 -241842 -241505 -240090 -236967 -227384 -217086 -214018 -209364 -209042 -210032 -204949 -197821 -201755 -196826 -198516 -209445
$$ packed form
16343b55669j2946K726L025M745M811M489m066K185P897p526P752P55j764L249
16329b40337n372n667q460m289l399K993L548J2955J1201q72q82r47M206J1207
16315b24115P531r851p665p441J535P842o571k10N286N81l799m872L929N268j375
16300b33927Pm484J132k385k422l591r543l70K1753k319n970Q068j4021j3354
16286b61426p478P476J5489J6788j2677k2444P671J9319N359Q31L687l201k61
16273b30867p470mN207j1122l878Q666O513J814L560n419q639J0910K4656R968
16259a96105j5895j9263p577P931M802l094k003O539J8523J5391o369k8192j6530
16246b41842L37J415L123R583J0298L068M654L22r90N083P128l934M929j690j0929
$$ plain form
16231 -209445 -213235 -218779 -211830 -208785 -205336 -206777 -216143 -221865 -220374 -222953 -233249 -217753 -206944
16218 -206944 -214311 -217241 -222458 -203794 -200154 -197412 -205498 -208522 -199862 -190401 -190245 -198887 -190112 -192538
16204 -192538 -208227 -211120 -194944 -196672 -196238 -191908 -200877 -207917 -196101 -187684 -190561 -193350 -191268 -197115
16190 -197115 -202547 -200113 -198307 -199965 -199554 -219969 -222540 -207265 -192098 -200512 -205662 -198961 -201500 -198484
16176 -198484 -207028 -210538 -208342 -190422 -175847 -175416 -187160 -204225 -206330 -196824 -195354 -191906 -185413
16163 -185413 -184224 -181579 -177380 -186751 -185972 -189627 -193094 -200522 -197003 -197203 -194600 -190290 -195808 -190446 -192999
16148 -192999 -194870 -199482 -191404 -179167 -176625 -178901 -177576 -178933 -190955 -204112 -214213 -201909 -197970
16135 -197970 -189421 -186075 -168565 -159499 -177865 -187178 -180515 -171079 -181390 -186155 -180269 -177960 -189642
$$ packed form
16231b09445l790n544O949L045L449j441r366n722J491k579j0296J5496J0809
16218b06944p367k930n217J8664L640K742q086l024Q660R461J56q642Q775k426
16204a92538j5689k893J6176j728M34M330q969p040J1816Q417k877k789K082n847
16190a97115n432K434J806j658M11k0415k571J5275J5167q414n150O701k539L016
16176a98484q544l510K196J7920J4575M31j1744j7065k105R506J470L448O493
16163a85413J189K645M199r371P79l655l467p428L519k00K603M310n518N362k553
16148a92999j871m612Q078J2237K542k276J325j357j2022j3157j0101J2304L939
16135a97970Q549L346J7510R066j8366r313O663R436j0311m765N886K309j1682
$$ plain form
16122 -189642 -185679 -181064 -180406 -185966 -192233 -187059 -179318 -169352 -167847 -173158 -188209 -200564 -188098 -176273
16108 -176273 -171078 -166613 -170512 -170199 -172836 -176752 -175644 -176382 -161458 -165828 -169553 -162066 -166742 -160545
16094 -160545 -158350 -160550 -158380 -164667 -171232 -173029 -185545 -173075 -157846 -154472 -161383 -158064 -170437
16081 -170437 -167239 -174450 -178310 -164706 -162294 -166069 -155207 -149307 -159130 -148848 -132635 -146052 -161790
16068 -161790 -153230 -148689 -152130 -151952 -151211 -161153 -163871 -157963 -162135 -178694 -173021 -176632 -183409 -174523
16054 -174523 -163399 -150822 -144970 -144926 -164134 -168455 -169678 -175996 -158381 -149670 -146098 -151877 -157995 -140652
16040 -140652 -138643 -156434 -161637 -164440 -160780 -153646 -156968 -152550 -154176 -154671 -153755 -157151 -158492 -157345
16026 -157345 -144174 -141956 -137478 -134779 -143830 -142057 -138760 -128620 -131044 -149902 -155850 -156354 -168417
$$ packed form
16122a89642L963M615O58n560o267N174P741R966J505n311j5051j2355J2466J1825
16108a76273N195M465l899L13k637l916J108p38J4924m370l725P487m676O197
16094a60545K195k200K170o287o565j797j2516J2470J5229L374o911L319j2373
16081a70437L198p211l860J3604K412l775J0862N900r823J0282J6213j3417j5738
16068a61790Q560M541l441J78P41r942k718N908m172j6559N673l611o777Q886
16054a74523J1124J2577N852M4j9208m321j223o318J7615Q711L572n779o118J7343
16040a40652K009j7791n203k803L660P134l322M418j626m95R16l396j341J147
16026a57345J3171K218M478K699r051J773L297J0140k424j8858n948n04j2063
$$ plain form
16013 -168417 -174222 -162346 -156326 -145193 -136582 -132824 -138481 -144620 -146152 -145934 -144539 -141783 -136238 -124120
15999 -124120 -120781 -118215 -126192 -134256 -136901 -132603 -132927 -149198 -161603 -160903 -153815 -135854 -119197 -126666
15985 -126666 -133027 -122487 -110439 -127763 -144577 -144037 -156311 -147296 -133666 -125850 -122373 -121414 -128528
15972 -128528 -129452 -127786 -130839 -128238 -136550 -145503 -133626 -126534 -133796 -125805 -114099 -123544 -129876 -137711
15958 -137711 -136302 -136907 -129099 -132247 -119643 -112822 -111422 -121617 -118241 -111657 -99078 -90880 -96022 -98871
15944 -98871 -91535 -94683 -117737 -131997 -129287 -112853 -107325 -109240 -112144 -113911 -109015 -110645 -105342 -105647
15930 -105647 -107388 -128534 -132762 -127496 -111870 -114992 -117217 -119864 -111806 -112267 -116362 -120859 -114872 -115837
15916 -115837 -125257 -141083 -144438 -146489 -138590 -126967 -114691 -115620 -95812 -92922 -92873 -96843 -108017 -96552
$$ packed form
16013a68417n805J1876O020J1133Q611L758n657o139j532K18J395K756N545J2118
15999a24120L339K566p977q064k645M298l24j6271j2405P00P088J7961J6657p469
15985a26666o361J0540J2048j7324j6814N40j2274R015J3630P816L477R59p114
15972a28528r24J666l053K601q312q953J1877P092p262P991J1706r445o332p835
15958a37711J409o05P808l148J2604O821J400j0195L376O584J2579Q198n142k849
15944i8871P336l148k3054j4260K710J6434N528j915k904j767M896j630N303l05
15930a05647j741k1146m228N266J5626l122k225k647Q058m61m095m497N987r65
15916a15837r420j5826l355k051P899J1623J2276r29J9808K890M9l970j1174J1465
$$ plain form
15902 -96552 -82234 -107388 -116269 -109743 -99925 -99472 -82170 -70569 -76604 -83653 -92408 -94504 -93840 -88559
15888 -88559 -92984 -96238 -98356 -101278 -94401 -94295 -100167 -95400 -103925 -107112 -104516 -102072 -92144 -75960
15874 -75960 -68563 -77425 -87879 -87746 -91243 -87371 -85393 -88495 -94941 -91620 -84748 -88812 -96916 -102521
15860 -102521 -89497 -77406 -84261 -93722 -86222 -78415 -76004 -85056 -80170 -73976 -87484 -96347 -95046
15847 -95046 -100506 -83849 -75623 -74258 -71824 -75704 -79518 -76192 -87806 -93864 -99911 -93560 -78547 -82011
15833 -82011 -92418 -86705 -77320 -86658 -91716 -84976 -80295 -82997 -77993 -81226 -78011 -78637 -75337 -74835 -78783
15818 -78783 -72344 -74256 -81327 -84478 -92088 -91930 -84532 -77266 -66662 -64803 -68789 -72544 -59428 -57387
15804 -57387 -67280 -66424 -64977 -79647 -86703 -91746 -88284 -78201 -83159 -80096 -72852 -64242 -66119 -76373
$$ packed form
15902i6552J4318k5154q881O526R818M53J7302J1601o035p049q755k096O64N281
15888h8559m425l254k118k922O877J06n872M767q525l187K596K444R928J6184
15874g5960P397q862j0454J33l497L872J978l102o446L321O872m064q104n605
15860a02521J3024J2091o855r461P500P807K411r052M886O194j3508q863J301
15847i5046n460J6657Q226J365K434l880l814L326j1614o058o047O351J5013l464
15833h2011j0407N713R385r338n058O740M681k702N004l233L215o26L300N02l948
15818g8783O439j912p071l151p610J58P398P266J0604J859l986l755J3116K041
15804e7387r893Q56J447j4670p056n043L462J0083m958L063P244Q610j877j0254
$$ plain form
15790 -76373 -74380 -62946 -54509 -55248 -48682 -71978 -74566 -67042 -62630 -59376 -68437 -66990 -49484 -58924
15776 -58924 -71029 -61766 -54509 -47510 -51088 -57818 -62723 -58928 -51862 -42326 -41025 -47086 -47824 -53962
15762 -53962 -67974 -70926 -65622 -52456 -57881 -68610 -70713 -63791 -65306 -61933 -46939 -41911 -50263
15749 -50263 -35137 -31684 -46613 -45225 -45793 -44970 -48347 -46408 -38014 -40425 -44794 -46079 -45608 -63453
15735 -63453 -54608 -50957 -59339 -60023 -52051 -40533 -38138 -40675 -27261 -25842 -42039 -55578 -47658 -42121
15721 -42121 -35642 -46246 -52777 -54227 -57731 -56972 -56690 -70006 -67034 -61080 -56548 -37693 -18273 -27690
15707 -27690 -36616 -41443 -44091 -41763 -39643 -28785 -18375 -23834 -29806 -32318 -30259 -32692 -32438 -40864
15693 -40864 -39704 -31920 -34322 -54794 -56672 -55854 -45761 -30386 -33181 -38748 -42168 -31776 -21526
$$ packed form
15790g6373J993J1434Q437p39O566k3296k588P524M412L254r061J447J7506r440
15776e8924j2105R263P257O999l578o730m905L795P066R536J301o061p38o138
15762e3962j4012k952N304J3166n425j0729k103O922j515L373J4994N028q352
15749e0263J5126L453j4929J388n68Q23l377J939Q394k411m369j285M71j7845
15735f3453Q845L651q382o84P972J1518K395k537J3414J419j6197j3539P920N537
15721d2121O479j0604o531j450l504P59K82j3316K972N954M532J8855J9420r417
15707b7690q926m827k648K328K120J0858J0410n459n972k512K059k433K54q426
15693d0864J160P784k402k0472j878Q18J0093J5375k795n567l420J0392J0250
$$ plain form
15680 -21526 -36267 -59097 -57790 -52402 -49063 -42128 -47054 -43059 -43618 -29744 -19157 -25897 -24051 -25798
15666 -25798 -38016 -47054 -44353 -46955 -40755 -31340 -20272 -19560 -16079 -21575 -21620 -23262 -17940 -22143 -22984
15651 -22984 -26744 -35738 -32007 -28151 -27880 -29577 -27738 -14492 -21267 -37078 -29205 -22546 -25038 -32979
15637 -32979 -17664 -11412 -22595 -36721 -50777 -30469 -16320 -15019 -11696 -8945 -6483 -15384 -17662
15624 -17662 -18836 -7780 -5959 -14975 -18084 -9300 -22147 -24334 -34795 -31312 -31951 -31379 -29206 -12189
15610 -12189 -5279 -3779 -5728 -4838 -12389 -26169 -34015 -31344 -15285 -16529 -17339 -6397 4715 11707
15596 11707 7076 981 -594 3075 4204 -678 -14714 -25207 -13154 -4969 -8569 -7961 -7116 -12283
15582 -12283 -11553 -12290 -18683 -22681 -13695 -3694 -3143 -3854 -16568 -32794 -27525 -12548 -1413 -6498
$$ packed form
15680b1526j4741k2830J307N388L339O935m926L995n59J3874J0587o740J846j747
15666b5798j2218r038K701k602O200R415J1068P12L481n496m5j642N322m203q41
15651b2984l760q994L731L856K71j697J839J3246o775j5811P873O659k492p941
15637c2979J5315O252j1183j4126j4056K0308J4149J301L323K751K462q901k278
15624a7662j174J1056J821r016l109Q784j2847k187j0461L483o39N72K173J7017
15610a2189O910J500j949Q90p551j3780p846K671J6059j244q10J0942J1112O992
15596A1707m631o095j575L669J129m882j4036j0493J2053Q185l600O08Q45n167
15582a2283P30p37o393l998Q986J0001N51p11j2714j6226N269J4977J1135n085
$$ plain form
15568 -6498 -3098 -5792 -16830 -17622 -13497 -12596 -8675 -8298 -3017 -13832 -17880 -7784 5022 -12289
15554 -12289 -14770 -6611 -2583 1320 -13560 -20301 -29180 -16765 5721 6143 36 -2489 -6336 -3495
15540 -3495 3889 6648 9960 8072 585 -17494 -30613 -24057 -14623 -12287 -5067 7768 11139 22687
15526 22687 15628 12025 17650 19220 19116 9556 13758 17521 14973 10275 12456 8571 10114 1472 2423
15511 2423 -3206 441 13511 25929 30388 21519 11259 18740 15172 -533 -2512 -3615 -2673 6280
15497 6280 15972 14403 7978 5093 -4516 1897 -1264 -1225 -1579 11582 28905 25392 21203 12652 7855
15482 7855 21046 22210 17260 21845 18182 5355 15707 23987 20466 24211 30909 28343 33550 30197
15468 30197 23008 25369 22292 25099 38967 42690 36046 30391 18708 25509 32656 22470 25241 34764
$$ packed form
15568f498L400k694j1038p92M125R01L921L77N281j0815m048J0096J2806j7311
15554a2289k481Q159M028L903j4880o741q879J2415K2486M22o107k525l847K841
15540c495P384K759L312j888p487j8079j3119O556R434K336P220J2835L371J1548
15526B2687p059l603N625J570j04r560M202L763k548m698K181l885J543q642R51
15511B423n629L647J3070J2418M459q869j0260P481l568j5705j979j103R42Q953
15497F280R692j569o425k885r609O413l161L9l54J3161J7323l513m189q551m797
15482G855J3191J164m950M585l663j2827J0352Q280l521L745O698k566N207l353
15468C0197p189K361l077K807J3868L723o644n655j1683O801P147j0186K771R523
$$ plain form
15454 34764 37164 29389 30841 34859 29546 32621 34195 38098 44799 38099 36830 37146 42915 34130 26414
15439 26414 20968 20935 31080 39247 35768 17103 19913 36956 42608 46465 44569 39248 48824 42546
15425 42546 44431 41210 35432 34731 31236 39226 53154 53137 62242 66816 56118 49241 46681 45016 32966
15410 32966 42213 50176 53892 42718 40453 46279 55126 53829 37203 35100 37002 42159 60079 65123
15396 65123 42814 35423 27821 32293 42030 26682 38952 31023 20373 36824 51028 49654 48072
15383 48072 57467 48031 38311 22328 12837 21801 42343 45456 44701 32061 32274 37883 43307 50869
15369 50869 64812 60962 52602 43534 34741 33053 52594 65715 60106 51141 51989 54386 55417 56512
15355 56512 60827 65450 72616 67325 61010 57019 52492 55224 56542 58955 58636 45130 50694 63105
$$ packed form
15454C4764K400p775J452M018n313L075J574L903O701o700j269L16N769q785p716
15439B6414n446l3J0145Q167l479j8665K810J7043N652L857j896n321R576o278
15425D2546J885l221n778p01l495P990J3928j7R105M574j0698o877k560j665j2050
15410C2966R247P963L716j1174k265N826Q847j297j6626k103J902N157J7920N044
15396F5123k2309p391p602M472R737j5348J2270p929j0650J6451J4204j374j582
15383D8072R395r436r720j5983r491Q964K0542L113p55j2640K13N609N424P562
15369E0869J3943l850q360r068q793j688J9541J3121n609q965Q48K397J031J095
15355E6512M315M623P166n291o315l991m527K732J318K413l19j3506N564J2411
$$ plain form
15341 63105 80732 80418 74912 74550 73775 63316 54003 43023 46618 51696 54665 64761 72304 70496
15327 70496 85335 82336 67173 63357 85201 92640 81112 59070 57129 63197 65417 64071 75617
15314 75617 86067 93305 90465 89316 75951 75191 82950 91587 88158 91125 86448 78148 82137 77280
15300 77280 66632 57876 56015 62962 69417 68949 72868 71499 63135 60259 55059 51589 54596 40293
15286 40293 44560 71698 83359 87755 75785 85242 86836 73815 63098 69341 72984 71752 74382
15273 74382 82347 83407 93247 89964 81818 76060 77613 86116 85198 90261 85629 92180 92673 85162 78142
15258 78142 84819 97952 93621 71578 65161 71454 69812 76084 80897 92245 93575 90340 80100
15245 80100 84111 97104 103510 101445 95994 101626 101696 109601 124463 120895 105226 91092 104600 111296
$$ packed form
15341F3105J7627l14n506l62p75j0459r313j0980L595N078K969J0096P543j808
15327G0496J4839k999j5163l816K1844P439j1528k2042j941O068K220j346J1546
15314G5617J0450P238k840j149j3365p60P759Q637l429K967m677q300L989m857
15300G7280j0648q756j861O947O455m68L919j369q364k876n200l470L007j4303
15286D0293M267K7138J1661M396j1970R457J594j3021j0717O243L643j232K630
15273G4382P965J060R840l283q146n758J553Q503r18N063m632O551M93p511p020
15258G8142O677J3133m331k2043o417O293j642O272M813J1348J330l235j0240
15245H0100M011J2993O406k065n451N632P0P905J4862l568j5669j4134J3508O696
$$ plain form
15231 111296 104890 109885 104859 99832 103781 97865 83454 85830 99524 101854 103371 101950 101588 106899
15217 106899 100286 99317 104642 109739 109211 117043 106478 95767 83330 85956 93013 99272 109942 98570
15203 98570 95502 96300 107940 107646 106795 106417 103842 105980 107992 98865 108704 108201 92960 83708 79654
15188 79654 84940 95972 111061 119145 112193 101732 104490 104075 97620 100411 109756 112562 113358 120991
15174 120991 116508 99001 97871 101038 108450 129007 138345 134501 120007 109380 111975 110044 117988
15161 117988 115556 117941 111511 105441 105946 115623 116674 120542 135458 138972 127625 129507 135862 127844
15147 127844 123547 121200 123243 128577 128052 119830 117258 124273 124507 123919 124504 125204 128571 114111 113967
15132 113967 117420 120034 132229 135088 132297 124273 121912 114304 111045 113392 104125 104559 101187 113781
$$ packed form
15231A11296o406M995n026n027L949n916j4411K376J3694K330J517j421l62N311
15217A06899o613r69N325N097n28P832j0565j0711j2437K626P057O259J0670j1372
15203I8570l068P98J1640k94q51l78k575K138K012r127R839n03j5241r252m054
15188G9654N286J1032J5089Q084o952j0461K758m15o455K791R345K806P96P633
15174A20991m483j7507j130L167P412K0557R338l844j4494j0627K595j931P944
15161A17988k432K385o430o070N05R677J051L868J4916L514j1347J882O355q018
15147A27844m297k347K043N334n25q222k572P015K34n88N85P00L367j4460j44
15132A13967L453K614J2195K859k791q024k361p608l259K347r267M34l372J2594
$$ plain form
15118 113781 118367 112746 122692 133374 128166 136610 147967 155309 157171 140656 124424 124131 133538
15105 133538 131020 111340 116613 132719 132488 132195 138830 149033 140643 142963 128236 117479 121060
15092 121060 131252 136905 141565 142784 151121 149807 142590 137571 135412 140368 133435 130834 131607 148900
15078 148900 152832 159396 155608 131131 116314 126119 140080 145285 139791 146265 157361 150824 135969
15065 135969 134796 151097 162967 167056 165902 154162 152961 159791 153140 153861 155869 159529 159929 165203
15051 165203 151748 142229 131524 117774 118990 131242 140100 130622 137590 147505 149960 154586 150614
15038 150614 157995 158218 154360 159639 168732 163074 152693 151233 151785 147459 144241 155101 166044 168668
15024 168668 167959 167764 179089 188287 179675 178591 175250 171440 161018 167184 175319 160185 148896 146146
$$ packed form
15118A13781M586n621R946J0682n208Q444J1357P342J862j6515j6232k93R407
15105A33538k518j9680N273J6106k31k93O635J0203q390K320j4727j0757L581
15092A21060J0192N653M660J219Q337j314p217n019k159M956o933k601P73J7293
15078A48900L932O564l788k4477j4817R805J3961N205n494O474J1096o537j4855
15065A35969j173J6301J1870M089j154j1740j201O830o651P21K008L660M00N274
15051A65203j3455r519j0705j3750J216J2252Q858r478O968R915K455M626l972
15038A50614P381K23l858N279R093n658j0381j460N52m326l218J0860J0943K624
15024A68668p09j95J1325R198q612j084l341l810j0422O166Q135j5134j1289k750
$$ plain form
15010 146146 151047 157026 162435 157439 169099 177814 177480 170497 161827 150463 155430 173239 173624 156866
14996 156866 154911 155187 153111 154025 151800 155719 165527 162742 167520 170627 167889 174082 168293 159822 157102
14981 157102 155121 166933 166650 176447 182842 179422 164949 161992 159621 165459 172754 170290 177685 180925
14967 180925 182369 183668 183016 181204 188117 196004 192192 185766 186993 181004 173686 166068 164195 169318
14953 169318 162433 165757 156644 154673 164774 168098 172932 175365 173876 171302 175770 185249 190044 178662
14939 178662 166797 175621 180914 184750 185203 190550 190992 186636 197762 210712 211728 210434 214515 206849
14925 206849 192082 204913 205823 216298 214990 190804 173323 168697 181850 180476 187621 206545 205372
14912 205372 204436 198149 192817 179967 173870 178993 192345 201749 196144 200576 205946 202002 202178 202672
$$ packed form
15010A46146M901N979N409m996J1660Q715l34o983q670j1364M967J7809L85j6758
14996A56866j955K76k076R14k225L919R808k785M778L107k738O193n789q471k720
14981A57102j981J1812k83R797O395l420j4473k957k371N838P295k464P395L240
14967A80925J444J299o52j812O913P887l812o426J227n989p318p618j873N123
14953A69318o885L324r113j971J0101L324M834K433j489k574M468R479M795j1382
14939A78662j1865Q824N293L836M53N347M42m356J1126J2950J016j294M081p666
14925B06849j4767J2831R10J0475j308k4186j7481m626J3153j374P145J8924j173
14912B05372r36o287n332j2850o097N123J3352R404n605M432N370l944J76M94
$$ plain form
14898 202672 192752 185192 183848 186534 182589 179099 188826 187979 193407 196048 200800 208157 205866 196663
14884 196663 201311 205357 206068 194834 195540 208343 193451 193930 214310 217326 205914 205016 204167 208099
14870 208099 211821 220307 222657 192282 178057 186897 201235 212297 217081 206714 202381 203420 202744
14857 202744 204104 203679 210863 208987 206810 207375 194012 177774 192184 206523 227154 231728 231567 226541
14843 226541 213269 205614 201533 211991 206846 214460 209846 206844 216622 222962 234122 233344 228017 229023
14829 229023 241309 229095 234104 241358 231359 227749 221130 215542 215718 218323 229824 224112 218829 221567
14815 221567 224038 230008 233790 225585 222205 212122 217848 223417 224516 224464 217526 234488 234617 230057
14801 230057 227556 217078 222137 229963 235040 229787 231860 240338 242768 228490 226020 229067 235135 235911
$$ packed form
14898B02672r920p560j344K686l945l490R727q47N428K641M752P357k291r203
14884A96663M648M046P11j1234P06J2803j4892M79K0380L016j1412q98q49L932
14870B08099L722Q486K350l0375j4225Q840J4338J1062M784j0367m333J039o76
14857B02744J360m25P184j876k177N65j3363j6238J4410J4339K0631M574j61n026
14843B26541j3272p655m081J0458n145P614m614l002R778O340J1160p78n327J006
14829B29023J2286j2214N009P254r999l610o619n588J76K605J1501n712n283K738
14815B21567K471N970L782q205l380j0083N726N569J099n2o938J6962J29m560
14801B30057k501j0478N059P826N077n253K073Q478K430j4278k470L047O068P76
$$ plain form
14787 235911 248724 251621 244627 246333 248443 263387 261969 258808 242559 231488 225950 232052 237727
14774 237727 242377 241676 256076 261585 261177 256652 243707 231804 228951 234503 236973 235716 240857 248880
14760 248880 248750 233891 226920 241285 241532 237176 236883 242028 244348 242438 244660 237261 245916 257785
14746 257785 258286 254627 257340 264661 263217 250259 246415 247595 253672 237374 246859 267564 274555 276560
14732 276560 266912 264867 268610 260938 263252 271546 262447 249791 243351 248213 250781 250743 253474 257839
14718 257839 254021 263249 272895 266219 245440 238919 232977 232769 230764 231092 244779 254896 257485 246776
14704 246776 250866 260391 269963 263531 262277 271359 266747 264038 259570 252969 260108 268639 273349 266694
14690 266694 268924 274344 259923 249056 248342 262570 280900 289194 291330 280136 273435 267646 259217
$$ packed form
14787B35911J2813K897o994J706K110J4944j418l161j6249j1071n538O102N675
14774B37727M650p01J4400N509m08m525j2945j1903k853N552K470j257N141Q023
14760B48880j30j4859o971J4365K47m356k93N145K320j910K222p399Q655J1869
14746B57785N01l659K713P321j444j2958l844J180O077j6298R485K0705O991K005
14732B76560r648k045L743p672K314Q294r099j2656o440M862K568l8K731M365
14718B57839l818R228R646o676k0779o521n942k08k005L28J3687J0117K589j0709
14704B46776M090R525R572o432j254R082m612k709m468o601P139Q531M710o655
14690B66694K230N420j4421j0867p14J4228J8330Q294K136j1194o701n789q429
$$ plain form
14677 259217 251403 241427 243396 253422 260224 263280 269235 269838 269750 270701 267507 268680 273204 268614 263269
14662 263269 256504 277615 287501 283803 277949 274212 273586 277413 281587 275170 272280 270197 263474 259129
14648 259129 260296 252087 256327 255130 263476 271567 269750 268154 279002 287079 279029 281048 273499 260485
14634 260485 254348 262997 273886 272481 281646 297205 295390 284904 274477 279532 302986 316228 311136
14621 311136 293988 283475 278526 272913 274901 267207 263419 257891 259650 266548 270796 275800 274277 290639
14607 290639 289211 271140 281588 285636 273597 269301 273697 285567 288728 310758 317284 310235 293787
14594 293787 294869 294786 294016 292300 291994 287696 287275 299635 304794 317260 311307 289033 290431 294882 289828
14579 289828 294792 297876 296021 300720 304122 310489 303823 298788 290914 289570 302459 302437 304081 310496
$$ packed form
14677B59217p814r976J969J0026O802L056N955O03q8R51l194J173M524m590n345
14662B63269o765K1111R886l698n854l737o26L827M174o417k890k083o723m345
14648B59129J167q209M240j197Q346Q091j817j596J0848Q077q050K019p549j3014
14634B60485o137Q649J0889j405R165J5559j815j0486j0427N055K3454J3242n092
14621C11136j7148j0513m949n613J988p694l788n528J759O898M248N004j523J6362
14607B90639j428j8071J0448M048j2039m296M396J1870L161K2030O526p049j6448
14594B93787J082q3p70j716l06m298m21J2360N159J2466n953k2274J398M451n054
14579B89828M964L084j855M699L402O367o666n035p874j344J2889k2J644O415
$$ plain form
14565 310496 324612 319324 311177 302115 298438 304430 307544 304510 309029 320883 320629 312165 313470 298560
14551 298560 297748 300249 300008 302061 301180 301619 291847 292380 298852 306751 306547 310191 309066 304657 315280
14536 315280 316874 327025 330148 337915 330645 320121 311189 312578 322055 328636 323302 325753 343016
14523 343016 329302 325606 327162 343254 350889 338809 317304 316910 340037 334763 319688 306606 315084
14510 315084 317164 316399 311807 318279 322807 324234 327717 338287 339935 342047 346313 339669 328191 328024
14496 328024 333843 340714 338950 360118 363965 353552 338006 331533 343310 342022 334912 334121 317308
14483 317308 317690 314734 313296 320060 327683 328057 337103 351126 351153 356186 347128 332700 331473 345499
14469 345499 352414 351185 337971 338735 359167 351481 337466 337296 335570 327773 315103 316588 324999 335208
$$ packed form
14565C10496J4116n288q147r062l677N992L114l034M519J1854k54q464J305j4910
14551B98560q12K501k41K053q81M39r772N33O472P899k04L644j125m409J0623
14536C15280J594J0151L123P767p270j0524q932J389R477O581n334K451J7263
14523C43016j3714l696J556J6092P635j2080k1505l94K3127n274j5075j3082Q478
14510C15084K080p65m592O472M528J427L483J0570J648K112M266o644j1478j67
14496C28024N819O871j764K1168L847j0413j5546o473J1777j288p110p91j6813
14483C17308L82k956j438O764P623L74R046J4023K7N033r058j4428j227J4026
14469C45499O915j229j3214P64K0432p686j4015j70j726p797j2670J485Q411J0209
$$ plain form
14455 335208 353892 365347 377782 363183 356591 359256 360765 363772 364856 359253 359029 373741 375231
14442 375231 365725 354965 358376 354074 347338 340582 337717 335842 345911 353456 360749 368996 374870 378033
14428 378033 376552 372816 374855 366759 363856 348775 353897 370147 362712 338488 347498 354851 353283
14415 353283 354985 349604 351284 358276 372016 373785 366529 368238 367617 369300 375232 373540 383651 381789
14401 381789 378404 377145 379766 384990 373293 374122 378066 381934 387076 385148 389193 381098 368683 368161
14387 368161 367650 380198 383575 383762 384276 390560 393421 395606 392777 390289 405340 404331 402140 396670
14373 396670 392687 393768 389953 389322 376599 372930 380769 385976 393969 393503 395824 386627 377309 382971
14359 382971 393993 388013 387298 382481 377096 379187 368969 371787 390206 380502 383753 398164 402580
$$ packed form
14455C35208J8684J1455J2435j4599o592K665J509L007J084n603k24J4712J490
14442C75231r506j0760L411m302o736o756k865j875J0069P545P293Q247N874L163
14428C78033j481l736K039q096k903j5081N122J6250p435k4224R010P353j568
14415C53283J702n381J680O992J3740J769p256J709o21J683N932j692J0111j862
14401C81789l385j259K621N224j1697Q29L944L868N142j928M045q095j2415n22
14387C68161n11J2548L377J87N14O284K861K185k829k488J5051j009k191n470
14373C96670l983J081l815o31j2723l669P839N207P993m66K321r197r318N662
14359C82971J1022n980p15m817n385K091j0218K818J8419r704L251J4411M416
$$ plain form
14346 402580 407410 397420 389893 397422 390579 389263 391333 391661 396047 404597 411759 405326 402153 401738 399497
14331 399497 386277 381232 407471 413679 418165 418402 418930 434228 432493 415944 402032 394363 396978
14318 396978 406817 411266 416553 422242 421930 419037 408772 396176 386688 390529 407611 424283 413863
14305 413863 408835 404917 395911 404948 402506 410958 434115 438151 426834 420753 414145 402419 397835
14292 397835 408062 425775 425052 413943 399207 396023 406757 426507 429873 434553 446869 447645 444040
14279 444040 442351 453470 469100 467517 451749 442376 435012 428232 427028 423060 415006 417955 433482
14266 433482 439433 425813 430872 447609 461462 452671 437904 434712 450152 447541 438802 430815 433672
14253 433672 439411 444144 440517 428872 431846 436079 442759 445640 445413 440211 437032 441662 447761 448399
$$ packed form
14346D02580M830r990p527P529o843j316K070L28M386Q550P162o433l173m15k241
14331C99497j3220n045K6239O208M486K37N28J5298j735j6549j3912p669K615
14318C96978R839M449N287N689l12k893j0265j2596r488L841J7082J6672j0420
14305D13863n028l918r006R037k442Q452K3157M036j1317o081o608j1726m584
14292C97835J0227J7713p23j1109j4736l184J0734J9750L366M680J2316P76l605
14279D44040j689J1119J5630j583j5768r373p364o780j204l968q054K949J5527
14266D33482N951j3620N059J6737J3853q791j4767l192J5440k611q739p987K857
14253D33672N739M733l627j1645K974M233O680K881k27n202l179M630O099O38
$$ plain form
14239 448399 443874 444062 434720 420302 419608 415112 415872 422784 442701 456567 454201 448437 449570 458988
14225 458988 474697 481702 474233 470791 465986 461621 454396 463684 467269 459838 457843 470027 478926 479017
14211 479017 475095 474746 467216 464250 463197 472135 464642 459686 450100 453654 456374 475160 471647 456811
14197 456811 456544 457963 455498 457357 450911 458463 465175 453010 457278 466953 470312 466361 457040 460646
14183 460646 465424 465020 471800 483759 489252 490711 491762 492964 491185 490048 472958 472007 474633 481142
14169 481142 491311 492201 489309 481243 483027 494316 484783 475437 469672 466552 474188 476268 474850 498068
14155 498068 493696 466432 460292 473633 486162 504816 513728 505056 488153 492938 494987 495711 504791
14142 504791 517818 504366 492752 486963 486570 479094 482158 480771 491492 497738 495378 499482 497581
$$ packed form
14239D48399m525J88r342j4418o94m496P60O912J9917J3866k366n764J133R418
14225D58988J5709P005p469l442m805m365p225R288L585p431j995J2184Q899R1
14211D79017l922l49p530k966j053Q938p493m956r586L554K720J8786l513j4836
14197D56811k67J419k465J859o446P552O712j2165M268R675L359l951r321L606
14183D60646M778m04O780J1959N493J459J051J202j779j137j7090r51K626O509
14169D81142J0169Q90k892q066J784J1289r533r346n765l120P636K080j418K3218
14155D98068m372k7264o140J3341J2529J8654Q912q672j6903M785K049P24R080
14142E04791J3027j3452j1614n789l93p476L064j387J0721O246k360M104j901
$$ plain form
14129 497581 508640 506728 498181 507550 516712 516136 509394 504646 500340 488130 485018 485767 499945 503793
14115 503793 500251 485695 483743 488982 494059 502228 498065 498256 499342 494423 494923 505894 501946 507823
14101 507823 511862 515945 509688 506967 506942 514202 525789 549802 557966 555738 545404 538008 537843 528083
14087 528083 511162 520218 533509 529408 522039 526965 540772 539790 528149 525388 526339 517921 512300 517797
14073 517797 513828 510173 523714 530789 536203 540972 528940 522054 519154 524387 525392 535755 537484
14060 537484 542322 547080 554342 561722 556126 540268 535861 542027 537018 534780 536432 544253 533876 524265
14046 524265 520220 515477 512708 517767 525638 549616 569504 564442 554638 555996 558736 565597 561819 561052
14032 561052 569399 565036 556816 543902 535109 548309 550670 567570 584520 584291 578104 583379 574562
$$ packed form
14129D97581J1059j912q547R369R162n76o742m748m306j2210l112P49J4178L848
14115E03793l542j4556j952N239N077Q169m163J91J086m919N00J0971l948N877
14101E07823M039M083o257k721k5P260J1587K4013Q164k228j0334p396j65r760
14087E28083j6921R056J3291m101p369M926J3807r82j1641k761R51q418n621N497
14073E17797l969l655J3541P075N414M769j2032o886k900N233J005J0363J729
14060E37484M838M758P262P380n596j5858m407O166n009k238J652P821j0377r611
14046E24265m045m743k769N059P871K3978J9888n062r804J358K740O861l778p67
14032E61052Q347m363q220j2914q793J3200K361J6900J6950k29o187N275q817
$$ plain form
14019 574562 578005 583833 592317 593647 591327 588580 579876 564735 574149 566145 562405 565061 565388 568285
14005 568285 573735 571853 572150 565089 560223 571814 580061 569077 566838 561962 573646 574241 574956 566667
13991 566667 558733 560313 567441 572715 577701 585583 589225 588379 579410 567201 567174 576476 573210 570252 586133
13976 586133 587949 576272 584741 588300 581074 585706 591904 595699 610875 623981 615318 613976 611268
13963 611268 597710 586272 596936 598568 601053 600385 594760 598254 608748 605802 589940 587515 593397
13950 593397 604202 613634 620899 635823 627024 629631 631000 629742 617991 605501 599105 593405 605765
13937 605765 606164 623822 625486 624754 626228 624033 614994 622237 634342 633550 628805 611231 606833 612641
13923 612641 621665 635168 629867 629494 627683 631979 639681 638105 631781 634979 635037 646769 651247 647959
$$ packed form
14019E74562L443N828Q484J330k320k747q704j5141R414q004l740K656L27K897
14005E68285N450j882K97p061m866J1591Q247j0984k239m876J1684N95P15q289
13991E66667p934J580P128N274M986P882L642q46q969j2209k7R302l266k958J5881
13976E86133J816j1677Q469L559p226M632O198L795J5176J3106q663j342k708
13963F11268j3558j1438J0664J632K485o68n625L494J0494k946j5862k425N882
13950E93397J0805R432P265J4924q799K607J369j258j1751j2490o396n700J2360
13937F05765L99J7658J664p32J474k195r039P243J2105p92m745j7574m398N808
13923F12641R024J3503n301l73j811M296P702j576o324L198N8J1732M478l288
$$ plain form
13909 647959 630352 622135 616882 615121 626166 629141 629834 633944 648689 651854 641452 642399 645626 650031
13895 650031 654198 648857 644416 635937 640786 642777 643458 635686 652332 661846 654910 661241 668975 668223
13881 668223 665062 664439 664976 669680 666850 661651 651451 645714 650977 653496 655495 650058 651268 652133 659753
13866 659753 666446 664191 667528 665940 657544 666909 668136 675552 684637 677542 673207 684832 684055 673309
13852 673309 672075 666617 668877 658346 669120 662681 655229 661849 673765 679732 686328 689488 691955
13839 691955 699997 698162 690884 690808 693524 690454 707299 722653 726940 717132 701120 701651 701364 706777
13825 706777 704520 693742 699423 705737 707704 703136 688289 687919 685830 693077 683847 683385 693393 705989
13811 705989 723569 732713 728803 720177 712100 696844 688591 692492 694994 702903 703975 720145 726453
$$ packed form
13909F47959j7607q217n253j761J1045K975O93M110J4745L165j0402R47L227M405
13895F50031M167n341m441q479M849J991O81p772J6646R514o936O331P734p52
13881F68223l161o23N37M704k830n199j0200n737N263K519J999n437J210Q65P620
13866F59753O693k255L337j588q396R365J227P416R085p095m335J1625p77j0746
13852F73309j234n458K260j0531J0774o439p452O620J1916N967O596L160K467
13839F91955Q042j835p278p6K716l070J6845J5354M287r808j6012N31k87N413
13825G06777k257j0778N681O314J967m568j4847l70k089P247r230m62J0008J2596
13811G05989J7580R144l910q626q077j5256q253L901K502P909J072J6170O308
$$ plain form
13798 726453 723363 724572 727723 729510 725386 720756 726641 722864 726418 733616 739765 737285 735958 731853
13784 731853 735909 734370 744190 738861 730099 724236 727923 727559 731012 735516 739376 737207 734374 739549
13770 739549 746469 749935 757368 777926 773890 766257 757405 743817 735057 750175 749568 752856 757867 758040
13756 758040 762124 774668 776468 778654 786168 782988 771585 764931 764605 772263 773355 766328 755003 766434
13742 766434 789269 789836 781443 779067 787833 788374 781735 774669 777523 784420 780379 773672 771747 770516
13728 770516 765228 773184 789097 791045 778384 773498 776225 783746 784187 783909 787669 784369 795241 802518
13714 802518 793911 789166 791092 788838 789218 788945 810111 829286 821140 799429 798649 806910 806651 811517
13700 811517 805804 795451 799481 798222 801292 810575 808768 802822 808974 815960 827674 820604 809509
$$ packed form
13798G26453l090J209L151J787m124m630N885l777L554P198O149k480j327m105
13784G31853M056j539R820n329q762n863L687l64L453M504L860k169k833N175
13770G39549O920L466P433K0558m036p633q852j3588q760J5118o07L288N011J73
13756G58040M084J2544J800K186P514l180j1403o654l26P658J092p027j1325J1431
13742G66434K2835N67q393k376Q766N41o639p066K854O897m041o707j925j231
13728G70516n288P956J5913J948j2661m886K727P521M41k78L760l300J0872P277
13714H02518q607m745J926k254L80k73K1166J9175q146k1711p80Q261k59M866
13700H11517n713j0353M030j259L070R283j807n946O152O986J1714p070j1095
$$ plain form
13687 809509 809023 822404 822923 811935 808529 802872 804909 806255 809145 813256 801149 799540 809053 809463
13673 809463 816374 828646 830801 830021 822661 818314 821166 827193 836578 829194 830087 849538 838740 829035
13659 829035 828096 837520 845306 844250 850789 862495 860073 859154 856117 858650 862464 850049 847730 846600
13645 846600 859614 868641 870953 861096 857333 855084 855321 856733 849236 864269 881391 886085 877408 891054
13631 891054 896992 891084 875811 872887 876097 885712 881700 890945 874604 881817 895371 907157 913330
13618 913330 924337 913616 901097 889084 887129 894625 897009 893511 895305 899832 904040 911938 905280
13605 905280 891154 873402 876845 886304 883377 883937 884658 877224 875430 881108 886820 899218 905600 910916
13591 910916 919576 928452 914517 904416 921570 929909 929460 927604 929198 921883 921286 924644 923303 924327
$$ packed form
13687H09509m86J3381N19j0988l406n657K037J346K890M111j2107j609R513M10
13673H09463O911J2272K155p80p360m347K852O027R385p384Q93J9451j0798r705
13659H29035r39R424P786j056O539J1706k422r19l037K533L814j2415k319j130
13645H46600J3014R027K312r857l763k249K37J412p497J5033J7122M694q677J3646
13631H91054N938n908j5273k924L210R615m012R245j6341P213J3554J1786O173
13618I13330J1007j0721j2519j2013j955P496K384l498J794M527M208P898o658
13605I05280j4126j7752L443R459k927N60P21p434j794N678N712J2398O382N316
13591I10916Q660Q876j3935j0101J7154Q339m49j856J594p315n97L358j341J024
$$ plain form
13577 924327 918322 918011 916799 927438 935600 936726 929192 926078 932870 954074 951010 932901 935699 948339
13563 948339 944152 940513 948679 941766 942894 953248 964540 941763 924924 923487 928047 943251 949404
13550 949404 957637 959404 959626 958662 959778 972241 975478 976388 977297 974554 981185 987198 983797 977941 976706
13535 976706 986028 985553 984503 985364 988727 986909 981880 972802 987809 998211 992034 979643 987064 1001540
13521 1001540 1009348 1004130 1006959 1015529 1014180 1021828 1018018 1017316 1012916 1022710 1024198 1012606 1018782 1018087
13507 1018087 1014979 1011279 1002488 996308 993940 1002879 1009425 1024718 1037074 1044236 1032246 1026357 1030051
13494 1030051 1034585 1022789 1018245 1019644 1024313 1032226 1043478 1047814 1050415 1052200 1052731 1057830 1066463 1067468
13480 1067468 1065868 1057641 1053875 1047080 1049726 1049648 1051853 1057936 1059242 1050048 1048717 1047337 1062837 1067836
$$ packed form
13577I24327o005l11j212J0639Q162J126p534l114O792K1204l064j8109K798J2640
13563I48339m187l639Q166o913J128J0354J1292k2777j6839j437M560J5204O153
13550I49404Q233J767K22r64J116J2463L237R10R09k743O631O013l401n856j235
13535I76706R322m75j050Q61L363j818n029r078J5007J0402o177j2391P421J4476
13521A001540P808n218K829Q570j349P648l810p02m400R794J488j1592O176o95
13507A018087l108l700q791o180k368Q939O546J5293J2356P162j1990n889L694
13494A030051M534j1796m544J399M669P913J1252M336K601J785N31N099Q633J005
13480A067468j600q227l766o795K646p8K205O083J306r194j331j380J5500M999
$$ plain form
13466 1067836 1064639 1064637 1058554 1060896 1065540 1072708 1075840 1086965 1090952 1089106 1094586 1103875 1104742 1109112 1102445
13451 1102445 1095989 1092322 1089872 1094052 1090864 1108733 1106579 1104735 1108594 1107028 1117428 1131823 1127169
13438 1127169 1130209 1126939 1125618 1131719 1135381 1141706 1137557 1136907 1124424 1123898 1135846 1140512 1134247 1123222
13424 1123222 1122671 1128416 1137244 1142700 1144620 1149381 1147409 1148149 1149070 1152179 1154419 1147335 1147169 1156537 1170665
13409 1170665 1177804 1185189 1169258 1148969 1153261 1148249 1154914 1160296 1157372 1166753 1181364 1191483 1200131
13396 1200131 1196450 1185505 1171575 1175016 1184856 1185235 1182698 1195494 1209328 1220278 1211003 1208204 1207534
13383 1207534 1207425 1211771 1210794 1203311 1210462 1205644 1204111 1210861 1237968 1247432 1237646 1231608 1227323 1225028
13369 1225028 1228118 1228520 1236875 1243306 1255354 1261910 1260792 1262877 1267213 1268308 1276804 1269706 1269412 1265753
$$ packed form
13466A067836l197ko083K342M644P168L132J1125L987j846N480R289Q67M370o667
13451A102445o456l667k450M180l188J7869k154j844L859j566J0400J4395m654
13438A127169L040l270j321O101L662O325m149o50j2483n26J1948M666o265j1025
13424A123222n51N745Q828N456J920M761j972P40R21L109K240p084j66R368J4128
13409A170665P139P385j5931k0289M292n012O665N382k924R381J4611J0119Q648
13396A200131l681j0945j3930L441R840L79k537J2796J3834J0950r275k799o70
13383A207534j09M346r77p483P151m818j533O750K7107R464r786o038m285k295
13369A225028L090M02Q355O431J2048O556j118K085M336J095Q496p098k94l659
$$ plain form
13355 1265753 1259415 1260788 1254707 1259019 1260056 1266920 1277259 1283834 1291745 1297177 1301687 1308201 1320232
13342 1320232 1331255 1321977 1314300 1298643 1284998 1292217 1309323 1303891 1295232 1305648 1309149 1301307 1299171
13329 1299171 1307585 1321309 1319703 1316705 1321875 1318299 1326737 1329369 1324284 1326708 1332870 1330304 1324194 1325169
13315 1325169 1321589 1321179 1343086 1350936 1343994 1346206 1339992 1338572 1340299 1357694 1363051 1373328 1387452
13302 1387452 1386976 1383400 1392220 1394207 1384441 1376780 1372236 1373667 1386471 1383671 1394783 1398248 1392536 1389357
13288 1389357 1394627 1406053 1411347 1417682 1416556 1417812 1413821 1413424 1420264 1427390 1431440 1430963 1433055 1436848
13274 1436848 1426277 1422250 1432768 1438457 1448752 1468728 1483570 1480820 1474137 1476310 1476953 1480667 1488543
13261 1488543 1504413 1511035 1498868 1485927 1486519 1477514 1490572 1497195 1490322 1485775 1497476 1501490 1499354
$$ packed form
13355A265753o338J373o081M312J037O864J0339O575P911N432M510O514J2031
13342A320232J1023r278p677j5657j3645P219J7106n432q659J0416L501p842k136
13329A299171Q414J3724j606k998N170l576Q438K632n085K424O162k566o110R75
13315A325169l580m10K1907P850o942K212o214j420J727J7395N357J0277J4124
13302A387452m76l576Q820J987r766p661m544J431J2804k800J1112L465n712l179
13288A389357N270J1426N294O335j126J256l991l97O840P126M050m77K092L793
13274A436848j0571m027J0518N689J0295J9976J4842k750o683K173O43L714P876
13261A488543J5870O622j2167j2941N92r005J3058O623o873m547J1701M014k136
$$ plain form
13248 1499354 1510177 1518282 1525442 1521055 1517336 1510333 1515804 1517296 1527535 1532519 1536631 1550612 1561036
13235 1561036 1548765 1537228 1548453 1553228 1566189 1562937 1558106 1556241 1557632 1569802 1572037 1570152 1573726
13222 1573726 1573154 1579599 1577560 1582625 1583688 1586133 1588166 1590541 1589227 1603076 1612443 1610518 1616338 1616733
13208 1616733 1615370 1618877 1631778 1634315 1633651 1625103 1633200 1647283 1666337 1680499 1692411 1687375 1677062
13195 1677062 1670174 1670030 1672010 1682193 1683075 1674049 1666926 1675225 1683389 1682390 1680783 1685655 1694880 1700476
13181 1700476 1707776 1721392 1733207 1754979 1759676 1758626 1759682 1760660 1757751 1763679 1776787 1768442 1772972
13168 1772972 1793765 1808670 1798914 1796855 1791932 1793574 1808135 1821576 1804992 1790923 1800421 1814613
13156 1814613 1833974 1842200 1859564 1869735 1870073 1855257 1863482 1889103 1914468 1920087 1915559 1929091
$$ packed form
13248A499354J0823Q105P160m387l719p003N471J492J0239M984M112J3981J0424
13235A561036j2271j1537J1225M775J2961l252m831j865J391J2170K235j885L574
13222A573726n72O445k039N065J063K445K033K375j314J3849R367j925N820L95
13208A616733j363L507J2901K537o64q548Q097J4083J9054J4162J1912n036j0313
13195A677062o888j44J980J0183Q82r026p123Q299Q164r99j607M872R225N596
13181A700476P300J3616J1815K1772M697j050J056R78k909N928J3108q345M530
13168A772972K0793J4905r756k059m923J642J4561J3441j6584j4069R498J4192
13156A814613J9361Q226J7364J0171L38j4816Q225K5621K5365N619m528J3532
$$ plain form
13144 1929091 1930802 1946623 1975146 1978585 1977935 1991126 2004543 2009125 2023029 2028312 2028805 2037120 2056182
13131 2056182 2070967 2078543 2094343 2115076 2137177 2159639 2182890 2211220 2255087 2309294 2369538
13120 2369538 2446933 2515022 2569958 2622551 2627549 2482034 2103535 1628692 1284909 1156592
13110 1156592 1188668 1261854 1330862 1387998 1443022 1489768 1524261 1563512 1598423 1623450 1637084
13099 1637084 1651810 1676631 1705388 1729297 1754449 1784189 1781054 1789177 1800976 1810756 1822063 1850026
13087 1850026 1870281 1878436 1901676 1892072 1886454 1900946 1918974 1917009 1910165 1916737 1927890 1946309
13075 1946309 1957872 1973129 1981098 1985851 1976720 1971121 1985269 2001461 2003527 2008523 2026457 2041109
13063 2041109 2068447 2075336 2070041 2074814 2079365 2083765 2082028 2088283 2107648 2112986 2118251 2120008 2114774
$$ packed form
13144A929091J711J5821K8523L439o50J3191J3417M582J3904N283M93Q315J9062
13131B056182J4785P576J5800K0733K2101K2462K3251K8330M3867N4207O0244
13120B369538P7395O8089N4936N2593M998j45515l78499m74843l43783j28317
13110A156592L2076P3186O9008N7136N5024M6746L4493L9251L4911K5027J3634
13099A637084J4726K4821K8757K3909K5152K9740l135Q123J1799R780J1307K7963
13087A850026K0255Q155K3240r604n618J4492J8028j965o844O572J1153J8419
13075A946309J1563J5257P969M753r131n599J4148J6192K066M996J7934J4652
13063B041109K7338O889n295M773M551M400j737O255J9365N338N265J757n234
$$ plain form
13050 2114774 2117869 2136763 2150372 2163930 2171044 2176823 2168492 2165068 2175890 2177319 2178119 2195105 2209467
13037 2209467 2218449 2222022 2226081 2228158 2236192 2251134 2257743 2277316 2287216 2271285 2265587 2273789 2288416
13024 2288416 2287229 2287865 2294255 2311576 2335917 2334818 2323004 2313562 2322114 2319733 2335414 2359884 2363078
13011 2363078 2381897 2394881 2408745 2405215 2395804 2400243 2406611 2424197 2442780 2462153 2458467 2438377
12999 2438377 2443393 2462490 2482960 2485326 2489939 2485685 2506735 2510238 2522869 2539161 2539470 2553667 2565048
12986 2565048 2577410 2594538 2602248 2582856 2584936 2601339 2621910 2620400 2618451 2630743 2649187 2662156
12974 2662156 2674225 2671413 2678444 2682325 2686564 2689303 2687126 2695078 2708162 2728206 2739918 2753129 2758174
12961 2758174 2758524 2759060 2783441 2805632 2810913 2830707 2864014 2871927 2866703 2878988 2883694 2889457 2897842
$$ packed form
13050B114774L095J8894J3609J3558P114N779q331l424J0822J429Q00J6986J4362
13037B209467Q982L573M059K077Q034J4942O609J9573R900j5931n698Q202J4627
13024B288416j187O36O390J7321K4341j099j1814r442Q552k381J5681K4470L194
13011B363078J8819J2984J3864l530r411M439O368J7586J8583J9373l686k0090
12999B438377N016J9097K0470K366M613m254K1050L503J2631J6292L09J4197J1381
12986B565048J2362J7128P710j9392K080J6403K0571j510j949J2292J8444J2969
12974B662156J2069k812P031L881M239K739k177P952J3084K0044J1712J3211N045
12961B758174L50N36K4381K2191N281J9794L3307P913n224J2285M706N763Q385
$$ plain form
12948 2897842 2915761 2929820 2943659 2940686 2926138 2925642 2938932 2946035 2965886 2983350 3000548 3024322
12936 3024322 3051887 3058661 3075666 3085230 3079513 3091764 3109760 3125783 3147372 3150899 3153780 3149978
12924 3149978 3149824 3163031 3178035 3215065 3237204 3277040 3280426 3286659 3300665 3319779 3337390 3343863
12912 3343863 3354752 3373064 3399403 3420438 3392038 3342297 3293554 3288494 3299829 3321501 3341026
12901 3341026 3372006 3401531 3425348 3435866 3446902 3466671 3487052 3490564 3491940 3512733 3533609 3545596
12889 3545596 3562366 3584809 3598929 3615439 3623559 3636989 3651893 3670839 3681009 3701397 3724149
12878 3724149 3738199 3737648 3744612 3760360 3781835 3810390 3844404 3864399 3892200 3894707 3892205 3913962
12866 3913962 3936075 3970518 4002378 4031500 4050083 4055284 4064321 4069001 4075308 4084140 4114598 4130439
$$ packed form
12948B897842J7919J4059J3839k973j4548m96J3290P103J9851J7464J7198K3774
12936C024322K7565O774J7005R564n717J2251J7996J6023K1589L527K881l802
12924C149978j54J3207J5004L7030K2139L9836L386O233J4006J9114J7611O473
12912C343863J0889J8312K6339K1035k8400m9741m8743n060J1335K1672J9525
12901C341026L0980K9525K3817J0518J1036J9769K0381L512J376K0793K0876J1987
12889C545596J6770K2443J4120J6510Q120J3430J4904J8946J0170K0388K2752
12878C724149J4050n51O964J5748K1475K8555L4014J9995K7801K507k502K1757
12866C913962K2113L4443L1860K9122J8583N201R037M680O307Q832L0458J5841
$$ plain form
12854 4130439 4146041 4181462 4206884 4226475 4228344 4229805 4260305 4306817 4345439 4356942 4374243 4403967
12842 4403967 4438370 4462224 4486727 4503833 4521801 4533359 4549725 4580011 4614806 4632364 4667780
12831 4667780 4710887 4731450 4753932 4782998 4816177 4859638 4886385 4898979 4909532 4944767 4978902
12820 4978902 5006530 5022603 5038404 5057816 5082545 5091320 5080117 5044597 4985598 4943053 4967771
12809 4967771 5057287 5146631 5225147 5304100 5395123 5470218 5530791 5583065 5629742 5679118 5715293
12798 5715293 5750676 5781206 5819414 5855231 5888372 5923911 5974640 6035498 6070837 6107506 6162204
12787 6162204 6227750 6279687 6312042 6335194 6367257 6390760 6375396 6361869 6383997 6457580 6527280
12776 6527280 6588066 6659043 6722184 6775268 6843204 6897221 6940574 6987744 7033305 7110015 7186856
$$ packed form
12854D130439J5602L5421K5422J9591J869J461L0500M6512L8622J1503J7301K9724
12842D403967L4403K3854K4503J7106J7968J1558J6366L0286L4795J7558L5416
12831D667780M3107K0563K2482K9066L3179M3461K6747J2594J0553L5235L4135
12820D978902K7628J6073J5801J9412K4729Q775j1203l5520n8999m2545K4718
12809D967771Q9516Q9344P8516P8953R1023P5095O0573N2274M6677M9376L6175
12798E715293L5383L0530L8208L5817L3141L5539N0729O0858L5339L6669N4698
12787F162204O5546N1937L2355K3152L2063K3503j5364j3527K2128P3583O9700
12776F527280O0786P0977O3141N3084O7936N4017M3353M7170M5561P6710P6841
$$ plain form
12765 7186856 7260073 7336834 7407305 7465431 7529681 7611939 7685666 7761929 7827415 7900795 7971925
12754 7971925 8050182 8133395 8209899 8298597 8362468 8429272 8523276 8635401 8748984 8847021 8938407
12743 8938407 9038236 9118487 9204844 9300663 9386517 9481924 9608273 9735914 9854782 9979820
12733 9979820 10108509 10244413 10384995 10519531 10640855 10771257 10911757 11061373 11221912
12724 11221912 11380337 11525051 11668868 11824802 11987175 12157550 12341300 12539302 12747671
12715 12747671 12965433 13183363 13390114 13603439 13815768 14052468 14332122 14622716 14906569
12706 14906569 15186834 15462552 15751219 16045150 16372566 16740931 17106291 17485349 17878950
12697 17878950 18300531 18738079 19182761 19637338 20112492 20613929 21167526 21756807 22371854
$$ packed form
12765G186856P3217P6761P0471N8126O4250Q2258P3727P6263O5486P3380P1130
12754G971925P8257Q3213P6504Q8698O3871O6804R4004J12125J13583R8037R1386
12743H938407R9829Q0251Q6357R5819Q5854R5407J26349J27641J18868J25038
12733I979820J28689J35904J40582J34536J21324J30402J40500J49616J60539
12724A1221912J58425J44714J43817J55934J62373J70375J83750J98002K08369
12715A2747671K17762K17930K06751K13325K12329K36700K79654K90594K83853
12706A4906569K80265K75718K88667K93931L27416L68365L65360L79058L93601
12697A7878950M21581M37548M44682M54577M75154N01437N53597N89281O15047
$$ plain form
12688 22371854 22994619 23665736 24374023 25123875 25938258 26790044 27711463 28733245 29847788
12679 29847788 31068519 32412764 33909716 35513464 37222544 39048268 41053435 43271469
12671 43271469 45753364 48549911 51669673 55076965 58730396 62815774 67849864 74227736
12663 74227736 82138639 91755344 103458085 117603863 134078932 150703308 160293491
12656 160293491 147058612 86696762 -16120941 -107415864 -149776068 -150417872 -136605967
12649 -136605967 -121477542 -108060750 -96606546 -86939098 -78799974 -71905566 -66119457
12642 -66119457 -61434089 -57587497 -54140549 -50848790 -47751440 -44934638 -42378748 -40080034
12634 -40080034 -38030918 -36226278 -34616496 -33173439 -31854404 -30601549 -29428912 -28345086
$$ packed form
12688B2371854O22765O71117P08287P49852Q14383Q51786R21419J021782J114543
12679B9847788J220731J344245J496952J603748J709080J825724K005167K218034
12671D3271469K481895K796547L119762L407292L653431M085378N034090O377872
12663G4227736P910903R616705J1702741J4145778J6475069J6624376R590183
12656A60293491j3234879o0361850j02817703r1294923m2360204o41804J3811905
12649a36605967J5128425J3416792J1454204R667448Q139124O894408N786109
12642f6119457M685368L846592L446948L291759L097350K816802K555890K298714
12634d0080034K049116J804640J609782J443057J319035J252855J172637J083826
$$ plain form
12626 -28345086 -27311023 -26340172 -25428630 -24573460 -23760234 -23003618 -22309955 -21653749 -21026747
12617 -21026747 -20449897 -19898073 -19352609 -18826097 -18341153 -17894631 -17481497 -17084883 -16698483
12608 -16698483 -16321388 -15951393 -15607601 -15278065 -14957676 -14635426 -14346048 -14073523 -13810641
12599 -13810641 -13574888 -13349764 -13096566 -12854676 -12624753 -12409556 -12199128 -11981402 -11783990
12590 -11783990 -11582002 -11389619 -11194761 -11009282 -10838080 -10665958 -10497403 -10331989 -10181720
12581 -10181720 -10041620 -9902483 -9771097 -9639492 -9490522 -9364949 -9252720 -9131098 -9016656
12572 -9016656 -8900172 -8798383 -8681294 -8544382 -8407478 -8279832 -8177734 -8085787 -7991552 -7925292
12562 -7925292 -7850745 -7762635 -7684243 -7592120 -7491676 -7402322 -7313117 -7239850 -7160592 -7070663 -7000726
$$ packed form
12626b8345086J034063R70851R11542Q55170Q13226P56616O93663O56206O27002
12617b1026747N76850N51824N45464N26512M84944M46522M13134L96614L86400
12608a6698483L77095L69995L43792L29536L20389L22250K89378K72525K62882
12599a3810641K35753K25124K53198K41890K29923K15197K10428K17726J97412
12590a1783990K01988J92383J94858J85479J71202J72122J68555J65414J50269
12581a0181720J40100J39137J31386J31605J48970J25573J12229J21622J14442
12572i016656J16484J01789J17089J36912J36904J27646J02098R1947R4235O6260
12562g925292P4547Q8110P8392R2123J00444Q9354Q9205P3267P9258Q9929O9937
$$ plain form
12551 -7000726 -6937227 -6858811 -6783676 -6731624 -6662779 -6591643 -6509837 -6435736 -6391228 -6353166 -6299916
12540 -6299916 -6236240 -6164772 -6103966 -6056996 -5991639 -5908781 -5841280 -5811925 -5763946 -5733982 -5700804
12529 -5700804 -5676050 -5639048 -5569623 -5477956 -5405862 -5358623 -5312672 -5261023 -5216267 -5175642 -5135874
12518 -5135874 -5104388 -5061772 -5011266 -4963684 -4917648 -4866929 -4823836 -4769088 -4725447 -4696439 -4662268
12507 -4662268 -4622193 -4588562 -4565680 -4548445 -4552450 -4578277 -4609343 -4619982 -4632325 -4646665 -4596665
12496 -4596665 -4481680 -4379700 -4296875 -4220416 -4154984 -4111487 -4077020 -4036312 -3991287 -3954177 -3926420
12485 -3926420 -3897057 -3872759 -3841670 -3797889 -3762889 -3735282 -3717868 -3697403 -3675148 -3658788 -3655457
12474 -3655457 -3622955 -3589727 -3561322 -3530711 -3502833 -3487201 -3467852 -3437218 -3406438 -3389637 -3376526
$$ packed form
12551g000726O3499P8416P5135N2052O8845P1136Q1806P4101M4508L8062N3250
12540f299916O3676P1468O0806M6970O5357Q2858O7501K9355M7979K9964L3178
12529e700804K4754L7002O9425R1667P2094M7239M5951N1649M4756M0625L9768
12518e135874L1486M2616N0506M7582M6036N0719M3093N4748M3641K9008L4171
12507d662268M0075L3631K2882J7235m005k5827l1066j0639j2343j4340N0000
12496d596665J14985J01980Q2825P6459O5432M3497L4467M0708M5025L7110K7757
12485c926420K9363K4298L1089M3781L5000K7607J7414K0465K2255J6360L331
12474c655457L2502L3228K8405L0611K7878J5632J9349L0634L0780J6801J3111
$$ plain form
12463 -3376526 -3352767 -3329821 -3316330 -3308718 -3279329 -3254212 -3229668 -3204531 -3183583 -3165688 -3163128 -3155824
12451 -3155824 -3133042 -3107336 -3084712 -3041993 -3006239 -2981490 -2965802 -2947314 -2948871 -2941092 -2928586 -2902503
12439 -2902503 -2877428 -2855789 -2823304 -2795103 -2786675 -2773781 -2758315 -2731831 -2710945 -2692011 -2668427
12428 -2668427 -2655996 -2636748 -2625190 -2612727 -2602239 -2583539 -2577071 -2569569 -2559757 -2549530 -2529585 -2508163
12416 -2508163 -2499447 -2484089 -2464817 -2426264 -2393601 -2370160 -2350775 -2336607 -2325747 -2314451 -2296909
12405 -2296909 -2285289 -2286929 -2277516 -2260150 -2251002 -2231819 -2219286 -2216971 -2201711 -2178932 -2160133 -2142868
12393 -2142868 -2129294 -2120409 -2101888 -2086347 -2081961 -2077931 -2059994 -2046013 -2030836 -2013639 -2001094 -1996841
12381 -1996841 -1984544 -1976872 -1956156 -1932931 -1924915 -1931301 -1919767 -1887915 -1872776 -1870953 -1866643 -1866499 -1852057
$$ packed form
12463c376526K3759K2946J3491P612K9389K5117K4544K5137K0948J7895K560P304
12451c155824K2782K5706K2624M2719L5754K4749J5688J8488j557P779J2506K6083
12439b902503K5075K1639L2485K8201Q428J2894J5466K6484K0886J8934K3584
12428b668427J2431J9248J1558J2463J0488J8700O468P502R812J0227J9945K1422
12416b508163Q716J5358J9272L8553L2663K3441J9385J4168J0860J1296J7542
12405b296909J1620j640R413J7366R148J9183J2533K315J5260K2779J8799J7265
12393b142868J3574Q885J8521J5541M386M030J7937J3981J5177J7197J2545M253
12381a996841J2297P672K0716K3225Q016o386J1534L1852J5139J823M310J44J4442
$$ plain form
12368 -1852057 -1830881 -1819495 -1809008 -1789193 -1762589 -1746321 -1731542 -1723171 -1708416 -1687110 -1673628
12357 -1673628 -1666599 -1661785 -1659986 -1648526 -1640062 -1660647 -1672126 -1652506 -1630796 -1619256 -1605753 -1582211
12345 -1582211 -1563350 -1558039 -1544298 -1536694 -1534883 -1538558 -1525920 -1504546 -1495437 -1489093 -1480995 -1455640 -1438235
12332 -1438235 -1420101 -1405218 -1402720 -1397272 -1392003 -1381657 -1385700 -1379790 -1367469 -1352307 -1338181 -1334468
12320 -1334468 -1339631 -1321766 -1306172 -1301400 -1295552 -1280272 -1254014 -1225135 -1217856 -1215936 -1221694 -1212281 -1192290
12307 -1192290 -1180529 -1179825 -1170580 -1170447 -1171061 -1155543 -1139172 -1135436 -1140127 -1135267 -1123206 -1117040 -1105530
12294 -1105530 -1084964 -1067029 -1058059 -1058215 -1047832 -1032720 -1026723 -1012764 -996532 -1008303 -1005067 -985839
12282 -985839 -976743 -966970 -956283 -943039 -933006 -929030 -928978 -920062 -906321 -876682 -868245 -859189 -850829
$$ packed form
12368a852057K1176J1386J0487J9815K6604J6268J4779Q371J4755K1306J3482
12357a673628P029M814J799J1460Q464k0585j1479J9620K1710J1540J3503K3542
12345a582211J8861N311J3741P604J811l675J2638K1374R109O344Q098K5355J7405
12332a438235J8134J4883K498N448N269J0346m043N910J2321J5162J4126L713
12320a334468n163J7865J5594M772N848J5280K6258K8879P279J920n758R413J9991
12307a192290J1761P04R245J33o14J5518J6371L736m691M860J2061O166J1510
12294a105530K0566J7935Q970j56J0383J5112N997J3959J6232j1771L236J9228
12282i85839R096R773J0687J3244J0033L976N2Q916J3741K9639Q437R056Q360
$$ plain form
12269 -850829 -856416 -861076 -842964 -819253 -794565 -774090 -773056 -778850 -773820 -749087 -728736 -722200 -709448
12256 -709448 -711800 -710324 -699100 -698110 -691891 -693846 -689179 -682231 -669377 -659953 -644965 -636329 -620276
12243 -620276 -613853 -611147 -593947 -576540 -574968 -565723 -541184 -544159 -528807 -509787 -497172 -496857 -488435
12230 -488435 -479887 -469962 -468261 -464869 -454291 -433599 -432135 -430807 -418362 -392888 -362547 -353222 -340071
12217 -340071 -316369 -298806 -284119 -262604 -263872 -262300 -235329 -219746 -216330 -193861 -174221 -156293
12205 -156293 -130888 -104210 -84540 -70385 -48345 -25596 14616 56177 88951 124296 170565
12194 170565 242635 311773 387081 462786 521225 496662 284309 -136320 -578236 -842735 -902939
12183 -902939 -860435 -787212 -727171 -662654 -607788 -554809 -510701 -481926 -456242 -416907 -373520
$$ packed form
12269h50829n587m660J8112K3711K4688K0475J034n794N030K4733K0351O536J2752
12256g09448k352J476J1224R90O219j955M667O948J2854R424J4988Q636J6053
12243f20276O423K706J7200J7407J572R245K4539k975J5352J9020J2615L15Q422
12230d88435Q548R925J701L392J0578K0692J464J328J2445K5474L0341R325J3151
12217c40071K3702J7563J4687K1515j268J572K6971J5583L416K2469J9640J7928
12205a56293K5405K6678J9670J4155K2040K2749M0212M1561L2774L5345M6269
12194A70565P2070O9138P5308P5705N8439k4563k12353m20629m41916k64499o0204
12183i02939M2504P3223O0041O4517N4866N2979M4108K8775K5684L9335M3387
$$ plain form
12172 -373520 -329085 -308766 -285881 -277414 -259400 -222429 -211880 -201726 -185399 -178482 -164986 -152329
12160 -152329 -142664 -124675 -90790 -72098 -72438 -66878 -53644 -38623 -19977 373 16215 28305
12148 28305 48590 58513 78969 85743 88721 95429 95516 99735 106409 120620 138078 149315 163169
12135 163169 169914 183885 211031 230471 235475 245328 255657 263876 270456 287160 294474 300109 307927
12122 307927 324942 331643 338767 352705 371629 388501 383826 384095 403936 425037 437090 440433 441259
12109 441259 455131 457589 477336 492909 502081 526147 524788 523417 528014 546052 564270 578946
12097 578946 584250 592255 605030 612523 635560 650430 661323 676752 679678 679395 695011 714407 726612
12084 726612 740286 745543 755651 763034 757801 764198 780786 806564 822299 827634 831820 839053 863062
$$ packed form
12172c73520M4435K0319K2885Q467J8014L6971J0549J0154J6327O917J3496J2657
12160a52329R665J7989L3885J8692l40N560J3234J5021J8646K0350J5842J2090
12148B8305K0285R923K0456O774K978O708Q7M219O674J4211J7458J1237J3854
12135A63169O745J3971K7146J9440N004R853J0329Q219O580J6704P314N635P818
12122C07927J7015O701P124J3938J8924J6872m675K69J9841K1101J2053L343Q26
12109D41259J3872K458J9747J5573R172K4066j359j371M597J8038J8218J4676
12097E78946N304Q005J2775P493K3037J4870J0893J5429K926k83J5616J9396J2205
12084G26612J3674N257J0108P383n233O397J6588K5778J5735N335M186P233K4009
$$ plain form
12071 863062 879024 892915 902013 915680 928585 933239 942121 955831 974954 974969 978881 991835 1007663
12058 1007663 1015663 1009670 1016531 1027996 1045291 1050390 1062881 1074622 1087805 1101727 1109648 1100908
12046 1100908 1098022 1118338 1140747 1154179 1156004 1159051 1167534 1165571 1159468 1173131 1178870 1189493 1203548
12033 1203548 1224047 1229500 1224107 1224886 1227947 1225160 1231891 1238933 1241234 1250619 1242596 1246001 1247481 1244495
12019 1244495 1229964 1242755 1256062 1257802 1256727 1262075 1265379 1252800 1239934 1230721 1221298 1198540
12007 1198540 1208906 1214820 1204009 1192558 1185601 1173381 1164016 1151859 1138797 1122166 1101907 1092602
11995 1092602 1078565 1054602 1048130 1046886 1029755 999608 966686 949826 938788 914783 881601 845658
11983 845658 826377 798979 774589 753035 726495 678170 626572 587209 551124 512088 479613
$$ packed form
12071H63062J5962J3891R098J3667J2905M654Q882J3710J9123J5L912J2954J5828
12058A007663Q000n993O861J1465J7295N099J2491J1741J3183J3922P921q740
12046A100908k886K0316K2409J3432J825L047Q483j963o103J3663N739J0623J4055
12033A203548K0499N453n393P79L061k787O731P042K301R385q023L405J480k986
12019A244495j4531J2791J3307J740j075N348L304j2579j2866r213r423k2758
12007A198540J0366N914j0811j1451o957j2220r365j2157j3062j6631k0259r305
11995A092602j4037k3963o472j244j7131l0147l2922j6860j1038k4005l3182l5943
11983H45658j9281k7398k4390k1554k6540m8325n1598l9363l6085l9036l2475
$$ plain form
11972 479613 443925 403782 358022 324867 284121 231258 178705 121549 69180 9734 -57908
11961 -57908 -106956 -159227 -204347 -253078 -316297 -386621 -435942 -490065 -557717 -613058 -668034 -736380
11949 -736380 -796161 -861197 -930801 -995859 -1062610 -1130853 -1187200 -1244260 -1312316 -1377374 -1434449
11938 -1434449 -1499276 -1544435 -1591925 -1649244 -1712011 -1775177 -1841987 -1904112 -1955370 -2010498 -2069448
11927 -2069448 -2125389 -2167928 -2226074 -2288259 -2333414 -2374366 -2416098 -2476772 -2521365 -2563140 -2613734
11916 -2613734 -2655391 -2703337 -2747419 -2784454 -2830232 -2866246 -2902795 -2953674 -3000866 -3034270 -3052957
11905 -3052957 -3085548 -3113399 -3129321 -3153143 -3180624 -3218447 -3238693 -3251987 -3258476 -3281210 -3303228
11894 -3303228 -3321744 -3339318 -3379450 -3396697 -3404500 -3424496 -3433904 -3437758 -3449838 -3468738 -3471583 -3482472
$$ packed form
11972D79613l5688m0143m5760l3155m0746n2863n2553n7156n2369n9446o7642
11961e7908m9048n2271m5120m8731o3219p0324m9321n4123o7652n5341n4976o8346
11949g36380n9781o5036o9604o5058o6751o8243n6347n7060o8056o5058n7075
11938a434449o4827m5159m7490n7319o2767o3166o6810o2125n1258n5128n8950
11927b069448n5941m2539n8146o2185m5155m0952m1732o0674m4593m1775n0594
11916b613734m1657m7946m4082l7035m5778l6014l6549n0879m7192l3404j8687
11905c052957l2591k7851j5922k3822k7481l7823k0246j3294o489k2734k2018
11894c303228j8516j7574m0132j7247p803j9996r408l854j2080j8900k845j0889
$$ plain form
11882 -3482472 -3501574 -3520481 -3526611 -3530312 -3537570 -3545090 -3550871 -3550386 -3540343 -3538304 -3535651 -3538007 -3535617
11869 -3535617 -3540608 -3549037 -3548342 -3553962 -3567970 -3562229 -3546391 -3529270 -3522696 -3533572 -3541038 -3550602 -3544780
11856 -3544780 -3532995 -3540080 -3532641 -3511769 -3509105 -3500297 -3499200 -3497089 -3489216 -3480825 -3465100 -3459353 -3461550
11843 -3461550 -3457335 -3448701 -3441157 -3429257 -3418978 -3416904 -3401665 -3395333 -3384274 -3375082 -3367991 -3360388 -3352193
11830 -3352193 -3344649 -3339882 -3336833 -3316648 -3304223 -3288195 -3269628 -3260234 -3262079 -3255185 -3240942 -3227795
11818 -3227795 -3225168 -3221009 -3204448 -3202379 -3196931 -3195660 -3194975 -3181301 -3170851 -3149877 -3140400 -3129685 -3118643
11805 -3118643 -3106826 -3095304 -3093298 -3086038 -3073147 -3061425 -3056417 -3047023 -3032840 -3013167 -3005103 -2997538
11793 -2997538 -2989302 -2984766 -2981553 -2978872 -2978784 -2974776 -2961338 -2953325 -2936854 -2921424 -2907783 -2907072 -2899558 -2884220
$$ packed form
11882c482472j9102j8907o130l701p258p520n781M85J0043K039K653k356K390
11869c535617m991q429O95n620j4008N741J5838J7121O574j0876p466r564N822
11856c544780J1785p085P439K0872K664Q808J097K111P873Q391J5725N747k197
11843c461550M215Q634P544J1900J0279K074J5239O332J1059R192P091P603Q195
11830c352193P544M767L049K0185J2425J6028J8567R394j845O894J4243J3147
11818c227795K627M159J6561K069N448J271O85J3674J0450K0974R477J0715J1042
11805c118643J1817J1522K006P260J2891J1722N008R394J4183J9673Q064P565
11793b997538Q236M536L213K681Q8M008J3438Q013J6471J5430J3641P11P514J5338
$$ plain form
11779 -2884220 -2867340 -2844408 -2830790 -2821456 -2818871 -2816884 -2815298 -2811092 -2801566 -2786610 -2778190 -2775494 -2766109
11766 -2766109 -2755991 -2749906 -2737418 -2726815 -2712405 -2707935 -2696522 -2683320 -2689568 -2681904 -2660497 -2655301
11754 -2655301 -2646543 -2626008 -2613541 -2616856 -2619809 -2610716 -2603529 -2602858 -2590087 -2583922 -2584693 -2571790 -2554457
11741 -2554457 -2540579 -2537624 -2537450 -2537592 -2527148 -2512075 -2498842 -2487940 -2480584 -2475922 -2470806 -2460790 -2454075
11728 -2454075 -2445939 -2428369 -2411044 -2406687 -2405275 -2405254 -2410405 -2411928 -2410542 -2409822 -2395622 -2392576 -2391429 -2375732
11714 -2375732 -2368176 -2357453 -2344725 -2330367 -2323622 -2321221 -2310679 -2304390 -2282925 -2273045 -2279938 -2292414
11702 -2292414 -2283923 -2274897 -2266036 -2253217 -2237459 -2226999 -2224323 -2225835 -2209123 -2189354 -2190601 -2194209 -2189734
11689 -2189734 -2182877 -2184820 -2175147 -2171236 -2150910 -2140720 -2138312 -2123035 -2112534 -2114248 -2114931 -2111779 -2101508
$$ packed form
11779b884220J6880K2932J3618R334K585J987J586M206R526J4956Q420K696R385
11766b766109J0118O085J2488J0603J4410M470J1413J3202o248P664K1407N196
11754b655301Q758K0535J2467l315k953R093P187O71J2771O165p71J2903J7333
11741b554457J3878K955J74j42J0444J5073J3233J0902P356M662N116J0016O715
11728b454075Q136J7570J7325M357J412K1n151j523J386P20J4200L046J147J5697
11714b375732P556J0723J2728J4358O745K401J0542O289K1465R880o893j2476
11702b292414Q491R026Q861J2819J5758J0460K676j512J6712J9769j247l608M475
11689b189734O857j943R673L911K0326J0190K408J5277J0501j714o83L152J0271
$$ plain form
11676 -2101508 -2087524 -2062357 -2054201 -2057634 -2039436 -2025793 -2030599 -2036963 -2015255 -1985876 -1972513 -1958975
11664 -1958975 -1932846 -1907021 -1886761 -1870247 -1841576 -1806721 -1789622 -1796150 -1895902 -2055295 -2179610
11653 -2179610 -2234284 -2234535 -2225546 -2196134 -2170004 -2136082 -2115014 -2112660 -2097312 -2091832 -2068543 -2037172
11641 -2037172 -2018425 -2025761 -2027257 -2018539 -2018638 -1999554 -1971528 -1955313 -1947932 -1955679 -1969688 -1963046 -1947852
11628 -1947852 -1924377 -1914193 -1917809 -1919265 -1918680 -1911997 -1916662 -1914083 -1917614 -1912796 -1914217 -1897392 -1886182
11615 -1886182 -1867693 -1870286 -1867248 -1862223 -1858000 -1858814 -1852316 -1860078 -1853970 -1852073 -1836843 -1830346 -1822195 -1803833
11601 -1803833 -1805260 -1818877 -1812163 -1792934 -1784059 -1773613 -1769480 -1769395 -1759812 -1755719 -1758990 -1763936 -1771009 -1766781
11587 -1766781 -1765259 -1757095 -1755535 -1754534 -1745424 -1728563 -1727761 -1726373 -1716442 -1718960 -1722882 -1721470 -1719145 -1716193
$$ packed form
11676b101508J3984K5167Q156l433J8198J3643m806o364K1708K9379J3363J3538
11664a958975K6129K5825K0260J6514K8671L4855J7099o528r9752j59393j24315
11653b179610n4674k51Q989K9412K6130L3922K1068K354J5348N480K3289L1371
11641b037172J8747p336j496Q718r9J9084K8026J6215P381p747j4009O642J5194
11628a947852K3475J0184l616j456N85O683m665K579l531M818j421J6825J1210
11615a886182J8489k593L038N025M223q14O498p762O108J897J5230O497Q151J8362
11601a803833j427j3617O714J9229Q875J0446M133Q5R583M093l271m946p073M228
11587a766781J522Q164J560J001R110J6861Q02J388R931k518l922J412K325K952
$$ plain form
11573 -1716193 -1705764 -1699593 -1704670 -1705126 -1684588 -1672458 -1692888 -1696131 -1684496 -1682609 -1673409 -1662370 -1660568
11560 -1660568 -1646244 -1642175 -1638698 -1628795 -1615674 -1620698 -1622529 -1625961 -1626062 -1619555 -1608119 -1597222 -1606107
11547 -1606107 -1603173 -1599018 -1599347 -1604923 -1601634 -1591489 -1590837 -1587736 -1582061 -1580018 -1577174 -1569974 -1569173 -1567261
11533 -1567261 -1563637 -1558000 -1558362 -1559950 -1560409 -1555694 -1550706 -1545931 -1538686 -1539757 -1541188 -1527679 -1512456 -1497393
11519 -1497393 -1497651 -1502062 -1501074 -1510103 -1525877 -1522220 -1518704 -1513299 -1506944 -1508317 -1508699 -1505918 -1510588 -1510651 -1506596
11504 -1506596 -1501977 -1488874 -1471068 -1478142 -1464424 -1455672 -1476633 -1474272 -1459834 -1450410 -1438028 -1447768
11492 -1447768 -1443799 -1428106 -1422272 -1428209 -1427782 -1425712 -1438063 -1439537 -1438731 -1439236 -1423691 -1411839 -1418106 -1421138
11478 -1421138 -1414742 -1410062 -1403515 -1399815 -1381951 -1371268 -1370843 -1377071 -1395380 -1385577 -1383401 -1388557 -1383633
$$ packed form
11573a716193J0429O171n077m56K0538J2130k0430l243J1635J887R200J1039J802
11560a660568J4324M069L477R903J3121n024j831l432j01O507J1436J0897q885
11547a606107K934M155l29n576L289J0145O52L101N675K043K844P200Q01J912
11533a567261L624N637l62j588m59M715M988M775P245j071j431J3509J5223J5063
11519a497393k58m411R88r029j5774L657L516N405O355j373l82K781m670o3M055
11504a506596M619J3103J7806p074J3718Q752k0961K361J4438R424J2382r740
11492a447768L969J5693N834n937M27K070j2351j474Q06n05J5545J1852o267l032
11478a421138O396M680O547L700J7864J0683M25o228j8309R803K176n156M924
$$ plain form
11465 -1383633 -1375845 -1353266 -1349924 -1362299 -1370609 -1361067 -1365401 -1365762 -1352460 -1343973 -1337188 -1340921 -1342529
11452 -1342529 -1336822 -1336002 -1329159 -1319552 -1319934 -1318996 -1308671 -1313692 -1318091 -1316321 -1295308 -1288866 -1289602 -1284446
11438 -1284446 -1278770 -1274641 -1277965 -1283818 -1276132 -1270814 -1272322 -1275453 -1275035 -1262449 -1260136 -1261047 -1252001 -1248700
11424 -1248700 -1247686 -1235447 -1233339 -1229378 -1240707 -1241523 -1220522 -1239465 -1252417 -1237338 -1231416 -1225316 -1226675
11411 -1226675 -1230942 -1225039 -1232214 -1240585 -1230140 -1220190 -1220206 -1231477 -1230911 -1221222 -1207934 -1208671 -1211416 -1222589
11397 -1222589 -1220258 -1216997 -1214116 -1202929 -1195656 -1188779 -1191313 -1193882 -1193620 -1197256 -1191565 -1187145 -1187467 -1177718
11383 -1177718 -1168313 -1161869 -1172453 -1167523 -1155730 -1155558 -1155617 -1163096 -1162401 -1151049 -1150269 -1144723 -1143840 -1142300 -1128989
11368 -1128989 -1115033 -1110691 -1122158 -1126670 -1127118 -1120944 -1119497 -1103627 -1100895 -1118554 -1125331 -1117455 -1094937
$$ packed form
11465a383633P788K2579L342j2375q310R542m334l61J3302Q487O785l733j608
11452a342529N707Q20O843R607l82R38J0325n021m399J770K1013O442p36N156
11438a284446N676M129l324n853P686N318j508l131M18J2586K313r11R046L301
11424a248700J014J2239K108L961j1329q16K1001j8943j2952J5079N922O100j359
11411a226675m267N903p175q371J0445R950j6j1271N66R689J3288p37k745j1173
11397a222589K331L261K881J1187P273O877k534k569K62l636N691M420l22R749
11383a177718R405O444j0584M930J1793J72n9p479O95J1352P80N546Q83J540J3311
11368a128989J3956M342j1467m512m48O174J447J5870K732j7659o777P876K2518
$$ plain form
11355 -1094937 -1074330 -1081451 -1094529 -1102438 -1105255 -1115776 -1118297 -1110511 -1112533 -1103631 -1101532 -1103962 -1106384
11342 -1106384 -1103291 -1093245 -1078148 -1069889 -1068765 -1079579 -1080770 -1058287 -1036981 -1043090 -1050608 -1048288 -1055986
11329 -1055986 -1064551 -1053851 -1042278 -1034483 -1041841 -1039501 -1034938 -1029842 -1033358 -1035499 -1036807 -1040153 -1027359
11316 -1027359 -1033603 -1036280 -1030402 -1023416 -1017339 -1014485 -1016609 -1016917 -1003988 -999524 -1013297 -1021001 -1013962 -1018074
11302 -1018074 -1017845 -998101 -992693 -999168 -991691 -986703 -990347 -991418 -991860 -985270 -979956 -986869 -982798 -990766
11288 -990766 -991275 -987326 -974682 -972718 -956965 -955486 -954614 -944174 -941234 -934358 -930402 -931690 -936415 -942488
11274 -942488 -955024 -950950 -945722 -932443 -931254 -923130 -914130 -915476 -922257 -929661 -918836 -919903 -938085
11261 -938085 -951482 -940845 -938848 -934392 -930668 -921022 -915919 -911582 -895467 -886437 -888427 -880590 -874836
$$ packed form
11355a094937K0607p121j3078p909k817j0521k521P786k022Q902K099k430k422
11342a106384L093J0046J5097Q259J124j0814j191K2483K1306o109p518K320p698
11329a055986q565J0700J1573P795p358K340M563N096l516k141j308l346J2794
11316a027359o244k677N878O986O077K854k124l08J2929M464j3773p704P039m112
11302a018074K29J9744N408o475P477M988l644j071m42O590N314o913M071p968
11288i90766n09L949J2644J964J5753J479Q72J0440K940O876L956j288m725o073
11274i42488j2536M074N228J3279J189Q124R000j346o781p404J0825j067j8182
11261i38085j3397J0637J997M456L724R646N103M337J6115R030j990P837N754
$$ plain form
11248 -874836 -868626 -870276 -879222 -878887 -888466 -889818 -877959 -872172 -868766 -856908 -857891 -868525 -870201 -857106
11234 -857106 -858334 -852188 -853047 -853773 -843734 -846668 -859922 -866277 -862487 -855013 -846480 -847073 -858199 -845367
11220 -845367 -833188 -838187 -839531 -832627 -827979 -826683 -829351 -832390 -826713 -831454 -825380 -839208 -850457
11207 -850457 -837350 -831837 -835454 -844632 -835755 -826000 -816517 -814391 -821718 -826917 -811581 -813968 -811420 -806380
11193 -806380 -799778 -794755 -792585 -780119 -777978 -787090 -786728 -780717 -779938 -773644 -774978 -772176 -775850 -784935
11179 -784935 -768787 -760298 -768452 -775548 -765185 -756824 -755017 -761180 -763037 -745299 -742909 -742857 -737846 -724177
11165 -724177 -715820 -720766 -723338 -722674 -724160 -718960 -712040 -714903 -723973 -724451 -727049 -732715 -730136 -720673 -719790
11150 -719790 -707077 -702515 -705285 -707182 -701173 -698230 -685642 -694397 -709747 -702700 -700294 -706496 -707850
$$ packed form
11248h74836O210j650q946L35r579j352J1859N787L406J1858r83j0634j676J3095
11234h57106j228O146q59p26J0039k934j3254o355L790P474Q533n93j1126J2832
11220h45367J2179m999j344O904M648J296k668l039N677m741O074j3828j1249
11207h50457J3107N513l617r178Q877R755R483K126p327n199J5336k387K548N040
11193h06380O602N023K170J2466K141r112L62O011P79O294j334K802l674r085
11179g84935J6148Q489q154p096J0363Q361J807o163j857J7738K390N2N011J3669
11165g24177Q357m946k572O64j486N200O920k863r070m78k598n666K579R463Q83
11150g19790J2713M562k770j897O009K943J2588q755j5350P047K406o202j354
$$ plain form
11137 -707850 -703895 -686616 -677562 -682102 -687726 -680630 -679811 -687059 -678362 -674174 -668213 -657315 -668603 -676706
11123 -676706 -668527 -669020 -655093 -643741 -648675 -662228 -661902 -655339 -642223 -617961 -622967 -621796 -610184
11110 -610184 -614799 -611822 -613341 -608114 -601450 -605560 -603770 -604363 -611249 -603395 -599740 -607133 -611292 -613217
11096 -613217 -615845 -608616 -585252 -589721 -586259 -575559 -573599 -576112 -576727 -576106 -568383 -560559 -561538 -552337
11082 -552337 -545383 -546325 -551190 -554707 -550926 -541752 -535315 -532107 -531354 -529102 -530457 -537238 -539462 -531562 -517686
11067 -517686 -506666 -502680 -502873 -500617 -512536 -500820 -489982 -486116 -490636 -488052 -482812 -475666 -454661
11054 -454661 -441494 -437621 -422648 -412222 -412062 -421428 -420929 -415199 -413738 -420275 -442371 -446087 -421847
11041 -421847 -403080 -403650 -402025 -393277 -388867 -405122 -435698 -452702 -465535 -467497 -459562 -449777 -440432
$$ packed form
11137g07850L955J7279R054m540n624P096Q19p248Q697M188N961J0898j1288q103
11123f76706Q179m93J3927J1352m934j3553L26O563J3116K4262n006J171J1612
11110f10184m615K977j519N227O664m110J790n93o886P854L655p393m159j925
11096f13217k628P229K3364m469L462J0700J960k513o15O21P723P824r79R201
11082e52337O954r42m865l517L781R174O437L208P53K252j355o781k224P900J3876
11067e17686J1020L986j93K256j1919J1716J0838L866m520K584N240P146K1005
11054d54661J3167L873J4973J0426J60r366M99N730J461o537k2096l716K4240
11041d21847J8767n70J625Q748M410j6255l0576j7004j2833j962P935R785R345
$$ plain form
11028 -440432 -430048 -423719 -416922 -420819 -436872 -475805 -512165 -530329 -519726 -514775 -500303 -503019
11016 -503019 -509835 -521785 -508125 -490635 -492147 -505981 -504559 -503701 -507586 -498221 -490811 -479825 -469937
11003 -469937 -465084 -461027 -474248 -472957 -472771 -489946 -487039 -484423 -472602 -463554 -468021 -466565 -447316
10990 -447316 -434223 -430656 -432359 -433887 -425495 -421358 -422339 -411432 -386651 -383214 -389035 -385432 -386073 -390372
10976 -390372 -394259 -398991 -394434 -388945 -402207 -397487 -391565 -385665 -366213 -357682 -359907 -345762 -344943 -339761
10962 -339761 -340367 -346956 -346033 -328593 -312267 -323546 -331291 -337081 -329588 -310535 -301888 -294068 -297344 -306996
10948 -306996 -298477 -293656 -283672 -274178 -265495 -260648 -273425 -288620 -292667 -286175 -272036 -267957 -271335
10935 -271335 -273609 -249791 -247558 -268517 -275733 -260363 -237604 -235160 -234159 -229718 -235359 -225082 -221633
$$ packed form
11028d40432J0384O329O797l897j6053l8933l6360j8164J0603M951J4472k716
11016e03019o816j1950J3660J7490j512j3834J422Q58l885R365P410J0986R888
11003d69937M853M057j3221J291J86j7175K907K616J1821R048m467J456J9249
10990d47316J3093L567j703j528Q392M137r81J0907K4781L437n821L603o41m299
10976c90372l887m732M557N489j3262M720N922N900J9452Q531k225J4145Q19N182
10962c39761o06o589R23J7440J6326j1279p745n790P493J9053Q647P820l276r652
10948c06996Q519M821R984R494Q683M847j2777j5195m047O492J4139M079l378
10935b71335k274K3818K233k0959p216J5370K2759K444J001M441n641J0277L449
$$ plain form
10922 -221633 -212783 -200949 -196513 -190004 -190213 -200984 -212313 -197127 -190898 -175908 -161148 -153973 -168909
10909 -168909 -173476 -169046 -164421 -166912 -162400 -152187 -142406 -128137 -115700 -122825 -118086 -110192 -129136
10896 -129136 -126482 -112416 -112249 -112775 -107269 -101762 -93352 -76388 -77188 -78253 -78883 -66431 -63375 -55586
10882 -55586 -41880 -29370 -24562 -32097 -39478 -51655 -55260 -45156 -28685 -21358 -2276 -2170 -1171
10869 -1171 8750 17627 10604 14796 17667 19189 28610 32369 48417 35993 26111 37741 39996 29673
10855 29673 38690 63821 67567 65437 62318 71950 86337 88192 85153 91999 100299 108577 118130 113945
10841 113945 109588 120811 125295 117304 124798 140125 160937 171538 160343 155569 165387 165242 157700
10828 157700 157125 173432 179757 179834 181603 193891 220235 234710 237222 241902 218502 212819 227494
$$ packed form
10922b21633Q850J1834M436O509k09j0771j1329J5186O229J4990J4760P175j4936
10909a68909m567M430M625k491M512J0213R781J4269J2437p125M739P894j8944
10896a29136K654J4066J67n26N506N507Q410J6964q00j065o30J2452L056P789
10882e5586J3706J2510M808p535p381j2177l605J0104J6471P327J9082J06R99
10869a171R921Q877p023M192K871J522R421L759J6048j2424r882J1630K255j0323
10855B9673R017K5131L746k130l119R632J4387J855l039O846Q300Q278R553m185
10841A13945m357J1223M484p991P494J5327K0812J0601j1195m774R818j45p542
10828A57700n75J6307O325P7J769J2288K6344J4475K512M680k3400n683J4675
$$ plain form
10815 227494 238510 249957 256044 261141 283430 301315 303275 304859 311857 319972 317188 320431 344073
10802 344073 362814 363069 368163 372936 376699 391523 401826 409689 403877 407506 420320 432779 437878
10789 437878 433628 445314 463556 468116 482117 509990 515605 510427 503517 496493 502182 506007 518414
10776 518414 545109 561282 569254 587184 606369 610855 615954 616398 635850 639453 653106 661982 663627
10763 663627 667661 662494 680278 703034 711720 724515 719454 729638 751076 772397 785327 794331
10751 794331 791766 791007 792773 821097 850463 857576 865573 868227 872852 884752 908422 933128 951676
10738 951676 965469 988161 990370 997611 1011849 1019557 1034542 1036240 1049108 1073807 1101042 1137347
10726 1137347 1152726 1157774 1180279 1206042 1230201 1236452 1252614 1272139 1275433 1292026 1309424 1318551
$$ packed form
10815B27494J1016J1447O087N097K2289J7885J960J584O998Q115k784L243K3642
10802C44073J8741K55N094M773L763J4824J0303P863n812L629J2814J2459N099
10789D37878m250J1686J8242M560J4001K7873N615n178o910p024N689L825J2407
10776E18414K6695J6173P972J7930J9185M486N099M44J9452L603J3653Q876J645
10763F63627M034n167J7784K2756Q686J2795n061J0184K1438K1321J2930R004
10751G94331k565p59J766K8324K9366P113P997K654M625J1900K3670K4706J8548
10738I51676J3793K2692K209P241J4238P708J4985J698J2868K4699K7235L6305
10726A137347J5379N048K2505K5763K4159O251J6162J9525L294J6593J7398R127
$$ plain form
10714 1318551 1330526 1355676 1374205 1404203 1436233 1456112 1461902 1490714 1511555 1536746 1557173
10703 1557173 1577696 1601055 1632807 1659580 1677810 1705809 1734908 1765086 1785312 1809507 1836565
10692 1836565 1854143 1876555 1908519 1952931 1993204 2031188 2061120 2093106 2137922 2186303 2234120
10681 2234120 2275907 2304084 2327793 2363982 2408231 2448866 2495270 2540904 2587060 2635521 2685557
10670 2685557 2721248 2762974 2816595 2887688 2957317 3002724 3050125 3130459 3208699 3274380 3338891
10659 3338891 3406555 3484275 3558654 3634566 3712597 3788118 3860203 3953757 4047865 4148314 4250212
10648 4250212 4358507 4483969 4612400 4732609 4868845 5008708 5154758 5301562 5476337
10639 5476337 5668649 5860077 6057717 6270914 6486258 6703925 6920115 7162731 7427639
$$ packed form
10714A318551J1975K5150J8529K9998L2030J9879N790K8812K0841K5191K0427
10703A557173K0523K3359L1752K6773J8230K7999K9099L0178K0226K4195K7058
10692A836565J7578K2412L1964M4412M0273L7984K9932L1986M4816M8381M7817
10681B234120M1787K8177K3709L6189M4249M0635M6404M5634M6156M8461N0036
10670B685557L5691M1726N3621P1093O9629M5407M7401Q0334P8240O5681O4511
10659C338891O7664P7720P4379P5912P8031P5521P2085R3554R4108J00449J01898
10648D250212J08295J25462J28431J20209J36236J39863J46050J46804J74775
10639E476337J92312J91428J97640K13197K15344K17667K16190K42616K64908
$$ plain form
10630 7427639 7756759 8122922 8531292 8994675 9501783 10083175 10720180 11390324 12086621
10621 12086621 12763702 13315546 13526890 13181242 12250277 11039804 10060712 9680188 9959505
10612 9959505 10744521 11841414 13101491 14311148 15154367 15101190 13578005 10549927 6953788
10603 6953788 4164350 2951660 3168352 4292403 5862909 7555618 9004258 9706904
10595 9706904 8927771 5941230 872059 -4734038 -8870165 -10682201 -10594081 -9465217 -7919564
10586 -7919564 -6320096 -4982932 -4312652 -4794404 -6835203 -10170733 -13654814 -16001908
10578 -16001908 -16718796 -16238511 -15176194 -13956667 -12808642 -11894282 -11394039 -11470681 -12175531
10569 -12175531 -13329398 -14473147 -15147324 -15202122 -14786208 -14156596 -13481892 -12806477 -12166972
$$ packed form
10630G427639L29120L66163M08370M63383N07108N81392O37005O70144O96297
10621A2086621O77081N51844K11344l45648r30965j210473r79092l80524K79317
10612I959505P85016J096893J260077J209657Q43219n3177j523185l028078l596139
10603F953788k789438j212690K16692J124051J570506J692709J448640P02646
10595I706904p79133k986541n069171n606097m136127j812036Q8120J128864J545653
10586g919564J599468J337164O70280m81752k040799l335530l484081k347094
10578a6001908p16888M80285J062317J219527J148025R14360N00243p6642p04850
10569a2175531j153867j143749o74177n4798M15914O29612O74704O75415O39505
$$ plain form
10560 -12166972 -11582178 -11068170 -10608425 -10195801 -9832245 -9492684 -9177267 -8892688 -8610834
10551 -8610834 -8352874 -8119556 -7902405 -7692756 -7505449 -7322898 -7162694 -7000179 -6837289
10542 -6837289 -6679470 -6526597 -6410065 -6287548 -6177988 -6069937 -5968125 -5864093 -5774999 -5680011
10532 -5680011 -5593531 -5498278 -5397603 -5323987 -5258519 -5186058 -5100547 -5018470 -4952680 -4880614 -4821667
10521 -4821667 -4768451 -4711649 -4650163 -4603607 -4553157 -4497398 -4452756 -4404814 -4359746 -4317734 -4271110
10510 -4271110 -4225704 -4176694 -4132987 -4091651 -4046205 -3993679 -3959198 -3923335 -3880741 -3842682 -3805832
10499 -3805832 -3769714 -3732957 -3711665 -3685822 -3654179 -3628890 -3591368 -3558340 -3528598 -3497582 -3473065
10488 -3473065 -3451689 -3423880 -3403112 -3391551 -3373908 -3349468 -3318961 -3298885 -3276791 -3252557 -3219370
$$ packed form
10560a2166972N84794N14008M59745M12624L63556L39561L15417K84579K81854
10551h610834K57960K33318K17151K09649J87307J82551J60204J62515J62890
10542f837289J57819J52873J16532J22517J09560J08051J01812J04032Q9094R4988
10532e680011Q6480R5253J00675P3616O5468P2461Q5511Q2077O5790P2066N8947
10521d821667N3216N6802O1486M6556N0450N5759M4642M7942M5068M2012M6624
10510d271110M5406M9010M3707M1336M5446N2526L4481L5863M2594L8059L6850
10499c805832L6118L6757K1292K5843L1643K5289L7522L3028K9742L1016K4517
10488c473065K1376K7809K0768J1561J7643K4440L0507K0076K2094K4234L3187
$$ plain form
10477 -3219370 -3192777 -3180989 -3155451 -3129119 -3123931 -3096399 -3083978 -3066466 -3055052 -3028363 -3005115
10466 -3005115 -2971699 -2957331 -2944793 -2934843 -2924697 -2902828 -2889081 -2881937 -2860240 -2837918 -2814999 -2804092
10454 -2804092 -2779075 -2769139 -2749554 -2732072 -2723057 -2727013 -2719350 -2702684 -2688145 -2666633 -2642368 -2624720
10442 -2624720 -2617270 -2602488 -2589451 -2578826 -2574652 -2567644 -2553811 -2534303 -2509076 -2503254 -2484526 -2464352
10430 -2464352 -2458797 -2459174 -2456686 -2454781 -2444993 -2426993 -2421877 -2406754 -2390591 -2380159 -2362157 -2343101 -2330561
10417 -2330561 -2337055 -2326105 -2320496 -2321911 -2324207 -2317150 -2296972 -2278963 -2277852 -2248269 -2238171 -2233907 -2226964
10404 -2226964 -2217000 -2202099 -2201159 -2208762 -2202364 -2194166 -2180548 -2168377 -2161714 -2150506 -2138627 -2138011 -2132750
10391 -2132750 -2127238 -2118266 -2103781 -2096950 -2097980 -2091740 -2091129 -2093498 -2081265 -2074597 -2065983 -2049046 -2041592
$$ packed form
10477c219370K6593J1788K5538K6332N188K7532J2421J7512J1414K6689K3248
10466c005115L3416J4368J2538R950J0146K1869J3747P144K1697K2322K2919J0907
10454b804092K5017R936J9585J7482R015l956P663J6666J4539K1512K4265J7648
10442b624720P450J4782J3037J0625M174P008J3833J9508K5227N822J8728K0174
10430b464352N555l77K488J905R788J8000N116J5123J6163J0432J8002J9056J2540
10417b330561o494J0950N609j415k296P057K0178J8009J111K9583J0098M264O943
10404b226964R964J4901R40p603O398Q198J3618J2171O663J1208J1879O16N261
10391b132750N512Q972J4485O831j030O240O11k369J2233O668Q614J6937P454
$$ plain form
10378 -2041592 -2037813 -2018737 -2000275 -2002378 -2008603 -2009707 -2007486 -1986539 -1978834 -1974270 -1962684 -1941890 -1933057
10365 -1933057 -1934118 -1941607 -1941683 -1935573 -1926473 -1920609 -1915393 -1902448 -1898620 -1903844 -1907345 -1900486 -1894639 -1880490
10351 -1880490 -1870883 -1872008 -1878492 -1865563 -1852480 -1856510 -1858509 -1839008 -1832528 -1819954 -1809619 -1806444 -1810435
10338 -1810435 -1825881 -1835486 -1823933 -1805406 -1803420 -1791084 -1791647 -1779795 -1772974 -1781610 -1785572 -1788475 -1773141
10325 -1773141 -1753370 -1754021 -1754174 -1757218 -1763239 -1766462 -1754575 -1744385 -1743556 -1734619 -1734109 -1737538 -1736251 -1730215
10311 -1730215 -1711632 -1696294 -1706768 -1708143 -1696340 -1692157 -1692880 -1674744 -1660809 -1663120 -1671443 -1665661 -1656508
10298 -1656508 -1649284 -1648766 -1649821 -1645392 -1635470 -1627244 -1617823 -1617318 -1609236 -1610980 -1626528 -1619013 -1601138 -1598336
10284 -1598336 -1596026 -1599860 -1603235 -1594537 -1582696 -1582171 -1593996 -1593711 -1590984 -1590391 -1594328 -1597084 -1585172 -1580844
$$ packed form
10378b041592L779J9076J8462k103o225j104K221K0947P705M564J1586K0794Q833
10365a933057j061p489p6O110R100N864N216J2945L828n224l501O859N847J4149
10351a880490R607j125o484J2929J3083m030j999J9501O480J2574J0335L175l991
10338a810435j5446r605J1553J8527J986J2336n63J1852O821q636l962k903J5334
10325a773141J9771o51j53l044o021l223J1887J0190Q29Q937N10l429J287O036
10311a730215J8583J5338j0474j375J1803M183p23J8136J3935k311q323N782R153
10298a656508P224N18j055M429R922Q226R421N05Q082j744j5548P515J7875K802
10284a598336K310l834l375Q698J1841N25j1825K85K727N93l937k756J1912M328
$$ plain form
10270 -1580844 -1574309 -1572432 -1573661 -1580141 -1570745 -1556462 -1562089 -1569549 -1557162 -1548428 -1538706 -1530381 -1523056
10257 -1523056 -1506709 -1508201 -1532919 -1539021 -1539124 -1528574 -1527874 -1525605 -1520155 -1516896 -1506731 -1514272 -1518416
10244 -1518416 -1510358 -1506210 -1512215 -1499988 -1496937 -1499014 -1491455 -1481504 -1475681 -1463931 -1455438 -1443274 -1441180
10231 -1441180 -1443870 -1450501 -1452399 -1448669 -1448458 -1452701 -1453535 -1440674 -1437607 -1444867 -1443084 -1443964 -1439335 -1423988
10217 -1423988 -1417881 -1417678 -1429544 -1423481 -1413679 -1420723 -1419271 -1404309 -1394692 -1390657 -1382398 -1379925 -1371218 -1370205
10203 -1370205 -1369394 -1373338 -1368272 -1359783 -1365568 -1367868 -1363759 -1365382 -1365237 -1369804 -1369450 -1342617 -1324016 -1320858
10189 -1320858 -1312244 -1296432 -1294211 -1290078 -1279035 -1282346 -1281952 -1280502 -1278043 -1290469 -1300941 -1310575 -1305131
10176 -1305131 -1303598 -1292855 -1273528 -1280394 -1280986 -1268672 -1275117 -1288110 -1300050 -1316442 -1320487 -1315502 -1314778
$$ packed form
10270a580844O535J877j229o480R396J4283n627p460J2387Q734R722Q325P325
10257a523056J6347j492k4718o102j03J0550P00K269N450L259J0165p541m144
10244a518416Q058M148o005J2227L051k077P559R951N823J1750Q493J2164K094
10231a441180k690o631j898L730K11m243q34J2861L067p260J783q80M629J5347
10217a423988O107K03j1866O063R802p044J452J4962R617M035Q259K473Q707J013
10203a370205Q11l944N066Q489n785k300M109j623J45m567L54K6833J8601L158
10189a320858Q614J5812K221M133J1043l311L94J450K459j2426j0472r634N444
10176a305131J533J0743J9327o866n92J2314o445j2993j1940j6392m045M985P24
$$ plain form
10163 -1314778 -1312339 -1314440 -1302380 -1293031 -1284444 -1290919 -1311707 -1344983 -1368574 -1374651 -1389710 -1390590 -1379755
10150 -1379755 -1358545 -1344256 -1321891 -1310630 -1309423 -1317686 -1342890 -1374645 -1383772 -1380716 -1379162 -1375390
10138 -1375390 -1355324 -1342996 -1336725 -1332113 -1327028 -1335872 -1341129 -1340861 -1340139 -1349684 -1346715 -1344679 -1342089 -1340256
10124 -1340256 -1343597 -1343540 -1325994 -1300331 -1295745 -1295440 -1293561 -1293786 -1300586 -1303284 -1287639 -1277308 -1285132 -1288003
10110 -1288003 -1282147 -1294094 -1295920 -1295104 -1291394 -1293367 -1290021 -1274124 -1268138 -1279540 -1276927 -1274388 -1254890
10097 -1254890 -1251279 -1254895 -1264600 -1262618 -1254517 -1237754 -1230785 -1233684 -1238277 -1241816 -1251757 -1256339 -1259139 -1248408
10083 -1248408 -1247861 -1246610 -1245732 -1234252 -1226617 -1230537 -1230567 -1230494 -1224586 -1231361 -1235129 -1232266 -1222124 -1229129 -1227432
10068 -1227432 -1229120 -1231834 -1234484 -1223669 -1211054 -1208190 -1205501 -1209781 -1212869 -1208903 -1210960 -1209821 -1208009
$$ packed form
10163a314778K439k101J2060R349Q587o475k0788l3276k3591o077j5059q80J0835
10150a379755K1210J4289K2365J1261J207q263k5204l1755r127L056J554L772
10138a375390K0066J2328O271M612N085q844n257K68P22r545K969K036K590J833
10124a340256l341N7J7546K5663M586L05J879k25o800k698J5645J0331p824k871
10110a288003N856j1947j826Q16L710j973L346J5897N986j1402K613K539J9498
10097a254890L611l616r705J982Q101J6763O969k899m593l539r941m582k800J0731
10083a248408N47J251Q78J1480P635l920l0P3N908o775l768K863J0142p005J697
10068a227432j688k714k650J0815J2615K864K689m280l088L966k057J139J812
$$ plain form
10055 -1208009 -1202221 -1198037 -1195906 -1195547 -1184525 -1187478 -1192814 -1190922 -1210463 -1205516 -1181913 -1162934 -1167362
10042 -1167362 -1176632 -1186139 -1182704 -1179032 -1173034 -1172887 -1172929 -1160858 -1161788 -1170773 -1175134 -1160176 -1155159 -1161877
10028 -1161877 -1160248 -1136307 -1140441 -1150079 -1164280 -1169099 -1157291 -1145979 -1142539 -1139864 -1146194 -1144208 -1146852
10015 -1146852 -1148265 -1139962 -1127262 -1117256 -1126133 -1135622 -1127458 -1114346 -1119996 -1117925 -1130697 -1138208 -1139112
10002 -1139112 -1140319 -1140082 -1139341 -1129797 -1127285 -1117475 -1119769 -1125008 -1127008 -1126660 -1117465 -1113485 -1115970 -1101865
9988 -1101865 -1104369 -1114468 -1126706 -1126304 -1112013 -1094315 -1088799 -1081726 -1096751 -1098285 -1091651 -1104284 -1108867
9975 -1108867 -1103610 -1101389 -1110175 -1106418 -1102632 -1102356 -1095839 -1088804 -1083272 -1074591 -1088226 -1100521 -1097840 -1086094
9961 -1086094 -1079943 -1081695 -1077762 -1077788 -1074006 -1069906 -1075458 -1078005 -1077120 -1079302 -1082627 -1077798 -1068455 -1069030 -1064494
$$ packed form
10055a208009N788M184K131L59J1022k953n336J892j9541M947K3603J8979m428
10042a167362r270r507L435L672N998J47m2J2071r30q985m361J4958N017o718
10028a161877J629K3941m134r638j4201m819J1808J1312L440K675o330J986k644
10015a146852j413Q303J2700J0006q877r489Q164J3112n650K071j2772p511r04
10002a139112j207K37P41R544K512R810k294n239k000L48R195L980k485J4105
9988a101865k504j0099j2238M02J4291J7698N516P073j5025j534O634j2633m583
9975a108867N257K221q786L757L786K76O517P035N532Q681j3635j2295K681J1746
9961a086094O151j752L933k6L782M100n552k547Q85k182l325M829R343n75M536
$$ plain form
9946 -1064494 -1057390 -1053377 -1054085 -1050842 -1048814 -1052661 -1053820 -1066559 -1061432 -1060912 -1066882 -1070456 -1068427 -1064052
9932 -1064052 -1071337 -1079564 -1076609 -1063709 -1056546 -1061011 -1058325 -1063466 -1063529 -1061656 -1065899 -1064509 -1071520 -1067403
9918 -1067403 -1054711 -1041045 -1043917 -1026106 -1024726 -1031141 -1042141 -1037409 -1033802 -1035863 -1042140 -1020002 -1014988
9905 -1014988 -1022446 -1032036 -1041954 -1048093 -1042123 -1045324 -1041158 -1052912 -1067431 -1043875 -1021860 -1022940 -1030410
9892 -1030410 -1028645 -1017070 -1016418 -1019041 -1013149 -1032347 -1030759 -1022382 -1020566 -1008215 -1000917 -1013784 -1023910
9879 -1023910 -1018688 -1028270 -1024308 -1009654 -1008854 -1017494 -1017349 -1010671 -1013089 -1011213 -1009815 -1014313 -1019083 -1016705
9865 -1016705 -1017574 -1012345 -999462 -988665 -988503 -976105 -979519 -982100 -985498 -995029 -986849 -974189 -987296
9852 -987296 -996356 -994806 -985077 -980647 -977355 -982293 -978099 -968763 -969787 -967693 -967999 -969477 -981644 -979503
$$ packed form
9946a064494P104M013p08L243K028l847j159j2739N127N20n970l574K029M375
9932a064052p285q227K955J2900P163m465K686n141o3J873m243J390p011M117
9918a067403J2692J3666k872J7811J380o415j1000M732L607k061o277K2138N014
9905a014988p458r590r918o139N970l201M166j1754j4519K3556K2015j080p470
9892a030410J765J1575O52k623N892j9198J588Q377J816J2351P298j2867j0126
9879a023910N222r582L962J4654Q00q640J45O678k418J876J398m498m770K378
9865a016705q69N229J2883J0797J62J2398l414k581l398r531Q180J2660j3107
9852i87296r060J550R729M430L292m938M194R336j024K094l06j478j2167K141
$$ plain form
9838 -979503 -990798 -994295 -987526 -972391 -970427 -983372 -995087 -994660 -992477 -984949 -974623 -974814 -974142 -978838
9824 -978838 -975777 -961254 -955487 -951572 -958949 -961834 -964181 -970106 -967423 -952007 -961140 -980531 -980404 -975569
9810 -975569 -974263 -965241 -961398 -966722 -974848 -963660 -954847 -962645 -968496 -963056 -964541 -959590 -970175 -971262
9796 -971262 -966058 -958490 -954267 -957734 -951349 -950406 -948691 -939726 -929351 -927901 -935818 -943993 -944890 -937358 -932818
9781 -932818 -934165 -934108 -930146 -934146 -928028 -923743 -924900 -935216 -932007 -930762 -937742 -946945 -949254 -942176 -935356
9766 -935356 -938484 -938631 -947742 -952743 -943395 -946177 -952859 -939814 -929439 -927107 -929952 -938505 -930809 -919427
9752 -919427 -928957 -936351 -932123 -925830 -907437 -897655 -912075 -914528 -922864 -931987 -931520 -934302 -939939 -933798
9738 -933798 -928770 -918017 -907562 -913067 -921449 -920705 -923024 -926587 -926670 -922049 -915707 -921531 -927261 -919658 -915265
$$ packed form
9838i79503j1295l497O769J5135J964j2945j1715M27K183P528J0326j91O72m696
9824i78838L061J4523N767L915p377k885k347n925K683J5416r133j9391J27M835
9810i75569J306R022L843n324q126J1188Q813p798n851N440j485M951j0585j087
9796i71262N204P568M223l467O385R43J715Q965J0375J450p917q175q97P532M540
9781i32818j347N7L962m000O118M285j157j0316L209J245o980r203k309P078O820
9766i35356l128j47r111n001R348k782o682J3045J0375K332k845q553P696J1382
9752i19427r530p394M228O293J8393R782j4420k453q336r123M67k782n637O141
9738i33798N028J0753J0455n505q382P44k319l563q3M621O342n824n730P603M393
$$ plain form
9723 -915265 -902630 -893619 -899654 -899894 -904527 -907045 -914327 -916633 -914250 -909640 -898453 -894135 -903674 -894291
9709 -894291 -889118 -888411 -878984 -885570 -880014 -867089 -873800 -895304 -896206 -902788 -897162 -895276 -911753 -908460
9695 -908460 -902873 -901020 -902755 -913510 -917837 -906062 -897209 -882954 -878653 -889488 -900678 -904211 -895367
9682 -895367 -885746 -887847 -883308 -886771 -887877 -897396 -897078 -890867 -882197 -876130 -897046 -897647 -890134 -885797 -894846
9667 -894846 -902345 -895558 -898202 -891757 -880281 -874416 -870634 -881651 -887917 -881729 -880049 -882436 -874035 -875793
9653 -875793 -882767 -880008 -884015 -884137 -886721 -888801 -888250 -898919 -890683 -880681 -885535 -894456 -893418 -895864
9639 -895864 -894908 -893756 -894158 -876954 -871360 -874256 -863320 -858131 -868249 -870007 -857674 -849440 -864491 -863201
9625 -863201 -858575 -855315 -854044 -871025 -874729 -868595 -866414 -873301 -869753 -867897 -870164 -859749 -853661 -858134
$$ packed form
9723i15265J2635R011o035k40m633k518p282k306K383M610J1187M318r539R383
9709h94291N173P07R427o586N556J2925o711k1504r02o582N626J886j6477L293
9695i08460N587J853j735j0755m327J1775Q853J4255M301j0835j1190l533Q844
9682h95367R621k101M539l463j106r519L18O211Q670O067k0916o01P513M337r049
9667h94846p499O787k644O445J1476N865L782j1017o266O188J680k387Q401j758
9653h75793o974K759m007j22k584k080N51j0669Q236J0002m854q921J038k446
9639h95864R56J152m02J7204N594k896J0936N189j0118j758J2333Q234j5051J290
9625h63201M626L260J271j6981l704O134K181o887L548J856k267J0415O088m473
$$ plain form
9611 -858134 -853961 -857762 -851296 -849330 -863332 -849811 -837330 -843526 -842304 -843364 -843825 -862378 -863109 -853222
9597 -853222 -858268 -867084 -864941 -865067 -863170 -855802 -852272 -847735 -853239 -847338 -837766 -843427 -842113 -843664 -844324
9582 -844324 -842918 -839957 -835261 -839192 -841637 -835198 -830217 -834659 -836940 -844852 -842070 -834327 -835686 -829436
9568 -829436 -820576 -831110 -831321 -831454 -841513 -831301 -811296 -807685 -809186 -823297 -823159 -817941 -820238 -815448
9554 -815448 -808873 -816602 -820395 -815704 -812957 -821946 -821468 -822300 -819496 -807046 -807684 -814202 -811188 -813722 -813395
9539 -813395 -814164 -808998 -812770 -824150 -816007 -816092 -811765 -810983 -816178 -815108 -825418 -823200 -817640 -811514 -816366
9524 -816366 -805236 -796365 -791268 -793897 -806236 -815555 -819171 -815771 -812969 -818282 -809018 -813313 -815899 -810935
9510 -810935 -797651 -802251 -800475 -807969 -807475 -800232 -791885 -786835 -779739 -782100 -784780 -795122 -802952 -805824
$$ packed form
9611h58134M173l801O466J966j4002J3521J2481o196J222j060m61j8553p31R887
9597h53222n046q816K143j26J897P368L530M537n504N901R572n661J314j551o60
9582h44324J406K961M696l931k445O439M981m442k281p912K782P743j359O250
9568h29436Q860j0534k11j33j0059J0212K0005L611j501j4111J38N218k297M790
9554h15448O575p729l793M691K747q989M78q32K804J2450o38o518L014k534L27
9539h13395p69N166l772j1380Q143q5M327P82n195J070j0310K218N560O126m852
9524h16366J1130Q871N097k629j2339r319l616L400K802n313R264m295k586M964
9510h10935J3284m600J776p494M94P243Q347N050P096k361k680j0342p830k872
$$ plain form
9496 -805824 -793722 -788806 -791666 -803976 -815793 -818200 -808036 -807594 -814875 -811345 -810598 -826491 -832436 -819397
9482 -819397 -811577 -810792 -813310 -808623 -808404 -819297 -817790 -812122 -804132 -802923 -802923 -801350 -793665 -775496 -787214
9467 -787214 -796797 -802706 -815045 -788917 -782463 -798817 -803255 -785650 -788418 -801438 -800831 -792291 -784099
9454 -784099 -782208 -786400 -798622 -806286 -800363 -804712 -809972 -803465 -802443 -795641 -778749 -776450 -785958 -791320
9440 -791320 -782787 -795960 -791611 -787561 -790911 -787651 -773879 -785440 -788053 -784402 -774382 -778658 -781715
9427 -781715 -772756 -774739 -774927 -798305 -807015 -798785 -794600 -779843 -770469 -775428 -774433 -776442 -784059 -770724
9413 -770724 -773966 -782944 -777328 -779832 -787399 -787709 -803122 -802964 -797669 -785158 -781923 -785367 -784721 -786866 -787075
9398 -787075 -780738 -778703 -775397 -782099 -787396 -791572 -794248 -776779 -759284 -757929 -752475 -752362 -765225 -774920
$$ packed form
9496h05824J2102M916k860j2310j1817k407J0164M42p281L530P47j5893n945J3039
9482h19397P820P85k518M687K19j0893J507N668P990J209%J573P685J8169j1718
9467g87214r583n909j2339K6128O454j6354m438J7605k768j3020O07Q540Q192
9454g84099J891m192j2222p664N923m349n260O507J022O802J6892K299r508n362
9440g91320Q533j3173M349M050l350L260J3772j1561k613L651J0020m276l057
9427g81715Q959j983j88k3378q710Q230M185J4757R374m959R95k009p617J3335
9413g70724l242q978N616k504p567l10j5413J58N295J2511L235l444O46k145k09
9398g87075O337K035L306o702n297m176k676J7469J7495J355N454J13j2863r695
$$ plain form
9384 -774920 -770729 -754072 -749292 -749335 -753863 -757778 -763254 -767148 -761247 -761391 -765222 -754232 -756305 -762627 -756052
9369 -756052 -753871 -755009 -757754 -753651 -764210 -768705 -783676 -780008 -772302 -780167 -771538 -757235 -737350
9356 -737350 -749343 -752366 -757137 -753692 -751609 -756462 -764338 -754895 -747058 -756595 -764539 -758325 -752682 -763170
9342 -763170 -748659 -744326 -746969 -751764 -750994 -755102 -761691 -764489 -755093 -741475 -744099 -742574 -736571 -743199
9328 -743199 -759172 -754158 -739050 -742736 -736545 -736329 -733619 -730694 -740122 -752404 -752934 -742564 -735423 -740739
9314 -740739 -725770 -730639 -742049 -743142 -744146 -741923 -748063 -745670 -733901 -730819 -725948 -723763 -731138 -738469
9300 -738469 -738813 -742998 -747207 -746478 -745358 -746050 -747775 -740882 -743170 -744080 -736608 -738259 -734260 -740692 -735262
9285 -735262 -730937 -726494 -725094 -720679 -720833 -729286 -739524 -727777 -720765 -722371 -738777 -733591 -736857 -743710
$$ packed form
9384g74920M191J6657M780m3m528l915n476l894N901j44l831J0990k073o322O575
9369g56052K181j138k745M103j0559m495j4971L668P706p865Q629J4303J9885
9356g37350j1993l023m771L445K083m853p876R443P837r537p944O214N643j0488
9342g63170J4511M333k643m795P70m108o589k798R396J3618k624J525O003o628
9328g43199j5973N014J5108l686O191K16K710K925r428j2282n30J0370P141n316
9314g40739J4969m869j1410j093j004K223o140K393J1769L082M871K185p375p331
9300g38469l44m185m209P29J120o92j725O893k288r10P472j651L999o432N430
9285g35262M325M443J400M415j54q453j0238J1747P012j606j6406N186l266o853
$$ plain form
9271 -743710 -744460 -748331 -748543 -748100 -725808 -724833 -729395 -723839 -724716 -719551 -717294 -714869 -711009 -717589 -720908
9256 -720908 -712496 -719604 -739320 -734085 -726143 -724276 -722945 -730655 -723207 -714948 -714680 -716592 -710690 -716854
9242 -716854 -720514 -723339 -724217 -732117 -732222 -728729 -735476 -727014 -718182 -718605 -721327 -717495 -725646 -733662 -736615
9227 -736615 -728891 -730115 -734930 -725989 -718026 -721517 -710225 -701130 -697902 -708904 -700418 -682522 -689380 -703411
9213 -703411 -700787 -706038 -721421 -737164 -740761 -728935 -718526 -706048 -693650 -682119 -694203 -699780
9201 -699780 -714475 -734082 -739930 -720796 -706048 -716754 -728579 -740366 -732044 -704981 -691290 -692815
9189 -692815 -688048 -691781 -696640 -706318 -715663 -703303 -705911 -716158 -728693 -720033 -718375 -736263 -744634
9176 -744634 -727142 -706361 -700656 -697274 -699771 -695660 -697428 -700666 -696271 -691346 -697050 -698508 -697532 -697680
$$ packed form
9271g43710p50l871k12M43K2292R75m562N556q77N165K257K425L860o580l319
9256g20908Q412p108j9716N235P942J867J331p710P448Q259K68j912N902o164
9242g16854l660k825q78p900j05L493o747Q462Q832m23k722L832q151q016k953
9227g36615P724j224m815Q941P963l491J1292R095L228j1002Q486J7896o858j4031
9213g03411K624n251j5383j5743l597J1826J0409J2478J2398J1531j2084n577
9201f99780j4695j9607n848J9134J4748j0706j1825j1787Q322K7063J3691j525
9189f92815M767l733m859r678r345J2360k608j0247j2535Q660J658j7888q371
9176g44634J7492K0781N705L382k497M111j768l238M395M925n704j458R76j48
$$ plain form
9162 -697680 -699211 -711260 -697168 -686029 -695255 -699161 -689567 -695012 -687951 -676255 -678573 -678253 -685479 -695161
9148 -695161 -710657 -708994 -703690 -696723 -710279 -708003 -699259 -689041 -699752 -700376 -678104 -661162 -674847
9135 -674847 -699001 -714556 -717698 -713265 -698020 -683789 -671069 -666771 -663911 -665324 -672778 -666031 -662588
9122 -662588 -665561 -663884 -669607 -676319 -682362 -688819 -686814 -688129 -703451 -696342 -680139 -681712 -694286 -696726
9108 -696726 -708563 -705754 -695808 -687261 -685184 -683706 -679935 -669485 -667707 -668932 -677500 -667044 -659921 -658885
9094 -658885 -663526 -682133 -687516 -676446 -673855 -677327 -687647 -685286 -686728 -687294 -679478 -691272 -685119 -680690
9080 -680690 -692011 -692036 -687465 -676783 -678615 -668471 -665128 -673418 -678914 -685708 -681317 -676351 -679825 -683826
9066 -683826 -688090 -679368 -668515 -660936 -677146 -674408 -664628 -671365 -678415 -676899 -671992 -672411 -665053 -661392
$$ packed form
9162f97680j531j2049J4092J1139r226l906R594n445P061J1696k318L20p226r682
9148f95161j5496J663N304O967j3556K276Q744J0218j0711o24K2272J6942j3685
9135f74847k4154j5555l142M433J5245J4231J2720M298K860j413p454O747L443
9122f62588k973J677n723o712o043o457K005j315j5322P109J6203j573j2574k440
9108f96726j1837K809R946Q547K077J478L771J0450J778j225q568J0456P123J036
9094f58885m641j8607n383J1070K591l472j0320K361j442n66P816j1794O153M429
9080f80690j1321k5M571J0682j832J0144L343q290n496o794M391M966l474m001
9066f83826m264Q722J0853P579j6210K738R780o737p050J516M907m19P358L661
$$ plain form
9052 -661392 -655298 -663129 -661827 -665399 -663642 -662617 -652363 -649209 -657921 -661859 -667012 -677380 -676127 -669256
9038 -669256 -667231 -656148 -657347 -668156 -663991 -658779 -667634 -673026 -683912 -675511 -675551 -691472 -694496 -683461
9024 -683461 -674644 -675991 -671234 -657294 -656196 -649278 -654826 -673580 -683151 -689765 -680752 -671077 -671026 -669440
9010 -669440 -668263 -657517 -649961 -644779 -654816 -644041 -642990 -646084 -639992 -629383 -630575 -632364 -634512
8997 -634512 -644223 -656385 -653212 -642062 -644895 -654747 -658377 -648918 -629551 -636093 -648999 -658641 -658473 -665169
8983 -665169 -668679 -664287 -673112 -667725 -672481 -667310 -664053 -665691 -666408 -665873 -655458 -650456 -644285 -644885 -649453
8968 -649453 -653935 -652138 -662237 -669280 -669084 -660850 -655109 -649520 -640161 -648296 -658154 -637841 -637211 -637624 -635771
8953 -635771 -643989 -647495 -645568 -656836 -662391 -666261 -668028 -656008 -646036 -642930 -630536 -629841 -636686 -638617
$$ packed form
9052f61392O094p831J302l572J757J025J0254L154q712l938n153j0368J253O871
9038f69256K025J1083j199j0809M165N212q855n392j0886Q401m0j5921l024J1035
9024f83461Q817j347M757J3940J098O918n548j8754r571o614R013R675N1J586
9010f69440J177J0746P556N182j0037J0775J051l094O092J0609j192j789k148
8997f34512r711j2162L173J1150k833r852l630R459J9367o542j2906r642J68o696
8983f65169l510M392q825N387m756N171L257j638p17N35J0415N002O171o00m568
8968f49453m482J797j0099p043J96Q234N741N589R359q135r858K0313O30m13J853
8953f35771q218l506J927j1268n555l870j767J2020R972L106J2394O95o845j931
$$ plain form
8939 -638617 -640506 -630011 -629968 -640951 -633622 -630527 -640882 -648404 -660233 -655159 -656620 -660492 -663855 -649880
8925 -649880 -639838 -635709 -636251 -645111 -671694 -671935 -661666 -653686 -631436 -634207 -641984 -637083 -627808 -628458
8911 -628458 -641429 -634048 -632999 -639127 -641966 -642273 -650461 -654650 -647111 -653087 -656532 -658608 -660148 -661254
8897 -661254 -648038 -643212 -643839 -657734 -658357 -655598 -657325 -647052 -630690 -632640 -626931 -631319 -633330 -644183
8883 -644183 -638394 -632023 -621451 -623117 -635607 -635956 -640358 -639810 -630581 -631561 -643512 -646011 -638708 -637800 -631837
8868 -631837 -629930 -620835 -631017 -635773 -628856 -615703 -618224 -636504 -633043 -636770 -641891 -630065 -622445
8855 -622445 -615212 -613464 -611377 -622432 -625654 -631776 -646234 -647846 -631725 -615599 -629846 -636698 -628024
8842 -628024 -636006 -635674 -631431 -636585 -634234 -623883 -619359 -618827 -610777 -599510 -600712 -601520 -615761 -614519
$$ packed form
8939f38617j889J0495M3j0983P329L095j0355p522j1829N074j461l872l363J3975
8925f49880J0042M129n42q860k6583k41J0269P980K2250k771p777M901R275o50
8911f28458j2971P381J049o128k839l07q188m189P539n976l445k076j540j106
8897f61254J3216M826o27j3895o23K759j727J0273J6362j950N709m388k011j0853
8883f44183N789O371J0572j666j2490l49m402N48R229r80j1951k499P303R08N963
8868f31837J907R095j0182m756O917J3153k521j8280L461l727n121J1826P620
8855f22445P233J748K087j1055l222o122j4458j612J6121J6126j4247o852Q674
8842f28024p982L32M243n154K351J0351M524N32Q050J1267j202q08j4241J242
$$ plain form
8828 -614519 -603614 -599545 -602617 -588760 -574871 -578121 -582025 -590690 -598468 -601444 -611925 -617379 -624550
8815 -624550 -629025 -638703 -633093 -620206 -615659 -613132 -609592 -611879 -615494 -625122 -624259 -633639 -623770 -606204
8801 -606204 -602136 -613755 -614373 -616123 -629397 -636011 -636336 -628400 -626967 -606573 -606074 -607346 -607437 -608985 -606660
8786 -606660 -612520 -618569 -616771 -602262 -597369 -600811 -594066 -592653 -590427 -587890 -583517 -589137 -598873 -610556
8772 -610556 -619342 -609587 -607567 -606378 -608332 -627815 -642728 -626880 -607352 -611734 -620187 -621589 -623324
8759 -623324 -624100 -615717 -614462 -598141 -599454 -598999 -608225 -594151 -591783 -587483 -583935 -586966 -578190 -587482
8745 -587482 -605160 -608875 -605619 -594050 -589899 -586932 -594846 -618019 -620544 -609196 -610662 -604078 -604365 -611652
8731 -611652 -623222 -625219 -617419 -598396 -587002 -582235 -582759 -583187 -589075 -600208 -604765 -588772 -592747 -601867
$$ packed form
8828f14519J0905M069l072J3857J3889l250l904q665p778k976j0481n454p171
8815f24550m475r678N610J2887M547K527L540k287l615r628Q63r380R869J7566
8801f06204M068j1619o18j750j3274o614l25P936J433K0394M99j272r1j548K325
8786f06660n860o049J798J4509M893l442O745J413K226K537M373n620r736j1683
8772f10556q786R755K020J189j954j9483j4913J5848J9528m382q453j402j735
8759f23324p76Q383J255J6321j313M55r226J4074K368M300L548l031Q776r292
8745e87482j7678l715L256J1569M151K967p914k3173k525J1348j466O584k87p287
8731f11652j1570j997P800J9023J1394M767n24m28n888j1133m557J5993l975r120
$$ plain form
8717 -601867 -604028 -604157 -586204 -582761 -606947 -594999 -586419 -592771 -603075 -586361 -563714 -562561 -591843
8704 -591843 -610215 -602876 -593027 -598480 -597621 -610082 -612877 -613822 -605625 -598050 -588778 -580554 -596809 -598788
8690 -598788 -584670 -589087 -601414 -596547 -586552 -562789 -554624 -567517 -573139 -573940 -586392 -595792 -591908
8677 -591908 -580492 -578026 -588557 -598955 -597516 -589714 -590858 -596340 -595199 -604941 -607203 -609626 -610312 -606587
8663 -606587 -597191 -593700 -598611 -612751 -612561 -603639 -602968 -602231 -594799 -590504 -591510 -589485 -594807 -598918 -593935
8648 -593935 -583741 -571382 -576181 -587075 -595188 -594254 -589116 -583877 -593176 -611963 -602708 -595243 -603161 -604600
8634 -604600 -589965 -570293 -573022 -580805 -579915 -582976 -573863 -567225 -581377 -588952 -586287 -580661 -582948 -585135
8620 -585135 -588768 -589192 -580604 -573104 -566333 -565977 -565432 -562658 -570780 -582583 -579446 -574046 -586013 -575640
$$ packed form
8717f01867k161j29J7953L443k4186J1948Q580o352j0304J6714K2647J153k9282
8704e91843j8372P339R849n453Q59j2461k795r45Q197P575R272Q224j6255j979
8690e98788J4118m417j2327M867R995K3763Q165j2893n622q01j2452r400L884
8677e91908J1416K466j0531j0398J439P802j144n482J141r742k262k423o86L725
8663f06587R396L491m911j4140J90Q922O71P37P432M295j006K025n322m111M983
8648e93935J0194J2359m799j0894q113R34N138N239r299j8787R255P465p918j439
8634f04600J4635J9672k729p783Q90l061R113O638j4152p575K665N626k287k187
8620e85135l633m24Q588P500O771L56N45K774q122j1803L137N400j1967J0373
$$ plain form
8606 -575640 -585402 -573358 -558840 -560195 -567827 -573663 -575492 -569906 -562809 -561557 -557590 -564398 -562931 -562975
8592 -562975 -558768 -542162 -545755 -558151 -558423 -568065 -570972 -579310 -587024 -585540 -585559 -589063 -596687 -591729 -571577
8577 -571577 -571261 -574997 -577283 -574712 -574301 -581779 -581345 -570217 -553284 -557161 -561805 -557534 -556542 -560632 -571389
8562 -571389 -577521 -569808 -567081 -572077 -578029 -576470 -571223 -566293 -565208 -579119 -580650 -566636 -558468 -554821
8548 -554821 -556872 -557701 -568941 -590055 -597555 -582472 -574813 -570586 -579385 -581382 -576861 -573201 -572073 -562040
8534 -562040 -549080 -565163 -570447 -559782 -553026 -552026 -547104 -555582 -564849 -562468 -545159 -541085 -544263
8521 -544263 -558844 -570165 -563436 -565926 -568740 -567922 -569104 -565469 -561648 -558164 -546515 -557748 -561179 -565754
8507 -565754 -556347 -567491 -572132 -578653 -578672 -562405 -564329 -570497 -572428 -566703 -554340 -555885 -543317 -546915
$$ packed form
8606e75640r762J2044J4518j355p632n836j829N586P097J252L967o808J467m4
8592e62975M207J6606l593j2396k72r642k907q338p714J484j9l504p624M958K0152
8577e71577L16l736k286K571M11p478M34J1128J6933l877m644M271R92m090j0757
8562e71389o132P713K727m996n952J559N247M930J085j3911j531J4014Q168L647
8548e54821k051q29j1240k1114p500J5083P659M227q799j997M521L660J128J0033
8534e62040J2960j6083n284J0665O756J000M922q478r267K381J7309M074l178
8521e44263j4581j1321O729k490k814Q18j182L635L821L484J1649j1233l431m575
8507e65754R407j1144m641o521j9J6267j924o168j931N725J2363j545J2568l598
$$ plain form
8493 -546915 -553942 -557557 -565026 -564212 -552736 -551780 -558586 -550466 -553164 -554802 -556265 -563938 -567697 -557875 -549036
8478 -549036 -550382 -545777 -548621 -558749 -551492 -554841 -567488 -568365 -567480 -554033 -547978 -548365 -544957 -546659
8464 -546659 -545412 -548911 -551484 -542091 -542839 -555803 -557949 -555628 -553836 -540557 -523280 -531335 -536359 -540805
8450 -540805 -547237 -549276 -549598 -549653 -552735 -550031 -537481 -536369 -534913 -546418 -542670 -549024 -561126 -563470
8436 -563470 -545093 -548633 -557876 -564784 -562092 -555223 -539760 -534147 -539348 -533765 -544630 -548912 -543734 -551340
8422 -551340 -547192 -550494 -558871 -561137 -559389 -561809 -566019 -577509 -582242 -564934 -550953 -543366 -543996 -548711
8408 -548711 -560278 -560082 -555944 -547080 -550892 -564692 -563416 -545033 -544652 -555999 -556559 -553998 -538743 -536636
8394 -536636 -535649 -525404 -526622 -548563 -558766 -568294 -566162 -569513 -573997 -577251 -572205 -571808 -571701 -565534
$$ packed form
8493e46915p027l615p469Q14J1476R56o806Q120k698j638j463p673l759R822Q839
8478e49036j346M605k844j0128P257l349j2647q77Q85J3447O055l87L408j702
8464e46659J247l499k573R393p48j2964k146K321J792J3279J7277q055n024m446
8450e40805o432k039l22n5l082K704J2550J112J456j1505L748o354j2102k344
8436e63470J8377l540r243o908K692O869J5463N613n201N583j0865m282N178p606
8422e51340M148l302q377k266J748k420m210j1490m733J7308J3981P587o30m715
8408e48711j1567J96M138Q864l812j3800J276J8383L81j1347n60K561J5255K107
8394e36636R87J0245j218k1941j0203r528K132l351m484l254N046L97J07O167
$$ plain form
8380 -565534 -552501 -550496 -553724 -555499 -559540 -565081 -563486 -570215 -568959 -564096 -560189 -551674 -560945 -560154
8366 -560154 -565756 -561669 -571351 -573903 -561357 -547215 -532033 -522723 -523889 -544061 -544469 -534058 -534716 -539483
8352 -539483 -555165 -554780 -546509 -537790 -533306 -522334 -539065 -547351 -554355 -555433 -547627 -541882 -540061 -534759
8338 -534759 -545864 -550492 -545005 -547147 -554870 -544122 -537742 -541028 -549017 -541901 -537497 -537361 -547694 -538241
8324 -538241 -532121 -532841 -544033 -547615 -553181 -559435 -564820 -559197 -547062 -546153 -549513 -539927 -537983 -525069
8310 -525069 -523659 -549054 -560506 -546462 -542687 -534313 -535718 -544990 -559226 -560275 -552927 -547238 -549879
8297 -549879 -543202 -547819 -554486 -556709 -549447 -536710 -533933 -543443 -553944 -571226 -561285 -541319 -540500 -539222
8283 -539222 -538755 -545584 -548443 -547915 -548393 -547137 -553765 -562667 -562994 -549069 -545208 -550433 -558407 -554596 -534742
$$ packed form
8380e65534J3033K005l228j775m041n541J595o729J256M863L907Q515r271P91
8366e60154n602M087r682k552J2546J4142J5182R310j166k0172m08J0411o58m767
8352e39483j5682L85Q271Q719M484J0972j6731q286p004j078P806N745J821N302
8338e34759j1105m628N487k142p723J0748O380l286p989P116M404J36j0333R453
8324e38241O120p20j1192l582n566o254n385N623J2135R09l360R586J944J2914
8310e25069J410k5395j1452J4044L775Q374j405r272j4236j049P348N689k641
8297e49879O677m617o667k223P262J2737K777r510j0501j7282R941J9966Q19J278
8283e39222M67o829k859N28m78J256o628q902l27J3925L861n225p974L811J9854
$$ plain form
8268 -534742 -519729 -526201 -532232 -543826 -546291 -540536 -542289 -549426 -547889 -542587 -549640 -541373 -528927 -533405
8254 -533405 -537543 -538859 -524420 -526532 -539430 -549180 -548422 -554368 -557822 -564378 -565091 -559253 -544104 -553199
8240 -553199 -567722 -561360 -548101 -546917 -533097 -527743 -535869 -532192 -530819 -530151 -531922 -550825 -561168
8227 -561168 -562517 -560503 -547651 -550459 -547995 -550672 -566669 -570581 -565666 -551891 -564728 -569523 -556764
8214 -556764 -537385 -539556 -546796 -542295 -532363 -522675 -529910 -540124 -543647 -537720 -531966 -551359 -553668 -538807
8200 -538807 -542656 -543210 -532213 -518755 -509805 -511121 -514899 -540752 -550990 -538419 -535916 -544100 -547760
8187 -547760 -539817 -533229 -543522 -543671 -554962 -559023 -541735 -526368 -534216 -536506 -541779 -544056 -544002 -546340
8173 -546340 -546566 -549197 -550515 -535925 -534953 -538026 -535452 -534117 -537799 -542829 -542533 -538884 -537430 -551727 -551452
$$ packed form
8268e34742J5013o472o031j1594k465N755j753p137J537N302p053Q267J2446m478
8254e33405m138j316J4439k112j2898r750P58n946l454o556p13N838J5149r095
8240e53199j4523O362J3259J184J3820N354q126L677J373O68j771j8903j0343
8227e61168j349K014J2852k808K464k677j5997l912M915J3775j2837m795J2759
8214e56764J9379k171p240M501R932R688p235j0214l523N927N754j9393k309J4861
8200e38807l849n54J0997J3458Q950j316l778k5853j0238J2571K503q184l660
8187e47760P943O588j0293j49j1291m061J7288J5367p848k290n273k277N4k338
8173e46340k26k631j318J4590R72l073K574J335l682n030K96L649J454j4297K75
$$ plain form
8158 -551452 -560699 -547781 -541871 -552598 -566049 -564942 -546060 -543332 -564505 -570940 -568372 -568769 -570577
8145 -570577 -565424 -560409 -550721 -547719 -542260 -545229 -545286 -543826 -547836 -547571 -545926 -544048 -534480 -526572 -533277
8130 -533277 -533240 -528609 -538729 -547802 -548116 -545113 -554298 -551124 -550832 -558979 -570596 -577741 -570250 -557336 -538542
8115 -538542 -535990 -550770 -547614 -551762 -536815 -539299 -537499 -549783 -559202 -555342 -549928 -542345 -554369
8102 -554369 -551811 -542977 -549285 -543062 -544227 -543309 -536865 -534278 -528364 -536609 -529123 -524740 -536109 -547216
8088 -547216 -554286 -555998 -537820 -532304 -541184 -535899 -538344 -530818 -523362 -525504 -524817 -528386 -536903 -533107
8074 -533107 -523618 -523976 -546420 -555086 -544300 -534786 -531776 -523701 -536215 -533964 -531336 -534694 -529666 -519648
8060 -519648 -519905 -509076 -505043 -501741 -503844 -514571 -521439 -515177 -514744 -530969 -531916 -528748 -539736 -548710
$$ packed form
8158e51452r247J2918N910j0727j3451J107J8882K728k1173o435K568l97j808
8145e70577N153N015R688L002N459k969n7J460m010K65J645J878R568P908o705
8130e33277L7M631j0120r073l14L003r185L174K92q147j1617p145P491J2914J8794
8115e38542K552j4780L156m148J4947k484J800j2284r419L860N414P583j2024
8102e54369K558Q834o308O223j165R18O444K587N914q245P486M383j1369j1107
8088e47216p070j712J8178N516q880N285k445P526P456k142O87l569q517L796
8074e33107R489l58k2444q666J0786R514L010Q075j2514K251K628l358N028J0018
8060e19648k57J0829M033L302k103j0727o868O262M33j6225r47L168j0988q974
$$ plain form
8046 -548710 -544449 -546986 -540983 -545741 -531734 -528020 -534199 -528190 -514627 -519821 -521158 -524988 -521991 -521065
8032 -521065 -523474 -517877 -525926 -538130 -535822 -531830 -534433 -530542 -526462 -522066 -521654 -532769 -536878 -518623
8018 -518623 -499122 -487278 -494290 -500524 -505009 -509609 -525914 -516170 -514314 -508638 -517882 -516436 -506548 -509613
8004 -509613 -513011 -512515 -515954 -523308 -524860 -517769 -510166 -512559 -523887 -517661 -511017 -514531 -515881 -512596
7990 -512596 -521446 -530298 -533311 -526491 -504248 -502130 -511694 -512432 -502756 -509179 -518895 -518849 -524184 -522609 -515786
7975 -515786 -523452 -526488 -522483 -507490 -498552 -510177 -512558 -525293 -532841 -530745 -519118 -498003 -490753
7962 -490753 -487325 -493908 -503781 -501699 -505373 -509672 -500751 -492288 -502683 -505391 -509280 -503676 -510620 -513152
7948 -513152 -501313 -504371 -516322 -524094 -521246 -512938 -521271 -533163 -528374 -519914 -509772 -506952 -506499 -513715
$$ packed form
8046e48710M261k537O003m758J4007L714o179O009J3563n194j337l830K997R26
8032e21065k409N597q049j2204K308L992k603L891M080M396M12j1115m109J8255
8018e18623J9501J1844p012o234m485m600j6305R744J856N676r244J446R888l065
8004e09613l398M96l439p354j552P091P603k393j1328O226O644l514j350L285
7990e12596q850q852l013O820K2243K118r564p38R676o423r716M6n335J575O823
7975e15786p666l036M005J4993Q938j1625k381j2735p548K096J1627K1115P250
7962d90753L428o583r873K082l674m299Q921Q463j0395k708l889N604o944k532
7948e13152J1839l058j1951p772K848Q308q333j1892M789Q460J0142K820M53p216
$$ plain form
7934 -513715 -523885 -528632 -521448 -525462 -537734 -543500 -535397 -536713 -531291 -504225 -503157 -506778 -516363 -514878
7920 -514878 -515731 -516866 -509745 -512436 -516113 -499412 -497784 -495974 -495934 -505320 -505783 -503429 -504781 -497446 -505280
7905 -505280 -517676 -512520 -501796 -496165 -502013 -503625 -500167 -496887 -490514 -492810 -498090 -495679 -498312 -505621
7891 -505621 -501108 -489220 -488851 -486205 -486585 -500482 -511916 -501105 -497251 -489473 -484366 -476001 -473978 -479984
7877 -479984 -483203 -488779 -488434 -491603 -503053 -513512 -511328 -507825 -491571 -488954 -484621 -491588 -506149 -495133
7863 -495133 -489659 -506758 -519316 -514408 -512209 -506519 -498841 -509198 -511744 -489101 -482991 -482553 -489168 -491254
7849 -491254 -494776 -497914 -497516 -487243 -481904 -472743 -461586 -473444 -487024 -496393 -503524 -504435 -499621 -489736
7835 -489736 -481002 -488164 -486286 -486990 -487775 -488437 -494166 -509314 -503018 -493370 -493563 -483182 -474299 -475594 -482126
$$ packed form
7934e13715j0170m747P184m014j2272n766Q103j316N422K7066J068l621r585J485
7920e14878q53j135P121k691l677J6701J628J810M0r386m63K354j352P335p834
7905e05280j2396N156J0724N631n848j612L458L280O373k296n280K411k633p309
7891e05621M513J1888L69K646l80j3897j1434J0811L854P778N107Q365K023o006
7877d79984l219n576L45l169j1450j0459K184L503J6254K617M333o967j4561J1016
7863d95133N474j7099j2558M908K199N690P678j0357k546K2643O110M38o615k086
7849d91254l522l138L98J0273N339R161J1157j1858j3580r369p131r11M814R885
7835d89736Q734p162J878p04p85o62n729j5148O296R648j93J0381Q883j295o532
$$ plain form
7820 -482126 -484944 -482456 -489955 -503919 -512217 -506318 -492745 -480968 -476455 -486436 -497579 -497078 -479333
7807 -479333 -474937 -479237 -495935 -503277 -493758 -480334 -477834 -480791 -488308 -491282 -497085 -497457 -488152 -483946
7793 -483946 -482123 -475636 -477571 -486085 -492820 -488410 -470535 -481851 -486483 -499135 -509990 -505840 -498081
7780 -498081 -494421 -478964 -468085 -479630 -494529 -488992 -488505 -491213 -483052 -470959 -473233 -471914 -470030
7767 -470030 -475876 -482167 -490266 -491463 -491842 -490055 -501040 -501604 -496073 -499731 -497753 -486867 -496554 -504362
7753 -504362 -497386 -483454 -473596 -482025 -484064 -490858 -482000 -482596 -482834 -488831 -485551 -494161 -502515 -502464 -503553
7738 -503553 -497595 -497871 -487061 -489094 -483809 -471270 -466534 -454871 -457679 -476862 -495313 -501683 -488053
7725 -488053 -472179 -473799 -477813 -486653 -480664 -476692 -478600 -473648 -478756 -483682 -478995 -469979 -484312 -491042
$$ packed form
7820d82126k818K488p499j3964q298N899J3573J1777M513r981j1143N01J7745
7807d79333M396m300j6698p342R519J3424K500k957p517k974n803l72R305M206
7793d83946J823O487j935q514o735M410J7875j1316m632j2652j0855M150P759
7780d98081L660J5457J0879j1545j4899N537M87k708Q161J2093k274J319J884
7767d70030n846o291q099j197l79J787j0985n64N531l658J978J0886r687p808
7753e04362O976J3932R858q429k039o794Q858n96k38n997L280q610q354N1j089
7738e03553N958k76J0810k033N285J2539M736J1663k808j9183j8451o370J3630
7725d88053J5874j620m014q840N989L972j908M952n108m926M687R016j4333o730
$$ plain form
7711 -491042 -476868 -470238 -486394 -488092 -482863 -476296 -479669 -483593 -477541 -489185 -497432 -493783 -485903 -496250
7697 -496250 -491651 -485914 -500612 -504396 -497518 -499881 -475813 -466646 -466493 -467899 -465691 -452129 -470201 -487303
7683 -487303 -489837 -477652 -472945 -465765 -474923 -475158 -482991 -505644 -503054 -492304 -483192 -480223 -470123 -470372
7669 -470372 -464063 -452741 -456955 -445903 -444158 -448631 -456199 -472239 -478164 -475451 -482281 -485983 -478471 -469177
7655 -469177 -465931 -473221 -481138 -470923 -471707 -479794 -473467 -458237 -453887 -461109 -469036 -471936 -463898 -468402
7641 -468402 -468964 -460893 -456430 -465273 -479654 -478004 -463323 -451721 -469980 -487219 -488388 -502371 -501023
7628 -501023 -498959 -502529 -510503 -500975 -489868 -477203 -474576 -477912 -478808 -482571 -486152 -500962 -497583 -480415
7614 -480415 -471252 -482433 -483801 -473791 -471456 -460562 -452831 -451826 -456979 -461027 -467719 -471012 -467106 -480856
$$ packed form
7711d91042J4174O630j6156j698N229O567l373l924O052j1644q247L649P880j0347
7697d96250M599N737j4698l784O878k363K4068R167J53j406K208J3562j8072j7102
7683d87303k534J2185M707P180r158k35p833k2653K590J0750R112K969J0100k49
7669d70372O309J1322m214J1052J745m473p568j6040n925K713o830l702P512R294
7655d69177L246p290p917J0215p84q087O327J5230M350p222p927k900Q038m504
7641d68402n62Q071M463q843j4381J650J4681J1602j8259j7239j169j3983J348
7628e01023K064l570p974R528J1107J2665K627l336q96l763l581j4810L379J7168
7614d80415R163j1181j368J0010K335J0894P731J005n153m048o692l293L906j3750
$$ plain form
7600 -480856 -491116 -486664 -469498 -467913 -484534 -496958 -493493 -488153 -481792 -475840 -468465 -463041 -458307
7587 -458307 -471518 -491623 -499870 -494447 -489191 -472126 -463478 -460990 -462075 -463431 -476178 -507483 -510177
7574 -510177 -503023 -510257 -505851 -499965 -492744 -476362 -472641 -487869 -484134 -472260 -472345 -482655 -483543 -471636
7560 -471636 -455666 -454381 -452571 -462578 -477809 -481886 -466479 -458534 -462539 -477065 -484005 -484993 -490187
7547 -490187 -488874 -482021 -461293 -448967 -464615 -474815 -470478 -472717 -472307 -473717 -468591 -464944 -455701 -455651
7533 -455651 -454114 -448472 -451870 -469442 -463362 -457327 -471094 -468322 -460486 -452258 -452202 -450847 -447451 -450513
7519 -450513 -460021 -474159 -486859 -496080 -488610 -471255 -459871 -460725 -463729 -474820 -480711 -473361 -474615
7506 -474615 -476413 -468386 -468643 -471009 -476470 -472462 -479874 -481117 -485099 -482274 -476434 -469076 -462015 -457420 -464604
$$ packed form
7600d80856j0260M452J7166J585j6621j2424L465N340O361N952P375N424M734
7587d58307j3211k0105q247N423N256J7065Q648K488j085j356j2747l1305k694
7574e10177P154p234M406N886P221J6382L721j5228L735J1874q5j0310q88J1907
7560d71636J5970J285J810j0007j5231m077J5407P945m005j4526o940r88n194
7547d90187J313O853K0728J2326j5648j0200M337k239M10j410N126L647R243N0
7533d55651J537N642l398j7572O080O035j3767K772P836Q228N6J355L396l062
7519d50513r508j4138j2700r221P470J7355J1384q54l004j1091n891P350j254
7506d74615j798Q027k57k366n461M008p412j243l982K825N840P358P061M595p184
$$ plain form
7491 -464604 -462178 -465414 -466343 -462192 -463342 -457256 -454154 -442916 -444227 -446825 -437387 -441359 -449224 -449958 -453603
7476 -453603 -453266 -461494 -464964 -460449 -444799 -444950 -446834 -453328 -453369 -453245 -463702 -470727 -476578 -463189 -462280
7461 -462280 -451510 -437189 -438369 -441597 -438200 -447166 -455022 -449895 -452259 -451849 -447004 -442741 -442625 -448677
7447 -448677 -460401 -465121 -473646 -477200 -484885 -485947 -468441 -459012 -449058 -443065 -444957 -447330 -447053 -453964
7433 -453964 -445010 -460422 -472870 -473638 -467600 -465391 -469529 -478625 -480329 -483540 -486060 -494504 -488378 -483315
7419 -483315 -476376 -477853 -465536 -449400 -443744 -444302 -445987 -442873 -448520 -448444 -451181 -460324 -458361 -443044
7405 -443044 -434661 -442746 -444228 -450021 -445287 -433592 -437898 -448570 -470883 -477543 -472045 -461832 -450684
7392 -450684 -455688 -441491 -427563 -433758 -436873 -427301 -429403 -434828 -431966 -429072 -428642 -435662 -434819 -428787
$$ packed form
7491d64604K426l236r29M151j150O086L102J1238j311k598R438l972p865p34l645
7476d53603L37q228l470M515J5650j51j884o494m1J24j0457p025n851J3389R09
7461d62280J0770J4321j180l228L397q966p856N127k364M10M845M263J16o052
7447d48677j1724m720q525l554p685j062J7506R429R954N993j892k373K77o911
7433d53964Q954j5412j2448p68O038K209m138r096j704l211k520q444O126N063
7419d83315O939j477J2317J6136N656n58j685L114n647P6k737r143J963J5317
7405d43044Q383q085j482n793M734J1695m306j0672k2313o660N498J0213J1148
7392d50684n004J4197J3928o195l115R572k102n425K862K894M30p020Q43O032
$$ plain form
7378 -428787 -427347 -434176 -442835 -444538 -445966 -459559 -460556 -443903 -447517 -454889 -443715 -441686 -438961 -443361
7364 -443361 -436231 -430673 -433667 -435332 -444776 -441259 -433576 -428309 -418540 -425209 -425742 -431100 -455800 -457407
7350 -457407 -449547 -444813 -442906 -427640 -421986 -422626 -424162 -441780 -451028 -446450 -446415 -440721 -441653 -443832 -441930
7335 -441930 -443068 -445784 -432291 -431407 -441040 -433781 -427813 -433473 -445628 -431072 -414305 -424250 -442313
7322 -442313 -438983 -427099 -427112 -422625 -443942 -459418 -455913 -446554 -438147 -433743 -447667 -457153 -454955 -447801
7308 -447801 -446977 -436109 -427439 -438071 -449297 -456104 -448679 -430641 -425204 -413995 -414947 -428350 -436681
7295 -436681 -438119 -436072 -421433 -420178 -424424 -422157 -411400 -422881 -437016 -439840 -440879 -428196 -422322
7282 -422322 -425037 -429006 -439230 -439888 -426560 -420707 -431946 -435536 -429351 -431545 -449550 -439055 -427554
$$ packed form
7378d28787J440o829q659j703j428j3593r97J6653l614p372J1174K029K725m400
7364d43361P130N558k994j665r444L517P683N267R769o669n33n358k4700j607
7350d57407P860M734J907J5266N654o40j536j7618r248M578L5N694r32k179J902
7335d41930j138k716J3493Q84r633P259N968n660j2155J4556J6767r945j8063
7322d42313L330J1884j3M487k1317j5476L505R359Q407M404j3924r486K198P154
7308d47801Q24J0868Q670j0632j1226o807P425J8038N437J1209r52j3403q331
7295d36681j438K047J4639J255m246K267J0757j1481j4135k824j039J2683N874
7282d22322k715l969j0224o58J3328N853j1239l590O185k194j8005J0495J1501
$$ plain form
7269 -427554 -419055 -411053 -410779 -414741 -417485 -425567 -438171 -438457 -435820 -446035 -453065 -441511 -427657 -430178
$$ packed form
7269d27554Q499Q002K74l962k744q082j2604k86K637j0215p030J1554J3854k521
$$ [...]
##END NTUPLES=NMR SPECTRUM
##END=
