##TITLE=Analysis number 326619
Compound Code cc 56202
Book Reference 513/43/25
Project Code adrs
Chemist Name ronp
##JCAMPDX= 6.0         $$ Bruker NMR JCAMP-DX V2.0
##DATA TYPE= NMR SPECTRUM
##DATA CLASS= NTUPLES
##ORIGIN= Bruker BioSpin GmbH
##OWNER= nmr
$$ XWIN-NMR		Version 3.5
$$ Thu Feb 15 12:19:13 2007 GMT Standard Time (UT+0h)  MAYBRIDGE\nmr@NMR_250MHZ
##.OBSERVE FREQUENCY= 250.131544655141
##.OBSERVE NUCLEUS= ^1H
##.ACQUISITION MODE= SIMULTANEOUS (DQD)
##.ACQUISITION SCHEME= undefined
##.AVERAGES= 16
##.DIGITISER RES= 18
##SPECTROMETER/DATA SYSTEM= dpx250
##.PULSE SEQUENCE= zg30
##.SOLVENT NAME= CDCl3
##.SHIFT REFERENCE= (INTERNAL, CDCl3, 0, 16.522)
##AUDIT TRAIL= $$ (NUMBER, WHEN, WHO, WHERE, WHAT)
$$ ##TITLE= Audit trail, XWIN-NMR		Version 3.5
$$ ##JCAMPDX= 5.01
$$ ##ORIGIN= Bruker BioSpin GmbH
$$ ##OWNER= nmr
$$ C:\u/data/dgb/nmr/ADRS/980/pdata/1/auditp.txt
$$ ##AUDIT TRAIL=  $$ (NUMBER, WHEN, WHO, WHERE, WHAT)
(   1,<2007-02-15 12:18:51.29 +000>,<MAYBRIDGE\nmr>,<NMR_250MHZ>,
      <created by zg, POWCHK disabled, PULCHK disabled
       configuration hash MD5:
       49 4B E0 1D 92 C2 6B 37 9F E6 65 BC 52 41 86 1D
       data hash MD5: 64K
       AA 05 B0 91 42 9E F2 0B 87 F5 12 BD DC E1 4C 7A>)
(   2,<2007-02-15 12:19:04.57 +000>,<MAYBRIDGE\nmr>,<NMR_250MHZ>,
      <Start of raw data processing
       ef LB = 0.3 FT_mod = 6 PKNL = 1 SI = 32K 
       data hash MD5: 32K
       2E E3 6A 60 A9 E0 5A 65 C4 CC A3 24 BC B0 2D A0>)
(   3,<2007-02-15 12:19:06.18 +000>,<MAYBRIDGE\nmr>,<NMR_250MHZ>,
      <apk 
       data hash MD5: 32K
       57 CA 84 99 A3 70 A7 98 54 31 61 53 CE DB 5D 3F>)
(   4,<2007-02-15 12:19:06.91 +000>,<MAYBRIDGE\nmr>,<NMR_250MHZ>,
      <abs ABSG = 5 
       data hash MD5: 32K
       F7 67 D1 19 0D 0B 3E 40 7E F9 4E DA 24 7A 17 12>)
$$ ##END=
$$ 
$$ hash MD5
$$ 4E 20 E8 C6 36 DC 8F AD 70 19 B3 8E 92 41 67 81
##$RELAX= 
##$RELAX= 
##$RELAX= 
##$RELAX= 
##$RELAX= 
##$RELAX= 
##$RELAX= 
$$ Bruker specific parameters
$$ --------------------------
##$DU= <C:\u>
##$EXPNO= 980
##$NAME= <ADRS>
##$PROCNO= 1
##$TYPE= <nmr>
##$USER= <dgb>
##$AMP= (0..31)
100 100 100 100 100 100 100 100 100 100 100 100 100 100 100 100 100 100 
100 100 100 100 100 100 100 100 100 100 100 100 100 100 
##$AQSEQ= 0
##$AQ_mod= 3
##$AUNM= <au_zg>
##$AUTOPOS= <35 >
##$BF1= 250.13
##$BF2= 250.13
##$BF3= 250.13
##$BF4= 250.13
##$BF5= 500.13
##$BF6= 500.13
##$BF7= 500.13
##$BF8= 500.13
##$BYTORDA= 1
##$CFDGTYP= 0
##$CFRGTYP= 5
##$CHEMSTR= <none>
##$CNST= (0..31)
1 1 145 1 1 1 1 1 1 1 1 1 1 1 1 1 1 1 1 1 1 1 1 1 1 1 1 1 1 1 1 1 
##$CPDPRG= <>
##$CPDPRG1= <>
##$CPDPRG2= <>
##$CPDPRG3= <>
##$CPDPRG4= <mlev>
##$CPDPRG5= <mlev>
##$CPDPRG6= <mlev>
##$CPDPRG7= <mlev>
##$CPDPRG8= <mlev>
##$CPDPRGB= <>
##$CPDPRGT= <>
##$D= (0..31)
0 1 0 0 0 0 0 0 0 0.06 0 0 0 0 0 0 0.0002 0 0 0 0 0 0 0 0 0 0 0 0 0 0 
0 
##$DATE= 1171541930
##$DBL= (0..7)
120 120 120 120 120 120 120 120 
##$DBP= (0..7)
150 150 150 150 150 150 150 150 
##$DBP07= 0
##$DBPNAM0= <>
##$DBPNAM1= <>
$$ [...]
##$SUBNAM7= <"">
##$SUBNAM8= <"">
##$SUBNAM9= <"">
##$SW= 20.6930455092707
##$SWIBOX= (0..15)
0 0 3 0 0 0 0 0 0 0 0 0 0 0 0 0 
##$SW_h= 5175.983436853
##$TD= 65536
##$TD0= 1
##$TE= 295.16
##$TE2= 300
##$TE3= 300
##$TEG= 300
##$TL= (0..7)
0 120 120 120 120 120 120 120 
##$TP= (0..7)
150 150 150 150 150 150 150 150 
##$TP07= 0
##$TPNAME0= <>
##$TPNAME1= <>
##$TPNAME2= <>
##$TPNAME3= <>
##$TPNAME4= <>
##$TPNAME5= <>
##$TPNAME6= <>
##$TPNAME7= <>
##$TPOAL= (0..7)
0.5 0.5 0.5 0.5 0.5 0.5 0.5 0.5 
##$TPOFFS= (0..7)
0 0 0 0 0 0 0 0 
##$TUNHIN= 0
##$TUNHOUT= 0
##$TUNXOUT= 0
##$USERA1= <user>
##$USERA2= <user>
##$USERA3= <user>
##$USERA4= <user>
##$USERA5= <user>
##$V9= 5
##$VALIST= <valist>
##$VCLIST= <CCCCCCCCCCCCCCC>
##$VD= 0
##$VDLIST= <DDDDDDDDDDDDDDD>
##$VPLIST= <PPPPPPPPPPPPPPP>
##$VTLIST= <TTTTTTTTTTTTTTT>
##$WBST= 1024
##$WBSW= 4
##$XGAIN= (0..3)
0 0 0 0 
##$XL= 0
##$YL= 0
##$YMAX_a= 186986
##$YMIN_a= -243989
##$ZGOPTNS= <>
##$ZL1= 120
##$ZL2= 120
##$ZL3= 120
##$ZL4= 120
##$ABSF1= 16.522
##$ABSF2= -4.171173
##$ABSG= 5
##$ABSL= 3
##$ALPHA= 0
##$AQORDER= 0
##$ASSFAC= 0
##$ASSFACI= 0
##$ASSFACX= 0
##$ASSWID= 0
##$AUNMP= <proc_1d>
##$AZFE= 0.1
##$AZFW= 0.1
##$BCFW= 0
##$BC_mod= 0
##$BYTORDP= 0
##$COROFFS= 0
##$CY= 12.5
##$DATMOD= 1
##$DC= 0
##$DFILT= <>
##$DTYPP= 0
##$F1P= 14.0000005364418
##$F2P= -0.99999901652339
##$FCOR= 0.5
##$FTSIZE= 32768
##$FT_mod= 6
##$GAMMA= 0
##$GB= 0
##$INTBC= 1
##$INTSCL= 1
##$ISEN= 128
##$LB= 0.3
##$LEV0= 0
##$LPBIN= 0
##$MAXI= 10000
##$MC2= 0
##$MEAN= 0
##$ME_mod= 0
##$MI= 0
##$NCOEF= 0
##$NC_proc= -4
##$NLEV= 6
##$NOISF1= 0
##$NOISF2= 0
##$NSP= 0
##$NTH_PI= 0
##$NZP= 0
##$OFFSET= 16.522
##$PC= 1
##$PHC0= 234.9143
##$PHC1= 1.340749
##$PH_mod= 1
##$PKNL= yes
##$PPARMOD= 0
##$PSCAL= 4
##$PSIGN= 0
##$REVERSE= no
##$SF= 250.13
##$SI= 32768
##$SIGF1= 0
##$SIGF2= 0
##$SINO= 400
##$SIOLD= 32768
##$SREGLST= <1H.CDCl3>
##$SSB= 0
##$STSI= 32768
##$STSR= 0
##$SW_p= 5175.98343685301
##$SYMM= 0
##$S_DEV= 0
##$TDeff= 65536
##$TDoff= 0
##$TI= <Analysis number 999999
Compound Code 99
Book Reference 9
Project Code 9>
##$TILT= no
##$TM1= 0
##$TM2= 0
##$TOPLEV= 0
##$USERP1= <user>
##$USERP2= <user>
##$USERP3= <user>
##$USERP4= <user>
##$USERP5= <user>
##$WDW= 1
##$XDIM= 32768
##$YMAX_p= 299606908
##$YMIN_p= -474708
$$ End of Bruker specific parameters
$$ ---------------------------------
##NTUPLES= NMR SPECTRUM
##VAR_NAME=  FREQUENCY,     SPECTRUM/REAL,   SPECTRUM/IMAG
##SYMBOL=    X,             R,               I
##VAR_TYPE=  INDEPENDENT,   DEPENDENT,       DEPENDENT
##VAR_FORM=  AFFN,          ASDF,            ASDF
##VAR_DIM=   32768,         32768,           32768
##UNITS=     HZ,            ARBITRARY UNITS, ARBITRARY UNITS
##FACTOR=    0.157963299565203, 1,           1
##FIRST=     4132.6476996994, 0,             0
##LAST=      -1043.33573715361, 0,           0
##MIN=       -1043.33573715361, -474708,     0
##MAX=       4132.6476996994, 299606908,     0
$$ Real data points
##PAGE= N=1
##DATA TABLE= (X++(R..R)), XYDATA
$$ [...]
27622 -89678 114054 39180 20000 99038 140924 154479 144542 163571 105021 163763 214381 138934
27610 138934 24963 16035 31899 71002 106451 74070 95263 -11757 -108285 -35014 169401
27599 169401 86654 8334 106017 210509 137100 62112 119180 -8436 -37727 -11957 51359
27588 51359 174905 257946 327984 376453 309245 124611 31285 6484 -31903 -19712 52166
27577 52166 94112 136462 227626 382499 339840 247936 201515 185044 101393 52996 68437
27566 68437 -4856 -70438 -127176 -233952 -248419 -127424 -55190 -84212 -147310 -92408 -96165
27555 -96165 -108376 -120284 -60649 37978 33880 -54808 -102603 -2885 106262 68753 6966 -7170
27543 -7170 -6908 -45307 -45315 -36138 20274 67427 121263 47104 -11135 -82314 -35145 33465 43597
27530 43597 97913 112587 15595 -136 -15411 -25314 -45230 43854 34845 21559 139029 92058
27518 92058 80531 22714 -45429 -141872 -174242 -147957 3559 19475 3548 90375 35279
27507 35279 13518 214859 232401 125631 42402 25334 130981 42233 -31146 52270 119440
27496 119440 122297 16693 -93258 -37383 53505 115428 209873 52402 -104690 15722 77094
27485 77094 44570 51144 118302 92832 -8862 64440 55849 30621 -117583 -106355 -5845
27474 -5845 8822 27200 -34096 -191549 -247054 -34798 176630 131787 26817 64355 148851
27463 148851 120666 109807 109027 26331 32242 107391 196908 215814 141878 109807 207042 230472
27451 230472 305409 203793 102041 123234 168258 259867 195491 23289 -75179 -48455 21178
27440 21178 111962 162741 75872 42254 111759 -381 -30529 -31918 100711 163803 -691
27429 -691 -86342 -37515 -37746 -124443 -58281 83849 134060 -648 -117235 -76448 -31656 48773
27417 48773 -74145 -171958 -127366 -78048 -35878 39865 69901 18734 32004 43114 -8629
27406 -8629 -168957 -105347 -21017 -45067 -75162 -24513 -66627 17293 55044 -126997 -159925
27395 -159925 -192542 -118269 54508 -13229 -82724 -33387 37520 113249 165030 119085 85854
27384 85854 -3899 -29257 -83432 -135724 -131983 -12138 92974 48175 52562 54978 -134382 -188839
27372 -188839 -45409 46414 91485 151496 78037 -30334 -103012 -60142 48683 37257 30319
27361 30319 55222 54529 97096 129321 104497 130209 249960 185679 159696 138058 195222 195356
27349 195356 -15441 -170110 -23951 109503 -39123 -155015 -137363 -172494 -164796 -102174
27339 -102174 -31421 52269 -4084 7653 70634 155526 150355 44900 52797 41778 49575 154767
27327 154767 254643 289923 201238 115749 36196 11196 -68655 173797 268193 205675 28853
27316 28853 -120339 -64991 30444 66485 98159 118271 198384 275735 252245 171467 51038
27305 51038 -28582 -40039 -92838 -130950 -80277 -118842 -144117 -3815 52693 50771 77557 24887
27293 24887 -81624 -128817 -103183 16156 46499 9132 111064 72262 132681 236508 151038
27282 151038 57589 -5466 -34577 37463 109461 54720 98227 240064 234297 237416 240373 68532
27270 68532 2364 25092 46593 39297 -76951 -72439 28663 -9841 31595 32694 34859 135542
27258 135542 132750 65606 41385 3777 -141993 -151224 -168755 -101003 -75734 -63292 24725 -32819
27246 -32819 7660 -42023 -47565 95443 128152 148971 91208 85232 155092 166694 101224 43545
27234 43545 -8328 10098 58301 117215 188618 155746 169918 202380 207344 214523 244413 255380
27222 255380 267004 254431 150459 125595 87090 18728 -23385 -46999 68198 169205 262087
27211 262087 241840 139171 38858 -30700 -76969 -14761 -49519 -52225 -40033 3444 -38321
27200 -38321 -113653 -150023 -146590 -19165 65027 38346 2141 52770 7428 -11466 12008 82715
27188 82715 254567 166401 39005 43593 102532 212691 93249 -31491 -45831 -40884 -24165
27177 -24165 -29035 2985 -10495 -93281 -111163 -75939 -101244 -195301 -100638 -52569 -12985 20444
27165 20444 -39412 -80277 -147483 -149265 -64136 66724 93310 109138 105277 59468 37920 -57977
27153 -57977 -37500 65026 -1669 -39586 -27691 58116 109920 58060 35609 107086 99842 100133
27141 100133 81353 66943 53632 -43324 -177770 -133324 31619 98237 177963 185949 78464
27130 78464 59988 60010 48528 23840 -23583 -13759 49743 49447 75002 33146 -74019 -56270 -33086
27117 -33086 12784 -80046 -95705 -13621 -21255 -23904 55850 110738 60149 75801 149993 197348
27105 197348 77408 -38785 -62142 -21877 39275 155037 132628 67512 40822 2343 -20067
27094 -20067 -33472 -3473 -80453 -188753 -199528 -74028 -51985 25553 79423 62597 -69576
27083 -69576 -72197 -94281 -137503 -179568 -209388 -199467 -171369 -202401 -261224 -290296 -250980 -153361
27071 -153361 -236701 -30699 -93550 -166345 -35640 -21577 -1821 -34976 -29670 3519 -18141
27060 -18141 -159680 -174446 -145673 -87587 -31480 -80386 -108187 11547 53627 20264 19798 17536
27048 17536 -135436 -262577 -282569 -181286 -5229 40634 -31045 -46564 64930 95709 7024
27037 7024 -18066 -30892 14358 67380 165309 42950 68907 28242 -36070 55824 200642
27026 200642 259284 281472 319447 171078 66661 -20880 -31691 14223 -15969 -54923 -23485
27015 -23485 4351 -29711 -39899 50408 108238 158656 145876 133860 250780 258789 140517
27004 140517 120223 637 -85974 -103132 10903 118164 33966 -32420 -45279 56245 25837
26993 25837 172367 282316 152741 97370 58133 -4432 -100857 -93384 -102849 -2249 27005
26982 27005 -5536 -4775 -10357 -15952 76226 53721 -37908 -48042 53935 157364 121200 148494
26970 148494 9244 -165292 -99857 6097 76303 20682 55072 71997 -7714 -185040 -140731
26959 -140731 -26846 -54151 -14948 36318 135119 143970 122642 82372 34362 23456 817
26948 817 -66748 -57086 -43394 -13952 31374 30449 -26143 57114 87514 -65174 -125002 -14849
26936 -14849 59286 99281 42420 57865 81027 27249 65849 105497 -2821 -63463 -36083
26925 -36083 73142 71815 29468 119287 114128 41355 -34450 -24783 52048 20467 26280 -4799
26913 -4799 15162 -39702 -119473 594 159984 129023 45913 -27708 -1185 49244 129651
26902 129651 102581 48699 91139 -37571 -94403 32437 -74941 -150203 -172257 -58920 110882
26891 110882 116183 -12837 -2656 -57492 -43259 -68516 -46348 70081 84732 17016 -63433
26880 -63433 63924 93432 48629 3541 -16058 -5610 -24934 21342 42072 45680 -18779 -31284
26868 -31284 -55838 52298 117854 90125 78661 30558 69171 93203 98413 102529 85737 57739
26856 57739 41451 31675 17809 16664 52047 -131023 -118576 -116701 -151894 -197550 -127409 -41216
26844 -41216 29324 -40376 -238819 -108921 -39589 -66599 -81858 -44630 9071 56812 61639
26833 61639 23507 51733 -2729 2754 150367 275167 245278 173939 196274 139626 159059
26822 159059 40562 -6307 -39713 -151873 -128289 -128663 -100644 -43435 -59808 -210838 -83500
26811 -83500 104231 203094 233189 223418 250461 279317 289064 307850 261148 188562 111577 65552
26799 65552 102960 187483 307072 266710 160511 217529 203496 66085 38023 -24580 -133339
26788 -133339 -209419 -131942 -111358 -188816 -148882 -80728 -62352 -82369 -120249 -126414 -68410 73085
26776 73085 133641 152651 46133 44710 136747 6968 -62686 -49720 47632 -19773 -32428
26765 -32428 37070 90779 163038 90189 -101059 -129197 28915 42269 89871 -50956 -49661
26754 -49661 -16368 -28660 3241 -63451 -91252 -15717 107844 157345 257984 232713 128447
26743 128447 61364 57211 61195 -9806 -34320 -35166 -97035 -6208 -67529 -162455 -69133 72414
26731 72414 120933 171318 192400 108171 -29006 -67643 -32387 -25811 -17194 84749 269199
26720 269199 306852 176895 136848 50903 -1035 -146880 -93825 -114825 -149343 -76541 -53461
26709 -53461 -105675 -133930 -182707 -117103 -81480 -74409 -2033 46942 152854 202917 152695 117065
26697 117065 -67202 -227567 -235240 -234451 -114730 -100973 -106213 -77185 -24079 31098 -5684 -276
26685 -276 -101036 -73737 -141464 -157998 -209085 -126657 -12003 58523 -16538 -76353 -122398 -120016
26673 -120016 12012 92168 14230 -96327 -60408 -100189 -93161 -152973 -274560 -362317 -192450
26662 -192450 -33695 -68699 37104 105765 80737 139294 178762 79744 107192 162336 205840
26651 205840 225901 100853 132141 182423 121268 92388 847 5201 -27843 -55445 24171
26640 24171 76234 182568 153235 47863 24283 40582 -44143 -24087 55785 94198 108762
26629 108762 53159 77425 179566 141248 19528 96783 117973 77777 145593 19686 -106985
26618 -106985 -80784 -9273 32596 82327 181470 126282 44191 -71524 -6293 -50053 -204014
26607 -204014 -198726 -108102 -43672 -124871 -63841 -184519 -254799 -218307 -139850 -88272 -58709
26596 -58709 38697 134616 131368 -57052 -111603 -102277 -86361 -133395 -127485 -36865 83895 33204
26584 33204 -76928 -55457 -51617 -101183 -69290 -125463 -152026 -34469 127615 141487 61820
26573 61820 -4575 -132532 -10316 17749 -86715 -158542 -25028 -24404 37674 131768 -12810
26562 -12810 -98122 -145652 -146086 -70684 4436 113470 117811 10363 -24860 -70036 -33405 -32524
26550 -32524 -34803 68235 155749 157152 117527 68768 33076 -22618 -137536 -186341 -164211 -152250
26538 -152250 -171080 -147228 -97611 -119179 -54992 -80285 -137633 -61543 -29778 -50286 26902
26527 26902 21225 31779 88416 81626 81154 60092 60366 154132 150413 87462 -7485 -34289 -28978
26514 -28978 -77050 29061 92030 54216 -5106 21403 -18418 28519 45238 -19044 21982
26503 21982 60415 46044 45463 69341 79262 -83014 -93583 -62530 -44324 -70554 -2775 10177
26491 10177 64613 117881 166371 213200 155745 62082 143552 140138 -7399 -62320 -168814
26480 -168814 -192006 -159832 -90039 -152938 -203426 -120550 -202147 -144449 114670 257658 180977
26469 180977 32546 71852 68452 85750 69443 85814 91023 102973 -35675 -161231 -172550
26458 -172550 -259123 -251983 -170623 -96744 -16322 -89110 43139 97651 41541 89313 56000
26447 56000 73337 75674 166435 49458 38966 49748 16849 -32489 10715 -45577 -120157 -73580
26435 -73580 -57219 36103 153868 209689 49079 -28298 77138 95633 65194 33868 -56818
26424 -56818 -130689 30236 13850 -109257 -166922 -163179 -141786 -92478 32891 -37548 110449
26413 110449 127236 41121 -55415 -34616 -140747 -314900 -318647 -282728 -298906 -249874 -217864
26402 -217864 -273696 -231414 -233844 -234418 -72450 61063 15952 -74627 31345 4934 31164
26391 31164 53140 1092 18951 -8158 -38794 103876 79751 -45374 -26691 33562 74077
26380 74077 -30773 -26750 -18732 96868 141673 124961 160150 144419 76307 -2999 -14265 -191819
26368 -191819 -130038 -136141 -84732 -68372 -182159 -313764 -233351 -144132 -124336 -33882 53546
26357 53546 134336 203048 178399 65865 106808 181958 180541 75335 -26064 9885 -13139
26346 -13139 42195 84535 -1016 14316 34329 45163 48123 1206 5614 51037 30256 -17515
26334 -17515 90370 111289 129169 24654 -32928 88476 162023 185131 231663 193811 214782
26323 214782 185049 110822 130505 121703 -12320 15900 -20746 -146595 -69352 27164 29989
26312 29989 -11680 -31692 -5515 35055 159249 238607 152702 17878 -63336 -45621 -645
26301 -645 61535 -41444 -63001 73109 157141 196518 94678 139384 66053 -30193 -24731 -46292
26289 -46292 -184627 -181701 -69577 -61795 -56048 -20218 79692 238555 294570 134400 -121122
26278 -121122 -239529 -177386 -45735 14575 57852 87729 94872 15354 12562 22657 96042
26267 96042 -70504 -269422 -279902 -134295 -49307 -53209 -129425 -164133 -130395 -102393 -110645
26256 -110645 -72468 -20858 -19952 35234 89645 30793 -66155 -108001 44055 160469 167547 110669
26244 110669 94775 53245 29433 -56225 -136 192698 224242 41149 -4283 -3117 67076
26233 67076 98069 37098 -67362 -119768 -101221 -15843 54675 -11599 9830 54499 55716 -121654
26221 -121654 -200674 14387 -21834 -151563 -112979 -32793 97066 112743 77737 69947 127699
26210 127699 99004 122815 177920 225506 122023 103188 24044 10272 16949 -22294 -20797 45241
26198 45241 22865 -61405 -116953 -134410 -132694 -303708 -353281 -192517 -128448 -106823 -66018
26187 -66018 -76017 -149338 -156757 -99832 -36783 -7320 43399 -8733 -19892 -13301 -130722 -69760
26175 -69760 -48294 -113233 -162391 -248975 -273493 -156010 -53698 81634 97194 81885 76921
26164 76921 72261 -26760 -59161 56964 68698 27860 32509 69625 26600 -39674 -11761 16335
26152 16335 64240 186753 153683 51915 154068 199340 85428 31213 -44798 -3016 -8543
26141 -8543 35804 -7354 54298 43928 42692 164371 149781 57614 -10716 -123066 -134467 -116312
26129 -116312 -49447 34289 61865 34963 45293 132989 135644 -18699 -46271 -50485 -44668 -4376
26117 -4376 6114 -84960 -85372 4791 38818 73939 137406 147967 94597 -11357 -200993 -278185
26105 -278185 -125308 2303 88529 101627 143366 160287 143806 217633 253439 105027 10287
26094 10287 72944 146025 101453 156791 199538 25268 44782 205148 257925 178058 13631
26083 13631 -3576 3184 99118 136160 47963 -60406 11038 12215 -45459 -17370 -44412 -83773
26071 -83773 -28690 20291 97621 31145 -80715 -94230 -14681 -2197 1811 -43762 -46208 -18064
26059 -18064 -30449 -123480 44943 241611 102002 -36382 -45144 -37475 -72105 -129132 -117580
26048 -117580 -88309 -94799 -93937 -85336 -76589 -71521 -6415 26363 31810 -154063 -128537 6646
26036 6646 86284 74240 44036 41425 -68891 -86230 -12806 -40854 -32949 -52270 -55974 10519
26024 10519 -133765 -121050 -4028 -4001 68924 91866 219923 202483 48062 96248 142100
26013 142100 123187 87966 -88892 -170737 -152918 -86978 -45494 -121702 -139603 -97815 -68929
26002 -68929 -155447 -103739 -113493 -78812 35537 -74309 -130490 -67032 -77977 -63980 -49576
25991 -49576 -35635 -27736 108873 113599 93764 71103 8013 -114742 -45457 159740 40114
25980 40114 -73534 -1734 31276 32354 73973 87188 -4851 -17977 -84431 -108965 -104723 -172868
25968 -172868 -169914 -121269 -215549 -184581 -114644 -54891 -83254 -97352 -65889 -56324 -44086 -8216
25956 -8216 6948 -28132 -22431 44801 71536 93662 94513 9897 5287 76169 115191 89101 91851
25943 91851 177260 185330 70377 -23019 -115557 -39479 -1412 75486 51417 -73421 -128205
25932 -128205 -118167 -78222 -12167 2963 -29277 6501 -62893 -76055 -83614 -92550 -17503 14532
25920 14532 -134002 -132289 41633 82482 -27667 -67395 17971 -23752 -147386 -163445 -110599
25909 -110599 11485 49487 -18274 -156372 -68796 102363 86114 -103177 -100203 -73151 -38644
25898 -38644 -174972 -204315 -252731 -96023 44206 4832 -3018 166941 181507 138451 111759
25887 111759 86648 128112 186086 135327 108579 -30813 -128610 -38268 42816 -125161 -153918
25876 -153918 -157027 -170106 -140175 -90654 -13359 23155 55615 92925 114299 -575 -44080
25865 -44080 -43160 -63589 -218255 -111855 19663 62236 14199 -49257 -30131 65205 59278 71527
25853 71527 90190 31085 158172 286841 296235 197790 99853 137902 13289 -54128 -16213
25842 -16213 -67401 -155188 -108366 16320 124776 165949 204477 49507 -30483 74794 104421
25831 104421 66193 -29116 -64453 -155109 -102340 -81643 -225701 -242321 -92154 2445 113364
25820 113364 103149 12851 36292 -13285 -61611 -69411 -105159 -139288 -33912 -21616 -23927 7363
25808 7363 -78777 -118396 -74385 -63370 -20751 46489 -13095 41043 142208 128863 -12636
25797 -12636 -36874 -105142 -29584 16643 70835 30336 -38954 -57753 18830 70311 48707 42630
25785 42630 28550 17411 111102 49894 32521 65107 11036 -72318 -92217 -40101 -21157 31419
25773 31419 -6262 -132771 -142685 -41451 16855 -77837 55571 186916 145417 113503 27245
25762 27245 -101064 -300196 -249318 -88064 -27231 4344 55490 -6238 -90582 -187993 -179204
25751 -179204 -33893 76715 37393 -91835 -95925 -127260 -20820 -40205 -20443 -43203 -93934
25740 -93934 -19156 -49346 -78450 -127223 -54168 -117093 -79006 -123448 -41925 24161 -114947
25729 -114947 -90550 27035 17204 -105342 -79124 -48769 -28903 -51020 -62020 -13336 25148
25718 25148 109731 81880 -13300 -153399 -179293 -121028 -50958 998 342 -34016 -170473 -254116
25706 -254116 -145528 -219971 -161990 -80709 -44034 -106696 -138321 -68159 -51307 62624 84784
25695 84784 81207 12270 -134342 -176962 -146971 -189719 -75313 145504 178520 217540 297262
25684 297262 231750 211924 403913 443324 377510 319157 218662 162921 41028 -1071 84784
25673 84784 151310 142976 179690 191685 45795 -60504 -40269 34435 22667 47530 -10927
25662 -10927 -25845 -88331 -114513 -109151 -177301 -215681 -112587 -146824 -168311 -50385 9851
25651 9851 -13107 3798 -4550 16396 -88765 -40878 40587 101982 82858 -19316 -159935
25640 -159935 -194124 -80855 -11235 -26655 -23927 -56508 -40265 1189 42568 -11976 11712
25629 11712 -27946 -70511 -84626 -187489 -136006 -41689 42011 57811 -53697 -87381 -19726
25618 -19726 -51508 -28215 -58430 -50949 28712 60038 -59876 -85717 7026 87085 136869 80188
25606 80188 79674 127838 140873 91968 -37034 -80394 -58467 -73890 -38625 5967 -87759 -67458
25594 -67458 15277 -75446 -149173 -190439 -261418 -194797 9801 73406 2055 -3116 52847 25225
25582 25225 -38996 8945 -25224 108982 250922 124102 76273 177939 254664 222589 138824
25571 138824 50984 -38533 -38242 -54420 -44169 10798 -62725 -8704 -98308 -178137 -101817 3785
25559 3785 74623 -3820 -34866 -54671 -83751 -57436 -55361 -83771 -25304 5274 84773 36575
25547 36575 -20534 -22613 -68393 -21996 10366 79718 58518 -28337 58307 31169 2825 15304
25535 15304 79442 59871 81384 99607 -2590 -2780 -13146 -25837 -142909 -112485 -164427 -58772
25523 -58772 42838 115337 152989 45550 -74865 22019 70720 196377 207833 15042 -4701
25512 -4701 45746 157748 197278 287835 195889 -9915 -30857 -22832 -77648 -97651 13649
25501 13649 125471 112108 -19305 -10598 -76680 -118662 -27490 17023 75112 108424 27128
25490 27128 -23324 57952 17835 35237 12278 127491 265754 273823 176629 43478 -7180
25479 -7180 -31277 -54966 -5627 -67195 -124315 -109474 -44767 64349 39263 -85907 -112378
25468 -112378 -154289 -164892 -219792 -253570 -167093 -50461 -2720 -36128 -21297 -101069 -167864
25457 -167864 -88127 17783 -54913 -31887 -1354 -2532 -81941 -95961 -69369 82510 28744
25446 28744 10510 -18458 9442 -37634 -62099 -84575 -45640 -133167 -165819 -211407 -213277 -100370
25434 -100370 -57214 20482 18882 -74943 -79414 -198994 -203477 -72574 42126 60778 19331
25423 19331 58037 -14843 -119349 26320 79349 -2459 -32074 -57252 -54306 184307 332755
25412 332755 255369 61726 -66100 -73235 -148941 -219483 -104110 35445 218967 247396 27663
25401 27663 -76568 -7852 -73210 -38988 90065 168499 77687 -49722 -41239 7358 45010
25390 45010 9030 58581 97295 -32957 -61534 5045 -58823 -121942 -102262 -84701 -226281
25379 -226281 -338385 -164946 -87623 -74000 -147349 -103788 -29272 -98304 -193734 -143890 -80417
25368 -80417 30705 78352 58379 -75913 -203191 -247217 -143451 -935 22014 -42292 37512
25357 37512 67809 145278 137182 -18188 -77469 -91475 -93949 -43087 84750 161579 202824 125791
25345 125791 61284 -22422 -79841 -179252 -137685 -60408 3498 -72567 -234323 -154428 -32638
25334 -32638 -175964 -213753 -199068 -113562 -102731 -160173 -180181 -136629 26366 120009 131147
25323 131147 123781 215647 135280 46340 26148 -13368 132468 119482 34982 78807 -57742
25312 -57742 -34523 70436 64884 91161 46447 -11362 -61850 -60391 66680 146858 58978 17462
25300 17462 52936 -21264 49123 -13984 -35286 34308 125519 -9444 -56400 12548 95578
25289 95578 37441 -8863 12359 -5467 43386 95872 95442 183082 262603 195961 120236 16369
25277 16369 -1063 33904 52948 131836 103601 36487 7592 -15845 -97684 -72928 17328 10441
25265 10441 42156 28686 -81938 -133759 -86422 -45782 20649 -73059 -31109 47813 60867
25254 60867 42829 129889 193795 47856 -58641 -16293 27805 54109 10113 -65195 -71469
25243 -71469 -67647 6262 115222 72062 90808 -14008 -183424 -219098 -72278 54522 56672
25232 56672 68376 73809 62111 24289 -39210 -103824 -162917 -165027 -83301 -72745 -78697 -49775
25220 -49775 -19539 -67611 -98183 -70756 -5353 -47632 -11390 -59335 -117403 -139945 -163146 -206567
25208 -206567 -261009 -147944 -34806 -97912 -75482 67059 -59881 -67668 -10197 36685 -5758
25197 -5758 14019 -69711 -91184 -13465 -52768 13511 67198 30009 56763 139635 145312 143150
25185 143150 163287 76935 -75224 -31716 128769 -7064 7650 84970 138490 128795 -72235
25174 -72235 -87861 -151012 -180420 -159372 14410 190151 215259 30024 -112763 -63939 -37783
25163 -37783 28931 80307 -67266 -89422 -57325 -129873 -131961 -65734 -39773 13545 -142988
25152 -142988 -122395 -18283 113986 227482 176253 96903 -7122 -12209 -84483 -69858 -170368
25141 -170368 -129108 -128265 -79051 -108542 -102710 -109749 -242192 -110574 21507 50596 127784 129757
25129 129757 64715 8038 61541 125063 127788 110625 42190 -78985 -26087 -44959 -66037
25118 -66037 54324 61946 138465 157070 139333 1195 -27802 -4909 69384 106782 -50297
25107 -50297 -47057 -14702 -27262 27298 66436 117466 196945 184749 11029 -102539 -88206
25096 -88206 -66348 -166073 -71785 -74841 -126924 -100895 -107888 -239210 -228855 -209494 -186841 -169779
25084 -169779 -172727 -11024 108266 87450 -5159 13094 3494 -14049 1725 -59643 -11207
25073 -11207 23430 85702 210892 228465 219550 239885 156209 135171 132775 77162 38788 -22396
25061 -22396 -158978 -135740 -55641 13921 142101 110595 119396 165049 71201 -21984 59470
25050 59470 -24556 -45007 -6980 -1911 -54494 -45533 -27479 233 23634 -13877 -19890 -59982
25038 -59982 -92661 45549 44336 40279 10090 -99184 -163623 -163613 -101547 -41273 9985 30602
25026 30602 -43911 114982 138543 -8136 -105410 6171 25164 45458 55182 -7089 73044
25015 73044 44927 -145551 -221386 -232648 -269466 -201874 -161552 -54794 -58820 -142794 -132529
25004 -132529 14696 150678 171818 86434 -50753 25152 113277 105569 146629 121211 52001
24993 52001 73735 171217 228806 86311 45915 183129 191212 188081 250282 196304 201218 210310
24981 210310 103554 87773 89335 -22178 -56978 -42707 5380 95592 118447 67488 73365
24970 73365 3883 -71956 -69123 -93044 -49939 5729 72766 6536 -37772 -18825 35059 63875
24958 63875 -1014 -112000 -68922 -116638 -106338 -39594 4466 50819 82507 44099 139550
24947 139550 80586 -7187 93757 85733 27374 91520 119304 112062 26111 84133 95492 19193
24935 19193 -20423 -76043 -2816 30138 40365 129518 154172 148692 119354 115567 66132 -29828
24923 -29828 -67851 -70203 -24762 40742 90598 61259 11409 -78933 -10620 -64696 -79268 -76325
24911 -76325 -159960 -151084 -164866 -88755 -31119 -53924 -9314 62520 46801 95382 69192 -52810
24899 -52810 -66412 -108614 -173241 -103008 -99659 36025 279886 169487 -42387 -60662 -38141
24888 -38141 -11131 25819 -13398 24011 -100933 -118840 -107302 -125476 -187021 -117666 -149984
24877 -149984 -176943 -117862 -72328 -46545 -29359 -200909 -264836 -165211 -217858 -280728 -164948
24866 -164948 -62181 72905 65297 17323 -5897 -53535 -99425 -33037 -78399 -68265 -79352
24855 -79352 -75139 13946 91722 79618 -2590 -101019 -79891 -82074 -109340 -183320 -162070 -30909
24843 -30909 -62673 -144755 -147839 -40101 20862 76215 6471 -95893 -54773 -20946 -105925
24832 -105925 -157206 -202143 -213898 -154674 -118209 -149195 -162547 -12354 71531 -30050 -59888
24821 -59888 -52032 -101033 1396 37524 22640 -23771 -22548 17210 55937 106945 92413 53372
24809 53372 7518 62667 168479 168371 149003 130362 168911 162834 32347 -114422 -135177 -73695
24797 -73695 -80381 -101260 -156862 -152831 -90233 29239 15844 -28841 -86528 -119783 -129631 -171066
24785 -171066 -122543 -37567 -12428 38972 38408 -122077 -118891 -103834 -108126 -24452 82330 99903
24773 99903 104545 80052 60921 87952 54942 92906 167305 149763 98065 -83460 -167740 -107291
24761 -107291 -59920 -85276 -57226 16922 65591 12535 -23444 -102970 -139238 -48664 -12701
24750 -12701 84159 -38123 -100554 -121498 -82952 -45305 49447 4920 -76000 -136607 20694
24739 20694 123465 -12777 -14611 58045 123014 137624 90379 151905 240842 189788 65833
24728 65833 65341 53051 35548 74645 40510 -18246 -55826 -187771 -102099 32689 59700 -4670
24716 -4670 -109095 -171337 -189787 -128255 -147280 -133103 -83056 10099 103876 214453 198201
24705 198201 132387 -15496 -175362 -202474 -91821 22337 42423 38349 -17855 -22926 -75885
24694 -75885 -22631 78172 182138 249639 124152 -26400 -149209 -64544 -95281 -185303 -182354
24683 -182354 -200377 -124215 23029 120339 44777 -53049 -86303 -123816 -136498 -34405 -4753
24672 -4753 -28727 -40494 -69523 2211 69116 -87733 -151772 -59298 -31951 -52734 -58237 -27197
24660 -27197 18018 78079 165660 221703 119732 24140 40499 -43271 -14662 8632 -27850
24649 -27850 -17292 -91 -70568 -68831 -242103 -290734 -119476 -36065 10139 18373 -80648 -111176
24637 -111176 7535 35634 114018 112029 -7299 4676 36883 38078 87911 113727 40689
24626 40689 31982 107322 101711 52688 -78970 -42727 30605 62782 -58083 -57072 -44648 -25753
24614 -25753 61353 106133 122973 8192 -77111 -123676 -133981 -24782 29309 62750 56206
24603 56206 28512 35080 37418 -34919 -107022 919 -38986 41625 93015 135916 65462 13872
24591 13872 55366 51512 -38186 -51958 -38304 48034 -100423 -125883 -115775 -14235 64815
24580 64815 116907 178983 277943 335865 257493 132963 73804 87151 54110 -20579 -137038
24569 -137038 -87755 -18551 44013 49432 91452 112315 18355 -21761 -2692 6085 48777 -38026
24557 -38026 -105030 95433 134296 25975 -39937 -66700 -49619 4628 -40590 23328 82741
24546 82741 11634 -45597 106688 120758 147359 136604 10010 -43184 -1400 130108 143927
24535 143927 54687 -62428 -176733 -153645 -146811 -97867 -73249 -11583 -11605 -65207 52189 144462
24523 144462 90200 33001 -27473 49871 47542 60233 96729 35889 -51777 46920 158301
24512 158301 -49317 -85113 28267 98382 88771 98795 95777 38591 39607 157070 266896
24501 266896 121742 -1849 20780 49501 -4614 -118723 -91964 39726 -11737 -51591 -71772
24490 -71772 -36493 -62688 -46920 16093 22002 15010 16306 2987 8046 -59695 -89688 -22508
24478 -22508 137693 189527 170442 136356 68460 21772 27988 -14266 -57422 -76007 -19826 -49721
24466 -49721 -46289 -38693 -20504 -55932 -12836 -72621 -173689 -42558 117096 129014 61122
24455 61122 873 -107172 -94224 13304 117801 163730 91219 78780 53569 83312 143422
24444 143422 114045 84872 38160 -83677 -55582 18767 78216 31699 120958 53249 -26131
24433 -26131 -26631 51321 173094 142847 94142 56745 -57799 -170663 -149412 -127167 -103899
24422 -103899 19391 161209 173242 23778 -145483 -139381 -59992 10871 101114 76591 60217
24411 60217 58865 105358 127887 16446 -8173 -146807 -245491 -187395 -134153 -63409 54891
24400 54891 48026 122335 46379 70523 100102 -9341 -40073 21008 -22312 28651 75919 19124
24388 19124 103706 107813 72855 292731 262384 177875 -45763 -47127 -4872 31373 42496 38587
24376 38587 150055 102878 -11675 -51126 -17473 21909 -74311 -71555 -24316 40070 49918 79946
24364 79946 21692 -54206 82326 74568 -24573 -17943 21065 -87368 -130381 -97165 -113309 -70347
24352 -70347 -91495 -143471 -100144 -106135 -141277 -133914 -62040 -51659 -57585 22630 14112 116933
24340 116933 184285 155505 63091 -64795 -8577 -10998 23818 4928 77917 35679 81814
24329 81814 170473 234821 37654 -62018 172896 149226 162785 182430 182889 199987 29741
24318 29741 -95757 -77848 -73268 -128089 -147995 -77097 -92063 -138219 -98063 -59715 -18995 -18621
24306 -18621 -89115 -81276 -9835 20620 -58627 -62425 -116565 -78343 -141526 -169882 -209010 -240953
24294 -240953 -237245 -204515 -132134 -203486 -161716 -131687 87186 236659 286636 200656 80015
24283 80015 126923 -10219 -67543 -55816 -63826 -85388 -169029 -241652 -172884 -133110 -162180 -110278
24271 -110278 -24318 122585 129916 55150 -30436 -31341 -59945 -139494 -215653 -190414 -153037 -131582
24259 -131582 -217236 -100582 -58278 8668 -17005 -147421 -140467 1377 93803 114764 81986
24248 81986 79025 144893 149661 -8601 3319 67224 123738 42528 -22669 -28811 -26549 -36567
24236 -36567 59832 -22203 -35434 -65791 -60595 -46796 -46149 -127855 -237630 -157350 -43987 7968
24224 7968 84647 67255 -63458 -61899 12069 -17721 -1373 95266 152487 131383 18479 -7020
24212 -7020 44814 105233 26109 -57207 -53775 -150845 -196552 -190778 -123368 -29132 1339 -42130
24200 -42130 50558 95701 190854 196012 142357 5310 2538 107774 158436 163359 104642 -45306
24188 -45306 -32195 -130141 -39314 85628 62840 11915 5804 22036 71079 -675 -124812
24177 -124812 -245733 -259397 -294989 -191231 -71460 -38990 90507 180836 108160 -93676
24167 -93676 -24250 36659 -66150 -46475 -108448 -195980 -219665 -241921 -144018 -134519 -64271 53461
24155 53461 162732 163324 70457 106593 129169 1019 -23115 -54482 63843 130484 130539 176860
24143 176860 117738 161167 116936 113435 33184 -29565 -53990 -18537 -16105 112432 127688 35856
24131 35856 -55604 -79458 -174825 -185122 43120 116951 46945 9952 -57944 -35372 -1295
24120 -1295 -71005 -174881 -184170 -154204 -139625 -4057 2152 85632 108256 68523 34217 20020
24108 20020 -43111 -150184 -187088 -107505 -77204 32697 61105 66179 -14985 -50157 6639
24097 6639 -68688 -49195 10148 -35704 -91896 -130446 -218377 -161922 14352 49165 72931 71957
24085 71957 -19401 -67365 -28157 78498 250210 243076 129937 57614 -27487 -133620 -124013
24074 -124013 -67530 36186 79292 -49622 -47942 18939 19907 67778 92339 117423 201774 202406
24062 202406 170256 263325 237400 49307 -90107 -15696 131284 98361 98084 87699 34527
24051 34527 -119175 -124803 -70241 -43624 10197 11123 -8988 63694 -66892 -79062 -69177 -161276
24039 -161276 -93963 44362 168018 125422 35916 53706 128814 209645 150360 199843 271609
24028 271609 163730 -42817 -74574 -61986 -21502 -73069 -27896 -18407 -59124 -22308 -70358
24017 -70358 -58710 -18537 -76973 -47926 -79385 -142995 -97594 -68803 -96700 -242255 -397045
24006 -397045 -461661 -311476 -164116 -28629 19496 27446 -50499 54931 86618 65615 70633
23995 70633 168948 133280 92682 184271 218877 277951 211266 49537 -52913 -68702 29374
23984 29374 58713 -129886 -211111 -92202 -38653 4708 -2888 35218 -70652 -255129 -362403
23973 -362403 -283432 -178395 -79992 -41735 38295 51305 153934 190162 132936 59885 21169
23962 21169 28396 -30750 -95823 -127697 -150678 -70943 -3306 -15944 -78427 -96851 -249815 -240368
23950 -240368 -150319 -195355 -194605 -227485 -239549 -90500 131987 157830 -82955 -123605 -136281
23939 -136281 -166508 -156989 -62040 -89796 -138258 6488 96944 118793 36741 51264 93641
23928 93641 -2320 -33893 -15396 28800 37532 49749 -18135 8574 65023 166861 257488 293914
23916 293914 340196 242626 132962 28189 -132519 -208637 -208727 -158597 -122103 -163836 -189045
23905 -189045 -104877 -72086 4558 89483 -13257 -101036 -136808 -125087 -177498 -115409 -37722
23894 -37722 -110170 -82371 -69738 -24776 67619 -17983 -32276 -88117 -96116 -135707 -179319 -170097
23882 -170097 -28789 21208 -44390 -5623 -98505 -153474 -79742 56314 123071 32952 91788
23871 91788 16551 -53289 62042 8735 -22673 -95134 -144481 -132557 -173073 -156603 -102884
23860 -102884 -119993 -184929 -148304 -114035 -111807 -43903 54709 -73215 -100921 8586 -87070
23849 -87070 -117881 -66523 -63016 -86554 -136746 -166721 -162825 -165523 -107410 -52851 -102697 -152189
23837 -152189 -265313 -330304 -253904 -207731 -120232 -152742 -154864 -213169 -169341 -157508 -141787
23826 -141787 -60382 -83129 -60962 3184 -23592 -160837 -124282 -60538 -49075 17589 -10951
23815 -10951 -47854 -72811 -103182 -59991 62737 -9060 -90727 -198256 -197413 -130275 -124123 -53295
23803 -53295 -95753 -123178 -6495 63163 60177 -41499 -126702 -59733 -46485 -63165 90252
23792 90252 203287 212089 229849 308729 320906 178690 -722 -68849 -19917 -2206 55034
23781 55034 39503 -122068 -184865 -206687 -167958 -77976 -51040 -99363 -181330 -204854 -179330
23770 -179330 -321402 -289975 -65334 33906 115209 27390 -112821 -171544 -173038 -179643 -81976
23759 -81976 -11065 -78401 -59950 -76799 -170941 -259366 -230724 -137330 -103989 -154432 -213958 -180037
23747 -180037 -224228 -206039 -178323 -205071 -80000 -46535 -158663 -183990 -102562 -121480 -179504
23736 -179504 -176693 -186457 -176397 -159597 -202543 -183285 -42118 65030 112449 75740 9534
23725 9534 -95727 -11087 8896 26717 18976 98759 182140 204288 130404 85732 109205 98034
23713 98034 54688 41013 -92139 -236331 -272531 -163398 -84643 -114984 -137644 -36213 51761
23702 51761 92778 -22319 -92460 52354 132801 178122 85144 -28473 -71090 -65186 -69207
23691 -69207 83630 46324 -10881 47618 19575 1053 -11522 -102988 -67424 92950 145535
23680 145535 56436 110092 200996 220632 241162 233471 200526 134255 99574 17643 -32441 -32272
23668 -32272 5444 17063 -35496 -74952 -70461 54881 58050 80339 148646 94584 83613 16670
23656 16670 -72289 -52057 59542 126145 205211 219935 199739 76663 50495 34423 56038
23645 56038 23624 -34436 -69522 -67631 -103438 -58115 -83264 -68105 -192493 -96640 -72358 -72696
23633 -72696 -40078 41973 68661 68698 -18481 -125703 -86029 -100090 -94126 -33403 47877 129014
23621 129014 78054 139863 79878 -48583 -36506 -104479 -109245 -61968 -21030 15532 164542
23610 164542 235360 177889 153125 62400 19297 44735 78538 133086 74164 55295 136831
23599 136831 171222 78217 46818 153348 132134 52172 -61143 -42366 55392 96401 108324
23588 108324 62945 -19082 7208 21310 4556 -64173 -14403 73810 148815 128663 45672
23577 45672 40296 -50634 -32287 75190 234405 277936 205389 81763 41143 7860 27279
23566 27279 61490 65516 23342 91866 192395 146360 82116 117963 114997 69805 126684 55329
23554 55329 -18347 -46822 11478 211158 255521 169896 69876 56722 50113 -27993 -70576
23543 -70576 -16545 97154 164180 99193 118234 156272 74516 69005 125260 58603 62298 -88109
23531 -88109 -186449 -140579 -85121 -26698 -166399 -106792 32019 -78350 -104650 -61871 -65210
23520 -65210 -39191 64642 -72216 -155778 -118641 -318 -32958 -42902 -72134 -107746 -91435
23509 -91435 -42538 -15440 38950 -4727 -33804 -41617 -45224 -58164 -63091 8945 13697 65085
23497 65085 102777 32913 -9437 -33005 -46444 -39065 -65265 -65070 -64315 -91564 3972 46081 63842
23484 63842 117833 205785 130310 53817 82156 141431 196234 195949 139697 171468 5916 -157367
23472 -157367 -55904 3710 -55839 -118662 -139128 -29079 -5757 -26310 -49946 -37983 44547
23461 44547 2891 -40218 74156 28829 33841 45226 -15646 22426 -36494 -124071 -100327 -153058
23449 -153058 -97887 18056 -8882 -114248 -80910 -75346 22913 195392 60196 -180674 -217132
23438 -217132 -168030 -175241 -170937 -239015 -262908 -109697 -78039 -113396 -222154 -183562 -133852
23427 -133852 -115269 76927 64647 6052 88951 -38745 -38904 -150774 -75786 -82742 -183760
23416 -183760 -146020 -110054 -31969 -104790 -198377 -73054 5949 -91803 -152733 -150247 -173856
23405 -173856 -139841 -29860 12616 33755 131453 146634 77318 126956 115351 -20867 -49787
23394 -49787 -79279 -29637 107064 54032 -68432 -82081 -191797 -230285 -122496 -113842 -67359
23383 -67359 -37712 -82008 -158842 -155141 -164287 -198147 -75694 -48828 -130831 -130564 -75568 -101685
23371 -101685 -132119 -97207 -115927 -108004 -60823 -59799 19380 -95254 -117416 -164621 -169540 -247580
23359 -247580 -167649 -113362 -28797 70078 136748 70558 163261 105859 19498 -47365 -2091
23348 -2091 119431 143916 237457 185735 34424 28889 30976 -62933 -194469 -120813 33596
23337 33596 -35383 -98598 22653 121434 23081 -8003 -34247 -102109 -43724 70785 75714
23326 75714 75155 61229 12219 -6847 -34779 -90358 -110149 -71320 -148764 -280921 -180948 -96296
23314 -96296 -134458 -152053 -146340 -122772 -120683 -111327 -78885 261 12444 13932 -107015 -142811
23302 -142811 -26958 31837 47412 92189 77174 -19484 -125456 -150521 -62423 36470 186317
23291 186317 247447 124741 52965 133637 -12640 -129931 -220701 -258247 -92745 169521
23281 169521 63576 46959 72618 -48454 -81682 -81484 7398 57188 12739 7040 37967 81470
23269 81470 -5855 -9637 157545 174018 103158 -39627 -67858 -70255 -92218 -115727 -110912 -33083
23257 -33083 -46611 31673 33318 79739 248521 188781 92389 -75552 -202090 -200736 -126512
23246 -126512 -153726 -149459 -59479 -47382 -5614 17202 190997 288537 207652 61086 -28365
23235 -28365 -166411 -231126 -151010 -169825 -121426 -128608 -126150 -132719 -124803 -97085 -60905 -2768
23223 -2768 -50638 -84451 -17402 -105450 -160174 -151316 -72841 -220176 -298939 -161799 -23301
23212 -23301 8819 -15623 -27689 86286 142834 -1296 -169046 -96955 -109788 -65954 -64204
23201 -64204 -69532 -108941 -90345 -89034 -99565 -35274 -18058 32938 143424 103484 -70427 -183680
23189 -183680 -263295 -165608 -116687 -5244 -13544 15985 46980 75577 28983 -118607 -132286
23178 -132286 -25700 30863 -43164 -121584 -46907 123006 235017 186099 -13097 -50811 67803
23167 67803 110745 100883 95145 75655 93482 78695 38315 113003 137542 110153 117149 -49150
23155 -49150 -75765 -84805 -89431 -118238 -100478 -190285 -174299 -171635 -79216 37474 -15861 80703
23143 80703 115603 70333 -102377 -119959 -29190 105985 32123 -139739 -104776 12400 41063
23132 41063 4412 -68692 -24212 -101505 -123670 -171812 -120723 -174002 -131968 -61034 -34002 -30606
23120 -30606 -86957 6255 95561 30069 2353 -43846 -39523 -30284 -14248 -77861 7585 85306
23108 85306 4576 3874 69411 49892 137294 267903 205196 82299 2442 4184 75999 155857
23096 155857 178038 182737 149290 171388 187560 156969 -30054 -92506 -125862 -160353 -192591
23085 -192591 -171309 -167613 -238504 -200671 -44499 57676 -68471 -43338 -77491 -61214 -14529
23074 -14529 -16887 104154 135977 59437 -4226 -48101 -924 -12282 897 -54159 -87687 -43728
23062 -43728 3395 171474 120848 77397 98373 -13592 -35572 -120686 -106639 -35364 20623
23051 20623 -20486 -29314 32121 57625 -3924 -67003 -111000 -123181 -71877 -69062 -9770 94472
23039 94472 119729 -82007 -86395 -15281 58555 42933 51112 68458 -51466 13358 -47666 -32517
23027 -32517 61170 189819 125089 -20822 -18610 -60435 -25828 38421 -27133 -160487 -270101
23016 -270101 -192471 -64162 -66143 -20048 -104324 -61707 23747 -12719 38485 22343 -32319
23005 -32319 122803 150565 36887 -68305 -5805 22289 -21361 -33961 -701 3921 31843
22994 31843 21795 -6608 25082 -58123 -38746 -6399 -46471 -118035 -28510 -52454 -74109 -199556
22982 -199556 -215668 -221116 -147979 -8985 81889 100309 140691 86227 218026 138008 42445
22971 42445 82033 -6442 -135341 -131103 -162669 -113649 -129205 -54791 -2758 1885 -129404 -271522
22959 -271522 -377344 -327589 -245049 -120331 -66429 -117546 -132092 -39835 -900 -27878 -100365
22948 -100365 -38169 -122186 -125734 60963 70215 143028 62864 -10925 -82721 20429 124907
22937 124907 97059 57990 -12803 -127196 23486 52146 182927 150172 188298 263610 296564
22926 296564 179259 126301 99144 155604 174609 222662 229524 156719 18930 -27165 -111147
22915 -111147 -9519 58461 63942 109991 111483 100582 132921 -8128 -57030 -7054 117402
22904 117402 88356 50499 48057 89751 36043 -1770 -73522 -63832 -26321 -146620 -106317 -132842
22892 -132842 -159476 -106760 84178 95116 -82261 -113242 -70033 -6377 26670 -61721 47278
22881 47278 131312 160118 171239 103391 -15099 18406 -39083 -106092 26479 54574 -31873
22870 -31873 -68735 -76327 -76435 -54550 -19394 10802 71647 39585 43003 -1178 -67911 -31298
22858 -31298 41060 48797 33704 -54619 -45566 -101133 -124165 -32229 -43294 -74988 -54302 -7833
22846 -7833 47242 18907 14396 -25334 -45143 -73454 -49150 59497 99263 60792 33217 14596
22834 14596 12047 -8190 50785 93972 42532 107247 94270 122282 136522 109935 7371 -3087
22822 -3087 4915 14584 -45193 -128611 -181864 -36832 125864 130056 -11491 -95488 -16934 35239
22810 35239 4199 43513 52122 8851 -119591 -237365 -225164 -182530 -84198 -147725 -198012
22799 -198012 -203248 -71821 -48193 -126081 -120131 511 21445 110428 175223 127314 215109
22788 215109 174522 113902 125367 204767 173512 184945 102935 113016 117166 -68206 -71290 -6839
22776 -6839 -176135 -327320 -308587 -139225 17560 -11190 -37581 -55614 -111788 -127504 -165927
22765 -165927 -92776 -15722 -10108 21709 30424 67578 120359 111596 138576 153551 230589 144355
22753 144355 110216 125731 96415 -13164 -23539 12300 119981 178414 154199 68363 35619
22742 35619 16086 -15976 -1246 507 -97268 -113488 -26928 27673 -9629 -81838 -77099 -83104
22730 -83104 110908 123366 -4022 24630 42589 28414 -2143 42022 39345 2292 -32053
22719 -32053 -102228 -12341 159285 234214 139157 56578 21175 53317 126221 169717 72859
22708 72859 6072 116819 90813 44195 21173 94004 142250 38508 -40679 -123487 -291416
22697 -291416 -329652 -146157 -44523 -87059 -146425 -169927 -175301 -201801 -89093 -43522 -56199
22686 -56199 -97216 -166232 -149569 -67807 -84676 -285568 -281420 -214310 -107612 -61393 -130428
22675 -130428 -92082 -33787 -53925 -97170 -147709 -108708 -108069 -91761 -94856 -205406 -210454 -117086
22663 -117086 -110667 -99671 -92150 -145099 -176859 -159063 -156681 -273931 -138927 -44479 -75912 6068
22651 6068 -88756 -125908 -177788 -141313 -141216 -253235 -188526 71194 -3507 -55924 9532 -6272
22639 -6272 62404 9179 -38793 -107843 -136146 -150441 -223144 -228861 -75380 47987 16898 -1455
22627 -1455 -24925 18982 68218 55095 64394 6379 -85599 -12582 -6273 -140692 -107017 -15317
22615 -15317 -35928 -172978 -71391 27113 124079 135321 155871 106030 97360 161611 -50721
22604 -50721 -99295 74163 37784 47873 -61857 -77014 25116 30630 -81047 -107091 107653
22593 107653 94163 -124626 -159396 -117549 -151964 -154466 47629 138237 46959 2 40084
22582 40084 48254 84244 58491 18109 35669 72492 30538 14265 67119 153062 210866 87646
22570 87646 85279 116970 32681 -47085 -47366 52760 -5904 -18243 -82779 -56433 -36874 -136559
22558 -136559 -91869 -10422 -34518 -102520 -88930 -167530 -156473 31974 31039 -1218 -82440 -177785
22546 -177785 -82529 123300 88152 4359 -28558 7572 16225 -5045 -71766 63769 95315
22535 95315 62751 131907 181327 203105 81480 132759 272288 162865 50284 -11122 -20332
22524 -20332 -104481 -180460 -151137 -70958 -75166 -154614 -224871 -273121 -194948 -45256 -57260 -113952
22512 -113952 -142169 2690 90460 13523 -68079 -26946 -92079 -97240 -59166 -32593 -29043 -94151
22500 -94151 -97089 -57101 -150895 -100189 -1137 18392 -67368 -143926 -102245 -14904 45618 10280
22488 10280 -60796 -88020 -65669 28485 71082 57395 61419 126158 67184 24643 60542 27748
22476 27748 99485 55569 6364 -39071 -50093 37625 140319 137027 1616 -44965 -55657
22465 -55657 -37173 -38243 14350 -113782 -141392 -176340 -174595 -81625 -85693 -52065 -170010 -161220
22453 -161220 -124644 -41604 10947 141253 270930 327643 224840 129030 42455 -93042 -151751
22442 -151751 -97840 20188 45114 -46848 -91122 -100432 -91330 -114446 -105990 -198160 -193111 -157099
22430 -157099 -14809 104212 21420 171700 304927 216817 16566 -78201 -87167 -190170
22420 -190170 -192542 -108505 -119966 -110760 -61838 -1067 99765 130089 -26525 -105561 -141349
22409 -141349 -139418 -199419 -184084 -145944 -227143 -209501 -122825 -51761 -10924 -53877 -54613 21531
22397 21531 26331 -55089 4884 -17530 -50880 -12112 25701 23904 103553 39917 81163 225559
22385 225559 165472 117461 64843 -58647 -63151 -70434 -63855 25530 -34929 -43601 59374 58438
22373 58438 -18336 -151151 -251444 -268923 -210858 -83137 -49784 -29535 -2656 -99713 -191787
22362 -191787 -223439 -156442 -195648 -83398 15968 58158 69363 55403 -24561 -57793 7576
22351 7576 5165 -37261 -130061 -138552 -210521 -107138 -121015 -127304 -118007 -121304 -111853 49433 165024
22338 165024 238550 146933 21724 -49433 -76837 -95059 -57725 16606 -9076 -104779 -257896
22327 -257896 -150000 -83921 -86555 -116450 -70433 -146062 -105180 -117154 -191341 -141839 -228913
22316 -228913 -259891 -139496 -90610 -21182 52580 -26157 -188690 -163888 -133053 -130765 -58035
22305 -58035 -107229 -176955 -177699 -162885 -158421 -173136 -138680 -13338 10823 57376 37552 -28375
22293 -28375 -42703 -139142 -167128 -171502 -141285 -4777 14225 -45876 -34072 13017 -10571 -74539
22281 -74539 -85243 -123922 -121615 -34100 -134320 -143909 -24643 -898 -58164 -111258 -152409 -113267
22269 -113267 -278 -39918 -1213 50738 8622 144908 155209 155227 97377 187886 248918 232169
22257 232169 178586 -55544 -124553 -35179 29770 50952 120728 153336 139425 134184 11333
22246 11333 8540 -130738 -235350 -137402 -104815 -157985 -85780 1079 123689 57482 -10344
22235 -10344 113461 232409 306647 135417 34058 -56611 -64618 33078 97282 91413 177325
22224 177325 188066 245676 342583 214398 224175 193484 166291 198822 71651 -933 -38507
22213 -38507 37015 34150 -117102 -69861 -47455 -74530 -33014 43993 17248 35621 76788 46182
22201 46182 -54451 -110623 -144543 -138187 -124996 -155492 -258470 -138498 -22482 43861 110668
22190 110668 149918 174077 205032 270068 286023 180772 -678 -66400 13656 18699 -5995
22179 -5995 63796 70539 73679 -4095 -102689 -127466 -63911 85106 153030 160814 181975 104521
22167 104521 -104737 -166297 -14326 80247 54372 46814 97432 46792 -49972 -17875 37856
22156 37856 23375 -11266 -46309 64521 20028 -72415 -67389 -22451 26032 59661 128471 239366
22144 239366 286067 257671 131022 63208 -36987 -23712 -104610 -73525 -34005 -69421 -30827
22133 -30827 -89001 -115589 -70764 -35938 -168993 -194805 -78310 30409 112751 257406 79594
22122 79594 -50546 -139483 -129990 -175285 -96600 -21785 7900 13046 114001 159539 147764 126295
22110 126295 143238 152244 51549 -37891 -21494 -38982 -139034 -179435 -281959 -252684 -235309
22099 -235309 -126852 -35664 -66313 -82170 -16346 -73586 -200230 -215290 -154220 13827 2170
22088 2170 -96245 -109496 -20757 -46131 29560 27906 20206 80381 176053 114793 -15075 28412
22076 28412 -28014 -117080 -174931 -185836 -197283 -211112 -257475 -213926 -86838 -101276 -90025
22065 -90025 -62578 -69140 -194108 -104670 -49762 15350 27496 -18881 -114369 -86617 26000
22054 26000 153944 117584 -4423 12866 -14228 -109599 -17400 14059 -77293 -181667 -71372
22043 -71372 101539 134551 104019 97631 110261 75048 -22397 -146519 -175845 -199722 -176009
22032 -176009 -37741 12011 -75790 -179506 -104291 -54354 3090 14908 -23972 61557 144212
22021 144212 76154 38533 31832 77358 57032 -120636 -184595 -147665 -39641 31372 52516
22010 52516 90961 73570 105209 144615 138998 51526 13348 72840 126018 13369 -11746 1548
21998 1548 27095 -35456 -37899 17055 7637 -89781 -60375 -83811 -49822 -142645 -213537 -31887
21986 -31887 145244 167428 261515 191960 185845 228408 54558 -23351 20383 66901 67196 -37002
21974 -37002 -120921 -52421 -22171 -74255 -44508 -135635 -111096 -28732 -139587 -169699 -61727
21963 -61727 -114753 -90892 9703 24879 -79330 -229054 -247630 -122473 -17409 -40286 -87171
21952 -87171 -9036 77737 81664 2237 125814 167253 31107 -54196 -13730 -5414 -50645 2435
21940 2435 4850 115358 104495 -55297 -189936 -234893 -114828 -145985 -136457 -70629 -94136
21929 -94136 -180564 -131688 -22117 -24076 -108245 -196577 -182800 -202523 -130048 -117825 -178802 -182375
21917 -182375 -105409 -74737 58739 52447 66642 98610 108330 95008 54175 -34904 -44822 -39620
21905 -39620 -91240 -71926 -53526 -120845 -91831 -52944 50705 138542 135938 109095 26324 37215
21893 37215 -36279 -34995 9859 71922 -24947 -115027 -162146 -86128 -6967 -63185 -12230 -60939
21881 -60939 -89179 -83070 -104199 -75704 -39558 -56380 -37332 80371 137675 129660 163986 128849
21869 128849 -39199 -208649 -256077 -384064 -323375 -220858 -199428 -100965 -52233 -59363 -68722
21858 -68722 -136394 -126002 -170414 -122730 -78118 -116543 -177769 -133377 -196905 -106825 8625
21847 8625 -37366 -5301 35228 125577 78436 90774 61215 47363 65882 5196 -116690 -101613
21835 -101613 -153353 -136550 -24974 -37589 -9332 -42194 -151147 -181571 -65774 3940 4400
21824 4400 -615 -14396 -90241 -132248 -174132 -196551 -104315 -38889 -55015 -89559 -86462 9011
21812 9011 26368 4265 24943 35918 34449 38278 -67696 -44912 -35500 -46025 -52194 -23952
21800 -23952 -55803 -136688 -37680 -19639 -44966 -110520 -45867 29444 73262 10141 755 -8018
21788 -8018 -17035 84663 24904 -2493 -88378 -166230 -210910 -185922 -228395 -105408 -54860 -37919
21776 -37919 -28922 -149613 -204943 -170449 -135806 -146292 -112003 -129678 -109987 -85542 -66281 -73300
21764 -73300 -372 -34819 -142530 -220382 -239599 -202032 -175763 -65142 -73950 -165299 -108368
21753 -108368 -124619 -189798 -217018 -162663 -77519 -73453 -190727 -191201 -79369 -72395 -1728 -50186
21741 -50186 -199929 -209443 -126287 -99542 -121639 -202502 -98090 47185 157757 173116 222565
21730 222565 249888 246340 250505 245646 191265 94399 145308 196316 225993 253067 170517 75783
21718 75783 -8562 -46133 -107485 76320 207910 228862 104476 208979 196588 152477 199087
21707 199087 202897 17173 -62249 -128552 -78305 -88364 -72383 -123948 -87284 -55446 -71114
21696 -71114 -22696 -8107 -49876 -90150 -94000 -191294 -117256 -57243 111840 197200 88013
21685 88013 -1831 -45988 -63548 -35208 39798 23034 11377 72061 -80318 -85919 65245
21674 65245 65585 54705 17247 -33965 -116697 -179616 -256798 -164020 -33880 -33019 -26635 -179089
21662 -179089 -214371 -194189 -93279 57665 62328 -5193 -89178 -176452 -200954 -145751 -143563
21651 -143563 -156670 -147054 -97207 13140 83816 59477 -13022 38072 61259 6608 11319 49217
21639 49217 -6991 -191489 -219906 -200501 -190711 -125932 -210422 -261756 -246392 -94657 -113131
21628 -113131 -71755 98309 215431 187521 57119 -113716 -109969 -112317 -136719 -34196 2897
21617 2897 -36929 -115818 -85834 -108345 -104607 -68277 -74643 -68327 -20446 24286 18263 -77260 -126985
21604 -126985 -68477 -24405 -60993 -88938 -14994 216755 194215 63458 7294 72280 101657
21593 101657 88054 37770 69448 168211 162018 115594 162274 129084 2670 -8867 144578
21582 144578 188057 219003 124855 101116 -18886 -176995 -131749 -42904 -23255 -26236 -65486
21571 -65486 -9791 31521 25489 -82718 -133007 -209126 -201061 -86117 -40335 4012 -127331
21560 -127331 -184318 48197 87638 97515 63492 133846 168569 36356 -49956 12575 38833
21549 38833 -99457 5326 127953 133833 91976 61426 147237 329973 225618 202634 181171
21538 181171 92480 -16260 -130327 -127697 -12383 -63011 -27457 45688 13441 -32484 -33550
21527 -33550 -40764 -124172 -53951 -40253 12094 -24917 -97742 -47926 -85744 -188769 -85821
21516 -85821 -105765 -73888 32432 73871 -61659 -135945 -110093 75035 157987 89908 58258
21505 58258 59473 140115 100291 33047 -1555 -7109 8151 -17797 -116926 -103868 -19298 58695
21493 58695 99983 129439 30366 -146394 -232024 -244117 -204140 -203707 -87622 30308 -20824
21482 -20824 -59666 68329 190335 208888 36238 23893 21285 -58926 -47558 95617 60140
21471 60140 38657 105404 120135 92463 119910 104482 18587 -19080 -32481 -113787 -74777 -178527
21459 -178527 -180855 -146429 -155779 -14238 -14282 -9181 58285 -12562 -100836 -235456 -286487 -231777
21447 -231777 -166837 -31235 66679 85115 82299 23022 -107840 -154284 -1654 178223 200383
21436 200383 46262 -87582 -160618 -62578 83908 54726 20599 16967 32998 13394 -166178
21425 -166178 -80220 122199 109554 47764 101762 6599 -79464 -111424 -54342 32175 12196
21414 12196 -55229 -167164 -239821 -84416 79916 -24831 -130549 -111256 -79985 -62582 -117567
21403 -117567 -125778 -31850 -49761 -131825 -134027 -158418 -125933 -4532 92183 49694 -122513
21392 -122513 -160547 -155568 -160320 -148986 -13718 148373 243042 326269 247607 139256 102394
21381 102394 -3921 -63028 -41269 -56005 -15213 -163880 -178102 -97393 -133377 -110019 -130201
21370 -130201 -355478 -259350 -134452 -28473 26472 209778 195944 10412 -91934 -111431
21360 -111431 -24091 -83879 -146499 -114388 12931 -4227 -154089 -190948 -258914 -246453 -347455
21349 -347455 -272921 -148315 -83938 -10027 95567 214104 93688 28094 2590 139911
21339 139911 293689 175556 214538 235191 99367 10143 -20019 -41843 38314 82588 170530
21328 170530 104728 -18662 -124198 -129075 -112063 -82695 96631 177797 270359 145408 56450
21317 56450 208266 228112 193462 102739 45690 48967 123473 121713 54054 55075 -11292 -56819
21305 -56819 -204541 -207217 -114143 20034 12512 -2164 33118 29892 -23855 -39514 51324 145056
21293 145056 148186 87951 45419 -141897 -150923 -40967 -7662 8653 36331 123497 165253
21282 165253 81280 84928 56874 158739 171591 83913 -17329 -2636 -45515 106682 203001
21271 203001 227928 240251 81353 90615 157438 251774 321818 353087 396090 395389 481783 416009
21259 416009 319300 196689 183019 169428 34428 -43170 102838 230693 258998 234947 228312
21248 228312 276194 361673 561100 529802 390486 273527 336986 242612 212461 293403 298127
21237 298127 296003 383562 370519 393318 575507 665540 539245 408503 358720 297365 191352
21226 191352 76471 147834 239052 249920 156605 225754 204591 267414 393319 509018 592361
21215 592361 614566 594078 510930 344661 290228 319412 246975 92853 46050 118144 142524
21204 142524 204017 269266 361771 206651 143797 139545 92718 224354 243650 182316 154360
21193 154360 75058 195495 248656 304114 237731 82658 -16737 -19403 -52921 -129702 -20984
21182 -20984 -7503 5839 74955 60698 96528 174325 125415 -25805 -218788 -157200 -141361
21171 -141361 -177576 -137624 -124337 -198768 -210926 -73637 12505 -6102 -50277 -136241 -166451
21160 -166451 -121467 -38376 15143 50458 48292 -5968 8427 75131 150359 282756 322258
21149 322258 190867 44705 120198 224133 247015 105288 24953 122080 177687 174570 172067
21138 172067 198873 170304 -17270 -93748 72758 24738 -139284 8395 88777 20339 88744
21127 88744 120706 63424 93430 135004 109463 136565 138024 124855 56112 116497 206287 160599
21115 160599 111786 50118 -70332 -145639 -111542 -88848 -80401 -18990 8932 60518 -78380
21104 -78380 -150290 -43677 42690 -82370 -66564 14529 14188 -42211 -113988 -157615 -92743 13363
21092 13363 27739 -65977 -82320 -89322 -85689 -109086 -206812 -235324 -158290 -206230 -171171 -135477
21080 -135477 -183909 -192488 -39839 48684 60488 37394 -26689 -26380 -24562 44568 -79040 -76851
21068 -76851 14841 36117 51901 128457 -27642 -45138 -10160 -62880 -93585 -95617 -55290 -73271
21056 -73271 34701 984 31220 140622 205987 158040 13116 -101373 -137116 -104719 -138033
21045 -138033 -201958 -175694 -43225 -60194 -128772 -134124 12422 110855 126850 44357 -120996
21034 -120996 -95269 -152782 -224922 -215165 -164922 -85891 -67054 -122117 -109070 -47146 62583
21023 62583 63737 34688 -63282 188 158662 191469 177300 -22866 -80064 21248 17804
21012 17804 36276 83268 90410 138729 209786 193974 231923 130508 22886 25386 154926
21001 154926 207573 143168 165207 129762 29323 80853 -26024 64378 199630 148262 107362
20990 107362 15131 -22425 58996 68328 -3876 -60134 -137791 -166904 -118330 -113827 -142862 -102139
20978 -102139 7623 99933 105501 2582 8471 -21671 -137424 -96017 35454 70890 32252
20967 32252 13707 146729 243123 168877 76163 34719 3228 -123859 3441 116928 110965
20956 110965 139208 142249 40199 22595 72226 98782 7699 225 39228 55778 166347
20945 166347 96768 -33543 -19647 45322 32232 93044 30342 -26667 37181 134212 191128
20934 191128 129890 16442 16012 63510 -37982 -118516 -43214 66635 148371 281523 163252
20923 163252 122067 45895 -79137 -16981 31268 9837 50003 1279 41160 44365 24790
20912 24790 20299 111623 66582 -25069 -103065 -18639 182775 220697 300099 366784 158489
20901 158489 96924 51205 107485 84530 9917 18456 11701 -213840 -154538 -19923 88769
20890 88769 146293 127526 37447 16621 88139 157345 106950 84495 50128 -10997 89805
20879 89805 211854 119919 36693 49409 85066 80691 134522 147237 127494 111849 124610 -7640
20867 -7640 -154316 -127514 51579 65840 -13054 36935 173963 239017 113745 -430 -148928
20856 -148928 -183794 -95571 2451 4294 21541 57227 46779 108107 134558 52644 -21887 128657
20844 128657 299562 361525 299781 91929 -36310 77615 133731 116422 115141 28080 17685
20833 17685 -50433 117889 316002 218432 189730 265813 294869 309025 235204 67097 59727
20822 59727 153646 285669 255699 160896 71334 155031 187423 132190 140520 148523 99962 207374
20810 207374 244927 357574 308760 228615 274948 323169 365627 244784 88589 185848 210438
20799 210438 202804 248668 307675 416427 450810 354048 309265 228831 228220 326952 343599 424628
20787 424628 333277 239534 325001 375958 519948 651282 660182 576156 592416 710804 804078
20776 804078 821664 684291 600263 580766 516073 490616 390093 342095 320591 328266 332934
20765 332934 254317 204778 144460 112134 78785 115965 261777 272942 211455 261121 243265
20754 243265 148230 178006 429227 501776 408505 451026 374271 305301 454496 530941 476379
20743 476379 452959 629444 705454 688916 611901 741361 968042 1007339 1048620 1020819 1039939
20732 1039939 971898 888213 787101 849938 873805 914119 1038904 1067687 1038102 953090 964245
20721 964245 975213 1062636 1253378 1430087 1710406 2151395 2271827 2232117 2173689 2142304
20711 2142304 2179769 2363546 2590876 2836715 3062880 3334491 3429258 3382661 3425809 3471296
20701 3471296 3633472 3781207 4025997 4450689 5008022 5715291 6722162 7829512 9232213
20692 9232213 11114586 13411353 16644018 21486503 28939217 40845808 60772374 94087364
20684 94087364 144420384 197365942 208188443 172469949 120963873 80555427 56029459
20677 56029459 41358917 32328489 26390629 22086492 18740870 16121368 14293719 13201079
20669 13201079 12356962 11604901 11244871 11058941 11074513 11478637 12334080 13534200 15371279
20660 15371279 17974806 21865444 27466445 35746404 48874212 71269391 108976269 163856626
20652 163856626 211266329 207886007 163831465 111359479 73640909 51119724 37548091
20645 37548091 28915256 23173411 19107816 15971120 13601137 11748444 10156925 8964976
20637 8964976 7935566 7049991 6355620 5740496 5253984 4814185 4526708 4447193 4412049 4479138
20627 4479138 4667926 4670917 4329522 3907764 3561812 3220779 3067791 3073584 3094403 2916921
20617 2916921 2585826 2321347 2009373 1787313 1627149 1577434 1427920 1220163 1181250 1214754
20607 1214754 1159607 1026917 921299 831106 724031 791849 817758 681991 656794 682107
20597 682107 677653 625313 655074 670304 626228 526170 401161 281239 461656 514989 414494
20586 414494 388225 434186 445906 501919 489720 404629 359313 233187 312245 327635 317939
20575 317939 355282 483743 472979 448743 485894 396632 261712 246728 255916 269761 326050
20564 326050 323634 482782 515998 573806 565900 279472 174197 258727 163658 116270 267133
20553 267133 322155 231524 269045 326018 351344 267876 157464 208459 270349 372413 272944
20542 272944 129268 108672 85174 -22634 -66772 17447 -21025 -78012 -134884 -154317 -172139
20531 -172139 -20677 133564 183429 116343 74198 48997 115905 223652 182956 131636 73247
20520 73247 97003 30256 -26359 3659 71718 124706 209576 200468 118343 142478 252357 272417
20508 272417 122149 -3468 -71376 -58504 -81248 19183 24514 93906 127007 74095 88368
20497 88368 105922 158358 95788 46350 35925 35708 65603 176569 273760 143614 60678 126614
20485 126614 172530 68963 82265 52502 126552 177371 146473 103968 73054 88812 38941
20474 38941 -106086 -201594 -93843 122195 122184 204674 281797 193282 217868 305311 166652
20463 166652 129471 108738 141566 -14972 -34708 -8015 69630 143700 2338 -125884 -68575
20452 -68575 18437 148686 127400 92323 95367 43212 4681 82398 231732 253317 186019
20441 186019 242300 285241 250039 172750 235407 267751 262002 331129 382225 379528 439960 421770
20429 421770 261771 6526 -137907 105800 239840 191075 120828 -46886 57371 207457
20419 207457 318638 214313 139431 188008 173470 256112 199136 165808 136806 166505 186332
20408 186332 126772 72112 142281 196295 151617 154112 167234 112112 158616 119628 117109 219392
20396 219392 241944 261220 247185 133425 125524 156611 10720 26327 5122 33372 47037
20385 47037 19203 -21493 137042 287159 378499 274247 271071 228331 198253 210852 272298
20374 272298 121904 138905 111568 66400 84126 60086 97101 186661 133337 131221 170336
20363 170336 162132 198811 211623 233511 282366 287821 406112 544188 493879 469375 337909
20352 337909 286692 212870 110590 143400 244063 360957 323510 315590 321423 315610 150350
20341 150350 154654 228070 261112 224955 408925 476821 503803 311899 292729 225536 233619
20330 233619 270690 294067 333437 308752 278155 262527 384799 326839 233340 269005 343261
20319 343261 330771 400188 443869 442018 415169 382670 503621 509380 576105 617546 484908
20308 484908 417073 573196 659439 671873 673396 772887 867811 883144 984636 962345 910588
20297 910588 1023158 1141170 1317671 1743609 2003351 2152255 2129973 2069923 2137639 2309263
20287 2309263 2516600 2765683 3164240 3888983 4869008 6267199 8602126 12289644 16842840
20278 16842840 19136226 17655041 14709805 12777597 12649415 14016950 17303600 23384952
20270 23384952 34655928 55159481 89112690 123109540 126512326 111590255 96583723
20263 96583723 86439073 72350825 54285703 39295043 30570907 27364879 28392975
20256 28392975 33857802 42537329 46802102 41215732 31011668 21937669 16076059 12383053
20248 12383053 9918355 8184908 7044629 6362365 5958913 5789760 5929407 5896509 5709576
20239 5709576 5639019 5792003 6116502 6411942 6330153 6108084 6107912 6323895 6811670 7761651
20229 7761651 9018341 11279768 14952788 21055930 30898655 43173872 49181353 44861724
20221 44861724 36078626 29230255 26847526 28400488 34594522 47847803 69446007 92321328
20213 92321328 111168383 130303796 156403045 159578291 128386801 86879470 55823530
20206 55823530 38907296 29367932 23885782 20963677 20236066 22006615 25998264 28113901
20198 28113901 24893966 19143565 14051497 10847854 8832785 7367328 6347664 5634174
20190 5634174 4996201 4510807 4324974 4194775 4098388 4033804 3743895 3100001 2509419 2156749
20180 2156749 1952768 1701568 1596149 1564622 1363627 1227735 1215391 1286039 1192645 1014015
20170 1014015 928406 919962 965589 914778 746719 692235 601359 570789 538890 647111 601132
20159 601132 527458 512642 608818 627618 601749 623059 552082 589635 586840 374106 280877
20148 280877 252846 276397 438637 495625 466785 436108 368247 354110 367122 393491 433941
20137 433941 492808 537118 449533 426095 397762 257971 303995 199869 196143 329441 391316
20126 391316 445921 448971 336666 256983 191039 186100 201825 269339 208316 158113 166185 229525
20114 229525 308929 405362 511424 628806 653576 514608 495641 581904 519350 381088 190796
20103 190796 94915 1974 46175 105225 215284 285926 330660 420449 492728 515701 524963
20092 524963 518858 467345 483707 253285 181564 179719 228755 144011 215850 222902 417953 617672
20080 617672 644822 512372 471784 442291 349176 262477 169965 110969 97450 130532 247347
20069 247347 413280 440591 421446 419622 479339 563671 514825 360170 237939 260190 187390
20058 187390 168776 96845 80604 151711 96975 52661 82707 66270 11390 57191 -21825
20047 -21825 -16542 -74039 -1863 98942 232102 210155 196383 201727 87544 75928 157802
20036 157802 217056 73018 -78454 -168026 -200130 -70881 64983 134587 66784 -45272
20026 -45272 -107637 -40552 35998 74445 131149 112756 -43631 9295 62008 328 -30131
20015 -30131 33523 22822 51654 -130298 -287866 -288722 -210698 -113016 -39137 -28326 76973
20004 76973 101330 30801 -71104 51115 130247 142773 199307 206390 198115 49212 -53364
19993 -53364 -154151 -178550 -134940 -21773 54210 91513 200847 245696 150796 97490 116163
19982 116163 48517 -41292 11115 115609 67362 168783 198126 182538 186699 182860 182505 144417
19970 144417 93127 89760 97290 79275 88875 180248 112506 11361 -58131 -38579 -86432 -29847
19958 -29847 63429 137167 195579 102943 9293 48899 109260 141699 24491 -41573 -80701
19947 -80701 -21524 40256 91886 86940 116271 241916 291819 117147 89704 182538 24340
19936 24340 -97880 -25425 56582 78010 14872 -47993 -11422 53656 23852 110791 204301
19925 204301 300425 309981 271543 118020 90242 123059 172250 207179 229596 65660 -18830
19914 -18830 53114 39552 54613 80385 25986 -45050 -62251 19275 112169 -18622 -69824
19903 -69824 73157 114526 170616 101049 54206 24346 -49424 -112397 -64944 -9007 85300
19892 85300 128086 208031 267573 309997 169245 -8607 -10966 80258 85260 110793 172757 153423
19880 153423 118958 -39456 -65887 -117270 -165666 -111926 -136122 -111539 -19710 17302 -52518
19869 -52518 -74140 -17114 -42668 14853 87274 39276 49102 50674 72005 41774 -37781 17850
19857 17850 -21320 -186188 -262993 -106281 76790 184366 220888 130562 38062 -30385 50704
19846 50704 142924 151887 -45386 -172169 -148092 -113726 -81802 -16101 107242 84703 119443
19835 119443 135379 26714 -61470 2722 42610 1907 -9983 38533 60409 94635 94042 21318
19823 21318 42257 -50924 -62498 -14809 -84046 -56529 2477 63411 180508 321692 320405
19812 320405 335667 284264 309106 317326 235706 215702 171575 132461 142161 116127 172680 160133
19800 160133 105548 99634 125203 111113 102743 158880 181165 268414 272549 245161 156496 150204
19788 150204 154152 106307 166103 172852 76155 71940 4923 -70178 -86268 -20582 111671 155117
19776 155117 204924 237538 218664 171766 174012 208933 191291 164260 218085 327598 215110
19765 215110 53371 46115 44764 215010 366146 318391 201351 238977 265306 262443 346103
19754 346103 348967 293497 230550 336222 396551 395502 447677 486682 460237 497579 562916 610887
19742 610887 602126 528201 474829 486355 408391 334107 306704 328168 324451 427765 386870 398048
19730 398048 500694 465362 585103 707191 768580 806020 842791 894740 867530 724468 774292
19719 774292 930002 1110024 1361667 1580398 1705793 2052168 2489294 2774721 2978242 3072466
19709 3072466 3151250 3471851 3925557 4507168 5450653 6558831 8217087 11355764 16688305
19700 16688305 23136041 25428788 22833687 18745612 16476632 16676015 19160407 24236520
19692 24236520 33895233 52014025 84299643 131515885 160438832 153342315 133845740
19685 133845740 114050240 94096755 70642626 50729495 37866119 31512733 29909111
19678 29909111 32489118 39446485 48995686 52160927 44752155 33091873 23226911 17079020
19670 17079020 13437917 11202882 9696711 8725747 8246857 7923013 7640922 7141376 6592129
19661 6592129 6367725 6232608 5937007 5704280 5700548 5762963 5728825 5816221 6001728 6464322
19651 6464322 7174186 8229523 10259723 13886469 19812184 29057016 40232777 44463110
19643 44463110 39613732 31522256 25930700 24740929 27924787 36440217 51833017 70246718
19635 70246718 84892826 95477504 113350726 132957116 121999596 90555463 57602193
19628 57602193 37343563 26419867 20165801 16672016 15051621 14975280 16759281 20204568
19620 20204568 21466178 18501974 13845951 10173254 8010323 6545300 5543536 4852265
19612 4852265 4378386 4061251 3631968 3373520 3325122 3015326 2721231 2326341 1970840 1788515
19602 1788515 1623650 1466520 1307870 1144982 1114888 1068788 982035 994892 937700 901020
19592 901020 823172 783456 846300 810671 738371 698675 611743 626968 582243 469087 415005
19581 415005 495875 457611 517261 539326 452802 364189 351266 323825 400497 449750 417907
19570 417907 445797 376352 152590 106557 120228 142590 94836 140146 214254 194808 120583
19559 120583 18639 202000 233178 233723 217862 291702 283588 263924 226171 153259 198544 293451
19547 293451 280612 305861 379432 395261 322940 331913 312537 256671 185988 150968 33686
19536 33686 113745 228211 163155 180687 185766 60322 117643 220777 286796 278774 181375
19525 181375 129232 118317 71358 191068 296744 230858 89911 708 -49142 -115012 -60122
19514 -60122 38725 48293 -22348 -145461 18378 167004 148356 71957 -43117 59477 49307
19503 49307 38063 44474 19529 27424 35490 43533 23928 -6856 35800 3821 66315 6091
19491 6091 -113932 -217749 -315276 -176217 -77712 -12126 5657 149384 235542 89496 -27581
19480 -27581 -95695 -122238 -11704 35609 139042 221257 279663 232856 145122 158004 106880
19469 106880 53637 -16571 45104 91098 -35010 -62038 -39094 -41117 -49587 -24863 -113142 -134216
19457 -134216 -183839 -137887 -166550 -69009 -16393 128002 154115 -2887 -74352 -50210 -74172
19446 -74172 51337 54495 5412 -195 44925 77622 94886 200795 210200 275509 210626 119202
19434 119202 98340 107379 70325 4082 54079 42319 53990 204552 267593 215987 134328
19423 134328 98213 130356 -17230 -43420 -40457 26874 160030 142402 65815 -90908 -81676
19412 -81676 19636 38800 -14691 -33821 -50779 -36715 -34837 -46162 2958 -34931 -132619 -166705
19400 -166705 -110276 44984 68780 7424 -54939 65022 144799 123735 -2626 -131218 -107555
19389 -107555 28925 48378 100462 121775 218475 227748 205305 140647 55009 -49476 -73730
19378 -73730 -76488 -91807 -68606 -9111 -12752 28720 -12348 89543 -27480 -2044 95711 57598
19366 57598 -5967 -47578 -107721 -183467 -169764 -58649 -96233 -99098 -52734 -139313 -177718 -203050
19354 -203050 -17311 150266 169978 209464 161458 172791 63622 -59148 -89704 -46998 3727
19343 3727 -24508 -63177 -51828 -129977 -145474 -142516 -157102 -107085 104383 169404 9118 -147372
19331 -147372 -111591 3714 3342 108717 138996 113054 120945 177664 154202 67236 -53434
19320 -53434 -61461 14062 8893 5414 4725 80350 51906 -124639 -212073 -215727 -262845 -170389 -57794
19307 -57794 6494 1256 -31035 -115584 -7022 120432 137709 -1187 34042 89831 46044
19296 46044 139400 26086 -74287 -38519 1993 -53307 -118025 -162847 -93177 -21401 151324
19285 151324 138369 138431 32747 5970 -32973 -76951 -89698 -17510 -90918 -106826 -51873 20413
19273 20413 112710 26124 -76314 -76798 -86838 -47869 -41670 -683 -20962 34696 -141921 -259759
19261 -259759 -214255 -160764 -89378 -112115 -78296 -71622 -47033 -79813 -247178 -242407 -181745 -117195
19249 -117195 -41871 45597 86260 5247 -36475 -9755 6272 5160 25135 12229 115523
19238 115523 175435 122075 118594 190538 136335 33015 58789 141674 207614 213840 174728 140172
19226 140172 133076 74483 109139 142948 103876 61522 7840 -91671 -76284 45504 50937 -31839
19214 -31839 12763 98133 164008 122565 -4069 37657 22704 -4380 -64781 84207 181007
19203 181007 40859 24588 -80222 -106490 -10253 3562 -5383 21781 48655 50756 12629
19192 12629 41153 77028 141136 91049 118769 161139 187888 128244 27101 64939 194310
19181 194310 123642 85385 188574 138500 17310 -48519 -101708 -62175 -44139 -54548 62945
19170 62945 161599 322963 430214 422937 466517 552182 452813 301006 214061 178341 188717
19159 188717 187174 281354 450309 494613 448937 339797 197587 14345 -118356 -120692 -76710
19148 -76710 -122895 -66782 -29202 -33801 49255 93211 -24002 99601 103203 74571 62261 15837
19136 15837 -55658 -170374 -180504 -177090 -177948 -222785 -150267 -246540 -377054 -339933 -202485 -106031
19124 -106031 -16602 -48326 39125 91651 160117 257179 330278 513474 600550 674826 551174
19113 551174 420741 392070 377730 281338 191347 163845 122679 226882 254528 167747 253494
19102 253494 298869 399474 483902 544888 406003 247426 144418 193806 161887 71511 -27919
19091 -27919 -10172 -117813 -195780 -41702 2875 52795 166489 92448 15384 -16027 -152817
19080 -152817 -80495 4028 -59555 -129882 -161563 38425 198700 165047 259247 241752 256692
19069 256692 259000 285611 249894 193240 253537 308311 286966 226620 164557 122441 176592 168758
19057 168758 22850 35027 66677 146614 249141 278158 290950 252572 70582 -6124 -52307
19046 -52307 -52571 -59785 -16786 105468 235724 272674 288664 337005 268534 94152 11147 48956
19034 48956 54359 13211 -128893 -196466 -128460 -34340 51325 147285 121627 191926 278634 67240
19022 67240 -89219 -52844 -130616 -146408 -94714 -57592 -131797 -163929 -62376 -23627 9848
19011 9848 44569 114234 12632 -87365 -59587 75730 16174 -124478 -153222 -116659 -151112
19000 -151112 -181091 -220091 -138153 -69698 -102283 -163598 -137899 -119848 25377 -11231 20763
18989 20763 38443 -33543 -98873 -107536 -88687 -18166 9863 4954 -35626 -31198 -98882 -39533
18977 -39533 -45365 -31050 21297 -46567 -35529 -75116 -7590 153539 243127 250305 -9011 -2930
18965 -2930 -227 27385 -11208 -57217 -890 1148 82186 61186 -34322 -136687 -159897 -165115
18953 -165115 -100216 -30570 -94700 -114536 -147927 -173431 -41084 109198 -4073 -75424 -51430
18942 -51430 87854 69960 102093 -5360 -159162 -133633 -52674 -14306 34681 118389 105100
18931 105100 3635 -44990 -42527 61371 97780 89572 -45449 -26918 103499 46942 -64278
18920 -64278 942 128184 111777 112286 82863 65569 147178 117351 11701 34673 147652
18909 147652 218758 179508 70062 -2098 7535 11712 -451 17907 -34334 43875 15206 -27286
18897 -27286 -74948 -81983 -127574 -198267 -177437 -124299 -22338 -46924 -88027 -59034 -96721 -231555
18885 -231555 -263074 -200539 -88260 -49773 47670 -20323 -44222 43807 -70025 -149945 7048
18874 7048 66335 114182 35583 -30580 -48948 33087 -28598 -23705 -55868 -43615 -149311 -113216
18862 -113216 -2781 56885 73529 107524 43088 15132 92689 32720 63865 12834 27827
18851 27827 77176 33441 10407 157106 205045 94016 73255 147309 103689 147640 172146
18840 172146 86428 113955 58093 53667 44931 73002 98143 103778 6099 -29392 1241 76415
18828 76415 185492 203139 244266 280937 143021 66903 38260 75409 14992 41442 14036
18817 14036 54536 87707 117885 141780 108647 -36026 -104844 -10451 -1962 -6759 37915 -7422
18805 -7422 -160911 -208282 -94433 38359 21549 -57086 -77310 6490 37055 23469 161781
18794 161781 234560 215564 128775 82615 84679 -3070 -34852 -43714 19776 -40504 39709 68431
18782 68431 50745 -47388 -15354 105157 31725 -10061 8455 -78270 -27752 134316 214314
18771 214314 157213 245105 525543 1000266 1531381 1800538 1456582 917820 681742 440004
18761 440004 395143 285945 81292 161669 172809 117040 62233 7184 90503 172102 134802
18750 134802 67075 48121 -37252 -6699 62122 -28577 -33213 -61434 -101344 9906 118616
18739 118616 140324 123906 -28641 19857 53187 -22737 94809 108231 224779 338871 293179
18728 293179 265578 177489 68126 123138 203457 137042 -45653 -150405 -131370 -66721 13955
18717 13955 52329 -33747 -84694 22429 68869 86733 -74779 -130436 -112614 -121029 -47119
18706 -47119 -100004 -111745 -70103 26407 133455 39589 252525 400692 399139 487814 447941
18695 447941 171291 110285 98000 56113 5184 89115 52673 57530 125837 111273 27469
18684 27469 -62965 -54750 90610 117177 158307 113285 33026 -26166 -34752 13882 37265 163844
18672 163844 56091 35110 19877 142377 216033 306510 255168 173113 127454 6518 -351
18661 -351 166562 320186 361146 302797 64483 -117906 -80186 -73925 -10691 99294 154055
18650 154055 141969 158377 112743 198303 36735 -59030 28127 50425 119235 55692 174537
18639 174537 214541 83281 89781 198359 73382 -6480 -50558 28106 146531 195259 97139
18628 97139 19561 38303 137078 47472 113169 141577 119540 98716 174291 237893 137452
18617 137452 -111074 -211130 -221159 -100942 7602 -55465 -29928 -137719 -132971 -107348 -50079
18606 -50079 -60751 -116499 -31297 17943 95023 129705 48188 -121556 -120502 -114020 -99380 -42071
18594 -42071 -8585 41495 15237 -43684 -46595 1347 124552 119337 3416 -84558 18101
18583 18101 115875 65931 33291 26705 29521 88033 101291 50029 17089 155183 271005 267577
18571 267577 166957 142581 166942 156242 112072 127052 125264 48583 -98567 -79842 -26138
18560 -26138 -29093 -47894 14316 77156 12257 -38477 -19928 64188 77707 14868 -46859 13213
18548 13213 53310 101588 141415 105333 157350 -19490 -204977 -235026 -107885 -81679 -164520
18537 -164520 -28368 137024 121527 -33989 -11314 61682 108645 149773 -41518 -83487 -38289
18526 -38289 -11318 -101722 -187728 -133770 -23363 25931 11262 34573 61306 -11769 -57325
18515 -57325 -69608 -87127 -28011 -64483 -101641 -152651 -140447 -95004 -143560 -100057 38648
18504 38648 77046 78192 47477 3471 -41686 -13271 50231 99731 38545 58714 -25039 -102495
18492 -102495 -102796 -30467 -111822 -93894 86520 206807 257132 103236 -100207 -105936 -25429
18481 -25429 53753 122689 231434 184046 105871 112039 76454 -32282 -31073 72214 -19236
18470 -19236 -58575 -36057 30062 4801 36200 68167 -41685 -91058 -197369 -223069 -172131
18459 -172131 -113513 48866 126655 131143 141972 154501 217669 270254 181589 59174 33356
18448 33356 18159 -101340 -185832 -211528 -160371 -164437 -111759 -112327 -217085 -203296 -55252 -60060
18436 -60060 -62104 -32492 -2205 -127388 -152879 -76252 -25978 -53811 55687 194328 138373
18425 138373 92108 199038 180227 98902 102928 11340 -87973 -75431 -91283 28712 -45347
18414 -45347 -84951 -93141 -155681 -142588 -38406 52334 -16815 78435 91133 46557 -7037 83700
18402 83700 44602 -95604 -77554 79610 4885 -24464 -69038 -172187 -144131 -71904 88663
18391 88663 45464 -45667 -36010 -22012 -97533 -23820 85818 91202 64353 33794 66941 38982
18379 38982 -19859 -4444 -47103 -128686 -180316 -158380 -165926 -122316 -202726 -194247 -159452 -79346
18367 -79346 57623 135158 189055 160322 336568 489433 485681 293207 294178 260797 141137
18356 141137 48521 88593 -2989 88727 165932 87456 123856 13180 -13260 59532 187576
18345 187576 304308 213354 33963 -83179 -4291 50380 124520 86835 -68552 815 123027
18334 123027 159369 123664 -13740 -196675 -131763 -33595 84951 61411 -99675 -197464 -81788
18323 -81788 17871 -2644 -29779 -74085 -123059 -64752 36571 -51913 -163973 -144478 -24049
18312 -24049 -79248 -6306 -80377 -164409 -36047 147544 157733 157161 169230 106222 57003 -1958
18300 -1958 -27597 28421 232622 201752 198948 342092 397598 342081 282647 159699 -68370
18289 -68370 12561 62487 113459 107383 81173 34964 121409 156964 85887 -16231 61935 71766
18277 71766 41010 39195 34300 85550 185821 202698 163024 120968 84736 93573 117646 117711 62338
18264 62338 174448 210665 257560 252224 110837 108415 285714 246332 280612 348993 303547
18253 303547 293147 229064 233865 224770 204970 150124 162645 160240 164150 258579 434852 451245
18241 451245 373894 426857 468131 330021 330552 573091 742585 782218 647352 547262 468620
18230 468620 481258 371487 362556 390555 398076 427112 551952 754235 842073 786056 721966
18219 721966 630720 645560 717936 783706 892329 888886 971739 1159122 1392179 1707952 2108710
18208 2108710 2507300 3054494 3833623 4882940 6161939 8181835 11629933 17834769 28940973
18199 28940973 47052838 63238784 60516166 45040008 28440651 18062883 12458966
18192 12458966 9220875 7282790 6088571 5310708 4807078 4581526 4395872 4127560 3838451
18183 3838451 3645227 3579017 3657166 3917043 4233283 4791186 5535322 6737799 8354184
18174 8354184 10206407 12874438 17353856 25325331 39410954 64380683 101168802 124366927
18166 124366927 110626153 78222547 48696933 31189291 21615226 16002152 12497177
18159 12497177 10328994 9002661 8142836 7437323 6738249 5983472 5236554 4858157 4590614
18150 4590614 4375794 4276273 4246802 4433181 4915337 5404532 6042795 6841071 8253713 10794994
18140 10794994 15274807 23206406 37042491 55464593 62468149 52171553 35257384
18133 35257384 22050872 14804278 10853816 8613815 7259607 6493078 6092595 5867435
18125 5867435 5739645 5733805 5713780 5885727 6148002 6661618 7590160 8779569 10347634 12719983
18115 12719983 16140626 21729513 31095326 47708110 79184249 138998258 238607883
18108 238607883 299606908 252206098 164909354 93749356 57861820 39352168 28613679
18101 28613679 22031203 17529677 14271455 11873310 10028883 8587462 7468131 6574861
18093 6574861 5779852 5118279 4601469 4138216 3705920 3343797 3008568 2853231 2659230
18084 2659230 2466569 2307418 2154975 2143878 2032820 1894265 1757040 1606691 1355570 1188969
18074 1188969 1078309 984898 995617 1000808 949911 918502 880089 821947 670910 676195 703747
18063 703747 712160 722422 589494 509031 538191 691217 798111 731585 585317 561811 602301
18052 602301 575347 505432 436797 298273 265291 329375 360458 354095 287871 186025 149755
18041 149755 209685 259811 160866 159887 203623 224402 140119 69287 165334 258342 297227 352415
18029 352415 385547 227893 110748 75126 113050 217025 66543 71294 189519 250733 210404
18018 210404 131471 22888 -51588 -45092 -85611 -108800 10716 195911 228945 227776 237471
18007 237471 228073 264068 289970 373225 326976 212132 186120 248016 312422 394186 503546
17996 503546 543836 554982 481137 443092 475064 334963 289572 305978 303338 380138 383757 294279
17984 294279 237648 101348 95502 93070 65174 84932 129299 118309 62184 41539 -129 65870
17972 65870 142649 189293 232747 318073 322122 274686 231778 137257 115355 64860 164524 50891
17960 50891 -178724 -248195 -99732 70043 81194 -34620 -610 132385 156813 52536
17950 52536 57685 135432 238051 238246 232211 138337 132372 341500 347266 285444 339507 234973
17938 234973 162455 168621 248457 201362 134769 143682 101499 30830 -76769 -53439 113745
17927 113745 74764 -5342 -103799 9315 -52160 -240741 -301740 -211246 37045 153024 43903
17916 43903 9873 109966 35232 59632 92648 149063 171007 76799 -37333 -111778 -68363
17905 -68363 -21739 -100098 8729 73813 -74945 -164050 -205572 -142635 -69107 14995 36455
17894 36455 -22642 62277 42708 76242 72768 -102755 -142657 -69398 3394 103940 193878
17883 193878 140669 186598 78582 7606 -77791 -77962 9344 -90754 -130446 24810 45118
17872 45118 34698 91444 174583 151622 86760 76011 77828 -32729 9510 -44727 -157263
17861 -157263 -214182 -186913 -73265 -131995 -157164 -105057 -124288 -40418 34641 226511 268283
17850 268283 57399 -61200 -28568 5949 -48389 -61629 76994 55355 -9149 -15293 -55535
17839 -55535 -11621 -61953 -107478 -168818 -185432 -127683 -118127 -141370 -129960 -202580 -189499 -112884
17827 -112884 -60794 17133 35900 41624 -31628 -73881 -50524 -8768 -44188 -173930 -202812
17816 -202812 -111736 68265 71745 -100073 -142903 -102684 -25327 -6316 -7295 22311 34731 88679
17804 88679 110313 40688 -80166 -130696 -18129 9911 26622 55584 -55903 16740 103699
17793 103699 118794 97056 65834 82938 77797 7816 -34915 -53253 -21271 37792 20514 -83451
17781 -83451 -9931 -25678 -19853 -26327 11647 33095 -10209 -48025 -72325 -138066 -30509 97841
17769 97841 83169 54821 -1263 -113229 -59639 24067 88615 95414 80603 29572 -20610 -83107
17757 -83107 -23138 -48349 -81750 -52976 -77770 -104905 -28476 1863 23722 68422 101665 79971
17745 79971 86430 48361 -23302 -93645 -58579 -25828 17603 35119 16213 51078 26905 -35617
17733 -35617 -68617 -99567 -224298 -195485 -169284 -110310 24972 141828 165942 132375 28590
17722 28590 -31095 112555 92251 60763 21181 -17605 -63655 4647 134247 157322 90048
17711 90048 29714 20622 96389 65729 -17587 57847 -48025 -151394 -264288 -286435 -232137
17700 -232137 -216792 -161050 -38890 -70349 -187451 -195591 -103682 -8194 -79728 -181311 -231035
17689 -231035 -186345 -184087 -276562 -225731 -246726 -192024 -83567 -173482 -196516 -115241 -32434
17678 -32434 49335 -45413 6605 94398 74006 -16298 -15380 90761 191187 291669 278418
17667 278418 137805 66036 34571 87079 30425 -53724 3387 252824 393890 355583 251626
17656 251626 144022 49823 30257 -84631 -195111 -299014 -155785 938 144248 160061
17646 160061 -6899 -58688 -52447 -112218 -52005 567 150791 254328 281541 226542 212237
17635 212237 127705 75401 125835 236776 331683 400808 463499 601035 526280 332815 265091
17624 265091 223813 95708 140329 133759 149623 20936 39326 135855 62801 5361 11288
17613 11288 -6951 -104715 -135946 -69580 -92142 -164310 -192165 -189594 -144217 71227 38857 112871
17601 112871 192735 254574 292093 265288 91289 11764 48869 8916 -100954 -166284 -91318
17590 -91318 29310 129415 72103 -109853 -176231 -95740 14283 -68020 -46578 -52632 -41295
17579 -41295 -75117 -160133 -196649 -214941 -166008 -50289 -40201 25808 18031 3535 -23742 -92384
17567 -92384 -103938 -76959 4704 -21982 -89949 -7899 22880 45692 15973 -82337 -88931 -40250
17555 -40250 7870 131309 35323 -23604 -4657 -15695 -50962 -84629 -48433 -24618 -34038 -68216
17543 -68216 -50726 -66959 -77653 -55546 -46775 -102235 -169649 -146817 -129897 -23071 10003 -10082
17531 -10082 -57513 -12158 -81331 26151 144395 121762 -60994 -154667 -218921 -90062 97211
17520 97211 -21905 63670 16238 -94940 -115798 -126862 -188129 -65093 -44804 -180758 -146828
17509 -146828 -113495 -19312 -25930 -13766 11997 104162 22328 -47189 -26053 -68602 -110056 -120312
17497 -120312 -162145 -152078 -63317 34392 56506 64330 -49998 -117876 -93778 -62423 -48677
17486 -48677 48072 133524 142820 144329 216453 253048 163142 124203 211946 187407 148152 208430
17474 208430 117383 47310 76930 62513 26051 130516 109960 328 69395 50007 -139073
17463 -139073 -159679 -146404 -32781 -181 -123441 -176960 -41913 34323 -21246 -26538 18429
17452 18429 139768 123540 85781 132549 105844 62194 111930 318011 692406 1205363 1610417
17441 1610417 1430343 969522 550171 474167 427667 274694 225293 120663 -90784 -235755
17431 -235755 -176537 -126874 -109451 -218387 -116214 127223 274567 157346 73463 93683
17421 93683 -21941 -84070 -123907 -34622 -25029 -9924 -8923 -27783 26505 92340 41790 28874
17409 28874 -76946 -226519 -192459 -106440 14948 11089 -55633 -77207 -100713 -160671 -205379
17398 -205379 -93988 -59430 -149447 -216425 -281598 -245857 -235117 -177911 -28024 -13943 -118206
17387 -118206 -205725 -180434 -149698 -188630 -173495 -37707 106768 59843 -38782 -2715 24178
17376 24178 113712 127186 46629 86882 166405 150232 2005 -3294 -8019 56705 115995 1917
17364 1917 -84631 -18784 29546 41466 103873 26514 -3120 -58457 -32111 -8309 -44839 -74617
17352 -74617 -143864 -130932 -91789 -31099 28648 -45964 -63579 -52296 -5811 53289 42187 -25918
17340 -25918 -5715 -22096 -56155 -89631 -104617 35525 18070 -141798 -162297 -125402 -59839
17329 -59839 -59540 -54659 -68165 -100805 -184 39394 55845 90596 21144 32537 -21998 -102540
17317 -102540 -99684 -16378 -18263 -112592 -238975 -98077 -104272 -260081 -250776 -235108 -98752
17306 -98752 14649 11389 44252 -50065 -85354 2927 38413 53129 -29650 -58109 -51495 -68480
17294 -68480 4308 69178 85560 139231 152904 11062 -99436 -82667 -50127 -125212 -116551
17283 -116551 -113659 -207088 -233369 -121508 -11752 5874 15502 -32966 -120794 -158857 -80323
17272 -80323 -86339 -139741 -150201 -46054 -17822 31658 92382 95627 106046 161110 126141 125423
17260 125423 -8727 -62526 -119174 -46472 -55863 -99298 -41494 18512 -105714 -128246 -142483
17249 -142483 -135645 -95629 -7677 27437 27586 -54801 -31886 -32706 -54162 -74563 -17725 30532
17237 30532 56745 82393 79275 113635 82977 114005 35810 -6026 9546 72373 110097 28344
17225 28344 105593 94805 -8203 12571 22781 -9915 -13410 53159 138320 132674 76714 66854
17213 66854 83967 -59593 -216215 -226053 -176699 -144646 -177894 -101300 -109364 -172086 -158969 -120309
17201 -120309 -38396 53444 106713 154277 217671 194427 124575 151557 88364 4926 -92297
17190 -92297 -14717 21417 75928 142718 183313 217513 208120 149214 104871 87436 -57061 -33732
17178 -33732 -10076 -27970 -42417 -41049 -18924 70917 46776 -22057 -30279 97510 114542 49822
17166 49822 28448 121806 110477 54341 61255 113416 97746 -58248 -129500 -121055 5872 38727
17154 38727 53615 3258 -81298 16041 11565 -56163 -197653 -211704 -233957 -183291 -119663 -67476
17142 -67476 -66102 -93908 -10447 -53327 54930 32814 -7611 39710 19486 91589 19738 28209
17130 28209 89546 49290 7105 14533 -5532 7943 -77560 1824 145686 237379 108390
17119 108390 -32501 -33074 28815 -16694 -229033 -340376 -267463 -28302 -5200 26557 -19094
17108 -19094 9732 133653 149604 136817 46962 66399 78141 22564 -26031 -75905 -132376
17097 -132376 -106648 -107917 -31544 -91574 -112818 -72464 -46731 -38396 -19754 -5392 -42762 -50903
17085 -50903 18315 103202 50513 -137720 -214772 -190007 -168790 -48512 -54540 -12109 -67052
17074 -67052 -183747 -168245 -84640 -6809 -10964 -79541 5120 -27771 -47304 54331 33720
17063 33720 -117578 -240409 -255283 -162527 -199834 -156906 -121188 -66378 -87503 -58046 -28193
17052 -28193 4217 57029 116767 142674 119724 94239 -40149 -139825 -135526 -116015 -161992 -99941
17040 -99941 -197670 -287369 -188258 -77471 -3125 -58436 -187397 -191230 -250740 -177846 35342
17029 35342 137019 243837 291938 115553 -8265 52304 34318 20162 -53903 -39695 -7952
17018 -7952 7681 38279 66385 23939 -111724 -86409 -39145 -73051 4975 77314 98728 39950
17006 39950 -47153 -4419 30913 108775 150153 78703 -54062 -146672 -198826 -59799 88054
16995 88054 -12670 -35828 -69627 23867 153268 79814 31467 -24714 -25224 18374 36942 178222
16983 178222 258859 256873 187075 107839 -19336 -119599 -195020 -110104 -39759 45175 56770
16972 56770 15381 -53339 -100423 -168878 -115498 -91843 -115996 -90274 -87477 -52076 -66596 -25541
16960 -25541 -4121 -156731 -162901 -119347 -71117 33854 32500 4423 23817 -59893 -68612 -32964
16948 -32964 22100 50723 -8832 29001 48887 116590 64929 -35507 -187784 -147375 -66564
16937 -66564 -92261 -88698 -88412 -101814 -113638 -62695 -22313 -46120 -15596 49454 131878 123681
16925 123681 4063 -76903 -163505 -124745 -121121 -121384 -33051 53608 42272 -26120 8988 4820
16913 4820 43190 50411 101760 55091 38243 39186 130911 114823 -6650 60298 82005 -34956
16901 -34956 -149309 -123624 -100676 -120715 -60131 -68142 -89643 -189619 -232148 -180024 -58668
16890 -58668 64303 124569 145774 55198 -8910 -121304 -96104 -2378 -1659 -30416 33 -1456
16878 -1456 -71506 -240311 -271120 -160432 -142650 -157863 -87826 -86390 -11400 -4209 62116 138000
16866 138000 165961 74325 9730 -109502 -91944 10162 72691 105112 104500 45478 111376
16855 111376 124674 93273 -28494 -74260 -119984 -34186 -70714 -88413 -5498 14912 85462
16844 85462 -12829 56871 187419 102822 -9387 -126281 -22427 86296 -14519 -102994
16834 -102994 -30431 106345 17646 -113952 -86773 -36785 3752 54571 102194 65786 23724
16823 23724 -80473 -50445 -102288 -26801 60780 2140 -95024 -178324 -297632 -293826 -241683
16812 -241683 -140454 -141634 -98964 -117040 -110877 -50435 -6387 -61812 -102604 -149651 -72788 55641
16800 55641 84436 77778 22073 -66009 -160444 -233200 -33071 102176 23176 70986 74941 35004
16788 35004 23909 -32051 11714 -12755 -42284 -71482 -93164 -26419 -75089 -60445 63738
16777 63738 33620 -7105 -145607 -241510 -229595 -118765 -100013 -22785 9030 21017 54347
16766 54347 80095 121121 33411 -30341 -52976 4360 5967 -59732 -107849 -142413 -77283 8626
16754 8626 -14597 26289 24314 -46979 24344 10869 111664 151198 58498 -27945 5815 -5518
16742 -5518 -20740 -105641 -92269 -183794 -265391 -244931 -195784 -2150 160789 188763 199749
16731 199749 275557 147029 -32338 1328 134179 163850 48579 33787 57719 17229 -81317
16720 -81317 -105316 -91233 -125227 -176053 -140095 -88310 -77982 -116258 -76053 -58605 -119041 -92834
16708 -92834 -33669 134758 208877 126886 31731 148581 57565 -76562 -66410 -123214 -39440
16697 -39440 48328 44777 37775 5660 11049 -17445 841 -19780 -92271 -162890 -80376 27603
16685 27603 25853 -50352 -75896 -57561 18783 12135 -97397 -82116 -42090 -84270 -109667 -58730
16673 -58730 -47553 18335 -2748 -3687 99103 124983 32239 -63956 40274 32006 140561 293936
16661 293936 316655 181684 -16996 -163055 -211358 -149080 -33566 61304 103734 90937 72309
16650 72309 22980 -5653 -64294 -75655 -18897 6932 3 95184 81328 87145 197881 279855
16638 279855 224095 208104 210200 174188 139829 178590 164958 248423 193287 100010 55966 -66540
16626 -66540 -64568 -80208 -48098 66529 21293 -76848 -28068 -7666 -74120 -195392 -194517 -144963
16614 -144963 -25259 67098 105063 20228 43678 -97134 -46102 12013 90601 166216 113945
16603 113945 75925 53436 12028 26114 48810 -34360 -93237 -180492 -262070 -202032 -205385 -260344
16591 -260344 -246699 -80763 -12057 -113817 -133980 -77708 -70151 -33795 45828 -96912 -106338
16580 -106338 10898 69337 71156 116706 45322 20201 -5460 11158 -63891 -179760 -326859
16569 -326859 -355556 -292934 -317524 -247077 -190147 -209929 -213974 -282566 -330626 -195664 -142834
16558 -142834 -128690 -150339 -155041 -153720 -202495 -208992 -119128 -148145 -67527 33725 -3694 -70713
16546 -70713 11446 36604 57159 77263 6839 -48637 -76848 -145818 -248930 -383655 -346478
16535 -346478 -230275 -141665 -126067 -61418 -15964 -41345 -127734 -127336 -107664 -38935 -96196 -185058
16523 -185058 -128171 -102242 12267 113782 55842 -14131 -127285 -129223 -128055 -120445 -158756
16512 -158756 -90774 22391 98643 178707 203722 108711 75170 72193 -135 -92344 -76550
16501 -76550 85214 112331 64388 -43730 -41918 -23549 -81159 -159172 -164352 -75618 28005
16490 28005 88957 52600 -56641 -24198 88427 107110 37626 -86068 -56710 -35945 -135949
16479 -135949 -24090 57624 -5881 -54643 75928 223250 293825 180314 121740 139249 216324
16468 216324 314446 211743 95780 82963 20042 -107948 -151475 -53485 -37 -54219 -26644
16457 -26644 -14586 39747 14991 36972 -19266 34787 191338 86956 -51861 -82898 -93070
16446 -93070 -108155 -105564 -57667 -38878 41775 -74302 -137023 -134833 -113337 -124532 -9232 -6592
16434 -6592 -130370 -206514 -270094 -179706 -118194 -21330 109741 87087 50031 -15972 47015
16423 47015 -17666 -143721 -124554 -101687 -57408 26648 34526 -16941 -173694 -94052 -24021
16412 -24021 -30661 -116845 -132456 -143645 -114703 -153662 -168133 -202763 -125509 -168828 -177318 -177711
16400 -177711 -122403 -94170 -114062 -226400 -189570 -49538 -81180 -187899 -151906 -107259 -58939
16389 -58939 -8302 -133376 -181168 -124824 -144593 -126614 19000 13894 -43292 -2809 -38249
16378 -38249 -117289 -172571 -193547 -164746 -110428 -132096 -150074 -161519 -99922 -51059 -101913 -133268
16366 -133268 -172306 -117761 -63013 -28658 100757 79293 -69875 -74951 -55650 -125775 -129404
16355 -129404 -145497 -113518 -45265 4550 -63755 -88727 -62982 -125117 -121673 -128807 -20857 121758
16343 121758 189446 49332 -87822 -177330 -171941 -96954 -27735 115296 130466 82868 39702
16332 39702 -11925 54088 125669 9696 -71670 -82670 -66294 -25676 -39043 -22359 81338
16321 81338 121422 24217 -92790 -53972 -41067 60183 14969 -111742 -144943 -52792 -1160
16310 -1160 -149360 -226220 -378748 -294060 -124939 -96088 -80411 -2285 143646 -9097 30276
16299 30276 120334 58174 85848 -107407 -75696 23524 204110 169983 31043 -109443 -152843
16288 -152843 -167492 -112615 -111594 -131232 -35651 83310 59797 138974 112882 -84507 -149390
16277 -149390 -259461 -313791 -288201 -246044 -162248 -13571 28090 46985 70987 125874 133970
16266 133970 170435 21749 -106110 -194377 -253912 -106030 -14205 29460 -46078 -128249 -37073
16255 -37073 106506 59286 -122862 -143202 -66852 -76892 -16394 135523 152055 180346 160361
16244 160361 2478 -116027 -123258 -42861 -24986 -11874 21817 11067 -19537 602 28187
16233 28187 114523 227197 180464 74019 37521 101863 135364 85134 17436 -11333 -48025
16222 -48025 10299 33439 104565 -526 -3388 43899 -8668 -38247 -53931 -43066 6423 84744
16210 84744 125897 110673 59836 189418 188758 126116 75199 185487 171059 -15550 -26054
16199 -26054 40520 115454 31521 55912 138831 3743 -101228 -67232 65697 86178 95372
16188 95372 136425 59069 56003 21439 -13806 23774 69422 205124 137003 145133 152408 164171
16176 164171 152268 36921 46048 -14639 39658 114991 44900 -11985 46333 -17912 643
16165 643 35217 85535 134439 41130 84713 198328 186006 260488 129647 414 -39755
16154 -39755 42678 -23796 -134908 -106032 43621 96516 67773 -412 -125049 -203046 -194544
16143 -194544 -157928 -76726 -54300 -2799 -108113 -99795 -54442 -97355 -98688 -151047 -102923 -160353
16131 -160353 -112702 -47073 -60778 -97142 -81974 -75019 18014 198576 162006 202986 184372
16120 184372 122497 38895 -48618 -69782 57420 98070 77189 -898 -45083 1536 -20172
16109 -20172 -52483 72833 242498 351241 389365 199598 77921 157617 153290 179577 176378
16098 176378 153686 165752 159074 115942 69684 91542 70754 37876 -100125 -135727 -95032
16087 -95032 -39453 5643 -62102 -80139 -163083 -164673 -113164 -92874 -74024 -49580 29027 -68346
16075 -68346 -97674 -133818 -134157 -66232 -29751 -65275 -442 70250 31285 79329 180281 76065
16063 76065 -71887 6858 49991 -25569 -25848 50743 69028 6087 -8761 62282 67832 -91941
16051 -91941 -37414 32859 6643 68356 216021 249736 152283 13575 14777 -35900 3810
16040 3810 -11417 -154822 -90649 -37572 -36969 -15599 32994 105102 190147 170664 19517 -74689
16028 -74689 -24151 -13765 878 -65820 -161322 -78149 -7242 48642 34135 -121412 3279
16017 3279 25537 167447 242092 252490 136867 50170 -83710 -164666 -137662 -68361 -33589
16006 -33589 -84363 4840 39539 3641 6996 -18317 -37079 -43999 -54303 -90771 -119992 -171846
15994 -171846 -166392 -129422 -18111 41826 -85848 -213231 -170478 -85470 -182297 -294762 -230052
15983 -230052 -230099 -206766 -67874 131947 98194 -18631 -30376 19825 89064 121510 -50593
15972 -50593 -136514 -76486 -32938 -18958 103564 187448 185800 109552 134537 18836 -95795
15961 -95795 -200823 -74545 68721 77160 -33261 4825 -66025 -74096 -105872 -76752 -77456 -59660
15949 -59660 -74968 -163421 -136716 -208124 -127184 -82518 -98915 -117346 -116548 -36888 52044 -68312
15937 -68312 -136157 -54740 -54262 -143301 -182866 -206821 -174083 -23597 -52975 -176893 -176571 -242862
15925 -242862 -192039 -129081 -114955 -120893 -21737 70122 11460 39329 -55710 -122784 -36498 101187
15913 101187 123349 279128 304101 267654 163510 83706 -14882 -130443 -162988 -57709 -113442
15902 -113442 -66083 -43142 -37308 70100 101060 70523 -29809 -54687 20214 49597 -2296
15891 -2296 33932 101578 92627 91492 87533 -56495 -89940 -3726 59395 142313 177924 119411
15879 119411 67714 37476 -11447 -23991 -7283 -128237 -144972 -16567 104201 62285 -20951
15868 -20951 -92062 28738 26926 68021 222893 189273 59528 54282 156253 73269 -30247
15857 -30247 27896 31361 28734 -2402 -116674 -128562 -70305 -17588 -40233 -18671 19384 57803
15845 57803 112279 204293 162459 106658 139458 177854 131250 64661 29176 -28961 23037 20995
15833 20995 -138031 -120295 37681 97204 -20743 -88747 -104776 -58512 -20293 -64429 -119983
15822 -119983 -10234 -35879 -17688 -31136 -131020 -140937 -123041 -132325 -88406 -75616 -145502 -59355
15810 -59355 -20939 -7539 -55250 -129696 -36966 36390 8383 27066 33421 50436 89079 134625
15798 134625 145213 58080 31368 9782 -85954 -123075 -91432 73101 190668 151395 79589
15787 79589 -93192 -200386 -166084 -174083 -242766 -287500 -244531 -63127 -21465 -86555 -229122
15776 -229122 -211050 -84469 13689 -18510 14726 64146 102732 2660 -21795 25685 -70648
15765 -70648 -66453 -71173 -15146 -36773 111259 181382 193440 112784 158129 117355 50329 -16965
15753 -16965 85008 73433 71285 128147 156215 65930 48458 89523 186332 176573 54192 -29594
15741 -29594 -11625 23997 110946 56232 60198 21229 -41720 -57036 -51019 -16132 161134 193698
15729 193698 -21308 -144032 -94619 -2041 -91224 -259452 -224003 -88973 -96966 -107750 -119355
15718 -119355 -221962 -219226 -108551 -53617 -56170 881 -55392 -240039 -153244 -61594 -150878
15707 -150878 -185793 -137402 -125100 -14878 -104702 -101391 -166665 -121931 -41055 22491 64354
15696 64354 32489 137858 208797 212717 206187 167525 100789 76708 38520 37050 92829 144772
15684 144772 239918 117290 7038 43109 -12864 73111 101135 59611 25263 57578 28102
15673 28102 -14012 -7206 14502 35268 64250 47486 -8824 -36420 -31330 -44466 -21893 -89219
15661 -89219 -61932 -38 -70280 -28532 47991 54269 2767 -33365 -51732 -133392 -81520 -106583
15649 -106583 -34421 -103892 -172949 -133254 36982 102847 87115 22512 -8030 37118 -17843
15638 -17843 -51425 -16629 -98782 -141469 -35002 -23069 -81274 27923 92385 118630 161105
15627 161105 147954 182536 73947 24949 26014 37715 -72839 7143 92986 69249 69026 37490
15615 37490 -45969 -127067 -187697 -185180 -122893 15744 46966 -25659 -28891 68056 124320 62491
15603 62491 37633 -6377 -76990 26722 52251 -69693 -213544 -133741 -140686 -73920 -36085
15592 -36085 -30973 56808 26782 -125189 -258504 -239768 -273244 -142792 21293 -32754 -5200
15581 -5200 30214 -5573 -94613 -102880 -213711 -290559 -224572 -188028 -282806 -347163 -298296 -142504
15569 -142504 -57722 -74456 -133826 -186231 -6229 133203 266519 138223 53301 64161 86509
15558 86509 119548 104478 84238 -17452 -56015 5064 14695 7415 -54568 -84938 -77229 -121023
15546 -121023 -117072 -153332 -102455 -65950 -75556 -30872 -78207 -54428 -111209 -187593 -157204 -136921
15534 -136921 -62272 61048 149621 29325 -15399 10783 -22384 -51671 -5596 27363 100773
15523 100773 80876 -7806 -1432 62114 117500 198738 94559 46484 150786 187667 136396
15512 136396 -207 -12584 -5860 -59785 -159282 -155435 -84957 -84597 31307 38539 -33222 17243
15500 17243 77080 74474 7750 -16716 2012 -33874 -105503 -93657 -69901 86590 248976
15489 248976 126395 -55029 -103092 -53663 -62550 -127631 -66465 -9066 -56973 -85034 -74656
15478 -74656 -60089 -29406 -75348 -160743 -71027 60072 -23928 -97148 -176509 -205610 -114026
15467 -114026 -119717 -47834 -5554 -21917 -6959 -59005 -52840 -29211 -39690 -100013 -188377 -212316
15455 -212316 -70337 -28382 7700 -80892 -88427 -2665 -45111 -209502 -208927 -43016 20099
15444 20099 104340 106831 50454 63246 168561 196506 171010 68981 -39309 -7118 27294
15433 27294 -32026 -58175 -59598 -125051 -70908 -72322 -92437 -32141 17575 -5024 -40196 -85224
15421 -85224 -101378 -137777 -87639 -20241 49928 -8210 -47368 -38014 63041 95490 144451 21572
15409 21572 -47208 35702 -9462 21481 148974 175768 144585 72152 -25762 -72328 -197274
15398 -197274 -227239 -186861 -234875 -201833 -113230 -97976 -95803 56684 172705 71266 -84259
15387 -84259 -72338 56167 189295 266648 227280 235199 129436 10282 -13331 43569 111838
15376 111838 82170 103461 87980 -54702 -136474 35552 136876 86003 140088 22120 18837
15365 18837 28315 -12229 -18911 15250 16461 95526 149049 162628 150651 167490 83265 95326
15353 95326 111611 201696 326741 230233 143866 122445 -32120 -106340 12767 75300 76902
15342 76902 204430 235179 165144 103523 114915 120452 -17958 -25934 29478 7383 18308 41543
15330 41543 -22561 -5732 -23701 -68935 -108149 -72858 -158437 -251826 -201947 -66263 34923
15319 34923 65281 132332 167836 167552 189985 192164 141506 54897 -9317 86255 183759 152596
15307 152596 99917 18807 9793 40432 -106202 -26043 -25841 -27372 -54369 -60810 -93525 11002
15295 11002 34729 -17181 -86420 48347 78702 91534 151546 183390 15341 -29381 20963
15284 20963 108948 12264 -1979 -3015 -12831 36247 -16248 248 40002 -22396 14389 99034
15272 99034 -29691 -126047 -137932 -67184 -64023 18719 44007 22062 140077 169365 96124
15261 96124 93458 -45180 66548 42497 84893 142810 135476 185411 174095 25718 -17575
15250 -17575 62626 119586 142466 -17946 42312 -11094 -16511 -89435 -22502 100050 195315
15239 195315 283418 198893 41620 67245 -146959 -139927 9465 614 -52648 -28263 18318
15228 18318 -30716 -20983 18472 -28551 -60334 -83688 -51896 1690 61764 139625 -53940 -166664
15216 -166664 -99859 56041 211716 278721 181379 42800 98476 201105 115036 137770 241131
15205 241131 173821 27337 -108622 -220242 -187798 -90845 -95854 -50172 73234 219994 253812
15194 253812 110675 -89920 -198684 -112924 -124939 -188486 -119694 -11529 -86884 -159074 -221133
15183 -221133 -197326 -232964 -253479 -238130 -274469 -57635 69299 70233 155391 160891 122050 145315
15171 145315 137099 120190 100772 130386 113748 183961 284385 224679 113066 25903 7331
15160 7331 20397 99549 155534 164599 105530 83752 174234 86681 36913 39929 59980 18622
15148 18622 95767 62489 -154 9807 81465 132160 75121 -48502 -50716 -176539 -202888 -266315
15136 -266315 -287707 -223033 -65980 13146 110747 89246 14951 -109220 -150054 -104517 -31004
15125 -31004 66112 29132 -64403 -55306 75898 125983 141065 143368 83362 20943 78192 104409
15113 104409 21579 34700 50762 -102005 -51636 34858 48232 27552 23045 88631 97709 37320
15101 37320 101978 116905 48908 -76251 -11811 111016 65117 15299 74981 111560 62379
15090 62379 -111251 -184933 -222068 -182435 -65196 62386 185560 232437 215833 73361 58920
15079 58920 51834 18223 -75871 -114349 -128489 -95208 -65617 28292 142387 120695 108818 110382
15067 110382 66535 5058 -136020 -235679 -17874 27542 -18569 -10118 -18817 104963 236897
15056 236897 178947 110228 89705 88681 104851 76859 62808 28408 67445 114486 170439 51958
15044 51958 -14464 145228 289810 223368 176087 203562 188070 115895 83150 214996 126821
15033 126821 113425 57010 55049 18898 20265 151457 192152 63268 46443 -101539 -276390
15022 -276390 -200264 -36010 24403 -36914 63024 93648 56618 11999 -69438 -29516 -95904
15011 -95904 -158110 -134025 -74160 -99413 -10360 29004 60217 7610 50482 122906 -28230
15000 -28230 -37317 107276 201314 172670 93119 -6516 -60392 71573 107722 116547 239313
14989 239313 240721 128979 11623 -34426 3414 26026 -5320 -152594 -164661 -44068 36408
14978 36408 -17713 84616 110162 88631 94877 63751 -11786 -99462 -138660 -99588 -128758 -101296
14966 -101296 -105705 -114658 -149220 -229524 -42883 95621 128278 315735 344020 125314 8802
14955 8802 -7119 78838 27371 99470 121864 39709 79341 169692 56088 2033 -8173 -7258
14943 -7258 79727 51649 -14775 -78470 -137332 -220734 -176140 -33637 -64687 -61909 -89781 -58955
14931 -58955 -99774 -59084 -17608 32705 -48101 -38729 26730 -8477 -89816 -4440 123217 146481
14919 146481 -28942 -145828 -128879 -85026 -27905 31483 31671 30636 107470 157460 115841 233388
14907 233388 256458 147828 19009 -101016 -188999 -251519 -225005 -147020 -125305 -183909 -179711
14896 -179711 -114840 -80998 104831 187759 47001 -1647 79376 98607 -10420 30071 88919
14885 88919 57948 9298 12129 25781 -18220 -77882 -40311 -33791 -108900 -66883 42038 108500
14873 108500 92171 71168 45001 17281 75895 -6165 48200 32417 106583 135236 55969
14862 55969 19902 120248 239463 127133 12191 106534 119003 112555 49957 123294 113155
14851 113155 102187 12769 53819 55830 67854 65746 126536 86181 64935 113279 39656 21383
14839 21383 -56575 -16786 -38089 -231555 -217836 -131777 -151687 -318100 -243545 -46181 -87653
14828 -87653 -30525 38087 32749 -12835 -21913 68513 116074 40881 83697 -31914 -224663 -199647
14816 -199647 -185720 -164283 -205994 -109752 36744 118894 86559 124423 152763 84727 -17585
14805 -17585 -101341 -104007 -76162 -8377 63219 -34520 -84215 -76572 -98093 -58426 -18567 103619
14793 103619 101204 39010 61881 11160 71212 159178 254071 233042 223077 76375 -53058
14782 -53058 -91642 34606 -47664 -148116 -91961 11893 58175 82513 53637 -3955 -59104
14771 -59104 -17480 -26082 35019 43270 100621 137886 87733 27392 50207 123123 11507 -94600
14759 -94600 -63624 -58112 25560 -584 39630 44663 66607 111179 116966 -3718 -53040 -5874
14747 -5874 61174 146597 238090 106624 -18685 -9862 39057 27730 50746 21410 14841 91987
14735 91987 170166 251302 240675 179307 200612 142366 122361 64123 57687 51126 64682 -58875
14723 -58875 -88855 -36362 60656 193143 270416 326420 212225 61388 -3035 -88720 -101325
14712 -101325 -36928 -114558 -110459 -53863 -49346 -116248 -43592 25836 64157 125170 106702 37282
14700 37282 20632 45329 -47089 58380 106578 24814 -16053 -26717 -42645 -104519 -97408 -40690
14688 -40690 14741 -25438 65884 -4841 6392 24242 49359 61056 54258 16501 19895 46846
14676 46846 145549 180671 -15192 -220953 -139583 -29362 37261 44734 176387 147012 130033
14665 130033 84521 69910 124703 132123 167559 92786 3940 1443 49682 78938 116777 151710
14653 151710 198497 181944 190479 130190 119762 166981 89016 -8764 37766 72792 63702 53423
14641 53423 -29128 18568 128071 102155 72704 41110 -10285 -11313 10390 -10527 99580
14630 99580 54016 21725 20052 -7652 -15944 -11906 -24997 -21595 21543 -12909 -65234 -129842
14618 -129842 -262576 -195154 -96373 24792 15817 4539 37792 68402 61753 15061 -43602
14607 -43602 43316 81358 30653 30593 134813 122497 58315 78884 62716 26940 72559 37326
14595 37326 50643 43703 116152 79687 35328 11582 -6959 25418 53937 -385 -37197 -136598
14583 -136598 -161244 -219749 -185778 -7558 129255 178472 143912 57928 89908 243293 267195
14572 267195 163711 137410 151605 35935 24004 62853 -11389 33392 135104 109448 18097
14561 18097 69708 -32066 31187 211754 188536 114482 -8630 75402 43050 85740 32042
14550 32042 53638 11299 -122213 -93723 -83330 -86761 -87123 -162437 2872 122033 116841 -8342
14538 -8342 -65159 42607 28581 -83598 -105456 -234471 -366603 -269207 -72150 197350 176093
14527 176093 68863 -2514 -33471 -46522 24441 -6340 -40966 67170 173358 103521 -2838
14516 -2838 26630 107710 85808 3279 4154 121102 293086 229151 155802 273614 236912 126514
14504 126514 116945 118133 221965 175910 180542 234008 201975 212827 195317 120451 23652 76038
14492 76038 131785 74583 -27530 3753 62364 88136 119477 195339 85929 98811 175353
14481 175353 243377 133682 -114811 -143275 -70566 -32612 -167232 -329361 -395524 -168610
14471 -168610 21740 -39757 -72381 -62789 -77882 -75974 -131768 -90239 -136839 -147001 -89681 -49625
14459 -49625 56820 179134 188681 144823 95746 11726 -51559 -6763 46763 43546 65347 71192
14447 71192 81152 1028 3805 936 -32824 30767 -18772 -48496 -60530 1811 9210 -150940
14435 -150940 -257333 -262619 -127959 -29814 -274 -62860 26307 36113 18622 76605 142201
14424 142201 182275 189446 89397 50405 -163290 -114536 -93201 -104886 -112035 -147745 -28445
14413 -28445 -30053 -103454 -3220 42832 -6186 -66808 -69704 3587 69037 3223 -61302 -122645
14401 -122645 -91566 -73373 -16565 -21269 -31203 8291 -19098 -57321 -51128 -17093 -57761 28788
14389 28788 111894 35077 40088 -29423 -109337 -161788 -103035 -36362 -152207 -71320 -65570 -60649
14377 -60649 38564 -48369 -158609 -89097 -55033 -98624 -189911 -160078 -126930 -36681 1912
14366 1912 -72874 30884 137314 119931 112639 4938 -92800 -111478 36955 35910 -161999
14355 -161999 -222531 -248331 -131755 -31025 -73957 -107808 -129042 -102747 -53803 -60600 14839
14344 14839 132819 16647 -71879 21481 -53538 -31073 5463 19182 246 -55752 25233
14333 25233 -105789 -129116 -94137 54417 282021 348470 305588 222480 116515 122909 135306
14322 135306 137770 155636 143986 9791 -62705 -20154 118217 276667 262734 178566 179579
14311 179579 184247 191805 237184 225218 153820 153789 211879 121523 32245 45518 63546 109009
14299 109009 -1224 2461 41612 79214 30433 101941 62622 -108074 -65714 -41992 21074
14288 21074 74060 -66668 -24782 46788 24294 -138904 -146006 -143970 -167185 -90113 -34751 48357
14276 48357 139615 114069 43763 102879 186149 207943 63881 -36053 -29224 -36206 10622 -44170
14264 -44170 -76378 25734 18910 59315 40136 11642 -792 -61920 -4972 -7777 40679 119546
14252 119546 153891 84828 61505 -52094 -65680 -116472 -191276 -108598 -10690 20939 109821
14241 109821 109839 50201 47893 61931 -22083 -126493 -120617 -165266 -86020 -1077 45802 89882
14229 89882 40256 54428 88096 122823 146578 136004 55137 94865 91247 -20841 -59167 -69250
14217 -69250 -77691 -107431 -93336 -39347 -2875 -23814 -33113 -20708 110709 247886 288654 313560
14205 313560 205781 48418 42675 140435 97858 88282 72263 15162 -72880 31561 67471
14194 67471 44504 38985 -12836 -40687 -101453 -136621 -147637 -83327 -12620 46559 -8271 -58190
14182 -58190 -48522 -93270 -144551 -72047 -55351 28446 46500 -45043 -49767 20576 -3696 -119634
14170 -119634 -121828 -111788 -192321 -95199 -38261 62948 53719 -23120 -43788 -131289 -162105 -45176
14158 -45176 -28864 -35593 24267 -4589 -63661 -131614 -83885 -77061 -7372 -66500 -76803 28718
14146 28718 -69430 -148748 -152630 -85072 24199 12305 -144225 -202036 -42461 -41254 198514
14135 198514 300236 296274 232846 126360 75613 72204 82027 -19097 -96934 -97497 -155808 -286586
14123 -286586 -188615 -143723 -211004 -84654 -97714 13175 19118 -18541 -60055 -2443 112489
14112 112489 176510 245426 236258 206362 139074 113373 7247 -65275 173611 262349 114779
14101 114779 119919 155459 123470 190082 178889 240297 253382 174093 149864 62247 2382 42938
14089 42938 -14976 -65182 61824 175759 255360 194428 146789 51893 1258 -50369 -42450
14078 -42450 -18680 -67481 -113825 21706 -20447 -68474 -120699 -155987 -154483 -139264 -47538 40230
14066 40230 31098 -12396 -50069 24444 145561 211422 163204 25599 -3672 -102271 -85650
14055 -85650 -2225 -20127 -3477 56200 105123 26634 -67890 -85633 -1192 -71146 -36945 -85862
14043 -85862 -113033 -89406 -2604 27632 31560 129404 180256 69478 -108851 -147005 -119773
14032 -119773 -100771 -28015 109802 182036 159008 98489 167643 190532 150837 120753 161234
14021 161234 113082 73953 14512 63711 70878 70044 -16517 41602 253532 245125 104094 -3373
14009 -3373 54369 148731 160771 172789 244913 196108 197398 246405 249007 199319 123353 118873
13997 118873 109637 118709 70598 112060 140119 66432 -83005 -162646 -189272 -11710 -677
13986 -677 -10241 34907 55928 131618 236393 67936 -118740 -149256 -65099 -32571 -74769 -81604
13974 -81604 -23605 81364 176557 101466 27979 26485 -13230 16937 84274 216003 193171
13963 193171 83465 104544 109495 74167 14469 -53013 25662 67658 -169306 -263816 -131950
13952 -131950 -73413 -54835 -13535 -718 65282 14838 -59281 75565 81769 73963 -26013 47064
13940 47064 76647 63579 -42027 -5613 3315 -37206 -230061 -270999 -86331 21076 104760
13929 104760 123609 136488 31951 59731 84016 61258 -6255 -62261 -96110 -111540 -164540
13918 -164540 -168397 -66798 20161 8546 34342 -16452 -147061 -112498 -86981 -62696 -60277
13907 -60277 -87772 -104103 -110338 -49663 -43111 -59467 86890 25951 -37340 -11062 -69682 -37481
13895 -37481 -36819 9428 63054 30301 35279 26769 22330 -4401 67513 117008 238669 360961
13883 360961 319607 226165 268760 228442 105862 53918 -47501 -44202 65571 113472 110390
13872 110390 38193 -24912 -42115 -76491 -70252 -50190 -80315 -20873 117049 179177 117625
13861 117625 140371 62948 36669 48449 51062 48862 38809 132047 207846 158726 59649 117011
13849 117011 197886 360155 240519 145233 111680 156588 159687 175098 92339 69856 115012
13838 115012 57906 28445 164461 64305 8334 116628 61000 -110885 -43578 -28019 -58760
13827 -58760 -101668 37215 152562 69927 28151 13835 -121346 15578 125496 66572 -26725
13816 -26725 -4984 25253 93266 18164 88466 134205 163682 80775 -46574 -22962 -101211
13805 -101211 -155301 -158410 21928 111654 26878 -36672 74601 116141 86466 13711 -24594
13794 -24594 72382 79729 35084 86407 164169 201904 233606 321854 199320 49181 43703 176496
13782 176496 97478 -70429 -48640 56034 119337 97154 11581 -46999 -185497 -222330 -166251
13771 -166251 -215613 -155753 -76654 7342 -43120 -47036 602 91308 171471 181475 154362 127135
13759 127135 63825 20339 3442 -69141 -40224 86178 148955 206799 195354 228520 148968
13748 148968 56044 -49644 -8362 68336 201 -101132 -108113 -65578 -45269 -25722 -117816
13737 -117816 -118071 -27043 36536 48434 -33258 -159004 -104553 64508 80306 49196 51150 29433
13725 29433 -10893 -28434 11459 -3776 -97156 -123147 -130617 -74332 44236 -33930 -89341 -33236
13713 -33236 -17401 41123 38322 3419 -74469 5467 -24462 16568 74270 -27334 -2310 21915
13701 21915 30148 20278 -10822 -104139 -17876 -23545 25122 30969 8216 -4592 -35948 -23752
13689 -23752 22024 -47662 -80958 -51306 -42927 -12190 175920 172398 30922 62828 120979 -19002
13677 -19002 -16609 -86220 -83936 -92542 -145437 -198292 -31224 43454 179886 90020 -56714 -109231
13665 -109231 -15653 28665 -79550 -37448 51440 117907 50714 -56150 -38559 -216360 -255299
13654 -255299 -225197 -154989 -67482 -59646 -25229 23350 92159 216978 191570 242283 141504
13643 141504 73023 49332 -25095 -74285 44281 29865 7496 53854 153376 90787 -9219
13632 -9219 42581 122723 152970 120319 5148 -27526 -23767 51804 92385 9369 -13284 34809
13620 34809 -14014 -14626 9646 -1588 48288 84006 18932 29587 76211 105090 69153 -8294
13608 -8294 31209 145069 142957 35970 62824 68053 76308 -42444 -30687 16783 -14402 27304
13596 27304 -32509 -109302 -52929 75496 161005 161234 110650 586 -69462 -84161 -56289 8179
13584 8179 43755 54253 8070 12262 -13177 89081 85702 64398 45362 69170 31813 15363
13572 15363 -13100 -40646 -85776 -54042 -119788 -60248 28691 28172 -43454 15621 -9536 49201
13560 49201 87812 66235 126964 179968 107769 24727 60898 65522 36542 -24949 -3333 -15838
13548 -15838 19058 -75360 -132393 -141558 -156633 -120316 -3409 45601 -45098 33601 189676
13537 189676 263214 216250 230642 223730 179305 61199 -25223 -106484 -171144 3024 116818
13526 116818 165835 228291 247662 74999 -57837 -96990 -41816 -3718 -67522 -32333 -4095
13515 -4095 -14949 -9996 -101671 -167603 4338 90118 17713 27018 8005 -76087 -37739 10620
13503 10620 3927 101674 96254 29742 49561 36030 -28720 8268 81068 46801 130079 187258
13491 187258 122440 -35723 -71763 -17625 -74532 -103246 14402 105119 54500 4665 -9018
13480 -9018 63315 28802 33253 125727 96433 38576 -65437 -197807 -191275 -117040 -47684 27907
13468 27907 -13890 -81180 -17495 -47552 -204837 -152243 -152401 -102879 35304 4484 -42138 -145234
13456 -145234 -93904 -181300 -143490 -32478 46813 -36386 -25756 67654 -28917 -39988 -99991
13445 -99991 -68263 -95144 -40005 18254 5055 27685 133490 204667 198450 218232 109767
13434 109767 49738 14060 22854 -652 -21580 13442 -3799 -48875 -90392 -148838 -197334 -326231
13422 -326231 -302241 -171089 -10235 13926 -28851 -56008 -64368 -65626 93962 111843 78208
13411 78208 90407 -27256 -143342 -127704 -30729 28293 25239 -67899 -66491 -22107 -24886 -20835
13399 -20835 21964 20750 -62110 -126597 -71983 31419 105481 111361 54086 40340 65455 3291
13387 3291 21025 46910 -42891 38227 27140 -105472 -171352 -182461 -188831 -94986 -130 60123
13375 60123 16682 119226 111792 70784 156413 188626 264328 255281 87732 -728 30670 82050
13363 82050 94041 -2270 -32702 80805 15067 -84962 -122901 -148916 -48485 26319 48492
13352 48492 21635 -21868 -23712 -104768 -159708 -100513 -71396 -169998 -130611 -77440 11509 28018
13340 28018 -45229 22856 -9031 36112 57865 -16219 7660 103701 225976 224049 106317
13329 106317 100723 116509 86272 30620 -20275 -199366 -242824 -251448 -159037 -39559 -82568
13318 -82568 -146937 -89804 -89724 -64763 -111872 -61594 -25995 20379 93642 100922 -48077 -54697
13306 -54697 49312 58058 -9934 -31843 -23290 160176 105704 28768 -23603 -117113 -67346 -17405
13294 -17405 79966 81719 39207 -9225 -86445 -159451 -67887 -46298 -1912 45115 79378 120846
13282 120846 101610 32483 67904 93069 -6075 15315 47656 36625 37461 -43802 -60181 -21659
13270 -21659 101343 100377 13500 67129 105601 172815 179031 113269 23754 -24309 -50220 -124181
13258 -124181 -171502 -88766 -29514 -112138 -217600 -121015 -111859 -58514 39878 66576 14279
13247 14279 -37557 64470 217008 149234 109633 67328 30910 19057 25333 85030 204362
13236 204362 200206 190561 277735 188069 43110 11477 -74248 79372 83690 41092 151112
13225 151112 191561 262924 326430 180574 79050 -50156 -97394 -34116 93386 189951 110007
13214 110007 53218 151965 106473 10581 -63206 3516 62459 105319 75365 68180 80380 88598
13202 88598 109889 26114 -53436 36555 175573 220342 165167 64925 -28394 -19429 4321
13191 4321 -18802 23719 -16669 2021 30808 121635 204797 109345 71390 189633 308250
13180 308250 199706 80986 45739 -38887 -45358 -106412 -63219 -8220 -928 -167528 -294567
13169 -294567 -249923 -141405 -63512 -39728 -30665 44568 67916 57483 53206 -65532 -160226
13158 -160226 -223156 -228057 -187719 -152538 -123528 40810 244236 131292 22320 -37685 -62172
13147 -62172 -145402 -71536 75186 56559 21872 90195 76240 63684 70071 18506 -48341 -113622
13135 -113622 -97186 -97157 -49792 -85552 -58372 -19828 -65241 -130915 -104853 -104753 -74724 -13388
13123 -13388 60484 35591 27372 -119587 -189023 -148237 -79739 -214976 -185025 -16564 96571
13112 96571 172834 58873 -146794 -235251 -192405 -131978 -8790 -42884 -154886 -133174 -88485
13101 -88485 -208576 -287548 -288879 -171960 -99285 -20545 -37737 -82560 16913 109732 209892
13090 209892 279669 264095 159333 194258 243561 197427 122251 87712 -33052 24054 58726
13079 58726 56878 74786 74699 78375 56850 91129 -8956 -169541 -74297 -25371 -26357 31826 -6379
13066 -6379 -67613 -55792 22152 -1354 -7730 -11053 -76662 -60416 -58245 -40730 117743 79546
13054 79546 -784 13449 -12109 -71610 -128702 -64931 -22834 121670 20455 -181973 -292135
13043 -292135 -223088 -233308 -168986 -148128 -12575 -4341 50872 103076 -17754 25742 156594
13032 156594 190167 230990 189468 52377 56126 -21293 -99385 -127301 -108999 -115315 -113956 -46539
13020 -46539 -13170 5894 24543 160403 248104 247510 242175 290656 152652 9005 -12632 38212
13008 38212 20690 -408 -73410 -103502 -29507 10371 -2570 49047 132915 108805 23847 13862
12996 13862 82654 1779 -46496 58796 140991 142337 156760 64818 -95003 -110752 -163332
12985 -163332 -165681 -180429 -185609 -269032 -304123 -182046 -40954 -77179 -136634 -145370 -28316
12974 -28316 116274 105184 51971 78404 183040 188615 117651 130526 63445 92381 111448
12963 111448 129001 135127 107560 111841 105101 33603 -45394 11747 144385 119581 78879 95849
12951 95849 215582 204577 122008 -10303 -50398 -22220 -22369 -70386 -88793 -35913 -267 -14723
12939 -14723 -70508 31742 64450 39597 119820 59563 33570 24181 13210 -9865 -70208 77505
12927 77505 112269 158234 136267 -2867 -41157 -96783 -138158 -43748 40570 -40441 1457
12916 1457 -81027 -46030 -12462 -32805 -41894 -99363 -186951 -207066 -202942 -238252 -138796 -104069
12904 -104069 -38203 -59119 -80567 -81146 -107420 -43702 -3093 76265 64152 -26698 -126224 -75267
12892 -75267 58559 117900 53940 -74444 -95300 -100706 -62873 -56122 -10449 18181 -37171 -192128
12880 -192128 -103646 48981 -63576 -161660 -146110 -75483 -7612 30436 -80079 -68535 -19380
12869 -19380 -16613 -70872 -41635 2025 7228 -25325 28235 64130 56066 131536 91819 75323
12857 75323 177022 237217 207078 159636 203936 132707 20055 -61323 -88411 23635 71907
12846 71907 96966 162516 105396 30514 68090 129740 73693 39835 -69659 -93836 -97142 -41118
12834 -41118 -100117 -170601 -10531 22776 -40070 11057 161964 98701 -24733 -160894 -127326
12823 -127326 -85047 53087 81085 77997 48560 94803 21582 -128934 -191335 -177852 -119121
12812 -119121 -97674 -75331 21002 36094 30236 -66018 -76196 58297 77688 119472 61728
12801 61728 15640 82353 241617 341632 357208 364631 313461 151688 65612 -65574 -113902
12790 -113902 -38868 23113 38301 -26185 66204 167013 112069 81784 100182 143080 26555
12779 26555 30498 69407 -1874 -62102 10486 -1414 -66876 -95982 10408 -15747 -61410 -124323
12767 -124323 -80150 -56704 -40471 5554 28646 -110993 -161541 -77246 6686 61727 23585
12756 23585 -44072 -42212 42545 2117 -112709 -35390 -19579 -110951 -52307 9001 19642 -80913
12744 -80913 -63779 -2733 -51051 -94741 26199 41066 2728 40931 124059 149772 123882
12733 123882 96614 154743 135314 30474 6530 38748 -19527 -27812 -891 -36860 -154010
12722 -154010 -183748 -117152 50832 185217 110344 193952 310751 215008 84581 83189 260871
12711 260871 260176 202089 129035 42175 49711 67015 79424 -1481 -66457 -181370 -198762 -40517
12699 -40517 -8021 -86676 -206422 -100249 74022 15206 -92832 -87152 16807 36584 50058
12688 50058 139408 181172 96782 39370 -78196 -150667 -95579 -54020 -30015 -239244 -342644
12677 -342644 -223856 -90152 -105622 -167474 -112416 -99723 -204308 -148666 -100054 -150457 -49381
12666 -49381 -85935 -107877 -27465 84263 152828 39886 -15692 -29305 16788 53201 -63072
12655 -63072 -2824 174475 155579 -15080 -7712 45496 -46686 -68215 68098 159349 166128
12644 166128 147840 103786 -7282 46007 -34636 -86535 -87486 -116996 -143666 -110933 11226
12633 11226 142084 136062 61365 -480 -51037 -100042 -19895 33460 39646 53262 49243 20312
12621 20312 37266 164337 85430 5039 -37737 13763 12858 83857 49089 38673 109784 133857
12609 133857 76212 89171 26137 20550 -55351 -118246 -108984 21597 237640 293763 215366
12598 215366 122811 -14103 -14218 -82496 -59704 -74258 -183380 -200640 -167292 -75773 -81814 -113350
12586 -113350 -108544 -5965 32101 46254 3755 -19480 34365 -87794 -193583 -179394 -561
12575 -561 -40262 -44681 -56287 -813 62075 181966 182313 66609 24782 24656 26545 53204 22147
12562 22147 -41929 -58243 33407 -8062 -28521 27408 42447 54605 116395 142991 36295
12551 36295 -24404 15520 -29682 -56611 -51642 -46918 -145328 -211611 -162336 -149948 -200520 -250333
12539 -250333 -104405 -4365 -37083 -15425 -72601 -39909 8957 -42047 -102844 -76606 -177809
12528 -177809 -201856 -72343 8541 -104058 -94277 -148656 -46816 53058 -67263 -179694 -160859
12517 -160859 -156119 -147316 -50409 32340 -20494 -70165 49191 -8820 -4504 6130 -8773 -3855
12505 -3855 -47947 -34975 -62415 -15743 79989 181013 252045 306448 231076 53954 -62627
12494 -62627 -112725 -13873 99275 106534 107580 86258 -83287 -144674 2217 46030 84713
12483 84713 220754 249820 132529 1887 -20186 -35116 -80644 -61425 132993 147924 94796
12472 94796 24990 12531 -27434 -35013 33324 38871 75656 -30390 -25317 29476 9710 -80218
12460 -80218 -102010 -52796 -33975 -22681 -56958 -161066 -207655 -161873 -147721 -81131 -22938
12449 -22938 154598 295452 234886 13714 -23208 54008 50594 197210 240652 248482 173380
12438 173380 -50 -22202 -69475 -11509 12745 -11078 -65453 -101297 -1576 -11889 49657
12427 49657 -15604 99942 94984 -15479 -121048 -105973 -20212 37216 99282 159022 140413
12416 140413 54273 3404 -77009 -46991 -30240 -4709 -98786 -142503 -126944 -89975 -45600
12405 -45600 -118304 -65849 -35247 -12124 -23800 56128 154573 141912 57291 148649 159953 12118
12393 12118 -1580 25881 92363 132768 64186 97077 172122 102020 -23708 -17429 -859 -57849
12381 -57849 -26112 56013 8324 -47390 -7883 57223 43850 81740 78492 2920 -65558 12906
12369 12906 49279 -20185 -61353 -39120 -6063 80775 147206 187717 202520 235499 266716 243279
12357 243279 133149 -111583 -123480 -168116 -129564 -46042 6358 1304 -36244 -9848 -36255
12346 -36255 10576 14001 -1704 43591 -2818 -40733 -69901 -101219 -84920 -24773 -77541 -88661
12334 -88661 -153260 -264562 -263159 -140015 -159240 -115794 -140745 -153144 -124185 -274849 -277454
12323 -277454 -232142 -243734 -178693 -23153 88315 74878 21716 -119823 -159992 -15996 26468
12312 26468 25538 71124 49510 -127133 -157440 -99379 50013 59154 45593 54869 61696 37826
12300 37826 -1287 19334 68562 67946 -11083 -18276 -2720 32053 186325 162760 11736 -103003
12288 -103003 -18763 49396 -9029 -171918 -207902 -271731 -180284 -85012 -1457 -2157 -36671 -54728
12276 -54728 -126543 -51798 26819 42270 59675 98975 48437 -7442 121211 126726 49633 53070
12264 53070 40629 -77010 -56690 60341 87584 128135 140363 127988 -57517 1479 13934
12253 13934 -156157 -199784 -101205 -24493 114841 185162 187989 100181 -19809 -93149 -48653
12242 -48653 -73394 -132883 -89723 -32603 -47656 -85600 -103468 33411 -52060 -108447 -108830 -42984
12230 -42984 57793 109230 212579 93514 3979 -88601 -128687 -91204 1002 34870 35105
12219 35105 43111 4957 -78301 -196099 -203337 -204102 -173292 -189378 -37967 74255 193267 220675
12207 220675 176105 113519 96041 157645 180307 98065 15294 21946 83742 82741 29485 91166
12195 91166 89449 48428 -7523 -17619 380 -60802 -160176 -141509 -172583 -143204 -87459 -69897
12183 -69897 -20786 -60285 -115610 -39479 -81881 -11217 21884 69166 -55054 -169580 -29063
12172 -29063 69558 51938 -48946 -133049 -198890 -145098 62642 106745 171209 36797 7469
12161 7469 117798 72804 -55939 -57831 -54953 -28927 -118773 -241621 -147218 -18039 142037
12150 142037 144219 8428 -89905 53264 175023 109274 19192 -86255 -9536 40970 125949
12139 125949 51298 -96675 -47661 -54350 40439 107238 171916 230384 256953 236927 186816
12128 186816 182977 203879 206011 136577 218157 110943 -29758 -54887 -119283 -120239 30816 185462
12116 185462 216550 234938 150727 -16816 -46115 100865 75234 25548 -37418 -23247 118323
12105 118323 145558 133757 97371 105638 52029 37422 107837 102211 -3825 -45510 -117556 -161130
12093 -161130 -138806 -106381 -167889 -173033 -201449 -203277 -267156 -148715 -61108 -84567 -75608 -13463
12081 -13463 -117048 -88705 -192598 -119304 35497 60507 4711 34224 138969 82314 -156162
12070 -156162 -152047 -80145 78706 198149 93081 152502 170067 104684 35809 -86103 -97493
12059 -97493 -69511 -76688 -61753 -97864 -116773 -95226 -129895 -82910 -42969 -51465 100131 54953
12047 54953 -10693 93551 101166 124322 47407 28643 28462 101379 124665 124294 153842 200735
12035 200735 145161 69049 76301 8081 -82179 -109016 -100999 -152303 -200468 -100285 33680
12024 33680 67235 33123 14351 -19964 -33712 -83161 -201003 -211679 -127716 -80688 -48944
12013 -48944 5412 48054 -29364 -154224 -91835 16565 -35706 -106336 -83802 -85396 19626
12002 19626 75390 136176 -16224 -149106 -186981 -149663 -47271 34010 6889 -111092 -163413
11991 -163413 -124205 -21565 76777 37739 -9670 -94595 -159842 -168937 -114483 -142846 -41314
11980 -41314 -59271 -160645 -171973 -89435 30755 47660 -84078 -78839 -86208 -90406 -19217 98206
11968 98206 54324 -52964 -86511 -188268 -115309 -101458 -157954 -127240 -18601 -32082 -53212
11957 -53212 -33952 88259 82811 -14259 -12765 -58855 -65179 -9565 9090 -37401 -138832 -71228
11945 -71228 1337 39374 27574 43193 69404 103937 125523 166108 141340 76260 16471 -1739
11933 -1739 67236 120207 32748 -78999 -89739 -60854 8994 74947 102649 47077 65409 155270
11921 155270 40657 -99359 40487 211230 158191 -22330 -16723 33729 69269 130755 77516
11910 77516 57795 78522 160881 22223 -29477 -29776 -16142 1057 -65115 -16531 5215 -9129
11898 -9129 63304 165143 293477 301614 84141 -75712 -74661 7553 56798 -3215 1952 146141
11886 146141 157109 109237 -29720 -84663 -88401 -57805 30276 107908 140494 43996 53532 42319
11874 42319 218634 221934 198954 245057 247715 141097 159401 141108 144255 138278 86932 63410
11862 63410 82679 7472 -75823 -87884 -104034 -74580 -115222 -191987 -178428 -160856 -201750 -127268
11850 -127268 -196248 -191763 -130008 -79721 -28794 -71653 -127252 -53664 81377 -38655 -58415
11839 -58415 -99820 -235015 -215194 -173008 -64196 -56669 -119329 -68397 43542 164855 203011
11828 203011 142683 101779 182102 292158 384957 198883 22780 -77531 -118870 -156567 -139175
11817 -139175 -77351 -34010 -25044 -13149 -31509 47323 131604 42844 -338 -3453 -107157 -48973
11805 -48973 -43138 42038 189639 221573 197533 219836 181643 62045 -132778 -160554 -23386
11794 -23386 70620 219342 262552 218570 206350 81108 123488 167745 180530 131471 -28595
11783 -28595 -142412 -107312 43116 46093 15225 -70530 -39170 67717 71586 -4440 -7522 -8575
11771 -8575 643 67149 127824 70070 124058 119917 30667 24301 -26845 -58641 -66855 -113104 -19049
11758 -19049 2659 31340 180756 172392 95288 107530 108472 88386 23752 7981 55577 83644
11746 83644 218765 225878 70500 -60849 -124991 -148307 -106650 -17091 85673 226383 234751
11735 234751 150026 40901 76098 74928 43646 46250 3228 -90892 -208679 -133740 -46462
11724 -46462 75599 104574 9065 -38167 -61296 46416 192475 93194 -134901 -93214 -2878
11713 -2878 -7297 -47113 -57553 -74369 -29259 -12854 -75630 -97823 75683 10523 -45844 -69007
11701 -69007 -35646 53845 69949 -41622 -27567 -38675 368 39114 19391 48867 114593
11690 114593 78668 1642 -20058 110686 287587 251405 113496 43020 -80244 -47042 -135252
11679 -135252 -59230 106821 80146 151457 121561 41382 6522 28179 163560 148423 7506
11668 7506 -28195 -106807 -95573 -91827 -32390 -39068 -110035 -50752 -9274 -22795 -30884 25093
11656 25093 -20269 -115235 -73239 7321 -68275 -132908 -139555 -86851 -90220 -179177 -234814 -141723
11644 -141723 -100719 -106975 -43352 27341 -141697 -46452 54240 64750 19056 19496 23246 40506
11632 40506 9275 -31281 -71378 -98006 -152682 -61297 -110771 -151186 -230078 -211070 -146339 -80203
11620 -80203 -47957 -23408 8673 13070 21419 -47992 -81216 43194 -704 -46253 -66281 -142329
11608 -142329 -38988 57019 62182 80788 175767 49402 45567 225026 259633 106598 152909
11597 152909 147320 101823 141676 128543 -39939 -72222 -51003 -84645 -124622 -183344 -74217
11586 -74217 -5512 -37709 43182 -59180 -115543 -103357 -88845 -100335 -115825 -122860 -272386
11575 -272386 -210978 -94390 -19517 78234 62162 111764 68846 -41170 3966 99702 52942
11564 52942 93275 82267 77876 65279 -39787 -236130 -166031 -69709 -18794 -25977 -51129 -53840
11552 -53840 -881 -18610 30842 69866 -43327 -53221 -68154 -86637 -74567 -94469 -143262 -178453
11540 -178453 -80893 116 97588 145645 182536 181913 146095 170303 62092 51240 51589 36042
11528 36042 75082 57447 63235 -82662 -160061 -141364 -117756 -96566 -108384 -67208 -64354 -187832
11516 -187832 -131108 60684 22118 -18845 64993 115039 40051 54951 -102448 -122656 -179386
11505 -179386 -327934 -395623 -289766 -180974 -77930 -84013 -16462 80948 63741 -67536 -128439
11494 -128439 -80705 -70371 23088 32308 -34332 -56964 -116388 -167737 -102404 -90420 -37072 -7137
11482 -7137 50631 -43406 -24320 56651 80202 65796 -45092 -163127 -125106 -145340 -114208
11471 -114208 -68748 -49796 -163574 -161555 48070 31348 5773 -80558 -978 125623 155691
11460 155691 -17698 -167525 -23421 -5651 -50563 -37042 52686 63438 65577 170873 109536
11449 109536 42703 -14304 5259 -38928 -62458 51675 30171 16365 -8338 -105265 -70633
11438 -70633 -36195 -145976 -145147 -45980 2241 -2603 -101103 -183647 -132180 -4970 7349 21150
11426 21150 43968 -26216 -51015 58110 87744 -11455 -82004 -47717 109133 107925 -77920
11415 -77920 -222859 -150538 -159197 -99389 -131742 -158386 -172619 -182134 -153777 -162961 -76486 -33356
11403 -33356 -149396 -105921 -113521 -94169 -91948 -127656 -75748 38118 34035 61455 130690 223690
11391 223690 174779 74027 -109582 -100807 -77608 -120876 -103706 -120535 -163086 -144308 -107191
11380 -107191 -67070 38297 181473 164648 187612 182747 148163 40749 -82305 -52626 52607
11369 52607 58916 8509 17572 -38874 -31385 -7814 -59296 -42260 31995 98220 77400 4389
11357 4389 -3598 -27625 -70677 -146560 -87366 -33233 -114424 -143990 -42219 7416 -88777 -155720
11345 -155720 -95110 -53203 3282 189343 254692 243573 213150 256786 228673 128419 46052
11334 46052 -11704 -91068 -34253 -35169 -159093 -181942 -255394 -166328 -62133 65638 85663
11323 85663 -85279 -239350 -236362 -140607 -77540 -198591 -296877 -279635 -357432 -357469 -231595 -171530
11311 -171530 -38971 -74578 -180094 -103852 26325 142578 169256 83803 -8043 -44278 -41759
11300 -41759 -13752 -101208 -202107 -232336 -168312 -217664 -301295 -202421 -200344 -207086 -96327 -22110
11288 -22110 -134510 -54536 -137961 -188985 -77067 -16034 59186 125362 178062 120296 13559
11277 13559 35331 -66123 -89613 -43941 -43110 -116649 -70384 -73575 -28455 11869 29772 107945
11265 107945 91642 -21197 48482 91208 -81789 -167267 -232912 -171631 -41768 -6824 -1978
11254 -1978 -24261 -103012 -77531 -18195 -58678 -6899 -95641 -196580 -132901 -84234 -215558
11243 -215558 -267461 -152452 -87509 -94407 9825 83459 75638 49802 55854 2831 -28416 -93319
11231 -93319 -19034 93883 75834 57291 -84204 -63014 -77446 -110345 67066 63012 -33096
11220 -33096 -99554 -195175 -184653 -159971 -212201 -115212 -52423 -37014 -106772 -54518 109138
11209 109138 124044 126404 79697 -32891 -120796 -106912 -182298 -321782 -216619 -143599 -63825
11198 -63825 -72204 -42047 -25352 -79315 -11418 157290 281168 183275 106955 88100 183582
11187 183582 252443 197847 166523 127238 -22810 -8004 76364 -7135 -44939 -21832 -92110
11176 -92110 -127197 -95195 -18649 -48220 -109468 -21229 31845 -31551 -83773 -101795 -23164 3655
11164 3655 -151303 -200207 -25259 -7731 54598 102147 171084 130792 14359 106659 240611
11153 240611 150461 15760 -58388 -102809 -185817 -92620 -83192 -87609 27839 51605 104108
11142 104108 157702 134516 49408 -73283 -84991 -32203 -30428 -60694 -170599 -235312 -111822
11131 -111822 -141221 -194865 -113002 -31825 43022 76723 141322 -36291 -197003 -166862 -194224
11120 -194224 -198474 -174521 -211255 -194084 -39263 192683 182646 68256 104196 -44792 -227564
11109 -227564 -241431 -289182 -247813 -127502 69550 61614 15659 -948 48105 -11553 54666
11098 54666 85703 37432 7279 -14270 -2721 -72951 -130897 -94505 -39848 -102153 -251813
11087 -251813 -218309 -83384 -21707 86974 223037 164913 100077 131148 16629 -152403
11077 -152403 -124186 -102637 -37970 5914 40525 -17083 -140246 -230272 -181586 -140313 -77682
11066 -77682 -37988 7472 64244 81304 81095 79263 40927 -13698 3296 -29200 -97149 -85520
11054 -85520 -43178 48509 -6411 -43930 -69804 -33697 -109744 -82101 -125376 -70923 281 34131
11042 34131 -1173 -31821 -56883 -62432 -135685 -177070 -97462 -122573 -156433 -82214 -19706 -36670
11030 -36670 -14483 32652 78892 -13442 -263577 -144825 109852 -33598 -160872 -133815 -60593
11019 -60593 -122892 -184151 -210869 -181496 -160155 -56151 -50654 -38263 -42829 53937 254638 186324
11007 186324 63113 74957 129158 131259 166355 88934 -52675 -65244 32306 102857 54816
10996 54816 9496 -124311 -128349 -151649 -145054 -140928 -208913 -272158 -240116 -167871 -152233 -114931
10984 -114931 -53444 -41391 -17440 -84867 -121895 -119243 -158032 -151100 -198215 -99203 -6800 30381
10972 30381 8855 37289 19911 -38465 -134107 -98432 14149 9282 52107 101173 166339 160838
10960 160838 71545 16004 64478 -20848 -37298 96981 151699 244844 204759 21132 -81068
10949 -81068 -96640 -130442 30991 52964 -109084 -81497 -25676 -23104 90716 159456 96578
10938 96578 -10958 -27709 -54037 -88638 -180307 -201169 -54242 -40825 -12307 54598 -64364
10927 -64364 -53014 40058 124290 129770 31895 52093 8917 -7424 -2642 -91032 -109651 -166416
10915 -166416 -218274 -153610 -58724 -30300 -112408 -281076 -336629 -262014 -195344 -95387 39408
10904 39408 72424 126580 -13796 -64076 -76710 -33328 35002 -26077 -199523 -135851 -41470
10893 -41470 -116912 -153434 -163962 -119534 -52290 30417 28157 -41 -48167 -89057 -42119 -128397
10881 -128397 -139324 -196749 -153435 -163512 -209929 -141976 -99711 -121335 18324 151313 252621
10870 252621 276108 238253 185262 130379 14001 -15858 14797 47792 -1381 -53104 -57599
10859 -57599 27496 97395 -9235 -65145 20838 50426 -29170 3939 -64048 -158745 -158655 -111749
10847 -111749 -84242 -80240 -65252 7601 29393 -106009 -148120 -164624 -172358 -116937 -65547 -31407
10835 -31407 -27662 -52350 -1415 75462 61914 -48633 27059 23178 -25630 96757 161256 54120
10823 54120 -97615 -108002 -106440 -165566 -46739 79806 64262 -69043 -155451 -137172 -121012
10812 -121012 -11999 52590 -117501 -269491 -195708 -103340 -66715 103432 226006 210412
10802 210412 139076 -5556 -110199 -65686 36750 78435 40663 -1559 -40553 -1192 97825
10791 97825 184233 223954 182877 141082 123716 93851 90683 28297 12846 -9754 -105774 -119693
10779 -119693 -159949 -96227 -66976 -73823 -113175 -132543 -136412 -135709 -28033 6851 104432 158880
10767 158880 101285 82581 -77126 -101172 -32224 96383 138040 184330 155376 57081 -152323
10756 -152323 -186808 -106880 -37489 -49330 56737 -2357 -260989 -179872 -98503 -84660 -74661
10745 -74661 -73533 15875 -33298 -131607 -157815 16389 61272 -51513 -79802 -183364 -263737
10734 -263737 -308697 -257999 -205130 -93992 -145926 -112999 -168326 -158437 -121954 -66313 -24388
10723 -24388 40000 148942 102001 -9066 5308 -29371 -122436 -108795 -137737 -46998 -73474
10712 -73474 -10998 -36503 -115506 -36391 -844 13317 12015 23945 20236 30385 68615 99085
10700 99085 -70412 -98471 -41232 -52645 -98105 -78299 -39951 -50715 58749 -27512 -228912
10689 -228912 -253321 -174475 -66260 -95262 -137007 -229466 -263092 -243846 -211947 -136241 -78132
10678 -78132 10240 131063 124773 151300 18799 -152786 -164997 -34106 52074 -48790 -111404
10667 -111404 13467 45396 -59620 -106849 -60463 -31793 2190 103478 86445 17297 -117964
10656 -117964 -156749 -119721 -49823 -21570 -78500 -131728 -70533 906 62007 -24354 -82138
10645 -82138 -67992 49522 96594 94122 150613 121457 21421 -94714 -106880 -55308 -25482
10634 -25482 -50376 -53117 -48478 34129 -21378 54428 152343 122005 83578 -41685 -63361 -58136
10622 -58136 18356 34224 -49556 -106925 -130908 -100670 -109244 -111426 -59480 -44393 -137635 -45090
10610 -45090 53366 111962 224224 187661 40951 -46121 30010 44995 84722 23839 -24425
10599 -24425 95108 155376 135411 164093 107496 28250 -26474 -112984 -45834 83269 40876
10588 40876 -4427 -36632 27039 164156 187973 129384 35287 -16096 -68984 -26472 110276
10577 110276 116206 -55076 -120771 -125997 -58377 -35507 24446 -7083 -4119 7385 70269 63956
10565 63956 34320 -147348 -160426 -98552 4172 73366 10404 66061 99403 81869 -68
10554 -68 16767 -79480 -134788 -37426 -107524 -92423 -9631 -87900 -123928 -155428 -153042 -166072
10542 -166072 -334882 -299163 -201823 -923 144491 197615 226943 251196 234748 62793 -50534
10531 -50534 -114120 -92693 -166598 -178533 -148289 -18522 109479 101059 -29222 -30669 -120120
10520 -120120 -173990 -78133 -112037 -90225 2357 -35541 37354 95911 1546 -136199 -38686
10509 -38686 -65345 5986 68954 38366 4005 69389 152739 203051 182370 -69413 -190312
10498 -190312 -47307 50213 -36333 -29590 -28436 -6673 14914 25154 10535 -80916 -101486 -209158
10486 -209158 -241964 -116101 -67792 -129194 -145652 -153543 -104834 -65943 -104475 -49075 -59609
10475 -59609 -11894 -13935 -123677 -33817 9606 26666 76724 120782 28837 -57285 -32790 56443
10463 56443 45114 -100368 -65604 -13256 -132330 -16092 90900 170781 153081 106396 124391
10452 124391 45207 -161226 -169069 -77995 65904 139400 143078 153895 137355 5697 25632
10441 25632 59199 9045 -34257 73992 98944 66840 46195 -114621 -210143 -179395 -129086
10430 -129086 -49863 -42557 -15576 3926 64720 148680 67621 10379 40312 -6233 16511 -99081
10418 -99081 -122433 -159891 -76276 129962 303712 182584 148798 252171 127523 -128487
10408 -128487 -112915 -25174 -28497 -4217 -9625 -34507 16459 54120 152070 108035 -74284 -34538
10396 -34538 -54458 3986 111553 57182 -28781 -101927 -150518 -109846 -61835 -62567 -67767 -81423
10384 -81423 -58983 61799 86846 67682 42589 -19896 -60281 1749 -10969 -36869 -180751
10373 -180751 -147747 -118684 -134548 -68077 -11174 -18211 -19632 -29682 28939 168931 113334 37597
10361 37597 89654 62041 58215 94440 66080 33878 35588 -14394 -53819 42635 40880 11381
10349 11381 -46621 174209 372108 398802 431592 625853 757230 869150 977699 964459
10339 964459 955301 992052 902155 782964 554665 297121 45621 1398 68165 142184 169337
10328 169337 142192 194624 166423 166226 140868 -14714 -101160 -72620 -24111 50066 142354 151666
10316 151666 15511 -2876 127396 49465 -175762 -226977 -192594 -55834 -7684 43954 193618
10305 193618 244977 233771 118136 75702 87000 -21348 -86586 -57739 -45002 -138678 -132662
10294 -132662 -107695 -147619 -225858 -148080 -28180 14391 37168 64735 35588 -31544 -89725
10283 -89725 -40074 -58057 -96181 -43835 21849 208 -27749 18910 -9481 -6015 -35762 -15970
10271 -15970 -9824 -133526 -120095 -52257 7084 70200 102031 -1782 27683 1009 -74949
10260 -74949 -89750 -74740 18728 21323 6562 -6552 34763 106832 150214 41335 -35725 -25688
10248 -25688 -63902 75128 121310 139256 100351 113443 104808 80029 34357 89820 158051 175504
10236 175504 35576 22677 -31518 -113775 -156561 -137302 -34010 -24725 -37271 -898 -15560
10225 -15560 -90611 -50038 -15172 -149204 -34248 -49394 -183495 -149827 -49184 22200 128592
10214 128592 87205 27249 48979 104837 -7963 -148749 -148294 -32600 -96561 -70678 -48576
10203 -48576 -73871 -53642 -153886 -60094 -47383 -101494 -66231 62803 104751 60052 -122608
10192 -122608 -161182 -180486 -40335 32319 -40416 -32354 14711 -108651 -116566 -105694 11590
10181 11590 65152 3210 143034 141764 -24086 -75974 -15355 -22022 -109059 -223380 -141723
10170 -141723 -83858 -161114 -63569 -143906 -147182 -132189 -119504 -137279 -69908 -78057 -147864 -177854
10158 -177854 -207224 -60780 -7844 109099 215003 142096 -26854 -121225 -67790 30357 31000
10147 31000 34564 -4393 -44534 -7354 -64795 -160402 -52574 102148 115293 10076 -29815
10136 -29815 -87752 -204596 -133488 -6482 -24235 -5297 41889 33841 -104 82695 102444
10125 102444 137423 93940 64060 62275 10894 -118842 -121527 -157357 -66301 -22346 45062 5552
10113 5552 96735 181545 157961 159355 50809 -55698 -56193 -12219 21732 21802 -16861 1438 123202
10100 123202 196253 179971 156478 135803 123384 103349 116410 14311 -19080 -42697 -37154
10089 -37154 -68762 -98947 -187794 -96903 -56081 -20593 -66351 -75183 -34958 -23204 -98076 -84421
10077 -84421 -49903 -4888 22392 -53633 -193072 -135531 33652 104957 7028 -68881 -13812
10066 -13812 -98257 -144599 -187691 -177963 -201237 -49603 37505 119365 106477 141608 154073 45678
10054 45678 -41923 15137 162061 144113 12277 -76578 46598 88617 67222 168387 204503
10043 204503 241000 164002 177637 65907 -5010 120855 189560 224022 76011 103952 159950
10032 159950 100713 -47359 -108827 -44816 93068 117630 3935 -53365 -1073 115549 191884
10021 191884 76313 -60748 67491 97240 22434 127662 217911 175595 -25676 -145934
10011 -145934 -97937 103269 112631 131160 41836 18399 -40017 29049 89809 84376 -64888
10000 -64888 -135344 -103236 -132736 -150286 -77588 -92509 -180791 -162516 -122494 41548 62874
9989 62874 129618 132396 113026 52265 -28819 -699 -13183 -24164 -51554 -21448 -47729 -27735
9977 -27735 -46382 -50041 4046 121249 102151 69952 13797 -11749 50959 179762 224185 179770
9965 179770 70580 26617 -3191 32698 76589 107556 14770 -13523 -118519 -88702 -25429
9954 -25429 -29450 -16465 41516 91035 175216 166684 78706 78586 118975 185927 225528 184465 80359
9941 80359 695 -37496 -23183 -80413 -37877 22609 44694 -20454 19304 80893 38983 -49080
9929 -49080 -25838 -45424 -158073 -90314 -128604 -194563 -144439 -126033 -156861 -71567 21922 4017
9917 4017 -77093 -107772 -93424 -31097 -105483 -63465 -58854 -86397 -46225 14873 35245 66584
9905 66584 65740 129632 35002 -19381 40932 90468 80258 -4713 61302 21157 41097 107022
9893 107022 180199 195863 111985 -24559 -65576 -50961 137570 188846 12243 -22090 47188
9882 47188 -24145 -52799 -79877 -49059 42219 -6640 14129 43465 113875 88604 15546 -32592
9870 -32592 -12086 -32914 -122714 -103543 -28570 -45987 4172 -27027 -57736 -104977 -101377 -45908
9858 -45908 52830 17093 12410 6172 32735 165301 192590 239592 212164 176724 167570 85309
9846 85309 25259 -14692 -9921 -74261 -51043 -68528 -195088 -91340 -86974 -81541 17044 -44474
9834 -44474 -107475 -39968 -53493 -114040 -48109 -85045 -67568 -76823 -10844 261873 196765 199115
9822 199115 248542 222075 71221 -32254 -35209 86344 171658 75664 33722 -42853 -47422
9811 -47422 -57405 -8058 66315 90159 149578 154972 247735 279964 273519 181666 165385 25930
9799 25930 72915 77582 71515 20143 -44479 -17480 84091 90412 50220 49152 16042 54673
9787 54673 223424 287739 249309 154525 166570 33681 -41344 -27049 34891 32097 -58715 -64734
9775 -64734 -22336 -83313 -147022 -143816 8968 32557 -93179 -166764 -139576 -6742 25226
9764 25226 -10426 -111372 -139345 -19532 70773 122164 189406 196435 143694 125243 58638 49807
9752 49807 35371 -47437 -90131 -32728 -11914 -143308 -170365 -196210 -125154 8086 13796 -48893
9740 -48893 66585 172842 106674 34268 12685 903 107302 189723 116084 92369 151468
9729 151468 122938 116631 70855 10678 -29477 -31693 -85901 -113060 -62581 52099 59423 130383
9717 130383 154304 61877 -23903 -21215 64355 86820 -15691 10463 -44422 -40210 -56177 -180107
9705 -180107 -62697 -20347 -148242 -98598 1715 13281 -97121 -86461 -27945 -16413 37323
9694 37323 -79607 -161744 -110126 -131016 -148768 -83123 -131508 -126467 -192175 -182588 -147674 -147332
9682 -147332 -152489 -36898 -17769 -104622 -137077 -97232 -25971 978 71788 27074 121285 122832
9670 122832 60789 54359 -104191 46077 84533 35325 38509 58899 37401 -1101 36321 58566
9658 58566 58947 30432 -32093 -72639 -92557 2487 21824 4914 1586 -34753 -16161 -2995
9646 -2995 -1460 -49398 -91067 -54949 -62200 -22975 95144 250390 326363 379745 251128 103792
9634 103792 -15384 -57244 -8349 40428 -54100 -79937 -473 -56673 -33713 74699 126085
9623 126085 120792 162969 175879 172983 193137 193510 125391 33696 -145290 -134079 -93914 -78585
9611 -78585 -160873 -174139 -80351 -116906 -228984 -90843 -40373 -59127 -72492 -8860 37228
9600 37228 96158 53160 -9082 -102265 -201272 -116643 -114234 -94653 18205 -58166 -62069 -208835
9588 -208835 -213423 -173865 -54167 52427 110793 69455 34479 -68139 -107591 -47711 10342
9577 10342 58165 85508 40434 -132106 -173918 -199049 -52133 36549 80157 108297 105866 130930
9565 130930 77345 -122586 -180872 -61446 79590 136023 -32744 -93870 57911 226811
9555 226811 206699 120178 34333 -12139 44797 221611 300257 270868 271487 292493 171848 55101
9543 55101 31529 51822 -28424 20202 -17405 10374 23851 -36082 -51923 -46753 21273 59917
9531 59917 50090 32585 41980 51379 121365 74046 -47116 53129 148382 88541 -13810 164645
9519 164645 226432 249698 169189 99126 69722 90552 2272 -14299 56725 18796 -17884 7138
9507 7138 -133911 -138248 -125033 -106968 -109492 -102042 -106556 -9138 70145 -5023 -93194 -8131 25141
9494 25141 51733 65874 -31378 -16760 -30629 -23930 30529 2406 -29634 -74364 -111358 -164353
9482 -164353 -188382 -123310 -76921 -25726 -36408 -121081 -40356 42123 25579 -35029 -111564 -121870
9470 -121870 -61625 -31990 37063 189649 137223 58350 127997 119607 254460 277636 181326
9459 181326 62482 21419 142981 144308 120020 141892 36394 -96826 -66655 -12590 -2604
9448 -2604 -71905 -56022 -110577 -196450 -156965 34832 13578 66578 22365 -58048 -109431 -126098
9436 -126098 -6679 104607 146844 131712 4399 -25155 61417 -28180 -45201 -3392 -19898
9425 -19898 -68862 11592 103350 170254 69383 18337 -36921 71034 172934 116372 58682
9414 58682 8353 9468 83595 91126 157216 257799 106806 -2447 6925 -11551 14892 -40151
9402 -40151 -93968 -21949 -2279 13293 73542 158537 125998 31600 51301 81926 122407 125220
9390 125220 148989 232221 271185 68285 5065 86789 98577 20087 -46818 -58299 1725
9379 1725 87043 158839 70251 52475 69306 121427 19274 -37417 -62313 -29176 -37910 -5347
9367 -5347 -19382 6384 71814 87186 5434 -195452 -126130 -26753 -74103 -122549 -47824 75000
9355 75000 245194 254300 155735 -909 -131282 -215093 -294606 -176132 -80892 34123 28243
9344 28243 -120551 -2691 168419 92101 -6404 -124192 -59263 -4433 -73157 -62994 21475
9333 21475 74073 910 21088 71221 94584 256216 221700 272727 244198 84630 -89856
9322 -89856 -23594 58964 43710 26639 127196 199909 157373 196412 227549 202863 155409 27311
9310 27311 -38519 -107457 -99785 40423 224940 199989 67654 -67682 -137280 -14200 4221
9299 4221 5295 -6933 96295 50751 -74399 -10272 55915 -6618 19292 36907 35431 145595
9287 145595 180105 52406 -64853 -24953 65741 195734 281196 105395 11916 -35655 -77614
9276 -77614 -111533 -144456 -173132 -133940 15661 -325 -71635 -77478 -97190 -138101 -240540 -131034
9264 -131034 -40464 -72123 -44121 -65777 -20402 79242 130210 132167 77008 129968 81132 93713
9252 93713 199658 239747 169807 4048 -50723 -121251 -115222 -38578 32344 51387 89091 115467
9240 115467 -37523 -46516 1492 87659 237880 119623 77359 4548 -33145 -95378 -69967
9229 -69967 2640 55742 34082 48026 80851 106650 97947 23591 -45425 -68057 -34 104019
9217 104019 36388 48495 53894 109620 219325 272956 232154 110457 47228 86153 90465 125049
9205 125049 127083 106548 52651 6364 26789 79096 98079 133235 101208 106453 222612 255899
9193 255899 221061 227231 177060 183188 238456 232137 269577 358578 325008 214844 52052 99563
9181 99563 195283 165701 124835 154108 151755 207782 79722 -76440 94234 103501 28544 38570
9169 38570 63097 152459 184657 114970 19128 -3093 100492 159955 146139 158911 193139 226167
9157 226167 122683 76737 156249 298230 378433 405520 471964 506993 595326 605058 491329
9146 491329 445050 261871 239335 280975 405771 359107 348184 364057 381717 446605 562182
9135 562182 518350 633629 603433 557225 594942 651778 599169 523268 555335 543559 567914
9124 567914 576667 643541 795568 783849 734980 794672 1000204 1214624 1329610 1427585 1557073
9113 1557073 1715234 1920515 2291313 2597739 2735177 2894623 3157035 3655762 4255107 4816947
9103 4816947 5477180 6391347 7466933 8880293 10551762 12551178 14997908 17691240 20245267
9094 20245267 22347563 23511025 23502493 22090568 19804885 17176886 14613198 12350980 10522026
9085 10522026 8894108 7481844 6396410 5529081 4712919 4189654 3845090 3413836 3000800
9076 3000800 2553532 2296823 2151520 1869048 1672843 1603997 1613031 1486735 1346223 1324584
9066 1324584 1287562 1230251 1044930 842935 664480 627739 564068 484657 656024 735533 651146
9055 651146 575265 547447 333715 210358 273386 350101 335903 275498 256358 262543 214533
9044 214533 263061 236810 297340 324116 245633 133052 137953 48532 -38574 48343 140459 96099
9032 96099 58483 109162 109021 134530 49923 6021 111350 38555 98460 209962 269037 218877
9020 218877 145908 160236 162395 173681 87648 47014 -79748 -50301 70656 202156 219082
9009 219082 174290 182277 276149 143891 89398 78013 155740 205948 75678 94865 180664
8998 180664 88568 39731 -2626 -86114 -169779 -139945 -91672 -70214 59315 122252 188832
8987 188832 173588 120027 90925 175789 197440 151399 -25038 -25431 -19505 -56718 -74391 -30577
8975 -30577 -72612 -97214 -115649 61068 160371 186069 86558 95314 38769 85690 76103 99390
8963 99390 64782 -4760 62046 68037 41445 -16550 -59234 71513 121652 74994 -38609 53437
8951 53437 187050 178682 194458 215506 11080 -106982 -50335 -2474 38205 174427 206894
8940 206894 225095 106177 133687 367165 351118 273662 233500 211818 153729 149413 60208
8929 60208 -20711 -6142 -40708 45239 119876 218112 79611 -123971 -226362 -112171 -37000
8918 -37000 99400 138956 55421 104829 91081 25727 -50117 -172074 -115665 -28756 -119767
8907 -119767 -105369 -114573 -110739 -201457 -221325 -155370 -40263 -67021 -28723 -97887 -186185 -115912
8895 -115912 59023 -58290 -89919 -72378 -23244 -1428 -5523 -45563 42644 149375 146103
8884 146103 122860 117713 -25533 -101760 -135427 -112047 -62211 27742 119227 119028 99300 48506
8872 48506 -24941 -72824 -121419 -147771 -80156 -11858 62354 146293 191857 149562 131223 125808
8860 125808 98696 94329 90373 64578 -60713 43838 222963 172031 131172 73849 151357
8849 151357 113373 23992 -51425 -104932 -108992 -114831 -138089 -92885 -85835 -134090 -171515 -138336
8837 -138336 8589 239283 223119 106376 60307 -9387 17205 -6751 93642 10793 44418
8826 44418 91725 68361 32570 17269 -36667 21678 42322 87089 10407 -84243 -50497 -89449
8814 -89449 -180077 -131440 -136526 -172796 -138963 6058 -28952 -185765 -257396 -26216 -1836
8803 -1836 -93454 -93337 -148161 -216523 -119657 16028 28454 -5046 -10760 -74359 -6871 10971
8791 10971 17647 129744 74592 -14866 78640 120177 125607 149488 89075 23856 69770 71716
8779 71716 -77541 -111829 -69399 -61527 -113727 -161321 -343599 -422249 -340817 -189202 -109542
8768 -109542 -53797 -25894 -26402 -5163 101702 174602 123774 82487 97866 85087 102542 22985
8756 22985 -136776 -224449 -152936 -118725 -58959 -9117 52062 -6743 -48819 67136 98486
8745 98486 86863 -28654 -55138 82955 168117 104806 120384 63136 78974 9014 66994
8734 66994 117394 69003 -31898 -92109 -4657 -30123 -48296 102113 73093 107859 89991
8723 89991 174221 91118 20216 49238 19035 90198 125199 129141 120981 143162 106571 27082
8711 27082 69892 28697 141570 215380 218806 66314 127940 201984 154730 14388 13646 44236
8699 44236 -26124 31876 26051 52191 114680 33111 113905 -12711 -18316 111987 86150 -1502
8687 -1502 -117249 -109015 -42357 89474 103209 67737 139500 179266 139182 16906 -137928
8676 -137928 -141415 -67511 56569 112689 127706 92304 11734 31162 20832 52457 7690 -109793
8664 -109793 -214512 -130831 -96448 -129556 -142057 -57923 -36518 -5634 39790 99034 83601
8653 83601 142867 123696 30582 -13127 -155378 -227902 -147792 -107327 -49414 74532 28944
8642 28944 -60022 -89361 -139392 -182825 -212682 -166268 -113245 -35485 48696 27318 -77596 -42722
8630 -42722 9312 -12963 -51203 -42931 -7093 4292 -22552 -43931 -8293 43704 27534 104854
8618 104854 116822 67951 -52484 -102366 -33402 76512 135144 73832 45672 49883 -10281
8607 -10281 -14508 59582 103096 70104 33771 87402 57971 183434 268998 201209 131195 146024
8595 146024 225513 288590 117952 11430 -98555 -126021 -49664 89955 122289 113570 199239
8584 199239 161972 97801 77890 2992 -99316 -111516 -119104 -32945 -48244 13748 75618 129763
8572 129763 183704 120999 100058 67416 -37890 -160292 -125430 -109820 12541 -6339 22068
8561 22068 63128 -18092 -168753 -225069 -214050 -71089 2843 36759 63660 20232 -69076
8550 -69076 -48206 -53445 -7019 -20935 -152635 -195934 -107002 28565 -58836 -14098 -45795 -37804
8538 -37804 143496 262238 168978 62399 -720 13042 -2820 -106489 -169184 -118213 -90465
8527 -90465 21812 -15851 -56261 -30406 -62665 -24528 81643 102387 86375 114925 146363
8516 146363 67604 62173 21962 111437 165381 168721 153083 124465 -62026 -160649 -8371 24191
8504 24191 38459 135876 281138 292858 303576 143140 117331 67431 60951 44938 9413 -76496
8492 -76496 -43336 30981 78457 121062 37014 33555 40723 -39040 -56954 -49229 -61471 -19426
8480 -19426 79589 100999 139121 85738 -82037 -37568 -9731 -18846 13605 -100644 -170573 -105278
8468 -105278 -36698 25183 107882 126124 77488 -19614 -40825 47780 65132 -17514 -127598
8457 -127598 -230897 -269331 -233063 -51188 23240 76138 -5914 -55296 67784 98043 76847
8446 76847 138241 176271 174540 67653 36234 97224 -7845 -55330 -30352 -56550 -113883 -103888
8434 -103888 72438 151843 -19643 -24153 94444 177893 112587 42210 -24492 25118 -30982
8423 -30982 -28553 -32543 -21884 -25927 -126706 -49415 99308 187806 63442 120405 113612 24919
8411 24919 11933 108452 51107 -17829 -100045 -13944 117566 111328 35962 -19575 30878 7644
8399 7644 -36954 -69132 -54146 -5363 29685 -20279 -164241 -197993 -263657 -134133 53432
8388 53432 74207 -85804 -64513 -70224 -93121 -47887 11209 29161 -78945 -125414 -59487 62802
$$ [...]
##END NTUPLES=NMR SPECTRUM
##END=
