##TITLE=Analysis number 326782
Compound Code cc 56209
Book Reference 513/47/37
Project Code adrs
Chemist Name ronp
##JCAMPDX= 6.0         $$ Bruker NMR JCAMP-DX V2.0
##DATA TYPE= NMR SPECTRUM
##DATA CLASS= NTUPLES
##ORIGIN= Bruker BioSpin GmbH
##OWNER= nmr
$$ XWIN-NMR		Version 3.5
$$ Thu Feb 22 10:24:49 2007 GMT Standard Time (UT+0h)  MAYBRIDGE\nmr@NMR_250MHZ
##.OBSERVE FREQUENCY= 250.131544655141
##.OBSERVE NUCLEUS= ^1H
##.ACQUISITION MODE= SIMULTANEOUS (DQD)
##.ACQUISITION SCHEME= undefined
##.AVERAGES= 16
##.DIGITISER RES= 18
##SPECTROMETER/DATA SYSTEM= dpx250
##.PULSE SEQUENCE= zg30
##.SOLVENT NAME= CDCl3
##.SHIFT REFERENCE= (INTERNAL, CDCl3, 0, 16.4495)
##AUDIT TRAIL= $$ (NUMBER, WHEN, WHO, WHERE, WHAT)
$$ ##TITLE= Audit trail, XWIN-NMR		Version 3.5
$$ ##JCAMPDX= 5.01
$$ ##ORIGIN= Bruker BioSpin GmbH
$$ ##OWNER= nmr
$$ C:\u/data/dgb/nmr/ADRS/1480/pdata/1/auditp.txt
$$ ##AUDIT TRAIL=  $$ (NUMBER, WHEN, WHO, WHERE, WHAT)
(   1,<2007-02-22 10:24:27.47 +000>,<MAYBRIDGE\nmr>,<NMR_250MHZ>,
      <created by zg, POWCHK disabled, PULCHK disabled
       configuration hash MD5:
       49 4B E0 1D 92 C2 6B 37 9F E6 65 BC 52 41 86 1D
       data hash MD5: 64K
       92 D1 9C 5F 5B EA A9 A6 FE CB 59 92 F1 AD 29 C5>)
(   2,<2007-02-22 10:24:41.07 +000>,<MAYBRIDGE\nmr>,<NMR_250MHZ>,
      <Start of raw data processing
       ef LB = 0.3 FT_mod = 6 PKNL = 1 SI = 32K 
       data hash MD5: 32K
       47 43 03 B0 04 34 59 30 D2 03 9F F3 57 C6 A4 DC>)
(   3,<2007-02-22 10:24:42.84 +000>,<MAYBRIDGE\nmr>,<NMR_250MHZ>,
      <apk 
       data hash MD5: 32K
       F8 3C 76 1C 84 73 62 EC 2B F2 58 4C 70 00 C9 91>)
(   4,<2007-02-22 10:24:43.54 +000>,<MAYBRIDGE\nmr>,<NMR_250MHZ>,
      <abs ABSG = 5 
       data hash MD5: 32K
       6B 35 DF 48 C1 6F 90 E2 86 A4 C6 5B CF A5 E8 42>)
$$ ##END=
$$ 
$$ hash MD5
$$ 64 DF 42 68 E3 7E 24 C7 1B 01 D6 F6 11 B2 98 CA
##$RELAX= 
##$RELAX= 
##$RELAX= 
##$RELAX= 
##$RELAX= 
##$RELAX= 
##$RELAX= 
$$ Bruker specific parameters
$$ --------------------------
##$DU= <C:\u>
##$EXPNO= 1480
##$NAME= <ADRS>
##$PROCNO= 1
##$TYPE= <nmr>
##$USER= <dgb>
##$AMP= (0..31)
100 100 100 100 100 100 100 100 100 100 100 100 100 100 100 100 100 100 
100 100 100 100 100 100 100 100 100 100 100 100 100 100 
##$AQSEQ= 0
##$AQ_mod= 3
##$AUNM= <au_zg>
##$AUTOPOS= <56 >
##$BF1= 250.13
##$BF2= 250.13
##$BF3= 250.13
##$BF4= 250.13
##$BF5= 500.13
##$BF6= 500.13
##$BF7= 500.13
##$BF8= 500.13
##$BYTORDA= 1
##$CFDGTYP= 0
##$CFRGTYP= 5
##$CHEMSTR= <none>
##$CNST= (0..31)
1 1 145 1 1 1 1 1 1 1 1 1 1 1 1 1 1 1 1 1 1 1 1 1 1 1 1 1 1 1 1 1 
##$CPDPRG= <>
##$CPDPRG1= <>
##$CPDPRG2= <>
##$CPDPRG3= <>
##$CPDPRG4= <mlev>
##$CPDPRG5= <mlev>
##$CPDPRG6= <mlev>
##$CPDPRG7= <mlev>
##$CPDPRG8= <mlev>
##$CPDPRGB= <>
##$CPDPRGT= <>
##$D= (0..31)
0 1 0 0 0 0 0 0 0 0.06 0 0 0 0 0 0 0.0002 0 0 0 0 0 0 0 0 0 0 0 0 0 0 
0 
##$DATE= 1172139866
##$DBL= (0..7)
120 120 120 120 120 120 120 120 
##$DBP= (0..7)
150 150 150 150 150 150 150 150 
##$DBP07= 0
##$DBPNAM0= <>
##$DBPNAM1= <>
$$ [...]
##$SUBNAM7= <"">
##$SUBNAM8= <"">
##$SUBNAM9= <"">
##$SW= 20.6930455092707
##$SWIBOX= (0..15)
0 0 3 0 0 0 0 0 0 0 0 0 0 0 0 0 
##$SW_h= 5175.983436853
##$TD= 65536
##$TD0= 1
##$TE= 294.16
##$TE2= 300
##$TE3= 300
##$TEG= 300
##$TL= (0..7)
0 120 120 120 120 120 120 120 
##$TP= (0..7)
150 150 150 150 150 150 150 150 
##$TP07= 0
##$TPNAME0= <>
##$TPNAME1= <>
##$TPNAME2= <>
##$TPNAME3= <>
##$TPNAME4= <>
##$TPNAME5= <>
##$TPNAME6= <>
##$TPNAME7= <>
##$TPOAL= (0..7)
0.5 0.5 0.5 0.5 0.5 0.5 0.5 0.5 
##$TPOFFS= (0..7)
0 0 0 0 0 0 0 0 
##$TUNHIN= 0
##$TUNHOUT= 0
##$TUNXOUT= 0
##$USERA1= <user>
##$USERA2= <user>
##$USERA3= <user>
##$USERA4= <user>
##$USERA5= <user>
##$V9= 5
##$VALIST= <valist>
##$VCLIST= <CCCCCCCCCCCCCCC>
##$VD= 0
##$VDLIST= <DDDDDDDDDDDDDDD>
##$VPLIST= <PPPPPPPPPPPPPPP>
##$VTLIST= <TTTTTTTTTTTTTTT>
##$WBST= 1024
##$WBSW= 4
##$XGAIN= (0..3)
0 0 0 0 
##$XL= 0
##$YL= 0
##$YMAX_a= 331440
##$YMIN_a= -524653
##$ZGOPTNS= <>
##$ZL1= 120
##$ZL2= 120
##$ZL3= 120
##$ZL4= 120
##$ABSF1= 16.44946
##$ABSF2= -4.243713
##$ABSG= 5
##$ABSL= 3
##$ALPHA= 0
##$AQORDER= 0
##$ASSFAC= 0
##$ASSFACI= 0
##$ASSFACX= 0
##$ASSWID= 0
##$AUNMP= <proc_1d>
##$AZFE= 0.1
##$AZFW= 0.1
##$BCFW= 0
##$BC_mod= 0
##$BYTORDP= 0
##$COROFFS= 0
##$CY= 12.5
##$DATMOD= 1
##$DC= 0
##$DFILT= <>
##$DTYPP= 0
##$F1P= 14.0000005364418
##$F2P= -0.99999901652339
##$FCOR= 0.5
##$FTSIZE= 32768
##$FT_mod= 6
##$GAMMA= 0
##$GB= 0
##$INTBC= 1
##$INTSCL= 1
##$ISEN= 128
##$LB= 0.3
##$LEV0= 0
##$LPBIN= 0
##$MAXI= 10000
##$MC2= 0
##$MEAN= 0
##$ME_mod= 0
##$MI= 0
##$NCOEF= 0
##$NC_proc= -4
##$NLEV= 6
##$NOISF1= 0
##$NOISF2= 0
##$NSP= 0
##$NTH_PI= 0
##$NZP= 0
##$OFFSET= 16.44946
##$PC= 1
##$PHC0= 226.1625
##$PHC1= 4.453351
##$PH_mod= 1
##$PKNL= yes
##$PPARMOD= 0
##$PSCAL= 4
##$PSIGN= 0
##$REVERSE= no
##$SF= 250.130018144287
##$SI= 32768
##$SIGF1= 0
##$SIGF2= 0
##$SINO= 400
##$SIOLD= 32768
##$SREGLST= <1H.CDCl3>
##$SSB= 0
##$STSI= 32768
##$STSR= 0
##$SW_p= 5175.98343685301
##$SYMM= 0
##$S_DEV= 0
##$TDeff= 65536
##$TDoff= 0
##$TI= <Analysis number 999999
Compound Code 99
Book Reference 9
Project Code 9>
##$TILT= no
##$TM1= 0
##$TM2= 0
##$TOPLEV= 0
##$USERP1= <user>
##$USERP2= <user>
##$USERP3= <user>
##$USERP4= <user>
##$USERP5= <user>
##$WDW= 1
##$XDIM= 32768
##$YMAX_p= 434115951
##$YMIN_p= -164179
$$ End of Bruker specific parameters
$$ ---------------------------------
##NTUPLES= NMR SPECTRUM
##VAR_NAME=  FREQUENCY,     SPECTRUM/REAL,   SPECTRUM/IMAG
##SYMBOL=    X,             R,               I
##VAR_TYPE=  INDEPENDENT,   DEPENDENT,       DEPENDENT
##VAR_FORM=  AFFN,          ASDF,            ASDF
##VAR_DIM=   32768,         32768,           32768
##UNITS=     HZ,            ARBITRARY UNITS, ARBITRARY UNITS
##FACTOR=    0.157963299565203, 1,           1
##FIRST=     4114.50349712551, 0,            0
##LAST=      -1061.4799397275, 0,            0
##MIN=       -1061.4799397275, -164179,      0
##MAX=       4114.50349712551, 434115951,    0
$$ Real data points
##PAGE= N=1
##DATA TABLE= (X++(R..R)), XYDATA
$$ [...]
$$ plain form
26442 -18184 -20926 -2324 -31195 -52792 -46325 -57549 -42798 -27424 -17777 21092 37866 36458
26430 36458 17274 -17582 -18114 -21014 -40876 -46258 -50475 -11177 -2755 -8719 -20731 -10543 -1258
26417 -1258 -5305 -12726 -3331 -6187 -7905 2326 43114 75684 59131 60204 50814 54867 65275
26404 65275 46743 36815 6026 -31857 -47995 -55532 -28324 -3324 7649 40321 42635 10854
26392 10854 -20056 -28726 -72539 -40899 -27861 -25169 -18762 7332 -4548 -25950 -42471 -585
26380 -585 9206 8953 -14868 -16623 -30082 -34569 -35493 -41286 -61339 -77911 -79017 -59677 -62726 -66642
26366 -66642 -62260 -70330 -72133 -41214 -6096 26494 29726 24394 2312 -3980 10648 11930 -31963
26353 -31963 -31815 12305 -4892 4910 7749 -15256 -29587 -13469 -47957 -69562 -78831 -76693 -88048
$$ packed form
26442a8184k742J8602k8871k1597O467j1224J4751J5374R647L8869J6774j408
26430C6458j9184l4856n32k900j9862n382m217L9298Q422n964j2012J0188R285
26417a258m047p421R395k856j718J0231M0788L2570j6553J073r390M053J0408
26404F5275j8532r928l0789l7883j6138p537K7208K5000J0973L2672K314l1781
26392A0854l0910q670m3813L1640J3038K692O407K6094j1880k1402j6521M1886
26380e85R791k53k3821j755j3459m487r24n793k0053j6572j106J9340l049l916
26366f6642M382q070j803L0919L5118L2590L232n332k2082o292J4628J282m3893
26353c1963J48M4120j7197R802K839k3005j4331J6118l4488k1605r269K138j1355
$$ plain form
26340 -88048 -97506 -78031 -14728 7331 -33797 -68058 -88128 -88376 -68686 -54417 -35979 -45922
26328 -45922 -51034 -51741 -49927 -82627 -69318 -34447 22987 63319 77258 63787 43618 16158
26316 16158 14468 13561 33246 29719 40023 16441 619 31525 31292 52561 90584 71432 35059
26303 35059 21295 9713 7898 30265 11346 -23027 -43255 -42770 -40538 -7272 17406 25983 6911
26290 6911 -13606 -59241 -78137 -52498 -19901 21576 11742 -6590 -33356 -54495 -29831 -11936
26278 -11936 -15945 19038 22855 21416 41093 52179 47629 44352 38649 56231 59404 93591 61431
26265 61431 11640 -20849 -44908 -50251 -22020 691 669 -8442 -9003 11484 9399 -9345 -10868
26252 -10868 -15890 -14942 -5621 15241 37535 43812 13130 -25144 -39991 -39172 -39760 -32872 -16983 14365
$$ packed form
26340h8048r458J9475O3303K2059m1128l4261k0070k48J9690J4269J8438r943
26328d5922n112p07J814l2700J3309L4871N7434M0332J3939j3471k0169k7460
26316A6158j690r07J9685l527J0304k3582j5822L0906k33K1269L8023j9152l6373
26303C5059j3764j1582j815K2367j8919l4373k0228M85K232L3266K4678Q577j9072
26290F911k0517m5635j8896K5639L2597M1477r834j8332k6766k1139K4664J7895
26278a1936m009L4983L817j439J9677J1086m550l277n703J7582L173L4187l2160
26265F1431m9791l2489k4059n343K8231K2711k2r111n61K0487k085j8744j523
26252a0868n022R48R321K0862K2294O277l0682l8274j4847Q19n88O888J5889L1348
$$ plain form
26238 14365 17761 5785 -9901 -22535 16317 55320 8332 -20394 -11913 -1601 1696 45161
26226 45161 73166 29487 8166 24102 41244 25826 -39340 -79604 -80522 -85041 -78003 -13164
26214 -13164 -10691 -4252 -13547 -16277 -15356 -35030 -46076 -27117 7003 47067 29195 -9436 -15946
26201 -15946 11363 13119 3052 152 -17803 -16906 10498 -12757 -11721 12905 57450 66429 64495
26188 64495 26969 -5934 -31471 -590 -7737 12461 24159 76718 62176 51219 -12008 -50680
26176 -50680 -31675 -27024 -11227 19979 23039 15374 -1835 -39640 -15780 1033 -15113 -4649
26164 -4649 -242 -22849 -3455 -1698 9698 15835 803 10308 7304 -11889 -1031 -10673 -10228
26151 -10228 18385 -21236 -74016 -38190 38845 52300 34320 -33213 -65917 -49752 -47544 -8003
$$ packed form
26238A4365L396j1976j5686j2634L8852L9003m6988k8726Q481J0312L297M3465
26226D5161K8005m3679k1321J5936J7142j5418o5166m0264r18m519P038O4839
26214a3164K473O439r295k730R21j9674j1046J8959L4120M0064j7872l8631o510
26201a5946K7309J756j0067k900j7955Q97K7404k3255J036K4626M4545Q979j934
26188F4495l7526l2903k5537L0881p147K0198J1698N2559j4542j0957o3227l8672
26176e0680J9005M651J5797L1206L060p665j7209l7805K3860J6813j6146J0464
26164d649M407k2607J9394J757J1396O137j5032R505l004j9193J0858r642M45
26151a0228K8613l9621n2780L5826P7035J3455j7980o7533l2704J6165K208L9541
$$ plain form
26139 -8003 19722 6214 -6134 10774 -1310 9159 3137 1729 17189 5335 14747 -14502
26127 -14502 -59872 -82307 -78015 -36104 -20311 -7177 -17446 -239 8538 179 -23118 -15474
26115 -15474 -3996 7585 20641 12363 13133 21899 -388 -37768 16533 13272 7798 37115 4304
26102 4304 -21468 23561 29785 -8814 -32909 -27848 -28983 -22824 -9830 -6179 9688 20350 3624
26089 3624 -9953 -22230 -11458 25397 -10994 -59450 -77416 -83625 -76116 -53131 -45222 -65737
26077 -65737 -67102 -31967 -18344 -49547 -38586 -75726 -48922 -11001 -5973 12036 20659 -15274
26065 -15274 -26171 -10403 -13012 -42254 -32018 26596 35379 44488 40038 35885 -9634 -11978 -38887
26052 -38887 -28726 6173 -16938 -10765 -10630 -19193 -27002 -43047 -12602 -6403 -2406 -12214 4308
$$ packed form
26139h003K7725j3508j2348J6908j2084J0469o022j408J5460j1854R412k9249
26127a4502m5370k2435M292M1911J5793J3134j0269J7207Q777q359k3297P644
26115a5474J1478J1581J3056q278P70Q766k2287l7380N4301l261n474K9317l2811
26102D304k5772M5029O224l8599k4095N061j135O159J2994L651J5867J0662j6726
26089C624j3577j2277J0772L6855l6391m8456j7966o209P509K2985P909k0515
26077f5737j365L5135J3623l1203J0961l7140K6804L7921N028J8009Q623l5933
26065a5274j0897J5768k609k9242J0236N8614Q783R109m450m153m5519k344k6909
26052c8887J0161L4899k3111O173J35q563p809j6045L0445O199L997r808J6522
$$ plain form
26039 4308 9999 12707 8515 -15757 -16926 22203 34335 11533 -59 2741 -23082 -58224 -24350
26026 -24350 20015 30701 41438 37686 23041 17891 -16696 -45577 -43635 -14966 6692 -2557
26014 -2557 -13941 6185 19327 23049 -11062 -25586 -31358 -24059 26955 3025 -27837 -28835 7152
26001 7152 8430 17284 8614 -23658 -3066 33405 -10723 2356 4807 24543 18555 6040 4550
25988 4550 -41381 -46301 -23445 -9014 -14931 4451 -29359 -73429 -21270 15358 37703 -10935
25976 -10935 -32950 -33953 -13411 42902 83064 92378 64303 24522 -19035 -8156 8534 5262
25964 5262 5866 47151 46129 16059 -59739 -56543 -14172 -6525 10692 4254 47471 43583 27574
25951 27574 21452 64759 93106 71272 44201 59299 55909 24846 15743 24460 44566 16840
$$ packed form
26039D308N691K708m192k4272j169L9129J2132k2802j1592K800k5823l5142L3874
26026b4350M4365J0686J0737l752j4645n150l4587k8881J942K8669K1658r249
26014b557j1384K0126J3142L722l4111j4524n772P299N1014k3930l0862r98L5987
26001G152J278Q854q670l2272K0592L6471m4128J3079K451J9736n988j2515j490
25988D550m5931m920K2856J4431n917J9382l3810m4070N2159L6628K2345m8638
25976a0935k2015j003K0542N6313M0162R314k8075l9781m3557J0879J6690l272
25964E262O04M1285j022l0070p5798L196M2371P647J7217o438M3217l888j6009
25951B7574o122M3307K8347k1834k7071J5098l390l1063r103Q717K0106k7726
$$ plain form
25939 16840 -7777 -9256 5192 36796 26299 28771 33184 5981 -8479 15139 16810 1009
25927 1009 -29213 -34144 8728 28040 -8836 -40776 -59605 -8066 10523 -27342 -17459 54675
25915 54675 76599 55310 30659 18874 8178 4124 7284 42679 75431 90976 31748 -826
25903 -826 -9950 -25352 -14916 17259 13945 41161 76354 29130 -27304 -3200 15392 14353 39887
25890 39887 39802 24295 -16319 -60765 -53704 -49510 -55259 -41688 -26461 -34234 -37995 -9801 -10135 -34000
25876 -34000 5915 42761 27810 -25432 3184 29212 -1984 -21578 -11494 -19855 -50919 -43865
25864 -43865 -45108 -68985 -49738 -36530 -33836 -4347 22395 17687 29497 41520 26037 34955
25852 34955 6343 -26527 -30790 -23882 -27384 -34373 -15466 -6424 -52812 -54919 -20487 -8037 -23753
$$ packed form
25939A6840k4617j479J4448L1604j0497K472M413k7203j4460K3618J671j5801
25927A009l0222m931M2872J9312l6876l1940j8829N1539J8589l7865R883P2134
25915E4675K1924k1289k4651j1785j0696m054L160L5395L2752J5545n9228l2574
25903h26r124j5402J0436L2175l314K7216L5193m7224n6434K4104J8592j039K5534
25890C9887q5j5507m0614m4446P061M194n749J3571J5227p773l761K8194l34k3865
25876c4000L9915L6846j4951n3242K8616K6028l1196j9594J0084q361l1064P054
25864d3865j243k3877J9247J3208K694K9489K6742m708J1810J2023j5483Q918
25852C4955k8612l2870m263O908l502o989J8907R042m6388k107L4432J2450j5716
$$ plain form
25839 -23753 -2508 -9971 16852 24583 27797 27503 -2170 17650 -12898 699 7925 -11487 9415
25826 9415 14027 -8849 -14190 -1818 -23374 -45037 -2946 44168 25962 18059 24841 45560 21992
25813 21992 172 -6867 6282 37906 61746 54735 33777 15308 -16415 -21923 3438 -14738
25801 -14738 -62128 -97072 -97260 -20391 -1559 -21283 -15102 -6226 7228 27170 19139 28838 39498
25788 39498 41925 47609 68833 48700 27748 29224 17077 -10061 -12839 -5922 -9102 11525 39703
25775 39703 49068 30718 33802 -12728 -64501 -66195 -58090 -72153 -48119 -14787 -23057 -24493 -6695
25762 -6695 -26241 -2089 34709 7214 -35540 -28012 27360 24516 39741 26659 7450 7258 4279
25749 4279 9830 4272 -29058 -38208 -66373 -79617 -57189 -38199 -23137 -43156 -24868 -21768 -33435
$$ packed form
25839b3753K1245p463K6823P731L214k94k9673J9820l0548J3597P226j9412K0902
25826I415M612k2876n341J2372k1556k1663M2091M7114j8206p903O782K0719k3568
25813B1992k1820p039J3149L1624K3840p011k0958j8469l1723n508K5361j8176
25801a4738m7390l4944j88P6869J8832j9724O181Q876J3454J9942q031R699J0660
25788C9498K427N684K1224k0133k0952J476j2147k7138k778O917l180K0627K8178
25775C9703R365j8350L084m6530n1773j694Q105j4063K4034L3332q270j436J7798
25762f695j9546K4152L6798k7495m2754P528N5372k844J5225j3082j9209j92k979
25749D279N551n558l3330r150k8165j3244K2428J8990J5062k0019J8288L100j1667
$$ plain form
25736 -33435 -23218 -24652 -41734 -18888 12977 15469 -4619 -49031 -56895 -34083 -48672 -56020
25724 -56020 -16226 -13346 3211 -19177 -64196 -73434 -62013 -70342 -48140 -46484 -86711 -113181
25712 -113181 -83674 -39686 6924 -3940 4588 17623 17030 -10108 -36195 -19854 10973 17405
25700 17405 -12952 -16366 -44439 -59327 -55141 -20998 10700 3976 6930 -14934 -38128 -8154
25688 -8154 7910 18155 -7365 -28279 -4661 -5859 -1098 3818 -23593 -30763 -29118 -5209 -15381
25675 -15381 -41020 -57776 -39417 22640 63288 56595 50429 32580 -12029 -25960 -12369 18937
25663 18937 32431 34027 21897 4060 -29034 -69466 -61448 -44287 -72962 -99320 -69772 -38807
25651 -38807 21149 36692 24554 -10692 -25738 -11764 -3033 11230 29633 28771 13722 -24357
$$ packed form
25736c3435J0217j434j7082K2846L1865K492k0088m4412p864K2812j4589p348
25724e6020L9794K880J6557k2388m5019r238J1421q329K2202J656m0227k6470
25712a13181K9507M3988M6610j0864Q528J3035n93k7138k6087J6341L0827O432
25700A7405l0357l414k8073j4888M186L4143L1698o724K954k1864k3194K9974
25688h154J6064J0245k5520k0914K3618j198M761M916k7411p170J645K3909j0172
25675a5381k5639j6756J8359O2057M0648o693o166j7849m4609j3931J3591L1306
25663A8937J3494J596j2130j7837l3094m0432Q018J7161k8675k6358K9548L0965
25651c8807N9956J5543j2138l5246j5046J3974Q731J4263J8403q62j5049l8079
$$ plain form
25639 -24357 -52677 -45896 -38050 -28429 -27217 -60014 -71889 -59128 -18214 -3073 12798 -8132
25627 -8132 -24543 -38137 -10780 -4089 -40539 -34308 -32662 -67069 -84580 -73520 -33156 11881
25615 11881 20759 46959 48996 16112 -10265 -4710 -33533 -30953 -34304 -29103 -2739 -12931 -27145
25602 -27145 -25744 -8485 -9468 -8061 10704 38417 58302 18843 14283 20693 34225 77971 96638
25589 96638 67432 6951 -26835 -20217 -19623 -4327 -11058 -45599 -62307 -48887 -60974 -23292
25577 -23292 -18221 -13597 -8498 -36712 -1041 -1463 22281 23789 20260 21433 22650 26562 50606 29471
25563 29471 -19795 13063 64734 69473 68639 56357 35121 48714 46165 47403 40994 57242 51576
25550 51576 29842 24180 58387 58658 51041 30887 25663 -10859 -27996 -66549 -75934 -64286 -68924
$$ packed form
25639b4357k8320O781P846R621J212l2797j1875J2761M0914J5141J5871k0930
25627h132j6411j3594K7357O691l6450O231J646l4407j7511J1060M0364M5037
25615A1881Q878K6200K037l2884k6377N555k8823K580l351N201K6364j0192j4214
25602b7145J401J7259r83J407J8765K7713J9885l9459m560O410J3532M3746J8667
25589I6638k9206o0481l3786O618N94J5296o731l4541j6708J3420j2087L7682
25577b3292N071M624N099k8214L5671m22K3744J508l529J173J217L912K4044k1135
25563B9471m9266L2858N1671M739q34j2282k1236J3593k549J238o409J6248n666
25550E1576k1734n662L4207K71p617k0154n224l6522j7137l8553r385J1648m638
$$ plain form
25537 -68924 -70825 -64637 -32678 10493 81084 87271 32762 27614 23246 -22050 -32425 -38422 -9821
25524 -9821 -2125 -14687 -21178 5290 11614 -16280 -19235 -42094 -5414 12390 55194 76380 72428
25511 72428 75577 53615 3093 -53732 -36207 13583 26371 5875 -21916 -28529 -49910 -29390
25499 -29390 -26732 -26789 -14376 1560 13237 -5855 -57162 -41611 -43962 -69569 -53436 -44574 -13658
25486 -13658 6988 47273 29663 -20149 -6661 -30438 -4649 26703 29360 13268 23657 10904
25474 10904 -2591 -10096 -49 -42226 -56734 -15956 -29140 -1004 30389 36544 -453 -2397
25462 -2397 -24337 -53160 -48218 -42053 -43025 -14767 -19193 -18992 -17655 622 -24994 -10532 31764
25449 31764 56984 43298 28296 -15596 -56335 -65662 -9364 -328 9849 -17079 -34335 -15785
$$ packed form
25537f8924j901O188L1959M3171P0591O187n4509n148m368m5296j0375n997K8601
25524i821P696j2562o491K6468O324k7894k955k2859L6680J7804M2804K1186l952
25511G2428L149k1962n0522n6825J7525M9790J2788k0496k7791o613k1381K0520
25499b9390K658n7J2413J5936J1677j9092n1307J5551k351k5607J6133Q862L0916
25486a3658K0646M0285j7610m9812J3488k3777K5789L1352K657j6092J0389j2753
25474A0904j3495p505J0047m2177j4508M0778j3184K8136L1393O155l6997j944
25462b397k1940k8823M942O165r72K8258m426K01J337J8277k5616J4462M2296
25449C1764K5220j3686j5002m3892m0739r327N6298R036J0177k6928j7256J8550
$$ plain form
25437 -15785 19629 63840 50081 -30473 -87240 -102365 -111506 -70415 -37604 -28050 -18623 10458
25425 10458 18498 4650 -30272 -39126 -31788 -65069 -38963 -66875 -65960 -37843 -10736 -50982 -79309
25412 -79309 -62708 9304 3380 -8227 -17528 -6529 -14569 -4918 20107 24625 39104 54297 16088
25399 16088 -24608 -45891 -60573 -34694 4583 11509 5268 6592 19562 -3420 16967 18040
25387 18040 -51814 -93129 -90017 -90785 -105596 -42814 -8870 -5912 -11735 -8296 20776 34296 40147
25374 40147 29084 30041 21545 -898 1107 17956 19421 -2979 -25870 22732 43408 24517 36956
25361 36956 53620 41200 39949 90392 62940 47124 20821 -12342 -23440 -11205 10441 49691
25349 49691 86421 73075 44256 4317 26828 30459 -3796 -26183 1802 23508 18218 -5590
$$ packed form
25437a5785L5414M4211j3759q0554n6767j5125r141M1091L2811R554R427K9081
25425A0458Q040j3848l4922q854P338l3281K6106k7912R15K8117K7107m0246k8327
25412g9309J6601P2012n924j1607r301J0999q040R651K5025M518J4479J5193l8209
25399A6088m0696k1283j4682K5879L9277O926o241J324J2970k2982K0387J073
25387A8040o9854m1315L112p68j4811O2782L3944K958n823L439K9072J3520N851
25374D0147j1063R57q496k2443K005J6849J465k2400k2891M8602K0676j8891J2439
25361C6956J6664j2420j251N0443k7452j5816k6303l3163j1098J2235K1646L9250
25349D9691L6730j3346k8819l9939K2511L631l4255k2387K7985K1706n290k3808
$$ plain form
25337 -5590 -24433 -13276 16245 7721 -13355 -28675 -67080 -55812 -58368 -46236 -42525 -12462
25325 -12462 -25216 -26525 -35042 -51703 -54994 -12805 2207 -8364 -20881 15578 32202 14992
25313 14992 -29730 -39466 -6779 7504 12639 15005 29927 -5882 -9645 -7182 16194 -12801 -3446
25300 -3446 -4828 -23869 12086 10182 -18597 -5960 -20686 -43716 -49229 -55966 -75943 -46570 -16763
25287 -16763 38040 38587 34981 32055 66644 51995 37211 34271 44289 44061 4043 69 20125
25274 20125 19329 -4004 -34283 -52371 -68012 -69441 -55415 -61037 -26829 -31304 -67420 -48209 -69640
25261 -69640 -55286 -20083 12327 -13883 -24129 -2817 -1415 1281 -19414 -20272 -4171 3520 25504
25248 25504 27621 40544 42189 20116 3919 1557 -4776 28281 23382 47373 25332 27 -2942
$$ packed form
25337e590j8843J1157K9521q524k1076j5320l8405J1268k556J2132L711L0063
25325a2462j2754j309q517j6661l291M2189J5012j0571j2517L6459J6624j7210
25313A4992m4722r736L2687J4283N135K366J4922l5809l763K463K3376k8995R355
25300c446j382j9041L5955j904k8779J2637j4726k3030n513o737j9977K9373K9807
25287a6763N4803N47l606k926L4589j4649j4784k940J0018k28m0018l974K0056
25274B0125p96k3333l0279j8088j5641j429J4026n622L4208m475l6116J9211k1431
25261f9640J4354L5203L2410k6210j0246K1312J402K696k0695q58J6101P691K1984
25248B5504K117J2923J645k2073j6197k362o333L3057m899K3991k2041k5305k969
$$ plain form
25235 -2942 9612 -4246 -1581 26935 51972 38069 -4451 -17866 -1019 17452 47300 43884
25223 43884 47270 51941 39528 51743 24246 9891 -20930 -27338 -24443 -16677 9325 47534 82949
25210 82949 84053 70223 40013 26095 31250 36374 30147 6979 -22901 -23842 1297 -49683 -68310
25197 -68310 -59584 -65246 -54264 -75825 -85293 -42352 12283 41312 52205 51263 66455 62654 21182
25184 21182 16215 178 31031 64091 76750 46543 26914 20050 37843 40205 18484 -7101
25172 -7101 -14662 4715 7508 34902 44113 38072 20254 12472 10073 -16746 -5998 -49424 -45100
25159 -45100 -34037 -20726 -22952 -3744 12590 35040 24201 20392 29938 58237 76770 51009
25147 51009 35690 20231 8994 -10748 -19 28733 14941 1741 -7278 -32522 -56689 -51425
$$ packed form
25235b942J2554j3858K665K8516K5037j3903m2520j3415J6847J8471K9848l416
25223D3884L386M671j2413J2215k7497j4355l0821o408K895P766K6002L8209L5415
25210H2949J104j3830l0210j3918N155N124o227k3168k9880r41K5139n0980j8627
25197f8310Q726n662J0982k1561r468M2941N4635K9029J0893r42J5192l801m1472
25184B1182m967j6037L0853L3060J2659l0207j9629o864J7793K362k1721k5585
25172g101p561J9377K793K7394R211o041j7818p782k399k6819J0748m3426M324
25159d5100J1063J3311k226J9208J6334K2450j0839l809R546K8299J8533k5761
25147E1009j5319j5459j1237j9742J0729K8752j3792j3200r019k5244k4167N264
$$ plain form
25135 -51425 -26114 -60604 -69714 -36554 -12522 3682 -1518 23325 41510 43957 -6543 -10729
25123 -10729 -29811 -51993 -33313 -9106 -5138 -6065 -17546 14824 -1106 -21989 -10677 -23854
25111 -23854 -54126 -38517 1707 -16076 -17733 -3409 5992 9848 2047 17411 -3742 -14848
25099 -14848 -36233 -20511 13593 13470 362 -15258 -22278 -9668 -9705 -16580 -5387 -16016 9912
25086 9912 21948 1746 -22196 -64765 -43175 -34882 -42484 -48626 -49517 -32332 -13862 -3999 -24228
25073 -24228 -48483 -28605 -28115 -38405 -40283 -10278 -48312 -51762 -60634 -22558 2151 -25081 -4810
25060 -4810 4987 33531 -2866 -22683 8567 8880 50412 59042 48428 74706 33923 -29666 343
25047 343 10116 -17119 -6472 -5733 -12899 35338 70725 71166 28621 14043 19176 8127 -2578
$$ packed form
25135e1425K5311l4490r110L3160K4032J6204n200K4843J8185K447n0500m186
25123a0729j9082k2182J8680K4207L968r27j1481L2370j5930k0883J1312j3177
25111b3854l0272J5609M0224j7783j657J4324R401L856p801J5364k1153j1106
25099a4848k1385J5722L4104j23j3108j5620p020J2610l7o875J1193j0629K5928
25086I912J2036k0202k3942m2569K1590Q293p602o142q91J7185J8470R863k0229
25073b4228k4255J9878M90j0290j878L0005l8034l450q872L8076K4709k7232K0271
25060d810R797K8544l6397j9817L1250L13M1532Q630j0614K6278m0783o3589L0009
25047C43R773k7235J0647P39p166M8237L5387M41m2545j4578N133j1049j0705
$$ plain form
25034 -2578 -7403 -59602 -66560 -39545 -41590 -80345 -67472 -53410 -57324 -71112 -21031 7446 4213
25021 4213 -34332 -23675 -4270 8911 23230 25459 14408 -1228 -5740 -31469 -11524 47765
25009 47765 50453 28306 22372 2500 -5618 14705 19816 -3986 25398 39512 8926 7553 31163
24996 31163 49880 6458 -1597 -4714 -11589 1851 -21329 -20745 20029 30265 26963 -9583 -23611
24983 -23611 -23055 -24258 -80934 -100596 -125787 -110362 -51580 -22230 -25881 -42848 -26026 208
24971 208 16451 -4229 5607 15062 10540 5072 -4188 -36179 -15288 -12597 -13974 8526 10707 7902
24957 7902 5952 3563 -21337 -15440 9139 31989 34688 -24271 -76614 -69692 -74309 -48164 -13776
24944 -13776 30684 13378 -8382 -30948 -373 4692 -8726 -30466 -34939 -61457 -19825 -6948
$$ packed form
25034b578m825n2199o958K7015k045l8755J2873J4062l914j3788N0081K8477l233
25021D213l8545J0657J9405J3181J4319K229j1051j5636m512k5729J9945N9289
25009D7765K688k2147n934j9872q118K0323N111k3802K9384J4114l0586j373K3610
24996C1163J8717m3422q055l117o875J3440k3180N84M0774J0236l302l6546j4028
24983b3611N56j203n6676j9662k5191J5425N8782K9350l651j6967J6822K6234
24971B08J6243k0680R836R455m522n468r260l1991K0891K691j377K2500K181k805
24957G902j950k389k4900N897K4579K2850K699n8959n2343O922m617K6145L4388
24944a3776M4460j7306k1760k2566L0575N065j3418k1740m473k6518M1632J2877
$$ plain form
24932 -6948 -11532 77 -20253 -38166 -37326 -35004 -23673 17259 32472 37720 13860 3696 -37569
24919 -37569 -24985 530 10214 12494 3590 -33427 -42322 542 14599 -6736 -33360 -31457 -4536
24906 -4536 29758 32858 24717 6529 -30069 -47308 -51754 -58678 -36363 12178 53939 22213 -16513
24893 -16513 -16354 -38742 -14048 -630 -41780 -19844 5090 10499 23342 -5806 -43136 -56623
24881 -56623 -66886 -58974 -58238 -56854 -44647 -32269 -14270 3426 19605 14161 1241 -27295 -44272
24868 -44272 -29171 -17718 -28428 -53356 -88999 -101879 -101854 -103394 -64693 -56512 -47057 -23281 -7781
24855 -7781 -53453 -29455 -8423 -33749 -26536 14481 31055 -4670 -51109 -55791 -23879 -35136
24843 -35136 -37915 -10348 24290 15971 18186 23147 6406 -20568 -2869 -9353 -8377 34592 29074
$$ packed form
24932f948m584J1609k0330j7913Q40K322J1331M0932J5213N248k3860j0164m1265
24919c7569J2584K5515R684K280q904l7017q895M2864J4057k1335k6624J903K6921
24906d536L4294L100q141j8188l6598j7239m446o924K2315M8541M1761l1726l8726
24893a6513J59k2388K4694J3418m1150K1936K4934N409J2843k9148l7330j3487
24881e6623j0263P912P36J384J2207J2378J7999J7696J6179n444j2920k8536j6977
24868d4272J5101J1453j0710k4928l5643j2880K5j540L8701Q181R455K3776J5500
24855g781m5672K3998K1032k5326P213M1017J6574l5725m6439m682L1912j1257
24843c5136k779K7567L4638q319K215M961j6741k6974J7699o484R76M2969n518
$$ plain form
24830 29074 23297 34353 9958 2488 10730 41108 70856 43753 24572 45580 38514 6576
24818 6576 -9225 -1089 2540 -12513 -22661 2399 43829 57395 76622 34665 8888 -14984
24806 -14984 -23004 2858 22852 14863 14459 24756 36927 44213 32114 22625 -847 14394 17327
24793 17327 39684 3435 -10625 -10544 -25049 -36635 -40800 853 24353 51838 52756 57130 24938
24780 24938 11284 32533 68549 25953 -5848 9458 29099 50324 84582 94262 55168 31932
24768 31932 48531 49387 19503 15621 2955 44502 45240 19707 -713 -25956 -49509 -46648 -39336
24755 -39336 -45201 -32540 -32883 -38093 -24445 7276 35131 13056 -22643 -13394 -4293 -1631 -16830
24742 -16830 -12628 -6184 14206 36262 37477 25755 33515 55152 45782 25090 -18227 -33541 -21538
$$ packed form
24830B9074n777J1056k4395p470Q242L0378K9748k7103j9181K1008p066l1938
24818F576j5801Q136L629j5053j0148K5060M1430J3566J9227m1957k5777k3872
24806a4984q020K5862J9994p989m04J0297J2171P286j2099r489k3472J5241K933
24793A7327K2357l6249j4060Q1j4505j1586m165M1653K3500K7485R18M374l2192
24780B4938j3654K1249L6016m2596l1801J5306J9641K1225L4258R680l9094k3236
24768C1932J6599Q56k9884l882j2666M1547P38k5533k0420k5243k3553K861P312
24755c9336n865J2661l43n210J3648L1721K7855k2075l5699R249R101K662j5199
24742a6830M202O444K0390K2056J215j1722P760K1637r370k0692m3317j5314J2003
$$ plain form
24729 -21538 -24659 -32387 -36568 -41204 -30424 -19928 9205 63220 55129 41099 51845 28400 5258
24716 5258 7207 3456 20279 54123 58708 19818 -2992 3046 9280 9937 905 15802 55578
24703 55578 21386 -29451 -23491 24568 29078 5945 22077 50287 -7481 -17195 -13295 -44480
24691 -44480 -61155 -27484 -42651 -35177 -16214 259 -12431 -44096 -64378 -86855 -49413 5811
24679 5811 58469 91578 22524 10706 49531 24186 -13057 5589 49837 91632 63127 39913
24667 39913 35348 17300 23948 38037 21843 -31399 -54304 -45594 -45233 -29827 -47795 -63826 -46778
24654 -46778 -6172 -2161 -21259 -39447 -46322 -63889 -66857 -29380 -26535 -10993 -41164 -37986 8206
24641 8206 3013 4637 -38080 -20916 -2811 17931 10902 -30321 -49111 -95409 -108930 -71202
$$ packed form
24729b1538l121p728m181m636J0780J0496K9133N4015q091j4030J0746k3445k3142
24716E258J949l751J6823L3844M585l8890k2810O038O234O57r032J4897L9776
24703E5578l4192n0837N960M8059M510k3133J6132K8210n7768r714L900l1185
24691d4480j6675L3671j5167P474J8963J6473j2690l1665k0282k2477L7442N5224
24679E811N2658L3109o9054j1818L8825k5345l7243J8646M4248M1795k8505k3214
24667C9913m565j8048O648J4089j6194n3242k2905Q710L61J5406j7968j6031J7048
24654d6778M0606M011j9098j8188o875j7567k968L7477K845J5542l0171L178M6192
24641H206n193J624m2717J7164J8105K0742p029m1223j8790m6298j3521L7728
$$ plain form
24629 -71202 -50845 -22358 36034 39793 11818 -5164 9958 27902 -8017 -7151 6748 -4424
24617 -4424 -13426 -21632 -29775 -43195 -24685 -29201 -3083 13435 20912 46809 56919 72638 32600
24604 32600 37742 52641 17297 17085 35741 31524 -1930 24684 32784 25072 17946 2427 17744
24591 17744 45129 77483 97049 80309 73230 76347 60612 36403 -210 -10564 3524 11343
24579 11343 24012 11072 643 -6299 -43605 -32642 9833 23327 -18632 -17680 -11676 6068
24567 6068 9887 -9367 -6453 15429 41018 60093 33176 -3821 -18335 -12888 -15778 -471 42150
24554 42150 17517 -11740 -9204 -39522 -28253 -14400 -40744 -29774 -23275 -6578 -16121 -3532
24542 -3532 -17327 -9226 -3594 -44279 -95822 -61505 -32652 -13778 -7393 15478 8053 -8866 20049
$$ packed form
24629g1202K0357K8487N8392L759k7975j6982J5122J7944l5919Q66J3899j1172
24617d424r002q206q143j3420J8510m516K6118J6518P477K5897J0110J5719m0038
24604C2600N142J4899l5344k12J8656m217l3454K6614Q100p712p126j5519J5317
24591A7744K7385L2354J9566j6740p079L117j5735k4209l6613j0354J4088P819
24579A1343J2669j2940j0429o942l7306J0963M2475J3494m1959R52O004J7744
24567F068L819j9254K914K1882K5589J9075k6917l6997j4514N447k890J5307M2621
24554D2150k4633k9257K536l0318J1269J3853k6344J0970O499J6697r543J2589
24542c532j3795Q101N632m0685n1543L4317K8853J8874O385K2871p425j6919K8915
$$ plain form
24529 20049 61321 40346 5625 -18503 -16319 -9674 -2280 -1577 51701 61945 37188 -8831 -18415
24516 -18415 -16758 14859 32563 38791 57853 15468 29466 34098 35445 42037 4403 -39872 -29289
24503 -29289 -11535 -7584 -33229 -55773 -23548 -8226 14158 38666 33413 38850 8212 6830
24491 6830 48886 56854 23050 8137 40121 39365 35163 -5233 -24585 -22902 -60378 -94336 -102118
24478 -102118 -78551 -4752 12113 -349 -21669 -3692 -13028 -23948 -25977 -41745 -41703 -12529
24466 -12529 35191 22875 -10397 -13069 1123 -17148 -11006 -2243 -28517 8254 53077 65006
24454 65006 26622 13782 -16831 -25330 13742 8411 -22694 -11123 -13143 15062 27899 53855
24442 53855 50247 81621 91844 75624 -4246 -24785 -19305 -24991 -50581 -44648 -13080 7657
$$ packed form
24529B0049M1272k0975l4721k4128K184O645P394P03N3278J0244k4757m6019r584
24516a8415J657L1617J7704O228J9062m2385J3998M632J347O592l7634m4275J0583
24503b9289J7754L951k5645k2544L2225J5322K2384K4508n253N437l0638j382
24491F830M2056P968l3804j4913L1984p56m202m0396j9352J683l7476l3958p782
24478a02118K3567P3799J6865j2462k1320J7977r336j0920k029j5768M2K9174
24466a2529M7720j2316l3272k672J4192j8271O142Q763k6274L6771M4823J1929
24454F5006l8384j2840l0613q499L9072n331l1105J1571k020K8205J2837K5956
24442E3855l608L1374J0223j6220p9870k0539N480n686k5590N933L1568K0737
$$ plain form
24430 7657 24977 254 -56388 -66667 -35209 -42272 -55155 -33326 -7085 -19255 -27537 -22290
24418 -22290 -9160 23166 14017 19227 -476 -39045 -52345 -36709 -43253 -59533 -33785 3718
24406 3718 36224 26698 23084 48673 33832 -28101 -60481 -58102 -30011 -16831 -26958 13918
24394 13918 42484 55699 58616 73081 26576 49433 65932 71008 31768 14270 14777 42194
24382 42194 -10739 -41610 -33696 -3069 4646 2517 -10435 -33813 -31794 -17032 -25105 -2459 11404
24369 11404 -1816 -6734 -47078 -69486 -32804 -22470 -59902 -45857 -35913 -40664 -9694 -2298
24357 -2298 3332 10119 11243 -8284 -30395 -66415 -36624 23130 26725 14218 -4192 -25336 -28670
24344 -28670 8922 14730 11538 -4633 -7344 -7453 -23559 -5765 9902 -7621 -9507 -31333 -48499
$$ packed form
24430G657J7320k4723n6642j0279L1458p063j2883K1829K6241j2170q282N247
24418b2290J3130L2326r149N210j9703l8569j3300J5636o544j6280K5748L7503
24406C718L2506r526l614K5589j4841o1933l2380K379K8091J3180j0127M0876
24394A3918K8566J3215K917J4465m6505K2857J6499N076l9240j7498N07K7417
24382D2194n2933l0871P914L0627P715k129j2952k3378K019J4762q073K2646J3863
24369A1404j3220m918m0344k2408L6682J0334l7432J4045R944m751L0970P396
24357b298N630O787J124j9527k2111l6020K9791N9754L595j2507j8410k1144l334
24344b8670L7592N808l192j6171k711j09j6106J7794J5667j7523j886k1826j7166
$$ plain form
24331 -48499 -18676 -35322 -59521 -65613 -48316 -33977 -37382 -24752 -16878 -12636 -13777 -10676 -21582
24318 -21582 -24934 -18826 -28597 -52694 -26647 -6934 -3265 10310 -8159 -13257 -1248 17384 35914
24305 35914 26047 -6900 3878 21305 28810 42895 41348 70508 65754 28528 15688 4907
24293 4907 40041 47234 66612 37040 11630 -9280 -16669 -17171 -2942 2263 22020 36410 31937
24280 31937 3613 -26197 4195 32547 27156 21213 19561 12590 21031 33455 33820 3216 -25316
24267 -25316 -54842 -18647 27723 17018 -10923 -28457 -14769 -14932 10861 12418 -16500 -40013
24255 -40013 -41982 -38907 -41678 -11559 -1428 -11433 -39189 -33667 -13036 -23390 -22746 9974 -13952
24242 -13952 -49788 -56814 -30729 -8716 -21742 -32382 -77602 -111650 -102543 -99381 -67613 -11441
$$ packed form
24331d8499K9823j6646k4199o092J7297J4339l405J2630P874M242j141L101j0906
24318b1582l352O108r771k4097K6047J9713L669J3575j8469n098J2009J8632J8530
24305C5914r867l2947J0778J7427P505J4085j547K9160m754l7226j2840j0781
24293D907L5134P193J9378k9572k5410k0910p389n02J4229N205J9757J4390m473
24280C1937k8324k9810L0392K8352n391n943j652o971Q441J2424L65l0604k8532
24267b5316k9526L6195M6370j0705k7941j7534J3688j63K5793J557k8918k3513
24255d0013j969L075k771L0119J0131j0005k7756N522K0631j0354O44L2720k3926
24242a3952l5836p026K6085K2013j3026j0640m5220l4048R107L162L1768N6172
$$ plain form
24230 -11441 -12838 703 529 -28649 -23202 1992 14618 13731 5782 10631 -9317 -18471 -34716
24217 -34716 -30764 -25909 -19721 5348 21045 15747 -35833 -44236 -64080 -71211 -40073 -35396 -28814
24204 -28814 -35186 -15517 32167 20331 -30676 -6342 5691 -21663 -37579 -40947 2525 -7222
24192 -7222 37318 68341 62844 35365 25914 14683 700 12834 6723 -13852 -20803 -24302 3244
24179 3244 -21087 -44040 -39753 -5784 54886 83202 50065 13798 29088 6455 230 33254
24167 33254 41792 -1028 -35116 -47487 -38704 -26700 19829 40093 58846 52055 35068 15612
24155 15612 -23837 -21728 -25998 13690 -11356 -78 15699 -5252 27344 29768 14544 21602
24143 21602 30626 34860 26029 5100 13917 21766 25274 34880 9573 16884 48653 55798 14639
$$ packed form
24230a1441j397J3541j74k9178N447K5194J2626q87p949M849j9948r154j6245
24217c4716L952M855O188K5069J5697n298n1580q403j9844p131L1138M677O582
24204b8814o372J9669M7684j1836n1007K4334J2033k7354j5916l368M3472r747
24192g222M4540L1023n497k7479r451j1231j3983J2134o111k0575o951l499K7546
24179C244k4331k2953M287L3969O0670K8316l3137l6267J5290k2633o225L3024
24167C3254Q538m2820l4088j2371Q783J2004M6529K0264J8753o791j6987j9456
24155A5612l9449K109m270L9688k5046J1278J5777k0951L2596K424j5224P058
24143B1602R024M234q831k0929Q817P849L508R606k5307P311L1769P145m1159
$$ plain form
24130 14639 3375 -6661 -8797 -20224 38748 31389 20342 46896 78467 57341 56079 47805
24118 47805 32462 32327 45598 51364 22861 37763 29917 10755 7284 17765 11381 -10793 -28090
24105 -28090 -10989 14815 17807 29785 39031 37966 1385 30601 34536 33981 14381 11499 12584
24092 12584 1828 3280 17363 32663 9258 -7996 -8812 -35402 -76139 -77819 -58148 -38654
24080 -38654 -7246 -6577 -29016 -69565 -69878 -23661 -53769 -74205 -88807 -55373 -55228 -69918 -56938
24067 -56938 -15084 8909 13199 10025 -8626 5038 -4536 -19917 -22943 -3281 -4699 -20705 -4935
24054 -4935 24965 26136 2735 -42203 -39611 -18971 3294 -5575 -27960 -33481 -21685 -8698 -12962
24041 -12962 6360 14670 13681 54040 66024 26009 -34701 -30595 -15558 -3965 196 -25519 -12449
$$ packed form
24130A4639j1264j0036k136j1427N8972p359j1047K6554L1571k1126j262q274
24118D7805j5343j35J3271N766k8503J4902p846j9162l471J0481o384k2174j7297
24105b8090J7101K5804K992J1978R246j065l6581K9216L935n55j9600k882J085
24092A2584j0756J452J4083J5300k3405j7254q16k6590m0737j680J9671J9494
24080c8654L1408O69k2439m0549l13M6217l0108k0436j4602L3434J45j4690J2980
24067e6938M1854K3993M290l174j8651J3664r574j5381l026J9662j418j6006J5770
24054d935K9900J171k3401m4938K592K0640K2265q869k2385n521J1796J2987m264
24041a2962J9322Q310r89M0359J1984m0015o0710M106J5037J1593M161k5715J3070
$$ plain form
24028 -12449 -11464 -7966 -19443 -24962 15549 46882 58856 48343 17786 -3283 -2013 3150 8945
24015 8945 21952 27624 -673 -30364 -11231 -15662 -20134 -41413 -4654 11630 -32558 -39609 -23333
24002 -23333 -19776 -23233 17295 16721 34105 25834 23285 36963 10939 -2049 -25556 -6599 15918
23989 15918 26132 -14796 -15159 -35497 -27888 -11414 -24044 -35727 -58632 -43580 -46245 -47371 -11671
23976 -11671 253 -19206 -63886 -82183 -113276 -80743 -36323 -29912 -12714 -10208 -28259 -25185
23964 -25185 -36469 -58754 -76026 -72803 -63715 -74731 -87087 -96490 -79228 -57979 -66588 -79337
23952 -79337 -75702 -31299 -23330 -41000 -20541 16794 10231 3428 4635 -32784 -48545 -33011 2807
23939 2807 17204 32417 22445 -16069 -56718 -50155 -14597 10659 24944 30498 12731 -42662
$$ packed form
24028a2449R85L498j1477n519M0511L1333J1974j0513l0557k1069J270N163N795
24015H945J3007N672k8297k9691J9133m431m472k1279L6759J6284m4188p051J6276
24002b3333L557l457M0528n74J7384q271k549J3678k6024j2988k3507J8957K2517
23989A5918J0214m0928l63k0338P609J6474j2630j1683k2905J5052k665j126L5700
23976a1671J1924j9459m4680j8297l1093L2533M4420O411J7198K506j8051L074
23964b5185j1284k2285j7272L223R088j1016j2356r403J7262K1249q609j2749
23952g9337L635M4403P969j7670K0459L7335o563o803J207l7419j5761J5534L5818
23939B807J4397J5213r972l8514m0649O563L5558K5256J4285N554j7767n5393
$$ plain form
23927 -42662 -68884 -43447 21255 57419 26243 20346 13644 -13572 13702 9122 9128 -7278 -37170
23914 -37170 -41699 -34548 -34730 -33115 -6433 -10312 -34046 -8547 11259 18578 24941 14731 17048
23901 17048 8682 24598 15561 6111 -15895 -33296 -37014 -58935 -45321 -40273 -42384 -19966 -26991
23888 -26991 -63697 -43351 -26580 -10368 -3673 13561 10610 10023 53698 77805 85993 41674 29000
23875 29000 -7761 -30608 -31107 -25763 -122 -13273 8459 9517 12901 -24296 -58719 -24060 46001
23862 46001 51545 64236 45686 24326 34236 -7953 3142 -19342 1491 30214 46585 52897
23850 52897 37977 51534 73351 63585 45494 31057 -3952 -26376 -19133 32257 49070 27117
23838 27117 26820 69877 54735 71813 95558 69960 23100 5526 -30439 -20695 25821 15128
$$ packed form
23927d2662k6222K5437O4702L6164l1176n897o702k7216K7274m580Oj6406k9892
23914c7170m529P151j82J615K6682l879k3734K5499J9806P319O363j0210K317
23901A7048q366J5916r037r450k2006j7401l718k1921J3614N048k111K2418p025
23888b6991l6706K0346J6771J6212O695J7234k951n87M3675K4107Q188m4319j2674
23875B9000l6761k2847m99N344K5641j3151K1732J058L384l7197l4423L4659P0061
23862D6001N544J2691j8550k1360R910m2189J1095k2484K0833K8723J6371O312
23850E2897j4920J3557K1817r766j8091j4437l5009k2424P243N1390J6813k1953
23838B7117k97M3057j5142J7078K3745k5598m6860j7574l5965R744M6516j0693
$$ plain form
23826 15128 -13717 -17200 -1619 -11677 8902 60428 60320 32205 -1962 -10765 3907 43718
23814 43718 72297 43007 24719 31124 28419 50358 25695 -26020 -30688 -37755 -48996 -30509
23802 -30509 -9777 -3106 -4031 -5722 38646 13756 -2972 14067 61508 34596 -9419 -27340
23790 -27340 5584 16803 32597 26234 5847 -17671 3387 -10116 -34437 -48296 -29836 715
23778 715 273 -6114 -9184 -7708 -2517 -29398 -33006 9532 55492 53085 75280 112101 79692 62364
23764 62364 46840 14779 4697 23005 14100 10158 4552 -30726 -16919 -41626 1218 39809
23752 39809 19815 3546 -7742 22523 12256 92 9603 -27301 -7205 8073 -41177 -25690
23740 -25690 34140 56729 59280 29671 -23036 -55496 -58072 -41484 -23453 -13674 -6848 -32677
$$ packed form
23826A5128k8845l483J5581j0058K0579N1526j08k8115l4167q803J4672L9811
23814D3718K8579k9290j8288O405k705K1939k4663n1715m668p067j1241J8487
23802c0509K0732O671r25j691M4368k4890j6728J7039M7441k6912m4015j7921
23790b7340L2924J1219J5794o363k0387k3518K1058j3503k4321j3859J8460L0551
23778G15m42o387l070J476N191k6881l608M2538M5960k407K2195L6821l2409j7328
23764F2364j5524l2061j0082J8308q905l942n606l5278J3807k4707M2844L8591
23752C9809j9994j6269j1288L0265j0267j2164R511l6904K0096J5278m9250J5487
23740b5690N9830K2589K551k9609n2707l2460k576J6588J8031R779O826k5829
$$ plain form
23728 -32677 -54381 -35532 -33460 -42237 -16852 -21054 -15733 9867 12632 19604 7168 -26623 -32513
23715 -32513 -38274 -7337 15177 28442 40935 39812 48141 5380 -56962 -60351 -75351 -57787
23703 -57787 -30304 -8462 -37374 -62521 -45884 -42368 -57710 -38402 -30468 4725 6457 5817 7217
23690 7217 -688 -3705 -23866 -16323 -5388 -15333 -17644 -15489 -21158 -7195 10701 31927 34785
23677 34785 30040 -28438 -59836 -90925 -64008 -71037 -65723 -4356 1787 22535 -1886 -114 -19796
23664 -19796 -63955 -67149 -87717 -82969 -21474 30030 59150 36739 -11102 -1110 8169 -5387
23652 -5387 -10331 -16182 -42899 -35859 14324 -3089 -21999 -24615 -23864 -25114 -28884 -32086 -5585 4080
23638 4080 12481 17878 11613 -11736 -1617 25474 23890 11066 -6455 -46992 -85836 -63660 -55687
$$ packed form
23728c2677k1704J8849K072q777K5385m202N321K5600K765O972j2436l3791n890
23715c2513n761L0937K2514J3265J2493j123Q329m2761o2342l389j5000J7564
23703e7787K7483K1842k8912k5147J6637L516j5342J9308P934L5193J732o40J400
23690G217p905l017k0161P543J0935r945k311K155n669J3963J7896K1226K858
23677C4785m745n8478l1398l1089K6917p029N314O1367O143K0748k4421J772j9682
23664a9796m4159l194k0568M748O1495N1504K9120k2411m7841R992R279j3556
23652e387m944n851k6717P040N0183j7413j8910k616P51j250l770l202K6501R665
23638D080Q401N397o265k3349J0119K7091j584j2824j7521m0537l8844K2176P973
$$ plain form
23625 -55687 -48370 -16412 -94 13196 26864 -1165 19417 17576 12701 -6058 -14716 -31941
23613 -31941 -57379 -51727 -20046 -54692 -102808 -99388 -73579 -32547 -49009 -14943 -24376 -59850
23601 -59850 -36481 -8830 -48662 -69446 -25407 -10345 -6295 2392 7677 5928 21029 37850
23589 37850 45652 42447 24332 11242 -7591 -12874 16557 14959 5398 -39926 -54355 -24489 -2907
23576 -2907 20561 25891 -7274 -20311 -9841 -1876 8372 -8197 17456 19204 -21493 -67822
23564 -67822 -69301 -59088 -52600 -26108 -7061 -14044 -37129 -20819 -48471 -58992 -39795 -37453
23552 -37453 -39417 -56733 -55532 -49193 -76854 -49389 2354 36026 56868 16491 -16685 4693
23540 4693 27534 22374 30316 8634 -23143 -21639 1835 3595 -53526 -89160 -99456 -80180 -59780
$$ packed form
23625e5687P317L1958J6318J3290J3668k8029K0582j841m875j8759q658j7225
23613c1941k5438N652L1681l4646m8116L420K5809M1032j6462L4066r433l5474
23601e9850K3369K7651l9832k0784M4039J5062M050Q687N285j749J5101J6821
23589C7850P802l205j8115j3090j8833n283K9431j598r561m5324j4429K9866K1582
23576b907K3468N330l3165j3037J0470P965J0248j6569K5653J748m0697m6329
23564f7822j479J0213O488K6492J9047o983k3085J6310k7652j0521J9197K342
23552c7453j964j7316J201O339k7661K7465N1743L3672K0842m0377l3176K1378
23540D693K2841n160P942k1682l1777J504K3474J760n7121l5634j0296J9276K0400
$$ plain form
23527 -59780 -47178 -45681 -37916 -28472 -43316 -19419 -30454 -34823 -25204 -12974 8932 11839 -775
23514 -775 -22692 -28109 -53210 -46867 -37298 -37610 -14355 -18757 -23754 -6326 -41608 -35646 -15047 10446
23500 10446 28768 29070 20903 35206 56729 60361 28279 24727 54323 51211 39023 21971 40826
23487 40826 30566 18952 2024 19111 42950 47899 31621 16409 1150 -20895 -35417 6498
23475 6498 68760 54382 30927 5814 -19143 -44462 -47197 -44353 -41251 -47739 -4760 -11973 2485
23462 2485 17608 15741 29876 25937 3031 24521 24205 7671 9004 3656 -19984 -14053 5080
23449 5080 22287 -19153 -36773 -7083 6669 5717 2592 -27687 -29835 -2754 4564 -31468 -37925
23436 -37925 -1376 1426 27868 3738 -11777 -2331 -21883 -24411 -38643 -41394 -45219 -40177 -28053
$$ packed form
23527e9780J2602J497P765R444j4844K3897j1035m369R619J2230K1906K907j2614
23514g75k1917n417k5101O343R569l12K3255m402m997J7428l5282N962K0599K5493
23500A0446J8322L02q167J4303K1523L632l2082l552K9596l112j2188j7052J8855
23487D0826j0260j1614j6928J7087K3839M949j6278j5212j5259k2045j4522M1915
23475F498O2262j4378k3455k5113k4957k5319k735K844L102o488M2979p213J4458
23462B485J5123j867J4135l939k2906K1490l16j6534J333n348k3640N931J9133
23449E080J7207m1440j7620K9690J3752r52l125l0279k148K7081P318l6032o457
23436c7925L6549K802K6442k4130j5515R446j9552k528j4232k751l825N042J2124
$$ plain form
23423 -28053 -34663 -37506 -35944 -42231 -24347 -23945 -49720 -65413 -37466 -53498 -66024 -50551 -56988
23410 -56988 -23814 -818 6077 14738 30398 6676 -41116 -53500 -35509 17956 -10357 -13313
23398 -13313 -7292 -38582 -48778 -35872 -30878 -25380 -46997 -61341 -10061 -6102 5353 15151 -17256
23385 -17256 -57014 -57861 -69179 -67976 -55786 -30722 -32705 -79934 -76303 -52755 -10621 -5220 5486
23372 5486 6835 -11755 -26517 -20915 -26757 15766 10521 11504 -11518 -24447 -12257 -18018 -22496
23359 -22496 -40392 -53340 -70862 -71537 -82222 -80429 -69343 -10092 -9516 -11851 -12221 -24599 -37864
23346 -37864 -14469 13847 23478 18884 -35585 -43246 -52067 -12176 9654 -25546 -40098 -37973 -35551
23333 -35551 -26285 -15234 -20795 -20481 -38543 -59947 -43297 -27986 -8010 2593 -2409 -23173 -20778
$$ packed form
23423b8053o610k843J562o287J7884M02k5775j5693K7947j6032j2526J5473o437
23410e6988L3174K2996O895Q661J5660k3722m7792j2384J7991N3465k8313k956
23398a3313O021l1290j0196J2906M994N498k1617j4344N1280L959J1455R798l2407
23385a7256l9758q47j1318J203J2190K5064j983m7229L631K3548M2134N401J0706
23372E486J349j8590j4762N602n842M2523n245R83k3022j2929J2190n761m478
23359b2496j7896j2948j7522o75j0685J793J1086N9251N76k335l70j2378j3265
23346c7864K3395K8316R631m594n4469p661q821L9891K1830l5200j4552K125K422
23333c5551R266J1051n561L14j8062k1404J6650J5311J9976J0603n002k0764K395
$$ plain form
23320 -20778 -38422 6573 29254 33129 39965 39916 63857 69245 8216 -17129 -16931 3687 -11329
23307 -11329 -9518 -23163 -23215 1023 -11083 -53012 -71544 -118610 -114080 -69843 -62511 -44211 -40057
23294 -40057 -27528 -11617 -25107 -33162 -65762 -101906 -54941 -28052 -36197 -27903 6396 -1653
23282 -1653 -15833 -63657 -94676 -70427 -64364 -60804 -34052 -28841 -27639 -22389 -58107 -43387 -53482
23269 -53482 -43621 -26892 -42942 -35109 -9498 -354 -27285 -6772 2355 4722 14585 12698 -9988
23256 -9988 -15511 763 -36135 -75306 -39690 38461 77667 43102 4624 -8199 2966 -21988
23244 -21988 -26974 11212 15229 -2709 -4371 -8149 -12080 9139 17410 32727 37830 17053 13496
23231 13496 -3942 -22707 -25521 3536 23110 17650 -26224 -36455 -43027 -34280 6650 3272 -11223
$$ packed form
23320b0778j7644M4995K2681L875O836m9K3941N388o1029k5345J98K0618j5016
23307a1329J811j3645n2K4238j2106m1929j8532m7066M530M4237P332J8300M154
23294d0057J2529J5911j3490q055l2600l6144M6965K6889q145Q294L4299q049
23282a653j4180m7824l1019K4249O063L560K6752N211J202N250l5718J4720j0095
23269e3482R861J6729j6050P833K5611R144k6931K0513R127K367R863j887k2686
23256i988n523J6274l6898l9171L5616P8151L9206l4565l8478j2823J1165k4954
23244b1988m986L8186M017j7938j662l778l931K1219Q271J5317N103k0777l557
23231A3496j7438j8765k814K9057J9574n460m3874j0231o572Q747M0930l378j4495
$$ plain form
23218 -11223 -15280 -30297 -31119 -1276 30352 30440 -6370 -26643 -31299 -37858 -26775 23279 30319
23205 30319 14080 28141 25799 -31106 -24801 39089 70566 84661 76789 57570 17848 -13370
23193 -13370 35845 105387 117885 128899 112797 75865 55857 27922 29009 42178 62246 39555
23181 39555 54 -51681 -42039 -56414 -11158 10490 -4862 -14490 -33285 -30080 -7292 2548
23169 2548 45083 47763 41972 17805 4276 7299 7832 4308 8389 3387 17714 9974 -4959 -25577
23155 -25577 -24855 -51738 -81155 -59085 -24056 -24314 -35273 -36353 -16632 -7458 -37165 -81773 -70828
23142 -70828 -38848 -47251 -48271 -51767 -32104 13491 46334 41715 60814 63139 13877 11522 -3904
23129 -3904 -11451 1655 5894 3838 28168 2216 -9047 -1313 13248 21422 4784 -27665 -54568
$$ packed form
23218a1223m057j5017q22K9843L1628Q8l6810k0273m656o559J1083N0054P040
23205C0319j6239J4061k342n6905O305O3890L1477J4095p872j9219l9722l1218
23193a3370M9215O9542J2498J1014j6102l6932k0008k7935J087J3169K0068k2691
23181C9555l9501n1735R642j4375M5256K1648j5352r628j8795L205K2788R840
23169B548M2535K680n791k4167j3529L023N33l524M081n002J4327p740j4933k0618
23155b5577P22k6883k9417K2070L5029k58j0959j080J9721R174k9707m4608J0945
23142g0828L1980q403j020l496J9663M5595L2843m619J9099K325m9262k355j5426
23129c904p547J3106M239k056K4330k5952j1263P734J4561Q174j6638l2449k6903
$$ plain form
23116 -54568 -39600 -17645 -4045 1439 -20970 -32752 5547 7748 4916 7747 -6309 -11781 -14933
23103 -14933 22323 30990 -33437 -53589 -26698 -23296 -5037 -5812 -12087 -2490 17974 60611 69870
23090 69870 53505 79306 59748 3243 -11014 20647 28783 25542 3246 -14344 -28644 -14868
23078 -14868 -44559 -82567 -52473 20983 47933 47490 21322 -2939 1273 9752 33414 19958
23066 19958 -7753 25420 4011 -36485 21869 103215 160205 148751 92354 -12569 -65144
23055 -65144 -83903 -93322 -81203 -66143 -70315 -30215 25897 19182 -26286 -12845 29845 19118
23043 19118 562 29338 53304 71750 55026 29129 23688 26484 18443 -25806 -46862 -51034
23031 -51034 -14353 36142 27580 52827 18388 -23121 -36396 -23080 -37575 -18414 -5163 -6981
$$ packed form
23116e4568J4968K1955J3600N484k2409j1782L8299K201k832K831j4056n472l152
23103a4933L7256Q667o4427k0152K6891L402J8259p75o275R597K0464M2637R259
23090F9870j6365K5801j9558n6505j4257L1661Q136l241k2296j7590j4300J3776
23078a4868k9691l8008L0094P3456K6950m43k6168k4261M212Q479K3662j3456
23066A9958k7711L3173k1409m0496N8354Q1346N6990j1454n6397j04923n2575
23055f5144j8759r419J2119J5060m172M0100N6112o715m5468J3441M2690j0727
23043A9118j8556K8776K3966J8446j6724k5897n441K796q041m4249k1056m172
23031e1034L6681N0495q562K5247l4439m1509j3275J3316j4495J9161J3251j818
$$ plain form
23019 -6981 -8924 -1666 9215 24696 20669 -17029 13992 22303 14778 1758 50989 34795 -7685
23006 -7685 -45744 -107443 -80801 -71441 -56757 -39186 -10799 22050 17702 -4976 -25621 -16251
22994 -16251 22649 5645 -11193 -33919 -26717 -52734 -62336 -23598 9710 22648 20839 5526
22982 5526 17648 13396 335 10386 29976 17519 -949 -3326 -492 12572 20945 17266 7133
22969 7133 7232 20164 37112 3138 17904 20680 42652 63410 34392 4485 -23018 -31231 -32760
22956 -32760 -53375 -52498 -46790 -51380 -44858 -40402 18548 6180 -8778 -14964 -14336 7086 -14471
22943 -14471 -6673 -1236 30173 58371 52319 5431 -19263 983 28366 59370 40705 27879
22931 27879 23087 -25652 -25304 35810 50869 64901 55406 70735 41503 27384 11862 -24307
$$ packed form
23019f981j943P258J0881J5481m027l7698L1021Q311p525j3020M9231j6194m2480
23006g685l8059o1699K6642R360J4684J7571K8387L2849m348k2678k0645R370
22994a6251L8900j7004j6838k2726P202k6017r602L8738L3308J2938j809j5313
22982E526J2122m252j3061J0051J9590j2457j8468k377K834J3064Q373l679j0133
22969G133R9J2932J6948l3974J4766K776K1972K0758k9018k9907k7503q213j529
22956c2760k0615Q77N708m590O522M456N8950j2368j4958o186O28K1422k1557
22943a4471P798N437L1409K8198o052m6888k4694K0246K7383L1004j8665j2826
22931B7879m792m8739L48O1114J5059J4032r495J5329k9232j4119j5522l6169
$$ plain form
22919 -24307 -10958 -496 -18554 -32874 -27123 -26339 -31568 -22621 -25840 6842 42650 -8514 -52707
22906 -52707 -53885 -29191 -19408 -34023 -5350 51117 48961 48538 25509 -31017 -58537 -30619 -29017
22893 -29017 -61190 -83039 -58391 -11036 46300 45269 19317 -7923 10662 1468 -24214 -16727
22881 -16727 -45871 -36866 -8805 10024 5626 -24440 -31846 3169 25954 1021 -16356 -22250
22869 -22250 -18196 -23087 16605 24855 266 -24991 -5997 6775 1551 9231 -3132 4936 8188
22856 8188 24514 16501 -27877 -48152 -18170 -3837 -19910 -22777 18529 41607 51242 12997
22844 12997 -3499 21090 13606 24560 44831 56947 63401 42650 27178 11735 4927 -32078
22832 -32078 -65626 -61120 -62553 -40745 -28255 -71635 -53547 -67965 -38337 24831 39159 55732
$$ packed form
22919b4307J3349J0462j8058j4320N751P84n229Q947l219L2682L5808n1164m4193
22906e2707j178K4694R783j4615K8673N6467k156m23k3029n6526k7520K7918J602
22893b9017l2173k1849K4648M7355N7336j031k5952k7240J8585r194k5682P487
22881a6727k9144R005K8061J8829m398l0066p406L5015K2785k4933j7377n894
22869b2250M054m891L9692Q250k4589k5257J8994J2772n224P680j2363Q068L252
22856H188J6326q013m4378k0275K9982J4333j6073k867M1306K3078R635l8245
22844A2997j6496K4589p484J0954K0271J2116O454k0751j5472j5443o808l7005
22832c2078l3548M506j433K1808J2490m3380J8088j4418K9628O3168J4328J6573
$$ plain form
22820 55732 70339 29869 -6547 -2356 -268 -48399 -43585 -54524 -29406 -10246 -10225 8536 25261
22807 25261 11555 33460 -5648 -8498 28147 5154 -2450 22115 23546 21352 23798 25730 23169
22794 23169 45841 73933 77369 62439 3060 14618 64309 905 -26734 -2747 12512 -16233
22782 -16233 -28232 -12900 -13695 -31064 -22899 -5603 15312 38836 22321 -20418 -11103 -24072
22770 -24072 19375 50309 37670 -6875 -28941 -22137 -35387 -50599 -66009 -44182 2282 18554
22758 18554 30828 48788 63633 64041 35242 -23152 -51675 -92899 -82767 -79749 -66916 -85691
22746 -85691 -86064 -73717 -77812 -55995 -71461 -80833 -90770 -55151 -6925 -5953 25802 13438 6363
22733 6363 -11970 -37586 -67461 -53280 3061 33569 13916 -35676 -44584 -21410 -13424 -9605
$$ packed form
22820E5732J4607m0470l6416M191K088m8131M814j0939K5118J9160K1J8761J6725
22807B5261j3706K1905l9108k850L6645k2993p604K4565J431k194K446J932k561
22794B3169K2672K8092L436j4930n9379J1558M9691o3404k7639K3987J5259k8745
22782a6233j1999J5332p95j7369Q165J7296K0915K3524j6515m2739R315j2969
22770b4072M3447L0934j2639m4545k2066O804j3250j5212j5410K1827M6464J6272
22758A8554J2274J7960J4845M08k8799n8394k8523m1224J0132L018J2833j8775
22746h5691l73J2347m095K1817j5466r372r937L5619M8226R72L1755j2364p075
22733F363j8333k5616k9875J4181N6341L0508j9653m9592q908K3174P986L819
$$ plain form
22721 -9605 -7775 -16956 6442 4387 -19436 -4736 -8534 -19325 -12175 -22285 -36907 12838 24342
22708 24342 33603 26249 17221 25543 31314 35910 12880 -18407 -25735 40380 62516 2442 -645
22695 -645 16253 37482 15901 1663 -6272 -34246 -11844 -12097 16290 17717 9203 9153 4995 -16250
22681 -16250 -60535 -96515 -71272 -20501 12571 -3580 -17877 -20904 11258 10116 23127 41188
22669 41188 5000 6126 -3429 -34590 -20082 -20644 -37123 -30342 -30317 -26174 -18146 -36132 -19522 -15182
22655 -15182 -27081 -25867 454 10708 -1856 -13456 15440 33382 45753 47419 -8418 -61479
22643 -61479 -75775 -75772 -38797 -36343 -49398 -68240 -50334 -33867 -61632 -94223 -118166 -87249 -17303
22630 -17303 997 16782 10319 -22070 -29030 -22184 -42331 -37058 12004 -12899 -5196 20174 42415
$$ packed form
22721i605J830r181K3398k055k3823J4700l798j0791P150j0110j4622M9745J1504
22708B4342R261p354r028Q322N771M596k3030l1287p328O6115K2136o0074l087
22695f45J6898K1229k1581j4238p935k7974K2402k53K8387J427q514n0m158k1245
22681a6250m4285l5980K5243N0771L3072j6151j4297l027L2162j142J3011J8061
22669D1188l6188J126r555l1161J4508n62j6479O781K5M143Q028j7986J6610M340
22655a5182j1899J214K6321J0254j2564j1600K8896J7942J2371J666n5837n3061
22643f1479j4296LL6975K454j3055j8842J7906J6467k7765l2591k3943L0917O9946
22630a7303J8300J5785o463l2389o960O846k0147N273M9062k4903P703K5370K2241
$$ plain form
22617 42415 23254 33040 47317 60342 43661 37390 37902 40050 39223 25510 10727 37801 52918
22604 52918 31000 18000 20955 -10744 -31152 -23292 -4686 20313 3863 -11783 -31992 4387
22592 4387 51120 50885 23335 9027 7281 -7665 -3523 26824 52746 23680 -9072 -42551 -56997
22579 -56997 -45030 -52978 -37116 -11151 -22107 7016 29020 15687 16925 30961 22876 18077
22567 18077 20771 551 8057 4394 -40384 -45316 -16391 -4356 -13602 21939 32990 58874 62519
22554 62519 38696 -1817 -36973 -8814 25466 8911 -38539 -56271 -44077 -13966 20322 28877
22542 28877 27573 -566 -33270 -32654 -22930 -37200 -75342 -30784 -29527 -14351 2289 -17144 -27469
22529 -27469 -26721 7805 -32058 -36095 -4669 28028 26324 27576 6224 19983 43614 34322 39778
$$ packed form
22617D2415j9161R786J4277J3025j6681o271N12K148q27j3713j4783K7074J5117
22604E2918k1918j3000K955l1699k0408P860J8606K4999j6450j5646k0209L6379
22592D387M6733k35k7550j4308j746j4946M142L0347K5922k9066l2752l3479j4446
22579e6997J1967p948J5862K5965j0956K9123K2004j3333J238J4036q085m799
22567A8077K694k0220P506l663m4778m932K8925J2035r246L5541J1051K5884L645
22554F2519k3823m0513l5156K8159L4280j6555m7450j7732J2194L0111L4288Q555
22542B8877j304k8139l2704O16R724j4270l8142M4558J257J5176J6640j9433j0325
22529b7469P48L4526l9863m037L1426L2697j704J252k1352J3759K3631r292N456
$$ plain form
22516 39778 38201 25346 -12873 -9182 -8187 17343 26314 16182 10238 11952 -11501 -67802 -79443
22503 -79443 -36648 435 2999 7037 11654 -17582 -3176 5702 -25010 -43467 -16962 -58042
22491 -58042 -47829 -33081 -33118 -19958 -54676 -48588 -23299 -21514 -72453 -87589 -48445 -8961 1415
22478 1415 -16474 -23780 -25719 -16241 -1410 13082 -20156 -86152 -74968 -4326 -3054 -10233 -8113
22465 -8113 -28238 -30248 -1159 -36018 -7783 -8851 577 26814 44229 39771 30631 28133 8070
22452 8070 -20962 -58722 -48561 -7090 10086 5300 -6106 21408 37331 17500 35614 21952
22440 21952 1777 -26547 -18673 -9635 -56703 -4255 41182 40873 71515 49623 39468 70594
22428 70594 47894 44484 44503 61350 23563 12987 39034 36682 37949 45280 27943 29034 16026
$$ packed form
22516C9778j577j2855l8219L691R95K5530Q971j0132n944J714k3453n6301j1641
22503g9443M2795L7083K564M038M617k9236J4406Q878l0712j8457K6505m1080
22491e8042J0213J4748l7J3160l4718O088K5289J785n0939j5136L9144L9484J0376
22478A415j7889p306j939R478J4831J4492l3238o5996J1184P0642J272p179K120
22465h113k0125k010K9089l4859K8235j068R428K6237J7415m458r140k498k0063
22452H070k9032l7760J0161M1471J7176m786j1406K7514J5923j9831J8114j3662
22440B1952k0175k8324P874R038m7068N2448M5437l09L0642k1892j0155L1126
22428G0594k2700l410J9J6847l7787j0576K6047k352J267P331j7337J091j3008
$$ plain form
22415 16026 -10616 -242 5201 13951 -18765 -28809 -31536 16901 90383 92075 41992 31760
22403 31760 17441 -2529 19238 60815 53431 66077 33653 5342 -8979 19300 77071 107380
22391 107380 56485 39997 99886 77965 71133 89418 82357 67329 44383 41051 32825 19955
22379 19955 23594 25520 -20740 -31734 -41462 -42450 -27493 -33988 -15622 -15121 -8306 20402 -1300
22366 -1300 1076 -8559 -2173 40039 88804 93313 44499 50551 32484 10166 33080 31763 9373
22353 9373 -17935 -20331 15473 36021 35506 13222 52266 32934 15042 9281 9284 14022 34312 25583
22339 25583 42080 62520 60918 29440 -6915 -6705 -15720 -69135 -68008 -54727 -34689 23200 -5455
22326 -5455 -19955 -34450 -56542 -33861 3712 -17270 -35348 -55059 -51714 -26928 2770 -17765
$$ packed form
22415A6026k6642J0374N443Q750l2716j0044k727M8437P3482J692n0083j0232
22403C1760j4319j9970K1767M1577p384J2646l2424k8311j4321K8279N7771L0309
22391A07380n0895j6488N9889k1921o832J8285p061j5028k2946l332q226j2870
22379A9955L639J926m6260j0994r728r88J4957o495J8366N01O815K8708k1702
22366a300K376r635O386M2212M8765M509m8814O052j8067k2318K2914j317k2390
22353I373k7308k396L5804K0548n15k2284L9044j9332j7892n761LM738K0290q729
22339B5583J6497K0440j602l1478l6355K10r015n3415J127J3281K0038N7889k8655
22326e455j4500j4495k2092K2681L7573k0982j8078j9711L345K4786K9698k0535
$$ plain form
22314 -17765 -53073 -45289 -50871 -26503 19379 21487 -15375 -49214 -45098 5826 14452 -41011 -49711
22301 -49711 -6398 3433 -2421 25643 27724 10269 24001 -20559 -51400 -7148 17540 12484
22289 12484 7508 32648 62148 67708 53078 56422 41601 14555 14194 16317 -17383 -24243 -22778
22276 -22778 -2184 8832 8600 40235 38589 38292 48159 35715 25681 -4850 -16514 17486 27475
22263 27475 2219 -52886 -62054 -31389 -39735 -54743 -12992 -33047 -38426 -31570 -11345 -10285 10560
22250 10560 70199 94473 49162 26458 33461 17361 18027 28123 28202 24155 25935 1680 -27804
22237 -27804 -14060 19323 45004 27609 -11256 24632 31081 20895 42750 66990 58221 65103
22225 65103 62818 50838 22696 16683 34326 41370 38236 50455 43987 48393 38547 -14930 9282
$$ packed form
22314a7765l5308P784n582K4368M5882K108l6862l3839M116N0924Q626n5463q700
22301d9711M3313R831n854K8064K081j7455J3732m4560l0841M4252K4688n056
22289A2484m976K5140K9500N560j4630L344j4821k7046l61K123l3700o860J465
22276b2778K0594J1016k32L1635j646k97R867j2444j0034l0531j1664L4000R989
22263B7475k5256n5105r168L0665q346j5008M1751k0055n379O856K0225J060K0845
22250A0560N9639K4274m5311k2704P003j6100O66J0096P9m047J780k4255k9484
22237b7804J3744L3383K5681j7395l8865L5888O449j0186K1855K4240q769O882
22225F5103k285j1980k8142o013J7643P044l134J2219o468M406r846n3477K4212
$$ plain form
22212 9282 25901 28977 12310 25163 15094 26582 51646 29631 38956 21925 6395 30744
22200 30744 18602 49744 96520 69606 43099 19887 19214 11500 9357 -21987 -43032 -41299 -69689
22187 -69689 -35951 -22183 -26596 -6191 -542 -21725 -70187 -73940 -24031 -18175 -10337 34547 53108
22174 53108 28268 -13671 -34000 -3136 13136 26291 18012 16354 54530 53611 37501 -7788
22162 -7788 -33991 -20038 14450 24134 9982 -8526 -15953 -28310 -22283 -26037 32314 64442 51152
22149 51152 34651 12741 42714 44126 35308 7060 19679 52407 13961 -44884 -43258 10163
22137 10163 66884 53110 22056 21692 53866 62267 58304 43574 4437 -19219 -3769 -26145
22125 -26145 -17097 34153 53359 46878 19418 27887 31701 61340 65979 50223 388 -961 -11192
$$ packed form
22212I282J6619L076j6667J2853j0069J1488K5064k2015R325j7031j5530K4349
22200C0744j2142L1142M6776k6914k6507k3212o73p714k143l1344k1045J733k8390
22187f9689L3738J3768m413K0405N649k1183m8462l753M9909N856P838M4884J8561
22174E3108k4840m1939k0329L0864J6272J3155q279j658L8176r19j6110m5289
22162g788k6203J3953L4488R684j4152j8508p427j2357O027l754N8351L2128j3290
22149E1152j6501k1910K9973J412q818k8248J2619L2728l8446n8845J626N3421
22137A0163N6721j3774l1054l64L2174Q401l963j4730l9137k3656J5450k2376
22125b6145R048N1250J9206o481k7460Q469L814K9639M639j5756m9835j349j0231
$$ plain form
22112 -11192 -47620 -75717 -75315 -74801 -51107 -31057 -21545 18918 55894 47632 9909 1734 13280
22099 13280 19568 12765 -18542 -26338 12977 56135 64763 53945 48771 22036 16854 -12775 -40013
22086 -40013 -62739 -20923 4308 6117 -6276 -33208 -30868 7462 14205 49965 22646 -22470
22074 -22470 -31371 -65806 -41475 10424 21502 2072 6166 30812 32354 4837 -3143 -30016
22062 -30016 -12844 42124 35077 23550 25722 23023 3445 -1597 21184 15436 36771 19640 21589
22049 21589 -19365 -41493 -85142 -60856 -21300 -38658 -41450 -14857 16118 7642 -19116 -6691
22037 -6691 12145 -1736 4507 -9378 -26145 -25213 10682 13633 40160 21776 37995 58305 53694
22024 53694 15391 9957 16600 4536 20581 17351 -11468 44845 83469 77913 51987 19639
$$ packed form
22112a1192l6428k8097M02N14K3694K0050R512M0463L6976q262l7723q175J1546
22099A3280O288o803l1307p796L9315M3158Q628j0818n174k6735n182k9629k7238
22086d0013k2726M1816K5231J809j2393k6932K340L8330O743L5760k7319m5116
22074b2470q901l4435K4331N1899J1078j9430M094K4646J542k7517p980k6873
22062c0016J7172N4968p047j1527K172k699j9578n042K2781n748K1335j7131J949
22049B1589m0954k2128m3649K4286L9556j7358k792K6593L0975q476k6758J2425
22037f691J8836j3881O243j3885j6767R32L5895K951K6527j8384J6219K0310m611
22024E3694l8303n434O643j2064J6045l230k8819N6313L8624n556k5926l2348
$$ plain form
22012 19639 2485 -3504 -24167 13916 29409 54734 90238 78341 53698 -14145 11583 32857
22000 32857 31406 25854 5718 16384 24734 31769 62206 43729 7522 -11040 22748 29677 19089
21987 19089 23396 -37720 -48539 -27891 -28726 -16642 -11557 11788 -2120 -30751 13554 51352
21975 51352 46674 85244 99170 83562 41092 17977 28067 50160 28705 -17323 -31391 -28648
21963 -28648 -4170 49501 56605 53440 27898 28718 36874 37371 39808 42182 2464 -3124 49679 74065
21949 74065 12390 850 17045 -9373 -34166 -52443 -23904 21264 35221 44279 10345 -6302
21937 -6302 26052 58077 20778 37643 86446 77738 52029 25123 12197 55005 50455 20406
21925 20406 -5389 8049 6730 -44612 -24990 23151 16279 31192 54755 81820 105389 86099
$$ packed form
22012A9639j7154n989k0663L8083J5493K5325L5504j1897k4643o7843K5728K1274
22000C2857j451n552k0136J0666Q350P035L0437j8477l6207j8562L3788O929j0588
21987A9089M307o1116j0819K0648q35J2084N085K3345j3908k8631M4305L7798
21975E1352m678L8570J3926j5608m2470k3115J0090K2093k1455m6028j4068K743
21963b8648K4478N3671P104l165k5542Q20Q156M97K437K374l9718n588N2803K4386
21949G4065o1675j1540J6195k6418k4793j8277K8539M5168J3957R058l3934j6647
21937f302L2354L2025l7299J6865M8803q708k5709k6906j2926M2808m550l0049
21925B0406k5795J3438j319n1342J9622M8141o872J4913K3563K7065K3569j9290
$$ plain form
21913 86099 32269 43386 75321 66984 26241 -23669 -17987 9957 41935 48194 76511 72870
21901 72870 60753 48623 -705 5520 15058 -27716 -36367 29888 48671 35375 41566 23099
21889 23099 35912 47017 59443 82349 58767 1955 -9005 6466 29255 57388 45947 6580
21877 6580 15420 -5110 4110 14248 20341 20204 19697 52622 62451 32208 9810 41469 34090 11639
21863 11639 -41461 -23491 17929 15394 -7237 -19395 -9810 -16419 -34885 -73439 -60887 1016
21851 1016 40930 55351 49529 33958 43097 33990 19420 8825 37055 38036 23256 9471 4582
21838 4582 41743 59691 57746 43742 46188 37438 1949 -10762 -14763 7831 -19392 6408 44533
21825 44533 26251 5802 17077 50346 54577 24988 -5983 -6815 19053 47026 73935 53844
$$ packed form
21913H6099n3830J1117L1935q337m0743m9910N682K7944L1978O259K8317l641
21901G2870j2117j2130m9328O225R538m2774q651O6255J8783j3296O191j8467
21889B3099J2813J1105J2426K2906k3582n6812j0960J5471K2789K8133j1441l9367
21877F580Q840k0530R220J0138O093j37n07L2925R829l0243k2398L1659p379k2451
21863A1639n3100J7970M1420k535k2631j2158R585o609j8466l8554J2552O1903
21851A016L9914J4421n822j5571R139r107j4570j0595K8230R81j4780j3785m889
21838D582L7161J7948j945j4004K446q750l5489j2711m001K2594k7223K5800L8125
21825D4533j8282k0449J1275L3269M231k9589l0971q32K5868K7973K6909k0091
$$ plain form
21813 53844 40970 36140 48636 30546 35558 44058 23591 24685 -2640 -32362 -43324 -15538
21801 -15538 -24468 -23623 -21931 4288 14286 321 -7802 30978 2527 -59420 -43362 -30424 -14015
21788 -14015 -9920 9943 24659 -345 -14608 10718 19288 31820 21318 -19304 -31978 9424
21776 9424 54321 29128 -15781 -35257 -20474 -22380 -40025 -43960 -24718 25728 47292 -13983
21764 -13983 -19512 -34251 -2898 3380 748 24526 42878 21450 47449 21880 23673 35414
21752 35414 30012 19474 31263 50498 40484 10487 15778 45141 41665 -32188 -27923 25648
21740 25648 29829 25274 20030 409 -10308 28456 12324 19156 62583 73688 91695 125634
21728 125634 111799 106832 100627 91227 64497 40576 58857 35068 35372 26441 -26029 -49966 -86932
$$ packed form
21813E3844j2874m830J2496j8090N012Q500k0467J094k7325k9722j0962K7786
21801a5538q930Q45J692K6219R998j3965q123L8780k8451o1947J6058J2938J6409
21788a4015M095J9863J4716k5004j4263K5326Q570J2532j0502m0622j2674M1402
21776I424M4897k5193m4909j9476J4783j906j7645l935J9242N0446K1564o1275
21764a3983n529j4739L1353O278k632K3778J8352k1428K5999k5569J793J1741
21752C5414n402j0538J1789J9235j0014k9997N291K9363l476p3853M265N3571
21740B5648M181m555n244j9621j0717L8764j6132O832M3427J1105J8007L3939
21728A25634j3835m967o205r400k6730k3921J8281k3789L04q931n2470k3937l6966
$$ plain form
21715 -86932 -78892 -35383 -16847 -24211 -34707 -32493 22071 27457 -9405 -25290 -45478 -43940 -16433
21702 -16433 4563 30456 49707 71442 101182 73670 63849 29591 -37704 -20708 -2737 18407
21690 18407 12390 13835 27896 27404 5636 -12707 -27265 3564 334 -20558 -31131 -14102 -14518
21677 -14518 -10297 -8488 28008 21894 8397 -5263 -57334 -69941 -46317 -40331 -10892 -12674 -19667
21664 -19667 -22934 -27737 -12401 15087 5371 -10343 -21950 -6891 26459 -2903 -1510 23514
21652 23514 30933 38503 49715 42475 7108 143 4789 -8576 -8398 -17552 -12295 9192 21996
21639 21996 43447 39943 14336 19322 45149 32419 18358 9711 10844 17284 57414 30661 23275
21626 23275 30279 23727 -5984 25822 16568 -10785 -18525 988 25673 45995 60183 68610 57835
$$ packed form
21715h6932Q040M3509J8536p364j0496K214N4564N386l6862j5885k0188J538K7507
21702a6433K0996K5893J9251K1735K9740k7512r821l4258o7295J6996J7971K1144
21690A8407o017J445J4061m92k1768j8343j4558L0829l230k0892j0573J7029m16
21677a4518M221J809L6496o114j3497j3660n2071j2607K3624N986K9439j782o993
21664a9667l267m803J5336K7488r716j5714j1607J5059L3350k9362J393K5024
21652B3514P419P570J1212p240l5367o965M646j3365J78r154N257K1487J2804
21639B1996K1451l504k5607M986K5827j2730j4061q647J133O440M0130k6753p386
21626B3275P004o552k9711L1806r254k7353p740J9513K4685K0322J4188Q427j0775
$$ plain form
21613 57835 61877 37727 20196 14618 18288 47643 53802 20324 5686 3756 -1246 -12724 -21725
21600 -21725 -42257 -60989 -32848 -48904 -78907 -15929 24931 53061 61470 20824 -36969 -40300
21588 -40300 -24189 -10779 -2255 24541 52073 36649 27237 21664 -28001 -23306 15283 30173
21576 30173 33292 41881 45680 46646 84296 62236 70501 33100 16706 42532 63696 47187 47550
21563 47550 55479 32472 76061 92823 81132 22512 9194 25535 27682 15754 -637 -33885
21551 -33885 -48785 -33558 389 6560 7660 -12114 -52221 -91254 -45692 6054 32686 18947
21539 18947 26331 44967 19985 -20304 -44845 -32046 -25603 -36129 13870 49409 76914 74016
21527 74016 9973 25025 50735 38605 18632 16520 53417 42783 27207 1887 46853 42294
$$ packed form
21613E7835M042k4150j7531n578L670K9355O159l3478j4638j930n002j1478r001
21600b1725k0532j8732K8141j6056l0003O2978M0860K8130Q409m0646n7793l331
21588d0300J6111J3410Q524K6796K7532j5424r412n573m9665M695L8589J4890
21576C0173L119Q589L799R66L7650k2060Q265l7401j6394K5826K1164j6509L63
21563D7550P929k3007M3589J6762j1691n8620j3318J6341K147j1928j6391l3248
21551c3885j4900J5227L3947O171J100j9774m0107l9033M5562N1746K6632j3739
21539A8947P384J8636k4982m0289k4541J2799O443j0526M9999L5539K7505k898
21527G4016o4043J5052K5710j2130j9973k112L6897j0634j5576k5320M4966m559
$$ plain form
21515 42294 13428 23956 22789 -23759 -36386 -61393 -45088 -8205 -15532 7274 22733 17138
21503 17138 -1458 -24354 -4495 51675 57269 41067 36236 12919 10090 -4422 -4044 -16960 -1371
21490 -1371 12960 29049 15373 34688 37807 15152 -5710 28569 61409 73002 87501 68682
21478 68682 29270 -8897 201 -11228 -1574 17564 56454 89044 74852 19631 -21912 -20597
21466 -20597 3128 15515 -5526 -22475 -47766 -52446 -50030 12736 46547 64489 70803 42677
21454 42677 -14156 13559 74214 119537 113558 112284 115556 121147 99965 66626 62139 56910 56847
21441 56847 26641 49687 42737 41649 51099 29882 32337 28687 43571 50893 46491 58190 12663
21428 12663 -13907 13250 4501 -23187 3514 5339 -25383 -2102 24280 39467 30240 2720
$$ packed form
21515D2294k8866J0528j167m6548j2627k5007J6305L6883p327K2806J5459n595
21503A7138j8596k2896J9859N6170N594j6202m831k3317k829j4512L78j2916J5589
21490a371J4331J6089j3676J9315L119k2655k0862L4279L2840J1593J4499j8819
21478F8682l9412l8167R098j1429R654J9138L8890L2590j4192n5221m1543J315
21466b0597K3725J2387k1041j6949k5291m680K416O2766L3811J7942O314k8126
21454D2677n6833K7715O0655M5323n979j274L272N591k1182l3339m487n229o3
21441E6847l0206K3046o950j088R450k1217K455l650J4884P322m402J1699m5527
21428A2663k6570K7157q749k7688K6701J825l0722K3281K6382J5187r227k7520
$$ plain form
21416 2720 26962 74730 51808 41343 26677 3340 28784 54569 19594 23211 47702 86793
21404 86793 44334 9694 27665 26091 57872 49959 37189 8936 -14643 13531 56184 61027
21392 61027 30175 37039 83672 94984 84608 68438 77428 69936 65752 31748 32792 33850 12764
21379 12764 9462 32842 67948 46533 63839 47619 49049 19790 -21896 11369 72312 105203
21367 105203 105937 81951 42458 46897 37459 7593 12098 17349 64819 36161 -20235 -33289 -7007
21354 -7007 36126 30022 33321 27619 59448 74418 49158 41400 62286 57262 35939 38942 12181
21341 12181 -13535 -33804 -24708 -3832 37192 -2558 -29626 -34194 -25103 22206 17845 -1659
21329 -1659 -21010 17486 55361 55492 56507 24133 21510 39869 16131 -5291 12209 33713 19869
$$ packed form
21416B720K4242M7768k2922j0465j4666k3337K5444K5785l4975L617K4491L9091
21404H6793m2459l4640J7971j574L1781p913j2770k8253k3579K8174M2653M843
21392F1027l0852O864M6633J1312j0376j6170Q990p492m184l4004J044J058k1086
21379A2764l302K3380L5106k1415J7306j6220J430k9259m1686L3265O0943L2891
21367A05203P34k3986l9493M439r438k9866M505N251M7470k8658n6396j3054K6282
21354g007M3133o104L299n702L1829J4970k5260p758K0886n024k1323L003k6761
21341A2181k5716k0269R096K0876M1024l9750k7068m568R091M7309m361j9504
21329a659j9351L8496L7875J31J015l2374k623J8359k3738k1422J7500K1504j3844
$$ plain form
21316 19869 46819 81122 51659 25065 8696 -8850 17518 7440 -26399 -50059 -74293 -56728
21304 -56728 -28587 -6784 -2597 -21975 381 779 8413 -13917 -22480 -5749 52726 94893 94565
21291 94565 89710 73302 61054 86595 117982 110130 122397 58854 21239 25990 47858 81868
21279 81868 82252 85148 105522 77049 51481 73045 61665 61520 73474 77177 69184 84531 84545 48162
21265 48162 7555 11224 6591 6003 23411 4164 10563 7469 -4784 16457 21109 -10202 -1714
21252 -1714 2362 2906 14477 35688 31057 19698 -15498 -31718 -12990 -12538 -39472 -50492 -17285
21239 -17285 -13148 -54610 -67832 -21695 16462 46208 65263 80925 66115 57298 76947 55827
21227 55827 39288 11643 38114 92464 116284 63065 59914 57323 63450 37561 18352 22456
$$ packed form
21316A9869K6950L4303k9463k6594j6369j7546K6368j0078l3839k3660k4234J7565
21304e6728K8141K1803M187j9378K2356L98P634k2330q563J6731N8475M2167l28
21291I4565m855j6408j2248K5541L1387p852J2267o3543l7615M751K1868L4010
21279H1868L84K896K0374k8473k5568K1564j1380j45J1954L703p993J5347J4l6383
21265D8162m0607L669m633n88J7408j9247O399l094j2253K1241M652l1311Q488
21252a714M076N44J1571K1211m631j1359l5196j6220J8728M52k6934j1020L3207
21239a7285M137m1462j3222M6137L8157K9746J9055J5662j4810q817J9649k1120
21227E5827j6539k7645K6471N4350K3820n3219l151k591O127k5889j9209M104
$$ plain form
21215 22456 30451 -6486 5936 11662 17502 -7082 4787 26728 35727 34519 21577 33401 66827
21202 66827 60958 56529 60404 63038 62435 57533 73307 63510 65280 80485 59228 57893 82438 54559
21188 54559 45613 73492 78263 55119 23762 12008 15485 11269 42748 77099 84869 76788 79802
21175 79802 91446 107124 77310 55746 69337 77454 75288 69324 73626 31598 34049 47228 22466
21162 22466 23337 98638 110733 111960 83892 54990 75421 76214 67350 42371 41567 -4649 -37945
21149 -37945 -34790 59218 100613 101654 82257 46878 46052 32407 67095 87943 103519 93747 100484
21136 100484 92215 89551 94899 97026 96516 122384 103081 109174 140117 123099 96613 64976 49158
21123 49158 62511 96097 128313 124888 134164 149870 171331 195450 255215 297644 381970 461799
$$ packed form
21215B2456P995l6937J2422N726N840k4584J1869K1941Q999j208j2942J1824L3426
21202F6827n869m429L875K634o03m902J5774r797J770J5205k1257j335K4545k7879
21188E4559q946K7879M771k3144l1357j1754L477m216L1479L4351P770q081L014
21175G9802J1644J5678k9814k1564J3591Q117k166n964M302m2028K451J3179k4762
21162B2466Q71P5301J2095J227k8068k8902K0431P93q864k4979q04m6216l3296
21149c7945L155R4008M1395J041j9397l5379q26j3645L4688K0848J5576r772O737
21136A00484q269k664N348K127n10K5868j9303O093L0943j7018k6486l1637j5818
21123D9158J3353L3586L2216l425R276J5706K1461K4119N9765M2429Q4326P9829
$$ plain form
21111 461799 588374 811162 1021162 1076525 920657 694731 519826 377417 291240 270316
21101 270316 280652 280560 321148 299057 308272 403340 556972 761988 984163 1192740 1150804
21090 1150804 944954 732823 570194 475276 389899 347713 336759 370430 442113 522943 733931
21079 733931 974705 1182946 1185035 988268 743306 543557 408352 332433 280117 266671
21069 266671 259644 282987 335542 416077 495610 628125 829374 1083368 1216716 1050005 769358
21058 769358 553612 420365 358204 305250 266553 222043 184688 134990 122912 87326 92134
21047 92134 85513 64559 94186 113648 76690 39195 78966 134873 116721 129034 155219 121281
21035 121281 112584 123665 126223 128012 103764 103250 97827 94035 143929 145370 64737 16941 13530
$$ packed form
21111D61799J26575K22788K10000N5363j55868k25926j74905j42409q6177k0924
21101B70316J0336r2M0588k2091R215R5068J53632K05016K22175K08577m1936
21090A150804k05850k12131j62629r4918q5377m2186j0954L3671P1683Q0830K10988
21079G33931K40774K08241K089j96767k44962j99749j35205p5919n2316j3446
21069B66671p027K3343N2555Q0535P9533J32515K01249K53994J33348j66711k80647
21058G69358k15746j33247o2161n2954l8697m4510l7355m9698j2078l5586M808
21047I2134o621k0954K9627J9462l6958l7495L9771N5907j8152J2313K6185l3938
21035A21281q697J1081K558J789k4248n14n423l792M9894J441q0633m7796l411
$$ plain form
21022 13530 14796 29863 45747 56603 69752 118686 75409 26592 21621 10359 -789 63667
21010 63667 87390 82175 83923 51992 24403 4836 39451 84200 128796 134682 112077 80584
20998 80584 109423 112802 107921 83268 50243 98139 90229 97802 137887 114041 113621 130372 134311
20985 134311 113254 89821 79410 125176 120726 100212 96183 71589 68113 46384 93810 116445
20973 116445 133729 99416 91291 45048 22904 42206 36170 42900 37007 31681 41827 65695
20961 65695 92426 109603 90973 66061 66024 60075 84962 119229 113534 121533 110201 94887 82962
20948 82962 76239 95736 107479 120336 103374 84282 52740 6275 23161 40226 98309 115323
20936 115323 132818 162859 156997 129127 125148 131181 84158 79837 116509 121313 113908 100309 97908
$$ packed form
21022A3530J266J5067J5884J0856J3149M8934m3277m8817m971j1262j1148O4456
21010F3667K3723n215J748l1931k7589j9567L4615M4749M4596N886k2605l1493
20998H0584K8839L379m881k4653l3025M7896p910P573M0085k3846m20J6751L939
20985A34311k1057k3433j0411M5766m450k0514m029k4594l476k1729M7426K2635
20973A16445J7284l4313q125m6243k2144J9302o036O730n893n326J0146K3868
20961F5695K6731J7177j8630k4912l7n949K4887L4267n695P999j1332j5314j1925
20948H2962o723J9497J1743J2857j6962j9092l1542m6465J6886J7065N8083J7014
20936A15323J7495L0041n862k7870l979O033m7023m321L6672M804p405j3599k401
$$ plain form
20923 97908 108096 132922 150840 156630 122970 104430 75027 51122 76806 106698 95943 69400
20911 69400 58206 54664 53070 47166 39841 94129 89265 55930 48520 44159 62887 100424 96147
20898 96147 92334 108764 97947 117938 136154 156296 186487 212975 175770 100415 83694 56340
20886 56340 28393 41738 82820 76097 60413 67029 83832 92343 118482 115475 96661 93953 109524
20873 109524 132413 148010 146740 157070 131893 131361 130634 119294 97217 106531 100715 128719 148163
20860 148163 158962 133858 167393 190977 163618 159646 135273 127428 151521 166212 171195 133474
20848 133474 102429 116208 168644 142404 107149 147918 165863 155918 133281 112571 119545 159829
20836 159829 146239 174951 215367 202254 144085 127992 116793 96832 112909 156426 130250
$$ packed form
20923I7908J0188K4826J7918N790l3660j8540k9403k3905K5684K9892j0755k6543
20911F9400j1194l542j594n904p325N4288m864l3335p410m361J8728L7537m277
20898I6147l813J6430j0817J9991J8216K0142L0191K6488l7205p5355j6721k7354
20886E6340k7947J3345M1082o723j5684O616J6803Q511K6139l007j8814k708J5571
20873A09524K2889J5597j270J0330k5177n32p27j1340k2077R314n816K8004J9444
20860A48163J0799k5104L3535K3584k7359l972k4373p845K4093J4691M983l7721
20848A33474l1045J3779N2436k6240l5255M0769J7945r945k2637k0710O974M0284
20836A59829j3590K8712M0416j3113n8169j6093j1199j9961J6077M3517k6176
$$ plain form
20825 130250 111723 119988 171810 177418 174647 192120 190418 161045 156004 122405 118501 119811 84423
20812 84423 65029 64864 103119 146096 166941 158828 133644 139759 141476 124506 99397 60909 84626
20799 84626 79532 77385 137231 165200 168391 148762 152564 155337 153246 181982 180627 261361 333269
20786 333269 401370 451695 433127 344894 252395 196985 169186 162593 169246 170193 157864 163976
20774 163976 139363 152269 134071 110796 117596 112269 123745 124042 146733 130906 133896 162205
20762 162205 140647 125431 161192 217966 262902 274766 300003 386416 424717 402890 341235
20751 341235 265720 218213 211337 215528 225802 193459 155953 147981 161933 200812 239489 219979
20739 219979 181319 145025 134305 109665 120506 145453 141349 160965 188528 212446 231190 278051
$$ packed form
20825A30250j8527Q265N1822N608k771J7473j702k9373n041l3599l904J310l5388
20812H4423j9394j65L8255M2977K0845q113k5184O115J717j6970k5109l8488K3717
20799H4626n094k147N9846K7969L191j9629L802K773k091K8736j355Q0734P1908
20786C33269O8101N0325j8568q8233r2499n5410k7799o593O653R47j2329O112
20774A63976k4613J2906j8198k3275O800n327J1476K97K2691j5827K990K8309
20762A62205k1558j5216L5761N6774M4936J1864K5237Q6413L8301k1827o1655
20751C41235p5515m7507o876M191J0274l2343l7506p972J3952L8879L8677j9510
20739B19979l8660l6294j0720k4640J0841K4947m104J9616K7563K3918J8744M6861
$$ plain form
20727 278051 342356 322053 293155 262745 251576 234502 241710 219996 191711 229860 282918 295650
20715 295650 274694 301874 292764 235582 197025 184339 182246 181092 165525 170827 194062 204761
20703 204761 255837 247005 195036 199798 228259 241539 232726 224092 227794 244189 290355 304514
20691 304514 284985 234250 246126 284951 321818 376079 402371 445157 414515 328372 272038
20680 272038 241056 258304 290591 262399 251126 268808 314881 306483 255443 260197 277098 306900
20668 306900 353187 369618 333250 343864 355341 382860 414241 457758 468799 489162 493982 504133
20656 504133 530583 531048 519626 463733 414374 370040 357314 363798 352929 357771 392502 435639
20644 435639 451584 446666 395622 338662 322213 372626 433941 438390 452580 492343 478466 454569
$$ packed form
20727B78051O4305k0303k8898l0410j1169j7074P208k1714k8285L8149N3058J2732
20715B95650k0956K7180r110n7182l8557j2686k093j154j5567N302K3235J0699
20703B04761N1076q832n1969M762K8461J3280q813q634L702J6395M6166J4159
20691C04514j9529n0735J1876L8825L6867N4261K6292M2786l0642q6143n6334
20680B72038l0982J7248L2287k8192j1273J7682M6073q398n1040M754J6901K9802
20668C06900M6287J6431l6368J0614J1477K7519L1381M3517J1041K0363M820J0151
20656E04133K6450M65j1422n5893m9359m4334j2726O484j0869M842L4731M3137
20644D35639J5945m918n1044n6960j6449N0413O1315M449J4190L9763j3877k3897
$$ plain form
20632 454569 465309 499636 539650 560010 575701 604365 623094 610921 603003 594977 591803 554646
20620 554646 558342 587301 546426 522053 517535 527809 512645 509688 528709 583940 615104 621407
20608 621407 623854 666117 681416 698232 728202 719924 723053 738518 759763 804280 819388 868015
20596 868015 904385 949157 959996 923290 891094 900412 973573 1046371 1068378 1040317 997208 1001912
20584 1001912 1019506 1035429 1109307 1222030 1315587 1395677 1493740 1586145 1668613 1739249 1803797
20573 1803797 1853685 1948549 2083206 2219799 2393717 2714893 3141175 3664213 4420448 5093249
20563 5093249 5107180 4790427 4648049 4752386 5128715 5617370 6084380 6551352 6933735 7115369
20553 7115369 7049469 6976158 7060140 7277320 7676425 8290591 9128261 10210210 11683272 13457450
$$ packed form
20632D54569J0740L4327M0014K0360J5691K8664J8729j2173p918q026l174l7157
20620E54646L696K8959m0875k4373m518J0274j5164k957J9021N5231L1164O303
20608F21407K447M2263J5299J6816K9970q278L129J5465K1245M4517J5108M8627
20596H68015L6370M4772J0839l6706l2196R318P3161P2798K2007k8061m3109M704
20584A001912J7594J5923P3878J12723R3557Q0090R8063R2405Q2468P0636O4548
20573A803797M9888R4864J34657J36593J73918L21176M26282N23038P56235O72801
20563E093249J3931l16753j42378J04337L76329M88655M67010M66972L82383J81634
20553G115369o5900p3311Q3982K17180L99105O14166Q37670J081949J473062J774178
$$ plain form
20543 13457450 15429977 17810730 20937260 25249020 31160849 39941888 53620577 75753403
20535 75753403 113465094 178847573 282048344 398031922 434115951 352424263 241746838
20528 241746838 159534614 108818919 78689824 60346510 48758337 40856631 34892419
20521 34892419 30508454 27578365 25357966 23172059 21232938 19934005 19410577 19655577
20513 19655577 20603161 22062550 24197290 27484860 32281521 39242759 49734775 65515032
20505 65515032 90427475 133145510 207462387 320255847 429104521 433419737 332497736
20498 332497736 222658732 145685369 98705364 70539635 53117600 41876026 34145031
20491 34145031 28492497 24458666 21657346 19120184 16353684 13797722 11681286 10023910
$$ packed form
20543A3457450J972527K380753L126530M311760N911829Q781039J3678689K2132826
20535G5753403L7711691O5382479J03200771J15983578L6084029q1691688j10677425
20528B41746838q2212224n0715695l0129095j8343314j1588173p901706n964212
20521C4892419m383965k930089k220399k185907j939121j298933n23428K45000
20513A9655577R47584J459389K134740L287570M796661O961238J0492016J5780257
20505F5515032K4912443M2718035P4316877J12793460J08848674M315216j00922001
20498C32497736j09839004p6973363m6980005k8165729j7422035j1241574p730995
20491C4145031n652534m033831k801320k537162k766500k555962k116436j657376
$$ plain form
20483 10023910 8775784 7931720 7360151 7012592 6921067 7082185 7496978 7962147 8049566
20474 8049566 7508053 6625721 5981911 5656580 5533721 5595670 5504324 4846291 3934339 3200736
20464 3200736 2668910 2330491 2160467 2049296 1939664 1853968 1789850 1767177 1770785 1746495
20454 1746495 1686652 1556465 1468213 1421122 1395185 1340962 1265562 1204895 1155764 1119188 1037490
20443 1037490 963438 906357 903183 911697 918948 907634 972612 1046249 1176431 1306772 1341727
20432 1341727 1318209 1229962 1088302 974654 927346 918222 923724 947994 993355 1118894 1222809
20421 1222809 1297676 1316982 1258332 1167859 1063989 1027826 980013 910769 840601 753584 665197
20410 665197 633313 637379 599054 573943 620522 706800 740566 650703 580161 533115 533126 519215
$$ packed form
20483A0023910j248126q44064n71569l47559r1525J61118M14793M65169Q7419
20474H049566n41513q82332o43810l25331j22859O1949r1346o58033r11952p33603
20464C200736n31826l38419j70024j11171j09632q5696o4118k2673L608k4290
20454A746495n9843j30187q8252m7091k5937n4223p5400o0667m9131l6576q1698
20443A037490p4052n7081l174Q514P251j1314O4978P3637J30182J30341L4955
20432A341727k3518q8247j41660j13648m7308r124N502K4270M5361J25539J03915
20421A222809P4867J9306n8650r0473j03870l6163m7813o9244p0168q7017q8387
20410F65197l1884M066l8325k5111M6579Q6278L3766q9863p0542m7046J1j3911
$$ plain form
20398 519215 465900 400877 350110 356134 398386 479848 478749 475573 491911 493042 441332 372082
20386 372082 387800 372226 386421 445811 559604 692431 810538 923184 1053028 1126684
20376 1126684 1137689 1221737 1254011 1188231 1072719 956329 849277 802666 798941 803559 808859
20365 808859 737070 599471 471145 412516 397025 367856 332014 312981 250315 246217 261844
20354 261844 231778 204469 183466 171893 166783 126399 106586 87077 77591 146080 141197 116859
20342 116859 110968 93476 58840 21004 28092 50757 61049 111883 167666 193621 174465 183015
20330 183015 148568 140352 184152 194573 173058 135258 64976 111663 164425 134661 90402 89863
20318 89863 103978 94526 94655 127084 136049 173386 153617 102986 85290 74643 41144 61439
$$ packed form
20398E19215n3315o5023n0767O024M2252Q1462j099l176J6338J131n1710o9250
20386C72082J5718j5574J4195N9390J13793J32827J18107J12646J29844P3656
20376A126684J1005Q4048L2274o5780j15512j16390j07052m6611l725M618N300
20365H08859p1789j37599j28326n8629j5491k9169l5842j9033o2666m098J5627
20354B61844l0066k7309k1003j1573n110m0384j9813j9509r486O8489m883k4338
20342A16859n891j7492l4636l7836P088K2665J0292N0834N5783K5955j9156Q550
20330A83015l4447q216M3800J0421k1515l7800p0282M6687N2762k9764m4259n39
20318H9863J4115r452J29L2429Q965L7337j9769n0631j7696j0647l3499K0295
$$ plain form
20306 61439 74770 49236 86030 150605 192326 189491 167411 170116 137398 123301 151991 131852
20294 131852 145843 199422 203622 182064 149916 133724 147140 178614 161153 115010 75051 117092
20282 117092 134897 149014 170630 179075 159039 154201 155733 132329 97310 118487 124734 137485
20270 137485 154925 192477 207994 189163 175584 127721 122606 169750 236058 275588 226083 177211
20258 177211 156467 151810 144267 148394 183983 187848 164162 175151 175237 149798 157998 142831 165133
20245 165133 160266 182160 189335 171721 182508 165913 207438 210311 241399 218064 202117 179139
20233 179139 186132 178176 171830 194423 194679 177121 173456 125475 102787 100107 92525 56775 64018
20220 64018 78307 43973 44064 84491 74542 71953 60403 59298 70853 61960 75331 128142 154703
$$ packed form
20306F1439J3331k5534L6794O4575M1721k835k2080K705l2718j4097K8690k0139
20294A31852J3991N3579M200k1558l2148j6192J3416L1474j7461m6143l9959M2041
20282A17092J7805J4117K1616Q445k0036m838J532k3404l5019K1177O247J2751
20270A37485J7440L7552J5517j8831j3579m7863n115M7144O6308L9530m9505m8872
20258A77211k0744m657p543M127L5589L865k3686J0989Q6k5439Q200j5167K2302
20245A65133m867K1894P175j7614J0787j6595M1525K873L1088k3335j5947k2978
20233A79139O993p956o346K2593K56j7558l665m7981k2688k680p582l5750P243
20220F4018J4289l4334R1M0427r949k589j1550j105J1555q893J3371N2811K6561
$$ plain form
20207 154703 133187 120658 142517 179879 184860 184277 148933 129370 101217 91480 81433 71709
20195 71709 95741 93777 69406 61371 73668 103387 124623 111248 141090 162164 139480 113628
20183 113628 144511 148879 125791 150625 149363 154633 127010 119751 133255 166183 191305 226207
20171 226207 256476 289035 324416 308428 259292 253472 220901 178954 122111 99385 120548 148888
20159 148888 154419 153920 126290 61354 66484 81838 82605 74244 96977 104013 89945 73599 90940
20146 90940 117576 160786 131233 98405 98458 124468 138678 158560 180916 140815 110890 125955
20134 125955 143421 145558 147775 160185 145918 118181 125167 120581 109895 92184 107422 109377
20122 109377 112252 165751 224311 281180 333716 347039 325027 310724 307302 276833 228026 195794
$$ packed form
20207A54703k1516j2529K1859L7362M981n83l5344j9563k8153r737j0047r724
20195G1709K4032j964k4371q035J2297K9719K1236j3375K9842K1074k2684k5852
20183A13628L0883M368k3088K4834j262N270k7623p259J3504L2928K5122L4902
20171B26207L0269L2559L5381j5988m9136n820l2571m1947n6843k2726K1163K8340
20159A48888N531m99k7630o4936N130J5354P67q361K2733P036j4068j6346J7341
20146I0940K6636M3210k9553l2828N3K6010J4210J9882K2356m0101k9925J5065
20134A25955J7466K137K217J2410j4267k7737O986m586j0686j7711J5238J955
20122A09377K875N3499N8560N6869N2536J3323k2012j4303l422l0469m8807l2232
$$ plain form
20110 195794 224120 238465 262293 223082 154613 111106 100503 127826 148118 127958 135815 134295
20098 134295 121615 162383 178196 175963 170048 181248 191424 202471 217084 221589 191586 136297
20086 136297 150037 201388 257554 276058 253023 225479 203003 220873 201594 192054 173590 211135
20074 211135 241872 244376 202323 217681 257105 259207 242836 273628 243307 232129 225364 276057
20062 276057 341875 360125 349804 369676 397411 409386 385434 396925 395292 342850 278408 294742
20050 294742 313306 304121 298343 287927 276696 260577 268756 285025 283476 314790 332218 325375
20038 325375 334417 356966 372748 377145 388606 401729 366587 378717 351760 336232 352602 359338
20026 359338 373374 380737 362383 367054 351404 344187 345249 351454 339432 367959 415295 393817
$$ packed form
20110A95794K8326J4345K3828l9211o8469m3507j0603K7323K0292k0160P857j520
20098A34295j2680M0768J5813k233n915J1200J0176J1047J4613M505l0003n5289
20086A36297J3740N1351N6166J8504k3035k7544k2476J7870j9279r540j8464L7545
20074B11135L0737K504m2053J5358L9424K102j6371L0792l0321j1178o765N0693
20062B76057O5818J8250j0321J9872K7735J1975k3952J1491j633n2442o4442J6334
20050B94742J8564r185n778j0416j1231j6119Q179J6269j549L1314J7428o843
20038C25375R042K2549J5782M397J1461J3123l5142J2130k6957j5528J6370O736
20026C59338J4036P363j8354M671j5650p217J062O205j2022K8527M7336k1478
$$ plain form
20014 393817 403479 423135 450203 459611 447785 419252 429479 464371 451609 446336 466562 437823
20002 437823 410873 377008 404069 414500 409313 440950 462120 472265 487547 500731 516798 518477
19990 518477 511324 530772 595817 660309 678569 661405 686152 701398 702774 696945 758393 777117
19978 777117 769599 763869 776398 810729 861912 906153 913483 893371 962542 1028565 1070587 1150804
19966 1150804 1305133 1544484 1839774 2067500 2083953 1922225 1785831 1687415 1638710 1611342
19956 1611342 1662675 1785358 1907100 2004787 2126748 2301550 2526014 2833686 3216110 3668284
19946 3668284 4041869 4291403 4535196 4857075 5201081 5523742 5740214 5969011 6359638
19937 6359638 6941496 7783817 9132806 11324808 14692831 19445137 24946295 30312764
$$ packed form
20014C93817R662J9656K7068R408j1826k8533J0227L4892j2762n273K0226k8739
20002D37823k6950l3865K7061J0431n187L1637K1170J0145J5282J3184J6067J679
19990E18477p153J9448O5045O4492J8260j7164K4747J5246J376n829O1448J8724
19978G77117p518n730J2529L4331N1183M4241P330k0112O9171O6023M2022Q0217
19966A150804J54329K39351K95290K27726J6453j61728j36394r8416m8705k7368
19956A611342N1333J22683J21742R7687J21961J74802K24464L07672L82424M52174
19946C668284L73585K49534K43793L21879L44006L22661K16472K28797L90627
19937F359638N81858Q42321J348989K192002L368023M752306N501158N366469
$$ plain form
19929 30312764 34315585 35274939 33808566 31880617 31214800 33790641 41398087 56744185
19921 56744185 83428195 121778361 164981175 205993131 230167087 229181586 213805719
19914 213805719 189015943 157128622 124968902 97425429 76739142 65895026 64514879
19907 64514879 69319120 75832925 79422705 75221365 64401056 51100515 38360971 28471577
19899 28471577 21825861 17633740 15029480 13491586 12619972 12158899 11949834 11813648 11837164
19890 11837164 12030433 12321584 12626422 12848366 12938166 13070365 13501048 14605114 16704996
19881 16704996 20418105 26642534 36367544 49396473 63373279 75141055 79943908 76500236
19873 76500236 69308185 62949279 62290263 71071602 90686725 119180326 154344162 191987907
$$ packed form
19929C0312764M002821R59354j466373j927949o65817K575841P607446J5346098
19921E6744185K6684010L8350166M3202814M1011956K4173956r85501j5375867
19914B13805719k4789776l1887321l2159720k7543473k0686287j0844116j380147
19907F4514879M804241O513805L589780m201340j0820309j3300541j2739544r889394
19899B8471577o645716m192121k604260j537894q71614m61073k09065j36186K3516
19890A1837164J93269K91151L04838K21944Q9800J32199M30683J104066K099882
19881A6704996L713109O224429R725010J3028929J3976806J1767776M802853l443672
19873G6500236p192051o358906o59016Q781339J9615123K8493601L5163836L7643745
$$ plain form
19865 191987907 223269878 245099188 252251176 231907594 191121217 145556743 102955394
19858 102955394 71749942 52640320 42376776 38194901 38014103 39497026 40711113 39316306
19850 39316306 34466742 28120381 21697484 16460805 12807378 10479373 8999985 8045489
19842 8045489 7372295 6830045 6425752 6101146 5747318 5389600 5002442 4651567 4420075
19833 4420075 4175832 3906892 3600517 3234927 2769170 2380876 2130215 1914140 1789194
19824 1789194 1705179 1619261 1634270 1684892 1709860 1703760 1607684 1480490 1337345 1211929 1084721
19813 1084721 1010186 920259 864342 867370 841926 817386 829803 809420 773050 732192 662440
19802 662440 601627 567967 597581 585684 543962 523702 533413 552378 548758 513811 535303 584022
$$ packed form
19865A91987907L1281971K1829310P151988k0343582m0786377m5564474m2601349
19858A02955394l1205452j9109622j0263544m181875j80798J482923J214087j394807
19850C9316306m849564o346361o422897n236679l653427k328005j479388r54496
19842H045489o73194n42250m04293l24606l53828l57718l87158l50875k31492
19833D420075k44243k68940l06375l65590m65757l88294k50661k16075j24946
19824A789194q4015q5918J5009N0622K4968o100r6076j27194j43145j25416j27208
19813A084721p4535q9927n5917L028k5444k4540J2417k0383l6370m0858o9752
19802F62440o0813l3660K9614j1897m1722k0260R711J8965l620l4947K1492M8719
$$ plain form
19790 584022 614131 608333 597020 546412 518551 445199 413747 393669 366897 381118 426049 468900
19778 468900 466870 469300 449642 423186 382943 391782 390587 393320 449340 490723 539151 629267
19766 629267 710103 727215 679131 552580 430929 339778 272160 228224 179842 194567 212112
19755 212112 247049 269675 270266 284262 301322 270394 264763 260906 240916 203035 192224 204103
19743 204103 188341 218285 256274 294111 308834 323856 360907 352549 340231 265914 200403 160885
19731 160885 162510 144169 103136 73651 60824 65781 102867 67690 33727 49056 64895 45330
19719 45330 19675 4786 22161 10025 -7382 3893 -15693 -8709 10373 24498 21655 54649
19707 54649 78923 51364 9902 17557 10311 34528 60745 70398 77320 65625 87941 91563 108818
$$ packed form
19790E84022L0109n798j1313n0608k7861p3352l1452k0078k6772J4221M4931M2851
19778D68900k030K430j9658k6456m0243Q839j195K733N6020M1383M8428R0116
19766F29267Q0836J7112m8084j26551j21651r1151o7618m3936m8382J4725J7545
19755B12112L4937K2626N91J3996J7060l0928n631l857j9990l7881j0811J1879
19743B04103j5762K9944L7989L7837J4723J5022L7051q358j2318p4317o5511l9518
19731A60885J625j8341m1033k9485j2827M957L7086l5177l3963J5329J5839j9565
19719D5330k5655j4889J7375j2136j7407J1275j9586O984J9082J4125k843L2994
19707E4649K4274k7559m1462P655p246K4217K6217R653O922j1695K2316L622J7255
$$ plain form
19694 108818 101688 119009 121166 85137 35826 3718 24036 78909 83086 71933 49965 33902
19682 33902 23915 29686 26848 38356 22554 22436 17797 42076 47548 41852 21848 19079 18170 13966
19668 13966 -6039 -3291 37947 67775 65333 43415 26702 20117 -32613 -13575 -10924 8904
19656 8904 5777 -845 24545 25595 14733 -26350 -40424 -1031 11321 80456 95134 63145
19644 63145 68466 71441 86892 67613 43438 10771 -25518 -43955 -25012 -12397 -9711 17749
19632 17749 50355 69066 72309 82155 90911 34469 14539 14921 59564 108911 105327 77625 60952
19619 60952 70606 82852 79072 103631 85333 76873 62880 34567 34295 22860 1099 36478 66360
19606 66360 29811 -23538 -44931 -34828 -25327 -1007 51281 58216 53909 40521 50295 64303
$$ packed form
19694A08818p130J7321K157l6029m9311l2108K0318N4873M177j1153k1968j6063
19682C3902r987N771k838J1508j5802j18m639K4279N472n696k0004k769r09m204
19668A3966k0005K748M1238K9828k442k1918j6713o585n2730J9038K651J9828
19656H904l127o622K5390J050j0862m1083j4074L9393J2352O9135J4678l1989
19644F3145N321K975J5451j9279k4175l2667l6289j8437J8943J2615K686K7460
19632A7749L2606J8711L243R846Q756n6442j9930L82M4643M9347l584k7702j6673
19619F0952R654J2246l780K4559j8298q460j3993k8313k72j1435k1761L5379K9882
19606F6360l6549n3349k1393J0103R501K4320N2288O935m307j3388R774J4008
$$ plain form
19594 64303 37015 11836 13655 -12338 -16624 7670 -8165 -16397 22516 34491 16070 33798
19582 33798 65216 54393 39840 11931 13793 -16273 6034 29461 16005 19547 15232 19223
19570 19223 17139 -31948 -39581 -60551 -34494 -28103 -47007 -43444 -55309 -44396 -22210 -4562
19558 -4562 -2299 -63378 -105998 -72969 -41401 1553 21068 -15795 -32279 -51573 -64219 -75592
19546 -75592 -51100 -39366 -75540 -91298 -58862 -61784 -33975 -6961 -30764 -56246 -69818 -78459
19534 -78459 -93514 -97237 -19607 15152 -8659 -28732 -31286 -31548 -20290 -27889 -35121 -56486 -68120
19521 -68120 -45453 -38828 -25808 -26693 -28060 -27736 -8122 -21972 -37421 -56526 -38152 -23051 17526
19508 17526 33229 44512 -6020 -63895 -60620 -49178 -67463 -71343 -75231 -63151 -54212 -45743 -32058
$$ packed form
19594F4303k7288k5179J819k5993m286K4294j5835q232L8913J1975j8421J7728
19582C3798L1418j0823j4553k7909J862l0066K2307K3427j3456L542m315L991
19570A9223k084m9087p633k0970K6057O391j8904L563j1865J0913K2186J7648
19558d562K263o1079m2620L3029L1568M2954J9515l6863j6484j9294j2646j1373
19546g5592K4492J1734l6174j5758L2436k922K7809K7014k3803k5482j3572q641
19534g8459j5055l723P7630L4759k3811k0073k554k62J1258p599p232k1365j1634
19521f8120K2667O625J3020q85j367L24J9614j3850j5449j9105J8374J5101M0577
19508A7526J5703J1283n0532n7875L275J1442j8285l880l888J2080Q939Q469J3685
$$ plain form
19495 -32058 -20539 -51816 -44927 -40639 -65092 -116907 -138832 -54313 6566 14197 12012 4651 -4634
19482 -4634 -41428 -78554 -72786 -58742 -45970 -48707 -42011 -4973 1288 23754 70949 81938 48609
19469 48609 13460 44583 37462 881 -45591 -45761 -5981 297 -25895 -43125 -33511 -40750 -12251
19456 -12251 525 346 11558 24110 22888 -28948 -30400 -16054 -34385 -33279 22632 43311 27149
19443 27149 9452 5540 8605 9228 38820 38363 -10360 -45022 -42948 -41031 -10880 15743 49203
19430 49203 80673 76029 69162 35836 -30644 -575 35188 38494 16913 26005 86602 118589
19418 118589 123021 164667 153313 142556 174158 204823 260680 312108 390135 503962 564684
19407 564684 600118 603742 594379 578423 607242 624041 651946 672558 729880 785792 853640 848148
$$ packed form
19495c2058J1519l1277O889M288k4453n1815k1925Q4519O0879P631k185p361r285
19482d634l6794l7126N768J4044J2772k737O696L7038O261K2466M7195J0989l3329
19469D8609l5149L1123p121l6581m6472j70L9780O278k6192j7230R614p239K8499
19456a2251J2776j79J1212J2552j222n1836j452J4346j8331J106N5911K0679j6162
19443B7149j7697l912L065O23K9592m57m8723l4662K074J917L0151K6623L3460
19430D9203L1470m644o867l3326o6480L0069L5763L306k1581R092O0597L1987
19418A18589M432M1646j1354j0757L1602L0665N5857N1428P8027J13827O0722
19407E64684L5434L624r363j5956K8819J6799K7905K0612N7322N5912O7848n492
$$ plain form
19395 848148 734895 591579 467997 354400 283545 264439 241224 235710 218723 199003 173655
19384 173655 174855 160808 180674 198216 159418 151715 139493 121975 99132 90012 67820 24802
19372 24802 29585 35723 65606 98251 144403 169448 180271 190330 198201 260833 349233 461153
19360 461153 596155 663836 711721 735723 709060 707389 737408 727908 639509 533973 459361
19349 459361 379435 294294 310395 392859 503792 634496 761907 886928 910987 791409
19339 791409 632892 488004 330301 224293 148378 137833 128763 110271 106496 124653 106672
19328 106672 125670 113503 38956 16210 12816 26052 24672 1844 20131 43143 54420 20963
19316 20963 -3827 -13325 -3583 -932 13819 25351 -16853 -23408 -61833 -32718 -22309 -29533 -60454
$$ packed form
19395H48148j13253j43316j23582j13597p0855j9106k3215n514j6987j9720k5348
19384A73655J200j4047J9866J7542l8798p703j2222j7518k2843r120k2192m3018
19372B4802M783O138K9883L2645M6152K5045J0823J0059P871O2632Q8400J11920
19360D61153J35002O7681M7885K4002k6663j671L0019r500q8399j05536p4612
19349D59361p9926q5141J6101Q2464J10933J30704J27411J25021K4059j19578
19339G91409j58517j44888j57703j06008p5915j0545r070j8492l775J8157j7981
19328A06672J8998j2167p4547k2746l394J3236j380k2828J8287K3012J1277l3457
19316B0963k4790r498R742K651J4751J1532m2204o555l8425K9115J0409p224l0921
$$ plain form
19303 -60454 -28883 -1709 2108 -20300 -25184 -47359 -70077 -68358 -69922 -37929 25569 36891
19291 36891 66613 65255 52301 11733 27773 18355 8844 -7222 4207 37878 30538 5665
19279 5665 -26623 13793 4389 -4613 -31807 -37303 -48397 -64680 -71397 -84335 -63385 -12409 122
19266 122 7340 12130 -10220 -49341 -34829 -30794 -35896 -58514 -59431 -60836 -67660 -40942 14660 18781
19252 18781 19525 16911 14006 11247 -624 18454 21366 -3590 -45441 -47469 -33662 -64840 -70506
19239 -70506 -35384 -15290 -8246 -405 -9729 -18976 3858 6051 3902 -5320 27031 39950 47392
19226 47392 84618 59811 20711 11820 25098 -14233 -31957 -6829 -8102 -26890 25140 52866
19214 52866 49521 12205 593 35649 68175 64416 26333 -11479 -5038 18581 -4108 -32273
$$ packed form
19303f0454L1571K7174L817k2408m884k2175k2718J719j564L1993O3498J1322
19291C6891K9722j358j2954m0568J6040r418r511j6066J1429L3671p340k4873
19279E665l2288M0416r404r002k7194n496j1094j6283o717j2938K0950N0976J2531
19266A22P218M790k2350l9121J4512M035n102k2618r17j405o824K6718N5602M121
19252A8781P44k614k905k759j1871J9078K912k4956m1851k028J3807l1178n666
19239g0506L5122K0094P044P841r324r247K2834K193k149r222L2351J2919P442
19226D7392L7226k4807l9100q891J3278l9331j7724K5128j273j8788N2030K7726
19214E2866l345l7316j1612L5056L2526l759l8083l7812O441K3619k2689k8165
$$ plain form
19202 -32273 -42957 -86111 -46901 -22818 -9728 -11832 -793 18294 36085 58476 51837 43415
19190 43415 34355 -4720 -31638 -25101 -2899 -17903 -723 31568 34108 40203 23350 11567
19178 11567 4681 -3574 -11345 -19583 -11928 -7330 -938 -21102 28616 83072 37477 19118 -5957
19165 -5957 13509 32498 42177 43919 75230 62679 59158 35990 17593 15134 15568 3431 19448
19152 19448 14328 -21702 -52806 -17761 16577 30679 1521 5831 17598 45754 97726 119316
19140 119316 52645 32771 24073 22895 59476 75561 43953 18069 14844 -14298 511 49917
19128 49917 19109 24562 21287 21833 72538 101285 100365 49736 38396 75016 95705 54760 63483
19115 63483 59739 51999 60980 39257 38960 39262 69391 118475 114581 73651 68195 54021 19863
$$ packed form
19202c2273j0684m3154L9210K4083J3090k104J1039J9087J7791K2391o639q422
19190D3415r060l9075k6918O537K2202j5004J7180L2291K540O095j6853j1783
19178A1567o886q255p771q238P655M598O392k0164M9718N4456m5595j8359k5075
19165e957J9466J8989R679J742L1311j2551l521k3168j8397k459M34j2137J6017
19152A9448n120l6030l1104L5045L4338J4102k9158M310J1767K8156N1972K1590
19140A19316o6671j9874q698j178L6581J6085l1608k5884l225k9142J4809M9406
19128D9917l0808N453l275N46N0705K8747r20n0629j1340L6620K0689m0945Q723
19115F3483l744p740Q981k1723k97L02L0129M9084l894m0930n456j4174l4158
$$ plain form
19102 19863 30483 36977 73895 52960 26838 22256 47713 13049 -7035 -10703 -20068 -17757 -11160
19089 -11160 40717 54670 23134 45151 51514 43298 889 -32560 8839 33329 69015 84698
19077 84698 69236 67686 67657 92723 55729 18224 10938 6704 26362 45217 40482 34127 9301
19064 9301 -13614 -12272 35923 55461 45743 69856 83434 24602 12885 56509 82152 91494
19052 91494 62518 48909 43747 44521 29652 -77 19680 39315 75667 85143 93999 77452 85175
19039 85175 55928 5618 23760 41633 37748 33113 70041 99845 78466 66161 64297 68849
19027 68849 59947 54207 53027 47881 31797 38614 31024 18390 -15290 -29964 15248 42185 24476
19014 24476 32246 61960 45974 38793 69450 54567 13517 -10679 14040 26623 17842 1669
$$ packed form
19102A9863J0620O494L6918k0935k6122m582K5457l4664k0084l668r365K311O597
19089a1160N1877J3953l1536K2017O363q216m2409l3449M1399K4490L5686J5683
19077H4698j5462j550k9K5066l6994l7505p286m234J9658J8855m735o355k4826
19064I301k2915J342M8195J9538r718K4113J3578n8832j1717M3624K5643R342
19052I1494k8976j3609n162P74j4869k9729J9757J9635L6352R476Q856j6547P723
19039H5175k9247n0310J8142J7873l885m635L6928K9804k1379j2305j864M552
19027F8849q902n740j180n146j6084O817p590j2634l3680j4674M5212K6937j7709
19014B4476P770K9714j5986p181L0657j4883m1050k4196K4719J2583q781j6173
$$ plain form
19002 1669 -10326 362 543 -16418 32500 47803 79628 77633 78077 71962 61036 33010 28273
18989 28273 7602 -8558 11972 24538 51146 41511 32913 31006 47944 65668 57961 36495
18977 36495 37445 29124 36472 92918 121888 96829 75166 87879 111156 123000 157515 154379 142803
18964 142803 133743 114177 107470 89840 121352 187059 255937 336678 423375 467216 490937 570672
18952 570672 677272 735532 705501 636227 609235 599562 595279 617721 616248 664720 690233 686604
18940 686604 718224 748374 769687 705883 676579 647223 614812 585455 537197 488832 410226
18929 410226 360882 292363 242558 237049 264642 232500 219678 221549 196347 184882 188821 171614
18917 171614 179284 183424 167634 160860 150806 188432 196227 220411 240795 253839 229518 234981
$$ packed form
19002A669j1995J0688J81j6961M8918J5303L1825j995M44o115j0926k8026m737
18989B8273k0671j6160K0530J2566K6608r635q598j907J6938J7724p707k1466
18977C6495R50q321P348N6446K8970k5059k1663J2713K3277J1844L4515l136j1576
18964A42803r060j9566o707j7630L1512O5707O8878Q0741Q6697M3841K3721P9735
18952E70672J06600N8260l0031o9274k6992r673m283K2442j473M8472K5513l629
18940F86604L1620L0150K1313o3804k9304k9356l2411k9357m8258m8365p8606
18929D10226m9344o8519m9805n509K7593l2142j2822J871k5202j1465L939j7207
18917A71614P670M140j5790o774j0054L7626P795K4184K0384J3044k4321N463
$$ plain form
18905 234981 277303 301176 322485 355477 420932 474137 532010 585934 654977 737294 768825
18894 768825 762052 780543 803051 855433 852136 782545 732192 646337 598202 625586 615723 549338
18882 549338 473057 417766 371991 329873 314634 282102 261979 242143 241241 255018 253904 237255
18870 237255 202855 171240 130319 81620 59962 47379 43799 76009 112884 112845 106177 88902
18858 88902 88136 90208 123238 119243 103607 66156 39249 37072 68774 92163 101640 114208 101674
18845 101674 74671 91593 102787 122079 123795 104731 83233 131147 161144 145873 112934 90567
18833 90567 94803 93236 88399 122918 176324 162602 150444 135458 109992 99411 104684 136330
18821 136330 162275 163514 162423 153133 163042 175368 154214 136409 114834 96848 78093 108630
$$ packed form
18905B34981M2322K3873K1309L2992O5455N3205N7873N3924O9043Q2317L1531
18894G68825o773J8491K2508N2382l297o9591n0353q5855m8135K7384r863o6385
18882E49338p6281n5291m5775m2118j5239l2532k0123j9836r02J3777j114j6649
18870B37255l4400l1615m0921m8699k1658j2583l580L2210L6875l9o668j7275
18858H8902p66K072L3030l995j5636l7451k6907k177L1702K3389R477J2568j2534
18845A01674k7003J6922J1194J9292J716j9064k1498M7914K9997j5271l2939k2367
18833I0567M236j567m837L4519N3406j3722j2158j4986k5466j0581N273L1646
18821A36330K5945J239j091r290R909J2326k1154j7805k1575j7986j8755L0537
$$ plain form
18809 108630 110589 120376 115227 70877 88676 107423 149243 156368 133980 109129 80877 37044
18797 37044 40994 88528 121129 77771 62802 105175 124496 141880 148632 142627 129713 111365
18785 111365 121967 123504 138568 126533 126536 144726 162538 211018 226297 199189 185145 185389 192952
18772 192952 199958 272623 333136 422252 525641 714645 850160 721605 554270 446500
18762 446500 359355 320345 292669 315777 332396 320573 326811 329317 318733 300113 238341 263298
18750 263298 262620 239318 200200 202695 211211 186936 181971 129448 137879 163311 150484 132943 138005
18737 138005 137332 142587 163826 181875 191890 199019 185838 181040 185225 207025 225269 217408 214031
18724 214031 186823 184588 217734 253034 261480 287949 327577 337993 344182 385412 444294 421466
$$ packed form
18809A08630J959R787n149m4350J7799J8747M1820P125k2388k4851k8252m3833
18797C7044L950M7534L2601m3358j4969M2373J9321J7384O752o005j2914j8348
18785A11365J0602J537J5064j2035LJ8190J7812M8480J5279k7108j4044K44P563
18772A92952P006P2665O0513Q9116J03389J89004J35515j28555j67335j07770
18762D46500q7145l9010k7676K3108J6619j1823O238K506j0584j8620o1772K4957
18750B63298o78k3302l9118K495Q516k4275m965n2523Q431K5432j2827j7541N062
18737A38005o73N255K1239J8049J0015P129j3181m798M185K1800J8244p861l377
18724B14031k7208k235L3146L5300Q446K6469L9628J0416O189M1230N8882k2828
$$ plain form
18712 421466 380987 346816 285932 276759 296615 292522 345876 412205 491141 515283 462522 432244
18700 432244 430994 452786 442719 428196 375741 382731 398761 401021 452509 447974 401781 407602
18688 407602 380519 369498 338887 325970 332443 381945 392411 411409 424812 369164 321019 298099
18676 298099 271474 249041 228369 191292 202441 273177 307237 289701 264014 218335 205905
18665 205905 209907 244658 286991 312793 332997 367644 367901 336630 331934 354278 380988 369420
18653 369420 397523 431352 451168 468345 501346 530088 508593 484877 493008 539835 589029 618319
18641 618319 642585 738792 832144 885785 901569 827359 779438 827323 957444 1120521 1325321
18630 1325321 1559669 1781501 1847677 1747758 1586621 1496797 1519434 1624041 1973467 2680489
$$ packed form
18712D21466m0479l4171o0884r173J9856m093N3354O6329P8936K4142n2761l0278
18700D32244j250K1792j0067j4523n2455O990J6030K260N1488m535m6193N821
18688D07602k7083j1021l0611j2917O473M9502J0466J8998J3403n5648m8145k2920
18676B98099k6625k2433k0672l7077J1149P0736L4060j7536k5687m5679j2430
18665B05905M002L4751M2333K5802K0204L4647K57l1271m696K2344K6710j1568
18653C69420K8103L3829J9816J7177L3001K8742k1495k3716Q131M6827M9194K9290
18641F18319K4266R6207R3352N3641J5784p4210m7921M7885J30121J63077K04800
18630A325321K34348K21832O6176r9919j61137q9824K2637J04607L49426P07022
$$ plain form
18620 2680489 3769115 5272215 6959204 8332991 8887578 8648499 7988665 7179087 6155425
18611 6155425 5063065 4076606 3383308 3035028 3027117 3261332 3518455 3633609 3395052 2895469
18601 2895469 2379163 1871454 1493041 1249533 1156870 1086282 1027650 994942 990654 1027555 1076354
18590 1076354 1100663 1069510 1107052 1148130 1165469 1238165 1281637 1413356 1635676 1891212 2255624
18579 2255624 2787618 3492638 4162591 4519916 4438925 4050759 3676171 3490168 3600304 4096313
18569 4096313 5139620 6718000 8710736 10893419 12833991 14171749 14532781 13455150
18561 13455150 11228135 8623394 6310708 4681081 3670372 3062345 2802309 2775495 2826802
18552 2826802 2890941 2855012 2571625 2222093 1900662 1616958 1401486 1272967 1202954 1146940
$$ packed form
18620B680489J088626J503100J686989J373787N54587k39079o59834q09578j023662
18611F155425j092360r86459o93298l48280p911K34215K57123J15154k38557m99583
18601B895469n16306n07709l78413k43508r2663p0588n8632l2708m288L6901M8799
18590A076354K4309l1153L7542M1078J7339P2696M3472J31719K22320K55536L64412
18579B255624N31994P05020O69953L57325q0991l88166l74588j86003J10136M96009
18569D096313J043307J578380J992736K182683J940572J337758L61032j077631
18561A3455150k227015k604741k312686j629627j010709o08027k60036k6814N1307
18552B826802O4139l5929k83387l49532l21431k83704k15472j28519p0013n6014
$$ plain form
18542 1146940 1058852 1052838 1089921 1127694 1154684 1216835 1325289 1459446 1569345 1517241 1363916
18531 1363916 1211866 1062458 979550 893329 879536 876610 863097 903371 895506 886579 876785 882203
18519 882203 892207 939757 984426 998315 1007450 1018008 1038776 1018791 1028545 1056220 1065066 1122066
18507 1122066 1192005 1334078 1585044 1859174 2034689 2023708 1879300 1712744 1555795 1430771
18497 1430771 1313493 1274351 1286753 1324538 1359900 1385576 1405986 1497403 1616327 1705170 1789219
18486 1789219 1875702 1954148 2028741 2134067 2254251 2406377 2572688 2825298 3146254 3545606
18476 3545606 4045737 4635313 5249721 5818372 6263371 6598021 6859806 7006261 7177676
18467 7177676 7644995 8450760 9612522 11347735 13986304 17433819 20465704 22450512
$$ packed form
18542A146940q8088o014L7083L7773K6990O2151J08454J34157J09899n2104j53325
18531A363916j52050j49408q2908q6221j3793k926j3513M0274p865q927r794N418
18519H82203J0004M7550M4669J3889R135J0558K0768j9985R754K7675Q846N7000
18507A122066O9939J42073K50966K74130J75515j0981j44408j66556j56949j25024
18497A430771j17278l9142J2402L7785L5362K5676K0410R1417J18924Q8843Q4049
18486A789219Q6483P8446P4593J05326J20184J52126J66311K52610L20956L99352
18476C545606N00131N89576O14408N68651M44999L34650K61785J46455J71415
18467G177676M67319Q05765J161762J735213K638569L447515L031885J984808
$$ plain form
18459 22450512 25066216 29431959 33794344 35186859 35826845 39741979 48655223 63256662
18451 63256662 83694543 104064973 117492894 134863349 166479873 197857754 200030957
18444 200030957 184076627 179332560 179958305 164218765 137104453 116551457 105038161
18437 105038161 93603005 80718920 72615570 71265893 71287807 65377398 56050449 49032009
18429 49032009 44364042 38855531 31729441 25176733 20384343 17319407 15477222 14419443
18421 14419443 13771696 13503263 13444615 13254053 12942316 12846197 12992740 13381417 14178941 15843424
18411 15843424 18834887 23687340 30273676 36752812 41254493 45840093 53498783 62542153
18403 62542153 66676591 66350312 69362090 78888645 90357123 99071117 112252336 136408115
$$ packed form
18459B2450512K615704M365743M362385J392515O39986L915134Q913244J4601439
18451F3256662K0437881K0370430J3427921J7370455L1616524L1377881K173203
18444B00030957j5954330m744067O25745j5739540k7114312k0552996j1513296
18437A05038161j1435156j2884085q103350j349677K1914n910409r326949p018440
18429D9032009m667967n508511p126090o552708m792390l064936j842185j057779
18421A4419443o47747k68433n8648j90562l11737r6119J46543L88677P97524J664483
18411A5843424K991463M852453O586336O479136M501681M585600P658690R043370
18403F2542153M134438l26279L011778R526555J1468478Q713994J3181219K4155779
$$ plain form
18395 136408115 160102349 165907519 165035122 177958778 192824222 179156328 147651688
18388 147651688 124600668 112144901 97074420 76871931 59900978 48504742 42257286
18381 42257286 40452187 40689518 39502549 36695805 34318907 32126142 29274544 25710604
18373 25710604 22010354 18456356 15421475 13162208 11520120 10293769 9318293 8471800
18365 8471800 7862725 7530749 7111166 6398046 5739494 5135405 4542758 3938746 3403472
18356 3403472 3007195 2723471 2470170 2265176 2115660 2011442 1871572 1803622 1767338 1723276
18346 1723276 1684752 1686312 1700214 1742194 1839823 2033717 2277158 2503890 2758708 3095497
18336 3095497 3396147 3510994 3518001 3599412 3877785 4213308 4510442 4941798 5739295 6634766
$$ packed form
18395A36408115K3694234N805170q72397J2923656J4865444j3667894l1504640
18388A47651688k3051020j2455767j5070481k0202489j6970953j1396236o247456
18381D2257286j805099K37331j186969k806744k376898k192765k851598l563940
18373B5710604l700250l553998l034881k259267j642088j226351r75476q46493
18365H471800o09075l31976m19583p13120o58552o04089n92647o04012n35274
18356C403472l96277k83724k53301k04994j49516j04218j39870o7950l6284m4062
18346A723276l8524J560J3902M1980R7629J93894K43441K26732K54818L36789
18336C095497L00650J14847P007Q1411K78373L35523K97134M31356P97497Q95471
$$ plain form
18326 6634766 7019408 7105743 7484294 7876348 7420030 6363392 5460190 4827110 4075367
18317 4075367 3300025 2683050 2224533 1929971 1765297 1696017 1615286 1504872 1391405 1233882
18307 1233882 1111180 989883 860223 758468 700123 660191 571291 508703 477557 448249
18297 448249 427531 416405 422084 428702 399400 393584 413102 412993 386022 379877 376957 389700 446500
18284 446500 423131 398498 370424 337697 291648 279641 295480 307274 317997 372710 373333 361124
18272 361124 342305 324189 329417 386439 426616 442399 489336 526529 536405 514767 525918 582858
18260 582858 606083 587469 576589 537355 474175 380923 308975 282067 283910 264803 216188 191395
18248 191395 231191 248920 236993 263080 245000 206331 180943 194832 215152 235810 274315
$$ packed form
18326F634766L84642Q6335L78551L92054m56318j056638r03202o33080p51743
18317D075367p75342o16975m58517k94562j64674o9280q0731j10414j13467j57523
18307A233882j22702j21297j29660j01755n8345l9932q8900o2588l1146k9308
18297D48249k0718j1126N679O618k9302n816J9518j09k6971o145k920J2743N6800
18284D46500k3369k4633k8074l2727m6049j2007J5839J1794J0723N4713O23j2209
18272C61124j8819j8116N228N7022M0177J5783M6937L7193R876k1638J1151N6940
18260E82858K3225j8614j0880l9234o3180r3252p1948k6908J843j9107m8615k4793
18248A91395L9796J7729j1927K6087j8080l8669k5388J3889K0320K0658L8505
$$ plain form
18237 274315 296869 314688 314407 333737 334688 303671 265863 288457 307251 323360 354727 384137
18225 384137 371564 335956 343027 364950 355709 353866 393889 438328 433205 404175 409490 408169 408935
18212 408935 408330 420794 444008 478940 522471 558816 631386 657138 699364 728973 774368 888308
18200 888308 1119337 1405638 1633140 1682223 1538481 1190230 841481 608998 509374 442743
18190 442743 372466 362719 383397 370138 384680 369993 388690 372278 292950 243981 241233 259538
18178 259538 267417 240545 199522 206538 250814 295369 315028 298327 290105 305365 331892 333804
18166 333804 331022 344949 367409 367366 369995 374589 373058 400689 441969 486948 535845 534964 556679
18153 556679 553255 522792 541983 607639 691249 720514 764828 808970 800331 758976 712238 687173
$$ packed form
18237B74315K2554J7819k81J9330R51l1017l7808K2594J8794J6109L1367K9410
18225C84137j2573l5608P071K1923r241j843M0023M4439n123k9030N315j321P66
18212D08935o05J2464K3214L4932M3531L6345P2570K5752M2226K9609M5395J13940
18200H88308K31029K86301K27502M9083j43742l48251l48749k32483r9624o6631
18190D42743p0277r747K0678j3259J4542j4687J8697j6412p9328m8969k748J8305
18178B59538P879k6872m1023P016M4276M4555J9659j6701q222J5260K6527J912
18166C33804k782J3927K2460m3K629M594j531K7631M1280M4979M8897q81K1715
18153E56679l424l0463J9191O5656Q3610K9265M4314M4142q639m1355m6738k5065
$$ plain form
18141 687173 635766 588926 583926 598355 645977 626593 570834 589386 637377 715072 770702 801459
18129 801459 835604 919682 1004987 1044919 1113858 1160602 1256477 1379776 1545520 1760096 2050898
18118 2050898 2407483 2808149 3439169 4491290 6083091 8688318 13242826 22056346 39577475
18109 39577475 70103184 99726376 90327779 58127837 33929560 20431849 13355229
18102 13355229 9484339 7123767 5571320 4469061 3628390 2992636 2525397 2183311 1864835
18093 1864835 1585765 1366736 1196483 1048316 920297 837123 792134 719367 637308 627859
18083 627859 633761 587818 564248 552638 526787 534537 550218 514160 497301 457600 428252 440030
18071 440030 459159 432621 447254 468544 425673 418696 389169 349275 374588 379574 384536 377327
$$ packed form
18141F87173n1407m6840n000J4429M7622j9384n5759J8552M7991P7695N5630L0757
18129H01459L4145Q4078Q5305L9932O8939M6744R5875J23299J65744K14576K90802
18118B050898L56585M00666O31020J052121J591801K605227M554508Q813520J7521129
18109C9577475L0525709K9623192r398597l2199942k4198277j3497711p076620
18102A3355229l870890k360572j552447j102259q40671o35754m67239l42086l18476
18093A864835k79070k19029j70253j48167j28019q3174m4989p2767q2059r449
18083F27859N902m5943k3570j1610k5851P750J5681l6058j6859l9701k9348J1778
18071D40030J9129k6538J4633K1290m2871o977k9527l9894K5313M986M962p209
$$ plain form
18059 377327 371526 345467 332364 364267 420389 461810 482080 474090 468806 481625 505386 443861
18047 443861 428136 447025 475642 560012 652791 737929 770500 732170 667150 669523 706834 758325
18035 758325 778409 784524 798590 850032 896476 909858 935977 972298 1033862 1119837 1214472 1304510
18023 1304510 1446662 1620473 1803209 1965509 2159451 2372878 2626588 3035876 3621595
18014 3621595 4410020 5556735 7039982 8732219 10827671 14213032 20185265 30877615
18006 30877615 50294588 82487526 118115752 125289604 96780134 63046955 39981845
17999 39981845 26595463 18905726 14319669 11510960 9833460 8912185 8365495 7810497
17991 7810497 7175311 6625183 6289228 6217550 6376083 6757956 7475123 8561764 10151010
$$ packed form
18059C77327n801k6059j3103L1903N6122M1421K0270p990n284J2819K3761o1525
18047D43861j5725J8889K8617Q4370R2779Q5138L2571l8330o5020K373L7311N1491
18035G58325K0084O115J4066N1442M6444J3382K6119L6321O1564Q5975R4635R0038
18023A304510J42152J73811J82736J62300J93942K13427K53710M09288N85719
18014C621595P88425J146715J483247J692237K095452L385361N972233J0692350
18006C0877615J9416973L2192938L5628226P173852k8509470l3733179k3065110
17999C9981845j3386382p689737m586057k808709j677500r21275n46690n54998
17991G810497o35186n50128l35955p1678J58533L81873P17167J086641J589246
$$ plain form
17982 10151010 12475015 15555093 19015384 23448653 30976554 44456073 68722488 112079876
17974 112079876 178610793 237882785 231009616 168871062 108119506 68571227 45537733
17967 45537733 32110039 24097672 19188218 16135410 14279280 12949419 11439003 9764222
17959 9764222 8348262 7361502 6675550 6287803 6182586 6323926 6774717 7648539 9064313
17950 9064313 10825352 12505586 14598422 18546154 25899688 39308746 63320754 98046800
17942 98046800 122366250 109408105 75653373 47657494 30492288 20671844 14972288
17935 14972288 11583754 9473442 8107563 7264378 6572878 5691015 4714975 3811007 3123805
17926 3123805 2658073 2329484 2101212 1957647 1905579 1961151 2057998 2117563 1947554 1649365
$$ packed form
17982A0151010K324005L080078L460291M433269P527901J3479519K4266415M3357388
17974A12079876O6530917N9271992o873169o2138554o0751556l9548279k3033494
17967D5537733j3427694q012367m909454l052808j856130j329861j510416j674781
17959I764222j415960r86760o85952l87747j05217J41340M50791Q73822J415774
17950I064313J761039J680234K092836L947732P353534J3409058K4012008L4726046
17942I8046800K4319450j2958145l3754732k7995879j7165206r820444n699556
17935A4972288l388534k110312j365879q43185o91500q81863r76040r03968o87202
17926C123805m65732l28589k28272j43565n2068N5572R6847N9565j70009k98189
$$ plain form
17916 1649365 1374754 1170309 1005550 917488 863910 814738 751168 657224 595812 564636 572339
17905 572339 571390 586259 677738 816686 941221 1016398 1045944 1033396 1004407 982005 910514
17894 910514 874868 866520 849861 855282 827561 771848 698724 677650 649554 672507 705074 722639
17882 722639 781243 852679 876647 848529 782697 732629 638838 569523 510044 427999 326820
17871 326820 271543 241330 201169 118691 106893 91020 56611 89149 102892 64702 71287 55178
17859 55178 1383 -14571 -30745 -31673 -24281 -29461 -29874 -29678 8746 63108 119121 165425 182824
17846 182824 203114 186065 122142 49306 50732 47688 45305 71592 74649 42390 15846 23962
17834 23962 41202 51425 40933 39049 28263 55318 76532 12117 -3555 24451 37107 19656
$$ packed form
17916A649365k74611k04445j64759q8062n3578m9172o3570r3944o1412l1176P703
17905E72339r49J4869R1479J38948J24535P5177K9546j2548k8989k2402p1491
17894I10514l5646q348j6659N421k7721n5713p3124k1074k8096K2953L2567J7565
17882G22639N8604P1436K3968k8118o5832n0068r3791o9315n9479q2045j01179
17871C26820n5277l0213m0161q2478j1798j5873l4409L2538J3743l8190O585j6109
17859E5178n3795j5954j6174r28P392n180m13J96L8424N4362N6013M6304J7399
17846A82824K0290j7049o3923p2836J426l044k383K6287L057l2259k6544Q116
17834B3962J7240J0223j0492j884j0786K7055K1214o4415j5672K8006J2656j7451
$$ plain form
17822 19656 27767 -12502 -44234 -34156 10928 65062 84069 71986 39316 8961 -365 -20273
17810 -20273 -30610 15660 45354 -9007 -5821 -1068 2330 -38201 -43644 -50973 -86938 -106095 -117729
17797 -117729 -128864 -110760 -91051 -81297 -81654 -71817 -69977 -81673 -70009 -81137 -56116 -31617
17785 -31617 -37381 -18989 -1127 -27435 -52361 -52023 -79032 -106486 -87146 -30085 -8366 1788
17773 1788 54670 55416 45162 5784 -33657 -70109 -62612 -62871 -67506 -66043 -56760 -64768 -42449 -33730
17759 -33730 -31951 -21382 -46059 -28030 -41896 -63545 -26189 -69809 -72564 -74136 -66231 -78353
17747 -78353 -129142 -110809 -92153 -91241 -99805 -100456 -83020 -78000 -81846 -88527 -102922 -115794 -144202
17734 -144202 -128974 -102285 -116558 -90030 -29603 -15440 -45767 -72329 -69643 -53422 -59524 -85231
$$ packed form
17822A9656Q111m0269l1732J0078M5084N4134J9007j2083l2670l0355r326j9908
17810b0273j0337M6270K9694n4361L186M753L398m0531n443p329l5965j9157j1634
17797a17729j1135J8104J9709R754l57R837J840j1696J1664j1128K5021K4499
17785c1617n764J8392J7862k6308k4926L38k7009k7454J9340N7061K1719J0154
17773A788N2882P46j0254l9378l9441l6452P497k59m635J463R283q008K2319Q719
17759c3730J779J0569k4677J8029j3866k1649L7356m3620k755j572P905j2122
17747g8353n0789J8333J8656R12q564o51J7436N020l846o681j4395j2872k8408
17734a44202J5228K6689j4273K6528O0427J4163l0327k6562K686J6221o102k5707
$$ plain form
17722 -85231 -80738 -76558 -57553 -53659 -77942 -40597 5843 32116 42713 16939 13562 3461
17710 3461 -46024 -63120 -56991 -66012 -76121 -61214 -60849 -71987 -77657 -71904 -51375 -72843 -81375
17697 -81375 -68485 -38896 -14171 -17569 -14708 -35693 -49324 -61647 -74986 -50253 -21381 -46552
17685 -46552 -60800 -80346 -66043 -39998 -70001 -85060 -79991 -40481 -30197 -27142 -20635 -23852
17673 -23852 -57452 -70469 -77172 -80231 -93804 -111375 -85062 -63862 -17211 33467 -12001 -48839
17661 -48839 -79041 -73737 -77461 -49910 -48758 -96870 -97968 -123013 -90453 -42731 -52625 -73919 -53131
17648 -53131 -59924 -50966 -84111 -126938 -109437 -98663 -85301 -113037 -84466 -48441 -24974 2060
17636 2060 5439 12193 43980 54400 14729 -3529 18388 31816 -8028 -36132 -55187 -29854
$$ packed form
17722h5231M493M180J9005L894k4283L7345M6440K6273J0597k5774l377j0101
17710C461m9485j7096O129r021j0109J4907L65j1138n670N753K0529k1468q532
17697h1375J2890K9589K4725l398K861k0985j3631j2323j3339K4733K8872k5171
17685d6552j4248j9546J4303K6045l0003j5059N069L9510J0284L055O507l217
17673b3852l3600j3017o703l059j3573j7571K6313K1200M6651N0678m5468l6838
17661d8839l0202N304l724K7551J152m8112j098k5045L2560M7722r894k1294K0788
17648e3131o793Q958l3145m2827J7501J0774J3362k7736K8571L6025K3467K7034
17636B060L379O754L1787J0420l9671j8258K1917J3428l9844k8104j9055K5333
$$ plain form
17624 -29854 -12930 -4960 -45408 -56460 -33869 -25030 -30834 -21053 -14842 -18844 -16757 -35596 -44513
17611 -44513 -11014 13225 51495 6522 -62964 -87271 -88511 -62988 -51253 -55603 -64841 -31163
17599 -31163 -19303 -40060 -77713 -53982 -55494 -98140 -114979 -100355 -44029 -51322 -85399 -109574
17587 -109574 -128678 -106608 -121061 -125262 -110002 -109989 -113713 -111906 -73251 -43459 -46340 -74197 -56018
17574 -56018 -40669 -61088 -37552 -50266 -42595 -38220 -44752 -23061 -30138 -96213 -78499 -58625
17562 -58625 -31256 -36671 -79563 -60082 -44569 -59317 -63516 -79433 -93718 -98798 -101779 -132797
17550 -132797 -131498 -76913 -30787 -64307 -75795 -71973 -81628 -96584 -45753 -9945 -35389 -56741
17538 -56741 -64223 -29933 15236 5650 -50412 -85364 -83769 -71922 -51618 -23404 -28034 -42302
$$ packed form
17624b9854J6924P970m0448j1052K2591Q839n804R781O211m002K087j8839q917
17611d4513L3499K4239L8270m4973o9486k4307j240K5523J1735m350r238L3678
17599c1163J1860k0757l7653K3731j512m2646j6839J4624N6326p293l4077k4175
17587a09574j9104K2070j4453m201J5260J3l724J807L8655K9792k881k7857J8179
17574e6018J5349k0419K3536j2714P671M375o532K1691p077o6075J7714J9874
17562e8625K7369n415m2892J9481J5513j4748m199j5917j4285n080k981l1018
17550a32797J299N4585M6126l3520j1488L822r655j4956N0831L5808k5444k1352
17538e6741p482L4290M5169r586n6062l4952J595J1847K0304K8214m630j4268
$$ plain form
17526 -42302 -50730 -91221 -88559 -86957 -75470 -41860 -8858 -30159 -67213 -50494 -83036 -69861
17514 -69861 -59343 -80532 -53983 -37892 -34340 -20606 -69951 -75068 -71579 -57515 -38267 -27520
17502 -27520 -27073 -14766 -8527 -49715 -57077 -7825 19179 26020 1644 -30654 -28077 -1386 44389
17489 44389 7091 -65701 -72731 -61917 -79035 -84474 -39736 -61901 -97982 -56323 -8202 -16808
17477 -16808 -13165 3228 16330 8804 8529 67566 112088 145355 168549 244766 355061 489034
17465 489034 519606 432676 251435 181503 118953 59792 39685 11914 20003 31564 20820
17454 20820 -15027 831 13291 6968 21880 13167 20738 48139 103183 122452 213744 359935
17442 359935 576608 656315 599103 538658 596457 759917 984280 1099112 1001289 767134
$$ packed form
17526d2302q428m0491K662J602J1487L3610L3002k1301l7054J6719l2542J3175
17514f9861J0518k1189K6549J6091L552J3734m9345n117L489J4064J9248J0747
17502b7520M47J2307O239m1188p362M9252K7004O841k4376l2298K577K6691M5775
17489D4389l7298p2792p030J0814j7118n439M4738k2165l6081M1659M8121q606
17477a6808L643J6393J3102p526k75N9037M4522L3267K3194P6217J10295J33973
17465D89034L0572q6930j81241o9932o2550n9161k0107k7771Q089J1561j0744
17454B0820l5847J5858J2460o323J4912q713P571K7401N5044J9269R1292J46191
17442C59935K16673P9707n7212o0445N7799J63460K24363J14832r7823k34155
$$ plain form
17432 767134 523588 351309 229309 176897 143066 97256 75802 34979 -1928 -10268 1798
17421 1798 -35938 -23685 -9688 -1999 22881 23883 -7212 -54607 -34999 1171 39792 58180
17409 58180 95058 125690 170794 294757 464054 542825 473890 311465 195940 156768 120425
17398 120425 101449 63800 38254 -3401 13798 25843 18994 24444 -7818 -24518 6614 30739
17386 30739 71905 77000 46418 14141 -2797 -13689 -49803 -60052 -57046 -99330 -90698 -87814
17374 -87814 -91262 -114584 -103928 -80743 -83100 -70774 -90495 -49043 -50873 -35334 -7828 2830
17362 2830 -43367 -47797 11278 30884 30329 15728 4769 -13716 -50445 -59057 -77583 -90415 -116005
17349 -116005 -78348 -43606 -94882 -113904 -111697 -131261 -110775 -101094 -83835 -57815 -63058 -41177
$$ packed form
17432G67134k43546j72279j22000n2412l3831m5810k1454m0823l6907q340J2066
17421A798l7736J2253J3997P689K4880J002l1095m7395J9608L6170L8621J8388
17409E8180L6878L0632M5104J23963J69297P8771o8935j62425j15525l9172l6343
17398A20425j8976l7649k5546m1655J7199J2045o849N450l2262j6700L1132K4125
17386C0739M1166N095l0582l2277j6938j0892l6114j0249L006m2284Q632K884
17374h7814l448k3322J0656K3185k357J2326j9721M1452j830J5539K7506J0658
17362B830m6197m430N9075J9606n55j4601j0959j8485l6729q612j8526j2832k5590
17349a16005L7657L4742n1276j9022K207j9564K0486R681J7259K6020n243K1881
$$ plain form
17337 -41177 -28578 -40542 -24578 -12906 2463 -15235 -50026 -45731 -28181 -21299 -24391 -9539
17325 -9539 -28164 -30707 -39684 -15643 5538 -17024 -10611 -10861 4862 12226 -22668 -55125 -49492
17312 -49492 -76720 -115235 -97888 -75464 -61197 -30686 7722 17737 -24664 -35253 -40529 -29634
17300 -29634 9316 -3481 -39675 -78946 -95958 -82142 -73440 -44032 -37988 -54000 -65379 -78662
17288 -78662 -70406 -76912 -91489 -114640 -77535 -31189 -11520 -54112 -90301 -63717 -23351 -14010
17276 -14010 -29195 -27211 -35664 -49054 -53986 -62645 -80281 -92831 -93501 -116949 -121290 -97408 -69481
17263 -69481 -70799 -54721 -52377 -33040 -24151 4410 -30514 -44270 -56759 -61899 -63668 -63378 -11960
17250 -11960 26554 16937 -11336 -43786 -73793 -19542 5227 -22726 -18060 8613 35320 44
$$ packed form
17337d1177J2599j1964J5964J1672J5369j7698l4791M295J7550O882l092J4852
17325i539j8625k543q977K4041K1181k2562O413k50J5723P364l4894l2457N633
17312d9492k7228l8515J7347K2424J4267L0511L8408J0015m2401j0589n276J0895
17300b9634L8950j2797l6194l9271j7012J3816Q702K9408O044j6012j1379j3283
17288g8662Q256o506j4577k3151L7105M6346J9669m2592l6189K6584M0366R341
17276a4010j5185J984q453j3390m932q659j7636j2550o70k3448m341K3882K7927
17263f9481j318J6078K344J9337Q889K8561l4924j3756j2489n140j769K90N1418
17250a1960L8514r617k8273l2450l0007N4251K4769k7953M666K6673K6707l5276
$$ plain form
17238 44 -15643 -41534 -29341 -15065 -16042 -19501 -35450 -54582 -71544 -51632 -27206 -13751 6410
17225 6410 -6631 -28602 -27099 -323 20465 14672 -23125 -30309 -57094 -53809 8010 31029 19780
17212 19780 377 307 -52829 -55251 -25154 -43567 -34076 -30052 -14396 21735 76011 110314 118349
17199 118349 147825 171861 168463 166414 181008 237776 269565 259513 245679 210089 211489 191440
17187 191440 194497 213708 198050 170748 131958 94336 82869 48760 57482 90176 38346 -21775
17175 -21775 -59131 -54909 -63767 -62854 -37733 -36194 -38318 -34409 -34180 -29291 -1770 -10410 -78903 -107135
17161 -107135 -79238 -65111 -36065 -48567 -62072 -25424 -20981 -58769 -42649 -14952 -17139 -33506
17149 -33506 -29819 -21042 -12953 -54383 -60608 -36217 -68289 -67816 -27024 -26557 -56641 -34767 10855
$$ packed form
17238D4j5687k5891J2193J4276r77l459j5949j9132j6962J9912K4426J3455K0161
17225F410j3041k1971J503K6776K0788n793l7797p184k6785L285O1819K3019j1249
17212A9780j9403p0n3136k422L0097j8413R491M024J5656L6131N4276L4303Q035
17199A18349K9476K4036l398k049J4594N6768L1789j0052j3834l5590J400k0049
17187A91440L057J9211j5658k7302l8790l7622j1467l4109Q722L2694n1830o0121
17175b1775l7356M222q858R13K5121J539k124L909K29M889K7521q640o8493k8232
17161a07135K7897J4127K9046j2502j3505L6648M443l7788J6120K7697k187j6367
17149c3506L687Q777Q089m1430o225K4391l2072M73M0792M67l0084K1874M5622
$$ plain form
17136 10855 20123 -1364 13723 35131 13728 3049 -17418 -32604 -64061 -70037 -33756 -56585
17124 -56585 -64792 -61519 -87706 -106442 -95196 -46825 -28268 -32089 -58218 -67352 -38716 6729
17112 6729 -1909 -39983 -21023 13769 -1642 16194 71122 111979 112514 88548 116273 185236
17100 185236 232702 253587 300333 344143 330814 363202 427236 463372 494844 526841 542170
17089 542170 542620 501985 428735 387310 326475 261107 228403 225939 196544 186398 177240 131720
17077 131720 93548 75974 98385 112339 128325 87628 65067 60264 34844 12244 -11415 -18796
17065 -18796 -19584 -8926 1137 -10792 38152 29772 -60059 -93432 -75150 -75914 -76671 -65407 -46993
17052 -46993 -22566 909 -2692 60 -17482 -44085 -58709 -47055 -36912 -32548 -30672 -50639
$$ packed form
17136A0855R268k1487J5087K1408k1403j0679k0467j5186l1457n976L6281k2829
17124e6585q207L273k6187j8736J1246M8371J8557l821k6129r134K8636M5445
17112F729q638l8074J8960L4792j5411J7836N4928M0857N35k3966K7725O8963
17100A85236M7466K0885M6746M3810j3329L2388O4034L6136L1472L1997J5329
17089E42170M50m0635p3250m1425o0835o5368l2704k464k9395j0146r158m5520
17077A31720l8172j7574K2411J3954J5986m0697k2561m803k5420k2600k3659p381
17065a8796p88J0658J0063j1929M8944q380q9831l3373J8282p64p57J1264J8414
17052d6993K4427K3475l601K752j7542k6603j4624J1654J0143M364J876j9967
$$ plain form
17040 -50639 -60054 -66851 -28959 -2984 -20622 -30806 -48563 -19308 6886 22421 -7241 -48637
17028 -48637 -51884 -52226 -66815 -71715 -97376 -125467 -119990 -69337 -22910 -38463 -39266 -46957 -16988
17015 -16988 9072 -17598 -55164 -50122 -39772 -10138 -11613 -18739 -15682 -43443 -47718 -28706 -18138
17002 -18138 -11648 4742 6302 19249 40322 25573 2236 -25240 428 23571 6499 -15366
16990 -15366 -3592 392 3485 -27585 -51973 -51808 -30339 -31953 -29472 -29402 -23104 6335 24139 14180
16976 14180 -54470 -33554 -25447 -18149 -37440 -68587 -29488 20755 42059 4465 -41210 -45669
16964 -45669 -70198 -53159 -36278 -38396 -32287 -15748 -32583 -29696 -25640 -14348 -2205 -8589 -44705
16951 -44705 -29759 -24366 -24374 -32614 -35797 -67795 -65225 -65622 -74437 -62663 -72743 -63379 -39965 -77886
$$ packed form
17040e0639r415o797L7892K5975j7638j0184j7757K9255K6194J5535k9662m1396
17028d8637l247l42j4589m900k5661k8091N477N0653M6427j5553q03p691K9969
17015a6988K6060k6670l7566N042J0350K9634j475p126L057k7761m275J9012J0568
17002a8138O490J6390J560J2947K1073j4749k3337k7476K5668K3143j7072k1865
16990a5366J1774L984L093l1070k4388J65K1469j614K481P0O298K9439J7804r959
16976A4180o8650K0916Q107P298j9291l1147L9099N0243K1304l7594m5675m459
16964d5669k4529J7039J6881k118O109J6539j6835K887M056J1292J2143o384l6116
16951d4705J4946N393qq240l183l1998K570l97q815J1774j0080R364K3414l7921
$$ plain form
16937 -77886 -80568 -54958 -42082 -22063 9232 30655 15726 41427 64472 18063 1907 -3494
16925 -3494 -3042 -25178 -7845 13264 60008 85707 38907 8810 -34905 -36501 4083 -3499 -39908
16912 -39908 -11418 -9512 18931 29521 34266 61708 58047 33894 115042 141996 192514 269319
16900 269319 346240 322898 202591 121650 126846 81529 39168 21488 -2720 2562 31562 16672
16888 16672 1243 14634 56323 61787 52628 45382 23551 -16621 -25351 -16251 -28350 -21068 -596
16875 -596 42390 93597 93656 74254 48268 103859 157917 254006 463093 681164 747826 594747
16863 594747 376212 221678 114502 95709 82701 28469 -15181 -5101 -16479 451 10227
16852 10227 5703 -17861 -42036 -15578 -11495 -26335 -40769 -25870 -11810 18560 21067 40534
$$ packed form
16937g7886k682K5610J2876K0019L1295K1423j4929K5701K3045m6409j6156n401
16925c494M52k2136J7333K1109M6744K5699m6800l0097m3715j596M0584p582l6409
16912c9908K8490J906K8443J0590M745K7442l661k4153Q1148K6954N0518P6805
16900B69319P6921k3342j20307q0941N196m5317m2361j7680k4208N282K9000j4890
16888A6672j5429J3391M1689N464r159p246k1831m0172q730R100j2099P282K0472
16875e96M2986N1207N9j9402k5986N5591N4058R6089K09087K18071O6662j53079
16863E94747k18535j54534j07176j8793j3008n4232m3650J0080j1378J6930R776
16852A0227m524k3564k4175K6458M083j4840j4434J4899J4060L0370K507J9467
$$ plain form
16840 40534 69464 88169 63812 55205 37916 49784 93908 150218 199757 308513 389196 331760
16828 331760 253083 205127 149171 121630 96807 57094 22757 6336 -11755 -20847 -25778 18414
16816 18414 23378 7240 12797 23879 16105 9095 3047 692 -23105 -26223 -13535 -16366 -30879
16803 -30879 -21473 -794 16080 58087 109162 50982 36773 47849 19412 5392 13447 18316
16791 18316 30798 26020 39158 27072 45136 23406 -16324 -43667 -63171 -57272 -62528 -55362
16779 -55362 -30722 -29757 -32733 -19216 -22695 -13527 -5594 3141 58670 115211 127705 160630 243192
16766 243192 321977 428631 471583 378879 250784 134383 110560 75220 14032 -37762 -45982
16755 -45982 -40538 13057 29803 -3410 -23115 -38721 -61213 -41450 -35865 -44474 -29929 -28247
$$ packed form
16840D0534K8930J8705k4357q607j7289J1868M4124N6310M9539J08756Q0683n7436
16828C31760p8677m7956n5956k7541k4823l9713l4337j6421j8091r092m931M4192
16816A8414M964j6138N557J1082p774p010o048k355k3797l118J2688k831j4513
16803c0879R406K0679J6874M2007N1075n8180j4209J1076k8437j4020Q055M869
16791A8316J2482m778J3138j2086J8064k1730l9730k7343j9504N899n256P166
16779e5362K4640R65k976J3517l479R168P933Q735N5529N6541J2494L2925Q2562
16766B43192P8785J06654M2952r2704j28095j16401k3823l5340o1188n1794q220
16755d5982N444N3595J6746l3213j9705j5606k2492J9763N585q609J4545J682
$$ plain form
16743 -28247 -26731 11792 34992 -344 -4808 -3841 25519 32819 52632 36645 34500 88027 153325
16730 153325 239023 248642 190258 126350 84993 91608 72033 18109 -18041 -9958 -4732 3659
16718 3659 -389 18511 43711 70632 81431 53016 13651 -28488 -35824 -33433 1019 8449 -42563
16705 -42563 -75778 -50902 -31892 -34701 -4532 2759 19812 5836 -46263 -94900 -108039 -148090
16693 -148090 -164179 -134111 -103288 -67734 -23273 -17175 -8581 187 5568 -22708 -40541 -28568
16681 -28568 -15127 -5467 14163 18997 453 -7075 4539 23281 -10651 -25906 -29827 -39823 -65343
16668 -65343 -117595 -123231 -112861 -124334 -74438 -57872 -62501 -53152 -11802 24231 24486 14419 8354
16655 8354 19393 -10484 -53841 -47013 -22620 -32683 -47272 -46927 -24890 -28956 -6979 8976 -10404
$$ packed form
16743b8247J516L8523K3200l5336m464R67K9360P300J9813j5987k145N3527O5298
16730A53325Q5698R619n8384o3908m1357O615j9575n3924l6150Q083N226Q391
16718C659m048J8900K5200K6921J0799k8415l9365m2139p336K391L4452P430n1012
16705d2563l3215K4876J9010k809L0169P291J7053j3976n2099m8637j3139m0051
16693a48090j6089L0068L0823L5554M4461O098Q594Q768N381k8276j7833J1973
16681b8568J3441R660J9630M834j8544p528J1614J8742l3932j5255l921r996k5520
16668f5343n2252n636J0370j1473M9896J6566m629R349M1350L6033K55j0067o065
16655H354J1039k9877m3357O828K4393j0063j4589L45K2037m066K1977J5955j9380
$$ plain form
16642 -10404 -42679 -65697 -53386 -20740 -5052 98 -13839 -13948 -52522 -58738 -50276 -70360 -76075
16629 -76075 -28697 -1350 -54405 -123699 -125978 -79483 -60212 -37296 -50842 -63374 -71437 -68309
16617 -68309 -38996 -56316 -42995 -52717 -45658 -47190 -33164 -1079 -10266 -16568 -57436 -62528 -44981
16604 -44981 -61671 -36633 22283 1134 -29001 -42739 -34412 22756 -1969 -5282 -26691 -48641
16592 -48641 -22049 -22106 -40551 -37495 -31680 -85732 -103298 -72009 -72770 -75725 -53337 -44952 -57397
16579 -57397 -54103 -70603 -35521 14746 -10501 35690 53808 60633 37921 36049 52978 26802
16567 26802 -4994 -39172 -65371 -67815 -99015 -109015 -122034 -83917 -58106 -46619 -51737 -6609
16555 -6609 1585 -7244 8170 -4425 -13111 -26884 -37517 15730 54890 35327 27868 12855 -1157
$$ packed form
16642a0404l2275k3018J2311L2646J5688N150j3937j09l8574o216Q462k0084n715
16629g6075M7378K7347n3055o9294k279M6495J9271K2916j3546j2532q063L128
16617f8309K9313j7320J3321r722P059j532J4026L2085r187o302m0868n092J7547
16604d4981j6690K5038N8916k1149l0135j3738Q327N7168k4725l313k1409k1950
16592d8641K6592n7j8445L056N815n4052j7566L1289p61k955K2388Q385j2445
16579e7397L294j6500L5082N0267k5247M6191J8118O825k2712j872J6929k6176
16567B6802l1796l4178k6199k444l1200j0000j3019L8117K5811J1487n118M5128
16555f609Q194q829J5414j2595q686j3773j0633N3247L9160j9563p459j5013j4012
$$ plain form
16542 -1157 -28326 -15594 -7528 34315 69352 49547 3251 -27869 -7703 17799 7367 -25861
16530 -25861 -22165 -26531 -16486 -11221 7911 31053 -15138 -25583 16739 15621 24912 30147 -7133
16517 -7133 -11421 -8420 9450 26394 20656 -7247 -7445 2041 -2231 -982 -21878 -31960 -28495 -32178
16503 -32178 -30310 -48689 -43110 -33640 -38313 -32134 -26694 -42218 -29065 896 3999 57279 58025
16490 58025 84645 74223 16023 -21704 -38177 -57888 -36416 -30177 13586 2377 -41055 -47275
16478 -47275 -44094 -47734 -64337 -66068 -61644 -78936 -54466 -65096 -47459 -69598 -62925 -45134 -43796
16465 -43796 -42874 -30633 21477 24279 44169 27635 14910 12733 7034 -4905 6577 -31867 -50942
16452 -50942 -11161 12546 24165 56994 65148 -2300 -45988 4549 -1732 -70993 -66061 -34642
$$ packed form
16542a157k7169J2732Q066M1843L5037j9805m6296l1120K0166K5502j0432l3228
16530b5861L696m366J0045N265J9132K3142m6191j0445M2322j118R291N235l7280
16517g133m288L001J7870J6944n738k7903j98R486m272J249k0896j0082L465l683
16503c2178J868j8379N579R470m673O179N440j5524J3153K9961L103N3280P46
16490E8025K6620j0422n8200l7727j6473j9711K1472O239M3763j1209m3432o220
16478d7275L181l640j6603j731M424j7292K4470j0630J7637k2139O673J7791J338
16465d3796R22J2241N2110K802J9890j6534j2725k177n699j1939J1482l8444j9075
16452e0942L9781K3707J1619L2829Q154o7448m3688N0537o281o9261M932L1419
$$ plain form
16440 -34642 -23843 -2923 -8257 -2578 5368 -14136 -28742 9912 -2702 -19879 -30564 -11213
16428 -11213 5638 -9097 -45637 -38753 -40065 -53421 -31386 -45648 -29785 -18952 15646 23957
16416 23957 11277 -3008 -31544 -16516 5668 -3933 -26207 -56041 -17970 -21292 -38361 -10713
16404 -10713 9770 -28912 -74174 -53528 -19652 -7028 -26876 -14209 5486 1662 -25884 -56588
16392 -56588 -66262 -66841 -32043 6087 50671 51231 20482 -8272 -34283 -58119 -44853 -34453 -27360
16379 -27360 -8318 -11922 -24042 -21049 -13865 -16510 -27819 -25531 -24874 -32906 -42652 -45417 -32429 -19957
16365 -19957 12667 -14306 -36867 -77431 -86435 -63489 -75568 -95131 -72615 -55891 -53984 -70089
16353 -70089 -74807 -40011 -28361 -41893 -28471 295 5856 9691 -20593 -64919 -43358 3674
$$ packed form
16440c4642J0799K0920n334N679P946j9504j4606L8654j2614j7177j0685J9351
16428a1213J6851j4735l6540O884j312j3356K2035j4262J5863J0833L4598Q311
16416B3957j2680j4285k8536J5028K2184r601k2274k9834L8071l322j7069K7648
16404a0713K0483l8682m5262K0646L3876J2624j9848J2667J9695l824k7546l0704
16392e6588r674n79L4798L8130M4584N60l0749k8754k6011k3836J3266J0400P093
16379b7360J9042l604j2120K993P184k645j1309K288O57q032r746k765J2988J2472
16365a9957L2624k6973k2561m0564r004K2946j2079j9563K2516J6724J907j6105
16353g0089m718L4796J1650j3532J3422K8766N561L835l0284m4326K1561M7032
$$ plain form
16341 3674 8291 -8278 -3339 14112 -3428 -12043 -39399 -58511 -27489 38522 25585 4469
16329 4469 45199 73727 72401 34241 18820 2801 -40869 -22751 6567 -18070 -20060 -4526
16317 -4526 -17111 -42895 -94703 -90674 -81695 -48768 5341 1257 -62140 -78801 -86005 -85588 -64428
16304 -64428 -68192 -77840 -67057 -60314 -35841 -51540 -62366 -66941 -54941 -43847 -25074 13116
16292 13116 15195 -30929 -41815 -19864 25952 49535 21515 34763 23062 13838 8340 8783 -12192
16279 -12192 -4145 -41600 -67628 -22743 -23332 -27343 -39614 -55726 -12188 14028 15342 -3928 -9412
16266 -9412 7712 9300 32676 16578 57895 74022 55108 2520 -18622 1205 45961 31687
16254 31687 -3170 3931 3743 -45930 -69205 -67656 -61848 -61431 -43418 -38485 -58717 -28391 -686
$$ packed form
16341C674M617j6569M939J7451j7540q615k7356j9112L1022O6011j2937k1116
16329D469M0730K8528j326l8160j5421j6019m3670J8118K9318k4637j990J5534
16317d526j2585k5784n1808M029Q979L2927N4109m084o3397j6661p204M17K1160
16304f4428l764r648J0783O743K4473j5699j0826m575J2000J1094J8773L8190
16292A3116K079m6124j0886K1951M5816K3583k8020J3248j1701r224n498M43k0975
16279a2192Q047l7455k6028M4885n89m011j2271j6112M3538K6216J314j9270n484
16266i412J7124J588K3376j6098M1317J6127j8914n2588k1142J9827M4756j4274
16254C1687l4857P101j88m9673k3275J549N808M17J8013M933k0232L0326K7705
$$ plain form
16241 -686 -18540 -69488 -79486 -44863 -14484 25888 68062 80440 58827 55568 59307 48694 -4382
16228 -4382 -16302 -37761 -33876 8860 5155 7433 21129 14065 28815 20805 28059 32500 20373
16215 20373 7094 5930 22288 -7651 -14966 -25806 -39153 -36651 -84161 -97696 -57101 -17410
16203 -17410 -29373 -54820 -77772 -51109 -40058 -52064 -20986 -16315 -15094 1816 12918 -13360
16191 -13360 -38286 -53166 -40418 11681 41159 57852 45882 -728 -28579 -637 13801 11493
16179 11493 12118 34314 41446 22661 -19889 -37546 -20514 36915 31595 35730 24817 26155 25467
16166 25467 40170 16728 -10471 -21729 -15874 -11900 9392 4359 -33113 -39997 4982 13875 22623
16153 22623 65108 81986 70922 3410 -10234 12383 17910 27112 78872 35936 31911 25558
$$ packed form
16241f86j7854n0948r998L4623L0379M0372M2174J2378k1613l259L739j0613n3076
16228d382j1920k1459L885M2736l705K278J3696p064J4750q010P254M441j2127
16215B0373j3279j164J6358k9939p315j0840j3347K502m7510j3535M0595L9691
16203a7410j1963k5447k2952K6663J1051j2006L1078M671J221J6910J1102k6278
16191a3360k4926j4880J2748N2099K9478J6693j1970m6610k7851K7942J4438k308
16179A1493O25K2196P132j8785m2550j7657J7032N7429n320M135j0913J338o88
16166B5467J4703k3442k7199j1258N855L974K1292n033l7472o884M4979Q893Q748
16153B2623M2485J6878j1064o7512j3644K2617N527R202N1760m2936m025o353
$$ plain form
16141 25558 14525 27053 21318 7424 -37840 -30056 -61 26458 13892 9775 46239 53923
16129 53923 -13650 -25866 -17988 -21339 6709 21658 14884 4170 22560 71946 135256 179072
16117 179072 125459 56737 26950 -2266 -3065 9087 44454 37942 6682 -26124 -15301 27766
16105 27766 42114 23828 3771 11270 28571 -9977 -43743 -21457 -9335 67213 84724 86183
16093 86183 88643 77765 50698 41884 53139 39325 41377 39246 56056 65868 58319 50091 41961
16080 41961 -10573 -18461 -17858 -44457 -19633 8236 1525 -19670 -21970 -5513 8129 -18249 -35326
16067 -35326 -181 -2267 -52210 -87782 -74965 -30769 -25973 -20038 -27442 4232 19354 9563 22249
16054 22249 -1853 -10801 -30619 -44625 -25365 -20884 -18253 -9060 9994 -4163 -3330 -27798 -31960
$$ packed form
16141B5558j1033J2528n735j3894m5264P784K9995K6519j2566m117L6464P684
16129E3923o7573j2216P878l351K8048J4949o774j0714J8390M9386O3310M3816
16117A79072n3613o8722k9787k9216p99J2152L5367o512l1260l2806J0823M3067
16105B7766J4348j8286k0057P499J7301l8548l3766K2286J2122P6548J7511J459
16093H6183K460j0878k7067q814J1255j3814K052k131J6810R812p549q228q130
16080D1961n2534p888O03k6599K4824K7869o711k1195k300J6457J3642k6378j7077
16067c5326L5145k086m9943l5572J2817M4196M796N935p404L1674J5122r791J2686
16054B2249k4102q948j9818j4006J9260M481K631R193J9054j4157Q33k4468m162
$$ plain form
16041 -31960 -6650 -10757 -17571 -10563 6038 -190 -6493 -16053 -31596 -34630 -7892 -13676 -5863
16028 -5863 6100 -25401 -26363 -23403 -14440 -22587 -4461 -24088 -22609 -15417 -9593 6226 22867
16015 22867 54254 60336 27997 -13761 -19871 -52372 -58995 -64249 -57636 -51786 -15212 -1916 -23128
16002 -23128 -33128 -31318 -12826 19234 64941 71017 32683 17810 12501 11881 -3481 -2712 -6823
15989 -6823 4608 1142 2658 14368 2971 -30003 -42207 -52941 -25545 -36456 -42578 18688
15977 18688 40365 16128 14459 14587 -39166 -31322 -37230 -35592 -4787 9975 16848 -25040 -1864
15964 -1864 11004 -4846 -16674 -1028 -20739 -23499 -46179 -81315 -56161 -51279 -60777 -10572
15952 -10572 -15899 -50145 -53007 -28062 -66921 -117627 -113650 -81456 -57845 -33212 -153 364 -45151
$$ packed form
16041c1960K5310m107o814P008J6601o228o303r560j5543l034K6738n784P813
16028e863J1963l1501r62K960Q963q147J8126j9627J479P192N824J5819J6641
16015B2867L1387O082l2339m1758o110l2501o623n254O613N850L6574J3296k1212
16002b3128j0000J810J8492L2060M5707O076l8334j4873n309o20j5362P69m111
15989f823J1431l466J516J1710j1397l2974j2204j0734K7396j0911o122O1266
15977A8688K1677k4237j669J28n3753P844n908J638L0805J4762O873m1888K3176
15964a864J2868j5850j1828J5646j9711k760k2680l5136K5154M882r498N0205
15952a0572n327l4246k862K4945l8859n0706L977L2194K3611K4633L3059N17m5515
$$ plain form
15939 -45151 -23242 -6045 -3515 10364 24157 18286 -21082 -23192 -34007 -33863 -22050 -25158 1685
15926 1685 4565 -5908 -13164 -3500 1705 -9577 -7127 -36086 -20698 -33351 -13484 27948 35194
15913 35194 24156 -11706 -9286 17408 30514 -3283 -16302 -16022 -28457 -5959 -9072 -1569 -22277
15900 -22277 -33047 21621 68765 43641 9594 21373 52525 62307 85842 68420 77473 47501
15888 47501 51306 46567 14721 395 -22089 -7825 25674 38973 -2352 6140 37969 28852
15876 28852 23963 42400 55661 6600 -35949 -52106 -3448 19376 11509 7884 56966 47262
15864 47262 37682 13888 -905 17969 -20071 -58843 -70029 -58390 -32993 -20366 -17053 -11477
15852 -11477 -60584 -57087 -42486 -24432 -15846 -5472 11380 -6717 -14832 1835 33713 14760
$$ packed form
15939d5151K1909J7197K530J3879J3793n871l9368k110j0815J44J1813l108K6843
15926A685K880j0473p256R664N205j1282K450k8959J5388j2653J9867M1432P246
15913C5194j1038l5862K420K6694J3106l3797j3019K80j2435K2498l113P503k0708
15900b2277j0770N4668M7144k5124l4047J1779L1152R782K3535j7422R053k9972
15888D7501L805m739l1846j4326k2484J4264L3499J3299m1325Q492L1829r117
15876B8852m889J8437J3261m9061m2549j6157M8658K2824p867l625M9082r704
15864D7262r580k3794j4793J8874l8040l8772j1186J1639K5397J2627L313N576
15852a1477m9107L497J4601J8054Q586J0374J6852j8097q115J6667L1878j8953
$$ plain form
15840 14760 10065 7812 -6937 -7574 -4840 16140 26934 36500 56329 3245 -20112 -22307 920
15827 920 269 27791 57968 52831 18287 -28022 -89823 -130681 -127660 -61322 -7615 39156 96093
15814 96093 80142 68443 66818 56593 34366 59806 65232 88567 54772 -2414 -11395 -12797
15802 -12797 -27340 -56856 -11889 23115 30517 -641 -8975 -623 -7046 -31909 -34843 3662 15538
15789 15538 16395 2246 -12136 -33010 -7935 -36985 -26480 -34805 -4900 -23473 -39362 -46468
15777 -46468 -45812 -14659 -40836 -55593 -27498 -22761 -5511 -4633 -918 59780 71976 50620 9910
15764 9910 -12602 11809 20973 1838 13522 -6117 21271 22834 18272 29057 43778 31835
15752 31835 42959 47955 44397 6701 -25945 -24467 -33804 -45369 -42412 -32869 -61486 -41457 -36480
$$ packed form
15840A4760m695k253j4749o37K734K0980J0794R566J9829n3084k3357k195K3227
15827I20o51K7522L0177n137l4544m6309o1801m0858L021O6338N3707M6771N6937
15814I6093j5951j1699j625j0225k2227K5440N426K3335l3795n7186q981j402
15802a2797j4543k9516M4967L5004P402l1158q334Q352o423k4863k934L8505J1876
15789A5538Q57j4149j4382k0874K5075k9050J0505q325K9905j8573j5889p106
15777d6468O56L1153k6177j4757K8095M737J7250Q78L715O0698J2196k1356m0710
15764I910k2512K4411R164j9135J1684j9639K7388J563m562J0785J4721j1943
15752C1835J1124M996l558l7696l2646J478r337j1565K957R543k8617K0029M977
$$ plain form
15739 -36480 -4953 -10867 -71255 -85139 -71944 -64725 -57740 -55456 -46650 -22506 13310 16375 7915
15726 7915 -13280 -63947 -61550 -11992 22006 -15123 -17053 -3038 19973 699 -1587 -15001
15714 -15001 -5000 868 13892 34919 77774 113321 131693 128470 80039 31352 14509 -3337
15702 -3337 -24675 -20103 -46727 -78635 -49937 -36153 -38465 -23418 -16277 22073 45892 25445
15690 25445 48787 38921 -30663 -29272 -28980 -29626 -22964 -26051 15156 43300 8044 -24235 11531
15677 11531 6713 12340 18395 19206 40331 16290 9256 7331 5513 16143 51015 45758 38813 12490
15663 12490 -31960 -66133 -22389 -3350 17282 15332 -12311 -35570 -30860 -23260 31314 30392 23746
15650 23746 28884 -521 1674 21983 -14373 7473 43445 56944 60897 38067 47662 48897 41531
$$ packed form
15739c6480L1527n914o0388j3884J3195P219O985K284Q806K4144L5816L065q460
15726G915k1195n0667K397M9558L3998l7129j930J4015K3011j9274k286j3414
15714a5001J0001N868J3024K1027M2855L5547J8372l223m8431m8687j6843j7846
15702c337k1338M572k6624l1908K8698J3784k312J5047P141L8350K3819k0447
15690B5445K3342r866o9584J391K92o46O662l087M1207K8144l5256l2279L5766
15677A1531m818N627O055Q11K1125k4041p034j925j818J0630L4872n257o945k6323
15663A2490m4450l4173M3744J9039K0632j950k7643k3259M710P600N4574r22o646
15650B3746N138k9405K195K0309l6356K1846L5972J3499L953k2830R595J235p366
$$ plain form
15637 41531 22345 -23492 -7846 11 -36308 -44378 -25854 -31597 -24553 16518 42497 -6056
15625 -6056 -61037 -66612 -25424 24122 27561 -7648 -32805 -38262 -39624 -43850 -51945 -21595 28056
15612 28056 44428 47114 42379 23121 1924 10960 25051 46017 20532 8293 -3337 12332
15600 12332 -13909 -40986 -34410 -4332 37854 51493 32857 23624 -12490 -8179 -17965 -435
15588 -435 -16945 -12808 -27130 -20948 -3105 6805 19015 -12415 -38486 -41045 -25490 -33816 -18380
15575 -18380 -30981 -71025 -87345 -95363 -63299 -17814 -25164 -29840 -18697 -20523 5972 64204
15563 64204 39694 13243 3742 20163 44404 43080 23103 1428 -25110 -1687 11249 37110
15551 37110 39615 13089 25971 36467 7448 -15812 -12698 -32172 -22530 4234 -15623 -22612
$$ packed form
15637D1531j9186m5837J5646P857l6319q070J8524n743P044M1071K5979m8553
15625f056n4981n575M1188M9546L439l5209k5157n457j362m226q095L0350M9651
15612B8056J6372K686m735j9258k1197R036J4091K0966k5485j2239j1630J5669
15600A2332k6241k7077O576L0078M2186J3639j8636r233l6114M311r786J7530
15588d35j6510M137j4322O182J7843R910J2210l1430k6071k559J5555q326J5436
15575a8380j2601m0044j6320q018L2064M5485p350m676J1143j826K6495N8232
15563F4204k4510k6451r501J6421K4241j324j9977k1675k6538K3423J2936K5861
15551C7110K505k6526J2882J0496k9019k3260L114j9474R642K6764j9857o989
$$ plain form
15539 -22612 -8289 24821 18510 -9701 -27042 875 14123 6289 16633 62840 76426 73341
15527 73341 42699 50094 41263 33167 74986 58330 26593 13375 25184 53568 43170 2830
15515 2830 -38863 -73256 -50975 -21325 -26539 -29951 -20144 -46091 -91863 -40664 1133 1803 -1325
15502 -1325 -6288 23433 79697 59166 16297 -16823 -8992 -5816 -13473 15383 61854 48254 6834
15489 6834 -14279 -8461 -28146 -14239 25084 25758 15362 -24465 -21762 -50464 -102744 -68663 -17960
15476 -17960 -30240 -36727 -13252 10785 44489 57073 35181 9257 13950 4275 -9346 -4703
15464 -4703 -14820 -33335 -14954 8282 -14299 6609 21874 -3739 -4616 662 -16683 -34599
15452 -34599 -41378 -35052 -17362 -67762 -86517 -72864 43380 70634 27746 -22270 -15436 -13349
$$ packed form
15539b2612J4323L3110o311k8211j7341K7917J3248p834J0344M6207J3586l085
15527G3341l0642P395q831q096M1819j6656l1737j3218J1809K8384j0398m0340
15515B830m1693l4393K2281K9650n214l412R807k5947m5772N1199M1797O70l128
15502a325m963K9721N6264k0531m2869l3120P831L176p657K8856M6471j3600m1420
15489F834k1113N818j9685J3907L9323O74j0396l9827K703k8702n2280L4081N0703
15476a7960j2280o487K3475K4037L3704J2584k1892k5924M693r675j3621M643
15464d703j0117j8515J8381K3236k2581K0908J5265k5613q77N278j7345j7916
15452c4599o779O326J7690n0400j8755J3653J16244K7254m2888n0016O834K087
$$ plain form
15440 -13349 -12841 8463 -21125 -489 -1269 -712 2831 25891 41205 32389 25419 36803 23973
15427 23973 9429 13313 38848 68868 72428 50012 34492 68014 75345 34834 56095 73135
15415 73135 58948 70318 43218 -4725 -33140 6929 47576 43339 6214 16716 16799 706
15403 706 21029 35888 59487 42049 44271 38743 2841 5301 13944 19163 39400 57818 26060
15390 26060 13667 7856 -12197 -38280 -49545 -13480 45767 47149 25565 1345 30334 42019
15378 42019 50822 16910 3959 -5444 -9926 -11168 9916 -12315 -38619 -7741 11229 4464 -1767
15365 -1767 22795 17175 3725 2416 -3339 21827 24916 -1496 3115 24638 14641 9211 32044
15352 32044 37464 32688 26664 12352 13913 -7906 -19946 -38519 -26579 22313 57386 23916
$$ packed form
15440a3349N08K1304k9588K0636p80N57L543K3060J5314q816o970J1384j2830
15427B3973j4544L884K5535L0020L560k2416j5520L3522P331m0511K1261J7040
15415G3135j4187J1370k7100m7943k8415M0069M0647m237l7125J0502Q3j6093
15403G06K0323J4859K3599j7438K222n528l5902K460Q643N219K0237J8418l1758
15390B6060j2393n811k0053k6083j1265L6065N9247J382k1584k4220K8989J1685
15378D2019Q803l3912j2951r403m482j242K1084k2231k6304L0878J8970o765o231
15365a767K4562n620j3450j309n755K5166L089k6412M611K1523r997n430K2833
15352C2044N420m776o024j4312J561k1819j2040j8573J1940M8892L5073l3470
$$ plain form
15340 23916 -24300 -614 12077 2804 -9693 8877 17434 -10810 -6185 -8346 -7382 -11562 -39845
15327 -39845 -10177 -33 -15783 9033 -1322 -20746 16744 18323 34123 49226 71007 42894
15315 42894 3450 19983 59744 104615 81171 66477 94085 93312 29582 14013 27885 71936
15303 71936 102603 84564 56105 35235 26558 -9113 -11150 -17888 -56755 -83677 -74133 -73476 -68703
15290 -68703 -51033 -21520 1494 11085 -17707 -12744 -5950 -27597 -38715 -39553 -28649 -17874 10448
15277 10448 45332 25657 -8424 -13793 -9156 -31219 -17615 12743 5728 10815 28746 44349
15265 44349 92728 114894 49778 -12544 16847 46044 31442 43086 71771 75927 22750 -40937
15253 -40937 -47321 -25393 -32233 -32258 -25919 -30632 -35497 -8991 -3109 14012 14977 28070 17093 18070
$$ packed form
15340B3916m8216K3686J2691r273j2497J8570Q557k8244M625k161R64m180k8283
15327c9845K9668J0144j5750K4816j0355j9424L7490J579J5800J5103K1781k8113
15315D2894l9444J6533L9761M4871k3444j4694K7608p73o3730j5569J3872M4051
15303G1936L0667j8039k8459k0870q677l5671k037o738l8867k6922R544O57M773
15290f8703J7670K9513K3014R591k8792M963O794k1647j1118q38J0904J0775K8322
15277A0448L4884j9675l4081n369M637k2063J3604L0358p015N087J7931J5603
15265D4349M8379K2166o5116o2322K9391K9197j4602J1644K8685M156n3177o3687
15253d0937o384K1928o840k5O339m713m865K6506N882J7121R65J3093j0977R77
$$ plain form
15239 18070 5264 13137 17497 28732 29070 27874 41862 2721 -25339 -22280 755 -23974 -31935
15226 -31935 47375 44160 25560 17370 41525 36284 -1585 -17224 22378 32296 32377 48039 42262
15213 42262 39004 20520 -14284 -35457 -36409 -17513 25837 12740 -29793 -38921 -23582 -13891 -29816
15200 -29816 -51673 -75660 -19373 21535 10088 -19662 -36323 -12425 8249 14610 23367 39317
15188 39317 69079 67838 88186 58517 49286 38066 33914 -13219 -29675 -11240 -14465 -8275 10105
15175 10105 34672 26329 -18658 -28367 -46193 -37607 -43427 -13631 12223 17325 -6056 255 20689
15162 20689 2758 3989 8060 5720 29411 15450 18606 39436 613 26426 49019 50020 6720
15149 6720 -10344 -4818 33623 47128 28288 30211 12956 24054 12531 -15755 -13115 -18661 -25784
$$ packed form
15239A8070j2806P873M360J1235L38j196J3988l9141k8060L059K3035k4729p961
15226c1935P9310l215j8600q190K4155n241l7869j5639L9602R918Q1J5662n777
15213D2262l258j8484l4804k1173r52J8896M3350j3097m2533r128J5339R691j5925
15200b9816k1857k3987N6287M0908j1447k9750j6661K3898K0674O361Q757J5950
15188C9317K9762j241K0348k9669r231j1220m152m7133j6456J8435l225O190J8380
15175A0105K4567q343m4987r709j7826Q586n820K9796K5854N102k3381O311K0434
15162B0689j7931J231M071k340K3691j3961L156K0830l8823K5813K2593J001m3300
15149F720j7064N526L8441J3505j8840J923j7255J1098j1523k8286K640n546p123
$$ plain form
15136 -25784 -11797 -26169 -27144 16119 22184 37860 75367 40353 14850 33690 33480 85695 92119
15123 92119 52725 58361 42610 36432 31620 27238 22137 23418 -5932 14324 51638 37966 4361
15110 4361 -21559 -16996 6596 25599 24099 38377 64054 44640 19142 -13309 -7622 -9043 -20399
15097 -20399 -40905 -40381 33490 91287 58973 40200 54850 27435 -8926 11220 51727 55049
15085 55049 20079 40193 55341 48783 -4916 -28063 -15387 15997 36196 55512 39061 64167
15073 64167 87890 47623 21807 -7175 -1450 6760 13595 21345 21713 -15701 -29147 -27325 31027
15060 31027 57573 73548 46836 55371 71870 53088 37048 35689 29048 32169 28090 2972 9811
15047 9811 26211 15195 -28795 -21794 23300 25794 5143 15673 5973 12196 -19683 12920 62103
$$ packed form
15136b5784J3987j4372r75M3263O065J5676L7507l5014k5503J8840k10N2215O424
15123I2119l9394N636j5751o178m812m382n101J281k9350K0256L7314j3672l3605
15110D361k5920M563K3592J9003j500J4278K5677j9414k5498l2451N687j421j1356
15097b0399k0506N24P3871N7797l2314j8773J4650k7415l6361K0146M0507L322
15085E5049l4970K0114J5148o558n3699k3147J2676L1384K0199J9316j6451K5106
15073F4167K3723m0267k5816k8982N725Q210O835P750L68l7414j3446J822N8352
15060C1027K6546J5975k6712Q535J6499j8782j6040j359o641L121m079k5118O839
15047I811J6400j1016m3990P001M5094K494k0651J0530r700O223l1879L2603M9183
$$ plain form
15034 62103 64763 57648 43836 25145 36190 40696 835 -53969 -49208 -14626 6813 17173
15022 17173 20011 6763 -26241 65 -5800 21721 -19730 -53784 -47025 -22780 -1568 2124
15010 2124 36676 37050 31859 11235 22087 63870 89460 94837 68262 63361 57487 35087 49016
14997 49016 38661 600 -8762 3936 -11306 17900 43750 35077 26587 16023 25659 19170 10739
14984 10739 -193 -11131 2853 70443 42247 5738 3940 46294 41786 67630 67241 35519
14972 35519 -11203 12784 52571 52696 24349 13797 37145 44610 42193 32891 -1028 -2149 -5376
14959 -5376 -12825 8191 46882 47432 35362 -27718 -66258 -89016 -75317 -37662 -7749 24781
14947 24781 49002 52493 65244 88386 84092 29806 24561 36515 30129 36322 69263 68908 37973
$$ packed form
15034F2103K660p115j3812j8691J1045M506l9861n4804M761L4582K1439J0360
15022A7173K838j3248l3004K6306n865K7521m1451l4054O759K4245K1212L692
15010B124L4552L74n191k0624J0852M1783K5590N377k6575m901n874k2400J3929
14997D9016j0355l8061r362J2698j5242K9206K5850q673q490j0564R636o489q431
14984A0739j0932j0938J3984O7590k8196l6509j798M2354m508K5844l89l1722
14972C5519m6722K3987L9787J25k8347j0552K3348P465k417r302l3919j121l227
14959e376p449K1016L8691N50j2070o3080l8540k2758J3699L7655K9913L2530
14947B4781K4221L491J2751K3142m294n4286n245J1954o386O193L2941l55l0935
$$ plain form
14934 37973 7400 -10291 -7305 35883 52956 32149 15868 32612 58640 86438 69575 52279
14922 52279 29694 1616 -7839 -17262 -19830 -19488 25539 26440 25722 23114 65470 48424 39878 65580
14908 65580 41781 6737 -26012 -25545 40910 22757 -13592 732 -1008 -26388 -32659 -4373
14896 -4373 18104 52853 65134 46086 67024 62655 60697 85015 101922 72727 33071 18266
14884 18266 56020 57023 71092 56795 16380 20193 52426 64218 34159 38791 15146 -29681
$$ packed form
14934C7973l0573j7691K986M3188J7073k0807j6281J6744K6028K7798j6863j7296
14922E2279k2585k8078r455r423k568L42M5027R01p18k608M2356j7046q546K5702
14908F5580k3799l5044l2749M67O6455j8153l6349J4324j740k5380o271K8286
14896d373K2477L4749J2281j9048K0938m369j958K4318J6907k9195l9656j4805
14884A8266L7754J003J4069j4297m0415L813L2233J1792l0059M632k3645m4827
$$ [...]
##END NTUPLES=NMR SPECTRUM
##END=
