##TITLE=Analysis number 327291
Compound Code cc 56306
Book Reference 513/61/27
Project Code adrs
Chemist Name ronp
##JCAMPDX= 6.0         $$ Bruker NMR JCAMP-DX V2.0
##DATA TYPE= NMR SPECTRUM
##DATA CLASS= NTUPLES
##ORIGIN= Bruker BioSpin GmbH
##OWNER= nmr
$$ XWIN-NMR		Version 3.5
$$ Tue Mar 20 08:57:35 2007 GMT Standard Time (UT+0h)  MAYBRIDGE\nmr@NMR_250MHZ
##.OBSERVE FREQUENCY= 250.131544655141
##.OBSERVE NUCLEUS= ^1H
##.ACQUISITION MODE= SIMULTANEOUS (DQD)
##.ACQUISITION SCHEME= undefined
##.AVERAGES= 16
##.DIGITISER RES= 18
##SPECTROMETER/DATA SYSTEM= dpx250
##.PULSE SEQUENCE= zg30
##.SOLVENT NAME= CDCl3
##.SHIFT REFERENCE= (INTERNAL, CDCl3, 0, 16.522)
##AUDIT TRAIL= $$ (NUMBER, WHEN, WHO, WHERE, WHAT)
$$ ##TITLE= Audit trail, XWIN-NMR		Version 3.5
$$ ##JCAMPDX= 5.01
$$ ##ORIGIN= Bruker BioSpin GmbH
$$ ##OWNER= nmr
$$ C:\u/data/dgb/nmr/ADRS/1250/pdata/1/auditp.txt
$$ ##AUDIT TRAIL=  $$ (NUMBER, WHEN, WHO, WHERE, WHAT)
(   1,<2007-03-20 08:57:13.61 +000>,<MAYBRIDGE\nmr>,<NMR_250MHZ>,
      <created by zg, POWCHK disabled, PULCHK disabled
       configuration hash MD5:
       49 4B E0 1D 92 C2 6B 37 9F E6 65 BC 52 41 86 1D
       data hash MD5: 64K
       C8 B4 D5 F7 72 02 47 64 2B 26 59 6E 1E DA 7B 3F>)
(   2,<2007-03-20 08:57:26.93 +000>,<MAYBRIDGE\nmr>,<NMR_250MHZ>,
      <Start of raw data processing
       ef LB = 0.3 FT_mod = 6 PKNL = 1 SI = 32K 
       data hash MD5: 32K
       77 8A 51 4F 51 DE 67 3C C9 16 05 DA 6F 93 15 F9>)
(   3,<2007-03-20 08:57:28.75 +000>,<MAYBRIDGE\nmr>,<NMR_250MHZ>,
      <apk 
       data hash MD5: 32K
       A7 F0 9B 32 D0 B5 AE EB 84 6F 85 93 04 CB 98 65>)
(   4,<2007-03-20 08:57:29.45 +000>,<MAYBRIDGE\nmr>,<NMR_250MHZ>,
      <abs ABSG = 5 
       data hash MD5: 32K
       36 D9 6E 52 FE 5A AD DB AD FF BA 39 3F EE A6 AB>)
$$ ##END=
$$ 
$$ hash MD5
$$ 18 90 C4 5C 8E F3 11 7F B8 D6 93 29 0C 10 49 38
##$RELAX= 
##$RELAX= 
##$RELAX= 
##$RELAX= 
##$RELAX= 
##$RELAX= 
##$RELAX= 
$$ Bruker specific parameters
$$ --------------------------
##$DU= <C:\u>
##$EXPNO= 1250
##$NAME= <ADRS>
##$PROCNO= 1
##$TYPE= <nmr>
##$USER= <dgb>
##$AMP= (0..31)
100 100 100 100 100 100 100 100 100 100 100 100 100 100 100 100 100 100 
100 100 100 100 100 100 100 100 100 100 100 100 100 100 
##$AQSEQ= 0
##$AQ_mod= 3
##$AUNM= <au_zg>
##$AUTOPOS= <51 >
##$BF1= 250.13
##$BF2= 250.13
##$BF3= 250.13
##$BF4= 250.13
##$BF5= 500.13
##$BF6= 500.13
##$BF7= 500.13
##$BF8= 500.13
##$BYTORDA= 1
##$CFDGTYP= 0
##$CFRGTYP= 5
##$CHEMSTR= <none>
##$CNST= (0..31)
1 1 145 1 1 1 1 1 1 1 1 1 1 1 1 1 1 1 1 1 1 1 1 1 1 1 1 1 1 1 1 1 
##$CPDPRG= <>
##$CPDPRG1= <>
##$CPDPRG2= <>
##$CPDPRG3= <>
##$CPDPRG4= <mlev>
##$CPDPRG5= <mlev>
##$CPDPRG6= <mlev>
##$CPDPRG7= <mlev>
##$CPDPRG8= <mlev>
##$CPDPRGB= <>
##$CPDPRGT= <>
##$D= (0..31)
0 1 0 0 0 0 0 0 0 0.06 0 0 0 0 0 0 0.0002 0 0 0 0 0 0 0 0 0 0 0 0 0 0 
0 
##$DATE= 1174381032
##$DBL= (0..7)
120 120 120 120 120 120 120 120 
##$DBP= (0..7)
150 150 150 150 150 150 150 150 
##$DBP07= 0
##$DBPNAM0= <>
##$DBPNAM1= <>
$$ [...]
##$SUBNAM7= <"">
##$SUBNAM8= <"">
##$SUBNAM9= <"">
##$SW= 20.6930455092707
##$SWIBOX= (0..15)
0 0 3 0 0 0 0 0 0 0 0 0 0 0 0 0 
##$SW_h= 5175.983436853
##$TD= 65536
##$TD0= 1
##$TE= 683.16
##$TE2= 300
##$TE3= 300
##$TEG= 300
##$TL= (0..7)
0 120 120 120 120 120 120 120 
##$TP= (0..7)
150 150 150 150 150 150 150 150 
##$TP07= 0
##$TPNAME0= <>
##$TPNAME1= <>
##$TPNAME2= <>
##$TPNAME3= <>
##$TPNAME4= <>
##$TPNAME5= <>
##$TPNAME6= <>
##$TPNAME7= <>
##$TPOAL= (0..7)
0.5 0.5 0.5 0.5 0.5 0.5 0.5 0.5 
##$TPOFFS= (0..7)
0 0 0 0 0 0 0 0 
##$TUNHIN= 0
##$TUNHOUT= 0
##$TUNXOUT= 0
##$USERA1= <user>
##$USERA2= <user>
##$USERA3= <user>
##$USERA4= <user>
##$USERA5= <user>
##$V9= 5
##$VALIST= <valist>
##$VCLIST= <CCCCCCCCCCCCCCC>
##$VD= 0
##$VDLIST= <DDDDDDDDDDDDDDD>
##$VPLIST= <PPPPPPPPPPPPPPP>
##$VTLIST= <TTTTTTTTTTTTTTT>
##$WBST= 1024
##$WBSW= 4
##$XGAIN= (0..3)
0 0 0 0 
##$XL= 0
##$YL= 0
##$YMAX_a= 492347
##$YMIN_a= -598968
##$ZGOPTNS= <>
##$ZL1= 120
##$ZL2= 120
##$ZL3= 120
##$ZL4= 120
##$ABSF1= 16.522
##$ABSF2= -4.171173
##$ABSG= 5
##$ABSL= 3
##$ALPHA= 0
##$AQORDER= 0
##$ASSFAC= 0
##$ASSFACI= 0
##$ASSFACX= 0
##$ASSWID= 0
##$AUNMP= <proc_1d>
##$AZFE= 0.1
##$AZFW= 0.1
##$BCFW= 0
##$BC_mod= 0
##$BYTORDP= 0
##$COROFFS= 0
##$CY= 12.5
##$DATMOD= 1
##$DC= 0
##$DFILT= <>
##$DTYPP= 0
##$F1P= 14.0000005364418
##$F2P= -0.99999901652339
##$FCOR= 0.5
##$FTSIZE= 32768
##$FT_mod= 6
##$GAMMA= 0
##$GB= 0
##$INTBC= 1
##$INTSCL= 1
##$ISEN= 128
##$LB= 0.3
##$LEV0= 0
##$LPBIN= 0
##$MAXI= 10000
##$MC2= 0
##$MEAN= 0
##$ME_mod= 0
##$MI= 0
##$NCOEF= 0
##$NC_proc= -3
##$NLEV= 6
##$NOISF1= 0
##$NOISF2= 0
##$NSP= 0
##$NTH_PI= 0
##$NZP= 0
##$OFFSET= 16.522
##$PC= 1
##$PHC0= 229.7118
##$PHC1= 12.90064
##$PH_mod= 1
##$PKNL= yes
##$PPARMOD= 0
##$PSCAL= 4
##$PSIGN= 0
##$REVERSE= no
##$SF= 250.13
##$SI= 32768
##$SIGF1= 0
##$SIGF2= 0
##$SINO= 400
##$SIOLD= 32768
##$SREGLST= <1H.CDCl3>
##$SSB= 0
##$STSI= 32768
##$STSR= 0
##$SW_p= 5175.98343685301
##$SYMM= 0
##$S_DEV= 0
##$TDeff= 65536
##$TDoff= 0
##$TI= <Analysis number 999999
Compound Code 99
Book Reference 9
Project Code 9>
##$TILT= no
##$TM1= 0
##$TM2= 0
##$TOPLEV= 0
##$USERP1= <user>
##$USERP2= <user>
##$USERP3= <user>
##$USERP4= <user>
##$USERP5= <user>
##$WDW= 1
##$XDIM= 32768
##$YMAX_p= 373636507
##$YMIN_p= -107129
$$ End of Bruker specific parameters
$$ ---------------------------------
##NTUPLES= NMR SPECTRUM
##VAR_NAME=  FREQUENCY,     SPECTRUM/REAL,   SPECTRUM/IMAG
##SYMBOL=    X,             R,               I
##VAR_TYPE=  INDEPENDENT,   DEPENDENT,       DEPENDENT
##VAR_FORM=  AFFN,          ASDF,            ASDF
##VAR_DIM=   32768,         32768,           32768
##UNITS=     HZ,            ARBITRARY UNITS, ARBITRARY UNITS
##FACTOR=    0.157963299565203, 1,           1
##FIRST=     4132.6476996994, 0,             0
##LAST=      -1043.33573715361, 0,           0
##MIN=       -1043.33573715361, -107129,     0
##MAX=       4132.6476996994, 373636507,     0
$$ Real data points
##PAGE= N=1
##DATA TABLE= (X++(R..R)), XYDATA
$$ [...]
26646E007k4564l3344K5854K9772j1352j3467k0029r030K3377K7909J5054R425
26634B4612N866l72j1864k4858N938j1340j6857J880J5156k3634J1189J6231R227
26621A174J146j7835j3567K6438q556O455K4285P435m727j6330l1502K9016L3985
26608C7417r75k0461j4976K3313O41m0945k3448J6822J5627J8814O967j8955M255
26595D096J210k026P429j6389j3348J3742j145n40m904j7152K1045J7616j5363
26582e729n689P319j4713k3257k2086Q559M3727J2337K451K9320j4580J2515L602
26569C3776n184l793r192j6154j317o078j894j2818O346K9106r963k0034n373
26556b2572N605N105l751j2864Q489J705L2840j569J214P029l1581j6622L6436
$$ y = [5007, -19557, -52901, -27047, 2725, -8627, -22094, -42123, -51153, -27776, 133, 15187, 24612, 30478, 30106, 18242, -6616, -678, -12018, -28875, -26995, -11839, -35473, -24284, -8053, 1174, 2320, -15515, -29082, -2644, -11200, -4745, 19540, 26975, 22248, 5918, -25584, 3432, 37417, 36442, 15981, 1005, 24318, 24959, -15986, -39434, -22612, -6985, 11829, 18796, -159, 4096, 5306, 3280, 10709, -5680, -19028, -5286, -6431, -6971, -11875, -29027, -7982, 9634, -5729, -11418, -4099, -18812, -42069, -64155, -55596, -11869, 468, 2919, 32239, 17659, 30174, 33776, 28592, 24799, 15607, -547, -1864, -7942, -9836, -22654, -16308, 12798, 2835, -17199, -22572, -16967, -11862, -15613, -28477, -19988, -18283, 14557, 12988, 14202, 21231, -10350, -26972, 9464]
26543I464L3193l854k4553j4447M895K2559R652k612j2466k4203L734J199j2392
26530i831J0297J6259q104M255M774l7622k7800Q405L2141J4231l1396k2221k1610
26517f8222L6439L0189J4155j0814j7463j1462j641L8398J8121J225Q00j4529
26505A5196j2463m400j81J3416N776j9323O470K9832K7148k2662j6124k5194j5170
26492a7679J1539K3104l7461j9926J2476L3015k712J0980J5040J0720l7925q781
26480g610J6890K8087k225k829o495K152k8061k1160j528m426p361K87j0510j89
26466d4978K2983J2843N362N226j93J5634l485M141j4806o315Q112j385k2509
26453a9370p825J5678K026O869K3434K956j632j74m7102j8559K9110J1347J1866
$$ y = [9464, 42657, 38803, 14250, -197, 4698, 27257, 36909, 34297, 21831, -2372, 1362, 2561, -9831, 466, 16725, 8621, 12876, 17650, -19972, -47772, -39367, -7226, 7005, -24391, -46612, -68222, -31783, -1594, 12561, 1747, -15716, -27178, -28819, 9579, 27700, 28925, 29725, 15196, 2733, -1667, -1848, 11568, 17344, -1979, 4491, 34323, 61471, 38809, 22685, -2509, -17679, -6140, 16964, -20497, -40423, -27947, 5068, 2356, 13336, 28376, 39096, 1171, -7610, 9280, 37367, 35142, 32313, 25818, 27970, -91, -21251, -22779, -27205, -34566, -34279, -44789, -44978, -21995, -9152, -3790, 1436, 1243, 16877, 13392, 17533, 2727, -3588, 4524, 3139, -19370, -27195, -11517, -9491, -2622, 20812, 23768, 22136, 21962, -25140, -43699, -14589, -3242, 8624]
26440H624L7200R537j6954j1626o287M6l10j3427J5033j746k1143j3941J0228
26427d766K2394j1531o284j9406J7537j0093r42J3598J3742J8614R262N275k1460
26414B5940n819J893j6679K132J6352k688J9579k6843j8720L735j5227j1295l547
26401c1187K0118L7038q519k6377M270k3906l0906J3370L4559K159j1189j4555
26389c5125p563K567K6741M459j2494r018J0323N783j084J3439Q67j4629J4217
26376a517J181k1882J3911j1372j844Q340J0884O575j4747k7528L250O239j2976
26363d1486M4939K1009k1407k2819L071K5144k1547l7965O708L6508q866p834
26351b4545K2956J29J8517j1058j1253r774m632j1863j4638O371k815K0443L4907
$$ y = [8624, 45824, 55361, 38407, 26781, 20494, 20540, 20230, 6803, 21836, 20090, -1053, -14994, -4766, 17628, 6097, -187, -19593, -2056, -12149, -13091, 507, 14249, 32863, 42125, 47400, 25940, 20121, 22014, 5335, 7467, 23819, 21131, 40710, 13867, -4853, -1118, -16345, -27640, -31187, -11069, 25969, 17450, -8927, -4657, -28563, -59469, -46099, -11540, -9381, -20570, -35125, -42688, -40121, -13380, -8921, -21415, -30433, -20110, -14327, -15411, -1972, -1105, -15734, -1517, -336, -22218, -8307, -19679, -21523, -13183, -2299, 4276, -10471, -37999, -34749, -28510, -41486, 3453, 24462, 3055, -19764, -16693, 8451, -13096, -51061, -44353, -7845, -16711, -24545, -1589, -1460, 17057, 5999, -5254, -15028, -19660, -31523, -46161, -39790, -42605, -22162, 12745]
26338A2745L9001Q082M286k5088n931j5558j4685N550p739L089L015O73j2009
26325d569l1926j2566P037p79K8331J5381j150j2494l6602j8008K6905O856k5695
26312e9279L2748L1620K7021K1207O074j0148k5480J6335k0717j2475L856L38
26300A1100O5J3264J5790k4349l3520M67j8331n885R018J082j6650o013K0834
26287c3128K7373k3173p587J7944L832J1072n151L481k0580J1407M359Q913j1719
26274a2957R86k0355O661m507k9681K1065M1369j103k5645N911L049O490m895
26261a3612j2160p642j352K2562P034K5094k3509j293K410j7638j2383R734N276
26248a7479j548j4194L479J2608J10J6212M379L4581j0853j6815M061j5418K360
$$ y = [12745, 51746, 59828, 64114, 39026, 33095, 17537, 2852, 8402, 663, 3752, 6767, 7440, -4569, -36495, -49061, -42024, -42803, -14472, 909, -241, -12735, -49337, -67345, -40440, -33584, -59279, -26531, 5089, 32110, 53317, 59391, 49243, 23763, 40098, 19381, 6906, 10762, 11100, 11165, 24429, 40219, 15870, -17650, -17183, -35514, -41399, -32381, -31299, -47949, -53962, -33128, -5755, -28928, -36515, -18571, -14739, -3667, -8818, -5337, -25917, -14510, -10151, -1238, -12957, -11971, -32326, -25665, -30172, -59853, -38788, 2581, 1478, -24167, -18256, -15207, -8717, -13612, -25772, -33414, -34766, -12204, -5170, 19924, -3585, -4878, -2468, -20106, -32489, -22755, -17479, -19027, -33221, -29742, -17134, -17024, -812, 3567, 38148, 27295, 10480, 14541, -877, 1483]
26235A483o013K5435l827L060o770j492O794m845P358N780j9891N599k1767p355
26221a6451j99K097P97N616k4835L72L0291K4011r617k2232j0750Q951L468m983
26207a3464p942L84P156N838p397o91j452p494j1357K0133K8131N133l78J555
26193A8155Q378Q383k472k5101j4362J673o934L24M956j0943k712P884J0635K1820
26179A9684J2980k6414j1490L204j9440K0047k4014J737K2778L720O184q513j1014
26166a0551J2790K9800R216j4301M484J1286l721l1252J0996J5242k0086j5847
26154a944k878J097r327k5123J1382M3875K5326o009l5280j1055J8720J4756j9428
26141D112k0514L2037K2224k0067m816K4826q1r827k9669N627K077j4356j0858
$$ y = [1483, -4530, 20905, 17078, 20138, 13368, 11876, 18670, 13825, 21183, 26963, 7072, 12671, -9096, -16451, -16650, -14553, -13756, -8140, -32975, -32603, -2312, 21699, 12082, -10150, -20900, -11949, -8481, -13464, -21406, -21022, -13866, -8028, -15425, -16116, -17568, -25062, -36419, -16286, 11845, 16978, 16600, 18155, 26533, 34916, 32444, 7343, -7019, -5346, -12280, -11956, -7000, -17943, -20655, -12771, -2136, 19684, 32664, 6250, -5240, -2036, -21476, -1429, -25443, -23706, -928, 2792, 8976, 463, -10551, 2239, 32039, 41255, 26954, 31438, 42724, 39003, 7751, 18747, 33989, 13903, -1944, -4822, -3725, -13052, -38175, -26793, 17082, 42408, 36399, 1119, -9936, 8784, 23540, 4112, -16402, 15635, 37859, 17792, 12976, 37802, 37721, 27894, -1775, 3852, 5929, -8427, -19285]
26128a9285J0828j351P774J8633k872J4561j3639p966r391m0958K6349K740j4780
26115b9357O168k981o723q021K7384K4248p29j8111K124j4930j545j1433j2952
26102d6858o758J0445L807K120L0987N697Q675m200m331j0547l780o670j8830
26089d0243P756n652J242K3133J1474J0712l807m960n91K1633L137m4336Q718
26076a1784J129L031k6852K816o75K7167m866j9031l174j6020M310M0430M7429
26063D3910J1192m75N78o538M518K029K3201j6525k0977j1697M8k5590m391J4869
26049A4152j4531l7532J1400J3279j3307J5099J0154J7899L709j3421J6860J1446
26037C5207j2681p490J484j3883j9737r588J0474L0053J5656M264j7717l752J2082
$$ y = [-19285, -8457, -9808, -2034, 16599, 13727, 28288, 14649, 6683, -2708, -43666, -17317, -14577, -29357, -23189, -26170, -32893, -40914, -13530, 10718, 9989, -8122, -5998, -20928, -22473, -33906, -46858, -53616, -43171, -39364, -37244, -6257, -560, 8115, 3915, -416, -10963, -14743, -21413, -40243, -32487, -38139, -36897, -13764, -2290, 8422, 4615, -345, -936, 20697, 23834, -20502, -11784, -10655, -7624, -34476, -31660, -32335, -5168, -10034, -29065, -32239, -48259, -43949, -3519, 43910, 55102, 54627, 55205, 48667, 53185, 55214, 78415, 61890, 40913, 29216, 29264, 3674, -717, 14152, -379, -37911, -26511, -13232, -26539, -11440, -1286, 16613, 20322, 6901, 23761, 35207, 22526, 15036, 16520, 2637, -17100, -26688, -16214, 13839, 29495, 33759, 16042, 12290, 24372]
26024B4372k6247j6625j511k618n860j5767K4137J2971j3695m964Q331j591J1160
26011g907M86Q792K5529K5198l1283m6089j2626J1352K5263R017j9261j7111Q851
25998a9789P970k8363P720M6461L6993K5278l2759j0971l514j1184j9848k2255
25986b4261J0126J687k578R139M85j5064j0343j9638q952p87q176K2119J8869
25973b7374J5583j3403o489N791R786M717k0869o455J1879J6564k0532k8962J2531
25960d7233L5516L2362j254O29j7634k1874M148j9102m388L1646K5314j352j2567
25947D211j3235O686N732j7451j6000p357R738K2862J5717N277L014O024m378
25934B0840Q197J6066j3216m1284k5528R970M2403k2899k2227j2723N62k3344
$$ y = [24372, -1875, -18500, -20011, -22629, -28489, -44256, -20119, -7148, -20843, -25807, -17476, -19067, -7907, -7421, 1371, 26900, 52098, 20815, -25274, -37900, -26548, -1285, 7732, -11529, -28640, -19789, -11819, -40182, -32462, 13999, 50992, 76270, 43511, 32540, 29026, 17842, -2006, -24261, -14135, -12448, -15026, -5887, -5402, -20466, -30809, -50447, -59399, -60186, -68362, -46243, -27374, -11791, -25194, -31683, -25892, -16106, -11389, -32258, -38713, -26834, -10270, -30802, -59764, -47233, -11717, 20645, 19391, 20020, 2386, -19488, -15340, -34442, -38830, -7184, 18130, 16778, 4211, -9024, -2338, 3394, -14057, -30057, -37414, -27676, -4814, 10903, 16180, 19194, 25218, 20840, 29037, 45103, 31887, -9397, -34925, -24955, 17448, -5451, -27678, -40401, -39839, -63183]
25922f3183j5803q825J6547L5556K2260j5282J3933J2414J5476K0192N768k4646
25910A4407p563j3952o28J9459n498N945J3654r807O840J5654k7100m5635N322
25897b8902L0127J0041k2322n716j2588p970l801K8488J1780N386n839k149J2283
25884H818j835q078J1253l525J7860j6192l4202m34R610J8249j5945k4858p163
25871d6442M441J9596Q936q037K151j0178m056J0382Q731J1412L620j4564j0323
25858b4331L0962J3697q54K962l563j5504j2061K432j2759n65J2570P950p640
25845f704Q251o31R078J0985m218L642k6289k3821P288P499J9894j0561j4707
25832b0294k963R322P813K2951K1152N489R723K0071k0876l4553j498n544j0074
$$ y = [-63183, -78986, -87811, -71264, -35708, -13448, -28730, -14797, -2383, 13093, 33285, 39053, 14407, 6844, -7108, -7736, 11723, 6225, 12170, 25824, 16017, 22857, 38511, 11411, -34224, -28902, 1225, 11266, -11056, -16772, -29360, -37330, -41131, -12643, -863, 4523, -1316, -3465, 8818, 6983, -1095, 10158, 6633, 24493, 8301, -25901, -26335, -16725, 1524, -14421, -39279, -46442, -42001, -22405, -13469, -21506, -19355, -29533, -33589, -23207, -14476, -3064, 556, -14008, -24331, 6631, 20328, 19474, 22436, 18873, 3369, -8692, -6260, -19019, -19584, -7014, 936, -6704, 1547, 916, 9994, 20979, 16761, 20403, -5886, -29707, -22419, -14920, 4974, -5587, -20294, -23257, -13935, -6122, 16829, 37981, 43470, 53193, 73264, 52388, 17835, 16337, 10793, 719]
25819G19R285J3953m983r832k4771K5973N227N624o094n421k3246k6274p81L3155
25805g466K2735K5273n565M301l0557j4683L1114K191R286p905j4459j6502O973
25792D736K3089m1n0105j5773P479O637N572L0217j3971k1992L531K4351k255
25779A475J5221j1199Q330l07j687r156l746K7594l257j5643q451N137m4480O347
25765c3822L0293Q319j4625m084J5383J7086J132j4631o324J2074k4213l5048
25753d8460J2220q858j1516Q126K5820J4550K0698n415p414N14N24r512K561K6069
25739A9907K4985P15j6234j3485k842K4570l5226m5164K6561L2613j4873j1725
25727a0198K7651N723J7275M1484k1131l7750m5459m797k517o483N616M592M578
$$ y = [719, 10004, 23957, 18974, 9142, -15629, 10344, 15571, 21195, 15101, 9680, -13566, -39840, -40621, -7466, 15269, 40542, 34977, 39278, 8721, -5962, 25152, 27343, 36629, 28724, 14265, -2237, 4736, 27825, 27784, -22321, -38094, -30615, -23978, -18406, 11811, -2160, -24152, -20621, 3730, 1475, 16696, 5497, 13827, 13520, 11833, 2677, -1069, 26525, 23268, 7625, -826, 4311, -40169, -33822, -3529, 4790, -9835, -13919, 1464, 18550, 19682, 5051, -1273, 10801, -13412, -48460, -36240, -45098, -56614, -48488, -22668, -8118, 12580, 7165, -249, 265, 789, -8723, -6162, 19907, 44892, 45607, 29373, 15888, 13046, 37616, 2390, -42774, -16213, 16400, 1527, -10198, 17453, 23176, 40451, 81935, 60804, 23054, -22405, -27202, -29719, -36202, -30586, -25994, -21416]
25714b1416L698j3819j2273j4189K3277L9564R82m442j7233l5776L0418K4209
25702C000N340K3518N360j3141P125J2859Q96j7326k0620j4014J7185k305p525
25689C52J024R270J1351J2280l072J55K846m1010l4191R775L2652j136N258O834
25675A2388j5734J3863N804k9599R811M2979j1445m5567l002J2259J7723N56k7801
25662a7765J4453m164j165j2019m352J2800N552P626Q762Q112N390J2457r434
25649B6253j8444k4558l405j7702J6264q593j7150k44J1861J7728k951K7440L9216
25636D5715O440k6558k0127j7761Q014J6972L0807l622n567r024K210l636j8427
25623E436j4519k177K5119j55k8705n115L5299k4033l6385K8048k45R676k3708
$$ y = [-21416, -17718, -31537, -43810, -57999, -34722, 4842, 5824, 1382, -15851, -51627, -21209, 3000, 8340, 31858, 37218, 24077, 31202, 44061, 44957, 27631, 7011, -7003, 10182, 7877, 352, 1376, 10646, 21997, 34277, 31205, 31360, 34206, -6804, -40995, -31220, 1432, 296, 5554, 12388, -3346, 10517, 16321, -13278, -3467, 39512, 28067, -17500, -20502, -8243, 9480, 10036, -17765, -3312, -7476, -8641, -20660, -25012, -12212, -6660, 966, 9728, 17840, 23230, 35687, 26253, 7809, -16749, -20154, -37856, -21592, -30185, -47335, -47579, -35718, -17990, -20941, 6499, 45715, 52155, 25597, 5470, -12291, -4277, 12695, 43502, 39880, 34313, 25289, 27499, 23863, 5436, -9083, -11260, 13859, 13704, -15001, -20116, 15183, -8850, -45235, -17187, -17432, -7756, -31464]
25610c1464l68M0359p890k3341k0693j1452m234J7388M272K2299L1471L0189k1825
25597B4711j5980K991j0421j3260K047k1597n86Q519j3146j2284K0551k741J0125
25584b1071J9773R835J4254M646k9347k3674J0350j4002j9306n453L2446q311
25572b9860K1432L2035l637k0094J1785j6145k3555M476J8648M485J2711J1985
25560B4266J7178j4090p497M11l9751J937K6004K1338L659j5022j7061k7924n835
25547c2387k842R035R449J2898K8410m907l0022J1121P440j0940J6056L0926K3102
25534F7339k5821k4012j6478J2367J2409k2277K356K503j9228l250n829J2792
25522g129K2807k8859k8838K1562J672j2962J9083J9861j9647p793q914k7245
$$ y = [-31464, -31832, 8527, 637, -22704, -43397, -54849, -59083, -41695, -37423, -15124, 16347, 46536, 24711, 8731, 11722, 1301, -11959, -9912, -31509, -32095, -23576, -36722, -49006, -28455, -31196, -21071, -1298, 8537, 22791, 27437, -1910, -25584, -15234, -29236, -48542, -53995, -21549, -29860, -8428, 23607, 19970, -124, 11661, -4484, -28039, -23563, -4915, -430, 12281, 24266, 41444, 27354, 19857, 20268, -19483, -17546, 8458, 29796, 33455, 18433, 1372, -26552, -32387, -35229, -26194, -16745, -3847, 24563, 19656, -10366, 755, 8195, -2745, 13311, 44237, 67339, 41518, 17506, 1028, 13395, 25804, 3527, 5883, 8386, -10842, -14092, -19921, -7129, 15678, -13181, -42019, -20457, -18785, -31747, -12664, 7197, -12450, -20243, -29157, -56402]
25510e6402q217K9540J1398j0835J5719k86J2386M078J46K565L492K1002K1839
25497D6425J3254q082k3106k8367k9288j4766m455J6228P895K7662j599j7828
25485a6027K5758J3455k3831j7946j0208K8317M0535k4148j8267J053K363L875
25473D929J8982P6k2135J3021Q008k9896j662M2338K39j9787k1835J0134K4837
25460B7249R609j4522l6244r101j3686J8966N2524O178m5562j2082K1173Q548
25448A3050J0441k47l9521k187J6378J4527J0590J940m991P689J1752J40j3537
25435B6024M340j1938k7248k9533R761L6550P445l1965Q645J4821L7230K0388
25423F4520K201J5501m3162k0549j5326r54K3995L0023P209j0839l4594r847M319
$$ y = [-56402, -64619, -35079, -23681, -34516, -18797, -19083, -6697, -2619, -2473, 92, 3584, 24586, 46425, 59679, 51597, 28491, 124, -29164, -43930, -48385, -32157, -24262, 3400, 1801, -16027, 9731, 23186, -645, -18591, -28799, -482, 40053, 15905, -2362, -1309, 1054, 4929, 23911, 23987, 1852, 14873, 22881, -7015, -8677, 33661, 33900, 14113, -7722, 2412, 27249, 36858, 22336, -13908, -23009, -36695, -17729, 34795, 40973, -4589, -16671, 4502, 13050, 23491, 23244, -16277, -18464, -2086, 12441, 23031, 24971, 19980, 27669, 39421, 39561, 26024, 30364, 18426, -8822, -38355, -28594, 7956, 15401, -16564, -7919, 6902, 44132, 64520, 66721, 82222, 39060, 18511, 3185, 2231, 26226, 56249, 63458, 52619, 18025, 8178, 12497]
25410A2497j667m895q686l608L757m874R694K0254J0418J1526j3613J1612M75
25397D2890l86o170k5777m28l6764n450J2634J523j2955j7139k4798L1402J5211
25384b6207n271k649J127Q637L299j8556k467R393L4043J1271R485m993r777j618
25370E717P032J8479K1516O455k1601j8045J3170n065q746n57r682j0126K363
25357I10J2377j0184j4312J3775L7680l179Q921j4479j4875m544k824j8177r452
25344a8363J8750J7300l0257k7903N655R535J5725J3557O94j7065k7019N156K4248
25331i987K23k7261K3871j1546j1399J344j3429K3202j194j1463J9569K0393k35
25318B088R13K655K4519K3186J0880P188j3669j5104O164k7873l6505K5822J9141
$$ y = [12497, 10830, 5935, -2751, -6359, -2602, -7476, 2218, 22472, 32890, 44416, 30803, 42415, 42890, 42504, 36334, 10557, 10129, -26635, -32085, -19451, -17928, -30883, -48022, -72820, -41418, -26207, -31478, -34127, -33000, -24363, -21064, -39620, -42087, -32694, 1349, 12620, 22105, 17112, 7335, 5717, 12749, 31228, 52744, 59199, 37598, 19553, 32723, 27658, 18912, 18355, 8673, -1453, 910, 13287, 3103, -11209, 2566, 40246, 37067, 45988, 31509, 16634, 12090, 9266, -8911, -18363, 387, 17687, -12570, -40473, -34818, -25283, -9558, 3999, 4693, -12372, -39391, -34235, -9987, -9764, -37025, -13154, -24700, -36099, -34755, -48184, -24982, -26176, -37639, -18070, 2323, 2088, 3001, 5656, 30175, 53361, 64241, 71429, 57760, 42656, 48820, 20947, -15558, 10264, 29405]
25305B9405l30l624P900K3519j083k1847j9821m3154K786R121j3353k498J1155
25292b1824k3412o719K9043o277k5133K9495J2613J6807P012j909k892J2025j7830
25279I99k2423J2565k1206o705J4444N368L1157l065j6940Q170j0160j8686k1245
25266d7727Q530R141J6922M743J1534j3073l0116p087L0376P806N263Q602M56
25253E370J6007P598k545J381m960Q123m329k4380j4929K8887K6528o808k3374
25240A2569l2055O185J6842N981o707J4468n193k2824q052R696L495k15l237J2411
25226C364n571K5046J6888r056j5391n76k927j691j5414J2931J4301k1543K029
25213B390J5241k7404J4480k3803l2498J7827J1804j0269N122j1874k927K2960
$$ y = [29405, 29075, 25451, 33351, 56870, 55787, 33940, 14119, -29035, -26249, -17128, -30481, -32979, -21824, -45236, -51955, -22912, -29189, -54322, -24827, -12214, 4593, 11605, 9696, 6804, 18829, 999, -21424, -8859, -30065, -36770, -22326, -16958, 14199, 11134, -5806, 2364, -7796, -26482, -47727, -39197, -30056, -13134, -8391, 3143, -9930, -40046, -47133, -16757, -8951, -3688, 4914, 5370, 21377, 28975, 26430, 27811, 22851, 30974, 26645, 2265, -12664, 16223, 42751, 35943, 12569, -19486, -13301, 3541, 9522, 2815, 17283, 12090, -10734, -18786, -9090, -5595, -5810, -9047, 3364, -2207, 22839, 39727, 30671, 15280, 14704, 11777, 10086, -5328, 7603, 21904, 361, 2390, 17631, -9773, 4707, -19096, -51594, -33767, -21963, -32232, -27110, -38984, -41911, -18951]
25201a8951P083l58O658O062N104n033q407L24r647o622J5645K1925q562k7093
25187b1872Q96r328k8143J6374L935q652Q768m856L2644J6831L04j4988M284j8324
25173b2127o651L5965O970o279O165K5608J6379p617m214j2756l4297k4752k970
25160c0576j0568K78q81J1915J3677L7097P718n402O697J2090j986k2221o805
25147A1033l092L924k4238J706j2741J4773J2553m2254q373K535M872J9641r258
25134b8919k2866L7265K3094k7391n05N630O429O331k299J536j756r670k8590
25121d1711Q300J0056l0834o958K7266J3927l062R350P06m678J6112J8308K2191
25108C8973J0851l1949j1126n670n239q37L909j4417Q007K0948J1391l4177k2367
$$ y = [-18951, -11868, -12226, -5568, 494, 5598, 565, -7842, -7518, -17165, -23787, -8142, 13783, 5221, -21872, -20976, -30304, -58447, -42073, -38138, -46790, -38022, -42878, -10234, 6597, 6901, -8087, -3803, -22127, -28778, 7187, 14157, 7878, 14043, 39651, 56030, 48413, 44199, 31443, -2854, -27606, -30576, -41144, -40866, -41747, -29832, -16155, 20942, 28660, 23258, 29955, 42045, 40059, 17838, 11033, 7941, 11865, -12373, -10667, -23408, -8635, 3918, -38336, -46709, -44174, -39302, -19661, -28919, -51785, -14520, 8574, -18817, -19322, -13692, -7263, -932, -3231, -1695, -3451, -13121, -41711, -33411, -23355, -54189, -61147, -33881, -19954, -23016, -13666, -12960, -17638, -1526, 16782, 38973, 49824, 17875, 6749, 1079, -4160, -4997, -1088, -15505, -7498, 13450, 24841, -9336, -31703]
25095c1703J8438L8154K6983j2552j2708j8713m518j9354L091L876N393k120K5163
25082A9430K723l6668J836M115J7985o663K24k5672l7210J4841m373L0832Q438
25069a0162O153L039K3785l190K461l644L252K179J5387k8113m7808q46L0187
25056g320L0447L050k146m675N241K199k173k8205l4292j7823l05K7854r20L012
25042b6056l648p512J517q33k4629R386K3894K4514J5869q223P4l017k8597j7677
25028d4938J5726J2428N354k4310K7059J4703j5732p31O13o945n295J2078j2916
25015b2906M422J6142j0195J6235R606k547L67p058j7135m792J1449J1521J4641
25002A9750j5877k5737K5023J6299N95K102J4422j2235k4403N778O463L0555k163
$$ y = [-31703, -13265, 24889, 51872, 39320, 26612, 7899, 3381, -15973, -12882, -9006, -3613, -5733, 19430, 22153, -14515, -12679, -8564, 9421, 2758, 2982, -22690, -59900, -45059, -49432, -18600, -10162, -4009, -970, 22815, 19625, 22086, 18442, 21694, 23873, 39260, 11147, -36661, -37507, -7320, 23127, 26177, 24031, 19356, 24597, 26796, 24623, -3582, -37874, -55697, -56002, -28148, -29068, -26056, -29704, -37216, -35699, -36532, -61161, -51775, -27881, -3367, 12502, 4279, 4353, 1336, -27261, -44938, -29212, -16784, -11430, -35740, -8681, 6022, -9710, -10441, -9828, -16773, -22068, -9990, -22906, -18484, -2342, -12537, 3698, 13304, 10757, 11124, 4066, -13069, -17861, -6412, 5109, 19750, 3873, -21864, 3159, 19458, 20053, 22155, 36577, 24342, -61, 5717, 12180, 42735, 40572]
24989D0572n941R337j6839k8315j9779j3588J9443L601K2318p126k2255q344K028
24976b4888J9511q790r124K3009L3669l4127j2220J87q98L158p196P350K0241
24963I882O999r929l4033k4435m512K0783J0046L034J5329k4334j0370K1305J674
24950a8561j6473L564Q353j152K0252J4880j4726K478O76J1149o965j5350q82
24937a2757J0575O785J9294q796k744j5151r294K81K1333k3175J504J4276J3201
24924A5332j4285j6029m699l137J1014M593k667j0628k2424r666J3954J4873J9889
24911c880N729J3245L295j8150P548J4202l811j9380l5104j4714K0774J9783K1574
24898A1111J4480k5582l366K3326K0398k4962j2444J6776r482j1142J6251K2047
$$ y = [40572, 34631, 43968, 27129, -1186, -20965, -34553, -15110, -11509, 10809, 3683, -18572, -26916, -24888, -5377, -14167, -23291, -282, 33387, -740, -12960, -12773, -13671, -10513, -17709, -10359, 9882, 16881, 6952, -27081, -51516, -56028, -35245, -25199, -22165, -6836, -31170, -41540, -20235, -18561, -35034, -31470, -23117, -24269, -4017, 10863, -3863, -1385, -709, 10440, 3475, -11875, -12757, -2182, 4603, 23897, 15101, 12357, -2794, -12088, -11807, 9526, -13649, -12145, 2131, 15332, 1047, -14982, -19681, -22818, -11804, -7211, -9878, -20506, -42930, -52596, -38642, -23769, -3880, 1849, 15094, 18389, 239, 7787, 21989, 18178, -1202, -36306, -51020, -30246, -10463, 11111, 25591, 9, -3357, 19969, 40367, 15405, 2961, 19737, 10255, -887, 15364, 37411]
24886C7411n883j2440P339j6871J620N878M543P695k8524j8832N209J3507j5589
24873a4937j8198L915M357j7627j0035J6551j869J9613O855l5309N333k1875l953
24860f7179J4765J6192Q762J2953J53q885k315q283q084j442O318L9257P475j5117
24846e430j0554K512Q941J6750p222j15o858P605M204l0581j1028K2378r228J6458
24832b168J0007o720j9312k3953J7914K2109m755k4263l0234L4368N1006n332
24820A8667P133J8718l5168k9715M300N043N288J4360J0112K465k9144j673j0437
24807b0051j2140j756N947j7226M954K9805J3928M421p763R447j155j4324q866
24794a4779O674K1640N610o952p276l5264j0188J229K8276L6019r055q598Q654
$$ y = [37411, 31528, 19088, 26427, 9556, 11176, 17054, 21597, 29292, 768, -18064, -12855, 652, -14937, -33135, -29220, -24863, -42490, -52525, -35974, -37843, -18230, -11375, -46684, -41351, -63226, -67179, -52414, -36222, -27460, -14507, -14354, -23239, -25554, -33837, -41921, -43363, -37045, 2212, 9687, -5430, -15984, -13472, -4531, 12219, 4997, 4882, -1976, 5629, 9833, -20748, -31776, -9398, -18626, -2168, 7839, 1119, -18193, -42146, -24232, -2123, -6878, -31141, -61375, -27007, 23999, 18667, 25800, 44518, 9350, -20365, -16065, -11022, -5734, 8626, 18738, 21203, -7941, -9614, -20051, -32191, -33947, -28000, -45226, -40272, -10467, 3461, 7882, 119, 9566, 8411, -5913, -14779, -8105, 13535, 19145, 12193, 4917, -30347, -40535, -39306, -11030, 24989, 15934, 7336, 15990]
24781A5990j3311P268J6798N521j5626k7565R54J1452k963O309J816j9387l820
24768a6564M492L281J6975J5323q257J3792R35r688j3424J1802j3387m036k102
24755h58L1958r49l5645l3256O158K2141J2709Q980l724J475J7268K5120J2625
24742F4002k4138k5435r892N279j5827o508R624l625N101j2159m1286k3236L415
24729g4685J0039J7103K1309K6632J0066J0542k5035j2341j834N784J647J1722
24717I49J739M864L463j5045j2822J5799J5849j3137l037r507k1919L488J9269
24704a0047p717R486K1614l049k0967k9538j4600J8109K2871l085p411O681R988
24691g665r97O94J3689K2656J663m783J1359J745j2578j3217J1847J7855j1236
$$ y = [15990, 2679, 9947, 26745, 32266, 16640, -10925, -9971, 1481, -1482, 4827, 6643, -12744, -16564, -12072, -8791, 8184, 23507, 15250, 29042, 29977, 20289, 6865, 18667, 5280, 1244, -858, 31100, 30151, -5494, -38750, -32592, -10451, 2258, 11238, 7514, 8989, 26257, 51377, 64002, 39864, 14429, 4537, 9816, -6011, -12519, -2895, -6520, -1419, -13578, -54864, -78100, -74685, -64646, -47543, -26234, 398, 10464, 21006, -4029, -16370, -18204, -12420, -10773, 949, 2688, 7552, 11015, -4030, -16852, -1053, 14796, 1659, -1378, -10885, -32804, -29316, -10047, -17764, -8278, 13336, 10287, -10680, -40218, -54818, -36709, -13838, -16923, -24334, -17653, -7665, -8662, -7968, 5721, 28377, 30040, 25257, 36616, 38361, 25783, 12566, 24413, 42268, 31032]
24678C1032k0092O765L6241J9861j6092l3928L613j4806j8284m848K861P413k3284
24665b3548m111p722o10J7478K4211K887n326J5858j9140k6418K6143n715r196
24652a5209J3171J6477j0252m3612K6033K7296J3058l377j1399j8454j2385n114
24640b3767p293N98L672J9907P827k3000j4868m16R625K4038J5431J9415j3678
24627A7491M343J7178N902j9811k9386j0642k3952j1783J6962Q013j3246K0776
24615a8155J630j1413K4155j1747P49K0p228k1187n37l362r926K970n638K2596
24601c7073Q940J1692K2371P110k098m355j5041j6566j9101k4104L9384L3222
24589D381j0081O823k2992L948o112p354m11J5571k30j2021L558k296j0236J1127
$$ y = [31032, 10940, 17705, 53946, 73807, 57715, 23787, 27400, 12594, -5690, -10538, -7677, -264, -23548, -27659, -35381, -35991, -18513, 5698, 8585, 3259, 19117, -23, -26441, -298, -6013, -15209, -2038, 14439, 4187, -39425, -13392, 13904, 26962, 23585, 12186, -6268, -18653, -23767, -31060, -30462, -26790, -6883, 944, -22056, -36924, -37340, -27715, -3677, 11754, 31169, 17491, 21834, 39012, 44914, 25103, -4283, -14925, -38877, -50660, -33698, -25685, -38931, -18155, -16525, -27938, -3783, -15530, -14781, -14761, -21989, -43176, -43713, -47075, -57001, -54031, -59669, -37073, -28133, -16441, 5930, 13040, 10942, 6587, -8454, -25020, -44121, -68225, -28841, 4381, -5700, 1123, -21869, -17921, -24033, -31387, -31798, -16227, -16457, -28478, -24920, -27216, -37452, -26325]
24575b6325K6063J6367k0135j5064J158L390J0536K0124K898J0627J0063m306
24563C5396J316j862J102K0620j0380L691O67k3850k0281O806P454n230L255j5245
24549C459R380k284j1295m815K314J2863K1069K258K277q197R591l274K378K706
24535C8430p356k6986k0407o016j298J375n171J7146N771J310j3446L422N809
24522g417J886N796J0469m575N808P92j5122N905K814j7776J0088j442j1670O750
24508g694J4238m711J2963M070M639l0674k6723J9097M071j4979K076j9383j799
24495d4809J7020R092K5176J2305k224l588j8255L132o387k3309k8520R496N494
24482d5377M2501J4401J8948Q06J290m0292j7805J701J9071p628j3197j7303N070
$$ y = [-26325, -262, 16105, -4030, -19094, -17936, -14546, -4010, 16114, 19012, 29639, 39702, 35396, 36712, 34850, 35952, 56572, 46192, 49883, 50550, 26700, 6419, 13225, 20679, 15449, 18704, 3459, 12839, 10555, -740, -5555, -3241, 9622, 30691, 32949, 35226, 27029, 36620, 33346, 35724, 38430, 31074, 4088, -16319, -22335, -23633, -22258, -27429, -10283, -4512, -3202, -16648, -13226, -7417, -5531, 265, 10734, 6159, 11967, 12759, -2363, 3542, 6356, -11420, -1332, -2774, -14444, -7694, 6544, 1833, 14796, 18866, 23505, -7169, -33892, -14795, -10724, -25703, -23627, -43010, -44809, -27789, -18697, 6479, 18784, 16560, 12972, -5283, -2151, -8538, -31847, -60367, -50871, -45377, -2876, 11525, 30473, 31279, 32569, -7723, -25528, -23827, -4756, -12384, -25581, -42884, -37814]
24469c7814q517m020J0690J1901R766j2723l995J9501K7477q184q140l0884m308
24456c9250l0634M160L7968K2084j3745J1334K5599q539j5191j603k6390J659
24444c2548K4023K5352J482o838o058j4119k7610J404J44K6565R439k2443j8271
24431c9478p241K4121L992M818j0008j3904J1286K6510l7761j8802j7978j542
24419g5987J7751J2480q004N338m220Q038K419J3182K6962J2424k0987q071N183
24406a3492J3747K340N906j7691j9141j6185k274J166J9063J282J339R846J7212
24393C118J6772j9158l9347N105j1338P292J4416J3656J3748J7768j3692k7260
24381a8920J7131J8698j4774q619J7323J9454k273k7716j5557J1399k496j6050
$$ y = [-37814, -46331, -50351, -39661, -27760, -17994, -30717, -34712, -15211, 12266, 4082, -4058, -34942, -39250, -69884, -65724, -27756, -5672, -19417, -8083, 17516, 8977, -6214, -7817, -34207, -32548, -8525, 16827, 18309, 11471, 5413, -8706, -36316, -34912, -34768, -8203, 1236, -21207, -39478, -46719, -22598, -18606, -13788, -23796, -37700, -26414, 96, -37665, -56467, -74445, -75987, -58236, -45756, -53760, -48422, -52642, -44604, -42185, -29003, -2041, 10383, -10604, -18675, -13492, 255, 2595, 8501, -9190, -28331, -44516, -46790, -45624, -26561, -25279, -23940, -14094, 3118, 19890, 732, -38615, -33510, -44848, -37556, -23140, -9484, 4264, 22032, 8340, -18920, -1789, 16909, 2135, -6484, 10839, 30293, 28020, 304, -15253, -3854, -6350, -22400]
24369b2400j1304k1073K597Q379l180j3179N807K4867N734N174q787K063K7907
24356B605M258q021r404J4785Q629J0456J7368K6707L495j0301k3743m144J8765
24343E1455o023k0558l0843l2833N375M4107J6439p818k4936p647R881Q197k9792
24330b4996N835n598p221M917q273k7628n24L3149M0834r209k6155K8095J4130
24317A7356j7583j3968O436J2523q72q655J5717J1053J891j9237L67J3191k6939
24304h720k3724K9389j206p32j2037j5951j2391k2691J9087L2015N635n771K2198
24291E101K5065K4197J4814m915m93l3231k1596k1579J5133O077n27J3425p210
24278A4261j2841l679j5536j129l249M5430J1926m2507O866J7628R85q098j1570
$$ y = [-22400, -33704, -54777, -52180, -43801, -46981, -60160, -54353, -29486, -23752, -18578, -27365, -25302, 2605, 6863, -1158, -10562, 4223, 12852, 23308, 40676, 67383, 70878, 60577, 36834, 32690, 51455, 45432, 24874, -5969, -38802, -33427, 10680, 27119, 19301, -5635, -13282, -3401, 4796, -24996, -19161, -24759, -31980, -27063, -35336, -62964, -63488, -30339, 10495, 1286, -24869, 3226, 17356, -227, -14195, -7759, 4764, 3892, -4763, 10954, 22007, 23898, 4661, 5028, 18219, -8720, -32444, -3055, -4261, -4993, -17030, -32981, -45372, -68063, -48976, -16961, -11326, -17097, 5101, 30166, 54363, 69177, 64262, 63769, 30538, 8942, -12637, 2496, 8573, 8046, 21471, 14261, 1420, -2259, -17795, -18924, -22173, 23257, 35183, -7324, -458, 17170, 18155, 10057, -1513]
24265a513k2606R06M950m693j7646l1100j1163J8931K4177K0324L0410J3648K7367
24252E1992j5813k493m1786J9753Q208l2640j0693q038l20J981p424J9925j148
24239a8496l561k4018J1671L1737L0057j7234M784K9823j9430O986m470q631l030
24226A6188j8118m11r423j6039K4611J1139L573O634p941N955J2668j456m238
24213B3142m634j7007p311j0592r64j3861o929j577J9292P473L949j0375K0507
24200A113K6322k3647j7557j671J0290r46k9106j6552M4303J6889l2454m2148
24188f5164J3674M4412j8800j6701J1366K7237J4166K0525k1755o68J828q505
24176A615m275l044k4560N533J4209K2912r205r239p813r603R572L0280j1536
$$ y = [-1513, -24119, -23213, -18263, -22956, -40602, -71702, -82865, -63934, -39757, -19433, 10977, 24625, 51992, 36179, 33686, -8100, 11653, 19861, -12779, -23472, -31510, -31830, -29849, -37273, -17348, -18496, -22057, -46075, -34404, -2667, 27390, 10156, 14940, 44763, 25333, 32319, 27849, 19218, 16188, -1930, -2341, -11764, -27803, -3192, 7947, 11520, 18154, 10213, 16168, 28836, 27380, 23142, 18508, 1501, -5810, -16402, -17366, -31227, -38156, -39733, -20441, -12968, -9019, -19394, 1113, 27435, 3788, -13769, -15440, -5150, -6096, -35202, -51754, -7451, 9438, -23016, -65164, -51490, -7078, -25878, -42579, -31213, -3976, 10190, 30715, 8960, 8292, 10120, 1615, -2660, -5704, -30264, -24731, -10522, 12390, 3185, -6054, -13867, -23470, -13898, 16382, 4846]
24163D846r845k344j6118j3255K1368J4126M436K3898J676n317l0229j8470J6232
24150h996L392l729j0184r9j820n807k3638j6622M7737L2566K633j1657J2977
24137A6753J7182M770m3052j2174J6914K3033N917j29O20J1211j6203j4155n782
24124D905k7760j8581K4906l044J8552K4396j3277k3275J8801M293j372Q307J7360
24111C4211r517r698j0669k362K1921o990j9751o06Q84m83j6680J1127J9563p641
24097C309J0822q825k5575j6920m632K085j2715k079K8361J1842J1480J7630J015
24084A5798j5726k4892r324k186M724j3197Q067K9233N424M392J5513j6305j6327
24071a4806j8477M161j2066J9139J6072j2724m0925q393J0910p662P445K2549
$$ y = [4846, -4999, -7343, -23461, -36716, -15348, -1222, 3214, 27112, 28788, 23471, -6758, -25228, -8996, -5604, -9333, -19517, -19616, -21436, -27243, -50881, -67503, -19766, 12800, 15433, 3776, 16753, 33935, 38705, -4347, -16521, 393, 23426, 29343, 29214, 29834, 41045, 24842, 10687, 4905, -22855, -41436, -16530, -19574, -1022, 23374, 10097, -13178, 5623, 9916, 8544, 16851, 34211, 24694, 14996, 4327, 1965, 23886, 16896, -2855, -3461, -2577, -3060, -19740, -8613, 10950, 3309, 14131, 5306, -20269, -37189, -41821, -39736, -52451, -54530, -26169, -14327, -2847, 14783, 15798, 72, -24820, -34144, -36330, -31606, -44803, -36736, -7503, -2079, 2313, 17826, 1521, -14806, -33283, -29122, -41188, -22049, -5977, -18701, -59626, -68019, -57109, -64771, -57326, -34777]
24059c4777Q77K1689R218j3397L0191j5765j7399J0670P678j145K265L573j8531
24046a4853j2371K2972K17p090J5870M218j1761n925J5918n008R535K2939K387
24033C7048j6839j9334j9602j0584J3336j3658O578O567N000J5836J3247l810
24021A3785P389j9408r178L3128O599o110n603j2114J3290j9270M108K1177J5414
24008D3207j7172l4289n6032j4283J6115J3883K827P482J3108J1496J8458J6354
23996B1154J2564K3485k7346l8345j9627j9856J9352J3273P151J1455J3412j2271
23984D401j7566j0059J68K631J0504n766J1294N17k2794J2774K5455j3201r262
23971a0904j6716q983K1463K9254l0542N962J0964j2836K9787J3559k3399j1104
$$ y = [-34777, -33900, -12211, -2993, -16390, 13801, -1964, -19363, -8693, -1015, -2160, 105, 3678, -14853, -27224, -4252, -4035, -11125, 4745, 8963, -2798, -8723, 7195, 2187, 11722, 34661, 37048, 20209, 875, -18727, -29311, -15975, -29633, -23055, -16488, -11488, 4348, 17595, 13785, 21174, 1766, -7412, 25716, 32315, 26205, 20602, 8488, 21778, 2508, 6616, 27793, 43207, 26035, -8254, -64286, -78569, -62454, -48571, -45744, -38262, -25154, -13658, 4800, 21154, 33718, 57203, 29857, -8488, -28115, -47971, -28619, -15346, -8195, 3260, 16672, 4401, -13165, -23224, -23056, -20425, -9921, -15687, -4393, -3876, -26670, -13896, 11559, -1642, -10904, -27620, -36603, -15140, 14114, -16428, -10466, 498, -12338, 17449, 31008, 7609, -3495]
23959c495q826J3995K7485J364J2324J4827j4808k9494J145J5465l2186n296N968
23946a532m076J4630j5625j4868m908q961L5519L4962j0954n2652n347J9248J6811
23933B247K2752j6537p161J2025L266J0749j6614k937j548J4444j7808k4025Q104
23920a3043o057l066k4288p492j6341j7972K4973L0138R975k2122j1594K9574
23908b7315R642l811j9816R565j2864l1808R651R913Q852J0843m151L4590j5789
23895b2498k421J1072p804J085L751o158N188K147M658j2441K7816n847j1725
23882a3177O704P668k0666m381J7828K5196n506m5386p275K3214J1552K004J7372
23869A5147J7107j164j644O164l283j3065O598Q350n544n845J6526j4546l3862
$$ y = [-3495, -12321, 1674, 29159, 30523, 42847, 57674, 42866, 13372, 14517, 29982, -2204, -7500, -1532, -5608, 9022, -6603, -21471, -26379, -35340, 179, 35141, 24187, -28465, -33812, -14564, 2247, 24999, 8462, 1301, 13326, 16592, 27341, 10727, 7790, 6242, 20686, 2878, -21147, -13043, -19100, -22166, -46454, -53946, -70287, -88259, -63286, -33148, -23173, -45295, -56889, -27315, -17673, -21484, -41300, -31735, -44599, -76407, -66756, -56843, -47991, -37148, -41299, -6709, -22498, -24919, -13847, -21651, -20566, -16815, -22973, -17785, -15638, -10980, -23421, 4395, -1452, -13177, -6473, 1195, -19471, -23852, -6024, 19172, 13666, -31720, -38995, -15781, -4229, -2225, 15147, 32254, 31090, 29446, 35610, 32327, 19262, 25860, 34210, 28666, 22821, 39347, 24801, -9061]
23856i061J286R784o753j020N589j4877j656K5578K238k6935M698J2733J3471
23843A5075j0072n194J1269r655J0827K7417j4894l1792j0556J3823J9514k4095
23831h333j3689K8732N899j0382L61J7932p992k3394j0764j3758L0464J0864p996
23818b056j6462J1480J1829n461N548J4957j6182R12Q526j2002l5814P861J5866
23805a0998M662k5886n453n689J9977K3919j068J0939j6262q362o521J157O243
23792a3342N980K2327P947j731j113J5996m794K619J0470r436k116j343k1770
23779I694j3415o013M306j1103J994M264J1N558k1397k0129L3093K7571k3971
23766i537j7888K669j0142O797J9827N863n195J2601J0417P065k3219k6145K3309
$$ y = [-9061, -7775, 2009, -4744, -5764, -175, -15052, -16708, 8870, 11108, -15827, -11129, 1604, 15075, 5003, -191, 11078, 1423, 12250, 39667, 24773, -7019, -17575, -3752, 15762, -8333, -22022, 6710, 12609, 2227, 2588, 20520, 12528, -10866, -21630, -35388, -4924, 5940, -2056, -18518, -7038, 4791, -670, 4878, 19835, 3653, 4565, 13091, 1089, -34725, -26864, -10998, -6336, -32222, -37675, -43364, -23387, 532, -536, 10403, -5859, -14221, -20742, -19585, -13342, -7362, 14965, 22912, 21181, 20068, 36064, 31270, 33889, 44359, 34923, 32807, 31464, 9694, -3721, -9734, -5428, -16531, -14537, -10273, -10262, -4704, -26101, -46230, -13137, 14434, -9537, -27425, -24756, -34898, -28101, -8274, -2411, -7606, 4995, 15412, 22477, -742, -26887, -3578]
23753c578J1698j2845l213J3018j959j510n736o69p868j175Q552J4739K0962o093
23739B4323j8744j7972J7550j0581Q579K7241P065j6432k5582K4432P486j9940
23727G425j2008m298p435K2518P202J9072l0949k2083l0814o160J2391J4973K9127
23714a039K4384p278n367n380o564N766j3138K4948J7076j2340k0449l111R269
23701F777r753j015p54n287Q487J7006J8642O980j5923j0767n356n929L082q168
23687a978m967j8703M091M281j165K4413J3305k3372j8415K6089Q950j6219l0477
23674c4167k7606J1123K6491M2149J3421o397j6433k1446j6216k361j0278j4762
23662e6482M2299K0168j3616j6449K1501N375j7172K0628M363j5433q022k372
$$ y = [-3578, 8120, -4725, -7938, 5080, 3121, 1611, -4125, -4794, -12662, -13837, -5285, 9454, 30416, 24323, 5579, -12393, 5157, -5424, 3155, 30396, 37461, 21029, -4553, 19879, 27365, 7425, -4583, -8881, -16316, 6202, 13404, 32476, 1527, -20556, -51370, -57530, -45139, -30166, -1039, 23345, 16067, 10700, 5320, -1244, 4522, -8616, 16332, 33408, 21068, 619, -2492, 6777, -2976, -3991, -4745, -10032, -1545, 15461, 34103, 41083, 25160, 14393, 9037, 3108, 6190, -1978, -6945, -25648, -21557, -17276, -18441, 5972, 19277, -4095, -22510, 3579, 12529, -3690, -34167, -61773, -50650, -24159, 17990, 31411, 25014, 8581, -12865, -29081, -31442, -41720, -56482, -14183, 5985, -7631, -24080, -2579, 2796, -14376, 6252, 10615, -4818, -12840, -15212]
23650a5212L2300j8615l692j3241K465N0734J6468m0443k6976j2847O825K4972
23638B738K4032l2383j8072q483J1954O385l76J9654J1303j0594m0499j7840p05
23625e2886O235J7234n06K3094L7334j9501k0085k3121K0570P929R392n683Q188
23612H194k5609o237k272O707P582L4484r024k0594j1917o360o872J0968J9717
23599a233P583r246k3691N792N691p758Q260L636P767J5962J8634N99l1842l4075
23585c3921l1385k0227J9027O146J1360Q613J6461J0093m465J3246m949K2306
23573A2305j2749l0168J946j2909r171L1999N435m0535J1528K881p152J335m181
23560d9436K9630L6367p15l0182P772p12K1185J5587p827l1368l3792J0211J8411
$$ y = [-15212, 17088, -1527, -5219, -18460, -15995, 34739, 51207, 10764, -16212, -29059, -22234, 2738, 26770, -5613, -23685, -32168, -20214, -13829, -14205, 5449, 16752, 6158, -34341, -52181, -52886, -46651, -29417, -29923, -6829, 30505, 11004, -9081, -32202, -11632, -3703, 5689, 6, 8194, -17415, -23652, -25924, -19217, -11635, 22849, 13825, -6769, -18686, -25046, -31918, -20950, -1233, 6350, -2896, -26587, -20795, -15104, -22862, -14602, -10966, -3199, 12763, 31397, 31996, 154, -33921, -65306, -85533, -66506, -60360, -49000, -40387, -23926, -13833, -18298, -5052, -10001, 12305, -444, -30612, -28666, -41575, -50746, -18747, -13312, -53847, -42319, -39438, -46590, -45255, -49436, -19806, 16561, 15846, -14336, -6564, -7276, 13909, 29496, 21669, -9699, -43491, -33280, -14869]
23547a4869K6664l378r221J4038k1134M919L259j6308k2655J6124Q324P00k45
23534a3782m584J0766k4026j1693K5943L3281K6283Q364k2703k3679k4227J0230
23522i827J7788O779J0520n837n695q406K3831J409j2788r700n075K7156L016
23509C3171j5626k3188k1997R309K2722j2213j0010m949j1337j7621o655m363
23497f2757n13M8053M4560J7798k6057k8510O622k065J5720J8317M834j9500j166
23484A5336K739j6648K0111m114m755J1862j0711m4761K001J7822J1306R876k6513
23471a6449k9667j2379j052J6605l457J8969R284R435J0548J6637j5762p428Q607
23458C891k2406j8398k5716o633J3892K4319L326K884R673r769P380m914j7266
$$ y = [-14869, 11795, 8417, -804, 13234, -7900, -2981, 278, -16030, -38685, -22561, -14237, -13537, -13782, -18366, -7600, -31626, -43319, -17376, 15905, 42188, 50552, 27849, 4170, -20057, -9827, 7961, 14740, 25260, 19423, 13728, 5322, 29153, 30562, 17774, 8074, 2999, 30155, 33171, 17545, -5643, -27640, -18331, 4391, -7822, -17832, -22781, -34118, -51739, -58394, -62757, -63270, -15217, 29343, 47141, 21084, -7426, -804, -2869, 12851, 31168, 36002, 16502, 15336, 18075, 1427, 21538, 17424, 12669, 24531, 13820, -30941, -28940, -11118, 188, 10064, -16449, -46116, -58495, -59547, -42942, -46399, -27430, -18146, -8711, 1837, 18474, 2712, -4716, 3891, -18515, -36913, -62629, -69262, -55370, -31051, -27725, -24841, -15168, -24937, -17557, -22471, -39737]
23445c9737k044K0578J3960K2450K400k1388K2557K1151k178j9266j0198j1514
23433c229k3980O752m704l465j7110j202L7375j460R22K1613Q305j6243l6108
23420c2534O143L0868p436K1593n78J1913o248l5914j4753K9492K5513p174m167
23407A6718l7813p811K0643L0999p875l8598K501M2315p439j2729j6500K1749
23395F160j0983l120L1521J440k067J156p189J2226j2355o279n440m815P413r937
23381b269K5321M456k9350j0472L6587J8313J5629r066k7121o031J6784p585k4648
23368E48j4801k0878L154K8460n797q024J1563q266n058R866L500K3040j2567
23355D740r420K372o534k8942J1175K0857J694K836l769j2158k3362J6938l793
$$ y = [-39737, -41781, -21203, -7243, 15207, 17607, -3781, 18776, 39927, 37749, 18483, 8285, -3229, -27209, -20457, -25161, -28626, -45736, -46938, -9563, -11023, -10101, 11512, 19817, 3574, -32534, -26391, 4477, -2959, 18634, 18056, 29969, 23721, -12193, -26946, 2546, 28059, 20885, 16718, -21095, -28906, -8263, 22736, 14861, -23737, -21236, 21079, 13640, 911, -15589, 6160, -4823, -7943, 23578, 25018, 22951, 24107, 16918, 29144, 16789, 10510, 5070, 255, 7668, -2269, 23052, 27508, -1842, -12314, 24273, 42586, 58215, 49149, 22028, 15997, 32781, 25196, 548, -14253, -35131, -31977, -3517, -9314, -17338, -5775, -14041, -19099, -9233, -5733, 17307, 4740, -4680, -2308, -8842, -37784, -26609, -5752, -4058, -1222, -4991, -17149, -40511, -23573, -27366]
23342b7366M846P949p48n7k5200P408K1432L710r293M260O760l410K466J1050
23328C807p338j60N399k6237j995K2015J3084K8908J0209k9641n682q602j4546
23315a0779o984L119J0056j0966m835J3113J0509L129j0543J104n475j6301K9937
23302E084K6410j7193k1397p311K869Q307r290j8163J0263N46O541qj1884J9510
23288e716m811K1071J55k9530o593K2883j1676q09L0036J256l82J6919k3900n402
23274C501q979Q062K511R416o567l7472M498J7114j5896j535k1438j571K4557
23261b3799k534j4914K1693J7085j6657R235m539k7168m945P983L673R551j2696
23248c8032N36m469R394M211r306J4541L2916J7760j3758J2883K3726j3125l7715
$$ y = [-27366, -22520, -14571, -15319, -15376, -40576, -33168, -11736, -8026, -17319, -13059, -6299, -9709, -7243, 3807, -3531, -3691, 1708, -24529, -26524, -4509, 8575, 37483, 47692, 18051, 12369, 3767, -10779, -17763, -14644, -4588, -15554, -20389, -7276, 3233, 6362, -4181, -3077, -8552, -24853, 5084, 31494, 14301, -7096, -14407, -11538, -3231, -12521, -30684, -20421, -19875, -13334, -13342, -25226, -5716, -10527, 10544, 10699, -18831, -25424, -2541, -14217, -15026, 15010, 16266, 15884, 32803, 8903, 3501, -5478, 2584, 5095, 14511, 7944, -29528, -25030, -7916, -23812, -25347, -46785, -48356, -23799, -26333, -41247, -19554, -2469, -19126, -9891, -14430, -41598, -46543, -38560, -34887, -25336, -38032, -37496, -41965, -32571, -28360, -37666, -23125, 9791, 27551, 13793, 26676, 50402, 37277, -438]
23235d38l6007M4383J2831l4127k6232K5297J8602J2047J8149q67j1798K1654
23223D3494M192j0905l7287k4847M940r754J4055P251Q486J4097K764L567j008
23210A9045K3525L1019j5299j7671l1145n81q404j4387N73K2847j1150j8866j1917
23197c2411J267J5037J9823K0174P853q028j6415j1o685J9029L329j7816k2K4480
23183B9604J7258k4258l1100k360J6679r050J8637J211l3049K1575P609j4985
23171b229m322j3191J3910j2896q707K9786r153k5634j2589K5132J4864J160Q483
23158D614k095k8761k6187p594L6091N092L250J048n600O795J3310J1888J144
23145A2995J7654j9937r807k7149n085P822p889J9502J8491j3359j6163r822k8054
$$ y = [-438, -36445, 7938, 20769, -13358, -39590, -14293, 4309, 16356, 34505, 33638, 21840, 43494, 47686, 36781, -506, -25353, -20413, -30167, -16112, -8861, -375, 13722, 16486, 20053, 19045, 42570, 73589, 58290, 40619, 9474, 8893, 489, -13898, -13325, 9522, -1628, -20494, -32411, -31144, -16107, 3716, 23890, 31743, 23715, 7300, 7289, 604, 19633, 22962, 5146, 5124, 29604, 46862, 22604, -8496, -10856, 5823, -3227, 15410, 16621, -16428, 5147, 12756, -2229, -6551, -19742, -5832, -18728, -27435, 2351, -6802, -32436, -45025, -19893, -5029, -3869, 4614, 2519, -26242, -52429, -60023, -23932, -18840, -15590, -14542, -20142, -13347, -37, 11851, 12995, 30649, 10712, 905, -26244, -31329, -23507, -31396, -11894, 6597, -6762, -22925, -32747, -60801]
23132f0801J6042K3997L3059Q47J8114q706j2200k0648n634m388O044j4396P234
23119b1436J0589o092J5077Q249k4711k0962j3281M8508K4695J0423K2099J4801
23107F7959k2821n0682k6218J5101L9687P586k3038l4488j6515M899O261L7265
23095D996n26k557l394J7609n499j3850q333K8043n863q667k5784p675J9670K235
23081i595k184p74J7634K6366R023j5729m7972o519J5421P634n584K5863O789
23068B0373l1517K617J3719r345r482J1345J0547J5946l4815k2130P244O396j0389
23055b9491L842j195l9987J793m925K4302K056N3466J6216k1191q873k8791j8843
23042e1621m16M146L2636K3225j0465k7077j3426J4147L588J715m083j0926l188
$$ y = [-60801, -44759, -20762, 12297, 13144, 31258, 22552, 10352, -10296, -15930, -20318, -14274, -28670, -21436, -10847, -16939, -1862, 6387, -18324, -39286, -52567, -4059, 20636, 31059, 53158, 67959, 45138, -5544, -31762, -16661, 23026, 30612, 7574, -26914, -43429, -38530, -32269, 4996, 4470, 1913, -1481, 16128, 10629, -3221, -11554, 16489, 10626, 1959, -23825, -31500, -11830, -9595, -11779, -12553, 5081, 31447, 40470, 24741, -23231, -29750, -14329, -6695, -12279, 13584, 20373, -11144, -8527, 5192, -4153, -13635, -2290, 8257, 24203, -10612, -32742, -25498, -19102, -29491, -25649, -26844, -66831, -65038, -69963, -45661, -43605, 9861, 26077, 4886, -3987, -32778, -51621, -52037, -47891, -15255, 7970, -2495, -29572, -42998, -28851, -25263, -23548, -27631, -38557, -41745]
23029d1745j7612j7066K4355L3464L6904K69K1170q112l5524J156m4J4362j2891
23016a314j2546j2402l409n769Q89k252J4271N291j0768l220J876K1810n019k458
23002a5020K8516j2296r112N734j1343j9471n627J8460N243J8736J5897p910M574
22989A6381l0326k0431j4878J8467J1823o07j1813o30O183J6018J0209J8939k698
22976A6637j8467L2932J7331j1917l331j7709j3545J0267Q036j9240j118j7675
22964a7799j1309m624j1122l293o573n922q953j3886J7550M8170R374J578k2787
22951b9596k716J9354M835l390k0531J6947K6929K3036K4191l6481l5082j1300
22939b3804L0299J1588n287j5012j9589J5743L76L8542O809k3155p408n873j2332
$$ y = [-41745, -59357, -76423, -52068, -18604, 18300, 18569, 39739, 31627, -3897, -2741, -2785, 11577, -1314, -13860, -26262, -29671, -35440, -34551, -36803, -22532, -17241, -28009, -31229, -29353, -7543, -12562, -15020, 13496, 1200, -7912, -2178, -13521, -32992, -38619, -20159, -14916, 3820, 19717, 11807, 16381, -13945, -34376, -49254, -30787, -18964, -19571, -31384, -32014, -25831, -9813, 396, 19335, 16637, -1830, 31102, 48433, 36516, 33185, 15476, 1931, 12198, 20234, 994, -124, -17799, -29108, -33732, -44854, -48147, -54720, -60642, -69595, -83481, -65931, -17761, -8387, -6809, -29596, -32312, -12958, -8123, -11513, -32044, -15097, 11832, 34868, 59059, 22578, -12504, -23804, 6495, 18083, 12796, -2216, -21805, -6062, -5686, 32856, 39665, 16510, 9102, 3229, -9103]
22926i103k289k8509k4086P868J2473J3585K9964K0959j5781j0995J8008o51j7799
22913f356L10m2969k2300M395L371K9858J7137J6073j360r225l428o046l25J3600
22899g265J6156l6498l584L1854J1374N70J830K5783j8434q719j0480J0828j2981
22886D34j0697J8328J4114j6275J2043J84m177J1084r107l3408j4667k782K5319
22873i607J1823J5482J8156k9341j7137K5354K1307q926M2P565j1555k5777J55
22860b459N402j462p900n380j9307J3137K3137K0344J5286j850l2946l1647j5131
22847d0776N383K9554Q083j5586J3866j1156K1221j5318J4586J0044o321k0708
22835g128J2543M0251J8142j4081L924R434J60k9495k2429K8394J9936j1833j0835
$$ y = [-9103, -11392, -39901, -63987, -56119, -43646, -30061, -97, 20862, 5081, -5914, 12094, 11443, -6356, -6046, -49015, -71315, -66920, -63549, -33691, -16554, -481, -1841, -11066, -14494, -20540, -20865, -7265, 8891, -27607, -31191, 663, 12037, 12607, 14437, 40220, 21786, 13067, 2587, 13415, 434, -10263, 8065, 22179, 5904, 17947, 18131, 13954, 25038, 15931, -17477, -32144, -34926, -9607, 2216, 17698, 35854, 6513, -10624, 14730, 36037, 27111, 27153, 34718, 23163, -2614, -2459, 2943, 1481, -6419, -11799, -31106, -17969, 5168, 25512, 40798, 38948, 6002, -25645, -40776, -35393, -5839, 2244, -13342, 524, -10632, 10589, -4729, 9857, 19901, 13580, -7128, 5415, 45666, 63808, 49727, 53651, 63085, 63245, 33750, 11321, 39715, 59651, 47818, 36983]
22822C6983r679j4142J0251L119j2250Q931k1968J3710Q4k51k975l791K1604L3822
22808F3448k6526l2450J6550l817Q077J7058k936K675J3938l4274l3251r349l5746
22795e6603K6294J8171M0378L0307k2214l0155k9721l107K799o099R704K5112
22783D866P683Q382N365J6991j4866j3489o952p124k6209l0885J9770J8592J4230
22770c646J4072j3198j3840m529J7448J9706j367k1595j8551J9563J8087p099
22758E051o431J1798L065k5289k9340k4202p804r72N745J1853L4810J2858N489
22745c369M099k404N002K85L953k9795O680Q472Q394K044m1546j8130J7681J8938
22731a9696K3701n398j2079r578j0613J6279J2573k8959K108J3334M1113q875
$$ y = [36983, 27304, 13162, 23413, 26532, 14282, 23213, 1245, 14955, 15039, 14788, 11813, 8022, 29626, 63448, 36922, 4472, 21022, 17205, 25282, 42340, 39404, 42079, 56017, 21743, -11508, -20857, -56603, -30309, -12138, 28240, 58547, 36333, 6178, -23543, -26650, -23851, -29950, -20246, 4866, 12549, 20931, 26296, 43287, 28421, 14932, 7980, 856, -25353, -56238, -36468, -17876, -3646, 10426, -2772, -16612, -21141, -3693, 16013, 14646, -6949, -25500, -5937, 12150, 5051, -1380, 10418, 13483, -11806, -41146, -65348, -73152, -74124, -68379, -56526, -21716, -8858, -3369, 730, -1674, 3328, 3613, 7566, -22229, -15549, -7077, 1317, 3361, -38185, -56315, -38634, -19696, 4005, -1393, -13472, -23050, -33663, -17384, -4811, -33770, -31662, -18328, 22785, 13910]
22719A3910k5623K4567j5062l7513m251R672J0845K761L1917J4950Q58K213K9599
22706E8843m692k6217m621J1031m930k8570j6804O903K6647O847j6972R247k8358
22693a1646l7394j9222N1607m84P372m956k16j7312J0248J4906O998R789N669
22680A5359k847j993j9295j3486o427L2320P164O089L69j511k3036j7113J2483
22667a1924l099n321L22O641j8448k2608K4118L2157j1601k1444j8695K3101J0229
22654a6572n403k505L0239N771J4039Q891k3246m40J2323J4339j6805k0600o972
22641f941K6875L4830j7017k8235p408l7335k7954J7772K5860K3107J7264K4203
22629D5021k3155l1190K4806P833p838j1359L4465Q333m809m040n145J4186m049
$$ y = [13910, -11713, 12854, -2208, -39721, -43972, -34300, -23455, -20694, 11223, 26173, 27031, 29244, 58843, 54151, 27934, 23313, 34344, 29414, 844, -15960, -9057, 17590, 24437, 7465, 16712, -11646, -49040, -68262, -16655, -17139, -9767, -14723, -14939, -32251, -22003, -7097, -99, 9690, 15359, 12512, 10519, -8776, -22262, -28689, 3631, 10795, 16884, 17253, 15742, -7294, -24407, -11924, -15023, -20344, -20022, -13381, -31829, -54437, -30319, 1838, -9763, -31207, -49902, -26801, -16572, -21975, -24480, 5759, 11530, 25569, 34460, 11214, 10774, 23097, 37436, 20631, 31, -6941, 19934, 54764, 37747, 9512, 2104, -35231, -63185, -45413, -19553, 3554, 20818, 45021, 21866, -9324, 15482, 23315, 15477, 4118, 38583, 46916, 42107, 38067, 32922, 47108, 43059]
22616D3059m9613k58N9372L2128k0083l6070p688k5271l7987J3084J4546k3910
22604c8691L0682Q976R930J3222k901k4598l7962P03J346j43J936K772K5496J5842
22590F610J2195j187k0995j0943K0902J1347k1626l8270K2847K4784n324l1485
22578c1145l1809J9591J3297k1057J8024R325n016Q595J6845J2158K5689K2885
22566E7382M020m5277m4368j5007K7740K0099l373J9124J5768n045k1659j9746
22554a0342m303p098R282K6606M00K883J3304P360k011K0221q430N534r362o659
22540C7385n340j3312J4249N824K3668l36j9208k190l2188j5621J4891k1002q865
22527b2045j1335j974N2170K1976n001N870o111j2545J194m330j5370K4433p156
$$ y = [43059, -6554, -6812, 52560, 84688, 64605, 28535, 20847, -4424, -42411, -29327, -14781, -38691, -8009, 967, 10897, 24119, 21218, -3380, -41342, -40639, -39293, -39436, -37500, -34728, -9232, 6610, 18805, 17618, -3377, -14320, 6582, 17929, -3697, -41967, -19120, 5664, 340, -31145, -62954, -43363, -30066, -51123, -33099, -23774, -28790, -20195, -3350, 8808, 34497, 57382, 61402, 16125, -28243, -43250, -15510, 4589, 1216, 20340, 36108, 31063, 9404, -10342, -14645, -21743, -12461, 14145, 14545, 17428, 30732, 38092, 36081, 56302, 47872, 53406, 44044, 37385, 32045, 18733, 32982, 38806, 62474, 62138, 42930, 40740, 8552, -7069, 7822, -13180, -22045, -33380, -35354, 16816, 38792, 33791, 39661, 33550, 21005, 22199, 17869, 2499, 26932, 19776]
22514A9776m673k1475k37J6010p474k1243m579J0413J8493j9324j6639J7376K5328
22501A1752k6219p794J1894m871j1979J3807L1857J6954p92l2046q767o973K895
22488a0282K7351j3142l8202j8677L755K8811Q179q868P716L3264q500k537L338
22475A2206q413M319J391k4953L3213Q623k2900m832j7511n143P862J2516K8233
22462B4611O379J316j3278J493K2351J3665j0537k4172k5410r399p869l853R708
22449a4995K4586K1170k526J452J9724l3262m7957O04L3727L5575l791j5142k097
22436A7068q837p837Q081J3452K107j2367q745n023Q796K2437j439j5889j4771
22423b967J1435j3495r406J8698j4274o585J7970K9173k8204n883J2875j1171
$$ y = [19776, 15103, -6372, -6609, 9401, 1927, -19316, -23895, -13482, 5011, -14313, -30952, -13576, 11752, -14467, -22261, -10367, -15238, -27217, -13410, 18447, 35401, 34609, 2563, -6204, -13177, -10282, 17069, 3927, -34275, -52952, -49197, -20386, -12207, -21075, -13359, 19905, 11405, 8868, 12206, 3793, 8112, 9503, -15450, 17763, 26386, 3486, -1346, -18857, -24000, -16138, -3622, 24611, 30990, 32306, 19028, 20521, 42872, 56537, 46000, 21828, -3582, -12981, -20850, -24703, -14995, 9591, 30761, 28235, 29687, 49411, 16149, -31808, -31204, 2523, 38098, 34307, 19165, 17068, 8231, 394, 8475, 21927, 24034, 11667, 2922, -2101, 6695, 29132, 27693, 11804, -2967, 8468, -5027, -14433, 4265, -10009, -16594, 1376, 30549, 2345, -3538, 9337, -1834]
22411a834J4627O50n369m2495n075J2485J6013J4127J0397j3755k4106l2385J7931
22398c8789L0021r911l752j6876l1796M83L2914M3552L1851j9078k3592j3784
22386a8757N859k442m473Q378J6783k323J5156K2100l1582j4606R754J4513K398
22373B0758j3178p437R160j0824O576K223k147M921n003j4200l469p049p377K7950
22359I04j3319k790l499P562o528R013R96J6586L0583l185m5911l1351J5400K8172
22345B633J9240j356N401k3217j9806J4304J749l7081J0974L0772r444j8168p104
22332c1103K368J9732N0974J9904j3085J0004k2649j7731l353m504J6914L8966
22320F6437k979j3644m4324k2127j9235j0094J4240K2140J1288j782L5627j3038
$$ y = [-1834, 12793, 13443, 8074, -34421, -39496, -27011, -10998, 3129, 13526, -229, -24335, -56720, -38789, -8768, -18679, -22431, -39307, -71103, -70620, -37706, 5846, 37697, 18619, -4973, -18757, -12898, -15340, -19813, -11435, 5348, 3025, 18181, 40281, 8699, -5907, 3847, 18360, 20758, 7580, 143, 9303, -1521, 5055, 7278, 5131, 10052, 5049, -9151, -12620, -19669, -27046, 904, -12415, -15205, -18704, -11142, -17670, -8657, -7661, 8925, 39508, 36323, -9588, -40939, -25539, 2633, 21873, 20517, 25918, 2701, -17105, -2801, -1052, -38133, -27159, 3613, -5831, -23999, -31103, -28735, -9003, 41971, 61875, 48790, 58794, 36145, 18414, 15061, 10557, 27471, 66437, 63458, 49814, 5490, -16637, -35872, -45966, -31726, -9586, 1702, -80, 35547, 22509]
22308B2509k5729k4814N695L0319l293j3662j4056J3510J6300P442q217j5893
22296i889j555J8278L1054M5189n147m0500p922K680M604j2253J5223j3862P07
22283B6607J3294k3443j5698k5020L729L4777m317K478L2514j9987k8653L792
22271G3J2070o44j762J1800k6724J5305j9988q507J2349k0060o820j4313J3665
22258c3556K1948L1122j1261k4757k117l1124N534K1736J8593K7416Q407K1756
22246E3697q596k6356j2439n231K921l591o175k348M175N435K7227L6253K695
22233F7667l2874j8628l6594q795N349O915J0171L362l4140O8N495K5140L4982
22220B8118q707q352J2360K5018J3476k1282k8286r219J1976K1686k59j5613j7015
$$ y = [22509, -3220, -28034, -22339, 7980, 4687, -8975, -23031, -9521, 6779, 14221, 6004, -9889, -11444, 6834, 37888, 83077, 77930, 37430, 29508, 32188, 36792, 24539, 39762, 25900, 26607, 39901, 16458, 760, -24260, -20531, 14246, 9929, 12407, 44921, 24934, -3719, 73, 12143, 11499, 9737, 21537, -5187, 10118, -9870, -18377, -6028, -26088, -32908, -47221, -33556, -11608, 19514, 8253, -16504, -18621, -49745, -44211, -22475, -3882, 23534, 31941, 53697, 45101, 18745, 6306, 1075, 3996, 405, -5770, -8118, -3943, 1492, 28719, 64972, 67667, 34793, 16165, -20429, -29224, -23875, -16960, -6789, -3427, -37567, -37499, -32004, -6864, 28118, 19411, 11059, 23419, 48437, 61913, 40631, 12345, 3126, 15102, 36788, 36529, 20916, 3901]
22207C901Q314r227k1525p190K7718L2541K301l662j5998L2217m168l2933j7593
22194e304m636k6454K0821Q375O580N207K6741r89j9793p575J9494j6304n174
22181I89j6719M119P961K6440k7525k0564n805J2097j9477k6552J8339J8957J8525
22168i215J1310j2450j3350q355J4638L675k0051J4423J2515r358k357J4810l172
22155f937R036N649P347K1212o877j9239l059n256j6400L6529J1969O107K2183
22142F2264O029J341k3740j5846j4902j4354Q697J3534K0719j5287P028Q186j9670
22129B3999r400L255Lj212K2188o225j8083M221P915j0789l537p559J2341K1151
22115C8268m161j8909k4817J0912J3235k2578J7998L904k8143j6384j889J5471
$$ y = [3901, 12215, 2988, -18537, -25727, 1991, 34532, 36833, 33171, 17173, 49390, 45222, 12289, -5304, -9940, -36394, -15573, -7198, -618, 4589, 31330, 30341, 10548, 2973, 22467, 6163, 989, -15730, -11611, -3650, 22790, -4735, -25299, -31104, -19007, -38484, -65036, -46697, -27740, -9215, 2095, -10355, -23705, -32060, -17422, -13747, -33798, -19375, -6860, -16218, -18575, -3765, -6937, 2099, 7748, 15095, 36307, 29430, 10191, 7132, 1876, -14524, 22005, 33974, 40081, 62264, 68293, 69634, 45894, 30048, 15146, 792, 9489, 23023, 43742, 28455, 35483, 43669, 23999, 14599, 17854, 17857, 16645, 38833, 32608, 14525, 18746, 26661, 15872, 12335, 4776, 17117, 38268, 34107, 15198, -9619, 1293, 14528, -8050, 9948, 13852, -14291, -30675, -32564, -17093]
22103a7093J6838K0296k026J3063J996j102k4501j8809j8472n337J1274N648n228
22090b3453J7246J528P029L356l703j5390q910J296j0262J841J7066J1904J497
22077A045L002o555J9066j0848j990K619L580R482O200q84K151j9300j3329N277
22063d84k9703r503K0142K5675J3098K0965J5341Q149m602k7428k7617p849j4796
22050a8612j1353M629P092J2258j803k1864K3013K6710K019j1977K8302j795j8491
22037A8128k1899J1940j3812j5690J2988n72K585k3705J6886K9712K69j0177K706
22024I359R250O398Q875r036j1882j3756j2979p855J1410k5522R66K7782O978
22011a2L616k8278P426K2116J8977o232j466n754J2146J8162L357N35k4367o518
$$ y = [-17093, -255, 20041, 18015, 31078, 33074, 31972, 7471, -11338, -29810, -35147, -23873, -18225, -23453, -6207, -4679, 2350, 5706, 2003, -13387, -22297, -21001, -31263, -29422, -12356, -452, 1045, 4047, -2508, 16558, 5710, 3720, 6339, 9919, 19401, 25601, 24717, 26868, 7568, -5761, -484, -30187, -39690, -19548, 6127, 19225, 40190, 55531, 63680, 59078, 31650, 4033, -3816, -18612, -29965, -25336, -18244, -5986, -7789, -29653, -6640, 20070, 22089, 10112, 38414, 36619, 18128, -3771, 8169, -5643, -21333, -8345, -8917, -6332, -30037, -13151, 16561, 16830, 6653, 9359, 18609, 25007, 33882, 24846, 12964, -792, -13771, -21626, -10216, -35738, -34772, -6990, -12, 3604, -24674, -17248, 4868, 23845, 17613, 16147, 10393, 22539, 40701, 44058, 44593, 20226, 13708]
21997A3708m340Q402J8222J9137k1051k4773R07P779O638l9819l6814N155N001
21984d1848K6782J2922j6113NQ958j6235k4460N871K2928J3977J372j974q270
21971a6085R555Q361J7339k2676k6883o424K2953L0508O629j6639k1024l2141
21959d6527O122K0717L933j4579J53k647J8096r12m39O939K1439r192K0668O873
21945C0644l826j7942o518J0761J8245J6929j7190r778o478p759J0238j4689j4537
21932a1900n186K8710J430j8107J1748J8083k5119j9559J3360J5923J7784P543
21920C4710k6453j636J0061N937n214k076J3623Q434l1949l1560K4127m078m242
21907a0316J5034K9051p185k2233P093o003L459J5075K685j1740R186j4680K585
$$ y = [13708, 9368, 17770, 35992, 55129, 34078, 9305, 10212, 17991, 24629, -15190, -52004, -46849, -41848, -15066, -2144, -18257, -18252, -9294, -25529, -49989, -44118, -21190, -7213, -5841, -7815, -16085, -6530, 1831, 19170, -3506, -30389, -36813, -13860, 16648, 23277, 6638, -14386, -46527, -40405, -19688, -15755, -30334, -30181, -32828, -14732, -15644, -16083, -9144, 12295, 3103, 23771, 30644, 26818, 8876, 2358, 13119, 31364, 48293, 31103, 21325, 14847, 7088, 17326, 2637, -11900, -17086, 11624, 13054, -5053, 6695, 24778, -341, -19900, -6540, 9383, 27167, 34710, 8257, 6621, 16682, 22619, 17405, 15329, 28952, 37386, 5437, -26123, -1996, -6074, -10316, 4718, 33769, 26584, 4351, 11444, 5441, 8900, 23975, 26660, 14920, 24106, 9426, 12011]
21894A2011Q413N334j4650k3282J8576j189j7066J0906l875Q426L519j3738l4286
21881d0901P494L2405K2175O341p235Q63R864j7782j4926j8868N935J8417K8889
21868C2671Q225n947n030j4085j1178k98N163M722J1508J4538j8844l7610m733
21855b0898K1888L5664k2136m3317M983J3963K0857Q74m415j7381p250K4116K4006
21842C0954j597k2392o12m758J1631L835q06R599n27J6995K57l0626l2430m780
21828b5257j960K3341J3536O717J2810m382k0245P54K3642Q306j5900l7239k9748
21815d5625L760L493J1212J1330q234k2094P618J0502Q483P136k2682p393L1276
21802a1218o958J2551J52n418L061j3114J074j7433k0110J6947L9149J5256J5276
$$ y = [12011, 20424, 25758, 11108, -12174, 6402, 5213, -11853, -947, -4822, 3604, 7123, -6615, -40901, -33407, -1002, 21173, 27514, 20279, 21142, 31006, 13224, -1702, -20570, -14635, 3782, 32671, 40896, 34949, 29919, 15834, 4656, 4358, 9521, 14243, 25751, 40289, 21445, -16165, -20898, 990, 36654, 14518, -28799, -23816, -9853, 11004, 11878, 7463, -9918, -17168, 6948, 30954, 29357, 6965, 6353, 1595, 13226, 17061, 16255, 25854, 25327, 42322, 42579, 11953, -20477, -25257, -27217, -3876, 9660, 16377, 29187, 24805, 4560, 5314, 28956, 37262, 21362, -15877, -45625, -41865, -38372, -27160, -15830, -24064, -46158, -38540, -28038, -19555, -12419, -35101, -42494, -11218, -18176, -5625, -5473, -10891, -7830, -20944, -19870, -37303, -57413, -40466, -1317, 13939, 29215]
21789B9215k2889j6879k542r66K494J13r053J20l374R327n331K3095j7156l125
21775a6951J2298l389M388L606J4644j5849m837j3305k6401R816K3257R222k2691
21762b6192l2392M805J8400J9766j179K589M811K5615P362j7063j6964l1602r157
21749e1201P97J6257J7605P040L6469L7065k3946j4591J3238o953j1406j1500
21737H874K0498L0661n556l6914j5753K1483k522K0928Q412l3652J3278P938m971
21724C2704J373J5839j6529j9195j840K1905l2277m5374M752L4833K7932K2282
21712D6405J5531l6625j1316N472j836R550K07Q739J1138j8993L0872j5358J0136
21699E3922Q678l7793k5609Q259J782M1456K6849j1329l549N750j2618j9796J1110
$$ y = [29215, 6326, -10553, -13095, -14061, -11567, -11454, -20507, -20387, -23761, -14434, -19765, 3330, -13826, -16951, -4653, -8042, -3654, -48, 14596, -1253, -6090, -19395, -45796, -35980, -12723, -3501, -26192, -58584, -53779, -35379, -15613, -16792, -14203, -9392, 16223, 23585, 6522, -10442, -42044, -51201, -50404, -34147, -16542, -9502, 26967, 64032, 40086, 25495, 38733, 31780, 20374, 8874, 29372, 60033, 54477, 17563, 1810, 23293, 20771, 41699, 50111, 16459, 29737, 37675, 32704, 34077, 49916, 33387, 14192, 12352, 34257, 1980, -43394, -38642, -3809, 24123, 46405, 61936, 25311, 13995, 19467, 17631, 27181, 27388, 36127, 47265, 28272, 59144, 43786, 53922, 62600, 24807, -802, 7457, 9239, 50695, 77544, 66215, 62666, 68416, 55798, 36002, 47112]
21686D7112P21J584N84l881K688J364m943j9525J7961Q341O189k596j5547l088
21672C6964j23p445l4229k318J0817J9570K2986m401p960r998j1243J654J5732
21659C0006n234n405k3098J7005q7j8929P497O809L323n71m766l5361k1519K1755
21645b8575k4925j0058K1013L4668J6657J4648k9710J512j932N30j626K9416K7414
21632D9032L403k326j0158n607j7205p701k0581K1434K795k9096k2994p231K9420
21619a6815p619K0731o621J9025K1608K1221J1104L292K835K754l3719k3693n875
21606H228m116p941j2821L3309K0310j2715j923P752j1706k6796k5073J36J09
21593c3247L0868K8998J7569k3520k500J3846k4691L876J1868p018r868j7720
$$ y = [47112, 47833, 49417, 50001, 46120, 48808, 50172, 45229, 25704, 43665, 52006, 58195, 55599, 40052, 36964, 36841, 29396, -4833, -7151, 3666, 23236, 46222, 41821, 33861, 23863, 12620, 14274, 30006, 24772, 19367, -3731, 13274, 13187, -5742, 1755, 8564, 11887, 11316, 6550, -28811, -50330, -28575, -53500, -63558, -42545, -7877, 8780, 23428, -6282, -4770, -6702, -6172, -7798, 21618, 49032, 52435, 50109, 39951, 34344, 17139, 9438, -11143, 10291, 13086, -16010, -39004, -46235, -16815, -24434, -3703, -10324, 8701, 30309, 51530, 62634, 65926, 68761, 71515, 37796, 14103, 8228, 4112, -3829, -16650, 16659, 36969, 24254, 22331, 30083, 18377, -8419, -33492, -33356, -33247, -2379, 26619, 44188, 20668, 18168, 32014, 7323, 11199, 23067, 16049, 6181, -11539]
21581a1539N154L8330j4901l1159l386J1653p724k51J6292q79p484J0266K9750
21568C4122L6428J1858j1664j6739n805o120L23j1970j0893K2120j944k6485l0168
21555a6937j6348j2008J9784J8626K0372K920j7145N290k4252j6546m46K9705
21543f985M4855m178k1064m278K1339O394n09j4834J1273m302j6547J7115L6084
21530F4363j3798r030K0012m505K1569K539m9390j0666J4798Q226q967J1478l0246
21517A6383l3869K1464K7037L839j0018J2116K3964r530j6329j6713P259J0645
21505C6248k3470j6528p510K852M845j7193K8958J1959m45P262Q85j9752J1847
21492A9958j305K2531j4595o312j6426j4438K799N956J2057j231j1135j1608l035
$$ y = [-11539, -6385, 31945, 17044, -14115, -17501, -5848, -13572, -13823, 2469, 1590, -5894, 4372, 34122, 70550, 82408, 70744, 54005, 48200, 42080, 42403, 30433, 19540, 41660, 39716, 13231, -16937, -33285, -45293, -25509, -6883, 13489, 16409, -736, 4554, -19698, -36244, -36690, -6985, 37870, 33692, 12628, 8350, 29689, 36083, 35574, 20740, 32013, 27711, 11164, 28279, 64363, 50565, 41535, 61547, 57042, 78611, 81150, 31760, 21094, 35892, 44118, 35151, 46629, 16383, -17486, 3978, 31015, 34854, 24836, 36952, 60916, 51386, 35057, 18344, 25603, 36248, 12778, -3750, -11260, -8408, -3563, -20756, 8202, 20161, 19716, 26978, 27863, 8111, 19958, 18653, 41184, 26589, 20277, 3851, -10587, -7788, -1832, 10225, 8994, -2141, -13749, -16784]
21479a6784k7195k3944K5794R814r604l273R325M845J5666L718K9526J3211P181
21466C8280j4650O562R626k0966k8193Q729O897l124J1143o965J5976j0635o969
21453E711P979L797j6610m0965N278J5741K7477J125j8347m119R813m592j4140
21440b1852O838P390j5920P460L301L1420o26R0J7865p860k6031K607J8876N854
21426B9412P8r636j4020K0261M1200L820k960k8974j6597j8274o828L848m727
21413c397R812R011J9513J0052k3965j9003j8007K0552L2615J4316j7915j3439
21401B0145n533k2124K6020J5432J3418k2746q329j2134K9740K2140P22P228K3191
21388H7170j0018m4992q349J1805k3075N04R0K277M748J0523K5732j0489n0217
$$ y = [-16784, -43979, -67923, -42129, -32315, -41919, -45192, -35867, -31022, -15356, -11638, 17888, 31099, 38280, 23630, 30192, 39818, 18852, -9341, -612, 6285, 3161, 14304, 7339, 23315, 12680, 5711, 13690, 17487, 877, -40088, -34810, -19069, 8408, 9533, -8814, -12933, -3120, -7712, -21852, -15014, -7624, -23544, -16084, -12783, 18637, 18011, 18101, 35966, 28106, 2075, 4682, 23558, 29412, 29490, 19854, 5834, 26095, 67295, 71115, 68155, 39181, 22584, 4310, -2518, 1330, -3397, 6415, 15426, 34939, 44991, 21026, 2023, -15984, 4568, 37183, 51499, 33584, 20145, 14612, -7512, 18508, 33940, 47358, 24612, 16283, 4149, 33889, 56029, 56751, 63979, 87170, 77152, 32160, 23811, 35616, 12541, 13045, 13135, 15412, 20160, 30683, 56415, 45926, -4291]
21375d291k3842R69L4748J1666k0014R457J6920k3003o265K6366l683k901k487
21362A3640p404m714K5072J3047l925K060K9460l5900k2526L913J3256j0048p759
21349H172j4495j610j3544J9164j1948m465j4274K3773M1744J8845o093l922r057
21336C2290j0791m259j0549j9166j5711n254j009J1485J2547J0775J6149J8267
21324C4774m288j0983K118l4791k511K8649J6090n47p25O40N705Q272K3332j7735
21310D8000l7022k2750k65J5730k282J0202K4088R670R73K0335l983j9678k3208
21297A9810J6922K2646j0297j3162q052k243k0050j350r06r555R477K356K3822
21284B9418N936j591K0595k3517Q302M955Q885k079m7120k286L4905M493q508
$$ y = [-4291, -28133, -27164, 7584, 19250, -764, 8693, 25613, 2610, -3655, 22711, 19028, 16127, 13640, 6236, 1522, 26594, 39641, 35716, 37776, 67236, 31336, 8810, 12723, 25979, 15931, 8172, -6323, -7933, -21477, -2313, -14261, -18726, -33000, -9227, 32517, 51362, 45269, 41347, 32290, 21499, 17240, 6691, -12475, -28186, -33440, -34449, -22964, -10417, 358, 16507, 34774, 30486, 19503, 21621, -13170, -15681, 12968, 29058, 28511, 27786, 28426, 34131, 42403, 65735, 48000, 10978, -11772, -12037, 3693, 1411, 11613, 35701, 45371, 46344, 66679, 62696, 43018, 19810, 36732, 59378, 49081, 35919, 27867, 25624, 5574, 4224, 3318, -6237, 3240, 5596, 29418, 35354, 33763, 54358, 30841, 39143, 44098, 52983, 50904, 3784, 1498, 36403, 40896, 32388]
21271C2388M405K3874J657P818n385k999j1483o682M069N138P047k1646P562N414
21257E1177o20j1797k0982L070J1019n865K775N144K3865j2370K469J1649K9299
21244H8833K1159n369n769j0202m59m7474o60J4714J7957l0005m540J1003J1280
21231F0468L196l2440k5486J9056R796p632K699J3213n042n578l454L6717J2158
21218G7671m410M09l4824l5581P274J8350q088L303P242J2463J6466n426J3243
21205F8092O846j9810m0871J56r400J0773K1396L480j1280n239J0541J9734J5859
21192G0277q892k4244J7951K5147L733j1866j7315k1913k4404l744M7948q740
21180D3938K396Q392j3951N273L844M985k6913J3203J8258K2295P233o121J2217
$$ y = [32388, 36793, 60667, 62324, 70142, 64757, 61758, 50275, 43593, 47662, 52800, 59847, 38201, 45763, 51177, 50557, 38760, 17778, 20848, 31867, 26002, 28777, 33921, 57786, 45416, 47885, 59534, 88833, 109992, 104623, 98854, 88652, 88193, 40719, 40059, 54773, 72730, 42725, 38185, 49188, 60468, 63664, 31224, 5738, 24794, 34590, 26958, 29657, 42870, 37828, 32250, 28796, 65513, 77671, 73261, 73670, 38846, 3265, 10539, 28889, 20801, 24104, 31346, 43809, 60275, 54849, 68092, 74938, 55128, 14257, 14413, 5013, 15786, 37182, 40662, 29382, 24143, 34684, 54418, 70277, 61385, 37141, 55092, 80239, 83972, 72106, 54791, 32878, 8474, 4730, 52678, 43938, 46334, 54726, 40775, 46048, 49892, 54877, 27964, 41167, 59425, 81720, 88953, 82832, 95049]
21167I5049l35j7125K2497O9525J6788J0334K8700P2545J30380J87646K39473
21156H55477J19004j21889j86076k00085j36958j11070j2619K4551m708j7891
21146B07736N628N0884N8714Q5883J76724K27800K03703l7340k14625k15259j37084
21135D12764p3481m1722k6729o089k543K8448Q1354J26207K16660K32885M7649
21124I95403j61290k35055j62883j30627o6038j1285o696p783K0227K2105M9733
21113C05811N0828J15644J72667K44183J51010r7548k35802j85477j43023r6332
21103B81961p5507k8789k8790r919k8857n391Q709k5364l0814k7145J0354L4921
21091G5369p010j3404j3138j384L469q952j8501k177L3506K5567N624j9208j4433
$$ y = [95049, 94714, 77589, 100086, 169611, 186399, 196733, 225433, 297978, 428358, 616004, 855477, 974481, 852592, 666516, 466431, 329473, 218403, 205784, 230335, 225627, 207736, 213364, 264248, 322962, 408845, 585569, 813369, 1017072, 979732, 765107, 549848, 412764, 339283, 297561, 270832, 264743, 262200, 290648, 372002, 498209, 714869, 947754, 995403, 834113, 599058, 436175, 305548, 239510, 228225, 221529, 213746, 233973, 256078, 305811, 356639, 472283, 644950, 889133, 1040143, 942595, 706793, 521316, 378293, 281961, 206454, 177665, 148875, 138956, 110099, 104708, 113417, 88053, 57239, 30094, 40448, 75369, 68359, 54955, 41817, 40433, 43902, 34950, 16449, 14272, 47778, 73345, 78969, 59761, 45328]
21078D5328L985J6452j4677r575n191J2206Q433J6306l026q034j7021L947p946
21065D1187J6568J4248L177J0079J9853j1113K80O458r753m3897j2388L9485j0598
21052F3586k5417O480P641m318j7856J0571k0993j5930L7808p77j1150j7325P863
21039B0183N831J1301j0937k2890j5823J4914L0382O770J6269M995Q59j7449J0968
21026E5373Q118k3016j0334K1791K0701J124K68m071L282j7873j1309J8699j3952
21013D8801O399R057Q086j0746k6308r571M354J648J6438J604M3179k6762j1902
21000E4277J6996o84O842q396j2210j6555m523q028J6039K2860K9699N676k2189
20987G9804k1903N412o057m864j5685K029j3797J8464L102L30P65K2256n319J7390
$$ y = [45328, 49313, 65765, 51088, 41513, 36322, 48528, 56961, 73267, 70241, 62207, 45186, 49133, 41187, 57755, 72003, 75180, 85259, 105112, 93999, 94279, 100737, 90984, 47087, 34699, 74184, 63586, 38169, 44649, 52290, 47972, 30116, 40687, 19694, 3764, 41572, 40795, 29645, 12320, 20183, 26014, 37315, 26378, 3488, -12335, 2579, 32961, 39731, 56000, 60995, 61854, 44405, 55373, 63491, 40475, 30141, 51932, 72633, 73757, 74025, 69954, 73236, 55363, 44054, 62753, 48801, 55200, 64257, 72343, 61597, 35289, 25718, 30072, 31720, 48158, 49762, 92941, 66179, 54277, 71273, 70589, 77431, 69035, 56825, 40270, 35747, 27719, 43758, 66618, 96317, 101993, 79804, 57901, 63313, 57256, 52392, 36707, 38736, 24939, 43403, 46505, 46835, 47600, 69856, 64537, 81927]
20973H1927l6740j6480K44N984J3108K8776j1705J0555P758j0644r940j442K2979
20960H4380L1700p694k7619j5297J062J1836j3753J3909K3242J5875l9367j2641
20948F5633j0260j6281N703L5670R279j0409k1991O971J4862K1320N983p963j0984
20935H7533j5410P360j8287p027L8559n812q499M092p544m1109M790J0570K2892
20922G2108M524j0845L660k809N179k6074j0080M1692J7691M406o225j2567k4051
20909E6609k1393J1583j6709j2034K9990N7471P698k4185R343L271k9770l00K4082
20896I5656O408j827k0157R829p684N557J4153J3251R18l6061k0126m790j6944
20883C8183p73L0122j7537k0715K0838L6073k548M072j783M937J185J245R082
$$ y = [81927, 45187, 28707, 28951, 34935, 48043, 76819, 65114, 75669, 83427, 72783, 62843, 61401, 84380, 116080, 108386, 80767, 65470, 66532, 78368, 64615, 78524, 101766, 117641, 78274, 65633, 55373, 39092, 44795, 80465, 89744, 79335, 57344, 64315, 79177, 100497, 106480, 98517, 87533, 72123, 79483, 61196, 54169, 92728, 86916, 78417, 82509, 74965, 33856, 38646, 49216, 72108, 76632, 65787, 69447, 66638, 71817, 45743, 35663, 77355, 95046, 99452, 93227, 80660, 56609, 35216, 46799, 30090, 18056, 48046, 105517, 113215, 89030, 98373, 101644, 71874, 71574, 95656, 102064, 100237, 80080, 89909, 82225, 87782, 101935, 115186, 116104, 80043, 59917, 55127, 38183, 37410, 67532, 49995, 29280, 50118, 86191, 83643, 87715, 85932, 90869, 92054, 93299, 102381]
20870A02381J8679j9378j6704j4722J8566J5183n435m030O766k010R731K3248
20858A32275P198m834J339Q561j2248j2114m805k5152j1753K1950J6853J8579
20846A35849J5911k738j4021l4k344l204J9484j5896O097K3591k5537J1885P9818
20833B28861O6171M2397K3577j5390k1725k3502m2727k9486l5063k4434k8198
20822A40481j2629l4141K765M384k8181O258L1189L4926j1904j0277J5555K0386
20810A58812j852j046K334J0459J3008J7777L9365K8827J8386P7599L1145j9425
20798C75389m4127m5598o9740p0182j5256J274m1786n487j2754L203J3101J1552
20786I9589O04J3982K7765K2275m429j2544J2052k0582l6077k2150Q987K0430
$$ y = [102381, 121060, 101682, 84978, 70256, 88822, 104005, 98570, 94540, 101306, 99296, 109027, 132275, 139473, 134639, 135978, 144539, 132291, 120177, 115372, 90220, 78467, 100417, 117270, 135849, 151760, 149022, 135001, 134967, 132623, 129419, 148903, 133007, 139104, 162695, 137158, 149043, 228861, 295032, 337429, 361006, 345616, 323891, 300389, 257662, 228176, 193113, 168679, 140481, 127852, 93711, 96476, 100860, 72679, 78937, 110126, 145052, 133148, 122871, 138426, 158812, 156960, 155914, 158248, 168707, 181715, 199492, 238857, 267684, 286070, 363669, 394814, 375389, 331262, 285664, 215924, 145742, 130486, 131760, 89974, 84487, 71733, 74936, 88037, 99589, 100193, 114175, 141940, 164215, 159786, 147242, 159294, 138712, 102635, 80485, 89472, 109902]
20774A09902M6187L7913J1302j8549k8047k4654j3023M24K4639k103j0390Q688
20762A42289j3553O102J7563k6655j3788J7512M4478r244l832K5957J2368j9618
20750A79579q903N622k4078J1907K1315Q376J6541K9439J0160K0707L9133j6133
20738B93665k3961k1290m103k8189m4770k2181M611L6077J081k142L898j1914
20726A80782j0432P445k8032m2859n634L4131K9703J2436K1258p055J9088P979
20714B18810k3710l457Q933J9648L6527L2889K7487M6697M3807Q8k5539j5818
20702C66362k0463J1530k0931l2968k635k8254l3468J1719N382K2905J2367k9023
20690B62523J8484J4153J1464j0473k0925m91j1396j2520j1820L6754K2458K9693
$$ y = [109902, 156089, 194002, 205304, 186755, 158708, 134054, 121031, 121455, 146094, 143991, 133601, 142289, 128736, 134838, 152401, 125746, 111958, 129470, 173948, 164704, 160872, 186829, 199197, 179579, 170676, 176298, 152220, 164127, 185442, 193818, 210359, 239798, 249958, 270665, 309798, 293665, 269704, 248414, 244311, 216122, 171352, 149171, 153782, 189859, 190940, 188798, 192696, 180782, 170350, 177795, 149763, 106904, 101270, 135401, 165104, 177540, 198798, 191743, 210831, 218810, 195100, 191643, 200576, 220224, 256751, 289640, 317127, 363824, 407631, 407719, 382180, 366362, 345899, 357429, 336498, 303530, 300895, 272641, 239173, 250892, 256274, 279179, 291546, 262523, 281007, 295160, 306624, 296151, 275226, 274735, 263339, 250819, 238999, 275753, 298211, 327904]
20678C27904K8929Q9403N1304k3189m9644J9172N6191n248k3747j3869l148l6504
20666D17554k0189k59j7065K4825K7722L4439J7305R098K865j3407O050J6992
20654E05930j7239K2319L3509J3319J0500K3930K4166J4184K4097Q206P032O310
20642F76263K7979J7995p209J0859K3404L6963L7212K5991K6530K1691M890j8805
20630H83763L2592M9647M5285M0580M7041P433O6155J22354J45646N1468j2702
20619A479262K700P0502R8600J20593J50581K46150L48407N16736O58103K80010
20609C971644j86724k05387J0406K77887M44018M17636L87074L20726K69126N2187
20599E758593j41115j88518j4428J93201L68950N65910P96816J079179J291296
$$ y = [327904, 356833, 446236, 497540, 474351, 424707, 443879, 500070, 494822, 471075, 457206, 454058, 417554, 397365, 397106, 380041, 404866, 432588, 467027, 484332, 493430, 496295, 482888, 488938, 505930, 488691, 511010, 544519, 557838, 568338, 592268, 616434, 630618, 654715, 662921, 669953, 676263, 704242, 722237, 715028, 725887, 749291, 786254, 823466, 849457, 875987, 897678, 902568, 883763, 916355, 966002, 1011287, 1051867, 1098908, 1106341, 1172496, 1294850, 1440496, 1491964, 1479262, 1481962, 1552464, 1651064, 1771657, 1922238, 2168388, 2516795, 3033531, 3691634, 3971644, 3784920, 3579533, 3589939, 3867826, 4311844, 4729480, 5116554, 5437280, 5706406, 5758593, 5617478, 5428960, 5414532, 5607733, 5976683, 6542593, 7339409, 8418588, 9709884]
20590I709884J409353J673824K188449K921033L780137N367083Q321542J3149421
20582D8520726K1457569L6681279O2384691R5512693R0128364r798141q7065063
20575B57822118q9232053n8460707l3361830j9431598j1972611p960764o015662
20568C1386893m905027l855367k870259k031649j335089p33723k26029J93954
20560A5623704N21945R00471J333398K060701L072028M367927O485312R813663
20552D4179149J4776065K4022542M1993316P1805555J03867805P2992075l8928292
20545C34708215r6536609q5269252n3118532l0597074j8185813j1491197p819204
20538C1690534n768728m491027l540246k818034k233691j677840j218573j050132
$$ y = [9709884, 11119237, 12793061, 14981510, 17902543, 21682680, 27049763, 35371305, 48520726, 69978295, 106659574, 169044265, 264556958, 354685322, 344887181, 257822118, 168590065, 110129358, 76767528, 57335930, 45363319, 37402555, 31386893, 26481866, 22626499, 19756240, 17724591, 16389502, 15655779, 15429750, 15623704, 16145649, 17046120, 18379518, 20440219, 23512247, 27880174, 34365486, 44179149, 58955214, 82977756, 124971072, 196776627, 300644432, 373636507, 334708215, 238171606, 152902354, 99783822, 69186748, 51000935, 39509738, 31690534, 25921806, 21430779, 17890533, 15072499, 12838808, 11160968, 9942395, 8892263]
20530H892263r66842q23345o30845m85822l26739n1359J89522L36330J68798l67059
20520E934902p24118n35717j30767k8681n3877P0377j00825n46424p34150o29605
20510B521115m12823k41426j71770j05503p6315q1515j13748q4371j1791o137
20500A215716p9396j08679j01159l9429m7861l1285k6085l5475n2011m7340p0694
20489E76302m3606L188q606k4320m0502j6149K941L0l463p471n8407j5098K729
20476C67568k6281p87K7390j0537k2630j1218o801n232l8949l4273k0862J1039
20464B28427N0129j23l0816P246J1451q020j3470p961J0198M6921N5412K4839
20452C74233N4009M0286j7132p6836q1611n2026p231L49K0709P258k4280j7965
$$ y = [8892263, 7925421, 7102076, 6471231, 5985409, 5658670, 5607311, 5796833, 6133163, 6301961, 5934902, 5210784, 4675067, 4544300, 4515619, 4461742, 4532119, 4431294, 3884870, 3150720, 2521115, 2108292, 1866866, 1695096, 1589593, 1513278, 1431763, 1318015, 1233644, 1221853, 1215716, 1136320, 1027641, 926482, 887053, 839192, 807907, 781822, 746347, 694336, 646996, 576302, 532696, 535884, 527278, 502958, 462456, 446307, 449248, 449278, 445815, 438344, 379937, 364839, 367568, 341287, 340500, 367890, 357353, 334723, 323505, 316704, 311472, 272523, 238250, 217388, 228427, 278556, 278433, 247617, 254863, 266314, 258294, 244824, 236863, 247061, 293982, 349394, 374233, 428242, 468528, 451396, 374560, 292949, 240923, 233692, 234041, 254750, 262008, 237728, 219763]
20440B19763K6991j1937l622j4108j1089j7862j606j026Q695k848r621l782P89
20427A78737o318k1328L2812M6940M8518L0547O4333J1317k9229n5925p3147l9057
20415A88200j4826O08j1558m307Q491J7378k7305j4580o310O791j2851K669j4130
20402A18270P356K0430p680q131L1136J8545n830j8000j97k2820r619m33p125
20389A15902m0985k1150j6551j8542j8384j8670j8238q971N1365M7186K6086K2332
20377A01380k232l1951j6198q092r632k9146PJ8713L6980K7871J1847j7997j6949
20364F4601L093J5488j15k135J030J2592j2560j4310M326k9079l8484k2577p795
20351b5925J8402n950L8009N8955M256n297m755k231k8890m3911j5888p003K0145
$$ y = [219763, 246754, 234817, 231195, 217087, 205998, 188136, 186530, 185504, 194199, 191351, 181730, 177948, 178737, 172419, 151091, 183903, 230843, 279361, 309908, 374241, 385558, 356329, 300404, 227257, 188200, 173374, 173982, 162424, 158117, 166608, 183986, 156681, 142101, 135791, 142582, 129731, 132400, 118270, 125626, 146056, 138376, 130245, 161381, 179926, 174096, 156096, 155899, 133079, 123460, 123027, 115902, 74917, 53767, 37216, 18674, 290, -18380, -36618, -45589, 5776, 52962, 79048, 101380, 99148, 67197, 50999, 42907, 33275, 4129, 4136, 22849, 59829, 87700, 99547, 81550, 64601, 67694, 83182, 83067, 80932, 81962, 94554, 81994, 67684, 72010, 42931, 4447, -18130, -25925, -7523, -13473, 24536, 83491, 87747, 82450, 77695, 75464, 46574, 2663, -13225, -20228, -83]
20338h3o874l11M1936K1508K718L443j153j3577o793j3196k934O581K127J6762
20324E0154J5705k6563j4423p831l5195Q423R64J2089L140k3559J4755R197J0990
20311A7846J6330q191p890j3723q313o52L8104L2359J1221K7624l9119p2132j2561
20298a9097l791K4929R843j9787O704J8017J3653n593k0156L331J8414j7664j0575
20285a772J0467K4011j7023l2316p376M2643L1846K3922J6244P541K4854M0237
20273A63278R5259M5704k1376p8970k7030L678L6554N0869M6390J079L2406R475
20261C57316l3462m9634m6584k6077M8817K2221K0442q771n3321p9493j5515l6939
20249I9000j9344k0055l5464M7231K404k9379k4059r575J0792r006J3261k603
$$ y = [-83, -6957, -7268, 34668, 56176, 58894, 62337, 61184, 47607, 40814, 27618, 24684, 31265, 33392, 50154, 65859, 39296, 24873, 17042, -18153, -9730, -8766, 3323, 6463, -17096, -2341, 6856, 17846, 34176, 25985, 18095, 4372, -3941, -4593, 33511, 65870, 77091, 104715, 65596, -6536, -19097, -22888, 2041, 11884, -7903, -1199, 16818, 30471, 24878, 4722, 8053, 26467, 8803, -1772, 8695, 32706, 15683, -16633, -24009, 18634, 50480, 74402, 90646, 98187, 123041, 163278, 258537, 304241, 282865, 203895, 176865, 180543, 217097, 267966, 314356, 315435, 347841, 357316, 323854, 274220, 227636, 201559, 250376, 272597, 293039, 284268, 230947, 151454, 135939, 99000, 79656, 59601, 24137, 71368, 73772, 44393, 20334, 10759, 21551, 12545, 25806, 23203]
20237B3203J4228l0810j5752K8292J6214r645J302l309Q08J4995L4895M5257M3659
20224A63337R1057P3587n596n4974l8455l662K2801N1387M4719K9589J2565L5467
20212D21822J3151p7677q4568n5383k1549L113L7607M9845j848q1764o8051k8932
20200A05766n24j2552O113m0267k9908k4095m041L3689L5528k6734m852k2117
20188A6006J4889J1256j306N749j134n409k8292j4479J5285p976j2444P859k4159
20175b4155k9612L1246J9960J2045N007j7226m821L2529J6637j8008k6286k445
20163e129K7267L9840p828j6213j078J4369r836l6044J2639p32j9914J4837o341
20150E837j7860j937K8184J138r595K2366K084j5964Q998n125j471J0587J2674
$$ y = [23203, 37431, 6621, -9131, 19161, 35375, 25730, 27032, 23723, 24531, 39526, 74421, 119678, 163337, 254394, 327981, 322385, 267411, 228956, 225294, 248095, 299482, 344201, 373790, 386355, 421822, 434973, 357296, 272728, 217345, 195796, 198909, 236516, 286361, 284513, 202749, 134698, 105766, 105242, 92690, 98803, 58536, 28628, 4533, 492, 34181, 69709, 42975, 38123, 16006, 30895, 42151, 40845, 46594, 45460, 40051, 11759, -2720, 12565, 4589, -7855, 4, -24155, -53767, -22521, -2561, 9484, 14491, -2735, -7556, 24973, 41610, 23602, -2684, -5129, 22138, 61978, 54150, 37937, 36859, 51228, 41392, 5348, 17987, 17255, -2659, 12178, 5837, -12023, -13960, 14224, 15362, 5767, 28133, 30217, 14253, 23251, 18126, 16655, 27242, 39916]
20137C9916k92k651K7887N8985J07027R6899M8788J0159Q084k8269o6792m1105
20125B58636k9881K0947J04297R9902R7560O3515O9665N7200k7099r8520o0595
20114E55627p6699r6968o0570r615L762K9574M6408L7928K7351J1877k2165r6303
20102C50207j05413p3169o3502m776K1244o888k7049q157K0011k8634j6803j1124
20090D5947j0197J023J1229J5276n071j9795l0603J6757L0353o289j9028Q53O45
20077C1100k569k8676m976j2164o457J1870L5074L842j3941j8930J6910K9891
20065D0974K3630l797J1614J1618K212j3985k5259O159j491o87l5758k7778j0170
20052b2718J2815K1576L0045q379M225k1272j5649J4615J6539J8524J6113k0624
$$ y = [39916, 39624, 36973, 64860, 123845, 230872, 327771, 376559, 386718, 394802, 366533, 299741, 258636, 228755, 249702, 353999, 453901, 551461, 614976, 684641, 741841, 714742, 616222, 555627, 478928, 381960, 321390, 311775, 315537, 345111, 391519, 429447, 456798, 468675, 446510, 350207, 244794, 171625, 108123, 103347, 124591, 117703, 90654, 82497, 102508, 73874, 57071, 45947, 35750, 36773, 48002, 63278, 58207, 38412, 7809, 24566, 54919, 48630, 29602, 30455, 31100, 28531, -145, -5121, -17285, -23742, -11872, 23202, 27044, 13103, -5827, 11083, 40974, 64604, 60807, 72421, 84039, 86251, 72266, 47007, 53166, 51675, 50988, 15230, -12548, -22718, -9903, 11673, 41718, 33339, 37564, 16292, 643, 15258, 31797, 50321, 66434, 45810]
20040D5810j9461M170M288j2354N953L323R777j0290j2120l450K3783L0636p926
20027F2139j597k761o69J2790p3L105j423J5539L473K046o140j875J9083M0408
20013A44045N6683O1060Q4515J69030K10923J83462J3921j43248j75030j44871
20003D60490p8058n2893l323k639j0582r857L1128K5624L1344J01931K15435K40987
19991I49587J07922j62156k32215j86249j13614n6420l5558j355L765L0323O6912
19980C70942J06035J76409K62144J86575j04681k26841k46816j51398p8392m3780
19970B50197j7056k7351k9555L3783M5614O3541Q5093J30830K19714K06437L134
19959I64381j48273j91941j76148j15670o7130l7295Q719j4033j7382l6634j7868
$$ y = [45810, 26349, 30519, 34807, 22453, 28406, 31729, 41506, 31216, 19096, 15646, 39429, 70065, 62139, 60542, 57781, 57112, 69902, 69829, 72934, 71511, 87050, 90523, 92569, 86429, 84554, 103637, 144045, 200728, 261788, 346303, 515333, 726256, 909718, 923639, 780391, 605361, 460490, 382432, 329539, 326216, 323577, 312995, 303138, 334266, 359890, 391234, 493165, 708600, 949587, 1057509, 895353, 663138, 476889, 363275, 306855, 271297, 269942, 273707, 304030, 370942, 476977, 653386, 915530, 1102105, 997424, 770583, 523767, 372369, 293977, 250197, 233141, 205790, 176235, 210018, 255632, 319173, 404266, 535096, 754810, 961247, 964381, 816108, 624167, 448019, 332349, 265219, 227924, 236643, 222610, 205228, 168594, 150726]
19948A50726Q118K3371L819j2118m3856j5559O332J3075o971k655q773J7329m895
19935A27943k2228l6182k9289n492K3139L486L421J2846K689M58o604R806k2218
19922F1775J6084M090q969J1042Q499j6669k4258J4915K6261p079j0279j0053
19910F5359R761K7641L900k5574O384M07J2403J4170J2095P453k0253l2752k3080
19897E7914k3776J761L5565J3695j421k0290J6901l239L939j3759m931J8829q607
19884G2581J3273J2775j0239o589O033L509j4467j8280K4270l6712J7420L7930
19872A01504m618O367J2339J9691L0179L2917R214m886j943l6938l0209r825L6285
19859A60077K2628K727N648M7597n862l9457k0466m406k0815j3139J3656p672
$$ y = [150726, 158844, 182215, 186034, 173916, 130060, 114501, 120833, 133908, 126937, 124282, 115509, 132838, 127943, 105715, 69533, 40244, 34752, 57891, 61377, 64798, 77644, 80333, 80791, 74187, 83993, 61775, 77859, 81949, 72980, 84022, 92521, 75852, 51594, 66509, 92770, 85691, 75412, 65359, 75120, 102761, 106661, 81087, 87471, 87878, 100281, 114451, 126546, 133999, 113746, 80994, 57914, 34138, 35899, 71464, 85159, 83738, 63448, 80349, 77110, 81049, 67290, 62359, 81188, 72581, 85854, 98629, 88390, 81801, 87834, 91343, 76876, 58596, 82866, 46154, 63574, 101504, 96886, 103253, 115592, 135283, 165462, 198379, 207593, 202707, 200764, 163826, 133617, 123792, 160077, 182705, 185432, 191080, 238677, 232815, 193358, 172892, 168486, 147671, 134532, 148188, 140516]
19847A40516j3284k104J5306q712L2842J4849l2857M674J5149Q108j3632J7780
19835A78635p739k536K060K079K7254j2410k6966r742M256o81q797L377M8155
19822A96945l454P196L5564l279K4960p57n793J252O809J0577m219k368j8190
19809B45243J0892m786n873q438L4628K993k931O09q070k9757K1323P3755P427
19796C37015J2622L074k880K4037M9595K4709J9973j9114J2173J8907K4992N4646
19784E59749M9968Q0774Q8565Q8374M1431K3277N7522P9948J32694J38784Q4349
19773A425435J16906J20676J32188J71476K31818K30755J52764J45457K28801
19764B956276L44732M96702Q19694J173090J703281K664342M612058Q174074J3440156
$$ y = [140516, 127232, 125128, 140434, 131722, 164564, 179413, 146556, 151230, 166379, 174487, 160855, 178635, 170896, 168360, 170420, 172499, 199753, 187343, 160377, 150635, 154891, 154210, 145413, 148790, 196945, 193491, 200687, 236251, 232972, 257932, 257175, 251382, 252634, 259443, 270020, 265801, 263433, 245243, 256135, 251349, 245476, 237038, 271666, 274659, 271728, 272337, 264267, 234510, 255833, 329588, 337015, 349637, 352711, 349831, 373868, 423463, 448172, 468145, 449031, 461204, 480111, 505103, 559749, 609717, 690491, 779056, 867430, 908861, 932138, 989660, 1069608, 1202302, 1341086, 1425435, 1542341, 1663017, 1795205, 1966681, 2198499, 2429254, 2582018, 2727475, 2956276, 3301008, 3797710, 4617404, 5790494, 7493775, 10158117, 14770175, 22944249, 36384405]
19755C6384405J2739542j743885j0006445p688696j121487N697924J3009559J5230495
19747F2501412L953925k49555M550206k468216j3784510j3807922o974976P23804
19739C4444168Q359100J3444651K963573j2898884j5469463j0564481n799482
19732A4479182l289160k105406j431593r87683p15133n26712k62813j35820k14632
19723D810230k82163k26402j62404m8889J63974K05387O0147K2045J56246K79277
19713D977448M02703O97493J110845J764343K907720N199190R227468J4855686
19705D1142896J2136022m117902j1012491p343956k30760O857353J4273334J5083538
19697F6788034L538006J744238P077650m341955j6749172j5213073o824202J750735
$$ y = [36384405, 49123947, 47380062, 37373617, 29684921, 28563434, 34261358, 47270917, 62501412, 66455337, 66205782, 70755988, 68287772, 54503262, 40695340, 33720364, 34444168, 42803268, 56247919, 59211492, 46312608, 30843145, 20278664, 14479182, 11190022, 9084616, 7653023, 6665340, 5950207, 5423495, 5160682, 5024862, 4810230, 4528067, 4301665, 4139261, 4090372, 4254346, 4459733, 4519880, 4541925, 4698171, 4977448, 5380151, 6077644, 7188489, 8952832, 11860552, 17059742, 26287210, 41142896, 53278918, 49161016, 38148525, 30804569, 30573809, 37431162, 51704496, 66788034, 70326040, 72070278, 79147928, 74805973, 58056801, 42843728, 36019526, 37770261]
19689C7770261J0159138J4796182R52050j5219026j6703812j0948320o038734
19682A4767739l531845k313910j641321j125800q03655o22374m61961l90892l50847
19673C525134l43266k82292k49409k10176j14216p8232j13498k09963j52318j13391
19663A658373n5139n2138p7684j19110j36001o0494l1742n0121n1754l5098j7484
19652I71608l1522l8835k2526k2361L2402J4294J6933K1067L3235N818K6825O2004
19640A068942K9609M3236M3263O9979J07371J38671J83114J96180K09055K44416
19630B333836J97787J96767K88629L13018K70084L45659M91641O24474Q06751
19621E868646J131700J620711K353242L633394N985379J0370126J7063800J8675350
$$ y = [37770261, 47929399, 62725581, 63677631, 48458605, 31754793, 20806473, 14767739, 11235894, 8921984, 7280663, 6154863, 5351208, 4728834, 4266873, 3875981, 3525134, 3181868, 2899576, 2650167, 2439991, 2325775, 2247543, 2134045, 1924082, 1771764, 1658373, 1603234, 1551096, 1473412, 1354302, 1218301, 1157807, 1126065, 1075944, 1024190, 989092, 971608, 940086, 901251, 878725, 856364, 888766, 903060, 919993, 941060, 974295, 980113, 1006938, 1068942, 1098551, 1141787, 1185050, 1255029, 1362400, 1501071, 1684185, 1880365, 2089420, 2333836, 2531623, 2728390, 3017019, 3330037, 3600121, 3945780, 4437421, 5061895, 5868646, 7000346, 8621057, 10974299, 14607693, 20593072, 30963198, 48026998, 66702348]
19613F6702348O942593K079744M867283n426508j5991982j3936749n796356K501225
19605D1941598J0949547J7767104J3061460Q111209J6168737J6976607m650083
19598A20326179j4123204p340662j0498849j9403510j7519979r423010r39328
19591D1077637P125928J3780439Q932482j654230j423401k468490j2657995j5880963
19583C6831407j1961865p031293m009763k583904j902453j439628j107304r25036
19575E870161p85969n45140l95950l69321k84080k45062l14011l07505k40241
19566B382882k69736k62232k12927j52484j18086j09296o8238o6880j07837r2088
19556I23078l8986k4100p9273p3548o5962j2814r447l2725j7317k9425l0027m2696
$$ y = [66702348, 73644941, 75724685, 80591968, 75165460, 59173478, 45236729, 39440373, 41941598, 52891145, 70658249, 83719709, 91830918, 107999655, 124976262, 120326179, 106202975, 98862313, 88363464, 68959954, 51439975, 42016965, 41077637, 48203565, 61984004, 70916486, 69262256, 67838855, 65370365, 52712370, 36831407, 24869542, 17838249, 13828486, 11244582, 9342129, 7902501, 6795197, 5870161, 5084192, 4539052, 4143102, 3773781, 3489701, 3244639, 2930628, 2623123, 2382882, 2113146, 1850914, 1637987, 1485503, 1367417, 1258121, 1189883, 1123003, 1015166, 923078, 884092, 859992, 780719, 707171, 641209, 628395, 618948, 586223, 568906, 539481, 509454, 466758]
19544D66758l5803m3807l4750j5491k000o619j6172l330k5488m0512j8856P811
19532B31741n387j7716k5616k371L818Q490P877P882l0782k503j5577K402j865
19519A60393p596n416J3003J8334k6344n2276k5475m387K0311L2166l337m1K132
19506A21467j738j2251j6328j0803J386j2136O956O173K1715L1506N655K1668
19494A63270J3857l1589j4295p169Q868J1893J9003j1437r545r487K124P436R99
19481A43928M212L111j4373J3663P398P298L294l466J3812j2890j4072j3799m666
19468A33450l3489j3598K3841K5264P839k014j6842j5077k62k2615k138J5037
19456I9396j1546k4972K379K796J6716N122j8207j4389j4972K577p934l499K201
$$ y = [466758, 430955, 387148, 352398, 336907, 334907, 328288, 312116, 308786, 283298, 242786, 223930, 231741, 226354, 208638, 183022, 180651, 184469, 192959, 200836, 208718, 177936, 175433, 159856, 162258, 160393, 152797, 147381, 160384, 178718, 152374, 100098, 74623, 70236, 90547, 122713, 119376, 119335, 121467, 119729, 107478, 91150, 80347, 81733, 69597, 76553, 82726, 104441, 135947, 141602, 163270, 177127, 145538, 131243, 124074, 132942, 144835, 163838, 152401, 142856, 133369, 135493, 142929, 143928, 148140, 151251, 136878, 150541, 157939, 165237, 168531, 165065, 178877, 165987, 151915, 138116, 133450, 99961, 86363, 110204, 135468, 143307, 141293, 124451, 109374, 109112, 86497, 84359, 99396, 87850, 62878, 65257, 68053, 84769, 89891, 71684, 57295, 42323, 44900, 36966, 33467, 35668]
19443C5668j8783j8935l3436J9075M0355J2158r703n333j5357j9421j4582J7929
19431a0365n154L877n290J1620Q899J0984K7878N780l8865q50m990L1621J3391
19418D8536J7137k9976j7470l1216J6054M0824K4726o563k4206n923k3865l185
19406D873j4833j0528J5427K3122m57Q854L310j9028J1240J5594K232j4019r612
19393A6175n697k1714k3324k754J4771K9096q0K0739j182j0733k0450Q504L0874
19380C4225L6034j567j9624j9337m282q404J277N05P976J0113J5081o503j4160
19367C1334n005O150j5639P30j8658R045j304J938J9328p389n528L0215m289p902
19353C3026Q111j9697o461K4730N158p566k1348l6459K8462l430n334o340l573
$$ y = [35668, 16885, -2050, -35486, -16411, 23944, 36102, 26399, 21066, 5709, -13712, -28294, -10365, -15519, -11642, -16932, -5312, 3587, 14571, 42449, 48229, 9364, 8514, 3524, 35145, 48536, 65673, 35697, 18227, -12989, 3065, 43889, 68615, 62052, 37846, 31923, 8058, 4873, -9960, -20488, -5061, 18061, 17604, 26458, 29768, 10740, 21980, 37574, 39806, 25787, 16175, 10478, -11236, -34560, -37314, -22543, 6553, 6473, 27212, 26030, 15297, -5153, 3351, 34225, 70259, 68692, 49068, 29731, 25449, 17045, 18322, 18827, 26803, 36916, 51997, 45494, 31334, 26329, 32479, 16840, 17570, -1088, 7957, 6653, 8591, 27919, 20530, 15002, 45217, 40928, 33026, 41137, 21440, 14979, 39709, 44867, 37301, 15953, -20506, 7956, 4526, -808, -7148, -10721]
19340a0721K2444J8968m135k239J0944j2017k3059l7220J3806J8980K2390J3272
19328C1413j6742k3701q974Q254J5042o92J9029K1527O804j3823k5231N075M081
19315B2062n506l729q134J2686j4748N424N386n611Q152N49j0564k7203k1094
19302d2330J9751J8433j3991j8671N647j0504n828J3270K0331J5035J0929K735
19290A4807j4139k7310L0222J018N78O509j6791m530O753R094J7937k3818j2014
19277a1684j2811K247L274j3645o69Q116K2052K1115k0076j1311p875M865Q525
19264g877o633K919R379L429k56Q740K83l6816k8026J0500J6732L372l7693q628
19250g0575R356R960J4919J1180N8m132J3459M3384K3003p362k1987q356K8183
$$ y = [-10721, 11723, 30691, 26556, 24317, 35261, 23244, 185, -37035, -23229, -4249, 18141, 31413, 14671, -9030, -18004, -9750, 5292, 4600, 23629, 45156, 51960, 38137, 12906, 17981, 22062, 16556, 12827, 4693, 17379, 2631, 8055, 13441, 7830, 15982, 16531, 5967, -21236, -42330, -22579, -4146, -18137, -36808, -31161, -41665, -47493, -34223, -13892, 1143, 12072, 14807, 668, -26642, 3580, 4598, 5176, 11685, -5106, -9636, -2883, 6211, 24148, 330, -11684, -24495, -22248, -18974, -32619, -33288, -25172, -3120, 17995, -2081, -13392, -21267, -16402, -7877, -14510, -11591, -2212, 1217, 961, 9701, 9984, -26832, -54858, -44358, -27626, -24254, -61947, -70575, -61219, -51259, -36340, -25160, -25102, -29234, -15775, 27609, 50612, 43250, 21263, 12907, 41090]
19237D1090J5451K7661O519J927O1919Q1572P390m2841m0174J893L5707Q5322
19225B83436M8014J3591q176n960n989n8623p8168l3382m36K2966N2548J9454
19213B49275l7596o3812p2073m2123j7109L642j8337l796J287j616J2852j7310
19201f716M118K0789j0777R068J3590j4598j3012R487q99J1577K8383J2924N936
19188F9870j0880p561M330J2231N9516R0806P6067J064l9114l6915q774J8748
19176B29388L5870Q9933R674j6880K3920p429n4190q2993m6408j1991J4612N6101
19164B39607L3587p1488o7309n2554o3948m8693l272K4772l5137k5950J8253j2491
19152f4623J2165K1679J5102k923Q507K2861K3044j7218p284J994k5568J3121
$$ y = [41090, 56541, 84202, 90721, 92648, 154567, 236139, 243529, 200688, 160514, 162407, 198114, 283436, 331450, 345041, 336865, 330905, 324916, 266293, 188125, 154743, 154307, 177273, 229821, 249275, 211679, 147867, 75794, 33671, 16562, 20204, 1867, -1929, -642, -2258, 10594, -6716, -2598, 18191, 7414, 16482, 30072, 15474, 2462, 11949, 11050, 22627, 51010, 63934, 69870, 58990, 51429, 55759, 67990, 127506, 218312, 294379, 295443, 256329, 219414, 210640, 229388, 265258, 355191, 364865, 347985, 371905, 364476, 310286, 227293, 180885, 168894, 183506, 239607, 273194, 201706, 134397, 81843, 17895, -30798, -34070, -9298, -44435, -70385, -52132, -64623, -52458, -30779, -15677, -18600, -10093, 12768, 35812, 18594, 11310, 13304, -12264, 857]
19140H57J9427p872L805J3291O892o194k1940m8238K3533K4840J6679m937j3690
19127F453o068J5501J8593J7193k4641P493J0238k4087o744p128M492Q34m484
19114G645j6969r129j3617J8408J6168N798J2075j647j9418k8908k0531J8467
19102c1658J4580j9747K258O068K7697J3132M8K2582P1440O7247P8040O9104R856
19089C30647J5301K7328k3660p5073j9011r983L0542N2898R4204M3375K3256R0561
19077E80385O5270k7085l4461o5870q9553r1205n4058l4917K66K5956Q8757O0236
19065D23721j3330k6769j4907n9384r7468p0949j3338k6069m754k0781m360n817
19053F5795q610j0488k961q564L728J718k8400m4089j7249K3968L6842J3541N583
$$ y = [857, 20284, 12412, 16217, 29508, 36400, 30206, 8266, -39972, -16439, 8401, 25080, 20143, 6453, 385, 15886, 34479, 51672, 27031, 34524, 44762, 20675, 13931, 6803, 11295, 12129, 7645, -9324, -18453, -32070, -13662, 2506, 8304, 20379, 18732, -686, -29594, -50125, -31658, -17078, -36825, -34567, -28499, -802, 12330, 12378, 34960, 106400, 173647, 251687, 320791, 330647, 345948, 373276, 349616, 274543, 255532, 245549, 276091, 328989, 423193, 466568, 489824, 580385, 645655, 618570, 584109, 518239, 428686, 337481, 283423, 248506, 248772, 274728, 363485, 423721, 410391, 383622, 368715, 309331, 211863, 140914, 127576, 101507, 96753, 75972, 71612, 65795, 57185, 46697, 43736, 35172, 38900, 40618, 12218, -31871, -49120, -25152, 11690, 25231, 30814]
19040C0814j6774K2647J523j722k9514l2483j7286n830L9865R244J5980l761n1876
19027c9173j5567L5790J7377k9966l797J6697q507N599n080j1747M287M6785L0436
19014D3134l2868m8241N672J6365O505m847k4493R531K3089J8431j6550N66J0390
19001F684J1757N972J4943p767j8866j9300Q583K7011K4077J1285j6516j0018
18989C7845j3013k0372r241r454q932q758N124M118K8324K5620L822j8294k098
18976A4691j2019j3639O618j5719K654O710K3716r631m836Q454j878j8852l2452
18963d6183L8140M4165o867j9646J102j7373N186K6132J1140k3786j0950K2044
18951B3104K6890j545M6770O4375P7254P0842m947p646r052j7208o4888j02679
$$ y = [30814, 14040, 36687, 38210, 36488, 6974, -25509, -42795, -48625, -8760, 484, 16464, 12703, -39173, -54740, -18950, -1573, -31539, -35336, -18639, -27146, -21547, -26627, -38374, -34087, 12698, 43134, 10266, -37975, -32303, -15938, -9433, -14280, -38773, -29242, -6153, 12278, -4272, -3706, 6684, 18441, 24413, 39356, 31589, 12723, -6577, 2006, 29017, 53094, 64379, 47863, 37845, 24832, 4460, -4781, -14235, -23167, -31925, -26801, -22683, 5641, 31261, 35083, 16789, 14691, 2672, -10967, -4349, -20068, -17414, -10704, 13012, 3381, -1455, 6999, 5121, -13731, -46183, -8043, 36122, 29255, 9609, 10711, -6662, -1476, 24656, 35796, 12010, 1060, 23104, 49994, 48449, 95219, 159594, 236848, 307690, 302743, 295097, 286045, 268837, 203949, 101270]
18939A01270n8415m0074Q377K5287o19j7031j2421J5012K0823j2768m656l21m7
18926B4417j685n637j4636K5172K3160j4376j8569j9107M732O568m791M785j317
18913H716j9617K9510K7770j9471M706K7895J7665K543k9635k191L1276N4874
18901A34041K4930J1577O3233Q0725J57333J74483R0573r930l3990q2880j53339
18890D56756j62521q8770o7510o3672n8086j1702L9912n085j4322J5897L3491
18879G4388j7325j2596m927K442J4953K4831N233N946n451l487k4887k8929r996
18866B0195J2968P398J0457J1834n826m8471k2029o705j6532M0498N9101K7050
18854H9938J0551j7377j4811K516j6784K7933Q2722J08823R3537J3323k1075K827
$$ y = [101270, 42855, 2781, 11158, 36445, 35826, 18795, 6374, 21386, 42209, 29441, 24785, 24464, 24417, 22732, 17095, 2459, 27631, 50791, 36415, 17846, -1261, 3471, 10039, 5248, 10033, 8716, -10901, 18609, 46379, 26908, 31614, 59509, 77174, 79717, 50082, 47891, 79167, 134041, 158971, 170548, 233781, 314506, 471839, 646322, 736895, 726965, 692975, 610095, 456756, 294235, 205465, 137955, 74283, 16197, 4495, 44407, 39322, 25000, 40897, 74388, 57063, 44467, 39540, 41982, 56935, 81766, 86999, 92945, 87494, 84007, 59120, 30191, 20195, 33163, 40561, 51018, 62852, 57026, 8555, -13474, -20179, -36711, 3787, 62888, 89938, 100489, 83112, 68301, 70817, 54033, 81966, 164688, 273511, 367048, 380371, 359296, 362123]
18842C62123m3903j11569q9926m1740k6488k9096j1498J1426J9538J7670o186
18831E0351J5474r469l3462q336O534Q33K4953L7158L754l6447j7803l083M231
18818C4688j6252q705J0958J2706j156k8733r290J2707K0441k8566p04M8547L610
18805E0251J7403J3834n836m7638P81O301Q035K0858k4654J517j018k7976k1834
18792i976L2118J1355k3902o223J6598j6444p926K2831J4221K820j5370j6180
18780C922j7998k145k1241j915K6507n631J5541K3088N86J3603M3783J9493N6265
18767A53858J33518R8477p2538j00512j09914r0383m2283J9964K5568L729P63
18756B0247M17J691Q089n745o729o872J3866l319k321R186R68l888K3958M123
$$ y = [362123, 318220, 206651, 116725, 74985, 48497, 19401, 7903, 19329, 38867, 56537, 50351, 65825, 56356, 22894, 14558, 21092, 21925, 46878, 84036, 87790, 51343, 33540, 30457, 34688, 18436, 9731, 20689, 33395, 32239, 3506, -5784, 6923, 27364, -1202, -1906, 46641, 50251, 67654, 81488, 75652, 28014, 28795, 35096, 43131, 63989, 39335, 40852, 39834, 11858, -9976, 22142, 33497, 9595, 3372, 19970, 3526, -4400, 18431, 32652, 35472, 20102, 3922, -14076, -16221, -37462, -39377, -12870, -18501, -2960, 20128, 20714, 34317, 78100, 97593, 153858, 287376, 385853, 313315, 212803, 102889, 12506, -29777, -9813, 15755, 19484, 20247, 20664, 22355, 30444, 24699, 17970, 11098, 24964, 21645, 19324, 28510, 29478, 25590, 49548, 53671]
18742E3671q252m4263m0539J9986J2030K483Q982l963j2114M235K718J583r004
18729a2447J8241J6429J1919J3406j389q004l3674k2252k4814l258K7898L4777
18717A6832K087O137k0226j4318p610q199Q901q464L372m100J769K3707J1870
18704A1758r908L98j2353Q722P062M087j8152k1207N744K8586K9166M103j051
18691C6955K477J5526J1466J4674R953n518k3015k0845r5P65k0225j789Q103j5593
18677A2839n800q261q771J2640J4983J3956j337q943L166n484o585J7462Q90K484
18663C3239Q975j5966o246J0730J7992k2194m31R441k8096L326J9386L0043q7
18650F0112k9568l3309k6515K8315K1379M506K3415N5017L3806N016k455J507
$$ y = [53671, 45419, 1156, -39383, -19397, -7367, -4884, 4098, 135, -11979, -7744, -5026, -3443, -12447, 5794, 22223, 34142, 47548, 46159, 38155, 4481, -17771, -42585, -45843, -17945, 16832, 18919, 25056, 4830, -9488, -17098, -25297, -16396, -24860, -21488, -25588, -23819, -112, 11758, 1850, 2248, -10105, -1383, 5679, 9766, -8386, -29593, -23849, 4737, 33903, 38006, 36955, 39432, 54958, 66424, 81098, 91051, 85533, 62518, 41673, 41578, 42343, 22118, 20329, 28432, 12839, 7039, -1222, -9993, 2647, 17630, 31586, 30249, 21306, 24472, 18988, 12403, 29865, 30755, 33239, 42214, 26248, 20002, 30732, 48724, 26530, 26099, 35540, 7444, 10770, 30156, 60199, 60112, 30544, -2765, -29280, -965, 20414, 24920, 48335, 103352, 137158, 142174, 139719, 141226]
18638A41226k5277J1653r77K750o736m1010m1867J6875K176J3720j986l3120l1993
18625E434k4550Q523M4043M615n440L1101J9435k3291J5482K2680n119J623L1474
18612A26010O5005J16693J28517R6479k9104j04473j11242p9310m5201m0161n0767
18601G2446l1779j3014K5648L2725K840N176K2126K2451p334J8663j4617q689
18589A26642J2281j2783k8378J1873J7642M0038P9134Q3425J28113J86146K29735
18578H73868J34851j09951k48494k16425j41818r3650p5269n3700R254P029O426
18567I2121NN290r727k869K0647n967K4574K3754K0702K3331L6701J5428j4726
18554B29264k8998Q328L8015Q4590R7853J35536J84909N1945j10512j50410q9372
$$ y = [141226, 115949, 127602, 126625, 129375, 122639, 81629, 39762, 56637, 58813, 72533, 70547, 37427, 5434, -19116, -10593, 33450, 38065, 32625, 63726, 83161, 59870, 75352, 98032, 92913, 94536, 126010, 191015, 307708, 436225, 532704, 503600, 399127, 287885, 208575, 163374, 123213, 72446, 40667, 27653, 53301, 86026, 88866, 94042, 116168, 138619, 131285, 149948, 135331, 126642, 138923, 126140, 97762, 109635, 127277, 167315, 246449, 329874, 457987, 644133, 873868, 1008719, 898768, 650274, 433849, 292031, 198381, 123112, 69412, 78666, 85695, 92121, 92126, 97416, 87689, 84820, 105467, 99500, 124074, 147828, 168530, 191861, 228562, 243990, 229264, 200266, 208594, 246609, 331199, 429052, 564588, 749497, 801442, 690930, 540520, 451148]
18543D51148m2191l9844p8305l9752l0837l6138k5547K1138N5305N7880k5687
18532B67170l2530l5437k0450j5293J1395J2533q570q831k3687j3659K395k5507
18520A09529l4191K1960K9930J7781J9895L771K493M3543L2283k108J5508K9268
18508B89662P3798R2741L0041n7968p5952m1943N822N4424P1348M2046O4299R97
18496E49315k3200K9266L8448K7259l7296q6652j13059m1437J2410M2392L8759
18485D36205P8493P2881l869q1354o9770l3099k411P483J065J811M493K7930L9017
18472D78875N6310J06345J05570K6886K2485J2274R474L8435O1733P711k6840
18461H99258N268k8324m5393l5008P524L3588P1815Q9601R3040J39889J59001
$$ y = [451148, 408957, 369113, 290808, 251056, 220219, 184081, 158534, 179672, 234977, 292857, 267170, 234640, 199203, 178753, 163460, 174855, 187388, 178818, 169987, 146300, 132641, 135036, 109529, 75338, 97298, 127228, 145009, 164904, 168675, 171168, 214711, 246994, 244886, 260394, 289662, 363460, 456201, 486242, 428274, 352322, 310379, 316201, 370625, 441973, 484019, 548318, 549315, 526115, 555381, 593829, 621088, 583792, 497140, 384081, 342644, 355054, 397446, 436205, 514698, 587579, 583710, 502356, 432586, 399487, 397076, 404559, 405624, 407435, 411928, 439858, 478875, 535185, 641530, 747100, 773986, 796471, 808745, 818219, 856654, 918387, 926098, 899258, 904526, 876202, 830809, 795801, 803325, 836913, 908728, 998329, 1091369, 1231258, 1390259]
18450A390259J92230J95576K76425L82652N32623P27381J121573J738532K716675
18441I273926M550982P948890J3770011J8334760Q197714p79317K173664k211317
18433F1259313j4245802j5691068j0619811o076505l651909k363088j728553j306892
18425E575685r27527o51007m38138k74077r0207p2440j29876o2137l5249q6195
18415B808832q482K5602o1674L9010N5754p3442j03583p8834k2573N0646R5427
18404B726683J11994J62524K74881K73339K73669M56264O30339P73905J070637
18395F754235J605394K451020L847652O106484J0214440J7750919L0518736L9284797
18387A18533677J6221202j995463M494193o075208l1181449l3749370k2855789
$$ y = [1390259, 1582489, 1778065, 2054490, 2437142, 2969765, 3697146, 4818719, 6557251, 9273926, 13824908, 21773798, 35543809, 53878569, 62076283, 61296966, 63470630, 61259313, 47013511, 31322443, 20702632, 14626127, 10974218, 8611130, 6882577, 5575685, 4648158, 3997151, 3559013, 3284936, 3194729, 3122289, 2992413, 2930276, 2895027, 2808832, 2800350, 2825952, 2764278, 2803288, 2859042, 2785600, 2682017, 2603183, 2580610, 2631256, 2726683, 2838677, 3001201, 3276082, 3549421, 3823090, 4279354, 4909693, 5683598, 6754235, 8359629, 10810649, 14658301, 20764785, 30979225, 48730144, 79248880, 118533677, 134754879, 132759416, 137253609, 131178401, 99996952, 66247582, 43391793]
18380D3391793j3094468p863583n107597l647754k686578k020955j493269j083508
18372F394081p62437n27736m27687l66322l03175k51529k09421j02633p0698o0116
18362C312327Q7776R4689r9762j43588p9213p1230o8790L419n1302P064R4470
18351C085860J9121K90R0634K01894L51290N43334Q52455J396313K190902L427616
18341A2159709N769674J0071226J7273111K1636025P999409j330694K557118m337365
18333G1798213j7751780j8494231j2253546p001290m233705k754207j937522j436386
18325E935546j075654q08747o05620m51155l50951k70647j88160r9023n7607J4647
18315B042629J21398P4375j8321K8666P8222r862j79741k33833k06949j43296
$$ y = [43391793, 30297325, 22433742, 17326145, 13678391, 10991813, 8970858, 7477589, 6394081, 5631644, 5103908, 4676221, 4309899, 4006724, 3755195, 3545774, 3443141, 3372443, 3312327, 3400103, 3494792, 3395030, 3251442, 3172229, 3100999, 3032209, 3035628, 2984326, 2991390, 3085860, 3104981, 3105271, 3195905, 3397799, 3749089, 4292423, 5144878, 6541191, 8732093, 12159709, 17929383, 28000609, 45273720, 66909745, 74909154, 73578460, 76135578, 71798213, 54046433, 35552202, 23298656, 16297366, 12063661, 9309454, 7371932, 5935546, 4859892, 4051145, 3445525, 2994370, 2643419, 2372772, 2184612, 2085589, 2027982, 2042629, 2164027, 2238402, 2220081, 2248747, 2326969, 2317107, 2137366, 1903533, 1696584, 1553288]
18305A553288p2148r1427k2414L976j01177j24417j08429q9381J506J18371J22865
18294A190613m3091j24324j41874j29058q1005k5330K2121P1261J59516K08556
18284A107385P0751j33810j58491o9781K1746J54861L32884N00957L56938j79947
18274B003493l99952k47034Q929K40221K83507R4326q1827l03356m08952l27106
18264H62249j96014q5792l2071m3229k3970j0426m2676m0195m5689k2333J7799
18253C37653j5047l4863r164J1751j5585m7122J946M8985L5094J5497l0660k4201
18241B74284n050p290r116o724L9483P2815L777l6951m8361l2231j3043l4897
18229A96696k6057j5695j5891J356J0930O373m9791J4851R155R982K3617r017
$$ y = [1553288, 1481140, 1389713, 1367299, 1371275, 1270098, 1145681, 1037252, 947871, 949377, 1067748, 1190613, 1147522, 1023198, 881324, 752266, 671261, 645931, 668052, 739313, 898829, 1107385, 1178136, 1044326, 885835, 816054, 837800, 992661, 1325545, 1826502, 2183440, 2003493, 1603541, 1356507, 1365436, 1605657, 1889164, 1983490, 1901663, 1598307, 1189355, 862249, 666235, 580443, 548372, 505143, 481173, 470747, 428071, 387876, 342187, 319854, 337653, 322606, 287743, 278579, 290330, 274745, 227623, 229569, 278554, 313648, 329145, 298485, 274284, 269234, 261944, 252828, 246104, 285587, 358402, 362179, 325228, 276867, 244636, 231593, 196696, 170639, 154944, 139053, 140409, 151339, 157712, 107921, 122772, 131927, 141909, 165526, 156509]
18217A56509j1080j7561l4867l500N2501L9680K9066j0476K7121L1404N438j0325
18205B53910j2861l7750k3028j8536L353J6066J2006M565n100P652J4449k6919
18193A87807k6401r268O59n180P230L6166M142k3615k1007R364l332j4558M684
18180A46691j100p282n37K4080l896j2475N00M0583L5832M49m5691j2710j0133
18167A54311K2304J8436P539j552j2477J1243L1271J4275N864j4888j7607J9987
18155B38706N58l0322j629K2715K1753k0039Q146N8111L2642M6491K8351j4650
18143C90833J560L527M245K6223L1324J2751j0101k442N1031L2530k5652q332
18131E07497m184P3826N7735J6245K7266N9509O4529O0382Q7064J10042J39192
$$ y = [156509, 145429, 127868, 93001, 89501, 142002, 181682, 210748, 200272, 227393, 258797, 264235, 253910, 241049, 203299, 180271, 161735, 165088, 181154, 193160, 197725, 192625, 200277, 214726, 187807, 161406, 152138, 152797, 147617, 154847, 191013, 195155, 171540, 150533, 159897, 156565, 142007, 146691, 145591, 138309, 137772, 161852, 157956, 145481, 145981, 186564, 222396, 222845, 177154, 164444, 154311, 176615, 195051, 202590, 201038, 188561, 199804, 231075, 245350, 251214, 236326, 218719, 238706, 239264, 208942, 207313, 230028, 251781, 231742, 239888, 297999, 330641, 377132, 405483, 390833, 392393, 395920, 400165, 426388, 457712, 470463, 460362, 457920, 508951, 541481, 515829, 507497, 503313, 577139, 634874, 651119, 678385, 737894, 802423, 862805, 949869, 1059911, 1199103]
18120A199103J67636K24170K99774L99050N53295P54537J022287J695542K989245
18111I304639N648445J0804507K0270931K1638869p262675k0656009j6696777
18104B3051930q704202m275123k243576j314090j007538q06508n60759l36178
18096C803956j12907K3091K477l3450k4871O6958K48017M64257P39521J036003
18086F213052J192328J496446K502277M443496P884667J4227792K5112998L2120826
18078I5193882J0572559k1278777k9189620k0756219j1588624o464132l820596
18071A2668473k353721j425741q19923m91768n45561o00403m53866k24962R7799
18062E850327L25996L92014M70179O64356J047537J645577K276003K792559L746690
$$ y = [1199103, 1366739, 1590909, 1890683, 2289733, 2843028, 3597565, 4619852, 6315394, 9304639, 14953084, 25757591, 46028522, 67667391, 60404716, 39748707, 23051930, 14347728, 10072605, 7829029, 6514939, 5507401, 4700893, 4140134, 3803956, 3691049, 3714140, 3716617, 3683167, 3658296, 3725254, 3973271, 4437528, 5177049, 6213052, 7405380, 8901826, 11404103, 15847599, 23732266, 37960058, 63073056, 95193882, 105766441, 84487664, 55298044, 34541825, 22953201, 16489069, 12668473, 10314752, 8889011, 8069088, 7577320, 7031759, 6431356, 5977490, 5752528, 5850327, 6176323, 6568337, 7038516, 7702872, 8750409, 10395986, 12671989, 15464548, 19211238]
18053A9211238O036517J0406786J8278347L2736827N4455452N5919887J815755
18046A98860809m8717328n2634223l3908915j7855408q531961k409506L087918
18039C7891386R731208J5637912Q642276q111114j3870277q885618p01859P708309
18031D8042223J4930397R481832p671312j4132961r249169p63839P714462J5052855
18023F3404488J1798402k586678p439735N66502J6250964L4917671L6689912J810149
18015A55411675l4994288m0654510k8369430j6408008r407056n653005l527238
18008A6398140k272366j546990j334986j338741j188189r67665o74475l74301
18000F700427k04679j70562j56284p3674P8915L21287O53724J086866J808845
$$ y = [19211238, 25247755, 35654541, 53932888, 86669715, 141125167, 197045054, 198860809, 150143481, 97509258, 63600343, 45744935, 37212974, 34803468, 37891386, 47622594, 63260506, 71902782, 63791668, 49921391, 41035773, 40333914, 48042223, 62972620, 72454452, 64783140, 50650179, 41401010, 40637171, 48351633, 63404488, 75202890, 72616212, 65176477, 65742979, 81993943, 116911614, 153601526, 155411675, 120417387, 79762877, 51393447, 34985439, 25578383, 19925378, 16398140, 14125774, 12578784, 11243798, 9905057, 8716868, 7749203, 7074728, 6700427, 6495748, 6325186, 6168902, 6095228, 6174143, 6495430, 7149154, 8236020, 10044865]
17991A0044865K975102N278299R436129J3671937Q128473n390919j0090197o382902
17983B7670787l22694N788211J1061800P379471n275304j0578653p327877j207187
17975B7188554N219475J1190079Q375027m678089j0785338p876237j956707M090506
17967C0767270R643216P626095m972488j2096159j0601161o610903l821312k220629
17959G713929j302799q05044o65533o67406o08794m60974l46586k18591j44877
17950B493325j27904j38972k35632k46762j86224r8320n0735k9961l3235o7947
17940A277633j17940j30868j05667o8869k9083q259k5214k6798n6392l5088k7202
17929F46253k6957P497j8936n7895J709K6033P710L5451L8989J404k1936j5855
$$ y = [10044865, 13019967, 18298266, 27734395, 41406332, 49534805, 44143886, 34053689, 27670787, 27348093, 33136304, 44198104, 51577575, 46302271, 35723618, 28395741, 27188554, 32408029, 43598108, 51973135, 47295046, 36509708, 28633471, 26676764, 30767270, 40410486, 48036581, 43064093, 30967934, 20366773, 13755870, 9934558, 7713929, 6411130, 5606086, 4940553, 4273147, 3664353, 3203379, 2856793, 2638202, 2493325, 2365421, 2226449, 1990817, 1744055, 1557831, 1459511, 1408776, 1378815, 1345580, 1277633, 1159693, 1028825, 923158, 854289, 825206, 816947, 791733, 764935, 708543, 673455, 646253, 619296, 626793, 607857, 549962, 551671, 577704, 585414, 620865, 659854, 661258, 639322, 623467]
17917F23467L5986J09431R7612L4382P804Q691k5428r3625j29711r7246m2879
17906E28484j4190l4765R633M2418Q102l6868m9332l9842j7036J9614P128K7322
17894D50668j5359k5747Q433N16M484l765m2888o7880j4003j0684j7763k9711
17882B36301k607L6274k0357J1895N209R034M5330J04042J32261J42854Q6675
17871G86911n5566r4910k5515N5183J22941J00419M8799J3786L5099j7846l3304
17860I35997j9943j7121p0865j34190o3473J7114P1530n4841j09557j06813m4946
17849D02892j1191q822j8427k1505n290O6287Q7367O6298l8203o3698l7287j01
17837D18320N4892Q2401R7474P397j02592j16525j06409q4539j2167j0588m1737
$$ y = [623467, 659453, 768884, 866496, 900878, 908682, 917373, 891945, 798320, 668609, 571363, 528484, 514294, 479529, 489162, 531580, 539682, 502814, 453482, 413640, 396604, 416218, 423346, 450668, 435309, 409562, 417995, 418511, 422995, 419230, 376342, 308462, 294459, 283775, 266012, 236301, 233694, 269968, 249611, 261506, 266715, 275749, 321079, 425121, 557382, 700236, 786911, 731345, 636435, 610920, 666103, 789044, 889463, 938262, 952048, 987147, 969301, 935997, 916054, 898933, 828068, 693878, 630405, 647519, 719049, 664208, 554651, 447838, 402892, 391701, 382879, 364452, 342947, 337657, 403944, 491311, 557609, 519406, 455708, 418421, 418320, 473212, 555613, 653087, 660484, 557892, 441367, 334958, 250419, 238252, 227664, 185927]
17826A85927j0515K7049L7760M1714R770O7294J15744J73844J44139P0987K8433
17815H92146n9779j41601j40215j21498q8043l2610k6675m3055k1637k690M6371
17804B60714Q5807J18533L3846n8759r1191p6138l7808j8671o407k0146L481j1715
17792A81546k7322l291J0788m2515j9623K2254K7441j2231m5734k4939R402J8960
17780I4736m925J653J2995r30m005K1052L1393L7481O006m0057j8188k3906l1450
17767H1855j8784j2367K2977J3361J9068J2519j7957n782j2998n107k1622j3477
17755D1686l4293j1842J3003Q64L684J5108M582L225J2978J2995K91P277K462
17742G2020q072k549M459l28k1498k1636J7617k0884o404M9442K5012k666j1297
$$ y = [185927, 175412, 202461, 240221, 281935, 291705, 358999, 474743, 648587, 792726, 863713, 892146, 832367, 690766, 550551, 429053, 341010, 308400, 281725, 238670, 217033, 214343, 260714, 346521, 465054, 498900, 440141, 348950, 272812, 235004, 216333, 209926, 189780, 193261, 181546, 154224, 150933, 161721, 119206, 99583, 121837, 149278, 137047, 91313, 66374, 75776, 94736, 89811, 91464, 104459, 103529, 99524, 120576, 151969, 189450, 195456, 155399, 137211, 113305, 81855, 63071, 50704, 73681, 87042, 106110, 118629, 100672, 94890, 81892, 76785, 55163, 41686, 7393, -4449, 8554, 9418, 13102, 28210, 32792, 36017, 48995, 61990, 62281, 69558, 72020, 63948, 61399, 65858, 65530, 44032, 22396, 40013, 19129, 12725, 62167, 87179, 84513, 73216]
17729G3216M16R203k0876j3371j618j6511L384n39J3478L5142l2276j3117q5j4864
17715B1582r762k2076j0679K7271j3967N249J0131r461J7605M949j2416J2550
17703B0976k2376l2213N043M5898L4055k57k5505l2420J2691J1553J8799K0176
17691E6420J1076k6498j0027j5127N195q408p960M330j3969j0927J1989q531n895
17678a8332j5580n338l681K3949L0062K6028J7159l2299j6992Q801O550M118J3289
17665C7734J2672q164O305J3125j9245k6122K254k2670n856K9323R169j0532k8636
17652a0643j5417K9743J4526j913k960J7067k6615J0510K4290p925k7350k3571
17640b0258J4090J8972K1682k0227J4948n085j0365K1725K5722M3431k7783m4366
$$ y = [73216, 73632, 82835, 61959, 48588, 46970, 30459, 33843, 33304, 46782, 81924, 49648, 36531, 36446, 21582, 11820, -10256, -20935, 6336, -7631, -2382, 7749, -1712, 15893, 20842, 8426, 20976, -1400, -33613, -28570, 17328, 51383, 51126, 25621, -6799, 5892, 17445, 36244, 56420, 67496, 40998, 30971, 15844, 21039, 12631, 4671, 9001, -4968, -15895, -3906, -12437, -18332, -33912, -39250, -42931, -18982, 11080, 37108, 54267, 21968, 4976, 13777, 20327, 24445, 37734, 50406, 42242, 48547, 61672, 42427, 16305, 18559, -4111, -9967, 19356, 28525, 17993, -10643, -26060, 3683, 18209, 16296, 13336, 30403, 3788, 14298, 38588, 30663, 3313, -20258, -6168, 12804, 34486, 14259, 29207, 24122, 13757, 35482, 61204, 104635, 76852, 32486]
17628C2486j3673j1957r491l680p57J6385R378J1430J5660N1068l448l5801l1397
17615B6203l1704k0576j0648K3502L1529R651o296j273j9609R257Q486j0587j8958
17602a1023J0166K7275N1K677k9388O229J1943m280K621N472k8655L353P08j2415
17588a5266k45J9250P049j506k5766p223J8819O351R90j7637L8754J6535J8322
17575E8427J2143K552j7284Q492p363O10N644j1300j5276j4436k4191K699J8530
17562A9247K8821j8r243l5156o700j7759J9792J1429l2346l739K4901K3736K1315
17549D4280j3362P847L0723L3635K7339N3854Q0195J00189J39812K2305r0764
17538D36053j13579o9083m3824o6286m0953k0504l460J0479j7709j467j6829O36
$$ y = [32486, 18813, 6856, -2635, -6315, -7072, 9313, 18691, 30121, 45781, 96849, 93401, 57600, 26203, -5501, -26077, -36725, -13223, 18306, 27957, 21661, 20388, 779, 10036, 18522, 7935, -11023, -857, 26418, 26469, 29146, -242, 5987, 17930, 13650, 16271, 21743, -6912, -3559, -2851, -15266, -15511, 3739, 10788, 9282, -16484, -23707, -4888, 1463, 2453, -15184, 23570, 40105, 58427, 70570, 73122, 55838, 64330, 56967, 57577, 63221, 51921, 36645, 22209, -1982, 717, 19247, 48068, 48050, 38807, 3651, -3049, -20808, -1016, 10413, -21933, -25672, -771, 22965, 44280, 30918, 38765, 69488, 103123, 130462, 184316, 264511, 364700, 504512, 526817, 436053, 322474, 253391, 209567, 143281, 102328, 81824, 78364, 88843, 71134, 69667, 52838, 53474]
17526E3474M1025L8184J3009K1763M2767O2699O3665K2563k0803k5548R806N5122
17514C77726J16575J14211J52124J90873J86958k460j63930j84155j07277j07212
17504E73433j10926q3069m0262J3651L3394M7603k4456p6717o4829m4341n9074
17493A64407k4531k9994k4301j2761k483n31J5080Q589J0964J9011L0646M4574
17481A98670P6705J13451P6378k1064j22496j18084p7371k596J8381L2083O3986
17470B38043N7434L296l8039n4615q460K1644K8272M9295j9835n0086n9944l0704
17458A36301K1516N1683K7079m646l9393k9066k2706J6070N6841J4202j6887j5162
17446A95832l7586k8563L4030N5905J11694N1030q4635j23872p8173p991n124
$$ y = [53474, 94499, 132683, 145692, 167455, 210222, 272921, 336586, 359149, 338346, 312798, 322604, 377726, 494301, 608512, 760636, 951509, 1138467, 1136007, 972077, 787922, 680645, 573433, 462507, 379438, 339176, 352827, 386221, 433824, 409368, 332651, 267822, 223481, 164407, 139876, 109882, 85581, 72820, 70337, 69806, 84886, 93475, 104439, 123450, 154096, 198670, 275375, 388826, 465204, 444140, 321644, 203560, 126189, 123593, 141974, 174057, 238043, 295477, 298773, 260734, 206119, 197659, 219303, 247575, 296870, 277035, 226949, 167005, 136301, 157817, 209500, 236579, 231933, 192540, 163474, 140768, 156838, 213679, 227881, 210994, 195832, 158246, 129683, 163713, 219618, 331312, 382342, 297707, 173835, 95662, 87671, 82547]
17435H2547l584q475o067l4874j2235j4318j535K3714J4816j2851j2619P916q584
17422A3851p807j485l120K1481L3895K4253j3936j0141m4486P040J5718k8066
17410G197k3559N175Q311P097J6941m707l1261o131N284P27K5289K1720J3396
17397D5479j764n474K805K5255k7035j8776l8556j4130J1309Q622J592R835o604
17384g442P820Q155j2268n354J286J0637L028J1707j3060M67j9449r246q551j0406
17370d2676j7261L758K5853K1336j1016m8396J1491K7947j1157K816J0063p15
17358b7957N694J3305L3953K389l0685p077l0919L993K3122J0996L5915K0902
17346E3631k4703k3018O981J6549j7845k6169j4024l8127O879J0630J7437J2450
$$ y = [82547, 78963, 70488, 64421, 29547, 17312, 2994, 1459, 25173, 39989, 27138, 14519, 22435, 13851, 6044, 4559, 1439, 22920, 56815, 81068, 67132, 56991, 12505, 19545, 35263, 7197, -16362, -11187, -2876, 4221, 21162, 16455, -14806, -20937, -15653, -14926, 10363, 32083, 45479, 43715, 38241, 41046, 66301, 39266, 20490, -18066, -32196, -20887, -12265, -10673, -838, -7442, 378, 8533, -3735, -9089, -7803, 2834, 5862, 17569, 4509, 4976, -14473, -23719, -32270, -42676, -59937, -56179, -30326, -8990, -20006, -68402, -56911, -28964, -40121, -37305, -27242, -27957, -22263, -8958, 24995, 27384, -3301, -10378, -41297, -37304, -14182, -3186, 32729, 53631, 28928, 5910, 12891, 29440, 11595, -14574, -28598, -66725, -59846, -49216, -31779, -19329]
17334a9329j088L4074N074J0256n54j7176j0467K3574J72J1436j4791p577j6637
17321c033L401J8295q206p048k882j3100j7585k3383K2457J3740j7996J8086j1494
17308b8748k8929K8112K3501j583m5336m006j298K5961J2903K5469Q93j3382L860
17295b583L1241N00M779O18p202M099j0984k3L3252p057j7850j162Q898k0068
17281A6458k2666N175L177P048J640J2944L208j1309n968j6721n348J0455L779
17268A872R270J0551K846k9665R924J9813J327p858k6268j8277R914N252J428
17255i871J2545j0876K281N392n776M625J4668J2044p746J6746N385m855k3319
17242A1243p876j1533m537m767L3990Q537J0783j4924j7715p89Q209J0236p54
$$ y = [-19329, -20417, 13657, 18731, 28987, 28433, 11257, 790, 24364, 24536, 35972, 21181, 13604, -3033, 368, 18663, 10457, 3409, 527, -12573, -30158, -53541, -31084, -17344, -35340, -17254, -28748, -57677, -29565, -6064, -7647, -52983, -56989, -58287, -32326, -19423, 6046, 6939, -6443, -2583, 28658, 29158, 33937, 34555, 27353, 31452, 20468, 20445, 53697, 46640, 28790, 27628, 36526, 16458, -6208, -1033, 2144, 9192, 10832, 23776, 26984, 15675, 9707, -7014, -12362, -1907, 1872, 11142, 21693, 24539, -5126, 4798, 24611, 25938, 18080, -8188, -26465, -16551, -11299, -9871, 2674, -8202, -5921, -529, -6305, -1680, 12988, 25032, 17286, 34032, 39417, 34562, 11243, 3367, -8166, -12703, -17470, 16520, 25057, 35840, 20916, 3201, 2412, 10621, 20857, 20103]
17229B0103ok7792Q61J5157L3715K998p472K654p762l766m976k1801R82M4879
17215D7774P682m8693m1601J3522M0841L239n081J7051J8986Q851k1098j4850
17203B6623o239l814M233N802q510k2314j2846K2368J1385m0159P085j434k0286
17190c8106p790J1378J2379J5879P096r361J8713j8289j1499m039J5743k1207
17178b9103Q688J1543J8965R355J1114L539j5655l2569k9022k0535K6820P487
17166b9373n730K2411J9790J7795J645j6410M518J638q479j5927k5414m334L76
17153c7494Q7N800Q957K1143l385J062J4218k7293J8499j001k8325J0655J2444
17140d633n386N975k674M774O369j4987j5387N888P207k019k8551k9989L3628
$$ y = [20103, 20097, -7695, -6834, 8323, 42038, 45036, 37564, 40218, 32456, 28690, 23714, 1913, 2895, 47774, 55456, 6763, -34838, -21316, 19525, 22764, 17683, 34734, 53720, 62571, 41473, 26623, 20384, 16570, 20803, 26605, 18095, -4219, -17065, 5303, 16688, -23471, -16386, -17820, -38106, -45896, -34518, -22139, -6260, 836, -8525, 10188, -8101, -19600, -23639, -7896, -29103, -20415, -8872, 10093, 19448, 30562, 34101, 18446, -14123, -43145, -63680, -36860, -29373, -35103, -12692, 7098, 24893, 26538, 10128, 14646, 16284, 7805, -8122, -33536, -37870, -37494, -37407, -31607, -22650, -1507, -4892, -3830, 10388, -16905, 1594, 593, -27732, -17077, -4633, -10019, -4044, -6718, -1944, 4425, -10562, -25949, -20061, -12854, -14873, -43424, -73413, -39785]
17127c9785N3420K8127k2429k2432l0625O695L9497J7684p876k7189n275J2120
17115A932J8212J8552k0648r696m471K44L255J1275J8751j1229j2979m028j2794
17102c624N77P712l276k6639j5130K4281K0076R870k1234k4361n359p979J3272
17089c1814J1059J5268r59j9127j1545J1182J3268j5m362J5455o134R474j643
17076A07j3864j974N331l8980J054K6259J4571j2193k9684j5229J0048J8460J2483
17063b3611o472R898j4427M963J3340R451Q045K8641J8334k0794J09J4618l1722
17050A0373n308m058R157j3024j1184O905J4247J3592l0753j6470j3523j3574
17038e3620K9141K707j5408j1512J626o143l38Q801n047R659j558K9320J8488
$$ y = [-39785, 13635, 41762, 19333, -3099, -33724, -27029, 12468, 30152, 22276, -4913, -10188, 1932, 20144, 38696, 18048, 8352, 3881, 4125, 7380, 18655, 37406, 26177, 13198, 9170, -3624, -3047, 4665, 1389, -25250, -40380, -16099, 3977, 13847, -7387, -31748, -37107, -45086, -31814, -20755, -5487, -6446, -25573, -37118, -25936, -12668, -12683, -17045, -1590, -7724, 1750, 107, -13757, -15731, -10400, -49380, -48326, -22067, -7496, -19689, -49373, -64602, -54554, -36094, -23611, -30083, -20185, -34612, -29649, -16309, -6858, 1187, 29828, 48162, 27368, 27477, 42095, 10373, 5065, 1007, 10164, -2860, -14044, -7139, 7108, 20700, -10053, -26523, -40046, -53620, -24479, -21772, -37180, -48692, -47066, -53209, -53547, -44746, -49793, -40134, -41692, -12372, 6116]
17025F116j9309q559p495J0087R211m482o763L9252l223l6353k4383J7765k063
17012c0199R815j5969k7173J5095L8836Q045m421K9952q86j0403j8234l5550J475
16999c9617R933j2928j9873j6604J876R42J4966O6292m76R189J4320m387l1342
16986g709j1298J5219q728j1083m169K263j9431J0136L9118J0475j798N604K5132
16973D3731k2870j0760n832K0371P66q277l4821l2j0641K3912r931o2568J469
16960g5483L4633M352P346L3641J9506k4170q993m227m51K1982K3636K1771J3610
16947F7153j2739k2706p051j5774j1911J0331l3667p556K2006J9993k030k3281
16935a7232l667J7246J2275k0634k6646m267J7200l857O365K1398R348J453j9949
$$ y = [6116, -13193, -21752, -29247, -19160, -9949, -14431, -21194, 18058, 14835, -21518, -45901, -28136, -30199, -20384, -36353, -63526, -48431, -9595, -1550, -5971, 23981, 23095, 12692, -5542, -41092, -39617, -29684, -42612, -62485, -79089, -77213, -76271, -61305, 4987, 4511, 13700, 28020, 23633, -7709, -19007, -3788, -12516, -23599, -27768, -25505, -44936, -34800, 4318, 14793, 12995, 18599, 43731, 20861, 10101, 4269, 24640, 25406, 17129, -17692, -17724, -28365, -4453, -14384, -76952, -75483, -40850, -36498, -29152, 4489, 23995, -175, -9168, -13395, -13846, 8136, 31772, 53543, 67153, 54414, 31708, 24657, 8883, -3028, 7303, -26364, -33920, -11914, 8079, 6049, -17232, -20899, -3653, 8622, -12012, -38658, -42925, -25725, -29582, -23217, -1819, 7529, 8982, -10967]
16922a0967k0963L527r307K9669K3364p672r502j1726j1812r002M118k0024j9494
16909f9791L9739j1708j0904J4854L0172J3491l229k2993N774K3683l3488J7980
16897f420J645O576o517J188j1760j946K1616j4065k1383O233J0507L2828j0452
16884H050l8655r379J2580J0884k296J2264M60j4326K0161j601K5099n144k5334
16871g237m9943k8067K2497M3171P926J5799m79j1325J8250K177m929r034k1843
16858b3037j0653L6574K7777j1333j3854n929j6997k2402N431J5059o982K224
16846b4122k680j221J2506k6089k1072J0224K3457N597K6211J8132j2015j8991
16834a0063j5808J3349Q935j2389L177J2285J5375m570r807q137O653K3516K8970
$$ y = [-10967, -31930, -28403, -37710, -8041, 15323, 7651, -1851, -13577, -25389, -34391, -30273, -50297, -69791, -30052, -41760, -52664, -37810, -7638, 5853, 2624, -20369, -14595, 9088, -24400, -6420, -4775, 1801, -4716, -3528, -15288, -17234, 4382, -9683, -31066, -24833, -14326, 18502, 8050, -30605, -39984, -27404, -16520, -18816, -6552, -6092, -20418, -257, -1858, 23241, 18097, -7237, -57180, -85247, -62750, -19579, -11653, 4146, 3667, -7658, 10592, 12769, 7840, -1194, -23037, -33690, 2884, 30661, 19328, 5474, -455, -17452, -39854, -34423, -19364, -26346, -24122, -26802, -28023, -15517, -41606, -62678, -52454, -28997, -23400, 2811, 20943, 8928, -10063, -25871, -12522, -3587, -15976, -12799, -514, 14861, 10291, 484, -7653, -1000, 22516, 51486]
16821E1486j1205k4417q397k9064j649J8934l208l1132j5322N911J1167K2638
16809a4258O598j1837n653o324J2291K1671j5622k4068j209n056K0804L2663K3487
16796C3487o512k0578j4854k3857n041J5686K8940j2814l4269m552J7027K5888
16784a449L010J284L2596J0607l5043m0406j3185K1881k912J3804O528j0459M579
16771i165L620K962l98l181J5328J0753k1788L636k0041J5551J9560p181j2271
16758b615m022k5815l9962J9690K3937K4790L574R860L0602j146j373j0056Q799
16745C6263J4607j0682l0699j707j1019L665Q981J3226k0157j1885K9382L380
16733B3355q121j9818q478J0770q773R442K7371l3632j9673N61J7967K0048O51
$$ y = [51486, 40281, 15864, 7467, -21597, -23246, -4312, -7520, -38652, -53974, -48063, -36896, -14258, -7660, -19497, -25150, -31474, -19183, 2488, -13134, -37202, -38411, -43467, -22663, 10000, 33487, 26975, 6397, -8457, -32314, -37355, -21669, 7271, -5543, -39812, -44364, -27337, -1449, 1561, 2845, 35441, 46048, 11005, -29401, -42586, -20705, -23617, -9813, -3285, -13744, -9165, -5545, -2583, -2981, -6162, 9166, 19919, -1869, 1767, -18274, -2723, 16837, 9656, -2615, -6637, -32452, -72414, -52724, -28787, -3997, -423, 9437, 40039, 38893, 37520, 27464, 36263, 50870, 40188, 9489, 7782, -3237, 428, 9409, 22635, 2478, -9407, 19975, 23355, 15234, -4584, -13062, -2292, -11065, -1623, 25748, -7884, -27557, -26996, -9029, 11019, 11670]
16720A1670k0218j0692J7519l011l552O791J2067J1441N101l92m395o16j0670
16707A1043o688j3289l94J243o998L904K1185l478M418K4433j6166k1958J307
16694a438J3494j0762r52J873n336K316Q008n708j3973N79j5637k8227J5542J4302
16680b5919K517J5682M283K4137K4871j4253j1390M51r024j5822l555N758J2250
16667I986n772J0627j336j0025k4132j7674l0J9186o243L406L1556K6646N137
16654D1332j9942j0137k370l415l1210K2267L9693j8491j5410j4401J1338n137
16642e883J209O295k1520j6952K7700M3151l758m6174l7224L1240J4041J976j3515
16629a9414k1774q052L0173K3566j6669j583j4132j8594M3579K1166j434j4738
$$ y = [11670, -8548, -19240, -1721, -4732, -8284, -1493, 10574, 22015, 27116, 26724, 22329, 21713, 11043, 4355, -8934, -9328, -8085, -15083, -11179, 10006, 6528, 10946, 35379, 19213, -2745, -1438, 12056, 1294, 342, 2215, -3121, -805, 7203, 1495, -12478, -11899, -27536, -55763, -40221, -25919, -23402, -7720, -3437, 20700, 45571, 31318, 19928, 20379, 11355, -4467, -8022, -2264, 9986, 4214, 14841, 13505, 3480, -20652, -38326, -38356, -19170, -25413, -22007, 9549, 36195, 41332, 21390, 11253, 8883, 5468, -25742, -3475, 36218, 17727, 2317, -12084, -746, -5883, -4674, 1621, -19899, -36851, -9151, 34000, 30242, -15932, -53156, -21916, -7875, -5899, -19414, -41188, -49240, -19067, 4499, -12170, -13753, -27885, -46479, -2900, 18266, 16832, 2094]
16617B094J042j2077m920J5533j92N8r071k114M1923L7492l6047j6755j21J4911
16603C1756J2303r602p676J190j1615l531M478O817J0023L0875K0213k2087p994
16590E5150k9074j603K6163p267j7093l4296J7894M3672M511m2506k8796k5053
16578c8298L3068J7605J7738q090j6656L806j5223N009k114Q310O459J5942r254
16565A8302k6887l7379r654J7577J0448J4188R07J0422r781m130L0306J4482j9876
16552H925m8636k5585L1298M2894K5584J2279n333j0666k6127r774l38n456J1380
16539D45P072J6272j586l0065j0191K2158J552o115m215k2376R90J9203K6984
16526B0128J7731p40k1387m0349j542j0215R553J5730k0721J6818p40r347o162
$$ y = [2094, 3136, -8941, -13861, 1672, 1480, 1538, -7533, -9647, 32276, 69768, 33721, 16966, 16845, 31756, 44059, 34457, 26781, 27971, 16356, 12825, 17303, 24120, 34143, 65018, 85231, 63144, 55150, 26076, 24473, 50636, 43369, 26276, -8020, 9874, 53546, 58057, 15551, -13245, -38298, -5230, 12375, 30113, 22023, 5367, 9173, -6050, -1041, -3155, 5155, 11614, 27556, 18302, -8585, -45964, -55618, -38041, -27593, -13405, -12498, -2076, -11857, -15987, 14319, 28801, 8925, -39711, -65296, -33998, 8896, 34480, 46759, 41426, 30760, 4633, -5141, -5479, -10935, 445, 7517, 23789, 22203, -7862, -18053, 4105, 5657, -458, -4673, -27049, -26059, -6856, 20128, 37859, 37119, 15732, -24617, -26159, -36374, -26821, -11091, -31812, -14994, -15734, -25081, -31243]
16513c1243K12M6615p437K870N098l877Q333K3180n325k269j8719l418L0968R207
16499E4195j8643j6206M419M504r080L682j0798l719N205J3046N702o2O342j2626
16485B5961p954J2653j4248j5083n117n478k4124J3095l03J0630J0406k453J0217
16472H202J9412l1169j7321j2152M42j5338r059M0880K6693J3040k6539k6437
16460b9346J2979r000L586J8383K5808N331j0231j2350j6492k3159r515J1473
16448c2533J913J764q810k349M434K7409N3P982J0048N534j9453n965j4346K4993
16434F74L6297k8650l3350k2514J8279L2309R552m280k4177J292R068m267J1129
16421A362P688k1475J1633K0113q028k2533M0857K4464n389r114j3746r289J1174
$$ y = [-31243, -31031, 15584, 8147, 11017, 16115, 12238, 20571, 43751, 38426, 36157, 17438, 14020, 44988, 54195, 35552, 19346, 23765, 28269, 19189, 22871, 12073, 8354, 13559, 26605, 32307, 32245, 38587, 25961, 18007, 30660, 16412, 1329, -3788, -9266, -33390, -20295, -20598, -9968, 438, -2015, 8202, 27614, -3555, -20876, -33028, -32586, -47924, -56983, -16103, 10590, 23630, -2909, -29346, -16367, -25367, -21781, -3398, 22410, 27741, 17510, 5160, -11332, -34491, -44006, -32533, -30620, -28856, -37666, -40015, -35581, -8172, -8119, -137, 9911, 15445, -4008, -9973, -24319, 674, 36971, 8321, -25029, -47543, -29264, 3045, 12597, 8317, -15860, -14568, -5500, -9767, 1362, 9050, -12425, -792, 19321, 11293, -11240, 29617, 54081, 48692, 39578, 25832, 16543, 27717]
16408B7717J7995k9026j9855O721J0674L5612j8367N88J731j5988j8515O182j5319
16395i850K611q51M474J017N504M439O358J6636j2114p035m618L3974J7719j6554
16381D1710n8189m2659Q662J1868P598M194O97q422J6997l2577o855K3667J8859
16368a4450M2270j8771j3943j1529p404R45L7181J2965k0147j1225N635l8789
16356c7262J6404K1237o734K6476J1017k0655q386j0699m497l2863o453K4809
16344b7606r747q420q175L697K1647J7849K4688m412m2472k508M300m473q231
16331d3863J3069L6957l5560k2352O534Q491K0275K6029P909j3937m165J705r672
16318h580J609o743j0141N696L5878k706j3854K192o6j5158J95K3893J6817k317
$$ y = [27717, 45712, 16686, -3169, 3552, 14226, 49838, 31471, 32059, 33790, 17802, -713, 5469, -9850, -7239, -8090, -3616, -2599, 2905, 7344, 13702, 30338, 18224, 11189, 6571, 40545, 58264, 41710, -16479, -59138, -50476, -38608, -31010, -26816, -26119, -34541, -17544, -50121, -56976, -33309, -14450, 27820, 9049, -4894, -16423, -23827, -22882, 14299, 27264, 7117, -4108, 1527, -37262, -20858, 379, -6355, 20121, 31138, 10483, 2097, -8602, -13099, -45962, -52415, -27606, -37353, -45773, -53948, -50251, -28604, -10755, 13933, 9521, -32951, -35459, -31159, -35632, -43863, -30794, 6163, -29397, -51749, -45215, -36724, -16449, 9580, 17489, 3552, -613, 1092, -8580, -6971, -13714, -23855, -18159, 17719, 15013, 1159, 3351, 3285, -11873, -11678, 12215, 29032, 26715]
16304B6715R330O618m2076l4191K219J7115J2321K600J5983O199o79K978j0613
16291A4519k1075j2009m671j4192J9578J0320M297j7325j2834K2090O206l944
16279i040M70r621j9876K9058L8373q540j8572n73p825J707O377k5299P3R470
16265a3818q22L5398J0907m3394r576J7420N489j863L6553J9842J0883j1435k9939
16252B5645j1684q833J5010J7192J2118r57j956m0624n7208k1839J1239l401j408
16239f6706J5882J8977k770J5288N667j2196L987J9227j3901j8580J5405J3296
16227f424K3308L4080R613l0141k6419M887J955q038k004k4716m734J154J8681
16214h798K2260m726j7292n355k988q310J3663j875o69k1081k160K7613J231p54
$$ y = [26715, 36045, 42663, 587, -33604, -31385, -14270, -1949, 651, 16634, 22833, 22154, 25132, 14519, -6556, -18565, -23236, -37428, -17850, -7530, -3233, -20558, -33392, -11302, -5096, -9040, -8570, -18191, -38067, -9009, 29364, 20824, 2252, 1679, -6146, -4439, 1938, -23361, -23288, -13818, -14640, 20758, 31665, -11729, -21305, -3885, 1604, -259, 36294, 56136, 67019, 55584, 25645, 13961, 5128, 20138, 37330, 49448, 48491, 46535, 5911, -51297, -73136, -61897, -65298, -66706, -50824, -31847, -34617, -19329, -13662, -25858, -21871, -2644, -16545, -35125, -19720, -6424, 16884, 50964, 60577, 30436, 4017, 8904, 10859, 2821, 817, -23899, -28633, -27479, -8798, 13462, 8736, -8556, -13911, -16899, -25209, -11546, -13421, -14090, -35171, -37331, -9718, -8487, -9241]
16200i241J8621J7735L647o858q593K216K4665o823l5008O399J8560j9791p074
16187a545J2502n455p346N757n546O240r487r395j883K781J4405j6818Q630J9053
16173A1893q795l8843R351j0224j3277J7392M662O444K0812j0323k1225N590M615
16160b1928j9924J0492K5788J6003j5082m6046J8199J7546K9664p47l8371j9424
16148d3830K664M0199j009O265j1398j3089l706j8378j9712O689K1730M977M929
16135b3669j1847J9703L2728L6214P34k1955l5998j335j533K822j980k0237K334
16122b4019J7016R423j3957j5377J1123K0263J6897r789o788r436j7379q035J1164
16109a8894J4372M572j1969J0209K5847p849j3272J2285o618j5613o530k9054
$$ y = [-9241, 9380, 27115, 30762, 23904, 15311, 17527, 42192, 35369, 361, 6760, 25320, 5529, -1545, 10957, 5502, -1844, 3913, -1633, 4607, -4880, -14275, -16158, -13377, 1028, -15790, -7160, 11893, 3098, -35745, -26394, -36618, -49895, -32503, -27841, -21397, -585, -10908, -32133, -26543, -21928, -41852, -31360, -5572, 10431, -4651, -50697, -32498, -14952, 14712, 13965, -24406, -43830, -41166, -967, -1976, 4289, -7109, -20198, -23904, -42282, -61994, -55305, -33575, -28598, -23669, -35516, -15813, 16915, 53129, 53863, 31908, -4090, -5425, -6958, -4136, -6116, -26353, -24019, -7003, 2420, -11537, -26914, -15791, 4472, 21369, 11580, 4792, -4644, -22023, -30058, -18894, -4522, 50, -11919, -1710, 24137, 16288, 3016, 15301, 8683, -6930, -13460, -42514]
16097d2514L1414K2809Q928j6023K03J8278R78J9022n696p068k7898q340K1851
16084A5944K2805j1777l328k5035O583k6012J2277K9172j7837J730K3441j8626
16072I337q153K4987R020O621j754J505K1630K1666o217j9246M343J9597o944
16059G6392j7206k5346n553o796J4062k0893j7616J2576J914k529j8620r960j9021
16046c8596K4695J7703k137J660Q021l752j9559k9386L18p938J8550J7723j464
16033a4162k815J0789j4249R348L1634k6843j1931P392o689L764J8196j7696k9437
16020d2699J0016K8881L278k1211K919J2201M742L3372J3290l1691k4278j1572
16008b2752J19q909K0600K3973j578j5466Q622m391J3104J0160l600L09o982k4573
$$ y = [-42514, -11100, 11709, 20637, 4614, 4817, 23095, 24073, 43095, 37399, 30331, 2433, -5907, 15944, 38749, 26972, 23644, -1391, 5192, -20820, -8543, 20629, 2792, 4522, 27963, 9337, 1184, 26171, 35191, 41812, 40058, 41563, 63193, 84859, 78642, 59396, 63739, 83336, 76392, 59186, 33840, 28287, 21491, 35553, 14660, -2956, 9620, 11534, 9005, -9615, -19575, -38596, -13901, 3802, 1665, 3325, 11346, 7594, -11965, -41351, -41033, -48971, -30421, -12698, -14162, -16977, -6188, -20437, -11089, 20545, -6298, -18229, -10837, -17526, -13762, 4434, -13262, -42699, -32683, -3802, -524, -21735, -18816, -6615, -1873, 31499, 44789, 13098, -11180, -22752, -22633, -31542, -10942, 13031, 11453, -4013, 4609, 218, 13322, 23482, 19882, 20191, 13209, -11364]
15994a1364J06K1582R832j2741k152l0823K034J7941K461r025m080o506K1214
15981a521L2697l3517k3102n148j0158O291j5783j702M494l222J2862N426p894
15968d0277m119O701L2483L9169L0834l1175j3032k1658j111K444L030K485k196
15955C578j4366j2108j7930j761j7492N4426K5313k7348j3875N459J3184j0613
15943a3533l9559k16L1152L7506M595j0016j6996J9448Q709J791p385l56J6807
15930C1947J6354p902j8308j0010L648l691J2707k5763O54M283K919K514j4810
15917e458p36J3215o445j5199j300j4460K3608K0241l1051k5464K4598n23J7858
15904a116p225q259k2453J4128P73L814J0805j2875l7312j5763N976L0418L707
$$ y = [-11364, -11258, 10324, 20156, 7415, 5263, -25560, -23526, -5585, -3124, -12149, -16229, -22735, -1521, 31176, -2341, -25443, -30591, -40749, -34458, -50241, -51943, -47449, -50671, -37809, -32383, -40277, -44396, -37695, -5212, 33957, 64791, 33616, 20584, -1074, -2185, 259, 3289, 5774, 3578, -10788, -22896, -40826, -42587, -60079, -5653, 19660, -7688, -21563, -16104, -2920, -13533, -53092, -53308, -22156, 15350, 19945, 9929, -7067, 12381, 21090, 22881, 15496, 15140, 31947, 48301, 40399, 22091, 12081, 15729, 12038, 24745, -1018, -364, 3919, 6838, 9352, -5458, -6194, 7021, 576, -14623, -15923, -30383, -6775, 13466, -17585, -43049, -18451, -18974, -1116, -8341, -16600, -39053, -24925, -24152, -20338, -9533, -22408, -59720, -75483, -69507, -39089, -35382]
15891c5382J0601o829j6043J8105K865k2855m076J75j4557J6240L1899L035J5185
15878a637J2577Q98R220n30R423j4673R513m172j5421j6543j9493R696K9317J3252
15864B1427j4084k5390J242P393j4227J6625J4433j373Q353K3042k9912M409l406
15851H532l258j9151k2744l905J0913r203j1569R599J2392K4103J4787N325Q97
15838A6718l3636o238L420K935P597M284L0189Q637q654J4117R907J0188r134
15825E0330j1339l2103P381N430j2773k852j1547N3K3432K3245j6901k6042j5838
15812a9524k7194J590K4278k1496J096K1469J6590L828m431j2611l8890p929K3835
15799c9389M8689Q73k8302k1309o327n991k4385J4914L3481j4288J2953J6892
$$ y = [-35382, -24781, -31610, -47653, -29548, -26683, -49538, -53614, -53439, -67996, -51756, -19857, -16822, -1637, 10940, 11838, 21058, 20528, 29951, 15278, 24791, 20619, 5198, -11345, -30838, -21142, 8175, 21427, 7343, -18047, -16805, -9412, -23639, -7014, 7419, 6046, 14399, 37441, 7529, 11938, 8532, 5274, -13877, -36621, -40526, -29613, -38816, -50385, -40786, -28394, -4291, 10496, 15821, 16718, -16918, -23156, -19736, -16801, -9204, -4920, 25269, 33906, 25252, 39369, 49276, 59464, 50330, 38991, 6888, 14269, 19699, 6926, 4074, -7473, -7420, 16012, 39257, 22356, -3686, -19524, -46718, -45128, -20850, -42346, -41250, -19781, -3191, 637, -3794, -16405, -55295, -63224, -39389, 9300, 10173, -18129, -39438, -45765, -51756, -76141, -61227, -27746, -42034, -29081, -12189]
15787a2189j5822J5358J1927K7410K5776J081l6330O786l522j8541n121k587Q482
15774B708p837M695P188J6170o189k4132o976M694J7777K1494j3521k8938R134
15761c733J2328l4776L2600K5296k8179j8989J9310j9902j7472q418j0789L7843
15749a4881J8451j1872o699p810q349j5579M327P975J0455K3856k2863j4397K2166
15736a5220J5551P949K963J567l374K3948k3845M096k5307j499r200k977K7272
15723A924r387N627n755R059J5497m471K136k1593m425J1482m88Q902M274j76
15709A2606N570l3430Q454L8418o984K686j1841l3032P413O056n78M115L2962
15696C2415J5531j4867m2918J8573J6370Q144k1257j6865K2255K4519R138Pk4503
$$ y = [-12189, -28011, -12653, -726, 26684, 52460, 53541, 17211, 23997, 20475, 1934, -3187, -5774, 2708, -5129, -434, 6754, 22924, 16735, -7397, -14373, -9679, 8098, 29592, 16071, -12867, -3733, 8595, -26181, 6419, 31715, 3536, -15453, 3857, -16045, -33517, -41935, -52724, -14881, 3570, -8302, -15001, -22811, -31160, -46739, -42412, -34437, -23982, -126, -22989, -37386, -15220, 331, 8280, 11243, 12810, 9436, 33384, 9539, 13635, -11672, -13171, -22371, -25348, 1924, -7463, -1836, -7591, 1468, 16965, 12494, 14630, -6963, -11388, 94, -394, 8508, 12782, 12606, 18176, -15254, -6800, 31618, 24634, 27320, 15479, -17553, -10140, -4084, -4662, -547, 32415, 47946, 33079, -9839, 8734, 25104, 33248, 11991, -4874, 17381, 41900, 51038, 51045, 26542]
15683B6542j5053J3683j9510l942Q879L1086n003j2023j7807k9201L010j1654
15671c0993K074j1865J4386J1323m212N445J8336P475k3715m043M168j7755k156
15658c1532J285P136J6600j6689m411m5195N061L4502J2921M044n015R614N031
15645f648l0532k5560P380L719n288K6876K0296q043M606P30J5237Q57J0375K2568
15631C6573J0064J0150m944k3438j7682l67K4581j8562l1140l3240j3199J5293
15619d5911K2884K9112J0761M8j5479P108k1551m515L571j283n611j2805j374
15606c5045K9385J0767J4932l510k5987p553m136K0118j1557j1492n237P470l400
15593b5245P57J0400P695m825q278j9345J5688j1666l8559J6990O4160K2987k1807
$$ y = [26542, 11489, 25172, 5662, 1720, 10599, 41685, 36682, 24659, 6852, -22349, -19339, -30993, -28919, -40784, -26398, -15075, -19287, -13842, 4494, 11969, -11746, -15789, -11621, -29376, -31532, -30247, -23111, -6511, -23200, -27611, -72806, -67745, -33243, -20322, -16278, -21293, -11679, -6648, -37180, -62740, -55360, -51641, -56929, -30053, -9757, -17800, -13194, -12464, 2773, 3630, 14005, 36573, 46637, 56787, 51843, 28405, 10723, 10356, 34937, 16375, -14765, -48005, -61204, -45911, -23027, 6085, 16846, 16894, 1415, 8523, -13028, -17543, -13972, -15255, -20866, -33671, -35045, -5660, 5107, 20039, 16529, -9458, -17011, -21147, -1029, -12586, -24078, -29315, -21845, -25245, -24488, -14088, -6393, -11218, -19496, -38841, -23153, -34819, -73378, -56388, 7772, 30759, 8952]
15580H952l625l149o47K266m686j6160J3586l32k269n574j0104K0120m138j1996
15566a7756J3043J558k3624J860K2989J8830j686K0720K0225l3173q24L997k67
15553B5892k0025L784J5719n82K201l515n95j8429r261k2695Q344l795j0641N392
15539b8206R678j0862r750K0382K2941J3460j2335k0062K1325K0991j1341n2607
15527c6386j8682K3293K8578L7955k367j2571m495k6004R182K862j0679l2094
15515d1408j089K7306J9131K1669O155r904j0360k5459J0272L0863J7540J385
15503D6101o739k4230j5542P200M274k3066l6460p259L5814j1416l4674l75L7719
15490b8653L423M426J3931L627q35j7478J1123J3818p667N330L801k9636k1265
$$ y = [8952, 5327, 2178, 1531, 3797, -889, -17049, -3463, -3795, -6064, -11638, -21742, -1622, -5760, -17756, -4713, -3155, -26779, -24919, -1930, 16900, 15214, 35934, 56159, 22986, 22162, 26159, 25892, 5867, 9651, 25370, 24788, 26989, 23474, 22879, 4450, -4811, -27506, -19162, -22957, -33598, -28206, -18528, -29390, -39140, -18758, 4183, 17643, 5308, -14754, 6571, 27562, 16221, -36386, -55068, -31775, -3197, 34758, 32391, 19820, 15325, -10679, -1497, 1365, -9314, -41408, -42497, -15191, 3940, 25609, 31764, 21860, 11500, -13959, -3687, 27176, 44716, 46101, 39362, 15132, -410, 6790, 11064, -12002, -48462, -55721, -19907, -31323, -65997, -66372, -28653, -25230, -20804, -6873, -3246, -4081, -21559, -10436, 3382, -4285, 1045, 4846, -24790, -46055]
15477d6055k997J6496J2457J9342j0626l6416p112P146K7696L0954P393n465k7274
15464a4461l763J0919j4753j6906o24J1809M926P473J4477k671k7516j8545M463
15451d5172J0489j300J6245K573Q942k3421n864K1932K0142J0787J0883n66P307
15438C2977m299j5804j0744R723k4686j5598J8727L978k6530j6209N546J2746
15426c0173k1735K4349L4338k2509k7730j4518M864J4981J3465K5900L1397k016
15414C0613r992m999K474j1479j3550N765k119p739J5633Q981r280l5138J0297
15401b0533J8584k0829J4576K0896Q158l3283k6012J4731O567K4828k0317n928
15389a8562J7584k0779p687L8773L1524j3866j4892k6777k427O240j667j9376
$$ y = [-46055, -49052, -32556, -20099, -757, -11383, -47799, -54911, -47765, -20069, 10885, 18278, 12813, -14461, -18224, -7305, -22058, -38964, -39588, -27779, -22853, -15380, -903, -3574, -31090, -49635, -45172, -34683, -35983, -19738, -17165, -8223, -31644, -37508, -15576, 4566, 15353, 26236, 25670, 32977, 28678, 12874, 2130, 11853, -12833, -28431, -9704, -5726, -32256, -48465, -42919, -30173, -51908, -27559, 6779, -15730, -43460, -57978, -53114, -38133, -24668, 1232, 32629, 30613, 20621, 15622, 18096, 6617, -6933, -1168, -3287, -11026, 4607, 13588, 4308, -30830, -20533, -1949, -22778, -8202, 12694, 20852, -12431, -38443, -23712, -17145, 7683, -12634, -18562, -978, -21757, -29444, 9329, 40853, 26987, 12095, -14682, -17109, -10869, -12536, -31912]
15377c1912r495J8538J9761N655L468k3538j8478J5079j0386P537K1007R393O529
15364A3158N841j2959j1916n821J3545q0j188j3974J5300M0822K5414O697k5531
15351D9308k6849l2056M36R148j780j0868J6055J2806J0720J4185j9496l1084
15339i475K389J3740J8930L824M506M439o628j5724k131l275P782l1766l3505
15326d6894L1950N1422N191j8021r8J986j7278l7786Q689N741L760L905o622K442
15312a1613Q016K8669J8934j553j1334m0506n059K0420r682k2803K5015O779r016
15299c733J7605K999k6315N935R475N471j5431q550j8491k42m631j3586J7278
15286c2216n041K5690J9051Q573o915j3517J602J5593Q816L113j1498J5350n061
$$ y = [-31912, -41407, -22869, -3108, 2547, 6015, -17523, -36001, -20922, -31308, -23771, -2764, 6629, 13158, 18999, 6040, -5876, -11697, 1848, 1768, 580, -13394, 1906, 42728, 68142, 74839, 49308, 22459, -9597, -9161, -13, -1793, -12661, 3394, 16200, 26920, 41105, 21609, -9475, -7086, 6654, 25584, 29408, 33914, 38353, 31725, 16001, 13870, 10595, 18377, -13389, -46894, -14944, 36478, 41669, 23648, 23550, 25536, 8258, -29528, -20839, -15098, -11338, -7433, -14055, -11613, -3597, 25072, 44006, 42453, 31119, -9387, -14446, 5974, -3708, -26511, -1496, 5283, -3733, 13872, 16871, -9444, -3509, 5966, 11437, -3994, -12544, -31035, -31277, -35908, -49494, -32216, -37257, -11567, 7484, 16057, 9142, -4375, -2773, 12820, 21636, 24749, 13251, 28601, 23540]
15273B3540k3276o504k0095j900P147k384j3263q062q975j0871n98M574L7949
15260b2718K1307P977K665j5225k3016N904L185K06O014N012K63j5226M341L4657
15246A5346K493k4131j3194J2749J62M41Q152r104O15j237p209k214n13l474J6707
15231d411J160L562R759j4333k1633J2469R889q265j5562j8965J9092q96J7510
15218a0624K3820o413k4875O492J3323m412K657l881k1647J6169j1946L307K0453
15205B423m870J1814J9334j3373l7640k2138j8548K3491L2876q669K874P623J0662
15192E859n180n997L1028J68j0505j588r743k0187M863K8282k969l0219K5015
15179H827J5216r800N688j4607k3740J2719K3543O802l6186j1360J5718J8269
$$ y = [23540, 264, -6240, -26335, -28235, -21088, -23472, -36735, -44797, -53772, -64643, -65241, -60667, -22718, -1411, 6566, 9231, -5994, -29010, -23106, -19921, -19715, -13701, -8689, -8426, -23652, -19311, 15346, 17839, -6292, -19486, -6737, -6575, -6134, 2018, -7086, -6471, -7708, -14917, -17131, -17644, -21118, -4411, -3251, 311, 10070, -4263, -25896, -13427, -3538, -11803, -27365, -46330, -27238, -28134, -10624, 13196, 6783, -18092, -11600, 1723, -2689, -32, -3913, -25560, -9391, -21337, -18030, 2423, -2447, 9367, 28701, 15328, -22312, -44450, -62998, -39507, -6631, -15300, -12426, -4803, 5859, 679, -5318, 25710, 25878, 15373, 13785, 4042, -16145, -11282, 17000, 14031, -16188, 8827, 24043, 14243, 19931, 5324, -18416, -5697, 17846, 24648, -11538, -22898, -7180, 11089]
15167A1089N016k0633J0665q67L717J0667n776j77P332L18j0861k1396K8188O785
15153B4067P749K3393J2717k6884l5119k1822k0855K0013L180n339M938M964M767
15140d231J2145J5827Q017J713J2998j5808k8675l2269J1529k885J2677J7161
15128H199J934j0581M65j1454j510q158j6252L587p99J5043L4741P710q931j6840
15114b846j865j2864j634Q566J4251l836j1671J731j0681j0091K439q580L9749
15101B668K1403p336K830j34M716j9408J7075j9k0898K5141j3353k6976j2801
15088b7092J8651R072J6147K01J044N494J516L710p512j8529j20R970p437j1639
15074f524o047M046n557m305J2392R136p493j036J3611k5083l1114p325L3901
$$ y = [11089, 16105, -4528, 6137, 5270, 8987, 19654, 13878, 13701, 21033, 21351, 10490, -10906, 17282, 24067, 31816, 55209, 67926, 41042, 5923, -15899, -36754, -16741, -13561, -18900, -13962, -8998, -4231, 7914, 23741, 31758, 33471, 46469, 30661, 1986, -30283, -18754, -21639, -8962, 8199, 10133, -448, 17, -11437, -12947, -21105, -37357, -33770, -34569, -19526, 15215, 22925, 13994, -2846, -4711, -17575, -19209, -10643, 3608, -228, -11899, -10168, -20849, -30940, -28501, -37081, 2668, 24071, 16735, 19565, 19431, 24147, 4739, 21814, 21795, 897, 26038, 12685, -14291, -27092, -8441, 631, 16778, 16979, 18023, 23517, 25033, 28743, 21231, 2702, 2582, 12552, 5115, -6524, -12571, -8525, -14082, -18387, -5995, 3141, -4352, -5388, 8223, -16860, -47974, -55299, -21398]
15061b1398o371P201R445j44P137J4148K6562j1422j303M762J5537J7929K4518
15048H6601l1650k5193j553N504K980q702j9395k2242K684k903J9095J6756J4947
15035C6929J4163l5556j4789J867P553o046J820p231q147Q357M072q168j849j5733
15021b2758k5428J0606M224J2460r411k810q752J5259M2918j7298j5670J1649
15009e011P880J8K706Q362J501Q41p999j0401P705l925l935p362J3770O100K5301
14994C5551K4224J2262p042k9597l3363j8034k4465O384O319L8798K4564l351
14982C2250L605q526k6252k7248j985R529j070P344L490j6999J7590j5892k94
14969b4458K1282j0990m6135k7705L6647M0067L3537L994q210o072R131j9114
$$ y = [-21398, -27769, -20568, -11123, -11267, -4130, 10018, 36580, 25158, 23855, 28617, 44154, 62083, 86601, 54951, 29758, 28205, 33709, 36689, 27987, 8592, -13650, -10966, -13869, 5226, 21982, 36929, 51092, 15536, 747, 2614, 10167, 4121, 5941, -1290, -9437, -1080, 2992, -5176, -7025, -22758, -48186, -37580, -33356, -20896, -30307, -33117, -41869, -26610, 16308, -990, -16660, -5011, 2869, 2887, 5593, 13955, 15456, 16297, 8298, -2103, 5602, 1677, -2258, -9620, 4150, 10250, 35551, 59775, 72037, 64995, 35398, 2035, -15999, -40464, -34080, -27761, 11037, 35601, 32250, 35855, 27329, 1077, -26171, -28156, -18627, -19697, -12353, -8863, -25862, -8272, -24164, -24458, -3176, -14166, -60301, -88006, -51359, -11292, 22245, 26239, 18029, 11957, 21088, 1974]
14957A974l5490o635J4230J7368K2630j5736j6511M497q565j202j1029q79K5692
14944i656O612j6438Q85K6260J614j2172J2276K6569J0431l5301r002j1980j341
14931a1243J7647K4462j3907k6660r188r11J6096j0073n892j1499J911K7833l332
14918d756j541K510l503p115L190p069Q588j8200K1744j0166j2019r185J218J3005
14904b3299J7263o763J451P995K3021K128j9244J2801o228o61p308r804r473q351
14890b6472J235P447p42j4043J9082K4697j848k68J245k664J4876j8013K129J5394
14876B2055J533m055o596k357j348l2324Q168l665l756L0434J5553j6977k432
14863D233j2474m056P3p598Q476r724J1041L5983r843l0960R781Q598J6926K1881
$$ y = [1974, -33516, -40151, -25921, -8553, 14077, -1659, -18170, -13673, -22238, -23440, -34469, -35348, -9656, -3044, -19482, -18597, 7663, 9277, -2895, 9381, 35950, 46381, 11080, 2078, -9902, -11243, 6404, 30866, 16959, -9701, -18889, -19800, -3704, -13777, -19669, -31168, -29257, -1424, -4756, -6297, -3787, -7290, -14405, -11215, -18284, -9696, -27896, -6152, -16318, -28337, -37522, -36304, -23299, -6036, -12799, -11348, -3353, 19668, 21796, 2552, 15353, 9125, 8464, 1156, -8648, -18121, -26472, -25237, -17790, -18532, -32575, -13493, 11204, 9356, 9088, 10333, 7669, 22545, 4532, 6661, 22055, 23588, 19533, 12937, 10580, 9232, -23092, -14924, -18589, -22345, 8089, 23642, 6665, 4233, -8241, -12297, -12224, -19822, -11346, -21070, -10029, 25954, 16111, -14849, -5068, 3530, 20456, 42337]
14849D2337O764k7725m033K4649N784k147R136q715R88p708j6023J0754J0721
14836D4782j6626l8607n649K1162J7332o321j4739J3386l877O578R446m1066q513
14823b2712Q476N62J3220l52K0583L837l9618r604q148L0173K9304K23j7344k3118
14809a4518j0482M955L5057k6528j7006N72O236L425k7193J246K2298m437J1373
14796a5002J201P639M462j3542L2544J9095j5841n604j1970O207m063M634K4017
$$ y = [42337, 49101, 21376, 17343, 41992, 47776, 45629, 54765, 46050, 47038, 39330, 23307, 34061, 44782, 28156, -10451, -16100, 5062, 22394, 16073, 1334, 14720, 10843, 17421, 26867, -14199, -22712, -14236, -13674, -454, -806, 19777, 23614, -16004, -25608, -33756, -3583, 25721, 25944, 8600, -14518, -25000, -20045, 15012, -11516, -28522, -27950, -21714, -18289, -45482, -44236, -21938, -26375, -15002, -13801, -6162, -1700, -15242, 17302, 36397, 20556, 14952, 2982, 9189, 5126, 9760, 33777]
$$ [...]
##END NTUPLES=NMR SPECTRUM
##END=
