##TITLE=Analysis number 326623
Compound Code cc 56616
Book Reference 508/46
Project Code adrs
Chemist Name antons
##JCAMPDX= 6.0         $$ Bruker NMR JCAMP-DX V2.0
##DATA TYPE= NMR SPECTRUM
##DATA CLASS= NTUPLES
##ORIGIN= Bruker BioSpin GmbH
##OWNER= nmr
$$ XWIN-NMR		Version 3.5
$$ Thu Feb 15 13:16:09 2007 GMT Standard Time (UT+0h)  MAYBRIDGE\nmr@NMR_250MHZ
##.OBSERVE FREQUENCY= 250.131544655141
##.OBSERVE NUCLEUS= ^1H
##.ACQUISITION MODE= SIMULTANEOUS (DQD)
##.ACQUISITION SCHEME= undefined
##.AVERAGES= 16
##.DIGITISER RES= 18
##SPECTROMETER/DATA SYSTEM= dpx250
##.PULSE SEQUENCE= zg30
##.SOLVENT NAME= DMSO
##.SHIFT REFERENCE= (INTERNAL, DMSO, 0, 16.522)
##AUDIT TRAIL= $$ (NUMBER, WHEN, WHO, WHERE, WHAT)
$$ ##TITLE= Audit trail, XWIN-NMR		Version 3.5
$$ ##JCAMPDX= 5.01
$$ ##ORIGIN= Bruker BioSpin GmbH
$$ ##OWNER= nmr
$$ C:\u/data/dgb/nmr/ADRS/1010/pdata/1/auditp.txt
$$ ##AUDIT TRAIL=  $$ (NUMBER, WHEN, WHO, WHERE, WHAT)
(   1,<2007-02-15 13:15:50.68 +000>,<MAYBRIDGE\nmr>,<NMR_250MHZ>,
      <created by zg, POWCHK disabled, PULCHK disabled
       configuration hash MD5:
       49 4B E0 1D 92 C2 6B 37 9F E6 65 BC 52 41 86 1D
       data hash MD5: 64K
       0C 48 10 E7 35 85 E9 3E 51 24 6E C2 E3 0A A5 2F>)
(   2,<2007-02-15 13:16:01.79 +000>,<MAYBRIDGE\nmr>,<NMR_250MHZ>,
      <Start of raw data processing
       ef LB = 0.3 FT_mod = 6 PKNL = 1 SI = 32K 
       data hash MD5: 32K
       7A B3 CE CD 23 BE 27 D0 A4 0C 7E 98 A6 8F 16 E2>)
(   3,<2007-02-15 13:16:03.41 +000>,<MAYBRIDGE\nmr>,<NMR_250MHZ>,
      <apk 
       data hash MD5: 32K
       C6 37 85 B8 E0 94 8A DF E1 C1 42 8A ED 5C 86 75>)
(   4,<2007-02-15 13:16:04.08 +000>,<MAYBRIDGE\nmr>,<NMR_250MHZ>,
      <abs ABSG = 5 
       data hash MD5: 32K
       7F A1 FA 26 55 89 1F F5 B3 26 A3 AC 43 20 07 33>)
$$ ##END=
$$ 
$$ hash MD5
$$ 9F 17 C1 AF 09 3F B2 46 D5 EB E1 8D 98 44 92 E0
##$RELAX= 
##$RELAX= 
##$RELAX= 
##$RELAX= 
##$RELAX= 
##$RELAX= 
##$RELAX= 
$$ Bruker specific parameters
$$ --------------------------
##$DU= <C:\u>
##$EXPNO= 1010
##$NAME= <ADRS>
##$PROCNO= 1
##$TYPE= <nmr>
##$USER= <dgb>
##$AMP= (0..31)
100 100 100 100 100 100 100 100 100 100 100 100 100 100 100 100 100 100 
100 100 100 100 100 100 100 100 100 100 100 100 100 100 
##$AQSEQ= 0
##$AQ_mod= 3
##$AUNM= <au_zg>
##$AUTOPOS= <42 >
##$BF1= 250.13
##$BF2= 250.13
##$BF3= 250.13
##$BF4= 250.13
##$BF5= 500.13
##$BF6= 500.13
##$BF7= 500.13
##$BF8= 500.13
##$BYTORDA= 1
##$CFDGTYP= 0
##$CFRGTYP= 5
##$CHEMSTR= <none>
##$CNST= (0..31)
1 1 145 1 1 1 1 1 1 1 1 1 1 1 1 1 1 1 1 1 1 1 1 1 1 1 1 1 1 1 1 1 
##$CPDPRG= <>
##$CPDPRG1= <>
##$CPDPRG2= <>
##$CPDPRG3= <>
##$CPDPRG4= <mlev>
##$CPDPRG5= <mlev>
##$CPDPRG6= <mlev>
##$CPDPRG7= <mlev>
##$CPDPRG8= <mlev>
##$CPDPRGB= <>
##$CPDPRGT= <>
##$D= (0..31)
0 1 0 0 0 0 0 0 0 0.06 0 0 0 0 0 0 0.0002 0 0 0 0 0 0 0 0 0 0 0 0 0 0 
0 
##$DATE= 1171545349
##$DBL= (0..7)
120 120 120 120 120 120 120 120 
##$DBP= (0..7)
150 150 150 150 150 150 150 150 
##$DBP07= 0
##$DBPNAM0= <>
##$DBPNAM1= <>
$$ [...]
##$SUBNAM6= <"">
##$SUBNAM7= <"">
##$SUBNAM8= <"">
##$SUBNAM9= <"">
##$SW= 20.6930455092707
##$SWIBOX= (0..15)
0 0 3 0 0 0 0 0 0 0 0 0 0 0 0 0 
##$SW_h= 5175.983436853
##$TD= 65536
##$TD0= 1
##$TE= 295.16
##$TE2= 300
##$TE3= 300
##$TEG= 300
##$TL= (0..7)
0 120 120 120 120 120 120 120 
##$TP= (0..7)
150 150 150 150 150 150 150 150 
##$TP07= 0
##$TPNAME0= <>
##$TPNAME1= <>
##$TPNAME2= <>
##$TPNAME3= <>
##$TPNAME4= <>
##$TPNAME5= <>
##$TPNAME6= <>
##$TPNAME7= <>
##$TPOAL= (0..7)
0.5 0.5 0.5 0.5 0.5 0.5 0.5 0.5 
##$TPOFFS= (0..7)
0 0 0 0 0 0 0 0 
##$TUNHIN= 0
##$TUNHOUT= 0
##$TUNXOUT= 0
##$USERA1= <user>
##$USERA2= <user>
##$USERA3= <user>
##$USERA4= <user>
##$USERA5= <user>
##$V9= 5
##$VALIST= <valist>
##$VCLIST= <CCCCCCCCCCCCCCC>
##$VD= 0
##$VDLIST= <DDDDDDDDDDDDDDD>
##$VPLIST= <PPPPPPPPPPPPPPP>
##$VTLIST= <TTTTTTTTTTTTTTT>
##$WBST= 1024
##$WBSW= 4
##$XGAIN= (0..3)
0 0 0 0 
##$XL= 0
##$YL= 0
##$YMAX_a= 421065
##$YMIN_a= -420843
##$ZGOPTNS= <>
##$ZL1= 120
##$ZL2= 120
##$ZL3= 120
##$ZL4= 120
##$ABSF1= 16.522
##$ABSF2= -4.171173
##$ABSG= 5
##$ABSL= 3
##$ALPHA= 0
##$AQORDER= 0
##$ASSFAC= 0
##$ASSFACI= 0
##$ASSFACX= 0
##$ASSWID= 0
##$AUNMP= <proc_1d>
##$AZFE= 0.1
##$AZFW= 0.1
##$BCFW= 0
##$BC_mod= 0
##$BYTORDP= 0
##$COROFFS= 0
##$CY= 12.5
##$DATMOD= 1
##$DC= 0
##$DFILT= <>
##$DTYPP= 0
##$F1P= 14.0000005364418
##$F2P= -0.99999901652339
##$FCOR= 0.5
##$FTSIZE= 32768
##$FT_mod= 6
##$GAMMA= 0
##$GB= 0
##$INTBC= 1
##$INTSCL= 1
##$ISEN= 128
##$LB= 0.3
##$LEV0= 0
##$LPBIN= 0
##$MAXI= 10000
##$MC2= 0
##$MEAN= 0
##$ME_mod= 0
##$MI= 0
##$NCOEF= 0
##$NC_proc= -3
##$NLEV= 6
##$NOISF1= 0
##$NOISF2= 0
##$NSP= 0
##$NTH_PI= 0
##$NZP= 0
##$OFFSET= 16.522
##$PC= 1
##$PHC0= 215.1062
##$PHC1= 5.123988
##$PH_mod= 1
##$PKNL= yes
##$PPARMOD= 0
##$PSCAL= 4
##$PSIGN= 0
##$REVERSE= no
##$SF= 250.13
##$SI= 32768
##$SIGF1= 0
##$SIGF2= 0
##$SINO= 400
##$SIOLD= 32768
##$SREGLST= <1H.DMSO>
##$SSB= 0
##$STSI= 32768
##$STSR= 0
##$SW_p= 5175.98343685301
##$SYMM= 0
##$S_DEV= 0
##$TDeff= 65536
##$TDoff= 0
##$TI= <Analysis number 999999
Compound Code 99
Book Reference 9
Project Code 9>
##$TILT= no
##$TM1= 0
##$TM2= 0
##$TOPLEV= 0
##$USERP1= <user>
##$USERP2= <user>
##$USERP3= <user>
##$USERP4= <user>
##$USERP5= <user>
##$WDW= 1
##$XDIM= 32768
##$YMAX_p= 411780558
##$YMIN_p= -96650
$$ End of Bruker specific parameters
$$ ---------------------------------
##NTUPLES= NMR SPECTRUM
##VAR_NAME=  FREQUENCY,     SPECTRUM/REAL,   SPECTRUM/IMAG
##SYMBOL=    X,             R,               I
##VAR_TYPE=  INDEPENDENT,   DEPENDENT,       DEPENDENT
##VAR_FORM=  AFFN,          ASDF,            ASDF
##VAR_DIM=   32768,         32768,           32768
##UNITS=     HZ,            ARBITRARY UNITS, ARBITRARY UNITS
##FACTOR=    0.157963299565203, 1,           1
##FIRST=     4132.6476996994, 0,             0
##LAST=      -1043.33573715361, 0,           0
##MIN=       -1043.33573715361, -96650,      0
##MAX=       4132.6476996994, 411780558,     0
$$ Real data points
##PAGE= N=1
##DATA TABLE= (X++(R..R)), XYDATA
$$ [...]
$$ plain form
18064 -9752 8526 23925 -207 -4306 11450 33149 18939 21105 33758 24724 11573 -7578
18052 -7578 -19218 -4370 12910 16623 35312 52439 57871 58093 54149 54211 45956 38995 26410 36156
18038 36156 36627 30142 22272 25272 37953 38754 21529 12190 -855 5745 10236 7238 32154 39167
18024 39167 23312 18265 12464 1057 7122 16208 -8209 -10743 -6645 -5247 5378 25638 20704
18011 20704 -12594 -15397 3489 13674 24566 20960 26805 21046 24015 26445 26869 10402 -28724
17998 -28724 -31949 -22082 -3728 -12831 -4699 22294 25247 39332 36820 28648 22373 14291 26915
17985 26915 41971 55015 29972 6656 29121 23663 11177 -4736 8300 21583 18706 6798
17973 6798 17834 27514 31498 36446 64134 60222 44825 41576 17009 -22408 -11606 4677 7631
$$ packed form
18064i752J8278J5399k4132m099J5756K1699j4210K166J2653r034j3151j9151
18052g578j1640J4848J7280L713J8689J7127N432K22l944O2q255o961j2585R746
18038C6156M71o485p870L000J2681Q01j7225r339j3045O600M491k998K4916P013
18024C9167j5855n047n801j1407O065R086k4417k534M098J398J0625K0260m934
18011B0704l3298k803J8886J0185J0892l606N845n759K969K430M24j6467l9126
17998b8724l225R867J8354r103Q132K6993K953J4085k512q172o275q082J2624
17985B6915J5056J3044k5043k3316K2465n458j2486j5913J3036J3283k877j1908
17973F798J1036R680L984M948K7688l912j5397l249k4567l9417J0802J6283K954
$$ plain form
17960 7631 19959 -16128 -18194 -9723 471 13766 17300 30509 37288 14477 10050 -11783 -20971
17947 -20971 -19813 14727 36397 30198 33640 29518 9892 1938 -3447 9803 -16561 -17619 -7525
17934 -7525 797 5249 26592 31987 19403 21936 29092 37796 53312 83053 54901 -9173 -15297
17921 -15297 3658 -2542 -23568 -31220 -40415 -2788 6829 31200 41425 50749 42958 37805 12413
17908 12413 -20335 -6299 4268 2536 -10063 -24897 -23057 -17147 -35676 -22887 5993 -3706
17896 -3706 -7131 -1947 14535 14888 34151 49388 60917 57060 61065 24849 4421 24268 54388
17883 54388 62092 71630 66227 40652 30626 38702 31933 20564 42518 71397 75033 54981 35001
17870 35001 -2188 3282 20389 22769 49488 78149 87213 97090 100213 129937 144544 200811 357273
$$ packed form
17960G631J2328l6087k066Q471J0194J3295L534J3209O779k2811m427k1833r188
17947b0971J158L4540K1670o199L442m122j9626p954n385J3250k6364j058J0094
17934g525Q322M452K1343N395j2584K533P156Q704J5516K9741k8152o4074o124
17921a5297J8955o200k1026p652r195L7627R617K4371J0225R324p791n153k5392
17908A2413l2748J4036J0567j732j2599j4834J840N910j8529J2789K8880r699
17896c706l425N184J6482L53J9263J5237J1529l857M005l6216k0428J9847L0120
17883E4388P704R538n403k5575j0026Q076o769j1369K1954K8879L636k0052j9980
17870C5001l7189N470J7107K380K6719K8661R064R877L123K9724J4607N6267J56462
$$ plain form
17857 357273 597313 918268 1310089 1542824 1272891 823984 493676 272339 181357 141277
17847 141277 103834 72869 65250 66226 74877 66607 70973 68962 70034 50474 61470 56148 57610
17834 57610 58855 66368 88256 98516 67849 59153 76510 97115 120374 139501 189881 251831
17822 251831 351890 501021 771718 1139097 1507842 1421821 896834 479376 279544 211199
17812 211199 159763 123364 115593 128504 110866 82391 47314 36260 33276 37704 21285 700
17800 700 22334 28462 12760 -20849 -20647 -10158 7882 32912 22895 8416 8547 2899 2654 -5323
17786 -5323 -17542 -18073 -8878 -14809 7070 44049 6371 -63185 -77657 -50467 -19745 -22816 423
17773 423 15662 1296 -2131 -8240 -8178 8929 29157 36373 -1609 -9269 -6183 -2826 -20026 -15583
$$ packed form
17857C57273K40040L20955L91821K32735k69933m48907l30308k21337r0982m0080
17847A41277l7443l0965p619R76Q651q270M366k011J072j9560J0996n322J462
17834E7610J245P513K1888J0260l0667q696J7357K0605K3259J9127N0380O1950
17822B51831J00059J49131K70697L67379L68745q6021n24987m17458j99832o8345
17812B11199n1436l6399p771J2911j7638k8475l5077j1054k984M428j6419k0585
17800G00K1634O128j5702l3609K02J0489J8040K5030j0017j4479J31n648k45p977
17786e323j2219n31R195n931K1879L6979l7678o9556j4472K7190L0722l071K3239
17773D23J5239j4366l427o109O2J7107K0228P216l7982p660L086L357j7200M443
$$ plain form
17759 -15583 3325 21146 23475 16570 -3045 -6841 10353 -220 -20375 -3174 33921 47967
17747 47967 46753 29533 10362 23912 32585 29329 47256 56341 36114 25919 32123 32153 19438
17734 19438 -20920 -58970 -54463 -34911 -42958 -48788 -46605 -6655 33297 38879 22604 -22123 -7550
17721 -7550 1131 -15259 -9674 -16229 -12103 -5056 -2395 -6449 16844 21379 9353 14753 15485 14793
17707 14793 20815 16821 9195 5209 2338 25084 20143 -3891 -9684 123 5541 9950 25765 41361
17693 41361 53732 52409 39734 18590 -5889 15802 49377 4631 -11552 -14197 -305 1036
17681 1036 -12655 -21815 -10537 -38757 -40609 -39270 -12578 9717 -11211 -17428 -2938 -20701 -39951
17668 -39951 -15616 9890 12551 18760 15194 6828 12494 19058 26843 -4524 2929 14549 -3284
$$ packed form
17759a5583J8908J7821K329o905j9615l796J7194j0573k0155J7201L7095J4046
17747D7967j214j7220j9171J3550Q673l256J7927R085k0227j0195O204L0j2715
17734A9438m0358l8050M507J9552q047n830K183L9950L9952N582j6275m4727J4573
17721g550Q681j6390N585o555M126P047K661m054K3293M535j2026N400P32o92
17707A4793O022l994p626l986k871K2746m941k4034n793R807N418M409J5815J5596
17693D1361J2371j323j2675k1144k4479K1691L3575m4746j6183k645J3892J341
17681A036j3691r160J1278k8220j852J339K6692K2295k0928o217J4490j7763j9250
17668c9951K4335K5506K661O209l566q366N666O564P785l1367P453J1620j7833
$$ plain form
17655 -3284 -26442 -26065 -10487 14090 34042 35335 -7138 -12121 -8623 -11614 -13858 3139 13265
17642 13265 -6001 -4528 -2397 -3652 -5866 -15987 -27169 -27436 -29977 -46000 -35162 -9863 -3697
17629 -3697 -7425 -24219 -14719 806 3019 -6629 -1379 -5738 1042 6094 19942 17197 16473 677
17615 677 -15521 -14061 -20640 -19404 -14930 -32818 -16097 -9340 -3601 147 5495 -1542 -4557 -7383
17601 -7383 -23696 -29962 -43934 -47130 -28992 -15934 -8700 -18305 -27251 -30220 -41312 -43988 -6224
17588 -6224 27039 41559 24848 33330 50748 39365 2124 -37222 -51574 -28128 -13728 -17318
17576 -17318 9309 24410 3108 -24109 -38421 -24746 5942 6445 11278 46205 32459 -13921
17564 -13921 -45488 -60663 -57016 -41352 -31443 -20709 -29197 -22974 11037 24885 25103 18621 28072
$$ packed form
17655c284k3158L77J5578K4577J9952J293m2473m983L498k991k244J6997J0126
17642A3265j9266J473K131j255k214j0121j1182k67k541j6023J0838K5299O166
17629c697l728j6794R500J5525K213r648N250m359O780N052J3848k745p24j5796
17615F77j6198J460o579J236M474j7888J6721O757N739L748N348p037l015k826
17601g383j6313o266j3972l196J8138J3058P234r605q946k969j1092k676L7764
17588f224L3263J4520j6711Q482J7418j1383l7241l9346j4352K3446J4400l590
17576a7318K6627J5101k1302k7217j4312J3675L0688N03M833L4927j3746m6380
17564a3921l1567j5175L647J5664R909J0734q488O223L4011J3848K18o482R451
$$ plain form
17551 28072 19722 18506 13011 10176 7940 -6274 110 2170 -11315 -5066 12612 4790 21224
17538 21224 33332 26603 16978 22542 18961 35843 35077 1372 3374 18540 -6582 -15230 -5647
17525 -5647 -2355 1812 10141 13361 6773 -5235 10861 -8375 -15443 6805 29926 9667 -14950
17512 -14950 -34957 -2536 11033 12165 26046 23106 20174 4632 -4833 -22998 -20639 -12053 877
17499 877 7711 -28449 -52440 -33280 -15339 -25640 -27782 2361 -3049 -22351 -21449 -23026 -6267
17486 -6267 8244 7037 20771 5691 -15381 3705 -3893 -4281 -6445 2731 -1561 -14541 -13131
17473 -13131 -10795 -39827 -43372 -30527 -13163 -16259 -15972 -5269 -16260 -4475 21220 27571 2725
17460 2725 -38176 -55865 -32864 -27384 -60019 -20538 7285 -7227 -19546 -13117 -4821 -8876 -26782
$$ packed form
17551B8072q350j216n495k835k236j4214O384K060j3485O249J7678p822J6434
17538B1224J2108o729r625N564l581J6882p66l3705K002J5166k5122q648R583
17525e647L292M167Q329L220o588j2008J6096j9236p068K2248K3121k0259k4617
17512a4950k0007L2421J3569J132J3881k940k932j5542r465j8165K359Q586J2930
17499H77O834l6160k3991J9160J7941j0301k142L0143n410j9302R02j577J6759
17486f267J4511j207J3734j5080k1072J9086p598l88k164R176m292j2980J410
17473a3131K336k9032l545J2845J7364l096K87J0703j0991J1785K5695O351k4846
17460B725m0901j7689K3001N480l2635L9481K7823j4512j2319O429Q296m055j7906
$$ plain form
17447 -26782 -14777 -10518 -3053 -15234 -28758 -18053 -41916 -17525 -13792 -28358 -34849 -22830
17435 -22830 -13621 194 26866 33215 14680 -398 -10445 -31631 -41904 -45968 -16766 -10918
17423 -10918 -28791 -10397 -11692 -41786 -66746 -70349 -39493 456 5733 -18485 -31712 -38571
17411 -38571 -21717 -9385 -6387 -25905 -20072 -23552 -16920 -32205 -16100 -20292 -22849 -30084 -29987 -10844
17397 -10844 23122 -2468 -51887 -41406 -30898 -15589 -23889 -25434 -10552 -13075 -11023 -16088 -24403
17384 -24403 -11884 -3410 -9358 -11419 -22096 -15187 -8557 -9793 -252 -16683 -30824 -16479 -13983
17371 -13983 -23093 -16125 -6895 21864 46966 25496 -1083 -33326 -21749 -31858 -53248 -41265
17359 -41265 -18215 -11208 -16949 -17139 -1968 16070 10096 16048 15797 -14087 -27470 -37087 -48761
$$ packed form
17447b6782J2005M259P465j2181j3524J0705k3863K4391L733j4566o491J2019
17435b2830R209J3815K6672O349j8535j5078j0047k1186j0273m064K9202N848
17423a0918j7873J8394j295l0094k4960l603L0856L9949N277k4218j3227o859
17411c8571J6854J2332K998j9518N833l480O632j5285J6105m192k557p235R7J9143
17397a0844L3966k5590m9419J0481J0508J5309q300j545J4882k523K052n065q315
17384b4403J2519Q474n948k061j0677O909O630j236R541j6431j4141J4345K496
17371a3983r110O968R230K8759K5102k1470k6579l2243J1577j0109k1390J1983
17359d1265K3050P007n741j90J5171J8038n974N952k51k9884j3383r617j1674
$$ plain form
17346 -48761 -34186 -21937 -2479 13046 23764 28188 5173 -5061 -7764 -298 10938 33837
17334 33837 34235 4700 -4830 22741 37762 22053 4490 -22345 -25639 -14421 3752 6180 14976
17321 14976 3212 10405 13961 11787 11004 10004 4002 -7046 -10333 -3415 -14432 -21677 -33581 -22810
17307 -22810 -12892 -7949 23392 23817 3200 14595 3653 -21787 -30388 -27040 -7388 12214 11407
17294 11407 -2963 -29874 -19083 -5166 17586 12770 -145 3816 9136 24481 30767 6910
17282 6910 5102 8683 -8248 -15271 -33853 -14310 -15284 -23277 -1858 16484 7342 -10074 -20432
17269 -20432 -31816 -38551 -36699 -22339 -24707 -18649 -12745 -21612 -14385 -369 -23125 -10650 10757
17256 10757 15222 3318 -7961 -11171 -53559 -75940 -65259 -64684 -54749 -37473 -33426 -32736 -33599 -41470
$$ packed form
17346d8761J4575J2249J9458J5525J0718M424k3015j0234k703P466J1236K2899
17334C3837L98k9535r530K7571J5021j5709j7563k6835l294J1218J8173K428Q796
17321A4976j1764P193L556k174p83j000o002j1048l287O918j1017p245j1904J0771
17307b2810R918M943L1341M25k0617J1395j0942k5440q601L348J9652J9602q07
17294A1407j4370k6911J0791J3917K2752m816j2915L961N320J5345O286k3857
17282F910j808L581j6931p023j8582J9543r74p993K1419J8342r142j7416j0358
17269b0432j1384o735J852J4360k368O058N904q867P227J4016k2756J2475K1407
17256A0757M465j1904j1279l210m2388k2381J0681N75R935J7276M047O90q63p871
$$ plain form
17242 -41470 -31104 -48771 -61320 -40799 -18625 -22918 -5017 5564 -4524 -7443 634 -25795
17230 -25795 -14114 -3504 3126 20221 6537 -17984 -27712 -41446 -42834 -41213 -25942 -36791
17218 -36791 -30549 -31549 -53682 -62032 -52078 -51406 -65360 -47301 3065 19185 30190 12766 -14685
17205 -14685 -16376 -3876 -6370 -44574 -64088 -37366 -16840 4583 15725 -9095 -34694 -41064
17193 -41064 -35072 165 14777 17372 -5898 -37282 -45651 -42343 -36085 -41301 -43054 -51535 -53710
17180 -53710 -56308 -29042 -4826 -11890 -36226 -31351 7065 256 -17400 -27091 -19307 -6855 -7259
17167 -7259 -17382 -10688 -6392 -34206 -22860 -9484 -4945 -22896 -38859 -38212 -32463 -26299 -25638 -20534
17153 -20534 -63901 -54136 -32499 -7811 10383 3134 17984 10641 -5215 -16977 -29930 -534
$$ packed form
17242d1470J0366j7667j2549K0521K2174m293J7901J0581j0088k919Q077k6429
17230b5795J1681J0610O630J7095j3684k4521r728j3734j388J621J5271j0849
17218c6791O242j000k2133q350R954O72j3954J8059N0366J6120J1005j7424k7451
17205a4685j691J2500k494l8204j9514K6722K0526K1423J1142k4820k5599o370
17193d1064N992L5237J4612K595k3270l1384q369L308O258n216j753q481k175
17180e3710k598K7266K4216p064k4336M875L8416o809j7656r691P784J2452m04
17167g259j0123O694M296k7814J1346J3376M539j7951j5963O47N749O164O61N104
17153b0534m3367R765K1637K4688J8194p249J4850p343j5856j1762j2953K9396
$$ plain form
17141 -534 11774 14160 -8489 -31173 -26789 -6644 -19044 -26325 -32378 -37985 -24852 -6221 13848
17128 13848 12358 -2329 -10411 -11601 2211 21675 40715 10471 -27898 -16450 -25033 -31524 -22433
17115 -22433 -20624 -154 -1534 17429 39300 41275 11107 -888 -3777 -13899 -14179 -16356 -22657
17102 -22657 -21333 -12975 -16353 27660 19971 -3473 -11464 -25172 -13458 -5529 5247 10459 15681
17089 15681 16562 -1687 -35044 -61605 -58190 -57623 -40760 -17472 9744 9156 -20619 -30175 -2845
17076 -2845 18910 35024 38625 10380 14210 2521 -12718 -23810 -7724 5128 10169 18432 32000
17063 32000 42431 16684 18509 12619 4057 1848 1100 29436 17248 4560 -28049 -42358 -33087
17050 -33087 2018 18008 5994 -16897 7056 -8089 -12298 -3137 -15303 -28307 -24287 -10953
$$ packed form
17141e34J2308K386k2649k2684M384K0145j2400p281o053n607J3133J8631K0069
17128A3848j490j4687q082j190J3812J9464J9040l0244l8369J1448q583o491R091
17115b2433J809K0470j380J8963K1871J975l0168j1995k889j0122k80k177o301
17102b2657J324Q358l378M4013p689k3444p991j3708J1714P929J0776N212N222
17089A5681Q81j8249l3357k6561L415N67J6863K3288K7216n88k9775r556K7330
17076b845K1755J6114L601k8245L830j1689j5239j1092J6086J2852N041Q263J3568
17063C2000J0431k5747J825n890q562k209p48K8336j2188j2688l2609j4309R271
17050c3087L5105J5990j2014k2891K3953j5145m209R161j2166j3004M020J3334
$$ plain form
17038 -10953 1188 9653 -10124 -28752 -31619 -43068 -45210 -40252 -49411 -54473 -50563 -45948 -36400
17025 -36400 -33949 -1659 -190 -10672 -11122 -10452 12647 24181 23160 -8785 -8399 33909 61317
17012 61317 29324 12029 -27743 -39971 -28103 -2643 -6440 -19745 -35788 -40293 -13736 979
17000 979 -4346 1258 40210 57494 47408 7556 13844 -3778 -39808 -57522 -34984 2701 34111
16987 34111 32872 36520 38935 8025 -10768 635 24435 16655 -4105 10709 18189 6920 -3307
16974 -3307 -1354 3780 -1502 -5129 -1904 -21447 -35057 -38317 -21523 -10908 -20374 -8426 14983
16961 14983 42089 52979 26964 -3123 -13657 -38022 -29660 -19612 -25550 -1874 25545 17902
16949 17902 10768 8372 -3842 -9328 -474 11939 14566 492 -3330 -8957 -28 -14620 2980
$$ packed form
17038a0953J2141Q465j9777j8628k867j1449k142M958r159n062L910M615R548
17025c6400K451L2290J469j0482m50O70K3099J1534j021l1945L86M2308K7408
17012F1317l1993j7295l9772j2228J1868K5460l797j3305j6043m505K6557J4715
17000I79n325N604L8952J7284j0086l9852O288j7622l6030j7714K2538L7685L1410
16987C4111j239L648K415l0910j8793J1403K3800p780k0760J4814P480j1269j0227
16974c307J953N134n282l627L225j9543j3610l260J6794J0615r466J1948K3409
16961A4983K7106J0890k6015l0087j0534k4365Q362J0048n938K3676K7419p643
16949A7902p134k396j2214n486Q854J2413K627j4074l822n627Q929j4592J7600
$$ plain form
16936 2980 -19773 -44084 -46669 -12759 -4030 10206 4303 -30857 -33269 11347 52279 32504 19115
16923 19115 37172 46623 21841 6950 -7893 2454 16065 23802 14548 -15378 -12562 -3815 -1928
16910 -1928 8216 30304 28379 -801 -11170 -36866 -56466 -28132 -11982 -24720 -25253 -22652 -37619
16897 -37619 -72214 -64555 -54128 -36449 -7009 -4640 -27284 -33943 -41761 -54819 -65963 -51787
16885 -51787 -30133 -17596 -8288 -52769 -40042 -29587 -32346 -39506 -49672 -49583 -47458 -38491 -40303
16872 -40303 -39657 -13668 -421 9489 9136 19605 25236 2606 -16528 -3729 -1084 -10594 5646
16859 5646 2084 -13832 -27069 -22079 -18301 15690 42251 43559 40614 23077 -3970 998 13183
16846 13183 1314 8356 9562 18085 16827 26901 27260 20796 21898 11969 22272 48876 49181 48412
$$ packed form
16936B980k2753k4311k585L3910Q729J4236n903l5160k412M4616M0932j9775j3389
16923A9115J8057R451k4782j4891j4843J0347J3611P737r254k9926K816Q747J887
16910a928J0144K2088j925k9180j0369k5696j9600K8334J6150j2738n33K601j4967
16897c7619l4595P659J0427J7679K9440K369k2644o659p818j3058j1144J4176
16885e1787K1654J2537R308m4481J2727J0455k759p160j0166Q9K125Q967j812
16872d0303O46K5989J3247R910l53J0469N631k2630j9134J2799K645r510J6240
16859E646l562j5916j3237M990L778L3991K6561J308k945j7537k7047M968J2185
16846A3183j1869P042J206Q523j258J0074L59o464J102r929J0303K6604L05p69
$$ plain form
16832 48412 14483 -23553 -21281 -4043 -12406 1665 2637 -4870 -16160 -30152 -26360 -20868 -14533
16819 -14533 -24538 -26554 -12902 -26683 -20229 -40204 -7809 4460 -26615 -24454 -47 13296
16807 13296 -17094 -24360 -12736 82 -12011 -22898 1370 1348 -2031 -3523 -9414 -22778 -18580
16794 -18580 -5262 166 -6402 -8730 -11178 -14639 -11475 -38323 -35218 -16390 -33249 -17986 4542
16781 4542 10659 517 -34045 -6150 27573 32314 26092 34636 -431 -16467 -23330 -18078 -21847
16768 -21847 -39785 -44127 -21193 -6376 -825 -267 -8210 -7085 -253 15318 19610 17735 10635 -11480
16754 -11480 5004 18305 -82 -11001 -4715 1151 8962 -7732 -23985 -22573 12691 47658
16742 47658 46731 -13843 -29715 -25312 -61477 -76620 -52620 -19696 -8077 -7926 -13972 -15861 -18432
$$ packed form
16832D8412l3929l8036K272J7238q363J4071R72p507j1290j3992L792N492O335
16819a4533j0005k016J3652j3781O454j9975L2395J2269l1075K161K4407J3343
16807A3296l0390p266J1624J2818j2093j0887K4268k2l379j492n891j3364M198
16794a8580J3318N428o568k328k448l461L164k6848L105J8828j6859J5263K2528
16781D542O117j0142l4562K7895L3723M741o222Q544l5067j6036o863N252l769
16768b1847j7938m342K2934J4817N551N58p943J125O832J5571M292j875p100k2115
16754a1480J6484J3301j8387j0919O286N866P811j6694j6253J412L5264L4967
16742D7658r27o0574j5872M403l6165j5143K4000L2924J1619J51o046j889k571
$$ plain form
16729 -18432 -19826 -29933 -22111 -27525 -26311 -13316 -1808 -15658 -6510 3172 -5197 -1621 4909
16716 4909 2603 -6844 -10061 -11089 -28347 -43083 -55466 -38479 -24784 -40970 -56590 -20155 -4693
16703 -4693 -26510 -37808 -28045 -41107 -67526 -80568 -49154 -34637 -39765 -39696 -8041 56836 35340
16690 35340 21961 13691 12493 -5514 11462 11338 16866 42683 47442 21993 13607 26733 862
16677 862 -20644 -27192 -11933 -20427 -21114 -31937 -26491 -3597 9493 20875 26989 36229 28400 -9691
16663 -9691 -43437 -32737 544 18485 37790 37618 26914 19741 24671 18032 24493 18516 -3037
16650 -3037 495 -2084 -27658 -24594 -23447 -26523 -52 18101 33291 55202 50327 24675 20317
16637 20317 28057 27752 14136 3762 -15993 -1631 10827 27026 4915 -23859 -22804 -16838 -30430
$$ packed form
16729a8432j394j0107P822n414J214J2995J1508j3850R148R682q369L576O530
16716D909k306r447l217j028j7258j4736j2383J6987J3695j6186j5620L6435J5462
16703d693k1817j1298R763j3062k6419j3042L1414J4517n128O9L1655O4877k1496
16690C5340j3379q270j198j8007J6976j24N528K5817M759k5449q386J3126k5871
16677H62k1506o548J5259q494o87j0823N446K2894J3090J1382O114R240p829l8091
16663i691l3746J0700L3281J7941J9305j72j0704p173M930o639O461n977k1553
16650c037L532k579k5574L064J147l076K6471J8153J5190K1911m875k5652m358
16637B0317P740l05j3616j0374j9755J4362J2458J6199k2111k8774J055N966j3592
$$ plain form
16624 -30430 -23798 -2143 -22711 -40009 -31689 -11844 17514 213 -15682 -17666 -18022 -22805 -8267
16611 -8267 9263 -1052 -5685 -5926 -9872 -10468 -24282 -28783 -6829 11935 13923 25175 36245
16598 36245 15783 8799 8991 13660 3991 2002 9629 5108 4415 22233 18027 -16711 -27266 -4503
16584 -4503 11820 1990 -22618 -48094 -72723 -57793 -37048 -11324 -797 -3360 1892 -11594
16572 -11594 -14202 3807 8244 -19305 -16524 -3917 -17101 -6876 6159 4175 -5016 3419 10328
16559 10328 18819 -23900 -41882 -39406 -40682 -17670 -8581 -3007 3532 -10292 -32469 -34302 -19568
16546 -19568 -5320 -25408 -28018 -46020 -41149 -35264 -17858 -1255 -2409 -3272 -14545 1888 31413
16533 31413 25688 7071 9261 13980 929 7193 29551 31901 27386 17643 13419 11208 14849 28118
$$ packed form
16624c0430O632K1655k0568j7298Q320J9845K9358j7301j5895j984l56m783J4538
16611h267J7530j0315m633k41l946n96j3814m501K1954J8764J988J1252J1070
16598C6245k0462o984J92M669r669j989P627m521o93J7818m206l4738j0555K2763
16584d503J6323r830k4608k5476k4629J4930K0745K5724J0527k563N252j3486
16572a1594k608J8009M437k7549K781J2607j3184J0225J3035j984r191Q435O909
16559A0328Q491m2719j7982K476j276K3012R089N574O539j3824k2177j833J4734
16546a9568J4248k0088k610j8002M871N885J7406J6603j154q63j1273J6433K9525
16533C1413n725j8617K190M719j3051O264K2358K350m515r743m224k211L641J3269
$$ plain form
16519 28118 17165 12415 -703 -22776 -20319 -42979 -43720 -32320 -30686 -16800 8311 8178 -12543
16506 -12543 -24871 -1049 4969 -6869 -13659 -7370 18680 51942 31262 1966 -10867 -19054
16494 -19054 -28897 -20922 -30634 -35033 -14156 -12801 -26365 -7163 -8154 -3831 2994 -4486 -14159 2981
16480 2981 9292 -238 -11482 -11489 14641 18486 -6301 -35099 -27212 -11713 -29772 -29285 -4162 19741
16466 19741 7432 -7176 1516 -9088 -19358 -11540 -21812 -12515 -3825 -9758 -7308 -7022 -23530
16453 -23530 -37231 -32051 -34802 -23787 -5214 302 -5179 5063 35887 34300 2315 -3916 819
16440 819 605 4919 20535 17814 10002 -9633 -13157 -17188 -11839 3789 17443 -7698 -8101 -14975
16426 -14975 -8905 -4456 -3730 -12510 -15721 -15501 -29856 -31867 -36652 -55505 -37825 -13442 -18476 8794
$$ packed form
16519B8118j0953m750j3118k2073K457k2660p41J1400J634J3886K5111j33k0721
16506a2543j2328K3822O018j1838o790O289K6050L3262k0680k9296j2833q187
16494a9054r843P975r712m399K0877J355j3564J9202r91M323O825p480r673J7140
16480B981O311r530j1244pK6130L845k4787k8798P887J5499j8059M87K5123K3903
16466A9741j2309j4608Q692j0604j0270P818j0272R297Q690n933K450K86j6508
16453b3530j3701N180k751J1015J8573N516n481J0242L0824j587l1985o231M735
16440H19k14M314J5616k721p812j9635l524m031N349J5628J3654k5141m03o874
16426a4975O070M449P26q780l211K20j4355k011m785j8853J7680K4383n034K7270
$$ plain form
16412 8794 23000 13004 618 10228 15598 -7316 -29752 -18607 -20979 -24511 -334 -14069 -14557
16399 -14557 -21123 -23082 -30294 -27848 -34048 -38065 -30769 845 182 -9956 -39416 -69683 -45137
16386 -45137 -18656 -36921 -32268 -23938 -19991 -18409 -32072 -25223 -5200 12472 18168 17473 22032
16373 22032 1857 18292 22457 12697 -1738 -15254 -11765 -19795 -16829 -21770 -17300 3606 -4391
16360 -4391 -33758 -22075 -1967 4251 7282 4372 21922 26973 35476 31038 23803 19349 19988 -4901
16346 -4901 -45230 -24655 2790 -880 7935 38518 50881 49254 53655 50243 26644 -308 3540
16333 3540 6224 -21974 -48292 -53857 -29348 -29655 -32886 -57102 -42660 -25491 -16790 4419 -2286
16320 -2286 -25040 -40664 -26941 -22885 -29943 -35481 -36004 -25504 -21380 3272 39450 28460 2275
$$ packed form
16412H794J4206r996j2386R610N370k2914k2436J1145k372l532K4177j3735m88
16399a4557o566j959p212K446o200m017P296L1614o63j0138k9460l0267K4546
16386d5137K6481j8265M653Q330L947J582j3663O849K0023J7672N696o95M559
16373B2032k0175J6435M165r760j4435j3516L489q030K966m941M470K0906p997
16360d391k9367J1683K0108O218L031k910J7550N051Q503m438p235m454O39k4889
16346d901m0329K0575K7445l670Q815L0583J2363j627M401l412k3599k6952L848
16333C540K684k8198k6318n565K4509l07l231k4216J4442J7169Q701K1209o705
16320b286k2754j5624J3723M056p058n538n23J0500M124K4652L6178j0990k6185
$$ plain form
16307 2275 -6377 -11877 -15146 -18317 -24271 -20226 -15613 -12001 -12875 -29455 -13016 -4636 -9419 -4184
16293 -4184 -23067 -19863 -16286 -10240 2344 -16322 -28512 -16675 733 13846 16618 3298 -12086
16280 -12086 3957 37707 74808 81135 47291 40296 28413 19305 7490 -7393 11342 43521
16268 43521 23954 7387 -13204 -17818 -22439 452 -5490 -4053 -5042 18904 23550 18721 941
16255 941 -22484 -40426 -25794 2686 17440 11952 24487 47322 40710 30902 26566 -18271 -35498
16242 -35498 -9914 -3100 -17523 8442 9740 -1748 20907 43598 41411 38965 22420 -1836
16230 -1836 -14779 6449 203 2125 -27096 -22828 -26551 -29357 -17389 -2077 -16032 -35450 -3108
16217 -3108 29182 22060 8589 38261 43974 30660 -2867 -7042 4926 24657 40626 30127
$$ packed form
16307B275q652n500l269l171n954M045M613L612q74j6580J6439Q380m783N235
16293d184j8883L204L577O046J2584j8666j2190J1837J7408J3113K772j3320j5384
16280a2086J6043L3750L7101O327l3844o995j1883r108j1815j4883J8735L2179
16268D3521j9567j6567k0591m614m621K2891n942J437r89K3946M646m829j7780
16255I41k3425j7942J4632K8480J4754n488J2535K2835o612r808m336m4837j7227
16242c5498K5584O814j4423K5965J298j1488K2655K2691k187k446j6545k4256
16230a836j2943K1228o246J922k9221M268l723k806J1968J5312j3955j9418L2342
16217c108L2290p122j3471K9672N713j3314l3527m175J1968J9731J5969j0499
$$ plain form
16205 30127 32226 53424 39216 -9887 -28444 -16821 -6401 -20763 -32808 -30189 -29787 -28067 -4926
16192 -4926 7379 22230 19684 -24573 -28328 -1439 12201 18449 4225 -14823 -12926 15796 31531
16179 31531 39997 20581 -14752 -30169 1388 12203 17923 9448 -24873 -45302 -35040 -35239 -30357
16166 -30357 -7111 18137 42739 15439 -12635 -5156 -17776 -32701 -35898 -25419 -10029 2507
16154 2507 -1812 10532 8398 23827 40253 29311 10745 3541 -11045 -40916 -16046 9979
16142 9979 334 -30009 -35394 -17946 -5152 -37241 -67936 -48709 -29468 -20286 5745 4086 -20802
16129 -20802 -24179 -23204 -12234 -19742 -34243 -52780 -46590 -24171 14603 20456 9610 -6801 -30920
16116 -30920 -30779 -29869 -11713 9602 25918 29055 7177 -12841 -13386 -22560 -7644 -3947 5272 19370
$$ packed form
16205C0127K099K1198j4208m9103j8557J1623J0420j4362j2045K619M02J720K3141
16192d926J2305J4851k546m4257l755K6889J3640O248j4224j9048J897K8722J5735
16179C1531Q466j9416l5333j5417L1557J0815N720q475l4321k0429J0262j99M882
16166c0357K3246K5248K4602k7300k8074P479j2620j4925l197J0479J5390J2536
16154B507m319J2344k134J5429J6426j0942j8566p204j4586k9871K4870K6025
16142I979r645l0343n385J7448J2794l2089l0695J9227J9241R182K6031j659k4888
16129b0802l377R75J0970p508j4501j8537O190K2419L8774N853j0846j6411k4119
16116c0920J41R10J8156K1315J6316L137k1878k0018n45r174J4916L697R219J4098
$$ plain form
16102 19370 -4126 -36839 -51861 -40970 -7659 -5216 12606 9417 -4728 12989 23958 22517
16090 22517 -589 -11251 3278 -10802 -28263 -30831 -30212 -39852 -12857 -1053 -3388 -18939 -45451
16077 -45451 -34936 2137 16945 -9364 -19094 -10452 -34932 -37456 -24822 -11556 -2538 8259
16065 8259 -12958 -53019 -34593 -16596 14272 38214 5230 551 28315 18573 9419 1618 2891
16052 2891 -6327 -18762 -14649 8647 16644 -3441 30 -1029 -18249 -14593 -3665 5853 -11635
16039 -11635 -17950 -21321 -21453 -1837 -7347 -22747 -38433 -42529 -9191 -2078 6868 -11834 -16685
16026 -16685 -8039 22864 10383 12616 14874 -12232 -38407 -36809 -36918 -50667 -69102 -43904 -12308
16013 -12308 15796 12330 4204 -21467 -44346 -9931 20801 11039 9157 21934 26789 27141 4325
$$ packed form
16102A9370k3496l2713j5022J0891L3311K443J7822l189j4145J7717J0969j441
16090B2517k3106j0662J4529j4080j7461k568O19r640K6995J1804k335j5551k6512
16077d5451J0515L7073J4808k6309r730Q642k4480k524J2634J3266R018J0797
16065H259k1217m0061J8426J7997L0868K3942l2984m679K7764r742r154p801J273
16052B891r218j2435M113K3296P997k0085L471j059j7220L656J0928R518j7488
16039a1635o315l371j32J9616n510j5400j5686m096L3338P113Q946j8702m851
16026a6685Q646L0903j2481K233K258k7106k6175J598j09j3749j8435K5198L1596
16013a2308K8104l466q126k5671k2879L4415L0732r762j882J2777M855L52k2816
$$ plain form
16000 4325 315 3977 2035 -154 -32222 -32783 -25865 -5481 -200 -19814 -11533 -27031 -58008 -45679
15986 -45679 -4351 19665 10128 -2870 -13317 -1126 -9784 -23060 -5852 -20661 -31185 -12171
15974 -12171 -9195 -32330 -44757 -44071 -18595 -8314 18774 33490 -8140 -19852 -8745 10789
15962 10789 11498 9725 19120 13021 6760 -2645 7539 4488 5749 6419 -11930 -62912 -60049 -35700
15948 -35700 -13401 3847 -5307 -5170 5413 28703 29239 29268 26362 -4625 -46237 -59609 -45818
15935 -45818 -29498 -7175 5541 -1708 -17982 -34070 -42897 -39510 -24192 -7885 -8994 -26124
15923 -26124 -18216 -24475 -17286 7285 4584 -5141 -218 -28668 -33372 -11038 15708 4642 2110
15910 2110 43704 52707 22613 -3694 -4614 -4522 -4832 6178 4899 10497 22838 15411 23063 3675
$$ packed form
16000D325m010L662j942k189l2068n61O918K0384N281j9614Q281j5498l0977J2329
15986d5679M1328K4016r537j2998j0447J2191q658j3276J7208j4809j0524J9014
15974a2171K976k3135j2427O86K5476J0281K7088J4716m1630j1712J1107J9534
15962A0789P09j773R395o099o261r405J0184l051J261O70j8349n0982K863K4349
15948c5700K2299J7248r154J37J0583K3290N36K9k906l0987m1612j3372J3791
15935d5818J6320K2323J2716p249j6274j6088q827L387J5318J6307j109j7130
15923b6124P908o259P189K4571k701r725M923k8450m704K2334K6746j1066k532
15910B110M1594R003l0094k6307r20R2l10J1010j279N598J2341p427P652j9388
$$ plain form
15896 3675 -16212 -13578 5543 -2091 -16599 -34159 -33813 -36274 -19781 -16466 -14023 -10471 -12687 -10831
15882 -10831 -19880 -11277 11825 15154 -11479 -17498 14201 23658 27438 11043 15023 21026 21705 40677
15868 40677 39108 40524 28759 16066 37584 41660 61360 57138 47525 42458 37098 3798 -4211
15855 -4211 -8801 -4591 -2470 -4128 1733 7390 15612 -11242 -26266 -31640 -35274 -19271 -19265 -46528
15841 -46528 -27609 9874 41899 19657 -11645 -21545 -34259 -14365 4604 -1490 -13159 -21656
15829 -21656 -22039 -29567 -10940 20076 28010 -21081 -34182 -29102 -42989 -54272 -21728 -40487 -57157
15816 -57157 -38537 -24273 -797 6199 -6977 -22809 -4102 11440 1840 7096 23321 19823
15804 19823 -5763 4627 -9937 -13000 -769 5385 -7867 -4352 6022 19663 21857 18817 114
$$ packed form
15896C675j9887K634J9121p634j4508j7560L46k461J6493L315K443L552k216J856
15882a0831r049Q603K3102L329k6633o019L1699R457L780j6395L980O003O79J8972
15868D0677j569J416j1765j2693K1518M076J9700m222r613n067n360l3300q009
15855d211m590M210K121j658N861N657Q222k6854j5024n374l634J6003Ok7263
15841d6528J8919L7483L2025k2242l1302r900j2714J9894J8969o094j1669q497
15829b1656l83p528J8627L1016P934m9091j3101N080j3887j1283L2544j8759j6670
15816e7157J8620J4264K3476O996j3176j5832J8707J5542r600N256J6225l498
15804A9823k5586J0390j4564l063J2231O154j3252L515J0374J3641K194l040j8703
$$ plain form
15791 114 -27692 -54130 -48887 -32483 -2295 15491 -11359 -48851 -55322 -30945 -37700 -41514 -23838
15778 -23838 -20107 -36437 -38615 -16799 -11366 2969 10736 2363 -39368 -35704 -44985 -36152 10199
15765 10199 12715 15635 -9418 -22851 -19864 -23576 -31445 -35354 -45835 -51412 -51438 -12049 -265 -41718
15751 -41718 -59956 -54087 -36244 10752 38785 4800 579 2559 -979 5648 7940 6521 1684
15738 1684 4471 3844 5141 -10283 -14261 17312 8079 3302 14020 1677 -1127 9100 12504 1010
15724 1010 -8762 -418 -10958 5127 1980 6548 23381 14619 8684 19671 -3707 843 7529
15711 7529 11457 4199 -11468 -36684 -53389 -42740 -29412 -13334 164 -27697 -49045 -42461
15699 -42461 -16824 -18002 -7086 -25954 -288 -19588 -21529 -2006 8059 21170 17351 6902
$$ packed form
15791A14k7806k6438N243J6404L0188J7786k6850l7492o471K4377o755l814J7676
15778b3838L731j6330k178K1816N433J4335P767q373m1731L664r281Q833M6351
15765A0199K516K920k5053j3433K987l712p869l909j0481n577k6L9389J1784m1453
15751d1718j8238N869J7843M6996K8033l3985m221J980l538O627K292j419m837
15738A684K787o27J297j5424l978L1573r233m777J0718j2343k804J0227L404j1494
15724A010r772Q344j0540J6085l147M568J6833q762n935J0987k3378M550O686
15711G529L928p258j5667k5216j6705J0649J3328J6078J3498k7861k1348O584
15699d2461K5637j178J0916j8868K5666j9300j941J9523J0065J3111l819j0449
$$ plain form
15687 6902 12868 11253 4220 -5084 -2682 -12786 16966 27336 -18599 -16523 -39099 -25174 -6512
15674 -6512 25047 35551 16515 14962 1482 -29745 -50069 -54160 -71927 -69540 -28946 11924
15662 11924 37199 48067 49302 30280 12477 4024 9070 18657 31134 27629 30997 32178 7577
15649 7577 3359 241 -7127 -8456 -6264 -8197 -33843 -21487 -1982 5216 -3600 -26433 -12471
15636 -12471 7985 -10647 -40618 -34191 -13594 -17104 -13908 -37764 -42176 -23105 -31701 -27406 3681
15623 3681 2739 -14584 -12687 -1466 2074 -14955 -10043 -12118 -7511 3162 5789 -3304 -4859 -10954
15609 -10954 -17289 -18198 -31108 -45141 -33551 -12818 9011 -13955 -26399 -16471 -8367 16649 22420
15596 22420 14324 3501 -6 -4061 1835 13948 -9157 -21706 59 6238 -12895 -20637 9437
$$ packed form
15687F902N966j615p033r304K402j0104K9752J0370m5935K076k2576J3925J8662
15674f512L1559J0504j9036j553j3480l1227k0324m091j7767K387M0594M0870
15662A1924K5275J0868J235j9022j7803q453N046R587J2477l505L368J181k4601
15649G577m218l118p368j329K192j933k5646J2356J9505P198q816k2833J3962
15636a2471K0456j8632k9971O427K0597l510L196k3856m412J9071q596M295L1087
15623C681r42j7323J897J1221L540j7029M912k075M607J0673K627r093j555o095
15609a0954o335r09j2910j4033J1590K0733K1829k2966j2444R928Q104K5016N771
15596B2420q096j0823l507m055N896J2113k3105j2549K1765O179j9133p742L0074
$$ plain form
15583 9437 9789 -4756 -34954 -53027 -60325 -56017 -40586 -6992 4353 -14889 -16611 -20326 11787
15570 11787 36344 35995 7030 10259 16807 5316 -1129 2342 9016 -13934 -25602 -17948 2518
15557 2518 32706 19863 -3741 -14703 -1007 12204 1611 -18550 -10470 24130 10301 16384
15545 16384 -8288 -23962 -20901 -18867 -13018 -4956 -9022 3458 20290 37823 32892 13646 9238
15532 9238 -14033 -28078 -10624 21523 25281 206 613 5858 3496 23438 40076 36741 12002
15519 12002 -8910 -27935 -34410 -33634 -25609 -22496 -10724 -8484 -472 29595 11728 135 -10854
15506 -10854 -26370 -19525 13120 8514 -24574 -9793 -20198 -41310 -53175 -52252 -41896 -45663 -18063
15493 -18063 -324 -719 -19236 -8637 -1571 9530 23111 11165 -11872 -10174 -39507 -33031 -25226
$$ packed form
15583I437L52j4545l0198j8073p298M308J5431L3594J1345j9242j722l715L2113
15570A1787K4557l49k8965L229O548j1491o445L471O674k2950j1668P654K0466
15557B518L0188j2843k3604j0962J3696J3211j0593k0161Q080L4600j3829O083
15545A6384k4672j5674L061K034N849Q062m066J2480J6832J7533m931j9246m408
15532I238k3271j4045J7454L2147L758k5075M07N245k362J9942J6638l335k4739
15519A2002k0912j9025o475P76Q025L113J1772K240Q012L0067j7867j1593j0989
15506a0854j5516O845L2645m606l3088J4781j0405k1112j1865R23J0356l767K7600
15493a8063J7739l95j8517J0599P066J1101J3581j1946k3037J698k9333O476P805
$$ plain form
15480 -25226 -9405 4902 12614 8962 10012 -2127 1859 18213 13589 4960 1277 -6582 -12362
15467 -12362 -31794 -47566 -57799 -67354 -80462 -69800 -60857 -41379 -33507 -21313 -10250 -18772
15455 -18772 -14822 -12558 -40710 -39661 -44236 -45417 -20659 -31430 -13026 -15439 -19749 -8181 -13853
15442 -13853 -7347 3959 -1130 -4821 21365 -2442 -17240 15670 -2473 -45189 -47888 -66686
15430 -66686 -36221 -24755 -27480 -43753 -52000 -45624 -52117 -42908 -11091 -13605 -24023 -54205 -43579
15417 -43579 -49121 -52375 -34491 -23911 8906 28949 35306 13574 7518 8863 -15156 -31894 -21062
15404 -21062 -31625 -51897 -40036 -37913 -38263 -551 21238 17877 12733 -3331 -18184 -24820 -28898
15391 -28898 -46132 -55219 -71058 -43287 -36271 -41244 -39353 -24003 -10724 -21473 -24634 -8144 5784
$$ packed form
15480b5226J5821J4307P712l652J050j2139L986J6354m624q629l683p859n780
15467a2362j9432j5772j0233r555j3108J0662Q943J9478P872J2194J1063q522
15455a8772L950K264k8152J049m575j181K4758j0771J8404k413m310J1568n672
15442a3853O506J1306n089l691K6186k3807j4798L2910j8143m2716k699j8798
15430f6686L0465J1466k725j6273q247O376o493R209L1817k514j0418l0182J0626
15417d3579n542l254J7884J0580L2817K0043O357k1732o056J345k4019j6738J0832
15404b1062j0563k0272J1861K123l50L7712K1789l361n144j6064j4853o636m078
15391b8898j7234r087j5839K7771P016m973J891J5350J3279j0749l161J6490J3928
$$ plain form
15378 5784 17369 18477 11416 12677 3435 -18061 -19467 -16151 -16294 -33786 -22654 -20059 -30534 -19909
15364 -19909 -28148 -15908 15503 21087 4253 -15400 -11671 5223 1291 -4023 -23659 -11313 -20150
15351 -20150 -14368 -11359 -33002 -49330 -25467 -7136 16988 36490 50236 55792 18161 8753
15339 8753 1057 -282 -13254 -7497 -7904 -6330 -21511 -52261 -42538 -24658 -8549 17444 18428 3639
15325 3639 6159 4152 -24784 -15249 7427 -16209 -18238 -31866 -31386 -4777 10655 -2504 -18889
15312 -18889 -21523 5698 3300 -5471 -19990 -22157 -1975 3005 -16100 -25258 -10852 261 8783
15299 8783 15581 -4635 8863 24460 20924 35320 47338 21584 -28762 -31715 1467 21796
15287 21796 42510 18127 -7258 -1890 -4459 -4688 -8492 3713 12028 -10250 -20460 -29996 -34986
$$ packed form
15378E784J1585J108p061J261r242k1496j406L316j43j7492J1132K595j0475J0625
15364a9909q239J2240L1411N584j6834j9653L729J6894l932n314j9636J2346q837
15351b0150N782L009k1643j6328K3863J8331K4124J9502J3746N556l7631r408
15339H753p696j339j2972N757m07J574j5181l0750R723J7880J6109K5993R84j4789
15325C639K520k007k8936R535K2676k3636k029j3628M80K6609J5432j3159j6385
15312a8889k634K7221k398q771j4519k167K0182M980j9105r158J4406J1113Q522
15299H783O798k0216J3498J5597l536J4396J2018k5754n0346k953L3182K0329
15287B1796K0714k4383k5385N368k569k29l804J2205Q315k2278j0210r536m990
$$ plain form
15274 -34986 -42119 -14520 24334 34899 32584 23349 24413 3920 1509 -1387 -15150 -24165 -25811
15261 -25811 5742 12762 -8089 -12104 -5480 13926 -3521 -4950 10612 12916 24903 27592 -4637
15248 -4637 -20848 -19936 -23734 -6809 27242 55957 31167 4823 4228 17888 17749 -8035 11459
15235 11459 -14221 -24238 -8146 -19752 -19464 8691 312 -1795 -1199 -1669 -13132 -9695 -12850 -18603
15221 -18603 -42146 -34640 -2781 12824 -4598 -2470 -2936 8958 17898 -30805 -62528 -43294 -38721
15208 -38721 -39416 -10663 -8708 -21945 -6191 25231 37382 26189 2517 -3011 1845 16463 16829
15195 16829 28902 16257 6687 892 21627 26635 10587 11356 10638 29382 16462 -21657 -10580
15182 -10580 -9695 -23975 -50997 -63786 -77791 -61656 -27020 10076 9676 1460 8352 28493 24317
$$ packed form
15274c4986p133K7599L8854J0565k315r235J064k0493k411k896j3763r015j646
15261b5811L1553P020k0851m015O624J9406j7447j429J5562K304J1987K689l2229
15248d637j6211R12l798J6925L4051K8715k4790k6344n95J3660j39k5784J9494
15235A1459k5680j0017J6092j1606K88K8155q379k107N96m70j1463L437l155n753
15221a8603k3543P506L1859J5605j7422K128m66J1894Q940m8703l1723J9234M573
15208c8721o95K8753J955j3237J5754L1422J2151j1193k3672n528M856J4618L66
15195A6829J2073j2645r570n795K0735N008j6048P69p18J8744j2920l8119J1077
15182a0580Q85j4280k7022j2789j4005J6135L4636L7096m00q216O892K0141m176
$$ plain form
15169 24317 11867 12603 1570 -3786 -1873 15416 15834 16755 17896 9319 -806 11673 9682 -56
15155 -56 1995 42976 57144 32884 16090 15203 24244 51410 76418 80852 75556 95343 132972
15142 132972 160144 186059 224917 252581 229147 225386 247932 256369 253935 276368 292050 282316
15130 282316 268685 235573 183093 167264 137785 101046 59307 40608 12664 16108 39160 45214
15118 45214 38966 46729 53190 56130 67558 48143 12511 20179 13987 30047 34749 7651 -9916
15105 -9916 22146 33024 20463 4028 817 12140 8114 -10591 -2530 -4212 -15018 -22413 4920
15092 4920 -405 -25187 -25228 -17500 -22807 -603 8059 6800 10143 -22490 5669 25167 41829 48566
15078 48566 41081 39107 40334 34834 35420 60645 80703 77964 75737 68865 83231 89323 98871 126666
$$ packed form
15169B4317j2450P36j1033n356J913J7289M18R21J141q577j0125J2479j991r738
15155e6K051M0981J4168k4260j6794q87R041K7166K5008M434n296J9787L7629
15142A32972K7172K5915L8858K7664k3434l761K2546Q437k434K2433J5682r734
15130B82316j3631l3112n2480j5829k9479l6739m1739j8699k7944L444K3052O054
15118D5214o248P763O461K940J1428j9415l5632P668o192J6060M702k7098j7567
15105i916L2062J0878j2561j6435l211J1323m026j8705Q061j682j0806p395K7333
15092D920n325k4782m1P728n307K2204Q662j259L343l2633K8159J9498J6662O737
15078D8566p485j974J227n500N86K5225K0058k739k227o872J4366O092R548K7795
$$ plain form
15064 126666 154923 171177 183238 182922 204231 198138 227445 238648 227923 236690 218417 200437
15052 200437 180358 165856 153123 119696 114206 98490 70801 44237 25490 33541 9287 -14139
15040 -14139 -13187 -7870 -12663 -24664 -15725 -1220 5962 31267 30632 46370 35899 26757 20358 25917
15026 25917 21874 12639 19907 2889 -40993 -40907 -18956 -30679 -36772 -9464 -8867 1039 6220 -11590
15012 -11590 -6201 16867 12225 35522 46283 18667 -2254 1912 -16023 -31804 -22451 -21786 -9219
14999 -9219 18806 624 -14287 -15243 7804 4717 3616 6300 2990 9810 3175 -6160 630 -16739
14985 -16739 -17204 -5080 11797 14954 2698 -711 21468 5559 4450 5161 5394 -5952 -6039 -6627
14971 -6627 -4997 -22577 -40614 -37787 -10174 -8175 -1092 5652 6183 152 -16174 -31887 -22913 -20634
$$ packed form
15064A26666K8257J6254J2061l16K1309o093K9307J1203j0725Q767j8273j7980
15052B00437k0079j4502j2733l3427n490j5716k7689k6564j8747Q051k4254k3426
15040a4139R52N317m793j2001Q939J4505P182K5305o35J5738j0471r142o399N559
15026B5917m043r235P268j7018m3882Q6K1951j1723o093K7308N97R906N181j7810
15012a1590N389K3068m642K3297J0761k7616k0921M166j7935j5781R353O65J2567
14999i219K8025j8182j4911r56K3047l087j101K684l310O820o635r335O790j7369
14985a6739m65J2124J6877L157j2256l409K2179j5909j109P11K33j1346q7n88
14971f627J630j7580j8037K827K7613J999P083O744N31o031j6326j5713Q974K279
$$ plain form
14957 -20634 2320 -1796 -24015 -13630 14847 -4423 -18772 -20742 -26302 4543 -1246 -24720
14945 -24720 -2198 -20934 -42785 -65797 -46378 -32383 -40686 -13170 -12663 -9316 3253 13167 -4441
14932 -4441 -18206 -13339 -6583 -28267 -28157 -5918 32559 37559 18361 613 4838 7940 -2329
14919 -2329 -27131 -20559 -5267 -6481 11513 -3843 -31512 -11055 1889 30415 12320 7271
14907 7271 17156 44567 55874 17865 -10336 -11300 -149 28507 2330 -2264 -23281 -23327 -8689
14894 -8689 1521 31097 37608 23074 10768 -17075 -25927 -27578 -19398 -261 1661 10917 9145
14881 9145 -7332 3341 -10942 -31676 -14183 17203 27643 -3229 -25623 -33269 -41575 -25517
14869 -25517 -15248 -25046 -6340 -14427 -25344 979 25981 -5639 -27846 -11252 -79 16502
$$ packed form
14957b0634K2954m116k2219J0385K8477j9270j4349j970n560L0845n789k3474
14945b4720K2522j8736k1851k3012J9419J3995q303K7516N07L347J2569R914j7608
14932d441j3765M867O756k1684J10K2239L8477N000j9198j7748M225L102j0269
14919b329k4802O572J5292j214J7994j5356k7669K0457J2944K8526j8095n049
14907G271R885K7411J1307l8009k8201r64J1151K8656k6177m594k1017m6J4638
14894h689J0210K9576O511j4534j2306k7843q852j651Q180J9137J922R256j772
14881I145j6477J0673j4283k0734J7493L1386J0440l0872k2394p646q306J6058
14869b5517J0269r798J8706q087j0917K6323K5002l1620k2207J6594J1173J6581
$$ plain form
14857 16502 13878 -7322 -24778 -32523 -52712 -47877 -36189 -26714 -39775 -34490 -15100 -8644 586
14844 586 -8268 -26353 -39078 -31934 -22412 -17803 -6524 -22167 -38787 -21548 4561 13193 20554
14831 20554 21419 13576 -848 10617 5864 -12975 4562 21196 7116 -15214 -31404 -17649
14819 -17649 -41536 -20229 -10746 -14729 -3785 -30412 -31652 -18426 -685 -11486 -21740 -13521
14807 -13521 -12183 -10094 -4509 23892 16304 -1903 -28016 -34477 -25474 -30548 -21012 -5290 5982
14794 5982 13440 11574 4571 1651 13091 12985 -7505 6630 37451 43588 10424 -980 -4088
14781 -4088 -3001 11492 6647 18036 -175 4879 2990 -1131 5595 11638 15640 -12012 -10244 -9491
14767 -9491 -27928 -12728 -5338 1992 -1550 -15450 -18163 -20121 -13187 -31850 -24387 -13888 -22117
$$ packed form
14857A6502k624k1200j7456p745k0189M835J1688R475j3061N285J9390O456R230
14844E86q854j8085j2725P144R522M609J1279j5643j6620J7239K6109Q632P361
14831B0554Q65p843j4424J1465m753j8839J7537J6634j4080k2330j6190J3755
14819a7649k3887K1307R483l983J0944k6627j240J3226J7741j0801j0254Q219
14807a3521J338K089N585K8401p588j8207k6113o461R003n074R536J5722J1272
14794E982P458j866p003k920J1440j06k0490J4135L0821O137l3164j1404l108
14781d088J087J4493m845J1389j8211N054j889m121O726O043M002k7652J768P53
14767i491j8437J5200P390P330l542j3900k713j958O934j8663P463J0499q229
$$ plain form
14754 -22117 -29774 -27341 -55823 -57391 -48719 -46658 -29761 -6072 4545 -28394 -22105 -2035 7365
14741 7365 19603 16137 5898 447 -11042 -16147 -29040 -24761 -5167 -7419 -6986 -1819 27285
14728 27285 36014 38888 2460 -4789 7074 9683 -14687 -23873 -16592 9492 26600 25541 21120
14715 21120 12161 -1981 -22240 -6237 -26161 -29087 673 -2274 -16497 -40004 -28205 5436
14703 5436 -7771 -17007 -29518 -14229 -11102 433 23356 8902 16090 6244 -4542 -15757 6943
14690 6943 11135 -5902 814 13000 15558 2049 6661 24140 25955 24161 10954 -11200 -19910
14677 -19910 -20238 -3473 -20239 -12403 -178 246 545 -23770 -3139 4979 15815 14917 8853 -6867
14663 -6867 -17900 -23447 -35384 -36389 -35937 -16469 18523 22650 8064 -5948 -14983 -41738 -47280
$$ packed form
14754b2117p657K433k8482j568Q672K061J6897K3689J0617l2939O289K0070R400
14741G365J2238l466j0239n451j1489n105j2893M279J9594k252M33N167K9104
14728B7285Q729K874l6428p249J1863K609k4370r186P281K6084J7108j059m421
14715B1120q959j4142k0259J6003j9924k926K9760k947j4223k3507J1799L3641
14703E436j3207r236j2511J5289L127J1535K2923j4454P188r846j0786j1215K2700
14690F943M192j7037O716J2186K558j3509M612J7479J815j794j3207k2154q710
14677a9910l28J6765j6766P836J2225M24K99k4315K0631Q118J0836q98o064j5720
14663f867j1033n547j1937j005M52J9468L4992M127j4586j4012r035k6755n542
$$ plain form
14650 -47280 -40474 -63744 -91220 -75888 -49933 -19868 -8009 15936 30109 19417 -2051 -11599
14638 -11599 180 21848 28391 14780 20054 24407 29512 33134 14694 1791 4843 -399 12795
14625 12795 30455 19420 -18711 -41255 -39483 -7681 23020 38437 43912 64711 47402 17263
14613 17263 1279 -21225 -31468 -17774 -19187 -28196 -44304 -29448 -15233 -16041 -15057 -13395 14766
14600 14766 19939 30576 37589 53389 41871 18811 22040 24069 6540 -18093 -20581 -15420 -17965
14587 -17965 -41112 -54030 -57056 -51431 -46327 -28904 -5251 31974 52055 32606 -2999 12040
14575 12040 34353 23967 -1950 -31894 -36282 -21237 -6865 2910 -6283 -2803 12051 -3201
14563 -3201 -14517 -10148 15509 26738 31677 2677 -21152 -41357 -32115 -26186 -22181 -21497 -23515
$$ packed form
14650d7280O806k3270k7476J5332K5955L0065J1859K3945J4173j0692k1468r548
14638a1599J1779K1668O543j3611N274M353N105L622j8440j2903L052n242J3194
14625A2795J7660j1035l8131k2544J772L1802L0701J5417N475K0799j7309l0139
14613A7263j5984k2504j0243J3694j413r009j6108J4856J4215q08R84J662K8161
14600A4766N173J0637P013J5800j1518k3060L229K029j7529k4633k488N161k545
14587a7965k3147j2918l026N625N104J7423K3653L7225K0081j9449l5605J5039
14575A2040K2313j0386k5917k9944m388J5045J4372R775r193L480J4854j5252
14563c201j1316M369K5657J1229M939k9000k3829k0205R242N929M005O84k018
$$ plain form
14550 -23515 -12035 -18850 -12308 1106 5436 -19831 -38642 -28660 -2447 20408 20905 51611 49422
14537 49422 9451 494 -43852 -59215 -32700 -26473 -7777 4787 8184 -6050 -9542 -12540 -16772
14524 -16772 -34546 -36411 -24320 6005 11171 9628 505 882 -5857 -35736 -225 8888 4326
14511 4326 -5201 6892 39168 28487 2432 3180 876 -28338 -44287 -53240 -21831 -18297 -34289
14498 -34289 -39744 -29170 -25456 2529 10102 -16505 -34825 -43046 -20866 -18840 -23109 303 16203
14485 16203 6429 16249 29233 28226 2764 -7990 -20401 -24995 -34800 -10138 32591 36401 43863
14472 43863 53390 39535 40736 24828 2880 -1647 -2151 8315 43067 39994 27413 7072 -16034
14459 -16034 -18319 -1594 16802 -3766 -5228 -1516 -11939 5741 26208 20182 10080 53734
$$ packed form
14550b3515J1480o815O542J3414M330k5267j8811R982K6213K2855M97L0706k189
14537D9422l9971q957m4346j5363K6515O227J8696J2564L397j4234l492k998m232
14524a6772j7774j865J2091L0325N166j543r123L77o739k9879L5511R113m562
14511D326r527J2093L2276j0681k6055P48k304k9214j5949q953L1409L534j5992
14498c4289n455J0574L714K7985P573k6607j8320q221K2180K026m269K3412J5900
14485A6203r774R820J2984j007k5462j0754j2411m594r805K4662M2729L810P462
14472D3863R527j3855J201j5908k1948m527n04J0466L4752l073j2581k0341k3106
14459a6034k285J6725J8396k0568j462L712j0423J7680K0467o026j0102M3654
$$ plain form
14447 53734 70341 43755 26713 31637 29158 18738 14403 -6155 -3865 2358 11599 -5973 2658
14434 2658 -2888 -156 -1147 -9494 -4990 -12718 5842 -13524 -18640 -19292 -29261 -42936 -55256 -24429
14420 -24429 4820 -12954 -23740 -12786 -4672 -19331 -24682 -21777 10581 23061 7994 -20214
14408 -20214 -25513 -38596 -33760 -12868 7608 -15129 -33754 -9803 4945 40434 48632 11974
14396 11974 -18995 -29396 -15658 5017 29270 35030 17153 8644 -12818 9036 21132 21918
14384 21918 -14564 -16498 9184 26871 33531 8380 1907 6977 -5593 -11100 4130 28619 22809
14371 22809 22211 23019 -5269 5337 21570 23987 46869 19090 21968 24727 -1343 -11654 -13537
14358 -13537 -664 16926 31994 46952 25775 -8546 -9139 3587 4571 -16673 -25612 -5234 7236
$$ packed form
14447E3734J6607k6586j7042M924k479j0420m335k0558K290O223R241j7572Q631
14434B658n546K732r91q347M504p728J8560j9366n116o52r969j3675j2320L0827
14420b4429K9249j7774j0786J0954Q114j4659n351K905L2358J2480j5067k8208
14408b0214n299j3083M836K0892K0476k2737j8625K3951J4748L5489Q198l6658
14396A1974l0969j0401J3738K0675K4253N760j7877q509k1462K1854J2096P86
14384B1918l6482j934K5682J7687O660k5151o473N070j2570n507J5230K4489n810
14371B2809n98Q08k8288J0606J6233K417K2882k7779K878K759k6070j0311j883
14358a3537J2873J7590J5068J4958k1177l4321n93J2726R84k1244q939K0378J2470
$$ plain form
14345 7236 11047 12653 -1716 -5994 -4148 25276 42848 2237 -17385 -17296 -2330 26865 35867
14332 35867 39036 25104 15056 2677 -7123 7968 -20549 -16462 -13740 3168 10124 7631 314
14319 314 26205 38681 23193 1203 -13678 -19229 -15411 -30307 -40415 -45766 -46957 -51139 -41155
14306 -41155 -42691 -55154 -49070 -14777 4397 36576 15184 13296 13767 10997 -697 -23478 -20167
14293 -20167 3231 23881 -2158 -16138 -10903 17037 19088 18122 19572 -14235 -12975 -3880 4594
14280 4594 -12417 -17495 -38727 -20536 3652 3329 -14544 -21512 -19563 -19594 -24852 -58075 -17156 -8139
14266 -8139 -3139 -16878 -20503 13202 22599 20636 14402 24950 44126 42846 35875 11306 -4155
14253 -4155 9563 -12617 -18262 -9825 2227 -3677 22062 22067 26766 22602 12417 34283 21096 28985
$$ packed form
14345G236L811J606j4369m278J846K9424J7572m0611j9622Q9J4966K9195R002
14332C5867L169j3932j0048j2379r800J5091k8517M087K722J6908O956k493p317
14319C14K5891J2476j5488k1990j4881n551L818j4896j0108n351j191m182R984
14306d1155j536j2463O084L4293J9174L2179k1392j888M71k770j1694k2781L311
14293b0167K3398K0650k6039j3980N235K7940K051r66J450l3807J260R095Q474
14280D594j7011n078k1232J8191K4188l23j7873o968J949l1n258l3223M0919R017
14266h139N000j3739l625L3705R397j963o234J0548J9176j280o971k4569j5461
14253d155J3718k2180n645Q437J2052n904K5739NM699m164j0185K1866j3187P889
$$ plain form
14239 28985 46551 53747 25652 3358 631 14407 22848 20043 25446 33934 32984 9424 29645
14226 29645 41892 39346 39230 20400 2786 -16615 -10794 3072 12545 15191 29520 -12259 -67235
14213 -67235 -73740 -53602 -49433 -12258 12539 28467 20276 19610 7247 -10379 -14355 -5761 10793
14200 10793 11089 -16148 -12417 -7746 -23642 -20574 -2641 304 -6580 -6740 7780 5499 -10156 -50682
14186 -50682 -44312 -47565 -45211 -56179 -56446 -59858 -24466 -15115 -31608 -26336 -27914 -16597 17203
14173 17203 11273 -16943 -2831 -4095 1980 -17488 -57169 -69307 -73080 -66500 -54968 -30570 -19782
14160 -19782 -10408 -532 -34748 -32201 -19233 -1949 12832 33947 28127 8822 35492 43556 53759
14147 53759 43318 31095 21047 38255 64148 40989 30461 -778 -49306 -71094 -85827 -79312
$$ packed form
14239B8985J7566P196k8095k2294k727J3776Q441k805N403Q488r50k3560K0221
14226B9645J2247k546j16j8830j7614j9401N821J3866R473K646J4329m1779n4976
14213f7235o505K0138M169L7175K4797J5928q191o66j2363j7626l976Q594J6554
14200A0793K96k7237L731M671j5896L068J7933K945o884j60J4520k281j5655m0526
14186e0682O370l253K354j0968k67l412L5392R351j6493N272j578J1317L3800
14173A7203n930k8216J4112j264O075j9468l9681j2138l773O580J1532K4398J0788
14160a9782R374R876l4216K547J2968J7284J4781K1115n820j9305K6670Q064J0203
14147E3759j0441j2223j0048J7208K5893k3159j0528l1239m8528k1788j4733O515
$$ plain form
14135 -79312 -42959 -24986 -25791 -31730 -29544 -18920 -28080 -36260 -55839 -43535 -24373 -30884 -5485
14122 -5485 -3902 -5092 24416 15122 9566 -4766 -9549 -5271 -3683 -8309 -12067 225 -7434 -3130
14108 -3130 -4916 -27018 -42914 -23069 438 7759 -9016 -40839 -43527 -45291 -49289 -17715 508
14095 508 7313 24230 34880 42191 44943 25350 -2913 -12086 17136 15453 -4525 -10707 -12698
14082 -12698 -14243 -10311 -18635 -23637 -35824 -35149 7184 14167 14053 14094 15456 4338 4276 18222 -995
14067 -995 -12894 -11225 13807 10537 -7204 -15955 8778 28883 20731 1661 -18854 -34335 -17867
14054 -17867 -28338 -80 9868 14604 -7865 -11323 3025 15138 6231 -6431 -665 -2737 24351
14041 24351 44293 17234 -3027 -6834 9787 23884 20674 21157 8707 -1690 16964 8959 -37221
$$ packed form
14135g9312L6353J7973q05n939K186J0624r160q180j9579J2304J9162o511K5399
14122e485J583j190K9508r294n556j4332m783M278J588m626l758J2292p659M304
14108c130j786k2102j5896J9845K3507P321j6775l1823k688j764l998L1574J8223
14095E08O805J6917J0650P311K752j9593k8263r173K9222j683j9978o182j991
14082a2698j545L932q324n002j2187O75M2333O983j14M1J362j1118o2J3946j9217
14067i95j1899J669K5032l270j7741q751K4733K0105q152j9070k0515j5481J6468
14054a7867j0471K8258R948M736k2469l458J4348J2113q907j2662N766k072K7088
14041B4351J9942k7059k0261l807J6621J4097l210M83j2450j0397J8654q005m6180
$$ plain form
14028 -37221 -37733 -5755 -10722 18657 30760 -1025 -19363 -34574 -32391 -30253 -35041 -23660 -29386
14015 -29386 -18616 -8624 18879 27896 7359 -18088 -13459 -18779 -18961 -32546 -46505 -26915 -11010
14002 -11010 628 -23881 -43042 -61404 -64640 -47713 -46624 -46621 -41558 -11482 -9789 -9518 -17881 -28150
13988 -28150 -16770 180 8724 1985 -2193 -3453 1110 2872 14427 14697 25672 30509 4515
13975 4515 -18665 -2303 11913 18176 12843 20063 21831 18495 15781 -6582 -32126 -18717 -8293
13962 -8293 -18549 -32040 -14615 -5712 3095 20045 17253 39504 29357 26376 12258 14494 30234
13949 30234 36502 38301 24847 20891 27982 51060 36104 31611 -12190 -39036 -32464 -22640 -13512
13936 -13512 -201 12489 -14498 -13386 -20292 -25269 -10474 2450 -15734 -6126 3366 -8304 -44839
$$ packed form
14028c7221n12L1978m967K9379J2103l1785j8338j5211K183K138m788J1381n726
14015b9386J0770R992K7503R017k0537k5447M629n320j82j3585j3959J9590J5905
14002a1010J1638k4509j9161j8362l236J6927J089LN063L0076J693K71q363j0269
13988b8150J1380J6950Q544o739m178j260M563J762J1555K70J0975M837k5994
13975D515k3180J6362J4216O263n333P220J768l336k714k2363k5544J3409J0424
13962h293j0256j3491J7425Q903Q807J6950k792K2251j0147k981j4118K236J5740
13949C0234O268J799j3454l956P091K3078j4956m493m3801k6846O572R824R128
13936a3512J3311J2690k6987J112o906m977J4795J2924j8184R608R492j1670l6535
$$ plain form
13923 -44839 -38326 -9535 -6287 -16851 -3458 13882 -18367 -30609 -11242 8079 -1879 -3738
13911 -3738 -10241 -3750 16461 13079 14026 1231 -7233 849 -47679 -42477 -25234 127 12918
13898 12918 9353 22543 11846 48 -23174 -17828 -4041 10409 10112 -17499 -5626 13775
13886 13775 3753 1992 -4735 -19421 2120 -10146 -23310 -14733 -17338 -23976 -19920 -22118 -31278
13873 -31278 -31809 -63447 -59218 -27507 -44362 -31919 -19136 -7873 -14155 -36756 -41314 -26653 -6062
13860 -6062 -6499 -9919 -8075 -167 13517 6782 13443 18481 23130 40976 60901 42451 23911 62833
13846 62833 78335 52580 15085 -17385 -34019 -25121 -10293 1473 20406 -7417 4974 25725
13834 25725 34184 36077 13778 -16036 -7832 154 4408 27482 24686 31345 44205 45837 46108 58470
$$ packed form
13923d4839O513K8791L248j0564J3393J7340l2249j2242J9367J9321r958j859
13911c738o503O491K0211l382R47j2795q464Q082m8528N202J7243K5361J2791
13898A2918l565J3190j0697j1798k3222N346J3787J4450k97k7611J1873J9401
13886A3775j0022j761o727j4686K1541j2266j3164Q577k605o638M056k198r160
13873c1278n31l1638M229L1711j6855J2443J2783J1263o282k2601m558J4661K0591
13860f062m37l420J844P908J3684o735O661N038M649J7846J9925j8450j8540L8922
13846F2833J5502k5755l7495l2470j6634Q898J4828J1766J8933k7823J2391K0751
13834B5725Q459J893k2299k9814Q204P986M254K3074k796O659J2860J632K71J2362
$$ plain form
13820 58470 57355 61924 65655 37680 -3994 -12114 -3985 12023 15721 12999 -25481 -23850 6900
13807 6900 26679 30050 32494 14104 75 15084 14628 31938 45844 40747 2378 -20165 -21147
13794 -21147 -8140 19860 68422 46132 24524 6323 -446 5247 14895 46150 64965 63543
13782 63543 40253 42486 47126 42003 52191 34019 20241 4629 -5072 -13426 -11890 -984 19074
13769 19074 14175 -8629 -15255 -2960 11657 3985 31474 -947 -46563 -57500 -14547 -10968
13757 -10968 -2302 -15897 -26017 -29497 -19232 -14046 25778 11572 -17238 -23358 -5943 -5569 26126
13744 26126 65456 55082 30149 17694 36787 65043 34827 -3029 -569 17623 2591 -26809
13732 -26809 -39032 -34605 -7664 -1966 2141 17919 1144 -20688 -7820 2262 -890 -18471
$$ packed form
13820E8470j115M569L731k7975m1674q120Q129J6008L698k722l8480J631L0750
13807F900J9779L371K444j8390j4029J5009m56J7310J3906n097l8369k2543r82
13794b1147J3007K8000M8562k2290k1608j8201o769N693R648L1255J8815j422
13782F3543k3290K233M640n123J0188j8172j3778j5612r701q354J536J0906K0058
13769A9074m899k2804o626J2295J4617p672K7489l2421m5616j0937M2953L579
13757a0968Q666j3595j0120l480J0265N186L9824j4206k8810o120J7415L74L1695
13744B6126L9330j0374k4933j2455J9093K8256l0216l7856K460J8192j5032k9400
13732b6809j2223M427K6941N698M107J5778j6775k1832J2868J0082l152j7581
$$ plain form
13720 -18471 -16064 4646 3144 -4799 2809 14014 22730 48347 65495 53741 18016 19215 6240
13707 6240 -12208 -2805 -1036 -18984 1586 19661 34654 56643 60240 54412 56411 40504 32964
13694 32964 12361 -7680 -13392 -1078 -16518 -29856 -29310 -3815 -2988 -18715 -37552 -19581 1078
13681 1078 -200 -1314 27401 31218 28190 19482 24192 37720 43740 54449 40078 19194 -8998
13668 -8998 -14828 -18782 336 23703 33997 51179 48565 6247 -17767 -22284 -16301 -7209 -21947
13655 -21947 -34757 -34832 -34978 -11634 -4501 -12312 -5538 1146 15587 23115 -1681 -14290 1503 10851
13641 10851 -2193 -15477 -18441 -14643 -21746 -35870 -35536 -15956 -960 -16681 -38578 -36535 -7426
13628 -7426 -17740 -28086 -40257 -23186 -15555 1540 22339 21681 32625 -9872 -15575 -4799 -19818
$$ packed form
13720a8471K407K0710j502p943P608J1205Q716K5617J7148j1754l5725J199j2975
13707F240j8448R403J769j7948K0570J8075J4993K1989L597n828J999j5907p540
13694C2964k0603k0041n712J2314j5440j3338N46K5495Q27j5727j8837J7971K0659
13681A078j278j114K8715L817l028q708M710J3528O020J0709j4371k0884k8192
13668h998n830l954J9118K3367J0294J7182k614m2318k4014m517N983R092j4738
13655b1947j2810p5j46K3344P133p811O774O684J4441P528k4796j2609J5793R348
13641A0851j3044j3284k964L798p103j4124L34J9580J4996j5721k1897K043K9109
13628g426j0314j0346j2171J7071P631J7095K0799o58J0944m2497n703J0776j5019
$$ plain form
13615 -19818 -17780 15250 32078 15548 26111 30546 8627 1950 20862 21103 33234 32103 28017
13602 28017 26609 8929 32329 24170 -5100 -30867 -3354 16850 6097 9785 22857 14250
13590 14250 28686 7859 10234 7529 -1596 3581 18781 14787 30539 28188 -14103 -37653 -31199
13577 -31199 -2594 13775 15998 18641 7205 1308 -3051 3161 9850 5539 -3730 -12640 -28515
13564 -28515 -16821 2317 -1850 21823 14275 -4521 13834 2562 -6081 -21415 -19765 -4662
13552 -4662 5432 17727 24353 15318 22523 25470 26692 15086 27896 8220 -17180 -2692 12760
13539 12760 -8461 -24242 -30076 -27065 -25798 919 22091 22792 30912 15079 10490 5007 24146
13526 24146 17503 3634 -11405 -29159 -26962 -1592 33537 12472 4329 3108 19702 21434 -2400
$$ packed form
13615a9818K038L3030J6828j6530J0563M435k1919o677J8912K41J2131j131m086
13602B8017j408j7680K3400q159k9270k5767K7513K0204j0753L688J3072q607
13590A4250J4436k0827K375k705r125N177J5200l994J5752k351m2291k3550O454
13577c1199K8605J6369K223K643j1436n897m359O212O689m311r269q910j5875
13564b8515J1694J9138m167K3673p548j8796J8355j1272q643j5334J650J5103
13552d662J0094J2295O626r035P205K947J222j1606J2810j9676k5400J4488J5452
13539A2760k1221j5781n834L011J267K6717K1172P01Q120j5833m589n483J9139
13526B4146o643j3869j5039j7754K197K5370L5129k1065q143j221J6594J732k3834
$$ plain form
13513 -2400 -6430 -392 -21987 -16260 -15640 -25689 -24625 7905 24491 36594 26315 15714 -13908
13500 -13908 -14174 3558 16381 7535 9889 9484 11640 16805 -13156 -20662 2933 13092 17075 36610
13486 36610 38637 28544 14295 20224 30752 14704 -4247 17749 32642 44862 28386 863
13474 863 2828 -18907 2101 5550 7749 20708 37669 47330 62015 34897 20239 4043 5963
13461 5963 10451 -9320 2702 18942 8922 15802 33224 41700 22137 -15735 -21582 -22324 13526
13448 13526 47908 59194 68199 31196 -7142 13381 29461 18161 20232 62776 65718 59024
13436 59024 50876 40094 28111 37040 47468 16334 7018 5160 -5681 -2174 6636 -8420 -36519
13423 -36519 -45003 -30097 -3331 639 27167 66384 68159 7206 -2283 -10758 -8739 20311 10150
$$ packed form
13513b400m030O038k1595N727O20j0049J064L2530J6586J2103j0279j0601k9622
13500a3908k66J7732J2823q846K354m05K156N165k9961p506K3595J0159L983J9535
13486C6610K027j0093j4249N929J0528j6048j8951K1996J4893J2220j6476k7523
13474H63J965k1735K1008L449K199J2959J6961R661J4685k7118j4658j6196J920
13461E963M488j9771J2022J6240j0020O880J7422Q476j9563l7872n847p42L5850
13448A3526L4382J1286R005l7003l8338K0523J6080j1300K071M2544K942o694
13436E9024q148j0782j1983Q929J0428l1134r316j858j0841L507Q810j5056k8099
13423c6519q484J4906K6766L970K6528L9217J775o0953r489q475K019K9050j0161
$$ plain form
13410 10150 -17623 -18262 6971 -15416 -34009 -26431 -43687 -51785 -23000 -1600 -6549 2651 28663
13397 28663 25563 42664 17500 -20337 -22919 -35201 -44035 -38996 6094 25774 10633 11209 21849
13384 21849 50320 55731 57015 36164 31000 37678 16507 -16075 -7806 10494 38494 35518 42205
13371 42205 42002 57932 41928 7592 42465 86921 55919 31537 11085 19374 25786 41219
13359 41219 33130 21404 26736 8883 -9693 5999 9798 -5129 11079 33550 40781 44703 47769
13346 47769 27089 18064 6725 -14985 -14302 30493 45776 44634 58013 66333 89977 101739 95919
13333 95919 55689 22561 7012 3392 -3189 14874 13103 36272 36506 42853 61285 21816 -3228
13320 -3228 -2390 -5125 -10034 -4508 394 3861 -29028 -36564 -23534 -1637 18367 20355 22417 -8177
$$ packed form
13410A0150k7773o39K5233k2387j8593P578j7256q098K8785K1400m949R200K6012
13397B8663l100J7101k5164l7837k582j2282q834N039M5090J9680j5141N76J0640
13384B1849K8471N411J284k0851n164O678k1171l2582Q269J8300K8000k976O687
13371D2205k03J5930j6004l4336L4873M4456l1002k4382k0452Q289O412J5433
13359D1219q089j1726N332j7853j8576J5692L799j4927J6208K2471P231L922L066
13346D7769k0680r025j1339k1710O83M4795J5283j142J3379Q320K3644J1762n820
13333I5919m0230l3128j5549l620o581J8063j771K3169K34O347J8432l9469k5044
13320c228Q38k735m909N526M902L467l2889p536J3030K1897K0004J988K062l0594
$$ plain form
13306 -8177 4069 -552 -16604 -14255 8574 29678 -2426 -43306 -61276 -45066 -32934 -33644 7697
13293 7697 29582 21376 21372 21215 21435 24788 25639 31334 24256 19165 24948 -6301 -5042 1871 29257
13278 29257 29973 3993 5978 3400 -320 -11280 6343 -9141 -13738 -7553 2475 2535 -14963 7303
13264 7303 12422 13188 26136 49837 49900 34093 14676 25871 29945 15617 12388 707 -11084
13251 -11084 21017 14439 -8284 17253 38676 13454 -5314 -11770 -3523 22309 26758 37547
13239 37547 40914 14110 9425 20158 15176 5935 1704 3740 -7627 -25044 -15723 -3896 -17140
13226 -17140 -4266 15577 17229 9479 -6935 18019 10626 -5971 10400 28895 26977 15924
13214 15924 20257 24869 8344 20664 28705 17693 18678 33542 50538 44394 15116 19551 25598
$$ packed form
13306h177J2246m621j6052K349K2829K1104l2104m0880j7970J6210J2132p10M1341
13293G697K1885q206mj57K20L353Q51N695p078n091N783l1249J259O913K7386
13278B9257P16k5980J985k578l720j0960J7623j5484m597O185J0028O0j7498K2266
13264G303N119P66J2948K3701O3j5807j9417J1195M074j4328l229j1681j1791
13251a1084L2101o578k2723K5537K1423k5222j8768o456Q247K5832M449J0789
13239C7547L367k6804m685J0733m982r241m231K036j1367j7417R321J1827j3244
13226a7140J2874J9843J652p750j6414K4954p393j6597J6371J8495j918j1053
13214A5924M333M612j6525J2320Q041j1012R85J4864J6996o144k9278M435O047
$$ plain form
13201 25598 28669 23367 37753 62065 44552 31752 22025 22230 -5892 -10047 8620 5061 -17744
13188 -17744 -195 30876 17003 15364 27195 18458 -14596 9712 28938 35764 11659 12477 -651
13175 -651 -28962 -28559 -12684 -929 45468 64595 53907 25414 18974 -2738 -39093 -32701 -20986
13162 -20986 -9240 14884 23232 32608 34654 13943 23060 2543 -22177 -20072 -16461 -4016 34310
13149 34310 56655 54462 33359 33576 44684 45178 21798 -2907 -2589 9228 4445 740 14897
13136 14897 37816 50524 42206 25067 15727 10539 30909 22970 17443 20808 8350 -1313 9650
13123 9650 18708 38550 19711 13289 20354 19631 16837 190 -16967 -26406 -12212 -15809 -12122 8995
13109 8995 -10853 -18293 -26479 -17509 3801 -6812 10564 34190 22681 20833 23909 38351 43613
$$ packed form
13201B5598L071n302J4386K4312j7513j2800r727K05k8122m155J8667l559k2805
13188a7744J7549L1071j3873j639J1831q737l3054K4308J9226O826k4105Q18j3128
13175f51k8311M03J5875J1755M6397J9127j0688k8493o440k1712l6355O392J1715
13162b0986J1746K4124Q348R376K046k0711R117k0517k4720K105L611J2445L8326
13149C4310K2345k193k1103K17J1108M94k3380k4705L18J1817m783l705J4157
13136A4897K2919J2708q318j7139r340n188K0370p939n527L365j2458r663J0963
13123I650R058J9842j8839o422P065p23k794j6647j7157r439J4194l597L687K1117
13109H995j9848p440q186Q970K1310j0613J7376K3626j1509j848L076J4442N262
$$ plain form
13096 43613 51646 41327 16299 8948 8899 25809 53459 51792 46573 23306 24286 26908 23006 9245
13082 9245 19695 17037 27999 3968 -20 25685 31314 48991 37344 20810 19477 37617 40316
13069 40316 43990 21678 1481 3765 2479 3661 -6869 -20168 -38533 1179 23935 17295 21587
13056 21587 34499 42442 35206 1951 25062 32801 31432 32959 53225 48091 31827 -6338 -7271
13043 -7271 -7019 17931 14621 21111 32392 11314 3397 11111 1338 -2562 4634 467 -636 -472
13029 -472 12936 35254 32490 21205 -8609 -2352 -8499 12970 9159 3608 27030 42261 14663
13016 14663 10686 16020 -6750 -10144 6296 23652 19434 17313 17284 16064 14042 38730 29731 35616
13002 35616 31496 4577 15162 27499 33835 20568 7710 -10584 19641 18640 5192 14242
$$ packed form
13096D3613Q033j0319k5028p351m9J6910K7650j667n219k3267R80K622l902j3761
13082I245J0450k658J0962k4031l988K5705N629J7677j1647j6534j333J8140K699
13069D0316L674k2312k0197K284j286J182j0530j3299j8365L9712K2756o640M292
13056B1587J2912P943p236l3255K3111P739j369J527K0266n134j6264l8165r33
13043g271K52K4950l310O490J1281k1078p917P714r773l900P196m167j103J64
13029d72J3408K2318k764j1285k9814O257o147K1469l811n551K3422J5231k7598
13016A4663l977N334k2770l394J6440J7356m218k121k9j220k022K4688q999N885
13002C5616m120k6919J0585J2337O336j3267j2858j8294L0225j001j3448R050
$$ plain form
12990 14242 28661 54531 44649 40390 28413 9832 -4825 -9587 -918 -4343 610 25956 69085
12977 69085 59113 36545 12485 -6256 -35686 -36136 -33138 -21107 -20857 -25555 -30429 -17814 -4005
12964 -4005 -9394 -22001 -29396 -1313 -13819 -29986 -5815 -1134 -25949 -45302 -33715 -49035
12952 -49035 -45854 -24548 -13014 -22721 -25254 -947 14758 10953 22934 9935 -19637 -27548 -23628
12939 -23628 -33549 -24924 20424 34208 24976 31432 18649 24573 29596 23846 11819 36281 35648
12926 35648 44372 41679 28189 37387 57806 71705 74502 62525 48311 54615 60298 30344 24169
12913 24169 28479 20453 18455 4818 13748 17919 -6615 -7520 -12659 310 55165 71711 68365
12900 68365 59431 45070 42055 49000 75460 82991 73444 61401 79842 77157 52934 34187 46553
$$ packed form
12990A4242J4419K5870r882m259j1977j8581j4657m762Q669l425M953K5346M3129
12977F9085r972k2568k4060j8741k9430m50K998J2031K50m698m874J2615J3809
12964d005n389j2607p395K8083j2506j6167K4171M681k4815j9353J1587j5320
12952d9035L181K1306J1534r707k533K4307J5705l805J1981j2999k9572p911L920
12939b3628r921Q625M5348J3784r232O456j2783N924N023n750j2027K4462o33
12926C5648Q724k693j3490R198K0419J3899K797j1977j4214O304N683k9954o175
12913B4169M310q026j998j3637Q930M171k4534r05n139J2969N4855J6546l346
12900F8365q934j4361l015O945K6460P531r547j2043J8441k685k4223j8747J2366
$$ plain form
12887 46553 42952 28387 24995 16266 -4086 -3438 12972 12025 -7030 26969 67019 65373 45061
12874 45061 63671 70490 67921 69560 74364 48505 43365 46493 35896 29509 24000 16792 33266
12861 33266 39644 26180 9516 14623 41505 35802 36101 67578 85769 72459 52973 31904 30282
12848 30282 16035 16935 3381 3376 36403 27268 19707 7164 -924 8567 18365 26274 7744 -17284
12834 -17284 16698 51019 67555 65399 57066 45109 50265 67766 71002 51343 25254 18884 25891
12821 25891 13745 14290 25540 13098 28364 56742 47894 39334 37924 24121 14034 24834 33720
12808 33720 35816 41250 64159 65608 21135 16344 30385 37976 47770 64121 49333 40395 25958
12795 25958 20280 23604 33903 11986 -6688 28379 18687 15322 14815 25872 23771 16264 18450
$$ packed form
12887D6553l601j4565l392q729k0352O48J6410r47j9055L3999M0050j646k0312
12874D5061J8610O819k569J639M804k5859n140L128j0597o387n509p208J6474
12861C3266O378j3464j6664N107K6882n703K99L1477J8191j3310j9486k1069j622
12848C0282j4247R00j3554nL3027r135p561j2543q088R491R798P909j8530k5028
12834a7284L3982L4321J6536k156q333j1957N156J7501L236j9659k6089o370P007
12821B5891j2146N45J1250j2442J5266K8378q848q560j410j3803j0087J0800Q886
12808C3720K096N434K2909J449m4473m791J4041P591R794J6351j4788q938j4437
12795B5958n678L324J0299k1917j8674L5067r692l365n07J1057k101p507K186
$$ plain form
12782 18450 14063 3017 -15761 443 -10239 -21500 3404 17078 9113 9522 46088 44758 36701
12769 36701 22287 26523 9535 -3129 18370 29811 36630 16423 -8124 5778 58246 78193
12757 78193 39901 28326 28464 17509 46 -3207 8997 14865 35971 67110 77335 54491
12745 54491 42002 64125 35265 22317 29101 -9155 17135 18925 25106 34903 35697 26535 26881
12732 26881 14049 12791 17089 23932 -11555 -4973 7815 23791 39486 38418 46698 27393 9847
12719 9847 4059 14386 37000 36683 35802 54065 53355 35390 33848 43063 28903 50702 69684 57815
12705 57815 34535 18436 24983 40152 39295 19946 14283 39115 54037 50104 40743 26235 25343
12692 25343 19782 21050 23794 7986 6484 33264 56170 69891 33217 15191 30210 8981
$$ packed form
12782A8450m387j1046j8778J6204j0682j1261K4904J3674p965M09L6566j330q057
12769C6701j4414M236j6988j2664K1499J1441O819k0207k4547J3902N2468J9947
12757G8193l8292j1575J38j0955j7463l253J2204N868K1106L1139J0225k2844
12745E4491j2489K2123k8860j2948O784l8256K6290J790O181R797P94r162L46
12732B6881j2832j258M298O843l5487O582J2788J5976J5695j068Q280j9305j7546
12719I847n788J0327K2614l17q81J8263p10j7965j542R215j4160K1799J8982j1869
12705E7815k3280j6099O547J5169q57j9349n663K4832J4922l933r361j4508q92
12692B5343n561J268K744j5808j502K6780K2906J3721l6674j8026J5019k1229
$$ plain form
12680 8981 -7621 23466 43883 42665 31146 47621 40424 47775 80589 93323 81526 74553 96369
12667 96369 109225 123335 145334 161122 140508 138708 166809 161281 144489 130271 92541 55155
12655 55155 42517 44807 46541 47025 68562 78724 67548 75957 58060 21245 30865 36669 32973
12642 32973 1671 4325 57341 103073 122155 106081 66628 69889 66407 65479 93568 128468 124881
12629 124881 110833 109862 103320 107784 128252 184014 240589 307401 400154 468494 492956 497291
12617 497291 475711 455469 388022 326113 280491 234329 179965 145456 143431 132396 123205 108657
12605 108657 112884 111285 111525 103590 90388 70443 70157 83498 79528 73870 63569 63095 59439 85363
12591 85363 104477 105734 69434 72377 78610 101103 97112 85904 86732 103626 121701 131273 153936
$$ packed form
12680H981j6602L1087K0417j218j1519J6475p197P351L2814J2734j1797o973K1816
12667I6369J2856J4110K1999J5788k0614j800K8101n528j6792j4218l7730l7386
12655E5155j2638K290J734M84K1537J0162j1176Q409j7897l6815R620N804l696
12642C2973l1302K654N3016M5732J9082j6074l9453L261l482r28K8089L4900l587
12629A24881j4048r71o542M464K0468N5762N6575O6812R2753O8340K4462M335
12617D97291k1580k0242o7447o1909m5622m6162n4364l4509k025j1035r191j4548
12605A08657M227j599K40p935j3202j9945k86J3341l970n658j0301m74l656K5924
12591H5363J9114J257l6300K943O233K2493l991j1208Q28J6894J8075R572K2663
$$ plain form
12578 153936 201834 280663 352634 410730 477071 512522 514549 501835 459607 386309 311280 249415
12566 249415 203683 179058 159333 122219 104391 80255 59324 60575 82247 104180 125912 135167
12554 135167 129552 116766 125216 153137 133504 123515 96547 84154 93040 77016 66009 65815 78108
12541 78108 87578 91927 99121 78046 86321 89624 85892 74380 84277 131092 140480 149565 164101
12528 164101 170577 166082 149320 123626 90950 97853 101081 61361 46397 56369 56700 48050 41143
12515 41143 51360 55505 38019 32959 26148 23376 31578 55790 61812 21440 23395 57903 53179
12502 53179 53915 46175 45443 40701 43286 65999 66312 69209 73971 71076 79100 84449 61095 42638
12488 42638 54432 44968 63716 78733 93360 117423 119535 117696 142728 134683 90536 89598 96143
$$ packed form
12578A53936M7898P8829P1971N8096O6341L5451K027j2714m2228p3298p5029o1865
12566B49415m5732k4625j9725l7114j7828k4136k0931J251K1672K1933K1732R255
12554A35167n615j2786Q450K7921j9633r989k6968j2393Q886j6024j1007j94J2293
12541G8108R470M349P194k1075Q275L303l732j1512R897M6815R388R085J4536
12528A64101O476m495j6762k5694l2676O903L228l9720j4964R972L31q650o907
12515D1143J0217M145j7486n060o811k772Q202K4212O022m0372J955L4508m724
12502E3179P36p740p32m742K585K2713L13K897M762k895Q024N349k3354j8457
12488D2638J1794r464J8748J5017J4627K4063K112j839K5032q045m4147r38O545
$$ plain form
12475 96143 92906 89376 81015 88122 82261 60371 52416 60081 60481 95438 82978 87835 80694 65824
12461 65824 52326 71135 86183 57662 30909 34387 37549 53381 56316 57080 57448 56043 39505
12448 39505 35747 28596 29469 28915 28783 42960 62944 71534 65315 79867 64336 68102 45393 51817
12434 51817 62859 69936 38195 36860 78527 77111 34195 -2919 -20956 -14035 1972 11451 10793
12421 10793 30307 34827 55428 90382 65976 50532 69151 108032 111687 105539 118685 103057
12409 103057 68940 60996 31336 12259 37111 57287 78829 91551 73329 43924 55767 84577
12397 84577 113287 117479 125680 109425 89543 65096 74107 83862 101009 109982 93682 91490 96802
12384 96802 106698 112382 128076 137775 128438 139385 107951 91303 99088 110073 123928 118630 99201
$$ packed form
12475I6143l237l530q361P107n861k1890p955P665M00L4957j2460M857p141j4870
12461F5824j3498J8809J5048k8521k6753L478L162J5832K935P64L68j405j6538
12448C9505l758p151Q73n54j32J4177J9984Q590o219J4552j5531L766k2709O424
12434E1817J1042P077l1741j335M1667j416m2916l7114j8037O921J6007R479o58
12421A0793J9514M520K0601L4954k4406j5444J8619L8881L655o148J3146j5628
12409A03057l4117p944k9660j9077K4852K0176K1542J2722j8222k9405J1843K8810
12397H4577K8710M192Q201j6255j9882k4447R011R755J7147Q973j6300k192N312
12384I6802R896N684J5694R699r337J0947l1434j6648P785J0985J3855n298j9429
$$ plain form
12371 99201 107723 113133 110366 88949 85474 99781 85028 68311 76616 94968 93395 83318 54483
12358 54483 42918 62690 75513 105916 102247 91582 109247 118539 130637 118047 87107 78064
12346 78064 121692 126282 121962 156134 193701 233457 238212 200032 153588 129524 99182 82713
12334 82713 72784 87109 99368 108142 138638 137241 132724 116424 116646 149426 160502 147522 137082
12321 137082 107556 78903 71247 105972 115429 133618 113095 99149 81721 88970 114969 140087
12309 140087 143909 117520 129489 133446 109248 84055 83490 111570 140206 167466 166025 128336
12297 128336 109898 92516 87474 88963 120055 132016 124680 124875 155167 161321 162111 154832 167102
12284 167102 132493 109410 112509 130217 133385 136346 147872 154861 137289 121249 112955 105832 115220
$$ packed form
12371I9201Q522N410k767k1417l475J4307j4753j6717Q305J8352j573j0077k8835
12358E4483j1565J9772J2823L0403l669j0665J7665R292J2098j2590l0940r043
12346G8064M3628M590m320L4172L7567L9756M755l8180m6444k4064l0342j6469
12334H2713r929J4325J2259Q774L0496j397m517j6300K22L2780J1076j2980j0440
12321A37082k9526k8653p656L4725R457J8189k0523j3946j7428P249K5999K5118
12309A40087L822k6389J1969L957k4198k5193n65K8080K8636K7260j441l7689
12297A28336j8438j7382n042J489L1092J1961p336J95L0292O154P90p279J2270
12284A67102l4609k3083L099J7708L168K961J1526O989j7572j6040q294p123R388
$$ plain form
12271 115220 120094 131067 139778 125935 121085 143874 171106 196388 187311 206265 235635 241164
12259 241164 220945 220427 228243 217228 204163 183772 202405 226658 248665 254634 250427 218925
12247 218925 209092 212861 211928 201708 197449 214127 229815 215739 214076 207640 199184 194047 210775
12234 210775 247651 274478 288082 278319 272268 303530 345137 401468 451647 474440 495521 524387
12222 524387 562512 589900 604817 575595 575240 557499 520964 485686 444667 403943 375513 362885
12210 362885 382323 374097 370812 340973 337553 346056 315042 301157 279956 251664 264790 275415
12198 275415 256462 250282 269332 279696 291888 284311 255217 287139 308962 311197 309046 347316
12186 347316 433554 481458 536570 602487 677862 828221 922277 983856 1004194 929391 819846
$$ packed form
12271A15220M874J0973Q711j3843m850K2789K7232K5282r077J8954K9370N529
12259B41164k0219n18P816j1015j3065k0391J8633K4253K2007N969m207l1502
12247B18925r833L769r33j0220m259J6678J5688j4076j663o436q456n137J6728
12234B10775L6876K6827J3604r763o051L1262M1607N6331N0179K2793K1081K8866
12222E24387L8125K7388J4917k9222l55j7741l6535l5278m1019m0724k8430j2628
12210C62885J9438q226l285k9839l420Q503l1014j3885k1201k8292J3126J0625
12198B75415j8953o180J9050J0364J2192p577k9094L1922K1823K235k151L8270
12186C47316Q6238M7904N5112O5917P5375J50359R4056O1579K0338p4803j09545
$$ plain form
12175 819846 737921 640502 567280 506884 437566 405270 397906 390872 376245 347316 330661 331304
12163 331304 328674 340604 324462 307994 275915 269096 253781 216761 192621 206010 206764 198045
12151 198045 209759 252050 256761 252444 273992 312054 337326 361055 367826 390491 418429 479025
12139 479025 542726 630580 741749 841915 962154 1061213 1106474 1088837 1028812 921884 775574
12128 775574 672402 618202 572712 556833 540957 526594 477506 470756 473128 470562 483056 464322
12116 464322 442334 466016 499876 501763 499137 464257 460484 463563 491599 510584 502984 502952 488897
12103 488897 480379 499181 520960 539042 582528 625288 644533 655686 683593 696066 716687 747704
12091 747704 827012 943113 1019237 1066710 1118464 1138668 1097346 1042297 1012694 963488 917956
$$ packed form
12175H19846q1925r7419p3222o0396o9318l2296p364p034j4627k8929j6655O43
12163C31304k630J1930j6142j6468l2079o819j5315l7020k4140J3389P54q719
12151A98045J1714M2291M711m317K1548L8062K5272K3729O771K2665K7938O0596
12139D79025O3701Q7854J11169J00166J20239R9059M5261j7637o0025j06928j46310
12128G75574j03172n4200m5490j5879j5876j4363m9088o750K372k566J2494j8734
12116D64322k1988K3682L3860J887k626l4880l773L079K8036J8985p600l2j4055
12103D88897q518J8802K1779J8082M3486M2760J9245J1153K7907J2473K0621L1017
12091G47704P9308J16101P6124M7473N1754K0204m1322n5049k9603m9206m5532
$$ plain form
12080 917956 920204 902244 886685 893631 894699 893959 900718 915820 958186 963634 934689 906959 897238
12067 897238 920101 925830 938056 977261 991570 1010425 1042453 1058785 1098427 1117886 1126387 1128070
12055 1128070 1147180 1198223 1232769 1221603 1226964 1237937 1261941 1290530 1340092 1384107 1392849 1420294
12043 1420294 1462412 1491930 1545598 1552043 1578996 1600124 1625241 1658398 1716842 1777673 1820620
12032 1820620 1891674 1942928 2028178 2092340 2181840 2274310 2341991 2434475 2543905 2659767 2742160
12021 2742160 2832793 2941991 3038984 3128250 3173407 3242697 3336599 3468532 3587233 3699675
12011 3699675 3871661 4048313 4210291 4384070 4619872 4853670 5091848 5342129 5630898
12002 5630898 5945976 6294458 6658325 7036456 7394789 7795238 8219742 8707498 9246989
$$ packed form
12080I17956K248j7960j5559O946J068p40O759J5102M2366N448k8945k7730r721
12067H97238K2863N729J2226L9205J4309J8855L2028J6332L9642J9459Q501J683
12055A128070J9110N1043L4546j1166N361J0973K4004K8589M9562M4015Q742K7445
12043A420294M2118K9518N3668O445K6953K1128K5117L3157N8444O0831M2947
12032A820620P1054N1254Q5250O4162Q9500R2470O7681R2484J09430J15862Q2393
12021B742160R0633J09198R6993Q9266M5157O9290R3902J31933J18701J12442
12011C699675J71986J76652J61978J73779K35802K33798K38178K50281K88769
12002E630898L15078L48482L63867L78131L58333M00449M24504M87756N39491
$$ plain form
11993 9246989 9834306 10541226 11286339 12096218 12988602 14003796 15161913 16449786 17895390
11984 17895390 19586713 21573344 23844563 26501509 29672491 33422280 37862272 43201555
11976 43201555 49686298 57593469 67361184 79651044 95353023 115559817 141727490
11969 141727490 175557896 218302008 269784159 326287846 378367871 411298469 411780558
11962 411780558 378717329 325013312 267050506 215225042 173018840 140024080 114597947
11955 114597947 94952494 79627911 67583509 58011884 50297497 43969857 38702210
11948 38702210 34278853 30560110 27388135 24650329 22290815 20231174 18425288 16846530
11940 16846530 15461265 14236358 13176159 12270663 11467265 10757962 10110378 9592429 9160977
$$ packed form
11993I246989N87317P06920P45113Q09879Q92384J015194J158117J287873J445604
11984A7895390J691323J986631K271219K656946L170982L749789M439992N339283
11976D3201555O484743P907171R767715J2289860J5701979K0206794K6167673
11969A41727490L3830406M2744112N1482151N6503687N2080025L2930598M82089
11962D11780558l3063229n3704017n7962806n1825464m2206202l2994760k5426133
11955A14597947j9645453j5324583j2044402r571625p714387o327640n267647
11948C8702210m423357l718743l171975k737806k359514k059641j805886j578758
11940A6846530j385265j224907j060199r05496q03398p09303o47584n17949m31452
$$ plain form
11931 9160977 8755200 8304256 7858089 7423463 6983050 6531570 6093471 5744146 5465693
11922 5465693 5210949 4951542 4739885 4555471 4358303 4202123 4057959 3889835 3728037
11913 3728037 3579528 3447164 3323522 3191946 3056241 2941894 2796448 2683598 2609273 2543649
11903 2543649 2463415 2412114 2368697 2339956 2299381 2242578 2171809 2097858 2025902 1966168 1892435
11892 1892435 1823413 1773065 1754803 1746369 1763457 1750996 1724071 1708285 1694395 1625114 1553615
11881 1553615 1470243 1410883 1370407 1319489 1266075 1225374 1209643 1203459 1152254 1103287 1095285 1068758
11869 1068758 1054879 1024857 971307 965781 970829 976571 957321 956935 944881 942672 908701 906664 889028
11856 889028 850102 862313 872469 853099 813719 762530 730521 710508 692905 683874 654827 656319
$$ packed form
11931I160977m05777m50944m46167m34626m40413m51480m38099l49325k78453
11922E465693k54744k59407k11657j84414j97168j56180j44164j68124j61798
11913C728037j48509j32364j23642j31576j35705j14347j45446j12850p4325o5624
11903B543649q0234n1301m3417k8741m0575n6803p0769p3951p1956n9734p3733
11892A892435o9022n0348j8262q434J7088j2461k6925j5786j3890o9281p1499
11881A553615q3372n9360m0476n0918n3414m0701j5731o184n1205m8967q002k6527
11869A068758j3879l0022n3550n526N048N742j9250l86j2054k209l3971k037j7636
11856H89028l8926J2211J0156j9370l9380n1189l2009k0013j7603r031k9047J492
$$ plain form
11844 656319 619149 594597 605096 639007 702651 776841 833558 877343 883061 859123 838331 812233
11832 812233 774117 722800 710159 706013 708931 701419 687952 680316 683009 676001 635947 611695 561727
11819 561727 540757 523996 491796 478795 463702 435250 425168 438295 455543 460323 483443 499438
11807 499438 501142 487571 469312 472269 461465 448604 422524 442665 439701 426803 419265 397891
11795 397891 390255 397875 401710 407111 418480 435555 448986 466722 453072 450808 500395 595184
11783 595184 695143 763981 773697 783187 742671 686623 622946 590968 578015 543630 507795 462124
11771 462124 414457 340709 299885 278954 261205 243995 249863 249563 252373 236342 213433 177872
11759 177872 201623 224720 224641 224319 210131 206344 203498 226973 243928 224266 217939 227498 217270
$$ packed form
11844F56319l7170k4552J0499L3911O3644P4190N6717M3785N718k3938k0792k6098
11832H12233l8116n1317j2641m146K918p512j3467p636K693p008m0054k4252m9968
11819E61727k0970j6761l2200j3001j5093k8452j0082J3127J7248M780K3120J5995
11807D99438J704j3571j8259K957j0804j2861k6080K0141k964j2898p538k1374
11795C97891p636P620L835N401J1369J7075J3431J7736j3650k264M9587R4789
11783E95184R9959O8838R716R490m0516n6048o3677l1978j2953l4385l5835m5671
11771D62124m7667p3748m0824k0931j7749j7210N868l00K810j6031k2909l5561
11759A77872K3751K3097p9l22j4188l787k846K3475J6955j9662o327R559j0228
$$ plain form
11746 217270 197331 222750 253378 282737 307622 328386 380669 446706 519040 577093 608304
11735 608304 635878 595797 574878 531622 482375 423940 345621 281946 263787 236321 227569 231632
11723 231632 215250 216514 193560 174597 159450 145261 156148 163117 164737 196684 220391 222333
11711 222333 206434 200948 191365 159618 163190 166194 164886 167099 182716 193269 202837 191786 193005
11698 193005 174303 165866 155281 144581 181787 219584 243026 280908 294031 289188 250321 210616
11686 210616 188285 174698 160742 152708 115470 107590 125417 102786 60390 66972 106576 102023
11674 102023 94913 100534 72920 78389 94466 97703 79923 79572 87527 75877 59036 67562 76821
11661 76821 95201 93026 111172 112920 119781 114946 100650 101305 101446 113107 120652 106810 102202 120080
$$ packed form
11746B17270j9939K5419L0628K9359K4885K0764N2283O6037P2334N8053L1211
11735F08304K7574m0081k0919m3256m9247n8435p8319o3675j8159k7466q752M063
11723B31632j6382J264k2954j8963j5147j4189J0887O969J620L1947K3707J942
11711B22333j5899n486r583l1747L572L004j308K213J5617J0553R568j1051J219
11698A93005j8702q437j0585j0700L7206L7797K3442L7882J3123m843l8867l9705
11686B10616k2331j3587j3956q034l7238p880J7827k2631m2396O582L9604m553
11674A02023p110N621k7614N469J6077L237j7780l51P955j1650j6841Q526R259
11661G6821J8380k175J8146J748O861m835j4296O55J41J1661P545j3842m608J7878
$$ plain form
11647 120080 124974 101385 91667 81852 84214 74088 52745 65241 108233 151574 167664 143373
11635 143373 76112 71535 112729 144058 112930 96118 94307 96806 93172 104847 123500 100469
11623 100469 69406 68466 97251 122009 107424 98386 98654 107040 88563 65179 63455 58792 43910
11610 43910 59426 58993 42327 37789 44860 48842 37292 42433 38696 43036 24895 36877 34255
11597 34255 14937 47106 64404 78350 88767 82767 81203 64314 60697 54764 81578 81619 80602
11584 80602 71033 47523 54818 69461 75089 86098 106674 99452 103502 91968 122942 147696 130866
11571 130866 106943 101823 106538 106788 79587 98198 84002 87697 73423 32573 27158 35034 15513
11558 15513 33423 29567 26369 42528 43903 39811 33849 51947 90082 117204 124136 129094 129750
$$ packed form
11647A20080M894k3589r718r815K362j0126k1343J2496M2992M3341J6090k4291
11635A43373o7261m577M1194L1329l1128j6812j811K499l634J1675J8653k3031
11623A00469l1063r40K8785K4758j4585r038K68Q386j8477k3384j724m663j4882
11610D3910J5516m33j6666m538P071L982j1550N141l737M340j8141J1982k622
11597C4255j9318L2169J7298J3946J0417o000j564j6889l617n933K6814M1j017
11584H0602r569k3510P295J4643N628J1009K0576p222M050j1534L0974K4754j6830
11571A30866k3923n120M715K50k7201J8611j4196L695j4274m0850n415P876j9521
11558A5513J7910l856l198J6159J375m092n962J8098L8135K7122O932M958O56
$$ plain form
11545 129750 140885 160450 180999 206613 172280 131262 113046 78200 79163 101520 115728 124969
11533 124969 131651 121380 140379 137702 146215 164498 156574 150824 131663 91621 69601 35334
11521 35334 23440 27001 49559 61648 50151 58147 65447 57305 32471 47217 59850 71382
11509 71382 104650 121139 112510 113100 88846 112008 157220 157158 126829 106863 116936 128639 138171
11496 138171 127073 83584 70246 64343 57420 44236 33587 57836 85106 90413 79008 72694
11484 72694 74052 96265 93769 104897 103247 94402 85570 81381 61782 50186 62429 52863 33492
11471 33492 20915 17076 33529 49406 57101 62185 49307 39562 48342 60922 40351 25822 1631
11458 1631 31887 67686 63125 78609 58191 29013 40017 38279 25309 7388 -3869 26621
$$ packed form
11545A29750J1135J9565K0549K5614l4333m1018j8216l4846R63K2357J4208R241
11533A24969O682j0271J8999k677Q513J8283p924n750j9161m0042k2020l4267
11521C5334j1894L561K2558J2089j1497P996P300q142k4834J4746J2633J1532
11509G1382L3268J6489q629N90k4254K3162M5212o2l0329j9966J0073J1703R532
11496A38171j1098m3489j3338n903o923j3184j0649K4249K7270N307j1405o314
11484G2694J358K2213k496J1128j650q845q832m189j9599j1596J2243r566j9371
11471C3492j2577l839J6453J5877P695N084j2878r745Q780J2580k0571j4529k4191
11458A631L0256L5799m561J5484k0418k9178J1004j738j2970j7921j1257L0490
$$ plain form
11446 26621 27165 6992 15351 -909 -23477 -2147 17895 -1324 -6072 15591 20048 52170 71538
11433 71538 65677 41688 28717 21513 43541 58616 81026 76772 66270 49124 40024 46676 34347
11420 34347 -1725 15041 45699 47879 45327 20225 15523 24815 26634 20743 22938 12568 -9553
11407 -9553 -14860 22385 40471 55116 22274 40039 50708 46221 31345 58418 51698 38935
11395 38935 39414 44398 25130 14613 7131 10672 12344 -2999 -4565 -6999 -13428 1281 -4714 2155
11381 2155 -5642 -8303 7251 -8162 -3896 15646 14836 20690 40040 56394 53973 36426 53696
11368 53696 50167 35146 2852 18470 28743 16580 -6915 -4053 9673 20659 40287 33778
11356 33778 -23794 -43154 -32799 -36356 -31705 376 23070 45107 55868 50425 14750 18118
$$ packed form
11446B6621N44k0173Q359j6260k2568K1330K0042j9219m748K1663M457L2122J9368
11433G1538n861k3989j2971p204K2028J5075K2410m254j0502j7146r100O652j2329
11420C4347l6072J6766L0658K180k552k5102m702R292J819n891K195j0370k2121
11407i553n307L7245J8086J4645l2842J7765J0669m487j4876K7073o720j2763
11395C8935M79M984j9268j0517p482L541J672j5343j566k434o429J4709n995O869
11381B155p797k661J5554j5413M266J9542q10N854J9350J6354k421j7547J7270
11368E3696l529j5021l2294J5618J0273j2163k3495K862J3726J0986J9628o509
11356C3778n7572j9360J0355l557M651L2081K2694K2037J0761n443l5675L368
$$ plain form
11344 18118 13456 5700 -2511 41922 68385 51456 8080 -15901 -33230 -9030 731 -29168
11332 -29168 -16972 -23660 -26051 -13149 16058 27334 30228 40890 62823 65032 60746 52729 19747
11319 19747 1498 7448 53632 88234 59688 45591 48087 56022 44838 16119 30155 33977
11307 33977 34810 33341 33345 43417 31226 34887 31427 21499 8785 9585 15297 15106 32633 48171 64914
11292 64914 50267 26348 -3847 -8214 -8219 34086 56142 53109 44132 17852 -6325 -12062 28438
11279 28438 76925 84524 80068 77251 71211 56981 30636 6964 741 6877 3256 12742 12964 16420
11265 16420 7450 -2518 -5476 -9801 11846 27614 42963 52815 65480 56933 47223 36435 32924
11252 32924 58318 50885 25130 36591 68641 66732 39735 15157 20777 13325 16280 19195 33703
$$ packed form
11344A8118m662p756q211M4433K6463j6929m3376k3981j7329K4200R761k9899
11332b9168J2196o688k391J2902K9207J1276K894J0662K1933K209m286q017l2982
11319A9747j8249N950M6184L4602k8546j4097K496P935j1184k8719J4036L822
11307C3977Q33j469MJ0072j2191L661l460r928j2714Q00N712j91J7527J5538J6743
11292F4914j4647k3919l0195m367nM2305K2056l033q977k6280k4177n737M0500
11279B8438M8487P599m456k817o040j4230k6345k3672o223O136l621R486K22L456
11265A6420q970r968k958m325K1647J5768J5349R852J2665q547r710j0788l511
11252C2924K5394p433k5755J1461L2050j909k6997k4578N620p452K955K915J4508
$$ plain form
11239 33703 36720 3258 -319 1370 9109 3425 14928 5642 4365 -5189 -19489 -33062 -36703
11226 -36703 4222 19926 25364 32827 33166 -919 -2921 -2033 -8567 15151 27824 61902 37144
11213 37144 4927 -2955 -18128 -21172 -22503 -22453 390 26524 56000 61863 37573 20755 19281
11200 19281 13746 4517 6006 18373 18701 12997 14083 -9209 -13793 -3567 9296 16317 -2761
11187 -2761 -23105 -4852 -2525 -18380 -3259 2020 -6174 -24909 -16148 27356 45942 26661 27907
11174 27907 8780 -4916 14682 27029 16939 17979 1905 -5914 -27733 -15356 -9184 97
11162 97 5245 9508 20592 33932 38203 24302 12398 16447 43939 51217 27155 27417 48813 45633
11148 45633 38978 53507 51729 57834 54204 42866 50438 45032 24914 28005 31823 13800 -10595
$$ packed form
11239C3703L017l3462l577J689P739n684J1503r286j277r554j4300j3573l641
11226c6703M0925J5704N438P463L39l4085k002Q88o534K3718J2673L4078k4758
11213C7144l2217p882j5173l044j331N0K2843K6134K9476N863k4290j6818j474
11200A9281n535r229J489J2367L28n704J086k3292m584J0226J2863P021j9078
11187b761k0344J8253K327j5855J5121N279q194j8735Q761M3504J8586j9281J246
11174B7907j9127j3696J9598J2347j0090J040j6074p819k1819J2377O172R281
11162I7N148M263J1084J3340M271j3901j1904M049K7492P278k4062K62K1396l180
11148D5633o655J4529j778O105l630j1338P572n406k0118L091L818j8023k4395
$$ plain form
11135 -10595 -32640 -18285 -8597 3455 25505 13272 -2203 -8749 -16994 -433 8707 -22338
11123 -22338 -31981 -24836 -6662 2869 -4130 -23176 -5992 9296 16669 19560 27856 11876 8628
11110 8628 -24082 -68757 -70103 -57131 -20433 -22118 -29022 -30153 26507 57144 60944 56145 52531
11097 52531 43516 34673 7820 3966 1284 -9540 1352 -17464 -13969 -12305 -1813 11524 -2636
11084 -2636 -7296 -1369 38912 40485 28466 24811 15470 20281 11507 13429 48059 43158 24358 26887
11070 26887 19965 11152 -7809 -23294 -15729 -12459 -31107 -13478 -2192 17676 2127 -34563
11058 -34563 -20520 -18428 6602 18062 502 17164 25215 27811 41243 58896 79318 99982
11046 99982 100413 93097 102930 130155 113342 90558 93603 109470 132777 158895 181631 209550 239628
$$ packed form
11135a0595k2045J4355R688J2052K2050j2233j5475o546q245J6561R140l1045
11123b2338r643P145J8174R531o999j9046J7184J5288P373K891Q296j5980l248
11110H628l2710m4675j346J2972L6698j685o904j131N6660L0637L800m799l614
11097E2531r015q843k6853l854k682j0824J0892j8816L495J664J0492J3337j4160
11084b636m660N927M0281J573j2019l655r341M811q774J922L4630m901j8800K529
11070B6887o922q813j8961j5485P565L270j8648J7629J1286J9868j5549l6690
11058c4563J4043K092K5030J1460j7560J6662Q051K596J3432J7653K0422K0664
11046I9982M31p316R833K7225j6813k2784L045J5867K3307K6118K2736K7919L0078
$$ plain form
11033 239628 267753 308048 294101 255109 226305 203247 201823 196220 233670 270666 329638 377963
11021 377963 416072 425487 389675 360405 315049 261792 209339 196462 223561 251564 263076 313745
11009 313745 334536 293996 267943 238271 186551 154176 142636 106953 104341 126337 161098 184825
10997 184825 195784 164153 101415 59944 51627 41831 53446 63823 45608 31953 33406 35507
10985 35507 18981 -2995 7697 31922 18340 22408 34298 46286 37603 43026 38782 34023 -4221
10972 -4221 -32444 -22880 -9430 1958 19981 35635 77984 91374 74149 27544 4718 -6033
10960 -6033 1445 -5657 -2518 37378 56989 36760 17417 -6543 -8180 3317 20786 42488 62425
10947 62425 69246 42609 24436 15459 35960 38099 38659 41654 38311 48377 70880 75392 51900
$$ packed form
11033B39628K8125M0295j3947l8992k8804k3058j424n603L7450L6996N8972M8325
11021C77963L8109R415l5812k9270m5356n3257n2453j2877K7099K8003J1512N0669
11009C13745K0791m0540k6053k9672n1720l2375j1540l5683k612K1996L4761K3727
10997A84825J0959l1631o2738m1471q317r796J1615J0377j8215j3655J453K101
10985C5507j6526k1976J0692K4225j3582M068J1890J1988q683N423m244m759l8244
10972d221k8223R564J3450J1388J8023J5654M2349J3390j7225m6605k2826j0751
10960f033P478p102L139L9896J9611k0229j9343k3960j637J1497J7469K1702J9937
10947F2425O821k6637j8173q977K0501K139N60K995l343J0066K2503M512k3492
$$ plain form
10934 51900 15949 -9483 -14073 10365 15446 14029 14910 33372 59489 70275 24322 2050 24782
10921 24782 31320 42130 25891 16577 43923 50353 28628 32587 28798 6422 4199 13692 36526
10908 36526 51141 37422 23038 22268 17611 -13104 -14884 -15705 -32630 -12847 4178 5595 11678
10895 11678 33428 60379 57342 37145 -5579 -33937 -30774 -14646 5127 18181 9474 -3056
10883 -3056 10217 20996 8213 14626 31248 37897 21437 -12890 -16505 12573 25035 8475
10871 8475 48958 78421 82529 48220 58307 44914 28999 24927 6975 2687 12612 23394 17749
10858 17749 47359 51050 42161 17499 30270 68211 71951 23182 40775 50391 60960 71005
10846 71005 79039 101056 106589 85399 54221 52842 25638 -8304 15338 19774 2047 17594
$$ packed form
10934E1900l5951k5432m590K4438N081j417Q81J8462K6117J0786m5953k2272K2732
10921B4782O538J0810j6239r314K7346O430k1725L959l789k2376k223R493K2834
10908C6526J4615j3719j4384p70m657l0715j780q21j6925J9783J7025J417O083
10895A1678K1750K6951l037k0197m2724k8358L163J6128J9773J3054q707j2530
10883c056J3273J0779j2783O413J6622O649j6460l4327l615K9078J2462j6560
10871H475M0483K9463M108l4309J0087j3393j5915m072j7952m288R925J0782n645
10858A7749K9610L691q889k4662J2771L7941L740m8769J7593R616J0569J0045
10846G1005Q034K2017N533k1190l1178j379k7204l3942K3642M436j7727J5547
$$ plain form
10834 17594 35151 28140 25059 35074 57326 34558 41252 70050 80652 60283 73470 85472
10822 85472 64959 45880 24636 37872 72102 74243 70709 61761 40404 40469 77776 87109 48178
10809 48178 54954 79189 90573 77481 57411 82570 82323 64455 60348 49493 28333 18767 36795
10796 36795 42908 46055 28650 18318 20186 11118 -5432 -19761 5748 38030 17176 2672
10784 2672 -12842 -5076 2147 19632 517 11637 36067 42921 41714 16648 3319 25492 31651
10771 31651 30157 27092 17714 25349 39556 19828 14241 12524 30145 33946 18028 14169 39262
10758 39262 62331 49438 35852 46721 26839 5372 470 31991 66998 77298 58742 48772
10746 48772 39807 21390 17198 18949 25761 52478 66232 62083 75316 95282 98187 61339 47725
$$ packed form
10834A7594J7557p011l081J0015K2252k2768O694K8798J0602k0369J3187J2002
10822H5472k0513j9079k1244J3236L4230K141l534q948k1357O5L7307R333l8931
10809D8178O776K4235J1384j3092k0070K5159k47j7868m107j0855k1160r566J8028
10796C6795O113L147j7405j0332J868r068j6550j4329K5509L2282k0854j4504
10784B672j5514P766P223J7485j9115J1120K4430O854j207k5066j3329K2173O159
10771C1651j494l065r378P635J4207j9728n587j717J7621L801j5918l859K5093
10758C9262K3069j2893j3586J0869j9882k1467m902L1521L5007J0300j8556r970
10746D8772q965j8417m192J751O812K6717J3754m149J3233J9966K905l6848j3614
$$ plain form
10733 47725 48868 61130 69391 70143 73892 96122 91057 102966 100483 107471 111876 96760 100229 100485
10719 100485 85729 112766 114669 119296 141478 168941 161843 139170 114252 102674 105980 96492
10707 96492 82309 80001 76999 101225 91688 97207 122575 138830 142182 119296 86291 95045 101131
10694 101131 98593 87450 87883 93417 116610 117274 117133 121999 130609 104804 85408 95800 85263
10681 85263 91332 121921 146413 155827 146028 159196 174694 166544 162722 143877 150561 157747 177244
10668 177244 210280 204516 171313 176595 203603 202564 197980 190957 217528 241494 213416 227325
10656 227325 256513 267646 293105 334090 358563 356285 336727 345023 367525 379574 414082 430803
10644 430803 440888 445260 462586 505144 550332 604492 658232 725496 800538 871465 973112
$$ packed form
10733D7725J143J2262Q261P52L749K2230n065J1909k483O988M405j5116L469K56
10719A00485j4756K7037J903M627K2182K7463p098k2673k4918j1578L306r488
10707I6492j4183k308l002K4226r537N519K5368J6255L352k2886l3005Q754O086
10694A01131k538j1143M33N534K3193O64j41M866Q610k5805j9396J0392j0537
10681H5263O069L0589K4492R414r799J3168J5498q150l822j8845O684P186J9497
10668A77244L3036n764l3203N282K7008j039m584p023K6571K3966k8078J3909
10656B27325K9188J1133K5459M0985K4473k278j9558Q296K2502J2049L4508J6721
10644D30803J0085M372J7326M2558M5188N4160N3740O7264P5042P0927J01647
$$ plain form
10633 973112 1107854 1267170 1459654 1613543 1698715 1792069 1954364 2137495 2388749 2740997
10623 2740997 3201282 3865472 4814878 6082551 7787269 10035856 12880192 16202496 19439089
10614 19439089 21683592 22162197 21202963 19770203 18774994 18690288 19774274 22214169 26214903
10605 26214903 31841209 38679259 45224051 48794906 47676598 43130964 38066415 34392281
10597 34392281 32745144 33313554 36152833 41357306 48838602 57609842 65259139 67947470
10589 67947470 63632050 54830517 45788179 38869634 34600514 32801309 33205599 35558504
10581 35558504 39575657 44366553 47961438 47916142 43301572 36095538 29168887 23982958
10573 23982958 20657565 18895091 18399190 18909813 20048279 21257928 21829427 20898184 18271028
$$ packed form
10633I73112J34742J59316J92484J53889Q5172R3354J62295J83131K51254L52248
10623B740997M60285O64190R49406J267673J704718K248587K844336L322304L236593
10614A9439089K244503M78605r59234j432760r95209q4706J083986K439895M000734
10605B6214903N626306O838050O544792L570855j118308m545634n064549l674134
10597C4392281j647137N68410K839279N204473P481296Q771240P649297K688331
10589F7947470m315420q801533r042338o918545m269120j799205M04290K352905
10581C5558504M017153M790896L594885m5296m614570p206034o926651n185929
10573B3982958l325393j762474m95901N10623J138466J209649N71499r31243k627156
$$ plain form
10564 18271028 14773422 11405626 8702795 6685531 5253768 4234650 3484885 2931050
10556 2931050 2495782 2163827 1909215 1721322 1542989 1375989 1255548 1147133 1037766
10547 1037766 925767 835096 765022 721295 661973 616163 561742 540349 513885 496750 482960
10536 482960 465041 444740 416187 390951 365258 354398 336634 289762 257722 249700 241773 247015
10524 247015 243159 237276 223541 210588 198464 199627 214059 211385 208299 233592 240781 186529 162502
10511 162502 160033 140590 115855 109458 111776 124899 133816 142990 139795 163778 179498 144402 96605
10498 96605 70011 89744 84812 87777 109875 106074 116663 125072 85874 72243 101199 95658 90654
10485 90654 67052 74857 89038 75994 70188 61292 31928 49609 72257 109116 92121 66235
$$ packed form
10564A8271028l497606l367796k702831k017264j431763j019118p49765n53835
10556B931050m35268l31955k54612j87893j78333j67000j20441j08415j09367
10547A037766j11999r0671p0074m3727n9322m5810n4421k1393k6464j7135j3790
10536D82960j7919k0301k8553k5236k5693j0860j7764m6872l2040q022p927N242
10524B47015l856n883j3735j2953j2124J163J4432k674l086K5293P189n4252k4027
10511A62502k469j9443k4735o397K318J3123Q917R174l195K3983J5720l5096m7797
10498I6605k6594J9733m932K965K2098l801J0589Q409l9198j3631K8956n541n004
10485I0654k3602P805J4181j3044n806q896k9364J7681K2648L6859j6995k5886
$$ plain form
10473 66235 63619 83807 65200 54953 29328 10892 29908 47496 63384 111588 150212 147751
10461 147751 115209 101715 76247 57512 51421 56809 31728 27180 50231 69250 71406 73561
10449 73561 83998 76244 75842 100387 96090 72339 48882 15795 25130 49035 103029 127879 73349
10436 73349 48395 60462 76837 66519 51169 35509 43353 30616 43573 55010 43475 28565
10424 28565 38751 56591 84436 97207 74748 68654 76129 81036 61924 63179 78403 75037 64885
10411 64885 72559 49815 33918 14652 10581 23533 33732 33752 28637 44967 58240 43658 45334
10398 45334 50124 32169 8465 -20897 -46586 -17244 31999 44088 41118 8596 -4040 3199
10386 3199 -3514 -30167 -45484 -43043 -9235 33802 31429 15969 17152 19134 34514 16484 32861
$$ packed form
10473F6235k616K0188j8607j0247k5625j8436J9016J7588J5888M8204L8624k461
10461A47751l2542j3494k5468j8735o091N388k5081m548K3051J9019K156K155
10449G3561J0437p754m02K4545m297k3751k3457l3087R335K3905N3994K4850n4530
10436G3349k4954J2067J6375j0318j5350j5660P844j2737J2957J1437j1535j4910
10424B8565J0186J7840K7845J2771k2459o094P475M907j9112J255J5224l366j0152
10411F4885P674k2744j5897j9266m071J2952J0199K0n115J6330J3273j4582J676
10398D5334M790j7955k3704k9362k5689K9342M9243J2089k970l2522j2636P239
10386C199o713k6653j5317K441L3808M3037k373j5460J183J982J5380j8030J6377
$$ plain form
10373 32861 41709 42209 29642 17081 16567 1750 -11663 -21137 -5579 -6550 -23321 -26633 -22068 4984
10359 4984 16430 -1244 11504 -8636 -26172 -3268 8261 -8121 -320 -12433 -51517 -48132
10347 -48132 -28716 -20372 -9611 -6804 -6719 -8777 -5895 -5838 21288 49612 68034 69806 52738 30542
10333 30542 13163 -25262 -44511 -23738 10091 52955 72283 42228 -3017 -29180 -30981 -46943
10321 -46943 -47772 -18322 -25119 -40589 -57316 -50485 -7097 -5585 -7879 7434 20225 10674 21804
10308 21804 5753 -1683 -10177 -2964 -11942 -10347 -345 -2722 -17619 -24891 -21573 -7732 -6996 15241
10294 15241 5416 -15220 -13374 -15803 11848 1425 -635 8896 15863 2561 -13375 6299 7630
10281 7630 8402 14521 11674 195 4109 -11320 -22989 -7554 -8772 27651 34114 27044 36593 27817
$$ packed form
10373C2861Q848N00j2567j2561n14j4817j3413r474J5558r71j6771l312M565K7052
10359D984J1446j7674J2748k0140j7536K2904J1529j6382P801j2113l9084L385
10347d8132J9416Q344J0761K807Q5k058K882N7K7126K8324J8422J772j7068k2196
10333C0542j7379l8425j9249K0773L3829M2864J9328l0055m5245k6163j801j5962
10321d6943q29K9450o797j5470j6727O831M3388J512k294J5313J2791r551J1130
10308B1804j6051p436q494P213q978J595J0002k377j4897p272L318J3841P36K2237
10294A5241r825k0636J846k429K7651j0423k060R531O967j3302j5936J9674J331
10281G630P72O119k847j1479L914j5429j1669J5435j218L6423O463p070R549q776
$$ plain form
10267 27817 15442 18863 7129 8396 -11536 -10362 -10269 -235 2505 20245 32965 40432 37290
10254 37290 33512 34549 20092 24006 26759 21153 38082 24229 12585 20429 11714 -24009 -44453
10241 -44453 -44179 -33702 -39514 -58612 -32417 -9347 -10211 -39933 -43014 -45104 -14223 -2863 -5474
10228 -5474 -5826 3455 9426 -28849 -53025 -45477 -45257 -36348 -12407 2275 -4283 -7017 3090 23951
10214 23951 33640 29560 22992 -3941 -13823 19599 30503 19135 -4963 -20981 -10182 -18141 -1462
10201 -1462 2581 18723 22171 25612 21095 38406 56406 19013 -19951 -5515 -12101 -15734 -20130
10188 -20130 -48762 -49595 -12004 8990 19067 50745 60742 57977 50665 62471 102607 125363 118790
10175 118790 107813 83443 94851 107009 107903 124723 148866 159146 202208 242263 267946 258324
$$ packed form
10267B7817j2375L421j1734J267j9932J174R3J0034K740J7740J2720P467l142
10254C7290l778J037j4457L914K753n606J6929j3853j1644P844q715l5723k0444
10241d4453K74J0477n812j9098K6195K3070q64k9722l081k090L0881J1360k611
10228e474l52R281N971l8275k4176P548K20Q909K3941J4682o558k734J0107K0861
10214B3951R689m080o568k6933r882L3422J0904j1368k4098j6018J0799p959J6679
10201a462M043J6142L448L441m517J7311J8000l7393l8964J4436o586l633m396
10188b0130k8632q33L7591K0994J0077L1678R997k765p312J1806M0136K2756o573
10175A18790j0977k4370J1408J2158Q94J6820K4143J0280M3062M0055K5683r622
$$ plain form
10163 258324 220898 183460 156175 155380 172386 197670 225461 282799 327378 355761 361658 310108
10151 310108 252193 201607 192656 200127 184084 203969 231793 252959 263674 285001 294415 282521
10139 282521 244206 177635 148759 152428 151193 134038 139438 146605 125495 134112 139670 113992 95540
10126 95540 83258 86533 73002 57297 61296 49538 37228 48513 57072 58647 65426 75208 41428
10113 41428 29067 32828 28853 20582 6708 665 -12246 -22205 -8396 39132 25623 8254 -9343
10100 -9343 569 -4359 -18710 -16790 5918 17440 2938 -5397 14121 -1397 -15561 -20223 -9574
10087 -9574 -21727 -22121 -11275 -20324 -25312 -35028 -32888 -39747 -31782 13926 5843 15055 20438 -18991
10073 -18991 -44813 -30896 -10864 3630 -6324 11705 24740 25022 19356 -598 -27658 -6864
$$ packed form
10163B58324l7426l7438k7285p95J7006K5284K7791N7338M4579K8383N897n1550
10151C10108n7915n0586q951P471j6043J9885K7824K1166J0715K1327R414j1894
10139B82521l8315o6571k8876L669j235j7155N400P167k1110Q617N558k5678j8452
10126I5540j2282L275j3531j5705L999j1758j2310J1285Q559J575O779R782l3780
10113D1428j2361L761l975q271j3874o043j2911r959J3809M7528j3509j7369j7597
10100i343R912m928j4351J920K2708J1522j4502q335J9518j5518j4164m662J0649
10087i574j2153l94J0846r049m988r716K140o859P965M5708q083R212N383l9429
10073a8991k5822J3917K0032J4494r954J8029J3035K82n666j9954k7060K0794
$$ plain form
10061 -6864 254 -2224 13721 18442 14834 15584 34123 32931 26439 5259 -13105 -7111 33392 -7671
10047 -7671 -17885 16236 39398 39022 9646 -6982 10253 41609 38096 22659 8548 10684 7460
10034 7460 31472 36535 9013 12503 15283 13760 27873 29233 -251 11622 47940 50565 37055
10021 37055 44540 43320 29856 28544 24638 29351 20645 3455 -8122 -27731 -19827 24848 34104
10008 34104 169 -30732 -24514 -11359 -12416 -6037 6911 -12709 -32024 -32748 -23018 -21025 -28351
9995 -28351 -22962 -32190 -8444 -18399 -30197 -26432 -43900 -44439 -24301 -15229 -5720 -16671 -41619
9982 -41619 -25324 11435 14462 33492 25695 18838 23669 29042 14176 -7802 -26667 -42637 -44423
9969 -44423 -20995 -26321 -31743 -10884 13185 20366 13218 -22230 -51009 -58784 -57222 -37176 -33654
$$ packed form
10061f864P118k478J5945M721l608P50J8539j192o492k1180j8364N994M0503m1063
10047g671j0214L4121K3162l76k9376j6628J7235L1356l513j5437j4111K136l224
10034G460K4012N063k7522L490K780j523J4113J360k9484J1873L6318K625j3510
10021C7055P485j220j3464j312l906M713q706j7190j1577j9609P904M4675R256
10008C4104l3935l0901O218J3155j057O379J2948j9620j9315p24R730J993p326
9995b8351N389r228K3746r955j1798L765j7468n39K0138R072R509j0951k4948
9982d1619J6295L6759L027J9030p797o857M831N373j4866k1978j8865j5970j786
9969d4423K3428n326n422K0859K4069P181p148l5448k8779p775J562K0046L522
$$ plain form
9956 -33654 -27547 -16060 20002 25285 19388 9026 4084 5694 -20162 -20442 7773 -2646 9420
9943 9420 -2962 893 -633 -8175 -1361 -1059 -2053 -11071 -294 -3540 5811 -555 -23500 -44716
9929 -44716 -35363 -18703 433 38482 24363 16035 -6014 -17000 -20164 -28866 -6938 -8743 -17558
9916 -17558 -52364 -58371 -19425 4311 -4346 5665 3235 -17393 -28211 -24683 -19836 -6595 17417
9903 17417 21095 15543 9362 22487 -395 16452 29447 20554 7175 -2487 -17634 -16901 -4502
9890 -4502 23439 14714 -366 18329 11733 -6153 -16441 6764 12356 -6479 -27848 -18202 4700
9877 4700 22471 6974 4516 8932 9345 20871 32098 37993 22454 3894 -1808 390 3897 7713
9863 7713 14258 17741 10768 15881 -3895 3263 14579 4826 18305 21751 -1236 -991 -378 -24027
$$ packed form
9956c3654O107J1487L6062N283n897j0362m942J610k5856k80K8215j0419J2066
9943I420j2382L855j526p542O814L02r94r018J0777l246R351o366k2945k1216
9929d4716R353J6660J9136L8049j4119q328k2049j0986l164q702K1928j805q815
9916a7558l4806o007L8946K3736q657J0011k430k0628j0818L528M847J3241K4012
9903A7417L678n552o181J3125k2882J6847J2995q893j3379r662j5147P33J2399
9890d502K7941q725j5080J8695o596j7886j0288K3205N592j8835k1369R646K2902
9877D700J7771j5497k458M416M13J1526J1227N895j5539j8560n702K198L507L816
9863G713O545L483o973N113j9776P158J1316r753J3479L446k2987K45O13k3649
$$ plain form
9849 -24027 -14645 -4829 -10382 -11006 -10181 -14876 1679 -21167 -28215 -17823 -10485 3106 17895 24775
9835 24775 -10268 -39718 -40344 -16323 -4329 -22060 -11644 -10953 -10872 -1276 -8101 -1772 9569 -5342
9821 -5342 3480 -2396 -13669 -29060 -6339 -14251 -6450 -7037 -11781 -6143 8795 8731 3331 8979 41513
9806 41513 43262 2218 -31678 -39463 -36299 -9937 9248 30367 42515 15818 19691 19394 10549
9793 10549 13494 20753 7064 -15992 -40352 -46357 -46481 -38552 -41115 -24118 27270 52934 34809
9780 34809 21871 -11864 -26187 -30700 -21522 -33352 -28140 -26510 -22026 -37738 -32376 -22213 -28484
9767 -28484 10760 23895 20683 18031 3874 -859 4877 -3253 -18429 -10317 -20115 -341 2577
9754 2577 -10636 -24553 -31123 -7257 -8100 -7930 -13678 -26478 -10111 -3737 -9217 -6167 30182 20284
$$ packed form
9849b4027R382R816n553o24Q25m695J6555k2846p048J0392P338J3591J4789O880
9835B4775l5043k9450o26K4021J1994j7731J0416O91Q1R596o825O329J1341j4911
9821e342Q822n876j1273j5391K2721p912P801n87m744N638J4938o4n400N648L2534
9806D1513J749m1044l3896p785L164K6362J9185K1119J2148k6697L873k97q845
9793A0549K945P259j3689k3056k4360o005j24P929k563J6997N1388K5664j8125
9780C4809j2938l3735j4323m513R178j1830N212J630M484j5712N362J0163o271
9767b8484L9244J3135l212k652j4157m733N736q130j5176Q112r798J9774K918
9754B577j3213j3917o570K3866q43J70n748j2800J6367O374n480L050L6349r898
$$ plain form
9740 20284 -5509 -5248 4146 -7385 -28935 -41433 -11782 16116 24070 8996 -2854 5917 -5119
9727 -5119 3913 7686 18955 17224 37790 68889 58213 50597 40806 29084 37644 28385 20347 13181
9713 13181 4998 9699 -15378 -44475 -51578 -22202 -17037 -27614 -10260 -22744 -10093 -2009 -19781
9700 -19781 -39807 -28068 -14361 -25577 5574 4093 -11555 7152 34485 24444 -6588 -30934
9688 -30934 -23489 -15705 -10316 -11518 5406 -15620 -38425 -45108 -22519 -48475 -49200 -36132 -67140
9675 -67140 -83004 -64789 -23203 24201 38713 34910 19383 -7865 -33757 -38566 -28868 5070
9663 5070 31528 43807 45396 75852 56910 36644 53025 55333 67253 81503 52483 51085 96639
9650 96639 138756 156898 110357 71938 55424 66372 58486 49134 37900 -16742 -26884 -430
$$ packed form
9740B0284k5793K61R394j1531k1550j2498K9651K7898P954j5074j1850Q771j1036
9727e119R032L773J1269j731K0566L1099j0676p616r791j1722Q560r259q038p166
9713A3181q183M701k5077k9097p103K9376N165j0577J7354j2484J2651Q084j7772
9700a9781k0026J1739J3707j1216L1151j481j5648J8707K7333j0041l1032k4346
9688c0934P445P784N389j202J6924k1026k2805o683K2589k5956p25J3068l1008
9675f7140j5864J8215M1586M7404J4512l803j5527k7248k5892m809R698L3938
9663E070K6458J2279J589L0456j8942k0266J6381K308J1920J4250k9020j398M5554
9650I6639M2117J8142m6541l8419j6514J0948p886r352j1234n4642j0142K6454
$$ plain form
9638 -430 10943 9074 3044 -10768 -12254 -3233 12778 31037 54832 40898 33102 8095 -15760
9625 -15760 -2277 -7191 -30424 -44502 -40292 -46058 -29637 -16815 14891 25241 29694 40386 8475
9612 8475 3991 -22285 -35848 -6449 -1750 10739 16520 15356 7227 -13098 -31131 -17979 -5519
9599 -5519 9283 8112 4998 -13672 -27024 -40918 -37014 -48864 -32149 -20088 -22411 6379 19859
9586 19859 -3113 -33897 -52727 -33162 -29841 4906 -16476 -19975 15805 15072 -17303 6119 2560
9573 2560 2061 3960 -4854 14307 3131 -10506 -19554 -36534 -35934 -29068 -26769 -40506 -27966 -24654
9559 -24654 -38801 -44516 -56374 -32728 5778 -5404 -20564 -11269 13246 13434 -6651 17676 59823
9546 59823 54332 39152 37424 35255 10355 768 5575 27188 39392 41902 19907 4597 -3853
$$ packed form
9638d30J1373j869o030j3812j486R021J6011J8259K3795j3934p796k5007k3855
9625a5760J3483m914k3233j4078M210n766J6421J2822L1706J0350M453J0692l1911
9612H475m484k6276j3563K9399M699J2489N781j164q129k0325j8033J3152J2460
9599e519J4802j171l114j8670j3352j3894L904j1850J6715J2061k323K8790J3480
9586A9859k2972l0784j8830J9565L321L4747k1382l499L5780p33l2375K3422l559
9573B560m99J899q814J9161j1176j3637r048j6980O00O866K299j3737J2540L312
9559b4654j4147n715j1858K3646L8506j1182j5160R295K4515J88k0085K4327M2147
9546E9823n491j5180j728k169k4900r587M807K1613J2204K510k1995j5310q450
$$ plain form
9533 -3853 20468 1694 -17778 -15156 -18459 -23253 -31552 -15434 -5090 10103 -15033 -24570 -29037
9520 -29037 -20946 -31947 -41339 -43754 -42712 -39323 -27696 -8000 9770 26967 21028 21252 32135
9507 32135 9152 -22902 -31683 -180 -8190 -11036 16906 31182 32386 13971 3820 -7018 -3555
9494 -3555 -6305 11780 29108 -11911 -50694 -39071 -17666 23819 46480 18023 -8183 -7674 7183
9481 7183 4114 -5486 9385 48367 54054 31079 4533 -1211 2226 19167 39441 62182 65029
9468 65029 59052 47116 33439 46375 24966 309 -9890 -8662 -10036 -5189 -892 -10729 -13955
9455 -13955 -23275 -19736 -11325 -1326 23916 26405 27279 31366 28792 1532 3759 3768 -1091 -8738 -32865
9440 -32865 -38538 -31402 -51518 -57383 -37518 -33295 -17999 -5774 -28929 -24898 2654 29334 9183
$$ packed form
9533c853K4321j8774j9472K622l303m794q299J6118J0344J5193k5136r537m467
9520b9037Q091j1001r392k415J042L389J1627J9696J7770J7197n939K24J0883
9507C2135k2983l2054q781L1503q010k846K7942J4276J204j8415j0151j0838L463
9494c555k750J8085J7328m1019l8783J1623K1405M1485K2661k8457k6206N09J4857
9481G183l069r600J4871L8982N687k2975k6546n744L437J6941K0274K2741K847
9468F5029n977j1936j3677J2936k1409k4657j0199J228j374M847M297r837l226
9455a3955r320L539Q411R999K5242K489Q74M087k574k7260K227Rm859p647k4127
9440c2865n673P136k0116n865J9865M223J5296J2225k3155M031K7552K6680k0151
$$ plain form
9427 9183 -1504 -5301 -20943 -25021 7430 36303 55820 32713 4997 -16587 -17353 -37558 -48278
9414 -48278 -33808 -19960 -12972 717 15461 29782 34071 60226 62499 68762 31976 -14486 -26959
9401 -26959 -5708 -3888 -34365 -32799 -17798 -6543 -10417 -10008 -12855 -18457 -24653 -30023 -11640 -29303
9387 -29303 -29316 -26576 -7432 -36539 -33110 -2528 3929 -1054 9446 21231 11744 -7423 10002
9374 10002 13867 496 7293 2847 -37698 -51730 -10917 14037 -3707 -16473 -10622 6027 15074
9361 15074 7676 -5715 -26799 -32112 -5247 7221 -7041 -26618 -33490 -48112 -27271 -21019 -26441
9348 -26441 -33575 -45465 -19673 -5796 -22687 -23986 -14874 8854 16558 -1146 -27194 -17964 -12371
9335 -12371 -10708 7947 32457 20279 4120 -2322 -4344 -759 -6482 948 564 11026 -13002
$$ packed form
9427I183j0687l797j5642m078L2451K8873J9517k3107k7716k1584p66k0205j0720
9414d8278J4470J3848O988J3689J4744J4321M289K6155K273O263l6786m6462j2473
9401b6959K1251J820l0477J566J5001J1255l874M09k847n602o196n370J8383j7663
9387b9303j3K740J9144k9107L429L0582O457m983J0500J1785r487j9167J7425
9374A0002L865j3371O797m446m0545j4032M0813K4954j7744j2766N851J6649R047
9361A5074p398j3391k1084n313K6865J2468j4262j9577o872j4622K0841O252n422
9348b6441p134j1890K5792J3877j6891j299R112K3728P704j7704k6048R230N593
9335a2371J663J8655K4510j2178j6159o442k022L585n723P430l84J0462k4028
$$ plain form
9322 -13002 -18760 -11110 3492 12540 16668 31964 47592 56650 21968 -5426 15043 6409 -11512
9309 -11512 -7602 14664 12230 -11097 -33122 -17484 -15010 -27145 -4197 -12904 -24383 -33828 -19131
9296 -19131 -61 2515 30239 20327 -1732 -4538 -24665 -40631 -40233 -26678 -7050 -32049 -39886
9283 -39886 -41378 -45549 -39481 -23794 -37 -1997 -9058 -35357 -41091 -16918 -17633 -18464 -26376 -34454
9269 -34454 -42507 -32529 -28220 -15590 -24836 -29848 -33491 -23757 -853 1874 -1567 2278 -7215 -8518
9255 -8518 -13855 -32610 -16613 -13073 9831 22242 -2549 -37571 -29578 -29033 -26261 -8725 -6924
9242 -6924 10909 28509 18446 17694 17685 37417 42457 39257 28204 9683 2155 -10677 -3905 -1872
9228 -1872 -5092 -12764 -38254 -35080 -47260 -24058 -14192 -21985 14207 44648 52187 58505 44881
$$ packed form
9322a3002n758P650J4602R048M128J5296J5628R058l4682k7394K0469q634j7921
9309a1512L910K2266k434k3327k2025J5638K474j2135K2948q707j1479r445J4697
9296a9131J9070K576K7724r912k2059k806k0127j5966L98J3555J9628k4999p837
9283c9886j492m171O068J5687K3757j960p061k6299n734K4173p15q31p912q078
9269c4454q053R978M309J2630r246n012l643R734K2904K727l441L845r493j303
9255h518n337j8755J5997L540K2904J2411k4791l5022P993N45K772J7536J801
9242f924J7833J7600j0063p52rJ9732N040l200j1053j8521p528j2832O772K033
9228a872l220p672k5490L174j2180K3202R866p793L6192L0441P539O318j3624
$$ plain form
9215 44881 47871 74445 65574 38513 28781 22157 41977 57008 50803 34710 36643 16853 -10659
9202 -10659 -33020 -47555 -39662 -23605 -46524 -60904 -46740 -37822 -37291 -37896 5348 27619 17264
9189 17264 38452 37424 29232 22751 24181 45093 53258 57868 40373 18538 16428 36060 39688
9176 39688 42279 39159 35944 13363 -6802 2535 25220 15509 -18785 -13326 31851 61806 62157
9163 62157 46637 68426 78653 86126 79306 52027 43727 53289 50412 35854 15413 19395 16363
9150 16363 16594 -1003 -24190 -18344 8732 14798 15950 18026 24432 43403 67109 53591 13184
9137 13184 6623 19397 16130 14861 50129 54693 44685 25355 -10059 10 5447 3178 25913
9124 25913 23783 15033 18591 19444 11062 19521 30409 25341 16039 23575 26375 36987 28148 21471
$$ packed form
9215D4881K990K6574q871k7061r732o624J9820J5031o205j6093J933j9790k7512
9202a0659k2361j4535P893J6057k2919j4380J4164Q918N31o05M3244K2271j0355
9189A7264K1188j028q192o481J430K0912Q165M610j7495k1835k110J9632L628
9176C9688K591l120l215k2581k0165R337K2685r711l4294N459M5177K9955L51
9163F2157j5520K1789J0227P473o820k7279q300R562k877j4558k0441L982l032
9150A6363K31j7597k3187N846K7076O066J152K076O406J8971K3706j3518m0407
9137A3184o561J2774l267j269L5268M564j0008j9330l5414J0069N437k269K2735
9124B5913k130q750L558Q53q382Q459J0888n068r302P536K800J0612q839o677
$$ plain form
9110 21471 31644 25656 33008 23704 22244 24403 47114 47745 29746 8588 12084 6801 -22802 -16420
9096 -16420 -9499 -15047 5140 11832 57767 56369 38764 78989 79906 83934 53282 62275 67507 51802
9082 51802 51457 57951 57984 55033 49670 71824 77364 52938 29369 23654 34870 18186 1366 36183
9068 36183 56657 35869 30754 31517 34545 26578 23780 33198 29406 54159 61642 48481 36520 23481
9054 23481 10091 34107 25069 18382 -6473 2733 8798 8362 7838 23370 8603 6350 31990 51096
9040 51096 52152 27057 6462 2697 8577 15448 13737 12900 26629 5978 -14831 -9818 -30138
9027 -30138 -41847 -10374 9334 10739 12131 11093 12063 -711 2657 27277 25252 12773 7244
9014 7244 7229 -9619 -30130 -38469 -40628 -23521 -2527 20084 16643 46043 52544 34252 13047
$$ packed form
9110B1471J0173n988P352r304j460K159K2711O31j7999k1158L496n283k9603O382
9096a6420O921n548K0187O692M5935j398j7605M0225R17M028l0652Q993N232j5705
9082E1802l45O494L3k951n363K2154N540k4426k3569n715J1216j6684j6820L4817
9068C6183K0474k0788n115P63L028p967k798R418l792K4753P483j3161j1961j3039
9054B3481j3390K4016r038o687k4855R206O065m36n24J5532j4767k253K5640J9106
9040E1096J056k5095k0595l765N880O871j711q37J3729k0651k0809N013k0320
9027c0138j1709L1473J9708J405J392j038R70j2774L368K4620k025j2479n529
9014G244j5j6848k0511q339k159J7107K0994K2611l441K9400O501j8292k1205
$$ plain form
9001 13047 16950 35039 19763 -3189 -5627 -6028 10674 19663 22567 -1418 5040 22515 23951
8988 23951 26117 32740 23146 12634 -18743 -15159 -15470 -12324 -812 16621 18367 4830 -8688
8975 -8688 12915 26153 32593 8731 435 -5878 -6651 -12263 -6098 -7936 -3097 9260 -15207 -31285
8961 -31285 -21953 -7438 -23136 -36896 -1969 1141 -11172 10203 28811 9649 -4318 7792
8949 7792 23663 -6128 3124 562 -6775 8907 28117 3265 -8367 -2931 28233 38436 26845
8936 26845 -30169 -49467 -34764 -30949 -44824 -47391 -10287 -3828 6995 -10106 -12079 -12932 1364
8923 1364 8174 -20400 -34146 -2103 -828 -19378 -12688 -10874 -11506 -4996 -5998 -327 -14246 -34885
8909 -34885 -48250 -44976 -21078 13101 21217 19088 29319 37716 23938 9538 -24069 -1187 44994
$$ packed form
9001A3047L903J8089j5276k2952k438m01J6702Q989K904k3985O458J7475J436
8988B3951K166O623r594j0512l1377L584l11L146J1512J7433J746j3537j3518
8975h688K1603J3238O440k3862q296o313p73n612O165j838M839J2357k4467j6078
8961c1285R332J4515j5698j3760L4927L110j2313K1375J8608j9162j3967J2110
8949G792J5871k9791R252k562p337J5682J9210k4852j1632N436L1164J0203j1591
8936B6845n7014j9298J4703L815j3875k567L7104O459J0823j7101j973q53J4296
8923A364O810k8574j3746L2043J275j8550O690J814o32O510j002N671j3919k0639
8909c4885j3365L274K3898L4179Q116k129J0231Q397j3778j4400l3607K2882M6181
$$ plain form
8896 44994 39384 -1955 -32392 -4761 14675 21394 30483 38674 47876 19500 6261 2621 -108
8883 -108 5900 22932 24825 39726 30180 33427 6145 -36337 -28648 14175 20368 22186 31703 48656
8869 48656 47998 30833 34562 40392 67176 70334 61827 62456 23669 5068 -14599 -21172 13429 45773
8855 45773 70054 55895 23465 23242 25714 28749 37276 31400 42797 19776 -15241 -26140 -9050
8842 -9050 -743 8268 -4231 -27978 -21812 -14265 4624 10387 -5764 -10480 18591 16665 7648 -8509
8828 -8509 -15852 -5196 242 -15651 -6227 9904 17549 13415 28930 35925 36366 26191 31760 50610
8814 50610 50333 24785 10597 6819 15516 -229 -9109 -6620 -76 -4080 -9840 12106 13607 15797
8800 15797 3862 16686 42433 32399 12726 -8648 1994 36081 50151 62671 63750 36158
$$ packed form
8896D4994n610m1339l0437K7631J9436O719R089Q191R202k8376j3239l640k729
8883a08O008J7032J893J4901r546L247k7282m2482P689M2823O193J818R517J6953
8869D8656o58j7165L729N830K6784L158q507O29l8787j8601j9667o573L4601L2344
8855D5773K4281j4159l2430k23K472L035Q527n876J1397k3021l5017j0899J7090
8842i050Q307R011j2499k3747O166P547J8889N763j6151m716K9071j926r017j6157
8828h509p343J0656N438j5893R424J6131P645m134J5515O995M41j0175N569J8850
8814E0610k77k5548j4188l778Q697j5745q880K489O544m004n760K1946J501K190
8800A5797j1935J2824K5747j0034j9673k1374J0642L4087J4070J2520J079k7592
$$ plain form
8788 36158 11069 29596 26451 18176 39454 24198 25446 10443 11460 3705 -12262 -15334 -33903
8775 -33903 -1149 -7940 -13524 -20817 -25917 -26088 -32544 5619 18466 -8703 -26010 -12851 6812
8762 6812 28009 23162 17439 19221 46355 61441 59672 42722 16693 9033 -11317 -22131 -27664
8749 -27664 -28685 -10137 9444 7069 18831 36149 33118 19509 -1396 -23100 -20801 18859 28267
8736 28267 18575 12527 21159 21216 15756 -2187 -18652 -17230 -12259 6835 -7324 3974 12780 32336
8722 32336 26979 28158 29862 11021 33323 17445 1884 9614 10565 -1119 -3623 -14741 -20767
8709 -20767 -5417 933 -3540 -11548 -31706 -50432 -43287 -36030 -35356 -19594 -5088 5160 26155
8696 26155 34883 33895 37207 54002 50433 34055 7468 -13010 -23179 -2077 18290 21042 10669
$$ packed form
8788C6158k5089J8527l145q275K1278j5256J248j5003J017p755j5967l072j8569
8775c3903L2754o791n584p293n100j71o456L8163J2847k7169j7307J3159J9663
8762F812K1197m847n723J782K7134J5086j769j6950k6029p660k0350j0814n533
8749b7664j021J8548J9581k375J1762J7318l031j3609k0905k1704K299L9660R408
8736B8267r692o048Q632N7n460j7943j6465J422M971J9094j4159J1298Q806J9556
8722C2336n357J179J704j8841K2302j5878j5561P730R51j1684k504j1118o026
8709b0767J5350O350m473q008k0158j8726P145P257O74J5762J4506J0248K0995
8696B6155Q728r88L312J6795l569j6378k6587k0478j0169K1102K0367K752j0373
$$ plain form
8683 10669 24763 22911 22276 27710 38675 49818 64728 67595 70825 40174 43024 66998 57220
8670 57220 50213 75797 114436 140162 148188 191784 255917 374635 489133 553196 531156 460198
8658 460198 370415 287887 246082 208472 177241 134721 142106 143692 108278 73824 57016 52390
8646 52390 47834 44091 52942 71966 76951 93552 101051 118867 114996 100250 58663 57463 73674
8633 73674 79992 100391 110067 109785 103770 110113 120613 130340 142915 159270 213097 245656 304654
8620 304654 399191 519992 715331 970300 1182739 1310636 1246522 1043965 840611 630726
8610 630726 485176 392492 306924 224210 161578 142854 132273 89701 58688 70373 90722
8599 90722 94454 89495 74459 60965 52133 39723 71207 119023 120199 95244 84141 69503 64534
$$ packed form
8683A0669J4094j852o35N434J0965J1143J4910K867L230l0651K850K3974r778
8670E7220p007K5584L8639K5726Q026M3596O4133J18718J14498O4063k2040p0958
8658D60198q9783q2528m1805l7610l1231m2520P385J586l5414l4454j6808m626
8646E2390m556l743Q851J9024M985J6601P499J7816l871j4746m1587j200J6211
8633G3674O318K0399R676k82o015O343J0500R727J2575J6355N3827L2559N8998
8620C04654R4537J20801J95339K54969K12439J27897o4114k02557k03354k09885
8610F30726j45550r2684q5568q2714o2632j8724j0581m2572l1013J1685K0349
8599I0722L732m959j5036j3494q832j2410L1484M7816J176k4955j1103j4638m969
$$ plain form
8586 64534 45600 60228 78483 75485 70870 76714 113341 149447 160318 170798 188434 228624
8574 228624 317437 405239 489624 641908 787357 842473 807231 708812 637859 605638 600351
8563 600351 544430 495541 477835 446420 372572 286015 264274 239903 229708 251206 246839 204887
8551 204887 189093 197787 181326 145955 129576 133668 102705 127396 144855 166863 175593 180181
8539 180181 210470 236372 242029 276172 317380 393946 505455 644422 791128 956522 1141732
8528 1141732 1228273 1182997 1005764 826789 692273 590062 535003 483444 448044 398706 360389
8517 360389 343457 311484 264086 241625 239784 224270 188957 210351 245617 256007 258450 283640
8505 283640 316319 322277 314951 307902 271895 249190 240601 238584 232243 259911 287290 262696 276161
$$ packed form
8586F4534j8934J4628J8255k998m615N844L6627L6106J0871J0480J7636M0190
8574B28624Q8813Q7802Q4385J52284J45449N5116l5242r8419p0953l2221n287
8563F00351n5921m8889j7706l1415p3848q6557k1741k4371j0195K1498m367m1952
8551B04887j5794Q694j6461l5371j6379M092l0963K4691J7459K2008Q730M588
8539A80181L0289K5902N657L4143M1208P6566J11509J38967J46706J65394J85210
8528A141732Q6541m5276j77233j78975j34516j02211n5059n1559l5400m9338l8317
8517C60389j6932l1973m7398k2461j841j5514l5313K1394L5266J0390K443K5190
8505B83640L2679N958p326p049l6007k2705q589k017o341K7668K7379k4594J3465
$$ plain form
8492 276161 317861 368790 481295 632545 838162 1063872 1328411 1649667 2034984 2394705
8482 2394705 2418678 2017770 1481084 1046561 776657 612840 492450 415860 353345 323370
8472 323370 290600 275808 303907 317009 316903 319125 318335 331801 352681 375828 407863 458362 501246
8459 501246 513208 460218 407503 366217 327907 309107 283708 288137 310552 306468 310183 345493
8447 345493 367978 386488 449849 526353 614651 741033 931775 1173782 1437290 1699806 1892968
8436 1892968 1899830 1712916 1469607 1208300 941968 747120 621857 515422 451953 399426
8426 399426 332986 340107 324071 314074 342613 348611 352868 339609 328871 349265 384878 408233
8414 408233 418312 421934 391572 364095 332471 277090 250395 224664 218448 255480 286485 341473
$$ packed form
8492B76161M1700N0929J12505J51250K05617K25710K64539L21256L85317L59721
8482B394705K3973m00908n36686m34523k69904j63817j20390p6590o2515k9975
8472C23370l2770j4792K8099J3102j06K222p90J3466K0880K3147L2035N0499M2884
8459E01246J1962n2990n2715m1286l8310j8800k5399M429K2415m084L715L5310
8447C45493K2485J8510O3361P6504Q8298J26382J90742K42007K63508K62516J93162
8436A892968O862j86914k43309k61307k66332j94848j25263j06435o3469n2527
8426C99426o6440P121j6036r997K8539N998M257j3259j0738K0394L5613K3355
8414D08233J0079L622l0362k7477l1624n5381k6695k5731o216L7032L1005N4988
$$ plain form
8402 341473 370636 354763 350113 349178 381990 445630 534747 650520 844686 1125183 1457074
8391 1457074 1803973 2053835 2031869 1722188 1306838 965887 757795 641534 540461 450921
8381 450921 391121 314004 323838 358876 329063 311951 317656 357808 401661 402214 350948 299624
8369 299624 271360 220516 192562 189384 208948 201806 215047 230109 228034 235668 282392 354158
8357 354158 422793 453515 467121 520860 621043 762476 909063 1000350 1020838 1019286 1064713
8346 1064713 1107957 1143156 1105467 994043 872974 722093 583496 477286 396298 351135
8336 351135 310927 283147 276260 268356 237837 225294 255066 272722 267766 257801 261342 235156 214829
8323 214829 174017 165493 146658 136049 129236 138256 155002 165313 184282 204550 244783 321263
$$ packed form
8402C41473K9163j5873m650r35L2812O3640Q9117J15773J94166K80497L31891
8391A457074L46899K49862k1966l09681m15350l40951k08092j16261j01073q9540
8381D50921n9800p7117R834L5038k9813j7112N705M0152M3853N53n1266n1324
8369B99624k8264n0844k7954l178J9564p142J3241J5062k075P634M6724P1766
8357C54158O8635L0722J3606N3739J00183J41433J46587R1287K0488j552M5427
8346A064713M3244L5199l7689j11424j21069j50881j38597j06210q0988m5163
8336C51135m0208k7780o887p904l0519j2543K9772J7656m956r965L541k6186k0327
8323B14829m0812q524j8835j0609o813R020J6746J0311J8969K0268M0233P6480
$$ plain form
8311 321263 346472 407996 529678 658304 838099 1042847 1210622 1280554 1159533 941688
8301 941688 677306 483858 371535 280752 204113 177063 165093 127116 104959 91000 85121
8290 85121 78855 98795 97288 66128 74756 84607 71371 70423 76138 52480 41834 46117 60073
8277 60073 45249 19467 28048 24607 31891 47387 71014 91380 97017 75064 78925 127157 171484
8264 171484 236318 274868 344978 391777 461500 520626 513220 437697 363878 282637 193662 120085
8252 120085 88835 88762 71857 38118 5261 9785 18618 21070 13740 17297 35957 31556 1043
8239 1043 8464 11185 2744 21781 25344 32474 51763 55905 32461 42745 55034 29804 5250
8226 5250 16773 31208 27564 13912 32726 55033 61159 21077 9391 21178 30454 19787 21623
$$ packed form
8311C21263K5209O1524J21682J28626J79795K04748J67775O9932j21021k17845
8301I41688k64382j93448j12323r0783p6639k7050j1970l7977k2157j3959n879
8290H5121o266J9940j507l1160Q628R851j3236r48N715k3658j0646M283J3956
8277F0073j4824k5782Q581l441P284J5496K3627K0366N637k1953L861M8232M4327
8264A71484O4834L8550P0110M6799O9723N9126p406p5523p3819q1241q8975p3577
8252A20085l1250p3j6905l3739l2857M524Q833K452p330L557J8660m401l0513
8239A043P421K721q441J9037L563P130J9289M142k3444J0284J2289k5230k4554
8226E250J1523J4435l644j3652J8814K2307O126m0082j1686J1787R276j0667J836
$$ plain form
8213 21623 22266 42029 42242 21315 20513 13187 15292 26310 20888 9779 26273 10070 -2355 -4806
8199 -4806 -15365 12398 24557 10423 11199 6170 31314 66898 88512 80092 51871 45949 32128
8186 32128 24783 244 -12159 14321 49331 59159 64457 28904 -9970 -11278 -15660 -14428 4685
8173 4685 20007 30755 21215 -18 7944 17701 16261 18281 10647 14203 13763 7374 16841 33268
8159 33268 25520 31245 11874 -23960 -25454 -18948 -3175 7429 -2098 17975 14944 38966 21412
8146 21412 -6934 5294 9543 -2203 -30549 -3559 37212 29972 29810 20544 33067 47402 43832
8133 43832 45182 32085 32208 39297 28712 7740 -18585 -32523 -45898 -40860 -22279 -16643 -51076
8120 -51076 -41454 -29041 -21789 -8843 -15119 -15271 -14730 14501 17120 -7250 -12227 -2609 10998 22792
$$ packed form
8213B1623O43J9763K13k0927q02p326K105J1018n422j1109J6494j6203j2425k451
8199d806j0559K7763J2159j4134P76n029K5144L5584K1614q420k8221n922j3821
8186C2128p345k4539j2403K6480L5010R828N298l5553l8874j308m382J232J9113
8173D685J5322J0748r540k1233P962R757j440K020p634L556m40o389R467J6427
8159C3268p748N725j9371l5834j494O506J5773J0604r527K0073l031K4022j7554
8146B1412k8346J2228M249j1746k8346K6990M0771p240j62r266J2523J4335l570
8133D3832J350j3097J23P089j0585k0972k6325j3938j3375N038J8581N636l4433
8120e1076R622J2413P252J2946o276j52N41K9231K619k4370m977R618J3607J1794
$$ plain form
8106 22792 60555 36224 4236 -15742 -594 5858 -2201 -6175 -4900 -4554 -9915 -948 -394 6544
8092 6544 -1432 -20443 -27462 -21931 9593 16965 20915 17795 21794 18911 9205 19031 28128 44688
8078 44688 26039 13134 15884 34923 20461 12838 28764 35240 32274 39989 44573 37322 33952
8065 33952 42092 22548 -5906 -20922 -19563 864 13371 -14232 3969 33539 39783 48056 24665
8052 24665 -15683 -1649 18290 23070 26061 5581 12322 20757 19936 24947 15706 17700 9800 -7926
8038 -7926 -4211 -11151 9129 9575 -679 6686 12124 8780 -6771 -4478 -6872 10628 42773 55853
8024 55853 61277 65992 76663 99956 106028 109129 105084 87282 64971 48206 46083 21889 39726
8011 39726 53491 52786 72879 98037 98070 107450 112128 128530 109152 85010 86324 104926 84432
$$ packed form
8106B2792L7763k4331l1988j9978J5148O452q059l974J275L46n361Q967N54O938
8092F544p976j9011p019N531L1524P372L950l120L999k883r706R826R097J6560
8078D4688j8649j2905K750J9039j4462p623J5926O476k966P715M584p251l370
8065C3952Q140j9544k8454j5016J359K0427J2507k7603J8201K9570O244Q273k3391
8052B4665m0348J4034J9939M780K991k0480O741Q435q21N011r241J994p900j7726
8038g926L715o940K0280M46j0254P365N438l344j5551K293k394J7500L2145J3080
8024E5853N424M715J0671K3293O072L101m045j7802k2311j6765k123k4194J7837
8011C9726J3765p05K0093K5158L3R380M678J6402j9378k4142J314J8602k0494
$$ plain form
7998 84432 33857 2371 8802 26464 45947 31174 41192 64191 62479 39816 14947 40713
7986 40713 41978 35249 36146 56464 66849 89466 122030 142585 171779 211151 246980 240505 238665
7973 238665 214564 178112 181148 154518 147036 169167 162553 127001 113653 90620 96781 144359
7961 144359 181011 200340 194509 171461 148165 126434 104526 115893 132884 116207 83468 79453
7949 79453 67337 43596 62272 55345 46633 27865 36655 45519 43284 61733 89204 99173 105067
7936 105067 114719 128013 153654 172313 167766 153007 145309 127787 125950 129984 134167 118438 106318
7923 106318 88924 87521 98267 92163 90215 71204 78548 63281 45940 48931 87376 81474 69227
7910 69227 47152 34788 53092 34531 28581 41980 58674 71547 77488 96088 98385 94020 83700
$$ packed form
7998H4432n0575l1486O431J7662J9483j4773J0018K2999j712k2663k4869K5766
7986D0713J265o729Q97K0318J0385K2617L2564K0555K9194L9372L5829o475j840
7973B38665k4101l6452L036k6630p482K2131o614l5552j3348k3033O161M7578
7961A44359L6652J9329n831k3048k3296k1731k1908J1367J6991j6677l2739m015
7949G9453j2116k3741J8676o927q712j8768Q790Q864k235J8449K7471R969N894
7936A05067R652J3294K5641J8659m547j4759p698j7522j837M034M183j5729j2120
7923A06318j7394j403J0746o104j948j9011P344j5267j7341K991L8445n902j2247
7910F9227k2075j2364J8304j8561n950J3399J6694J2873N941J8600K297m365j0320
$$ plain form
7897 83700 67246 52563 39376 34265 55039 47333 66853 94421 81575 72332 48830 43119 46295
7884 46295 59322 63007 68491 61566 57459 34952 33338 38002 25040 19719 22215 16172 5651 8744
7870 8744 16523 12800 30136 54381 68814 54136 27218 7919 -847 9600 20660 10214 8825
7857 8825 7692 23491 35228 29394 27618 40978 63229 71896 51464 69079 70103 38026 7989
7844 7989 15694 51804 82267 79285 68371 58642 75942 65486 19476 3767 9560 1055 33
7831 33 5752 16179 38419 58089 50831 48074 32413 22044 -6863 -29845 -7222 -2820 -17330
7818 -17330 -36204 -17698 -21771 -17724 -10509 2998 -1869 -10901 -12210 -11036 25988 32372 18900
7805 18900 17117 13699 24211 11000 -17030 -17355 -48828 -59412 -64293 -53487 -3791 -9883 -22169
$$ packed form
7897H3700j6454j4683j3187n111K0774p706J9520K7568j2846r243k3502n711L176
7884D6295J3027L685N484o925m107k2507j614M664j2962n321K496o043j0521L093
7870H744P779l723J7336K4245J4433j4678k6918j9299q766J0447J1060j0446j389
7857H825j133J5799J1737n834j776J3360K2251Q667k0432J7615J024l2077l0037
7844G989P705L6110L0463k982j0914r729J7300j0456m6010j5709N793q505j022
7831C3N719J0427K2240J9670p258k757j5661j0369k8907k2982K2623M402j4510
7818a7330j8874J8506m073M047P215J3507m867r032j309J174L7024O384j3472
7805A8900j783l418J0512j3211k8030l25l1473j0584m881J0806M9696o092j2286
$$ plain form
7792 -22169 -4867 2977 -9555 220 14043 23662 9653 20947 26926 13667 -19103 -15935 -1629
7779 -1629 -4217 -13350 -31990 -38529 -15774 -16107 -21493 -27279 -13067 -569 -7136 -25499 -33015 -26159
7765 -26159 -8588 4886 17800 -9088 -11182 -2558 3847 1972 -21571 -10262 5814 -13027 -18944
7752 -18944 -20278 -25549 -23789 -18688 -4157 12753 11282 -10212 -32751 -44974 -52575 -51272 -39176
7739 -39176 -53991 -37474 -31581 -37127 -27632 -2368 18837 21219 7974 18729 -1021 -21217 -21619
7726 -21619 -29019 -36157 -36578 777 20348 33825 45558 46770 39539 46804 30376 14777 21483
7713 21483 44159 47577 14753 -24585 -36008 -16834 152 4029 9474 28736 4164 -6362
7701 -6362 -12010 -24873 -21109 -17341 -34372 -27183 -9775 -4549 -19818 -15796 -2312 1784 -16699
$$ packed form
7792b2169J7302P844j2532R775J3823R619j4009J1294N979j3259l2770L168J4306
7779a629k588r133j8640o539K2755l33n386n786J4212J2498o567j8363p516O856
7765b6159J7571J3474J2914k6888k094Q624O405j875k3543J1309J6076j8841n917
7752a8944j334n271J760N101J4531J6910j471k1494k2539j2223p601J303J2096
7739c9176j4815J6517N893n546R495K5264K1205K382j3245J0755j9750k0196m02
7726b1619p400p138m21L7355J9571J3477J1733J212p231P265j6428j5599O706
7713B1483K2676L418l2824l9338j1423J9174J6986L877N445J9262k4572j0526
7701f362n648j2863L764L768j7031P189J7408N226j5269M022J3484M096j8483
$$ plain form
7688 -16699 -21297 -20839 2908 32430 16210 -2714 9227 -15963 -18219 -15959 -11278 -12675 -40726
7675 -40726 -38827 -37124 -40673 -29035 -40580 -52603 -33781 -37746 -18884 -13153 -27875 -38778 -36988
7662 -36988 -4462 10553 -19319 -32699 -30543 -15359 -20412 -59223 -75271 -40181 -4873 13404
7650 13404 5742 -22309 -22094 -2069 8694 1181 -7592 -3196 2509 3266 402 5430 -9441 -7113
7636 -7113 5125 11841 24126 15977 27852 26437 137 -20138 -20728 -21772 -34685 -36066 -11545
7623 -11545 4198 -4096 1671 10922 -25162 -24189 -34996 -29785 2075 10066 18341 24682 29990 9933
7609 9933 3310 -7630 2341 -4564 -11325 -9044 -33352 -32329 -31793 -22467 -32076 -24777 4107 43661
7595 43661 38380 33149 45648 10073 -5500 10309 2932 -14974 -12410 -28871 -34054 -20018 -16314
$$ packed form
7688a6699m598M58K3747K9522j6220j8924J1941k5190k256K260M681j397k8051
7675d0726J899J703l549J1638j1545j2023J8822l965J8862N731j4722j0903J790
7662c6988L2526J5015k9872j3380K156J5184n053l8811j6048L5090L5308J8277
7650A3404p662k8051K15K0025J0763p513q773M396N705P57k864N028j4871K328
7636g113J2238O716J2285q149J1875j415k6300k0275n90j044j2913j381K4521
7623a1545J5743q294N767R251l6084R73j0807N211L1860P991Q275O341N308k0057
7609I933o623j0940R971o905o761K281k4308J023N36R326r609P299K8884L9554
7595D3661n281n231J2499l5575j5573J5809p377j7906K564j6461n183J4036L704
$$ plain form
7582 -16314 7299 21870 -5938 -17788 24344 31669 15494 -15862 -33985 -29628 -18478 -26109
7570 -26109 -47496 -54398 -53654 -38603 -45024 -29177 -12336 -9945 -7927 -8805 14785 -4283 -31735
7557 -31735 -45790 -51346 -24450 -9937 8908 -6552 -22743 -5613 3348 -11252 -42197 -16092
7545 -16092 -11063 -7823 -21358 -20014 2489 1542 -5269 3490 16375 -1587 2856 -6623 -10175 -12364
7531 -12364 -19688 -18758 -18727 -19250 -28042 -27811 -26338 1299 5799 -7946 -18756 -1512 -4327 -641 21957
7516 21957 21974 -1542 -16316 -1048 -6206 -13108 -35847 -19385 5691 1837 -8920 1038 -6974
7503 -6974 284 9602 -14178 -45345 -50392 -17459 3470 -13259 -3221 -4178 11240 2249 -17108
7490 -17108 -19251 -12602 -13531 -31844 285 5856 -17040 -8009 -5042 -18993 -22134 -2173 6394 -25713
$$ packed form
7582a6314K3613J4571k7808j1850M2132P325j6175l1356j8123M357J1150p631
7570b6109k1387o902P44J5051o421J5847J6841K391K018q78K3590j9068k7452
7557c1735j4055n556K6896J4513J8845j5460j6191J7130Q961j4600l0945K6105
7545a6092N029L240j3535J344K2503r47o811Q759J2885j7962M443r479l552k189
7531a2364p324R30L1n23q792K31J473K7637M500j3745j0810J7244k815L686K2598
7516B1957J7k3516j4774J5268n158o902k2739J6462K5076l854j0757R958q012
7503f974P258R318k3780l1167n047L2933K0929j6729J0038r57J5418q991j9357
7490a7108k143O649r29j8313L2129N571k2896R031K967j3951l141J9961Q567l2107
$$ plain form
7476 -25713 -40760 -40430 -50845 -55233 -37357 -15243 -6873 -7848 -16276 -13659 -36188 -41252 -16996 12904
7462 12904 38053 34416 15986 8531 -3241 6171 -12326 -7309 5988 20501 24530 18205 1961
7449 1961 -4484 -8800 -15493 -7674 8556 -9199 -35239 -27102 -14159 -20866 -34972 -47570 -42894
7436 -42894 -50224 -57985 -40502 -4001 196 -12248 -27367 -19127 -16765 -17196 -17234 -18894 -6385 -2336
7422 -2336 -15834 -5753 -12961 -33546 228 32614 26519 13071 -10020 6698 22698 12676
7410 12676 -13793 -52 21234 315 17026 24241 22591 -564 -28930 -50290 -56651 -46641
7398 -46641 -26466 -5078 5084 21951 9326 -3899 -17676 -12415 -7449 -16188 8083 -3825
7386 -3825 -23724 -45109 -40511 -17134 -24844 -32639 -37225 -22695 -15744 -5551 -7211 -18776 -15561
$$ packed form
7476b5713j5047L30j0415m388J7876K2114Q370r75q428K617k2529n064K4256K9900
7462A2904K5149l637j8430p455j1772R412j8497N017J3297J4513M029o325j6244
7449A961o445m316o693P819J6230j7755k6040Q137J2943o707j4106j2598M676
7436d2894p330p761J7483L6501M197j2444j5119Q240K362m31l8j660J2509M049
7422b336j3498J0081p208k0585L3774L2386o095j3448k3091J6718J6000j0022
7410A2676k6469J3741K1286k0919J6711P215j650k3155k8366k1360o361J0010
7398d6641K0175K1388J0162J6867j2625j3225j3777N261M966q739K4271j1908
7386c825j9899k1385M598K3377p710p795m586J4530O951J0193j660j1565L215
$$ plain form
7373 -15561 -30215 -14198 -7159 -12853 -27410 -12239 24183 2816 -3196 10576 24780 24810 21567
7360 21567 3271 355 9292 22313 30894 25213 2951 -8446 -24179 -5794 23114 21652 13013
7347 13013 28183 12762 6347 -1524 -16883 -27008 -22014 -35917 -25333 -12846 -17541 -27377 -36326
7334 -36326 -33957 -36327 -45177 -12476 16726 19018 13833 -4067 -15438 -19898 -4903 -14142 -11808
7321 -11808 -30202 -11317 5922 -5164 -5624 -10536 -31661 -40105 -30124 -19825 -6655 5612 17232
7308 17232 37251 37680 26528 -720 -12784 -21645 -10081 2073 -21465 -28755 -4858 15084 -14247
7295 -14247 -41409 -55426 -53772 -77802 -63742 -25182 -9453 2593 9672 2893 9714 271 -17673
7282 -17673 -4179 5037 -285 4580 1773 -16604 -45995 -46787 -45402 -9698 -4897 2095 18599 15626
$$ packed form
7373a5561j4654J6017P039n694j4557J5171L6422k1367o012J3772J4204L0l243
7360B1567j8296k916Q937J3021Q581n681k2262j1397j5733J8385K8908j462q639
7347A3013J5170j5421o415p871j5359j0125M994j3903J0584J2487m695r836q949
7334c6326K369k370q850L2701K9202K292n185j7900j1371m460J4995r239K334
7321a1808j8394J8885J7239j1086m60m912k1125q444R981J0299J3170J2267J1620
7308A7232K0019M29j1152k7248j2064q861J1564J2154k3538p290K3897J9942k9331
7295a4247k7162j4017J654k4030J4060L8560J5729J2046P079o779O821r443j7944
7282a7673J3494R216n322M865k807j8377k9391p92J385L5704M801O992J6504k973
$$ plain form
7268 15626 17447 27434 -3059 -30534 -31846 -15240 -23634 -11866 5345 6779 6085 -16318 -33462
7255 -33462 -15962 4092 -333 -15102 -21764 -14896 -5352 26193 41493 41479 16275 -19981 -16402
7242 -16402 5238 8976 13838 -7433 -18712 -22128 -33126 -24303 -9134 20673 12965 4589 8072
7229 8072 -19661 -10615 -24891 -25418 -28465 -13201 -8039 -23211 -17883 -18564 -37992 -37004 -24754 -23073
7215 -23073 -4911 -10652 -29502 -28417 -12007 -10912 -8134 -33848 -57151 -42286 -19617 -11098 -18219
7202 -18219 -22440 -11457 -17841 -38836 -50631 -63434 -87657 -67137 -30829 -24021 -19870 -23525 -22499
7189 -22499 -30670 -29413 7039 1364 -2633 -8584 -13868 -3822 127 -4622 -2016 2260 -32628 -37206
7175 -37206 -10062 -318 -20576 -44004 -41660 -54073 -42482 -36466 -21634 -13906 -31911 -15095 21484
$$ packed form
7268A5626J821R987l0493k7475j312J6606q394J1768J7211J434o94k2403j7144
7255c3462J7500K0054m425j4769o662O868R544L1545J5300j4k5204l6256L579
7242a6402K1640L738M862k1271j1279l416j0998Q823J5169K9807p708q376L483
7229H072k7733R046j4276n27l047J5264N162j5172N328o81j9428R88J2250J681
7215b3073J8162n741j8850J085J6410J095K778k5714k3303J4865K2669Q519p121
7202a8219m221J0983o384k0995j1795j2803k4223K0520L6308O808M151l655J026
7189b2499q171J257L6452n675l997n951n284J0046L949m749K606M276l4888m578
7175c7206K7144R744k0258k3428K344j2413J1591O016J4832P728j8005J6816L6579
$$ plain form
7162 21484 11646 32502 43144 34831 20628 8159 90 16238 -17551 -42177 -69549 -67747 -42613
7149 -42613 -23690 -24047 -18168 -41826 -55911 -31174 -45364 -62207 -75342 -68856 -37677 -19928 -12446
7136 -12446 8120 21940 15614 -1161 7031 31288 40292 2428 -3064 30645 25895 -12965 -63575
7123 -63575 -63800 -45933 -39083 -41665 -40087 -14367 12721 -14827 -14222 -8839 2285 1963 14364 16042
7109 16042 5414 -6435 -7744 -9865 -19845 -18791 -31341 -41095 -22154 -3491 7810 7854 -11787
7096 -11787 -18024 -11989 -49 12266 10180 22313 42713 27716 -3103 -3288 7379 16929 28797
7083 28797 365 -25159 -3178 -6192 -4825 9258 24604 11619 -13911 -14142 -19524 -21851 10619
7070 10619 29552 15452 -15304 13008 25529 10551 -34425 -42162 -18868 7230 -6629 -5271
$$ packed form
7162B1484r838K0856J0642q313j4203j2469q069J6148l3789k4626k7372J802K5134
7149d2613J8923l57N879k3658j4085K4737j4190j6843j3135O486L1179J7749P482
7136a2446K0566J3820o326j6775Q192K4257R004l7864n492L3709m750l8860n0610
7123f3575k25J7867O850k582J578K5720K7088k7548O05N383J1124l22J2401J678
7109A6042j0628j1849j309k121r980J054j2550r754J8941J8663J1301M4j9641
7096a1787o237O035J1940J2315k086J2133K0400j4997l0819j85J0667R550J1868
7083B8797k8432k5524K1981l014J367J4083J5346j2985k5530k31n382k327L2470
7070A0619J8933j4100l0756K8312J2521j4978m4976p737K3294K6098j3859J358
$$ plain form
7058 -5271 -6876 -12399 -3583 -17076 -18399 -26976 -48187 -20132 -4036 7114 -32453 -41447 -22772
7045 -22772 -27598 -6464 7329 9790 9429 18090 14163 -3474 -17420 -18000 -20601 -17964 3106 22995
7031 22995 11841 15263 23713 1063 -6531 4279 -3065 435 11958 20464 17928 1350 -25323
7018 -25323 -41733 -38471 -18012 -40663 -42156 -29776 -2169 17225 8100 -3495 9279 31043
7006 31043 24924 9793 -37533 -53064 -36074 -38456 -2843 4500 7308 21812 16031 28891 34936
6993 34936 36564 43951 26346 21920 1704 -4345 -8636 -9955 -29298 -19777 -20334 -35099 -34002 -52448
6979 -52448 -49159 -50275 -44136 -30270 -11699 -12437 -28045 -18036 -2778 412 1079 34224 35740 29918
6965 29918 14594 9061 8581 773 -3313 -8553 4807 5044 -1557 -6502 -17779 -19336 -20760 -26352
$$ packed form
7058e271j605n523Q816j3493j323q577k1211K8055J6096J1150l9567q994J8675
7045b2772m826K1134J3793K461l61Q661l927j7637j3946n80k601K637K1070J9889
7031B2995j1154L422Q450k2650p594J0810p344L500J1523Q506k536j6578k6673
7018b5323j6410L262K0459k2651j493J2380K7607J9394r125j1595J2774K1764
7006C1043o119j5131m7326j5531J6990k382L5613P343K808J4504n781J2860O045
6993C4936J628P387j7605m426k0216o049m291j319j9343R521n57j4765J097j8446
6979e2448L289j116O139J3866J8571p38j5608J0009J5258L190O67L3145J516n822
6965B9918j5324n533m80p808m086n240J3360K37o601m945j1277j557j424n592
$$ plain form
6951 -26352 -16962 7038 26421 40088 27611 18329 13411 -1654 7245 6951 -6006 -4148 -1249
6938 -1249 -10926 18182 29935 -10826 -21296 -9759 -12158 -26858 -31635 -27285 -14327 -24697 -51052
6925 -51052 -47982 -44716 -43144 -43113 -46705 -42089 -31675 -16008 -24865 -44860 -35041 -22551 -27042 -16279
6911 -16279 -20031 -17602 -26596 -37491 -40481 -53988 -47387 -29195 -4111 -27855 -25917 -38528 -15712
6898 -15712 -3909 -15997 -24398 -33101 -29871 8204 31808 54366 29602 3659 -1179 5991 -3667
6885 -3667 10196 -17518 -18843 -7050 12186 -1775 11105 20110 28676 7354 10538 6045 15741
6872 15741 1779 3694 5331 20317 11368 6254 -4278 6461 7074 16629 2125 -14365 -2858
6859 -2858 -11269 -20086 -5366 7653 7887 4380 6467 13059 11470 12087 -2426 -22195 -15394 15176
$$ packed form
6951b6352R390K4000J9383J3667j2477r282m918j5065Q899k94j2957J858K899
6938a249r677K9108J1753m0761j0470J1537k399j4700m777M350J2958j0370k6355
6925e1052L070L266J572L1l592M616J0414J5667q857j9995R819J2490m491J0763
6911a6279l752K429q994j0895k990j3507O601J8192K5084k3744J938j2611K2816
6898a5712J1803j2088q401q703L230L8075K3604K2558k4764k5943m838P170r658
6885c667J3863k7714j325J1793J9236j3961J2880R005Q566k1322L184m493R696
6872A5741j3962J915J637J4986q949n114j0532J0739O13R555j4504j6490J1507
6859b858q411q817J4720J3019K34l507K087O592j589O17j4513j9769O801L0570
$$ plain form
6845 15176 12807 675 -1042 -6773 -4376 9978 16564 2190 -22397 -5854 -9610 -3610 -14630
6832 -14630 -24956 -6202 -3937 -8193 -5168 13716 23766 31389 35263 31723 21699 -6187 -16315
6819 -16315 -24934 -11775 -4559 3705 5067 12473 -8235 -23591 -32841 -3853 13921 32568 32644 25547
6805 25547 6126 5416 -8313 -16759 -14723 -33010 -20715 -3499 -20646 -12311 -4552 -8181 -30886
6792 -30886 -10417 10943 25078 1214 -7128 -7464 -24389 -9057 10377 7334 7233 12387 -2900
6779 -2900 -9798 -22693 -44374 -48978 -49931 -29412 -29177 -9877 12262 -9805 -39495 -33870 -39127 -31471
6765 -31471 -22173 -790 1107 -12405 -19966 -8504 1997 14358 14676 24628 6547 24775 31395
6752 31395 18474 14272 2882 -4472 -20760 -36954 -25194 -1102 22797 25909 -3726 -6015 -3086
$$ packed form
6845A5176k369j2132j717n731K397J4354O586j4374k4587J6543l756O000j1020
6832a4630j0326J8754K265m256L025J8884J0050P623L874l540j0024k7886j0128
6819a6315q619J3159P216Q264J362P406k0708j5356r250K8988J7774J8647P6p097
6805B5547j9421p10j3729q446K036j8287J2295J7216j7147Q335P759l629k2705
6792c0886K0469K1360J4135k3864q342l36j6925J5332J9434l043j01N154j5287
6779b900o898j2895k1681m604r53K0519K35J9300K2139k2067k9690N625n257P656
6765c1471R298K1383J897j3512p561J1462J0501J2361L18R952j8081J8228O620
6752C1395j2921m202j1390p354j6288j6194J1760K4092K3899L112k9635k289K929
$$ plain form
6739 -3086 -11386 12964 34465 7583 -3367 12183 23707 35855 22185 7033 14584 23183 26585
6726 26585 7984 -5328 -15656 -6939 453 22699 40606 63346 36285 585 -26110 -34965
6714 -34965 -39659 -11712 13974 -206 -33967 -39637 -35914 -55859 -41177 -24503 -15016 -17476 -15928
6701 -15928 -1110 29222 28813 4754 9301 -11423 30 6219 9136 14015 26681 32026 23540
6688 23540 -6932 -27485 -6724 17286 27624 7683 -24106 -21345 -14497 -19432 -17983 -13659 13833
6675 13833 18303 -604 -16923 -16884 -20005 -23111 -16706 -9546 6094 28514 23971 30407 29482 -2631
6661 -2631 -21429 -7716 -19895 -24704 -35194 -19913 -24715 -39046 -31226 -25149 14929 23522 4124
6648 4124 -15764 -12692 -22717 -32077 -34600 707 11160 1256 19058 30925 30402 16092 -2495
$$ packed form
6739c086q300K4350K1501k6882j0950J5550J1524J2148j3670j5152P551Q599L402
6726B6585j8601j3312j0328Q717P392K2246J7907K2740k7061l5700k6695q855
6714c4965m694K7947K5686j4180l3761n670L723j9945J4682J6674R487k460J548
6701a5928J4818L0332m09k4059M547k0724J1453O189K917M879J2666N345q486
6688B3540l0472k0553K0761K4010J0338j9941l1789K761O848m935J449M324K7492
6675A3833M470j8907j6319L9l121l106O405P160J5640K2420m543O436r25l2113
6661b631j8798J3713j2179m809j0490J5281m802j4331P820O077M0078Q593j9398
6648D124j9888L072j0025r360k523L5307J0453r904J7802J1867n23j4310j8587
$$ plain form
6635 -2495 -2896 -12799 -19708 -28906 -20594 -33741 -47251 -39384 -16431 -12316 -33045 -16694 1792 9877
6621 9877 778 7402 7063 6422 -1180 -7135 -5824 9706 23267 29911 18549 -6721 3078 20340
6607 20340 34319 5977 -23638 -33385 -24491 -1998 5109 22379 23197 16059 7714 8226 -29461 -68981
6593 -68981 -57358 -21669 -20981 1863 27184 25549 15725 29196 29399 28015 39973 26808 4745
6580 4745 -18077 -20393 -22284 -37361 -45455 -38479 -53023 -55806 -71451 -47930 -28282 -10243 746
6567 746 3384 11076 21549 43296 35209 22133 14018 21114 29457 19244 9338 -17545 -22469 -15266
6553 -15266 1783 5531 -3093 -24052 -11152 17822 7530 28525 49791 33758 4459 13294
6541 13294 55408 49872 33361 31388 526 6258 26200 24575 25379 31413 23067 -12383 -28980
$$ packed form
6635b495m01r903o909r198Q312j3147j3510P867K2953M115k0729J6351J8486Q085
6621I877r099O624l39o41p602n955J311J5530J3561O644j1362k5270R799J7262
6607B0340J3979k8342k9615r747Q894K2493P107J7270Q18p138q345N12l7687l9520
6593f8981J1623L5689O88K2844K5321j635r824J3471K03j384J1958j3165k2063
6580D745k2822k316j891j5077q094O976j4544k783j5645K3521J9648J8039J0989
6567G46K638P692J0473K1747q087j3076q115P096Q343j0213r906k6883m924P203
6553a5266J7049L748q624k0959J2900K8974j0292K0995K1266j6033k9299Q835
6541A3294M2114n536j6511j973l0862N732J9942j625Q04O034q346l5450j6597
$$ plain form
6528 -28980 -5054 9691 -22765 -43767 -40555 -20198 -4422 9260 -9500 -27756 -29529 -20214
6516 -20214 -36258 -42322 -29493 -58768 -63345 -48000 -57412 -37396 -3129 -4514 -12473 485 3454
6503 3454 22425 1124 -5961 -15948 -10468 -16307 -25182 -20681 -32040 -27218 -15940 -5330 -5206 -28142
6489 -28142 -25794 -3572 18143 12984 15555 17663 -3579 7912 17343 14385 5164 13954 1515
6476 1515 -18226 9685 29248 -1784 -3364 5691 7044 -21397 -16341 1613 -6219 -12346 -29166
6463 -29166 -20349 11843 -18859 -34677 -12697 6987 17386 -11323 -35333 -29054 -20930 -8675
6451 -8675 5815 -8307 -27880 -15336 -6616 -27719 -36237 -47546 -55651 -51976 -27964 -31801 -19806
6438 -19806 8728 7930 10595 6748 3908 -13217 -4303 -3384 -11877 -3279 -12209 -19936 -51936 -66130
$$ packed form
6528b8980K3926J4745l2456k1002L212K0357J5776J3682j8760j8256j773R315
6516b0214j6044o064J2829k9275m577J5345r412K0016L4267j385p959J2958K969
6503C454J8971k1301p085r987N480n839q875M501j1359M822J1278J0610J24k2936
6489b8142K348K2222K1715n159K571K108k1242J1491R431k958r221Q790j2439
6476A515j9741K7911J9563l1032j580R055J353k8441N056J7954p832o127j6820
6463b9166Q817L2192l0702j5818K1980J9684J0399k8709k4010O279Q124J2255
6451h675J4490j4122j9573J2544Q720k1103q518j1309q105L675K4012l837J1995
6438a9806K8534p98K665l847k840j7125Q914R19q493Q598q930p727l2000j4194
$$ plain form
6424 -66130 -77014 -46609 -15441 1215 869 -8099 -8844 -7339 8903 32484 39472 17311 -1521
6411 -1521 14626 6832 -28775 -23819 29487 12678 -4659 -28916 -53700 -37335 -42399 -53822 -30021
6398 -30021 -26166 -27495 -9093 10411 10735 401 -28410 -4682 28457 21454 -6870 -23986 -29721
6385 -29721 -40432 -15614 18044 42238 21532 4971 -2689 -3423 -887 -6737 -17017 -20579 -27034
6372 -27034 -32417 -38118 -42249 -37745 -25602 -18779 -11013 7897 10907 -18304 -33644 -21296 20178
6359 20178 22037 -3734 -32037 -42975 -31669 -21327 -4299 810 11464 21655 24535 11731
6347 11731 7480 25299 45133 49051 12119 -22274 -28431 -47931 -34376 -15748 -4611 -5677 554
6334 554 27729 27915 7053 614 1270 11226 -146 5001 9317 -7063 -11771 -6206 -28333 -24416
$$ packed form
6424f6130j0884L0405L1168J6656l46q968p45J505J6242K3581O988k2161j8832
6411a521J6147p794l5607M956N3306j6809j7337k4257k4784J6365n064j1423K3801
6398c0021L855j329J8402J9504L24j0334k8811K3728L3139p003k8324j7116n735
6385b9721j0711K4818L3658K4194k0706j6561p660p34K536n850j0280l562o455
6372b7034n383n701m131M504J2143O823P766J8910L010k9211j5340J2348M1474
6359B0178J859k5771k8303j0938J1306J0342J7028N109J0654J0191K880j2804
6347A1731m251J7819J9834L918l6932l4393o157j9500J3555J8628J1137j066O231
6334E54K7175J86k0862o439O56R956j1372N147M316j6380m708N565k2127L917
$$ plain form
6320 -24416 -9015 -20709 -20813 385 -1864 -14370 -2667 14574 25277 286 -32811 -37321 -10307
6307 -10307 -3509 -930 1941 4192 13479 14398 9677 6709 6668 6686 22169 31290 31566 -4452 5941
6292 5941 54388 65219 59330 57295 59104 38113 15137 9555 -18647 -35335 -7093 19871 26362
6279 26362 46190 52193 40014 26669 6542 871 7893 33386 6939 -3405 -9894 -26983 -22239
6266 -22239 3367 6279 3004 18156 -6172 -18190 -11255 18685 375 9325 570 9716 19479
6253 19479 23241 13263 1929 -13969 -21557 -40110 -38962 -13449 -3528 -840 7474 7979 -5779 -31160
6239 -31160 -12698 23784 8331 7883 40247 26394 1278 -4908 3795 -23727 -30659 -40410 -32534
6226 -32534 -29119 -35910 -32330 -15266 -8505 -9937 17418 11265 2705 3171 -29826 -16833 -7632 -25339
$$ packed form
6320b4416J5401j1694j04K1198k249j2506J1703J7241J0703k4991l3097m510K7014
6307a0307O798K579K871K251R287R19m721k968m1J8J5483R121K76l6018J0393
6292E941M8447J0831n889k035J809k0991k2976n582k8202j6688K8242K6964O491
6279B6362J9828O003j2179j3345k0127n671P022K5493k6447j0344o489j7089M744
6266b2239K5606K912l275J5152k4328j2018O935K9940j8310Q950q755R146R763
6253A9479L762r978j1334j5898p588j8553J148K5513R921K688Q314N05j3758k5381
6239c1160J8462L6482j5453m48L2364j3853k5116o186Q703k7522o932r751P876
6226c2534L415o791L580J7064O761j432K7355o153q560M66l2997J2993R201j7707
$$ plain form
6212 -25339 -34655 -22596 -9631 13030 8275 21567 47038 60951 32340 13883 28318 25591
6200 25591 -5422 -14855 -20035 -7973 9987 -1197 -26345 -38609 -25269 -14987 -20254 -18772 1780
6187 1780 29576 28447 -4441 -43044 -44310 -22368 12390 26087 29790 27607 33247 41437 52722
6174 52722 52447 50921 53570 20996 -22597 -43547 -30040 -31038 -24200 -12465 -12621 -21897 -10373 -4079
6160 -4079 -5049 -36122 -13443 12218 544 5772 2245 -16566 -200 -26 -19914 -23368 -23108 -24891
6146 -24891 -44462 -53844 -47707 -21151 -24020 -39573 -45018 -49846 -8274 -5689 7149 24734 -13155
6133 -13155 -19933 -18239 -2264 9544 8266 29257 58798 56029 43594 16628 -8518 -27587 -4743
6120 -4743 6594 11409 5317 2324 12995 -14607 -52606 -39696 -40160 -54854 -54594 -23407 7984
$$ packed form
6212b5339r316J2059J2965K2661m755J3292K5471J3913k8611j8457J4435k727
6200B5591l1013r433n180J2062J7960j1184k5148j2264J3340J0282n267J482K0552
6187A780K7796j129l2888l8603j266K1942L4758J3697L703k183N640Q190J1285
6174E2722k75j526K649l2574m3593k0950J3507r98O838J1735j56r276J1524O294
6160d079r70l1073K2679K5661j1674N228l527j8811J6366J74j9888l454K60j783
6146b4891j9571r382O137K6556k869j5553n445m828M1572K585J2838J7585l7889
6133a3155o778J694J5975J1808j278K0991K9541k769j2435k6966k5146j9069K2844
6120d743J1337M815o092k993J0671k7602l7999J2910m64j4694K60L1187L1391
$$ plain form
6107 7984 29386 5064 -52845 -30450 -736 401 -1988 -10306 -30951 -40152 -31994 -30570 -37180
6094 -37180 -25534 -10083 8676 5171 -28598 -32017 -22742 -23754 -30691 -18946 -14030 -41046 -64296
6081 -64296 -41329 -37888 -63198 -79080 -69117 -72768 -48051 -23862 -15151 -31508 -30490 -16934 -21995
6068 -21995 -27848 -42145 -47235 -24049 -9865 -31572 -45227 -68341 -59304 -14525 21875 18902 -2417
6055 -2417 12718 -3259 -9982 14732 29041 10991 -3189 4849 17105 23508 8675 8626 5587
6042 5587 -4539 -6385 -7478 10588 21427 -10534 -13102 -18456 -34134 -16002 -21507 -4199 22782
6029 22782 4797 22241 22224 -11587 -8566 -4200 -21694 -40829 -35909 -23044 -31879 -11833 21034
6016 21034 1089 -4788 -10168 -12695 -21934 4804 16418 -2077 -9299 9759 22717 33201 16109
$$ packed form
6107G984K1402k4322n7909K2395K9714J137k389q318k0645r201Q158J424o610
6094c7180J1646J5451J8759l505l3769l419R275j012o937J1745M916k7016k3250
6081f4296K2967L441k5310j5882R963l651K4717K4189Q711j6357J018J3556n061
6068b1995n853j4297n090K3186J4184k1707j3655k3114R037M4779L6400k973k1319
6055b417J5135j5977o723K4714J4309j8050j4180Q038J2256O403j4833m9l039
6042E587j0126j846j093J8066J0839l1961k568n354j5678J8132n505J7308K6981
6029B2782j7985J7444j7l3811L021M366j7494j9135M920J2865q835K0046L2867
6016B1034j9945n877n380k527r239K6738J1614j8495p222J9058J2958J0484j7092
$$ plain form
6003 16109 -24169 -45284 -43366 -33091 -22066 -194 31380 36916 37831 13075 -4456 7321 28588
5990 28588 8416 -4982 -22209 -24747 8903 38987 53204 18617 2323 -7094 -30927 -35892
5978 -35892 -21356 -3581 389 5460 -24527 -64673 -69728 -55282 -42962 -32618 -47756 -29053
5966 -29053 -25671 4744 11653 7750 -5724 -13567 -45107 -56998 -24970 -8934 -8115 20510 18734
5953 18734 12537 -4602 -1765 12440 -6863 11124 -4483 -8271 -563 6977 7525 -11309 -23724
5940 -23724 -8072 -4125 -24114 -41142 -26703 7807 -3121 -24788 -46790 -67087 -75471 -54120
5928 -54120 -32435 -18646 -20677 -28352 -55401 -17180 -10859 -33559 -44158 -40305 -22191 -8469 -6870
5915 -6870 -7176 -5503 -23780 -45727 -38288 -31956 -15429 1012 17013 14310 1979 4611 -5243 -8447
$$ packed form
6003A6109m0278k1115J918J0275J1025K1872L1574N536R15k4756j7531J1777K1267
5990B8588k0172j3398j7227k538L3650L0084J4217l4587j6294r417k3833m965
5978c5892J4536J7775L970N071k9987m0146n055J4446J2320J0344j5138J8703
5966b9053L382L0415O909l903j3474p843l1540j1891L2028J6036Q19K8625j776
5953A8734o197j7139K837J4205j9303J7987j5607l788P708P540N48j8834j2415
5940b3724J5652L947j9989j7028J4439L4510j0928k1667k2002k0297q384K1351
5928e4120K1685J3789k031p675k7049L8221O321k2700j0599L853J8114J3722J599
5915f870l06J673j8277k1947P439O332J6527J6441J6001k703j2331K632r854l204
$$ plain form
5901 -8447 1324 13386 11547 -5755 21211 38314 49012 27787 13712 7484 3831 -8377 15677
5888 15677 19985 2115 15191 24947 14536 26747 41335 21573 12064 3101 -6956 -33994 -33604
$$ packed form
5901h447R771J2062j839j7302K6966J7103J0698k1225j4075o228l653j2208K4054
5888A5677M308j7870J3076R756j0411J2211J4588j9762r509q963j0057k7038L90
$$ [...]
##END NTUPLES=NMR SPECTRUM
##END=
