##TITLE=Analysis number 326781
Compound Code cc 58316
Book Reference 467/128/1
Project Code adrs
Chemist Name benw
##JCAMPDX= 6.0         $$ Bruker NMR JCAMP-DX V2.0
##DATA TYPE= NMR SPECTRUM
##DATA CLASS= NTUPLES
##ORIGIN= Bruker BioSpin GmbH
##OWNER= nmr
$$ XWIN-NMR		Version 3.5
$$ Thu Feb 22 10:16:36 2007 GMT Standard Time (UT+0h)  MAYBRIDGE\nmr@NMR_250MHZ
##.OBSERVE FREQUENCY= 250.131544655141
##.OBSERVE NUCLEUS= ^1H
##.ACQUISITION MODE= SIMULTANEOUS (DQD)
##.ACQUISITION SCHEME= undefined
##.AVERAGES= 16
##.DIGITISER RES= 18
##SPECTROMETER/DATA SYSTEM= dpx250
##.PULSE SEQUENCE= zg30
##.SOLVENT NAME= CDCl3
##.SHIFT REFERENCE= (INTERNAL, CDCl3, 0, 16.522)
##AUDIT TRAIL= $$ (NUMBER, WHEN, WHO, WHERE, WHAT)
$$ ##TITLE= Audit trail, XWIN-NMR		Version 3.5
$$ ##JCAMPDX= 5.01
$$ ##ORIGIN= Bruker BioSpin GmbH
$$ ##OWNER= nmr
$$ C:\u/data/dgb/nmr/ADRS/1470/pdata/1/auditp.txt
$$ ##AUDIT TRAIL=  $$ (NUMBER, WHEN, WHO, WHERE, WHAT)
(   1,<2007-02-22 10:16:06.72 +000>,<MAYBRIDGE\nmr>,<NMR_250MHZ>,
      <created by zg, POWCHK disabled, PULCHK disabled
       configuration hash MD5:
       49 4B E0 1D 92 C2 6B 37 9F E6 65 BC 52 41 86 1D
       data hash MD5: 64K
       BC 11 07 72 00 B8 5B DF 53 B0 CB 1C FD 89 87 4D>)
(   2,<2007-02-22 10:16:25.43 +000>,<MAYBRIDGE\nmr>,<NMR_250MHZ>,
      <Start of raw data processing
       ef LB = 0.3 FT_mod = 6 PKNL = 1 SI = 32K 
       data hash MD5: 32K
       31 3B 1D F2 54 B7 30 29 D8 FD 07 A6 C1 35 A5 1A>)
(   3,<2007-02-22 10:16:27.04 +000>,<MAYBRIDGE\nmr>,<NMR_250MHZ>,
      <apk 
       data hash MD5: 32K
       D3 4D 89 57 8F 92 45 51 39 FD 8A 43 48 15 65 0D>)
(   4,<2007-02-22 10:16:27.84 +000>,<MAYBRIDGE\nmr>,<NMR_250MHZ>,
      <abs ABSG = 5 
       data hash MD5: 32K
       CE 29 C1 03 3C 66 19 14 8F 35 EC 97 DD FC 88 B7>)
$$ ##END=
$$ 
$$ hash MD5
$$ AE C6 2A A5 53 71 B4 77 97 E1 8C C4 86 BB 74 F4
##$RELAX= 
##$RELAX= 
##$RELAX= 
##$RELAX= 
##$RELAX= 
##$RELAX= 
##$RELAX= 
$$ Bruker specific parameters
$$ --------------------------
##$DU= <C:\u>
##$EXPNO= 1470
##$NAME= <ADRS>
##$PROCNO= 1
##$TYPE= <nmr>
##$USER= <dgb>
##$AMP= (0..31)
100 100 100 100 100 100 100 100 100 100 100 100 100 100 100 100 100 100 
100 100 100 100 100 100 100 100 100 100 100 100 100 100 
##$AQSEQ= 0
##$AQ_mod= 3
##$AUNM= <au_zg>
##$AUTOPOS= <55 >
##$BF1= 250.13
##$BF2= 250.13
##$BF3= 250.13
##$BF4= 250.13
##$BF5= 500.13
##$BF6= 500.13
##$BF7= 500.13
##$BF8= 500.13
##$BYTORDA= 1
##$CFDGTYP= 0
##$CFRGTYP= 5
##$CHEMSTR= <none>
##$CNST= (0..31)
1 1 145 1 1 1 1 1 1 1 1 1 1 1 1 1 1 1 1 1 1 1 1 1 1 1 1 1 1 1 1 1 
##$CPDPRG= <>
##$CPDPRG1= <>
##$CPDPRG2= <>
##$CPDPRG3= <>
##$CPDPRG4= <mlev>
##$CPDPRG5= <mlev>
##$CPDPRG6= <mlev>
##$CPDPRG7= <mlev>
##$CPDPRG8= <mlev>
##$CPDPRGB= <>
##$CPDPRGT= <>
##$D= (0..31)
0 1 0 0 0 0 0 0 0 0.06 0 0 0 0 0 0 0.0002 0 0 0 0 0 0 0 0 0 0 0 0 0 0 
0 
##$DATE= 1172139365
##$DBL= (0..7)
120 120 120 120 120 120 120 120 
##$DBP= (0..7)
150 150 150 150 150 150 150 150 
##$DBP07= 0
##$DBPNAM0= <>
##$DBPNAM1= <>
$$ [...]
##$SUBNAM7= <"">
##$SUBNAM8= <"">
##$SUBNAM9= <"">
##$SW= 20.6930455092707
##$SWIBOX= (0..15)
0 0 3 0 0 0 0 0 0 0 0 0 0 0 0 0 
##$SW_h= 5175.983436853
##$TD= 65536
##$TD0= 1
##$TE= 295.16
##$TE2= 300
##$TE3= 300
##$TEG= 300
##$TL= (0..7)
0 120 120 120 120 120 120 120 
##$TP= (0..7)
150 150 150 150 150 150 150 150 
##$TP07= 0
##$TPNAME0= <>
##$TPNAME1= <>
##$TPNAME2= <>
##$TPNAME3= <>
##$TPNAME4= <>
##$TPNAME5= <>
##$TPNAME6= <>
##$TPNAME7= <>
##$TPOAL= (0..7)
0.5 0.5 0.5 0.5 0.5 0.5 0.5 0.5 
##$TPOFFS= (0..7)
0 0 0 0 0 0 0 0 
##$TUNHIN= 0
##$TUNHOUT= 0
##$TUNXOUT= 0
##$USERA1= <user>
##$USERA2= <user>
##$USERA3= <user>
##$USERA4= <user>
##$USERA5= <user>
##$V9= 5
##$VALIST= <valist>
##$VCLIST= <CCCCCCCCCCCCCCC>
##$VD= 0
##$VDLIST= <DDDDDDDDDDDDDDD>
##$VPLIST= <PPPPPPPPPPPPPPP>
##$VTLIST= <TTTTTTTTTTTTTTT>
##$WBST= 1024
##$WBSW= 4
##$XGAIN= (0..3)
0 0 0 0 
##$XL= 0
##$YL= 0
##$YMAX_a= 229848
##$YMIN_a= -322280
##$ZGOPTNS= <>
##$ZL1= 120
##$ZL2= 120
##$ZL3= 120
##$ZL4= 120
##$ABSF1= 16.522
##$ABSF2= -4.171173
##$ABSG= 5
##$ABSL= 3
##$ALPHA= 0
##$AQORDER= 0
##$ASSFAC= 0
##$ASSFACI= 0
##$ASSFACX= 0
##$ASSWID= 0
##$AUNMP= <proc_1d>
##$AZFE= 0.1
##$AZFW= 0.1
##$BCFW= 0
##$BC_mod= 0
##$BYTORDP= 0
##$COROFFS= 0
##$CY= 12.5
##$DATMOD= 1
##$DC= 0
##$DFILT= <>
##$DTYPP= 0
##$F1P= 14.0000005364418
##$F2P= -0.99999901652339
##$FCOR= 0.5
##$FTSIZE= 32768
##$FT_mod= 6
##$GAMMA= 0
##$GB= 0
##$INTBC= 1
##$INTSCL= 1
##$ISEN= 128
##$LB= 0.3
##$LEV0= 0
##$LPBIN= 0
##$MAXI= 10000
##$MC2= 0
##$MEAN= 0
##$ME_mod= 0
##$MI= 0
##$NCOEF= 0
##$NC_proc= -6
##$NLEV= 6
##$NOISF1= 0
##$NOISF2= 0
##$NSP= 0
##$NTH_PI= 0
##$NZP= 0
##$OFFSET= 16.522
##$PC= 1
##$PHC0= 227.3879
##$PHC1= 6.373651
##$PH_mod= 1
##$PKNL= yes
##$PPARMOD= 0
##$PSCAL= 4
##$PSIGN= 0
##$REVERSE= no
##$SF= 250.13
##$SI= 32768
##$SIGF1= 0
##$SIGF2= 0
##$SINO= 400
##$SIOLD= 32768
##$SREGLST= <1H.CDCl3>
##$SSB= 0
##$STSI= 32768
##$STSR= 0
##$SW_p= 5175.98343685301
##$SYMM= 0
##$S_DEV= 0
##$TDeff= 65536
##$TDoff= 0
##$TI= <Analysis number 999999
Compound Code 99
Book Reference 9
Project Code 9>
##$TILT= no
##$TM1= 0
##$TM2= 0
##$TOPLEV= 0
##$USERP1= <user>
##$USERP2= <user>
##$USERP3= <user>
##$USERP4= <user>
##$USERP5= <user>
##$WDW= 1
##$XDIM= 32768
##$YMAX_p= 603116458
##$YMIN_p= -1276110
$$ End of Bruker specific parameters
$$ ---------------------------------
##NTUPLES= NMR SPECTRUM
##VAR_NAME=  FREQUENCY,     SPECTRUM/REAL,   SPECTRUM/IMAG
##SYMBOL=    X,             R,               I
##VAR_TYPE=  INDEPENDENT,   DEPENDENT,       DEPENDENT
##VAR_FORM=  AFFN,          ASDF,            ASDF
##VAR_DIM=   32768,         32768,           32768
##UNITS=     HZ,            ARBITRARY UNITS, ARBITRARY UNITS
##FACTOR=    0.157963299565203, 1,           1
##FIRST=     4132.6476996994, 0,             0
##LAST=      -1043.33573715361, 0,           0
##MIN=       -1043.33573715361, -1276110,    0
##MAX=       4132.6476996994, 603116458,     0
$$ Real data points
##PAGE= N=1
##DATA TABLE= (X++(R..R)), XYDATA
$$ [...]
22322b80252j7470J11372J68612J0220k9303j72270L6214K89705J72023o2210
22312B26641j66623J88283k16063L6830J37634l7542p3574J23483j28951k73770
22302a83652K6281N2246j44722j61207K20936l1082J32913K67226k421J13719
22292B90237j96784n22171j10400J59894J29940K32669K92434N671k11336m2907
22282B7247l5063P246k9588O1713j0668r7035M4434j07352r9059O7927k66613
22271d36811l07135M05484K87216J8228j74136l7737J94013o0875j75730R195
22261b78288J56709J3474K7619Q5485p8248j90243j37928j74972K20855k0939
22251c76476j63377K01759L65731m8219r6773o2727l8939m7814r159r3613j2148
$$ y = [-280252, -297722, -186350, -17738, -7518, -36821, -209091, -172877, 116828, 288851, 226641, 60018, 248301, 32238, 69068, 206702, 169160, 95586, 219069, 90118, -183652, -157371, -105125, -249847, -411054, -190118, -221200, -88287, 178939, 176518, 290237, 93453, -428718, -539118, -379224, -249284, -16615, 275819, 281490, 70154, 27247, -7816, -570, -30158, 31555, 20887, -76148, -31714, -139066, -238125, -170198, -436811, -743946, -338462, -51246, -33018, -207154, -244891, -50878, -111753, -287483, -278288, -121579, -108105, -80486, 4999, -73249, -263492, -401420, -576392, -355537, -376476, -539853, -338094, 27637, -20582, -117355, -180082, -219021, -266835, -275994, -369607, -381755]
22240c81755K93991J58671J07036K3591k67303Q8983O9435J76546K0361j11415
22230A78141l25944r0292L42518O750k7825m7174n7498l13201j94223j4066K3583
22219e19231M7266p9558O0831J67496J02048K63307j36004N8296K64096R3882
22209C22429j02424k58129j10338N8704Q7515p5478J55747J59897Q3869l88768
22199f6976j55677l402k54358n5683K7901J28345L1878L4990M8574J49612k16380
22188c31176J3935K73456R7199p4034k28337m9043Q2418J51572k12230K54961
22178b1279O6180j1039L18383J12763m5444j77608j80976Q2415K5583R3545J9927
22167B82450p266j26043k15121k69614j83011J87104L77738J67118n1151P4404
$$ y = [-381755, -87764, 70907, 177943, 201534, -65769, 23214, 92649, 269195, 289556, 178141, -147803, -238095, 104423, 111173, 83348, 36174, -21324, -334525, -528748, -542814, -519231, -471965, -551523, -490692, -323196, -221148, 42159, -93845, -35549, 228547, 322429, 220005, -38124, -148462, -89758, -2243, -77721, 78026, 237923, 321792, -66976, -222653, -226055, -480413, -536096, -508195, -379850, -347972, -312982, -264408, -114796, -331176, -317241, -43785, 53414, -20620, -248957, -298000, -215582, -64010, -276240, -21279, 44901, 33862, 352245, 465008, 419564, 241956, 60980, 143395, 168978, 262523, 282450, 275184, 149141, -65980, -335594, -518605, -331501, 46237, 213355, 162204, 236608]
22157B36608J967Q7990n8952k50633k65691J16182J08260o9642J56608L255n308
22146F0644J7884K1444P0450J37845j02649k97390j07856j85243O6247n079p1212
22135c94915Q6362P6836j33843P2828K00289j10325q0648Q2537k09477j11703
22125e22059J82044K36743j23130K4196K23253J09405K9277q0877J4189k38745
22115a45704j7669O0792J801K68039o5639k05952j49182J85554J00455L7469J18717
22104A88681j67517j38650K39377J25797j9712j28715J06082k3155l02736j12551
22094b33099J99124l4492k44939M8001L83031J63320l84922j31992R728K54605
22084B8365J48397j53863j48903J96519J50786j13667j70623k08969J3533R3610
$$ y = [236608, 238575, 326565, 267613, 16980, -248711, -132529, -24269, -93911, 62697, 65952, 60644, 78528, 99972, 170422, 308267, 205618, -91772, -199628, -384871, -318624, -323703, -394915, -308553, -231717, -365560, -292732, -92443, -202768, -283416, -200879, -410356, -522059, -340015, -103272, -226402, -202206, 21047, 130452, 159729, 78852, 93041, -145704, -163373, -102581, -100780, 167259, 101620, -104332, -253514, -67960, 32495, 69964, 188681, 21164, -117486, 121891, 247688, 227976, 99261, 205343, 182188, -120548, -233099, -33975, -68467, -313406, -265405, 117626, 280946, -103976, -235968, -226240, 28365, 176762, 22899, -126004, 70515, 221301, 107634, -62989, -271958, -258425, -164815]
22074a64815J61950j80121J19708k1269J4998K22414m438M1076k70896l78574
22064d59967j38516M5599J98256J92628O1656j55639p096N539J34121M3781L0520
22053d9118m5326l9734J54972K52934j35880k55920j04618j15698J67055J32793
22043c8540K33881L4022j12843n3424J0589m4835j97445q1729J1002J82248j30239
22032a87313m5029J37894O35j71218r7648J17311J86515K1595r1198j70774j35634
22021d34864N2544J83875K16082p6958K01445J24880j01742k9988o7055K10798
22011B79017K42777l45404j46513j56499m4881K96064R9362j73112k71868n9952
22001b81009L03716j992l5011J80177O1660N1773j06577l14719o0308J0036j7365
$$ y = [-164815, -2865, -182986, -63278, -84547, -69549, 152865, 148427, 189503, -81393, -459967, -598483, -552884, -354628, -162000, -100344, -255983, -263079, -257540, -123419, -79638, -49118, -94444, -134178, 20794, 273728, 137848, -118072, -222690, -338388, -171333, -38540, 195341, 229363, 116520, 63096, 73685, 28850, -168595, -250324, -239322, -57074, -187313, -232342, -94448, -93813, -265031, -362679, -245368, -58853, -37258, -128456, -299230, -434864, -382320, -198445, 17637, -59321, 142124, 267004, 165262, 135274, 68219, 279017, 521794, 176390, 29877, -126622, -171503, 124561, 223923, 50811, -221057, -281009, 22707, 20715, -14296, 165881, 227541, 279314, 172737, -141982, -202290, -192254, -209619]
21990b09619k918M8100N3786J88442n1800p596l22876j06727m407K37588Q207
21979a69820j41387p2555m7981L83826J06223O4445K13559J0393j03779j03702
21969A39222K05061P949m23050j38401J66118K1479o5548k40063k8283P2258n1853
21958c35111J33652J75495j7420q466K2817j12485k85438J45025o3630j09519
21948d55080L08659K33110j1953r9539l64710j084L91715j97783Q134J15246m3842
21937a17127N7728p2805P2948K6624j8972Q4603M7959K0991K107k93220N9J75926
21925a3179k4137J8828m4324J12618L7906L0502o8618M4714J08470j32059q6289
21914a5568j04089j09498R4850q0597k14253J78718J17457j1751J61991J78428
$$ y = [-209619, -212537, -164437, -110651, 77791, 25991, 18395, -304481, -411208, -415615, -178027, -169820, -311207, -383762, -431743, -47917, 58306, 122751, 336310, 346703, 242924, 139222, 344283, 352232, -70818, -209219, -43101, -21622, -87170, -327233, -355516, -283258, -335111, -201459, -25964, -43384, -51850, -29033, -141518, -426956, -281931, -345561, -455080, -146421, 86689, 74736, -24803, -389513, -390597, 1118, -196665, -188531, -73285, -117127, -59399, -132204, -59256, -32632, -51604, 32999, 80958, 101949, 104056, -189164, -189105, -13179, -37316, -18488, -62812, 49806, 87712, 118214, 49596, 94310, 202780, 70721, -15568, -119657, -229155, -134305, -214902, -429155, -250437, -132980, -144731, 17260, 195688]
21904A95688j72046k12756n6736R8815P2004N915L7796J93247J184r0160j68610
21893i5659l9463j97823J15102j05077j22850J41840M96573J20630k22825k07865
21883a17417o5251P2926J47098r8004n4348K6840R126j44670j26013j7100Q3895
21872b82918K701J58959J25991L7792j26768k65147L0889P7550Q5950l4581Q3498
21861a06084J04459q446n9084j46815K93032j32303j55786K02141J06094l05113
21851b07905K5042j33815l0241L75269O0802k95184K62567K52764J14252M5044
21841D68595j74624l18534l03839r8155k9053j3275m7224L42861J1370Q4233J37745
21830F0100N9670q5820L4388N4382K4448L5656j5072r5438M8876n6215M43J66328
$$ y = [195688, 23642, -189114, -245850, -147035, -75031, -69116, -31320, 161927, 163111, 72951, -95659, -135122, -332945, -217843, -322920, -445770, -303930, 192643, 313273, 90448, -117417, -182668, -109742, 37356, -60648, -114996, -88156, -79030, -223700, -349713, -366813, -282918, -280217, -121258, 4733, 42525, -84243, -349390, -318501, -240951, -155001, -189582, -106084, -1625, -10071, -69155, -215970, 77062, -55241, -211027, -8886, 97208, -207905, -182863, -316678, -346919, 28350, 89152, -206032, 56535, 309299, 423551, 468595, 293971, -24563, -328402, -426557, -455610, -468885, -516109, -173248, -161878, -77645, 60100, 119770, 33950, 68338, 122720, 147168, 182824, 167752, 72314, 121190, 64975, 65418, 231746]
21818B31746k5466l05083p2681K13757k66905j70614K77964L19830j55325J45421
21808A92644r5099n0497M6456p7821K01388o4240j38335j70218J15399J41747
21798A01424Q283j79054k19890J91605K3158j29796j34648J29487J20605l8095
21788a26921P8524O9292j9989l5803R4549N6209K4221n870j9202k71660j87467
21777c44117J20911J55369J16568j46978p1257J173l2636K24078K29268K29825
21767D82204k64739q9934J45260k35069k45804m5558j39163j05885M0504R4099
21757c64085j04573J2844Q7595J3614m5556N2100J30674j04235L3439j9686p2601
21746c80470J10609K73069P6484r4877j55735M3528J00445k50482k60716R4543
$$ y = [231746, 206280, -98803, -171484, 42273, -224632, -395246, -117282, 202548, 47223, 192644, 97545, 47048, 93504, 15683, 217071, 152831, 14496, -155722, -40323, 101424, 109707, -69347, -289237, -97632, -74474, -204270, -338918, -209431, -88826, -126921, -48397, 20895, 906, -34897, 59652, 115861, 140082, 134212, 115010, -156650, -344117, -223206, -67837, 48731, -98247, -169504, -168331, -200967, 23111, 252379, 482204, 217465, 127531, 272791, 37722, -208082, -253640, -392803, -498688, -458184, -364085, -468658, -455814, -368219, -354605, -400161, -348061, -217387, -321622, -288183, -307869, -380470, -269861, 3208, 79692, -15185, -170920, -127392, -26947, -277429, -538145, -443602]
21736d43602J51951J90391q6257m4152J3807J85686O1971k03659o0018K29095
21726d787J15662j26936J29858N3410J31335n7438q9798K3981K4236K188j30068
21715G1643p8782r4765q3831k3848j98902K53370J84107j18367o7314K60652R8751
21704B02714l23309p2407O0495q3548J62398r1560j43425j7263J64747o6233P8652
21693a28739O9048M1095K6924N6856J7030J8795k3368j23754J53060j1986Q7355
21682A82316j54264q5537J05495q4526p9307J09724J37702q9078j29679J2039
21672g5115l1727J10184m1633j80521J04528J67761M3409o0577j82603J67010
21662B0716K15825k06428l13703q3468J50974L778j24579J80925j03859J33346
$$ y = [-443602, -291651, -101260, -187517, -231669, -217862, -32176, 29795, -173864, -233882, -4787, 110875, -16061, 113797, 167207, 298542, 241104, 151306, 175287, 199523, 201711, 71643, -7139, -101904, -185735, -209583, -408485, -155115, 28992, -89375, -156689, 103963, 202714, -120595, -193002, -132507, -216055, -53657, -145217, -288642, -305905, -141158, -207391, -128739, -59691, -18596, 8328, 65184, 82214, 101009, 77641, -46113, 106947, 94961, 182316, 28052, -57485, 48010, -36516, -115823, -6099, 131603, 42525, -87154, -75115, -106842, 3342, -38291, -218812, -114284, 53477, 96886, 36309, -146294, 20716, 236541, 30113, -283590, -367058, -216084, -212306, -336885, -155960, -259819, -126473]
21652a26473M9453j37196n8578n5826J32966l9927k9447P8367J53388J0669L2007
21641I403R3992j9317N9608J6401j38849M388q7067k88550j41096q3765Q9390
21630d85462K75926L04287n6981l95399k23151k0388J5839R5181K54060J60383
21620g5705J2614J5854j8407q2958O655K16180p697J10869N7376M946o3295k74036
21608i7604Q4667O5364j61145j59905R6961J07926R2222J88607k41474j83417
21598b07798M7426J37128l7522J2264k73889l82795J76782J58591M0378J34796
21588a94639M6715P1329J44754n7935M5118K49610j07314k80840o695L00435k587
21577B07951j02128k7413j79585j38682J12145m2324j16471J96799K09331J66221
$$ y = [-126473, -77020, -214216, -272794, -328620, -195654, -235581, -265028, -186661, -33273, -22604, 9403, 103395, 84078, 143686, 160087, 21238, 25626, -61441, -349991, -491087, -574852, -485462, -209536, 94751, 37770, -357629, -580780, -601168, -585329, -490148, -236088, -75705, -63091, -47237, -65644, -148602, -141947, 74233, 66536, 177405, 234781, 239727, 176432, -97604, -12937, 52427, -108718, -268623, -171662, -63736, 28486, 217093, -24381, -207798, -160372, -23244, -60766, -48502, -322391, -705186, -528404, -369813, -329435, -194639, -147924, -76595, 68159, 10224, 55342, 304952, 197638, -83202, -89897, 210538, 207951, 105823, 78410, -101175, -239857, -127712, -170036, -286507, -89708, 119623, 285844]
21567B85844k46706q1181k9550N9586j66551p8029J47291P296j5448j04554K9616
21556a92386O4569j77372J13580k859j27904K0358k6453K37925J99298J44268
21546B53024P4170m200j25103J41169n0987k85523O787j1941K1607J06317L0722
21535A56042J48465r3327J5046r3869k63994k15322j15829J90336O5617O11J40329
21524f5895O103O981K82837K66267L1877k10195k01321j57320M5381J51710j09364
21513D7061j21537L78570j85661j07858J16891K5582P6374j4344j47366k60275
21503a92563j4335K9875J08139K15284j49305k31301j57463P9445K74941J8225
21493a9058J93348j48542q0360J05506L2532M2431k69474K1872J45279j26378
$$ y = [285844, 39138, -42043, -71593, -12007, -178558, -256587, -109296, -102000, -117448, -222002, -192386, -127817, -305189, -191609, -194468, -322372, -302014, -328467, -90542, 108756, 253024, 327194, 322994, 197891, 339060, 288073, 2550, 9337, -2604, 19003, 125320, 156042, 304507, 211180, 226226, 132357, -131637, -346959, -462788, -272452, -206835, -206224, -65895, -59792, -52811, 230026, 496293, 528170, 317975, 116654, -40666, 4715, 156425, 47061, -74476, 304094, 118433, 10575, 127466, 153048, 229422, 215078, 67712, -192563, -206898, -177023, -68884, 146400, -2905, -234206, -391669, -312224, -37283, -19058, 174290, 25748, -54612, 50894, 83426, 125857, -143617, -121745, 23534, -102844]
21483a02844K49971R4099k53268l56964j42858J43967J92215j41430n3074n0743
21473d20929k928K35510m3413J08288J94289J4166J59488J09222j27659p3729
21463A52305j0565j94069j25053O0860K34149j42292o1025q5395k3114J46827
21453d7372J39352J60703P8768m03556k67859J92341J92103J28685Q9938k84033
21443b0930O420Q9322K6455n0960l9613n1554l4850J43523m7210k26063n3210
21432b58670K44273J71933j13819j69756L3879L8514J63472k8838j05018k32837
21422b56867j12371K53131j0963P5731J62852j38707j64881n4296l4962J54336
21412a26997R0908j15329j40286l1958J52685O1291q7037Q8588j78280j41123
$$ y = [-102844, 147127, 241226, -12042, -369006, -511864, -367897, -175682, -317112, -370186, -420929, -423857, -188347, -231760, -123472, 70817, 84983, 244471, 353693, 226034, 152305, 141740, -52329, -177382, -116522, 117627, -24665, -85690, -171085, -194199, -47372, 91980, 252683, 331451, -72105, -339964, -147623, 44480, 173165, 263103, -20930, -14510, 74812, 101267, 50307, 10694, -40860, -75710, 67813, 20603, -205460, -258670, -14397, 157536, 43717, -126039, -92160, -53646, 109826, 80988, -24030, -256867, -369238, -116107, -127070, -51339, 111513, -27194, -192075, -246371, -281333, -126997, -36089, -151418, -291704, -323662, -170977, -109686, -196723, -108135, -286415, -427538]
21402d27538J19114J46439J37119j24817j57491J95374J73395l3882k41485N6258
21392a57514O3646J04634j43504j81100J68838J34399J63705J00909K2700j52953
21382A23760J15079R5470j92928k25225R9455J66698k48318j29699j73890r2076
21372d61674J95285L1747n7687J0678r596k2928P5173R3588m2343j4709J1069
21361a91397j60742J71920M14299j4300R684J19006k28041l72896K9436M949j11337
21350c29419P0283j14023J64444K09987k923k18951k28052k34301J45729J90528
21340c46698J11702J22831j8001j62664k24386J23242J44177J17421Q295J17240
21330f841m7490l1795j61681o0398L85151P6258j07068K8339J71q8826l246R3685
$$ y = [-427538, -308424, -161985, -24866, -149683, -307174, -111800, 61595, 27713, -213772, -157514, -93868, 10766, -132738, -313838, -145000, -10601, 153104, 254013, 276713, 123760, 238839, 334309, 141381, -83844, 15611, 182309, -66009, -195708, -369598, -461674, -266389, -234642, -292329, -281651, -291247, -314175, -239002, -145414, -187757, -202466, -191397, -352139, -180219, 234080, 219780, 229464, 348470, 120429, -252467, -223031, -218082, -329419, -259136, -373159, -208715, 1272, -1651, -220602, -448654, -682955, -537226, -346698, -234996, -112165, -130166, -292830, -517216, -393974, -249797, -132376, -124081, -6841, -54331, -86126, -247807, -308205, 76946, 153204, 46136, 74475, 74646, -14180, -17426, 76259]
21318G6259j62727j15672j03415R1465o8923n9636Q1162j26271L6569J57926L3908
21307a59355J05198K46876j49370l44784J43009J66673l0893J55822K01451j21935
21297B12692k06680j50854o300Q3629O7309J40386k6457k29931j28540R4892r5708
21286b45562j80939j24715J02726P0047J79454J86976P5300J26236o1825P852
21276A35550j94896k73747J55819L5089K23534O5763l0764m1188k36554j22655
21266b84049N6451K5297k64J45060J39918k37034l5606K4510K38815J95112k1426
21255B46784j59086j02415J57207J5672j73514j49571o5435j98475o0134R4645
21245c94322j42372K6906O6352J68269K7369k0281J10470j3796n9982K6102K45555
$$ y = [76259, -86468, -202140, -305555, -214090, -283013, -342649, -261487, -387758, -351189, -193263, -159355, -54157, 192719, 43349, -301435, -158426, 8247, -22646, 133176, 334627, 212692, 6012, -144842, -151142, -67513, -204, 140182, 113725, -116206, -244746, -149854, -245562, -426501, -551216, -448490, -378443, -198989, -12013, 63287, 189523, 127698, 135550, -59346, -333093, -177274, -142185, 81349, 147112, 116348, 75160, -161394, -284049, -227598, -202301, -202565, -57505, 82413, -154621, -190227, -165717, 73098, 268210, 246784, 87698, -14717, 142490, 158162, -15352, -164923, -230358, -428833, -488967, -394322, -536694, -509788, -443436, -275167, -247798, -268079, -157609, -171405, -231387, -205285, 40270]
21234D0270J54298L9999j90490l8785J14662K62692O7326m8572r1193j25453k68425
21223h3671j20975L7761K24748K23278k30327k27352j1113r5654j270P3596J40906
21212g0073j4123O2353n3375j50774J24266J93651R5801j46665o7379q529j44945
21201a79792N1078L8726K67384J4954k80006j11150L1993J5499l5165j96352j37931
21190e20762J07861O6361k5747N6584k100m6750J14860m5421O2191P9110j18368
21179b72181j62799O5192Q9097J36906K00760R2166p2009m33605J65587K25961
21169C5075J238j63583J16168j09712l0422k06337j09355n4531J66617J11834
21159b43008m1283M7465M9070m3596K09363J62230R1472k26682m5519M9679j04894
$$ y = [40270, 194568, 234567, 44077, 5292, 119954, 382646, 449972, 401400, 310207, 184754, -83671, -204646, -166885, 57863, 281141, 50814, -176538, -187651, -283305, -284575, -210979, -70073, -84196, -21843, -75218, -225992, -101726, 91925, 187726, 41061, -26318, -34847, -179792, -128714, -89988, 177396, 192350, -87656, -198806, -166813, -151314, -186479, -382831, -520762, -412901, -346540, -372287, -315703, -317803, -364553, -249693, -295114, -232923, -153813, -272181, -434980, -369788, -280691, -143785, 56975, 149141, 77132, -356473, -190886, 35075, 36313, -127270, -11102, -120814, -151236, -357573, -466928, -521459, -354842, -243008, -284291, -236826, -187756, -231352, -21989, 140241, 231713, 5031, -40488, 9191, -95703]
21148i5703N272j4488K0513P6711J25972k20419K1015K0496L6475J44326N7923
21137A78093J58388j30399J5295j56213m51K40468p6318j63452R8628J71990j8154
21126C17875j7613j79344j40638L3303L1000j13309J6693K0891j43183j29509
21116c03834N4455O4897J36006J38176j59108l32204k88504N4752R7743K10690
21106c26931J79211j26855k59605K75457K40060J29762k28307j89379K87580M18273
21096C99266o2897j9172j30578j64217k39292P2193M176J6122K48825K9052k58809
21085a05331O0816J66521L481j28081j45215J74261j11402N2512P2245k2414J7814
21074C5207j03238k20019Q8513R2548N9752l691j28541J68887K5571Q2309M674
$$ y = [-95703, -90431, -104919, -84406, -7695, 118277, -102142, -81127, -60631, -24156, 120170, 178093, 336481, 206082, 221377, 65164, 64713, 305181, 228863, 65411, 164039, 336029, 317875, 300262, 120918, -19720, 13583, 44583, -68726, -52033, -31142, -174325, -303834, -249379, -184482, -48476, 89700, -69408, -401612, -690116, -635364, -537621, -326931, -147720, -274575, -534180, -258723, -18663, 111099, -117208, -306587, -19007, 399266, 336369, 317197, 186619, 22402, -216890, -144697, -140521, -124399, 124426, 153478, -105331, -44515, 122006, 125487, -2594, -147809, 26452, -84950, -32438, 39807, 17393, 35207, -68031, -288050, -199537, -106989, -47237, -50928, -179469, -10582, 14989, 97298, 101972]
21063A01972k08877m1874p4281R7603K926K1192M1354j63876p5486j48625m4423
21052d92395M09997k6912k8224K77821J98940J55911k46379o2224M2024K30490
21042D59049r6403M5759R346j76018l29341O6948J43085j53551j60723K08168
21032A6319m3498j39915j89240j42204J24239J24417O7266N50O063J67051J11389
21021A02437J11924K39077j85080q4651J11857k34121n140k3166k73023r8688
21011c38574K04057K129j13024k69041K2670K20821j2534N176O9146J71738l0184
21000f7620k6869j76325j54867p2011J14755m0081M4851J79339j63463J75075
20990a87216J41421J25029o3021j72992q0472J02164N1304j933K7490J68251j4278
$$ y = [101972, -106905, -148779, -223060, -125457, -122531, -101339, -59985, -223861, -299347, -447972, -492395, -82398, -109310, -137534, 140287, 339227, 495138, 248759, 186535, 228559, 459049, 362646, 408405, 417751, 241733, -87608, -20660, 122425, -31126, -191849, 16319, -27179, -167094, -356334, -498538, -374299, -249882, -182616, -182066, -176003, -8952, 102437, 214361, 453438, 268358, 183707, 295564, 61443, 56303, 33137, -239886, -338574, -134517, -132388, -245412, -514453, -491783, -270962, -283496, -278320, -209174, -37436, -67620, -94489, -270814, -425681, -497692, -382937, -423018, -378167, -198828, -362291, -187216, -45795, 79234, 16213, -156779, -237251, -135087, -83783, -85716, -58226, 110025, 95747]
20979I5747Q3426k67959k58477O8069J7234L5451j70233k86341J29166J48434
20969d05483K00981K10421K7659j50604K8676J04522l05790l22785o3952P3771
20959f02584L4257P4768q8096K06124K52850k19425m3826L49522K49369j05581
20949A07378j25076k93483J8392l1511P0504k7470K6501k4737j8601j69572n6509
20938e24184l792J24106M1325L6735R4708o6616o899j40652J40222o8658j21525
20927d95230J57599L5524r1976r0856M1245j98916j9547J40168K55084L3715N7152
20916a76038n626J8560r2345L041P3244K05495r8381j44129k0699J08962J28322
20905D06p4196k5391k01958o0035m2153K71741J35508M7381N2940k90724j82019
$$ y = [95747, 179173, -88786, -347263, -279194, -261960, -226509, -396742, -683083, -553917, -405483, -204502, 5919, 33578, -117026, -88350, 16172, -289618, -612403, -676355, -602584, -568327, -493559, -581655, -375531, -122681, -342106, -385932, -36410, 212959, 107378, -17698, -311181, -292789, -324300, -253796, -281266, -254765, -279502, -298103, -467675, -524184, -527976, -403870, -362545, -325810, -231102, -297718, -304617, -445269, -305047, -373705, -495230, -337631, -302107, -394083, -484939, -443694, -642610, -662157, -521989, -266905, -233190, -176038, -181664, -163104, -255449, -252408, -179164, 26331, -72050, -216179, -236878, -127916, 406, -73790, -99181, -301139, -361174, -403327, -131586, 3922, 51303, 104243, -186481, -368500]
20894c68500K92987N7341k39385k6524J12721k33953j96445m0985N182J23006
20884e14555K9099R9410L8491J06357J23713L06533J41907j01113j37983q7484
20874D375J7723o9929j3889p405q3144k5952j77905K61125J62546j06598j27615
20863a66668k075J35619J59253K2993k2790j40817J58326O8841k47027l50594
20853c84939k9056J84304K22699J38232n4513p7740j43215r3839j03648J37841
20843b03874P8402k7435r0702r0250p87j8331m5731L40277M5508l29065M3870
20832b98118R7982M8698j26505q9299R3179J85260p2785k42284m2605J04792K19945
20821a21740N1148k14155J00326q2487m6947J55937k9538j68154M6240R2985J20750
$$ y = [-368500, -75513, -18172, -257557, -284081, -171360, -405313, -601758, -642743, -637561, -514555, -485456, -386046, -347555, -241198, -117485, 189048, 330955, 229842, 91859, 4375, 22098, -47831, -61720, -69125, -152269, -178221, -356126, -95001, 67545, -39053, -166668, -168743, -33124, 126129, 149122, 126332, -14485, 143841, 212682, -34345, -384939, -413995, -229691, -6992, 131240, 76727, -1013, -144228, -238067, -341715, -203874, -125472, -152907, -243609, -333859, -334646, -352977, -398708, -58431, -12923, -341988, -298118, -200136, -151438, -277943, -367242, -274063, -88803, -161588, -403872, -446477, -341685, -121740, -70592, -284747, -184421, -266908, -313855, -157918, -187456, -355610, -309370, -216385, -95635]
20810i5635k0242K01706Q9183j21325P8872j7573r181M8790j93420j24701J50060
20799a3466n6414o1417N1582R911k12449r2135J91006J40166P3407j88374k5639
20788a83822o0096R6238j09012m5361J47352q066N3841J42402K46420j55332j80544
20777e5980p4564m1333j8379K12053m6612j11230K86540M3290j81852j47013L9691
20766i5389k17099N558L30998J06571o1007k28747Q595k75188k07867N9483M9863
20755e24229k3590K27065J65466p507q7255j67401P2955J03410K77483J06555
20745A42952J104Q491l07274o135J52318r4917j7764j04043r378K31999L33229
20734C30582j84690k04308l17816k79905K17385K82575R9317O6442M1499P5621
$$ y = [-95635, -115877, 85829, 175012, 53687, 132559, 114986, 105805, 154595, -38825, -163526, -13466, -69880, -131297, -79715, -69804, -282253, -374388, -183382, -43216, 30191, -158183, -183822, -243918, -147680, -256692, -302053, -154701, -162767, -108926, 33476, 279896, 124564, -55980, -130544, -171877, -190256, 21797, -24815, -136045, 150495, 193785, 11933, -135080, -95389, -312488, -306930, 24068, 130639, 69632, -159115, -150520, -425708, -633575, -574092, -524229, -547819, -320754, -155288, -162795, -250050, -417451, -344496, -241086, 36397, 142952, 144056, 152547, -154727, -160862, -8544, -103461, -121225, -225268, -234646, -2647, 330582, 145892, -58416, -376232, -656137, -438752, -156177, -56860, 9582, 51081, 126702]
20724A26702K0308L1072k04321j08544j87800p1614q0235j52053L15559M9040
20714b61886P3810J15746m983m3376J32720M7627l17892N7408R5426J02715n5223
20703e7908J25359L1430j60919J26321P603j01399k00991J36575j11453k92205
20693d97587O9860L21650p6924Q6374n4948j58959P5284m1079q9700J09685J35057
20682a21287k7442Q3940q5689k69057l3503K43501J7820r0622P3154J51689j09762
20671a67258m5702J49923Q5238j2648P8133M8656k38880j63717r1572P9097J60719
20660a18011Q6439k45053j20849J79087K17855l8620L299j44411j4345J58139
20650c6470j14083N3954r8609r1930J51934K30878L9070j43171j02692j46721
$$ y = [126702, 147010, 178082, -26239, -134783, -322583, -394197, -474432, -626485, -310926, -261886, -188076, -72330, -77313, -120689, 12031, 59658, -258234, -200826, -105400, -2685, -57908, 67451, 98881, -62038, 64283, 71886, -29513, -230504, -93929, -205382, -497587, -427727, -106077, -183001, -96627, -151575, -310534, -235250, -276329, -366029, -256344, -121287, -148729, -64789, -150478, -419535, -453038, -209537, -191717, -282339, -209185, -57496, -167258, -212960, -63037, 22201, 9553, 87686, 136342, -102538, -266255, -357827, -278730, -118011, -31572, -276625, -397474, -218387, -532, -39152, -35853, -180264, -194609, -36470, -150553, -96599, -195208, -287138, -135204, 95674, 134744, -8427, -111119, -257840]
20640b57840q611J48089M6567j32197r6599j19083J98169M4193j0563K13375j2944
20629A2556k9159k26828j6870J46319j20941J04099J68091L1253P522l6515j35480
20618i5953q4333O3340L56452O7405L8887r8867m7502P3376m7374j23701p8279
20607B3451k7430j97968j45134p7285J15262J60506j5766R3228n0387j07520r8136
20596c27179j36591J02190M7185K4795J48557J84325n531p9121J5453o7607Q9665
20585c859j34454j62511P8195K65666L77153L05113M29712K54353J05423k10656
20575A304135M4707L47040K66870j0030m76520n85709j09010K42335J25410N4061
20565A203289K49779K57018K11430k0034k01612J72168J74103j9807k11460k56556
$$ y = [-257840, -266451, -118362, -71795, -203992, -300591, -419674, -221505, -177312, -187875, 25500, 12556, -16603, -243431, -260301, -113982, -234923, -130824, 37267, 68520, 76042, 39527, -95953, -180286, -116946, 239506, 306911, 345798, 246931, 199429, 272805, 225431, 101730, 23451, -3979, -201947, -347081, -424366, -309104, -148598, -164364, -71136, -121523, -229043, -327179, -463770, -361580, -314395, -289600, -141043, 43282, 37751, -41370, -25917, -93524, -3859, -138313, -300824, -222629, 43037, 420190, 725303, 1155015, 1409368, 1514791, 1304135, 1348842, 1695882, 1962752, 1952722, 1476202, 890493, 781483, 1023818, 1149228, 1203289, 1453068, 1710086, 1921516, 1901482, 1699870, 1872038, 2046141, 2026334, 1814874, 1558318]
20555A558318o10579k16196L2502N3904j69532l13394m4431j70136j74890Q0117
20545B5683j2632j02860q4921j43006J35765K40434J20332J6661k9307j17318
20535D8831Q0550l2412r4297Q5547r8745j17539j05530j91715m3869J35325N079
20524c28775M3913j1371J61709J22064L448l1062N7597J8259k51745Q8603K66390
20513A39030J03001q517Q1554k02021q0110r2277j01492J06314j00122j89195
20503c43835M1722R642j65280j79665R4742K11445J99665J21169P9126O0466k55192
20492a25995k57209j50649K22962L5562J46676j69911j88407J54823J27150q8284
20482b93282r221m0182l9769J18614k6981j53076P5080J51141J75221j28765J18815
$$ y = [1558318, 947739, 731543, 764045, 817949, 648417, 335023, 290592, 120456, -54434, 25683, 13051, -89809, -174730, -317736, -181971, 58463, 178795, 195456, 166149, 48831, 129381, 96969, 2672, 88219, -10526, -128065, -233595, -425310, -469179, -333854, -328775, -284862, -296233, -134524, -12460, -9012, -40074, 17523, 35782, -215963, -127360, 139030, 242031, 233514, 315068, 113047, 32937, -59340, -160832, -54518, -154640, -343835, -302113, -292471, -457751, -637416, -542674, -331229, -131564, -10395, 68731, 129197, -125995, -383204, -533853, -310891, -275329, -128653, -298564, -486971, -332148, -204998, -293282, -302503, -342685, -382454, -263840, -290821, -443897, -368817, -217676, -42455, -171220, -52405]
20471e2405P4559k91346n9644Q9933P4613K40442K21976Q0333r1835j55084j77559
20460d6017k68218p8265K19077r7064p8548J61641L35431K5352j58585l1170J20147
20449A03781m3057p3077k08998M6299J04384J22647j05471j83886k98713O4137
20439d71954J84991L4267m227J23505R2420j47144l45138J54290j11412J59269
20429c31133J72652j60800k08666p9004J38500l6723K45569L44019J31962P8795
20419B95171n0656l05761k22450k3235K2984j43998j00158K2911R1241K11688
20409b02263J53862J07195l53072j71828J38848J18102O4569p6127J65185L12907
20399B57378j12073q8733O9913N7666j9488o1392j61641j07199K45628K79228
$$ y = [-52405, 22154, -269192, -328836, -238903, -164290, 76152, 298128, 378461, 286626, 131542, -46017, -314235, -392500, -173423, -270487, -349035, -187394, 148037, 173389, 14804, -16366, 103781, 60724, -12353, -221351, -175052, -70668, 51979, -53492, -237378, -536091, -471954, -286963, -252696, -256923, -133418, -40998, -188142, -533280, -378990, -490402, -331133, -158481, -319281, -527947, -606951, -468451, -505174, -259605, 84414, 216376, 295171, 244515, -61246, -283696, -306931, -283947, -427945, -528103, -505192, -413951, -202263, -48401, 58794, -294278, -466106, -327258, -209156, -144587, -220714, -55529, 257378, 145305, 56572, 126485, 184151, 164663, 103271, -58370, -165569, 80059, 359287]
20389C59287j05129l10418J4874J28668R4877O503q4111j92451j37675J536k707
20378b26746j69843q8379K1384m4212p7026o980K87662L37994J79731r3208k41291
20367a20914j54393j58214p6035J97469K65249J74571K7403o1452q1761j58841
20357a46918K34479p7633l12041k38676l9468j4129J09039O7501J41774J39361
20347a36711r282J40492K30920o7317k61597r162M5332K405j20175q832R8871
20336i5056K96488n5926j63763p9924k12937j6256J3918Q9305Q9903Q6712j29104
20325a76640r4316j6904J62199J39778q074P7143j83863j50330K04924K36284
20315A90201k91832j53954L3445j8228r1588n5111m2308n7922K67861K95474l8642
$$ y = [359287, 254158, -56260, -41386, 87282, 182159, 188662, 104551, -87900, -225575, -224039, -226746, -396589, -484968, -463584, -507796, -584822, -591802, -304140, 33854, 213585, 120377, -120914, -275307, -433521, -509556, -312087, -46838, 127733, 155136, 93684, 11923, -146918, 87561, 9928, -302113, -540789, -580257, -594386, -485347, -417846, -276072, -136711, -145993, -5501, 225419, 158102, -103495, -112657, -67325, -64920, -185095, -193927, -95056, 201432, 145506, -18257, -98181, -311118, -327374, -313456, -224151, -134248, -47536, -176640, -270956, -287860, -125661, 14117, 6043, 83186, -100677, -251007, -46083, 190201, -101631, -255585, -222140, -240368, -331956, -387067, -429375, -487297, -219436, 76038, 37396]
20304C7396r3381K23823m9211k40830j46952J59513J35605P265j20721N3569l8880
20293g2804l25147j11895K21506J71584N5582q0061q2912M2655j3755n2986r7141
20282c45374J58814Q3321K02434j18735j87533K07695n1525r9359O4898J89584
20272A04220J02535j72231J82768j66095j70139K11670J42881k08399k40430l7491
20262b50711J49504L0605q5948n8518Q0664Q7322J1265m6060k9142l9107K0505
20251a29621N0235q8149q9498L0278K14579N0683J3459q351M6414R7296J87328
20240C74653Q0942N5686k78011O5728J93136k43488m3138K25425J22226j72405
20230C80754n0716J29751k06886R8062k01332j55463l3490l26642L75K58138K14934
$$ y = [37396, -55985, 167838, 118627, -122203, -269155, -109642, 25963, 33228, -87493, -33924, -72804, -397951, -509846, -288340, -116756, -61174, -141235, -224147, -181492, -195247, -248233, -345374, -186560, -103239, 99195, -19540, -207073, 622, -50903, -150262, -85364, 104220, 206755, 34524, 217292, 51197, -118942, 92728, 235609, 27210, -213220, -250711, -101207, -70602, -156550, -215068, -134404, -47082, -35817, -81877, -111019, -150126, -129621, -79386, -167535, -257033, -226755, -12176, 38507, 51966, 43615, 90029, 187325, 374653, 455595, 511281, 233270, 298998, 492134, 248646, 205508, 430933, 553159, 380754, 330038, 459789, 252903, 350965, 149633, -5830, -39320, -365962, -365587, -107449, 107485]
20219A07485N1973J11051j6063k08119P106N740o1151R7040J3945K83290K31065
20208F23362M18982M80526O51872P98370M98537O229o8810J18458L34589j83876
20198C678239p64568p05364m98523m22326p1597j03097K00380K37426O05825R16245
20188C072640O75276q7050j19424L06607L92560j04796n05259n86930k56276q6195
20178B701153l29934k87707l2376j03638o7394m77098k67004l10490k8497n4554
20168G42461j23576j01248K19791K05208K44799N02260J10684k08376p464K87530
20158A872069J9795j46379k96607m97339j04511j88892j60291j8543R2656k44456
20148C27502m2343j83735j84694O7020p8354j2943L1580P68k290J19163L33007
$$ y = [107485, 159458, 270509, 254446, 46327, 53433, 59173, -1978, 95062, 109007, 392297, 623362, 1042344, 1522870, 2174742, 2973112, 3471649, 3477878, 3409068, 3527526, 3862115, 3678239, 2913671, 2208307, 1709784, 1287458, 1215861, 1112764, 1313144, 1550570, 2156395, 3072640, 3747916, 3660866, 3541442, 3848049, 4240609, 4135813, 3630554, 3043624, 2787348, 2701153, 2371219, 2083512, 2051136, 1947498, 1880104, 1403006, 1136002, 825512, 797015, 742461, 618885, 517637, 737428, 942636, 1187435, 1689695, 1800379, 1592003, 1584539, 1872069, 1891864, 1745485, 1448878, 951539, 847028, 658136, 497845, 479302, 571958, 327502, 285159, 101424, -83270, -16250, -94604, -107547, -75967, -75199, -77489, 41674, 374681]
20137C74681L3098k18305n2490l3169j2741N4072M5043P5647L3222L9251K10057
20126E48366l2678L3126m1680p288k19006J37389M91p0773R3867j35938J06191
20115D12067J4874J31440q016k81674k62148M2155K45061K36185J05878j73306
20105D62516l2620J6909j51948k16697K00867J98952k19970k13180j50604K19996
20095A14221Q1922K81041k7553M0136J1850l17624l4300J6644j17334j72305R7838
20084b5464J03346k17475L4567R6775l016l385o6563J28254J47268J42503K02478
20073E39288j45141N123J23357K95620o2836q8713J12269Q9952j24432r0326J90095
20062H44256M2796q769j95178j07507n6137J33822n9536l3005K21074J66062k0838
$$ y = [374681, 407779, 189474, 136984, 103815, 91074, 145146, 190189, 265836, 299058, 338309, 548366, 515688, 548814, 507134, 499846, 280840, 418229, 418720, 347947, 441814, 305876, 412067, 426941, 558381, 550365, 268691, 6543, 48698, 293759, 529944, 635822, 462516, 429896, 446805, 294857, 78160, 279027, 477979, 258009, 44829, -105775, 114221, 196143, 477184, 449631, 489767, 501617, 183993, 149693, 166337, 49003, -123302, -25464, 77882, -139593, -105026, -8251, -11267, -14652, -81215, 47039, 194307, 336810, 539288, 394147, 399270, 522627, 818247, 755411, 666698, 778967, 868919, 744487, 654161, 844256, 887052, 878283, 683105, 575598, 519461, 653283, 593747, 560742, 781816, 947878, 927040]
20051I27040k07147j725J26417K8182j30613p6844K74719M86141j87808m52166
20041G86196j35096K70334L66758J82574J29326K10840K76851K72133K57921M14745
20031C032582M42919K21262r7798R8757K57839K76164P8037j17338l08125L6988
20021C921287J70082L13726M44257J001024J267102J130455J123584R17281K83361
20012A0572159O78533Q06903Q05846R04124O03988O88264J546194K048867K809666
20003B1464544L502940N279263P538908J0807320J5329911K4583767M1096945
19996A29603598O4338243P1776139L1475536j3466486j3429869J7759995L1106927
19989C19164083j1331133n6426910o0347147m1205630k0461157m566586J1053880
$$ y = [927040, 719893, 718168, 844585, 872767, 742154, 665310, 940029, 1426170, 1238362, 786196, 651100, 921434, 1288192, 1470766, 1600092, 1810932, 2087783, 2359916, 2617837, 3032582, 3475501, 3696763, 3598965, 3697722, 3955561, 4231725, 4309762, 4192424, 3884299, 3921287, 4091369, 4405095, 4849352, 5850376, 7117478, 8247933, 9371517, 10288798, 10572159, 11250692, 12057595, 12863441, 13767565, 14371553, 15059817, 16606011, 18654878, 21464544, 24967484, 30246747, 37785655, 48592975, 63922886, 88506653, 129603598, 193941841, 265717980, 297193516, 283727030, 270297161, 288057156, 319164083, 307832950, 251406040, 191058893, 149853263, 129392106, 124825520, 135879400]
19982A35879400L1641986N8814570P0190093K8537315k1002406k1296329J0766045
19975B93530674K5515833j4685596o0814062o7293001n0636711l3133167k1285229
19968G1198741j4642894j0595755p744584n538228m023002l346981k421880j964331
19960B0921086j868717j155825m41690n90678j192430j376117j141730q53027
19952A2300872r03388j154431j184224j089804o48360k68532n27869j55547K64728
19943F633445L48017q4675l94716n09538L7076L39525k75726q37612j012503o00598
19933C642695n65050k54556j29062k6148K4880m79419l18195M695j93712o9584
19923A636544O7013j51379K0596L607k02972j3790j1229l8200N6969j28975k14590
$$ y = [135879400, 167521386, 226335956, 296526049, 325063364, 304060958, 282764629, 293530674, 319046507, 304360911, 243546849, 176253848, 125617137, 92483970, 71198741, 56555847, 45960092, 38215508, 32677280, 28654278, 25307297, 22885417, 20921086, 19052369, 17896544, 17454854, 16864176, 15671746, 14295629, 13153899, 12300872, 11397484, 10243053, 9058829, 7969025, 7320665, 7052133, 6524264, 6368717, 6633445, 6981462, 6896787, 6502071, 5992533, 6029609, 6369134, 6093408, 5255796, 4243293, 3642695, 3077645, 2823089, 2694027, 2667879, 2692759, 2213340, 1895145, 1899840, 1706128, 1636544, 1703557, 1552178, 1572774, 1576381, 1373409, 1359619, 1348390, 1310190, 1367159, 1238184, 1023594]
19912A023594J32585M7442J33021j20931l29564L4340R5714M5007m6082q2812
19902I32314J41294O968o671j197j37357k74725j8468n7156N5540J53367Q4964
19891H78873j81318j98908j82810R1826Q8855M6293j2848P9289j79747j24820
19881C04685j24277n0801L68007P7852m175P6140J76758j11901r3545k19017L2090
19870D31816J38563o1890J57011j20017K170n5580j7847r7544k80183P9737J95569
19859C71805J90282J23666n3065p7568L6186n6245L1299K3988j56585j75758n2981
19848B05024R2925P1076j3515j86458J61325P7665J28374q4791l04960j01878
19838D4787j81576j10503J1797J30222o8132j1846L60226K44400q5671J26161
$$ y = [1023594, 1156179, 1203621, 1336642, 1215711, 886147, 920487, 1016201, 1061208, 1015126, 932314, 1073608, 1080576, 1073905, 1072708, 935351, 660626, 642158, 585002, 640542, 793909, 878873, 697555, 498647, 315837, 407663, 496518, 542811, 529963, 609252, 429505, 304685, 180408, 129607, 497614, 575466, 571291, 647431, 824189, 712288, 618743, 399726, 431816, 570379, 508489, 665500, 545483, 547653, 492073, 474226, 376682, 96499, 176236, 371805, 562087, 685753, 632688, 555120, 591306, 535061, 566360, 590348, 433763, 258005, 205024, 297949, 369025, 355510, 169052, 330377, 408042, 536416, 451625, 146665, 44787, -136789, -247292, -235495, -105273, -173405, -185251, 174975, 419375, 333704, 459865]
19828D59865J1279k62514n4318Q8438J006Q0497L8528J98839j18373j88750J8481
19817B72978J17528j75758q6829J29725J36661J31866j04336k14102p8498j1718
19807A17517p693r4451k86188R9759J71212k6076j07487l2039m7740q8597Q3042
19796b18741R9263J3456J58233J98486o725k99338l3140L66237L13431O6486n7099
19785F00549k25001k16851j61476R7233R0941J77922J31501l54748j50392j55290
19775a65612k45288n038o5663J47257K40500K12762J07973l8342N2304j86610
19765E4243k3444M8739k1199R5536J10875k16714N279R7099P4926M2395l46693
19754g8958l4111j05761J05866N6892L8468J65470J08400L227K5642K59953P2424
$$ y = [459865, 471144, 208630, 154312, 242750, 243756, 324253, 362781, 561620, 443247, 254497, 272978, 390506, 214748, 127919, 257644, 394305, 526171, 421835, 207733, 129235, 117517, 109824, 15373, -270815, -171056, 156, -25920, -133407, -165446, -213186, -301783, -218741, -119478, -106022, 52211, 250697, 243972, -55366, -88506, 277731, 591162, 657648, 600549, 375548, 158697, -2779, 94454, 185395, 363317, 494818, 140070, -10322, -165612, -410900, -415938, -481601, -334344, -93844, 118918, 226891, 188549, 240853, 54243, 30799, 79538, 58339, 153875, 264750, 48036, 53315, 150414, 225340, 267735, -78958, -113069, -218830, -112964, -56072, -17604, 147866, 256266, 259493, 285135, 545088, 617512]
19743F17512k01435l28076j82658j34690J41898J86941o29l3065j34398O2363
19733f237J3094l07996k8179K80755L45254J45754j22270j73193j40353r8372
19723i1743p7163K41267J3739m6579K512k2652J31839o5428r3348j55861r5682
19712b59099M16617J65061l71368j39395m8275n2j86623j05976j53066j34210
19702h16386J7233K61462J69716J59999j5421J0033O5888k5031j47192o6007n463
19691c91169M8536N3655q7284p2774K11091Q4035j5191J4862L7594p9452l2195
19680b28292L50413J15719j45582R6262j00377p2818j13708r2937M8887J98988
19670E6555m1793j17261J80441o5231j78528q9354j29763J24145L26709J71206
$$ y = [617512, 416077, 88001, -94657, -229347, -87449, 99492, 98863, 65798, -68600, -6237, 6857, -301139, -329318, -48563, 296691, 442445, 320175, 146982, 6629, -91743, -168906, 72361, 86100, 39521, 42033, 19381, 151220, 85792, -7556, -163417, -259099, 157518, 322579, -48789, -188184, -236459, -236511, -423134, -529110, -682176, -816386, -799153, -537691, -367975, -207976, -223397, -213364, -147476, -172507, -319699, -385706, -391169, -342633, -288978, -376262, -449036, -237945, -153910, -169101, -154239, -116645, -196097, -228292, 122121, 237840, 92258, 188520, 88143, 15325, -98383, -191320, -142433, 56555, 14762, -102499, 77942, 12711, -165817, -255171, -384934, -260789, 65920, 237126]
19660B37126j35190k09696l5558J06277o0208k7140K6815P3742J52743j35824
19650f913j42529l8054P4097M1036J71525J10407j42509k41040J9200l681J5407
19639a43054J13947K27646J11876N0131J84790J2111j99787l73494k42945M2213
19629b16566J59739P6947P854k01519Q5735J41091L1877M8247M5254j73928J35704
19618A40435j16524k1596O0224j5939J88062J56429J20579n0032l67226k58618
19608a64206J8437K6819l8099K51013m4855k29827j4090O8318M5452J09683M5543
19597G4188k15335J59449k0051l73549r6806M7983m3352N3062l7000K19349O8984
19586a63078j80056j4009K06796L203l9404m4438K7036J02562K32813k69352j50976
$$ y = [237126, 101936, -107760, -143318, -37041, -97249, -124389, -97574, -23832, 128911, -6913, -149442, -187496, -113399, -72363, 99162, 209569, 67060, -173980, -154780, -158461, -143054, -29107, 198539, 310415, 360546, 545336, 557447, 357660, -15834, -258779, -216566, -56827, 20120, 27974, -173545, -87810, 53281, 85158, 133405, 178659, 4731, 140435, 23911, 2315, 62539, 46600, 234662, 391091, 511670, 461638, 94412, -164206, -145769, -118950, -157049, 93964, 49109, -180718, -194808, -126490, -81038, 28645, 74188, -141147, 18302, -1749, -375298, -472104, -424121, -467473, -414411, -451411, -232062, -163078, -343134, -357143, -150347, -147144, -186548, -230986, -203950, -101388, 131425, -137927, -288903]
19575b88903Q5332j22788Q9144q3590K02276J5423j193j04150k86867J39091N901
19564c50324J05504J28510J28583J8984J01383n5303K3594j63776n3343R7067
19554a9121o5729j4226L64914j82872l02910j91714k02357J65303n8682j2132
19544e19526o3421P9759K74197P3214j00183l321J98717J56947J56310j60487
19534I2206j92668j58413m6493j84181K17200K17329J30764p2561P0175N8176
19524A31534m4113k11806J10518P0688k45347k5177N9181N6867J20236J62930
19514A85511Q460j44124j09880k05436O6488O3348n7078K67344K44249P2828k9241
19503C62469M0123L6470j36452k08994j94752J91207J31532o4692J4688R1971
$$ y = [-288903, -203571, -326359, -237215, -320805, -118529, -103106, -104299, -208449, -495316, -356225, -350324, -244820, -116310, 12273, 31257, 132640, 77337, 100931, -62845, -116188, -19121, -84850, -99076, 265838, 82966, -219944, -411658, -614015, -448712, -507394, -519526, -582947, -503188, -228991, -155777, -255960, -259281, -60564, 96383, 252693, 92206, -100462, -258875, -305368, -489549, -272349, -55020, 75744, 3183, 73358, 131534, 87421, -124385, -13867, 56821, -188526, -213703, -154522, -97655, 22581, 185511, 193971, 49847, -60033, -265469, -198981, -135633, -192711, 74633, 318882, 391710, 362469, 402592, 439062, 302610, 93616, -101136, 90071, 221603, 156911, 171599, 263570]
19493B63570o1181j92891n6738M0329L55898M78115N93404K42112l49883l53055
19483I59680m03176j70454k60774L9829n4827K39365K07542n1643k82983j95464
19473B7095M70910M48548K39341P405m56673r9410M6388j31450k91199j90642
19463G0313J55013j33973j51271k45407J04427J94917P6156r2258k67583q5301
19453c74967M23831M2409l2440M5608q9622J4087N5081K479k77064q0632L5324
19442b35906n0210p6282j48695K69646J87428L6245J59222K80270K74049Q3286
19432G79053O36675N14650l73906m94402k56709j89968k08888K7300M2179j6075
19422D59909k06632j26203K27437J85762L18705M23737K0410r7920n4813l49671
$$ y = [263570, 202389, 9498, -47240, -6911, 348987, 827102, 1420506, 1662618, 1312735, 959680, 556504, 386050, 125276, 165105, 110278, 349643, 557185, 505542, 222559, 27095, 498005, 946553, 1185894, 1193299, 736626, 637216, 683604, 552154, 260955, 70313, 225326, 91353, -59918, -305325, -200898, -5981, 70175, -22083, -289666, -374967, 48864, 91273, 58833, 104441, 14819, 28906, 83987, 86466, -190598, -271230, -235906, -286116, -362398, -511093, -241447, -54019, -17774, 141448, 421718, 695767, 779053, 1415728, 1930378, 1556472, 1062070, 805361, 615393, 406505, 433805, 475984, 459909, 253277, 127074, 354511, 540273, 858978, 1282715, 1303125, 1205205, 1150392, 800721]
19412H00721n76713j50793J37304K35987K68945k9748m390L19484j04829m7603
19402H48365Q0111L43279K63427J253k03631l36066j87632j55427j58707j31334
19392C63638R3340L86185N02305K55674k20941l8190j1036J66355k3157k50363
19382A223810l89916j73305j213j02231p8074R6566K01068j96964l66780j14931
19372I8030J8593J78736M1887m8289R1145N4728M739J60889o145J42046p4570
19361F61789M3099L68146Q46407J035403K67898n00761p20326o86423m54490k67755
19351E92987j61271j33433o4114j08450J18530K81791J96986K35749O28372R73592
19341B560739L84965m85030p63792n16328k16358j53835k90305n27763j96324
$$ y = [800721, 224008, 73215, 210519, 446506, 715451, 685703, 681313, 1000797, 895968, 848365, 928476, 1271755, 1535182, 1536435, 1332804, 996738, 809106, 653679, 494972, 363638, 456978, 843163, 1345468, 1601142, 1380201, 1342011, 1330975, 1497330, 1474173, 1223810, 833894, 660589, 659376, 557145, 479071, 575637, 776705, 579741, 212961, 98030, 116623, 295359, 337246, 288957, 380102, 434830, 439569, 600458, 594313, 736359, 661789, 704888, 1073034, 1919441, 2954844, 3222742, 2721981, 2001655, 1315232, 860742, 592987, 431716, 298283, 234169, 125719, 244249, 526040, 723026, 958775, 1587147, 2560739, 2945704, 2460674, 1696882, 1180554, 964196, 810361, 520056, -7707, -204031]
19332b04031J73151J59980K52961j8710k02774k09316J38884M2651j14239r3609
19322g5052k1198n8299n7478L5545r4301l1021p964K20833K37302J57864q7692
19311B18539q4541J05910J12862J51271L09149M62326K63138P77019Q43842L13667
19301C473182o44759q55831p31599m41217l4696j89078j99473J11696J34456K35700
19291H58381K44300J85557J30547L66991P74861N14261n64348n86855n03958o49902
19281G69835k70010k949N6045j69234l0470J08744n8700o9800r9064K0719J62152
19270D17268j11422m01020j71251J39104J13558J66228J7147j3116J61371J44689
19260D62556L50319K93201L37393j74477m22342k45631j88052l01655R3368K81403
$$ y = [-204031, -30880, 129100, 382061, 363351, 160577, -48739, 90145, 132796, 18557, -75052, -96250, -154549, -212027, -176482, -270783, -301804, -309768, -88935, 148367, 306231, 218539, 133998, 239908, 352770, 504041, 813190, 1275516, 1538654, 2315673, 3159515, 3473182, 2828423, 1972592, 1240993, 799776, 765080, 576002, 376529, 488225, 622681, 858381, 1102681, 1288238, 1418785, 1785776, 2560637, 3074898, 2510550, 1923695, 1419737, 769835, 499825, 496876, 552921, 383687, 353217, 461961, 403261, 333461, 234397, 255116, 417268, 305846, -95174, -266425, -127321, -13763, 152465, 169612, 156496, 317867, 462556, 812875, 1106076, 1443469, 1268992, 846650, 601019, 412967, 111312, 204680, 486083]
19250D86083P1551K1331r6706j08669q4246K38102K78455J68334M13703K16028
19240A603966k65435l69654m86571k95507j98213q8908J90647L66947J11134l17270
19230B51136k38090o9223M9383J48331M1017r6062l6798j80545n1334o5359n3430
19219c00974K00874N715M9170l8704J22688J70360J39796J14345j99990k70609
19209g329k68500J3484N44642K65043J67692N26438K43118l66759k62947j16929
19199G37953N0903k2884k45630R6347l8092k13928k75881k12341J62611K55143
19189B94201K62366M65826M51736j7959m90621k93113J41303L958k31723j88504
19179C97470j33625l05900j65100R0584K43620k46485j80047R3882j42959k13676
$$ y = [486083, 557634, 578965, 482259, 373590, 289344, 527446, 805901, 974235, 1387938, 1603966, 1338531, 968877, 482306, 186799, -11414, -100322, 90325, 457272, 568406, 251136, 13046, -56177, -6794, 141537, 182554, 86492, 49694, -130851, -182185, -247544, -300974, -100100, -94385, -45215, -83919, 38769, 209129, 348925, 463270, 263280, -7329, -275829, -262345, 282297, 547340, 715032, 1241470, 1484588, 1117829, 854882, 737953, 788856, 765972, 520342, 616689, 578597, 364669, 88788, -123553, 39058, 294201, 556567, 1022393, 1474129, 1456170, 965549, 672436, 813739, 817697, 585974, 397470, 263845, -42055, -207155, -116571, 127049, -119436, -299483, -205601, -348560, -562236]
19169e62236J35891K39473K48601P2048k49325m9697O5464L54113J70826m35186
19159a0028k53559J17434R7316K20076n823p7515k40331k69153j10408N5766K3505
19148d52720J49159P1588j50633Q7345J78821K12069J14936j75027j98372p142
19138a69976R0065p067Q5124j17562l3408J12826J29679L9823p0161j61564J37584
19127C5363J41552J20914j03844J04391k8867n7306j82449k97755k87542J9652
19117e35891K04789J57849J52614J76220L3566J4405J15867m281j80157m7596
19107H7385l3556k4441R8465o5347J27316k4933J15273r8097j51045j02878j48322
19096b20180R4660J4260o8703O2153N3447R9114J42390m7440J53736K28831n824
$$ y = [-562236, -426345, -186872, 61729, 133777, -115548, -165245, -99781, 254332, 425158, -10028, -263587, -146153, -48837, 171239, 165416, 87901, -152430, -421583, -531991, -476225, -452720, -303561, -231973, -382606, -295261, -116440, 95629, 210565, 35538, -162834, -169976, -79911, -86978, -1854, -119416, -152824, -39998, 89681, 129504, 59343, -102221, 35363, 176915, 297829, 193985, 298376, 269509, 212203, 29754, -268001, -555543, -535891, -331102, -173253, -20639, 155581, 189147, 203552, 319419, 315138, 134981, 87385, 53829, 29388, 127853, 62506, 189822, 164889, 280162, 182065, 31020, -71858, -220180, -125520, -111260, -179963, -117810, -64363, 34751, 177141, 129701, 283437, 512268, 506444]
19085E06444k03936J62461J39593k63322q5724N4569o3695k48067j53999J21377
19075c4299K2972m6939l6418K81510J69901R3622k11368r7887J04253j15324j73342
19064d3319J80690p8129j25317K86140l5294k20620K1334N3925J9698K73685R8743
19053D31536j39851o805q3038k1488m3853o8960J30691J507P9260J65047q4034
19042C60012j85146R5557N0300j02354j41771O1359Q5491J0383k28877J65367
19032A70321L74586L0183k0599m2523j09799j79345O6574J52679j28104Q9626
19022D03599K00329O4275n3250m1796k25173J44389K73841j72624k67539N4448
19012C80499J47344j37673J39448J57287o5828j73303l89549j71442K79582L96947
$$ y = [506444, 302508, 464969, 604562, 341240, 255516, 310085, 246390, -1677, -155676, -34299, -11327, -58266, -94684, 186826, 356727, 450349, 238981, 141094, 245347, 130023, -43319, 137371, 59242, -66075, 220065, 184771, -35849, -14515, 39410, 59108, 332793, 431536, 291685, 284880, 201842, 180354, 136501, 67541, 198232, 199739, 278999, 444046, 360012, 174866, 270423, 320723, 218369, 76598, 137957, 223448, 233831, 4954, 170321, 544907, 575090, 554491, 511968, 402169, 222824, 289398, 442077, 313973, 403599, 603928, 668203, 614953, 573157, 347984, 492373, 766214, 593590, 326051, 380499, 527843, 390170, 529618, 686905, 621077, 447774, 58225, -113217, 166365, 563312]
19002E63312L38642K13048j28859j04188r012m2286p3737K5108K57208K25718
18992A264954L44428O51489L16305j04886k01620n4201L19621P9217p5443J09223
18982B649087L55987L01077P25487O44482M67392O52895R82392J105439L27088
18973H211326j88886M01112J072428J680335K153510L143599M624423P463547
18965B8561394J1631815J9160001L5172616O5735540R2697392M3223710m8958797
18958B47223671p6123339n8484713l4736059j9087469j0299016m870387j183088
18951D2439600K476031P706290J6090731L1789524O0386701Q7110854M2540958
18944B90540689m7290168p5263715n8554107l5740349k0905595j2791416q594589
$$ y = [563312, 901954, 1115002, 986143, 881955, 872943, 830657, 756920, 782028, 1039236, 1264954, 1609382, 2260871, 2577176, 2472290, 2270670, 2216469, 2536090, 2615307, 2539864, 2649087, 3005074, 3306151, 4031638, 4676120, 5143512, 5796407, 6778799, 7884238, 8211326, 8022440, 8423552, 9495980, 11176315, 13329825, 16473424, 21097847, 28561394, 40193209, 59353210, 94525826, 160261366, 252958758, 296182468, 247223671, 171100332, 112615619, 77879560, 58792091, 48493075, 43622688, 42439600, 44915631, 52621921, 68712652, 100502176, 160888877, 247999731, 290540689, 243250521, 167986806, 109432699, 73692350, 52786755, 39995339, 31400750]
18937C1400750n793585l647337k636279k218839j692152o93416k52372p55232
18929A3711538j184479j056702m34046L5138k99267n62526m63382L8778Q73630
18920A0658682P38581n8334L35318R17406J380806J436482K135237L162265M698888
18911B5405331P511354J2038305K0307389L7138539O8100771R8077785M9484954
18904C18064428m9719208q1442601o3731269l8056134k0891744j1412635o019927
18897D6790910j786535K857726Q320668J7272375L3482689O3392256R3301136
18890B63631225M9388044m8818859q1958956o4309570l9035722k3130401j4138746
18883D1627015r340530o582104m583285l305643k546482j491407p42566l08799
$$ y = [31400750, 25607165, 21959828, 19323549, 17104710, 15412558, 14719142, 14466770, 13711538, 12527059, 11470357, 11036311, 11071449, 10772182, 10209656, 9746274, 9785052, 10658682, 11397263, 11338929, 11674247, 12591653, 13972459, 15408941, 17544178, 20706443, 25405331, 32916685, 44954990, 65262379, 102400918, 170501689, 268579474, 318064428, 268345220, 186902619, 123171350, 85115216, 64223472, 52810837, 46790910, 45004375, 47862101, 56182769, 73455144, 106937833, 170330089, 263631225, 313019269, 264200410, 182241454, 117931884, 78896162, 55765761, 41627015, 32286485, 25704381, 21121096, 17815453, 15268971, 13777564, 13034998, 12726199]
18875A2726199j023848j442855r53003n85732m91116p36221q65926r40417r53209
18866D733872n05166m41625k75248J9201K16373L22069k04702n58277l53564O4431
18856C017364j69774m10796k08130l76477l62469J93631K59564J38297N4520l41868
18846A793862k35796n6831N4310k11335l08481J8899K26147M7879Q3953K27173
18836A639780P7685O4701J98787J16383k83562j79245j67944j38637k51677j50687
18826I25584j08832j27861j61015O8260j66854N5379L09805L37162q3673l78453
18816F69502j02305K33084k4612j36883p4115j5457M9063j1238K8997m2769O5960
18805F39227R865K9388k18650k14267j33657l9472J75690K80831o1775r1106J71184
$$ y = [12726199, 11702351, 10259496, 9306493, 8720761, 8229645, 7493424, 6627498, 5687081, 4733872, 4228706, 3787081, 3511833, 3531034, 3747407, 4069476, 3864774, 3306497, 2952933, 3017364, 2847590, 2436794, 2228664, 1852187, 1489718, 1683349, 1942913, 2081210, 2135730, 1793862, 1558066, 1501235, 1555545, 1344210, 1035729, 1054628, 1280775, 1328654, 1412607, 1639780, 1717465, 1782166, 1980953, 2097336, 1813774, 1634529, 1466585, 1327948, 1076271, 925584, 816752, 688891, 527876, 596136, 429282, 484661, 794466, 1131628, 1047955, 669502, 567197, 800281, 775669, 638786, 564671, 549214, 598277, 587039, 616036, 573267, 639227, 649092, 678480, 459830, 245563, 111906, 72434, 248124, 528955, 467180, 376074, 547258]
18794E47258j54122j26985n176J55191R8938L1226j8981r7272j24007J35775k9794
18783D12051o6291K39647K5874n0389L35432K48615k1771k05146k14735k99418
18773D03869K2648J60546J33192J7099L24545R81325J135292L10267p68597o15020
18763B105166n71090n18569j08544j18245L7241j30816j54867l8538k06010J6184
18753C11912J9608K10793J53213m35858k13828L03806l2230j34713j48284j25408
18743i0989j60001q2652K49100L12043M3801j35254j75245k33316P1881L62691
18733A62059J61763j66844P8035j38990q4355j2693j7003J07039k7888J40144
18723B01267L3290N4606n166j16997j01114R5222l5360N5829j9692k8337J77968
$$ y = [547258, 393136, 266151, 260975, 416166, 515104, 546330, 527349, 430077, 306070, 441845, 412051, 345760, 585407, 611281, 560892, 896324, 1144939, 1123168, 918022, 703287, 403869, 426517, 587063, 720255, 737354, 1061899, 2043224, 3178516, 3488783, 2720186, 2105166, 1534076, 1015507, 906963, 788718, 825959, 695143, 540276, 501738, 295728, 311912, 331520, 542313, 695526, 259668, 45840, 349646, 317416, 182703, 34419, -90989, -250990, -333642, -84542, 227501, 271302, 136048, -39197, -272513, -200632, 162059, 323822, 156978, 235013, 96023, 11668, -1025, -18028, 89011, 61123, 201267, 234557, 289163, 283997, 167000, 65886, 161108, 125748, 181577, 161885, 133548, 311516]
18712C11516j730j84368k87096J11576K31083n1019J09495j66608J3216P3310
18702A59375j45149M0617O9645j638k31070Q161J33213L6624j18949J10486J24661
18691A85976m2954r4417j03470P256j9767J42826K8553l93661j12083q0909J94509
18680b88141k0839J31109J59428m1586j53957j67015p5163L8870O3891K03455
18670a49948l4526L2165J33825M3698L6945Q6138n3325k79336j26735Q0752L1137
18659a99210O602Q8805r7850J88101J19505J57939l3370l22809j41315p1206k09416
18648e14224J72382Q2547o990K24908O2520j87660J32912K58291n8298q7002J53752
18637B33138k5498j50692k21785j53125L38285J79927n2959r4854j90803J17885
$$ y = [311516, 309786, 125418, -161678, -50102, 180981, 129962, 239457, 72849, 86065, 159375, 14226, 54843, 124488, 122850, -108220, -100059, 33154, 69778, -49171, 61315, 185976, 143022, 48605, -54865, -47609, -67376, 75450, 104003, -289658, -401741, -482650, -288141, -308980, -177871, -18443, -60029, -213986, -381001, -456164, -417294, -353403, -149948, -184474, -152309, -18484, 25214, 62159, 148297, 94972, -184364, -311099, -230347, -199210, -192608, -103803, -201653, -13552, 105953, 263892, 230522, -92287, -233602, -304808, -514224, -341842, -259295, -266285, -41377, 21143, -166517, -33605, 224686, 166388, 79386, 233138, 207640, 56948, -164837, -317962, 20323, 200250, 147291, 52437, -138366, -20481]
18627b0481j3925Q6466N9392J21936j21701P0010q954j71974l08828j36994L76672
18616f8381L61560K74571p1961l26409o6690q1713j04408O8519M4273k11912p8931
18605b61482m8155j14460k17859J29941K51889K29425p2883J12298K3200j88252
18595a56338j87119L44096K19254J75517M4313m69364k14717Q2267J20276O8201
18585B6386k26886j23763J76718q9482k99473l19422J36632K49042K68594P1879
18575a29775o5821j86764J93042L01436k00890j77718K77716J42109k43110j61687
18565b51462J68481J02757k14375k56448j16783M7577j39962m5625K17038J81197
18555c07605O6651J50090j9906j04752M7871M2800J9039J37107j8996j44768j17796
$$ y = [-20481, -34406, 52060, 111452, 233388, 111687, 181697, 172743, 769, -308059, -445053, -68381, 293179, 567750, 495789, 169380, 102690, 20977, -83431, -14912, 29361, -182551, -261482, -309637, -424097, -641956, -512015, -260126, -30701, -103584, 8714, 31914, -156338, -343457, 639, 219893, 395410, 439723, -29641, -244358, -162091, -41815, 26386, -200500, -324263, -147545, -237027, -536500, -855922, -719290, -470248, -201654, -129775, -195596, -382360, -189318, 112118, -88772, -266490, 11226, 153335, -89775, -251462, -82981, 19776, -194599, -451047, -567830, -520253, -660215, -705840, -488802, -307605, -240954, -90864, -110770, -215522, -167651, -124851, -105812, 31295, 12299, -132469, -250265]
18544b50265J75202J04014r9261O8239k2344j48507j751J51328L6564o6142o0643
18533a13566J14371j02393J7656K08414j07694j46888J37777p454j47878j07058
18523b54713J65425J10340R4919M2092J09284l9232K8609q8772k76031J32034
18513B3955J70148L5634j48401l7438J86782j55158r3915L5088p3237o9751J69961
18502D3668J2415m2106k38941j39666J30967p8189L7299J99985L14539k59394
18492a9423j86570o1791n8673J68268J13200J35080l9096p1852K74045Q051m07407
18481a46168k10568o2017K14206J02103L7287j37365Q2237K16302k5224o7211
18471C582L6812j88460m6289J59070j34623k02676K18J30461K01496P8687P7983
$$ y = [-250265, -75063, 28951, -70310, -2071, -24415, -172922, -174673, -23345, 13219, -52923, -113566, 805, -101588, -83932, 124482, 16788, -130100, 7677, 223, -147655, -254713, -89288, 21052, 115971, 158063, 267347, 228115, 256724, 167952, -108079, 23955, 194103, 229737, 81336, 43898, 230680, 75522, -18393, 16695, -56542, -126293, 43668, 56083, 13977, -224964, -364630, -233663, -311852, -274553, -74568, 239971, -19423, -205993, -267784, -326457, -158189, -44989, 90091, 50995, -20857, 253188, 261239, -146168, -356736, -418753, -204547, -102444, -65157, -202522, -120285, 96017, 70793, 3582, 40394, -148066, -194355, -35285, -169908, -372584, -372366, -241905, -40409, 38278, 116261]
18460A16261M880j64060O7228M4920j69401k64262l3048J17969J59828j38565
18450b58250j5272o1044j7616K1149n694K04106k3410K61725r8385q8034j11823
18439a92548J34328l9057O5425O0694J11187j02972J81629j93684J13012K80011
18429D18025L91236L52362K30670m99931o73911k49190J32171O8303Q8023j95573
18419F2185J518r4705K5350J00367J21336K92209N90713K93305o6198l27656o63622
18408C34802n83110j52009P459J12036k21415R9623J01203M21682K76803k8864
18398C68210L5587j05146k08793p9086O4047m395j63977k00073p0039K46322R2600
18387b4743Q3890K46268k08758J9393J98192M7339o0817J35765l747p8497k09986
$$ y = [116261, 121141, -42919, 24309, 69229, -100172, -364434, -397482, -279513, -119685, -258250, -273522, -334566, -352182, -331033, -336727, -132621, -156031, 105694, 7309, -80725, -192548, -58220, -97277, -31852, 28842, 140029, 37057, 218686, 25002, 138014, 418025, 809261, 1161623, 1392293, 892362, 218451, -30739, 101432, 169735, 257758, 62185, 63703, -31002, -5652, 94715, 216051, 508260, 1098973, 1392278, 1326080, 998424, 334802, -248308, -400317, -392858, -280822, -502237, -402614, -301411, 120271, 397074, 368210, 403797, 298651, 89858, 10772, 74819, 70424, -93553, -293626, -363665, -117343, -24743, 59147, 305415, 96657, 116050, 314242, 361581, 300764, 436529, 432782, 354285, 144299]
18376A44299k39340K29066M77640N64340J74054k98749m16226k84602j44236k86679
18366h0433m7243K15130P0098L03256L81541J58887J5101J19350K4941L46343
18356A506971R5546k71627n89300o50134k36430O542J27114J23917M0457J05677
18346B58733l35865j07952k56832K2893m8126L10510K21172j74513j08750N3211
18336a65519L4363J19518K3403J272R1381M5170N3955j1320n3378q9978p9468
18325c0601J09243o6436j16109J08879m6987M5627K30039j58031k77926q4684
18315b86986R9585J4758p4862Q3076R4474r3822j26119N026O6121K67930r1661
18304d2480j04328K230N2159R9635M5615M8931o061K3586R704P1091P0645O465
$$ y = [144299, -95041, 134025, 611665, 1176005, 1350059, 1051310, 635084, 350482, 206246, -80433, -127676, 87454, 157552, 460808, 842349, 1001236, 1016337, 1135687, 1160628, 1506971, 1602517, 1330890, 741590, 91456, -144974, -138432, -11318, 112599, 153056, 258733, -77132, -185084, -441916, -419023, -467149, -156639, 64533, -109980, -218730, -165519, -131156, -11638, 11765, 13037, 104418, 149588, 203543, 192223, 138845, 48867, -30601, 78642, 12206, -103903, 4976, -42011, 3616, 233655, 75624, -202302, -286986, -187401, -172643, -247505, -164429, -69955, -163777, -289896, -284870, -218749, 49181, -42480, -146808, -144578, -92419, 7216, 52831, 101762, 95701, 119287, 128991, 200082, 270727, 277192]
18292B77192j49475j39165P0644p1931j08723l9454p0229r5785k02653r4502O7599
18281e56482J46370J53046M3893R7438L71956k13155m05192r1788K40022j5959
18271b29851l8139j67798K7884K53753J31341J72455L45283M0349j47884l37476
18261D9917j98626J17018K8233j5310n1446k03051J147n5593j22718O5807j5809
18250d00431J01691K3842j21854n280N8066o80K48315l048O8468K80808r6126
18239A53771j81881j25412k5941J03479L29880o6164k13898J85955J88623j56114
18229A92298p7565j89189o571j6425l1928n783k65869J86533J52383p7989Q6792
18218e3313R4318j30096o2918J49014M33603Q0338k38355j08854J12531j73841
$$ y = [277192, 127717, -11448, 59196, -12735, -121458, -160912, -231141, -326926, -529579, -624081, -556482, -410112, -257066, -213173, -115735, 256221, 43066, -362126, -453914, -213892, -229851, -267990, -435788, -407904, -154151, -22810, 149645, 494928, 535277, 387393, 49917, -148709, -31691, -3458, -18768, -70214, -273265, -272118, -327711, -450429, -384622, -400431, -298740, -274898, -396752, -402032, -343966, -344646, -96331, -99379, -30911, 249897, 153771, -28110, -153522, -179463, -75984, 253896, 187732, -26166, 159789, 348412, 192298, 114733, -74456, -81027, -97452, -129380, -135163, -401032, -214499, -62116, -140105, -53313, 41005, -89091, -152009, -2995, 430608, 510946, 272591, 163737, 276268, 102427]
18208A02427j62662j97631k6898P1395P9883J0398J32231j43383k7019M24669
18198B63410L69300J02633k88259k05178J26386M0795Q9919j86700l96777r0134
18188a74605K06405J72451j2525K45594r5676o579K9954J5303K2134j57490q5176
18177A59790J05258M5204l1146r9979k6432l0513k75849l79128k493K92536K16989
18166b5763J81447K4379k2531j00543P4618J10459j60214K19393Q7956j62654
18156B26547J26707J44538j45872j80458K14055K40295j13840J36489M9176m1147
18146F56490l5670K17586R2147k5780J15216K61018L4973j5828O6601M9642J96518
18135A612913J87886K68154K79041J8539J0744K3076K38191M6450K34179P52989
$$ y = [102427, -60235, -257866, -284764, -213369, -133486, -123088, 9143, -134240, -161259, 263410, 632710, 735343, 447084, 241906, 368292, 409087, 499006, 312306, -84471, -174605, 31800, 204251, 191726, 437320, 341644, 335065, 365019, 380322, 402456, 244966, 159790, 265048, 310252, 279106, 179127, 152695, 122182, -153667, -532795, -535288, -242752, -25763, 155684, 180063, 157532, 56989, 131607, 242066, 81852, 301245, 389201, 226547, 353254, 497792, 351920, 171462, 385517, 625812, 511972, 648461, 697637, 656490, 620820, 838406, 930553, 904773, 1019989, 1281007, 1315980, 1300152, 1366753, 1416395, 1612913, 1800799, 2068953, 2347994, 2366533, 2377277, 2400353, 2638544, 2684994, 2919173, 3672162]
18125C672162J152583Q40048P66970P87580J153504J602047K200076K712484L629599
18116A8517053N230814P924777J1878410J9374178L3273385O3174864J26100349
18109B85473830K05253786J12388842j12654349j71685168j25543147p0187325
18103A23046469l8060510k2332149j4844265j0262564p353257n300325m087137
18096B0806262l211467k432085k207017j800620j242775j101691q45564o72165
18088G292878q96268p21253n66838q97818q39712l04571J20955J5363j20983k00824
18078B880929j27295j48649m67193q6978j21373O9157k23697k88353K14793l9522
18068A661819j44300q1089K9927j98288r6533k9534j73760m6029J41448K575k92825
$$ y = [3672162, 4824745, 5664793, 6431763, 7219343, 8372847, 9974894, 12174970, 14887454, 18517053, 23747867, 31672644, 43551054, 62925232, 96198617, 159373481, 285473830, 490727616, 603116458, 490462109, 318776941, 193233794, 123046469, 84985959, 62653810, 47809545, 37546981, 30193724, 24893399, 20806262, 17594795, 15162710, 12955693, 11155073, 9912298, 8810607, 7965043, 7292878, 6396610, 5675357, 5108519, 4210701, 3370989, 3066418, 3187373, 3202736, 3081753, 2880929, 2753634, 2604985, 2137792, 2050814, 1929441, 1998598, 1774901, 1486548, 1701341, 1661819, 1517519, 1436430, 1466357, 1268069, 1171536, 1142002, 968242, 922213, 1063661, 1066236, 773411]
18057G73411M667j19931l2897o2172j06110m3392k3871J18133n2359m9408J20645
18046E26716J46786J9734k95132q584j1092m9382O4760M5772j64365p8158Q1795
18035B78850j11264P6748P6125k8694o7439K6339k9797O1009J3146n9506J31788
18024C67305k15390o4504j72679j71683J99342K38785l342o0633K84522K39941
18014F41664K63666J36408l3021l42704j54291j39973K29000L8004k0652k47908
18004C70193N9522j7105k82204q6431J99523P2046j26295j49544J19266K8052
17994A87023J00644o54o547L4848q7194k10182k5871J75699J5364j02634J28433
17983B08929K57879J53908q763k62058q6127p3506k2780l2358j83254J3889J51700
$$ y = [773411, 778078, 658147, 625250, 563078, 456968, 413576, 389705, 507838, 455479, 406071, 526716, 673502, 693236, 398104, 389520, 378428, 329046, 393806, 439578, 275213, 197055, 278850, 167586, 244334, 320459, 291765, 224326, 250665, 220868, 281877, 295023, 235517, 367305, 151915, 87411, -85268, -256951, -57609, 181176, 177834, 117201, 401723, 641664, 905330, 1041738, 1008717, 666013, 511722, 371749, 600749, 638753, 618101, 370193, 429715, 412610, 130406, 43975, 243498, 315544, 189249, 39705, 158971, 187023, 287667, 287013, 280466, 315314, 228120, 17938, -7933, 167766, 183130, 80496, 208929, 466808, 620716, 611953, 349895, 263768, 190262, 167482, 135124, -48130, -34241, 117459]
17972A17459J45606o9924j87994m4425K6098J00832k01366j5197N8307K27371
17962A56767K16919n5878k84807n4237J15956q2750l57086n5372J94486K173K38888
17951C5059J63300l4068L2835O6458j20001J08141j15661l19859J05839J95294
17941A17337l2510P9660K86030P6480N8074M69405N92415L79107q1890j96275
17931A747833N907M0582J59018p0666m06195n29521k74955m23674m74653j10282
17921c36606L36779K26877j18189k39331j23981K5556j62156K1283n8141P6868
17911c51041K05765j07132p1447m1281K69793J36090M7791J3366j60099J41785
17901H3590o8327r3999l1243O3208J77038j10751J1479l2796J94811R1473j90466
$$ y = [117459, 263065, 193141, 5147, -39278, -13180, 87652, -113714, -128911, -70604, 156767, 373686, 317808, 33001, -21236, 94720, 11970, -345116, -400488, -206002, -203829, 35059, 198359, 164291, 197126, 263584, 143583, 251724, 136063, -183796, -77957, 117337, 84827, 164487, 450517, 526997, 585071, 1054476, 1646891, 2025998, 1944108, 1747833, 1753740, 1794322, 1953340, 1882674, 1476479, 946958, 672003, 248329, -226324, -336606, 173, 227050, 108861, -130470, -254451, -228895, -391051, -369768, -427909, -351041, -145276, -252408, -323855, -365136, -95343, 40747, 88538, 101904, -58195, 83590, 15263, -78736, -109979, -46771, 130267, 19516, 30995, -1801, 193010, 284483, 94017]
17890I4017p5735R7440M7125r3228J47153j75325j88864p9408J72908M86021Q01406
17879A233510O31681N1121k22883k92557J41884L31316r1950m11186n14531k57138
17869E99267q8786N0641l0238j51730n6383k82916k70938J17603J99787J15192
17859B01499n377k77746M8220L8374j4223q3190r2045j52778N3657K25989n3279
17848a10899m41275o1224J78307K33368J92276J1928j8819n8914j44575R6278
17838a23549j0130k33444j51613J47535K82227O3531J98203p9199j92795k24612
17828c23846J6247Q6581k7761j35454j19244J05057J60034R6226p5933M1653J00475
17817g5965N9662Q5651k0105k01227j15663R550p6151J72813l1571K35045k7563
$$ y = [94017, 18282, 115722, 162847, 69619, 216772, 41447, -147417, -226825, -53917, 432104, 1233510, 1865191, 1916312, 1693429, 1400872, 1542756, 1874072, 1782122, 1370936, 856405, 599267, 510481, 561122, 530884, 379154, 322771, 39855, -231083, -113480, 86307, 201499, 196122, -81624, -33404, 4970, -9253, -92443, -184488, -337266, -283609, -57620, -110899, -552174, -613398, -435091, -201723, -9447, 2481, -16338, -75252, -219827, -123549, -133679, -367123, -518736, -371201, -88974, -25443, 172760, 93561, -99234, -323846, -307599, -221018, -248779, -384233, -503477, -398420, -238386, -142160, -218093, -176440, -75965, -16303, 69348, 49243, -151984, -267647, -258097, -334248, -161435, -193006, 42039, 14476]
17806A4476q9849J54527L5352J45427Q3044l18895L1458K11974n8730o9288k53893
17795a14397j08575R5237J97536j1778j84609o1460o1516N667J02713J03394M2875
17784E087j65443L6490N0224l44979J07138J77446Q0526L6817j41578j92139L19716
17773c0695P6346O8317O2919N4226q8934o7663k3499K24968j23286j79872L6778
17762I605J17517J36028K914j633j8863o0810k09242k4296P1058j76204j33437
17751b87363l5928N2939J00855k9845K37425P5515r2487j85349p0540q2003J15657
17740b01124J82453K870j38734Q3302J49786J9992K2547J25660o8631j11582Q5553
17729A52092K05429j56921p3790R1819q2062k23819k16259J91069J40874K6165
$$ y = [14476, -75373, 79154, 114506, 259933, 342977, 24082, 55540, 267514, 208784, 139496, -114397, -222972, -127735, 69801, 58023, -126586, -188046, -249562, -243895, -141182, -37788, 5087, -160356, -123866, -73642, -418621, -311483, -134037, -53511, -16694, -158272, -350411, -30695, 45651, 113968, 176887, 231113, 142179, 74516, 51017, 275985, 152699, -27173, 9605, 127122, 263150, 266064, 264431, 245568, 184758, -24484, -48780, 22278, -153926, -287363, -323291, -270352, -169497, -199342, 38083, 113598, 21111, -164238, -234778, -316781, -201124, -18671, -15801, -154535, -71233, 78553, 98545, 121092, 246752, 178121, 66539, 152092, 357521, 200600, 126810, 218629, 136567, -87252, -303511, -112442, 28432, 54597]
17719E4597j14616J19346K01959j09203l31810j00088N4706K40003O7488j64506
17709h2124j84421j51386j57296J48226J85190R6958k06947l5288J67922p3074
17699b92240O8729J04963K21583l4442j60853j10946R0587J00668j4696O3699
17689C7052j20814R3663J0175r9259k36900l11905p9950M15514K43891L0714j68245
17678a86064R6648J48855k085N9572l68313O822J49886o222q5326k01625J1054
17667c76798J20226l041l03507k3751J28821J26996J90094J53725j20573P8086
17657b9722p4387j08334K47137K20270j78811M4546L64036p2187J15490k65838
17647B62200j61329k2987j71615K8832l1773j34052M3806J12304J60674j85338
$$ y = [54597, -60019, 59327, 261286, 152083, -179727, -279815, -225109, 14894, 82382, -82124, -266545, -417931, -575227, -427001, -241811, -144853, -351800, -387088, -219166, -292240, -223511, -118548, 103035, 68593, -92260, -203206, -112619, -11951, -26647, 37052, -83762, 9901, 20076, -79183, -316083, -627988, -707938, -292424, -48533, -17819, -186064, -89416, 59439, 57354, 116926, -251387, -244565, -94679, -100901, -186227, -387852, -376798, -256572, -259613, -563120, -586871, -458050, -331054, -140960, 12765, -107808, -29722, -104109, -212443, 34694, 254964, 76153, 120699, 484735, 412548, 528038, 262200, 100871, 77884, -93731, -64899, -96672, -230724, -186918, -74614, 86060, -99278]
17637i9278j54615j7747k3828J79975J0593K6376K4558K695r7066k88589P0223
17626c66703R0914M0982o5951m9872J96868O3537o6383j70652q4217Q2862j975
17615c30590M5780L9117J52589K05974r3364J53202L03022j24886j25534k25838
17605e28p7707j00662o0317J80353K13143N7984J64866J92036j04569o7309m050
17594C93240r880j12016k8620j91330k26112q7886J15066J13172M5798J9240Q3086
17583A13758k91726j74215K06341L07791q4249j36709j16964j07834l7547p1088
17573c92442q0961j20816j44828L6387M4206K7164K22870K6644O4010J4915K01855
17562a00996K41511m396j61712J20291k09112j24316J09888J64762K53933j7378
$$ y = [-99278, -253893, -271640, -295468, -115493, -104900, -78524, -53966, -51271, -148337, -436926, -366703, -275789, -234807, -300758, -350630, -153762, -90225, -156608, -327260, -411477, -328615, -330590, -284810, -245693, -93104, 112870, 19506, 172708, 475730, 350844, 225310, -528, -78235, -178897, -239214, -58861, 154282, 212266, 377132, 569168, 464599, 397290, 393240, 383360, 271344, 242724, 51394, -174718, -262604, -147538, -34366, 11432, 30672, 113758, -177968, -352183, -145842, 161949, 77700, -59009, -175973, -283807, -321354, -392442, -473403, -594219, -739047, -702660, -658454, -631290, -408420, -381776, -317766, -302851, -100996, 140515, 136119, -25593, 94698, -114414, -238730, -128842, 35920, 289853, 272475]
17552B72475j15242K1843R6291j94257l3227n3567N9072j2019p1024K99506n2361
17541B17490j46829o8202J41939R5623o2531j83546Q1510K35300J26335P9496
17531E16585l21837l53725J05416L79726J10347J20934O0162j59869M9627J59196
17521F66562m362k79192j46672o2132j38452k4567j8595L12104K40957j76579
17511C69072k03139k9426K41027L96778n9192j11135j32124k52678l67743j61225
17501c09785J09855L05239L9661J38256M3305n7408k2489p8795j35344M3029J75405
17490B50929K30132q6246m4588L0494J01923K55841J06108m54323o0147L7210
17480C67333j39085j1258P1703m0561k6292j21154R3226l696J098J93568K73417
$$ y = [272475, 157233, 179076, 275367, 81110, 47883, -5684, 53388, 41369, -29655, 269851, 217490, 70661, 2459, 144398, 240021, 177490, -6056, 75454, 310754, 437089, 516585, 194748, -158977, -53561, 326165, 436512, 557446, 617608, 457739, 507366, 666562, 662200, 383008, 236336, 174204, 35752, 11185, -7410, 304694, 545651, 369072, 165933, 136507, 377534, 774312, 715120, 603985, 471861, 219183, -148560, -309785, -199930, 105309, 144970, 283226, 326531, 269123, 246634, 167839, 32495, 75524, 250929, 481061, 394815, 350227, 380721, 482644, 738485, 844593, 390270, 330123, 367333, 228248, 216990, 288693, 248132, 221840, 100686, 193912, 190216, 191314, 384882, 658299]
17469F58299M1145n8379r3050J28010k59274k30756L3584p0982k03917J56913
17459A01593M1302K6861O2918J11857o5686K12131k19853J47163J93535j6476
17449E95345J61464Q8747J83935q807K6459N70762R11518J249554q1582q71477
17439B825918o80125k74643j79571r1974j42920m7987K38665K32508o624J05908
17429A979155K97238N96064N17529M27112N45504K84284j22211J42593J16735
17420D784003K30698K48118j13744J94015N32799O47693Q79184Q00025J352981
17411I555772J801594K423302L040457M245292O230981R349351J4600394K4222590
17403G5469733M2263008P5156456J06118530N7826654k8871899l8011217J0807118
$$ y = [658299, 699444, 641065, 548015, 676025, 416751, 185995, 219579, 148597, -55320, 101593, 142895, 169756, 232674, 344531, 278845, 490976, 271123, 418286, 611821, 595345, 756809, 845556, 1029491, 1020684, 1047143, 1617905, 2529423, 3778977, 3697395, 2825918, 2145793, 1871150, 1691579, 1599605, 1456685, 1408698, 1647363, 1879871, 1873247, 1979155, 2276393, 2872457, 3389986, 3817098, 4362602, 4646886, 4524675, 4667268, 4784003, 5014701, 5262819, 5149075, 5343090, 5875889, 6523582, 7402766, 8202791, 9555772, 11357366, 13780668, 16821125, 21066417, 27297398, 36646749, 51247143, 75469733, 117732741, 192889197, 299007727, 356834381, 327962482, 289951265, 300758383]
17396C00758383N5808818N276284p7524936r0311652o5141357l8921604k3108174
17389F6835762j5412927j0988302p789861n631501m180950k941269k572108k012441
17381A5306403j718678j379684r23525p65909k90266k00383l51894l25883l13579
17372I036602J60080R02894K87344n84382o13238k65110N62281Q06955N36365
17363A0829791O71386K16697k62888J40955J148046J355560O53250O16210J000326
17354A6369333K422759L763316N458527P909850J2949598K2066229L8574968O8504672
17346A78019252R9029554N7399988k5990085l7239742Q167311N2856922Q660660
17339C40903860p1707789q5949933o2393124l7098086k2197832j4594883j0370839
$$ y = [300758383, 356567201, 361843485, 284318549, 194006897, 128865540, 89943936, 66835762, 51422835, 40434533, 32644672, 27013171, 22832221, 19890952, 17318844, 15306403, 13587725, 12208041, 11284516, 10518607, 10228341, 10027958, 9676064, 9350181, 9036602, 9196682, 10099576, 10386920, 9802538, 9189300, 8924190, 9486471, 10293426, 10829791, 11501177, 11717874, 11454986, 11595941, 12743987, 14099547, 14752797, 15369007, 16369333, 18792092, 22555408, 28013935, 35923785, 48873383, 70939612, 109514580, 178019252, 277048806, 334448794, 308458709, 271218967, 279386278, 332243200, 340903860, 269196071, 183246138, 120853014, 83754928, 61557096, 46962213, 36591374]
17332C6591374p035612n169261l798141l048052k332047j683225j447181j277951
17324A0799904r10437r54084p30881j1062j14793p26147o93857k98365r5925j88429
17314F075924o84834m51383m3092P848K01921N56163P55527K11383l08808k88348
17304F032301k25849L44967n91959j091688p87411q13384m15128k10291j48470
17295B093088j36033O5754l19992j96766p410M0332N2304q0211p1206j23544r2701
17284A223615K18364j96010k74758l6056N4134n1543j92039M6057L7755J73189
17274A002708K56735k3154k78037l28180j97820Q6599o4360m0255J8664Q2033
17264E14933J59299J28592k42986o2534J60462R3227p5296j80926k74141J88365
$$ y = [36591374, 29555762, 24386501, 20588360, 17540308, 15208261, 13525036, 12077855, 10799904, 9889467, 8935383, 8204502, 8193440, 8078647, 7352500, 6658643, 6360278, 6264353, 6075924, 5391090, 4939707, 4896615, 4904463, 5106384, 5662547, 6418074, 6629457, 6320649, 6032301, 5806452, 6151419, 5559460, 4467772, 3680361, 2866977, 2451849, 2241558, 2093088, 1957055, 2022809, 1702817, 1506051, 1498641, 1538973, 1591277, 1511066, 1439860, 1316316, 1223615, 1441979, 1245969, 971211, 935155, 989289, 937746, 745707, 791764, 829519, 1002708, 1259443, 1236289, 958252, 630072, 432252, 518851, 454491, 414236, 432900, 514933, 674232, 802824, 559838, 497304, 657766, 750993, 675697, 494771, 220630, 408995]
17254D08995J65154k16548j69228j30959j0009K28050R2765j76001k28764O2705
17244B6160o8860L5041q664J86629K28319J30273j97103j39819k2352J25321J57359
17233D52304l62476k22618k066J93100J16002m6618J79469l0491m443J56931J64760
17222E93854o5695j0355r4774k08182o3051k3357R9614R7172J24381K25031J20147
17211G94785K17332J50913j02926n9866L15612K22310j53585k62562K77889M34411
17201A834313L48392N847k27938r0669L52167l14313n43956l57624j75395n5469
17191G75355l3086j88648k62316j54177L07360K54912J21130k13729j20494q6856
17181C99451j85883J30132Q3235P7753j78023q4098j66609m9245J06629L847L801
$$ y = [408995, 574149, 357601, 188373, 57414, 47405, 275455, 368220, 192219, -36545, 26160, -42700, -7659, -16323, 170306, 398625, 528898, 331795, 191976, 169624, 294945, 452304, 89828, -132790, -134856, 58244, 174246, 127628, 307097, 276606, 272163, 429094, 593854, 528159, 517804, 423030, 214848, 151797, 128440, 228054, 325226, 449607, 674638, 794785, 1012117, 1163030, 1060104, 1000238, 1315850, 1538160, 1384575, 1122013, 1399902, 1834313, 2182705, 2188552, 1960614, 1869945, 2222112, 1907799, 1363843, 1006219, 830824, 775355, 742269, 553621, 291305, 137128, 444488, 699400, 820530, 606801, 486307, 399451, 213568, 343700, 426935, 504688, 326665, 242567, 75958, 26713, 133342, 137189, 140990]
17170A40990J45943R8105J7274o466n8271j90155L6914K7062J65926R0678L7562
17159E05562M699m7101n1Q6100k13929J84468K50466R1922J81462J61196j74395
17148A030399p2278M58765L90796k8585j14990O740J93394q5708k79324m38205
17138A061004m28734k12759K08997L2808l74824j33184k0925j61648n7938j3104
17128a00307M6394O9459j7344K53672k34817J9882J20606J38899J26069j65118
17118B57395k66441K1973j35517j20723j22822M8329Q2508J39007J26930j53599
17108a22960o1000P627J05250K13607p9416k76798L8233M5565o9151O6208p51
17097a33586l663N5866q4353R7598J2468L44877o3233j57792r0999J52195P4528
$$ y = [140990, 286933, 385038, 402312, 395846, 337575, 147420, 184334, 211396, 377322, 468000, 505562, 510261, 463160, 463109, 549209, 335280, 519748, 770214, 862136, 1043598, 1204794, 1030399, 958121, 1416886, 1807682, 1779097, 1664107, 1670847, 1864241, 1778533, 1499209, 1061004, 632270, 419511, 628508, 661316, 286492, 153308, 132383, -29265, -87203, -100307, -53913, 15546, -1798, 251874, 17057, 36939, 157545, 296444, 422513, 257395, -9046, 12927, -122590, -243313, -366135, -317806, -235298, -96291, 30639, -122960, -183960, -176333, -71083, 142524, 63108, -213690, -175457, -129892, -199043, -132835, -133586, -137249, -81383, -165736, -68138, -55670, 289207, 225974, 68182, -22817, 129378, 203906]
17086B03906j70474j71397p9556K03631P1616J79330j28801L4952j09801l4073
17076f67N5413L6040L7667P274j9011p3613M6556j17j8353p9014r3118n4185K49044
17063I3916J27758k1687L2626l6671J07569j56249k12608j36049Q3868K27788
17053A10261l701j39891j36234P4406j07062j007n6999K56535j3741q3959j07053
17042b08445l8173j66499J03711K97037K61419k34794o2769J17556J67361r7480
17032A38924n7890m6483j0064J01062K96307N8743m0648j86607k77495M9110K77697
17021C02656K9544j30107j32773j54725k84912J34469m1561M4687K34668J48173
17011A50119J36358K6596K5864j51022l45158k6244P7305j0736k91683K05636
$$ y = [203906, 33432, -137965, -217521, -13890, 57726, 237056, 108255, 143207, 33406, -667, 54746, 90786, 128453, 135727, 116716, 43103, 89659, 89542, 71189, -7825, -100943, -155128, 93916, 221674, 199987, 232613, 195942, 303511, 147262, -65346, -201395, -117527, 110261, 106560, -33331, -169565, -95159, -202221, -203228, -260227, -3692, -17433, -101392, -208445, -246618, -413117, -309406, -12369, 249050, 14256, -48513, 69043, 236404, 138924, 81034, 34551, 24487, 125549, 421856, 480599, 439951, 253344, -24151, 24959, 302656, 332200, 202093, 69320, -85405, -370317, -235848, -277409, -232722, 1946, 150119, 286477, 313073, 338937, 187915, -157243, -183487, -106182, -116918, -408601, -202965]
17001b02965J38331j43900j38464Q2019j043p9485j47412J72577K61630K13662
16991A54950j54943k07536K04632K82107J8659n7016j39333l7334l9549N2540
16981G7177P6494J79009K1122J06369k14803j69640J27304J14960j3945l09318
16971e271R3850L3913k1734Q5605P7864o3349j55357l48349J20918L23672K36405
16960C78167q6119k23106j92389k0761R4356M725L85424K01711k45677l93728
16950i7397j84225R3464M319M0023J02784k6543j55830K04627J90405J1137M7695
16939B30459J32406o3075l6521j38941l71006o6351L6573K28142J28506K1269
16929A01461L1159N4932m3687j47856k24409L3725N2246J09175K37837P3802l94202
$$ y = [-202965, -64634, -208534, -346998, -264979, -266022, -345507, -492919, -320342, -58712, 154950, 7, -207529, -2897, 279210, 297869, 240853, 101520, 64186, 24637, 77177, 153671, 332680, 353802, 460171, 245368, 75728, 203032, 317992, 304047, -5271, 88579, 122492, 100758, 186363, 264227, 200878, 45521, -302828, -181910, 141762, 378167, 292048, 68942, -123447, -144208, -49852, -45127, 340297, 542008, 296331, -97397, -281622, -188158, -183839, -143816, -41032, -67575, -223405, -18778, 171627, 182764, 230459, 362865, 299790, 263269, 124328, -246678, -313029, -276456, -48314, 80192, 101461, 132620, 187552, 143865, -3991, -228400, -194675, -142429, -33254, 204583, 278385, -115817]
16918a15817k57475K40205k810j79540j37462K36698m5795k23478K65735L76531
16908A56792k45701N7983K47230m5979M1222N2987j39279j72839R5599J05940
16898A53955N8979j49964L09839j18658M4195p3427k945N45J2269J182m5493M0734
16886B31211k91920j96112M7829j55957K2796L23692M9003j12144o5368J57819
16876A0849m5890l0811L0199P6900K16739k27006j83569k6425J01694J32967J91610
16865B47257R5446J44544Q9226K02027N56125J67340j09650L8579K27243J22389
16855A780526j7726l82706j63140j88434n33076m54798j83533J82035K52357N4880
16845C46385o6641K5639j5919M0964L0374j00276k29843k291n1452L2386j34857
$$ y = [-115817, -373292, -133087, -135897, -315437, -452899, -216201, -261996, -485474, -219739, 156792, -88909, -30926, 216304, 170325, 211547, 264534, 125255, -47584, 48015, 153955, 212934, 62970, 372809, 254151, 298346, 224919, 221974, 222519, 234788, 235970, 190477, 231211, -60709, -256821, -208992, -364949, -342153, -18461, 30542, -81602, -146970, 10849, -35041, -65852, -35653, 41247, 257986, 30980, -152589, -179014, -77320, 55647, 247257, 342703, 487247, 576473, 778500, 1334625, 1501965, 1392315, 1430894, 1658137, 1780526, 1762800, 1380094, 1216954, 1028520, 495444, 40646, -142887, 39148, 291505, 346385, 279744, 305383, 289464, 330428, 360802, 260526, 30683, 28392, -23060, 9326, -125531]
16834a25531J4177L0284k26574P594J2158q1969J68192J6506p7203Q4186R5977
16823h2203J1869k32854J88141J57368m4233j37121R2832L90463P0235j88486
16813B26011K1938O8524k14526j9795m171K10121L79213L98086L44504J30481
16803A540386j08495O0706J00430O745k64011n48964l71492k76449j52820L2774
16793A8810N497j26312m4305K14804m3461j63554j5462K76351K52525j98417k17308
16782d0832k07393J23417K02841K21176k00195j89095J77380K18976j13615Q2762
16772B75422k37078k08826J03708K45784L9631k6041j68839J0015N4648o1237
16762B7187r4656j39458M2044J82834j70203j14960r6573J52324q361O2643K60165
$$ y = [-125531, -111354, -81070, -307644, -300050, -287892, -369861, -201669, -185163, -262366, -178180, -82203, -70334, -303188, -115047, 42321, -1912, -139033, -46201, 344262, 414497, 226011, 247949, 316473, 101947, 82152, 77981, 288102, 667315, 1065401, 1409905, 1540386, 1431891, 1492597, 1593027, 1599772, 1335761, 786797, 415305, 138856, -13964, 18810, 24307, -102005, -146310, 68494, 25033, -138521, -153983, 122368, 374893, 176476, -40832, -248225, -124808, 78033, 299209, 99014, -90081, 87299, 306275, 192660, 275422, 38344, -170482, -66774, 179010, 218641, 192600, 23761, 33776, 88424, 27187, -67469, -206927, -164883, 17951, -152252, -267212, -363785, -211461, -219822, -157179, 102986]
16751A02986k903m2684J55026n5896n1204l3637j24609j46532O8947j5220j29704
16740b75430k26433O5311K17688j12889P8131M7670N9881q7463K51460R5881j5154
16729I8653j82254N9945M3880j98369L7467J08541J36925J6977k47938k00971
16719c27144J72497K88852J34672q5315q8477l23142j36337m1553j89427K99677
16709b95697K74295N9374P3795j50054q0875N5530l485j7628n4530Q4860q7686
16698a42101J83871q8143l65808l4560K30446J45235j0641N1051L0606R0840j19479
16687b8683P0903J19072k49936k97079J76933J99855L307r8591m1311q3452M6413
16676a82569L36787j01456k01778M0540K0080L5646j38289o3295K79188L59791
$$ y = [102986, 100083, 57399, 212425, 156529, 105325, 71688, -52921, -199453, -130506, -145726, -275430, -501863, -436552, -218864, -331753, -253622, -205952, -146071, -233534, 17926, 113807, 98653, -83601, -23656, 20224, -178145, -140678, -32137, 104788, 121765, -126173, -327144, -154647, 134205, 268877, 183562, 95085, -228057, -364394, -405947, -595374, -295697, -21402, 37972, 111767, -38287, -119162, -63632, -67117, -84745, -139275, -54415, -142101, 41770, -46373, -412181, -446741, -216295, -71060, -81701, -30650, -44, 90796, -28683, 42220, 161292, -88644, -385723, -208790, -8935, -5628, -104219, -145530, -228982, -182569, 154218, 52762, -149016, -108476, -88396, -52750, -191039, -254334, 24854, 384645]
16666C84645R3446k66564j64505j73216k6099L3082j4720q6403j32345R5140P5925
16655a81614K05429N2953j90220k5583L7020L8504N4213j66362j87866R9237m2037
16644c06326J06121K48799J22060Q6731m9239k09838j4700q5535J28672j56338
16634a29593j71410J30640N8113l844m6733q7201Q8748l8871Q8707Q6255R6904
16623G1715k50517o178J33748m0059P0636j1723j70340j84206J58020K17892M752
16612f260O747q2275q0421J21189J41840m2489P648N0412n9085K2398Q6369J34485
16600C00558m1310p0541j57750J14863r827k2492Q3101M8656m207r3906Q4475
16589B31620j09777l54842J5560J01735K46589p823j04396j31360Q1394J97465
$$ y = [384645, 478091, 211527, 47022, -126194, -152293, -119211, -133931, -220334, -352679, -257539, -181614, 23815, 76768, -113452, -139035, -102015, -63511, -9298, -175660, -363526, -264289, -306326, -200205, 48594, 170654, 257385, 208146, -1692, -16392, -101927, 26745, -129593, -301003, -170363, -112250, -116094, -162827, -250028, -161280, -200151, -111444, -25189, 71715, -178802, -184980, -51232, -91291, -20655, -32378, -202718, -386924, -228904, -11012, -6260, 487, -81788, -162209, -41020, 100820, 58331, 65979, 116391, 57306, 79704, 166073, 300558, 259248, 188707, 30957, 145820, 135993, 113501, 196602, 245258, 241051, 147145, 231620, 121843, -232999, -217439, -115704, 130885, 123062, 18666, -112694, -31300, 166165]
16579A66165J47659j91734j94069P93M2149K62063n7018j33993j53413o6920J30553
16568d7765M4657o156J15160P423k10638N1756J41883O5529O2076p5201j51714
16557b990J2175J82137k71871O2190K39872P0446j91178p8111n3536j17951p8352
16546b27169L20786J39236J7267R6846P830j81037k44618j70064p6837n2466J32448
16535b37778M6713m7785r6409Q4384O9884P5775P0452J39329J33560j21919j01477
16524A4729p9208p1389j04369k8996K01033m2800j51964m4220k33656K7459J31653
16513c81728K53973J75790Q6997j14098k24675M5773N4203J13001K74926o1168
16503B22994L48L8575j56483r2386j9157O4274J13411N3154k35799j11272j01165
$$ y = [166165, 313824, 122090, -71979, -71186, -29037, 233026, 176008, 42015, -111398, -178318, -47765, -3108, -9264, 105896, 113319, -97319, -45563, 96320, 161849, 223925, 148724, -2990, 9185, 191322, -80549, -18359, 221513, 291959, 100781, 22670, -30866, -148817, -227169, 93617, 232853, 250120, 346966, 354796, 173759, -70859, -240923, -317760, -370226, -237778, -191065, -238850, -335259, -250875, -180991, -105216, -34764, 104565, 238125, 116206, 14729, -64479, -135868, -240237, -269233, -68200, -111000, -262964, -307184, -540840, -513381, -381728, -127755, 48035, 135032, 20934, -203741, -157968, -103765, 9236, 284162, 222994, 223342, 261917, 105434, 13048, -6109, 58165, 171576, 224730, -11069, -122341, -223506]
16492b23506m4907J47038R1300L76712J51286l05627l05154J41477N3992o9010
16482A3601j29081j05470J36960K5313j56638J410J93253j05358r1685k5233J94315
16471d8613j51759j8765J32234J00985L4377k01581m6657q0165j13019J01318
16461b91645K04939K28637J48213K9456J2947k63216n8687P5820L4884Q2892n608
16450A98632J63078K6337l10907j05319M3097j60107j33980q579j10887K5234
16440c73401L8819K0826k0688p8316O9228q3749J94318J31436k4521r2808J47416
16429g1440J75911j61347j91973J9740J64129P905q8346j69553J6521N6190L6546
16418b05717k735o4374q9536M495o840O9439J53076M1913J01781K6715l24162
$$ y = [-223506, -268413, -121375, -30075, 346637, 497923, 192296, -112858, 28619, 82611, 13601, -115480, -220950, -83990, -58677, -215315, -213905, -20652, -126010, -217695, -242928, -48613, -200372, -219137, -86903, 14082, 48459, -153122, -199779, -279944, -392963, -291645, -86706, 141931, 290144, 319600, 332547, 69331, 10644, 86464, 121348, 204240, 198632, 361710, 388047, 77140, -28179, 14918, -145189, -279169, -287748, -398635, -373401, -334582, -313756, -334444, -412760, -343532, -427281, -232963, -101527, -126048, -218856, -71440, 104471, -56876, -248849, -229109, -64980, -57075, -145421, -314974, -298453, -242263, -205717, -208452, -272826, -362362, -357867, -364707, -295268, -142192, -100279, 1502, 28217, -295945]
16407b95945O3237J84310j32037j36031J46050J5421m1914k08924J54387j53366
16397d04812j50335k2356K58693K39059N7268R6628K01825j32688j31303j64544
16387a52565K70696k17156j75921j60747K04580M01354K29993J29953q5291n0839
16377C94057k5428k29299j84805j04880J62316K90717R4482j72438j35909j986
16367H6827K10909l9666J8006k64498l9896j08791M3257J37177j15209K6684m6370
16356i1570J25424p0913j7324Q5457J91O5670n1350j39586K8429r5465K08968
16345D7931J49452m269l8782j07586j57912l14549l39199J39113M80419K17268
16335G1886n8505Q5335J12808m852j6680j11383j28098K5421j06038L0829R9605
$$ y = [-295945, -232708, -48398, -180435, -316466, -170416, -154995, -196909, -405833, -251446, -404812, -555147, -577503, -318810, -79751, -22483, 74145, 275970, 143282, 11979, -152565, 118131, -99025, -274946, -435693, -231113, 170241, 400234, 530187, 444896, 394057, 368629, 139330, -45475, -150355, 11961, 302678, 397160, 224722, 88813, 86827, 297736, 258070, 276076, 11578, -28318, -137109, -93852, 43325, -71884, -45200, -91570, 33854, -37059, -54383, 31074, 31265, 96935, 45585, -94001, -65572, -161037, 47931, 197383, 193114, 154332, 46746, -111166, -425715, -764914, -625801, -145382, 71886, 13381, 98716, 211524, 206672, 189992, 78609, -49489, -24068, -130106, -99277, 328]
16324C28j45373J31952M4083j39974o9648J65792J94990j02660p9437j7663j69699
16313a87309J92562N0407L0601j91549Q1291K04553p6500K0952K7009m7738L3966
16302A38245m084j55135j86269J31126l3399k31756j8959N5982j34271J06233
16292c32287k2098R9859O2110j57369j15936M9621K67482N5327o4583O1716r753
16281a05911J76244L4833L9906l731k66447q4155J11490k25631j78919J29627
16271c72694j1480R2141k9022K79632J20637m0613K1304P6632O4483K2092j79101
16260D4011j30975n966Q7251J46664K0019P7348j21297j64875k73680J72159P3376
16249g5965P8482j91558j76022p9745J98432M4350J16549q931k011o8385k5990
$$ y = [328, -145045, -13093, 30990, -108984, -178632, -12840, 182150, 79490, 53, -17610, -187309, 5253, 55660, 86261, -105288, -23997, 180556, 104056, 125008, 152017, 104279, 138245, 134161, -20974, -207243, -76117, -109516, -341272, -360231, -304249, -438520, -332287, -354385, -254526, -192416, -349785, -465721, -416100, -148618, -93291, -157874, -96158, -105911, 70333, 105166, 145072, 141341, -125106, -209261, -97771, -323402, -502321, -372694, -384174, -292033, -321055, -41423, 79214, 38601, 59905, 136537, 201020, 223112, 44011, -86964, -92930, -5679, 140985, 161004, 238352, 117055, -47820, -321500, -149341, -75965, 2517, -189041, -365063, -444808, -246376, -202026, -85477, -94408, -96419, -164804, -190794]
16238a90794n7020j67376J30709K58986l3443j50110j9971J95571r5324P3520
16228e5252J96441k08196k13109M8680J33009K19772r0613L7434p912Q9419j24391
16217B5282O9889K6245q1057k4409N0709p9804j23795J05873p1125j87431k05162
16206d94785J12649p3913j86489J57311M47491O1938o7650J60938l2569r6025
16196a1104J94557O8704K1642j535r0097P0593p1398n135o6580j64878j52467
16185b07698q9512J44762J72894j26282k6097Q0867J05870o4060K23153J26573
16175C40470j98570K76838j21252k10866j57862J09148k6653k1225k2153l2131
16165f4256Q1528K9027l7805k20591j03456r2144K08653J03143j8064j0475J00763
$$ y = [-190794, -247814, -415190, -284481, -25495, -58938, -209048, -229019, -33448, -128772, -55252, 141189, -67007, -280116, -231436, -98427, 121345, 30732, 68166, 60254, 149673, 25282, 95171, 121416, 40359, 15950, 66659, -13145, -136940, -31067, -102192, -289623, -494785, -382136, -456049, -642538, -485227, -37736, 24202, -43448, 117490, 84921, -11104, 183453, 252157, 273799, 272264, 182167, 252760, 181362, 176227, 109647, -55231, -207698, -297210, -152448, 20446, -105836, -131933, -51066, 54804, -9256, 213897, 340470, 141900, 418738, 297486, 86620, -71242, 37906, 11253, -9972, -32125, -64256, 17272, 46299, 8494, -212097, -315553, -407697, -199044, -95901, -113965, -124440, -23677]
16154b3677J12118K3772n1469o9297j28396m318J94505J64280j19664m86626k3935
16143d12707K45059o4361L1340M66911L49208m9410k86132k56723p8755K37518
16133A81948m1958p3518P7616J45759o047J2637O849l1263k67594k98871J57534
16122a36908O8752l41Q1491J91575l24578j40880J52778l442j8708j82715L1355
16111b81621K40143L06095l7389q0546M1058O713J37896j6072l31854j28422m3896
16100a87895K0832M53487J29577k90677j83338P9076l4613J1169r110L8630K21965
16089B49103J88260l07682k28986J5282k36294L9163K06347q6330M459O7556Q7199
16078a923j18223k2658j47419k5178j2641n1909j87032j81471M7578K2997K76853
$$ y = [-23677, 88441, 112213, 60744, -8553, -136949, -141267, 53238, 217518, 97854, -388772, -412707, -167648, -232009, -200669, 266242, 615450, 566040, 279908, 23185, -55570, 181948, 139990, 66472, 144088, 289847, 283800, 296437, 303286, 272023, 4429, -294442, -136908, -68156, -68497, 12994, 204569, -120009, -260889, -108111, -111553, -130261, -312976, -281621, -41478, 264617, 227228, 146682, 187740, 194453, 332349, 316277, -15577, -143999, -187895, -167063, 286424, 416001, 125324, -58014, 21062, -13551, -2382, -11492, 27138, 249103, 437363, 129681, -99305, -84023, -320317, -281154, -74807, -161137, -156678, -89122, -1923, -120146, -142804, -290223, -315401, -328042, -379951, -566983, -748454, -700876, -677879, -401026]
16067d01026K40422Q5072J78874J23323k63265L7990Q7219j11592J27675j8445
16057H6247j52029j78961M6286M5630J14487J82433J92306j46558j25719K1827
16047H5949j13465j75732J7221L8087K39938J1358q6806J75443M258j91384k01158
16036a96291L9947L4193J8752P0729R4838J7474l70204j7534K51546J72129J69724
16025B85303N7j11111L6126P659k01352j0247J68876j71756p7941J22965J9969
16014F8548o8299k0966K75206k10909N754K91839p5614R2895q7288K7645L294
16003C02105k12534K1321K27387j41685r9439J38498J0890j64861j60946O0020
15993a9244Q3724J29762J7199r3954k37437o2385M0337M5491J13912Q4625J31664
$$ y = [-401026, -160604, -75532, 103342, 226665, -36600, 1390, 88609, -22983, 104692, 86247, -65782, -244743, -198457, -152827, -38340, 144093, 336399, 189841, 64122, 85949, -27516, -203248, -186027, -147940, 91998, 103356, 16550, 191993, 196251, 4867, -196291, -156344, -122151, -103399, -32670, 62168, 79642, -290562, -308096, -56550, 115579, 285303, 285360, 174249, 210375, 218034, 16682, 6435, 175311, 3555, -74386, 48579, 68548, 249, -20717, 254489, 43580, 49334, 341173, 265559, 358454, 271166, 298811, 302105, 89571, 110892, 338279, 196594, 97155, 235653, 246543, 81682, -79264, -19244, 64480, 194242, 211441, 117487, -119950, -182335, -141998, -96507, 17405, 102030, 233694]
15982B33694n5891j72983O8795P7192o1816k0201K17177L126j30801j8593M7390
15971A87089K0436p1613N9488j25763q1575J0604L3920J53167M8829k87410J27495
15960G4667J00323j02108j63193K42384R4604m0228k43281P5667j40412j04254
15950b05831K70872K34123J82289j97572k92998j30443K15028M05213n2676J6943
15940D44948J7138R5661o2966k56214j71456O0147J11592J56627r1834l5567O5809
15929C33885o9321j34229L0006Q2495m0102J01929m9825q8756m6027P1429m9669
15918A41815Q1992j93710j18076r4877K36996o1609J15542L4336k25570n5116
15908a38277N9992Q2696J25446n6893k8046K8119o4681Q1872j02598O9302j07367
$$ y = [233694, 177803, 4820, 73615, 150807, 88991, 68790, 285967, 289093, 158292, 139699, 187089, 207525, 135912, 195400, 69637, -11938, -1334, 32586, 185753, 234582, -52828, 74667, 174990, 72882, -90311, 152073, 246677, 206449, -36832, 38835, -101577, -205831, 65041, 299164, 481453, 283881, -9117, -139560, 75468, 480681, 428005, 444948, 462086, 557747, 494781, 238567, 67111, 127258, 238850, 395477, 303643, 268076, 333885, 264564, 130335, 160341, 242836, 202734, 304663, 254838, 166082, 120055, 191484, 141815, 223807, 30097, -87979, -182856, 54140, -7469, 108073, 142409, -83161, -138277, -78285, 4411, 129857, 72964, 44918, 73037, 8356, 90228, -12370, 56932, -50435]
15897e0435J44505K36789L237j43562j35090J9216J20718K62544k5692k28418
15887B03812k8108N0422k65995p1276J12395L2998L38325J01923j045N437k10684
15876B68204k82011R4191Q0324J0169k78600k8174J92051J15092O4391q0532q7990
15865F7115J3556J5932J80140L01505Q1684j83653k61621N3189J44435l7070m0154
15854C35058j03612k86867j49133J45925M29032R7162k03136j38579J90532N4992
15844C71374p2997m8878l3469J44461n5772j04296Q9484K38068O0740j7831M9800
15833F20684K2449O611l67682j27169J12589R9030j23707j75746Q3293k928j88952
15822d1528o1287K64410O3115l6835j01665J07615o0434P4261j55330k31601j0292
$$ y = [-50435, 94070, 330859, 334096, 190534, 55444, 74660, 195378, 457922, 432230, 203812, 175704, 226126, -39869, -111145, 1250, 34248, 372573, 474496, 473451, 478888, 268204, -13807, 80384, 160708, 170877, -107723, -135897, 56154, 171246, 235637, 155105, 67115, 80671, 96603, 276743, 578248, 659932, 476279, 214658, 267847, 412282, 375212, 335058, 231446, -55421, -204554, -58629, 370403, 467565, 264429, 125850, 316382, 371374, 298377, 249499, 216030, 360491, 304719, 200423, 289907, 527975, 588715, 570884, 620684, 643133, 649744, 282062, 154893, 267482, 366512, 242805, 67059, 150352, 147424, -41528, -102815, 161595, 224710, 187875, 86210, 193825, 133391, 207652, 52322, -179279, -189571]
15811a89571K51467J83795j73185j22526L0199k5247N7934M5275J91779m4583
15801B05337L6786o7616j73721J2045J41826P1440j74581K3908K36179o1009j70406
15790H0188k9407j4705J61152k64484k8141J94937k158r9263j67022R6844K4768
15779d7291j90349J95725R8789l9352J06957n0103O9926J66532l1330k88128J94583
15768A85959J20007l2149Q634n5641j99706j87048Q7076P9762p7259L0587q4520
15757a24298j8575K1772J51089N8983N7183J545j6373k9115J55186N8849l0441
15746B85805J87717j57386k17970k7074J94395N6456O9298k9082K6679M2599j807
15735D29630p394j89242j38915R6380m8728M4306j31955o4008M6883M6338L8210
$$ y = [-189571, 61896, 245691, 72506, -50020, -19821, -45068, 12866, 58141, 249920, 205337, 242123, 174507, 786, 12831, 154657, 226097, 51516, 75424, 311603, 250594, 80188, 50781, 36076, 197228, -67256, -95397, 99540, 97382, -1881, -168903, -72059, -47291, -237640, -41915, 56874, 17522, 124479, 74376, 144302, 310834, 279504, -8624, 185959, 305966, 273817, 282451, 226810, 27104, -159944, -72868, 6894, -70365, -39778, -124298, -142873, -121101, 29988, 88971, 146154, 147699, 131326, 102211, 257397, 316246, 285805, 473522, 316136, 98166, 71092, 265487, 321943, 391241, 362159, 388838, 431437, 429630, 422236, 232994, 94079, 190459, 141731, 186037, 54082, -9926, 36957, 83295, 121505]
15724A21505R0607J72566K04267K5676j89159j21778m6929J21065J64118R8974
15714F40912j74156q576J30517M7564j11729j86770J9497j27409k05245Q277J89766
15703B22648N4227k6747K1232K20626j45778J56419O2221j7418j52615l32106
15693F2709m0716J40313P3223n8149n9727K8355L4879K36193J01947m5717j05392
15682C67918p2592r7577k9814R0451J7184k27014j79820K31634J52572j40736
15672A12206R9576k1988J04242k54713j85626L99097K69935j24076r9761p4805
15662B24087P6703l8534J9097K22902K5026m69908k2281L00161r015K19286J48
15651E47672n0630l50447m4155j8790Q4377M3220l18769Q0283L62866K5781J31620
$$ y = [121505, 212112, 384678, 588945, 614621, 425462, 303684, 256755, 377820, 541938, 640912, 466756, 458180, 588697, 636261, 524532, 337762, 357259, 229850, 24605, 32882, 222648, 276875, 250128, 271360, 491986, 346208, 502627, 564848, 547430, 394815, 62709, 21993, 162306, 235529, 177380, 117653, 146008, 180887, 417080, 519027, 473310, 367918, 295326, 197749, 167935, 258386, 275570, 48556, -131264, 100370, 252942, 112206, 211782, 189794, 294036, 39323, -146303, 252794, 522729, 398653, 298892, 224087, 300790, 262256, 281353, 504255, 529281, 59373, 37092, 337253, 328238, 547524, 547672, 497042, 146595, 102440, 83650, 168027, 211247, -107522, -27239, 335627, 361408, 493028]
15640D93028J5193j95143j82904O9753K51425J03921J15208J84787j6265j79297
15630F59706l67786k8399R4737J55992R78l3572k10486j42965J47764Q6747j91069
15619A71647N1741j39219q744R7498m2435K58725o6500j77640J36574K46185q9174
15608D38658l59316j32520J00646K18143m0042J33824J04379O9275n3064k78168
15598B01815R8806n7269j30491O1691M4513K15005Q3476M2268J0402j20827k61383
15587A88006M4300l7669J9426P968q2034J01169K21137J28917j28057j98234k17812
15576D7117p1647J33449M8910r0847j82319J25393K37838J69842j65091K0349
15566B72994q5379o7050J37267K31576J50674J4562n5664n0897k3997R2578j960
$$ y = [493028, 508221, 313078, 130174, 199927, 451352, 555273, 670481, 855268, 839003, 659706, 291920, 263521, 358258, 514250, 515228, 481656, 271170, 128205, 275969, 362716, 171647, 223388, 84169, 75425, 172923, 130488, 389213, 322713, 145073, 281647, 527832, 438658, 79342, -53178, 47468, 265611, 225569, 359393, 463772, 533047, 479983, 201815, 300621, 243352, 112861, 174552, 219065, 434070, 517546, 559814, 570216, 449389, 188006, 232306, 194637, 214063, 222031, 139997, 241166, 462303, 591220, 463163, 264929, 47117, -24530, 108919, 157829, 66982, -115337, 10056, 247894, 417736, 252645, 272994, 187615, 120565, 257832, 489408, 640082, 654644, 598980, 548083, 524086, 616664, 614704]
15555F14704J29653J76738N161k21182K39024M9524k66469j03269j09022L184
15545E18046q0211o7577k42650N9047L7406M06804J43789Q6654j12580k03131
15535E45597l76427l74085j60033K47507J82376j53634J32998N9322K38987J0476
15525C53084K6896j1171L54571M7998j20067J8743N821k57863K38034K29726j21556
15514G64216j23726N1137J65406N1389P688p0375K3999o8224j78280l9452l50669
15503B33109r2113J16557p2448j86900k03412K63586Q0597J33342K75195j57026
15493C90487k91493j82305j07093K31837J46976J50687k35906k7541J20505J39713
15483C35867J74711L22086K16963m504q8706M289p8779j04600P6732k14560j15888
$$ y = [614704, 744357, 921095, 926256, 705074, 944098, 993622, 727153, 623884, 514862, 518046, 437835, 370258, 127608, 186655, 224061, 630865, 774654, 861308, 748728, 545597, 169170, -204915, -364948, -117441, 64935, -88699, 44299, 103621, 342608, 353084, 379980, 368809, 723380, 771378, 651311, 670054, 675875, 418012, 656046, 885772, 764216, 640490, 691627, 857033, 908422, 916110, 845735, 869734, 801510, 623230, 583778, 233109, 140996, 257553, 185105, -1795, -205207, 58379, 138976, 272318, 547513, 390487, 98994, -83311, -190404, 41433, 188409, 339096, 103190, 75649, 196154, 335867, 510578, 832664, 1049627, 1045123, 956417, 960706, 881927, 777327, 854059, 639499, 523611]
15472E23611R5956m464j96906K9465M1272j85809j69252J11865J48228J59874
15462E53840m2835l45085J24867R3296k5092J06865L9356l0960P0256K23106J20936
15451H88550l48115K14938p1082r7727J74920J20161j12975k49645l2252o8967
15441D17806k50762P3424J75741q3113j14142L1874k61022r3548J55619K89444
15431C41321K0041n6413q076L06725q3465J50960k8939q8689m5717Q0081L6289
15420F24118k08528p7700M6289j22655n0156J55112L99676j27064l06442j53768
15410A78882J09975K66247j00908j9454j84548p8837j86803m9734L54014J99722
15400D88556Q6565m9429J29482j7369j40187N3232P4820j54815K5463J14356J58033
$$ y = [523611, 619567, 615103, 418197, 447662, 488934, 303125, 133873, 245738, 393966, 553840, 511005, 165920, 290787, 384083, 358991, 465856, 505212, 474252, 544508, 767614, 888550, 540435, 755373, 684291, 586564, 761484, 881645, 768670, 519025, 486773, 417806, 167044, 240468, 416209, 333096, 218954, 250828, -10194, -103742, 51877, 341321, 361362, 304949, 296873, 603598, 520133, 671093, 642154, 553465, 507748, 587829, 624118, 415590, 337890, 384179, 261524, 211368, 366480, 766156, 639092, 332650, 178882, 288857, 555104, 454196, 434742, 250194, 171357, -15446, -65180, 288834, 488556, 575121, 525692, 655174, 637805, 497618, 550850, 625670, 470855, 496318, 610674, 768707]
15389G68707l8611l14048l38233m32153J03932L38521K57924j35890q2599k6282
15379A01268l0941J77128k5159o8418m3632K7310Q6733j4419R2031K15372j08920
15368D08353j01742M663J48553k5073j12178k64891L48847J43244j32380j04007
15358C13389J27239J09404j15559q9227j46715j71884n6456N9716j596J4477M82
15347D3270K88572j94714l03293o297K30440J52799K14242L925q6579o0295j50478
15336A31592k34224M1790J94843K18640j08785k31763j37079J14703J51095j53709
15326a2897R4986P0095k5809K24818J26365k64131j46936j56991L3008J879K41422
15315A85809J56806l23333p6916J98756m8142J5455P4486j73409k95944K0575
$$ y = [768707, 730096, 416048, 77815, -354338, -250406, 88115, 346039, 210149, 127550, 101268, 70327, 247455, 222296, 153878, 110246, 137556, 224289, 209870, 301901, 517273, 408353, 306611, 311274, 459827, 434754, 322576, 57685, 406532, 549776, 417396, 313389, 440628, 550032, 434473, 345246, 198531, 26647, -29809, 29907, 28311, 42788, 43270, 331842, 137128, -166165, -172462, 57978, 210777, 425019, 428944, 342365, 282070, 131592, -102632, -60842, 134001, 352641, 243856, 12093, -124986, -10283, 140812, -12897, 82089, 152184, 126375, 351193, 477558, 213427, 66491, -90500, -57492, -55613, 185809, 342615, 19282, -57634, 141122, 92980, 108435, 182921, 9512, -286432, -265857]
15305b65857K7132K09228j3901n9172K6408L41N6191j01187r5814j31745m1050
15294c89426j00659J49617R3842J95663P4631j22256l5434Q0303J5716M6556J07647
15283A16200p1909j00030p2122K17484r896J32481Q1024P0920j39974n4326m5027
15272A24825j00071J9409K23176q4416j3930O6758m0755L8536J50990O586K3932
15261D15040n6373k16244l9536J23097J43864j98502q5253Q4679j46723l6300
15251a2251Q6969o5211k8877n8925Q1017J50952K35415J74570k19372n10714l0618
15240a97045j798J75113L7832o4132K50066Q892k31536j33656K7321N9509J88525
15229A19091N0618J98494o3172j69053m9698O1530K46700l24299l16784r0874
$$ y = [-265857, -238725, -29497, -43398, -102570, -76162, -75821, -19630, -120817, -216631, -348376, -389426, -490085, -340468, -246626, -50963, 23668, -98588, -134022, -53719, -38003, 8553, 116200, 44291, -55739, -127861, 89623, 79727, 212208, 293232, 364152, 224178, 169852, 124825, 24754, 44163, 267339, 182923, 168993, 235751, 194996, 233532, 384522, 391108, 415040, 358667, 142423, 102887, 225984, 369848, 171346, 86093, 170772, 24049, -12251, 74718, 9507, -19370, -78295, 2722, 153674, 389089, 563659, 344287, -166427, -197045, -198843, -23730, 14102, -50030, 200036, 208928, -22608, -156264, -128943, -69434, 119091, 169709, 368203, 305031, 135978, 86280, 147810, 394510, 70211, -246573, -337447]
15219c37447L4586J56104J81541K7505j09804J00019K76767J91739k43933r1027
15209A86050k28204j50938k7369K80421L93216J9396j55912j60611R8516O3130
15199C17695R153o8505q2704J8498l12851j03479K99802l7312P453m2901M5872
15188E0721m9646J20296Q9955l3233J13895K022p8375k23891M4292m3066m3133
15177e0163K04174N0205L0636J0012o6637o2182k9681J6215J19577N6953K21231
15166E00340j33919l57128M0617P3684j59791N0390K69270Q9350j13191k18642
15156D0980L2J71151N001j93882j42172p8100O7706M3125J33980J83463J35829
15145C67113J72056n9707K31884j20360r8802m2370k18525P5939K3590q4909J11491
$$ y = [-337447, -302861, -146757, 34784, 62289, -47515, 52504, 329271, 521010, 277077, 186050, -42154, -193092, -220461, 59960, 453176, 472572, 316660, 156049, 254565, 317695, 326848, 258343, 175639, 194137, -118714, -222193, 77609, 40297, 47750, 4849, 50721, 1075, 121371, 211326, 178093, 291988, 294010, 215635, -8256, 36036, -7030, -50163, 154011, 204216, 234852, 244864, 178227, 116045, 86364, 102579, 222156, 279109, 500340, 366421, 9293, 49910, 123594, -36197, 14193, 283463, 372813, 259622, 40980, 41012, 212163, 217164, 23282, -118890, -196990, -129284, -86159, 47821, 231284, 367113, 539169, 479462, 711346, 590986, 492184, 449814, 231289, 307228, 330818, 245909, 357400]
15134C57400O580J40630J57949K05841O7660l4001k39948J49138J38773k58306
15124F91716k09721k33788O9134j05250L77922N43119j01879p0431K40511M0853
15114A242186J9526l118J3522L2748p8226k9076L43323L00271J99792L39810O62763
15103C043521Q52901P81414P46752J443200J873880K570809L447656M828599N228661
15094B4817393N280498M864408L620143R17150j840058l177797m357605n217088
15086B4907044m664533l750978k801153j875400j132739r32433p70184l989L60685
15077I336320N63069J085649J634487K297556L286933M453183O614427R284424
15069C8556048J0950525J0520076R510115P989715L240671k676077o505134q595900
$$ y = [357400, 363980, 504610, 662559, 868400, 936060, 902059, 662111, 811249, 950022, 691716, 481995, 248207, 317341, 212091, 590013, 1133132, 1031253, 960822, 1201333, 1242186, 1261712, 1258594, 1272116, 1304864, 1226638, 1197562, 1540885, 1841156, 2040948, 2380758, 3043521, 3896422, 4677836, 5424588, 6867788, 8741668, 11312477, 14760133, 19588732, 24817393, 30097891, 34962299, 38582442, 39499592, 37659534, 34481737, 30124132, 24907044, 20242511, 16491533, 13690380, 11814980, 10682241, 9749808, 8979624, 8975635, 9336320, 9899389, 10985038, 12619525, 14917081, 18204014, 22657197, 29271624, 38556048, 49506573, 60026649, 69536764, 77526479, 80767150, 78091073, 71585939, 62990039]
15061F2990039j0106274j0478988q801634o522907m332011l196150k240850j605235
15053A5705990j135418n07431J82454N57248J333420J833846K479002L784729
15045B4233840N614098Q003044J0771089J3251425J5123156J5557465J3234081
15038A05788198Q997252L802215l124597r797414j2999369j4141528j4650639
15031F3874118j3155846r966401p101823n099776l376073k109638j360730m59298
15023B1244533J64629J085257K047143L165353M590264O486770R701952J4178909
15015F2664810J9241824K2232363K1138397J9218047J5820321N610337p357200
15008A58568899j4538053j8605818k1652759k1677589j8279704j3280005r065619
$$ y = [62990039, 52883765, 42404777, 33603143, 27080236, 22748225, 19552075, 17311225, 15705990, 14570572, 14063141, 14245595, 14802843, 16136263, 17970109, 20449111, 24233840, 29847938, 37850982, 48622071, 61873496, 76996652, 92554117, 105788198, 114785450, 118587665, 115463068, 105665654, 92666285, 78524757, 63874118, 50718272, 40751871, 33650048, 28550272, 25174199, 23064561, 21703831, 21244533, 21409162, 22494419, 24541562, 27706915, 32297179, 38783949, 48485901, 62664810, 81906634, 104138997, 125277394, 144495441, 160315762, 165926099, 158568899, 144030846, 125425028, 103772269, 82094680, 63814976, 50534971, 41469352]
15001D1469352o213414m758063l696963k546322j419591n27154J60569R06446
14993B3374860K093971L217393M781657P517315J0301265J3078950J4967297J5052012
14985I4384720J4056921R574877K594518l273299q869067j3528694j5294085j4625315
14977F5020576j3106146j0799620q135036n614531m104828l203010k127703j324480
14969A6605222r91453n45518K46364R32924J281626K496204L463505M683665P099252
14960C5271791R862987J1489658J0791085R500871P258176J762755m503664q035469
14952G3398190r660408j1219261j0882164r471583o774206m481974l098061k632765
14944A5177768j895195j310297m95962k03611j58999J22977N70460J307159K225148
$$ y = [41469352, 35255938, 30497875, 26800912, 24254590, 22834999, 22307845, 22468414, 23374860, 25468831, 28686224, 33467881, 40985196, 51286461, 64365411, 79332708, 94384720, 108441641, 118016518, 120611036, 117337737, 108468670, 94939976, 79645891, 65020576, 51914430, 41114810, 32979774, 27365243, 23260415, 20057405, 17929702, 16605222, 15613769, 15068251, 15314615, 16247539, 17529165, 20025369, 23488874, 28172539, 35271791, 45134778, 56624436, 67415521, 76916392, 84174568, 85937323, 81433659, 73398190, 63737782, 52518521, 41636357, 32164774, 25390568, 20908594, 17810533, 15177768, 13282573, 11972276, 11476314, 11272703, 11113704, 11236681, 11807141, 13114300, 15339448]
14935A5339448L061656M351661N321052N005278M442169L663874J592323j610802
14927D1166659l468221m610565n357451n496228m979749l780724k714371j952138
14919H807212j412091r39862q63702r50486n76122l85758l27083l08329m99236
14910B544543k02744k89640n7403J77902j3851k26564l30542j08662m7032r2194
14900A353813j1062J16176J01565k73207j37484j57446j26603r2317o0524k51530
14890D61381k6104L02537P9771M8040l3598J21597m0245N0481k93915j56624P9851
14879E93172p6888k01912m0623K63704J88918J33481k90747j8798M7688Q3755
14869F81750L3418j61130j40546j19089l171J66144J24363L4021o9870j03138
$$ y = [15339448, 18401104, 22752765, 28073817, 33079095, 37521264, 41185138, 42777461, 41166659, 37698438, 33087873, 27730422, 22234194, 17254445, 13473721, 10759350, 8807212, 7395121, 6455259, 5591557, 4641071, 4064949, 3679191, 3352108, 3043779, 2544543, 2341799, 2052159, 1994756, 2172658, 2158807, 1932243, 1601701, 1493039, 1446007, 1353813, 1342751, 1458927, 1560492, 1287285, 1149801, 992355, 865752, 773435, 712911, 461381, 435277, 737814, 817585, 865625, 832027, 953624, 913379, 963860, 669945, 513321, 593172, 516284, 314372, 273749, 537453, 726371, 859852, 569105, 550307, 597995, 681750, 715168, 554038, 413492, 294403, 291232, 457376, 581739, 615760, 545890, 442752]
14859D42752K26758J04849l3024l4730O5843j68279L2244j36162k65511J44542
14849C79282R0219r1788J7711Q704m5816r1569K7987l2292q555L1263L0657m3981
14837B71822J34391q096L7652j23081j88699K40468K01407m5747j07713k18284
14827A94120j51222o7250M7386J11039R0487K48508K9020j25452p646J18943J69477
14816F57410p0444j34090J67217K73741P670j40483k58077k22068r7525k29860
14806d6509L456J41920P8566P2139M4321J25409k11695r5011l4490j3308J43749
14795B08547K5143j56554n0496J284K08567P9429j95993j6870Q3539m5405j71391
14784c0200N4736P5564J12204K0313J99763K80352K7498n4825j02538j21966J40649
$$ y = [442752, 669510, 774359, 741335, 706605, 772448, 604169, 636413, 500251, 234740, 379282, 469501, 377713, 395424, 404128, 358312, 266743, 294730, 262438, 253883, 285146, 315803, 271822, 406213, 398117, 435769, 312688, 123989, 364457, 565864, 520117, 412404, 194120, 42898, -24352, 23034, 134073, 224560, 473068, 502088, 376636, 368990, 487933, 657410, 586966, 452876, 620093, 893834, 901504, 761021, 502944, 280876, 183351, -46509, -43053, 98867, 177433, 249572, 293893, 419302, 207607, 112596, 78106, 64798, 208547, 233690, 77136, 26640, 27924, 236491, 315920, 119927, 103057, 186596, 141191, -30200, 24536, 100100, 212304, 232617, 432380, 712732, 740230, 685405, 582867, 460901, 601550]
14773F01550k87563l28211p5604j1697J13873R6648J00598M9576j12983j21479
14763B4708j418K1529q6128m1681J36449n1441L83080K77244j34510k70159J35299
14752C92972L441k41367l3914M530L94519J52612P7230m4150j91979k61528j69285
14741H3081l5327J18875L8850j17916m7072J14542j03102k58435M2508J97464
14731C3468J98405R4557L4808J03451j2053j18398J3132K2373K09964p7529k44860
14720B57318k09111J8651J35175k29712j73164K49536O4927p8674n5565J27816
14710A07197J7290m0255j1133M3772j46814K53430k3784j70064j44181j29909
14700b44451L7165L15947J47020k19318m18835K9442L40859J77300Q093L0205
$$ y = [601550, 313987, -14224, -89828, -101525, 12348, 108996, 209594, 259170, 146187, 24708, 23290, 44819, -41309, -82990, 53459, 2018, 385098, 662342, 527832, 257673, 392972, 396413, 155046, 121132, 125662, 520181, 672793, 750023, 705873, 513894, 252366, 83081, 47754, 166629, 205479, 87563, 40491, 155033, 51931, -206504, -163996, 33468, 231873, 326430, 361238, 464689, 452636, 334238, 347370, 369743, 579707, 502178, 257318, 48207, 66858, 202033, -27679, -200843, 48693, 113620, 34946, -20619, 107197, 124487, 84232, 73099, 116871, -29943, 223487, 199703, 29639, -114542, -244451, -207286, 108661, 255681, 36363, -382472, -353030, -12171, 165129, 173222, 203427]
14690B03427L37493L1550p6430l61287k36556j01757K68700l3630N3526J77790
14680B62826j54380n8205K5327o2017j81673m5570M8240L37694K15306j73023
14670B14525q5371J56342k20610J039K18815K78272J55922k94325m8487R914o7531
14659C18505p6468j99021N4743M9882q5714j29315j6842K9560J23869p5359J08456
14648A02296k2579Q727j28063j47731j60705O7598M62285J47391J26601L2578
14638D88398j47749m06938j48146J76816j3349j88325J1327o7922q8501J29272
14628b55117K34916R4347P1669J66743J15435k6503k92409l47960J66112M05202
14618C32435M9813j1817j03948j59603J01014k1469l8241J7428M2782j98081j66648
$$ y = [203427, 540920, 572470, 496040, 134753, -101803, -203560, 65140, 31510, 85036, 262826, 108446, 50241, 75568, 13551, -168122, -213692, -165452, 172242, 387548, 214525, 129154, 285496, 64886, 65925, 284740, 563012, 718934, 424609, 376122, 386036, 318505, 242037, 43016, 97759, 147641, 61927, -67388, -84230, -54670, 69199, -6160, 102296, 79717, 88444, -39619, -187350, -348055, -280457, 181828, 329219, 455820, 488398, 340649, -66289, -214435, -37619, -50968, -239293, -227966, -295888, -384389, -255117, -20201, 74146, 145815, 312558, 427993, 401490, 109081, -238879, -72767, 332435, 382248, 370431, 266483, 106880, 207894, 186425, 148184, 165612, 208394, 10313, -156335]
14607a56335M5268Q4969o1772K34725J81325M8750k1738k4819n3326p5605j82189
14596A9253P3548J99338Q4402k001o3731K49844K57296J89474q5823q8061j39767
14585F93772p1666O1849p7885j79185J12112J69939j04528k5089N8097k97344
14575C40072j14618N9211M4209j45132j30077k2930j27760P1380J10970p633J83798
14564B61490K18288P8335K67932k6522l31081j19902j40163j47814K10308J58831
14554D29702j31985K9722k41634n1082j8877j7555p4492J71488J37911m628J678
14543B30248m8615L97934J07167J5285R9944j5162j40605j8526K95780K41700
14533A165150J17683J67793J7849m10095j46808j26499n05040m0079N9078j20368
$$ y = [-156335, -111067, -26098, -87870, 146855, 328180, 376930, 355192, 330373, 277047, 201442, 19253, 92801, 292139, 376541, 374540, 310809, 560653, 817949, 1007423, 921600, 833539, 693772, 622106, 683955, 606070, 426885, 538997, 708936, 604408, 579319, 637416, 340072, 225454, 284665, 328874, 183742, 53665, 30735, -97025, -25645, 85325, 77692, 261490, 479778, 558113, 826045, 799523, 468442, 348540, 208377, 60563, 270871, 429702, 297717, 327439, 85805, 34723, 15846, -1709, -76201, 95287, 233198, 228570, 230248, 181633, 579567, 686734, 702019, 801963, 786801, 646196, 627670, 923450, 1165150, 1282833, 1450626, 1468475, 1058380, 911572, 785073, 280033, 239954, 299032, 178664]
14523A78664j60382K17071k1014j27830J46090N5263k47751j29719L13819K72844
14513D97055J1663J18268l14521R987L91979J58426R3297J4561j12910j29263
14503G38542o6024k82572j49370k3579J86699R9998r1599j82050j16177N4420
14493A68288K0339j87789j3873J25334M992j47357q2700J69455K04162j39595
14483A21256k47949J03738L43613M60014O3446j81353k03945j88629j12684r3822
14473F3685R9345O7598o895R3012L459k2946O2955j12454m7989k3169n1408j06673
14461A8520m2819k7273J54371J18832j57398n9754J38420j42707j2941L43709
14451C30960j05664j87022n7872j41559p3579L46796N67176J63942j11033k69415
$$ y = [178664, 18282, 235353, 214339, 86509, 232599, 287862, 40111, -89608, 224211, 497055, 508718, 626986, 312465, 322452, 714431, 872857, 966154, 980715, 867805, 738542, 672518, 389946, 240576, 216997, 403696, 503694, 412095, 230045, 113868, 168288, 188627, 838, -13035, 112299, 117291, -30066, -112766, 56689, 260851, 121256, -126693, -22955, 320658, 780672, 844118, 662765, 458820, 270191, 157507, 63685, 163030, 230628, 223733, 316745, 320204, 297258, 360213, 247759, 199770, 176601, 125193, 18520, -24299, -51572, 102799, 221631, 64233, 4479, 142899, 192, -12749, 330960, 225296, 38274, -19598, -161157, -234736, 112060, 679236, 843178, 732145, 462730]
14441D62730k08817k16166M2528o1960k8999l75360q5763K3956L40596P0733j01334
14430a37856J67049K8544k86256M9094K7721J298j29816j35007K04101K81121
14420F9993J47607l2327R5924Q2037j10933j02905m07811j87083K41174K3724
14410a80600m8745o4761j1656J99465L31928L7783m6483l6782k03357p3818J52355
14399E5329K9894J15977N2295k16958k37596K42631J27676J89493J97485J58389
14389G14615j06928k21593j68520K4911j83133l00323q7909J53549R7157j03961
14379a82135k49865J20574o5786k43557r3911J33660L35957J07178Q3907k7644
14369h1622L9109L8102J53699N8254k13087j28028M0891o176j60388j11527J26658
$$ y = [462730, 253913, 37747, 80275, 18315, -10684, -386044, -471807, -447851, -107255, -36522, -137856, 29193, 57737, -228519, -179425, -151704, -150406, -280222, -415229, -211128, 69993, 217600, 185273, 281197, 363234, 252301, 149396, -258415, -445498, -204324, -180600, -229345, -294106, -305762, -106297, 225631, 263414, 216931, 180149, -23208, -97026, 55329, 85223, 201200, 253495, 36537, -201059, 41572, 169248, 358741, 556226, 714615, 607687, 386094, 217574, 242485, 59352, -240971, -328880, -175331, -78174, -182135, -432000, -311426, -377212, -620769, -714680, -581020, -245063, -137885, -53978, -81622, -42513, -4411, 149288, 207542, -5545, -133573, -92682, -98858, -259246, -370773, -244115]
14358b44115J42079K37323j20860N981k6979K13577Q015o1024r4775j94461K7883
14347a07356L8843p300J2958j53268l8073R713j3095k34748j24991K08221K39306
14336a69790K87774J81807J87836j04946k41240j84700J792N224J10760J64052
14326B38569j8753j70286k88979J78104J59065q2223K5575k98689j43320l325
14316d04262J32182O5651k4472q4907Q8766K30321j3393J4658j36160Q6613K06986
14305A61983R3377o9399j63764O9592j72867j71246M8874J68645o207q1182O1544
14294f0650q7420J26025N7516j59615K8280Q8144M8448N6915k17120K7465J40816
14283D8804j74186k25189j21424J82539J9212J93459r6156Q7027j29862l5819
$$ y = [-244115, -102036, 135287, 14427, 20408, -6571, 207006, 215021, 153997, 59222, -135239, -107356, -68513, -75813, -62855, -216123, -254196, -244483, -257578, -492326, -617317, -409096, -169790, 117984, 299791, 487627, 382681, 141441, -43259, -41467, -36243, 74517, 238569, 219816, 49530, -239449, -61345, 97720, 15497, 41072, -257617, -400937, -404262, -272080, -206429, -230901, -315808, -227042, 3279, -10114, 4544, -131616, -45003, 161983, 255360, 185961, 22197, 91789, -81078, -252324, -203450, -34805, -41012, -122194, -60650, -148070, -22045, 35471, -124144, -95864, -7720, 40728, 97643, -119477, -92012, 48804, -125382, -350571, -471995, -289456, -270244, -76785, -172941, -85914, -215776, -251595]
14273b51595l7405J77928O442n4382j35519q8800N2008M9396L5067o5649o8147
14262c80656K06004J00667K5894K82513Q2816L5220j63803Q4850j89020l55196
14252b70711j63332o212J94060J83501K7668J01178J84295J14364j03370J1353
14242B72794N935j16515M6402q932j94975j43976m8803J13317O5511J8040J81717
14231A90515K711q8470k91979j88372j05569j2224Q3354K14576k5836m4677L10759
14220D4788J07934k81242k2381K31137J97348j26225l16251J05026J5249P9326
14210C4709J43766O4394j38997l415K6223J3803o5005L2433J92236j16995j05478
14199G7674p3432N6261K00765j00285k55382n5362l38m9530k36345J24217J08621
$$ y = [-251595, -289000, -111072, -104630, -159012, -294531, -383331, -331323, -281927, -246860, -312509, -380656, -174652, -73985, -48091, 234422, 317238, 352458, 188655, 273505, 84485, -270711, -434043, -440255, -246195, -62694, -35026, 66152, 250447, 364811, 261441, 272794, 278729, 162214, 208616, 199684, 4709, -139267, -188070, -74753, -9242, 8798, 190515, 193226, 104756, -187223, -375595, -481164, -493388, -410034, -195458, -221294, -265971, 44788, 152722, -128520, -150901, 80236, 277584, 151359, -164892, -59866, -44617, 34709, 178475, 242869, 103872, 100457, 126680, 140483, 75478, 107911, 300147, 183152, 77674, 4242, 60503, 261268, 160983, -94399, -149761, -150099, -199629, -435974, -311757, -203136]
14188b03136J05328J7779K22765N4201k2612K4746j33670j94741l03585p2099
14178e05024r4632J67424J93269N6061j86278K20099R169k49249n2327J14205
14168c27283j32083o0564J27713K07395M5680O2153j52556K37689J03818l4946
14158G7016k17790k62926J59234J9992j34144J61295K98064r1544j00116K4205
14148f6714o7917k90350p0745N0331q5799K69612K08226K41166l5227J7520k07869
14137c7766j91020M4438p5466p1588k9779q0977j24761L0610K25743L9791K38548
14126c2227J51487l3914J7641J40357j56057j72036p6472J62253K35840j58633
14116G8239p573k00256J76453j0791j27724q2539K614Q7042n352q665J05949K7608
$$ y = [-203136, -97808, -80029, 142736, 196937, 174325, 199071, 65401, -129340, -432925, -505024, -599656, -432232, -238963, -182902, -369180, -149081, -139912, -389161, -441488, -327283, -459366, -519930, -392217, -184822, -139142, -76989, -229545, 8144, 111962, 77016, -140774, -403700, -244466, -224474, -358618, -197323, 100741, 9197, -90919, -66714, -134631, -424981, -495726, -445395, -531194, -261582, -53356, 187810, 152583, 170103, -37766, -228786, -184348, -259814, -331402, -361181, -442158, -566919, -536309, -310566, -270775, -32227, 119260, 85346, 102987, 243344, 87287, -84749, -161221, 1032, 236872, 78239, 70666, -129590, 46863, 36072, -91652, -174191, -171577, -84535, -89887, -98552, 7397, 35005]
14104C5005j21617L883O7398J89762J11710j1284l52740j50361K47169J23556
14094A42481k44066N6210O4260j49529j69437k3181J06246R5382K17882k00290
14084a04042j80590J08578k9003j01253O1021J20888j10463L4882M5875K5510
14074a28597Q0747k02484K7564P5422j18600j80320O6322J97280J80272J44788
14064A42394j91995k75036l7108J85791O840o225P4790j10081p3760J58609R9145
14053b6636j1171J35936J57464j10928Q8699L4117l35080j25115J79711L9013
14043B6010P9071k26070l0277N8856M5523L6137M4068Q9385r7183l5943j7954
14032b8377J60087l13442q9608P6952m6290L9074j4175O0074J09617J01452J75495
$$ y = [35005, -86612, -82729, -15331, 174431, 286141, 274857, -77883, -228244, 18925, 142481, -101585, -45375, 18885, -130644, -300081, -323262, -217016, -121634, 96248, -104042, -284632, -176054, -205057, -306310, -245289, -124401, -234864, -199982, -154107, -128597, -47850, -250334, -222770, -147348, -265948, -446268, -379946, -182666, -2394, 142394, -49601, -324637, -361745, -175954, -169114, -175339, -100549, -210630, -284390, -125781, -26636, -37807, 98129, 255593, 144665, 233364, 267481, -67599, -192714, -13003, 26010, 105081, -120989, -151266, -92410, -46887, -10750, 33318, 122703, 25520, -10423, -28377, 131710, -181732, -271340, -194388, -240678, -201604, -215779, -155705, -46088, 55364, 230859]
14021B30859n6262k01326P4439r505m4809j60392O7403j4074k7509K00945j7800
14010D1969j88970K42653J17220J44641k8019j27132j34721Q3938m7575r019m2878
13999E2107k04535r6164O9954o1242p4753o7734Q6091N0843J08628j1515l9719
13988a88039j50646M0483j8720j04511j57407k0199J68048J74991P0807Q4547
13978a00646J41593j11807j5084J51108K04372j22122j33346N4995K374j91754
13968a20317j77436L3473J48446J26211j73204J81621P7195k6478l17211J0992
13958b36708J77497k03150o7517O2112O1509q5930j67241n8915J28529J47648
13948b42166R5162l8773j10476J74333J15445j10477j12377O2235Q8960n9455
$$ y = [230859, 174597, -26729, 47710, 38205, -6604, -166996, -99593, -113667, -141176, 59769, 41969, -147001, 95652, 212872, 357513, 329494, 202362, 67641, 151579, 104004, 94985, 52107, -152428, -248592, -178638, -239880, -314633, -382367, -296276, -245433, -136805, -148320, -188039, -338685, -298202, -316922, -421433, -578840, -599039, -430991, -256000, -185193, -100646, 40947, -70860, -85944, 65164, 269536, 147414, 14068, 69063, 71437, -120317, -297753, -264280, -115834, 10377, -162827, 18794, 95989, 69511, -247700, -236708, -59211, -262361, -329878, -267766, -206257, -292187, -459428, -518343, -389814, -242166, -147004, -185777, -296253, -121920, -6475, -116952, -229329, -167094, -78134, -137589]
13938a37589L17326J67959j85985j75016J06074K36701Q4122j55729j1604l0887
13928B15372k54665j83898l41694o7658K99497K22997R6393j54167m7156J10319
13918a04660J20636M2179q3604m1859p205J09415o2402N2357J86468k03899k91401
13907b83975j04938K7969P841J87579L5581k3605j07550J85902J20241j40041
13897i4996j62209j74931O5429K89211M5186n2324k07058j24484P8556P484J24332
13886b05804L8279P8328J21534m5192O2273N5030j15362J77787j07886j63304
13876a04317j92266k0050l0277J01101J5896J50033J25712k01921N2475j17139
13866b20753r7935J7237J19748j22701j48214Q1961Q4177p5914J14022K2266k60273
$$ y = [-137589, 179737, 347696, 161711, -13305, 92769, 329470, 413592, 257863, 246259, 215372, -39293, -223191, -564885, -632543, -333046, -110049, -13656, -167823, -214979, -104660, 15976, 58155, -25449, -67308, -74513, 34902, -27500, 24857, 211325, 7426, -283975, -388913, -360944, -353103, -165524, -129943, -153548, -261098, -75196, 45045, -94996, -257205, -432136, -366707, -77496, -32310, -84634, -291692, -416176, -337620, -330136, -205804, -167525, -89197, 32337, -12855, 49418, 104448, -10914, 166873, 58987, -104317, -296583, -316633, -346910, -245809, -229913, -79880, 45832, -156089, -103614, -220753, -318688, -301451, -181703, -304404, -452618, -370657, -286480, -362394, -248372, -226106, -486379]
13855d86379J18764j41182r5033J83194L93545K13822j03300j58685Q502L9360
13845b7392o8411j7736k88547m8622l9160l9962K37685K75209j9589j15327J56882
13834E030o6826m2717J50878M6461j59611r2152K5035j25978P8300J2905K52832
13823H4157Q0510M4152P7802N9429j07832j77704l53794q4667k4716L89791L73282
13812C60410j6539k47370l02837l5651Q4707m270j24075M7966K32886j01824j52023
13801b58620k23476Q5082M36787J41887j69010j07454P871L47924j13671q9294
13791E8026O3058J03111M3921J6093j10020n2645M3090j37829j04249o0463k63512
13780d01419j8296q84O7218p887j39758j6342K2215n4411J84997J29013j18685
$$ y = [-486379, -367615, -508797, -603830, -420636, -27091, 186731, 83431, -75254, -66752, -27392, -95803, -113539, -402086, -450708, -489868, -529830, -292145, -16936, -36525, -151852, 5030, -61796, -104513, 46365, 92826, -66785, -158937, -133902, -259880, -181580, -168675, 84157, 164667, 208819, 286621, 346050, 238218, 60514, -293280, -377947, -402663, -12872, 360410, 343871, 96501, -206336, -241987, -157280, -161550, -285625, -237659, -4773, -106597, -258620, -482096, -397014, 39773, 181660, 12650, -94804, -86933, 260991, 147320, 58026, 121084, 224195, 268116, 284209, 174189, 121544, 164634, 26805, -77444, -137907, -401419, -419715, -420599, -353381, -361268, -501026, -517368, -495153, -549564, -364567, -235554, -354239]
13769c54239P3137Q319j74835j26648J01507J10626Q7963Q7038J26661P2533O1520
13758G3582J34676M9497k05173j42325R0957Q2543p765L3999j0763L5542J33151
13747B67921N7631q7087O6592k52170l10286o3118L04452R2885K919k57752k37169
13736d15182J23544L31783N4043m40528k5062J74902j09689q3171M7922j63203
13726e04641j07317J51466J67937J58958j01475q3000J74534Q5849k28133L0528
13716b55294j16742j37291K71151J91306K88989l8292k1434K30379N6997k78501
13706A91268k28053l1640J2382r5812j52898j31137L27077J37836L0560J10016
13696A69599J7716m2514j0607j80790k11294J95145p6598o2630P8492L0038p5949
$$ y = [-354239, -281102, -272783, -447618, -574266, -472759, -362133, -274170, -187132, -60471, 12062, 73582, 208258, 257755, 52582, -89743, 1214, 83757, 75992, 109991, 99228, 134770, 267921, 325552, 238465, 305057, 52887, -257399, -320517, -16065, 76820, 79739, -178013, -415182, -291638, 40145, 94188, -346340, -371402, -196500, -306189, -389360, -341438, -504641, -611958, -460492, -292555, -133597, -235072, -318072, -143538, -57689, -285822, -255294, -372036, -509327, -238176, -46870, 242119, 203827, 182393, 412772, 469769, 191268, -36785, -68425, -56043, -151855, -304753, -435890, -108813, 29023, 59583, 169599, 187315, 144801, 134194, -46596, -257890, -62745, -139343, -201973, -123481, -93443, -169392]
13685a69392n1643j1395L9971N9159k5476j53107m338K6459k04534N7797J76248
13674b60251K25733J69686o434k98160r4133J26655K64636J9181n2790j42533
13664d8410J41257K779l88067M9728J13065j44596L1006j75033R1639J92951j69135
13653c02816j3422J92741n3731P2806j28040j40221j4182J97397K17780k8185
13643A27j49173O6014J03907J12269N0237j26759k22853J48085K77211N9417j70861
13632A47621q5421l5795K128J03074l10415p2288j4405k1574J23734K28993n2893
13621A2759m07853K6743J33840n7457J07434K93636k73j88363r7973L4141l6146
13610a79512j19086j36301J76626J84087l7314K7180j67901o3281J93706J21887
$$ y = [-169392, -221035, -232430, -192459, -133300, -158776, -311883, -316221, -289762, -494296, -436499, -260251, -34518, 135168, 128734, -169426, -263559, -136904, 127732, 146913, 94123, -48410, 92847, 95626, -292441, -242713, -129648, -274244, -243238, -418271, -326632, -133681, -302816, -316238, -123497, -177228, -104422, -232462, -372683, -386865, -189468, 28312, 127, -149046, -83032, 20875, 133144, 183381, 56622, -166231, -18146, 259065, 318482, 147621, 62200, 26405, 28533, 131607, -178808, -251096, -265501, -287075, -163341, 65652, 12759, -395094, -368351, -234511, -291968, -184534, 109102, 108829, -79534, -177507, -143366, -179512, -298598, -434899, -258273, -74186, -111500, -84320, -252221, -315502, -121796, 91]
13600I1j01783l2878M1980O6066R6924Q5826o4901j9933j9788j26607j36127J14518
13588i6612J26108J01740q7300P1233k61314l40053K9092R8671J23767P1576J80
13577a62912R9426j4551k27609j87170Q9077M5198L5442J43414p2865q6569O1145
13566b77974j72425J18006K03671K3841N8466R0578j61475n0244l21052p5804
13556e64412K49125J02618K10809j58432M3991l6536J95294J56568K11963j49034
13546B61954l9651o7645j683J00202r5185R0192j35811j22828j14104l8380P6206
13535h6733P537K9895m7568J07935l4540Q8101j083j25056M2774k24149j96387
13524d39274K2184Q5024Q5234Q7404K08640o995L5230l6922K4842k56842j26846
$$ y = [91, -101692, -134570, -92590, -26524, 70400, 156226, 91325, 71392, 51604, -75003, -211130, -96612, 29496, 131236, 43936, 115169, -146145, -486198, -457106, -358435, -234668, -163092, -162912, -63486, -78037, -305646, -492816, -403739, -358541, -323099, -179685, -252550, -339119, -277974, -450399, -332393, -128722, -104881, -46415, 44163, -117312, -167556, -488608, -564412, -315287, -212669, -1860, -160292, -116301, -152837, 42457, 199025, 410988, 261954, 222303, 154658, 152975, 253177, 157992, 248184, 112373, -10455, -124559, -162939, -86733, -79196, -49301, -96869, 11066, -23474, 64627, 63544, -61512, -18738, -242887, -439274, -417090, -332066, -246832, -159428, 49212, 42217, 77447, 40525, 65367, -191475, -318321]
13513c18321J18457K0714r4301J15412L865J06641K7148k05006R9972O0541q8713
13502a53591j52199J71000K14892J4591j23419j79809k5645k9767J64992j6517
13492a15472J72054J16348O7973k32343k67113m300L28067J1103o4424j2433k09268
13481b09808j13545J2170R8768j02058q0192J53035J20414J7874J36111R1424
13471A24193k73955J95474m2694j18656q7876l748J91208P5609j14409L4393J63642
13460A43181o0963q7463J20637K0739m2481m1963N2742M5940L3925J12565k69567
13449B7292q6493J3021k28678P8483K19687j45669J40155K22400K26559J93742
13439F60499J61412j41779o5822k46824k5749K14157R365j42861p1023K5206p6280
$$ y = [-318321, -199864, -179150, -273451, -158039, -154174, -47533, -20385, -225391, -125419, -64878, -153591, -305790, -134790, 80102, 94693, -28726, -208535, -234180, -263947, -98955, -115472, 56582, 172930, 240903, 8560, -258553, -262853, 65214, 76317, 11893, -540, -209808, -323353, -311183, -212415, -314473, -394665, -241630, -121216, -103342, 32769, 124193, -149762, 45712, 3018, -115638, -203514, -207262, -16054, 59555, -54854, -20461, 143181, 82218, -5245, 115392, 136131, 93650, 51687, 104429, 150369, 184294, 296859, 27292, -59201, -46180, -274858, -196375, 23312, -122357, 17798, 240198, 466757, 660499, 821911, 680132, 614310, 367486, 341737, 555894, 565259, 422398, 351375, 376581, 300301]
13428C00301j23964j36476J92387J39783J14832n9305j65992j40601J66866J74467
13418D62298K20727j2205P3313J21872J48643R5799r3857j10089p4158n7632J39145
13407I13856M2708M2814j39023L9495o4585k91405j95043j46044J81422R4892
13397D79087j47977J4968K0659k0251O9831L19516j41536k26447m4891N1760k39879
13386A34840J9280J27199L99421Q2927j85203j47619J61383Q3452l17806j67478
13376A90396m0110l1090K57338K14920M5254O5627n2249j3549M6588L22267l02553
13365G02839j80555O7512M9709k0190l07810K01045j46745j21723N1123J9963
13355C15168Q5472J97843N473j35776j7004m0994K52016J71353L5092j46052j09862
$$ y = [300301, 176337, 39861, 232248, 372031, 486863, 427558, 261566, 120965, 287831, 462298, 683025, 670820, 744133, 866005, 1014648, 1110447, 1016590, 906501, 832343, 774711, 913856, 956564, 999378, 860355, 899850, 835265, 543860, 348817, 202773, 384195, 479087, 331110, 346078, 366737, 346486, 416317, 735833, 594297, 367850, 322959, 374719, 134840, 154120, 281319, 680740, 763667, 578464, 430845, 592228, 675680, 357874, 190396, 150286, 119196, 376534, 591454, 636708, 702335, 650086, 636537, 683125, 1005392, 702839, 522284, 589796, 639505, 619315, 311505, 512550, 365805, 244082, 295205, 315168, 400640, 598483, 603956, 468180, 451176, 410182, 662198, 833551, 868643, 722591, 612729]
13344F12729J37538P7029o7308m1440l514J82837L08535n2865J02308J91862p2846
13333A374865P9886J0701p6642j86642l11961k41491k20994N6490K37704j65049
13323E56867k75638r8052O9329l741Q9162k02748j94881J13004J8122J16384L28562
13312E16370K30952j88385M2277Q6098q0043j34570Q1J27003o5805l4348k83405
13301B16225j47261K14126N8173j90405L2698K53145N8233n2321J3839l13897
13291A42555j54643J59580L9138q8322j80644j10191N456L89946J36286r5126
13281B44035k06033J00871K8569l06782k449K13092R7510q3935j65142O7921l3456
13270d5799k9642P6937J66428k57944k65778k10039Q6767N0877O2075K18497M3702
$$ y = [612729, 750267, 827296, 759988, 718548, 715034, 897871, 1206406, 1153541, 1255849, 1447711, 1374865, 1454751, 1465452, 1388810, 1202168, 890207, 648716, 427722, 484212, 721916, 556867, 281229, 183177, 252506, 248765, 337927, 135179, -59702, 53302, 71424, 187808, 516370, 747322, 558937, 601214, 687312, 607269, 472699, 472780, 599783, 533978, 499630, 216225, 68964, 283090, 341263, 150858, 183556, 436701, 494934, 442613, 456452, 142555, -12088, 147492, 186630, 98308, -82336, -192527, -187071, 202875, 339161, 244035, 38002, 138873, 167442, -139340, -141789, 71303, 168813, 84878, -80264, -12343, -45799, -75441, 1496, 167924, -90020, -355798, -565837, -479070, -428193, -366118, -147621, -103919]
13259a03919j98678j57411L04769J56154q0138J812R3320o1434J19661M3837j33797
13248a5824k34299J95381M4186j49144k08100Q8093K02803J50310K19511j3961
13238B78956j17419k93700K20956j9747l3151m6189j03284j43624l1465j81669
13228d70336l559j91805R3062Q3357R2225O6645J21588j99305l1716r242r6135
13217e45221L70255K81808P3492j45j13625J04041L8707q1586O9987p9893N9007
13206A76827p042r8620j34653J15308j51618j15553J21075K72735j51220M6839
13196G4078j12873l03710O3999N2100J73757K733K2312j02265K54405k05702j06373
13185a87539J19711r1278j79320k62930M3369L96700K61895j3685J56191R5208
$$ y = [-103919, -302597, -460008, -155239, 915, -79223, -77411, 15909, -45525, 74136, 117973, -15824, -250123, -54742, -10556, -159700, -367800, -279707, -76904, 73406, 292917, 278956, 161537, -132163, 88793, 69046, 35895, -10294, -113578, -257202, -288667, -470336, -473895, -665700, -572638, -489281, -397056, -330411, -208823, -408128, -439844, -449086, -545221, -174966, 106842, 180334, 180189, 66564, 170605, 209312, 127726, 197713, 117820, 176827, 169785, 71165, -63488, 51820, -99798, -215351, -94276, 178459, 27239, 74078, -38795, -342505, -278506, -226406, -52649, -49916, -27604, -129869, 124536, -81166, -187539, -67828, -159106, -338426, -601356, -557987, -161287, 100608, 86923, 243114, 338322]
13175C38322n9114k1604k13003j0523p4456N2067J00784J43970J0976R198J8107
13164B94724k502J7655Q143J14003j22822k71824n3367J28163K97294q3725k52528
13153G3214n7487J11993K9522l4411j5056J1036O0195n2339j36741L355j45090
13142a51809j40396J19916J34455J25436P8328R0270p6355p2891M340J72714J08069
13131C92077l4573j40348k39182J1887K7270j28598K1102M09531J29132j97382
13121B50916k66459j54579L38129J08179j11479O6106K0668r4933K40291K18851
13111F15690j3778j5020q9811L3603q8413m4718J32224j37885J2878K0159J82619
13100F07548k7844l26703q2666K02471r3538q7714M2664P935n9211M8722n7703
$$ y = [338322, 279208, 257604, 44601, 34078, -40378, 11689, 112473, 256443, 267419, 276617, 294724, 292222, 309877, 318020, 432023, 309201, 37377, -15990, 112173, 409467, 325742, 73214, 15727, 127720, 157242, 122831, 107775, 118811, 179006, 126667, -10074, -6719, -151809, -292205, -172289, -37834, 87602, 165930, 256200, 179845, 106954, 111294, 284008, 392077, 357504, 217156, -22026, -10139, 17131, -111467, -90365, 319166, 448298, 250916, -15543, -170122, 168007, 276186, 164707, 230813, 251481, 156548, 396839, 615690, 601912, 586892, 497081, 530684, 442271, 397553, 529777, 391892, 404770, 424929, 607548, 579704, 253001, 170335, 372806, 279268, 191554, 234218, 242153, 182942, 231664, 173961]
13089A73961r3633J64077r7413j9525Q5813M5990J28738M1214j70703O1809m7748
13078B72580l42307O8364R4262L4693K68926K72968Q0937o0525l92274J5172O9901
13067C82697r9218j91011J3002K5366k37727m7555J04459K49493R4270J19865
13057D13641M2496P9614j74873q9693q6035R1043J68897L7133J70369k5494R3939
13046G21037k2224m9232j53951j14897K22870N4962k8584O0942R2611L38201J75366
13035A297101L0998l06783k90251M2o9819l0988K71545K65723K65129K8577L4
13024A461308R0043j18696j60235k03148K06546P8179Q4097o4302m9734N60564
13014A884622M95922N057K27821L64841K83948L79571M82109J01681J83503K16038
$$ y = [173961, 80328, 244405, 146992, 127467, 213280, 259270, 388008, 429222, 258519, 320328, 272580, -69727, -1363, 92899, 127592, 396518, 669486, 750423, 689898, 297624, 312796, 382697, 283479, 92468, 105470, 130836, -106891, -154446, -49987, 199506, 293776, 413641, 456137, 535751, 360878, 271185, 185150, 276193, 445090, 482223, 652592, 627098, 721037, 698813, 649581, 495630, 380733, 603603, 658565, 629981, 690923, 783534, 1121735, 1297101, 1328099, 1021316, 731065, 731107, 661288, 630300, 901845, 1167568, 1432697, 1461274, 1461308, 1551351, 1432655, 1272420, 1069272, 1275818, 1353997, 1438094, 1373792, 1324058, 1884622, 2380544, 2385601, 2613422, 2978263, 3262211, 3641782, 4123891, 4225572, 4409075, 4625113]
13004D625113K00579K60699L00955l1705L97360P51299R95015J325050J684979
12995A0509344J770946K187802K749689L737231M628651O222050R091046J2050351
12987E2947110J3978876J3658213J1730791R729892P258850L075983j214471m695106
12979A06470138o533474p996475r495334j0879562j0618878r355437p473232n652577
12971C8465169l387487j571921j77817J240664K141162L218689N058481O966348
12963E1953288R785294J3081604J5809544J7658987J7853289J7019728J6740697
12956A59902431J5588538J1338705N957317J885674k198999p408687j1635996
12949A73428983j2920300j3074476j3035959j2701120j2018944j0750444j0599482
$$ y = [4625113, 4825692, 5086391, 5387346, 5355641, 5753001, 6504300, 7499315, 8824365, 10509344, 12280290, 14468092, 17217781, 20955012, 25583663, 31805713, 40896759, 52947110, 66925986, 80584199, 92314990, 102044882, 109303732, 112379715, 111165244, 106470138, 99936664, 91940189, 82444855, 71565293, 60946415, 51590978, 44117746, 38465169, 35077682, 33505761, 33327944, 34568608, 36709770, 39928459, 44986940, 51953288, 61738582, 74820186, 90629730, 108288717, 126142006, 143161734, 159902431, 175490969, 186829674, 192786991, 194672665, 192473666, 185064979, 173428983, 160508683, 147434207, 134398248, 121697128, 109678184, 98927740, 88328258]
12942H8328258j0941117j0581953r175706p132463m676470k722036r76541P59135
12934D2881107K343142L812099N982724P791610R159939R575209R142486Q802587
12926I9490903P840572O342656M185363J954797K37680r90035l164145n022057
12918A10875734m577016k727286p17936J621919L594175N109918P205261Q066243
12910A28451012P072451N383735L556516J419719j748637n381508q163170r967743
12902A20622375j1207995j1661642j1556615j0812699r072451p215985m965523
12895E4129465k844222m09348J827797M049549O450572R385138J2239811J3384256
12887I8213018J3245696J3281829J4299303J5804225J7144443J7897550J8691077
$$ y = [88328258, 77387141, 66805188, 57629482, 50497019, 45820549, 43098513, 42121972, 42881107, 45224249, 49036348, 55019072, 62810682, 71970621, 81545830, 90688316, 99490903, 107331475, 113674131, 117859494, 119814291, 120051971, 119061936, 115897791, 110875734, 106298718, 103571432, 102853496, 104475415, 108069590, 113179508, 120384769, 128451012, 135523463, 140907198, 144463714, 145883433, 144134796, 138753288, 130590118, 120622375, 109414380, 97752738, 86196123, 75383424, 66310973, 59094988, 54129465, 51285243, 50875895, 52703692, 56753241, 63203813, 72588951, 84828762, 98213018, 111458714, 124740543, 139039846, 154844071, 171988514, 189886064, 208577141]
12880B08577141J8510585J4491041P104411J059571k978645r012041j5470323
12873B22281740j8452017j9703196k1659065k3111086k2162974j8900648j5253770
12866H3038984j1753062q916266o641140m775783l268527j530923M26675K392874
12858D8972832N009340P812140J0407855J2729214J3793804J3266646J2085311
12851A24077142J0824570Q944202N682889R32153m120705q610963j2673307j6541554
12843A08514427j8671660j7664813j4852809j1161295p919434n691070m430854
12836B8122492l623331l144002l025878k615165j803771j320271r89630r83391
12828A0617053p84001n09966o15654l72928m74247l94190k71106l54984k95075
$$ y = [208577141, 227087726, 241578767, 248683178, 249742749, 246764104, 237752063, 222281740, 203829723, 184126527, 162467462, 139356376, 117193402, 98292754, 83038984, 71285922, 62369656, 55728516, 50952733, 47684206, 46153283, 46579958, 48972832, 53982172, 61794312, 72202167, 84931381, 98725185, 111991831, 124077142, 134901712, 143845914, 149528803, 150460956, 146340251, 137729288, 125055981, 108514427, 89842767, 72177954, 57325145, 46163850, 38244416, 32553346, 28122492, 24499161, 21355159, 18329281, 15714116, 13910345, 12590074, 11600444, 10617053, 9833052, 9323086, 8707432, 8334504, 7860257, 7466067, 7194961, 6839977, 6544902]
12819F544902k39464k61200k09120k66886l05295k08006k34112l94401p04218
12810C722200m91439K7839j72520q4467l4880P6116l13747l1558q9945j11666
12800B495933j67494m40765j19748j1812p4351J00932J35027j43611k84108j85624
12790A304379m9319R8439J18811R6166K97796J35830J07771j16011N5446K03755
12780B253063J58223J68474L48497r6962l69758j73259j87167l77754l04414R1668
12770A510611L03508k17001k68976M15k39177L49453L84525M94955L54271Q104
12760B680688j5950m4710k62572K2510J7833k47863m44508k15838j73151n9074
12750A257365l7832j08194J11428J97645J56434l7617j81452M7607O8633j10398
$$ y = [6544902, 6305438, 6044238, 5835118, 5568232, 5262937, 5054931, 4820819, 4426418, 3722200, 3230761, 3258600, 3086080, 3001613, 2966733, 3042849, 2729102, 2697544, 2607599, 2495933, 2328439, 1887674, 1767926, 1756114, 1681763, 1782695, 1917722, 1774111, 1490003, 1304379, 1255060, 1353499, 1472310, 1568476, 1866272, 2002102, 2109873, 1993862, 2049308, 2253063, 2411286, 2579760, 2928257, 2831295, 2461537, 2288278, 2101111, 1723357, 1418943, 1510611, 1814119, 1597118, 1328142, 1328557, 1089380, 1438833, 1823358, 2318313, 2672584, 2680688, 2664738, 2620028, 2357456, 2379966, 2397799, 2149936, 1705428, 1489590, 1316439, 1257365, 1219533, 1111339, 1222767, 1420412, 1576846, 1539229, 1357777, 1405384, 1474017, 1363619]
12740A363619J46274R3031j88254j05192l55243k16749p9575l7235m0209O5969
12730F46436J79282j44514k25483q8317L19053K16113J86050j556R0634r6253
12720A081445l57025j7939K27354J61150p1319j95346j5618J21885J47472O9553
12710A151612O2292p7919n7589n6466q9369K38013J33653J64309r7657l27317
12700A043562k35257q4651J55415Q0028O824k68272k95408J01456J81801J00332
12690G85830l0229m137K06506L00904N9354K3055M2952k5811j39889l52583m054
12679H61898j39595q9016J33081Q5309r5171n7296o5727K52343p132n6377l2524
12668G89793j46615j59723P8916j25130p6763o8215k22894r0732l2368J89417
$$ y = [1363619, 1509893, 1602924, 1414670, 1309478, 954235, 737486, 657911, 620676, 580467, 646436, 825718, 681204, 455721, 367404, 686457, 902570, 1088620, 1087064, 1177698, 1081445, 724420, 706481, 933835, 1094985, 1023666, 828320, 812702, 934587, 1082059, 1151612, 1213904, 1135985, 1078396, 1021930, 932561, 1170574, 1304227, 1468536, 1370879, 1043562, 808305, 723654, 879069, 959097, 965921, 697649, 402241, 503697, 685498, 785830, 755601, 751464, 957970, 1258874, 1318228, 1341283, 1384235, 1358424, 1218535, 865952, 861898, 722303, 633287, 766368, 851677, 756506, 699210, 633483, 885826, 878694, 822317, 789793, 643178, 483455, 562371, 437241, 360478, 292263, 69369, -21363, -53731, 135686]
12658A35686J94142o9463J03484J18181j60633j11407J20728j81743L4776J84945
12648C68696P8541j6242q6677Q2772j96732m467N3789k3022N0929L0845K67647
12637F06079q8847J067l03700k38497J11333K49751Q4227J49669O2292k3120R586
12626F19840k1268k32409O09J2867k46947o8718J05829J2294l84274P3371K81879
12615A53073m9625j52878p9871K31702R9879j55992o4853J68469J67316k8884
12605B88336N3027k06219j55572J27178J23953J30810K29805k2288O190J16234
12595F91454j36291j27537j60374j21919O8131O1873J16984K06230J06291k29819
12585D75023j30749Q6602J21069J73539j35884l20686n0669N157j57851J55575
$$ y = [135686, 329828, 260365, 363849, 482030, 321397, 209990, 330718, 148975, 183751, 368696, 447237, 430995, 344318, 427090, 230358, 225891, 279680, 256658, 307587, 338432, 606079, 517232, 518299, 214599, -23898, 87435, 337186, 421413, 571082, 633374, 610254, 619840, 598572, 366163, 366772, 379639, 132692, 63974, 169803, 182097, -202177, -128806, 153073, 103448, -49430, -129301, 102401, 202280, 46288, -18565, 149904, 317220, 288336, 341363, 135144, -20428, 106750, 230703, 361513, 591318, 569030, 575220, 691454, 555163, 427626, 267252, 145333, 213464, 275337, 392321, 598551, 704842, 475023, 344274, 430876, 551945, 725484, 589600, 268914, 218245, 223402, 65551, 221126]
12575B21126L01092J47809Q610r0174j32415K5920n2779J94569L8224n8765j11080
12564D92137M0055N2174L772j94332N5761K76863M6766j68028R2782L2146k2146
12553G07950l1456j162L9816Q231j45395K2677r3082O9104J02914k52618m8088
12542C78891n321q225J698O0104o16n66K8731m5680K0832p0974K6037K77072J85264
12529H47247j9173k25730L9726R6656O1536k71219j1068K23147K98867J44355
12519A184344j26432j87587P348K07866l5622L5769L26786r1678k66447k05635
12509H48712j30910j91646j18742J61977L13883K14634k59550k91948J49002J91491
12499H86903M2512J1000J77152K93686k78849j80791o171l54416M5447L65132
$$ y = [221126, 522218, 670027, 678637, 588463, 456048, 481968, 429189, 623758, 661982, 603217, 492137, 532192, 584366, 588138, 393806, 449567, 726430, 773196, 605168, 697950, 730096, 707950, 676494, 675332, 715148, 723379, 577984, 600661, 507579, 576683, 679597, 426979, 378891, 373570, 365345, 367043, 427147, 426531, 425965, 454696, 409016, 429848, 358874, 384911, 661983, 847247, 828074, 602344, 642070, 738726, 800262, 529043, 517975, 741122, 1039989, 1184344, 1057912, 870325, 877673, 1085539, 1049917, 1085686, 1412472, 1320794, 1054347, 848712, 717802, 526156, 407414, 569391, 883274, 1097908, 838358, 546410, 695412, 886903, 929415, 940415, 1117567, 1411253, 1132404, 951613, 945442, 591026, 636473, 1001605]
12489A001605O1349P42q2307p2269M8853j38501M1855o9066k46983L4113J08079
12478F87470J26222J74272J8558k64135j01444j04064r6768L96290J93814J40902
12468A171117j14360n7657J02878M8685J19891j60735n7521K75465R9211j11916
12458A315058r9463q56l6807j2522J15474p969J6835O5869J75769Q4111k18500
12447A396999J87035J12830Q1411J32338j8047j14570K5297L16952L1401r4829
12437B056817k2744K4766Q670j1342K51606j33111p6001N3642K01684K32685N2536
12426B639208J33282P5213K45158J54913O6962J02842L09173N04956M74953M06027
12416E112687K79028M22410N10266N92850R48358P75729Q32080J204609J224612
$$ y = [1001605, 1062954, 1063696, 981389, 909120, 957973, 819472, 861327, 792261, 545278, 579391, 687470, 813692, 987964, 1006522, 742387, 640943, 536879, 440111, 836401, 1030215, 1171117, 1056757, 999100, 1101978, 1150663, 1270554, 1109819, 1052298, 1327763, 1426974, 1315058, 1215595, 1214739, 1177932, 1165410, 1280884, 1272915, 1289750, 1355619, 1531388, 1615499, 1396999, 1584034, 1696864, 1778275, 1910613, 1892566, 1777996, 1803293, 2120245, 2151646, 2056817, 2034073, 2058839, 2067509, 2056167, 2307773, 2174662, 2098661, 2152303, 2353987, 2586672, 2639208, 2772490, 2847703, 3092861, 3247774, 3314736, 3417578, 3726751, 4231707, 4706660, 5112687, 5391715, 5814125, 6324391, 6917241, 7865599, 8641328, 9473408, 10678017, 11902629]
12407A1902629J058634J374201J979870K182880K757987L598080M415895N540187
12399C4810363P835815J1412232J6201117K2535895K8454580L1261639K8207329
12392A80718970J7265709j573514j9758757k9348423k8977782k3750844j6965703
12385G7609656j1625767p339243l699770n16428L333918P078040J0808447J4941436
12377I0590289J8840639K3224252K5905661K2539465J1521030l051075j6317951
12370A73252310k3481688k5092019k3473555k0320000j6262675j1941839r051180
12363D3629354o908911m677627l694979k600424j973937j860431j355761o48309
$$ y = [11902629, 12961263, 14335464, 16315334, 18498214, 21256201, 24854281, 29270176, 34810363, 42646178, 54058410, 70259527, 92795422, 121250002, 152511641, 180718970, 197984679, 196411165, 176652408, 147303985, 118326203, 94575359, 77609656, 65983889, 58644646, 54944876, 54428448, 57762366, 64840406, 75648853, 90590289, 109430928, 132655180, 158560841, 181100306, 192621336, 189570261, 173252310, 149770622, 124678603, 101205048, 80885048, 64622373, 52680534, 43629354, 36720443, 32042816, 28347837, 25747413, 23773476, 21913045, 20557284, 19908975]
$$ [...]
##END NTUPLES=NMR SPECTRUM
##END=
