##TITLE=Analysis number 326534
Compound Code cc 59413
Book Reference 494/118
Project Code adrs
Chemist Name craigr
##JCAMPDX= 6.0         $$ Bruker NMR JCAMP-DX V2.0
##DATA TYPE= NMR SPECTRUM
##DATA CLASS= NTUPLES
##ORIGIN= Bruker BioSpin GmbH
##OWNER= nmr
$$ XWIN-NMR		Version 3.5
$$ Mon Feb 12 09:19:55 2007 GMT Standard Time (UT+0h)  MAYBRIDGE\nmr@NMR_250MHZ
##.OBSERVE FREQUENCY= 250.131544655141
##.OBSERVE NUCLEUS= ^1H
##.ACQUISITION MODE= SIMULTANEOUS (DQD)
##.ACQUISITION SCHEME= undefined
##.AVERAGES= 16
##.DIGITISER RES= 18
##SPECTROMETER/DATA SYSTEM= dpx250
##.PULSE SEQUENCE= zg30
##.SOLVENT NAME= CDCl3
##.SHIFT REFERENCE= (INTERNAL, CDCl3, 0, 16.522)
##AUDIT TRAIL= $$ (NUMBER, WHEN, WHO, WHERE, WHAT)
$$ ##TITLE= Audit trail, XWIN-NMR		Version 3.5
$$ ##JCAMPDX= 5.01
$$ ##ORIGIN= Bruker BioSpin GmbH
$$ ##OWNER= nmr
$$ C:\u/data/dgb/nmr/ADRS/690/pdata/1/auditp.txt
$$ ##AUDIT TRAIL=  $$ (NUMBER, WHEN, WHO, WHERE, WHAT)
(   1,<2007-02-12 09:19:32.09 +000>,<MAYBRIDGE\nmr>,<NMR_250MHZ>,
      <created by zg, POWCHK disabled, PULCHK disabled
       configuration hash MD5:
       49 4B E0 1D 92 C2 6B 37 9F E6 65 BC 52 41 86 1D
       data hash MD5: 64K
       FA FF 77 9A 4C 29 37 FD E6 2C 9C A0 C7 AB 35 70>)
(   2,<2007-02-12 09:19:46.28 +000>,<MAYBRIDGE\nmr>,<NMR_250MHZ>,
      <Start of raw data processing
       ef LB = 0.3 FT_mod = 6 PKNL = 1 SI = 32K 
       data hash MD5: 32K
       35 C4 EA AD A3 CF 33 69 02 44 FA 66 94 E7 E8 E4>)
(   3,<2007-02-12 09:19:47.97 +000>,<MAYBRIDGE\nmr>,<NMR_250MHZ>,
      <apk 
       data hash MD5: 32K
       EC A5 B6 B8 40 27 B9 A2 EA D9 06 16 D4 34 34 0F>)
(   4,<2007-02-12 09:19:48.65 +000>,<MAYBRIDGE\nmr>,<NMR_250MHZ>,
      <abs ABSG = 5 
       data hash MD5: 32K
       B1 40 4E 07 FD F5 E8 8A 4E A7 50 C3 75 83 4F 34>)
$$ ##END=
$$ 
$$ hash MD5
$$ 5F 8E 4A 9B 7B 68 5F 6A A5 0F 83 E1 96 E0 80 82
##$RELAX= 
##$RELAX= 
##$RELAX= 
##$RELAX= 
##$RELAX= 
##$RELAX= 
##$RELAX= 
$$ Bruker specific parameters
$$ --------------------------
##$DU= <C:\u>
##$EXPNO= 690
##$NAME= <ADRS>
##$PROCNO= 1
##$TYPE= <nmr>
##$USER= <dgb>
##$AMP= (0..31)
100 100 100 100 100 100 100 100 100 100 100 100 100 100 100 100 100 100 
100 100 100 100 100 100 100 100 100 100 100 100 100 100 
##$AQSEQ= 0
##$AQ_mod= 3
##$AUNM= <au_zg>
##$AUTOPOS= <41 >
##$BF1= 250.13
##$BF2= 250.13
##$BF3= 250.13
##$BF4= 250.13
##$BF5= 500.13
##$BF6= 500.13
##$BF7= 500.13
##$BF8= 500.13
##$BYTORDA= 1
##$CFDGTYP= 0
##$CFRGTYP= 5
##$CHEMSTR= <none>
##$CNST= (0..31)
1 1 145 1 1 1 1 1 1 1 1 1 1 1 1 1 1 1 1 1 1 1 1 1 1 1 1 1 1 1 1 1 
##$CPDPRG= <>
##$CPDPRG1= <>
##$CPDPRG2= <>
##$CPDPRG3= <>
##$CPDPRG4= <mlev>
##$CPDPRG5= <mlev>
##$CPDPRG6= <mlev>
##$CPDPRG7= <mlev>
##$CPDPRG8= <mlev>
##$CPDPRGB= <>
##$CPDPRGT= <>
##$D= (0..31)
0 1 0 0 0 0 0 0 0 0.06 0 0 0 0 0 0 0.0002 0 0 0 0 0 0 0 0 0 0 0 0 0 0 
0 
##$DATE= 1171271970
##$DBL= (0..7)
120 120 120 120 120 120 120 120 
##$DBP= (0..7)
150 150 150 150 150 150 150 150 
##$DBP07= 0
##$DBPNAM0= <>
##$DBPNAM1= <>
$$ [...]
##$SUBNAM7= <"">
##$SUBNAM8= <"">
##$SUBNAM9= <"">
##$SW= 20.6930455092707
##$SWIBOX= (0..15)
0 0 3 0 0 0 0 0 0 0 0 0 0 0 0 0 
##$SW_h= 5175.983436853
##$TD= 65536
##$TD0= 1
##$TE= 295.16
##$TE2= 300
##$TE3= 300
##$TEG= 300
##$TL= (0..7)
0 120 120 120 120 120 120 120 
##$TP= (0..7)
150 150 150 150 150 150 150 150 
##$TP07= 0
##$TPNAME0= <>
##$TPNAME1= <>
##$TPNAME2= <>
##$TPNAME3= <>
##$TPNAME4= <>
##$TPNAME5= <>
##$TPNAME6= <>
##$TPNAME7= <>
##$TPOAL= (0..7)
0.5 0.5 0.5 0.5 0.5 0.5 0.5 0.5 
##$TPOFFS= (0..7)
0 0 0 0 0 0 0 0 
##$TUNHIN= 0
##$TUNHOUT= 0
##$TUNXOUT= 0
##$USERA1= <user>
##$USERA2= <user>
##$USERA3= <user>
##$USERA4= <user>
##$USERA5= <user>
##$V9= 5
##$VALIST= <valist>
##$VCLIST= <CCCCCCCCCCCCCCC>
##$VD= 0
##$VDLIST= <DDDDDDDDDDDDDDD>
##$VPLIST= <PPPPPPPPPPPPPPP>
##$VTLIST= <TTTTTTTTTTTTTTT>
##$WBST= 1024
##$WBSW= 4
##$XGAIN= (0..3)
0 0 0 0 
##$XL= 0
##$YL= 0
##$YMAX_a= 274634
##$YMIN_a= -306717
##$ZGOPTNS= <>
##$ZL1= 120
##$ZL2= 120
##$ZL3= 120
##$ZL4= 120
##$ABSF1= 16.522
##$ABSF2= -4.171173
##$ABSG= 5
##$ABSL= 3
##$ALPHA= 0
##$AQORDER= 0
##$ASSFAC= 0
##$ASSFACI= 0
##$ASSFACX= 0
##$ASSWID= 0
##$AUNMP= <proc_1d>
##$AZFE= 0.1
##$AZFW= 0.1
##$BCFW= 0
##$BC_mod= 0
##$BYTORDP= 0
##$COROFFS= 0
##$CY= 12.5
##$DATMOD= 1
##$DC= 0
##$DFILT= <>
##$DTYPP= 0
##$F1P= 14.0000005364418
##$F2P= -0.99999901652339
##$FCOR= 0.5
##$FTSIZE= 32768
##$FT_mod= 6
##$GAMMA= 0
##$GB= 0
##$INTBC= 1
##$INTSCL= 1
##$ISEN= 128
##$LB= 0.3
##$LEV0= 0
##$LPBIN= 0
##$MAXI= 10000
##$MC2= 0
##$MEAN= 0
##$ME_mod= 0
##$MI= 0
##$NCOEF= 0
##$NC_proc= -3
##$NLEV= 6
##$NOISF1= 0
##$NOISF2= 0
##$NSP= 0
##$NTH_PI= 0
##$NZP= 0
##$OFFSET= 16.522
##$PC= 1
##$PHC0= 228.7819
##$PHC1= 6.258962
##$PH_mod= 1
##$PKNL= yes
##$PPARMOD= 0
##$PSCAL= 4
##$PSIGN= 0
##$REVERSE= no
##$SF= 250.13
##$SI= 32768
##$SIGF1= 0
##$SIGF2= 0
##$SINO= 400
##$SIOLD= 32768
##$SREGLST= <1H.CDCl3>
##$SSB= 0
##$STSI= 32768
##$STSR= 0
##$SW_p= 5175.98343685301
##$SYMM= 0
##$S_DEV= 0
##$TDeff= 65536
##$TDoff= 0
##$TI= <Analysis number 999999
Compound Code 99
Book Reference 9
Project Code 9>
##$TILT= no
##$TM1= 0
##$TM2= 0
##$TOPLEV= 0
##$USERP1= <user>
##$USERP2= <user>
##$USERP3= <user>
##$USERP4= <user>
##$USERP5= <user>
##$WDW= 1
##$XDIM= 32768
##$YMAX_p= 488253717
##$YMIN_p= -96482
$$ End of Bruker specific parameters
$$ ---------------------------------
##NTUPLES= NMR SPECTRUM
##VAR_NAME=  FREQUENCY,     SPECTRUM/REAL,   SPECTRUM/IMAG
##SYMBOL=    X,             R,               I
##VAR_TYPE=  INDEPENDENT,   DEPENDENT,       DEPENDENT
##VAR_FORM=  AFFN,          ASDF,            ASDF
##VAR_DIM=   32768,         32768,           32768
##UNITS=     HZ,            ARBITRARY UNITS, ARBITRARY UNITS
##FACTOR=    0.157963299565203, 1,           1
##FIRST=     4132.6476996994, 0,             0
##LAST=      -1043.33573715361, 0,           0
##MIN=       -1043.33573715361, -96482,      0
##MAX=       4132.6476996994, 488253717,     0
$$ Real data points
##PAGE= N=1
##DATA TABLE= (X++(R..R)), XYDATA
$$ [...]
16341f733l216j1674K779J3055p958j0617O526J8221J4102Q655o32L483Q99p877
$$ -6733 -9949 -21623 -18844 -5789 -13747 -24364 -17838 383 14485 23140 22508 25991 26890 19013
16327A9013J2215j2364r226j2456l693K955j2317n296J928j736J2372K38l170
$$ 19013 31228 18864 9638 -2818 -6511 -3556 -15873 -21169 -19241 -20977 -8605 -8367 -11537
16314a1537M76J798M238L627O00l615j7115O75N493J4576m412j412l406p840r57
$$ -11537 -11061 -9263 -5025 -1398 -798 -4413 -21528 -20853 -15360 -784 -5196 -6608 -10014 -17854 -18811
16299a8811M117P176L751M361Q712j2179o115J376J4537R452o582q131P11J3621
$$ -18811 -14694 -7518 -3767 594 9306 -2873 -8988 -7612 6925 16377 9795 1664 2375 15996
16285A5996l01q554j4790j9415L448R135m821O67J389p598J6867J3983m838P193
$$ 15996 15695 7141 -7649 -27064 -23616 -14481 -19302 -18635 -17246 -24844 -7977 6006 1168 8361
16271H361o267j5572j3749n769N933J6047J0109K026n072j395l876N274m219j53
$$ 8361 2094 -13478 -27227 -32996 -27063 -11016 -907 1119 -3953 -5348 -9224 -3950 -8169 -8322
16257h322J240K137Q80K212K288r605L327J912n72p439j1362j267M529J0271Q278
$$ -8322 -7082 -4945 -4065 -1853 435 -9170 -5843 -3931 -4503 -11942 -23304 -24571 -20042 -9771 -1493
16242a493q775l605J931K485n579R457R936J0507j420k197m139L089O219m421
$$ -1493 -10268 -13873 -11942 -9457 -15036 -5579 4357 14864 13444 11247 7108 10197 16416 11995
16228A1995r717j1127O728O364N414M48l516p603j1593L405N479L639l61j0357
$$ 11995 2278 -8849 -2121 4243 9657 10105 6589 -1014 -12607 -9202 -3723 -84 -445 -10802
16214a0802N852P006j526J420J3362P962k686p761J1415p881M007N686j6380j4197
$$ -10802 -4950 2056 530 1950 15312 23274 20588 12827 24242 16361 20368 26054 9674 -4523
16200d523J0838P313L4P916j033j3263m447K09R082J008j710m292j7224M828j346
$$ -4523 6315 13628 13662 21578 20545 7282 2835 3044 12126 13134 11424 7132 -10092 -5264 -6610
16185f610J1985O547j1811L633l354q044n937o745l287J942P065M052N832L2775
$$ -6610 5375 11922 111 3744 390 -7654 -13591 -20336 -23623 -21681 -14616 -10564 -4732 28043
16171B8043J146j0594o237K376q263j6578l301j429M070m537P48Q701L637N248
$$ 28043 29189 18595 12358 14734 6471 -10107 -13408 -14837 -10767 -15304 -14556 -5855 -2218 3030
16157C030r237Q740k647J3213P4o849M528K540j518m171K920K871l867l78r544
$$ 3030 -6207 2533 -114 13099 13173 6324 10852 13392 11874 7703 10623 13494 9627 9249 -295
16142b95l46n341o620q769r367K720J1056J3917Q124k173Q866O596j2343r870
$$ -295 -641 -5982 -12602 -21371 -30738 -28018 -16962 -3045 5079 2906 11772 18368 6025 -3845
16128c845j7050p855l581J59N754J3487J1880m160m953M579l810Q717J1443q913
$$ -3845 -20895 -28750 -32331 -32172 -26418 -12931 -1051 -5211 -10164 -5585 -9395 -678 10765 1852
16114A852r368N622q85m886n271r902L538R70J2469K0345m492l423J3197O96m665
$$ 1852 -7516 -1894 -2779 -7665 -12936 -22838 -19300 -18330 -5861 14484 9992 6569 19766 20462 15797
16099A5797J36j584j7970p479p994j556Q922j049L348l542K700J2567M382Q075
$$ 15797 15933 14349 -3621 -11100 -19094 -20650 -11728 -12777 -9429 -12971 -10271 2296 6678 14753
16085A4753n151j4701J729l64L682J20N390n315k2525l508L015l037j916Q799
$$ 14753 9602 -5099 -3370 -3734 -52 68 5458 143 -22382 -25890 -22875 -25912 -27828 -19029
16071a9029J0262k220r574m807n76m642J979O155J2297J3016N735j0154L999N098
$$ -19029 -8767 -10987 -20561 -25368 -25944 -30586 -28607 -22452 -10155 2861 8596 -1558 2441 7539
16057G539j0331j8225J189J0470j0189O441Q890J2754o680k954J53Q420q155j4477
$$ 7539 -2792 -21017 -19828 -9358 -19547 -13106 -4216 8538 1858 -1096 -943 7477 -678 -15155
16043a5155O260K902O688k657m941M570j819M799P320o69j776M958r209M483J4676
$$ -15155 -8895 -5993 695 -1962 -6903 -2333 -4152 647 7967 7298 5522 10480 1271 5754 20430
16028B0430r875K730K0326k284l931j189k719j0685q181j1058r025k083N838J0844
$$ 20430 10555 13285 33611 31327 27396 26207 23488 12803 4622 -6436 -15461 -17544 -11706 -862
16014h62J1261J2558j949j9891O384K918m533m723M497P468k480L27j2537j0761
$$ -862 10399 22957 21008 1117 7501 10419 5886 1163 5660 13128 10648 10975 -1562 -12323
16000a2323n627Q716j983j874N258R617k155o700n022n839j3001N625J6631M442
$$ -12323 -17950 -9234 -11217 -13091 -7833 1784 -371 -7071 -12093 -17932 -30933 -25308 -8677 -4235
15986d235o825m79Q897j482j7083Q527J4226p514N535q39K280J2576l830P925
$$ -4235 -11060 -11539 -2642 -4124 -21207 -12680 1546 -5968 -433 -1272 1008 13584 9754 17679
15972A7679n256j0132N553J5458N786p760m204l193r396j1885k229J3191P246
$$ 17679 12423 2291 7844 23302 29088 21328 17124 13931 4535 -7350 -9579 3612 10858
15959A0858m658j8020j455R589N790j1487J5121O290q162p351P638L872j306o251
$$ 10858 6200 -11820 -13275 -3686 2104 -9383 5738 12028 3866 -3485 4153 8025 6719 468
15945D68r875o954o49N261K2690O189q084k518L526k258l86J0036N653M514j3965
$$ 468 -9407 -16361 -17010 -11749 10941 17130 9046 6528 10054 7796 7410 17446 23099 27613 13648
15930A3648m041J6112m595n837j2221j5362k070J0902n996k669J0206N044L719
$$ 13648 9607 25719 21124 15287 3066 -12296 -14366 -3464 -9460 -12129 -1923 3121 6840
15917F840p385k985M277L559l071P716M102o765k167Q514N038O492J550n981m294
$$ 6840 -545 -3530 747 4306 1235 8951 13053 6288 4121 12635 17673 24165 25715 19734 15440
15902A5440n367j0726l413m812m843R908J0348l776j4595p16O639L599J3533O303
$$ 15440 10073 -653 -4066 -8878 -13721 -3813 6535 2759 -11836 -12552 -5913 -2314 11219 17522
15888A7522m38m416j7268p913J955q468L382N580Q537r70Q53n153q192J3974P991
$$ 17522 17084 12668 -4600 -12513 -10558 -19026 -15644 -10064 -1527 -2497 -1644 -6797 -14989 -1015 6976
15873F976k6079q029j575J2751j168N746j557p186M12L824Q35p79l153j0839K002
$$ 6976 -19103 -27132 -28707 -15956 -17124 -11378 -12935 -20121 -19709 -15885 -15050 -15829 -18982 -29821 -27819
15858b7819L044R666p870r267K6085M421K22J654K251n163j659o753J915p672
$$ -27819 -24775 -15109 -22979 -32246 -6161 -1740 -1518 136 2387 -2776 -4435 -11188 -9273 -16945
15844a6945P5O746k95q303N261j205m874O065K2007J7723n621O041p724j3925
$$ -16945 -16870 -10124 -10419 -18722 -13461 -14666 -19540 -13475 8532 26255 20634 26675 18951 5026
15830E026o525M864k171R391M580p757J314J333N618K151m211J0456l534o296
$$ 5026 -1499 3365 1194 10585 15165 7408 8722 10055 15673 17824 13613 24069 20535 14239
15816A4239K54j0206m038R199m652l611p175O503M851m207j0885j0723R35J4852
$$ 14239 14493 4287 249 9448 4796 1185 -5990 513 5364 1157 -9728 -20451 -19516 -4664
15802d664P546j1469j1079J843O470J8176j0861J044R73q169o324J9579J5789
$$ -4664 2882 -8587 -19666 -17823 -11353 6823 -4038 -2994 -2021 -10190 -16514 3065 18854
15789A8854j423O667J658n264m80j3109p491n433j384O845J734K337j420j881
$$ 18854 17431 24098 25756 20492 20012 6903 -588 -6021 -7405 -560 1174 3511 2091 210
15775B10k080J84k949R189m538j2532p510j1939L501J4383N770N098k304q145
$$ 210 -1870 -1686 -4635 4554 16 -12516 -20026 -31965 -28464 -14081 -8311 -3213 -5517 -13662
15761a3662J1495O98q533n920j0750o119P834l339K260J0953L033P82K772P95
$$ -13662 -2167 -1469 -10002 -15922 -26672 -32791 -24957 -28296 -26036 -15083 -12050 -11268 -8496 -7701
15747g701P498J741N131n536M480j260j2134q3J6967l524M927J6115J2826P249
$$ -7701 -203 1538 6669 1133 5613 4353 -7781 -7864 9103 5579 10506 26621 39447 46696
15733D6696r029l892L624j125k0270j1485J060K965O573k656l26M416j785p122
$$ 46696 37667 33775 37399 36274 16004 4519 5579 8544 15117 12461 12135 16551 14766 7644
15719G644n383J392p17N211O680j3278j882O693o873J2955M618r526j4081o818
$$ 7644 2261 3653 2936 8147 14827 1549 -333 6360 -513 12442 17060 7534 -6547 -13365
15705a3365M120m427N997O071R221P97j9297P797J0501l414J208O957j0146l018
$$ -13365 -9245 -13672 -7675 -1604 7617 8414 -10883 -3086 7415 4001 5209 12166 2020 -998
15691i98L521o603K795o482j0466L834J828O027M816M140P032n90o089P502p435
$$ -998 2523 -4080 -1285 -7767 -18233 -14399 -12571 -6544 -1728 2412 9444 8854 2765 10267 2832
15676B832J241J4488P999O62m602O080n465p429J455j4023j7624n949P634J4046
$$ 2832 4073 18561 26560 27222 22620 28700 23235 15806 17261 3238 -14386 -20335 -12701 1345
15662A345L290k144J662M160m152m536L189K5712J8363j137j0534p890r098n074
$$ 1345 4635 2491 4153 8313 4161 -375 2814 28526 46889 45752 35218 27328 18230 13156
15648A3156l591J798p546M23Q520o81j6701m892R811J0037q329l390j4487j6880
$$ 13156 9565 11363 3817 4240 12760 12079 -4622 -9514 297 10334 2005 -1385 -15872 -32752
15634c2752O270L454n099k70R489r902o113K3514K0775o91j469p874k748J717
$$ -32752 -26482 -23028 -28127 -28397 -18908 -28810 -34923 -11409 9366 8675 7206 -668 -3416 -1699
15620a699K619j060J5066J1480n278J639q727k117j762Q28J806n55o430K586n587
$$ -1699 920 -140 14926 26406 21128 22767 14040 11923 10161 10989 12795 12240 5810 8396 2809
15605B809J669Q85M706J9248n467P13o130m176p461J502P151O670p851k438p473
$$ 2809 4478 5363 10069 29317 23850 24563 18433 14257 6796 8298 15449 22119 14268 11830 4357
15590D357l907q431k139q2J5085J8j1911n683j4426k477j147l964j6320K0071
$$ 4357 450 -7981 -10120 -10202 4883 4901 -7010 -12693 -27119 -29596 -30743 -34707 -51027 -30956
15576c0956N906L511Q822j0465o261l453J1559J1545J4400J3219o171r457q877
$$ -30956 -25050 -21539 -12717 -23182 -29443 -32896 -21337 -9792 4608 17827 11656 2199 -6678
15563f678n36R540J318j0149j6569J3785K3302p22N315j762l837Q805j0291j6237
$$ -6678 -7214 2326 3644 -6505 -23074 -9289 14013 13291 18606 16844 13007 21812 11521 -4716
15549d716n711R757j115q843j021K891Q764N165K628r261Q401j1721j5745J5621
$$ -4716 -10427 -670 -1785 -10628 -11649 -8758 6 5171 7799 -1462 6939 -4782 -20527 -4906
15535d906m582N774J2344L723r502J72J3581k016j3163R813J920L670J269q977
$$ -4906 -9488 -3714 8630 12353 2851 3023 16604 14588 1425 11238 13158 16828 18097 9120
15521I120j1403r658J5602M795j669p547m368P63J555o657K007M313q002n854
$$ 9120 -2283 -11941 3661 8456 6787 -760 -5128 -4365 -2810 -9467 -7460 -3147 -11149 -17003
15507a7003Q502J0156J1648j2101j1371l870r145Q889J0033M560j995M048R853
$$ -17003 -8501 1655 13303 1202 -10169 -14039 -23184 -14295 -4262 298 -1697 2351 12204
15494A2204n726n809K48K823q074j1895O09R369N746J996R55p441l215k175k817
$$ 12204 6478 669 917 3740 -4334 -16229 -15620 -6251 -505 1491 2446 -4995 -8210 -10385 -13202
15479a3202r751j246R7J1139J2284J7303j0633j7035j5058K028N123J4717O365
$$ -13202 -22953 -24199 -24102 -12963 -679 16624 5991 -11044 -26102 -24074 -18951 -4234 2131
15466B131p692n899k973K2946L542r543J449N57j5897j5083r684J8991O234Q542
$$ 2131 -5561 -11460 -14433 8513 12055 2512 3961 4518 -11379 -26462 -36146 -17155 -10921 -2379
15452b379p249J808n32J296Q181r155L337P617L428k487j4154j508Q078J317o80
$$ -2379 -9628 -7820 -8352 -7056 1125 -8030 -4693 2924 6352 3865 -10289 -11797 -3719 -2402 -3082
15437c082K718n610L146N007l92J8420K199m275n425j0547n662J950O059K293
$$ -3082 -364 -5974 -2828 2179 1787 20207 22406 18131 12706 2159 -3503 -1553 4506 6799
15423F799N422l350r621L641l920p302q337N946M766L687k531O578J14j0854l566
$$ 6799 12221 8871 -750 2891 -1029 -8331 -16668 -10722 -5956 -2269 -4800 1778 1892 -8962 -12528
15408a2528Q227j4909k842J3685J4863R643k966j1682q733K312q364J2504m201
$$ -12528 -4301 -19210 -22052 -8367 6496 16139 13173 1491 -7242 -4930 -13294 -790 -4991
15395d991l463K161j502M215R2m73m142o665J4475j98k368J9519j7130q189J0379
$$ -4991 -8454 -6293 -7795 -3580 -3488 -3961 -8103 -14768 -293 -491 -2859 16660 -470 -8659 1720
15380A720J109j0550k993M506P616M586J1454o95j5557p337j1214O460J3505M567
$$ 1720 2829 -7721 -10714 -6208 1408 5994 17448 16753 1196 -6141 -17355 -10895 2610 7177
15366G177J095N650q583q297j0173K474R449k290k281M932J5517j365N969j064
$$ 7177 8272 13922 5339 -2958 -13131 -10657 -1208 -3498 -5779 -847 14670 13305 19274 18210
15352A8210n716n104P68l124r809q135M144K118j249L35L474j0734q521j782K5157
$$ 18210 12494 7390 8158 5034 -4775 -12910 -8766 -6648 -7897 -7562 -4088 -14822 -23343 -25125 32
15337C2J6106j2016k0553l113R242P331O98k123P675k748j2066N96J0582m768
$$ 32 16138 4122 -16431 -19544 -10302 -2971 -2273 -4396 3279 531 -11535 -10939 -357 -5125
15323e125J2916O070P90k269l79N116l062j568j0934p379j1680l130Q299m991
$$ -5125 7791 13861 14651 12382 12003 17119 14057 12489 1555 -5824 -17504 -20634 -12335 -17326
15309a7326P973L251p858j5293M111R409K587J0200N892j2127K055J0165K748
$$ -17326 -9353 -6102 -13960 -29253 -25142 -15733 -13146 -2946 2946 -9181 -7126 3039 5787
15296E787l581l489o678J270J085J1013j5666j8113k494K5594J0333k368o253
$$ 5787 2206 -1283 -7961 -6691 -5606 5407 -10259 -28372 -30866 -5272 5061 2693 -3560
15283c560q072N254j07k141j78j072K259K030R480j574o799N475r4k610K506M328
$$ -3560 -11632 -6378 -6485 -8626 -8804 -9876 -7617 -5587 3893 2319 -4480 995 901 -1709 797 5125
15267E125m846m176k754j1818J0850J1407n474R132J170n216l125n319j0236p113
$$ 5125 279 -3897 -6651 -18469 -7619 3788 -1686 7446 8616 3400 275 -5044 -15280 -22393
15253b2393Q331K402N317J619P844J3908j168O224J702k5135r590m574k3712L978
$$ -22393 -14062 -11660 -6343 -4724 3120 17028 15860 22084 23786 -1349 -10939 -15513 -39225 -35247
15239c5247K2693L169n134j5026P156k135r381J5078J6322k098k16Q163N395J6511
$$ -35247 -12554 -9385 -14519 -29545 -22389 -24524 -33905 -18827 -2505 -4603 -4819 3344 8739 25250
15225B5250k688k338k830l7772o279R506J3053N989O684O104K5m328j138Q181
$$ 25250 22562 20224 17394 -20378 -26657 -17151 -4098 1891 8575 14679 14704 10376 9238 17419
15211A7419m793j0011m868o289m871r35P797j422K79q062R23k128m700J441l710
$$ 17419 12626 2615 -2253 -8542 -13413 -14348 -6551 -7973 -7694 -15756 -14833 -16961 -21661 -20220 -23930
15196b3930k10R136O39N680K312l990J1140Q403M18r48k977j0036o914j408J685
$$ -23930 -24140 -15004 -14365 -8685 -6373 -10363 777 9180 9598 8650 5673 -4363 -11277 -12685 -11000
15181a1000O053R730o786o433j851q179q058Q649K3565P729q725n111k97m498
$$ -11000 -4947 4783 -2003 -8436 -10287 -18466 -26524 -17875 5690 13419 4694 -417 -714 -5212
15167e212K316p379n762J2193P825R6n178n220q155J855l212J0530J0773l909
$$ -5212 -2896 -10275 -16037 -3844 3981 4077 -1101 -6321 -14476 -12621 -15833 -5303 5470 1561
15153A561k016Q307j031r171j1651J209O449m944J687K517J0551j714k486R416
$$ 1561 -455 7852 6821 -2350 -14001 -12792 -6343 -11287 -9600 -7083 3468 1754 -732 8684
15139H684n269o16j0004K063P51l841j232l894M210K0473R121K43j5068p191n354
$$ 8684 3415 2799 -7205 -5142 -4391 -8232 -9464 -13358 -9148 11325 20446 20689 5621 -1570 -6924
15124f924p606P208k617M474L3K04K132J275j1712j928J2210M461r012j5288o277
$$ -6924 -14530 -7322 -9939 -5465 -5432 -5228 -3096 -1821 -13533 -15461 -3251 1210 -7802 -23090 -29367
15109b9367Q888M948N524J0371o285j2414P76N871K686j42o805k731J1584L647
$$ -29367 -20479 -15531 -10007 364 -5921 -18335 -17559 -11688 -9002 -9144 -15949 -18680 -7096 -3449
15095c449j4071j894j805P316M380q586o601m073K47M824J2336m094K754L320
$$ -3449 -17520 -19414 -21219 -13903 -9523 -18109 -24710 -28783 -28536 -23712 -11376 -15470 -12716 -9396
15081i396q384k284J5156j773r648l816J6162J5962j0586r702p969Q62k36J2448
$$ -9396 -17780 -20064 -4908 -6681 -16329 -20145 -3983 11979 1393 -8309 -16278 -15416 -15652 -3204
15067c204K430p276o3J780J904m227p647O392P764J809m294n526J736P608P613
$$ -3204 -774 -8050 -8113 -6333 -4429 -8656 -16303 -9911 -2147 -338 -4632 -10158 -8422 -814 6799
15052F799J2917o453j2007K367p574l257N230r065J458M90m492j592K344J4087
$$ 6799 19716 13263 1256 3623 -3951 -7208 -1978 -11043 -9585 -9095 -13587 -15179 -12835 1252
15038A252N722J1208J1378j2993j2557L867o535p088o2N818J7043L223j7804j6514
$$ 1252 6974 18182 29560 16567 4010 7877 1342 -5746 -5808 10 17053 20276 2472 -14042
15024a4042J1913o86j4927K69N396K177O47l466J4152R247j674n254p64r257o001
$$ -14042 -2129 -2815 -17742 -17473 -12077 -9900 -9253 -12719 1433 10680 9006 3752 2988 -6269 -12270
15009a2270k289j795O841J2611J4243r315o393N941K3219r860q381n817l088J8
$$ -12270 -14559 -16354 -9513 3098 17341 8026 1633 7574 30793 20933 12552 6735 3647 3665
14995C665Q587L582m499p362j675K2470J5365P56l7902k3124r60J157J110M21
$$ 3665 12252 15834 11335 3973 2298 24768 40133 40889 2987 -20137 -21097 -19940 -18830 -18409
14981a8409M009Q192M5q081r66Q485O058k415J1711p989k993n288p335J293P712
$$ -18409 -14400 -6208 -6163 -14244 -15210 -6725 -667 -3082 8629 640 -2353 -7641 -14976 -13683 -5971
14966e971M687O743L770o190j1293J619K756j84K214n151j234q971R825J2175
$$ -5971 -1284 5459 9229 3039 -8254 -6635 -3879 -4063 -1849 -7000 -8234 -17205 -7380 4795
14952D795j1989j3858N567R104o281j2039o427J467K430O038J3236n88j0053Q167
$$ 4795 -7194 -21052 -15485 -6381 -12662 -24701 -31128 -29661 -27231 -21193 -7957 -8545 -18598 -10431
14938a0431J3349j1025r264K967k064J1653Q175j5929k0323m939P827J323k809
$$ -10431 2918 -8107 -17371 -14404 -16468 -4815 3360 -12569 -32892 -37831 -30004 -28681 -31490
14925c1490J1979J389j4564K844J3925Q15L452Q982o367p511j6746L416J4067
$$ -31490 -19511 -18122 -32686 -29842 -15917 -15102 -11650 -2668 -9035 -16546 -33292 -29876 -15809
14912a5809M626m488J22k227J845N009J2740L185O033k704r110K155J6107M589
$$ -15809 -11183 -15671 -15549 -17776 -15931 -10922 1818 5003 11036 8332 -778 1377 17484 22073
14898B2073J440j0981r764J0309q829k2317j0280O636n891Q524K275j384M368
$$ 22073 23513 12532 2768 13077 4248 -18069 -28349 -21713 -27604 -19080 -16805 -18189 -13821
14885a3821q430o85J4597J5185N259n454o673M996j0567q382J4756J386J3754
$$ -13821 -22251 -22936 -8339 6846 12105 6651 -22 4974 -5593 -13975 781 2167 15921
14872A5921j5527j2973J666J5169k183j56n119O803O65L493K0009m545j1510p664
$$ 15921 394 -12579 -10913 4256 2073 1917 -3202 3601 4266 7759 27768 23223 11713 4049
14858D049M227p863M649o02o618j0886j5516p021K760J4110n91J2950J020o43
$$ 4049 8276 413 5062 4460 -2158 -13044 -28560 -35581 -32821 -18711 -19302 -6352 -5332 -5975
14844e975r452r511J933M255M960M539Q968M151r510j7280p733M772R718R835
$$ -5975 -15427 -24938 -23005 -18750 -13790 -9251 -283 3868 -5642 -22922 -30655 -25883 -16165 -6330
14830f330J1685P058J521m189N69L621j954k693J924J7280Q26j2802q830R648
$$ -6330 5355 12413 13934 9745 10314 13935 11981 9288 11212 28492 29318 16516 7686 17334
14816A7334k2591j828K673j7678k05J3593J924J5902J070r692n9R18Q218j1013
$$ 17334 -5257 -7085 -4412 -22090 -22295 -8702 -6778 9124 10194 502 443 1361 9579 -1434
14802a434o039k950q136J0363N331j379O966p754j0856o618J1551O105o025k597
$$ -1434 -7473 -10423 -18559 -8196 -2865 -4244 2722 -5032 -15888 -22506 -10955 -4850 -10875 -13472
14788a3472o669l706J0986J6329k622n630o056J97o883r529M706J98P06J7088
$$ -13472 -20141 -23847 -12861 3468 846 -4784 -10840 -10643 -17526 -27055 -22349 -22151 -21445 -4357
14774d357k522k553n124K095K594r025N421J5424Q270r481j1858P251J2654N730
$$ -4357 -6879 -9432 -14556 -12461 -9867 -18892 -13471 1953 10223 742 -11116 -3865 8789 14519
14760A4519N28n252j2247n462J918M916j1628N811k021j4196Q886l959q652p763
$$ 14519 15047 9795 -2452 -7914 -5996 -1080 -12708 -6897 -8918 -23114 -14228 -18187 -26839 -34602
14746c4602M556k686Q836J1282j470n51J0172L356N700N591j2272J556m489j2168
$$ -34602 -30046 -32732 -23896 -12614 -14084 -14635 -4463 -1107 4593 10184 -2088 -532 -5021 -17189
14732a7189m772J738J1983J1457K754J671J647j2615k712n809j0948R564J1364
$$ -17189 -21961 -20223 -8240 3217 5971 7642 9289 -3326 -6038 -11847 -22795 -13231 -1867
14719a867j1267m182Q183R51R70R570K533j0165O876J2750k883j1995j176Q113
$$ -1867 -13134 -17316 -9133 -8182 -7212 2358 4891 -5274 1602 14352 11469 -526 -1702 6411
14705F411K175q975l715L695J1358o003l82j1523j494J0859o202r178n39R06j438
$$ 6411 8586 -389 -4104 -409 10949 4946 4564 -6959 -8453 2406 -3796 -12974 -13513 -12607 -14045
14690a4045R667L906p668q336j0209n099R014J1671N875L806m999O135J0232k126
$$ -14045 -4378 -472 -8140 -16476 -26685 -31784 -22770 -11099 -5224 -1418 -6417 -282 9950 7824
14676G824j6818j2889J0594J6336N010j8122o69K0915J3332n818m605j9023r305
$$ 7824 -8994 -21883 -11289 5047 10057 -8065 -8734 12181 25513 19695 15090 -3933 -13238
14663a3238K750p918o303J237M214K323J908l296r811K674J5542J1353L804K094
$$ -13238 -10488 -18406 -24709 -23472 -19258 -16935 -15027 -18323 -28134 -25460 -9918 1435 5239 7333
14649G333l858m285J2389k224j0913o844J0831J1621M850k331r630n93j4179o787
$$ 7333 3475 -810 11579 9355 -1558 -8402 2429 14050 18900 16569 6939 6346 -7833 -14620
14635a4620n507o953M254J5925O659k705l923k519Q45J3166k738j3539Q99M228
$$ -14620 -20127 -27080 -22826 -6901 -242 -2947 -6870 -9389 -8544 4622 1884 -11655 -10756 -6528
14621f528l391m35J2903Q256j0318j252N905O681J0618L982j2603m125o717j1130
$$ -6528 -9919 -10354 2549 10805 487 -765 5140 11821 22439 26421 13818 9693 2976 -8154
14607h154Q80M082j265Q072M151l270m005l161l731l265J3517m088l570r883j1125
$$ -8154 -7274 -3192 -4457 3615 7766 4496 491 -2670 -6401 -9666 3851 -237 -3807 -13690 -24815
14592b4815p85Q895J7841k644J035L218l379O417r761j3386J1248J8192o022j5059
$$ -24815 -25600 -16705 1136 -1508 -473 2745 -634 5783 -3978 -17364 -6116 12076 6054 -9005
14578i005n272O145K793k431J84k184P921q056m512K211j012R414J62N271k656
$$ -9005 -14277 -8132 -5339 -7770 -7586 -9770 -1849 -9905 -14417 -12206 -13218 -3804 -3642 1629 -1027
14563a027r216P585L867j510N937J896j8028O095M190P014j34j4655j1423O560
$$ -1027 -10243 -2658 1209 -301 5636 7532 -10496 -4401 -211 6803 6669 -7986 -19409 -12849
14549a2849r817k40q64P432J8385L40k626k160o793K968J8936o936j4328J1376
$$ -12849 -22666 -22906 -23770 -16338 2047 2387 -239 -2399 -9192 -6224 12712 5776 -8552 2824
14535B824o589J2842l935j200L653O497J2077q688j2295o403o958l350K052l013
$$ 2824 -3765 9077 5142 3942 7595 14092 26169 17481 5186 -1217 -8175 -11525 -9473 -12486
14521a2486n864k512K063j047P612R306k97k116J424j547o005J0081K379p284
$$ -12486 -18350 -20862 -18799 -19846 -12234 -2928 -3225 -5341 -3917 -5464 -11469 -1388 991 -6293
14507f293o468O204J3595P38K499m139j50l833j9833r415J2181J2913K773k514
$$ -6293 -12761 -6557 7038 7776 10275 6136 5986 2153 -17680 -27095 -14914 -2001 772 -1742
14493a742j3779J5421O694n660N536Q384n026j5610p508j211Q83R733J0660j2550
$$ -1742 -15521 -100 6594 934 6470 14854 9828 -5782 -13290 -14501 -13618 -3885 6775 -5775
14479e775n068k979l983J4117j2230j1758J5960j661k584L944l481K544K1942
$$ -5775 -10843 -13822 -17805 -3688 -15918 -27676 -11716 -13377 -15961 -12017 -15498 -12954 8988
14466H988R582k209j1832M039k601p689M348N590L574p245o672m445j287Q260
$$ 8988 18570 16361 4529 8568 5967 -1722 2626 8216 11790 4545 -2127 -6572 -7859 401
14452D01p263m642K988R45K0546R746j4421k6104q866J1467J1545O048J2840L378
$$ 401 -6862 -11504 -8516 -7571 12975 22721 8300 -17804 -26670 -15203 -3658 2390 15230 18608
14438A8608j2362J61L486r53m245k677P533J228N022L885j2403O28l380q561o749
$$ 18608 6246 6407 9893 8940 4695 2018 9551 10779 15801 19686 7283 7911 4531 -4030 -10779
14423a0779l432J1640K871j0382o567M282R841K042O45l011O17l58N649L011m803
$$ -10779 -14211 -2571 300 -10082 -16649 -12367 -2526 -484 161 -2850 -2233 -2591 3058 6069 1266
14408A266q026J354J3121L674l924q769j7436O1M801J1049N031j6005j2785j786
$$ 1266 -6760 -5406 7715 11389 7465 -1304 -18740 -18679 -13878 -2829 2202 -13803 -26588 -28374
14394b8374J0685J8559Q734J2532j4857k0124m574K69L281M206J8699P346m878
$$ -28374 -17689 870 9604 22136 7279 -12845 -17419 -17150 -13869 -9663 9036 16382 11504
14381A1504j52K897K133p55r852j4071j860N32q425n189M466J22l972M638J327
$$ 11504 11352 14249 16382 15627 5775 -8296 -10156 -9624 -18049 -23238 -18772 -18650 -22622 -17984 -16657
14366a6657R303Q450n208j0846P836L315N111q020m813Q30J2224M743P822J5918
$$ -16657 -7354 1096 -4112 -14958 -7122 -3807 1304 -6716 -11529 -10699 1525 6268 14090 30008
14352C0008k974k3044p604J969n450N006J4598R573o95J1724J692j1382j1161
$$ 30008 27034 3990 -3614 -1645 -7095 -2089 12509 22082 21387 33111 34803 23421 12260
14339A2260j391r008r15o503M154N361o807Q202p11M848J2822p969o254p412j3818
$$ 12260 10869 1861 946 -5557 -1403 3958 -2849 5353 4642 9490 22312 14343 8089 677 -13141
14324a3141K440K0406k964j1196M615K179L793N326M561J530q963j1946p551m967
$$ -13141 -10701 9705 6741 -4455 160 2339 6132 11458 16019 17549 8586 -3360 -10911 -15878
14310a5878m554J1323k607n870J0542R132J0424J0821j4519k0391L171N035Q543
$$ -15878 -20432 -9109 -11716 -17586 -7044 2088 12512 23333 8814 -11577 -8406 -3371 5172
14297E172o345L574M865o085m370L540M380J3714m21j7352r989J5865P729r338
$$ 5172 -1173 2401 7266 1181 -3189 351 4731 18445 18024 672 -9317 6548 14277 4939
14283D939m26N473N928j0534j1117N368K43l436N943P260J44r954j847Q692N030
$$ 4939 4513 9986 15914 5380 -5737 -369 -126 -3562 2381 9641 9785 -169 -2016 6676 11706
14268A1706R171M422p488j711k261q723j0570j0067J3510K194J836Q950Q19k2342
$$ 11706 20877 25299 17811 16100 13839 5116 -5454 -15521 -2011 183 2019 10969 11788 -10554
14254a0554j1431l161Q544O770Q949J4780O546q915k6046k309J534k545l16M655
$$ -10554 -21985 -25146 -16602 -9832 -883 13897 20443 11528 -14518 -16827 -15293 -17838 -18154 -13499
14240a3499m476p506Q512K2805J3377j3326q868O216q859L798P43o91j7782q934
$$ -13499 -17975 -25481 -16969 5836 19213 5887 -2981 3235 -5624 -1826 -1083 -1774 -19556 -28490
14226b8490M875Q09P575O257P37p371J906j2597J398l998P46J8655J4178R373
$$ -28490 -23615 -22806 -15231 -8974 -8237 -15608 -13702 -26299 -24901 -28899 -28153 -9498 4680 14053
14212A4053j1812o609K674n669K205O730k908j178N200q43k576o506r498o233
$$ 14053 2241 -4368 -1694 -7363 -5158 1572 -1336 -2514 2686 1843 -733 -7239 -16737 -22970
14198b2970K52Q64N514M647J2916n559L376N987M647p395l465k053K263Q717n225
$$ -22970 -22718 -21854 -16340 -11693 1223 -4336 -960 5027 9674 2279 -1186 -3239 -976 7741 2516
14183B516j6740M438L366q670P572Q688q947n32L290R412l422q49l825l862M135
$$ 2516 -14224 -9786 -6420 -15090 -7518 1170 -7777 -8309 -5019 4393 971 122 -3703 -7565 -3430
14168c430N332k312m273j2610J3247M513j344j4651k00K13l512J6878J3968j5651
$$ -3430 1902 -410 -4683 -17293 -4046 467 -877 -15528 -15728 -15515 -19027 -2149 11819 -3832
14154c832o028n351j2334O757J8394L02J1390J751j8011j8227l019l661M621K358
$$ -3832 -9860 -15211 -27545 -20788 -2394 -2092 9298 11049 -6962 -25189 -28208 -31869 -27248 -24890
14140b4890J1819j5807O591J1694Q691J4641J842j488J830j8841m379L498j777
$$ -24890 -13071 -28878 -22287 -10593 -1902 12739 14581 13093 14923 -3918 -8297 -4799 -6576
14127f576J379P37m978N443K1776L847j1590j1798K183M329p033J0960o901j9288
$$ -6576 -5197 -4460 -9438 -3995 17781 21628 10038 -1760 423 4752 -2281 8679 1778 -17510
14113a7510p394N150J2111N050m565L84K0882J0801o90r907l039j213j19j1623
$$ -17510 -24904 -19754 -7643 -2593 -7158 -6774 14108 24909 24219 14312 11273 10060 9941 -1682
14099a682p639O997K1888Q654k0754l0732j1472J1692J3315P135L802j1870R828
$$ -1682 -9321 -2324 19564 28218 7464 -23268 -34740 -23048 -9733 -2598 1204 -10666 -838
14086h38L007L414j829j0120l737J879p50R272q987k870p137J4001j778M651K542
$$ -838 2169 5583 3754 -6366 -10103 -8224 -8974 298 -8689 -11559 -18696 -4695 -6473 -1822 720
14071G20p078j8365k902P418J5600O629K266R330l366l574j806M574k954m779
$$ 720 -6358 -24723 -27625 -20207 -4607 2022 4288 13618 10252 6678 4872 9446 6492 1713
14057A713j2703K366L584J5612R448m975k88L075j4407j2191Q88o806L531L107
$$ 1713 -10990 -8624 -5040 10572 20020 15045 14757 17832 3425 -8766 -7878 -14684 -11153 -8046
14043h046K07J1588j015j234P563J5898K151j0279k5170k0309J0511K5027J4120
$$ -8046 -7839 3749 2734 1500 9063 24961 27112 16833 -8337 -28646 -18135 6892 21012
14030B1012m144q228L111p364J500K090O659j2216k1669p684n98K492N892K942
$$ 21012 16868 8640 11751 4387 5887 7977 14636 2420 -19249 -26933 -27531 -25039 -19147 -16205
14016a6205p499m229J9552K5716j304l097l415j3805M5O625r541k5827M767L0396
$$ -16205 -23704 -27933 -8381 17335 16031 12934 9519 -4286 -4241 2384 -7157 -32984 -28217 2179
14002B179m171q1p849R76Q191M058j5145M426Q668Q767M959N477m226o042j6420
$$ 2179 -1992 -2073 -9922 -8946 -755 3303 -11842 -7416 1252 10019 14978 20455 16229 10187 -6233
13987f233j1944j4497O107M048J1524L449J0843J1358N696k1726l496o924R10
$$ -6233 -18177 -32674 -26567 -22519 -10995 -7546 3297 14655 20351 -1375 -4871 -11795 -10885
13974a0885k158j2653K100K1826Q109Q022Q64L820J6651J127L123P373J6332J763
$$ -10885 -13043 -25696 -23596 -1770 6339 14361 15225 19045 35696 36823 39946 47319 63651 65414
13960F5414M20k936k118j3438k1499n332K113O54j5161n147N677M29l352j531
$$ 65414 65834 62898 60780 47342 25843 20511 22624 23278 8117 2970 8647 9076 5724 4193
13946D193j3194j6313L154J6697J2371j1681j3949O033J2573m156m391k867K526
$$ 4193 -9001 -25314 -22160 -5463 6908 -4773 -18722 -12689 -116 -4272 -8663 -11530 -9004
13933i004R589Q301N001P883N42q80j3134j2388o416o442L696L565q231q191O43
$$ -9004 585 8886 13887 21770 22312 21432 8298 -4090 -10506 -16948 -13252 -9687 -17918 -26109 -25466
13918b5466k202J9057K1343K865l692m565K865j2098J2270K1263n970j0160p637
$$ -25466 -27668 -8611 12732 15597 11905 7340 10205 -1893 10377 31640 25670 15510 7873
13905G873p230J811m494o834O801J8971L726j5212k558Q705N463n734P161p777
$$ 7873 643 2454 -2040 -8874 -2073 16898 20624 5412 2854 11559 17022 11288 18449 10672
13891A0672j0132j8008M44J5448J4969J139p403j10J0306K647l02j1419j3874
$$ 10672 540 -17468 -17024 -1576 13393 14532 7129 7019 17325 19972 19670 8251 -5623
13878e623n077K058n838M252R397J2115K303j7185j2187L396J769P493J2962M59
$$ -5623 -10700 -8642 -14480 -10228 -831 11284 13587 -3598 -15785 -12389 -10620 -3127 9835 10294
13864A0294L206M424k185j571m414p841L372L641n517N956P671j529n99j0982
$$ 10294 13500 17924 15739 14168 9754 1913 5285 8926 3409 9365 17036 15507 14908 3926
13850C926j7898n564J6380o038J205J4116j821p560k9139J656J7504M802l560
$$ 3926 -13972 -19536 -3156 -9194 -7989 6127 4306 -3254 -32393 -30737 -13233 -8431 -11991
13837a1991K332P647J5555K554r083p782j1823j406J2443l960j6526M3P907J27
$$ -11991 -9659 -2012 13543 16097 7014 -768 -12591 -13997 -1554 -5514 -22040 -21997 -14090 -13963
13823a3963P216K759J1521K574m763L955j4008l942J1615J937l329p984j3680
$$ -13963 -6747 -3988 7533 10107 5344 9299 -4709 -8651 2964 4901 1572 -6412 -20092
13810b0092M883M396J3751J669p597J682J0110o550k007N12M668N38m695o489
$$ -20092 -15209 -10813 2938 4607 -2990 -1308 8802 2252 245 757 5425 5963 1268 -5221
13796e221r59p680j665N091R419J1461k208j956M491k335M953l266K282j0178
$$ -5221 -6180 -13860 -15525 -10434 -1015 10446 8238 6282 10773 8438 13391 10125 12407 2229
13782B229q047M934l808P168j193o856q607q8J833J4270J0851j2572Oo162l25
$$ 2229 -5818 -884 -4692 2476 1283 -5573 -14180 -14268 -12435 1835 12686 114 120 -6042 -6367
13767f367J4465k551k011l355q80O6K447k995k541j4720J0060J592r329J0007
$$ -6367 8098 5547 3536 181 -699 -633 1814 -1181 -3722 -18442 -8382 -6790 -16119 -6112
13753f112Q910J045r216o25n877n603P99j261k003L510K081m00J2612R986K295
$$ -6112 2798 3843 -5373 -5998 -11875 -17478 -16679 -17940 -19943 -16433 -14352 -14752 -2140 7846 10141
13738A0141J1583p023j3639j3050l842l301R871m265Q634J1221L65j873r573R318
$$ 10141 21724 14701 1062 -11988 -15830 -19131 -9260 -13525 -4891 6330 6695 4822 -4751 4567
13724D567l945J0074n086j2655j739n422p282q362N943P432P217o801m698k030
$$ 4567 622 10696 5610 -7045 -8784 -14206 -21488 -29850 -23907 -16475 -9258 -16059 -20757 -22787
13710b2787J3212l785j0983K0095L73k252N599k058K977p167J853J278K323j096
$$ -22787 -9575 -13360 -24343 -4248 -3875 -6127 -528 -2586 391 -6776 -4923 -3645 -1322 -2418
13696b418O123J3441j2662m867n023m409n945r19R710M822O430m910r459l023
$$ -2418 3705 17146 4484 -383 -5406 -9815 -15760 -16679 -6969 -2147 4283 -627 -10086 -13109
13682a3109m390P648P181L545l119m493k066Q507Q702k188r851l150p115L391
$$ -13109 -17499 -9851 -2670 875 -2244 -6737 -8803 -296 8406 6218 -3633 -6783 -13898 -10507
13668a0507q74j439K936J1961J9095J0789k025r986l605k1993j7513L581k112
$$ -10507 -11381 -12820 -9884 2077 21172 31961 29936 19950 16345 -5648 -23161 -19580 -21692
13655b1692K887J4406J2067Q759j5477q852k0028J2285J5526Q517j2213K124O72
$$ -21692 -18805 -4399 7668 16427 950 -7902 -27930 -15645 -119 8398 -3815 -1691 -1019
13642a019q891r644P037j618k599j1175Q823j9394O39J9679K3810N510k0617q325
$$ -1019 -9910 -19554 -12517 -14135 -16734 -27909 -19086 -38480 -37841 -18162 5648 11158 -9459 -17784
13628a7784J8954Q057r883l561j8024q918N932M51l091J4236J0023o447K690R485
$$ -17784 1170 9227 -656 -4217 -22241 -31159 -25227 -24776 -27867 -13631 -3608 -10055 -7365 2120
13614B120M89n538j667J1047J7968o612j1382P652P846J257j48j447n17J897j6044
$$ 2120 2609 -2929 -4596 6451 24419 17807 6425 14077 21923 23180 23032 21585 21068 22965 6921
13599F921k079R155l684M969k956l217M566J6277J0904j0178p462o683l015j978
$$ 6921 4842 13997 10313 15282 12326 9109 13675 29952 40856 30678 23216 16533 13518 11540
13585A1540Q909n592r019j917J545j319q361Q853j4854j6879J3995J0956J2101
$$ 11540 20449 14857 5838 3921 5466 4147 -4214 4639 -10215 -27094 -13099 -2143 9958
13572I958m67j2069l669M195M487o959n38m16N422K069L065q139r29M156L157
$$ 9958 9491 -2578 -6247 -2052 2435 -4524 -5062 -5478 -56 2013 5078 -3061 -3990 166 3323
13557C323M610M820r547K943J470J0146j938M887J391l07J53r434r455J0226L218
$$ 3323 7933 12753 3206 6149 7619 17765 15827 20714 22105 21798 21951 12517 3062 13288 16506
13542A6506o824j1597j4930n381J4339J1498l710n674K54j816P260J6385q76K864
$$ 16506 9682 -1915 -16845 -22226 -7887 3611 -99 -5773 -5519 -7335 -75 16310 15434 18298
13528A8298k884L65L507q92P99q723j1124J789j664L541L050n562m068o356J502
$$ 18298 15414 15779 19286 18394 19193 10470 -654 1135 -529 3012 6062 500 -3568 -9924 -8422
13513h422L394K438r84J0828k689N497J1668j0396Q92k61p724Q154J0901J0441
$$ -8422 -5028 -2590 -3574 7254 4565 10062 21730 11334 12226 11965 4241 12395 23296 33737
13499C3737j2865j0779O242j4274j0833J953J982o728M103m882j775K3945M886
$$ 33737 20872 10093 16335 2061 -8772 -6819 -4837 -11565 -7462 -12344 -14119 9826 14712
13486A4712j4801q344O430J910p928n833Q417J0414L231j539P566M46r025N089
$$ 14712 -89 -8433 -2003 -93 -8021 -13854 -5437 4977 8208 6669 14235 14681 5656 10745
13472A0745K711N770N522J8430j099K0O139K67R813K4265L7045K0734J2861N928
$$ 10745 13456 19226 24748 43178 42079 42099 48238 48505 58318 82583 119628 140362 153223 159151
13458A59151q239j2816l6328l1382k2368j2911n086p344j621l080N261J0906k649
$$ 159151 150912 138096 101768 70386 48018 35107 30021 22677 21056 17976 23237 34143 31494
13445C1494m664O922k106l030k137J1162L987r500j829m755K047O803j69p978
$$ 31494 26830 33752 31646 28616 26479 37641 41628 32128 30299 25544 27591 34394 34225 26247
13431B6247K2343Q395Q308r196j3320Q617J5045L2662M4271M9020L6118M0555
$$ 26247 48590 56985 65293 56097 42777 51394 66439 99101 143372 192392 228510 269065
13419B69065L6330J6068k4385m5354o5151n4201l8229j0331j0693j3910r787n718
$$ 269065 305395 321463 297078 251724 186573 132372 94143 83812 73119 59209 49422 43704
13407D3704M595p686j2331m279J1568J0250q531p423L40J5519p21j6354q851k623
$$ 43704 48299 40613 28282 24003 35571 45821 37290 29867 30207 45726 45005 28651 19800 17177
13393A7177K635K342M302Q168j24q115O0P649P545K72K715J5555M1409J9671J6149
$$ 17177 19812 22154 26456 34624 34500 26385 26445 34094 41639 41911 44626 60181 101590 121261 137410
13378A37410K4343j250j4845l4983l3000j1532p679q632j0946r006k377J152J1140
$$ 137410 161753 160503 145658 110675 77675 66143 58464 49832 38886 29880 27503 28655 39795
13365C9795p469k0874q629o624M05o796n807M875J7421J4485L793K877l307j7639
$$ 39795 32326 11452 2823 -3801 -3396 -10192 -15999 -11124 6297 20782 24575 27452 24145 6506
13351F506o587q98J1513J1174j3973j0668o369j2017O248J6382J2957J031o629
$$ 6506 -81 -979 10534 21708 7735 -2933 -9302 -21319 -15071 1311 14268 15299 8670
13338H670J768O44J0380M493m209n002L770j21j1549r170M236J48l806j4278J652
$$ 8670 10438 11082 21462 25955 21746 16744 20514 20393 8844 -326 3910 4058 252 -14026 -12374
13323a2374O195j470R639j654M553R697K529q88l260P542Q769p053n153q041Q088
$$ -12374 -6179 -7649 1990 336 4889 14586 17115 16227 12967 20509 29278 22225 17072 9031 17119
13308A7119K908L18k412q471o833j1310O009J5539j2888j159J827J0385N818M174
$$ 17119 20027 20345 17933 9462 2629 -8681 -2672 12867 -21 -1180 647 11032 16850 21024
13294B1024K061k73j8814p959K359j932N053J1501l51O572k195j0366P35j8782
$$ 21024 23085 22812 3998 -3961 -1602 -3534 1519 13020 12669 19241 17046 6680 7415 -11367
13280a1367M278J1182J3488M97n406n402j1822K860k946n030K08M433m014L949
$$ -11367 -7089 4093 17581 18078 12672 7270 -4552 -1692 -4638 -9668 -9460 -5027 -9041 -5092
13266e092J3155J9265J2578J3081j127j1454O450r959p145k844j9849r583K755
$$ -5092 8063 27328 39906 52987 51860 40406 46856 36897 29752 26908 7059 -2524 231
13253B31J567J2114O502K125m339j775m448o484O203J0549j5798k592Q728M411
$$ 231 1798 13912 20414 22539 18200 16425 11977 5493 11696 22245 6447 3855 12583 16994
13239A6994j0060K495m301m727J1456P356p191k727J4725l785M930J8458n126
$$ 16994 6934 9429 5128 401 11857 19213 12022 9295 24020 20235 25165 43623 38497
13226C8497o403J8259K6847R874N353J0729j6085k1768j9408j8081J858n802m477
$$ 38497 32094 50353 77200 87074 92427 103156 87071 65303 45895 27814 29672 23870 19393
13213A9393P863P424j286P682o385j6520m247O407k065Q988N515r049p637J3751
$$ 19393 27256 34680 33394 41076 34691 18171 13924 20331 18266 27254 32769 23720 16083 29834
13199B9834n773j3759j2579r651Q023J5112q33K093N030l225O433J1158Q089M867
$$ 29834 24061 10302 -2277 -11928 -3905 11207 10374 12467 17497 14272 20705 31863 39952 44819
13185D4819R935J2286k408n680n653R266R453m607o699K024M89n520m663m435
$$ 44819 54754 67040 64632 58952 53299 62565 72018 67411 60712 62736 63225 57705 53042 48607
13171D8607j988r47M640r606j801n822j2798N250R565p378q909j853K343O630
$$ 48607 46619 45672 50312 40706 38905 33083 20285 25535 35100 27722 18813 16960 19303 25933
13157B5933o956q044m370l272J6153M042J3559J2456L903J1621n763r040L695
$$ 25933 18977 10933 6563 3291 19444 23486 37045 49501 53404 65025 59262 50222 53917
13144E3917J7520K619N854J5987J1824O887N584k257j8614j8968j2300j3385L118
$$ 53917 71437 74056 79910 95897 107721 114608 120192 117935 99321 80353 68053 54668 57786
13131E7786m421j4477R452R914O030k193j1391J05j14o549l278M671O335j0406
$$ 57786 53365 38888 48340 58254 64284 62091 50700 50805 50691 44142 40864 45535 51870 41464
13117D1464r907L773l791O108J7884O239j680l70K1141L1562K6603L6542M7251
$$ 41464 31557 35330 31539 37647 55531 61770 60090 59720 80861 112423 139026 175568 222819
13104B22819M8234O1575O3117P8733O5037M3092L5391J4197l5040o6319r5182
$$ 222819 271053 332628 395745 474478 539515 582607 617998 632195 597155 530836 435654
13093D35654p5973o5421n4876m5568l6621j4338j7557k8560p224J1282Q62j3412
$$ 435654 359681 294260 239384 193816 157195 142857 125300 96740 89516 100798 101660 88248
13081H8248r128P458L905r429n591N331j5479j8207Q212J2479k742n931j3025
$$ 88248 79120 86578 90483 81054 75463 80794 65315 47108 55320 67799 65057 59126 46101
13068D6101o976o107M696K0981J7987K1525L653R026Q886Q033J1410J9230R469
$$ 46101 39125 33018 37714 58695 76682 98207 101860 110886 119772 127805 139215 158445 167914
13055A67914k792Q31j5596m694M070M034j1731j0736K2700K0772p667l345K0203
$$ 167914 165122 165953 150357 145663 149733 153767 142036 131300 154000 174772 167105 163760 183963
13042A83963K1981J4239J4347M0899K4011L3471L1100K2362K7799L5558M5733
$$ 183963 205944 220183 234530 275429 299440 332911 364011 386373 414172 449730 495463
13031D95463O8701P7255O8325J02405J17566J41761J54576K04803K28906K56681
$$ 495463 564164 641419 709744 812149 929715 1071476 1226052 1430855 1659761 1916442
13021A916442L38503M67167O29426R03624J298541J908525K817626M001492N215338
$$ 1916442 2254945 2722112 3351538 4255162 5553703 7462228 10279854 14281346 19496684
13012A9496684N798179M850438K087565j562046m432370n511328n022768l844095
$$ 19496684 25294863 30145301 32232866 30670820 26238450 20727122 15704354 11860259
13004A1860259k706950j866613j297612r24746o84066n16926l93937l08760k40277
$$ 11860259 9153309 7286696 5989084 5064338 4380272 3863346 3469409 3160649 2920372
12995B920372j95930j70251j47306q8124l7845L996L2070R2737J50333J88356
$$ 2920372 2724442 2554191 2406885 2318761 2280916 2284912 2316982 2409719 2560052 2748408
12985B748408K22931K67821L30386M15026M76702O60125R05324J260043J809899
$$ 2748408 2971339 3239160 3569546 3984572 4461274 5121399 6026723 7286766 9096665
12976I096665K645339L948130N910651Q564375J1327237J2678062J0629976M338997
$$ 9096665 11742004 15690134 21600785 30165160 41492397 54170459 64800435 69139432
12968F9139432m098700j0564884j2632020j1114326q192761n539452l687022k527344
$$ 69139432 65040732 54475848 41843828 30729502 22536741 16997289 13310267 10782923
12960A0782923j789448j330823j025347q00014o25627n34987m71380m11195l35916
$$ 10782923 8993475 7662652 6637305 5837291 5211664 4676677 4205297 3794102 3458186
12951C458186k62385k02254j31519q0377m4996O779J9650M1265O3394R5167J55120
$$ 3458186 3195801 2993547 2862028 2781651 2736655 2743434 2763084 2804349 2867743 2962910 3118030
12940C118030K22738L13014M49096O62052R81166J439666K119593L102125M357061
$$ 3118030 3340768 3653782 4102878 4764930 5746096 7185762 9305355 12407480 16764541
12931A6764541N551446N904486M601295J477500k404054n238051o057685n271013
$$ 16764541 22315987 28220473 32821768 34299268 31895214 26657163 20599478 15328465
12923A5328465l914160k700280j827501j280265r25839p16873n56855m34093l56915
$$ 15328465 11414305 8714025 6886524 5606259 4680420 3963547 3406692 2972599 2615684
12914B615684k99383k47301k30128j85902j67257j25783j09549r2958o9156o8047
$$ 2615684 2316301 2069000 1838872 1652970 1485713 1359930 1250381 1157423 1088267 1020220
12904A020220q2900p2734m8913m1906m2510n2002m1051m1720m1899l0431k4532
$$ 1020220 937320 864586 815673 773767 731257 679255 638204 596484 554585 524154 499622
12893D99622j3367j4326k1496j3498j2711n039m331k3466k0386k0234k0687k9599
$$ 499622 486255 471929 450433 436935 424224 419185 414854 391388 371002 350768 330081 300482
12881C00482j7118O815P553j320Q59j1718j7877m588L565j849r907j6174j3666
$$ 300482 283364 290179 297732 296412 297271 285553 267676 263088 266653 264804 254897 238723 225057
12868B25057m309Q072j0127l740m594J464L664N799n120j0793n415o09k374J2454
$$ 225057 220748 228820 218693 214953 210359 211823 215487 221286 216166 205373 199958 199349 196975 209429
12854B09429O848p565l24l849l518J0140J6899J4652N406j1756k0401l2260l8807
$$ 209429 216277 208712 208388 204539 201021 211161 228060 242712 248118 236362 215961 183701 144894
12841A44894l2792j3011L725J3035K722L723P332L36J1909O465J018m815R503
$$ 144894 112102 99091 102816 115851 118573 122296 129628 129964 141873 148338 149356 144541 154044
12828A54044J6059j1299N271k145j884L624n628j479J3295j1381j615J6504K064
$$ 154044 170103 158804 164075 161930 160046 163670 158042 156563 169858 158477 156862 173366 175430
12815A75430j5762k43M965J2017Q843K7243J1613K447K0161J6736P491l915k5358
$$ 175430 159668 159425 164390 176407 185250 212493 224106 226553 246714 263450 270941 267026 241668
12802B41668j9350j3903k4924l0124k9379k7812k2684j9750j729k632o767p846
$$ 241668 222318 208415 183491 153367 123988 96176 73492 53742 52013 49381 42614 34768
12790C4768Q338J628j478N875Q873m49r292r785J4538J5950N135k646j0999o798
$$ 34768 43106 44734 43256 49131 58004 57555 48263 38478 53016 68966 74101 71455 60456 53658
12776E3658n045m253M989L621l128l866R236j993N98r50k585Q026M523l923K984
$$ 53658 48613 44360 49349 52970 49842 45976 55212 53219 53817 52867 50282 58308 62831 58908 61892
12761F1892J2710P823J1720j482q483J3412J1819J4597M572N016O982O300M074
$$ 61892 74602 82425 94145 92663 84180 97592 109411 124008 128580 133596 140578 146878 150952
12748A50952k937J321N239k404J0036K6921K3926k501p362P659J1243K784J0443
$$ 150952 148015 149336 154575 152171 162207 189128 213054 210553 203191 210850 222093 224877 235320
12735B35320L640O574J2581O944J9992K5097J0325Q918n07K1401K2076J6813K3514
$$ 235320 238960 245534 258115 265059 285051 310148 320473 329391 328884 350285 372361 389174 412688
12722D12688K5771K9573J5770J4818L1908L5349L9553N0494M3550O5295Q9273
$$ 412688 438459 468032 483802 498620 530528 565877 605430 655924 699474 764769 854042
12711H54042J15410J27522J32138Q1631k0466l8406L595N3986P8790J03613J13987
$$ 854042 969452 1096974 1229112 1310743 1290277 1251871 1255466 1309452 1388242 1491855 1605842
12700A605842J48507J68242J87462K25735K60714L26746L94474M61030N36089
$$ 1605842 1754349 1922591 2110053 2335788 2596502 2923248 3317722 3778752 4314841
12691D314841O16538P03464Q41927R71436J169224J483900J953673K681669L699421
$$ 4314841 4931379 5634843 6476770 7448206 8617430 10101330 12055003 14736672 18436093
12682A8436093N061558O686256Q211682R252524R738524R640186Q665340O607862
$$ 18436093 23497651 30183907 38395589 47648113 57386637 67026823 75692163 82300025
12674H2300025L723936N34205k629764n593325p915718r200793r471774r072866
$$ 82300025 86023961 86558166 83928402 78335077 70419359 61218566 51746792 42673926
12666D2673926q230368o951348n418617m004957k941367k201758j690283j368521
$$ 42673926 34443558 27492210 22073593 18068636 15127269 12925511 11235228 9866707
12658I866707j124780r65070q37260p58492o82691n90743n08153m26373l65007
$$ 9866707 8741927 7776857 6939597 6181105 5498414 4907671 4399518 3973145 3608138
12649C608138l09556k72292k19438j83580j70601j91352j71624j38549j26418
$$ 3608138 3298582 3026290 2806852 2623272 2452671 2261319 2089695 1951146 1824728
12640A824728o9433k9806K2478o816j01310j55954j26492j05714q2157m7723k9625
$$ 1824728 1755295 1725489 1747967 1741151 1639841 1483887 1357395 1251681 1169524 1121801 1092176
12629A092176k7895m6052l8690m1787m4863n1225n0764l4389l0446k6102l1803
$$ 1092176 1064281 1018229 979539 937752 892889 841664 790900 756511 726065 699963 668160
12618F68160l8291j7798j8687j5318l2625k0640m027m105k1026j1170j5238p460
$$ 668160 629869 612071 593384 578066 545441 524801 520774 516669 495643 484473 469235 461775
12606D61775m885j2695k2475j5235l701n547n774m050k8159j7232M668N482n006
$$ 461775 456890 444195 421720 406485 402784 397237 391463 387413 359254 342022 346690 352172 347166
12593C47166j0211j8424k639k904k220l770J1499K235j1127k0900p149J1093n22
$$ 347166 336955 318531 315892 312988 310768 306998 318497 320732 309605 288705 281556 292649 292127
12580B92127k331j1310j2063j74p928m627J4307J843p622J063j4473j2409n64
$$ 292127 289796 278486 266423 266249 258321 253694 268001 269844 262222 263285 248812 236403 235839
12567B35839Q690N585P021Q444r690k248J8456K5175J1215J7735K3683J6102J2098
$$ 235839 244529 250114 257135 265579 255889 253641 272097 297272 308487 326222 349905 366007 378105
12554C78105J6352J9044K093k7277m0469l6726m7016m3533m5501l2584l0104l2172
$$ 378105 394457 413501 415594 388317 347848 311122 264106 220573 175072 142488 112384 80212
12542H0212j0762K32r684oJ228o23P577K4603J062L533N238J5107J809n478k083
$$ 80212 69450 69682 59998 59992 61220 60597 68174 92777 93839 97372 102610 117717 119526 114048 111965
12527A11965J0791L984j8254J88n05P097J5657J1206J69M820J4357K9610L9249
$$ 111965 122756 126740 108486 108674 108169 115266 130923 142129 142298 147118 161475 191085 230334
12514B30334M9897M2869M2964J6409k2435n5693o3020m5273k0156j5811n035L524
$$ 230334 280231 323100 366064 382473 360038 304345 241325 196052 175896 160085 155050 158574
12502A58574Q268R047J3202M412j0754r773j1322P051K3368l32j965J2197J4715
$$ 158574 166842 175889 189091 193503 182749 172976 161654 168705 192073 191741 189776 201973 216688
12489B16688O965J5901J5729m092k436j8200k5216k9515k7381k1964m283O817
$$ 216688 223653 239554 255283 251191 248755 230555 205339 175824 148443 126479 122196 129013
12477A29013R59J5010J3893M048J0878J8874J6351Q22j5881k8947l0135k8959
$$ 129013 129972 144982 158875 162923 173801 192675 209026 209848 193967 165020 134885 105926
12465A05926j2823m832J309P812M137P13k429j283k704P759J2800R463K037L930
$$ 105926 93103 88271 89580 97392 101529 102242 99813 98530 95826 103585 116385 125848 127885 131815
12451A31815j590k2707j5249O683R518J4609L105J5057K6581M1047O1067P7284
$$ 131815 130225 107518 92269 98952 108470 123079 126184 141241 167822 208869 269936 347220
12439C47220J15470J51597R6180k0761r5129j15837q6939o4983l0637p295M125
$$ 347220 462690 614287 710467 689706 594577 478740 391801 326818 296181 288886 293011
12428B93011P011K0308J0607J728J5748L1320J2924J3983m577J5464K2839L2046
$$ 293011 300022 320330 330937 332665 348413 379733 392657 406640 402063 417527 440366 472412
12416D72412J8341M574j740l412k0576k7793j5230K946K9701N7743O8232P8368
$$ 472412 490753 495327 493587 490175 469599 441806 426576 429522 459223 516966 585198 663566
12404F63566J19403J94467K36127K13541R4840o9955j87738k17289j92724j37557
$$ 663566 782969 977436 1213563 1427104 1521944 1451989 1264251 1046962 854238 716681
12394G16681j00343p1848m1025j9828k0435n055L4490K5059l50j0357j5616l3104
$$ 716681 616338 544490 503465 483637 463202 458147 492637 517696 517346 506989 491373 458269
12382D58269m9585k3602m761K494j120r045k1456j5553k1693j0877P902j0122
$$ 458269 408684 385082 380321 382815 381695 372650 351194 335641 313948 303071 310973 300851
12370C00851j2266J0028M3453O2761P9264J15210J06232K9161q2726j33909j38838
$$ 300851 288585 298613 342066 404827 484091 599301 705533 734694 651968 518059 379221
12359C79221j05409o7346m2337k1911j9794k6571k85m15j2320k991Q544k589o945
$$ 379221 273812 206466 164129 142218 122424 95853 95568 95153 82833 79842 88386 85797 78852
12346G8852O947k205n032r406R860J3732r990M015J2021N6n817k1189r032m101
$$ 78852 85799 83594 78562 69156 79016 92748 82758 86773 98794 98850 93033 71844 62812 58711
12332E8711M455O603j5321j1159N853Q452N376l266r24r122J345p824n431L438
$$ 58711 63166 69769 54448 43289 49142 57594 62970 59704 58780 49658 51003 43179 37748 41186
12318D1186R244o821j7339r948J9099M460n042l319Q590R379l564k555M492P698
$$ 41186 50430 43609 26270 16322 35421 39881 34839 31520 40110 49489 45925 43370 47862 55560
12304E5560j0078J867q501j6180O03q216j3449M678J1084j172R711J7595Q564
$$ 55560 45482 47349 38848 22668 23271 15055 1606 6284 17368 16196 25907 43502 52066
12291E2066j3736R23O000m181n90n048o193j9449q907J5048R996k687j1499j346
$$ 52066 38330 39253 45253 41072 40482 35434 29241 9792 885 15933 25929 23242 11743 10397
12277A0397Q21P725J4054J352k593j4369m429P687K315p111J776K73K738P137
$$ 10397 11218 18943 32997 34349 31756 17387 12958 20645 22960 15849 17625 17898 20636 27773
12263B7773l651K583r765J7137K2857N725L654J2378Q794k568O705L7926K9689
$$ 27773 24122 26705 16940 34077 56934 62659 66313 78691 87485 84917 91622 129548 159237
12250A59237N2718N4411M3559M8947M0120K6302J9010J4006O327l0263l8401m8720
$$ 159237 211955 266366 309925 358872 398992 425294 444304 458310 464637 434374 395973 347253
12238C47253o4181n4616l9764n2910l5184l665r439q687j3791j0835p61j7945
$$ 347253 283072 228456 188692 135782 100598 96933 87494 78807 65016 54181 53420 35475
12226C5475j5060M660j327O834j775j5990k891R559J5577R896R653j3058j8968
$$ 35475 20415 25075 23748 30582 28807 12817 9926 19485 35062 44958 54611 41553 22585
12213B2585J1008o575l197j633j493l646J6317n813l820k69J0137M024o971l114
$$ 22585 33593 27018 23821 22188 20695 17049 33366 27553 23733 23464 33601 37625 30654 27540
12199B7540j147j5623j2245J051J6369j49m430r205q662R012J4520l216m503k591
$$ 27540 26393 10770 -1475 -424 15945 15796 11366 2161 -6501 2511 17031 13815 9312 6721
12185F721J7206N234K459j473o633j0136K668J4331J62k03N356j4303r146j1526
$$ 6721 23927 29161 31620 30147 23514 13378 16046 30377 30539 30336 35692 21389 12243 717
12171G17j4192O701q118j169K6100J1419p787q48J0919J362k476j1597m127J906
$$ 717 -13475 -6774 -14892 -16061 10039 21458 13671 12823 23742 25104 22628 11031 6904 8810
12157H810k383k1564r384o950J7301K9460J454k202j6529j0273j426j564N699
$$ 8810 6427 -15137 -24521 -31471 -14170 15290 16744 14542 -1987 -12260 -13686 -15250 -9551
12144i551J7394M255j2646K368M126j2783P104N487j95M694O114L889P305j925
$$ -9551 7843 12098 -548 1820 5946 -6837 267 5754 5559 10253 16367 20256 27561 25636
12130B5636l122O651M856j0089j0555r084L182M934p596j0205o568j2244J6846
$$ 25636 22514 29165 34021 23932 13377 4293 7475 12409 4813 -5392 -11960 -24204 -7358
12117g358J6709q796n546J5293j231q760N478Q924r377j4319j774N937M742K786
$$ -7358 9351 555 -4991 10302 9071 311 5789 14713 5336 -8983 -10757 -4820 -78 2708
12103B708k409j720M904N498J61n739p706j134o672p197j391O353k354O782J9565
$$ 2708 299 -1421 3483 8981 9142 3403 -4303 -5437 -12109 -19306 -20697 -14344 -16698 -9916 9649
12088I649l443j1001j269p525N424n665k051L761N168k587q64J933O528P790j255
$$ 9649 6206 -4795 -6064 -13589 -8165 -13830 -15881 -12120 -6952 -9539 -10403 -8470 -1942 5848 4593
12073D593r249J6905l38n073K623J4215O934j1059j83k988j8717p45p834L742
$$ 4593 -4656 12249 11911 6838 9461 23676 30610 19551 19368 16380 -2337 -3082 -10916 -7174
12059g174Q083K196l3N94q239j843O785k646M952J1370M586J6882p261o733j6986
$$ -7174 909 3105 3072 3666 -4573 -6416 369 -2277 2675 14045 18631 35513 28252 21519 4533
12044D533Q967Q230j1047p201k302m638K771J1130j049K560J1315K58N814p997
$$ 4533 13500 21730 10683 3482 1180 -3458 -687 10443 9394 11954 23269 23527 29341 21344
12030B1344j6301M56R930r866j1476O524m06L08J188O321J0896n462j4332J591
$$ 21344 5043 5499 15429 5563 -5913 611 205 513 1701 8022 18918 13456 -876 715
12016G15N685k0898j2095J2705K5277m362j0582l93M499K36J0059L417J800m65
$$ 715 6400 -14498 -26593 -13888 11389 7027 -3555 -3948 551 787 10846 14263 16063 15598
12002A5598P575p20j0501Q93P431j5490j6142n693q39N401J0914R462l687o737
$$ 15598 23173 22453 11952 12845 20276 4786 -11356 -17049 -17888 -12487 -1573 7889 4202 -2535
11988b535M049K0076J0859m509q56l189r889k206m551p267R552o659r444N056
$$ -2535 1514 21590 32449 27940 27084 23895 14006 11800 7249 -18 9534 2875 -6569 -1513
11974a513m806k663J9800J2646j9734k076J918p053N850j001J925L138j322N349
$$ -1513 -6319 -8982 10818 23464 3730 1654 3572 -3481 2369 1368 3293 6431 5109 10458
11960A0458K0163l554j3280J608J9783Q873J615K911j4894j6773q554J186l985
$$ 10458 30621 27067 13787 15395 35178 44051 45666 48577 33683 16910 8356 9542 5557
11947E557o825k23P254k363L519k500O171K487J0217k735q198k945J326M804m105
$$ 5557 -1268 -1491 5763 3400 6919 4419 10590 13077 23294 20559 12361 9416 10742 15546 11441
11932A1441j1804P71m082r009o630N907J394M401o022r263J0008J557N030M609
$$ 11441 -363 408 -3674 -12683 -19313 -13406 -12012 -7611 -13633 -22896 -12888 -11331 -6301 -1692
11918a692p132m672J006R446Q336k662R326k64j1940r27J6044J4595R040m995
$$ -1692 -8824 -13496 -12490 -3044 5292 2630 11956 11692 -248 -1175 14869 29464 38504 33509
11904C3509o431o893j385R726n380j1896J879K641K239L70m910j3451j0738n392
$$ 33509 27078 20185 18800 28526 23146 11250 13129 15770 18009 18379 13469 18 -10720 -16112
11890a6112J4469J4639Q633j0118j4151r867M256J3853j45J4240M468j3641r510
$$ -16112 -1643 12996 21629 11511 -2640 -12507 -8251 5602 5457 19697 24165 10524 1014
11877A014K675J1787R378j809o751j3280j0055n223p199K757J4693J1377o680
$$ 1014 3689 15476 24854 23045 16294 3014 -7041 -12264 -19463 -16706 -2013 9364 2684
11864B684j3760O43L685k61J1444J337r272j420q36r807l248J5637p308L388J0461
$$ 2684 -11076 -10433 -6748 -7009 4435 5772 -3500 -4920 -5756 -15563 -18811 -3174 -10482 -7094 3367
11849C367k989k720j062Q984J2830K349j3442o399J0026j9720j1809r797J4725
$$ 3367 378 -2342 -3404 5580 18410 20759 7317 918 10944 -8776 -20585 -30382 -15657
11836a5657R509Q571K643n327n221r601Q206n812J657K1155J2072J1628O692j7760
$$ -15657 -6148 2423 5066 -261 -5482 -15083 -6877 -12689 -11032 10123 22195 33823 40515 22755
11822B2755k0304M968j210L952r257j4899K006M841j9023l846J8024K5207M577
$$ 22755 2451 7419 6209 10161 904 -13995 -11989 -7148 -26171 -30017 -11993 13214 17791
11809A7791j2671K043M228J0882n323n509M852n489M381M01m870j3549Q468L461
$$ 17791 5120 7163 11391 22273 16950 11441 16293 10804 15185 15586 10716 -2833 5635 9096
11795I096l872k12l738p530j015J388N411M026r54J478N826M483l112n103J1075
$$ 9096 5224 5012 1274 -6256 -7271 -5883 -472 3554 2600 4078 9904 14387 11275 6172 17247
11780A7247O766M771m835k050K648o214j405j574k2207j102M012R295K385P070
$$ 17247 24013 28784 23949 21899 24547 18333 16928 15354 -6853 -7955 -3943 5352 7737 14807
11766A4807J931q158J722K0672R756j6352q83M958j300j1783j4323j611J050o53
$$ 14807 16738 8580 10302 30974 40730 24378 23495 28453 27153 15370 1047 -564 486 -167
11752a67k895q732l883j77J2213P736J7338J3183N58j1309j6405j4471n337N622
$$ -167 -3062 -11794 -15677 -15854 -3641 4095 21433 34616 35174 23865 7460 -7011 -12348 -6726
11738f726M221J1485J6836k245r769m634N776J2674P165K545r088j1831K200m812
$$ -6726 -2505 8980 25816 23571 13802 9168 14944 27618 34783 37328 28240 16409 18609 13797
11724A3797j2316l058Q932Q194k724q4J673P903J1151N032j817j3071q232k880
$$ 13797 1481 -1577 7355 15549 12825 12741 14414 22317 33468 38500 36683 23612 15380 12500
11710A2500l369j1132k483O445J2230L16k374j0626r355J4121N065j735R668k212
$$ 12500 9131 -2001 -4484 1961 14191 14507 12133 1507 -7848 6273 11338 9603 19271 17059
11696A7059j6759J1864Q767j2372j9010L338j03L022R525Q56L717J333l339m307
$$ 17059 300 12164 20931 8559 -10451 -7113 -7216 -4194 5331 6187 9904 11237 7898 3591
11682C591o8Q913o094L271M967n785J045M81k219K758L680m564p465k208K148
$$ 3591 3523 12436 6342 9613 14580 8795 9840 10321 8102 10860 14540 9976 2511 303 2451
11667B451K310P822o353q498l849R812R269J2790J682L846K680p663J654j3168
$$ 2451 4761 12583 6230 -2268 -6117 3695 12964 25754 27436 31282 33962 26299 27953 14785
11653A4785j2203n005J0396o497p061j4794J3702P745R475L832m899p242J2411
$$ 14785 2582 -2423 7973 1476 -5585 -20379 -6677 1068 10543 14375 9476 2234 14645
11640A4645J4040m371j0840j0513j0938k322O085p858p33J3058L768M031k21n960
$$ 14645 28685 24314 13474 2961 -7977 -10299 -4214 -12072 -12805 253 4021 8052 7831 1871
11626A871j178q601o156j1559Q048K2592J3303Q426k3618j1736N701R701L743
$$ 1871 693 -7908 -14064 -25623 -17575 5017 18320 26746 3128 -8608 -2907 6794 10537
11613A0537j3496n126N289o082N114J5582Q550J9570j1174j9743l456L1O870P33
$$ 10537 -2959 -8085 -2796 -8878 -3764 11818 20368 39938 28764 9021 5565 5596 12466 13199
11599A3199M024J876j0746p383r225r492n522J1962J5842J4026j890Q7Q18j459
$$ 13199 17223 19099 8353 970 -8255 -17747 -23269 -11307 4535 18561 16671 16758 17576 16117
11585A6117k83k761q290l363J1254j7841j0028J2703J877P180p473j0219K1189
$$ 16117 15834 13073 4783 1420 12674 -5167 -15195 -2492 -615 6565 -908 -11127 10062
11572A0062k615p936r913J169M355J8849M81%j5859j3669Q960L866J280N438Q068
$$ 10062 7447 -489 -10402 -9233 -4878 13971 14452 14452 -1407 -15076 -6116 -2250 -970 4468 12536
11557A2536q414l885J2464M887l810J726j1831j852J0905n646r720O010J6258
$$ 12536 4122 237 12701 17588 13778 15504 3673 1821 12726 7080 -2640 3370 19628
11544A9628k623L885M420P64p30j254l701o080r614q449K2L045j0962l10J302
$$ 19628 17005 20890 25310 26074 25344 24090 20389 14309 4695 -3754 -3732 -687 -11649 -11959 -10657
11529a0657J6813J1211o512k0690j1375K081m099M251M177K460J3785J884j3859
$$ -10657 6156 17367 10855 -9835 -21210 -19129 -23228 -18977 -14800 -12340 1445 3329 -10530
11516a0530l459N49J2330P986q065K359P685M791M81L549k034k003M358N05p431
$$ -10530 -13989 -13440 -1110 6876 -1189 1170 8855 13646 14127 17676 15642 13639 17997 18502 11071
11501A1071o377M027R12J400M437k037j667j7362m992Q282j1111R93o403n763
$$ 11071 4694 8721 9633 11033 15470 13433 11766 -5596 -10588 -2306 -13417 -12424 -18827 -24590
11487b4590J1809J3333j3813o605p692l923M535J9931L393O770J66M178Q685J143
$$ -24590 -12781 552 -13261 -19866 -27558 -31481 -26946 -7015 -3622 3148 3314 7492 16177 17320
11473A7320J172O906P56j2639j3212j1536j358j4647m954Q779P355p58J3190M315
$$ 17320 18492 25398 26154 13515 303 -11233 -12591 -27238 -32192 -23413 -16058 -16816 -3626 689
11459F89m090n9k773P516N927K761m361L05R05n622j5686o300O876R909R32L623
$$ 689 -3401 -3460 -6233 1283 7210 9971 5610 5915 6820 1198 -14488 -20788 -13912 -4003 -3071 552
11443E52R76N896o330m688j2479n039O354J2907M920P16j088p93O414N772j2107
$$ 552 1528 7424 1094 -3594 -16073 -21112 -14758 -1851 3069 3785 2697 1904 8318 14090 1983
11428A983k233P850j659j275J2169m475j1517J975N659k92O67j2639N443N724
$$ 1983 -250 7600 5941 4666 16835 12360 843 2818 8477 8185 8852 -3787 1656 7380
11414G380l929o601J7026J0948m526j922K072L42o429j1976q660n795J4327L955
$$ 7380 3451 -3150 13876 24824 20298 18376 20448 20790 14361 2385 -6275 -12070 2257 6212
11400F212j208r497K538M614J5113R523m327J1644J4659n356k0319j2706k1838
$$ 6212 5004 -4493 -1955 2659 17772 27295 22968 34612 49271 43915 23596 10890 -10948
11387a0948j2448P532J6018P282k88j0927K124J4983J2347q147j0006m550P732
$$ -10948 -23396 -15864 154 7436 7148 -3779 -1655 13328 25675 17528 7522 2972 10704
11374A0704Q926r332j559N48k134O151m648k678J468m230n000j903n456J2400
$$ 10704 19630 10298 8739 9287 7153 13304 8656 5978 7446 3216 -1784 -3687 -9143 3257
11360C257J4788R59n372k5n290j0319p387L772J1672P521n737K263J401n874K667
$$ 3257 18045 19004 13632 13607 8317 -2002 -9389 -5617 6055 13576 7839 10102 11503 5629 8296
11345H296N405o739j9850o01J6942R919j392j4604L970J1489J233N866J6301o655
$$ 8296 13701 6962 -12888 -13489 3453 13372 11980 -2624 1346 12835 14068 19934 36235 29580
11331B9580j4206j0003l728M850M496M583m599n225L048R504o139n967J2499L760
$$ 29580 15374 5371 1643 6493 10989 15572 10973 5748 8796 18300 12161 6194 18693 22453
11317B2453j8101j1637L751m070j0372k819J695l602J4970P925J380Q096Q467
$$ 22453 4352 -7285 -3534 -7604 -17976 -20795 -19100 -22702 -7732 193 1573 9669 18136
11304A8136M597j615j483J588j3215j9924P121J7339M092k4421P416J5547j4046
$$ 18136 22733 21118 19635 21223 8008 -11916 -4795 12544 16636 -7785 -369 15178 1132
11291A132k894o18l751L702J613k983r82R974N655J924q464R816r41j1209o666
$$ 1132 -1762 -2380 -6131 -2429 -816 -3799 -4781 5193 10848 12772 4308 14124 13183 1974 -4692
11276d692N39j106p234j420R213J455m709n743L168R652J2972N250k857N202l835
$$ -4692 -4153 -5259 -12493 -13913 -4700 -3245 -7954 -13697 -10529 -877 12095 17345 14488 19690 15855
11261A5855m740j1425J331J4670M543n588K344P628k324j4686r798j2399l808
$$ 15855 11115 -310 1021 15691 20234 14646 16990 24618 22294 7608 -2190 -14589 -18397
11248a8397K0911J2341m259J1587Q293q256L669K012k750m985M319j452n058Q983
$$ -18397 2514 14855 10596 22183 30476 22220 25889 27901 25151 20166 24485 23033 17975 26958
11234B6958j913k1553j7888O00J4817O454j4479m067K0992Q229j322n772r149
$$ 26958 25045 3492 -14396 -13796 1021 7475 -7004 -11071 9921 18150 16828 11056 1907
11221A907j682j2L333J3272N131j7095j2573N854k393P850J0297J1450k997j3923
$$ 1907 225 213 3546 16818 21949 4854 -7719 -1865 -4258 3592 13889 25339 22342 8419
11207H419j459M320q716j999N553M964L952p33L939q209j3984J0850j434l154
$$ 8419 6960 11280 2564 565 6118 11082 15034 14301 18240 10031 -3953 6897 5463 2309
11193B309J502R997k361K29J380M89q54m042n9L087M407q113m717nj1217k697
$$ 2309 3811 13808 11447 11676 13056 13545 12691 8649 8590 11677 16084 7971 3254 3249 -7968 -10665
11177a0665j0764Q938K4488K903j3957L456J5282R087O169l38m210l431l399m585
$$ -10665 -21429 -12491 11997 14900 943 4399 19681 28768 34937 34599 30389 26958 23559 18974
11163A8974j4332p076j4324N558J7975Q432j1744l739J2677o179l370O333l237
$$ 18974 4642 -2434 -16758 -11200 6775 15207 3463 -276 12401 6222 2852 9185 5948
11150E948N233L931l095q340q41J3344P563M581l80j247p869r087J221J4554J2876
$$ 5948 11181 15112 12017 3677 2836 16180 23743 28324 27944 26697 18828 9741 10962 25516 38392
11135C8392m350l239j3721p502K950O763Q591k362M190m311j64j417j2157m757
$$ 38392 34042 30803 17082 9580 12530 19293 27884 25522 29712 25401 25237 23820 11663 6906
11121F906L866L001J556O204r938k2027M558J9280l480o628j7254Q560N203j0371
$$ 6906 10772 13773 15329 21533 11595 -10432 -5874 13406 9926 3298 -13956 -5396 -193 -10564
11107a0564m761J2398P77K011M8Q560J4734Q060K689j0086n782n051K615k900
$$ -10564 -15325 -2927 -2150 -139 -91 8469 23203 31263 33952 23866 18084 13033 15648 12748
11093A2748M360N339L099R299j901m5k4502j1744n173J2743Q504J0135l99n121
$$ 12748 17108 22447 25546 34845 32944 32899 8397 -3347 -8520 4223 12727 22862 22463 17342
11079A7342Q23k897j6921J0464P88j0389J383N598M696q652M856k888m649J470
$$ 17342 18165 15268 -1653 8811 9599 -790 593 6191 10887 2235 7091 4203 -446 1024
11065A024K614J1805P136j0379k2910l871J3937K0773O513L479p812n066q242
$$ 1024 3638 15443 22579 12200 -10710 -14581 -644 20129 26642 30121 22309 17243 9001
11052I001R94l096p257M481j303m012P59J1482J3670p493j9361k2505J2325M444
$$ 9001 9995 6899 -358 4123 2820 -1192 -433 11049 24719 17226 -2135 -24640 -12315 -7871
11038g871K3236K0796o676j6890j1968J828L656o522P29n66L364N235r782l31
$$ -7871 15365 36161 29485 12595 627 2455 6111 -411 318 -248 3116 8351 -1431 -1762
11024a762o055N906J5963J2097J989r619q476L58n989l507r859L81J4883J9502
$$ -1762 -7817 -1911 14052 26149 28138 18519 10043 10401 4412 905 -8954 -8573 6310 25812
11010B5812o777j1689k27O207O82j1373N4N668k012n118L897J1599O75m459J208
$$ 25812 19035 7346 7119 13326 14008 2635 2689 8357 6345 1227 5124 16723 17398 12939 14147
10995A4147L445J8995k839m359O496J7589p340j2907j5989j2553k804J798j528
$$ 14147 17592 36587 33748 29389 35885 53474 46134 33227 17238 4685 1881 3679 2151
10982B151L346j724Q191J0488m122j2410k011J0260R119L721m640j6982O312J639
$$ 2151 5497 3773 11964 22452 18330 5920 3909 14169 23288 27009 22369 5387 11699 13338
10968A3338L684j0819K922R098O231Q290K270p034J35L166L184k1313j187j187
$$ 13338 17022 6203 9125 18223 24454 32744 35014 27980 28115 31281 34465 13152 11965 10778
10954A0778j1240J0621K2915J0750r714q177n649j0328N674Q982J4909K742M317
$$ 10778 -462 10159 33074 43824 34110 25933 20284 9956 15630 24612 39521 42263 46580
10941D6580K2806K3895K6265K8383J8066l536l281O450o553k4818k3886k4665
$$ 46580 69386 93281 119546 147929 165995 162459 159178 165628 159075 134257 110371 85706
10929H5706k1288o105j1709k3622O791K581l384q8J387j7592Q13J2432J449p091
$$ 85706 64418 58313 46604 22982 29773 32354 28970 28882 30269 12677 13490 25922 27371 20280
10915B0280K766J642p5L967J1198l855P863r438o448K541R454L276N01K4479N458
$$ 20280 23046 24688 24613 28580 39778 35923 43786 34348 27900 30441 39895 43171 43672 68151 73609
10900G3609N746R545M740O220K2292K0035K3167K1421L6977J9474Q103m922k4173
$$ 73609 79355 88900 93640 99860 122152 142187 165354 186775 223752 243226 251329 246407 222234
10887B22234j3699q319j0041j6118j3461j1185k1739k3279j0062J90q095j4878
$$ 222234 208535 200216 190175 174057 160596 149411 127672 104393 94331 94521 86426 71548
10875G1548j4999p1j0335K083o176LR588L925J906j3791J711l473j4303q060J1480
$$ 71548 56549 56478 46143 48226 42050 42053 51641 55566 57472 43681 45392 41919 27616 19556 31036
10860C1036O115j655J723P007P406j000j766m321J645J1638J3993R833J2066K2484
$$ 31036 37151 35496 37219 44226 51632 50632 48866 44545 46190 57828 71821 81654 93720 116204
10846A16204K4046K6579J2033M938k236k3806k4570r454j8502k1829j7523M694
$$ 116204 140250 166829 178862 183800 181564 157758 133188 123734 105232 83403 65880 70574
10834G0574q061j5897k1288j288Q040R866L552k1569j7051J820J1227L441K194
$$ 70574 62513 46616 25328 24040 32080 41946 45498 23929 6878 8698 19925 23366 25560
10821B5560o280j0987N741O977j166j779M558j0850N495J0577J872K574J2042
$$ 25560 19280 8293 14034 21011 19845 18066 22624 11774 17269 27846 29718 32292 44334
10808D4334k134l280J0637k82k2576j284K442o663J2594r39p904K631j212N618
$$ 44334 42200 38920 49557 49275 26699 25415 27857 21194 33788 32849 24945 27576 26364 31982
10794C1982j4758q262N931R169r391n665J3323O20k508o076p488N623k947j1297
$$ 31982 17224 8962 14893 24062 14671 9006 22329 22949 20441 14365 6877 12500 9553 -1744
10780a744J2603L0904J4255n182r45l668j0047m668P254l361m411o860o399r774
$$ -1744 10859 41763 56018 50836 49891 46223 36176 31508 38762 35401 30990 24130 17731 7957
10766G957J955O514M588J0698O409m294r420l782J2563r411p009P433L122R302
$$ 7957 9912 16426 21014 31712 38121 33827 24407 20625 33188 23777 16768 24201 27323 36625
10752C6625J2993k302p580K24j2643p187m467P15J3877Q168J0437M195l352R334
$$ 36625 49618 47316 39736 39960 27317 20130 15663 16378 30255 38423 48860 53055 49703 59037
10738E9037M985j2301j1105J094J2323J2594J801N411m893j2532Q311P94j2683
$$ 59037 64022 51721 40616 41710 54033 66627 68428 73839 68946 56414 64725 65519 52836
10725E2836R402R110j710j3220l988Q580j5388K501K19k482m189q359j140n361
$$ 52836 62238 71348 69638 56418 52430 61010 45622 48123 48342 45860 41671 33312 32172 26811
10711B6811j1764j589N201J8588n495q171m626P041J7735M545j0284K5J5729K816
$$ 26811 15047 13458 18659 37247 31752 23581 18955 25996 43731 48276 37992 38017 53746 56562
10697E6562j8527j658O548m052j989O53J2062K766M310M896q421L465J3279k242
$$ 56562 38035 36377 42925 38873 36884 37537 49599 52365 56675 61571 53150 56615 69894 67652
10683F7652L555J10P098J3136P584o853l209j2706j2106j5143j476N635m50j650
$$ 67652 71207 71317 78415 91551 99135 92282 89073 76367 64261 49118 47642 53277 52827 51177
10669E1177p986O560K417l450K991L926R033m626l31j1418J9529K2015J0044k631
$$ 51177 43191 49751 52168 48718 51709 55635 64668 60042 59711 48293 67822 89837 99881 97250
10655I7250n610J1929J3596J1420J3496j552l959r659j2215O648n466m374K995
$$ 97250 91640 103569 117165 128585 142081 140529 136570 126911 114696 121344 115878 111504 114499
10642A14499l495n532k1731l011N764J2898J2899L062j3792j7511k5893j4605
$$ 114499 111004 105472 83741 80730 86494 99392 112291 115353 101561 84050 58157 43552
10630D3552L821K2230K5105m527j7466M755P892J658l924k5790o568N453J8401
$$ 43552 47373 69603 94708 90181 72715 77470 85362 87020 83096 57306 50738 56191 74592
10617G4592J8169J3654J5684J7811J1400L131j1510J293M2648J2425L288q47q306
$$ 74592 92761 106415 122099 139910 151310 154441 142931 144224 186872 199297 202585 201738 193432
10604A93432k757m411r701m604m09P883J5637J5627J7627K8139M8987N7683P9574
$$ 193432 190675 186264 176563 171959 171550 179433 195070 210697 228324 256463 305450 363133 442707
10591D42707J42826J92753K37865K71899L00257K45002J36512O111j33595k47345
$$ 442707 585533 778286 1016151 1288050 1588307 1833309 1969821 1975932 1842337 1594992
10581A594992k82742k63587k13277j69280j26332q5669o0112m7242l8631j8141
$$ 1594992 1312250 1048663 835386 666106 539774 454105 393993 346751 308120 289979
10571B89979j1632k3160j5475K97p489Q785K708n103R477J7762J4351J335Q624
$$ 289979 278347 255187 239712 240009 232520 241305 244013 238910 248387 266149 280500 281835 290459
10558B90459j181r582o440l37j3788J7K1985K8151P554R545K2845K1787K7785
$$ 290459 289278 279696 273256 272919 259131 259148 281133 309284 316838 326383 349228 371015 398800
10545C98800K9896L3955M1153O6256J00333J06532J40606J57064J82798K01181
$$ 398800 428696 462651 503804 570060 670393 776925 917531 1074595 1257393 1458574
10535A458574K13890K40878L07028M03292N42809P92457J167872J741428K506743
$$ 1458574 1672464 1913342 2220370 2623662 3166471 3958928 5126800 6868228 9374971
10526I374971L307654L900522L973278L242428J716200j82298j942170l192630
$$ 9374971 12682625 16583147 20556425 23798853 25515053 25332755 23390585 20197955
10518B0197955l697898l516432k921316k214545j594733j116022p76898n42650
$$ 20197955 16500057 12983625 10062309 7847764 6253031 5137009 4360111 3817461
10510C817461l94831l07400k32776j99370j82443j63231j25381r9180o1448j8603
$$ 3817461 3422630 3115230 2882454 2683084 2500641 2337410 2212029 2112849 2051401 2032798
10500B032798J4908O2974J31325J90234K91138M40688O03250P68013Q89105Q90586
$$ 2032798 2047706 2110680 2242005 2432239 2723377 3164065 3767315 4535328 5424433 6315019
10490F315019P53948N49314L45994L34399O11547J233163K145230L322790M688774
$$ 6315019 7068967 7618281 7964275 8298674 8910221 10143384 12288614 15611404 20300178
10481B0300178N970810O561824N845041L638257N32403k450703m323277m665376
$$ 20300178 26270988 32832812 38677853 42316110 42848513 40397810 36074533 31409157
10473C1409157l789055k442073j466511j255369j777673k505928k873165k713455
$$ 31409157 27620102 25178029 23711518 22456149 20678476 18172548 15299383 12585928
10465A2585928k133440j433526p81734k64441M0239O5780j88648n94143r22852
$$ 12585928 10452488 9018962 8237228 7972787 8013026 8078806 7890158 7296015 6373163
10456F373163j008083q80183o82069m86132l42797k19717j38234o3984j712M4358
$$ 6373163 5365080 4484897 3802828 3316696 2973899 2754182 2615948 2551964 2550252 2594610
10446B594610J00368J33040J77288K04987K33170L08374M16820O15095R10825
$$ 2594610 2694978 2828018 3005306 3210293 3443463 3751837 4168657 4783752 5694577
10437E694577J372212K010121K910448L950579M848748N169644M454763K604160
$$ 5694577 7066789 9076910 11987358 15937937 20786685 25956329 30411092 33015252
10429C3015252P041k525523m316020n001234m711043l828942k821782j973169
$$ 33015252 33022293 30496770 26180750 21179516 16468473 12639531 9817749 7844580
10421G844580j392830j033332p79592o21240m98554l85987l26693l20103k83415
$$ 7844580 6451750 5418418 4638826 4017586 3519032 3133045 2806352 2486249 2202834
10412B202834k47998k26494j93335j49617j32694r7294q7986p6187n6224m5192
$$ 2202834 1954836 1728342 1535007 1385390 1252696 1155402 1067416 991229 935005 889813
10402H89813o3323n0928l7134l6527m8325l4108n1183m6618m6025l3217j0037
$$ 889813 826490 775562 738428 701901 653576 619468 568285 521667 475642 442425 432388
10391D32388M613j2277j7395j9825k6883l008m632q538N803J877J3165J1713O352
$$ 432388 437001 424724 407329 387504 360621 357613 352981 344443 350246 352123 365288 377001 383353
10378C83353O766M283J2395J0727j128m22M992j2715j6958k1804j917j0151M09
$$ 383353 390119 394402 406797 417524 416396 415974 420966 408251 391293 369489 367572 357421 357830
10365C57830k8515j8302j3095k2727o039m688p338k3810k0132j6909j8872m572
$$ 357830 329315 311013 297918 275191 269152 264464 257126 233316 213184 196275 177403 172831
10353A72831R522J3417l178n74J1941J7499L144o160n873r551J3083J0893Q169
$$ 172831 182353 195770 192592 192018 203959 221458 224602 218442 212569 203018 216101 226994 235163
10340B35163Q083J483K948L245J7010J5152O107J340l812k423K238Q442P621K0285
$$ 235163 243246 244729 247677 250922 267932 283084 289191 290531 286719 284296 286534 294976 302597 322882
10326C22882K0016K4157J5667j1497l3698o0897n6017k2767R688J1845K4887J2992
$$ 322882 342898 367055 382722 371225 337527 276630 220613 197846 207534 219379 244266 257258
10314B57258J6954L1428Q035l006J2725K6486J4548J0593K8170K8477K2123J9742
$$ 257258 274212 305640 313675 310669 323394 349880 364428 375021 403191 431668 453791 473533
10302D73533J9022M4722N9608R1721J09466J16818Q8480k0205k01129l14660l04916
$$ 473533 492555 537277 596885 688606 798072 914890 1003370 983165 782036 467376 162460
10291A62460j83524n6442j8976J192K4221K0828K5400K5180J0806j3233k8496
$$ 162460 -21064 -77506 -96482 -95290 -71069 -50241 -24841 339 11145 -2088 -30584
10280c0584j7945k903J1021J4335N181j41J4894R845K95R74J0302J1404Q024P561
$$ -30584 -48529 -51432 -40411 -26076 -20895 -21036 -6142 3703 3998 4972 15274 26678 34702 42263
10266D2263J6375K4378J0891J6495O759l736p147J4811J1866J8137k122K104J2270
$$ 42263 58638 83016 93907 110402 117161 113425 106278 121089 132955 151092 148970 151074 163344
10253A63344q447j5364K287J4920J3804K6140J8036J7842J3270J299m681j8568
$$ 163344 154897 139533 141820 156740 170544 196684 214720 232562 245832 247131 242450 223882
10241B23882M914J52J6040K6278L8415K1053K0874K8234K4329J0170K3141K1566
$$ 223882 228796 228948 244988 271266 309681 330734 351608 379842 404171 414341 437482 459048
10229D59048J3645J6064K484O255K1013L9225L4957J2021K5671J5688K3313M7062
$$ 459048 472693 488757 491241 497496 518509 557734 592691 604712 630383 646071 669384 716446
10217G16446N0136M6887M9907N0634N0354N0677P1985Q5940Q8786R9356J02128
$$ 716446 766582 813469 863376 914010 964364 1015041 1087026 1172966 1261752 1361108 1463236
10206A463236R5696R8007J02119J08615J19623J33455J40592J51930J39023J67725
$$ 1463236 1558932 1656939 1759058 1867673 1987296 2120751 2261343 2413273 2552296 2720021
10196B720021K08532K74300L00876L50278M25987N47698O84217Q33045J029942
$$ 2720021 2928553 3202853 3503729 3854007 4279994 4827692 5511909 6344954 7374896
10187G374896J248417J472359J617035J512278J137845Q32948J046874J728709
$$ 7374896 8623313 10095672 11712707 13224985 14362830 15195778 16242652 17971361
10179A7971361K650151L797660N355799P627921J1133233J7061586K7251106M3799904
$$ 17971361 20621512 24419172 29774971 37402892 48536125 65597711 92848817 136648721
10171A36648721O7696027R5423093J10264868P8221008j0446265r3742876j12194725
$$ 136648721 204344748 299767841 410032709 488253717 477807452 384064576 271869851
10164B71869851q5475605n5172945l5042389k3029653j5751435j1068878p933503
$$ 271869851 186394246 131221301 96178912 73149259 57397824 46328946 38395443
10157C8395443n836021m383509l252136k327391j634663j204915j202812j496716
$$ 38395443 32559422 28175913 24923777 22596386 20961723 19756808 18553996 17057280
10149A7057280j715583j717907j557252j344547j157022r89648q30538p29339
$$ 17057280 15341697 13623790 12066538 10721991 9564969 8575321 7744783 7015444
10141G015444o38360n37361m66916m44874m05700l44185k84659k44011k38513
$$ 7015444 6377084 5839723 5372807 4927933 4522233 4178048 3893389 3649378 3410865
10132C410865k06369j85237j73588j39674j15708j07381j06883j00599q7715o9855
$$ 3410865 3204496 3019259 2845671 2705997 2590289 2482908 2376025 2275426 2187711 2117856
10122B117856p7332r0308o1229n7280o0287m9396o1048o2639o0865n2565m1743
$$ 2117856 2040524 1950216 1888987 1831707 1771420 1722024 1660976 1598337 1537472 1484907 1443164
10111A443164k3185j5183o970j3363k0539k5488l6652l2454j6653k4141k0738
$$ 1443164 1419979 1404796 1397826 1384463 1363924 1338436 1301784 1269330 1252677 1228536 1207798
10100A207798m390N483j562k3574j6621l8954m5070k2376q403k374j9791n816
$$ 1207798 1203408 1208891 1207329 1183755 1167134 1128180 1083110 1060734 1052331 1049957 1030166 1024350
10088A024350n848j2568n119r461k4666l5038l5495m5781k8885r151j5017k3271
$$ 1024350 1018502 1005934 1000815 991354 966688 931650 896155 850374 821489 812338 797321 774050
10076G74050k0698j6336p203j5091m686O393J5919N263Q504N920J4652K0976J6513
$$ 774050 753352 737016 729813 714722 710036 716429 732348 737611 746115 752035 766687 787663 804176
10063H04176J3688J4838L1287K5988J8618J7347P065r492l8092m4673j6282J7283
$$ 804176 817864 832702 863989 889977 908595 925942 933007 923515 885423 840750 824468 841751
10051H41751L6741M8937N2523L7304K3547K8085K1147j6026j13002k74064l38525
$$ 841751 878492 927429 979952 1017256 1040803 1068888 1090035 1074009 961007 686943 348418
10040C48418k62330j21435p397M0925M0565L6560L7425J9502K1120K4851L3967
$$ 348418 86088 -35347 -42744 -1819 38746 75306 112731 132233 153353 178204 212171
10029B12171K3213M713J2887J7500P666J032O330R887J7355K062J5643K3165Q188
$$ 212171 235384 240097 252984 270484 278150 279182 285512 295399 312754 314816 330459 353624 361812
10016C61812P744j4149k2861k8127k1006k3371J33K0595J7530j5753j5057j3459
$$ 361812 369556 355407 332546 304419 283413 260042 260175 280770 298300 282547 267490 254031
10004B54031j7015r884j3732k1714j5250O484O148j817k237R343j000L897P522
$$ 254031 237016 227132 213400 191686 176436 182920 189068 187251 185014 194357 193357 197254 204776
9991B04776O505q134o273r233L784J8160K2683J7628J4177J0805J5529L435k7106
$$ 204776 211281 203147 196874 187641 191425 209585 232268 249896 264073 274878 290407 293842 266736
9978B66736k4190j3717j8605r447m222p658k1418j9500k1431q485j1642L018l36
$$ 266736 242546 228829 210224 200777 196555 188897 167479 147979 126548 118063 106421 109439 109103
9965A09103r696k1292n774j0224L598J912M022J5010J2366K8852J4980N527J3079
$$ 109103 99407 78115 72341 62117 65715 67627 71649 86659 99025 127877 142857 148384 161463
9952A61463J6780J0874J7550R197r672j5799q957Q893J1586Q73N243j3841q022
$$ 161463 178243 189117 206667 215864 206192 190393 181436 190329 201915 202788 208031 194190 186168
9939A86168M457j2552l957j903k861K138n877j3727m003j398J5489K0976L082
$$ 186168 190625 178073 174116 172213 169352 171490 165613 151886 147883 146485 161974 182950 186032
9926A86032l154j0703m827j756l767J6217K0027K4194Q382o425K0324K666k0899
$$ 186032 182878 172175 167348 165592 161825 178042 198069 222263 230645 224220 244544 247210 226311
9913B26311q038Q738K4419M061k3266p571M447q462n280j206Q705o975j4885j0873
$$ 226311 218273 227011 251430 255491 232225 224654 229101 220639 215359 214153 222858 215883 200998 190125
9899A90125Q640N530K491m711o058j1658p550j0050q065j3204o648r286Q717R155
$$ 190125 198765 204295 206786 202075 196017 184359 176809 166759 158694 145490 138842 129556 138273 147428
9885A47428r571K591K5101J8591J0803j0134j0742r723l526l418J767P277r34
$$ 147428 137857 140448 165549 184140 194943 184809 174067 164344 160818 157400 159167 166444 165510
9872A65510k84J8395K3408Q552M978m923j399k0109j0893j1486K2070J6711l084
$$ 165510 165226 183621 207029 215581 220559 215636 214237 194128 183235 171749 193819 210530 207446
9859B07446j712J5716M064k4610l8251j6170n118J2727r36n627K591R469k923
$$ 207446 205734 221450 225514 200904 162653 146483 141365 154092 153156 147529 150120 159589 156666
9846A56666j0557m27l242n288k247J1463M827J6926L126L780n983j707O883O597
$$ 156666 146109 145682 142440 137152 134905 146368 151195 168121 171247 175027 169044 167337 174220 180817
9832A80817k917O726J0061Q864J1012K868o361R545K141P502J9566J8757J9662
$$ 180817 177900 184626 194687 203551 214563 217431 211070 220615 222756 230258 249824 268581 288243
9819B88243j4166J250o629o486j0596o216q132l645O0p214M105N578P533m755
$$ 288243 274077 275327 268698 262212 251616 245400 237268 233623 233683 226469 230574 236152 243685 238930
9805B38930Q870L2403L4967L4275K8127L1820L1382K8131N5549P8328N8095P8646
$$ 238930 247800 280203 315170 349445 377572 409392 440774 468905 524454 602782 660877 739523
9793G39523Q7682J21524J73556K25168L15796M44582O45738R29466J221148J382075
$$ 739523 827205 948729 1122285 1347453 1663249 2107831 2753569 3683035 4904183 6286258
9783F286258J253592Q00247K57642l02244r24770j339265j308729j038920p60801
$$ 6286258 7539850 8340097 8597739 8295495 7370725 6031460 4722731 3683811 2923010
9774B923010n20709l58731k68750j97351j35170p6415n5699m5807l4694j6902
$$ 2923010 2402301 2043570 1774820 1577469 1442299 1365884 1310185 1264378 1229684 1212782
9764A212782j7115q098J5502L4611N8948R7790J34114J78207K35989L00177M02678
$$ 1212782 1195667 1187569 1203071 1237682 1296630 1394420 1528534 1706741 1942730 2242907 2645585
9753B645585M82963M78551L86166L61935N26620Q59142J275225J805209K459683
$$ 2645585 3128548 3607099 3993265 4355200 4881820 5740962 7016187 8821396 11281079
9744A1281079L278460L918138L709288K218132N1053j740608k565259k230888
$$ 11281079 14559539 18477677 22186965 24405097 24456150 22715542 20150283 17919395
9736A7919395j155578k71804j34531p35758j601833k227277k249789j819140j306335
$$ 17919395 16763817 16492013 16357482 15621724 14019891 11792614 9542825 7723685 6417350
9727F417350q72257n71660l62430j93966p7284p4162j88561l05795l04133j90658
$$ 6417350 5545093 4973433 4611003 4417037 4339753 4265591 4077030 3771235 3467102 3276444
9717C276444o9416O9363J87734L44067N26101N95855M33668O7580j41861j5344
$$ 3276444 3207028 3276391 3464125 3808192 4334293 4930148 5363816 5431396 5289535 5274191
9707E274191L03300P19492J219811J873707K659278L366265L317842J901923M6668
$$ 5274191 5577491 6296983 7516794 9390501 12049779 15416044 18733886 20635809 20682477
9698B0682477p99190k67241J048501K419121L040293K456089Q93837j191500l125331
$$ 20682477 19883287 19616046 20664547 23083668 26123961 28580050 29473887 28282387 25157056
9689B5157056l972424l762297l201323k614647j948906j323482p94778m02210
$$ 25157056 21184632 17422335 14221012 11606365 9657459 8333977 7539199 7136989
9681G136989k72700m81437p48215p72360n84973l96450k56244j53391m9460N9154
$$ 7136989 6864289 6382852 5634637 4862277 4277304 3880854 3624610 3471219 3421759 3480913
9671C480913J04835M1848q5080j53177r0086M1782J83157L50091N22621P21118
$$ 3480913 3585748 3627596 3542516 3389339 3299253 3341035 3524192 3874283 4396904 5118022
9661E118022R06638Q78187N60625K82908M09456R33811J628039K220914K616563
$$ 5118022 6024660 6902847 7463472 7746380 8155836 9089647 10717686 12938600 15555163
9652A5555163K703257K416811J413390k28024j612882k405396k965984l071207
$$ 15555163 18258420 20675231 22088621 21860597 20247715 17842319 14876335 11805128
9644A1805128k557294j850475j248916q04822n65560n15630n43006m97509m17215
$$ 11805128 9247834 7397359 6148443 5343621 4778061 4262431 3719425 3221916 2804701
9635B804701l37498k32651j91095j80548j42931j26186j06408p2407p2475n4485
$$ 2804701 2467203 2234552 2043457 1862909 1719978 1593792 1487384 1414977 1342502 1288017
9625A288017m7285m0026k3203J2449J6458K5198M9831Q1477R8865J42879K06428
$$ 1288017 1240732 1200706 1177503 1189952 1206410 1231608 1281439 1362916 1461781 1604660 1811088
9614A811088L34085M83251O69085Q69273R85252Q60600M73381O7525l17808p55377
$$ 1811088 2145173 2628424 3297509 4166782 5152034 6012634 6486015 6553540 6235732 5480355
9604E480355j043918j014244p96600n49852l75215k63743j98404j41727j19170
$$ 5480355 4436437 3422193 2625593 2075741 1700526 1436783 1238379 1096652 977482
9595I77482r0996o0701m1007m5948m3334m4859n1395l0930k4684k7761l1115j2793
$$ 977482 886486 825785 784778 738830 695496 650637 599242 568312 543628 515867 484752 471959
9583D71959j6432j9411o156r654k0365k00m855j1499k245p670k3081j8920j5357
$$ 471959 455527 436116 429960 420306 399941 399741 394886 383387 381142 373472 350391 331471 316114
9570C16114r847j3415k1702J735m518j5793k6526j6370J6330J6952Q629l226J0783
$$ 316114 306267 292852 271150 272885 268367 252574 226048 209678 226008 242960 251589 248363 259146
9557B59146r095j2816J4826J3646j867n375p755j0600j07J0159K265n492j5633
$$ 259146 250051 237235 252061 265707 263840 258465 250710 240110 240003 250162 252427 246935 231302
9544B31302j863m157j4323L394J3774M679O9j580M442k244m999M754L39J0896
$$ 231302 229439 225282 210959 214353 228127 232806 232875 231295 235737 233493 228494 233248 233587 244483
9530B44483J3238L122Q800o920L275o733k6119j7525o875j2118o732r789Q598
$$ 244483 257721 260843 269643 262723 265998 259265 233146 215621 208746 196628 189896 180107 188705
9517A88705k085p608P035l049j65J1565j238r594k246J4707J3387l520R187M474
$$ 188705 186620 179012 186047 182998 182833 194398 193160 183566 181320 196027 209414 205894 215081 219555
9503B19555J0604M321j8659J830J2376o735L281J1454K299J4307K1901R775R394
$$ 219555 230159 234480 215821 217651 230027 223292 226573 238027 240326 254633 276534 286309 295703
9490B95703J7089J3728j0090k2331k1496l1433l0401j6114l116q233m360J2659
$$ 295703 312792 326520 316430 294099 272603 241170 210769 194655 191539 183306 178946 191605
9478A91605j120j85J986j172o455j297K92J9044k012l821O183P433j602o097L596
$$ 191605 190485 190300 192286 191114 184659 183362 183654 202698 200686 196865 203048 210481 208879 202782 206378
9463B06378O608L0974J4069p225q506J6123J0900J3140L4008K2977q289o360j9239
$$ 206378 212986 243960 258029 250804 242298 258421 269321 282461 316469 339446 331157 324797 305558
9450C05558j9573j5546j0566j9405k2229j994q060n675l812p367j4414m11M982
$$ 305558 285985 270439 259873 240468 218239 216245 208185 202510 198698 191331 176917 176506 181488
9437A81488J1284K9991j0839j4461P913J3634R758m737J3032R919k1055n942N381
$$ 181488 192772 222763 211924 197463 205376 219010 228768 224031 237063 246982 225927 219985 225366
9424B25366J0379J2673K0904J8688R05n261L367J1787k046n638k6349j1835j2532
$$ 225366 235745 248418 269322 288010 288915 283654 287021 298808 296762 291124 264775 252940 240408
9411B40408r383k002K868N850R99j4765n232J5973k682j873j2480M763N174R13
$$ 240408 231025 229023 231891 237741 238740 223975 218743 234716 232034 230161 217681 222444 227618 228531
9397B28531Q5j008j1259O764J962k592J7593N471p498k629K188L057J0592J7063
$$ 228531 228616 227608 216349 223113 225075 222483 240076 245547 238049 235420 237608 240665 251257 268320
9383B68320R463K602L051k027j7480M644O137q350m559n341J0040J2145k2529
$$ 268320 277783 280385 283436 281409 263929 268573 274710 266360 261801 256460 266500 278645 256116
9370B56116l23j0996k4971J5591R005q777m44P447o013J1495M449k1614K734J1406
$$ 256116 255793 244797 219826 235417 244422 235645 235201 242648 236635 248130 252579 230965 233699 245105
9356B45105J9110j378j2397q055R688j258k138N352J1948K951j0021q20J2047
$$ 245105 264215 262837 250440 242385 252073 250815 248677 254029 265977 268928 258907 258087 270134
9343B70134J3048L178N479J1716L5472M3489Q827j574j3839J344R795L184j671
$$ 270134 283182 286360 291839 303555 339027 382516 391343 389769 375930 377274 387069 390253 388582
9330C88582k2783j7805r473k814j3900k3225j2932j71J6755R454k32J48Q231m385
$$ 388582 365799 347994 338521 335707 321807 298582 285650 285479 302234 311688 311456 311604 319835 315450
9316C15450q850n645R246n035p205m439n024Q922P366Q461j7P947l213J4808Q193
$$ 315450 306600 300955 310201 305166 297961 293522 288498 297420 304786 313247 313230 321177 317964 332772 340965
9301C40965P464R770L8214K9943K9875M3312M6232N4172P4182R6758J03092J01116
$$ 340965 348429 358199 396413 426356 456231 499543 545775 599947 674129 770887 873979 975095
9289I75095N9732j3408q8500j16908j02882q5484n5141l3343m805P078K6359L1453
$$ 975095 1034827 1021419 932919 816011 713129 627645 572504 539161 534356 541434 567793 599246
9277E99246N8623P0701O8984M6815L9088J5845j8195k2042k4814l3668k8643j1373
$$ 599246 657869 728570 797554 844369 883457 899302 881107 859065 834251 800583 771940 760567
9265G60567j2678j2979K572j3664K03J8683L6996P2793J24632K01949K46064K34810
$$ 760567 747889 734910 737482 723818 724021 742704 779700 852493 977125 1179074 1425138 1659948
9253A659948J78860P1318r2076k13244k46696j82768j37844p7145n4972m1325
$$ 1659948 1838808 1910126 1818050 1604806 1358110 1175342 1037498 960353 905381 864056
9243H64056k2687j6608j6668R19K315K111j097K7403K3829N0584K8058N932l5863
$$ 864056 841369 824761 808093 809012 811327 813438 812341 839744 863573 914157 942215 948147 912284
9230I12284o6042q7275p4008n3207l5392l1809o674L668P322K5998M8948O7288
$$ 912284 846242 758967 684959 631752 596360 564551 557877 561545 568867 594865 643813 711101
9218G11101Q3664Q9356O1733j592p2818r4969p4428p6916p0059m5024k4945j2506
$$ 711101 794765 884121 945854 944262 871444 776475 702047 625131 555072 510048 485103 472597
9206D72597l149m482j102K917l537P233j2089j6769j4780k084O757L65J48J1010
$$ 472597 469448 464966 463864 466781 463244 470477 458388 441619 426839 424755 431512 431877 432025 443035
9192D43035N97q581l06N103Q005P188R387q621j0053J180m560J0263J3342j228
$$ 443035 443632 435051 434745 439848 447853 455041 464428 455807 445754 446934 442374 452637 465979 464751
9178D64751L555J6661J0202l248j1044O055L819j6655j0813P65k347q707l264
$$ 464751 468306 484967 495169 491921 480877 486932 490751 474096 463283 464048 461701 452994 449730
9165D49730n44L082J7727J2064o880l756L884p082J7243J1711l936P197o287k256
$$ 449730 449186 452268 469995 482059 475179 471423 475307 468225 485468 497179 493243 500440 494153 491897
9151D91897o653p757P963J3155J4957J2712m560j2493K728N894J2338L445P39
$$ 491897 485244 477487 485450 498605 513562 526274 521714 509221 511949 517843 530181 533626 534365
9138E34365j1215j8660j321J0510j396J2283Q933O205L016L958j50M986O528J2575
$$ 534365 523150 504490 503169 513679 512283 524566 533499 539704 542720 546678 546528 551514 558042 570617
9124E70617N835o36J03J310j498L599J220J6316J0656o997r5Q380k22N509n289
$$ 570617 576452 575816 575919 577229 575731 579330 580550 596866 607522 600525 600430 608810 608588 614097 608808
9109F08808j2604R971K4094N265p234R419J6639J7161j3525j0317L153P991J0919
$$ 608808 596204 606175 630269 635534 628300 637719 654358 671519 657994 647677 650830 658821 669740
9096F69740K93L373p315P562M971Q401l165K752J3893O305k310j0L175J1553M691
$$ 669740 670033 673406 666091 673653 678624 687025 683860 686612 700505 706810 704500 704490 707665 719218 723909
9081G23909r773J0792Q357Q557J1197J1368O057m698J1636N038J2116J0593P04
$$ 723909 714136 724928 733285 741842 753039 764407 770464 765766 777402 782440 794556 805149 805853
9068H05853o902R479r943m431J3114Q640k195J0734J6988P807k070R818N543N917
$$ 805853 798951 808430 798487 794056 807170 815810 813615 824349 841337 849144 847074 856892 862435 868352
9054H68352J6775n776k127l973J3516J9328K1651J3570K1639l70J669j0943j96
$$ 868352 885127 879351 877224 873251 886767 906095 927746 941316 962955 962585 964254 953311 953115
9041I53115J8845J2131R372J3568P507J3739R583P186p10K971J2019j288J2354
$$ 953115 971960 984091 993463 1007031 1014538 1028277 1037860 1045046 1044336 1047307 1059326 1058038 1070392
9028A070392J8127M080Q26p328Q583J6643R141J2755K8650Q753K1975J4447P676
$$ 1070392 1088519 1092599 1093425 1086097 1094680 1111323 1120464 1133219 1161869 1170622 1192597 1207044 1214720
9015A214720l659M252J3008J6946l385j0474J0696r03J3776K3437K0079J8532
$$ 1214720 1211061 1215313 1228321 1245267 1241882 1231408 1242104 1241201 1254977 1278414 1298493 1317025
9003A317025J2972K776L120J2627J0261K3095K1494J8973L067L91J3624K0955
$$ 1317025 1329997 1332773 1335893 1348520 1358781 1381876 1403370 1422343 1425410 1425801 1439425 1460380
8991A460380J7819J4283J4984K0548K0779K747J3936Q418P846P200O880Q3L1051
$$ 1460380 1478199 1492482 1507466 1528014 1548793 1551540 1565476 1573894 1581740 1588940 1595820 1595903 1626954
8978A626954K7533L6314J2474J0056J6105K5265L5480J7754J3217K3521J1528
$$ 1626954 1654487 1690801 1703275 1713331 1729436 1754701 1790181 1807935 1821152 1844673 1856201
8967A856201R665K1238J5114J4869J6750L2721K3225K1796Q382J0227J2751L1393
$$ 1856201 1865866 1887104 1902218 1917087 1933837 1966558 1989783 2011579 2019961 2030188 2042939 2074332
8955B074332L0904L3906J3560J5942K7261L8964L0410J2498L7347K6654L5962
$$ 2074332 2105236 2139142 2152702 2168644 2195905 2234869 2265279 2277777 2315124 2341778 2377740
8944B377740K2167K2136K0027J5886K9394K8692K4739J8721L7751L1213K0282
$$ 2377740 2399907 2422043 2442070 2457956 2487350 2516042 2540781 2559502 2597253 2628466 2648748
8933B648748J6638K6747M1679M1328K5100L0343L2062L5185K2795L4908L9931
$$ 2648748 2665386 2692133 2733812 2775140 2800240 2830583 2862645 2897830 2920625 2955533 2995464
8922B995464L8469L4740M9825M6621K8466L4912M3815L3177K4152L1391L7281
$$ 2995464 3033933 3068673 3118498 3165119 3193585 3228497 3272312 3305489 3329641 3361032 3398313
8911C398313M1231L1288M2665K8695L4942N0883N1143N1143M6502L4878K2042
$$ 3398313 3439544 3470832 3513497 3542192 3577134 3628017 3679160 3730303 3776805 3811683 3833725
8900C833725K9821L2769M3070M5390M1508M2518L6496M5957N0428N1345M8476
$$ 3833725 3863546 3896315 3939385 3984775 4026283 4068801 4105297 4151254 4201682 4253027 4301503
8889D301503N5839N1883L3889L4010M9578M5827K7951K2428N4473O2100M3605
$$ 4301503 4357342 4409225 4443114 4477124 4526702 4572529 4600480 4622908 4677381 4739481 4783086
8878D783086K7437L7913N6672P3942P1614O3288J15827J38078J31519P3078l5163
$$ 4783086 4810523 4848436 4905108 4979050 5050664 5113952 5229779 5367857 5499376 5572454 5537291
8867E537291q7561n1056j7673P826J8116J7911K1923K6781M5789L2112R567K4541
$$ 5537291 5449730 5398674 5381001 5388827 5406943 5424854 5446777 5473558 5519347 5551459 5561026 5585567
8855E585567J7565J3908K1292J2217J9482K2555K4136J4345J1441j00J114J0309
$$ 5585567 5603132 5617040 5638332 5650549 5670031 5692586 5716722 5731067 5742508 5742408 5743522 5753831
8843E753831R063P037J6077l369n545r552j0215q38j2405k1132j0832J901m210
$$ 5753831 5762894 5769931 5786008 5782639 5777094 5767542 5757327 5756489 5744084 5722952 5712120 5714021 5709811
8830E709811k4702l943q23k1645l1418k1024j7771k6646l2935k5542l2432j9500
$$ 5709811 5685109 5681166 5680343 5658698 5627280 5606256 5588485 5561839 5528904 5503362 5470930 5451430
8818E451430l4595n1608m3822k4620j6536k7422l5720l8651n3293l8990l9521
$$ 5451430 5416835 5365227 5321405 5296785 5280249 5252827 5217107 5178456 5125163 5086173 5046652
8807E046652l8114k4281n1284n5667l9619l3463n0909l4561l8207m5276n4353
$$ 5046652 5008538 4984257 4932973 4877306 4837687 4804224 4753315 4718754 4680547 4635271 4580918
8796D580918m5836m2144m7331m9759m1407m1166n5602l6217k9896l3111n4739
$$ 4580918 4535082 4492938 4445607 4395848 4354441 4313275 4257673 4221456 4191560 4158449 4103710
8785D103710n0739m0431m0161m0681l7534m5080l8685m2399m4703m4181m9578
$$ 4103710 4052971 4012540 3972379 3931698 3894164 3849084 3810399 3768000 3723297 3679116 3629538
8774C629538l3168m7192m6973l8721l3823n9821n4324m2801l7518l2423k3876
$$ 3629538 3596370 3549178 3502205 3463484 3429661 3369840 3315516 3272715 3235197 3202774 3178898
8763C178898k3913l3965m1454k8367k4069l5606l9560k8155l5451l4467l9041
$$ 3178898 3154985 3121020 3079566 3051199 3027130 2991524 2951964 2923809 2888358 2853891 2814850
8752B814850m3635l6142l5531l3612l0517k6764m0200k9063k3206j4721j8132
$$ 2814850 2771215 2735073 2699542 2665930 2635413 2608649 2568449 2539386 2516180 2501459 2483327
8741B483327k6430l8578l5889l4789m7072l0308j9125k9371k5087k8999k4195
$$ 2483327 2456897 2418319 2382430 2347641 2300569 2270261 2251136 2221765 2196678 2167679 2143484
8730B143484l5272k5972j3079k0754j7101j5505k5323l5221l0052j9187p841k3219
$$ 2143484 2108212 2082240 2069161 2048407 2031306 2015801 1990478 1955257 1925205 1906018 1898177 1874958
8718A874958j6554k3155j6953j7975j7401k2874k8439l5093j6100j5986k1218
$$ 1874958 1858404 1835249 1818296 1800321 1782920 1760046 1731607 1696514 1680414 1664428 1643210
8707A643210j6264j6691j1361k4963k6502j4353r111K24k8332k4781q807n245
$$ 1643210 1626946 1610255 1598894 1573931 1547429 1533076 1523965 1524189 1495857 1471076 1462269 1457024
8695A457024k8023l8073q349j106j3800n602k2810j5379j5319j6364r813o200
$$ 1457024 1429001 1390928 1382579 1381473 1367673 1362071 1339261 1323882 1308563 1292199 1282386 1276186
8683A276186q823q034j9752j4231r157k1358j0026j1470r066r10k0583q712o738
$$ 1276186 1267363 1259329 1239577 1225346 1216189 1194831 1184805 1173335 1164269 1163359 1142776 1134064 1127326
8670A127326k0714j7377j8669k799r141j1121q198j2834o603j0552l357l921p426
$$ 1127326 1106612 1089235 1070566 1067767 1058626 1047505 1039307 1026473 1019870 1009318 1005961 1002040 994614
8657I94614L830j079j8432j4124k0972j465K741n825j8213k7123k1632l697j0438
$$ 994614 998444 997365 978933 964809 943837 942372 945113 939288 921075 893952 872320 868623 858185
8644H58185n992n167M194j9289m772j2124R814J1129k0027j7715j1421r734l459
$$ 858185 852193 847026 851220 831931 827159 815035 824849 835978 815951 798236 786815 777081 773622
8631G73622r826p781J2897o079j0571r395j082J720o677K811M204j5351k8471
$$ 773622 763796 756015 768912 762833 752262 742867 741785 743505 736828 739639 743843 728492 700021
8618G00021q091J316J481q075j3765K07R631N363j6901k2360L318k838j209P379
$$ 700021 691930 693246 694727 686652 672887 673094 682725 688088 671187 648827 652145 649307 648098 655477
8604F55477j347L298k339j0109n477K518J5192J7417K983L701r550O899K0916
$$ 655477 654130 657428 655089 644980 639503 642021 657213 674630 677613 681314 671764 678663 699579
8591F99579P692k871n17k2101j7155j1640m3273j2427m09O91m453j3688l1580
$$ 699579 707271 704400 703883 681782 664627 652987 609714 597287 596878 597569 593116 579428 547848
8578E47848n120o534p608m840K90k0934r054J912K599o41j3972k2576R463r741
$$ 547848 542728 536194 528586 523746 524036 503102 494048 495960 498559 497918 483946 461370 470833 461092
8564D61092j3529J1529k34j5102K20l138K783N381m733j6231k1819O738k721p672
$$ 461092 447563 459092 458858 443756 443976 440838 443621 449002 444269 428038 406219 412957 410236 402564
8550D02564J0268P055q716j4138j0825J0786j509M32K751Q399N722k425m658j0657
$$ 402564 412832 419887 411171 397033 386208 396994 395485 395917 398668 407067 412789 410364 405706 395049
8536C95049J88o599k221R732L799j498j4091l872N339p858j2884P194l230k8081
$$ 395049 395237 388638 386417 396149 399948 398450 384359 380487 385826 377968 365084 372278 369048 340967
8522C40967m382k87P545k63r588m234n203q302o797p047M960m480m812O115M547
$$ 340967 336585 336298 343843 343580 333992 329758 324555 316253 309456 302409 307369 302889 298077 304192 308739
8507C08739M142O778j2808j8774q308J8049J0833O145j6899j3446Q009j718o627
$$ 308739 312881 319659 306851 288077 279769 297818 308651 314796 297897 284451 292460 290742 284115
8494B84115q685p792j5571Q975K4681k633j4069o398k6N093J1976M377j5146Q38
$$ 284115 275430 267638 252067 261042 285723 283090 269021 262623 262597 267690 279666 284043 268897 269735
8480B69735l372N692P395N252J2912R081j6968k0085j5051m990K916m501l753
$$ 269735 266363 272055 279450 284702 297614 306695 289727 269642 254591 249601 252517 248016 244263
8467B44263J540J6043q389j7246J3149J2271J2538j3142l2717K611N67M667R658
$$ 244263 245803 261846 253457 236211 249360 261631 274169 261027 228310 230921 231488 236155 245813
8454B45813j4931L446q239r390O818J4603l796m238J374j839J53N17j630q859
$$ 245813 230882 234328 226089 216699 223517 238120 234324 230086 231460 229621 229774 230291 228661 219802
8440B19802l201K05O178j909O78p186j2640Q098J1338M626j5569k677m989j2036
$$ 219802 216601 216806 222984 221075 221753 214567 201927 210025 221363 225989 210420 207743 202754 190718
8426A90718l140L882J0M387R945j8442j1331Q419K800N553L547j2307m854p442
$$ 190718 187578 191460 191470 195857 205802 187360 176029 184448 187248 192801 196348 184041 179187 171745
8412A71745m865m041J2427j581q796K445J335J6048L185j0952k463p9J036j5594
$$ 171745 166880 162839 175266 173685 164889 167334 168669 184717 187902 176950 174487 174408 175444 159850
8398A59850j6776P393P092k585J4955J5547P073N456R109j5964k0219o414j7401
$$ 159850 143074 150467 157559 154974 169929 185476 192549 198005 207114 191150 170931 164517 147116
8385A47116l36L602R353j905j0555J5005M640j811k04q422l687n714J355p720
$$ 147116 146780 150382 159735 157830 147275 162280 166920 165109 164905 156483 152796 147082 148437 140717
8371A40717K765J4845J1908k121j5034N72o132p124k528r73j251Q392J7546j22
$$ 140717 143482 158327 170235 168114 153080 153652 147520 140396 137868 136895 135644 144036 161582 161460
8357A61460n863o283j0826K018P079l401q40m380J4635O989j2671O314J4459j5051
$$ 161460 155597 149314 138488 140506 147585 144184 143344 138964 153599 160588 147917 154231 168690 153639
8343A53639q221q391p591J1370J9842J0890P33j4062j2961k348l229J1044j227
$$ 153639 145418 137027 129436 140806 160648 171538 172271 158209 145248 142900 139671 150715 149488
8330A49488j226K1611p435J128l516p727k8330J740P190l286K082m430j5963j368
$$ 149488 148262 169873 162438 163566 160050 152323 123993 125733 132923 129637 131719 127289 111326 109958
8316A09958M266l55p352J774M848j594k574J0340q8J1178M570k0095q767P63O380
$$ 109958 114224 113869 106517 108291 113139 111545 108971 119311 119223 130401 134971 114876 106109 106872 113252
8301A13252N490K41L385q618Q929Q501o29r367j0414l356N851Q454m713j022M277
$$ 113252 118742 118983 122368 113750 122679 131180 130551 121184 110770 107414 113265 121719 117006 115984 120261
8286A20261J1275J2734J6484K5538N471j2212j3054k5967j9596r657k169j6174
$$ 120261 131536 144270 160754 186292 191763 179551 166497 140530 120934 111277 109108 92934
8274I2934J1807M726l309j144N275P515R77j5024j4546N433J898O903N298O382
$$ 92934 104741 109467 106158 105014 110289 117804 118781 103757 89211 94644 96542 103445 108743 115125
8260A15125m98n125k821l424Q078m625j738j1303m573j564j80J1296R644j0291
$$ 115125 114627 109502 106681 103257 111335 106710 104972 93669 89096 87532 87352 98648 108292 98001
8246I8001o825R674j2737k1277Q751K7964J7635r640R529k884j7057j9180j4035
$$ 98001 91176 100850 88113 66836 75587 103551 121186 111546 121075 118191 101134 81954 67919
8233F7919J885Q898J3115J1586p099n112k898M294p775n600Q371K0454l165j4586
$$ 67919 69804 78702 91817 103403 96304 91192 88294 92588 84813 79213 87584 108038 104873 90287
8219I0287p412K280j653j1472j3084J0176J5739J3752R962l396j2583m007p110
$$ 90287 82875 85155 83502 72030 58946 69122 84861 98613 108575 105179 92596 88589 81479
8206H1479L976J4252J2367O684j8578j9645J202l186m252M311J4947O263j2641
$$ 81479 85455 99707 112074 118758 100180 80535 81737 78551 74299 78610 93557 99820 87179
8193H7179j2425O570K970O396K524o471m498j0912j0281N715j871O607J2299m757
$$ 87179 74754 81324 84294 90690 93214 86743 82245 71333 61052 66767 64896 71503 83802 79045
8179G9045k479j4971p192M127J1689j951K12p195j1709O318M781n239m103K538
$$ 79045 76566 61595 54403 58530 70219 68268 68480 61285 49576 55894 60675 55436 51333 53871
8165E3871M445j6364k0J4335J4890O497j3161p285j81j574J3995J2604l221j3288
$$ 53871 58316 41952 41932 56267 71157 77654 64493 57208 57027 55453 69448 82052 78831 65543
8151F5543J5149J617k348k558n909Q388L782o005k984k011p439j9862j1250J118
$$ 65543 80692 82309 79961 77403 71494 79882 83664 77659 74675 72664 65225 45363 34113 35231
8137C5231k637J9046J523J1431L394m026L953p951O816q862r54K641o093O479
$$ 35231 32594 51640 53163 64594 67988 63962 67915 59964 66780 57918 56964 59605 53512 59991
8123E9991L749j019J2160r267k5113P299M525m097P645J3416j8647m677J3946
$$ 59991 63740 62721 74881 65614 40501 47800 52325 48228 55873 69289 50642 45965 59911
8110E9911j2607o317J3256m624k0947k240J6222J887N471J3415P943R423L759
$$ 59911 47304 40987 54243 49619 28672 26432 42654 44541 50012 63427 71370 80793 84552
8097H4552j1920m389j0319j1002N114n783N394R430P216j5350K943J917N474Q110
$$ 84552 72632 68243 57924 46922 52036 46253 51647 61077 68293 52943 55886 57803 63277 71387
8083G1387j438q150l624K06N631J0801R38J317L663q512n514m125m537k858o979
$$ 71387 69949 61799 58175 58381 64012 74813 75751 77068 80731 72219 66705 62580 58043 55185 48206
8068D8206Q551L921O969k966l286K376L746N596R706R232L654j0437r978k1888
$$ 48206 56757 60678 67647 64681 61395 63771 67517 73113 82819 92051 95705 85268 75290 53402
8054E3402J034J0496J7115R541n96P7n510j2891j225k599j949N772J0141P812
$$ 53402 54436 64932 82047 91588 90992 91069 85559 72668 71443 68844 66895 72667 82808 90620
8040I0620p33p100r873n488n249j290o572l594k679k217R434j1725J12R463O148
$$ 90620 89887 82787 72914 67426 62177 60887 54315 50721 48042 45825 55259 43534 43646 53109 59257
8025E9257k339P896p354L178N553L964n325J3388M541j077M883k133j5292j0128
$$ 59257 56918 64814 57460 60638 66191 70155 64830 78218 82759 81682 86565 84432 69140 59012
8011E9012J0379J0699M626J2836l601j0206j6622O857J964k2038j2174P519J0632
$$ 59012 69391 80090 84716 97552 93951 83745 67123 73980 75944 53906 41732 49251 59883
7998E9883J0855O570R936M505j2615o373L831k86m786r204L084K870m467k290
$$ 59883 70738 77308 87244 91749 79134 72761 76592 76306 71520 62316 65400 68270 63803 61513
7984F1513n796j1131J871l065R227J8050q593j2969M909k166O442p334R17J5119
$$ 61513 55717 44586 46457 43392 52619 70669 62076 49107 54016 51850 58292 50958 51875 66994
7970F6994L374K851N042n612l393p340q405N084Q876J7260q064j1040n887J0211
$$ 66994 70368 73219 78261 72649 69256 61916 53511 58595 67471 84731 76667 65627 59740 69951
7956F9951n913j0915j2616K777K1402N423m154q182j6145k307N575K042l08m193
$$ 69951 64038 53123 40507 43284 64686 70109 65955 57773 41628 39321 44896 46938 46630 42437
7942D2437Q621O153l886m718N149O207m323j2202j1849K211J2695O363J6977p46
$$ 42437 51058 57211 53325 48607 53756 59963 55640 43438 31589 33800 46495 52858 69835 69089
7928F9089r620n107q829j7581K587K791J576k550n186o052J5435J3242J5878m618
$$ 69089 59469 54362 45533 27952 30539 33330 34906 32356 27170 21118 36553 49795 65673 61055
7914F1055l236R40j1281j2360O68J678o398J0109J955N371p61n566N776j18j3767
$$ 61055 57819 58759 47478 35118 35786 37464 31066 41175 43130 48501 47740 42174 47950 47832 34065
7899C4065r013j2130k663P222J3126P663R493J0900M672j1041l955p708k032O21
$$ 34065 25052 12922 10259 17481 30607 38270 47763 58663 63335 52294 48339 40631 38599 39220
7885C9220l015O653J0162q764n41k804K864J710q860j233r700j829J5413r422
$$ 39220 36205 42858 53020 44256 43715 40911 43775 45485 36625 35392 25692 23863 39276 29854
7871B9854o334R432Q835J958L131r539n967o765j2251n026J5786J0988N092J907
$$ 29854 23520 32952 41787 43745 46876 37337 31370 24605 12354 7328 23114 34102 39194 41101
7857D1101j3701O83N765j2364j791O720l901J0612N673N209P797n558j5726k5050
$$ 41101 27400 28083 33848 21484 19693 26413 22512 33124 38797 44006 51803 46245 30519 5469
7843E469O372Q066J4106P351q169j3118j1720J7514J8297p523m302q903m267m445
$$ 5469 11841 19907 34013 41364 33195 20077 8357 25871 44168 36645 32343 23440 19173 14728
7829A4728j792r611M351J1883P136k399J237K065j3806o417M080R064J33j122
$$ 14728 12936 3325 7676 19559 26695 24296 25533 27598 13792 7375 11455 20519 20652 19530
7815A9530q773j5709m039J0315J6640J4594k518j3912J4504K718r438m104p216
$$ 19530 10757 -4952 -8991 1324 17964 32558 30040 16128 30632 33350 23912 19808 12592
7802A2592J1259J1956O659J234j4536k0659j5727L945J1073N459L959K438J8818
$$ 12592 23851 35807 42466 43700 29164 8505 -7222 -3277 7796 13255 17214 19652 38470
7789C8470R197R21j1602j9935n58L1o786l786k67j59L462J1341K0312M814j7846
$$ 38470 47667 48588 36986 17051 16493 16524 9738 5952 5685 5526 8988 20329 40641 45455 27609
7774B7609k341N302p185L078L543j830j5268j6281Q346L977K0863L945j2171m002
$$ 27609 25268 30570 23385 26463 30006 28176 12908 -3373 4973 8950 29813 33758 21587 17585
7760A7585n044M97J1139L103l88k1176j0246Q642P746J754M326J374M069J0052
$$ 17585 12541 13038 24177 27280 26892 5716 -4530 4112 11858 13612 17938 19312 23381 33433
7746C3433O550O841j0396L998m245m747J033m789J1704P460r385k882j940j2757
$$ 33433 39983 46824 36428 40426 36181 31434 32467 27678 39382 46842 37457 34575 32635 19878
7732A9878j92M977K244k079J1799K328o895q599J7893N877j792P98l816L93l529
$$ 19878 19686 24663 26907 24828 36627 38955 32060 23461 41354 47231 45439 46237 42421 42814 39285
7717C9285j0666m967M319J368R495j3113p111P011J923j520j5174m896O602k221
$$ 39285 28619 23652 27971 29339 38834 25721 18610 25621 27544 26024 10850 5954 12556 10335
7703A0335q905L32k946M680N087J4790J1866j0199k4499M982J0813M013K14j1842
$$ 10335 1430 1762 -1184 3496 8583 23373 35239 25040 541 5523 16336 20349 20563 8721
7689H721K126R399n447o370l925N191m054K919O895j711o132n761J8518P868m653
$$ 8721 10847 20246 14799 8429 4504 9695 5641 8560 15455 13744 7612 1851 20369 28237 23584
7674B3584n100l179O690J610L562j289N877J9699J907j365r326j5875O678J7688
$$ 23584 18484 15305 21995 23605 27167 25878 31755 51454 53361 51996 42670 26795 33473 51161
7660E1161K707m121q209k015l274J585P19j945l283r059M107l974P675N080j1950
$$ 51161 53868 49747 41538 39523 36249 37834 38553 36608 33325 24266 28373 24399 32074 37154 25204
7645B5204n441o253R613L779p832k961J6757K3248j7121k5111o394Q958J3916
$$ 25204 19763 13510 23123 26902 19070 16109 32866 56114 38993 13882 7488 16446 30362
7632C0362R213n545r647j6666R78L975R299j065j1197j2826j318m896m326J3262
$$ 30362 39575 34030 24383 7717 8695 12670 21969 20904 9707 -3119 -4437 -9333 -13659 -397
7618c97R633r90K71P209J2210n714j3548L91K561R81j0893O276J1169N143J0482
$$ -397 9236 8246 8517 15726 27936 22222 8674 9065 11626 12607 1714 7990 19159 24302 34784
7603C4784K874j3516p352j5370j266N995P07O409k275j7069m908J4709P452k950
$$ 34784 37658 24142 16790 1420 154 6149 6856 13265 10990 -6079 -10987 3722 11174 8224
7589H224l787M527N15J0091p32Q498m726n364q533J9306N741l452j3513j3607
$$ 8224 4437 8964 9479 19570 18838 27336 22610 17246 8713 28019 33760 30308 16795 3188
7575C188j1405r148J4219P452r102L60P070J3338J2960R216j1250n849K271l662
$$ 3188 -8217 -17365 -3146 4306 -4796 -4436 2634 15972 28932 38148 26898 21049 23320 19658
7561A9658Q5n920l004K53l936L268j2627J640r692Q767N978j231J1898P469J2394
$$ 19658 19743 13823 10819 11072 7136 10404 -2223 -583 -10275 -1508 4470 3239 15137 22606 35000
7546C5000j6934j0630P258l958p480r997P006Q275J055P084j0749j5663N962Q000
$$ 35000 18066 7436 14694 10736 3256 -6741 265 8540 9595 16679 5930 -9733 -3771 4229
7532D229P199M69k784P492l265q685q55L324J8851J1183j0476n452K012n858j1735
$$ 4229 11428 11897 9113 16605 13340 4655 3800 7124 25975 37158 26682 21230 23242 17384 5649
7517E649Q570j1195j6356N748J1270J143N793r485J211J2134j534j9123O677l32
$$ 5649 14219 3024 -13332 -7584 3686 4829 10622 1137 2348 14482 12948 -6175 502 170
7503A70l345o665k709O014O039p087k731p91J461j906j571R95J5660n509j2698
$$ 170 -3175 -9840 -12549 -6535 -496 -7583 -10314 -11105 -9644 -11550 -13121 -12126 3534 -1975 -14673
7488a4673j0066J1439L605J4301O448j919k199j08j620K304o666P401o052j2020
$$ -14673 -24739 -13300 -9695 4606 11054 9135 6936 6828 5208 7512 846 8247 2195 -9825
7474i825Q261L981m066n01j590M573K889J3655M44j691m199K489K488j794P049
$$ -9825 -1564 2417 -1649 -2150 -3740 833 3722 17377 17821 16130 11931 14420 16908 15114 22163
7459B2163N483j2379j4836o297r016J2169O452n769L449R455j543K230j5676l171
$$ 22163 27646 15267 431 -5866 -14882 -2713 3739 -2030 1419 10874 9331 11561 -4115 -7286
7445g286q61Q094K600O115O034J1234J54q994M686K066j1233k441K109o446m710
$$ -7286 -8147 -53 2547 8662 14696 25930 26084 17090 21776 23842 12609 10168 12277 5831 1121
7430A121J0216j0155Q166J2092J2132l217j2198J409J006N728o820O375K853j9814
$$ 1121 11337 1182 9348 21440 33572 30355 18157 19566 20572 26300 19480 25855 28708 8894
7416H894j4906n290K183P519J59K0287K349m826j4248L260P953n983N392J5479
$$ 8894 -6012 -11302 -9119 -1600 -1441 18846 21195 16369 2121 5381 13334 7351 12743 28222
7402B8222O82j3588j766M222K4n222P651k081L171K227j6172k223J698K963J731
$$ 28222 28904 15316 13550 17772 17796 12574 20225 18144 21315 23542 7370 5147 6845 9808 11539
7387A1539o226J37j4817M303Q234R81p919l758M040J8087N513j6040k132J8257
$$ 11539 5313 5450 -9367 -5064 3170 4151 -3768 -7526 -3486 14601 20114 4074 1942 20199
7373B0199K767n229j9510j0807L122J3267K6357Q476m799k0365j6191j3514o723
$$ 20199 22966 17737 -1773 -12580 -9458 3809 30166 38642 33843 13478 -2713 -16227 -22950
7360b2950M994O327O620n766q702K064R168L499J1405o778o549K367P711M846
$$ -22950 -17956 -11629 -5009 -10775 -19477 -17413 -8245 -4746 6659 -119 -6668 -4301 3410 8256
7346H256l463m241j1735j923O575J3317Q056r618l128J201k539L885O16k306J4634
$$ 8256 4793 552 -11183 -13106 -6531 6786 14842 5224 2096 3297 758 4643 5259 2953 17587
7331A7587K683k862O207J9560j5359j1805q200r580l884K271J1040J4391j216
$$ 17587 20270 17408 23615 43175 27816 16011 7811 -1769 -5653 -3382 7658 22049 20833
7318B0833j7400j6703K668o52J3624j306r533J2343n477j2735J229N164m218J982
$$ 20833 3433 -13270 -10602 -11254 2370 1064 -8469 3874 -1603 -14338 -13109 -7945 -12163 -10181
7304a0181j0140q502L766J122J7293p274N78J4279r42q410r367K821O475K993
$$ -10181 -20321 -28823 -25057 -23935 -6642 -13916 -13338 941 -1 -8411 -17778 -14957 -8482 -5489
7290e489J4357R071P669j41r351q327Q255j244m643N628q194J575k695l517R241
$$ -5489 8868 17939 25608 25467 16116 7789 16044 14800 10157 15785 7591 9166 6471 2954 12195
7275A2195O293J1713j171k6112o82Q791J413q618k273J0688J4086Q480l121j2511
$$ 12195 18488 30201 29030 2918 2236 11027 12440 3822 1549 12237 26323 34803 31682 19171
7261A9171l807j4435j088M365O6J473P639M163J1191J4461m345j0869k2623k9416
$$ 19171 15364 929 -159 4206 4272 5745 13384 17547 28738 43199 38854 27985 5362 -24054
7247b4054j478Q715J0318J6669j956j3293j9462r35J4795l963M174J2638J142
$$ -24054 -25532 -16817 -6499 10170 8214 -5079 -24541 -25476 -10681 -14644 -10470 2168 3310
7234C310P446Q10q575Q281M01q870j2723q218N069R680J1861L73M103k067m077
$$ 3310 10756 11566 2991 11272 11673 2803 -9920 -18138 -13069 -3389 8472 8845 12948 10881 6804
7219F804k029K666O202J0385j1415j0148M202R317M099j3096j7764j1399l83O067
$$ 6804 4775 7441 13643 24028 12613 2465 6667 15984 20083 6987 -10777 -22176 -22559 -16492
7205a6492L947J2262J0669l403N663O056j3116j987L891M708O154K637M433N901
$$ -16492 -12545 -283 10386 6983 12646 18702 5586 3599 7490 12198 18352 20989 25422 31323
7191C1323P153j1152j3285j0750N678J825N892k750j413j4209n868J0759R328
$$ 31323 38476 27324 14039 3289 8967 10792 16684 13934 12521 -1688 -7556 3203 12531
7178A2531p222q700k590p761Q344O965J21q047N939M78n562p379k717N545N904
$$ 12531 5309 -3391 -5981 -13742 -5398 1567 1688 -6359 -420 58 -5504 -12883 -15600 -10055 -4151
7163d151j198M819O343P603J9126j4806j0306M308l241N37n25q621j0223M774
$$ -4151 -5349 -530 5813 13416 32542 17736 7430 11738 8497 9034 8509 -112 -10335 -5561
7149e561Q52o789Q455L506P855j245o034J9590O022j4991j4692k838J793N049
$$ -5561 -4709 -11498 -3043 463 8318 7073 1039 20629 26651 11660 -3032 -5870 -4077 972
7135I72J10l217J0310K467q93j026n377N565N107j3063j277K495o610N848N176
$$ 972 1082 -2135 8175 10642 9749 8723 3346 8911 14018 955 -322 2173 -4437 1411 6587
7120F587N044j9904L776P915k039J138j702N699k890j2926K180J4642m404r883
$$ 6587 11631 -8273 -4497 3418 1379 2517 815 6514 3624 -9302 -7122 7520 3116 -6767
7106f767j573j191L862J1923r65l400R379j1165R02j482N759K362M412p345j5232
$$ -6767 -8340 -9531 -5669 6254 5289 1889 11268 103 1005 -477 5282 7644 12056 4711 -10521
7091a0521r251K3433Q675j6780R2J2856j761O650j4246J115n199R870q887Q927
$$ -10521 -19772 3661 12336 -4444 -4352 8504 6743 13393 -853 262 -4937 4933 -3954 4973
7077D973J8471p165o965j0557n025J2831J4323n376p526J08q923J637M715J4071
$$ 4973 23444 16279 9314 -1243 -6268 6563 20886 15510 7984 8092 -831 806 5521 19592
7063A9592M653r559K073p638j0425P791Q339n700j2263J5718J4320n19q001N325
$$ 19592 24245 14686 16759 9121 -1304 6487 14826 9126 -3137 12581 26901 26382 18381 23706
7049B3706n456m227l398p231L394n608j494N321j1222M21k723L382n749j056K2784
$$ 23706 18250 14023 10625 3394 6788 1180 -314 5007 -6215 -5794 -8517 -5135 -10884 -11940 10844
7034A0844J865o617q810j0997K866J4865k665j3886n045O064O75L451q569j2689
$$ 10844 12709 6092 -2718 -13715 -10849 4016 1351 -12535 -17580 -11516 -10841 -7390 -15959 -28648
7020b8648p335J5941J2410J3229N037j2510j2339N484J563j0174m260K864J7540
$$ -28648 -35983 -20042 -7632 5597 10634 -1876 -14215 -8731 -7168 -17342 -21602 -18738 -1198
7007a198R135P650p945p895l762k501p746J3323K807n384q365R186J5738N17m436
$$ -1198 7937 15587 7642 -253 -4015 -6516 -14262 -939 1868 -3516 -11881 -2695 13043 13560 9124
6992I124J751j7748m596J1431n438j0082J3640Q940K85m447N095j884R195Q2r953
$$ 9124 10875 -6873 -11469 -38 -5476 -15558 -1918 7022 7307 2860 7955 6071 15266 15348 5395
6977E395j105q907p753P358j370o152M465J732M659K868k676j231L923j6646n939
$$ 5395 4290 -4617 -12370 -5012 -6382 -12534 -8069 -6337 -1678 1190 -1486 -2717 1206 -15440 -21379
6962b1379m58M954N294J974L321R420j1457j4875J2396J1535N530p83J1626n112
$$ -21379 -21837 -16883 -11589 -9615 -6294 3126 -8331 -23206 -10810 725 6255 5472 17098 11986
6948A1986k550r580j931l63k568p589p252J2535J1644j860p337L435L291l259
$$ 11986 9436 -144 -2075 -2438 -5006 -12595 -19847 -7312 4332 2472 -4865 -1430 1861 -1398
6934a398N186O696M275q628l632J452P882K760n98R763L14O87j6177j6556J1388
$$ -1398 3788 10484 14759 6131 2499 3951 11833 14593 13995 23758 24072 24759 8582 -7974 3414
6919C414L260m579J2347J0781j4314n067p590j1992J0139N001r834J715Q600M383
$$ 3414 6674 2095 14442 25223 10909 5842 -1748 -13740 -3601 1400 -8434 -6719 1881 6264
6905F264m595J4251M513j057r081j4534M789J871j299j275P987n276j5269J1267
$$ 6264 1669 15920 20433 19376 10295 -4239 550 2421 1122 -153 7834 2558 -12711 -1444
6891a444J8510k461k133Q030L020j5509K14N923M733L070n251l700j0675q662
$$ -1444 17066 14605 12472 20502 23522 8013 8227 14150 18883 21953 16702 13002 2327 -6335
6877f335R535J0732n21k664j7663r102J9066L79r63L808l190j6780n437q20N471
$$ -6335 3200 13932 13411 10747 -6916 -16018 3048 3427 2464 6272 3082 -13698 -19135 -19955 -14484
6862a4484p621O147J282j446P097L205J0426J4752K341o481o839o834k1388J2183
$$ -14484 -22105 -15958 -14676 -16122 -9025 -5820 4606 19358 21699 15218 8379 1545 -19843 -7660
6848g660J4110l939o275J2751J267P158K982K657p025j0990m256k648R088J4398
$$ -7660 6450 2511 -3764 8987 10254 17412 20394 23051 16026 5036 780 -1868 7220 21618
6834B1618O439k091q901k1153Q755J7584O921l11K843p609l561o79J791k990O143
$$ 21618 28057 25966 17065 -4088 4667 22251 29172 28861 31704 24095 20534 19855 21646 18656 24799
6819B4799p953j34K092l605L095n72l010r972j0084N43M518L512j0896k777J207
$$ 24799 16846 16712 18804 15199 18294 17722 14712 4740 -5344 -4801 -283 3229 -7667 -10444 -9237
6804i237R27N715J8457J2518k895k0553r088k836Q810J5910Q035o198k373l651
$$ -9237 -8310 -2595 15862 28380 25485 4932 -4156 -6992 1818 17728 25763 19565 17192 13541
6790A3541M234N985o034j8784r343j677O362m993r421O340m65N863J1850j701
$$ 13541 17775 23760 17726 -1058 -10401 -12078 -5716 -10709 -20130 -13790 -14255 -8392 3458 1757
6776A757R612k754j077r391j079J966p905M041J0903J552p947K347O65l807P427
$$ 1757 11369 8615 7538 -1853 -2932 -966 -8871 -4830 6073 7625 -322 2025 2690 -1117 6310
6761F310J0724m187r325j231J1424N418l489j7233n864J811Q410Q933R908K41
$$ 6310 17034 12847 3522 2291 13715 19133 15644 -1589 -7453 -5642 2768 11701 21609 21850
6747B1850j7531p093P086p760r960o209J037J5100j575M04Q933J952m723L722
$$ 21850 4319 -2774 4312 -3448 -13408 -19617 -18580 -3480 -5055 -4651 4282 6234 1511 5233
6733E233J612n257K070N49Q114O938n931k891j296n550j9002L355J0392m8M299
$$ 5233 6845 1588 3658 4207 12321 19259 13328 10437 9141 3591 -15411 -12056 -1664 -1712 2587
6718B587k9P318J2465M246j4485k4365n261Q244m145r324J2191J8737M240O67
$$ 2587 2558 9876 22341 26587 12102 -12263 -17524 -9280 -13425 -22749 -10558 8179 12419 13086
6704A3086j54j6532P178K202q282j3091J2823Q951j613j1441R766J1326L586m217
$$ 13086 12932 -3600 3578 5780 -2502 -15593 -2770 6181 4568 -6873 2893 14219 17805 13588
6690A3588j1769l678Q147K760j2148K562Q636K859N625m692r439j092j0960P818
$$ 13588 1819 -1859 6288 9048 -3100 -538 8098 10957 16582 11890 2451 1359 -9601 -1783
6676a783Q409M320N363K489j4299j9496p574o69o42J1967J2941n263m081l477
$$ -1783 6626 10946 16309 18798 4499 -14997 -22571 -23240 -23882 -11915 1026 -4237 -8318 -11795
6662a1795k474N46K243J1630P136K154k935k349j236J469J558m827n143o366n310
$$ -11795 -14269 -13723 -11480 150 7286 9440 6505 4156 2920 4389 5947 1120 -4023 -10389 -15699
6647a5699L575J6824o521j266p238n907q10M836J0511O995p128j632n132o058
$$ -15699 -12124 4700 -1821 -3087 -10325 -16232 -17042 -12206 -1695 5300 -1828 -3460 -8592 -14650
6633a4650L049K061R942Q284J659m186Q391j2218l471k16n479J145m215N580j157
$$ -14650 -11601 -9540 402 8686 10345 6159 14550 2332 -1139 -1355 -6834 -5689 -9904 -4324 -5481
6618e481J510J249k147o723k228l421j4236J0869J8889j828j298o232Q052k529
$$ -5481 -3971 -2722 -4869 -11592 -13820 -17241 -31477 -20608 -1719 -3547 -4845 -11077 -3025 -5554
6604e554p585K348l688k390l790P066J4325M928j3431p95J2756Q878k318j0014
$$ -5554 -13139 -10791 -14479 -16869 -20659 -13593 732 5660 -7771 -8566 4190 13068 10750 736
6590G36j248m588k261m111m810P32N124k737j4968n088K0942P565K429j248O36
$$ 736 -512 -5100 -7361 -11472 -16282 -15550 -10426 -13163 -28131 -33219 -12277 -4712 -2283 -3531 -2895
6575b895l023p163l522P150o5J6435N996n935j3712N788J2578j4196m65M861r877
$$ -2895 -5918 -13081 -16603 -9453 -9518 6917 12913 6978 -6734 -946 11632 -2564 -3029 1832 -8045
6560h045J0582j15J28o60j2054o372P293j051L10J2395P401l013P651l552k987
$$ -8045 2537 2422 2550 1890 -10164 -16536 -9243 -10294 -9984 2411 9812 6799 14450 10898 7911
6545G911j4257r468j305m205O759j594p708k679O94J1884Q422M900L956j7253
$$ 7911 -6346 -15814 -17119 -21324 -14565 -16159 -23867 -26546 -25852 -13968 -5546 -646 3310 -13943
6531a3943L889M210n809r829N6K3860j089O502O358n10j1614j918Q363M37k990
$$ -13943 -10054 -5844 -11653 -21482 -21426 2434 1345 7847 14205 13695 2081 163 8526 8963 5973
6516E973l089M781n152r326j246R295l474K438M805l16J2406j405l004l821j2238
$$ 5973 2884 7665 2513 -6813 -8059 1236 -2238 200 5005 4689 17095 15690 12686 8865 -3373
6501c373l109K760l828l964Q755M513L430N894k025m804j6765m331J024L1703
$$ -3373 -6482 -3722 -7550 -11514 -2759 1754 5184 11078 9053 4249 -12516 -16847 -15823 15880
6487A5880Q003j4733L394R969n406j2271j4576j1265j0104k951M275K2408L757
$$ 15880 23883 9150 12544 22513 17107 4836 -9740 -21005 -31109 -34060 -29785 -7377 -3620
6474c620j1827O885Q329l728l784K1776J2280n061j4330n113M339Q200l311L726
$$ -3620 -15447 -8562 -233 -3961 -7745 14031 26311 21250 6920 1807 6146 14346 11035 14761
6460A4761l427j970j7051l70M12N447k206l610R24Q089l643j285O559N983N731
$$ 14761 11334 9364 -7687 -8057 -7645 -2198 -4404 -8014 -7090 999 -2644 -3929 2630 8613 14344
6445A4344j589K392j4242o868P095J5787l430j0539m560P769n308K782O079K498
$$ 14344 12755 15147 905 -5963 1132 16919 13489 2950 -1610 6159 851 3633 9712 12210
6431A2210O506J0877O855o202j8477m953l199O63N306L756R049M36L905K631M782
$$ 12210 18716 29593 36448 30246 11769 6816 3617 4280 9586 13342 22391 22827 26732 29363 34145
6416C4145q906j359M053l885j4549n187Q423j872l992M04J599K675p548L955J543
$$ 34145 25239 23880 27933 24048 9499 4312 12735 10863 6871 7275 8874 11549 4001 7956 9499
6401I499K609L526m373j0981j48k493k877L023j4643K660K743O62Q531L338J6274
$$ 9499 12108 15634 11261 280 132 -2361 -5238 -2215 -16858 -14198 -11455 -10793 -2262 1076 17350
6386A7350j3318j4297k501J0356Q247J240l127M176N830l677o627l870m931k2893
$$ 17350 4032 -10265 -12766 -2410 5837 7077 3950 8126 13956 10279 3652 -218 -5149 -28042
6372b8042R677K582Q338O657J241q598L695J4728m585O879p123j7661n003J8921
$$ -28042 -18365 -15783 -7445 -788 453 -8145 -4450 10278 5693 12572 5449 -12212 -17215 1706
6358A706N161j0653n629p28Q503Q590Q069M488o52o708k2826l210N628L155J2849
$$ 1706 6867 -3786 -9415 -10143 -1640 6950 15019 19507 18855 12147 -10679 -13889 -8261 -5106 7743
6343G743p422k2487m126L179R510J9353J4813q462j8887k938J0752J334p83p107
$$ 7743 321 -22166 -26292 -23113 -13603 5750 20563 12101 -6786 -9724 1028 2362 1579 -5528
6329e528N308R82J026k940K0L611M488M452j0414p185k1289R916K1359L185o15
$$ -5528 -220 762 1788 -1152 -1132 2479 6967 11419 1005 -6180 -27469 -17553 3806 6991 6376
6314F376j4356j5424p33P945j346q722O311Q406l77p339l676l239k04J5668O734
$$ 6376 -7980 -23404 -24137 -16192 -17538 -26260 -19949 -11543 -11920 -19259 -22935 -26174 -26378 -10710 -3976
6299c976J219r97p72L678k10L300j013O825M356o423j0898J0794J6156m786m817
$$ -3976 -2757 -3754 -4526 -848 -1058 2242 1229 8054 12410 5987 -4911 5883 22039 17253 12436
6284A2436q512j5354j1720J57O145P579n428p17O017L830n776J0020M152o005
$$ 12436 3924 -11430 -23150 -22993 -16848 -9269 -14697 -15414 -9397 -5567 -11343 -1323 2829 -3176
6270c176j2744m419m136J1512J1699J2679k952j2300j5435K581j993O818r035
$$ -3176 -15920 -20339 -24475 -12963 -1264 11415 8463 -3837 -19272 -16691 -18684 -11866 -20901
6257b0901l665M286M471j1045j818J1533O419K13N430N12k61M440r617P105J1569
$$ -20901 -24566 -20280 -15809 -26854 -28672 -17139 -10720 -10507 -5077 -4565 -4826 -386 -10003 -2898 8671
6242H671j0432N353J7414m825j3302k0648l381K572K214J7773J3302j1655j2469
$$ 8671 -1761 3592 21006 16181 2879 -17769 -21150 -18578 -16364 1409 14711 3056 -9413
6229i413o179l404J8011J476q83P202J1351k528o864J092K843R758j0888j1809
$$ -9413 -15592 -18996 -985 491 -392 6810 18161 15633 8769 9861 12704 22462 11574 -235
6215b35l78r154p885J0463J151j3538o184Q613L82Q954K956r85J2522j46m141
$$ -235 -613 -9767 -17652 -7189 -6038 -19576 -25760 -17147 -16765 -7811 -4855 -5840 6682 6536 2395
6200B395n80J931J313J2800q362j8332Q252J6160o41M425k5363q331r840j0954
$$ 2395 1815 3746 5059 17859 9497 -8835 -583 15577 14936 19361 -6002 -14333 -24173 -35127
6186c5127J7688Q88L871O93J3657L742J4191j3208q182k784J8723R639k719j1694
$$ -35127 -17439 -16551 -12680 -11987 1670 5412 19603 6395 -1787 -4571 14152 23791 21072 9378
6172I378j0427r689m389k703M614K5041J658L841n629j2273o951J238j2122j096
$$ 9378 -1049 -10738 -15127 -17830 -13216 11825 13483 17324 11695 -578 -7529 -6291 -18413 -19509
6158a9509N168R612N721J840L186n589J456M680m861R158K103j9976r129j1395
$$ -19509 -14341 -4729 992 2832 6018 429 1885 6565 1704 10862 12965 -7011 -16140 -27535
6144b7535j0319J1102J8351J6978M097l29j2170o936P983K145m491m626m499k322
$$ -27535 -37854 -26752 -8401 8577 12674 12345 175 -6761 1222 3367 -1124 -5750 -10249 -12571
6130a2571K584R15K105j311O536J2766O993j1556l067L435j0642R200N056n07
$$ -12571 -9987 -9072 -6967 -8278 -1742 11024 18017 6461 3394 6829 -3813 5387 10443 9936
6116I936p395M854n404k660j14l779J0158Q09j4374j531p120Q556p01K465r602
$$ 9936 2541 7395 1991 -669 -783 -4562 5596 6405 -7969 -9500 -16620 -8064 -8765 -6300 -15902
6101a5902p476N902o126o660P273P243O660M363j2139l124l726K3225M724o874
$$ -15902 -23378 -17476 -23602 -30262 -22989 -15746 -9086 -4723 -16862 -19986 -23712 -487 4237 -2637
6087b637o219N867J3510l535m758L705J16q528j926K37K425k199l455o704J1142
$$ -2637 -8856 -2989 10521 6986 2228 5933 6049 -2479 -4405 -4168 -1743 -3942 -7397 -14101 -2959
6072b959K734q343j1633r813j2830J359K4311K3761R162j8032j6775j6834M242
$$ -2959 -225 -8568 -20201 -30014 -42844 -41485 -17174 6587 15749 -2283 -19058 -35892 -31650
6059c1650Q018j053k689J0j123q149j623J7838J0574m653P811Q675L998J771q470
$$ -31650 -23632 -24685 -27374 -27364 -28487 -36636 -38259 -20421 -9847 -14500 -6689 1986 5984 7755 -715
6044g15K16o19K087J1720p510N23L637J866P663J258l635J441j3931j1878m60
$$ -715 -499 -1118 969 12689 5179 5702 9339 11205 18868 20126 16491 17932 4001 -7877 -8337
6029h337n960l887o819k396k660J5250J2507l577j0479n879N822J2194J3580j094
$$ -8337 -14297 -18184 -25003 -27399 -30059 -14809 -2302 -5879 -16358 -22237 -16415 -4221 9359 8265
6015H265j937m674P938M994n790O179m184j1458N501M38M495j757j7520q831Q444
$$ 8265 6328 1654 9592 14586 8796 14975 10791 -667 4834 5272 9767 8010 -9510 -18341 -9897
6000i897J6718o481j0417K5765p254m365l294J462P794J0475l118j7800j2488
$$ -9897 6821 340 -10077 15688 8434 4069 775 2237 10031 20506 17388 -412 -12900
5987a2900O773J7811m750j8905j64Q135m140k424M368R32j793o239P94J3709j0055
$$ -12900 -6127 11684 6934 -11971 -12135 -4000 -8140 -10564 -6196 -5264 -7057 -13296 -12502 1207 -8848
5972h848P589j685p40k289k481m015P644J3637n061j3312n649J5688R900P207
$$ -8848 -1259 -2944 -3684 -5973 -8454 -12469 -4825 8812 3751 -9561 -15210 478 10378 17585
5958A7585k280q704j9038Q704K0396J471j6091m659j0221p869K646K348J5480
$$ 17585 15305 6601 -12437 -3733 16663 18134 2043 -2616 -12837 -20706 -18060 -15712 -232
5945b32Q005m97p296k1103q858J8693N694j333L806o9q460q051J1641J7032k500
$$ -232 7773 7276 -20 -21123 -29981 -11288 -5594 -6927 -3121 -3190 -11650 -19701 -8060 8972 6472
5930F472p114j5657M233Q44n593o386R493J7815P191j964j7092j5234O828j59
$$ 6472 -642 -16299 -12066 -11222 -16815 -23201 -13708 4107 11298 9334 -7758 -22992 -16164 -16323
5916a6323K427K3304N75J853m315o360J1160l006j3543j155j822O309N455N439
$$ -16323 -13896 9408 9983 11836 7521 1161 12321 9315 -4228 -5383 -7205 -896 4559 9998
5902I998j8302J300O914L079Q207J589j6033M968k037J4534J5708l871k171l882
$$ 9998 -8304 -7004 -90 2989 11196 12785 -3248 1720 -317 14217 29925 26054 23883 20001
5888B0001o726n070j1182r614K402m659o649l267J4002j0602J6368L920m993O388
$$ 20001 13275 8205 -2977 -12591 -10189 -14848 -21497 -24764 -10762 -21364 -4996 -1076 -6069 319
5874C19J4937J1268n229k0529o25R929o403o649j793J180l111r746m814q922q746
$$ 319 15256 26524 21295 766 141 10070 3667 -2982 -4775 -3595 -6706 -16452 -21266 -30188 -38934
5859c8934J3087R260K345l857Q33J5934R680N256n895q29L16K691M715k492Q62
$$ -38934 -25847 -16587 -14242 -18099 -17266 -1332 8348 13604 7709 6880 7196 9887 14602 12110 12972
5844A2972k894l516K959k942j0562l175o139j4533j450J3377k250M05K91L999
$$ 12972 10078 6562 9521 6579 -3983 -7158 -13297 -27830 -29280 -15903 -18153 -17748 -17457 -13458
5830a3458L206j0649Q038j135o556P779M434n692l542J966j0778l227J7806O039
$$ -13458 -10252 -20901 -12863 -13998 -20554 -12775 -8341 -14033 -17575 -15609 -26387 -29614 -11808 -5769
5816e769j3054j334k541j751J4654O250n39m032l770n688O771K28L633l855r825
$$ -5769 -18823 -20157 -22698 -24449 -9795 -3545 -4084 -8116 -11886 -17574 -10803 -10575 -6942 -10797 -20622
5801b0622k351j73K0837R346m512l514N413J3104q212k894r024l774J0107o905
$$ -20622 -22973 -23146 -2309 7037 2525 -989 4424 17528 9316 6422 -2602 -6376 3731 -3174
5787c174o036o522q67J835K912M134J6450p982j881P279O7q018Q05N490Q376p204
$$ -3174 -9210 -15732 -16599 -14764 -11852 -7718 8732 750 -1131 6148 6215 -1803 -998 4492 12868 5664
5771E664p15Q97q737j404N891Q891j790j3777o072J343J71O259J6382J2689p048
$$ 5664 4949 5846 -2891 -4295 1596 10487 8697 -5080 -11152 -9809 -9638 -3379 13003 25692 18644
5756A8644j6981q041M575J0374m218J1464N78j133n946n231j2036o895O991L714
$$ 18644 1663 -6378 -1803 8571 4353 15817 16395 15262 9316 4085 -7951 -14846 -7855 -4141
5742d141P917q95p352j758J8l89j0838R47J1291O352O679O2j2815O644J9158j4062
$$ -4141 3776 2881 -4471 -6229 -6211 -6600 -17438 -16491 -5200 1152 7831 7893 -4922 1722 20880 6818
5726F818m674O954m04j0512J7635p703l333N944J2176j5864n832P960p683n764
$$ 6818 2144 9098 8694 -1818 15817 8114 4781 10725 22901 7037 1205 9165 1482 -4282
5712d282M931J301o118l583k262J1787J2712Q797j6133p046J567J75P377Q639
$$ -4282 649 1950 -4168 -7751 -10013 1774 14486 23283 7150 104 1671 1846 9223 17862
5698A7862n936n275k877n006O315N647L585P146p655j1696m109K091Q327j458
$$ 17862 11926 6651 3774 -1232 5083 10730 14315 21461 13806 2110 -1999 92 8419 6961
5684F961o92l943r48l35J3353P022j6797j8513J1786J1902R188J368k66j1782
$$ 6961 6269 2326 1378 1043 14396 21418 4621 -13892 -2106 9796 18984 20352 20086 8304
5670H304j3452j235o61j0260l397Q035J2514Q868P938j4504j4787P217P214o192
$$ 8304 -5148 -6383 -7044 -17304 -20701 -12666 -152 8716 16654 2150 -12637 -5420 1794 -4398
5656d398j8132J0479n222L144r65p517K2674J6243J1450n204r051J718O6o376
$$ -4398 -22530 -12051 -17273 -14129 -15094 -22611 63 16306 27756 22552 13501 15219 15285 8909
5642H909k347J9524R950j2243n951j364K006L113m694q181p508m51j434k054j0025
$$ 8909 6562 26086 36036 23793 17842 16478 18484 21597 16903 8722 1214 763 -671 -2725 -12750
5627a2750J141J658L391r519k327J0421R176o742j3729p444k204l81O458N697
$$ -12750 -11609 -9951 -6560 -16079 -18406 -7985 1191 -5551 -19280 -26724 -28928 -29309 -22851 -17154
5613a7154j674R670o214o719J32O20o582N232O745J4482o606Q012R179J981O383
$$ -17154 -18828 -9158 -15372 -22091 -21959 -21339 -27921 -22689 -15944 -1462 -8068 -56 9123 11104 17487
5598A7487p431p469k464J655n999N958Q0p548j131j338J0244J9823K113k342K068
$$ 17487 10056 2587 123 1778 -4221 1737 1817 -5731 -6862 -8200 2044 21867 23980 21638 23706
5583B3706l415k2408j4849J379j507J2624L80O87J7689m443p124M092k642m037
$$ 23706 20291 -2117 -16966 -15587 -17094 -4470 -4090 -3403 14286 9843 2719 6811 4169 132
5569A32q755N671O719j2158j0292L501k296P595j462O880j483M115o029N318q392
$$ 132 -8623 -2952 3767 -8391 -18683 -15182 -17478 -9883 -11345 -4465 -5948 -1833 -7862 -2544 -10936
5554a0936N425n13k308j372j2672N816M109j0826n210J8477J2020p587j802m899
$$ -10936 -5511 -6024 -8332 -9704 -22376 -16560 -12451 -23277 -28487 -10010 2010 -5577 -7379 -12278
5540a2278j1532k779L880j551Q140J3584R93Q058J969n857j023J1460j41l212
$$ -12278 -23810 -26589 -22709 -24260 -16120 -2536 -1543 6515 8484 2627 1604 13064 12923 9711
5526I711k629o566N94j655j0202J0959J4523j6376n00m353L488O476M315p760
$$ 9711 7082 516 1110 -545 -10747 212 14735 -1641 -2141 -6494 -3006 3470 7785 25
5512B5r194Q885n781k270O060J2683q34m218r498j2135m629k292P73O754K0298
$$ 25 -9169 -284 -6065 -8335 -2275 10408 9574 5356 -4142 -16277 -20906 -23198 -22425 -15671 4627
5497D627j724j851n885L484K931J9715j404r213k119j6197J1O462N095P421j2891
$$ 4627 2903 1052 -4833 -1349 1582 21297 19893 10680 8561 -7636 -7625 -1163 3932 11353 -1538
5482a538o664L177K108R21q217Q703J3680q729o004p55P805Q55k437J612r67l364
$$ -1538 -8202 -5025 -2917 -1996 -10213 -1510 12170 3441 -2563 -3318 4487 5342 2905 4517 3550 186
5466A86J102k1052n598n137N329J2100Q458P44K522J831J00k594m716L616J2661
$$ 186 1288 -19764 -25362 -30499 -25170 -13070 -4612 -3868 -1346 485 585 -2009 -6725 -3109 9552
5451I552m608j5224p457J5922Q117l648j6408r133J3121P103J613o822j4023R969
$$ 9552 4944 -10280 -17737 -1815 6302 2654 -13754 -22887 -9766 -2663 -1050 -7872 -21895 -11926
5437a1926P703k616J2201J0758j106j6091j8570j8073K43K9339Q024j8140r738
$$ -11926 -4223 -6839 5362 16120 15014 -1077 -19647 -37720 -37477 -8138 -114 -18254 -27992
5424b7992R273J2781L803O257n163j2375q094q447m183J2459j15m74P915P455
$$ -27992 -18719 -5938 -2135 4122 -1041 -13416 -21510 -29957 -34140 -21681 -21796 -22270 -14355 -6900
5410f900J551K861Q030M679j3753j0222m843l924R726m42m111o485O389J440m888
$$ -6900 -5349 -2488 5542 10221 -3532 -13754 -18597 -22521 -12795 -13237 -17348 -23833 -17444 -16004 -20892
5395b0892K096P357l028n29P307J2981j3111P425J483j5677j131M822K866L679
$$ -20892 -18796 -11439 -14467 -14996 -7689 5292 -7819 -394 1089 -14588 -15719 -10897 -8031 -4352
5381d352m694M795J3070J5270K4195M342j2086k3206M93j7126j3441m341m680
$$ -4352 -9046 -4251 8819 24089 48284 52626 40540 17334 17827 701 -12740 -17081 -21761
5368b1761K711M596j8824P051o170Q28p754P605J731j605K489l668J0133O972
$$ -21761 -19050 -14454 -33278 -26227 -32397 -31569 -39323 -31718 -29987 -31592 -29103 -32771 -22638 -15666
5354a5666k826R085M30j468O446J0832n944o36o58O85M599j1107j4834K563N330
$$ -15666 -18492 -9407 -8977 -10445 -3999 6833 889 253 -405 280 4879 -6228 -21062 -18499 -13169
5339a3169J2949J8786qm225r244q465K369p692l228J0181J7884n026j3269j8304
$$ -13169 -220 18566 18558 14333 5089 -3376 -1007 -8699 -11927 -1746 16138 11112 -2157 -20461
5325b0461m372R432Q500r095j521R866j1912p545K131k537j0682M565Q794P01
$$ -20461 -24833 -15401 -6901 -15996 -17517 -7651 -19563 -27108 -24977 -27514 -38196 -33631 -24837 -24136
5311b4136J4628P330l568j6444L868J6659n4p219m154O932J6760K780m904o95
$$ -24136 -9508 -2178 -5746 -22190 -18322 -1663 -1717 -8936 -13090 -6158 10602 13382 8478 7783
5297G783k175j206m625p162o611p062j147m405O620Q344O758J2448q558r63q00
$$ 7783 5608 4402 -223 -7385 -13996 -21058 -22205 -26610 -19990 -11646 -4888 7560 -998 -1961 -2761
5282b761q732J604J0952M91q534n371l138O237J5869M934M922K660l389j547p159
$$ -2761 -11493 -9889 1063 1554 -6980 -12351 -15489 -9252 6617 11551 16473 19133 15744 14197 7038
5267G038j908m926j2480P612J0243p058q296k372L556J2936M914K106p214n271
$$ 7038 5130 204 -12276 -4664 5579 -1479 -9775 -12147 -8591 4345 9259 11365 4151 -1120
5253a120K705q930n821J0676l008J597J069l655l66O263o581q039J6271L287K603
$$ -1120 1585 -7345 -13166 -2490 -5498 -3901 -2832 -6487 -6853 -590 -7171 -15210 1061 4348 6951
5238F951k886m796l231j0378j413K843N532m048j1307J184J1632R645R179P369
$$ 6951 4065 -731 -3962 -14340 -15753 -12910 -7378 -11426 -22733 -21549 -9917 -272 8907 16276
5224A6276R367L883l92m8j0634j3688m658k651P451p989j168Q23Q928k868L580
$$ 16276 25643 29526 29134 29086 18452 4764 106 -2545 4906 -3083 -4251 -3428 5500 2632 6212
5209F212K2583M011l016k913p617J0775l454k1963p363K200O671J0508Q813J3233
$$ 6212 28795 32806 29790 26877 19260 30035 26581 4618 -2745 -545 6126 16634 25447 38680
5195C8680j0928o903J461q605p893K665l259j3920M82O024R109K837m981j079
$$ 38680 27752 20849 22310 13705 5812 8477 5218 -8702 -8220 -2196 6913 9750 4769 3690
5181C690k684M156J5423P131j4887q349q237L394n018j0889J0552K549k359j4968
$$ 3690 1006 5162 20585 27716 12829 4480 -3757 -363 -5381 -16270 -5718 -3169 -5528 -20496
5167b0496M443m963J3942J2256P36J05j1262j1276R097N209n506l251J4868N179
$$ -20496 -16053 -21016 -7074 5182 5918 6023 -5239 -16515 -7418 -2209 -7715 -10966 3902 9081
5153I081O680k019r800Q02J192N536j2091k700J5710j433j5616M109q58j1401
$$ 9081 15761 13742 3942 4744 5936 11472 -619 -3319 12391 10958 -4658 -549 -1407 -12808
5139a2808l369k508k893Q650O272l098J0336N351n256M341J545p239P17J2506
$$ -12808 -16177 -18685 -21578 -12928 -6656 -9754 582 5933 677 5018 6563 -676 41 12547
5125A2547m137O486J2063p721j2816R66j5593o707J5155J4902o373j3176o694
$$ 12547 8410 14896 26959 19238 6422 7388 -8205 -14912 243 15145 8772 -4404 -11098
5112a1098K196p880j4242Q037M096Q097r00K033N192N136M059j008r035m204N586
$$ -11098 -8902 -16782 -31024 -22987 -18891 -10794 -11694 -9661 -4469 667 4726 3718 -5317 -9521 -3935
5097c935k158l355M427n195m783n465j25J1680j96o792j2739K467J3171J082L453
$$ -3935 -6093 -9448 -5021 -10216 -14999 -20464 -20589 -8909 -9105 -15897 -28636 -26169 -12998 -11916 -8463
5082h463m831j3091J4259J3342L69M103j3804n155j207J835Q055M531Q971o249
$$ -8463 -13294 -26385 -12126 1216 1585 5688 -8116 -13271 -14478 -12643 -4588 -57 8914 2665
5068B665l446J2778r155j8061J989Q431o563K540J805P990j0078r363N644K7000
$$ 2665 -781 11997 2842 -15219 -13230 -4799 -11362 -8822 -7017 973 -9105 -18468 -12824 14176
5054A4176n57n562j886J3319M905n918J79j6557j5084O506P536k89r257o237O042
$$ 14176 13619 8057 6171 19490 24395 18477 18656 2099 -12985 -6479 1057 768 -8489 -14726 -8684
5039h684l474j704N816J676J4527Q310j6380j1141j9174o53J2338J3551k016J002
$$ -8684 -12158 -13862 -8046 -6370 8157 16467 87 -11054 -30228 -30881 -18543 -4992 -7008 -6006
5025f006l582R364K053m193J275l279J963j070j0984J1673J4307Q925j7239j5402
$$ -6006 -9588 -224 1829 -2364 -1089 -4368 -2405 -3475 -14459 -2786 11521 20446 3207 -12195
5011a2195n501N606L618O866o755k113O88R73J713N25o853o223J0001J057j331
$$ -12195 -17696 -12090 -8472 -1606 -8361 -10474 -9786 -8813 -7100 -6575 -13428 -19651 -9650 -8593 -9924
4996i924J693j0113n636K177M224N656p588J0862J4661N547N512k469m410o866
$$ -9924 -8231 -18344 -23980 -21803 -17579 -11923 -19511 -8649 6012 11559 17071 14602 10192 3326
4982C326j1901n619M029m195L339q557M571J1456j2282j6942P346J6992J0105
$$ 3326 -8575 -14194 -10165 -14360 -11021 -19578 -15007 -3551 -15833 -32775 -25429 -8437 1668
4969A668m472j1102J857n08J0361K203K177q281m033J5630R334m903m61o883r579
$$ 1668 -2804 -13906 -12049 -12557 -2196 7 2184 -6097 -10130 5500 14834 9931 9470 2587 -6992
4954f992Q732j4063M139J1080m941o688L750q61J480J583n14j1427J123N232k324
$$ -6992 1740 -12323 -8184 2896 -2045 -8733 -4983 -5844 -4364 -2781 -3295 -14722 -13599 -8367 -10691
4939a0691k622J365q27O877m547L762K526q852l388J6972J2571q266j3961j4423
$$ -10691 -13313 -11948 -12775 -5898 -10445 -6683 -4157 -13009 -16397 575 13146 4880 -9081 -23504
4925b3504O357L567N208J5102N121O46n590o879l173q188m86K215l306l612m414
$$ -23504 -17147 -13580 -8372 6730 11851 12497 6907 28 -3145 -11333 -11819 -9604 -12910 -16522 -20936
4910b0936j4920j0607J4261Q917R691K486K126R585K73L124j426L609k904J1286
$$ -20936 -35856 -46463 -32202 -23285 -13594 -11108 -8982 603 876 4000 2574 6183 3279 14565
4896A4565K034k1322j4397p436M951M135K4071J5529R83L732o56k0454k855P990
$$ 14565 16599 -4723 -19120 -26556 -21605 -17470 6601 22130 23113 26845 26189 5735 2880 10870
4882A0870r056q238L364R341P670j0678p718l768m565J2904O063l038L357J789
$$ 10870 1814 -6424 -3060 6281 13951 3273 -4445 -8213 -12778 126 6189 3151 6508 8297
4868H297P359P985p795j0589j6339J9k615j5870N128l068J5551P025j111N850
$$ 8297 15656 23641 15846 5257 -11082 -11063 -13678 -29548 -24420 -27488 -11937 -4912 -6023 -173
4854a73j004n51j1567j6909J0920K9407N755k0101L398q8r81R941j1781M025J6204
$$ -173 -1177 -1728 -13295 -30204 -19284 10123 15878 -4223 -825 -913 -1894 8047 -3734 291 16495
4839A6495J7168n573p031j1617j0721r191l308n833m934J2898J1312M012Q288
$$ 16495 33663 28090 21059 9442 -1279 -10470 -13778 -19611 -24545 -11647 -335 3677 11965
4826A1965M30o018m502K941K113o551j4604k237J885K2402N46q620q004j771r742
$$ 11965 12395 6377 1875 4816 6929 378 -14226 -16463 -14578 7824 8370 -250 -8254 -10025 -19767
4811a9767K127J4376J3363M369n74o520M811K82R01q907j3826p892R629j034N529
$$ -19767 -17640 -3264 10099 14468 13894 7374 12185 12467 13368 4461 -9365 -17257 -7628 -8662 -3133
4796c133J820n76L626l138l749k640J409m916R325Q010q622q614R22r079M288
$$ -3133 -1313 -1889 1737 -1401 -5150 -7790 -6381 -11297 -1972 6038 -2584 -11198 -10276 -19355 -15067
4781a5067M103M633J5576M764k123k099j1306Q881L226J0M55j2162N572n219K273
$$ -15067 -10964 -6331 9245 14009 11886 9787 -1519 7362 10588 10598 11053 -1109 4463 -756 1517
4766A517j0461j4600P15J3746M972J730M794o032l843j5731j1076J5586J1377
$$ 1517 -8944 -23544 -22829 -9083 -4111 -2381 2413 -3619 -7462 -23193 -34269 -18683 -7306
4753g306N124L740j6445J0290O54l778R107R162j091j1004J175j329n618j174
$$ -7306 -2182 1558 -14887 -4597 -3943 -7721 1386 10548 9457 -1547 -372 -1701 -7319 -8493
4739h493k304J451k655k29Q28K766j076n193M366O437J625q969N912K44j6009
$$ -8493 -10797 -9346 -12001 -12230 -11402 -8636 -9712 -14905 -10539 -4102 -2477 -11446 -5534 -5290 -21299
4724b1299K554n718K555r212o808R313M180J0162K760L055R570M312k159j85N21
$$ -21299 -18745 -24463 -21908 -31120 -37928 -28615 -24435 -14273 -11513 -8458 1112 5424 3265 3080 3601
4709C601j798p477m950j276J1187K684L820Q070o32j369K491j8031k306J2716
$$ 3601 1803 -5674 -10624 -11900 -713 1971 5791 13861 13229 11860 14351 -3680 -5986 6730
4695F730K1443L552j5746r67M959n899j114q114m93j072Q208K904p764o598j0584
$$ 6730 28173 31725 15979 15012 19971 14072 12958 4844 4351 3279 11487 14391 6627 29 -10555
4680a0555N488Q876J0498m230j4866m204L489m899o748K739M561Q078L853j619
$$ -10555 -5067 3809 14307 10077 -4789 -8993 -5504 -10403 -17151 -14412 -9851 -1773 2080 461
4666D61J576N806j4127q141R511r389m765J81l634N625J1683o324l756L041L692
$$ 461 2037 7843 -6284 -14425 -4914 -14303 -19068 -18887 -22521 -16896 -5213 -11537 -15293 -12252 -8560
4651h560M321o968o692o273j1280P978R574M956Q380J7184O499M84q728j7136
$$ -8560 -4239 -11207 -17899 -24172 -35452 -27474 -17900 -12944 -4564 12620 19119 19603 10875 -6261
4637f261j0894J4364J1750M237j5217o262K2058m504p451p584j5322K636r336
$$ -6261 -17155 -2791 8959 13196 -2021 -8283 13775 9271 1820 -5764 -21086 -18450 -27786
4624b7786M141Q801J3661Q512J1216p738j9816n851l979L761O620P587K507K36
$$ -27786 -23645 -14844 -1183 7329 18545 10807 -9009 -14860 -18839 -15078 -8458 -871 1636 1872
4610A872k508L84O931l000k930m545q36l283Q678J1284P68m351k666N553J41j6183
$$ 1872 -636 -252 6679 3679 749 -3796 -4632 -7915 763 12047 12815 8464 5798 11351 11492 -4691
4594d691j3372o439O680J2513J0395M049K15j0391l583j52J2256l370K792Q189
$$ -4691 -18063 -24502 -17822 -5309 5086 9135 9350 -1041 -4624 -4776 7480 4110 6902 15091
4580A5091Q282J296O6j0812j1038k609l283K514J0344M217j7102o13O342o307
$$ 15091 23373 24669 24735 13923 2885 276 -3007 -493 9851 14068 -3034 -3647 2695 -3612
4566c612P723o942m344m532M371R053J955o343j0824J0593J0425o921j1269K879
$$ -3612 4111 -2831 -7175 -11707 -7336 1717 3672 -2671 -13495 -2902 7523 602 -10667 -7788
4552g788l329J658j440j6813n793L697l508K906M747J3463j607m817n310l491
$$ -7788 -11117 -9459 -10899 -27712 -33505 -29808 -33316 -30410 -25663 -12200 -13807 -18624 -23934 -27425
4538b7425K832l359J3166l748l16J0967M691j887m284O290O061J1126P240j1201
$$ -27425 -24593 -27952 -14786 -18534 -18850 -7883 -3192 -5079 -9363 -3073 2988 14114 21354 10153
4524A0153k5780k019K554J5583N248p59r26j2881m568L492L662J261Q077n904
$$ 10153 -15627 -17646 -15092 491 5739 4980 4054 -8827 -13395 -9903 -6241 -4980 3097 -2807
4510b807j0178p540J4829J4184k411P220R172j008j6785q894M829R802J921p297
$$ -2807 -12985 -20525 -5696 8488 6077 13297 22469 21461 4676 -4218 611 10413 12334 5037
4496E037m056J7347K375j5673j0539l069j8o016n100J9778P859o604r186N409
$$ 5037 981 18328 20703 5030 -5509 -8578 -8596 -14612 -19712 66 7925 1321 -7865 -2456
4482b456j172q425j2433J89K2077K576o501Q607O146o000R99l573J1855l52j0281
$$ -2456 -3628 -12053 -24486 -24297 -2220 356 -6145 2462 8608 2608 3607 34 11889 11537 1256
4467A256P447N914l466n763n878k4715k366J4909k984k755o306j0060L633N088
$$ 1256 8703 14617 11151 5388 -490 -25205 -27571 -12662 -15646 -18401 -24707 -34767 -31134 -26046
4453b6046P32K34J629j986J0312R333J2788R01l152N858l790j3331k713L014N046
$$ -26046 -25314 -25080 -23451 -25437 -15125 -5792 6996 7897 4745 10603 6813 -6518 -9231 -6217 -1171
4438a171R91j1688j26R863J3923j2420r097j0410O661J5324k049J406j510J194
$$ -1171 -180 -11868 -11994 -2131 11792 -628 -9725 -20135 -13474 1850 -199 1207 -303 891
4424H91r085L64m577J5022Q848p832j4531n493P324J0478J7062j3128j6208L488
$$ 891 -8194 -7830 -12407 2615 11463 3631 -10900 -16393 -9069 1409 18471 5343 -10865 -7377
4410g377P268j6791k0489Q590N047j626O803o3q31K456J0368N228K051K155J0624
$$ -7377 -109 -16900 -37389 -28799 -23752 -25378 -18575 -18638 -19469 -17013 -6645 -1417 634 2789 13413
4395A3413K0113o502m534q254n821j6322O170n763N117l418P300M221q50k141
$$ 13413 33526 27024 22490 14236 8415 -7907 -1737 -7500 -2383 -5801 1499 5720 4870 2729
4381B729k082J4844n829k4853K88L602o848L757J7214P477l74r1m329K683R102
$$ 2729 647 15491 9662 -15191 -14903 -11301 -18149 -14392 2822 10299 9925 9834 5505 8188 17290
4366A7290j0683m953L976n132l817q34P462r270j7533M293J0151R916K692J97
$$ 17290 6607 1654 5630 498 -3319 -4153 3309 -5961 -23494 -19201 -9050 866 3558 3755
4352C755L559l57J758r335N206J2755l047r555j720j127j9443o903R020K374J3070
$$ 3755 7314 6957 8715 -620 4586 17341 14294 4739 3019 1892 -17551 -24454 -15434 -13060 10
4337A0k799J567j0822q986j704N105J6378N175k381q269r697j956R698J6709k249
$$ 10 -2789 -1222 -12044 -21030 -22734 -17629 -1251 3924 1543 -6726 -16423 -18379 -8681 8028 5779
4322E779o402n876n367K1046P771O993j9400j0854q02N462L555J524Q542K236
$$ 5779 -623 -6499 -11866 9180 16951 23944 4544 -6310 -7112 -1650 1905 3429 11971 14207
4308A4207j918q48L26O76j8538q28J2961M900p433j1247J675q308o301J0597P502
$$ 14207 12289 11441 11767 12443 -6095 -6923 6038 10938 3505 -7742 -6067 -14375 -20676 -10079 -2577
4293b577j304L33k841N872j000j408r21n010n416M908J0483o258O824J9059R07
$$ -2577 -3881 -3548 -6389 -517 -1517 -2925 -3846 -8856 -14272 -9364 1119 -5139 1685 20744 21651
4278B1651j2316l89j519M983k272j413O238j4778K79r234r446Q598J1988Q396
$$ 21651 9335 8946 7427 12410 10138 8725 14963 185 464 -8770 -18216 -9618 2370 10766
4264A0766r45r440J0690J3662m282l604n708j716l056l364n416j4805l678K3911
$$ 10766 9821 381 11071 24733 20451 16847 11139 9423 6367 3003 -2413 -17218 -20896 3015
4250C015o017o650m052k474Q180J8878j465j1908n183n965l106M239J5054P51
$$ 3015 -3002 -9652 -13704 -16178 -7998 10880 9415 -2493 -7676 -13641 -16747 -12508 2546 3297
4236C297n742J186J7024K0041n778j5200k0395j0421R354J5560J5073o048j8023
$$ 3297 -2445 -1259 15765 35806 30028 14828 -5567 -15988 -6634 8926 23999 17951 -72
4223g2l508q534L06R18P801K2966R20J720N148j2706j443j013J856N548K466r403
$$ -72 -3580 -12114 -11808 -10890 -3089 19877 20797 22517 27665 14959 13516 12503 14359 19907 22373 12970
4207A2970o403M778K120j700K439l559r259p409O975K3245L355j4520j965o837
$$ 12970 6567 11345 13465 11765 14204 10645 1386 -6023 952 24197 27552 13032 11067 4230
4193D230k1400q79Q599K98j3032Q657J0811l016k893N412q576m246O241q731J682
$$ 4230 -17170 -18049 -9450 -9152 -22184 -13527 -2716 -5732 -8625 -3213 -11789 -16035 -9794 -18525 -16843
4178a6843M48o121R52N141j136q185m19J2442j451R68M078m608m034m23P548J5120
$$ -16843 -16395 -22516 -21564 -16423 -17559 -25744 -26163 -13721 -15172 -14204 -10126 -14734 -18768 -19191 -11643 3477
4162C477J161p948L837N036q988j2073J2474O845M395j0513K236m983o969p665
$$ 3477 4638 -3310 527 5563 -3425 -15498 -3024 3821 8216 -2297 -61 -5044 -12013 -19678
4148a9678M551p554m827J3352J2102J651R128m914J449K186j0968k291Q933O8
$$ -19678 -15127 -22681 -27508 -14156 -2054 -403 8725 3811 5260 7446 -3522 -5813 3120 3188
4134C188J1061m014j3559n318J0091r56J0455r13j3560j7156j2341l77N602j366
$$ 3188 14249 10235 -3324 -8642 1449 493 10948 10035 -3525 -20681 -33022 -33399 -27797 -29163
4120b9163J767J3059J1093m174k758J2636J0835l06k662k199R571J0781m070r030
$$ -29163 -27396 -14337 -3244 -7418 -10176 2460 13295 12989 10327 8128 17699 28480 24410 15380
4106A5380j3549p819M036N084p37m617M388j6712n028n563l039l312J8246J4534
$$ 15380 1831 -5988 -1952 3132 2395 -2222 2166 -14546 -19574 -25137 -28176 -31488 -13242 1292
4092A292O911j907l805q545M46l219J989N873J494L925J4308N107j581r907j2741
$$ 1292 8203 6296 2491 -6054 -5608 -8827 -6838 -965 529 4454 18762 23869 22288 12381 -360
4077c60L388J7650l177j0195k0132j7241J3747J8541m213J388M477j3181o874
$$ -360 3028 20678 17501 7306 -12826 -30067 -16320 2221 -1992 -604 3873 -9308 -16182
4064a6182J883M965J0500n194k137m799l298o71L396K404k27p593P317M729M136
$$ -16182 -14299 -9334 1166 -4028 -6165 -10964 -14262 -14933 -11537 -9133 -9360 -16953 -9636 -4907 -771
4049g71J3331J2359k391k2925n280J3001J116J586M087K082n070o41m962O079
$$ -771 12560 24919 22528 -397 -5677 7324 8440 10026 14113 16195 11125 10484 5522 11601
4035A1601j050q910j0643m536K483O64O455M000j819j1114l259N220r535J49J8767
$$ 11601 10551 1641 -9002 -13538 -11055 -10391 -3936 64 -1755 -12869 -16128 -10908 -20443 -20294 -1527
4020a527M521k876P155J2040j0693j6520O229o29j695P646m260N113J0582O235
$$ -1527 2994 118 7273 19313 8620 -7900 -1671 -2300 -3995 3651 -609 4504 15086 21321
4006B1321K185o008j4409l297j1424j0387n543m514J3165R423l625l238M620J1856
$$ 21321 23506 17498 3089 -208 -11632 -22019 -27562 -32076 -18911 -9488 -13113 -16351 -11731 125
3992A25J832O363n963r12J4795J7445m84j831n499j9048j0817o957p734q883Q433
$$ 125 1957 8320 2357 1445 16240 33685 33201 31370 25871 6823 -3994 -10951 -18685 -27568 -19135
3977a9135M268l522J0343J1776J1459l982l6l51n838k427J82N72M315N478l37
$$ -19135 -14867 -18389 -8046 3730 15189 11207 11171 10820 4982 2555 2737 3309 7624 13102 12765
3962A2765L274J977P646p333n857j0294m736l331n940j0158O692N307L5M547M245
$$ 12765 16039 18016 25662 18329 12472 2178 -2558 -5889 -11829 -21987 -15295 -9988 -9953 -5406 -1161
3947a161P311J2833p151j0226O265J8330j038k0907o915Q543j431J877o107J0795
$$ -1161 6150 18983 11832 1606 7871 26201 25163 4256 -2659 5884 4453 6330 223 11018
3933A1018R14J618q647j7517m944M314Q926L043J2294M819j0231j085L379N919
$$ 11018 11932 13550 4903 -12614 -17558 -13244 -4318 -1275 11019 15838 5607 4522 7901 13820
3919A3820n241O615j1442j1484j2271J3359J7448O277m429O08n965q713J263N649
$$ 13820 8579 15194 3752 -7732 -20003 -6644 10804 17081 12652 13260 7295 -1418 -155 5494
3905E494o247j399J741J748o559o173n897L598P301N489j68p573R889J5164q863
$$ 5494 -753 -2152 -411 1337 -5222 -11395 -17292 -13694 -6393 -904 -1072 -8645 1244 16408 7545
3890G545k3969o706O499J2399p40R834Q695M84r634J4291o255j7996j1843l730
$$ 7545 -16424 -23130 -16631 -4232 -4972 4862 13557 14041 4407 18698 12443 -5553 -17396 -21126
3876b1126M135J4938o772L402j3321k387J4348P415j0591j8621J1637k60k469
$$ -21126 -16991 -2053 -8825 -5423 -18744 -21131 -6783 632 -9959 -28580 -16943 -17203 -19672
3863a9672J756O462J1881j2174M761k864Q199N01j1254m578M13R34J1616k408
$$ -19672 -17916 -11454 427 -11747 -6986 -9850 -1651 -1150 -12404 -16982 -16569 -15635 -4019 -6427
3849f427l993J2031r748j916j596K786l135P838m126O951J0263L96m784O141J835
$$ -6427 -10420 1611 -8137 -10053 -11649 -8863 -11998 -4160 -8286 -1335 8928 9324 4540 10681 12516
3834A2516q217K346j166K382J2067j880o834M664l65q922k336q998N426R541j4544
$$ 12516 4299 6645 5479 7861 19928 18048 11214 15878 15513 6591 4255 -4743 683 10224 -4320
3819d320j6029M87o037J9856J1124l12O357M156l64q241j1584L598J2611M358
$$ -4320 -20349 -19862 -25899 -6043 5081 4769 11126 15282 14918 6677 -4907 -1309 11302 15660
$$ [...]
##END NTUPLES=NMR SPECTRUM
##END=
