##TITLE=Analysis number 326535
Compound Code cc 59446
Book Reference 494/120
Project Code adrs
Chemist Name craigr
##JCAMPDX= 6.0         $$ Bruker NMR JCAMP-DX V2.0
##DATA TYPE= NMR SPECTRUM
##DATA CLASS= NTUPLES
##ORIGIN= Bruker BioSpin GmbH
##OWNER= nmr
$$ XWIN-NMR		Version 3.5
$$ Mon Feb 12 09:28:16 2007 GMT Standard Time (UT+0h)  MAYBRIDGE\nmr@NMR_250MHZ
##.OBSERVE FREQUENCY= 250.131544655141
##.OBSERVE NUCLEUS= ^1H
##.ACQUISITION MODE= SIMULTANEOUS (DQD)
##.ACQUISITION SCHEME= undefined
##.AVERAGES= 16
##.DIGITISER RES= 18
##SPECTROMETER/DATA SYSTEM= dpx250
##.PULSE SEQUENCE= zg30
##.SOLVENT NAME= CDCl3
##.SHIFT REFERENCE= (INTERNAL, CDCl3, 0, 16.522)
##AUDIT TRAIL= $$ (NUMBER, WHEN, WHO, WHERE, WHAT)
$$ ##TITLE= Audit trail, XWIN-NMR		Version 3.5
$$ ##JCAMPDX= 5.01
$$ ##ORIGIN= Bruker BioSpin GmbH
$$ ##OWNER= nmr
$$ C:\u/data/dgb/nmr/ADRS/700/pdata/1/auditp.txt
$$ ##AUDIT TRAIL=  $$ (NUMBER, WHEN, WHO, WHERE, WHAT)
(   1,<2007-02-12 09:27:46.60 +000>,<MAYBRIDGE\nmr>,<NMR_250MHZ>,
      <created by zg, POWCHK disabled, PULCHK disabled
       configuration hash MD5:
       49 4B E0 1D 92 C2 6B 37 9F E6 65 BC 52 41 86 1D
       data hash MD5: 64K
       4D 29 ED 88 B4 9F A6 32 AC DA 22 0A 54 1D A5 C5>)
(   2,<2007-02-12 09:28:03.63 +000>,<MAYBRIDGE\nmr>,<NMR_250MHZ>,
      <Start of raw data processing
       ef LB = 0.3 FT_mod = 6 PKNL = 1 SI = 32K 
       data hash MD5: 32K
       46 40 21 E8 59 DB 14 34 72 F8 C1 2C C0 15 07 91>)
(   3,<2007-02-12 09:28:05.56 +000>,<MAYBRIDGE\nmr>,<NMR_250MHZ>,
      <apk 
       data hash MD5: 32K
       7A 65 CF 91 A3 4D 19 BB C0 10 7A 0F A5 D7 75 19>)
(   4,<2007-02-12 09:28:06.82 +000>,<MAYBRIDGE\nmr>,<NMR_250MHZ>,
      <abs ABSG = 5 
       data hash MD5: 32K
       E6 64 4A A2 F8 9D 1D 60 E1 91 BF 47 1E 54 BB EC>)
$$ ##END=
$$ 
$$ hash MD5
$$ 13 2D A6 18 4B D9 30 4B 70 73 C7 32 CA A1 D6 1D
##$RELAX= 
##$RELAX= 
##$RELAX= 
##$RELAX= 
##$RELAX= 
##$RELAX= 
##$RELAX= 
$$ Bruker specific parameters
$$ --------------------------
##$DU= <C:\u>
##$EXPNO= 700
##$NAME= <ADRS>
##$PROCNO= 1
##$TYPE= <nmr>
##$USER= <dgb>
##$AMP= (0..31)
100 100 100 100 100 100 100 100 100 100 100 100 100 100 100 100 100 100 
100 100 100 100 100 100 100 100 100 100 100 100 100 100 
##$AQSEQ= 0
##$AQ_mod= 3
##$AUNM= <au_zg>
##$AUTOPOS= <42 >
##$BF1= 250.13
##$BF2= 250.13
##$BF3= 250.13
##$BF4= 250.13
##$BF5= 500.13
##$BF6= 500.13
##$BF7= 500.13
##$BF8= 500.13
##$BYTORDA= 1
##$CFDGTYP= 0
##$CFRGTYP= 5
##$CHEMSTR= <none>
##$CNST= (0..31)
1 1 145 1 1 1 1 1 1 1 1 1 1 1 1 1 1 1 1 1 1 1 1 1 1 1 1 1 1 1 1 1 
##$CPDPRG= <>
##$CPDPRG1= <>
##$CPDPRG2= <>
##$CPDPRG3= <>
##$CPDPRG4= <mlev>
##$CPDPRG5= <mlev>
##$CPDPRG6= <mlev>
##$CPDPRG7= <mlev>
##$CPDPRG8= <mlev>
##$CPDPRGB= <>
##$CPDPRGT= <>
##$D= (0..31)
0 1 0 0 0 0 0 0 0 0.06 0 0 0 0 0 0 0.0002 0 0 0 0 0 0 0 0 0 0 0 0 0 0 
0 
##$DATE= 1171272462
##$DBL= (0..7)
120 120 120 120 120 120 120 120 
##$DBP= (0..7)
150 150 150 150 150 150 150 150 
##$DBP07= 0
##$DBPNAM0= <>
##$DBPNAM1= <>
$$ [...]
##$SUBNAM7= <"">
##$SUBNAM8= <"">
##$SUBNAM9= <"">
##$SW= 20.6930455092707
##$SWIBOX= (0..15)
0 0 3 0 0 0 0 0 0 0 0 0 0 0 0 0 
##$SW_h= 5175.983436853
##$TD= 65536
##$TD0= 1
##$TE= 295.16
##$TE2= 300
##$TE3= 300
##$TEG= 300
##$TL= (0..7)
0 120 120 120 120 120 120 120 
##$TP= (0..7)
150 150 150 150 150 150 150 150 
##$TP07= 0
##$TPNAME0= <>
##$TPNAME1= <>
##$TPNAME2= <>
##$TPNAME3= <>
##$TPNAME4= <>
##$TPNAME5= <>
##$TPNAME6= <>
##$TPNAME7= <>
##$TPOAL= (0..7)
0.5 0.5 0.5 0.5 0.5 0.5 0.5 0.5 
##$TPOFFS= (0..7)
0 0 0 0 0 0 0 0 
##$TUNHIN= 0
##$TUNHOUT= 0
##$TUNXOUT= 0
##$USERA1= <user>
##$USERA2= <user>
##$USERA3= <user>
##$USERA4= <user>
##$USERA5= <user>
##$V9= 5
##$VALIST= <valist>
##$VCLIST= <CCCCCCCCCCCCCCC>
##$VD= 0
##$VDLIST= <DDDDDDDDDDDDDDD>
##$VPLIST= <PPPPPPPPPPPPPPP>
##$VTLIST= <TTTTTTTTTTTTTTT>
##$WBST= 1024
##$WBSW= 4
##$XGAIN= (0..3)
0 0 0 0 
##$XL= 0
##$YL= 0
##$YMAX_a= 537190
##$YMIN_a= -547762
##$ZGOPTNS= <>
##$ZL1= 120
##$ZL2= 120
##$ZL3= 120
##$ZL4= 120
##$ABSF1= 16.522
##$ABSF2= -4.171173
##$ABSG= 5
##$ABSL= 3
##$ALPHA= 0
##$AQORDER= 0
##$ASSFAC= 0
##$ASSFACI= 0
##$ASSFACX= 0
##$ASSWID= 0
##$AUNMP= <proc_1d>
##$AZFE= 0.1
##$AZFW= 0.1
##$BCFW= 0
##$BC_mod= 0
##$BYTORDP= 0
##$COROFFS= 0
##$CY= 12.5
##$DATMOD= 1
##$DC= 0
##$DFILT= <>
##$DTYPP= 0
##$F1P= 14.0000005364418
##$F2P= -0.99999901652339
##$FCOR= 0.5
##$FTSIZE= 32768
##$FT_mod= 6
##$GAMMA= 0
##$GB= 0
##$INTBC= 1
##$INTSCL= 1
##$ISEN= 128
##$LB= 0.3
##$LEV0= 0
##$LPBIN= 0
##$MAXI= 10000
##$MC2= 0
##$MEAN= 0
##$ME_mod= 0
##$MI= 0
##$NCOEF= 0
##$NC_proc= -2
##$NLEV= 6
##$NOISF1= 0
##$NOISF2= 0
##$NSP= 0
##$NTH_PI= 0
##$NZP= 0
##$OFFSET= 16.522
##$PC= 1
##$PHC0= 229.4473
##$PHC1= 4.768863
##$PH_mod= 1
##$PKNL= yes
##$PPARMOD= 0
##$PSCAL= 4
##$PSIGN= 0
##$REVERSE= no
##$SF= 250.13
##$SI= 32768
##$SIGF1= 0
##$SIGF2= 0
##$SINO= 400
##$SIOLD= 32768
##$SREGLST= <1H.CDCl3>
##$SSB= 0
##$STSI= 32768
##$STSR= 0
##$SW_p= 5175.98343685301
##$SYMM= 0
##$S_DEV= 0
##$TDeff= 65536
##$TDoff= 0
##$TI= <Analysis number 999999
Compound Code 99
Book Reference 9
Project Code 9>
##$TILT= no
##$TM1= 0
##$TM2= 0
##$TOPLEV= 0
##$USERP1= <user>
##$USERP2= <user>
##$USERP3= <user>
##$USERP4= <user>
##$USERP5= <user>
##$WDW= 1
##$XDIM= 32768
##$YMAX_p= 354032529
##$YMIN_p= -31605
$$ End of Bruker specific parameters
$$ ---------------------------------
##NTUPLES= NMR SPECTRUM
##VAR_NAME=  FREQUENCY,     SPECTRUM/REAL,   SPECTRUM/IMAG
##SYMBOL=    X,             R,               I
##VAR_TYPE=  INDEPENDENT,   DEPENDENT,       DEPENDENT
##VAR_FORM=  AFFN,          ASDF,            ASDF
##VAR_DIM=   32768,         32768,           32768
##UNITS=     HZ,            ARBITRARY UNITS, ARBITRARY UNITS
##FACTOR=    0.157963299565203, 1,           1
##FIRST=     4132.6476996994, 0,             0
##LAST=      -1043.33573715361, 0,           0
##MIN=       -1043.33573715361, -31605,      0
##MAX=       4132.6476996994, 354032529,     0
$$ Real data points
##PAGE= N=1
##DATA TABLE= (X++(R..R)), XYDATA
$$ [...]
16562a323o05K676M857M55n234l450m712o579k686L236J459k765K981K497O11
16547h582l193m06M814k053l69P32k951k952O79k557R056M109L13N3o122L76o64
16530i717L719N537l684k877M051M0n332M549P470l278l422j670k175k418J650
16515g557L511J806q62j873L979O482J2M64j97q136r354l667K893K984p42k009
16499a2266n890j383O234P033N769M386L848L41m773m134m610l576j660p64O492
16484d953L040k754K032j527j572j003l009R10J3955Q23j0303P90J965K913r05
16469D02Q15j289P225l423l516k014k082K386J533N385m78j965l949l76L414p80
16453A288k145n605k016L909L552N187N351o437j2568k49P621L018J827l871r207
$$ y = [-1323, -1928, 748, 5605, 6060, 826, -2624, -7336, -13915, -16601, -13365, -11906, -14671, -11690, -9193, -8582, -11775, -12181, -7367, -9420, -9789, -9057, -12008, -14960, -14281, -16838, -7782, -3673, -3360, -3307, -9429, -9053, -9717, -5998, -461, -4145, -7022, -2971, -2931, -8263, -3714, 3756, 478, -2944, -4614, -6789, -9207, -7557, -4046, -2240, -3102, -4975, -996, 5486, 5498, 5962, 5765, -2371, -11725, -15392, -12499, -9515, -10257, -12266, -18156, -19539, -13305, -6272, -503, 3883, 7731, 8072, 3299, -835, -5445, -9021, -10681, -11445, -4953, -1913, -4667, -2635, -4162, -5734, -6737, -9746, -8836, 5119, 5942, -4361, -3571, -1606, 1307, 402, 1217, -72, 7153, 3730, 214, -1800, -3882, -1496, 37, 5422, 4944, 2979, -970, -1346, 2068, 1288, -857, -6462, -8478, -4569, -1017, 4170, 9521, 3084, -9484, -9733, -2112, 906, 2733, -1138, -10345]
16438a0345m103K588K352J182K886K562Ok807L382L51N85p413r874j573L599K780
16422a3842M573m086N834L483J166n152m418J323N239R0L742M462p421k247J086
16407f168K333M120J407K420l212M352p308P12J0113n033p273n625p80k77N018
16392e201k369M19J460r35l455K656J228O485k382j522n609m315K426M538M96
16377f080J340J576K242R588N706N074l621n154j274K163j002p327q025o87P001
16362A520j640j965K957m358j636P024j364p509n82op688k010K862R438L545q97
16346b309j190k287K302J436m418k54M686M33O45J224q843k723j270J130L779
16331g659J137k191k668J446q148K326r16o822K909P124L225P458J0790J0557
$$ y = [-10345, -14448, -11860, -9508, -8326, -5440, -2878, -2872, -5679, -2297, -1946, -1361, -8774, -18648, -20221, -16622, -13842, -9269, -13355, -7521, -4038, -2872, -8024, -12442, -11119, -5880, -5790, -2048, 2414, -5007, -7254, -6168, -3835, 285, 1692, 4112, 900, 5252, -2056, -1344, 8769, 3736, -3537, -9162, -9942, -10219, -5201, -7570, -7151, -5691, -6626, -10081, -7425, -6197, 288, -2094, -3616, -9225, -13540, -11114, -6576, -6080, -4740, -3164, -922, 8666, 14372, 19446, 15825, 10671, 9397, 11560, 10558, 3231, -4794, -5481, 1520, -120, -2085, 872, -3486, -5122, 1902, 538, -6971, -7553, -7559, -15247, -17257, -14395, -4957, -1412, -2309, -3499, -5786, -3484, -2048, -6466, -6720, -2034, -1601, -956, 268, -8575, -11298, -12568, -11438, -7659, -6522, -8713, -11381, -9935, -18083, -15757, -16673, -23495, -20586, -13462, -10237, -2779, 8011, 18568]
16317A8568Q331O660p996j4742q422l503N30l515l532L793l933r57P462K124k562
16302a694k437J819j298n767O749M517M940J474J447k307J970K154o181p17O473
16287A1142J2094M065J0087J0696N321j2023j1339r634m504n96m99q407n347L379
16273D435l317o06J897l106M944K020j262O448k318K219J722J614j4374j0393
16259a0077m38M844N083l665O173J1101Q701J3945J4955Q272l782j5517j6776
16246B2819p789m553Q96m749L39J69J887l492j337k100m540m135M37j114J562
16231e700O994J0444M83k34j610N54j258k574J0764J1479j265m330J1878J6432
16217E2057O943J508q919j8202j1619N95K529K773M208M281j467j1821q774q14
$$ y = [18568, 26899, 33559, 25563, 10821, 2399, -1104, -574, -4089, -7621, -3828, -7761, -8718, -1256, 868, -1694, -4131, -2312, -3610, -9377, -2628, 1889, 6829, 8303, 9750, 7443, 9413, 11567, 5386, 4669, 11142, 23236, 27301, 37388, 48084, 53405, 41382, 30043, 20409, 15905, 15309, 14810, 6403, 1056, 4435, 1118, 512, 2409, -697, 4247, 6267, 5005, 11453, 9135, 11354, 13076, 14690, 316, -10077, -10515, -5671, -588, -4253, 1920, 13021, 21722, 35667, 50622, 58894, 55112, 39595, 22819, 15030, 10477, 11373, 6624, 6963, 7132, 9019, 5527, 4190, 2090, -2450, -6585, -6148, -7262, -5700, 1294, 11738, 12221, 11987, 10377, 10931, 9673, 7099, 17863, 29342, 28077, 23747, 35625, 52057, 59000, 60508, 51589, 33387, 21768, 22363, 24892, 27665, 31873, 36154, 34687, 22866, 14092, 13278]
16203A3278j49l211j09k718r430l309J373L169O83N87p28o362j45O246J100L453
16187C728N894R782Q098RK579K033r109n312N89L618K12J2405K0872K2617j856
16172G6159j9267k0084j2716l350n920n681M075m285p222o741k502K799L784J269
16158C18l634j724M907O709o742p151q23R8j662L100M890L110M798J3684P320
16143B7198J4435J5306J5705l47j4175j6921q811m298j0432l418l57n282lK827
16129A1427M036k206p611k451j266k18p963N33J976p841Q48O434L451k916L164
16114f03L319K242P769O684J0610J4972K4394P776j5940j9099j3356o230p892
16101A4646l186p518o495J045J605o843j331O34M568M750l306o308k256K518n834
$$ y = [13278, 13129, 9918, 9809, 7091, -2339, -5648, -4275, -1106, -423, 164, -564, -6926, -7071, -825, 275, 3728, 9622, 19404, 27502, 27511, 30090, 32123, 23014, 17702, 18291, 21909, 22121, 34526, 55398, 78015, 76159, 56892, 36808, 24092, 20742, 14822, 9141, 13216, 8931, 1709, -5032, -7534, -4735, -951, 318, -3316, -5040, -133, 6576, -166, -7317, -8140, -8042, -9704, -6604, -1714, 1396, 6194, 19878, 27198, 41633, 56939, 72644, 72297, 58122, 41201, 32390, 28092, 17660, 14242, 13885, 8603, 8600, 11427, 15463, 13257, 5646, 3195, 1929, 1711, -6252, -5719, -3743, -11584, -10736, -4302, -851, -3767, -603, 2716, 4958, 12727, 19411, 30021, 44993, 69387, 77163, 61223, 42124, 28768, 22538, 14646, 11460, 3942, -2553, -1508, 97, -6746, -8077, -7443, -2875, 1875, -1431, -7739, -9995, -7477, -13311]
16086a3311o626j535P496O210L404M207J446J64J710P814J0925M926N399k259
16072B9970j0131r677k337n600j262M681M760p865j0617o503j149J105p83P16
16058a4692M109M506j763J015J297M309K325P84o657q269N381Q539M12J965n555
16043b294m572k446J452O09K579L85M783J219j3125j416J1728O129q814L530J346
16028A093K635m151m251J949L217j705M478j455J275p307o970P442K657l158K2
16013d229o389m414L471L562M178J937J61k1n790N64K17q486l418N279O147j850
15997i081K501k030R10n17J475N7J586L279j503l927J231K80N023Q508J110r97
15981G905o256p521J351J945j581Q56j266M257Q551M256J14j003j2756k493o878
$$ y = [-13311, -19937, -21472, -13976, -7766, -4362, -155, 1291, 1455, 3165, 10979, 21904, 26830, 32229, 29970, 19839, 10162, 7825, 2225, 963, 5644, 10404, 2539, -8078, -14581, -15730, -14625, -15408, -14692, -10583, -6077, -7840, -6825, -5528, -1219, 1106, 1890, -4767, -13036, -7655, 884, 1296, 3261, -2294, -6866, -9312, -7860, -7251, -4672, -4287, 496, 1715, -11410, -12826, -1098, 5031, -3783, -253, 1093, 3728, -423, -4674, -2725, 492, -1213, 3265, 1810, 3085, -4222, -11192, -3750, -1093, -4251, -4229, -10618, -15032, -11561, -7999, -3821, -1884, -1723, -1744, -7534, -6970, -6753, -15239, -18657, -13378, -7231, -9081, -6580, -8610, -7700, -8217, -6742, -6685, -5099, -1820, -3323, -7250, -6019, -5739, -716, 7792, 8902, 7905, 1649, -5872, -4521, -2576, -4157, -3301, -4567, -310, 8241, 12497, 12611, 11608, -1148, -3641, -10519]
15966a0519j395j265K124j242m857L881J566J201N61K608m565J954O35o71K254
15951g730j79l967j497O108K777M971K237m931n740j100n509N25O090k357pN615
15935d694Q939P46k170n147J290O91k091J098J453K07k155j741K508K263l485
15920b288J006k067o534N03K195j937l038l464L08O414k376J278M382o139P011
15905d746N800j463r16Q19k739K845L495jl486n295K409P636m890k934J710m046
15889e802j512K673K46J01J983L282n01q644l780j607J787M747J2241R82n702
15874D94l379j582L984N109j160l264r09K437N456l600j0422m135O848P267j953
15859A191j451k764N050m438k872Q59j413l152N315L772o072q620P780K980L418
$$ y = [-10519, -11914, -13179, -11055, -12297, -17154, -13273, -11707, -10506, -9945, -7337, -11902, -9948, -9313, -9984, -7730, -7909, -11876, -13373, -7265, -4488, 483, 2720, -2211, -7951, -9051, -14560, -14035, -7945, -10302, -10309, -4694, 4245, 4991, 2821, -2326, -1036, -345, -2436, -1338, 115, 322, -1833, -3574, -1066, 1197, -2288, -1282, -3349, -9883, -9380, -7185, -9122, -12160, -15624, -15316, -8902, -11278, -10000, -5618, -11757, -4746, 1054, -409, -1325, -506, -3245, -400, 3095, 3094, -392, -5687, -3278, 4358, -532, -3466, -1756, -5802, -7314, -4641, -4395, -4294, -2311, 971, 470, -8174, -11954, -13561, -11774, -7027, 5214, 6196, 494, -2885, -4467, -483, 4626, 3466, 202, -707, 1730, 7186, 3586, -6836, -10971, -4123, 3144, 1191, -260, -3024, 2026, -2412, -5284, -4425, -5838, -8990, -3675, 97, -5975, -14595, -6815, -3835, -417]
15844d17l468p696L204j154k508j148q94P071M11k775J09J705N440k577k285m46
15828g428P122M472k29j809l991j768k237M831r358p302n96J074P072Q923J438
15813B14j307n365j871N534J083k914m929j414o0j3422p154O968R060P578K578
15798e421n36J878o31n914m458l948O476K176O465M355K546R396k926n694L774
15783G538J887o691n907j648j12K45N586K927k392j963k95N67j068k802k466M536
15767b058n6j169l365o84l441P33J631J168l321N081J086p96l134J509J095L647
15751b074J385J586r71j518j1030j121r23O657n215l145j704J543Q006R209J030
15736A715k664L510n320r358l848L440R097L913q03M325J332o795l637k18p322
$$ y = [-417, -3885, -11581, -8377, -9531, -12039, -13187, -14081, -7010, -6599, -9374, -9265, -7560, -2120, -4697, -6982, -7428, -306, 4166, 3937, 2128, -1863, -3631, -5868, -1037, -10395, -17697, -18293, -17219, -10147, -1224, 214, -1093, -6458, -8329, -2795, -1712, -4626, -9555, -10969, -11029, -24451, -31605, -24637, -15577, -7999, -5421, -5957, -4079, -4710, -10624, -15082, -19030, -12554, -10378, -3913, 442, 2988, 12384, 9458, 3764, 7538, 9425, 2734, -3173, -4821, -4933, -4688, 898, 3825, 1433, -530, -825, -258, -1326, -4128, -6594, -2058, -2114, -3283, -6648, -7332, -10773, -10040, -8409, -7241, -10562, -5481, -4395, -5191, -8325, -6816, -5721, -2074, -689, 897, -74, -1592, -12622, -13743, -14666, -8009, -13224, -16369, -18073, -16530, -8524, 685, 1715, -949, 2561, -2759, -12117, -15965, -12525, -3428, 485, -318, 4007, 5339, -1456, -5093, -5311, -12633]
15721a2633n21P642r63L579J2380j030l954J87j199p980j056M458k706k927j186
15706g909N718j024N59o01L216n05p510L912m97M227o493j780K617j697j050M979
15690c838K869k495m330Q77N045Q57J829O41j13K376j22L975J372j804J232k168
15674F203L616l234l474J95P04j840j567r279l680k969M334L651J118O88k191
15659g725k519J066K502N19L196m087J327J022l531m567M484L163J896L843K711
15644C300M50m50j786o888L056J53J942L625q283n571l295k620N66J534M59k523
15628a6331L563k500L921O90N47J687l089P11J533O286P058N941K785K558o162
15613I198m865O96k536l619j93l185n125l608M253L591p525J808P636k048l836
$$ y = [-12633, -13154, -5512, -6475, -2896, 9484, 8454, 4500, 4687, 3488, -4492, -5548, -1090, -3796, -6723, -7909, -2191, -3215, -2656, -3257, -41, -546, -8056, -4144, -4641, -414, -6907, -8687, -6070, -7767, -8817, -3838, -969, -3464, -7794, -6917, -1872, -1015, 814, 1455, 1342, 3718, 3596, 7571, 8943, 7139, 8371, 6203, 9819, 6585, 3111, 3306, 4010, 2170, 603, -8676, -12356, -15325, -10991, -7340, -6222, -5534, -7725, -10244, -9178, -6676, -6157, -2961, -7048, -5721, -4699, -8230, -12797, -8313, -5150, -3254, 589, 3300, 3750, 3300, 1514, -5374, -2318, -2165, -223, 3402, -4881, -10452, -13747, -16367, -15801, -14267, -13808, -16331, -12768, -15268, -11347, -10657, -10110, -8423, -11512, -10801, -9268, -2982, 4076, 10017, 12802, 15360, 9198, 4333, 5029, 2493, -1126, -1319, -4504, -9629, -13237, -8984, -5393, -12918, -11110, -3474, -5522, -9358]
15598i358J871R16j205P33k077m942O480j029l784M120k149o86K864O45n60P311
15582h50J828m171l854m811q74k243K326L043N977k598kp08l43K106J251j964
15566e887P508N082l300j918j846k069J176p668J340O236j02j659r74m2R3K436
15550a594N958k874J02L536n902o703n05n16m83m044l554M073J863q14j75J144
15534a0488k684L120N829M404k20Q66n189r87J0113L451j0988m518M702P160J863
15519F434m865n294N507j382m060p702Q12N430Q436J665l720O29l14n282p404
15504a1110P68p08K043j887k534R76Q537j654m26K707k061l557n712M55N647l96
15488h912k352J48K622J222K514O993J82j091l198j285j561p320q013P091J0569
$$ y = [-9358, -7487, -6571, -7776, -7043, -9120, -14062, -7582, -8611, -12395, -8275, -10424, -11110, -8246, -7601, -8161, -850, 978, -3193, -7047, -11858, -12732, -14975, -12649, -9606, -3629, -6227, -6229, -6937, -7280, -5174, -3923, -5887, 1621, 6703, 3403, 1485, -361, -2430, -1254, -8922, -7582, -1346, -1448, -3107, -4081, -4123, -4030, -1594, 4364, 1490, 1592, 5128, -774, -7477, -7982, -8498, -8981, -13025, -16579, -12506, -10643, -11457, -11632, -10488, -13172, -10052, -4223, 181, -39, 827, -4362, -5349, 4764, 8215, -2773, -7291, -2589, 4571, 6434, 1569, -3725, 1782, 400, -3660, -11362, -10550, -5120, 3316, 4981, 1261, 1890, 1576, -3706, -11110, -10342, -11050, -9007, -10894, -13428, -12452, -3915, -5569, -5995, -3288, -5349, -8906, -14618, -14163, -8516, -8912, -11264, -11116, -8494, -7272, -4758, 2235, 2417, 1326, -1872, -3157, -4718, -12038, -20051, -12960, -2391]
15473b391L548l241j036q09l32Q06j257K716k90m543L392K858l255j43k246m459
15457a0682K391J797K721L813L528n576n151J620N376L061n446k693K995n286
15443g532l998k624l450k32L060R402j493l160o089N767J5340j680m602m841M882
15428a250j882q290j643L412j0443k661M102J2057J1036j068o476p566L702o13
15414g583Q187N229J35l290P57N831O37K032m233o362l832K045r62l198n486j032
15398a1125j631l832N70J121K939J677j09j221Q3N483M380m173m929M672K903
15383c192k023j1064L588L913p542K229O346L081N210j734J404n669p361L208
15369i606J416N477K634m873n400L702K357k829j618L996L046o10L040J043k802
$$ y = [-2391, 1157, -2084, -3120, -3929, -4261, -3455, -4712, -1996, -2286, -6829, -3437, -579, -3834, -3977, -6223, -10682, -8291, -6494, -3773, 40, 3568, -2008, -7159, -5539, -163, 2898, -2548, -5241, -2246, -7532, -11530, -14154, -17604, -17836, -14776, -5374, -6867, -10027, -16116, -10349, 4991, 3311, -1291, -6132, -1250, -3132, -11422, -13065, -9653, -20096, -22757, -18655, -6598, 4438, 3370, -3106, -10672, -6970, -7583, 604, 5833, 5968, 2678, 3435, 9266, 9903, 11935, 7702, 1340, -2492, -447, -1409, -4607, -10093, -11125, -12756, -16588, -16018, -14897, -11958, -10281, -10390, -11611, -11528, -6045, -1665, -5838, -10767, -6095, -3192, -5215, -16279, -12691, -8778, -16320, -14091, -7745, -4664, 546, -1188, 216, -5453, -12814, -9606, -8190, -2713, -79, -4952, -10352, -6650, -4293, -7122, -8740, -4744, -1698, -2308, 732, 1775, -1027]
15354a027l187p12m389n205L708j199l205J909M897k957N594O048m234L322j295
15339a932j389k0p2k46K637o03m005o469L304L771N136K487j893P16r55k958l791
15322f282n314M986J796L502j189k023J643N227n022k513N561j906j365L397P374
15307G872j780k578K859k679n629n398N360l763q376p018o144J2098J4598N161
15293D583j924R68Q21r399j834N02M051M473M149n584m624O31K381n51l22M062
15277B383j006m213n229j442N554P165L36l382m058K032L199n686j1201p57o07
15262a6912J0248M213m218K808M497K287K091n765p316O226N263j656k24k739
15248a197M883n58K56j152N27J579L867O040Q491N597R050q12k478l186k200K053
$$ y = [-1027, -4214, -4926, -9315, -14520, -10812, -12011, -15216, -13307, -8410, -11367, -5773, 275, -3959, -637, -1932, -3321, -3341, -3413, -3659, -1022, -1625, -5630, -12099, -8795, -5024, 112, 2599, 706, 1422, 467, -2491, -6282, -11596, -6610, -4814, -1312, -2501, -4524, -2881, 2346, -2676, -5189, 372, -1534, -2899, 498, 7872, 6092, 3514, 6373, 3694, -1935, -7333, -1973, -5736, -14112, -21130, -27274, -15176, -578, 4583, 2659, 3627, 4448, -4951, -6785, -6283, -2232, 2241, 6390, 806, -3818, -3187, -806, -1357, -1679, 2383, 1377, -2836, -8065, -9507, -3953, 3212, 3548, 166, -3892, -1860, 1339, -4347, -15548, -16305, -16912, -6664, -2451, -6669, -3861, 636, 2923, 5014, -751, -8067, -1841, 3422, 1766, 1542, -1197, 3686, 3128, 3384, 2232, 2759, 4338, 8205, 14245, 22736, 28333, 37383, 36571, 34093, 30907, 28707, 30760]
15232C0760Q305M436J7355K4011L1597P758j1260k1556j5925j0690n563k802M343
15219F0769J9334L2489K8083q459k7129k8542k6276j6582j6953k869Q809Q163
15207C0837J0975K532j2316j0115k612m819q325k642M587j957j469n920m443M785
15193i02l52r81l93J074M386m059o400K844Q71k364o031j860M585O201l839l546
15177a0766O20J889P693J568M078P918q187o444J236M079l167J555k564J381K325
15162C214q258k084M488l734j0601O519L690p084L7R496K151l844k330J363j622
15147h599m0J248M235J372q654k550N213n72N401r21l914m531N150O292J430l653
15131c093K621N890N297J704J289j78j21O109J1430P076N032J2620J7028J6847
$$ y = [30760, 39065, 43501, 60856, 84867, 116464, 124222, 112962, 91406, 75481, 64791, 59228, 56426, 60769, 80103, 112592, 140675, 132216, 105087, 76545, 50269, 33687, 16734, 13865, 22674, 30837, 41812, 44344, 32028, 21913, 19301, 14482, 6157, 3515, 8102, 6145, 4676, -1244, -5687, -902, -1254, -2235, -2628, -1554, 2832, -1227, -7627, -4783, -3912, -6276, -12307, -14167, -9582, -3381, -7220, -10766, -10146, -8257, -564, 1004, 5082, 13000, 4813, -1631, -395, 3684, 517, 2072, -492, 889, 3214, -5044, -7128, -2640, -6374, -16975, -10456, -6766, -13850, -13813, -4317, -2166, -6010, -8340, -6977, -8599, -8639, -7391, -3156, -1784, -10438, -12988, -7775, -8347, -2946, -3867, -7781, -12312, -7162, -870, 560, -3093, -472, 5418, 10715, 12419, 13708, 13530, 13409, 19518, 30948, 38024, 43056, 55676, 72704, 89551]
15117H9551K328k1511j8931p026n589N70J0943J3931J9861J6456m722j7849k6755
15104E1257j1460r576j2412j798j966O10N812K242m037o267o221k455l409J378
15090A698j348p679N63M469j04l533J394j655k581M540j12l518J109N928O137
15075E308j384j3423l829n734j092O762R439N217N570j120o569o815P75P566k004
15060a333m352K49J844r436m334R820N919K789l799l707p505j869KN497K465J928
15044e822o563L584N774m903j645l363M69O732M277p615K757J661M564L765k773
15029H99l967j51M942j268L756k197m129J189k57J216M611q72l189n435M57J962
15013b433p101k710p19N474R341N690j796n102O399J9199J6386N440R40j2550
$$ y = [89551, 91879, 70368, 51437, 44411, 38822, 39392, 50335, 64266, 84127, 100583, 95861, 78012, 51257, 39797, 30221, 17809, 16011, 14045, 14655, 20467, 22709, 18672, 12405, 6184, 3729, 320, 1698, 350, -7329, -6766, -2297, -2401, -5934, -4540, -6195, -8776, -4236, -4348, -7866, -6757, -829, 5308, 3924, -9499, -13328, -19062, -20154, -13392, -3953, 1264, 6834, 5714, -855, -7670, -6895, 671, -1333, -5685, -5436, -3592, -13028, -17362, -7542, -1623, 1166, -2633, -6340, -13845, -15714, -15712, -10215, -7750, -5822, -12385, -8801, -3027, -7930, -9575, -12938, -12469, -5737, -1460, -9075, -6318, -4657, -93, 3672, 899, -3068, -3219, 1723, 455, 4211, 2014, -2115, -926, -1183, 33, 4644, 3772, 583, -4852, -4395, -2433, -9534, -12244, -12963, -7489, 1852, 7542, 5746, 644, 7043, 26242, 42628, 48068, 49008, 36458]
14999C6458j2666k127O974J7510K2325K8314K6531k255k0374k4920j8819n494
14987E1457L615Q002K7051K5293J2287j4394l3618j8044j1094n055m005m540j443
14974C5512O261m71j3119j9350q489p914R3N952K880K107L216K262l596M00m113
14959A631N58L45m154n935J805L646N763N599j966n686j26J081j607m144k899
14944f089P122j294q726K297M230Q388N137R642Q349J695j825p870k024L794R842
14929C2668J8628K7535K2903Q810j5193k8703k0234n152k034J2622K0240K0084
14917I2174J5382j420k1079k4240j5549r250q285M365M525N065m043n793o811
14904B5041p528k238m259n580o419q28L848l904n311J130k274J484O978J609L222
$$ y = [36458, 23792, 21665, 28639, 46149, 68474, 96788, 123319, 121064, 100690, 75770, 56951, 51457, 55072, 63074, 90125, 115418, 127705, 113311, 79693, 61649, 50555, 45500, 41495, 36955, 35512, 41773, 41302, 28183, 8833, 344, -7570, -7477, -1525, 1355, 3462, 6678, 8940, 5344, 5744, 1631, 2189, 2534, -1620, -7555, -5750, -2104, 3659, 9258, 7292, 1606, 1480, 2561, 954, -3190, -6089, 1033, -261, -8987, -6690, -2460, 5928, 11065, 20707, 29056, 30751, 28926, 21056, 19032, 22826, 32668, 51296, 78831, 101734, 110544, 95351, 66648, 46414, 41262, 39228, 51850, 72090, 92174, 107556, 106136, 85057, 60817, 45268, 36018, 27733, 32098, 36623, 41688, 37645, 31852, 25041, 17513, 15275, 11016, 5436, -983, -1811, 2037, -1867, -7178, -6048, -8322, -6838, 140, 1749, 4971]
14889D971r867o532M21P193J2521N424n585n658n900m306P133J550l672m250j83
14874f740j001K693k265N481J431j0398m213J244P53M810R3r253L07M191J284
14859a1583K771o47j453L004q430J619J2044K642R97j363P11P473k570l588j180
14844D47j565M770j108j1386m770j122N744O747j222o29J611L752R27j420K100
14829B876j530k287m047l819q58l421m239L826N450N478M862K605L520j796L037
14814I657J41k495o596n612l968O195M333j984l549R88k375o168J74j207j480
14799a3946J230P696o25j163K32j210K065L422k408m358K183K002n885L44N448
14784d973M355J594K034K225j26n997l249j492m553Q6j921l131L760j64j699N823
$$ y = [4971, -4896, -11428, -11007, -3814, 8707, 14131, 8546, 2888, -3012, -7318, -185, 1365, -2307, -6557, -6740, -7741, -5048, -7313, -1832, -401, -10799, -15012, -13768, -13015, -8205, -8112, -17365, -17058, -12867, -11583, -8812, -9459, -10912, -7908, -16338, -14719, -2675, -33, 964, -399, 312, 7785, 5215, 1627, 447, -1118, 3652, 2544, -8842, -13612, -14734, -8990, -2243, -3465, -4094, -2483, 1269, 2196, 776, 2876, 1346, -941, -4988, -8807, -9665, -13086, -17325, -13499, -8049, -2571, 2291, 4896, 8416, 6620, 9657, 9798, 7303, 707, -4905, -8873, -2678, 1655, -329, -3878, -2890, -5265, -11433, -11259, -12466, -13946, -12716, -5020, -5645, -6808, -6576, -7786, -5721, -2299, -4707, -9065, -6882, -4880, -10765, -10421, -4973, -618, 976, 3010, 5235, 5109, -888, -4137, -5629, -10182, -10096, -12017, -15148, -11388, -11552, -13251, -7428]
14768g428L285k927O65L795l557k904K226Q153J20L59p114O233k901l546m840
14753a0381k658K030J501m705J48M436K637K186L161P123L384l891n105k73o774
14738g181L635M554j132j902L77J398j171K084K623m669q47n827M22J81n556M49
14722a2562M081O997Q692m08p179o116p484L489P798L362k322l040L629M457j33
14707C261k399l839J928n270K877N231L717J041o253j2544l623J268l657O575
14693a1687J0984k224P22N997l777r342K057J314n035L120r32K348O973n41j632
14678a655l430m903O72O229n887n877P43M000L013M283o46k66J83n072j194j97
14662a0004P959Q08m17l072k518M70L560M687p023l864L06M797r95p481J534O829
$$ y = [-7428, -4143, -7070, -6405, -2610, -6167, -9071, -6845, 1308, 1428, 1787, -5327, 906, -1995, -5541, -10381, -13039, -11009, -9508, -14213, -14065, -9629, -6992, -4806, -1645, 5478, 8862, 4971, -134, -407, -7181, -3546, 1008, -124, -2026, -1649, -251, -1422, 662, 3285, -1384, -2231, -8058, -7636, -7455, -13011, -12562, -8481, -1484, 7208, 6800, -379, -6495, -13979, -10490, -2692, 670, -1652, -4692, -1063, 3394, 3261, 862, -2977, -1049, -6319, -3442, 1789, 5506, 6547, 294, -12250, -15873, -14605, -18262, -11687, -703, -2927, -2205, 3792, 15, -9327, -7270, -5956, -10991, -7871, -8803, -6455, 518, -23, -1655, -5085, -9988, -9316, -3087, -8974, -14851, -14108, -10108, -7095, -2812, -3458, -3724, -3541, -8613, -9807, -10004, -2045, -1237, -1654, -4726, -7244, -6774, -3214, 1473, -5550, -9414, -9108, -4311, -5306, -12787, -11253, -4424]
14646d424K621o96M040k102j65O33J149l684m688M232J834k478L000J0460J291
14631A1023j881q219m473o169l6K541m65K032M457O821L208m499J43N97L42p939
14615b517j0231n518P015J0617J401J27O516J961j264J01l222l312j246o268j351
14600g191L560l883p47O940K525k982n125L441j901l43m91k339L12L134L751O28
14584g11k208K599J26k628P81j36m200l514K129K713K892L448L639k143m643o615
14568h471K079M798M639n389k105K37M929Jp25K395n613j130j223j939L099j631
14552f049p743J997O326K928M153l946p728l885L266K859J246L390K479L174J785
14537D252j870n523p148L789L242k837K882K452M817j149o117o587M083N512K659
$$ y = [-4424, -1803, -2499, 1541, -561, -726, -93, 1056, -2628, -7316, -3084, -1250, -3728, -728, 9732, 11023, 9142, 923, -3550, -9719, -9755, -7214, -7679, -5647, -1190, 5631, 8839, 4340, 4483, 5080, 5422, -2517, -12748, -18266, -11251, -634, 767, 894, 7410, 9371, 8107, 8208, 4986, 1674, 428, -5840, -7191, -3631, -7514, -8261, -1321, 1204, -1778, -6903, -3462, -5363, -5706, -6197, -8536, -8224, -5090, -1339, -711, -2919, -320, -194, -2822, -2041, -2177, -6377, -9891, -7762, -5049, -2157, 1291, 4930, 2787, -1856, -8471, -6392, -1594, 3045, -2344, -4449, -4212, 717, 718, -7, 2388, -3225, -4355, -5578, -7517, -4418, -6049, -13792, -11795, -5469, -2541, 1612, -2334, -10062, -13947, -10681, -7822, -6576, -3186, -707, 2467, 4252, 2382, -3141, -10289, -6500, -3258, -6095, -3213, -761, 4056, 2907, -3210, -9797, -5714, -202, 2457]
14522B457j966k5o84n882j771j900M071N722m069k842M138K894m098k744p32l616
14506a1047o592K074J562N628N587l441q11O38l652Jl024L437J906k190M825P050
14490A951K079j585Q83o432k028L101m090k378J737L721j927l201n746q52K304
14475a2463l41N758M622P021n033m387j516j2473O169R720M833M145k035j493
14461B527k149m562m992N171O724p164m583J509K217m77o43k435m399K129Q586
14446b541O58l672l898O8Q87L380L101J091k415K85K763M146K459j0871o374O405
14430d528P769K187o691j693K663M349O41o507k602L202M292k055p644L196M743
14415A322L289j735k986k803K259J085j992m392p248k96J1870P318K749l001o833
$$ y = [2457, 491, 466, -218, -6100, -7871, -9771, -5700, 22, -4047, -6889, -2751, 143, -3955, -6699, -7431, -11047, -17639, -15565, -14003, -8375, -2788, -6229, -7040, -6402, -10054, -10053, -13077, -9640, -7734, -9924, -5099, 1951, 4030, 2445, 3328, -3104, -5132, -2031, -6121, -8499, -6762, -3041, -4968, -8169, -13915, -14767, -12463, -12804, -7046, -2424, 4597, -436, -4823, -6339, -18812, -12643, -2923, 1910, 6055, 4020, 2527, 378, -4184, -9176, -4005, 2719, -4445, -9028, -7519, -5302, -5779, -6422, -8857, -13256, -11127, -2541, -1883, -5555, -9453, -9385, -8498, -5118, -2017, -926, -3341, -3056, -293, 3853, 6312, -4559, -10933, -4528, 3241, 5428, -1263, -2956, -293, 4056, 4697, -1810, -4412, -1210, 3082, 1027, -6617, -3421, 1322, 4611, 2876, -110, -2913, -654, 431, -1561, -5953, -13201, -13497, -1627, 5691, 8440, 5439, -1394]
14400a394r186o993P368K876j1154j612M470O3Q38M329J0444J117j672j051M785
14385C228m838m168O331j824o659M199l86N83J615J164j574P253k438J488P636
14370A1610l422p430n825j570n9N274J797n44n323J279Q269o951l060L999j311
14355c267o20O154P802N032k159m534l194J338j865j5m604J263n162n57L653J412
14339F77r920j300J633J561N212o248l462J929L821K086K832k974k770N771P740
14324F588m235p493k036l177j945L468M197j478r777Q62Q585K502k159L405K195
14309d98p16n119m49J1040M628l751k689L597M068n872j399K959K243p49K337
14294I630p023m24j534m130j504j272j476o9P721j954K337p05L328J85m181m231
$$ y = [-1394, -10580, -17573, -10205, -7329, -18483, -20095, -15625, -15562, -14724, -10395, 49, 1166, -506, -1557, 3228, -1610, -5778, 553, -1271, -7930, -3731, -4117, -3534, -1919, -755, -2329, 4924, 2486, 3974, 11610, 8188, 758, -5067, -6637, -6696, -1422, 375, -169, -5492, -4213, 4056, -2895, -5955, -1956, -3267, -3887, 2267, 10069, 15101, 12942, 8408, 5214, 6552, 4687, 4672, 68, 1331, -3831, -4388, -735, 677, -9243, -10543, -8910, -7349, -2137, -8385, -11847, -9918, -6097, -4011, -1179, -4153, -6923, -1152, 6588, 2353, -5140, -7176, -10353, -12298, -8830, -4633, -6111, -15888, -15026, -6441, -3939, -6098, -2693, -498, -1214, -6333, -6782, 4258, 8886, 5135, 2446, 6043, 10111, 4239, 2840, 5799, 8042, 7293, 9630, 2607, 2183, 649, -3481, -4985, -6257, -7733, -7802, -81, -2035, 302, -403, 2925, 3110, -1071, -5302]
14278e302o461m18K217R283Q218K050q80k32m263m456k199K481k905k852j452
14263g171K355K758R115Q7o697J441K872K470l482K840k344o910M974J340N76
14248D224p289k115K055k910j159M359J801Q98j041M390l798K562M809n25l690
14233B571q839q634l750J595R088J0681K155N970L549l35j116p30l206p625j699
14218c25L248K837p87j067J424k118K765o22m368O325n76j1039J715N156M036
14203F604m502m465N183M35J263N912k790j0355n59M078P180m396k892K694J0245
14188A3635J297p982r56n43k517k114r48M60J857o262J049K603K078n525j620
14173e488L852k189k206n008K411M050O016R950k013p667l399L73J638n52j137
$$ y = [-5302, -11763, -12181, -9964, -681, 7537, 9587, 8707, 8475, 4212, -244, -2443, 38, -2867, -5719, -7171, -4816, -2058, 7057, 7144, 447, 1888, 4760, 7230, 3748, 6588, 4244, -2666, 2308, 3648, 4224, -3065, -5180, -3125, -6035, -7194, -2835, -1034, -136, -1177, 3213, -585, 1977, 6786, 6261, 2571, -6268, -14902, -18652, -17057, -7969, 2712, 4867, 10837, 14386, 14051, 12935, 12205, 8999, 1374, -325, 2923, 5760, 4973, 3906, 5330, 3212, 5977, 5355, 987, 7312, 6736, -4303, -2588, 2568, 6604, 2102, -2363, 2820, 3255, 4518, 10430, 7640, -2715, -3274, 804, 7984, 3588, 696, 3390, 13635, 14932, 6950, 5994, 5451, 2934, 820, -128, 332, 2189, -4073, -3024, -421, 1657, -3868, -5488, -1636, -3825, -6031, -11039, -8628, -4578, 1438, 11388, 9375, 1708, -1691, -1318, 320, -232, -1369]
14158a369J811M579n527j432L169N311n4j703m36l581L920Q557P10l829j783n34
14142G809l0J209L587J911l884K771L391n041k527j795j74j196J081L415l421
14127G106l223J46L980O091j803l690m47j58o360p441Q337P608m98j362j794o284
14111B08m581j860K390O96O48K9ok279Q341M97k277n868o47L055l229M854O199
14094F170m70k437k407L443R154l595n585pM39r82J78O104l4j365J662m989p85
14077D494R825L916j555k774m827j601k874M214R9O545k708r187n353J13M91K392
14061A210O85M341L754m992j0085r327P025J1129q04q94J000j428j711k624n993
14046h714n67M607P814l50n992J533M144J64o691p005n89R297J1293M298n96n897
$$ y = [-1369, 442, 5021, -506, -1938, 1231, 6542, 6488, 4785, 4349, 768, 4688, 13245, 13955, 10126, 8343, 7809, 7779, 8988, 12575, 14486, 10602, 13373, 16764, 11723, 9196, 7401, 7227, 6031, 7112, 10527, 7106, 3883, 4029, 8009, 14100, 12297, 8607, 8160, 8002, 1642, -5799, 2538, 10146, 9648, 8286, 6492, 208, -4373, -6233, -3843, -3147, -2499, -2470, -2476, -4755, 3586, 4083, 1806, -4062, -4709, -1654, -4883, -29, 6170, 5700, 3263, 856, 4299, 13453, 9858, 4273, 4266, 4705, 3723, 3901, 10005, 9971, 8606, 10268, 5279, 4494, 14319, 18235, 16680, 13906, 9079, 7478, 4604, 8818, 8917, 15462, 12754, 3567, -1786, -1673, -1182, 1210, 1895, 6236, 9990, 4998, -5087, -14414, -7389, 3740, 2936, 2042, 3042, 1614, -97, -2721, -8714, -9281, -4674, 3140, 2790, -3202, -1669, 2475, 2639, -4052, -11057, -11646, -2349, 8944, 13242, 12646, 6749]
14030F749k125J65j231J632l217m759K399K539j735l3j32L361o980j0963K18M703
14014i409J0202J905n931J754J741q949j962K834j605K29M031J0100L594M030
14000A2564m582r328m157k011L229K406N89K728r54m032N625K713r63j0984q113
13985a5270P906R577J474m158j230P284M470j808K683m970j0018k051l135O323
13971b923O439j379K232j312o052m49K410n416K280J302M535O629l544p857m923
13956h028R13j559m09O413L629N034J549J18L901J427K841jn065o186r280N67
13940d136L019o6O820n011m264K060N459K05J024N131j47q076j434J005Q29l900
13924a482N306O242J989o278k616m69n078J824l51L433J873O797q64m737J79P26
$$ y = [6749, 4624, 4789, 3558, 5190, 1973, -2786, -387, 2152, 417, 384, 252, 3613, -3367, -14330, -14112, -9409, 793, 2698, -3233, -1479, 262, -8687, -10649, -7815, -9420, -9191, -5160, 4940, 8534, 12564, 7982, -1346, -5503, -7514, -4285, -1879, -1290, 1438, 484, -3548, 2077, 4790, 3827, -7157, -15270, -7364, 2213, 3687, -471, -1701, 5583, 10053, 8245, 10928, 5958, -4060, -6111, -9246, -2923, 3516, 2137, 4369, 3057, -2995, -3444, -1034, -6450, -4170, -2868, 1667, 8296, 4752, -3105, -8028, -7115, -8674, -9083, -2670, 959, 5993, 7542, 7660, 11561, 12988, 15829, 15828, 10763, 4577, -4703, -4136, -1117, -1183, 5637, 626, -3638, -1578, 3881, 4086, 5110, 10241, 10094, 2018, 584, 1589, 2418, -1482, 3824, 10066, 12055, 5777, 3161, 2692, -2386, -562, -913, 2520, 4393, 11190, 10326, 5589, 5768, 6494]
13908F494m985l059L659n065L459j074k557j316p27J2320M723q148o130M960n444
13893b890k863L770K256N933j081k918K585J838L48k117m660j342k822j613K451
13878c125K554m332P09L655n164j038K861N270O227k416j769K969M10l451Q39
13863D199j143k475j365j622Q20K629k603m210L898p43m401L95R772K220m017
13848A354M860q23j1023R99P866k892K692J173L905O394q117j1417O134M676o4
13833E717l048k963J621Q498L252l700M018K518j526n10J329N197P380J2268K063
13818D2114P02J5592K7871K6932K6098K2904Q98j3358k3877j5358O977K4269L2593
13805A74357M2164L8284J9594j6085m5512m6567l0366j2417j32Q303J8165J6665
$$ y = [6494, 1509, -1550, 2109, -2956, 503, -571, -3128, -4444, -5171, 7149, 11872, 3724, -2406, 2554, -2890, -5753, -1983, 273, 6206, 5125, 2207, 4792, 6630, 6978, 4861, 201, -1141, -3963, -5576, -3125, -571, -4903, -4194, -539, -5703, -6741, -3880, 1390, 7617, 5201, 3432, 6401, 6811, 3360, 4199, 3056, 581, -784, -2406, -1586, 1043, -1560, -5770, -1872, -2615, -7016, -6621, 3151, 5371, 1354, 6214, 5391, -5632, -4633, 3233, 341, 3033, 4206, 8111, 14505, 6388, -5029, 1105, 5781, 5717, 2669, -294, 1327, 9825, 13077, 9377, 13395, 15913, 14387, 13877, 15206, 20403, 27783, 40051, 42114, 42816, 58408, 86279, 113211, 139309, 162213, 163111, 149753, 125876, 110518, 117495, 141764, 174357, 216521, 254805, 274399, 258314, 212802, 166235, 135869, 123452, 123320, 131623, 149788, 166453]
13793A66453l725k9269l7101k5184n959k072n272l243O497O497J2950K0720L2752
13780A34044K6620N275j7272k3071j1740j27J1643K9662L9854M5926K6919n644
13768B62089l5901m7914m5770k1397l708L10J7602J4117Q705j5642l0267l5847
13756F6377k0555r181o091q105m311l258m486n869r04N643J0269L34L55n528m776
13741I914J480K896K392r3q501p138L327M687l454k808M793N648J886j762L9j030
13725A2276m050p059n175J214L725K140N881L263m057j179p96K818k973o046J664
13710A646n489N40J4552N607l029k273l957O162J546p747j973M007Q645k611o518
13695I108k589L951L60L947L989n904o922K741J769J878m15p282k620l70L90l250
$$ y = [166453, 162728, 133459, 96358, 71174, 65215, 63143, 57871, 54628, 61125, 67622, 80572, 101292, 134044, 160664, 165939, 148667, 125596, 113856, 113729, 125372, 155034, 194888, 240814, 267733, 262089, 226188, 178274, 132504, 111107, 107399, 107709, 125311, 139428, 148133, 132491, 102224, 66377, 45822, 36641, 30550, 22445, 18134, 14876, 10390, 4521, 3617, 9260, 19529, 19863, 20218, 14690, 9914, 11394, 14290, 16682, 16589, 8088, 950, 4277, 8964, 5510, 2702, 7495, 13143, 15029, 13267, 13306, 12276, 8226, 1167, -4008, -2794, 931, 3071, 8952, 12215, 8158, 6979, 6183, 9001, 6028, -18, 1646, -3843, -3303, 11249, 16856, 13827, 11554, 7597, 13759, 15305, 7558, 5585, 9592, 18237, 15626, 9108, 6519, 10470, 10830, 14777, 18766, 12862, 5940, 8681, 10450, 12328, 11913, 4631, 2011, 1641, 2031, -1219]
13679a219K890Q630L439J470N371L039k279k130K810j87k186q48M842J265m070
13664B0837l957m420k980L279O540M352Q21l684j227k098l921k799k505J672M510
13649A4420j910O03n303l449K386N955M097K396M111P202j979n373n642M218N323
13634B7055k122l964l473l885m01J960M580L476m558l548l663m163J963P344m568
13619A2033p625J057j555j48K03K46J021J144M909N320j1159j0214k247Q464M829
13604F278L057j93N25O656L082m952l343r712K470M005j881o31J433o0K879K329
13588A1942k149n770k727K668l277K89J874n160M187P584j416P90l168j102o51
13573C914P32K535J630p750o736k622K667J68l260M36N646J3302j273J5k123k427
$$ y = [-1219, 1671, 10301, 13740, 15210, 20581, 23620, 21341, 19211, 22021, 21834, 19648, 18800, 23642, 24907, 20837, 16880, 12460, 9480, 12759, 19299, 23651, 24472, 20788, 19561, 17463, 13542, 10743, 8238, 9910, 14420, 12510, 13113, 7810, 4361, 6747, 12702, 16799, 19195, 23306, 30508, 28529, 23156, 17514, 21732, 27055, 24933, 20969, 17496, 13611, 13210, 15170, 19750, 23226, 18668, 15120, 11457, 7294, 9257, 16601, 12033, 4408, 5465, 3910, 3762, 3965, 4211, 5232, 6376, 11285, 16605, 5446, -4768, -7015, 1449, 6278, 9335, 9142, 9667, 16323, 19405, 14453, 11110, 1398, 3868, 7873, 5992, 5361, 6794, 6734, 9613, 11942, 9793, 4023, 1296, 3964, 687, 976, 2850, -2310, 1877, 9461, 8045, 8835, 5667, 4565, 3914, 4646, 7181, 8811, 1061, -5675, -8297, -5630, -5462, -8722, -8286, -2640, 10662, 9389, 9404, 7281, 4854]
13557D854p16j933K807O079K576j547j0333p605N274p313o467J128O381J538K217
13542c060N266m616l531N214n228k453Q04O983J374n521j415L497K18K861j69
13527B24j37P365m7K911k691N593l586k372J80K397k490K217q960k813j095k021
13511e325N79J800J0681J059Q2k894L589M006m093n421J311L256k001M595j510
13496I714o089j376N534K453O708j013m590j849j856J037q5p58l45o34k441m63
13480C947l020M925m6k108J870N159R72l54Q835J533q624m549l173J063J011j862
13464E579J293N54J720n23K673m52L21K470L345L529j239PN315O306J0500M644
13448D6042J2944K0217J5589R649M011j2837j7105q778j1340q303r554O80r495
$$ y = [4854, 4138, 2205, 5012, 11091, 13667, 12120, 1787, -5818, -544, -7857, -14324, -13196, -6815, -5277, -3060, 2206, -2410, -5941, -727, -5955, -8408, -7604, -621, 753, -4768, -6183, -2686, -2468, 393, 224, 87, 7452, 7405, 10316, 7625, 13218, 9632, 7260, 7440, 9837, 7347, 9564, 604, -2209, -3304, -5325, -4746, -2946, 7735, 8794, 8876, 5982, 9571, 13577, 9484, 4063, 5374, 8630, 6629, 11224, 9714, 3625, 2249, 7783, 10236, 16944, 15931, 11341, 9492, 7636, 8673, 8588, 7830, 7485, 6851, 4410, 3947, 927, 5852, 5806, 3698, 5568, 10727, 11699, 11345, 20180, 21713, 13089, 8540, 5367, 6430, 7441, 5579, 6872, 7426, 9146, 8623, 11296, 10844, 11165, 13635, 16980, 20509, 19270, 19277, 24592, 30898, 41398, 46042, 58986, 79203, 94792, 104441, 108452, 95615, 78510, 69732, 58392, 50089, 40535, 41215, 31720]
13435C1720n297P513M76m127q329L303O0p07L556K228m335p371L257N469L271
13420C0687M841L877O98L189K250L891l037m972N983J6065J3643J5830K5163K7250
13406A45358K9774L6438J9882Q473j4381k9527l8419k8676k8873k1011j4337j5116
13394D9585k837k499j1079l614n842l008N829M0q232K128J3070l133k886Q82l900
13379B4504j831M038M310r07l101N451M646J983m08N64O113N81J6643J7885J5350
13364I5821J6642J3293k776k0666j6429j7871j5906j4341l651p14m055k993k926
13351B3428R71j75k006p450k009n024L341M159o9l28p37n308K301L962J425o352
13335A0129n183Q41J862M94K467k84L104n756q992j452R066O196L679K018n952
$$ y = [31720, 26423, 33936, 34412, 30285, 21956, 25259, 25319, 24612, 28168, 30396, 26061, 18690, 21947, 27416, 30687, 35528, 39405, 40103, 43292, 45542, 49433, 46396, 41424, 47407, 63472, 77115, 92945, 118108, 145358, 175132, 211570, 231452, 239925, 225544, 196017, 157598, 128922, 100049, 79038, 64701, 49585, 46748, 44249, 33170, 29556, 23714, 20706, 26535, 26575, 18343, 20471, 33541, 30408, 27522, 28404, 24504, 22673, 26711, 31021, 30114, 27013, 32464, 37110, 39093, 38685, 39249, 45362, 45943, 62586, 80471, 95821, 112463, 125756, 122980, 102314, 85885, 68014, 52108, 37767, 34116, 33402, 29347, 26354, 23428, 24399, 24224, 22218, 14768, 12759, 7735, 11076, 15235, 15166, 14838, 14101, 8793, 11094, 15056, 16481, 10129, 4946, 5787, 7649, 8143, 10610, 10326, 13430, 7674, -1318, -2770, 6296, 12492, 16171, 18189, 12237]
13320A2237l306K817j918J751L919L511L524J04J665M812o462m451j813r71j126
13305A4293J087L492p278j759j771L127n59L6J35J302p53m351J940L874N872l933
13289A4754k871l215M015L237L555O751j493n078j0918o036J819N763J805n124
13275F964J045R192J688k268j602k282M471j900r613l37O092k254l578n073J951
13260B496J058p97J243Q886K622O451K010k048M05L509o02J538Q234m73k655k179
13244B9698n707k389J397M808J250p00m54p5o426l31N333L347m618j883p310m143
13228A1797K864L415k95O862R027j1615q569k169Q36J580J238K032J1213j27j606
13213B6483J884L566L658P476O620O155L112K391o774n583r575p526M618L873
$$ y = [12237, 8931, 11748, 9830, 11581, 15500, 19011, 22535, 22639, 24304, 29116, 22654, 18203, 16390, 15419, 14293, 15380, 18872, 11594, 9835, 8064, 11191, 10632, 10668, 10803, 12105, 11352, 7001, 8941, 12815, 18687, 14754, 11883, 8668, 12683, 15920, 19475, 26226, 24733, 19655, 8737, 2701, 4520, 10283, 12088, 6964, 8009, 17201, 18889, 16621, 15019, 12737, 17208, 15308, 5695, 5358, 11450, 9196, 5618, 545, 2496, 3554, 2757, 4000, 12886, 15508, 21959, 23969, 21921, 22326, 25835, 25233, 26771, 35005, 34532, 31877, 29698, 23991, 21602, 22999, 27807, 29057, 28357, 27903, 27828, 21402, 21071, 26404, 29751, 25133, 23250, 15940, 11797, 14661, 18076, 17781, 24643, 33670, 22055, 13486, 11317, 12153, 13733, 14971, 17003, 28216, 28089, 26483, 28367, 31933, 35591, 43067, 49687, 55842, 58954, 61345, 54571, 48988, 39413, 31887, 36505, 40378]
13199D0378J908m236J379J711L240l106k511j884l827K774m523L042P526l721
13185C8150m160m85P84J548K039M652j903k556l373M64O444m766k08L018K020
13170D1668l798M498Q298J838N767L380P682k649J921m042o810K875J1765J3355
13156H5748J953O511J5059L2135L5327K9286K7336J7056m384l0749l4510k3812
13144A56956k4252k1814j1099n526N172n708k622P182O55o817p720J725j939l225
13130H0968l950p479m97L948N927K512Q832O845K964j90k8O486K304K751N342
13115A16735J5572J6565L1608M5118O0500O9213O0893L2828k205l5911o6863o8935
13103B75118n5144l0482j3868j5948j5016n359q21J177l396r352q14n761l189
$$ y = [40378, 42286, 38050, 39429, 41140, 44380, 41274, 38763, 36879, 33052, 35826, 31303, 34345, 41871, 38150, 33990, 33505, 34289, 35837, 37876, 42528, 40625, 38069, 34696, 35160, 41604, 36838, 36630, 39648, 41668, 37870, 42368, 50666, 52504, 58271, 61651, 69333, 66684, 68605, 64563, 57753, 60628, 72393, 85748, 87701, 94212, 109271, 141406, 176733, 206019, 233355, 250411, 246027, 215278, 180768, 156956, 132704, 110890, 99791, 94265, 99437, 93729, 91107, 98289, 98944, 92127, 84407, 86132, 84193, 80968, 77018, 69539, 69042, 72990, 78917, 81429, 90261, 97106, 100070, 99880, 99852, 106338, 108642, 111393, 116735, 132307, 148872, 180480, 225598, 286098, 355311, 416204, 449032, 446827, 410916, 344053, 275118, 219974, 189492, 175624, 159676, 144660, 139301, 138480, 139657, 136261, 126909, 126095, 120334, 117145]
13090A17145m958j837L84J465K503N682J0485P71P083M556j731p57l461o380m817
13075A26133K591J0505R684J0875J8281L1097L4877L4383J7516L743k1078l6598
13063B42009l4089k3211r843j156J33J246k78M85m741j6M545M364R941M011j966
13048A91434M397J1563J377J2998K4964J8769J7316K7941L6379K9640K0390O929
13036D04097P60m87m507K251N594O264j405R60N697J563j246J0783J0365J4914
13022D55603J7830L2346M2633L8978M1549N0433O0667O2334P9689R9535J21171
13011A102768J40360J59547J90942K31173K77072L49366M55612O07982Q19534
13002D334356J111491J537635K124790K854693L546291L804118L134384J394081
$$ y = [117145, 112187, 110350, 110734, 112199, 114702, 120384, 130869, 131640, 138723, 143279, 141548, 140791, 137330, 130950, 126133, 128724, 139229, 148913, 159788, 178069, 209166, 244043, 278426, 295942, 299685, 278607, 242009, 207920, 184709, 174866, 173710, 173843, 175089, 174811, 175296, 170555, 170539, 175084, 179448, 189389, 193400, 191434, 195831, 207394, 208771, 221769, 246733, 265502, 282818, 310759, 347138, 376778, 397168, 404097, 404857, 404370, 399863, 402114, 407708, 413972, 412567, 413527, 419224, 420787, 419541, 430324, 440689, 455603, 473433, 505779, 548412, 587390, 628939, 679372, 740039, 802373, 882062, 981597, 1102768, 1243128, 1402675, 1593617, 1824790, 2101862, 2451228, 2906840, 3514822, 4334356, 5445847, 6983482, 9108272, 11962965, 15509256, 19313374, 22447758, 23841839]
12994B3841839q82725k761855l624237l527891k916499k198490j599898j158510
12986E171734q25006o07620m52636l31977k56194j87944j44510j05215p2247l4245
12976B154140M778L2453P0875J05121J41400J90322K39733K91450L42958M08819
12966C982049N13031O70904Q88693J190856J631216K240959L126883M402144O051482
12957B4698217P661316Q316384O846512K848821k430341o667475q395639p867421
12949B5010374o249262m535754l178069k219857j586645j157079q59108o55145
12941D569455n13349m28812l53190k87867k48836j95569j38035q9703m9382j3970
12931B250742J6878M3975O9430J01465J41689J76999K37753L35196M51193O18437
$$ y = [23841839, 22959114, 20197259, 16573022, 13045131, 10128632, 7930142, 6330244, 5171734, 4346728, 3739108, 3286472, 2954495, 2698301, 2510357, 2365847, 2260632, 2188385, 2154140, 2158918, 2191371, 2262246, 2367367, 2508767, 2699089, 2938822, 3230272, 3573230, 3982049, 4495080, 5165984, 6054677, 7245533, 8876749, 11117708, 14244591, 18646735, 24698217, 32359533, 40675917, 47522429, 50371250, 47940909, 41273434, 32877795, 25010374, 18761112, 14225358, 11047289, 8827432, 7240787, 6083708, 5224600, 4569455, 4056106, 3627294, 3274104, 2986237, 2737401, 2541832, 2403797, 2314094, 2264712, 2250742, 2267620, 2311595, 2381025, 2482490, 2624179, 2801178, 3038931, 3374127, 3825320, 4443757]
12921D443757Q54191J182167J649322K293090L065316L723561L831681K924125
12913B3967210R29233j499980l341614m024898l713952k936362k142132j511796
12905E725709j055894p53239n56968m26235l31456k73039k43823k21439k06932
12896A656684j89449j71029j53357j24116j03775q3515o4615n7924n8310n2905
12886E97689m8401l5771k7944k6766l1891l0238k2948k9336k4930j3490j3627
12875B92347r073o040j4900j4068j2378j2350q516r090P52P37j1214r363O09l299
12861A84154l401p514l217n997l79r990r032o686k692m879K414K631l886n847
12847A25679l929J799K049k010j0844k715P837M58n467m969k838l214n938K119
$$ y = [4443757, 5297948, 6480115, 8129437, 10422527, 13487843, 17211404, 21043085, 23967210, 24896443, 23396463, 20054849, 16029951, 12315999, 9379637, 7237505, 5725709, 4669815, 3916576, 3359608, 2933373, 2601917, 2328878, 2085055, 1863616, 1656684, 1467235, 1296206, 1142849, 1018733, 914958, 831443, 766828, 708904, 650594, 597689, 549288, 513517, 485573, 458807, 426916, 396678, 373730, 344394, 319464, 305974, 292347, 283274, 277234, 262334, 248266, 235888, 223538, 215022, 205932, 206684, 207421, 196207, 186844, 187453, 184154, 180753, 173239, 170022, 164025, 163646, 153656, 144624, 137938, 135246, 130367, 132781, 135412, 131526, 125679, 121750, 123549, 125598, 123588, 112744, 110029, 117866, 118324, 112857, 107888, 105050, 101836, 95898, 98017]
12833I8017N59k246l825o290l241N226M24j930J454m843o119l635J467k6jm791
12817G0200N69N951K971n48R766J3705L089l230p602j1137j3784J360Q931J703
12803H1944R9l097p7m977q756J544P481m277r517j2186k365n41r52k397M338R488
12787E5752J709k219r28N303m203L915K903o060j345J076o050o184O427j340M54
12772D9210j994n127l339K351P808R311J693l508J334l416m643j687n164j503
12758D1326k399n148m245k99L970O721m640J644J194m331J505R38N573J0093L921
12743E5823O253k061N25L144Q313R542R976Q581Q894R77j732m878k856p306q367
12728H4828j3891p823n948j0779p718q661M089M190j664K032j182l959K403L215
$$ y = [98017, 98576, 96330, 92505, 86215, 82974, 88200, 88624, 86694, 88148, 83305, 77186, 73551, 75018, 74992, 74991, 70200, 70769, 76720, 79691, 79143, 88909, 102614, 105703, 102473, 94871, 83734, 69950, 71310, 80241, 81944, 82043, 78946, 78869, 73892, 65136, 66680, 74161, 69884, 60367, 48181, 45816, 45275, 44323, 41926, 46264, 55752, 57461, 55242, 54314, 59617, 55414, 59329, 62232, 56172, 54827, 55903, 49853, 43669, 50096, 48756, 49210, 47216, 42089, 38750, 41101, 48909, 58220, 59913, 56405, 57739, 54323, 49680, 47993, 42829, 41326, 38927, 33779, 29534, 29235, 33205, 39926, 35286, 36930, 38124, 33793, 35298, 36236, 41809, 51902, 55823, 62076, 60015, 60540, 63684, 71997, 81539, 91515, 100096, 108990, 109967, 108235, 103357, 100501, 93195, 84828, 70937, 63114, 57166, 46387, 38669, 30008, 34097, 38287, 36623, 38655, 37473, 33514, 35917, 39132]
12714C9132N488O339O046P222P847J956q057l555K9O540l928j1374J987k02m214
12699E1256m016m926J481k384j370L089J812M40K016Q85k202L236L370P879M815
12684F5381q696N190M855K032n803j634R011Q021J2128K0483L1426M0588K3130
12671B06112L308k5368l3932l2347k7375q741p421l061j928l180k965l041m001
12658E6060j0601q879p32p53j6k386K105N823R911P521M932J022P512Q865L984
12643H4368O133N889K294P358R832J7466K0539L4524L9299O2544J09792J73321
12631E73359K62232K64612Q9723j66559k90919k47988j53056q0713m7916l4427
12621A68348j8711r011j2437j3606o286J0609L540L68R461J0090J0462M330K479
$$ y = [39132, 44620, 50959, 57005, 64227, 72074, 74030, 65973, 62418, 62447, 68987, 65059, 53685, 55672, 55470, 51256, 47240, 42314, 43795, 41411, 40041, 43130, 44942, 45382, 47398, 48283, 46081, 49317, 52687, 60566, 65381, 56685, 61875, 66730, 68762, 62959, 61325, 70336, 78357, 90485, 110968, 142394, 182982, 206112, 209420, 184052, 150120, 117773, 90398, 81657, 74236, 71175, 69247, 66067, 63102, 60061, 56060, 45459, 36580, 35848, 35095, 35079, 32693, 34798, 40621, 50532, 58053, 62985, 64007, 71519, 80384, 84368, 90501, 96390, 98684, 106042, 115874, 133340, 153879, 188403, 227702, 290246, 400038, 573359, 835591, 1100203, 1189926, 1023367, 732448, 484460, 331404, 250691, 202775, 168348, 149637, 140626, 128189, 114583, 108297, 118906, 122446, 122814, 132275, 142365, 152827, 157157, 159636]
12608A59636P741k300q299j1830q844q700n206r085j2226k441k787p177J4J432
12594H9928M36K998L87n391n540l95O601K865K98N554K115K095K13l76J385j196
12578A01977k992J705Q276R227K230M00j249J3731R003m283L015j255p45R471
12564A48511M158Q12J799N070J6236L849J862L184J1691J2611O432O62Q511J9318
12550B44706J8359K5156L1103M0664M5727M7993N3160L7845L4048J9611M984p729
12538E95627j4146j9193k8537l2164l1162k0733j977N187O781J5464J6400J2826
12526E04373M497M051R533J7898Q666J5933K5356L3294K8886L0909M1748N0981
12514G76125N4833O5067P5933R8323J19414J35199J54569J69211J82405J91724
$$ y = [159636, 167377, 165077, 156778, 144948, 136104, 127404, 122198, 113113, 100887, 98446, 95659, 88482, 88496, 89928, 90364, 93362, 93749, 88358, 82818, 82423, 89024, 91889, 92187, 97741, 99856, 101951, 102164, 101788, 103173, 101977, 98985, 100690, 108966, 118193, 120423, 120823, 119574, 133305, 142308, 138025, 141040, 139785, 139040, 148511, 152669, 153481, 155280, 160350, 176586, 180435, 182297, 185481, 197172, 209783, 216215, 216877, 225388, 244706, 263065, 288221, 319324, 359988, 405715, 453708, 506868, 544713, 578761, 598372, 603356, 595627, 581481, 562288, 533751, 501587, 470425, 449692, 447715, 452902, 459683, 475147, 491547, 504373, 508870, 512921, 522454, 540352, 549018, 564951, 590307, 623601, 652487, 683396, 725144, 776125, 830958, 896025, 971958, 1070281, 1189695, 1324894, 1479463, 1648674, 1831079, 2022803]
12504B022803K07895K27434K69797L17549L85672M80707N60717O16093O53530
12495E742197P01227P83052R16279J130901J493692K081360K995343M313611N938803
12486B6096465P520863Q648726R140560Q875921P590269N190839K062741j263020
12478G3863364m439911p111354q806507r326393q936753p985156o556924m888476
12470A5811890l377656k271983j554424j124932q59061p09724o27752n79108n35550
12461D171700m95377m49901l92259l31669k76091k32796j94790j58714j44357
12452A495746j33960j16178r6684q3518p5241o6323n6444n8051m4041m0694m5268
12441F79344l7607l0738k9593k4274l0611k8369j8728j5226j1488j1097j2585
$$ y = [2022803, 2230698, 2458132, 2727929, 3045478, 3431150, 3911857, 4472574, 5088667, 5742197, 6443424, 7226476, 8142755, 9273656, 10767348, 12848708, 15844051, 20157662, 26096465, 33617328, 42266054, 51406614, 60282535, 67872804, 73063643, 75126384, 73863364, 69423453, 62312099, 53505592, 44179199, 35242446, 27257290, 20700366, 15811890, 12434234, 10162251, 8607827, 7482895, 6623834, 5914110, 5286358, 4707250, 4171700, 3676323, 3226422, 2834163, 2502494, 2226403, 1993607, 1798817, 1640103, 1495746, 1361786, 1245608, 1148924, 1065406, 990165, 923842, 867398, 809347, 765306, 724612, 679344, 641737, 610999, 581406, 557132, 526521, 498152, 479424, 464198, 452710, 441613, 429028]
12430D29028j3063j3146k1208j7426k0511j9703j316p256j4781n786M715k212
12418B97335M465J2975J7901J4021J5337J0654J33k769j5894j6941j3313j3661
12406C10243k7534j8781q580k800k870q409j2099q468P050R412J0864M798N801
12393B58627J2478Q644O79o089o378j0556k4958j9308j7636k0593r681n470o556
12380A53203j2924j1466Q1J451q18o246r598j1574l447Q240L348m80K56l381r596
12365I7049q404K074J1013M897l64n682n477k557N9j92J199m702N224L031l541
12350I3627n852p489O585O02r859r319J136N325J949j46n11o200K533j584o214
12335F4583q810n80O544j59r49k876M525M932M080o563j5276o354N333N497J621
$$ y = [429028, 415965, 402819, 381611, 364185, 343674, 323971, 322655, 315399, 300618, 294832, 299547, 297335, 301800, 314775, 332676, 346697, 362034, 372688, 372821, 370052, 354158, 337217, 323904, 310243, 282709, 263928, 255348, 252548, 249678, 241269, 229170, 220702, 227752, 237164, 248028, 252826, 258627, 271105, 279749, 280428, 274339, 267961, 257405, 232447, 213139, 195503, 174910, 165229, 159759, 153203, 140279, 128813, 128894, 130345, 129527, 123281, 113683, 102109, 98662, 106902, 110250, 109770, 110026, 106645, 97049, 88645, 90719, 101732, 106629, 106265, 100583, 95106, 92549, 92608, 92416, 93615, 88913, 94137, 97168, 93627, 87775, 80286, 86871, 87473, 77614, 68295, 69431, 74756, 76705, 76559, 76048, 69848, 72381, 70797, 64583, 55773, 55193, 61737, 61578, 60629, 57753, 62278, 67210, 71290, 64727, 49451, 43097, 48430, 53927, 55548]
12320E5548j815j978K577j021p725J25P29O543N021o391m553J973N995m779R3
12305E0342j527q093q519k496l409Q33J033j550K412K302O186O230o372j966M644
12290D0050j414l342k405l274l338k005q242J06J0608K806n240m786p109n555
12276F860m167K065Q971L152P578L202k526L274j068p329n297l882k99k327L72
12261H579N318N798q54j691n85O18K711o463j833o29l543n110N365L775M81q33
12245A1104j313J1171n17l82L286p06k353l432m602o26N85K597K396l091m186
12230I931m085M624N911N401o745k747l907j133O704K936m082L229J778l858P305
12215B1262m547j680Q859k52J991j40p100l023P146o18Q074R320n952j1953m115
$$ y = [55548, 53733, 51755, 54332, 53311, 45586, 45711, 46440, 52983, 58004, 51613, 47060, 49033, 55028, 50249, 50342, 48815, 40722, 32203, 29707, 26298, 27131, 28164, 26614, 29026, 31328, 37514, 43744, 37372, 35406, 40050, 38636, 35294, 32889, 29615, 26277, 24272, 16030, 16136, 26744, 29550, 24310, 19524, 12415, 6860, 2693, 4758, 13729, 16881, 24459, 27661, 25135, 28409, 27341, 20012, 14715, 10833, 10534, 8207, 8579, 13897, 19695, 18841, 17150, 16565, 17183, 19894, 13431, 11598, 10969, 7426, 2316, 7681, 11456, 11937, 11104, 9791, 20962, 20445, 20063, 23349, 22643, 20290, 16858, 12256, 11630, 12215, 14812, 17208, 14117, 9931, 5846, 10470, 16381, 21782, 15037, 12290, 8383, 7250, 13954, 16890, 12808, 16037, 17815, 13957, 21262, 16715, 15035, 23894, 23642, 25633, 25493, 18393, 15370, 22516, 21898, 29972, 39292, 33340, 21387, 17272]
12200A7272K304Q747k600k213M14p576m690m063r83k557k515P132K765j894r18
12185H625L330k482K032L424p6N93J87l0q37J354Q914L244K871J060M099j649
12169C4659n806l601k086r702P30L89L191N222M792n87o671o584m822r726j217
12154a819j384M233J1166j51j722L62K604l127j440M321R933k67j722k680o269
12139A2038j123L929l025J218n167L22K615K889J962J346N266l066m863l223n274
12124E844j0014n97J499M895l46k577m016N005O970N260j017L968P922K139p30
12109B4205l901l581J907J298M589N30j213o128m30l566o33K107m33M860M252
12094B3863P59m362k639M606Q872N542M66n163m859P214J080O841J364o294L237
$$ y = [17272, 19576, 28323, 25723, 23510, 23924, 16348, 11658, 7595, 6612, 4055, 1540, 8672, 11437, 9543, 8625, 11955, 9473, 11505, 14929, 14853, 15446, 15633, 15603, 14766, 16120, 25034, 28278, 31149, 32209, 36308, 34659, 28853, 25252, 23166, 13464, 14194, 14583, 17774, 22996, 27788, 27201, 20530, 13946, 9124, -602, -1819, -3203, 1030, 12196, 12045, 10323, 10685, 13289, 10162, 8722, 13043, 22976, 22709, 20987, 18307, 12038, 10915, 14844, 11819, 13037, 7870, 8192, 10807, 13696, 15658, 17004, 22270, 19204, 14341, 11118, 5844, -4170, -4767, -3268, 1627, 1281, -1296, -5312, -307, 6663, 11923, 10906, 14874, 22796, 24935, 24205, 20304, 16723, 18630, 19928, 24517, 25047, 23834, 17706, 17276, 13710, 13077, 15184, 14751, 19611, 23863, 24622, 20260, 17621, 22227, 31099, 36641, 37107, 31944, 27085, 34299, 35379, 42220, 43584, 37290, 40527]
12079D0527J411q151l235O741L237J651K735k267O091k816k002O214J0360j253
12065E9243J118J3968J4567J8195L2534L0442L9300M8696N5166M0626L2647J8980
12053D05482L278j2378k2046l2618m6227m8839m9156m0209l6371k9494k1120j3861
12041E6441r219n187o610m854k119M253m743j438K40m113K487r807n092N259O677
12026B2175n071J698k047o141m543R918N172K724N298k027o739R30q01k207n962
12011A2377J257J029P19J565N935P81n20J528k160n165n504j045K674J727n498
11996I700L113N005Q446L462J04o798m228J483P563R876L513j51l355o712K22
11981C1243J1875Q334J589n627L771O383o07M512M492J1400J4600J3475O860M790
$$ y = [40527, 41938, 33787, 30552, 37293, 40530, 42181, 44916, 42649, 48740, 45924, 43922, 50136, 60496, 59243, 60361, 74329, 88896, 107091, 139625, 170067, 209367, 258063, 313229, 353855, 386502, 405482, 408760, 396382, 374336, 341718, 295491, 246652, 197496, 157287, 120916, 91422, 70302, 56441, 47222, 42035, 35425, 30571, 28452, 32705, 27962, 26524, 26764, 22651, 25138, 15331, 10239, 15498, 22175, 17104, 18802, 16755, 10614, 6071, 15989, 21161, 23885, 29183, 27156, 20417, 21347, 20546, 18339, 12377, 13634, 14663, 15382, 16947, 22882, 23663, 23143, 24671, 22511, 17346, 11842, 10797, 13471, 15198, 9700, 12813, 17818, 26264, 29726, 29830, 23032, 18804, 20287, 27850, 37726, 41239, 41088, 37733, 31021, 31243, 43118, 51452, 53041, 47414, 51185, 57568, 56961, 61473, 65965, 77365, 91965, 105440, 112300, 117090]
11967A17090J3929K2351K2033K7367L4738K5704K5377M5426N2166O1800R0780
11956E38761J23400J65288K16956K57689K94789L15664K94711K39043J52420N4204
11946B652925o3919j67765k44170l00734l12899k97182k66310k12637j70017j31015
11936D86277q7586o2832m5650l4724k7308j8781j8670k2407j6493j9461j4252
11925A18113q732r234j5805j1657j2501k929l429l230r49j0295k743m358l302
11912B8949L88K273k721q42j306n96k294k835j152Q396K774k590r889q24K991
11897B0722L034k397M225P93L468K460o45j531k401k26q037j572J303J63k858
11882A6501M02M419k922n018m904K497O053K267k772k557k276R825j214q404o87
$$ y = [117090, 131019, 153370, 175403, 202770, 237508, 263212, 288589, 334015, 386181, 447981, 538761, 662161, 827449, 1044405, 1302094, 1596883, 1912547, 2207258, 2446301, 2598721, 2652925, 2589006, 2421241, 2177071, 1876337, 1563438, 1266256, 999946, 787309, 617292, 486277, 398691, 335859, 290209, 255485, 228177, 209396, 190726, 168319, 151826, 132365, 118113, 109381, 100147, 84342, 72685, 60184, 57255, 53826, 50596, 49647, 39352, 36609, 32251, 28949, 29337, 31610, 28889, 28047, 26741, 26145, 23851, 21016, 19864, 28260, 31034, 28444, 18555, 17731, 20722, 23756, 21359, 25584, 26377, 29845, 32305, 31660, 30129, 27728, 27502, 19465, 17893, 19196, 19359, 16501, 16903, 21322, 18400, 13382, 8478, 10975, 17028, 19295, 16523, 13966, 11690, 21515, 20301, 11897, 11210]
11867A1210P168j721k247K938K052L641P04J032m40N66l389N65q45N88m618n415
11851A1789k72k825m020o353J696o65k740M051K810J114j074M841N616k952r71
11836A0045J617o707j766O370j120M924p701n862j29O298J2053K193l227q652
11822H336p570L643n739p432K316J3447m192k771L12N107j084k72k831J0033M575
11807A5878J014m137l930M393j07k443n710l594o806K163k73P335J0348m004q713
11792A414l811J184N429P855R68p89L947n486m002J842K105N228J589n9o049l731
11776G634l561o134q74J159N63L386k378j263l779J458M864j677Q50K683L238
11761F169j915l479l778K70k218L176J71K152k757P978O453m301N769k448q60
$$ y = [11210, 18378, 16657, 14410, 17348, 19400, 23041, 23745, 24777, 24337, 24903, 21514, 22079, 21234, 21822, 17204, 11789, 11517, 8692, 4672, -1681, 15, -650, -3390, 661, 3471, 4585, 3511, 8352, 13968, 11016, 10045, 11662, 4955, 3189, 9559, 8439, 13363, 5662, -200, -329, 5969, 18022, 20215, 16988, 8336, 766, 4409, -1330, -8762, -6446, 7001, 2809, 38, 350, 5457, 4373, 4101, 1270, 11303, 15878, 16892, 12755, 8825, 13218, 13111, 10668, 4958, 1364, -5442, -3279, -3552, 3783, 14131, 10127, 1414, -2397, -1213, 4216, 12071, 13039, 12250, 16197, 10711, 6709, 8551, 10656, 15884, 17473, 17414, 11365, 7634, 4073, -2061, -2935, -1776, -1213, 2173, -205, -1468, -5247, -3789, 1075, -602, 248, 2931, 6169, 4254, 775, -3003, -2733, -4951, -1775, -1604, 548, -2209, 5769, 12222, 7921, 13690, 11242, 10382]
11746A0382m770o691l237M611Q252j251m53m906o554n832N455J3411P45L86K77
11731I825m714j4969j975O388K133l206N383p13j765L859Q39L388L561P14J026
11716I774J343j968n447j750LM815k698m545L166j941J732P828o80n884m79J258
11700D527j039O000K147N529L049q213n071N417J589J505J584l11j882n263n215
11685D353N196K336L229J426k342k903k61m894n896P42KJ427P012M912r415n946
11669a022Q093L080N89J42K88J0026M036j651n542k994j652k732j41j686n747
11654C087J240L165p732k522J1886n013j1621M762N019O445Q35o19N200M26K039
11639A6597N96L327l816k727J789m707j766M542M862j060J777M5p20q42k792Q302
$$ y = [10382, 5612, -1079, -4316, 295, 8547, 7296, 6843, 1937, -4617, -10449, -4994, 8417, 9162, 9548, 9825, 5111, -9858, -11833, -5445, -3312, -6518, -1135, -1848, -3613, 246, 1085, 4473, 8034, 8748, 9774, 11117, 9149, 3702, 1952, 1955, 6770, 4072, -473, 2693, 752, 2484, 10312, 9632, 3748, 3269, 4527, 3488, 9488, 11635, 17164, 20213, 12000, 6929, 12346, 13935, 15440, 17024, 16713, 14831, 9568, 4353, 9549, 11885, 15114, 16540, 14198, 11295, 11034, 6140, 244, 986, 988, 2415, 9427, 14339, 4924, -1022, 7071, 10151, 10740, 10882, 11170, 21196, 25232, 23581, 18039, 15045, 13393, 10661, 10520, 8834, 3087, 4327, 7492, -240, -2762, 9124, 4111, -7510, -2748, 2271, 8716, 9551, 8932, 14132, 14558, 16597, 17193, 20520, 16704, 13977, 15766, 11059, 9293, 13835, 18697, 17637, 19414, 19459, 18739, 17897, 15105, 23407]
11623B3407J288M912k071o65o249p173J38L175p644l191k02O506K227Kp937M484
11607A1007J384n526K981K089K39j195j718j808K649j06j056O676M450L91j15
11592B0342J728k705p772R55K95K719M144l640K555j658m443o062P42j028O354
11577A2526M859L387L398J166j310j477n859L61k832N436M662j639l441o367l760
11562I110l126l080k117J748K965R54N180k597J612J40o138J797o4l093n244K074
11546A21N622N983O993l904m871o745k091J294m569L31R412N43Ok371O794K85
11530A2833K351l690L066L914K135L41k074n788n669k976o535l216J0304N050
11516A0046M267k45p217R28R840L295p25k925k315n85L016l021n815Q92m04m433
$$ y = [23407, 24695, 29607, 27536, 26871, 20622, 13449, 13587, 16762, 9118, 5927, 5725, 12231, 14458, 14460, 6523, 11007, 12391, 6865, 9846, 11935, 12174, 10979, 9261, 7453, 10102, 9996, 8940, 15616, 20066, 20457, 20342, 22070, 19365, 11593, 12548, 12843, 15562, 19706, 16066, 18621, 16963, 12520, 6458, 7200, 6172, 12526, 17385, 20772, 24170, 25336, 24026, 22549, 16690, 17051, 14219, 19655, 24317, 22678, 19237, 12870, 9110, 5984, 2904, 787, 2535, 5500, 6454, 11634, 9037, 10649, 10789, 4651, 6448, 6384, 3291, -1953, 121, 5743, 11726, 18719, 14815, 9944, 3199, 1108, 2402, -2167, -1836, 7576, 8119, 8125, 5754, 12548, 12833, 15184, 11494, 14560, 18474, 20609, 20950, 18876, 13088, 7419, 4443, -2092, -5308, 4996, 10046, 14313, 14068, 6851, 7779, 17619, 20914, 20189, 17264, 14949, 14364, 17380, 14359, 8544, 9436, 9032, 4599]
11500D599K583M830L383J967j334L243J142o126k587k079J459K552l41j636n731
11485E924k073M53j852J35L982J2667l471j1761K713K918K751j36k101K395R164
11470B1708J792N668o996j3233K925L987K86J438m026J98K124j42L453k351k658
11455A4173N365n1j862K10j800K283N86R33m590K095J303L131l071l966Q66K054
11439A7659P10k140K680P395m58l277M581j2835o368o182j546P708J1717l479
11425A6165m713j982L225l672l762K670M396J540l501K095L526l811k400p70O87
11410I693l528l7J2014L429l121P33q817J165Q687n25j984j99J721N61j78L46
11394A9960L231K155L419m766q815M019L908O81k391M006Q086K321p349j248m401
$$ y = [4599, 7182, 12012, 15395, 17362, 16028, 19271, 20413, 14287, 11700, 9621, 11080, 13632, 13291, 11655, 5924, 3851, 4304, 2452, 2587, 6569, 19236, 15765, 4004, 6717, 9635, 12386, 12250, 10149, 12544, 21708, 23500, 29168, 22172, 8939, 11864, 15851, 16137, 17575, 13549, 13747, 15871, 15729, 19182, 16831, 14173, 19538, 19487, 17625, 17835, 16035, 18318, 18904, 19837, 15247, 17342, 18645, 21776, 18705, 14739, 15605, 17659, 18369, 16229, 18909, 26304, 25846, 22569, 27150, 14315, 7947, 1765, 219, 7927, 19644, 16165, 11452, 9470, 12695, 9023, 5261, 7931, 12327, 13867, 10366, 12461, 15987, 12176, 9776, 9006, 9693, 6165, 6128, 18142, 21571, 18450, 19183, 10366, 11531, 20218, 19693, 17709, 17510, 19231, 19792, 19614, 19960, 23191, 25346, 28765, 23999, 15184, 19203, 23111, 23792, 21401, 25407, 33493, 35814, 28465, 27217, 22816]
11379B2816k969l033m338K876M855J498J750o940l282j043Q19l33j167r82J395
11364A1922P514N941N565O601R322J321r427j3802J374O188J855R87l850q845
11350B2666q477K362J929j427k739M36P419M583J024L663L317l706K942j373J915
11335C4534l546p255L756K269L082R006M136l357j0038o590k046k304j209j464
11321A8974n004L502J755j19l528R29j889K561p268k775J571J878m380j945L311
11306G573j257L029M576L490O23N384j156j641K849j073j592q280L99j944J749
11291A2729L811o91O92j666p93P560Q861q761l142K715k639l606J196M054k617
11276A7703k49j032j633j134j500N611N269m936m573j199M37O612J0174k182L412
$$ y = [22816, 19847, 16814, 12476, 15352, 20207, 21705, 23455, 16515, 13233, 12190, 13009, 12676, 11509, 10527, 11922, 19436, 25377, 30942, 37543, 46865, 48186, 38759, 24957, 26331, 32519, 34374, 35361, 31511, 22666, 14189, 16551, 18480, 17053, 14314, 14750, 22169, 26752, 27776, 31439, 34756, 31050, 33992, 32619, 34534, 30988, 23733, 27489, 29758, 32840, 41846, 45982, 42625, 32587, 25997, 23951, 21647, 20438, 18974, 13970, 17472, 19227, 19108, 15580, 16509, 14620, 17181, 9913, 7138, 8709, 10587, 6207, 4262, 7573, 6316, 9345, 13921, 17411, 18034, 23418, 22262, 20621, 23470, 22397, 20805, 12525, 12924, 10980, 12729, 16540, 15849, 16541, 14875, 14082, 21642, 30503, 21742, 18600, 21315, 18676, 15070, 16266, 20320, 17703, 17454, 16422, 14789, 13655, 12155, 17766, 23035, 18099, 13526, 12327, 12764, 19376, 29550, 27368, 30780]
11261C0780O41m487m596M989l537k288M098K700n699m240L878j585q496K218J3029
11246B7405q47L49J0634N537l863r464o644N065O679L83k911K610J039J59L368
11231C9499O23l634P14P312M12J842Q49k803Q263J2180R672N507L433J2652O676
11216A03197N641L743R338J6642J6554J7782J2276L978J5919K4278K5158K9076
11204B83582L2530L6980M1320M5903O0408O8407P3759P6398P4097O7396O0532
11193I21312L5256J5567j5981l7278n7566o8593p2065p4702o9419o0156n8501
11182D57874n2589m5779m1246l6868l0050k2679j6446j3783j4589j7861j0915
11171A55069q565j7859n185l448l248j0921j2405l085m446n824O431K150j3069
$$ y = [30780, 31421, 26934, 22338, 27327, 23790, 21502, 25600, 28300, 22601, 18361, 22239, 20654, 12158, 14376, 27405, 26558, 26907, 37541, 43078, 39215, 29751, 23107, 28172, 34851, 35234, 32323, 34933, 35972, 36131, 39499, 40122, 36488, 37202, 44514, 44926, 46768, 47617, 44814, 53077, 65257, 74929, 80436, 83869, 96521, 103197, 108838, 112581, 121919, 138561, 155115, 172897, 185173, 189151, 205070, 229348, 254506, 283582, 316112, 353092, 394412, 440315, 500723, 569130, 642889, 719287, 793384, 860780, 921312, 956568, 972135, 956154, 918876, 861310, 792717, 720652, 645950, 576531, 516375, 457874, 405285, 359506, 318260, 281392, 251342, 228663, 212217, 198434, 183845, 165984, 155069, 146504, 128645, 123460, 120012, 116764, 105843, 93438, 90353, 85907, 80083, 86514, 88664, 75595]
11158G5595r517N917l57N09o98j767l478m900j896K921n533L383M986N478q77
11143F9766r285p183k30o064o141K860O336p159l97M828K197O745N26l077l37
11128E3385k2j133j352j2149o418K657o71O30N763P299o76j924m031p991k933
11113C0434j5N146K013M311Q186m18r35O648L117p657n285o687L09n78l072n4
11097C5463P241N880O78m929N321O834J415o318k74J758J902n930o388N709M709
11082E3071M814L706L450L981m251j3866p521L669J107J06n707o609L467R839
11068D9256O458j758k442j221O763j065k671j270J946r866N726K839O95M506K274
11053F0170N22m667p794k484j699q41m566j713M524l42N861J439k465j313K438
$$ y = [75595, 66078, 71995, 71638, 72147, 71449, 69682, 66204, 61304, 59408, 62329, 56796, 60179, 65165, 70643, 69766, 60481, 53298, 53068, 47004, 40863, 43723, 50059, 42900, 42503, 47331, 49528, 56273, 56799, 53722, 53385, 53363, 52230, 50878, 38729, 32311, 34968, 34297, 34927, 40690, 47989, 47313, 45389, 41358, 33367, 30434, 30419, 35565, 37578, 41889, 50075, 49657, 48722, 55370, 58487, 50830, 45545, 38858, 39167, 38589, 35517, 35463, 42704, 48584, 49262, 44333, 49654, 56488, 57903, 51585, 51311, 53069, 54971, 49041, 42653, 48362, 53071, 57885, 61591, 65041, 69022, 64771, 50905, 43384, 47053, 48160, 48266, 42559, 35950, 39417, 49256, 55714, 53956, 51514, 50293, 57056, 55991, 53320, 52050, 53996, 44130, 49856, 52695, 53390, 57896, 60170, 60692, 56025, 48231, 45747, 44048, 43207, 38641, 36928, 41452, 41110, 46971, 48410, 45945, 44632, 47070]
11038D7070K213K342m472m518M438O332J2412L746O493R335N861J0433K2056K1760
11024A45501K6548L5113L9671K3273R757k896k161j25M719m809j8348k2432k7277
11011B06534k9413k1322j5573j3157r460j2784r077j376l037n913j761o358K388
10998G9691k396J874N775P382M566Q713J0279J2674O740J8769K1132K7237M2575
10985B45011L5425K3062J4384J1310J9845K6509L3731L2134J421m1194o2472o4374
10973B74792o0452m3307k9657j8840q137j0307q869j5053j4741k268k358M95o8
10960F1230j09L780Q75o59r438p42j198l785j997j177N63m89J844P745O815N476
10944F8734N402M127J1418Q764M062J7605J6101K2720L4050L4437J8480L015k3904
$$ y = [47070, 49283, 51625, 47153, 42635, 47073, 53405, 65817, 69563, 76056, 85391, 91252, 101685, 123741, 145501, 172049, 207162, 246833, 270106, 279863, 276967, 274806, 274681, 279400, 274591, 256243, 233811, 206534, 177121, 155799, 140226, 127069, 117609, 104825, 95748, 94372, 91335, 85422, 83661, 77303, 79691, 77295, 79169, 84944, 92326, 96892, 105605, 115884, 128558, 135298, 154067, 175199, 202436, 245011, 280436, 303498, 317882, 329192, 349037, 375546, 409277, 441411, 442832, 401638, 339166, 274792, 214340, 171033, 141376, 122536, 114399, 104092, 95223, 80170, 65429, 63161, 60803, 61298, 61230, 61121, 64901, 65776, 65117, 55679, 54937, 53739, 49954, 47957, 46780, 47343, 46854, 48698, 56443, 63258, 68734, 74136, 78263, 89681, 98445, 102507, 120112, 136213, 158933, 192983, 227420, 245900, 248915, 225011]
10931B25011l6753k1599j2731j2627Q638P961P670M251m305m317j7183j7405p434
10918A19177r269j2854o717n152M479P919j751n808j385P840Q320J0837Q765N081
10904A29482J4946L9575L9390L5133O4767R6459J47528K00604K05120Q9404r3109
10893I69299k19280k03095j41885r0022o4443m0852k3105j4540k144N300J5333
10882A90566J6884J9845J4600M121p243o731j3583j9135j9998j1234o661r474
10870A51957j1376j7639j3103j2643m425p708p079N063M361K284j763j0506q699
10857F8724K10k0k562k766m706J542j980M227q10Q900O681j207q284j844L504
10842F9609L438P275J5455Q039M954J2965Q450M013J4972J7116J3070R861n687
$$ y = [225011, 188258, 166659, 153928, 141301, 149939, 157900, 165570, 169821, 165516, 161199, 144016, 126611, 119177, 109908, 97054, 90337, 85185, 89664, 97583, 95832, 90024, 88639, 96479, 104799, 115636, 124401, 129482, 144428, 184003, 223393, 258526, 323293, 419752, 567280, 767884, 973004, 1062408, 969299, 750019, 546924, 405039, 315017, 250574, 209722, 186617, 172077, 169933, 175233, 190566, 207450, 227295, 241895, 246016, 238773, 232042, 218459, 199324, 179326, 168092, 161431, 151957, 140581, 122942, 109839, 97196, 92771, 85063, 77984, 83047, 87408, 89692, 87929, 77423, 68724, 68934, 68914, 66352, 63586, 58880, 60422, 58442, 62669, 61859, 70759, 77440, 76233, 67949, 66105, 69609, 73047, 80322, 95777, 103816, 108770, 121735, 130185, 134198, 149170, 166286, 179356, 189217, 183530]
10829A83530j9356j6503j8747j2866j7257j8464o529n009q541k477l060p95L582
10816E7508P957J448n233k448j494n824j813j862l953Q819J801k598n024P076
10802E4360J0957k020p302p87N436K166P314K42j1410r407l976M221P820o622
10788E0992j1557o172n648Q464l41J781N725L934m1R898J2525M668k278J888l901
10773F9937q877k096Q325M449K21O6L973m20P32J133P03j283P342j551l486J120
10757H0288K104n220J977K046q00p450l02N198Q139J481L50j475m55m574pr39
10741H0361L529N174R032L824J893P965O928K626O561K1208M0370M5227Q387k9813
10727B13272m1321l1798k2883p618k488m75N259K861r3p721m580m819p198m46
$$ y = [183530, 164174, 147671, 128924, 116058, 98801, 80337, 73808, 68799, 60258, 57781, 54721, 53926, 57508, 65465, 66913, 61680, 59232, 57738, 51914, 50101, 48239, 44286, 53105, 54906, 52308, 47284, 54360, 65317, 63297, 55995, 55208, 60644, 62810, 70124, 70366, 58956, 49549, 45573, 49794, 57614, 50992, 39435, 33263, 27615, 36079, 35738, 37519, 43244, 47178, 47137, 57035, 69560, 74228, 71950, 73838, 69937, 61060, 58964, 67289, 71738, 71959, 72025, 75998, 75578, 76310, 77443, 78146, 76863, 84205, 82654, 79168, 80288, 82392, 77172, 79149, 81195, 80395, 72945, 72643, 77841, 85980, 87461, 87811, 86336, 85881, 81307, 81300, 80361, 83890, 89064, 98096, 101920, 103813, 111778, 118706, 121332, 127893, 149101, 189471, 234698, 243085, 213272, 171951, 140153, 117270, 109652, 107164, 106689, 111948, 114809, 114716, 106995, 102415, 97596, 90398, 89952]
10713H9952L975J735L903Q133L468j493R968N174m406j6232m454m817J614N63
10699I7083l251n58N168M499l040k060k176j1457j674N427n573j404M750N179
10685I0913J0488J2700p521l599K945L770P928R245J0280O968q265J608J930J384
10671A40774p75o593k785K33J510q70K527M345N571K462l919m366j552n046k933
10656A28583k564L07m524k681l577n803q473L523M898j672L118Q707P435K670
10642A29947L829L293M954J0893J2282m652q76j357m999j5134j1156P0J0154J3365
10628A50613J2766k953K197j486O018l94K720L730q093K116P245Q675L759M90
10614A87403m777R85O383J357M917J5764J5076J0496J6113L8006M1467L4522m723
$$ y = [89952, 93927, 95662, 99565, 107698, 111166, 109673, 119641, 124815, 120409, 104177, 99723, 94906, 96520, 97083, 93832, 93274, 98442, 102941, 99901, 97841, 95665, 84208, 82534, 87961, 82388, 80984, 85734, 90913, 101401, 114101, 106580, 102981, 105926, 109696, 117624, 126869, 137149, 144117, 135852, 137460, 139390, 140774, 139999, 133406, 130621, 130854, 132364, 131494, 134021, 138366, 143937, 146399, 142480, 138114, 136562, 131516, 128583, 126019, 126326, 121802, 119121, 115544, 109741, 101268, 104791, 109689, 108017, 111135, 119842, 127277, 129947, 133776, 137069, 142023, 152916, 165198, 160546, 159670, 158313, 153314, 138180, 127024, 127094, 137248, 150613, 163379, 160426, 162623, 161137, 167155, 166761, 169481, 173211, 165118, 167234, 174479, 183154, 186913, 187403, 182626, 183611, 189994, 191351, 196268, 212032, 227108, 237604, 253717, 291723, 333190, 367712, 362989]
10601C62989k7211l4915j6660J474R052J55M502J1304J1271J4055P160Q989J7652
10588C69817J4622J3754K0764K2686L9716N7398P2517J02767J30636J65932J97219
10577A207828K04640J74371R9672K642r1937j62213j91366j89327j66862j32484
10567G54964q7710o5874l8357l1939j2125q226j686M88M462M480P839J731O661
10554E34708J1748J9745K5937K5102K4477J7931J9860J9071J2358K0251K9151
10543G60339K6951J9509J4896J3663R190J5440K6303K6108L1614M8745O1727O4460
10531A118945P8825R0569R7926J16106J35981J72447K02354K21149K47597K98274
10521B780173L71509M71761O09753Q10120J114047J548539K081172K583783K850643
$$ y = [362989, 335778, 300863, 284203, 285677, 294729, 294884, 299386, 310690, 321961, 336016, 343176, 352165, 369817, 384439, 398193, 418957, 441643, 481359, 538757, 611274, 714041, 844677, 1010609, 1207828, 1412468, 1586839, 1686511, 1689153, 1597216, 1435003, 1243637, 1054310, 887448, 754964, 667254, 601380, 563023, 531084, 518959, 510733, 509047, 509535, 513997, 518477, 526316, 528047, 534708, 546456, 566201, 592138, 617240, 641717, 659648, 679508, 698579, 710937, 731188, 760339, 787290, 806799, 821695, 835358, 844548, 859988, 886291, 912399, 944013, 992758, 1054485, 1118945, 1197770, 1288339, 1386265, 1502371, 1638352, 1810799, 2013153, 2234302, 2481899, 2780173, 3151682, 3623443, 4233196, 5043316, 6157363, 7705902, 9787074, 12370857, 15221500]
10512A5221500K687408J961348P96087n13203j659259k399387k632501k409591
10504A1052402j926200j388234r20133n48686k73500o5657J00088K42728L95111
10495F667919N09933N31786M97015N58054P97673J098803J287456J485364J977042
10486A5411045K830085L905578N194745P196562J0668277J6251440K4522550L5159344
10478A21139626M2632342L2110631k298428l6006353m4570454l3672665k0226474
10471E9108225j0863876n004306j428596M00362O97273k19188j765386l240986
10463C7683522m064500m009474l211687k165251j423125j327214j715014k166165
10455A7601092k366042k243158j886747j412870r14771m79999k13146j40667k86239
$$ y = [15221500, 17908908, 19870256, 20666343, 20153140, 18493881, 16094494, 13461993, 11052402, 9126202, 7737968, 6817835, 6269149, 5995649, 5929992, 6030080, 6272808, 6667919, 7177852, 7709638, 8206653, 8764707, 9562380, 10661183, 11948639, 13434003, 15411045, 18241130, 22146708, 27341453, 34538015, 45206292, 61457732, 85980282, 121139626, 163771968, 195882599, 193584171, 157577818, 113007364, 79334699, 59108225, 48244349, 43240043, 41811447, 42211809, 42909082, 42689894, 40924508, 37683522, 33619022, 29609548, 26397861, 24232610, 22809485, 21482271, 19767257, 17601092, 15235050, 12991892, 11105145, 9692275, 8777504, 8297505, 8084359, 7943692, 7657453]
10446G657453n48037p60799q24029p48908n95584m37089l10995k08784j24486
10437C098742o9866j8718L8974Q4738J35705J86285K39117K85536L29306L97118
10427D706937N41588P86070J150693J650589K287236L000973L570571L660923
10419B1355580K965201J515233l16874k051085l253381l715444l496678k889024
10411A0113528k196982j599257j182182q83004o45698m71243l69623k97079k52900
10402B215560k30096k06393j88715j76469j48686j23822j02581q0045o1578m9037
10392H48138m4514l3821l0747k5281k0372j9405l5861l7273k9710k2855j7790
10381E30509p249j5649l902Q20j68q503j3617k1811j1891o680j5272j1669L50
$$ y = [7657453, 7109416, 6348617, 5524588, 4775680, 4180096, 3743007, 3432012, 3223228, 3098742, 3028876, 3010158, 3049132, 3133870, 3269575, 3455860, 3694977, 3980513, 4309819, 4706937, 5248525, 6034595, 7185288, 8835877, 11123113, 14124086, 17694657, 21355580, 24320781, 25836014, 25519140, 23468055, 20214674, 16499230, 13002552, 10113528, 7916546, 6317289, 5135107, 4252103, 3606405, 3135162, 2765539, 2468460, 2215560, 1985464, 1779071, 1590356, 1413887, 1265201, 1141379, 1038798, 958753, 897175, 848138, 803624, 769803, 739056, 713775, 693403, 673998, 638137, 600864, 571154, 548299, 530509, 523260, 507611, 503709, 504529, 504361, 495858, 482241, 460430, 448539, 441859, 426587, 414918, 415268]
10368D15268J3420Q173L88K261Q198R269J4625K0912J7408L128r006k2335k3420
10355D58289k9902k0917j3259k1630k6318j804J1463j5989j9296l141j6Q546R518
10342C35544n631q396n96p412p432q273k780n046o224j0802m212N348R840P932
10328B91860R288l266K898O414J5766J7356J2985J7350P366K515O841J6747N971
10315D10091K288j0496k0490j5335l032k969o397n260K093J742J2383K0394J8290
10302D03302P130j713r996j0721k0350j6031p699p228m012Q872J8201J5328J9098
10289C94181K6185K7254L2409M4172N1411K4291k0177n5019o6183n1431k9997
10278C77096j6038j1049q053k193N443J8711J0910J1665Q797J1871K0313K6423
$$ y = [415268, 428688, 436861, 437249, 439510, 447708, 456977, 471602, 492514, 509922, 513050, 504044, 481709, 458289, 428387, 407470, 394211, 372581, 346263, 344459, 355922, 339933, 320637, 317496, 317480, 326026, 335544, 329913, 321517, 320921, 313509, 306077, 297804, 295024, 289978, 283754, 272952, 268740, 274088, 283928, 291860, 301148, 297882, 300780, 307194, 322960, 340316, 353301, 370651, 378017, 380532, 387373, 404120, 410091, 412379, 401883, 381393, 366058, 363026, 360057, 353660, 348400, 350493, 352235, 364618, 385012, 403302, 410432, 408719, 398723, 388002, 367652, 351621, 343922, 336694, 332682, 341554, 359755, 375083, 394181, 420366, 447620, 480029, 524201, 575612, 599903, 579726, 524707, 458524, 407093, 377096, 361058, 350009, 341956, 339763, 345206, 363917, 374827, 386492, 395289, 407160, 427473, 453896]
10266D53896K6951K2938J954n820j8611k6435k8828k7942j2848j1227k267Q411
10254C80172N594J4439J1397N857R523q95O131J8909K1575J2925R042O662R203
10241E10534P239J0134J3705O588M650J1508J2929J7159K5606J4122J5578J4438
10229F64190Q152P909J5885J8905J7186K6749L0621K1048J2840J4300P475j34
10217H45126P69J6165K6180K9952L5017K7593K4637K0802K9026L1351L8829M8000
10205A173447O2103P1431P7382P8909Q9474Q7837P0598O8113R2034R9903J02960
10194B074191J10169J15196J22249J43146J69052J90140J98292K14989K49472
10185C586896L04902L83892M43591N25886O23317P39303Q76867J029941J231346
$$ y = [453896, 480847, 503785, 505739, 499919, 481308, 454873, 426045, 398103, 385255, 374028, 371761, 380172, 385766, 400205, 411602, 417459, 426982, 426087, 432218, 451127, 472702, 485627, 494669, 501331, 510534, 517773, 527907, 541612, 548200, 552850, 564358, 577287, 594446, 620052, 634174, 649752, 664190, 672342, 680251, 696136, 715041, 732227, 758976, 789597, 810645, 823485, 837785, 845260, 845126, 845895, 862060, 888240, 918192, 953209, 980802, 1005439, 1026241, 1055267, 1086618, 1125447, 1173447, 1235550, 1306981, 1384363, 1463272, 1552746, 1640583, 1711181, 1779294, 1871328, 1971231, 2074191, 2184360, 2299556, 2421805, 2564951, 2734003, 2924143, 3122435, 3337424, 3586896, 3891798, 4275690, 4719281, 5245167, 5868484, 6607787, 7484654, 8514595, 9745941]
10176I745941J433927J592771J653329J577072J482942J534146J847953K524472
10168B3392553L620242N151579P252193J0262932J4800834K1773240L2398098
10161A18651671M7658779O5176940P2652437M9892702m286271n7145896p6956910
10154B15643452o5691355m5197435k9009116j8798219j2574003q696503o204512
10147B9472309m526715l313789k378986j631930j051010o61901n14503m98693
10139A4894782l52840N5767O58115J227968J371535O14852r23954k280645k627738
10130A2637842k097595j295393o77238m80800p02818r76656r91133p91705n66565
10121D057939m02915k82711j97096j45571j06958o6089l5635j6540l8810j05397
$$ y = [9745941, 11179868, 12772639, 14425968, 16003040, 17485982, 19020128, 20868081, 23392553, 27012795, 32164374, 39416567, 49679499, 64480333, 86253573, 118651671, 166310450, 231487390, 304139827, 354032529, 349746258, 292600362, 215643452, 149952097, 104754662, 75745546, 56947327, 44373324, 35676821, 29472309, 24945594, 21631805, 19252819, 17620889, 16569879, 15907978, 15393475, 14894782, 14541942, 14597709, 15255824, 16483792, 17855327, 18470179, 17546225, 15265580, 12637842, 10540247, 9244854, 8567616, 8086816, 7383998, 6407342, 5416209, 4624504, 4057939, 3655024, 3372313, 3175217, 3029646, 2922688, 2856599, 2820964, 2804424, 2765614, 2660217]
10111B660217j74654k06312k06615j71557j45890j39232j21296j02520q0614n6485
10101A255042m1626m2004m9630n2349n1209n1844l9944l1715j5272o689k764p710
10089H62286j1079j3149l1658l7891l3468k9304j3580j0944q783p434j0577j8572
10077F35847k0326j3866j7693j8442j8841j8113j8686j9927j4150k720L667N250
10065D82000j16m039R245J0819J7043K2419L2527N0217O9180R4658J31995J80435
10053A096383K04271J32484n0607j89337k05305j64532j14093p7946n4936m1688
10043E34694l5956l2090j2482k540K351K490Q518J2812J2582J4148o157j2430
10031D85940J0399j367l0359m5193m1655l0133k3237j8822j1074j0479j5176q691
$$ y = [2660217, 2485563, 2279251, 2072636, 1901079, 1755189, 1615957, 1494661, 1392141, 1311527, 1255042, 1213416, 1171412, 1121782, 1069433, 1018224, 966380, 926436, 894721, 879449, 872760, 869996, 862286, 851207, 838058, 806400, 768509, 735041, 705737, 692157, 681213, 672430, 664996, 654419, 635847, 615521, 601655, 583962, 565520, 546679, 528566, 509880, 489953, 475803, 473083, 476750, 482000, 481884, 477845, 487090, 497909, 514952, 537371, 569898, 620115, 689295, 783953, 915948, 1096383, 1300654, 1433138, 1382531, 1193194, 987889, 823357, 709264, 631318, 576382, 534694, 498738, 466648, 454166, 451626, 453977, 456467, 464985, 477797, 490379, 504527, 498370, 485940, 496339, 494972, 464613, 419420, 377765, 347632, 324395, 305573, 294499, 284020, 268844, 260153]
10019B60153M072O854J130j3582j7496m171O346K379J054J4257O996N252J0429
10006B83673J7125K1021K2331J4776m898m482j306o48n97n475j6878j5386k2067
9993B87189k3979j4179r171l256o504j0445r173m756m109r634p579n533j1738
9980A67133j5022q460j2740j4040r101K693j464l311M90n60J0279R148P991L5
9966A33071j0087j2367j1866j1702j717m28j1061j1607m819N43J2280J4697J0552
9953I5489R62o663o436o75J959O083Q679J3001L015k045n234p182j522p974r69
9938I0488k818p295k080K278Q923k351k499o678l522m238l316L168J531N840M497
9923H1928l283M902J4404J2382j769j567k64r649m830Q78o456l857P519M897K51
$$ y = [260153, 264225, 271079, 272209, 258627, 241131, 236960, 243306, 245685, 246739, 260996, 267992, 273244, 283673, 300798, 321819, 344150, 358926, 354028, 349546, 348240, 347592, 346995, 341520, 324642, 309256, 287189, 263210, 249031, 239860, 236604, 230100, 219655, 210482, 205726, 201617, 191983, 184404, 178871, 167133, 152111, 143651, 130911, 116871, 107770, 110463, 108999, 105688, 106178, 105618, 115897, 125045, 133036, 133071, 122984, 110617, 98751, 87049, 85332, 84904, 73843, 62236, 57417, 57960, 70240, 84937, 95489, 96451, 89788, 83352, 82677, 84636, 90719, 99398, 112399, 115414, 113369, 108135, 100953, 99431, 91457, 90488, 87670, 80375, 78295, 80573, 89496, 87145, 84646, 77968, 74446, 70208, 66892, 70060, 71591, 77431, 81928, 78645, 83547, 97951, 110333, 108564, 106997, 106733, 97084, 92254, 93132, 86676, 82819, 90338, 95235, 95486]
9908I5486k66K442j043p0O087J000q88j501q680j0510p132K275L288l415k43N472
9892H2302M346K539M243O308N040L92J900M305M694n736n533o076p495k387r61
9877H7881K643k593j0721j251Q602M266n224n518l161j46l39P427J834m973k348
9862G6379N088o566L333M591k932m30J3289K0980K3370J2667N459j226J590l520
9848A52072K385L760p609o358j2110j3615K446J0262J7635J1077j221k0132l5952
9835A02640k6090j411J1468K27l328K486L624K021R819J1219O549K174m256m150
9821A12992l117K584m85N603P072R887K655Q373M299L161Q128M97k661J0207M895
9806A74090j362N992J0991L462j219m902Q89J1334J1863L437Q638J6167K4735
$$ y = [95486, 95220, 97662, 96619, 96549, 102636, 103636, 102748, 101247, 92567, 82057, 74925, 77200, 80488, 77073, 76830, 82302, 86648, 89187, 93430, 99738, 104778, 105170, 107070, 111375, 116069, 110333, 104800, 98724, 91229, 88842, 87881, 90524, 87931, 77210, 75959, 84561, 88827, 83603, 78085, 74924, 74778, 74439, 81866, 83700, 78727, 76379, 81467, 74901, 78234, 82825, 79893, 79463, 92752, 113732, 137102, 149769, 155228, 154002, 155592, 152072, 154457, 158217, 150608, 144250, 132140, 118525, 120971, 131233, 148868, 159945, 158724, 138592, 102640, 76550, 75139, 86607, 86834, 83506, 85992, 89616, 91637, 101456, 112675, 119224, 121398, 117142, 112992, 109875, 112459, 111974, 117577, 124649, 134536, 137191, 145564, 149863, 153024, 161152, 161649, 158988, 169195, 174090, 172728, 178720, 189711, 193173, 191954, 187052, 187941, 199275, 211138, 214575, 223213, 239380, 264115]
9793B64115J9724J6295L306J8210J9124K0200K3603L3709L6815M6034M8055N8391
9781F07581O6316P8300R9064J26644J67606K12374K90982M08314N55995P28643
9771C341819Q87099R22895P65259M50142P3048l36828p20958r13643q80282p09819
9761B878732n28053l80812k68652j83310j16890p5573m3862j7073k536l379P177
9750A265769R280J1428J9446L9190O7659J08329J57376K14441K75377L58270M45232
9739B971797M92993M90768M57558M49928N13436O41095Q56780J196635J672820
9730I743810K233902K558704K211904J139112j71174j203393j613162j362350
9722A3537353p89157l49950l16999o38887j090692j424134j466895j257864r37714
$$ y = [264115, 283839, 300134, 303440, 321650, 340774, 360974, 384577, 418286, 455101, 501135, 549190, 607581, 673897, 752197, 851261, 977905, 1145511, 1357885, 1648867, 2057181, 2613176, 3341819, 4228918, 5151813, 5917072, 6367214, 6440262, 6103434, 5382476, 4468833, 3588551, 2878732, 2350679, 1969867, 1701215, 1517905, 1401015, 1325442, 1281580, 1264507, 1261971, 1258592, 1265769, 1275049, 1286477, 1305923, 1345113, 1412772, 1521101, 1678477, 1892918, 2168295, 2526565, 2971797, 3464790, 3955558, 4413116, 4863044, 5376480, 6017575, 6874355, 8070990, 9743810, 11977712, 14536416, 16748320, 17887432, 17716258, 16512865, 14899703, 13537353, 12748196, 12398246, 12081247, 11442360, 10351668, 8927534, 7460639, 6202775, 5265061]
9713E265061o58435m38875k69740j60178r0382q0971j33491j91039j88028j22246
9703B931676k9195P9154J96246L25189M24154M18147K65872N6703J4010J52322
9693D834278M06631P31239J106294J574090K077671K334465J928218Q80318q2071
9684A5791133l41728R5437Q81847J585678J792654J335376L94706q20838j980637
9675A8733628k610929k637593k341459j940831j495947j055591o69775l83980
9667E597523k86068l88794n28845n41777m41229l15702j99491j03559j2769N6465
9657B835754O5099O390o2744o5508l216R8283K02937L19477M54198O01048O50051
9646E101769N42290L40707K69792M54762Q04552J207092J545559J745824J777340
$$ y = [5265061, 4606626, 4167751, 3898011, 3737833, 3647451, 3566480, 3432989, 3241950, 3053922, 2931676, 2902481, 2981635, 3177881, 3503070, 3927224, 4345371, 4611243, 4667946, 4681956, 4834278, 5240909, 5972148, 7078442, 8652532, 10730203, 13064668, 14992886, 15873204, 15791133, 15449405, 15544842, 16426689, 18012367, 19805021, 21140397, 21535103, 20714265, 18733628, 16122699, 13485106, 11143647, 9202816, 7706869, 6651278, 5981503, 5597523, 5311455, 4922661, 4393816, 3852039, 3410810, 3095108, 2895617, 2792058, 2779289, 2835754, 2900853, 2907243, 2844499, 2778991, 2775775, 2874058, 3076995, 3396472, 3850670, 4451718, 5101769, 5644059, 5984766, 6254558, 6709320, 7513872, 8720964, 10266523, 12012347, 13789687]
9637A3789687J529026Q58491j35384j051461j689331k096596k156764j873712
9629G173956j426691r99707o87352m94707m19377m13369l74379l16800k47898
9620A793676j86723j58230j37955j15846j01747p7856o5154n6458k9122j0300
9610H54285K033N74Q397K2059L3429M9559O8952J01190J47445J95572K76187L82481
9598B142163M97806O01740O38841N29172K97046L7139k41613n20584p06972p09298
9588B565440n77425m34265l20210k25739j62835j20473r2838p4662n7602l7818
9578D61573l6677l8725k5098k4512k5656k7246k4374j0877j7637j1276l609q719
9566B07167j5035m575j0691q917n651o096m284l977l323J605N75l339o235l212
$$ y = [13789687, 15318713, 16177204, 16041820, 14990359, 13301028, 11204432, 9047668, 7173956, 5747265, 4747558, 4060206, 3565499, 3146122, 2732753, 2358374, 2041574, 1793676, 1606953, 1448723, 1310768, 1194922, 1093175, 1015319, 950165, 893707, 864585, 854285, 856318, 856892, 865289, 887348, 920777, 970336, 1039288, 1140478, 1287923, 1483495, 1759682, 2142163, 2639969, 3241709, 3880550, 4409722, 4706768, 4743907, 4502294, 3981710, 3274738, 2565440, 1988015, 1553750, 1233540, 1007801, 844966, 724493, 631655, 556993, 499391, 461573, 424896, 386171, 361073, 336561, 310905, 283659, 259285, 248408, 230771, 219495, 215886, 207167, 192132, 187557, 176866, 167949, 162298, 156202, 151918, 147941, 144618, 146223, 146798, 143459, 137224, 134012]
9552A34012p304r112n256p625k673P197N743M690J0760O059K690m287l539o379
9538A24976r396o124m079j965j16p666n159j554m582j0540k174k244M409N022
9524G8808k380l624q744q215n6j031M424J9294K1726J3190j214j2021j628J0270
9510A08799k507m217k008k710J4306J5342J1984J4659J7530J3451L566j2686j9182
9497A56327k2647j1142k158k57N285K699L683n980j1339p737j571l921l953o247
9483I1042o927o141L820M876M614P576m321l498j868L807J307K994l222q715L154
9468H8498R212M088L197l376R95J9491K1853J2513R662K269r997p441J990j521
9454A51433Q183J6549O828j721K826K716P23l725n261j0553k1085j8296m824m923
$$ y = [134012, 126708, 117596, 112340, 104715, 102042, 109239, 114982, 119672, 130432, 136491, 139181, 134894, 131355, 124976, 115580, 109456, 105377, 103412, 103296, 95630, 90471, 88917, 84335, 73795, 71621, 69377, 73786, 78808, 76428, 72804, 64060, 55845, 55789, 54758, 59182, 78476, 100202, 113392, 112178, 100157, 98529, 108799, 106292, 102075, 100067, 97357, 111663, 127005, 138989, 153648, 171178, 184629, 188195, 175509, 156327, 133680, 122538, 120380, 120123, 125408, 128107, 131790, 125810, 114471, 106734, 105163, 101242, 97289, 91042, 84115, 77974, 81794, 86670, 91284, 98860, 94539, 91041, 89173, 92980, 94287, 97281, 94059, 85344, 88498, 97710, 101798, 104995, 101619, 102614, 122105, 143958, 156471, 166133, 168402, 158405, 150964, 152954, 151433, 159616, 176165, 182993, 181272, 184098, 186814, 187537, 183812, 178551, 167998, 146913, 128617, 123793, 118870]
9440A18870n795p402j0121p437J48Q484L668K709o196j3630j279J360k186o718
9426G4475o290J043R395R062N187R125J178j956J851L643R6J529M066J5307J4144
9411A41855Q919j934O751J5028J2194P479o66q846j8794j7377j3188j5012j9008
9398I7401j1600j301l768l158r023o396j582M029K972K208K328j0292n770k191
9384E3857K51K542J0064l48m402j994L96N209J537R87L58M199j859o38R891P566
9368H7616J5556Q688M055J0697J2845L990j844j2928j6927j6892j2436q501k718
9355G1201R31q655m699L382J543q76p99j1000K115N198l158N515j0074n491l768
9340D1365j361n7M187J6489N970J253L94N795O16l836l890M107Q402J1885J7112
$$ y = [118870, 113075, 105673, 95552, 88115, 88263, 96747, 100415, 103124, 96928, 83298, 82019, 83379, 81193, 74475, 68185, 69228, 78623, 87685, 92872, 101997, 103175, 101219, 103070, 106713, 106809, 108338, 112404, 127711, 141855, 150774, 148840, 155591, 170619, 182813, 190292, 189626, 180780, 161986, 144609, 131421, 116409, 97401, 85801, 84500, 80732, 77574, 68551, 62155, 60573, 64602, 67574, 69782, 72110, 61818, 56048, 53857, 54108, 56650, 66714, 66366, 61964, 59970, 60366, 65575, 67112, 68099, 68457, 72656, 70797, 70159, 80050, 87616, 103172, 111860, 115915, 126612, 139457, 143447, 141603, 128675, 111748, 94856, 82420, 73919, 71201, 72132, 63477, 58778, 62160, 63703, 62827, 62028, 51028, 53143, 58341, 55183, 60698, 50624, 45133, 41365, 40004, 39947, 44134, 60623, 66593, 67846, 68240, 74035, 74651, 70815, 66925, 71032, 79434, 91319, 108431]
9325A08431J6059J1110P270j942o173k253o743q034o504k727n256j107j2040r757
9311H0334o846p184n029J487m568j220O027L063J249k925k687R5j049j28k594
9296E8025O755K028M27R515M030J524O382o44L887j615L156J3195J0649Q770R484
9281A35568K151j340m088N673J2017O651O101l37j3289j1915n849j1035o480q969
9267A04859p811n997p641o987n152o066J084M290L538n73n060l134l607K61K000
9252F4004N409N355O636l06o842k277k470j52Q590q56L749P722m156m093J5905
9237I6218J7160R645L844K801R150L631k735q957n265j5437j4437m187r77j4238
9223G6216j0150N755L213p146q497k950L095N749M00k150k513q239p643m053N507
$$ y = [108431, 124490, 135600, 142870, 140928, 134755, 132502, 125759, 117725, 111221, 108494, 103238, 102131, 90091, 80334, 73488, 66304, 61275, 62762, 58194, 56974, 63001, 66064, 67313, 64388, 61701, 61796, 60747, 60619, 58025, 64780, 66808, 67235, 76750, 80780, 82304, 88686, 88042, 91929, 90314, 93470, 106665, 117314, 126084, 135568, 137719, 136379, 132291, 137964, 149981, 156632, 162733, 162396, 149107, 137192, 131343, 120308, 113828, 104859, 97048, 91051, 83410, 76423, 71271, 65205, 66289, 70579, 74117, 73544, 68484, 65350, 61743, 62004, 64004, 69413, 74768, 81404, 81098, 74256, 71979, 69509, 69357, 77947, 77091, 80840, 88562, 84406, 80313, 96218, 113378, 123023, 126867, 129668, 138818, 142449, 139714, 130757, 125492, 110055, 95618, 91431, 90454, 76216, 66066, 71821, 75034, 67888, 59391, 56441, 59536, 65285, 65685, 63535, 61022, 52783, 45140, 41087, 46594]
9208D6594M807L27l858O803P811K048M47P066L842K074k713j763j604k54K124
9193G3751O862J337K284j074J402l512J73Q91m560j137L944p16k588J056M47r090
9177F9470p039m139J886l89K484J032p52k315M77n366P145J1502n076j343m319
9162F3258n335M136J865N70L306K058n237l598J016k267L126R89n117J822Q672
9147F9264P675K289J756J855q33J269l154j896k424L349N566k398q14O0L117l349
9131H1332j51k65m379j940N486L620l706J899k579j274K352M274M461o754j1123
9116G1253k962Q537N216j67j033J30M37k351k235L483J3371M326p77K513l886
9101I5855q215n379K755p41J04J0274l733p592j288N75K356N23L032L025P904
$$ y = [46594, 51401, 51728, 47870, 54673, 62484, 64532, 64979, 72045, 75887, 77961, 75248, 73485, 71881, 71627, 73751, 80613, 81950, 84234, 83160, 84562, 81050, 81223, 82114, 77554, 76417, 80361, 79645, 77057, 78113, 78560, 69470, 62431, 58292, 60178, 59789, 62273, 63305, 62553, 60238, 60715, 55349, 62494, 73996, 68920, 67577, 63258, 57923, 62059, 63924, 64494, 67800, 69858, 64621, 61023, 62039, 59772, 62898, 63887, 58770, 60592, 69264, 76939, 79228, 80984, 82839, 82006, 83275, 80121, 78225, 75801, 79150, 84716, 82318, 81504, 81564, 84681, 81332, 81181, 80916, 76537, 74597, 80083, 83703, 79997, 81896, 79317, 78043, 80395, 84669, 89130, 82376, 71253, 68291, 76828, 82044, 81877, 80844, 80974, 81411, 79060, 76825, 80308, 93679, 98005, 97228, 99741, 95855, 87640, 82261, 85016, 84275, 84379, 94653, 90920, 83328, 82040, 82615, 84971, 85494, 88526, 91551, 99455]
9086I9455L137n448r045o240M331P036L146K36J0067M703m156n457j997O639K131
9071A08538r62J276J020J1129O441n692n190n315j621k575P557P762J566j571
9057A22363j749k693K241k913K234M573M173j089j970L884j40j550M355n335l710
9042A22674j039M999R282Q161l693n84j782J086J699m569j698P561M036m03j840
9027A43890M849M151K52m915O881K428R615N935n999q258K802M190J948j984j580
9012A64205N37j314P032M515p284j006J188K241J26N378P061K280l434l166P186
8997A85545J293j618N222P631M186P273M731L485k734l727m47L367j356q4m094
8982B08673p71M993o56N535K027J949M09O752J764r77N30N04m287j089N342P018
$$ y = [99455, 102592, 97144, 88099, 81859, 86190, 93226, 96372, 96608, 106675, 111378, 107222, 101765, 99768, 106407, 108538, 107576, 108852, 109872, 121001, 127442, 121750, 116560, 111245, 109624, 107049, 114606, 122368, 123934, 122363, 120614, 117921, 120162, 117249, 119483, 124056, 128229, 127140, 125170, 129054, 128914, 127364, 131719, 126384, 122674, 121635, 126634, 135916, 144077, 140384, 139800, 138018, 139104, 140803, 136234, 134536, 142097, 146133, 145730, 143890, 148739, 152890, 153142, 148227, 155108, 157536, 167151, 173086, 167087, 158829, 161631, 165821, 167769, 165785, 164205, 164742, 163428, 170460, 174975, 167691, 166685, 167873, 170114, 170240, 175618, 182679, 184959, 181525, 178359, 185545, 186838, 185220, 190442, 198073, 202259, 209532, 214263, 217748, 215014, 211287, 210840, 214207, 212851, 212767, 208673, 207902, 212895, 212239, 217774, 219801, 221750, 222159, 228911, 230675, 229698, 230228, 230732, 226445, 225356, 230698, 237716]
8966B37716j008K477l983L135L983L015P730m854n258O877O389K658L780Q193
8952B70850K166k025N900J0968J0866J0719J3979J2608J087j4510j1165o782o145
8939B98516K377P647Q287P257J514m591k260N967M067L718R066Q905K207N102
8925C57779J419L273m24qN028K374Q767M544O512l441j912L647O786k159K694
8910C94879M407J4277M131O603J0590P199L343P794O617J5204R854L562N333l474
8896D90319j172K565M553J1930P640K112P099M774J0911J0677K157N340J0674
8883E69579J1614N027K759Q417R829J0296J3450J3813M534R795L380M322N521
8870F72336R231J2347R823R200J1197K4646K0100P883J7812M193O093J2404J0819
$$ y = [237716, 236708, 239185, 235202, 238337, 242320, 245335, 253065, 248211, 242953, 249830, 256219, 258877, 262657, 270850, 273016, 270991, 276891, 287859, 298725, 309444, 323423, 336031, 337118, 322608, 311443, 304661, 298516, 300893, 308540, 316827, 324084, 325598, 321007, 318747, 324714, 328781, 332499, 341565, 350470, 352677, 357779, 359198, 362471, 362047, 362039, 367067, 369441, 378208, 382752, 389264, 385823, 383911, 387558, 394344, 392185, 394879, 399286, 413563, 417694, 424297, 434887, 442086, 445429, 453223, 459840, 475044, 484898, 488460, 493793, 490319, 489147, 491712, 496265, 508195, 515835, 517947, 525046, 529820, 540731, 551408, 553565, 558905, 569579, 581193, 586220, 588979, 597396, 607225, 617521, 630971, 644784, 649318, 659113, 662493, 666815, 672336, 681567, 693914, 703737, 712937, 724134, 748780, 768880, 776763, 794575, 798768, 804861, 817265, 828084]
8857H28084Q647J4781J0475J5534K1167J9587J3162K657J8127J7736J2526J0432
8845I92915J5385J6397K4505J7100J6614J7020J2637J9407K2289K2161J8080J4729
8833A209239K1414L3213K5558K1001K6115K4788K4697K6742K0133K1687K5003
8822A479590L1601K7399L3106L6826K7965K8028L1191L0448L4556M2054M3782
8811A846546L6756L3801L6439K7564K9237M2806M7436M2346L6725L6762M3866
8800B260284M5839M1743M1570M8587N2120M8893N0633M2796M5348M4371M6208
8789B768392N3305N2834M9076M5879M5958N1572O0214N4612M1046L8804M9039
8778C310731N3074M8435M7088M3879M6080M1345L9719L2078L9703L8001K7263
$$ y = [828084, 836731, 851512, 861987, 877521, 898688, 918275, 931437, 934094, 952221, 969957, 982483, 992915, 1008300, 1024697, 1049202, 1066302, 1082916, 1099936, 1112573, 1131980, 1154269, 1176430, 1194510, 1209239, 1230653, 1263866, 1289424, 1310425, 1336540, 1361328, 1386025, 1412767, 1432900, 1454587, 1479590, 1511191, 1538590, 1571696, 1608522, 1636487, 1664515, 1695706, 1726154, 1760710, 1802764, 1846546, 1883302, 1917103, 1953542, 1981106, 2010343, 2053149, 2100585, 2142931, 2179656, 2216418, 2260284, 2306123, 2347866, 2389436, 2438023, 2490143, 2539036, 2589669, 2632465, 2677813, 2722184, 2768392, 2821697, 2874531, 2923607, 2969486, 3015444, 3067016, 3127230, 3181842, 3222888, 3261692, 3310731, 3363805, 3412240, 3459328, 3503207, 3549287, 3590632, 3630351, 3662429, 3702132, 3740133, 3767396]
8767C767396K5207L0091K7294K4593J7806J7297K1225J5495L68L410Q585P742
8755C966509J0927J036j1211k1255j6874j1427j9275k1579j8622k6805l2622l0511
8743C768291k7268k1380k9106m2897m6826l6758l5094m5646n0940m9639m3518
8732C339219m9518m7057m7700m9247m8390m9793m7870n0363n3832n2827m9774
8721B792848m0766m7700m4474m9727n0334m8348m0969m4633m9705m0945l7365
8710B297882m3977m3579l9796n1768m0905l8111l9739m2047l3193l3634l0418
8699A860715k5409l9695m2322l4798k6856l2282l7581l6681l1663k4303k1569
8688A507556k6232l0006k8320k4412k0430k3832k0737k7474k7957k7879k1371
$$ y = [3767396, 3792603, 3822694, 3849988, 3874581, 3892387, 3909684, 3930909, 3946404, 3946772, 3950182, 3958767, 3966509, 3977436, 3978472, 3967261, 3946006, 3929132, 3917705, 3898430, 3876851, 3858229, 3831424, 3798802, 3768291, 3741023, 3719643, 3690537, 3647640, 3600814, 3564056, 3528962, 3483316, 3432376, 3382737, 3339219, 3289701, 3242644, 3194944, 3145697, 3097307, 3047514, 2999644, 2949281, 2895449, 2842622, 2792848, 2752082, 2704382, 2659908, 2610181, 2559847, 2511499, 2470530, 2425897, 2376192, 2335247, 2297882, 2253905, 2210326, 2170530, 2118762, 2077857, 2039746, 2000007, 1957960, 1924767, 1891133, 1860715, 1835306, 1795611, 1753289, 1718491, 1691635, 1659353, 1621772, 1585091, 1553428, 1529125, 1507556, 1481324, 1451318, 1422998, 1398586, 1378156, 1354324, 1333587, 1306113, 1278156, 1250277, 1228906]
8677A228906j6610k1401j6071k0063k2128k2546k3112j3014j8479k0306j9871
8666A015305j6384j3510j5993j2749j1303j4192j9704j6908j6535j6339q888p763
8654H45037j4020j2380j3785k2486j5737j1269j7939j3932k095j395n134j1629
8642G03236j1765j6703m108n320j6424q915m336j360j0394r233n356K697j0790
8629F01229q930j2834j4343j0141j1122m742j3739q141j785r864k452n575k453
8616D95108q142n484k063J74n713q036k691n682j2889l318K196l197J477n983
8602D35757r187L160l106l298m85n191q101J905J567L38K306L139O576p79L596
8587D28197J0139Q909O2j2880j2052j5222k0451j3260p999q329j0045j4574p437
$$ y = [1228906, 1212296, 1190895, 1174824, 1154761, 1132633, 1110087, 1086975, 1073961, 1055482, 1035176, 1015305, 998921, 985411, 969418, 956669, 945366, 931174, 911470, 894562, 878027, 861688, 852800, 845037, 831017, 818637, 804852, 782366, 766629, 755360, 737421, 723489, 721394, 719999, 714865, 703236, 691471, 674768, 670660, 665340, 648916, 640001, 635665, 634305, 623911, 614678, 609322, 612019, 601229, 592299, 579465, 565122, 554981, 543859, 539117, 525378, 517237, 515452, 505588, 503136, 497561, 495108, 486966, 481482, 479419, 479593, 473880, 465844, 463153, 457471, 444582, 441264, 443460, 440263, 441740, 435757, 426570, 429730, 426624, 423326, 422841, 417650, 409549, 411454, 413021, 413359, 415665, 418804, 425380, 424601, 428197, 438336, 447245, 447307, 434427, 422375, 407153, 386702, 373442, 365443, 357114, 347069, 332495, 325058]
8574C25058m52p676j2962J914N472q523k825m535l299j223J72m610o180j401M94
8559B79424j0653j0261n405m910L79n529l883M151L327j046j1216p723l193k309
8545B21153k103j551j780l176L233M566K484J68k550r263n685q028k866K508j423
8530A95687j176l627J009P589p71m577j1094j034l517O65r58k983J264j180l569
8515A71728L706j36o014m817r211L883P793j155r62n483m022l605j067n88m780
8500A45270m863M481L751K352K982M692j432m050r234q700O205M541j2089r869
8486A24037K779Q493O04l494j418j11N666l332n988j502J231O55k458j708o233
8471A17221k836O114N441l655J003l664n208k971J078L585N878j573r94l13j69
$$ y = [325058, 324606, 316930, 303968, 305882, 311354, 302831, 300006, 295471, 292172, 290949, 291121, 286511, 280331, 278930, 279424, 268771, 258510, 253105, 248195, 248574, 243045, 239162, 243313, 246640, 245594, 234378, 226655, 223462, 221153, 219050, 217499, 215719, 212543, 215776, 220342, 222826, 222994, 220444, 211181, 205496, 197468, 194602, 197110, 195687, 194511, 190884, 191893, 199482, 198711, 194134, 183040, 182006, 178489, 179154, 178196, 175213, 176477, 175297, 171728, 175434, 175298, 169284, 164467, 155256, 159139, 166932, 165777, 164815, 159332, 155310, 151705, 150638, 150050, 145270, 140407, 144888, 148639, 150991, 153973, 158665, 157233, 153183, 143949, 135249, 141454, 145995, 133906, 124037, 126816, 135309, 135913, 132419, 131001, 130890, 136556, 133224, 127236, 125734, 126965, 127620, 125162, 123454, 117221, 114385, 120499, 125940, 122285, 123288, 119624, 114416, 111445, 112523, 116108, 121986, 120413, 119419, 119106, 118937]
8456A18937k216j475k950j682J683M75j687m327k544N022j71q390k646N584J246
8441A04859P263p1q072r795n891p93j116M645O098r7l708N808K369n138L04j271
8425I5394R5o253l18j455J683K533J320M941J522m868n397K588L433L978n783
8410I3413L399r17k031j325j0579L396L911l875j0960l245j0m355J064N423K155
8395G5464q03J920K594L415o460p85O186m699m034m76O029j840P32M944n868n678
8379G0641J662N087j225m655m866o017q07K772P05Q908P351K182n753r048n846
8364F1091q554M974P995L020N411k348j3027o492J750M975K71j925r43N726M456
8349F6380j459k632j175n845J526l251o713J667Q909j905m716K371l19L654k478
$$ y = [118937, 116721, 115246, 112296, 110614, 112297, 112772, 111085, 106758, 104214, 109236, 109065, 100675, 98029, 103613, 104859, 112122, 112051, 103979, 94184, 88293, 87500, 86384, 91029, 97127, 97030, 93322, 99130, 101499, 96361, 96665, 95394, 95489, 89236, 88918, 87463, 89146, 91679, 92999, 97940, 99462, 94594, 89197, 91785, 95218, 99196, 93413, 96812, 95895, 93864, 92539, 81960, 85356, 89267, 85392, 74432, 71187, 71177, 66822, 67886, 73309, 75464, 74661, 76581, 79175, 82590, 76130, 75345, 81531, 76832, 72798, 72322, 78351, 76511, 77243, 82187, 76319, 70641, 72303, 77390, 76165, 71510, 66644, 60627, 59820, 62592, 63297, 72205, 79556, 81738, 75985, 66937, 61091, 52537, 57511, 65506, 68526, 73937, 71589, 58562, 52070, 53820, 58795, 59066, 57141, 56198, 61924, 66380, 64921, 62289, 61114, 55269, 56795, 53544, 46831, 48498, 57407, 55502, 50786, 53157, 52838, 56492, 54014]
8334E4014m567m991k69K875J234l631k017O833P437j241p06L083J314N32j293
8319E8607P36j802k331J974k690l621n057q573o10K83J4486Q722j720r941o099
8304D2364J4012J2529m132q828l618j412j533J926L672M807J414j97O593P536
8290G5133M021N155L52j2220n058K276m784k265j492o063k33N11P88j236K530
8275E7415O259K455M43k514n812r136j693L921K802L625l336m27J957J082n257
8260E1784p685k248k248j276M751L15j973K222P171K313N755J366O686M464k219
8245F9178n834o394r152j1364n685M13K907j172L149N691j589K942m97L269j143
8230D4719k17m637M847J419K463k616n283p822k271j591J272l685k940Q055L587
$$ y = [54014, 49447, 44456, 44187, 47062, 48296, 44665, 42648, 49481, 56918, 55677, 54971, 58054, 59368, 59900, 58607, 59343, 57541, 55210, 57184, 54494, 50873, 45816, 37243, 36633, 36916, 51402, 60124, 58404, 48463, 42364, 56376, 68905, 64773, 55945, 52327, 50915, 49382, 51308, 54980, 59787, 61201, 61004, 67597, 75133, 79154, 84309, 84661, 72441, 67383, 69659, 64875, 62610, 61118, 55055, 54822, 55333, 56121, 54885, 57415, 63674, 66129, 66572, 64058, 58246, 49110, 47417, 51338, 54140, 57765, 54429, 54002, 55959, 57041, 51784, 44099, 41851, 39603, 38327, 43078, 43393, 41420, 43642, 50813, 53126, 58881, 60247, 66933, 71397, 69178, 63344, 56950, 47798, 36434, 30749, 31162, 34069, 32897, 36046, 41737, 40148, 43090, 42593, 45862, 44719, 44502, 39865, 44712, 46131, 48594, 45978, 40695, 32873, 30602, 29011, 30283, 26598, 23658, 31713, 35300]
8215C5300N496J01j1345j278K480m786J927j310k674l012K273M524n615J072o95
8200B2458l92L594K493J309l005Q546N21o984l272L023o85P06L88L16l364O163
8184C1815m229p267O206m226n52O613Q44p046R288N278p51m086J844O237l573
8169C6395j852j023R10k546l038N807j354j832k93p776r76M221L480j466n64q80
8153B7213M368M235j964r155J087p299l222O413P549j473m06J0046j207l829l176
8138B9180M368p40n676Q35o22J134J008k286j204q86J613n667l018j73J410m94
8122A8782j819l457k977P92K489q836K064P100j020o38K214O16l195L699L76m202
8106A1988P032O502P76q606r684J963J313J448K454l890M046l065Q292P144m227
$$ y = [35300, 40796, 40897, 29552, 28274, 30754, 25968, 27895, 26585, 23911, 20899, 23172, 27696, 22081, 23153, 22458, 22066, 25660, 28153, 29462, 26457, 35003, 35524, 28540, 25268, 28291, 27606, 28312, 28700, 29016, 25652, 31815, 27586, 20319, 26525, 22299, 21747, 28360, 29204, 22158, 31446, 36724, 35973, 31887, 33731, 39968, 36395, 34543, 33520, 34430, 31884, 28846, 34653, 33299, 31467, 31174, 23398, 22422, 26643, 30123, 28657, 28093, 27213, 31581, 35816, 33852, 24697, 25784, 18485, 15263, 21676, 29225, 27752, 27346, 37392, 36185, 32356, 29180, 33548, 32808, 27132, 27967, 27345, 28479, 29487, 27201, 25997, 25111, 26724, 21057, 18039, 17866, 19276, 18782, 16963, 13506, 10529, 11321, 13810, 4974, 7038, 14138, 13118, 12480, 14694, 15310, 12115, 15814, 16190, 11988, 19020, 25522, 26298, 17692, 8008, 9971, 11284, 12732, 15186, 11296, 15342, 12277, 20569, 27713, 23486]
8091B3486R42j563p92k682k095K528R42J803L385r755J636L087m697r459l058
8076C708J2738O38j1802M59L204K017j658J154L336L819P904J987Q471m360l988
8061B7627l355J250l946L738K308m132o090m214m320O77Q496N328r32j793j069
8046A9573R590M371n811n900L023K882R39n264j2447L876J2178l207j0653l071
8032A0079m383N994L119J1438N293N631q46k221M136N674k975o024j324M591N025
8017D3207N780J361O003Q455N594J07l074j772j877K628M895l57K044m737o222
8002F2035n863m293l418Q65l268N36k175r860q36J461J158o65M823p12k781m40
7986C6567K702k010n482J434K514j657j311Q19k084r9j251J1236N270L506K831
$$ y = [23486, 24428, 22865, 22073, 19391, 17296, 19824, 20766, 22569, 25954, 16199, 17835, 20922, 16225, 6766, 3708, 16446, 17084, 5282, 5741, 8945, 10962, 9304, 10458, 13794, 17613, 25517, 27504, 35975, 31615, 27627, 24272, 25522, 21576, 25314, 27622, 23490, 17400, 13186, 8866, 9543, 18039, 23367, 22435, 20642, 19573, 29163, 33534, 27723, 21823, 24846, 27728, 28667, 23403, 10956, 14832, 27010, 23803, 13150, 10079, 5696, 11690, 14809, 26247, 31540, 37171, 36325, 34104, 38240, 43914, 40939, 34915, 33591, 38182, 43207, 48987, 50348, 56351, 64806, 70400, 70507, 67433, 65661, 63784, 66412, 71307, 70950, 72994, 68257, 62035, 56172, 51879, 48461, 49326, 46058, 46594, 44419, 34559, 33723, 35184, 36342, 35677, 40500, 39788, 37007, 36567, 39269, 37259, 31777, 33211, 35725, 34068, 32757, 33576, 31492, 31393, 30142, 41378, 46648, 50154, 52985]
7971E2985K862R421q84m593n57J771j39n485r50j108p091q61r143q343J829N593
7955C5307J779n331L606Q79K55j05k454L408j951m832l749o694p1R114O764k910
7939C3015l492k341N19m233k418J662L640k910k45p388J115J854m090m830N470
7924A5328P867K878o776m706K2l62O456J365J44k277l7j500R52O072o71K426j563
7907B5618j1556l042K051q12n612J760O763Q73o312K184M508N036p02K669n224
7892A8202k451K892p577Q27O353l89J209m40m270J841K522k388J716l408J373
7877A6012p1n492j562k341J301K550j099K010o993j496J981M210O124m127j878
7862I129m181n105J000k196O003k899k627m286l367P508Q523N43l185L810Q950
$$ y = [52985, 55847, 65268, 64384, 59791, 59234, 61005, 60866, 55381, 54431, 53323, 46232, 45371, 36228, 27885, 29714, 35307, 37086, 31755, 35361, 36240, 36495, 36390, 33936, 37344, 35393, 30561, 26812, 20118, 20047, 29161, 35925, 33015, 29523, 27182, 27701, 23468, 21050, 22712, 26352, 23442, 23197, 15809, 16924, 18778, 14688, 9858, 15328, 23195, 26073, 19297, 14591, 14613, 14251, 20707, 22072, 22216, 19939, 19902, 18402, 19354, 25426, 24755, 27181, 25618, 14062, 11020, 13071, 12259, 6647, 8407, 15170, 16043, 9731, 11915, 16423, 21459, 20757, 23426, 18202, 15751, 18643, 11066, 11893, 18246, 17857, 19066, 18626, 14356, 16197, 18719, 16331, 18047, 14639, 16012, 15941, 10449, 8887, 6546, 7847, 10397, 9298, 11308, 4315, 2819, 4800, 9010, 15134, 11007, 9129, 4948, -157, 843, -1353, 4650, 1751, -876, -5162, -8529, -1021, 7502, 8045, 4860, 8670, 17620]
7847A7620O81n585k084m673L178O224Q216k337L391J0423N88j1046k758j603r060
7832A1175n250k98N251K806K867k226j0725Q77P146K155O88k67m483n378M59O080
7816A0877K66j378j0404J132J048J410j013O519J675M674n892l090p10r20N937
7801A0131j151q67k998p43N294J606j913n799Q820P458j756p026j008j533n121
7786C394L94M32r40M901J653Q45n029n758P549J0268m034L753j669k435K640m421
7770A1543m745M323l74l614p010k852J214L215L513M97N8M50M161O62n412r87
7754D642j911m365Q10O88N94L953N900P51o999l008K508N031n65m079k879l008
7738a937K044k523j976n117l505L627Q838N017J244M033K149k008l106l247j9
$$ y = [17620, 18301, 12716, 10632, 5959, 9137, 15361, 23577, 21240, 24631, 35054, 35642, 24596, 21838, 20235, 11175, 5925, 5627, 10878, 13684, 16551, 14325, 3600, 4477, 11623, 13778, 14466, 14199, 9716, 4338, 4797, 10877, 11143, 9765, -639, 493, 1541, 2951, 1938, 8457, 10132, 14806, 8914, 5824, 5114, 4194, 10131, 8980, 8113, 5115, 4372, 9666, 11272, 9359, 3560, 12380, 19838, 18082, 11056, 10048, 8515, 3394, 3788, 4220, 3280, 8181, 9834, 10679, 5650, -108, 7441, 17709, 13675, 17428, 15759, 13324, 15964, 11543, 6798, 11121, 10747, 7133, 123, -2729, -1515, 1700, 5213, 5710, 5768, 6218, 10379, 11041, 5629, 4642, 2731, -1634, -824, -136, 458, 4411, 10311, 11062, 4063, 1055, 3563, 8594, 8029, 3950, 1071, -1937, 107, -2416, -4392, -9509, -13014, -9387, -549, 4468, 5712, 9745, 11894, 9886, 6780, 3533, 3514]
7723C514L622K132p52p555r84J244l89K06k306K478q04n675J217M773J544k490
7707b25M187k280K64m777N17L549P435R53l195k84j365k770n488M384k02K595
7691C298l548k488n11K780k451j921m240O282L522J288R759N506m0l264j3714
7676B58p74l144L598J595p687R86K143K564O436L113j1690q278K071j800Q026
7661b583K18O6L53R03L039K345k55J691l175K067M398p880l249Jq638O30L705
7644f364O57p4K202J896J097L93l779K392j981O712l846O20m280j549J483Q038
7628C617O241n258n589N008P049J978j89l956M096j355l102K372K620n02r160
7613C870m296K697j459L054l214j169l962k448k717m44R860N911O448M712k411
$$ y = [3514, 7136, 9268, 8516, 961, -23, 1221, 832, 1038, -1268, 1210, 406, -5269, -4052, 721, 2265, -225, 3962, 1682, 1946, -2831, -2314, 1235, 8670, 9623, 6428, 6144, 4779, 2009, -3479, 905, 703, 3298, -250, -2738, -3249, -469, -2920, -4841, -9081, -2799, 723, 2011, 11770, 17276, 17236, 13972, 258, -516, -3660, -62, 1533, -6154, -5168, -3025, -461, 5975, 9088, -2602, -10880, -8809, -10609, -2583, -2365, -2299, -1946, -1043, 1996, 4341, 4086, 5777, 2602, 4669, 9067, 1187, -2062, -2061, -10699, -10069, -6364, -5707, -5781, -3579, -1683, -586, -193, -3972, -1580, -3561, 3151, -695, -75, -4355, -5904, -4421, 3617, 9858, 4600, -989, 4019, 11068, 13046, 12857, 8901, 12997, 11642, 8540, 10912, 13532, 13030, 3870, -426, 2271, 812, 3866, 652, -517, -4479, -6927, -9644, -10088, -228, 5683, 12131, 16843, 14432]
7598A4432p753l842m43M52l170k276K67m059J054o191l884m907k542L203M804
7583a4855Q921N740q53M428k037n672m25N871L626k738k907J76J66q68K698J407
7567B678l232k41O600K16l96J922l146n293j53Q76k58J94K622k677l427p792J623
7550i884N114o665J651P3k286P805L216q694K123R169l631K511l21m157M491l816
7534c301p538k359m8M209l64k16j003O93M013J619n008r952P786M202k350K14
7518i403j653k100P779K593l57M006k025M322J524j0039r573M97L666P380Q749
7503E366J207p639l559m513q115J641J5246R636m561j665j957p256n368P410O488
7488B361k727j540M936L975o085P77L729P471N12k997n874p141O063M262k584
$$ y = [14432, 6679, 2837, 2394, 2846, -324, -2600, -2333, -6392, -5338, -11529, -15413, -20320, -22862, -19659, -14855, -5934, -194, -1047, 3381, 1344, -4328, -4753, 1118, 4744, 2006, -901, -725, -559, -1427, 1271, 2678, -554, -795, 5805, 6021, 5625, 7547, 4401, -892, -1045, -169, -427, -233, 2389, -288, -3715, -11507, -9884, -4770, -11435, -9784, -9711, -11997, -4192, -976, -9670, -7547, 1622, -2009, 502, 181, -3976, 515, -3301, -10839, -13198, -13246, -9037, -9401, -9617, -10620, -9927, -5914, -4295, -9303, -19255, -11469, -7267, -9617, -9403, -11056, -13156, -5377, -2784, -3141, 865, -1160, 3162, 4686, -5353, -14926, -14429, -10763, -3383, 5366, 6573, -1066, -4625, -9138, -17253, -15612, -366, 9270, 4709, 3044, 1087, -6169, -11537, -4127, 2361, -366, -1906, 3030, 7005, 920, 1697, 5426, 12897, 13409, 10412, 4538, -2603, 3460, 7722, 5138]
7473E138j08P79m947J908N591o993l685l146K20N254M347n109q252K314P749K107
7457C167k549P319k215j940o396k462m975N866R206K913K712k908Q8R04K948p86
7441A0892m69l815l110l509j738n511p1P411M179n38J833M717P825J997q885q064
7425C144j244k185l986O28Q93l049l386K52K72K887J0376N43r205j242K478R99
7409a825m670r99k56P827M499j593k913n52K93m031m4N72k099j444K931M772K344
7392B812k666o638m769O387J293J37m278L027P135L592l838j805p24j030M2m09
7376a732q585O289P260r17O3n536j1O209j55r320K076R910M858j268r136p68M00
7359c63L143m006m734q98K186m700J303L713J36K590N744j25K089l794k843j756
$$ y = [5138, 5030, 5809, 862, 2770, 8361, 1368, -2317, -5463, -5243, 11, 4358, -751, -9003, -6689, 1060, 3167, 618, 7937, 5722, 3782, -2614, -5076, -10051, -4185, 5021, 7934, 10646, 7738, 7826, 8730, 11678, 10892, 10423, 6608, 3498, -11, -1749, -7260, -7331, 80, 4259, 3721, 5554, 10271, 18096, 20093, 11208, 3144, 1900, -285, -4271, -3643, -2750, -5799, -9185, -8933, -8661, -5774, 4602, 5145, -4060, -5302, -2824, -1825, -6495, -7494, -7750, 77, 4576, 2983, 70, -482, -189, -4220, -4264, -3692, -5791, -7235, -4304, 468, 2812, 146, -6492, -11261, -4874, -3581, -3444, -7722, -4695, 2440, 6032, 2194, 389, -335, -1365, -1323, -1732, -10317, -4028, 3232, 2315, 2378, -3158, -3169, 3040, 2885, -6435, -4359, 5551, 10409, 9141, 5, -763, -363, 2780, -1226, -5960, -6858, -4672, -9372, -8069, -4356, -4220, -1630, 4114, 3989, 6078, 2284, -559, -2315]
7343b315j195K277P82N522L79J7N33m191q312K680K822K178M040K721n666j96
7327B076O140O041l761o377j684k433o8J49k152j0783L043M572J895j702n143
7312a0187m148J569K07L877M527n15n749m663P94Q516l99o445j208j96N620L265
7296e135n741l037O096q0m204l106R576P01l978l491l888K947M193N350L901J67
7280B71K823K0j031M682L1o08j214k873q993k721p210p229M20O896Q574P418k498
7263c242n886k160K146N448M06j647N344n818m943l31M650L492q4q41J707L310
7247A551j122K355M652j32K506q56l343k841j282L654J811J527k205l855K35M423
7231G078o82o989K442J120q292l320l528L849L990N638q848o561P774m876P52
$$ y = [-2315, -3510, -1233, -451, 5071, 5450, 5467, 6000, 1809, -6503, -3823, -1001, 1177, 5217, 7938, 2272, 2076, 8216, 14257, 10496, 4119, 2435, 2, -66, 83, -2069, -12852, -9809, -5237, -3342, -5044, -10187, -14335, -12766, -12559, -8682, -4155, -4670, -10419, -15082, -14288, -5772, -6171, -12616, -13824, -14020, -8400, -5135, -10876, -13913, -7817, -7897, -12101, -15207, -5631, -4930, -8908, -12399, -16287, -13340, -9147, -3797, 104, 271, 3094, 3114, 2083, 6765, 6796, 6188, 4974, 2101, -6892, -9613, -16823, -24052, -23632, -16736, -8162, -744, -3242, -9128, -11288, -9142, -3694, -3288, -4935, 409, -5409, -10352, -10683, -6033, -2541, -2625, -3466, -1759, 1551, 429, 2784, 7436, 7304, 9810, 8954, 5611, 2770, 1488, 5142, 6953, 8480, 6275, 2420, 2655, 7078, 6396, -593, 1849, 2969, -5323, -8643, -12171, -8322, -4332, 1306, -7542, -14103, -6329, -11205, -10453]
7216a0453P467Q050M637l478r54q93q064p414O334N968O070K970J042k83j059
7201I940r027p902N470l900j074O205J831l139k983rj433n340m161R3M300N836
7185e293L668N743p643o276N52j750J6q683M74P575Q796K121p974M87L256J417
7169c514J540j912k475m922N053O834J061L281N764l066n791j500K899L80p284
7154c652o137J546N363L817j0448o058J3802R315j062o4q12K524l651k039k608
7139a64k602j585K759N312o03o165j619m348K364N067n047m003K786K843J195
7124c810M600M966k157P23K249J318q129n268K659K130n561O14m911r38R134J230
7108a151L88K747L155j713o4k402Q54L373J202p649p825l840j276L729m20M390
$$ y = [-10453, -2986, 5064, 9701, 6223, 5269, 4376, -3688, -11102, -4768, 1200, 7270, 10240, 11282, 10999, 9940, 913, -6989, -1519, -5419, -6493, -288, 1543, -1596, -4579, -4588, -6021, -11361, -15522, -15429, -11129, -5293, -1625, 4118, -3525, -9801, -9249, -10999, -10983, -19666, -19192, -11617, -2821, -700, -8674, -8187, -4931, -3514, -1974, -3886, -6361, -11283, -6230, 604, 1665, 4946, 10710, 7644, 1853, 353, 3252, 3632, -3652, -9789, -8243, -2880, 937, -9511, -15569, -1767, 7548, 6486, 6422, 5610, 8134, 4483, 2444, -164, -2766, -4351, -1592, 3720, 3117, -3048, -4667, -9015, -6651, -1584, -6631, -10634, -7848, -5005, -3810, 790, 5756, 3599, 4322, 6571, 7889, -240, -5508, -2849, -719, -6280, -5666, -10577, -11515, -2381, -1151, -763, 1984, 5139, 3426, 3362, 960, 1814, 5187, 6389, -1260, -9085, -12925, -14201, -10472, -10892, -6502]
7092f502k159k377J311J476L239m383k523r33Q20k689J12M408M826M485K476j420
7076A67n074l515P520J634j0M135k504k083j148j875K515k11N94m14j682J221
7060g30L99L02q71n385l593J276P209j242n525l50j127l664M690J1792j38j3k501
7043E29n129j861M89K183Q42Q829m50p530p347m94M366j5n108L04P191K111j964
7026c054M45l053J427n052k140P133O141m08J213J032j348p280J094k54P68k267
7010e603j0769N324J4766O224k597j0506q029m372N906L349m238l821P136L808
6996c422N269q651j248J854j872N625L48n945K821L577O92K088J142L174J538
6981F990l565j0664l267K388M072J798n130K49Q831Q8l880N213P91J236k814j802
$$ y = [-6502, -8661, -11038, -9727, -8251, -5012, -9395, -11918, -12851, -12031, -14720, -14608, -10200, -5374, -889, 1587, 167, -4907, -8422, -902, 732, 722, 4857, 2353, 270, -878, -2753, -238, -449, 145, -269, -1951, -730, -331, -29, -900, -6285, -9878, -8602, -1393, -2635, -8160, -8510, -9637, -13301, -8611, 3181, 3043, 3030, 529, -4600, -6461, -5972, -3789, -2947, 5882, 5432, -2098, -9445, -9939, -5573, -5588, -10696, -10392, -3201, -1090, -3054, -2609, -5662, -4235, -9287, -11427, -4294, 1847, 1439, 2652, 3684, 2336, -4944, -3850, -4104, -3336, -5603, -16372, -11048, 3718, 9942, 7345, -3161, -11190, -15562, -9656, -6307, -10545, -14366, -7230, -3422, 1847, -6804, -8052, -6198, -8070, -2445, -2097, -8042, -5221, -1644, -952, 1136, 2278, 5452, 6990, 3425, -7239, -10506, -8118, -4046, -2248, -7378, -7129, 1702, 1790, -2090, 3123, 3914, 5150, 2336, 534]
6965E34l642L113n120L822O229m445l740M726P662l330q595L20l93J146J381M906
6949D574J271m983n626p395j100l39P940K729n094j293K14k648J702k850k066
6934a4964N96L888o92K731Q73N23m099o82j7M236L75K114L421P177k361m191M73
6917e99k716K635p24L633L469j929M95L030o92m482l625k581R98L813o150L726
6901a699M161n365p492j468R814J0774k723l035o991l125J449P007O818O513n987
6886H651j3377l932L034N84l543J307M145N511r756n423J694P129L397J0341m6
6871I716m375j751J410M296r78o685j1107m819j330P086M584P240K851o540o989
6856g391j228O058N211l260j325m63n249l289l137N992m265J724O511j4K4j075
$$ y = [534, -3108, 5, -5115, -1293, 4936, 491, -3249, 1477, 9139, 5809, -2786, -2466, -2859, -1713, -332, 4574, 5845, 862, -4764, -12159, -13259, -13598, -5658, -2929, -8023, -9316, -9102, -11750, -10048, -12898, -14964, -14368, -10480, -11172, -8441, -7568, -7045, -11144, -11826, -11843, -7607, -7232, -5118, -1697, 5480, 3119, -1072, -599, -3315, -680, -1404, 2229, 5698, 3769, 4264, 7294, 6602, 2120, -1505, -4086, -3088, 725, -5425, -1699, 2462, -2903, -10395, -11863, -2049, 8725, 6002, 2967, -4024, -7149, -5700, 1307, 8125, 14638, 8651, -4726, -8658, -5624, -5040, -8583, -7276, -3131, 2380, -7376, -12799, -11105, -3976, -579, 9762, 9716, 5341, 3590, 5000, 9296, 8318, 1633, -9474, -14293, -15623, -8537, -3953, 3287, 6138, -402, -7391, -8619, -2561, 2650, -610, -1935, -2398, -7647, -10936, -14073, -8081, -12346, -10622, -4111, -4125, -4101, -5176]
6840e176k206k628k163Q30O134M307R94n754k1N07p28q04Q664M668k829j253J549
6823D091j1406o338k352L325L337J472R7P651K806L404K532M035o110j264o723
6808a443j077l367k666o02p07n51L726n8N107k307n82K496J014P25L573k621j01
6791E59Ok764K366j447J700l340l810k153m970j959O619L906l508M22J260J786
6775e327K231J956J313j376L868M516l675o076M393K540O516L536p854m551P77
6760B787N341K041r07k231j388k646j0716J284n26J214Q42l534M303M235n95k397
6744b893K87o611J674P077k371k097J689R639K108n229j3029m029Q216K167m272
6729g674n394l63J1012K450J130m238k715M156L535K723K904K486L948k287q080
$$ y = [-5176, -7382, -10010, -12173, -11343, -5209, -902, 92, -5662, -5683, -5176, -5904, -6708, 1956, 6624, 3795, 2542, 4091, -7315, -13653, -16005, -12680, -9343, -7871, -7774, -123, 2683, 6087, 8619, 12654, 6544, 5280, -1443, -2520, -5887, -8553, -9155, -9862, -10413, -6687, -6745, -1638, -3945, -4527, -2031, -1017, -292, 3281, 660, 559, 565, -2199, 167, -1280, 420, -2920, -6730, -8883, -13853, -15812, -9193, -5287, -8795, -8373, -7113, -5327, -3096, -1140, 173, -1203, 2665, 7181, 3506, -2570, 1823, 4363, 10879, 14415, 6561, 2010, 2787, 8128, 10169, 9262, 7031, 5643, 2997, -7719, -6435, -6961, -5747, -4905, -8439, -4136, 99, -496, -2893, -2606, -9217, -7543, -466, -2837, -4934, -3245, 6394, 8502, 3273, -9756, -13785, -5569, -3402, -7674, -13068, -13431, -2419, 31, 1161, -3077, -5792, -1636, 1899, 4622, 7526, 10012, 13960, 11673, 3593]
6714C593K653O906J071L218k715p20l928n415p92m445P9N154J135L792n242m642
6698b98K90K324m337Q6P724M689q042j437P967N011r510j0559m274q90P40O549
6682c967j542k631J251j607P376K557l138l71O131O057N765m918l321k945m837
6667a40n001o7l54M611m166m499l705p7j904J457L796p19R993N860m19k166M439
6650F939o171N513j767n852n02j75j160k989N234N011k81o526l506m72J600J909
6634c195L367m115m771N576M403K79K18K739k04p357j0791n920j217J975N663
6619a3350P07L647K596J871R739L533l005l446J011m793q779m079k57M532O448
6604c625j392K669J227p49O962k372l087P312l382k954Q00m875n355N22k861L373
$$ y = [3593, 6246, 13152, 14223, 17441, 14726, 14006, 10078, 4663, 3871, -574, -495, 4659, 5794, 9586, 4344, -298, -8, 2316, -2021, -1935, 5789, 10478, 2436, 999, 8966, 13977, 4467, -6092, -10366, -11256, -10516, -3967, -5509, -8140, -6889, -8496, -1120, 1437, -1701, -2072, 4059, 10116, 15881, 10963, 7642, 4697, -140, -5141, -5208, -5562, -951, -5117, -9616, -13321, -13398, -15302, -13845, -10049, -10768, -775, 5085, 4666, 2500, 6939, 768, 6281, 4514, -1338, -1840, -2015, -3175, -6164, -930, 4081, 3800, -2726, -6232, -6704, -5104, -3195, 172, -3943, -8714, -3138, 1265, 1544, 1762, 4501, 4297, -3060, -13851, -19771, -20988, -19013, -13350, -12643, -8996, -6400, -4529, 5210, 8743, 5738, 2292, 3303, -1490, -10269, -14348, -14605, -10073, -3625, -5017, -2348, -1121, -1870, 5092, 2720, -367, 6945, 3563, 609, 1409, -3466, -8821, -8299, -11160, -7787]
6588g787O993J946l84J276j431m86K068L15M352k88j38l26k603o785j047l097
6572g422r04P822J294j343R83m72J602p123J172Q10m159P44Q714k545J538r32
6556b21l291K478O734J187p109K247K488R82Q6K750J381o201J394j987K295l56
6540D857l389k951N07o34k305r40J90J597K457j559R02K306M152m847q617j036
6524i310m74l381j78P551K752Q65N20J153K118J194j686q03Q92o219o373L595
6508g784q03p499L592L846L305N818m958l49N824k127n762l117Q186K031m874
6493d671l075m77k256p05K640M529K618L12m778k433K334r50k163L879N814k310
6477a692m133J396L55n217M224R45n324k948L229J063m788J500O839J919J441
$$ y = [-7787, -794, 1152, 768, 2044, 613, 127, 2195, 2510, 6862, 6574, 6436, 6110, 3507, -3278, -4325, -7422, -8326, -504, 790, -553, 430, -42, 1560, -5563, -4391, -3581, -7740, -6996, 1718, -827, 711, -221, -3512, -1034, 5700, 6887, -222, 2025, 4513, 5495, 5581, 8331, 9712, 3511, 4905, 2918, 5213, 4857, 1468, -1483, -976, -1610, -3915, -4855, -4665, -3068, -611, -2170, -1268, 1038, 5190, 343, -8274, -9310, -9784, -13165, -13343, -5792, -3040, -2175, -1655, -502, 1616, 2810, 1124, 321, 1213, -5006, -11379, -7784, -8587, -16086, -12494, -8648, -5343, 475, -4483, -4832, 992, -1135, -6897, -10014, -1828, 203, -4671, -7746, -8223, -10479, -11184, -8544, -4015, -1397, -1085, -5863, -8296, -5962, -6912, -9075, -5196, 618, -1692, -5825, -4429, -4074, -9291, -5067, -4122, -9446, -12394, -9165, -8102, -12890, -11390, -4551, -2632, -1191]
6462a191n297n107N717P838n405o26o387J794o810J136J1357N688r869j517M874
6447c805q19k42l564o320l769K718P247j02l982N031j626k981N742L696O235l741
6431b82j628K614q264l23L08M0o59l726N868k639o440M008L750O388M33L416m184
6414a320o102l447P819K668P00J530k448K009k553j0098L141J916K232m856l007
6399a1816P007m59L197J082k066j956l747k323M395M241J614n302K310K972j486
6384b337J51k450J738j883q394p665L623M843j88K157K316j556J1799O289j863
6369F580l555n77O58l150l746R66RK605k935r990J358O888L291K915O433o551
6353A199l052L792O75M143M064l854L253L038j900j0084r11k052j178N818K720
$$ y = [-1191, -6488, -11595, -5878, 1960, -3445, -4071, -10458, -8664, -15474, -14338, -2981, 2707, -7162, -8679, -3805, -4624, -4866, -8430, -14750, -18519, -15801, -8554, -8656, -12638, -7607, -9233, -12214, -6472, -2776, 3459, -282, -1910, 704, -7560, -7883, -7575, -7535, -8194, -11920, -6052, -8691, -15131, -11123, -7373, -985, -552, 2864, -1320, -7422, -10869, -3050, -382, 318, 1848, -600, 1409, -1144, -11242, -8101, -6185, -3953, -8809, -11816, -4809, -5268, -2071, -989, -3055, -5011, -8758, -11081, -6686, -2445, -831, -6133, -3823, -851, -2337, -2186, -4636, -2898, -4781, -13175, -20840, -17217, -12374, -12562, -10405, -8089, -9645, 2154, 8443, 6580, 3025, 2448, 3106, -44, -3790, -2824, -2815, -210, -3145, -13135, -11777, -4889, -1598, 1317, 7750, 1199, -1853, 1939, 2614, 6757, 10821, 6967, 10220, 13258, 11358, 1274, 363, -1689, -2867, 2951, 5671]
6338E671L237K248l187K184K60N09o786n479o834K5N520N026l096q76k316J428
6322b466j374M450L396M61Q43K68M687k098m923l628l115k455n167j435M723M779
6306c054J23j992p26q39L868l539K297J066k581k520j174M035K805m437O767m846
6290d747r584P509O223L207m183J193p112J174j781K747k975l022j432j391R06
6275a3268l157q63N391m738J817K904N815o631J851j385l393M254R308L640K1
6260A566P506j092p901p841J523l714p76l11O602l214l666m94K715J106m798K481
6244a0308P132L042Q27o56j165j68n455l944J377P980L624N292J450l632k550
6229B846N611l81l191o800m84M471k416j506J511k613k046M883M438N428j560
$$ y = [5671, 8908, 11156, 7969, 10153, 10413, 10922, 4136, -1343, -8177, -8152, -2632, 2394, -702, -1578, -3894, -2466, -3840, 610, 4006, 4467, 5310, 5578, 10265, 8167, 3244, -384, -3499, -5954, -11121, -12556, -7833, -3054, -2931, -4923, -5649, -6488, -2620, -6159, -3862, -2796, -5377, -7897, -9071, -5036, -2231, -6668, 99, -4747, -14331, -6822, -599, 2608, -1575, -382, -7494, -6320, -8101, -5354, -8329, -11351, -12783, -14174, -13268, -16425, -17288, -11897, -16635, -14818, -11914, -6099, -12730, -10879, -12264, -15657, -11403, -2095, 1545, 1566, 9072, 7980, 79, -7762, -6239, -9953, -10729, -11040, -4438, -7652, -11318, -11812, -9097, -7991, -12789, -10308, -3176, -134, 693, 37, -1128, -1296, -6751, -10695, -9318, -1338, 2286, 7578, 9028, 5396, 2846, 8457, 8076, 4885, -1915, -2399, 2072, -344, -1850, -339, -2952, -4998, -115, 4323, 9751, 8191]
6214H191p888k727k007L631N00J554j354r16K315R07j2676O38R406L436q571K037
6198c524l465K655N657j600m674k876L785M573l948J335K604j484O548L407J358
6183A0351j624q421k827j620k21j16L471K31N317O127p356p334O412J260N36l855
6167C31m12m698l335J61k783L750k033M610J22r232N315O515n355k734L18K093
6151g367N142M72o247p583M177j39k99P584L774Q643L537M250m98k596o119n641
6135A090l669K379l65M923L82j042N812K384j944j363m06l820M980M663n640p412
6119I52o451l170m059m778L685N133j009k455N270L080O362L612r64q411j178
6104d381M973N322K524N483k211l625l96p92m898L115l99q464o275o01o55q13
$$ y = [8191, 303, -2424, -4431, -800, -300, 1254, -100, -1016, 1299, 2206, -10470, -9832, -426, 3010, -5561, -3524, -6989, -4334, 1323, -277, -4951, -7827, -4042, 531, -3417, -2082, 522, -962, 5586, 8993, 10351, 8727, 306, -2521, -4141, -4362, -4478, -1007, -776, 4541, 10668, 3312, -4022, 2390, 3650, 4186, 331, -81, -4779, -8114, -7953, -10736, -6986, -9019, -4409, -4287, -13519, -8204, -1689, -7044, -9778, -9460, -7367, -2225, -1753, -8000, -15583, -11406, -11545, -11844, -4260, -486, 8157, 11694, 15944, 15446, 12850, 6731, 1090, -2579, -200, -565, 4358, 4740, 3698, 9510, 11894, 9950, 8587, 8181, 4361, 9341, 14004, 8364, 952, -5499, -8669, -12728, -17506, -13821, -8688, -9697, -12152, -6882, -3802, 2560, 6172, 5208, -3203, -4381, 592, 5914, 8438, 13921, 11710, 8085, 7689, 6897, 1999, 5114, 4715, -3749, -10024, -10625, -11280, -12093]
6088a2093J53P120Q526k51j3656k945M343L782l277J383M446l265m828R48J833
6073g781Q358J0088m740j3570M814L294l174l273r517J762O056J458k609P507
6059a327O147Q15o613k402J043K133j040J759k121m8R312N708J292n830l608l977
6043A243n99l294k751j642P89K585j686M514Q66o43k437K825j717L077M800q895
6027b965k497L350Q39j400J152K189m10o67J621N58k903l464p135J03m507K999
6011a3137R771J253j6K662J203n125j406K669m35m519j926K042p97K774K35j031
5995e783n354M503N788k29K216L902o60j1146L294L101K342O796Q09r00q799k553
5979b673M494q481K07N702N820N047q530r89K348j0792o99k259M187j790k722
$$ y = [-12093, -11940, -4820, 3706, 3455, -10201, -13146, -8803, -5021, -8298, -6915, -2469, -5734, -10562, -9614, -7781, 577, 10665, 5925, -7645, -2831, 463, -2711, -5984, -15501, -13739, -7683, -6225, -8834, -1327, 4820, 5635, -978, -3380, -2337, -204, -1244, 515, -1606, -1654, 7658, 13366, 14658, 8828, 5220, 1243, 644, -2650, -5401, -7043, -6254, -3669, -5355, -841, 25, -618, -3055, -230, -1947, 1130, 5930, -2965, -5462, -2112, -1273, -2673, -1521, 668, 258, -409, 1212, 1770, -1133, -4597, -11732, -11629, -16136, -13137, -3366, -2113, -2129, 533, 1736, -3389, -4795, -2126, -2561, -7080, -9006, -6964, -7761, -4987, -4752, -5783, -11137, -6634, -846, -1075, 1141, 5043, 4383, -6763, -3469, -368, 1974, 8770, 9579, 8679, -120, -2673, 1821, -6660, -6453, -751, 5069, 10116, 1586, 597, 2945, -7847, -8546, -10805, -6618, -8408, -11130]
5964a1130J346n526L121O58J101J405m144l173J682m3l693K063R676M041k906
5949e522R53J531L468J242q61K315M188K593n037j136L006j053m814n165L459
5934h33J095r053j0215K574N615R421j474O63k370k499K253P57J85j460J456l91
5918d276K565K405K800k233n158j739J795L429M265m356m089q10J2395L000p494
5903B499m093N283o185J289K097p39k682m747q7K133k624q09R33J983M833J391
5887D75k182K576M686n511m491N141M797R1k099J634k995m360J497j303M066k175
5871a53n882M673j999m05M222l511l037M577K658K366L68k676p190k7R92k438
5855g462R60l956j278M657l684J914K034m25k031p4o354j188j734L372M239j542
$$ y = [-11130, -9784, -15310, -12189, -11531, -10430, -9025, -13169, -16342, -14660, -14703, -18396, -16333, -6657, -2616, -5522, -4569, -3038, 430, 1672, 811, 3126, 7314, 9907, 4870, 3734, 6740, 5687, 873, -4292, -833, 262, -8791, -19006, -16432, -10817, -1396, -2870, -2207, -4577, -7076, -4823, -4066, -3881, -5341, -3885, -4276, -1711, 694, 3494, 1261, -3897, -5636, -3841, -412, 3853, -503, -4592, -5402, 6993, 9993, 2499, -1594, 3689, -2496, -1207, 890, 151, -2531, -7278, -7365, -5232, -7856, -8665, -7732, -5749, -916, 475, -1707, 869, 5555, 44, -4447, 694, 5491, 5582, 3483, 5117, 2122, -2238, -741, -2044, 2022, -153, -6035, -1362, -3361, -3766, 456, -3055, -6092, -1515, 1143, 3509, 3877, 1201, -5989, -6016, -5024, -7462, -6502, -10458, -11736, -7079, -10763, -8849, -6815, -7240, -9271, -9345, -15699, -16887, -18621, -15249, -11010, -12552]
5839a2552l979M709M959p939j909M124L671K033k634k258M264M360k739Q210L563
5824E883n512r051k156J145j14O253Q211P161k044o98k763L60q159p673J211N027
5808b919j458q029k216Q516k605j689R889K144J163J596J05M67l816l179j678
5793c709n05k173n882K027O115m35L063K888J073m800k672j129K471J636L962
5778A930q23o912M386j698M825q0K475k757l139k667n485o233L82L556N265J2761
5762E786N365l609n348o661M436L86l923k375j299K694M428L525J100k360m765
5747b620K15j550j977j311L859J365p867j735N598K774j699p3k348J596J358k640
5731g055L159P625L933l584p390m685r60M575L532K839n5p878k047J349M224M317
$$ y = [-12552, -16531, -11822, -6863, -14802, -16711, -12587, -8916, -6883, -9517, -11775, -7511, -3151, -5890, 2320, 5883, 371, -8680, -10836, -9691, -9805, -3552, 4659, 11820, 9776, 9078, 6315, 6675, -1484, -9157, -7946, -2919, -4377, -12406, -14622, -6106, -8711, -10400, -511, 1633, 2796, 4392, 4497, 4964, 1148, -2031, -3709, -4214, -6387, -12269, -10242, -4127, -4562, -1499, 1389, 2462, -2338, -5010, -6139, -3668, -2032, 1930, 1107, -5805, -1419, -3117, 1708, 1628, 4103, 1346, -1793, -4460, -9945, -16178, -15796, -12240, -6975, 5786, 11151, 7542, 2194, -4467, -31, 355, -3568, -5943, -7242, -4548, -120, 3405, 4505, 2145, -2620, -2405, -3955, -5932, -7243, -3384, -2019, -9886, -11621, -6023, -3249, -4948, -5021, -7369, -5773, -4415, -7055, -3896, 3729, 7662, 4078, -3312, -7997, -8957, -4382, -850, 1989, 1934, -5944, -7991, -6642, -2418, 1899]
5715A899M88o548n883n881K019O709J949l557J220R973K82j468n051q604l678
5700a6131M034n33k64J969N865O285l171K487N64n596k289J325N532O660q476
5685a739n560M905K175j216j2235j713Q364r14K356p84K871l950K889K694P586
5670E729j716l151J632M647l71n436L541l3m756L052p71p864P23O520k792N379
5654D333l094n082N969l49r763k933l805J611M618J440M115M859O35L592l910
5639B236j0288l005N672M586L120L583k052M06j701p555N850N469l154o728P88
5624b773K591J164p091K81L82L294Q85k862K395J476m257j3412k822O345K772
5609a1632j42n393m20Q918N503N356n424p632Q07N570o09n33j507N702k211k284
$$ y = [1899, 2387, -4161, -10044, -15925, -13906, -7197, -5248, -8805, -7585, 2388, 2670, 1202, -3849, -12453, -16131, -12097, -12630, -12894, -10925, -5060, 1225, -1946, 541, 1105, -4491, -6780, -5455, 77, 6737, -1739, -7299, -2394, -219, -1435, -13670, -15383, -7019, -7933, -5577, -6361, -3490, -7440, -4551, -1857, 5729, 4013, 862, 2494, 7141, 6770, 1334, 4875, 4842, 86, 3138, 2367, -5497, -4774, 1746, -1046, 4333, 1239, -3843, 2126, 1777, -7986, -10919, -14724, -13113, -8495, -7055, -2940, 1919, 2554, 6146, 2236, -8052, -11057, -5385, -799, 2321, 5904, 3852, 4258, 2557, -4998, 852, 6321, 3167, -3561, -2773, -182, 982, -6109, -5828, -5446, -2152, -1267, -4129, -1734, -258, -4515, -17927, -20749, -14404, -11632, -11774, -17167, -17587, -8669, -3166, 2190, -3234, -10866, -10059, -4489, -5098, -5631, -7138, -1436, -3647, -5931]
5593e931j641l797L975l315m508O99j0067J751O429P350j871K041l805L77L140
5578i173j535K42j217r88k7P773R49O410n173m870n63m54M78M083k872o631J544
5561a2024M234M334K911J923m161j560j524J852K82O407N713k511l044k74J084
5546C642l174j223Q047k712o943n650q91L738L808N767j350l163J692L311m036
5531H63k481k063n743K68k931k39J599K727l361J565P894N769q41m07j2119k188
5515a1688M227N221L531R1n430K597M591K367n363k287L72j713q232P28M141k713
5499i560Q57j261J358m498K671O569j677n508j661K853L539J856o78K061j867
5484d946j473m588J818O107m479n444m619P077N973j319N58J018N35n560Q37P74
$$ y = [-5931, -7572, -11369, -7394, -10709, -15217, -14518, -24585, -22834, -16405, -9055, -10926, -8885, -12690, -12313, -9173, -10708, -10466, -11683, -12671, -12698, -4925, -3976, 2434, -2739, -7609, -8172, -8626, -8148, -4065, -6937, -13568, -12024, -7790, -3456, -545, 1378, -2783, -4343, -5867, -4015, -3733, 2674, 8387, 5876, 2832, 2558, 3642, 468, -755, 7292, 4580, -2363, -8013, -8904, -5166, -1358, 4409, 3059, -104, 1588, 4899, 863, -1618, -3681, -9424, -9156, -12087, -12326, -10727, -8000, -11361, -9796, -1902, 3867, 3026, 2619, -9500, -11688, -7461, -2240, 1291, 1382, -4048, -1451, 3140, 5507, 144, -2143, -1771, -3484, -11716, -10988, -6847, -9560, -8703, -9964, -8606, -13104, -10433, -3864, -5541, -11049, -12710, -9857, -6318, -4462, -5140, -3079, -4946, -6419, -11007, -9189, -3082, -7561, -13005, -17624, -10547, -4574, -5893, -5335, -4317, -3782, -9342, -8505, -7731]
5468g731o815k160L944J2899R313o710j0360j1757N9N857l57L80L240J55o05J74
5452a0474M0Q404J495k318r623m082k151N616N035L263J921J718l592o38J271
5437d115o865L826N944L78Q63K015q71j163J214l800K057l297K47J0532M497m736
5421F726n107l326J251o85j475j099K30L26J470N94l440J423L415J915r21o524
5405e227p397J926N178N71l766l811k914j681N730J785L639l37k979J779K086
5390e418l030P34j892K987O745J982L166o83p057l11N128Q44L730m099j259k717
5374a150n975L68J867Q70J019J930J39l990j115n031l22j412m901j156N747L836
5358i276L271P361l342l130L460K597L932N918l092q377l396R488J96k070n247
$$ y = [-7731, -14546, -16706, -12762, 137, 9450, 2740, -7620, -19377, -19318, -13461, -13818, -13438, -10198, -10043, -10648, -10474, -10434, -2030, -535, -2853, -12476, -16558, -18709, -13093, -8058, -4795, -2874, -1156, -4748, -5386, -4115, -10980, -7154, -1210, -832, 31, 2046, 1175, 12, 1226, -2574, -517, -3814, -3567, 6965, 11462, 6726, 1619, -1707, -456, -1141, -2616, -3715, -3485, -3159, -1689, -1095, -4535, -3112, 303, 2218, 1297, -5227, -12624, -10698, -5520, -4949, -8715, -12526, -15440, -17121, -11391, -9606, -5967, -6304, -9283, -7504, -5418, -8448, -7714, -9606, -6619, 126, 2108, 5274, 4591, -2466, -2777, 2351, 3195, 6925, 2826, 1567, -1150, -7125, -6757, -4890, -4020, -3001, -1071, -932, -4922, -6037, -11068, -11390, -12802, -17703, -18859, -13112, -9276, -6005, 1356, -1986, -5116, -1656, 941, 4873, 10791, 7699, -678, -4074, 5414, 5610, 3540, -1707]
5343a707k635N758j0303K19K690J31Q88p22K677m76j729o811j412M846p26o419
5327a5731J779P394J998K096N590M166k973Q13k619m36O07j321P477M345l154
5312A0031l817M337P447j149m966k566k466n582M80K736n346K518K878n779l105
5297d349J821M347q56j061L527j540rK860l489j530m161J08l359n34L187M525
5281e13M138m052o790R267K450k831K038J100l699l688K504L112q851j858J2107
5266D434k235l437j376P96K214R43l988K930k749p37J210k112O03J429o020k951
5250a1046L344k378j490L825K039N362N634k657n250l75j951R91N476l598K28
5235a846N480j806q06N57J642K909Q00O857j741l247m328m592l060o667N30M344
$$ y = [-1707, -4342, 1416, -8887, -8668, -5978, -5847, -4959, -5681, -3004, -3480, -5209, -12020, -13432, -8586, -9312, -15731, -13952, -6558, -4560, -2464, 3126, 7292, 4319, 5132, 2513, 2077, 2684, 1363, 8840, 13185, 10031, 6214, 10551, 17998, 16849, 11883, 9317, 6851, 1269, 1749, 4485, -861, 1657, 4535, -1244, -4349, -2528, 1819, 963, -98, 3429, 1889, 1880, 4740, 1251, -279, -4440, -4332, -7691, -8225, -5038, -513, 3625, -427, -7217, 2050, 4500, 1669, 3707, 4807, 1108, -2580, -76, 3036, -5815, -7673, 4434, 2199, -1238, -2614, -1818, 396, 1339, -2649, 281, -2468, -3205, -1995, -4107, -3504, -2075, -8095, -11046, -7702, -10080, -11570, -7745, -5706, -344, 5290, 2633, -2617, -2992, -4943, -3952, 1524, -2074, -1846, 3634, 1828, 1022, 1579, 3221, 6130, 6930, 13787, 12046, 8799, 4471, -121, -3181, -9848, -9318, -4974]
5219d974K812N592Q32p701k886M914k545m623m52k086N252J1573n452Q2p37k057
5203b456L611L525p73q347J225n526m702J60J058O300j421j662M709R78j680L746
5187a255N717J414j120p513q82N616L82j0878k219L728O839J257k974l276J449
5172c715O972k338l840k651o437J690P51L87J078N31q68P684K788l46n262J188
5156b388K297J906K777M323j635l828o701j304L987M551J896o864j612K136k167
5141b626k432J624l014j070J785L35M059J549n401m959J021N553K695n452k918
5126i251R031K748n883j603k333k735o27k245J066k96M300K886m542n710K079
5111a3115o105O713O318K879m62k702N34m591K073j889l63L442j60M536J188n4
$$ y = [-4974, -2162, 3430, 4262, -3439, -6325, -1411, -3956, -8579, -9031, -11117, -5865, 5708, 256, 338, -399, -2456, 1155, 4680, 3907, -4440, -3215, -8741, -13443, -13283, -12225, -5925, -7346, -9008, -4299, -3321, -5001, -1255, 4462, 5876, 4756, -2757, -3639, 1977, 2359, -8519, -10738, -7010, -171, 1086, -1888, -5164, -3715, 3257, 919, -2921, -5572, -12009, -10319, -9568, -9181, -8103, -7572, -8440, -756, 2032, 1686, -3576, -2388, -91, 1815, 4592, 8915, 7280, 3452, -3249, -4553, -566, 3985, 5881, -983, -2595, -459, -2626, -5058, -3434, -6448, -7518, -5733, -5398, -1339, 210, -5191, -10150, -9129, -3576, -881, -6333, -9251, -220, 2528, -3355, -4958, -7291, -10026, -10653, -12898, -11832, -12128, -7828, -4942, -9484, -15194, -13115, -19220, -12507, -6189, -3310, -3772, -6474, -5940, -10531, -8458, -10347, -10710, -7268, -7428, -2892, -1704, -1758]
5095a758j397k719K438K302m723k305L810M638l798P42K318j211m985J280M019
5080a349M87K331j855p04L7n130R67l30L261j545r041K933P923Q883o227j1944
5064a1303N526M975K771M899L578m475q515m530m171J507O175Q04q636q006j212
5049b0613J2098M094L78l507j388n277j581J708L895J2884p45m007n169R383M433
5034F586J268m893n316m413k174Q09O781O040L081Q38m261k995Q260K453r384
5019B680l235m362q07K531J057P643L916o746j0420p098K700M630N080k958q124
5004a3513P557L494j532n765L414J847L742M446M819l722r93k258m450K674L07
4989F7k596q40l258j0922j073K204J935m080M856j171N324L280j024J559L191
$$ y = [-1758, -3155, -5874, -3436, -1134, -5857, -8162, -4352, 286, -3512, -2770, -452, -1663, -6648, -5368, -1349, -862, 1469, -386, -1090, -1053, -6183, -5216, -5546, -2285, -3830, -12871, -9938, -2015, 6868, 641, -11303, -5777, -802, 1969, 6868, 10446, 5971, -2544, -7074, -11245, -9738, -3563, -2759, -11395, -19401, -20613, -8515, -4421, -4043, -7550, -8938, -14215, -15796, -14088, -10193, 2691, 1946, -2061, -7230, 2153, 6586, 7854, 2961, -2355, -6768, -8942, -8133, -1352, 4688, 7769, 8607, 4346, 1351, 9611, 12064, 2680, -555, -4917, -5724, -3193, -2136, 5507, 9423, 2677, -7743, -14841, -12141, -7511, -2431, -5389, -13513, -5956, -2462, -3994, -9759, -6345, -4498, -756, 3690, 8509, 4787, 3794, 1536, -2914, -240, 67, -2529, -3369, -6627, -17549, -18622, -16418, -14483, -18563, -13707, -14878, -9554, -6274, -7298, -5739, -2548]
4974b548p382q514J638N477M139P316P186R30l05k472m555p64L753n273p489l77
4958i240P439j576L298J324k212L063k175l153M144K67N702M00m974L781O460
4943A2548k078j0184j294K040j612K28Q42K937n63l747n759k644l523Q176L651
4928i82k155K115k853J347k426j68K30P63M469N541k229n365N380M355o752R79
4912B249k132L772o364k935K423M796j341l343l491k776Q206L928K222K522J075
4897H811k729j503J886J138K084K369l110o347q708j963L21O46p230L722P188
4882c425k146o907n739L084O672J448K985N110j561L749M92m139n645o749j061
4867a3832J1894J1101J271j0297m076o4l802K370J586Q76N512l189J2K745l291
$$ y = [-2548, -9930, -18444, -16806, -11329, -7190, 126, 7312, 8242, 7937, 5465, 910, 146, 3899, -1374, -8863, -9240, -1801, -3377, -79, 1245, -967, 2096, -79, -3232, 912, 1179, 6881, 7281, 2307, 6088, 12548, 10470, 286, -1008, 1032, -580, -352, 490, 3427, 2864, -883, -6642, -9286, -12809, -4633, -982, -3137, -1022, -3875, -2528, -4954, -5122, -4892, -4129, 340, 5881, 3652, -1713, 3667, 8022, 1270, 2249, 117, 3889, -2475, -5410, -2987, 1809, 468, -2875, -6366, -9142, -936, 2992, 5214, 7736, 8811, 6082, 4579, 6465, 7603, 9687, 12056, 8946, 2599, -6109, -8072, -7751, -7105, -14335, -10613, -3425, -5571, -12478, -18217, -15133, -8461, -7013, -4028, 1082, -479, 3270, 3762, -377, -6022, -12771, -13832, -1938, 9163, 10434, 137, -3939, -4003, -7805, -5435, -3849, -2973, 2539, -650, -638, 2107, -1184]
4852a184J123L80q66k034j994J621P188J443k046K387J710k236o444q928P718
4837b162N707L540k841n643j96K228L265J365K024p51n396M182l763q252J932
4822d761J1204N798L616q12n927r289l780n625L233O317j816l283O737M174j825
4807C961k468m017n37j194K092P617N688K139n747m75o404l972M916m489M679
4792A789L303N921K815O50k241o056p445j83M163K387K904N632k286k847k382
4777F124j726q673o944l963l846L411O287L903Q57k339K855Q125L839L491n69
4762A0832J024Q12k609l247o944m161K009k620j69J670J648k666N266M19k970
4747a706J122J078K023k735m567p085O868M771j857N87R46M861p88m739n153Q12
$$ y = [-1184, -61, 319, -547, -2581, -4575, -2954, 4234, 5677, 3631, 6018, 7728, 5492, -952, -9880, -2162, 3545, 7085, 4244, -1399, -1595, 633, 3898, 5263, 7287, 6536, 1140, 5322, 1559, -6693, -4761, 6443, 12241, 15857, 15045, 9118, -171, -3951, -9576, -6343, -26, -1842, -5125, 1612, 5786, 3961, 1493, -2524, -3061, -4255, -2163, 5454, 11142, 13281, 7534, 7059, 655, -3317, 1599, -2890, 1789, 5092, 11013, 13828, 14478, 12237, 6181, -1264, -1447, 2716, 5103, 8007, 13639, 11353, 8506, 6124, 4398, -4275, -11219, -15182, -19028, -15617, -9330, -5427, -4570, -6909, -4054, 4071, 7910, 11401, 10832, 11856, 12668, 10059, 6812, -132, -4293, -2284, -4904, -5073, -3403, -1755, -4421, 845, 1264, -1706, -584, 494, 2517, -218, -4785, -11870, -5002, -231, -2088, -1501, -555, 4306, 3518, -1221, -6374, -5562]
4731e562P228r2l721l275M62l23n209L823M18k353P534M457n235J800k059R07
4715a200l324l996L376K946m323o887o39J390L400M692M351L632J816M045O26
4700I905r430N77j721N381L652j961m42l385l260l226m320j455K451P572M71M197
4684E006k494j341O056l587q048M738M053j18J442j378m738L040J041K675J562
4669G909p286Q95k25l058K549K74j717l77k503K56K255n91Q264K285k266k41l453
4652B970k503k151j2328j764P430l055N687O609L905j89j675n884k009P773L68
4637C184j16l563J799L681m891q240j256K877j837J444K421R353j700J705J531
4622F392K30m632j707k162J941J569M941n62j763k251j283M063n501L804L634
$$ y = [-5562, 1666, 1574, -2147, -5422, -4960, -5283, -10492, -6669, -6251, -8604, -1070, 3387, -1848, -48, -2107, -1200, -4524, -8520, -5144, -2198, -6521, -13408, -14047, -12657, -9257, -4565, -214, 3418, 5234, 9279, 9905, 475, 1052, -669, 4712, 8364, 6403, 5961, 2576, -684, -3910, -8230, -9685, -7234, 338, 809, 5006, 2512, 1171, 7227, 3640, -4408, 330, 4383, 4265, 5707, 4329, -409, 2631, 3672, 6347, 7909, 623, 1518, 1293, -1765, 784, 1058, -659, -1036, -3539, -3283, -1028, -1619, 6645, 8930, 6664, 6423, 2970, 467, -1684, -14012, -15776, -8346, -11401, -5714, 895, 4800, 4611, 2936, -2948, -4957, 2816, 3184, 3068, -495, 1304, 4985, 94, -8146, -9402, -6525, -8362, -6918, -4497, 4856, 3156, 4861, 6392, 6622, 1990, 283, -1879, 62, 1631, 6572, 6010, 4247, 1996, 713, 4776, -725, 3079, 6713]
4607F713j727n390n915o038L35Q910J866j430J040M491q09m216o739L246M161
4592a502m375p10j48p100N510L443Q204k151P40P827M046k201K785o956k206k277
4576B929k808k16m488L225P008k243M075j315k157j0428j190m059K948M834M270
4561C85M318l554m909k228k633j50O095n800k735O977Q171J319m636Q18n412j272
4545e246j5K146L261K706k669q05L48K49J518O136n60k400o84k34N270N542o043
4528H520J824J425q586n439n775n252l423L522P355J0397N156j2275n640j468
4514i659l248K914Q430p70o225m143M984J4870J27l290N27l631l520L426RQ32
4498A633N189N457M457m917o808l374K762j838n064J121O701J1026o148o495J276
$$ y = [6713, 4986, -404, -6319, -12357, -12022, -3112, -1246, -2676, -1636, 2855, 2046, -2170, -8909, -5663, -1502, -5877, -6587, -6735, -13835, -8325, -4882, 3322, 1171, 1911, 9738, 13784, 11583, 14368, 7412, 5206, 2929, 121, -95, -4583, -1358, 5650, 3407, 7482, 6167, 4010, -6418, -7608, -11667, -8719, -3885, 385, 4703, 1149, -3760, -5988, -8621, -8771, -2676, -8476, -11211, -4234, 3937, 5256, 620, 1438, -3974, -5246, -5261, -3115, 146, 2852, 183, -622, -274, -25, 1493, 7629, 7069, 4669, 3985, 3751, 9021, 14563, 8520, 10344, 11769, 3183, -2256, -8031, -13283, -16706, -13184, -5829, 4568, 9724, -2551, -8191, -9659, -12907, -9993, -1563, -2333, -8558, -12701, -7717, 7153, 7280, 3990, 4517, 886, -2634, 792, 801, 1633, 6822, 12279, 16736, 11819, 5011, 1637, 4399, 2561, -2503, -1382, 5319, 16345, 10197, 3702, 4978]
4483D978k110J544J876L360l145o314l89K749k587o801o565K964O581k811O356
4468c14J564o81o250m304K359j808m123J436R29M342J980J218L798K07J552o632
4452d727o018K502Q060J395j945M638P087p437n290l570r41R005k885j905N974
4437C943M92r300o189q24O133R512m688j01j706m818O289J941n861l897q01M56
4421i419P479Q74m480q56J584M256j311j586m505M744M064M367J668m088J078
4406C869k866n203k472j261K677o55o857k689J382K017M225Q916M652k947k04
4391B584n550o489L581M145j930j552J141K392l244n23J285N528k483L351m52
4376A784j347m138r461k070P563L765q09l70K76L994L362J03r176k20N142R576
$$ y = [4978, 2868, 4412, 6288, 9648, 6503, 189, -200, 2549, -38, -6839, -13404, -10440, -3859, -6670, -314, 1250, 569, -5681, -9985, -7626, -9434, -13557, -12121, -11192, -6850, -4870, -3652, 146, 353, 1905, -4727, -10745, -8243, -183, 1212, -733, 3905, 10992, 3555, -1735, -5305, -6246, 2759, -126, -2031, 3943, 4435, -4865, -11054, -11878, -5745, 3767, -921, -1022, -2728, -7546, -1257, 684, -5177, -9074, -9875, -9419, -1940, -1066, -5546, -6402, -4818, -562, -1873, -3459, -7964, -3220, 844, 5211, 6879, 2791, 3869, 1003, -4200, -6672, -7933, -5256, -5911, -12768, -15457, -14075, -12058, -7833, 1083, 5735, 2788, 2584, -2966, -9455, -5874, -1729, -3659, -5211, -4070, -1678, -4922, -5445, -4160, 1368, -1115, 2236, 1784, 437, -3701, -13162, -15232, -7669, -3904, -4713, -5083, -4807, -813, 2549, 2652, -6524, -6744, -1602, 7974]
4360G974M56r934k465q30K354k137J048l132n603J711n8J265M296K676o96O454
4344C379r14n791n199J46n589L315M923M435m88J554m234O455P816k662j390n914
4328a58k549M758J870j741K837P79M640p98M181l947q410k248l466J506P856J762
4312F872p046k123J720L330K477j575j146K723k048j319r084m027N409L461L854
4297A478r96N418o35N88m979o132Q063N318j559n266l382j196L045p23j397L605
4281A250O213k148j712o018j461j00J44o94O3M772m900N442J26m609m71M586J280
4264A763p190j577m676k631N51K307Q800L181k872l521M260p9m206L95N784L408
4248C697o609m729l32j706o09J885K633M032q77j0721k963m6J860M795M285K737
$$ y = [7974, 8430, -1504, -3969, -4799, -2445, -4582, -3534, -6666, -12269, -10558, -10616, -9351, -5055, -2379, -3075, 3379, 2465, -3326, -8525, -8379, -13968, -10653, -5730, -1295, -1783, -229, -4463, 1992, 9808, 7146, 5756, -158, -2707, 2051, 3921, 2180, 5017, 5796, 10436, 9638, 13819, 9872, 1462, -786, -4252, -2746, 5110, 6872, -174, -2297, -577, 2753, 5230, 3655, 2509, 5232, 3184, 1865, -7219, -11246, -5837, -2376, 1478, 482, 5900, 5265, 5853, 874, -5258, 2805, 8123, 6564, 1298, -2084, -3280, -235, -958, -2355, 1250, 7463, 5315, 3603, -2415, -3876, -3976, -3832, -4526, -4463, 309, -4591, 851, 977, -3632, -4103, 483, 1763, -5427, -7004, -11680, -14311, -13760, -11453, -2653, 528, -2344, -5865, -1605, -1684, -5890, -5495, 289, 3697, -2912, -7641, -7973, -9679, -10288, -8403, -5770, -1738, -2615, -13336, -16299, -16345, -14485, -9690, -5405, -2668]
4232b668n09M402m117Q54K144l223o707J323N037K56k166L123K40P075m974l111
4216c021K32k034K56K313Q305k772o146J279j052L263M497k524K584J708l183
4201C705J191j44L78R68m843K387l094l609P831R6n621P800M101j724J368O19
4185A1409o611k724K688q472k749k005K859O872N863N72r860n532P616K396m963
4170b641N77M736l805m935R63N825j081L688o790o286J682q86m750K647J0403
4155f53M26n156L608j023k745j761m010Q930k630n126K471l630l153L991Q321
4140b140N701L910n13j544l816k993M174P26j497k58P346O600n14j73j2481j1127
4124h599M100R185K083p92q445n368K828O353K397k65l884R23k22J326K055J623
$$ y = [-2668, -3177, 1225, -2892, -2038, 106, -3117, -9824, -8501, -3464, -3208, -5374, -2251, -2011, 5064, 90, -3021, -2789, -4823, -4567, -2254, 6051, 3279, -2867, -1588, -2640, 623, 5120, 2596, 5180, 6888, 3705, 4896, 4752, 5130, 6098, 1255, 3642, 548, -3061, 4770, 4866, -755, 7045, 11146, 9422, 10790, 11409, 4798, 2074, 4762, -3710, -6459, -8464, -5605, 1267, 7130, 7702, -2158, -7690, -74, 2322, -2641, -2064, 2672, -1133, -6068, -5105, 720, -361, 3327, -3463, -9749, -8067, -8953, -13703, -11056, -653, -227, -5383, -1775, -2798, -5543, -7304, -11314, -2384, -5014, -10140, -7669, -11299, -14452, -10461, -2140, 3561, 7471, 6958, 5414, 1598, -1395, 2779, 3505, 2008, 1750, 9096, 15696, 15182, 15009, 2528, -8599, -4499, 4686, 6769, 5977, -2468, -7836, -5008, 1345, 3742, 3477, -407, 516, 294, 1620, 3675, 5298]
4108E298p615M754K514j646n715j274J015J0797l32m991J673Q55p409j294l466
4093f836l03P000J472N92K759j329k769l155J43Q959K389j0226O1K557Q408L725
4077A3447j648p48k678j733j233M183J584l545n39j628n166k364k834L651L173
4062A922L224J455k12k391N25J728o26o547j416m78q244K311M722R439L23J547
4046G282J209o79J521k654l454n810j868N535K364J260k011l962N039P360o434
4031D698L761j921j856o13k762N731l155q698N872L2p133n239L292M401R119M107
4015I636p966n263O03K246J013K68K310J891p296p089j089M300L295q26k068L262
3999b773J116k797M652L001M542m879k250o479j765J0497K76O149M86p141o080
$$ y = [5298, -2317, 2437, 4951, 3305, -2410, -3684, -2669, 8128, 7796, 2805, 4478, 5333, -2076, -3370, -6836, -7139, -139, 1333, 1925, 4684, 3355, 586, -2569, -2426, 6533, 8922, -1304, -1243, 1314, 9722, 13447, 11799, 11051, 8373, 6640, 5407, 9590, 11174, 7629, 7090, 5462, 296, -2068, -4902, -1251, 1922, 5146, 6601, 6389, 3998, 4523, 6251, 5625, -922, -2338, -2816, -11060, -8749, -4027, 5412, 5735, 7282, 8491, 7812, 9333, 6679, 3225, -2585, -4453, 1082, 3446, 4706, 2695, -1267, 3772, 11132, 4698, 8459, 6538, 4682, 4069, 1307, 7038, 3883, -4815, 1057, 1089, -6044, -11283, -7991, -3590, 5529, 9636, 1670, -3593, -2990, -744, 269, 537, 2847, 4738, -2558, -9647, -10736, -6436, -3141, -3967, -6035, -2773, -1657, -4454, 198, 3199, 7741, 2862, 612, -5867, -7632, 2865, 3141, 9290, 9776, 2635, -3445]
3984c445J684J307J706Q5K014m256L456l30j29j640M29o587N163O259L672o20
3968H768k384j775m470L502j58m415j162n483l400l012k86M384M696r26n342o51
3952a2114M673K894K847m139K963P73k178n985J768J204l13J0608k438o786r93
3937g216R62N465P17j854M182k963k611J855Q17J127p732J584M166l948j793N3
3921g189L682m310J321K583P580O643o837p071J255P10l615k798J27k210J95R18
3905i016j019K418N826J052J788O087L672n503k695n910l591O795K724o965j596
3890e933K78P045O256l680q823o070m897J407l02P479N184K379K026k175n23j918
3874b267p36K554K130n933J227q066l2o552P46P454K235K473l437j570j043M622
$$ y = [-3445, -1761, -454, 1252, 1337, 3351, -905, 2551, 2221, 2092, 452, 881, -5706, -543, 5716, 9388, 8768, 6384, 4609, 139, 3641, 3483, -932, -2094, -7577, -10977, -13989, -14275, -9891, -5195, -6121, -11463, -12114, -7441, -4547, -1700, -5839, -2876, -2103, -4281, -10266, -8498, -7294, -7607, 3001, 563, -6223, -7216, -6254, -789, -72, -1926, 2256, -707, -3318, -1463, -646, 481, -7251, -5667, -1501, -5449, -7242, -7189, -3507, -7817, -6496, -3913, 3667, 10310, 3473, -3598, -2343, -1633, -5248, -8046, -7919, -10129, -9934, -9016, -10035, -7617, -1791, -739, 1049, 7136, 10808, 5305, 2610, -3300, -6891, -96, 2628, -4337, -5933, -5655, 1390, 7646, 3966, -4857, -10927, -15824, -14417, -14719, -7240, -2056, 323, 2349, 174, -349, -2267, -3003, -449, 1681, -4252, -3025, -11091, -11123, -17675, -16929, -9475, -7240, -4767, -8204, -9774, -10817, -6195]
3858f195K47M588L744k189m795k191P569j365l382J797k486M004J734K190j07
3843C163l419j578P296O123l154m41j922n583L100l986l994J944J1041n730j1839
3828h979k416J1080N998J798N86R50m592l94K2n938k866K386o23M500K762L97
3812D671q20J898j231j27k831m551L383J0322K266p603j254l47o284o727r58O233
3796c960n679K661J1065q208k34l311m906N36N775O096L579J391m947k764K375
3781e31K36j261r05l707l944j118N799o63j45J5j53J726L330J621l231j52j632
3764d715J265p29l29P619l722p446l072N227N007L512j859p66l006o220m523N866
3748g891N101k724j116L580L382K420j36j391M582M25o74R41N767j564n364p576
$$ y = [-6195, -5948, -1360, 2384, 195, -4600, -6791, 778, -587, -3969, -2172, -4658, -654, 1080, 3270, 3163, -256, -1834, 5462, 11585, 8431, 7990, 6068, 485, 3585, -401, -4395, -2451, 8590, 2860, -8979, -11395, -315, 5683, 7481, 8067, 9017, 4425, 4031, 4053, -1885, -4751, -2365, -2988, 1512, 4274, 4671, 3851, 5749, 4518, 4391, 1560, -2991, 392, 10714, 12980, 5377, 4123, 3776, -2508, -9235, -10193, -3960, -9639, -6978, 4087, -4121, -4355, -7666, -12572, -12036, -6261, -165, 3414, 4805, -142, -2906, -531, -295, -1556, -2461, -6168, -10112, -11230, -5431, -6094, -6239, -6224, -6377, -4651, -1321, 300, -2931, -3083, -4715, -3450, -4179, -4508, 3111, -611, -8057, -11129, -5902, -895, 2617, 758, -8, -3014, -9234, -13757, -7891, -2790, -5514, -6630, -3050, 332, 2752, 2616, 1225, 5807, 6232, 5558, 6499, 12266, 10702, 5338, -2238]
3732b238k348J136k684J557m199M24M775O547o301j2435K545N253L384l350j48
3717h082P88K179R67J624j801o576k81l434K301N558L531J354n83P441p87n203
3701a004k167J416R72P851J221j145k098n597J363M197l683n035k352m181K549
3686g693j378O44N297N164L004j417O25k23j141j422J73l115l84J118k722m192
3670g662k928Q032j067R08L854n924J931n671j833K474m691K499R479R187m541
3655D047r286j945j235J278L514m575L936n75J039J1751j428P71l133l526p044
3640f411l67j468k93M17K041L418J272m269K233O446J034K691k7o911m515L234
3624a475L028j71n45P241L292J41k610q400n474l850K952N146K745K610j745m670
$$ y = [-2238, -4586, -3450, -6134, -4577, -8776, -8352, -3577, 2970, -3331, -15766, -13221, -7968, -4584, -7934, -8082, -7294, -5115, -4148, -2524, -4325, -10901, -11182, -14616, -12315, -6757, -3226, -1872, -2455, 4986, 4199, -1004, -3171, -1755, -783, 7068, 8289, 7144, 5046, -551, 812, 5009, 1326, -3709, -6061, -10242, -7693, -9071, -8427, -3130, 2034, 5038, 3621, 4246, 4023, 2882, 1460, 1633, -1482, -1866, -748, -3470, -7662, -10590, -2558, -3625, -2717, 1137, -4787, -2856, -8527, -10360, -7886, -12577, -10078, -599, 8588, 4047, -5239, -7184, -8419, -7141, -3627, -8202, -4266, -4841, -3802, 7949, 6521, 7292, 4159, 633, -6411, -6778, -8246, -8539, -8122, -6081, -2663, -1391, -5660, -3427, 3019, 4053, 6744, 6717, -194, -4709, -1475, 1553, 1382, 837, 8078, 11370, 11511, 8901, 501, -4973, -8823, -5871, -725, 2020, 4630, 2885, -1785]
3608a785l064M048k156J622l623L430P357L760J065o395k106K590O065M576n713
3593I671n245j949r78L244J430m250k941j91mo999l655M523N519J109J212m412
3577c916n064N530O12j574L952L242l82l658l759o251j050L858L590m089l429
3562a2388J384J922N130j48p57K320j313K160J230K981J197N753N22n157j356
3547C480k810m056l746m54K601O431l933M622n079n217J1246J1597O66l485n658
3532F205j708l545j974m6K246L291J009r803j544J1675O412l962n301m11j331
3517A213K050j607N377R702K093L63m857L89m820o524l9j239L309j441R66Q27
3501E762K308j274j746o543J965K871r8l895j484M870O267J431n720j872n406
$$ y = [-1785, -4849, -801, -2957, -1335, -4958, -1528, 5829, 9589, 10654, 4259, 2153, 4743, 10808, 15384, 9671, 4426, 2477, 1499, 4743, 6173, 1923, -1018, -1209, -1213, -8212, -11867, -7344, -1825, -716, 496, -3916, -8980, -3450, -2838, -4412, -460, 2782, 2400, -1258, -5017, -11268, -12318, -8460, -4870, -8959, -12388, -11004, -9082, -3952, -4100, -4857, -2537, -3850, -1690, -460, 2521, 3718, 9471, 9993, 4836, 3480, 670, -3386, -7132, -7586, -4985, 1446, -2487, 2135, -2944, -8161, 3085, 14682, 15348, 11863, 6205, 4497, 952, -1022, -1068, 1178, 4469, 5478, -4325, -5869, 5806, 12218, 8256, 2955, 2544, 1213, 3263, 1656, 7033, 16735, 18828, 19191, 14334, 14723, 9903, 3379, 3340, 2101, 5410, 3969, 4935, 5762, 8070, 6796, 5050, -1493, 472, 3343, 3245, -650, -2134, 2736, 9003, 10434, 4714, 2842, -2564]
3486b564j209P90N766l594k53k509J103P42J874R835J260j206o83j935m431p036
3470d050N37k599J009K765n41N803J92p70n06Q30M835j461m575K39m191r328M988
3453f823L6p755N968L320k079l338O652L621k598j38L664q03j341l562r34L541
3437b569k92K316K59J315N08j105n47L994L225J77K014j20l038p735J949N604
3421E955J623l585j314J03l98k6J48J715J05J31M923j319j1207l861R466J773
3405D232O749K682l162k532l942j562K98R28M532k386m76q735R23N31l040p53
3389e713K039n441k35J660k938O374N511N868L021k860j937o577L09L93K691j961
3373B04k991j86J470J519j902l535r73J337J91R395N398j235p088p220n787J15
$$ y = [-2564, -3773, -2983, 2783, -811, -1064, -3573, -2470, -1728, 146, 9981, 11241, 10035, 9352, 7417, 2986, -4050, -3513, -6112, -5103, -2338, -2879, 2924, 3116, 2346, 1840, 2670, 7505, 6044, 1469, 1708, -2483, -11811, -6823, -6787, -14542, -8574, -5254, -7333, -10671, -4019, -398, -2996, -3134, 530, -273, -1614, -5176, -6110, -2569, -2861, -545, -286, 1029, 1537, 432, -115, 3879, 7104, 7281, 9295, 9175, 6137, -1598, 351, 5955, 7578, 3993, 2679, 2782, 2384, 2358, 2506, 4221, 4326, 4457, 9380, 8061, -3146, -7007, 2459, 4232, 10981, 13663, 10501, 7969, 4027, 2465, 2763, 3691, 8223, 5837, 5361, -3374, -2451, -1920, -4960, -5713, -3674, -9115, -9350, -7690, -10628, -4254, 1257, 7125, 10146, 7286, 5349, -1228, -919, -526, 2165, 204, -2787, -2973, -1503, 16, -1886, -5421, -6394, -5057, -4866, 4529, 9927, 8692, 1604, -5616, -11403, -11288]
$$ [...]
##END NTUPLES=NMR SPECTRUM
##END=
