##TITLE=Analysis number 326408
Compound Code cc 62001
Book Reference 511/52
Project Code adrs
Chemist Name stevem
##JCAMPDX= 6.0         $$ Bruker NMR JCAMP-DX V2.0
##DATA TYPE= NMR SPECTRUM
##DATA CLASS= NTUPLES
##ORIGIN= Bruker BioSpin GmbH
##OWNER= nmr
$$ XWIN-NMR		Version 3.5
$$ Tue Feb  6 11:12:43 2007 GMT Standard Time (UT+0h)  MAYBRIDGE\nmr@NMR_250MHZ
##.OBSERVE FREQUENCY= 250.131544655141
##.OBSERVE NUCLEUS= ^1H
##.ACQUISITION MODE= SIMULTANEOUS (DQD)
##.ACQUISITION SCHEME= undefined
##.AVERAGES= 16
##.DIGITISER RES= 18
##SPECTROMETER/DATA SYSTEM= dpx250
##.PULSE SEQUENCE= zg30
##.SOLVENT NAME= DMSO
##.SHIFT REFERENCE= (INTERNAL, DMSO, 0, 16.522)
##AUDIT TRAIL= $$ (NUMBER, WHEN, WHO, WHERE, WHAT)
$$ ##TITLE= Audit trail, XWIN-NMR		Version 3.5
$$ ##JCAMPDX= 5.01
$$ ##ORIGIN= Bruker BioSpin GmbH
$$ ##OWNER= nmr
$$ C:\u/data/dgb/nmr/ADRS/380/pdata/1/auditp.txt
$$ ##AUDIT TRAIL=  $$ (NUMBER, WHEN, WHO, WHERE, WHAT)
(   1,<2007-02-06 11:12:15.41 +000>,<MAYBRIDGE\nmr>,<NMR_250MHZ>,
      <created by zg, POWCHK disabled, PULCHK disabled
       configuration hash MD5:
       49 4B E0 1D 92 C2 6B 37 9F E6 65 BC 52 41 86 1D
       data hash MD5: 64K
       AB 64 21 1C 93 01 EF 88 3C CA BF 3C 39 FF EA 3A>)
(   2,<2007-02-06 11:12:31.58 +000>,<MAYBRIDGE\nmr>,<NMR_250MHZ>,
      <Start of raw data processing
       ef LB = 0.3 FT_mod = 6 PKNL = 1 SI = 32K 
       data hash MD5: 32K
       6E F5 29 D8 AC B4 CE FD 3E DB 4F F8 E5 E9 B4 C2>)
(   3,<2007-02-06 11:12:33.27 +000>,<MAYBRIDGE\nmr>,<NMR_250MHZ>,
      <apk 
       data hash MD5: 32K
       C3 2C 1F BF BF 73 1A 62 6E 93 F3 5D 85 92 F3 79>)
(   4,<2007-02-06 11:12:33.99 +000>,<MAYBRIDGE\nmr>,<NMR_250MHZ>,
      <abs ABSG = 5 
       data hash MD5: 32K
       92 57 03 5F F6 51 29 10 82 27 8E CA AF 7C 19 B6>)
$$ ##END=
$$ 
$$ hash MD5
$$ C1 E4 1F A6 91 7D 19 D9 4A AB E9 59 1D F5 36 EC
##$RELAX= 
##$RELAX= 
##$RELAX= 
##$RELAX= 
##$RELAX= 
##$RELAX= 
##$RELAX= 
$$ Bruker specific parameters
$$ --------------------------
##$DU= <C:\u>
##$EXPNO= 380
##$NAME= <ADRS>
##$PROCNO= 1
##$TYPE= <nmr>
##$USER= <dgb>
##$AMP= (0..31)
100 100 100 100 100 100 100 100 100 100 100 100 100 100 100 100 100 100 
100 100 100 100 100 100 100 100 100 100 100 100 100 100 
##$AQSEQ= 0
##$AQ_mod= 3
##$AUNM= <au_zg>
##$AUTOPOS= <47 >
##$BF1= 250.13
##$BF2= 250.13
##$BF3= 250.13
##$BF4= 250.13
##$BF5= 500.13
##$BF6= 500.13
##$BF7= 500.13
##$BF8= 500.13
##$BYTORDA= 1
##$CFDGTYP= 0
##$CFRGTYP= 5
##$CHEMSTR= <none>
##$CNST= (0..31)
1 1 145 1 1 1 1 1 1 1 1 1 1 1 1 1 1 1 1 1 1 1 1 1 1 1 1 1 1 1 1 1 
##$CPDPRG= <>
##$CPDPRG1= <>
##$CPDPRG2= <>
##$CPDPRG3= <>
##$CPDPRG4= <mlev>
##$CPDPRG5= <mlev>
##$CPDPRG6= <mlev>
##$CPDPRG7= <mlev>
##$CPDPRG8= <mlev>
##$CPDPRGB= <>
##$CPDPRGT= <>
##$D= (0..31)
0 1 0 0 0 0 0 0 0 0.06 0 0 0 0 0 0 0.0002 0 0 0 0 0 0 0 0 0 0 0 0 0 0 
0 
##$DATE= 1170760334
##$DBL= (0..7)
120 120 120 120 120 120 120 120 
##$DBP= (0..7)
150 150 150 150 150 150 150 150 
##$DBP07= 0
##$DBPNAM0= <>
##$DBPNAM1= <>
$$ [...]
##$SUBNAM7= <"">
##$SUBNAM8= <"">
##$SUBNAM9= <"">
##$SW= 20.6930455092707
##$SWIBOX= (0..15)
0 0 3 0 0 0 0 0 0 0 0 0 0 0 0 0 
##$SW_h= 5175.983436853
##$TD= 65536
##$TD0= 1
##$TE= 294.16
##$TE2= 300
##$TE3= 300
##$TEG= 300
##$TL= (0..7)
0 120 120 120 120 120 120 120 
##$TP= (0..7)
150 150 150 150 150 150 150 150 
##$TP07= 0
##$TPNAME0= <>
##$TPNAME1= <>
##$TPNAME2= <>
##$TPNAME3= <>
##$TPNAME4= <>
##$TPNAME5= <>
##$TPNAME6= <>
##$TPNAME7= <>
##$TPOAL= (0..7)
0.5 0.5 0.5 0.5 0.5 0.5 0.5 0.5 
##$TPOFFS= (0..7)
0 0 0 0 0 0 0 0 
##$TUNHIN= 0
##$TUNHOUT= 0
##$TUNXOUT= 0
##$USERA1= <user>
##$USERA2= <user>
##$USERA3= <user>
##$USERA4= <user>
##$USERA5= <user>
##$V9= 5
##$VALIST= <valist>
##$VCLIST= <CCCCCCCCCCCCCCC>
##$VD= 0
##$VDLIST= <DDDDDDDDDDDDDDD>
##$VPLIST= <PPPPPPPPPPPPPPP>
##$VTLIST= <TTTTTTTTTTTTTTT>
##$WBST= 1024
##$WBSW= 4
##$XGAIN= (0..3)
0 0 0 0 
##$XL= 0
##$YL= 0
##$YMAX_a= 243606
##$YMIN_a= -273562
##$ZGOPTNS= <>
##$ZL1= 120
##$ZL2= 120
##$ZL3= 120
##$ZL4= 120
##$ABSF1= 16.522
##$ABSF2= -4.171173
##$ABSG= 5
##$ABSL= 3
##$ALPHA= 0
##$AQORDER= 0
##$ASSFAC= 0
##$ASSFACI= 0
##$ASSFACX= 0
##$ASSWID= 0
##$AUNMP= <proc_1d>
##$AZFE= 0.1
##$AZFW= 0.1
##$BCFW= 0
##$BC_mod= 0
##$BYTORDP= 0
##$COROFFS= 0
##$CY= 12.5
##$DATMOD= 1
##$DC= 0
##$DFILT= <>
##$DTYPP= 0
##$F1P= 14.0000005364418
##$F2P= -0.99999901652339
##$FCOR= 0.5
##$FTSIZE= 32768
##$FT_mod= 6
##$GAMMA= 0
##$GB= 0
##$INTBC= 1
##$INTSCL= 1
##$ISEN= 128
##$LB= 0.3
##$LEV0= 0
##$LPBIN= 0
##$MAXI= 10000
##$MC2= 0
##$MEAN= 0
##$ME_mod= 0
##$MI= 0
##$NCOEF= 0
##$NC_proc= -3
##$NLEV= 6
##$NOISF1= 0
##$NOISF2= 0
##$NSP= 0
##$NTH_PI= 0
##$NZP= 0
##$OFFSET= 16.522
##$PC= 1
##$PHC0= 218.4349
##$PHC1= 8.023232
##$PH_mod= 1
##$PKNL= yes
##$PPARMOD= 0
##$PSCAL= 4
##$PSIGN= 0
##$REVERSE= no
##$SF= 250.13
##$SI= 32768
##$SIGF1= 0
##$SIGF2= 0
##$SINO= 400
##$SIOLD= 32768
##$SREGLST= <1H.DMSO>
##$SSB= 0
##$STSI= 32768
##$STSR= 0
##$SW_p= 5175.98343685301
##$SYMM= 0
##$S_DEV= 0
##$TDeff= 65536
##$TDoff= 0
##$TI= <Analysis number 999999
Compound Code 99
Book Reference 9
Project Code 9>
##$TILT= no
##$TM1= 0
##$TM2= 0
##$TOPLEV= 0
##$USERP1= <user>
##$USERP2= <user>
##$USERP3= <user>
##$USERP4= <user>
##$USERP5= <user>
##$WDW= 1
##$XDIM= 32768
##$YMAX_p= 337095998
##$YMIN_p= -354258
$$ End of Bruker specific parameters
$$ ---------------------------------
##NTUPLES= NMR SPECTRUM
##VAR_NAME=  FREQUENCY,     SPECTRUM/REAL,   SPECTRUM/IMAG
##SYMBOL=    X,             R,               I
##VAR_TYPE=  INDEPENDENT,   DEPENDENT,       DEPENDENT
##VAR_FORM=  AFFN,          ASDF,            ASDF
##VAR_DIM=   32768,         32768,           32768
##UNITS=     HZ,            ARBITRARY UNITS, ARBITRARY UNITS
##FACTOR=    0.157963299565203, 1,           1
##FIRST=     4132.6476996994, 0,             0
##LAST=      -1043.33573715361, 0,           0
##MIN=       -1043.33573715361, -354258,     0
##MAX=       4132.6476996994, 337095998,     0
$$ Real data points
##PAGE= N=1
##DATA TABLE= (X++(R..R)), XYDATA
$$ [...]
17433c7349L0960K8386O363j9724k0839k5722J8059J6723J3281k5114j3255P761
17421b0470K8564Q011q606k5593l0853o309J8366J8618K127R054M86K3544k5430
17408h491j0040k2126m641k807j317J9899N0840j3230m1473O468J8050M60L2714
17395B4306q92k9191m926J2712j4284k0426K2169M813j0399J7540K725o916p080
17382i849J1350m018L778j76j321N734L9165j6426l1474J1489J2335M970j6711
17369H846l603q19J015k3163j2808K845J9933J7798J0933L709j269o109m90J0920
17355B7738o334j4751Rj5153R53J2388J6450K67j5296m126L1841j3640m6135q293
17341c4082K5719P196q567m702L0565k0031l1554j782J0078P553J303k2110K603
$$ plain form
17433 -37349 -6389 21997 28360 8636 -12203 -37925 -19866 -3143 10138 -14976 -28231 -20470
17421 -20470 8094 16105 7499 -18094 -48947 -55256 -36890 -18272 -16145 -7091 -6605 16939 -8491
17408 -8491 -18531 -40657 -45298 -48105 -49422 -29523 21317 8087 -33386 -26918 -8868 -8408 24306
17395 24306 23414 -5777 -10703 2009 -12275 -32701 -10532 -5719 -16118 1422 4147 -2769 -9849
17382 -9849 1501 -2517 1261 1085 -236 5498 44663 28237 -3237 8252 20587 25557 8846
17369 8846 5243 4424 5439 -17724 -30532 -27687 -7754 10044 20977 24686 23417 17308 16818 27738
17355 27738 21404 6653 6662 -8491 -7538 4850 21300 21567 6271 2145 33986 20346 -25789 -34082
17341 -34082 -8363 -1167 -9734 -14436 16129 -3902 -35456 -37238 -27160 -19607 -18304 -40414 -37811
17328c7811L0417J3660l6757K051R34j1371K299L8707J4688K8159k2181k9923
17316g128j0013l904J0170K6793K1937Q104J4675l4436l8082j5003j0605m465
17304d1957j906J3945J8746K4848P4j5181K0093K1914L714l4535j6358k5181J1847
17291a9937M991n39j6979J5561M333L918J2951J8021j3905j1095L1864m500l173
17278B1511j546J6950j5462k2470m834k7622K9452P038K24K1624J1852j7872m99
17265A8346J3611l0412k8188j388K8031K0087J9610p051j3720m206k3967k0863
17253c0110K509O054J3701p310j5113j7743K1883o947M188J2456q41J8466J3755
17240A4948m63K1509p272k5477L136P344L267m934J496K432l8811l854n995j3167
$$ plain form
17328 -37811 -7394 6266 -30491 -28440 -27506 -38877 -36578 2129 16817 44976 22795 -7128
17316 -7128 -17141 -21045 -10875 15918 37855 45959 60634 26198 -11884 -26887 -37492 -41957
17304 -41957 -43863 -29918 -11172 13676 13750 -1431 18662 40576 44290 9755 -6603 -31784 -19937
17291 -19937 -14946 -15485 -32464 -16903 -12570 -8652 4299 22320 8415 -2680 29184 24684 21511
17278 21511 19965 36915 21453 -1017 -5851 -33473 -4021 3017 3241 24865 36717 18845 18346
17265 18346 31957 1545 -26643 -28031 0 20087 39697 32646 18926 14720 -9247 -30110
17253 -30110 -27601 -21547 -7846 -15156 -30269 -48012 -26129 -33076 -28888 -16432 -17273 1193 14948
17240 14948 14485 35994 28722 3245 6381 13725 16992 12058 13554 15986 -22825 -26679 -32674 -45841
17226d5841j0781J1258K730K0314L4002M043j0967l2813N755J9938l0130k565
17214c5057P268j2307R119L787M684n498J2159K202M2400j7493j8494k0601l496
17201c1327K8773J5195m924N170K2103L4463L1424j0004l3234k7805j5778J2540
17189B6596K4061J7394j3139k5249k1526k0134J2108J1574J4706k4495m4444R014
17177c3534K3396m960m2438J1115j0208J5880L1739L1659J5689J859j8823k1181
17165A93j6455j768r486o219p354L2887Q174q212J7921j986L2975J1230J297m978
17151D8219j6085j8061J6955k6523l0111J0427k0895p208K6444K5033J1109j6153
17139C151k697J2562k4503m0377L5946L0693M812q804j3079K4183J3733l0457
$$ plain form
17226 -45841 -56622 -45364 -42634 -22320 11682 15725 4758 -28055 -22300 -2362 -32492 -35057
17214 -35057 -27789 -40096 -30977 -27190 -22506 -28004 -15845 -13643 28757 11264 -7230 -27831 -31327
17201 -31327 -2554 12641 7717 12887 34990 69453 100877 90873 57639 29834 14056 26596
17189 26596 50657 68051 54912 29663 8137 -11997 111 11685 26391 1896 -42548 -33534
17177 -33534 -10138 -15098 -57536 -46421 -56629 -40749 -9010 22649 38338 40197 21374 193
17165 193 -16262 -18030 -27516 -33735 -41089 -8202 -28 -8240 9681 7695 40670 51900 53197 48219
17151 48219 32134 14073 31028 4505 -25606 -15179 -36074 -43282 -16838 8195 19304 3151
17139 3151 454 13016 -11487 -51864 -15918 14775 19587 10783 -2296 21887 35620 5163
17127E163l2423j4358J1287L1363j0530j620M637J0002M379o897k0404J8711K9248
17114B8558K5587l0779l2835j3310j3808Q559K1053n09J482l61l004l551M424
17101h494o273J7886j6438k2525O892L2720R927N080k3217q953K511K438J8131
17088I685J2683O57j6244o254j0903N191j996O869K3579j8477j7590N758k0858
17075b7900l7916K4107K3102P100p859J3245Q503K3806K1508j9017n4511l7423
17063f3255q37O951K2598P322J8431J0412k6029j526M884J6381j175j2073J48
17050a7768k8593M787J8957J6084J461O425k0379J5355M156l0122r58J4464J9573
17037C442K2238o687k8232l2382p244p080J7476K3798K514k0982l7362K5171n747
$$ plain form
17127 5163 -27260 -41618 -30331 1032 -9498 -11118 -6481 3521 7900 1003 -19401 -690 28558
17114 28558 54145 23366 -9469 -22779 -36587 -28028 -6975 -7484 -6002 -6363 -9367 -12918 -8494
17101 -8494 -14767 3119 -13319 -35844 -28952 3768 13695 18775 -4442 -13395 -10884 -8446 9685
17088 9685 22368 23025 6781 527 -10376 -5185 -7181 -312 23267 4790 -12800 -7042 -27900
17075 -27900 -65816 -41709 -18607 -11507 -19366 -6121 2382 26188 47696 28679 -25832 -63255
17063 -63255 -64092 -57141 -34543 -27221 -8790 1622 -24407 -25933 -21049 -4668 -5843 -17916 -17768
17050 -17768 -46361 -41574 -22617 -6533 -5072 1353 -19026 -3671 485 -29637 -30595 -16131 3442
17037 3442 25680 18993 -9239 -41621 -48865 -55945 -38469 -14671 -12157 -33139 -70501 -45330 -51077
17024e1077K2390K7271J2864k3956k9419j2966L113L2406M6155j0031j8795J7952
17012A5907q355R059k88m784R666m0251J1902K0622q510J313J283r624l58k0758
16998b3176j7141K2190K5247K2704j5410N372k1857k9302k2487L3700L1453j6523
16986e230j6613J117J0613J2537p228j7613K2282L2391q070j5063l5514p57N1485
16973B4337L039l3765j5117J482J4644N159K1934j1602m4087k0942L2142K6121
16961C345o15j927p387l3431j457M1701M1524j6892n4518k7959j2469K3165M1116
16948e804L635J2043J0321l76k9981k2420K9636J9934n678K397j3901P460k333
16935D933K006J5800N264j9279P435l6694j8329j3106R856J5385Q164j699K9474
$$ plain form
17024 -51077 -28687 -1416 11448 -12508 -41927 -54893 -51780 -19374 26781 16750 -2045 15907
17012 15907 7552 16611 16323 11539 21205 -19046 -7144 13478 4968 6281 7564 -2060 -2418 -23176
16998 -23176 -40317 -18127 7120 29824 14414 19786 -2071 -31373 -53860 -20160 11293 -5230
16986 -5230 -21843 -20726 -10113 2424 -4804 -22417 -135 32256 24186 9123 -26391 -27148 24337
16973 24337 27376 -6389 -21506 -20024 -5380 -221 21713 10111 -33976 -54918 -22776 3345
16961 3345 2730 803 -6584 -40015 -41472 229 41753 24861 -29657 -57616 -70085 -46920 -5804
16948 -5804 -2169 9874 20195 19819 -10162 -32582 -2946 16988 11310 13707 -194 7266 4933
16935 4933 6939 22739 28003 8724 16159 -20535 -38864 -51970 -42114 -26729 -18565 -20264 9210
16922I210j2863l0026j3400j0473Q52L3049J1466J924P123j1938J6091L1370k0611
16909A1774j6686k0986M314J0459M254R535n505Q270J0329J485j0822j0193r32
16896d704J586J4402r84j4962L034N038k724j4925L585P737J185o938K283Q047
16882A660K6338k6590J2452J8049j1883k6239R124M698m1625r748P644l222q15
16869d0157J0731K2863J6118r548l1571k5719l91n897J2650K3724j490L993K4582
16856a12j6663j8840j7643k765J0642M381q822J5205J0655j9564j2658K836K9968
16843b3380J8898Q883J2593J2902k6383j7895l067K8769N5660j9410l3593j1915
16831B062q204j6021R786J7343j4517j7091l0975j6518Q281J6994j6975j8500
$$ plain form
16922 9210 -3653 -33679 -47079 -57552 -56700 -23651 -12185 -10261 -3138 -15076 1015 32385 11774
16909 11774 -4912 -25898 -21584 -11125 -6871 2664 -2841 5429 15758 17243 6421 -3772 -4704
16896 -4704 -3118 11284 10300 -4662 -1628 3410 686 -14239 -10654 -2917 -1732 -8670 -6387 1660
16882 1660 27998 1408 13860 31909 20026 -6213 2911 7609 -34016 -43764 -36120 -39342 -40157
16869 -40157 -29426 -6563 9555 7 -31564 -57283 -57674 -63571 -50921 -27197 -28687 -24694 -112
16856 -112 -16775 -35615 -53258 -56023 -45381 -41000 -49822 -34617 -23962 -43526 -56184 -53348 -23380
16843 -23380 -4482 4401 16994 29896 3513 -14382 -17449 11320 66980 47570 13977 2062
16831 2062 -6142 -22163 -12377 4966 -9551 -26642 -57617 -74135 -65854 -48860 -65835 -84335
16819h4335M9565L705k2817K0511K3723k9801j6427r971K6511L90Q465J482K3131
16806e868K513J1810n477n035q912m0830K5836k192R823J0719L3296j4132R947
16793B1498o659k642k615l5771k8096R658j8053o226J3840m703j0002L9375N8712
16780B8316L30j2397j0664r23K0423j38k5972j6732n279J4139k280J2639j7296
16767a5834J1265M115J8348K0492m2816J146J6024k0657q540Q388q101j9120K4276
16754a1014J6399P839J2491k0816j2397K8q48j3909j485M285p962N833k4374K2226
16740b3704R120r425M466K0723j4802k093j6535k476j5618j9780j4857J9742M6292
16727a8947Q220o774k5348n457K9087j4434k0822J4274K0560J9182N064M365k7040
$$ plain form
16819 -84335 -34770 -31065 -53882 -33371 -9648 -39449 -55876 -65847 -39336 -38946 -30481 -28999 -5868
16806 -5868 -3355 8455 2978 -2057 -10969 -51799 -25963 -28155 -18332 -7613 25683 11551 21498
16793 21498 14839 12197 9582 -26189 -54285 -44627 -62680 -68906 -55066 -59769 -69771 -30396 28316
16780 28316 28646 16249 5585 4662 25085 24947 -1025 -17757 -23036 -8897 -11177 1462 -15834
16767 -15834 -4569 -454 17894 38386 -4430 -3284 12740 -7917 -16457 -8069 -16170 -35290 -11014
16754 -11014 5385 13224 25715 4899 -7498 -7470 -8318 -22227 -23712 -19427 -27389 -21556 -45930 -23704
16740 -23704 -14584 -24009 -19543 1180 -13622 -15715 -32250 -34726 -50344 -70124 -84981 -65239 -18947
16727 -18947 -10727 -17501 -42849 -48306 -19219 -33653 -54475 -40201 -19641 -459 4605 8970 -18070
16714a8070j9905P801J5750j3176r463M500K0819J8894L277k2218m2334r509L6730
16701b6904L6089J654j2225J8220L0941o605j9337R38p977j5557J749j4267j488
16688a4769k294k6330P643o599R774L6963j0089k4896P125k3582k4446L4780K8620
16675h100J8610p909j5273l5774p417K0730L8225K1433J1873O302m470R641k648
16662D5223l9812k3103K7880R779K3386k0781J898M823n1j5826l2842j5153J9775
16649a4804k0079N637J7449K966j5609j3014O737k7144P677K3129j2062J7453
16637b1664J8141Q328L4573p737j5478r919l8335K8724N951P85j3606j8762o611
16624c5610L081N1152p540k9939j8075J7991L1533j7331j2064L66j1546o54M5294
$$ plain form
16714 -18070 -37975 -30174 -14424 -27600 -37063 -32563 -11744 7150 10427 -11791 -54125 -63634 -26904
16701 -26904 9185 10839 -1386 16834 47775 41170 21833 22771 14794 -763 986 -13281 -14769
16688 -14769 -17063 -43393 -35750 -42349 -32575 4388 -5701 -30597 -23472 -47054 -71500 -36720 -8100
16675 -8100 10510 2601 -12672 -48446 -55863 -35133 3092 24525 36398 42700 38230 47871 45223
16662 45223 5411 -17692 10188 19967 43353 22572 24470 29293 29242 13416 -19426 -34579 -14804
16649 -14804 -34883 -29246 -11797 -8831 -24440 -37454 -30717 -57861 -50184 -27055 -39117 -21664
16637 -21664 -3523 4805 39378 31641 16163 6244 -32091 -3367 2584 3369 -10237 -28999 -35610
16624 -35610 -32529 18623 11083 -18856 -36931 -18940 12593 -4738 -16802 -16436 -27982 -28636 16658
16611A6658P165k1035K6736K6257J904m7190l2833l652J6938q25p714K3806j3328
16598g113j2694k5894j5846L3477K5035p909J2462N864k3949k4397J4497O454
16586b0013n9L604J6692p00n056k6182k5873J3315O676L969l5641L792K1073J1558
16572c2845m160q033j4673L0112J6142m70q418j5094K3451L5777l0592l7975Q28
16559d5950K0905l3901j9719J5028K6778K0665P630k9072k1480J4380j5025P431
16547e2330P437J645j8602j2961m365j033N618K0674L1955L4247k7122p18q281
16534b3836o812K0766N753j4895J4161p709J5236l10j9402q370j3001P879K3877
16521f663J2205J1781j1151j3284l1129j3583K8166J7523n336J9647J3266r182
$$ plain form
16611 16658 23823 2788 29524 55781 57685 10495 -22338 -25990 -9052 -9877 -17591 6215 -7113
16598 -7113 -19807 -45701 -61547 -28070 -3035 -10944 1518 7382 -16567 -40964 -26467 -20013
16586 -20013 -20072 -16468 224 -476 -5532 -31714 -57587 -44272 -37596 -33627 -69268 -65476 -44403 -32845
16572 -32845 -37005 -45038 -59711 -29599 -13457 -13927 -22345 -37439 -13988 21789 -8803 -46778 -45950
16559 -45950 -25045 -58946 -78665 -63637 -36859 -16194 -8564 -37636 -59116 -44736 -59761 -52330
16547 -52330 -44893 -43248 -61850 -74811 -79176 -80209 -74591 -53917 -21962 12285 -14837 -15555 -23836
16534 -23836 -30648 -9882 -4129 -19024 -4863 -12572 2664 2354 -17048 -25418 -38419 -30540 -6663
16521 -6663 5542 17323 6172 -7112 -38241 -51824 -23658 -6135 -11471 8176 21442 12260
16509A2260O083P167n392j9902j6677K1446O192k0953K473O848N581j3292j3341
16496b1507P908l816K4358J1647K6766K0439l878k7603j5289r786j7971k468K3208
16483A2008L2035n985k2089j2979p960L4084p407k2015M836k7457j1704o233k6645
16470f7511J7436K6793K999j4134K751n350q233K93L349J0290p79P764J7569J1541
16456D778K0475J477m024k1336k698j2754l4753n055j1778O669K1053o832K2389
16443b2389R458J582p375m1444l759L844L720K0550L684P564J2551k6061j1523
16430d9598K442r822M440K021K0115p302o48k2101J5519J346J702m712j5429O885
16416e5142K0302R785j3673J6856M5461j3495m813j912K4880J1057o800r323J7771
$$ plain form
16509 12260 18343 25510 20118 216 -16461 4985 11177 -9776 -7303 -455 5126 -8166 -21507
16496 -21507 -13599 -17415 6943 18590 45356 65795 61917 34314 19025 9239 -8732 -11200 12008
16483 12008 44043 38058 15969 2990 -4970 29114 21707 -308 4528 -22929 -34633 -40866 -67511
16470 -67511 -50075 -23282 -20283 -34417 -31666 -37016 -45249 -44956 -41607 -31317 -32096 -24332 -6763 4778
16456 4778 25253 26730 22706 1370 -1328 -14082 -48835 -53890 -65668 -58999 -37946 -44778 -22389
16443 -22389 -12931 -11349 -18724 -60168 -63927 -60083 -56363 -35813 -32129 -24565 -12014 -38075 -49598
16430 -49598 -47156 -56978 -52538 -50517 -30402 -37704 -38352 -60453 -44934 -43588 -41886 -46598 -62027 -55142
16416 -55142 -34840 -25055 -38728 -21872 23589 10094 5281 3369 28249 39306 32506 23183 40954
16403D0954k650l7272J4572J9886j8557m0349N879J5121K065k8479j4342J945
16391d1227k1765K5831K7959o433K3540k8315K852p467J1768N077k4986M844J6660
16378a1662J0857K2323N404j8975j7100q462J5998J0160l2296J2665J7128j752
16366D288m497k533k5008k65P403K714J2842J668J6924K4379j0461j6550j1860
16353i56o122p004m703q061q565J9787K5257J6548l212K4141m994k2352k9475
16340i711K6610n394j7532k3115K4080K3909k846k5431q898J0338K1814j1594
16328B230J9695j8793q856K0767K2850j1758j5777R403o970k151K718r979k7138
16315b3759o489J0723K8981L4713j5395l8409j6080m555Q5o033Q817K4464k1979
$$ plain form
16403 40954 38304 1032 15604 35490 16933 -23416 -17537 -2416 -351 -28830 -43172 -41227
16391 -41227 -62992 -37161 -9202 -15635 7905 -20410 -17558 -25025 -13257 -8180 -33166 -28322 -11662
16378 -11662 -805 21518 26922 7947 -9153 -17615 -1617 8543 -23753 -11088 6040 4288
16366 4288 -209 -2742 -27750 -28015 -20612 -17898 -5056 -3388 13536 37915 27454 10904 -956
16353 -956 -7078 -14082 -18785 -26846 -35411 -15624 9633 26181 22969 47110 42116 19764 -9711
16340 -9711 16899 11505 -6027 -29142 -5062 18847 16001 -9430 -18328 -7990 13824 2230
16328 2230 21925 3132 -5724 15043 37893 26135 10358 19761 12791 10640 13358 3379 -23759
16315 -23759 -30248 -19525 9456 44169 28774 -9635 -25715 -30270 -30185 -36218 -27401 -2937 -24916
16302b4916J7295K3469j8421l1300J9494J3290k6173j0460K347N332J0560m355
16290b3838k4326j5448N814K049J1917K8760K9014L5015O696m3718l3038k073
16278b3176J8148l658K3921L0458K4115J0880l5025l8346N137P719q065j1370
16266G38o655K323n9K3686m562L0395K84k5870k2492l2309l5713K5460N1330L1882
16252C8438p201j2900j5439k2334J3208J2006k5016J264P52j1501m08m012K8885
16239d258N0362J5473k600J7872P463n8617j4099Q749L443O213k821l0028Q564
16226E716Q54j1287Q430k9159N010J658Q140j184K8863M666q621K568j3229j4209
16212a1784k3980k7436j2468L5324M0998J2455Q295j4591l1630n851R21j2804
$$ plain form
16302 -24916 -7621 15848 -2573 -33873 -14379 -1089 -27262 -37722 -35375 -30043 -19483 -23838
16290 -23838 -48164 -63612 -57798 -55749 -43832 -15072 13942 48957 55653 11935 -21103 -23176
16278 -23176 -5028 -8686 15235 45693 69808 80688 45663 7317 12454 20173 12108 738
16266 738 -5917 -3594 -3653 20033 15471 45866 46150 20280 -2212 -34521 -70234 -44774 6556 38438
16252 38438 31237 18337 2898 -19436 -6228 5778 -19238 -17974 -17222 -28723 -29131 -33143 -4258
16239 -4258 46104 61577 58977 76849 84312 25695 11596 20345 23788 30001 27180 -2848 5716
16226 5716 6570 -4717 3713 -25446 -20436 -18778 -10638 -11822 17041 21707 13086 15654 2425 -11784
16212 -11784 -35764 -63200 -75668 -40344 654 13109 21404 6813 -24817 -30668 -29747 -42551
16200d2551j8290j2970K0364L1398J8861l947R049O995M500Q293l6011N508J7239
16187H438K2097J8674J5552J6575j2345k4006j646k0609j0853r744P573j1580
16175a874K1583L675l1062j4463j7515r300J8043K0672l16J0674M348J2658L487
16162B0610O81n192q984Q525j7858k8362J5421J9338J2911j3507p861j9613j3421
16149c7312m774L4892k0827r698o613n095K2414J065L1569n601o700L6810K058
16136C2188l2651k1248j2965J8568q225n994n56J8388o853j4335k426R613Q983
16123a7513J857K4001n043j5933k4287j2299L964J2575R256K1821J1819p758J2043
16110A4503p787Q600J8165j753j7152k0370k169L209P05k245j3832Q54L52K755
$$ plain form
16200 -42551 -60841 -73811 -53447 -22049 -3188 -7135 1914 8909 13409 21702 -14309 -8801 8438
16187 8438 30535 49209 64761 81336 68991 44985 43339 22730 11877 2133 9706 -1874
16175 -1874 19709 23384 -7678 -22141 -39656 -48956 -30913 -10241 -10557 117 4465 17123 20610
16162 20610 21291 16099 7115 15640 -2218 -30580 -15159 4179 17090 3583 -4278 -23891 -37312
16149 -37312 -42086 -7194 -28021 -37719 -44332 -49427 -27013 -25948 5621 20 -6680 30130 32188
16136 32188 -463 -21711 -34676 -16108 -24333 -30327 -30883 -12495 -19348 -33683 -36109 -26496 -17513
16123 -17513 -15656 8345 3302 -12631 -36918 -49217 -45253 -32678 -23422 -1601 10218 2460 14503
16110 14503 6716 15316 33481 31728 14576 -5794 -7963 -4754 -4049 -6294 -20126 -19272 -18920 -16165
16096a6165k2440j7248K6786K5447K1430R424j4642k4667k2023J1799O691l97
16084a6005j4737m6850J1450K5208l0346r127K0627L3560L7853K2175j0439l969
16072A9400M2367j3167k8736l2261k5819K418K049l371M173R319K1178j2494L757
16059a1187J518O552J1637J0129J3963P670k3468n461O815K0545j2144n201K5234
16046D6602Q79k5597j209Q272k2324l111k9364o758K1189q967j5569j3248q4J8217
16032c1072L452O858J0554r225j0994j3287k7864l640M0044J2363K7771k117k7676
16019b4833j1346K4147Q511j676j130L1986J239j0753j1327j226j35K0071O545
16006C0073j3396k8371Q249M7841J4162m1615o83O746L975J9990J8444k1870j0332
$$ plain form
16096 -16165 -38605 -55853 -29067 -3620 17810 27234 12592 -12075 -34098 -22299 -15608 -16005
16084 -16005 -30742 -77592 -66142 -40934 -71280 -80407 -59780 -26220 11633 33808 23369 19400
16072 19400 61767 48600 19864 -12397 -38216 -35798 -33749 -37120 -32947 -23628 -2450 -14944 -11187
16059 -11187 -9669 -3117 8520 18649 32612 40282 16814 11353 18168 38713 26569 21368 46602
16046 46602 47481 21884 20675 28947 6623 3512 -25852 -32610 -11421 -20388 -35957 -49205 -49289 -31072
16032 -31072 -27620 -20762 -10208 -19433 -30427 -43714 -71578 -75218 -35174 -22811 4960 2843 -24833
16019 -24833 -36179 -12032 -3521 -5197 -6327 25659 26898 16145 4818 3592 3457 23528 30073
16006 30073 16677 -11694 -3445 44396 58558 16943 16260 23006 26981 46971 65415 43545 33213
15993C3213O883k3212k0350K6194N243l3800K0841L4957j3581J654m3713k0996
15981b6667M709O513j0083m29P964M109n053j7612j6273M554O471N1454K0748
15968C0405L394l0869j0707R74L4999Q957k532k3702l1602k9448P207L7753L0440
15955B5269J7418J4350R620m1833k0444j96J8152J645l1464K3045K8300K6397
15943G0259k1172j7065j0889l0921m131r178P958L969R562j9295L1879l876j2913
15930e813J8713J2238n327r718N591k9133r409K9964q544k8325L4655J2382J4001
15917C1275j68k847P742l827N046O471k2655J2048k3058l8781j1167j767K7297
15904a4391J5103J297n700R309K8330p115k3875J2153r597j5578L779r211k1941
$$ plain form
15993 33213 40096 16884 -3466 22728 27971 -5829 15012 49969 36388 38042 -5671 -26667
15981 -26667 -21958 -15445 -25528 -25957 -17993 -13884 -18937 -36549 -52822 -48268 -41797 9657 30405
15968 30405 33799 2930 -7777 -6803 28196 37153 34621 10919 -20683 -50131 -42924 -5171 25269
15955 25269 42687 57037 66657 24824 4380 4184 22336 23981 -7483 15562 43862 70259
15943 70259 49087 32022 21133 -9788 -13919 -23097 -15139 -11170 -1608 -20903 10976 7100 -5813
15930 -5813 12900 25138 19811 10093 15684 -13449 -22858 7106 -1438 -29763 4892 17274 31275
15917 31275 31107 28260 36002 32175 37221 43692 21037 33085 10027 -28754 -39921 -41688 -14391
15904 -14391 712 2009 -3691 5618 33948 26833 2958 15111 5514 -10064 -6285 -15496 -37437
15891c7437J7475K3480O961K3954J4888j0957l8900k0773K961N447q767k0981
15879d2649J8784J1603Q116Q926N122P613Q98j1695l3290l197J4684j3196J1559
15866a6722l702m476k1162j981K4101J4307j4348n167R066R226Q172J972r437
15853a0151j6779L304p822r939J071J6015M6807j0180j5871L2290r835k3070m557
15840h717O410k6572j4345J8482L1730p083M801o31j9589j1234q609n70J1998
15827b3929L5315J0898j1827O27N483j0732n054J240K460k9460l772J7763L5805
15814B4817P67J5623k2983n775L695j3203k1541k1806n418K1649O432o362K6363
15801B258J1421J9401j4278j4995k8331k9203J3769J3912J0678J0073K0122k3654
$$ plain form
15891 -37437 -19962 3518 10479 34433 49321 38364 -536 -21309 -18348 -12901 -21668 -42649
15879 -42649 -23865 -12262 -4146 4780 9902 17515 18413 6718 -26572 -29769 -15085 -28281 -16722
15866 -16722 -20424 -24900 -46062 -48043 -23942 -9635 -23983 -29150 -20084 -10858 -2686 -714 -10151
15853 -10151 -26930 -23626 -31448 -41387 -40316 -24301 22506 12326 -3545 28745 18910 -4160 -8717
15840 -8717 -2307 -28879 -43224 -24742 6988 -95 4706 4075 -15514 -26748 -35357 -35927 -23929
15827 -23929 11386 22284 10457 11084 16567 5835 781 2021 4481 -24979 -28751 -10988 24817
15814 24817 25584 41207 18224 12449 16144 2941 -18600 -40406 -45824 -24175 -17743 -24105 2258
15801 2258 13679 33080 18802 3807 -24524 -53727 -39958 -26046 -15368 -5295 14827 -8827
15789h827l407j0581o791J0007K1094J4140N814l8878l0485J5778P26p895L769
15776c5536N388K0445Q790l393n79j2794J1853K0836n760K4154n848o324l5746
15763a4514k1888K7071L1529J9022P3248O4689J6468P2378J75764L45478O67351
15752A456596P29114k65949q23880n14535k32972j12934n4510n9392n4486J0005
15742G7057J5355j0869k4880k3870J277J468N033P076P86j3865N848K7428l759
15729F4085R73r246j2163k5127m6231k2684R124j3761J5317L9829K0557P928r860
15716A8741L557j010Q66l9894j8422R611L3187k6439n960Q498n079K0623J6012
15703A4291Q263j72o505j3162n677j3986J2554J5151j493J3152K2400j9012k3657
$$ plain form
15789 -8827 -12234 -22815 -29606 -19599 1495 15635 21449 -17429 -47914 -32136 -31410 -39305 -35536
15776 -35536 -30148 -9703 -913 -4306 -4885 -17679 -5826 15010 9250 33404 27556 21232 -14514
15763 -14514 -36402 -9331 22198 41220 114468 179157 195625 268003 443767 789245 1456596
15752 1456596 2185710 1919761 1095881 581346 348374 235440 180930 121538 67052 77057
15742 77057 92412 81543 56663 32793 34070 35538 40571 47647 48433 34568 40416 67844 64085
15729 64085 65058 55812 43649 18522 -27709 -50393 -41269 -55030 -39713 116 20673 28601 18741
15716 18741 22298 21288 22154 -17740 -36162 -26551 6636 -19803 -25763 -17265 -22344 -1721 14291
15703 14291 22554 22382 15877 2715 -2962 -16948 -4394 10757 9264 22416 44816 25804 2147
15690B147k3163L224j3075j2753M127J8779p955p1J7405j0985j2766K5845M0535
15677C1294q368k0697k2367q278j1824Q991K1018L3235J7541k6088k6179n347
15665a7069K8144J123j6913j2009K140K6739L963j1831j5501k5366p239J5390
15653b8429K8109n304j7637P168K3182k476j5168J87n75K5281J6586n305j7698
15640G921l0839j7597Q290J8165J5816k156L5318m711k1909Q76j0225p80q149
15627i980M328J7909l0593j5947k480J1597J8577J9533N331j1299l206j5115J786
15614i559N910K9523O944m8546J2587K2631N34j8093m3332j8380R824m877k3333
15601g8167J0472M1102K3324m465R513o078l213J2477j2529l4792Q744K3021k1867
$$ plain form
15690 2147 -21016 -17792 -30867 -43620 -39493 -20714 -28669 -28740 -11335 -22320 -35086 -9241 31294
15677 31294 22926 2229 -20138 -28416 -40240 -31249 -10231 23004 40545 14457 -11722 -17069
15665 -17069 11075 12198 -4715 -16724 -14584 12155 16118 4287 -11214 -36580 -43819 -28429
15653 -28429 -320 -5624 -23261 -16093 7089 4613 -10555 -10368 -10943 14338 30924 25619 7921
15640 7921 -22918 -40515 -32225 -14060 1756 -400 34918 30207 8298 9174 -1051 -1831 -9980
15627 -9980 -5652 12257 -18336 -34283 -36763 -25166 -6589 12944 18275 6976 3770 -11345 -9559
15614 -9559 -3649 25874 32818 -15728 -3141 19490 20024 1931 -41401 -59781 -49957 -54834 -78167
15601 -78167 -67695 -26593 -3269 -7734 1779 -4299 -7512 4965 -7564 -42356 -33612 -10591 -32458
15588c2458j2024o866K7489K0645M563L101j0354N54j4574l3097N617r516j6353
15575g3273j5124M0820K6865L8655P901K1074m532m6970P299L4225J0496j966
15563D5470l2602l0408k132l1057J701J6562J8184J0124Q191n132j9861l999Q12
15550b4147O535O545k0536J7276M4Q664j411K8097R642r836j424o472j5383k3126
15536b5532k6968j3132J611N745K0800L3065q787j5052J0949L938K8292J2826
15524B7755j9992j7606O745j8469R067K2158j1742k4163J400m026J2809K5869
15512I805J5509j7339j9692j1497L42N689r861j1352N062J3254J6698J4233J4682
15499B5533k9960k6110l1674j875J5185M5545j521M4589J7171p088r520Q49k6941
$$ plain form
15588 -32458 -44482 -51348 -23859 -3214 1349 4450 -5904 -5350 -19924 -53021 -47404 -56920 -73273
15575 -73273 -88397 -47577 -20712 17943 25844 46918 42386 -4584 2715 36940 47436 45470
15563 45470 12868 -17540 -19672 -50729 -49028 -32466 -14282 -4158 4033 -1099 -20960 -24959 -24147
15550 -24147 -17612 -11067 -31603 -14327 -14283 -5619 -7030 21067 30709 20873 19449 12977 -2406 -25532
15536 -25532 -52500 -65632 -64021 -58276 -37476 -4411 -13198 -28250 -17301 -13363 14929 27755
15524 27755 7763 -9843 -3098 -21567 -12500 9658 -2084 -26247 -24847 -28873 -16064 9805
15512 9805 25314 7975 -11717 -23214 -22872 -17183 -27044 -38396 -33334 -20080 -3382 10851 25533
15499 25533 -4427 -30537 -62211 -64086 -48901 -3356 -4877 39712 56883 49795 40275 41124 14183
15486A4183j4420m052J7777M5186J7574j6262l7080n630k5129n750j59J4823M4227
15473D5288q707l46p014k7635j5133R626J3919J2536K5517L778j6492k8993j9455
15460a3111Q583j1515l5256p158J8362L5621J9508P013O239q594q904j706K364
15447A1446N610O988l8741k1416J1061J6312P591j4497k3632L661k63L532J069
15434c1279L8910k4030k3186j3411N7570K180l61K3732M253k1316k0381j7572
15422b4891M4616Q424k3237l453j148O234l047K2893Q355p421k8833o773L1659
15409B3378o486l460k5352n093k731k7401J418J1122N616L1938N955k6582j7579
15396c5257j694J7317L556j9727k7130N705o166R699K0760L1660o04l3504N95
$$ plain form
15486 14183 -237 -4289 13488 58674 76248 59986 22906 17276 -7853 -13603 -13762 1061 45288
15473 45288 36581 36235 29221 1586 -13547 -3921 9998 22534 48051 51829 35337 6344 -13111
15460 -13111 -4528 -16043 -51299 -58457 -40095 -4474 15034 22047 28286 19692 10788 9082 11446
15447 11446 17056 24044 -14697 -36113 -25052 -8740 -1149 -15646 -39278 -35617 -35880 -32348 -31279
15434 -31279 7631 -16399 -39585 -52996 4574 6754 6393 30125 34378 13062 -7319 -24891
15422 -24891 19725 28149 4912 1459 311 6545 3498 26391 34746 27325 -1508 -8281 23378
15409 23378 16892 13432 -11920 -17013 -19744 -47145 -45727 -34605 -28989 2949 8904 -17678 -35257
15396 -35257 -36951 -19634 -16078 -35805 -62935 -57230 -63396 -53697 -32937 -1277 -1881 -35385 -34790
15383c4790K5673J9795j7618k382q459n542J0956j0935j6413L2252q042k5490
15371d0995m621J7335j800k0474J4001L9163J5536J0150j8838m0793j3063k2968
15359f7367Q805M823J3093J5291l020j571J9102K0616J2771J2370j0120o356j9582
15346a145J8014q640k3088o921J3366k6455K406J689m140J8659L1822M193j0272
15333I488K3785L122j2902m3240j7852L1389Q95k3517l616K3828M4130P232k5018
15320A7724K982o525K9l599J4997J180j2609R03p176j4581Q811j906j0378m394
15306a4542J0266K7362o09j8770l5568K7625J1523j0974M573k4743j9928l414
15294d7199K409k3194p431L8874N0352K2210m0425j9575l190K8627K1450j9714
$$ plain form
15383 -34790 -9117 10678 -6940 -9322 -17781 -23323 -12367 -23302 -39715 -7463 -15505 -40995
15371 -40995 -45616 -28281 -30081 -50555 -36554 2609 18145 28295 9457 -31336 -44399 -67367
15359 -67367 -58562 -53739 -40646 -25355 -28375 -29946 -10844 9772 22543 34913 24793 18437 -1145
15346 -1145 16869 8229 -14859 -21780 -8414 -34869 -32463 -30774 -34914 -16255 15567 19760 9488
15333 9488 33273 36395 23493 -19747 -37599 -6210 -5315 -28832 -32448 -8620 35510 42742 17724
15320 17724 20706 14181 14210 10611 25608 26788 14179 15082 7906 -6675 2136 230 -10148 -14542
15306 -14542 -4276 23086 22477 3707 -31861 -4236 7287 -3687 886 -23857 -43785 -47199
15294 -47199 -44790 -67984 -75415 -36541 13811 36021 -4404 -23979 -27169 1458 22908 3194
15282C194j7186j8106O811L604J3138J1865q648j4116m886O182n002J3505o324
15269a5969l995J7804L9200O622j0770j8262p080J4000j4928l0826O17J679q885
15256c0793M1391L2989Q929l3381P202j8591R171P571l0991j872J1357K1453J7021
15243D1456N246k3205l4012l950J4113n001r757n768o957J9688P560L821k2799
15230a9565K1164J1577j1233n262M733r085l344K8j2495N809L0609r77M419J8056
15216C4434K2246k5897l0315j1204q522J2747m456j2814o154K2362l433o201M372
15203a2835j7029m238J5435L5448M0583K466l3693l32J8680k6445o387J0947P617
15190C0217o926l1707L0843J0543o201k001n830J9092J8852k1666l2277l1120
$$ plain form
15282 3194 -13992 -32098 -25287 -21683 -8545 3320 -5328 -19444 -24330 -18148 -23150 -9645 -15969
15269 -15969 -19964 -2160 37040 43662 32892 14630 7550 21550 6622 -24204 -23587 -21908 -30793
15256 -30793 10598 43587 52516 19135 26337 7746 16917 24488 -6503 -8375 2982 24435 41456
15243 41456 46702 23497 -10515 -14465 -352 -5353 -15110 -20878 -27835 -8147 -587 3234 -19565
15230 -19565 1599 13176 1943 -3319 1414 -7671 -11015 -10987 -23482 -17673 12936 11959 16378 34434
15216 34434 56680 30783 468 -10736 -19258 -6511 -10967 -23781 -29935 -7573 -11006 -17207 -12835
15203 -12835 -29864 -34102 -18667 16781 57364 59830 26137 25805 44485 18040 11653 22600 30217
15190 30217 23291 -8416 22427 32970 26769 24768 18938 38030 56882 35216 2939 -28181
15178b8181j4461p542J7828k2934J5808L8748j3497l761P26j9132L2244M4488
15166D0334p517m104j3828m766p699K7031J2487l306r202j0328j2790j8957J1036
15153a609k7070l140K8826O115K241o603r317o198N155j5533L7142J7165J6317
15140D3491l5406j703J0302j52l2389k1552R458J0282K4272J9702j0260J1889
15128B7934k3580n637J8931J0663k5918J029J1724J9405j4709n8627J2467M3820
15116A7502K0514p761k1400j7859j7702N947K7451K1838K8283m5509k9996n575
15104b4267K557M878r333k2341N072L9560K190J5299J4638j8461q905j5594o714
15091b1421m23Q454P440K9831J0173k2937J4453Q204j9419j8745p821J4388j7637
$$ plain form
15178 -28181 -42642 -50184 -32356 -55290 -39482 -734 -14231 -17992 -17266 -36398 -4154 40334
15166 40334 32817 28713 14885 10119 2420 29451 41938 38632 29430 19102 6312 -12645 -1609
15153 -1609 -28679 -31819 -2993 3122 5363 -1240 -10557 -16755 -11600 -27133 10009 27174 43491
15140 43491 8085 6382 16684 16532 -15857 -37409 -27951 -17669 6603 26305 16045 27934
15128 27934 4354 -1283 17648 28311 2393 3422 15146 34551 19842 -38785 -26318 17502
15116 17502 38016 30255 8855 -9004 -26706 -20759 6692 28530 56813 11304 -18692 -24267
15104 -24267 -21710 -16832 -26165 -48506 -43434 -3874 -1684 13615 28253 9792 887 -14707 -21421
15091 -21421 -21844 -13390 -5950 23881 34054 11117 25570 33774 14355 -4390 -12211 2177 -15460
15078a5460k5885p990J9804N224k272j7899o387j0381k74K1417k384j5260n73
15065e8320J9785j919K4672K6583j0202k0192K1819P199Q208J065k2791k5583
15053b9676j4341K6681K1670P081J1561J6766n833l4454k8787J775P344J8182
15041b031j1726l4103Q804K1796J1839m530k595j7086J7351N961q947j2192o750
15028c4209K1548K9916m206j0028K4036q066J3854j0768j7986J5529n613k4206
15016a0199j4230k521K6166R971N040n995k3119O516m474p962J165L0099n4J09
15002A0512m6570j6940J5011J2655J282j4800O898J4147O366P228K595J8785J0671
14989B7840k2881j2786N157j2043J8702j7271k3165j8o728P421N778R801j871
$$ plain form
15078 -15460 -41345 -49335 -29531 -24307 -26579 -44478 -50865 -61246 -61520 -40103 -42487 -57747 -58320
15065 -58320 -38535 -40454 -15782 10801 599 -19593 2226 9425 17633 18698 -4093 -29676
15053 -29676 -44017 -17336 4334 11415 22976 39742 33909 -545 -29332 -27557 -20213 -2031
15041 -2031 -13757 -47860 -39056 -17260 -5421 -9951 -12546 -29632 -12281 -6320 -15267 -27459 -34209
15028 -34209 -12661 17255 13049 3021 27057 18991 32845 22077 4091 19620 14007 -10199
15016 -10199 -24429 -26950 -784 9187 14227 8232 -14887 -8371 -12845 -20807 -19642 10457 10403 10512
15002 10512 -36058 -52998 -37987 -25332 -24050 -38850 -31952 -17805 -11439 -4211 -1616 17169 27840
14989 27840 4959 -7827 -2670 -14713 3989 -13282 -36447 -36465 -43193 -35772 -29994 -20193 -22064
14976b2064p765Q984q151k2144J5881K7652M2044J7416l6459N4q274J7107j2732
14963A1549k7445l642J0739O677j2454j5767k0186J1735j8101J0083J1989l30
14951c5153K8422J0359o237k379j2721j026J1059K0760R955Q885j4433k2763n217
14938a0489K6566K780j6321r671N48K9622L5890k2189l3926k142J8398n800j1765
14925A501J5726n282j5997J83J8205K0513l389k2406J883k775k7429p080M092
14912b2255J6961K4678k3411j7286R570L359l114p568l119j2495j5563j2518J9357
14899d3404L9850Q994k084L272k0552K617K4176K2387j5801j2423J4478J6804
14887C8314k7332K973O187l1866j2453K4789m514p217J1161M5712J6341j7822
$$ plain form
14976 -22064 -29829 -20845 -28996 -51140 -35259 -7607 34437 51853 15394 15448 7174 24281 11549
14963 11549 -15896 -19538 -8799 -2122 -14576 -30343 -50529 -38794 -56895 -46812 -34823 -35153
14951 -35153 -6731 3628 -2609 -4988 -17709 -18735 -7676 13084 23039 31924 17491 -5272 -10489
14938 -10489 16077 18857 2536 -7135 -6587 23035 58925 36736 2810 668 19066 13266 1501
14925 1501 17227 11945 -4052 -3869 14336 34849 31460 9054 10937 8162 -19267 -26347 -22255
14912 -22255 -5294 19384 -4027 -21313 -11743 -8384 -11498 -19066 -22185 -34680 -50243 -62761 -43404
14899 -43404 -3554 5440 3356 6628 -13924 -11307 12869 35256 19455 7032 21510 38314
14887 38314 10982 13955 20142 -11724 -24177 612 -3902 -11119 42 45754 62095 44273
14875D4273q383n185j3979J941l1616p935K2466l3L0021J6116N986q603k0844
14862B4225k2275j2283K416p402j1127P647j1938M610K1440L666j4095j4333k521
14849c1970L5218K9091k006m2377K66J7077j6393k1206K2617K7043K551k2246
14837b335r146J8791j6670P756p699O985K182J414K0086J0249m5263l4807n986
14824e4443J4793j4344j0571K4046K5152J4942K354k021J0027k2525j7758J4754
14812a5594L8922r347o022K3637L6729j1114l8037j3283j3528l8818l9898K5921
14800f0432N1199K2141l4006m8388j5365R447K1425J8754K7319M35J6099l3514
14788b4886k6916n213P667j0453R114K3182J4890R899J3311L465j5591J3955J5260
$$ plain form
14875 44273 35890 30705 16726 18667 -12949 -20884 1582 1549 31570 47686 53672 45069 24225
14862 24225 1950 -10333 -7917 -15319 -26446 -18799 -30737 -26127 -4687 -1021 -15116 -29449 -31970
14849 -31970 3248 32339 30333 -12044 -11778 5299 -11094 -32300 -9683 17360 19911 -2335
14837 -2335 -11481 7310 -9360 -1604 -9303 -2318 -136 1278 21364 31613 -13650 -48457 -54443
14824 -54443 -39650 -53994 -64565 -40519 -15367 -425 1929 -92 9935 -12590 -30348 -15594
14812 -15594 23328 13981 7959 31596 68325 57211 19174 5891 -7637 -46455 -86353 -60432
14800 -60432 -9233 12908 -21098 -69486 -84851 -75404 -53979 -35225 -7906 -7471 8628 -24886
14788 -24886 -51802 -57015 -49348 -59801 -50687 -27505 -12615 -2716 10595 14060 -1531 12424 27684
14775B7684j8983k3618j624K2902k9051j6671K3844M910p968L734p229J0475K2506
14762A0911k8007j0667r106Q082J5055o855N075K0023J6723j0828k9723l3017
14750e2334K5898J2085j8923L994K395j7065j29l5J0503k4516K8278M9743J7490
14737C7384m164l524m683L473j6325k045j1387j0214J2191k713j47j347J672j1879
14723a3708k4073j7952J7977j6699o584K4715J0012J240j6720Q701K5919K1239
14711A4067k5047k6093j4829K0813L7418j0240k4268J1741J6712K2613l250j5850
14699C787q851l4770j4877K4183N785q175j9614J5299K8443K2290j9010k9765
14687c5275O009J5033M442L7090J0413j2194J480p102l1333o99P478q916j8673
$$ plain form
14775 27684 8701 -14917 -16541 6361 -22690 -39361 -15517 -10607 -18575 -14841 -22070 -11595 10911
14762 10911 -17096 -27763 -36869 -28787 -13732 -20587 -15512 4511 21234 10406 -19317 -52334
14750 -52334 -26436 -14351 -33274 -29280 -26885 -43950 -44079 -44114 -33611 -58127 -29849 19894 37384
14737 37384 33220 29696 25013 28486 12161 10116 -1271 -11485 706 -2007 -2154 -3501 -1829 -13708
14723 -13708 -37781 -55733 -37756 -54455 -61039 -36324 -26312 -25072 -41792 -33091 -7172 14067
14711 14067 -10980 -37073 -51902 -31089 6329 -3911 -28179 -16438 274 22887 19637 3787
14699 3787 -5064 -39834 -54711 -30528 -24743 -32918 -52532 -37233 -8790 13500 -5510 -35275
14687 -35275 -29266 -14233 -9791 27299 37712 25518 26998 19896 -11437 -12136 -4658 -13574 -32247
14674c2247j5274K861m934P679K1237K1458J0537P880l985L3546L364m2313k821
14661F988K454k663O544K8569j369m3090k5112K2745K4409K302M14L34j521L492
14647B4496k3451J6336J952K398K784P315Q632j0126J102N03Q83k0390J9399J9025
14633E0858q354Q131j4767k4912p509K965k1506R205N731J4597o752N060k748
14620I999J6663K6371q542j6865k406j4729m99L5296j1112P453M241j2859k5529
14607G482k9640k4543j558K5695K1427M240n448l819K2161k966J1245K770r652
14594A7394j9877k975Q424O804K2599j376k1534j7437O860o657L1833J4958j7551
14581B1465j1643j287k6366J4130K9172j8063k9993k727J1263J5031k1177q808
$$ plain form
14674 -32247 -47521 -44660 -49594 -41915 -20678 780 11317 19197 15212 48758 52122 9809 6988
14661 6988 9442 6779 13323 41892 40523 -2567 -27679 -4934 19475 21777 22191 22525 21004 24496
14647 24496 1045 17381 19333 21731 24515 31830 40462 30336 31438 31941 32824 12434 31833 50858
14633 50858 42504 50635 35868 10956 3447 6412 -15094 -5889 -158 14439 7687 12747 9999
14620 9999 26662 53033 44491 27626 25220 10491 9992 45288 34176 41629 45870 33011 7482
14607 7482 -22158 -46701 -48259 -22564 -1137 3103 -2345 -6164 15997 13031 24276 27046 17394
14594 17394 -2483 -5458 2966 9770 32369 30993 9459 -7978 -1118 -7775 24058 39016 21465
14581 21465 9822 8535 -17831 -3701 25471 7408 -22585 -25312 -14049 982 -20195 -29003
14569b9003J1146q805l3638J557K9669J8975M867o266L2941L0404k7005j5898
14557H944J6382m490j0098j864j5734l2754K8634K6474L1912J8540k8823l2692
14545D431k7750k759J3880K6014k15p45J4962n197L4352K051l1067j2020O749
14532B2686l2195r446R587Q846J1124J491k4449k5553L4363K3866K5700P445k0014
14519C3451o809j1919q532l5348j0254J4393K9041J4086P390l952l5229N381K2067
14506A3766l3941k1132K3027J5880L9498M3377l5619j5801l0590O359K6355q480
14494B2699j7174O072J2516Q430k5109j1065p94j0142K434J6479k29N84j3337
14481h636j7052J6613L151p577l982K1287L822j6335p839J4888j3053K942k549
$$ plain form
14569 -29003 -17857 -26662 -60300 -58743 -29074 -10099 -5232 -11498 21443 51847 24842 8944
14557 8944 25326 20836 10738 8874 -6860 -39614 -10980 15494 47406 65946 37123 4431
14545 4431 -23319 -26078 -12198 13816 13601 12856 27818 22621 56973 59024 27957 15937 22686
14532 22686 -9509 -18955 -9368 -522 10602 12093 -12356 -37909 -3546 20320 46020 53465 33451
14519 33451 26642 14723 6191 -29157 -39411 -25018 4023 18109 25499 21547 -13682 -8301 13766
14506 13766 -20175 -41307 -18280 -2400 37098 80475 44856 29055 -1535 4824 31179 22699
14494 22699 5525 11597 24113 32543 7434 -3631 -4425 -14567 -12133 4346 4117 4701 -8636
14481 -8636 -25688 -9075 -5924 -13501 -17483 3804 7626 -8709 -16548 -1660 -14713 -11771 -14320
14468a4320p276j9745j276J4375N284j2232J1758N7416K898l3359n546K6884r091
14455A5770J0286j79K0028j1232k4061j296K6509p48k0536l7770L0958j324k4435
14442a8030k7594k242N816K3725R436l413l4830R037J6258k792l9601k794L1189
14429c5835J9769j196l977L539K1181k3128j8246R875K0622k196m91j2311M321
14416a8073n454L919J0241K0337l2463l3596K2065L6977j3832J2578K584j0663
14404e380K724O923q201m383r806J4100N270k2378k0092J4191K6243J5641n154
14391I698J32M2650J1148k1880l1391k4361p163N68K2803J1810k4969m7102J1336
14378d6721J6661j476k4845L5246J9635k215j5302K0252K2402P326p331r828j0251
$$ plain form
14468 -14320 -21596 -41341 -42617 -28242 -22958 -35190 -23432 33984 36882 3523 -2023 24861 15770
14455 15770 26056 25877 45905 34673 10612 9316 35825 35077 14541 -23229 7729 6405 -18030
14442 -18030 -45624 -47866 -42050 -18325 -8889 -12302 -47132 -38095 -21837 -24629 -64230 -67024 -35835
14429 -35835 -16066 -17262 -21239 -17700 3481 -19647 -37893 -28018 -7396 -9592 -10083 -22394 -18073
14416 -18073 -23527 -19608 -9367 10970 -21493 -55089 -33024 3953 -9879 2699 5283 -5380
14404 -5380 -2656 4267 -3934 -8317 -18123 -4023 1247 -21131 -41223 -27032 -789 14852 9698
14391 9698 9830 52480 63628 41748 10357 -14004 -21167 -20599 2204 14014 -10955 -58057 -46721
14378 -46721 -30060 -31536 -56381 -21135 -1500 -3715 -19017 1235 23637 30963 23632 13804 3553
14365C553l5941j757J6538J909j4109j0587J0320L3138K4165J9813l231l1325
14353A2486j6865N261J896J3300j1317K250P987J1919j3432j6595l2052L5483
14341C21j6760k0143J6394r79K0051J5912J7268K2027J7222l0912j0944J8183
14329D7640k3470k2895K8835J8035j21k1018j3596J8984J4903k5626l7248L5498
14317A9921j0034k1271m572L459J738K5849N67k444m0212k4346K0494L2438j828
14304b41j7016M701n943J8626q887Q014K0330o17P461p940j7494k7863N185J1017
14290a0667M723p649k442P578K1286J136l1919K789J4678N042n6711J7199J4125
14277b0832K7238k407Q361L290L3589p809l8902k5540k836P810M9421J3141l0100
$$ plain form
14365 3553 -32388 -34145 -17607 -15698 -29807 -40394 -30074 3064 27229 47042 43811 12486
14353 12486 -4379 882 2778 16078 4761 7011 14998 26917 13485 -3110 -35162 321
14341 321 -16439 -36582 -20188 -21167 -1116 14796 32064 54091 71313 40401 29457 47640
14329 47640 24170 1275 30110 48145 48024 27006 13410 32394 47297 21671 -15577 19921
14317 19921 9887 -11384 -15956 -12497 -10759 15090 15657 13213 -26999 -51345 -30851 1587 -241
14304 -241 -17257 -12556 -18499 127 -8760 -746 19584 18967 26428 18488 994 -26869 -21684 -10667
14290 -10667 -5944 -13593 -16035 -8457 12829 13965 -17954 -15165 -487 4555 -52156 -34957 -20832
14277 -20832 6406 3999 12360 15650 49239 41430 2528 -23012 -25848 -18038 31383 44524 14424
14264A4424R817l012q433j489k3087j2289j5962L951K6872J6083k5578N765j360
14251a4298P295J9592J5133J1530k7027l2573J7702J6848N626k4209j3357J0882
14239f856P367n2159j9717J4455L2887L5483R811k2055k532j3700m164k274n874
14226b9328J883P19q233M2725O005j4850J3907L106j4049k2452r913j1246J181
14213d0545M0270K384K490L7654R286k7954j4085M884J6500N847q588r520j0323
14200H300j0373p681L213K6463R010J7469L836k2162J055j1647l0525Q364J4461
14187I783j3445J898M6121N494Q388k6994l1863J7851M3184o388m905j6771l9676
14174g323l4569j5185K5562o730J070J7306p879J068L939j0729R358K9416K5268
$$ plain form
14264 14424 24241 21229 12796 11307 -11780 -24069 -40031 -36080 -9208 6875 -18703 -12938 -14298
14251 -14298 -7003 12589 27722 39252 12225 -20348 -2646 14202 19828 -4381 -17738 -6856
14239 -6856 511 -51648 -71365 -56910 -24023 11460 21271 -784 -3316 -17016 -21180 -23454 -29328
14226 -29328 -27445 -26726 -34959 7766 13771 -1079 12828 15934 1885 -20567 -30480 -41726 -40545
14213 -40545 -275 2109 4599 42253 51539 23585 9500 14384 30884 36731 28143 18623 8300
14200 8300 -2073 -9754 -6541 19922 28932 46401 50237 28075 29130 17483 -13042 -4678 9783
14187 9783 -3662 -1764 44357 49851 58239 31245 -618 17233 60417 54029 49124 32353 -7323
14174 -7323 -41892 -57077 -31515 -38245 -37175 -19869 -27748 -26680 -22741 -33470 -24112 5304 30572
14161C0572j2056k9655J80J3849j4844j6764K222j4334J8519J9296N224J7396
14149A9605J1311k5355j9176K9253J3425l7383j9632j9950J981L7378J4688k3113
14137a6968J1260k3151P859K2103Q119O237Q540P841K563l3992p119j7586k675
14124b6969J0456J0137K3047j4386j1752k6494j8260J6661Q300Q69K6691K0922
14112A9222M337r879J6817P556j940k770O951o604k8821n0730J0541K8105K2514
14099A5299J4095J3503p364j1554l4167l1600k9039n154L1567J5892L4490J5659
14087B1627Q308l1527R392K955l6748P318N375J9193K9797r750k6950p047l146
14074a1203K133M570K8423J7706l6486j9203O806R240j6366k0545j7463m027J8470
$$ plain form
14161 30572 18516 -11139 -10959 2890 -11954 -28718 -26496 -40830 -22311 -3015 2209 19605
14149 19605 30916 5561 -13615 15638 29063 -8320 -27952 -47902 -45921 -8543 6145 -16968
14137 -16968 -5708 -28859 -21000 1103 9222 15459 23999 31840 34403 411 -6708 -24294 -26969
14124 -26969 -16513 -6376 16671 2285 -9467 -35961 -54221 -37560 -29260 -28391 -1700 19222
14112 19222 23559 13680 30497 38053 36113 33343 40294 33690 4869 -45861 -35320 -7215 15299
14099 15299 29394 42897 35533 23979 -10188 -41788 -70827 -75981 -44414 -28522 5968 21627
14087 21627 29935 -1592 7800 10755 -25993 -18675 -13300 5893 35690 25940 -1010 -8057 -11203
14074 -11203 -9070 -4500 23923 41629 5143 -14060 -7254 1986 -14380 -34925 -52388 -56415 -37945
14061c7945J7127K961R939K4024K5171m017n8052n1624J1818K9819P666J8864
14049d249m305k7908K7120J7971L58k2530L122J0205k3694M495K2096J4505l2162
14036a4976j0964j3472L0579J1646J4208j123l5220k0137K3139K839J5284K0653
14024B2456m558j7310k4743q319L4177K4023O752k3711k3243J0195N526l9701
14012c8456o975J9894J6594J7106J394J838K0102l2515j7809P233k540J733L043
13999i358K9949q004j843P02K3512N358k0619p286M56j0596j8174M715j0742P13
13985b1217J6726J214J2599J9425L5140M698l4173j0136r400j5258Q154j4760
13973f988N102j5682J976J6234Q993K430j587l786n470j9209j0839J7910M1416
$$ plain form
14061 -37945 -20818 -17857 -7918 16106 41277 37260 -20792 -72416 -60598 -30779 -23113 -4249
14049 -4249 -8554 -36462 -9342 8629 8987 -13543 -10421 -216 -23910 -19415 2681 17186 -14976
14036 -14976 -25940 -39412 -8833 2813 17021 15898 -19322 -39459 -16320 -13481 1803 22456
14024 22456 17898 588 -24155 -32474 1703 25726 32478 8767 -14476 -4281 1245 -38456
14012 -38456 -45431 -25537 -8943 8163 9557 11395 31497 -1018 -18827 -11594 -14134 -12401 -9358
13999 -9358 20591 12587 10744 11446 34958 40316 19697 12411 12867 2271 -15903 -11188 -21930 -21217
13985 -21217 -4491 -3277 9322 28747 63887 68585 34412 24276 14876 -382 7772 -6988
13973 -6988 -1886 -17568 -15592 642 9635 12065 10478 6692 1222 -17987 -28826 -10916 30500
13960C0500N777l7819k0839J5090L348l002j5885J5898J2806L6904Q558l4468
13948A6868K5549k957l0176k5941L1902J8778l3230l1175N852M3024J6144j0080
13936B4558K281Q329k0604j0450k694k4657j5772J7227J6550Q892J4319J9035
13924C7014r255m4312k7381N792K2393j0015k6956p886K5840K3819J5913O430
13912A1396K270j79J1103Q483j267o45l420o21m812J1324j203r358k4747j8677
13898b0353k147j4960J4533P283j8785k0626K2795K2238J8499J7186K53j1387
13886A4529P187o385j2015o82K1460R656j6790K0088K862j974P110j8848j9403
13873F795P924l1170k4547J8306N808L332J4003J2097q859j239J3182N325l1206
$$ plain form
13960 30500 36277 -1542 -22381 -7291 -3943 -6945 -22830 -6932 5874 42778 51336 16868
13948 16868 42417 39460 9284 -16657 15245 34023 793 -30382 -24530 18494 34638 24558
13936 24558 26839 35168 14564 4114 1420 -23237 -39009 -21782 -5232 3660 17979 37014
13924 37014 27759 -16553 -43934 -38142 -15749 -25764 -52720 -60606 -34766 -10947 4966 11396
13912 11396 13666 13487 24590 33073 31806 31161 27741 27120 22308 33632 32429 23071 -1676 -20353
13898 -20353 -22500 -37460 -22927 -15644 -34429 -55055 -32260 -10022 8477 25663 25916 14529
13886 14529 21716 15331 3316 2634 24094 33750 16960 37048 39910 37936 45046 26198 6795
13873 6795 14719 -16451 -40998 -22692 -16884 -13552 451 12548 3689 2450 15632 20957 -10249
13860a0249m5900j6267K0539K0823l0643M166L5079M2158J8014k4083j382P546
13848A9801M122j9161L5420J9348m0694k5661j0714j7305L564O029P672k1538
13836c9117k811Q166j2387k022m401k292J783m015K9107M617n909J4960K2115
13823G794J4854J180M291R114j0644J6065J0769R758m2122j0834M5127K1249q416
13810F8185J576j9071l0802n346j9353j697r968j8085n693J4115k435Q791K0395
13797F12L0016O405n859j0249j7158j7722J0855j5710J9859K1266J5j9236n815
13784b721P941P94J4759J6561Q701L4975J2742j8966J1220N3655L2838M547q573
13771A68473k654j2612J7249k4810m288k5475j8913j5029l361k979K0039k3358
$$ plain form
13860 -10249 -56149 -72416 -51877 -31054 -61697 -57531 -22452 19706 37720 13637 12255 19801
13848 19801 23923 4762 40182 59530 18836 -6825 -17539 -34844 -31280 -25251 -17579 -39117
13836 -39117 -41928 -33762 -46149 -48171 -52572 -54864 -53081 -57096 -27989 -23372 -29281 -14321 7794
13823 7794 22648 23828 28119 37233 26589 42654 53423 63181 21059 10225 55352 76601 68185
13810 68185 69761 50690 19888 14542 -4811 -6508 -16476 -34561 -40254 -26139 -28574 -19783 612
13797 612 30628 37033 31174 20925 3767 -13955 -3100 -18810 1049 22315 22330 3094 -2721
13784 -2721 5220 6014 20773 37334 46035 81010 93752 74786 86006 139661 172499 177046 168473
13771 168473 165819 153207 170456 145646 141358 115883 96970 81941 78580 75601 95640 72282
13759G2282m6952k7800K9107J9960k55m27M4452R744J4942J3354J7661L1781K4725
13746B02574J3647K673L928R25j3332j9261k8962J262j0968m0006l1297n248J0674
13733H6609j7526Q05J9672L524J4119m711J5303k0770k5492L494P148l3768R031
13720E7438J3287J2035J4349P348J865J8465J3474j980j2451j2247k2956j3358
13708G5269k9983j0063N012L9530k4561l4285J707j6380j3706k770M0381K6314
13696E6465k6199j5585R273j1432P300J2264q740j6126J433P590j3110j5669n517
13683a8053J3622j1707n657o263j814Q582M5778J5666r551q813j7522n429l440
13670d601J3953j2481k732n470r801m0610R64K6292N1160j3410l943J1258j2039
$$ plain form
13759 72282 25330 -2470 26637 46597 46342 45915 90367 100111 115053 128407 146068 177849 202574
13746 202574 216221 218894 222822 223747 210415 191154 162192 163454 152486 112480 81183 75935 86609
13733 86609 69083 69888 89560 93084 107203 102492 117795 97025 71533 75027 82175 48407 57438
13720 57438 70725 82760 97109 104457 106322 124787 138261 136281 123830 111583 88627 75269
13708 75269 45286 35223 40235 79765 55204 20919 22626 6246 -7460 -10230 30151 56465
13696 56465 30266 14681 23954 12522 19822 32086 23346 7220 8653 16243 3133 -12536 -18053
13683 -18053 -4431 -16138 -21795 -28058 -29872 -21290 24488 40154 30603 21790 4268 -1161 -4601
13670 -4601 9352 -3129 -5861 -11331 -21132 -61742 -60778 -34486 16674 3264 -679 10579 -1460
13657a460k2817k8738K3353K7685n602K3108J5769l3373k9802J4315L791J3620
13645a51J7502r521k4060M0711K523j1569j0966j4585j4380l892K0710J8295J5572
13632B6189J8246k1040j660O957P89K0713R358m5992l545Q000n073j3241K2997
13619B2698k0008j0199J9568J2231J1639N062l098k9720j2587J4412L0995j2972
13607B8021k151Q132k2007l5345J1824J5603J028J6051M6288L3259k6085l7499
13595C7119J4865K7228j3823k8695m0506K3715J2460L0399J830o542j5007j4995
13583B8048q321r637J5202J5624p149J678q960k8907N570J8520L3205J5626l0556
13570C9943k3891j5019j1817L8890J5504j7099j112J5058j3364O13K4429Q962
$$ plain form
13657 -1460 -24277 -53015 -29662 -1977 -7579 15529 31298 -2075 -31877 -17562 -13771 -151
13645 -151 17351 7830 -16230 24481 27004 15435 4469 -10116 -24496 -28388 -7678 10617 26189
13632 26189 44435 23395 21735 28692 29481 50194 59552 13560 10015 18015 12942 -299 22698
13619 22698 2690 -7509 12059 24290 35929 40991 37893 8173 -4414 9998 40993 28021
13607 28021 25870 34002 11995 -23350 -11526 4077 5105 21156 67444 100703 74618 37119
13595 37119 51984 79212 65389 36694 -3812 19903 32363 62762 64592 58050 43043 28048
13583 28048 19727 10090 25292 40916 33767 35445 26485 -2422 3148 21668 54873 70499 39943
13570 39943 16052 1033 -10784 28106 43610 26511 25399 40457 27093 27706 52135 61097
13558F1097J9544j1846L442j3152j0226R388j1195k6757k2957j8485q31n785r479
13545c7242J5312p855j8416n721n489L984N2707N5993K4246q45q642j2349K701
13532E8384P318L752j9136k3144k2905k2491L5748M2002K4820k3677k2227n898
13520C2546J881J1896j7336j5989O788O560J6045j1451P30l499n222P478j3377
13507A7050J9459Q217J003p008L4838N400L1686o872m4877o245J731J690j0661
13494D5411k0125l3384m247K1148K6370K6564j7159l6732K9158J4708j8229j0423
13482B3060K6667J6458m1800M581L8531J1309l2700j9780J6190n753n445J1526
13470D2844n12k3979p352J9888j2397J5413K3481j5463n685n10o497M21j5485
$$ plain form
13558 61097 80641 68795 72237 59085 48859 58247 47052 20295 -2662 -21147 -21978 -27763 -37242
13545 -37242 -21930 -29785 -48201 -53922 -59411 -55427 -2720 53273 77519 76674 68032 55683 58384
13532 58384 65702 69454 50318 27174 4269 -18222 17526 59528 84348 60671 38444 32546
13520 32546 34427 46323 28987 12998 19786 26346 42391 30940 31670 28171 22949 30427 17050
13507 17050 36509 44726 45729 38721 73559 78959 110645 103773 58896 52651 54382 56072 45411
13494 45411 25286 -8098 -12345 8803 35173 61737 44578 7846 37004 51712 33483 23060
13482 23060 49727 66185 24385 28966 67497 78806 46106 26326 42516 36763 31318 42844
13470 42844 42332 18353 11001 30889 18492 33905 57386 41923 36238 35728 29231 29652 14167
13457A4167n263L4078K1053m843k0377k6045k5852k23L3426K1248P729J8314k0061
13444D7351j9305K0667P013J0456N524j3719k8435n745j4544J8384K5811J1768
13432F5226j7398r296L048j6906q026M9810L9846l513q408l1292m4378r485K6337
13419C5565K8482j810o336j7421q499n364K4322J6615K154O024J453j8746k6767
13406B9672q798j8924J6171N899n547j6224k6657Q152J354k2337K6730R290K932
13393A713K1349L5698k31O811J6926J572l770L0432J0290j1236J4931k0571j2519
13380I1395m56j0949L0074j9369L24P242j6550o827J9096q471K898j6395n840
13367F6172L5870K5921J3342p168j4259J1944j4757M096j859J2282K0413L5455
$$ plain form
13457 14167 8904 42982 64035 59192 38815 12770 -13082 -13305 20121 41369 49098 67412 47351
13444 47351 28046 48713 55726 66182 71706 57987 29552 23807 9263 27647 53458 65226
13432 65226 47828 38532 41580 24674 16648 66458 106304 102791 94383 63091 18713 9228 35565
13419 35565 64047 62237 55901 38480 29981 24617 48939 65554 67708 73732 75185 56439 29672
13406 29672 20874 1950 18121 24020 18473 2249 -24408 -16256 -14902 -37239 -10509 -1219 1713
13393 1713 23062 58760 58529 65340 82266 83838 80068 110500 120790 109554 124485 103914 91395
13380 91395 90939 79990 110064 90695 91019 98261 81711 74884 93980 85509 88407 72012 66172
13367 66172 102042 127963 141305 134137 119878 131822 117065 121161 119302 131584 151997 187452
13355A87452L3730j4507k3803L6939K3606K2796L8755J5244L2856K8283m202k6305
13343C50844l978M1902L5532j3843K7216P1260R304P449O2193K6587K525K2587
13331F39578M5108N1968K3051N4210N1196P2135R9198Q2930J09050J55380J58637
13320A542441J92043K20197K43363K60672L49744M32310M87719O07630P85629
13311E121748J034825J362717J801229K443037L266535M214318M897171M812127
13303B8953707L274622M60709k448427m118217m321344l669704k836242k015731
13295A3279373j343011p62288k56256K45434P24667R08624M54895l20587p38666
13286A2192185m92976J25784Q78122J717216K774814M162793N595129O224736
$$ plain form
13355 187452 221182 206675 182872 219811 243417 266213 304968 320212 353068 381351 377149 350844
13343 350844 346866 388768 424300 410457 437673 508933 518237 525686 587879 614466 616991 639578
13331 639578 684686 736654 759705 813915 865111 937246 1036444 1119374 1228424 1383804 1542441
13320 1542441 1734484 1954681 2198044 2458716 2808460 3240770 3728489 4336119 5121748
13311 5121748 6156573 7519290 9320519 11763556 15030091 19244409 24141580 28953707
13303 28953707 32228329 32689038 30240611 26122394 21801050 18131346 15295104 13279373
13295 13279373 11936362 11174074 10917818 11163252 11887919 12796543 13251438 12930851 12192185
13286 12192185 11699209 11824993 12703115 14420331 17195145 21357938 26953067 33177803
13278C3177803M940917K592368J470795J309911N17443j216598k673900k721587
13270C7397152j564678m53404j173547l673330n332895m913200l591604k342930
13262A4351564j388760o42395K8226N95883Q47683M20116m13013q02588o11203
13253A2385513l3773N84886J240020K057255K962658L954756M808426M874163
13245C2833904L455077M91422k837321n031406n446879m750280l792082k883280
13237A2039155k170840j654222j243567r69030p77353o71207n38193m17538l63494
13228C233711l61632l00589k43052j83323j76298j81432j35332j17769j14126
13219A420158p6961n8775o1893q5045o6368r4297o3937j5398m1946m0594k7144
$$ plain form
13278 33177803 38118720 40711088 42181883 43491794 44009237 42792639 40118739 37397152
13270 37397152 35832474 35379070 34205523 30532193 25199298 20286098 16694494 14351564
13262 14351564 12962804 12320409 12348635 12944518 13792201 14212317 13799304 12996716 12385513
13253 12385513 12351740 12936626 14176646 16233901 19196559 23151315 27959741 32833904
13245 32833904 36288981 36780403 33943082 28911676 23464797 18714517 14922435 12039155
13237 12039155 9868315 8214093 6970526 6001496 5224143 4552936 4014743 3597205 3233711
13228 3233711 2872079 2571490 2328438 2145115 1968817 1787385 1652053 1534284 1420158
13219 1420158 1343197 1284422 1222529 1137484 1071116 976819 912882 897484 855538 814944 787800
13208G87800m7810j9051p431m4356l4510j4786r427J25k7970n8453l6262K4386
13196E12255K9794j6047l4598j5101j7493j7873k2151j9690K100k540K383J4130
13184D15169k6452j8394j4009o522K1035M381J4338q918m6968k4814K2410j1615
13172C19641j6090j3744J0341j1058m495L073r719L0824L2792J2207L2632J5723
13160D02127l096k8181n2258K8384R215J633k7410k6081m165M427K7334Q361l3012
13147C07278R566J4564J0483n612l0971J8180m571J7313j4570k1363K0658J7521
13135C38476J7471K0290l396k9416P086M0321J0074j6931n89J2585q084p709L632
13122C83810K1389l0146k6907Q697l4554l2189k5555j4472R939J7930k1694m3588
$$ plain form
13208 787800 739990 720939 713508 669152 634642 619856 610429 610554 582584 524131 487869 512255
13196 512255 542049 526002 491404 476303 458810 440937 418786 399096 401196 398656 401039 415169
13184 415169 388717 370323 356314 349792 370827 375208 389546 380628 333660 308846 331256 319641
13172 319641 303551 289807 300148 289090 284595 287668 277949 308773 341565 353772 386404 402127
13160 402127 399031 370850 318592 346976 356191 357824 330414 304333 300168 304595 331929 340290 307278
13147 307278 316844 331408 341891 336279 305308 323488 318917 336230 321660 300297 320955 338476
13135 338476 355947 376237 372841 343425 350511 390832 400906 383975 383386 395971 387887 380178 383810
13122 383810 405199 375053 348146 356843 322289 290100 264545 250073 260012 277942 256248 212660
13110B12660p993N727K0241K2578j3383J7825r297o908J66k061k704j3105j1745
13097B12001l2680j7014j183J6572m3874q515K8386K0646o987N677l95l2043j9581
13084A21010j6725j5233l1572K281J4484K8737J7204K8566K0514M949l7860j4543
13072A21812p111N969l708o390J0713k2278k4330l1420j0449J2494P450j382M699
13059E6069J204n941J5048J7458N145J4827k3755k2093M77J6268q354j3973J6145
13046F8525k2534m555J0200J3723J5782K1448n537l2506l7680K757L0993k820
13034E7796j588R066N034k6671J2502K2643Q40N082k660j2169j4391K0315n141
13021G0658R119J101N353r321j1575j429l1102k620L5144m560k279j7958q460
$$ plain form
13110 212660 204667 210394 230635 253213 239830 257655 248358 241450 241616 239555 236851 223746 212001
13097 212001 179321 162307 161124 177696 133822 125307 153693 174339 167352 173029 172634 140591 121010
13084 121010 104285 89052 57480 59761 74245 102982 120186 148752 169266 174215 136355 121812
13072 121812 114701 120670 116962 110572 121285 99007 74677 43257 32808 45302 52752 51370 56069
13059 56069 57273 51332 66380 83838 88983 103810 80055 57962 58439 74707 66353 52380 68525
13046 68525 45991 41436 51636 65359 81141 102589 97052 64546 26866 29623 60616 57796
13034 57796 56208 65274 70308 43637 56139 78782 79622 84704 82044 69875 55484 75799 70658
13021 70658 79777 80878 86231 76910 65335 63906 32804 30184 65328 60768 58489 40531 32071
13008C2071L0236N442L269j5455m1299l1770L4742J5931J3791K2073J7408j0693
12996G5746j4249J1047k0209J160k8660m567M7150j2055n179o647k463O984P262
12983E5320J5689J4859L6556m284O591j459Q38q486k004k5789l4085k0544J9108
12970E2310n199j0817k948J4455j174J1608j3760j5165Q355L2723M414j6902O900
12957F4800J6360J0014k445p527k6357o911Q118j527L120K6553J2021j2478k6682
12944E7059p798l565M524J6788K2227l7568k7986K2175L0320j7856l820J3574
12932F8074q903j6941j2592K9553K0930k8309l2369J6241L2747l622k6593M482
12920D2698J1899l0403K797L5727J0096J4284N8p838J752K3899o126J9006l038
$$ plain form
13008 32071 62307 67749 71018 55563 14264 -17506 17236 33167 46958 69031 86439 75746
12996 75746 61497 72544 52335 53495 24835 20268 67418 55363 50184 43537 41074 48058 55320
12983 55320 71009 85868 122424 118140 124731 123272 124110 115624 113620 87831 53746 33202 52310
12970 52310 47111 36294 33346 47801 46627 58235 44475 29310 37665 70388 74802 57900 64800
12957 64800 81160 91174 88729 81202 54845 47934 56052 54525 57645 84198 96219 83741 57059
12944 57059 49261 45696 50220 67008 89235 51667 23681 45856 76176 58320 54500 68074
12932 68074 59171 42230 29638 59191 80121 51812 19443 35684 68431 64809 38216 42698
12920 42698 54597 24194 26991 62718 72814 87098 87156 79318 81070 104969 98843 117849 114811
12907A14811j8596K5184j5104k9757J6755Q49k1054m271j1186l274m669J748m12
12894E1024J7922K3022j921K4221j2284k5401k4738m0605Q709J0487K743o278
12882B6901j4488k106N185O0699L2071j0054l8284k6025k0303L9439J5446m89
12870F7992k3402k805q593K934K6284N0454J6961k5170k5474m2356j5162R624
12858C1287K0555J163k981j2554j0260j7807n129K0990p507J3868N249L6727J979
12845G5580M027P152J6719O216k0536l849m211J9440M63j3426k1396J0839J7665
12832I4683J5576J913J7432K750L7060M0146K179J1734L381l4352o1823l5537
12820I5142k7806J4515P471n897j2770K6639L2638J858n834o739k7559J8585J9291
$$ plain form
12907 114811 96215 121399 106295 76538 93293 94142 73088 68817 57631 54357 49688 51436 51024
12894 51024 68946 91968 90047 114268 101984 76583 51845 11240 19949 30436 33179 26901
12882 26901 12413 10307 15492 76191 108262 98208 59924 33899 13596 53035 68481 67992
12870 67992 44590 41785 33192 36126 62410 112864 129825 104655 79181 36825 21663 31287
12858 31287 51842 53005 50024 37470 27210 9403 4274 25264 17757 31625 36874 73601 75580
12845 75580 79607 86759 103478 109694 89158 85309 81098 100538 101001 87575 66179 77018 94683
12832 94683 110259 112172 129604 132354 169414 209560 211739 223473 226854 192502 130679 95142
12820 95142 67336 81851 89322 83425 70655 97294 129932 131790 125956 119217 91658 110243 129534
12807A29534K5723J5679R149J894J6521L5601J3522p196o13K9699K3595j6373
12795B76735l6549k3859j6098j2354j9481j8985O607j3798j6352j0662l2023j259
12783H1922L0912m048J8537k1999J2041M0046K0115k1815m1349J310J0321N017
12771A31010L0260K5439K2844k0138q822K278O251o932j8854l4370n1840K9758
12759A06884L2268p433l1009k865j1497O49J2243O424m080k6478J8220Q302j8117
12746H3511j7144m3383j9850J8746K5974J2276r097j3841J9060J7635K891K0522
12734I7300o052J0804k3792n484j9270J4060M46J2636l5023j7067L004J969J8039
12721E1570J214l2104p614L0212K5924J3409m108q015k7863o103J6976O118J7767
$$ plain form
12807 129534 155257 170936 180085 181979 198500 234101 247623 240427 239814 269513 293108 276735
12795 276735 240186 216327 200229 187875 168394 149409 156016 142218 125866 115204 83181 81922
12783 81922 112834 108786 127323 105324 117365 157411 177526 155711 114362 115672 125993 131010
12771 131010 161270 186709 209553 189415 180593 182871 189122 182190 163336 128966 77126 106884
12759 106884 139152 131719 100710 97845 86348 86997 99240 105664 101584 75106 93326 101628 83511
12746 83511 66367 22984 3134 21880 47854 60130 51033 37192 56252 73887 76778 97300
12734 97300 91248 102052 78260 72776 53506 67566 68012 80648 45625 28558 31562 33531 51570
12721 51570 52784 20680 13066 43278 69202 82611 78503 70488 42625 36522 53498 59616 77383
12708G7383J6535K975N200K0453m672l6927j8061l857j1395l976j164N805L1146
12695G9445q480r473M6639N1250J3386J1116L8804k7946k785j1214j938P379j4183
12682A72000k331l5617l1511J1348O710o531j6559Q017m329K0405J6053K8513
12670A66168n372j3541l916K7844N656k343M885J7097J6135j6549J875L8521J5896
12657B52356J361q64K4035k5368k0763o8528j8346j1497k6654J3093K1651J4108
12645A54584j6221j1805n484j3934k5638l0170J0530J6400L0589k72P320j5634
12633A00265K1876J5200K1372m967K9887J8618J2196j1478k5838K330j3162k7634
12621A38665k2717m914K581J812l3237k5862k5280R620m020r131L0817j3799m2235
$$ plain form
12708 77383 93918 96893 102093 122546 117874 80947 62886 59029 47634 43658 42494 48299 79445
12695 79445 70965 61492 108131 159381 172767 183883 222687 194741 191956 180742 178804 186183 172000
12682 172000 169669 134052 102541 113889 120599 114068 97509 105526 101197 121602 137655 166168
12670 166168 160796 147255 143339 171183 176839 174496 179381 196478 212613 196064 197939 236460 252356
12657 252356 253717 252853 276888 251520 230757 162229 143883 132386 105732 118825 140476 154584
12645 154584 138363 126558 121074 107140 81502 51332 61862 78262 108851 108579 115899 100265
12633 100265 122141 137341 158713 153746 183633 202251 214447 202969 177131 179461 166299 138665
12621 138665 115948 111034 113615 115427 82190 56328 31048 40668 36648 27517 58334 44535 2300
12608B300l1986K5566M930J6082K8594O432j6873l2096j3437K5679J0644K5911
12596E1746O711M991K3983O952m656m6473r872k524K855J786M577J2211q541J1489
12582E5235M855k0518k6276J2152k439J740K2807l07K46K5154R041l4537q673
12569C8480J3234k520k176k70j160q107Q816J2546J5260j1469k0004o681n004
12556C0945l886P291n796J8986J2558k9070J1862L820j6328m9677J5083R236k5166
12543b0142J8055J8343K7138K1792J930j1642o524q030K6304J2878k3266m2348
12531A4488l112P155N731N478J6521M553L002L4573J6911j7194j9483j7045k6228
12518B5350l601M0599K4174j531k6160r362m1123P45o726J5283K3860j1575j630
$$ plain form
12608 2300 -29686 -4120 810 16892 45486 51918 35045 2949 -10488 15191 25835 51746
12596 51746 58457 63448 87431 94383 89727 43254 33382 30858 33713 35499 40076 52287 43746 55235
12582 55235 60090 39572 13296 25448 23009 24749 47556 47249 47495 72649 81690 47153 38480
12569 38480 51714 49194 47018 46748 45588 37481 46297 58843 74103 62634 42630 35949 30945
12556 30945 27059 34350 28554 47540 60098 31028 42890 46710 30382 -19295 -4212 5024 -20142
12543 -20142 -2087 16256 43394 65186 67116 55474 48950 40920 67224 80102 56836 14488
12531 14488 11376 18531 24262 29740 46261 50814 53816 88389 105300 88106 68623 51578 25350
12518 25350 21749 62348 86522 84991 58831 49469 8346 9091 2365 17648 41508 29933 28303
12505B8303K9978R62R697J0816J3347L2405j641j887o200j8589k5898j2931j9755
12492C8607J7589K9118p639R003Rj8821K720K7388J2388N874j3729k6367K2600
12479I8740j3361j1208O517J33J3084J0858l74K041K2890J1757k3690l5682j5082
12466F6623j510J2991m668J698O62p955j8598J7934L916L3097l192J6829K846
12453A20673J5452k380k061j063J1994j5615j5663J2574j6536k8000p475k272
12441F9628K5399J356m6830j8382j8327M261J7029j2580j2995J7528O755j4853
12429A7989L1547M7444L3051l9477j4469P050L844N319j3629k88j0354r338M220
12416F2909K6764K0846M864j7268N553j3177M132M913J544k1164O829k9091j9465
$$ plain form
12505 28303 58281 59243 68940 79756 93103 125508 123867 121980 115780 97191 71293 58362 38607
12492 38607 56196 85314 77675 86678 86687 67866 70586 97974 110362 116236 102507 76140 98740
12479 98740 85379 74171 80688 80821 93905 104763 104389 106430 129320 141077 117387 81705 66623
12466 66623 65113 78104 73436 75134 75796 67841 49243 67177 71093 104190 100998 117827 120673
12453 120673 136125 133745 131684 130621 142615 127000 111337 123911 107375 79375 71900 69628
12441 69628 95027 96383 49553 31171 12844 17105 34134 21554 8559 26087 32842 17989
12429 17989 49536 96980 130031 90554 76085 83135 86979 92298 78669 78381 68027 58689 62909
12416 62909 89673 110519 115383 98115 103668 90491 94623 99536 101080 79916 86745 57654 38189
12403C8189M29j0868R310J8107L7167J2109p483Q681J1548q502j3479q716j9877
12390F6615j3657K673p966J6090K9025K3402J832j8528j8406J1006j0594k4236
12378E7256J841L7919K3272j4362l1982j8443L5592J7931K1482J1984K1744N140
12366A69374n1094o749J2605j371L939J0313p877l4293k6615J2159m250L949K1908
12353A01998K608n712j1449m948n598j1303L2482k878j9127O216m92k2832j8972
12340C9993J2312M4289R643r742J8678k6023p069J6786r13R252K0148J558N176
12327A34088K9309K2272k7515K932J6242N202R940k0879l0790K1358L8839j806
12315A99192m6335j1617k2275K0541M0219k435R358L3410L633k2105n12m21j1548
$$ plain form
12403 38189 38618 27750 37060 55167 92334 104443 96960 105641 117189 108687 95208 86492 66615
12390 66615 52958 55631 47665 63755 92780 116182 118014 99486 81080 92086 81492 57256
12378 57256 59097 97016 120288 105926 73944 55501 91093 109024 130506 142490 164234 169374
12366 169374 118280 111531 124136 122765 126704 137017 129140 94847 68232 80391 76141 80090 101998
12353 101998 104606 98894 87445 82497 76899 65596 98078 95200 76073 82289 81797 58965 39993
12340 39993 52305 96594 106237 96495 115173 89150 82081 98867 97954 107206 127354 128912 134088
12327 134088 163397 185669 158154 161086 177328 182530 192470 171591 140801 162159 200998 199192
12315 199192 152857 141240 118965 139506 179725 177290 186648 220058 223691 201586 201074 200653 189105
12302A89105L4612M8038L2253K997p096o775J4228N311l1891J2761M3328O2146
12290C99017l1870j2231N1827O6632J925J339J8804K4215L4144j3908K8050N9646
12278F27590M8939L6989O223J3492P4026O0275P0236M4534N8794Q4038J33735
12267A258871J02799J05996J59408J84671J90075J83852K37642L39410M38215
12258C200939N05190O06899P53176R86717J221112J600069K131124K841071L737000
12249A7583297M694179N289196M896793L083777J00437k801560m439927m616420
12241B3789772l964056l043599k199947j464138p46701j15154L92753P17801N28277
12232A3895008j49168p47068p06108k00371N34520J340873K209219L221274M203085
$$ plain form
12302 189105 223717 271755 304008 307005 299909 293134 307362 312673 280782 293543 336871 399017
12290 399017 367147 354916 406743 473375 475300 476639 495443 519658 553802 539894 567944 627590
12278 627590 676529 713518 719741 733233 807259 867534 937770 982304 1041098 1125136 1258871
12267 1258871 1361670 1467666 1627074 1811745 2001820 2185672 2423314 2762724 3200939
12258 3200939 3706129 4313028 5066204 6052921 7274033 8874102 11005226 13846297 17583297
12249 17583297 22277476 27566672 32463465 35547242 35647679 32846119 28406192 23789772
12241 23789772 19825716 16782117 14582170 13118032 12371331 12256177 12648930 13366731 13895008
12232 13895008 13745840 12998772 12292664 12092293 12626813 13967686 16176905 19398179 23601264
12223B3601264M434000L509148K042397J461448K050184K861771K777466J518516
12215D4256194k20912j499400k066415k748219m006759n072587n038993m150574
12207A9452335k998340j956588j090683m02946J95776M53598J68187n20621r54174
12198A2346544q20223l97408J92790P23744J312611J971365K754878L508704M084136
12189B5677141L918297K592426J90424k401527m125930m593763m158828l385908
12181A3712332k569758j962453j483239j124424r17180p18926o09079n13027m10977
12172C403269l39248k95246k48229k25312j84266j63079j34154q7976r4464q6268
12162A545027p6211o8933n7247o5001q0241n5620m5174m4512n6210n3043n5680
$$ plain form
12223 23601264 28035264 31544412 33586809 35048257 37098441 39960212 42737678 44256194
12215 44256194 44035282 42535882 40469467 37721248 33714489 28641902 23602909 19452335
12207 19452335 16453995 14497407 13406724 13003778 13199554 13653152 13821339 13300718 12346544
12198 12346544 11526321 11128913 11321703 12045447 13358058 15329423 18084301 21593005 25677141
12189 25677141 29595438 32187864 32378288 29976761 25850831 21257068 17098240 13712332
12181 13712332 11142574 9180121 7696882 6572458 5655278 4936352 4327273 3814246 3403269
12172 3403269 3064021 2768775 2520546 2295234 2110968 1947889 1813735 1725759 1631295 1545027
12162 1545027 1468816 1399883 1342636 1277635 1197394 1141774 1096600 1052088 995878 942835 887155
12151H87155k9312O09q691l6507l6921J947M698j5438r698j3401m5167R032L4
12138G08340j5839k3000k8714M2736M9730O478l6675l3709k7290J3072K4927K2135
12126G02191j5750o959m3263J7900N0954K8077j1685j2757q167j1122k2632r810
12114F56977J2607N453j8358p879l2315j4582J1328N4578M8342J9014j8638k5874
12102F90653l5232m0156k3169K2026M8404N1200M999k8688R770O444J0244K1398
12090G37893j6348K1086J2138j1323J456K0278J3210k3906l1339m562L0732J2239
12078G61554l9622J754l40j9214P111K5165k7225k7082j264J8631M6335J6923
12066G62726J502K3251J7965J9741n473k6773k8143R361J2791m253l285m3530
$$ plain form
12151 887155 857843 858452 849761 813254 776333 778280 782978 767540 757842 744441 699274 708306 708340
12138 708340 692501 669501 640787 683523 733253 739731 703056 669347 642057 655129 680056 702191
12126 702191 686441 679482 636219 654119 705073 733150 721465 708708 700541 689419 666787 656977
12114 656977 669584 675037 656679 648800 616485 601903 613231 667809 716151 735165 716527 690653
12102 690653 655421 615265 592096 614122 662526 713726 718725 690037 699807 706251 716495 737893
12090 737893 721545 742631 754769 743446 744902 765180 778390 754484 723145 718583 749315 761554
12078 761554 721932 723686 723346 704132 711243 736408 709183 682101 680837 699468 745803 762726
12066 762726 764228 787479 805444 825185 819712 792939 764796 774157 786948 782695 779410 735880
12054G35880J9325L6948l22k3765K5626l070j1360J7695J0167j9247o265J7641
12042G99253K1147K9675J7961J608k4067L9292J7860M704j3114J370J8406k1190
12030H92905p318K2810M7092L3038j7558l4503K5701M0750K4398P371K35j4740
12018A020181O059M2032K8637L9541M7131N3294K4814K7793K5163K3655K6054
12007A364354L6071K0791M3109M0280J3973L7432P9209P0970P8777Q7469Q2760
11996A955195J34753K18879L01047L76074L64941J48965j92516l34607k59388
11987B713343j30791m2556K5427l387J3568L7424L5206K3912L2536Q0896Q5061
11976B870639R5012O5902Q4350P0525O2137J32370Q9004J06514J09951J14395
$$ plain form
12054 735880 755205 792153 791831 768066 793692 790622 779262 796957 807124 787877 781612 799253
12042 799253 820400 850075 868036 869644 845577 884869 902729 907433 894319 895689 914095 892905
12030 892905 885587 908397 955489 988527 970969 936466 962167 1002917 1027315 1034686 1034921 1020181
12018 1020181 1026240 1068272 1096909 1136450 1183581 1236875 1261689 1289482 1314645 1338300 1364354
12007 1364354 1400425 1421216 1464325 1504605 1518578 1556010 1635219 1706189 1784966 1872435 1955195
11996 1955195 2089948 2308827 2609874 2985948 3350889 3499854 3307338 2972731 2713343
11987 2713343 2582552 2539996 2565423 2562036 2575604 2613028 2648234 2672146 2704682 2785578 2870639
11976 2870639 2965651 3031553 3115903 3186428 3248565 3380935 3469939 3576453 3686404 3800799
11966C800799J47703J20617J14336J07335J56998J39533J45066J60853J53691
11957E046931J58643J49282J47117J80971J77633K15047K03654K07814J66509
11948F653601J72023J92715K09460K17043J96785J69477J78311J81257K00789
11939H371461K04199K45175J79460J36032J77013J43330J05587J13253P1302M2369
11929I789181O7072K7664P405k2869k8431n0535m8431j01077q4718p5859j49022
11918I330380j93390j77451j48558j60252j95338j93426j99692j70382j99149
11909G692742k03063j84448k09570k25756j97845k07942j88700j72046j97481
11900E905891k01095j69523j61157j98228j59080j35632j29068j33115j40330
$$ plain form
11966 3800799 3948502 4069119 4183455 4290790 4447788 4587321 4732387 4893240 5046931
11957 5046931 5205574 5354856 5501973 5682944 5860577 6075624 6279278 6487092 6653601
11948 6653601 6825624 7018339 7227799 7444842 7641627 7811104 7989415 8170672 8371461
11939 8371461 8575660 8820835 9000295 9136327 9313340 9456670 9562257 9675510 9746812 9789181
11929 9789181 9856253 9883917 9891322 9868453 9840022 9789487 9741056 9639979 9555261 9479402 9330380
11918 9330380 9136990 8959539 8810981 8650729 8455391 8261965 8062273 7891891 7692742
11909 7692742 7489679 7305231 7095661 6869905 6672060 6464118 6275418 6103372 5905891
11900 5905891 5704796 5535273 5374116 5175888 5016808 4881176 4752108 4618993 4478663
11891D478663j54771j21592j48693j30297r3499r6018q7204j36938j24678q8360
11881C296613n6257o8472r4241j03089q3145q3776p5714p8300m7744r6830o6723
11870B442322m2748o3304m9077n2429p2021n5092n4197l2072o0630r3620m4325
11859A822807k3934k0243l6776o2606m7287l1118r693j697j5420n9505m8516l7469
11847A428543l4352k2311j1560l5768k8731j6728j7085k9879m3265k7504K736
11836A164096k2962m3221j9358j0165l2957m1279O05k3495l674j4951l5136m6513
11824H70990J7796K7518p009k5193K0358P23n096N7707J0984K2055L5221n242
11812A020812k9800n7343n1174p8596k9357M506k1838L227J6037J0215q591J62
$$ plain form
11891 4478663 4323892 4202300 4053607 3923310 3829811 3733793 3646589 3509651 3384973 3296613
11881 3296613 3240356 3171884 3077643 2974554 2891409 2807633 2731919 2653619 2605875 2509045 2442322
11870 2442322 2399574 2336270 2287193 2234764 2162743 2107651 2053454 2021382 1960752 1867132 1822807
11859 1822807 1798873 1778630 1741854 1679248 1631961 1600843 1591150 1589453 1574033 1514528 1466012 1428543
11847 1428543 1394191 1371880 1360320 1324552 1295821 1279093 1262008 1232129 1188864 1161360 1164096
11836 1164096 1141134 1097913 1078555 1068390 1035433 994154 994759 971264 967590 952639 917503 870990
11824 870990 888786 916304 909295 884102 904460 905183 900087 957794 968778 990833 1026054 1020812
11812 1020812 991012 933669 882495 803899 774542 779048 757210 760437 776474 786689 778098 778260
11800G78260M077Q033J4633J332k586k5732o0477n0395k6467n43k5933o803j7335
11787E90064Q710K7084J1303P171J2595j7423N279Q369o070m2363k1497m271K2999
11774F01950M2491K3497K5778L5244L1635l236k9170l2275r461Q959j7655k8520
11762F49237m5288o8689m137J0421m26P317O264R834m6737j6465l541k9881k0820
11749D47089l197L159N56J7184N357J48q005J413n698J518K435j6675r572j4235
11735D21477k6898l0605l0812j2435p016j7646k4495K6282Q333O119n748O984
11723C13540j9435j1592L358q194l0417j3021j1260l4021J4408J3081J4679N626
11711B36752J7979j1573J763k493L7955R141j96l277j7400P455J8940p097J2669
$$ plain form
11800 778260 782337 790370 805003 806335 803749 778017 717540 667145 640678 640135 614202 607399 590064
11787 590064 598774 625858 637161 644332 656927 639504 644783 653152 647082 604719 583222 578951 601950
11774 601950 644441 667938 693716 728960 760595 757359 728189 695914 686453 695412 677757 649237
11762 649237 603949 535260 531123 541544 541118 548435 554699 564533 517796 501331 497790 467909 447089
11749 447089 443892 447051 447607 464791 470148 470296 462291 463704 458006 459524 461959 445284 435712 421477
11735 421477 394579 363974 333162 320727 313711 296065 271570 297852 306185 312304 306556 313540
11723 313540 294105 282513 285871 277677 247260 234239 222979 188958 203366 216447 231126 236752
11711 236752 254731 243158 244921 242428 280383 289524 289328 286051 268651 276106 295046 287949 300618
11698C00618J6531n124k0162j20j3925J5705L0003k7457k5906l9666o3034j51332
11686A6131j99454j68998j937Q6414J20437J10050O9833L2378K7387L7382K5023
11675A54646J3460l6027J2338K7996j3077J970L5408M924j4474k1943q702J2105
11663A68624L69J2567J114k5984n771J5994K5276L7785L1571j2670j8053K8577
11651B59399j5834l231J0993k1240k6l1427k0987R669K6052K5801J8408j8257
11639B39320P093Q732K740K0001N460J8598r11P214K1905J881k763J0351j2543
11626C27078j0167J9517K4756P254m930p836L5395J8940K55K8946K5117J6331
11614D80656l1093l9261K2624M1463K2332K9201M3930O3371L7538n787j2614K9932
$$ plain form
11698 300618 317149 312025 291863 291743 277818 293523 323526 296069 270163 230497 167463 16131
11686 16131 -183323 -352321 -354258 -267844 -147407 -37357 32476 64854 92241 129623 154646
11675 154646 168106 132079 144417 172413 159336 161306 196714 201638 187164 165221 156519 168624
11663 168624 168993 181560 182674 156690 150919 166913 192189 229974 261545 248875 230822 259399
11651 259399 243565 240334 251327 230087 230061 198634 177647 187316 213368 239169 257577 239320
11639 239320 246413 255145 257885 277886 283346 301944 301033 308247 330152 332033 329270 339621 327078
11626 327078 316911 336428 361184 368438 363508 355672 391067 410007 410262 439208 464325 480656
11614 480656 449563 410302 432926 474389 496721 525922 569852 633223 670761 664974 652360 682292
11602F82292K6483J3952K1944M8701P0878Q8211O3666J5441L0831P4763N5810
11591A192972Q8335R5230N4688R3742J17120J42199J45415J42591J75823K34185
11581B482300K66447K88328L36638M04796M35389N24865O44927Q08950J048025
11572G240665J352422J727809K220852K744627L284370L890723M992802P324750
11564C4779020J1720070J9179475L1489607N0124225P2114540P9921893L7767168
11557C37095998m4595265q3229445o8930024m4578437k7445788j7262432j1211841
11550C9842766p476007n319002m223948l593893k974552k468400j979765j603845
11542A0203354j299071j065775r23376p88653o37341n16050l71548l46986l20860
$$ plain form
11602 682292 708775 722727 744671 793372 864250 952461 1016127 1031568 1062399 1137162 1192972
11591 1192972 1281307 1376537 1431225 1524967 1642087 1784286 1929701 2072292 2248115 2482300
11581 2482300 2748747 3037075 3373713 3778509 4213898 4738763 5383690 6192640 7240665
11572 7240665 8593087 10320896 12541748 15286375 18570745 22461468 27454270 34779020
11564 34779020 46499090 65678565 97168172 147292397 219406937 299328830 337095998
11557 337095998 292500733 209271288 140341264 95762827 68317039 51054607 39842766
11550 39842766 32366759 27047757 22823809 19229916 16255364 13786964 11807199 10203354
11542 10203354 8904283 7838508 6915132 6126479 5489138 4973088 4601540 4254554 3933694
11533C933694k85270k51873k15813j85907j93610j84309j56931j75900j30288
11524B153793q1390r0182q6772p7426j24307j00787m3631m2981m5298q4827j03538
11513A272654p9270o7206m7710j9589n999l1322r745k735K910k5258p2025m7544
11501H67161k5207j4147o864j9730k4392j2879k2868j3125m8464m499K9230L435
11489G07651j6695j7625K371L5930K8134o076k018k3309k9901p9950k1124j4652
11477E62736l508k3318j1036K7271J6980p576m6476k3290l0412k0462k716K500
11465D40693j5455k1683j7754j1180l178j2609j6371P122J1708R30J209J2001
11453C75433J6677j9j6989J2963K629k1693k612j6430P095M248K0944K8306N4284
$$ plain form
11533 3933694 3648424 3396551 3180738 2994831 2801221 2616912 2459981 2284081 2153793
11524 2153793 2072403 1982221 1895449 1818023 1693716 1592929 1549298 1506317 1461019 1376192 1272654
11513 1272654 1193384 1126178 1078468 1058879 1052880 1021558 1011813 1009078 1011988 986730 914705 867161
11501 867161 841954 827807 820943 801213 776821 763942 741074 727949 679485 674986 704216 707651
11489 707651 690956 673331 675702 711632 739766 733690 731672 708363 678462 598512 577388 562736
11477 562736 559228 535910 524874 552145 569125 561549 515073 491783 461371 440909 438193 440693
11465 440693 425238 403555 385801 374621 371443 358834 342463 349585 361293 362223 363432 375433
11453 375433 392110 392091 375102 388065 390694 369001 366389 349959 357054 361302 382246 410552 464836
11440D64836N0277M8812L7165N4121M3300N7905J42463J46624J07662J0871j32346
11429A031690j87124j68227j28168n8910m0902l8546j5460k8980m0556J3566L028
11418C41411J1033j3127l0790N064N188k2276j2882J7492K5934q321o649p591
11406C04486j4892k764J1861K2505N869o772j7497n140j8528J3662K1317j2224
11394C01883k8450j8783K397R873k8367l0923j5305k704N779J1660k143N451l129
11381B07239J2519l6170o23R629J7150j7008k041Q937j896J011p295J0664p4J2425
11367B14467R600K4239j8307l1718k1850m1969m7092l8981Q141J2026J5368O978
11355I0902M257K944k2768J3593K2642Q2k0542O436p325K5737K8217J9912j5677
$$ plain form
11440 464836 515113 563925 601090 655211 698511 756416 898879 1045503 1153165 1164036 1031690
11429 1031690 844566 676339 548171 489261 448359 409813 394353 365373 324817 338383 341411
11418 341411 352444 339317 308527 313591 318779 296503 283621 301113 327047 318726 312077 304486
11406 304486 289594 286830 298691 321196 327065 320293 302796 297656 279128 292790 314107 301883
11394 301883 273433 254650 257047 266920 238553 207630 192325 189621 195400 207060 204917 210368 207239
11381 207239 219758 183588 182965 192594 209744 192736 190695 199632 197736 198747 191452 202116 202042 214467
11367 214467 224067 248306 229999 198281 176431 134462 87370 48389 56530 68556 83924 90902
11355 90902 95159 98103 75335 88928 111570 111652 91110 97546 90221 115958 144175 164087 148410
11342A48410j8420J3563j2842l6360l8585Q640L1383J5977k3896k1141K518J5904
11330H5151J5507m2233O005L9318K4702j3402k7711j9993J0648P057N869K9692
11318A20610n367r211l535J9986J0933m665J5160P212l4760k0987K568J5673L871
11305A17488J2748Q093k5631J474J0761O238r07k0941l4092n028L1384K2193j6495
11292A07285o730k667K016j6506k6344o093L1974m28J0693j5092J5069r94J079
11279I3262J9301Q115m393l5960l4188K7242K2094P347K0851j8731k1485l3936
11267D9519J1023K1387j5640J5236K116J4390K0061R635j9133k028j6658J4867
11255A04775J0310l702j6996l5719K9930J5456m72l8192K3155K6508q107k7188
$$ plain form
11342 148410 129990 143553 130711 94351 55766 64406 95789 111766 87870 66729 69247 85151
11330 85151 100658 58425 64430 103748 128450 115048 87337 67344 77992 85049 90918 120610
11318 120610 115243 106032 102497 122483 133416 128751 143911 151123 116363 95376 97944 113617 117488
11305 117488 130236 138329 112698 114172 124933 131171 130264 109323 75231 70203 101587 123780 107285
11292 107285 100555 97888 99904 83398 57054 50961 82935 82507 93200 78108 93177 92183 93262
11279 93262 112563 120678 116285 80325 46137 73379 95473 102820 123671 104940 83455 49519
11267 49519 60542 81929 66289 81525 83641 98031 118092 127727 108594 106566 89908 104775
11255 104775 115085 111383 94387 58668 88598 104054 103582 65390 88545 115053 106946 79758
11243G9758k6766K9737K439k0392l1503M53Q124J9423L5867j0446q245J4868j6656
11230G6661o64J9868J7138J3357q710m9260k6228R05J6458M862r125J6136R384
11217H0782J2738k4576k5932L2927J1423j6964m035k0134j6907J9161J3887J6247
11205G8617j3037p616K4761j1538J118K551J043N656J9178J0778J3941j1057j7671
11192I6724l8977j4492k890J6454L2084K9464j0099J2445K6766l68j0473r026
11180A27612J9347K5118K2866j873p075k7316j615k4406n919m55l305j0979j5313
11167I6687r626j4754l055L7028J4538k4323K9462Q001n8443m0032N2q56J7469
11154E2148J7107m53L5842N3652M794j3853j2120M949K000k3439l5725l0871n1318
$$ plain form
11243 79758 52992 82729 85168 64776 33273 33726 41850 61273 97140 86694 78449 93317 76661
11230 76661 75997 95865 113003 126360 117650 68390 42162 43067 59525 64387 55262 71398 80782
11217 80782 93520 68944 43012 75939 87362 70398 66363 46229 29322 48483 62370 78617
11205 78617 65580 57964 82725 71187 72305 74856 75899 81555 100733 111511 125452 114395 96724
11192 96724 57747 43255 40365 56819 88903 118367 108268 120713 147479 147111 136638 127612
11180 127612 146959 172077 194943 193070 185995 158679 157064 132658 126739 126284 122979 112000 96687
11167 96687 87061 72307 69252 106280 120818 96495 125957 133958 75515 35483 35535 34679 52148
11154 52148 69255 68802 104644 158296 163090 149237 137117 142066 144066 120627 84902 54031 2713
11141B713J2129L6290P284M01k0681j5615k691N1212N2341O099J8656p727j0485
11128A29926K9470K7983J2552M945P5123J08465J75268K17609K95942L59165K04672
11117A641120j63258l60130l22810k13242j39369j00073l1429l6630k4480j0493
11107B39206j5111k9182k5749m5646m1922j9064o545k4640K314K7364R371R880
11095H0276o950l3190q4k459N718J827J2848L116o758r830K842j2432J0938q702
11081C7160l132L9999j9698k4985j2389l6148k2602R890L1411L7113L0067M000
11069G0686J298Q145p175k529O540Q48P276O810k07J3O524r259k7013j5049J2991
11054E9899J3377j1348K0458n801O72J3988J0014K0559J6986K1993k5239j7420
$$ plain form
11141 2713 14842 51132 58416 58817 38136 22521 19830 71042 123383 129482 148138 140411 129926
11128 129926 159396 187379 199931 204876 279999 388464 563732 781341 1077283 1436448 1641120
11117 1641120 1477862 1117732 794922 581680 442311 342238 310809 274179 249699 239206
11107 239206 224095 194913 169164 123518 81596 62532 55987 31347 33661 61025 70396 80276
11095 80276 73326 40136 40052 37593 43311 45138 57986 61102 54344 44514 47356 34924 45862 37160
11081 37160 34028 74027 54329 29344 16955 -19193 -41795 -31905 -494 36619 66686 70686
11069 70686 71984 80129 72954 70425 76965 77813 85089 91899 91692 91705 98229 88970 61957 46908 59899
11054 59899 73276 61928 82386 76585 77257 91245 101259 121818 138804 160797 135558 118138
11042A18138L422K1687P553Q593R964j46J5548M7628O8244L7421J7428M607k4295
11029C35792j9136n9363k8086r048k611N0830P5877Q6817N1590J021l7035p7117
11017C69531p8143k4333j1787k1057k0151K7317M9565M1328K144l188k2193m2231
11005B66802o1019n2027l4310j6118K4780Q07k809l974n469Q46p580L720k6863
10992H6786j9943k669j059J6214r621m272k3992l2697R499O520l07K1809j1011
10979C5257k6551j2739J4055K1670N009O263N09j6708Q487K1030P957j8235l9440
10966F564J2776M707j4485k3594j7074J8076J9156k3175l285J9199K6089k677
10954B2277J1134J1368j0607N69J9092j158k8617N70J4478j4283K4343L4155m1225
$$ plain form
11042 118138 121560 143247 150800 159393 169357 169211 184759 232387 300631 338052 355480 360087 335792
11029 335792 316656 257293 229207 220159 217548 268378 344255 431072 482662 483683 446648 369531
11017 369531 291388 267055 255268 234211 214060 241377 290942 332270 334414 331226 309033 266802
11005 266802 205783 153756 119446 103328 128108 128915 126106 122132 116663 117509 109929 113649 86786
10992 86786 66843 64174 63115 79329 69708 65436 41444 8747 18246 24766 24459 46268 35257
10979 35257 8706 -4033 10022 31692 36701 42964 43473 26765 35252 56282 64239 46004 6564
10966 6564 19340 24047 9562 -14032 -31106 -13030 6126 -17049 -20334 -1135 24954 22277
10954 22277 33411 44779 34172 34741 53833 52675 24058 24628 39106 24823 49166 83321 42096
10941D2096j9901j4213o774J145J9746p408K1492j2001N175J2241l1311R494J1461
10928C1242K2640n295k6128J970J8326j9981J9932J4598j1420k4168m769m508
10916A2439k197q281l4878p808L4588J2221J0424k7536R643Q487J9683J8428k403
10903D2810K8677K3944j5466j1288j8109K1382M3916O933k0580m8650k1742j003
10891C0824J2281j3242R330K8219j2296k6902m179N561K2892O892j1095l2748
10879A5537L9247K0748P729P574j4727l8271J5340N0177N061m3031m2772l9924
10867a7312J8391q047J0634O646k221L3048J0008r832j4502o677N457k1783L1120
10854C4930M0967j3376j1351J2523k3411M667O413k4040k120L0563K8711J1872
$$ plain form
10941 42096 22195 7982 1208 2353 22099 14691 36183 24182 29357 41598 10287 19781 31242
10928 31242 53882 48587 22459 24429 42755 22774 42706 57304 45884 21716 16947 12439
10916 12439 10242 1961 -32917 -40725 -6137 6084 16508 -11028 -1385 7102 26785 45213 42810
10903 42810 71487 95431 79965 68677 50568 71950 115866 122799 102219 53569 31827 30824
10891 30824 43105 29863 39193 67412 55116 28214 24035 29596 52488 59380 48285 15537
10879 15537 54784 75532 83261 90835 76108 37837 53177 103354 108415 65384 22612 -17312
10867 -17312 1079 -6968 3666 10312 8091 41139 51147 41315 26813 20136 25593 3810 34930
10854 34930 75897 62521 51170 63693 40282 44949 51362 27322 25202 55765 84476 96348
10842I6348L49j3268j7967k5101M169J7671J7859J9425N309j2820k5265j3248
10830E3461j1340k142j9230k5326P541K7996J4075P483Q88k4372q556o393j8116
10817d031M1906Q135K2942R648k8010l604n176J7763j9870m19M684j6779J519
10804B8708p520j0845J1400J6846J0859k2248l5636K7093K1371p48M322o331m0778
10791c507k7062K1828K2673K1065k9265k2355m449J1455K0317N205L1209j068
10779D6046k723J8469J9828j2922n859J0684O926N636k0573j5000r68p345O315
10766D8514p454L300K276R746k5111j3387j2793n095m872K4173M719K282p963
10753A8335k4276J1317J2055l75R350P172J2737K548k7505k3031j2243j6284l234
$$ plain form
10842 96348 96697 83429 65462 40361 44530 62201 80060 99485 104794 91974 66709 53461
10830 53461 42121 39979 20749 -4577 2964 30960 45035 52518 53406 29034 20478 14085 -4031
10817 -4031 37875 46010 68952 78600 50590 46986 41810 59573 39703 39284 43968 27189 28708
10804 28708 21188 10343 21743 38589 49448 27200 -8436 18657 40028 39280 43602 37271 -3507
10791 -3507 -30569 -8741 13932 34997 5732 -16623 -21072 -9617 10700 15905 47114 46046
10779 46046 43323 61792 81620 68698 62839 73523 80449 86085 65512 50512 49544 42199 48514
10766 48514 41060 44360 46636 56382 31271 17884 5091 -4 -4876 19297 24016 26298 18335
10753 18335 -5941 5376 17431 17056 26406 33578 46315 48863 21358 -1673 -13916 -30200 -33434
10740c3434j2322k3305J4541K1684J0621M1389N730j4844k0022j5994k970j7344
10728d6270k8709K651p12O845N1570K6820k1563l956O344l8814l0278k8745l7
10715a04854R74K5258R570J2557J0246L529k025j6835K084k1156k8455J390L036
10702a04681J689L4270K3228j1264j4034L269k4031k5833J6188L2730K2658j944
10690d7755j7076j7350o262M458m838N0148O6918L3459j0944j3369j6443j2323
10678H623N585K5386K1657l2797j5729q947L4374J6102j78L364n782k6978k0638
10665D042M0205N6701L2158J3121J9439K7912M7666J4055m1484k6576j5068j6364
10653A55807M922J0876j7721K3658K9893M2020J0922j5692l481L414Q954q007
$$ plain form
10740 -33434 -45756 -69061 -54520 -32836 -22215 19174 24904 10060 -9962 -25956 -28926 -46270
10728 -46270 -74979 -72328 -73040 -66195 -14625 12195 -9368 -13324 -6980 -45794 -76072 -104817 -104854
10715 -104854 -103880 -78622 -69052 -56495 -46249 -42720 -44745 -61580 -59496 -80652 -109107 -107717 -104681
10702 -104681 -102992 -68722 -45494 -56758 -70792 -67523 -91554 -117387 -101199 -68469 -45811 -47755
10690 -47755 -64831 -82181 -88443 -83985 -88823 -38675 28243 61702 50758 37389 20946 8623
10678 8623 14208 39594 61251 28454 12725 3778 38152 54254 54076 57440 51658 24680 4042
10665 4042 44247 100948 133106 146227 165666 193578 241244 255299 213815 187239 172171 155807
10653 155807 160729 171605 153884 177542 207435 249455 260377 244685 241204 244618 253572 245565
10641B45565K4108N7178K9574K6378O4343J04763Q9817N5308J31800J71919J64353
10630A165106J20152P6674P9376J35208J69000K31205L54516M72768O52197R83751
10620D439953J350373J828734K510871L289350L981662L908113K487789K39423
10612B4036268j390161j750782j198176j60520J108835K635638M516129O652738
10604C4449969Q438193Q049260L919108k109021n789169n903621m096573j754492
10596C5203654O59630L255896O069747R027218J0945556R425268K576301o253842
10588G0909428j0771455j0193533p452749m520797j845100N75403K931738N040651
10580D4673586O061995M438552m98413o187932q656215p731866n578794l528812
$$ plain form
10641 245565 269673 326851 356425 382803 447146 551909 641726 697034 828834 1000753 1165106
10630 1165106 1285258 1361932 1441308 1576516 1745516 1976721 2331237 2804005 3456202 4439953
10620 4439953 5790326 7619060 10129931 13419281 17400943 21309056 23796845 24036268
10612 24036268 22646107 20895325 19697149 19536629 20645464 23281102 27797231 34449969
10604 34449969 42888162 50937422 54856530 52747509 46958340 41054719 36958146 35203654
10596 35203654 35863284 39119180 45188927 54216145 65161701 74586969 77163270 70909428
10588 70909428 60137973 49944440 42491691 37970894 36125794 36701197 39632935 44673586
10580 44673586 50735581 55174133 54675720 48487788 39831573 32099707 26520913 22992101
10572B2992101j820081m33462O92953J483429J628977O86617j320755l297684
10564B0612095m135141l754138k927767k139276j571748j135213q18404o24574
10556C505834m64337l44095k93392k32207j87115j82446j66955j75454j41273
10547A318560j18307q6321q3588o0668m2468n4745m6940m350j633l5361k7855
10536G56324q3945n6025m8631k8707r055k5057j7577L178j5909j2746q493p146
10524D46211j9773j5146J8249J546r853O096r567j6962k535K3509j3145k2516
10512C86114j6960j2396k4718j2257L471o446K4427O951m6809q027O722l9649
10500B60423p66L5026m2408k8518J3509R698O512k459m759L0906p868j2457k9685
$$ plain form
10572 22992101 21172020 20738558 21431511 22914940 24543917 25230534 23909779 20612095
10564 20612095 16476954 12722816 9795049 7655773 6084025 4948812 4130408 3505834
10556 3505834 3041497 2697402 2404010 2171803 1984688 1802242 1635287 1459833 1318560
10547 1318560 1200253 1113932 1030344 969676 927208 872463 825523 821173 819540 784179 756324
10536 756324 672379 616354 567723 539016 529961 504904 487327 490505 474596 461850 453357 446211
10524 446211 426438 411292 429541 431087 421234 427330 417763 400801 398266 421775 408630 386114
10512 386114 369154 356758 332040 319783 323254 316808 341235 348186 301377 293350 300072 260423
10500 260423 259657 294683 252275 223757 237266 246964 253476 251017 246258 277164 269296 256839 227154
10487B27154o426L3397l2146N653J7019K5653J8922m518j1763n698K5870M9540
10475C42657j805l5725j1047r585j5108j8804j2831j2680K9422L3239L8610M5231
10463C71574K5488l2844l4546j0537R583j2220l1525J0286N772l038N799J5866
10451C19658k5778n2324m2540j0512k46O948n045K669P321L7967J7582j6494K944
10438B42150l3046j8749q269j9496j8903R789N033l173N874m2187o892J6473r748
10425A18856m0053j1304K0815J7682l636K7469J6115J418k6391k8060K0293J2429
10413A25633K790n445q317k3101Q236j7347j3908J6986M348j2697o667L848N094
10400G9453j9882j9487J0254O443j9998N318J928J3926J6770j7567k0551k5265
$$ plain form
10487 227154 220728 254125 221979 227632 244651 270304 289226 284708 272945 267247 293117 342657
10475 342657 340852 305127 294080 284495 269387 250583 237752 225072 254494 287733 326343 371574
10463 371574 397062 364218 329672 319135 328718 316498 284973 295259 301031 297993 303792 319658
10451 319658 293880 241556 199016 188504 188258 195206 190161 192830 200151 238118 255700 239206 242150
10438 242150 209104 190355 182086 162590 143687 153476 158509 155336 161210 119023 112131 128604 118856
10425 118856 78803 67499 88314 105996 102360 129829 145944 147362 120971 92911 113204 125633
10413 125633 128423 122978 114661 91560 99796 82449 68541 85527 89875 77178 70511 74359 79453
10400 79453 59571 40084 50338 56781 36783 42101 44029 57955 74725 57158 36607 11342
10388A1342q237O820J2641j4535K7336K8567R061j3226j7935K853K7318P527J1046
10375I0578j3853q693L849l733L1401J8881k5903j8232l932J5134O620M456k2387
10362G4186l2173O959J1320J7781P942p182j8066O574K2550j7582k5263m360n119
10349C7567L256O459m978Q755P808l2084k7911J2105K2819R809K7471L9026m054
10336A06048N447l5020J0386K4933m6812K102J2479j7528m900N490J6900j2030
10324F7495m0990k917k0500k6805n809R971J1894K8962L0410J5473N947J6934
10312I0065j0294k267q804k6891J6295K6049m09k4072K03M1854J5987j3401n6447
10299D7868l1557M6267j3298k0542j1126R83m094r91O276N095j0482m188L6732
$$ plain form
10388 11342 3105 9925 22566 8031 35367 63934 72995 59769 41834 44687 72005 79532 90578
10375 90578 76725 68032 71881 68148 99549 118430 92527 74295 70363 85497 92117 96573 74186
10362 74186 42013 48972 60292 78073 86015 78833 60767 67341 89891 72309 47046 42686 37567
10349 37567 40823 47282 42304 51059 58867 26783 -1128 10977 33796 43605 71076 110102 106048
10336 106048 111495 76475 86861 111794 64982 67084 79563 62035 57135 62625 79525 67495
10324 67495 26505 23588 3088 -23717 -29526 -19555 -7661 21301 51711 67184 73131 90065
10312 90065 79771 77504 68700 41809 58104 84153 83744 59672 59875 101729 117716 104315 47868
10299 47868 16311 62578 49280 28738 17612 18595 14501 13510 19786 24881 14399 10211 46943
10286D6943K1883m866j3914k1009k9120j3804j1284M2467o94l3014J1947N965
10274A500k1244j0697L9919J4131R971O735j1885N854J6565k39l205K4790r138
10261F3057k9205p201j184q164j3916L2967K7396p036l551j0270j1441m0255J0034
10248A231J1368K7382p014l168m79l163P390K3539l1161J9794L8369p758j7971
10235E8359j0385L41L895R75P557k7283j1207m70O582K5270J3878j8631j0467
10222C8414j5404o331P327j9474j0099J7673J4005K9969R958j0875k1843k2656
10210A0664j2621l0653J5908K9581j706q435R302J7955K5434K0976l0116k2555
10198B3734m659r177P159J1263K920j0812J0871K6438K8667k3143j8450r179L6063
$$ plain form
10286 46943 68826 63960 50046 29037 -83 -13887 -25171 17296 16602 -16412 -4465 1500
10274 1500 -19744 -30441 9478 23609 33580 40315 28430 34284 50849 50610 47405 72195 63057
10261 63057 33852 26651 25467 17303 3387 36354 63750 56714 53163 42893 31452 -8803 1231
10248 1231 12599 39981 32967 29799 29320 26157 33547 57086 25925 45719 84088 76330 58359
10235 58359 47974 48315 52210 53185 60742 33459 22252 21782 28364 53634 67512 48881 38414
10222 38414 23010 16679 24006 4532 -5567 12106 26111 56080 66038 55163 33320 10664
10210 10664 -1957 -32610 -16702 12879 11173 2738 12040 29995 55429 76405 46289 23734
10198 23734 19075 9898 17057 28320 31240 20428 31299 57737 86404 63261 44811 35632 71695
10185G1695R940J541K668j1148K698q932J6936L3991K8038j3348j8611O077j3245
10172A08300j0053L0698J0049K6434K9554M6552N2943L4824k1855k4106J344j8350
10160B66334J1864L1317r153J4964L9562O9787L5736j0082k8744n4066m4120n1799
10148B71600M066l822K2332R284M335L5661J9629r930l0824l9497l9198m2151
10136B01485k0500k6902J7649R689k663l2759K753P504k019k3133m4202l0528
10124E6374k5147J7307j3442M149L11n695j5441M498J7358j4747k4817j1678j774
10111a2744J5809M285j7960O925J5759j9790r09J7812J5351K2064N068l2855l327
10098A5488J6245n978R790r581l8501L158j6511K8644J403n044J364K2121q770
$$ plain form
10185 71695 81635 83176 85844 74696 77394 68462 85398 119389 147427 134079 115468 121545 108300
10172 108300 98247 128945 138994 165428 194982 241534 294477 329301 307446 283340 284684 266334
10160 266334 278198 309515 300362 315326 354888 424675 460411 450329 421585 367519 323399 271600
10148 271600 275666 271844 294176 303460 307795 343456 363085 353155 322331 282834 243636 201485
10136 201485 180985 154083 171732 181421 178758 145999 148752 156256 154237 131104 86902 56374
10124 56374 31227 48534 35092 39241 39552 33857 18416 22914 40272 25525 708 -10970 -12744
10111 -12744 3065 7350 -10610 -3685 12074 -7716 -8625 9187 24538 46602 51670 18815 15488
10098 15488 31733 25755 35545 25964 -12537 -9379 -25890 2754 4157 -887 477 22598 13828
10085A3828K273J5614N358n939m151K0949j9905k8805j3676K2509M2947o641q581
10072C5780J2823P81M17l3058j9986j6408K4324J5991k577K3469K4249O237q96
10059G1146j7907j8006m169j0781o394j306m2729m923K1488J3508l97m286l005
10046g761r012k3945J2377o77J8059L5970K4191o90j351M044l9578k6796M2098
10033B6929J9194j5600p899L516m219m772J0632n084P900J89m810K884P418j2604
10019B3674q688j8847j78k1350K288Q967L040n936J9494l29J0861m94Q462P004
10005B7968J7698j0811l0568j4140J43K087K5347L5781J3793p055L859J3099K2542
9992I9743j4609m9778l0447m211J3587P78k587Q659J1007O254P480j4544q785
$$ plain form
10085 13828 16101 31715 37073 31134 26983 47932 28027 -778 -14454 8055 51002 44361 35780
10072 35780 48603 49384 49801 16743 -3243 -19651 4673 20664 18087 41556 65805 72042 71146
10059 71146 53239 35233 31064 20283 13889 12583 -30146 -35069 -13581 -73 -470 -4756 -7761
10046 -7761 -16773 -40718 -28341 -29018 -10959 25011 49202 48512 47161 51205 11627 -15169 26929
10033 26929 46123 30523 22624 26140 21921 17149 27781 22697 30597 30786 25976 28860 36278 23674
10019 23674 14986 -3861 -4039 -25389 -23101 -14134 -11094 -17030 2464 2135 12996 12502 20964 27968
10005 27968 45666 34855 4287 -9853 -9710 -7623 17724 53505 67298 60243 64102 77201 99743
9992 99743 85134 35356 4909 698 14285 15063 12476 21135 32142 38396 45876 31332 22547
9979B2547K4765k3695p366p86k220j7521j0181K6904K154k5682k5046J288R664
9966b5175J0341P626R638L3103L9676m9465j9958Q901J3852k573K0071N936j6008
9953C5965j6503m232J0788k205j7945M715R541q336j8792R726R137J312N38m444
9939I265k1145j1755J4559J5347J0298J8628J2287M0335O7354R5747K1198j03764
9927A68354o9387m6224j8712n900k4861k24K1539J1270j8382k6525r812J8371
9915d93J0768j2568j2439J6849j0127K4654n081k1690J0660L6523M3429j3885
9903F6600l7380J1199J7776j6588l5307j6355J274N604J2292J3175R463L1865
9891F3618j9675m4643k896j643J0284j873j4316K5073L6676L336k3318J016K0798
$$ plain form
9979 22547 47312 23617 16251 15465 13245 -4276 -14457 12447 14601 -11081 -36127 -34839 -25175
9966 -25175 -14834 -7208 2430 35533 75209 25744 5786 14687 28539 25966 46037 51973 35965
9953 35965 19462 15230 26018 23813 5868 10583 20124 11788 -7004 2722 11859 13171 13709 9265
9939 9265 -11880 -23635 -9076 6271 16569 35197 47484 87819 155173 250920 272118 168354
9927 168354 98967 52743 34031 28131 3270 3046 24585 35855 17473 -9052 -18864 -493
9915 -493 10275 -2293 -14732 2117 -8010 16644 11563 -10127 533 37056 80485 66600
9903 66600 29220 40419 58195 41607 6300 -10055 -8781 -3177 9115 22290 31753 63618
9891 63618 43943 -700 -3596 -5239 5045 3172 -11144 13929 50605 53941 30623 31639 52437
9878E2437l966O159q101r251k6124j3Q074J2782o096j6685j5725J2082J1374k3687
9864f740Q055J7614n603k5520Q874O231q06K0887K8804O110K0919K253l2525l415
9850D5138j9884O062o033N114J394j2795K58r15j7162J1306J960l378k2977k350
9836a4262K1309J2063r390k6691M13J954J1171n536j0456P124K8290R172k0373
9823D788j9420p536J7848J5775R886L1125o812j6505P138k228J631K7649J372
9810F4711l622k128l5900l537J2820k7813J5772p127k989J8477J0846r730j2175
9797A7605j3969K141O37j3090o242J9500k0435M753M049m095K597k7913R749L0173
9783E460P304N633P763j1296J0937O168J210k0900p26L2486j2473l6138k987O357
$$ plain form
9878 52437 48471 54630 46529 37278 11154 11141 19215 31997 25901 9216 -6509 5573 16947 -6740
9864 -6740 1315 18929 13326 -12194 -3320 2911 2105 22992 51796 57906 78825 81078 48553 45138
9850 45138 25254 31316 25283 30397 31791 18996 19254 18339 1177 12483 14443 11065 -11912 -14262
9836 -14262 7047 19110 9720 -16971 -16558 -14604 -3433 -8969 -19425 -12301 15989 25161 4788
9823 4788 -14632 -22168 -4320 11455 21341 52466 45654 29149 36287 34059 35690 63339 64711
9810 64711 61089 58961 23061 19524 32344 4531 20303 13176 10187 28664 39510 29780 17605
9797 17605 3636 5777 6414 -6676 -12918 6582 -13853 -9100 -5051 -9146 -6549 -34462 -24713 5460
9783 5460 12764 18397 26160 14864 25801 31969 33179 12279 11553 44039 31566 -4572 -7559 -1202
9769a202j547J201R741L132l1529j2397m481K0625J3401j0211p973k585L4607
9756A0782L8937j3288j5454J7644L273l7950j6775J9141J347k5097r23K0596R274
9743A1507L7613L570k4204M782p533q398J0245k3329j8733J6146M965l1475j3062
9730c7906J689N822j1329J3738J0231L942L3267Q418M2221L7204K3688r190m9503
9717G2292l6610P054n100j0570J4375K7J765J7948j0791k8135k8945J2769J9406
9704B5485p03j9745m504L048r653o086j5157j2848J8062J0749k4330N899M1348
9691A1565j127J678j3141L650L5260k745k1155o836j8411L732j5135O825J9728
9678C888Q883K1645M883n083L894k8436k1859J112Q808j2767K3818K6256l9995
$$ plain form
9769 -1202 -2749 -1548 8193 11325 -20204 -32601 -37082 -16457 -3056 -13267 -21240 -23825 10782
9756 10782 49719 36431 20977 38621 41894 3944 -12831 6310 7657 -17440 -18363 2233 11507
9743 11507 49120 52690 28486 33268 25735 17337 27582 4253 -14480 1666 6631 -24844 -37906
9730 -37906 -36217 -30395 -41724 -27986 -17755 -13813 19454 27872 70093 107297 130985 121795 72292
9717 72292 35682 42736 37636 27066 41441 41468 43233 61181 50390 22255 -6690 6079 25485
9704 25485 24782 5037 533 3581 -6072 -12158 -27315 -40163 -22101 -11352 -35682 -29783 11565
9691 11565 10438 12116 -1025 2625 37885 35140 13985 7149 -11262 -7530 -22665 -15840 3888
9678 3888 12771 34416 39299 34216 38110 9674 -12185 -11073 -2265 -15032 8786 35042 -4953
9665d953k9799J2593K4972Q192K8477O057j0774j577q595m425M470P059J0585
9652D2282K4120K0673L2959l563k5899k1690o2506j0723K3644J8055M800k5815
9640A6337k565J357j4181o348n011k320n592K4157J2896J795m4342j6703J9567
9627b0953o504k206k54k313Q152L2844M5808L1291l4886m6260r462p101o917l209
9613b1970j9108J0181J3500J0286k4596L0734Q019K5678J6498j8811k3254J2272
9601A9429j8822k6397K090k487p216J4295M438J0078M034J638j0148O84K4089
9588A5705M517J3525L37j1804p556o839J2612j0500j168L771j4714k7418L336
9575b6196J6779j5068J2383j5855k3979K4754o93P087L1753k359m1673j02J0681
$$ plain form
9665 -4953 -34752 -22159 2813 11005 39482 45539 34765 33188 24593 20168 24638 31697 42282
9652 42282 66402 87075 120034 116471 90572 68882 6376 -4347 19297 37352 42152 16337
9640 16337 13772 15129 948 -5400 -10411 -12731 -18323 5834 18730 20525 -23817 -40520 -20953
9627 -20953 -27457 -29663 -29917 -32230 -24078 8766 54574 85865 50979 4719 -4743 -11844 -18761 -21970
9613 -21970 -41078 -30897 -17397 -7111 -31707 -973 7046 32724 49222 30411 7157 19429
9601 19429 607 -25790 -23700 -26187 -33403 -19108 -14670 -4592 -558 1080 -9068 -8384 15705
9588 15705 20222 33747 34084 22280 14724 7885 20497 9997 8829 12600 -2114 -29532 -26196
9575 -26196 -9417 -24485 -12102 -27957 -51936 -27182 -27875 -20788 10965 8606 -33067 -33169 -22488
9562b2488k4164j2955L9258L4858l2534j2483J8390K8978k8825l9349M4061L2882
9550B5629k3945k7064j0565K0216K1572j2552p596k7967O478K5287J3057K4470
9538B7020n667j3980J760J5932q19k571q45k5758k1321L5914J2162k5718j7938
9525b1829m502K3114J3954M105J8876J1835j7693j5875j8253K1657l583J3250
9513B5056j1813l8942l31R005J3981J6538j2138m396M29K3322K4344r209j8012
9500A7834o734j2430J9722J0851M188o996j8789Q828R62R681O595q660J351j1024
9486A5379J1703k0633j3888L9419R157k1454M69r841L710R04J651P341j2474q643
9472B800k420p806j1554j2284K5746K2587j3457J270J8980j4300J825l369l6737
$$ plain form
9562 -22488 -46652 -59607 -20349 14509 -18025 -30508 -12118 16860 -11965 -51314 -7253 25629
9550 25629 1684 -25380 -35945 -15729 5843 -6709 -14305 -42272 -35794 -10507 2550 27020
9538 27020 21353 7373 9133 25065 24246 21675 20830 -4928 -26249 9665 21827 -3891 -21829
9525 -21829 -26331 -3217 10737 14842 33718 45553 27860 11985 -6268 15389 11806 25056
9513 25056 13243 -25699 -26030 -17025 -3044 13494 1356 -3040 -2611 20711 45055 35846 17834
9500 17834 11100 -1330 18392 29243 33431 26435 7646 16474 17436 27117 33712 25052 26403 15379
9486 15379 27082 6449 -7439 31980 41137 19683 20152 10311 14021 14925 16576 23917 11443 2800
9472 2800 380 -7426 -18980 -31264 -5518 17069 3612 4882 23862 9562 11387 8018 -28719
9459b8719j7200J7177j077j1245Q549L9374K8308N703n065J3970k250r205P005
9446D5325j4394l3017j7089J9243O736k1362k360J1679l3461O024L1253N009j5479
9433a1893n214K6024K1776j7876j9312J229P158j6271k1144L9683O746j3419k133
9420d646o999K2031N11l6873j3614N4184l569r631j1966J4971Q195m516j6224
9407h146L572n738L457K7312K2721n929K279l3579l259j8450R87M362p16q798
9393a9925K185L4479o190K459N0015j1283o305K4923j5657j000r284j5889j9908
9380H620J7241K1541n291o457p368J2574J4604k7318m5617j8847l361J0783P741
9367b1155k4643L8748J3757p213K3786J0907n492R596q03k9551k4412M466J8795
$$ plain form
9459 -28719 -45919 -28742 -29819 -41064 -32515 6859 35167 40870 35805 49775 47525 38320 45325
9446 45325 30931 -2086 -19175 68 6804 -14558 -16918 -5239 -38700 -32676 -1423 3586 -11893
9433 -11893 -17107 8917 30693 12817 -6495 -5266 1892 -14379 -35523 4160 10906 -2513 -4646
9420 -4646 -11645 10386 10897 -25976 -39590 14594 11025 1394 -10572 4399 12594 8078 -8146
9407 -8146 -4574 -10312 -6855 20457 43178 37249 39528 5949 2690 -15760 -14773 -10411 -11127 -19925
9393 -19925 -17740 16739 10549 13008 63023 51740 45435 70358 54701 53701 44417 28528 8620
9380 8620 25861 47402 42111 35654 28286 40860 55464 28146 -17471 -36318 -39679 -28896 -21155
9367 -21155 -45798 -7050 6707 -506 23280 34187 28695 38291 37488 7937 -16475 -12009 6786
9354F786k4178k2488M0169J4940O239j8274j0416J3984k1436L6175J0379k7759
9342D121j1945r816n146J5631J0082r002K4118k9985K173L1977J7865k6093l9374
9329b5394J9726L1378R320j029J1778q754k4178k6482k824K6337L595k3531j1385
9316b1443n49N409j4378m388N82K3480P643l1553r240L335J2550J7704J9156R438
9302A7746K744n568j7006k646J5978p254k0098o223n217m689r970J3781J0354
9289a8068k7260J1064j628K4653q103K6072K3674k9312k3509k535O392k491K6160
9276E109N338j5965l527L1137J196j7986j7994l934N769j9767j2757K2022p21
9263b2080n988J889r229n138o688j8550J5292l967o046L8795K9020O529r24k741
$$ plain form
9354 6786 -17392 -39880 289 15229 21468 3194 -7222 6762 -14674 21501 31880 4121
9342 4121 -7824 -17640 -22786 -7155 2927 -6075 18043 -11942 -9769 22208 40073 13980 -25394
9329 -25394 -5668 25710 35030 34001 45779 37025 12847 -13635 -16459 9878 13473 -10058 -21443
9316 -21443 -21992 -16583 -30961 -35349 -34767 -11287 -3644 -35197 -44437 -41102 -28552 -10848 8308 17746
9302 17746 20490 14922 -2084 -4730 11248 3994 -16104 -22327 -27544 -32233 -42203 -28422 -18068
9289 -18068 -45328 -34264 -35892 -11239 -19342 6730 30404 1092 -22417 -24952 -18560 -21051 5109
9276 5109 10447 -5518 -9045 22092 23288 5302 -12692 -16626 -10857 -30624 -43381 -21359 -22080
9263 -22080 -28068 -26179 -35408 -40546 -47234 -65784 -50492 -54459 -60505 -21710 7310 13839 12915 10174
9249A0174n942q654k1739J759K9369J8344M86L073K550k5097k974n847J91J6581
9235A2274k4087k514K3535J856J9753M585j0539m2224j0846K8170k038j8430j3638
9222c4143J7211M8658k873J240j5445j4096J8431K462L741j0214L8376j6046m2412
9209e110j8531J2482K572k7273k2157J7265J5557j1644p067J3888o688R057p811
9196c5460j5439L3212J5434m938N950K1498M6883r657k480q228k363L0763K1477
9183I6652l9912k8902j0361j1280r495l3048r784l779K2951K0576K3689k573L0004
9170D4738J352j6567j0621j9275k7952K766J338J4188J0018j5809l0702k9492
9158g6018r102J3611r857k238L2213L0648J8758r284k00k8912k4052J4294j1581
$$ plain form
9249 10174 4232 -4422 -26161 -24402 4967 23311 23797 26870 29420 4323 1349 -4498 -4307 12274
9235 12274 -11813 -14327 9208 11064 30817 35402 24863 -17361 -28207 -37 -2075 -20505 -34143
9222 -34143 -16932 31726 28853 30093 14648 552 18983 21445 25186 14972 53348 37302 -5110
9209 -5110 -23641 -11159 -8587 -35860 -58017 -40752 -25195 -36839 -43906 -30018 -36706 -27649 -35460
9196 -35460 -50899 -17687 -2253 -7191 -1241 20257 67140 57483 55003 46775 44412 75175 96652
9183 96652 56740 27838 17477 6197 -3298 -36346 -46130 -49909 -26958 -6382 17307 14734 44738
9170 44738 46090 29523 18902 -373 -28325 -25559 -24221 -10033 -15 -15824 -46526 -76018
9158 -76018 -85120 -71509 -81366 -83604 -51391 -20743 -1985 -11269 -11469 -40381 -64433 -50139 -61720
9145f1720L2295J9578J3502q695k9868j2108J5360j8835k4139J0455O276L0736
9133b7163p215m793L0676l500o551k5903l1889Q159J2950K3893J5966l58l525
9120a9253J9700K2582p546j478r978P505j8641l0383k3585J2957J6738K3173p462
9107a5671j0037L4702Q426k3441k2590M7005K4715j7913j5460o464P855J6539
9095B7666j2298j3025L814J1637m618J2030P774J2450J1235r866o8115j7217J8549
9082a9984L0085k105m540K3478j309k9490l0898k8542j3059L6513M5331M5735
9070E1215J6573j7093l9482l3361Q697K6196O572k6546j6351L266K0907K4307
9058B4900J6577r684r469J8037r909r884J425o728j1268K536j5414p254n74L7687
$$ plain form
9145 -61720 -29425 -9847 3655 -5040 -34908 -47016 -31656 -50491 -74630 -64175 -57899 -27163
9133 -27163 -34378 -39171 -8495 -11995 -18546 -44449 -76338 -68179 -55229 -31336 -15370 -15728 -19253
9120 -19253 447 23029 15483 14005 4027 11532 -7109 -37492 -61077 -48120 -31382 -8209 -15671
9107 -15671 -25708 8994 17420 -6021 -28611 18394 43109 25196 9736 3272 11127 27666
9095 27666 15368 2343 6157 17794 13176 25206 32980 45430 56665 46799 -21316 -38533 -19984
9082 -19984 10101 7996 3456 26934 25625 -3865 -34763 -63305 -76364 -39851 5480 51215
9070 51215 67788 50695 11213 -22148 -13451 12745 19317 -7229 -23580 -20314 593 24900
9058 24900 41477 31793 22324 40361 30452 20568 21993 15265 3997 6533 -8881 -16135 -16709 20978
9044B0978K2774k064O679O930q631l2350L0299L631k5723k3572m969K0953J7962
9031C2897o265J1221L4743j6798l4372k7505k7005j0710l340N402l820O158j1328
9018e0722K2444K7204J4345j3851j7205p967K5233P4k5309l931J9568O088J3352
9005I323L6438L5276m1916k2724J8354J9068j335n1267k696K4637j2468l2889
8993b2199L3426p329m107K3514j0170o620j6769m991l7797k2954M9797K7386j3105
8980a1918n287l0785J9780K8999K3149k1155j2029Q613K2357O959q139Q242j4855
8967A3931j5658j1654K398k9674n327J4465J9877M7151j9346k4446m946K1082
8955G853M463j6716N951J7260Q631p033j9332K771r410K0156M608k1773M579L0678
$$ plain form
9044 20978 43752 41688 48367 55297 46666 14316 44615 48246 22523 -1049 -6018 14935 32897
9031 32897 26632 37853 72596 55798 21426 -6079 -33084 -43794 -47134 -41732 -45552 -39394 -50722
9018 -50722 -28278 -1074 13271 -580 -17785 -25752 -519 -445 -25754 -29685 -10117 -4029 9323
9005 9323 45761 81037 39121 16397 34751 53819 52484 1217 -1479 23158 10690 -22199
8993 -22199 11227 3898 -209 23305 13135 6515 -10254 -15245 -53042 -75996 -26199 1187 -11918
8980 -11918 -17205 -47990 -28210 789 23938 2783 -9246 -633 21724 28683 20544 28786 13931
8967 13931 -1727 -13381 -10983 -40657 -45984 -31519 -11642 35509 16163 -8283 -13229 7853
8955 7853 12316 -4400 1551 18811 27442 20409 1077 3848 -5562 14594 19202 -2571 2008 32686
8941C2686M649J3908j3892J4863j4063j9878k1825j4418K0222k2121o452J8780
8929g541j0661r864r096k680Q434o563K9257J7605j6840K5302L1390j0760m2194
8916d211m9852o49K939J2245K646L6174P828j9232R059k187o462J7691K8650J2144
8902D6783k6289k0840J8789o442K0307J2972k9540J2804Q63J8105J0445J0025
8890F7982n059k0657j8375k367K7692j7428k7262k0373K6682j305n005L3011K6731
8877F4267m0473j7801N754P535P190K38n928j8103N423j4940j0701K9948K6429
8864C8838j2320k3820l1659l0209J0988n028L3553J2085M517K5856K5854p158
8852D1497k9934j2451j7804p858l239k0451j4410o046J9370J574k48M603J3039
$$ plain form
8941 32686 37335 51243 37351 52214 38151 18273 -3552 -17970 2252 -19869 -26321 -7541
8929 -7541 -18202 -28066 -37162 -39842 -31408 -37971 -8714 8891 -7949 17353 48743 37983 -4211
8916 -4211 -54063 -54712 -51773 -39528 -36882 -708 7120 -12112 -3053 -5240 -11702 5989 34639 46783
8902 46783 20494 -346 18443 12001 32308 45280 15740 28544 29407 47512 57957 67982
8890 67982 62923 42266 23891 21524 49216 31788 4526 -15847 10835 9530 4525 37536 64267
8877 64267 23794 5993 11747 19282 26472 26710 20782 2679 8102 -6838 -17539 12409 38838
8864 38838 26518 2698 -28961 -59170 -48182 -53210 -19657 -7572 -3055 22801 48655 41497
8852 41497 11563 -888 -18692 -26550 -29789 -50240 -64650 -70696 -51326 -49752 -50000 -45397 -32358
8839c2358O113O43J6449j132k2201K442K4528Q542K067k0128q776J6168J414Q016
8825A787j4970Q730M220j1415q712J2453k1198l2735M275L0693J5924m250N347
8812i851J2520o666j8659p091Q535k1069O615K1452k1999n207J2953J6245K7152
8799A4930m006J4062j2021j5230k3037J2423J2904K1540j1286P83j1165j6386
8787a6489j2103K0601r718j6789J6169N631P939Q022K0590J608Q55J300m575m8440
8773b5399r543J4959J2111m422L742J7469k4230m0380J9063J6228J1310o218K343
8760a2967k5944o390J4021n104j1456J0850q066J3128J3441L1060k2418L1007
8748B1162j558k4928j0444Q818K674l181J1757j6686p789J234m636J4193p243
$$ plain form
8839 -32358 -26245 -25602 -9153 -10285 -32486 -30044 -5516 3026 5093 -15035 -23811 -7643 -6229 1787
8825 1787 -13183 -4453 -233 -11648 -20360 -7907 -29105 -61840 -57565 -26872 -10948 -15198 -9851
8812 -9851 2669 -3997 -22656 -29747 -21212 -42281 -35666 -14214 -36213 -41420 -28467 -12222 14930
8799 14930 10924 24986 12965 -2265 -25302 -12879 25 21565 10279 11062 -103 -16489
8787 -16489 -28592 -7991 -17709 -34498 -18329 -12698 -4759 3263 23853 25461 26316 27616 23041 -25399
8773 -25399 -34942 -19983 -7872 -12294 -8552 8917 -15313 -55693 -36630 -20402 -9092 -15310 -12967
8760 -12967 -38911 -45301 -31280 -36384 -47840 -36990 -45056 -31928 -18487 12573 -9845 21162
8748 21162 19604 -5324 -15768 -6950 -4276 -7457 4300 -12386 -20175 -18941 -23577 -9384 -16627
8735a6627J5449K956L8340K4288k0779l1661o539j699j9572k1660J1733p024m690
8722c7485m381n005j5535K4354n367J1466R234Q260j1173k1593N194L0426L0090
8709A8485j459K7820J5422K2950l1970m6466J5216K066k0493o547O151n370J1574
8696G379K0411O040P719K916k6067r340j1705p373K7658J6771k78O870k6076m0403
8682b5478l4720J4689J8233N630n642r262Q478q378J3872q77L2327p106j596K797
8668B967j0050L3065j499j5876j7139M679n27k4921m61l196J2735N772J8700r728
8654e479P673l855n626L9534P379j2788q528j6775L877l449r654l912J6628J7162
8640B2187K3746o398k969L7820j7119l7323l4858o033j2879l771L2850L5376Q687
$$ plain form
8735 -16627 -1178 1778 40118 64406 43627 11966 5427 3728 -15844 -37504 -25771 -32795 -37485
8722 -37485 -41866 -46871 -62406 -38052 -43419 -31953 -22719 -14459 -25632 -47225 -42031 -11605 18485
8709 18485 17026 44846 60268 83218 51248 4782 19998 22064 1571 -4976 1175 -4195 7379
8696 7379 27790 33830 41549 44465 18398 9058 -2647 -10020 17638 34409 34131 41001 14925 -25478
8682 -25478 -60198 -45509 -27276 -21646 -27288 -36550 -28072 -36450 -22578 -23455 8872 1766 170 2967
8668 2967 -7083 25982 24483 8607 -8532 -3853 -4380 -29301 -29762 -32958 -20223 -14451 4249 -5479
8654 -5479 2194 -1661 -7287 32247 39626 26838 18310 1535 5412 1963 -7691 -11603 5025 22187
8640 22187 45933 39535 36566 74386 57267 19944 -14914 -20947 -33826 -37597 -4747 30629 39316
8627C9316L103j5137K216L149j8466j9810m971O05J2762n758j2362q585L0053
8614F115K6906j046N80P081k1420j6395r167J5340K1463k576J3326R639k6686
8601B3160o126q714N198J8099l454j9533q976j2291j1717R267K0604J6861j0953
8588A1425J1372m969n275j7861J6752J3168K0320K8740k0048l3566n645P666j0062
8575A2017j4006l102L2549l523j0747j2501j883L158q168P511J2339j2742Q661
8562I563J2983J0605j1813j9653j2956J6934M220j0826l173J56j1118k7209r053
8549e1340L4897L2598L4992R981j2973m6236l3268J0027l714K6573L3232j4035
8537B0734k5696o462k1529p28K6421L2428N269j4236Q680n359K9738J906j7043
$$ plain form
8627 39316 42419 27282 29498 32647 14181 -5629 -10600 -9995 2767 -2991 -15353 -23938 6115
8614 6115 33021 31975 32555 39636 18216 1821 -7346 7994 29457 26881 40207 49846 23160
8601 23160 17034 8320 13518 31617 28163 8630 -346 -12637 -24354 -15087 5517 22378 11425
8588 11425 22797 17828 12553 -5308 11444 24612 44932 73672 53624 20058 14413 22079 12017
8575 12017 -1989 -5091 27458 23935 13188 687 -1196 1962 -6206 1305 13644 902 9563
8562 9563 22546 33151 21338 1685 -11271 5663 9883 -943 -4116 -3960 -15078 -42287 -51340
8549 -51340 -16443 16155 51147 61128 48155 1919 -31349 -21322 -25036 1537 34769 20734
8537 20734 -4962 -11424 -32953 -33681 -7260 25168 30437 16201 24881 19522 49260 51166 34123
8524C4123k28j2363J0721L033L1406j1370P404J8828j1299P924M187j0222P506
8511G9650J7101L3653K1250J0888J5712M307M3192J9021j1902j6050l1440m8708
8499A36674m0650j4586L65j0768k2048q439k1992j445N661K8908O525j1798j5781
8486C0626J2307j6793Q659r445m740j7094J1001j3369N083J6153k458L3293K0440
8473G3663p074l7607o636O573O161J1726K2184Q739J7247K1205J9542L4774J05672
8460B76169J21765P0594J8854o9225j04294p5665q0486o0353m1801l9316K4397
8449D0639J6561K8485o003m8160k7945M36N2417j407j8442k206m90k9094q785
8436c994K1064O926j5453j5977Q732k0398Q726K6653L1777Q869l536Q350n289
$$ plain form
8524 34123 33895 21532 32253 35286 66692 55322 62726 81554 70255 78179 82366 72144 79650
8511 79650 96751 130404 151654 162542 178254 182561 225753 244774 232872 216822 185382 136674
8499 136674 96024 81438 81803 71035 48987 40548 18556 17111 22772 51680 58205 46407 30626
8486 30626 42933 26140 34799 25354 20614 3520 14521 1152 6235 22388 19930 53223 73663
8473 73663 66589 28982 22346 28919 35080 46806 68990 77729 94976 116181 135723 170497 276169
8460 276169 397934 468528 487382 418157 313863 238198 157712 97359 55558 16242 40639
8449 40639 57200 85685 79682 31522 3577 4013 56430 55023 36581 34375 33885 4791 -3994
8436 -3994 17070 23996 8543 -7434 1298 -19100 -10374 16279 48056 56925 53389 61739 56450
8423E6450k1482K0798k3142j4764l1387J7588M5788N1354M7358K1391M0116J833
8411B11901j4821n01l9540l7058n0564k4414q879o441P667J7675J4451j3104j3475
8398D2897r415j1195O433M345K1733k5144j9642o70J0195l641J0729N823j0083
8385B2365O671J4744r681J32J1941m9854k3000L0139J9960O22J2533K4852J7497
8372G8921j7755J0614J1065j0257j9704k0049k2695l7388K8955R265J777J0489
8360B3238K38m3741n21K0497P791j348l75j0729k8990J172K3365R911n741R094
8346C861M1710k340m2236j7254j823k3397M700J77L4694K8407K5933j0312p816
8333C4304k1906L359J7811K5880k026K41o706r708m990N133Q834J577n048r48
$$ plain form
8423 56450 34968 55766 32624 17860 -13527 4061 49849 101203 148561 169952 210068 211901
8411 211901 197080 196579 157039 119981 69417 45003 36124 29683 37350 55025 69476 56372 42897
8398 42897 33482 22287 28720 33065 54798 29654 10012 9342 19537 15896 26625 32448 22365
8385 22365 29036 43780 34099 34231 46172 -3682 -26682 3457 23417 24039 36572 61424 78921
8372 78921 61166 71780 82845 72588 52884 32835 10140 -27248 1707 10972 12749 23238
8360 23238 23476 -20265 -20786 -289 7502 6154 5779 -4950 -33940 -32768 -9403 508 -5233 3861
8346 3861 45571 43231 995 -16259 -18082 -41479 -36779 -36602 -1908 26499 52432 42120 34304
8333 34304 12398 15757 33568 59448 57422 57663 50957 41249 36259 41392 50226 51803 46755 45807
8319D5807o525j4290M0L095Q973J3795R576l3462l8520m937K2570M813n493k3275
8305a7833j3251J7475K0818j598N547N003J0859o600n699l2286K356M583J572
8292i054L3793K4978l1076o62l44M709k510n144o903r107J743j835O256m903q338
8277h397O56Q865j0671j0779J2683K7563L682j3783j7117P121N459l721j3718
8264a2157j590o330K159J0092P725K6353N510j0188l3932J756K0965K2510k5784
8251G089q347K4210L5689L1036R074m3489l5032j7641j28R048M118q217P270J6299
8237C0979J5168l0374o979O549o106J2577J6317n143l9508l5046K4249L7026o289
8224A3420M767M321P500O786J642l1178l0107P088K6659M755M925K7112O911k3939
$$ plain form
8319 45807 39282 24992 25032 28127 37100 50895 60471 27009 -11511 -16448 6122 10935 5442 -17833
8305 -17833 -31084 -13609 7209 5611 11158 16161 27020 20420 14721 -17565 -15209 -10626 -9054
8292 -9054 24739 49717 18641 17979 17635 22344 19834 14690 7787 -1320 423 -1412 4844 -59 -8397
8277 -8397 -7741 1124 -9547 -20326 -7643 19920 23602 9819 -7298 -177 5282 1561 -12157
8264 -12157 -13747 -20077 -17918 -7826 -101 26252 31762 21574 -12358 -10602 10363 32873 7089
8251 7089 -1258 22952 58641 89677 98751 55262 20230 2589 2461 11509 15627 7410 14680 30979
8237 30979 46147 15773 8794 15343 9237 21814 38131 32988 -6520 -41566 -17317 19709 13420
8224 13420 18187 22508 30008 36794 38436 7258 -22849 -15761 10898 15653 20578 47690 54601 30662
8210C0662k7838r116p557J4681n498M494L645K114n591j1880j9141k9870J9391
8197d1504M9459K50k4010O92J4591K3182j3770j9163N871J8686k6334K5634P781
8184B1365l2037K4086J122n391J0408j973k5705j6632J8245K2195j224P255N554
8171B7268J3408q524j8644J3434q247J8561J4115j6052k5453j1272l6216j209
8159c8831j5599j6607j8823J0056M8607K0959L149N383k3441k5643k4278K1015
8147e4053K5817K5152K8223m253l14L7853l4068l2314J7305l043K1897J0529j1721
8134B7010j5827n811J7791J2170k2653j0942j2236K7060p991j0173J0727J1152
8122B0277j1860k150p838N12j2981k15j7295J3114O254l8506k608K7372J2954
$$ plain form
8210 30662 2824 -6292 -13849 832 -4666 -172 3473 5587 -4 -11884 -31025 -60895 -41504
8197 -41504 7955 8205 -15805 -15113 -522 22660 8890 -10273 -4402 14284 -12050 13584 21365
8184 21365 -10672 13414 14536 9145 19553 17580 -8125 -24757 -6512 15683 14459 21714 27268
8171 27268 40676 32152 13508 26942 18695 37256 51371 35319 9866 -1406 -37622 -38831
8159 -38831 -54430 -71037 -89860 -79804 -31197 -10238 -7089 -1706 -25147 -50790 -75068 -54053
8147 -54053 -28236 -3084 25139 20886 20572 58425 24357 -7957 9348 6305 28202 38731 27010
8134 27010 11183 5372 23163 35333 12680 1738 -10498 16562 8571 -1602 9125 20277
8122 20277 8417 6267 -1571 -1059 -14040 -14255 -31550 -18436 -12182 -50688 -53296 -25924 -12970
8109a2970j5439k2348K37J0878L4747K7855j3491P023K2916N719k237Q443j4209
8096C7124n059j5261k7639k9003K3931j9169o216o198K3254j0117O944N402Q841
8083a3166K1003P3J8490M2334o111j5979j0791k3518k250j9221J9752L9865r282
8070D1199p094j8297P033J2701k1487l955L6030P308l6880o793m064N875J1255
8057B2831K2435Q012j8112J623L9169Q729J513j4919j6632l9590k8888J1411M129
8044A711k0076o288K0795J6538n161j4178k3743j4593j6785J1988L1500K4564
8032F272J3875q781j678j5747j3740J4024k644p582J1496J5706K5703n407m7145
8019a5648j4224J7302L111j2273L084K2544R831q095K7296J2713p406j2119J0496
$$ plain form
8109 -12970 -28409 -50757 -50520 -39642 -4895 22960 9469 16492 39408 45127 42890 51333 37124
8096 37124 32065 16804 -10835 -39838 -15907 -35076 -41292 -47490 -24236 -34353 -27409 -22007 -13166
8083 -13166 7837 7910 26400 68734 62623 46644 35853 12335 10085 -9136 10616 50481 41199
8070 41199 34105 15808 22841 35542 14055 10100 46130 53438 16558 9765 5701 11576 22831
8057 22831 45266 53278 35166 36789 75958 84687 86200 71281 54649 15059 -13829 -2418 1711
8044 1711 -18365 -24653 -3858 12680 7519 -6659 -30402 -44995 -61780 -49792 -18292 6272
8032 6272 20147 11366 9688 -6059 -19799 -5775 -8419 -16001 -4505 11201 36904 31497 -15648
8019 -15648 -29872 -12570 -9459 -21732 -18648 3896 13727 5632 32928 45641 38235 26116 36612
8006C6612M532m1666j0483N050K2143l874J5146P386k4583p670j761K0638k2609
7993a139j8451K1493L6818l726l1559l83J0922Q237K908R401j5597l5756l3472
7980e0304J033J5581J1364j4836j4237J5768K2675J7855K7086J993o743k2660
7968D575J5109j1648j3451k2629j2472J2155L9276K1489n080o295j527k075n209
7955A2218j7826j2229j3669J266j0504n377K1141J2486K6947N934K1306K516o295
7942C7914K870l6121k504K3124m610J336K8095k5075j039J3561l0609k8439L958
7929a7539j673j7604J798L1563k2745L000L4112N324o614j624N350j6354N73K2206
7915A9773m026j9098J2341k569J5565J7354k4212J1942K3052J1007j9955O983
$$ plain form
8006 36612 41144 -522 -11005 -5955 16188 12314 27460 34846 10263 2593 832 21470 -1139
7993 -1139 -19590 1903 38721 34995 3436 3053 13975 22212 25120 34521 18924 -16832 -50304
7980 -50304 -49271 -33690 -22326 -37162 -51399 -35631 -12956 4899 31985 33978 27235 4575
7968 4575 19684 8036 -5415 -28044 -40516 -28361 10915 32404 27324 21029 19502 17427 12218
7955 12218 -5608 -17837 -31506 -30240 -40744 -46121 -24980 -12494 14453 20387 41693 44209 37914
7942 37914 40784 4663 2159 25283 20673 22009 50104 25029 23990 37551 6942 -21497 -17539
7929 -17539 -19212 -36816 -35018 -3455 -26200 -23200 10912 16236 9622 7998 13348 -3006 -2433 19773
7915 19773 15747 -3351 8990 6421 21986 39340 15128 27070 50122 61129 41174 48157
7903D8157L2625j9547j8546k1534j8685J378K747K0581O145j3401j3722J8041
7891B4239K25q492P258K1395k3984j9405l39K1073j3278Q502j589m520N54j3924
7877b285k652l673j1154M980P887Q442J8832J6553j0680j5383N500P560J1335
7864C5262l113j7346k3524n466j9190l53L192J6673K3590k6473j3024o953k5054
7851f1779P039L3459K3676l82K9650J9725j6840l7005n395j8017j2290k0103r695
7838f7957K7993K6816n617P79k044R001M191p31p782P500K5508j860n415j1202
7824h20M777K6429p551j6751J2467N418J0424J4281l0985j8907K730J2254O898
7811B0664k904j1217q965J154q65m882K96Q541q23J8389k6756r040O176M3833
$$ plain form
7903 48157 80782 61235 42689 21155 2470 3848 6595 27176 33321 19920 6198 24239
7891 24239 24464 15972 23230 44625 20641 1236 897 21970 8692 17194 15605 11085 11639 -2285
7877 -2285 -4937 -8610 -19764 -14784 -6897 1545 20377 36930 26250 10867 16367 23927 35262
7864 35262 32149 14803 -8721 -14187 -33377 -33730 -30538 -13865 9725 -16748 -29772 -36725 -61779
7851 -61779 -54740 -21281 2395 2013 31663 51388 34548 -2457 -7852 -25869 -38159 -58262 -67957
7838 -67957 -39964 -13148 -18765 -17986 -20030 -11029 -6838 -7569 -15351 -7851 17657 15797 10382 -820
7824 -820 3957 30386 22835 6084 18551 23969 34393 48674 17689 -1218 1512 13766 20664
7811 20664 17760 6543 -2422 -1268 -2133 -7015 -6719 1822 999 19388 -7368 -16408 -10232 33601
7797C3601K9106k8054l4511o079J8190K2698m812j8926l1140k9290M042j1005
7785e6180J8216L9082O523J8797j5230j1822k5107m973r828J9447L6662J8166
7773C3753J3083J963j9000o884m445j7345p539J924K0976L1099p136l3885R619
7760A6183n261K7120K0924j0771q073j5267J6445r544j3665J9120k8526j0896
7748b211J7085j4254o835m708k3852j3882K378N5119L2994n670k162j6511k4674
7735g183r031O669J9745j320j4816m20J8834k2598p406o36k4645L756L3365K4589
7721A8903l2141j6831K6433l162j1407m475L8924Q9j2335K699K5799K7583n00
7708E9579k493j5389k6575q215L764m0750J6690N1965q213j6450K720k2247j6935
$$ plain form
7797 33601 62707 34653 142 -5937 12253 34951 30139 11213 -19927 -49217 -45175 -56180
7785 -56180 -37964 1118 7641 26438 11208 -614 -25721 -30694 -40522 -21075 15587 33753
7773 33753 46836 48799 29799 22915 18470 1125 -6414 -4490 16486 47585 40449 6564 16183
7760 16183 10922 38042 58966 48195 40122 24855 41300 31756 18091 37211 8685 -2211
7748 -2211 14874 620 -6215 -10923 -34775 -48657 -46279 8840 41834 36164 34002 17491 -7183
7735 -7183 -16214 -9545 10200 8880 -5936 -6356 12478 -10120 -17526 -18162 -42807 -39051 -5686 18903
7721 18903 -13238 -30069 -3636 -6798 -18205 -22680 16244 16333 3998 6697 32496 60079 59579
7708 59579 57086 41697 15122 6907 10671 -30079 -13389 38576 30363 13913 16633 -5614 -22549
7695b2549J6284K914J5470p394k5776L1506L177o186L0012J1424j9996k9491p934
7682h539M66Q583K3974j2651j3740k1868M540M5183m589k002k7100l4175J8132
7669b3786K8454l245j895m4701j6811K3799R430l901J2911K963K1414K9794J3975
7656D8401j4923l8181j5789j2470Q684J8093J8318j3766l3433j2828J9740J8891
7644i263m098p316P011J5987r360Q600j2406p826J4497j3682j5008K9337K7283
7631B3756j2094j7109j7213p970M0136K5746N211K0230M582N667Q319j8826l761
7618E6674o776j4858k3258j903K0507k3155J7407q47n705p389O05M137j0881J922
7604F480r469l7463K5912K0174q795r72j487J3474K0053r70m945k2780l8351j8161
$$ plain form
7695 -22549 -6265 -3351 12119 4725 -21051 10455 13632 7446 37458 48882 28886 -605 -8539
7682 -8539 -8073 510 24484 11833 -1907 -23775 -19235 25948 21359 19357 -7743 -41918 -23786
7669 -23786 4668 1423 -472 -45173 -61984 -38185 -28755 -32656 -19745 -16782 4632 34426 48401
7656 48401 33478 -4703 -20492 -32962 -24278 -6185 12133 -1633 -35066 -47894 -28154 -9263
7644 -9263 -13361 -20677 -13666 2321 -7039 1561 -10845 -18671 -4174 -17856 -32864 -3527 23756
7631 23756 11662 -5447 -22660 -30630 9506 35252 40463 60693 65275 70942 79261 60435 56674
7618 56674 49898 35040 11782 9879 30386 7231 24638 23791 18086 10697 11302 15439 4558 6480
7604 6480 -2989 -40452 -14540 5634 -3161 -4133 -5620 7854 27907 26937 21992 -788 -39139 -57300
7590e7300r16Q468L520m47J7259k5649j878P696J0738K3984J0874N0093P783J2015
7576F6240k4651j2340j3043j7061J2968L102l0305L2001j0745k505O13q872j0931
7563a5529j6142J1708k706M1052n764j3281O263m457o248j3701j0339o484J8859
7550a6769J5316J8140j4522q011J7261J0367l027j1586K879Q468j9605l56N875
7537D430j2511q877K2399J3575P961j6259k2592N50J9397P045R26K6572P467l7034
7523A3049P592j3636l158J3010k2938p698j0608O247J2986J4706J7863j6272p752
7510C391n52j5612j641K5287L6855J266k2340m510k2041j8254k3684q582m842
7497e5259J8173L2551Q540k3141j39J4690J0707j0565r301P946J2232k388j9076
$$ plain form
7590 -57300 -58216 -49748 -46228 -46675 -29416 -55065 -56943 -49247 -38509 -14525 -3651 46442 54225 66240
7576 66240 41589 29249 16206 -855 12113 15215 -15090 16911 6166 3661 4274 -4598 -15529
7563 -15529 -31671 -19963 -22669 18383 12619 -662 5601 1144 -5104 -18805 -29144 -35628 -16769
7550 -16769 -1453 16687 2165 -5846 11415 21782 18755 7169 10048 18516 -1089 -1445 4430
7537 4430 -8081 -16958 5441 19016 26977 10718 -11874 -11324 8073 15118 16044 42616 50083 13049
7523 13049 20641 7005 3847 16857 -6081 -13779 -24387 -18140 -5154 9552 27415 11143 3391
7510 3391 2839 -12773 -14414 10873 47728 48994 26654 22144 103 -18151 -41835 -50417 -55259
7497 -55259 -37086 -4535 4005 -19136 -19275 -4585 6122 -4443 -13744 -5798 6434 4046 -15030
7484a5030J3971M2422J783l8783j6125k0626r356N37J5529Q165m523N958L3964
7471A7886J826k4488P773K1968K5045k2025l4192k6611K8127L405N835k499j7982
7458a5932L2935J4664R028k4590l2888O01p438n126j4370J9566K0084O646J7041
7445B0221n7366q90M3519K4545n551k0317J210O253j9123j9396K7378R89j615
7432a43J5693j0121j7468j9972l0167r527k4707L7372N8069M6893j9786m9037
7420b2901O590K6224k0359j3117J7681K3371l4584l5K7693o9k1079j715k1439
7407c3739Q080K3857N335j7174j475J0128J4215l445n50K5976j0265O833K6994
7394E4770j403J7953k986j6917K0521j1373l2670P391k4926j0631K115k5534k4198
$$ plain form
7484 -15030 -1059 41363 43146 4363 -11762 -32388 -41744 -41207 -25678 -17513 -22036 -16078 17886
7471 17886 19712 -4776 2997 24965 50010 27985 -6207 -32818 -4691 -1286 4549 2050 -15932
7458 -15932 17003 31667 40695 16105 -16783 -16182 -23620 -28746 -43116 -23550 -3466 3180 20221
7445 20221 -37145 -38035 5484 30029 24478 4161 5371 11624 -7499 -26895 483 1472 -143
7432 -143 15550 5429 -12039 -32011 -62178 -71705 -96412 -59040 -971 45922 26136 -22901
7420 -22901 -16311 9913 -10446 -23563 -5882 17489 -17095 -17130 10563 10494 -10585 -12300 -33739
7407 -33739 -25659 -1802 3533 -13641 -15116 -4988 9227 5782 5232 31208 20943 27776 54770
7394 54770 53367 71320 68334 51417 71938 60565 27895 35286 10360 -271 1844 -23690 -47888
7381d7888J0078K1564J0439K4839j7107J0830J2270k1712k0093O592j1199N706
7369a5681J0077P25J2995J5653R149k0421j6708j2999J2064N178j7539J1083J7551
7356A1127k562J3484m323j0435J5279j6671r685j5334J4368K841J468k950J5477
7343A2084J53r967J5323j3012k5749M699J4777O195q823n070J977j1311L524q749
7329b3949j4267L4135J5078j4691m8084j2350L3036K9244j365j3702n36J1491
7317e960l077j240q581j3663R975J2994M23J3723L0364k3120j9896O222q578j7997
7303b8411j855k1981k8119J4119P301j426j9716K1675K8473K5388K875K2766R79
7290B2068r851J924K0481J1388m3433k6794J2488P262k767K9907j4757L55r911
$$ plain form
7381 -47888 -37810 -16246 -5807 19032 1925 12755 25025 3313 -16780 -10188 -21387 -15681
7369 -15681 -5604 -4879 8116 23769 32918 12497 -4211 -17210 -5146 32 -17507 -6424 11127
7356 11127 8565 22049 17726 7291 22570 5899 -3786 -19120 -4752 -1911 -443 -3393 12084
7343 12084 12237 2270 17593 4581 -21168 -16469 -1692 4503 -4320 -9390 -7413 -18724 -15200 -23949
7329 -23949 -38216 -4081 10997 -3694 -51778 -64128 -31092 -1848 -3213 -16915 -17451 -5960
7317 -5960 -9037 -10277 -18858 -32521 -22546 -9552 -9129 4594 34958 11838 -8058 -1836 -10414 -28411
7303 -28411 -30266 -52247 -80366 -66247 -58946 -60372 -80088 -58413 -29940 -4552 -1677 21089 22068
7290 22068 12217 14141 34622 46010 2577 -24217 -11729 -4467 -7234 22673 7916 8271 -1640
7277a640J7826l956p760k2092l4751J1426K0344q15K0363K6504p844m552N353
7264A8406O292R249k8404l0388K2894J5879l383n311n331j4159m2465k2107n101
7251h3929k621K1997M4990K3009l2767J3870L9582j0647k2995p190N593j8882
7239b9990k7219j0848L2742P189L7449p339j6462J8120m367k2951P024K1980j7387
7226a2059k8598m442K2159k143K893J8342J0922M502j1366P034J9289k5241k4535
7213b3243o709j1582K5306K5777j3772k5726k3534J5555R207n924O014J0946l218
7200b0903j1277J1017K544k2755Q926K3985j3425j4330K0748J0609r084m635l2474
7187e1054Q620L2906K1548j1505q292N623j3679N410Q577K1130l2015Q740K2270
$$ plain form
7277 -1640 16186 12230 4470 -17622 -52373 -40947 -20603 -21418 -1055 25449 17605 13053 18406
7264 18406 24698 33947 5543 -24845 -1951 13928 10545 5234 -97 -14256 -56721 -78828 -83929
7251 -83929 -86550 -64553 -19563 3446 -29321 -15451 24131 13484 -9511 -16701 -11108 -29990
7239 -29990 -57209 -68057 -35315 -28126 9323 1984 -14478 3642 -725 -23676 -16652 5328 -12059
7226 -12059 -40657 -45099 -22940 -25083 -22190 -3848 7074 11576 210 7244 26533 1292 -23243
7213 -23243 -29952 -41534 -16228 9549 -4223 -29949 -53483 -37928 -28721 -34645 -28631 -17685 -20903
7200 -20903 -32180 -21163 -18619 -41374 -32448 -8463 -21888 -36218 -15470 -4861 -13945 -18580 -51054
7187 -51054 -42434 -9528 12020 515 -7777 -2154 -15833 -10423 -1846 19284 -12731 -3991 18279
7174A8279R447l8191k1035j3877J9058O183N492j6273J321J2305L8321j0076j5350
7161d396N433j2432j341n377n44k6860K7841j9066r114R452P066j8298j6758L1205
7147c3189J1585J607r589L96K355L0901l011j0366K3866L1124k8543l080j4476
7134d20r710K8259K228J20m400m4161L415L4190k211j0255m169j2949J980j4435
7120c2518j6646m609J8100J3054j1021L667l274k6502R206M853K2128N143J1814
7107f605J6485L3506K625l9580J1891L3389J0545j0657j5547Ml53J0056J5865
7094F1624k6636k9833n803J5317j6153P27K5530j921N989k152l3653k0462J9266
7081h160L0048k6636m0538l227J5241K0075r99P196R606J1030j8579j0265q72
$$ plain form
7174 18279 27726 -10465 -31500 -45377 -26319 -20136 -14644 -30917 -29596 -17291 21030 10954 -4396
7161 -4396 1037 -11395 -12736 -18113 -18657 -45517 -17676 -36742 -45856 -36404 -29338 -47636 -64394 -33189
7147 -33189 -21604 -19997 -29586 -29190 -26835 4066 1055 -9311 14555 45679 17136 14056 -420
7134 -420 -10130 18129 20357 20477 16077 -28084 -24669 9521 7310 -2945 -7114 -20063 -18083 -32518
7120 -32518 -49164 -53773 -35673 -22619 -33640 -29973 -33247 -59749 -50543 -45690 -23562 -18419 -6605
7107 -6605 9880 43386 46011 6431 18322 51711 62256 51599 36052 36056 35703 45759 61624
7094 61624 34988 5155 -648 14669 -1484 -757 24773 22852 28841 26689 -6964 -27426 -8160
7081 -8160 21888 -4748 -45286 -48513 -33272 -13197 -14196 -7000 2606 13636 -4943 -15208 -16080
7068a6080J5815j1109P000P906r619K814k718J208j6448l616j29j4177K1785Q407
7054h961L7450j8211k8496j0608j0658J3679j9297j3611K1156K3296j018N527
7042i752J7003m671k2903N061J0843p630j0032j9737L975J3761j3396L072r36
7029c5342J6223P31r455J7219l424K1298r01k1458k3524q736k193J6071m021R136
7015b8376j4388L980j0215L798l788N139O928J650R136j6221L8469M3212k1874
7002A7450j9163j1015Q2J9197K284k237K015j4021P203J1696j0743k6978J169
6989b3061p911J0327J7071J1932j7289O53J9607k166o438J1424J1011M421j7292
6976A2289j9772K631J2176k0719k3596K3509R191l0629k5101J0125J291n96N698
$$ plain form
7068 -16080 -265 -11374 -4374 3532 -6087 -3273 -5991 -4783 -21231 -24847 -24976 -39153 -17368 -8961
7054 -8961 28489 10278 -18218 -28826 -39484 -25805 -45102 -58713 -37557 -14261 -15279 -9752
7042 -9752 7251 2580 -20323 -15262 -4419 -12049 -22081 -41818 -37843 -24082 -37478 -34406 -35342
7029 -35342 -19119 -18388 -27843 -10624 -14048 7250 6349 -15109 -38633 -47369 -49562 -33491 -37512 -28376
7015 -28376 -42764 -38784 -48999 -45201 -48989 -43850 -36922 -35272 -26136 -42357 -3888 39324 17450
7002 17450 -1713 -12728 -12646 6551 8835 6598 8613 -5408 1795 13491 2748 -24230 -23061
6989 -23061 -30972 -20645 -3574 8358 -8931 -8278 11329 9163 2725 14149 25160 29581 12289
6976 12289 -7483 -4852 7324 -13395 -36991 -13482 -4291 -34920 -60021 -49896 -48605 -49201 -43503
6963d3503m311J6410L5715R128N89r114R132j8515l2834K4173L2953n249q811
6950E763J1306R822l0805k635j081J630j2940p221J4257R146l45l0307R423J0244
6936a3743J3130j3226j0447Q202j0314l055Q257R8j411J6904j916Q456o529j182
6922f776j4494P437k709j7871j2040O116J728J8886M3406P422N702j1253J9395
6909D4949K4773j4781j9132j8502j5201j4674M291p801L4856K3007l147j4930
6897B3708l9527K1522L5174K8488l432k2033k068p344k1804j7176r622j784J3906
6884a992r339j2674J6533R325j925o207J2051l361L968j6001R29P033n118K6436
6870A9658J596j8475k2347j4499r066J8112r882M7747j51m3042J351M965j9056
$$ plain form
6963 -43503 -47814 -31404 4311 13439 14028 4914 14046 -4469 -37303 -13130 19823 14574 5763
6950 5763 17069 26891 -3914 -6549 -7630 -6000 -18940 -26161 -11904 -2758 -3103 -33410 -23987 -13743
6936 -13743 -613 -13839 -24286 -16084 -26398 -29453 -21196 -21098 -22509 -5605 -7521 935 -5594 -6776
6922 -6776 -21270 -13833 -16542 -34413 -46453 -40337 -38609 -19723 23683 31105 36807 25554 44949
6909 44949 69722 54941 35809 17307 2106 -12568 -8277 -16078 18778 41785 38638 23708
6897 23708 -15819 5703 40877 69365 65933 43900 41832 34488 12684 -4492 -14114 -15898 -1992
6884 -1992 -11331 -24005 -7472 1853 -72 -6279 5772 2411 6379 -9622 -8693 -1660 -6778 19658
6870 19658 21254 2779 -19568 -34067 -43133 -25021 -34903 12844 12693 -30349 -28998 -24033 -43089
6857d3089J23M7393K4202j733j923j3105l4042r7J1533J5167q110J2517O751j9705
6843d118J4736J868n534M3425K79j7737R585j4503j1374j3576J5145j2153k0876
6830a4833L812k9258k762K616K6352L0786j501l2878m031J5969k4442l4143J4639
6817d9674K1443O0677K6568q943l3969k5175j2232j1088J6701L0854L4828m1960
6805H030l2664M2067J7060j8178l181m2759k9448K1525L4734L908J7725m79Q842
6792B7182J2069l4902j5496J362o840J0423M8957N493P199j0624k1895j769j4689
6779F470j6286q155J1177K1630O421k2518p842K780m15k0530n280L5383J7058
6766A9893o634l0084Q984J6911p949j0114k163j1061p80M778j4885j7928q162
$$ plain form
6857 -43089 -42966 4427 28629 26896 24973 11868 -22174 -22271 -10738 4429 -3681 8836 15587 -4118
6843 -4118 10618 12486 6952 50377 50656 32919 42504 28001 16627 3051 18196 6043 -14833
6830 -14833 -11021 -40279 -43041 -40425 -14073 16713 15212 -17666 -21697 -5728 -30170 -64313 -49674
6817 -49674 -28231 32446 59014 50071 16102 -9073 -21305 -32393 -15692 15162 49990 8030
6805 8030 -24634 17433 34493 16315 13134 -29625 -59073 -37548 -2814 1094 18819 18340 27182
6792 27182 39251 4349 -11147 -9785 -16625 -6202 42755 48248 55447 44823 22928 21159 6470
6779 6470 -9816 -17971 -6794 14836 21257 -1261 -9103 -6323 -6738 -27268 -32548 2835 19893
6766 19893 13259 -16825 -7841 9070 1121 -8993 -11156 -22217 -22997 -18219 -33104 -51032 -59194
6753e9194P433K8698N828j0814j324M818m652q775J837J5111j2469q971K6419
6740a6055K2304l989j3820j1603J2344J6048k2618j438L4551J170j5788p229J6806
6727A0683k301j1174N756J4571O532P089j2916j143k4028J8948K9197K1623j6986
6714D5851j6284k6395L627j601j840L982l1438k9669k4431K4371L6612k065j1222
6701c0502R255J1933q427k9622k298K4488j6228L834j6869k1639K265j9873N5454
6688c8229N1684m506K8843J5988j3688m9128m0293m674J9561N259k4502M529J3320
6675c5836J9473k5737j9200j0200l7898R305N2269J5195L171K1910O395J9134
6663A7981j1936j3910j8279l2265m821L5986J8058L2664p112j5882j9833j7761
$$ plain form
6753 -59194 -51761 -23063 -17235 -28049 -29373 -24555 -29207 -37982 -36145 -21034 -33503 -42474 -16055
6740 -16055 6249 2260 -11560 -23163 -10819 5229 -17389 -18827 15724 16894 1106 -6123 10683
6727 10683 8382 -2792 2964 17535 24067 31156 18240 17097 -6931 12017 41214 62837 45851
6714 45851 29567 3172 6799 5198 3358 7340 -24098 -53767 -78198 -53827 -17215 -19280 -30502
6701 -30502 -21247 -9314 -17741 -47363 -49661 -25173 -41401 -37567 -54436 -76075 -73810 -93683 -38229
6688 -38229 13455 8949 37792 53780 40092 -9036 -49329 -54003 -34442 -29183 -53685 -49156 -35836
6675 -35836 -16363 -42100 -61300 -71500 -109398 -100093 -47824 -32629 -29458 -7548 -1153 17981
6663 17981 6045 -7865 -26144 -58409 -63230 -27244 -9186 23478 16366 484 -19349 -37110
6651c7110J0053o744J2111Q128R048N9845J6127o285l6933q319j1454J0448J3319
6638C2234j0204n1405j0025L247p28J910Q786l068m129J9569M756J8028L2373
6625D1344p828l2086j1043n138k5922K3161K4711j106j6327m228L803K2268j849
6612I760J6239j3160k4167j5702Q570L1269k0728M255m182l297o846J0099K290
6599e600L963K8922J8782j9573O478n926j9285J3272p701k2062k5345M78n083
6586c8680j4515J2346L741K8326M265l4836n989N036o372J7775J3173J8956J0346
6573A3572j6620q505j2904j6212J9787N650J7156J3919J0440L047j389l186j0083
6560A4672O546k297q813m457l9754q533K5769J9930K4186L076j2980k1215l1165
$$ plain form
6651 -37110 -27057 -33801 -21690 -13562 -4514 55331 71458 65173 28240 19921 8467 18915 32234
6638 32234 22030 -29375 -39400 -36153 -36881 -34971 -26185 -29253 -33382 -13813 -9057 8971 41344
6625 41344 33516 1430 -9613 -14751 -40673 -17512 7199 6093 -10234 -14462 -10659 11609 9760
6612 9760 25999 12839 -11328 -27030 -18460 12809 -7919 -3664 -7846 -11143 -17989 -7890 -5600
6599 -5600 -1637 27285 46067 26494 32972 27046 7761 21033 13332 -8730 -34075 -33597 -38680
6586 -38680 -53195 -40849 -37108 -8782 -4517 -39353 -45342 -40306 -46678 -28903 -15730 3226 13572
6573 13572 -3048 -11553 -24457 -40669 -20882 -15232 1924 15843 26283 29330 27941 24755 14672
6560 14672 21218 18921 10108 5651 -34103 -42636 -16867 3063 27249 30325 17345 -3870 -35035
6547c5035l938L5394L49n107J0412M943l7700K618P181r664j617k017p313Q379
6533c3115J3098J2434m916J3941P380j719n085j4115J1531O169K4662O883j6381
6520B0767o769j2387o647L822M677m552l454L1083K5175l4554k0554K3916J1178
6507C1701j7297l1862R531R175k3705K7175L763K4485L6772k1050j5649j5076
6495A7963k6240K3169l7108k4340k8179K6944K0744J0405r567P798N249o236l2785
6482e2183K2973L6920J1980j1606k6585K3053k3233r090J6524k1711J6972K5053
6470I067J9386r08j6763K807j0844j5682n97j9538l267j0358j3340L2183J2443
6457a5411P45k2012J361J098O449o644l4294j1951m053K1869L3864K824k9748
$$ plain form
6547 -35035 -38973 -3579 -3230 -8337 2075 7018 -30682 -28064 -20883 -30547 -32164 -34181 -41494 -33115
6533 -33115 -20017 -7583 -12499 1442 8822 7103 2018 -12097 -566 5603 30265 37148 20767
6520 20767 13998 1611 -5036 -1214 3463 -1089 -4543 26540 51715 17161 -3393 20523 31701
6507 31701 14404 -17458 -7927 1248 -22457 4718 8481 32966 69738 48688 33039 17963
6495 17963 -8277 14892 -22216 -46556 -74735 -47791 -27047 -16642 -26209 -18411 -13162 -19398 -52183
6482 -52183 -29210 7710 19690 8084 -18501 4552 -18681 -27771 -11247 -32958 -15986 9067
6470 9067 28453 27545 10782 13589 2745 -12937 -13534 -33072 -36339 -46697 -60037 -27854 -15411
6457 -15411 -14666 -36678 -35317 -34219 -27770 -34414 -68708 -80659 -84712 -62843 -28979 -26155 -55903
6444e5903J5281L0997j2632k538l3107J879K2712K2289K9973J8375m509j5581
6432A7236M784n325K9480J2860j9803n470l4756j1452K2272j559n676r466Q8L8225
6418C1438J1120l0490O311l5273J7557L4101j0055k0778K327k4604P576J7527
6406F757J4030l283j9513j297J0974k9048m2167l842J0827K9553m353K5884P870
6393B392J2338K850l3602j8947R487L0729R672k9123Q308j5335K2431J6667p109
6380A0758K1140J2245p583r901q05J9355j5942K940j6436l4697j3090j1331m781
6367d8128p090k9346K499J3444K5694N4480l941j0367n625k0563J2395M6413j418
6354B8447k0792l740k2620q590l2575j3247K6967K2781P160j9228J3604K7453
$$ plain form
6444 -55903 -40622 -9625 -22257 -24795 -57902 -56023 -33311 -11022 18951 37326 32817 17236
6432 17236 22020 16695 46175 59035 39232 33762 -994 -12446 9826 8267 2591 -6875 -6787 31438
6418 31438 42558 12068 18379 -16894 663 34764 24709 3931 6258 -18346 -10770 6757
6406 6757 20787 17504 -2009 -3306 7668 -21380 -63547 -67389 -56562 -27009 -31362 -5478 2392
6393 2392 14730 17580 -16022 -34969 -25482 5247 14919 -14204 -5896 -21231 1200 17867 10758
6380 10758 31898 44143 36560 26659 25854 45209 29267 32207 15771 -18926 -32016 -43347 -48128
6367 -48128 -55218 -84564 -82065 -68621 -42927 11553 7612 -2755 -8380 -28943 -16548 29865 28447
6354 28447 7655 3915 -18705 -27295 -59870 -73117 -46150 -23369 -16209 -35437 -21833 5620
6342E620M64j6832J0268j3711j1767J3998N843L384L6972J5527j5051l257j9031
6329A2427k6200K1358L0358l220j4786r032L212P224p970l0308m0639J084K2686
6316c3806J9171J4922r44j8498j7323J2440K1649N053j8652l8501k3600J1160
6304f6929K6229N2393L6495j5053k1333n445l0910J934J587k2007K1208L7377
6292A5546J3312j0722k086m83l8588l6888j6085J1845K9763L3849J6485N637k4564
6279b979j1110Q459L0036J1163q42n200l5208O2L452j4920J413n535R819L2771
6265B1381J9146l4911k0615N633K0601j1799R520L031k7295o247K5495L741p348
6252C33l008l214J6335Q106j740j7659j766j9968p931J2627J637J5768J0373j3858
$$ plain form
6342 5620 6084 -10748 -480 -14191 -25958 -11960 -6117 -2733 34239 49766 34715 31458 12427
6329 12427 -13773 7585 37943 34723 19937 10905 14117 21341 13371 -16937 -57576 -56492 -33806
6316 -33806 -14635 287 -657 -19155 -36478 -24038 -2389 2664 -15988 -54489 -78089 -66929
6304 -66929 -40700 11693 48188 33135 11802 6357 -24553 -22619 -21032 -43039 -21831 15546
6292 15546 28858 18136 16050 15567 -23021 -59909 -75994 -64149 -34386 -537 15948 21585 -2979
6279 -2979 -14089 -5630 24406 35569 34727 29527 -5681 -5619 -2167 -17087 -15674 -21209 -11390 21381
6265 21381 40527 5616 -14999 -9366 11235 -564 8956 11987 -15308 -21555 3940 7681 333
6252 333 -2675 -5889 10446 18552 16812 -847 -2613 -22581 -30512 -17885 -16248 -480 9893 -3965
6238c965K072J3145r878r342o926M796J851J6667k4682o686J1541K4078J708N755
6224B0134M460j1305l7797m250j1720k3352L0904K9719K3856K288p573k4279L7108
6211B8193l280k7832l0770m0710J7822J8983M348M2680j9186Q43J4766K0387j7244
6198I000k9611R982J9534r448k1439R299K5858j5924j1877P916k4547r676P954
6185c2979j9540J1502M6492M0837J7287l8581k2233k0418j2301J4829J655J8161
6173D711K1222j4059p199l51L8042J4516P224l1080l3918j0651n835L0683N334
6160A8639k3928K1419J3304o137k3957j5811m065p646L0851Q638K0496m648j1855
6147A5300l2780p158J7114J4475l8858J6368K2710j3377j8317J6928Q079k418
$$ plain form
6238 -3965 -1893 11252 1374 -7968 -14894 -10098 -8247 8420 -16262 -22948 -11407 12671 14379 20134
6224 20134 24594 13289 -24508 -28758 -40478 -63830 -32926 -3207 20649 22937 15364 -8915 28193
6211 28193 24913 -2919 -33689 -74399 -56577 -37594 -33246 9434 -9752 -8909 5857 26244 9000
6198 9000 -20611 -10629 8905 -543 -21982 -12683 13175 -2749 -14626 -6710 -31257 -40933 -32979
6185 -32979 -52519 -41017 5475 46312 63599 25018 2785 -17633 -29934 -15105 -13450 4711
6173 4711 25933 11874 4675 4324 42366 56882 64106 33026 -892 -11543 -17378 13305 18639
6160 18639 -5289 16130 29434 23297 -660 -16471 -20536 -28182 2669 11307 31803 27155 15300
6147 15300 -17480 -24638 -7524 6951 -31907 -15539 7171 -6206 -24523 -7595 484 -1934
6135a934r408J0217k210j5096k1403j9815n575K9620J2330J3865J0331n010k9741
6122c3829j4998K0603M0690K0283j687K035l8414j7131J8706P023L161R75j0205
6109b788k3784k4314J5463j1796J3202K2884j0722j8945M981K6204K1089j5520
6097d046L459J9475q631q276J0622J5260k3587K794l773j4341j5808M73L0043
6084C664m501j6177L94k1576k7191J6466L5711J5138j4117n876K8410J324j0385
6071A284j0663j8501P787L3746r879N826j4579Q940L345n827j1787k6628J7793
6058a9143L9045j346r390k7872l7150N057O3404L752j2183q107J0126k2696l2657
6045d9160L931J1678O847k2767K7378O670k3198K4644k590m0436j6266J2157L9517
$$ plain form
6135 -1934 -11342 -1125 -3335 -18431 -39834 -59649 -65224 -35604 -23274 -9409 922 -4088 -33829
6122 -33829 -48827 -28224 12466 32749 31062 33097 -5317 -22448 -3742 3281 6442 7417 -2788
6109 -2788 -26572 -50886 -35423 -47219 -34017 -11133 -21855 -40800 -35819 -9615 11474 -4046
6097 -4046 -587 18888 10257 1981 12603 27863 4276 7070 3297 -11044 -26852 -26379 3664
6084 3664 -837 -17014 -16620 -38196 -65387 -48921 -13210 1928 -12189 -18065 10345 11669 1284
6071 1284 -9379 -27880 -20093 13653 3774 9600 -4979 3961 7306 1479 -10308 -36936 -19143
6058 -19143 19902 18556 9166 -18706 -55856 -50799 12605 16357 4174 -3933 6193 -16503 -49160
6045 -49160 -45229 -33551 -26704 -49471 -22093 -15423 -38621 -13977 -16567 -57003 -73269 -61112 -21595
6032b1595K0983k4413p275l197R535J6824k1949k9316L4304L0367m719j7415k9747
6019d7613n309M659O370L074M31J7747p691K6750M946j2960K7178N778j2054L805
6005A5111K6241k4102k8328M891Q373j111L954R195P30k1297l167J7496m743j2933
5991i690n46J5188J1141J2397M505k0304q027N245L280j9239M325M845m0903k0078
5977e7861O620K2460N5447Q691o566l804j4145K3798k557k4536q927j2996o271
5964b0647l3043O527L385j948L0529J2861j2009o115p901p681P937L7464j6540
5951g181j4160Q967R028k7745j9727P084N355J0873K0599j4839l4446N103K3472
5938b7617J4702o680M01O940M8270j7324k3952j168l742P23j3516l103O304J8440
$$ plain form
6032 -21595 -612 -25025 -32300 -35497 -25962 -9138 -31087 -60403 -26099 4268 -451 -17866 -47613
6019 -47613 -52922 -48263 -41893 -38819 -38388 -20641 -28332 -1582 3364 -9596 17582 23360 11306 15111
6005 15111 41352 17250 -11078 -6187 2186 1075 5029 14224 14954 -6343 -9510 7986 3243 -9690
5991 -9690 -10236 4952 16093 28490 32995 12691 4664 9909 13189 -6050 -1725 3120 -37783 -57861
5977 -57861 -51241 -28781 26666 35357 28791 24987 10842 34640 32083 7547 -1380 -14376 -20647
5964 -20647 -53690 -47163 -43778 -45726 -15197 -2336 -14345 -20460 -28361 -36042 -28105 9359 -7181
5951 -7181 -21341 -12374 -3346 -31091 -50818 -43734 -38379 -27506 -6907 -21746 -56192 -51089 -27617
5938 -27617 -12915 -19595 -19194 -12254 36016 18692 -5260 -6428 -10170 -9447 -22963 -26066 -19762 -1322
5924a322L3217J0181l1623j1893O234P720j7248J6672M086j4180j2796R508j0028
5911a1472L0709J1191j3832J0060O527m7229l994Q116j5175K3146K0044J9060
5899C7151l668j679j292j327K0297l91m1555r345O981k442k5456l6239J7351j310
5885d2924J149L912M133K4521J2257j5677J5178J6728k166N645J4515O809m4988
5872i08l9113J784J9410R57J0717P019j7610j016J9357N06J3850J6388J184k4721
5858G804k8832j7474R344J9659j7621k5731k902P237J035K1166j0693k8361o509
5845g1878K1108K2368Q743l824q953J3934J041j551J8842n381j3097K1636J7902
5832B0890J1098n912j0296l1756K0429K1787l8545k4058j8238P069n928K4172
$$ plain form
5924 -1322 31895 42076 10453 -1440 4794 12514 -4734 11938 16024 1844 -10952 -1444 -11472
5911 -11472 19237 30428 16596 26656 33183 -14046 -18040 -9924 -25099 -1953 18091 37151
5899 37151 33483 31804 30512 29185 49482 49091 7536 -1809 5172 2730 -22726 -58965 -41614 -42924
5885 -42924 -41775 -37863 -33730 -9209 3048 -12629 2549 19277 17111 22756 37271 44080 -908
5872 -908 -40021 -38237 -18827 -17870 -7153 -134 -17744 -18760 597 1103 14953 31341 32525 7804
5858 7804 -21028 -38502 -29158 -9499 -27120 -52851 -55753 -48516 -47481 -26315 -37008 -65369 -71878
5845 -71878 -50770 -28402 -19659 -23483 -32436 -18502 -17461 -19012 -170 -5551 -18648 2988 20890
5832 20890 31988 26076 15780 -15976 4453 26240 -12305 -36363 -54601 -47532 -53460 -29288
5820b9288J2303l2662r906L3410K2864j8959J6507K898k5373m123J5383J9098
5808B152L1289J9457J692k6906K592j7956k1732Q425Q735o9k1804j465j5565N607
5794b5548J3297l9086k434L0209R348J2756l378l6746k1737J835K1946J7112J1117
5781a1309J1235p334J4763k1159o90j877j2395O660L5861k1740K063K936J7212
5768A4226k2249O679M333M700J2325N134j0378q019P729M293j2956j2019l608
5755i810j4212m024J3037r452P2L417j4809R354K5632K0368K740l0879J1544q074
5741e096j0882J7584q45L174K994k167j2054p657K6253L7263J2352K1060J5921
5728I7900j9194k8697k579k0035k2090J0300j852J0673l136J4288r525r749k291
$$ plain form
5820 -29288 -16985 -49647 -59553 -26143 -3279 -22238 -5731 -2833 -28206 -32329 -16946 2152
5808 2152 33441 52898 54590 27684 30276 12320 -9412 -987 7748 7679 -14125 -15590 -31155 -25548
5794 -25548 -12251 -51337 -53771 -23562 -14214 -1458 -4836 -41582 -63319 -61484 -39538 -22426 -11309
5781 -11309 -74 -7408 7355 -13804 -14494 -16371 -28766 -22106 13755 -7985 -5922 -2986 14226
5768 14226 -8023 -1344 2989 7689 20014 25148 14770 6751 14480 18773 5817 -6202 -9810
5755 -9810 -24022 -28046 -15009 -24461 -24389 -20972 -35781 -26427 -795 19573 22313 -8566 2978 -5096
5741 -5096 -15978 1606 761 3935 6929 4762 -7292 -14949 11304 48567 60919 81979 97900
5728 97900 78706 50009 47430 27395 5305 15605 13753 24426 21290 35578 26053 16304 14013
5715A4013J3549l0047l4359J4107R384q833M736P059M001R606J2654o515k3073
5702a3718J930k6244j7254K4259L7569J0365n433o330j0817p817P847J9216L6126
5689D9699j1080j275J7316l2482k5612n046n349l2540j4779J1233l93j1616j2781
5676g4705J9961M3018L0630j8233P919k8867k8495L661K0315M747k5106M964q365
5663d8556r29K5665j547J9265N279j5908M139L8656N971k5089j1962J5613P099
5650A7696O85j621j6717K519K8850N75l2342j5951Q61l354p625J1589J9201j445
5636B921l862j3048L7145k954q63j4927J4782j584p793j6971q123r370j1787k2395
5622e8829L7729J5901j0061K0491P465j3903J4307M626n502k526j4895J0008Q301
$$ plain form
5715 14013 27562 -2485 -36844 -22737 -13353 -22186 -17450 -10391 -6390 3216 15870 9355 -13718
5702 -13718 -11788 -38032 -55286 -31027 6542 16907 11474 5144 -5673 -13490 -5643 13573 49699
5689 49699 38619 37344 54660 22178 -3434 -8480 -13829 -46369 -61148 -49915 -50308 -61924 -74705
5676 -74705 -54744 -11726 18904 671 8590 -20277 -48772 -45111 -24796 -20049 -45155 -40191 -48556
5663 -48556 -49485 -23820 -25367 -6102 -823 -16731 -12592 26064 32035 6946 -5016 10597 17696
5650 17696 18381 16760 43 2562 31412 31987 -355 -16306 -15445 -18799 -26424 -14835 4366 2921
5636 2921 -941 -13989 23156 20202 19339 4412 19194 17610 9817 -7154 -15277 -24647 -36434 -58829
5622 -58829 -21100 -5199 -15260 5231 12696 -1207 13100 17726 12224 9698 -5197 4811 13112
5609A3112j1760j7120j9926k2068J2256L2885L7221K6489O662j6794k0557p629
5597A2771l948J9703p138j8621K0473L3315J747k5308l1529l0101n420Q960l582
5584b8678J6981j0134k3636K0927J1410o501R86K2418Q377l638N67J2140M457
5571B5676k338K8214N268r517O729j0787k5395m016K4097j4324k9118k0950K4975
5558a486N857l6880j334j0949M201J5221o99l2686k14K9817K2917K552L530Q478
5544H325j2832K3885K313l0707K0448J0646k1094J0490K2907K205Q653J046r475
5531C6810j2452m628r344k1142j4694q009j5141N996M0614L1983J3060j948M771
5518D5876O210l8701k5888j1821J4684k7861K666L4838J5605j6039K1217J8356
$$ plain form
5609 13112 1352 -15768 -35694 -57762 -45506 -12621 24600 51089 57751 40957 20400 12771
5597 12771 8823 28526 21388 2767 23240 56555 58302 32994 1465 -28636 -34056 -25096 -28678
5584 -28678 -11697 -21831 -45467 -24540 -13130 -19631 -18645 3773 12150 8512 9079 21219 25676
5571 25676 23338 51552 56820 47303 54032 43245 17850 13834 37931 23607 -5511 -26461 -1486
5558 -1486 4371 -32509 -33843 -44792 -40591 -25370 -26069 -58755 -58969 -29152 -6235 -3683 -153 8325
5544 8325 -4507 19378 21691 -9016 11432 22078 984 11474 34381 36586 45239 46285 36810
5531 36810 24358 19730 10386 -10756 -25450 -33459 -48600 -42604 -1990 29993 43053 41105 45876
5518 45876 52086 13385 -12503 -24324 -9640 -37501 -34835 3 15608 -431 20786 39142
5506C9142N23q817k2265m0553j0814j632O810L1167O759k220j5026p690K6465
5493A849J1883r53K3912M939j3351m049j082j6708K442J2955k7560k4449j7051
5480d7223j0872K7359L9488j1440l9025P62J5887j0954l3148N993Q718L1493n863
5467b8825q709K2763K0480K1900N870j8598p719q658j4306k694L423J7170J3434
$$ plain form
5506 39142 39665 30848 8583 -31970 -42784 -44416 -37606 -6439 320 -1900 -16926 -24616 1849
5493 1849 13732 12779 36691 41630 28279 24230 23148 6440 8882 21837 -5723 -30172 -47223
5480 -47223 -58095 -30736 8752 -2688 -41713 -40951 -25064 -36018 -69166 -63173 -54455 -22962 -28825
5467 -28825 -37534 -14771 5709 27609 33479 14881 7162 -1496 -15802 -18496 -15073 2097 15531
$$ [...]
##END NTUPLES=NMR SPECTRUM
##END=
