##TITLE=Analysis number 326680
Compound Code cc 62039
Book Reference 511/60
Project Code adrs
Chemist Name stevem
##JCAMPDX= 6.0         $$ Bruker NMR JCAMP-DX V2.0
##DATA TYPE= NMR SPECTRUM
##DATA CLASS= NTUPLES
##ORIGIN= Bruker BioSpin GmbH
##OWNER= nmr
$$ XWIN-NMR		Version 3.5
$$ Fri Feb 16 13:33:12 2007 GMT Standard Time (UT+0h)  MAYBRIDGE\nmr@NMR_250MHZ
##.OBSERVE FREQUENCY= 250.131544655141
##.OBSERVE NUCLEUS= ^1H
##.ACQUISITION MODE= SIMULTANEOUS (DQD)
##.ACQUISITION SCHEME= undefined
##.AVERAGES= 16
##.DIGITISER RES= 18
##SPECTROMETER/DATA SYSTEM= dpx250
##.PULSE SEQUENCE= zg30
##.SOLVENT NAME= CDCl3
##.SHIFT REFERENCE= (INTERNAL, CDCl3, 0, 16.522)
##AUDIT TRAIL= $$ (NUMBER, WHEN, WHO, WHERE, WHAT)
$$ ##TITLE= Audit trail, XWIN-NMR		Version 3.5
$$ ##JCAMPDX= 5.01
$$ ##ORIGIN= Bruker BioSpin GmbH
$$ ##OWNER= nmr
$$ C:\u/data/dgb/nmr/ADRS/1120/pdata/1/auditp.txt
$$ ##AUDIT TRAIL=  $$ (NUMBER, WHEN, WHO, WHERE, WHAT)
(   1,<2007-02-16 13:32:53.46 +000>,<MAYBRIDGE\nmr>,<NMR_250MHZ>,
      <created by zg, POWCHK disabled, PULCHK disabled
       configuration hash MD5:
       49 4B E0 1D 92 C2 6B 37 9F E6 65 BC 52 41 86 1D
       data hash MD5: 64K
       58 E4 D8 6B 10 89 84 E1 81 A9 1F B2 6F 4A 15 DD>)
(   2,<2007-02-16 13:33:04.47 +000>,<MAYBRIDGE\nmr>,<NMR_250MHZ>,
      <Start of raw data processing
       ef LB = 0.3 FT_mod = 6 PKNL = 1 SI = 32K 
       data hash MD5: 32K
       62 99 B4 F9 2E 73 80 6F 68 21 BC E8 40 E7 11 94>)
(   3,<2007-02-16 13:33:06.11 +000>,<MAYBRIDGE\nmr>,<NMR_250MHZ>,
      <apk 
       data hash MD5: 32K
       34 0C E0 E6 F2 03 71 50 42 7A BF D2 F1 86 E3 21>)
(   4,<2007-02-16 13:33:06.79 +000>,<MAYBRIDGE\nmr>,<NMR_250MHZ>,
      <abs ABSG = 5 
       data hash MD5: 32K
       BD 58 55 1C D6 B0 0F D0 53 11 61 4B D7 8A 4D 09>)
$$ ##END=
$$ 
$$ hash MD5
$$ 3E 61 09 8C 73 26 45 67 62 5B 34 22 56 2E 1F BB
##$RELAX= 
##$RELAX= 
##$RELAX= 
##$RELAX= 
##$RELAX= 
##$RELAX= 
##$RELAX= 
$$ Bruker specific parameters
$$ --------------------------
##$DU= <C:\u>
##$EXPNO= 1120
##$NAME= <ADRS>
##$PROCNO= 1
##$TYPE= <nmr>
##$USER= <dgb>
##$AMP= (0..31)
100 100 100 100 100 100 100 100 100 100 100 100 100 100 100 100 100 100 
100 100 100 100 100 100 100 100 100 100 100 100 100 100 
##$AQSEQ= 0
##$AQ_mod= 3
##$AUNM= <au_zg>
##$AUTOPOS= <5 >
##$BF1= 250.13
##$BF2= 250.13
##$BF3= 250.13
##$BF4= 250.13
##$BF5= 500.13
##$BF6= 500.13
##$BF7= 500.13
##$BF8= 500.13
##$BYTORDA= 1
##$CFDGTYP= 0
##$CFRGTYP= 5
##$CHEMSTR= <none>
##$CNST= (0..31)
1 1 145 1 1 1 1 1 1 1 1 1 1 1 1 1 1 1 1 1 1 1 1 1 1 1 1 1 1 1 1 1 
##$CPDPRG= <>
##$CPDPRG1= <>
##$CPDPRG2= <>
##$CPDPRG3= <>
##$CPDPRG4= <mlev>
##$CPDPRG5= <mlev>
##$CPDPRG6= <mlev>
##$CPDPRG7= <mlev>
##$CPDPRG8= <mlev>
##$CPDPRGB= <>
##$CPDPRGT= <>
##$D= (0..31)
0 1 0 0 0 0 0 0 0 0.06 0 0 0 0 0 0 0.0002 0 0 0 0 0 0 0 0 0 0 0 0 0 0 
0 
##$DATE= 1171632772
##$DBL= (0..7)
120 120 120 120 120 120 120 120 
##$DBP= (0..7)
150 150 150 150 150 150 150 150 
##$DBP07= 0
##$DBPNAM0= <>
##$DBPNAM1= <>
$$ [...]
##$SUBNAM7= <"">
##$SUBNAM8= <"">
##$SUBNAM9= <"">
##$SW= 20.6930455092707
##$SWIBOX= (0..15)
0 0 3 0 0 0 0 0 0 0 0 0 0 0 0 0 
##$SW_h= 5175.983436853
##$TD= 65536
##$TD0= 1
##$TE= 295.16
##$TE2= 300
##$TE3= 300
##$TEG= 300
##$TL= (0..7)
0 120 120 120 120 120 120 120 
##$TP= (0..7)
150 150 150 150 150 150 150 150 
##$TP07= 0
##$TPNAME0= <>
##$TPNAME1= <>
##$TPNAME2= <>
##$TPNAME3= <>
##$TPNAME4= <>
##$TPNAME5= <>
##$TPNAME6= <>
##$TPNAME7= <>
##$TPOAL= (0..7)
0.5 0.5 0.5 0.5 0.5 0.5 0.5 0.5 
##$TPOFFS= (0..7)
0 0 0 0 0 0 0 0 
##$TUNHIN= 0
##$TUNHOUT= 0
##$TUNXOUT= 0
##$USERA1= <user>
##$USERA2= <user>
##$USERA3= <user>
##$USERA4= <user>
##$USERA5= <user>
##$V9= 5
##$VALIST= <valist>
##$VCLIST= <CCCCCCCCCCCCCCC>
##$VD= 0
##$VDLIST= <DDDDDDDDDDDDDDD>
##$VPLIST= <PPPPPPPPPPPPPPP>
##$VTLIST= <TTTTTTTTTTTTTTT>
##$WBST= 1024
##$WBSW= 4
##$XGAIN= (0..3)
0 0 0 0 
##$XL= 0
##$YL= 0
##$YMAX_a= 466663
##$YMIN_a= -472267
##$ZGOPTNS= <>
##$ZL1= 120
##$ZL2= 120
##$ZL3= 120
##$ZL4= 120
##$ABSF1= 16.522
##$ABSF2= -4.171173
##$ABSG= 5
##$ABSL= 3
##$ALPHA= 0
##$AQORDER= 0
##$ASSFAC= 0
##$ASSFACI= 0
##$ASSFACX= 0
##$ASSWID= 0
##$AUNMP= <proc_1d>
##$AZFE= 0.1
##$AZFW= 0.1
##$BCFW= 0
##$BC_mod= 0
##$BYTORDP= 0
##$COROFFS= 0
##$CY= 12.5
##$DATMOD= 1
##$DC= 0
##$DFILT= <>
##$DTYPP= 0
##$F1P= 14.0000005364418
##$F2P= -0.99999901652339
##$FCOR= 0.5
##$FTSIZE= 32768
##$FT_mod= 6
##$GAMMA= 0
##$GB= 0
##$INTBC= 1
##$INTSCL= 1
##$ISEN= 128
##$LB= 0.3
##$LEV0= 0
##$LPBIN= 0
##$MAXI= 10000
##$MC2= 0
##$MEAN= 0
##$ME_mod= 0
##$MI= 0
##$NCOEF= 0
##$NC_proc= -2
##$NLEV= 6
##$NOISF1= 0
##$NOISF2= 0
##$NSP= 0
##$NTH_PI= 0
##$NZP= 0
##$OFFSET= 16.522
##$PC= 1
##$PHC0= 227.7775
##$PHC1= 5.570225
##$PH_mod= 1
##$PKNL= yes
##$PPARMOD= 0
##$PSCAL= 4
##$PSIGN= 0
##$REVERSE= no
##$SF= 250.13
##$SI= 32768
##$SIGF1= 0
##$SIGF2= 0
##$SINO= 400
##$SIOLD= 32768
##$SREGLST= <1H.CDCl3>
##$SSB= 0
##$STSI= 32768
##$STSR= 0
##$SW_p= 5175.98343685301
##$SYMM= 0
##$S_DEV= 0
##$TDeff= 65536
##$TDoff= 0
##$TI= <Analysis number 999999
Compound Code 99
Book Reference 9
Project Code 9>
##$TILT= no
##$TM1= 0
##$TM2= 0
##$TOPLEV= 0
##$USERP1= <user>
##$USERP2= <user>
##$USERP3= <user>
##$USERP4= <user>
##$USERP5= <user>
##$WDW= 1
##$XDIM= 32768
##$YMAX_p= 485586418
##$YMIN_p= -55052
$$ End of Bruker specific parameters
$$ ---------------------------------
##NTUPLES= NMR SPECTRUM
##VAR_NAME=  FREQUENCY,     SPECTRUM/REAL,   SPECTRUM/IMAG
##SYMBOL=    X,             R,               I
##VAR_TYPE=  INDEPENDENT,   DEPENDENT,       DEPENDENT
##VAR_FORM=  AFFN,          ASDF,            ASDF
##VAR_DIM=   32768,         32768,           32768
##UNITS=     HZ,            ARBITRARY UNITS, ARBITRARY UNITS
##FACTOR=    0.157963299565203, 1,           1
##FIRST=     4132.6476996994, 0,             0
##LAST=      -1043.33573715361, 0,           0
##MIN=       -1043.33573715361, -55052,      0
##MAX=       4132.6476996994, 485586418,     0
$$ Real data points
##PAGE= N=1
##DATA TABLE= (X++(R..R)), XYDATA
$$ [...]
14949a155M667l512L170P291M100N555r29j361L02j0166k5262N301P187q675m717
$$ -1155 3512 0 3170 10461 14561 20116 19187 17826 18128 7962 -17300 -11999 -4812 -13487 -18204
14934a8204R587N33p517n72J754M963J8222Q212j6967r847J1077K539O557j041
$$ -18204 -8617 -8084 -15601 -16173 -14419 -9456 8766 16978 11 -9836 1241 3780 10337 9296
14920I296N262l024L892j0179p157J3447k350r281K399Q50L697j4501K741L201
$$ 9296 14558 11534 15426 5247 -1910 11537 9187 -94 2305 3155 6852 -7649 -4908 -1707
14906a707Q577P387n721j1014o640P853Q163j450j926n881K614J2062P279p411
$$ -1707 6870 14257 8536 -2478 -9118 -1265 6898 5448 3522 -2359 255 12317 19596 12185
14892A2185J905K518N652p922j0189Q37L883P451l180j2276j768N814n094j0028
$$ 12185 14090 16608 22260 14338 4149 4986 8869 16320 13140 864 -904 4910 -184 -10212
14878a0212K0695M25r734n820l827o805k1521q902P189K971L491N054R763P138
$$ -10212 10483 10908 1174 -4646 -8473 -15278 -36799 -45701 -38512 -35541 -32050 -26996 -17233 -10095
14864a0095J91Q811K387O623J5368m2p736q346O845j340m760q738J275q166r06
$$ -10095 -9904 -1093 1294 7917 23285 23243 15507 7161 14006 12666 7906 -832 443 -7723 -8629
14849h629P680J107N37P512J2517J562l367q160j0387j8697O733J5608n214m103
$$ -8629 -949 158 695 8207 20724 22286 18919 10759 372 -18325 -11592 4016 -1198 -5301
14835e301n527p003o613Q585J6566O390r764R025n61n79n79P425J4740o969k5671
$$ -5301 -10828 -17831 -24444 -15859 707 7097 -2667 6358 5797 5218 4639 12064 26804 19835 -5836
14820e836n256m50Q229J4496N901j4299j7016L061O636k35k700R12M139P865J2009
$$ -5836 -11092 -11542 -3313 11183 17084 2785 -14231 -11170 -4534 -4769 -7469 -6557 -2418 5447 17456
14805A7456k31r754l942n97q839k844p994L503L356o50N673l850j284M167J4096
$$ 17456 17225 7471 3529 2932 -5907 -8751 -16745 -13242 -9886 -10536 -4863 -8713 -9997 -5830 8266
14790H266o16j3265k356o166p47P857O974L184m875L245K151l624k559Q763R427
$$ 8266 7650 -5615 -7971 -14137 -14884 -7027 -53 3131 -1744 1501 3652 28 -2531 6232 15659
14775A5659j934M0j2169q161j1742L197K0983J3610n007j5669J2772J744j5799
$$ 15659 13725 13765 1596 -6565 -18307 -15110 5873 19483 14476 -1193 11579 13323 -2476
14762b476L1L754O503o599j8977q677J42L415q50k360J5957R594R298M759r914
$$ -2476 -2445 1309 7812 1213 -17764 -26441 -26299 -22884 -23734 -26094 -10137 -543 8755 13514 3600
14747C600j735j546r752K772N562j049j69j252k173R89N531m483J852l247N930
$$ 3600 1865 319 -9433 -6661 -1099 -2148 -2317 -3569 -5742 -4753 778 -3705 -1853 -5100 830
14732H30m584l525J3254N146m287N638p234M560M890k024j945J3831O881j6486
$$ 830 -3754 -7279 5975 11121 6834 12472 5238 9798 14688 12664 10719 24550 31431 14945
14718A4945j1188q298o500o293p837n450N784Q419K2363J3884l484p478p063j5366
$$ 14945 3757 -4541 -11041 -17334 -25171 -30621 -24837 -16418 5945 19829 16345 8867 1804 -13562
14704a3562L16m692J2849K1479j1734m196j296K982J2992M436q104j6290j1609
$$ -13562 -13246 -17938 -5089 16390 4656 460 -836 2146 15138 19574 11470 -4820 -16429
14691a6429N373L177Q663l188K561n050Q173m185p900M718J6579o664j7938L652
$$ -16429 -11056 -7879 784 -2404 157 -4893 3280 -905 -8805 -4087 12492 5828 -12110 -8458
14677h458R574n095K8n327j3871R984R674P727j0638j921J0994Q592m101q535
$$ -8458 1116 -3979 -3951 -9278 -23149 -13165 -3491 4236 -6402 -8323 2671 11263 7162 -1373
14663a373r560j2761M664N791j6910j338J0954R700K959j5926n352J1994J83P544
$$ -1373 -10933 -23694 -19030 -13239 -30149 -31487 -20533 -10833 -7874 -23800 -29152 -17158 -16975 -9431
14649i431J2075k488k750m495J575O358p183j2306r732Q327J0642l74k631L922
$$ -9431 2644 156 -2594 -7089 -5514 844 -6339 -18645 -28377 -20050 -9408 -9782 -12413 -8491
14635h491j0557m58q484P384k717p852O25P003j854k793P020L157p54J1881J8297
$$ -8491 -19048 -19506 -27990 -20606 -23323 -31175 -30550 -23547 -25401 -28194 -21174 -18017 -18771 -6890 11407
14620A1407J263j9471m163k215p331N843J7011J6560J1393j0094j1868j5131j0988
$$ 11407 12670 -6801 -10964 -13179 -20510 -14667 2344 18904 30297 20203 8335 -6796 -17784
14607a7784O518k045l644M560j930j857R232J0829r601P22l931q515J868P33R45
$$ -17784 -11266 -13311 -16955 -12395 -14325 -16182 -6950 3879 -5722 -5000 -8931 -17446 -15578 -14845 -13900
14592a3900M961J0185N94l919r109n954J3120O522M172N22M028m204p075k943
$$ -13900 -8939 1246 1840 -2079 -11188 -17142 -4022 2500 6672 7194 11222 7018 -57 -3000
14578c000L45J654J045p159O730J4915m42j2682J0006m075o361o821l095O119
$$ -3000 -2655 -1001 44 -7115 -385 14530 14088 1406 11412 7337 976 -5845 -8940 -2821
14564b821N663m634N267j0755m631N67M500J0168m533N684k688j2295J3543M578
$$ -2821 2842 -1792 3475 -7280 -11911 -11344 -6844 3324 -1209 4475 1787 -10508 3035 7613
14550G613m609R241P824m165j0962n946nj521N379J1254K3840n562o624R313k135
$$ 7613 3004 12245 20069 15904 4942 -1004 -1009 -2530 2849 14103 37943 32381 25757 35070 32935
14535C2935p425j2869k139p543j0264M392J1292J3890j508j1004j5540J3026J796
$$ 32935 25510 12641 10502 2959 -7305 -2913 8379 22269 20761 9757 -5783 7243 9039
14522I039J3569P51r116k729N915O16q598j1258J381N453m893k863L127o645m102
$$ 9039 22608 23359 14243 11514 17429 18045 9447 -1811 -430 5023 130 -2733 394 -6251 -10353
14507a0353J3187P874p273N141N441k079J476Q023L530l709j511K744j3801m569
$$ -10353 2834 10708 3435 8576 14017 11938 13414 21437 24967 21258 19747 22491 8690 4121
14493D121M385j895l875j626M97j003J1694J1333K700o230j1068N152j2885o026
$$ 4121 8506 6611 2736 1110 1607 604 12298 23631 26331 20101 9033 14185 1300 -4726
14479d726j1210M795J7131l26l368j2105m474J0460j1315M328J3769L187O432
$$ -4726 -15936 -11141 5990 5664 2296 -9809 -14283 -3823 -15138 -10810 2959 6146 12578
14466A2578j2128j2631M039j789Q595J517l65P303n353N421k535j4385m194P812
$$ 12578 450 -12181 -8142 -9931 -1336 181 -184 7119 1766 7187 4652 -9733 -13927 -6115
14452f115P07q982J484k924k372J0717k3j399l494Q111l47M37n891R07o57l413
$$ -6115 -5408 -14390 -12906 -15830 -18202 -7485 -7508 -8907 -12401 -4290 -4637 -4200 -10091 -9184 -9841 -13254
14436a3254J1110O882j059m089L684J392O7N511j022O580R706r546r291o342L098
$$ -13254 -2144 4738 3679 -410 3274 4666 4733 10244 9222 15802 25508 15962 6671 329 3427
14421C427O044N551K312j280j5189q581K464J6376N503j2284l618o588r5L74n990
$$ 3427 9471 15022 17334 16054 865 -7716 -5252 11124 16627 4343 725 -5863 -5958 -5584 -11574
14406a1574q933N591R502N86l638J3509M964j0366j957j346j0665l950M476P902
$$ -11574 -20507 -14916 -5414 -4828 -8466 5043 10007 -359 -2316 -3662 -14327 -18277 -13801 -5899
14392e899P8J655K842L553M326p170j764N80J6882J5047l912o470m92j3664j9363
$$ -5899 -5821 -4166 -1324 2229 6555 -615 -2379 -1799 15083 30130 26218 19748 19256 5592 -13771
14377a3771J7754N231j0094m761J552k144K414n701k831R016J6702O78j3538k503
$$ -13771 3983 9214 -880 -5641 -4089 -6233 -3819 -9520 -12351 -3335 13367 14045 507 -1996
14363a996J54j2587Q270M383O14o572O563p913j3682J839M300J506l668L719M127
$$ -1996 -1842 -14429 -6159 -1776 -1162 -7734 -1171 -9084 -22766 -20927 -16627 -15121 -18789 -15070 -10943
14348a0943J520L640o749L435O07m494m629M76m348k209P156m174P635O495N161
$$ -10943 -9423 -5783 -12532 -9097 -8490 -12984 -17613 -17137 -21485 -23694 -16538 -20712 -13077 -6582 -1421
14333a421P6r312L643J632J4504p395j7668m564k940j6565O369O034P12R690J7529
$$ -1421 -1345 -10657 -7014 -5382 9122 1727 -15941 -20505 -23445 -40010 -33641 -27607 -26895 -17205 324
14318C24k244j2978J4873o255j3022q403O665J2128J428N679p528J0044L288l94
$$ 324 -1920 -14898 -25 -6280 -19302 -27705 -21040 -8912 -7484 -1805 -9333 711 3999 3605
14304C605j869r938M085m774o835K747J5117L426r553K087M649k00j859j3718
$$ 3605 1736 -8202 -4117 -8891 -15726 -12979 2138 5564 -3989 -1902 2747 2547 688 -13030
14290a3030O939J8589L93k3597p92Q323L309j27p794o261j903M549L158M928J3192
$$ -13030 -6091 12498 12891 -10706 -11498 -3175 134 7 -7787 -14048 -15951 -11402 -8244 -3316 9876
14275I876j2674m183L686K127K944J1525M131j0036j0554j689J3662J1579L021
$$ 9876 -2798 -6981 -3295 -1168 1776 13301 17432 7396 -3158 -4847 8815 20394 23415
14262B3415j5302m110l27K408N866L244L018n893p119j2349l117J7899l40k61
$$ 23415 8113 4003 3676 6084 11950 15194 18212 12319 5200 -7149 -10266 7633 7293 7032
14248G032j4100j5096R303Q843m404K685k371o586q954J2466K567o49n043j4454
$$ 7032 -7068 -22164 -12861 -4018 -8422 -5737 -8108 -14694 -23648 -11182 -8615 -9264 -14307 -28761
14234b8761P878J4086M01O936J2129O604k794r941r431J1820J5824j0041j8110
$$ -28761 -20883 -6797 -6396 540 12669 19273 16479 6538 -2893 8927 24751 14710 -3400
14221c400o610M426K909j5051j5386O025J4871j76j7411m083N122J1352R90K1364
$$ -3400 -10010 -5584 -2675 -17726 -33112 -27087 -12216 -12392 -29803 -33886 -28764 -17412 -16422 4942
14207D942o33j8611p869Q558J1953N37J658j6076l534J4083J2347q521m842l50
$$ 4942 4309 -14302 -22171 -13613 -1660 -1123 535 -15541 -19075 -4992 7355 -1166 -6008 -6358
14193f358J4613N939N896o493q439q068N19l001j2912R030O192Q748O19m121R092
$$ -6358 8255 14194 20090 13597 5158 -2910 -2391 -5392 -18304 -9274 -3082 5666 6285 2164 11256
14178A1256m301j0293j2303P256O061J1945N51n863o205k782M316l725q832N785
$$ 11256 6955 -3338 -15641 -8385 -2324 9621 10172 4309 -1896 -4678 -362 -4087 -12919 -7134
14164g134P554N885K13o449J314J45q089j1360J4469K6471k664K401p434l594
$$ -7134 420 6305 6518 69 1383 1528 -6561 -17921 -3452 23019 20355 22756 15322 11728
14150A1728m964m019k030L71j3693O189P131j792m762m086N77J098J4304j2890
$$ 11728 6764 2745 715 1086 -12607 -6418 713 -1079 -5841 -9927 -9350 -8252 6052 -6838
14136f838j0993R923j765n68O331k418R911J8239J385j6792o240j53M389j3926
$$ -6838 -17831 -7908 -9673 -10241 -3910 -6328 3583 21822 23207 6415 175 22 4411 -9515
14122i515R87P692N908K244o282o513p030N154P036J1075Q138j1741j5104j1920
$$ -9515 -8528 -836 5072 7316 1034 -5479 -12509 -7355 -319 10756 18894 7153 -7951 -19871
14108a9871k459J1582O721P6q633O887r727q891J3647J08j2192j5793q928J4477
$$ -19871 -22330 -10748 -4027 -3951 -12584 -5697 -15424 -24315 -10668 -10560 -22752 -38545 -47473 -32996
14094c2996J6900R315N150M918p140K478L805j0269n180P444m953q786J930Q310
$$ -32996 -16096 -6781 -1631 3287 -3853 -1375 2430 -7839 -13019 -5575 -10528 -19314 -17384 -9074
14080i074J218p139p615k709O384J0890P09j600k105q429o864J6976J4942J571
$$ -9074 -7856 -14995 -22610 -25319 -18935 -8045 -7336 -8936 -11041 -19470 -26334 -9358 5584 7155
14066G155K128j0161j884P96l809L696m262j371K978Q533m166L542L206r80J1943
$$ 7155 9283 -878 -2762 -1966 -5775 -2079 -6341 -7712 -4734 3799 -367 3175 6381 5401 17344
14051A7344j0037k5955L411J2227n638j2491J291J4395R491K847k41K410m711
$$ 17344 7307 -18648 -15237 -3010 -8648 -21139 -19848 -5453 4038 6885 6644 9054 4343
14038D343q999n395N879P297o282J345j0426m630O255O151j1953N584J0222k709
$$ 4343 -4656 -10051 -4172 3125 -3157 -1812 -12238 -16868 -10613 -4462 -16415 -10831 -609 -3318
14024c318O427Q732J406k800m743j1065O374K703K785p859o130j816Q500J2475
$$ -3318 3109 11841 13247 10447 5704 -5361 1013 3716 6501 -1358 -7488 -9304 -804 11671
14010A1671R408j2138n417p947L228m722l074N295N242Q425n329m785o65m575
$$ 11671 21079 8941 3524 -4423 -1195 -5917 -8991 -3696 1546 9971 4642 -143 -808 -5383
13996e383M38k221J2924Q994M387j3202j1135r306r289o553R926J1723J1001k223
$$ -5383 -4945 -7166 5758 14752 19139 5937 -5198 -14504 -23793 -30346 -20420 -8697 2304 81
13982H1j8516K078r582j2762J7485Q814J827J1071Q171k683J0011P057j0271j1550
$$ 81 -18435 -16357 -25939 -38701 -21216 -12402 -10575 496 8667 5984 15995 23052 12781 1231
13968A231n533r50P821o559n222J1991j355j86J889q734O465O978k233M403L405
$$ 1231 -4302 -5252 2569 -3990 -9212 2779 1424 1238 3127 -5607 858 7836 5603 10006 13411
13953A3411j0431k479O785o667l684M079M513p068k684K44P416J1305J9909n519
$$ 13411 2980 501 7286 619 -3065 1014 5527 -1541 -4225 -3981 3435 14740 34649 29130
13939B9130r673j7103k331q105Q685J3604j1492j2266M664k290q588j2401J6720
$$ 29130 19457 2354 23 -8082 603 14207 2715 -9551 -4887 -7177 -15765 -28166 -11446
13926a1446L282M641L309M27j559Q178P169Q836p559J139j853L872q992p32N834
$$ -11446 -8164 -3523 -214 213 -1346 6832 14001 22837 15278 16417 14564 18436 9444 8712 14546
13911A4546n227j220l976j0339l915J303L884n505L037o76J1671J0219p994j032
$$ 14546 9319 8099 4123 -6216 -10131 -8828 -4944 -10449 -7412 -8088 3583 13802 5808 4776
13897D776R38r210j9159J0220J3298N473J622n512n145j1128Q558J1615j3427
$$ 4776 5714 -3496 -22655 -12435 863 6336 7958 2446 -2699 -13827 -5269 6346 -7081
13884g081K295J111P281Q458o054r200M225j0600j087N958M923r957K963J1840
$$ -7081 -4786 -3675 3606 12064 6010 -3190 1035 -9565 -10652 -4694 229 -9728 -6765 5075
13870E075j4066M254L922R278n699j4873k0591P891J6156O852j592l163p989m825
$$ 5075 -8991 -4737 -815 8463 2764 -12109 -32700 -24809 -8653 -1801 -3393 -6556 -14545 -19370
13856a9370J304J4226J0701j5053j069R022n90K563R406Q656O185p805q275L835
$$ -19370 -18066 -3840 6861 -8192 -9261 -239 -829 1734 11140 19796 25981 18176 9901 13736
13842A3736j4932p155J8152J973n751q527N446O69j955k708J1842M15j1091k830
$$ 13736 -1196 -8351 9801 11774 6023 -2504 2942 3611 1656 -1052 10790 11205 114 -2716
13828b716n577l362Q834J7782o622k2683K732J0634J0344L967n45j319p986R088
$$ -2716 -8293 -11655 -2821 14961 8339 -14344 -11612 -978 9366 13333 12788 11469 3483 12571
13814A2571O68q763O259J7486m949n545j1425o83n520j049q094j428n141j433
$$ 12571 13239 4476 10735 28221 23272 17727 6302 5619 99 -950 -9044 -10472 -15613 -17046
13800a7046K605J1058J345J408P30N947Q799N450l102j4007q504J3911J0194Q475
$$ -17046 -14441 -3383 -2038 -630 100 6047 14846 20296 17194 3187 -5317 8594 18788 27263
13786B7263r042K911k0558k670N384R451O171j135j6063j3787O96J1438R593N499
$$ 27263 18221 21132 574 -2096 3288 12739 18910 17775 1712 -12075 -11379 59 9652 15151
13772A5151j1075p543j837Q866k803n613n68m282N359K892M238J7486N228o620
$$ 15151 4076 -3467 -5304 3562 759 -4854 -5422 -9704 -4345 -1453 2785 20271 25499 18879
13758A8879j4005p33M453j353J7508J6331q239p641J657K2215M686r906J5751
$$ 18879 4874 4141 8594 7241 24749 41080 32841 25200 26857 49072 53758 43852 59603
13745E9603J8649J5084Q356j7630j2400j2713r256j9141j4831p659K413J6528
$$ 59603 78252 93336 101692 84062 71662 58949 49693 30552 15721 8062 10475 27003
13733B7003J0310L138j1532K0481J1360k278q388j3118J4833J232J196J0108J8705
$$ 27003 37313 40451 28919 49400 60760 58482 50094 36976 51809 53041 54237 64345 83050
13720H3050O042O329Q750K0275L617j3789m934p100J5o796j7775j3648P928J3720
$$ 83050 89092 95421 104171 124446 128063 114274 109340 102240 102255 95459 77684 64036 71964 85684
13706H5684l778k6400k0767O134j486r370N407J1827M458j0947r308J824M449
$$ 85684 81906 55506 34739 40873 39387 30017 35424 47251 51709 40762 31454 33278 37727
13693C7727j261l180J727P328K0066J4585K5982L862k72k152p195k6355k3902
$$ 37727 36466 33286 35013 42341 62407 76992 102974 106836 106564 104412 97217 70862 46960
13680D6960k9770r093R924J4618p060j3657n303K739O707j165j3559O850o362
$$ 46960 17190 8097 18021 32639 25579 11922 6619 9358 16065 14900 1341 8191 1829
13667A829M951L989j1158j6262j0823P498J3535J0253O174l212N25K027n504k096
$$ 1829 6780 10769 -389 -16651 -27474 -19976 -6441 3812 9986 6774 7299 9326 3822 1726
13653A726j912J353N915J122l368p363k216J4695k796m099Q818O767j0355j8168
$$ 1726 -186 1167 7082 8204 4836 -2527 -4743 9952 7156 3057 11875 18642 8287 -9881
13639i881L707Q115k373j761K477o011J0076J0595O11j8465j0946o76O454J8897
$$ -9881 -6174 1941 -432 -2193 284 -5727 4349 14944 15555 -2910 -13856 -14532 -8078 10819
13625A0819J0021j822m662m179K667j5086P96l597Q799J4933p315q593M88j859
$$ 10819 20840 19018 14356 10177 12844 -2242 -1446 -5043 3756 18689 11374 2781 3269 1410
13611A410n197P993M319l62Q521j0137k309N909r978M890L081p620J511p657p650
$$ 1410 -3787 4206 8525 8163 16684 6547 4238 10147 169 5059 8140 520 2031 -5626 -13276
13596a3276q501P278R296k032M383j016K902o073K960J2722L075r537q821j137
$$ -13276 -21777 -14499 -5203 -7235 -2852 -3868 -966 -7039 -4079 8643 11718 2181 -6640 -7777
13582g777q721l319N520J5492P219M46P113o384J194m507P944k91q090N329o77
$$ -7777 -16498 -19817 -14297 1195 8414 8860 15973 9589 10783 6276 14220 13929 5839 11168 10491
13567A0491K363J9270l288q945k1099l779N042K868k563l68q457P059L300J329
$$ 10491 12854 32124 28836 19891 -1208 -4987 55 2923 360 -8 -8465 -1406 1894 3223
13553C223Q270Q412j389j145P94J3605N41q363j1960p855N975J0440N522J589
$$ 3223 11493 19905 18516 17371 18165 31770 32311 23948 11988 4133 10108 20548 26070 27659
13539B7659j8499j1870Q348Q777L299K430r03K905K183p391r649J899k163m583
$$ 27659 9160 -2710 5638 14415 17714 20144 19241 22146 24329 16938 7289 9188 7025 2442
13525B442M803J3021Q226o361k287p449j4815q694J01J4729N813m883K366J1865
$$ 2442 7245 20266 28492 22131 19844 12395 -2420 -11114 -11013 3716 9529 4646 7012 18877
13511A8877J6455j1062l641J3277o706j3287j0831p32N066Q539N817M42j1662
$$ 18877 35332 24270 20629 33906 27200 13913 3082 2350 7416 15955 21772 22214 10552
13498A0552j1847K664K303R076J2955J6595j945j0173o470p758L70J864J552k959
$$ 10552 -1295 1369 3672 12748 25703 42298 40353 30180 23710 15952 16322 18186 19738 16779
13484A6779L557m1K1491l772j8587L429J1699J2413o746L537l134n746P639j963
$$ 16779 20336 20295 41786 38014 19427 22856 34555 46968 40222 43759 40625 34879 42518 40555
13470D0555K94j1033l2434m135J7074R402N101J4928j395n270p029j208o412O810
$$ 40555 40849 29816 -2618 -6753 10321 19723 24824 39752 38357 33087 26058 24850 18438 25248
13456B5248p292j0737J6993P536J6132R983J32p330r425o538M901J1158p699j7120
$$ 25248 17956 7219 24212 31748 47880 57863 57995 50665 41240 34702 39603 50761 43062 25942
13442B5942o378K744j337o751k724k801R383M083m717o719k703N147J4387l761
$$ 25942 19564 22308 20971 14220 11496 8695 18078 22161 17444 10725 8022 13169 27556 23795
13428B3795n909q410r3R706L400K087j0175k648O539J5681J0182j286j3596o2
$$ 23795 17886 9476 9383 19089 22489 24576 14401 11753 18292 33973 44155 42869 29273 29211
13414B9211J891J195j6179n913J1780N746k907q755k699J8177K1926K93J235j590
$$ 29211 31102 32297 16118 10205 21985 27731 24824 16069 13370 31547 53473 53766 55001 53411
13400E3411K726J7672J2766j6220l588j462k610r798j3720J4404J3531L292j732
$$ 53411 56137 73809 86575 70355 66767 65305 62695 52897 39177 53581 67112 70404 68672
13387F8672k511p309N142L962N413j5004j8650j640R540l930P04J9537J9573j451
$$ 68672 66161 58852 63994 67956 73369 58365 39715 38075 47615 43685 44389 63926 83499 82048
13373H2048j4457k2501l32J1390P286O063J0013j724m442k700k837J0686K994
$$ 82048 67591 45090 44758 56148 63434 69497 79510 77786 73344 70644 67807 78493 81487
13360H1487j0647j531P991q73o265r08J5457K02q243J41o025J503J9151J4578
$$ 81487 70840 69309 77300 76427 70162 69254 84711 84913 76670 76811 70786 72289 91440 106018
13346A06018J3189N751j6395j5234L196O244P756O865p321j6405Q591L1019J7590
$$ 106018 119207 124958 108563 93329 96525 102769 110525 117390 110069 93664 102255 133274 150864
13333A50864m31j0194J0608J4645j742q588m51k111K695Q502l747k332n787J0387
$$ 150864 150433 140239 150847 165492 163750 155162 154711 152600 155295 163797 160050 157718 151931 162318
13319A62318J7040J1609R361J2912M519m361n122K8774L2490N954Q664L0971J5496
$$ 162318 179358 190967 200328 213240 217759 213398 208276 237050 269540 275494 284158 315129 330625
13306C30625J7718J5532L6671N6063K5520K1091K6128L9225L7228M3795P4923
$$ 330625 348343 363875 400546 456609 482129 503220 529348 568573 605801 649596 724519
13295G24519R2509R9453J26786J36496J50102J80264K19539K94315L94327N54887
$$ 724519 817028 916481 1043267 1179763 1329865 1510129 1729668 2023983 2418310 2973197
13285B973197P74417J123775J661448K407975L246809L739854L023844R15220
$$ 2973197 3747614 4871389 6532837 8940812 12187621 15927475 18951319 19866539
13277A9866539j468136k956866l254902k734176j986554j350106q77550n23134
$$ 19866539 18398403 15441537 12186635 9452459 7465905 6115799 5238249 4715115
13269D715115k43919K0802K97648N88542P55349O15985J78263j61434j43047K25481
$$ 4715115 4471196 4491998 4789646 5378188 6133537 6749522 6927785 6766351 6623304 6848785
13259F848785Q45366J589593K204431K242456J550539R84859J182683J899952
$$ 6848785 7694151 9283744 11488175 13730631 15281170 16266029 17448712 19348664
13251A9348664K204113J381958l34989j956763k610827k157575j100069j72013
$$ 19348664 21552777 22934735 22599746 20642983 18032156 15874581 14774512 14602499
13243A4602499j58700j036199j828969j971578j542447q84513k40581K01839K26276
$$ 14602499 14443799 13407600 11578631 9607053 8064606 7180093 6939512 7141351 7367627
13234G367627j62126n92322p30493n76834l14425k0536K89948O48037J121556
$$ 7367627 7205501 6613179 5882686 5305852 4991427 4970891 5260839 5908876 7030432
13225G030432J774362K642761L533610L881350K794980K84516k293589l687077
$$ 7030432 8804794 11447555 14981165 18862515 21657495 21942011 19648422 15961345
13217A5961345l750159l053792k214156j558763j103176p88215n81678m37082
$$ 15961345 12211186 9157394 6943238 5384475 4281299 3493084 2911406 2474324
13209B474324l08161k54523k10478j78060j75603j59571j10209j05333r8624p4192
$$ 2474324 2166163 1911640 1701162 1523102 1347499 1187928 1077719 972386 873762 799570
13199G99570o9368p1383n7917l9788l0200k1720k1391l1113l5696l0180l19j4550
$$ 799570 730202 658819 600902 561114 530914 509194 487803 456690 420994 390814 390495 375945
13187C75945j9658k1101j2427o788p389k0701j7774k4923j4961L301J0728j2594
$$ 375945 356287 335186 322759 315971 308582 287881 270107 245184 230223 233524 244252 231658
13175B31658j0459j0421j223j5057j3511k1703l064p30J3386M072q885n594j7621
$$ 231658 221199 210778 209555 194498 180987 159284 156220 155490 168876 172948 164063 158469 140848
13162A40848m055o387l326O730J2008N762j3576k0006j6499Q13J0199k556P581
$$ 140848 136793 130406 127080 133810 145818 151580 138004 117998 101499 102312 112511 109955 117536
13149A17536P626j3228k3993p15O419J0303o555q133K773N662o801k196J294j7422
$$ 117536 125162 111934 87941 87226 93645 103948 97393 89260 92033 97695 90894 88698 89992 72570
13135G2570l575P775J4008o313l719r339j042P761o289Q85J1749q140j1272n459
$$ 72570 68995 76770 90778 84465 80746 71407 70365 78126 71837 72722 84471 76331 65059 59600
13121E9600j338L056k676m192M455m264p441k327L136Q870L376Q000K658n067
$$ 59600 58262 61318 58642 54450 58905 54641 47200 44873 48009 56879 60255 68255 70913 65846
13107F5846N860P099J2564J1289m656Q781L192k635o956o918j4566j4281o073
$$ 65846 71706 78805 91369 102658 98002 106783 109975 107340 100384 93466 78900 64619 58546
13094E8546k489k676o520L633j0880o766N775m425l884O322k949r017L58o676
$$ 58546 56057 53381 46861 50494 39614 32848 38623 34198 30314 36636 33687 24670 25028 18352
13080A8352N853J270m535K135N271p92K7017R736k422Q193l314n893Q958J1887
$$ 18352 24205 25475 20940 23075 28346 27554 54571 64307 61885 70078 66764 60871 69829 81716
13066H1716N25q412j0730j4714j1912M536p070K446O921q568J0531l373K484n670
$$ 81716 82241 73829 63099 48385 36473 41009 33939 36385 43306 34738 45269 41896 44380 38710
13052C8710l862O704o45K613p129m365K377j2363J712P778m111J46P030M567J404
$$ 38710 34848 41552 40907 43520 36391 32026 34403 22040 23752 31530 27419 27565 34595 39162 40566
13037D0566l97K330m52q479p707k917J4968L058r559l542r118j0330Q861J2914
$$ 40566 40169 42499 42047 33568 25861 22944 37912 40970 31411 27869 18751 8421 17282 30196
13023C0196j0857j2518J0134J436O583L54n029k222N739l468j6878p723j3422
$$ 30196 19339 6821 16955 18391 24974 25328 20299 18077 23816 20348 3470 -4253 -17675
13010a7675P693J0107k597q082M198Q81o886J5682J9798o810m102J50L976M00
$$ -17675 -9982 125 -2472 -10554 -6356 -5475 -12361 3321 23119 16309 12207 12357 16333 16733
12996A6733l965o804J4064J4470n122j4260p077n71Q601j868o773r187l790Q829
$$ 16733 12768 5964 20028 34498 29376 15116 8039 7468 16069 14201 7428 -1759 -5549 3280
12982C280J201k755j0265O879P513Q278O646n972J4033J8740j3145k0826m462
$$ 3280 4481 1726 -8539 -1660 5853 14131 20777 14805 28838 47578 34433 13607 9145
12969I145R191K721j6991N270N251k675k421L33K972O544P423j1774j2571N916
$$ 9145 18336 21057 4066 9336 14587 11912 9491 9824 12796 19340 26763 14989 2418 8334
12955H334m890n638l519m82P389R413J103O160r866N461n66k647K301p17r86K478
$$ 8334 3444 -2194 -5713 -6195 1194 10607 11710 17870 8004 13465 12899 10252 12553 11836 10850 13328
12939A3328k465O149p965N352R237J584p005j5809r177O08N996n438m19J3886
$$ 13328 10863 17012 9047 14399 23636 25220 18215 2406 -6771 -6163 -167 -5605 -6024 7862
12925G862R6j97J159P403N366p291P620m994p743J7751o88q213m41o927n659j3087
$$ 7862 7958 7761 8920 16323 21689 14398 22018 17024 9281 27032 26344 18131 17690 10763 5104 -7983
12909g983p118q051O358M462J2494N532k669j858n905k283K838M872j8002N308
$$ -7983 -15101 -23152 -16794 -12332 162 5694 3025 1167 -4738 -7021 -4183 689 -17313 -12005
12895a2005J0392J0581M191j1381n956P580K192No526m221k558J818M69n046Q516
$$ -12005 -1613 8968 13159 1778 -4178 3402 5594 5599 -927 -5148 -7706 -5888 -5419 -10465 -1949
12880a949R177K310o19Q639Q518N438j6483j8670j806L396Q364Q6Q910m044L561
$$ -1949 7228 9538 8919 17558 26076 31514 15031 -3639 -5445 -2049 6315 6401 15311 11267 14828
12865A4828J5660m417o871Q782p381j2297j924k1197J91L985M550K767L789J8871
$$ 14828 30488 26071 19200 27982 20601 8304 6380 -14817 -14626 -10641 -6091 -3324 465 19336
12851A9336R239j9515N74J1844M076R703L501n198n418n462m80p024J964J224
$$ 19336 28575 9060 9634 21478 25554 35257 38758 33560 28142 22680 22200 15176 17140 18364
12837A8364P420R47K050k321K534k841j4314J413N500m131m84J424j2966j2030
$$ 18364 25784 26731 28781 26460 28994 26153 11839 13252 18752 14621 14137 15561 2595 -9435
12823i435j454q333N848J4461J0685rn505M752Q706J79L099M622K768J4372Q977
$$ -9435 -10889 -19222 -13374 1087 11772 11763 6258 11010 19716 19895 22994 27616 30384 44756 53733
12808E3733J2119J2013j316m948J2438M616q48N125j5147j1446j6169n135J3305
$$ 53733 65852 77865 76549 71601 84039 88655 87807 92932 77785 66339 50170 45035 58340
12795E8340Q419l662l603Q057R472j3011j0132j6349O40K1749J5827K113L0947
$$ 58340 66759 63097 59494 67551 77023 64012 53880 37531 38171 59920 75747 77860 108807
12782A08807J6167J015k586Q064M083k0897l095j5283j3610j088K376l451j2591
$$ 108807 124974 125989 123403 131467 135550 114653 111558 96275 82665 81577 83953 80502 67911
12769F7911Q649q497j5629j2822k803J7455R272J2426j0794j1239k219J1127j53
$$ 67911 76560 68063 52434 39612 36809 54264 63536 75962 65168 53929 51710 62837 62684
12756F2684J023k636p34J0656J9205J5761J0789J1795N131j6924j8386j3945k3006
$$ 62684 63707 61071 60337 70993 90198 105959 116748 128543 133674 116750 98364 84419 61413
12743F1413k1742R064R748j0125k1127j4509M292R115p930k39O482Q784p580k377
$$ 61413 39671 48735 58483 48358 27231 12722 17014 26129 18199 17960 24442 33226 25646 23269
12729B3269r935j8451r79K018P288J6138J3590l867j2082j8028j0422q633J0520
$$ 23269 13334 -5117 -6096 -4078 3210 19348 32938 29071 16989 -1039 -11461 -20094 -9574
12716i574R803m372K827K828J284L690J1378J718J895q227n159l645K261j9142
$$ -9574 229 -4143 -1316 1512 2796 6486 17864 19582 21477 13250 8091 4446 6707 -12435
12702a2435j4261N386J1962O749L45l804l80R752J4413N586L788M142k95j272
$$ -12435 -26696 -21310 -9348 -2599 -2254 -6058 -6438 3314 17727 23313 27101 31243 30948 29676
12688B9676p031j5442p855J2223J7632P571j7053k2178n04m586m444J304m111
$$ 29676 22645 7203 -652 11571 29203 36774 19721 -2457 -2961 -7547 -11991 -10687 -14798
12675a4798j557J7208P585j548j4031J954J5347J2025o173O602J2252j0926o815
$$ -14798 -16355 853 8438 6890 -7141 -5187 10160 22185 16012 22614 34866 23940 17125
12662A7125j0185k62L20o171l335K552m105J0482O375j562O68L964N587j873k5275
$$ 17125 6940 6678 6998 827 -2508 44 -4061 6421 12796 11234 11902 15866 21453 19580 -5695
12647e695o112J9064O00p220J492j721m529l324R795Q882o995k164O919L606N571
$$ -5695 -11807 7257 7857 637 2129 408 -4121 -7445 2350 11232 4237 2073 8992 12598 18169
12632A8169M139n449n834l146Q733J4170M854q978j0253n578J724O738M306p084
$$ 18169 22308 16859 11025 7879 16612 30782 35636 26658 16405 10827 12551 19289 23595 16511
12618A6511o915nj179j908k855k840m133L567M137q458r954Q764J251K172l969
$$ 16511 9596 9591 8412 6504 3649 809 -3324 243 4380 -4078 -14032 -5268 -4017 -1845 -5814
12603e814O297J0431J2428O899K075m585j0295j227K588k398L228L216J0037P244
$$ -5814 483 10914 23342 30241 32316 27731 17436 16209 18797 16399 19627 22843 32880 40124
12589D0124M583M466J4117J3369Q81N24J2027P948j1993j1778j845r825N999m939
$$ 40124 44707 49173 63290 76659 77540 78064 90091 98039 86046 74268 72423 62598 68597 63658
12575F3658j3468n335J817p554j985N095q050N486K4912J5019k043J9707K1196
$$ 63658 50190 44855 46672 39118 37133 42228 34178 39664 64576 79595 77552 97259 118455
12562A18455J8619J1242M088o139r408L430J633n032o732j830O035l768K206O836
$$ 118455 137074 148316 152404 146265 136857 140287 141920 136888 130156 128326 134361 130593 132799 139635
12548A39635j820l766O123P223J8763K4752J1840M586J6158J6531J8671L059l517
$$ 139635 137815 134049 140172 147395 166158 190910 202750 207336 223494 240025 258696 261755 258238
12535B58238K216J603j412J1071p771k1815j8153j5028q705n603k2173j5558K009
$$ 258238 260454 262057 260645 271716 263945 242130 223977 208949 200244 194641 172468 156910 158919
12522A58919L38k839r941L587L105L547J1110O404J7767K2955Q519J0908Q923
$$ 158919 159257 156418 146477 150064 153169 156716 167826 174230 191997 214952 223471 234379 243302
12509B43302J4638J5609m454l306Q148l288j967k1720P492O03j3944j2267J2109
$$ 243302 257940 273549 269095 265789 273937 270649 268682 246962 254454 255057 241113 228846 240955
12496B40955o64q785O849m523j1762j9276n595j548j3923j2865k327M442k3636
$$ 240955 240291 231506 238355 233832 222070 202794 197199 195651 181728 168863 166536 170978 147342
12483A47342j6881j1895l971L873N508J0240J2666n999M082M146p791L318J587
$$ 147342 130461 118566 114595 118468 123976 134216 146882 140883 144965 149111 141320 144638 146225
12470A46225J519J2735J099J719K5842J2099Q075r9j1165o484j4035m440k3024
$$ 146225 147744 160479 161578 163297 189139 201238 209313 209214 198049 191565 177530 173090 150066
12457A50066k1146r537N381M684k68j8910j3858j0516L646q70n401R211j9076
$$ 150066 128920 119383 124764 129448 129180 110270 96412 85896 89542 88672 83271 92482 73406
12444G3406j6596L605R459j140n356l057p03j8722j7114Q891n898M316k26q010
$$ 73406 56810 60415 69874 68734 63378 60321 59618 40896 23782 32673 26775 31091 30865 22855
12430B2855J0401n905K666r90J2318J0499K828q28L250J0761N258j0191o820M302
$$ 22855 33256 27351 30017 29027 41345 51844 54672 53844 57094 67855 73113 62922 56102 60404
12416F0404J3694r00l2013j9962q359m689J0074Q319l586q651o483P91N908K498
$$ 60404 74098 73198 41185 21223 12864 8175 18249 26568 22982 14331 7848 8639 14547 17045
12402A7045J73j2202n081P318Q669M917r939j447J0388j715n708l180k77j45K338
$$ 17045 17218 5016 -65 7253 15922 20839 10900 9453 19841 18126 12418 9238 8961 8816 11154
12387A1154K937M834Q205J2853r593n584j668n983R906Q124q464N825P501m960
$$ 11154 14091 18925 27130 39983 30390 24806 23138 17155 27061 35185 26721 32546 40047 35087
12373C5087k805j1159m189N67q167K906J3072l874l241r790l108N449R979N765
$$ 35087 32282 21123 16934 17501 9334 12240 25312 21438 18197 8407 5299 10748 20727 26492
12359B6492j405P084L615j26j1918r712n566L64o250j095Q931Q240m574n4P243
$$ 26492 25087 32171 35786 35660 23742 14030 8464 8828 2578 1483 10414 18654 14080 14026 21269
12344B1269Q497Q854o422j0735j4579q165l147L816Q459k54L316l441l784P465
$$ 21269 29766 38620 32198 21463 6884 -1281 -4428 -612 7847 7593 10909 7468 3684 11149
12330A1149J4684Q388k038r949j6850m013J5796R473J0393P052r240r124o521
$$ 11149 25833 34221 32183 22234 5384 1371 17167 26640 37033 44085 34845 25721 19200
12317A9200m131L983K025K255J409o522k75P525Q207N28Q81l495n745K495J4704
$$ 19200 15069 19052 21077 23332 24741 18219 17944 25469 33676 34204 35085 31590 25845 28340 43044
12302D3044k106k0798L733J5591J2393k21n633j2731j8733K389L884k52P442K830
$$ 43044 40938 20140 23873 39464 51857 51636 46003 33272 14539 16928 20812 20560 28002 30832
12288C0832O50k75q95K799J0155j3429k81J0730M949K980n89m187j135J593j541
$$ 30832 31482 31207 30312 33111 43266 29837 29556 40286 45235 48215 47626 43439 42304 43897 42356
12273D2356K547J3580k931j4775O44q72M633k267p115K911M273p609J950m229
$$ 42356 44903 58483 55552 40777 41421 40549 45182 42915 35800 38711 42984 35375 37325 33096
12259C3096q340J6795J6323j290m292j9007J3877K1604R932r24o663q808l29J5817
$$ 33096 24756 41551 57874 56584 52292 33285 47162 68766 78698 77774 71111 62303 61974 77791
12245G7791J6398J225R763j7529j1111j7894n127O621P039k088J617L625L734
$$ 77791 94189 95414 105177 87648 76537 58643 53516 60137 67176 65088 66705 70330 74064
12232G4064l924p37k559J472r001j614J1500Q889K90J2005K213j3970n480n113
$$ 74064 70140 69403 66844 68316 59315 57701 69201 78090 78380 90385 92598 78628 73148 68035
12218F8035j452j2627J1603J274J579l498J827P632J0390n787j0013r772j0342
$$ 68035 66583 53956 65559 66833 68412 64914 66741 74373 84763 78976 68963 59191 48849
12205D8849l781J2380J3661N962p503r351l31Q04j145J3147J5238K1382J0453
$$ 48849 45068 57448 71109 77071 69568 60217 59886 60690 59545 72692 87930 109312 119765
12192A19765j0166j5984M046J4413L618l096o61L90m520n615J6709J5545j896
$$ 119765 109599 93615 97661 112074 115692 112596 111935 112325 107805 102190 118899 134444 132548
12179A32548J486l12J564j1742K592J6366K737J0403J6361R773m530l519J3499
$$ 132548 134034 133722 135286 123544 126136 142502 145239 155642 172003 181776 177246 173727 187226
12166A87226K755j972K749Q723O135K0667K2187J6649J6337J6629J1210J721K6431
$$ 187226 189981 188009 190758 199481 205616 226283 248470 265119 281456 298085 309295 311016 337447
12153C37447K3666K2219K8550M7508L4086K4882L4549M1591L9204O6456P1348
$$ 337447 361113 383332 411882 459390 493476 518358 552907 594498 633702 700158 771506
12142G71506O5659J00717J14148J49163J96383K37768L04317L72372M63369N92922
$$ 771506 837165 937882 1052030 1201193 1397576 1635344 1939661 2312033 2775402 3368324
12132C368324Q02897J201373J791709K594393L523564M107142L402699J143459
$$ 3368324 4171221 5372594 7164303 9758696 13282260 17389402 20792101 21935560
12124B1935560j551765l264664l603312l045299k221880j516576r78308n66915
$$ 21935560 20383795 17119131 13515819 10470520 8248640 6732064 5753756 5186841
12116E186841k44549P7595M06076O69735P24684L65984j12613k62073m1409M95743
$$ 5186841 4942292 5019887 5425963 6095698 6820382 7186366 7073753 6811680 6770271 7266014
12106G266014J156455J747148J876518J255371M43018J91417P48023J806917K659365
$$ 7266014 8422469 10169617 12046135 13301506 13744524 13935941 14683964 16490881 19150246
12097A9150246K558987J296721n00824j817852k036569j435823r62017j234782
$$ 19150246 21709233 23005954 22505130 20687278 18650709 17214886 16252869 15018087
12089A5018087j859646k154303j888613j278215o03768o1981J49281j20046n57863
$$ 15018087 13158441 11004138 9115525 7837310 7233542 7171561 7320842 7200796 6642933
12080F642933p64057p07384m74702j83396M6923K78725N79410R92242J568056
$$ 6642933 5878876 5171492 4696790 4513394 4560317 4839042 5418452 6410694 7978750
12071G978750K305928L085197L440983K558196M16380j888044l244425l378826
$$ 7978750 10284678 13369875 16810858 19369054 19785434 17897390 14652965 11274139
12063A1274139k801343k048623j419645j008477p25329n17065l92590l08889k42193
$$ 11274139 8472796 6424173 5004528 3996051 3270722 2753657 2361067 2052178 1809985
12054A809985k27987k05260j41589j23361j02896q9947p5859o2021o7325n1857
$$ 1809985 1581998 1376738 1235149 1111788 1008892 918945 843086 781065 713740 661883
12044F61883n0462l7973l5516j8645L646O611j2851L710J6857K3639O8367J38876
$$ 661883 611421 573448 537932 519287 522933 529544 516693 520403 537260 560899 629266 768142
12032G68142J64207J18343j1810j26398j65802j54819j20144o2595l6322k3033
$$ 768142 932349 1050692 1038882 912484 746682 591863 471719 409124 372802 349769
12022C49769m4464k1555k6749n072K726n460j9439j3908j5292M933K439j8547
$$ 349769 305305 283750 257001 251929 254655 249195 229756 215848 200556 205489 207928 189381
12010A89381k0153J874j1768q429K918o257r998j2612j106J5359k047m174k713
$$ 189381 169228 171102 159334 150905 153823 147566 137568 124956 123850 139209 137162 132988 130275
11997A30275J1508p282j2338n680J183J6061J4264K095k1029j7990k4474p637
$$ 130275 141783 134501 122163 116483 117666 133727 147991 150086 129057 111067 86593 78956
11985G8956q34J279K626N431K409j2522k73N597J790O750K136p908j7138l943
$$ 78956 78122 79401 82027 87458 89867 77345 77072 82669 84459 91209 93345 85437 68299 64356
11971F4356J0704n731P360m152J872n167k975p676r09j769J2678J4508j1399k3348
$$ 64356 75060 69329 76689 72537 74409 69242 66267 58591 57682 55913 68591 83099 71700 48352
11957D8352j301J2990K596O643M982J8889k045q596j6422P549J2543j071j5740
$$ 48352 47051 60041 62637 69280 74262 93151 91106 82510 66088 73637 86180 85109 69369
11944F9369j5484j5742P38J1527J4649J4464j1950j8729M543l451j267L622J2910
$$ 69369 53885 38143 38881 50408 65057 79521 67571 48842 53385 49934 48667 52289 65199
11931F5199m960k830j0770j1662N779l153J552J3501K086q649r154K433P851M862
$$ 65199 60239 57409 46639 34977 40756 37603 39155 52656 54742 46093 36939 39372 47223 52085
11917E2085J0743j4044j1190k329J1135M886n015o413j040q365n327j896j0265
$$ 52085 62828 48784 37594 35265 46400 51286 46271 39858 38818 30453 25126 23230 12965
11904A2965m782J528J9955J2064m877r549M683M182l247m630L359P592Q064k785
$$ 12965 8183 9711 29666 41730 36853 27304 31987 36169 32922 28292 31651 39243 47307 44522
11890D4522l63k3j606O056M61P01p892j3305N206P335R146m314J2871J1243k003
$$ 44522 44159 44136 42530 48586 49047 49748 41856 28551 33757 41092 50238 45924 58795 70038 68035
11875F8035n657r182k0796J129l336j45M298k630L358j0098n663m548O01j0696
$$ 68035 62378 53196 32400 33529 30193 30048 34346 31716 35074 24976 19313 14765 15366 4670
11861D670O816J9866J9920K666J2240M504Q399J9816J5673Q996o79k1173n963
$$ 4670 11486 31352 51272 53938 66178 70682 79081 98897 114570 123566 122887 101714 95751
11848I5751J02j7119k1273o390R161L824k0731p289q075r474P7P389O065L977
$$ 95751 95853 78734 57461 51071 60232 64056 43325 36036 27961 18487 18564 25953 32018 35995
11834C5995J7281J0437p288j0133o477o228O269j416k0646k68l452L753J2497
$$ 35995 53276 63713 56425 46292 39815 33587 39856 38440 17794 17526 14074 17827 30324
11821C0324p7J4018L060j307L292o529l742m821n038k710J1240p72r8j48L143
$$ 30324 30247 44265 47325 46018 49310 42781 39039 34218 29180 26470 37710 36938 36840 36692 39835
11806C9835j1081l82k303K042K147j312k527J6072J0129n318n011n412J823j095
$$ 39835 28754 28372 26069 28111 30258 28946 26419 42491 52620 47302 42291 36879 38702 37607
11792C7607j1236k1777J4228Q979r610k1968O30J0716k076k689m955j3206N949
$$ 37607 26371 4594 18822 27801 18191 -3777 -3147 7569 5493 2804 -2151 -15357 -9408
11779i408Q122k595P915J5862J0165J3181J1181j693J515M60q171J404m129j1497
$$ -9408 -1286 -3881 4034 19896 30061 43242 54423 52730 54245 54705 46534 47938 43809 32312
11765C2312J194O970J078J487N110K082j0660j91j1324j94J4401J3817K3829J3362
$$ 32312 33506 40476 41554 43041 48151 50233 39573 39382 28058 27864 42265 56082 79911 93273
11751I3273Q416k3407j6077j1676n948m775L470k385M912J3269j1989L02p727
$$ 93273 101689 78282 62205 50529 44581 39806 43276 40891 45803 59072 47083 47385 39658
11738C9658J274J7529J180m874J3055J7627M940j1258r592M062K8572N0119O0440
$$ 39658 40932 58461 59641 54767 67822 85449 90389 79131 69539 73601 102173 152292 212732
11725B12732K3674k0991l3124j0474j3131k5857k2227p514k858L508o562k3704
$$ 212732 236406 215415 182291 171817 158686 132829 110602 103088 100230 103738 97176 73472
11713G3472j3461J7248J6151M013o576M98o073j1523J1447J6374p402j0040l715
$$ 73472 60011 77259 93410 97423 90847 91345 85272 73749 85196 101570 94168 84128 80413
11700H0413N813J5786k594Q148M376j069O306p227j2616M364K0948K1292K4731
$$ 80413 86226 102012 99418 107566 111942 110873 117179 109952 97336 101700 122648 143940 168671
11687A68671K5629K6691K1783J9797j853j6643k7131k3604r669r581j1522r255
$$ 168671 194300 220991 242774 262571 260718 244075 216944 193340 183671 174090 162568 153313
11675A53313j441J9895J3325J1075J1883n160m845m391K628M29L291J7102J9069
$$ 153313 151872 171767 185092 196167 208050 202890 198045 193654 196282 196711 200002 217104 236173
11662B36173J9604J1226N827J6124K1339K5842L6571J8602J2945K5201J1687j0233
$$ 236173 255777 267003 272830 288954 310293 336135 372706 391308 404253 429454 441141 430908
11650D30908N70R534L581K1430K595J5425K7095J0091J2841J8652J8699K432j0554
$$ 430908 431478 441012 444593 466023 468618 484043 511138 521229 534070 552722 571421 573853 563299
11637E63299Q27J5058J7789K4262L5265O5530P0434Q4961Q7804R2876J04999J17090
$$ 563299 564126 579184 596973 621235 656500 722030 792464 877425 965229 1058105 1163104 1280194
11625A280194R9091J08806J06208Q6649R6305J33540J54805J97021K51014L19131
$$ 1280194 1379285 1488091 1594299 1680948 1777253 1910793 2065598 2262619 2513633 2832764
11615B832764L96901M96318O65318Q73956J071912J276992J492538J806819K368080
$$ 2832764 3229665 3725983 4391301 5265257 6337169 7614161 9106699 10913518 13281598
11606A3281598L457559N496552R166318J5372927K4710132L5091416L5363930
$$ 13281598 16739157 22235709 31402027 46774954 71485086 106576502 141940432
11599A41940432J3400491j5515843l1494172l2380604k4483148j5709269r670691
$$ 141940432 155340923 139825080 108330908 75950304 51467156 35757887 26087196
11592B6087196o074365l960947k751735k086241j676384j396026j193270j009551
$$ 26087196 20012831 16051884 13300149 11213908 9537524 8141498 6948228 5938677
11584E938677q19780o56168n32029m21712l59626l13557k99820k72201k21215
$$ 5938677 5118897 4462729 3930700 3508988 3149362 2835805 2535985 2263784 2042569
11575B042569j87541j74458j30444j01513p0633p5481o2493o9027n0978m6634
$$ 2042569 1855028 1680570 1550126 1448613 1377980 1302499 1240006 1170979 1120001 1073367
11565A073367n4450m9719l7411n7957o8077m8302n6392m6144l6756m0113l2996
$$ 1073367 1018917 969198 931787 873830 805753 757451 701059 654915 618159 578046 545050
11554E45050j6584k1295l2136k8195k9593j6082j200j2743l481K356K704J0230
$$ 545050 528466 507171 475035 446840 417247 401165 399965 387222 383741 386097 388801 399031
11542C99031Q482R200J704J4874K1810L0948J5887k5453m4166m6687l7431k7640
$$ 399031 407513 416713 418417 433291 455101 486049 501936 476483 432317 385630 348199 320559
11530C20559k4794r779j4387j8312m39l944j8694j1567j7232J58M49L245k054
$$ 320559 295765 285986 271599 253287 252848 248904 230210 218643 201411 201569 202018 205263 203209
11517B03209q079L56m130q557j2597j139m426m268o815K081Q379j4112m928j0908
$$ 203209 195130 195486 191356 182799 170202 169063 164637 160369 153554 155635 164014 149902 144974 134066
11503A34066j300J1174k327o488N148j211k388R635K265l834j0995q933q847q445
$$ 134066 132766 143940 141613 135125 140273 139062 136674 146309 148574 144740 133745 124812 115965 107520
11489A07520n247K443k142K091R52j0509j1429j1632l464J113J8842R030l119
$$ 107520 102273 104716 102574 104665 105617 95108 83679 72047 68583 69696 88538 97568 94449
11476I4449m259K288j2421N488J9486M360J1326N922l163l213j4711L604o598
$$ 94449 90190 92478 80057 85545 105031 109391 120717 126639 123476 120263 105552 109156 102558
11463A02558j5084l80N363r083L335j9434j2759o366K889k306O667J9448R821
$$ 102558 87474 87094 92457 83374 86709 67275 54516 48150 51039 48733 55400 74848 84669
11450H4669j7615l6947j8623j2858J2201K1407L4054J6972j3p610j2013r465j662
$$ 84669 67054 30107 11484 -1374 10827 32234 66288 83260 83247 75637 63624 54159 52497
11437E2497K042J6921P892q068P891o838j4736j6500L105J146k406j643N906O994
$$ 52497 54539 71460 79352 71284 79175 72337 57601 41101 44206 45352 42946 41303 47209 54203
11423E4203R683o052m802m859L219J2237J5739n620r160j0362k553J3178Q162
$$ 54203 63886 57834 53032 48173 51392 63629 79368 73748 64588 54226 51673 64851 73013
11410G3013q737m98j2398n571r366p802j9684k141J2913j3072j5513J0489O100
$$ 73013 64276 63778 51380 45809 36443 28641 8957 6816 19729 6657 -8856 1633 7733
11397G733J1674J0153R741o128N887j487J068R121K24j1322J1748o814j2362J595
$$ 7733 19407 29560 39301 33173 39060 37573 38641 47762 47986 36664 48412 41598 29236 30831
11383C0831J137q241j2874j0562K194J2162J2849O438r360o075j0447j2677J3046
$$ 30831 31968 23727 10853 291 2485 14647 27496 33934 24574 18499 8052 -4625 8421
11370H421J6017O98Q32P075m306q233O183j1805O384J7023J5286N583j172j1681
$$ 8421 24438 25136 25968 33043 28737 20504 26687 14882 21266 38289 53575 59158 57986 46305
11356D6305j4196j06j8001r138j390M010J8416J2080n775m149j514l162q650P618
$$ 46305 32109 32003 14002 4864 3474 7484 25900 37980 32205 28056 26542 23380 14730 22348
11342B2348m199K24K068m65K044n338N484N28N115L035l799q020j0052r237j705
$$ 22348 18149 18373 20441 19976 22020 16682 22166 22694 27809 30844 27045 19025 8973 -264 -1969
11327a969J4125J8706r438r062J885J7608m424l98m851j5162m054M674l322k282
$$ -1969 12156 30862 21424 12362 14247 31855 27431 27033 22182 7020 2966 7640 4318 2036
11313B036j943j2159P469R845J1233J1891J396j691l606O4j459r95j959J2980
$$ 2036 93 -12066 -4597 5248 16481 28372 29768 28077 24471 24535 23076 22081 20122 33102
11299C3102r374l852j56j5284m257O19L505K328L068P563N251k946N413j699p812
$$ 33102 23728 19876 19720 4436 179 798 4303 6631 9699 17262 22513 19567 24980 23281 15469
11284A5469J3682J5670j8705l0050m247R239J2612J154O294L72P988N377q447
$$ 15469 29151 44821 26116 -3934 -8181 1058 13670 14824 21118 21490 29478 34855 26408
11271B6408j7783M116q455l312J3430J2704R351n177j3553l615n084o176l193
$$ 26408 8625 12741 4286 974 14404 27108 36459 31282 17729 14114 9030 2854 -339
11258c39K624K40J5872N674p900o024O117O513n619N056L512k152j1089m310J4343
$$ -339 2285 2525 18397 24071 16171 10147 16264 22777 17158 22214 25726 23574 12485 8175 22518
11243B2518J1736m122j132j4576j159o397M214j0480O207O446J3192J6413J563
$$ 22518 34254 30132 29000 14424 13265 6868 11082 602 6809 13255 26447 42860 44423
11230D4423K19n368P492J756p832r2m615k735j3807l942m2L82j1351N4P367R83
$$ 44423 44642 39274 46766 48522 40690 40598 35983 33248 19441 15499 15457 15839 4488 4542 11909 12892
11214A2892N74m657n34L446m356P11K579o506j3066J034J2112p086n13Q509K801
$$ 12892 13466 8809 8275 11721 7365 8076 10655 4149 -8917 -7883 4229 -2857 -3370 5139 7940
11199G940k966k650q518k908M587l867O228J1105q26P555j623j0114p484J3521
$$ 7940 4974 2324 -6194 -9102 -4515 -8382 -2154 8951 8125 15680 14057 3943 -3541 9980
11185I980K253N981J4161J284q399j7909m292J4254O865j3294k077J5375Q375
$$ 9980 12233 18214 32375 33659 25260 7351 3059 17313 24178 10884 8807 24182 32557
11172C2557k690n754J7351K7334J6425K9762N0621O4310J00906J46632J80662
$$ 32557 29867 24113 41464 68798 85223 114985 165606 229916 330822 477454 658116
11161F58116J05412l7855j54251j58297j21583r4022m3487m4431k4975n429l068
$$ 658116 763528 725673 571422 413125 291542 197520 154033 109602 84627 79198 76130
11150G6130j4919N34n053o907j3071r389K312L230j4139j1917j0812Q619O446
$$ 76130 61211 61745 56692 49785 36714 27325 29637 32867 18728 6811 -4001 4618 11064
11137A1064j965O96P205Q043J4336n68q332q155O50J439k349p612R047P215j740
$$ 11064 9099 9795 17000 25043 39379 38811 30479 22324 22974 24413 22064 14452 23499 30714 28974
11122B8974n893n216n910k420M204J067o432P381P574n113l955j4143N882k366
$$ 28974 23081 17865 11955 9535 13739 14806 8374 15755 23329 18216 14261 118 6000 3634
11108C634K793q064m281L835L051m300N215M158j097o509j1969r957J3290J1229
$$ 3634 6427 -1637 -5918 -2083 968 -3332 1883 6041 4944 -1565 -13534 -23491 -10201 1028
11094A028o629k436m5J0171P862J2889N155m847k3816j198J4993m112j8851K82
$$ 1028 -5601 -8037 -8082 2089 9951 22840 27995 23148 -668 -1866 13127 9015 -9836 -9554
11080i554n882J003R347J0466N697n487M188K437j1243P767J0158n230J793j0287
$$ -9554 -15436 -14433 -5086 5380 11077 5590 9778 12215 972 8739 18897 13667 15460 5173
11066E173r481j4589q046J3040J2259j435Q820J0440N540j7916r039J1083L131
$$ 5173 -4308 -18897 -26943 -13903 -1644 -3079 5741 16181 21721 3805 -5234 5849 8980
11053H980m610N189l015Q865q648k28Q79j0010J081K926o936N482j0174j1033
$$ 8980 4370 9559 6544 15409 6761 6533 7412 -2598 -1517 1409 -5527 -45 -10219 -21252
11039b1252K893l85J3995o35L871K788K276m161J2348J5238p037k244M566K932
$$ -21252 -18359 -18744 -4749 -5384 -1513 1275 3551 -610 11738 26976 19939 17695 22261 25193
11025B5193m889j1813N248P637l332p474N945L223j2761P923N932o630o475o443
$$ 25193 20304 8491 13739 21376 18044 10570 16515 19738 6977 14900 20832 14202 7727 1284
11011A284l750n144M898J3431J4363L530j6247p899o815O469O511P935J2933r383
$$ 1284 -2466 -7610 -2712 10719 25082 28612 12365 4466 -2349 4120 10631 18566 31499 22116
10997B2116j0119r31L890O419p106j380N86p316J531P22m671l379l971K625L191
$$ 22116 11997 11066 14956 21375 14269 12889 13475 6159 7690 8412 3741 362 -3609 -984 2207
10982B207K096M298N018j518K143J1033J753n885j7936q091J5477Q21L132M330
$$ 2207 4303 8601 13619 12101 14244 25277 27030 21145 3209 -4882 10595 11416 14548 18878
10968A8878k853q180L454P50j7900M351K951j4816j1579K152J0103n07J7445P351
$$ 18878 16025 7845 11299 12049 -5851 -1500 1451 -13365 -24944 -22792 -12689 -13196 4249 11600
10954A1600N124j2830O212m834q080o870r098J0100K1561K021p6n343l996K410
$$ 11600 16724 3894 10106 5272 -2808 -9678 -18776 -8676 12885 14906 14830 9487 5491 7901
10940G901J0150k450r961m312m157n681o794O385N345M875N530M081j2607o431
$$ 7901 18051 15601 5640 1328 -2829 -8510 -15304 -8919 -3574 1301 6831 10912 -1695 -8126
10926h126n426l113n02J3807J1222k0715J882J6038J1454K462j4817q270R396
$$ -8126 -13552 -16665 -17167 -3360 7862 -12853 -10971 5067 16521 18983 4166 -4104 5292
10913E292K355m236o663k2798Q509J3353N207P591N599j272k601n452J953M406
$$ 5292 7647 3411 -3252 -26050 -17541 -4188 1019 8610 14209 12937 10336 4884 6837 11243
10899A1243K823j1341J394q167o405N263J5669J1418j1156r685M790n770M367
$$ 11243 14066 2725 4119 -4048 -10453 -5190 10479 21897 10741 1056 5846 76 4443
10886D443L545r610M533J4840M817m387m584q396N497K807P655j0093J747P009
$$ 4443 7988 -1622 2911 17751 22568 18181 13597 5201 10698 13505 21160 11067 12814 19823
10872A9823j4979q848j2934r870J1315J0582P15o214L691k31m680j8449n491N899
$$ 19823 4844 -4004 -16938 -26808 -15493 -4911 -4196 -10410 -6719 -6950 -11630 -30079 -35570 -29671
10858b9671Q696J2848J7698J764n145J0166n229p507O551j2201q102L61p02L62
$$ -29671 -20975 -8127 9571 11335 6190 16356 11127 3620 10171 -2030 -10132 -9771 -10473 -10111
10844a0111l251p081P731K1531M979m834m945m531j1015j757j0567J1503m786
$$ -10111 -13362 -20443 -12712 8819 13798 8964 4019 -512 -11527 -13284 -23851 -12348 -17134
10831a7134L956J7008K972j7800j1462P45Q447J2956O685N625m148j8115R051
$$ -17134 -13178 3830 6802 -10998 -22460 -21715 -13268 -312 6373 11998 7850 -10265 -1214
10818a214J4432p262k0448k0778J2289J3970J0294K361n834k570r56J532J9160
$$ -1214 13218 5956 -14492 -35270 -22981 -9011 1283 3644 -2190 -4760 -5716 -4184 14976
10805A4976m44j2561N640P29j0145k2117j352m718L448J36m738M276J4645M974
$$ 14976 14532 1971 7611 8340 -1805 -23922 -25274 -29992 -26544 -26408 -31146 -26870 -12225 -7251
10791g251J5286j2199j490j3263r404Q218K676N559O137j2502m146K854J537J2518
$$ -7251 8035 -4164 -5654 -18917 -28321 -20103 -17427 -11868 -5731 -18233 -22379 -19525 -17988 -5470
10777e470K978j4831j6466M483J0457J263K0674J309J7591Q523m254j8579r365
$$ -5470 -2492 -17323 -33789 -29306 -18849 -17586 3088 4397 21988 30511 26257 7678 -1687
10764a687k244j0399o181J1068j3512O537J0637L840P419l103l047r678n19Q534
$$ -1687 -3931 -14330 -20511 -9443 -22955 -16418 -5781 -1941 5478 2375 -672 -10350 -10869 -2335
10750b335J1644k263p782O690n22k393l658l744o081q289p753J5922o46P846j0689
$$ -2335 9309 7046 -736 5954 5432 3039 -619 -4363 -10444 -18733 -26486 -10564 -11210 -3364 -14053
10735a4053l204o909J0780J1109j0862j2716J0528J0390K949k29j076Q91L252
$$ -14053 -17257 -24166 -13386 -2277 -13139 -25855 -15327 -4937 -1988 -2217 -3293 -2402 850
10722H50p167j2740P066Q803N337O656P60L497o223j5436J3026J0920p365M723
$$ 850 -6317 -19057 -11991 -3188 2149 8805 9565 13062 6839 -8597 4429 15349 7984 12707
10708A2707R97K59j0406o244N36M801N611J3202O104M261j9292j4703Q599N725
$$ 12707 13704 13963 3557 -2687 -2151 2650 8261 21463 27567 31828 12536 -2167 6432 12157
10694A2157R751j4033j1897N388Q414L321m408j1744k700p877j351R201l744n910
$$ 12157 21908 7875 -4022 1366 9780 13101 8693 -3051 -5751 -13628 -14979 -5778 -9522 -15432
10680a5432L289M239l519N654N517P463K357J163n284q433q102o387J57L827J456
$$ -15432 -12143 -7904 -11423 -5769 -252 7211 9568 10731 5447 -2986 -11088 -17475 -17318 -13491 -12035
10665a2035O765o0J0231j775q355j2268j8653p263J2118R409J2497J2983P829
$$ -12035 -5270 -5330 4901 3126 -5229 -17497 -36150 -43413 -31295 -21886 -9389 3594 11423
10652A1423j896k420J17l538m403k972l403q372r614M438M911j694P405J2236
$$ 11423 9527 7107 7224 3686 -717 -3689 -7092 -15464 -25078 -20640 -15729 -17423 -10018 2218
10638B218k981j9494r92J0144l492k554K086J3965j606j56M443p500j2697J205
$$ 2218 -763 -20257 -21249 -11105 -14597 -17151 -15065 -1100 -2706 -2862 1581 -5919 -18616 -17411
10624a7411M5Q404N64k257M053k722j169Q125r435n175k214N325J1453m310K632
$$ -17411 -17366 -8962 -8398 -10655 -6602 -9324 -10493 -2368 -11803 -16978 -19192 -13867 -2414 -6724 -4092
10609d092J820M826o346j808o303Q402R049J0886m201m779J5850K131L089j413
$$ -4092 -2272 2554 -3792 -5600 -11903 -3501 5548 16434 12233 7454 23304 25435 28524 27111
10595B7111o170j3887J274j3178o543J0460K182j4010r74J6853j3514k823K062
$$ 27111 20941 7054 8328 -4850 -11393 -933 1249 -12761 -13735 3118 -10396 -13219 -11157
10582a1157p246K057K919m745k686m693J653R040N488j016r545J3921P655J6635
$$ -11157 -18403 -16346 -13427 -18172 -20858 -25551 -23898 -14858 -9370 -10386 -19931 -6010 1645 18280
10568A8280j0396j0705j7605Q241P701J958l864L595m348j0624r503Q50P903J1793
$$ 18280 7884 -2821 -20426 -12185 -4484 -2526 -6390 -2795 -7143 -17767 -27270 -26420 -18517 -6724
10554f724M649j038J397j0481o457n574R958M696J247M12O535J1968J1890l214
$$ -6724 -2075 -3113 -1716 -12197 -18654 -24228 -14270 -9574 -8327 -7915 -1380 10588 22478 19264
10540A9264j4171j5536K71J0834L565K160j722q881O534N796j6078l930R334O186
$$ 19264 5093 -10443 -10172 662 4227 6387 4665 -4216 2318 8114 -7964 -11894 -2560 3626
10526C626m067o262O170L456P953L071j855j0453o319R59R851n109n973Q861J480
$$ 3626 -441 -6703 -533 2923 10876 13947 12092 1639 -4680 -3721 6130 1021 -4952 3909 5389
10511E389L255j339k1137m165J7378N377O121j874j8761l246o881O346J0445M170
$$ 5389 8644 7305 -13832 -17997 -619 4758 10879 9005 -9756 -13002 -19883 -13537 -3092 1078
10497A078M830O053m827n291j0677l775j0287j614Q99O013L929L294K64j1043
$$ 1078 5908 11961 7134 1843 -8834 -12609 -22896 -24510 -23611 -17598 -13669 -10375 -10111 -21154
10483b1154L254N658p500L246J2338J005L161L362j3844r059R516J3972J544J683
$$ -21154 -17900 -12242 -19742 -16496 -4158 -3153 8 3370 -10474 -19533 -10017 3955 5499 7182
10469G182J390K510k56k3760j2777M06J7988J6091R166j0678q552P711P33n54
$$ 7182 8572 11082 10826 -12934 -25711 -25305 -7317 8774 17940 7262 -1290 6421 7154 6600
10455F600m936r815J0025Q162j69l646o411o226j1689o20k873J0040K4157N667
$$ 6600 1664 -8151 1874 10036 9867 6221 -190 -6416 -18105 -18725 -21598 -11558 12599 18266
10441A8266j7569j3566l377R602J6593j2058k0357j1444N238J4J1301R944P707
$$ 18266 697 -12869 -16246 -6644 9949 -2109 -22466 -33910 -28672 -28658 -17357 -7413 294
10428B94j132j683J50J175n481j0747R5m390Q950K808J440K183N29K470P198J13
$$ 294 -838 -2521 -2371 -1196 -6677 -17424 -17329 -21719 -12769 -9961 -8521 -6338 -5809 -3339 3859 3972
10412C972n157L677k823j5565n044m44M34J1650J0984O634O13j1193j4632O594
$$ 3972 -1185 2492 -331 -15896 -20940 -21384 -20950 -9300 1684 8318 8931 -2262 -16894 -10300
10398a0300J7925O465j2379m81M855j2052J0654J293r972K399J0632p622o571
$$ -10300 7625 14090 1711 1230 6085 -5967 4687 5980 -3992 -1593 9039 1417 -5154
10385e154k15L218M194J7655j3836n230N284q731p766K548K170N287N40J2422
$$ -5154 -5369 -2151 2043 19698 5862 632 5916 -2815 -10581 -8033 -5863 -576 -36 12386
10371A2386P038J398r03k024j4262k2934l579p683m71J1870R192L059J3620N562
$$ 12386 19424 20822 19919 17895 3633 -19301 -22880 -30563 -31034 -19164 -9972 -6913 6707 12269
10357A2269M70j1110j9444M327n471R445L304q805o664N012P064J8380J103j0804
$$ 12269 12739 1629 -17815 -13488 -18959 -9514 -6210 -15015 -21679 -16667 -9603 8777 9880 -924
10343i24P00Q003q643L96R887K917K1056M804q867N466J0065M50j3758j4046k1646
$$ -924 -224 7779 -864 -468 9419 12336 33392 38196 29329 34795 44860 45310 31552 17506 -4140
10328d140q579J0305J7294r453j7981j115J5476j4667p709O818P268j062m724
$$ -4140 -12719 -2414 14880 5427 -12554 -13669 1807 -12860 -20569 -13751 -6483 -7545 -12269
10315a2269K748N824q941q741R538l49O165L534Q154J838m847m748p274j0913
$$ -12269 -9521 -3697 -12638 -21379 -11841 -12190 -6025 -2491 5663 7501 2654 -2094 -9368 -20281
10301b0281L127K462Q699K514j940J0778L452l89j595o846l475O437Q97m260Q493
$$ -20281 -17154 -14692 -5993 -3479 -5419 5359 8811 8422 6827 -19 -3494 2943 3840 -420 8073
10286H073m884P232O575p09n25j1584q322j2461M044P157k892N248R703K286j2668
$$ 8073 3189 10421 16996 16287 15762 4178 -4144 -16605 -12561 -5404 -8296 -3048 6655 8941 -3727
10271c727k497K540o65J6724J2348J6376p040j0411m558K224j4390j0673j5269
$$ -3727 -6224 -3684 -4349 12375 24723 41099 34059 23648 19090 21314 6924 -3749 -19018
10258a9018l187R921L447n134K341J2658k121P074K803K287k752l251J6160R629
$$ -19018 -22205 -12284 -8837 -13971 -11630 1028 -1093 5981 8784 11071 8319 5068 21228 30857
10244C0857j2637p364P937p397j757j1800j323J98l120j5422O116j241l252M987
$$ 30857 18220 10856 18793 11396 9639 -2161 -3484 -3286 -6406 -21828 -15712 -16953 -20205 -15218
10230a5218J2838j812M077L611k792o538K825O49r491j116j0748N078R919M44
$$ -15218 -2380 -4192 -115 3496 704 -5834 -3009 -2360 -11851 -12967 -23715 -18637 -8718 -8274
10216h274R4R442k577M010l116P6J661j2149k3282j3722J0511P666M285P720J6221
$$ -8274 -8180 1262 -1315 2695 -421 -345 1316 -10833 -34115 -47837 -37326 -29660 -25375 -17655 -1434
10201a434L26K335J0314r673m961O983r484N323J2077m179j1981J278J600q69
$$ -1434 -1108 1227 11541 1868 -3093 3890 -5594 -271 11806 7627 -4354 -3076 -1476 -2345
10187b345j107j4416k173M848J540Q875R773j1479r853j0324J2917J0069j61n640
$$ -2345 -3452 -17868 -20041 -15193 -13653 -4778 4995 -6484 -16337 -26661 -13744 -3675 -3836 -9476
10173i476L369j105P929j727j1909n173p360M272O703M313N522j1249o169L082
$$ -9476 -6107 -7212 717 -1010 -12919 -18092 -25452 -21180 -14477 -10164 -4642 -15891 -22060 -18978
10159a8978O251j3253p557J6856l208l999P528K340o985l807J4946J230j397J819
$$ -18978 -12727 -25980 -33537 -16681 -19889 -23888 -16360 -14020 -21005 -24812 -9866 -8636 -10033 -8214
10145h214K832Q812P823J0711j0906j6742q708o945P874P313J978j1720p739K965
$$ -8214 -5382 3430 11253 21964 11058 -5684 -14392 -21337 -13463 -6150 -4172 -15892 -23631 -20666
10131b0666J6106R674l902m401q31N391n050j3181O652o77o507j8367j956j027
$$ -20666 -4560 5114 1212 -3189 -4020 1371 -3679 -16860 -10208 -10885 -17392 -35759 -37715 -38742
10117c8742M801J0493N649J7502n931J0770J0265l929k669p991L451n57j514L017
$$ -38742 -33941 -23448 -17799 -297 -6228 4542 14807 10878 8209 218 3669 3112 1598 4615
10103D615P688J0137j991j1260J859N899m092j2700K406M595O040K675p928n832
$$ 4615 12303 22440 20449 9189 11048 16947 12855 155 2561 7156 13196 15871 7943 2111
10089B111K280P569j0646k603j0887n389M435j568n926J3271J0914K649n259j573
$$ 2111 4391 11960 1314 -1289 -12176 -17565 -13130 -14698 -20624 -7353 3561 6210 951 -622
10075f22K091J8653o021j2537L768J8643R627J0275l971j8675j9841M093L626
$$ -622 1469 20122 14101 1564 5332 23975 33602 43877 39906 21231 1390 5483 9109
10062I109J274n519K770L613K0293M458M773N868Q275J9295J2130L2118N0155
$$ 9109 10383 4864 7634 11247 31540 35998 40771 46639 54914 74209 86339 118457 168612
10049A68612J07879J96420K74406J95651n7434k07287k14373j65215j06668o4448
$$ 168612 276491 472911 747317 942968 885534 678247 463874 298659 191991 127543
10039A27543k8064j8333j8399q631k543n130o082l554j1431k0227L979J221J691
$$ 127543 99479 81146 62747 54116 51573 46443 40361 36807 25376 5149 9128 10349 12040
10026A2040p196k381n1N713Q702P807j1984n729P427j8452j041Q391O346j5038
$$ 12040 4844 2463 2412 8125 16827 24634 12650 6921 14348 -4104 -5145 3246 9592 -5446
10012e446p45J440J3165p162j8560M104Q742J799R964k83L543L444j051q365j2817
$$ -5446 -6191 -4751 8414 1252 -17308 -13204 -4462 -2663 7301 7018 10561 14005 12954 4589 -8228
9997h228J1790p124l963m05J326J948m551O633Q764p882j0532J0019l377q786
$$ -8228 3562 -3562 -7525 -7930 -6604 -4656 -9207 -2574 6190 -1692 -12224 -2205 -5582 -14368
9983a4368n146O224K535J5360J865l472L217J4123N784j7906m739N442Q553O127
$$ -14368 -19514 -13290 -10755 4605 6470 2998 6215 20338 26122 8216 3477 8919 17472 23599
9969B3599m783j7539p659L581P495r619K197k949O029N333p752O78M816J6441
$$ 23599 18816 1277 -6382 -2801 4694 -4925 -2728 -5677 352 5685 -2067 -1389 3427 19868
9955A9868O496K184p616j4777p811J1617J4322m631J72o508j433j338l352m77
$$ 19868 26364 28548 20932 6155 -1656 9961 24283 19652 19824 13316 11883 10545 7193 6716
9941F716q00P7o877j297p392P791K566j034L618j6854j309O908P432P264O647
$$ 6716 5916 5993 -884 -2181 -9573 -1782 784 -250 3368 -13486 -14795 -7887 -455 6809 13456
9926A3456j6655L123O336n566R322J605p374l663P467J0805K720l813n377j2040
$$ 13456 -3199 -76 6260 694 10016 11621 4247 584 8051 18856 21576 17763 12386 346
9912C46J352J0016o190L094l021J172l796o543q886j5424J374L869Q47L337J5138
$$ 346 1698 11714 5524 8618 5597 6769 2973 -3570 -12456 -27880 -26506 -22637 -21790 -18453 -3315
9897c315J3171l800p244P992K648N457m231l986l821J201M736r843J045m164n597
$$ -3315 9856 6056 -1188 6804 9452 14909 10678 6692 2871 4072 8808 -1035 10 -4154 -9751
9882i751r555j8100l884J8337J9274K756o671m093r207J619j669n003J938K949
$$ -9751 -19306 -37406 -41290 -22953 -3679 -923 -7594 -11687 -20894 -19275 -20944 -25947 -24009 -21060
9868b1060j734K490J7044L896L698P559m044j1344R151j246n102j225m96O265
$$ -21060 -22794 -20304 -3260 636 4334 11893 7849 -3495 5656 4410 -692 -1917 -2413 3852
9854C852o70N378j733k2485j1931l415j1114j2934J6886J6490P693P700Q278K657
$$ 3852 3182 8560 6827 -15658 -27589 -31004 -42118 -55052 -38166 -21676 -13983 -6283 1995 4652
9840D652m288j1001Q301J0511p276L924J796K376p481o820k816K66n815l788L481
$$ 4652 364 -10637 -2336 8175 899 4823 6619 8995 1514 -5306 -8122 -7856 -13671 -17459 -13978
9825a3978m553J661K254L936J9232K400l789j418J372q11n990j478o256J5328
$$ -13978 -18531 -16870 -14616 -10680 8552 10952 7163 5745 7117 6306 316 -1162 -7418 7910
9811G910Q472j3539k4461m176K51J0051J9326l12r690o654n841k909q278O780
$$ 7910 16382 2843 -21618 -25794 -25543 -15492 3834 3522 -6168 -12822 -18663 -21572 -29850 -23070
9797b3070K186q083m421Q810R815J2374o05l857L420Q978m628l219l567l399j264
$$ -23070 -20884 -28967 -33388 -24578 -14763 -2389 -2994 -6851 -3431 5547 919 -2300 -5867 -9266 -10530
9782a0530J3125J210P91l10j5732k130L425J6342O229N942n786j9255K5q933K550
$$ -10530 2595 3805 4596 4286 -11446 -13576 -10151 6191 12420 18362 12576 -6679 -6654 -15587 -13037
9767a3037O836L300j261r127l559j265J2418K5863m627p219N214q46o538m298
$$ -13037 -6201 -2901 -4162 -13289 -16848 -18113 -5695 20168 15541 8322 13536 12690 6152 1854
9753A854p845K64P464m747O40j151q954j456Q2J253Q009J73m786J4906K661k6589
$$ 1854 -5991 -5727 1737 -3010 -2370 -3521 -12475 -13931 -13849 -12596 -4587 -4414 -9200 5706 8367 -18222
9737a8222j593K552J724O212O23n535o07j080K72L893L418j3210j389N682L91
$$ -18222 -19815 -17263 -15539 -9327 -8704 -14239 -14846 -15926 -15654 -11761 -8343 -21553 -22942 -17260 -16869
9722a6869k298N623o074r390l848J8217J3899j0921L216P422P465J2030n908q689
$$ -16869 -19167 -13544 -19618 -29008 -32856 -14639 -740 -11661 -8445 -1023 6442 18472 12564 3875
9708C875O297l199L135O680J449j4639j1391K968K99k032R291O331p43l292K187
$$ 3875 10172 6973 10108 16788 18237 3598 -7793 -4825 -4526 -6558 2733 9064 8321 5029 7216
9693G216k271L186P419K81k124R820m50p555P921k181l477o995j2550M239L153
$$ 7216 4945 8131 15550 15831 13707 23527 23077 15522 23443 21262 17785 10790 -1760 2479 5632
9678E632J3941O869J766J437Q116j5476p899m69J542J241K593R149O922l285j6955
$$ 5632 19573 26442 28208 29645 37761 22285 14386 13917 15459 16700 19293 28442 35364 32079 15124
9663A5124j1987Q556J0928j931J009k06l551M49J0241o971r365l949p292M952
$$ 15124 3137 11693 22621 20690 21699 21493 17942 18391 28632 21661 12296 8347 1055 6007
9649F007R869R890K557o689r119k823L637j7748o779o426K030O895n205m774Q92
$$ 6007 15876 25766 28323 21634 12515 9692 13329 -4419 -11198 -17624 -15594 -8699 -13904 -18678 -17786
9634a7786J750j615m156K210J0322J1865L5j149k387P64k596m125N162J1122N895
$$ -17786 -16036 -17651 -21807 -19597 -9275 2590 2625 1476 -911 -147 -2743 -6868 -1706 9416 15311
9619A5311j512l479J1406o412r627Q53O650p524j0861R431J4517p748m945J049
$$ 15311 13799 10320 21726 15314 5687 6540 13190 5666 -5195 4236 18753 11005 6060 7109
9605G109n959n4J3143J2740n017m801l290q28j359R74r730k246N566P633R310
$$ 7109 1150 1096 14239 26979 21962 17161 13871 13043 11684 12658 2928 682 6248 13881 23191
9590B3191J816J493L760l654M787l925q106q357m811n462j5733j3215K0777K0844
$$ 23191 25007 26500 30260 26606 31393 27468 19362 11005 6194 732 -15001 -28216 -7439 13405
9576A3405R581K723J3278J660J426k0566j0582J7714M382j1766j7206j1058l714
$$ 13405 22986 25709 38987 40647 42073 21507 10925 28639 33021 21255 4049 -7009 -10723
9563a0723l496P076q283r521Q670J1877l686k396L406j071J339J1348j0991K757
$$ -10723 -14219 -7143 -15426 -24947 -16277 -4400 -8086 -10482 -7076 -8147 -6808 4540 -6451 -3694
9549c694J2577K703j3311J152R652O231p507j144J0258m589K971O741p004j4798
$$ -3694 8883 11586 -1725 -573 9079 15310 7803 6659 16917 12328 15299 22040 15036 238
9535B38m960J0901J0829o453J207K272J5758Q240j8104k554p528k757N309k594
$$ 238 -4722 6179 17008 10555 11762 14034 29792 38032 19928 17374 9846 7089 12398 9804
9521I804N871M995K137L361j020k1663m168J0918K03o36P267l779o716J053J7492
$$ 9804 15675 20670 22807 26168 25148 3485 -683 10235 10438 9802 17069 13290 6574 7627 25119
9506B5119N823j7712o228O764O649O590j1200j7302N271R168N067l956p16N526
$$ 25119 30942 13230 7002 13766 20415 27005 15805 -1497 3774 12942 18009 14053 13337 18863
9492A8863O40o689m16N860k167K839r37j880l097k230n767L406n418n567N35R952
$$ 18863 19503 12814 12398 18258 16091 18930 17993 16113 13016 10786 5019 8425 3007 -2560 -2025 7927
9476G927J9151l10j3888j0838l586J898M479j866O793L055j2804J1526L815J6165
$$ 7927 27078 26768 12880 2042 -1544 354 4833 2967 9760 12815 11 11537 15352 31517
9462C1517L977n620l603p568j0781N935n914J2219Q17j4141L895J0340L923o775
$$ 31517 35494 29874 26271 18703 7922 13857 7943 20162 20979 6838 10733 21073 24996 18221
9448A8221N39O148p37K298k792j2414j2364k750n532o952J8101J8402J6347O799
$$ 18221 18760 24908 24171 26469 23677 11263 -1101 -3851 -9383 -16335 1766 20168 36515 43314
9434D3314j8656p738k559J486J1163L24J247n930J75N516P599M948J897R984N382
$$ 43314 24658 16920 14361 15847 27010 27334 28581 22651 22826 28342 35941 40889 42786 52770 58152
9419E8152l457P453N150R054m707n290Q188m978j4130m582o35J4401L965j8666
$$ 58152 54695 62148 67298 76352 71645 66355 74543 69565 55435 50853 50218 64619 68584 49918
9405D9918j160J2263k69j250P794r20j2786j0802P276J7392P565N929L001q730
$$ 49918 48758 61021 60752 59502 67296 66376 53590 42788 50064 67456 75021 80950 83951 75221
9391G5221r865J4302P34k426K801J9486M998J257j694q45J3337J0482K812p298
$$ 75221 65356 79658 80392 77966 80767 100253 105251 106508 104814 103969 117306 127788 130600 123302
9377A23302P89k973n202R348J2734M06O411M323M193M411K2813J1835M908J1498
$$ 123302 124091 121118 115916 125264 137998 138404 144815 149138 153331 157742 180555 192390 197298 208796
9363B08796J6288j074o669J6004N214J7309J3143J8729J4243J0707J5774K9029
$$ 208796 225084 224010 217341 233345 238559 255868 269011 287740 301983 312690 328464 357493
9351C57493L3655K1577L4017K9733L1185J5805M1727M8875N1791N9016L6397M3485
$$ 357493 391148 412725 446742 476475 507660 523465 565192 614067 665858 724874 761271 804756
9339H04756O2656P7979O1003O1153P6169P9392P7477R1882Q0464P0551O0301K4865
$$ 804756 867412 945391 1006394 1067547 1143716 1223108 1300585 1392467 1472931 1543482 1603783 1628648
9327A628648J3491L002n9r126l0754m2886m5322o7996q1021p5509o6445p2719
$$ 1628648 1642139 1645141 1645082 1635956 1605202 1562316 1516994 1448998 1367977 1292468 1226023 1153304
9315A153304p3534p1889p7324p4575m1836m7686n8272m8340m6409k9346l0635
$$ 1153304 1079770 1007881 930557 855982 814146 766460 708188 659848 613439 584093 553458
9304E53458l0032l2374m0309j8712j2803l0008l9565k0385k4882j7407j5554l337
$$ 553458 523426 491052 450743 432031 419228 389220 349655 329270 304388 286981 271427 268090
9292B68090n84q800j6187j2171j8922j6823k067K031j4810j5137Qo693L475j1507
$$ 268090 267506 258706 242519 230348 211426 194603 192536 194567 179757 164620 164628 157935 161410 149903
9278A49903p27o255K29m058l845k73j559l287l507j1859j2557n275R355L670J3844
$$ 149903 149176 142921 143150 139092 135247 134974 133415 130128 126621 114762 102205 96930 106285 109955 123799
9263A23799q278j1203P592j8089k5825k4044PJ3034M394p933o553M763J942M623
$$ 123799 115521 104318 111910 93821 67996 43952 43959 56993 61387 53454 46901 51664 53606 58229
9249E8229N843j1390k627k10n07j016N491O81J481p723m053J655J8381O559j0230
$$ 58229 64072 52682 50055 49845 49338 48322 53813 54494 55975 48252 44199 45854 64235 70794 60564
9234F0564j2824J0332r66j0724j2295M41P131K795j0230r213P901O233o43R037
$$ 60564 47740 58072 57106 46382 34087 34528 41659 44454 34224 25011 32912 39145 38502 47539
9220D7539o914J0714l16p483J189J1270j23o093M207n609o474n617N677J4646
$$ 47539 40625 51339 51023 43540 44729 55999 55876 49783 53990 48381 41907 36290 41967 56613
9206E6613L342n295q811j024K830j3N794j357r967j1021l249r332L847J1818Q015
$$ 56613 59955 54660 45849 44825 47655 47642 53436 52079 42112 31091 27842 18510 22357 34175 42190
9191D2190m67J731j729M499J0928M553j1796l516P942p302q420j0260q021R020
$$ 42190 41723 43454 41725 46224 57152 61705 49909 46393 54335 47033 38613 28353 20332 29352
9177B9352P798r778M20P084j156j0719l451J0110J333N608J0609l243j1630k443
$$ 29352 37150 27372 27792 34876 33720 23001 19550 29660 30993 36601 47210 43967 32337 29894
9163B9894J6451R161J1991Q563k2342j9614j038r492j268J7288L513M313M098
$$ 29894 46345 55506 67497 76060 53718 34104 33066 23574 22306 39594 43107 47420 51518
9150E1518o276J5652M486j3689j9513N80J386j0568j615p006o085n620l713P598
$$ 51518 45242 60894 65380 51691 32178 32758 34144 23576 21961 14955 8870 3250 -463 7135
9136G135J5485M293J6706J2375P528k26m559k170k629o139j6375J87R255O762
$$ 7135 22620 26913 43619 55994 63522 63296 58737 56567 53938 47799 31424 31611 40866 47628
9122D7628n345j0133n730M072J4447J4746J306k672M432K636J992M582O971J0133
$$ 47628 42283 32150 26420 30492 44939 59685 60991 58319 62751 65387 67379 71961 78932 89065
9108H9065M58M771o87o654r681M462J1095j047r411Q175J2537Q645j2248J0438
$$ 89065 89523 94294 93607 86953 77272 81734 92829 91782 82371 90546 103083 111728 99480 109918
9094A09918R258M908K0183K7353J3989J2054K9945K9459L3705M8745N9620P2836
$$ 109918 119176 124084 144267 171620 185609 197663 227608 257067 290772 339517 399137 471973
9082D71973R3061J27350J57857J87838K11300K09213J67663J26069M9660l7651
$$ 471973 565034 692384 850241 1038079 1249379 1458592 1626255 1752324 1801984 1764333
9072A764333j09794j60926j92872j95887j90566j56288j24626r7264r0944n9226
$$ 1764333 1654539 1493613 1300741 1104854 914288 758000 633374 536110 445166 385940
9062C85940m9296m2401k6880k9419k1518k4040j7008k8798j6288K174j0260J857
$$ 385940 336644 294243 267363 237944 216426 192386 175378 146580 130292 132466 122206 124063
9050A24063p329k4636k723r182J518K697r824q024k0760l892M166O407Q376j556
$$ 124063 116734 92098 89375 80193 81711 84408 74584 66560 45800 41908 46074 52481 60857 59301
9036E9301j4509n158J4247J1623J1013j1834k098K124k388o689j761K052j714
$$ 59301 44792 39634 53881 65504 76517 64683 62585 64709 62321 55632 53871 55923 54209
9023E4209r911L838N060L366J5588M324m888J311O938Q981L468j0649j0613j077
$$ 54209 44298 48136 53196 56562 72150 76474 71586 72897 79835 88816 92284 81635 71022 69945
9009F9945n654q264O11J4014j241K232J0187j0278k1818j0506K032J7494M80J02
$$ 69945 64291 56027 56638 70652 69411 71643 81830 71552 49734 39228 41260 58754 59234 59336
8995E9336K295L18J2826l3521k5571j0629R393J2186L315q001j3014m248M036
$$ 59336 61631 61949 74775 41254 15683 5054 14447 26633 29948 21947 8933 4685 8721
8982H721J502M666L605R115o711K0052K1887O006J104n556Q84K078k1404k1764
$$ 8721 10223 14889 18494 27609 20898 40950 62837 68843 69947 64391 65275 67353 45949 24185
8968B4185J4330J9678q39K841J2061O879Q692q717M386J9609P163K681M630O094
$$ 24185 38515 58193 57354 60195 72256 79135 87827 79110 83496 103105 110268 112949 117579 123673
8954A23673M840L557k6129j2356q03k918p037j661O688L501P992K410j94M796
$$ 123673 128513 132070 105941 93585 92782 89864 82827 81166 87854 91355 99347 101757 101563 106359
8940A06359J1558J9194J1559Q365K5311L9383L6551K6244M7303L9306J4571j1663
$$ 106359 117917 137111 148670 157035 182346 221729 258280 284524 331827 371133 385704 374041
8928C74041k5574m4607l4420k7104k2215m429k0642k1710j1628n960k5234k2240
$$ 374041 348467 303860 269440 242336 220121 215692 195050 173340 161712 155752 130518 108278
8916A08278k856l381J0737J8402J4209J0276J3667J9802o084k6983q252J0651
$$ 108278 105422 102041 112778 131180 145389 155665 169332 189134 183050 156067 147815 158466
8904A58466N325J515n318L004o269P172J3595J0086j2171n411j6924k0620n85
$$ 158466 163791 165306 159988 162992 156723 163895 177490 187576 175405 169994 153070 132450 131865
8891A31865M395M697j1055o407N683n492J0079J2551o524l557j1157M145J3247
$$ 131865 136260 140957 129902 123495 129178 123686 133765 146316 139792 136235 125078 129223 142470
8878A42470K5951L6642L3751R568p122r227k3928l1284k7747k2933j3024j1253
$$ 142470 168421 205063 238814 248382 241260 232033 208105 176821 149074 126141 113117 101864
8866A01864m761N114q721r714J4350Q698M488n484j0483p251L622Q644Q642J3768
$$ 101864 97103 102217 93496 83782 98132 106830 111318 105834 95351 88100 91722 100366 109008 122776
8852A22776R060L1513K4348P997n809L751N814J565J019j8665l548M015r498k981
$$ 122776 131836 163349 187697 195694 189885 193636 199450 201015 202034 183369 179821 183836 174338 171357
8838A71357k828J8267J5667j0041k118K8946L6666M2706M8179J7068j2963k7652
$$ 171357 168529 186796 202463 192422 190304 219250 255916 298622 346801 363869 350906 323254
8826C23254k4533k8179l446N334J1493J0963N069J6159j4210j774J4952J6173
$$ 323254 298721 270542 267096 272430 283923 294886 299955 316114 301904 300130 315082 331255
8814C31255m098N75J9849R797J2748R495J9390L5949M3423R5121J44043R8176
$$ 331255 327157 327732 347581 357378 370126 379621 399011 434960 478383 573504 717547 815723
8802H15723J9361m6628o4562o1943n6684n1063l9434k4325p566j1875N075j295
$$ 815723 835084 788456 723894 661951 605267 554204 514770 490445 482879 471004 476079 474784
8790D74784o995K815J5633J9597l405l229P600J7624J6678N645J2860K618O243
$$ 474784 467789 470604 486237 505834 502429 499200 506800 524424 541102 546747 559607 562225 568468
8777E68468O705J8200J0385P893L594j7768k664K394N772K9985K7363J2450K8016
$$ 568468 575173 593373 603758 611651 615245 597477 594813 597207 602979 632964 660327 672777 700793
8764G00793L6938J2222J2864L6465K0863K0471P125l039K2045K5764J9422K6708
$$ 700793 737731 749953 762817 799282 820145 840616 847741 844702 866747 892511 911933 938641
8752I38641L5773K7837K6104J5674O384K2582K5746L2618L5091M9747M7745M6812
$$ 938641 974414 1002251 1028355 1044029 1050413 1072995 1098741 1131359 1166450 1216197 1263942 1310754
8740A310754P5631O1279L5820J7188M223p21K8884N4655P6074R1027R8133Q3890
$$ 1310754 1386385 1447664 1483484 1500672 1504895 1504174 1533058 1587713 1663787 1754814 1852947 1936837
8728A936837O2564P8930P4117P2788R3146J06729J06111J22283J26653J18087
$$ 1936837 1999401 2078331 2152448 2225236 2318382 2425111 2531222 2653505 2780158 2898245
8718B898245J13957R9225R4039J02820J19634J33781J74477K25443K73595K89011
$$ 2898245 3012202 3111427 3205466 3308286 3427920 3561701 3736178 3961621 4235216 4524227
8708D524227L30110L76079M13571M72437N26971N83368O47722O93887P56656Q36585
$$ 4524227 4854337 5230416 5643987 6116424 6643395 7226763 7874485 8568372 9325028 10161613
8698A0161613R66638J130852J365564J685065K012833K357321K749564L272545
$$ 10161613 11128251 12259103 13624667 15309732 17322565 19679886 22429450 25701995
8690B5701995L905056M504133N058212N824904P224240R739479J3815806K0197065
$$ 25701995 29607051 34111184 39169396 44994300 52218540 61958019 75773825 95970890
8682I5970890L0167127M5284386O6022153Q8273355R6105544O3762963k836996
$$ 95970890 126138017 171422403 237444556 325717911 421823455 485586418 482749422
8675D82749422o1171424q7571179q4008697o5270977m5938869l1582334k1869093
$$ 482749422 421577998 334006819 249998122 184727145 138788276 107205942 85336849
8668H5336849j5394969j1046738q184221o358614n139673m310559l844475l589031
$$ 85336849 69941880 58895142 50710921 44352307 39212634 34902075 31057600 27468569
8660B7468569l288771k883530k485531k145892j836482j571280j354113j134557
$$ 27468569 24179798 21296268 18810737 16664845 14828363 13257083 11902970 10768413
8652A0768413r36973p71229o51301n47162m87072m31459l98437l63645l33815
$$ 10768413 9831440 9060211 8408910 7861748 7374676 6943217 6544780 6181135 5847320
8643E847320l01622k73943k80638k82758k75874k78304k67482k43029k29147k01554
$$ 5847320 5545698 5271755 4991117 4708359 4432485 4154181 3886699 3643670 3414523 3212969
8633C212969j60838j23069j05206j04565r1899r4325p4089p1749l2449j164L8437
$$ 3212969 3052131 2929062 2823856 2719291 2627392 2533067 2458978 2387229 2354780 2353616 2392053
8622B392053R2487J85278K58842K17264N6719k8967J1642P1407l8745k41126l63321
$$ 2392053 2484540 2669818 2928660 3145924 3202643 3173676 3185318 3256725 3217980 2976854 2613533
8611B613533l38326k48771j69036j29420r7634p6157o0511m4168p2392o7940j1498
$$ 2613533 2275207 2026436 1857400 1727980 1630346 1554189 1493678 1449510 1377118 1309178 1297680
8600A297680j3315m1584k7839l6328l3376k9588J780K9017M3818R4506J33313
$$ 1297680 1284365 1242781 1214942 1178614 1145238 1115650 1117430 1146447 1190265 1284771 1418084
8589A418084P5442k5382r6951j18354q9931l8634k3921j8690k6835J0016P7461
$$ 1418084 1493526 1468144 1371193 1252839 1162908 1124274 1100353 1081663 1054828 1064844 1142305
8578A142305J70285L21021M94031N22529J47497k11074l06624k71721k52349k56926
$$ 1142305 1312590 1633611 2127642 2650171 2797668 2586594 2279970 2008249 1755900 1498974
8568A498974k52140k13198j41615j02641n9466l3376k9427l2977k9320k1589j2068
$$ 1498974 1246834 1033636 892021 789380 729914 696538 667111 634134 604814 583225 571157
8557E71157j7883k1872j7777k3250m4419j9443J901L8976K9594J6096J9651O57
$$ 571157 553274 531402 513625 490375 445956 426513 428414 467390 496984 513080 532731 533388
8545E33388N532m121q660Q411m281p320J4766L2502J8643j105q651N2223J09170
$$ 533388 538920 534799 526139 534550 530269 522949 537715 570217 588860 587755 579104 631327 740497
8532G40497J72914K24747J42385o3492k00193k35655k02200j31837q4767m7982
$$ 740497 913411 1138158 1280543 1217051 1016858 781203 579003 447166 362399 314417
8522C14417P908K1304K0995J2378k91j3124N838N056k1035j5951k2019k4423j1615
$$ 314417 322325 343629 364624 377002 376711 363587 369425 374481 353446 337495 315476 291053 279438
8509B79438r854j3246M4K002J3712p764n764R222R872J6473J7530J1332M859J5866
$$ 279438 269584 256338 256382 258384 272096 264332 258568 267790 277662 294135 311665 322997 327856 343722
8495C43722J4474J1269K0016Q973n859j4952j5559k9911l0656l2014j6262k2790
$$ 343722 358196 369465 389481 398454 392595 377643 362084 332173 301517 269503 253241 230451
8483B30451j2861k6945l2131k6512j1593M228R790J5552Q109L894Q369L010J3204
$$ 230451 217590 190645 158514 132002 120409 124637 134427 149979 158088 161982 170351 173361 186565
8470A86565N647q53n271K497J597j0421j1078j0888O164m254k1463j1582q231
$$ 186565 192212 191359 186088 188585 190182 179761 168683 157795 163959 159705 138242 126660 118429
8457A18429j110M675n657m441j3964l788P572R057L561L349j932Q556M784M21
$$ 118429 117319 121994 116337 111896 97932 94144 101716 110773 114334 117683 115751 124307 129091 129512
8443A29512j1681J4686Q878M634j892J0582j040j1895q160j2825n868L380O423
$$ 129512 117831 132517 141395 146029 144137 154719 153679 141784 133624 120799 114931 118311 124734
8430A24734P598O380k271J1245j643l056K0811R847j456K571o353k2017r002q827
$$ 124734 132332 138712 136441 147686 146043 142987 163798 173645 172189 174760 168407 146390 137388 128561
8416A28561m55N306j0055p428o473O227J1945m743j0417J2295j662n928j1335
$$ 128561 128106 133412 123357 115929 109456 115683 127628 122885 112468 124763 123101 117173 105838
8403A05838j847k675l923j026j3493N36m895j485M143J2570j096M764J1438R343
$$ 105838 103991 101316 97393 96367 82874 83410 78515 77030 81173 93743 92647 97411 108849 118192
8389A18192m016j1893L160J1787L623l370j4378j2046R617Q886M74j493j412K174
$$ 118192 114176 102283 105443 117230 120853 117483 103105 91059 100676 109562 110036 108543 107131 109305
8375A09305q244R768J090R038J2703P528J356j090j6112p164K421l606n442j1270
$$ 109305 101061 110829 111919 120957 133660 141188 142544 141454 125342 118178 120599 116993 111551 100281
8361A00281j1128p37m879p828q001J1678p668j2552J449P506M637J4178J0631
$$ 100281 89153 88416 83537 75709 67708 79386 71718 59166 60615 68121 72758 86936 97567
8348I7567L570k676r984j2598J2912J2780O435o138n467L18k0064k6369J743J0135
$$ 97567 101137 98461 88477 75879 88791 101571 108006 101868 96401 96719 76655 50286 52029 62164
8334F2164Q686j764P647Q758n70J1261j908n580j731P614k377J347K42m122K205
$$ 62164 70850 69086 76733 85491 84921 96182 94274 88694 86963 94577 92200 93547 93789 89667 91872
8319I1872J2872m171j537Q683P832j0356m625R155J0381p115m995n951R032O850
$$ 91872 104744 100573 99036 107719 115551 105195 100570 109725 120106 112991 107996 102045 111077 117927
8305A17927P781q678j3437m622k01j878J2193L991K981n28J861m320J1306J9718
$$ 117927 125708 117030 103593 98971 98770 96892 109085 113076 116057 115529 117390 113070 124376 144094
8291A44094J6498J0047K0894L5319J0895L1938M0908N1044P2039Q5579J08426
$$ 144094 160592 170639 191533 226852 237747 269685 310593 361637 433676 519255 627681
8280F27681J33359J50112J80649K11806K19845J62010P7666K18l2345j01608j66254
$$ 627681 761040 911152 1091801 1303607 1523452 1685462 1763128 1763346 1731001 1629393 1463139
8269A463139j96532j98245j80359j59128j21330j02078o8112n3819n4000l9852
$$ 1463139 1266607 1068362 888003 728875 607545 505467 437355 383536 329536 289684
8259B89684l6706l3372k5524k2509j3362j3801j1610j3059j1155p293J796M298
$$ 289684 252978 219606 194082 171573 158211 144410 132800 119741 108586 101293 103089 107387
8247A07387k602j7033j2339j0652R491k138P29O609L419L736m415j6606j1719
$$ 107387 104785 87752 75413 64761 74252 72114 72843 79452 82871 86607 82192 65586 53867
8234E3867J1652J4521q42q368j4261p716n049O833M986j478M68m37O392p57J6683
$$ 53867 65519 80040 79198 70830 56569 48853 43804 50637 55623 54145 54613 54176 60568 59811 76494
8219G6494J5102k5159j0904L417l641O663r255j2937J1528m685k431M538N663
$$ 76494 91596 66437 55533 58950 55309 61972 52717 39780 51308 46623 44192 48730 54393
8206E4393J842p377J0111L602r308q955l223Q857o862k462m990l385J88O749q747
$$ 54393 56235 48858 58969 62571 53263 44308 41085 49942 43080 40618 35628 32243 32431 39180 30433
8191C0433m249P318j1272N375J2106q914r682J7761P856L201j358j3117l051R235
$$ 30433 26184 33502 22230 27605 39711 30797 21115 38876 46732 49933 48575 35458 32407 41642
8177D1642J2802k143r396J246P275o99k678L481M995J562l326o80J6036J885k2427
$$ 41642 54444 52301 42905 44151 51426 50727 48049 51530 56525 58087 54761 54081 70117 72002 49575
8162D9575m416n87r45K985J2204K274L709N109J4020k228p972k1221j9327j4764
$$ 49575 45159 44572 43627 46612 58816 61090 64799 69908 83928 81700 73728 52507 33180 18416
8148A8416q60J1696O005r53p170M398Q498J0389Q943M658R067k1297o153q686
$$ 18416 17556 29252 35257 34304 27134 31532 40030 50419 59362 64020 73087 51790 45637 36951
8134C6951q386J0751Q362J149J823m865j5232p533R5J710p310j8985L363N137
$$ 36951 28565 39316 47678 48827 50650 45785 30553 23020 23115 24825 17515 -1470 1893 7030
8120G030O560P660Q429j891Q702n593j81K835J5363m259L080J705k811j616p96
$$ 7030 13590 21250 29679 27788 36490 30897 30716 33551 48914 44655 47735 49440 46629 45013 44217
8105D4217M219L816M951K78j3008m726J857J1298J847O452r223l473K80Q221p194
$$ 44217 48436 52252 57203 57481 44473 39747 41604 52902 54749 61201 51978 48505 48785 57006 49812
8090D9812J526K598K007J2944r294p037p199j964m835j2682l143k668l884l948
$$ 49812 51338 53936 55943 68887 59593 52556 45357 43393 38558 25876 22733 20065 16181 12233
8076A2233k22R222J0040J1715J472q58Q80r662j6045m049P115J344J573O076L710
$$ 12233 12011 21233 31273 42988 44460 43602 44482 34820 18775 14726 21841 23185 24758 30834 34544
8061C4544L188m836j8358K0793J6922N980O77q475o704r004k0920O683j323L022
$$ 34544 37732 32896 14538 35331 52253 58233 58910 50435 43731 34727 13807 20490 19167 22189
8047B2189L857J496j0050M5o946O705K2392O092j1210j1434p873P484j5221q429
$$ 22189 26046 27542 17492 17537 10591 17296 39688 45780 34570 23136 15263 22747 7526 -903
8033i03N197J166N525J519M883J1644n55M706Q213q209m001n183m671N424J3048
$$ -903 4294 5460 10985 12504 17387 29031 28476 33182 41395 33186 29185 24002 19331 24755 37803
8018C7803m011k0119J762M535J0418j670o222J3608J1637P08j1828n576R311O377
$$ 37803 33792 13673 15435 19970 30388 28718 22496 36104 47741 48449 36621 31045 40356 46733
8004D6733O466R650N139k853r729j6203m374J580O654r220m507J4206J7842N431
$$ 46733 53199 62849 67988 65135 55406 39203 34829 36409 43063 33843 29336 43542 61384 66815
7990F6815K87j2082j1096o791r074L308r343p294P741K705N525Q611M977R15q514
$$ 66815 67102 55020 43924 37133 28059 31367 22024 14730 22471 25176 30701 39312 44289 45204 36690
7975C6690p749o345Q360O420K665j2488r508K088k809j638J0131K3245Q479m881
$$ 36690 28941 22596 30956 37376 40041 27553 18045 20133 17324 15686 25817 49062 57541 52660
7961E2660q61J5L869k284N519p746j2756L537p374L121O427k890O274j2575l59
$$ 52660 51799 51814 55683 53399 58918 51172 38416 41953 34579 37700 44127 41237 47511 34936 34577
7946C4577J758j1183p954l956N539r6n766K575M76M905P323P914N887j1123k848
$$ 34577 36335 25152 17198 13242 18781 18685 12919 15494 15970 20875 28198 36112 41999 30876 28028
7931B8028n86R685J35P28j1109j8352n465J4386J3228l180o561J2479J2277q09
$$ 28028 27442 37127 37262 37990 26881 8529 3064 17450 30678 27498 20937 33416 45693 44884
7917D4884K520q656O348N731j7629k5719K124J5818j0466j3740J3403R667J490
$$ 44884 47404 38748 45096 50827 33198 7479 9603 25421 14955 1215 14618 24285 25775
7904B5775j4449n917k832p393P166O734J1610k908j6813k4379l721K0252J0098
$$ 25775 11326 5409 2577 -4816 2350 9084 20694 17786 973 -23406 -27127 -6875 3223
7891C223j252K351N841J1778j0280j4569m817n715R291J3685J2921K649O801m149
$$ 3223 1971 4322 10163 21941 11661 -2908 -7725 -13440 -4149 9536 22457 25106 31907 27758
7877B7758j1475j580r77N25K691n739n717O126O994L827M816o707j1334l69O120
$$ 27758 16283 14703 13726 14251 16942 11203 5486 11612 18606 22433 27249 20542 9208 8839 14959
7862A4959L191m996k584J20l333O844J1070O715l21k312m872K36J125p217o553
$$ 14959 18150 13154 10570 10690 7357 14201 25271 31986 31665 29353 24481 24717 25842 18625 12072
7847A2072k898Q100o85O139K49J5980r4m537p746M571j7030j132k1205q147M537
$$ 12072 9174 17274 16589 22728 22977 38957 38863 34326 26580 31151 14121 12989 -8216 -16363 -11826
7832a1826K407J5823N366j564o035P172N114M797O772k223j6962P160N599j245
$$ -11826 -9419 6404 11770 10206 4171 11343 16457 21254 28026 25803 8841 16001 21600 20355
7818B0355P11o948n035Q87r512j2359m21L547J2416J5m958J0867K2849J2734j474
$$ 20355 21066 14118 9083 9970 458 -11901 -12322 -8775 3641 3656 -1302 9565 32414 45148 43674
7803D3674j3711J713p91o306l779l501o318q107q442m562J7281M300M441R306
$$ 43674 29963 31676 30885 24579 20800 17299 10981 2874 -5568 -10130 7151 11451 15892 25198
7789B5198k729K649J53m611r408K268J3164K974J776P194p608j0842j4401N561
$$ 25198 22469 25118 25271 20660 11252 13520 26684 29658 31434 38628 31020 20178 5777 11338
7775A1338O811j7781j1783M525k539k476J3914p32n014Q512L864O48O566o401
$$ 11338 18149 368 -11415 -6890 -9429 -11905 2009 1277 -3737 4775 8639 9287 15853 9452
7761I452N37m33q518J253r015m302L482L388M689K5899L651R00j0893o557K139
$$ 9452 9989 9556 1038 2291 -6724 -11026 -7544 -4156 533 26432 30083 30983 20090 13533 15672
7746A5672J641P486J575j3431K536K313j1942o026P472N992O21n491l905M292
$$ 15672 17313 24799 26374 12943 15479 17792 5850 -176 7296 13288 13909 8418 4513 8805
7732H805P942L98l147j131J1015J4617j1170l064m104J0874q057q922o681P596
$$ 8805 16747 17145 13998 12867 23882 38499 27329 24265 20161 31035 22978 14056 7375 14971
7718A4971K730L596R70j1582j343l911k688L681j0231l362j8340N068K8591N308
$$ 14971 17701 21297 22267 10685 9342 5431 2743 6424 -3807 -7169 -25509 -20441 8150 13458
7704A3458m473r728j4091m243Q875O609N423k6o441L817O549J0137q77j100j0201
$$ 13458 8985 -743 -14834 -19077 -10202 -3593 1830 1804 -4637 -820 5729 15866 14989 13889 3688
7689C688j1569J3005P657j39J1497m91j3398L903p868m630k022P846R441j0993
$$ 3688 -7881 5124 12781 12642 24139 23648 10250 14153 6285 1655 -367 7479 16920 5927
7675E927j927k369q714Q96J5734l534n930M901P062l364p203m143L780J3801J1469
$$ 5927 4000 1631 -7083 -6187 9547 6013 83 4984 12046 8682 1479 -2664 1116 14917 26386
7660B6386J0466n592j047L588k941l899q095N522j1518p674n619k577N203q436
$$ 26386 36852 31260 30213 33801 30860 26961 18866 24388 12870 5196 -423 -3000 2203 -6233
7646f233J616M5J74o748q305J7838J8388l435m911n015L734J5676O561r340l552
$$ -6233 -4617 -4572 -4398 -11146 -19451 -1613 16775 13340 8429 3414 7148 22824 29385 20045 16493
7631A6493L766J773k936m997m302j7030R035R023O382j425K877p610p728P471
$$ 16493 20259 22032 19096 14099 9797 -7233 1802 10825 17207 15782 18659 11049 3321 10792
7617A0792l090m573m183k315o549O020L36K892J0598n152n11J0206L561N444r993
$$ 10792 7702 3129 -1054 -3369 -9918 -3898 -3562 -670 9928 4776 4265 14471 18032 23476 13483
7602A3483j1003K929L160O261j1631j0538P558J8051N260p273q674m766L084P438
$$ 13483 2480 5409 8569 14830 3199 -7339 219 18270 23530 16257 7583 2817 5901 13339
7588A3339J839P964q467j985o241j3928r06M09J1746R620M471Q0J2679q641k1253
$$ 13339 15178 23142 14675 12690 6449 -7479 -8385 -7976 3770 13390 17861 17941 30620 21979 726
7573G26Q032N19O573M898l619k501m88o183q658M312l192L316M135M304J658j0353
$$ 726 8758 9277 15850 20748 17129 14628 14140 7957 -701 3611 419 3735 7870 12174 13832 3479
7557C479Q561l693O906P381J1964l477p280j589R21l181q897R78N390L972R255
$$ 3479 12040 8347 15253 22634 34598 31121 23841 22252 23173 19992 11095 12073 17463 21435 30690
7542C0690q845m476J131J79m456q206j0949Q5j5644q284J8271J0645J1554N913
$$ 30690 21845 17369 18500 18679 14223 6017 -4932 -4847 -20491 -28775 -10504 141 11695 17608
7528A7608n295j4646m799L40K386J1044J1010M316r500q976J1364J772p723r244
$$ 17608 12313 -2333 -7132 -6792 -4406 6638 17648 21964 12464 3488 14852 16624 8901 -343
7514c43r415m398K7415J524m051J1063l252k624q507j3471k711J0046J1091l043
$$ -343 -9758 -14156 13259 14783 10732 21795 18543 15919 7412 -6059 -8770 1276 12367 9324
7500I324j5672q808L826J3358P470k285n963p288J3307J1511l552q103m118j0625
$$ 9324 -6348 -15156 -11330 2028 9498 7213 1250 -6038 7269 18780 15228 7125 3007 -7618
7486g618l188Q255N284n170O075L910R136N216j6693P6n154l920m429k163J4272
$$ -7618 -10806 -2551 2733 -2437 3638 7548 16684 21900 5207 5283 129 -3791 -8220 -10383 3889
7471C889O049j0663q429J1967J093k66L006K397j0365p890J8149j605n259R722
$$ 3889 9938 -725 -9154 2813 3906 3640 6646 9043 -1322 -9212 8937 7332 2073 11795
7457A1795k955n606k584L815l940N283J779j3974m398J3395J6205K615j2537J068
$$ 11795 8840 3234 650 4465 525 5808 7587 -6387 -10785 2610 18815 21430 8893 9961
7443I961q352o531k81J784R76r249J1329J8839r59p459n075R067J850j5269j2039
$$ 9961 1609 -4922 -5203 -3419 -2443 -11692 -363 18476 17517 10058 4983 14050 15900 631 -11408
7428a1408j3454N231n420k59J8161J0172M782j2064r416l60o014J3202J0389M923
$$ -11408 -24862 -19631 -25051 -25310 -7149 3023 7805 -4259 -13675 -14035 -20049 -6847 3542 8465
7414H465P601r69m932N643K974l418j970p334l573k627M608J0309n13q133o233
$$ 8465 16066 15097 10165 15808 18782 15364 13394 6060 2487 -140 4468 14777 14264 6131 -102
7399a02M891K690J169P18L786N536R859L409j867j6551j0597J2769J0988j3469
$$ -102 4789 7479 8648 9366 13152 18688 28547 31956 30089 13538 2941 15710 26698 13229
7385A3229r487r346k307o494J705J525J9249J0120k433m339M498q466j948M053
$$ 13229 3742 -5604 -7911 -14405 -12700 -11175 8074 18194 15761 11422 15920 7454 5506 9559
7371I559M273j053J0880j6232j1441j487J0181M226n882P003k845o079M855j2140
$$ 9559 13832 12779 23659 7427 -4014 -5501 4680 8906 3024 10027 7182 1103 5958 -6182
7357f182r266N407L198M348J0139l408o158k32q88J872l251J5764N540p442K921
$$ -6182 -15448 -10041 -6843 -2495 7644 4236 -1922 -2154 -3042 -1170 -4421 11343 16883 9441 12362
7342A2362o33j3337N99J9606j3141j006O716n196m290P75M018L379L345j1075
$$ 12362 11729 -1608 -1009 18597 5456 4450 11166 5970 1680 2455 6473 9852 13197 2122
7328B122j7866r602L107P442O856M186p397j24M188K143R729n870p393P458M704
$$ 2122 -15744 -25346 -22239 -14797 -7941 -3755 -11152 -11276 -7088 -4945 4784 -1086 -8479 -1021 3683
7313C683R152N68M135M940j0232j3071j443j906M169n693n112k752r792o63K46
$$ 3683 12835 13403 17538 22478 12246 -825 -2268 -4174 -5 -5698 -10810 -13562 -23354 -24017 -23771
7298b3771N074L917M311O549m196j1371R87J0913K912o637J1488J6564m747j4473
$$ -23771 -18697 -14780 -10469 -3920 -8116 -19487 -18500 -7587 -4675 -11312 176 16740 11993 -2480
7284b480j0341M405J8967K370l455K630Q542r140o743j571N90p896l324k230q581
$$ -2480 -12821 -8416 10551 12921 9466 12096 20638 11498 4755 3184 3774 -4122 -7446 -9676 -18257
7269a8257l870n365O728M963J3376J5572L594J4102q122n58M123L440K948n924
$$ -18257 -22127 -27492 -20764 -15801 -2425 13147 16741 30843 22721 22163 26286 29726 32674 26750
7255B6750l994j419j1477j0712L260O604J732K167J867O214k865J325j1317l07
$$ 26750 22756 21337 9860 -852 2408 9012 10744 12911 14778 20992 18127 19452 8135 7828
7241G828r402p142J579J216L757n895j396q828P515J3498O986k446R734K450k418
$$ 7828 -1574 -8716 -7137 -5921 -2164 -8059 -9455 -18283 -10768 2730 9716 7270 17004 19454 17036
7226A7036k852n990m510q00Q737J2327p159q696j5102o465M101R302N754q173
$$ 17036 14184 8194 3684 2884 11621 23948 16789 8093 -7009 -13474 -9373 -71 5683 -2490
7212b490l08J2383o485j3729K059Q199r49p765M382j103p143p075p794J0755J8774
$$ -2490 -2798 9585 3100 -10629 -8570 -371 -1320 -9085 -4703 -5806 -12949 -20024 -27818 -17063 1711
7197A711R802p470J087l576q355J2343O474p257j5007J18R723L289O135R88M107
$$ 1711 11513 4043 5130 1554 -6801 5542 12016 4759 -10248 -10130 -407 2882 9017 10005 14112
7182A4112l020j4827J7615O418q129l97j5018j9136l73J0156n108L296R326J0648
$$ 14112 11092 -3735 13880 20298 12169 11772 -3246 -22382 -22755 -12599 -17707 -14411 -5085 5563
7168E563M179l079J268R402j5697p23N035k742m965K357N035j551o861j468r324
$$ 5563 9742 6663 7931 17333 1636 913 5948 3206 -1759 598 5633 4082 -2779 -4247 -13571
7153a3571Q825R728m190j725R775j920J30J218R197M023p516j462n007M23o256
$$ -13571 -4746 4982 792 -933 8842 6922 7052 8270 17467 21490 13974 12512 7505 7928 1672
7138A672P083l070n599K95L219l873m470J015o57P000J2756K052j1073k520J1531
$$ 1672 8755 5685 86 381 3600 -273 -4743 -3728 -4385 2615 15371 17423 6350 3830 15361
7123A5361j883R325J0485p7j7866j9447l929M819J1242P866j1105p151k127j98
$$ 15361 13478 22803 33288 33211 15345 -4102 -8031 -3212 8030 15896 4791 -2360 -4487 -4685
7109d685l43J044J4171J0932n010j9223o306J971L356L090M271L526J1628K739
$$ -4685 -5028 -3984 10187 21119 16109 -3114 -9420 -7449 -4093 -1003 3268 6794 18422 21161
7095B1161j4045K4P396l559R430n906m465r855j184O478o425j1644L477O536K319
$$ 21161 7116 7140 14536 10977 20407 14501 10036 181 -1003 5475 -950 -12594 -9117 -2581 -262
7080b62Q807p03J327J653J505O578p182p094p685n258J151q43J6723J310r299
$$ -262 8545 7842 9169 10822 12327 18905 11723 4629 -3056 -8314 -7163 -8006 8717 10027 728
7065G28N226j2581r892M906Q974J7878R658p877j1434L11K0546j6343j6519J5567
$$ 728 5954 -6627 -16519 -11613 -2639 15239 24897 17020 5586 5897 26443 10100 -6419 9148
7051I148J1078j8559j626J548q107j450J429J0199J0085L226j9629k1498q806
$$ 9148 20226 1667 41 1589 -6518 -7968 -6539 3660 13745 16971 -2658 -24156 -32962
7038c2962m273N313K883M043l31j3190n8J0202J6581M745J9223N410r780p049
$$ -32962 -37235 -31922 -29039 -24996 -25327 -38517 -38575 -28373 -11792 -7047 12176 17586 7806 757
7024G57L224P280j126K960J067k321O703J5817j6248j1757o12K226J2873J4332
$$ 757 3981 11261 10135 13095 14162 11841 18544 34361 18113 6356 5744 7970 20843 35175
7010C5175N660p642n876q980j1623K603P994l341r89L889j3321o284R185J2748
$$ 35175 40835 33193 27317 18337 6714 9317 17311 13970 12981 16870 3549 -2735 6450 19198
6996A9198O575j1861j1151J0706l40j1824j1466P874J9074M924K59o501l359J25
$$ 19198 25773 13912 2761 13467 13127 1303 -10163 -2289 16785 21709 21968 15467 12108 12233
6982A2233N33j4555l200J1817m622R11J4851k145Q136J160j1489K846k347o013
$$ 12233 12766 -1789 -4989 6828 2206 3117 17968 15823 23959 25119 13630 16476 14129 8116
6968H116M266j8800j1723M316K868j1652O595R658j65m140M454K213l775R616
$$ 8116 12382 -6418 -18141 -13825 -10957 -22609 -16014 -6356 -6521 -10661 -6207 -3994 -7769 1847
6954A847J485l111O950Q010P78k035o64r218r215l407Q257L508M886L407j6228
$$ 1847 3332 221 7171 15181 15959 13924 13260 4042 -5173 -8580 -323 3185 8071 11478 -4750
6939d750o555k435N689O36j0485J4954L815n00m510K076N612j0764m796J3947
$$ -4750 -11305 -13740 -8051 -7415 -17900 -2946 869 369 -4141 -2065 3547 -7217 -12013 1934
6925A934N225m459j6231j127M915Q103l785k999o317j4372N133J4204O637M948
$$ 1934 7159 2700 -13531 -14658 -9743 -1640 -5425 -8424 -14741 -29113 -23980 -9776 -3139 1809
6911A809L92p408n709O383N524j2851L268J5738j003j3131J100l08K033J1111
$$ 1809 2201 -5207 -10916 -4533 991 -11860 -8592 7146 6143 -6988 -5888 -6196 -4163 6948
6897F948k725k53M179j322q791j6883j573l922O707J2401l00r198L953R089o398
$$ 6948 4223 3970 8149 6827 -1964 -18847 -20420 -24342 -17635 -5234 -5534 -14732 -10779 -1690 -8088
6882h088K683J9169M74j1571P286l399K092P52j1236j3238L392R418j2246k62
$$ -8088 -5405 13764 14238 2667 9953 6554 8646 9398 -1838 -15076 -11684 -2266 -14512 -14774
6868a4774M497o021J3248J3123L408L331N443n270j2604j1228J6381j0312n364
$$ -14774 -10277 -16298 -3050 10073 13481 16812 22255 16985 4381 -6847 9534 -778 -6142
6855f142J1901j59j0644P502Q483M44r902k266J063l410o840K17r358j4531j4587
$$ -6142 5759 5600 -5044 2458 10941 11385 1483 -783 280 -3130 -9970 -9753 -19111 -33642 -48229
6840d8229N906J4317J0954k023M618P047P017M001l979l738N124L215J9032n779
$$ -48229 -42323 -28006 -17052 -19075 -14457 -7410 -393 3608 -371 -4109 1015 4230 23262 17483
6826A7483k708J3862n071j2713o13O975J0411j3933O320K087P199O657j8103p433
$$ 17483 14775 28637 23566 10853 10240 17215 27626 13693 20013 22100 29299 35956 17853 10420
6812A0420l50o420k403j1028K320o265n560j1206m043l105J1994J7614J1207M905
$$ 10420 10070 3650 1247 -9781 -7461 -13726 -19286 -30492 -34535 -37640 -25646 -8032 3175 8080
6798H080N378n662o205j871L223J0975j7287l800M917N461n612r292J549J4764
$$ 8080 13458 7796 1591 -280 2943 13918 -3369 -7169 -2252 3209 -2403 -11695 -10146 4618
6784D618J1792l337o963r754j639P041O700n12l762j4413k696Q176J4256L199
$$ 4618 16410 13073 6110 -3644 -5283 1758 8458 7946 4184 -10229 -12925 -4749 9507 12706
6770A2706m842q130J3718J4105N721k134k937j5394j1659q03J3052k367r17k888
$$ 12706 7864 -266 13452 27557 33278 31144 28207 12813 1154 351 13403 11036 10119 7231
6756G231j5825J905K101o599l61P071O780J687j64j7995q816m194P304O495J2033
$$ 7231 -8594 -6689 -4588 -11187 -11548 -4477 2303 3990 3826 -14169 -22985 -27179 -19875 -13380 -1347
6741a347J5076o626j4529o138k47l807j5097j0701J3035K2627L802R42k05j196
$$ -1347 13729 7103 -7426 -13564 -13811 -17618 -32715 -43416 -30381 -7754 -3952 -3010 -3215 -4411
6727d411O701L677l937n589m864M210J6039j406j669J2688N356m041Q85K062k4329
$$ -4411 2290 5967 2030 -3559 -8423 -4213 11826 10420 8751 21439 26795 22754 23639 25701 1372
6712A372o326K987L306M266N590p910J744J0010j4433j5060J395P633q869k934
$$ 1372 -4954 -1967 1339 5605 11195 3285 5029 15039 606 -14454 -13059 -5426 -14295 -17229
6698a7229J5287m24j1280o539J4230m325o040K453J0914J647K180O611J1366J534
$$ -17229 -1942 -2366 -13646 -20185 -5955 -10280 -16320 -13867 -2953 -1306 874 7485 18851 20385
6684B0385m780r891l859J100J7007n072j5160n961K68J3402k854L386r7k618j515
$$ 20385 15605 5714 1855 2955 19962 14890 -270 -6231 -5963 7439 4585 7971 7874 5256 3741
6669C741M303k628j133j6673L13j83L593O584O091R592j857j119j597O60L259
$$ 3741 8044 5416 4283 -12390 -12077 -12260 -8667 -2083 4008 13600 11743 10624 9027 9687 12946
6654A2946k940k972k513l459J3112m59m876j3350j9N16J3209m753l65l158m130
$$ 12946 10006 7034 4521 1062 14174 13715 8839 -4511 -4530 -4014 9195 4442 4077 919 -3211
6639c211n431r21Q589l175p07P56R48O386j535q020o92O772j0008q215j0156J0032
$$ -3211 -8642 -9563 -974 -4149 -4856 -4100 -3152 3234 1699 -6321 -7013 -241 -10249 -18464 -28620 -18588
6623a8588K5515J1777j0647o952l053k313k756J547N884Q646j3500n012Q62K1642
$$ -18588 6927 18704 8057 1105 -1948 -4261 -7017 -5470 414 9060 -4440 -9452 -8590 13052
6609A3052j0297L390P518K94n441n276l909l330j0069p841J2733M200J634L857
$$ 13052 2755 6145 13663 13957 8516 3240 -669 -3999 -14068 -21909 -9176 -4976 -3342 515
6595E15p724L078J0046N592N26j9024j376J4962K656j4937P722O246j2131p516
$$ 515 -7209 -4131 5915 11507 12033 -6991 -8367 6595 9251 -5686 2036 8282 -3849 -11365
6581a1365K615l843J767J1971J267J3659N148n642j2635K202P371P545k486j3114
$$ -11365 -8750 -12593 -10826 1145 2412 16071 21219 15577 2942 5144 12515 20060 17574 4460
6567D460l796O769Q642m335j415j687L57n351r907Q80j2269m669J722P042Q460
$$ 4460 664 7433 16075 11740 10325 8638 8995 3644 -6263 -5383 -17652 -22321 -20599 -13557 -5097
6552e097mo8Q216k444N27j1337k802M999L182m815J3190P020L122R93m392l791
$$ -5097 -5101 -5169 3047 603 1130 -10207 -13009 -8010 -4828 -9643 3547 10567 13689 14682 10290 6499
6536F499o842o329q594p420q066J5612P896K423K538Q731r321j4662o791J9065
$$ 6499 -343 -6672 -15266 -22686 -30752 -15140 -7244 -4821 -2283 6448 -2873 -17535 -24326 -5261
6522e261R998m010l743l261m487m086N434j0380k428J579R373M866L712L215L867
$$ -5261 4737 727 -3016 -6277 -10764 -14850 -9416 -19796 -22224 -20645 -11272 -6406 -2694 521 4388
6507D388j754J191L228K925o394j0630l383K0K01N186j48n514k047j718L226R787
$$ 4388 2634 3825 7053 9978 3584 -7046 -10429 -10409 -10208 -5022 -5170 -10684 -12731 -14449 -11223 -1436
6491a436n304l217l952J1364M851Q425N199j9560R300J2764L623j2236j0112n502
$$ -1436 -6740 -9957 -13909 -2545 2306 10731 15930 -3630 5670 18434 22057 9821 -291 -5793
6477e793J96J0833q02O223j3621j4692j21L009L530O277m247N840J8360j736J411
$$ -5793 -5597 5236 4434 10657 -2964 -17656 -17777 -14768 -11238 -4961 -9208 -3368 14992 13256 14667
6462A4667l174J010P308l019p745M395q866m176n028P628K851O365M587K358r828
$$ 14667 11493 12503 19811 16792 9047 13442 4576 400 -4628 3000 5851 12216 16803 19161 9333
6447I333l589O226l617p008k425M754m931J970K032P0K125o632r394J128Q956
$$ 9333 5744 11970 8353 1345 -1080 3674 -1257 713 2745 2815 4940 -1692 -11086 -9958 -1002
6432a002l037L655p645k852l37J4224J938P904J3106j0288j6153L410J128n575
$$ -1002 -4039 -384 -8029 -10881 -11218 3006 4944 12848 25954 15666 -487 2923 4051 -1524
6418a524q192p204l253k236R467J0966l259M303K126Q83M590J7060k853j4760
$$ -1524 -9716 -16920 -20173 -22409 -12942 -1976 -5235 -932 1194 2077 6667 23727 20874 6114
6404F114j3184l20q437L845P752M534K551m965L863N716m665n38N066n166q897
$$ 6114 -7070 -7390 -15827 -11982 -4230 304 2855 -2110 1753 7469 2804 2266 7332 2166 -6731
6389f731r502N619J2082j619j3780N851O206P89O69J0675q42J044L36m427l328
$$ -6731 -16233 -10614 1468 -151 -13931 -8080 -1874 -1085 -416 10259 9417 10461 10797 6370 3042
6374C042j0747q635K164Q994N241j1826k9R843L544l070J2686P781n225M170q263
$$ 3042 -7705 -16340 -14176 -5182 59 -11767 -11796 -1953 1591 -1479 11207 18988 13763 17933 9670
6359I670m623K997P31J08P805q902J460l957J081j1177r039P308J5579J0503j4914
$$ 9670 5047 8044 8775 8883 16688 7786 9246 5289 6370 -4807 -13846 -6538 9041 19544 4630
6344D630q756m853J545N884q309o405J6904p90p093l740o402K706K93P640m539
$$ 4630 -4126 -8979 -7434 -1550 -9859 -16264 640 -150 -7243 -10983 -17385 -14679 -14386 -6746 -11285
6329a1285j1285O384J5279J845L044P435j6452j6214P625N426Q99m212P01M357
$$ -11285 -22570 -16186 -907 938 3982 11417 -5035 -21249 -13624 -8198 -7299 -11511 -10810 -6453
6315f453J3090k595j2757m969m09r490Q529Q60J335J1672o195q95J0330J3195
$$ -6453 6637 4042 -8715 -13684 -14093 -23583 -15054 -14194 -12859 -1187 -7382 -8277 2053 15248
6301A5248j609k099n252r44m449J0226m904K014n902j89P802R322l965L08R19
$$ 15248 13639 11540 6288 5344 895 11121 6217 8231 2329 2140 9942 19264 15299 15607 16526
6286A6526j700j80j1371n490J0235Q065R61j972n124m864N244o394j0924P279
$$ 16526 14826 14646 3275 -2215 8020 16085 17046 15074 9950 5086 10330 3936 -6988 291
6272B91r593p424J3076J3317J958j0277j5862p426L587J5918J0669L951O30r771
$$ 291 -9302 -16726 -3650 9667 11625 1348 -14514 -21940 -18353 -2435 8234 12185 12815 3044
6258C044j4669n396L925Q460L862L274j657k456R362j915K716J0777q530m586
$$ 3044 -11625 -17021 -13096 -4636 -774 2500 843 -1613 7749 5834 8550 19327 10797 6211
6244F211m975O648r210j531q043L991o085l532m593J7653J3176o812j4897j1063
$$ 6211 1236 7884 -1326 -2857 -10900 -6909 -12994 -16526 -21119 -3466 9710 2898 -11999 -23062
6230b3062R330R927k805o141M778k712m434K973P889R868O677R86O202J575p864
$$ -23062 -13732 -3805 -6610 -12751 -7973 -10685 -15119 -12146 -4257 5611 12288 13274 19476 21051 13187
6215A3187r813j0255l37o990m872Q865N514r364q085n8J2449R641J0743O913J745
$$ 13187 3374 -6881 -7218 -14208 -19080 -10215 -4701 -14065 -22150 -22208 -9759 -118 10625 17538 19283
6200A9283j0923j8856m529P938L539j2686m845J1308N952l273l236K87R48j525
$$ 19283 8360 -10496 -15025 -7087 -3548 -16234 -21079 -9771 -3819 -7092 -10328 -10041 -9093 -10618
6186a0618j0892l206J3473Q465k524k39o669K445J670P782J192j1105n739m598
$$ -10618 -21510 -24716 -11243 -2778 -5302 -5541 -12210 -9765 -8095 -313 879 -10226 -15965 -20563
6172b0563q9Q04O680q921r083Q523Q084K59n771M934l48N673J6224q622m872L646
$$ -20563 -20652 -19848 -13168 -22089 -31172 -22649 -14565 -14306 -20077 -15143 -15491 -9818 6406 -2216 -7088 -3442
6156c442j703J6450m175l666J1523L430q930p308l778J0164K559L959l326p276
$$ -3442 -5145 11305 7130 3464 14987 18417 9487 2179 -1599 8565 11124 15083 11757 4481
6142D481k325j061L444r150q671O269N067j789q405M80R689Q445k819K247K152
$$ 4481 2156 1095 4539 -4611 -13282 -7013 -1946 -3735 -12140 -11660 -1971 6474 3655 5902 8054
6127H054r969O194o42L603K718j7221m264m266P296R163r29M754j276L232j4234
$$ 8054 -1915 4279 3637 7240 9958 -7263 -11527 -15793 -8497 666 -263 4491 3215 6447 -7787
6112g787o588k248O942O454k218o040m445Q337J8586J2900j7283m512K075j653
$$ -7787 -14375 -16623 -9681 -3227 -5445 -11485 -15930 -7593 10993 23893 6610 2098 4173 2520
6098B520N334l603j1548l387O900o402m498Q862j63J5119j2365o8J6594K196j0295
$$ 2520 7854 4251 -7297 -10684 -3784 -10186 -14684 -5822 -5985 9134 -3231 -3299 13295 15491 5196
6083E196q786L199M438q87O522o99j4484J454P932k680Q642N906q351j6890j0243
$$ 5196 -3590 -391 4047 3160 9682 8983 -5501 -4047 3885 1205 9847 15753 7402 -9488 -19731
6068a9731n923O172J336R810k778l37l302j26J0142O738K319l951r496n529q061
$$ -19731 -25654 -19482 -18146 -8336 -11114 -11451 -14753 -14879 -4737 2001 4320 369 -9127 -14656 -22717
6053b2717J183Q657p81l82j5999n510R067J0912M975n21K089m281m438R543K704
$$ -22717 -21534 -12877 -13658 -14040 -30039 -35549 -26482 -15570 -10595 -11116 -9027 -13308 -17746 -8203 -5499
6038e499K375M473J308K174N784o353R482o02j1422j1635P400O371q243L304r732
$$ -5499 -3124 1349 2657 4831 10615 4262 13744 13142 1720 -9915 -2515 3856 -4387 -1083 -10815
6023a0815j886R830k848n500J175O205o438J0946J7946K468j1094k394l044r257
$$ -10815 -12701 -2871 -5719 -11219 -10044 -3839 -10277 669 18615 21083 9989 7595 4551 -4706
6009d706k312R191P458O87o798j2386K337m077J3724J5099q096j0112N807K473
$$ -4706 -7018 2173 9631 10318 3520 -8866 -6529 -10606 3118 18217 10121 9 5816 8289
5995H289m217l94m94j411Q899K249m98j5787K436k701N001o034j8466k160L861
$$ 8289 4072 3678 3184 1773 10672 12921 12423 -3364 -928 -3629 1372 -4662 -23128 -25288 -21427
5980b1427J472M419L037k447J965P553J2265q896n120L294k700L925o796J04J3690
$$ -21427 -19955 -15536 -12499 -14946 -12981 -5428 6837 -2059 -7179 -3885 -6585 -2660 -9456 -9352 4338
5965D338J3439p528j4504p250O732J4699l33j024p092K874n09o585m97L508j3479
$$ 4338 17777 10249 -4255 -11505 -4773 9926 9593 8569 1477 4351 3842 -2743 -3240 268 -13211
5950a3211K41J544J0657R395j1873p130K83n890P88J1491m735M670q365j383K266
$$ -13211 -12970 -11426 -769 8626 -3247 -10377 -10094 -15984 -15196 -3705 -8440 -3770 -12135 -13518 -11252
5935a1252n779N226N464J0438r915J0534K661M859L978N259K645n205o916o525
$$ -11252 -17031 -11805 -6341 4097 -5818 4716 7377 12236 16214 21473 24118 18913 11997 5472
5921E472j6663m039J8245O775n872j5067n479J0853N096P868o21r962L400K071
$$ 5472 -11191 -15230 3015 9790 3918 -11149 -16628 -5775 -679 7189 6568 -3394 6 2077
5907B077N291K905k399n027K556J2778q663l988n323P316p981l735O338m15o859
$$ 2077 7368 10273 7874 2847 5403 18181 9518 5530 207 7523 -458 -4193 2145 1730 -5129
5892e129K111p697q119p973K342J2115M539J3648L534L769l277o331L63l299P262
$$ -5129 -3018 -10715 -18834 -26807 -24465 -12350 -7811 5837 9371 13140 9863 3532 3895 596 7858
5877G858M120j7955j3423Q316L644J1055J0493J864o332j906m703j5110k10J9826
$$ 7858 11978 -5977 -19400 -11084 -7440 3615 14108 15972 9640 7734 3031 -12079 -12289 7537
5863G537L869J385j0097n02Q243M646j2079k665R773r03q091j6821J394J1992
$$ 7537 11406 12791 2694 2192 10435 15081 3002 337 10110 9207 1116 -15705 -14311 -2319
5849b319K590J786p90P60l897j0957k883j557J0039Q368N839m244n991O685J386
$$ -2319 271 2057 1267 2027 -1870 -12827 -15710 -17267 -7228 1140 6979 2735 -3256 3429 4815
5834D815M91N629j5065j1205M88p282N817J5944Q567K544N277j5789K101n192
$$ 4815 5306 10935 -4130 -15335 -14847 -22129 -16312 -368 8199 10743 16020 231 2332 -2860
5820b860j1769j99L00q401P119O078K832Q246N210j5218n539J341Q272l244p581
$$ -2860 -14629 -14828 -14528 -22929 -15810 -9732 -6900 1346 6556 -8662 -14201 -12860 -4588 -7832 -15413
5805a5413J1340J5744L286O394n8r126j6099n104j25L187J6741O501n626M089
$$ -15413 -4073 11671 14957 21351 21293 12167 -3932 -9036 -9161 -5974 10767 17268 11642 15731
5791A5731l931n500j8163K695O920J4886L866k266j2115O49L863l024p213o477
$$ 15731 11800 6300 -11863 -9168 -2248 12638 16504 14238 2123 2772 6635 3611 -3602 -10079
5777a0079P065L387m752P405Q096j0646o375k0028j3043J0648J3930q18k144J492
$$ -10079 -3014 373 -4379 3026 11122 476 -5899 -25927 -38970 -28322 -14392 -15210 -17354 -15862
5763a5862J972L971J1018k5607L279J6172Q773R743J4513l555k5026k7976m8K840
$$ -15862 -13890 -9919 1099 -24508 -21229 -5057 3716 13459 27972 24417 -609 -28585 -28633 -25793
5749b5793j64j129R893L928O691P478J092q818k883O187R79L234p14l862j1417
$$ -25793 -25957 -27086 -17193 -13265 -6574 904 1996 -6822 -9705 -3518 -2539 695 -19 -3881 -15298
5734a5298Q2M995L664l880J442J2289L826R50N034j6722m679L415J1385Q531q668
$$ -15298 -15216 -10221 -6557 -10437 -8995 3294 7120 8070 13104 -3618 -8297 -4882 6503 15034 6366
5719F366k1449p408J1024J883p689n344m509J1503R410Q53k137M297q308J0924
$$ 6366 -15083 -22491 -11467 -9584 -17273 -22617 -27126 -15623 -6213 -5360 -7497 -3200 -11508 -584
5705e84J3656r901j8378m92N138J0336j4892P02R831N712O840J0352O704Q23k107
$$ -584 13072 3171 -15207 -15699 -10561 -225 -15117 -14415 -4584 1128 7968 18320 25024 25847 23740
5690B3740j0283q708m692j1961o60m377J603k056N203M489J593J280q117K221
$$ 23740 13457 4749 57 -11904 -12564 -16941 -15338 -17394 -12191 -7702 -6109 -4829 -12946 -10725
5676a0725r497p588P360M906q865L965M855M101J4314K779j739n896l451l497
$$ -10725 -20222 -27810 -20450 -15544 -24409 -20444 -15589 -11488 2826 5605 3866 -2030 -5481 -8978
5662h978J8127M663l910o611n646p965M8l063K276M772L956J929k939p24P43m678
$$ -8978 9149 13812 9902 3291 -2355 -10320 -10272 -13335 -11059 -6287 -2331 -402 -3341 -4065 -3322 -8000
5646h000J6735R613o990j072m968J2981O170j7708k1733m836J3030K124r104q60
$$ -8000 8735 18348 11358 10286 5318 18299 24469 6761 -14972 -19808 -6778 -4654 -13758 -14618
5632a4618n437J345J1920J5326J1485j124j1895j8687k066J357P98k830o345J1269
$$ -14618 -20055 -18710 -6790 8536 20021 18897 7002 -11685 -13751 -12394 -11596 -14426 -20771 -9502
5618i502P150M357J344N100j717o778m068q189p005J0908k76k175J468J380L897
$$ -9502 -2352 2005 3349 8449 6732 -46 -4114 -12303 -19308 -8400 -8676 -10851 -9383 -8003 -4106
5603d106P768O535q323r624j414N322O162M314k409L40o29o637p721N965l504
$$ -4106 3662 10197 1874 -7750 -9164 -3842 2320 6634 4225 4565 3936 -2701 -10422 -4457 -7961
5588g961q79p455r771K265k794J666J2838j254M407K5508J2688P03n114q581j6073
$$ -7961 -8840 -16295 -26066 -23801 -26595 -24929 -12091 -13345 -8938 16570 29258 29961 24847 16266 193
5573A93j65l180J0902P109o314j846L962q378r312m639p510L338j4203o229N11
$$ 193 28 -3152 7750 14859 8545 6699 10661 2283 -7029 -11668 -19178 -15840 -30043 -36272 -35761
5558c5761Q980n82J1115N815Q59j542K300j0717R018J0138n705K337m4J58O429
$$ -35761 -26781 -27363 -16248 -10433 -9574 -11116 -8816 -19533 -10515 -377 -6082 -3745 -3789 -3631 2798
5543B798q041O176N089q023q970L13R2M486O48m560K512l765N012J8579K287j1888
$$ 2798 -5243 933 6022 -2001 -10971 -10658 -10566 -6080 -5432 -9992 -7480 -11245 -6233 12346 14633 2745
5527B745P453L807O307L559O671N543k837o660n154j3299j0325q857k08P839j099
$$ 2745 10198 14005 20312 23871 30542 36085 33248 26588 21434 8135 -2190 -11047 -11255 -3416 -4515
5512d515k512r00K4003L203j0770l94K302N752j6442j0649N718R690N519K059
$$ -4515 -7027 -7927 16076 19279 8509 8115 10417 16169 -273 -10922 -5204 4486 10005 12064
5498A2064o821p548o477J1290O309o562J0784l751j5404L12l923L769O726m718
$$ 12064 5243 -2305 -8782 2508 8817 2255 13039 9288 -6116 -5804 -9727 -5958 768 -3950
5484c950K682m45P740J0240K218J575M277q552k270j0369j3337N32m531r80j211
$$ -3950 -1268 -1713 6027 16267 18485 20060 24337 15785 13515 3146 -10191 -9659 -14190 -15170 -16381
5469a6381L608j201L669O39l299p583J4677J4900Q810Q710m218j1765o274j1475
$$ -16381 -12773 -13974 -10305 -9666 -12965 -20548 -5871 9029 17839 26549 22331 10566 4292 -7183
5455g183K16Q407M821o480Q821M406j2181K295J1848J3429k434r718j7204n37
$$ -7183 -6967 1440 6261 -219 8602 13008 827 3122 14970 28399 25965 16247 -957 -1494
5441a494Q225p921L745Q244p417L207P384K645q226M866j3187O967n749o810r409
$$ -1494 6731 -1190 2555 10799 3382 6589 13973 16618 8392 13258 71 7038 1289 -5521 -14930
5426a4930K117k393l882R102J0082p587j651J3679J8508q756j8377J1447J2140
$$ -14930 -12813 -15206 -19088 -9986 96 -7491 -9142 4537 23045 14289 -4088 7359 19499
5413A9499J032j2284r047J2064N009o785j1471j57J0517q514N314P662J905q30
$$ 19499 20531 8247 -800 11264 16273 9488 -1983 -2140 8377 -137 5177 12839 14744 13914
5399A3914K496j5461l661o89m011p560j5008N840l360n42J0068J686L370m093
$$ 13914 16410 949 -2712 -3401 -7412 -14972 -29980 -24140 -27500 -28042 -17974 -16288 -12918 -17011
5385a7011j876K105J357J0059J1905j2556j0757J0859Q443O755q00j3942j7003
$$ -17011 -18887 -16782 -15425 -5366 6539 -6017 -16774 -5915 2528 9283 8483 -5459 -22462
5372b2462j255J896J0856J2496o13o46m907m072O938J3140l095j1687j565j427
$$ -22462 -23717 -21821 -10965 1531 918 272 -4635 -8707 -1769 11371 8276 -3411 -4976 -6403
5358f403k718M552L927k848K479J2635O024n567J742R52P1L713k467j1816M344
$$ -6403 -9121 -4569 -642 -3490 -1011 11624 17648 12081 13823 14775 14846 18559 16092 4276 8620
5343H620L772n204P404J0083m18q252r683r966j2988o631L691k188j2294M607
$$ 8620 12392 7188 14592 24675 24257 16005 6322 -3644 -16632 -23263 -19572 -21760 -34054 -29447
5329b9447Q726J542J8176N861J4085O398j0696j0177j0324m898N511k614M132
$$ -29447 -20721 -19179 -1003 4858 18943 25341 14645 4468 -5856 -10754 -5243 -7857 -3725
5316c725J9O729M53j800L652p333P431j5617m459J879j097L56k845j65l306q858
$$ -3725 -3706 3023 3476 1676 5328 -2005 5426 -10191 -14650 -12771 -13868 -13512 -16357 -16522 -19828 -28686
5300b8686J2546Q996r94J656J490m542p267J173O621r03j2686L237N277N630O163
$$ -28686 -16140 -7144 -8138 -6482 -4992 -9534 -16801 -15628 -9007 -9910 -22596 -19359 -14082 -8452 -2289
5285b289P440J9873J963j8656n521L593m225Q049J0540M795p786k5207p865O185
$$ -2289 5151 25024 26987 8331 2810 6403 2178 10227 20767 25562 17776 -7431 -15296 -9111
5271i111Q588J363j4864M0L40n261k385K856p849O557K4103O93M736J025Q392
$$ -9111 -523 840 -14024 -13984 -13644 -18905 -21290 -18434 -26283 -19726 4377 5070 9806 10831 19223
5256A9223o595j2449n543P718j348j0122o400k413O555O508J17R772N24r992o882
$$ 19223 12628 179 -5364 2354 1006 -9116 -15516 -17929 -11374 -4866 -4749 5023 5547 -4445 -11327
5241a1327k593j318k176J3076M606j2304r465K0029j0974j1946N425k701J6410
$$ -11327 -13920 -15238 -17414 -4338 268 -12036 -21501 -1472 -12446 -24392 -18967 -21668 -5258
5228e258K3361l963r778j2186k962n72K438m692j034O473K2917Q628n70j2276
$$ -5258 18103 14140 4362 -7824 -10786 -11358 -8920 -13612 -14646 -8173 14744 23372 22802 10526
5214A0526j4455j1871k981o651J4434J3524Q53j1648J172K524o263j289J053J126
$$ 10526 -3929 -15800 -18781 -25432 -10998 2526 3379 -8269 -7097 -4573 -10836 -12125 -11072 -9946
5200i946P650J5163O20r377j1234j6386J065N831q858k265J124L864J3671O958
$$ -9946 -2296 12867 13487 4110 -7124 -23510 -22445 -16614 -25472 -27737 -26613 -22749 -9078 -2120
5186b120k582q102N676K078o445M447l754L476R789l269p022J883J1518M281k387
$$ -2120 -4702 -12804 -7128 -5050 -11495 -7048 -10802 -7326 2463 -806 -7828 -5945 5573 9854 7467
5171G467n997J4073o139N546J1735l732o610k841j4603k434J2831l044j3434j3159
$$ 7467 1470 15543 9404 14950 26685 22953 16343 13502 -1101 -3535 9296 6252 -7182 -20341
5157b0341P260K6641r997r17N362Q127J4957m436p432m117p737j013O454N757
$$ -20341 -13081 13560 3563 2646 8008 16135 31092 26656 19224 15107 7370 6357 12811 18568
5143A8568j651j4469o450j898k465N735N969M633J316j2406o833O843Q319j1083
$$ 18568 16917 2448 -4002 -5900 -8365 -2630 3339 7972 9288 -3118 -9951 -3108 5211 -5872
5129e872r470J6143r84O232J357J2797k018j2717m382j390M49j1010j325R978
$$ -5872 -15342 801 -183 6049 7406 20203 18185 5468 1086 -304 145 -10865 -12190 -2212
5115b212k518r697J274O018J1149K163j1483o686o18l477k341Q983m631J0795
$$ -2212 -4730 -14427 -13153 -7135 4014 6177 -5306 -11992 -12610 -16087 -18428 -9445 -14076 -3281
5101c281L126R618p686j2077k301p501l489K4403J2511j9270p848J3464K96l639
$$ -3281 -155 9463 1777 -10300 -12601 -20102 -23591 812 13323 -5947 -13795 -331 -35 -3674
5087c674J5793K718O885k790L604j6981k860J0465P08k776R256p514j1272J191
$$ -3674 12119 14837 21722 18932 22536 5555 2695 13160 13868 11092 20348 12834 1562 2753
5073B753K860j269O188m007m873L595k664m151j3260J680K947M026l549n926K264
$$ 2753 5613 4344 10532 6525 1652 5247 2583 -1568 -14828 -13148 -10201 -6175 -9724 -15650 -13386
5058a3386L266J4513J1156j011j311k471n955J165N684j1464j0697K186K520O086
$$ -13386 -10120 4393 15549 14538 13227 10756 4801 5966 11650 186 -10511 -8325 -5805 281
5044B81Q657p443K365k602j2163p955J1694M249O255P771K177K901m153k013j1023
$$ 281 8938 1495 3860 1258 -10905 -18860 -7166 -2917 3338 11109 13286 16187 12034 10021 -1002
5029a002j3294j2087P813J3832j7449l888L372L06O852j0491j221J0564J2283
$$ -1002 -14296 -26383 -18570 -4738 -22187 -26075 -22703 -22397 -15545 -26036 -27257 -16693 -4410
5016d410J0960j267O03p176M923j5155j0288J6645O70O546O789R688l956j4851
$$ -4410 6550 5283 5886 -1290 3633 -11522 -21810 -5165 -4495 2051 8840 18528 14572 -279
5002b79n040N699J6069r785j0980L680M43n723q355m322k604k526J1904N251L696
$$ -279 -5319 380 16449 6664 -4316 -636 -193 -5916 -14271 -18593 -21197 -23723 -11819 -6568 -2872
4987b872L60l336M105J4424n148k712J442M384m1J4713J356j2583l08k882K185
$$ -2872 -2512 -5848 -1743 12681 7533 4821 6263 10647 10606 25319 26675 14092 13784 10902 13087
4972A3087L879m371q614J001O059l733n188j4444m66J7446Q172j8734p155J163
$$ 13087 16966 12595 3981 4982 11041 7308 2120 -12324 -12790 4656 12828 -5906 -13061 -11898
4958a1898p22P414j992j0468L512J0870K552J3558R866n121k955j2769r119J2112
$$ -11898 -12620 -5206 -7198 -17666 -14154 -3284 -732 12826 22692 17571 14616 1847 -7272 4840
4944D840K1436Q836r890j5568p258L065J774l671m570o004q868J7049k925K081
$$ 4840 26276 35112 25222 9654 2396 5461 7235 3564 -1006 -7010 -15878 1171 -1754 327
4930C27J2296O547j2714q833M870M572k210j2621L17J2691l799j2956Q31R624
$$ 327 12623 19170 6456 -2377 2493 7065 4855 -7766 -7449 5242 1443 -11513 -10682 -1058
4916a058J5123r95l16j0115j1564L40P649K029o803j7562o71J0531R432P24j189
$$ -1058 14065 13070 12754 2639 -8925 -8585 -936 1093 -5710 -23272 -23943 -13412 -3980 -3256 -4445
4901d445n643J418k683l930M020J2795P018L476J3749p762p975M596n090q913
$$ -4445 -10088 -8670 -11353 -15283 -11263 1532 8550 12026 25775 18013 10038 14634 9544 631
4887F31l937J017n976K885O002J8276Q312j7965m813j0n039J257J3769q856j7860
$$ 631 -3306 -2289 -8265 -5380 622 18898 27210 9245 4432 4422 -617 640 14409 5553 -12307
4872a2307q745m023Q622K0873M349n067J3168O623n222M598l344j6728q511m818
$$ -12307 -21052 -25075 -16453 4420 8769 3702 16870 23493 18271 22869 19525 2797 -5714 -10532
4858a0532j016O828j4365n318Q439j086R086R366P439k389k958n362O325j720
$$ -10532 -11548 -4720 -19085 -24403 -15964 -17050 -7964 1402 8841 6452 3494 -1868 4457 2737
4844B737p302o548j2010L519R015N157L705P83M884m910l965n196M534j0452j3204
$$ 2737 -4565 -11113 -23123 -19604 -10589 -5432 -1727 -944 3940 -970 -4935 -10131 -5597 -16049 -29253
4829b9253l748Q884J2496j1493k257N075N280n931l025J4497J7049Q520q82j0837
$$ -29253 -33001 -24117 -11621 -23114 -25371 -20296 -15016 -20947 -23972 -9475 7574 16094 15212 4375
4815D375n876M889N315k620o543q476m481o960m22J382J1310K758M407M08j221
$$ 4375 -1501 3388 8703 6083 -460 -8936 -13417 -20377 -20799 -19417 -8107 -5349 -942 -534 -1755
4800a755m012q419M440J915q51K386Q009R001j0779m233O995l187o232n97o82
$$ -1755 -5767 -14186 -9746 -7831 -8682 -6296 1713 10714 -65 -4298 2697 -490 -6722 -7319 -8001
4785h001r41R992J1273r197j6084p805K159J7998m137P939O946o743k814k140
$$ -8001 -8942 1050 12323 3126 -12958 -20763 -18604 -606 -4743 3196 10142 3399 585 -1555
4771a555O621r49q117j3454P676J2148r681j0290r494j765j1364n804L451K4690
$$ -1555 5066 4117 -4000 -17454 -9778 2370 -7311 -17601 -27095 -28860 -40224 -46028 -42577 -17887
4757a7887J8462N018r852m790n413k146o68r50N21k488k014M362K215J5630J1877
$$ -17887 575 5593 -4259 -9049 -14462 -16608 -17276 -18226 -17705 -20193 -22207 -17845 -15630 0 11877
4742A1877p40L732j5995k4664k476p472R195J4757L077m99L91N225k493o505M313
$$ 11877 11137 14869 -1126 -25790 -28266 -35738 -26543 -11786 -8709 -9208 -8817 -3592 -6085 -12590 -8277
4727h277N587j4826r647J2815R88r232J1637J0764P81m238q934K677L128Q01L897
$$ -8277 -2690 -17516 -27163 -14348 -13360 -22592 -10955 -191 590 -3648 -12582 -9905 -6777 -5976 -2079
4712b079M347J760J0868j379m972K878n18q467j076l671o332r094j121J431n5
$$ -2079 2268 4028 14896 13517 8545 11423 10905 2438 1362 -2309 -8641 -17735 -18856 -17425 -17480
4697a7480J7230J8261j305l791l962O329M52o425j4395o881O315Q247N076m159
$$ -17480 -250 18011 16706 12915 8953 15282 15734 9309 -5086 -11967 -5652 2595 7671 3512
4683C512J341K625j462m654l708K622k130l598o044K481O191K397r383q430j953
$$ 3512 4853 7478 6016 1362 -2346 276 -1854 -5452 -11496 -9015 -2824 -427 -9810 -18240 -20193
4668b0193j646J1051J2479r68l768l454j4650n949N777P683R562M278N320j0315
$$ -20193 -21839 -10788 1691 723 -3045 -6499 -21149 -27098 -21321 -13638 -4076 202 5522 -4793
4654d793j763M672j456j4909L305R795o314r207l80J0697J9100J2358M191j3751
$$ -4793 -6556 -1884 -3340 -18249 -14944 -5149 -11463 -20670 -21050 -10353 8747 21105 25296 11545
4640A1545k0676J528j389o205J8706J641o542O810M329k674j0015j3356j0794
$$ 11545 -9131 -7603 -8992 -15197 3509 5150 -1392 5418 9747 7073 -2942 -16298 -27092
4627b7092P187J1102j591l913P220J1690j1453k0205q91k2Q447J9139L518L67
$$ -27092 -19905 -8803 -10394 -14307 -7087 4603 -6850 -27055 -27946 -27968 -19521 -382 3136 3503
4613C503j9838q202J00O106J2215J497m482j0407m562J538J4251J9248j753k052
$$ 3503 -16335 -24537 -24437 -18331 -6116 -4619 -9101 -19508 -24070 -22532 -8281 10967 9214 7162
4599G162R15j6275n022m03r898J429O396N460J60R667K930j899m433O192J26L004
$$ 7162 8077 -8198 -13220 -13623 -23521 -22092 -15696 -10236 -10076 -409 2521 622 -3811 2381 2507 5511
4583E511l361j5730p046J0157J3311m234L6N391k336k601r992j689J0516j512
$$ 5511 2150 -13580 -20626 -10469 2842 -1392 -1356 4035 1699 -902 -10894 -12583 -2067 -3579
4569c579q052Q618L27j853J0430M896L494P485n139j3958p40p756k151J5642N603
$$ -3579 -11631 -3013 -2686 -4539 5891 10787 14281 21766 16627 2669 1929 -5827 -7978 7664 13267
4554A3267q907p905o715M273Q128P535l710o51K323N304O842j9947r825K544k11
$$ 13267 4360 -3545 -10260 -5987 2141 9676 5966 5315 7638 12942 19784 -163 -9988 -7444 -7655
4539g655o909j4167J779J0563N098K645M675R113k615j572M792j6292m453P050
$$ -7655 -14564 -28731 -26952 -16389 -11291 -8646 -3971 5142 2527 955 5747 -10545 -14998 -7948
4525g948N838o617j7081P44k089o101J1039J8584L620l905J4263N407j2133l087
$$ -7948 -2110 -8727 -25808 -25064 -27153 -33254 -22215 -3631 -11 -3916 10347 15754 3621 534
4511E34J7800J4622j2870j1936M85P835K620r472j2705j4271l459M454j0133R586
$$ 534 18334 32956 20086 8150 8635 16470 19090 9618 -3087 -17358 -20817 -16363 -26496 -16910
4497a6910J8704J0498J1181j850o225n369M531P42p277L653n549l06K085q297
$$ -16910 1794 12292 23473 21623 15398 10029 14560 15302 8025 11678 6129 5823 7908 -389
4483c89l099n389N134j151J0981J535j4342m915K172R913K096j2081r656J0814
$$ -389 -3488 -8877 -3743 -4894 6087 7622 -6720 -11635 -9463 450 2546 -9535 -19191 -8377
4469h377n251Q651J2419J2699P108p654j5165n821M264j0824j851O986Q187O93
$$ -8377 -13628 -4977 7442 20141 27249 19595 4430 -1391 2873 -7951 -9802 -2816 5371 6064
4455F064K128J6636r78l297j6380j2081j3273J0383J5799m613n989n504N646J0008
$$ 6064 8192 24828 23850 20553 4173 -7908 -21181 -10798 5001 388 -5601 -11105 -5459 4549
4441D549R2K008M125n863j1513k578N90J1126L052j2093n911J783N245p860p570
$$ 4549 4641 6649 10774 4911 -6602 -9180 -8590 2536 5588 -6505 -12416 -10633 -5388 -13248 -20818
4426b0818J4890J6511J32r485L517N112m296o699q310j0852N597j083J0899J1625
$$ -20818 -5928 10583 10715 1230 4747 9859 5563 -1136 -9446 -20298 -14701 -15784 -4885 6740
4412F740q510j1698j1174J1229J9043K784j4169j3926J568J1868J5278K888j1598
$$ 6740 -1770 -13468 -24642 -13413 5630 8414 -5755 -19681 -18113 -6245 9033 11921 323
4399C23J188l550K275m344p273q144j3964J2931R645L16J2856M739n235j1614
$$ 323 1511 -2039 236 -4108 -11381 -19525 -33489 -20558 -10913 -10597 2259 6998 1763 -9851
4385i851J1258Q609P150O649j854j492m09P736Q344j1020m334j9772j2484N766
$$ -9851 1407 10016 17166 23815 21961 20469 20060 27796 36140 25120 20786 1014 -11470 -5704
4371e704J6559J693j0600J0560Q677j0506K28J1921L810j4987j2193M574L256
$$ -5704 10855 12548 1948 12508 21185 10679 10907 22828 26638 11651 -542 4032 7288
4358G288J915n506p103J3642J0553r707j3085j3249r74P477M539j4588m793N947
$$ 7288 9203 3697 -3406 10236 20789 11082 -2003 -15252 -16226 -8749 -4210 -18798 -23591 -17644
4344a7644K080m04J0837l021O114q020p879j1135K752J7922J2956N823l479M991
$$ -17644 -15564 -15968 -5131 -8152 -2038 -10058 -17937 -29072 -26320 -8398 4558 10381 6902 11893
4330A1893q228j2623j2410j340M912L719J2456O652j519J310Q967n838q853j1219
$$ 11893 3665 -8958 -21368 -22708 -17796 -14077 -1621 5031 3512 4822 13789 7951 -902 -12121
4316a2121j2957k754J0676J4205p350j767K586N508Q580K599K203k061j7958r680
$$ -12121 -25078 -27832 -17156 -2951 -10301 -12068 -9482 -3974 4606 7205 9408 7347 -10611 -20291
4302b0291n755M972O521k710M176N748Q510M223j6031m274J3150M669m217m206
$$ -20291 -26046 -21074 -14553 -17263 -13087 -7339 1171 5394 -10637 -14911 -1761 2908 -1309 -5515
4288e515n62K956o180k017P88j145m716L740P44J730n722n304o230J3704N742
$$ -5515 -6077 -3121 -9301 -11318 -10530 -11675 -16391 -12651 -11907 -10177 -15899 -21203 -27433 -13729 -7987
4273g987k775j1647J233J6587N593K226j468m342N073J1157N055j430q229m98
$$ -7987 -10762 -22409 -21176 -4589 1004 3230 1762 -2580 2493 13650 18705 17275 9046 8548
4259H548Q644M29j044k1783q174q483q145R126K223J513Q075O206Q379l371k569
$$ 8548 17192 17621 16577 -5206 -13380 -21863 -30008 -20882 -18659 -17146 -9071 -2865 5514 2143 -426
4244d26r49O933K387J0348J1023p763q799o33Q968j507j0179j1594K165r13q453
$$ -426 -1375 5558 7945 18293 29316 21553 12754 12121 21089 19582 9403 -2191 -26 -939 -9392
4229i392Q193R716k200l706j4363n131J4198Q835l828q701L275m733L085o315
$$ -9392 -1199 8517 6317 2611 -11752 -16883 -2685 6150 2322 -6379 -3104 -7837 -4752 -11067
4215a1067j4080k31K919J005R126J6573n434j4080J342O653o13l188j098q265
$$ -11067 -25147 -25378 -22459 -21454 -12328 4245 -1189 -15269 -13927 -7274 -7887 -11075 -12173 -20438
4201b0438m834J3988J4744J226k416j3589m645n032m948N6o15N004Q757J5039
$$ -20438 -25272 -11284 3460 4686 2270 -11319 -15964 -20996 -25944 -25888 -26503 -21499 -12742 2297
4187B297J0681l873l086Q186m311n411j0321N280K523k554n411P649M850L091
$$ 2297 12978 9105 6019 14205 9894 4483 -5838 -558 1965 -589 -6000 1649 6499 9590
4173I590j083m798o063q555j0423p13M871J5520M172P436j5154K028j2126p835
$$ 9590 8507 3709 -2354 -10909 -21332 -22045 -17174 -1654 2518 9954 -5200 -3172 -15298 -23133
4159b3133Q634M431Q21l966j709M150Q610J6427n339j0547k1239L717K11N066
$$ -23133 -14499 -10068 -9247 -13213 -14922 -10772 -2162 14265 8926 -1621 -22860 -19143 -18932 -13866
4145a3866N385N093l622J38Q701O821M223N959j0007m616j0564l122P152j3161
$$ -13866 -8481 -3388 -7010 -6872 1829 8650 12873 18832 8825 4209 -6355 -9477 -2325 -15486
4131a5486j019q274N122N24r962J1707J0032J1297P329p650k658O435m257J1132
$$ -15486 -16505 -24779 -19657 -19133 -29095 -17388 -7356 3941 11270 3620 962 7397 3140 14272
4117A4272R514q338r900K680L28l844k70K603o152p430p381O608K6254K46j5326
$$ 14272 23786 15448 5548 8228 8556 4712 4442 7045 893 -6537 -13918 -7310 18944 19190 3864
4102C864p878j0080J0815J2855r709k0140m942J9937R499J8351J2310r574p041
$$ 3864 -4014 -14094 -3279 9576 -133 -20273 -25215 -5278 4221 22572 34882 25308 18267
4089A8267k255k1542j90m762J422P299O364M552o309n915k349K791J2759j099
$$ 18267 16012 -5530 -5720 -10482 -9060 -1761 4603 9155 2846 -3069 -5418 -2627 10132 9033
4075I033n082N115l629j2394o537r520m753j193J8477J1303n365j5554M221q551
$$ 9033 3951 9066 5437 -6957 -13494 -23014 -27767 -28960 -10483 820 -4545 -20099 -15878 -24429
4061b4429J987R271L354N071Q790j1366l726P712k429L27l868j833J0735n360
$$ -24429 -22442 -13171 -9817 -4746 4044 -7322 -11048 -3336 -5765 -5438 -9306 -11139 -404 -5764
4047e764P376J3476m176l831K320L506J680o453K132P66j0457r513N068K335J745
$$ -5764 1612 15088 10912 7081 9401 12907 14587 8134 10266 11032 575 -8938 -3870 -1535 210
4032B10O435M280M353L599j3803r06L060m798m587q44o169L030k140N102P886
$$ 210 6645 10925 15278 18877 5074 4168 7228 2430 -2157 -3001 -9170 -6140 -8280 -3178 4708
4017D708k896j0066J0704J0935j074K971l487l609r952l064M813l93k836j080
$$ 4708 1812 -8254 2450 13385 12311 15282 11795 8186 -1766 -4830 -17 -410 -3246 -4326
4003d326L614M479M517r634j278N173j719q828r572q010P460O330q16K06N097
$$ -4326 -712 3767 8284 -1350 -2628 2545 826 -8002 -17574 -25584 -18124 -11794 -12610 -12404 -7307
3988g307M077j0671m088M720Q022j30l732K344Q147O571p996n089p800k273N067
$$ -7307 -3230 -13901 -17989 -13269 -5247 -5377 -9109 -6765 1382 7953 -43 -5132 -12932 -15205 -10138
3973a0138j984o89j0978j836J6903O680r364j7943R140J6337k2J878J0102P620
$$ -10138 -12122 -12811 -23789 -25625 -8722 -2042 -11406 -29349 -20209 -3872 -3894 -2016 8086 15706
3959A5706k765M320J2183j289m837j5453j5900J245L644j5105L981N143O131J0935
$$ 15706 12941 17261 29444 28155 23318 7865 -8035 -6790 -3146 -18251 -14270 -9127 -2996 7939
3945G939O944j006N040l837j828q79m015m215q178n896j246j0366j871J0643M297
$$ 7939 14883 13877 18917 15080 13252 12373 8358 4143 -4035 -9931 -11177 -21543 -23414 -12771 -8474
3930h474L800j189R113L9p495K599L113J3179j332p273l611j227m541J0769N686
$$ -8474 -4674 -5863 3250 3289 -4206 -1607 1506 14685 13353 6080 2469 1242 -3299 7470 13156
3915A3156r749j3900o40k535l418Q918P580L941o123P201j2401J939q521n098
$$ 13156 3407 -10493 -11133 -13668 -17086 -8168 -588 3353 -2770 4431 -7970 -6031 -14552 -19650
3901a9650M855o460r131P778M47J1080J0291j2323m62n12l809l335J0266O450
$$ -19650 -14795 -21255 -30386 -22608 -22161 -11081 -790 -13113 -13575 -14087 -17896 -21231 -10965 -4515
3887d515O48p527j2171m700J0115K458j203M653Q538l427n128k243m076j121m458
$$ -4515 -3867 -11394 -23565 -28265 -18150 -15692 -16895 -12242 -3704 -7131 -12259 -14502 -18578 -19699 -24157
3872b4157q504J4929J1856j353j74L357j047p731m63J6451j0899j1272l419O216
$$ -24157 -32661 -17732 -5876 -7229 -7403 -4046 -5093 -12824 -13287 3164 -7735 -19007 -22426 -16210
3858a6210R949l149j0398l16J4122k440O783p694m071m663O469P863j4670k909
$$ -16210 -6261 -9410 -19808 -20124 -6002 -8442 -1659 -9353 -13424 -18087 -11618 -3755 -18425 -21334
3844b1334j491p168M619N969K597l216N205J2089O208Q603m410r869P483N907
$$ -21334 -22825 -29993 -25374 -19405 -16808 -20024 -14819 -2730 3478 12081 7671 -2198 5285 11192
3830A1192K851p539O315q158j161j8660m70K898K459M177j2550j382J1139K534
$$ 11192 14043 6504 12819 4661 3500 -15160 -15630 -12732 -10273 -6096 -18646 -20028 -8889 -6355
3816f355n736J2346L49k136N685N209K589K298p404p286j9211o402R708P382M355
$$ -6355 -12091 255 604 -1532 4153 9362 11951 14249 6845 -441 -19652 -26054 -16346 -8964 -4609
3801d609J2112M448j6369j3816r731j0710M92N522J3222N426J8892R562N846N928
$$ -4609 7503 11951 -4418 -18234 -27965 -38675 -38183 -32661 -19439 -14013 4879 14441 20287 26215
3787B6215l110k0690j066J151o722o782Q774k205p878r659kj02N456Q209O491
$$ 26215 23105 2415 1349 2500 -4222 -11004 -2230 -4435 -12313 -21972 -21974 -22076 -16620 -8411 -1920
3772a920q563l980L308N896j1693n472R420K0741J014O10j454j4521L31k560j4409
$$ -1920 -10483 -14463 -11155 -5259 -16952 -22424 -13004 7737 8751 9361 7907 -6614 -6283 -8843 -23252
3757b3252k970L145K111P275m801J1036L530k263L99M060l531O406m549J817n446
$$ -23252 -26222 -23077 -20966 -13691 -18492 -7456 -3926 -6189 -5790 -1730 -5261 1145 -3404 -1587 -7033
3742g033n544J2751J6135M954j0644j3578Q856L641j5088o765R046p146n169n4
$$ -7033 -12577 174 16309 21263 10619 -2959 5897 9538 -5550 -12315 -3269 -10415 -15584 -15638
3728a5638m010k989j784L353P377N886M982J0499J4564o502n173o959k585q05
$$ -15638 -19648 -22637 -24421 -21068 -13691 -7805 -2823 7676 22240 15738 10565 3606 1021 216
3714B16R494q841j0030Q256R356K0259L810j9857j1652K62r575P605J4418n277
$$ 216 9710 869 -9161 -905 8451 28710 32520 12663 1011 1273 -8302 -697 13721 8444
3700H444j335O960j637n796p103K380k878j35J543k427J356O215J323p898j5717
$$ 8444 7109 14069 12432 6636 -467 1913 -965 -1100 443 -1984 -628 5587 6910 -988 -16705
3685a6705N810K098P074R155j5186r450k956J531J5378J869N423N932j2552j371
$$ -16705 -10895 -8797 -1723 7432 -7754 -17204 -20160 -18629 -3251 -1382 4041 9973 -2579 -3950
3671c950N65O156J3951o505j5868j4213J421j144J6901J1684m313j414n951l307
$$ -3950 -3385 2771 16722 10217 -5651 -19864 -18443 -19587 -2686 8998 4685 3271 -2680 -5987
3657e987J4652n796q468l688M561l825n192o115o05J5638Q635N402o853n637J0647
$$ -5987 8665 2869 -5599 -9287 -4726 -8551 -13743 -19858 -20463 -4825 3810 9212 2359 -3278 7369
3642G369M324L629Q187n388j6073j0653o377J1305L131Q376p684r048M119m480
$$ 7369 11693 15322 23509 18121 2048 -8605 -14982 -3677 -546 7830 146 -8902 -4783 -9263
3628i263q596p965P292J1154j484l129J391o931P015L983m036Q385L868r139P082
$$ -9263 -17859 -25824 -18532 -7378 -8862 -11991 -10600 -17531 -10516 -6533 -10569 -2184 1684 -7455 -373
3613c73O996L33L244q261j6283j0382J48K1532J2548O94J0466j2344j1012O35
$$ -373 6623 6956 10200 1939 -14344 -24726 -24578 -3046 9502 10196 20662 8318 -2694 -2059
3599b059j592m75J1030N741j8671M427J0820R322l415j0006j6236p997k979j3590
$$ -2059 -3651 -4126 6904 12645 -6026 -1599 9221 18543 15128 5122 -11114 -19111 -22090 -35680
3585c5680N832P355P498Q686K739j088q76j2428K136M143K638P432o340l227k966
$$ -35680 -29848 -22493 -14995 -6309 -3570 -4658 -5534 -17962 -15826 -11683 -9045 -1613 -7953 -11180 -14146
3570a4146J0117r728n352m254J1321J9532Q673k0463Q2O868o402o016P50M674
$$ -14146 -4029 -13757 -19109 -23363 -12042 7490 16163 -4300 -4218 2650 -3752 -9768 -9018 -4344
3556d344L254n215q47J0294K4167K186r051K024n733j5788q343o494P337K925
$$ -4344 -1090 -6305 -7152 3142 27309 29495 20444 22468 16735 947 -7396 -13890 -6553 -3628
3542c628k847M750P803k750r032J4515J903j1295k224l208O755J7571N921j0728
$$ -3628 -6475 -1725 6078 3328 -5704 8811 10714 -581 -2805 -6013 742 18313 24234 13506
3528A3506l413M200k034m776j043R068q013L588r975j1776R832L441O697o839
$$ 13506 10093 14293 12259 7483 6440 15508 7495 11083 1108 -10668 -836 2605 9302 2463
3514B463n397k652J2223L746j9474M332N706M961R240M741r076k0690j5510J983
$$ 2463 -2934 -5586 6637 10383 -9091 -4759 947 5908 15148 19889 10813 -9877 -25387 -23404
3500b3404J021p727j4750Q824P435p51k711K594P610l535k4J7427J2841P961O397
$$ -23404 -22383 -30110 -44860 -36036 -28601 -29352 -32063 -29469 -21859 -25394 -25418 -7991 4850 12811 19208
3485A9208m133p399p682L76M749R054k467N075l924m188j0508r034O517J3325
$$ 19208 15075 7676 -6 370 5119 14173 11706 16781 12857 8669 -1839 -10873 -4356 8969
3471H969j2266J480R005m344L241Q868O75j771M148j036k813l457k8038R02M753
$$ 8969 -3297 -1817 7188 2844 6085 14953 15628 13857 18005 16969 14156 10699 -17339 -16437 -11684
3456a1684j68k010K625n358p622o791K936K612P408L204M830P273J874o127L740
$$ -11684 -11852 -13862 -11237 -16595 -24217 -31008 -28072 -25460 -18052 -14848 -10018 -2745 -871 -6998 -3258
3441c258n054J628j620j2416j0694K0411k14N260L760M355J0271L840n883o110
$$ -3258 -8312 -6684 -8304 -20720 -31414 -11003 -11217 -5957 -2197 2158 12429 16269 10386 4276
3427D276J2219N723J53k230n200l678n032j3417n414j703O057M310n675k835Q096
$$ 4276 16495 22218 22371 20141 14941 11263 6231 -7186 -12600 -14303 -8246 -3936 -9611 -12446 -4350
3412d350m382k224O970O4j111K115m934M776L489m071r72l640R037O88q573M96
$$ -4350 -8732 -10956 -3986 -3922 -5033 -2918 -7852 -3076 413 -3658 -4630 -8270 767 1455 -7118 -6622
3396f622M572N565M844O623m052j089M436M688l161j3388m498j297o837Q622m907
$$ -6622 -2050 3515 8359 14982 10930 9841 14277 18965 15804 2416 -2082 -3379 -10216 -1594 -6501
3381f501Q326J974q737j1527J3409n54j8740K726O925K0939L97m986k228j0747
$$ -6501 1825 3799 -4938 -16465 -3056 -3610 -22350 -19624 -12699 8240 8637 3651 1423 -9324
3367i324j1630O163L318p057p888L618Q459Q915L788J3459R426n550q023p622
$$ -9324 -20954 -14791 -11473 -18530 -26418 -22800 -14341 -5426 -1638 11821 21247 15697 7674 52
3353E2m748N021J387M86O503j367j3916K618O693P291L467Q039j3626p651k073
$$ 52 -4696 325 1712 2198 8701 7334 -6582 -3964 2729 10020 13487 21526 7900 249 -1824
3338a824L953M90M588N576R682j595l15l136P688m770o411j2426M694q047m741
$$ -1824 2129 2619 7207 12783 22465 20870 20555 17419 25107 20337 13926 1500 6194 -1853 -6594
3323f594P140K708P887P121n622k3943L085m401m738P330Q679j837M570Q715P269
$$ -6594 546 3254 11141 18262 12640 -11303 -8218 -12619 -17357 -10027 -1348 -3185 1385 10100 17369
3308A7369k629j1977j0393j8416M526K0797K2659N514j1802k2429p239L845R28
$$ 17369 14740 2763 -7630 -26046 -21520 -723 21936 27450 15648 -6781 -14020 -10175 -9247
3295i247j1681j5504k597j1479M648K972K2919M415l967k792o046R781J450O869
$$ -9247 -20928 -36432 -39029 -50508 -45860 -42888 -19969 -15554 -19521 -22313 -28359 -18578 -17128 -10259
3281a0259P304L172L042j706R575p12j833m094L457k409J794J3684O01j4606j0114
$$ -10259 -2955 217 3259 1553 11128 10416 8583 4489 7946 5537 7331 21015 21616 7010 -3104
3266c104r397j7515j196J3990k709K353N892J2369J4586J2101j0478j0951R906
$$ -3104 -12501 -30016 -31212 -17222 -19931 -17578 -11686 683 15269 27370 16892 5941 15847
3253A5847m20K65p412j3381J1898j927j0793M61O596O688L501M945q113r674l880
$$ 15847 15427 15692 8280 -5101 6797 4870 -5923 -5462 1134 7822 11323 16268 8155 -1519 -5399
3238e399o273q112k672J2519J121l246j1715J0845R137J0358J200r011n934o30
$$ -5399 -11672 -19784 -22456 -9937 -8816 -12062 -23777 -12932 -3795 6563 7763 -1248 -7182 -7812
3224g812P972L493Q052j1562m196J1434K890O847N899r96r717l135M856l760m000
$$ -7812 160 3653 11705 143 -4053 7381 10271 17118 23017 22021 12304 9169 14025 10265 6265
3209F265N916j518n386N411p001l069j8800r610O668Q948L567P38p929o880P072
$$ 6265 12181 10663 5277 10688 3687 618 -18182 -27792 -21124 -12176 -8609 -7871 -15800 -22680 -15608
3194a5608P989K766p806l289O817k441l761o86l655N273K410R462M154N781j1013
$$ -15608 -7619 -4853 -12659 -15948 -9131 -11572 -15333 -16019 -19674 -14401 -11991 -2529 1625 7406 -3607
3179c607j6622J918J5425J0024l037m98P31j0299j4724J578J6092Q393J0203j308
$$ -3607 -20229 -18311 -2886 7138 4101 3603 4334 -5965 -20689 -19111 -3019 5374 15577 14269
3165A4269o372l140J09P997J0479q362j9076l986J7667R853q950J792k554P14
$$ 14269 7897 4757 4866 12863 23342 14980 -4096 -8082 9585 19438 10488 12280 9726 10440
3151A0440j0843k201j2487r09R154j943n142J729m854L669j310n209j939M025
$$ 10440 -403 -2604 -15091 -16000 -6846 -8789 -13931 -12202 -17056 -13387 -14697 -19906 -21845 -17820
3137a7820O909K0251J0265m912j3599q525J5069j071k882j219m348P378p227L102
$$ -17820 -10911 9340 19605 14693 1094 -7431 7638 6567 3685 2466 -1882 5496 -1731 1371
3123A371O053k399r365j1815N105M430P476k199j1249J6361J1001n169j49j4444
$$ 1371 7424 5025 -4340 -16155 -11050 -6620 856 -1343 -12592 3769 14770 9601 9452 -4992
3109d992Q52J1560N365j2626n166J803M654j317r474j734J1848Q589P399o851
$$ -4992 -4140 7420 12785 159 -5007 -3204 1450 133 -9341 -11075 773 9362 16761 9910
3095I910M818N913J786K925o165p009n141p569R493P632j5390k091O232K733Q541
$$ 9910 14728 20641 22427 25352 19187 12178 7037 -532 8961 16593 1203 -888 5344 8077 16618
3080A6618j5994n220J2049k15p344j1883P904Q667m336O966N276m551r438q055
$$ 16618 624 -4596 7453 7238 -106 -11989 -4085 4582 246 7212 12488 7937 -1501 -9556
3066i556j3005K484P701J750J745P191R191J154l701k21j445r543K081O154J3538
$$ -9556 -22561 -20077 -12376 -10626 -8881 -1690 7501 8655 4954 4733 3288 -6255 -4174 1980 15518
3051A5518j1066k608R211J2946j5182n951j2383J1608N123M486j3496N971K0112
$$ 15518 4452 1844 11055 24001 8819 2868 -9515 2093 7216 11702 -1794 4177 24289
3038B4289L483j8216r542O38L027l49P04J0626O17n574j3029m606J1846N682o960
$$ 24289 27772 9556 14 652 3679 3330 4034 14660 15277 9703 -3326 -7932 3914 9596 2636
3023B636o789j642J0265M925j821K198M522j2839j0114q069N370j751j283J2134
$$ 2636 -4153 -5795 4470 9395 7574 9772 14294 1455 -8659 -16728 -11358 -13109 -14392 -2258
3009b258J6346J3297Q775o764j9471j4162J220K191J1587O520m897j1052J796
$$ -2258 14088 27385 36160 29396 9925 -4237 -3017 -826 10761 17281 12384 1332 3128
2996C128m379M948J0700j2039j7499J7254J4267n119j244j367j4701m578J5166
$$ 3128 -1251 3697 14397 2358 -15141 2113 16380 11261 10017 8650 -6051 -10629 4537
2983D537J2497L139j4307o170J847j2271j6568L965P202P003l38J149L3m691J4991
$$ 4537 17034 20173 5866 -304 1543 -10728 -27296 -23331 -16129 -9126 -9464 -8315 -8282 -12973 2018
2968B018m037L193j0576j1545J2120J307p753J000l208O337M389p146N504J3272
$$ 2018 -2019 1174 -9402 -20947 -8827 -7520 -15273 -14273 -17481 -11144 -6755 -13901 -8397 4875
2954D875M15j0432N369M275j2253M483J7207N045j2228m867n800q755P151K138
$$ 4875 5290 -5142 227 4502 -7751 -3268 13939 18984 6756 1889 -3911 -12666 -5515 -3377
2940c377q043k905n661O282M503j5050m51J4145R929P731N86Q828j077m371L88
$$ -3377 -11420 -14325 -19986 -13704 -9201 -24251 -24702 -10557 -628 7103 7689 16517 15440 11069 11457
2925A1457j059Q875j1158J18k243M212L185J196J23l352j0812j4262l19J3589
$$ 11457 10398 19273 8115 8233 5990 10202 13387 14583 14706 11354 542 -13720 -14039 -450
2911d50J217k532k753K729J4771j297J008J553j0135o146N479N651j460M080J981
$$ -450 767 -1765 -4518 -1789 12982 11685 12693 14246 4111 -2035 3444 9095 7635 11715 13696
2896A3696j0914j1648o207R995J1518l755O8N946M425j3716Q41J059J6683j5356
$$ 13696 2782 -8866 -15073 -5078 6440 2685 2753 8699 13124 -592 249 1308 17991 2635
2882B635j2443j2767m44J369j345P83k215n490n894q29J3198n345m636R315K748
$$ 2635 -9808 -22575 -23019 -21650 -22995 -22212 -24427 -29917 -35811 -36640 -23442 -28787 -33423 -24108 -21360
2867b1360O741K296O106p807n145M783J5231q37O416K242o047p176j324O86n611
$$ -21360 -14619 -12323 -6217 -14024 -19169 -14386 845 8 6424 8666 2619 -4557 -5881 -5195 -10806
2852a0806o162P032J2707n796q327m32N892o758q122M527J775N215k353O113n861
$$ -10806 -16968 -9936 2771 -3025 -11352 -11784 -5892 -12650 -20772 -16245 -14470 -9255 -11608 -5495 -11356
2837a1356j800P41J1616o267k432k521L354J0942R177m432P414n943p37N942l399
$$ -11356 -13156 -12415 -799 -7066 -9498 -12019 -8665 2277 11454 7022 14436 8493 7756 13698 10299
2822A0299K409K484K575o580j3667M179J042L958k793K409O043j3530o788N888
$$ 10299 12708 15192 17767 11187 -2480 1699 2741 6699 3906 6315 12358 -1172 -7960 -2072
2808b072l73p683r312o055J0317Mq575o465P972J5390J113l588m507M702M800
$$ -2072 -2445 -10128 -19440 -25495 -15178 -15174 -23749 -30214 -22242 -6852 -5739 -9327 -13834 -9132 -4332
2793d332n379r018l82M957Q32J632k275K136O121M368m877M822O778J122p741
$$ -4332 -9711 -18729 -19111 -14154 -13322 -11690 -13965 -11829 -5708 -1340 -6217 -1395 5383 6505 -1236
2778a236K918O277o815j5448j720m951l123O732J0834R403l687n500p0r814l233
$$ -1236 1682 7959 1144 -14304 -16024 -20975 -24098 -17366 -6532 2871 -816 -6316 -6386 -16200 -19433
2763a9433J1221J1487j382r59n971N808o228j5419O97J0434M269p700O50J1061
$$ -19433 -8212 3275 1893 934 -5037 771 -5457 -20876 -20179 -9745 -5476 -13176 -12526 -1465
2749a465J2593J8457J0341k4064k0720M84K141k620J9382Q072r739j0825n907
$$ -1465 11128 29585 39926 15862 -4858 -4374 -2233 -4853 14529 22601 12862 2037 -3870
2736c870q318O265R148m021l711J3798K0103J2871n905q848l80j5460O63K920
$$ -3870 -12188 -5923 3225 -796 -4507 9291 29394 42265 36360 27512 27132 11672 12335 15255
2722A5255j0138o884J2691l561r544n131O951K827m164J440K260j5883K0J3191
$$ 15255 5117 -1767 10924 7363 -2181 -7312 -361 2466 -1698 -258 2002 -13881 -13861 -670
2708f70Q272P094P96m448J90M362J013j1601j5521N490J1477J347J598N506M78
$$ -670 7602 14696 15492 11044 11234 15596 16609 5008 -10513 -5023 6454 7801 9399 14905 15383
2693A5383j1466j2505j2096M063J5101P635J130o646m99k246r542K46l726M609
$$ 15383 3917 -8588 -20684 -16621 -1520 6115 7245 599 100 -2146 -11688 -11442 -15168 -10559
2679a0559Q14J1490J3975R624j2166q310m400j919p21P554m454j696L386J449
$$ -10559 -9745 1745 15720 25344 13178 4868 468 -1451 -2172 5382 928 -768 2618 4067
2665D067K855m039p39O798k634n059o388K613q54j0338J143j434j414O93n958
$$ 4067 6922 2883 2144 8942 6308 1249 -5139 -2526 -3380 -13718 -12575 -14009 -15423 -14730 -20688
2650b0688o535R746J5167J642K472L823j5345Q469J2236J3023r404k1243j6309
$$ -20688 -27223 -17477 -2310 -668 1804 5627 -9718 -1249 10987 24010 14606 -6637 -22946
2637b2946R992k335P39K0711R246j0831p747o014P288Q333q386j3494N536J3093
$$ -22946 -12954 -15289 -14550 6161 15407 4576 -3171 -9185 -1897 6436 -1950 -15444 -9908 3185
2623C185J2203j1516o90l921j4487M035J3111O206o048L465j69n988L789M788
$$ 3185 15388 3872 3182 -739 -15226 -11191 1920 8126 2078 5543 5374 -614 3175 7963
2609G963P758K724o566j65K245m408l986j0860j851Q098L723n293p84J703l211
$$ 7963 15721 18445 11879 11714 13959 9551 5565 -5295 -7146 952 4675 -618 -1402 301 -2910
2594b910j5750N249K257M436L81M108K0746o182l0947L871J4398n293l694K429
$$ -2910 -18660 -13411 -11154 -6718 -6337 -2229 18517 12335 -18612 -14741 -343 -5636 -9330 -6901
2580f901M147j2411j3570o73J6116J1029k451K700k784L993K34P465j9101n293
$$ -6901 -2754 -15165 -28735 -29408 -13292 -2263 -4714 -2014 -4798 -805 -571 6894 -12207 -17500
2566a7500M924K443k536N755l864j2384L624J1438J4433J940j2295q793K412Q612
$$ -17500 -12576 -10133 -12669 -6914 -10778 -23162 -19538 -8100 6333 8273 -4022 -12815 -10403 -1791
2552a791N082q109j0363j5249R137M700O550J9515J5464j4168j2235J0284R830
$$ -1791 3291 -4818 -15181 -30430 -21293 -16593 -10043 9472 24936 10768 -1467 8817 18647
2539A8647j3350k829p587n437r381m419m0K969J1232L10O212K857j268m328j863
$$ 18647 5297 2468 -5119 -10556 -19937 -24356 -24396 -21427 -10195 -9885 -3673 -816 -2084 -6412 -8275
2524h275r715j478J6441R645q544m527K769o06k436j304M222J312N363Q284R208
$$ -8275 -17990 -19468 -3027 6618 -1926 -6453 -3684 -4290 -6726 -8030 -3808 -2496 2867 11151 20359
2509B0359m589j1707j7121N528J0352Q760n360j0906K415j2724K062k859n751
$$ 20359 15770 4063 -13058 -7530 2822 11582 6222 -4684 -2269 -14993 -12931 -15790 -21541
2496b1541m343L777J0464q71P05k286K091K972L520o781K454p606k263n917J6210
$$ -21541 -25884 -22107 -11643 -12514 -11809 -14095 -12004 -9032 -5512 -12293 -9839 -17445 -19708 -25625 -9415
2481i415J0731K374J1995M837j7049l176r01o100O55M350m316q598M65J5105J3659
$$ -9415 1316 3690 15685 20522 3473 297 -604 -6704 -6049 -1699 -6015 -14613 -14148 957 14616
2466A4616l483l267k949K015j6498m908O837J1715l06m150j406M876M653Q5L991
$$ 14616 11133 7866 4917 6932 -9566 -14474 -7637 4078 3772 -378 -1784 3092 7745 7830 11821
2451A1821O469j1737o84j1267n624J3342l252j5580j077P699R923q539l489P44
$$ 11821 18290 6553 5869 -5398 -11022 2320 -932 -16512 -17589 -9890 33 -8506 -11995 -11251
2437a1251j1355Q820K0317K736j076q323L953k319N67n892o454O920J6693K408
$$ -11251 -22606 -13786 6531 9267 8191 -132 3821 1502 2069 -3823 -10277 -3357 13336 15744
2423A5744J668k20p879o839n123N307l27n185j559P970q730q909J6726O249J1999
$$ 15744 17412 17192 9313 2474 -2649 2658 2331 -2854 -4413 3557 -5173 -14082 2644 8893 20892
2408B0892J2388k877j6047j567Q675q46p262j7921j7744J4561J0538J0919M339
$$ 20892 33280 30403 14356 12789 21464 20618 13356 -4565 -22309 -7748 2790 13709 18048
2395A8048r370j6526p33k66n732N694M316J4315p994j0610j007Q777Q226l410
$$ 18048 8678 -7848 -8581 -8847 -14579 -8885 -4569 9746 1752 -8858 -9865 -1088 7138 3728
2381C728j7053j181J7468o1j1394r512P679J5118O028O589j1303j4292R98K047
$$ 3728 -13325 -14506 2962 2901 -8493 -18005 -10326 4792 10820 17409 6106 -8186 -7188 -5141
2367e141L722n430l344r54j880M105Q849M211O857M446k726j0849l57K58m993
$$ -5141 -1419 -6849 -10193 -11147 -13027 -8922 -73 4138 10995 15441 12715 1866 1509 1767 -3226
2352c226M111Q534j390o725N948j639m208K316k085n427n348o776O728m050L895
$$ -3226 885 9419 8029 1304 7252 5613 1405 3721 1636 -3791 -9139 -15915 -9187 -13237 -9342
2337i342J2022J0523n782j9783o73K951o378j253O160L153P255Q156m257R661
$$ -9342 2680 13203 7421 -12362 -13035 -10084 -16462 -17715 -11555 -8402 -1147 7009 2752 12413
2323A2413J798k509k251r755m337n114j283J6352J759J0857L121o750l22n665
$$ 12413 14211 11702 9451 -304 -4641 -9755 -11038 5314 7073 17930 21051 14301 13979 8314
2309H314K929K448l372l595o558N48l312o666k300p946J226K4501J3216n797r425
$$ 8314 11243 13691 10319 6724 166 714 -2598 -9264 -11564 -19510 -18284 6217 19433 13636 4211
2294D211k559l926J836P187j665R46p558j311K938J2596L147q344r164j235R614
$$ 4211 1652 -2274 -438 6749 5084 6030 -1528 -2839 99 12695 15842 7498 -1666 -2901 6713
2279F713J5697l391j2888q786k917l178j7408n021R056J1426J1204N048q358k467
$$ 6713 22410 19019 6131 -2655 -5572 -8750 -26158 -31179 -22123 -10697 507 5555 -2803 -5270
2265e270J3070M296j840P14O484n457j4156n92K109o711r159k03J3064O711R869
$$ -5270 7800 12096 10256 10970 17454 11997 -2159 -2751 -642 -7353 -16512 -16715 -3651 3060 12929
2250A2929M985o147o624j3891M018Q51n030l448m059Q089p091l502N408N259r41
$$ 12929 17914 11767 5143 -8748 -4730 -3879 -8909 -12357 -16416 -8327 -15418 -18920 -13512 -8253 -9194
2235i194P060J3811J57j5033p673j0102P842J0010M453m026k331p309j1461l09
$$ -9194 -2134 11677 11834 -3199 -10872 -20974 -13132 -3122 1331 -2695 -5026 -12335 -23796 -24105
2221b4105L248J0255O549p302N946J3150O522J0564J298j6110k731l699M842k986
$$ -24105 -20857 -10602 -4053 -11355 -5409 7741 14263 24827 26125 10015 7284 3585 8427 5441
2207E441n194n16K6392j959r715j1280J714k038K239M589k60j6743P976l995m98
$$ 5441 247 -269 26123 24164 14449 3169 4883 2845 5084 9673 9413 -7330 646 -3349 -3847
2192c847p37M375m867l745r217R551J2983l899j749Q826q684O069J8368j0130
$$ -3847 -4584 -209 -5076 -8821 -18038 -8487 4496 597 -1152 7674 -1010 5059 23427 13297
2178A3297r591J3530P989N70r664M693l144q017r490j2026k094J9299J194r114
$$ 13297 3706 17236 25225 25795 16131 20824 17680 9663 173 -11853 -13947 5352 6546 -2568
2164b568m957k747N139J5465N635q208Q353J2457n801m273j7768j4382K30J347
$$ -2568 -7525 -10272 -5133 10332 15967 7759 16112 28569 22768 18495 727 -13655 -13425 -12078
2150a2078M5N140K123O577O949j389j0537o569O539J9339m85J249R446n05o155
$$ -12078 -12033 -6893 -4770 1807 8756 7367 -3170 -9739 -3200 16139 15654 16903 26349 25844 19689
2135A9689j5101J696j550L113L868j0068p895K485J4961O013J0274M620j6702
$$ 19689 4588 6284 4734 7847 11715 1647 -6248 -3763 11198 17211 27485 32105 15403
2122A5403r927R025J6914l412j7422J749K118j0765j84K943P999P721l000k0046
$$ 15403 5476 14501 31415 28003 10581 12330 14448 3683 3499 6442 14441 22162 19162 -884
2108h84q769Q406P705R188K243k309m545n957J253N400q303j2440M182J3197L344
$$ -884 -9653 -1247 6458 15646 17889 15580 11035 5078 6331 11731 3428 -9012 -4830 8367 11711
2093A1711j5177p536M661L808j231n652O438j4460L019L1109J2465p708j4954
$$ 11711 -3466 -11002 -6341 -2533 -3764 -9416 -2978 -17438 -14419 16690 29155 21447 6493
2080F493O47q160J338R90J909P513o500j0548R340J1659j1097o902l174J4444
$$ 6493 7140 -1020 318 1308 3217 10730 4230 -6318 3022 14681 3584 -3318 -6492 7952
2066G952K007j2058p183m951J5003R374o157j6606K432N08m174k459R83K514J6936
$$ 7952 9959 -2099 -9282 -14233 770 10144 3987 -12619 -10187 -9679 -13853 -16312 -15329 -12815 4121
2051D121R700q262o569o53o698n80R955m879l134Q717n05l872p090k784K0405
$$ 4121 13821 5559 -1010 -1663 -8361 -8941 1014 -3865 -6999 1718 1213 -2659 -9749 -12533 7872
2036G872O15r195J150p30Q231m236m834P017O482m058j1105o385p033R804J7400
$$ 7872 8487 -708 442 -288 7943 3707 -1127 5890 12372 8314 -2791 -9176 -16209 -6405 10995
2021A0995N754J5292n825l079J0478J3134N217o922j6839j7819j6994l775K059
$$ 10995 16749 32041 26216 23137 33615 46749 51966 45044 28205 10386 -6608 -10383 -8324
$$ [...]
##END NTUPLES=NMR SPECTRUM
##END=
