##TITLE=Analysis number 327267
Compound Code cc 62710
Book Reference 494/132
Project Code adrs
Chemist Name craigr
##JCAMPDX= 6.0         $$ Bruker NMR JCAMP-DX V2.0
##DATA TYPE= NMR SPECTRUM
##DATA CLASS= NTUPLES
##ORIGIN= Bruker BioSpin GmbH
##OWNER= nmr
$$ XWIN-NMR		Version 3.5
$$ Mon Mar 19 09:52:21 2007 GMT Standard Time (UT+0h)  MAYBRIDGE\nmr@NMR_250MHZ
##.OBSERVE FREQUENCY= 250.131544655141
##.OBSERVE NUCLEUS= ^1H
##.ACQUISITION MODE= SIMULTANEOUS (DQD)
##.ACQUISITION SCHEME= undefined
##.AVERAGES= 16
##.DIGITISER RES= 18
##SPECTROMETER/DATA SYSTEM= dpx250
##.PULSE SEQUENCE= zg30
##.SOLVENT NAME= CDCl3
##.SHIFT REFERENCE= (INTERNAL, CDCl3, 0, 16.522)
##AUDIT TRAIL= $$ (NUMBER, WHEN, WHO, WHERE, WHAT)
$$ ##TITLE= Audit trail, XWIN-NMR		Version 3.5
$$ ##JCAMPDX= 5.01
$$ ##ORIGIN= Bruker BioSpin GmbH
$$ ##OWNER= nmr
$$ C:\u/data/dgb/nmr/ADRS/1150/pdata/1/auditp.txt
$$ ##AUDIT TRAIL=  $$ (NUMBER, WHEN, WHO, WHERE, WHAT)
(   1,<2007-03-19 09:51:53.89 +000>,<MAYBRIDGE\nmr>,<NMR_250MHZ>,
      <created by zg, POWCHK disabled, PULCHK disabled
       configuration hash MD5:
       49 4B E0 1D 92 C2 6B 37 9F E6 65 BC 52 41 86 1D
       data hash MD5: 64K
       15 07 33 45 AB 2C BC 26 06 F0 B3 C3 3A 8C 7D 9C>)
(   2,<2007-03-19 09:52:11.12 +000>,<MAYBRIDGE\nmr>,<NMR_250MHZ>,
      <Start of raw data processing
       ef LB = 0.3 FT_mod = 6 PKNL = 1 SI = 32K 
       data hash MD5: 32K
       21 3B 0F 1E AF 46 6C 00 D2 D1 E7 A9 0D 3F 37 77>)
(   3,<2007-03-19 09:52:12.87 +000>,<MAYBRIDGE\nmr>,<NMR_250MHZ>,
      <apk 
       data hash MD5: 32K
       1D 6C F0 DF FF 10 E8 41 2E F5 7F 2A 48 B7 2C CE>)
(   4,<2007-03-19 09:52:13.61 +000>,<MAYBRIDGE\nmr>,<NMR_250MHZ>,
      <abs ABSG = 5 
       data hash MD5: 32K
       4B C3 91 CA 60 69 FA 94 30 F8 73 D9 DD 16 B2 C4>)
$$ ##END=
$$ 
$$ hash MD5
$$ DA 70 01 42 3F 15 52 88 29 AC 2B F6 7D 9B DC B2
##$RELAX= 
##$RELAX= 
##$RELAX= 
##$RELAX= 
##$RELAX= 
##$RELAX= 
##$RELAX= 
$$ Bruker specific parameters
$$ --------------------------
##$DU= <C:\u>
##$EXPNO= 1150
##$NAME= <ADRS>
##$PROCNO= 1
##$TYPE= <nmr>
##$USER= <dgb>
##$AMP= (0..31)
100 100 100 100 100 100 100 100 100 100 100 100 100 100 100 100 100 100 
100 100 100 100 100 100 100 100 100 100 100 100 100 100 
##$AQSEQ= 0
##$AQ_mod= 3
##$AUNM= <au_zg>
##$AUTOPOS= <4 >
##$BF1= 250.13
##$BF2= 250.13
##$BF3= 250.13
##$BF4= 250.13
##$BF5= 500.13
##$BF6= 500.13
##$BF7= 500.13
##$BF8= 500.13
##$BYTORDA= 1
##$CFDGTYP= 0
##$CFRGTYP= 5
##$CHEMSTR= <none>
##$CNST= (0..31)
1 1 145 1 1 1 1 1 1 1 1 1 1 1 1 1 1 1 1 1 1 1 1 1 1 1 1 1 1 1 1 1 
##$CPDPRG= <>
##$CPDPRG1= <>
##$CPDPRG2= <>
##$CPDPRG3= <>
##$CPDPRG4= <mlev>
##$CPDPRG5= <mlev>
##$CPDPRG6= <mlev>
##$CPDPRG7= <mlev>
##$CPDPRG8= <mlev>
##$CPDPRGB= <>
##$CPDPRGT= <>
##$D= (0..31)
0 1 0 0 0 0 0 0 0 0.06 0 0 0 0 0 0 0.0002 0 0 0 0 0 0 0 0 0 0 0 0 0 0 
0 
##$DATE= 1174297912
##$DBL= (0..7)
120 120 120 120 120 120 120 120 
##$DBP= (0..7)
150 150 150 150 150 150 150 150 
##$DBP07= 0
##$DBPNAM0= <>
##$DBPNAM1= <>
$$ [...]
##$SUBNAM7= <"">
##$SUBNAM8= <"">
##$SUBNAM9= <"">
##$SW= 20.6930455092707
##$SWIBOX= (0..15)
0 0 3 0 0 0 0 0 0 0 0 0 0 0 0 0 
##$SW_h= 5175.983436853
##$TD= 65536
##$TD0= 1
##$TE= 683.16
##$TE2= 300
##$TE3= 300
##$TEG= 300
##$TL= (0..7)
0 120 120 120 120 120 120 120 
##$TP= (0..7)
150 150 150 150 150 150 150 150 
##$TP07= 0
##$TPNAME0= <>
##$TPNAME1= <>
##$TPNAME2= <>
##$TPNAME3= <>
##$TPNAME4= <>
##$TPNAME5= <>
##$TPNAME6= <>
##$TPNAME7= <>
##$TPOAL= (0..7)
0.5 0.5 0.5 0.5 0.5 0.5 0.5 0.5 
##$TPOFFS= (0..7)
0 0 0 0 0 0 0 0 
##$TUNHIN= 0
##$TUNHOUT= 0
##$TUNXOUT= 0
##$USERA1= <user>
##$USERA2= <user>
##$USERA3= <user>
##$USERA4= <user>
##$USERA5= <user>
##$V9= 5
##$VALIST= <valist>
##$VCLIST= <CCCCCCCCCCCCCCC>
##$VD= 0
##$VDLIST= <DDDDDDDDDDDDDDD>
##$VPLIST= <PPPPPPPPPPPPPPP>
##$VTLIST= <TTTTTTTTTTTTTTT>
##$WBST= 1024
##$WBSW= 4
##$XGAIN= (0..3)
0 0 0 0 
##$XL= 0
##$YL= 0
##$YMAX_a= 447923
##$YMIN_a= -461125
##$ZGOPTNS= <>
##$ZL1= 120
##$ZL2= 120
##$ZL3= 120
##$ZL4= 120
##$ABSF1= 16.522
##$ABSF2= -4.171173
##$ABSG= 5
##$ABSL= 3
##$ALPHA= 0
##$AQORDER= 0
##$ASSFAC= 0
##$ASSFACI= 0
##$ASSFACX= 0
##$ASSWID= 0
##$AUNMP= <proc_1d>
##$AZFE= 0.1
##$AZFW= 0.1
##$BCFW= 0
##$BC_mod= 0
##$BYTORDP= 0
##$COROFFS= 0
##$CY= 12.5
##$DATMOD= 1
##$DC= 0
##$DFILT= <>
##$DTYPP= 0
##$F1P= 14.0000005364418
##$F2P= -0.99999901652339
##$FCOR= 0.5
##$FTSIZE= 32768
##$FT_mod= 6
##$GAMMA= 0
##$GB= 0
##$INTBC= 1
##$INTSCL= 1
##$ISEN= 128
##$LB= 0.3
##$LEV0= 0
##$LPBIN= 0
##$MAXI= 10000
##$MC2= 0
##$MEAN= 0
##$ME_mod= 0
##$MI= 0
##$NCOEF= 0
##$NC_proc= -3
##$NLEV= 6
##$NOISF1= 0
##$NOISF2= 0
##$NSP= 0
##$NTH_PI= 0
##$NZP= 0
##$OFFSET= 16.522
##$PC= 1
##$PHC0= 232.7726
##$PHC1= 5.828534
##$PH_mod= 1
##$PKNL= yes
##$PPARMOD= 0
##$PSCAL= 4
##$PSIGN= 0
##$REVERSE= no
##$SF= 250.13
##$SI= 32768
##$SIGF1= 0
##$SIGF2= 0
##$SINO= 400
##$SIOLD= 32768
##$SREGLST= <1H.CDCl3>
##$SSB= 0
##$STSI= 32768
##$STSR= 0
##$SW_p= 5175.98343685301
##$SYMM= 0
##$S_DEV= 0
##$TDeff= 65536
##$TDoff= 0
##$TI= <Analysis number 999999
Compound Code 99
Book Reference 9
Project Code 9>
##$TILT= no
##$TM1= 0
##$TM2= 0
##$TOPLEV= 0
##$USERP1= <user>
##$USERP2= <user>
##$USERP3= <user>
##$USERP4= <user>
##$USERP5= <user>
##$WDW= 1
##$XDIM= 32768
##$YMAX_p= 400549307
##$YMIN_p= -119576
$$ End of Bruker specific parameters
$$ ---------------------------------
##NTUPLES= NMR SPECTRUM
##VAR_NAME=  FREQUENCY,     SPECTRUM/REAL,   SPECTRUM/IMAG
##SYMBOL=    X,             R,               I
##VAR_TYPE=  INDEPENDENT,   DEPENDENT,       DEPENDENT
##VAR_FORM=  AFFN,          ASDF,            ASDF
##VAR_DIM=   32768,         32768,           32768
##UNITS=     HZ,            ARBITRARY UNITS, ARBITRARY UNITS
##FACTOR=    0.157963299565203, 1,           1
##FIRST=     4132.6476996994, 0,             0
##LAST=      -1043.33573715361, 0,           0
##MIN=       -1043.33573715361, -119576,     0
##MAX=       4132.6476996994, 400549307,     0
$$ Real data points
##PAGE= N=1
##DATA TABLE= (X++(R..R)), XYDATA
$$ [...]
16527f786j2145J4984Q977J7041j1469K513L8157L013j860l292l7533m827J3958
$$ -6786 -18931 -3947 5030 22071 10602 13115 51272 54285 52425 49133 11600 6773 20731
16514B0731K17k3779l8834K48J9461k084j9436k803K0137k1575Q655K8374Q008
$$ 20731 20948 -2831 -41665 -41417 -21956 -24040 -43476 -46279 -26142 -47717 -39062 -10688 -2680
16501b680p657o690R67K4862J183j6505j8425J8145K5124N930j0651j2860l0848
$$ -2680 -10337 -17027 -16060 8802 9985 -6520 -24945 -6800 18324 24254 13603 743 -30105
16488c0105k444K3127J7143p26m5967p150M699K727j6809J9827N2982M5692o964
$$ -30105 -32549 -9422 7721 6995 -38972 -46122 -41423 -38696 -55505 -35678 17304 62996 56032
16475E6032k8740L173K0190o434k0125j358l2691l3026L467K3653j6942j5589
$$ 56032 27292 30465 50655 44221 24096 22738 -9953 -42979 -39512 -15859 -32801 -48390
16463d8390J8176J5230J0178J840P52j9241J3441J2307O285J8603J4447J2716
$$ -48390 -30214 -14984 -4806 -2966 -2214 -21455 -8014 4293 10578 29181 43628 56344
16451E6344m898k6641k3226j1929K3749N3081j39L798N615l52j2770k5219K6822
$$ 56344 51446 24805 1579 -10350 13399 66480 66341 70139 75754 75402 62632 37413 64235
16438F4235K7344J2255N9382o588k9647j8750l6576j782J3446j8419k2234J2518
$$ 64235 91579 103834 163216 156628 126981 108231 71655 69873 83319 64900 42666 55184
16426E5184m227k8924N869K6974j4767n7240l1155P398N0234K5060j319k4016
$$ 55184 50957 22033 27902 54876 40109 -17131 -48286 -40888 9346 34406 33087 9071
16414I071k3769m2848o11L6822j7416J2348j6712j6838k10O501K7389K1482P039
$$ 9071 -14698 -57546 -58157 -21335 -38751 -26403 -43115 -59953 -60163 -53662 -26273 -4791 2248
16401B248l237Q331m848Q997L6268K0141Q942j613n652J235j2918n1172r267j6700
$$ 2248 -989 7342 2494 11491 47759 67900 76842 75229 69577 70812 57894 6722 -2545 -19245
16387a9245o747K4969j867p204J7928J438J012J0750r22j5894k0439J5188j9900
$$ -19245 -25992 -1023 -2890 -10094 7834 9272 10284 21034 20112 4218 -16221 -1033 -20933
16374b0933L5132O069k2002q459J9179j0109O360j9678r110p886J5462l337J4914
$$ -20933 14199 20268 -1734 -10193 8986 -1123 5237 -14441 -23551 -31437 -15975 -19312 -4398
16361d398Q404N956J1085J8996L776r451l1245j9824k8666j8441K0449J0800J0499
$$ -4398 4006 9962 21047 40043 43819 34368 3123 -16701 -45367 -63808 -43359 -32559 -22060
16348b2060j3956K4611M4715L1246j0914k0043j5419k4541j6303P875o434L9718
$$ -22060 -36016 -11405 33310 64556 53642 33599 18180 -6361 -22664 -14789 -21223 18495
16336A8495M8950J3583j1534k5012k998J3974L110O75K5911J8685K1467J3R943
$$ 18495 67445 81028 69494 44482 41484 55458 58568 59243 85154 103839 125306 125319 135262
16323A35262k0706l4905k5288j1364k324L599N405O613j2882n4195m96L6072K9515
$$ 135262 114556 79651 54363 42999 40675 44274 49679 56292 43410 -10785 -11281 24791 54306
16310E4306j2727q434p097j0630j1388Q507r059M946K6849L678k8239J0968M89
$$ 54306 41579 33145 26048 15418 4030 12537 3478 8424 35273 38951 10712 21680 22169
16297B2169J9775j9127j9949k3921r493J2042L0739l1275J7767N2304J596m1393
$$ 22169 41944 22817 2868 -21053 -30546 -18504 12235 -19040 -1273 51031 52627 11234
16285A1234k4075P520k3617L145o788M311J1928k139r571j6524L7397J1712l3369
$$ 11234 -12841 -5321 -28938 -25793 -32581 -28270 -16342 -18481 -28052 -44576 -7179 4533 -28836
16272b8836j9990K8801K1861L527J6797k5216p250j3864j9715J2332K4517J2430
$$ -28836 -48826 -20025 1836 5363 22160 -3056 -10306 -24170 -43885 -31553 -7036 5394
16260E394j2258o045m862Q87R690J9848J6593J5836o737k7053j7662J622j9228
$$ 5394 -6864 -12909 -17771 -16884 -7194 12654 29247 45083 38346 11293 -6369 -4747 -23975
16247b3975R400K5943Q430j4097M649n618J6393j322k5419l695l9246j2853K6396
$$ -23975 -14575 11368 19798 5701 10350 4732 21125 19803 -5616 -9311 -48557 -61410 -35014
16234c5014L9315o552k7494R522N618M6J5320J46P646j9698o593k9711j5749J6255
$$ -35014 4301 -2251 -29745 -20223 -14605 -14559 761 907 8553 -11145 -17738 -47449 -63198 -46943
16220d6943p338j8559K2617J550R317J7963J3095k9388P708n510R596L206K3580
$$ -46943 -54281 -72840 -50223 -48673 -39356 -21393 -8298 -37686 -29978 -35488 -25892 -22686 894
16207H94L4612k2864m0228O999j0965j1897r51J6870K3474O680K480j7453k5237
$$ 894 35506 12642 -27586 -20587 -31552 -43449 -44400 -27530 -4056 2624 5104 -12349 -37586
16194c7586q255o595L6532Q583j186O477K131J9852J075k086j6442j4129J7274
$$ -37586 -45841 -52436 -15904 -7321 -8507 -2030 101 19953 21028 18942 2500 -11629 5645
16181E645l02q352N294k866P691j2102M2090k02l0497l3016k9925O652K2228K9149
$$ 5645 5343 -3009 2285 -581 7110 -4992 37098 36896 6399 -26617 -56542 -49890 -27662 1487
16167A487k7695j7315M561K4468q617j5339K8757P097J2355J5010j7895n5060
$$ 1487 -26208 -43523 -38962 -14494 -23111 -38450 -9693 -2596 9759 24769 6874 -48186
16155d8186m416J4076k202J0013k0857J2006K2140p907K0123J7589j2525L429
$$ -48186 -52602 -38526 -40728 -30715 -51572 -39566 -17426 -25333 -5210 12379 -146 3283
16143C283Q75l507j0501j516j0143k5741m059j0184K339O76O780K9024R152N855
$$ 3283 4158 651 -9850 -11366 -21509 -47250 -51309 -61493 -59154 -58478 -51698 -22674 -13522 -7667
16129g667L9547r045m8040p314M6531N4060K960j4486p799j5100l5639J4346J2014
$$ -7667 31880 22835 -25205 -32519 14012 68072 71032 56546 48747 33647 -1992 12354 24368
16116B4368p810l1462N912J0861J22J9394M081j2506j1486j8548K2692J5323j6755
$$ 24368 16558 -14904 -8992 1869 1991 21385 25466 12960 1474 -17074 5618 20941 4186
16103D186k2387J5305o895M233j4652K764j0380J0103o317j3784o141K1119N144
$$ 4186 -18201 -2896 -9791 -5558 -20210 -17446 -27826 -17723 -24040 -37824 -43965 -22846 -17702
16090a7702k8634J8159O723L972j4571l4067j990J0782K0655K918J7455J3898
$$ -17702 -46336 -28177 -21454 -17482 -32053 -66120 -68110 -57328 -36673 -33755 -16300 -2402
16078b402o985R516j3737o350J0793K895n227J8595k7466J8488L2263k478k6946
$$ -2402 -9387 129 -13608 -19958 -9165 -6270 -11497 7098 -20368 -1880 30383 27905 959
16065I59m539J3748j6911l0306R535K6426J523n755r842J1169k4567j2640K1746
$$ 959 -3580 10168 -6743 -37049 -27514 -1088 435 -5320 -15162 -3993 -28560 -41200 -19454
16052a9454L7733L90k3512n956O984k7609Q344o726k3662K0533L8138J8286J1148
$$ -19454 18279 18669 -4843 -10799 -3815 -31424 -23080 -29806 -53468 -32935 5203 23489 34637
16039C4637J3978k8062k3900j7194K0260k6019m77k66j8512K6436r735k5201m698
$$ 34637 48615 20553 -3347 -20541 -281 -26300 -26777 -27043 -45555 -19119 -28854 -54055 -58753
16026e8753L156J537K3588R440r519J4945J3724J8019j1727J6868k1218k5498
$$ -58753 -55597 -54060 -30472 -21032 -30551 -15606 -1882 16137 4410 21278 60 -25438
16014b5438M911J7644L3968J4000l6325k0627L1194N009l6137M874L4732n112
$$ -25438 -20527 -2883 31085 45085 8760 -11867 19327 24336 -11801 -6927 27805 22693
16002B2693j5479O841j8376j8467Q18k8262J346K9662J3385K701j4937k151K1841
$$ 22693 7214 14055 -4321 -22788 -21970 -50232 -48886 -19224 -5839 -3138 -18075 -20226 1615
15989A615L514j9399j3003n119j731L1739J8363q655j6415m387j65J2101K603
$$ 1615 5129 -14270 -27273 -32392 -34123 -2384 15979 7324 -9091 -13478 -13643 -1542 1061
15976A061J4869J2516q69O641k5422L945R902n307l0869m777J48r794o369K5222
$$ 1061 15930 28446 27577 34218 8796 12741 22643 17336 -13533 -18310 -18162 -27956 -34325 -9103
15962i103P150p567K8868J7386j4904Q808O324l887k9848l340J3681r134j472
$$ -9103 -1953 -9520 19348 36734 21830 30638 36962 33075 3227 -113 13568 4434 2962
15949B962j6826K2762M7610m208k9859q863k5363j9705R378Q150J982J5061q793
$$ 2962 -13864 8898 56508 52300 22441 13578 -11785 -31490 -22112 -13962 -11980 3081 -5712
15936e712P597J1996j8510o940K7388P141k9365J4129K0684r260N977k2725k5092
$$ -5712 1885 13881 -4629 -11569 15819 22960 -6405 7724 28408 19148 25125 2400 -22692
15923b2692K7022r971m708j4409j2419K4125K6032K4452j293j785k2434l2912
$$ -22692 4330 -5641 -10349 -24758 -37177 -13052 12980 37432 36139 34354 11920 -20992
15911b0992j4068O109N785L412M5279l694R067L4562J807l7739R328l716J2150
$$ -20992 -35060 -28951 -23166 -19754 25525 21831 30898 65460 67267 29528 38856 35140 47290
15898D7290j5939K539M4449J3228l5193m3094M639J882l5465K286K1472N722j8932
$$ 47290 31351 33890 78339 91567 56374 13280 17919 19801 -15664 -13378 8094 13816 -5116
15885e116p179K0335m743o845m917j2764r94J8745K419k9154p144M4563L020j2991
$$ -5116 -12295 8040 3297 -3548 -8465 -21229 -22223 -3478 -1059 -30213 -37357 7206 10226 -2765
15871b765j0924J292J0345j4893J5897J0715q924J5231o942l9858L846P964K8891
$$ -2765 -13689 -12397 -2052 -16945 -1048 9667 743 15974 9032 -30826 -26980 -19016 9875
15858I875k779r257J0039N424j7849J4615K0101o347n136j2881k9758j0053l88
$$ 9875 7096 -2161 7878 13302 -4547 10068 30169 23822 18686 5805 -23953 -34006 -34394
15845c4394Q835J9712R90R35k0294j712j4477M494N616j5115k180M1337M529R169
$$ -34394 -25559 -5847 -4857 -3922 -24216 -25928 -40405 -35911 -30295 -45410 -47590 -6253 -1724 7445
15831G445J8650k298l216p021j8422q08k5877M124L23Q653p467J9865K0427j0169
$$ 7445 26095 23797 20581 13560 -4862 -5670 -31547 -27423 -27100 -18447 -25914 -6049 14378 4209
15817D209p096J0940K7243J5767l147k8205k0691k183Q056j7965j7738K2440J2847
$$ 4209 -2887 8053 35296 51063 47916 19711 -980 -3163 4893 -13072 -30810 -8370 4477
15804D477j7202O377m176O033m709J2737N567N746j2572r173K376p869l154J4506
$$ 4477 -12725 -6348 -10524 -4491 -9200 3537 9104 14850 2278 -6895 -4519 -12388 -15542 -1036
15790a036J7951o170k2214j8330k3063J8540J2647P301K3112L1137R666k1753
$$ -1036 16915 10745 -11469 -29799 -52862 -34322 -21675 -14374 8738 39875 49541 27788
15778B7788q667p95j0477J0016r053j1544j0634N904m819J307j1337O598J5341
$$ 27788 19121 18326 7849 17865 8812 -2732 -13366 -7462 -12281 -10974 -22311 -15713 -372
15765c72J1440K4713L0178r35o004k0797J0299j6019k4713q961l506J7877J2941
$$ -372 11068 35781 65959 65024 59020 38223 48522 32503 7790 -1171 -4677 13200 26141
15752B6141k2077n889l927L5502l0185p655N5634j0567k1911R994J8244j6991
$$ 26141 4064 -1825 -5752 29750 -435 -8090 47544 36977 15066 25060 43304 26313
15740B6313K8535p932j6148r245O410K1684l2912k3353j9208k1555L1014O625
$$ 26313 54848 46916 30768 21523 27933 49617 16705 -6648 -25856 -47411 -16397 -9772
15728i772M052j3930k6247j8215K4426J4938J2018L9195P44n74r883m0448l3949
$$ -9772 -5720 -19650 -45897 -64112 -39686 -24748 -12730 26465 27209 26635 16752 -23696 -57645
15715e7645J5689J7301K0866Q138K6850o657j8663l268k332p215o889O935Q537
$$ -57645 -41956 -24655 -3789 4349 31199 24542 5879 2611 279 -6936 -13825 -6890 1647
15702A647j7804P2J9091j4939J4880J4219J2746N902l1144j0630Q320J6622k5886
$$ 1647 -16157 -16085 3006 -11933 2947 17166 29912 35814 4670 -5960 2360 18982 -6904
15689f904j2974K5258K4612J0189N33k7747J3224R309l8688r083J822o765j0781
$$ -6904 -19878 5380 29992 40181 40714 12967 26191 35500 -3188 -12271 -10449 -17214 -27995
15676b7995m63m633l8180J4494M2909K684J34J7969r082k4869K0996K8511l600
$$ -27995 -28458 -33091 -71271 -56777 -13868 -11184 -11050 6919 -2163 -27032 -6036 22475 18875
15663A8875k4311o696L9919K2467R207N014l2373j9627k648j2577P46L064q392
$$ 18875 -5436 -12132 27787 50254 59461 64475 32102 12475 9827 -2750 -2004 1060 -7332
15650g332j9736n963P869M4244n88J6900J8840q948l622k5357o762k3132k1254
$$ -7332 -27068 -33031 -25162 19082 18494 35394 54234 45286 41664 16307 9545 -13587 -34841
15637c4841J8461n905k4100K7850M1679L7236R439j2159k9692k0714j6253L72
$$ -34841 -16380 -22285 -46385 -18535 23144 60380 69819 57660 27968 7254 -8999 -8627
15625h627K8983K4212j9448k7032k5993Q037K6246J0827j524M104j8636O570o89
$$ -8627 20356 44568 25120 -1912 -27905 -19868 6378 17205 15681 19785 1149 7719 7030
15612G030j9298q721j4327j3936L6687k516K2043J4029k3142o130J0038j1030
$$ 7030 -12268 -20989 -35316 -49252 -12565 -15081 6962 20991 -2151 -8281 1757 -9273
15600i273k7816j4783j3119l042K5401P164K3045K2145j7760k3430J9636J389
$$ -9273 -37089 -51872 -64991 -68033 -42632 -35468 -12423 9722 -8038 -31468 -11832 -10443
15588a0443P839K1869K510p95m6708k1649O888K1061Q433J0757o15J606J7542
$$ -10443 -2604 19265 21775 20980 -25728 -47377 -40489 -19428 -10995 -238 -853 753 18295
15575A8295k703j2675j8644n50j072k4776Q247L972j5341J4620K1270K9469K0423
$$ 18295 15592 2917 -15727 -16277 -17349 -42125 -33878 -29906 -45247 -30627 -9357 20112 40535
15562D0535M74m9080k8985O351L5171J9341O340l9870j2813N858J3411R629n861
$$ 40535 41009 -8071 -37056 -30705 4466 23807 30147 -9723 -22536 -16678 -3267 6362 501
15549E01j4252j6727O771o099l0886J0025J1559r719j5693m591J5161K5882m613
$$ 501 -13751 -30478 -23707 -29806 -60692 -50667 -39108 -48827 -64520 -69111 -53950 -28068 -32681
15536c2681J3158L1973J3327Q495j8316J016k0860l5899J0888J4545l318n4J8548
$$ -32681 -19523 12450 25777 34272 15956 16972 -3888 -39787 -28899 -14354 -17672 -17726 822
15523H22l2260j3488K9272j2416o955j8651K2639K5842j6408M066j6369j5558
$$ 822 -31438 -44926 -15654 -28070 -35025 -53676 -31037 -5195 -21603 -17537 -33906 -49464
15511d9464P449P118j074J3403Q977r402k2592K0285L8469R341k5657P107P729
$$ -49464 -42015 -34897 -35971 -22568 -13591 -22993 -45585 -25300 13169 22510 -3147 3960 11689
15498A1689K2451P28q899k5286j8058M212J229k1448q112o997O453J7972R433
$$ 11689 34140 34868 25969 683 -17375 -13163 -11934 -33382 -41494 -48491 -42038 -24066 -14633
15485a4633P957M6426j2102k5714j0537R176P764K434P912j2630q355k4857j4872
$$ -14633 -6676 39750 27648 1934 -8603 573 8337 10771 18683 6053 -2302 -27159 -42031
15472d2031J3723k367K1865J6723j5523J9949j5553l0308p710J444K0680J4840
$$ -42031 -28308 -30675 -8810 7913 -7610 12339 -3214 -33522 -41232 -39788 -19108 -4268
15460d268J1840k416j419L623o546L4432l012l0537l8605j3973m677J2937K5396
$$ -4268 7572 5156 3737 7360 814 35246 32234 1697 -36908 -50881 -55558 -42621 -17225
15447a7225j274j20p660K6040J5554J0011q72m281k2425Q550j721l2124m692K9408
$$ -17225 -18499 -18619 -26279 -239 15315 25326 24454 20173 -2252 6298 4577 -27547 -32239 -2831
15433b831J8411N871j9962l4265j0595L0920J3992K3123j9006r948K5715K346
$$ -2831 15580 21451 1489 -32776 -43371 -12451 1541 24664 5658 -4290 21425 23771
15421B3771L801j5025p445r492J18n747J0878m632L1877M2661m0337k5322m686
$$ 23771 27572 12547 5102 -4390 -4272 -10019 859 -3773 28104 70765 30428 5106 420
15408D20J1606k5630k1507J1315J0411q232n449l3085j5497J8195K6915M4949
$$ 420 12026 -13604 -35111 -23796 -13385 -21617 -27066 -60151 -75648 -57453 -30538 14411
15396A4411Q827O77P066J867j1830r153M599J7443k6453j2124k4450K004M263
$$ 14411 23238 23915 30981 32848 21018 11865 16464 33907 7454 -4670 -29120 -27116 -22853
15383b2853J6788l79K4670J2532L5690J5000J865r415j5857J591j1127p941l466
$$ -22853 -6065 -6444 18226 30758 66448 81448 83313 73898 58041 59632 48505 40564 37098
15370C7098M4772M482k3946k2411l213P000o913j8262J34l0857K1795J5576j6173
$$ 37098 81870 86352 62406 39995 36782 43782 36869 18607 18741 -12116 9679 25255 9082
15357I082l0736k6665j9869K7140L2207k2371n062N4169O862j8297j4235J1226
$$ 9082 -21654 -48319 -68188 -41048 -8841 -31212 -36274 17895 24757 6460 -7775 3451
15345C451R502O989J14N911P342o06o358k822L6839r997k4387o179J0068l4756
$$ 3451 12953 19942 20056 25967 33309 32703 26345 23523 60362 50365 25978 19799 29867 -4889
15331d889l6329L2942K0233j3117N774q817m0455r040K1100J2344J999L2247o589
$$ -4889 -41218 -8276 11957 -1160 4614 -4203 -44658 -53698 -32598 -20254 -18255 13992 7403
15318G403j9030j2951J5978L7102K4166N931L595j869p26j0756j4978j6199l1352
$$ 7403 -11627 -24578 -8600 28502 52668 58599 62194 60325 59599 48843 33865 17666 -13686
15305a3686K6786N1094N614J2882M683k2243k0003J4088Pj6330n5229l9380j367
$$ -13686 13100 64194 69808 82690 87373 65130 45127 59215 59222 42892 -12337 -51717 -53084
15292e3084M68P882K3007K1748N532J6046R930n426k36k1682l4476r780J1625
$$ -53084 -52616 -44734 -21727 21 5553 21599 31529 26103 25867 4185 -30291 -40071 -28446
15279b8446j1906M165m10K2977L1099L0139K7798l6960j7946j8906m2890J3936
$$ -28446 -40352 -36187 -36597 -13620 17479 47618 75416 38456 20510 1604 -41286 -27350
15267b7350j2512K6761K0999n346J7034M052k0816R541k5038r080J2049J3815
$$ -27350 -39862 -13101 7898 2552 19586 23638 2822 12363 -12675 -21755 -9706 4109
15255D109k935r474K8733j7909k9794K3199J6685n133J0695j3797P533J2355j23
$$ 4109 1174 -8300 20433 2524 -27270 -4071 12614 7481 18176 4379 11912 24267 24144
15242B4144k0159p371j1683J6008k6433r254L3955R005l508j6085j5965M641J7196
$$ 24144 3985 -3386 -15069 939 -25494 -34748 -793 8212 4704 -11381 -27346 -22705 -5509
15229e509J5755K687N841j3660j0235j3291N925J0636N677K1922O392l4575k2628
$$ -5509 10246 12933 18774 5114 -5121 -18412 -12487 -1851 3826 25748 32140 -2435 -25063
15216b5063L958k4504n472J694L7108K972O368J2151M0155k3920k8900k9133J8753
$$ -25063 -21105 -45609 -51081 -49387 -12279 -9307 -2939 9212 49367 25447 -3453 -32586 -13833
15203a3833K2205J03k5028o239J3620J5399o489j6472j5936r456J8320J5790J2445
$$ -13833 8372 8475 -16553 -22792 -9172 6227 -262 -16734 -32670 -42126 -23806 -8016 4429
15190D429J6690k772q290L575j4515K693J9683P057j4465o772l3709K3219R248
$$ 4429 21119 18347 10057 13632 -883 1810 21493 28550 14085 7313 -26396 -3177 6071
15177F071K6469J6245p835J0376K5281q635o156l5327o467q65k624j1429L2447
$$ 6071 32540 48785 40950 51326 76607 67972 61816 26489 20022 19157 16533 5104 37551
15164C7551J1o264k0063k7479r286K9116j7064j3492J0810J7145K0613L887j427
$$ 37551 37562 31298 11235 -16244 -25530 3586 -13478 -26970 -16160 985 21598 25485 24058
15151B4058J792O572k6299j8178j3835j8235L575n27N540J7876M1427J107J3745
$$ 24058 25850 32422 6123 -12055 -25890 -44125 -40550 -41077 -35537 -17661 23766 24873 38618
15138C8618m683o051j9625k7222J0450L274J8965j6957j8087J834j4628K55M4710
$$ 38618 33935 27884 8259 -18963 -8513 -5239 13726 -3231 -21318 -19484 -34112 -33857 10853
15125A0853J5188K050q048r786J4461m000l1175L9600L0708J1556j8333j0809
$$ 10853 26041 28091 20043 10257 24718 20718 -10457 29143 59851 71407 53074 42265
15113D2265O126l6017k5986m724Q27L3554J7247j5082j0998l0478M74n062K8841
$$ 42265 48391 12374 -13612 -18336 -17509 16045 33292 18210 7212 -23266 -22792 -27854 987
15100I87J2594l5595N666j0809J3851L497J6480R408j6330q559K6830q257o105
$$ 987 13581 -22014 -16348 -27157 -13306 -9809 6671 16079 -251 -8810 18020 9763 3658
15087C658m953M0523j849L0433l159k2761N155p96o469j2124J1861m892q533J1881
$$ 3658 -1295 39228 37379 67812 64653 41892 47047 46251 39782 27658 39519 34627 26094 37975
15073C7975J3612k1017o013J7140o126q776k543K1431K5568J4406p270l7363k9696
$$ 37975 51587 30570 24557 41697 35571 26795 24252 45683 71251 85657 78387 41024 11328
15060A1328J7235J8321k673l1885j2887N0954l591J1263j3594m9780L487j1046
$$ 11328 28563 46884 44211 12326 -561 50393 46802 58065 44471 -5309 -1822 -12868
15048a2868L0835N517q949k9481J686K6707m7624l1039K128K9629k843M4032m484
$$ -12868 17967 23484 14535 -14946 -13260 13447 -34177 -65216 -63088 -33459 -36302 7730 3246
15035C246n2564m452J7918J2880j32j0273L2505R264L578N3j0383k2277k4630
$$ 3246 -49318 -53770 -35852 -22972 -23104 -33377 -872 8392 11970 12023 1640 -20637 -45267
15022d5267j764J4689j2380k6758o88M2320L8754J1180j740j1522m4361o072K2761
$$ -45267 -47031 -32342 -44722 -71480 -72168 -29848 8906 20086 18346 6824 -37537 -43609 -20848
15009b0848j08K8816J3276P593p830O821j5757j1319K4986J5011K5684M5649Q1666
$$ -20848 -20956 7860 21136 28729 20899 27720 11963 644 25630 40641 66325 111974 193640
14996A93640M2757o3325o4218n4223m6332m543l4l594M0615l466N370j6176j3446
$$ 193640 236397 173072 108854 54631 8299 3756 3722 128 40743 37277 42647 26471 13025
14983A3025M710m293j8971l571N272j2858J7579J7227k759l3847o575q226J641
$$ 13025 17735 13442 -5529 -9100 -3828 -16686 893 18120 15361 -18486 -25061 -33287 -31646
14970c1646P773L662M1898J4872k0319J954j3923k1092J4056P950p576j0196j2272
$$ -31646 -23873 -20211 21687 36559 16240 18194 4271 -16821 -2765 5185 -2391 -12587 -24859
14957b4859J4282J7529N356J1967j0551k651r935j3121k8365R168J4752j693q810
$$ -24859 -10577 6952 12308 24275 13724 11073 1138 -11983 -40348 -31180 -16428 -18121 -26931
14944b6931K5725J9135k6149M582k6010j1692j0493q158M6970J9939k2890K5467
$$ -26931 -1206 17929 -8220 -3638 -29648 -41340 -51833 -59991 -13021 6918 -15972 9495
14932I495K814m624k8577j0522J2645K3388p504k9169R901k475j1333o434J946
$$ 9495 12309 7685 -20892 -31414 -18769 4619 -2885 -32054 -22153 -24628 -35961 -42395 -40449
14919d0449L0692K6005n736m184J4091n798n019j5469k3370j9194m626J4244K0713
$$ -40449 -9757 16248 10512 6328 20419 14621 9602 -5867 -29237 -48431 -53057 -38813 -18100
14906a8100l1048l890j192K3971K3547k347O482R554P056N3417J6088k8582k5375
$$ -18100 -49148 -53038 -54230 -30259 -6712 -9059 -2577 6977 14033 67450 83538 54956 29581
14893B9581n217j6797J7389M4434K0854j0691j6262l595j9001k331l9945l5172
$$ 29581 24364 7567 24956 69390 90244 79553 63291 59696 40695 38364 -1581 -36753
14881c6753L7102L9490M080j193j4923J954q745Q317j4535N92M499J714p352J433
$$ -36753 349 39839 43919 42726 27803 29757 21012 29329 14794 15386 19885 21599 14247 15680
14867A5680j9137j0239R04J2910k022k738J5904J3187M686k8358J6193J2381J4659
$$ 15680 -3457 -13696 -12792 118 -1904 -4642 11262 24449 29135 777 16970 29351 44010
14854D4010k8486K845M784L803J2677J5084l458j5682J2305m810k775j791m980
$$ 44010 15524 18369 23153 26956 39633 54717 51259 35577 47882 43072 40297 38506 33526
14841C3526k8152j5033j7459j1700L8574J5386l4878q709K0482J5948m90n780
$$ 33526 5374 -9659 -27118 -38818 -244 15142 -19736 -28445 -7963 7985 7495 1715
14829A715J1671j241k4468N683K7315J020j1417k9323j3619q583L3944j979K1
$$ 1715 13386 12145 -12323 -6640 20675 21695 10278 -19045 -32664 -41247 -7303 -9282 -9261
14816i261K481k72r080O343k5429K820P722M55J3190j5696K540J6517j7108K902
$$ -9261 -6780 -7052 -16132 -9789 -35218 -32398 -24676 -24221 -11031 -26727 -24187 -7670 -24778 -21876
14802b1876j543N087J0673J2910j5414o893N76M490J1133N160j4159n797l914
$$ -21876 -23419 -18332 -7659 5251 -10163 -17056 -16480 -11990 -857 4303 -9856 -15653 -19567
14789a9567O897J962j7516q07R776J2756J9603r325j5425J9544L1960j6196j5813
$$ -19567 -12670 -10708 -28224 -29031 -19255 -6499 13104 3779 -11646 7898 39858 23662 7849
14776G849j7062l2605p6l9K7274K5068j5689k1517K0818K7095Q989J9527l149
$$ 7849 -9213 -41818 -41894 -41933 -14659 10409 -5280 -26797 -5979 21116 30105 49632 46483
14763D6483j0034o257k012j4853l1419O23j955j2053J0657J8892r182j2104O728
$$ 46483 36449 30192 28180 13327 -18092 -17469 -19424 -31477 -20820 -1928 -11110 -23214 -16486
14750a6486J685j651j9416l616M574q100k4362K1884J8935K9618J9988k594J4811
$$ -16486 -14801 -16452 -35868 -39484 -34910 -43010 -67372 -45488 -26553 3065 23053 20459 35270
14737C5270j9683j6251l3028j2360R142J3271Q859j9705N591O716j3951L873J6061
$$ 35270 15587 -664 -33692 -46052 -36910 -23639 -14780 -34485 -28894 -22178 -36129 -32256 -16195
14724a6195L0527K0177n355r377k1104K67k1246q580Q807j5305J5920K140M994
$$ -16195 14332 34509 29154 19777 -1327 -1060 -22306 -30886 -22079 -37384 -21464 -19324 -14330
14711a4330K1132j1919J2117j2718q993K253Q316J4682m4773O872N706p30J1905
$$ -14330 6802 -5117 7000 -5718 -14711 -12458 -4142 10540 -34233 -27361 -21655 -22385 -10480
14698a0480l029N433j5679j9453J2557J0309K9687k157J779m549J8721m477k0258
$$ -10480 -13509 -8076 -23755 -43208 -30651 -20342 9345 7188 8967 4418 23139 18662 -1596
14685a596J5792R990k5437J7249L1485Q888l0717k6654p489j4561j0362m643Q355
$$ -1596 14196 24186 -1251 15998 47483 56371 25654 -1000 -8489 -23050 -33412 -38055 -29700
14672b9700M2225K5056j5295j347j7939q218K4343K56r552M376q866j1911k1495
$$ -29700 12525 37581 22286 20939 3000 -5218 19125 19381 9829 14205 5339 -6572 -28067
14659b8067J8749L9195m76k8404P386J9573j2328j8618k8693p705J3537K9308
$$ -28067 -9318 29877 29401 997 8383 27956 15628 -2990 -31683 -39388 -25851 3457
14647C457j291Q552l094Q931k3004J005K5557J2892k4477l3299k546n049J9757
$$ 3457 2166 10718 7624 16555 -6449 -5444 20113 33005 8528 -24771 -27317 -32366 -12609
14634a2609J7544J5695j9920j730J4468r565K542m057O294J5983q422L222J3261
$$ -12609 4935 20630 710 -1020 13448 3883 6425 2368 8662 24645 16223 19445 32706
14621C2706m9032j3203K2235J4828j4880K043j6176n996Q581K335K4849j1529
$$ 32706 -16326 -29529 -7294 7534 -7346 -5303 -21479 -27475 -18894 -16559 8290 -3239
14609c239K0038J2810j2830Q302j7439l590K6462J6239m5233n0064J2998J0077
$$ -3239 16799 29609 16779 25081 7642 4052 30514 46753 1520 -48544 -35546 -25469
14597b5469R102J6341M327J0692k550k800O50k696l433m046j1276k0010K041R026
$$ -25469 -16367 -26 4301 14993 12443 9643 10293 7597 4164 118 -11158 -31168 -29127 -20101
14583b0101J3437j6840k7686N155L5100m285L686K4655K256k324k5272P037K579
$$ -20101 -6664 -23504 -51190 -46035 -10935 -15220 -11534 13121 15377 13053 -12219 -5182 -2603
14570b603j5829j3710j099K893R767P968K3240j9606J099L996j771m909P585O622
$$ -2603 -18432 -32142 -33241 -30348 -20581 -12613 10627 -8979 -7880 -3884 -5655 -10564 -2979 3643
14556C643J9377K4143K3404o851j0424l4315l6660R320k718J5564K012K2199p552
$$ 3643 23020 47163 70567 63716 53292 18977 -17683 -8363 -11081 4483 6495 28694 21142
14543B1142m110L576k4672j342J1084j2124R110m851J1875M84J9598j3088K590
$$ 21142 17032 20608 -4064 -5406 5678 -6446 2664 -2187 9688 10172 29770 16682 19272
14530A9272K2854k8867k3720L345j5386J794L841Q993J3802j999j6780j8135j0241
$$ 19272 42126 13259 -10461 -7116 -22502 -20708 -16867 -7874 5928 3929 -12851 -30986 -41227
14517d1227J6206J6259Q856l2823k8065K0123J8018J5629p46j5360J292J6106
$$ -41227 -25021 -8762 94 -32729 -60794 -40671 -22653 -7024 -7770 -23130 -21838 -5732
14505e732J4089m670p842j8950J202J819J0309J598o871J4150j0909q971k935
$$ -5732 8357 3687 -4155 -23105 -21903 -20084 -9775 -8177 -15048 -898 -11807 -20778 -23713
14492b3713J9935M3167K0803k3002j4342J0838M210o390m6324j1878n506j1712
$$ -23713 -3778 39389 60192 37190 22848 33686 37896 31506 -14818 -26696 -32202 -43914
14480d3914j2874K3823Q199j6438N404M29j138K2264J0799J4713j6091k547J845
$$ -43914 -56788 -32965 -24766 -41204 -35800 -35371 -36509 -14245 -3446 11267 -4824 -7371 -5526
14467e526J9168k502r536j5151q740O577m714K9846n365L832J2506k4153k3621
$$ -5526 13642 11140 1604 -13547 -22287 -15710 -20424 9422 4057 7889 20395 -3758 -27379
14454b7379L0330J6134l3638j7086J655m261p063J000P196j5665L2029M5003n478
$$ -27379 2951 19085 -14553 -31639 -29984 -34245 -41308 -40308 -33112 -48777 -16748 28255 22777
14441B2777j5416m730j040J1463N0899K1191l8629k0576k0501J0875o495k503
$$ 22777 7361 2631 1591 13054 63953 85144 46515 25939 5438 16313 9818 7315
14429G315J105k3432P238q275l3739q317K5715K0244k9817j717M606j7132K3194
$$ 7315 8420 -15012 -7774 -16049 -49788 -58105 -32390 -12146 -41963 -43680 -39074 -56206 -33012
14416c3012P763J9864J1951j3384R82j2099L2722J38j3646N638N769J4703j5004
$$ -33012 -25249 -5385 6566 -6818 -5836 -17935 14787 14925 1279 6917 12686 27389 12385
14403A2385P137j854j1545k0211R248k2905k86J4250J5705K519O948p16k5042
$$ 12385 19522 17668 6123 -14088 -4840 -27745 -28031 -13781 1924 4443 11391 10675 -14367
14390a4367j9642J0937J3350k3400q306K2169J1427J8172M899k9025l0698o142
$$ -14367 -34009 -23072 -9722 -33122 -41428 -19259 -7832 10340 15239 -13786 -44484 -50626
14378e0626O802n380P302K842L2852L7386J9101k6658j8006k5605k6493J0600
$$ -50626 -43824 -49204 -41902 -39060 -6208 31178 50279 23621 5615 -19990 -46483 -35883
14366c5883K3198L6692q767J5368K0021n7444L883J5707K4585r095k7423k7297
$$ -35883 -12685 24007 15240 30608 50629 -6815 -2932 12775 37360 28265 842 -26455
14354b6455O012K5250J3660k4867k496J987o644N707L4325k3109k5009O071L4239
$$ -26455 -20443 4807 18467 -6400 -8896 -6909 -13553 -7846 26479 3370 -21639 -15568 18671
14341A8671k206r657K6405K865j7034k6621O349O593o459k2753k8865M4265N4999
$$ 18671 16465 6808 33213 36078 19044 -7577 -1228 5365 -1094 -23847 -52712 -8447 46552
14328D6552K0030k5918m2058l3361o877L4352O907J1216J5047j8918k2066J062
$$ 46552 66582 40664 -1394 -34755 -41632 -7280 -373 10843 25890 6972 -15094 -14032
14316a4032K139j7707r738J9256R842m355K0529P723L0741j3528j0333J8393k4591
$$ -14032 -11893 -29600 -39338 -20082 -10240 -14595 5934 13657 44398 30870 20537 38930 14339
14303A4339j6468J0737o302r565k2559p883j1619J1794R388R903J1544K5521m92
$$ 14339 -2129 8608 2306 -7259 -29818 -37701 -49320 -37526 -28138 -18235 -6691 18830 18338
14290A8338j8170J1626k4360K3352k0101L388J4112j212J4708J1188k9612l0032
$$ 18338 168 11794 -12566 10786 -9315 -5927 8185 6973 21681 32869 3257 -26775
14278b6775r564K1978J2473J7506p015l4251J9702L7026m907k7766p507j9471
$$ -26775 -36339 -14361 -1888 15618 8603 -25648 -5946 31080 26173 -1593 -9100 -28571
14266b8571j0333J5866J5876j9416j172J6198N904r944k3173P786J7035K0877
$$ -28571 -38904 -23038 -7162 -26578 -27750 -11552 -5648 -15592 -38765 -30979 -13944 6933
14254F933N1715K4221m4294k4176L313j9948M134L0704q701m2574L787N847j558
$$ 6933 58648 82869 38575 14399 17712 -2236 1898 32602 23901 -18673 -14886 -9039 -10597
14241a0597j2954J852R490K1743J2788J1857N563l7250k551j8052m917J3264J5472
$$ -10597 -23551 -21699 -12209 9534 22322 34179 39742 2492 -59 -18111 -23028 -9764 5708
14228E708K7344q281l2433l6267K7958J0499Q373p164l267o303R351J0639K0494
$$ 5708 33052 24771 -7662 -43929 -15971 -5472 2901 -4263 -7530 -13833 -4482 6157 26651
14215B6651r77r492k508l001J0544j5196N215j4388r243p799m264J0841K2689
$$ 26651 25674 16182 13674 10673 21217 6021 11236 -3152 -12395 -20194 -24458 -13617 9072
14202I072Q649k2138j2693P933m288o838L1199K442k753k5574M779K3764J0420
$$ 9072 17721 -4417 -17110 -9177 -13465 -20303 10896 13338 10585 -14989 -10210 13554 23974
14189B3974r33j9992j2918K0180K4458n874j7323R551l5003P910J1714K6063k8779
$$ 23974 23041 3049 -9869 10311 34769 28895 11572 21123 -13880 -5970 5744 31807 3028
14176C028n1041N439K8742K9759K870j6160m8551P393K0900j5397K2262k929P141
$$ 3028 -48013 -42574 -13832 15927 18797 2637 -45914 -38521 -17621 -33018 -10756 -13685 -6544
14163f544r636L155j3130K2158K4871K275K6137J0758j1825j2092m3469l2226
$$ -6544 -16180 -13025 -26155 -3997 20874 23149 49286 60044 48219 36127 -7342 -39568
14151c9568J4108J5674K022L754l245j7009J6510l117q846J743m561j3409O634
$$ -39568 -25460 -9786 -7764 -4010 -7255 -24264 -7754 -10871 -19717 -17974 -22535 -35944 -29310
14138b9310j4608P827Q187j1624J9219J3149J2306j1376j8191K6999K7269J5663
$$ -29310 -43918 -36091 -27904 -39528 -20309 -7160 5146 -6230 -24421 2578 29847 45510
14126D5510q442j0735j808l7378l6670J2205L7936L9841k2177k009L400L2649
$$ 45510 37068 26333 24525 -12853 -49523 -37318 618 40459 18282 16273 19673 52322
14114E2322Q269l0929k4283o670k5894n1030j2931M6576K9755J254P025r176O974
$$ 52322 60591 29662 5379 -1291 -27185 -78215 -91146 -44570 -14815 -13561 -6536 -15712 -8738
14101h738K0110N356j4845N980K1869N682J8490j9386j1779k4482k7871J9713
$$ -8738 11372 16728 1883 7863 29732 35414 53904 34518 22739 -1743 -29614 -9901
14089i901J2608N019j950J4651L650j5367r732j636n977M1607K1817q12j9704
$$ -9901 2707 7726 5776 20427 24077 8710 -1022 -2658 -8635 32972 54789 53977 34273
14076C4273j5480J0455r406o531J698J2189l723k1017J1000j4324j3588K4139
$$ 34273 18793 29248 19842 13311 15009 27198 23475 2458 13458 -866 -14454 9685
14064I685J5668k4411j5341O436K2582J9602k2409l4962Q120L0517J6522o743
$$ 9685 25353 942 -14399 -7963 14619 34221 11812 -23150 -15030 15487 32009 25266
14052B5266j3865j0875l009m557j7892k232M213r578j853j331J4763R934k1569
$$ 25266 11401 526 -2483 -7040 -24932 -27164 -22951 -32529 -34382 -35713 -20950 -11016 -32585
14039c2585K4153L6908K229J0984J4104l6905N848j8436l3688L3334L4509j1808
$$ -32585 -8432 28476 30705 41689 55793 18888 24736 6300 -27388 5946 40455 28647
14027B8647k5404K1662R334l035l8111j5850k328R653J4306K695J4351L1432N796
$$ 28647 3243 24905 34239 31204 -6907 -22757 -25085 -15432 -1126 1569 15920 47352 53148
14014E3148N517k4031j9137Q621J7009j1010m4215K1304J208l7173m16M757J680
$$ 53148 58665 34634 15497 24118 41127 30117 -14098 7206 8414 -28759 -29175 -24418 -22738
14001b2738J8433J3149J0821k6621j3973J5135J1408l543L569K0747K0143R507
$$ -22738 -4305 8844 19665 -6956 -20929 -5794 5614 2071 5640 26387 46530 56037
13989E6037p580j6182j4836J441m692n252J2135j951r478j6525k9545l125J9444
$$ 56037 48457 32275 17439 18880 14188 8936 21071 19120 9642 -6883 -36428 -39553 -20109
13976b0109J9747R792j6107j999j6296l5804J1924J3283J768K0870k1200O240
$$ -20109 -362 9430 -6677 -8676 -24972 -60776 -48852 -35569 -33801 -12931 -34131 -27891
13964b7891J7870M794j6830J6736K1098L978K1117J4048j0807k1865m57j7162
$$ -27891 -10021 -5227 -22057 -5321 15777 19755 40872 54920 44113 22248 21791 4629
13952D629m170J2554o61j9022k2584K1866K4837m964k9016J7335J7014j858j2298
$$ 4629 459 13013 12352 -6670 -29254 -7388 17449 12485 -16531 804 17818 15960 3662
13939C662L1025j0255k8390l562J06J8916Q355J3763j6450Q138k919l4555r518
$$ 3662 34687 24432 -3958 -7520 -7414 11502 19857 33620 17170 25308 22389 -12166 -21684
13926b1684K689n569q204J3661k2830j0191M543J1530K5669O658N527L0038k2078
$$ -21684 -18995 -24564 -32768 -19107 -41937 -52128 -47585 -36055 -10386 -3728 1799 31837 9759
13913I759j8607k3297M0785N7761L240m2240M381J0828j3387j4878J564J5872
$$ 9759 -8848 -32145 8640 66401 69641 27401 31782 42610 29223 14345 15909 31781
13901C1781J4552j517k5918j8118r10j2791K761m180R553m268r8K5575K045K66
$$ 31781 46333 44816 18898 780 -130 -12921 -10160 -14340 -4787 -9055 -9153 16422 18467 18733
13887A8733Q848M710L749k61j5889m0998j2099J2958K4282R263P391l3831j4928
$$ 18733 27581 32291 36040 35779 19890 -21108 -33207 -20249 4033 13296 20687 -13144 -28072
13874b8072R168J9273K5067j931n582o721J763l378Q835k3904j356J298o722K512
$$ -28072 -18904 369 25436 23505 17923 11202 12965 9587 18422 -5482 -6838 -5540 -12262 -9750
13860i750q484j313r489k579Q164K5934j0006P581j2187l430K0206M611O676J3170
$$ -9750 -18234 -19547 -29036 -31615 -23451 2483 -7523 58 -12129 -15559 4647 9258 15934 29104
13846B9104M4603M103l7865k7500Q360k861K970k8109J154J7377J0256j7065j6294
$$ 29104 73707 77810 39945 12445 20805 17944 20914 -7195 -6041 11336 21592 4527 -11767
13833a1767J0268Q480M914m093k2240J785O429j0512j5197J7920j3722k0612L7928
$$ -11767 -1499 6981 11895 7802 -14438 -12653 -6224 -16736 -31933 -14013 -27735 -48347 -10419
13820a0419J4754Q60p035n976m9524J7030K4970J1348o044l2662j3420J9487L1975
$$ -10419 4335 5195 -1840 -7816 -57340 -40310 -15340 -3992 -10036 -42698 -56118 -36631 -4656
13807d656o10r159J530L412n689j4267O606M749J8478J1093j104j5496j9291Q952
$$ -4656 -5266 -14425 -12895 -9483 -15172 -29439 -22833 -18084 394 11487 10383 -5113 -24404 -15452
13793a5452K9011j5619r2J7831j4681l843O225l6230j0226k4060J2795K3670J7386
$$ -15452 13559 -2060 -2152 15679 998 -2845 3380 -32850 -43076 -67136 -54341 -30671 -13285
13780a3285J5489J522k6452j9162R411L9168J2157j2715j6086R101L1805o564
$$ -13285 2204 3726 -22726 -41888 -32477 6691 18848 6133 -9953 -852 30953 24389
13768B4389J8340J008k7595o655P573N668j2960j1659p658L433K5326K761o196
$$ 24389 42729 43737 16142 9487 17060 22728 9768 -1891 -9549 -6116 19210 21971 15775
13755A5775o002J1793K3359l0510m6921p775J8011J4727n374l0229J5003K2684
$$ 15775 9773 21566 44925 14415 -32506 -40281 -22270 -7543 -12917 -43146 -28143 -5459
13743e459l5415o469Q00O16J0800J3505R284q48L3599j1445J3296l515n2752J9653
$$ -5459 -40874 -47343 -46543 -45927 -35127 -21622 -12338 -13186 20413 8968 22264 18749 -34003 -14350
13729a4350K0654k0866J001J1731J9017p889J4096J8661J9839k4499j7012L862
$$ -14350 6304 -14562 -13561 -1830 17187 9298 23394 42055 61894 37395 20383 24245
13717B4245l2210k4479J6989O082R54N548J0464k1728l7190N58J9942J4317j190
$$ 24245 -7965 -32444 -15455 -9373 -8419 -2871 7593 -14135 -51325 -50767 -30825 -16508 -17698
13704a7698K384K164J2419M779N651J0066R829m204k1917j3504p95K8051l834
$$ -17698 -15314 -13150 -731 4048 9699 19765 29594 25390 3473 -10031 -10826 17225 13391
13691A3391k0516j0535n14N637P70l6068p00J4083K3498Q734l8240J3370L8621
$$ 13391 -7125 -17660 -18174 -12537 -11767 -47835 -48535 -34452 -10954 -2220 -40460 -27090 11531
13678A1531K09k2563l9226K782K802k7917L769L706K3969L9325K2585Q760j9541
$$ 11531 11740 -10823 -50049 -47267 -44465 -72382 -68613 -64907 -40938 -1613 20972 29732 10191
13665A0191L22K589l0855K777J3884j3594J7453k7924j7206K3834P591J032K0879
$$ 10191 10513 13102 -17753 -14976 -1092 -14686 2767 -25157 -42363 -18529 -10938 -9906 10973
13652A0973L011p889q617p799k8759L1368p627l4187p993K439m50K3380P793L1731
$$ 10973 13984 6095 -2522 -10321 -39080 -7712 -15339 -49526 -57519 -55080 -55530 -32150 -24357 7374
13638G374o677m0612K0384J0612P105J486q672j3305j843o802J1127m498j092
$$ 7374 697 -39915 -19531 -8919 -1814 -328 -9000 -22305 -24148 -30950 -19823 -24321 -25413
13625b5413j3230j1873K1904K7156J7440J1204K5852N2309j607m1759k540l9014
$$ -25413 -38643 -50516 -28612 -1456 15984 27188 53040 105349 103742 61983 59443 20429
13613B0429j6250j7248J715m271K2493m734l3272K3635O704p479J3243K463k3445
$$ 20429 4179 -13069 -11354 -15625 6868 2134 -31138 -7503 -799 -8278 4965 7428 -16017
13600a6017P245O993K7714r285L934p313l4747j0773J3894K5274j216l340k1299
$$ -16017 -8772 -1779 25935 16650 20584 13271 -21476 -32249 -18355 6919 5703 2363 -18936
13587a8936m074j242K4444M6418J1069O435J0126j8991k2012j8576o272j5748
$$ -18936 -23010 -24252 192 46610 57679 64114 74240 55249 33237 14661 8389 -7359
13575g359j4298N124r712l515j7086K7181O8802j0528l8638k8352J1057J3919
$$ -7359 -21657 -16533 -26245 -29760 -46846 -19665 49137 38609 -29 -28381 -17324 -3405
13563c405j3538n576J210j2304K13M8933P950j2378k5329q684L011l158L0111
$$ -3405 -16943 -22519 -21309 -33613 -33400 15533 23483 11105 -14224 -22908 -19897 -23055 7056
13550G056J3079l0236k1933j2443K3649K5290j1830j2483l48L6235P492J8212
$$ 7056 20135 -10101 -32034 -44477 -20828 4462 -7368 -19851 -20199 16036 23528 41740
13538D1740l26j3060l0687r703k565j4293j8921L0044P010K6839J9399l0482j2479
$$ 41740 41414 28354 -2333 -12036 -14601 -28894 -47815 -17771 -10761 16078 35477 4995 -7484
13525g484j6592L9004j0800j8570J4322Q498j990j82R712K991P086J8201J075
$$ -7484 -24076 14928 4128 -14442 -120 8378 6388 6206 15918 18909 25995 44196 45271
13512D5271m5390m2811J3898J2205Q287l079k0552o240l787K0836K0134j381o71
$$ 45271 -119 -42930 -29032 -16827 -8540 -11619 -32171 -38411 -42198 -21362 -1228 -2609 -3280
13499c280l4050k2053J1881L9041l288j4567R535J4466k822J937K1776k259k1864
$$ -3280 -37330 -59383 -47502 -8461 -11749 -26316 -16781 -2315 -5137 -3200 18576 16317 -5547
13486e547j287K13K386j3423k956J0489K3428k39j7914j9686j9582J2859K0868
$$ -5547 -6834 -6621 -4235 -17658 -20614 -10125 13303 13064 -4850 -24536 -44118 -31259 -10391
13473a0391J6206j9028m067R195O881J9605K3209J5626l963j6359r861n22j7208
$$ -10391 5815 -13213 -17280 -8085 -1204 18401 41610 57236 53273 36914 27053 26531 9323
13460I323Q250P386J6942n671l3327j5121K6857q4j2497l0678J9063M245K8764
$$ 9323 17573 24959 41901 36230 2903 -12218 14639 14555 2058 -28620 -9557 -5312 23452
13447B3452j2407m0370j028K2736p214K0016J0028Q962J6359P108l287k1597j2096
$$ 23452 11045 -29325 -30353 -7617 -14831 5185 15213 24175 40534 47642 44355 22758 10662
13434A0662J3273J5530p413k2282k0398k523J2245J3015m397j782j3387k6023
$$ 10662 23935 39465 32052 9770 -10628 -13151 -906 12109 7712 5930 -7457 -33480
13422c3480J5338K4847Q225j1102J039O107j9198j017Q247J6722Q931J1954k3947
$$ -33480 -18142 6705 14930 3828 4867 10974 -8224 -9241 -994 15728 24659 36613 12666
13409A2666j5980L4338J2024Q70j7530O20l5884o847K9840j7746j2638j745j1015
$$ 12666 -3314 31024 43048 43918 26388 27008 -8876 -15723 14117 -3629 -16267 -18012 -29027
13396b9027o589P44m399p837j0170O25Q865P552L3110L0818m491j8723k712L4942
$$ -29027 -35616 -34872 -39271 -47108 -57278 -56653 -47788 -40236 -7126 23692 19201 478 -2234 32708
13382C2708K8475m4972j8270J4186J2625k222j5262m2949k2354k221L7519K2416
$$ 32708 61183 16211 -2059 12127 24752 22530 7268 -35681 -58035 -60256 -22737 -321
13370c21m243j5006r374k291o424K9650M3842Q442j1843j559l0420l269L1725
$$ -321 -4564 -19570 -28944 -31235 -37659 -8009 35833 44275 32432 30873 453 -2816 28909
13357B8909k962k62o644k0440m168J307K2802J9988j0916j112k0335l4704J5258
$$ 28909 25947 25685 19041 -1399 -5567 -4260 18542 38530 27614 26502 6167 -28537 -13279
13344a3279K7532J0820k0000o282J7766q13o234l1990J8033K4235M970k6777N25
$$ -13279 14253 25073 5073 -1209 16557 15744 9510 -22480 -4447 19788 24758 -2019 -1494
13331a494J4387n086J2676k849j1562n040L3448K3121Jj2696j6624j9019p682
$$ -1494 12893 7807 20483 17634 6072 1032 34480 57601 57602 44906 28282 9263 1581
13318A581P755k5748k6663j6886K6014J9986K9176K8035l880q811l3060j069j0578
$$ 1581 9336 -16412 -43075 -59961 -33947 -13961 15215 43250 39370 30559 -2501 -3570 -14148
13305a4148l2085k2054l2205j4800J9402K8416K3679j188j3210J5055L9462L056
$$ -14148 -46233 -68287 -100492 -115292 -95890 -67474 -43795 -44983 -58193 -43138 -3676 -620
13293f20l4065J0428K8701L1263k1621k8097J0660k1620n299J6473J6057J74k524
$$ -620 -34685 -24257 4444 35707 14086 -14011 -3351 -24971 -30270 -13797 2260 2434 -90
13280i0J4698j3757k603J3152j1373p654J144J2159j319N842p307l381l1528j0736
$$ -90 14608 851 -1752 11400 27 -7627 -6483 5676 4357 10199 2892 -489 -32017 -42753
13266d2753K0970L0343K7915K2736j2892k0586k8987K8728J6638o240R23J6678
$$ -42753 -21783 8560 36475 59211 46319 25733 -3254 25474 42112 35872 36795 53473
13254E3473l6245k6185M035J7842j0477j1532j8159O688R569j227j8537R168Q741
$$ 53473 17228 -8957 -4922 12920 2443 -9089 -27248 -20560 -10991 -12218 -30755 -21587 -12846
13241a2846n098L4774kj2934q482Q240j8977J8319M162k4184K835k2210j5346
$$ -12846 -17944 16830 16828 3894 -4588 3652 -15325 2994 7156 -17028 -14193 -36403 -51749
13228e1749O586J4398J7745o828K110L2726K311j4728J4185J8056R753k7542j5125
$$ -51749 -45163 -30765 -13020 -19848 -17738 14988 17299 2571 16756 34812 44565 17023 1898
13215A898Q767J3734n403j2704k1291l3802J8279J0897k621o803J6141J3810o027
$$ 1898 10665 24399 18996 6292 -14999 -48801 -30522 -19625 -22246 -29049 -12908 902 -5125
13202e125L312j8167J4765K9585J8575k2605l8325J3057K2134j2657o13O201K458
$$ -5125 -1813 -19980 -5215 24370 42945 20340 -17985 -4928 17206 4549 3936 10137 12595
13189A2595q690m44M093k581j6255J5457L293r253k0943J2867K2732J5962k8397
$$ 12595 3905 3461 7554 4973 -11282 4175 7468 -1785 -22728 -9861 12871 28833 436
13176D36k6027J1126M101N3527l444p660J6209p851j5282k9404j437N5244L331
$$ 436 -25591 -14465 -10364 43163 39719 32059 48268 40417 25135 -4269 -5706 49538 52869
13163E2869k1463m630M699J0372J719k6840j5454R150J2467J8587j225l946k4080
$$ 52869 31406 26776 31475 41847 43566 16726 1272 10422 22889 41476 40251 36305 12225
13150A2225k225L0367k4538k8788n712P173q035O949K2790N002j585o000O409
$$ 12225 10000 40367 15829 -12959 -18671 -11498 -19533 -12584 10206 15208 13623 7623 14032
13137A4032k557J4026o534q515J175n03k328n093q964p822j3202p935J5148L8764
$$ 14032 11475 25501 18967 10452 11627 11124 8796 3703 -5261 -13083 -26285 -34220 -19072 19692
13123A9692j1516l3762N15M1426K586m0866p272q245j108K9831l435o593L5391
$$ 19692 8176 -25586 -25071 16355 18941 -21925 -29197 -37442 -38550 -8719 -12154 -18747 16644
13110A6644K3745J2712J268k4643j6329m66O8k867R972m509L1186J4842j2415
$$ 16644 40389 53101 54369 29726 13397 12931 12999 10132 20104 15595 46781 61623 49208
13097D9208k9116l4382j5224J7291J7941j056j2133j6920j2234j736L657K035
$$ 49208 20092 -14290 -29514 -12223 5718 4662 -7471 -24391 -36625 -38361 -34704 -32669
13085c2669K635R645q662J7028l4664J4415N736J1707K1518P513N989n734J5297
$$ -32669 -30034 -20389 -29051 -12023 -46687 -32272 -26536 -14829 6689 14202 20191 14457 29754
13072B9754j3862l1368k3797J0364K5638J3913j6839J3824L1021j5012k0776j6427
$$ 29754 15892 -15476 -39273 -28909 -3271 10642 -6197 7627 38648 23636 2860 -13567
13060a3567l729j6463j4586J4934J5658P203k2765k8666L092P916J5856K5603
$$ -13567 -17296 -33759 -48345 -33411 -17753 -10550 -33315 -61981 -58889 -50973 -35117 -9514
13048i514J7464j2693k7378k6905k2962L4106J4401M4734l174j2212L764j1115
$$ -9514 7950 -4743 -32121 -59026 -81988 -47882 -33481 11253 8079 -4133 -369 -11484
13036a1484K0632o337j4562P74K2604p612P875n987j3040l579R28O808J0567K4716
$$ -11484 9148 2811 -11751 -10977 11627 4015 11890 5903 -7137 -10716 -9788 -2980 7587 32303
13022C2303j4686q96m885j8468m241k4905k0506j0440j9156K612Q56P670K3915
$$ 32303 17617 16721 11836 -6632 -10873 -35778 -56284 -66724 -85880 -83268 -82412 -74742 -50827
13009e0827O121K8198K3915M674l5420j4102m068L1268J3573j107J200K8331m501
$$ -50827 -44706 -16508 7407 12081 -23339 -37441 -41509 -10241 3332 2225 3425 31756 27255
12996B7255r952o402l5489j450K2924M7046K8332l1841k9098j0054j1605M284
$$ 27255 17303 10901 -24588 -26038 -3114 43932 72264 40423 11325 1271 -10334 -6050
12984f050q69K5282j392k8647J1553R61r472l4240j8052J7347L128q599r042J9136
$$ -6050 -6919 18363 16971 -11676 -123 838 -8634 -42874 -60926 -43579 -40451 -49050 -58092 -38956
12970c8956k571j8879M02k744K053L1523L3609K24l3309o063L1121K4059M100
$$ -38956 -41527 -60406 -60004 -62748 -60695 -29172 4437 4661 -28648 -34711 -3590 20469 24569
12957B4569J2910K218p687j2069Q768K6470j5994k1323r27M826j0063j2030j0875
$$ 24569 37479 39697 32010 19941 28709 55179 39185 17862 16935 21761 11698 -332 -11207
12944a1207j4243j3527J4885J0656K653J5356O595m1572o240p655j922o07J2628
$$ -11207 -25450 -38977 -24092 -13436 -10783 4573 11168 -30404 -36644 -44299 -46221 -46828 -34200
12931c4200L4721K0861J0166k5760j4740N619j1183J7027K4341J1119P129k331
$$ -34200 521 21382 31548 5788 -8952 -3333 -14516 2511 26852 37971 45100 42769
12919D2769k3839M668J3912J6699j6918k0371J34K9261J2335r276J494k478k5215
$$ 42769 18930 23598 37510 54209 37291 16920 17054 46315 58650 49374 50868 48390 23175
12906B3175m9254l4706j0371K2690M4636L3321q834j2603R529L5462J9660N565
$$ 23175 -26079 -60785 -71156 -48466 -3830 29491 20657 8054 17583 53045 72705 78270
12894G8270k0912j8576l5310l1559J8435k38J6020p612j1786L411O977J1511k14
$$ 78270 57358 38782 3472 -28087 -9652 -9890 6130 -1482 -13268 -9857 -2880 8631 8417
12881H417j1188J7604j2188j724J8557Q114j1165l1671R848K0773J5345k3821
$$ 8417 -2771 14833 2645 921 19478 27592 16427 -15244 -5396 15377 30722 6901
12869F901l5685M1961L0477K4986k657j9717k1572n0449k905M9378J7650j6208
$$ 6901 -28784 13177 43654 68640 65983 46266 24694 -25755 -28660 20718 38368 22160
12857B2160l8811k4581m038J1025J9908K6421L10j6499m126l20K381j2656j861
$$ 22160 -16651 -41232 -45270 -34245 -14337 12084 12394 -4105 -8231 -8551 -6170 -18826 -20687
12844b0687J2857K2633o602k334K4281k1267k4696J9567J2898N903P181r032P858
$$ -20687 -7830 14803 8201 5867 30148 8881 -15815 3752 16650 22553 29734 20702 28560
12831B8560k2271k9961p447J0366N2374l526k5883O775j3691j5513J650J1822
$$ 28560 6289 -23672 -31119 -20753 31621 28095 2212 8987 -4704 -20217 -18567 -6745
12819f745J0126j7206K77Q492k4518r494R122J3967j1094J5741L2530J7801l4329
$$ -6745 3381 -13825 -13548 -5056 -29574 -39068 -29946 -15979 -27073 -11332 21198 38999 4670
12806D670k115L93k2634R548O311q167n585l868L579K9224K414k8153k3257n067
$$ 4670 2555 2948 -19686 -10138 -3827 -11994 -17579 -21447 -17868 11356 13770 -14383 -37640 -42707
12792d2707n851m739m041K846L965J7466J8540L012k885P159Q661J6853J6955
$$ -42707 -48558 -53297 -57338 -54492 -50527 -33061 -14521 -11509 -14394 -7235 1426 18279 35234
12779C5234j2244j1082l0038J0947K1231M456j7861r133M2162J5790j6188k9440
$$ 35234 22990 11908 -18130 -7183 14048 18504 643 -8490 33672 49462 33274 3834
12767C834K115R692J2156O217K464j9994P366P783k120o58k6789q417j861k6170
$$ 3834 5949 15641 27797 34014 36478 16484 23850 31633 29513 28855 2066 -6351 -8212 -34382
12753c4382r93p730K5590K4855J0556m5253j5453J0492K193K595k78Q735L672
$$ -34382 -35375 -43105 -17515 7340 17896 -27357 -42810 -32318 -30125 -27530 -27808 -19073 -15401
12740a5401K3290O303j3750p606m759k146R005J8688m5009r338p119R101M8090
$$ -15401 7889 14192 442 -7164 -11923 -14069 -5064 13624 -31385 -40723 -47842 -38741 9349
12727I349J4410J6369K57l2860m89K2843k0589J4043J6801k8081q168J8660K954
$$ 9349 23759 40128 40385 7525 7036 29879 9290 23333 40134 12053 3885 22545 25499
12714B5499k0852Kk1382k740J0111J9831N929j4595L0856J0207Q986k5637k4118
$$ 25499 4647 4649 -16733 -19473 -9362 10469 16398 1803 32659 42866 51852 26215 2097
12701B097K145L5477J6432k8042l1198j0196k0904J0257J7035l785L0781K4005
$$ 2097 4242 39719 56151 28109 -3089 -13285 -34189 -23932 -6897 -10682 20099 44104
12689D4104K9474j4648k3214K8013J4544r390j9283j8567k8912m2406N355j086
$$ 44104 73578 58930 35716 63729 78273 68883 49600 31033 2121 -40285 -34930 -36016
12677c6016K4424M330N450K3165j0627O81l374L2238Q33m7191l5492j6054J12
$$ -36016 -11592 -7262 -1812 21353 10726 11407 8033 40271 41104 -6087 -41579 -57633 -57521
12664e7521n38J5301Q939k9617j6022J8946R679J3617J8851J9396N173q205O991
$$ -57521 -58059 -42758 -33819 -63436 -79458 -60512 -50833 -37216 -18365 1031 6204 -2001 4990
12651D990p415k8060j0140P387m974J2967K191J378J9396K1437j6442K5018K3133
$$ 4990 -2425 -30485 -40625 -33238 -38212 -25245 -23054 -21676 -2280 19157 2715 27733 50866
12638E0866N530k5124j3546j6792j9397o766j989J1618J7647j548m660o037k4457
$$ 50866 56396 31272 17726 934 -18463 -25229 -27218 -15600 2047 499 -4161 -10198 -34655
12625c4655M174N096Q85J3662p995O69N236K8918k6974j8991K2485J4321P686
$$ -34655 -30481 -25385 -24500 -10838 -18833 -18164 -12928 15990 -10984 -29975 -7490 6831 14517
12612A4517l122k8150j0198J2695N348Q01K7525l939P420L7206N574j0368l3210
$$ 14517 11395 -16755 -26953 -14258 -8910 -8109 19416 15477 22897 60103 65677 55309 22099
12599B2099l3086k660o400P46K1576N830J0510K1848O017j7215k5344j8649m0712
$$ 22099 -10987 -13647 -20047 -19301 2275 8105 18615 40463 46480 29265 3921 -14728 -55440
12586e5440R505M0492J6176k5710j4650O482m400k5586R631L2268M714J612M944
$$ -55440 -45935 -5443 10733 -14977 -29627 -23145 -27545 -53131 -43500 -11232 -6518 -4906 38
12573C8K9635l260j0257J0050Q580n80N359j3444k2681M12J4049J219j9353l5240
$$ 38 29673 26413 16156 26206 34786 34206 39565 26121 3440 3852 17901 19120 -233 -35473
12559c5473J2828M854O8M0894m012J0727j7038l9993k6604k415J4262O675m947
$$ -35473 -22645 -17791 -17723 23171 19159 29886 12848 -27145 -53749 -56164 -41902 -35227 -40174
12546d0174n074o254J4653K9021J1912J7121J7266j9500l9798J5355P835Q723
$$ -40174 -45248 -51502 -36849 -7828 4084 21205 38471 18971 -20827 -5472 2363 11086
12534A1086p419p48J1119K2855J9255k1971m7344k2763O216o139j6822K0443J0019
$$ 11086 3667 2919 14038 36893 56148 34177 -13167 -35930 -29714 -35853 -52675 -32232 -22213
12521b2213k3655j4824L6815L0893O796j2419j2010j0256m195J2271R87L695j6030
$$ -22213 -45868 -60692 -23877 7016 13812 1393 -10617 -20873 -25068 -12797 -11810 -8115 -24145
12508b4145j3123K5908L219j772J5364r687J293J9889J1951j1532Q197N585K1324
$$ -24145 -37268 -11360 -8141 -9913 5451 -4236 -2943 16946 28897 17365 25562 31147 52471
12495E2471j8243J8050j7674L099m505j5086j2538q154K665K5738r65k7044k1570
$$ 52471 34228 52278 34604 37703 33198 18112 5574 -2580 85 25823 24858 -2186 -23756
12482b3756P566J4694J1466j4216J691K0994q292o413p866j1410J6536k0573j8348
$$ -23756 -16190 -1496 9970 -4246 -2555 18439 10147 3734 -4132 -15542 994 -19579 -37927
12469c7927L3022L5109Q519k8042j6470J7486l597J0153J8053j2100l8415J3050
$$ -37927 -4905 30204 38723 10681 -5789 11697 8100 18253 36306 24206 -14209 -1159
12457a159Q870J1274n600k2299L0477n543J05l011m740r292l058K3110j0212l0095
$$ -1159 7711 18985 13385 -8914 21563 16020 16125 13114 8374 -918 -3976 19134 8922 -21173
12443b1173j1547M889k597K1994K2689k6524j5761J7233l222L863K712j8829p836
$$ -21173 -32720 -27831 -30428 -8434 14255 -12269 -28030 -10797 -14019 -10156 -7444 -26273 -34109
12430c4109J5284J6642O187M789j2054l566l1013j3598J635J7997K3553K773o394
$$ -34109 -18825 -2183 4004 8793 -3261 -6827 -37840 -51438 -49803 -31806 -8253 -5480 -11874
12417a1874j4165p316J9423K0099r030q734M340K0673j0193J0292k2636j7738
$$ -11874 -26039 -33355 -13932 6167 -2863 -11597 -7257 13416 3223 13515 -9121 -26859
12405b6859m295p63J5095O3721K1658j8041j105K8846j1656k98j4174l2171k4391
$$ -26859 -31154 -31917 -16822 46899 68557 50516 49411 78257 66601 66303 52129 19958 -4433
12392d433J6590J8709n793j7984j5634p959J4572N689K5440k9414l0702j082K4937
$$ -4433 12157 30866 25073 7089 -8545 -16504 -1932 3757 29197 -217 -30919 -32001 -7064
12379g064L8979J7108j8824q410n973j2148j5006k4175j8417L8149L8628k2018
$$ -7064 31915 49023 30199 21789 15816 3668 -11338 -35513 -53930 -15781 22847 829
12367H29l7261L963j673o198k088O462J5580J9614Q37K3445m904m1187k0986P978
$$ 829 -36432 -32469 -34142 -40340 -42428 -35966 -20386 -772 65 23510 18606 -22581 -43567 -35589
12353c5589M0971j4164l6127K3048K7869Q560j5177j0428R14O4K0490K0749n750
$$ -35589 5382 -8782 -44909 -21861 6008 14568 -609 -11037 -10123 -10059 10431 31180 25430
12340B5430J1205J2850K34l7447P361R973J4444L4613J4627M7881Q5897J08273
$$ 25430 36635 49485 49719 12272 19633 29606 44050 78663 93290 141171 227068 335341
12328C35341J36585J44476J43578J13737O5137m08l9594p1394j36134j41835j08479
$$ 335341 471926 616402 759980 873717 938854 938446 898852 827458 691324 549489 441010
12317D41010j11997n6927q7076l6587k2263j9645k7037j5602j8294K0948K5300
$$ 441010 329013 272086 185010 148423 126160 106515 79478 63876 45582 66530 91830
12306I1830l9772n5917J4700N15j6555J8095K9279k6467p341P55j199K3689L482
$$ 91830 52058 -3859 10841 11356 -5199 12896 42175 15708 8367 9122 7923 31612 35094
12293C5094k0110l5999j2917J3070J8097J0712j7959L776r836j8928Q907m95J0665
$$ 35094 14984 -21015 -33932 -20862 -2765 7947 -10012 -6236 -16072 -35000 -26093 -26588 -15923
12280a5923M987l856J0739l5927K13K1581J8713J9479R696j8816j7605j3338l572
$$ -15923 -10936 -14792 -4053 -39980 -39767 -18186 527 20006 29702 10886 -6719 -20057 -23629
12267b3629K4392L634m9595J1919J2096r421j4309N943R123j1663k8575K5595
$$ -23629 763 4397 -45198 -33279 -21183 -30604 -44913 -38970 -29847 -41510 -70085 -44490
12255d4490R566J6276J549P420K3010N015L161j6460j6963J9747j8867k0836j4942
$$ -44490 -34924 -18648 -17099 -9679 13331 18346 21507 5047 -11916 7831 -11036 -31872 -46814
12242d6814N495q498L6537K2228K7192Q692r552K917q028l972Q74J3180N799p673
$$ -46814 -41319 -49817 -13280 8948 36140 44832 35280 38197 30169 26197 27071 40251 46050 38377
12228C8377j9543J2412L265k0372R712n881m221Q189k1811K948N980J3764l7071
$$ 38377 18834 31246 34511 14139 23851 17970 13749 21938 127 3075 9055 22819 -14252
12215a4252m2378J5733M8422L6185J6174j0293j9377J4374j060m50O445m0945
$$ -14252 -56630 -40897 7525 43710 59884 49591 30214 44588 43528 43078 49523 8578
12203H578k2335M645K4162L3560q595k9980k9930J2287Q013K7038j4177m83k1516
$$ 8578 -13757 -9112 15050 48610 40015 10035 -19895 -7608 405 27443 13266 12783 -8733
12190h733j3077o108N056m1190l563M7645K9620L5322n745k3485j5474k9696M768
$$ -8733 -21810 -27918 -22862 -64052 -67615 -19970 9650 44972 39227 15742 268 -29428 -24660
12177b4660L3692M590O784L230M720k4531q829L1471l322k863o215k8793q763
$$ -24660 9032 13622 20406 23636 28356 3825 -5004 26467 23145 20282 14067 -14726 -23489
12164b3489O743O052J096J3156J251n104k3456J4238n95l1880M1118M5187l4591
$$ -23489 -16746 -10694 -9598 3558 4809 -295 -23751 -9513 -10108 -41988 -870 44317 9726
12151I726O187O196l567k0887l810J9661j832r38k5251R185K9609P935j9970J2946
$$ 9726 15913 22109 18542 -2345 -6155 13506 11674 10736 -14515 -5330 24279 32214 12244 25190
12137B5190Q603o230r293q403l2524m911J0193p486J0030L5717J5839o635k6536
$$ 25190 33793 27563 18270 9867 -22657 -27568 -17375 -24861 -14831 20886 36725 30090 3554
12124C554o496q271k591N138J0637J4523L537P555k2254j2761O731J6958J0252
$$ 3554 -2942 -11213 -13804 -8666 1971 16494 20031 27586 5332 -7429 -698 16260 26512
12111B6512O701L079k3855O58J4502M0p81q811j3852j838l281J8545R81n640k4713
$$ 26512 33213 36292 12437 13095 27597 27637 26856 18045 4193 2355 -926 17619 18600 12960 -11753
12096a1753k8374O102L6155M601k4430L014K575k7844j9093J2225J3501O700j289
$$ -11753 -40127 -34025 2130 6731 -17699 -14685 -12110 -39954 -59047 -46822 -33321 -26621 -27910
12083b7910q278K1223K5909K048l3883n345L987L9535m303m5254l4262k1663R453
$$ -27910 -36188 -14965 10944 12992 -20891 -26236 -22249 17286 12983 -32271 -66533 -88196 -78743
12070g8743L5705M4782K5053k6709j29p922n978J2778j3938j2527K5580L5152
$$ -78743 -43038 1744 26797 88 -41 -7963 -13941 -1163 -15101 -27628 -2048 33104
12058C3104J7893j5961l896j0178k0585L4575j648J3889R219m1606k0976J1866
$$ 33104 50997 35036 31140 20962 377 34952 33304 47193 56412 14806 -6170 5696
12046E696l439j3850J0730L4007j302n642p692k2978O474J2328J0370R218n733
$$ 5696 2257 -11593 -863 33144 31842 26200 18508 -4470 2004 14332 24702 33920 28187
12033B8187j7397k4636r640K3866N588N00q505J494j0941J8338L3269j6042l8538
$$ 28187 10790 -13846 -23486 380 5968 6468 -2037 -543 -11484 6854 40123 24081 -14457
12020a4457R467J986j7380L8197L5316M474l3272l9090k4006J369J2457l734j0182
$$ -14457 -4990 -3004 -20384 17813 53129 57603 24331 -14759 -38765 -37396 -24939 -28673 -38855
12007c8855R901K2057K0677K2713J2926l8357L643J0856k5906j6465J3950K0097
$$ -38855 -28954 -6897 13780 36493 49419 11062 14705 25561 -345 -16810 -2860 17237
11995A7237l1614l2276n241J8559K4899P66m046Q856J2096j9097L0798J2084j7558
$$ 17237 -14377 -46653 -51894 -33335 -8436 -7670 -11716 -2860 9236 -9861 20937 33021 15463
11982A5463L829j3105j9850k7111J521J6834L970k311J496K8135J446K294j0540
$$ 15463 19292 6187 -13663 -40774 -39253 -22419 -18449 -20760 -19264 8871 10317 12611 2071
11969B071k561J485M433M671k7731L9092M151k8600K83K2081r564j3702j0855
$$ 2071 -490 995 5428 10099 -17632 21460 25611 -2989 -2706 19375 9811 -3891 -14746
11956a4746L6337J7251n603l9701k8400p755l182j7094l206J2755N349Q739J7452
$$ -14746 21591 38842 33239 -6462 -34862 -42617 -45799 -62893 -66099 -53344 -47995 -39256 -21804
11943b1804M1879k625M57j8103k0038J6935L8734j2326l7976k1919L6100j5493
$$ -21804 20075 17450 17907 -196 -20234 -3299 35435 23109 -14867 -36786 -686 -16179
11931a6179J4304K0370J880k5368J4907j1658l5654j7478N0959L2459K0578J3808
$$ -16179 -1875 18495 20375 -4993 9914 -1744 -37398 -54876 -3917 28542 49120 62928
11919F2928o456R645K2354l055l2367l5543l0961j4399P324J2608K0450j3262
$$ 62928 56472 66117 88471 85416 53049 17506 -13455 -27854 -20530 -7922 12528 -734
11907g34m3134o861P286J2143J4130J3507K1050P85j503k1675j0719L205J977
$$ -734 -43868 -50729 -43443 -31300 -17170 -3663 17387 18172 16669 -5006 -15725 -12520 -10543
11894a0543j4113l450l974K0722K7549K1534K5549K022l9070m4925j7905j0931
$$ -10543 -24656 -28106 -32080 -11358 16191 37725 63274 65296 26226 -18699 -36604 -47535
11882d7535k1780l982K8146L4392l4541p397J1609k508Q77K6300L9867j1960k7741
$$ -47535 -69315 -73297 -45151 -10759 -45300 -52697 -41088 -43596 -42719 -16419 23448 11488 -16253
11869a6253j2141j0527q972j6388L530L3293K1155J2817j0641J2432l264k1294
$$ -16253 -28394 -38921 -47893 -64281 -60751 -27458 -6303 6514 -4127 8305 5041 -16253
11857a6253j7940j0274j4612o835M6181J8435L533k4118k332J8458n915j5229
$$ -16253 -34193 -44467 -59079 -65914 -19733 -1298 2235 -21883 -24215 -5757 -11672 -26901
11845b6901k905K881j3547K3523L2199j7387j5074o873R046k4785m594J5164r51
$$ -26901 -29806 -26925 -40472 -16949 15250 -2137 -17211 -24084 -15038 -39823 -44417 -29253 -30204
11832c0204J2657J7343l547j1567O890N249J0711l508R46J17K8492J4131l0586
$$ -30204 -17547 -204 -3751 -15318 -8428 -3179 7532 4024 4970 5087 33579 47710 17124
11819A7124m3703Q461O356J461J292K5387j2884l645J7599K1351J2968k1429m6037
$$ 17124 -26579 -18118 -11762 -10301 -9009 16378 3494 -151 17448 38799 51767 30338 -15699
11806a5699j3956j7184j0847K2351L0195K7519l5428n0535N972K5912J9219M446
$$ -15699 -29655 -46839 -57686 -35335 -5140 22379 -13049 -63584 -57612 -31700 -12481 -8035
11794h035L687J4104N382n7119o3729J8399M5694J3781J3835K5264R424j7182
$$ -8035 -4348 9756 15138 -41981 -105710 -87311 -41617 -27836 -14001 11263 20687 3505
11782C505l4891m079J2241J5329Q984J1620J7091Q520l4044j6642n492R168m108
$$ 3505 -31386 -35465 -23224 -7895 1089 12709 29800 38320 4276 -12366 -17858 -8690 -12798
11769a2798J023L1043M431l0530k1790j9561j3534n479J3280N2989k436l6239
$$ -12798 -11775 19268 23699 -6831 -28621 -48182 -61716 -67195 -53915 -926 -3362 -39601
11757c9601n352J0358O709K5018J92m882k2916k3237J0122J1619J33M202j74K32
$$ -39601 -44953 -34595 -27886 -2868 -2676 -7558 -30474 -53711 -43589 -31970 -31837 -27635 -27809 -27577
11743b7577J666J4859L2796K0172r662l6999k1248L0685J3761j9259K1047J9069
$$ -27577 -25911 -11052 21744 41916 32254 -4745 -25993 4692 18453 -806 20241 39310
11731C9310m3068j7119J4209J3066Q577L086M653l6010q469Q600k3462m109J5774
$$ 39310 -3758 -20877 -6668 6398 14975 18061 22714 -13296 -21765 -13165 -36627 -40736 -24962
11718b4962K8066J3580J9573L784m4256R034K1403J4585P301K2425n3537k3950
$$ -24962 3104 16684 36257 40041 -4215 4819 26222 40807 48108 70533 16996 -6954
11706f954M696q106j5650k141k321K741K2709J9144K874O546j3496l981J481J380
$$ -6954 -2258 -10364 -26014 -28155 -30476 -27735 -5026 14118 16992 23538 10042 6061 7542 8922
11692H922Q84l9J7022R304l96l5724p707R048J2877q567l277k1657K2598j4337
$$ 8922 9806 9767 26789 36093 35697 -27 -7734 1314 14191 5624 2347 -19310 3288 -11049
11678a1049p846o322L260m48j4641K9491J4629O612o617m517l9976j328M4051
$$ -11049 -18895 -25217 -21957 -22405 -37046 -7555 7074 13686 7069 2552 -37424 -38752 5299
11665E299J0000Q722O808M070J474k2414m423l9377j0407j4434k5422K6262L9410
$$ 5299 15299 24021 30829 34899 36373 13959 9536 -29841 -40248 -54682 -80104 -53842 -14432
11652a4432m671j5329J195k070P666P067k544L148K8822K0423L155j0760k1995
$$ -14432 -19103 -34432 -33237 -35307 -27641 -20574 -23118 -19970 8852 29275 32430 21670 -325
11639c25k5582l4903J7608K6196J7173K2583J317R463k518j6524R932j8067j9357
$$ -325 -25907 -60810 -43202 -17006 167 22750 24067 33530 31012 14488 24420 6353 -13004
11626a3004L09r896m9741K033L0406J7795M5822J0253M276j4905k4344k5674J7258
$$ -13004 -12695 -22591 -72332 -70299 -39893 -22098 23724 33977 38253 23348 -996 -26670 -9412
11613i412p738j3256k213L2820K8674l9092J2231n976n741j5342j458K4601J0804
$$ -9412 -17150 -30406 -32619 201 28875 -10217 2014 -3962 -9703 -25045 -26503 -1902 8902
11600H902j8908k0122J6476K8467K9298k1818j1050J0633L239n88k1590p720r317
$$ 8902 -10006 -30128 -13652 14815 44113 22295 11245 21878 25117 24529 2939 -4781 -14098
11587a4098k3557N008j4212P673N220K0040J310O068j5264K4154N591k228j949
$$ -14098 -37655 -32647 -46859 -39186 -33966 -13926 -12616 -6548 -21812 2342 7933 5705 3756
11574C756r603j9058n144j6459L4671M7961Q5J0166Q042j6769l3543r954M628
$$ 3756 -5847 -24905 -30049 -46508 -11837 36124 36209 46375 54417 37648 4105 -5849 -1221
11561a221L555j1820j6364J6958j520J282P76j3317M045J0295j117J4501l6297
$$ -1221 2334 -9486 -25850 -8892 -10412 -9130 -8354 -21671 -17626 -7331 -8448 6053 -30244
11548c0244l74K3186K716K6514K9713j3060m5514j0037L8561o03k2962q962J5832
$$ -30244 -30618 -7432 -4716 21798 51511 38451 -7063 -17100 21461 20858 -2104 -11066 4766
11535D766K4440K034j5620J007j5192j1297K0550O87j6856N473k933k521O468
$$ 4766 29206 31240 15620 16627 1435 -9862 10688 11375 -5481 -8 -2941 -5462 1006
11522A006J390p670J9955o07j5981M451j5805j7444n000M0323n369k7138P205
$$ 1006 2396 -5274 14681 14074 -1907 2544 -13261 -30705 -35705 4618 -751 -27889 -20684
11509b0684M417k879j0512K7677j1682L727j4079k3250O797R856N650j4415K1398
$$ -20684 -16267 -19146 -29658 -1981 -13663 -9936 -24015 -47265 -40468 -30612 -24962 -39377 -17979
11496a7979R073m435P967m2594k2289j087J8352O9315J8422j9317r677k805p583
$$ -17979 -8906 -13341 -5374 -47968 -70257 -71344 -52992 16323 34745 15428 5751 2946 -4637
11483d637J9309l1055M349J9529r968k494J7897J3401l0611j03p22J4986j248
$$ -4637 14672 -16383 -12034 7495 -2473 -4967 12930 26331 -4280 -4383 -5105 9881 8633
11470H633r375K2130j7078n1072Q521M1139M1268o296k6970j2695k2842O107N019
$$ 8633 -742 21388 4310 -46762 -38241 2898 44166 37870 10900 -1795 -24637 -18530 -13511
11457a3511q50L343j23J4409j8194j4862l068k840K6468K9747j1481L260l1989
$$ -13511 -14361 -11018 -11141 3268 -14926 -29788 -32856 -35696 -9228 20519 9038 12298 -19691
11444a9691q421N669P00K5135j5062j7324m992N081J4099J3583K8904R377j74
$$ -19691 -28112 -22443 -21743 3392 -11670 -28994 -33986 -28905 -14806 -1223 27681 37058 36884
11431C6884j3728k3373j4348J0231J6327l8157J6956L439j9593J7301L71J6220
$$ 36884 23156 -217 -14565 -4334 11993 -26164 -9208 -5769 -25362 -8061 -7690 8530
11419H530j8450L861L0100l3822l3209o753K2261K3644l775l1512l0282k7518
$$ 8530 -9920 -6059 24041 -9781 -42990 -49743 -27482 -3838 -7613 -39125 -69407 -96925
11407i6925J4197L8533K3178m657J4092j975K3703k303k1171J6933K652l5652
$$ -96925 -82728 -44195 -21017 -25674 -11582 -13557 10146 7843 -13328 3605 6257 -29395
11395b9395r860j4922j6265r249J2751R821J4816r722M286k6676j806L2240J5411
$$ -29395 -39255 -54177 -70442 -79691 -66940 -57119 -42303 -52025 -47739 -74415 -76221 -43981 -28570
11382b8570L623L1069J054j6308l668o831N300J0312K9652M944j8397k9903j4235
$$ -28570 -24947 6122 7176 -9132 -12800 -19631 -14331 -4019 25633 30577 12180 -17723 -31958
11369c1958j4441K0921K0847j9166K452L0719K0795j6597N287J1407P195q982
$$ -31958 -46399 -25478 -4631 -23797 -21345 9374 30169 13572 18859 30266 37461 28479
11357B8479l8986J1829K5832K6142k0302j6916k3855O381Q066K617K2616J914
$$ 28479 -10507 1322 27154 53296 32994 16078 -7777 -1396 6670 9287 31903 33817
11345C3817l1794l0320k7311m72J7413K6797K2870K3129K5032O123l4303l2229
$$ 33817 2023 -28297 -55608 -56080 -38667 -11870 11000 34129 59161 65284 30981 -1248
11333a248K19J8952P0P74Q943p797p437P076j5372l157k4637k2004K4139K7322
$$ -1248 -1029 17923 17993 18767 27710 19913 12476 19552 4180 1023 -23614 -45618 -21479 5843
11319E843J4511o696k5635P725K8468K751j3507J1342N66L499k719j6375J5998
$$ 5843 20354 13658 -11977 -4252 24216 26967 13460 24802 25368 28867 26148 9773 25771
11306B5771K3115N760k6588l4500n137J9196R601n74J9851K9608K86r334R828
$$ 25771 48886 54646 28058 -6442 -11579 7617 17218 16644 36495 66103 66389 57055 66883
11293F6883K0545K9518O4912P4022N9202O9073K9749p681n7556o5334o1549m7492
$$ 66883 87428 116946 181858 255880 315082 384155 413904 406223 348667 283333 221784 174292
11281A74292n0936j5142n650k4941j8539m993m603q355j72l612o313J39p254n386
$$ 174292 123356 108214 102564 77623 59084 54091 49488 41133 40961 37349 31036 31175 23921 18535
11267A8535p841J9347j1379L9L973m752l1405j6685j274j054J8232K02j5887r481
$$ 18535 10694 30041 18662 18701 22674 17922 -13483 -30168 -31442 -32496 -14264 -14062 -29949 -39430
11253c9430O156J6520J4111Q580o086j0019k0648N484M780k1705k5581J7317J6677
$$ -39430 -33274 -16754 -2643 5937 -149 -10168 -30816 -25332 -20552 -42257 -67838 -50521 -33844
11240c3844L1439P250J0265Q248k684j60O644j5929j2789j3172p716J036M0622
$$ -33844 -2405 4845 15110 23358 20674 20514 27158 11229 -1560 -14732 -22448 -21412 19210
11227A9210P741l3801j5368O740j1209P078J3659J527L1139O13k8963j7436P321
$$ 19210 26951 -6850 -22218 -15478 -26687 -19609 -5950 -4423 26716 27329 -1634 -19070 -11749
11214a1749M233J5421K6243l140M943J1200k2874q048K8884K1877P467M806k7183
$$ -11749 -7516 7905 34148 31008 35951 47151 24277 16229 45113 66990 74457 79263 52080
11201E2080l5185o365l554o903K0567j80k666M86J251J5534Q305l220J0023m2385
$$ 52080 16895 10530 6976 73 20640 20460 17794 18280 19531 35065 43370 40150 50173 7788
11187G788n7198R169J1038M6617M0714j1003k3650J7526K6021N5573M6312O6731
$$ 7788 -49410 -40241 -29203 17414 58128 47125 23475 41001 67022 122595 168907 235638
11175B35638P8208L5877O671P084j4744k1423q6666n3332l9866m2637n1525k8789
$$ 235638 313846 349723 356394 363478 348734 327311 240645 187313 147447 104810 53285 24496
11163B4496j609j338k5508M372J959K917J5662J9758L9403J2259l0877j1341k7077
$$ 24496 22887 21549 -3959 413 2372 5289 20951 40709 80112 92371 61494 50153 23076
11150B3076J3143M835k2028j1171l3547n883K4146j2591p924K5312L2291j1739
$$ 23076 36219 41054 19026 7855 -25692 -31575 -7429 -20020 -27944 -2632 29659 17920
11138A7920k590j1997l6257l6447K818O652J3246J2664k23J4249M8260L9835j9756
$$ 17920 15330 3333 -32924 -69371 -66553 -59901 -46655 -33991 -34214 -19965 28295 68130 48374
11125D8374k8217J3726P637o21J7256J1466k4370l6536j2201L4814M247J4347
$$ 48374 20157 33883 41520 40899 58155 69621 45251 8715 -3486 31328 35575 49922
11113D9922Q76p594j2255l1883k1388j2285N379j894Q746K9466j800j6067n007
$$ 49922 50798 43204 30949 -934 -22322 -34607 -29228 -31122 -22376 7090 5290 -10777 -15784
11100a5784n970j310M056J9197K7571L019J600j3597j218J357k549J3724l43k7292
$$ -15784 -21754 -23064 -19008 189 27760 30779 32379 18782 17564 18921 16372 30096 29753 2461
11086B461p782l446j6873Q45p800q539L0725P265l0125K056K0908L273Q444J5052
$$ 2461 -5321 -8767 -25640 -24795 -32595 -41134 -10409 -3144 -33269 -31213 -10305 -7032 1412 16464
11072A6464k2955J629M465k4940L205l669k0207k548L596J8268P905J9710K6793
$$ 16464 -6491 -4862 -397 -25337 -22132 -25801 -46008 -48556 -44960 -26692 -18787 923 27716
11059B7716J2377j3252k3639q122O88j76o4J3438o758k389o815p028J9543k359
$$ 27716 40093 26841 3202 -4920 -4232 -4408 -4472 8966 2208 -181 -6996 -14024 5519 3160
11045C160M3K4123o571j314J4008O486j7338L619j4217K0605K962L741O237J2022
$$ 3160 3203 27326 20755 19441 33449 39935 22597 26216 11999 32604 35566 39307 45544 57566
11031E7566k6207k3453J8382M201q448j0027j2271L7397j366J644M033k0410k4343
$$ 57566 31359 7906 26288 30489 22041 12014 -257 37140 35774 37418 41451 21041 -3302
11018c302p318m627k0497j7408n958k3845k7328J3584J4450J9233J4705N609M58
$$ -3302 -10620 -15247 -35744 -53152 -59110 -82955 -110283 -96699 -82249 -63016 -48311 -42702 -42244
11005d2244K8598K1851Q120m957J3848j818P26m598k3129l669J4095P185q104
$$ -42244 -13646 8205 16325 11368 25216 23398 24124 19526 -3603 -7272 6823 14008 5904
10992E904o713L615J4400L3179J380k3723o073J606k861m624j5825L773J727J6936
$$ 5904 -809 2806 17206 50385 51765 28042 21969 23575 20714 16090 265 4038 5765 22701
10978B2701O066R943n666k109k8682K264J2034j1696j7909K993L014J8809j024
$$ 22701 28767 38710 33044 30935 2253 4517 16551 4855 -13054 -10061 -7047 11762 10738
10965A0738K0584J7993J5312p40O86j6921k642o612n26r00k7424J6053M545j2227
$$ 10738 31322 49315 64627 63887 64573 47652 45010 38398 37872 36972 9548 25601 30146 17919
10951A7919j5906L9533J4674k0636k056J1103J649K8212j0128M809j7849k3217
$$ 17919 2013 41546 56220 35584 33528 44631 46280 74492 64364 69173 51324 28107
10939B8107k9124J602K1430K6462k3988L417k5939O022L9725J0544M254j8245
$$ 28107 -1017 585 22015 48477 24489 27906 1967 7989 47714 58258 62512 44267
10927D4267l8722p445j495p530N874k025K840J1347p333p551J6459M3121K7085
$$ 44267 5545 -1900 -3395 -10925 -5051 -7076 -4236 7111 -222 -7773 8686 51807 78892
10914G8892k4528j4403K6578l951N167K7087J3938l3792k1335j9805k4800n203
$$ 78892 54364 39961 66539 62588 67755 94842 108780 74988 53653 33848 9048 3845
10902C845K4022J3661J2908k1585j1659j4694r394M654l774o446P441K6835M096
$$ 3845 27867 41528 54436 32851 21192 6498 -2896 1758 -2016 -8462 -1021 25814 29910
10889B9910j784K0489o179r720m977q266l1183r446K3226N579J3880j4083p262
$$ 29910 28126 48615 42436 32716 27739 19473 -11710 -21156 2070 7649 21529 7446 184
10876A84Q457m004Q102J2373o221j2686L055K2978K7366n27J4944j582L2134K039
$$ 184 8641 4637 12739 25112 18891 6205 9260 32238 59604 59077 74021 72439 104573 106612
10862A06612j0402J0919j4235J6369K1109r958k5543o902o29J3995L734K0448
$$ 106612 96210 107129 92894 109263 130372 120414 94871 87969 87340 101335 105069 125517
10850A25517O0812M6824N3142O1307R2414J27071K35296L02402K44829J38617
$$ 125517 186329 233153 286295 347602 440016 567087 802383 1104785 1349614 1488231
10840A488231J63023K88157K00171q2729k12732j85079j23615k03600k67260k75759
$$ 1488231 1651254 1939411 2139582 2056853 1844121 1659042 1535427 1331827 1064567 788808
10830G88808k23422j79982p5208l1468n4621l5483k2382K2444k7262m4750k6883
$$ 788808 565386 385404 310196 278728 224107 188624 166242 188686 161424 116674 89791
10819H9791j809q343n25j4098l6335R74K6455r615r407k0020J3240L1310M111
$$ 89791 87982 79639 79114 65016 28681 29655 56110 46495 37088 17068 30308 61618 65729
10806F5729j7046j4755L313R479P217N398p475m0581r190L8729k0350n7248k933
$$ 65729 48683 33928 37241 46720 53937 59335 51860 11279 2089 40818 20468 -36780 -39713
10793c9713L1477J2238K2739J3035J1832J4481k3587j8665J4309J1426J3408K717
$$ -39713 -8236 4002 26741 39776 51608 66089 42502 23837 38146 49572 62980 65697
10781F5697j7048m892n746P316j4840j2903M069L5885K3925j2309j2585k5163
$$ 65697 48649 43757 38011 45327 30487 17584 21653 57538 81463 69154 56569 31406
10769C1406J6444k513q682j2360r121K679j032K6522J6708R137n500R718k4414
$$ 31406 47850 45337 36655 24295 15174 17853 16821 43343 60051 69188 63688 73406 48992
10756D8992k2158K2174J5828J3616M3407M4293N1456L5077J1591j2285n3140n9725
$$ 48992 26834 49008 64836 78452 121859 166152 217608 252685 264276 251991 198851 139126
10744A39126l5267j8446k5147q747j7218j0955m6108j5191M0508K1698p480M183
$$ 139126 103859 85413 60266 51519 34301 23346 -22762 -37953 2555 24253 16773 20956
10732B0956J876j8761J2890K6286R856J9976r5Q969L606j4378k5919j7227k7763
$$ 20956 22832 4071 16961 43247 53103 73079 72984 81953 85559 71181 45262 28035 272
10719B72J2202L3430J9576J4352L223K2597k4869J9413j7213j8896L715o250p815
$$ 272 12474 45904 65480 79832 83055 105652 80783 100196 82983 64087 67802 61552 53737
10706E3737R782K7124Q272J0475O676n652j372k5518k0498L0093N9542K2391J9747
$$ 53737 63519 90643 98915 109390 116066 110414 109042 83524 63026 93119 152661 175052 194799
10693A94799N9936M9492R602q230L6316M4496L219j9837j9407o0694k6590q362
$$ 194799 254735 304227 313829 305599 341915 386411 389630 369793 350386 289692 263102 254740
10681B54740l8040k1339J0139m670j7492j5252q13Q0813Q8728J08625J80074K83725
$$ 254740 216700 195361 205500 200830 183338 168086 167273 248086 336814 445439 625513 909238
10669I09238K43032o0265k18992k53446j93466j08982m3536n3001n5080j6410
$$ 909238 1152270 1092005 873013 619567 426101 317119 273583 220582 165502 149092
10659A49092j478r547j7279N859k9728k914J1190k0679p278R441M906K1101N271
$$ 149092 147614 138067 120788 126647 96919 94005 105195 84516 77238 86679 91585 112686 117957
10646A17957l920j0452l0975l4636J1304R131J0804l4841k6589j4433K85j0574
$$ 117957 114037 103585 72610 37974 49278 58409 69213 34372 7783 -6650 -6365 -16939
10634a6939k9372o731j1513Q106P637N1119k9242j4915K7971p577K509J1008L4870
$$ -16939 -46311 -53042 -64555 -56449 -48812 2307 -26935 -41850 -13879 -21456 -18947 -7939 26931
10621B6931J0771J9201O574P664J862j2234J9831L0856J5230j0856k647k0040
$$ 26931 37702 56903 63477 71141 73003 60769 80600 111456 126686 115830 113183 93143
10609I3143m4242O928K5416J7945J4234L393J5168L1476K7584K0099P326p72M0342
$$ 93143 48901 55829 81245 99190 113424 116817 131985 163461 191045 211144 218470 217698 258040
10596B58040N0254P4121Q4341M5470L4958J7633o126n7963n2998o2801k5188m0054
$$ 258040 308294 382415 466756 512226 547184 564817 558691 500728 447730 384929 359741 319687
10584C19687k6901k7806k1771j5094m074K0127R134J3102k756K0299L9493O1951
$$ 319687 292786 264980 243209 228115 224041 244168 253302 266404 263648 283947 323440 385391
10572C85391J10364J43488J04711N6716O0475J40828J43031L8501n1770o3530
$$ 385391 495755 639243 743954 800670 861145 1001973 1145004 1183505 1131735 1068205
10562A068205l2891k2805p1766j20002j29852q6562o9198o9363q0155k3825Q84
$$ 1068205 1035314 1012509 940743 820741 690889 604327 535129 465766 385611 361786 362670
10551C62670j5568l9106l2565O987j2117J4368l127R427l924J0842K425l3707
$$ 362670 347102 307996 275431 282418 270301 284669 281542 290969 287045 297887 300312 266605
10539B66605K2015L2846J1018L043k676P458j0876k5267j3205J65K96L5665J9064
$$ 266605 288620 321466 332484 335527 332851 340309 329433 304166 290961 291126 291422 327087 346151
10526C46151J6265J9855o98j8382L2393L5329K0528k288R753K465n122J6272K3719
$$ 346151 362416 382271 381573 363191 395584 430913 451441 449153 458906 461371 456249 472521 496240
10513D96240K5138O686L480K5910m8195j6848L3040L5519k3485j2552J2326K4828
$$ 496240 521378 528064 531544 557454 509259 492411 525451 560970 537485 524933 537259 562087
10501E62087N5707L3967J537q153K5251N3770L7049O4816N3708K2367n013q659
$$ 562087 617794 651761 653298 645145 670396 724166 761215 826031 879739 902106 897093 888434
10489H88434K5784N7976P2348J8816J8822J3557M7591O0074O3756M3405Q1158
$$ 888434 914218 972194 1044542 1063358 1082180 1095737 1143328 1203402 1267158 1310563 1391721
10478A391721J04258R8018J20642J20809J41822J60543K03398K10138K53913K76210
$$ 1391721 1495979 1593997 1714639 1835448 1977270 2137813 2341211 2551349 2805262 3081472
10468C081472K72271L02679L38667L75191L99617M55145N33293O62654P04245
$$ 3081472 3353743 3656422 3995089 4370280 4769897 5225042 5758335 6420989 7125234
10459G125234O25753P25878Q99068J093012J055042J013498J070214J302854J669749
$$ 7125234 7750987 8476865 9375933 10468945 11523987 12537485 13607699 14910553 16580302
10450A6580302K019623K372593L000752M205227O204537R343695J4377242K2831675
$$ 16580302 18599925 20972518 23973270 28178497 34383034 43726729 58103971 80935646
10442H0935646L6508548N3912511N6236517L3093435K7622521M5921474N3333236
$$ 80935646 117444194 171356705 227593222 260686657 288309178 334230652 387563888
10435C87563888J2985419l2592804l6935461k6827704l0163642m8913661n1719082
$$ 387563888 400549307 367956503 331021042 304193338 274029696 225116035 173396953
10428A73396953m6206868l5631378k3370390j5138827j0353630p232098n248907
$$ 173396953 127190085 91558707 68188317 53049490 42695860 35463762 30214855
10421C0214855m104163l299244k564154k092648j837571j551906j223225j126007
$$ 30214855 26110692 22811448 20247294 18154646 16317075 14765169 13541944 12415937
10413A2415937j176571j087204r03303q01226q05917p26815n89522m27570l68294
$$ 12415937 11239366 10152162 9248859 8447633 7641716 6914901 6325379 5897809 5529515
10404E529515l34351j87032p2018j50490k68743l02158k68077k65668k86803k95841
$$ 5529515 5195164 5008132 4936114 4785624 4516881 4214723 3946646 3680978 3394175 3098334
10394C098334k56336k28357j70123j65548j60213j07992r4542q9329r8411r5470
$$ 3098334 2841998 2613641 2443518 2277970 2117757 2009765 1915223 1825894 1727483 1632013
10384A632013p5635n7177o3148n3818n3557m6727m0604p7598m8726l7267j5015
$$ 1632013 1556378 1499201 1436053 1382235 1328678 1281951 1241347 1163749 1115023 1077756 1062741
10373A062741l0412m3773n2710l3865m1832m9226l1168k5009k4297l6384j5429
$$ 1062741 1032329 988556 935846 901981 860149 810923 779755 754746 730449 694065 678636
10362F78636m5241m3397j6146j5499K5043k4342k5565k7412l2738k1821J6120
$$ 678636 633395 589998 573852 558353 583396 559054 533489 506077 473339 451518 467638
10351D67638P717j7351j590J8768K797j8445l2651p328J7527J6124l1344m5964
$$ 467638 475355 458004 456414 475182 477979 459534 426883 419555 437082 453206 421862 375898
10339C75898j4961J3082J357q994o563J233j9521p305k8524j2617L90k5887J5960
$$ 375898 360937 374019 375376 366382 359819 361052 341531 334226 305702 293085 293475 267588 283548
10326B83548J8826K115j1290l3922j0320N436N496L799K7186p531l0220M916p927
$$ 283548 302374 304489 293199 259277 248957 254393 259889 263688 290874 283343 253123 258039 250112
10313B50112n521k125J9903k2592m3244Q273L7508K7418k3146j3383L0795L9878
$$ 250112 244591 242466 262369 239777 196533 204806 242314 269732 246586 233203 263998 303876
10301C03876K2046l6336m1503k2175j191L7871Q38P325m381k7138L466j0999l4077
$$ 303876 325922 289586 248083 225908 224717 262588 263426 270751 266370 239232 242698 231699 197622
10288A97622r134O529j419l7622m8319q175r114K0165J6363q347J6851K1963J646
$$ 197622 188488 195017 193598 155976 107657 99482 90368 110533 126896 118549 135400 157363 159009
10275A59009K0496J1096m9784j084K3722k4402j8903Q067K1689K6668r550q670
$$ 159009 179505 190601 140817 139733 163455 139053 120150 128217 149906 176574 167024 158354
10263A58354J3693N261j8576j8629n4797j3878P100K7598L7944J4590R178J0345
$$ 158354 172047 177308 158732 140103 85306 71428 78528 106126 144070 158660 167838 178183
10251A78183k1863M900J7150k0724l1984N1957L0645O869K2593j1494p773r089
$$ 178183 156320 161220 178370 157646 125662 177619 208264 215133 237726 226232 218459 209370
10239B09370j4536k145p520q427K0873q890k2498j2317j6288j1110R131j6621
$$ 209370 194834 192689 185169 176742 197615 188725 166227 153910 137622 126512 135643 119022
10227A19022J2797k5258k7487j5288j8492K1823L9799K031j6038P908k9858r686
$$ 119022 131819 106561 79074 63786 45294 67117 106916 108947 92909 100817 70959 61273
10215F1273J4143J3560j1321N923k9842j7652R041n798L1208K0560J1636k8150
$$ 61273 75416 88976 77655 83578 53736 36084 45125 39327 70535 91095 102731 74581
10203G4581j2836j0758J9123M8007L9916K3814l5474k5199j1906J997K875k8750
$$ 74581 61745 50987 70110 118117 158033 181847 146373 121174 109268 111265 114140 85390
10191H5390j6164j0999M222k2499k4443J7897N0625J8596j7103j5533L614J060
$$ 85390 69226 58227 62449 39950 15507 33404 84029 102625 85522 69989 73603 74663
10179G4663K846j1792j8696p833k2637R251j0742K39M651n522j7168K3981K120
$$ 74663 77509 65717 47021 39188 16551 25802 15060 15299 19950 14428 -2740 21241 23361
10166B3361m303j4013M599J6633K5253M0671O058L629l7172k4054O055J7571l4376
$$ 23361 19058 5045 9644 26277 51530 92201 98259 101888 64716 40662 46717 64288 29912
10153B9912K563K0698J3150k5448m004J0692J7535J8719n985K30m200n280K3183
$$ 29912 32475 53173 66323 40875 36871 47563 65098 83817 77832 78062 73862 68582 91765
10140I1765O570j2897J3850m150J0294L1378k4260k8527j0430K0473J1363m911
$$ 91765 98335 85438 99288 95138 105432 136810 112550 84023 73593 94066 105429 100518
10128A00518n123n50j4372J0850r693j2107J5437K7551J1945m1864j7446k7976
$$ 100518 95395 94845 80473 91323 81630 69523 84960 112511 124456 82592 65146 37170
10116C7170p910J0835K1384N107l688j0090L996K1659M251j1299K6194O694j5207
$$ 37170 29260 40095 61479 66586 62898 52808 56804 78463 82714 71415 97609 104303 89096
10103H9096l5485j9475k8521p346r93L540L5147K923k538l3286l3168J6339K631
$$ 89096 53611 34136 5615 -1731 -2724 816 35963 38886 36348 3062 -30106 -13767 -11136
10090a1136L1179r243P762n065j6318j5067k9924K5702M1131M2608J9672k66P727
$$ -11136 20043 10800 18562 13497 -2821 -17888 -47812 -22110 19021 61629 81301 81035 88762
10077H8762o703j5783j0744j4447l0106O508Q389O734M1333p037J3515l0077k9192
$$ 88762 82059 66276 55532 41085 10979 17487 25876 32610 73943 66906 80421 50344 21152
10064B1152J0862k6698j3237J9470p259J834L82J3385K7406L0974l0460k573n084
$$ 21152 32014 5316 -7921 11549 4290 6124 6506 19891 47297 78271 47811 45238 40154
10051D0154O1N680J0320k5448j9819K9175K9266J8098J2413p53J7981L3204L1331
$$ 40154 40215 45895 56215 30767 10948 40123 69389 87487 99900 99147 117128 150332 181663
10038A81663L4533O3179Q2475Q2587J96614K91093K89884K01342J67598K40888
$$ 181663 216196 279375 361850 444437 641051 932144 1222028 1423370 1590968 1831856
10028A831856K64229Q3610j27041k14881j64783j72663k74788k47000k35749k27675
$$ 1831856 2096085 2179695 2052654 1837773 1672990 1500327 1225539 978539 742790 515115
10018E15115j63699o6241n033m3247l9453j2626j5313j2587k6663m4503r16j2416
$$ 515115 351416 285175 280142 236895 197442 184816 169503 156916 130253 85750 84834 72418
10006G2418l9216k1574N1186M119Q150J2563k9768l257k253j1619J395O344j6218
$$ 72418 33202 11628 62814 66933 75083 87646 57878 54621 52368 40749 42144 48488 32270
9993C2270j3111j3849j457L614k72J1956N134O59L121j2227J4818J5899j3467
$$ 32270 19159 5310 3853 7467 7195 19151 24285 24944 28065 15838 30656 46555 33088
9980C3088m9414k9289Q942Q847q872L1066J4090P685L3778j5643j9637k0005J1236
$$ 33088 -16326 -45615 -36673 -27826 -36698 -5632 8458 16143 49921 34278 14641 -5364 5872
9967E872Q74L1683p215J3346M412N084L055j5478j9747J1218J8070k6349r682
$$ 5872 6746 38429 31214 44560 48972 54056 57111 41633 21886 33104 51174 24825 15143
9954A5143L6765p476j6928Q104P83J5608J7959p914j8191p594L234n6582P002
$$ 15143 51908 44432 27504 35608 36391 51999 69958 62044 43853 36259 39493 -17089 -10087
9941a0087N0586M71j0947j7591j9420J4832L776m4666j1601M6456M8973k710l7274
$$ -10087 40499 40970 30023 12432 -6988 7844 11620 -33046 -44647 1809 50782 48072 10798
9928A0798j3589J028k2767J3336J3896j3776M8329K4719K4683q415N259l896k0280
$$ 10798 -2791 -1763 -24530 -11194 2702 -11074 37255 61974 86657 78242 83501 79605 59325
9915E9325o5186l7515L032K5953J2739L6607q857n162J1627j3062k6148J5294
$$ 59325 -5861 -43376 -40344 -14391 -1652 34955 26098 20936 32563 19501 -6647 8647
9903H647J3079m784J3160L358p551o727J733K3119K380M851J7760m881n158J3382
$$ 8647 21726 16942 30102 33460 25909 19182 20915 44034 46414 51265 69025 64144 58986 72368
9889G2368m4906k0644R52n972j3305j0337p6N513O810p858j1033p255J877q798
$$ 72368 27462 6818 7770 1798 -11507 -21844 -21920 -16407 -9597 -17455 -28488 -35743 -33866 -42664
9875d2664J0886Q001m729J972r740N652j0512n621J070K0371K1R556q206K4776
$$ -42664 -31778 -23777 -28506 -26534 -36274 -30622 -41134 -46755 -45685 -25314 -25293 -15737 -23943 833
9861H33N1637L2848K2055k1458j9651k4287n840J4978K6124K6938M0140K5113
$$ 833 52470 85318 107373 85915 66264 41977 36137 51115 77239 104177 144317 169430
9849A69430M6791P4318J41504P7478m5468j05372j07554r4246o5936l9665M5605
$$ 169430 216221 290539 432043 509521 464053 358681 251127 156881 90945 51280 96885
9838I6885K6977l5479l2011j4696K7423j043m3934o937P202k381j9746o355R429
$$ 96885 123862 88383 56372 41676 69099 68056 24122 17185 24387 22006 2260 -4095 5334
9825E334K6346M1957n475n829K9284J1084l915j4942m0061j6325K051j0666j7542
$$ 5334 31680 73637 68162 62333 91617 102701 98786 83844 43783 27458 29509 18843 1301
9812A301k6179K8031M3889p597n969L5851K0020J8685k2991o813L6941K2313M3765
$$ 1301 -24878 3153 47042 39445 33476 69327 89347 108032 85041 78228 115169 137482 181247
9799A81247N1477L1191Q5108J42965K46595M18536N70742M48739j491l80668m74522
$$ 181247 232724 263915 349023 491988 738583 1157119 1727861 2176600 2175109 1794441 1319919
9788A319919m33280l10257j56203q1492n6400l3528L608m940o2237o6353m6563
$$ 1319919 886639 576382 420179 338687 282287 248759 252367 247427 185190 118837 72274
9777G2274r141J4781r865m307L720n774j4802m7751J2367P827j4455j9835J9648
$$ 72274 63133 77914 68049 63742 67462 61688 46886 -865 11502 19329 4874 -14961 4687
9764D687Q271L081o457m427J4725L1288n695R703P901k7244j0019N144J813k2626
$$ 4687 12958 16039 9582 5155 19880 51168 45473 55176 63077 35833 25814 30958 32771 10145
9750A0145l6771r339L2599J5797k9526J8867M1668j150r143n426j5388k9959O54
$$ 10145 -26626 -35965 -3366 12431 -17095 1772 43440 42290 33147 27721 12333 -17626 -16972
9737a6972K6100j1417j4875N561K1733J8309m404o906M278R359L567l0445j6836
$$ -16972 9128 -2289 -17164 -11603 10130 28439 24035 17129 21407 30766 34333 3888 -12948
9724a2948L421K0885N375j7580k8974J5134K9058j3819J7453p602q844J8543k2106
$$ -12948 -9527 11358 16733 -847 -29821 -14687 14371 552 18005 10403 1559 20102 -2004
9711b004K845j815J2591J3194M234k08k28L68j1926j1540P272N172L0388L943
$$ -2004 841 -974 11617 24811 29045 28837 28609 28977 17051 5511 12783 17955 48343 52286
9697E2286l5774j3494k4568l671K8072J0936J7151K0536l7854k0644j0712n678
$$ 52286 16512 3018 -21550 -25221 2851 13787 30938 51474 13620 -7024 -17736 -23414
9685b3414j234j6988k0945L0751M4167J4784j0313r343j7015j8898K5701M3916
$$ -23414 -24648 -41636 -62581 -31830 12337 27121 16808 7465 -9550 -28448 -2747 41169
9673D1169k265l4597k8884J8135j6057j330J4616O477k4655k5107J8774J1987
$$ 41169 38904 4307 -24577 -6442 -22499 -23829 -9213 -2736 -27391 -52498 -33724 -21737
9661b1737K55M749k413j6577J6042K3181o817K092K0330j5664k1767J5943L837
$$ -21737 -21482 -16733 -19146 -35723 -19681 3500 -3317 -1225 19105 3441 -18326 -2383 1454
9648A454p953j211o484j6812r030K4469K459l5609J2577J6578K4626o201j136
$$ 1454 -6499 -7710 -14194 -31006 -40036 -15567 -13108 -48717 -36140 -19562 5064 -1137 -2273
9635b273j3945j1005K6547L0698l385n547k5541k895L368j3253J9802J0020l361
$$ -2273 -16218 -27223 -676 30022 26637 21090 -4451 -7346 -3978 -17231 2571 12591 9230
9622I230J1641j5304l3448K77K1704j8982j2100m677K9838K9008J4723j121n0901
$$ 9230 20871 5567 -27881 -27604 -5900 -24882 -36982 -41659 -11821 17187 31910 30789 -20112
9609b0112m81J0040j8662j3919L0361M1849j897J2417n767l4374j5894r185m151
$$ -20112 -20593 -10553 -29215 -43134 -12773 29076 27179 39596 33829 -545 -16439 -25624 -29775
9596b9775O352k3839k3740R557K0183R156K4145P408J956K4898j1164j1948m499
$$ -29775 -23423 -47262 -71002 -61445 -41262 -32106 -7961 -553 1403 26301 15137 3189 -1310
9583a310P657o527j9735P649M0649J7286l1279J0848J7361M465M590o591m2999
$$ -1310 6347 -180 -19915 -12266 28383 45669 14390 25238 42599 47064 51654 45063 2064
9570B064l0776L5612J6935l28j4664j4806l410K5816j535K676K0948n4087q088
$$ 2064 -28712 6900 23835 23507 8843 -5963 -9373 16443 14908 17584 38532 -15555 -23643
9557b3643K8958J2225p641p345l2990J6000L6381K910j6201o909M137J2845n81
$$ -23643 5315 17540 9899 2554 -30436 -14436 21945 24855 8654 1745 5882 18727 18146
9544A8146k764M957k2527M979K0905J4630L3636n457k9990k7808L649K7602k053
$$ 18146 15382 20339 -2188 2791 23696 38326 71962 66505 36515 8707 12356 39958 37905
9531C7905l0034J6197K0476j6951j5527n615K5345n151k6181j3015k3276O468
$$ 37905 7871 24068 44544 27593 12066 6451 31796 26645 464 -12551 -35827 -29359
9519b9359P410K7743K8324k8420N701R300l002j2031r785K7959M936j5998k1358
$$ -29359 -21949 5794 34118 5698 11399 20699 17697 5666 -4119 23840 28776 12778 -8580
9506h580m475q666P148k9739k021N452j2894j727n862J8458N2002K1442m21n5888
$$ -8580 -13055 -21721 -14573 -44312 -46333 -40881 -53775 -55502 -61364 -42906 9096 30538 30117 -25771
9492b5771j0683l299J8760K9251l521j333k0475Q409K3233o388o224n490O649
$$ -25771 -36454 -39753 -20993 8258 4737 3404 -17071 -8662 14571 8183 1959 -3531 3118
9479C118k660J4791m509k921j270l135n171J6913J0755n078k8554M605R146j2895
$$ 3118 458 15249 10740 7819 6549 3414 -1757 15156 25911 20833 -7721 -3116 6030 -6865
9465f865k9858N928J1960K10J7357K0404M414j3149K1726R715k1625r579q067
$$ -6865 -36723 -30795 -18835 -18625 -1268 19136 23550 10401 32127 41842 20217 10638 2571
9452B571K1085J995n1390Q917l319j2256Q265K676l680J3509j0550O584j927j2919
$$ 2571 23656 25651 -25739 -16822 -20141 -32397 -24132 -21456 -25136 -11627 -22177 -15593 -17520 -30439
9438c0439J7978O689j6394K807J765j7056R344N8220L4594j5196k0959j4991l7197
$$ -30439 -12461 -5772 -22166 -19359 -17594 -34650 -25306 32914 67508 52312 31353 16362 -20835
9425b0835J132M5073L5349M92j5716j1551n331j2070M734k2025K1557J3966j7294
$$ -20835 -19703 25370 60719 61211 45495 33944 28613 16543 21277 -748 20809 34775 17481
9412A7481L637L215J5911j6850l163l280q256k6683l0463L228L0359L311j1090
$$ 17481 21118 24333 40244 23394 20231 16951 8695 -17988 -48451 -45223 -14864 -11553 -22643
9399b2643j2132L7618J2811k5205j2295P586J6130j2578Q637j359p425j5042K7692
$$ -22643 -34775 2843 15654 -9551 -21846 -14260 1870 -10708 -2071 -3430 -10855 -25897 1795
9386A795k990O869l442j8150j8239O844J1161J3012L4703K5016j8677j9059R994
$$ 1795 -1195 5674 2232 -15918 -34157 -27313 -16152 -3140 31563 56579 37902 18843 28837
9373B8837M044N445J0998K9976p502k2989k0813j6005k056l3474J290K2915j6042
$$ 28837 32881 38326 49324 79300 71798 48809 27996 11991 9935 -23539 -22249 666 -15376
9360a5376j7218j3398O716R283k591J3037J1949r104k6727n024L1037M08J4741
$$ -15376 -32594 -45992 -39276 -29993 -32584 -19547 -7598 -16702 -43429 -48453 -17416 -17008 -2267
9347b267K2807j635j3987M702M627J0268q747M29J3806J6296L4755L736r160j3445
$$ -2267 20540 18905 4918 9620 14247 24515 15768 16197 30003 46299 81054 84790 75630 62185
9333F2185m139q632k1308l319l605k660K3200k3351l0189J0710j3510l0429K398
$$ 62185 58046 49414 28106 24787 21182 18522 41722 18371 -11818 -1108 -14618 -45047 -42649
9320d2649K0738K6646K9350k2676K075J9186K734k0551j8560r817k1880k211L5939
$$ -42649 -21911 4735 34085 11409 13484 32670 35404 14853 -3707 -13524 -35404 -37615 -1676
9307a676N7905q178J0769K1194j7220k2158p798Q964j1216N1804p825l3029j1842
$$ -1676 56229 48051 58820 80014 62794 40636 32838 41802 30586 82390 74565 41536 29694
9294B9694K7700J0539J887L865l70q516O808J0298R62j9545K0723K2994m0858
$$ 29694 57394 67933 69820 73685 73315 64799 71607 81905 82867 63322 84045 107039 66181
9281F6181k4607J1963Q308K6963M3969R405l168L50q051j2970Q444J3568M278
$$ 66181 41574 53537 61845 88808 132777 142182 139014 139364 131313 118343 126787 140355 144633
9268A44633L6465K3298J4746P810k0668k191K3603n281J895K0693K420Q046L8444
$$ 144633 181098 204396 219142 226952 206284 204093 227696 222415 224310 245003 247423 255469 293913
9255B93913M6776j4274M8254L8145j640J5319M2095M1920O8440N3471P1152J06274
$$ 293913 340689 326415 374669 412814 411174 426493 468588 510508 578948 632419 703571 809845
9243H09845R1232J15279J31815J55898K15356K18008K81052L92306M20234M71733
$$ 809845 901077 1016356 1148171 1304069 1519425 1737433 2018485 2410791 2831025 3302758
9233C302758N27746N52696N14529L79541J93661m2606k69355m31319n13974n21473
$$ 3302758 3830504 4383200 4897729 5277270 5470931 5428325 5158970 4727651 4213677 3692204
9223C692204m60710m44535m02836l27350k70033k38983j96235j28547j66255j43273
$$ 3692204 3231494 2786959 2384123 2056773 1786740 1547757 1351522 1222975 1056720 913447
9213I13447r3855o9484n2439m5521m0003n2360m4758o4225k9374j1133o0067m2380
$$ 913447 819592 750108 697669 652148 612145 559785 515027 450802 421428 410295 350228 307848
9201C07848l8769k4715j5961k0176j7964k5753l5282j1984J5740M082N847J6827
$$ 307848 269079 244364 228403 208227 190263 164510 129228 117244 132984 137066 142913 159740
9189A59740q467j5355n990M604J6807j4790j0484j4830P091l498j1349J860j8993
$$ 159740 151273 135918 129928 134532 151339 136549 126065 111235 118326 114828 103479 105339 86346
9176H6346k0541m197p544K025j7541N795r308r242L1761K0612k5786j0414M713
$$ 86346 65805 61608 54064 56089 38548 44343 35035 25793 57554 78166 52380 41966 46679
9163D6679j5347j1518K7989J3416o86j6185q941O715N2169J1468q518k3914m2490
$$ 46679 31332 19814 47803 61219 60533 44348 35407 42122 94291 105759 97241 73327 30837
9150C0837J1681J3724j8207J5893J4128K0741k3203R628j1946q258j340j5225
$$ 30837 42518 56242 38035 53928 68056 88797 65594 75222 63276 55018 53678 38453
9138C8453n3056m0007P648J3019k5719p499L4191L9312N137q343j0333Q417J8663
$$ 38453 -14603 -54610 -46962 -33943 -59662 -67161 -32970 6342 11479 3136 -7197 1220 19883
9125A9883Q230j9136o053L731j0573Q324N773L8099N120j3718j9829J4383j8080
$$ 19883 28113 8977 2924 6655 -3918 4406 10179 48278 53398 39680 19851 34234 16154
9112A6154l1887n455J5076K7722L7798Q783l2794r771j3165K0880N61q798M730
$$ 16154 -15733 -21188 -6112 21610 59408 68191 35397 25626 12461 33341 33902 25104 29834
9099B9834J0616l0036j4109j2532J0705M6876J5403n0p619k3828K0287J7771j7714
$$ 29834 40450 10414 -3695 -16227 -5522 41354 56757 56707 49088 25260 45547 63318 45604
9086D5604l8956o237j3290j6722r88J7784k470J0161O839J0069N987J1722k4323
$$ 45604 6648 411 -12879 -29601 -30589 -12805 -15275 -5114 1725 11794 17781 29503 5180
9073E180k8848J3738M952J2447Q227m262j8203j6012L8220J8492l1771l430L1032
$$ 5180 -23668 -9930 -4978 7469 15696 11434 -6769 -22781 15439 33931 2160 -1270 29762
9060B9762L3024k3321j9627j4375J6285L0860k2961n398J4442K7901k7446k034
$$ 29762 62786 39465 19838 5463 21748 52608 29647 24249 38691 66592 39146 37112
9048C7112R486j3802l7583q153K1458J1898J9279J0825K155N285j2943n4817j1667
$$ 37112 46598 32796 -4787 -12940 8518 20416 39695 50520 52675 57960 45017 -9800 -21467
9035b1467L1397m897J7832L364p670j0247j6119j5798l877J8219P018N133K439
$$ -21467 9930 5033 22865 26229 18559 8312 -7807 -23605 -27482 -9263 -2245 2888 5327
9022E327J9629k5447j4280J2718j1404l4814R125M3094K2899j0863J0654P529
$$ 5327 24956 -491 -14771 -2053 -13457 -48271 -39146 3948 26847 15984 26638 34167
9010C4167l1607k3273O483J8640P22k0068j7475J493K6454o437K1740O393o124
$$ 34167 2560 -20713 -14230 4410 5132 -14936 -32411 -30918 -4464 -10901 10839 17232 11108
8997A1108j2007k6038L557L2442M667l5731j0464L0508Q675o665j2856J8486K4819
$$ 11108 -899 -26937 -23380 9062 13729 -22002 -32466 -1958 6717 52 -12804 5682 30501
8984C0501M601k4439j2700J1048K0149K1545r669j0021K1523L73l2600l4755k1234
$$ 30501 35102 10663 -2037 9011 29160 50705 41036 31015 52538 52911 20311 -14444 -35678
8971c5678j521K044Q941m114O550R617K2557Q970r911p228k6023j3167O48K794
$$ -35678 -37199 -35155 -26214 -30328 -23778 -14161 8396 17366 7455 227 -25796 -38963 -38315 -35521
8957c5521M0940l878k097j2006J369m042L442J2459j881j0885L536J1936l966
$$ -35521 5419 1541 -556 -12562 -11193 -15235 -11793 666 -1215 -12100 -8564 3372 -594
8944e94r415L1654K335j8147l789r287L6292k5944l202j2590K687O534R176j3203
$$ -594 -10009 21645 23980 5833 2044 -7243 29049 3105 -97 -12687 -10000 -3466 5710 -7493
8930g493k9607J647Q894J6571k6912m0300Q808K0628R609L0596J3202k6706j0857
$$ -7493 -37100 -35453 -26559 -9988 -36900 -77200 -68392 -47764 -38155 -7559 5643 -21063 -31920
8917c1920Q840l332J4410M2650q706k2773M660Q201k6923J1087R173n651n94Q910
$$ -31920 -23080 -26412 -12002 30648 21942 -831 3829 12030 -14893 -3806 5367 -284 -878 8032
8903H032K2244P944k445J449l969k532n592J5908j6707k6698J0757J6109q771
$$ 8032 30276 38220 35775 37224 33255 30723 25131 41039 24332 -2366 8391 24500 15729
8890A5729o729J5777N83k6669K0790o021j2570J5069K577O195J171p565K856k882
$$ 15729 9000 24777 25360 -1309 19481 13460 890 15959 18536 24731 25902 18337 21193 18311
8876A8311J3127j6967l4916J5784J1723k2673r441j487r421j0152j969J7655M4370
$$ 18311 31438 14471 -20445 -4661 7062 -15611 -25052 -26539 -35960 -46112 -48081 -30426 13944
8863A3944L2495k7956L3447L7694k1904P427j5857l5289K4307L3394J385l6252
$$ 13944 46439 18483 51930 89624 67720 75147 59290 24001 48308 81702 83087 46835
8851D6835o6144k7937L5087J4753r808J735n536k2892K7487J2259K1876j9172
$$ 46835 -19309 -47246 -12159 2594 -7214 -5479 -11015 -33907 -6420 5839 27715 8543
8839H543k8350M583L745J4877J034l0089j287J8985K5054K5629k9997J2354K6395
$$ 8543 -19807 -15224 -11479 3398 4432 -25657 -26944 -7959 17095 42724 12727 25081 51476
8826E1476k4640k4839L525K3989k620l6004j9143n721j090J0883L1308J7678M021
$$ 51476 26836 1997 5522 29511 26891 -9113 -28256 -33977 -35067 -24184 7124 24802 28823
8813B8823J0782k2737J4265J0926k1753m477q220M169L756k638k8505J007K670
$$ 28823 39605 16868 31133 42059 20306 15829 7609 11778 15534 12896 -15609 -14602 -11932
8800a1932l3096q928K506J1368L048n264n793L835j13J5644j3254k7464J0437
$$ -11932 -45028 -53956 -51450 -40082 -37034 -42298 -48091 -44256 -44369 -28725 -41979 -69443 -59006
8787e9006J3656K9116j7760J9382K2391k224j8149k3955P650J3092j832J6145
$$ -59006 -45350 -16234 -33994 -14612 7779 5555 -12594 -36549 -28899 -15807 -17639 -1494
8775a494K1886J0032l0640K0365L059k8436m179Q230j4165j5865j3274K9707N9838
$$ -1494 20392 30424 -216 20149 23208 -5228 -9407 -1177 -15342 -31207 -44481 -14774 45064
8762D5064M0086k1532k8828j7565J7345J8759j0827N817m1498j0051K3215J390
$$ 45064 85150 63618 34790 17225 34570 53329 42502 48319 6821 -3230 19985 21375
8750B1375P099o573k8780j3789L4778P651k5988n452J0299J6591n692j7664K0550
$$ 21375 28474 21901 -6879 -20668 14110 21761 -4227 -9679 620 17211 11519 -6145 14405
8737A4405l7081j0381K242J4623m426J9041J7212J7185J187k886K94J2158j8498
$$ 14405 -22676 -33057 -30815 -16192 -20618 -1577 15635 32820 34007 31121 31415 43573 25075
8724B5075O248J9318P302k7004o335K1802K779j0722j5137J1337L7009o081m4551
$$ 25075 31323 50641 57943 30939 24604 46406 49185 38463 23326 34663 71672 65591 21040
8711B1040q254m722L06J4972j6319J1660p261m864j840J0310j9732m7080L2445
$$ 21040 12786 8064 8370 23342 7023 18683 11422 6558 4718 15028 -4704 -51784 -19339
8698a9339K2102L036R638j4889k9140l4842J5092Q940K0969J6815J4719m462j3526
$$ -19339 2763 5799 15437 548 -28592 -63434 -48342 -39402 -18433 -1618 13101 8639 -4887
8685d887Q304l856J8738K5794o396O922P705r233j4814L393l481k694j861n0677
$$ -4887 3417 -439 18299 44093 37697 44619 52324 43091 28277 31670 28189 25495 23634 -27043
8671b7043l3944J5491L5123J6539j6391J0664m384L7090J1433j5186J4672J0234
$$ -27043 -60987 -45496 -10373 6166 -10225 439 -3945 33145 44578 29392 44064 54298
8659E4298k946k0662J3869k6007k3757L3664K1519k594j1154l445P099L3962L6190
$$ 54298 51352 30690 44559 18552 -5205 28459 49978 47384 36230 32785 39884 73846 110036
8646A10036M5746J6262P953J4245K045m4913m5517j2401j3701j9931J3017N133
$$ 110036 155782 172044 179997 194242 196287 151374 105857 93456 79755 59824 72841 77974
8634G7974K2171Q175k4849k1619q31J3977j173j3781N346J816l5737l726J1594
$$ 77974 100145 108320 83471 61852 61021 74998 73825 60044 65390 67206 31469 27743 39337
8621C9337K0473J3480L823Q829K8094l2712j3680J0048J8072k0600j9836J6652
$$ 39337 59810 73290 77113 85942 114036 81324 67644 77692 95764 75164 55328 71980
8609G1980J6904R11k1763K0785K0823L1079K1445P830N7615Q2249M1108L362n4717
$$ 71980 88884 89795 68032 88817 109640 140719 162164 169994 227609 309858 350966 354328 299611
8596B99611n5790k3280k9178J2848J7629P988J314K991K3771j3106r355k6814
$$ 299611 243821 220541 191363 204211 221840 229828 231142 234133 257904 244798 235443 208629
8584B08629l6761k8676j8627J990J9547R961l9156l6318k4007j5908M8798k313
$$ 208629 171868 143192 124565 126555 146102 156063 116907 80589 56582 40674 89472 87159
8572H7159k1643p449j3246k8515k3582q433J6736J1980O083Q064K0571k7856p335
$$ 87159 65516 58067 44821 16306 -7276 -15709 1027 13007 19090 27154 47725 19869 12534
8559A2534L9587L7021K6942M4961N9579r073n2939o9613n5792R297L590J9315
$$ 12534 52121 89142 116084 161045 220624 211551 158612 88999 33207 42504 46094 65409
8547F5409K4209K1561m1583o242j5419o953O146K0686L128l9441r642J582p362
$$ 65409 89618 111179 69596 63354 47935 40982 47128 67814 70942 31501 21859 23441 16079
8534A6079l3376j0922R877M890J3444J1686k3536j3823J9902m2414J6996r398
$$ 16079 -17297 -28219 -18342 -13452 -8 11678 -11858 -25681 -5779 -48193 -31197 -40595
8522d0595L695O0213J7016J107J0660m4668n899j1120j2871p335L507L3415M4863
$$ -40595 -36900 23313 40329 41436 52096 7428 1529 -9591 -22462 -29797 -26290 7125 51988
8509E1988J5935l9805k4374j381J1261k0078k4190J4567K1132l1590P883L0452
$$ 51988 67923 28118 3744 2363 13624 -6454 -30644 -16077 5055 -26535 -18652 11800
8497A1800l915k0983o892j361J8030o247J0093J5346K1137J3842l3999l6800K3222
$$ 11800 7885 -13098 -19990 -21351 -3321 -9568 525 15871 37008 50850 16851 -19949 3273
8484C273l380l8754J2077L975M874K9032n9M954k1104l1251K0118K4822k9912
$$ 3273 -107 -38861 -26784 -22809 -17935 11097 11038 15992 -5112 -36363 -16245 8577 -21335
8471b1335n455J1523Q106J8661n122r575j3304j6107l2408J1K5793J2992l691
$$ -21335 -26790 -15267 -7161 11500 6378 -3197 -16501 -32608 -65016 -65005 -39212 -26220 -29911
8458b9911L5519o823k1495J4369J0530r490o727N417R607r355K0680K3593j5074
$$ -29911 5608 -1215 -22710 -8341 2189 -7301 -14028 -8611 996 -8359 12321 35914 20840
8445B0840k2774k2297J372O514K5607Q752p135j6192K7779l6077j66J342r052
$$ 20840 -1934 -24231 -22859 -16345 9262 18014 10879 -5313 22466 -13611 -13777 -12435 -21487
8432b1487l752O560p831o750J9061J1170j0501j8789L1355N906l5740k721L0668
$$ -21487 -25239 -18679 -26510 -33260 -14199 -3029 -13530 -32319 -964 4942 -30798 -33519 -2851
8419b851p740J336j3386o655R409k8783m280K7666l325j4903Q552J6999M1259
$$ -2851 -10591 -9255 -22641 -29296 -19887 -48670 -52950 -25284 -28609 -43512 -34960 -17961 23298
8406B3298K5997j806l52R621N73k0427m6763l4449J8542J2767o65k9285J5463
$$ 23298 49295 47489 47137 56758 57331 36904 -9859 -44308 -25766 -12999 -13664 -42949 -27486
8393b7486K7081L886p198k1487P492J9182K1635k6721j8684Q229K6026j9468J3804
$$ -27486 -405 3481 -3717 -25204 -17712 1470 23105 -3616 -22300 -14071 11955 -7513 6291
8380F291J2606o494M441J8253P285p853P876k9096j2596J6891J4367M605l6597
$$ 6291 18897 12403 16844 35097 42382 34529 42405 13309 713 17604 31971 36576 -21
8367b1j3441k1928m814J6742k408L2622k0465k1378K668J9218n512J3574O083
$$ -21 -13462 -35390 -40204 -23462 -25870 6752 -13713 -35091 -32423 -13205 -18717 -5143 940
8354I40l4418r905L1746J2661Q774j2016j5415M213m585K6727L0619k855j5682
$$ 940 -33478 -43383 -11637 1024 9798 -2218 -17633 -13420 -18005 8722 39341 36486 20804
8341B0804J2031P79j8085j9868Q2M856j4899k7189k7061J133J7727P892J1783
$$ 20804 32835 33614 15529 -4339 -4257 599 -14300 -41489 -68550 -67417 -49690 -41798 -30015
8328c0015P198j0653J5121J8115L2070P449L2857l808J14q517l6052j9035P242
$$ -30015 -22817 -33470 -18349 -234 31836 39285 72142 68334 68448 59931 23879 4844 12086
8315A2086j6983j4211N038J8063N934p186O942k552J3393m595k758r927l1457
$$ 12086 -4897 -19108 -14070 3993 9927 2741 9683 7131 20524 15929 13171 3244 -28213
8302b8213j1231J1926J1265L1374k3989q102j972k0810J4931K251Q756L664q502
$$ -28213 -39444 -27518 -16253 15121 -8868 -16970 -18942 -39752 -24821 -22570 -13814 -10150 -18652
8289a8652K897j8017N41K6890P908Q841J7240m189n556M546N787j8621j7548J8289
$$ -18652 -15755 -33772 -33231 -6341 1567 10408 27648 23459 17903 22449 28236 9615 -7933 10356
8275A0356K0421P918j1327j259O042k8111j4629N332m129r555k228j0828L4183
$$ 10356 30777 38695 27368 26109 32151 4040 -10589 -5257 -9386 -18941 -21169 -31997 2186
8262B186R058J3359J0137j2982K3894L6119l674j5901j9199k4643o893m168R870
$$ 2186 11244 24603 34740 21758 45652 81771 78097 62196 42997 18354 11461 7293 17163
8249A7163n65j7414m5472L37L5710Q468J4414q712m3405M408N1633R613O766J933
$$ 17163 16598 -816 -46288 -45951 -10241 -1773 12641 3929 -39476 -35068 16565 26178 32944 34877
8235C4877Q661l8603j6198j8671Q672J5550K629j6408Q003j0881k0102q995j3745
$$ 34877 43538 4935 -11263 -29934 -21262 -5712 -3083 -19491 -11488 -22369 -42471 -51466 -65211
8222f5211p726l743L1947K8335K2437l207J082j6371j6705k127p935P912L122
$$ -65211 -72937 -76680 -44733 -16398 6039 2832 3914 -12457 -29162 -31289 -39224 -31312 -28190
8209b8190k0557K4661K490l0847J6884J8383K3877O318L382m6K9416k155l3277
$$ -28190 -48747 -24086 -21596 -52443 -35559 -17176 6701 13019 16401 16355 45771 43616 10339
8196A0339k1902j7505j2413R015J9372M81M437m652J2053Q055j1650j796r353
$$ 10339 -11563 -29068 -41481 -32466 -13094 -12613 -8176 -12828 -775 7280 -4370 -6166 -15519
8183a5519M475n146m090j2644K1145K1008J3903J5343J0960l0074N963k725p0740
$$ -15519 -11044 -16190 -20280 -32924 -11779 9229 23132 38475 49435 19361 25324 22599 -48141
8170d8141m5301M871J6797o092J6752L1328L092j3608k1748J0322L0878K2227
$$ -48141 -93442 -88571 -71774 -77866 -61114 -29786 -26694 -40302 -62050 -51728 -20850 1377
8158A377J7755q17K11J4995P457p212k1242M034N199j4409k194J4645k937j6805
$$ 1377 19132 18315 18526 33521 40978 33766 12524 16558 21757 7348 5154 19799 16862 57
8144E7k897k5794J762R053L414q736J0800L905K9519J28j0279j1203l285k8849
$$ 57 -2840 -28634 -26872 -17819 -14405 -23141 -12341 -8436 21083 21211 10932 -271 -3556 -32405
8130c2405j3848L91J0819R658N563M8581m939l3154K1739J2765Q288L023q732
$$ -32405 -46253 -45862 -35043 -25385 -19822 28759 23820 -9334 12405 25170 33458 36481 27749
8117B7749k1315R544L6942J6934j3887j8684l0066j7600r125J1400K7430R88N766
$$ 27749 6434 15978 52920 69854 55967 37283 7217 -10383 -19508 -8108 19322 20310 26076
8104B6076M93k3644K835J4001K9564r418l0067l4788j2568j2026K58K1906M0897
$$ 26076 26569 2925 5760 19761 49325 39907 9840 -24948 -37516 -49542 -49284 -27378 13519
8091A3519Q341j8200k7920R933K768O410j8960J3238J1115L6773J480m1370j2125
$$ 13519 21860 3660 -24260 -14327 -11559 -5149 -24109 -10871 244 37017 38497 -2873 -14998
8078a4998J1999K7834J1449q534J3177j5470L378J1378j1491j3688k5810O542
$$ -14998 -2999 24835 36284 27750 40927 25457 28835 40213 28722 15034 -10776 -4234
8066d234J2968q152n744o054j8802M954J6246K2256k0519L403O258L0230K3571
$$ -4234 8734 582 -5162 -11216 -30018 -25064 -8818 13438 -7081 -3678 2580 32810 56381
8053E6381j9139l6014l4792J385L3773K001k9278j1340K5037K8764j0058k289
$$ 56381 37242 1228 -33564 -32179 1594 3595 -25683 -37023 -11986 16778 6720 4431
8041D431K2549M1011J6276k9781m1885j4459j5427j2700q546l964R486K6555K7153
$$ 4431 26980 67991 84267 54486 12601 -1858 -17285 -29985 -38531 -42495 -33009 -6454 20699
8028B0699K8302L690p577j4243J7064Q625K3108j2326j8885J5778J9505l7549
$$ 20699 49001 52691 45114 30871 47935 56560 79668 67342 48457 64235 83740 46191
8016D6191J2840J7318q261k0173l6180n101J9375J4805j8894K10J9076L676k1291
$$ 46191 59031 76349 68088 47915 11735 6634 26009 40814 21920 22130 41206 44882 23591
8003B3591l352N701K743J0263J1724K6233L4810j4074j2649k2272j4882K293O87
$$ 23591 20239 25940 28683 38946 50670 76903 111713 97639 84990 62718 47836 50129 50816
7990E0816Q248J7027K2814l5811n2561k3829j3092m4572K3937L5456J6592L5004
$$ 50816 59064 76091 98905 63094 10533 -13296 -26388 -70960 -47023 -11567 5025 40029
7978D0029j45J2400J3619j8740j9510k4653j5830J9564o794j8971j0312M419K7136
$$ 40029 39884 52284 65903 47163 27653 3000 -12830 6734 -60 -19031 -29343 -24924 2212
7965B212K1165J7122k597J6764m865k0132j9560L52m818L5645N391K6062M400
$$ 2212 23377 40499 37902 54666 49801 29669 10109 10461 5643 41288 46679 72741 77141
7952G7141L025M3542J4489n871o6541o868L6709q781n797M332l5784J912j4605
$$ 77141 80166 123708 138197 132326 65785 58917 95626 86845 81048 85380 49596 51508 36903
7939C6903m744l816r677q533j5545J8005q580p450r378J3696L6581n528J8651
$$ 36903 32159 28343 18666 10133 -5412 12593 4013 -3437 -12815 881 37462 31934 50585
7926E0585K2042L6826k2872k0006n8132l8321J0341L9556k448K647J903J4161
$$ 50585 72627 109453 86581 66575 8443 -29878 -19537 20019 17571 20218 22121 36282
7914C6282J624K983j2089k9146O689p602o591q095m788K0209p873L3613j389J3902
$$ 36282 37906 40889 28800 -346 6343 -1259 -7850 -15945 -20733 -524 -8397 25216 23827 37729
7900C7729J8072J0837k1998l2504N420J8548m0510j0444L7029o112l9180O696
$$ 37729 55801 66638 44640 12136 17556 36104 -4406 -14850 22179 16067 -23113 -16417
7888a6417J0500K0451N06j6949j1086k9519q325r455O097L0894L7634r470j7638
$$ -16417 -5917 14534 15040 -1909 -12995 -42514 -50839 -60294 -54197 -23303 14331 4861 -12777
7875a2777J1529J1753j541j9535J4103J5332j1947j2619R587K0982j6019j0000
$$ -12777 -1248 10505 8964 -10571 3532 18864 6917 -5702 3885 24867 8848 -1152
7863a152m413j5172J8311J2679K1565k5942j5324J8810n910J1766p581R429q263
$$ -1152 -5565 -20737 -2426 10253 31818 5876 -9448 9362 3452 15218 7637 17066 8803
7850H803j157q19n439K1718L6626j9517n3253j7135J4936J7678k1905K707j7991
$$ 8803 7646 6827 1388 23106 59732 40215 -13038 -30173 -15237 2441 -19464 -16757 -34748
7837c4748q752N2175J6082j0317O113K6796r043k2030o740J3647O925l274l8352
$$ -34748 -43500 8675 24757 14440 20553 47349 38306 16276 9536 23183 30108 26834 -11518
7824a1518l5669k8573P689J5885j5151L6166M0909P831m6223l346K3073l100R852
$$ -11518 -47187 -75760 -68071 -52186 -67337 -31171 9738 17569 -28654 -32000 -8927 -12027 -2175
7811b175J9392K235L0158J7037j5727l2473l1291j3196K0312K5835N653j1497
$$ -2175 17217 19452 49610 66647 50920 18447 -12844 -26040 -5728 20107 25760 14263
7799A4263o866m3865l9807K4647J9848j8355l617N997R745J3499J815J6776J2091
$$ 14263 7397 -36468 -76275 -51628 -31780 -50135 -53752 -47755 -38010 -24511 -22696 -5920 6171
7786F171j5810k6981J0115Q445l888L4262Q728l8454j0254K5014J7695j0976R241
$$ 6171 -9639 -36620 -26505 -18060 -21948 12314 21042 -17412 -27666 -2652 15043 4067 13308
7773A3308J3168K646j4921j5108k701k4057J9023L6673L4831J4315j9186j6402
$$ 13308 26476 29122 14201 -907 -3608 -27665 -8642 28031 62862 77177 57991 41589
7761D1589O688J9912k1015l9949j8829j8261o457J2572L2717J4185p925m3817
$$ 41589 48277 68189 47174 7225 -11604 -29865 -36322 -23750 8967 23152 15227 -28590
7749b8590k5393J5791J2736M123N951j0554J9976q277j1073R45q757k7235J3174
$$ -28590 -53983 -38192 -25456 -21333 -15382 -25936 -5960 -14237 -25310 -24365 -33122 -60357 -47183
7736d7183M2056R916R559l111r506k7410J1942K5525q874q030K340J1551R887
$$ -47183 -5127 4789 14348 11237 1731 -25679 -13737 11788 2914 -5116 -2776 8775 18662
7723A8662j9535k4779j3215N797L1049K0521j1055r41K9363R725q423l628j9047
$$ 18662 -873 -25652 -38867 -33070 -2021 18500 7445 6504 35867 45592 37169 33541 14494
7710A4494l3733K081L8951k393l0299P85k1383Q760k771L1299n68j5965K6144
$$ 14494 -19239 -17158 21793 19400 -10899 -10114 -31497 -22737 -25508 5791 5223 -10742 15402
7697A5402J895j5424M3408j4543k1822j4702r157j5203J086K8736j3468j9978
$$ 15402 17297 1873 45281 30738 8916 -5786 -14943 -30146 -29060 -324 -13792 -33770
7685c3770j2489j999L131J7404Q246k7120R008J316Q952J1395j4576J5008j1910
$$ -33770 -46259 -48258 -45127 -27723 -19477 -46597 -37589 -36273 -27321 -15926 -30502 -15494 -27404
7672b7404k0J2261Q662J406L240l648j8089K3010n045k1592j8649J8117M1336
$$ -27404 -27424 -15163 -6501 -5095 -1855 -5503 -23592 -582 -5627 -27219 -45868 -27751 13585
7659A3585J8937L2107j5478K0478o569j7620j9285n0637O427k397l5219j9378
$$ 13585 32522 64629 49151 69629 63060 45440 26155 -24482 -18055 -20452 -55671 -75049
7647g5049K0002L3134N7721J3813R386J390m3831j0368J364k336K6786L4723K604
$$ -75049 -55047 -21913 35808 49621 59007 60397 16566 6198 7562 5226 32012 66735 69339
7634F9339P364j4681j2524J281j6550r394n2144L5212Q422l1285m2030k291M2696
$$ 69339 76703 62022 49498 50779 34229 24835 -27309 7903 16325 -14960 -56990 -59281 -16585
7621a6585Q365l7814k3374l937J388j6286J1640N4720K6961L694K784j0893k426
$$ -16585 -8220 -46034 -69408 -73345 -71957 -88243 -76603 -21883 5078 8772 11556 663 -1763
7608a763k3815K231j1571o10j3244n457K6212L417o02J8571q70M372N39r812j6625
$$ -1763 -25578 -23347 -34918 -35528 -48772 -54229 -28017 -24600 -25202 -6631 -7501 -3129 -2590 -12402 -29027
7593b9027R965J5167J2191j6168n167K6243k2139j0112M798J1401J3016m166k1249
$$ -29027 -19062 -3895 8296 -7872 -13039 13204 -8935 -19047 -14249 -2848 10168 6002 -15247
7580a5247j1752L4656N430o912j6251j1779j2422J932L9677J2542j3031J2997
$$ -15247 -26999 7657 13087 6175 -10076 -21855 -34277 -32345 7332 19874 6843 19840
7568A9840k8650k8168r034j1450J9478O5885n723j9662j7872J5162J6951l2539
$$ 19840 -8810 -36978 -46012 -57462 -37984 27901 22178 2516 -15356 -194 16757 -15782
7556a5782p318J4429J5419k4201K624J8745l019l8708J9703n207J1500k2772K2218
$$ -15782 -23100 -8671 6748 -17453 -14829 3916 897 -37811 -18108 -23315 -11815 -34587 -12369
7543a2369J2180l319j7127l4436M64O1217K4550k4657j133J2384K102k5614j0910
$$ -12369 -189 -3508 -20635 -55071 -54607 6610 31160 6503 5370 17754 19856 -5758 -16668
7530a6668L8930k0310j1572m965J2122R632k7952J4119J0446Q447p581K8940q107
$$ -16668 22262 1952 -9620 -14585 -2463 7169 -20783 -6664 3782 12229 4648 33588 25481
7517B5481j9641j8317K4304L0387q846m3022j2797k1593j2427m105j2906j4144
$$ 25481 5840 -12477 11827 42214 33368 -9654 -22451 -44044 -56471 -60576 -73482 -87626
7505h7626K5797Q131j602Q832o40K4534K3517n893k3852j9279K3669K6203Q453
$$ -87626 -61829 -53698 -55300 -46468 -47108 -22574 943 -4950 -28802 -48081 -24412 1791 10244
7492A0244K911j6223K1448K3062j2391j70j873p130k9071j0165J0770R9K410J585
$$ 10244 13155 -3068 18380 41442 29051 28881 27008 19878 -9193 -19358 -8588 -8489 -6079 -4494
7478d494j6934j3944N379J8853P830n067j6474o641M737k628N036R329N952j5674
$$ -4494 -21428 -35372 -29993 -11140 -3310 -8377 -24851 -31492 -26755 -29383 -24347 -15018 -9066 -24740
7464b4740Q878j0950k3217K6600J6866l473K9699Q678o0j1055R311R973k4231
$$ -24740 -15862 -26812 -50029 -23429 -6563 -10036 19663 28341 28281 17226 26537 36510 12279
7451A2279r225j1984J345k8144j4657J92j2777J2262J4863l854k6679j5285l2100
$$ 12279 3054 -8930 -7585 -35729 -50386 -50194 -62971 -50709 -35846 -39700 -66379 -81664 -113764
7438a13764J3509K4811J5791K548J6264K5997J3265l597O250J3459l04k4191k2213
$$ -113764 -100255 -75444 -59653 -57105 -40841 -14844 -1579 -5176 1074 14533 14229 -9962 -32175
7425c2175K9754J6210k393j8298l0210j189O474q571K227K0301J4825J0467j3845
$$ -32175 -2421 13789 11396 -6902 -37112 -38301 -31827 -40398 -38171 -17870 -3045 7422 -6423
7412f423j3978P14j5084L3330J3455k5936r464K2814J6475m05l024L578Q446K982
$$ -6423 -20401 -19687 -34771 -1441 12014 -13922 -23386 -572 15903 15498 12474 16052 24498 27480
7398B7480j9531l0335n006P225l680L5459J6119k6917j6395k0186O159j0925k453
$$ 27480 7949 -22386 -27392 -20167 -23847 11612 27731 814 -15581 -35767 -29608 -40533 -42986
7385d2986J1257j4q662J0367K2802J1507q938l1226J5612J5523O086J6325J6308
$$ -42986 -31729 -31743 -40405 -30038 -7236 4271 -4667 -35893 -20281 -4758 1328 17653 33961
7372C3961p495k347k3801j084j4629n946n540j407J8106J4712j6918j8514j6208
$$ 33961 26466 24119 318 -766 -15395 -21341 -26881 -28288 -10182 4530 -12388 -30902 -47110
7359d7110N581J1989N061L2915L072k199J4804J3473j5253k1106j4532M049J4531
$$ -47110 -41529 -29540 -24479 8436 11508 9309 24113 37586 22333 1227 -13305 -9256 5275
7346E275J9114m80j7658k4907L922K9295q941J7292m134j8385j510J0684p950
$$ 5275 24389 23909 6251 -18656 -14734 14561 5620 22912 18778 393 -1117 9567 1617
7333A617j886M5259k8123p727p133j960K7148k5720k7388j6124J457j2026M811
$$ 1617 -269 44990 16867 9140 2007 47 27195 1475 -25913 -42037 -40580 -52606 -47795
7320d7795o028J0593M3404O312N232L7678o147l0934k1455r392k3116j0366j2393
$$ -47795 -53823 -43230 174 6486 11718 49396 43249 12315 -9140 -18532 -41648 -52014 -64407
7307f4407N583J185q495O631K93J8354j906m055j1418J469K2151L1181l682j8353
$$ -64407 -58824 -57639 -66134 -59503 -59210 -40856 -42762 -46817 -58235 -56766 -34615 -3434 -7116 -25469
7293b5469l836L0024J7907k048O137o474k1035P205J759r63k1685J830L0921L651
$$ -25469 -29305 719 18626 16578 22715 16241 -4794 2411 4170 3207 -18478 -16648 14273 17924
7279A7924K269J2224J35j4453K0032j5998k6655j7146j5006J3163m245m247k3504
$$ 17924 20193 32417 32552 18099 38131 22133 -4522 -21668 -36674 -23511 -27756 -32003 -55507
7266e5507k5529J6758J3039K0206j888p951l7198j0338J0349K6567L3947M560
$$ -55507 -81036 -64278 -51239 -31033 -32921 -40872 -78070 -88408 -78059 -51492 -17545 -12985
7254a2985J985l854Q443n121N139K2658J5589k4878j3869J1093J077q745k6600
$$ -12985 -11000 -14854 -6411 -11532 -6393 16265 31854 6976 -6893 4200 5277 -3468 -30068
7241c0068P932R028p6n006l60m170K1055J9282P414j8117j4474k8766j468K4836
$$ -30068 -22136 -13108 -13184 -18190 -18550 -22720 -1665 17617 25031 6914 -7560 -36326 -37794 -12958
7227a2958n639R604M56j3221o783K743K2759r938j2769J808M545J3892J6144r71
$$ -12958 -18597 -8993 -8537 -21758 -28541 -25798 -3039 -12977 -25746 -23938 -19393 -5501 10643 9672
7213I672j9001j5090J0960J0221O045j4863q426l2092L7145L5712O856P860J8231
$$ 9672 -9329 -24419 -13459 -3238 2807 -12056 -20482 -52574 -15429 20283 27139 34999 53230
7200E3230q173l2783j2438o498J408J5017j8457l3880J2680J1938j2523o577m777
$$ 53230 45057 12274 -164 -6662 -5254 9763 -8694 -42574 -29894 -17956 -30479 -37056 -41833
7187d1833o895J9048J1019K1011M732N177K9133o289n1396j9036k659j5347o467
$$ -41833 -48728 -29680 -18661 2350 7082 12259 41392 35103 -16293 -35329 -37988 -53335 -59802
7174e9802M3046J7990L60J1108J1063O864j8934J8308j6875k3214k8429M162K7122
$$ -59802 -16756 1234 1594 12702 23765 30629 11695 30003 13128 -10086 -38515 -34353 -7231
7161g231J3965Q73o302J2617K146k6873j3218r083j7737J3289K3967O024j8813
$$ -7231 6734 7607 1305 13922 16068 -10805 -24023 -33106 -50843 -37554 -13587 -7563 -26376
7148b6376o180P564M1048j195q093O109m862j9332k2002R097q440o17j5711l4809
$$ -26376 -32556 -24992 16056 14861 6768 12877 8015 -11317 -33319 -24222 -32662 -33279 -48990 -83799
7134h3799L5590K8917J597k255N839n398K5663R323m1877J1863j2079p396L4402
$$ -83799 -48209 -19292 -17695 -19950 -14111 -19509 6154 15477 -26400 -14537 -26616 -34012 390
7121C90j0361m509K3743P660n962j1079J630k5735l359J3353O304J4506K0081
$$ 390 -9971 -14480 9263 16923 10961 -118 1512 -24223 -27582 -14229 -7925 6581 26662
7108B6662j4196o388L1815K157j5328j0589M1904J6988j6416j6452l1844l0654
$$ 26662 12466 6078 37893 40050 24722 14133 56037 73025 56609 40157 8313 -22341
7096b2341O954J4673R299Q686J853j8221L273K035j0767l6633n2117K5710M2562
$$ -22341 -15387 -714 8585 17271 19124 903 4176 6211 -4556 -41189 -93306 -67596 -25034
7083b5034O731P85L8342J5515l4593m3601R553L3509j0587j5252j4147J4498L2417
$$ -25034 -18303 -17518 20824 36339 1746 -41855 -32302 1207 -9380 -24632 -38779 -24281 8136
7070H136J0974J97j8492j1170J7541K6283j3825j3841l2288q791O081J391O154
$$ 8136 19110 19307 815 -10355 7186 33469 19644 5803 -26485 -35276 -29195 -27804 -21650
7057b1650K8030p492r853k900k7197L2686l936J142J2648K525m412k4311k593
$$ -21650 6380 -1112 -10965 -13865 -41062 -8376 -12312 -11170 1478 4003 -409 -24720 -27313
7044b7313Q007Q694p04K5027K834j6113J9887m905m751l454n309K072n186j898
$$ -27313 -19306 -10612 -11316 13711 16545 432 20319 15414 10663 7209 1900 3972 -1214 -3112
7030c112k1737j5080J1532Q930j803J6102L5647K560L318k247n1228m4251M93
$$ -3112 -24849 -39929 -28397 -19467 -21270 -5168 30479 33039 36357 34110 -17118 -61369 -60876
7017f0876M9751Q152l60j0728O929P602K814k3638N869j61j4600l338j7967J375
$$ -60876 -11125 -2973 -3333 -14061 -7132 470 3284 -20354 -14485 -14646 -29246 -32584 -50551 -49176
7003d9176k089Q199l3366J0984M3529J2599l1508k0512J3291K1254K9771j0629
$$ -49176 -51265 -43066 -76432 -65448 -21919 -9320 -40828 -61340 -48049 -26795 2976 -7653
6991g653K553O429j0491L0152K3443k0428l8237k123M5502J7126j358k4290r133
$$ -7653 -5100 1329 -9162 20990 44433 24005 -14232 -16355 29147 46273 44915 20625 11492
6978A1492j2420k5512q381k971j3201J2453L1159M1255q55k3735k0427O227R404
$$ 11492 -928 -26440 -34821 -37792 -50993 -38540 -7381 33874 33019 9284 -11143 -4916 4488
6965D488J2524K860j8165j0675j249K2389J8531k4134k7560j8258m775L403J5216
$$ 4488 17012 19872 1707 -8968 -10217 12172 30703 6569 -20991 -39249 -44024 -40621 -25405
6952b5405K4059l965k033J1345J0284j0477O468j1459J4085J1688k2736j5762
$$ -25405 -1346 -5311 -7344 4001 14285 3808 10276 -1183 12902 24590 1854 -13908
6940a3908K716R673j942l9507r637j0306K9144L6152J637j808J999q465m502O470
$$ -13908 -11192 -1519 -3461 -42968 -52605 -62911 -33767 2385 4022 2214 4213 -4252 -8754 -2284
6926b284J1196J5782j9759j8417j022k0269n616O908p997K1063K2888P22N93k5146
$$ -2284 8912 24694 4935 -13482 -14504 -34773 -40389 -33481 -41478 -20415 2473 3195 3788 -21358
6912b1358k4001K9215J6351M585M533j2827K2950j2187j23j4636j4416j906K1188
$$ -21358 -45359 -16144 207 4792 9325 -3502 19448 7261 7138 -7498 -21914 -23820 -2632
6899b632J1889k821j4960k645J4186J3559q269N17r446j1022m670k0344J9437
$$ -2632 9257 6436 -8524 -11169 3017 16576 8307 8824 -622 -11644 -16314 -36658 -17221
6886a7221K9529Q397j9755O898K3794n511o832j2244m829m7915M537L5561m437
$$ -17221 12308 20705 950 7848 31642 26131 19299 7055 2226 -45689 -41152 -5591 -10028
6873a0028O147j3664J1050J3101J04m350j3160K614M78K3287L0491l865R334j2315
$$ -10028 -3881 -17545 -6495 6606 6710 2360 -10800 -8186 -7708 15579 46070 42205 51539 39224
6859C9224k6360k7229Q584J0995N0373p805o882K959l655j2066m4820r217J6083
$$ 39224 12864 -14365 -5781 5214 55587 47782 40900 43859 40204 28138 -16682 -25899 -9816
6846i816l877J568n779P743k3043j7414L7511n145K069K3719O131r034r28J4223
$$ -9816 -13693 -12125 -17904 -10161 -33204 -50618 -13107 -18252 -16183 7536 13667 4633 3705 17928
6832A7928j9402J204k117j9129n846J5595K4000r822J5510j241m5125k0046J2302
$$ 17928 -1474 -270 -2387 -21516 -27362 -11767 12233 2411 17921 16680 -28445 -48491 -36189
6819c6189J0319j5397k9078J5858K1203L0683J4824N259j0916n057k7979Q698
$$ -36189 -25870 -41267 -70345 -54487 -33284 -2601 12223 17482 6566 1509 -26470 -17772
6807a7772j8999O234N663l681Q226J3786p29K3521J3002k9740j7990J079O871
$$ -17772 -36771 -30537 -24874 -28555 -20329 -6543 -7272 16249 29251 -489 -18479 -17400 -10529
6794a0529K941J5848M647M423k4309j3805J6791j9060L806M144O491L8703M6331
$$ -10529 -7588 8260 12907 17330 -6979 -20784 -3993 -23053 -19247 -15103 -8612 30091 76422
6781G6422o965k3718j3138k3255k9140m9525M225K9079L0599p879J4011L240k4181
$$ 76422 69457 45739 32601 9346 -19794 -69319 -65094 -36015 -5416 -13295 716 3956 -20225
6768b0225R328J1890k4661m146J4627L9048l01l9690j9948K015N5402j0702j8537
$$ -20225 -10897 993 -23668 -27814 -13187 25861 25560 -14130 -34078 -32063 23339 12637 -5900
6755e900j3654n933k923r932j8430J9581K4535J9149k8000J6157j3150p989l430
$$ -5900 -19554 -25487 -28410 -38342 -56772 -37191 -12656 6493 -21507 -5350 -18500 -26489 -29919
6742b9919j8644J308J627o693N409L3369K4167R112m0395J6038L3039L0579Q966
$$ -29919 -48563 -47255 -45628 -52321 -46912 -13543 10624 19736 -20659 -4621 28418 58997 67963
6729F7963l248l8764j8222R985J8432K0799k0573k5582j999L5066K6679r356l1354
$$ 67963 64715 25951 7729 17714 36146 56945 36372 10790 8791 43857 70536 61180 29826
6716B9826j5349j3183j9347K7557J6183l5869j3659M240K5831N847n443N679l2102
$$ 29826 14477 1294 -18053 9504 25687 -10182 -23841 -19601 6230 12077 6634 12313 -19789
6703a9789k2105K1472j4289j5796J7380J8843J7833j0649k0605J1407J5844L8099
$$ -19789 -41894 -20422 -34711 -50507 -33127 -14284 3549 -7100 -27705 -16298 -454 37645
6691C7645L8944k1972m6085l4134J6381K5111L5335l727r085j1555m2976j8861
$$ 37645 76589 54617 8532 -25602 -9221 15890 51225 47498 38413 26858 -16118 -34979
6679c4979K150J0062O910K3435J372l0741m720M934K3538R693O140J1150j1344
$$ -34979 -32829 -22767 -15857 7578 8950 -21791 -26511 -21577 1961 11654 17794 28944 17600
6666A7600J5723j8188k7701j2295k3123K2015L7946j7324J1937j0825J063K2383
$$ 17600 33323 15135 -12566 -24861 -47984 -25969 11977 -5347 6590 -4235 -3172 19211
6654A9211K9059k7668n2354k2928M4236O316J8938j4141J607J5267l331j9634
$$ 19211 48270 20602 -31752 -54680 -10444 -4128 14810 669 2276 17543 14212 -5422
6642e422j5653J4986J8363J6011j1293l7896K491J8763j4339M027L3932J1429
$$ -5422 -21075 -6089 12274 28285 16992 -20904 -18413 350 -13989 -9962 23970 35399
6630C5399k9759j1561J1214J1195k885k2547j3093r308j5023K0557K7529m95J1510
$$ 35399 5640 -5921 5293 16488 13603 -8944 -22037 -31345 -46368 -25811 1718 1223 12733
6617A2733j961J1251q63l1577m706M542M986J942j2375K465o505l0809J3165J6881
$$ 12733 10772 22023 21160 -10417 -15123 -10581 -5595 -3653 -16028 -13563 -20068 -50877 -37712 -20831
6603b0831O306o833o384J3587J5308m785m0279j0566m156J7882K8910J6216j3517
$$ -20831 -14525 -21358 -27742 -14155 1153 -3632 -43911 -54477 -58633 -40751 -11841 4375 -9142
6590i142r943j1150k3734o905K079l723L5731M15r072j989N331j8893J8398J5795
$$ -9142 -19085 -30235 -53969 -60874 -58795 -62518 -26787 -26372 -35444 -37433 -32102 -50995 -32597 -16802
6576a6802l635J9190K413K1364J4126n905l1189l480J3402K8179o382n31J6561
$$ -16802 -20437 -1247 1166 22530 36656 30751 -438 -3918 9484 37663 31281 30750 47311
6563D7311J7681J3005m2891m4464Q867j7284N813o146P24K8606j5791l1575j85
$$ 47311 64992 77997 35106 -9358 -491 -17775 -11962 -18108 -17384 11222 -4569 -36144 -36329
6550c6329o451k8443L3N9988L3118j5575l617n353j7013J1597j3707k838j2897
$$ -36329 -42780 -71223 -71190 -11202 21916 6341 2724 -2629 -19642 -8045 -21752 -24590 -37487
6537c7487j1806L7804L3486P219p080k5014N311L475J9863j0544l7731r127j5254
$$ -37487 -49293 -11489 21997 29216 22136 -2878 2433 5908 25771 15227 -22504 -31631 -46885
6524d6885K6316J9317j6425Q761Q67k9755k481R910l152k5217J0071M1851K0748
$$ -46885 -20569 -1252 -17677 -8916 -8049 -37804 -40285 -30375 -33527 -58744 -48673 -6822 13926
6511A3926o73J142N360j2148k840O901j1935q412L992J1272L2039o957l8959j4781
$$ 13926 13253 14395 19755 7607 4767 11668 -267 -8679 -4687 6585 38624 31667 -7292 -22073
6497b2073J2412r804R250Q160J3075M952j978m536j236j6713m0418K4371J5856
$$ -22073 -9661 -19465 -10215 -2055 11020 15972 13994 9458 8222 -8491 -48909 -24538 -8682
6484h682l7429L941L6592j2239K383l679j9257J7627J8002r625J22N3l389r28
$$ -8682 -46111 -42170 -5578 -17817 -15434 -19113 -38370 -20743 -2741 -12366 -12244 -12191 -15580 -16508
6470a6508K6030M66J2898j596j7341O039l375K4694k0480N709j2829o890P924
$$ -16508 9522 9988 22886 21290 3949 9988 6613 31307 10827 16536 3707 -3183 4741
6457D741Q582J264N706j0087J1315J4866j8235m6011J9420J3311K2586j6013k817
$$ 4741 13323 14587 20293 10206 21521 36387 18152 -27859 -8439 4872 27458 11445 8628
6444H628K194q116k6502j0807N928k209L1767L340r894n036Q753P453N109j616
$$ 8628 10822 2706 -23796 -34603 -28675 -30884 883 4223 -5671 -10707 -1954 5499 10608 8992
6430H992j7832P583P100K0217K0679R888j3403l1930j3549L4071P446l6248j3057
$$ 8992 -8840 -1257 5843 26060 46739 56627 43224 11294 -2255 31816 39262 3014 -10043
6417a0043j7441L4213L2714k8604j9778O914K2269j7108q066l0419j4445J3033
$$ -10043 -27484 6729 39443 10839 -8939 -2025 20244 3136 -4930 -35349 -49794 -36761
6405c6761l819j7402M298J4916L2995O490L186K7989j0656N766j6064n0369l9978
$$ -36761 -40580 -57982 -53684 -38768 -5773 717 3903 31892 21236 27002 10938 -39431 -79409
6392g9409L2526L4672J5581K5198J4250J2789k1909k6510j1672J5553P173k6844
$$ -79409 -46883 -12211 3370 28568 42818 55607 33698 7188 -4484 11069 18242 -8602
6380h602j8660K9998J691k1602O712j3087k9033N959J8393j9433L5418L6659j3271
$$ -8602 -27262 2736 4427 -17175 -10463 -23550 -52583 -46624 -28231 -47664 -12246 24413 11142
6367A1142J9374L8585j8072k0531m0683J7816K8440n0132j026K6009k5675k319
$$ 11142 30516 69101 51029 30498 -10185 7631 36071 -14061 -15087 10922 -14753 -17072
6355a7072K1164j1967m4916j9169K5056K1082Q706j9044K8352q528n337R443j0112
$$ -17072 4092 -7875 -52791 -71960 -46904 -25822 -17116 -36160 -7808 -16336 -21673 -12230 -22342
6342b2342j2144J4864n830K5019j271j9801l863l731j592J0125J8323J7189j55
$$ -22342 -34486 -19622 -25452 -433 -1704 -21505 -25368 -29099 -30691 -20566 -2243 14946 14791
6329A4791o160j6275p119l467j9544J9948K0046J3264o82l4458J6993J805K4431
$$ 14791 8631 -7644 -14763 -18230 -37774 -17826 2220 15484 14802 -19656 -2663 -858 23573
6316B3573J1520K0757P358q497k9325l5790o046L4905j205j5309N002j8759K4526
$$ 23573 35093 55850 63208 54711 25386 -10404 -16450 18455 17250 1941 6943 -11816 12710
6303A2710J6081k0675m6418l2486K7867m648Q339K2189N157l296K2196L590r488
$$ 12710 28791 8116 -38302 -70788 -42921 -47569 -39230 -17041 -11884 -15180 7016 10606 1118
6290A118q804k95k0503J8824j8135J7853k73O476J8706Q741J241j1551j8951k7969
$$ 1118 -7686 -7981 -28484 -9660 -27795 -9942 -10215 -3739 14967 23708 24949 13398 -5553 -33522
6276c3522j5979K6440N3199k710o549o408k4684k3513j442O262Q917K1878J5681
$$ -33522 -49501 -23061 30138 27428 20879 14471 -10213 -33726 -35168 -28906 -19989 1889 17570
6263A7570L466K3298J1846j7170k29j2540R254O808j8547l0256o970j1932j5246
$$ 17570 21036 44334 56180 39010 38781 26241 35495 42303 23756 -6500 -13470 -25402 -40648
6250d0648k547L9388r252J954j612l922j209K707J0152r96M3942L2888k159j2100
$$ -40648 -43195 -3807 -13059 -11105 -12717 -16639 -17848 -15141 -4989 -5985 37957 70845 68686 56586
6236E6586k8091j8804j2137K18j1072J5572K2121J0973L918m256o788k3486J9581
$$ 56586 28495 9691 -2446 -2228 -13300 2272 24393 35366 39284 35028 28240 4754 24335
6223B4335K6074p729k938J686k9442k2849N413n031k4488j2296l549M6011m072
$$ 24335 50409 42680 39742 41428 11986 -10863 -5450 -10481 -34969 -47265 -50814 -4803 -8875
6210h875k35O01N133J5463j3790J2319K6544K054L623q493j0159Q859j2294r132
$$ -8875 -9110 -8509 -3376 12087 -1703 10616 37160 39214 42837 34344 24185 33044 20750 11618
6196A1618J4030j4025m238j8638j8804K7664L186J4000J7681n653k6520l6039
$$ 11618 25648 11623 7385 -11253 -30057 -2393 793 14793 32474 26821 301 -35738
6184c5738M5805K4992k6948n3222J0571M1286N7867j2574l2204l984l9794p407
$$ -35738 10067 35059 8111 -45111 -34540 6746 64613 52039 19835 15851 -23943 -31350
6172c1350L6401K2563k3569k4435m888M470K1778M5716j001j0473K655k178l7207
$$ -31350 5051 27614 4045 -20390 -25278 -20808 970 46686 45685 35212 37867 35689 -1518
6159a518j5855l41Q035r288J9442J1516k029J0137m614J9423L933k8032j3525
$$ -1518 -17373 -17714 -9679 -18967 475 11991 9962 20099 15485 34908 38841 10809 -2716
6146b716J515k4320k214l2822L0571J1038j2819Q081j7960L3456K9462n510k6657
$$ -2716 -1201 -25521 -27735 -60557 -29986 -18948 -31767 -23686 -41646 -8190 21272 15762 -10895
6133a0895q822L9156l2078r032n60K0702J6212J462j1241J9199J8538j5953k1230
$$ -10895 -19717 19439 -12639 -21671 -22231 -1529 14683 16145 4904 24103 42641 26688 5458
6120E458K0123j527K8921K4228k5686j6182j6834l0469j3960J6514J7654K767
$$ 5458 25581 24054 52975 77203 51517 35335 18501 -11968 -25928 -9414 8240 11007
6108A1007k4871M394o123K8270J8463r49K063k3368j1757m2353Q556N091l545
$$ 11007 -13864 -9470 -15593 12677 31140 30191 32254 8886 -2871 -45224 -36668 -31577 -35122
6095c5122K6413L7855j7921n260o08j0266m4419J7694K7166j194l0635J3037j4551
$$ -35122 -8709 29146 11225 5965 5357 -4909 -49328 -31634 -4468 -5662 -36297 -23260 -37811
6082c7811k5366L5043l196r236J7874J6561j0805j9661o360j0157n272J0702K2953
$$ -37811 -63177 -28134 -31330 -40566 -22692 -6131 -16936 -36597 -42957 -53114 -58386 -47684 -24731
6069b4731J3905p0J2545L4039k3315j0894j049J0112O727k5430q011Q325o080
$$ -24731 -10826 -10896 1649 35688 12373 1479 430 10542 17269 -8161 -16172 -7847 -13927
6056a3927m625k5170L547q166L4361k782M067j298j0717l374O544K2950L2380
$$ -13927 -18552 -43722 -40175 -48341 -13980 -16762 -12695 -13993 -24710 -28084 -21540 1410 33790
6043C3790K4715q990p648J2354l0048j1266k235l3670j7057L3995j9030j2706
$$ 33790 58505 49515 41867 54221 24173 12907 10672 -22998 -40055 -6060 -25090 -37796
6031c7796K926L4306L2866j1850k4298r206J2567N030j2j7426k4463J9177J7678
$$ -37796 -34870 -564 32302 20452 -3846 -13052 -485 4545 4533 -12893 -37356 -18179 -501
6018e01Q968R087l902j0861j2403L445r206p352j4025r178L5674j231K072j7097
$$ -501 8467 17554 13652 2791 -9612 -6167 -15373 -22725 -36750 -45928 -10254 -11485 -9413 -26510
6004b6510N617K2505P064K2082r632n802m528m3j958j1341l5879j0625J5307J9969
$$ -26510 -20893 1612 8676 30758 21126 15324 10796 10753 8795 -2546 -38425 -49050 -33743 -13774
5990a3774m845k894J6182j8591N040M7882j8171k6245J6369K1548L2050L683k0340
$$ -13774 -18619 -21513 -5331 -23922 -18882 29000 10829 -15416 953 22501 54551 58234 37894
5977C7894J0930k5180k4838m965J6123n519j9044k7941J0263k1362m369j076k770
$$ 37894 48824 23644 -1194 -6159 9964 4445 -14599 -42540 -32277 -53639 -58008 -59084 -61854
5964f1854K3563L574P815m14K5817r534o925J7128K8795j2512j668q747j5451
$$ -61854 -38291 -34717 -26902 -27316 -1499 -11033 -17958 -830 27965 15453 13785 5038 -10413
5951a0413K170j3380o74L9492Q153K459l3231j6817j0819r296K9611k624j7863
$$ -10413 -8243 -21623 -22297 17195 25348 27807 -5424 -22241 -33060 -42356 -12745 -15369 -33232
5938c3232l1781K0261N6108J1198j5943k0463L694J7138J6972q830q394k4802
$$ -33232 -65013 -44752 11356 22554 6611 -13852 -10158 6980 23952 15122 6728 -18074
5926a8074q092j5330K8026L8003n797k3303K1867L4797j6981j2782o664l4544
$$ -18074 -26166 -41496 -13470 24533 18736 -4567 17300 52097 35116 22334 15670 -18874
5914a8874J3916M1472l4725k6076l458J374j7025o565K8887J1835j6663j7567
$$ -18874 -4958 36514 1789 -24287 -27745 -26371 -43396 -49961 -21074 -9239 -25902 -43469
5902d3469K268M0619K3284o175o187j3302l268j57k030q268J49q046k211j1195
$$ -43469 -41201 -582 22702 16527 10340 -2962 -6230 -6387 -8417 -16685 -16536 -24582 -26793 -37988
5888c7988R40L7042J8249k5974m6101J1256J3214K4131J221k9453M134n565Q577
$$ -37988 -37048 -6 18243 -7731 -53832 -42576 -29362 -5231 -4010 -33463 -29329 -34894 -26317
5875b6317q020J8251M8879j2762k2957L3776J4931k85l2891q835J9059L0038M18
$$ -26317 -34337 -16086 32793 20031 -2926 30850 45781 45496 12605 3770 22829 52867 53285
5862E3285k8623j3297q014K7249J7810r441j2900J1645j0558o515o119J3892N63
$$ 53285 24662 11365 3351 30600 48410 38969 26069 37714 27156 20641 14522 28414 28977
5849B8977j8755J0010M328j2307k9583j6655k4862j0009M0826J9551J4103k9202
$$ 28977 10222 20232 24560 12253 -17330 -33985 -58847 -68856 -28030 -8479 5624 -23578
5837b3578J7043M7998J4563m4028p012J9445j8702j7506L414M475R858M692j5651
$$ -23578 -6535 41463 56026 11998 4986 24431 5729 -11777 -8363 -3888 5970 10662 -4989
5824d989R76K0176J0021j4345P387m3911m329K5167r624n4561r935K3740L0649
$$ -4989 -4013 16163 26184 11839 19226 -24685 -29014 -3847 -13471 -68032 -77967 -54227 -23578
5811b3578J4063r684j7471o429O308J7614l388m296N760k5636r511L4469J1120
$$ -23578 -9515 -19199 -36670 -43099 -36791 -19177 -22565 -26861 -21101 -46737 -56248 -21779 -10659
5798a0659J4645j7523j6340J1306R578j762j7201J1902J6819q858j3639K7157
$$ -10659 3986 -13537 -29877 -18571 -8993 -10755 -27956 -16054 765 -8093 -21732 5425
5786E425L4288R21j8160J157q084r812p458j0947k1569j5335j3626n917L2359
$$ 5425 39713 40634 22474 23631 15547 5735 -1723 -12670 -34239 -49574 -63200 -69117 -36758
5773c6758K1027P010n34J7312K1751R304j4836m436Q052j1005o893R020J5159
$$ -36758 -15731 -8721 -9255 8057 29808 39112 24276 19840 27892 16887 9994 19014 34173
5760C4173P0k0893o749j2772r31j3377o825K4624m7918j3694K1905L2658Q900
$$ 34173 34243 13350 6601 -6171 -7102 -20479 -27304 -2680 -50598 -64292 -42387 -9729 -829
5747h29n958L642N107J017J49k0757k4466j5769J5179L807L3617L3996K2387l61
$$ -829 -6787 -3145 1962 2979 3128 -17629 -42095 -57864 -42685 -38878 -5261 28735 51122 50761
5733E0761P484j1287k5456l9336j8952Q253L85N213K1910l043J5200j5022j491
$$ 50761 58245 46958 21502 -17834 -36786 -28533 -28148 -22935 -1025 -4068 11132 -3890 -5381
5720e381J8994l722K48J8383j5474r008J615j0548J0134j5432J176M08o1010p989
$$ -5381 13613 9891 10139 28522 13048 4040 5655 -4893 5241 -10191 -9015 -8607 -69617 -77606
5706g7606j1181J0350L7534M1517R892j1746L194J3601k0906j9367J3954P992
$$ -77606 -88787 -78437 -40903 614 10506 -1240 1954 15555 -5351 -24718 -10764 -2772
5694b772J8020J7761R425l851j1901J6633k7746l7542j1934j3239J1595J9976
$$ -2772 15248 33009 42434 38583 26682 43315 15569 -21973 -33907 -47146 -35551 -15575
5682a5575M421j3915M341o375q925J5944J4028J7761j1228j9007m813j3678K2232
$$ -15575 -11154 -25069 -20728 -27103 -36028 -20084 -6056 11705 477 -18530 -23343 -37021 -14789
5669a4789J8966J2930J7581m67k1661k2313q036L9338J5402l150P560k4003k2806
$$ -14789 4177 17107 34688 34221 12560 -9753 -17789 21549 36951 33801 41361 17358 -5448
5656e448J8502L967K163o223r68M345J1356J0551K7338K749j4603j4482l2333
$$ -5448 13054 17021 19184 12961 11993 16338 27694 38245 65583 68332 53729 39247 6914
5643F914j1829J9118Q683j1504j7952n014n100n585O195Q18j6538O13J3711P932
$$ 6914 -4915 14203 22886 11382 -6570 -11584 -16684 -22269 -16074 -15256 -31794 -31181 -17470 -9538
5629i538J0825j1737J4439j056L464K8289j9693m5778J3236K2692J0660o467J0796
$$ -9538 1287 -10450 3989 2933 6397 34686 14993 -30785 -17549 5143 15803 9336 20132
5616B0132J3153P634j6342j8171r416j8547J028L5066j4262q141J8268j4565L46
$$ 20132 33285 40919 24577 6406 -3010 -21557 -20529 14537 275 -7866 10402 -4163 -3817
5603c817K0896K3004J7244l3117k0675j2997l5876j7172L3615J0839k175P314
$$ -3817 17079 40083 57327 24210 3535 -9462 -45338 -62510 -28895 -18056 -20231 -12917
5591a2917J8303L853j5557k4638J1211J7369k9345r07J1796L203l809o853J1364
$$ -12917 5386 9239 -6318 -30956 -19745 -2376 -31721 -32628 -20832 -17629 -21438 -28291 -16927
5578a6927K276R8N746L1634J514k0085P781J5164K7647k6595j4119j2495l081
$$ -16927 -14651 -14553 -8807 22827 24341 4256 12037 27201 54848 28253 14134 1639 -1442
5565a442m348l2268j919P049J2664P085M313R22m644n584K1079J846L931j816
$$ -1442 -5790 -38058 -39977 -32928 -20264 -13179 -8866 -7944 -12588 -18172 2907 4753 8684 6868
5551F868M615k0688J6120K3127J909K4650O84l3990J0840O1521j2567l9752l9737
$$ 6868 11483 -9205 6915 30042 31951 56601 57285 23295 34135 95656 83089 43337 3600
5538C600j2405M6576L67K14l2178p1324P786K3168L205l099J5162K0100J6718
$$ 3600 -8805 37771 38138 38352 6174 -65150 -57364 -34196 -30991 -34090 -18928 1172 17890
5525A7890J0943J834J1851j3508J8q68j0894o208j5010k080k1005j4310L12J3948
$$ 17890 28833 30667 42518 29010 29028 28160 17266 11058 -3952 -6032 -27037 -41347 -41035 -27087
5511b7087M9332K1017N422K0154k2393m0633l4070l3277k569L1756K3339J3043
$$ -27087 22245 43262 48684 68838 46445 5812 -28258 -61535 -64104 -32348 -9009 4034
5499D034j2330J4480K2913p334l2526q184L369j6231Q686N2265K5537j7082k6718
$$ 4034 -8296 6184 29097 21763 -10763 -18947 -15578 -31809 -23123 29142 54679 37597 10879
5486A0879n300j1816J3677K6176K6713L569j8642k5767j4029J4455J4143j5425
$$ 10879 5579 -6237 7440 33616 60329 63898 45256 19489 5460 19915 34058 18633
5474A8633R26Q048q705J0644j5628l1249j0410L5602K5052K2648j3610L742o801
$$ 18633 19559 27607 18902 29546 13918 -17331 -27741 7861 32913 55561 41951 45693 38892
5461C8892o954n069M952j6603l360J4381J6208j1490j3749J3768J7071j9307q089
$$ 38892 31938 26869 31821 15218 11858 26239 42447 30957 17208 30976 48047 28740 20651
5448B0651j611O977r203j5137k554J9927p412N307o891l2776J1448M823l77k587
$$ 20651 19040 26017 16814 1677 -877 19050 11638 16945 10054 -22722 -11274 -6451 -6828 -9415
5434i415J4490N863K627K1822M930q097p064r07j9506K1590M1039j7413j3632
$$ -9415 5075 10938 13565 35387 40317 32220 25156 24249 4743 26333 67372 49959 36327
5421C6327n31q818l7710j7877O606M9751J7828L779l474Q702j4677j5287j3264
$$ 36327 35796 26978 -10732 -28609 -22003 27748 45576 49355 45881 54583 39906 24619 11355
5408A1355L7462J1489l8996k7384j0520J0362J8680n757k5784j7955k510j1387
$$ 11355 48817 60306 21310 -6074 -16594 -6232 12448 6691 -19093 -37048 -39558 -50945
5396e0945K1376J5779r226J2936m239j293l565K1975J5107k1831j2959k1498j6591
$$ -50945 -29569 -13790 -23016 -10080 -14319 -15612 -19177 2798 17905 -3926 -16885 -38383 -54974
5383e4974k614N5558K7588J478k3453J3044J098j9690j3487J6889R855n210K0443
$$ -54974 -57588 -2030 25558 27036 3583 16627 17725 -1965 -15452 1437 11292 6082 26525
5370B6525k950k1640J4270k7616j2636L6109l113j339K4861l3344J1709J4404
$$ 26525 23575 1935 16205 -11411 -24047 12062 8949 7610 32471 -873 10836 25240
5358B5240m597M980k0044N756K4304j3611m0081l595M0168K9815j2065k4814k3412
$$ 25240 20643 25623 5579 11335 35639 22028 -18053 -21648 18520 48335 36270 11456 -11956
5345a1956k0822m460j0882P246n161P411J6025J4612Q010J2135k4180j6351K2180
$$ -11956 -32778 -37238 -48120 -40874 -46035 -38624 -22599 -7987 23 12158 -12022 -28373 -6193
5332f193J6956j158q948N48K182m640j5565p824L221m099M3579K120L075k5252
$$ -6193 10763 9605 657 1205 3387 -1253 -16818 -24642 -21421 -25520 18059 20179 23254 -1998
5318a998k071j9782R648J5217J1131l638J4917J6983j4180l4501p802M8163L3150
$$ -1998 -4069 -23851 -14203 1014 12145 8507 23424 40407 26227 -8274 -16076 32087 65237
5305F5237k855j5670j9167O238M618j1670m815l8430L636j8612Q006L9360L5532
$$ 65237 62382 46712 27545 33783 38401 26731 21916 -16514 -12878 -31490 -23484 15876 51408
5292E1408Q848j2962q128n2165l0382K702k264j6436K0520L8808j7045k6851L2022
$$ 51408 60256 47294 39166 -12999 -43381 -40679 -42943 -59379 -38859 -51 -17096 -43947 -11925
5279a1925K2179l1725q988J5683m418J0896J0869m484k4746J5360K9012j5404
$$ -11925 10254 -21471 -30459 -14776 -19194 -8298 2571 -1913 -26659 -11299 17713 2309
5267B309k8728q339N928J9435J1346K950K682k5178k4055l489k61j8696M359K5777
$$ 2309 -26419 -34758 -28830 -9395 1951 4901 7583 -17595 -41650 -45139 -45400 -64096 -59737 -33960
5253c3960J4951N8J238r490q913L1303J2923J504j6396j1186O838O703Q914o771
$$ -33960 -19009 -18951 -17713 -27203 -36116 -4813 8110 9614 -6782 -17968 -11130 -4427 4487 -2284
5239b284k671K4398J874P938j8703j5542L888q068l382k2805l074j865L4834p37
$$ -2284 -4955 19443 21317 29255 10552 -4990 -1102 -9170 -12552 -35357 -38431 -40296 -5462 -6199
5225f199o199o138J0744J7944P304k6098r404L1862L409j1327j1231j2544J387
$$ -6199 -12398 -18536 -7792 10152 17456 -8642 -18046 13816 17225 5898 -5333 -17877 -16490
5212a6490Q99k2832J4797J2666j8432M937O527L681m712j1224J998J5162K3657
$$ -16490 -15591 -38423 -23626 -10960 -29392 -24455 -17928 -14247 -18959 -30183 -28185 -13023 10634
5199A0634j6404J0043k8003k4686N849J4582j2741o96K3602o773m138K9418j473
$$ 10634 -5770 4273 -23730 -48416 -42567 -27985 -40726 -41422 -17820 -24593 -28731 687 -786
5186g86o587J812K4671K4577l6594j0018M1469j3387j8686k370J3442M246j1471
$$ -786 -7373 -5561 19110 43687 7093 -2925 38544 25157 6471 4101 17543 21789 10318
5173A0318p524n769j9500J1013j4982l4854K07M151k4960K6940M0562K6190k576
$$ 10318 2794 -2975 -22475 -11462 -26444 -61298 -61091 -56940 -81900 -54960 -14398 11792 9216
5160I216p952l5165j2773J7532L0070K0932K5284J6343M502O583l4473m6409j1330
$$ 9216 1264 -33901 -46674 -29142 928 21860 47144 63487 67989 74572 40099 -6310 -17640
5147a7640k4474j2380L1065M1053K5994j4473l3977N580q814j2025j4251M04K4049
$$ -17640 -42114 -54494 -23429 17624 43618 29145 -4832 748 -8066 -20091 -34342 -33938 -9889
5134i889M0157K0725j3042l7051j4247J2770j3096j4576P705K6645M303m37k3694
$$ -9889 30268 50993 37951 900 -13347 -577 -13673 -28249 -20544 6101 10404 9967 -13727
5121a3727K7233j3517l002Q375j0640P256N817j946J6014j0269P39k4636N75L2026
$$ -13727 13506 -11 -3013 5362 -5278 1978 7795 5849 21863 11594 12333 -12303 -11728 20298
5107B0298j911j0517l8857j8418m128r453J4865M8162J0703N889Q684j7605J7312
$$ 20298 18387 7870 -30987 -49405 -53533 -62986 -48121 41 10744 16633 25317 7712 25024
5094B5024l78R473K000k0628l6291j1096J2891K2205J2695j3816k332k177N788
$$ 25024 24646 34119 36119 15491 -20800 -31896 -19005 3200 15895 2079 -253 -2430 3358
5081C358m813j5989N386j5492P3k5687r791L8881M4670o423k1264q832J1910R513
$$ 3358 -1455 -17444 -12058 -27550 -27477 -53164 -62955 -24074 20596 14173 -7091 -15923 -4013 5500
5067E500K0379J8476o3743n712m299j8074j5965j166P424L8222j6478n582J8883
$$ 5500 25879 44355 -19388 -25100 -29399 -47473 -63438 -64604 -57180 -18958 -35436 -41018 -22135
5054b2135n553L0050n636k4174l5938L9808L1406j1184o392P570N858M049M0668
$$ -22135 -27688 2362 -3274 -27448 -63386 -23578 7828 -3356 -9748 -2178 3680 7729 48397
5041D8397N977j1598j5149k647P237J2247j7373m2969l320n485J4154r951j0121
$$ 48397 54374 42776 27627 24980 32217 44464 27091 -15878 -19198 -24683 -10529 -20480 -30601
5028c0601j4899K0829O480r086L302q41k8146J4979J4442N753R427J6733r416
$$ -30601 -45500 -24671 -18191 -27277 -23975 -24816 -52962 -37983 -23541 -17788 -8361 8372 -1044
5015a044j7995K1043k6850j7561J7765K1972K4885J2179n579j5362k5664m119
$$ -1044 -19039 2004 -24846 -42407 -24642 -2670 22215 34394 28815 13453 -12211 -16330
5003a6330O49n339k4185j9067L4918J9924p255p743J8553K7044J2975j8277N850
$$ -16330 -15681 -21020 -45205 -64272 -29354 -9430 -16685 -24428 -5875 21169 34144 15867 21717
4990B1717l2575j1607N9512M3688N61O621k5561n5338j0237K2930O289k5121j0007
$$ 21717 -10858 -22465 37047 80735 81296 87917 62356 7018 -3219 19711 26000 879 -9128
4977i128q21Q972l0462J5146J7905j8665p975k0710k7852J4890J9704N153Q893
$$ -9128 -9949 -977 -31439 -16293 1612 -17053 -25028 -45738 -73590 -58700 -38996 -33843 -24950
4964b4950N732j3494J1597K2564K0922j0344J8799M314l0141Q12J3600O326k2850
$$ -24950 -19218 -32712 -21115 1449 22371 12027 30826 35140 4999 5811 19411 25737 2887
4951B887j5583K1429p596k0838J9146K8597o23j1515j1032j495j304j7894l2006
$$ 2887 -12696 8733 1137 -19701 -555 28042 27419 15904 4872 3377 2073 -15821 -47827
4938d7827j0124J0546j3136j4165J5760N3045L8705p339j3500K531L311K5062
$$ -47827 -57951 -47405 -60541 -74706 -58946 -5901 32804 25465 11965 14496 17807 42869
4926D2869j44l577j6444K548j4649j8379O706Q207l3177j3919M0234J3297L677
$$ 42869 42725 39148 22704 25252 10603 -7776 -1070 7137 -26040 -39959 275 13572 17249
4913A7249l647J0029K6819L1438m7002l4563L7293l1797j3587K2166J4700r559
$$ 17249 13602 23631 50450 81888 34886 323 37616 5819 -7768 14398 29098 19539
4901A9539N784M67k2454J7361j0488l3418l3682q172q741K8099P540K0320J448
$$ 19539 25323 25790 3336 20697 10209 -23209 -56891 -65063 -73804 -45705 -38165 -17845 -16397
4888a6397j1295q619K724K920J0052k2165J6738k0604n808l2113j1148K6150L9540
$$ -16397 -27692 -36311 -33587 -30667 -20615 -42780 -26042 -46646 -52454 -84567 -95715 -69565 -30025
4875c0025J4963K815j1549j0726j4431J8100K5440q480J0734o942k1680j3313
$$ -30025 -15062 -12247 -23796 -34522 -48953 -30853 -5413 -13893 -3159 -10101 -31781 -45094
4863d5094K9161l0644j125O491J3714O050l2471l6967L0674L680k23K22M23J9381
$$ -45094 -15933 -46577 -47702 -41211 -27497 -21447 -53918 -90885 -60211 -56531 -56754 -56532 -56109 -36728
4849c6728M2127j5884q476J1528k803p836J1606j65j5641R218r967n492p253Q811
$$ -36728 5399 -10485 -18961 -7433 -10236 -18072 -6466 -6631 -22272 -13054 -23021 -28513 -35766 -26955
4835b6955Q959J6240o070L0735p119J9314J3983j8250k4581j2847l153P748j7512
$$ -26955 -17996 -1756 -7826 22909 15790 35104 49087 30837 6256 -6591 -9744 -1996 -19508
4822a9508j346j1623j6471J1070P776j92J3442k1761k5438O996J2976J1477J8463
$$ -19508 -20854 -32477 -48948 -37878 -30102 -30294 -16852 -38613 -64051 -57055 -44079 -32602 -14139
4809a4139K2333Q241j3185q997K2431J1432j0941R350j2875j213J028n5024j2428
$$ -14139 8194 16435 3250 -5747 16684 28116 17175 26525 13650 12437 13465 -41559 -53987
4796e3987K9406k9670N489K2052K6202J9416N462l2355K350J4909Q041n124J4675
$$ -53987 -24581 -54251 -48762 -26710 -508 18908 24370 -7985 -5635 9274 17315 12191 26866
4783B6866j289j0610j0516M2904K6505j0035k8299m1430l7887O853O706J1202
$$ 26866 25577 14967 4451 47355 73860 63825 35526 -5904 -43791 -36938 -30232 -19030
4771a9030p734k0174k6K0446J9675m1599k2106J8179l711J4495K9944K7477P059
$$ -19030 -26764 -46938 -46964 -26518 -6843 -48442 -70548 -52369 -56080 -41585 -11641 15836 22895
4758B2895j4073P100n465l6584n483n759m02P200K7330J8183j6804J4792k2400
$$ 22895 8822 15922 10457 -26127 -31610 -37369 -37771 -30571 -3241 14942 -1862 12930 -9470
4745i470j3917K0561L2431L4416j5065l5564j3074J535K1006l2071l8547Q830
$$ -9470 -23387 -2826 29605 64021 48956 13392 318 1853 22859 -9212 -47759 -38929
4733c8929J92J6143k767j2049R676K7520J5712o945J0241l5181j9108J9518M216
$$ -38929 -38737 -22594 -25361 -37410 -27734 -214 15498 8553 18794 -16387 -35495 -15977 -11761
4720a1761L378o925L1833K610k1641j3106J2927L0705j4139j2060j2108j2445
$$ -11761 -8383 -15308 16525 19135 -2506 -15612 -2685 28020 13881 1821 -10287 -22732
4708b2732Q669J3028M071J4277Q740j6000K402j8996q243J0768l012j2538j8435
$$ -22732 -14063 -1035 3036 17313 26053 10053 12455 -6541 -14784 -4016 -7028 -19566 -38001
4695c8001K5693J6279l2017j4440r867K7705p773l279J8150J9473n970j9074j1435
$$ -38001 -12308 3971 -28046 -42486 -52353 -24648 -32421 -35700 -17550 1923 -4047 -23121 -34556
4682c4556J55J4320L1332R860l4716L78L7840M92l039j5227k7766m861J0367J8980
$$ -34556 -34401 -20081 11251 21111 -13605 -13227 24613 25105 22066 6839 -20927 -25788 -15421 3559
4668C559J9579l216J1879J6030j2262j8244J3277j315L495M670n3907o438L7141
$$ 3559 23138 19922 31801 47831 35569 17325 30602 29287 32782 37452 -16455 -22893 14248
4655A4248P034L806O991o9903j5248K3678L083k9362J0694q841q548K0805K0203
$$ 14248 21282 25088 32079 -37824 -53072 -29394 -26311 -55673 -44979 -53820 -62368 -41563 -21360
4642b1360j5257Q866P915P927m56q396n889k8787L1493J0223j5953j6981n994
$$ -21360 -36617 -27751 -19836 -11909 -12365 -20761 -26650 -55437 -23944 -13721 -29674 -46655 -52649
4629e2649L7866J6604o708k3962l596P411J1419J1111j9625K954L700l442l2859
$$ -52649 -14783 1821 -4887 -28849 -32445 -25034 -13615 -2504 -22129 -19175 -15475 -18917 -51776
4616e1776k0586K05J8267K1356K0426j3678J0539Q781J9026p322l246N968j931
$$ -51776 -72362 -72157 -53890 -32534 -12108 -25786 -15247 -6466 12560 5238 1992 7960 6029
4603F029k277L915o04O26p730J0756K5106j7428l301K2095j1539p729q328j9525
$$ 6029 3752 7667 7063 7689 -41 10715 35821 18393 15092 37187 25648 17919 9591 -9934
4589i934j4464J1201L3431P932r095p175l950j06K0475J0656J0532K73l5342K85
$$ -9934 -24398 -13197 20234 28166 19071 11896 7946 7840 28315 38971 49503 49776 14434 14719
4575A4719J2039n499K407j0313k151m736J2960r311k6731J6803Q5P101Q792j9542
$$ 14719 26758 21259 23666 13353 11202 6466 19426 10115 -16616 187 272 7373 16165 -3377
4561c377j624J4249K8956K6578O758j6059k2573j5268o784Q271O208L220j530
$$ -3377 -5001 9248 38204 64782 71540 55481 32908 17640 10856 19127 25335 28555 27025
4548B7025l0792j7948q816L0449K7984l215J886m114k0781J0220O503l390N148
$$ 27025 -3767 -21715 -30531 -82 27902 24687 26573 22459 1678 11898 18401 15011 20159
4535B0159j8261k6329K6431K2682p260r994j2124k4796J0512K6787J719l2906
$$ 20159 1898 -24431 2000 24682 17422 7428 -4696 -29492 -18980 7807 9526 -23380
4523b3380k06k9701j842L5651L0261K9140k7118R7J2099j3306j036j0353n619
$$ -23380 -23586 -53287 -55129 -19478 10783 39923 12805 12902 25001 11695 10659 306 -5313
4510e313o816J6582l487j240l5231l151P449J3693Q515J8063k5252j4286O868
$$ -5313 -12129 4453 966 -274 -35505 -38656 -31207 -17514 -8999 9064 -16188 -30474 -23606
4497b3606l2786k4978m099J9776N2243k47m3421l23L382K2761K0791k009j3416
$$ -23606 -56392 -81370 -85469 -65693 -13450 -13697 -57118 -57441 -54059 -31298 -10507 -12516 -25932
4484b5932j1305J0234J7353J1031n100k7022j8902J2649J5388N181L3383l786
$$ -25932 -37237 -27003 -9650 1381 -3719 -30741 -49643 -36994 -21606 -16425 16958 13172
4472A3172m0636k2673j1850M1150J9252m333J5083K0900j8648j0749L6361K0180
$$ 13172 -27464 -50137 -61987 -20837 -1585 -5918 9165 30065 11417 668 37029 57209
4460E7209k5170j4611j718q276k5782l533Q535J7979k0386l144m997q014L4918
$$ 57209 32039 17428 15710 7434 -18348 -21881 -13346 4633 -15753 -18897 -23894 -31908 3010
4447C010M8667P274k0105k6746l0022j3744J7615K365K111j3966M100K2718K220
$$ 3010 51677 58951 38846 12100 -17922 -31666 -14051 -11686 -9575 -23541 -19441 3277 5497
4434E497j2314k2410j3283R268m10K8502K3607K1798J530J1455j0387O832K794
$$ 5497 -6817 -29227 -42510 -33242 -33652 -5150 18457 40255 41785 53240 42853 49685 52479
4421E2479j1858k7945J642K2846p249k8697o498K478N103o254j8682J9717J1229
$$ 52479 40621 12676 14318 37164 29915 1218 -5280 -2802 2301 -3953 -22635 -2918 8311
4408H311l232j041J128Q272J248m96m096j8165l333M688J0041j8147M4213L624
$$ 8311 5079 4038 5166 13438 14686 14190 10094 -8071 -11404 -6716 3325 -14822 29391 33015
4394C3015o927k1067j8555o97N0928J1210k0834k8305k054l052j5756p298J8671
$$ 33015 26088 5021 -13534 -14231 36697 47907 27073 -1232 -3286 -6338 -22094 -29392 -10721
4381a0721K0945K613l48j3895k0265m990o266J1617L5449J0256K415r988l7943
$$ -10721 10224 12837 12489 -1406 -21671 -26661 -32927 -21310 14139 24395 26810 16822 -21121
4368b1121l2202J3614K6389L1696K611q602O81M179k4337j7934L3787O4701K9252
$$ -21121 -53323 -39709 -13320 18376 20987 12385 13066 17245 -7092 -25026 8761 73462 102714
4355A02714j8286p0997l8583j0219K1447K4136N737j8885J3789J8019L575j4955
$$ 102714 84428 13431 -25152 -35371 -13924 10212 15949 -2936 10853 28872 32447 17492
4343A7492j7224q453R799p65p761K9414N251p802n511k2569K0263L4440K0454
$$ 17492 268 -8185 1614 849 -6912 22502 27753 19951 14440 -8129 12134 46574 67028
4330F7028k6431m8217k025K2081R472j7907j7795L0847k3661k2328L7489P253
$$ 67028 40597 -7620 -9645 12436 21908 4001 -13794 17053 -6608 -28936 8553 15806
4318A5806l966r411L372m20l727Q694r641j2424j8933R277R218R976j8253k870
$$ 15806 11840 2429 5801 5381 1654 10348 707 -11717 -30650 -21373 -12155 -2179 -20432 -23302
4304b3302L02J1483Q260Q181J0658k5811p103J2663j3922J2568L5912j5741m560
$$ -23302 -23000 -11517 -3257 4924 15582 -10229 -17332 -4669 -18591 -6023 29889 14148 9588
$$ [...]
##END NTUPLES=NMR SPECTRUM
##END=
