##TITLE=Analysis number 326509
Compound Code cc 63639
Book Reference 470/148
Project Code adrs
Chemist Name mikem
##JCAMPDX= 6.0         $$ Bruker NMR JCAMP-DX V2.0
##DATA TYPE= NMR SPECTRUM
##DATA CLASS= NTUPLES
##ORIGIN= Bruker BioSpin GmbH
##OWNER= nmr
$$ XWIN-NMR		Version 3.5
$$ Fri Feb  9 09:54:50 2007 GMT Standard Time (UT+0h)  MAYBRIDGE\nmr@NMR_250MHZ
##.OBSERVE FREQUENCY= 250.131544655141
##.OBSERVE NUCLEUS= ^1H
##.ACQUISITION MODE= SIMULTANEOUS (DQD)
##.ACQUISITION SCHEME= undefined
##.AVERAGES= 16
##.DIGITISER RES= 18
##SPECTROMETER/DATA SYSTEM= dpx250
##.PULSE SEQUENCE= zg30
##.SOLVENT NAME= CDCl3
##.SHIFT REFERENCE= (INTERNAL, CDCl3, 0, 16.4424)
##AUDIT TRAIL= $$ (NUMBER, WHEN, WHO, WHERE, WHAT)
$$ ##TITLE= Audit trail, XWIN-NMR		Version 3.5
$$ ##JCAMPDX= 5.01
$$ ##ORIGIN= Bruker BioSpin GmbH
$$ ##OWNER= nmr
$$ C:\u/data/dgb/nmr/ADRS/600/pdata/1/auditp.txt
$$ ##AUDIT TRAIL=  $$ (NUMBER, WHEN, WHO, WHERE, WHAT)
(   1,<2007-02-09 09:54:29.68 +000>,<MAYBRIDGE\nmr>,<NMR_250MHZ>,
      <created by zg, POWCHK disabled, PULCHK disabled
       configuration hash MD5:
       49 4B E0 1D 92 C2 6B 37 9F E6 65 BC 52 41 86 1D
       data hash MD5: 64K
       EB 64 A1 15 03 B3 77 BD 70 7E 71 89 62 2C 4B 5F>)
(   2,<2007-02-09 09:54:42.57 +000>,<MAYBRIDGE\nmr>,<NMR_250MHZ>,
      <Start of raw data processing
       ef LB = 0.3 FT_mod = 6 PKNL = 1 SI = 32K 
       data hash MD5: 32K
       0B 6D A3 CA 59 9E A9 3E 2D 05 C5 D9 5C 5F E9 90>)
(   3,<2007-02-09 09:54:44.18 +000>,<MAYBRIDGE\nmr>,<NMR_250MHZ>,
      <apk 
       data hash MD5: 32K
       53 57 59 7B 02 55 EE 4C 32 D1 92 67 42 18 BE E3>)
(   4,<2007-02-09 09:54:44.85 +000>,<MAYBRIDGE\nmr>,<NMR_250MHZ>,
      <abs ABSG = 5 
       data hash MD5: 32K
       93 65 2F E3 D3 F3 2B 4C 88 E0 BC DD 17 73 5D 94>)
$$ ##END=
$$ 
$$ hash MD5
$$ 9B 57 D4 38 A3 79 8D 81 72 58 14 1D 2A FD B4 0A
##$RELAX= 
##$RELAX= 
##$RELAX= 
##$RELAX= 
##$RELAX= 
##$RELAX= 
##$RELAX= 
$$ Bruker specific parameters
$$ --------------------------
##$DU= <C:\u>
##$EXPNO= 600
##$NAME= <ADRS>
##$PROCNO= 1
##$TYPE= <nmr>
##$USER= <dgb>
##$AMP= (0..31)
100 100 100 100 100 100 100 100 100 100 100 100 100 100 100 100 100 100 
100 100 100 100 100 100 100 100 100 100 100 100 100 100 
##$AQSEQ= 0
##$AQ_mod= 3
##$AUNM= <au_zg>
##$AUTOPOS= <28 >
##$BF1= 250.13
##$BF2= 250.13
##$BF3= 250.13
##$BF4= 250.13
##$BF5= 500.13
##$BF6= 500.13
##$BF7= 500.13
##$BF8= 500.13
##$BYTORDA= 1
##$CFDGTYP= 0
##$CFRGTYP= 5
##$CHEMSTR= <none>
##$CNST= (0..31)
1 1 145 1 1 1 1 1 1 1 1 1 1 1 1 1 1 1 1 1 1 1 1 1 1 1 1 1 1 1 1 1 
##$CPDPRG= <>
##$CPDPRG1= <>
##$CPDPRG2= <>
##$CPDPRG3= <>
##$CPDPRG4= <mlev>
##$CPDPRG5= <mlev>
##$CPDPRG6= <mlev>
##$CPDPRG7= <mlev>
##$CPDPRG8= <mlev>
##$CPDPRGB= <>
##$CPDPRGT= <>
##$D= (0..31)
0 1 0 0 0 0 0 0 0 0.06 0 0 0 0 0 0 0.0002 0 0 0 0 0 0 0 0 0 0 0 0 0 0 
0 
##$DATE= 1171014868
##$DBL= (0..7)
120 120 120 120 120 120 120 120 
##$DBP= (0..7)
150 150 150 150 150 150 150 150 
##$DBP07= 0
##$DBPNAM0= <>
##$DBPNAM1= <>
$$ [...]
##$SUBNAM7= <"">
##$SUBNAM8= <"">
##$SUBNAM9= <"">
##$SW= 20.6930455092707
##$SWIBOX= (0..15)
0 0 3 0 0 0 0 0 0 0 0 0 0 0 0 0 
##$SW_h= 5175.983436853
##$TD= 65536
##$TD0= 1
##$TE= 294.16
##$TE2= 300
##$TE3= 300
##$TEG= 300
##$TL= (0..7)
0 120 120 120 120 120 120 120 
##$TP= (0..7)
150 150 150 150 150 150 150 150 
##$TP07= 0
##$TPNAME0= <>
##$TPNAME1= <>
##$TPNAME2= <>
##$TPNAME3= <>
##$TPNAME4= <>
##$TPNAME5= <>
##$TPNAME6= <>
##$TPNAME7= <>
##$TPOAL= (0..7)
0.5 0.5 0.5 0.5 0.5 0.5 0.5 0.5 
##$TPOFFS= (0..7)
0 0 0 0 0 0 0 0 
##$TUNHIN= 0
##$TUNHOUT= 0
##$TUNXOUT= 0
##$USERA1= <user>
##$USERA2= <user>
##$USERA3= <user>
##$USERA4= <user>
##$USERA5= <user>
##$V9= 5
##$VALIST= <valist>
##$VCLIST= <CCCCCCCCCCCCCCC>
##$VD= 0
##$VDLIST= <DDDDDDDDDDDDDDD>
##$VPLIST= <PPPPPPPPPPPPPPP>
##$VTLIST= <TTTTTTTTTTTTTTT>
##$WBST= 1024
##$WBSW= 4
##$XGAIN= (0..3)
0 0 0 0 
##$XL= 0
##$YL= 0
##$YMAX_a= 414780
##$YMIN_a= -394394
##$ZGOPTNS= <>
##$ZL1= 120
##$ZL2= 120
##$ZL3= 120
##$ZL4= 120
##$ABSF1= 16.4424
##$ABSF2= -4.250772
##$ABSG= 5
##$ABSL= 3
##$ALPHA= 0
##$AQORDER= 0
##$ASSFAC= 0
##$ASSFACI= 0
##$ASSFACX= 0
##$ASSWID= 0
##$AUNMP= <proc_1d>
##$AZFE= 0.1
##$AZFW= 0.1
##$BCFW= 0
##$BC_mod= 0
##$BYTORDP= 0
##$COROFFS= 0
##$CY= 12.5
##$DATMOD= 1
##$DC= 0
##$DFILT= <>
##$DTYPP= 0
##$F1P= 14.0000005364418
##$F2P= -0.99999901652339
##$FCOR= 0.5
##$FTSIZE= 32768
##$FT_mod= 6
##$GAMMA= 0
##$GB= 0
##$INTBC= 1
##$INTSCL= 1
##$ISEN= 128
##$LB= 0.3
##$LEV0= 0
##$LPBIN= 0
##$MAXI= 10000
##$MC2= 0
##$MEAN= 0
##$ME_mod= 0
##$MI= 0
##$NCOEF= 0
##$NC_proc= -2
##$NLEV= 6
##$NOISF1= 0
##$NOISF2= 0
##$NSP= 0
##$NTH_PI= 0
##$NZP= 0
##$OFFSET= 16.4424
##$PC= 1
##$PHC0= 231.5201
##$PHC1= 6.109011
##$PH_mod= 1
##$PKNL= yes
##$PPARMOD= 0
##$PSCAL= 4
##$PSIGN= 0
##$REVERSE= no
##$SF= 250.130019909288
##$SI= 32768
##$SIGF1= 0
##$SIGF2= 0
##$SINO= 400
##$SIOLD= 32768
##$SREGLST= <1H.CDCl3>
##$SSB= 0
##$STSI= 32768
##$STSR= 0
##$SW_p= 5175.98343685301
##$SYMM= 0
##$S_DEV= 0
##$TDeff= 65536
##$TDoff= 0
##$TI= <Analysis number 999999
Compound Code 99
Book Reference 9
Project Code 9>
##$TILT= no
##$TM1= 0
##$TM2= 0
##$TOPLEV= 0
##$USERP1= <user>
##$USERP2= <user>
##$USERP3= <user>
##$USERP4= <user>
##$USERP5= <user>
##$WDW= 1
##$XDIM= 32768
##$YMAX_p= 463124423
##$YMIN_p= -62922
$$ End of Bruker specific parameters
$$ ---------------------------------
##NTUPLES= NMR SPECTRUM
##VAR_NAME=  FREQUENCY,     SPECTRUM/REAL,   SPECTRUM/IMAG
##SYMBOL=    X,             R,               I
##VAR_TYPE=  INDEPENDENT,   DEPENDENT,       DEPENDENT
##VAR_FORM=  AFFN,          ASDF,            ASDF
##VAR_DIM=   32768,         32768,           32768
##UNITS=     HZ,            ARBITRARY UNITS, ARBITRARY UNITS
##FACTOR=    0.157963299565203, 1,           1
##FIRST=     4112.73783401312, 0,            0
##LAST=      -1063.24560283989, 0,           0
##MIN=       -1063.24560283989, -62922,      0
##MAX=       4112.73783401312, 463124423,    0
$$ Real data points
##PAGE= N=1
##DATA TABLE= (X++(R..R)), XYDATA
$$ [...]
$$ plain form
15193 5840 2065 12118 30677 47299 56094 49151 30250 16099 2852 -5084 -4831 4133 18372
15180 18372 10725 1709 7226 15883 21878 24251 20426 19080 11529 4901 -3480 -3713 -11252 -4291 1477
15165 1477 10350 11539 10486 6118 9709 2876 -13580 -14068 12183 29724 27746 17723 20839 5506
15151 5506 -14421 -17810 2533 3075 -18306 -14243 -1774 9065 8799 -3777 -16659 -14490 -8198
15138 -8198 -4583 -2231 -9091 -21416 -17452 -12364 -4976 7956 11749 6690 3008 -17847 -20840 -22029
15124 -22029 -24175 -13379 -15311 -27976 -18718 -1929 2726 3423 -2297 -1391 9739 33069 36283 23054
15110 23054 -5547 -6678 6448 -1239 -7378 2151 -2626 2774 13845 13035 17727 21656 35462 32628
15096 32628 19133 16195 9785 14146 19039 35498 66066 105725 141669 179878 200486 223670
$$ packed form
15193E840l775J0053J8559J6622Q795o943j8901j4151j3247p936K53Q964J4239
15180A8372p647r016N517Q657N995K373l825j346p551o628q381k33p539O961N768
15165A477Q873J189j053m368L591o833j6456m88K6251J7541j978j0023L116j5333
15151E506j9927l389K0343N42k1381M063J2469J0839k66j2576j2882K169O292
15138h198L615K352o860j2325L964N088P388J2932L793n059l682k0855k993j189
15124b2029k146J0796j932j2665R258J6789M655O97n720R06J1130K3330L214j3229
15110B3054k8601j131J3126p687o139R529m777N400J1071q10M692L929J3806k834
15096C2628j3495k938o410M361M893J6459L0568L9659L5944L8209K0608K3184
$$ plain form
15084 223670 252508 288777 280892 266382 260236 251069 217220 179797 156175 130809 119625 105949
15072 105949 76734 49288 43837 45072 47528 41788 28625 37285 30738 6839 -2505 4254 4979
15059 4979 7493 1272 3366 -93 6452 7510 4749 16875 17762 1692 14654 21778 17943 10665
15045 10665 16078 17325 18996 16126 12650 1660 -6150 -226 18521 26622 27446 14587 2318 -11989
15031 -11989 -2929 7868 3732 637 -4777 -15009 377 12631 19537 8999 13538 27400 13799
15018 13799 8522 13877 11926 7532 4703 7787 17749 10569 -900 15548 22413 12184 1191
15005 1191 -5958 341 -9672 -11528 -10583 2742 9939 18106 15977 13048 19588 28446 35052 39216
14991 39216 42611 38384 33433 23281 33261 41529 30680 20941 10570 20675 16304 14518 15428 2478
$$ packed form
15084B23670K8838L6269p885j4510o146r167l3849l7423k3622k5366j1184j3676
15072A05949k9215k7446n451J235K456n740j3163Q660o547k3899r344O759P25
15059D979K514o221K094l459O545J058k761J2126Q87j6070J2962P124l835p278
15045A0665N413J247J671k870l476j0990p810N924J8747Q101Q24j2859j2269j4307
15031a1989R060J0797m136l095n414j0232J5386J2254O906j0538M539J3862j3601
15018A3799n277N355j951m394k829L084R962p180j1469J6448O865j0229j0993
15005A191p149O299j0013j856R45J3325P197Q167k129k929O540Q858O606M164
14991C9216L395m227m951j0152R980Q268j0849r739j0371J0105m371j786R10j2950
$$ plain form
14977 2478 1022 6302 1771 -11444 -8033 -2834 8805 8943 23389 25559 11932 -9292 -6197 5434
14963 5434 17238 25712 13666 -1374 -14058 -3143 -3064 -6933 -6309 -8365 -5639 -1974 -22714 -35668
14949 -35668 -24882 -6317 18123 26518 11144 6547 -5426 -17071 -9871 10176 15838 15936 18447
14936 18447 16736 26194 24409 22060 14555 5787 1414 11855 11448 19240 21571 7612 4174 488
14922 488 13349 4867 -5354 -8849 -15640 -6277 3774 13296 11844 11031 6340 5383 14903 22309 5520
14907 5520 1093 -8968 -6747 13007 6613 1886 -2326 -11615 -12401 7270 29920 40193 39852 40243
14893 40243 40296 49100 61223 53318 26444 20651 33055 46961 41122 51249 47986 26345 20979
14880 20979 14286 13059 11416 705 5206 8163 18941 20863 17691 11728 -4625 -5925 7431
$$ packed form
14977B478j456N280m531j3215L411N199J1639J38J4446K170j3627k1224L095J1631
14963E434J1804Q474j2046j5040j2684J0915P9l869O24k056K726L665k0740j2954
14949c5668J0786J8565K4440Q395j5374m597j1973j1645P200K0047N662R8K511
14936A8447j711R458j785k349p505q768m373J0441m07P792K331j3959l438l686
14922D88J2861q482j0221l495o791R363J0051R522j452q13m691r57R520P406j6789
14907E520m427j0061K221J9754o394m727m212r289p86J9671K2650J0273l41L91
14893D0243N3Q804J2123p905k6874n793J2404J3906n839J0127l263k1641n366
14880B0979o693j227j643j0711M501K957J0778J922l172n963j6353j300J3356
$$ plain form
14867 7431 12782 9926 902 13478 24040 21922 17166 17257 14527 8300 -3339 -3026 7365 12676
14853 12676 3490 -7435 -14196 81 -5515 -918 5558 8811 19823 19003 16214 23912 32509 30043
14839 30043 17652 34927 44380 32353 17902 14628 27867 28155 14722 12826 4612 -4340 -13844
14826 -13844 -6192 17788 18274 2200 1215 6158 5510 9968 21375 20508 8775 10984 18101 20647
14812 20647 20558 6901 -6026 1854 6272 6417 21476 25115 22830 16217 2893 -7532 15227 20794
14798 20794 28104 21648 9717 17666 23630 21254 24601 19494 7512 11779 20973 24353 23128 17676
14784 17676 14357 19628 40938 42372 36494 30730 18029 14390 24664 18991 21393 22659 24984 26380
14770 26380 36409 48823 64441 59835 40205 49420 66382 72020 76754 89894 110986 107847 80754
$$ packed form
14867G431N351k856r024J2576J0562k118m756R1k730o227j1639L13J0391N311
14853A2676r186j0925o761J4277n596M597O476L253J1012q20k789P698Q597k466
14839C0043j2391J7275R453j2027j4451l274J3239K88j3433j896q214q952r504
14826a3844P652K3980M86j6074r85M943o48M458J1407q67j1733K209P117K546
14812B0647q9j3657j2927P880M418J45J5059L639k285o613j3324j0425K2759N567
14798B0794P310o456j1931P949N964k376L347n107j1982M267R194L380j225n452
14784A7676l319N271K1310J434n878n764j2701l639J0274n673K402J266K325J396
14770B6380J0029J2414J5618m606j9630R215J6962N638M734J3140K1092l139k7093
$$ plain form
14757 80754 65172 67534 60022 54326 51627 53081 60676 54216 50901 43177 39608 47273 34091 32394
14743 32394 49816 50848 56374 40309 17860 17524 53361 77543 70026 53296 54264 60493 48980
14730 48980 29934 26484 42332 42633 43157 56744 56568 55502 59913 60797 41556 33879 45619 60124
14716 60124 70144 69715 62401 65305 68364 61885 65001 67290 67083 56031 59333 67190 73052 79284
14702 79284 79438 82171 79062 77555 71562 79286 101101 110885 106569 92393 96465 111629 117200 117808
14688 117808 107331 113407 132636 144473 139260 144555 137019 134557 154033 172850 181859 180455 193981
14675 193981 218955 215823 206572 233779 250494 265521 294259 314372 331537 336749 351099 366252
14663 366252 388172 413043 443211 497213 543024 588231 637822 703247 786988 876676 974943
$$ packed form
14757H0754j5582K362p512n696k699J454P595o460l315p724l569P665j3182j697
14743C2394J7422J032N526j6065k2449l36L5837K4182p517j6730R68O229j1513
14730D8980j9046l450J5848L01N24J3587j76j066M411Q84j9241p677J1740J4505
14716F0124J0020m29p314K904L059o479L116K289k07j1052L302P857N862O232
14702G9284J54K733l109j507n993P724K1815R784m316j4176M072J5164N571O08
14688A17808j0477O076J9229J1837n213N295p536k462J9476J8817R009j404J3526
14675A93981K4974l132r251K7207J6715J5027K8738K0113J7165N212J4350J5153
14663C66252K1920K4871L0168N4002M5811M5207M9591O5425Q3741Q9688R8267
$$ plain form
14652 974943 1101540 1269131 1476199 1727168 2017861 2361391 2793500 3282500 3842566 4546461
14642 4546461 5517678 6869850 8839087 11718413 15683720 20621129 26313410 32571810
14634 32571810 38922810 44559019 48783187 51177388 51493220 49668345 45885281 40591184
14626 40591184 34528104 28407442 22690637 17621768 13491032 10435068 8319110 6846462
14618 6846462 5804666 5028442 4403331 3892714 3450719 3045881 2681674 2359294 2087933
14609 2087933 1859473 1659649 1503201 1380184 1268473 1178641 1094195 996843 923727 865010
14599 865010 808008 739524 679050 620594 578276 544200 518606 488293 446157 419725 397133
14588 397133 376024 364874 353060 319532 307147 296492 278344 265541 262975 240143 236211 234375
$$ packed form
14652I74943J26597J67591K07068K50969K90693L43530M32109M89000N60066P03895
14642D546461R71217J352172J969237K879326L965307M937409N692281O258400
14634C2571810O351000N636209M224168K394201L15832j824875l783064n294097
14626D0591184o063080o120662n716805n068869m130736l055964k115958j472648
14618F846462j041796p76224o25111n10617m41995m04838l64207l22380k71361
14609B087933k28460j99824j56448j23017j11711q9832q4446r7352p3116n8717
14599H65010n7002o8484o0474n8456m2318l4076k5594l0313m2136k6432k2592
14588C97133k1109j1150j1814l3528j2385j0655j8148j2803k566k2832l932j836
$$ plain form
14576 234375 236188 215429 208014 211902 183768 165080 167399 170515 170008 154816 162655 173039 170472
14563 170472 168622 145922 117498 120649 143466 141772 145688 139697 118654 116877 108411 122266 121829
14550 121829 108354 93466 92263 96873 97851 103711 102447 102779 92432 77473 80749 82454 81298 63638
14536 63638 60250 66063 62790 69242 68444 79830 100028 75916 56877 66481 69688 63425 67107 67257
14522 67257 70708 56501 47490 43246 54615 64453 70666 68427 65473 77378 80520 86722 71375
14509 71375 45471 35276 49873 57582 40445 40015 27561 31439 39716 15896 20965 14679 2095
14496 2095 7641 21394 28773 37916 39939 34195 36313 34459 31234 28874 28136 28830 24476 6691 10276
14481 10276 42110 54089 53368 52911 47924 46522 25771 23471 32996 33665 21565 27778 39281 10875
$$ packed form
14576B34375J813k0759p415L888k8134j8688K319L116n07j5192P839J0384k567
14563A70472j850k2700k8424L151K2817j694L916n991k1043j777q466J3855m37
14550A21829j3475j4888j203M610R78N860j264L32j0347j4959L276J705j156j7660
14536F3638l388N813l273O452p98J1386K0198k4112j9039R604L207o263L682J50
14522F7257L451j4207r011m244J1369R838O213k239k954J1905L142O202j5347
14509G1375k5904j0195J4597P709j7137m30j2454L878Q277k3820N069o286j2584
14496B095N546J3753P379R143K023n744K118j854l225k360p38O94m354j7785L585
14481A0276L1834J1979p21m57m987j402k0751k300R525O69j2100O213J1503k8406
$$ plain form
14467 10875 6940 23594 12869 -822 679 10067 19100 13428 19528 16531 2787 4413 28585
14454 28585 29261 14960 -5294 -4482 -16394 -13126 -3608 -6211 593 9258 8590 18334 14850 22995
14440 22995 30793 26244 26373 24752 27284 20265 5028 14518 12225 10798 16832 9934 10840 8380 -1284
14425 -1284 3107 11027 5684 7775 7523 5570 1529 -3535 -11321 -8416 -877 7259 10445 -2331 -2775
14410 -2775 4902 15815 11354 4114 -4394 911 19929 19372 9895 4789 6763 7557 -7719 6262
14396 6262 20282 21647 16410 10871 22752 22503 7046 139 9962 14802 20597 37198 38451 30322
14382 30322 14341 7576 23399 35490 29063 24133 12266 6219 14335 21234 14832 11263 4535
14369 4535 4250 -12680 -24140 -17062 -3619 8917 26878 39474 34804 20406 4128 -15350 -8032
$$ packed form
14467A0875l935J6654j0725j3691J501R388R033n672O100k997j3744J626K4172
14454B8585O76j4301k0254Q12j1912L268R518k603O804Q665o68R744l484Q145
14440B2995P798m549J29j621K532p019j5237R490k293j427O034o898R06k460r664
14425a284M391P920n343K091k52j953m041n064p786K905P539Q136L186j2776m44
14410b775P677J0913m461p240q508N305J9018n57r477n106J974P94j5276J3981
14396F262J4020J365n237n539J1881k49j5457o907R823M840N795J6601J253q129
14382C0322j5981o765J5823J2091o427m930j1867o047Q116O899o402l569o728
14369D535k85j6930j1460P078J3443J2536J7961J2596m670j4398j6278j9478P318
$$ plain form
14356 -8032 -8043 -742 1372 2240 834 -8358 761 -3841 -88 14339 12099 12636 22792 25005 13408
14341 13408 -1276 -550 1608 7685 -6917 -13809 -8233 -12480 -19693 -24772 -25574 -21437 -14836 -9716
14327 -9716 -4639 -2975 -1536 8835 -3731 -4725 -7314 -5610 -843 10020 7441 -173 9684 11091
14313 11091 9331 6401 7449 7254 4029 7478 12539 10986 1826 -4738 -3266 5943 3553 7625 9733
14298 9733 12789 14151 20168 23920 19321 22609 27415 23697 18217 26954 32406 33146 37502 28910 18101
14283 18101 22302 14974 12422 7335 3862 1836 5027 341 -3090 -15543 -24342 -17725 -13257 -2278
14269 -2278 -4367 4850 15197 19061 12744 1766 12169 24281 43034 43407 23235 8228 20293
14256 20293 22197 15570 18939 9088 2092 5229 18039 17383 10091 8853 5678 8785 1970 9927
$$ packed form
14356h032j1P301K114Q68j406r192R119m602L753J4427k240N37J0156K213j1597
14341A3408j4684P26K158O077j4602o892N576m247p213n079q02M137O601N120
14327i716N077J664J439J0371j2566r94k589J704M767J0863k579p614R857J407
14313A1091j760k930J048j95l225L449N061j553r160o564J472R209k390M072K108
14298I733L056J362O017L752m599L288M806l718n480Q737N452P40M356q592j0809
14283A8101M201p328k552n087l473k026L191m686l431j2453q799O617M468J0979
14269b278k089R217J0347L864o317j0978J0403J2112J8753L73k0172j5007J2065
14256B0293J904o627L369r851o996L137J2810o56p292j238l175L107o815P957
$$ plain form
14242 9927 9934 11020 10176 8361 20335 20979 13358 1835 4833 14068 18929 6879 -3515 -7987 -12665
14227 -12665 6046 12879 16534 19829 14054 15387 21471 30644 32495 26655 26745 26508 7255 -3473
14213 -3473 -14983 -18791 -11095 -10297 -21382 -27196 -23996 -4865 10976 8118 -599 -18042 -13530 -4317
14199 -4317 2309 -2221 -11822 -18306 -15592 -16816 -16761 4387 20593 22250 14884 8615 7711 7269 17129
14184 17129 32229 44424 63088 96023 119646 134702 141120 158119 177638 196178 223502 239452
14172 239452 239404 239409 240297 232370 198308 162413 123246 97617 83075 75476 69400 58207 56235 45584
14158 45584 43831 28679 25557 30690 27898 20124 9077 6840 -1760 -8561 -22716 -16646 -870
14145 -870 9814 20354 18996 20349 13618 9953 23756 32102 25639 14114 15212 5766 -3395 -10032
$$ packed form
14242I927PJ086q44j815J1974O44p621j1523K998R235M861j2050j0394m472m678
14227a2665J8711O833L655L295n775J333O084R173J851n840R0k37j9253j0728
14213c473j1510l808P696P98j1085n814L200J9131J5841k858q717j7443M512R213
14199d317O626m530r601o484K714j224N5K1148J6206J657p366o269r04m42R860
14184A7129J5100J2195J8664L2935K3623J5056O418J6999J9519J8540K7324J5950
14172B39452m8NQ88p927l4062l5895l9167k5629j4542p599o076j1193j972j0651
14158D5584j753j5152l122N133k792p774j1047k237q600o801j4155O070J5776
14145h70J0684J0540j358J353o731l665J3803Q346o463j1525J098r446r161o637
$$ plain form
14131 -10032 -5082 11931 6829 8467 16500 13852 706 -1001 -8571 3246 9132 15134 15037 323
14117 323 -4150 8560 6720 10750 22277 19138 -1521 -9213 -4546 7076 1185 2660 12039 17034
14103 17034 8299 -8270 -20539 -8104 -2417 -9770 -23063 -16607 4895 18044 25922 12472 -538
14090 -538 9876 12718 5518 3009 -599 3256 6976 12942 13877 15144 9100 26574 15661 -4255
14076 -4255 -13421 -13964 -8267 -2966 11155 3411 6264 6615 735 1506 6742 3800 -1921 -2446 -11924
14061 -11924 -4477 -182 11861 6035 6159 6478 3175 4284 10666 7152 -6386 -11812 -11904 -17953 -1853
14046 -1853 10990 -5149 -4899 -4655 -2289 10130 1795 -4618 -7246 3345 4014 194 2000 17899
14032 17899 29274 29481 -1814 -11483 -19901 -19955 -11606 9464 868 -19061 -19200 357 -1968 -7745
$$ packed form
14131a0032M950J7013n102J638Q033k648j3146j707p570J1817N886O002r7j4714
14117C23m473J2710j840M030J1527l139k0659p692M667J1622n891J475R379M995
14103A7034q735j6569j2269J2435N687p353j3293O456K1502J3149P878j3450j3010
14090e38J0414K842p200k509l608L855L720N966R35J267o044J7474j0913j9916
14076d255r166n43N697N301J4121p744K853L51n880P71N236k942n721n25r478
14061a1924P447M295J2043n826J24L19l303J109O382l514j3538n426r2o049J6100
14046a853J2843j6139K50K44K366J2419q335o413k628J0591O69l820J806J5899
14032A7899J1375K07l1295r669q418n4Q349K1070q596j9929j39J9557k325n777
$$ plain form
14018 -7745 12159 7202 868 4652 686 -8273 -19073 -22441 -16782 -23903 -18347 -12851 -1522 4897
14004 4897 260 6371 -8360 -22271 -25630 -26143 -7916 6144 14074 5957 -1331 -5782 2576 -4411
13990 -4411 -15125 -11612 -4323 -3172 -14161 -12973 -14829 -13134 -25807 -32043 -21124 -10535 7388
13977 7388 20978 21693 31145 34496 24620 12757 11487 8644 5731 -587 -4245 -11087 -23941 -20488
13963 -20488 -4496 -1219 -760 279 229 576 4735 11356 6306 -1808 -5323 898 10082 1095 -22659
13948 -22659 -30133 -19803 -26136 -22366 -6111 7362 3257 -11239 -10622 108 9442 15096 24508
13935 24508 29180 34874 37575 38948 35405 27011 7281 -4725 6232 9413 -6014 -10375 6080
13922 6080 8856 9029 17487 9674 5256 181 2881 8323 -5929 -16715 5777 7176 10349 16699
$$ packed form
14018g745J9904m957o334L784l966q959j0800l368N659p121N556N496J1329O419
14004D897m637O111j4731j3911l359n13J8227J4060P930q117p288m451Q358o987
13990d411j0714L513P289J151j0989J188j856J695j2673o236J0919J0589J7923
13977G388J3590P15R452L351r876j1863j270k843k913o318l658o842j2854L453
13963b0488J5992L277M59J039n0L47M159O621n050q114l515O221R184q987k3754
13948b2659p474J0330o333L770J6255J3473m105j4496O17J0730R334N654R412
13935B4508M672N694K701J373l543q394j9730j2006J0957L181j5427m361J6455
13922F080K776J73Q458p813m418n075K700N442j4252j0786K2492J399L173O350
$$ plain form
13908 16699 11136 19670 11222 -8166 9932 17588 13560 12628 7212 8854 17089 33879 34821 15888
13894 15888 -133 -524 -4273 -13113 -3423 -3598 1695 -473 1966 3102 -10160 -12007 4256 860
13880 860 -7335 -1981 12799 13099 -3321 -3295 8491 2894 -7098 -7936 -3792 663 -121 5840 6465 -336
13864 -336 2997 15686 26504 25021 25426 11653 3595 5180 1680 1997 -6493 -15513 -24569 -27629 -28044
13849 -28044 -27597 -24156 -13598 5538 2863 -2000 6883 1410 8344 18589 14877 10103 3722 -7536
13835 -7536 -1889 5646 10689 2916 -9051 5614 15942 2796 3839 9654 9289 16211 14496 9060
13821 9060 -2458 -8514 -9485 -7417 -8153 -1713 3613 4877 1793 8057 24689 20404 613 -4092
13807 -4092 -3493 -6531 6642 -4856 -30851 -25159 -13324 -9808 -16922 -16445 -19720 -25167 -16844 2983
$$ packed form
13908A6699n563Q534q448j9388J8098P656m028r32n416J642Q235J6790R42j8933
13894A5888j6021l91l749q840R690j75N293k168K439J136j3262j847J6263l396
13880H60q195N354J4780L00j6420K6J1786n597r992q38M144M455p84N961O25o801
13864c36L333J2689J0818j483M05j3773q058J585l500L17q490r020r056l060m15
13849b8044M47L441J0558J9136k675m863Q883n473O934J0245l712m774o381j1258
13835g536N647P535N043p773j1967J4665J0328j3146J043N815l65O922j715n436
13821I060j1518o056r71K068p36O440N326J264l084O264J6632m285j9791m705
13807d092N99l038J3173j1498k5995N692J1835L516p114M77l275n447Q323J9827
$$ plain form
13793 2983 3791 -4816 -1294 -803 7402 12280 15267 6686 11272 13380 6952 7679 1215 -5692 33
13778 33 -3197 -1720 1694 -4944 -15782 -16749 -13491 -10298 -18252 -16390 -17618 -20255 -6815 923 -4644
13763 -4644 6786 -3822 -3393 -22461 -26121 -7244 858 -6659 -11738 -7641 -4241 5892 16337
13750 16337 20790 12438 10735 -5087 -15140 -11242 -5178 1492 18263 16464 8432 11392 13561 -1323
13736 -1323 -12126 -2430 -2594 -776 -14948 -36472 -32571 -10720 -10060 -9956 -17213 -28356 -27420 -9912
13722 -9912 -15607 -11252 -13905 964 5674 -1225 -326 -2593 -9398 -6553 3946 1875 3613 8697
13708 8697 6996 6610 17404 6730 -10832 -13299 -9333 7470 3858 -1010 -1059 8391 20379 19630
13694 19630 21883 16626 9465 13634 5688 -7755 -14010 5887 8215 15692 10664 -4787 -8106 -18779
$$ packed form
13793B983Q08q607L522M91Q205M878K987q581M586K108o428P27o464o907N725
13778C3l230J477L414o638j0838r67L258L193p954J862j228k637J3440P738n567
13763d644J1430j0608M29j9068l660J8877Q102p517n079M097L400J0133J0445
13750A6337M453q352j703j5822j0053L898O064O670J6771j799q032K960K169j4884
13736a323j0803R696j64J818j4172k1524L901K1851O60J04p257j1143R36J7508
13722i912n695M355k653J4869M710o899Q99k267o805K845J0499k071J738N084
13708H697j701l86J0794j0674j7562k467L966J6803l612m868m9R450J1988p49
13694A9630K253n257p161M169p946j3443o255J9897K328P477n028j5451l319j0673
$$ plain form
13680 -18779 -23046 -16226 2865 3871 -11023 -15867 -8898 -5922 -2633 277 4917 5885 7966 6428
13666 6428 11206 8439 6524 64 -12813 -12593 -10273 -6202 12450 1698 -20721 -14219 -6373 -4329
13652 -4329 -139 8629 8205 -3814 788 12642 7791 4090 3485 4333 12095 9956 554 19192 23748
13637 23748 21797 21665 15189 11934 20498 19588 -159 -18556 -30454 -31591 -30206 -23102 4493 18505
13623 18505 22262 25398 26631 31057 33443 30274 19187 7080 8948 1697 3031 -2251 -3622 7560
13609 7560 5462 -4613 -15319 -6015 4251 2751 10590 19229 26466 23459 11596 15432 20725 -1358
13595 -1358 -23523 -19057 -12675 -559 -11529 -7932 -8072 -8080 -6019 8458 10850 32235 28538 12530
13581 12530 11669 7427 13762 12610 12122 -4631 8279 13410 2561 6025 -3871 -14946 -21628 -14402
$$ packed form
13680a8779m267O820J9091J006j4894m844O969K976L289K910M640R68K081j538
13666F428M778k767j915o460j2877K20K320M071J8652j0752k2419O502P846K044
13652d329M190Q768m24j2019M602J1854m851l701o05Q48P762k139r402J8638M556
13637B3748j951j32o476l255Q564r10j9747j8397j1898j137J385P104K7595J4012
13623A8505L757L136J233M426K386l169j1087j2107J868p251J334n282j371J1182
13609G560k098j0075j0706R304J0266j500P839Q639P237l007j1863L836N293k2083
13595a358k2165M466O382J2116j0970L597j40qK061J4477K392K1385l697j6008
13581A2530q61m242O335j152m88j6753J2910N131j0849L464r896j1075o682P226
$$ plain form
13567 -14402 -15100 -1 9222 8513 7801 -3483 -3661 7111 17651 21168 11705 17143 3876 12181
13553 12181 16978 10963 68 -17327 -18711 -7222 -4165 -9292 3613 10923 391 -2773 -13882
13540 -13882 -9908 -13351 -26746 -15670 4276 12939 8524 12784 8125 -7624 -14886 -15867 -8062 -3086
13526 -3086 -8455 -17673 -33672 -31677 -16946 -13755 -11789 4810 2170 -8925 -5446 -15401 -22008 -17593
13512 -17593 -20429 -17122 -12737 -22913 -17279 -7664 -5429 9439 6367 -4294 -1721 -2259 -14282 -20747
13498 -20747 -8095 13263 13655 4361 -9052 4319 15281 13148 23565 23422 13044 -11384 -7344
13485 -7344 1314 6958 579 742 194 735 -8263 -1787 10322 10670 -688 6928 6689 14139 20560
13470 20560 18284 -4997 -9446 -6000 1219 805 -2984 -5198 14828 11367 -18399 -20710 -11884 -6403
$$ packed form
13567a4402o98J5099R223p09p12j1284j78J0772J0540L517r463N438j3267Q305
13553A2181M797o015j0895j7395j384J1489L057n127J2905P310j0532l164j1109
13540a3882L974l443j3395J1076J9946Q663m415M260m659j5749p262r81P805M976
13526c086n369r218j5999J995J4731L191J966J6599k640j1095L479r955o607M415
13512a7593k836L307M385j0176N634R615K235J4868l072j0661K573n38j2023o465
13498b0747J2652K1358L92r294j3413J3371J0962k133J0417j43j0378k4428M040
13485g344Q658N644o379J63n48N41q998O476J2109L48j1358P616k39P450O421
13470B0560k276k3281m449L446P219m14l789k214K0026l461k9766k311Q826N481
$$ plain form
13456 -6403 -1676 -5069 1868 -9473 -23116 -19313 -24518 -31773 -28684 -6230 -3571 -6777 -9485 3625
13442 3625 -457 364 3137 7098 1475 8088 13641 4447 -3591 -2511 -7749 5083 4363 -5957 -13758
13427 -13758 -19806 -6121 -1183 -4918 -1702 -6204 4066 7917 5510 764 -12605 -10057 932
13414 932 -13358 -10125 -1726 2942 4445 -12108 -22788 -20242 -14553 -9873 -13454 1103 21183 26108
13400 26108 20349 15026 8459 3877 -4816 6291 18129 12574 4076 -21488 -20995 -24544 -25084 -26624
13386 -26624 -22236 -17659 -19530 -14030 -2224 -8900 -1051 2034 4917 7271 704 -627 30 -760 -2984
13371 -2984 -19715 -30807 -20743 -16761 -7568 9507 23331 9209 3845 6446 -3788 2389 15544
13358 15544 6300 -24008 -48659 -55389 -41029 -42597 -44599 -24905 -20372 -25975 -24399 -8339 7105
$$ packed form
13456f403M727l393O937j1341j3643L803n205p255L089K2454K659l206k708J3110
13442C625m082Q21K773L961n623O613N553r194q038J080n238J2832p20j0320p801
13427a3758o048J3685M938l735L216m502J0270L851k407m746j3369K548J0989
13414I32j4290L233Q399M668J503j6553j0680K546N689M680l581J4557K0080M925
13400B6108n759n323o567m582q693J1107J1838n555q498k5564M93l549n40j540
13386b6624M388M577j871N500J1806o676P849L085K883K354o567j331O57p90k224
13371b984j6731j1092J0064L982R193J7075J3824j4122n364K601j0234O177J3155
13358A5544r244l0308k4651o730J4360j568k002J9694M533n603J576J6060J5444
$$ plain form
13345 7105 13185 3724 6544 16705 6904 2367 13623 2157 4799 8324 7926 3144 -1852 2053
13331 2053 2202 7423 19116 14809 9955 17181 12873 3336 2865 -2410 -5253 5599 10125 11424 8243
13316 8243 13543 7321 1498 7633 19773 36702 32732 3041 -4897 15443 26162 20989 11296
13303 11296 -1149 -11636 559 349 -11351 -19442 -16392 -7596 7897 2031 10844 14313 7897
13290 7897 794 -2404 -5072 12708 21667 17409 9528 17391 7270 -11593 -12549 -7238 -16502 3014
13276 3014 3798 -8179 -7933 3500 -8861 -18715 434 17295 26881 29023 10377 -11378 -12737
13263 -12737 -6846 1014 -1488 -4349 -2625 -421 -8735 -11018 -13336 -13083 5771 -5740 2650 8969
13249 8969 5343 9653 13564 19899 6302 -7309 -5067 -7181 -1661 6204 3707 3935 -1617 -6768
$$ packed form
13345G105O080r461K820J0161r801m537J1256j1466K642L525l98m782m996L905
13331B053J49N221J1693m307m854P226m308r537m71n275k843J0852M526J299l181
13316H243N300o222n823O135J2140J6929l970k9691p938K0340J0719n173r693
13303A1296j2445j0487J2195k10j1700q091L050Q796J5493n866Q813L469o416
13290G897p103l198k668J7780Q959m258p881P863j0121j8863r56N311r264J9516
13276C014P84j1977K46J1433j2361r854J9149J6861R586K142j8646k1755j359
13263a2737N891P860k502k861J724K204q314k283k318K53J8854j1511Q390O319
13249H969l626M310L911O335j3597j3611K242k114N520P865k497K28n552n151
$$ plain form
13235 -6768 -17956 -27640 -14340 9390 5716 -19669 -31485 -14909 -3188 12511 20042 29839 22095
13222 22095 19017 17820 24144 23696 20488 13624 499 -15740 -17717 -22398 -42817 -34830 -20298 -13309
13208 -13309 -2361 13849 7198 46 -1036 -86 4609 -10624 -21385 -15147 -5641 -3499 -180 1571
13194 1571 -6072 -6050 -137 5412 9935 11175 8620 16494 15022 4527 -210 -1520 -362 -9379 -6391
13179 -6391 1557 -6163 -1157 6618 1439 11819 21445 32773 1076 -13663 -22182 -27881 -19051 -15927
13165 -15927 -14704 -14284 -8828 -12605 -14295 -11628 -4369 10595 27227 27784 26270 35028 31049 15644
13151 15644 5410 23930 28616 27301 3430 -7986 -21757 -20749 806 5064 9108 375 -6698
13138 -6698 -16981 -13091 -1312 2548 2765 5766 1582 -11098 -15657 -20788 -22032 -18039 -31443 -32813
$$ packed form
13235f768j1188r684J3300K3730l674k5385j1816J6576J1721J5699P531R797p744
13222B2095l078j197O324m48l208o864j3125j6239j977m681k0419P987J4532O989
13208a3309J0948J6210o651p152j082R50M695j5233j0761O238R506K142L319J751
13194A571p643K2N913N549M523J240k555P874j472j0495m737j310J158r017K988
13179f391P948p720N006P775n179J0380R626J1328l1697j4739q519n699Q830L124
13165a5927J223M20N456l777j690K667P259J4964J6632N57j514Q758l979j5405
13151A5644j0234J8520M686j315k3871j1416j3771J008K1555M258M044q733p073
13138f698j0283L890J1779L860K17L001m184j2680m559n131j244L993j3404j370
$$ plain form
13124 -32813 -17907 7684 20296 3471 -17509 -24921 -12794 -9558 3739 7594 13962 12570 5906
13111 5906 3309 10834 12361 12251 6643 3190 -3773 -13609 4458 24426 36390 29574 9539 3668
13097 3668 -12700 -18432 -9977 -7857 -19694 -24348 -29336 -28546 -25633 -5223 -2379 -11619 -2917 8577
13083 8577 6981 16058 24452 33354 24028 1055 -17610 -7746 6213 2211 10922 8694 -14210 -30750
13069 -30750 -23469 -10182 5701 14892 22359 28874 17815 16500 19241 23264 7858 -5411 -23657
13056 -23657 -24137 -25400 -16962 4844 4334 -9762 -11493 -7192 -9153 -4185 -12696 -15624 -20559 -17083
13042 -17083 -6630 -1643 3396 2145 -8540 3116 -235 724 9825 13311 1131 -1383 7311 513
13028 513 -13759 1367 8249 350 -10293 -9025 6636 17128 3047 4599 14237 14372 26768
$$ packed form
13124c2813J4906K5591J2612j6825k0980p412J2127L236J3297L855O368j392o664
13111E906k597P525J527j10n608l453o963r836J8067J9968J1964o816k0035n871
13097C668j6368n732Q455K120j1837m654m988P90K913K0410K844r240Q702J1494
13083H577j596R077Q394Q902r326k2973j8665R864J3959m002Q711k228k2904j6540
13069c0750P281J3287J5883R191P467O515j1059j315K741M023j5406j3269j8246
13056b3657m80j263Q438K1806n10j4096j731M301j961M968q511k928m935L476
13042a7083J0453M987N039j251j0685J1656l351R59R101L486j2180k514Q694o798
13028E13j4272J5126O882p899j0643J268J5661J0492j4081J552R638J35J2396
$$ plain form
13015 26768 18095 -1559 -15258 -7546 3567 -1924 -5613 -23257 -36229 -21199 -1817 9290
13003 9290 14134 9298 10477 13518 12248 -536 -4848 -7575 5131 17406 5071 3083 4048 651
12989 651 -5346 6341 13000 942 -8250 -716 1710 -3509 -16767 3139 13726 16619 18592 19394
12975 19394 1374 -20592 -31117 -25122 -4889 -696 4913 328 5551 3800 9277 12151 10144
12962 10144 14280 12694 10667 9035 9757 19090 13266 6633 -11227 -8909 -1493 -7049 2241 -160
12948 -160 7714 10137 4958 -3466 -10233 -4726 5362 5481 14447 5618 -4753 -12606 -11523 4642
12934 4642 11943 19115 13435 6614 -11526 -17374 -8492 11008 12118 7486 1336 17027 27585 41306
12920 41306 35162 9856 7347 11032 10296 9527 19288 21739 15298 4753 -7852 -21151 -7130 -9455
$$ packed form
13015B6768q673j9654j3699P712J1113n491l689j7644j2972J5030J9382J1107
13003I290M844m836J179L041j270j2784m312k727J2706J2275j2335j988R65l397
12989F51n997J1687O659j2058r192P534K426n219j3258J9906J0587K893J973Q02
12975A9394j8020k1966j0525N995K0233M193N609m585N223j751N477K874k007
12962A0144M136j586k027j632P22R333n824o633j7860K318P416n556R290k401
12948a60P874K423n179q424o767N507J0088J19Q966q829j0371p853J083J6165
12934D642P301P172n680o821j8140n848Q882J9500J110m632o150J5691J0558J3721
12920D1306o144k5306k509L685p36p69R761K451o441j0545j2605j3299J4021k325
$$ plain form
12906 -9455 -19412 -11155 7029 25500 27629 10472 -18442 -22619 -16803 -170 8609 4448 -13046
12893 -13046 -10478 -9511 5371 18018 28657 34605 33846 29110 22045 34062 29829 12726 -3390
12880 -3390 -680 -664 920 -6423 -5961 -1716 -2805 3486 11088 7960 5155 2596 -10518 -13144 229
12865 229 11999 20015 7463 111 -2757 -4563 9209 2242 -4597 -14593 -32312 -38754 -35366 365
12851 365 14736 16084 8826 1288 -376 -20059 -21636 -15533 -1400 -6253 -6550 -2558 -3965 -29
12837 -29 1921 5297 -1499 -5359 2050 -1625 -14838 -14985 -5106 -6454 -16847 -23997 -31724 -26101 -9184
12822 -9184 -6593 -8221 -22155 -20797 -6853 4335 12287 8421 6408 4398 -2508 -8530 -7738 -20213
12808 -20213 -31554 -40997 -24658 -15195 -4341 15999 16323 5781 887 -8717 -2571 14611 14171
$$ packed form
12906i455r957Q257J8184J8471K129j7157k8914m177N816J6633Q779m161j7494
12893a3046K568R67J4882J2647J0639N948p59m736p065J2017m233j7103j6116
12880c390K710J6J584p343M62M245j089O291P602l128k805k559j3114k626J3373
12865B29J1770Q016j2552p352k868j806J3772o967o839r996j7719o442L388L5731
12851C65J4371J348p258p538j664j9683j577O103J4133m853k97L992j407L936
12837b9J950L376o796l860P409l675j3213j47R879j348j0393p150p727N623J6917
12822i184K591j628j3934J358J3944J1188P952l866k013k010o906o022P92j2475
12808b0213j1341r443J6339R463J0854K0340L24j0542m894r604O146J7182m40
$$ plain form
12795 14171 10653 6264 1614 -5354 -1074 -3217 -8126 -9117 -10907 -3087 738 10279 12642 8814 3562
12780 3562 3497 8386 3944 -1180 -7823 -381 20978 27203 34505 35827 36315 28367 9587 -19199 -26694
12765 -26694 -8926 3672 10995 14700 6186 5334 2562 -7395 -8966 -3858 -10288 -2291 -12693 -23192
12751 -23192 -35687 -32722 -22520 -13868 -17089 -12865 -24920 -29199 -16232 4936 1168 -6262 -863
12738 -863 -4095 -5520 -9216 -3392 1191 8242 1025 2133 9330 12820 5468 846 -6951 6072 11784
12723 11784 19332 15036 6336 7520 21292 27680 33383 17414 6131 -2978 -2109 9411 8261 -2094
12709 -2094 -2753 4404 -8759 -8214 7811 5614 -7486 -17379 -12556 -7443 -4802 -2286 -538 -743 -6415
12694 -6415 -762 -15 -5109 -16879 -20816 -24583 -25863 -33005 -36581 -27568 -26583 -36624 -48800 -40495
$$ packed form
12795A4171l518m389m650o968M280k143m909r91j790P820L825R541K363l828n252
12780C562o5M889m442n124o643P442K1359O225P302J322M88p948j8780k8786p495
12765b6694J7768J2598P323L705q514q52k772r957j571N108o430P997j0402j0499
12751b3192j2495K965J0202Q652l221M224j2055m279J2967K1168l768p430N399
12738h63l232j425l696N824M583P051p217J108P197L490p352m622p797J3023N712
12723A1784P548m296q700J184J3772O388N703j5969j1283r109Q69J1520j150j0355
12709b094o59P157j3163N45J6025k197j3100r893M823N113K641K516J748k05n672
12694f415N653P47n094j1770l937l767j280p142l576R013R85j0041j2176Q305
$$ plain form
12680 -40495 -28386 -21730 234 13104 20143 27887 38808 35043 17064 2233 -3530 -7420 6978
12667 6978 7229 -2247 -385 1992 950 -8501 -16847 -6952 -5854 -16729 -14432 -12388 -12423 -1988 14541
12652 14541 19907 2212 -5210 -11623 -23104 -28868 -36297 -38483 -47328 -36544 -6294 2361 -16054
12639 -16054 -25745 -21825 -7927 2425 4981 2485 -271 1673 10705 18967 22833 641 -19880
12626 -19880 -3084 -7717 -11493 -3217 -2042 -3026 2134 3489 9165 -720 -6226 -16382 -4753 1817
12612 1817 5428 9166 11155 2166 -1581 6988 -4748 -16417 -19334 -19851 -16506 3374 13416 22615
12598 22615 33775 37020 34225 32219 27177 9230 -5356 -13624 -8795 -8186 -5406 -8263 -5119 2363
12584 2363 1993 -9542 -15223 -21951 -14538 -15952 -7525 3081 1697 -8872 -19722 -21293 -3726 10169
$$ packed form
12680d0495J2109O656K1964J2870P039P744J0921l765j7979j4831n763l890J4398
12667F978K51r476J862K377j042r451q346R895J098j0875K297K044l5J0435J6529
12652A4541N366j7695p422o413j1481n764p429k186q845J0784L0250Q655j8415
12639a6054r691L920J3898J0352K556k496k756J944R032Q262L866k2192k0521
12626a9880J6796m633l776Q276J175r84N160J355N676r885n506j0156J1629O570
12612A817L611L738J989q989l747Q569j1736j1669k917n17L345J9880J0042R199
12598B2615J1160L245k795k006n042j7947j4586q268M829O09K780k857L144P482
12584B363l70j1535n681o728P413j414Q427J0606j384j0569j0850j571J7567J3895
$$ plain form
12570 10169 17280 8310 2954 -2357 4312 20797 29263 40004 51155 45399 30115 15385 13828
12557 13828 19777 28799 38383 55212 78626 112989 139443 148124 125547 94529 48212 27695
12545 27695 17227 4905 3101 2801 -300 7014 16377 12442 13011 10796 13336 7798 5621 1674
12531 1674 429 807 3182 12393 22835 15618 7220 12024 30416 36989 44246 55540 83086 124258
12517 124258 158627 164765 130396 87560 46996 36059 33325 33094 54467 79674 117064 159594
12505 159594 167877 127766 87284 78585 60127 40215 34670 33689 24386 22934 27479 40553 44761
12492 44761 54816 90727 112400 149454 244150 415140 716330 1032883 901549 575150 357483
12481 357483 247242 184975 140060 110841 103051 106249 118867 132142 143458 146573 121931 85554
$$ packed form
12570A0169P111q970n356n311O669J6485Q466J0741J1151n756j5284j4730j557
12557A3828N949R022R584J6829K3414L4363K6454Q681k2577l1018m6317k0517
12545B7695j0468j2322j804l00l101P314R363l935N69k215K540n538k177l947
12531A674j245L78K375R211J0442p217q398M804J8392O573P257J1294K7546M1172
12517A24258L4369O138l4369m2836m0564j0937k734k31K1373K5207L7390M2530
12505A59594Q283m0111m0482q699j8458j9912n545r81r303j452M545J3074M208
12492D4761J0055L5911K1673L7054R4696J70990L01190L16553j31334l26399k17667
12481C57483j10241o2267m4915k9219p790L198J2618J3275J1316L115k4642l6377
$$ plain form
12469 85554 61419 62773 63387 39826 38343 51279 70734 90957 84244 60335 61801 49140 40245
12456 40245 35604 39903 21970 15686 18840 25940 26879 12691 -7311 -8325 -6202 -4535 -2065 -4766
12442 -4766 -3468 -824 9855 21961 32792 33076 28122 20662 15161 10962 11199 12480 28711 41745
12428 41745 44391 41672 27055 4916 480 -10910 -9823 -1688 -5762 -2641 -30995 -32336 -21647
12415 -21647 -12245 1526 10903 1683 4931 18863 12843 11299 7604 8903 10571 10774 13662 -2447
12401 -2447 -18519 -19631 -30153 -36360 -25122 -10401 -4028 -14972 -18726 -4167 -389 272 12998
12388 12998 23023 11105 1820 374 3141 16327 27757 22918 9801 6757 8168 2826 17673
12375 17673 9272 3150 12176 12985 17688 -3587 -8394 -11783 -9916 -1095 -153 3123 7806 9930 4046
$$ packed form
12469H5554k4135J354O14k3561j483J2936J9455K0223o713k3909J466j2661q895
12456D0245m641M299j7933o284L154P100R39j4188k0002j014K123J667K470k701
12442d766J298K644J0679J2106J0831K84m954p460n501m199K37J281J6231J3034
12428D1745K646k719j4617k2139m436j1390J087Q135m074L121k8354j341J0689
12415b1647R402J3771R377r220L248J3932o020j544l695J299J668K03K888j6109
12401b447j6072j112j0522o207J1238J4721O373j0944l754J4559L778O61J2726
12388A2998J0025j1918r285j446K767J3186J1430m839j3117l044J411n342J4847
12375A7673q401o122R026Q09M703k1275m807l389J867Q821R42L276M683K124n884
$$ plain form
12360 4046 15100 4892 -7391 -25594 -33971 -24737 -9454 -14232 -18410 -15865 -11107 -2582 4290
12347 4290 2698 -10025 10547 24369 8715 -12899 -15655 -26278 -25684 -28822 -39876 -36211 -29228
12334 -29228 -13416 -18649 -7914 -13477 -19892 -27235 -18986 -23644 -25430 -21229 -20498 -30712 -24986 -19665
12320 -19665 -7511 5181 19898 18312 16355 9645 1330 4621 11911 17644 15618 2787 -4299
12307 -4299 649 1618 -6603 -12036 -15457 -10863 -15887 -24267 -30769 -33527 -35017 -25143 -23329 -18808 -9954
12292 -9954 728 -1553 -6544 -7481 -14252 -14928 -14406 -22421 -21317 -6370 -1542 -2563 -3858 -7919 -17845
12277 -17845 -26412 -26698 -21401 -5774 22286 24532 20219 9745 8793 7440 -3662 -15791 -21721 -28043
12263 -28043 -42616 -23854 -2655 -6574 -9418 -6282 -22310 -25489 -15631 -5879 8776 14035 7459
$$ packed form
12360D046J1054j0208j2283j8203q377R234J5283m778m178K545M758Q525O872
12347D290j592j2723K0572J3822j5654k1614k756j0623N94l138j1054L665O983
12334b9228J5812n233J0735n563o415p343Q249m658j786M201P31j0214N726N321
12320a9665J2154J2692J4717j586j957o710q315L291P290N733k026j2831p086
12307d299M948R69q221n433l421M594n024q380o502k758j490R874J814M521Q854
12292i954J0682k281m991r37o771o76N22q015J104J4947M828j021j295m061r926
12277a7845q567k86N297J5627K8060K246m313j0474r52j353j1102j2129n930o322
12263b8043j4573J8762K1199l919k844L136j6028l179R858R752J4655N259o576
$$ plain form
12250 7459 11152 17766 4113 2334 7933 -11656 -11499 9844 19852 -19549 -41097 -41264 -36547 -25378
12236 -25378 -21121 -14609 -8447 -20469 -9036 -5111 -10328 -6062 35 -9853 -12210 3967 12453 410
12222 410 2407 -3908 7782 18019 11052 -14197 -28288 -27871 -14520 -17652 -10606 7847 8293 -367
12208 -367 -16791 -33231 -20323 179 2688 1179 -13533 -15337 -11457 2783 11857 -2958 -748
12195 -748 28131 30878 16991 3442 -798 -5903 -8392 3445 23131 20641 -1936 -8064 -15659
12182 -15659 -9721 -13113 -14478 -16293 -8426 -5121 -5692 -11785 -22231 -13583 -4845 5511 4666 7968
12168 7968 4188 -6495 -12887 -7430 -6516 -2015 20866 38070 33691 18101 11077 -11617 -20002 -12922
12154 -12922 5805 14701 180 -3243 -11898 -10356 -9959 -10106 -13706 -11266 -4712 5759 14804 14343
$$ packed form
12250G459L693O614j3653j779N599j9589J57K1343J0008l9401k1548j67M717J1169
12236b5378M257O512O162j2022J1433L925n217M266O097r888k357J6177Q486j2043
12222D10J997o315J1690J0237o967k5249j4091M17J3351l132P046J8453M46q660
12208c67j6424j6440J2908K0502K509j509j4712j804L880J4240R074j4815K210
12195g48K8879K747j3887j3549m240n105k489J1837J9686k490k2577o128p595
12182a5659N938l392j365j815P867L305n71o093j0446Q648Q738J0356q45L302
12168G968l780j0683o392N457R14M501K2881J7204m379j5590p024k2694q385P080
12154a2922J8727Q896j4521l423q655J542L97j47l600K440O554J0471R045m61
$$ plain form
12140 14343 8366 -6028 5262 3677 7856 11887 17913 20731 15709 12248 3080 419 -4008 8669
12126 8669 13318 12394 5963 848 -3565 -3727 -19176 -33094 -34606 -29423 -26386 -26506 -17506 -11788 5284
12111 5284 11899 -11084 -18255 -18736 -5041 3577 -2941 -1820 6127 18108 20801 15680 9354 11624
12097 11624 9611 2028 3834 1529 1070 1376 12792 16145 -8860 -33269 -33380 -25610 -26394 -19173 -1870
12082 -1870 -1233 8009 25707 10127 -17043 -33053 -45498 -38935 -32378 -19182 -3803 -404 2920
12069 2920 -4107 3986 8751 4867 807 4789 32 -13600 5244 9490 8060 5350 -412 3006
12055 3006 13157 27247 22057 13744 15535 24819 18777 4431 238 4628 4257 -7121 -16000 -14526
12041 -14526 -10444 -5196 -5192 -14623 -13803 8763 19637 13442 -3578 -14312 -15386 -73 1149 -5564
$$ packed form
12140A4343n977j4394J1290j585M179M031O026K818n022l461r168k661m427J2677
12126H669M649r24o431n115m413j62j5449j3918j512N183L037j20R000N718J7072
12111E284O615k2983p171m81J3695Q618o518J121P947J1981K693n121o326K270
12097A1624k013p583J806k305m59L06J1416L353k5005k4409j11P770p84P221J7303
12082a870O37R242J7698j5580k7170j6010j2445O563O557J3196J5379L399L324
12069B920p027Q093M765l884m060L982m757j3632J8844M246j430k710n762L418
12055C006J0151J4090n190q313J791R284o042j4346m193M390l71j1378q879J474
12041a4526M082N248Mr431Q20K2566J0874o195j7020j0734j074J5313J222o713
$$ plain form
12027 -5564 2880 3246 2601 -6544 -11078 -8302 -15821 -24587 -29163 -36606 -37080 -33935 -23422 -11512 -11481
12012 -11481 -14670 -12168 -2143 -7391 -13728 -8610 -12703 -20857 -16730 -14460 -11663 -1373 -4411 -4673
11998 -4673 -11182 191 -2182 -8319 -7600 -5967 6536 20084 16084 6616 6934 16529 18439 14585
11984 14585 -2345 -16966 -22668 -20897 -22258 -21081 -22768 -20590 -14370 -9839 3033 -6853 -21759
11971 -21759 -20740 -10833 -19753 -25925 -30495 -17500 -328 -7245 -11372 -6760 -7171 -18145 -22599 -9633
11957 -9633 -24 -20427 -13934 -3170 -3592 -9441 -12208 -13104 -16003 -10705 -14122 -9939 -19890 -17299 -12900
11942 -12900 5935 9778 4159 -5053 -13376 -25128 -42649 -38117 -29779 -27955 -36587 -33080 -7960
11929 -7960 7744 6481 -1572 8113 22517 16574 3959 -5898 -9271 -4505 -635 8521 1332 -3804
$$ packed form
12027e564Q444L66o45r145m534K776p519q766m576p443m74L145J0513J1910L1
12012a1481l189K502J0025n248o337N118m093q154M127K270K797J0290l038k62
11998d673o509J1373k373o137P19J633J2503J3548m000r468L18R595J910l854
11984A4585j6930j4621n702J771j361J177j687K178O220M531J2872r886j4906
11971b1759J019R907q920o172m570J2995J7172o917m127M612m11j0974m454J2966
11957i633R609k0403O493J0764m22n849k767q96k899N298l417M183r951K591M399
11942a2900J8835L843n619r212q323j1752j7521M532Q338J824q632L507K5120
11929g960J5704j263q053R685J4404n943j2615r857l373M766L870R156p189n136
$$ plain form
11915 -3804 -9161 -8866 1481 6084 1693 1173 4705 12057 27102 10949 -736 -1098 440 -5347
11901 -5347 -265 -2193 -3133 3257 7261 1969 -2217 -17276 -31395 -28379 -15333 -12662 -2751 11011
11887 11011 18608 23971 22244 2191 2197 9 -1681 -8366 -5053 6974 10159 23628 16814 5246
11873 5246 -5162 -17745 -11995 -1318 -3979 1570 10293 12734 9140 2838 10443 3894 -5406 -11271
11859 -11271 -20169 -3899 1872 -1671 3159 9306 16702 10971 -4235 -17093 -19458 -16775 -10612 -10543
11845 -10543 -10093 -13636 -19582 -10978 11760 17119 6436 19458 16809 16540 10914 11120 6516 9274
11831 9274 15230 8010 -10426 3438 -9062 -15663 -10168 -10281 -10289 -18125 -15375 -4667 -8615 -5455 -7487
11816 -7487 -24085 -20825 -1893 -3093 5098 6533 1634 13873 13959 15643 99 350 -250 -12213
$$ packed form
11915c804n357K95J0347M603m391n20L532P352J5045j6153j1685l62J538n787
11901e347N082j928r40O390M004n292m186j5059j4119L016J3046K671R911J3762
11887A1011P597N363j727k0053Ok188j690o685L313J2027L185J3469o814j1568
11873E246j0408j2583N750J0677k661N549Q723K441l594o302P605o549r300n865
11859a1271q898J6270N771l543M830O147P396n731j5206j2858k365K683O163O9
11845a0543M50l543n946Q604K2738N359j0683J3022k649k69n626K06m604K758
11831I274N956p220j8436J3864j2500o601N495j13qp836K750J0708l948L160k032
11816g487j6598L260J8932j200Q191J435m899J2239Q6J684j5544K51o00j1963
$$ plain form
11802 -12213 -29181 -21756 -11095 -15047 -16292 -5321 7312 -5869 2433 5736 26183 21363 15971
11789 15971 15268 4289 684 5687 15474 15213 20994 18263 17188 14820 19084 21072 24389 11858
11775 11858 7911 -6350 -16114 -22960 -22602 -13517 -56 2443 -5021 -4018 -4205 3339 -14191 -14061
11761 -14061 -6755 3657 11478 -412 -3721 1123 12687 12765 -2030 -5313 -14746 -4489 20178
11748 20178 21678 3248 -8944 2290 20176 10065 1801 2892 4240 10648 8003 -7254 14442
11735 14442 11492 18592 15887 8783 8756 -9893 -15587 -11240 3688 8803 2907 450 1539 -1046
11721 -1046 -5171 -14855 -5124 16382 12140 7434 5303 1916 -18480 -20551 -11939 -5810 -5688 -11406
11707 -11406 -25795 -30625 -22727 -2510 7309 17909 3728 -10088 -20937 -27564 -25952 -18830 -14794
$$ packed form
11802a2213j6968P425J0661l952j245J0971J2633j3181Q302L303K0447m820n392
11789A5971p03j0979l605N003R787k61N781k731j075k368M264J988L317j2531
11775A1858l947j4261r764o846L58R085J3461K499p464J003j87P544j7530J30
11761a4061P306J0412P821j1890l309M844J1564P8j4795l283r433J0257K4667
11748B0178J500j8430j2192J1234J7886j0111q264J091J348O408k645j5257K1696
11735A4442k950P100k705p104k7j8649n694M347J4928N115n896k457J089k585
11721a046m125r684R731K1506m242m706k131l387k0396k071Q612O129J22n718
11707a1406j4389m830P898K0217R819J0600j4181j3816j0849o627J612P122M036
$$ plain form
11694 -14794 -14865 -31926 -17761 2071 -14072 -7012 284 -2914 -15998 -18411 -6423 1075 -11467
11681 -11467 -11859 -8660 -14415 -9307 -11163 -12568 -20537 -14194 7268 196 -3993 -2637 17163 28030
11667 28030 22106 5151 -9419 -11818 -9603 -7545 -14983 -17900 -16966 -11040 -221 -1898 -9980 -17463
11653 -17463 -9855 6651 14426 607 -14940 -3135 -6730 -20950 -26034 -17223 -15198 -12841 -15667
11640 -15667 -18101 -30276 -41935 -27867 -13335 -8798 1200 -2695 -9020 -15741 -23331 -28081 -13887
11627 -13887 -20323 -19079 -20278 -281 2159 11848 18081 11854 14899 24283 12571 1489 6222 6231
11613 6231 1292 2107 -11325 -1014 -7876 -6900 -4019 -5492 133 -1915 -1180 -2208 -12788 -14791 -15432
11598 -15432 -5215 -16002 -18418 -8293 -13879 -13481 -14320 -21123 -14371 -7163 -11985 -20339 -21658 -8804
$$ packed form
11694a4794p1j7061J4165J9832j6143P060P296l198j3084k413J1988P498j2542
11681a1467l92L199n755N108j856j405p969O343K1462p072m189J356J9800J0867
11667B8030n924j6955j4570k399K215K058p438k917R34N926J0819j677q082p483
11653a7463P608J6506P775j3819j5547J1805l595j4220n084Q811K025K357k826
11640a5667k434j2175j1659J4068J4532M537R998l895o325o721p590m750J4194
11627a3887o436J244j199J9997K440R689O233o227L045R384j1712j1082M733R
11613F231m939Q15j3432J0311o862R76K881j473N625k048P35j028j0580k003o41
11598a5432J0217j0787k416J0125n586L98q39o803O752P208m822q354j319J2854
$$ plain form
11584 -8804 -10052 -28637 -19714 -20967 -11079 -9509 -10357 -9777 -15915 -21635 -17302 -11522 -5427 -21196 -8540
11569 -8540 -3790 -150 -11337 -7853 -10454 -2763 -3652 -957 1688 -8466 -13059 -19800 -24315 -18138
11555 -18138 -17859 -22842 -20397 4215 8446 -4148 -11768 -8276 -2639 -1539 -10079 -329 7736 -9
11541 -9 1892 -5048 -32650 -52681 -32491 -9371 -4531 5656 -742 6342 3830 -18614 -35051 -36474
11527 -36474 -21020 -10489 -5131 -10790 -21881 -23071 -25159 -34367 -24850 -13742 -15277 -21719 -19538
11514 -19538 -16839 -11412 -23014 -16126 -16001 -32778 -32787 -38564 -31921 -15923 3809 8580 -8105 -21222
11500 -21222 -20833 -17437 -15404 -9227 -11392 -12418 -17123 -10901 -5435 -3500 -23291 -13946 10061 -3203
11486 -3203 -21411 -26611 -30135 -23818 -16863 -10652 -10501 -1286 10246 -6739 -25084 -20127 -36200 -35795
$$ packed form
11584h804j248j8585Q923j253R888J570q48N80o138n720M333N780O095j5769J2656
11569h540M750L640j1187L484k601P691q89K695K645j0154m593o741m515O177
11555a8138K79m983K445K4612M231j2594p620L492N637J100q540R750Q065p745
11541iJ901o940k7602k0031K0190K3120M840J0187o398P084k512k2444j6437j423
11527c6474J5454J0531N358n659j1091j190k088r208R517J1108j535o442K181
11514a9538K699N427j1602O888J25j6777rn777O643J5998J9732M771j6685j3117
11500b1222L89L396K033O177k165j026m705O222N466J935j9791R345K4007j3264
11486c203j8208n200l524O317O955O211J51R215J1532j6985j8345M957j6073M05
$$ plain form
11472 -35795 -35549 -13211 8979 18103 20319 26036 13479 12943 22245 21412 16066 -9397 -18056 -8052
11458 -8052 3068 6344 -1125 -17800 -26031 -21372 -10506 -24641 -36797 -22285 -5561 -11128 -17090
11445 -17090 -16579 -15332 -19472 -10913 -17515 -34369 -27112 -13409 -4888 -10670 -1393 -7658 -13662 -7197
11431 -7197 1040 5907 3927 5338 1395 -3932 5228 7796 -3966 8261 -3472 -2528 6898 2522
11417 2522 -17078 -24042 -17566 -16401 -9225 -936 -9775 -15833 -19979 -17582 -13986 -13905 -4458 5561 4050
11402 4050 8467 6207 9865 8702 -571 7651 8301 -7430 -10250 -8976 -26815 -20689 -14182 -9751
11388 -9751 -7961 -10656 -9442 2444 11053 10762 -4012 -10798 -13549 -27235 -19851 -13487 -13673 -3610
11374 -3610 -4826 -15495 -18367 -29166 -31168 -22179 -25538 -23363 -7746 -419 -8111 12283 13152 -13471
$$ packed form
11472c5795K46K2338K2190R124K216N717j2557n36R302q33n346k5463q659J0004
11458h052J1120L276p469j6675q231M659J0866j4135j2156J4512J6724n567n962
11445a7090N11J247m140Q559o602j6854P257J3703Q521n782R277o265o004O465
11431g197Q237M867j980J411l943n327R160K568j1762J2227j1733R44R426m376
11417B522j9600o964O476J165P176Q289q839o058m146K397L596Q1R447J0019j511
11402D050M417k260L658j163r273Q222O50j5731k820J274j7839O126O507M431
11388i751J790k695J214J1886Q609k91j4774o786k751j3686P384O364j86J0063
11374c610j216j0669k872j0799k002Q989l359K175J5617P327p692K0394Q69k6623
$$ plain form
11360 -13471 -18215 -18701 -16274 -11960 -18392 -28922 -24731 -21141 -5668 472 -3631 -7172 -14839 -4666
11346 -4666 -1929 -12396 -21149 -14082 -16438 -9599 -8984 -13052 -19173 -10049 13902 26338 21359 11146
11332 11146 5787 1717 3256 527 -1880 -3140 -11577 534 7866 -1436 956 7393 7930 7847 520
11317 520 -848 -8939 -18858 -12193 -4087 -799 -16732 -12473 4844 11299 3275 -10456 -22311 -14266
11303 -14266 -8739 -6821 -8628 2060 -5342 -18440 -21166 -20915 -12278 -271 680 -9471 -7965 -2280
11289 -2280 8676 -5403 -12690 -9110 -11145 -21269 -18105 1478 -8244 -6046 -2079 81 2971 9689
11275 9689 5037 4323 1192 6337 -6888 -14510 -15167 -17159 -31778 -38051 -24811 -14937 -12489 -20987
11261 -20987 -23507 -15899 -9561 -4702 601 15416 3939 3392 -5195 -6008 7766 4785 -5283 4088
$$ packed form
11360a3471m744m86K427M314o432j0530M191L590J5473O140m103l541p667J0173
11346d666K737j0467q753P067k356O839O15m068o121R124K3951J2436m979j0213
11332A1146n359m070J539k729k407j260q437J2111P332r302K392O437N37q3p327
11317E20j368q091r919O665Q106L288j5933M259J7317O455q024j3731j1855Q045
11303a4266N527J918j807J0688p402j3098k726K51Q637J2007R51j0151J506N685
11289b280J0956j4079p287L580k035j0124L164J9583r722K198L967K160K890O718
11275I689m652p14l131N145j3225p622o57j992j4619o273J3240R874K448q498
11261b0987k520P608O338M859N303J4815j1477n47q587q13J3774k981j0068R371
$$ plain form
11247 4088 8219 -430 2632 7009 1418 -7960 -4048 762 -1739 511 7143 9170 10352 942 -10150
11232 -10150 -569 18420 21773 8926 8403 15997 3643 -4757 -1844 1984 1273 -4272 -6548 472
11218 472 -3393 -4817 1579 11703 -6609 -15235 -14013 -22825 -22295 -7383 -5341 -13371 -13862 -24819
11204 -24819 -25201 -15474 -15861 -12680 -1215 -15476 -20154 -13023 9452 16385 5754 -9822 -13088 1193
11190 1193 18419 12466 -1244 -26108 -29059 -33450 -34738 -22292 -12399 -6741 -8173 2673 2932 2250
11176 2250 7669 20232 7944 -4153 -2613 1971 2401 -3888 1765 1435 -241 2938 9952 2095
11162 2095 -8142 -11062 19 -2640 -5625 -13285 -25660 -31207 -22256 -27504 -19035 -12452 -12175 -4095
11148 -4095 6016 10773 23007 28652 19111 5051 -8573 -3423 12203 19458 16113 11123 -14444
$$ packed form
11247D088M131q649L062M377n591r378L912M810k501K250O632K027J182r410j1092
11232a0150R581J8989L353j2847n23P594j2354q400K913L828p11n545k276P020
11218D72l865j424O396J0124j8312q626J222q812N30J4912K042q030m91j0957
11204b4819l82R727l87L181J1465j4261m678P131K2475O933j0631j5576l266J4281
11190A193J7226n953j3710k4864k951m391j288J2446R893N658j432J0846K59o82
11176B250N419J2563j2288j2097J540M584M30o289N653l30j676L179P014p857
11162B095j0237k920J1081k659k985p660j2375n547Q951n248Q469O583K77Q080
11148d095J0111M757J2234N645r541j4060j3624N150J5626P255l345m990k5567
$$ plain form
11135 -14444 -15182 -301 3233 2350 5352 -5046 -21811 -18573 -5274 -7366 -11864 -14443 -18817 -15807
11121 -15807 -25060 -28209 -28193 -16698 -18699 -10828 -3599 2006 -21384 -28454 -33713 -33502 -24134 2157
11107 2157 -10572 -31537 -29533 -25395 -21458 -29622 -34241 -29861 -24644 -27897 -24846 -15167 -24274 -10162
11093 -10162 6226 17599 18451 -1913 -20080 -12364 -9134 -7260 -8825 -14425 -19078 -30117 -20975
11080 -20975 -16589 -16715 -19986 -8112 -3851 -7300 -14824 -12458 -10968 -11667 -9680 -2314 -7754 -24216
11066 -24216 -18457 -1671 -5605 -4850 4352 14327 9105 9253 10352 9049 25511 22499 20751 14594
11052 14594 369 5703 5241 -4343 7816 14606 7394 21132 16294 224 -9644 -19219 -10942 -8344
11038 -8344 -17679 -23979 -26467 -35441 -23463 -989 2230 6079 7370 -5316 -9095 -6907 -10681 -12814
$$ packed form
11135a4444p38J4881L534q83L002j0398j6765L238J3299k092m498k579m374L010
11121a5807r253l149J6J1495k001P871P229N605k3390p070n259K11R368K6291
11107B157j2729k0965K004M138L937q164m619M380N217l253L051R679r107J4112
11093a0162J6388J1373Q52k0364j8167P716L230J874j565n600m653j1039R142
11080b0975M386j26l271J1874M261l449p524K366J490o99J987P366n440j6462
11066b4216N759J6786l934P55R202R975n222J48J099j303J6462l012j748o157
11052A4594j4225N334m62r584J2159O790p212J3738m838j6070r868r575Q277K598
11038h344r335o300k488q974J1978K2474L219L849J291j2686l779K188l774k133
$$ plain form
11024 -12814 -6264 -6183 -4005 8243 21018 19371 8061 -3968 10327 20893 5469 -20195 -14507
11011 -14507 7287 21948 17659 6750 -4300 -14423 68 13376 21105 16225 8204 5714 1696
10998 1696 -2400 3051 7348 16577 13002 10022 16235 22233 27646 20693 10576 -5381 -12973 -3208
10984 -3208 3553 3490 -5577 2754 1784 -14486 -12777 -9349 -11422 -8457 -4693 -10600 -15816 -10916 -16683
10969 -16683 -22568 -22552 -19227 -8578 -1383 -6825 -6580 -2863 17154 27709 34511 9020 10264 11044
10955 11044 10382 10003 2007 4058 6777 -3419 -5379 -14918 -32925 -35432 -19916 -384 -211 -8860
10941 -8860 3169 918 11573 3718 -2584 -6503 -5795 -14221 -10183 -5053 -5708 2724 7368 11257 3570
10926 3570 4311 16455 12802 4819 9049 5137 -7508 6906 6980 7657 10295 2922 7073 -273 -10934
$$ packed form
11024a2814O550Q1K178J2248J2775j647j1310j2029J4295J0566j5424k5664N688
11011a4507K1794J4661m289j0909j1050j0123J4491J3308P729m880q021k490m018
10998A696m096N451M297R229l575k980O213N998N413o953j0117j5957p592R765
10984c208O761o3r067Q331r70j6270J709L428k073K965L764n907n216M900n767
10969a6683n885J6L325J0649P195n442K45L717K0017J0555O802k5491J244P80
10955A1044o62l79p996K051K719j0196j960r539j8007k507J5516J9532J73q649
10941h860J2029k251J0655p855o302l919P08q426M038N130o55Q432M644L889p687
10926C570P41J2144l653p983M230l912j2645J4414P4O77K638p373M151p346j0661
$$ plain form
10911 -10934 -1477 6873 15639 13420 15066 6131 6655 893 -4368 -15095 -22166 -13327 -6711 -11428
10897 -11428 3084 13911 4475 -675 -486 -18325 -23001 -14359 -13237 -6009 4083 -1216 -1956 -4246
10883 -4246 6841 5115 23147 31689 32704 13518 4010 4545 8073 7048 11680 11858 -2112 7595
10869 7595 19306 5430 5298 6898 8705 -10305 -23009 -23071 -23606 -14448 -2727 1316 -1478 -13646
10855 -13646 -11708 -11769 -4037 -7630 -15678 1499 11304 4465 4439 11939 14462 8665 12375 -4529 -7891
10840 -7891 6188 13074 23943 22056 24248 14157 9476 -4492 -8519 -11497 -21624 -20711 -26480 -23289
10826 -23289 -11435 -13797 -14785 -3930 -1200 -8438 -16080 -14668 9131 26355 3193 -9576 -7094
10813 -7094 705 2120 9730 18865 7022 14516 45694 36551 15604 7396 24072 16004 -1560
$$ packed form
10911a0934R457Q350Q766k219J646q935N24n762n261j0727p071Q839O616m717
10897a1428J4512J0827r436n150J89j7839m676Q642J122P228J0092n299p40k290
10883d246J1087j726J8032Q542J015j9186r508N35L528j025M632J78j3970R707
10869G595J1711j3876j32J600J807j9010j2704o2n35R158J1721M043k794j2168
10855a3646J938o1P732l593q048J7177R805o839k6P500K523n797L710j6904l362
10840g891J4079O886J0869j887K192j0091m681j3968m027k978j0127R13n769L191
10826b3289J1854k362r88J0855K730p238p642J412K3799J7224k3162j2769K482
10813g094P799J415P610R135j1843P494L1178r143k0947q208J6676q068j7564
$$ plain form
10800 -1560 -10391 -4313 -6405 -18485 -20976 -5418 -2735 916 7623 1169 -11396 -18419 -23303 -33899
10786 -33899 -36563 -21620 -25047 -24775 -21531 -13050 -14145 -18403 -4034 5286 20384 30325 11163 -7371
10772 -7371 -4427 -1114 -10867 -3091 7132 6509 11268 5551 3907 14880 11180 4808 6214 6413 -1857
10757 -1857 -9090 -7947 9615 18729 7671 2491 11468 8687 1167 6775 2240 -4631 -7311 -13404
10743 -13404 960 12629 5866 2379 14021 8201 -14161 -33444 -17556 -1666 -4489 -5800 -3020
10730 -3020 -4494 1788 8445 12882 10349 10586 2091 -16276 -20282 -35272 -35878 -26822 -25276 -17916 -4481
10715 -4481 -8463 -13928 -8145 3151 4333 66 2228 1206 -3393 -5142 -4619 -1694 -8434 -14349 -5930
10700 -5930 -924 9385 8715 8485 12213 1884 -2 -287 5626 24390 23771 8491 -2018 -10778
$$ packed form
10800a560q831O078k092j2080k491J5558K683L651O707o454j2565p023m884j0596
10786c3899k664J4943l427K72L244Q481j095m258J4369R320J5098R941j9162j8534
10772g371K944L313r753P776J0223o23M759n717j644J0973l700o372J406J99q270
10757a857p233J143J7562R114j1058n180Q977k781p520N608m535o871k680o093
10743a3404J4364J1669o763l487J1642n820k2362j9283J5888J5890k823j311K780
10730c020j474O282O657M437k533K37q495j8367m006j4990o06R056J546P360J3435
10715d481l982n465N783J1296J182m267K162j022m599j749N23K925o740n915Q419
10700e930N006J0309o70k30L728j0329j886k85N913J8764o19j5280j0509q760
$$ plain form
10686 -10778 -24238 -22846 -28407 -27630 -21420 -26404 -27167 -22484 -18040 -9171 2389 6125 -4884 -14038
10672 -14038 -13970 -4518 -1727 -5703 -1052 9137 20882 18290 3211 5744 4950 427 -5197 -2115
10658 -2115 5195 5179 1219 28148 36211 29159 29034 6800 2201 10261 -8455 -14266 13332 8664
10644 8664 -17716 -13590 -9333 -16585 -24394 -14871 -11974 -19271 -20628 -42376 -38334 -41743 -37080 -20951
10630 -20951 -16243 -11829 5490 14238 22397 5127 -92 3080 18268 23306 4086 -18812 -18910 -12681
10616 -12681 -10876 -2033 -10057 -10224 -11603 -11884 -6158 3999 7559 5163 4560 -1414 -7331 -28647 -32413
10601 -32413 -30046 -10943 3362 2041 -1720 -8878 -2642 -8942 5048 19477 10450 2311 -11879
10588 -11879 -7981 3036 5249 -5823 -14798 -10060 -6942 -14576 -16309 -16227 -15386 6109 17095 10347
$$ packed form
10686a0778j3460J392n561P77O210m984p63M683M444Q869J1560L736j1009r154
10672a4038O8R452K791l976M651J0189J1745k592j5079K533p94m523n624L082
10658b115P310j6l960K6929Q063p052j25k2234m599Q060j8716n811K7598m668
10644H664k6380M126M257p252p809R523K897p297j357k1748M042l409M663J6129
10630b0951M708M414J7319Q748Q159j7270n219L172J5188N038j9220k2898r8O229
10616a2681J805Q843q024j67j379k81N726J0157L560k396o03n974n917k1316l766
10601c2413K367J9103J4305j321l761p158O236o300J3990J4429r027q139j4190
10588a1879L898J1017K213j1072q975M738L118p634j733Q2Q41K1495J0986o748
$$ plain form
10574 10347 -14783 -7395 -3731 -20600 -36629 -27284 -20144 -11113 -2731 -4273 -910 14981 26129
10561 26129 28009 20614 11209 6944 -2438 441 -12352 -18690 -20222 -17825 -27418 -35091 -26798 -8755
10547 -8755 13989 17294 10891 18460 12429 705 -1869 -7534 -20574 -18080 -8210 -2161 -5777 -3787
10533 -3787 -804 1658 -463 1086 -658 -20581 -32256 -24908 -15733 -18960 -18599 -6739 2678 41
10519 41 -11209 -1898 -2249 -406 8116 330 -6190 -13192 -12971 -17627 -16716 -23775 -15836 -6825 -20037
10504 -20037 -18797 5952 10348 7872 2624 -13171 -11446 982 8554 13920 10085 4910 1255 6789
10490 6789 20851 8567 -16043 -14667 -7787 -3466 -15436 -17119 -21074 -13479 -18127 -20837 -28072 -27458
10476 -27458 -27087 -13636 -14412 -6317 13589 16421 8897 -11980 -14032 -18399 -28964 -41792 -40166 -28325
$$ packed form
10574A0347k5130P388L664j6869j6029R345P140R031Q382j542L363J5891J1148
10561B6129J880p395r405m265r382K879j2793o338j532K397r593p673Q293J8043
10547h755K2744L305o403P569o031j1724k574n665j3040K494R870O049l616J990
10533c787K983K462k121J549j744j9923j1675P348R175l227L61J1860R417k637
10519D1j1250R311l51J843Q522p786o520p002K21m656R11p059P939R011j3212
10504b0037J240K4749M396k476n248j5795J725J2428P572N366l835n175l655N534
10490F789J4062j2284k4610J376O880M321j1970j683l955P595m648k710p235O14
10476b7458L71J3451p76Q095J9906K832p524k0877k052m367j0565j2828J626J1841
$$ plain form
10462 -28325 -21780 -16852 -15626 -965 7371 6463 -2421 -4153 -9347 -12409 -11963 -25190 -40031 -29672
10448 -29672 -20064 -11303 -8485 -11234 -14755 -11519 -4335 -14726 -11179 2839 -8514 -11380 -9444 6706
10434 6706 6596 3713 -10158 -14922 -3943 -2654 -6591 3721 11136 6840 -2820 -14494 -11035 -11942
10420 -11942 -7754 -13711 -10642 -9344 701 -5501 -5552 2721 10613 6200 6226 8226 5177 1394 -3350
10405 -3350 -22462 -16742 -29878 -43011 -19198 3365 4443 -5344 -13491 -1642 7038 -10090 -14702
10392 -14702 -502 10594 3469 -2823 -6208 -22004 -12670 -5162 -9000 -2094 6518 6420 -5561 -4257
10378 -4257 4356 15734 17162 23566 22535 15614 7416 1075 7671 9251 11752 3342 2356 20202
10364 20202 30684 24671 9089 -10151 -14485 -13689 -10501 -3616 6467 10359 7911 -1846 -7269 1780
$$ packed form
10462b8325O545M928J226J4661Q336r08q884j732n194l062M46j3227j4841J0359
10448b9672R608Q761K818k749l521L236P184j0391L547J4018j1353k866J936J6150
10434F706j10k883j3871m764J0979J289l937J0312P415m296r660j1674L459r07
10420a1942M188n957L069J298J0045o202n1Q273P892m413K6K000l049l783m744
10405c350j9112N720j3136j3133K3813K2563J078r787q147J1849Q680j7128m612
10392a4702J4200J1096p125o292l385j5796R334P508l838O906Q612r8j1981J304
10378d257Q613J1378J428O404j031o921q198o341O596J580K501q410r86J7846
10364B0202J0482o013j5582j9240m334P96L188O885J0083L892k448r757n423R049
$$ plain form
10350 1780 1902 -2103 -8304 -19151 -28731 -13941 2490 5063 7804 11300 -408 -9472 320 -5716
10336 -5716 -12021 7566 7874 7391 -5093 -9103 -10946 3387 7639 4591 -5272 -11013 -8343 -1118
10322 -1118 -1834 -1162 -2355 -5428 -18147 -20530 -6385 -4100 -14205 -16027 -15824 -10546 7944 13998
10308 13998 266 -14650 -18968 -21189 -1301 7228 14748 5660 -4217 423 4360 4913 15466 17855
10294 17855 9768 12577 19324 25177 30304 20635 11485 6234 -7980 -6566 -12442 -10349 -18399 -22180
10280 -22180 -25547 -25310 -9510 -5145 -4499 -1483 -3821 -9153 -26025 -29379 -16036 -20295 -13139 -16692
10266 -16692 -18172 -8311 -5815 -10709 -17012 -3865 -581 -11876 -26026 -6735 8899 11170 22248
10253 22248 18363 16109 14630 16236 18015 8148 -3421 -16949 -24582 -14564 13239 26363 17354
$$ packed form
10350A780J22m005o201j0847r580J4790J6431K573K741L496j1708r064R792o036
10336e716o305J9587L08m83j2484m010j843J4333M252l048r863n741K670P225
10322a118p16O72j193l073j2719k383J4145K285j0105j822K03N278J8490O054
10308A3998j3732j4916m318k221J9888Q529P520r088r877M640L937N53J0553K389
10294A7855q087K809O747N853N127r669r150n251j4214J414n876K093q050l781
10280b2180l367K37J5800M365O46L016k338n332j6872l354J3343m259P156l553
10266a6692j480R861K496m894o303J3147L284j1295j4150J9291J5634K271J1078
10253B2248l885k254j479J606J779r867j1569j3528p633J0018K7803J3124r009
$$ plain form
10240 17354 11012 743 -6376 -7895 -15793 -13428 -9845 -13390 -8243 4955 6101 6671 15743 6887
10226 6887 -15025 -8164 7982 2776 -2922 -5954 -9498 -15414 -16232 -20650 -17074 -15977 -21094 -29707
10212 -29707 -29059 -17250 -9591 5560 -2486 -11687 -16960 -17858 -9820 -11711 -3553 -14504 -15608 513
10198 513 8111 -1997 -4083 4153 4981 -2783 1876 5529 -3231 -5586 2344 3939 -2692 -8342 -5420
10183 -5420 -9688 -6369 -5733 -7047 -17913 -14792 -3395 -4407 -14287 -15440 -5521 13331 7228 -3988
10169 -3988 3977 5925 -7293 -10039 -5162 -4912 -3163 6668 -10606 -19570 -14615 -10157 -2468 912
10155 912 7635 4132 2849 12047 32526 43916 36730 22740 8566 3680 5348 5116 -219 -3024
10141 -3024 -4035 -1333 -3177 2343 -2679 10869 26598 23723 6082 5435 -1943 -6320 -10878 -10217
$$ packed form
10240A7354o342j0269p119j519p898K365L583l545N147J3198J146N70R072q856
10226F887k1912O861J6146n206n698l032l544n916q18m418L576J097n117q613
10212b9707O48J1809P659J5151q046r201n273q98Q038j891Q158j0951j104J6121
10198E13P598j0108k086Q236Q28p764M659L653q760k355P930J595o631n650K922
10183e420m268L319O36j314j0866L121J1397j012r880j153R919J8852o103j1216
10169c988P965J948j3218k746M877K50J749R831j7274q964M955M458P689L380
10155I12O723l503j283R198K0479J1390p186j3990j4174m886J668k32n335k805
10141c024j011K702j844N520n022J3548J5729k875j7641o47p378m377m558O61
$$ plain form
10127 -10217 -19042 -24176 -14843 -6991 -11186 -6723 -2889 1906 9299 5538 3380 -1843 1569 12635
10113 12635 15368 10360 1599 -10534 -7608 -5531 2062 -1414 -1638 1720 8554 -7218 -6439 5225
10099 5225 4796 4455 17164 20911 17275 10804 5813 -181 9703 22699 22017 8840 -5104 -11000
10085 -11000 8781 20226 22872 22737 28177 14415 12436 7566 3958 -6155 2730 4908 -735 3099
10071 3099 -555 7555 16803 25421 31135 50723 62103 75505 105651 128493 185036 305597 548329
10058 548329 962421 1258856 964717 579374 340460 196459 119782 82345 59753 51723
10048 51723 40792 40332 48188 37442 16560 25967 14504 2781 3149 -2109 -4919 16217 13965
10035 13965 7108 -3256 -15782 -16454 -9192 -13135 -5989 -8086 -16793 -17139 -2936 13382 9934 18311
$$ packed form
10127a0217q825n134R333P852m195M463L834M795P393l761k158n223L412J1066
10113A2635K733n008q761j2133K926K077P593l476k24L358O834j5772P79J1664
10099E225m29l41J2709L747l636o471m991n994R884J2996o82j3177j3944n896
10085a1000J9781J1445K646j35N440j3762j979m870l608j0113Q885K178n643L834
10071C099l654Q110R248Q618N714J9588J1380J3402L0146K2842N6543J20561K42732
10058E48329M14092K96435k94139l85343k38914j44001p6677l7437k2592q030
10048E1723j0931m60P856j0746k0882R407j1463j1723L68n258k810K1136k252
10035A3965o857j0364j2526o72P262l943P146k097q707l46J4203J6318l448Q377
$$ plain form
10021 18311 22808 10445 -5112 -10639 -12389 -3588 -2115 -12491 -16046 -996 16536 15569 2292
10008 2292 9137 16411 17444 15121 -5145 -9429 1970 7029 3616 4386 -5313 -9573 -8939 -16827 -18338
9993 -18338 3391 -81 -9007 -12419 -22831 -33428 -23437 -3728 5891 7361 7280 4770 -14845 -6266
9979 -6266 -4006 -6303 -2986 -6447 2565 7300 8378 7017 -4735 -3357 13743 10972 20283 23044
9965 23044 13081 789 -11540 -10346 -8457 -1318 -5332 -4763 10158 2190 2569 14157 26063 20913
9951 20913 9960 653 10070 -2798 1169 7046 5052 -7625 -16124 -5650 4920 6362 1385
9938 1385 1424 -15918 -10703 5196 2787 -17713 -19424 -16711 -11979 -13049 -10348 -10003 -10116 -20756 -17157
9923 -17157 -4845 -2769 -16258 -13749 -1460 -503 -9792 -18934 -20004 -23421 -17640 -11609 -18487 -9522
$$ packed form
10021A8311M497j2363j5557n527j750Q801J473j0376l555J5050J7532r67j3277
10008B292O845P274J033k323k0266m284J1399N059l413P70r699m260O34p888j511
9993a8338K1729l472q926l412j0412j0597R991J9709R619J470q1k510j9615Q579
9979f266K260k297L317l461R012M735J078j361j1752J378J7100k771R311K761
9965B3044r963j2292j2329J194J889P139m014N69J4921p968L79J1588J1906n150
9951B0913j0953r307R417j2868L967N877j994j2677q499J0474J0570J442m977
9938A385L9j7342N215J5899k409k0500j711K713M732j070K701L45j13j0640L599
9923a7157J2312K076j3489K509J2289R57r289r142j070l417N781O031o878Q965
$$ plain form
9909 -9522 -494 5095 -3541 -15294 -26353 -18920 -17883 -9845 3084 13441 9333 -13805 -808
9896 -808 2919 -7069 -712 4128 11265 12242 -5889 -9264 6450 16650 24279 10605 2469 2145 10701
9881 10701 3615 -1218 3880 -2009 -3149 -6444 -18112 -21141 -9007 3235 8330 1410 -4136 -15026
9867 -15026 -16020 -5547 -11303 -10411 -1087 4009 5445 -3500 1782 -85 -4868 -3453 -12271 -16366 -13159
9852 -13159 -4193 6520 11685 3532 7640 3266 -6292 -8225 -11004 -2619 9281 4168 -10917 -3685
9838 -3685 7528 2903 4414 9071 -1754 -3921 -3165 1459 3031 6973 993 -12770 -23464 -17940
9824 -17940 -1910 5315 2120 -6513 -4749 148 8895 11322 -378 -239 -4101 2116 10694 3924
9810 3924 -12930 -6887 1864 18041 31204 37562 27932 15311 12605 12116 785 13775 21455 23934
$$ packed form
9909i522R028N589q636j1753j1059P433J037Q038J2929J0357m108k3138J2997
9896h08L727r988O357M840P137R77j8131l375J5714J0200P629j3674q136l24Q556
9881A0701p086m833N098n889j140l295j1668l029J2134J2242N095o920n546j0890
9867a5026r94J0473n756Q92R324N096J436q945N282j867m783J415q818m095L207
9852a3159Q966J0713N165q153M108m374r558j933k779Q385J1900n113j5085P232
9838c685J1213m625J511M657j0825k167P56M624J572L942n980j3763j0694N524
9824a7940J6030P225l195q633J764M897Q747K427j1700J39l862O217Q578o770
9810C924j6854O043Q751J6177J3163O358r630j2621k706m89j1331J2990P680K479
$$ plain form
9796 23934 11591 -4885 -9368 -7860 -12025 -14753 -16073 -19713 -24527 -11377 17199 29307 26516
9783 26516 19318 22334 16104 21742 20853 21856 17478 13795 20885 20097 13801 -10941 -16378 -23613 -11202
9768 -11202 -9476 -2111 20520 16536 13379 21311 22946 12162 6331 -2891 971 3657 865 -19473
9754 -19473 -11963 7025 -4325 -2498 8232 -3202 -9872 -3067 -14896 -30485 -37701 -37014 -31750
9741 -31750 -9342 11328 -5783 -22629 -15929 -7884 -8692 -14549 -3725 4350 6911 5727 -600 5909
9727 5909 -3147 -15878 -14028 -6055 -9104 -627 7496 11689 -1336 5901 8831 -4481 -20191 3595
9713 3595 12849 5099 3386 6463 3881 3302 8204 -3462 -3963 12488 23200 22059 7369 -17895
9699 -17895 -17906 -8338 -10738 -7767 2992 -1712 -15417 -22742 -18272 -8474 -7820 4076 11084 7607 -11182
$$ packed form
9796B3934j2343j6476m483J508m165k728j320l640m814J3150K8576J2108k791
9783B6516p198L016o230N638q89J003m378l683P090p88o296k4742n437p235J2411
9768a1202J726P365K2631l984l157P932J635j0784n831r222L862K686k792k0338
9754a9473P510J8988j1350J827J0730j1434o670O805j1829j5589p216O87N264
9741c1750K2408K0670j7111j6846O700Q045q08n857J0824Q075K561j184o327O509
9727E909r056j2731J850P973l049Q477Q123M193j3025P237K930j3312j5710K3786
9713C595R254p750j713L077k582n79M902j1666n01J6451J0712j141j4690k5264
9699a7895j1R568k400K971J0759m704j3705p325M470R798O54J1896P008l477j8789
$$ plain form
9684 -11182 -21150 -27432 -32441 -21031 -18325 -5566 2712 -3741 -11457 -5014 -4754 -371 925 -3115
9670 -3115 991 2220 13301 20155 10343 -17862 -23820 -7143 -5089 -10946 -7848 1802 4660 -7299
9656 -7299 -13509 -21759 -12370 4584 22474 30328 24158 24986 21938 19539 9712 7867 12977 -4089
9642 -4089 -2532 13969 22537 8830 5723 7984 2095 -1348 -5818 10720 21532 23872 20882 6533
9628 6533 -205 -336 1112 -3273 -10252 -14851 -13921 -2369 15564 29677 27214 14563 9391 9269 3011
9613 3011 -12748 -7463 2829 12346 14709 6863 5268 12515 19763 17682 4990 -3809 -6101 4041
9599 4041 22262 18592 -4693 -8466 -5958 -11362 -9299 6286 12300 9600 17208 5226 -13690 -11748
9585 -11748 -1051 11632 5471 -7101 -5910 3879 25160 22873 7333 1511 -1751 -7061 -2907
$$ packed form
9684a1182r968o282n009J1410K706J2759Q278o453p716O443K60M383J296m040
9670c115M106J229J1081O854r812k8205n958J6677K054n857L098R650K858j1959
9656g299o210q250R389J6954J7890P854o170Q28l048k399r827j845N110j7066
9642d089J557J6501Q568j3707l107K261n889l443m470J6538J0812K340k990j4349
9628F533o738j31J448m385o979m599R30J1552J7933J4113k463j2651n172j22o258
9613C011j5759N285J0292R517K363p846j595P247P248k081j2692q799k292J0142
9599D041J8221l670k3285l773K508n404K063J5585O014k700P608j1982j8916J942
9585a1748J0697J2683o161j2572J191R789K1281k287j5540n822l262n310M154
$$ plain form
9572 -2907 12271 19487 7604 693 -3049 -5744 1092 14717 10286 19489 23901 18636 14747 14294
9558 14294 3022 4232 -10291 -11122 7942 -7189 -19227 -16408 4492 20201 18380 10506 9320
9545 9320 26514 12919 -10549 -7747 -996 -11945 -9279 -1282 -1352 3655 15909 17940 11857 5452
9531 5452 9967 -69 -15267 -26182 -40203 -22417 -3029 7278 9527 10879 1119 -4256 4797
9518 4797 10461 14431 17080 15852 339 -10947 -10968 -17262 -19903 -24605 -15985 -2568 -160 13486
9504 13486 32912 29097 11248 6825 -5563 -23276 -8224 -18306 -12448 9103 10642 -2064 -5772
9491 -5772 -10425 -6860 6033 6043 -508 -9108 -12579 1057 4633 -10625 -15380 -14694 -1759 9259
9477 9259 13615 5676 1574 2227 193 -5497 -2009 -16213 -20364 -29364 -20626 -1241 10510 3137
$$ packed form
9572b907J5178P216j1883o911l742k695O836J3625m431R203M412n265l889m53
9558A4294j1272J210j4523q31J9064j5131j2038K819K0900J5709j821p874j186
9545I320J7194j3595k3468K802O751j0949K666P997p0N007J2254K031o083o405
9531E452M515j0036j5198j0915j4021J7786J9388J0307K249J352r760n375R053
9518D797N664L970K649j228j5513j1286k1o294k641m702Q620J3417K408J3646
9504A3486J9426l815j7849m423j2388j7713J5052j0082N858K1551J539j2706l708
9491e772m653L565J2893J0o551q600l471J3636L576j5258m755O86J2935J1018
9477I259M356p939m102O53k034n690L488j4204m151r000Q738J9385J1751p373
$$ plain form
9463 3137 -1935 -18162 -24178 -14786 -7935 10553 29114 29188 35670 33129 31140 22674 9845 3783
9449 3783 4720 -848 778 14663 14339 26128 24012 26723 28759 19755 11116 16696 15896 17030 11470
9434 11470 24077 27862 17261 5964 11368 17890 17795 12564 14337 -2199 -14653 -3111 14205
9421 14205 19622 17544 18397 7235 -9271 -6999 481 15698 22600 28617 21639 23665 29299 31289
9407 31289 28405 28208 26462 18779 18102 20943 12363 -936 -1198 6331 672 -5338 -7877 3451 3520
9392 3520 10027 -2587 7960 17324 13341 11196 18370 17563 17674 8614 5071 1892 5921 23297 37214
9377 37214 37597 18649 13512 16012 3764 18666 22668 21558 30042 41799 47843 46390 38288 21978
9363 21978 12743 12973 30747 27743 16687 16303 21847 18568 9419 14985 9968 10861 -2250 -13436
$$ packed form
9463C137n072j6227o016R392O851J8488J8561P4O482k541j989q466j2829o062
9449C783R37n568J626J3885l24J1789k116K711K036r004q639N580q00J134n560
9434A1470J2607L785j0601j1297N404O522r5n231J773j6536j2454J1542J7316
9421A4205N417k078Q53j1162j6506K272P480J5217O902O017o978K026N634J990
9407C1289k884j97j746p683o77K841q580j3299k62P529n659o010k539J1328O9
9392C520O507j2614J0547R364l983k145P174q07J11r060l543l179M029J7376J3917
9377C7214L83j8948n137K500j2248J4902M002j110Q484J1757O044j453q102j6310
9363B1978r235K30J7774l004j1056l84N544l279r149N566n017Q93j3111j1186
$$ plain form
9349 -13436 -11398 -4392 10467 27594 36813 52408 41797 32092 29948 33964 29695 33557 33925 26244
9335 26244 6351 8510 21763 19632 10738 -2788 3822 11557 28193 22865 29456 32183 23646 10804
9321 10804 1749 3352 -2464 -247 -6580 -5156 24171 25710 3265 -7066 -11853 -6665 -1940 -2774
9307 -2774 -9732 -312 9191 15411 18040 26836 32754 30534 26472 16081 20208 26396 14395 -1242
9293 -1242 -3949 -11369 -4045 5264 4595 1606 2695 2097 14036 31030 41641 37973 27636 29093
9279 29093 28277 39527 59710 67753 50265 35754 36763 44846 54256 42714 48422 60981 49222
9266 49222 32615 27000 28908 30889 42205 33271 24019 10444 6471 8679 -4256 -14634 -9505
9253 -9505 -8115 -11641 1509 4760 12663 38780 45015 40117 31753 26707 17778 10772 425 24269
$$ packed form
9349a3436K038P006J4859J7127R219J5595j0611r705k144M016m269L862L68p681
9335B6244j9893K159J3253k131q894j3526O610P735J6636n328O591K727q537j2842
9321A0804r055J603n816K217o333J424K9327J539k2445j0331m787N188M725q34
9307b774o958R420R503O220K629Q796N918k220m062j0391M127O188j2001j5637
9293a242k707p420P324R309o69k989J089n98J1939J6994J0611l668j0337J457
9279B9093q16J1250K0183Q043j7488j4511J009Q083R410j1542N708J2559j1759
9266D9222j6607n615J908J981J1316q934r252j3575l973K208j2935j0378N129
9253i505J390l526J3150L251P903K6117O235m898q364n046q929p006j0347K3844
$$ plain form
9239 24269 22804 17654 17651 20141 17439 1630 2370 9617 8643 12164 8765 13764 2074 -18005 -23322
9224 -23322 -30715 -26374 -12327 3777 2431 5785 13398 26122 13073 933 12433 20705 23175
9211 23175 30351 37440 28494 27170 33539 24563 29127 32590 53695 37756 36127 43376 48237 42458
9197 42458 59735 59653 43569 38655 59215 66717 53038 44918 44619 48591 53879 71791 69153 72048
9183 72048 75514 73453 94362 120933 119273 113147 123255 147327 169422 182399 199384 218751 248279
9170 248279 272882 317820 391861 470034 571601 707009 872073 1071305 1265536 1415363
9160 1415363 1523139 1561135 1539027 1445528 1293854 1121544 950888 776206 613408 501136
9150 501136 411461 340260 299352 267951 229388 206468 189160 169040 151672 134952 114387 120786
$$ packed form
9239B4269j465n150lK490k702j5809P40P247r74L521l399M999j1690k0079n317
9224b3322p393M341J4047J6104j346L354P613J2724j3049j2140J1500Q272K470
9211B3175P176P089q946j324O369q976M564L463K1105j5939j629P249M861n779
9197D2458J7277q2j6084m914K0560P502j3679q120k99L972N288J7912k638K895
9183G2048L466k061K0909K6571j660o126J0108K4072K2095J2977J6985J9367K9528
9170B48279K4603M4938P4041P8173J01567J35408J65064J99232J94231J49827
9160A415363J07776L7996k2108r3499j51674j72310j70656j74682j62798j12272
9150E01136q9675p1201m0908l1401l8563k2920j7308k0120j7368j6720k0565O399
$$ plain form
9138 120786 122437 118358 111989 98247 106105 83518 67654 79842 82741 90879 94181 94865 114147
9125 114147 125785 114401 96402 89485 85214 75058 58701 64342 78196 83011 95086 90892 93251
9112 93251 82161 78952 82181 105548 130362 132635 128352 119410 124856 124996 129725 145929 147959 155672
9098 155672 175079 197736 228745 264004 323119 397960 478953 598591 780806 1090006 1656905
9087 1656905 2711292 4687407 7955948 10252227 8177736 5116802 3118193 2019478
9079 2019478 1413724 1051674 807630 635474 504874 417986 385732 348791 321614 318245 320440
9068 320440 321692 316434 313641 329709 330668 301886 261930 240565 218050 216391 199504 178995 162860
9055 162860 160611 145695 131325 132611 134551 141059 136742 125746 98424 96965 103588 87348 73679
$$ packed form
9138A20786J651m079o369j3742P858k2587j5864J2188K899Q138L302O84J9282
9125A14147J1638j1384j7999o917m271j0156j6357N641J3854M815J2075m194K359
9112I3251j1090l209L229K3367K4814K273m283q942N446J40M729J6204K030P713
9098A55672J9407K2657L1009L5259N9115P4841Q0993J19638J82215L09200N66899
9087A656905J054387J976115L268541K296279k074491l060934j998609j098715
9079B019478o05754l62050k44044j72156j30600q6888l2254l6941k7177l369K195
9068C20440J252n258k793J6068R59k8782l9956k1365k2515j659j6887k0509j6135
9055A62860k249j4916j4370J286J940O508m317j0996k7322j459O623j6240j3669
$$ plain form
9042 73679 69119 54088 65582 79566 78610 66896 70649 106631 107989 87226 79978 94394 98306
9029 98306 104088 108279 107641 115836 114147 128168 144003 154486 168549 192908 222610 267196 316784
9016 316784 364266 367154 345532 290307 228868 180634 167556 171964 163797 145006 120188 92853
9004 92853 84535 83768 76254 66208 73539 91493 88998 89188 94221 96326 102455 114238 114680 115253 105127
8989 105127 94215 92725 99926 103095 127193 140645 140652 137772 125394 120945 119992 114420 108253 117666
8975 117666 112760 104321 105834 115573 97932 92628 93730 92559 101385 101496 74656 66975 63513 64860
8961 64860 66821 66503 71816 81562 86701 89430 94116 96753 100170 122872 124761 120235 139844 162679
8947 162679 167118 161573 136133 135462 159380 180282 178856 168807 160144 146403 152291 157430 154969
$$ packed form
9042G3679m560j5031J1494J3984r56j1714L753L5982J358k0763p248J4416L912
9029I8306N782M191o38Q195j689J4021J5835J0483J4063K4359K9702M4586M9588
9016C16784M7482K888k1622n5225o1439m8234j3078M408q167j8791k4818k7335
9004I2853q318p67p514j0046P331J7954k495J90N033K105O129J1783M42N73j0126
8989A05127j0912j490P201L169K4098J3452Pk880j2378m449r53n572o167R413
8975A17666m906q439J513R739j7641n304J102j171Q826J11k6840p681l462J347
8961F4860J961l18N313R746N139K729M686K637L417K2702J889m526J9609K2835
8947A62679M439n545k5440o71K3918K0902j426j0049q663j3741N888N139k461
$$ plain form
8934 154969 158329 157356 153351 163687 175304 171104 160054 146061 135517 126917 128448 150273 151055
8921 151055 132509 141606 153836 153488 146820 131850 98849 71017 54736 57192 71579 89381 137094
8908 137094 178614 192018 195237 216021 242853 257192 262223 271689 291886 287228 290411 322314 342981
8895 342981 362368 385268 428039 505566 627799 767964 856484 830362 676873 504062 374687
8884 374687 290838 242378 218352 233825 240205 245336 237331 245289 252582 261891 261802 263936 258092 276178
8870 276178 304381 323373 314577 303442 290250 273274 268736 290182 317539 333168 339528 347395
8858 347395 358907 370565 380990 394312 398139 425111 445579 468538 472816 463379 472288 470714 457737
8845 457737 459186 467197 496890 524116 539898 560348 572997 571371 582121 590953 607435 616158 610344
$$ packed form
8934A54969L360r73m005J0336J1617m200j1050j3993j0544q600J531K1825P82
8921A51055j8546R097J2230l48o668j4970l3001k7832j6281K456J4387J7802M7713
8908A37094M1520J3404L219K0784K6832J4339N031R466K0197m658L183L1903K0667
8895C42981J9387K2900M2771P7527J22233J40165Q8520k6122j53489j72811j29375
8884C74687q3849m8460k4026J5473O380N131q005P958P293R309q9K134n844J8086
8870B76178K8203J8992q796j1135j3192j6976m538K1446K7357J5629O360P867
8858C47395J1512J1658J0425J3322L827K6972K0468K2959M278r437Q909j574j2977
8845D57737J449Q011K9693K7226J5782K0450J2649j626J0750Q832J6482Q723n814
$$ plain form
8832 610344 597073 608416 631590 662123 696042 723475 751606 775881 822972 878080 927747 966271
8820 966271 991834 1004073 1021099 1052693 1086875 1141029 1186854 1252893 1320594 1398256 1465127 1510669
8808 1510669 1552145 1617006 1691407 1777972 1873918 1980501 2089613 2188463 2290500 2387425 2498282
8797 2498282 2633580 2784703 2963902 3155163 3354868 3574035 3816214 4093569 4419091 4816947
8787 4816947 5300397 5831836 6397543 7014981 7689478 8460276 9415778 10600864 12077946
8778 12077946 13921993 16207668 19045106 22495265 26480293 30748268 35337859 40647554
8770 40647554 47482043 57108308 71245411 92537140 125053229 174692873 248178964
8763 248178964 345388292 437808864 463124423 401599068 306494884 222994846 162584031
$$ packed form
8832F10344j3271J1343K3174L0533L3919K7433K8131K4275M7091N5108M9667L8524
8820I66271K5563J2239J7026L1594L4182N4154M5825O6039O7701P7662O6871M5542
8808A510669M1476O4861P4401Q6565R5946J06583J09112R8850J02037R6925J10857
8797B498282J35298J51123J79199J91261J99705K19167K42179K77355L25522L97856
8787D816947M83450N31439N65707O17438O74497P70798R55502J185086J477082
8778A2077946J844047K285675K837438L450159L985028M267975M589591N309695
8770D0647554O834489R626265J4137103K1291729L2516089M9639644P3486091
8763B48178964R7209328R2420572K5315559o1525355r5104184q3500038o0410815
$$ plain form
8756 162584031 121476773 93571468 74317240 60864398 51391640 44546263 39241966
8749 39241966 34880006 31306246 28200021 25179229 22293172 19717926 17509070 15623403
8741 15623403 14002150 12584608 11371503 10371291 9565446 8900695 8291439 7716774 7163029
8732 7163029 6645859 6170713 5698882 5241635 4859026 4547620 4253080 3992765 3751477 3510831
8722 3510831 3287024 3077984 2893043 2762568 2653690 2549738 2434474 2317470 2191450 2086862
8712 2086862 1999893 1934246 1853188 1791824 1737876 1671007 1615116 1544220 1478786 1422155 1368839
8701 1368839 1334429 1288215 1256876 1219725 1188583 1161816 1148339 1136586 1117601 1095583 1066385
8690 1066385 1029553 980165 921648 889982 884444 866150 837199 810965 782968 759250 734723 735259
$$ packed form
8756A62584031m1107258k7905305j9254228j3452842r472758o845377n304297
8749C9241966m361960l573760l106225l020792k886057k575246k208856j885667
8741A5623403j621253j417542j213105j000212q05845o64751o09256n74665n53745
8732G163029n17170m75146m71831m57247l82609l11406k94540k60315k41288k40646
8722C510831k23807k09040j84941j30475j08878j03952j15264j17004j26020j04588
8712B086862q6969o5647q1058o1364n3948o6869n5891p0896o5434n6631n3316
8701A368839l4410m6214l1339l7151l1142k6767j3477j1753j8985k2018k9198
8690A066385l6832m9388n8517l1666n538j8294k8951k6234k7997k3718k4527N36
$$ plain form
8678 735259 720460 696737 671140 641102 619241 599099 606675 616275 619141 626630 618308 595953 588507
8665 588507 584295 578121 572748 567520 568453 562383 553428 549568 566166 554415 545367 546669 540662 535284
8651 535284 534191 527322 510227 501397 506745 518599 521742 526230 542080 555239 556999 565267 568738
8638 568738 551522 497529 413798 336942 299670 361994 544670 734811 831995 963466 1101460
8627 1101460 1002870 770631 573018 430483 377849 346172 320576 305861 308929 298751 300045
8616 300045 317857 323461 330611 352512 391482 421284 443689 436610 418651 398740 387392 425219
8604 425219 506134 576450 553096 477474 419307 371372 328669 317960 312760 296210 267209 271073
8592 271073 293633 331555 390044 508722 696660 916204 892191 688603 518400 410257
$$ packed form
8678G35259j4799k3723k5597l0038k1861k0142P576R600K866P489q322k2355p446
8665E88507m212o174n373n228R33o070q955l860J6598j1751r048J302o007n378
8651E35284j093o869j7095q830N348J1854L143M488J5850J3159J760Q268L471
8638E68738j7216n3993q3731p6856l7272O2324J82676J90141R7184J31471J37994
8627A101460r8590k32239j97613j42535n2634l1677k5596j4715L068j0178J294
8616C00045J7812N604P150K1901L8970K9802K2405p079j7959j9911j1348L7827
8604D25219Q0915P0316k3354p5622n8167m7935m2703j0709n200j6550k9001L864
8592B71073K2560L7922N8489J18678J87938K19544k4013k03588j70203j08143
$$ plain form
8582 410257 324888 235897 199142 196884 188339 163215 144835 139067 141251 151503 162611 168900 175430
8569 175430 183437 191382 198807 195813 215741 220816 223414 245371 258673 256100 235213 211562 192534
8556 192534 189904 197189 200937 201293 207010 184248 169714 159405 150073 148648 171504 217916 301086
8543 301086 414474 455570 365926 259776 201490 165071 148554 141955 163392 163368 159635 177383
8531 177383 191350 214198 247819 287259 295056 255491 213758 182694 175185 165426 151910 144754
8519 144754 126434 104166 104388 92894 99578 105316 119321 132422 119931 111007 117875 120929 118851
8506 118851 120697 116905 116658 116656 107392 108279 111144 109893 107428 103440 107572 129050 147853 131275 113335
8491 113335 107702 92368 92237 97188 91369 88865 95117 84980 71400 63898 65770 81953 92111
$$ packed form
8582D10257q5369q8991l6755k258q545k5124j8380n768K184J0252J1108O289O530
8569A75430Q007P945P425k994J9928N075K598K1957J3302k573k0887k3651j9028
8556A92534k630P285L748L56N717k2762j4534j0309r332j425K2856M6412Q3170
8543C01086J13388M1096q9644j06150n8286l6419j6517o599K1437k4l733J7748
8531A77383J3967K2848L3621L9440P797l9565m1733l1064p509r759j3516p156
8519A44754j8320k2268K22j1494O684N738J4005J3101j2491q924O868L054k078
8506A18851J846l792k47kr264Q87K865j251k465l988M132K1478J8803j6578j7940
8491A13335n633j5334j31M951n819k504O252j0137j3580p502J872J6183J0158
$$ plain form
8478 92111 87594 66803 62671 54383 72277 77660 70940 51927 44284 42758 38210 33241 24273 20558
8464 20558 2531 -6646 -655 -9664 -32690 -56633 -56137 -42023 -23240 -20868 -6837 9584 6493
8451 6493 13230 43854 67339 74455 72834 60509 68371 75593 64676 58181 46533 47680 49501 58780
8437 58780 66340 84664 79334 57120 40117 36677 40443 47252 50454 64669 71173 71661 69880 68640
8423 68640 67636 67303 61614 56304 52886 50452 41864 40479 34472 23793 18742 -7086 -2614 19891
8409 19891 28327 50231 52697 42102 42857 42977 54224 41637 26753 27848 35953 38493 40352 52320
8395 52320 68074 60409 61525 76453 85907 90423 88129 80934 76953 77920 71598 63042 75465 102419
8381 102419 113806 102111 96145 100745 118263 132550 151211 151710 165826 180708 204784 228865
$$ packed form
8478I2111m517k0791m132q288J7894N383o720j9013p643j526m548m969q968l715
8464B0558j8027r177N991r009k3026k3943M96J4114J8783K372J4031J6421l091
8451F493O737L0624K3485P116j621j2325P862P222j0917o495j1648J147J821R279
8437E8780P560J8324n330k2214j7003l440L766O809L202J4215O504M88j781j240
8423F8640j004l33n689n310l418k434q588j385o007j0679n051k5828M472K2505
8409A9891Q436K1904K466j0595P55J20J1247j2587j4884J095Q105K540J859J1968
8395E2320J5754p665J116J4928R454M516k294p195l981R67o322q556J2423K6954
8381A02419J1387j1695n966M600J7518J4287J8661M99J4116J4882K4076K4081
$$ plain form
8369 228865 260450 300852 376808 450602 543557 691021 867118 1044885 1211143 1367777 1489554
8358 1489554 1547591 1528018 1451275 1314804 1144185 964113 811742 667394 551789 455248
8348 455248 380415 326148 282555 241463 214668 170248 137408 117605 110815 112307 102781 90812
8336 90812 100301 93557 73886 71237 82594 84556 84554 85485 79582 75980 74868 56549 50688 53695 35795
8321 35795 23489 32355 38397 51904 51402 36638 19838 22702 31022 39096 45822 36005 33627 44252
8307 44252 51721 50747 35684 30793 33782 56091 70433 75695 91901 88085 67495 55758 54989 45984
8293 45984 30208 31704 29917 22462 16165 16610 2984 -2189 1484 5384 8626 13784 18360 5299
8279 5299 -4694 -15873 -355 19589 15704 10211 18461 34814 49351 53306 38112 31410 29070
$$ packed form
8369B28865L1585M0402P5956P3794R2955J47464J76097J77767J66258J56634J21777
8358A489554N8037j9573p6743j36471j70619j80072j52371j44348j15605r6541
8348D55248p4833n4267m3593m1092k6795m4420l2840j9803o790J492r526j1969
8336I0812R489o744j9671k649J1357J962kR31n903l602j112j8319n861L007j7900
8321C5795j2306Q866O042J3507n02j4764j6800K864Q320Q074O726r817k378J0625
8307D4252P469r74j5063m891K989K2309J4342N262J6206l816k0590j1737p69r005
8293D5984j5776J496j787p455o297M45j3626n173L673L900L242N158M576j3061
8279E299r993j1179J5518J9944l885n493Q250J6353J4537L955j5194o702k340
$$ plain form
8266 29070 11141 15382 7116 6186 13888 17712 17715 8846 7876 12055 13894 21274 40093 43121 48523
8251 48523 58142 43158 31586 28342 16339 7111 12003 13535 32512 41982 32896 19959 13147
8238 13147 22398 26113 34805 26017 20434 15903 538 -3893 -5132 -18150 -26267 -17600 -3912 -5308
8224 -5308 2467 10584 16110 6983 392 14177 23486 16821 10087 -2197 2763 17550 12378 10366
8210 10366 13953 8759 -375 198 8823 13412 5442 -6255 14 -2876 -12898 -15966 1948 4741
8196 4741 8085 9790 9888 11793 -777 -18186 -22631 -30893 -31312 -14497 -818 8002 2432 9962 23318
8181 23318 12072 -4870 -3046 -7489 -7442 -3038 -2221 -706 326 -6402 -14508 -12012 -18711 -4515 -2572
8166 -2572 -15151 -9779 -6621 1276 17225 13325 15252 22824 23344 6220 4762 14603 17418 24587
$$ packed form
8266B9070j7929M241q266r30P702L824Lq869r70M179J839P380J8819L028N402
8251D8523R619j4984j1572l244j2003r228M892J532J8977R470r086j2937o812
8238A3147R251L715Q692q788n583m531j5365m431j239j3018q117Q667J3688j396
8224e308P775Q117N526r127o591J3785R309o665o734j2284M960J4787n172k012
8210A0366L587n194r134N73Q625M589p970j1697O269k890j0022l068J7914K793
8196D741L344J705R8J905j2570j7409m445q262m19J6815J3679Q820n570P530J3356
8181B3318j1246j6942J824m443M7M404Q17J515J032o728q106K496o699J4196J943
8166b572j2579N372L158P897J5949l900J927P572N20j7124j458R841K815P169
$$ plain form
8152 24587 26550 20086 12058 19737 24803 24586 18638 17607 21420 26949 9005 26686 16498 326
8138 326 -1728 -5403 2767 19576 3157 -2154 4718 5134 -4571 -6374 -8074 -5007 -1849 4551 472
8123 472 16010 20649 9653 -6378 -14499 -11193 -274 -1138 13795 26589 34528 26881 14111 21940
8109 21940 33668 45057 32733 22588 33153 48332 43139 25309 14983 14922 21434 19117 27136
8096 27136 14059 7233 23847 24167 13943 -10 346 8468 12213 9657 22836 15745 5448 2905
8082 2905 8686 7071 -3901 -6889 -8429 6395 8103 12234 11236 16234 22820 5256 4972 11544 10202
8067 10202 20464 14332 -1904 -7835 19290 25307 13681 4526 9980 6813 -9374 -15620 -7541
8054 -7541 1209 10458 6273 2786 -490 6991 9867 13817 -1563 -15558 -13282 -10023 -11310 -2575
$$ packed form
8152B4587J963o464q028P679N066k17n948j031L813N529j7944J7681j0188j6172
8138C26k054l675Q170J6809j6419n311O872M16r705j803j700L067L158O400m079
8123D72J5538M639j0996j6031q121L306J0919q64J4933J2794P939p647j2770P829
8109B1940J1728J1389j2324j0145J0565J5179n193j7830j0326o1O512k317Q019
8096B7136j3077o826J6614L20j0224j3953L56Q122L745k556J3179p091j0297k543
8082B905N781j615j0972k988j540J4824J708M131r98M998O586j7564k84O572j342
8067A0202J0262o132j6236n931K7125O017j1626r155N454l167j6187o246Q079
8054g541Q750R249m185l487l276P481K876L950j5380j3995K276L259j287Q735
$$ plain form
8040 -2575 672 9311 23733 12146 4610 19548 21719 16746 3187 -1810 -180 4329 14080 12742
8026 12742 5754 8055 5923 5404 10430 32329 36851 28399 17481 -3070 -1560 5565 1019 100
8012 100 589 391 16207 27047 25513 35215 27255 21399 28829 26827 18318 6215 3367 7633 17704
7997 17704 12664 4749 10285 20143 13284 6600 4639 11008 4934 11777 5098 11914 24441 16802
7983 16802 10055 16428 25884 32359 40977 37428 33302 41299 33453 22756 19435 28350 17918 13998
7969 13998 18692 27414 21436 25622 29371 6377 15511 10702 -6286 8195 15476 10225 2545 -7003
7955 -7003 2185 -5458 -13556 -10626 -8796 -7141 12610 19933 18344 10048 11739 8751 -2762 -2880 -1333
7940 -1333 -3155 742 14447 20918 27768 41461 25805 5815 -3071 -5307 -9707 19024 20586 1320
$$ packed form
8040b575L247Q639J4422j1587p536J4938K171m973j3559m997J630M509R751j338
8026A2742o988K301k132n19N026K1899M522q452j0918k0551J510P125m546r19
8012A00M89j98J5816J0840j534R702p960n856P430k002q509j2103k848M266J0071
7997A7704n040p915N536R858o859o684j961O369o074O843o679O816J2527p639
7983A6802o747O373R456O475Q618l549m126P997p846j0697l321Q915j0432l920
7969A3998M694Q722n978M186L749k2994R134m809j6988J4481P281n251p680r548
7955g003R188p643q098K930J830J655J9751P323j589q296J691k988j1513j18J547
7940a333j822L897J3705O471O850J3693j5656j9990q886k236m400K8731J562j9266
$$ plain form
7926 1320 -4883 -5941 -6853 -4497 -3588 1200 13364 25105 22342 24494 36356 34286 27509 28258 36076
7911 36076 34293 21561 13179 17303 16792 16471 17694 32294 27574 32370 27303 19978 22957 25356 17747
7896 17747 24559 35962 42242 40762 24869 25778 22000 20544 21060 -5477 -11048 -4434 -17627 -20664
7882 -20664 -11141 6207 8781 10193 15566 12644 7469 2861 9968 3707 7402 -3728 -4015 -2959
7868 -2959 -14500 -15816 7351 17024 19257 5730 -9191 8448 9539 5196 3411 4922 6348 10106
7854 10106 488 6002 13201 16771 10240 4496 17804 23445 19773 26574 23377 19005 21788 23034
7840 23034 31482 26951 25304 20232 301 -1018 1759 10275 5229 4162 1497 11308 2797 13434
7826 13434 21925 13643 10760 27281 26969 18865 16677 8083 6935 23050 20685 17388 33486 24479
$$ packed form
7926A320o203j058r12K356R09M788J2164J1741k763K152J1862k070o777P49P818
7911C6076j783j2732q382M124n11l21J223J4600m720M796n067p325K979K399p609
7896A7747O812J1403O280j480j5893R09l778j456N16k6537n571O614j3193l037
7882b0664R523J7348K574J412N373k922n175m608P107o261L695j1130k87J056
7868b959j1541j316K3167R673K233j3527j4921J7639J091m343j785J511J426L758
7854A0106r618N514P199L570o531n744J3308N641l672O801l197m372K783J246
7840B3034Q448m531j647n072j9931j319K777Q516n046j067k665R811q511J0637
7826A3434Q491q282k883J6521l12q104k188q594j148J6115k365l297J6098r007
$$ plain form
7812 24479 30010 40791 42462 27838 23152 15894 19222 9722 13687 16471 16546 15112 3261 -2235
7798 -2235 4970 14227 12247 13004 14470 3111 24080 26939 10428 262 2316 -6856 -5494 5076
7784 5076 15320 2412 2049 3714 9772 13081 12335 7104 13564 15766 15804 13560 8898 -7105 -12244
7769 -12244 -19751 -20304 3454 12977 1455 2657 -13862 -6022 -9357 -10948 -7634 -12890 -15156 -6575
7755 -6575 -6083 2412 13112 9097 -3997 601 3001 7153 13563 10396 13871 14633 22554 13656 -2400
7740 -2400 -3434 -9571 -9750 618 13774 5478 -3072 7346 9584 9291 9052 4054 -13161 -8703 -3847
7725 -3847 -16303 -16079 -7760 -7643 -6606 6770 5357 8882 2616 -11471 -6323 -23197 -30067 -25724
7711 -25724 -11378 297 -1450 8329 5345 3866 1306 -8025 -8597 -6462 -13018 -2962 5099 5702
$$ packed form
7812B4479N531J0781J671j4624m686p258L328r500L965K784P5j434j1851n496
7798b235P205R257j980P57J466j1359K0969K859j6511j0166K054r172J362J0570
7784E076J0244j2908l63J665O058L309p46n231O460K202L8k244m662j6003n139
7769a2244p507n53K3758R523j1522J202j6519P840l335j591L314n256k266Q581
7755f575M92Q495J0700m015j3094M598K400M152O410l167L475P62P921q898j6056
7740b400j034o137j79J0368J3156q296q550J0418K238k93k39m998j7215M458M856
7725c847j2456K24Q319J17J037J3376j413L525o266j4087N148j6874o870M343
7711b5724J4346J1675j747R779k984j479k560r331n72K135o556J0056Q061O03
$$ plain form
7697 5702 13106 24662 28004 18186 -2871 -16563 -27964 -26929 -12826 -4383 -10406 813 6511
7684 6511 482 -16487 -20948 -15651 -4022 6704 -1690 -3355 -663 6698 43 -2173 -14535 -4133
7670 -4133 10481 13053 8088 3457 14992 13479 9004 9058 7939 6122 6775 2838 -2596 -9077 -14972
7655 -14972 -5466 -39 5373 -8215 -19105 -33005 -38320 -31819 -26202 -19163 -10686 -106 4115 -13068
7641 -13068 -22701 -10668 1978 -2609 -11686 -521 -844 -13420 -19287 3753 10671 10056 9611 3706
7627 3706 -6657 -17839 -26941 -17543 -6613 -7260 -1255 9385 -1656 -506 -4167 -7429 479 -3149
7613 -3149 9156 9393 22395 21224 4440 -14844 -5489 -1416 -2639 10774 23430 20851 17633 2851
7599 2851 -2845 -3296 4185 -7294 -4668 13790 18947 16381 3309 -8489 -11237 -988 6821 -767
$$ packed form
7697E702P404J1556L342r818k1057j3692j1401J035J4103Q443o023J1219N698
7684F511o029j6969m461N297J1629J0726q394j665K692P361o655k216j2362J0402
7670d133J4614K572m965m631J1535j513m475N4j119j817O53l937n434o481n895
7655a4972R506N427N412j3588j0890j3900n315O501N617P039Q477J0580M221j7183
7641a3068r633J2033J2646m587r077J1165l23j2576n867K3040O918o15m45n905
7627C706j0363j1182r102R398J0930o47O005J0640j1041J150l661l262P908l628
7613c149J2305K37J3002j171j6784j9284R355M073j223J3413J2656k579l218j4782
7599B851n696m51P481j1479K626J8458N157k566j3072j1798k748J0249P809p588
$$ plain form
7585 -767 -20127 -16261 -8217 77 11028 17480 27761 33272 12758 2434 -4448 5952 8478 9225
7571 9225 9822 -1551 -1607 9268 17987 18625 6266 8041 7181 12391 5510 10176 12379 21775 6759
7556 6759 9519 7119 11436 9635 15183 29175 19217 4859 8897 20480 24232 1964 -9590 -8765
7542 -8765 6966 2610 -7698 -991 -15963 -20158 -14373 1712 12885 3585 -5906 -2875 -532 9204
7528 9204 17747 19453 18706 20806 20554 10880 13412 7300 -2140 -15119 -29334 -32626 -23764 -13659 -7609
7513 -7609 3537 10335 10149 17910 23371 14346 13847 8913 -11850 -9798 -6668 -12827 -27674 -23689 -18759
7498 -18759 -22151 -20468 -11138 -6296 -19966 -19580 -5640 -15055 -17709 -15386 -16988 -20817 -3452 6765
7484 6765 23001 15381 8731 790 7112 9340 1596 7495 8428 9536 11352 15478 10477 7527 6259
$$ packed form
7585g67j9360L866Q044Q294J0951O452J0281N511k0514j0324o882J0400K526P47
7571I225N97j1373n6J0875Q719O38j2359J775q60N210o881M666K203R396j5016
7556F759K760k400M317j801N548J3992r958j4358M038J1583L752k2268j1554Q25
7542h765J5731m356j0308O707j4972m195N785J6085J1173r300r491L031K343R736
7528I204Q543J706p47K100k52r674K532o112r440j2979j4215l292Q862J0105O050
7513g609J1146O798j86P761N461r025m99m934k0763K052L130o159j4847L985M930
7498a8759l392J683R330M842j3670L86J3940r415k654K323j602l829J7365J0217
7484F765J6236p620o650p941O322K228p744N899R33J108J816M126n001k950j268
$$ plain form
7469 6259 3208 6120 -1948 -15168 -12831 -5493 -9781 -4389 941 -1669 1342 -12376 -28758 -24689
7455 -24689 -14692 -14549 -6374 9778 8280 2251 -2052 -4011 -8214 -10422 -621 9973 20386 24306
7441 24306 1693 -641 9211 1635 -4091 -5111 1468 -820 2195 -7441 -14242 49 -2083 -8823
7427 -8823 -12933 -21058 -30008 -18821 -21157 -28957 -33452 -8636 -6793 -13555 -4901 -9198 -17733 -15667
7413 -15667 -17269 -25726 -21989 -15798 -3972 6994 11451 -2875 -15879 -6726 -5153 -14361 -20619 -22481
7399 -22481 -7421 7943 5080 -2886 -7900 5263 28553 1412 -5488 3137 590 -6026 -4610
7386 -4610 -5900 -24292 -11930 -59 5253 1205 4683 6002 8003 7950 -9600 -12661 -12300 -16576 -5846
7371 -5846 -4690 -19411 -21816 -21651 -22285 -22928 -23885 -2059 13136 6888 398 -971 -8330 -17999 -10516
$$ packed form
7469F259l051K912q068j3220K337P338m288N392N330k610L011j3718j6382M069
7455b4689R997J43Q175J6152j498o029m303j959m203k208R801J0594J0413L920
7441B4306k2613k334R852p576n726j020O579k288L015r636o801J4291k132o740
7427h823m110q125q950J1187k336p800m495K4816J843o762Q654m297q535K066
7413a5667j602q457L737O191J1826J0966M457j4326j3004R153J573r208o258j862
7399b2481J5060J5364k863p966n014J3163K3290k7141o900Q625k547o616J416
7386d610j290j8392J2362J1871N312m048L478J319K001n3j7550l061L61m276J0730
7371e846J156j4721k405J65o34o43r57K1826J5195o248o490j369p359r669P483
$$ plain form
7356 -10516 -1815 -5077 -10920 -4923 1059 3483 -4460 -18213 -14874 -1560 3748 9793 8720 8808 4934
7341 4934 4973 -450 12780 22253 24870 17941 14856 17572 8749 3652 -2792 -6202 1324 -4181 4311
7326 4311 7482 14749 12676 8405 9134 9718 6853 -2490 1661 13617 5360 1510 4876 5853 18013
7311 18013 13410 2625 -8558 -18025 -24399 -1916 1788 -5387 339 3322 -4408 1326 8733 14614
7297 14614 16471 11722 17119 10637 25443 21211 24186 28373 14305 -3253 9716 16201 11939 9191
7283 9191 -2508 -18746 -24649 -18242 1404 9756 11640 18216 15915 11322 -351 -5573 -2800 1464
7269 1464 18270 29378 22319 24679 26250 19486 20073 10696 4450 14857 8142 517 -3732 2998
7255 2998 10981 10708 11671 -7061 -21874 3441 -5812 -15347 -20789 -16019 -24989 -31811 -26217 -27030 -29635
$$ packed form
7356a0516Q701l262n843N997N982K424p943j3753L339J3314N308O045j073Q8l874
7341D934L9n423J3230R473K617o929l085K716q823n097o444l410P526n505Q492
7326D311L171P267k073m271P29N84k865r343M151J1956q257l850L366R77J2160
7311A8013m603j0785j1183r467o374K2483L704p175N726K983p730N734P407N881
7297A4614J857m749N397o482J4806m232K975M187j4068j7558J2969O485m262k748
7283I191j1699j6238n903O407J9646Q352J884O576k301m593j1673n222K773M264
7269A464J6806J1108p059K360J571o764N87r377o246J0407o715p625m249O730
7255B998P983k73R63j8732j4813K5315r253r535n442M770q970o822N594q13k605
$$ plain form
7240 -29635 -30501 -25370 -17791 -17169 -8946 -2142 -9057 -968 23624 22402 21922 20484 3614 6064 2513
7225 2513 1648 8739 -6073 -6482 17602 17554 -1910 -3441 -6038 -15665 -13422 -6384 -8256 -4137 -5894
7210 -5894 -9084 -5381 -97 5845 10383 3282 -2206 -7294 -6774 -1739 10910 18600 12467 13508 4944
7195 4944 5282 17136 11312 5699 -5689 -6783 -11729 -15063 -8518 -5960 -8148 -18528 -36441 -44390
7181 -44390 -53715 -52379 -32796 -23653 -11061 5960 18330 6295 -4250 -9818 -12340 -6181 -6929
7168 -6929 -6356 1006 6213 15433 6744 15990 21661 19449 19224 11378 -4349 -14189 -25352 -39608 -26899
7153 -26899 -2244 8464 4563 8051 14364 -168 2756 13991 13601 20322 3623 -9602 2707
7140 2707 4088 -5601 2289 18134 21643 16773 8962 875 6154 2167 -15442 -19952 -17041 -17814 -16293
$$ packed form
7240b9635q66N131P579O22Q223O804o915Q089K4592j222m80j438j6870K450l551
7225B513q65P091j4812m09K4084m8j9464j531k597r627K243P038j872M119j757
7210e894l190L703N284N942M538p101n488n088N20N035J2649P690o133J041q564
7195D944L38J1854n824n613j1388j094m946l334O545K558k188j0380j7913p949
7181d4390r325J336J9583R143J2592J7021J2370j2035j0545n568k522O159p48
7168f929N73P362N207R220q689R246N671k212k25p846j5727r840j1163j4256J2709
7153b6899K4655J0708l901L488O313j4532K924J1235l90O721j6699j3225J2309
7140B707J381r689P890J5845L509m870p811q087N279l987j7609m510K911p73J521
$$ plain form
7125 -16293 -12364 -11265 3065 23233 22650 18558 12816 14820 28508 20261 23826 19345 -482 878
7111 878 1629 6358 -8807 -13799 -1711 6553 5110 3294 -7407 -17156 -681 13037 14344 19515
7097 19515 25251 18440 15468 10894 11622 331 -6014 -413 8612 23847 24771 16170 10692 -5530
7083 -5530 -9196 -16315 -9024 -6115 -11909 -23574 -29938 -32312 -31057 -19559 -13588 -8552 -14464 -17313
7069 -17313 -13646 -3004 -1016 -5576 -11038 -11061 8301 8772 -8312 -11201 1202 -3474 -7080 -4047
7055 -4047 -7908 -6087 -20198 -12640 4676 18616 30894 29201 27333 9099 13902 10720 3873 17101
7041 17101 18472 10099 12279 11871 11223 10583 6776 -764 -8465 -12857 -2514 12945 25239 30151 16929
7026 16929 -3006 3654 7845 5361 5831 -2852 -10155 -5992 -4955 -1079 937 309 -9372 -12334 -14889
$$ packed form
7125a6293L929J099J4330K0168n83m092n742K004J3688q247L565m481j9827J360
7111H78P51M729j5165m992J2088Q264j443j816j0701r749J6475J3718J307N171
7097A9515N736o811k972m574P28j1291o345N601R025J5235R24q601n478j6222
7083e530l666p119P291K909n794j1665o364k374J255J1498N971N036n912k849
7069a7313L667J0642J988m560n462k3J9362M71j7084k889J2403m676l606L033
7055d047l861J821j4111P558J7316J3940J2278j693j868j8234M803l182o847J3228
7041A7101J371q373K180m08o48o40l807p540p701m392J0343J5459J2294M912j3222
7026A6929j9935O660M191k484M70q683p303M163J037L876K016o28r681k962k555
$$ plain form
7011 -14889 -12755 -306 -1670 -21266 -22099 -13811 1745 15652 6245 -4342 -19684 -22001 -15219
6998 -15219 4677 19845 24553 19993 11503 2798 8553 -2117 -4537 -5699 -11503 -16447 -19712 -26476
6984 -26476 -23428 -8017 -13476 -16687 -16200 -14544 -7946 -6563 11436 4375 7699 11206 16614 21938
6970 21938 6307 -5800 -70 13667 15825 15957 13855 24743 28457 18116 12172 -9180 -8489 1153
6956 1153 -1615 -2191 -9306 -5942 -10275 -16326 -11973 -9649 -5369 -5996 -15676 -5641 8627 3560 -555
6941 -555 8384 2679 -5160 8150 7390 4776 -3755 -1072 22279 23716 4782 -3584 -8651 -18514 -15392
6926 -15392 -23180 -18067 -5969 -12631 -1608 -1355 -14524 -24522 -18234 5751 -2117 -3997 8563 4906
6912 4906 6380 17838 20084 18693 -5546 -27664 -34087 -48654 -45687 -37072 -28343 -6282 1626 836
$$ packed form
7011a4889K134J2449j364j9596q33Q288J5556J3907r407j0587j5342k317O782
6998a5219J9896J5168M708m560q490q705N755j0670k420j162n804m944l265o764
6984b6476L048J5411n459l211M87J656O598J383J7999p061L324L507N408N324
6970B1938j5631j2107N730J3737K158J32k102J0888L714j0341n944k1352O91R642
6956A153k768n76p115L364m333o051M353K324M280o27r680J0035J4268n067m115
6941e55Q939n705p839J3310p60k614q531K683K3351J437j8934q366n067r863L122
6926a5392p788N113J2098o662J1023K53j3169r998O288K3985p868j880J2560l657
6912D906J474J1458K246j391k4239k2118o423j4567K967Q615Q729K2061P908p90
$$ plain form
6898 836 14128 15065 2357 -1593 -6127 -12026 -4047 -2260 11034 2683 -12605 -14833 -4508 11118
6884 11118 6643 17267 10108 -2271 -1149 -825 -6132 -7462 -421 -5833 5742 10971 -5506 -3072
6870 -3072 3342 12452 26573 12067 -751 -14956 -16115 -4363 -2914 -7490 -25814 -26150 -24047 -21099
6856 -21099 -8378 436 2576 8639 8451 1117 -8749 1977 7337 1772 17479 30890 21221 11437
6842 11437 17576 15803 17855 6262 5539 4489 17997 15529 11712 22358 32793 18622 13821 8514
6828 8514 3466 7746 10902 -2375 -10986 -9309 -1366 -560 -9191 -11390 -9350 -14898 -13791 -13107 -18019
6813 -18019 -3253 -5726 3529 14264 7297 -1339 -15754 -26294 -17421 -4157 -10913 -1278 -4135
6800 -4135 -12045 17532 25837 14165 -1358 3200 7996 22923 27369 35937 30599 29737 27235 25021
$$ packed form
6898H36J3292R37j2708l950m534n899P979J787J3294q351j5288k228J0325J5626
6884A1118m475J0624p159j2379J122L24n307j330P041n412J1575N229j6477K434
6870c072O414R110J4121j4506j2818j4205j159J1752J449m576j8324l36K103K948
6856b1099J2721Q814K140O063j88p334r866J0726N360n565J5707J3411r669r784
6842A1437O139j773K052j1593p23j050J3508k468l817J0646J0435j4171m801n307
6828H514n048M280L156j3277q611J677P943Q06q631k199K040n548J107O84m912
6813a8019J4766k473R255J0735o967q636j4415j0540Q873J3264o756R635k857
6800d135p910K9577Q305j1672j5523M558M796J4927M446Q568n338q62k502k214
$$ plain form
6786 25021 16051 17726 10977 11390 -2365 -14828 -8269 -7002 -5374 -7526 -8221 -2860 7004 20490
6772 20490 18500 3379 4910 2757 -10987 -846 6578 1620 5522 8162 -13227 -26127 -18115
6759 -18115 -9260 5640 14418 18569 14486 10384 8331 -228 -7805 -12038 12321 36789 26452 2987
6745 2987 2370 8444 24982 41853 42879 42091 47072 80342 121860 176347 251842 353681 520475
6732 520475 727723 802923 647990 459128 300851 201274 129472 91137 70532 57130 39880
6721 39880 35676 41104 44841 38419 8611 -1781 4685 22265 13703 18022 22997 28434 31249 28398
6707 28398 33802 24550 16949 2995 -1048 -8673 -19154 -3699 14025 10071 9148 7529 9521 20029
6693 20029 18413 26905 20810 29225 26983 34176 38657 31789 23622 14077 -4118 -15423 -13853 -9567
$$ packed form
6786B5021q970J675o749M13j3755j2463O559J267J628k152o95N361R864J3486
6772B0490j990j5121J531k153j3744J0141P424m958L902K640k1389j2900Q012
6759a8115Q855J4900Q778M151m083m102k053q559p577m233K4359K4468j0337k3465
6745B987o17O074J6538J6871J026p88M981L3270M1518N4487P5495J01839J66794
6732E20475K07248P5200j54933j88862j58277r9577p1802l8335k0605j3402j7250
6721C9880m204N428L737o422k9808j0392O466J7580q562M319M975N437K815k851
6707B8398N404r252p601j3954m043p625j0481J5455J7724l954r23j619J992J0508
6693B0029j616Q492o095Q415k242P193M481o868q167r545j8195j1305J570M286
$$ plain form
6679 -9567 3802 13845 14730 7676 -7319 -5137 2530 2956 3538 1363 -399 -507 -6103 -6118 5109
6664 5109 10568 14940 12682 -4586 -19242 -22297 -10391 -3902 -11317 -14600 -6599 3499 -3084 -5135
6650 -5135 -8124 -4015 612 -7220 -5203 -658 81 -135 -6605 -15917 -36339 -31655 -24696 -8747 363
6635 363 9366 -7597 -16841 -7764 -1411 13163 15423 26416 33992 26453 20262 -1274 1402 19907
6621 19907 15840 14881 -545 -2437 -11324 -19607 -23533 -29256 -23940 -8389 -2047 -3184 -2261 -1975 3595
6606 3595 9355 -8420 -16793 -11293 -14401 -12443 -11946 -9906 -9894 699 10858 28083 41724 38917
6592 38917 29157 17783 5878 -10208 -23751 -16880 -23399 -33714 -29557 -30259 -45855 -49420 -40857
6579 -40857 -30421 -37272 -28595 -18711 -6028 19771 23925 24535 36282 39026 31768 21165 17228 8001
$$ packed form
6679i567J3369J0043Q85p054j4995K182P667M26N82k175j762j08n596j5J1227
6664E109N459M372k258j7268j4656l055J1906O489p415l283Q001J0098o583k051
6650e135k989M109M627p832K017M545P39k16o470r312k0422M684O959J5949R110
6635C63R003j6963r244R077O353J4574K260J0993P576p539o191k1536K676J8505
6621A9907m067r59j5426j892q887q283l926n723N316J5551O342j137R23K86N570
6606C595N760j7775q373N500l108J958M97K040J2J0593J0159J7225J3641k807
6592C8917r760j1374j1905j6086j3543O871o519j0315M157p02j5596l565Q563
6579d0857J0436o851Q677R884J2683K5799M154O10J1747K744p258j0603l937r227
$$ plain form
6565 8001 10016 4670 1982 -334 6617 12034 17076 17297 13573 12171 1515 -12525 -14792 -27679
6551 -27679 -38130 -22106 -10002 -954 13778 7631 14055 15261 18741 15280 665 -17381 -19648
6538 -19648 -20319 -17713 -9519 -2156 9771 3182 8764 15486 7028 -12335 -7617 2136 -8721 -10056
6524 -10056 -11516 -7553 -13380 -3701 16642 18677 11667 1337 4523 -3160 -9818 -11251 5211 10067
6510 10067 -520 5030 11148 13061 5848 -7950 -12830 -9453 -9044 -8818 -5066 3932 1222 -838 2881
6495 2881 9982 1184 -15743 -22714 -21127 -13228 -13338 1705 9462 3212 8762 -1497 -15840 -12457
6481 -12457 -13411 -19740 -14067 -11436 -6646 -1067 1974 15976 20747 9835 13895 30387 32664 19323
6467 19323 5052 1678 7383 14656 11250 15060 7936 -17097 -20735 -2897 -2861 -21335 -33199 -27176
$$ packed form
6565H001K015n346k688k316O951N417N042K21l724j402j0656j4040k267j2887
6551b7679j0451J6024J2104R048J4732o147O424J206L480l461j4615j8046k267
6538a9648o71K606Q194P363J1927o589N582O722q458j9363M718R753j0857j335
6524a0056j460L963n827R679K0343K035p010j0330L186p683o658j433J6462M856
6510A0067j0587N550O118J913p213j3798m880L377M09K26L752Q998k710k060L719
6495B881P101q798j6927o971J587P899j10J5043P757o250N550j0259j4343L383
6481a2457r54o329N673K631M790N579L041J4002M771j0912M060J6492K277j3341
6467A9323j4271l374N705P273l406L810p124k5033l638J7838L6j8474j1864O023
$$ plain form
6453 -27176 -27247 -15574 -15745 -2715 10769 14426 11922 13611 22268 16900 10605 8549 10178 -1006
6439 -1006 -3281 6370 15560 13815 -377 12337 18199 22076 31505 19588 20258 14671 10026 6128
6425 6128 6692 12166 15518 6283 -216 4315 5604 18505 30178 27623 26642 16940 113 -13734
6411 -13734 -1881 -10112 -18358 -25482 -23681 -10661 -10944 -8847 -2346 9205 7159 699 -8173 -17156
6397 -17156 -2987 15437 11348 5363 8777 11097 1088 8262 18529 23482 24145 25247 8917 -1760
6383 -1760 -2406 -7106 -19022 -6453 -16865 -24912 -27435 -25254 -22263 -11943 -2878 -4158 -7719 -3185
6369 -3185 9258 3737 -5891 368 3209 -2150 -14426 -4174 21031 16241 4173 21242 16315
6356 16315 3807 15682 9743 -1626 -11342 4562 9760 11107 5836 4235 8075 639 -7231 -5033
$$ packed form
6453b7176p1J1673j71J3030J3484L657k504J689Q657n368o295k056J629j1184
6439a006k275R651R190j745j4192J2714N862L877R429j1917O70n587m645l898
6425F128N64N474L352r235o499M531J289J2901J1673k555r81r702j6827j3847
6411a3734J1853q231q246p124J801J3020k83K097O501J1551k046o460q872q983
6397a7156J4169J8424m089n985L414K320j0009P174J0267M953O63J102j6330j0677
6383a760o46m700j1916J2569j0412q047k523K181K991J0320R065j280l561M534
6369c185J2443n521r628O259K841n359j2276J0252K5205m790j2068J7069m927
6356A6315j2508J1875n939j1369r716J5904N198J347n271j601L840p436p870K198
$$ plain form
6342 -5033 2454 -390 1914 1209 -3192 -4883 -9737 1941 -3183 -29 4189 311 94 -5242 688
6327 688 13871 16257 7493 -6610 -10989 -6667 -10901 -10558 -8200 -12851 -7454 -8950 -14274 -15168 -9547
6312 -9547 -9518 -3902 5873 11459 5642 -5936 -10420 -16131 -323 12775 4049 -6499 -12994 -16325
6298 -16325 -8885 -2129 6546 16353 8385 -3441 -11794 -24050 -20689 -14264 -10926 -5215 8730 5412
6284 5412 5967 23876 25493 14675 5123 -477 -16028 -20021 -1131 1056 -10157 -4203 3893 7385
6270 7385 -1308 6212 7455 329 200 -2064 -2987 6538 -7824 -18174 -4030 -3769 -6697 -16719 -27583
6255 -27583 -21807 2451 24614 24622 18077 16612 18092 6347 -5537 -7755 -16847 -26563 -24614 -15632
6241 -15632 -5885 7763 6413 -869 -15082 -8916 -3296 -5917 -22895 -23551 -8750 -29341 -29755 -18045
$$ packed form
6342e033P487k844K304p05m401j691m854J1678n124L154M218l878k17n336N930
6327F88J3183K386q764j4103m379M322m234L43K358m651N397j496n324q94N621
6312i547K9N616R775N586n817j1578m484n711J5808J3098q726j0548o495l331
6298a6325P440O756Q675R807p968j1826q353j2256L361O425L338N711J3945l318
6284E412N55J7909J617j0818r552n600j5551l993J8890K187j1213N954Q096L492
6270G385q693P520J243p126j29k264r23R525j4362j0350J4144K61k928j0022j0864
6255b7583N776K4258K2163Qo545j465J480j1745j1884k218r092r716J949Q982
6241a5632R747J3648j350p282j4213O166N620k621j6978o56J4801k0591m14J1710
$$ plain form
6227 -18045 -13942 139 12250 13238 8270 -2355 4932 16729 19360 -3166 -4316 -3801 -2622 -8612
6213 -8612 -424 -5074 -16903 -14979 -19823 -21777 -5447 2359 -14279 -26630 -27274 -25114 -20510 -20080
6199 -20080 -20336 -13138 3739 24881 28267 22096 10839 3453 -6731 -9795 -2552 12678 19852 17566
6185 17566 12741 4220 -2483 -8116 -8360 7787 15536 17211 18372 24532 18211 8921 -11247 -16457
6171 -16457 -17159 -20905 -16427 -10571 -2537 -9852 -24627 -34507 -25182 -12508 -15640 -4718 9720 23060
6157 23060 22045 7917 1420 -6197 -8307 5662 6911 2168 -14079 -15032 -11298 -12138 -21777 -16761
6143 -16761 -18269 -833 19518 17522 5333 -2518 300 6968 15907 12090 -3696 488 6191 7409
6129 7409 1807 -8799 -13157 1457 -1484 -1702 -1887 -14825 -16166 -10201 -9520 -4110 6918 14131 -11538
$$ packed form
6227a8045M103J4081J2111R88m968j0625P287J1797K631k2526j150N15J179n990
6213h612Q188m650j1829J924m844j954J6330P806j6638j2351o44K160M604M30
6199b0080k56P198J6877K1142L386o171j1257p386j0184l064P243J5230P174k286
6185A7566m825q521o703n633k44J6147P749J675J161O160o321r290k0168n210
6171a6457p02l746M478N856Q034p315j4775r880R325J2674l132J0922J4438J3340
6157B3060j015j4128o497p617k110J3969J249m743j6247r53L734q40r639N016
6143a6761j508J7436K0351j996j2189p851K818O668Q939l817j5786M184N703J218
6129G409n602j0606m358J4614k941k18j85j2938j341N965O81N410J1028P213k5669
$$ plain form
6114 -11538 -11497 -13563 -19625 -22035 -9120 3529 -2653 -22536 -21204 -3213 -5028 -13065 -5347 -1495
6100 -1495 -7728 -17667 -13403 -3068 15684 37002 34739 24193 16150 5639 -3265 -5231 3532 8988
6086 8988 4059 12097 15223 18 -8955 -5317 2207 7859 -2209 -667 3206 4083 15639 13913
6072 13913 6480 -7347 -27252 -12742 -3140 -10208 829 4370 62 3439 11986 657 -7830
6059 -7830 -556 -5636 -12402 -4566 -11578 -16279 -14376 -7580 -224 -8072 -13615 -18160 -24478 -17039 -19963
6044 -19963 3032 3486 155 -10046 -9147 -4545 3272 2479 -19147 -19383 -3797 12099 2325 -16868
6030 -16868 -17874 -1604 2900 -4813 -11279 -12074 -9548 -3401 6665 8475 19380 17259 11003 -5301
6016 -5301 -7631 4876 11128 8684 1395 -1903 -5249 -13105 -4680 -2905 -1244 -5269 4340 5929 -3110
$$ packed form
6114a1538M1k066o062k410J2915J2649o182j9883J332J7991j815q037P718L852
6100a495o233r939M264J0335J8752K1318k263j0546q043j0511q904j966Q763N456
6086H988m929Q038L126j5205q973L638P524N652j0068J542L873Q77J1556j726
6072A3913p433j3827j9905J4510R602p068J1037L541m308L377Q547j1329q487
6059g830P274n080o766P836p012m701J903O796P356p848n543m545o318P439k924
6044a9963K2995M54l331j0201Q99M602P817p93k1626k36J5586J5896r774j9193
6030a6868j006J6270M504p713o466p95K526O147J0066J810J0905k121o256j6304
6016e301k330J2507O252k444p289l298l346p856Q425J775J661m025R609J589r039
$$ plain form
6001 -3110 1355 4513 13000 11515 13646 9524 20552 19320 21494 15323 8962 -609 896 -1847 -1261
5986 -1261 -4670 -4185 -2681 -5173 -11788 -3056 1729 1823 6658 10040 4035 11055 -6485 -5646 324 10029
5970 10029 28508 26660 5949 996 -6135 -4279 1404 9570 2109 -6378 -8574 -11492 -9315 -16156
5956 -16156 -15122 -9618 -13549 -17031 -3932 12344 15235 13246 4155 5589 18695 15565 11439 6660
5942 6660 222 -6740 5487 7106 1595 -4411 -10037 -1964 7108 -1387 7745 21401 5657 -12289
5928 -12289 -17841 -18405 -11042 -5902 5487 21970 22017 10820 5962 10373 2830 5134 -17443 -21605
5914 -21605 -11140 -7437 -5278 -9000 -14441 -31678 -25655 -13407 -6975 -19056 -23177 -6860 -5349
5901 -5349 -5492 3757 6136 1706 573 -9497 -4610 2195 9652 11250 8934 19245 31860 38061
$$ packed form
6001c110M465L158Q487j485K131m122J1028j232K174o171o361r571J505k743N86
5986a261l409M85J504k492o615Q732M785R4M835L382o005P020j7540Q39N970R705
5970A0029J8479j848k0711m953p131J856N683Q166p461q487k196k918K177o841
5956a6156J034N504l931l482J3099J6276K891j989r091J434J3106l130m126m779
5942F660o438o962J2227J619n511o006n626Q073R072q495R132J3656j5744j7946
5928a2289n552n64P363N140J1389J6483M7j1197m858M411p543K304k2577m162
5914b1605J0465L703K159l722n441j7237O023J2248O432j2081m121J6317J511
5901e349j43R249K379m430j133j0070M887O805P457J598k316J0311J2615O201
$$ plain form
5887 38061 24651 8908 8461 10011 11096 -1205 -1989 -3206 2025 11013 2100 -5184 -197 -5205
5873 -5205 -9562 -13476 -6162 -665 -9129 -10399 9625 17719 4725 821 -1392 6733 1919 -4473
5859 -4473 1459 -8920 -14247 -3929 -13124 -12578 -14220 -25128 -10788 6973 21595 12663 6940 5917
5845 5917 1687 -3563 9354 15354 8069 -39 5611 22624 38614 31582 34404 22433 21553 25373
5831 25373 19146 21023 10020 -4121 4474 9000 8962 8240 12832 16754 11523 6824 15571 6210 -9035
5816 -9035 -64 -2842 -1679 -1383 2615 14455 7558 723 -5393 -11382 -12896 -7851 -1937 9055 10507
5801 10507 720 -2739 4593 -1233 -16842 -33761 -41159 -34370 -31801 -23252 1435 3696 -3179 -5183
5787 -5183 333 -11204 -9039 10225 9303 -4598 -10333 -23209 -29659 -12579 707 -542 5212 21399
$$ packed form
5887C8061j3410j5743m47J550J085j2301p84j217N231Q988q913p284M987n008
5873e205m357l914P314N497q464j270K0024Q094j2994l904k213Q125m814o392
5859d473N932j0379n327J0318r195N46j642j0908J4340J7761J4622q932n723j023
5845E917m230n250J2917O000p285q108N650J7013J5990p032K822j1971q80L820
5831B5373o227J877j1003j4141Q595M526l8p22M592L922n231m699Q747r361j5245
5816i035Q971k778J163K96L998J1840o897o835o116n989j514N045N914J0992J452
5801A0507r787l459P332n826j5609j6919p398O789K569Q549K4687K261o875k004
5787e183N516j1537K165J9264r22j3901n735j2876o450J7080J3286j249N754J6187
$$ plain form
5773 21399 29513 28923 12535 1744 1346 4067 10191 3899 -1338 -6380 -15653 1668 2287 -14238
5759 -14238 -12934 -6520 -12556 -1077 4587 3201 2589 -8950 -9582 -12828 -9899 -8997 -13559 -7723 -1583
5744 -1583 -2214 -9322 -6476 -9780 -4159 20354 24376 16032 16250 9918 9825 12948 3108 -9655 -25574
5729 -25574 -20116 -24401 -23971 -29502 -27478 -30969 -21248 -23111 -17420 -26929 -21581 4305 7624 4644 14696
5714 14696 11546 9089 -20629 -28249 4074 11565 -8886 -3857 16721 24183 19362 13654 2539
5701 2539 -11346 -5232 4448 -12188 373 9164 4799 -3021 -14284 -14929 -15237 -14205 1445 905
5687 905 -11221 -27439 -16333 -19200 -787 779 -7608 -8666 -13277 -1633 -6310 6176 -1054 709
5673 709 3990 601 -12292 1417 3173 12397 15145 13543 12816 5617 7775 9375 9901 8577 -9352
$$ packed form
5773B1399Q114n90j6388j0791l98K721O124o292n237n042r273J7321O19j6525
5759a4238J304O414o036J1479N664j386o12j1539o32l246K929R02m562N836O140
5744a583o31p108K846l304N621K4513M022q344K18o332r3L123r840j2763j5919
5729b5574N458m285M30n531K024l491R721j863N691r509N348K5886L319k980J0052
5714A4696l150k457k9718p620L2323P491k0451N029K0578P462m821n708j1115
5701B539j3885O114R680j6636J2561Q791m365p820j1263o45l08J032J5650n40
5687I05j2126j6218J1106k867J8413J566q387j058m611J1644m677J2486p230J763
5673G09L281l389j2893J3709J756R224K748j602p27p199K158J600N26j324j7929
$$ plain form
5658 -9352 -16323 -31801 -28978 -2350 9807 19618 21392 15672 6402 -7034 -4199 -963 9574 20335
5644 20335 12832 13101 16892 8801 11532 3498 1069 -10648 -7060 -255 13117 3350 -5686 -2292
5630 -2292 -3197 8064 7099 3863 -2671 10003 25932 31179 26768 18237 9335 14404 20087 4174
5616 4174 -18897 -33309 -38718 -36029 -27597 -16451 -10840 -23592 -19910 -17692 -15620 -8902 -1834 -4285
5602 -4285 1239 4103 7212 -769 6749 17910 30272 19466 17880 23445 27672 15930 12706 4202
5588 4202 5532 4356 -9644 1365 -819 -1380 454 194 -23812 -30727 -21274 -23699 -30796 -31937 -27267
5573 -27267 -19752 -17297 -12880 -14412 -21289 -17064 -26241 -31885 -16568 -3507 6346 1073 -12041 -24255
5559 -24255 -21217 -22395 -6529 12224 -3258 -9980 -6259 -3988 -2205 4848 20258 22121 10079
$$ packed form
5658i352o971j5478K823K6628J2157R811J774n720r270j3436K835L236J0537J0761
5644B0335p503K69L791q091K731q034k429j1717L588O805J3372r767r036L394
5630b292r05J1261r65l236o534J2674J5929N247m411q531q902N069N683j5913
5616D174k3071j4412n409K689Q432J1146N611j2752L682K218K072O718P068k451
5602d285N524K864L109p981P518J1161J2362j0806j586N565M227j1742l224q504
5588D202J330j176j4000J1009k184n61J834k60k4006o915R453k425p097j141M670
5573b7267P515K455M417j532o877M225r177n644J5317J3061R853n273j3114j2214
5559b4255L038j178J5866J8753j5482o722L721K271J783P053J5410J863j2042
$$ plain form
5546 10079 -126 -6776 -11997 -15189 5096 6026 1854 6947 -2792 -12859 -13934 6766 10096 -3598
5532 -3598 -2614 4367 13607 19251 8663 1716 12730 19544 33181 28520 6797 1251 10787 5431
5518 5431 20263 25118 28283 26395 13031 3936 15193 16570 10093 5963 -14797 -27554 -20064 -19248
5504 -19248 -12950 11120 12905 4043 -9638 -5760 -479 -2136 -21621 -23274 -28722 -26743 -13654 -11904
5490 -11904 -14939 -19398 -8728 -1023 -2540 8535 10189 3202 -1842 -3090 1571 13220 8257 5939
5476 5939 13217 9484 -699 -1643 -16048 -2984 2687 11725 11310 5846 -8481 -19880 -7494 -4051
5462 -4051 -12672 -20264 -14286 -6814 -12068 -2933 1418 -43 -3009 -10122 -11604 -7164 -14427 2706 8289
5447 8289 14825 13005 1431 -12427 -3810 -15351 -23193 -1837 129 1275 -4238 -9621 -18889 -1248
$$ packed form
5546A0079j0205o650n221l192K0285R30m172N093r739j0067j075K0700L330j3694
5532c598R84O981R240N644j0588o947J1014O814J3637m661k1723n546R536n356
5518E431J4832M855L165j888j3364r095J1257J377o477m130k0760j2757P490Q16
5504a9248O298K4070J785q862j3681L878N281j657j9485j653n448J979J3089J750
5490a1904l035m459J0670P705j517J1075J654o987n044j248M661J1649m963k318
5476E939P278l733j0183r44j4405J3064N671R038m15n464j4327j1399J2386L443
5462d051q621p592N978P472n254R135M351j461k966p113j482M440p263J7133N583
5447H289O536j820j1574j3858Q617j1541p842K1356J966J146n513n383r268J7641
$$ plain form
5433 -1248 14735 27985 16525 8280 9689 4997 9694 -2651 -11032 -6315 383 -18389 -17287 -4507
5419 -4507 -6499 2688 371 -2244 -3016 4417 17546 27452 21810 5525 -5488 -10225 -17834 -17535 -15388
5404 -15388 -13587 -17214 -13878 -1715 -9077 -5514 9128 11575 3201 4277 7089 15388 12150 7951
5390 7951 19770 2623 -8872 -265 11316 16014 15086 11076 12712 1566 -5934 2517 -2375 -18135
5376 -18135 -2077 8399 -1262 -9533 -6492 402 5689 8178 -8989 -17389 -1708 4767 2197 1645
5362 1645 -9038 -19761 -23101 -10982 -683 -6577 -10302 -464 -76 3323 1533 -9500 -7574 -1800
5348 -1800 -14920 -14941 -11827 -19281 -22098 -13886 -7899 -11270 -8572 -5439 -20225 -12519 6608 -1189 -10746
5333 -10746 -25078 -27856 -12035 -22614 -22856 3816 15812 -4791 -12815 13053 17943 19122 24529
$$ packed form
5433a248J5983J3250j1460q245J409m692M697j2345q381M717O698j8772J102J2780
5419d507j992R187k317k615p72P433J3129R906n642j6285j1013m737p609K99K147
5404a5388J801l627L336J2163p362L563J4642K447q374J076K812Q299l238m199
5390G951J1819j7147j1495Q607J1581M698r28m010J636j1146p500Q451m892j5760
5376a8135J6058J0476r661q271L041O894N287K489j7167q400J5681O475k570n52
5362A645j0683j0723l340J2119J0299n894l725R838L88L399j790j1033J926N774
5348a800j3120k1L114p454k817Q212N987l371K698L133j4786P706J9127p797r557
5333a0746j4332k778J5821j0579k42K6672J1996k0603q024K5868M890J179N407
$$ plain form
5320 24529 25600 14133 5265 11733 6893 -3508 -10127 -8288 -12854 -8991 -3929 -1465 -4150 -9469
5306 -9469 4105 -765 -9565 -9445 881 7439 6891 -641 -10803 -30110 -29994 -17257 -21926 -26806
5292 -26806 -18401 -17708 -27523 -24966 -8715 5432 6165 7709 6071 -3133 -4136 -6307 -14259 -14524 -9061
5277 -9061 -359 3784 6180 -714 -11506 -18293 -22875 -13996 -7630 -13773 -20454 -23715 -29947 -30005 -28451
5262 -28451 -11483 -6247 -3418 -9231 82 8258 -4813 -4148 -24359 -27277 -22564 -10951 87 -9548
5248 -9548 -15562 -8059 4077 11602 19007 19173 21387 22370 21169 22348 17335 115 3240 6835 1917
5233 1917 3210 1618 -4767 -25015 -36769 -28372 -26027 -43095 -21694 -3289 -8354 -16858 -21924 -16944
5219 -16944 -6900 -1621 -9518 -20699 -12399 -4007 10846 28141 32775 36460 41955 32429 17848
$$ packed form
5320B4529J071j1467q868O468m840j0401o619J839m566L863N062K464k685n319
5306i469J3574m870q800J20J0326O558n48p532j0162j9307J16J2737m669m880
5292b6806Q405O93r815K557J6251J4147P33J544j638r204j003k171p952k65N463
5277i061Q702M143K396o894j0792o787m582Q879O366o143o681l261o232n8J554
5262b8451J6968N236K829n813R313Q176j3071O65k0211k918M713J1613J1038r635
5248i548o014P503J2136P525P405J66K214R83j201J179n013j7220L125L595m918
5233A917J293j592o385k0248j1754Q397K345j7068K1401J8405n065q504n066M980
5219a6944J0044N279p897j1181Q300Q392J4853J7295M634L685N495r526j4581
$$ plain form
5206 17848 -3293 -5786 -3830 6709 10266 1972 -2650 -2760 -13489 -23462 -22476 -16480 -11456 9452
5192 9452 19905 23632 18504 11262 19989 40 20142 28841 25158 11960 -2949 -8461 -13520 -15159
5178 -15159 -1152 -7127 -20131 -24434 -12625 -283 7191 8537 -6370 -1766 -9352 -20410 -2305
5165 -2305 11911 9181 2747 -3442 3851 1122 -419 0 -2570 1082 9080 -2341 -11345 -5095 773
5150 773 -1678 -17387 -26361 -15902 -9101 -4459 -11611 -5534 10929 18036 22398 14354 2709 -2001
5136 -2001 12040 36172 23003 -6345 -10290 -9892 -12847 -5213 -25530 -38061 -31011 -3115 5206
5123 5206 -4489 -10260 -1803 -1950 -367 8661 -1522 -3800 -7235 -15581 2460 18277 15523 1898
5109 1898 1780 -3544 2790 15762 27459 10247 -12203 -22902 -24411 761 11959 1835 -206
$$ packed form
5206A7848k1141k493J956J0539L557q294m622j10j0729r973R86N996N024K0908
5192I452J0453L727n128p242Q727j9949K0102Q699l683j3198j4909n512n059j639
5178a5159J4007n975j3004m303J1809J2342P474J346j4907M604p586j1058J8105
5165b305J4216k730o434o189P293k729j541M19k570L652P998j1421r004O250N868
5150G73k451j5709q974J0459O801M642p152O077J6463P107M362q044j1645m710
5136b001J4041K4132j3169k9348l945L98k955P634k0317j2531P050K7896Q321
5123E206r695n771Q457j47J583R028j0183k278l435q346J8041J5817k754j3625
5109A898j18n324O334J2972J1697j7212k2450j0699j509K5172J1198j0124k041
$$ plain form
5096 -206 3947 -1655 -9686 -2735 2315 -3198 -2843 -4769 -13022 358 1322 -6392 -27749 -25308 -30228
5081 -30228 -28598 -30813 -31874 -38223 -37805 -33283 -29756 -15734 -22149 -35681 -30942 -10128 -2058 2594
5067 2594 -530 -3711 492 64 -11563 -13422 -9364 -22352 -24266 -28003 -20548 -16939 -13823 -26866
5053 -26866 -31438 -39137 -27603 -25046 -16540 -10750 -12339 -15603 -12417 -13492 -6469 3353 6725 9739
5039 9739 16168 21365 19434 10891 3525 -7014 -16832 -7640 4549 3174 17421 31158 25997 17044
5025 17044 7763 -3741 -5469 326 256 -4132 -303 595 -5396 -16865 -15426 -22112 -22705 -14184 -11264
5010 -11264 -1563 -1677 -3337 -16765 -22853 -14912 -13091 -11608 -24261 -26968 -17215 -3193 12754 14803
4996 14803 13652 9110 -3702 1726 -5804 -12162 -14449 4954 18190 19550 17719 -3393 -11241 -17171
$$ packed form
5096b06M153n602q031O951N050n513L55j926q253J3380R64p714k1357K441m920
5081c0228J630k215j061o349M18M522L527J4022o415j3532M739K0814Q070M652
5067B594l124l181M203m28j1627j859M058j2988j914l737P455L609L116j3043
5053b6866m572p699J1534K557Q506N790j589l264L186j075P023R822L372L014
5039I739O429N197j931q543p366j0539r818R192J2189j375J4247J3737n161q953
5025A7044r281j1504j728N795p0m388L829Q98n991j1469J439o686n93Q521K920
5010a1264R701j14j660j3428o088P941J821J483j2653k707R753J4022J5947K049
4996A4803j151m542j2812N428p530o358k287J9403J3236J360j831k1112p848n930
$$ plain form
4982 -17171 -22689 -22898 -15766 -17136 -11051 -12680 -3070 5530 7012 18137 30189 33369 32889 19879
4968 19879 24266 18100 -5291 -26165 -21162 -16280 -3186 14000 6090 1796 3440 1807 6853 -1574
4954 -1574 7214 12755 15509 14746 -1125 -189 2767 12750 4035 -463 -16497 -12642 -6897 -8877 -10478
4939 -10478 -18707 -20056 -12299 -4197 -4206 8272 1277 -4183 -14148 -13657 -11644 -7055 14753 8520 -4067
4924 -4067 -3512 -15241 -22632 -17260 -18516 -14886 -12630 -26561 -16196 -5903 6366 9801 5016 -924
4910 -924 12545 13572 2670 3536 4664 -56 1453 2123 -7061 -3472 232 -1125 2232 -3538 -15299
4895 -15299 1821 -1837 -17520 -7512 -10667 -12015 -10624 -14148 -14169 -4416 -11898 -16731 -21881 -17738
4881 -17738 -11960 -6356 7005 2335 -11060 -5502 1574 -3884 -1386 2998 6388 6659 7496 15268 11187
$$ packed form
4982a7171n518k09P132j370O085j629R610Q600J482J1125J2052L180m80j3010
4968A9879M387o166k3391k0874N003M882J3094J7186p910m294J644j633N046q427
4954a574Q788N541K754p63j5871R36K956R983q715m498j6034L855N745j980j601
4939a0478q229j349P757Q102rJ2478o995n460r965M91K013M589K1808o233j2587
4924d067N55j1729p391N372j256L630K256j3931J0365J0293J2269L435m785n940
4910i24J3469J027j0902Q66J128m720J509O70r184L589L704j357L357n770j1761
4895a5299J7120l658j5683J0008l155j348J391l524k1R753p482m833n150M143
4881a7738N778N604J3361m670j3395N558P076n458K498M384L390K71Q37P772m081
$$ plain form
4866 11187 -2000 -1984 5739 12672 -13925 -30545 -28712 -18641 -19563 -16808 1889 5171 2444 1100
4852 1100 -2408 -13511 2831 14674 12265 6297 3898 -8448 -6378 6328 10200 8202 -679 -8492
4838 -8492 -242 4417 -5428 -7695 6340 18083 16408 19118 30553 37875 29071 4624 4259 -1533
4824 -1533 2798 4328 -15151 -9715 -1846 -559 -8104 -14729 6790 12948 -4750 4243 1738 -11785
4810 -11785 -11367 1216 -415 -4865 1199 12952 1823 -7516 -8983 -15073 -10421 6311 9688 -3173
4796 -3173 -19276 -13810 -30018 -28186 -7016 2588 -6487 -1514 2600 16411 21447 5462 13971 1338
4782 1338 -6169 -24619 -24710 -322 1072 5602 6534 5489 -1849 -8821 -19473 -13437 -17855 -17689 -11111
4767 -11111 -1193 3587 5040 -3929 -19547 -25204 -13461 6512 3588 -741 -9871 -21218 -13584 -13160
$$ packed form
4866A1187j3187J6P723O933k6597j6620J833J0071r22K755J8697L282k727j344
4852A100l508j1103J6342J1843k409n968k399j2346K070J2706L872j998q881p813
4838h492Q250M659r845k267J4035J1743j675K710J1435P322q804k4447l65n792
4824a533M331J530j9479N436P869J287p545o625K1519O158j7698Q993k505j3523
4810a1785M18J2583j631m450O064J1753j1129r339j467o090M652J6732L377j2861
4796c173j6103N466j6208J832K1170R604r075M973M114J3811N036j5985Q509j2633
4782A338p507j8450r1K4388J394M530R32j045p338o972j0652O036m418J66O578
4767a1111R918M780J453q969j5618n657J1743J9973k924m329r130j1347P634M24
$$ plain form
4753 -13160 -31485 -35571 -20595 -11686 -10592 -5093 14791 12051 -4100 3629 21365 32223 19389
4740 19389 8707 26153 33778 10192 2487 7395 18061 3118 -6651 -11388 -13566 -8642 6893
4727 6893 20318 10428 -4848 9758 15616 9889 -302 -12453 -16753 -11291 -6067 1438 9554 12737
4713 12737 6200 12211 11231 21449 11725 8919 -5560 -13940 -2827 1406 -3752 3626 -1525 -5573
4699 -5573 -12217 -1829 6341 2175 4598 355 -12562 -749 6171 1339 -5797 -1500 1184 -12059
4685 -12059 -9421 3038 6563 3174 -10841 -9851 -21533 -15422 -14228 -14374 -21691 -28484 -11298 9702
4671 9702 2755 -6821 5919 20160 20311 17646 34548 26484 28064 30360 21003 13388 18533 13915
4657 13915 -1926 -9818 -2248 2047 -1046 -5777 4822 12568 -865 -14428 -5744 5053 4087 -11516
$$ packed form
4753a3160j8325m086J4976Q909J094N499J9884k740j6151P729J7736J0858j2834
4740A9389j0682J7446P625k3586p705M908J0666j4943r769m737k178M924J5535
4727F893J3425r890j5276J4606N858n727j0191j2151m300N462N224P505Q116L183
4713A2737o537O011r80J0218r724k806j4479q380J1113M233n158P378n151m048
4699e573o644J0388Q170m166K423m243j2917J1813O920m832p136M297K684j3243
4685a2059K638J2459L525l389j4015R90j1682O111J194j46p317o793J7186K1000
4671I702o947r576J2740J4241J51k665J6902q064J580K296r357p615N145m618
4657A3915j5841p892P570M295l093m731J0599P746j3433j3563Q684J0797r66j5603
$$ plain form
4643 -11516 -3175 7931 13133 12626 9085 4405 -3617 -2768 -2755 -12064 -12611 -3757 -7032 -17479 -29796
4628 -29796 -42128 -31697 -29223 -13415 -6560 -2755 -4650 3072 -1582 -15938 -18139 -7543 -4564
4615 -4564 -12561 -653 -11092 -38999 -40346 -22512 -9134 -258 4231 1362 7295 21350 19396
4602 19396 9713 5100 -1122 782 -1600 -4180 -1943 1125 7499 14522 12629 -11055 -17696 -11765
4588 -11765 -10770 -20309 -23633 -23423 -9361 13682 5906 231 -1061 6663 13829 -4333 -18973 -12767
4574 -12767 -15854 -18989 -1166 16271 18134 22005 12907 1337 -22593 -26235 -6917 11002 -41
4561 -41 -5604 -321 15603 9469 2443 -6336 -5726 1476 11732 980 -11628 -17093 -28012 -21982
4547 -21982 -6823 143 8117 19588 12688 -14807 -20684 -9299 -6489 1441 2605 6969 18977
$$ packed form
4643a1516Q341J1106N202n07l541m680q022Q49J3r309n47Q854l275j0447j2317
4628b9796j2332J0431K474J5808O855L805j895P722m654j4356k201J0596K979
4615d564p997J1908j0439k7907j347J7834J3378Q876M489k869N933J4055j954
4602A9396r683m613o222J904k382k580K237L068O374P023j893k3684o641N931
4588a1765R95r539l324K10J4062K3043p776n675j292P724P166j8162j4640O206
4574a2767l087l135J7823J7437J863L871r098j1570k3930l642J9318J7919j1043
4561d1n563N283J5924o134p026q779O10P202J0256j0752j2608n465j0919O030
4547b1982J5159O966P974J1471o900k7495n877J1385K810P930J164M364J2008
$$ plain form
4534 18977 -1578 -9386 -1295 -4164 -13642 -13067 -11013 -1012 -1272 -2884 -2571 150 -3514 -4812 -2787
4519 -2787 -2872 -3920 10632 8064 -8734 -5318 -17202 -19867 -11994 -4547 -429 3979 -5727 -6512 -9004
4504 -9004 -14582 -11463 -6449 883 5597 22131 35659 36250 18918 9871 3152 -10672 -7753 -3324
4490 -3324 -5785 -5872 1941 1966 16140 12629 7293 28058 26240 13721 1779 -16872 -27930 -19953
4476 -19953 -9665 9741 11504 5453 -2430 -9014 4175 14371 18615 19937 13003 -914 -16995
4463 -16995 -28837 -17002 -9492 -3950 -16451 -13755 -1170 -5163 -12517 -8687 -9802 -5815 -740 -4669
4449 -4669 3024 -11152 -10462 -328 22100 30005 39980 30527 21178 20354 9604 -4284 -18171 -17879
4435 -17879 -30600 -23096 -17969 -20341 -1999 28631 23086 5726 -5768 -4879 -9948 -21410 -4987
$$ packed form
4534A8977k0555p808Q091k869r478N75K054J0001k60j612L13K721l664j298K025
4519b787q5j048J4552k568j6798L416j1884k665P873P447M118M408r706p85k492
4504i004n578L119N014P332M714J6534J3528N91j7332r047o719j3824K919M429
4490c324k461q7P813K5J4174l511n336K0765j818j2519j1942j8651j1058P977
4476a9953J0288J9406J763o051p883o584J3189J0196M244J322o934j3917j6081
4463a6995j1842J1835P510N542j2501K696J2585l993p354L830j115L987N075l929
4449d669P693j4176O90J0134K2428P905R975r453r349q24j0750j3888j3887K92
4435a7879j2721P504N127k372J8342L0630n545j7360j1494Q89n069j1462J6423
$$ plain form
4422 -4987 8892 16264 17999 21500 19344 -1306 -11688 -11793 -13038 -10204 2708 6758 8446 10812
4408 10812 11337 25172 36484 31665 27003 12199 -11943 -22381 -25488 -9649 5268 -2005 -9879
4395 -9879 -8349 -7474 -10778 -10653 -10065 1239 -148 -648 8777 16431 22146 9913 3280 453 5260
4380 5260 10276 17315 8545 -7021 -6831 -10931 3119 11712 826 -7390 3072 8417 5501 12459
4366 12459 19369 13385 7875 -11885 -33792 -32665 -19242 -8535 4748 8431 5331 -15536 -13836
4353 -13836 -12020 -7970 -10539 -22097 -20629 -18759 -11307 -4549 -8683 -1301 14753 18647 2823 -8060
4339 -8060 -12077 -3923 9925 24816 22335 10855 19272 15800 168 -11077 -8631 -2221 1675 -3260
4325 -3260 -6057 -6560 -20733 -30544 -34149 -26786 -16946 -24235 -18999 -10490 -5945 -930 -57 -18484 -26445
$$ packed form
4422d987J3879P372J735L501k156k0650j0382j05j245K834J2912M050J688K366
4408A0812N25J3835J1312m819m662j4804k4142j0438l107J5839J4917p273p874
4395i879J530Q75l304J25N88J1304j387n00R425P654N715j2233o633k827M807
4380E260N016P039q770j5566J90m100J4050Q593j0886q216J0462N345k916O958
4366A2459O910n984n510j9760k1907J127J3423J0707J3283L683l100k0867J700
4353a3836J816M050k569j1558J468J870P452O758m134P382J6054L894j5824j0883
4339h060m017Q154J3848J4891k481j1480Q417l472j5632j1245K446O410L896m935
4325c260k797n03j4173r811l605P363R840p289N236Q509M545N015Q73j8427p961
$$ plain form
4310 -26445 -29971 -37107 -30903 -14708 1608 10457 5056 2981 -2382 -3116 7444 2496 -7658 1039
4296 1039 22218 15566 6597 11030 16690 1231 1650 7727 -2631 -20324 -5873 3324 -503 -7884
4282 -7884 -6704 -5668 -3950 12922 35119 26404 11373 6077 14790 14400 13337 12558 9616 -1355
4268 -1355 -16095 -12905 -6558 -14899 -24165 -4569 1485 4822 -4358 -16448 -8172 -14328 -9545 -5442
4254 -5442 4716 19199 21758 20534 -4131 -7800 11141 15132 -3771 -8255 11782 17007 23250
4241 23250 15656 18503 15434 -11414 -3011 -6825 -5717 -467 -5691 -4409 5267 20518 13412 14341
4227 14341 8339 -2644 -8592 -626 -9958 -14944 -1341 9196 5209 14372 11059 12160 16858 10433
4213 10433 4818 8804 2327 6460 -7408 -9069 -9791 -6919 -7790 -20002 -16986 -15262 -8272 -246 -10819
$$ packed form
4310b6445l526p136O204J6195J6316Q849n401k075n363p34J0560m948j0154Q697
4296A039K1179o652q969M433N660j5459M19O077j0358j7693J4451R197l827p381
4282g884J180J036J718J6872K2197q715j5031n296Q713l90j063p79k942j0971
4268a355j4740L190O347q341r266J9596O054L337r180j2090Q276o156M783M103
4254e442J0158J4483K559j224k4665l669J8941L991j8903m484K0037N225O243
4241B3250p594K847l069k6848Q403l814J108N250n224J282R676J5251p106R29
4227A4341o002j0983n948P966r332m986J3603J0537l987R163l313J101M698o425
4213A0433n615L986o477M133j3868j661p22K872q71j2212L016J724O990Q026j0573
$$ plain form
4198 -10819 -27675 -6022 5365 -15649 -34842 -30008 -24579 -15988 -13111 -3157 11937 16156 3025
4185 3025 6425 5788 2457 543 18345 23605 15055 6387 12216 20215 13712 -3801 -7536 -10263 -168
4170 -168 2884 -12750 -9680 -2747 -15489 -17842 -9757 12844 19266 27504 39061 36013 18487 1841
4156 1841 -7369 1607 9543 4360 8094 12519 3629 -916 -1129 -163 -14099 -10612 -8052 -9188 -9251 -2612
4140 -2612 -8436 -19746 -10761 -3087 -3432 -12452 -6349 -6058 2590 1996 -3195 -10286 -6826 2134 72
4125 72 -7300 4368 30908 17492 690 -1007 917 2434 -1078 -3653 1175 2992 12114 14172
4111 14172 19453 37479 40051 24690 8169 10696 3595 -6723 7599 9073 1281 -1356 4758
4098 4758 18122 24655 19078 3546 -4225 -10078 11501 16319 4779 2409 -7074 -11419 -13062 -1722
$$ packed form
4198a0819j6856K1653J1387k1014j9193M834N429Q591K877R954J5094M219j3131
4185C025L400o37l331j914J7802N260q550q668N829P999o503j7513l735k727J0095
4170a68L052j5634L070O933j2742k353Q085K2601O422Q238J1557l048j7526j6646
4156A841r210Q976P936n183L734M425q890m545k13R66j3936L487K560j136o3O639
4140b612n824j1310Q985P674l45r020O103K91Q648n94n191p091L460Q960k062
4125G2p372J1668K6540j3416j6802j697J924J517l512k575M828J817R122K058
4111A4172N281J8026K572j5361j6521K527p101j0318J4322J474p792k637O114
4098D758J3364O533n577j5532p771n853K1579M818j1540k370r483m345j643J1340
$$ plain form
4084 -1722 1579 -10969 -16047 -6976 -7406 -1592 2187 -11723 -19276 -10703 1694 18250 14715 -2328
4070 -2328 -850 1427 562 -7401 -13185 53 -5620 -14917 -32509 -32067 -27661 -18673 -8186 -4083 -5213
4055 -5213 -1766 7902 19247 18829 16620 6653 -6755 1472 6768 -5268 -5210 171 4499 2425 -7585
4040 -7585 199 -7189 -17481 -12514 368 1508 155 -8669 -5573 2569 -3175 -519 6060 12940
4026 12940 3968 -2181 14219 15813 11596 8441 -7033 -17351 888 8968 8778 6415 -10191 -6163
4012 -6163 -292 2175 17699 15537 1146 425 671 14320 17467 7249 -7318 1454 9970 -13540
3998 -13540 -27048 -39354 -28816 -37575 -29550 -8066 -11704 -33332 -33133 -21737 -14014 -6056 6417
3985 6417 17732 13091 7858 13415 21493 10631 -2678 -1543 -4681 -10630 -8694 -6065 -7159 -15427
$$ packed form
4084a722L301j2548n078R071m30N814L779j3910p553Q573J2397J6556l535j7043
4070b328J478K277q65p963n784J3238n673r297j7592M42M406Q988J0487M103j130
4055e213L447R668J1345m18k209r967j3408Q227N296j2036N8N381M328k074j0010
4040g585P784p388j0292M967J2882J140j353q824L096Q142n744K656O579O880
4026A2940q972o149J6400J594m217l155j5474j0318J8239Q080j90k363j6606M028
4012f163N871K467J5524k162j4391p21K46J3649L147j0218j4567Q772Q516k3510
3998a3540j3508j2306J0538q759Q025K1484l638k1628J99J1396P723P958J2473
3985F417J1315m641n233N557Q078j0862j3309J135l138n949J936K629j094q268
$$ plain form
3971 -15427 -3656 11843 1370 -7354 -4836 6941 14257 23805 36497 43406 36894 20462 6860
3958 6860 -2891 -10183 -31168 -34039 -18461 -11617 2503 23403 25458 26008 3788 -20939 -33677
3945 -33677 -13260 -1434 3880 5715 5303 -9050 -8937 -4334 308 334 2036 -7967 -21390 -25991
3931 -25991 -26754 -22284 -7709 -4702 -22530 -17147 -1344 14253 1566 -4800 11361 25793 30004
3918 30004 5359 -29384 -15272 -3606 -771 14776 18500 1470 -14055 -14153 -14796 -3003 3030
3905 3030 -1420 -8527 -6059 -4704 -6921 3270 19157 14005 -611 2150 2644 5300 18893 1445
3891 1445 -22407 -22338 -25032 -33970 -19428 -1928 -8172 -14403 -20235 -12122 -10890 -22323 -20270 -7123
3877 -7123 -1615 1602 1416 3923 2297 8362 141 485 4534 4153 3924 -3891 -1597 -5701 -8515 1854
$$ packed form
3971a5427J1771J5499j0473q724K518J1777P316R548J2692O909o512j6432j3602
3958F860r751p292k0985k871J5578O844J4120K0900K055N50k2220k4727j2738
3945c3677K0417J1826N314J835m12j4353J13M603M642K6J702j0003j3423m601
3931b5991p63M470J4575L007j7828N383J5803J5597j2687o366J6161J4432M211
3918C0004k4645l4743J4112J1666K835J5547L724j7030j5525r8o43J1793O033
3905C030m450p107K468J355k217J0191J5887n152j4616K761M94K656J3593j7448
3891A445k3852O9k694q938J4542J7500o244o231n832Q113J232j1433K053J3147
3877g123N508L217j86K507j626O065q221L44M049l81k29p815K294m104k814J0369
$$ plain form
3861 1854 5879 14972 7486 -6902 -7051 -655 -4016 -8697 4798 7030 4540 5913 -311 -11787
3847 -11787 -11685 -12106 -11128 -9536 8704 20462 4920 -10069 -18294 -2356 4304 213 -8474 -5427
3833 -5427 1272 4853 12671 8762 -206 613 -1107 5237 6163 3409 5076 13187 6064 -5183 -3745
3818 -3745 8841 25821 23288 23955 20363 9473 -4949 -1957 -4276 -13266 -8389 7784 9615 19100
3804 19100 39855 27840 27057 24413 8329 4472 16651 19407 28303 28837 17792 9359 -8191 -18024
3790 -18024 -5265 -1311 -5627 11148 20565 17248 27540 18599 3232 16761 20346 10322 1190
3777 1190 -4951 -11984 -19403 -8930 -4961 -26098 -32183 -12188 1549 -8033 1421 -2835 -8804 11675
3763 11675 29335 18119 8039 15578 11467 10742 16932 21815 13020 5011 4491 13420 5251 -349
$$ packed form
3861A854M025R093p486j4388j49O396l361m681J3495K232k490J373o224j1476
3847a1787J02m21R78J592J8240J1758j5542j4989q225J5938O660m091q687L047
3833e427O699L581P818l909q968Q19j720O344R26k754J667Q111p123j1247J438
3818c745J2586J6980k533O67l592j0890j4422K992k319q990M877J6173J831R485
3804A9100K0755j2015p83k644j6084l857J2179K756Q896N34j1045q433j7550r833
3790a8024J2759L954m316J6775R417l317J0292q941j5367J3529L585j0024r132
3777A190o141p033p419J0473L969k1137o085J9995J3737r582R454m256n969K0479
3763A1675J7660j1216j0080P539m111p25O190M883q795q009n20Q929q169n600
$$ plain form
3749 -349 -2846 5887 11436 6866 -5778 2723 -492 -7445 -1488 -13773 -27775 -25278 -9389 2120
3735 2120 -9799 -13001 -5162 4557 13818 16296 18629 28876 36306 11322 -4412 -6533 1350 656
3721 656 4002 -5120 -386 19552 20800 7431 3877 -3255 -8751 -4325 3023 13737 15299 14229
3707 14229 5754 -2322 -5579 -1580 10682 6981 4697 4051 3043 2814 5019 11561 12514 15411 -5372
3692 -5372 -15397 1311 9646 2609 -109 8049 730 7974 20975 30024 27930 16593 -18127 -15836
3678 -15836 8935 27646 23772 6025 -6763 3683 8848 16944 24791 17737 2779 -7182 -10239
3665 -10239 -8224 -22086 -32133 -17553 -17777 -3822 3166 -365 6958 21968 23674 16912 -5537
3652 -5537 -16643 -20547 -21855 -208 3233 -1258 -6324 -23982 -26038 -36841 -32300 -22308 -31650 -26500
$$ packed form
3749c49k497Q733N549m570j2644Q501l215o953N957j2285j4002K497J5889J1509
3735B120j1919l202P839R719R261K478K333J0247P430k4984j5734k121P883o94
3721F56L346r122M734J9938J248j3369l554p132n496M426P348J0714J562j070
3707A4229q475q076l257L999J2262l701k284o46j008k29K205O542R53K897k0783
3692e372j0025J6708Q335p037k718Q158p319P244J3001R049k094j1337l4720K291
3678a5836K4771J8711l874j7747j2788J0446N165Q096P847p054j4958r961l057
3665a0239K015j3862j0047J4580k24J3955O988l531P323J5010J706o762k2449
3652e537j1106l904j308K1647L441m491n066j7658k056j0803M541R992r342N150
$$ plain form
3638 -26500 -11164 -24782 -15802 -8219 -7256 -7415 561 11530 23850 22137 28422 25172 25903 24386
3624 24386 18804 6602 -7653 3827 3116 5476 10388 -998 -10715 -7147 1899 -5352 -12091 3574
3610 3574 1781 -9531 -11828 -9954 -23279 -12000 1338 586 -4012 1706 4964 -27294 -36493 -20480
3596 -20480 -6222 2399 7702 12606 18840 1857 -9086 -12464 -7158 10055 10975 4734 5068 -740
3582 -740 -4943 -3433 -6535 3212 14257 20308 21445 842 -8409 7529 29053 24174 7981 -7502
3568 -7502 -10831 -16473 -25547 -19571 -12284 -6923 -10666 -11796 -7544 8420 12078 13923 582 -1688
3554 -1688 891 6528 6238 8698 10093 19579 14563 18063 26661 8067 2093 1155 -12369 -26289 -37102
3539 -37102 -22590 -14656 -8797 -10399 -18663 -15666 -12773 -8120 -6363 2264 11803 11483 10739 13265 12171
$$ packed form
3638b6500J5336j3618Q980P583R63j59P976J0969J2320j713O285l250P31j517
3624B4386n582j2202j4255J1480p11K360M912j1386r717L568R046p251o739J5665
3610C574j793j1312k297J874j3325J1279J3338p52m598N718L258l2258r199J6013
3596b0480J4258Q621N303M904O234j6983j0943l378N306J7213R20o241L34n808
3582g40m203J510l102R747J1045O051J137k0603r251J5938K1524m879j6193j5483
3568g502l329n642r074N976P287N361l743j130M252J5964L658J845j3341k270
3554a688K579N637k90K460J395R486n016L500Q598j8594n974r38j3524j3920j0813
3539c7102J4512P934N859j602q264K997K893M653J757Q627R539l20p44K526j094
$$ plain form
3524 12171 3474 16671 18453 22525 14114 12549 11297 10936 7541 -369 -7174 -9402 -18929 -17177 -13759
3509 -13759 -14567 -17640 -8506 -15465 -11896 -7757 -10877 -2232 11263 11822 6924 4787 15024 11895 2107
3494 2107 4903 12201 13081 4386 15788 15292 14184 13517 -3052 5673 14510 23915 36793 35254 28954
3479 28954 25677 14869 24520 31816 26192 6562 -3810 -14428 -9717 -14076 -3359 11750 13343
3466 13343 8216 19205 22198 22449 12638 7956 19964 14690 9205 -2270 -4237 1976 7124 5454
3452 5454 7373 -2126 -13746 -1237 -3589 -13963 -10807 980 -8292 -20053 -17347 -8488 2925
3439 2925 -5949 -15947 -12743 -17145 -25713 -21572 5932 11588 -8274 -19704 -26937 -24963 -13024 -20599
3425 -20599 -23702 -16220 6490 2799 -6221 -4089 -7662 7583 22231 4464 -36 8571 13189 -1817
$$ packed form
3524A2171q697J3197J782M072q411j565j252l61l395p910o805k228r527J752L418
3509a3759q08l073R134o959L569M139l120Q645J3495N59m898k137J0237l129r788
3494B107K796P298Q80q695J1402m96j108o67j6569Q725Q837R405J2878j539o300
3479B8954l277j0808R651P296n624j9630j0372j0618M711m359J0717J5109J593
3466A3343n127J0989K993K51r811m682J2008n274n485j1475j967O213N148j670
3452E454J919r499j1620J2509k352j0374L156J1787r272j1761K706Q859J1413
3439B925q874r998L204m402q568M141K7504N656j9862j1430p233J974J1939p575
3425b0599l103P482K2710l691r020K132l573J5245J4648j7767m500Q607M618j5006
$$ plain form
3411 -1817 -14832 -14010 -10387 -14767 -7888 4192 8264 9749 -525 2018 7504 5474 15611 15913
3397 15913 11596 7041 7081 7041 281 -6685 801 343 1990 1747 -1942 -13644 -22984 -11304 4942
3382 4942 4759 11435 12831 7535 6211 5109 11486 23700 14543 6143 4533 898 8175 -2499 3425
3367 3425 1641 3701 -2912 -4437 -11059 -14579 -19996 -10219 -3540 486 15235 20455 20697 9165 -5197
3352 -5197 -902 -4801 -5376 -4569 6431 5119 -17408 -32091 -30563 -18249 -2197 10098 6930 -2145
3338 -2145 -2146 -7084 -18460 -13775 98 4081 16426 19336 10259 11277 19459 29366 34945 35070 27416
3323 27416 12617 -4642 -9797 -10709 -6513 -1961 4831 -2853 -4765 12108 25167 19383 15853 23799
3309 23799 23063 24646 16974 9783 -980 -5930 10714 18928 11769 -325 -1685 -9322 -11857 -16315
$$ packed form
3411a817j3015Q22L623m380O879J2080M072J485j0274K543N486k030J0137L02
3397A5913m317m555M0m0o760o966P486m58J647k43l689j1702r340J1680J6246
3382D942j83O676J396n296j324j102O377J2214r157q400j610l635P277j0674N924
3367C425j784K060o613j525o622l520n417R777O679M026J4749N220K42j1532j4362
3352e197M295l899n75Q07J1000j312k2527j4683J528J2314J6052J2295l168r075
3338b145jm938j1376M685J3873L983J2345K910r077J018Q182R907N579J25p654
3323B7416j4799j7259n155r12M196M552O792p684j912J6873J3059n784l530P946
3309B3799p36J583p672p191j0763m950J6644Q214p159j2094j360p637k535m458
$$ plain form
3295 -16315 -10723 6771 18815 5598 -4730 -12672 -20368 -23795 -18439 -11680 -7643 -16738 -23302 -12527
3281 -12527 3839 5158 717 -11147 -19337 -18272 4708 26332 30956 23203 10998 -1298 -1594
3268 -1594 -1895 -6358 -15865 -10196 2654 16709 5757 -14505 -5681 3834 7329 -5994 -27017 -33766
3254 -33766 -24288 -4560 21993 19215 324 -5217 6769 4872 18759 37429 25987 12663 5967
3241 5967 -1195 793 1803 9946 12053 9852 9198 3183 -6444 -6444 -5148 -2888 -1658 6002 98 -8520
3225 -8520 -10607 -8648 -6342 -3143 -130 -1079 -6691 1767 12388 5127 -3471 -9103 -9900 18382 16109
3210 16109 -535 8405 -1024 -12833 -1621 14902 7345 -6474 2282 -1784 -5552 -8052 -7946 6484
3196 6484 5689 -2841 150 6657 6454 -7962 -8765 8463 5349 4667 1445 1539 4060 -4789 -4961 -1402
$$ packed form
3295a6315N592J7494J2044j3217j0328p942p696l427N356O759M037r095o564J0775
3281a2527J6366J319m441j1864q190J065K2980K1624M624p753j2205j2296k96
3268a594l01m463r507N669J2850J4055j0952k0262Q824R515L495j3323k1023o749
3254c3766R478J9728K6553k778j8891n541J1986j897J3887J8670j1442j3324o696
3241E967p162J988J010Q143K107k201o54o015r627%J296K260J230P660n904q618
3225h520k087J959K306L199L013r49n612Q458J0621p261q598n632p97K8282k273
3210A6109j6644Q940r429j1809J1212J6523p557j3819Q756m066l768k500J06J4430
3196F484p95q530K991O507k03j4416q03J7228l114o82l222R4K521q849j72L559
$$ plain form
3180 -1402 -3481 3554 2356 -3693 15184 5329 -7017 6365 13051 25222 18055 -4523 -4650 -4742
3166 -4742 -1957 2200 10219 19050 23824 22286 7420 -6975 -9193 -11893 -19002 -8307 1868 -242
3152 -242 -16686 -14355 -3368 12513 4977 2363 10832 12469 -3273 -17793 -19982 -10203 5102 10107
3138 10107 -3349 -10348 435 10745 -3302 -8110 2503 7213 16879 1805 -564 -3338 4067
3125 4067 1518 -3961 3019 -609 -9549 -18964 -17197 -11646 -10927 -6059 -16620 -18531 -2071 8185
3111 8185 -5952 -10902 -7873 6412 7652 -15377 -33103 -42953 -26453 -6809 -4172 -19609 -28540
3098 -28540 -21469 -12271 -8571 -675 -7407 -23350 -21708 -23570 -16240 -13445 -26618 -18813 -12178 -23126
3084 -23126 -13897 -628 3202 -11118 -9974 -3622 -21163 -32068 -17435 -9164 -13567 -19057 -16844
$$ packed form
3180a402k079P035j198o049J8877r855j2346J3382O686J2171p167k2578j27r2
3166d742K785M157Q019Q831M774j538j4866j4395k218k700p109J0695J0175k110
3152b42j6444K331J0987J5881p536k614Q469J637j5742j4520k189R779J5305N005
3138A0107j3456o999J0783J0310j4047m808J0613M710R666j5074k369k774P405
3125D067k549n479O980l628q940r415J767N551P19M868j0561j911J6460J0256
3111H185j4137m950L029J4285J240k3029j7726r850J6500J9644K637j5437q931
3098b8540P071R198L700P896o732j5943J642j862P330K795j3173P805O635j0948
3084b3126R229J3269L830j4320J144O352j7541j0905J4633Q271m403n490K213
$$ plain form
3071 -16844 -7850 4238 6557 -2822 -1858 -2023 -8727 -11502 -7300 -9412 -4354 -5215 -3945 1617 -5369
3056 -5369 3703 23451 27277 25555 24167 24444 22882 19453 936 -3044 -14856 -21657 -10553 8167
3042 8167 17577 1796 -9337 -11699 -14841 4456 13739 10956 12626 10576 6803 7049 2889 -2904
3028 -2904 3034 8650 15443 16853 14633 -2662 -21958 -27558 -22210 -17080 -14163 -3448 6464 10771
3014 10771 23200 19101 15423 13212 4497 611 6412 15306 24644 24530 22314 12209 4146 6580
3000 6580 18065 19348 9205 2182 7323 4651 9155 11686 -5334 11080 19262 7916 9948 5768
2986 5768 -10596 -25384 -17203 -7805 9446 9723 2460 2128 1273 2680 11810 13841 8196 -10049 -12670
2971 -12670 -10968 -12096 628 4870 18965 31421 22635 17440 4576 2697 -2271 -2406 11250 13231
$$ packed form
3071a6844Q994J2088K319r379R64j65o704k775M202k112N058q61J270N562o986
3056e369R072J9748L826j722j388K77j562l429j8517l980j1812o801J1104J8720
3042H167R410j5781j1133k362l142J9297R283k783J670k050l773K46m160n793
3028b904N938N616O793J410k220j7295j9296n600N348N130K917J0715R912M307
3014A0771J2429m099l678k211q715l886N801Q894R338j14k216j0105q063K434
3000F580J1485J283j0143p023N141k672M504K531j7020J6414Q182j1346K032m180
2986E768j6364j4788Q181R398J7251K77p263l32q55J407R130K031n645j8245k621
2971a2670J702j128J2724M242J4095J2456q786n195j2864j879m968j35J3656J981
$$ plain form
2957 13231 9319 19488 24965 14591 16299 21335 21116 18137 8727 13688 5220 -1796 -9184 -11291
2943 -11291 -760 6612 23912 16729 5425 -560 907 4300 -74 -9266 -13108 -13170 3046 6751
2929 6751 6305 6731 2092 -5974 -10726 -17757 -14264 -7992 -1750 2183 2783 7557 10355 2748 -12855
2914 -12855 -10710 -4277 8067 13123 -11391 -22740 -19867 -3584 -1660 -7037 -8889 -9742 -853 16641
2900 16641 23470 25271 30988 14388 1728 -12193 -16980 -20008 -16100 -5910 -4184 -9522 -13177 -8670
2886 -8670 6900 18442 17031 27493 31156 27283 20577 26958 39427 31564 9848 -4417 3172
2873 3172 2889 -19054 -20811 -11253 -3135 -18324 -17239 -10734 -6398 -12266 -15269 -4677 6794 -6756
2859 -6756 -5678 -2422 -8728 -14375 -11518 -10025 -14978 -23116 -21908 -9636 5927 5050 2254 -2324 -1086
$$ packed form
2957A3231l912J0169N477j0374J708N036k19k979r410M961q468p016p388k107
2943a1291J0531P372J7300p183j1304n985J467L393m374r192l842o2J6216L705
2929F751m46M26m639q066m752p031L493O272O242L933O00M774K798p607j5603
2914a2855K145O433J2344N056k4514j1349K873J6283J924n377j852q53Q889J7494
2900A6641O829J801N717j6600j2660j3921m787l028L908J0190J726n338l655M507
2886h670J5570J1542j411J0462L663l873o706O381J2469p863k1716j4265P589
2873C172k83k1943j757R558Q118j5189J085O505M336n868l003J0592J1471j3550
2859f756J078L256o306n647K857J493m953q138J208J2272J5563q77k796m578J238
$$ plain form
2844 -1086 -7955 -3089 -1336 -11881 -22880 -18279 -18987 -19972 -27854 -24162 -12352 -405 13460 18191
2830 18191 12195 -3683 -20004 -10256 -5436 133 7001 -8224 -23655 -20003 -11208 -1303 14309
2817 14309 18609 24208 11921 -8846 -5174 -1213 -1978 -3606 368 12469 24405 19290 -6567 -17852
2803 -17852 -3708 181 8935 13486 7187 -11009 -35194 -27662 -29731 -35511 -30255 -29185 -13448 -15091
2789 -15091 -28140 -26915 -44482 -55999 -45312 -22148 -13599 -4921 10703 7105 9806 8145 13619
2776 13619 19941 15701 19575 10412 193 11120 6144 -13668 -26462 -33242 -22949 -9823 1967
2763 1967 4245 5684 20548 6702 -2468 -14865 -20120 -1841 5440 14442 8957 -7546 -8090 -6811
2749 -6811 1793 -11585 -10780 -14808 -4165 6195 11196 3061 3494 1480 -3157 4252 7195 -1395 -9826
$$ packed form
2844a086o869M866J753j0545j0999M601p08r85p882L692J1810J1947J3865M731
2830A8191n996j5878j6321R748M820N569O868j5225j5431L652Q795R905J5612
2817A4309M300N599j2287k0767L672L961p65j628L974J2101J1936n115k5857j1285
2803a7852J4144L889Q754M551o299j8196k4185P532k069n780N256J070J5737j643
2789a5091j3049J225j7567j1517J0687K3164Q549Q678J5624l598K701j661N474
2776A3619O322m240L874r163j0219J0927m976j9812j2794o780J0293J3126J1790
2763A967K278J439J4864j3846r170j2397n255J8279P281R002n485j6503n44J279
2749f811Q604j3378Q05m028J0643J0360N001q135M33k014m637P409K943q590q431
$$ plain form
2734 -9826 2635 858 -13558 -18444 -13818 -29789 -36496 -29729 -26532 -16146 -2477 3330 9415 -5241
2720 -5241 -14158 -817 -7905 -7607 -11949 -11508 -7764 -3891 -7072 -17385 -21569 -14852 -16599 -17031 -13307
2705 -13307 -16728 -10064 -9418 -14262 -10882 -133 -142 -4266 7157 12593 5887 -844 -13362 5362 15270
2690 15270 12582 12238 11712 1542 -16126 -9240 -7531 1747 12840 10771 -2202 4569 7538 10754
2676 10754 24660 13680 -3581 -6356 -10228 -6096 6574 4238 5788 8285 1113 -5248 6359
2663 6359 6208 7646 8618 12441 27621 31823 21880 19425 7389 -5809 -18361 -10774 1181 790
2649 790 -9892 -16400 -18885 -11056 1876 781 3290 -412 -2498 2942 -58 -6873 621 13601
2635 13601 22165 7192 -1107 -17268 -9148 2188 -1360 2459 -6194 75 7548 11928 16940 -3524
$$ packed form
2734i826J2461j777j4416m886M626j5971o707O767L197J0386J3669N807O085j4656
2720e241q917J3341p088K98m342M41L744L873l181j0313m184O717j747m32L724
2705a3307l421O664O46m844L380J0749rm124J1423N436o706o731j2518J8724R908
2690A5270k688l44n26j0170j7668O886J709R278J1093k069j2973O771K969L216
2676A0754J3906j0980j7261k775l872M132J2670k336J550K497p172o361J1607
2663F359j51J438R72L823J5180M202r943k455j2036j3198j2552P587J1955l91
2649G90j0682o508k485P829J2932j095K509l702k086N440l000o815P494J2980
2635A3601Q564j4973q299j6161Q120J1336l548L819q653O269P473M380N012k0464
$$ plain form
2621 -3524 -12684 -11617 8513 19693 12296 -10811 -9933 -10267 -8610 1118 -2482 735 -8671 -13366 -17136
2606 -17136 -4742 -3722 3631 -2640 4801 20639 17887 8216 1151 -1385 -5885 -8265 -25414 -29793
2592 -29793 -25197 -26931 -21860 -17004 -13007 10673 28975 15116 4510 -290 4598 14316 27851
2579 27851 23258 4849 11816 19397 11726 -4460 -13904 -20443 -9640 -5005 -7246 1500 3848 73
2565 73 -8005 -2347 4488 5390 -367 -7229 -10607 -3460 8241 -8529 -10436 -10780 -4208 5993 5762
2550 5762 8054 19942 8899 -1585 -7534 -27530 -30250 -9258 5465 -8313 -8729 -7938 -13812 -13586
2536 -13586 -9353 -10093 -811 -1003 -14647 -10495 -8389 2590 12428 7028 225 -12940 -23530 -18661
2522 -18661 -10055 4678 -1420 -3172 -450 8719 3055 -8787 -11846 1316 15660 21239 18121 26527
$$ packed form
2621c524r160J067K0130J1180p397k3107Q78l34J657R728l600L217r406m695l770
2606a7136J2394J020P353o271P441J5838k752r671p065k536m500k380j7149m379
2592b9793M596j734N071M856L997K3680J8302j3859j0606m800M888R718J3535
2579B7851m593j8409O967P581p671j6186r444o539J0803M635k241Q746K348l775
2565G3q078N658O835R02n757o862l378P147J1701j6770j907l44O572J0201k31
2550E762K292J1888j1043j0484n949j9996k720K0992J4723j3778m16P91n874K26
2536a3586M233p40R282j92j3644M152K106J0979R838n400o803j3165j0590M869
2522a8661Q606J4733o098j752K722R169n664j1842l059J3162J4344N579l118Q406
$$ plain form
2508 26527 25612 3264 5121 17421 28368 20100 3050 6137 8380 6530 5019 10737 -2807 -3170
2494 -3170 -12867 -4808 6735 16962 9685 -5965 -7786 1571 -1961 -11180 2198 6267 -3520 -1238
2480 -1238 3517 1276 5682 13715 12802 3104 7728 13241 7630 -1092 392 -11012 -12131 -5585 4790
2465 4790 1269 -4374 -2414 -3024 -9051 -8008 808 14583 13808 2999 2528 7993 12755 4047 -5540
2450 -5540 -644 6639 4994 7865 11104 -14162 -21421 -18555 -6463 10910 13585 18667 2102 -2903
2436 -2903 -10960 -5760 3454 -4611 -4944 -6894 -7819 -3272 -12548 -7041 -3047 16606 18683 12989 -13871
2421 -13871 -16196 -2433 -8570 -15893 -11288 4558 6441 4922 3181 -3519 -11049 -17449 5536 28460
2407 28460 19888 20951 27690 21135 7562 1719 1818 -1167 5715 18309 18077 -2116 4 -3309 -9741
$$ packed form
2508B6527r15k2348J857J2300J0947q268j7050L087K243j850j511N718j3544l63
2494c170r697Q059J1543J0227p277j5650j821R357l532r219J3378M069r787K282
2480a238M755k241M406Q033r13r698M624N513n611q722J484j1404j119O546J0375
2465D790l521n643J960o10o027J043Q816J3775p75j0809m71N465M762q708r587
2450e540M896P283j645K871L239k5266p259K866J2092J7373K675N082j6565n005
2436b903q057N200R214q065l33j950r25M547r276N507L994J9653K077n694k6860
2421a3871k325J3763o137p323M605J5846J883j519j741o700p530o400K2985K2924
2407B8460q572J063O739o555j3573n843R9k985O882J2594k32k0193K120l313o432
$$ plain form
2392 -9741 278 3396 -6289 -18972 -24796 -6780 1620 247 -3808 -10396 -7811 -435 -135 6961
2378 6961 15030 5359 -8991 -11734 -13083 -13313 -26102 -21970 -22673 -19421 -14676 -3300 6251 11997 7219
2363 7219 9559 5661 1609 -3282 5048 15796 16339 -5847 -13126 -3429 15681 20505 13658 9646
2349 9646 8263 4212 -7323 -7497 -7262 -8213 20635 22095 12350 -2606 -6379 -4024 -5769 -7357 -2740
2334 -2740 18900 14246 -1853 4343 24666 23805 16563 -1155 -5906 4070 -5312 -8561 -12858 -7469
2320 -7469 -9601 3242 7951 4309 3264 8644 -7553 1887 5456 4463 6913 -4773 -7304 -7430 -1716
2305 -1716 4523 5676 -13083 -14609 -4661 8901 10764 9495 22425 23637 11882 17673 12424 8283
2291 8283 16206 43 -22073 -32792 -20276 4011 23031 35473 12421 -2455 2186 192 -4121
$$ packed form
2392i741J0019L118r685j2683n824J8016Q400j373m055o588K585P376L00P096
2378F961Q069r671j4350k743j349k30j2789M132p03L252M745J1376R551N746m778
2363G219K340l898m052m891Q330J0748N43k2186p279R697J9110M824o847m012
2349I646j383m051j1535j74K35r51K8848J460r745j4956l773K355j745j588M617
2334b740K1640m654j6099O196K0323q61p242j7718m751R976r382l249m297N389
2320g469k132J2843M709l642j045N380j6197R440L569r93K450j1686k531j26N714
2305a716O239J153j8759j526R948J3562J863j269J2930J212j1755N791n249m141
2291H283P923j6163k2116j0719J2516K4287J9020J2442k3052j4876M641j994m313
$$ plain form
2278 -4121 -12590 -11529 -16223 -16769 -13561 -18516 -5967 12090 7883 -4358 1485 6570 5006 -2120
2264 -2120 2735 8995 -11912 -25297 -7115 12053 36073 35694 9034 -1475 13762 28998 34270
2251 34270 28337 15696 900 -686 10226 12390 12753 15782 6507 6691 10861 14219 11136 17199
2237 17199 21271 20645 28073 9813 -8548 -6192 -1540 -3157 -14973 -17059 -9115 8817 -384 -13819
2223 -13819 -21101 -21997 -10004 1691 -1074 -13369 -19063 -12744 -176 1128 -4078 -13072 -21917 -22547
2209 -22547 -5264 1525 -7662 946 3854 -728 -3270 -7256 -12784 -14827 -10059 -10386 -14094 -20886 -8033
2194 -8033 3884 2712 -9493 -20253 -15842 -28016 -25602 -17888 5553 22696 17392 17704 6555
$$ packed form
2278d121q469J061m694n46L208m955J2549J8057m207j2241N843N085j564p126
2264b120M855O260k0907j3385J8182J9168K4020l79k6660j0509J5237J5236N272
2251C4270n933j2641j4796j586J0912K164L63L029r275J84M170L358l083O063
2237A7199M072o26P428j8260j8361K356M652j617j1816k086P944J7932r201j3435
2223a3819p282q96J1993J1695k765j2295n694O319J2568J304n206q994q845o30
2209b2547J7283O789r187Q608K908m582k542l986n528k043M768l27l708o792J2853
2194h033J1917j172j2205j0760M411j2174K414P714K3441J7143n304L12j1149
$$ [...]
##END NTUPLES=NMR SPECTRUM
##END=
