##TITLE=Analysis number 326604
Compound Code cc 63801
Book Reference 511/76
Project Code adrs
Chemist Name stevem
##JCAMPDX= 6.0         $$ Bruker NMR JCAMP-DX V2.0
##DATA TYPE= NMR SPECTRUM
##DATA CLASS= NTUPLES
##ORIGIN= Bruker BioSpin GmbH
##OWNER= nmr
$$ XWIN-NMR		Version 3.5
$$ Thu Feb 15 09:28:16 2007 GMT Standard Time (UT+0h)  MAYBRIDGE\nmr@NMR_250MHZ
##.OBSERVE FREQUENCY= 250.131544655141
##.OBSERVE NUCLEUS= ^1H
##.ACQUISITION MODE= SIMULTANEOUS (DQD)
##.ACQUISITION SCHEME= undefined
##.AVERAGES= 16
##.DIGITISER RES= 18
##SPECTROMETER/DATA SYSTEM= dpx250
##.PULSE SEQUENCE= zg30
##.SOLVENT NAME= DMSO
##.SHIFT REFERENCE= (INTERNAL, DMSO, 0, 16.522)
##AUDIT TRAIL= $$ (NUMBER, WHEN, WHO, WHERE, WHAT)
$$ ##TITLE= Audit trail, XWIN-NMR		Version 3.5
$$ ##JCAMPDX= 5.01
$$ ##ORIGIN= Bruker BioSpin GmbH
$$ ##OWNER= nmr
$$ C:\u/data/dgb/nmr/ADRS/920/pdata/1/auditp.txt
$$ ##AUDIT TRAIL=  $$ (NUMBER, WHEN, WHO, WHERE, WHAT)
(   1,<2007-02-15 09:27:54.08 +000>,<MAYBRIDGE\nmr>,<NMR_250MHZ>,
      <created by zg, POWCHK disabled, PULCHK disabled
       configuration hash MD5:
       49 4B E0 1D 92 C2 6B 37 9F E6 65 BC 52 41 86 1D
       data hash MD5: 64K
       13 DF 3C 03 83 EA E3 B6 E7 70 BB B2 3B 18 58 BE>)
(   2,<2007-02-15 09:28:07.52 +000>,<MAYBRIDGE\nmr>,<NMR_250MHZ>,
      <Start of raw data processing
       ef LB = 0.3 FT_mod = 6 PKNL = 1 SI = 32K 
       data hash MD5: 32K
       DC D6 CD A1 45 7E DE CD 54 6D 6F 2D 3D A9 FB 56>)
(   3,<2007-02-15 09:28:09.18 +000>,<MAYBRIDGE\nmr>,<NMR_250MHZ>,
      <apk 
       data hash MD5: 32K
       CD 0A 5C D5 50 27 68 09 54 1E 83 2E 28 6D 6B BC>)
(   4,<2007-02-15 09:28:10.08 +000>,<MAYBRIDGE\nmr>,<NMR_250MHZ>,
      <abs ABSG = 5 
       data hash MD5: 32K
       FD 49 D5 43 76 88 4E 68 AC 86 3A AE 31 3A F5 85>)
$$ ##END=
$$ 
$$ hash MD5
$$ A0 48 D4 22 9A 58 4B 6C 32 D6 32 3F 66 B8 67 FB
##$RELAX= 
##$RELAX= 
##$RELAX= 
##$RELAX= 
##$RELAX= 
##$RELAX= 
##$RELAX= 
$$ Bruker specific parameters
$$ --------------------------
##$DU= <C:\u>
##$EXPNO= 920
##$NAME= <ADRS>
##$PROCNO= 1
##$TYPE= <nmr>
##$USER= <dgb>
##$AMP= (0..31)
100 100 100 100 100 100 100 100 100 100 100 100 100 100 100 100 100 100 
100 100 100 100 100 100 100 100 100 100 100 100 100 100 
##$AQSEQ= 0
##$AQ_mod= 3
##$AUNM= <au_zg>
##$AUTOPOS= <54 >
##$BF1= 250.13
##$BF2= 250.13
##$BF3= 250.13
##$BF4= 250.13
##$BF5= 500.13
##$BF6= 500.13
##$BF7= 500.13
##$BF8= 500.13
##$BYTORDA= 1
##$CFDGTYP= 0
##$CFRGTYP= 5
##$CHEMSTR= <none>
##$CNST= (0..31)
1 1 145 1 1 1 1 1 1 1 1 1 1 1 1 1 1 1 1 1 1 1 1 1 1 1 1 1 1 1 1 1 
##$CPDPRG= <>
##$CPDPRG1= <>
##$CPDPRG2= <>
##$CPDPRG3= <>
##$CPDPRG4= <mlev>
##$CPDPRG5= <mlev>
##$CPDPRG6= <mlev>
##$CPDPRG7= <mlev>
##$CPDPRG8= <mlev>
##$CPDPRGB= <>
##$CPDPRGT= <>
##$D= (0..31)
0 1 0 0 0 0 0 0 0 0.06 0 0 0 0 0 0 0.0002 0 0 0 0 0 0 0 0 0 0 0 0 0 0 
0 
##$DATE= 1171531673
##$DBL= (0..7)
120 120 120 120 120 120 120 120 
##$DBP= (0..7)
150 150 150 150 150 150 150 150 
##$DBP07= 0
##$DBPNAM0= <>
##$DBPNAM1= <>
$$ [...]
##$SUBNAM7= <"">
##$SUBNAM8= <"">
##$SUBNAM9= <"">
##$SW= 20.6930455092707
##$SWIBOX= (0..15)
0 0 3 0 0 0 0 0 0 0 0 0 0 0 0 0 
##$SW_h= 5175.983436853
##$TD= 65536
##$TD0= 1
##$TE= 295.16
##$TE2= 300
##$TE3= 300
##$TEG= 300
##$TL= (0..7)
0 120 120 120 120 120 120 120 
##$TP= (0..7)
150 150 150 150 150 150 150 150 
##$TP07= 0
##$TPNAME0= <>
##$TPNAME1= <>
##$TPNAME2= <>
##$TPNAME3= <>
##$TPNAME4= <>
##$TPNAME5= <>
##$TPNAME6= <>
##$TPNAME7= <>
##$TPOAL= (0..7)
0.5 0.5 0.5 0.5 0.5 0.5 0.5 0.5 
##$TPOFFS= (0..7)
0 0 0 0 0 0 0 0 
##$TUNHIN= 0
##$TUNHOUT= 0
##$TUNXOUT= 0
##$USERA1= <user>
##$USERA2= <user>
##$USERA3= <user>
##$USERA4= <user>
##$USERA5= <user>
##$V9= 5
##$VALIST= <valist>
##$VCLIST= <CCCCCCCCCCCCCCC>
##$VD= 0
##$VDLIST= <DDDDDDDDDDDDDDD>
##$VPLIST= <PPPPPPPPPPPPPPP>
##$VTLIST= <TTTTTTTTTTTTTTT>
##$WBST= 1024
##$WBSW= 4
##$XGAIN= (0..3)
0 0 0 0 
##$XL= 0
##$YL= 0
##$YMAX_a= 284030
##$YMIN_a= -358917
##$ZGOPTNS= <>
##$ZL1= 120
##$ZL2= 120
##$ZL3= 120
##$ZL4= 120
##$ABSF1= 16.522
##$ABSF2= -4.171173
##$ABSG= 5
##$ABSL= 3
##$ALPHA= 0
##$AQORDER= 0
##$ASSFAC= 0
##$ASSFACI= 0
##$ASSFACX= 0
##$ASSWID= 0
##$AUNMP= <proc_1d>
##$AZFE= 0.1
##$AZFW= 0.1
##$BCFW= 0
##$BC_mod= 0
##$BYTORDP= 0
##$COROFFS= 0
##$CY= 12.5
##$DATMOD= 1
##$DC= 0
##$DFILT= <>
##$DTYPP= 0
##$F1P= 14.0000005364418
##$F2P= -0.99999901652339
##$FCOR= 0.5
##$FTSIZE= 32768
##$FT_mod= 6
##$GAMMA= 0
##$GB= 0
##$INTBC= 1
##$INTSCL= 1
##$ISEN= 128
##$LB= 0.3
##$LEV0= 0
##$LPBIN= 0
##$MAXI= 10000
##$MC2= 0
##$MEAN= 0
##$ME_mod= 0
##$MI= 0
##$NCOEF= 0
##$NC_proc= -5
##$NLEV= 6
##$NOISF1= 0
##$NOISF2= 0
##$NSP= 0
##$NTH_PI= 0
##$NZP= 0
##$OFFSET= 16.522
##$PC= 1
##$PHC0= 213.6336
##$PHC1= 9.290046
##$PH_mod= 1
##$PKNL= yes
##$PPARMOD= 0
##$PSCAL= 4
##$PSIGN= 0
##$REVERSE= no
##$SF= 250.13
##$SI= 32768
##$SIGF1= 0
##$SIGF2= 0
##$SINO= 400
##$SIOLD= 32768
##$SREGLST= <1H.DMSO>
##$SSB= 0
##$STSI= 32768
##$STSR= 0
##$SW_p= 5175.98343685301
##$SYMM= 0
##$S_DEV= 0
##$TDeff= 65536
##$TDoff= 0
##$TI= <Analysis number 999999
Compound Code 99
Book Reference 9
Project Code 9>
##$TILT= no
##$TM1= 0
##$TM2= 0
##$TOPLEV= 0
##$USERP1= <user>
##$USERP2= <user>
##$USERP3= <user>
##$USERP4= <user>
##$USERP5= <user>
##$WDW= 1
##$XDIM= 32768
##$YMAX_p= 387152128
##$YMIN_p= -354885
$$ End of Bruker specific parameters
$$ ---------------------------------
##NTUPLES= NMR SPECTRUM
##VAR_NAME=  FREQUENCY,     SPECTRUM/REAL,   SPECTRUM/IMAG
##SYMBOL=    X,             R,               I
##VAR_TYPE=  INDEPENDENT,   DEPENDENT,       DEPENDENT
##VAR_FORM=  AFFN,          ASDF,            ASDF
##VAR_DIM=   32768,         32768,           32768
##UNITS=     HZ,            ARBITRARY UNITS, ARBITRARY UNITS
##FACTOR=    0.157963299565203, 1,           1
##FIRST=     4132.6476996994, 0,             0
##LAST=      -1043.33573715361, 0,           0
##MIN=       -1043.33573715361, -354885,     0
##MAX=       4132.6476996994, 387152128,     0
$$ Real data points
##PAGE= N=1
##DATA TABLE= (X++(R..R)), XYDATA
$$ [...]
17373A36172j13533j07300k3495N4075K4999m7445N2733n0564M287J51928L5403
17362A17260p6429p0521q7808K6384P8463j07344p1410R4599Q4592N6441N177
17351D9404L9239p3228p278K1170p8904o5702l0748l3174j0817P5166P8990o1140
17339i7022q0506l823M8695J02432l446N5631K3605q960j05405m0627J7661n07
17327i2272N1766N9262j1457m7308M1192j6687j354j65804p3565K8348J12799
17316a15080Q5842Q592n5449p6355k2444J37822Q3973k465j22488k0867R019m3493
17304a33393O0292K7675J11368k7681n3054J2221l8164L0603l0004j14462N9046
17293i5553J00638J6102L5663p4129r14M1734l8348n4211L7978Q0635j6925r1802
$$ plain form
17373 136172 22639 -84661 -108156 -54081 -29082 -76527 -23794 -74358 -70071 81857 117260
17362 117260 40831 -29690 -117498 -91114 -12651 -119995 -191405 -96806 -12214 44227 49404
17351 49404 88643 15415 8137 29307 -49597 -115299 -146047 -179221 -190038 -114872 -35882 -97022
17339 -97022 -177528 -181351 -132656 -30224 -33670 21961 45566 36606 -68799 -109426 -91765 -92272
17327 -92272 -40506 18756 7299 -40009 1183 -15504 -16858 -182662 -256227 -227879 -115080
17316 -115080 -29238 -20646 -76095 -152450 -174894 -37072 46901 44436 -78052 -98919 -89900 -133393
17304 -133393 -73101 -45426 65942 38261 -14793 -2572 -40736 -10133 -40137 -154599 -95553
17293 -95553 5085 21187 56850 -17279 -18193 23541 -14807 -69018 -31040 49595 32670 -59132
17281e9132j0436N9994J3626o9186K8877M7038r6944o6475L4899N1765o3990q5674
17269b15638o1740K2187J16545J16652L6189r802L4115K0865l9259m2403l1071
17258e3360j02230k033N1242J49161Q3813m8802n2710j1051p4668l0586q151k664
17246a02039J3044k177q2634P6683k0760q3289k046R4424K2704M136J07506O1277
17234H6829p1674q3752j07399J8179R5292J2289p214l4320J20031K1112p6929
17223b7556k125O2083N0428m6780q9747L4635N9180j463m2300m8143L129m2618
17211i1277n3915M2683M8407L8489l1282m0116J42600K2941l9213m7675R0578
17200H2220M1482J815q8637p7863l0739j5511R5139o397l1760l6155L5889J4387
$$ plain form
17281 -59132 -69568 -9574 4052 -65134 -36257 10781 -86163 -152638 -117739 -65974 -129964 -215638
17269 -215638 -277378 -255191 -138646 -21994 14195 4393 38508 59373 20114 -22289 -53360
17258 -53360 -155590 -157623 -106381 42780 126593 77791 25081 14030 -60638 -91224 -99375 -102039
17246 -102039 -88995 -91172 -173806 -97123 -117883 -201172 -203218 -108794 -86090 -81954 25552 86829
17234 86829 15155 -68597 -175996 -157817 -62525 -50236 -57450 -91770 28261 49373 -27556
17223 -27556 -29681 32402 82830 36050 -53697 -19062 40118 38655 -3645 -51788 -48659 -91277
17211 -91277 -145192 -102509 -54102 -15613 -46895 -87011 55589 78530 39317 -8358 82220
17200 82220 123702 125517 36880 -40983 -71722 -87233 7906 1509 -30251 -66406 -30517 -16130
17188a6130n8361L5889P3848O7713j7444j19763j6133J1959n3093n1246K9531
17177a13230L2485k9296N7323N1993J1067J3920m59r224j9128P378N6431k6367
17165C2893m9319N7394J23819o3643j8429O1539p680K6093l5379q2928j4886j2879
17153A6595p9463J0155q170o1404M7124J03995r378l7930K8172J384o4973n6137
17141a10030M1893J50724K8233J6012p487L6226m1670r207q8256K0370o7724j4705
17129d5621m2752n0049J5061j4189M3225L3716j8720K9425j8582L5885M5430P3586
17117H6415N478l4753n2069l8336l7035N5713K3570q954j3578q477j3560Q936
17105b6650K6433M4103n3594q683O1425P6292n6463q5902o6653n3779N862N2521
$$ plain form
17188 -16130 -74491 -38602 35246 102959 85515 -34248 -50381 -38422 -91515 -142761 -113230
17177 -113230 -80745 -110041 -52718 -725 10342 24262 23803 14579 -4549 2829 59260 32893
17165 32893 -16426 40968 164787 101144 82715 144254 136574 162667 127288 44360 29474 16595
17153 16595 -62868 -52713 -60883 -122287 -75163 28832 19454 -18476 9696 11080 -53893 -110030
17141 -110030 -68137 82587 110820 126832 119345 155571 113901 104694 16438 36808 -30916 -45621
17129 -45621 -88373 -138422 -123361 -137550 -94325 -60609 -79329 -49904 -68486 -32601 12829 86415
17117 86415 91893 57140 5071 -33265 -70300 -14587 8983 29 -13549 -22026 -35586 -26650
17105 -26650 -217 43886 -9708 -18391 43034 119326 62863 -23039 -89692 -143471 -137609 -85088
17093h5088Q518n8745j9257K2550J11626J00998K2950k338p7482q9758J9575P2551
17081B6100n0959o5965L4313m6327j3536O8363M3619j23655r7344L7242J15711
17070g2438N4486N9438N266P221q8590l4721M0788r538L4013K1365K3677M5873
17058H6840o9605j8454l6345k4346k9709n9602L6881j4113M3171M6301o730J6360
17046b9351n4513l266k5308R182K7543J3391l410O7492O4261m1291p3495J9706
17034b9059Q168P364k869o8899P875j3480l979P8859p950L4379N3433o2470o1421
17021f0049L5820K8393q539m0817l2639j8061J1097J41146O0057l5231K284q1266
17009B195j16145J409L6142K5330J7369L1833j28343k4903M0804K6166P2552Q6954
$$ plain form
17093 -85088 -76570 -135315 -154572 -132022 -20396 80602 103552 101214 23732 -66026 -46451 26100
17081 26100 -24859 -90824 -56511 -102838 -116374 -48011 -4392 -128047 -225391 -188149 -72438
17070 -72438 -17952 41486 46752 53973 -34617 -69338 -28550 -38088 -4075 17290 40967 86840
17058 86840 17235 -1219 -37564 -61910 -91619 -151221 -114340 -128453 -85282 -38981 -45711 -29351
17046 -29351 -83864 -87130 -112438 -103256 -75713 -62322 -65732 1760 66021 24730 -48765 -29059
17034 -29059 -20891 -13527 -16396 -85295 -77420 -90900 -94879 -16020 -23970 10409 63842 1372 -60049
17021 -60049 -24229 4164 -4375 -45192 -77831 -95892 -84795 56351 116408 81177 83461 2195
17009 2195 -113950 -112541 -76399 -51069 -33700 -1867 -130210 -155113 -114309 -88143 -15591 71363
16997G1363k7249n2850n3292p7227n0515O8273R5970k7666O6242P7199O8974l8398
16985A20824r0983n6543k3763k508m0332N4566N6693M239o1499q2318L1053N0022
16973d0549M2390N0847L2232K6418j0904m609K4178j13456q2096j0458K1982J6683
16961d7342K3862O5686m1556j6736K4739k9843l5233N1287o730n0153k1259J8901
16949f4377L1693K1665Q655l4029m3660J8704n055R228p708j9446L666P3950p4855
16936h1569o5173M7888R0884J5389j91684q2229J10282J07206j5450Q8453N2638
16925G6635r980j04096n8123P2665L0651l8212J6412n5922q6771K843P8410m672
16913h0160p6000o2965N4562M6800m626P7854k7298l2416Q5502q5475m9882L6500
$$ plain form
16997 71363 44114 -8736 -62028 -139255 -189770 -121497 -25527 -53193 13049 90248 159222 120824
16985 120824 29841 -26702 -50465 -52973 -93305 -38739 17954 22193 -39306 -121624 -90571 -40549
16973 -40549 1841 52688 84920 111338 100434 95825 120003 6547 -75549 -86007 -64025 -47342
16961 -47342 -23480 42206 650 -16086 8653 -21190 -56423 -5136 -11866 -62019 -83278 -64377
16949 -64377 -32684 -11019 -2364 -36393 -80053 -61349 -66404 -57176 -64884 -84330 -80664 -6714 -81569
16936 -81569 -146742 -98854 -7970 7419 -184265 -266494 -156212 -49006 -64456 23997 76635
16925 76635 66655 -37441 -95564 -22899 7752 -30460 -14048 -69970 -156741 -153898 -75488 -80160
16913 -80160 -156160 -219125 -164563 -117763 -122389 -44535 -71833 -104249 -18747 -104222 -154104 -117604
16901a17604L9870o3086N6731R069m6968m9396J32937K5956p9729l2698k1544
16890a46462Q0490J11328o7250l8503m7272o9470k403Q0644J27996Q4226p0361
16879D2963j6762r5534l4081o8538J8713K875j7001J2981J32355q577n0905o4380
16867a45891O8945N1660j6452K7456L0580O1950l3936k7751l4846J3100J1725
16856F540j01837p5210L3935l9972M0307m4082O1019R1313J9040n3594n2316m9014
16844a63871j11594p9420J58019J71158M841J0376n1057J4585N8472j7352m6342
16833e2185O55m7841l5346R4682J23805M1355q0137q1728j02365Q3296J50856
16822I5047l3531o0067r0847m1490l5904l2929J56304R2189n3585K0934l1461
$$ plain form
16901 -117604 -77734 -140820 -84089 -75020 -121988 -171384 -38447 -12491 -92220 -124918 -146462
16890 -146462 -65972 45356 -21894 -60397 -107669 -177139 -179542 -98898 29098 113324 42963
16879 42963 26201 -69333 -103414 -171952 -153239 -150364 -167365 -154384 -22029 -30606 -81511 -145891
16867 -145891 -76946 -25286 -41738 -14282 16298 78248 44312 16561 -18285 -5185 6540
16856 6540 -95297 -170507 -136572 -176544 -136237 -180319 -119300 -27987 -8947 -62541 -114857 -163871
16844 -163871 -275465 -354885 -196866 -25708 -20867 -10491 -61548 -46963 11509 -5843 -52185
16833 -52185 -51530 -99371 -134717 -40035 83770 125125 44988 -36740 -139105 -55809 95047
16822 95047 61516 1449 -89398 -130888 -166792 -199721 -43417 48772 -4813 16121 -15340
16811a5340m0007j7418N06P4147R094K846q0947N4401m8160j12170N0871J48195
16799B6018J01629j08447p6301M225L5189K5107R8852L4938l9960j2270K1029
16788A10009m5492K4104M6234n4919n5974p0608j16044m4584J26643R8438O002
16777B3809n9175j9186P3383m8839L164K1738p5750n2959l6383K3694p1698J18124
16765a00078J06265r629N705m3044l385P1826K6525r227k6753r376p0688O5428
16753C569q1849o8240J1366M9476J7336M015K8540M2732J666j32894L3694Q6921
16741c668M5078N9493k9910r1720m2342j7377O5072k0778K8815Q3900j2393N1104
16729A15274o8693L9117L9827r2255n4760L2223j3224Q641M6857L6153k8646M8444
$$ plain form
16811 -15340 -55347 -72765 -72259 1888 10982 13828 -67119 -12718 -60878 -173048 -122177 26018
16799 26018 127647 19200 -57101 -52876 -17687 7420 106272 141210 101250 88980 110009
16788 110009 64517 88621 134855 79936 23962 -46646 -162690 -207274 -80631 17807 23809
16777 23809 -35366 -54552 18831 -30008 -26844 -5106 -80856 -133815 -170198 -146504 -218202 -100078
16765 -100078 6187 -3442 2263 -40781 -44166 27660 54185 44958 18205 8829 -61859 3569
16753 3569 -78280 -146520 -135154 -85678 -68342 -64327 -35787 6945 8611 -124283 -90589 -3668
16741 -3668 41410 100903 70993 -20727 -63069 -80446 -15374 -36152 -7337 76563 64170 115274
16729 115274 46581 85698 125525 33270 -21490 10733 -2491 6150 53007 89160 60514 108958
16717A08958K7938k1221l9913L7475j00557l1491N5236L3166p7798j16899K6920
16706i8186L8122L2942l2119o742J7165J23006p907K8295n1390j8328L3121N4293
16694A12272l3908j01411r2548l1576J23855P2759k3183j915j7234j7947M9161
16683C8325l3205o2105J0181J18726j5646k672M4924n7636p4831k632m637q8031
16671a29239R806P7531l4486m6740K5775J19803Q8144o2865m8713r0617l3557
16660a25158L5204j4250k6989o0718p623J31700o532j06666m0285O7940R1556
16649f1821K247P332o2456o6569J3565J24413K6404n1022n8516J055l5708O0415
16637a00661J13527J38192l4044j50137o3519j8839O6854M7451m3435K0083K9508
$$ plain form
16717 108958 136896 115675 75762 113237 12680 -18811 36425 69591 -8207 -125106 -98186
16706 -98186 -60064 -27122 -59241 -65983 -48818 74188 66281 94576 43186 24858 57979 112272
16694 112272 78364 -23047 -115595 -147171 -23316 49443 26260 24345 7111 -10836 38325
16683 38325 5120 -56985 -46804 71922 56276 53604 98528 40892 -33939 -36571 -41208 -129239
16671 -129239 -119433 -41902 -76388 -123128 -97353 22450 110594 47729 -984 -91601 -125158
16660 -125158 -89954 -104204 -131193 -191911 -199534 -67834 -74366 -181032 -221317 -153377 -61821
16649 -61821 -59574 -52242 -114698 -181267 -167702 -43289 -16885 -67907 -126423 -125368 -161076 -100661
16637 -100661 12866 151058 117014 -33123 -96642 -115481 -48627 -1176 -44611 -24528 4980
16626D980K9151P576K3259n0632M7801J3120k4609j9839M1969m2420q9705N9569
16614B20R6700k0925p0421j50066k463r891O3733p482R5991n390k5949R9516p7184
16601a3611J03847l1318j66443n5654J13945J26279L8527P1107j11289q0341l5253
16590d0204k2949M0145j6633O8842j0366R575r992p1224K2869n6413p3882K9385
16578a30847J27379p945l5711m4551m1521r451R0404R2206l5832j27745l4618
16567a58232j3149J6846N398n5061J337N0805n0476K5834M3787j3839m4830n2191
16555b43771M746O503R2603L3473j1120k3374J00403R1266j3804L949k834n8187
16543b0147l2940k8448N9342L7245j18969o9127J3059M7102l8294P7302J15618
$$ plain form
16626 4980 34131 41707 64966 14334 62135 75255 50646 30807 72776 30356 -59349 220
16614 220 96920 75995 5574 -144492 -146955 -156846 -93113 -100595 -4604 -9994 -35943 63573 -13611
16601 -13611 90236 58918 -107525 -163179 -49234 77045 115572 186679 75390 -4951 -40204
16590 -40204 -63153 -23008 -39641 29201 18835 28410 18418 -52806 -29937 -86350 -160232 -130847
16578 -130847 -3468 -11413 -47124 -91675 -133196 -142647 -52243 39963 4131 -123614 -158232
16567 -158232 -171381 -154535 -149137 -204198 -202861 -152056 -202532 -176698 -132911 -146750 -191580 -243771
16555 -243771 -239025 -232522 -139919 -106446 -117566 -140940 -40537 50729 36925 40874 38040 -20147
16543 -20147 -53087 -81535 -22193 15052 -103917 -173044 -159985 -112883 -151177 -73875 41743
16532D1743P6474j27071n0923M0744M6494j6629O1861p0478o9909n032o3567K5612
16520a10681O1975m1229j6344L6795J96340m6611o0185l5082j7141j809m653R215
16508b9410j5650l1866L2326m0215p728J5034M0742q1729k7897K7335Q5960N1035
16496A7937n9794K9514K4410n485Q6679j0012n6002j38723O620J36006O7367P205
16484A05722j2010q9977j57465n3752J27861J97126n4811K2545j0720k5545q952
16473D0022m0215j7782P8948N390j8975K4959P7907o476J7028m3807q0569l3235
16461C195j04424L2079K4433m3014L5173J09527O3820j3598l5262j7184j06167
16450e1422j34600K0037P8857R0633M6412N587m2230P4175O6950j17972q5583
$$ plain form
16532 41743 118217 -8854 -59777 -19033 27461 10832 72693 2215 -67694 -72726 -136293 -110681
16520 -110681 -48706 -89935 -106279 -69484 126856 80245 20060 -15022 -32163 -33972 -38625 -29410
16508 -29410 -45060 -76926 -44600 -84815 -92543 -77509 -36767 -118496 -146393 -119058 -33098 17937
16496 17937 -41857 -12343 12067 6582 93261 83249 27247 -111476 -104856 31150 98517 105722
16484 105722 93712 3735 -153730 -207482 -79621 117505 62694 85239 74519 48974 40022
16473 40022 -193 -17975 60973 66363 47388 72347 150254 143778 160806 116999 36430 3195
16461 3195 -101229 -69150 -44717 -87731 -52558 56969 120789 107191 71929 54745 -51422
16450 -51422 -186022 -165985 -87128 3505 49917 55504 13274 87449 154399 36427 -49156
16439d9156m8272N0138Q4695J677p2330o9653Q8057J46806K127j17944M4557Q0220
16427A40922o190q9826j29116j9541m9584Q3508O2460Q4557j2724n3106O3643
16416G5003K6625J7601K3574j1955q7250k4993M3117O3534q0098l3485P2648k1770
16404F2551n7635o3491O1495R917l8084k7091p2909o6782o962J08479L9622m0441
16392i1331r3363m9469M9967K7114J5862M3685M8468j2504M2304Q2611O6419J3067
16380A42830L7831n9922n5843L967p1640o1350n9008p7647J2819J17927P4401
16369D365L681K7560Q3543L255m6838k1003j3199n7829m7130K3235P0063O7668
16357I7371o9392p4913K2941j03317j52217M7938J33161Q9720j390q8338r9400
$$ plain form
16439 -49156 -97428 -47290 37405 39082 -33248 -102901 -14844 131962 134089 16145 60702 140922
16427 140922 134732 44906 -84210 -103751 -153335 -69827 -7367 77190 64466 11360 75003
16416 75003 101628 119229 142803 130848 43598 18605 61722 125256 45158 11673 84321 62551
16404 62551 4916 -58575 2920 12837 -25247 -52338 -125247 -192029 -198991 -90512 -50890 -91331
16392 -91331 -184694 -234163 -184196 -157082 -141220 -97535 -49067 -61571 -19267 63344 129763 142830
16380 142830 180661 120739 64896 68863 -2777 -64127 -123135 -200782 -187963 -70036 4365
16369 4365 8046 35606 119149 122404 75566 54563 41364 -16465 -63595 -40360 29703 97371
16357 97371 27979 -46934 -23993 -127310 -279527 -231589 -98428 -8708 -10098 -98436 -197836
16346a97836J0880L6985O5920M2734o134l2825l787O7159P6833m8112l8541j3168
16334c9892N4249R285N0734o0598L9203n2120p8151K7411P3236M2588l4707j0060
16322B1178j00392l8976r166J3523q4816p0549k2725L4968j8835J57800J03124
16311a4866Q7845M2155q638m4996L8561j21446p0198l8034j5360l849j9357J02739
16299f5444J10301l9446n4629n4837M7978P5032N9127l613o7455m1335j6505k7570
16287g8396K9089R1898q451M4121O5068j08221n8321n4441J2731l658Q7324Q0864
16275I9607M1604J2310m9864j38655n6737m835q2150k5347J0793j9095K8075P4883
16263a09411M2318P6246m7644O715P395k5243K0134j006q3740O0293R9924k0758
$$ plain form
16346 -197836 -186956 -149971 -84051 -41317 -47451 -80276 -84063 -16904 59929 11817 -26724 -39892
16334 -39892 14357 23642 74376 13778 52981 861 -77290 -49879 23357 65945 31238 21178
16322 21178 -79214 -118190 -127356 -113833 -198649 -269198 -291923 -256955 -275790 -117990 -14866
16311 -14866 72979 115134 106496 61500 100061 -21385 -91583 -129617 -144977 -148826 -168183 -65444
16299 -65444 44857 5411 -49218 -104055 -56077 18955 78082 74469 7014 -34321 -50826 -78396
16287 -78396 -49307 42591 34140 78261 143329 35108 -23213 -77654 -64923 -68581 18743 99607
16275 99607 141211 153521 103657 -34998 -91735 -96570 -178720 -204067 -193274 -212369 -184294 -109411
16263 -109411 -67093 9153 -38491 -31776 -24381 -49624 -29490 -30496 -114236 -53943 45981 25223
16251B5223l3144n1517j4892K3315k923m1593o5592j7047n8933j6037M4045J07380
16239a01715J22055p3724j10234n0126L8396P0646O9651j2182j1516K4959K4714
16228i076Q1920K9913K490n3268n8668P041K1847j7426L667p7196l6592k4650
16216a29998j1034r4117M8976O3938M6191K1435m3059o9262R734M8796k177q3980
16204a94557R9254J88638l8144j03427l7372N1322k0579l0685O528K1318J9946
16193c7758m3786M7518n813J3573n9216k5499L410O427j9203p1457R0265J26670
16181B5131Q8159O4585r5010q8960n415l2008k0513L2630Q4091O4755K4417m3671
16169I8191k3449m4202p4536J7754l3788q5258k7087O4554m8512N5911J18528
$$ plain form
16251 25223 -7921 -59438 -74330 -51015 -53938 -95531 -161123 -178170 -237103 -253140 -209095 -101715
16239 -101715 20340 -53384 -163618 -213744 -175348 -104702 -35051 -47233 -58749 -33790 -9076
16228 -9076 72844 102757 105247 51979 -6689 352 22199 4773 8440 -68756 -105348 -129998
16216 -129998 -141032 -235149 -186173 -122235 -76044 -54609 -97668 -166930 -157196 -108400 -110577 -194557
16204 -194557 -95303 93335 55191 -48236 -85608 -34286 -54865 -85550 -79022 -57704 -37758
16193 -37758 -81544 -34026 -39839 -26266 -85482 -110981 -107571 -101144 -120347 -191804 -101539 25131
16181 25131 113290 177875 82865 -6095 -11510 -43518 -64031 -31401 52690 117445 141862 98191
16169 98191 74742 30540 -43996 -26242 -60030 -145288 -172375 -107821 -156333 -100422 18106
16158A8106L3714k709L3201m395K61N9174p651j6661l7777n9126j4623k7742M5845
16145A9617J4869m3404l6315L3296M7378p4126p572O5153N2098m6733p1287N530
16133d1496J12871N8524j2438m5442j0228K6876K5904m0283o8365k40K9352M5234
16121H0269j26909o6136q5m4227k5831M6979M6635o9198K3638q15k0029J00072
16109e5637k7082j4353K5914Q940M8007L0119R935m7868L919j3463n792P750K6153
16096c458k7762n4918J33583J24994o013q7739j08082o9044R6016M9264k2984
16085B3857O4102n723J1657o6722j11904q440J2142K1235J05661R4557o4974r080
16073F6368o4095o6101L0291l6563l3230o4834N2566L7798j0303R4021Q0299J7448
$$ plain form
16158 18106 51820 49111 82312 77917 78178 137352 129701 113040 75263 16137 1514 -26228 19617
16145 19617 34486 -8918 -45233 -11937 35441 -38685 -46257 18896 70994 24261 -47026 -41496
16133 -41496 71375 129899 117461 72019 61791 88667 114571 74288 5923 5683 35035 80269
16121 80269 -46640 -112776 -112861 -157088 -182919 -135940 -89305 -158503 -134865 -135680 -155709 -55637
16109 -55637 -82719 -97072 -71158 -62218 -14211 15908 25843 -22025 -18106 -31569 -37361 -29611 -3458
16096 -3458 -31220 -86138 47445 172439 166426 78687 -29395 -98439 -2423 46841 23857
16085 23857 87959 82236 93893 27171 -84733 -93173 -81031 -59796 45865 140422 75448 66368
16073 66368 2273 -63828 -33537 -70100 -103330 -168164 -115598 -77800 -88103 5918 86217 103665
16061A03665l1447q7738o8394n4850R729K383J00457J1853M8802K9790p8971j9771
16049c4492L1101M1169K7529m9455o2936q6097l3028J13964N8124k2395Q2683
16038F6167N434l1671n3525J2639K1037j1282j1859j5382r1671o1596M2340m0175
16026a69544j4578O1792J44241j5098n8240Q471j7021l0957K7461J8204J6477
16015b8792O942n6357r0705O1122R2468N8487O112n9868K654j30113n3791P9024
16003a12817O9953k8931o6678J4705Q4688l9861n6010N9232j13754m917O3976
15992a30414Q9432M6256j561j06984l0571J15014J6012k8995O274m0178o6525
15981a32240L978M5937j8101n1564K2876j5712J1210J21637O6651n8765n3482
$$ plain form
16061 103665 72218 -15520 -83914 -138764 -129035 -126652 -26195 -14342 34460 64250 -14721 -34492
16049 -34492 -3391 37778 65307 15852 -47084 -133181 -166209 -52245 5879 -16516 66167
16038 66167 71601 39930 -13595 -956 20081 8799 -3060 -18442 -110113 -171709 -129369 -169544
16026 -169544 -184122 -122330 21911 6813 -51427 -42956 -59977 -90934 -63473 -45269 -28792
16015 -28792 -21850 -78207 -168912 -107790 -15322 43165 49277 -10591 -7937 -138050 -191841 -112817
16003 -112817 -42864 -71795 -138473 -123768 -39080 -78941 -134951 -75719 -189473 -194390 -130414
15992 -130414 -40982 5274 3713 -103271 -133842 -18828 -2816 -31811 -25537 -65715 -132240
15981 -132240 -128262 -82325 -100426 -151990 -129114 -144826 -133616 -11979 54672 -4093 -57575
15970e7575j1836m0187M4720O7195O0807j2346m0744m9859J0837P3264m8594J3666
15958I348L3778r0629K0056O8761j849p9588M1439L7777J66272k4428j49585m3542
15946a2190Q3263L0553l545j31508j37081j0718j3117n264J21898J03426o4603
15935c8886k9266p438P0699o2291q3327L779Q3674J7999m2147n0832q81P0969
15923f7948J10620K2461n9027r033q509q4548J7072j5494K4240O497j02809m6372
15911b12850J1700j3917R778P8990O0911m1803j19250J7555M2715N9829J33928
15900B7586Q7043l4547j03395K5273K9142N5036j6084j05349q511m1948k0236
15889a05990J8189M3686o3316q7768O7020n4413m0334Q4783p678j5512K2655M2741
$$ plain form
15970 -57575 -69411 -109598 -64878 2317 63124 50778 10034 -39825 -28988 44276 -4318 9348
15958 9348 43126 -47503 -27447 41314 39465 -40123 1316 39093 205365 180937 31352 -12190
15946 -12190 71073 101626 98081 -33427 -170508 -181226 -194343 -199607 -77709 25717 -38886
15935 -38886 -68152 -75590 -4891 -67182 -150509 -146730 -63056 -45057 -87204 -138036 -138917 -67948
15923 -67948 42672 65133 6106 -2927 -11436 -95984 -78912 -94406 -70166 -63669 -166478 -212850
15911 -212850 -201150 -215067 -205289 -126299 -65388 -107191 -226441 -208886 -166171 -106342 27586
15900 27586 114629 80082 -23313 1960 31102 86138 70054 -35295 -43806 -85754 -105990
15889 -105990 -87801 -44115 -107431 -195199 -128179 -182592 -222926 -138143 -145821 -161333 -138678 -95937
15877i5937j0453l6956p83K1995K1973Q2410Q5476q6047o4822K5642l6844j1554
15865a05900O4725O0294J0318n5907l2578o4302m9299O4550N0705L2939j05903
15854a30358o9364P4571N2000m8036n4532Q0002Q1886J894m801Q4791M7250m3152
15842G2151q4832j9567J6911k0352j1266m5605n7630r1778Q5267N1259l9732M0420
15830a04754M9539N4587J4129q1268l922J8138M5095R071q300M0286O1420j6008
15818G8013l4112j17582Q086N3425N0459r0156j5415N5078o9567j09252k837P6335
15806a17525l157K2044O1607P4088L9292n6525j4926P2721n5368l4765m5822n2481
15794a10817N9756P09p2321j395M8033j0454L4559O5136n2847l1409q1698Q1988
$$ plain form
15877 -95937 -106390 -143346 -144129 -122134 -100161 -17751 67725 -18322 -83144 -57502 -94346 -105900
15865 -105900 -41175 19119 29437 -26470 -59048 -123350 -172649 -108099 -57394 -24455 -130358
15854 -130358 -199722 -125151 -73151 -121187 -175719 -95717 -13831 -11937 -16738 68053 115303 72151
15842 72151 -12681 -32248 -15337 -35689 -46955 -92560 -150190 -241968 -156701 -105442 -145174 -104754
15830 -104754 -55215 -628 13501 -67767 -71689 -53551 -8456 615 -7685 32601 94021 78013
15818 78013 43901 -73681 -65595 -12170 38289 -51867 -67282 -12204 -81771 -191023 -193860 -117525
15806 -117525 -120682 -98638 -37031 37057 76349 19824 4898 77619 22251 -12514 -58336 -110817
15794 -110817 -51061 -50352 -122673 -124068 -76035 -86489 -51930 13206 -39641 -71050 -152748 -70760
15782g0760l8958J9871K055o2206J9819L3526k6888N1648J11212J8256m7765K8114
15770C7924L8094q653k1318l2522j6266M1982n1219M405j3037m3862R932k0590
15758g5130j9335j7446N3432N4224m6841j52726q6071J0240K0231M2355J6118
15747b00949R8272o8771o9377L3510P6927j5151l0281j0951J522J43215P8742
15736C6708R776m3319l4728K5074j17629p4458j6488J21439R3697l8830j51711
15725a90469q0384j7731N9375J14899L7029K9632m7140L8210Q0894P7950l8593
15714F3672n8073j455N7614L0532j6330l8382L6610k6766m5030p3352j7304n139
15702i3403K1273j48599m4292J2871j5804N9103n8285J28524J62362k5554O8666
$$ plain form
15782 -70760 -109718 -89847 -87792 -149998 -130179 -96653 -123541 -71893 39319 57575 9810 37924
15770 37924 76018 67365 46047 13525 -2741 39241 -11978 -7573 -20610 -64472 -54540 -75130
15758 -75130 -94465 -111911 -58479 -4255 -51096 -203822 -289893 -279653 -259422 -217067 -200949
15747 -200949 -102677 -171448 -240825 -207315 -130388 -145539 -175820 -186771 -185249 -42034 36708
15736 36708 46484 3165 -31563 -6489 -124118 -198576 -215064 -93625 72 -38758 -190469
15725 -190469 -270853 -288584 -229209 -114310 -77281 -47649 -94789 -56579 24315 102265 63672
15714 63672 5599 4144 61758 92290 75960 37578 74188 47422 2392 -70960 -88264 -93403
15702 -93403 -72130 -220729 -265021 -252150 -267954 -208851 -267136 -138612 23750 -1804 66862
15691F6862o9418K8307k7799n8518j38514j2538N0614O8346n0940L9466J21990
15680A7858J39510l06r3044K8406J2526n6683j26842N9768R35L7354p4160L9052
15668a5626N3087K5307L6838k0471j34538n0312l5876J5809m103j8956k9418l2084
15656b10343L8281M3326P5575K0574m1095j3086O2614o4632k1800M045P023p1892
15644a71410K1112J02697J1285J6027l6834m6278o3155N4606j5898M8575N0530
15633b8743K2531k9749o8189J8452k4661K7999K9393j0980p0619k3349J07336
15622e0579m8505o6566L3963M6705j8711k5210n528k8143q537J10243J22729r5966
15610c4105r6878j19558J3934P6030Q5877Q5096j7469o1592P4716j291j20533
$$ plain form
15691 66862 -2556 25751 -2048 -60566 -199080 -211618 -161004 -92658 -143598 -104132 17858
15680 17858 157368 157062 64018 92424 104950 48267 -78575 -18807 -17872 19482 -54678 -15626
15668 -15626 37461 62768 99606 79135 -55403 -105715 -141591 -125782 -129885 -148841 -178259 -210343
15656 -210343 -172062 -128736 -53161 -32587 -73682 -86768 -24154 -88786 -110586 -106541 -99518 -171410
15644 -171410 -150298 -47601 -36316 -20289 -57123 -103401 -166556 -111950 -127848 -79273 -28743
15633 -28743 -6212 -35961 -104150 -85698 -110359 -82360 -52967 -63947 -134566 -157915 -50579
15622 -50579 -99084 -165650 -131687 -84982 -103693 -128903 -134431 -162574 -171111 -60868 61861 -34105
15610 -34105 -130983 -250541 -236607 -160577 -74700 10396 -7073 -68665 6051 4760 -115773
15599a15773O871O6300Q7013j6155k1072k4521O680K587M9760l0255P545M4392
15587F3372N3453K7327q1837r3698k1504O133k1371m6017m8951O508k2268j02242
15575b81095N2221R5934N4144K0646N825l2891m9845q8219l3489R2393J04636
15564e9740J8205p2384r0221K0585J0827J08395R6599L2115m197p7566o3905j60794
15552b42081q908J47707p0660J2445L6699L3971L2041L5026N0978N3866P66k9499
15540E2351l8836n8019p5262K1174Q63k641L0368M1306J6202o7911j4279K3999
15528g0685j01936J6829L0645o680J1999l7232Q6812N2066j3362K5960m2593j5635
15516f3812M5383n5903k6023O3821l246j5284j2311P6961J4207O780J7059n1723
$$ plain form
15599 -115773 -108902 -42602 44411 28256 7184 -17337 -10657 -8070 41690 11435 18980 63372
15587 63372 116825 144152 62315 -31383 -52887 -46754 -68125 -114142 -163093 -156585 -178853 -281095
15575 -281095 -228874 -132940 -78796 -58150 -52325 -85216 -135061 -223280 -256769 -164376 -59740
15564 -59740 -41535 -113919 -204140 -183555 -172728 -64333 32266 64381 60184 -17382 -81287 -242081
15552 -242081 -250989 -103282 -173942 -161497 -124798 -90827 -58786 -23760 27218 81084 81850 52351
15540 52351 13515 -44504 -119766 -98592 -97729 -100370 -70002 -28696 -12494 -80405 -94684 -70685
15528 -70685 -172621 -155792 -125147 -131827 -119828 -157060 -70248 -18182 -31544 -5584 -48177 -63812
15516 -63812 -18429 -74332 -100355 -36534 -39780 -55064 -67375 9586 23793 30573 47632 -4091
15504d091o0038m4996l416Q7822Q5115Q630K3404P2356p8367j12047l4518K7623
15492c2523j07197j6034O8484L1405j4813l5798j3755K453M2984o4193l3375K4045
15480a48317L2657J6764o5099N9254J0393o247J3620l8312n6326M5797j4605m4439
15468a94860O6315M182J1507l0788K3912m6461o2380k8362P9989O5105r6480j8692
15456b27013j9181P0669J02321Q5724q1841q4172l0305M6494R6776N6494k8239
15445a2273J4240O0737N201L3450L9232l7091j25860K8671L4335k2284J169k68
15433A9259J5614J5307o3496j2719k9450P2625J7358L3183k2566q0267M0679L2875
15421C8402j23774L0354N3911k1488r2051p1497L2650Q8644O1797j7725N0045
$$ plain form
15504 -4091 -64129 -109125 -112541 -24719 60396 69026 92430 164786 86419 -25628 -60146 -32523
15492 -32523 -139720 -155754 -87270 -55865 -70678 -106476 -120231 -117778 -74794 -138987 -172362 -148317
15480 -148317 -115660 -98896 -163995 -104741 -94348 -100595 -86975 -125287 -181613 -135816 -150421 -194860
15468 -194860 -128545 -124363 -112856 -143644 -119732 -166193 -228573 -256935 -176946 -111841 -208321 -227013
15456 -227013 -246194 -175525 -73204 12520 -69321 -153493 -183798 -137304 -40528 15966 -12273
15445 -12273 1967 62704 67905 101355 140587 103496 -22364 6307 40642 18358 19527 19259
15433 19259 34873 50180 -13316 -26035 -55485 17140 34498 67681 45115 -35152 5527 38402
15421 38402 -85372 -55018 -1107 -22595 -114646 -186143 -153493 -64849 -3052 -20777 29268
15410B9268k9336k8686M7080k9506m9201j8380k5843O4646O4528N0840N1332L3035
15398A59777l6195p9688Q1830o8057r3021m6415K8260J72215N5793p4963j501
15387I8035J0597k287q3502k7578q642l5366Q8364k7905j6442M8148o1533n9615
15375g7726M858j5016m6136k6715J4317k439K107k9318L5419O9299q203N3653
15363b5900N425p1432J296L7712O4503P7237M6924P138n1388l5665q4946o688
15351c5784N9980K3426p5633m0810m549n9462r510N8397k1929R4123L4376M8939
15339G1564J4420q2406m6044l6183O0968Q2114j16970J2319n9106n8282K2258
15328a35348k1343O7126R4707R1941m0167q6784J3943j14161L801O2219j9343
$$ plain form
15410 29268 -68 -28754 18326 -11180 -60381 -78761 -104604 -39958 24570 75410 126742 159777
15398 159777 123582 43894 125724 57667 -35354 -81769 -53509 118706 174499 99536 98035
15387 98035 108632 106345 22843 -4735 -13377 -48743 39621 11716 -4726 43422 -18111 -77726
15375 -77726 -72868 -87884 -134020 -160735 -146418 -148857 -146750 -176068 -140649 -71350 -79553 -25900
15363 -25900 -20475 -91907 -90611 -52899 11604 88841 135765 142903 91515 55850 -29096 -35784
15351 -35784 24196 47622 -28011 -68821 -73370 -132832 -142342 -83945 -105874 -11751 22625 71564
15339 71564 85984 3578 -42466 -78649 -17681 64433 -52537 -40218 -99324 -157606 -135348
15328 -135348 -156691 -89565 5142 97083 56916 -29868 -15925 -130086 -126285 -64066 -83409
15317h3409r5883J7497J08338J13685l6754j31253j27155M723N0210P3110M6862
15306f0029o4602l3258m5203L8843M2851M2091O130N8354K8476n1286j56589p3170
15294b67392R0574J57051K3355L4759k3809K9361J2939j15902j2919J32241N8285
15283A18543q111r0351k0861j02238l7810J6082J02418M9269q9476o3744l6623
15272a62902O9763K7382J7010j8343l6370P374n720J14845o242q8250p2847J735
15260a52565j4542O3876m2246o0292k4369R0614N9398j0124j4800k8401R647N9483
15248f4321L4761J0430j8779j8087p1149N0937J96149Q9224K2245N154j7428m2280
15236A76856n4650p7221q4755m9415j5444j2063J14643j0357o4265j1453O34J15030
$$ plain form
15317 -83409 -179292 -161795 -53457 60228 23474 -107779 -234934 -230211 -180001 -106891 -60029
15306 -60029 -124631 -157889 -203092 -164249 -121398 -79307 -73177 -14823 13653 -37633 -194222 -267392
15294 -267392 -176818 -19767 3588 38347 14538 43899 56838 -59064 -71983 60258 118543
15283 118543 110432 20081 -780 -103018 -140828 -124746 -22328 26941 -62535 -126279 -162902
15272 -162902 -93139 -65757 -48747 -67090 -103460 -96086 -101806 13039 6797 -81453 -154300 -152565
15260 -152565 -167107 -103231 -145477 -205769 -230138 -139524 -80126 -90250 -105050 -133451 -123804 -64321
15248 -64321 -29560 -19130 -37909 -55996 -127145 -76208 119941 209165 231410 236564 219136 176856
15236 176856 122206 44985 -39770 -89185 -104629 -116692 -2049 -12406 -76671 -88124 -87490 27540
15224B7540n162K9145l9132p5759J5698p0505N3959J10058j59227j59873Q0076
15213a93182K7441q70R4937r4539j18990L7495J24161J20072P9597O432l0011
15202E2543M0290L367j6911o9828l2458n8012L508R380p2003M0360q656o2375
15190a70795L9366k90M3637L2p4589P5060P066l584J03630k3116o9791P6077O488
15177I191m5666o3820J569P3312P548l1278j16880j3840J14658P4287k257J570
15165H394O2397M9855p2806j5585M913p759k4523J068q0511l3023m2083P7648
15153g2015M1817r0871p3306q3592L3765J13430J27742J8490j6788J666q8118
15142h7780L240R215j792K0556l2231J7506K21n565J04993J5233q1545M9054p0609
$$ plain form
15224 27540 22378 51523 12391 -63368 -47670 -118175 -64216 45842 -113385 -273258 -193182
15213 -193182 -165741 -166611 -71674 -166213 -285203 -247708 -123547 -3475 76122 82554 52543
15202 52543 92833 96200 79289 9461 -22997 -81009 -77501 -68121 -140124 -99764 -108420 -170795
15190 -170795 -131429 -131719 -88082 -88050 -162639 -87579 -80513 -84097 19533 -3583 -73374 2703 9191
15177 9191 -36475 -100295 -98726 -25414 -17866 -49144 -166024 -179864 -65206 9081 6824 8394
15165 8394 70791 120646 47840 32255 37168 29409 4886 5954 -74557 -107580 -149663 -72015
15153 -72015 -30198 -121069 -194375 -277967 -244202 -130772 -3030 15460 -1328 338 -87780
15142 -87780 -84540 -75325 -77117 -56561 -88792 -71286 -71065 -76630 28363 43596 -37949 11105 -59504
15129e9504j44566J8868l4262L7238J42962l1096M9307J30729r028m769K453r2355
15117E977n5563M2170l5727n5939k4065j00567j6143O3894O1375N4102M0199m7509
15105f7796l3919K4944j0540J15436P8652m6856j36932P004Q6283J07729K7722
15094A51727l928j5428q054l5515j02715j1493k7646J7394n2601L1752P9389P8156
15082A01038l974m842j0015r4684j8707O25k3785j9898J6337J1221m8634K5276
15070g0042o6328J6008N8898j2215L7916k33l8384Q996R4923Q9084m990m0056
15058G3577o5460l0339Q0169O5436j4939p4786l7572j2808n3456M5031K0874N1098
15046D6825p4800k4491J2528O2378R5896j8216l5821m1286Q1686J3604M299j3807
$$ plain form
15129 -59504 -204070 -185202 -219464 -182226 -39264 -70360 -21053 109676 100648 95879 98332 5977
15117 5977 -49586 -7416 -43143 -99082 -123147 -223714 -239857 -175963 -114588 -60486 -20287 -67796
15105 -67796 -101715 -76771 -87311 28125 106777 59921 -77011 -70007 16276 124005 151727
15094 151727 147799 132371 124317 88802 -13913 -25406 -53052 -35658 -88259 -56507 22882 101038
15082 101038 97064 92222 82207 -12477 -31184 -30559 -54344 -74242 -57905 -46684 -95318 -70042
15070 -70042 -136370 -120362 -61464 -73679 -35763 -35996 -74380 -65384 29539 118623 113633 73577
15058 73577 8117 -22222 57947 123383 108444 33658 -3914 -16722 -70178 -25147 -4273 46825
15046 46825 -27975 -52466 -39938 22440 118336 100120 64299 23013 104699 118303 122602 108795
15034A08795l7435Q100l447L44R341l650K3625k0772n2814J4210M4859r6092j4173
15021a9109P4614q5179j17022m9295N112J36111R8067M2049q5900q99k4022K3467
15009b006m7462j8310M7370R57n695M7952k781r8043N4925J34034k0663l9479
14997E0799l7185q0226j05059p8255N2224Q6100o5919M236J35422M8405L0546
14986D1088r6198J2360j9956j6832j8033N6442J9898K1980m6766j1651L5179K0878
14974a611o9581j0631L4758k2681l5189N8965R2979n9576r7239P2392O0907l0660
14962g167n9808J0881j13559O372M2526L3316M2079m0146k7826R219L5679m722
14950g3156M8108P1821j06326j2627O8886O5957j5453M8313L1948o1373r0596
$$ plain form
15034 108795 71360 79460 76013 76357 85698 82048 105673 84901 32087 46297 91156 -4936 -19109
15021 -19109 55505 -29674 -146696 -195991 -190879 -54768 43299 85348 -552 -1451 -25473 -2006
15009 -2006 -49468 -67778 -20408 -19451 -25146 22806 20025 -78018 -23093 110941 90278 50799
14997 50799 13614 -66612 -171671 -249926 -197702 -111602 -177521 -173285 -37863 10542 41088
14986 41088 -55110 -42750 -62706 -79538 -97571 -41129 -21231 749 -46017 -57668 -22489 -1611
14974 -1611 -71192 -81823 -47065 -69746 -104935 -45970 47009 -12567 -109806 -37414 23493 -7167
14962 -7167 -66975 -56094 -169653 -163281 -120755 -87439 -45360 -85506 -113332 -104113 -68434 -73156
14950 -73156 -25048 46773 -59553 -72180 -3294 62663 47210 95523 127471 66098 -24498
14939b4498M0289N6991m5595L8023j2150k520P0069j9556m9788K1103r6754N1305
14927B6919J9462o5274l4400m8129Q4172O3706K738L7629n7201q0248J4103k1892
14915e8415N7370P2813n0111r0880p0338k0478n0697N3481K0583p7416N5877M4955
14903a13256Q6867R6117o795j03398r2732j1981j7122K0606P0699M1784j9716
14892d8927J420n3047l6287K8130K5968k2224M5804k4973j8757j8841R1423K8441
14880a870m3717l2192n6475o7868O2990J37171J05304l1257l713k3173j56698
14869a11498m9750l6312j9904r6187P1158R1494L5616p445L1714L161j6877L1136
14857g3694K528k7951K09P4891L7653r3047m8009O1400K2351N9776K4619j0636
$$ plain form
14939 -24498 15791 72782 27187 65210 53060 50540 120609 101053 51265 72368 -24386 26919
14927 26919 46381 -18893 -53293 -101422 -17250 46456 49194 86823 29622 -50626 -36523 -58415
14915 -58415 -1045 71768 21657 -69223 -139561 -160039 -210736 -157255 -136672 -214088 -158211 -113256
14903 -113256 -26389 69728 62933 -40465 -133197 -145178 -162300 -141694 -70995 -29211 -48927
14892 -48927 -47507 -100554 -136841 -108711 -82743 -104967 -59163 -84136 -102893 -121734 -30311 -1870
14880 -1870 -45587 -77779 -134254 -202122 -139132 -1961 103343 72086 68373 45200 -111498
14869 -111498 -161248 -197560 -217464 -313651 -242493 -150999 -115383 -122828 -91114 -87953 -104830 -73694
14857 -73694 -71166 -99117 -98908 -24017 13636 -79411 -127420 -66020 -43669 16107 40726 30090
14845C0090q8155j08154J9872J11949M6679n0194J09496J37707q3758j4157l929
14834A07446l8249n857J7317L3486L2371o5304m4392j05720l5341j3372O0260
14823e7355q9824L8035N7636J01665j0258m4960r749M987k7169O6392N3370J1719
14811I4489m5086n9765n6025J9564o8264l9106J4486J18070N2015m5342o5507
14800h0471J4454m234j3126N2466l4654o2110k3237L3944q2761k0558J7432J23220
14788g9635M4576R400n5254p5453N2999q097K7713Q4147o3803J4059N6287O3257
14776G0196K9226M6274j04436j82633m2340M5385K7038L2620k0336m0651R0683
14765d8974L6135n5315j9456J4667n0000k3789L8852M3050M5664j4007L1837R5360
$$ plain form
14845 30090 -58065 -166219 -146347 -34398 12281 -37913 71583 209290 125532 111375 107446
14834 107446 69197 63340 80657 114143 146514 81210 36818 -68902 -104243 -117615 -57355
14823 -57355 -147179 -109144 -51508 50157 39899 -5061 -14810 -9823 -36992 29400 82770 94489
14811 94489 49403 -10362 -66387 -46823 -115087 -154193 -139707 -21637 30378 -14964 -80471
14800 -80471 -66017 -70251 -83377 -30911 -65565 -127675 -150912 -116968 -199729 -220287 -202855 -79635
14788 -79635 -35059 -25659 -80913 -156366 -103367 -111464 -83751 396 -63407 -49348 6939 70196
14776 70196 99422 145696 41260 -141373 -183713 -138328 -111290 -78670 -99006 -139657 -48974
14765 -48974 -12839 -68154 -87610 -72943 -122943 -146732 -107880 -64830 -19166 -33173 -1336 94024
14753I4024l0705p2674K4118N8275o4417m0656k3326N4796K3695K9769j678Q491
14741E9712K2636p9395n6116J33519J04367j15825j35282L0151k5108r0838R6866
14730e5313J03608n7353j21900M5852Q3153k0809l1430J200l3628O096M9453l7268
14718f8339M6984k3901q3092N866j6264J1373J63667M0042k5530J6260j3880l6234
14706A6952n3119N9012n5194r5526L6722J50539l7507r5063N1081R1889j8246
14695E1540q501M6568q096j5225k1058p1205K3247j1457M2180r8823j15283M2309
14683a43804R2741L1105N2057K9760J3348L7697J8764m6657o7301m9839m2294
14672g4423J8016k0733M5325N9884O7282j9463o8008m1442J2653J2657r3377q4011
$$ plain form
14753 94024 63319 -9355 14763 73038 8621 -32035 -55361 -565 23130 52899 51221 59712
14741 59712 82348 2953 -53163 80356 184723 68898 -66384 -36233 -61341 -152179 -55313
14730 -55313 48295 -9058 -130958 -85106 -1953 -22762 -54192 -52992 -86620 -80524 -31071 -68339
14718 -68339 -21355 -45256 -128348 -122482 -138746 -127373 36294 76336 50806 67066 53186 16952
14706 16952 -36167 22845 -32349 -127875 -91153 59386 21879 -73184 -22103 69786 51540
14695 51540 43039 89607 81511 66286 45228 -25977 -2730 -14187 27993 -70830 -186113 -143804
14683 -143804 -51063 -19958 32099 61859 75207 112904 131668 85011 17710 -32129 -74423
14672 -74423 -56407 -77140 -31815 28069 95351 75888 7880 -33562 -20909 -8252 -101629 -185640
14660a85640L2669R3420J15096O4329n1249p5400n260O7812l99L4805K5383o0721
14648E4845J0805N0835m316J3462O3039j10996o0611L335p7765j8122P3723j1555
14636a3321q0848K2939O7757L1902M8802J1376l548R113l920q6730m0063o2191
14624i8732o3755l098p4713j1369J12295J2826J03535K6911j32750J1281M2487
14613g5082p3546K3890J48600L4010o2919K4811Q229m3181K4221L3402q6050M5395
14601A780J023J1413m6164N1369J6036l4461p4274R0451O5840q9009q3516N2901
14589c6611o4975l7015K8878L5211L8542O4430O6330m516L5971J359m9198O1440
14577A39846l7156o8037Q6891Q8669m18k8662m3839n2785r0586M528l2112K3909
$$ plain form
14660 -185640 -152971 -59551 55545 119874 68625 -6775 -12035 55777 55378 90183 115566 54845
14648 54845 65650 116485 112169 125631 188670 77674 17063 20398 -57367 -75489 -1766 -13321
14636 -13321 -94169 -71230 -3473 28429 77231 88607 85059 94172 90252 3522 -36541 -98732
14624 -98732 -162487 -165585 -240298 -251667 -139372 -126546 -23011 3900 -128850 -117569 -75082
14613 -75082 -148628 -124738 23862 57872 -5047 19764 27993 -15188 9033 42435 -43615 1780
14601 1780 2803 14216 -31948 19421 35457 996 -73278 17173 83013 -5996 -89512 -36611
14589 -36611 -101586 -138601 -109723 -74512 -35970 28460 94790 90274 126245 127604 78406 139846
14577 139846 102690 34653 121544 210213 209795 181133 137294 84509 -6077 -1549 -33661 -9752
14565i752k6552o9390n6743M0471J0206k6272q5772j9321O8229J56506J4550K817
14553a023n5628p264J16181Q5328N0497P4502l945j01194o4964k9837o0899m9797
14541d8043k8657J03024O3562p3859j08701j15591N5167R006R1429N7260n8202
14530e3605k8804K7446M7L074j8838P6578P9514L4346j13992j15465j4375R600
14518a14474M7405M2752N047Q7214l0025O7386o6611p972K6324l982k6076p0733
14506d3745j01709O519J33282J7890J5787m1837J9390m1771m781p46J55622K7075
14494A40976j012l1502n6951o3348j0381O2593J0905j76295m7617K8518M4653
14483i9461j8545P0711P3212j5084j30596p0308L8522R9671N7787N9302K7101
$$ plain form
14565 -9752 -36304 -105694 -162437 -121966 -111760 -138032 -223804 -243125 -174896 -18390 -3840 -1023
14553 -1023 -56651 -63915 52266 137594 188091 262593 258648 157454 92490 62653 1754 -48043
14541 -48043 -76700 26324 89886 16027 -92674 -208265 -153098 -144092 -52663 4597 -53605
14530 -53605 -82409 -54963 -54916 -51842 -70680 5898 85412 119758 5766 -109699 -124074 -114474
14518 -114474 -67069 -24317 -19270 67944 37919 105305 38694 30722 57046 53064 26988 -43745
14506 -43745 -145454 -138935 -5653 12237 28024 -13813 5577 -36194 -40975 -41721 113901 140976
14494 140976 139964 108462 51511 -11837 -22218 40375 51280 -125015 -172632 -144114 -99461
14483 -99461 -118006 -47295 25917 10833 -119763 -190071 -151549 -51878 5909 65211 92312
14472I2312l2457K878l4479n7657J529J44656j02604n3827r6273Q9928Q556M7592
14460A0154P1415l2857l7959j2763j3659q828R329k122N9210l0722j02111l0521
14448a21434n958k5606M2102P7368K7344k8458k7282M2112K1468O0428k0962j10233
14436f9111l4670o195N6770K8200O4896K0326m7994n519j7132p4515N154N3936
14424b5854N0605M2363R6064k356r6383k8006N4265m3232j08270l1989m3871K6386
14412a10278O1695o1482n2177M331N3320Q2921j2367k5451k0902m0007P2628N0972
14400C203J1948K6140L8364m6122j6829O727n9401L6635P379j8164k7953k5967
14388f4040m389P3488Q910j442l8643M48m3693q4128n4809N9140J16604N6143
$$ plain form
14472 92312 59855 62733 28254 -29403 -27874 116782 14178 -39649 -135922 -45994 -37438 10154
14460 10154 81569 48712 10753 -2010 -15669 -24497 -15168 -17290 41920 11198 -90913 -121434
14448 -121434 -127392 -152998 -110896 -33528 -6184 -34642 -61924 -19812 1656 62084 41122 -69111
14436 -69111 -103781 -109976 -53206 -25006 39890 60216 12222 6703 -10429 -84944 -79790 -25854
14424 -25854 24751 67114 163178 160822 64439 36433 90698 47466 -60804 -92793 -136664 -110278
14412 -110278 -48583 -110065 -162242 -157911 -104591 -21670 -34037 -59488 -80390 -120397 -47769 3203
14400 3203 15151 41291 79655 33533 16704 23431 -35970 665 8044 -10120 -38073 -64040
14388 -64040 -68429 5059 13969 12527 -26116 -25668 -69361 -153489 -208298 -149158 -32554 23589
14376B3589R3017M385j43690o054M8760R768L3348O325n5882L4969J51836j0628
14364A89743o0595k6909P0101O9877Q6570j3698l3670m3428k1802N339K093J311
14352B24932o0767n8462m7672Q8488P0489q9953m2038j0221L6559m4643M5027
14341A11739N9965M1819n1961n7793j9319N9540n9977j15184O8508j4903O9707
14330I2141M9974N881N4603m7931P0K5152K7270l6238j2184M6684j35299n3604
14318A6519M4381n3201N6067M6348P4303O9453j25066k1480M991L4770j7916m8191
14306H0978O4112Q2876M6671o0321n1808j09413N3238o419m616J6499M1206j8305
14294A34698P476K6969m0681J6787L0L1059k3540m5488k4005K9232N0115M8639
$$ plain form
14376 23589 116606 120991 -22699 -28753 20007 29775 63123 69448 13566 48535 200371 189743
14364 189743 129148 102239 172340 242217 328787 315089 281419 237991 216189 221528 223621 224932
14352 224932 164165 105703 58031 146519 217008 127055 85017 74796 111355 66712 111739
14341 111739 171704 213523 161562 103769 84450 143990 84013 -31171 37337 22434 92141
14330 92141 142115 147996 202599 154668 154738 179890 207160 170922 158738 205422 70123 16519
14318 16519 60900 7699 63766 110114 184417 253870 128804 107324 112315 147085 129169 80978
14306 80978 145090 227966 274637 214316 162508 53095 106333 99914 95298 111797 153003 134698
14294 134698 142174 169143 128462 145249 145279 176338 152798 107310 83305 112537 162652 211291
14282B11291n769r2926l8250j036K9695l251P4373N9142n4599r8619M3058P4903
14270A98012L5386o0471J875j9629L218J3680L4422L2921n9412j31960l1085Q0125
14258I7082k0856Q9146J77241q1705j25108L1557N4641n4831j10197R8647K3938
14247A79555k0199k4828m5457k3897J56577M4754j1666q7384o9387k0841k9147
14236D8080P7376J6227m519l574o8921m3427o0221R5260N9074j2474k2296p409
14224G3176n4486J9403J3472j1544L894n163l185R314q059l9144j7420q0266n489
14211a05497Q0633P5468m2855R6565P0162m1857N659L7190j5685q6576P0248l6570
14199A06885k7651k0520J2892N3192k247J0734N5493k9400o8243m1466n0071m5700
$$ plain form
14282 211291 205522 112596 74346 73310 103005 99754 174127 233269 178670 80051 123109 198012
14270 198012 233398 172927 174802 155173 158391 172071 206493 239414 180002 48042 16957 97082
14258 97082 76226 165372 342613 260908 135800 167357 221998 167167 56970 155617 179555
14247 179555 159356 134528 89071 65174 221751 266505 254839 167455 98068 77227 48080
14236 48080 125456 141683 137164 133590 64669 21242 -38979 56281 115355 102881 80585 73176
14224 73176 18690 38093 51565 40021 43915 38752 35567 44881 36822 -2322 -19742 -100008 -105497
14211 -105497 -24864 50604 7749 104314 174476 132619 138278 175468 159783 73207 143455 106885
14199 106885 79234 58714 71606 124798 122551 133285 188778 159378 91135 49669 -402 -46102
14187d6102m5494P8767J11465J6193l3733q8598J2358N5797j8864M6556k9876
14176E8469l1028k7355M1302L4932O7354M875m8001J019p5940r1458R2425N5375
14164H1969q1616p593N8623O0423l0682j2512K8636R8313P0045p2862J619k0083
14152A74280l0035q1905o9027R0554P6262l4771r8332O1075l8951o0176K7237
14141A6211R575L5242j3458n3130j6187J16968O0438m7387n2356J9230q771p3820
14129g445p1841M3493Q9953k1955k1996p2015K1078J6259J4705J14547j935j05274
14117b426K4764M2372O3101m5628j8215Q03K0269K7261K2129l8520N4502P2489
14105B22901P0125N2033q3762r3467m5317N4309M7105R3579L4515J6248J7486
$$ plain form
14187 -46102 -91596 -12829 98636 114829 81096 -7502 4856 60653 41789 88345 58469
14176 58469 27441 86 41388 76320 143674 148549 100548 101567 25627 -65831 26594 81969
14164 81969 353 -7240 51383 111806 81124 68612 97248 195561 265606 192744 194363 174280
14152 174280 144245 62340 -6687 83867 160129 125358 27026 88101 49150 -11026 16211
14141 16211 25786 61028 47570 -5560 -21747 95221 155659 108272 55916 75146 66375 -7445
14129 -7445 -79286 -35793 54160 32205 10209 -61806 -40728 -24469 -9764 104783 102848 -2426
14117 -2426 22338 64710 127811 82183 63968 64771 85040 112301 134430 95910 150412 222901
14105 222901 293026 345059 261297 167830 122513 176822 223927 317506 352021 368269 385755
14094C85755j13410p5547k3806Q6449L5646O1256l803l7857l3307J2009N2372
14083C45757K4241L9918m0349k17676j35719M5862J16751q149J12714O0410j7241
14072C26519j04218O7063k3792o7020m8204J4218J4855M995R65l2365p5012j6944
14060F1060N3778P8134j830K1369O2057o0192Q117R933L9155J9671J1779k9507
14048B73524q165n7337J09902N0670j83832O125j7934k2944k070o6049o9123j61
14036A2606N0900M8564Q8749P1115L8149k8271m7446K6536L8046J9377Q2902o0046
14024C41181j17961L4977M664n4065P063m8457m5326L1058N1811P134Q6059J5507
14012C13645P0915p8097J9951J16977P435p3396l6218J71885K0725p9382l7768
$$ plain form
14094 385755 272345 196798 172992 259441 295087 356343 352540 314683 281376 293385 345757
14083 345757 369998 409916 369567 151891 16172 62034 178785 170636 283350 343760 326519
14072 326519 222301 289364 265572 198552 150348 164566 179421 184416 185381 153016 78004 61060
14060 61060 114838 192972 191142 212511 274568 214376 222493 232426 271581 291252 303031 273524
14048 273524 265359 208022 317924 368594 184762 190887 172953 150009 147939 81890 12767 12606
14036 12606 63506 112070 200819 271934 310083 281812 234366 260902 298948 318325 401227 341181
14024 341181 223220 258197 262861 208796 215859 167402 122076 153134 204945 212079 298138 313645
14012 313645 384560 306463 326414 443391 450826 377430 341212 513097 533822 454440 416672
14001D16672M0212j7652K9496j3317L8115P1663j9182O9423Q1146j09683j26113
13990D60780n0277N4860R4501j2239R0641k4241p2500Q707N1374J4188j7401j3805
13978E84588p1589r333K230J08188j1066K4847P2960N9526K2489k1115l7033L8535
13966G63227J06178K0264j6039J8662N2071K1188P1546R2381P229O9686R9843
13955A306236K7400J7420J9749J34695J21913P2345J63457J13548J29828J97338
13945B303929K59646K59998K06706K43074L53719M92386M61262M67434N13681
13936E561835O72635Q04044R15159J114570J185785J165344J285950J419493J257449
13927A5382264J232350J088596R72361R64390Q58562P56868O58126O21968N69557
$$ plain form
14001 416672 456884 439232 468728 455411 493526 565189 546007 615430 696576 586893 460780
13990 460780 410503 465363 559864 547625 638266 614025 541525 550232 601606 615794 598393 584588
13978 584588 512999 503666 505896 614084 603018 627865 700825 760351 782840 761725 724692 763227
13966 763227 869405 889669 873630 892292 944363 965551 1037097 1129478 1136707 1206393 1306236
13955 1306236 1333636 1351056 1370805 1505500 1627413 1699758 1863215 1976763 2106591 2303929
13945 2303929 2563575 2823573 3030279 3273353 3627072 4119458 4580720 5048154 5561835
13936 5561835 6234470 7038514 7953673 9068243 10254028 11419372 12705322 14124815 15382264
13927 15382264 16614614 17703210 18675571 19639961 20498523 21255391 21913517 22535485 23105042
13918B3105042L65695J30614k0564j73228k59217k56611J04897M36466P68133
13909B4201227J071716J461364J919005K306318K630157K855902K817602K557965
13901D1821256K215010K039653J683636J362642R73384M41568j63498q10377j480928
13892D8082346j939482k429153k945184l025541k938095k719303k328110j829815
13884B7927663j307656r29942m28688J433K56453L97594M78920L65810K27085
13875B6988672J43932r0593l31064m50134m91738n54934o33426p52846r03972
13866B2923897j074239j211126j356523j461420j403400j374253j367583j225244
13858A2450109r40257p92012n55554l24963j63128m1562J21124L03111O00317
$$ plain form
13918 23105042 23470737 23601351 23580787 23407559 23148342 22891731 22996628 23433094 24201227
13909 24201227 25272943 26734307 28653312 30959630 33589787 36445689 39263291 41821256
13901 41821256 44036266 46075919 47759555 49122197 50095581 50537149 50373651 49563274 48082346
13892 48082346 46142864 43713711 40768527 37742986 34804891 32085588 29757478 27927663
13884 27927663 26620007 25690065 25261377 25262810 25519263 25916857 26395777 26761587 26988672
13875 26988672 27132604 27042011 26710947 26260813 25769075 25214141 24580715 23827869 22923897
13866 22923897 21849658 20638532 19282009 17820589 16417189 15042936 13675353 12450109
13858 12450109 11509852 10717840 10162286 9837323 9674195 9632633 9753757 10056868 10657185
13849A0657185N55384Q26422J180378J323884J465536J539704J492786J575392
13841B0616671J328143J152403J036823Q98590P58721N45936O50875O56842M40881
13832B8085885L00302J15631j17996k44488m19213m14178j98209J36368M34989
13823B7679091R09990J426496K093287K605243K958146L098255L208104L097635
13815D7076247K724505K112380J478146R17422K95057k41075p59421j304115j638388
13806E0660758j885354k324317k591948k791086k907205k686317k435843k104421
13798C0934267j696332j288878p77911l40776j14337J7052K26521J14264n4838
13789B7019032j90968k24383l92723o92530p24318q22377r25520j014481j087324
$$ plain form
13849 10657185 11212569 12038991 13219369 14543253 16008789 17548493 19041279 20616671
13841 20616671 21944814 23097217 24134040 25032630 25791351 26337287 26988162 27645004 28085885
13832 28085885 28386187 28501818 28383822 28139334 27720121 27305943 27107734 27244102 27679091
13823 27679091 28589081 30015577 32108864 34714107 37672253 40770508 43978612 47076247
13815 47076247 49800752 51913132 53391278 54308700 54603757 54362682 53603261 52299146 50660758
13806 50660758 48775404 46451087 43859139 41068053 38160848 35474531 33038688 30934267
13798 30934267 29237935 27949057 27171146 26830370 26716033 26733085 26959606 27073870 27019032
13789 27019032 26828064 26603681 26210958 25518428 24794110 23971733 23046213 22031732 20944408
13780B0944408j150942j364228j375862j462364j422919j449335j323045j163079
13772A0232634r40933q66548q57054p65961o25017n72859m85467m44178m44745
13763D229872l75340l23030j85262j00517j57170k33318j49862r7812j89752j78633
13753B239176j65899o6518j09358j48965j10630j06675M517l1963l8250r8663
13743A366772j7983j9669j32345j22178o2043J4605R8226J7587j6629o9270l4081
13732A022992k4509m3774m5245p4048o4228L5065J3142o1657o3259L0569R0006
13721H15054J8433k9219n9320o1447n9426m9855J0886o0724j98k4141l7436L4315
13709D96922K468K6701n4946N0374M1413k0766o1590j7836N014L729j07626j04854
$$ plain form
13780 20944408 19793466 18429238 17053376 15591012 14168093 12718758 11395713 10232634
13772 10232634 9291701 8425153 7568099 6802138 6177121 5604262 5118795 4674617 4229872
13763 4229872 3854532 3531502 3346240 3245723 3088553 2855235 2705373 2607561 2417809 2239176
13753 2239176 2073277 2006759 1897401 1748436 1637806 1531131 1535648 1503685 1465435 1366772
13743 1366772 1348789 1329120 1196775 1074597 1012554 1027159 1125385 1142972 1126343 1057073 1022992
13732 1022992 998483 954709 909464 835416 771188 806253 819395 757738 694479 725048 815054
13721 815054 833487 804268 744948 683501 624075 574220 585106 524382 524184 500043 462607 496922
13709 496922 499390 526091 471145 521519 562932 542166 480576 462740 467754 471483 363857 259003
13697B59003J19217J56699p595k631Q4586n3783n974P9534n5824p1476K1819j15955
13685D07620j11760K3472P3207N1150K1025r7122K0919N6901m9424L5180j1315
13674D19853l1278l1927l4329J4140L0463k0158k2628P3556N5583J7029o5404
13663D04900r806J6724k1671k7850L1890k4709o09L3881j47506n6664N5035J4281
13651B67896q16M232J5013m0395j3186R2448K922J0943L4042N2904N317k9953
13639D01367q6215n8780J976k7035L824P9110p5675j2497k9726L147Q5932Q0949
13627C66377m1638n3428m5028j755N3420q647m0403K6021N7881o7100j6224M7216
13615B76692k8151q4879j4316L0764L9107j8741j7534J5012J54305Q376m8809
$$ plain form
13697 259003 378220 534919 527324 524693 609279 555496 549522 629056 573232 501756 523575 407620
13685 407620 295860 319332 392539 443689 464714 367592 388511 445412 395988 431168 419853
13674 419853 388575 356648 322319 336459 366922 346764 324136 397692 453275 470304 404900
13663 404900 395094 411818 390147 362297 394187 369478 368869 402750 255244 198580 253615 267896
13651 267896 267080 271312 286325 245930 232744 325192 328114 339057 373099 426003 431320 401367
13639 401367 315152 256372 258348 231313 235137 314247 238572 226075 196349 199496 285428 366377
13627 366377 324739 271311 226283 224528 277948 269301 228898 254919 312800 245700 229476 276692
13615 276692 248541 163662 149346 180110 219217 200476 182942 197954 352259 360635 311826
13604C11826k7558q9943n3402l1904J5440Q0623j2876n0338P3243R8102M6730
13593C59943N7504m4069n8371j2048n1957r566o0173n4907K1017j8827m2281J21351
13581B07616Q0041K6669M985p1264m192Q1504J6928j02031K8788m4149l8991P195
13569A93099O0267P3004M6436l2067L1724P296K4911N4973p5760p3331n0623L576
13557B63505L5739J9341N0944p7768q6502K235Q2081R1763M0974P2032p6779p7054
13545C40511O408K6060o3933m9405J3293L7523J5503q7381J9525N0270j4327n0683
13533B43364n9436k6586o6044j8776N9765Q8005J2054J04830R5631J102m427J7375
13521D46857L2227l2131O34q0577p8951j06136N3035N0423m0444m6271o3852n2929
$$ plain form
13604 311826 284268 194325 140923 109019 124459 205082 192206 141868 215111 313213 359943
13593 359943 417447 373378 315007 302959 251002 241436 181263 126356 147373 128546 86265 207616
13581 207616 287657 314326 319311 248047 243855 325359 342287 240256 269044 224895 185904 193099
13569 193099 253366 326370 372806 340739 372463 379759 404670 459643 383883 310552 259929 263505
13557 263505 299244 318585 369529 291761 205259 207494 289575 381338 422312 494344 417565 340511
13545 340511 346919 372979 309046 259641 272934 310457 325960 238579 258104 308374 294047 243364
13533 243364 183928 157342 91298 72522 132287 220292 232346 337176 432807 433909 429482 446857
13521 446857 479084 446953 447587 367010 288059 181923 234958 285381 244937 198666 134814 81885
13509H1885k4937Q3661J17921M0164r1768r7753o9929R443M4079j1955J2733r5
13497I3449k7642m4522j9612M5453J32899o832m8551l1277o3124J01891P5821
13486B07953M456L6867L6242l6964K809Q225J0428K7119k2831m4664R512j2540
13474B26612l2089k5307M9474M7961n6463m0848J05664L7491M0204P574r0462
13463B69811l0726L1229K9331J7781n1692K7957J02611K1973q2054J4978K8830
13452C80029r6097M5295J39973K6455j6090j69913l5189q4270j28511P1549O9366
13441B02597J31998O8842L5340K4615l8944o6459r0997k6628o8137P1829O7067
13430C11123L5648L8324L1102O3893q2224p0548r9216m8087o805l6184K5326l2675
$$ plain form
13509 81885 56948 140609 258530 298694 206926 109173 39244 48687 92766 80811 93544 93449
13497 93449 65807 21285 1673 47126 180025 173193 124642 93365 30241 132132 207953
13486 207953 212409 249276 285518 248554 251363 259588 270016 297135 274304 229640 239152 226612
13474 226612 194523 169216 218690 266651 210188 169340 275004 312495 352699 360273 269811
13463 269811 239085 270314 299645 317426 265734 293691 396302 418275 336221 351199 380029
13452 380029 283932 329227 469200 495655 479565 309652 274463 190193 61682 133231 202597
13441 202597 334595 403437 438777 463392 424448 357989 266992 240364 172227 244056 311123
13430 311123 346771 385095 416197 480090 397866 327318 228102 180015 173210 137026 162352 129677
13418A29677j05212N6327o284L680J47649J05886q5164j52110K3489J42713J1057
13407B71708p4377j4936M7965R113l3380j3553M1207n0741o5649N9061J47437
13396C23855M4823n7969j26559j4647P0548L1495j19876L1404J02838N7260l8779
13385C04393j55783M2102M7717o2619n3347K9925J24740J13160J2417p8372K0731
13374C45064L2760M9890O5363j615j3006n616M4416k9161l4797l4639Q2561K5892
13362E27112L6395l0477o6036O876J6032K3598j1592j34942j7726m7651k5318
13351B76271n6516j1606p936l1247K6243J6000N5935m904o5163N3259K9515K313
13339B82164J021J5660l3068K9639k5327n4222K1635N2367m5642j6674J4349O668
$$ plain form
13418 129677 24465 80792 74508 78188 225837 331723 246559 94449 117938 260651 271708
13407 271708 197331 182395 230360 239473 206093 192540 233747 183006 117357 176418 323855
13396 323855 368678 310709 184150 169503 240051 271546 151670 183074 285912 343172 304393
13385 304393 148610 190712 238429 175810 122463 152388 277128 390288 402705 324333 345064
13374 345064 377824 427714 493077 491462 478456 472840 517256 488095 453298 418659 501220 527112
13362 527112 563507 533030 466994 473870 489902 513500 501908 366966 349240 301589 276271
13351 276271 219755 208149 200213 168966 195209 211209 267144 262240 197077 250336 279851 282164
13339 282164 283185 298845 265777 295416 270089 215867 237502 289869 244227 227553 241902 248570
13327B48570R558l9854r97O5007k6397l9849N3916l7993m7970n7346n8684n5931
13315A2030K1151L4607K5003k0157O6350O0727o9047q2395k4195N685P7447M0425
13303A47631O8122M1058j11984n8755R233j663l159P440j0004J3269O220l9021
13291F8387k5034m0300L3686O8733N118J9794K666N4275K3724l0728j07286P042
13279H0077J61943K6592l6844j05986j4171M5136L4932j0508m2416k4773l7438
13268G6544M1927o8621m6511Q3615J0614p3364k570P7170J6473N6277N0766M5044
13256B67364O605j9457p9347N676k2604k5474p681j3922l0701M0079p5696J06129
13244A50971L4802l1871j1127j733o3197Q080K9891n1119p8688j4694M4124P2911
$$ plain form
13327 248570 258128 218274 217277 282284 255887 216038 269954 231961 183991 126645 67961 12030
13315 12030 33181 67788 92791 72634 138984 199711 130664 48269 24074 29759 107206 147631
13303 147631 215753 256811 144827 86072 95305 93642 90483 97923 87919 101188 107408 68387
13291 68387 43353 3053 36739 105472 110590 130384 133050 187325 211049 180321 73035 80077
13279 80077 242020 268612 231768 125782 111611 156747 191679 181171 138755 113982 76544
13268 76544 118471 49850 3339 86954 97568 24204 21634 98804 115277 171554 222320 267364
13256 267364 273969 254512 175165 180841 158237 132763 125082 111160 80459 120538 44842 150971
13244 150971 185773 153902 142775 141042 77845 85925 115816 64697 -13991 -28685 15439 88350
13232H8350Q5737q982K9065j3534j2396n5112l3251N5878N734Q99k2180j20703
13220d95q2941K1637N5242J00020l162j13724q274K3821L6111M8962Q2192J30630
13208B90019k8344J8301o550j48081j50944j5004M651R185K9357j8499M1922K6490
13196E2503j1888R921k6971p602q540J6986K4821Q981p4746R8752n008J37882
13184B15091m3315o6192P8617o2054n8369k7638J1687Q7316k5837m7317m0011
13173B1978P8985N7756n2961M363k7696o8423L1503J08907O624j06723l895N4627
13161A05045L7357q455J5120L2923n6833l3293L5297l7989K8218L2532J9336J2449
13149A81707o0808o7368M6369n7169l5362l1317Q532l6368l9098N2128l7477m7550
$$ plain form
13232 88350 174087 165105 194170 180636 168240 113128 79877 135755 141489 142388 120208 -495
13220 -495 -83436 -61799 -6557 93463 90301 -23423 -31697 -7876 28235 77197 159389 290019
13208 290019 261675 279976 273426 125345 -25599 -40603 -35952 -26767 2590 -15909 26013 52503
13196 52503 40615 50536 23565 15963 7423 24409 49230 58211 -16535 82217 77209 215091
13184 215091 171776 105584 184201 122147 63778 36140 47827 135143 109306 61989 21978
13173 21978 100963 158719 105758 110121 82425 14002 45505 154412 161036 54313 50418 105045
13161 105045 142402 133947 149067 181990 125157 91864 127161 89172 117390 149922 169258 181707
13149 181707 120899 53531 99900 42731 7369 -23948 -15416 -51784 -90882 -38754 -76231 -123781
13137a23781L7357J82530l3892q106R3576O2976l2698m5445p8079p2762P19M1041
13125B3436j5814O792l9527m1027N4828j8684M6061J13366J9522m4567O4954p6631
13113I2709k2012L9015M0113K195n024m4811r6128k7384p349L1418n209l0279
13101c2746R0110J6405q857O7882L9006Q2397O8921n7551q982l6572p3759p518
13089A38736O7859p0677m9706K5249J6264M9325q7493J00974j4349j00586J2479
13078H8075J14985R0870K4688o7109q0758K239l4587k5486N584J76345M2418J4272
13066C51536p9715q1519o0897j8479K4815K1303R39Q368n0442m0295O7483j3411
13054A29686j38759q8608K0392Q5832N9511m2013P086L8963n3253l2412J2508
$$ plain form
13137 -123781 -86424 96106 62214 54108 147684 210660 177962 132517 54438 -18324 -17605 23436
13125 23436 7622 14414 -25113 -66140 -11312 -29996 16065 129431 148953 104386 169340 92709
13113 92709 70697 109712 149825 152020 146996 102185 6057 -21327 -28676 2742 -2467 -32746
13101 -32746 57364 73769 64912 132794 171800 254197 323118 265567 256585 220013 146254 138736
13089 138736 206595 135918 86212 111461 127725 177050 89557 190531 176182 75596 88075
13078 88075 203060 293930 318618 251509 170751 172990 138403 112917 118501 294846 337264 351536
13066 351536 271821 190302 129405 110926 135741 157044 157983 166351 115909 75614 143097 129686
13054 129686 -9073 -97681 -77289 8543 68054 26041 33127 72090 18837 -13575 -1067
13043a067L8548L8214l6734K138K4230N7273n4468J2502p0588K2029J28320J26278
13031B86675l7494M9907l4890j5965m1179k7464j9706l3254L3725l8102o9571
13020E2682j8939J9880N5021L6741q7167o0392J0818M4807M5062J12254N9857
13009B70624m6262p1288p8024n4483k1926p825O4008N8041p69K36Q3485L1188
12997B27005J9053L0390p3401o1989R880M4913Q030L0739P3403K8645p3625j62303
12985A00740k6267O260J6011M433M6246M6483o2411o7563J9654R1631K8212r1209
12973A12220R9691J17364o3064m1523K4369Q1652J8558j7506Q2915l8755r2996
12962B82925j09546N9676K5971M5160Q5282l9435k7473j07939k0716J8996L8340
$$ plain form
13043 -1067 37481 75695 38961 41099 65329 122602 68134 80636 10048 32077 160397 286675
13031 286675 249181 299088 264198 248233 207054 179590 159884 126630 160355 122253 52682
13020 52682 33743 53623 108644 145385 58218 -2174 8644 53451 98513 210767 270624
13009 270624 224362 153074 75050 20567 -1359 -9184 54824 112865 112096 112332 195817 227005
12997 227005 246058 276448 203047 141058 150938 195851 203881 234620 308023 336668 263043 100740
12985 100740 74473 80733 96744 101177 147423 193906 131495 63932 83586 175217 203429 112220
12973 112220 211911 329275 266211 224688 249057 330709 349267 331761 414676 375921 282925
12962 282925 173379 233055 259026 304186 389468 350033 322560 214621 193905 212901 251241
12951B51241q5100o219P6392K415k6397o8430j06972M0909J6811k6060J8740o7581
12939A9749K4859O1395l3102N2878O7435R2956K9505l3686r3877m1939l7833J1817
12927A20157j719N3567m983M0678O2032j1748J6932j5554K2923m3775l3254N1714
12915B56970M5048J5636p1699L6254j3564l9037p4784K5662N8627l5914P2088
12904B75287k6905j3132J03257M7771o0394j06992j0387k3337K2218L5677k7108
12893B15955n1886j6883L6277Q7638J9902N7093K8762k3872j10272m1349M0785
12882B42150M6262J848J0857N0037n7256l6042o2797q8316K4496J30025J47818
12871D09082O991j42057j18841N6654K150J6834p6603o1898Q9686O5107p6204
$$ plain form
12951 251241 166141 159922 236314 238729 212332 143902 36930 77839 94650 68590 87330 19749
12939 19749 44608 106003 72901 125779 193214 286170 315675 281989 188112 146173 108340 120157
12927 120157 118438 172005 167022 207700 269732 257984 274916 259362 282285 238510 205256 256970
12915 256970 302018 317654 245955 282209 268645 229608 154824 180486 239113 203199 275287
12904 275287 248382 235250 338507 386278 325884 218892 208505 185168 207386 243063 215955
12893 215955 164069 147186 183463 271101 291003 348096 376858 352986 242714 201365 242150
12882 242150 288412 290260 301117 351154 293898 257856 195059 106743 131239 261264 409082
12871 409082 416073 274016 155175 211829 213979 230813 154210 92312 181998 247105 170901
12860A70901n400N070m1173o1117l1734J7510R3748J60573J4672p2819l4530l2805
12848A82896q8792j4573J371L0803O9426l7851k2269L082K3953N2464l7385j865
12836A61260K5220N7409j1880r6384j9551O4081O3856j9933p1241j0343R725r7212
12824E5007J6834O1480K4974M1016J4478j0328Q518o9233n722O5808J32682k513
12812C33001o8909l1039P2L4228q8832r07j915J5383O5481n6609J1412M5975J1913
12799B69254O5811k225j0437k8751o9622k9471J11599N9698l4596n3479q7152
12788A90629q9983j8159n5816M2312Q0837N2634m7842M1236N789m3164m2482M6274
12776A62265K181Q18K2763P598N71K3574k346K3080o4749q5773J11340k7081m0867
$$ plain form
12860 170901 165501 170571 129398 68281 36547 54057 147805 308378 323050 250231 215701 182896
12848 182896 94104 79531 80902 111705 181131 143280 121011 124093 148046 200510 163125 161260
12836 161260 186480 243889 232009 135625 116074 180155 244011 224078 152837 142494 152219 55007
12824 55007 71841 133321 158295 199311 213789 203461 211979 142746 137024 202832 335514 333001
12812 333001 264092 233053 233125 267353 178521 177614 175699 191082 256563 199954 211366 257341 269254
12799 269254 335065 332840 322403 293652 224030 194559 306158 365856 331260 277781 190629
12788 190629 100646 82487 26671 68983 149820 202454 154612 195848 201637 158473 115991 162265
12776 162265 164446 165264 188027 195625 196196 219770 217424 240504 175755 89982 201322 174241 133374
12763A33374R3436R792J1036p5434j2265N0627l3161L8794J21624J1019j2203
12752C36639j02235j5733R109k0853K8623j8424l8898K4044P1837l9555p2537
12741A62017p6437j4765J17223N8665l8834m4003J752O263R287m2116l7310J04291
12729B06033Q262o8051p5188R2526O2005L9866J03376M4575J7097l4531j43888
12718B52082j7549M7484p124m6663J7578R9063L5237j3275r6940n5235K874Q540
12706B26072M0901J8217m4398K248R6441M753q475m5758m1024l1328k7617J5507
12694B05539k5016l401M4813K0228l0464N281j72l6043Q8294J27311j9209l5300
12682C41861r0597K2060o74M5442J09642O5968l9816q7937r245J7114j1821r9907
$$ plain form
12763 133374 226810 236602 247638 172204 159939 210566 177405 216199 337823 348842 336639
12752 336639 234404 218671 227780 206927 235550 217126 178228 202272 274109 234554 162017
12741 162017 85580 70815 188038 246703 207869 163866 165618 171881 181168 139052 101742 206033
12729 206033 214295 146244 71056 163582 225587 265453 368829 413404 430501 395970 252082
12718 252082 234533 282017 274893 228230 245808 344871 380108 366833 269893 214658 217532 226072
12706 226072 266973 285190 240792 243040 339481 344234 335759 290001 248977 217649 190032 205539
12694 205539 180523 177122 221935 242163 211699 216980 216808 180765 269059 396370 377161 341861
12682 341861 251264 273324 272650 318092 427734 493702 453886 365949 356704 373818 361997 262090
12670B62090J1481l5310l1600K660k871M0540l1250P565L2261o4246O7204L0648
12658B89172l6781q1906j4803K9039m9255n9152J09860O4302l084M001K6267J03137
12646C80797q090K66l0504m7385N7454J4835K2985P3999r1367j05530k4062N986
12634B49384n8311j1587K8333R94P801K515R0202L9355l220J21775M1363p7874
12622D30730l7523Q292M10m8379o3310p1591O4720k471j5651K6787K0081Q1000
12610C93095N0549l0010M1884J8750k3367k5873n2164r62j212N595j13692P834
12598B70427J06997p7677j7145J9499R8386J17549O818j00611k3252l1338k1749
12587C47904o6671r530L6724l2941j9573n0593O5036Q5379k2656r500L2797l6965
$$ plain form
12670 262090 273571 238261 206661 209321 206450 246990 215740 223305 255566 191320 258524 289172
12658 289172 252391 170485 155682 184721 135466 76314 186174 250476 247392 251393 277660 380797
12646 380797 372707 372973 342469 295084 352538 367373 390358 464357 372990 267460 243398 249384
12634 249384 191073 179486 207819 208813 216614 219129 309331 348686 345466 467241 508604 430730
12622 430730 393207 401499 401909 353530 290220 218629 283349 280878 265227 292014 312095 393095
12610 393095 443644 413634 455518 474268 450901 425028 372864 371902 370690 376285 262593 270427
12598 270427 377424 299747 282602 302101 400487 518036 524854 424243 400991 369653 347904
12587 347904 281233 271703 308427 275486 255913 205320 270356 355735 333079 323579 356376 319411
12575C19411p0391J71L5649J6671q732k6333R8017L6135O4639k5659j37956p6256
12563B25366M2630J09540k5172L2171O6579O3099j2821j08083m6696P3475q2544
12552C37544r889Q8720K3600r773k2845R198M5347L4445o3983M4138J04006m0670
12540E39838r3975k5194j4914m9554L8617R5902k0995p95l4379L0774k1328j5268
12528D28729n9927r3227J4291M7816J08973O5278l8159L658J3727J3334n3103
12517D51390o5129m5525M7936M8666J7529J9900L2135m7937n951K2677n6619p757
12505D11315P3671J2733J3719p1707j6851J21440R8381l0393k0071L0921k3006
12494F00152n8408P6400k0182o0139J853j7008l005k2439O0772O4242N359o7997
$$ plain form
12575 319411 249020 249191 284840 301511 292779 266446 364463 400598 465237 439578 301622 225366
12563 225366 267996 377536 352364 384535 451114 514213 501392 393309 346613 420088 337544
12552 337544 327655 416375 439975 430202 407357 416555 461902 496347 432364 476502 580508 539838
12540 539838 445863 420669 405755 356201 394818 490720 469725 468930 434551 465325 443997 428729
12528 428729 368802 275575 289866 337682 446655 511933 473774 477432 491159 504493 451390
12517 451390 386261 340736 388672 437338 454867 474767 506902 458965 453014 475691 419072 411315
12505 411315 484986 497719 511438 439731 422880 544320 642701 612308 592237 623158 600152
12494 600152 541744 618144 597962 537823 539676 522668 519663 497224 557996 622238 627597 559600
12482E59600l6464J09594O4120O095j27202n3623J032O9304o998K2403l759N3493
12470F57595n715m6583K2529j3172J34221M7545q3858k9425j2174q5154K2799
12459F08608O7918N0890P412N1322k686j7253M2205Q901J1500L7713j01274l6702
12447G28554j5321l6455M8136N8452m7915m9403M5653J65j1788n9387O441J07145
12435G74277N2198L2911p7832j08356j03885L9418R35L9409M9081r594j21552
12424E67010p41J38343M4497k1087L8938L8975n9672r6864k044O2634J64782K4886
12412H99657q4944m9561j8432k6487Q0346q549m7647m7824J96208K0203l9581
12401H73389L4463K8537J0647o340j979k228M8831K1824k213N306J7532O8873
$$ plain form
12482 559600 523136 632730 696850 702945 575743 522120 523152 592456 585458 607861 604102 657595
12470 657595 651880 605297 627826 614654 748875 796420 712562 683137 670963 585809 608608
12459 608608 676526 727416 734828 786150 783464 766211 808416 817317 828817 866530 765256 728554
12447 728554 713233 676778 724914 783366 735451 686048 731701 731866 720078 660691 667132 774277
12435 774277 826475 859386 781554 673198 569313 608731 609666 649075 698156 688562 567010
12424 567010 566269 704612 749109 728022 766960 805935 746263 649399 647355 709989 874771 899657
12412 899657 814713 765152 746720 720233 800579 792030 744383 696559 892767 912970 873389
12401 873389 907852 936389 947036 940696 938717 936489 985320 1007144 1004931 1010237 1027769 1096642
12389A096642M2534o3201k2131j4187L2021J1354J7775m936j3978P5455P6269
12378A233617j06314n5460k7002N6738N4272M5412o5859l8068m6256q2240m5695
12367I23145l6896l3050k1456M2381R1298R7789J6214p993j3973p6423j9238L1742
12355I93540l0070n3361k0390j2800r288K5434M5985n7584j6398p7948J42614
12344I29734J07818M4867K0989O7305o1144l4929M468N0294j06514m8569R1803
12333A066122j3059j27488N6218P8621N2513j59376k9961Q0476J21313J8980K6561
12322A170920J6210j1414j2293K2115L066K1608L3262N1976J0374n8342P7589
12311A325071K7385P4656j9599r7141M512M1322o4457N3014O0720K4861K3351
$$ plain form
12389 1096642 1139176 1075975 1053844 1039657 1071678 1083032 1100807 1095871 1081893 1157348 1233617
12378 1233617 1127303 1071843 1044841 1101579 1155851 1201263 1135404 1097336 1051080 968840 923145
12367 923145 886249 853199 831743 874124 965422 1063211 1079425 1071432 1057459 981036 961798 993540
12355 993540 963470 910109 889719 876919 867631 893065 939050 881466 865068 787120 929734
12344 929734 1037552 1082419 1103408 1170713 1109569 1074640 1079108 1129402 1022888 974319 1066122
12333 1066122 1053063 925575 981793 1060414 1112927 953551 923590 1004066 1125379 1144359 1170920
12322 1170920 1187130 1175716 1163423 1185538 1188604 1210212 1243474 1295450 1305824 1247482 1325071
12311 1325071 1352456 1427112 1407513 1310372 1314884 1356206 1291749 1344763 1405483 1430344 1453695
12300A453695n5513Q6961J8541J7871k728L2604l1375j82135L0913Q3288k3008
12289A429114K2230N9648J0794p0988p6391r2860J9423J13538L4590N3072N2991
12278A555161J0607k0207L9945J4996J03990o2093N9743Q9147j988r238K9702
12267A809765m7676k0725n3519J3244K8457O8322K1331O771K2367M2747K6929
12256A918013J3623M4909q2966J03734J24817n1238j07386K3966R2796P8576j1794
12245B147050r8819L7173N8873n4612l2142K9056L8852J17995R4754M1075J60046
12234B539301O215l6636l6598j06552N6847R1377j29984p9397R7773J54074M0711
12223B597131L8554N4031N2086O8760k0669j08479K1598J27581K6252n7314q717
$$ plain form
12300 1453695 1398182 1485143 1503684 1521555 1518827 1551431 1520056 1337921 1368834 1452122 1429114
12289 1429114 1451344 1510992 1521786 1450798 1374407 1281547 1300970 1414508 1449098 1502170 1555161
12278 1555161 1565768 1545561 1585506 1600502 1704492 1642399 1702142 1791289 1789301 1780063 1809765
12267 1809765 1762089 1741364 1687845 1701089 1729546 1797868 1819199 1825970 1848337 1891084 1918013
12256 1918013 1931636 1976545 1893579 1997313 2122130 2070892 1963506 1987472 2080268 2158844 2147050
12245 2147050 2048231 2085404 2144277 2089665 2057523 2086579 2125431 2243426 2338180 2379255 2539301
12234 2539301 2545516 2508880 2472282 2365730 2422577 2513954 2383970 2304573 2402346 2556420 2597131
12223 2597131 2635685 2689716 2741802 2810562 2789893 2681414 2703012 2830593 2856845 2799531 2790814
12212B790814j33312N4287J38184R7433K1139M113M8881O474j42991j09883P2893
12201B848032O4167J6915j1189P3775n3322K0525K4858j1510O0957N2602O3594
12190C149404m0509K0999R9186J7784j0806m547M9486j457J3170M5994O3847p677
12178C394874j4853m4715O7776J14134R2655O9372J6269j8768p7475K8011K5217
12167C652497N0749L2863J2767n7338J5751L8672J19450J69219K4657K6688o6033
12156D019942Q2770J34118m0424l091L1764J5802P1938J39036J43272J3330Q1157
12145D689614J63632j5545p532Q3211L5391O5306J38069J94R4099J38662j7806
12134E367295J3525P3915j1834O7884J35457R4859L8880l0461R6471R7134R9619
$$ plain form
12212 2790814 2657502 2711789 2849973 2947406 2968545 2972658 3021539 3028013 2885022 2775139 2848032
12201 2848032 2912199 2929114 2917925 2991700 2938378 2958903 2983761 2972251 3033208 3085810 3149404
12190 3149404 3108895 3129894 3229080 3246864 3236058 3231511 3280997 3279540 3292710 3338704 3402551 3394874
12178 3394874 3380021 3335306 3403082 3517216 3609871 3679243 3695512 3676744 3599269 3627280 3652497
12167 3652497 3703246 3736109 3748876 3691538 3707289 3745961 3865411 4034630 4059287 4085975 4019942
12156 4019942 4102712 4236830 4196406 4193315 4225079 4240881 4312819 4451855 4595127 4608457 4689614
12145 4689614 4853246 4837701 4830169 4913380 4948771 5014077 5152146 5152340 5246439 5385101 5367295
12134 5367295 5380820 5454735 5442901 5510785 5646242 5741101 5779981 5749520 5845991 5943125 6042744
12123F042744Q1564N5066K451J03137K6680K5863R9623J98879K28882O8113J15250
12112G048252J79453N7622J67962J73778J65176J39973J28361R2109K13027K21609
12102H587322K29340J28996J51691K24096K24656K54331O5370N0721J64756J35863
12092A0217142P2185J94604L37063K24238J63257K21596Q0124Q0411Q8461J82078
12082A1861159K34649K43360J94463K20514K28438K20520K36240K41412L29942
12073A4010697L87844L22404L11080L33134L70523L20207L11473M02673M37584
12064A7207619M21371M23851M46782N35351N32797O30656O70976O54030P27736
12055B2251169P56203Q94075R45244J038884J111697J309160J494306J674454
$$ plain form
12123 6042744 6124308 6179374 6181825 6284962 6311642 6337505 6437128 6636007 6864889 6933002 7048252
12112 7048252 7227705 7285327 7453289 7627067 7792243 7932216 8060577 8152686 8365713 8587322
12102 8587322 8816662 8945658 9097349 9321445 9546101 9800432 9865802 9916523 10081279 10217142
12092 10217142 10289327 10483931 10820994 11045232 11208489 11430085 11510209 11590620 11679081 11861159
12082 11861159 12095808 12339168 12533631 12754145 12982583 13203103 13439343 13680755 14010697
12073 14010697 14398541 14720945 15032025 15365159 15735682 16055889 16367362 16770035 17207619
12064 17207619 17628990 18052841 18499623 19034974 19567771 20198427 20869403 21523433 22251169
12055 22251169 23007372 23901447 24846691 25885575 26997272 28306432 29800738 31475192
12047C1475192J829315K064996K302769K516814K677593K891745L017163K947492
12039E1723079K570298K123610J598010P55448K50335j05310l13909j30084J50044
12030E8621521L49595R29949J299603J716714K178818K563263K894031L063992
12022G3617486K974549K691834K241135J355667N67800j83031p57130j036201
12014H1472109q89485o38886k63206O3429N53820J032093J284556J660814K058637
12005H6333881K278541K592934K850578L186311L421606L687660M070064M340395
11997A12761970M665566M883898N357182N732686N979149O258963O661635P086107
11989A59387156P454877P864508Q368532Q691409R144118R440384R844692J0278510
$$ plain form
12047 31475192 33304507 35369503 37672272 40189086 42866679 45758424 48775587 51723079
12039 51723079 54293377 56416987 58014997 58770445 59020780 58915470 58601561 58471477 58621521
12030 58621521 58971116 59901065 61200668 62917382 65096200 67659463 70553494 73617486
12022 73617486 76592035 79283869 81525004 82880671 83448471 83265440 82508310 81472109
12014 81472109 80582624 79943738 79680532 79743961 80297781 81329874 82614430 84275244 86333881
12005 86333881 88612422 91205356 94055934 97242245 100663851 104351511 108421575 112761970
11997 112761970 117427536 122311434 127668616 133401302 139380451 145639414 152301049 159387156
11989 159387156 166842033 174706541 183075073 191766482 200910600 210350984 220195676 230474186
11981B30474186J0691701J1069200J1350849J1505334J1722687J1628807J1704036
11974C10146800J1498783J1107690J0670917R979949Q990588Q118406O809126
11967C77322259N283527L376684J169658j056361k958680m684474o016260o859124
11959C65577229p429684p693981p696200p305075o887663o655690o603552o836986
11951C08468398p344803q123318q873953r779084j0670324j1374019j1739211
11944B40563686j1612200j1094492j0447243r489134q348314p415363o597777
11937A75559163n966254n646233n630742n852238o152654o379893o626038o625224
11929A26679887o498066o187005n813762n447786n152169m823931m310713l905536
$$ plain form
11981 230474186 241165887 252235087 263585936 275091270 286813957 298442764 310146800
11974 310146800 321645583 332753273 343424190 353404139 362394727 370513133 377322259
11967 377322259 382605786 385982470 387152128 386095767 383137087 378452613 372436353 365577229
11959 365577229 358147545 350453564 342757364 335452289 328564626 321908936 315305384 308468398
11951 308468398 301123595 293000277 284126324 274347240 263676916 252302897 240563686
11944 240563686 228951486 217856994 207409751 197920617 189572303 182156940 175559163
11937 175559163 169592909 163946676 158315934 152463696 146311042 139931149 133305111 126679887
11929 126679887 120181821 113994816 108181054 102733268 97581099 92757168 88446455 84540919
11921H4540919l645776l473687l216655k986986k761323k508292k334532k124101
11913F1489567k149286j955491j814335j710259j469426j412145j339951j411303
11905D8227371j378695j247372j071565j044958j028114j028379q63916o83794
11897C9880578n43311n38513m36239k96649j53211m445J59505N18308P82569J050360
11887D0418952J256229J571033K031399K246144K431831K418601K027312J235158
11879E5636659L49660p00762j503021j987443k103627k059826j858636j516755
11871D4256249j164344r06555l68869J11572M28534P88860R15072Q25712M77872
11862D5364103J6475m97518j282815k001779k307372k471300k575352k412508
$$ plain form
11921 84540919 80895143 77421456 74204801 71217815 68456492 65948200 63613668 61489567
11913 61489567 59340281 57384790 55570455 53860196 52390770 50978625 49638674 48227371
11905 48227371 46848676 45601304 44529739 43484781 42456667 41428288 40564372 39880578
11897 39880578 39337267 38798754 38362515 38065866 37912655 37908210 38067715 38586023 39368592 40418952
11887 40418952 41675181 43246214 45277613 47523757 49955588 52374189 54401501 55636659
11879 55636659 55986319 55285557 53782536 51795093 49691466 47631640 45773004 44256249
11871 44256249 43091905 42185350 41816481 41928053 42356587 43145447 44060519 44886231 45364103
11862 45364103 45380578 44883060 43600245 41598466 39291094 36819794 34244442 31831934
11854C1831934k201020k070568j773528j647414j412761j178694j254201j031658
11846A9262090q96696q06488o90449n56076n45809m71929m75810n15052m01794
11837A3901987k92012l10346l29121k47182l66346k74577j85823j16096k09688
11828A1570796k60903k63665k51552j13732j63862j98535j78426j23820j89499
11819I826802j54801m5364j59548k63412j62289r3756r0488k10358j5307q6806
11809H544673n9477l1197j59706k45325j29481m0382p6199n1281n7695j86471
11799G507459n7523q705k1470q5021j42914r0937r6325r1082j15908m4767o6924
11788F685883r0885j13284J3833k8551j62259o7727l3233j11072j37407j02206
$$ plain form
11854 31831934 29630914 27560346 25786818 24139404 22726643 21547949 20293748 19262090
11846 19262090 18365394 17558906 16868457 16312381 15766572 15294643 14818833 14303781 13901987
11837 13901987 13609975 13299629 12970508 12723326 12356980 12082403 11896580 11780484 11570796
11828 11570796 11309893 11046228 10794676 10680944 10517082 10318547 10140121 10016301 9826802
11819 9826802 9672001 9626637 9467089 9203677 9041388 8947632 8857144 8646786 8631479 8544673
11809 8544673 8485196 8453999 8294293 8048968 7919487 7879105 7802906 7751625 7693930 7507459
11799 7507459 7449936 7441231 7419761 7334740 7191826 7100889 7004564 6913482 6797574 6752807 6685883
11788 6685883 6594998 6481714 6495547 6466996 6304737 6237010 6203777 6092705 5955298 5853092
11778E853092p0569j05457J9446N7178J736m8052j17874j57971j93030n4599j912
11767E181988j26498r7668j0178j01487q7627l8960m6519J4693k7245j3946K699
11756D649252q1780j68969p2414J5949p7028j02739m9106j1716M0359J9809p5345
11745D086272j24825n6558l9095m4900O8796p9778k6116K0853N572q2422j28466
11734C599333M2555m8236l6700Q125j5857K0832o1766p3561L5926J6181o2456
11723C424376O7694P28n8491l0586l2193j24936o7809o2081o190n0765j4378m4677
11711C000692k7283j6090N616Q0j18299m0956k4094P480j980R2230j4371j60371
11699B702654j1894R4416Q8586q0646l5905o2704K7382N2153K8296k9170p4955
$$ plain form
11778 5853092 5782523 5677066 5696512 5753690 5755426 5707374 5589500 5431529 5238499 5183900 5181988
11767 5181988 5055490 4957822 4947644 4846157 4758530 4719570 4673051 4687744 4660499 4646553 4649252
11756 4649252 4567472 4398503 4326089 4342038 4265010 4162271 4113165 4101449 4141808 4161617 4086272
11745 4086272 3961447 3904889 3865794 3820894 3889690 3809912 3783796 3804649 3810221 3727799 3599333
11734 3599333 3641888 3593652 3556952 3565077 3549220 3570052 3508286 3434725 3470651 3486832 3424376
11723 3424376 3492070 3492798 3434307 3403721 3371528 3246592 3178783 3116702 3110512 3059747 3045369 3000692
11711 3000692 2973409 2957319 2962935 2963015 2844716 2803760 2779666 2787146 2785166 2877396 2863025 2702654
11699 2702654 2690760 2785176 2873762 2793116 2757211 2694507 2721889 2774042 2802338 2773168 2698213
11688B698213p1284k5980N752J1978k1213o728M8381n2783l5617L3763k5644l9136
11676B519702r1520K0505K8284n8827m7149q8096j22541l4008J04476k1356P160
11665B216630R16N922O0646m0140o4225j3413k5831k9309M4746k1767j0097N5529
11653B179607L177q3882j18564J1206o9625J00763R5368l2523n9686k2937N449
11642B008353K0104j257M1786M6929j0917n4602N8147J6448o7138m7257K993r153
11630B004436N4094l8478o4610l8749n2249L1793N0072o4528m8906N2677l3380
11619A852172o0900K7581j2664m1936o6083m2877P298P0780N6723n7197o1818
11608A671079O520R0350J38058P0289n1090o1252n8707p6489M737j3444j0122
$$ plain form
11688 2698213 2626929 2600949 2606701 2618679 2597466 2590738 2639119 2586336 2550719 2584482 2558838 2519702
11676 2519702 2428182 2448687 2476971 2418144 2370995 2282899 2160358 2126350 2230826 2209470 2216630
11665 2216630 2217546 2223468 2284114 2243974 2179749 2166336 2140505 2111196 2155942 2134175 2124078 2179607
11653 2179607 2182784 2098902 1980338 1991544 1921919 2022682 2118050 2085527 2025841 2002904 2008353
11642 2008353 2028457 2027200 2068986 2115915 2104998 2050396 2108543 2124991 2057853 2010596 2013589 2004436
11630 2004436 2058530 2020052 1955442 1916693 1864444 1896237 1946309 1881781 1832875 1885552 1852172
11619 1852172 1791272 1818853 1806189 1764253 1698170 1655293 1662591 1733371 1790094 1732897 1671079
11608 1671079 1677599 1767949 1906007 1976296 1925206 1863954 1805247 1728758 1733495 1720051 1709929
11597A709929J4179P2419m568r0403q9376j02642J0149M7995k047Q5516M8201
11586A699352l5560j4651l6012n3943J6507j6841k4257J27809K5932k1455o759
11575A660122k5577m6924j00311Q189k9555K1008j545k5398K7797Q5315o924j25691
11563A440506j29511j0784M6594J4480J8103m2636j2538p9356l9409J6438Q8301
11552A310188J23146P374j8028p6648p2568k9308k952j138K2794K6299P6746k5892
11540A340013j1428j8116r236j0513j591R494n1143k333J01759K9278p4977J9450
11528A320657l9151j5565O5023m159m7794N0787K8952n881j04290o2232k7052
11517A159295J20164N8991L0699k5407N3115Q8596M7799n8026l5531o4021m8679
$$ plain form
11597 1709929 1724108 1796527 1791959 1701556 1612180 1509538 1519687 1567682 1565635 1651151 1699352
11586 1699352 1663792 1649141 1613129 1559186 1575693 1558852 1534595 1662404 1688336 1666881 1660122
11575 1660122 1634545 1587621 1487310 1495499 1465944 1486952 1485407 1460009 1487806 1573121 1566197 1440506
11563 1440506 1310995 1300211 1346805 1361285 1379388 1336752 1324214 1244858 1205449 1221887 1310188
11552 1310188 1433334 1440708 1422680 1346032 1273464 1244156 1241204 1240066 1262860 1289159 1365905 1340013
11540 1340013 1328585 1310469 1301233 1290720 1289129 1298623 1247480 1245147 1346906 1376184 1301207 1320657
11528 1320657 1281506 1265941 1330964 1326805 1279011 1329798 1358750 1352869 1248579 1186347 1159295
11517 1159295 1279459 1338450 1369149 1343742 1396857 1485453 1533252 1475226 1439695 1375674 1326995
11506A326995M7934p897j5672k4511L1618n3810l7050j3121k1291m091o5599j76071
11494I87434M7173K8716R2369K618m5734n0703l3486n5684P23k4862L1282K4369
11482A004215o4698m8923k151J11931J9522j0997K9236l474k2571m8728o6348
11471H97014p809M0994L5807n7284j8957q0528l9260J5181J4916K1432K8418L2173
11459H82097L9237R641L771o9169k9504k2750m4726K3219M0678O3033L7956m4408
11447H89075n6174n9320L8097k8965O7098k211J4355l4580Q6913N0565p2664m3299
11435H48890m5055K4144L5593N88M5602l5080J9707K1922n7481N6465N967r1369
11423H29893R0441m1378m7220O9685j5465q3135l5623N8541K6545N1183m8316
$$ plain form
11506 1326995 1374929 1367032 1351360 1326849 1358467 1304657 1267607 1254486 1233195 1229104 1163505 987434
11494 987434 1034607 1063323 1155692 1158310 1112576 1061873 1028387 972703 973426 948564 979846 1004215
11482 1004215 939517 890594 888443 1000374 1019896 1008899 1038135 1034661 1012090 963362 897014
11471 897014 889205 930199 966006 908722 889765 809237 769977 785158 800074 821506 849924 882097
11459 882097 921334 930975 934746 865577 836073 813323 768597 791816 832494 895527 933483 889075
11447 889075 832901 773581 811678 782713 849811 847600 861955 827375 914288 964853 892189 848890
11435 848890 803835 827979 863572 864160 909762 874682 894389 916311 858830 915295 921262 829893
11423 829893 920334 878956 831736 901421 885956 802821 767198 825739 852284 903467 855151
11412H55151n2598L278j6331l4967j42012K888J00352j3219M9457J1632q871N6344
11400H11104R9478j17273j09231l7727J6307l2515m8034k1399N2428L4813P8360
11389G26311m9555K2226K5503j00349K0982l0508M9977o1488j11094M1872M9994
11378E83871L3978R4039m0173o3932j10179k2268N333k5701R2797Q0376o0836
11367E67305j34641J07020Q3298L7256K2564J5712N5722L4027J1071n3949o7425
11356F77960k9234m7437M8257j5941O347o1830o8055q3798l6711j8555L1564K6148
11344D28715R2656O4548m3090j8602R5508L3918J0384j0938m2731o5017m448j11188
11332D29715p3456K2395L8237N7892L1374l4J52587N0768M2038M2822j90499j23287
$$ plain form
11412 855151 802553 805831 789500 754533 612521 615409 715761 702542 751999 763631 754760 811104
11400 811104 910582 793309 684078 646351 662658 630143 582109 560710 613138 647951 726311
11389 726311 676756 698982 724485 624136 645118 614610 664587 603099 492005 533877 583871
11378 583871 617849 711888 671715 607783 497604 475336 480669 454968 547765 628141 567305
11367 567305 432664 539684 622982 660238 682802 698514 754236 788263 799334 745385 677960
11356 677960 648726 601289 649546 633605 639952 578122 510067 426269 389558 371003 402567 428715
11344 428715 521371 585919 542829 524227 619735 653653 664037 653099 610368 545351 540903 429715
11332 429715 356259 378654 416891 474783 506157 506123 658710 709478 751516 794338 603839 480552
11320D80552R6957M0803L6937l1052o4555Q932j6436R1952Q0159j76498o3561
11309D84190m461P6094n2176N506N9356p006n1509l1131k3915n3651q1522Q1051
11297D00826R0753O498J0212j6623o6190P464L157j34004K437J5734N6604O7159
11285D44027M219j4174m3555l4658k149l9680J13719O4114K0668J10290k1998
11274F00823o1221k5717O869q9613j755N3917N9591P1936P646j9943l931m6410
11262E52192M216m8605q8200O887m8708Q634R871q7595N4028J34850J0745l0622
11250D77693L5259L6124p584N6000J15046j3297q7219J3453M469j6562L983l111
11238F14254o6520j40080N3923N0100k1223k7128J4478J1814R708j19552M3966
$$ plain form
11320 480552 577509 618312 655249 624197 559642 568574 552138 644090 724249 547751 484190
11309 484190 479729 555823 503647 509153 568509 561503 509994 478863 454948 401297 319775 400826
11297 400826 491579 498077 508289 491666 425476 432940 436097 302093 304530 320264 376868 444027
11285 444027 448246 434072 390517 355859 353710 314030 427749 491863 512531 622821 600823
11274 600823 539602 513885 520754 431141 429386 483303 542894 614830 622476 602533 598602 552192
11262 552192 556408 507803 419603 426490 377782 386416 396287 308692 362720 497570 508315 477693
11250 477693 512952 549076 541492 597492 712538 699241 612022 625475 629944 613382 617365 614254
11238 614254 547734 407654 461577 511677 490454 463326 477804 489618 499326 379774 423740
11227D23740J1985p488O4985n408K2669J3889p9365q2204J8316N3008P2865k7330
11215D79662m2694K2821N757o3742J6935P2159J5141K294K5046j9093m5225K1650
11203D90711n0037m9337j5687P0825K5847O2516o9402o702q01M6980j0081m8614
11191D46218k8291L4558r1726q4616O9869J43643M8467o7842O5597P6055l6631
11180E75301j36998j47037M0427o237M3117P5408K682l5925m5063P4958M7756
11169D88389Q0339r3751j8675n2630o6223m974l0064Q9374k1312k4905n0631l1239
11157B63698Q70Q2054L6670o0524k9265L158J5880k5859L7298L7500R9624j4056
11145D47048o3294L0124N0368r0199n1417K0698J10904n2506o1726J2515j07543
$$ plain form
11227 423740 435725 428237 493222 487814 510483 524372 445007 362803 381119 434127 506992 479662
11215 479662 436968 459789 465546 401804 418739 490898 506039 508333 533379 514286 469061 490711
11203 490711 440674 391337 375650 446475 472322 534838 465436 458734 457933 504913 494832 446218
11191 446218 417927 452485 360759 276143 346012 489655 538122 470280 535877 611932 575301
11180 575301 438303 291266 331693 325456 368573 443981 446663 410738 365675 440633 488389
11169 488389 568728 474977 456302 403672 337449 332475 302411 391785 370473 345568 294937 263698
11157 263698 264568 346622 383292 322768 293503 296661 312541 286682 323980 361480 461104 447048
11145 447048 383754 413878 464246 374047 322630 343328 454232 401726 340000 352515 244972
11134B44972o7818K1458J1756M966J9925Q4762M7391O949J0503N7102q2634m3572
11122C15760k6415O9289M0024n2946L1769N2434k3863k5601l7559n9807L7217
11111C20302J15561O6452q3494j10570q5761j9964M4270n9998N006M2393P5864
11100C10061L8148m4871p5400N439J8069j544q2215o1705R2838L5033M6707P1919
11088C52479O2185P2457p2879n5304K4756R2837m6274j35139k6943k0759N924
11077B53340N7688L4584o8260n264m7185k0339Q5438k906k6821n4198o1207m5918
11065I8952l3668J06441J00320K2465K1987N8828J05093L7971j20411k0033L2544
11054D10489J28224R664p8810n1323j0979j555J6654J27537J41937R3834q098
$$ plain form
11134 244972 177154 198612 210368 215334 235259 320021 367412 374361 384864 441966 359332 315760
11122 315760 289345 358634 398658 345712 377481 429915 406052 380451 342892 283085 320302
11111 320302 435863 502315 418821 308251 222490 202526 246796 186798 191804 234197 310061
11100 310061 348209 303338 227938 233377 251446 249902 167687 105982 198820 233853 280560 352479
11088 352479 414664 487121 414242 358938 383694 476531 430257 295118 268175 247416 253340
11077 253340 311028 345612 277352 272088 224903 204564 290002 287096 260275 206077 144870 98952
11065 98952 65284 171725 272045 294510 316497 375325 480418 518389 397978 377945 410489
11054 410489 538713 548377 469567 418244 407265 405710 422364 549901 691838 785672 777574
11043G77574j19086k0773j9204m5063K8372j0247M1558R6176N3727J82615J30605
11032A096254J0998M8380j03833j15859l8165P6902J0384L6437N0162J40652J97311
11021A409623J12025n6962j13232j24838k13588j40793k3224n3539L686O7103
11011H66261J87751J29050j928J1827q9286k48073r4562q6745K291j7718L973
11000F62841O7819J11783J0425j109k8037m1508j73054j69683j9134K7367p2292
10989C75418j07121J662L9732J09057j0272l4956m3529L1510l5015L531j5315
10978C14702N9485R7281M7462j21400k5503R4517m3687n7250N5426K7592q6950
10967C61675J4597L1692Q6863Q5409J14111k0033n7643n1330N7890R4159N0765
$$ plain form
11043 777574 658488 637715 618511 573448 601820 591573 633131 729307 783034 965649 1096254
11032 1096254 1107252 1155632 1051799 935940 897775 974677 985061 1021498 1071660 1212312 1409623
11021 1409623 1521648 1464686 1351454 1226616 1013028 872235 849011 795472 799158 866261
11011 866261 1054012 1183062 1181134 1192961 1103675 855602 761040 674295 676586 658868 662841
11000 662841 730660 842443 852868 851759 823722 782214 609160 439477 420343 447710 375418
10989 375418 268297 269959 309691 418748 408476 373520 329991 361501 326486 330017 314702
10978 314702 374187 471468 518930 397530 372027 466544 422857 365607 421033 448625 361675
10967 361675 376272 407964 494827 580236 694347 674314 616671 565341 623231 717390 768155
10956G68155O1140m854N1876K35019K21172J18039J39410J68723K43628M40294
10946B442602L40224K71034M11064N15060O28278O31191N87568M04893L28258
10937F560172J70383l0684k15151l83436l79697l53135m11634k87398j83522q6291
10927D399607j76886l2622J07887K21201J98663M07231N61538M89096O45141Q70918
10917G691774J019441J207428J209996J226956J139098R39534N16751j81081o66055
10908A4103842j020138j281714j189355r70750r03548q46182n98131n13693m20769
10899F359562k31429k36154j34815o5648O0468J88151K36775K95357N09604P19308
10889G701179P32062P39220P98844N81441M35798J83886j69494m38787n14194
$$ plain form
10956 768155 829295 824441 876317 1111336 1332508 1450547 1589957 1758680 2002308 2442602
10946 2442602 2782826 3053860 3464924 3979984 4608262 5239453 5827021 6231914 6560172
10937 6560172 6730555 6699871 6484720 6101284 5721587 5368452 4956818 4669420 4485898 4399607
10927 4399607 4222721 4190099 4297986 4519187 4717850 5125081 5686619 6175715 6820856 7691774
10917 7691774 8711215 9918643 11128639 12355595 13494693 14434227 14950978 14769897 14103842
10908 14103842 13083704 11801990 10612635 9641885 8738337 7892155 7294024 6780331 6359562
10899 6359562 6128133 5891979 5757164 5691516 5751984 5940135 6176910 6472267 6981871 7701179
10889 7701179 8433241 9172461 9971305 10552746 10988544 11172430 11002936 10564149 10049955
10880A0049955m32220j90794k5924J77768M82527P24324J046851J230583J538399
10871A4601469J476000J187748O13379J5884m61697r36128j226557j248433j175880
10862A2845785r48494p53703n58772l93651l28296n8231M3570L13298N57473O54281
10852A1373260R06749J357968J632329J961412K516188K969051L205678L112138
10844B9034773K634637J656673L63387r40843k131483k823288l045383k934822
10836B1813651k557879k152206j761763j482132j145444p41686n78930n16081
10828A0877530l35223m4537J30632L80631N70214P12167R06513J178096J318489
10819A5694512J339230J257913Q73839K46303n35318r45397j236158j384981j438234
$$ plain form
10880 10049955 9617735 9426941 9401017 9578785 10061312 10785636 11832487 13063070 14601469
10871 14601469 16077469 17265217 17878596 17894480 17432783 16496655 15270098 14021665 12845785
10862 12845785 11897291 11143588 10584816 10191165 9862869 9804638 9848208 10161506 10718979 11373260
10852 11373260 12280009 13637977 15270306 17231718 19747906 22716957 25922635 29034773
10844 29034773 31669410 33326083 33689470 32748627 30617144 27793856 24748473 21813651
10836 21813651 19255772 17103566 15341803 13859671 12714227 11972541 11393611 10877530
10828 10877530 10542307 10497770 10628402 11009033 11579247 12291414 13197927 14376023 15694512
10819 15694512 17033742 18291655 19165494 19411797 18876479 17931082 16694924 15309943 13871709
10810A3871709j197806r36401o86594l76596p6349L27914M90033N97508O49978
10801A2663396M75575J96709l82128p88561j012400j012547r71221q12251o90552
10792G666020o57420m47267j63500q3101R132N7257K12929K52584L99201N67135
10782G812970P10267J003775J156864J309647J566904J652656J546868J247930
10774A8007881N91214j85068q76789j401704j663209j654730j574901j382004
10766I860690j253251r25256o52236n64559l96425l42977j64743o0003m0990N507
10756E465757K04106K98418M08636N24958N53966N93480N38287L07046R2440j30254
10746H856840m31832n56418o44935p95728p76123o65143n99061n71759m74938
$$ plain form
10810 13871709 12673903 11737502 11050908 10674312 10597963 10925877 11415910 12013418 12663396
10801 12663396 13138971 13335680 12953552 12164991 11152591 10140044 9168823 8356572 7666020
10792 7666020 7008600 6561333 6397833 6314732 6323864 6381121 6594050 6846634 7245835 7812970
10782 7812970 8523237 9527012 10683876 11993523 13560427 15213083 16759951 18007881
10774 18007881 18599095 18414027 17537238 16135534 14472325 12817595 11242694 9860690
10766 9860690 8607439 7682183 7029947 6465388 6068963 5725986 5561243 5501240 5460250 5465757
10756 5465757 5669863 5968281 6376917 6901875 7455841 8049321 8587608 8894654 8987094 8856840
10746 8856840 8425008 7868590 7223655 6427927 5651804 4986661 4387600 3815841 3340903
10737C340903m70816l32010l32745k63689r6629j35437j24246j05557q2659q7741
10727A309374j18415j13546Q791m3226J4349q7013j73249l2968M7991J00702L1539
10716I44329j13297j18390j6011k2555L7266O512J710o2670l7045P8802P3727
10705G72378p6224r4060p9000m7840o9192o065N1226K4509R2545J6400q3103K47
10693E01821L9622J4607n8699l7670m1654q9642p5014N4269N165p0563Q6552J22884
10681D51678M3990l3642j1990o319k8658l7146K5160o7554M6022N5317N680P0482
10669E13020O6447o895p2688P0146o4637q9387M4010M2317R1040j05339m0339
10658D47695O9385L8283M7484K7586L5030K0186N2218K0789L4690J2432L3162
$$ plain form
10737 3340903 2870087 2538077 2205332 1941643 1845014 1709577 1585331 1479774 1397115 1309374
10727 1309374 1190959 1077413 1086204 1042978 1057327 970314 797065 764097 812088 912790 944329
10716 944329 831032 712642 696631 674076 711342 717854 719564 656894 619849 698651 772378
10705 772378 696154 602094 523094 475254 406062 399997 451223 475732 568277 584677 501574 501821
10693 501821 541443 556050 497351 459681 418027 328385 253371 307640 312805 242242 328794 451678
10681 451678 495668 462026 450036 443717 415059 377913 403073 335519 381541 436858 442538 513020
10669 513020 579467 572572 499884 570030 505393 416006 460016 502333 593373 488034 447695
10658 447695 517080 555363 602847 630433 665463 685649 737867 758656 793346 805778 838940
10647H38940P4070k5783M161P101k7379J01201J58399J18018J14489K16273J84701
10636A764191K41709L20174K86539L89191N27718M51568L68788L38341L31906
10627E020125N09033O48174Q69390J254225J582854K250269L244991M550113O255688
10618B6184862Q260592J0383498J1714733J0829013O806367J134387l244146m444540
10610F7624766l006712J27633M215331R191922J4904062K0762574K4272925K1285813
10602A59378314R646165n249608j4837026j6078589j1631724m795794K844094
10595A19275832J1083929J9682903K7367585L0680804K3912202N036251j6603860
10588B20435646k8846285k9008577k2377609j3944127n687961J950020Q937949
$$ plain form
10647 838940 913010 887227 891388 898489 871110 972311 1130710 1248728 1363217 1579490 1764191
10636 1764191 2005900 2326074 2612613 3001804 3529522 3981090 4349878 4688219 5020125
10627 5020125 5529158 6177332 7046722 8300947 9883801 12134070 15379061 19929174 26184862
10618 26184862 34445454 44828952 56543685 67372698 74179065 75313452 72069306 67624766
10610 67624766 64618054 64745687 68961018 78152940 93057002 113819576 138092501 159378314
10602 159378314 169024479 163774871 148937845 132859256 121227532 116431738 119275832
10595 119275832 130359761 150042664 177410249 208091053 232003255 237039506 220435646
10588 220435646 191589361 162580784 140203175 126259048 120571087 122521107 131459056
10581A31459056J4643616J6228585J0280550k959837j6911091k3752875k2561222
10574A06426782j7156529j1143554n892975j776667J639103L810855L839193R86815
10566H0733023m404791r470032j1814743j1373523r264103o984105n022031l673989
10558A8725706k852989k174828j667662j355628j093840q14196p58184p51948
10550G256431o18737n38842n88157m20583l08505k28275j80377k39532k38360
10541C895063k44832j41130j55044j35447k85777l12471q6859k9370j01768j49365
10531B253000j38412r0623k2917j03926r0880M1182n6019r1772q367j1521p6705
10520A603040j0468J4795J9339q0393l9475m1643q6281j06851k6793m5377K5375
$$ plain form
10581 131459056 146102672 162331257 172611807 169651970 152740879 128988004 106426782
10574 106426782 89270253 78126699 72233724 70457057 72096160 75907015 79746208 80733023
10566 80733023 76328232 66858200 55043457 43669934 34405831 27421726 22399695 18725706
10558 18725706 15872717 13697889 12030227 10674599 9580759 8766563 8008379 7256431
10550 7256431 6637694 6098852 5510695 5090112 4781607 4553332 4372955 4133423 3895063
10541 3895063 3650231 3509101 3354057 3218610 2932833 2620362 2533503 2504133 2402365 2253000
10531 2253000 2114588 2023965 2001048 1897122 1806242 1847424 1791405 1699633 1691266 1679745 1603040
10520 1603040 1592572 1607367 1626706 1546313 1506838 1465195 1378914 1272063 1245270 1199893 1225268
10509A225268N5907r985o2951o464o4154J01953P9346L609J4538j16380j12851
10498A107836j05861k2355L2002q4461n4120r9q8757M1676N0867K4791n0230O7572
10486I18861q506r3430K2249m2710n6693L5108o4606n3001J6734J69786K9648
10475H73440Q893m9783n5628L8458k2431j10431j02783J2307J20680J27202j367
10464H38557N6672L5477l9546j09700l3624L9024J2041j05932m4870L3338l3679
10453F47758n179O7332N6852K3696M321m3432N7539N3771k6649P7538N424q1611
10441H37360m9072L4783N8149J29699M8861l8077m8065K428j1839o1950q1453
10430H20824q343n4994q9227j0419j8150K1560J0443L8693J1045L185L0340o94
$$ plain form
10509 1225268 1281175 1271190 1208239 1201775 1137621 1239574 1318920 1322529 1337067 1220687 1107836
10498 1107836 1001975 979620 1011622 927161 873041 872942 784185 825861 876728 901519 851289 918861
10486 918861 910355 816925 839174 796464 739771 774879 710273 657272 674006 843792 873440
10475 873440 882333 832550 776922 815380 792949 682518 579735 592042 712722 839924 838557
10464 838557 895229 930706 891160 781460 747836 786860 798901 692969 648099 681437 647758
10453 647758 642579 709911 766763 790459 794780 751348 808887 862658 836009 913547 918971 837360
10441 837360 788288 823071 881220 1010919 1059780 1021703 973638 976066 964227 902277 820824
10430 820824 812481 757487 668260 657841 639691 661251 671694 710387 721432 724617 754957 754263
10418G54263q1723n6836L088m0988q844J4046M4268L7561J4166n0650j53315j14545
10406C60491N0779J17779O344q444N8295p7249M3272O5711O0058m792p7776l7287
10394E57181M0761K1883k3991K2535L320l5041j8333n3318l5986p1079j6692n7980
10382C33260j5445N859j4815k2781Q107j5543k9784R8448k0657O722J1015n0194
10370B94192L1466o701p3864n0544j9134o1398M9723M1279p7470q1589l9407R8659
10358A05212Q8920Q1265M296r80k2592j3658o710L4267K1181j6874K2600p468
10346B89459P4974J34147p0531j47653l8037J27985j3961r8206n3268m281k3079
10335A77549P5242P974k2116q911P0675J3100N8329j2109j559l5959l4418j4138
$$ plain form
10418 754263 672540 615704 618792 577804 568960 583006 627274 664835 679001 628351 475036 360491
10406 360491 411270 529049 535393 526949 585244 507995 551267 616978 677036 672244 594468 557181
10394 557181 597942 619825 595834 618369 621689 586648 568315 514997 479011 407932 391240 333260
10382 333260 317815 323674 308859 286078 294185 278642 248858 347306 326649 333371 344386 294192
10370 294192 325658 318957 245093 194549 175415 114017 163740 205019 127549 45960 6553 105212
10358 105212 194132 275397 279693 278713 256121 242463 235753 270020 291201 274327 296927 289459
10346 289459 364433 498580 428049 280396 242359 370344 356383 258177 204909 200628 177549
10335 177549 252791 260765 238649 229738 300413 313513 371842 359733 358174 322215 287797 273659
10323B73659L397M430L0013O0029j8364r2206l9457J1149k6469Q7312N5987O272
10311C55752K3629l7277r5290J3869O3097m2307m9225p5367j7921O9443N1289
10300B59692k370m1966R6949J0360l9291N3869n263j69255j8590J64370k9712
10289B78793j45403M2355J59633R397m0084L5914k9833r4799o3596L3668R8071
10278B84116j1451n868l5680p6598K1860J61975M9592p5464M4047J19733M6806
10267E23068L4003r2736k02043j00569l0829M5098R858o4098M8243N2213k5729
10256A96479N4087R4252m8493o1885r7733N8525O5822J2665M9196N4467k5059
10245C52323j5620L2853J36907K0389k8247j50776n4658m590j9967k3804M719
$$ plain form
10323 273659 277056 281486 311499 371528 353164 260958 221501 232650 206181 293493 349480 355752
10311 355752 379381 342104 246814 260683 323780 281473 232248 156881 138960 208403 259692
10300 259692 257322 215356 312305 322665 283374 337243 331980 162725 144135 308505 278793
10289 278793 133390 175745 335378 344775 304691 340605 310772 215973 152377 186045 284116
10278 284116 272665 266797 231117 154519 176379 338354 387946 312482 356529 476262 523068
10267 523068 557071 464335 262292 161723 130894 175992 185850 121752 169995 222208 196479
10256 196479 250566 344818 296325 234440 136707 195232 261054 273719 322915 377382 352323
10245 352323 336703 369556 506463 526852 498605 347829 293171 288581 268614 244810 249529
10234B49529L3938M1890O3958j9208o6626q1667R1311J3891k0673O0380O4802
10223D31525K272m6095R24k7149J0433j1996m71N6177Q9899n7729j00067l6119
10211C11604J8752j7078j9968K0817K5256N5746R672o471l8405n3593m630J11748
10199D13450j8138j9337n7144l4399N1978P9927J6853J2975l4461o9476j242j5891
10187C25095J9477L7389M8428M2914j7428j9721O5648k1817J0886J25915J81902
10176G98688L5450r2635j00272o1902K4961J48549R5343K7659J88455J27561O8391
10165A260248m1254p5865j7184O51r5075j4896P4980O4403J39006J50096J03737
10154A548847N4973n73j36095k33191k82774j15812j981P3387N0855O8821Q1284
$$ plain form
10234 249529 283467 325357 389315 370107 303481 221814 313125 327016 306343 366723 431525
10223 431525 433797 387702 388626 361477 371910 359914 359443 415620 505519 447790 347723 311604
10211 311604 330356 313278 293310 314127 339383 395129 404801 398330 359925 306332 301702 413450
10199 413450 395312 375975 318831 284432 336410 416337 433190 446165 411704 342228 340986 325095
10187 325095 344572 381961 430389 473303 455875 436154 501802 479985 490871 616786 798688
10176 798688 834138 741503 641231 579329 604290 752839 848182 875841 1064296 1191857 1260248
10165 1260248 1218994 1143129 1125945 1126596 1031521 1016625 1091605 1156008 1295014 1445110 1548847
10154 1548847 1603820 1603247 1467152 1233961 951187 835375 833394 906781 957636 1026457 1107741
10143A107741J59499J78185r9679j10789k69638q9602m1080j29043j24592o1628
10133E19374J79577J70946k4446p7521l3523m2211j12078m2157M1180j00923m5635
10122D32583k176J5797p9831p0206q1885L8926Q4626O8794j4907J6217k4027k2861
10110C61050j1258p0712m0040m623m1371J9968j786j7822r5703o0427n8270L3968
10098A2974P9348Q7399L8511k2779n681o3327J671N0950l0706n16m633k6919o8400
10085D7892k7623j4535J1625Q7181L5204Q0697P4815N4838j10711l4707J1117
10074B15793m4925L892K0854k0873J2052p4767p8844p2707j00650O8110K25555
10063A53490J29138m8100K1847k4212N6462K4722j58760j11350M592N5646k9365
$$ plain form
10143 1107741 1267240 1445425 1345746 1234957 965319 875717 834637 705594 581002 519374
10133 519374 698951 869897 845451 767930 734407 692196 580118 537961 579141 478218 432583
10122 432583 430407 446204 366373 296167 214282 253208 337834 406628 391721 407938 383911 361050
10110 361050 349792 279080 239040 234417 193046 213014 211228 193406 97703 37276 -20994 12974
10098 12974 92322 179721 218232 195453 189772 126445 128116 179066 148360 147844 143211 116292 47892
10085 47892 20269 5734 17359 104540 139744 220441 295256 350094 239383 204676 215793
10074 215793 170868 174760 195614 174741 186793 112026 33182 -39525 -140175 -72065 153490
10063 153490 282628 234528 256375 232163 288625 313347 154587 43237 47829 103475 74110
10052G4110Q0514P3652o6726M78P2828k6350K6156o81k1871p9941k6166o0803
10040D5200j17024n6P4278m8200M540J11825j681J24946N4798n4975p7086j4461
10028A02104L1659m9374K5900J17017K1032q5636L0828J2857n6573J6685l9802
10017A26697L2060L9034m7756j20659j5328P9516J35107J15006j4186N9585o2348
10006C26728o0009l6861o4613M3991J3280L1775K3238r61j37566q7980J4863J3378
9994G9263L2674J7418J9408O5477k0550j48292J32457O7387m2957k7704m9100
9983A25481q6220L0969p340m8306L8031J2629O940l1626P6237j4734j25666N7018
9971C3413P4544R1278M0540m8396P7493K3328j46856J6319K5210p6711M0442M6403
$$ plain form
10052 74110 154624 228276 161550 162028 234856 208506 234662 233981 212110 132169 106003 45200
10040 45200 -71824 -71880 2398 -45802 -41262 70563 68882 193828 248626 193651 116565 102104
10028 102104 133763 84389 110289 227306 248338 162702 193530 206387 149814 166499 126697
10017 126697 158757 197791 150035 29376 14048 93564 228671 343677 329491 389076 326728
10006 326728 266719 229858 165245 209236 222516 254291 277529 276568 139002 51022 65885 79263
9994 79263 111937 129355 148763 214240 193690 45398 177855 245242 202285 174581 125481
9983 125481 39261 70230 62890 14584 52615 65244 72184 40558 116795 102061 -23605 33413
9971 33413 107957 199235 239775 191379 268872 292200 145344 161663 186873 110162 150604 197007
9959A97007J06556K432j05905k4731O5258M5158K6237j00322j0602L5847K5867
9948B62802m7217m3512n1659j7905o8287j11385O3709Q7629O6212Q0404k696p7696
9936A40399L2247P6521P9907Q0004O5909m1185L6180K7004o6436m7940j11921
9925B70689K6111q9880o4798K7053M4621q1431M8151Q5486J376J12024J5044J05686
9913E00132j1775j19691l9787Q628l285r1588j02418l7524M1114J5225N3497J00200
9901C12728L1198p458j10210m0023O5055R0143O7421M213L3693n2855r6155O4727
9889C62477O6511r588K5058j8163p7785N5693J6979N5256J2674O7127j6416k3759
9877E16064k4024K8782P0350R3584K1272M3982R6809O7952L3498R9712K1521O3133
$$ plain form
9959 197007 303563 305995 200090 175359 240617 285775 312012 211690 201088 236935 262802
9948 262802 215585 172073 120414 102509 34222 -77163 -13454 74175 140387 220791 218095 140399
9936 140399 172646 249167 329074 409078 474987 433802 469982 496986 430550 382610 270689
9925 270689 296800 206920 142122 169175 213796 132365 180516 266002 267378 379402 394446 500132
9913 500132 488357 368666 328879 337507 334222 242634 140216 102692 143806 159031 212528 312728
9901 312728 343926 336468 226258 186235 251290 341433 408854 413067 446760 393905 297750 362477
9889 362477 428988 419400 444458 426295 348510 404203 421182 476438 489112 556239 539823 516064
9877 516064 492040 520822 591172 684756 706028 750010 846819 914771 948269 1047981 1069502 1132635
9865A132635Q584K2901J52833J82437J65074J14070J22182J26642K78196K72363
9855B577917L29110K29858L07863M29992N62203O07985N95313O17544P46011P21349
9845G725145P31244Q09153O95362P46762P92552O03441L68802L52989M04302L41192
9835A3570944L81178K91920L65216L37607L30360O64433R15130J033468J278970
9826A9169226J479570J519857J540969J521052J512775J435802J353694J141760
9818C0674705Q68463N68135K39599p8263l71581n74807o05629n24813o31040o58657
9808B8906112m42540l63184k03508o7370J20951M18112O64612P12892Q35545Q14495
9798C1396117P60347O55885N91015L64139J71669p5232l55160o87261q89987j143597
$$ plain form
9865 1132635 1141219 1164120 1316953 1499390 1664464 1778534 1900716 2027358 2305554 2577917
9855 2577917 2907027 3136885 3444748 3874740 4436943 5044928 5640241 6257785 7003796 7725145
9845 7725145 8456389 9265542 9960904 10707666 11500218 12103659 12472461 12825450 13229752 13570944
9835 13570944 13952122 14244042 14609258 14946865 15277225 15941658 16856788 17890256 19169226
9826 19169226 20648796 22168653 23709622 25230674 26743449 28179251 29532945 30674705
9818 30674705 31543168 32111303 32350902 32272639 31901058 31326251 30720622 30195809 29564769 28906112
9808 28906112 28463572 28100388 27896880 27829510 27950461 28368573 29033185 29746077 30581622 31396117
9798 31396117 32156464 32812349 33403364 33767503 33939172 33863940 33508780 32821519 31931532 30787935
9788C0787935j439247j635623j611927j514898j224050j121037j101623j047712
9780B0091818p89941n37109m78234k02348m1949J0527J5946J2628p7090j01280
9770A7902968j11611q3914j05223M0101Q8599K00455K15933K44254M34655L43739
9760A9169956J84787K15657K02803K75213M96013N36603N46401M64225L19127
9751B2410785K71947J87740J97560J52261K16488L86336N08173Q15197J103902
9742B6250389J335838J483496J561598J825001J920713K018729K011197J916472
9734D0323433J558647J100472Q33271M16091N8777k22315n28566p44117q74515
9725D1921178q61150q64000r82907q11397o33341n21987j52911J38651L24229
$$ plain form
9788 30787935 29348688 27713065 26101138 24586240 23362190 22241153 21139530 20091818
9780 20091818 19301877 18764768 18286534 18084186 18042237 18052764 18068710 18081338 18004248 17902968
9770 17902968 17791357 17707443 17602220 17642321 17730920 17931375 18147308 18391562 18826217 19169956
9760 19169956 19354743 19570400 19773203 20048416 20544429 21081032 21627433 22091658 22410785
9751 22410785 22682732 22870472 23068032 23220293 23436781 23823117 24331290 25146487 26250389
9742 26250389 27586227 29069723 30631321 32456322 34377035 36395764 38406961 40323433
9734 40323433 41882080 42982552 43815823 44231914 44290691 44068376 43539810 42795693 41921178
9725 41921178 41060028 40196028 39213121 38401724 37768383 37246396 37093485 37232136 37556365
9716C7556365M41775N71043N67531O20478O42919O24595N66021L09197O4355k67568
9706D1696711o59430j027855j532088j736419j809174j869824j868921j902030
9698B9290970j913343j706475j361540j235173j143096r25526o74936n15793m89470
9689A9325618n88987m07499m27044n30886n69809o52111o76334q20435r54494
9680A3698019r46600r33549r02596q75368q28088q38334p64980o14175o87745
9671F306584n62072m85232m08073l00044l79529l56817k47910k04105k20532j46463
9661B995807r3155o5483j46352j95360j47102k7038P4927R0482R1474K35086J81157
9650B994443k41942m12113l16311j50078j66332j66949o1312o4628l8661q7042
$$ plain form
9716 37556365 37998140 38569183 39136714 39757192 40400111 41024706 41590727 41899924 41964279 41696711
9706 41696711 41037281 40009426 38477338 36740919 34931745 33061921 31193000 29290970
9698 29290970 27377627 25671152 24309612 23074439 21931343 21005817 20330881 19815088 19325618
9689 19325618 18736631 18329132 17902088 17371202 16801393 16149282 15472948 14652513 13698019
9680 13698019 12751419 11817870 10915274 10039906 9211818 8373484 7608504 6994329 6306584
9671 6306584 5744512 5259280 4851207 4551163 4171634 3814817 3566907 3362802 3142270 2995807
9661 2995807 2902652 2837169 2690817 2495457 2348355 2321317 2396244 2486726 2578200 2813286 2994443
9650 2994443 2752501 2340388 2024077 1873999 1707667 1540718 1479406 1414778 1376117 1289075
9640A289075l501L7130k4181p9870n8872m6663M7725K6424q0633j03453p4326
9629I28855m3728k938M1215K3277M3441n682J1453P7863j08278n5685R7130J2512
9617A019435r1113n2988M5035Q2445J56007l2606j10364j10565j35019M2456j3660
9606G99063L9151k0032j46710m6530M3593R7966J47193N4728O7017p3226p6820
9595H85393M2126K0427J916o260p9132k8291n0825L4987N3539r650o250p4074
9583G83906L568N4719k1936j19827n87K5162l4555M1497l1403j5444l482l9021
9571F42597m0545L7683M8143o143k6329m5707k1823k1811L773K4989J2725J1032
9559F18584o474r562n0768k4589l3979L4445j6429n450K4135P0887j7948O4144
$$ plain form
9640 1289075 1285574 1322704 1298523 1218653 1159781 1113118 1160843 1187267 1106634 1003181 928855
9629 928855 885127 882189 923404 946681 990122 984440 995893 1073756 965478 909793 1006923 1019435
9617 1019435 928322 875334 920369 1002814 1158821 1126215 1015851 905286 770267 812723 799063
9606 799063 838214 818182 671472 624942 668535 766501 913694 968422 1035439 962213 885393
9595 885393 927519 947946 949862 943602 864470 836179 785354 820341 873880 864230 857980 783906
9583 783906 787474 842193 820257 700430 699843 725005 690450 731947 700544 685100 681618 642597
9571 642597 602052 639735 687878 681735 655406 609699 587876 566065 569838 594827 607552 618584
9559 618584 612110 602548 551780 527191 493212 527657 511228 505778 529913 600800 582852 646996
9547F46996l1932K6426l429n6495K9152m1117M5696j1470l4341j04278K9677j2123
9535D82762M9263Q2826m9339q938J8667M6455J4317p1455o4490k3537J649Q8352
9523E66532m5183k2290m824L927J0992R3513j0363o8105k2348l2657J7640K6363
9511E13197n7434l8133O8771K9546p7260O0055L4393m1843J9053Q3266P266q30
9499F00047j23166n9955P5703l3786l5959l5966k2962J0552L0402K9009N8560
9488D92479p2060j40116J4161Q8395k4810L8089o5838p3356M587R1036Q725K4092
9476C85384J5247L1747j0900j06715m9318R8422J00737m5099m460J67291L6200
9465F18536j47499j14855o9478k5860M2869Q2520j8356n9915l1322J7996J11522
$$ plain form
9547 646996 615064 641490 638061 581566 610718 569601 615297 603827 569486 465208 494885 482762
9535 482762 532025 614851 565512 556574 575241 621696 636013 564558 500068 476531 478180 566532
9523 566532 521349 499059 494235 498162 509154 602667 592304 524199 501851 469194 486834 513197
9511 513197 455763 417630 486401 515947 438687 498742 533135 491292 510345 593611 600877 600047
9499 600047 476881 416926 492629 458843 422884 386918 363956 374508 404910 433919 492479
9488 492479 420419 280303 294464 382859 358049 396138 330300 256944 261531 352567 361292 385384
9476 385384 400631 432378 421478 314763 265445 363867 464604 419505 415045 582336 618536
9465 618536 471037 356182 286704 260844 303713 386233 367877 307962 276640 294636 406158
9454D06158k540M1300j11565N5120J40813M6222j48211j06384J4662J7613p0148
9443B83040J1390M4407L8227O3059J04810M8408l1259o8915k6884q2261j11450
9432B72572N5432R0297K2482p3151k9418L3979L5086k565j07066N8071J04246
9421D59965P1311K485j17664J5041J304M8928O5534o810l0572M4315O9465o1955
9409E61347q1966j8505J6193L1817R5983k9771O5569p3366q3286l412R7075o4847
9397E12831j14807M2519J07898R3861o6728j03762n0853n6534L9134N5012J07443
9386E66014P0635q5019j40766k2271L5649N0008m4274l7683J7359J6591R0315
9375E16558P3677k5310q1861r9393q9620n7348M6641l2819o3223J0871j8629O2690
$$ plain form
9454 406158 403618 444918 333353 388473 529286 575508 427297 320913 335575 353188 283040
9443 283040 294430 338837 377064 440123 544933 593341 562082 493167 466283 384022 272572
9432 272572 328004 418301 440783 367632 338214 372193 407279 404714 297648 355719 459965
9421 459965 531276 533761 416097 431138 432442 481370 546904 540094 509522 553837 623302 561347
9409 561347 479381 460876 477069 508886 604869 575098 640667 567301 484015 480603 577678 512831
9397 512831 398024 440543 548441 642302 575574 471812 420959 364425 403559 458571 566014
9386 566014 636649 551630 410864 388593 424242 474250 429976 392293 409652 426243 516558
9375 516558 590235 564925 483064 383671 294051 236703 283344 250525 187302 198173 179544 242234
9363B42234Q0860M3181K5278n4004M950K7769M837Q2101q6844l8916R059N0493
9351C90998J1902o9070j08287m1644K9738J78088J34343m9414q9618n2476K747
9340C37307n2945k4884J18148P9401P5569n7210Q586n2932r3586P0549J31826
9329E39829J3881J0934m782m214L6778P5863M9989J16079n988Q98N401Q4053J9881
9316I38602K491N3926L6428L6156k4023k0337P7003O7910R8753R0481J93481Q1685
9304A632556J6607K1398J02587J26816Q9046K27628L70385L38182L26348M34702
9294C686255L98532M23970M78230O62743Q64194J020276J022959J063694J131776
9285A0752629J327968J424002J255397Q90858M70597J41681j39543m39472p01325
$$ plain form
9363 242234 323094 366275 391553 337549 342499 370268 375105 457206 370362 331446 340505 390998
9351 390998 402900 333830 225543 183899 213637 391725 526068 476654 387036 334560 337307
9340 337307 284362 259478 377626 457027 532596 475386 483972 431040 337454 408003 539829
9329 539829 553710 564644 559862 555648 592426 668289 718278 834357 828369 829267 834668 918721 938602
9316 938602 941093 995019 1031447 1067603 1043580 1023243 1100246 1168156 1266909 1357390 1550871 1632556
9304 1632556 1649163 1670561 1773148 1899964 1989010 2216638 2587023 2925205 3251553 3686255
9294 3686255 4084787 4508757 4986987 5649730 6513924 7534200 8557159 9620853 10752629
9285 10752629 12080597 13504599 14759996 15650854 16121451 16263132 16123589 15684117 14982792
9276A4982792p80522q91323q79585p62998p14249m83211l53014j09767m2455R709
9266I975377J88995M22433P20177R27357J040094J285127J355924J328805J173123
9257A8417412P97795L20922k28814p96633j143484j256003j253120j346614j242429
9248A2269032j112696j003295r90746p62547p24154n08567m47705n30370l39666
9239E849286k21830j31957j10742o3404J4734J9183Q7018O5103M9640K10061L64978
9228F132070M06268M18137M86478N53449P25935R11360J120534J176626J405807
9219A3336664J553054J805164K143602K365533K420992K514991K349659K000155
9211C0489814J560189R10012L44363j60558o67484r16394q17611p77898p42682
$$ plain form
9276 14982792 14202270 13310947 12431362 11668364 10954115 10470904 10117890 10008123 9965668 9975377
9266 9975377 10164372 10586805 11306982 12234339 13274433 14559560 15915484 17244289 18417412
9257 18417412 19215207 19536129 19307315 18510682 17367198 16111195 14858075 13511461 12269032
9248 12269032 11156336 10153041 9162295 8399748 7675594 7167027 6719322 6188952 5849286
9239 5849286 5627456 5495499 5384757 5321353 5336087 5355270 5442288 5507391 5557031 5767092 6132070
9228 6132070 6538338 6956475 7442953 7996402 8722337 9633697 10754231 11930857 13336664
9219 13336664 14889718 16694882 18838484 21204017 23625009 26140000 28489659 30489814
9211 30489814 32050003 32960015 33304378 33143820 32476336 31559942 30742331 29964433 29221751
9202B9221751m97319k12278K54024N82633P59169Q02235P20298P84197P04192
9193C3118902Q31450R04822J016842J223355J270789J128674P21081L02388j60693
9184D0357610p30059j212407j783184k012898j991456j862642j775568j496286
9176B7493110j258422r71652p30651o83194o75148p00527q20015j071765j315352
9167A9266384j434547j318667j267216j209172j003968q26779q19842o01339m94846
9158A0290008l95347l62952k59415p5807j4990K19107K93832L64916M73393O62671
9148A1195416Q46043J075590J241916J201044J303443J308198J245110J155878
9140B0572638P16751M92597L89630K02562K19451M03238N73093P34636Q58218
$$ plain form
9202 29221751 28724432 28512154 28766178 29348811 30107980 30910215 31630513 32414710 33118902
9193 33118902 33950352 34855174 35872016 37095371 38366160 39494834 40215915 40518303 40357610
9184 40357610 39627551 38415144 36631960 34619062 32627606 30764964 28989396 27493110
9176 27493110 26234688 25263036 24532385 23849191 23174043 22473516 21653501 20581736 19266384
9167 19266384 17831837 16513170 15245954 14036782 13032814 12206035 11386193 10784854 10290008
9158 10290008 9894661 9531709 9272294 9196487 9181497 9400604 9694436 10059352 10532745 11195416
9148 11195416 12041459 13117049 14358965 15560009 16863452 18171650 19416760 20572638
9140 20572638 21289389 21781986 22171616 22374178 22593629 22996867 23569960 24304596 25162814
9131B5162814J177895J453939J625655J633783J457063J128474P41698K74461
9123C4655782k23110n37769p84782p95531o04325m29017k17074j84305l38250
9114C0541619p22770q00409q90116r41880o34970m41677k63730N373L53812M80445
9104B6685697N26719M34697K96669j00104n57829j061229j404818j687889j831059
9095B1300854j968851j904305j781448j578641j360251j358720j060113r47997
9087I340528q01832o16554o21609n62764n15048l02268j70295k27356k84116j83983
9077E054703k60479j15773n9431k0450J6229K4445N1913J59825K10094J55880
9067E216956J76639L03040M22907O07385N74703O73373P74230R22912R43080J014658
$$ plain form
9131 25162814 26340709 27794648 29420303 31054086 32511149 33639623 34381321 34655782
9123 34655782 34432672 33894903 33110121 32314590 31710265 31281248 31064174 30879869 30541619
9114 30541619 29818849 29018440 28128324 27186444 26551474 26109797 25846067 25851440 26205252 26685697
9104 26685697 27212416 27647113 27943782 27843678 27285849 26224620 24819802 23131913 21300854
9095 21300854 19332003 17427698 15646250 14067609 12707358 11348638 10288525 9340528
9087 9340528 8538696 7922142 7300533 6737769 6222721 5920453 5750158 5522802 5238686 5054703
9077 5054703 4794224 4678451 4619020 4598570 4614799 4639244 4691157 4850982 5061076 5216956
9067 5216956 5393595 5696635 6119542 6726927 7301630 7975003 8749233 9672145 10615225 11629883
9057A1629883R16726Q32388O07616J93961l18774p46552r06463r88131r29711
9048A0290943r14872p03922o21920n04643l13562j66155r4186M2983J03037K54385
9038G372088M25780N50617N88865P23149O42011N70999O14032L79646K3002j67560
9028A1722629m46620p79258r50031r18116q77802p69475p45567o74231m89479
9019E072050n76216n58802l63922k97063k09971l00702k16639l33668k97921j20724
9009A796422q5862l9114n7447j23275j16441j00911P0896j426j43625p3889N197
8998A130525j1593P9800q405j26586j50625J5762P4124L7945n1847m2356j28638
8987H18106m5036n8100J9707K7737L2836L2657L0106r3706j48176m5329K4710
$$ plain form
9057 11629883 12546609 13378997 13986613 14180574 13861800 13115248 12208785 11220654 10290943
9048 10290943 9376071 8672149 8050229 7545586 7232024 7065869 6971683 7014666 7117703 7372088
9038 7372088 7797868 8348485 8937350 9660499 10302510 10873509 11487541 11867187 11890189 11722629
9028 11722629 11276009 10496751 9546720 8628604 7750802 6981327 6235760 5561529 5072050
9019 5072050 4495834 3937032 3573110 3276047 3066076 2765374 2548735 2215067 1917146 1796422
9009 1796422 1710560 1671446 1613999 1490724 1374283 1273372 1344268 1342842 1199217 1125328 1130525
8998 1130525 1118932 1198732 1190327 1063741 913116 928878 1003002 1040947 989100 946744 818106
8987 818106 773070 714970 734677 762414 795250 827907 858013 764307 616131 570802 595512
8976E95512j228O0771q9597k1559R140N296j1026k1066j3899O0555P8096L5490
8964F86485k2170j74540j46762j1124P9232R8505m451K4416L5358o530n2579o1586
8952D44254J06225o2247o0007N3834m3115J7498O6652N2218j7819r3033n0647
8941D13813N3820j6259K2052K1397o9521L4915r6064o8731N0174j6570j1953L180
8929C20253K610M5941L9884j7703l5369J729O827N3633J11160q483n5907m1131
8917D23444j2063P3093N4173j9316p0046l3915K5324R4294l2892k1061q1575p9918
8905C19542o8019J9137L7504L0235L91k6467p5117k5662Q60K2751O8757J20007
8893D23919Q023q0642n0599P103J10625j1148J8194j6449L009L5026p7576k2439
$$ plain form
8976 595512 594284 655055 565458 543899 553039 558335 547309 526243 512344 572899 650995 686485
8964 686485 664315 489775 343013 331889 411121 509626 505175 529591 564949 558419 505840 444254
8952 444254 550479 488232 428225 482059 438944 456442 523094 575312 557493 464460 413813
8941 413813 467633 451374 473426 494823 425302 460217 364153 295422 345596 329026 317073 320253
8929 320253 322863 368804 408688 390985 355616 357345 364172 417805 528965 520482 464575 423444
8917 423444 411381 484474 538647 519331 449285 415370 440694 534988 502096 481035 399460 319542
8905 319542 251523 270660 308164 338399 338790 312323 237206 211544 212404 235155 303912 423919
8893 423919 431942 351300 300701 307804 418429 407281 425475 409026 412035 447061 369485 347046
8881C47046j782k5518l4728j5958N0360J29483M5544n1742n9354n7686L7938Q7973
8869D51576J7718O904p5502K7808J8667J0464J1611j21593r6756M1622L1676L9167
8857C63362j26354j77908L2428J00397n7598O7313R8020k1705k1728M247j9661
8846B40813q2268m7340j9515R3177J08551o6872L5657K9737k2406l1483L8080
8835B76131j1983O9695K2264n5413m1747n5010l1315m5331p4345J174q6673J7639
8823a4914J05769N4760P1851N7806L9208O3300O4473o8766r5768K9739O9351M9410
8811D26219R798k20q4773k8336m4381o369k9121q501O1911j8353m3055k5578O6480
8798B75721M9089n7284K7078K9297N9266n4479M9286j03301o1994J880J2941k4237
$$ plain form
8881 347046 345264 319746 285018 269060 319420 448903 494447 442705 383351 325665 363603 451576
8869 451576 469294 476198 400696 428504 447171 457635 469246 347653 250897 292519 324195 363362
8857 363362 237008 59100 91528 191925 134327 201640 299660 277955 256227 260474 240813
8846 240813 158545 111205 91690 184867 293418 226546 262203 291940 269534 238051 276131
8835 276131 264148 333843 356107 300694 258947 203937 172622 127291 52946 54120 -32553 -14914
8823 -14914 90855 145615 217466 275272 314480 377780 442253 373487 277719 307458 376809 426219
8811 426219 436017 435797 351024 322688 278307 271938 242817 234316 296227 277874 234819 209241 275721
8798 275721 324810 267526 294604 323901 383167 328688 377974 274673 212679 214559 227500 203263
8786B03263L3358J04256J23958J3772r9077n6059L3062J13936k3863n0660l7924
8775C58022o6619j2473J02609l7464n5239R8926M3431k3459n5549j7575l0896
8764C03714m2543M9093O7662M0791l1052o8907m6385p1160n268M8914l414M3586
8752B85031R245j8127q536n8055j7843M3905R0272o3047J8480K8858m8589m8752
8740B12842l8762M3994J9971M915J7882k0323k4108K6218N9955P3646n9965p4213
8728B42052n8920R5595k496M318P521M0780J1017J11959p4927l252K4264m1318
8716C56593q3375K6489l4495Q1290M0742Q155n3447p2857o227l055R017l7365
8704B31465l7138K8600L1300N3357L7268m2049j45259R5851J42384L2230n8957
$$ plain form
8786 203263 236621 340877 464835 478607 379530 323471 356533 470469 446606 395946 358022
8775 358022 291403 278930 381539 344075 288836 387762 431193 407734 352185 334610 303714
8764 303714 261171 310264 377926 418717 387665 318758 272373 201213 195945 244859 241445 285031
8752 285031 294276 276149 267613 209558 191715 235620 325892 262845 281325 310183 261594 212842
8740 212842 174080 218074 238045 242960 260842 240519 216411 242629 302584 376230 316265 242052
8728 242052 183132 278727 276231 280549 288070 328850 339867 451826 376899 373647 397911 356593
8716 356593 273218 299707 265212 346502 387244 395399 341952 269095 262868 259813 268830 231465
8704 231465 194327 222927 254227 307584 344852 302803 157544 253395 395779 428009 369052
8693C69052r6593J00656J55532k8537K6517n4665j6882l8758l3554k6055n1089
8682C05624m7160j7047N718n5074j8083n0222K4883j2672R799J1060J5748r105
8670A63469M2705M7950r178k6092k4264L9676N5630n3485j04895J858J22649L489
8658B59512j10493q343K5692M4607k0696j04590J9567L6006l632k8392k2912j01306
8646a4980l9999N8727L8901N8448Q3225J7945K9758O481j3023m7698m2823r341
8634A25621j9725Q765N5937N2261o7825l8659l5418o0677J6884J14136M9668l4825
8622A66143L8821q51J743P0504j6190o4747J9516m7526K09N355k2639j6368R6120
8609B30090O7219o2253J2786N6700l8373j8354l3496o7735j14851j0400J6873
$$ plain form
8693 369052 272459 373115 528647 500110 526627 471962 455080 416322 382768 356713 305624
8682 305624 258464 241417 247135 192061 173978 123756 148639 135967 145766 156826 172574 163469
8670 163469 206174 254124 244946 218854 194590 234266 289896 236411 131516 133374 256023 259512
8658 259512 149019 140676 166368 210975 190279 85689 105256 141262 137630 109238 86326 -14980
8646 -14980 -54979 3748 42649 101097 184322 202267 232025 238506 225483 177785 134962 125621
8634 125621 105896 114661 170598 222859 155034 116375 80957 20280 37164 151300 200968 166143
8622 166143 204964 204113 205856 276360 260170 195423 214939 167413 167622 172977 150338 133970 230090
8609 230090 297309 235056 247842 304542 266169 247815 214319 146584 31733 21333 38206
8598C8206J3681K5623n4239J7913O6974R4055N0989P5341K2858j20666l5874Q323
8586B03184j9446P925K3992R7078O052o4608k3798J2211P7399L588o2974n8809
8574B01794j6749J03757R6820m598l1416l3667J7972Q5973j7726m9243j00364
8563B52553j7014P5544l0152L309L2341J2539r808l5045l5044O8467j0030j0897
8551B96763k5213n4594l3098M2670k2447k5617l4675l5684j0409J1124K4741o0024
8539G3537p0208J6074K4414O60J6933o3860m4106P6379R7428N3708K2394N1682
8527B55035o0846M9702P5172n4320q8471r3461q3470J37657P5426j15343o1458
8516C5623J2234l6773N992J31739J66634m3993m9876m3463j22303k8141L5886
$$ plain form
8598 38206 51887 77510 23271 41184 108158 202213 253202 328543 351401 230735 194861 203184
8586 203184 183738 191663 215655 312733 318785 254177 230379 242590 319989 323577 260603 201794
8574 201794 185045 288802 385622 381024 349608 315941 333913 419886 402160 352917 252553
8563 252553 235539 311083 280931 284240 316581 329120 319312 284267 249223 317690 307660 296763
8551 296763 271550 216956 183858 226528 204081 178464 143789 108105 97696 108820 133561 73537
8539 73537 3329 19403 43817 44477 61410 -2450 -46556 29823 127251 180959 203353 255035
8527 255035 194189 243891 319063 264743 176272 82811 -659 136998 212424 97081 35623
8516 35623 47857 11084 17076 148815 315449 271456 221580 178117 55814 27673 63559
8505F3559O9891N0266N9994K2419o4649o7550j9925J960j14594j12538P4697N9478
8493B3008J03965J2430l7747k1112K340N171p4479k7209K0464M8252J67486L9121
8481B61690l2164n9673r3773J8152L4801N216k3519J1209k3013l9706J916o4879
8469c743l852R9617O995K0800q3778k3383n889o5655k3481P7655L7797L7947J7457
8456H8487l1772o6242K4724p592l443Q9210l921k8376J9970j135J9644o4227P491
8443D2818J6264r076P9922L7764k6899P423P1861L0884l4494r6816j0429q2774
8431B6448J0571j3802o4886N6912O0727n6627j17123k3890P9655Q3995O1099m994
8419I8085N07n4612M7658P302J7113m9791j24643J7546J1584n000Q126J62L1703
$$ plain form
8505 63559 133450 183716 243710 266129 201480 133930 114005 115965 1371 -111167 -36470 23008
8493 23008 126973 139403 101656 80544 82884 88055 13576 -13633 6831 55083 222569 261690
8481 261690 229526 169853 76080 94232 129033 134249 110730 121939 98926 59220 61136 -3743
8469 -3743 -7595 92022 99017 119817 36039 12656 6767 -58888 -82369 -4714 33083 71030 88487
8456 88487 56715 -9527 15197 7605 4162 93372 89451 61075 81045 79910 99554 35327 42818
8443 42818 59082 50006 129928 167692 140793 148216 220077 250961 216467 119651 109222 26448
8431 26448 37019 23217 -41669 15243 75970 19343 -97780 -121670 -42015 41980 103079 98085
8419 98085 98592 43980 91638 98940 116053 66262 -58381 -40835 -29251 -34251 -26125 -25963 5740
8406E740J19439L2994J9155l7467k205R009j18957P663j3329j6789m8422J30065
8394H6896O6878l4871m0408m6598m5847O1677K799p843o49m8580J03350M4361
8382A41165j02346p1117L9589L0414N8808O5128j025j00073n0788j037P2333N905
8370H6956L0038m3540k4382q2270j00101O6172L5081n9608K1160J22838J4494
8359F6838J5615J1462p2921o9806J00429J0750J8340P9256N5277L3860J4922k0025
8347B43997n3419L3265K17440K27790L09203M32417N90199N28189m9598n85188
8337A894295o09676m29976k25415r2234p6091q9961j8931o3535j47234L482k2172
8326A22552l8506L4332L426M3975M6580L7548l300o2994M75L9585k3115k2454
$$ plain form
8406 5740 125179 158173 177328 139861 137656 146665 27708 35371 22042 5253 -43169 86896
8394 86896 153774 118903 78495 31897 -13950 47727 50526 42683 42034 -6546 96804 141165
8382 141165 38819 -32298 7291 37705 96513 161641 160616 60543 9755 8718 81051 86956
8370 86956 116994 73454 49072 -33198 -133299 -67127 -32046 -91654 -70494 52344 66838
8359 66838 82453 93915 20994 -48812 51617 62367 80707 159963 215240 249100 264022 243997
8347 243997 190578 223843 441283 669073 978276 1410693 2000892 2529081 2479483 1894295
8337 1894295 1284619 854643 629228 536994 460903 370942 352011 288476 141242 144724 122552
8326 122552 84046 118378 121804 165779 212359 249907 246607 183613 184088 223673 200558 178104
8314A78104j07936p0471K5621j5860Q2290N3755K6457M1045o46K258J46458R6339
8302D57414J1245J18917K63973N00887O40215J105662J457534M76274r62474j402351
8292B667296j088480n28171k09281k19820j50663j09572j2703l6099p3378n9748
8282A79381M5689J3714o4976p9861q5611R7335k7439n0239Q7177J1042j11140
8271A5072P6815N4609p385N5349l3574j12248J17718J5596m3358m5474n2871J13802
8259A54051J23241Q8279J18067K0928R8383J84068M79393P09940L96994l29360
8249B043984n82668o12734l72431j39377K0052o1068m5988j04947l3276p9245
8239C2302P6005J32925L2927l8243n3703o2287O0942m316k8593j5677j13024o571
$$ plain form
8314 178104 70168 -303 25318 9458 91748 145503 171960 213005 212359 214617 361075 457414
8302 457414 468659 587576 851549 1352436 1992651 3098313 4555847 5032121 4069647 2667296
8292 2667296 1578816 1050645 841364 621544 470881 361309 348606 312507 239129 179381
8282 179381 225070 238784 173808 93947 8336 105671 78232 27993 115170 126212 15072
8271 15072 91887 146496 139111 194460 160886 48638 166356 181952 138594 93120 40249 154051
8259 154051 277292 365571 483638 504566 602949 787017 1266410 1976350 2373344 2043984
8249 2043984 1461316 848582 476151 336774 356826 295758 249770 144823 111547 32302
8239 32302 108307 241232 274159 235916 182213 119926 180868 176552 147959 132282 19258 12687
8227A2687J0208J2381K1364P536l4564L408J04160j3999N2477j3689q5046P5820
8215A52743M6905j5500P945r9307j06953O6423M758k7648l2417M9268n0872k0275
8203b4930L9406O4075M436O708p776Q8549n1914n8348L9247M5792k8671N2355
8191A68929J4484k5469n0682o8020N5029k7044M4950M2086k8670n6991p8641O0678
8179E0639O111J4267O228n0560J1866K8455j0113q6495j15808L4444L2490M7789
8167c0687J5166j8095L4468N8528L4235O18j1867J673P347j3244N5194k6264j7208
8154H9864m3192n1743N513o4443O5775J9433L616R234N8146J7802r0849L6353
8142E5509K0416q4776R699J16305N6772q5507l9782R556R833o6093o240k0666
$$ plain form
8227 12687 22895 35276 56640 64176 29612 33020 137180 123181 175658 161969 76923 152743
8215 152743 199648 184148 192093 92786 -14167 52256 57014 29366 -3051 46217 -4655 -24930
8203 -24930 14476 78551 82987 89695 81919 170468 118554 60206 99453 145245 116574 168929
8191 168929 183413 157944 107262 39242 94271 67227 112177 154263 125593 68602 -10039 50639
8179 50639 56750 71017 77245 26685 38551 67006 56893 -29602 -145410 -110966 -78476 -30687
8167 -30687 -15521 -33616 852 59380 93615 94233 82366 84039 91386 78142 133336 107072 89864
8154 89864 46672 -5071 442 -64001 1774 21207 24823 34057 92203 110005 19156 55509
8142 55509 75925 -8851 848 117153 173925 88418 48636 58192 68025 1932 -4308 -24974
8130b4974j1684M1783O219p386k3462j107j3998R6758J05813L8609j3738l7299
8118A55534n7293j4761R9087Q2066L9042n5442m7153o078k7542r1754K9576L2769
8106A38051J0626l4824l8431K243J8579L8082N835n2732p0044N2768p9506k3910
8094c3263Q9570M6481Q684m8772o6589K1590p7224J6249J17874R2425l7379j3960
8082A15686M5575P8126K5167n8975k8419q5213j06142j8502Q0739Q8125J15141
8071B51308M5042m4296j12886j03984M5278M4319k99l9612m6618Q6913P8291J9862
8059B23318q2407j7678k3243Q983l4875J4454N8361j0625J3279J2568p1316N8366
8047A49185n3143n7785L9991J0589k230L7167J7144l5220K4430Q2869K490k6164
$$ plain form
8130 -24974 -36658 5125 11344 3958 -19504 -20611 -34609 62149 167962 206571 192833 155534
8118 155534 98241 83480 182567 264633 303675 248233 201080 195002 167460 75706 105282 138051
8106 138051 148677 113853 75422 77665 96244 134326 140161 87429 17385 70153 -9353 -33263
8094 -33263 56307 102788 111472 62700 -3889 17701 -59523 -43274 74600 167025 129646 115686
8082 115686 161261 239387 264554 205579 177160 91947 -14195 -32697 48042 136167 251308
8071 251308 296350 252054 139168 35184 80462 124781 124482 84870 38252 125165 203456 223318
8059 223318 140911 123233 99990 108973 74098 88552 146913 136288 149567 162135 90819 149185
8047 149185 96042 38257 78248 88837 86607 123774 140918 105698 130128 212997 215487 189323
8035A89323m7364n8395m842l8239n098m0661j8719J9785K8797J01261m9081J00137
8023A76904O1158q9508j84035j386M9528Q0270J6913k3505L2484M3369j8179n5871
8011H8142L9958q2146q6263j3847P3977R270j4285l814Q7438O2867j1760p4370
7999G5167m3796j9020O4977P4476n622n3156r8774n9893R9281R0601l5622l3537
7987E5082m4598j9362k7673J06447J19284J7854m4206k9906M1092M2534M966k1619
7975A99895n4625n085K4395j4944L1168J5215r3944p7138o7748L0952J950J17987
7963A08078O2912P952j3239o7224K2393Q481M821m0890n6308O260n4791m3915
7951e5470N7164Q4992K2890l081q6398m6772r4451N1464P0302k5067P5821l9511
$$ plain form
8035 189323 141959 83564 78722 40483 35385 -5276 -23995 -4210 24587 125848 76767 176904
8023 176904 238062 148554 -35481 -36867 12661 92931 109844 86339 118823 162192 144013 88142
8011 88142 128100 45954 -40309 -54156 19821 29091 14806 10992 98430 161297 149537 75167
7999 75167 31371 12351 77328 151804 146182 93026 -5748 -65641 33640 124241 88619 55082
7987 55082 10484 -8878 -36551 69896 189180 207034 162828 132922 174014 216548 221514 199895
7975 199895 145270 140185 164580 149636 180804 196019 102075 24937 -42811 -11859 -9909 108078
7963 108078 170990 178942 165703 98479 120872 129353 134174 93284 36976 43236 -11555 -55470
7951 -55470 1694 86686 109576 106495 20097 -26675 -121126 -69662 640 -24427 51394 11883
7939A1883J0059R6633L2568o6751j3648J05821m2663m0894L540k7470N615q7358
7927a2665o476R5424N7275j4282j7641r206n9524p0262n1035L9368J04027J4974
7915F9977r0591n8281Q0342L068O972m0711k7921k5404k7419m0471M7709j5235
7903a17965j4857Q1864P1206P7123O2213R5963K403j06480n3427J8933k5688L1529
7891A22817m0006L6691k2630L2518N7432p0653m9885J0072P4244J1507n7813l5399
7879F8895P3243r4538k4059m9606k2916j10997k1572K0023j9274L9904O5559Q4435
7867I097O5118o1373k1571n7315m145P7471j8733k5855j0781J6256J0320L7287
7855A5776k700K2751K9473j4539J0441P5320M7418m796p908o1542q2067l1678
$$ plain form
7939 11883 21942 118575 151143 84392 70744 176565 133902 93008 96548 69078 74693 -12665
7927 -12665 -19141 76283 133558 119276 101635 92429 32905 -37357 -88392 -49024 55003 69977
7915 69977 -20614 -78895 1447 4515 11487 -29224 -57145 -82549 -109968 -150439 -102730 -117965
7903 -117965 -132822 -50958 20248 97371 159584 255547 257950 151470 98043 116976 91288 122817
7891 122817 82811 119502 96872 129390 186822 116169 66284 76356 150600 162107 104294 68895
7879 68895 142138 47600 23541 -26065 -48981 -159978 -181550 -161527 -180801 -140897 -75338 9097
7867 9097 74215 12842 -8729 -66044 -70189 7282 -11451 -37306 -48087 -31831 -21511 15776
7855 15776 13076 35827 65300 50761 61202 136522 183940 179144 171236 109694 27627 -4051
7843d051o3452P143O1377J4155q956N1439j3182q122K3140L5464M927Q8099j6147
7830A71834n9654K477n277L1778K0361m089p2003K2165l1154J671q6503r3185
7818a01579o639P2812K3284K1346j4946K4459N4718k8841q8418P1329m8699Q1247
7806F0073J19009j5303j18899k0855M6495l6146N871j9794j06817N2778P798j4841
7794d0631J6106O6991K0274N562r1526J7127O5837P3237K153q2214l4542k6217
7782g843R687m4597P8167p248J6485m566r475M0222m173p774J0492M6166J4045
7769A29588J5005j6662l1380o2270m5106K0228K2652M0600K9056k4842n5027O8313
7757I0155l7520p2752K3497J8477j5404j1862L4710l7083r1062N9564J65899O708
$$ plain form
7843 -4051 -67503 -60360 1017 15172 6216 57655 44473 36351 59491 94955 99882 187981 171834
7830 171834 112180 114657 109380 141158 161519 157430 85427 107592 76438 78109 -8394 -101579
7818 -101579 -108218 -35406 -12122 9224 -5722 18737 73455 44614 -43804 27525 -21174 60073
7806 60073 179082 163779 44880 24025 70520 34374 40245 20451 -86366 -33588 -25790 -40631
7794 -40631 -24525 42466 62740 68302 -23224 -6097 59740 132977 135130 52916 18374 -7843
7782 -7843 1844 -42753 35414 28166 44651 40085 30610 70832 66659 58885 69377 115543 129588
7769 129588 144593 127931 96551 34281 -10825 9403 32055 72655 101711 76869 21842 90155
7757 90155 52635 -20117 3380 21857 6453 -5409 29301 -7782 -98844 -39280 126619 133327
7745A33327j1119j19896P590J6109J5027j2973R0317J5494l5756l851j8038n960
7733G0271k0868j738J6395L2119k7846j19311M3624K7319m3843N6094K1541O3095
7721A16852k6903l2250N678L9344K2120p8280p5564p1051J8127P3388J27055k0144
7709I8372o7205O1626r0243K7514M3153j3334k475M3643j1006j70151m8741M2767
7697h6080O1064J52910J485N622q3604l6465n3251o6313l0191P1726L5100Q3112
7685E5115J8975M0768o747M6200m6733j06216n8950o773N3783Q724K1026J2016
7673C1188k4051n1757K3976J2226k090J2884L6197J6298J7151P1289L8007j33104
7661D8214j10364j3119N841K3585L2667j4137m4326J07488P8187J0687l8435k3518
$$ plain form
7745 133327 122208 2312 9902 26011 41038 28065 118382 133876 98120 94269 76231 70271
7733 70271 49403 47665 64060 96179 68333 -50978 -7354 19965 -23878 32216 53757 116852
7721 116852 89949 57699 63377 102721 124841 46561 -29003 -100054 -81927 -8539 118516 98372
7709 98372 31167 92793 2550 30064 73217 59883 57408 101051 90045 -80106 -128847 -86080
7697 -86080 -25016 127894 129379 135001 51397 14932 -38319 -104632 -134823 -63097 -27997 55115
7685 55115 74090 114858 108111 154311 107578 1362 -57588 -64361 -10578 -1854 19172 31188
7673 31188 7137 -44620 -20644 -8418 -10508 2376 38573 54871 72022 143311 181318 48214
7661 48214 -62150 -75269 -69428 -45843 -13176 -27313 -71639 35849 114036 124723 86288 62770
7649F2770o981j3649J2009O9680K1105m4564O40j7069O1039O808k2106j5128M0100
7636A54654k522r2615J1575M9607m9930j32568K0653R7850j34006n9258O7161
7625f9399M3568Q6258L5681P3340p0509l5455J501k8064n8311P1274l2306J14175
7613A31753P8157m9598J2893K5338m2318j10327l3306K6453o8614J8674M6418
7602C5523j5760l4549P2215R8000l1659l9371Q0016L6297j2998O3978K8633o8082
7590B12243j18874N0226m608q5561p9191K5808M9032J24303k6541j5134L787l1827
7578A03663m6006j6812p7578j00146J06307K4887L6326O873R075j399j6321m0854
7566a1985j06736m6529k2957M1331L9434J7339j0201J06657L8553j01819k7702
$$ plain form
7649 62770 55789 42140 54149 123829 144934 100370 101010 83941 144980 151788 129682 114554 154654
7636 154654 152132 59517 71092 120699 70769 -61799 -41146 56704 -77302 -136560 -69399
7625 -69399 -25831 60427 96108 169448 98939 63484 64985 36921 -21390 49884 17578 131753
7613 131753 209910 160312 173205 198543 156225 45898 12592 39045 -29569 -10895 35523
7602 35523 19763 -14786 57429 155429 123770 84399 164415 200712 187714 251692 280325 212243
7590 212243 93369 143595 138987 53426 -25765 43 49075 173378 146837 131703 135490 103663
7578 103663 57657 40845 -36733 -136879 -30572 -5685 30641 37514 46589 45190 28869 -11985
7566 -11985 -118721 -165250 -188207 -146876 -107442 -90103 -100304 6353 44906 -56913 -84615
7555h4615J8959L9464J0290n9892o5640Q0262j1035n0712K5423K3134R6033j5392
7543F279r3584j9746P9337P7263k6401j9945n362j1816m9112k6643K8614M9313
7531a1803P4574l1754j59839q7637K7612J74642J20009K6409o1323o2344M0744
7520D9290J4724n6755j86013k5124Q1577J21492P7732m7798o9845N3716K0272
7509C3268L7355j8978j30000j49818M953O7137J6211k0720o2261M2519R5509J7465
7497f7360K3069n9077j3613M7839M582P1k6810m6550k5665P4666k097n2253N191
7484a38007N3379J5507K2580j1887p6601M7252J56545Q0073j42688p5754m0662
7473a10263N1057J1786N7277M3734R327l0533m7699M2444k9570o0024m854N6631
$$ plain form
7555 -84615 -65656 -26192 -15902 -75794 -141434 -61172 -72207 -122919 -97496 -74362 21671 6279
7543 6279 -87305 -107051 -27714 49549 23148 3203 -2159 -13975 -63087 -89730 -61116 -11803
7531 -11803 62771 31017 -128822 -216459 -188847 -14205 105804 132213 70890 8546 49290
7520 49290 64014 7259 -178754 -203878 -122301 -809 76923 29125 -40720 12996 33268
7509 33268 70623 51645 -78355 -228173 -223220 -156083 -139872 -160592 -222853 -180334 -84825 -67360
7497 -67360 -44291 -103368 -116981 -69142 -64560 -64489 -91299 -137849 -163514 -88848 -90945 -143198 -138007
7484 -138007 -84628 -69121 -46541 -58428 -135029 -87777 68768 148841 6153 -69601 -110263
7473 -110263 -59206 -47420 9857 53591 62918 32385 -15314 27130 -2440 -62464 -67318 -10687
7461a0687R4738Q774q6106M3872J9678O684l974J5795m4958n4072j15108M624
7449a20740R7750M2253k2033k8808m8883K6495K4559j1915k9616J12301J30642
7438A72005R1k7127l6631m7679o5281r2398o6500P645J35520Q9016M8126m5039
7426G1748p7121j6448L401L5696j7956l4306l5157K7371J9379J7127k1523l1867
7414e9656r5601O8443P7433L4833k9482j23154k4555J14830M2311M5190Q3251
7403A33843o0638l5106K3151p8000P6177j2402j03057j5962M7123j1013N2773
7392A6889m9256o9547l5865k2345Q6191N8654L6153K2898n3696l5102L5720J04241
7380I4935k3261k9904p9819j2491J07904O6576K8755o447r8628P867N7804J4058
$$ plain form
7461 -10687 84051 92825 6719 50591 70269 76953 72979 88774 43816 -10256 -125364 -120740
7449 -120740 -22990 19263 -2770 -31578 -80461 -53966 -29407 -41322 -70938 41363 172005
7438 172005 172096 144969 108338 60659 -4622 -97020 -163520 -155875 -20355 68661 116787 71748
7426 71748 -5373 -21821 -18420 17276 -680 -34986 -70143 -42772 -23393 -6266 -27789 -59656
7414 -59656 -155257 -86814 -9381 25452 -4030 -127184 -151739 -36909 5402 50592 133843
7403 133843 73205 38099 61250 -16750 59427 47025 -56032 -71994 -24871 -35884 16889
7392 16889 -32367 -101914 -137779 -160124 -73933 -15279 20874 43772 -9924 -45026 -9306 94935
7380 94935 71674 41770 -38049 -50540 57364 123940 152695 146248 47620 55487 113291 127349
7368A27349j13411j29081l3011M5155L0128p223K4064M9632J28258l1648l1247
7357E8965r3564j0287J2438J08720K6290m7941k4473o0217O4004j7532J1063K9243
7345E6709m0848L672P5562j5676p2125j0447P5023J1753q1974J2347j3732p1056
7333g0792M947O4456N3417N9475j0679k0760m6123j307N8180p932l6114L182q5536
7320c5586m9190J8759P8392Q802l6273J3157O1401p6912l0996J2432L4664p3974
7308g5324L5698O2357N725o667p0982o7555p245J6025J2247P9993q4684L2630
7296f7782M4628m1722P2006J11091L2913q7615j60081m838J37432K6150o1968
7285B14n971n7821o2439J03520M0094M856k0498p450J24904N6210m6134j53670
$$ plain form
7368 127349 13938 -115143 -148154 -102999 -72871 -80094 -56030 -6398 121860 90212 58965
7357 58965 -34599 -44886 -32448 76272 102562 54621 30148 -30069 33935 16403 27466 56709
7345 56709 15861 19533 95095 79419 7294 -3153 71870 83623 1649 13996 264 -70792
7333 -70792 -65845 -1389 52028 111503 100824 80064 33941 32634 90814 82882 46768 49950 -35586
7320 -35586 -84776 -66017 12375 21177 -15096 -1939 59462 -17450 -48446 -36014 -1350 -75324
7308 -75324 -39626 22731 28456 21789 -49193 -116748 -123993 -107968 -95721 -15728 -100412 -67782
7296 -67782 -23154 -64876 7130 118221 151134 63519 -96562 -101400 36032 62182 214
7285 214 -5757 -63578 -126017 -22497 17597 22453 1955 -5495 119409 175619 129485 -24185
7273b4185q265M0377N0277l4190o8235j14580N116J7830J16899K340k8484P6056
7261C0956L0976n2568K6595N8521l9747j6992n1450o8913m9728J2489J06398N9681
7249D6218m6599n5469k8577m91M6193K9949P538N6230M1743l878j2126o822N0716
7236A24625l8888q1509m7399N0089Q0113l0489k7384j63426m3649Q1484P7226
7225a9207J4062o4894q0327M7748N5713k4409m0049R7169P8501l9834q7464k8222
7213i1213R66l6397Q155N2681K097K1758J3662J24o443O5583R7154N8516q5850
7200A00793O4516j25032k2724L7065q974r0529N6082M3205l9203l3679m5860o68
7188f5008J6577j1726L1545N0327O5325N561p2581M6469P6176m0406k6279j05297
$$ plain form
7273 -24185 -32450 7927 58204 24014 -44221 -158801 -153685 -135855 -18956 -16616 -45100 30956
7261 30956 61932 9364 35959 94480 54733 37741 -13709 -82622 -132350 -119861 -13463 46218
7249 46218 -381 -55850 -84427 -84918 -38725 -8776 -1238 54992 96735 92857 80731 73909 124625
7236 124625 85737 4228 -43171 6918 87031 56542 29158 -134268 -177917 -96433 -19207
7225 -19207 -5145 -70039 -150366 -102618 -46905 -71314 -111363 -14194 64307 24473 -62991 -91213
7213 -91213 -90247 -126644 -118489 -65808 -63711 -41953 -28291 -28167 -34610 30973 128127 186643 100793
7200 100793 165309 40277 17553 54618 45644 -44885 11197 54402 15199 -18480 -64340 -65008
7188 -65008 -48431 -60157 -28612 21715 87040 92601 20020 66489 142665 102259 75980 -29317
7176b9317n9498n7642l1923n0095K7408K2643L6448J08015K7657k5991p3139j4275
7164a19709m745l7445q873k7368M0672M6009m502J35030L356N4502J9094j66902
7152g0881R6893r215r0074M0538m0047Q426K2102O137K9836m4989k836N0701n1741
7139e5150j08766j31070P5894R9178N182K6237R8831p766Q9523J16759k2327j47406
7127C9119j43175o22O0780J6297M9127J89171M6511j09834l3851j3290Q221N870
7115A14324p6391p4612n5980j9862J3301o2683J1022J8219l81m1009k4780J31241
7103f7591Q6343K445M7576k6312q2543j03081M4395J10544M4158M4786L2421l8373
7091I4768r8800L3489l515m2321o3887J7491O2057L8773k8912p902m2980j50308
$$ plain form
7176 -29317 -88815 -146457 -178380 -228475 -201067 -178424 -141976 -33961 -6304 -32295 -105434 -119709
7164 -119709 -124454 -161899 -170772 -198140 -157468 -111459 -115961 19069 22425 76927 96021 -70881
7152 -70881 26012 16797 -73277 -32739 -72786 -64360 -42258 -36121 -6285 -51274 -54110 -3409 -55150
7139 -55150 -163916 -294986 -219092 -119914 -114732 -88495 10336 2570 92093 208852 186525 39119
7127 39119 -104056 -104678 -43898 -27601 21526 210697 257208 147374 113523 100233 108454 114324
7115 114324 37933 -36679 -92659 -112521 -99220 -161903 -150881 -132662 -133043 -174052 -198832 -67591
7103 -67591 18752 21197 68773 42461 -40082 -143163 -98768 11776 55934 100720 133141 94768
7091 94768 -4032 29457 25942 -16379 -80266 -62775 -718 38055 9143 1241 -41739 -192047
7079a92047m4782J42225J38409N6712j29223L0523K9204M479L5450o3734n3155
7068d5939m5114K2183J9509M1049k045m5326N5027Q4971r901n6789O9258k6717
7056F0166j09289k8272j0952O1307K2627k4032j1627k079n8186M0861Q0729L1079
7044E2332l0457M2569K9622r8609q8360q758Q0961P1589k2941o8317p1445P7954
7032c3860J3065q468l4101l2633M4758M3512K4786j7154o4962n6891Q5940N0199
7020A4191q6533l8063J6458O662Q4022k0814j41319l6046O7614o23M8370P8858
7008g223k3762m5421M4175L9942m852o9909j4893J03585J1385p0974O7737R6833
6996A26623o4375q0666p654N8023j7256k0526K1565M5628n190J1725o168m4056
$$ plain form
7079 -192047 -236829 -94604 43805 100517 -28706 1817 31021 35500 70950 7216 -45939
7068 -45939 -91053 -68870 -49361 -8312 -10357 -55683 -656 84315 74414 17625 86883 60166
7056 60166 -49123 -77395 -88347 -27040 -4413 -28445 -40072 -42151 -100337 -59476 21253 52332
7044 52332 21875 64444 94066 -4543 -92903 -101661 -20700 50889 27948 -40369 -111814 -33860
7032 -33860 -20795 -29263 -63364 -95997 -51239 -7727 17059 -95 -65057 -121948 -36008 14191
7020 14191 -72342 -110405 -93947 -87285 -3263 -24077 -165396 -201442 -133828 -134451 -86081 -7223
7008 -7223 -30985 -76406 -32231 7711 2859 -67050 -81943 21642 33027 -37947 29790 126623
6996 126623 62248 -18418 -26072 31951 14695 -5831 15734 61362 56172 67897 61729 17673
6984A7673k6862M660m3194n193J00811k4746m355k1553M1192k3674l4384o0608
6972h0233l4289O5460L1564n2501J31275K708o4626n9013n9533l673J13594N2934
6960D3667j6446M783q3485q0379R9655q867k7257R9065k7367J4851j9162K8346
6948B7404P0466N5658n7808j3090l4607P487q9819n1931J2041O5330M582l9057
6936d3344j6535l5817L9316M876m0221Q3577J26390J23414M6611j04165J9115
6925B03217J7968k2169q291l7199k9802K9282m3317q5187m4153l3659n5863k1989
6913a31162m9667M1299L8314k1319j01578J3116J2756m5573J14988N9643M1032
6902b8151k7106q1119R858Q3842N2686K0272k8476L495l4886j9191J0749O3797
$$ plain form
6984 17673 -9189 -4529 -47723 -52916 47895 23149 18794 -2759 38433 14759 -19625 -80233
6972 -80233 -114522 -49062 -17498 -69999 61276 63984 -642 -59655 -119188 -122861 -9267 43667
6960 43667 27221 32004 -51481 -131860 -32205 -41072 -68329 30736 3369 18220 -942 27404
6948 27404 97870 153528 95720 82630 48023 55510 -34309 -86240 -74199 -8869 -4287 -43344
6936 -43344 -59879 -95696 -56380 -51504 -91725 -8148 118242 241656 288267 184102 203217
6925 203217 221185 199016 190725 153526 123724 153006 109689 24502 -19651 -53310 -109173 -131162
6913 -131162 -180829 -139530 -101216 -122535 -224113 -210997 -198241 -243814 -128826 -69183 -28151
6902 -28151 -55257 -136376 -126518 -42676 10010 30282 1806 5301 -29585 -48776 -38027 25770
6890B5770Q3856n0995M006L5395r1094r8067L5406P2136m0360n0545R0594L1214
6878D7316K2623Q1704r5351m8320k0103n4476o6755P0202L709L637O5688J7092
6866B6966l5081m7475J13243N9257o8964M3507l6163j9112k7863L8343O5780m820
6854A07618j6247R843l3039p9017p4363m5681j0245m8128k606J01908Q2939L5772
6842B8754R2793J2400m4719l5173q5110O403J4717K5112j6189M7889J3385J7917
6830G8179m2285m6959M0756j7350m3278j4161J0220K4811n0293n9747N1320L0308
6818c8479O353K9574j769J5814L0581M8956J6835j4225n2163l6003N62R421N225
6805B0682j01359p2470N8081J3213P908N030N6778K6012j3736L842k0499o5113
$$ plain form
6890 25770 109626 58631 62637 98032 6938 -91129 -55723 16413 -23947 -74492 16102 47316
6878 47316 69939 151643 56292 7972 -12131 -66607 -133362 -63160 -59451 -55814 9874 26966
6866 26966 -8115 -55590 57653 116910 47946 91453 55290 36178 8315 46658 112438 107618
6854 107618 91371 101214 68175 -10842 -85205 -130886 -141131 -189259 -191865 -89957 -7018 28754
6842 28754 121547 133947 89228 54055 -31055 -24652 -9935 15177 -1012 46877 60262 78179
6830 78179 35894 -11065 29691 12341 -30937 -45098 -34878 -10067 -60360 -120107 -68787 -38479
6818 -38479 -32126 -2552 -4321 11493 42074 91030 107865 93640 41477 5474 6036 15457 20682
6805 20682 -80677 -153147 -95066 -81853 -73945 -68915 -12137 13875 139 3981 -16518 -81631
6793h1631M2633Q5419J20636P749k2443q0016r5063j5821Q205r399l8657R6405
6781A8017K9884j13189J6192P8845Q649l8412m0404L9818J8318q8275j17534R9247
6769h8844J03359o225l7651K1420J0472K4112k1269o4903k873R5722m5171j38847
6757a50698J1009L6406O7175N8823N296l3768J5360o888l9204L6792M3958r859
6745C4402K4698J36L91L2318J860N5800j0646q1560j01175o0124q8316l2481J8812
$$ plain form
6793 -81631 -38998 46421 167057 174806 152363 72347 -22716 -38537 -30332 -39731 -78388 18017
6781 18017 47901 -65288 -49096 29749 38398 -14 -40418 -600 17718 -70557 -188091 -88844
6769 -88844 14515 8290 -29361 -7941 2531 26643 5374 -59529 -62402 33320 -11851 -150698
6757 -150698 -139689 -103283 -36108 22715 28011 -5757 9603 2715 -36489 303 44261 34402
6745 34402 59100 59236 59627 91945 93805 149605 138959 57399 -43776 -103900 -192216 -224697 -205885
$$ [...]
##END NTUPLES=NMR SPECTRUM
##END=
