##TITLE=Analysis number 326554
Compound Code cc 63823
Book Reference 511/74
Project Code adrs
Chemist Name stevem
##JCAMPDX= 6.0         $$ Bruker NMR JCAMP-DX V2.0
##DATA TYPE= NMR SPECTRUM
##DATA CLASS= NTUPLES
##ORIGIN= Bruker BioSpin GmbH
##OWNER= nmr
$$ XWIN-NMR		Version 3.5
$$ Tue Feb 13 10:54:24 2007 GMT Standard Time (UT+0h)  MAYBRIDGE\nmr@NMR_250MHZ
##.OBSERVE FREQUENCY= 250.131544655141
##.OBSERVE NUCLEUS= ^1H
##.ACQUISITION MODE= SIMULTANEOUS (DQD)
##.ACQUISITION SCHEME= undefined
##.AVERAGES= 16
##.DIGITISER RES= 18
##SPECTROMETER/DATA SYSTEM= dpx250
##.PULSE SEQUENCE= zg30
##.SOLVENT NAME= CDCl3
##.SHIFT REFERENCE= (INTERNAL, CDCl3, 0, 16.522)
##AUDIT TRAIL= $$ (NUMBER, WHEN, WHO, WHERE, WHAT)
$$ ##TITLE= Audit trail, XWIN-NMR		Version 3.5
$$ ##JCAMPDX= 5.01
$$ ##ORIGIN= Bruker BioSpin GmbH
$$ ##OWNER= nmr
$$ C:\u/data/dgb/nmr/ADRS/730/pdata/1/auditp.txt
$$ ##AUDIT TRAIL=  $$ (NUMBER, WHEN, WHO, WHERE, WHAT)
(   1,<2007-02-13 10:54:00.83 +000>,<MAYBRIDGE\nmr>,<NMR_250MHZ>,
      <created by zg, POWCHK disabled, PULCHK disabled
       configuration hash MD5:
       49 4B E0 1D 92 C2 6B 37 9F E6 65 BC 52 41 86 1D
       data hash MD5: 64K
       A4 1F E7 31 B7 67 BE C8 32 A7 DA 83 E6 75 3E 94>)
(   2,<2007-02-13 10:54:14.83 +000>,<MAYBRIDGE\nmr>,<NMR_250MHZ>,
      <Start of raw data processing
       ef LB = 0.3 FT_mod = 6 PKNL = 1 SI = 32K 
       data hash MD5: 32K
       06 FE FA 59 A8 60 F6 AB F8 34 5A 8C F8 4E 92 F3>)
(   3,<2007-02-13 10:54:16.68 +000>,<MAYBRIDGE\nmr>,<NMR_250MHZ>,
      <apk 
       data hash MD5: 32K
       C7 09 FA AF E4 A2 7E F3 70 22 78 0C 9A BE 79 28>)
(   4,<2007-02-13 10:54:17.40 +000>,<MAYBRIDGE\nmr>,<NMR_250MHZ>,
      <abs ABSG = 5 
       data hash MD5: 32K
       46 CE C0 98 20 F6 56 32 7C C4 D7 C1 69 D7 D8 CF>)
$$ ##END=
$$ 
$$ hash MD5
$$ 9D 1F 5C A8 2C 55 29 5E CD AA 8D 72 F0 98 10 02
##$RELAX= 
##$RELAX= 
##$RELAX= 
##$RELAX= 
##$RELAX= 
##$RELAX= 
##$RELAX= 
$$ Bruker specific parameters
$$ --------------------------
##$DU= <C:\u>
##$EXPNO= 730
##$NAME= <ADRS>
##$PROCNO= 1
##$TYPE= <nmr>
##$USER= <dgb>
##$AMP= (0..31)
100 100 100 100 100 100 100 100 100 100 100 100 100 100 100 100 100 100 
100 100 100 100 100 100 100 100 100 100 100 100 100 100 
##$AQSEQ= 0
##$AQ_mod= 3
##$AUNM= <au_zg>
##$AUTOPOS= <38 >
##$BF1= 250.13
##$BF2= 250.13
##$BF3= 250.13
##$BF4= 250.13
##$BF5= 500.13
##$BF6= 500.13
##$BF7= 500.13
##$BF8= 500.13
##$BYTORDA= 1
##$CFDGTYP= 0
##$CFRGTYP= 5
##$CHEMSTR= <none>
##$CNST= (0..31)
1 1 145 1 1 1 1 1 1 1 1 1 1 1 1 1 1 1 1 1 1 1 1 1 1 1 1 1 1 1 1 1 
##$CPDPRG= <>
##$CPDPRG1= <>
##$CPDPRG2= <>
##$CPDPRG3= <>
##$CPDPRG4= <mlev>
##$CPDPRG5= <mlev>
##$CPDPRG6= <mlev>
##$CPDPRG7= <mlev>
##$CPDPRG8= <mlev>
##$CPDPRGB= <>
##$CPDPRGT= <>
##$D= (0..31)
0 1 0 0 0 0 0 0 0 0.06 0 0 0 0 0 0 0.0002 0 0 0 0 0 0 0 0 0 0 0 0 0 0 
0 
##$DATE= 1171364039
##$DBL= (0..7)
120 120 120 120 120 120 120 120 
##$DBP= (0..7)
150 150 150 150 150 150 150 150 
##$DBP07= 0
##$DBPNAM0= <>
##$DBPNAM1= <>
$$ [...]
##$SUBNAM7= <"">
##$SUBNAM8= <"">
##$SUBNAM9= <"">
##$SW= 20.6930455092707
##$SWIBOX= (0..15)
0 0 3 0 0 0 0 0 0 0 0 0 0 0 0 0 
##$SW_h= 5175.983436853
##$TD= 65536
##$TD0= 1
##$TE= 295.16
##$TE2= 300
##$TE3= 300
##$TEG= 300
##$TL= (0..7)
0 120 120 120 120 120 120 120 
##$TP= (0..7)
150 150 150 150 150 150 150 150 
##$TP07= 0
##$TPNAME0= <>
##$TPNAME1= <>
##$TPNAME2= <>
##$TPNAME3= <>
##$TPNAME4= <>
##$TPNAME5= <>
##$TPNAME6= <>
##$TPNAME7= <>
##$TPOAL= (0..7)
0.5 0.5 0.5 0.5 0.5 0.5 0.5 0.5 
##$TPOFFS= (0..7)
0 0 0 0 0 0 0 0 
##$TUNHIN= 0
##$TUNHOUT= 0
##$TUNXOUT= 0
##$USERA1= <user>
##$USERA2= <user>
##$USERA3= <user>
##$USERA4= <user>
##$USERA5= <user>
##$V9= 5
##$VALIST= <valist>
##$VCLIST= <CCCCCCCCCCCCCCC>
##$VD= 0
##$VDLIST= <DDDDDDDDDDDDDDD>
##$VPLIST= <PPPPPPPPPPPPPPP>
##$VTLIST= <TTTTTTTTTTTTTTT>
##$WBST= 1024
##$WBSW= 4
##$XGAIN= (0..3)
0 0 0 0 
##$XL= 0
##$YL= 0
##$YMAX_a= 217998
##$YMIN_a= -310579
##$ZGOPTNS= <>
##$ZL1= 120
##$ZL2= 120
##$ZL3= 120
##$ZL4= 120
##$ABSF1= 16.522
##$ABSF2= -4.171173
##$ABSG= 5
##$ABSL= 3
##$ALPHA= 0
##$AQORDER= 0
##$ASSFAC= 0
##$ASSFACI= 0
##$ASSFACX= 0
##$ASSWID= 0
##$AUNMP= <proc_1d>
##$AZFE= 0.1
##$AZFW= 0.1
##$BCFW= 0
##$BC_mod= 0
##$BYTORDP= 0
##$COROFFS= 0
##$CY= 12.5
##$DATMOD= 1
##$DC= 0
##$DFILT= <>
##$DTYPP= 0
##$F1P= 14.0000005364418
##$F2P= -0.99999901652339
##$FCOR= 0.5
##$FTSIZE= 32768
##$FT_mod= 6
##$GAMMA= 0
##$GB= 0
##$INTBC= 1
##$INTSCL= 1
##$ISEN= 128
##$LB= 0.3
##$LEV0= 0
##$LPBIN= 0
##$MAXI= 10000
##$MC2= 0
##$MEAN= 0
##$ME_mod= 0
##$MI= 0
##$NCOEF= 0
##$NC_proc= -4
##$NLEV= 6
##$NOISF1= 0
##$NOISF2= 0
##$NSP= 0
##$NTH_PI= 0
##$NZP= 0
##$OFFSET= 16.522
##$PC= 1
##$PHC0= 227.8953
##$PHC1= 7.423049
##$PH_mod= 1
##$PKNL= yes
##$PPARMOD= 0
##$PSCAL= 4
##$PSIGN= 0
##$REVERSE= no
##$SF= 250.13
##$SI= 32768
##$SIGF1= 0
##$SIGF2= 0
##$SINO= 400
##$SIOLD= 32768
##$SREGLST= <1H.CDCl3>
##$SSB= 0
##$STSI= 32768
##$STSR= 0
##$SW_p= 5175.98343685301
##$SYMM= 0
##$S_DEV= 0
##$TDeff= 65536
##$TDoff= 0
##$TI= <Analysis number 999999
Compound Code 99
Book Reference 9
Project Code 9>
##$TILT= no
##$TM1= 0
##$TM2= 0
##$TOPLEV= 0
##$USERP1= <user>
##$USERP2= <user>
##$USERP3= <user>
##$USERP4= <user>
##$USERP5= <user>
##$WDW= 1
##$XDIM= 32768
##$YMAX_p= 338587485
##$YMIN_p= -221194
$$ End of Bruker specific parameters
$$ ---------------------------------
##NTUPLES= NMR SPECTRUM
##VAR_NAME=  FREQUENCY,     SPECTRUM/REAL,   SPECTRUM/IMAG
##SYMBOL=    X,             R,               I
##VAR_TYPE=  INDEPENDENT,   DEPENDENT,       DEPENDENT
##VAR_FORM=  AFFN,          ASDF,            ASDF
##VAR_DIM=   32768,         32768,           32768
##UNITS=     HZ,            ARBITRARY UNITS, ARBITRARY UNITS
##FACTOR=    0.157963299565203, 1,           1
##FIRST=     4132.6476996994, 0,             0
##LAST=      -1043.33573715361, 0,           0
##MIN=       -1043.33573715361, -221194,     0
##MAX=       4132.6476996994, 338587485,     0
$$ Real data points
##PAGE= N=1
##DATA TABLE= (X++(R..R)), XYDATA
$$ [...]
##PAGE= N=2
##DATA TABLE= (X++(I..I)), XYDATA
13143a0264557J070810J074398J165019J317725J372230J500545J614055J906923
13135G57148K283817K714185L084626K711082N13458n310336j3596831j7011354
13127b3854205j1229638l010833J533352K757322K756406K439395K002730J615298
13119b4990173J253275J067751J013917R82079Q78992P77728P26682P12363O43255
13110a6934131N99977N55672M58759L75900L69064L10690J82628R4350J09853
13101a3877238K41491L12725L42944K88476L24058K81290K02040K67805K16819
13092a1399590R1631J67538J13386J73251J60288K30683J60977J14628J07123
13083a0080085J13705J07731J75935J55588Q1117J25225J26045J79003J32571
$$ plain form
13143 -10264557 -9193747 -8119349 -6954330 -5636605 -4264375 -2763830 -1149775 757148
13135 757148 3040965 5755150 8839776 11550858 12064316 6753980 -6842851 -23854205
13127 -23854205 -35083843 -38094676 -36561324 -33804002 -31047596 -28608201 -26605471 -24990173
13119 -24990173 -23736898 -22669147 -21655230 -20673151 -19794159 -19016431 -18289749 -17577386 -16934131
13110 -16934131 -16334154 -15778482 -15319723 -14943823 -14574759 -14264069 -14081441 -13987091 -13877238
13101 -13877238 -13635747 -13323022 -12980078 -12691602 -12367544 -12086254 -11884214 -11616409 -11399590
13092 -11399590 -11307959 -11140421 -11027035 -10853784 -10693496 -10462813 -10301836 -10187208 -10080085
13083 -10080085 -9966380 -9858649 -9682714 -9527126 -9446009 -9320784 -9194739 -9015736 -8883165
13074h883165O0426R9717J22205P3512J07615J24536J26459J17924J06991J14042
13064g829738O2562J08014J06860R3776P7050j8595M2988L5098r771O6691Q1759
13053g183306J20632J13713J22705J11775O9754Q922m55N3751j8014L0166N8424
13042f511933L9780Q0464Q5664R4867R4749N5777L8452L5207O2516O6990M0029
13031e817438Q0926O0781L2379K1318N0396Q1424O4627M8725J5210k2976j02597
13020e487225N4680J32328Q9474R0773l0206K4996J20902Q2643J2476R627L4066
13009d865466O8265o498N5154J400P1888M5459L122J6206K5072n2307P3250R2674
12997d471781N8628L1905R422M2864N3389P7565j9133J3941J6568J7851K5352
$$ plain form
13074 -8883165 -8822739 -8723022 -8600817 -8527305 -8419690 -8295154 -8168695 -8050771 -7943780 -7829738
13064 -7829738 -7767176 -7659162 -7552302 -7458526 -7381476 -7400071 -7357083 -7321985 -7331756 -7265065 -7183306
13053 -7183306 -7062674 -6948961 -6826256 -6714481 -6644727 -6635805 -6636260 -6582509 -6600523 -6570357 -6511933
13042 -6511933 -6472153 -6391689 -6306025 -6211158 -6116409 -6060632 -6022180 -5986973 -5924457 -5857467 -5817438
13031 -5817438 -5736512 -5675731 -5643352 -5622034 -5571638 -5490214 -5425587 -5376862 -5361652 -5384628 -5487225
13020 -5487225 -5432545 -5300217 -5210743 -5119970 -5150176 -5125180 -5004278 -4921635 -4909159 -4899532 -4865466
13009 -4865466 -4797201 -4803699 -4748545 -4747145 -4675257 -4629798 -4626676 -4610470 -4585398 -4637705 -4564455 -4471781
12997 -4471781 -4413153 -4381248 -4371826 -4328962 -4275573 -4198008 -4217141 -4203200 -4186632 -4168781 -4143429
12986d143429o521O0719N9819k258m3961L2228Q6820L8262k6855r031k0800P3121
12974c901886Q3408J6890M4472O9308K4098K9507J1470k7496K5281P3990P4766
12963c476192l4400L342J1060O7248O4529J22679m853l5814P113K1144R582K2891
12951c221671L649M0500L2099M4138j7111J6053K4316K0401K4169O692j3145K1737
12939c018173L7608M7408P2445J5778q277k1307J8555N3272k792K1709L8931M1694
12927b703149J7786L1782q783k1049K8371L7465L2228J5434R3307m4103m4551
12916b565262O631n5628J4187K2650M6257m6505J05835O2978p676j552L0666J09055
12904b278364N1740k3741J4237j6858j2113l389N005j577N571M1064Q7239J4165
$$ plain form
12986 -4143429 -4149950 -4089231 -4029412 -4031670 -4075631 -4043403 -3956583 -3918321 -3945176 -3954207 -3975007 -3901886
12974 -3901886 -3818478 -3801588 -3757116 -3687808 -3663710 -3634203 -3622733 -3650229 -3624948 -3550958 -3476192
12963 -3476192 -3510592 -3507250 -3496190 -3428942 -3364413 -3241734 -3246587 -3282401 -3275288 -3254144 -3244562 -3221671
12951 -3221671 -3218022 -3177522 -3145423 -3101285 -3118396 -3102343 -3078027 -3057626 -3033457 -3026765 -3039910 -3018173
12939 -3018173 -2980565 -2933157 -2860712 -2844934 -2853211 -2874518 -2855963 -2802691 -2805483 -2783774 -2744843 -2703149
12927 -2703149 -2685363 -2653581 -2662364 -2683413 -2655042 -2617577 -2585349 -2569915 -2476608 -2520711 -2565262
12916 -2565262 -2558631 -2614259 -2600072 -2577422 -2531165 -2577670 -2471835 -2408857 -2416533 -2418085 -2387419 -2278364
12904 -2278364 -2226624 -2250365 -2236128 -2252986 -2265099 -2268488 -2263483 -2265060 -2259489 -2218425 -2131186 -2117021
12892b117021k2253p6607r126K0769P6173L6258M8729J6431l5864J3118K9108
12881b020285p087j3467M958N5366M6035J9792N6664J8578m5568j4497M2169L1435
12869a825907o2333m371R493L4805J3841j5619k0940J3447M4986M0616Q832K7508
12857a735642L6654K5875j4179l8165P8902L1035k8960k6720j1570j5944J5114
12846a683600J11325O1147l0537j2583m3409l7397o1704J7076N4985O6406K0570
12835a537721Q462K0937o203R396L5812j0571k1946L4074K1931N4050P0770k2504
12823a343513M3311m407l7914m6361L4480K7446M4153L6516N7814j1019N0313
12812a149181L8647j1011k7267n3664Q3674M0159M133k7876m0403L761R0060J5541
$$ plain form
12892 -2117021 -2139274 -2215881 -2225007 -2204238 -2128065 -2091807 -2043078 -2026647 -2062511 -2049393 -2020285
12881 -2020285 -2027372 -2040839 -2035881 -1980515 -1934480 -1914688 -1858024 -1839446 -1885014 -1899511 -1857342 -1825907
12869 -1825907 -1888240 -1892611 -1883118 -1848313 -1834472 -1850091 -1871031 -1857584 -1812598 -1771982 -1763150 -1735642
12857 -1735642 -1698988 -1673113 -1687292 -1725457 -1646555 -1615520 -1644480 -1671200 -1682770 -1698714 -1683600
12846 -1683600 -1572275 -1511128 -1541665 -1554248 -1597657 -1635054 -1696758 -1679682 -1624697 -1558291 -1537721
12835 -1537721 -1529259 -1508322 -1514525 -1505129 -1469317 -1479888 -1501834 -1467760 -1445829 -1391779 -1321009 -1343513
12823 -1343513 -1300202 -1304609 -1342523 -1388884 -1354404 -1326958 -1282805 -1246289 -1188475 -1199494 -1149181
12812 -1149181 -1110534 -1121545 -1148812 -1202476 -1118802 -1078643 -1074510 -1102386 -1142789 -1139028 -1048968 -1033427
12800a033427K7152l4736o6157N5678O1219J8338p1125o5051r451J076l0349J9082
12788a127751J6969N2728J1197p818J0154p72l1260j2152m2939j6103L9377M8298
12776a060072J01584K1067K2095L7270N6334R610k2844n961j7968m1376J6446
12765h83815Q7097r335N3955N1405L213J9185L3142N9426j9018Q3009L6848l5205
12753e20093K2649N8829J15075M0964j01542k71739k90545j88098K4970K9195
12743a080335N2981L8536j5452M7211O7350K8706n832L2494M3438M6782J4714
12732g29407M3664n094j2538M9052L5801P566p3264k6061J1978M5193R0435Q9243
12720d73432J9247k2864o8875Q32M1721q436P5285J17230O5065J8502J9313K1538
$$ plain form
12800 -1033427 -1006275 -1041011 -1107168 -1051490 -990271 -971933 -1043058 -1108109 -1117560 -1116484 -1146833 -1127751
12788 -1127751 -1110782 -1058054 -1046857 -1054675 -1044521 -1045293 -1076553 -1088705 -1131644 -1147747 -1108370 -1060072
12776 -1060072 -958488 -937421 -915326 -878056 -821722 -812112 -834956 -840917 -858885 -900261 -883815
12765 -883815 -796718 -806053 -752098 -700693 -697480 -678295 -645153 -585727 -604745 -521736 -484888 -520093
12753 -520093 -497444 -438615 -323540 -282576 -384118 -655857 -946402 -1134500 -1109530 -1080335
12743 -1080335 -1027354 -988818 -1004270 -957059 -889709 -861003 -866835 -834341 -790903 -744121 -729407
12732 -729407 -685743 -690837 -703375 -654323 -618522 -610956 -684220 -710281 -698303 -653110 -562675 -473432
12720 -473432 -454185 -477049 -545924 -545092 -503371 -511807 -436522 -319292 -254227 -235725 -216412 -194874
12708a94874R740j847L8120M9643k9468j22810k57858j66658k3276L0792k2206
12697f90702J9975J284O4811N2457j6350p632P4657J6331m10J0950j10P826L0228
12684d36685l677N4622o873l9853L8207L6320q349m954Q605K677M0736P7740P6384
12671a65100J5171m3676J9547L9109k0692k609Q3495j7521K3572L5614M530M2115
12659A3555P007o8793j57030p3925M7576P0304Q757p7622o5540j2065R616L6763
12647b61397M3321L329J7483K8590J5636L2328L8148J3177k1081q6684k9939R1222
12635a15867N1462j3189N1022p774j4047J0696k2566J8131N5658Q0303n370l4308
12623E4151k6377j9696J4058K4316J2M5369M4347p633m8779J2859N6238J9151
$$ plain form
12708 -194874 -185134 -186981 -148861 -99218 -128686 -251496 -509354 -676012 -699288 -668496 -690702
12697 -690702 -670727 -669443 -604632 -552175 -568525 -576157 -501500 -485169 -485579 -474629 -474739 -466913 -436685
12684 -436685 -440362 -385740 -392613 -432466 -394259 -357939 -366288 -371242 -362637 -359960 -319224 -241484 -165100
12671 -165100 -149929 -193605 -174058 -134949 -155641 -158250 -74755 -92276 -68704 -33090 -28560 13555
12659 13555 20562 -48231 -205261 -279186 -231610 -161306 -152549 -230171 -295711 -307776 -298160 -261397
12647 -261397 -218076 -214747 -197264 -168674 -153038 -120710 -82562 -69385 -90466 -177150 -207089 -115867
12635 -115867 -64405 -77594 -26572 -34346 -48393 -37697 -60263 -42132 13526 93829 88459 54151
12623 54151 27774 8078 22136 46452 46464 91833 136180 128547 79768 92627 148865 168016
12611A68016l9577L0115K0426L271k9809J1331L29o5816r610R3113m542J0060
12599A87307O1063L3563j0788j2258j4210P324n351j0383J2766M1429K4306P8692
12587C93460N4074K1179r0024j1579q911j5129j4204n255m655M7168m194R521
12575C71451r366L5693K2646k4536k6656k7795Q625j2578Q660J5174N1671j3742
12563C99247J1851J4166K2653k3077j9202N0401K6184o26O337N2239n392L4001
12551E68782k2673l7962M9214L7025M401k9841j8917N0579L1266N2763M4458m352
12539G24743m3173n8313n401k457K9015M5070K5063P2547P738j9800n366j978
12527G67688n6413j59K9106J0494k0872j3070n571L2558K2037o509j1320R698
$$ plain form
12611 168016 128439 158554 178980 182251 152442 163773 164102 98286 88676 181789 177247 187307
12599 187307 248370 281933 271145 258887 244677 252001 246650 236267 249033 290462 314768 393460
12587 393460 447534 468713 378689 367110 358199 343070 328866 323611 318956 366124 361930 371451
12575 371451 362085 397778 420424 395888 369232 341437 350062 337484 346144 361318 412989 399247
12563 399247 411098 425264 447917 424840 405638 456039 482223 481597 487934 540173 534781 568782
12551 568782 546109 508147 557361 594386 598787 568946 550029 600608 631874 684637 729095 724743
12539 724743 681570 623257 617856 615399 644414 689484 714547 787094 794832 775032 769666 767688
12527 767688 711275 711116 740222 750716 729844 716774 711203 743761 765798 759289 747969 757667
12515G57667J8507K6425j3901o2958j6574K1426j9862J7581L3448j5093J9116
12504G65782P7718K8613p9303J1378K4310l451J8971L0364M923J584N8814R7582
12492A037285O1431J8352j6153J8447P6470K3752O8018J21146k9520L6529j20929
12481A294828k89736k15147p1548J5235o54N0592L5613M1607P4748L3490o55k8040
12469I40333J0298L164M674k76P1053K9990N2081N0506k2941m2121n5867l6145
12457A004749L2988Q4812J751m2316J7252J8517J2628N3174j1712p753M974N9966
12445A229030K1251P905l4401k5927K5677L2588O3023L4941K5667L2251K6235
12434A438240L6669N921j02754j10067j6782N6999J1214R071m8430J5481M7756
$$ plain form
12515 757667 776174 802599 788698 725740 709166 730592 710730 728311 761759 746666 765782
12504 765782 843500 872113 792810 804188 828498 825047 844018 874382 879305 880889 939703 1037285
12492 1037285 1098716 1117068 1100915 1119362 1195832 1219584 1287602 1408748 1379228 1415757 1294828
12481 1294828 1005092 789945 718397 733632 732978 783570 819183 860790 935538 969028 968373 940333
12469 940333 950631 953795 958469 958193 1029246 1059236 1111317 1161823 1138882 1096761 1040894 1004749
12457 1004749 1037737 1122549 1124300 1081984 1099236 1117753 1130381 1183555 1171843 1164090 1169064 1229030
12445 1229030 1250281 1258186 1223785 1197858 1223535 1256123 1319146 1354087 1379754 1412005 1438240
12434 1438240 1474909 1480830 1378076 1268009 1251227 1308226 1319440 1328511 1280081 1295562 1343318
12423A343318R848J0732K4991j9230j2114Q529M9729n949k924j172k9750J5254
12411A391262q94q9426m7257J2018P1342P4510M4340J5921J0396j2753l3912L4500
12399A470047J7393Q198j1267J4077o7079M044J4660K5802L3293O7241N1485n6793
12387A571101o1733j1557Q7643O4450K1150j5812J3202L2690P507o2178k0224
12376A626239K9087k112P5923O5344j9877J1672M5661K8496J5391L9404p059L921
12364A912090N7047K9236j9819j24528q2353o2689k7615M2105N1800M3258L4365
12353A852897J0979L2371O6425J4792q1094L1756P5137l1767l5910j3861l1191
12342A890534L611p0343j8795j9806m3065J6554K5454N8316O6088j8193J1312
$$ plain form
12423 1343318 1353166 1363898 1388889 1369659 1357545 1366074 1415803 1409854 1406930 1405758 1376008 1391262
12411 1391262 1390368 1300942 1253685 1265703 1337045 1411555 1455895 1471816 1482212 1469459 1435547 1470047
12399 1470047 1487440 1495638 1484371 1498448 1431369 1435413 1450073 1475875 1509168 1576409 1627894 1571101
12387 1571101 1509368 1497811 1585454 1649904 1671054 1655242 1668444 1701134 1708641 1646463 1626239
12376 1626239 1655326 1653214 1729137 1794481 1774604 1786276 1831937 1860433 1875824 1915228 1908169 1912090
12364 1912090 1969137 1998373 1978554 1854026 1771673 1708984 1681369 1723474 1775274 1818532 1852897
12353 1852897 1863876 1896247 1962672 1977464 1896370 1928126 2003263 1971496 1935586 1921725 1890534
12342 1890534 1894145 1823802 1805007 1785201 1742136 1758690 1784144 1842460 1908548 1890355 1901667
12331A901667R2851N973J7264r679P065o3965o85J0111rL0234n601N270k1133
12318A969363L2432L5562L3534J8631J0566k5305j4287q096k4115N0495j2090
12307B066690o798R4214N7255l414M3868J2201J2180K8989J9724N854O1615l3902
12295B358476r02K2060j1126k0766O2573P570j3542j2358K0215K2113L1179K7544
12283B493036O9838J8941m727k2062l6953l713K8222N4510M8783L1259k6974Q259
12271B658419j7534L801l0911o568O0712N713N560N1003J6433L5808O606j034
12259B788008l195k6631o1075k4789L1155M5611j9325R287l6090p7M8793J33795
12247B885467L0149o2744K02r0558l2000m7919r2N9999R8228N6044N4681M5366
$$ plain form
12331 1901667 1994518 2000491 2017755 2008076 2015141 1951176 1950491 1960602 1960593 1990827 1985226 1990496 1969363
12318 1969363 2001795 2037357 2070891 2089522 2100088 2074783 2060496 2052400 2028285 2078780 2066690
12307 2066690 2059892 2154106 2211361 2207947 2251815 2264016 2276196 2305185 2324909 2330763 2392378 2358476
12295 2358476 2357574 2379634 2368508 2347742 2410315 2417885 2404343 2391985 2412200 2434313 2465492 2493036
12283 2493036 2562874 2581815 2577088 2555026 2518073 2514360 2542582 2597092 2645875 2677134 2650160 2658419
12271 2658419 2640885 2644686 2613775 2607207 2667919 2673632 2679192 2730195 2746628 2782436 2789042 2788008
12259 2788008 2784813 2758182 2697107 2672318 2703473 2749084 2729759 2739046 2702956 2702879 2751672 2885467
12247 2885467 2915616 2852872 2853074 2762516 2730516 2682597 2682505 2742504 2840732 2896776 2951457 2996823
12235B996823k9127J8445j5081j3529P2023M8623m072j2136n6851L3933M5099
12224C084150K9466k7109Q134P7590M0427M4290L2101o0577k3572L914K5089K2908
12212C256811J2480R512L2163J5955M4153k9251M1293K6638P847k6498K1744L3727
12200C446574O8450K7313J0413k1955N2059K5646m3266L3022M9963L5040K1324
12189C704583J654K3519K6212j2653O660R232j3496L7824J8606J844K1420L5302
12177C860707K6991O0790N9787j806M9013L5530J2519n7037r7780J2810L0147
12166C991671L6006k553m174N1980M5748Q506R3788L089k5291K674J17511K3874
12154D342829o7874N9844P5230M8440K3148q360O4016r25M3007L8359K0605M1173
$$ plain form
12235 2996823 2967696 2986141 2971060 2957531 3029554 3078177 3074105 3061969 3005118 3039051 3084150
12224 3084150 3113616 3086507 3094641 3172231 3212658 3256948 3289049 3228472 3204900 3208814 3233903 3256811
12212 3256811 3269291 3278803 3310966 3326921 3371074 3341823 3383116 3409754 3417601 3391103 3412847 3446574
12200 3446574 3515024 3542337 3552750 3530795 3582854 3608500 3565234 3598256 3648219 3683259 3704583
12189 3704583 3706237 3729756 3755968 3743315 3749975 3759207 3745711 3783535 3802141 3803985 3825405 3860707
12177 3860707 3887698 3948488 4008275 4006469 4055482 4091012 4103531 4046494 3948714 3961524 3991671
12166 3991671 4027677 4025124 4020950 4072930 4118678 4127184 4220972 4224061 4198770 4201444 4318955 4342829
12154 4342829 4274955 4334799 4410029 4458469 4481617 4473257 4537273 4536348 4579355 4617714 4638319 4679492
12142D679492L3337j5960p4853l1344k143J18622R8078J05957Q8180L2758k9849
12131E002275J5526K5058J5500k4855J1186M9843N2482N5230J9542K331P0026
12120E294144N8009N1283L3193k896R0157n630K643P2471M4272k3679J0268K6046
12108E650281J04071P2929J0363L0988M1848J2666N6385Q5724K6549K3456K6409
12097F141669L6510K8943O9802O1981j514P0489O4496M730L0940N6701L9412P4620
12085F678779M1059Q5626J06471O1926j2478K795R6567Q3382O5465J39645L0264
12074G379501M1564R4502L3777N9378O853N8320J04679J04286P5531Q8430J43509
12063H190330J13078k0009K6973Q9613J15075J19679Q2567J54149J58853Q4176
$$ plain form
12142 4679492 4712829 4696869 4622016 4590672 4588529 4707151 4805229 4911186 4999366 5032124 5002275
12131 5002275 5017801 5042859 5058359 5033504 5044690 5094533 5147015 5202245 5221787 5224118 5294144
12120 5294144 5352153 5403436 5436629 5433733 5523890 5518260 5520903 5593374 5637646 5613967 5624235 5650281
12108 5650281 5754352 5827281 5837644 5868632 5910480 5923146 5979531 6065255 6091804 6115260 6141669
12097 6141669 6178179 6207122 6276924 6338905 6337391 6407880 6472376 6477106 6508046 6564747 6604159 6678779
12085 6678779 6719838 6805464 6911935 6973861 6961383 6964178 7060745 7144127 7209592 7349237 7379501
12074 7379501 7421065 7515567 7549344 7608722 7615575 7673895 7778574 7882860 7958391 8046821 8190330
12063 8190330 8303408 8283399 8310372 8399985 8515060 8634739 8717306 8871455 9030308 9114484
12053I114484R3409J00641O9874O1477R8611J42526R1290J36332J23710J48239
12043A0180593K10479J82504J71285J43749J66318K08109J90732J57722J78900
12034A1790391K03329J90817K42386J98384J51865K73489K59086K68244L40591
12025A3918582M15562L66845L58495M78004M39105M85578N24540N44052O18048
12016A8148811P01434P29777Q14413Q93985R54973R23471R43496Q45472Q05884
12007B5761716Q26080O96579L94691m70276k036384m042491n426241n257473l761368
11998F684833k078712p76248J71967Q20465J277448J565851J616539J597423J438839
11989A2318405J059201N34860J44716k86976r56985k001324l474054m688719m650858
$$ plain form
12053 9114484 9207893 9308534 9378408 9439885 9538496 9681022 9772312 9908644 10032354 10180593
12043 10180593 10391072 10573576 10744861 10888610 11054928 11263037 11453769 11611491 11790391
12034 11790391 11993720 12184537 12426923 12625307 12777172 13050661 13309747 13577991 13918582
12025 13918582 14334144 14700989 15059484 15537488 15976593 16462171 16986711 17530763 18148811
12016 18148811 18850245 19580022 20394435 21288420 22243393 23166864 24110360 24955832 25761716
12007 25761716 26587796 27284375 27679066 27208790 25172406 21129915 15703674 10446201 6684833
11998 6684833 4606121 3829873 4001840 4822305 6099753 7665604 9282143 10879566 12318405
11989 12318405 13377606 13912466 14057182 13770206 12813221 10811897 7337843 2649124 -2001734
11980b001734l254050j612239o41974l30486j59269K00941O37486R85520J082678
11971e093127J072446J102131J099873R78330R21421Q65295Q45069P39155O47447
11962C178040P12822P07904P17573O27696O29269O01814O11469O04325O07687
11953H998599O79866P07764O75753Q19282R00590Q05838R30344J016757J054615
11944A6589408J128969J264356J358681J271171J195540J003722O51914M29062
11936B4892823N06031P03317M90734n68697k387950m187558m524226l314058j866066
11927I744350q86009j53102N74377J427291K169461K484292K556731K534232K305563
11918B2757186J663505J78548k340625n488870q016699r169347r326651q024435
$$ plain form
11980 -2001734 -5255784 -6868023 -7509997 -7840483 -7999752 -7798811 -7161325 -6175805 -5093127
11971 -5093127 -4020681 -2918550 -1818677 -840347 81074 946369 1791438 2530593 3178040
11962 3178040 3890862 4598766 5316339 5944035 6573304 7175118 7786587 8390912 8998599
11953 8998599 9678465 10386229 11061982 11881264 12781854 13587692 14518036 15534793 16589408
11944 16589408 17718377 18982733 20341414 21612585 22808125 23811847 24463761 24892823
11936 24892823 25398854 26102171 26592905 26024208 23636258 19448700 14924474 11610416 9744350
11927 9744350 8858341 8705239 9279616 10706907 12876368 15360660 17917391 20451623 22757186
11918 22757186 24420691 24599239 22258614 16769744 8753045 -416302 -9742953 -17767388
11910a7767388m896712j587469O84893J764894K152607K281567K208103K039682
11902a3119823J726974J233359M61800j27934q19000j984204l231890l681863
11894a9542581k906855j390576j25313L54153N11385M73606N20699P18505J012802
11885b0374175J074596J142014J164674J108919R89737R62098Q89979Q65058P81839
11876a1395261Q09781P34729O26463O37002O39049N66821N67776O23116O09524
11867e581000N81084O84811O82608O66265O45869O63944P38438Q15421R01895
11858G99335R95584J088695J127678J148818J190870J118026R33489O01525J67525
11849I171545j10863j70031n31168j917448l972547n082650m405460k802608j424986
$$ plain form
11910 -17767388 -22664100 -24251569 -23566676 -21801782 -19649175 -17367608 -15159505 -13119823
11902 -13119823 -11392849 -10159490 -9697690 -9825624 -10644624 -12628828 -15860718 -19542581
11894 -19542581 -22449436 -23840012 -23965325 -23611172 -23099787 -22626181 -22105482 -21386977 -20374175
11885 -20374175 -19299579 -18157565 -16992891 -15883972 -14894235 -13932137 -13042158 -12177100 -11395261
11876 -11395261 -10585480 -9850751 -9224288 -8587286 -7948237 -7381416 -6813640 -6190524 -5581000
11867 -5581000 -4999916 -4315105 -3632497 -2966232 -2320363 -1656419 -917981 -102560 799335
11858 799335 1794919 2883614 4011292 5160110 6350980 7469006 8402495 9004020 9171545
11849 9171545 9060682 8890651 8359483 6442035 2469488 -2613162 -7018622 -9821230 -11246216
11840a1246216o70899k60693K31573P00910J232536J586850J751791J667667J477450
11831c529031J044879N51865j92457j218738k632847m347589n454700m963524
11823b0742142l237002j387829j11319N12320O13421N39201O14944Q11497Q11453
11814b1575456Q55539Q06613Q21578P03101P14666O25600O29015N48940M94905
11805a5375499M44947N05211M22388L30332L35989L57590L34284K72750J88721
11796a2183287J84254K53658L09555K73688J56924J78552K10396J84173J98342
11787a0233745K01979J34018J27247J28366J35593J64859J55333J23260J78583
11778h884507J76685N3309N9817P5026Q3316J32580J77540R7677J00616R6859
$$ plain form
11840 -11246216 -11917115 -12177808 -11946235 -11245325 -10012789 -8425939 -6674148 -5006481 -3529031
11831 -3529031 -2484152 -1932287 -2124744 -3343482 -5976329 -10323918 -15778618 -20742142
11823 -20742142 -23979144 -25366973 -25478292 -24965972 -24352551 -23813350 -23198406 -22386909 -21575456
11814 -21575456 -20719917 -19913304 -19091726 -18388625 -17673959 -17048359 -16419344 -15870404 -15375499
11805 -15375499 -14930552 -14425341 -14002953 -13672621 -13336632 -12979042 -12644758 -12372008 -12183287
11796 -12183287 -11999033 -11745375 -11435820 -11162132 -11005208 -10826656 -10616260 -10432087 -10233745
11787 -10233745 -10031766 -9897748 -9770501 -9642135 -9506542 -9341683 -9186350 -9063090 -8884507
11778 -8884507 -8707822 -8654513 -8594696 -8519670 -8436354 -8303774 -8126234 -8028557 -7927941 -7831082
11768g831082P0607O5314J06527Q1588J06476P1305O7149P2257N9276Q6327K0676
11757g023580O5151J11913J00165P9465O8326L7030N4316R5411M8875N0663M8664
11746f263601K0999M1957Q3442L3440L2133J11444O6257P2404O9531R2250L0498
11735e609246L7945K0056Q9312J00419O9176j0751j5108k297J03973M2932N1992
11724e121597J7874O5054O4347K6960M0181J5571M9364O0868k3903k4456L0317
11713d799420O9423R6281Q953o819R2076O2178K3910L1712M0484n319O3360J7531
11701d305650O397O359Q8336L8510m1400R510N7335L9315L8542K7536o066j2449
11689d053725J7976K3137N5882l7198L2690K9763N1303O1831N0581R742N7573
$$ plain form
11768 -7831082 -7760475 -7695161 -7588634 -7507046 -7400570 -7329265 -7262116 -7189859 -7130583 -7044256 -7023580
11757 -7023580 -6958429 -6846516 -6746351 -6666886 -6598560 -6561530 -6507214 -6411803 -6362928 -6312265 -6263601
11746 -6263601 -6242602 -6200645 -6117203 -6083763 -6051630 -5940186 -5873929 -5801525 -5731994 -5639744 -5609246
11735 -5609246 -5571301 -5551245 -5461933 -5361514 -5292338 -5303089 -5318197 -5320494 -5216521 -5173589 -5121597
11724 -5121597 -5103723 -5038669 -4974322 -4947362 -4907181 -4891610 -4842246 -4781378 -4805281 -4829737 -4799420
11713 -4799420 -4729997 -4633716 -4624763 -4631582 -4539506 -4477328 -4453418 -4421706 -4381222 -4386541 -4323181 -4305650
11701 -4305650 -4299253 -4292894 -4204558 -4166048 -4207448 -4197938 -4140603 -4101288 -4062746 -4035210 -4041276 -4053725
11689 -4053725 -4035749 -4012612 -3956730 -3993928 -3961238 -3931475 -3880172 -3818341 -3767760 -3758018 -3700445
11678c700445K4926j03784k0038P0241J01162M0408L3557L7713J0646j8004J1179
11667c512439M8475l222K9024K1848J15016L9624l7209N6032O5418p6715R976
11656c244172O0687r787p590L7841j0796M5234P6478M3731K3114j5806k930N0663
11644b953333K8028J634j4958J3982N6054j446k378Q320N3297J4666m6639L7374
11632b805399M0677o698m7591m2226L9390J33172K5586K0549L4070Q3j2084m398
11620b624869k4341P0198R2433N615o3147m1019K6410N6903Q8408K5135j4786
11609b403060M0142K1000l2618j146K1069m0492N2152O7926O1814L3293n8369
11598b238289j9168j2931j9579O510N9100M980J8489r005K8186O2483P191L0297
$$ plain form
11678 -3700445 -3675519 -3779303 -3799341 -3729100 -3627938 -3587530 -3553973 -3516260 -3505614 -3523618 -3512439
11667 -3512439 -3463964 -3467186 -3438162 -3416314 -3301298 -3261674 -3298883 -3242851 -3177433 -3254148 -3244172
11656 -3244172 -3183485 -3193272 -3200862 -3163021 -3173817 -3128583 -3052105 -3008374 -2985260 -3001066 -3003996 -2953333
11644 -2953333 -2925305 -2923671 -2938629 -2924647 -2868593 -2870039 -2872417 -2864097 -2810800 -2796134 -2842773 -2805399
11632 -2805399 -2764722 -2771420 -2819011 -2861237 -2821847 -2688675 -2663089 -2642540 -2608470 -2608387 -2620471 -2624869
11620 -2624869 -2649210 -2579012 -2486579 -2480964 -2544111 -2585130 -2558720 -2501817 -2413409 -2388274 -2403060
11609 -2403060 -2362918 -2341918 -2374536 -2375682 -2354613 -2395105 -2342953 -2275027 -2213213 -2179920 -2238289
11598 -2238289 -2257457 -2270388 -2289967 -2283457 -2224357 -2219377 -2200888 -2209893 -2181707 -2119224 -2112033 -2081736
11586b081736j7016j0075J7229L5209o146l4943J406k1827N1079M8251J5073N6262
11574a947234N6442K3279J3121K835L3302n531j2175R156m6475k8933J4269N1841
11562a836103J1143k4447M615O370L2342M7599J701P241R037O4317N4597P034
11550a614554o889n1839j000K2244k5007j0378R998J0594m3841m1271K3766M2922
11538a685255O1377j0023p5157K8200J19208L1674M6520K1812l6360J7059M4487
11527a436458N753L2601L5577k9367j5954L7172j7746k2987K0905l9807j1308
11516a441619O3440M1349K805m993k9800J9252N7291L0606k762p610L7108j3266
11504a248199l4185Q7208J8749J439P3732l5152Q2425J02810n7308k5100P267
$$ plain form
11586 -2081736 -2098752 -2108827 -2091598 -2056389 -2062535 -2097478 -2096072 -2117899 -2066820 -2018569 -2003496 -1947234
11574 -1947234 -1890792 -1867513 -1854392 -1851557 -1818255 -1823786 -1835961 -1826805 -1873280 -1902213 -1887944 -1836103
11562 -1836103 -1824960 -1849407 -1844792 -1838422 -1806080 -1758481 -1756780 -1749539 -1740502 -1676185 -1621588 -1614554
11550 -1614554 -1621443 -1673282 -1674282 -1652038 -1677045 -1687423 -1677425 -1666831 -1710672 -1751943 -1728177 -1685255
11538 -1685255 -1623878 -1633901 -1709058 -1680858 -1561650 -1529976 -1483456 -1461644 -1498004 -1480945 -1436458
11527 -1436458 -1430705 -1398104 -1362527 -1391894 -1407848 -1370676 -1388422 -1411409 -1390504 -1430311 -1441619
11516 -1441619 -1378179 -1336830 -1334025 -1339018 -1368818 -1349566 -1292275 -1261669 -1264431 -1272041 -1234933 -1248199
11504 -1248199 -1282384 -1195176 -1176427 -1174988 -1101256 -1136408 -1053983 -951173 -1008481 -1033581 -1026314
11493a026314J9993p671l5846j6623l8476N417K5827L7854O0357M7349m954q9891
11481a022978r727L0941K1884j5861m7039r5319l7265j2525J7981N9420O5723
11470a044765L8138K1864N4925p357j8183M8792J2627O019J9337q573j4428q3547
11458i75151k0095K9779J3493M6034J8030j033o4242j9145M6988J12798j4191
11447h26735o5090L2379N4679l8010r82j9762j37m418N8630N9877L1882l351l1488
11434g52526M329K8052o697k5453j0327J1514L3339q15l430Q005P9888N6064k2783
11421f00840K3724J4124k1488K8439K2252j7099L394N9657Q604P3392K651k4014
11409d27204J492r357K0616l7969j0650n1994j3374O863k420O126L3047P0805
$$ plain form
11493 -1026314 -1006321 -1013992 -1049838 -1066461 -1104937 -1099520 -1073693 -1035839 -975482 -928133 -933087 -1022978
11481 -1022978 -1032705 -1001764 -979880 -995741 -1042780 -1138099 -1175364 -1187889 -1169908 -1110488 -1044765
11470 -1044765 -1006627 -984763 -929838 -937195 -955378 -906586 -893959 -887940 -868603 -877176 -891604 -975151
11458 -975151 -995246 -965467 -951974 -905940 -887910 -888943 -953185 -972330 -925342 -812544 -826735
11447 -826735 -891825 -859446 -804767 -842777 -843759 -863521 -863658 -868076 -809446 -749569 -717687 -721038 -752526
11434 -752526 -748197 -720145 -726842 -752295 -762622 -751108 -717769 -718584 -722014 -714009 -634121 -578057 -600840
11421 -600840 -577116 -562992 -584480 -556041 -533789 -550888 -547494 -487837 -479233 -405841 -403190 -427204
11409 -427204 -425712 -435069 -414453 -452422 -463072 -515066 -528440 -521577 -523997 -517871 -484824 -414019
11397d14019M3402J8836L8132n4179p9062L8988Q4348M6502p8595r4137J071J5773
11385d32940j3287k757J8044K9334L2936r298l6928M3167M3837J5387L3928K2578
11373b55999J4001k3842J5489N4250L3210k673P800O584J6530K989l4708p5187
11361b41556J5613j0639r411j8151L0051J06061L1713m5848r617J1619L7253R138
11349i3774n3805K7038Q9825R1600K890j26578j3693R092j7244j4662l1009J8399
11337a11921J4364P8088M7082l3514K730K0114J9775o0840L7766O5610j9655P295
11325F6894K5276l8513j0482J1837L4324J0990N276M5992J1459j2686N896M3458
11313A99721k238j6932j500J7176N0289L906j0692m2790N9850M1508p0016n2411
$$ plain form
11397 -414019 -370617 -351781 -313649 -367828 -446890 -407902 -323554 -277052 -355647 -449784 -448713 -432940
11385 -432940 -446227 -448984 -430940 -401606 -368670 -377968 -414896 -371729 -327892 -312505 -278577 -255999
11373 -255999 -241998 -265840 -250351 -196101 -162891 -165564 -157764 -151180 -134650 -131661 -166369 -241556
11361 -241556 -225943 -236582 -245993 -264144 -234093 -128032 -96319 -142167 -151784 -140165 -102912 -93774
11349 -93774 -147579 -120541 -30716 60884 63774 -62804 -76497 -67405 -84649 -99311 -130320 -111921
11337 -111921 -97557 -19469 27613 -5901 -3171 16943 36718 -24122 13644 79254 59599 66894
11325 66894 92170 53657 43175 55012 89336 100326 105602 151594 163053 150367 156263 199721
11313 199721 197483 180551 179051 196227 246516 250422 239730 196940 256790 298298 228282 175871
11301A75871M8661M6805o3165k414P1353l462N01M6626j2351J0902M2573p355
11289C54545j7408O93P5507M0141k5224m1400k0379j4511K5187O669K3207M2528
11277D49555L021M8606P233j9406K3414J2941k0642R995N826j5346o11J8674O2261
11264E85521l1938n8476N8907O3122J7453M6293M4142j8486Q739k6548l434Q913
11252F94208P1403m4467K870o192n2054j9715O3335N4891l9255M536K4813K5984
11240G80357l0381o1998k4081l1451n808l617n7197J5615L4171M0063L4889R719
11228G00281K7084P455L5985N3043o939N522M0333j196K0619k3805l0134J6916
11216H45164j707Q00l355l6208K9736l132l1439N312J5576m4838M3060Q6562O5821
$$ plain form
11301 175871 224532 271337 208172 205758 277111 273649 274150 320776 308425 319327 361900 354545
11289 354545 337137 337830 413337 453478 428254 386854 366475 351964 377151 383820 407027 449555
11277 449555 452576 501182 508415 489009 512423 525364 504722 514717 520543 505197 504586 523260 585521
11264 585521 553583 495107 554014 617136 634589 680882 725024 706538 715277 688729 685295 694208
11252 694208 765611 721144 724014 717822 665768 646053 709388 764279 725024 729560 754373 780357
11240 780357 749976 687978 663897 632446 626638 623021 565824 581439 615610 655673 690562 700281
11228 700281 727365 734820 770805 823848 816909 822431 862764 861568 882187 858382 828248 845164
11216 845164 843457 844257 840902 804694 834430 831298 799859 805171 820747 775909 818969 905531 971352
11203I71352J5183j03K5771O368n2378k5279k5974Q787O9687L6331r098o808n0620
11190I63219J5088M4524L2013O3528l5920n7381l1915J8601j2512k29N8791M9472
11178A107279k6024L7909j2800r126P205K1467j6451M0972l1495r504K5442Q699
11166A143573J541j7949J3802L5273K5453K1656K8480k7836O381K8693j087j5050
11154A242930j4356J0221J2961J888K3544L6608l3189p1749m574O278J886r820
11142A202628M6430P9314Q0053j5698j977j0438L8503K5809K0061R630l917J045
11130A471443K9967M5365p862M806p5389k7479M1906m1248L1382J12288m9222
11119A535957k7190k4198L4018O5807j3835k6451Q0462P0481L0536k4391L272
$$ plain form
11203 971352 986535 986432 1012203 1018571 966193 940914 914940 923727 993414 1029745 1020647 1013839 963219
11190 963219 978307 1022831 1054844 1118372 1082452 1025071 993156 1011757 999245 999016 1057807 1107279
11178 1107279 1081255 1119164 1106364 1097238 1104443 1125910 1109459 1150431 1118936 1109432 1134874 1143573
11166 1143573 1145114 1127165 1140967 1176240 1201693 1223349 1251829 1223993 1230374 1259067 1257980 1242930
11154 1242930 1228574 1238795 1251756 1253644 1277188 1313796 1280607 1208858 1204284 1210562 1212448 1202628
11142 1202628 1249058 1328372 1408425 1392727 1390750 1380312 1418815 1444624 1464685 1474315 1470398 1471443
11130 1471443 1501410 1546775 1538913 1543719 1468330 1440851 1482757 1441509 1472891 1585179 1535957
11119 1535957 1508767 1484569 1518587 1584394 1570559 1544108 1624570 1695051 1725587 1701196 1704468
11108A704468J0201L6857l0048L4723O240M6563M0510M3170P434j02693o5209
11097A732216P5338J400p245M312J4390r243K152J7724K4765J2133j9826M8241
11085A896357J5817J9975J3688m9367K623P5748Q2554J7657k2354j3356M9574
11074B088916K1072M816n945k8910n6705L540Q1506J322R163J5784m106M655J5742
11061B150850M7806J8569P500L5561Q2806K6884o7281J7654L0784L6356L4247
11050B421736M4187J7306P762N562o42L8370J5725M5409j3007n0383K1453J0689
11038B564167j9360J8983N6607M4344M1932k8344J0466L2255L5441j4298P620
11027B749813N0477R2328L8520L5800L1244l7168l4256O9293K9557O7298o9583
$$ plain form
11108 1704468 1714669 1751526 1721478 1756201 1762441 1809004 1849514 1892684 1900118 1797425 1732216
11097 1732216 1807554 1808954 1801709 1806021 1820411 1811168 1813320 1831044 1855809 1867942 1848116 1896357
11085 1896357 1912174 1932149 1945837 1896470 1899093 1974841 2057395 2075052 2052698 2039342 2088916
11074 2088916 2109988 2114804 2108859 2079949 2023244 2026784 2108290 2109612 2118775 2134559 2130453 2135108 2150850
11061 2150850 2198656 2217225 2224725 2260286 2343092 2369976 2302695 2320349 2351133 2387489 2421736
11050 2421736 2465923 2483229 2490991 2496553 2495911 2534281 2550006 2595415 2582408 2532025 2553478 2564167
11038 2564167 2544807 2563790 2620397 2664741 2706673 2678329 2688795 2721050 2756491 2742193 2749813
11027 2749813 2800290 2892618 2931138 2966938 2998182 2961014 2926758 2996051 3025608 3092906 3023323
11016C023323K5684O2277M5704N0334N6681K5973L5822M143J4631K862p467R461
11004C349428K5588K8455J9220j0038J9200R9136O0910l3440l8312O0934N02M2208
10992C623791P2412L4025K4273L1255O6041P754L6748l965K9456P3525P4880P2015
10980D142210L1190N6582L5747L6192J0011M6503P6277R8867O4607M459K8576
10969D631221N4046L0983N2166L1354P2438J14697J25952J17550R0440O7142N6647
10958E444636O9710N1565O9508R3643Q6010J55342J47199J01968J16287Q7728
10948F423596J41440K17041J59529J11908J67174K36554K19860K48329K73835
10939H199266L02242L03344L24363L45895K11004O0473k93594p47982j099926
$$ plain form
11016 3023323 3049007 3111284 3156988 3207322 3264003 3289976 3325798 3329941 3344572 3347434 3339967 3349428
11004 3349428 3375016 3403471 3422691 3412653 3431853 3530989 3591899 3558459 3520147 3581081 3581583 3623791
10992 3623791 3696203 3730228 3754501 3785756 3851797 3859551 3896299 3892334 3921790 3995315 4070195 4142210
10980 4142210 4173400 4229982 4265729 4301921 4311932 4358435 4434712 4533579 4598186 4602645 4631221
10969 4631221 4685267 4716250 4768416 4799770 4872208 4986905 5112857 5230407 5320847 5387989 5444636
10958 5444636 5514346 5565911 5635419 5729062 5815072 5970414 6117613 6219581 6335868 6423596
10948 6423596 6565036 6782077 6941606 7053514 7220688 7457242 7677102 7925431 8199266
10939 8199266 8501508 8804852 9129215 9475110 9686114 9746587 9452993 8705011 7605085
10930G605085j131866r96091p26336l95436m8512J37996L04544M07877M05342
10921E562603L54830L71685L50793M17575M74428M81976N17948N31067N50858
10912I613763O02224P05318O68879N78911L27503j99431j052719j819777k539583
10903F885088k700420k338963j625084p22121K2414L82875N96155O72531P23623
10894A896098O22732N19627N52688N97017N39267N48056N16625N30476N46734
10885F869320O37483O74485O37165N05003M21872M5533m18950p91549j113316
10876G467046j094815p86898k64670K11169O69220R20152J105528J118912R59324
10867A0304968M65650j28812j038369k082968k757279k763584k143780j100213
$$ plain form
10930 7605085 6473219 5477128 4750792 4355356 4306844 4444840 4749384 5157261 5562603
10921 5562603 5917433 6289118 6639911 7057486 7531914 8013890 8531838 9062905 9613763
10912 9613763 10215987 10921305 11590184 12169095 12496598 12297167 11244448 9424671 6885088
10903 6885088 4184668 1845705 220621 -501500 -479086 -96211 499944 1172475 1896098
10894 1896098 2518830 3038457 3591145 4188162 4727429 5275485 5792110 6322586 6869320
10885 6869320 7506803 8181288 8818453 9323456 9745328 9790861 9371911 8580362 7467046
10876 7467046 6372231 5585333 5320663 5531832 6201052 7121204 8226732 9345644 10304968
10867 10304968 10770618 10641806 9603437 7520469 4763190 1999606 -144174 -1244387
10859a244387k80760L33312P29445Q73295R30287R20633R90686R26236Q67106
10850E045853R93942R76682R60922R74589J174062J280774J529429J672289J489571
10841A6098113J045841N0836j602142l663235n534128o417073n989549m492999
10833a0504336k508110o73034N19342J184083J380949J355752J335145J298400
10825f611809J157756J017869R77269R05180R51948R35743R29036J030353J108216
10816B401561R89549Q30789N24206j6842p89914j764801k587620k885355k492725
10807e791152j645108o99814O9490N97478R44011J184937J173309R72454O10885
10798b583510n8448p20882j275220j507077j303358q46376j56859L16285O13133
$$ plain form
10859 -1244387 -1525147 -1191835 -462390 410905 1341192 2261825 3252511 4178747 5045853
10850 5045853 6039795 7016477 7977399 8951988 10126050 11406824 12936253 14608542 16098113
10841 16098113 17143954 17194790 15592648 11929413 6395285 -21788 -6011337 -10504336
10833 -10504336 -13012446 -13685480 -13166138 -11982055 -10601106 -9245354 -7910209 -6611809
10825 -6611809 -5454053 -4436184 -3458915 -2553735 -1601787 -666044 262992 1293345 2401561
10816 2401561 3391110 4221899 4746105 4729263 3939349 2174548 -413072 -3298427 -5791152
10807 -5791152 -7436260 -8136074 -8066584 -7469106 -6525095 -5340158 -4166849 -3194395 -2583510
10798 -2583510 -2641958 -3362840 -4638060 -6145137 -7448495 -8294871 -8451730 -8135445 -7522312
10789g522312P37221P77779P53791P21361O20711O35438N97535O41496O65434
10780a371546P46529P45871P61685Q26395R13515R43719Q29589M60721l97483
10771D458995j436310k590222l403271l625640l045876j944662p90705J05945
10763a2271746O51532P69615Q11521P19995O84678O79191O50865O24435N81558
10754f098356N74405N08860N09838N17594N80712N26511M84390M02213J58867
10745a834966k84279q13083j357844j600838j530161j265392p07669k88714P1847
10736i611099K68220L37713M15520L39351L23693L51842K92094K56719K36263
10727f789684K17152J98727K16917J94873J59679J63994K22134J75491J57159
$$ plain form
10789 -7522312 -6785091 -6007312 -5253521 -4532160 -3911449 -3276011 -2678476 -2036980 -1371546
10780 -1371546 -625017 120854 882539 1708934 2622449 3566168 4395757 4856478 4458995
10771 4458995 3022685 432463 -2970808 -6596448 -9642324 -11586986 -12377691 -12271746
10763 -12271746 -11620214 -10850599 -10039078 -9319083 -8634405 -7955214 -7304349 -6679914 -6098356
10754 -6098356 -5523951 -5015091 -4505253 -3987659 -3406947 -2880436 -2396046 -1993833 -1834966
10745 -1834966 -2119245 -2932328 -4290172 -5891010 -7421171 -8686563 -9394232 -9682946 -9611099
10736 -9611099 -9342879 -9005166 -8589646 -8250295 -7926602 -7574760 -7282666 -7025947 -6789684
10727 -6789684 -6572532 -6373805 -6156888 -5962015 -5802336 -5638342 -5416208 -5240717 -5083558
10718e083558J73428J18981P1740J51531Q7498R2798O7432K0285N0495J02565
10708d146805Q5997O1395Q0887R3184J31304J1733M2810N5111N4448N5893J7745
10697c456298J04862R3583L9078N3511P0398Q0916O7086K9784N0312L2970P6014
10686b757784M3977j4874O6897P8013L6385R5133M0893j7283q76J15620L1777
10675b282122m2662N1484J35146M6514m8329n9073m892K3208P4318R5170N1009
10664a960229Q264j7976K7504K763M513P2770M1448O302j6179p791O4544O1610
10652a712457N3806J8926J8714O8725N7926j633l9829M844M4536N5896J6082l1875
10640a446339M4363q548l2382N2991N7163o734J0401N2678j407k8514O5801N2389
$$ plain form
10718 -5083558 -4910130 -4791149 -4719409 -4567878 -4480380 -4387582 -4320150 -4299865 -4249370 -4146805
10708 -4146805 -4060808 -3999413 -3918526 -3825342 -3694038 -3682305 -3639495 -3584384 -3529936 -3474043 -3456298
10697 -3456298 -3351436 -3257853 -3218775 -3165264 -3094866 -3013950 -2946864 -2917080 -2866768 -2833798 -2757784
10686 -2757784 -2713807 -2728681 -2661784 -2583771 -2547386 -2452253 -2411360 -2428643 -2429519 -2313899 -2282122
10675 -2282122 -2324784 -2273300 -2138154 -2091640 -2139969 -2199042 -2203934 -2180726 -2106408 -2011238 -1960229
10664 -1960229 -1951965 -1969941 -1942437 -1939674 -1935161 -1862391 -1820943 -1814641 -1830820 -1838611 -1774067 -1712457
10652 -1712457 -1658651 -1639725 -1621011 -1552286 -1494360 -1495993 -1535822 -1530978 -1486442 -1430546 -1414464 -1446339
10640 -1446339 -1401976 -1410524 -1442906 -1389915 -1332752 -1339486 -1329085 -1276407 -1277814 -1306328 -1240527 -1188138
10628a188138J3518K0562O996K5257M7007J1765L054P6558L869L7542L3869K1248
10616h86893j3914l044J3348J7418M1582k3811j5523N9922l135l2416L9162J4474
10604g92830K5036j2702L737K1933M7932o764M8540k4780l7766N8908N2969K41
10592f15546L199q264k1282M0555N6005N2525k1573k3289o696K9028N8237N1600
10580d05501K0719n2775j1968K1485q601L1797N6808O6751o376q5178o352N5539
10568c23652L0315q198R446K4657L5047J20208Q3465k2563r9495l9777k9225j8836
10556b38608J6861P0668j6610J2224K7584K0984N0844R2848J1284k3982L040K1730
10544D8867O1451L9918k9202m9215l77J2768K843N250K6511J0885K1770L4464
$$ plain form
10628 -1188138 -1174620 -1154058 -1147062 -1121805 -1074798 -1063033 -1059979 -983421 -979552 -942010 -908141 -886893
10616 -886893 -900807 -903851 -890503 -873085 -831503 -855314 -870837 -810915 -814050 -846466 -807304 -792830
10604 -792830 -767794 -780496 -776759 -754826 -706894 -713658 -665118 -689898 -727664 -668756 -615787 -615546
10592 -615546 -612347 -620611 -641893 -601338 -545333 -492808 -514381 -537670 -544366 -515338 -457101 -405501
10580 -405501 -384782 -437557 -449525 -428040 -436641 -404844 -348036 -281285 -287661 -372839 -379191 -323652
10568 -323652 -293337 -301535 -292089 -267432 -232385 -112177 -28712 -51275 -150770 -190547 -219772 -238608
10556 -238608 -221747 -151079 -167689 -155465 -127881 -106897 -56053 36795 48079 24097 27137 48867
10544 48867 110318 150236 121034 71819 71442 84210 87053 92303 118814 129699 151469 185933
10532A85933K1230R0286L3971o9894l7932j2371j8696K1251j3113J1687L7477
10521B49829N8585j7381K3713J2704p496p465J3878M3361J1995r100m378N1025
10509D19270K9743k3193J69P7261J4963n363q2828j220K020J378K4146J2740J1796
10496D80882J9857K2525K8149K6399N9667J5375l761J1371p528k5510j119J3076
10484F39383j9814R816L4006K3835O6115L7881L1104p773n1055L2150O2478L6654
10472H94780K2040m2928m9406K8267j6859q797o921r480K6794L042O0459P2025
10460I73016L7065k7647q37r561J7390P9843l4762p4407p708K5900O567N0800
10448A035659K1956K915k9065P787P4302O2871J572J4351q091k6790m272J5608
$$ plain form
10532 185933 207163 297449 331420 261526 223594 211223 192527 213778 200665 212352 249829
10521 249829 308414 291033 314746 327450 319954 312489 326367 369728 381723 372623 368245 419270
10509 419270 449013 425820 425989 503250 518213 512850 430022 428802 430822 432200 456346 469086 480882
10496 480882 500739 523264 551413 577812 637479 652854 649093 660464 652936 627426 626307 639383
10484 639383 619569 629385 663391 687226 753341 791222 822326 814553 763498 795648 858126 894780
10472 894780 916820 873892 824486 852753 835894 827097 820176 810696 837490 840532 900991 973016
10460 973016 1010081 982434 981597 972036 989426 1069269 1034507 960100 952392 978292 984859 1035659
10448 1035659 1057615 1060530 1031465 1039252 1113554 1176425 1177997 1192348 1184257 1157467 1153195 1168803
10436A168803J2969L7175M0324M3039N259J653J1224m2341o7024m2053J1247J994
10424A182269k498K1911K7868j3869j6021J6398k867O2349N3526M3523J8082Q45
10412A391516J4322k5008J0106l255k503N9255K0262N5537L2510k585j2514K1500
10400A559143j0348K808L3623J4142m3495L2116l0973j3105L2834K6809K0853
10389A624407J676m2906k9983K483J1033N9693N0971n4816k5440K7893r862j805
10377A613344L6342M0470J5978k255J5966N1229L7525j3363N1190Q7926j8455
10366A915897m6846L2894Q6483N8028L167r7626j41230l1718M2601K4543k3354
10355A822839N652L5704L9617O614K5172K6124J6128J7639J0162K2075J8258o0690
$$ plain form
10436 1168803 1181772 1218947 1259271 1302310 1307569 1309222 1320446 1278105 1211081 1169028 1180275 1182269
10424 1182269 1179771 1201682 1229550 1215681 1199660 1216058 1213191 1275540 1329066 1372589 1390671 1391516
10412 1391516 1405838 1380830 1390936 1387681 1385178 1444433 1464695 1520232 1552742 1550157 1537643 1559143
10400 1559143 1548795 1551603 1585226 1599368 1555873 1587989 1557016 1543911 1576745 1603554 1624407
10389 1624407 1626083 1583177 1553194 1555677 1566710 1626403 1677374 1622558 1597118 1625011 1615149 1613344
10377 1613344 1649686 1690156 1706134 1703879 1719845 1771074 1808599 1795236 1846426 1934352 1915897
10366 1915897 1869051 1901945 1988428 2046456 2049623 1951997 1810767 1779049 1821650 1846193 1822839
10355 1822839 1828491 1864195 1903812 1910426 1935598 1961722 1977850 1995489 2005651 2027726 2045984 1985294
10343A985294l3415K3728N4290J6682k5848J1915O4694J9490K1331o079k3055
10332B109027k2945q210k3215K5228P9292O3247J7765j344m5429l1910J7596L9167
10320B218269O2380k1846p937K0574J8927R108J759J7682O2105m28J4960N819
10308B401372l8063Q696J0676o8125K3180L3116J1761P6784N5140M9692k0271
10297B543958J337j8714M6937L9655r93o9417K1539Q8039J4985k5567j8045p855
10285B615859m9808l2175Q6739O2385M3204J4227j1236k4950K0260n241q571R4667
10273B805360K0630n837L555J8312J4395J035J9352J4968o0478m4275M2384M7599
10261B877000J3099M5365n870j798Q3321K7719R54Q605k4674k3247l4919K4074
$$ plain form
10343 1985294 1951879 1975607 2029897 2046579 2020731 2032646 2097340 2116830 2138161 2132082 2109027
10332 2109027 2086082 2077872 2054657 2079885 2159177 2222424 2240189 2238845 2193416 2161506 2179102 2218269
10320 2218269 2280649 2258803 2250866 2271440 2290367 2299475 2301234 2318916 2381021 2380593 2395553 2401372
10308 2401372 2363309 2372005 2382681 2314556 2337736 2370852 2382613 2459397 2514537 2564229 2543958
10297 2543958 2545295 2526581 2573518 2613173 2612180 2542763 2564302 2652341 2667326 2641759 2623714 2615859
10285 2615859 2566051 2533876 2620615 2683000 2726204 2740431 2729195 2704245 2724505 2719264 2710693 2805360
10273 2805360 2825990 2820153 2823708 2842020 2856415 2857450 2876802 2891770 2831292 2787017 2829401 2877000
10261 2877000 2890099 2935464 2929594 2927796 3011117 3038836 3039790 3048395 3023721 3000474 2965555 2989629
10249B989629N61k4236o666K5206L0296L7120K1873J6772O974L9315P3203k1419
10237C188628o0894L788N5085O7324J457N97J1542j8404K1670o768O0841N0917
10225C375783K6267j0986K2177j1210m6264j4544N520N2760K1594o395N7351J0645
10213C482698j5436L7873M2313J1444R542M5373M3028j2883m4022N8122N7513
10202C715565N0263n6324K0899M9335J4459K7696l3471l9863K6976N4378M9755
10191C879668l208k312J5845Q4217J3048M2167O1880l7547K3098Q238J5817P1010
10179D171921K8023O645J7242l5752J3250j3319K9097J3689L0380M5097K8982
10168D335255L0881M2123K2875k4068J9575J171J8646O1681M4298k4348j2342
$$ plain form
10249 2989629 2990190 2965954 2959288 2984494 3014790 3051910 3073783 3090555 3097529 3136844 3210047 3188628
10237 3188628 3127734 3131522 3186607 3253931 3255388 3255985 3267527 3249123 3270793 3264025 3324866 3375783
10225 3375783 3402050 3391064 3413241 3402031 3355767 3341223 3346743 3399503 3421097 3414702 3472053 3482698
10213 3482698 3467262 3505135 3547448 3558892 3568434 3613807 3656835 3643952 3599930 3658052 3715565
10202 3715565 3765828 3709504 3730403 3779738 3794197 3821893 3788422 3748559 3775535 3829913 3879668
10191 3879668 3876460 3874148 3889993 3974210 3987258 4029425 4091305 4053758 4076856 4085094 4100911 4171921
10179 4171921 4199944 4206589 4223831 4188079 4201329 4188010 4217107 4230796 4261176 4306273 4335255
10168 4335255 4366136 4408259 4431134 4407066 4426641 4427812 4446458 4508139 4552437 4528089 4515747
10157D515747L4764K8640o462L1003l674j3425J12795N8955J4706K9789J7281
10146D820119O7834O0647l461N663M394m1694M1635J29853L9842J6641L4397j6857
10134E159013L4120n051n444J4643K2315o227O4320J4347j714L1586R8611L7465
10122E457984L7017p039j2298J9118O0202L8229K9100K7263J7131L1420M7094
10111E745221M2929M3885L4233J1013L106K2518O8648P9352M0687j7124J6136
10100F090604L6297N9625P1637K4680J1054k8573m0009L640M5713M2838P4110
10089F391616J01147Q1384N1881K275N1996O4594O2085K3632R927N3418q223N5591
10077F941323J2038M3591R8882N9784K0240K9872R4623R6136O3198Q67k3709J9289
$$ plain form
10157 4515747 4550511 4579151 4572689 4603692 4600018 4586593 4699388 4758343 4773049 4802838 4820119
10146 4820119 4887953 4948600 4945139 4950802 4955196 4913502 4955137 5084990 5124832 5141473 5175870 5159013
10134 5159013 5193133 5188082 5182638 5197281 5219596 5213369 5277689 5292036 5290322 5321908 5420519 5457984
10122 5457984 5495001 5487962 5475664 5494782 5554984 5593213 5622313 5649576 5666707 5698127 5745221
10111 5745221 5788150 5832035 5866268 5877281 5880387 5902905 5971553 6050905 6091592 6074468 6090604
10100 6090604 6126901 6186526 6258163 6282843 6293897 6265324 6225315 6228955 6274668 6317506 6391616
10089 6391616 6492763 6574147 6626028 6628303 6680299 6744893 6806978 6830610 6840537 6893955 6885732 6941323
10077 6941323 6953361 6996952 7095834 7155618 7175858 7205730 7300353 7396489 7459687 7460554 7436845 7456134
10065G456134r143P0424Q4246J14363O6504k1398L5402K5550K2213R5194J46560
10054H086049J02960M2131Q9160Q3126J46666Q2024P3890R9505J28971J53817
10044I088299J59951J29533j17757o49618m36892O4056R9505J84859J69262K13564
10034H904762J25378J02519J44199P2057P8393O6286J10442J34755J13810J31470
10024I984071J10640J03020J03324Q1084J61324J48039Q8390R3232J80103K42158
10014A1295385J68885J66945J65363J13859J69241J55441J41345J31582J38622
10005A2646668J42676J89797K92679J59733K01089K29971L00915K90661J82723
9996A4636912J58726K82230L79412L49865L01424L65954M13936M54953N48758
$$ plain form
10065 7456134 7446991 7517415 7601661 7716024 7782528 7761130 7796532 7822082 7844295 7939489 8086049
10054 8086049 8189009 8231140 8320300 8403426 8550092 8632116 8706006 8805511 8934482 9088299
10044 9088299 9248250 9377783 9260026 8610408 8173516 8237572 8337077 8521936 8691198 8904762
10034 8904762 9030140 9132659 9276858 9348915 9427308 9493594 9604036 9738791 9852601 9984071
10024 9984071 10094711 10197731 10301055 10382139 10543463 10691502 10779892 10873124 11053227 11295385
10014 11295385 11464270 11631215 11796578 11910437 12079678 12235119 12376464 12508046 12646668
10005 12646668 12789344 12979141 13271820 13431553 13632642 13862613 14163528 14454189 14636912
9996 14636912 14795638 15077868 15457280 15807145 16108569 16474523 16888459 17343412 17892170
9987A7892170M75552L95230L54435K14274J22259j22118k72943l54725l78117
9978A8326017k84592k29081r1792j23383j63030k91519k72925j04682J41363M83454
9968A7389830P85271Q83173Q48010Q12971O02047K88027J49815O3787j6382r7924
9958B1708625j47791m25911j003317j539841k021581k126936j869632j439107
9950A1134509q31052l75065k21195k64705l82596m50030j87499L16233Q46431
9941I585031J048802J152079J023111N31383K88m52458o87282q10294q35852p95213
9931I759595p09629o70746r37224j318176j682835j809420j451390j044010m34506
9922b98341J06187M42434N63400M97669N11192O01509P54974R38388J036456J014070
$$ plain form
9987 17892170 18367722 18762952 19117387 19331661 19453920 19331802 19058859 18704134 18326017
9978 18326017 18041425 17812344 17720552 17597169 17434139 17142620 16869695 16765013 16906376 17389830
9968 17389830 18175101 19058274 19906284 20719255 21321302 21609329 21759144 21822931 21806549 21708625
9958 21708625 21560834 21134923 20131606 18591765 16570184 14443248 12573616 11134509
9950 11134509 10303457 9928392 9707197 9442492 9059896 8609866 8422367 8738600 9585031
9941 9585031 10633833 11785912 12809023 13340406 13340694 12888236 12200954 11390660 10554808 9759595
9931 9759595 9049966 8379220 7441996 6123820 4440985 2631565 1180175 136165 -298341
9922 -298341 -192154 250280 813680 1311349 1822541 2424050 3179024 4117412 5153868 6167938
9912F167938Q77007N79139L28724J35015J4766O7015K02120K94378M45548N88910
9902I700560O91276O68258L50249j94630o30396o86551m27616J35643M94559N16200
9892A0617552K33425L746k56924l85674n30510o37311m55506j8744M87159Q94692
9882I951905J287671J438024J333843R98788O85046N56469O39937P29223O54184
9873A8275090K32369p67573j740299k366684k716710k840680k620223k009432
9865C445858j310128j102383j278027j537451j598280j405390r81742j63243N53643
9856e377143J131642J515107J592839J126720L89548k93077n38563l63192j76925
9847i93044j44417l96396r99624j798191k766734l896273m581699l869208k186832
$$ plain form
9912 6167938 7044945 7624084 7952808 8087823 8102589 8169604 8371724 8666102 9111650 9700560
9902 9700560 10391836 11060094 11410343 11215713 10585317 9898766 9471150 9606793 10101352 10617552
9892 10617552 10850977 10854723 10597799 10212125 9681615 9044304 8588798 8570054 9057213 9951905
9882 9951905 11239576 12677600 14011443 15010231 15695277 16251746 16891683 17620906 18275090
9873 18275090 18507459 17739886 15999587 13632903 10916193 8075513 5455290 3445858
9865 3445858 2135730 1033347 -244680 -1782131 -3380411 -4785801 -5767543 -5930786 -5377143
9856 -5377143 -4245501 -2730394 -1137555 -10835 378713 85636 -452927 -816119 -993044
9847 -993044 -1137461 -1533857 -2533481 -4331672 -7098406 -10994679 -15576378 -19445586 -21632418
9838b1632418p74589o2796N9006m9124q447J43073N25810O84882Q49935J101538
9828a9163130J317374J162929P61853L08655p358k45639k74048j37657N2623o7998
9818a6292396k92178m67196n86246n72076m91741l79811q1345K30056M44592O02128
9808a7886213O69203P58893O82818N70199N75323M73692M99066N18385M44629
9799a2694005M42928M39297L63158L33292L15725L18339L76552L50085K50697
9790i503932K75008K93284K67626K34818K28547K14192K61450K09701J97863J77832
9780g143611K09070K55034J56991J90825J77452J90833J54434J70969J40358J71403
9770e326242J12380J85426J43425O0509J03825J53912J47352J87414J77345J34509
$$ plain form
9838 -21632418 -22407007 -22469803 -22410797 -22459921 -22468368 -22325295 -21799485 -21114603 -20264668 -19163130
9828 -19163130 -17845756 -16682827 -15920974 -15612319 -15619677 -15865316 -16139364 -16277021 -16224398 -16292396
9818 -16292396 -16584574 -17051770 -17638016 -18210092 -18701833 -19081644 -19162989 -18932933 -18488341 -17886213
9808 -17886213 -17217010 -16458117 -15775299 -15205100 -14629777 -14156085 -13657019 -13138634 -12694005
9799 -12694005 -12251077 -11811780 -11448622 -11115330 -10799605 -10481266 -10104714 -9754629 -9503932
9790 -9503932 -9228924 -8935640 -8668014 -8433196 -8204649 -7990457 -7729007 -7519306 -7321443 -7143611
9780 -7143611 -6934541 -6679507 -6522516 -6331691 -6154239 -5963406 -5808972 -5638003 -5497645 -5326242
9770 -5326242 -5213862 -5028436 -4885011 -4824502 -4720677 -4566765 -4419413 -4231999 -4054654 -3920145
9760c920145R8924J99676J29476J03188R9086Q4066R7316J56759J51471J01581
9750b698602J09556J16086J04034O6273J02537J22373J49667J33823N7734N1529
9740a684990J09385M8726J17699J11795N1361R2362J49078J11847M4677P4042
9730g74018J62288Q9722Q7730J10600P6830J03920J03765J04511J68374R7026
9720C30748P5771J32561J44498Q6850J04795O2714R7258R7185P6270J26683J33011
9709A468344J40584O0581M2115J17299J74733J94702J50449J48477J40200P9096
9699B716580J24123J06505J66013J56048J41390J65963J53059J55818K03173J75126
9689D263798K17300J60784K41465J88611J88678K29107K34828K07269K90719K66792
$$ plain form
9760 -3920145 -3821221 -3621545 -3492069 -3388881 -3289795 -3205729 -3108413 -2951654 -2800183 -2698602
9750 -2698602 -2589046 -2472960 -2368926 -2302653 -2200116 -2077743 -1928076 -1794253 -1736519 -1684990
9740 -1684990 -1575605 -1526879 -1409180 -1297385 -1246024 -1153662 -1004584 -892737 -848060 -774018
9730 -774018 -611730 -522008 -434278 -323678 -246848 -142928 -39163 65348 233722 330748
9720 330748 406519 539080 683578 770428 875223 937937 1035195 1132380 1208650 1335333 1468344
9709 1468344 1608928 1669509 1711624 1828923 2003656 2198358 2348807 2497284 2637484 2716580
9699 2716580 2840703 2947208 3113221 3269269 3410659 3576622 3729681 3885499 4088672 4263798
9689 4263798 4481098 4641882 4883347 5071958 5260636 5489743 5724571 5931840 6222559 6489351
9679F489351K22588K68094K70665K48465L36684L62604L88384M64907N11736M74462
9669A0037940N39405N74355O32387O11179O53277O15733O26437O05788M48202
9660A5344703K1260p58876j780711k903646l361675k911843k017821j175111o30143
9651a73863k42705J53010N14181O75816Q03831R09273R90023R81960R57736R89026
9641F558288J020381R48769Q98837P40705N65439J83454l42467j072214k051601
9632G449591l082782l251933k487650j355465m64387j22183k0558N8697J59998
9623c116672L79081N48872O12744P00620Q05036P86389P91275P92882O85864O69621
9613C655712O07733O28535O65698O61368O73167N99828O99714Q11872Q57816Q73022
$$ plain form
9679 6489351 6711939 6980033 7250698 7499163 7835847 8198451 8586835 9051742 9563478 10037940
9669 10037940 10577345 11151700 11784087 12395266 13048543 13664276 14290713 14896501 15344703
9660 15344703 15365963 14607087 12826376 9922730 6561055 3649212 1631391 456280 -173863
9651 -173863 -416568 -263558 250623 926439 1730270 2639543 3629566 4611526 5569262 6558288
9641 6558288 7578669 8527438 9426275 10166980 10732419 10915873 10573406 9501192 7449591
9632 7449591 4366809 1114876 -1372774 -2728239 -3192626 -3314809 -3335367 -3276670 -3116672
9623 -3116672 -2737591 -2188719 -1575975 -875355 -70319 716070 1507345 2300227 2986091 3655712
9613 3655712 4263445 4891980 5557678 6219046 6892213 7492041 8191755 9003627 9861443 10734465
9603A0734465Q36024R32272J026405J071013J202134J235335J250239J233861
9595A9521748J205232J010614P54458K48897p16041k086643l440044m471428m706853
9586G319940m094205k810000j598732p50302j59959K87789O76563J079213J464570
9577A414877J610620J624020J703198J622094J383206Q73183J83537o15274j013269
9568H786192r92778j119457j804584k780806l652082m081635m164774l807357
9560a3617281k741975j418521m43085K00577P30764R57951J038016J213097J277303
9551a2803154J079738P88093N92443M23787K26904j75208p89231j081246q60169
9542a2598043k36400K85300O43370Q13930Q59247R86772R39127R89827J037431
$$ plain form
9603 10734465 11570489 12502761 13529166 14600179 15802313 17037648 18287887 19521748
9595 19521748 20726980 21737594 22492052 22740949 22024908 19938265 16498221 12026793 7319940
9586 7319940 3225735 415735 -1182997 -1933299 -2093258 -1805469 -1128906 -49693 1414877
9577 1414877 3025497 4649517 6352715 7974809 9358015 10231198 10414735 9799461 8786192
9568 8786192 7793414 6673957 4869373 2088567 -1563515 -5645150 -9809924 -13617281
9560 -13617281 -16359256 -17777777 -18220862 -18020285 -17289521 -16331570 -15293554 -14080457 -12803154
9551 -12803154 -11723416 -10935323 -10342880 -9919093 -9692189 -9867397 -10656628 -11737874 -12598043
9542 -12598043 -12834443 -12549143 -11905773 -11091843 -10232596 -9245824 -8306697 -7316870 -6279439
9533f279439J046508R79260J041276J093478J018198R95077R85072R87190R97991
9524B864611Q50193N76249J05640o63800j444510j960380j767726j065692n05307
9515c010722k56707N4970M90144P99128R72028J075515J112750J018924R94525
9506C250555P72082L36245k86526j117913j906998k300579k367032k086312j605172
9497g311650j309152j283146j725749k245953k141269j329953k99578M62282Q94230
9488a6289938J145178J176389J170203J189975J138446Q60568M46053J89462o7926
9479i041590n14947j352075k394429k983039k770454k138565j227786l88632K09070
9470b2602447N56876P30876P75645Q96466Q86298P68480O90760P53078P74686
$$ plain form
9533 -6279439 -5232931 -4253671 -3212395 -2118917 -1100719 -105642 879430 1866620 2864611
9524 2864611 3714804 4291053 4396693 3732893 2288383 328003 -1439723 -2505415 -3010722
9515 -3010722 -3267429 -3212459 -2722315 -1923187 -951159 124356 1237106 2256030 3250555
9506 3250555 4022637 4358882 4072356 2954443 1047445 -1253134 -3620166 -5706478 -7311650
9497 -7311650 -8620802 -9903948 -11629697 -13875650 -16016919 -17346872 -17646450 -17184168 -16289938
9488 -16289938 -15144760 -13968371 -12798168 -11608193 -10469747 -9609179 -9163126 -8973664 -9041590
9479 -9041590 -9556537 -10908612 -13303041 -16286080 -19056534 -21195099 -22422885 -22811517 -22602447
9470 -22602447 -22045571 -21314695 -20539050 -19642584 -18756286 -17987806 -17297046 -16543968 -15769282
9461a5769282O98159O33032M84784M75606N32631M96265M60906M60468M56485
9452a1070946M47700M40454M32995L95448M51302N02978N11673M35264N02752
9443f950380N54776N32032M52267L37603K86117K00770J21090L1414j61285n95530
9433e191126j194886j781725j815844j291739o02015k09508J46638K38361L91142
9424a1310702N22445N81851O17512O32694N92099N98381O24296N62565N35198
9415f043661N12053L56407K09307K3842j82504n70773j004830j485977j770678
9406i956814j677016j127963m61312L621K36965K45368J92491K81615K84905K52743
9396a1725397K28831K00908J16232J85528J60724Q4628K7131k5949N015m4843
$$ plain form
9461 -15769282 -15071123 -14438091 -13953307 -13477701 -12945070 -12448805 -11987899 -11527431 -11070946
9452 -11070946 -10623246 -10182792 -9749797 -9354349 -8903047 -8400069 -7888396 -7453132 -6950380
9443 -6950380 -6395604 -5863572 -5411305 -5073702 -4787585 -4586815 -4465725 -4434311 -4595596 -5191126
9433 -5191126 -6386012 -8167737 -9983581 -11275320 -11877335 -12086843 -11940205 -11701844 -11310702
9424 -11310702 -10788257 -10206406 -9588894 -8956200 -8364101 -7765720 -7141424 -6578859 -6043661
9415 -6043661 -5531608 -5175201 -4965894 -4942052 -5124556 -5695329 -6700159 -8186136 -9956814
9406 -9956814 -11633830 -12761793 -13223105 -13219484 -12982519 -12737151 -12544660 -12263045 -11978140 -11725397
9396 -11725397 -11496566 -11295658 -11179426 -10993898 -10833174 -10748546 -10721415 -10747364 -10742349 -10787192
9386a0787192j0517K3179k6820l2267J8201k2499k5976L9274K8667J75m5802J7177
9374a0824400k0157M4864O1682K3959q449P8798J35507O0790L1721M2525R8620
9363a0274540J00450Q7593Q9608Q0720O2741J06091Q3311R6363J8766M6621J80070
9352i322206R7091Q8213M6011M5565J09419N7975M1633N3757R2392Q5636L3647
9341h570867J09667J41592M071L5029Q1029L9041O2251N9875N1497M3949M3548
9330g899318O7113O6673Q1154P6830J13912P8857j4067N87N7256N3923J10145
9319g206935J08594k0511k3177O0202L7644N4377P1028P6870K6915O560R2775
9308f715658j4776J3547N4000O3404M0380O1916M6922K6810N5316L8022l6444
$$ plain form
9386 -10787192 -10797709 -10774530 -10801350 -10833617 -10815416 -10837915 -10863891 -10824617 -10795950 -10795775 -10841577 -10824400
9374 -10824400 -10844557 -10799693 -10738011 -10714052 -10722501 -10643703 -10508196 -10447406 -10415685 -10373160 -10274540
9363 -10274540 -10174090 -10086497 -9996889 -9916169 -9853428 -9747337 -9664026 -9567663 -9548897 -9502276 -9322206
9352 -9322206 -9225115 -9136902 -9090891 -9045326 -8935907 -8877932 -8836299 -8782542 -8690150 -8604514 -8570867
9341 -8570867 -8461200 -8319608 -8315537 -8280508 -8199479 -8160438 -8098187 -8038312 -7986815 -7942866 -7899318
9330 -7899318 -7832205 -7765532 -7684378 -7607548 -7493636 -7414779 -7428846 -7428259 -7371003 -7317080 -7206935
9319 -7206935 -7098341 -7118852 -7142029 -7081827 -7044183 -6989806 -6918778 -6841908 -6814993 -6808433 -6715658
9308 -6715658 -6730434 -6716887 -6662887 -6599483 -6559103 -6497187 -6450265 -6423455 -6368139 -6330117 -6366561
9297f366561J5882M8805J00328N7427P6101O0013K1186j023l4677P0117R3172
9286e859230N6291K6783J1530P224N0121L2914R466R0325P8317o527k4942J1857
9274e515871K3254J5983K9771O1560P3622J01190N6530J4075J5917k6275j9065
9263e169309N1195P9577L8501l3939m0307P4459M5474K4789m1781N3623Q9257
9252d828461K9485p326n322M3097O5788Q0199O1138K3773J6279L7075N3536k1703
9240d452442J900l4083j9548J8293L4439J8784k6642L293L4876K0935L5783J2568
9228d351844n45J223K9327L3091N8883J775M9657N9253N5939m4039q4130M5583
9216d145827R0004O4679J2768k7198m3837k2399J9655P3780M7511l1578J5591
$$ plain form
9297 -6366561 -6350679 -6301874 -6201546 -6144119 -6068018 -6008005 -5986819 -5987842 -6022519 -5952402 -5859230
9286 -5859230 -5802939 -5776156 -5764626 -5757402 -5707281 -5674367 -5664901 -5574576 -5496259 -5502786 -5527728 -5515871
9274 -5515871 -5492617 -5476634 -5446863 -5385303 -5311681 -5210491 -5153961 -5139886 -5123969 -5150244 -5169309
9263 -5169309 -5118114 -5038537 -5000036 -5033975 -5074282 -4999823 -4954349 -4929560 -4971341 -4917718 -4828461
9252 -4828461 -4798976 -4806302 -4811624 -4768527 -4702739 -4622540 -4561402 -4537629 -4521350 -4484275 -4430739 -4452442
9240 -4452442 -4450542 -4484625 -4504173 -4485880 -4451441 -4432657 -4459299 -4456006 -4421130 -4400195 -4364412 -4351844
9228 -4351844 -4352389 -4351166 -4321839 -4288748 -4229865 -4228090 -4178433 -4119180 -4063241 -4107280 -4191410 -4145827
9216 -4145827 -4055823 -3991144 -3978376 -4005574 -4049411 -4071810 -4052155 -3978375 -3930864 -3962442 -3946851
9205c946851P1863M2604q652r2140k403O2516P1656J22096L5523l0895K0719K2539
9193c631425M675M348K3013L6125k7745o861M7633L0168n8982P5710M8000O3560
9181c391781m7686j7152N7829J17261L2436L0883L1462J2061j6015L0170M2660
9170c117872N3167K8998m7071o7532K7528l114J5115j7701N9378J1177M8622P9346
9158b929959p759n2280L6706Q7205M0530l6791n4434n0792L6429P4608k4245l0780
9146b911562Q1947m3442k6163l1355j472O9824L9339J2647M8498K2207N288J8421
9134b715823M5387k0821L76K7898L5793k9475K4969J6014j3815L474O0234J5576
9122b550213j2401l1581R904N7556L2335N6579L4255O381K2164P8121M9612k7245
$$ plain form
9205 -3946851 -3874988 -3832384 -3841036 -3933176 -3935579 -3873063 -3801407 -3679311 -3643788 -3674683 -3653964 -3631425
9193 -3631425 -3626750 -3622402 -3599389 -3563264 -3591009 -3597870 -3550237 -3520069 -3579051 -3503341 -3455341 -3391781
9181 -3391781 -3439467 -3456619 -3398790 -3281529 -3249093 -3218210 -3186748 -3174687 -3190702 -3160532 -3117872
9170 -3117872 -3064705 -3035707 -3082778 -3150310 -3122782 -3125896 -3110781 -3128482 -3069104 -3057927 -3009305 -2929959
9158 -2929959 -2937718 -2989998 -2953292 -2866087 -2825557 -2862348 -2916782 -2967574 -2931145 -2856537 -2880782 -2911562
9146 -2911562 -2829615 -2873057 -2899220 -2930575 -2932047 -2862223 -2822884 -2810237 -2761739 -2739532 -2734244 -2715823
9134 -2715823 -2670436 -2691257 -2690881 -2662983 -2627190 -2656665 -2631696 -2615682 -2629497 -2626023 -2565789 -2550213
9122 -2550213 -2562614 -2594195 -2584291 -2526735 -2494400 -2437821 -2403566 -2397185 -2375021 -2296900 -2247288 -2274533
9110b274533m2365L8325J2780K9998q10O7773J4432L1592l7139P651J0228k973
9098b145041O0762P6163k979j2048M0173P2468l0801Q233P7449N9267k4535J1852
9086a809037O935O323j743N2365k9829l404M5452p9403j0317N495M4620J0108
9074a762435O8071J5325N023j5361Q9995J45425J28798q9l6932L3285M1929L2114
9062a254852P5270J07602M9244n255j37680l49494k94338j31532l3895J08901
9052a866029J10109J00300R065L0353K9107M1297Q6950J5259K2356N9892O2602
9041a298739J1386l192N0261k478L0609M2761Q6796J4430j6255o240J2020K7651
9029a050990J5362R7510R9149K3334k3976L2312J23066R2419M9532O1418J3303
$$ plain form
9110 -2274533 -2316898 -2278573 -2265793 -2235795 -2236605 -2168832 -2154400 -2122808 -2159947 -2152296 -2142068 -2145041
9098 -2145041 -2084279 -2008116 -2011095 -2023143 -1982970 -1910502 -1941303 -1933070 -1855621 -1796354 -1820889 -1809037
9086 -1809037 -1802102 -1795779 -1797522 -1745157 -1774986 -1778390 -1732938 -1812341 -1822658 -1817163 -1772543 -1762435
9074 -1762435 -1694364 -1679039 -1674016 -1689377 -1599382 -1453957 -1325159 -1325248 -1362180 -1328895 -1286966 -1254852
9062 -1254852 -1179582 -1071980 -1022736 -1027991 -1165671 -1515165 -1809503 -1941035 -1974930 -1866029
9052 -1866029 -1755920 -1655620 -1646555 -1616202 -1587095 -1545798 -1458848 -1443589 -1421233 -1361341 -1298739
9041 -1298739 -1287353 -1290545 -1240284 -1242762 -1212153 -1169392 -1082596 -1068166 -1084421 -1090661 -1078641 -1050990
9029 -1050990 -1035628 -938118 -838969 -815635 -839611 -807299 -684233 -591814 -542282 -480864 -467561
9018d67561K9681J43403J25134J06364M969j37672n75805o75489l19231J7815
9008a748392J14614J34731J16193P9817J23774P4852K6733Q363L057N6576N1424
8997i58258N3400P1074O1156J9757R021N9605M1394j4408l6600k0289Q9522M6485
8985e78141L1743L1013N8984J6824K2680L2328M3686M6121L3384M5650L2237M3433
8973a40058M6932M9537J08759R5085J7577o1787k27509l34097k16222j7330N7476
8962f21637Q2428R8258J37979Q8647L7813J01397M7885p8443j6304o547Q3139
8951d5385N6936L3841J866N4568M3969k4135m6867o283P007M3288J16726M8513
8939B84044l3704m479L5967J14683J2490k5470L7887L3044k4490O1007O3117J5087
$$ plain form
9018 -467561 -437880 -294477 -169343 -62979 -58010 -195682 -771487 -1446976 -1766207 -1748392
9008 -1748392 -1633778 -1499047 -1382854 -1303037 -1179263 -1104411 -1077678 -1069315 -1066258 -1009682 -958258
8997 -958258 -904858 -833784 -772628 -752871 -743850 -684245 -642851 -657259 -693859 -714148 -624626 -578141
8985 -578141 -546398 -515385 -456401 -439577 -416897 -384569 -340883 -294762 -261378 -215728 -183491 -140058
8973 -140058 -93126 -43589 65170 160255 177832 116045 -111464 -445561 -661783 -679113 -621637
8962 -621637 -539209 -440951 -302972 -214325 -176512 -75115 -27230 -105673 -121977 -128524 -45385
8951 -45385 11551 45392 47258 101826 145795 121660 74793 68510 75517 118805 235531 284044
8939 284044 250340 245861 281828 396511 409001 383531 421418 454462 429972 490979 554096 569183
8927E69183M8654k0677L8424j1989J3458J0823m176K7979J7868K6237R5321O4618
8915H75723P7427O5115L153J7679j8613j7464j4331j5440q361O9887j7316N4917
8903A072376K8499P1436M1909m9960k1786M4355M6220J1199K6211N6811R6684
8892A423954P9823J4500l4962O422j74P7097M892l9695J3804P0564Q8777N8319
8880A763321j3696K6618K9665K276L21M0878P5412o707j5835L3334Q8762R5099
8868B119448P8120N4716p8393j24155o7293K7340M6049l484J1045N9441J18762
8857B241596J7629L1582Q6528M0203P0301J19245k9692l5833K8555L7325N0465
8846B657904P7788L1548K5032J07727Q7391K7524M556L5872K6387m337N8029L4144
$$ plain form
8927 569183 617837 597160 635584 623595 637053 647876 643700 671679 689547 715784 811105 875723
8915 875723 953150 1018265 1021418 1039097 1020484 1003020 988689 973249 964888 1034775 1017459 1072376
8903 1072376 1100875 1172311 1214220 1164260 1142474 1186829 1233049 1244248 1270459 1327270 1423954
8892 1423954 1503777 1518277 1483315 1489737 1489563 1566660 1571552 1531857 1545661 1616225 1705002 1763321
8880 1763321 1749625 1776243 1805908 1808184 1808505 1849383 1924795 1918088 1902253 1935587 2024349 2119448
8868 2119448 2197568 2252284 2173891 2049736 1982443 2009783 2055832 2052348 2063393 2122834 2241596
8857 2241596 2259225 2290807 2377335 2417538 2487839 2607084 2577392 2541559 2570114 2607439 2657904
8846 2657904 2735692 2767240 2792272 2899999 2987390 3014914 3019470 3055342 3081729 3077392 3135421 3169565
8834C169565J7164j4332M6340N5287N5623N3729M9956O7023k4848O1817K6042
8823C563366M1653L4803N0690p3476p8063P9934M4400J36017N9420N72M3813L9867
8811C942996J05737Q6653M4711P0071J5625j1594L8541J36312O1023K9399l1175
8800D488299N6472J33274L6404K2398P2072R2361R8791O4591O0693L9229M4012
8789E208596J7133M7639M3149O3389J57022P5236L6524L0341K1633k6121O1846
8778E736387O0859Q6728Q7346Q8591J20975P8647J9623L4728O3817M4930M8937
8767F471568P7337J04905J25721J26176O9092J29311L2946J28487J45554Q6096
8757G497193M4226J6573R966J25571J47975O3377J55126J07481P5887J39663R0927
$$ plain form
8834 3169565 3186729 3172397 3218737 3274024 3329647 3383376 3433332 3500355 3475507 3537324 3563366
8823 3563366 3605019 3639822 3690512 3617036 3538973 3618907 3663307 3799324 3858744 3859316 3903129 3942996
8811 3942996 4048733 4135386 4180097 4250168 4265793 4254199 4292740 4429052 4490075 4519474 4488299
8800 4488299 4544771 4678045 4714449 4736847 4808919 4901280 5000071 5064662 5125355 5164584 5208596
8789 5208596 5225729 5273368 5316517 5379906 5536928 5612164 5648688 5679029 5700662 5674541 5736387
8778 5736387 5797246 5883974 5971320 6059911 6180886 6259533 6279156 6313884 6377701 6422631 6471568
8767 6471568 6548905 6653810 6779531 6905707 6974799 7104110 7137056 7265543 7411097 7497193
8757 7497193 7541419 7557992 7567958 7693529 7841504 7904881 8060007 8167488 8243375 8383038 8473965
8746H473965P0851J04753J13322Q5001R7065K28576J99501J19996M0870J36722
8736I670622J32503J39766J34868J16957P6896J16518J37565J15280J68408J56906
8726A0966289J55919J29347J40401J79962K67264J87544J09942K18698K27475
8717A2582841J34804K54199K63629K33452K04801J89816K22782J89656K63318
8708A4539298K94696L04544K78692K06879K43222K27103K91833L24406M01955
8699A7112628L86930L09380L26334M30401M46450M20904M22917N21848M42396
8690B0820188M87447N64625O16463N76848O02896N93673O78296P87047Q29846
8681B6557329Q65639R20700R70757J119201J276281J327509J361254J528340J633780
$$ plain form
8746 8473965 8544816 8649569 8762891 8847892 8944957 9173533 9373034 9493030 9533900 9670622
8736 9670622 9803125 9942891 10077759 10194716 10271612 10388130 10525695 10640975 10809383 10966289
8726 10966289 11122208 11251555 11391956 11571918 11839182 12026726 12136668 12355366 12582841
8717 12582841 12717645 12971844 13235473 13468925 13673726 13863542 14086324 14275980 14539298
8708 14539298 14833994 15138538 15417230 15624109 15867331 16094434 16386267 16710673 17112628
8699 17112628 17499558 17808938 18135272 18565673 19012123 19433027 19855944 20377792 20820188
8690 20820188 21307635 21872260 22488723 23065571 23668467 24262140 24940436 25727483 26557329
8681 26557329 27422968 28343668 29314425 30433626 31709907 33037416 34398670 35927010 37560790
8672C7560790J779969J871999K046225K618400L334990M070646M806639N709242
8664F3798900O967724Q571703J0124984J0600190O111806j2315802m9225977o6948146
8656b2314618l6825922m415462P672402R508330Q659512P360308O178967N190159
8648a8986324M344797L810485L455614L176272K961999K562002K251250K135588
8640E711683J857740J808039K101214K247734K309612K372396K442306K497115
8632B3347839K535478K685687K962548L183687L346631L502079L571530L847208
8624D8982687M837224O321230P703763Q995518J0696446J3155985J6525425K0432621
8616A37650899K3103559J8455233j2232828r4351371j50413837q5424186j0568339
$$ plain form
8672 37560790 39340759 41212758 43258983 45877383 49212373 53283019 58089658 63798900
8664 63798900 70766624 79338327 89463311 100063501 106175307 93859505 44633528 -22314618
8656 -22314618 -59140540 -63556002 -55883600 -46375270 -37715758 -30355450 -24176483 -18986324
8648 -18986324 -14641527 -10831042 -7375428 -4199156 -1237157 1324845 3576095 5711683
8640 5711683 7569423 9377462 11478676 13726410 16036022 18408418 20850724 23347839
8632 23347839 25883317 28569004 31531552 34715239 38061870 41563949 45135479 48982687
8624 48982687 53819911 60141141 67844904 76840422 87536868 100692853 117218278 137650899
8616 137650899 160754458 179209691 166976863 72625492 -77788345 -163212531 -173780870
8609a73780870J6361818J9940243J7797861J4807508J2138880R987170Q171430
8602g4575960O867344N978979N480686M861690L959775L122268K780020K420798
8594c9104400K115885K367547K620023K598218K462929K354894K299155K194549
8586b0091200K127122K175452K298023K399193K367516K356586K467571K796649
8578a103088L368194M019341M650619N387715O397326P720878R276600J0177798
8570D9895383P834872m212938l4633540o3757278m7972994j2411193N516839R403512
8562i0337337Q823836P492256O256574N173773M254997L552171L080605K710725
8554d8992400K438320K099464J650556J401486J202694J004551J038938J058523
$$ plain form
8609 -173780870 -157419052 -137478809 -119680948 -104873440 -92734560 -82747390 -74575960
8602 -74575960 -67708616 -61729637 -56248951 -51387261 -47427486 -44305218 -41525198 -39104400
8594 -39104400 -36988515 -34620968 -32000945 -29402727 -26939798 -24584904 -22285749 -20091200
8586 -20091200 -17964078 -15788626 -13490603 -11091410 -8723894 -6367308 -3899737 -1103088
8578 -1103088 2265106 6284447 10935066 16322781 22720107 30440985 39717585 49895383
8570 49895383 57730255 53517317 18883777 -44873501 -92846495 -105257688 -99740849 -90337337
8562 -90337337 -81513501 -74021245 -67764671 -62590898 -58335901 -54783730 -51703125 -48992400
8554 -48992400 -46554080 -44454616 -42804060 -41402574 -40199880 -39195329 -38156391 -37097868
8546c7097868J104079J044675R50284Q71341Q11485P32174P22803P50118O61783
8537b9449126O45315O17850N97936M62301M34616L89343L87537M31923L44294
8528b5138011L43105L72025L62036M10059L37595K88004K68237L11753L32196
8519b2113001L20592K63737K57776K51670J89310K22982K03052K26609K24651
8510a9952622K14797K34630J94289K00018K23812J62524J64875J83406J64922
8501a8209349K13145K21713J64603J49598J43213J73516J54506J63451J84757
8492a6640847J67670J32263J60949J80465J59958O7682p388J6791Q8066J06220
8482a5568171N9831K1883J14908J73639J27721J15366J02517R3317L7145R8403
$$ plain form
8546 -37097868 -35993789 -34949114 -33998830 -33127489 -32316004 -31583830 -30861027 -30110909 -29449126
8537 -29449126 -28803811 -28185961 -27588025 -27125724 -26691108 -26301765 -25914228 -25482305 -25138011
8528 -25138011 -24794906 -24422881 -24060845 -23650786 -23313191 -23025187 -22756950 -22445197 -22113001
8519 -22113001 -21792409 -21528672 -21270896 -21019226 -20829916 -20606934 -20403882 -20177273 -19952622
8510 -19952622 -19737825 -19503195 -19308906 -19108888 -18885076 -18722552 -18557677 -18374271 -18209349
8501 -18209349 -17996204 -17774491 -17609888 -17460290 -17317077 -17143561 -16989055 -16825604 -16640847
8492 -16640847 -16473177 -16340914 -16179965 -15999500 -15839542 -15771860 -15779248 -15762457 -15674391 -15568171
8482 -15568171 -15508340 -15486457 -15371549 -15197910 -15070189 -14954823 -14852306 -14758989 -14721844 -14623441
8472a4623441J49021K03332P1207Q7889Q6314J08825O5051Q4235J11560K6672
8462a3629335M0512J2451R1891Q4501N8602R9324J22607N6004K9442J03603R0414
8451a2839984O2989N3134O4030J29452J30485R9483J14311O4800M9852P6507L7576
8440a1957365K2822L3982k2094K5874O6160J19346K8364m089P2682N2548K4938
8429a1536832P3883L0939M4722O4574J07925P5793P1525M2048K8207J1631j0420
8418a0996005M5152P2246Q5438J257j2669O3522P9258M1782L8212J13738P9402
8407a0388667j3831K4132K5958J6272J425J2804O5044K0877M4219J13593P5103
8396a0003071Q7538M1878L8j9596j1713O3851M9838P9794Q2359M6759j7431j9977
$$ plain form
8472 -14623441 -14474420 -14271088 -14199881 -14111992 -14025678 -13916853 -13851802 -13767567 -13656007 -13629335
8462 -13629335 -13588823 -13576372 -13484481 -13399980 -13341378 -13242054 -13119447 -13063443 -13034001 -12930398 -12839984
8451 -12839984 -12776995 -12723861 -12659831 -12530379 -12399894 -12300411 -12186100 -12121300 -12071448 -11994941 -11957365
8440 -11957365 -11934543 -11900561 -11922655 -11896781 -11830621 -11711275 -11682911 -11687000 -11614318 -11561770 -11536832
8429 -11536832 -11462949 -11432010 -11387288 -11322714 -11214789 -11138996 -11067471 -11025423 -10997216 -10985585 -10996005
8418 -10996005 -10950853 -10878607 -10793169 -10791912 -10804581 -10741059 -10661801 -10620019 -10581807 -10468069 -10388667
8407 -10388667 -10402498 -10378366 -10352408 -10336136 -10334711 -10321907 -10256863 -10235986 -10191767 -10078174 -10003071
8396 -10003071 -9915533 -9873655 -9873617 -9893213 -9904926 -9841075 -9791237 -9711443 -9629084 -9582325 -9599756 -9619733
8384i619733O5809q0K1818Q1909J00719M4530Q19J0942K3411j9247k0686M8468
8372i261321Q5265O4089k2083j9892L0614j560O6951Q5835O6343M4036M2674j167
8360h820216j1726M6130J7170L4987R517J3045O8198k5822r044L173m244L1330
8348h647502M4541J0923L5265P2793P3536N5283M5047L9776j8823k6991K3849
8337h292303R4630K8150j6498K9308M758M7879J8797k8930L7860j1153K055N114
8325h080333Q9507P8835O0059k8455k0473L7981K9163M2156K9222K0681k434P395
8313g736696J6464N7459K7455L0968N7075k6659k9193L5910M8644j1472P235K0364
8301g502446p935r935o109J6143M4195K7806M9663k604m4423m114N0973N9125
$$ plain form
8384 -9619733 -9553924 -9554004 -9532186 -9450277 -9349558 -9305028 -9304209 -9293267 -9269856 -9289103 -9309789 -9261321
8372 -9261321 -9176056 -9111967 -9134050 -9153942 -9123328 -9124888 -9057937 -8972102 -8905759 -8861723 -8819049 -8820216
8360 -8820216 -8831942 -8785812 -8768642 -8733655 -8724138 -8711093 -8642895 -8668717 -8677761 -8674588 -8678832 -8647502
8348 -8647502 -8602961 -8592038 -8556773 -8483980 -8410444 -8355161 -8310114 -8270338 -8289161 -8316152 -8292303
8337 -8292303 -8197673 -8169523 -8186021 -8156713 -8151955 -8104076 -8085279 -8114209 -8076349 -8087502 -8085447 -8080333
8325 -8080333 -7990826 -7911991 -7851932 -7880387 -7900860 -7862879 -7833716 -7791560 -7762338 -7741657 -7744091 -7736696
8313 -7736696 -7720232 -7662773 -7635318 -7604350 -7547275 -7573934 -7603127 -7567217 -7518573 -7530045 -7522810 -7502446
8301 -7502446 -7510381 -7520316 -7526425 -7510282 -7466087 -7438281 -7388618 -7391222 -7435645 -7439759 -7388786 -7329661
8289g329661M4858L8368l4636j1648L3799Q558L937Q800P0725R0083l7755j6727
8277g131299K4012M459K6988J1319O4254P7666L2694K03L6970M6394K4447o479
8265f788372K914l404M4714M0335L204L7760R8049N8747L8659N6804N5554k2477
8253f377513j70568l30493k08696l612J6515O3457L2951L1836M1403n140O2502
8242f847358Q984k9683M3757J03420k8168L7699Q4307j6276O3034M354Q0690N7358
8230f437882o6090l4320M436O256N1044Q6842J7821l2575J26033Q0300J9543J6246
8218f162346m830Q4571O7590M8733Q3850J78923Q3216P4689Q4300j22341n51012
8207f134657o85088l55807m3513R1809J75677J03047M0811P0908J16548N4197
$$ plain form
8289 -7329661 -7284803 -7246435 -7281071 -7292719 -7258920 -7250362 -7246425 -7237625 -7166900 -7076817 -7114572 -7131299
8277 -7131299 -7107287 -7102828 -7075840 -7064521 -7000267 -6922601 -6889907 -6889704 -6852734 -6806340 -6781893 -6788372
8265 -6788372 -6785458 -6788862 -6744148 -6703813 -6700609 -6662849 -6564800 -6506053 -6467394 -6410590 -6355036 -6377513
8253 -6377513 -6548081 -6878574 -7087270 -7090882 -7074367 -7010910 -6977959 -6946123 -6904720 -6909860 -6847358
8242 -6847358 -6838374 -6868057 -6824300 -6720880 -6749048 -6711349 -6627042 -6643318 -6580284 -6575930 -6495240 -6437882
8230 -6437882 -6503972 -6538292 -6533856 -6527600 -6476556 -6389714 -6371893 -6404468 -6278435 -6198135 -6178592 -6162346
8218 -6162346 -6167176 -6082605 -6015015 -5966282 -5882432 -5703509 -5620293 -5545604 -5461304 -5583645 -6134657
8207 -6134657 -6819745 -7175552 -7219065 -7127256 -6951579 -6848532 -6807721 -6736813 -6620265 -6566068
8197f566068N5177O600P6148K4888N087j9910J0027J898L1563N4017K1996m4474
8185f343051J6553M0465N9349P1317p811Q853M9569M8028O1397R854J1666P170
8173e966641N7274o501l8659K6179L0258N1626Q4460P0534L4278p4k26316l31183
8161f214765j86203j4043J06731P0715O152k9665K3539O9392l5167R711R8795
8150f094808N6439m2229L5134P5704O0022J9376N0524M1420j3413l4611J0944
8139e835498O210j5681Q05q985p396m612L8771L2706M0641J8686K3123l3108O268
8126e738070J7934Q3534M6444k9242k3943k9937J2361K372K064L2318L9179O1536
8114e523450N2445n9601k4847q192k5334l2163k3441N0181J4359l4730O198o3595
$$ plain form
8197 -6566068 -6510891 -6504291 -6428143 -6403255 -6398168 -6418078 -6408051 -6406153 -6374590 -6320573 -6298577 -6343051
8185 -6343051 -6326498 -6286033 -6226684 -6155367 -6163178 -6154325 -6104756 -6056728 -5995331 -5985477 -5973811 -5966641
8173 -5966641 -5909367 -5915868 -5954527 -5928348 -5898090 -5846464 -5762004 -5691470 -5657192 -5657266 -5883582 -6214765
8161 -6214765 -6400968 -6415011 -6308280 -6237565 -6231413 -6261078 -6237539 -6168147 -6203314 -6193603 -6094808
8150 -6094808 -6038369 -6080598 -6045464 -5969760 -5909738 -5890362 -5839838 -5798418 -5811831 -5846442 -5835498
8139 -5835498 -5829288 -5844969 -5844164 -5853149 -5860545 -5865157 -5826386 -5793680 -5753039 -5734353 -5711230 -5744338 -5738070
8126 -5738070 -5720136 -5636602 -5590158 -5619400 -5643343 -5673280 -5660919 -5658547 -5656483 -5624165 -5584986 -5523450
8114 -5523450 -5471005 -5530606 -5555453 -5563645 -5588979 -5621142 -5644583 -5594402 -5580043 -5614773 -5608575 -5672170
8102e672170K6302J52626O5251J5259K5946q691o0017n788P4507J02955j4202
8091e298022m1253n8615n0257k0352J8777K3623J04907L5784l516j1072J1907
8080e288089K2532J9058R915l080r7054o4966k3578M2389L6107N1272M2734J4655
8068e238105j6384J5752K9175K8283J5072K9497j10n9163j7149J1J794J7777k2082
8055e215632k9526J7468N9929M5301k8253o540k0075P5455L0354k6035k2796p195
8043e127545K890N7110L5400n806o2951n2271J4727O3587P6136P9588l1158p1274
8031e021567O88j0621j0624L8214K5969o0050j7629j5174P0101K0313M0087N3764
8019d886529J2003n67j9210J2733j8136n6654p427P2394J8006J3117J318l8950
$$ plain form
8102 -5672170 -5645868 -5493242 -5427991 -5412732 -5386786 -5395477 -5455494 -5461282 -5386775 -5283820 -5298022
8091 -5298022 -5339275 -5397890 -5448147 -5468499 -5449722 -5426099 -5321192 -5285408 -5288924 -5299996 -5288089
8080 -5288089 -5265557 -5246499 -5236584 -5239664 -5336718 -5401684 -5425262 -5382873 -5346766 -5295494 -5252760 -5238105
8068 -5238105 -5254489 -5238737 -5209562 -5181279 -5166207 -5136710 -5136820 -5195983 -5213132 -5213121 -5211327 -5193550 -5215632
8055 -5215632 -5245158 -5227690 -5167761 -5122460 -5150713 -5157253 -5177328 -5101873 -5071519 -5097554 -5120350 -5127545
8043 -5127545 -5124655 -5067545 -5032145 -5037951 -5100902 -5153173 -5138446 -5074859 -4998723 -4919135 -4950293 -5021567
8031 -5021567 -5020879 -5031500 -5042124 -5003910 -4977941 -5037991 -5055620 -5070794 -5000693 -4980380 -4940293 -4886529
8019 -4886529 -4874526 -4875093 -4894303 -4881570 -4899706 -4956360 -4963787 -4891393 -4873387 -4860270 -4858952 -4897902
8007d897902R6697J8986n2253p7140K6384O7943J8443K4049K2644k4965n910K8795
7995d754229P416m017l9749K5798j3659k0211J8800r92m5388l5989N4399J086
7983d806735J6061J6381Q620L1408j6094O074k7393K1561K3525P279l6936L2530
7971d723719J6601K9856k1435j7745M5847k8057k5230L9373L8265Q400N0738j8794
7959d605900j065P648J3736k3961k4065r985L1417M7705J3372J720o1213q0892
7947d691483M0567K4363L1075L3107m0326P134N5473L0173l5265l9389j8601j2472
7935d615644J4486j4814J6013Q6999K0749J6165N5572L2250L2413P202m7345j05380
7923d501334m7057J983N0583N1587j5606J530j9082l0284M5811M0096K3237L8231
$$ plain form
8007 -4897902 -4801205 -4782219 -4834472 -4911612 -4885228 -4817285 -4798842 -4774793 -4752149 -4777114 -4783024 -4754229
7995 -4754229 -4746813 -4750830 -4790579 -4764781 -4778440 -4798651 -4779851 -4780843 -4826231 -4862220 -4807821 -4806735
7983 -4806735 -4790674 -4774293 -4765673 -4734265 -4750359 -4744285 -4771678 -4750117 -4726592 -4719313 -4756249 -4723719
7971 -4723719 -4707118 -4677262 -4698697 -4716442 -4670595 -4698652 -4723882 -4684509 -4646244 -4637844 -4587106 -4605900
7959 -4605900 -4606965 -4599317 -4585581 -4609542 -4633607 -4643592 -4612175 -4564470 -4551098 -4549378 -4610591 -4691483
7947 -4691483 -4650916 -4626553 -4595478 -4562371 -4602697 -4595563 -4540090 -4509917 -4545182 -4584571 -4603172 -4615644
7935 -4615644 -4601158 -4615972 -4599959 -4512960 -4492211 -4476046 -4420474 -4388224 -4355811 -4348609 -4395954 -4501334
7923 -4501334 -4548391 -4546408 -4495825 -4444238 -4459844 -4458314 -4477396 -4507680 -4461869 -4421773 -4398536 -4360305
7911d360305L2974l1571k9363m0389L1476K2749l0528m428J3421K9938o366n7583
7899d429975k9313J0839J9781Q78K56N991J5027L2069L6225M976K2325M3474p7154
7886d344601p2485Q6005N9611Q0559J0772p0196n2140L2206k0778k8431k4206
7875d343684L1097L7527j0590m2031k1288M3515K9772k0657o1772k2616J0370
7864d370357M1649J8067l0104k334O2696L9154j4683M611N130k6529J7585J13259
7852d141856m337J4535m746o9066J6255L6475k9040K5799K1661l2283m2824K1185
7840d188242l6166l9003O2673O7693L3348o179l5162R333L8541k8685j081m6703
7828d169633m9947J4321J4702M6064M6208k2417l2053J7388k0085q788q876L9010
$$ plain form
7911 -4360305 -4327331 -4358902 -4388265 -4428654 -4397178 -4374429 -4404957 -4409385 -4395964 -4366026 -4372392 -4429975
7899 -4429975 -4459288 -4448449 -4428668 -4427790 -4427534 -4421543 -4406516 -4374447 -4338222 -4333246 -4310921 -4267447 -4344601
7886 -4344601 -4417086 -4331081 -4271470 -4190911 -4180139 -4250335 -4302475 -4270269 -4291047 -4319478 -4343684
7875 -4343684 -4312587 -4275060 -4285650 -4327681 -4348969 -4305454 -4275682 -4296339 -4358111 -4380727 -4370357
7864 -4370357 -4328708 -4310641 -4340745 -4343079 -4280383 -4241229 -4255912 -4251301 -4246171 -4272700 -4255115 -4141856
7852 -4141856 -4146193 -4131658 -4136404 -4205470 -4189215 -4152740 -4181780 -4155981 -4134320 -4166603 -4209427 -4188242
7840 -4188242 -4224408 -4263411 -4200738 -4133045 -4099697 -4105876 -4141038 -4131705 -4093164 -4121849 -4122930 -4169633
7828 -4169633 -4219580 -4205259 -4190557 -4144493 -4098285 -4120702 -4152755 -4135367 -4155452 -4164240 -4173116 -4134106
7816d134106P3594Q9954K7614j2230l31o9343o2113J8128K3814l6106r758M8022
7804d042861j6894P087P961N3401n0541K0887P777j2518j0958k4743k9767K4648
7792d066521R9745O6328k8351k5163m7036k2646L9575j445J4814K2180k3735J0616
7780c961639K1515J6544l7371m6233N987L7799O685J1196K4775N350O5332J1824
7768c838236n7836k2510O4085N661P646j3344O6833j8359n2099m7989K662k3457
7756c926943j4462Q672l534M275M0245q837p0845l255P6238K4735K8721O272J5749
7743c822969J771l338m7947l737J2818K2770J9611P9597j2816n868J6369p561
7731c751300l6572k4004Q785k2713M4816P5833j9165j06129q3669l6629O7045
$$ plain form
7816 -4134106 -4060512 -3970558 -3942944 -3955174 -3955505 -4024848 -4086961 -4068833 -4045019 -4081125 -4090883 -4042861
7804 -4042861 -4059755 -4052668 -4044707 -3991306 -4041847 -4020960 -4013183 -4025701 -4036659 -4061402 -4091169 -4066521
7792 -4066521 -3966776 -3900448 -3928799 -3953962 -4000998 -4023644 -3984069 -3985514 -3970700 -3948520 -3972255 -3961639
7780 -3961639 -3940124 -3923580 -3960951 -4007184 -4001197 -3963398 -3956713 -3945517 -3920742 -3915392 -3850060 -3838236
7768 -3838236 -3896072 -3918582 -3854497 -3848836 -3841190 -3854534 -3787701 -3806060 -3858159 -3906148 -3903486 -3926943
7756 -3926943 -3941405 -3932733 -3936267 -3931992 -3891747 -3900584 -3971429 -3974684 -3898446 -3873711 -3844990 -3838718 -3822969
7743 -3822969 -3821198 -3824536 -3872483 -3876220 -3863402 -3840632 -3821021 -3741424 -3754240 -3760108 -3743739 -3751300
7731 -3751300 -3787872 -3811876 -3803091 -3825804 -3780988 -3705155 -3724320 -3830449 -3914118 -3950747 -3883702
7720c883702R7479M9043J4885j1917J2552j8070o8517r295j0200o1495J169N6365
7708c831703M1941l533N321p652L5884J4033J1715l5959M9694L4153p487m077
7696c697670P011k0398j3811o5580N1214K7615j7730n0578k3570P3072K4894J0442
7684c695089L6054k1391n2288k6978K8039K0089l4866n9242M0280P0520O722j5818
7672c703968k5052M511j063N2349M8658J9888j2322P7008L4428l3558q0720k8754
7660c648595P1315O8917j0570N585m016j6476k1919n0353k9901o7050Q583K6415
7648c668065K7125R010m9761M6510O8172o905K8637R603m3073l1076n111J5904
7636c599030j9843M6166L9555m4699m6753J9788M6015J1413k6291K656N2225M1409
$$ plain form
7720 -3883702 -3786223 -3737180 -3722295 -3734212 -3721660 -3739730 -3808247 -3817542 -3827742 -3889237 -3888068 -3831703
7708 -3831703 -3789762 -3793295 -3787974 -3795626 -3759742 -3745709 -3733994 -3769953 -3720259 -3686106 -3693593 -3697670
7696 -3697670 -3690659 -3711057 -3724868 -3790448 -3739234 -3711619 -3729349 -3779927 -3803497 -3730425 -3705531 -3695089
7684 -3695089 -3659035 -3680426 -3732714 -3759692 -3731653 -3711564 -3746430 -3805672 -3765392 -3694872 -3688150 -3703968
7672 -3703968 -3729020 -3724509 -3725572 -3673223 -3624565 -3604677 -3616999 -3539991 -3505563 -3539121 -3619841 -3648595
7660 -3648595 -3577280 -3508363 -3518933 -3513348 -3517364 -3533840 -3555759 -3606112 -3636013 -3703063 -3694480 -3668065
7648 -3668065 -3640940 -3631930 -3681691 -3635181 -3567009 -3573914 -3545277 -3535674 -3578747 -3609823 -3614934 -3599030
7636 -3599030 -3618873 -3572707 -3533152 -3577851 -3624604 -3604816 -3558801 -3547388 -3573679 -3571023 -3518798 -3477389
7624c477389o0769J9555j3455J3435L4511L7737p5023k9384j276j3221n8327p29
7612c624335j2526O6686R8240M6676L149l5353j2627k748q0122j3135N5268N9948
7600c450879q594j3908l8810J3549J9702Q317M8590j9736l4099l9470J3101K1181
7588c481056j6146m1967o291O8511P4546n078m9362j2926K7198j4953l0063o737
7576c494324j3605J1154N9023K5890N4839M6002k6434p2948k6650n105k5226j8769
7564c486153J013Q256L3664K0465j4599J3991M0514o100l775K9703n76p0004J8783
7551c414818k896o964K4875J2575O8692k2367o9402M3110k7759J6530J6439N8833
7539c303152j2222K5432k7761Q783L8205L357Q533K0408m9557j0862J2450l158
$$ plain form
7624 -3477389 -3538158 -3518603 -3532058 -3518623 -3484112 -3446375 -3521398 -3550782 -3552058 -3565279 -3623606 -3624335
7612 -3624335 -3636861 -3570175 -3471935 -3425259 -3422110 -3457463 -3470090 -3472838 -3552960 -3566095 -3510827 -3450879
7600 -3450879 -3459473 -3473381 -3512191 -3498642 -3478940 -3470623 -3422033 -3441769 -3475868 -3515338 -3502237 -3481056
7588 -3481056 -3497202 -3539169 -3545460 -3476949 -3402403 -3407481 -3456843 -3469769 -3442571 -3457524 -3487587 -3494324
7576 -3494324 -3507929 -3496775 -3437752 -3411862 -3357023 -3311021 -3337455 -3410403 -3437053 -3442158 -3467384 -3486153
7564 -3486153 -3485140 -3476884 -3443220 -3422755 -3437354 -3423363 -3382849 -3388949 -3392724 -3363021 -3363597 -3433601 -3414818
7551 -3414818 -3417714 -3424678 -3399803 -3387228 -3318536 -3340903 -3410305 -3367195 -3394954 -3378424 -3361985 -3303152
7539 -3303152 -3315374 -3289942 -3317703 -3308920 -3270715 -3267358 -3258825 -3238417 -3287974 -3298836 -3286386 -3289544
7527c289544l6611k3193J5137l1719j6557n0118k6235N2884N3786k2133l6646
7516c410949P1594M3236j3204K6448q516M570L2993q079l7851J6164j1866o4541
7504c360001k5790l812q249J7871N9277n1294Q214M4405M0120J9654p735RK534
7491c264797l6625p730O7046K1185o1518l0767o077m010J1372N248j2584m8109
7479c367366j0737M7293l9148N2216K319n3906M0836J18176N8649o2543l6644
7468c250855K5449l835k0331k933J4507r349K7477J4539m0094L8384j3296K954
7456c217383L4533k7017k218O4169k3504m0615m8722p20K1641K7874N2089m5611
7444c205484o3053N2220M5932k3112j7998k8532n367O1754M850R031M5698K0805
$$ plain form
7527 -3289544 -3326155 -3349348 -3334211 -3365930 -3382487 -3432605 -3458840 -3405956 -3352170 -3374303 -3410949
7516 -3410949 -3339355 -3296119 -3309323 -3282875 -3291391 -3286821 -3253828 -3261907 -3299758 -3283594 -3295460 -3360001
7504 -3360001 -3385791 -3389603 -3397852 -3379981 -3320704 -3371998 -3363784 -3319379 -3279259 -3259605 -3267340 -3267331 -3264797
7491 -3264797 -3301422 -3309152 -3242106 -3220921 -3282439 -3313206 -3319283 -3323293 -3311921 -3306673 -3319257 -3367366
7479 -3367366 -3378103 -3330810 -3369958 -3317742 -3315423 -3369329 -3328493 -3210317 -3151668 -3214211 -3250855
7468 -3250855 -3225406 -3229241 -3249572 -3252505 -3237998 -3247347 -3219870 -3205331 -3245425 -3207041 -3220337 -3217383
7456 -3217383 -3182850 -3209867 -3212085 -3147916 -3171420 -3212035 -3260757 -3261477 -3239836 -3211962 -3159873 -3205484
7444 -3205484 -3268537 -3216317 -3170385 -3193497 -3211495 -3240027 -3245394 -3183640 -3178790 -3169759 -3124061 -3103256
7432c103256o1378O5450l0827q6170K6352O0213l2154J0750j1374k4812j6485
7421c203691L9607L3157n3454m4720P5503O1587j046k1882O2400J5672Q498J1753
7409c016616k1230l3871o0672k4252N0212R506l9303L9055m372J9068M1442K5654
7397c015379r563j7843n3204k4477J200q991j3930J9130K2238J5756j5285J667
7385c098681J1188j5324K1203M5428J6444k2151M7136R184r399m8353o9843l0185
7373c143353K1375L9099O33K0915P172q036Q408M3083k8130l0511m6090k6415
7361c141850O2302L8550r459N600m674K5510m5500M2639q530M838M2468M0579
7349b947527Q322J0583o1372j7232j4713q5202J6110N5278K8330M070n335J2231
$$ plain form
7432 -3103256 -3164634 -3099184 -3130011 -3216181 -3189829 -3129616 -3161770 -3151020 -3162394 -3187206 -3203691
7421 -3203691 -3164084 -3130927 -3184381 -3229101 -3153598 -3092011 -3093057 -3114939 -3052539 -3036867 -3028369 -3016616
7409 -3016616 -3037846 -3071717 -3132389 -3156641 -3106429 -3096923 -3136226 -3097171 -3101543 -3082475 -3041033 -3015379
7397 -3015379 -3024942 -3042785 -3095989 -3120466 -3119266 -3128257 -3142187 -3123057 -3100819 -3085063 -3100348 -3098681
7385 -3098681 -3087493 -3102817 -3081614 -3036186 -3019742 -3041893 -2994757 -2985573 -2994972 -3043325 -3113168 -3143353
7373 -3143353 -3121978 -3082879 -3082246 -3061331 -3054159 -3062195 -3053787 -3010704 -3038834 -3069345 -3115435 -3141850
7361 -3141850 -3079548 -3040998 -3050457 -3044857 -3049531 -3024021 -3069521 -3026882 -3035412 -3030574 -2988106 -2947527
7349 -2947527 -2939205 -2928622 -2989994 -3007226 -3021939 -3107141 -3091031 -3035753 -3007423 -3003353 -3008688 -2996457
7337b996457L3668K5056l3023n3257j2762L2697k168O7618k2987K0191Q5406j6313
7325b872331j8785m9112o167q698n7810k6826J0094J4934J6232L3644m9068j042
7313c014935L8209k3825J490r118k008j8337m3937l6946N2707J8990M9197L6313
7301b952200k2153j9066l6612n2955L2666O6379L9944O0565m238k8607n1524m8104
7289c015905J8149M6980N6422L984k8580J285l0147j6254O3243K1946m9277k0471
7277b948625J1737K8230m3506L4504k520j5968J0698L9547R414o802n8715J2505
7265b929501K9726m8000m3912R204k5007K6589L0196J9831J8325M27J2652n336
7253b904806j3350j5012L0763L5765j6455k4960k9833k3349N9526N90j7514L8215
$$ plain form
7337 -2996457 -2962789 -2937733 -2970756 -3024013 -3036775 -3004078 -3006246 -2938628 -2961615 -2941424 -2856018 -2872331
7325 -2872331 -2891116 -2940228 -2946395 -2955093 -3012903 -3039729 -3029635 -3014701 -2998469 -2964825 -3013893 -3014935
7313 -3014935 -2976726 -3000551 -2999061 -3008179 -3010187 -3028524 -3072461 -3109407 -3056700 -3037710 -2988513 -2952200
7301 -2952200 -2974353 -2993419 -3030031 -3082986 -3050320 -2983941 -2943997 -2883432 -2887670 -2916277 -2967801 -3015905
7289 -3015905 -2997756 -2950776 -2894354 -2890370 -2918950 -2917665 -2947812 -2964066 -2900823 -2878877 -2928154 -2948625
7277 -2948625 -2936888 -2908658 -2952164 -2917660 -2920180 -2936148 -2925450 -2885903 -2876489 -2883291 -2942006 -2929501
7265 -2929501 -2899775 -2947775 -2991687 -2982483 -3007490 -2980901 -2950705 -2930874 -2912549 -2912122 -2899470 -2904806
7253 -2904806 -2918156 -2933168 -2902405 -2866640 -2883095 -2908055 -2937888 -2961237 -2901711 -2901121 -2918635 -2880420
7241b880420r430J0052l7182j6212M4173O1323K9751j3135K0414m9829o1197j6941
7229b918633m5217l888N9668L7553L7151J3692n3721n2715K0149N145p5783m4793
7217c021392L1534J01953N9657k2190k4573L9758j6799m3179m5304L5019L4361
7206b871155q818K6457Q463O219L4191P3059l090n0533K0791l9753k9183k9731
7194b863083n3586K8799L1052J8145O8203k2930p8091j5737P440J5473J1005Q045
7182b845265N2186k0581J9059r903L571N8654K8390k7618O998J6105j3169m1197
7170b772770l8573l4434j0932M8672J7507O366M0950Q8656n0219l9413J6221M1924
7158b686045k3444k8422k1229k8195N8027M5257Q393p5865j07284M350O6557M5100
$$ plain form
7241 -2880420 -2889850 -2879798 -2916980 -2933192 -2889019 -2827696 -2797945 -2811080 -2790666 -2840495 -2901692 -2918633
7229 -2918633 -2963850 -2967738 -2908070 -2870517 -2833366 -2819674 -2873395 -2926110 -2905961 -2900816 -2976599 -3021392
7217 -3021392 -2989858 -2887905 -2828248 -2850438 -2875011 -2835253 -2852052 -2895231 -2940535 -2905516 -2871155
7206 -2871155 -2879973 -2853516 -2845053 -2838834 -2804643 -2731584 -2734674 -2785207 -2764416 -2804169 -2833352 -2863083
7194 -2863083 -2916669 -2887870 -2856818 -2838673 -2770470 -2793400 -2871491 -2887228 -2879788 -2864315 -2853310 -2845265
7182 -2845265 -2793079 -2813660 -2794601 -2804504 -2800933 -2742279 -2713889 -2741507 -2734509 -2718404 -2731573 -2772770
7170 -2772770 -2811343 -2845777 -2856709 -2808037 -2790530 -2784164 -2743214 -2654558 -2704777 -2744190 -2727969 -2686045
7158 -2686045 -2709489 -2737911 -2759140 -2787335 -2729308 -2684051 -2675658 -2751523 -2858807 -2854457 -2787900 -2742800
7146b742800L4773K3388N1570L294l4167n0498l6560J340m741O2793M895K3038
7134b663675L2047l6285n5992o030J390j2733N3415J7458l0667J316k7085M5098
7122b681743M0647K3552o258j8631j2517o6896k0711O151k4829J4914N5004j2690
7110b704007n99k7083J521L7819L6357k0860p2355n6797l2139N8158J7700n9389
7098b821674m4445J1805M8663O7307n442J4146O816m4469k6715j0259K1193P3230
7086b709844M0544M7725k0438n0387K4261n235k3294K4020N2551M0869l8181K2980
7074b594429k4400m9236J1741L9477M3008l7141r7622j6457J6765M1494P7719
7063b589081R281k5404M1665m2207j7809P012R181K830j5968J608j3339q615l0718
$$ plain form
7146 -2742800 -2708027 -2684639 -2633069 -2629775 -2663942 -2714440 -2751000 -2749660 -2754401 -2691608 -2686713 -2663675
7134 -2663675 -2631628 -2667913 -2723905 -2729935 -2728545 -2741278 -2687863 -2670405 -2701072 -2699756 -2726841 -2681743
7122 -2681743 -2641096 -2617544 -2623802 -2642433 -2654950 -2721846 -2742557 -2736406 -2761235 -2746321 -2691317 -2704007
7110 -2704007 -2704606 -2731689 -2730168 -2692349 -2655992 -2676852 -2749207 -2806004 -2838143 -2779985 -2762285 -2821674
7098 -2821674 -2866119 -2854314 -2805651 -2738344 -2743786 -2729640 -2722824 -2767293 -2794008 -2804267 -2783074 -2709844
7086 -2709844 -2669300 -2621575 -2642013 -2692400 -2668139 -2673374 -2696668 -2672648 -2620097 -2579228 -2617409 -2594429
7074 -2594429 -2618829 -2668065 -2656324 -2616847 -2573839 -2610980 -2708602 -2725059 -2708294 -2666800 -2589081
7063 -2589081 -2579800 -2605204 -2563539 -2605746 -2623555 -2616543 -2607362 -2604532 -2620500 -2618892 -2632231 -2640846 -2671564
7050b671564J8381M6577k3580o2271M6927M6747J6243k6062N6747K6407J952K7875
7038b495621m0567j2090n1615m6744L2105k0830R060j9989J7462l8828j9795J5509
7026b671943k0927p752l6287p405K0215l8259N4730J2861j204L9858k6991L2745
7014b650359P3400j349j6607M3131K4465l6771o1015K0951L3630M4117J8803m8893
7002b556497j2170m8104n1136J8379M0131J3369j8074J2350P734K6926q8051n9641
6990b714784J4519J4233n568K5645M8508K6078J0396O7284O3423n0409o9127p0481
6978b640283J4252j1316o889J37j1187K4516J370M5141N0251k9794l2504R34m8269
6965b643641M2503Q9068J1893p2882p6760L8178L6442L2842k64j4747p737K8318
$$ plain form
7050 -2671564 -2653183 -2606606 -2630186 -2692457 -2645530 -2598783 -2582540 -2608602 -2551855 -2525448 -2523496 -2495621
7038 -2495621 -2536188 -2548278 -2599893 -2646637 -2614532 -2635362 -2626302 -2646291 -2628829 -2667657 -2687452 -2671943
7026 -2671943 -2692870 -2700622 -2736909 -2744314 -2724099 -2762358 -2707628 -2694767 -2695971 -2656113 -2683104 -2650359
7014 -2650359 -2576959 -2578308 -2594915 -2551784 -2527319 -2564090 -2625105 -2604154 -2570524 -2526407 -2507604 -2556497
7002 -2556497 -2568667 -2616771 -2667907 -2649528 -2609397 -2596028 -2614102 -2601752 -2594018 -2567092 -2655143 -2714784
6990 -2714784 -2700265 -2686032 -2691600 -2665955 -2617447 -2591369 -2580973 -2513689 -2450266 -2500675 -2569802 -2640283
6978 -2640283 -2626031 -2637347 -2644236 -2644099 -2655286 -2630770 -2629400 -2584259 -2534008 -2563802 -2596306 -2595372 -2643641
6965 -2643641 -2601138 -2512070 -2500177 -2573059 -2649819 -2611641 -2575199 -2542357 -2542621 -2557368 -2565105 -2536787
6953b536787N8917L0130j6770n4372j5765J916l174k1774L9285N748K3720O0046
6941b428880l7134q0925j4431L5038L7582N8804N856m2722l0596N7501n284l5263
6929b480454k893k0246l5481j0903O6177j934m2616j8397M5558K7128P47j0215
6917b483529m5928k1898j564O7148P700n0820o0015l926M0127N1701K433n9224
6905b557795n5876m38O2114m726P053k825J2994O1748Q5431k8897m374K3541L9411
6892b362639q9225r3291l8777j567m073p188l27M469l5407M8852R7129J3788p4615
6879b542871m7514k361O613k5666l0962J7413M3524P082M2442L4341k0350k4527
6867b542836n843N313j3420k275P5453L4165j5392m5579o7917L7380O3368L6133
$$ plain form
6953 -2536787 -2477870 -2447740 -2464510 -2518882 -2534647 -2532731 -2535905 -2557679 -2518394 -2512646 -2488926 -2428880
6941 -2428880 -2466014 -2546939 -2561370 -2526332 -2488750 -2429946 -2424090 -2466812 -2497408 -2439907 -2445191 -2480454
6929 -2480454 -2483347 -2503593 -2539074 -2549977 -2483800 -2485734 -2528350 -2546747 -2501189 -2474061 -2473314 -2483529
6917 -2483529 -2529457 -2551355 -2552919 -2485771 -2478071 -2528891 -2588906 -2592832 -2552705 -2501004 -2498571 -2557795
6905 -2557795 -2613671 -2614109 -2551995 -2556721 -2549668 -2552493 -2539499 -2477751 -2392320 -2421217 -2425591 -2402050 -2362639
6892 -2362639 -2451864 -2545155 -2583932 -2585499 -2589572 -2596760 -2597087 -2592618 -2628025 -2579173 -2482044 -2468256 -2542871
6879 -2542871 -2590385 -2592746 -2586133 -2611799 -2642761 -2625348 -2581824 -2574742 -2532300 -2497959 -2518309 -2542836
6867 -2542836 -2548679 -2543366 -2556786 -2559061 -2483608 -2449443 -2464835 -2510414 -2578331 -2540951 -2477583 -2441450
6855b441450m1856k0408L4131j490l9030J0451R396N2109m3328p5183M8490L676
6843b504492K0614M6571J6797K3500l1955r893O0363j2167j0601N3131K4718o4268
6831b387682j0404p2213j5947L9856j1925l6281n2877L5775J03272P742q4770
6820b485454J293N2431j1801J7663Q5349M4577l3534p7451l4874J8000K1016n7351
6808b460136k3482k788M4864P8670K4404q323p0035n0160J2997k2102j9794K9403
6796b466482N4365k3356j5506q3268J8324O1209K8021k0687L8103j6378m9027
6785b474682l9186k404P7138M5852Q48N110L7513k6358l9876L6959P0818m3948
6773b352216m2219K3737J6926j0438m3039M248M4931o174k6850K0514l5711M969
$$ plain form
6855 -2441450 -2483306 -2503714 -2469583 -2471073 -2510103 -2499652 -2490256 -2438147 -2481475 -2556658 -2508168 -2504492
6843 -2504492 -2483878 -2437307 -2420510 -2397010 -2428965 -2438858 -2378495 -2390662 -2401263 -2348132 -2323414 -2387682
6831 -2387682 -2398086 -2470299 -2486246 -2446390 -2458315 -2494596 -2547473 -2511698 -2408426 -2400684 -2485454
6820 -2485454 -2484161 -2431730 -2443531 -2425868 -2340519 -2295942 -2329476 -2406927 -2441801 -2423801 -2402785 -2460136
6808 -2460136 -2483618 -2486406 -2441542 -2362872 -2338468 -2346791 -2416826 -2466986 -2453989 -2476091 -2495885 -2466482
6796 -2466482 -2412117 -2435473 -2450979 -2534247 -2515923 -2454714 -2426693 -2447380 -2409277 -2425655 -2474682
6785 -2474682 -2513868 -2516272 -2439134 -2393282 -2392434 -2387324 -2349811 -2376169 -2416045 -2379086 -2308268 -2352216
6773 -2352216 -2394435 -2370698 -2353772 -2364210 -2407249 -2403001 -2358070 -2364244 -2391094 -2370580 -2406291 -2401322
6761b401322P0800j7168p3468K390Q897N1324O6731J0499K7770p405k7485q281
6749b296718j9046l2268M6772O5249m3177p5054k7057n982l5190j2596L1574M9361
6737b354132K3752j6466O1878M8713l7048m5395N6N4484M626p906J1923M7239
6725b208276j1754m8752m7052L4012K4180J4704N7902K5855k9877j5671l038M138
6713b203629J6873o0520r5425l9868n782m8546l7046L0640R4256N3878p979o5668
6701b368816j4730L6972J6225M6776J8088p439k6738k7147k89o608l2987l541
6689b370234J7205K4577J4685q914p6961n0128L0894L6871j2854R418M9502J028
6677b334911J3665M5975q883k6937O3841L7782j735j0542n0575p9688q6611p018
$$ plain form
6761 -2401322 -2330522 -2347690 -2421158 -2418768 -2409871 -2358547 -2291816 -2281317 -2253547 -2260952 -2288437 -2296718
6749 -2296718 -2315764 -2348032 -2301260 -2236011 -2279188 -2354242 -2381299 -2387281 -2422471 -2435067 -2403493 -2354132
6737 -2354132 -2330380 -2346846 -2284968 -2236255 -2273303 -2318698 -2318642 -2264158 -2259532 -2267438 -2255515 -2208276
6725 -2208276 -2220030 -2268782 -2315834 -2281822 -2257642 -2242938 -2185036 -2159181 -2189058 -2204729 -2207767 -2203629
6713 -2203629 -2186756 -2247276 -2342701 -2382569 -2388351 -2436897 -2473943 -2443303 -2349047 -2295169 -2303148 -2368816
6701 -2368816 -2383546 -2346574 -2330349 -2283573 -2265485 -2272924 -2299662 -2326809 -2327098 -2333706 -2366693 -2370234
6689 -2370234 -2353029 -2328452 -2313767 -2322681 -2399642 -2449770 -2418876 -2382005 -2394859 -2385441 -2335939 -2334911
6677 -2334911 -2321246 -2275271 -2284154 -2311091 -2247250 -2209468 -2211203 -2221745 -2272320 -2352008 -2438619 -2445637
6665b445637K0807M2594P146L3897L6237k956M9159l2260MK355n4781K8329L4309
6652b280797k0643j4172J8576R210J1181k7535l3728M1133L275N0998J1966J1588
6640b218948P901j5709j6996R096j6491K921r461m688L7248M992j0195k4790l78
6627b255498r815L1079j332J8604k1550O353K5438J2967J6470j3617K8883o801
6615b168819m4708l6567L1153m6882q5487l3491M4423M0045K0917N5850L3277
6604b190289L129k8302j6796n971Q454l9653k975J3704M9207K5001N780K8608
6592b150103L9293n765n4156J33j2295m4306L7386K2941J328K0441j1358r6202
6580b252663k5393J2782L707K3901P0519L495p1920j07313j977J0612K8092N9803
$$ plain form
6665 -2445637 -2424830 -2382236 -2375090 -2341193 -2304956 -2307912 -2258753 -2291013 -2291009 -2288654 -2343435 -2315106 -2280797
6652 -2280797 -2301440 -2315612 -2297036 -2287826 -2276645 -2304180 -2337908 -2296775 -2293500 -2242502 -2230536 -2218948
6640 -2218948 -2211047 -2226756 -2243752 -2234656 -2251147 -2248226 -2257687 -2262375 -2225127 -2220135 -2230330 -2255120 -2255498
6627 -2255498 -2265313 -2234234 -2235566 -2216962 -2238512 -2232159 -2206721 -2193754 -2177284 -2190901 -2162018 -2168819
6615 -2168819 -2213527 -2250094 -2218941 -2265823 -2351310 -2384801 -2340378 -2300333 -2279416 -2223566 -2190289
6604 -2190289 -2187160 -2215462 -2232258 -2238229 -2229775 -2269428 -2272403 -2258699 -2209492 -2184491 -2178711 -2150103
6592 -2150103 -2110810 -2116575 -2170731 -2170598 -2182893 -2227199 -2189813 -2166872 -2165544 -2145103 -2156461 -2252663
6580 -2252663 -2278056 -2265274 -2261567 -2237666 -2167147 -2163652 -2235572 -2342885 -2344862 -2334250 -2306158 -2246355
6568b246355M9304n7670m0273J1624P213l5194J9431n144L936N7568M0388J374
6556b193798L3339m0760j5365m9814o594n095l9898Q992K0224Q5564J3424P040
6544b182741k1203p4705k2553K900K52M3606l3032k9153L0634J0360l092k1105
6532b299832N8246M115J6646L2599P5439P488k1324l2147J2856l0091L5353j546
6520b142198n7380M9069M6819J3739m7329n1608m9110O6135N2419j9204K1779
6509b116869J1142M45l9112l1951N6489k8079o7907q0913L5352L8242q259j1608
6497b243028l7906l140J4301K1707J9662O7249J9040k2032L5019J1158l0619L4395
6485b114194n285l1482n86J8702l656l5453o433J8039k4361J0032m2550N6222
$$ plain form
6568 -2246355 -2197051 -2254721 -2294994 -2283370 -2276157 -2311351 -2291920 -2297064 -2293128 -2235560 -2195172 -2193798
6556 -2193798 -2160459 -2201219 -2216584 -2266398 -2272992 -2278087 -2317985 -2308993 -2288769 -2203205 -2189781 -2182741
6544 -2182741 -2203944 -2278649 -2301202 -2298302 -2298050 -2254444 -2287476 -2316629 -2285995 -2275635 -2278727 -2299832
6532 -2299832 -2241586 -2237471 -2220825 -2188226 -2112787 -2105299 -2126623 -2158770 -2145914 -2176005 -2140652 -2142198
6520 -2142198 -2199578 -2150509 -2103690 -2089951 -2137280 -2188888 -2237998 -2171863 -2119444 -2138648 -2116869
6509 -2116869 -2105727 -2105282 -2144394 -2176345 -2119856 -2147935 -2215842 -2296755 -2261403 -2223161 -2231420 -2243028
6497 -2243028 -2280934 -2284074 -2269773 -2248066 -2228404 -2161155 -2142115 -2164147 -2129128 -2117970 -2148589 -2114194
6485 -2114194 -2119479 -2150961 -2151547 -2132845 -2136501 -2171954 -2178387 -2160348 -2184709 -2174677 -2217227 -2161005
6473b161005k7904l6607N6021L3774j7607L2354m286l1647k5568k9736j5196J420
6461b225987K3325K9369K6787K9027k5584o681n3442n1754L6049j4798l8704M7248
6449b225145M8981K8257n140Q119m2066l0395j7033o3432l6729M7539Q096r491
6437b288439N1842M1733L8094p170l354M2550K6427K7169J5128J6602n1338n8628
6425b149384k9717L5790J7959J6036j3281q398O3804L1615j5298k8804k5507J4449
6413b090736M7845J4446K384q572k8876l0895J2918J6257j8077R281N0670K5270
6401a998085l6859k3744L6003k2958m481o672l2306L4329L6656P393k667m541
6389b017932p4262l1804k2929k0644Q978N6063Q473n8541K7952O5958k800J5189
$$ plain form
6473 -2161005 -2188909 -2225516 -2169495 -2135721 -2153328 -2120974 -2125260 -2156907 -2182475 -2212211 -2227407 -2225987
6461 -2225987 -2202662 -2173293 -2146506 -2117479 -2143063 -2149744 -2203186 -2254940 -2218891 -2233689 -2272393 -2225145
6449 -2225145 -2176164 -2147907 -2153047 -2144928 -2186994 -2217389 -2234422 -2297854 -2334583 -2287044 -2278948 -2288439
6437 -2288439 -2236597 -2194864 -2156770 -2163940 -2167294 -2124744 -2098317 -2071148 -2056020 -2039418 -2090756 -2149384
6425 -2149384 -2179101 -2143311 -2125352 -2109316 -2122597 -2130995 -2067191 -2035576 -2050874 -2079678 -2105185 -2090736
6413 -2090736 -2042891 -2028445 -2026061 -2034633 -2063509 -2094404 -2081486 -2065229 -2083306 -2074025 -2023355 -1998085
6401 -1998085 -2034944 -2058688 -2022685 -2045643 -2050124 -2056796 -2089102 -2054773 -2018117 -2010724 -2013391 -2017932
6389 -2017932 -2092194 -2123998 -2146927 -2167571 -2158593 -2102530 -2094057 -2152598 -2124646 -2058688 -2061488 -2046299
6377b046299L4397J4349m460j7141j5018m1206l2603N7507k7955o0120j7879Q0888
6365b075540m902P0363N4333j4238j9031l1524m981k7262n4677J9364N8432l595
6353b033258K56j4249K3088j963o2802m6448J7163K3272N0048O2962J063p85K1480
6340a960173q181r341J1061k3294p7464K80j3736m8440L0505N367j9304N9792
6328b052928q906l1531L605K8792N54L4826J459m6688k2359j4234L8610Q6876
6316a981924k4748k672J7207j891m4898k6627N391Q1277K203M6984r104l4670
6304a973472j172r1398m2554M410q859J5784j5539j2236J076O2512j3198J3316
6292b061330q266J6696L1449j3377j1907q399O7975J1528m2656k2992L8294J7495
$$ plain form
6377 -2046299 -2011902 -1997553 -2002013 -2019154 -2034172 -2075378 -2107981 -2050474 -2078429 -2138549 -2156428 -2075540
6365 -2075540 -2080442 -2010079 -1955746 -1969984 -1989015 -2020539 -2025520 -2052782 -2107459 -2088095 -2029663 -2033258
6353 -2033258 -2033002 -2047251 -2024163 -2026126 -2088928 -2135376 -2118213 -2094941 -2044893 -1981931 -1980868 -1981653 -1960173
6340 -1960173 -1968354 -1977695 -1966634 -1989928 -2067392 -2067112 -2080848 -2129288 -2098783 -2093416 -2112720 -2052928
6328 -2052928 -2061834 -2093365 -2089760 -2060968 -2060414 -2025588 -2024129 -2070817 -2093176 -2107410 -2068800 -1981924
6316 -1981924 -2006672 -2009344 -1992137 -1994028 -2038926 -2065553 -2060162 -1978885 -1976682 -1929698 -1938802 -1973472
6304 -1973472 -1974644 -2066042 -2108596 -2104186 -2113045 -2097261 -2112800 -2125036 -2123960 -2061448 -2074646 -2061330
6292 -2061330 -2069596 -2052900 -2021451 -2034828 -2046735 -2055134 -1987159 -1975631 -2018287 -2041279 -2002985 -1985490
6280a985490M2881j0734o0307K2311m5479O0841j0062J3598j9022l3007m6806
6269b071276k883l2911L666K6062O3257l5645J8753J3747K9683N7559N7198m911
6257a877701K7249M2837r4798l8314J4682j2486p8488n7745J5115N445K7409p8337
6245b105132l8025Q9608L9423J098k6420M0534J6450Q125r696P220kJ8703k6920
6232a985034k7172K7466J6911o1177m7066K5055k721l0947M1064J5876O2422k0633
6220a985956J3196r060L32K7275m1086j6085J6174J7612O2336p9779q8265j1850
6208b095156O542K3835M775O1480M6833p3282k1773K490J0025J6251p574O491
6196b019063Q386j1109L93J6033J1440j4927k1449Q573j1166J5643n03L0871J8379
$$ plain form
6280 -1985490 -1942609 -1953343 -2013650 -1991339 -2036818 -1975977 -1986039 -1972441 -1991463 -2024470 -2071276
6269 -2071276 -2074159 -2107070 -2103404 -2077342 -2014085 -2049730 -2030977 -2017230 -1987547 -1929988 -1872790 -1877701
6257 -1877701 -1850452 -1807615 -1902413 -1940727 -1926045 -1938531 -2017019 -2074764 -2059649 -2054204 -2026795 -2105132
6245 -2105132 -2143157 -2053549 -2014126 -2013028 -2039448 -1998914 -1982464 -1974339 -1984035 -1976815 -1976817 -1958114 -1985034
6232 -1985034 -2012206 -1984740 -1967829 -2029006 -2076072 -2051017 -2053738 -2084685 -2043621 -2027745 -1965323 -1985956
6220 -1985956 -1972760 -1981820 -1981488 -1954213 -1995299 -2011384 -1995210 -1977598 -1915262 -1995041 -2083306 -2095156
6208 -2095156 -2088614 -2064779 -2060004 -1998524 -1951691 -2024973 -2046746 -2044256 -2034231 -2017980 -2025554 -2019063
6196 -2019063 -2010677 -2021786 -2021393 -2005360 -1993920 -2008847 -2030296 -2021723 -2032889 -2017246 -2017749 -1986878 -1968499
6183a968499m9260R583j9229M5474J17027R038n7047J755n8551K073l2985J8396
6171a982225K4402K4361N808M1697j7186l1905j09782j9585M8827K6159n3429
6160b042858M2762K1819K3109K3321m4894l0763K5682K5501j2920n4486k5759
6149b049486J0640P7236Q6830m4303r001K4145n344j2309l7704m8202k0349m256
6137b032103n4280l0623K7178L3503L1731O4758j6327k7737N9623O273n8870n7371
6125b054245m6119j0245P3431O8912P9630K1291k2356n0283m8838o241l9630j4206
6113b048899r83O5881M7453l755n7678j6427K5707O0633N2787K0805l3102o1962
6101a949540m905K5505j3083M4560j8375m3362k3544J9005m621N1820M2122k4275
$$ plain form
6183 -1968499 -2017759 -2008176 -2027405 -1981931 -1864904 -1855866 -1912913 -1911158 -1969709 -1967636 -2000621 -1982225
6171 -1982225 -1957823 -1933462 -1927654 -1885957 -1903143 -1935048 -2044830 -2064415 -2015588 -1989429 -2042858
6160 -2042858 -2000096 -1978277 -1955168 -1931847 -1976741 -2007504 -1981822 -1956321 -1969241 -2023727 -2049486
6149 -2049486 -2038846 -1961610 -1874780 -1919083 -1928084 -1903939 -1909283 -1921592 -1959296 -2007498 -2027847 -2032103
6137 -2032103 -2086383 -2117006 -2089828 -2056325 -2024594 -1959836 -1976163 -2003900 -1944277 -1938004 -1996874 -2054245
6125 -2054245 -2100364 -2110609 -2037178 -1968266 -1888636 -1867345 -1889701 -1939984 -1988822 -1995063 -2034693 -2048899
6113 -2048899 -2049882 -1984001 -1936548 -1940303 -1997981 -2014408 -1988701 -1928068 -1875281 -1854476 -1887578 -1949540
6101 -1949540 -1954445 -1928940 -1942023 -1897463 -1915838 -1959200 -1982744 -1963739 -1968360 -1916540 -1874418 -1898693
6089a898693l5298L5154K8019O1242l6719j9385K0555l6651p2474o3630k5161
6078b043041j2729k0929M8168N8926L1652N4413M9613K6492p0967l3488n39N742
6066a906687O5199k5336r2577L7190J5374k7273l2608K548P74n27Q6643O421j4333
6053a885192N5342k6796q8725Q604J3948K8121M6169K627l9422J5629J515K4516
6041a843664j8090J0422j9436m6791L401j2171O6368k2365p5920M638j2018o735
6029a972361R9547J8252n446k592M773k3926J5661j7052m0911l1470K4583j0623
6017a941565k7492K4456m2597K0288O158K6276N7757R363J7407j9556m619k4194
6005a898318k508m9544o1766o867J3510o542N963k3244M6416M6505L6200O9281
$$ plain form
6089 -1898693 -1933991 -1898837 -1870818 -1809576 -1846295 -1865680 -1845125 -1881776 -1954250 -2017880 -2043041
6078 -2043041 -2055770 -2076699 -2028531 -1969605 -1937953 -1883540 -1833927 -1807435 -1878402 -1911890 -1912429 -1906687
6066 -1906687 -1841488 -1866824 -1959401 -1922211 -1906837 -1934110 -1966718 -1964170 -1963396 -1963923 -1877280 -1870859 -1885192
6053 -1885192 -1829850 -1856646 -1945371 -1936767 -1922819 -1894698 -1848529 -1845902 -1885324 -1869695 -1868180 -1843664
6041 -1843664 -1861754 -1851332 -1870768 -1917559 -1914158 -1926329 -1859961 -1882326 -1958246 -1953608 -1965626 -1972361
6029 -1972361 -1872814 -1854562 -1860008 -1862600 -1857827 -1881753 -1866092 -1883144 -1924055 -1955525 -1930942 -1941565
6017 -1941565 -1969057 -1944601 -1987198 -1966910 -1960752 -1934476 -1876719 -1867356 -1849949 -1869505 -1874124 -1898318
6005 -1898318 -1900826 -1950370 -2012136 -2019003 -2005493 -2012035 -2006072 -2029316 -1982900 -1936395 -1900195 -1830914
5993a830914K0887k238m3425J1819q150o2172K4857M311L1458l8482k0930J5148
5981a897831K8864M8119n5914M4538N722l9486q106J1102m2655j4389N5163q441
5969a873314J3479j3806j3179Q1968P6184N9138o4984m5430q985l108K4426k5721
5957a793332k5443m3399k1693M819k1697L2369J827k7096o9074k8342N7413K4671
5945a908977j4959j8645k2786O5159Q6655L4332m0145o3383l371N355J0292M7784
5933a822689O0332m0693n146N138q4660o9302j4081M4677J01889j9997K2076K5284
5921a797172N342n1164l7435K08K7800J0383p409K162M5124m516J6819k4538N397
5908a808999K6549O2158L5025l9517m7281j4126K646O757p291l9802K6995r523
$$ plain form
5993 -1830914 -1810027 -1812265 -1855690 -1843871 -1852021 -1914193 -1889336 -1885025 -1853567 -1892049 -1912979 -1897831
5981 -1897831 -1868967 -1820848 -1876762 -1832224 -1826502 -1865988 -1874094 -1862992 -1905647 -1920036 -1864873 -1873314
5969 -1873314 -1859835 -1873641 -1886820 -1804852 -1728668 -1669530 -1734514 -1779944 -1788929 -1792037 -1767611 -1793332
5957 -1793332 -1818775 -1862174 -1883867 -1879048 -1900745 -1868376 -1866549 -1893645 -1962719 -1991061 -1933648 -1908977
5945 -1908977 -1923936 -1942581 -1965367 -1900208 -1813553 -1779221 -1819366 -1882749 -1886120 -1880765 -1870473 -1822689
5933 -1822689 -1762357 -1803050 -1808196 -1803058 -1887718 -1957020 -1971101 -1926424 -1824535 -1844532 -1822456 -1797172
5921 -1797172 -1791830 -1842994 -1880429 -1880221 -1852421 -1842038 -1849447 -1847285 -1802161 -1806677 -1789858 -1814396 -1808999
5908 -1808999 -1782450 -1720292 -1685267 -1724784 -1772065 -1786191 -1783545 -1776788 -1784079 -1823881 -1796886 -1806409
5896a806409l2599q2081M950L9252O529J8854P1252R3117J3475J1142j1373q5567
5884a759458o8381K9185r522m7042p349N769k2741L8381M7658r858o36O8771m1716
5871a776939o1946l4693J9429K4956L5399J34530P758m5887o8194k9538M3710
5860a751415J801l179n6278j611Q493L5837K8023J734K0469K3948k8874q0611
5848a801663j3682M7061n2974m9307n93l3480J7150M7856K2606O2949L826m020
5836a754271l1331m2099n314N361L628J0726n290k3091l8577o987r118L1809N3573
5823a810981O8103n6127p8543J1055L1794k5251j5554L879N5457l50m2424j5958
5811a874900K4081L2749n3814L0822K0062M803K9051J5346L3242l729n4m2395
$$ plain form
5896 -1806409 -1839008 -1921089 -1916139 -1876887 -1870358 -1851504 -1780252 -1687135 -1673660 -1662518 -1673891 -1759458
5884 -1759458 -1827839 -1798654 -1808176 -1855218 -1862567 -1856798 -1879539 -1841158 -1793500 -1803358 -1803994 -1735223 -1776939
5871 -1776939 -1838885 -1873578 -1854149 -1829193 -1793794 -1659264 -1651506 -1697393 -1765587 -1795125 -1751415
5860 -1751415 -1749614 -1752793 -1809071 -1810682 -1802189 -1766352 -1738329 -1736595 -1716126 -1692178 -1721052 -1801663
5848 -1801663 -1815345 -1768284 -1821258 -1870565 -1871158 -1904638 -1887488 -1839632 -1817026 -1754077 -1750251 -1754271
5836 -1754271 -1785602 -1827701 -1833015 -1827654 -1824026 -1813300 -1818590 -1841681 -1880258 -1887245 -1896363 -1864554 -1810981
5823 -1810981 -1742878 -1799005 -1877548 -1866493 -1834699 -1859950 -1875504 -1871625 -1816168 -1816518 -1858942 -1874900
5811 -1874900 -1850819 -1818070 -1871884 -1841062 -1821000 -1816197 -1787146 -1771800 -1738558 -1742287 -1742341 -1784736
5799a784736q3172j5561L3152k4672l5533L7952N377P598M5352j2817l7523J869
5787a862714j0793N6906L0038J3327N8884l0670k9962K1961N970k4904l1706K239
5775a801424M1093M1503R557j9988j1976l3039j2058k0500N0635j2643L979N0947
5763a713914J007j3548r6576l3690J5181J3157k4288J2621J4200j7618J2377K4333
5751a806758O5425L7920l0783n0558n803l8334j9793L0807M7073L9910l2911m2823
5739a806628O408J8456L645l1426k2456J0148N246J5749l2825K0947O7492K8253
5727a716991j0888Q78k4862m4398n2349n516J6832L0151j7942L2634O105L9791
5715a746555P0628l972K9234j03877m6179K5132k4639O3864M2121J0965p1963
$$ plain form
5799 -1784736 -1867908 -1883469 -1850317 -1874989 -1910522 -1872570 -1867193 -1859595 -1814243 -1827060 -1864583 -1862714
5787 -1862714 -1873507 -1816601 -1786563 -1773236 -1714352 -1745022 -1774984 -1753023 -1747053 -1771957 -1803663 -1801424
5775 -1801424 -1760331 -1718828 -1709271 -1729259 -1741235 -1774274 -1786332 -1806832 -1756197 -1768840 -1764861 -1713914
5763 -1713914 -1712907 -1726455 -1823031 -1856721 -1841540 -1828383 -1852671 -1840050 -1825850 -1843468 -1831091 -1806758
5751 -1806758 -1741333 -1703413 -1734196 -1784754 -1790557 -1828891 -1848684 -1817877 -1770804 -1730894 -1763805 -1806628
5739 -1806628 -1800220 -1781764 -1778119 -1809545 -1832001 -1821853 -1816607 -1800858 -1833683 -1812736 -1745244 -1716991
5727 -1716991 -1727879 -1727001 -1751863 -1796261 -1848610 -1854126 -1837294 -1807143 -1825085 -1792451 -1786346 -1746555
5715 -1746555 -1675927 -1679899 -1650665 -1754542 -1800721 -1775589 -1800228 -1736364 -1694243 -1683278 -1755241
5704a755241j23443j441J2209R828N6878J5289n6177n0201J3717Q8892R6168P193
5692a686329j6432N240j1795J18M9802r380l1075P938J4795l0850l7226L0448
5680a714746n555j4542J5414l5683J3443N4338m2768j5819l139p2716K3298J3808
5668a784667M5445K7415K1478k0490m192Q393o4208p4685j5490N651M9942P5171
5656a730237J8043m7614K8559K7541K7982K3412K7380M0019j35692r6234K5325
5645a791516L0630j9486k3368K2402N9806j575K97L2424n2285l6454J8248M650
5633a756227L223j2550k1954R2094M1330K0228J1598j6603m3097j3873o030m091
5621a705952j0624M836k3255n385l0215j8311k9611P132J2098L221K0113M1356
$$ plain form
5704 -1755241 -1878684 -1880125 -1867916 -1858088 -1801210 -1785921 -1842098 -1892299 -1878582 -1789690 -1693522 -1686329
5692 -1686329 -1702761 -1697521 -1709316 -1709198 -1659396 -1668776 -1699851 -1691913 -1677118 -1707968 -1745194 -1714746
5680 -1714746 -1720301 -1734843 -1719429 -1755112 -1741669 -1687331 -1730099 -1745918 -1749057 -1821773 -1798475 -1784667
5668 -1784667 -1739222 -1711807 -1690329 -1710819 -1715011 -1706618 -1770826 -1845511 -1861001 -1855350 -1805408 -1730237
5656 -1730237 -1712194 -1759808 -1731249 -1703708 -1675726 -1652314 -1624934 -1584915 -1720607 -1816841 -1791516
5645 -1791516 -1760886 -1780372 -1803740 -1781338 -1721532 -1723107 -1722810 -1690386 -1742671 -1779125 -1760877 -1756227
5633 -1756227 -1753004 -1765554 -1787508 -1695414 -1654084 -1633856 -1622258 -1638861 -1681958 -1695831 -1701861 -1705952
5621 -1705952 -1716576 -1711740 -1734995 -1740380 -1770595 -1788906 -1818517 -1811385 -1799287 -1796066 -1775953 -1734597
5609a734597m7144l4442J5566L5836K3633J6730k5785Q7755M1276o4021J759p7808
5597a761242K9990K1967K5067M8977M1305k9395l2472L1258q654l2060l1197l9569
5585a736025n757j4740j408j3867J7166R1843L2496m6542k4308J4112k1537J0528
5573a698039j699J3397k2859L0595J6205L1701k8821K9229J2854J6512r4458j121
5561a696504L1865L1857J3029m3878q0110j0604N5890N0456M2535j2451m5094
5550a663009p0879M0583N7571q793k1782M817l4923L9595K4606J0532l3886k7304
5538a682872k0602m0612L178M0423P3422Q362M619k764l9571l1881M31o1586K4246
5525a725207R656n7824K4946O7054N2256j9681l151L3951M49n1094p4150Q056
$$ plain form
5609 -1734597 -1781741 -1816183 -1800617 -1764781 -1741148 -1724418 -1750203 -1662448 -1621172 -1685193 -1683434 -1761242
5597 -1761242 -1731252 -1709285 -1684218 -1635241 -1593936 -1623331 -1655803 -1624545 -1633199 -1665259 -1696456 -1736025
5585 -1736025 -1741782 -1756522 -1757930 -1771797 -1754631 -1662788 -1630292 -1676834 -1701142 -1687030 -1708567 -1698039
5573 -1698039 -1699738 -1686341 -1709200 -1678605 -1662400 -1630699 -1659520 -1630291 -1617437 -1600925 -1695383 -1696504
5561 -1696504 -1664639 -1632782 -1619753 -1663631 -1743741 -1754345 -1698455 -1647999 -1605464 -1617915 -1663009
5550 -1663009 -1733888 -1693305 -1635734 -1644527 -1666309 -1661492 -1696415 -1656820 -1632214 -1621682 -1655568 -1682872
5538 -1682872 -1703474 -1744086 -1740908 -1700485 -1627063 -1618701 -1614082 -1616846 -1656417 -1688298 -1687867 -1749453 -1725207
5525 -1725207 -1715551 -1773375 -1748429 -1681375 -1629119 -1648800 -1651951 -1618000 -1617551 -1668645 -1742795 -1734739
5513a734739J279L371L8938O3061N1099J7728p959K0834q388m6422l0716m4828
5501a676742M5121m4724j7421L4812L0843J2269k8738J5906k4244l5281J7349
5490a670850J2951K5382K2247m3581k0269j0200J9933J7691m4817n1900q958j1876
5478a764247P4873L8115M6263M6108m0815o7778l1448m0911J8538j518j062m0517
5466a764399N1233M5812K911R547K9001n2392k6303O4300N8356j4163k3346m7345
5454a666788l2397j3241j8933K8791p86M0412M7851J3465j7552p790M892l3973
5442a656049k166l0536k6523K2798L2184J0279J3448N0784j3663L9010j9281k7314
5430a607029o4961l431K0929J4430k1190J1457k2243m8451J0643N2637K0738N639
$$ plain form
5513 -1734739 -1733460 -1730089 -1691151 -1628090 -1576991 -1559263 -1567222 -1546388 -1554776 -1601198 -1631914 -1676742
5501 -1676742 -1631621 -1676345 -1693766 -1658954 -1628111 -1615842 -1644580 -1628674 -1652918 -1688199 -1670850
5490 -1670850 -1657899 -1632517 -1610270 -1653851 -1674120 -1684320 -1664387 -1646696 -1691513 -1743413 -1752371 -1764247
5478 -1764247 -1689374 -1651259 -1604996 -1558888 -1599703 -1667481 -1698929 -1739840 -1721302 -1722820 -1723882 -1764399
5466 -1764399 -1713166 -1667354 -1664443 -1654896 -1625895 -1678287 -1704590 -1640290 -1581934 -1596097 -1619443 -1666788
5454 -1666788 -1699185 -1712426 -1731359 -1702568 -1703354 -1662942 -1615091 -1601626 -1619178 -1626968 -1622076 -1656049
5442 -1656049 -1658215 -1688751 -1715274 -1692476 -1660292 -1650013 -1636565 -1585781 -1599444 -1560434 -1579715 -1607029
5430 -1607029 -1671990 -1675421 -1654492 -1640062 -1661252 -1649795 -1672038 -1720489 -1709846 -1657209 -1636471 -1630832
5418a630832L2634J9124k6102o6011m2746l4561k4172O3348M9270k4558L6965
5407a647641Q4663M6227m9780r8122j9946L1232k8199j4011M728M0463L0490K614
5395a617282m7066q967J6238m7859K6264P8234k2236j5227J1205J1388m7406J6257
5383a646457j4560L6361N6223M4575L9029J3444j01418q3686o503J0536j6501
5372a668957K2505k5973n6439j0429M1617M6142O2037o8374J6849J2283m9278
5361a678017J3841K7990q4126L6375O5771l1715K9965j39j7375K8883j78m9151
5349a657876P901M5553m053n8810J0316O5305m6024R781O6150L0456o0123m2342
5337a633766J7671L5442j1146j3881l1962N8505J7978J3340k2391l4465k0789
$$ plain form
5418 -1630832 -1598198 -1579074 -1605176 -1671187 -1713933 -1748494 -1772666 -1709318 -1660048 -1684606 -1647641
5407 -1647641 -1562978 -1516751 -1566531 -1664653 -1684599 -1653367 -1681566 -1695577 -1690849 -1650386 -1619896 -1617282
5395 -1617282 -1664348 -1673315 -1657077 -1704936 -1678672 -1600438 -1622674 -1637901 -1626696 -1615308 -1662714 -1646457
5383 -1646457 -1661017 -1624656 -1568433 -1523858 -1484829 -1471385 -1572803 -1656489 -1662992 -1652456 -1668957
5372 -1668957 -1646452 -1672425 -1728864 -1739293 -1697676 -1651534 -1589497 -1657871 -1641022 -1628739 -1678017
5361 -1678017 -1664176 -1636186 -1720312 -1683937 -1618166 -1649881 -1619916 -1620055 -1637430 -1608547 -1608725 -1657876
5349 -1657876 -1649975 -1604422 -1608475 -1667285 -1656969 -1591664 -1637688 -1627907 -1561757 -1531301 -1591424 -1633766
5337 -1633766 -1616095 -1580653 -1591799 -1605680 -1637642 -1579137 -1561159 -1547819 -1570210 -1604675 -1625464
5326a625464K3017N2824J4872L6693j0975j17196l1092J1140K1954J4282m9110
5315a659055l2968K7016N3934m8039m561K3157q366M240K4550k8958N8636J6384
5303a574030m6980M3966J641m9833j8880k6985j2921J9342K1528N5115Q0288r3
5291a507842r4994m2479J6975j8002j6724N1344M5913J7375m2275n9292k3877
5280a673878L5083J6935j0245m9120o2547N7181R3886j8073k2917L0863N2731
5269a550101k757J4015J0703j1411k3405L0130M8953j7728N269p6025l1014j8122
5257a621493j260p045K8545L159j8214J6722L9948N964K8330K6044l2056m7075
5245a578431K0614m5517K0310P8897k5392L0218K1823j7017m6419n0032p4181
$$ plain form
5326 -1625464 -1602447 -1549623 -1534751 -1498058 -1509033 -1626229 -1657321 -1646181 -1624227 -1609945 -1659055
5315 -1659055 -1692023 -1665007 -1611073 -1659112 -1663673 -1640516 -1648882 -1644642 -1620092 -1649050 -1590414 -1574030
5303 -1574030 -1621010 -1577044 -1575403 -1625236 -1644116 -1671101 -1684022 -1664680 -1643152 -1588037 -1507749 -1507842
5291 -1507842 -1602836 -1645315 -1628340 -1646342 -1663066 -1611722 -1565809 -1548434 -1590709 -1650001 -1673878
5280 -1673878 -1638795 -1621860 -1632105 -1681225 -1743772 -1686591 -1592705 -1610778 -1633695 -1602832 -1550101
5269 -1550101 -1552858 -1538843 -1528140 -1539551 -1562956 -1532826 -1483873 -1501601 -1496332 -1572357 -1603371 -1621493
5257 -1621493 -1622753 -1629798 -1601253 -1598094 -1616308 -1599586 -1559638 -1553674 -1525344 -1499300 -1531356 -1578431
5245 -1578431 -1557817 -1603334 -1583024 -1504127 -1529519 -1499301 -1477478 -1494495 -1540914 -1590946 -1665127
5234a665127r335Q0632R3560L8314m085m4343p7452K0390K454j13337l5085N1519
5222a661895O7632J1190j3505l423j034J4142L3593J6761l4665k8094K417r370
5210a606251K0608m516m5870m2772J3997k4098J9851K5881N2113k0911m0434M4178
5198a608224N2550o008k3648j4603P0800K2170j6788l8208k4553j6444J5446l0113
5186a617623L9916N4364Q306l5104q215n530k7298K7868J4703j1911j7264n5430
5174a633218p053K2672Q756N0610O0358j8919k5066M023m495l3553K4250K4424
5162a527211l6494j2182J2498Q741m9855O417N642j1515K13N1783o659Q475K3847
5149a526300j0231r7523l8875J7750J3283K1348K3641j3080j6922K4347l272M9474
$$ plain form
5234 -1665127 -1674462 -1593830 -1500270 -1461956 -1466041 -1510384 -1587836 -1567446 -1564992 -1678329 -1713414 -1661895
5222 -1661895 -1594263 -1583073 -1596578 -1600001 -1601035 -1586893 -1553300 -1536539 -1571204 -1599298 -1596881 -1606251
5210 -1606251 -1585643 -1590159 -1636029 -1678801 -1664804 -1688902 -1669051 -1643170 -1591057 -1611968 -1652402 -1608224
5198 -1608224 -1555674 -1561682 -1585330 -1599933 -1529133 -1506963 -1523751 -1561959 -1586512 -1602956 -1587510 -1617623
5186 -1617623 -1577707 -1523343 -1515037 -1550141 -1558356 -1563886 -1591184 -1563316 -1548613 -1560524 -1577788 -1633218
5174 -1633218 -1640271 -1617599 -1608843 -1558233 -1497875 -1516794 -1541860 -1537837 -1542332 -1575885 -1551635 -1527211
5162 -1527211 -1563705 -1575887 -1563389 -1554648 -1604503 -1598086 -1592444 -1603959 -1603746 -1551963 -1558622 -1550147 -1526300
5149 -1526300 -1536531 -1634054 -1672929 -1655179 -1641896 -1620548 -1596907 -1609987 -1626909 -1602562 -1605834 -1556360
5137a556360N1984p189j9187l6347K790L7463R576l850q002L35l3643j754L8857
5124a525327k3711m1931M659K7757j0455j5591m0696N2858M3250j0601k213Q8943
5112a453058K9966k1977j9490m4897m2739k7010K9237k808k5565m6618R327J1942
5100a603690J5515l7670n5361J09122O4009J5810j9295k9112m4790L5447k1022
5089a571037n3574m460N7537K6551r559l4585O192o688J5181J453m23k3341K0151
5076a576602p5804N4774N4706o580k2897L2989P733m8015M007M9604K3149o3056
5064a565992l3355L4318m7559j3405M5127j6135N9726R67j1347j0009J8641L2021
5052a507002l1236r231j163k3570k1845J7047k4668r041J9258K6444M5577J212
$$ plain form
5137 -1556360 -1504376 -1511565 -1530752 -1567099 -1564309 -1526846 -1517270 -1521120 -1529122 -1528787 -1562430 -1564184 -1525327
5124 -1525327 -1549038 -1590969 -1586310 -1558553 -1569008 -1584599 -1625295 -1572437 -1529187 -1539788 -1542001 -1453058
5112 -1453058 -1423092 -1445069 -1464559 -1509456 -1552195 -1579205 -1549968 -1552776 -1578341 -1624959 -1615632 -1603690
5100 -1603690 -1588175 -1625845 -1681206 -1572084 -1508075 -1492265 -1511560 -1540672 -1585462 -1550015 -1571037
5089 -1571037 -1624611 -1629071 -1571534 -1544983 -1554542 -1589127 -1582935 -1589623 -1574442 -1572989 -1573412 -1596753 -1576602
5076 -1576602 -1652406 -1597632 -1542926 -1549506 -1572403 -1539414 -1531681 -1579696 -1575689 -1526085 -1502936 -1565992
5064 -1565992 -1599347 -1565029 -1612588 -1625993 -1580866 -1597001 -1537275 -1536308 -1547655 -1557664 -1539023 -1507002
5052 -1507002 -1538238 -1547469 -1548632 -1572202 -1594047 -1577000 -1601668 -1610709 -1591451 -1565007 -1519430 -1518218
5040a518218k4751L4426r515q708K6159j5700Q892j3052m4557k8459L9147L9862
5028a514474J0962j4389k1717k3716j3K1213R5574M3419j8336k3613l9107n9320
5016a543517N3729k588q0420j4769O3391n1398l7460n418l9997O1867J14625J3196
5004a468759k1041o0397l2189O5170P0716k2160l2895l0906N031J1803r0417j6573
4992a622617M9221K1573O3243j1551p197m839R969N5523l4979n8897l8839n5954
4980a635344L2437M5888J1197l8843j9390j7313O6721K2789K7595p71l0463K7653
4968a507844r148m894L7128J0777k4118L3686j5532l1061J3972K6491j2276l3034
4956a515853J2799k4636k1501j1311l3774O1353K1941k390L3335K5892l6926J3196
$$ plain form
5040 -1518218 -1542969 -1508543 -1518058 -1526766 -1500607 -1516307 -1507415 -1520467 -1565024 -1593483 -1554336 -1514474
5028 -1514474 -1503512 -1517901 -1539618 -1563334 -1563347 -1542134 -1446560 -1403141 -1421477 -1445090 -1484197 -1543517
5016 -1543517 -1489788 -1492376 -1572796 -1587565 -1524174 -1575572 -1613032 -1618450 -1658447 -1596580 -1481955 -1468759
5004 -1468759 -1489800 -1550197 -1582386 -1517216 -1446500 -1468660 -1501555 -1532461 -1527430 -1515627 -1606044 -1622617
4992 -1622617 -1573396 -1551823 -1488580 -1500131 -1507328 -1512167 -1502198 -1446675 -1481654 -1540551 -1579390 -1635344
4980 -1635344 -1602907 -1557019 -1545822 -1584665 -1604055 -1621368 -1554647 -1531858 -1504263 -1505034 -1535497 -1507844
4968 -1507844 -1516992 -1521886 -1484758 -1473981 -1498099 -1464413 -1479945 -1511006 -1497034 -1470543 -1482819 -1515853
4956 -1515853 -1503054 -1527690 -1549191 -1560502 -1594276 -1532923 -1510982 -1513372 -1480037 -1454145 -1491071 -1477875
4944a477875M9j6953j6171l798l1248J0388l4455R964o079l7736K7758J6634o9649
4931a629171k1793L7203O8789R762N4229L3439m6687K1208n5796p2752M3880M3263
4919a514426r305K7540O558p785o9523P205l80L7868L9362J2297o003M9473j8585
4906a445704k1465j702k131K6449P93m863l9954n6695m3277N4916K4725L7840
4894a471068m1016J7837L6813N892l6783K4402j0942j6400o710r96K426O6187
4882a430358P6396L3366n0338k9345j0960r852k2729o0939k200L8549J4987o9731
4870a523154J2978N6660r506L2863J418L3014j3292l3218j1169J02740j1692o9639
4858a431997n9869o3287p937m7498Q607j5798l173J0854M4481J3822J7836L5431
$$ plain form
4944 -1477875 -1477826 -1494779 -1510950 -1514748 -1545996 -1535608 -1570063 -1560099 -1566178 -1603914 -1576156 -1559522 -1629171
4931 -1629171 -1650964 -1613761 -1544972 -1535210 -1480981 -1447542 -1494229 -1473021 -1528817 -1601569 -1557689 -1514426
4919 -1514426 -1523731 -1496191 -1489633 -1497418 -1566941 -1559736 -1560116 -1522248 -1482886 -1470589 -1476592 -1427119 -1445704
4906 -1445704 -1467169 -1468871 -1471002 -1444553 -1443760 -1448623 -1488577 -1545272 -1588549 -1533633 -1508908 -1471068
4894 -1471068 -1512084 -1494247 -1457434 -1451542 -1488325 -1463923 -1474865 -1491265 -1497975 -1498971 -1496545 -1430358
4882 -1430358 -1353962 -1320596 -1370934 -1400279 -1411239 -1421091 -1443820 -1504759 -1506959 -1468410 -1453423 -1523154
4870 -1523154 -1510176 -1453516 -1463022 -1430159 -1428741 -1395727 -1409019 -1442237 -1453406 -1350666 -1362358 -1431997
4858 -1431997 -1491866 -1555153 -1563090 -1610588 -1601981 -1617779 -1620952 -1610098 -1565617 -1551795 -1533959 -1498528
4846a498528k0772l4604l7951J0200N3097L8318J9240J8800K4232o1126n4146
4835a543240M222M3679q89q2545l3509K8318j6107L2638P6878K6955m2625n9906
4823a566131J0945L5256R2203O1277k7838p4668k1401j453m2190K8433Q53N035
4811a499679L2572M379m346N841j2859k604M1959L5568j5551j7125j6612K9994
4799a418463M90k899K4403O480l8381m6160J1183M105K3978q537K6685m7718k1015
4786a485849l8214j5645O3700j5593K1323K6239P23L1021L0427q126r7677m6144
4774a533815K0278j5812K0535Q7368j7821m1119J857k87j6949j5618N1390N5488
4762a404505j607m4290n496N108K476k214R603K3070J0097q6157o2809R1947L9089
$$ plain form
4846 -1498528 -1519300 -1553904 -1591855 -1581655 -1528558 -1490240 -1471000 -1452200 -1427968 -1489094 -1543240
4835 -1543240 -1539018 -1495339 -1496228 -1578773 -1612282 -1583964 -1600071 -1567433 -1490555 -1463600 -1506225 -1566131
4823 -1566131 -1555186 -1519930 -1427727 -1366450 -1394288 -1468956 -1490357 -1491810 -1534000 -1505567 -1504714 -1499679
4811 -1499679 -1467107 -1462728 -1467074 -1461233 -1474092 -1476696 -1434737 -1399169 -1414720 -1431845 -1448457 -1418463
4799 -1418463 -1417973 -1420872 -1396469 -1389989 -1428370 -1474530 -1463347 -1459242 -1435264 -1443801 -1417116 -1464834 -1485849
4786 -1485849 -1524063 -1539708 -1476008 -1491601 -1470278 -1444039 -1443316 -1412295 -1381868 -1389994 -1487671 -1533815
4774 -1533815 -1513537 -1529349 -1508814 -1421446 -1439267 -1480386 -1478529 -1478816 -1495765 -1511383 -1459993 -1404505
4762 -1404505 -1406112 -1450402 -1455898 -1450790 -1448314 -1450528 -1440925 -1417855 -1407758 -1493915 -1556724 -1464777 -1425688
4749a425688k1895N3241J91l77m1984p4362J4187J9619k467m2029j7268K4536
4737a514296m8993p012L341O047k7874j2092K6326P6076J6717m2842p127M9431
4725a482298o401l269J3109N4126j4231k8197K1526K8114k0588q856n6040k1225
4713a524230N222Q3604R9925j6612o2296m4415k1318K102K7166N4075M9017p536
4701a355296k726j103k569R293k7155k3065n4120K4906N075K1553l5600K0089
4689a420718k7214P765N3242L5653n6084k7915K0333m4853J1818K2878j5165N2761
4677a387499L0088j8616J231o0484j6169K6859r661L4882K5617m9415j9387M9286
4665a393268J0427l2660L5504p3m3371j8503l2241q3406p857L4317R9070J07981
$$ plain form
4749 -1425688 -1447583 -1394342 -1394151 -1394528 -1436512 -1510874 -1496687 -1477068 -1479535 -1521564 -1538832 -1514296
4737 -1514296 -1563289 -1570301 -1566960 -1560913 -1588787 -1600879 -1574553 -1498477 -1481760 -1524602 -1531729 -1482298
4725 -1482298 -1488699 -1491968 -1478859 -1424733 -1438964 -1467161 -1445635 -1417521 -1438109 -1446965 -1503005 -1524230
4713 -1524230 -1519008 -1435404 -1335479 -1352091 -1414387 -1458802 -1480120 -1478018 -1450852 -1396777 -1347760 -1355296
4701 -1355296 -1358022 -1359125 -1361694 -1352401 -1379556 -1402621 -1456741 -1431835 -1426760 -1405207 -1440807 -1420718
4689 -1420718 -1447932 -1440167 -1386925 -1351272 -1407356 -1435271 -1414938 -1459791 -1447973 -1425095 -1440260 -1387499
4677 -1387499 -1357411 -1376027 -1374796 -1435280 -1451449 -1424590 -1434251 -1399369 -1373752 -1423167 -1442554 -1393268
4665 -1393268 -1382841 -1415501 -1379997 -1380070 -1423441 -1441944 -1474185 -1557591 -1565448 -1531131 -1432061 -1324080
4653a324080j131k8411m6846l8129r926j3487L0020M234K9444Q4840N581k5821
4641a333712k4719j8771j2205m4892j7372P88L4099N1134P0903l5763o9675k5946
4629a426131M0639L2054l4339l608m20l0350m0241k8740M936O1914N9309j1717
4617a376694l1461k6585k4646m0563M7577j7868Q918L0974q8033l240k1617M1802
4605a501436M1945M9230l6324o9430m2290M3228N6507K5500m239k567K617K1099
4593a416160N077J3608L2136L0598L92q7823O530K1832j1418n0591l7898O698
4581a487019L4582P270k1055l1974R052J5838j2575K484j4978k3821L3113N9301
4569a429782M3312P961J7227n085Q178K1753j2819n9111n3049M9758l2444k5933
$$ plain form
4653 -1324080 -1325211 -1353622 -1400468 -1438597 -1448523 -1462010 -1431990 -1427756 -1398312 -1313472 -1307891 -1333712
4641 -1333712 -1358431 -1377202 -1389407 -1434299 -1451671 -1450883 -1416784 -1365650 -1294747 -1330510 -1400185 -1426131
4629 -1426131 -1385492 -1353438 -1387777 -1391385 -1391805 -1422155 -1462396 -1491136 -1486200 -1424286 -1364977 -1376694
4617 -1376694 -1408155 -1434740 -1459386 -1499949 -1452372 -1470240 -1461322 -1430348 -1518381 -1521621 -1543238 -1501436
4605 -1501436 -1459491 -1410261 -1446585 -1516015 -1558305 -1515077 -1458570 -1433070 -1437309 -1439876 -1437259 -1416160
4593 -1416160 -1411083 -1397475 -1365339 -1334741 -1334349 -1422172 -1415642 -1393810 -1405228 -1455819 -1493717 -1487019
4581 -1487019 -1452437 -1445167 -1466222 -1498196 -1489144 -1473306 -1485881 -1483397 -1498375 -1522196 -1489083 -1429782
4569 -1429782 -1386470 -1378509 -1361282 -1366367 -1358189 -1336436 -1349255 -1408366 -1461415 -1411657 -1444101 -1470034
4557a470034K3668Q0787L9171J5681N039j2728n8773j8662k5904j1400m1846j6468
4545a491469k6036j3054K768L6684L9526M1610N2847M2897L1885k0874k9079P104
4533a325191J1726O890o0678m6557q143J2921M1984k8128L1575L8259j3907k4583
4521a363832o7634m8904k1885J3530L9856O896l162N2822l991k9951k7336m520
4509a458111L0560L1847R126O682k230K1062O1931K3170k4061k9972o7280K6897
4497a370379Q7638K9795n0245m2387n4941n9389R639L2704J9525k4627j3816N3584
4485a382899n8478l8972j3859K8770K9057j632n95M5278k9280m266N2948M1002
4473a332926L5156q5320q876P1297j7244m9386m0175M5091O9881j2741j8622q949
$$ plain form
4557 -1470034 -1446366 -1365579 -1326408 -1310727 -1305688 -1318416 -1377189 -1395851 -1421755 -1433155 -1475001 -1491469
4545 -1491469 -1517505 -1530559 -1527791 -1491107 -1451581 -1409971 -1357124 -1314227 -1282342 -1303216 -1332295 -1325191
4533 -1325191 -1313465 -1306575 -1367253 -1413810 -1421953 -1409032 -1367048 -1395176 -1363601 -1325342 -1339249 -1363832
4521 -1363832 -1431466 -1480370 -1502255 -1488725 -1448869 -1441973 -1445135 -1392313 -1396304 -1426255 -1453591 -1458111
4509 -1458111 -1427551 -1395704 -1386578 -1379896 -1382126 -1361064 -1299133 -1275963 -1300024 -1329996 -1397276 -1370379
4497 -1370379 -1282741 -1252946 -1303191 -1345578 -1400519 -1459908 -1450269 -1417565 -1398040 -1422667 -1436483 -1382899
4485 -1382899 -1441377 -1480349 -1494208 -1465438 -1436381 -1438013 -1438608 -1393330 -1422610 -1426876 -1373928 -1332926
4473 -1332926 -1297770 -1383090 -1391966 -1320669 -1337913 -1387299 -1427474 -1382383 -1312502 -1325243 -1343865 -1352814
4461a352814j0048l4685L9559M0874m2393j0762m6501O913Q0343J9639p0615m8117
4449a428607J5037N867L8484J3234J2598j6860p7915n7537L9921o69J9719M5719
4437a391009k700N5672j6272k2058J7070O8971J4850l7519o1296l9181j5285k860
4425a431617K7809Q3717K2413p0636p6853N103k7123n8747N6650J23107K7482
4414a318695p194l6659n8295j2976p135P286J5197K9184k0469m1292j3478K4077
4402a440449R3984K0733j7020K9905J3763o165k544j129P191l8333n522M6986
4390a298600j1078k775o0209j1715k1911k2110N4069P20K8227m1349o3259M3954
4378a406036L670M8142N2332n875l4699n7990J0690O5487k8793o9698n701P5546
$$ plain form
4461 -1352814 -1362862 -1397547 -1357988 -1317114 -1359507 -1370269 -1416770 -1409857 -1329514 -1309875 -1380490 -1428607
4449 -1428607 -1413570 -1407703 -1369219 -1355985 -1343387 -1360247 -1438162 -1495699 -1455778 -1456447 -1436728 -1391009
4437 -1391009 -1393709 -1338037 -1354309 -1376367 -1359297 -1290326 -1275476 -1312995 -1374291 -1413472 -1428757 -1431617
4425 -1431617 -1403808 -1320091 -1297678 -1368314 -1445167 -1440064 -1467187 -1525934 -1469284 -1346177 -1318695
4414 -1318695 -1325889 -1362548 -1420843 -1433819 -1440954 -1433668 -1418471 -1389287 -1409756 -1451048 -1464526 -1440449
4402 -1440449 -1346465 -1325732 -1342752 -1312847 -1299084 -1305249 -1307793 -1308922 -1301731 -1340064 -1345586 -1298600
4390 -1298600 -1309678 -1312453 -1372662 -1384377 -1406288 -1428398 -1374329 -1373609 -1345382 -1386731 -1449990 -1406036
4378 -1406036 -1402366 -1354224 -1301892 -1307767 -1342466 -1400456 -1389766 -1324279 -1353072 -1422770 -1428471 -1352925
4366a352925L3885l1513K3028q620j4854K8998n3549n9236K9645O4997M6920K1850
4354a271374K1039R967q3107m8512K6721P7293K8516l1471k6095J8025K9536o4517
4342a313979n0710J1877L4116J1948O793j5693n9925J8783L4016O832k7250k6950
4330a370142j2942r222L4674N8079r406m2374m9148J7135l1022K62K2881o626
4318a397851O358M0519J4967m6108K9777K5053l1338n4442M6042M4496l0875m4140
4306a397542O652P2753J5027k4222j3737j2927Q697l0001l4335J9132n921j1326
4294a407750q7245K1860O3261L4088p521N683N9428J8413m78J3352J8080o4523
4282a333352l4704L8990P122K6408j4344J4401L890k1846k0688m349k3036O748
$$ plain form
4366 -1352925 -1319040 -1350553 -1327525 -1336145 -1350999 -1322001 -1375550 -1434786 -1405141 -1340144 -1293224 -1271374
4354 -1271374 -1250335 -1240368 -1323475 -1371987 -1345266 -1267973 -1239457 -1270928 -1297023 -1278998 -1249462 -1313979
4342 -1313979 -1364689 -1352812 -1318696 -1306748 -1299955 -1315648 -1375573 -1356790 -1322774 -1315942 -1343192 -1370142
4330 -1370142 -1383084 -1392306 -1357632 -1299553 -1308959 -1351333 -1400481 -1383346 -1414368 -1414106 -1391225 -1397851
4318 -1397851 -1391493 -1350974 -1336007 -1382115 -1352338 -1327285 -1358623 -1413065 -1367023 -1322527 -1353402 -1397542
4306 -1397542 -1390890 -1318137 -1303110 -1327332 -1341069 -1353996 -1345299 -1375300 -1409635 -1390503 -1396424 -1407750
4294 -1407750 -1494995 -1473135 -1409874 -1375786 -1383307 -1377624 -1318196 -1299783 -1300261 -1286909 -1268829 -1333352
4282 -1333352 -1368056 -1329066 -1321944 -1295536 -1309880 -1295479 -1291589 -1313435 -1334123 -1338472 -1361508 -1354760
4270a354760m9238p162M2770l7974l0603N7527M6129M2817L9408n6734k7918j4151
4258a349889K9k0517j6960K2078K0614K3002l3516O704K4241k713L9854k3610
4246a310683m8071l0046N7851j715j9036n7702l8569M3690L8591m710k1594K3858
4234a368136K3062M7788J9110j4468Q103J636l8081l4632j2950n632k1584k7772
4222a423556O0602P3580J4150k94N1441j5011j7547m1513r3890L2705L1578P6967
4210a250788L3951l8463k6365m9973J6559o601J1439k9318m1223N6797K9187L585
4198a291213j3026k330m292J9228j5702m9960o8245L9452M2473M3129N2990k2543
4186a270039l0753o6052k3308P7316J3388K4457r747n7031l0084P4989M3484m7270
$$ plain form
4270 -1354760 -1403998 -1411160 -1368390 -1406364 -1436967 -1379440 -1333311 -1290494 -1251086 -1307820 -1335738 -1349889
4258 -1349889 -1349860 -1370377 -1387337 -1365259 -1344645 -1321643 -1355159 -1348455 -1324214 -1326927 -1287073 -1310683
4246 -1310683 -1358754 -1388800 -1330949 -1332664 -1351700 -1409402 -1447971 -1404281 -1365690 -1370400 -1391994 -1368136
4234 -1368136 -1345074 -1297286 -1278176 -1292644 -1284541 -1282905 -1320986 -1355618 -1368568 -1374200 -1395784 -1423556
4222 -1423556 -1362954 -1289374 -1275224 -1275518 -1224077 -1239088 -1256635 -1298148 -1392038 -1359333 -1327755 -1250788
4210 -1250788 -1216837 -1255300 -1281665 -1331638 -1315079 -1321680 -1310241 -1339559 -1380782 -1323985 -1294798 -1291213
4198 -1291213 -1304239 -1306569 -1310861 -1291633 -1307335 -1357295 -1425540 -1386088 -1343615 -1300486 -1247496 -1270039
4186 -1270039 -1300792 -1366844 -1390152 -1312836 -1299448 -1274991 -1284738 -1341769 -1371853 -1296864 -1253380 -1300650
4174a300650l0786J385K7935L213n0282J2585O875J6276j4688o525N2089j302
4162a283875K4547r726n4126j7470L0174l6936l1408r489P3505J3742J7093m6810
4150a330779O470N1952k7230n1371j7107L3666J0764k0924N0520K1101j6606J1843
4138a277701P909M007k0012j6707K4628j7094M0561L5392n0837j1612m2023j5885
4126a339374M9857K3538R514m612k559k8095l87O4779R007l1297Q351J762r8165
4113a337681k2615P5156p687q8952L9314k1459j3550J7129J937p416L5709L1835
4101a298280L4676K7315o4344o3713j096j9208M9954L9243M0512K6336o0813q257
4089a297675j0289n665K2529n68M7046o053k1300k5507j4651m225l1152L7549
$$ plain form
4174 -1300650 -1331436 -1330051 -1302116 -1298903 -1349185 -1336600 -1329725 -1313449 -1328137 -1334662 -1282573 -1283875
4162 -1283875 -1259328 -1269054 -1323180 -1340650 -1310476 -1347412 -1378820 -1388309 -1314804 -1301062 -1283969 -1330779
4150 -1330779 -1324309 -1272357 -1299587 -1350958 -1368065 -1334399 -1323635 -1344559 -1294039 -1272938 -1289544 -1277701
4138 -1277701 -1269792 -1265785 -1285797 -1302504 -1277876 -1294970 -1254409 -1219017 -1269854 -1281466 -1323489 -1339374
4126 -1339374 -1289517 -1265979 -1256465 -1261077 -1263636 -1291731 -1292118 -1227339 -1218332 -1249629 -1241278 -1239516 -1337681
4113 -1337681 -1360296 -1285140 -1292827 -1381779 -1342465 -1363924 -1377474 -1360345 -1358408 -1365824 -1330115 -1298280
4101 -1298280 -1263604 -1236289 -1300633 -1364346 -1365442 -1384650 -1334696 -1295453 -1254941 -1228605 -1289418 -1297675
4089 -1297675 -1307964 -1313629 -1291100 -1291668 -1244622 -1250675 -1271975 -1297482 -1312133 -1316358 -1347510 -1309961
4077a309961L1327K3975K7329q49l8088l2596k7840K7427N9332j1750k2792k373
4065a276859l4177L5885J3829l6337q4081j9820P0174N9198J278k6310p166N0492
4053a253894K2186K05J3520j8986J0865j1102k4459J0712l1963J450M0006l0149
4041a271609L9683N2013n3360j2524L4170M4335J1629o643o7780k0381k18o0675
4029a311360m1635K4428l2017L6673O5920K5501r098m635k6072p2837p857N5387
4017a297602J2875L988J0440k2549l6951J6951j6395O872J0771L0617O3634Q193
4005a209156n5437n0919J5585M2820l0307n1719J7430J3099k7438j0704N3461
3994a293285O4209l8298l5788R963j0594k5992n345P3398O6106J792l6895l1558
$$ plain form
4077 -1309961 -1278634 -1254659 -1227330 -1228179 -1266267 -1298863 -1326703 -1299276 -1239944 -1251694 -1274486 -1276859
4065 -1276859 -1311036 -1275151 -1261322 -1297659 -1381740 -1401560 -1331386 -1272188 -1270910 -1297220 -1304386 -1253894
4053 -1253894 -1231708 -1231503 -1217983 -1236969 -1226104 -1237206 -1261665 -1250953 -1282916 -1281466 -1241460 -1271609
4041 -1271609 -1231926 -1179913 -1233273 -1245797 -1211627 -1167292 -1155663 -1162306 -1230086 -1250467 -1250685 -1311360
4029 -1311360 -1352995 -1328567 -1360584 -1323911 -1257991 -1232490 -1241588 -1246223 -1272295 -1345132 -1352989 -1297602
4017 -1297602 -1284727 -1280739 -1270299 -1292848 -1329799 -1312848 -1329243 -1322371 -1311600 -1280983 -1217349 -1209156
4005 -1209156 -1264593 -1315512 -1299927 -1257107 -1287414 -1339133 -1321703 -1308604 -1336042 -1346746 -1293285
3994 -1293285 -1229076 -1267374 -1303162 -1293199 -1303793 -1329785 -1335130 -1261732 -1195626 -1193834 -1230729 -1262287
3982a262287l307q6466K7036O2051l7448L7942M6664m0089M4423K3537P660L7978
3970a142306k7292o3493M262J1008L9014j0551j7484n0789l6630o6298l6485n15
3958a397559J8927J8529P0602L3092m2340J617o778j8693J2961L9890L1825j0638
3946a248565o3940k2265K502O2452Q6690J9163L3686l5886p5569m4816l3603j3472
3934a333623L0817K0015j9473O3481M8604L6612k7636k6808m4871k168j6715k5081
3922a296846K4745j5797l0390N7100M5028o5924o4994N798r713Q829L7973n257
3910a309448m2840Q271M7935N1843l473j3647j8574n789L7572L1164l4936k6502
3898a278424q745k1013j2500O6561L092p0453J9334K1705K6700N7212k9949j9964
$$ plain form
3982 -1262287 -1265594 -1352060 -1325024 -1262973 -1300421 -1262479 -1215815 -1255904 -1211481 -1187944 -1180284 -1142306
3970 -1142306 -1169598 -1233091 -1228829 -1217821 -1178807 -1189358 -1206842 -1257631 -1294261 -1360559 -1397044 -1397559
3958 -1397559 -1378632 -1360103 -1289501 -1256409 -1298749 -1297132 -1303910 -1322603 -1309642 -1269752 -1237927 -1248565
3946 -1248565 -1312505 -1334770 -1332268 -1269816 -1183126 -1163963 -1130277 -1166163 -1241732 -1286548 -1320151 -1333623
3934 -1333623 -1302806 -1282791 -1302264 -1238783 -1190179 -1153567 -1181203 -1208011 -1252882 -1255050 -1271765 -1296846
3922 -1296846 -1272101 -1287898 -1318288 -1261188 -1216160 -1282084 -1347078 -1341280 -1350993 -1342164 -1304191 -1309448
3910 -1309448 -1352288 -1344017 -1296082 -1244239 -1247712 -1261359 -1279933 -1285722 -1248150 -1216986 -1251922 -1278424
3898 -1278424 -1287169 -1308182 -1320682 -1254121 -1251029 -1321482 -1302148 -1280443 -1253743 -1196531 -1226480 -1246444
3886a246444m792N0673p160o2129M5098M304J3842l1176m3573M2652p3716o108
3874a318529O6471r578j6726l064M6303K835l2931l8298j2817J0105J3919l0902
3862a323212K4895R5514p641l1468j5272k4013O7557L0750N7550m9969o4153n9545
3850a299007K8830N7783o5082l6441O6083N4122m4596K9038K7699l3965j7358
3839a232894j1511n781m0693O549p189J6832p185N555M6916l4781m8383K1758
3827a290807Q5552j5414l6034j7519n26n1442j8854l231k5684J6872L8056l3434
3815a352465K0179O0671K6629l5763j3329J3471j347K196k1992l0287k4612K6110
3803a330539k1073j6825O922M0271k9151J4439q410K8191L2669O312q152J0429
$$ plain form
3886 -1246444 -1251236 -1200563 -1207723 -1269852 -1224754 -1220450 -1206608 -1237784 -1281357 -1238705 -1312421 -1318529
3874 -1318529 -1252058 -1261636 -1278362 -1281426 -1235123 -1232288 -1265219 -1303517 -1316334 -1306229 -1292310 -1323212
3862 -1323212 -1298317 -1202803 -1210444 -1241912 -1257184 -1281197 -1213640 -1182890 -1125340 -1175309 -1239462 -1299007
3850 -1299007 -1270177 -1212394 -1277476 -1313917 -1247834 -1193712 -1238308 -1209270 -1181571 -1215536 -1232894
3839 -1232894 -1244405 -1250186 -1290879 -1284330 -1291519 -1274687 -1281872 -1276317 -1229401 -1264182 -1312565 -1290807
3827 -1290807 -1205255 -1220669 -1256703 -1274222 -1274748 -1326190 -1345044 -1348275 -1373959 -1357087 -1319031 -1352465
3815 -1352465 -1332286 -1271615 -1244986 -1280749 -1294078 -1280607 -1281954 -1279758 -1301750 -1332037 -1356649 -1330539
3803 -1330539 -1351612 -1368437 -1361515 -1321244 -1350395 -1335956 -1344366 -1316175 -1283506 -1277194 -1285346 -1274917
3791a274917k4625L4781K9075N0506j4966o5966M157L4457R561k1469J1114j6610
3779a244902j8957k3529k06L9593k782k9848L9377M1099L7319j521l3264k8236
3767a225857j6324j5963L0617K5370n7071j9426N8762k5475l002r569J740l611
3755a259809k3336R232O266m0040K895P4608L5964l1436m9631q2558J348M0447
3743a316050K2893J0061K8449J1082M3766N629N607n062k1794o034J3956n7976
3731a265473J1424K0259K2822L4907O6249p7222k9042R05J8490l6923k1633N600
3719a249637L5792K5212J8779p9249j3758m947J3060k4788J7863l0808L9145l3707
3707a287043l1236k249L3852N8900J2683J6497l7739l513J0043J5205j7619J9962
$$ plain form
3791 -1274917 -1299542 -1264761 -1235686 -1185180 -1200146 -1266112 -1261955 -1227498 -1217937 -1239406 -1228292 -1244902
3779 -1244902 -1263859 -1287388 -1287594 -1248001 -1250783 -1280631 -1241254 -1200155 -1162836 -1164357 -1197621 -1225857
3767 -1225857 -1242181 -1258144 -1227527 -1202157 -1259228 -1278654 -1219892 -1245367 -1248369 -1257938 -1256198 -1259809
3755 -1259809 -1283145 -1273913 -1267647 -1307687 -1304792 -1230184 -1194220 -1225656 -1275287 -1357845 -1356497 -1316050
3743 -1316050 -1293157 -1283096 -1254647 -1243565 -1199799 -1194170 -1188563 -1193625 -1215419 -1221453 -1207497 -1265473
3731 -1265473 -1254049 -1233790 -1210968 -1176061 -1109812 -1187034 -1216076 -1215171 -1196681 -1233604 -1255237 -1249637
3719 -1249637 -1213845 -1188633 -1169854 -1249103 -1262861 -1267808 -1254748 -1279536 -1261673 -1292481 -1253336 -1287043
3707 -1287043 -1318279 -1320528 -1286676 -1227776 -1215093 -1198596 -1236335 -1239848 -1229805 -1214600 -1232219 -1212257
3695a212257o3500j0683M2289L5451K327Q146K6598N2681M8497q1741q1990N1141
3683a183041M8918K3380J5092Q045n5357j14658l4711o1J1908L4559o6038J9005
3671a292959K5815m1769N4563L5371k176l17Q420Q320O001P119J7177L1740k7742
3658a170437m9388r161K362K6629N2336k4352k7498o1543k2627r218k4865Q300
3646a309462K4374Q0872N7439j8048k4709m6162L6979O0240l2146r3355J7831
3635a246147L0052L3402q0229o6508J7482m0136j8559N4550R1133L8939k0062
3624a206083k689j7926J1906o727l460R332k8841J4788O6257J8902j2872k1585
3612a178998o9053L0917L1787l8879n796j6225k1855M2394k8679k9853J5834L3872
$$ plain form
3695 -1212257 -1275757 -1286440 -1244151 -1208700 -1206373 -1198227 -1171629 -1118948 -1070451 -1152192 -1234182 -1183041
3683 -1183041 -1134123 -1110743 -1095651 -1087606 -1142963 -1257621 -1292332 -1292393 -1280485 -1245926 -1311964 -1292959
3671 -1292959 -1267144 -1308913 -1254350 -1218979 -1221155 -1221472 -1213052 -1204732 -1198731 -1191612 -1174435 -1142695 -1170437
3658 -1170437 -1219825 -1228986 -1226624 -1199995 -1147659 -1172011 -1199509 -1261052 -1283679 -1292897 -1317762 -1309462
3646 -1309462 -1285088 -1204216 -1146777 -1164825 -1189534 -1235696 -1198717 -1138477 -1170623 -1263978 -1246147
3635 -1246147 -1216095 -1182693 -1262922 -1329430 -1311948 -1352084 -1370643 -1316093 -1224960 -1186021 -1206083
3624 -1206083 -1208772 -1226698 -1214792 -1221519 -1224979 -1215647 -1244488 -1229700 -1163443 -1144541 -1157413 -1178998
3612 -1178998 -1248051 -1217134 -1185347 -1224226 -1230022 -1246247 -1268102 -1225708 -1254387 -1284240 -1268406 -1234534
3600a234534j4195K56r432J6356L5869K9438N4949n759o1233j1936l4780n316
$$ plain form
3600 -1234534 -1248729 -1248473 -1257905 -1241549 -1205680 -1176242 -1121293 -1127052 -1188285 -1200221 -1235001 -1240317
$$ [...]
##END NTUPLES=NMR SPECTRUM
##END=
