##TITLE=Analysis number 326676
Compound Code cc 63909
Book Reference 470/164
Project Code adrs
Chemist Name mikem
##JCAMPDX= 6.0         $$ Bruker NMR JCAMP-DX V2.0
##DATA TYPE= NMR SPECTRUM
##DATA CLASS= NTUPLES
##ORIGIN= Bruker BioSpin GmbH
##OWNER= nmr
$$ XWIN-NMR		Version 3.5
$$ Fri Feb 16 11:50:34 2007 GMT Standard Time (UT+0h)  MAYBRIDGE\nmr@NMR_250MHZ
##.OBSERVE FREQUENCY= 250.131544655141
##.OBSERVE NUCLEUS= ^1H
##.ACQUISITION MODE= SIMULTANEOUS (DQD)
##.ACQUISITION SCHEME= undefined
##.AVERAGES= 16
##.DIGITISER RES= 18
##SPECTROMETER/DATA SYSTEM= dpx250
##.PULSE SEQUENCE= zg30
##.SOLVENT NAME= CDCl3
##.SHIFT REFERENCE= (INTERNAL, CDCl3, 0, 16.4564)
##AUDIT TRAIL= $$ (NUMBER, WHEN, WHO, WHERE, WHAT)
$$ ##TITLE= Audit trail, XWIN-NMR		Version 3.5
$$ ##JCAMPDX= 5.01
$$ ##ORIGIN= Bruker BioSpin GmbH
$$ ##OWNER= nmr
$$ C:\u/data/dgb/nmr/ADRS/1090/pdata/1/auditp.txt
$$ ##AUDIT TRAIL=  $$ (NUMBER, WHEN, WHO, WHERE, WHAT)
(   1,<2007-02-16 11:49:58.82 +000>,<MAYBRIDGE\nmr>,<NMR_250MHZ>,
      <created by zg, POWCHK disabled, PULCHK disabled
       configuration hash MD5:
       49 4B E0 1D 92 C2 6B 37 9F E6 65 BC 52 41 86 1D
       data hash MD5: 64K
       F1 EA 7D 07 0D 39 DE B7 B6 47 14 CC 38 2D D8 00>)
(   2,<2007-02-16 11:50:17.14 +000>,<MAYBRIDGE\nmr>,<NMR_250MHZ>,
      <Start of raw data processing
       ef LB = 0.3 FT_mod = 6 PKNL = 1 SI = 32K 
       data hash MD5: 32K
       F1 15 E7 60 E3 0B 1D 9A 33 AD 35 FB FF A9 48 17>)
(   3,<2007-02-16 11:50:22.10 +000>,<MAYBRIDGE\nmr>,<NMR_250MHZ>,
      <apk 
       data hash MD5: 32K
       8B 44 C8 DB 1C 77 2C 71 EE 9C 54 A2 D2 2E 2A 03>)
(   4,<2007-02-16 11:50:23.61 +000>,<MAYBRIDGE\nmr>,<NMR_250MHZ>,
      <abs ABSG = 5 
       data hash MD5: 32K
       75 88 25 EF F0 17 3A FE 0E 02 FA D1 70 22 72 28>)
$$ ##END=
$$ 
$$ hash MD5
$$ CA DE BF EC 28 2C ED 10 30 AA FC B7 5F A7 08 93
##$RELAX= 
##$RELAX= 
##$RELAX= 
##$RELAX= 
##$RELAX= 
##$RELAX= 
##$RELAX= 
$$ Bruker specific parameters
$$ --------------------------
##$DU= <C:\u>
##$EXPNO= 1090
##$NAME= <ADRS>
##$PROCNO= 1
##$TYPE= <nmr>
##$USER= <dgb>
##$AMP= (0..31)
100 100 100 100 100 100 100 100 100 100 100 100 100 100 100 100 100 100 
100 100 100 100 100 100 100 100 100 100 100 100 100 100 
##$AQSEQ= 0
##$AQ_mod= 3
##$AUNM= <au_zg>
##$AUTOPOS= <52 >
##$BF1= 250.13
##$BF2= 250.13
##$BF3= 250.13
##$BF4= 250.13
##$BF5= 500.13
##$BF6= 500.13
##$BF7= 500.13
##$BF8= 500.13
##$BYTORDA= 1
##$CFDGTYP= 0
##$CFRGTYP= 5
##$CHEMSTR= <none>
##$CNST= (0..31)
1 1 145 1 1 1 1 1 1 1 1 1 1 1 1 1 1 1 1 1 1 1 1 1 1 1 1 1 1 1 1 1 
##$CPDPRG= <>
##$CPDPRG1= <>
##$CPDPRG2= <>
##$CPDPRG3= <>
##$CPDPRG4= <mlev>
##$CPDPRG5= <mlev>
##$CPDPRG6= <mlev>
##$CPDPRG7= <mlev>
##$CPDPRG8= <mlev>
##$CPDPRGB= <>
##$CPDPRGT= <>
##$D= (0..31)
0 1 0 0 0 0 0 0 0 0.06 0 0 0 0 0 0 0.0002 0 0 0 0 0 0 0 0 0 0 0 0 0 0 
0 
##$DATE= 1171626597
##$DBL= (0..7)
120 120 120 120 120 120 120 120 
##$DBP= (0..7)
150 150 150 150 150 150 150 150 
##$DBP07= 0
##$DBPNAM0= <>
##$DBPNAM1= <>
$$ [...]
##$SUBNAM7= <"">
##$SUBNAM8= <"">
##$SUBNAM9= <"">
##$SW= 20.6930455092707
##$SWIBOX= (0..15)
0 0 3 0 0 0 0 0 0 0 0 0 0 0 0 0 
##$SW_h= 5175.983436853
##$TD= 65536
##$TD0= 1
##$TE= 295.16
##$TE2= 300
##$TE3= 300
##$TEG= 300
##$TL= (0..7)
0 120 120 120 120 120 120 120 
##$TP= (0..7)
150 150 150 150 150 150 150 150 
##$TP07= 0
##$TPNAME0= <>
##$TPNAME1= <>
##$TPNAME2= <>
##$TPNAME3= <>
##$TPNAME4= <>
##$TPNAME5= <>
##$TPNAME6= <>
##$TPNAME7= <>
##$TPOAL= (0..7)
0.5 0.5 0.5 0.5 0.5 0.5 0.5 0.5 
##$TPOFFS= (0..7)
0 0 0 0 0 0 0 0 
##$TUNHIN= 0
##$TUNHOUT= 0
##$TUNXOUT= 0
##$USERA1= <user>
##$USERA2= <user>
##$USERA3= <user>
##$USERA4= <user>
##$USERA5= <user>
##$V9= 5
##$VALIST= <valist>
##$VCLIST= <CCCCCCCCCCCCCCC>
##$VD= 0
##$VDLIST= <DDDDDDDDDDDDDDD>
##$VPLIST= <PPPPPPPPPPPPPPP>
##$VTLIST= <TTTTTTTTTTTTTTT>
##$WBST= 1024
##$WBSW= 4
##$XGAIN= (0..3)
0 0 0 0 
##$XL= 0
##$YL= 0
##$YMAX_a= 295820
##$YMIN_a= -350950
##$ZGOPTNS= <>
##$ZL1= 120
##$ZL2= 120
##$ZL3= 120
##$ZL4= 120
##$ABSF1= 16.45637
##$ABSF2= -4.236803
##$ABSG= 5
##$ABSL= 3
##$ALPHA= 0
##$AQORDER= 0
##$ASSFAC= 0
##$ASSFACI= 0
##$ASSFACX= 0
##$ASSWID= 0
##$AUNMP= <proc_1d>
##$AZFE= 0.1
##$AZFW= 0.1
##$BCFW= 0
##$BC_mod= 0
##$BYTORDP= 0
##$COROFFS= 0
##$CY= 12.5
##$DATMOD= 1
##$DC= 0
##$DFILT= <>
##$DTYPP= 0
##$F1P= 14.0000005364418
##$F2P= -0.99999901652339
##$FCOR= 0.5
##$FTSIZE= 32768
##$FT_mod= 6
##$GAMMA= 0
##$GB= 0
##$INTBC= 1
##$INTSCL= 1
##$ISEN= 128
##$LB= 0.3
##$LEV0= 0
##$LPBIN= 0
##$MAXI= 10000
##$MC2= 0
##$MEAN= 0
##$ME_mod= 0
##$MI= 0
##$NCOEF= 0
##$NC_proc= -2
##$NLEV= 6
##$NOISF1= 0
##$NOISF2= 0
##$NSP= 0
##$NTH_PI= 0
##$NZP= 0
##$OFFSET= 16.45637
##$PC= 1
##$PHC0= 224.6648
##$PHC1= 8.549677
##$PH_mod= 1
##$PKNL= yes
##$PPARMOD= 0
##$PSCAL= 4
##$PSIGN= 0
##$REVERSE= no
##$SF= 250.130016414148
##$SI= 32768
##$SIGF1= 0
##$SIGF2= 0
##$SINO= 400
##$SIOLD= 32768
##$SREGLST= <1H.CDCl3>
##$SSB= 0
##$STSI= 32768
##$STSR= 0
##$SW_p= 5175.98343685301
##$SYMM= 0
##$S_DEV= 0
##$TDeff= 65536
##$TDoff= 0
##$TI= <Analysis number 999999
Compound Code 99
Book Reference 9
Project Code 9>
##$TILT= no
##$TM1= 0
##$TM2= 0
##$TOPLEV= 0
##$USERP1= <user>
##$USERP2= <user>
##$USERP3= <user>
##$USERP4= <user>
##$USERP5= <user>
##$WDW= 1
##$XDIM= 32768
##$YMAX_p= 318033951
##$YMIN_p= -194648
$$ End of Bruker specific parameters
$$ ---------------------------------
##NTUPLES= NMR SPECTRUM
##VAR_NAME=  FREQUENCY,     SPECTRUM/REAL,   SPECTRUM/IMAG
##SYMBOL=    X,             R,               I
##VAR_TYPE=  INDEPENDENT,   DEPENDENT,       DEPENDENT
##VAR_FORM=  AFFN,          ASDF,            ASDF
##VAR_DIM=   32768,         32768,           32768
##UNITS=     HZ,            ARBITRARY UNITS, ARBITRARY UNITS
##FACTOR=    0.157963299565203, 1,           1
##FIRST=     4116.23194814539, 0,            0
##LAST=      -1059.75148870762, 0,           0
##MIN=       -1059.75148870762, -194648,     0
##MAX=       4116.23194814539, 318033951,    0
$$ Real data points
##PAGE= N=1
##DATA TABLE= (X++(R..R)), XYDATA
$$ [...]
19018b1441J5127J6963J4428j509q735j0622M57j3726J289N723N828p616j1768
19005a5602J90J0563L883O75J1987j6905j9681K481J254J4964N457m401o69k722
18991h526L401p8R99r73R257K2899j8511m335J5223n091m870j1022m703j599K416
18976e513K006R497L212L915r547r715m710K961l487n67J695R718Q390j1699j3353
18961a7197O462R41J818J144P242j080M30J4864Q215M209J1335k650j7038j0987
18947G708m731p788p501Q537J5548P140J5009q714j8747j563M317M93L237j7738
18933d793L97M33j2599p700m109J2247O818O769J3827M104J4065N318j1812j795
18919B1170R952k368j3994r057l722k237n08n650m465L326J17J4669M127j1394
$$ y = [-21441, -6314, 10649, 25077, 23568, 14833, 4211, 4668, -9058, -7769, -2046, 3782, -3834, -15602, -15412, -4849, -966, -291, 11696, -5209, -24890, -22409, -21155, -6191, -734, -5135, -5804, -8526, -5125, -5203, -4204, -5177, 4080, 26979, 8468, 4133, 19356, 14265, 9395, -1627, -6330, -7929, -5513, -3507, 5990, 9202, 13117, 3570, -6145, -10855, -7894, -11381, -11948, -10253, -535, 7855, -3844, -17197, -10735, -9794, -7976, -6832, 410, -670, -240, 14624, 22839, 27048, 38383, 35733, 18695, 7708, 2977, -4811, -12312, -3775, 11773, 18913, 33922, 25208, 6461, 4898, 9215, 9708, 12945, -4793, -4396, -3963, -16562, -24262, -28371, -16124, -9306, -2537, 11290, 15394, 29459, 34777, 22965, 21170, 31122, 28754, 14760, 5703, 1981, -256, -764, -6414, -10879, -7553, -7436, 7233, 11360, -34]
18905c4k981O781K529k619j3901o988K050J3138M144j0202j0479R147R671l178
18891b922n239P529j0691J896j4840l383O570O837K011O362J1877N109n427l247
18877B442J2752M262p897J0057Q137p617n521J8600j784k514J5472p519k247J8862
18863E5485J4968L3582M1831O7572O4787O7767L9432j0368k0117k5163o0534m7940
18851B21302o4300n1978k4308k2169j3630j6935p420J525l625r677J568N702r128
18838F927j3243j5234Q150J5403Q145p289k256R938p654j9450Q95J0747J473P785
18824D337k1560j0225P906j930R239J0111N910n367K212o412P876M061J671l356
18810D473K283J3046J262p067m261j3008M237O520J3057m314r954Q52J6196J702
$$ y = [-34, -3015, 3766, 6295, 3676, -10225, -17213, -15163, -2025, 2119, -8083, -18562, -9415, 256, -2922, -8161, -632, -11323, -9427, -24267, -27650, -21080, -14243, -12232, -5870, 6007, 11116, 5689, 2442, 15194, 19456, 11559, 21616, 29753, 22136, 16615, 35215, 33431, 30917, 46389, 38870, 36623, 55485, 70453, 104035, 145866, 213438, 278225, 345992, 385424, 375056, 354939, 329776, 269242, 221302, 157002, 105024, 80716, 58547, 44917, 27982, 20562, 22087, 18462, 8785, 10353, 16055, 6927, -6316, -21550, -13400, 2003, 10148, 2859, 603, 10541, 2887, -16563, -15668, -4921, -3448, 4337, -17223, -27448, -19542, -21472, -12233, -2122, 3788, -1579, 633, -5779, 2097, 6158, 7829, 4473, 6756, 19802, 21064, 13997, 9736, -3272, 965, 7485, 20542, 16228, 6274, 7126, 23322, 25024]
18796B5024j010l83q238j4743p45J6280J3501m078p125J4505j410L888r558l0103
18782d195J0599N812l589M587L209p627K202m303l782J4262M854M683J7781L0874
18768G5367L2562O0439K9144m7372n7934m1153j0103O098j0156r956K545j0038
18756A9443N329M331j076J0004p587n768j0938M545R162L956O747j2794k759J6581
18742C9176m208l371m951q118o175o835j0122q349j977l109Q768J9211N904r183
18728F661o867O615K905J1788p448o280k526k2161m936J322j7655N914L899j2311
18714d1080N06K8105J9930L346j0902L405o275j9o817P29J25q201j060L950m62
18699a4720J1661J2034M085o764j0215r848Q392J938R319j427j3569O137K2166
$$ y = [25024, 24014, 23631, 15393, 650, -95, 16185, 29686, 25608, 18483, 32988, 31578, 35466, 25908, -4195, 6404, 12216, 8627, 13214, 16423, 8796, 10998, 6695, 2913, 17175, 22029, 26712, 44493, 75367, 107929, 168368, 197512, 150140, 92206, 51053, 40950, 47048, 36892, 26936, 29481, 19443, 24772, 29103, 28027, 38031, 30444, 24676, 13738, 18283, 27445, 31401, 38148, 25354, 22595, 39176, 34968, 31597, 26646, 18528, 12353, 5518, -4604, -12953, -14930, -18039, -9271, 9940, 15844, 6661, -206, 6409, 9314, 21102, 13654, 7374, 4848, -17313, -22249, -20927, -38582, -32668, -28769, -41080, -40574, -12469, 7461, 10807, -95, 3310, -2965, -2984, -9801, -9072, -8947, -17148, -18208, -14258, -14720, -3059, 8975, 13060, 6296, -3919, -13767, -5375, -3437, 5882, 4455, -9114, -2977, 19189]
18686A9189J92j0358j0116J3387J3989j9044O881k671k454j1143j4432m463M198
18673a6845k078J1401M517j613r230p704K305J0222K0344L597o756k954r60k147
18659B099m52N303o267n188P847l949j0252q380o18l037J170Q354Q768J6569j3836
18644a869m809J5099o878M070j080k1962j3293J2359m264j0541J3652J4690m621
18631i447O446o314R013j555O92L537N592J0153K759k5615q209J2225J0176N464
18617A4917j9933O39P606L065k941L020J3740J1685l062O543l636r191Q58R454
18603C2764K312K196M952j4196r773j679J350m514l042Q541j206j1015k0631p451
18589b1392Q777R219l54k974o1p752Q640k281m968q449K622R112J2616J1093J6314
$$ y = [19189, 19381, 9023, -1093, 12294, 26283, 7239, 14120, 11449, 8995, -2148, -16580, -21043, -16845, -18923, -7522, -3005, -4618, -13848, -21552, -19247, -9025, 11319, 14916, 8160, 5206, 4246, 2099, 1647, 6950, 683, -4505, 3342, -607, -10859, -19239, -19857, -22894, -21724, -13370, -4602, 11967, -1869, -6678, 8421, 1543, 5613, 4533, -17429, -30722, -18363, -22627, -33168, -19516, -4826, -9447, -3001, -9315, -302, -1857, -1165, 2372, 7964, 18117, 20876, -4739, -12948, -723, 9453, 14917, -5016, -4377, 3229, 6294, 3353, 6373, 20113, 31798, 28736, 35279, 31643, 22452, 23310, 32764, 35076, 37272, 42224, 28028, 18255, 16576, 17926, 13412, 10370, 18911, 17705, 6690, -13941, -21392, -12615, -3396, -3750, -6724, -6785, -14537, -5897, -8178, -13146, -21595, -18973, -9861, 2755, 13848, 30162]
18574C0162j1840k810J130l086j6368k1813Q147J06k938j0773j6126M199Q974
18561c3036J2697O686J1632K2659P364o096l400J5761J088L058j5536j2826L457
18548A3508j4736M807J627N011Q446J7954j137j0639j0859j1844J349o029P111
18535D569J1715k535r200O239J2331l500J1921o912k631J449O729O083J6610p762
18521D5106j1791j6900o238Q358J0981L04N381K375m125L828k463Q919O74j920
18507D2489n695r115J1941O918j0822k1951K196J7588N795k152j0699J0765P536
18494D4794j1694L535j3094m256k545j801j0647R851Q619N096j1898j1117k248
18481B595k754J0662N87p998q684R802l67l756J4813K0254p6r640K166L691M151
$$ y = [30162, 18322, 15512, 16642, 13556, -2812, -24625, -16478, -16372, -19310, -30083, -46209, -42010, -33036, -20339, -13653, -2021, 20638, 28002, 21906, 18506, 34267, 35355, 38413, 22877, 10051, 13508, -1228, 3579, 5206, 10217, 18663, 36617, 35480, 24841, 13982, 2138, 3487, -2542, 4569, 16284, 13749, 4549, 10788, 23119, 19619, 31540, 24628, 21997, 23446, 30175, 36258, 52868, 45106, 33315, 16415, 10177, 18535, 29516, 29820, 35201, 37576, 33451, 37279, 34816, 43735, 44409, 42489, 36794, 27679, 39620, 46538, 35716, 13765, 15961, 33549, 39344, 37192, 26493, 37258, 44794, 33100, 36635, 23541, 19285, 16740, 14939, 4292, 14143, 22762, 27858, 15960, 4843, 2595, -159, 10503, 11090, 3092, -5592, 4210, 3843, 87, 14900, 35154, 35078, 25438, 27604, 31295, 35446]
18466C5446n652p819n325P167J1017K2735N326k973k0343r511m362J7351M261
18453D7318K824q678n064k374q071k621n387Q511J7264n365j3958J001L589n284
18439B3705j6429L169J3608Q661l81J8963J417k2966l759j0484k329Q134J8424
18426C9733j273q235L005N64p764r822R805o62q08r125o977q869k251j313q519
18411a2511m42l339o534J0548N248J400K993J6613K0243L756o688M802K417L525
18397D2031O420P251p121k6036j1899J986L640j2525J367J7073J7842O901j764
18384D5166o047J5622J5333K1169K0035J6761O934j3701j3380j7056j1891J0768
18372H9713r076P901Q697P455J7983O782O014o87J0004K393q066r305j103k383
$$ y = [35446, 29794, 21975, 16650, 23817, 34834, 57569, 62895, 59922, 39579, 30068, 25706, 43057, 47318, 50142, 41464, 36400, 34026, 25955, 23334, 17947, 26458, 43722, 38357, 24399, 25400, 28989, 23705, 7276, 10445, 24053, 32714, 32333, 51296, 52713, 29747, 25988, 15504, 13175, 21309, 39733, 38460, 30225, 33230, 33794, 26030, 16208, 26013, 25351, 24543, 15418, 8441, -428, -2679, -3992, -12511, -12953, -16292, -22826, -12278, -7030, -5630, -2637, 13976, 34219, 37975, 31287, 36089, 38506, 42031, 48451, 55702, 48581, 22545, 10646, 12632, 16272, 3747, 5114, 22187, 40029, 46930, 45166, 39119, 54741, 70074, 91243, 111278, 128039, 134973, 121272, 107892, 90836, 78945, 89713, 80637, 88538, 97235, 104690, 122673, 129455, 135469, 134782, 144786, 147179, 139113, 129808, 128705, 126322]
18358A26322q155j1284J4947j443M271j3855j3972r30m024l196l24l296k538L735
18344H6258p608J085j465J5742P283j0406n805j1054m583J2224j3348N773P283
18331H1379J793k273L007K2465J6265N900J7346p878n7k057J3894J1675n2r362
18317A52045J1200J5667m028l870M706P760J1311N190J756L887J235J7484O885
18304B31228J0686n995N386J6135R431N852J3011J2904R581Q957R183J6068K0780
18291C63207R06k035N347N228K6535K6642L0876L5059L1833O1173R3285J21679
18279G99735J29527J51038J78110J95207J82881J64915J39140J12562J00854J21246
18269B275215J72993K34938L27103M44186O28493R09025J373595K184767L524162
$$ y = [126322, 118167, 106883, 121830, 120387, 124658, 110803, 96831, 95901, 91877, 88681, 88357, 85061, 82523, 86258, 78650, 79735, 78270, 94012, 101295, 90889, 85084, 74030, 69447, 81671, 68323, 74096, 81379, 83172, 80899, 83906, 106371, 122636, 128536, 145882, 138004, 137947, 135890, 149784, 161459, 161407, 152045, 163245, 178912, 174884, 171014, 175720, 183480, 194791, 199981, 201737, 205624, 206859, 224343, 231228, 241914, 235919, 241305, 257440, 266871, 272723, 285734, 298638, 308219, 317176, 326359, 342427, 363207, 364113, 362078, 367425, 372653, 399188, 425830, 456706, 491765, 523598, 584771, 678056, 799735, 929262, 1080300, 1258410, 1453617, 1636498, 1801413, 1940553, 2053115, 2153969, 2275215, 2448208, 2683146, 3010249, 3454435, 4082928, 4991953, 6365548, 8550315, 12074477]
18260A2074477N616228Q338309J1377211J3495863J3487680J1218705N061189
18253H0669662j325234p866476j2496212j3422636j2485967r874615o937082m589677
18245A1671763k941566j927879j310534r21501o84665n01890l56514k47002j66903
18236B613309j26486r3096r4638j58062j88968k00090k22302j89816j37607j13964
18226A088280r6738j10722r1768q4502p7702p3901n6203n2169n8562m6572l2411
18215C07030k8985j8107j2728p557r107K654p330m998R098n143q987j3533j321
18202B00986m105J6938L5867N528K2535R906k2955j6614j6477j7106k3234k4325
18190A66944k4032l889p432o415r289n624J676r190Q303K5479J9833N25K6282
$$ y = [12074477, 17690705, 26029014, 37406225, 50902088, 64389768, 75608473, 80669662, 79344428, 71477952, 58981740, 45559104, 33073137, 23198522, 16261440, 11671763, 8730197, 6802318, 5491784, 4570283, 3885618, 3383728, 3027214, 2780212, 2613309, 2486823, 2393727, 2299089, 2141027, 1952059, 1751969, 1529667, 1339851, 1202244, 1088280, 991542, 880820, 789052, 704550, 626848, 552947, 496744, 444575, 386013, 339441, 307030, 278045, 259938, 247210, 239653, 230546, 233200, 225870, 220872, 229970, 224827, 215840, 202307, 200986, 196881, 213819, 249686, 255214, 277749, 287655, 264700, 248086, 231609, 214503, 191269, 166944, 142912, 139023, 131591, 125176, 115887, 110263, 111939, 102749, 111052, 136531, 156364, 156889, 183171]
18177A83171L4273M8347P4278Q0410O6237O9753K9396l841m3915o0452o6604p3424
18165C37629m6313k5868k677L5197L8939O1614P5459P1176M3565k353n0193p7614
18153D58561n9237n9412o8847n0102l6941k8560k7213r664n350P467K545m544
18141A18703p833j057q021p704J0532K369J965K0661J7731K5372K8102K1508L7260
18128B59588K0939J8529N0675N4360L6940K9256N3689P0251P9896J22960J45048
18117I42131K01290L05639M23899O79573J133141K038760L952308P479701J2346771
18108B9503213J0226747n754667j3506986q989203m413876k290364j304688q05507
18100B664669n63864m16077k92834k12932j81355j66201j15856r1456q1139o5364
$$ y = [183171, 217444, 265791, 340069, 420479, 486716, 556469, 585865, 582024, 538109, 477657, 411053, 337629, 291316, 265448, 262771, 297968, 336907, 398521, 473980, 545156, 588721, 586368, 536175, 458561, 399324, 339912, 271065, 220963, 184022, 155462, 128249, 118585, 113235, 120702, 123247, 118703, 110870, 109813, 101792, 94088, 104620, 106989, 108954, 129615, 147346, 172718, 200820, 222328, 259588, 280527, 299056, 349731, 404091, 441031, 470287, 523976, 594227, 674123, 797083, 942131, 1143421, 1449060, 1872959, 2552532, 3685673, 5724433, 9676741, 17156442, 29503213, 39729960, 33975293, 20468307, 11479104, 7065228, 4774864, 3470176, 2664669, 2100805, 1684728, 1391894, 1178962, 997607, 831406, 715550, 624094, 542955, 477591]
18090D77591n6300m6472l7177m0608l6674l8502k0536j7099j1329l857p553k726
18078A58758l757j7942j2759j2836j7084j7210j2569n519n340q620j2673q63Q164
18065C9750n534L937N467l465r222j1768K852J2030j4304j8159m820J8693J1310
18052B6767q633j1869j1823r821j354J8090J2837k051N109M500m350L57k849m070
18038A0840j1874j6266K576K9759N952m343J130J2333p118p529L276j5428l981
18025f73J0558J0914r33k3730n126J2684J0731k661j9037O84J6942M337j0681
18012D009q748K246P965R057j3230l564O120J4290j688j7451K937R530k083n585
17998C805p266K007L566N423O987R576Q173j0882N605J0037m657j0554j610j55
$$ y = [477591, 421291, 374819, 337642, 297034, 260360, 221858, 201322, 184223, 172894, 169037, 161484, 158758, 155001, 137059, 124300, 111464, 94380, 77170, 64601, 59082, 53742, 45122, 32449, 31586, 39750, 34216, 38153, 43620, 40155, 30933, 19165, 22017, 34047, 19743, 1584, -3236, 15457, 26767, 18134, 6265, -5558, -15379, -16733, 1357, 14194, 12143, 17252, 21752, 17402, 17759, 14910, 10840, -1034, -17300, -14724, 15035, 20987, 16644, 17774, 30107, 22989, 15460, 18736, 3308, -673, 9885, 20799, 19866, -3864, -8990, 3694, 14425, 11764, -7273, -6589, 10353, 14690, 4009, -4739, -2493, 5472, 14529, 1299, -2265, 3855, 18145, 16457, -994, 1943, 11473, 9390, 3805, -3461, -1454, 2112, 7535, 14522, 24098, 32271, 21389, 26994, 37031, 32374, 21820, 20210, 20055]
17984B0055J3032l662p015j529N48K358M943r752l031N028r791j189K557q479
17970D073j8580p233J1139O817N35J4378J1142p509j1943k265k29m036k623k152
17956h486K3015O748j3570L82O099O98J749j2601l755M652K3160K0185M623p655
17942D5244l809r780j5118L670j0175j4807Q331J7882J3584k2570j1894p689o410
17929a3541k82M629N636R242Q547j4191n141m899q453J1419r827j8052p115O50
17915d1378O912J3754J9753lL544j0825j2499J1759K689l656L738j0413r700l890
17901c0215J3671O92K1487J4025j620j8154o058q060m449R938J0950l89l500M792
17887C110O48o432K710Q439J636j611M066J420O551k704j8286p079j057p655j3928
$$ y = [20055, 33087, 29425, 22410, 20881, 21429, 23787, 28730, 18978, 15947, 20975, 11184, 9995, 12552, 4073, -14507, -21740, -10601, -3784, -3249, 11129, 22271, 14762, 2819, 554, 325, -3711, -6334, -8486, 14529, 21277, 7707, 8089, 14188, 14886, 16635, 4034, 279, 4931, 28091, 48276, 52899, 45244, 41435, 31655, 16537, 20207, 10032, -4775, 3556, 21438, 35022, 12452, 558, -7131, -13541, -13823, -9194, -3558, 5684, 14231, 40, -5101, -10000, -18453, -7034, -16861, -34913, -42028, -41378, -34466, -20712, -959, -962, 2582, -8243, -20742, -8983, -6294, -9950, -6212, -16625, -26325, -30215, -16544, -15852, 5635, 19660, 18040, -114, -6172, -14232, -18681, -8743, 2207, 1818, -1682, 3110, 3758, -2674, 36, 8475, 10111, 8500, 12566, 13986, 20537, 17833, -453, -7532, -8589, -16244, -30172]
17872c0172k274J2444J1030j4990J289J3348M930j749M99n233n345J6K3487M278
17858A1558K979P387k5172j4806r04J1898R20j9337k0635j189R275J8317K2050
17845B341P802J0520j0632j2548K200J0034P56m207N660J535j4242M839n198j1622
17831a2762r472k437K280R577m308o18M2175k126k4921j5208J0410J88q646j3438
17817b9306n110M668N254P430K3094m756j4555J563j985J0207m050L708r716n784
17803a9338J7046l604R301J9144O367N418P065O033n149k2420j0739O08n361l740
17789F31M029j413r704n137K240K13J0254N161j7484j3258P935R666J2206K359
17775G698P025J517p142k394J3218J1003n253q70j9252r697q19j8386K695K2162
$$ y = [-30172, -32446, -20002, -8972, -23962, -22673, -9325, -4395, -6144, -5645, -10878, -16223, -16207, 7280, 11558, 14537, 21924, -3248, -18054, -18958, -7060, -6140, -25477, -46112, -47301, -38026, -19709, 2341, 10143, 20663, 10031, -2517, -317, 9717, 10473, 6266, 11926, 13461, -781, 4058, -1140, -12762, -22234, -24671, -22391, -12814, -17122, -17740, 24435, 22309, -2612, -17820, -7410, -7222, -15868, -29306, -34416, -29748, -24494, -17064, 6030, 1274, -13281, -11718, -13703, -3496, -7546, -3838, -13554, -19338, -2292, -5896, 3405, 22549, 28916, 34334, 41399, 47432, 42283, 19863, 9124, 9732, 4371, 631, 4660, 3247, -6457, -11594, -9354, -9141, 1113, 6274, -11210, -24468, -16533, -6867, 5339, 7698, 14723, 16240, 9098, 6704, 19922, 30925, 25672, 24802, 5550, -4147, -4966, -23352, -20657, 1505]
17761A505L548k0274j0752O005J5125P943M364l018r910k3216o374R968K5151
17748F5J1177j3335p668o498j6256P205O46J17J4535J7701J1694p970j3066L250
17734A597j0113j9712J1900K1037o615J386K2144K399j0603j4120K368p697J7710
17721A1681P662j0145m468j554q66P74J351J6140l568j9148j1112J794J0178m546
17707e827j548r913P113O059j7344K269J6363M753j0126o159k023N958m329M124
17693a0630J1656J135j3319j0200n07L651J6325m329j171j9858J524J9521N671
17680e31o936j3232P084J1154l070k490n860l484r367M015K7870J5061O349m163
17666B2400r90j4440o778J5015J0501j9023m79P176m709q515L747j34j84K4721
$$ y = [1505, 5053, -15221, -25973, -19968, -4843, 3100, 7464, 4446, -5464, -28680, -35054, -25086, 65, 11242, -2093, -9761, -16259, -32515, -25310, -24664, -24547, -10012, 7689, 19383, 11413, -1653, 1597, -8516, -28228, -16328, 4709, -1906, -520, 21624, 24023, 13420, -700, 1668, -6029, 11681, 19343, 9198, 4730, 3176, 2310, 3084, 4435, 20575, 17007, -2141, -13253, -11459, -1281, -5827, -7375, -17288, -10175, -4116, -21460, -19191, -2828, 1925, -8201, -14360, -16383, -10425, -14754, -10630, 1026, 2161, -11158, -21358, -21865, -18214, -1889, -6218, -7389, -27247, -25723, -6202, -531, -7467, -20699, -13615, -2461, -5531, -8021, -13881, -17365, -26732, -22717, 5153, 20214, 26563, 22400, 21410, 6970, 192, 15207, 25708, 6685, 6206, 13382, 8673, 158, 3905, 3771, 3587, 28308]
17652B8308J4357K3496L7965L9617L0901O7191O9485O3291L1256J941k6250o3236
17640C18322q1039n8448m9546l5929l8305j9922j7718j1633N959n980k97J3161
17628A8625m451p216j4471Q596P232L708o233j5866r831J0095L707N606q42k251
17614c592j8557j2771m405J563R625J4553J3971M305r780n731o995R341l9L42
17600h170O218m312r101r37Q378M14J319j676j253J0384K3250j12P179n710k092
17585B3779r203r310N977p584p122L06m292q155k964N693M875j457R26R40N184
17570b407P096O20K078p385n724j0951P1J2715J3023q593k587K270j434j008q079
17555a0295j4134j4598j239o404J1806J0852J3602K997j4296N721P877q537q055
$$ y = [28308, 42665, 66161, 104126, 143743, 174644, 241835, 311320, 374611, 405867, 407808, 381558, 318322, 237283, 178835, 129289, 93360, 55055, 35133, 17415, 5782, 11741, 5761, 5464, 18625, 14174, 6958, -7513, 1083, 8315, 12023, 5790, -10076, -19907, -9812, -6105, -499, -1341, -3592, -22149, -34920, -39325, -37762, -28137, -13584, 387, 4692, -5088, -10819, -17814, -8473, -8512, -8170, -1952, -6264, -15365, -16302, -7924, -7510, -6191, -7867, -9120, 1264, 24514, 24402, 31581, 25871, 23779, 14576, 5266, 11243, 3659, -3463, -3157, -7449, -15604, -18568, -12875, -8000, -9457, -8531, -7591, -2407, 4689, 5309, 7387, 2, -5722, -16673, -16602, -3887, 9136, 543, -2044, 226, -1208, -2216, -10295, -24429, -39027, -40266, -46670, -34864, -24012, -10410, -7413, -21709, -15988, -8111, -16648, -24703]
17542b4703J924M197p778Q389J0451J5483l819r685K112L366o296r210l921l945
17528b3435k79J9325k000j110O497J2911M845p064Q673M918q014o928j4840j9866
17514b6367j1433L128k980J0282P173J273J6122k577J054J033O377M470o254j2396
17500a1095q851p412j4982N3P652R138J3654p50j296k2390m747Q959L236j1209
17486d0040k820J0132J3653K968P402J148J2065J2720j3552j1167j68N969O728
17473E038N285L565o330n543j4273o646o546l559R821N781q976j185R511K345
17459a1712j3924m27J0401k15Q791l099J522K227o768L28K4853j044r41P362R485
17444B6839L3587N9308Q4032K7047p7558q1529m0044k3824L987k667R739m25j3940
$$ y = [-24703, -22779, -18582, -26360, -17971, -7520, 7963, 4144, -5541, -3429, -63, -6359, -15569, -19490, -23435, -23714, -4389, -6389, -7499, -1002, 11909, 16754, 9690, 18363, 23281, 15267, 8339, -6501, -26367, -37800, -34672, -37652, -27370, -20197, -18924, -2802, -5379, -4325, -3292, 3085, 7555, 1301, -11095, -19946, -27358, -42340, -42287, -34635, -25497, -11843, -12593, -13889, -36279, -41026, -32067, -28831, -40040, -42860, -32728, -19075, -16107, -8705, -7557, 4508, 17228, 3676, -7491, -7659, -1690, 5038, 10323, 13888, 7558, 2015, -12258, -18904, -25450, -29009, -19188, -13407, -22383, -23568, -14057, -11712, -25636, -26063, -15662, -15877, -7086, -10185, -8663, -6436, -13204, -12876, 11977, 10933, 9992, 17354, 26839, 60426, 119734, 203766, 230813, 153255, 71726, 31682, 7858, 11845, 9178, 18917, 18492, 4552]
17431D552j2605m072J8494n601J1753Q16l772K028j4474n653J1674J841n452l747
17417d218N568M084J053J2731j5121j4027P874M190L486J0208o877j0417j1357
17404a2823m638j5636j1279j609O445N431J6159J1226J7610O62r56j3212j3082
17391a5702J812J1905J7066N508j9126M32j0760j6535j0006M779J2047j154N373
17378a4361L480p339L219K511J171K3196J2389q198N881p251l925r67O948j3944
17364B810k0559L38J0295L749k652j970j5456M716J237J820M473J713J2041R651
17350A2206k217K680j964P553j2775j1050q678o91L764p310M164J5888M927r930
17336c433j0931n296J0061Q094n786k466K178Q736j2026O066M152q818k862M958
$$ y = [4552, -8053, -12125, 6369, 768, 12521, 13337, 9565, 11593, -2881, -8534, 3140, 4981, -471, -4218, 1350, 5434, 6487, 19218, 4097, -9930, -2056, 2134, 5620, 15828, 8951, -1466, -12823, -17461, -33097, -44376, -45985, -39540, -34109, -17950, -6724, 10886, 11548, 10592, -2620, -15702, -13890, -1985, 15081, 20589, 1463, 1895, -8865, -25400, -35406, -30627, -18580, -19734, -14361, -10881, -18220, -15001, -12490, -11319, 11877, 24266, 16068, 21949, 14698, 10773, 9806, 16754, 2810, -17749, -17411, -7116, -3367, -6019, -7989, -23445, -18729, -17492, -15672, -11199, -9486, 2555, 12206, 9989, 12669, 10705, 18258, 5483, -5567, -14245, -14936, -11172, -18482, -14318, 1570, 6497, -3433, -14364, -19660, -9599, -1505, -7291, -9757, -7579, 1157, -10869, -4803, -651, -9469, -12331, -7373]
17322g373J051O018J4765R337l60j4380J884j1570k5078j4292m176J912K318R582
17308c0362J7015J4618p325m523o648q140L247o951Q379N862N453q270P021j255
17294a1879m959r620o879N450j0140m01J2900R056o724j5565K413J8380J2962
17281e006J9658o00l622j0234q712M029l90n637j515j2220j802J0408J6828L459
17267D644K189o535k4920N425J9833J1126j406n912J600o945p233J0757J5878
17254A8501N643p173l752p182Q98M462J314r375M042J1687j343m846j7189K702
17240a611J4186j0974r179q96O703J5290J1384k27k878j4639o681p250m885N024
17226f633J877n092L467J2201M730j324K442p610j2582j806k360M877J0358N320
$$ y = [-7373, -6322, -304, 14461, 23798, 23438, 9058, 10942, -628, -25706, -39998, -44174, -42262, -39944, -30362, -13347, 1271, -6054, -10577, -17225, -25365, -22118, -29069, -20690, -14828, -9375, -17645, -10624, -11879, -16838, -26458, -33337, -27887, -38027, -38428, -25528, -16472, -23196, -38761, -36348, -17968, -5006, 14652, 14052, 10430, 196, -8516, -4487, -4877, -10514, -12029, -24249, -26051, -15643, 1185, 4644, 6833, 298, -24622, -19197, 636, 11762, 10356, 4444, 6044, -901, -8134, 2623, 18501, 24144, 16971, 13219, 6037, 6935, 11397, 12711, 3336, 7378, 19065, 17722, 12876, -4313, -1611, 12575, 1601, -7578, -8474, -1771, 13519, 24903, 24676, 21798, 7159, 478, -6772, -11657, -6633, -4756, -9848, -6381, 5820, 10550, 9226, 11668, 4058, -8524, -10330, -12690, -7813, 2545, 7865]
17212G865O842o474J171K813q759n816M390M660l73J5860K652p32j7421j0315
17198c637j9625j6887m380J8477L316l146Q036M258j1594m742L683L246J7534
17185e461J5732l756o322N112J571j264j0894p554m545J2937R563P808O597M543
17171B4067k509k900O487r798j219l111j9773k590j1202J1899J4339l570j0854
17158a0734O042J5346J3815j0808k2024o056m504j496J5560J8646m269N04j1922
17145a900j3811l40J7626J2771k495j1979k012q189o851K0458N276j6326q549
17132a6321o21j007o068j1938n1M078R110J0538J4334o26L660l238j0576O017
17118b709J27p441l093k19J306r411J893O501J4208J372Q93m575o794J0759J3833
$$ y = [7865, 14707, 8233, 9404, 12217, 3458, -2358, 2032, 6692, 6319, 22179, 24831, 24099, 6678, -3637, -23262, -40149, -44529, -26052, -22736, -25882, -17846, -13588, -25182, -29924, -26241, -22995, -5461, 10271, 6515, 193, 5305, 6876, 5612, -5282, -12836, -17381, -4444, 5119, 12927, 19524, 24067, 21558, 18658, 25145, 15347, 14128, 11017, -8756, -11346, -22548, -10649, 3690, 120, -10734, -4692, 10654, 24469, 13661, -8363, -14419, -18923, -20419, -4859, 13787, 9518, 10022, -1900, -15711, -16051, 1575, 14346, 11851, -128, -2140, -10329, -17180, 3278, 8554, -7772, -16321, -16942, -17949, -24017, -35955, -36006, -31928, -22818, -12280, 2054, 1428, 5088, 1850, -8726, -2709, -2582, -10023, -13116, -13335, -12029, -21440, -19547, -13046, 1162, 2534, 3427, -1148, -7942, 2817, 16650]
17103A6650j3243p616K358J5216k704j0807K267M535k2732j3825M970l2J6284
17090h679J1337o21N033K878j859P248J9265M458j3988j970O172j1219q637l399
17076F019m537j1656O533J447j1673k6744K5187K4419m011q437K168O927J2841
17063A8483j3707n738L545l356J777Q63K889K672J373k73j1028j1664p707j0486
17049c2357J02O246N451K099J955O590p792o875j4895o675Q791P292N720J2344
17035a2004M018Q159q417j5633j0935J584J5333J7349J0761k133j0609O802n423
17022a148j4127j2248J019M125J2612M69O808l241k139q140k766J1537P478J2039
17008A2278R095j9602k1612l946J635k1892K345J2337q70j42P25j2992L54o691
$$ y = [16650, 3407, -4209, -1851, 13365, 10661, -146, 2121, 6656, -16076, -29901, -24931, -24963, -8679, 2658, 2037, 7070, 9948, 8089, 15337, 34602, 39060, 25072, 23102, 29274, 18055, 9418, 6019, 1482, -10174, -3641, -2194, -13867, -40611, -15424, 8995, 4984, -3453, -1285, 5642, 18483, 4776, -962, 2583, -773, 1004, 1867, 4756, 7428, 8801, 8528, -2500, -14164, -21871, -32357, -32255, -26009, -20558, -18459, -16504, -9914, -17706, -24581, -39476, -46151, -37360, -30068, -24348, -12004, -7986, 173, -8244, -23877, -34812, -33228, -17895, -546, 10215, 8082, -2527, 4275, -1148, -15275, -27523, -26504, -22379, -9767, -9298, -2490, -5731, -7870, -16010, -18776, -7239, 239, 12278, 21373, 1771, -19841, -23787, -22152, -44044, -41699, -29362, -30232, -30374, -29649, -42641, -42287, -48978]
16994d8978R404P704r28O974J9422K0288q183j0550K765r789q806O362R403L142
16980a770q688L038L116k2736j1129L495J1381o072l378J0220L700N770J3796
16967G43O597l341l531m023l748P490Q818j7403q090J1692J2231n240j1873n371
16953a5049k532P926J409l654N103J9647J4140L759N954j3173k8297j0808L120
16940a2455p442o635O687R136n714j1120N392N613N052J1949J414j5763l089R770
16926g205J1586K136r387l50P378j629N648Q879J1857p454J32O935o995j7857
16912C674m488K326O985J6816q215k2776J437O762q021j4765l150L742K2170K811
16898E308j6538R30j308J5520Q938p030o022j1192K555Q327Q706P47n470J4675
$$ y = [-48978, -39574, -31870, -32798, -25824, -6402, 13886, 5703, -4847, -2082, -11871, -20677, -14315, -4912, -1770, -10458, -7420, -4304, -27040, -38169, -34674, -23293, -29365, -32743, -22523, -18823, -13053, 743, 7340, 3999, 468, -3555, -7303, 187, 9005, -8398, -16488, -4796, 7435, 2195, -9678, -15049, -17581, -9655, -8246, -11900, -6797, 12850, 26990, 30749, 36703, 23530, -4767, -15575, -12455, -19897, -26532, -19845, -10709, -16423, -27543, -22151, -16538, -11486, 463, 1877, -13886, -16975, -7205, 4381, 6517, -2870, -3220, 4158, 2529, 8177, 17056, 28913, 21459, 21591, 28526, 21531, 3674, -814, 1512, 8497, 25313, 17098, -5678, -4241, 2521, -5500, -20265, -23415, -19673, 2497, 5308, -11230, -10300, -11608, 3912, 12850, 5820, -202, -11394, -8839, -512, 8194, 8941, 3471, 18146]
16884A8146R639j0271j3481O93j1578J304l712R66R319q267J0055n136n97j405
16870d325K380J0599L99r926r403j83K227K530j080j6026O383J8619N360l159
16856D395j252P70m948L112N336q78j5298j0227j0831J1074Q3r255J3593K924
16842a1402m234P044N773r417l79J4060j1544p213j746P611O757n384p812N007
16828a2879J9675p21m416m881r718j2422q508l82K789J6776J1310q38M369R212
16814I366r914o379L95N72K833J0138j893j004J2191l725j3267n634k2703j113
16800c0137J3729J2982K0002J995j3041j3588J573N765M321l458M726L044j5555
16787g642O752l447J019q335q615p293Q141K1495O054r763K225j2628k291M423
$$ y = [18146, 27785, 17514, 4033, 4726, -6852, -5548, -9260, -8294, 1025, -7242, 2813, -2323, -2920, -4325, -1945, 8654, 9053, -873, -10276, -10459, -8232, -5702, -6782, -22808, -16425, 2194, 7554, 4395, 3143, 3913, -1035, 2077, 7413, 6535, -8763, -18990, -29821, -18747, -18664, -27919, -14326, -11402, -15636, -8592, -2819, -12236, -12615, 1445, -10099, -17312, -19058, -11447, -4690, -10074, -17886, -12879, 6796, 6075, 1659, -3222, -12940, -25362, -33870, -34252, -31463, -14687, -3377, -4215, 154, 9366, -548, -6927, -6532, -5960, -3127, 7011, 5118, 4114, 16305, 12580, -687, -6321, -29024, -30137, -16408, -3426, 16576, 18571, 5530, -8058, -6485, -720, 3601, 143, 4869, 7913, -7642, -890, -4337, -3318, -11653, -20268, -27561, -19420, 2075, 8129, -1634, 591, -12037, -14328, -9905]
16773i905K173J355o168j3659L30K1130R577n592k820l024n787m817J897J2326
16759b984P92R65n048N586j48P296J0299j2214j667Q683J5177L742j1499j1134
16745G846j769j3381j00q675P896p784K430J662m73m350L608J4902k006L650j2060
16730h604n833p184P519K2339N927j66n118K2918j479j4591p331P774J5534j692
16716C0013j2373m187q696k908J550P460J2012p88M530r56o247j7448O476J0489
16702A8927P052l932j8199r974J1178J0006j7636Q779j846j5313M176n192m491
16689a6465M719P36Q249P254J2109p533m944j2119j0108J3446J598j2768Q500
16676g326m423J696N247J2970k3626p591L144N731P167Q237J5747Q179N692n439
$$ y = [-9905, -7732, -6377, -12545, -26204, -25874, -4744, 4833, -759, -3579, -6603, -12390, -17207, -15310, -2984, -2192, -1227, -6275, -689, -837, 6459, 16758, 4544, 2877, 11560, 26737, 30479, 18980, 7846, 6077, -7304, -7404, -16079, -8183, -15967, -13537, -11875, -12348, -16698, -13090, 1812, -194, 3456, -8604, -14437, -21621, -14102, 8237, 14164, 13998, 8880, 31798, 30319, 15728, 8397, 16171, 31705, 30013, 17640, 13453, 4757, 1849, 3399, 10859, 22871, 22083, 26613, 25657, 19410, 1962, 8438, 18927, 25979, 22047, 3848, -6126, 5052, 15058, -2578, 6201, 4355, -10958, -6782, -11974, -16465, -11746, -11010, -2761, 4493, 16602, 9069, 4125, -7994, -18102, -4656, -3058, -15826, -7326, -11749, -10053, -4806, 8164, -15462, -23053, -19909, -14178, -7011, 1226, 16973, 25152, 30844, 25405]
16662B5405N236j0427j9535j390O501R866j4996q284k767J4212J6946l123m19
16649A7225n244o109m973n449J5535J1102k6886j1456Q378N614M989j103j589
16636C4R470j311n941M94q002j2911P555J5439j7023O316j472j5522r432Q102
16622b4204R594j4863O16Q086K439l761k152n063L202j0376M413K197J6009O493
16608g370L269l954O641m191K944J861Q450j3159n587j2907j641k486K035J5343
16594a0752J4852R124j1637j4315j509J6501N460K886j011l790r86o511j6165
16581a7853j2444O178Q189J1235J7487M024l641q266n096r071o828l351o791J000
16567b5228P675J1732K4622k52j0314q386l357O01J0680N432j744j4019o861k664
$$ y = [25405, 30641, 20214, 679, -711, 5790, 15656, 660, -7624, -10391, 3821, 20767, 17644, 17225, 11981, 5872, 899, -4550, 10985, 22087, -4799, -16255, -7877, -2263, 2726, 1623, 34, 9504, 8193, 2252, 2746, -5256, -18167, -10612, 4827, -12196, -5880, -7352, -22874, -32306, -24204, -14610, -29473, -28857, -20771, -18332, -22093, -24245, -29308, -26106, -36482, -32069, -29872, -13863, -7370, -4101, -8055, -1414, -5605, -2661, -800, 7650, -5509, -11096, -24003, -25644, -28130, -26095, -10752, 4100, 13224, 1587, -12728, -14237, 2264, 7724, 10610, 9599, 5809, 4823, -1688, -17853, -30297, -24119, -15930, -4695, 12792, 16816, 13175, 4909, -187, -9258, -16086, -19437, -26228, -25228, -17553, -5821, 18801, 18549, 8235, -151, -3508, -2907, 7773, 13205, 11461, -2558, -9419, -12083]
16553a2083l074K578Q95J6493N851j0930J4790k88R751j0328j6348J4168n015
16540F460r701N606J1071K032q010k334j4052m311J133J130p132J314J0505n914
16526a2203R485q044j2776M49M241Q078k630M708J485Q65M590m431N376Q297j3075
16511e585k0425j0574K2896J9901M759Q389j3691j1489O660J830Q511q998l114
16498i30j997k548J156l647J508J0761n037o997L178O519j046l669L697n900o90
16483e642N652J7793R062l549K913O843K6641J3201N971J3763K9334N5977R3134
16470B71093J30610J00859O8832J3640m3219p7856p3289q4682p4441l0698Q672
16459B09521K1670L7071O9134Q4973Q2517O9279K7842m6822r7906r3425r1908
$$ y = [-12083, -15157, -12579, -11684, 4809, 10660, -270, 14520, 14232, 23983, 13655, -2693, 11475, 6460, -3241, 2365, 13436, 15468, 7458, 5124, -8928, -13239, -12106, -10976, -18108, -16794, -6289, -12203, -2718, -10762, -23538, -23089, -18848, -10770, -13400, -8692, -7207, -6342, -1752, -6183, -807, 7490, -5585, -26010, -36584, -13688, 6213, 10972, 19361, 5670, -5819, 841, 2671, 11182, 2184, -930, -2927, -5475, -4319, -7966, -6458, 4303, -734, -7731, -4553, 1966, 920, -2749, 948, -4952, -5642, 10, 17803, 26865, 23316, 26229, 33072, 59713, 72914, 78885, 92648, 121982, 177959, 271093, 401703, 502562, 571394, 585034, 541815, 463959, 390670, 305988, 231547, 200849, 209521, 231191, 268262, 337396, 422369, 504886, 574165, 602007, 555185, 457279, 363854, 271946]
16448B71946q0549n9159k8290j1476j8620p783j615j5078m626j4804j1776o096
16436A2074R497r19K1374M326j0496K234q830k3077j352Q257q780j1115l442J3653
16422C404J0022o912k64m02J5898K54o367o951o14K670M449j0737r560j5806o211
16407b7127R803j67m577J1607J99R67j712j013j092l809K830J6793N139l396P28
16392E173j2170K510J8543k837j548L737j9583l942p890o837j3144R889P626m97
16378b0970M991N814O985M100n64N730J6675j1449j7359n831J0898l746j5203
16365a9929J3833k303j4098K133J691R099L853J2653Q701j8486j5357J8083k160
16352b287K678J8862j103j1303P038k155j403k219J0000l174j6577j4391p375
$$ y = [271946, 191397, 132238, 103948, 92472, 73852, 66069, 64454, 49376, 44750, 29946, 18170, 12074, 21571, 20652, 42026, 46352, 35856, 38090, 29260, 6183, 4831, 13088, 4308, -6807, -10249, 3404, 13426, 6514, 6250, 5848, 21746, 22000, 15633, 8682, 8068, 10738, 15187, 4450, -5110, -20916, -27127, -17324, -17491, -22068, -10461, -10262, -9295, -11007, -12020, -13112, -16921, -14091, 2702, 7841, 4445, 5173, -6997, -4487, 14056, 11219, 9671, 13408, -6175, -10117, -18007, -24844, -37988, -28099, -20473, -20970, -15979, -10165, -3180, 920, 356, 6086, 22761, 11312, -6047, -11878, -980, -4726, -19929, -6096, -8399, -22497, -20364, -18673, -9574, -5721, 6932, 15633, -2853, -18210, -127, -2287, 391, 19253, 18150, 6847, 13885, 11730, 10327, 8108, 18108, 14934, -1643, -16034, -23409]
16339b3409J3283K3373J5794J161K479m899r998j3294j832k845J5327n6K831j965
16325A5950P769j6651q244R482M813k088q624k3393m545R429J9417j6265K296
16312a0654J0977m575j16L193P570q498N828K0654l211j5933L773K170k41J294
16298A2231p892r772R845l06P75K597N974N71L196P032q563n329O908N62Q736
16283B6565J9225o017o352j1573n532j1660M888J0957j0697j0111N995j0547L262
16270a597N100q62O107r286p442j367J062l35p0j0930j4833m506J9753J0576O693
16255a937j0216q527K943Q786l436P601R29o067j2571m408K2280K2870M67j0128
16241H586q737l257l643m855k483j0711J388J2779J9421j241j05j9730j6126J3992
$$ y = [-23409, -10126, 13247, 29041, 30202, 32681, 27782, 17784, 4490, 2658, -187, 15140, 15084, 17915, 15950, 23719, 7068, -1176, 8306, 13119, 11031, 2407, -20986, -25531, -16102, 3315, -12950, -10654, 323, -4252, -4368, -1175, 6395, -2103, 3725, 24379, 21168, 5235, 9008, 11178, 10937, 12231, 4339, -5433, 4412, 4106, 4881, 7478, 13452, 14023, 17219, 24251, 15688, 10359, 17267, 17829, 26565, 45790, 39773, 33421, 21848, 16316, 4656, 9544, 20501, 9804, -307, 5688, -4859, -1597, 3503, 2641, 8748, -538, -7980, -9347, -8285, -8620, -8690, -19620, -34453, -38959, -19206, -8630, -1937, -12153, -20680, -17737, -8951, -12387, -4786, -3857, -9924, -22495, -26903, -4623, 18247, 18714, 8586, -151, -3408, -7051, -11906, -14389, -25100, -23712, -10933, 8488, 7247, 7142, -12588, -28714, -14722]
16227a4722J9979j241j3405M207O785N24p647k175O135P531N787j38k114j304
16213H202j7717N34j4938M109J4474n264n32R854K157l276j2530o430j941K431
16199b0867P070L055j7604O842J7915m722j330q853r341P28J2561J0074m692n891
16185a5055p355j2474J1399J1872R37o602P118J641J708l659j0019j1544o287
16172c8320J0150J8253M996j3462j0221Q610J0903J27L905p105q117k967k0407
16159d3655j661N463J5862J5210J3K406J6308oJ678q875K778j846l932j6628J5741
16144a144P542l099j53k74m941j2784j788P090l054J2041J0357n186n042j4615
16130a5050l711N651O045J3858M372N632N440o342R90M964j8998k2509k005J5714
$$ y = [-14722, 5257, 4016, -9389, -5182, 1603, 2127, -5520, -7695, -1560, 5971, 11758, 11620, 9506, 8202, -9515, -8981, -23919, -19810, -5336, -10600, -11132, -1278, 879, -2397, -14927, -21357, -23298, -20867, -13797, -10742, -28346, -21504, -3589, -8311, -9641, -18494, -27835, -27107, -14546, -4472, -9164, -15055, -22410, -34884, -23485, -11613, -10676, -17278, -10160, -8519, -6811, -10470, -20489, -32033, -38320, -28170, -9917, -4921, -18383, -28604, -19994, -9091, -8964, -5059, -12164, -20281, -23248, -43655, -45316, -39853, -23991, -8781, -8768, -6362, 9946, 9940, 11618, 2743, 5521, 3675, -257, -16885, -1144, 6398, 3299, 3146, 2872, -2069, -14853, -16641, -9551, -12605, -564, 9793, 4607, -435, -15050, -18761, -13110, -7065, 6793, 11165, 16797, 22237, 15895, 16885, 21849, 2851, -19658, -21663, -5949]
16116e949J0399k193n276k0483L387J0997R650k070J172K653n278r373J5068P273
16102I977L436j0716j5190q030n617P878q61N374L519J6474P869L705J88J0704
16088B8710j4304k2298j436J2543M150j6337J0091R125j968m752J490J8619q514
16075A5119j4088j2698j0080r150J0902P486N789K2527n364J2118O2o878p059
16062H686n310Q842n369r772q840q323k82O429M010j3698J011N286Q845J5417
16048F932r626j3046M469M359p274K741N917m094j194J8951M301P646K852j7901
16034E033j9888j3062J8613P812m270Q2p692r168R469l679l621J2805o409Q927
16020e048J4598l46r101R261O586r081k0134j5844P21Q399J6018K154k083J2486
$$ y = [-5949, 4450, 2257, -3019, -23502, -20115, -9118, 532, -1538, -366, 2287, -2991, -12364, 2704, 9977, 13413, 2697, -12493, -20523, -26140, -18262, -19123, -13749, -10230, 6244, 14113, 17818, 18006, 28710, 14406, -7892, -9328, 3215, 7365, -8972, 1119, 10244, 8276, 3524, 5014, 23633, 15119, 1031, -11667, -21747, -30897, -19995, -12509, -6720, 15807, 10443, 22561, 22623, 15745, 8686, 3376, 12218, 6849, -2923, -11763, -20086, -20368, -13939, -9929, -23627, -22616, -17330, -8485, 6932, -2694, -15740, -11271, -6912, -14186, -11445, -5528, -9622, -10816, 8135, 12436, 20082, 22934, 5033, -14855, -27917, -9304, -1492, -5762, -5680, -13372, -22540, -13071, -16750, -20371, -7566, -13975, -5048, 9550, 9204, 103, 9364, 15950, 6869, -13265, -29109, -28388, -19989, -3971, -1817, -3900, 8586]
16006H586R925k228L586k427J75n898n619J847j1727K691o56L215m572o44O092
15991B346l855l541J3937N28Q387Q322n929j611L881q697k837m954L669J1447
15977B1093Q268p508M237N793M027m040l373M545j0654n994J881o074l5558l462
15963b6819M863k147J3486J9111R443j528n410J2386j1995j7696L355j218p14
15950d883N289q497Q207J1408R715j1268j3582J289M26M451J004j4031P227J1200
15936G955J1463j3107o026j523o61q55l59r696p128J6256J8278j0693j2111R083
15922H76m042q342M631J2908K631m149j3561K873M159k998J34m446j3797k123
15908b5246N842Q076l386j2010k409P963M677N476J1531J4046P344m215q190j573
$$ y = [8586, 18511, 16283, 19869, 17442, 17617, 11719, 6100, 7947, -3780, -1089, -1745, 1470, -3102, -3746, 2346, -1509, -5050, 8887, 9415, 17802, 26124, 20195, 18584, 22465, 13768, 10931, 5977, 9646, 21093, 29361, 21853, 26090, 31883, 35910, 31870, 28497, 33042, 22388, 16394, 18275, 12201, -23357, -26819, -21956, -24103, -10617, 8494, 17937, 16409, 10999, 23385, 11390, -6306, -2951, -4169, -4883, 406, -8091, 116, 11524, 21239, 9971, -3611, -2322, -1896, 2555, 3559, -10472, -3245, 7955, 19418, 6311, 285, -1238, -1899, -2754, -3113, -12809, -19937, -3681, 14597, 3904, -8207, 876, -3166, -11508, -6877, 6031, 8662, 4513, -9048, -6175, -2016, -5014, -4880, -9326, -23123, -25246, -19404, -11328, -14714, -26724, -29133, -21170, -16493, -11017, 514, 14560, 21904, 17689, 9499, 7926]
15894G926n011m427q614N64j038l767J003N486J1549m34K666Q803L636j3347k5100
15879b0105m04J5315l715J695N993m459K71l321r586l904k557Q229J0480L482
15865b586l996J237K550J3624K714k882p190p930o78P688L988m85j986J001o194
15850a125p796k471r740K906J7976L277O179m427J1554P847p987k582J768k0142
15836d763m246O761o23N368J062L198M455j4740j8328K1188L1237Q72k1785j5334
15822e678J0364N833j0879k797j261m895J9854J0575m838n171j8811j3101p254
15809b8059l021J1251K628n136J930K191Q991O244K024J1975J417j1997l103J5985
15795A3320o097j3953j4374m83J0727K1159k905l203J2015j6751j2958o661j1094
$$ y = [7926, 2915, -1512, -10126, -9562, -10600, -14367, -13364, -7878, 3671, 3237, 5903, 14706, 18342, 4995, -20105, -20509, -5194, -8909, -7214, -1221, -5680, -5409, -8730, -18316, -22220, -24777, -16548, -6068, -2586, -6582, -5345, -2795, 10829, 13543, 10661, 3471, -4459, -5137, 2551, 6539, 6054, 4068, 5069, -1125, -8921, -11392, -21132, -18226, -250, 3027, 9206, 4779, 16333, 24180, 16193, 13611, 15379, -4763, -9009, -2248, -2871, 2497, 3559, 6757, 11212, -3528, -21856, -668, 30569, 31441, 9656, -5678, 4686, 10519, -360, -3157, -4418, -9313, 10541, 21116, 16278, 11107, -7704, -20805, -28059, -31080, -19829, -17201, -22337, -20407, -18216, -9225, -2981, -957, 11018, 12435, 438, -2665, 13320, 7223, -6730, -21104, -21587, -10860, 10299, 7394, 4191, 16206, -545, -13503, -20164, -31258]
15782c1258Q565R536R164N822K585k433r333Q4J920L265R941k610q353j716r981
15767a4802L274O132J0285p071N71J3963o629k95j753k08q847Q760p661k538J4570
15752G751j3098l243m074P55l46j998m240J3040l459N207q04o671J1290j690n868
15737g448K085j3721N30P959M221m007Q007J0167n288n316K092P461n730j7807
15723a6795O12O373P906l657j8774L376R834L784m976k79K031N093J674p200O027
15708d971J8555N168r520l905q324J1030q795j0359j42J0094R684n075n036L252
15694A656M414M501p259r418o352K548J7320q43j6434R74P566Q814j89l789k347
15679A162n246k25O545P13o920K729J2173J5483P604N744o801q50n314k3984r962
$$ y = [-31258, -22693, -13157, -3993, 1829, 4414, 1981, -7352, -7268, -5348, -2083, 7858, 5248, -3105, -4821, -14802, -11528, -5396, 4889, -2182, -1611, 12352, 5723, 5428, 3675, 3467, -5380, 3380, -4281, -6819, 7751, -5347, -8590, -12664, -11909, -12255, -14253, -18493, -5453, -8912, -3705, -4509, -11180, 110, -1580, -7448, -5363, -19084, -18554, -10595, -6374, -10381, -2374, 7793, 2505, -2811, -719, 6742, 1012, -16795, -16183, -9810, -1904, -5561, -24335, -20959, -11125, -7341, -12317, -12596, -10565, -5472, -3798, -10998, -4971, 13584, 18752, 9232, 5327, -2997, 8033, -762, -11121, -11263, -1169, 8515, 3440, -1596, 1656, 6070, 10571, 3312, -6106, -12458, -9910, 7410, 6567, -9867, -8893, -1327, 7487, 7298, 3509, 1162, -4084, -4309, 2236, 2949, -3971, -1242, 10931, 26414, 34018, 39762, 32961, 32111, 26797, 2813, -7149]
15664g149j829O72P100J023k77j9234j8448q089J6540J8226J12P153N376L637
15650D813j639j0596J0640L831n188J2473o889j1293j463J0410j3229j2783j53
15637b1066j051k119P466k069R389J1797k408j6079p530m259M619O030P799j358
15623a0839p90q013M961P242m569J2262J5024m988k636J2980o385n245R442O98
15609A9144J23k4361j8241p606Q502J3483J1680J983o500r749Q570J0944P688
15596A5660Q31r110j27j602j3315o159k356m530J4831q9k6262o369M922O399o604
15581c3880N543J1910P352K729r711j6836R128L443K980m850j1966J7983K3923
15568G748O303j7091r167n702m084J2067o167R055j418J150J7030J1090m598k12
$$ y = [-7149, -8978, -8306, -1206, -183, -460, -19694, -38142, -46231, -29691, -11465, -11353, -4200, 1176, 4813, 3174, -7422, 3218, 7049, 1861, 14334, 7445, -3848, -5311, 5099, -8130, -20913, -21066, -22117, -24236, -16770, -18839, -9450, 2347, -61, -16140, -23670, -27929, -23310, -17280, -9481, -10839, -11629, -19642, -14681, -7439, -12008, 254, 15278, 10290, 7654, 20634, 14249, 9004, 18446, 19144, 19267, -5094, -23335, -30941, -22439, -8956, 2724, 4707, -1793, -11542, -2972, 7972, 15660, 16491, 7381, 7254, 5652, -7663, -13822, -16178, -20708, -5877, -5966, -32228, -38597, -33675, -27276, -33880, -28337, -16427, -9075, -6346, -16057, -32893, -23765, -20322, -17342, -22192, -34158, -16175, 7748, 14051, -3040, -12207, -17909, -21993, -9926, -16093, -7038, -8456, -7306, 9724, 20814, 16216, 16004]
15554A6004k839K11L005k163P35j1161j7100p376J1932O724J0950L284L612J2644
15540B8462n728j4711N683J5889J734l70m103j4214j0499M287k410r366J1999
15527F653j015p056p359P606O161p868k746j5579J0119o080P536M494J6126K67
15513A1259j2923N72R243q05j8141j3499L298m83l1k162l02J3360k50P141K410
15498a313L692R076j4310k116R349Q802K399n233K0108R722l699j5795j2570N879
15484A3991l831k969k8n159j3837m526L397M41m934p169J0207j45l532K074m681
15469b0701p349J9053R832Q298J475n113j502K574O696J2931k309n553n425j5651
15455b744Q958o103J294N611j1214l973J4414L921J1801q715q177J4496j3467
$$ y = [16004, 13165, 13376, 16381, 14218, 14953, 3792, -13308, -20684, -8752, -2028, 8922, 12206, 15818, 28462, 22734, 8023, 13706, 29595, 31329, 30959, 26856, 12642, 2143, 6430, 4020, -5346, 6653, 5638, -1418, -8777, -1171, 4990, -2878, -5624, -21203, -11084, -17164, -9628, -5134, 10992, 11259, -1664, -1092, 8151, 7346, -10795, -24294, -20996, -21479, -21510, -23672, -23974, -10614, -10864, -3723, -1313, 2379, 11455, -2855, -4971, 4378, 13180, 15579, 10346, 30454, 40176, 36477, 20682, 8112, 13991, 10160, 7191, 7163, 2004, -11833, -16359, -12962, -12521, -17455, -24624, -14417, -14562, -18094, -16020, -20701, -28050, -8997, 835, 9133, 10608, 5495, 3993, 6567, 13263, 26194, 23885, 18332, 12907, -2744, 6214, 111, 1405, 7016, -4198, -8171, 6243, 10164, 21965, 13250, 5073, 19569, 6102]
15442F102r40J1798N669j448j3642j8818j3314N435q475J8277J3735N010k790
15429F599L559j1792j7177p248N490Q739J614j153M854o068j91K0439R031p321
15415I375K11o231j4656Q548o915j0794L972Q730j1362p266N361J4088J5593l668
15401D986L931R526n922o054p719m113m341q188J8529J2163l831r112J2850J6769
15387B9474q412j2274l740K327J370j313j9340r91L162L416O3K746p681j569P125
15372e637J4021n732J1063O468r479j4439O499p26j091O8j2472J2511J7127j8363
15358a82j5783n490J469J3464K369K395K1006L953l478j2112l690l787L215O411
15344I760r025P80L408j735O95j389j2430P945l548n270K42j4006K614J5324L957
$$ y = [6102, 5162, 16960, 22629, 21181, 7539, -11279, -24593, -19158, -27633, -9356, 4379, 9389, 6599, 10158, -1634, -18811, -26059, -20569, -11830, -10216, -11369, -6515, -12583, -12774, 7665, 16696, 9375, 9586, 3355, -11301, -2753, -9668, -20462, -16490, -7760, -19122, -26388, -21027, -6939, 8654, 4986, 8917, 18443, 12521, 6467, -1252, -5365, -9706, -17894, 635, 12798, 8967, -145, 12705, 29474, 21062, 8788, 5048, 7375, 8745, 7432, -11908, -12899, -9737, -6321, -6258, -3512, -11193, -12762, -5637, 8384, 2652, 13715, 20183, 10704, -3735, 2764, 2038, 947, 1015, -11457, 1054, 18181, -182, -15965, -21455, -19986, -6522, -4153, -1758, 19248, 23201, 19723, 7611, 3921, 134, 3349, 9760, 735, 1515, 4923, 3188, 3883, 2494, -9936, -1991, -5539, -10809, -10567, -24573, -21959, -6635, -2678]
15329b678R56j2438k93O623M200Q127m967M195J0414q171j260J886j516J104M263
15314A0445J044o100R945L515j1342k159O726K1105m36j6908j4864j5923j1364
15301b6316K1364Q718m253j6105j8678K032K8578p79q551N416Q52j092P940K0456
15287A9582J8343q965k909l063q79j6j0922q740k319j0492L2k664M645O372K1855
15272A9860R070j4578j4852n232m567J074J3050N794K423o581r309n902O326M020
15258E96J1035n431k6198N317R996J760O604o577q583m659j109J3764J5033K1029
15244C2577l955k7121j5307j5903j1718J259Q523K1968L795j776q232j1429Q852
15231a8467J1884j135m106K3778K3165M264j1551j0877J213k552n750l921p149
$$ y = [-2678, -1722, -14160, -14453, -7830, -3630, 4497, -470, 3725, 14139, 5968, 4708, 6594, 5078, 6182, 10445, 11489, 5389, 15334, 18849, 7507, 5348, 12074, 33179, 32743, 15835, 971, -14952, -26316, -4952, 3766, -487, -16592, -35270, -33238, -4660, -5439, -13990, -8574, -7722, -8814, -874, 19582, 37925, 28960, 26051, 22988, 22109, 22093, 11171, 2431, 112, -10380, -10348, -13012, -8367, -1995, 19860, 28930, 14352, -500, -5732, -10299, -9225, 3825, 9619, 12042, 5461, -3848, -9750, -3424, 596, 11631, 6200, -19998, -14681, -4685, -2925, 3679, -2898, -11481, -16140, -17249, -3485, 11548, 32577, 28622, 1501, -13806, -29709, -41427, -40168, -31645, -9677, -5882, -7658, -15890, -27319, -18467, -6583, -7718, -11824, 11954, 35119, 39383, 27832, 16955, 18168, 15616, 9866, 5945, -1204]
15218a204j9711O22J4755K191o591J858j910O502M035J0474p186Q588j3280P106
15204F249K7232p379k4208o600N048j200J2231J795N319j2796J3369L224j0649
15191A1635j494R957L961J2136m684j1721j1856q524M554O848J2128q880p169
15178F891K806j520j5126P361m423J2493O925o780o878p293q443L307J0793j1629
15164a1516o545N122l172L616J4316Q829j6366j0429j142J229k742R03K140M488
15150a1269j4101N903J6119M028l296k11J3J192J0670J1999o358K076O884n66
15136B3083o670p187p451l419J205n507j6367p281J4618k774N01O968k686K0018
15122G051J0278k597j3370l299j7146M563L892m741l761L39k556j390R357N731
$$ y = [-1204, -20915, -20293, -5538, -3347, -9938, -8080, -9990, -3488, 547, 11021, 3835, 12423, -857, 6249, 33481, 26102, 1894, -4706, 342, -858, 11373, 13168, 18487, 5691, 19060, 22284, 11635, 10141, 20098, 24059, 36195, 31511, 19790, 7934, -590, 3964, 10812, 22940, 14060, 6891, 9697, 8177, -6949, 412, -4011, 8482, 15407, 8627, 1749, -5544, -13987, -10680, 113, -11516, -18061, -12939, -16111, -12495, 1821, 10650, -5716, -16145, -17287, -16058, -18800, -17897, -15757, -11269, -25370, -19467, -3348, 680, -2616, -2827, -2814, -1622, 9048, 21047, 14689, 16765, 23649, 23083, 16413, 9226, 1775, -1644, -439, -5946, -22313, -29594, -14976, -17750, -17249, -10281, -12967, 7051, 17329, 14732, 1362, -1937, -19083, -14520, -10628, -15369, -19130, -18791, -21347, -22737, -13380, -7649]
15108g649J058n137P26J2622J8437L533O82R436q012q860L789r3m529M750m481
15093A6272j5695j3939r243Q402N540Q870P931n155m500M57m354q649n70K1417
15079F784q181m204k037l147J974L872K954N782L319P482P542j491m344k677m133
15064I495n036K90m106R473l569n05J1253Q166j1294r52L813P07Q331K616k985
15049B5697l533j0830j6152L695J0646n559j0425J7629j006k198r805o86j331
15036c858j6709l469M089q930J745M893k797Q939N675L112J1045J0025J3977j0384
15022A7353k4948j1774L923J375K868O908N311J786J1324P842M551L787n258o470
15008A8578j0532j657R245J284m892L212O388K820J2489R572J573j4524j0711
$$ y = [-7649, -6591, -11728, -11002, 1620, 20057, 23590, 24272, 33708, 25696, 16836, 20625, 20532, 16003, 20753, 16272, 577, -13362, -22605, -14203, -8663, 207, 8138, 2983, -1517, -1060, -5414, -14063, -14633, 6784, -1397, -5601, -7638, -10785, -8811, -4939, -1985, 3797, 7116, 14598, 22140, 20649, 16305, 13628, 9495, 4459, 4749, 643, 10116, 6547, 6042, 17295, 25461, 14167, 13215, 17028, 17735, 26066, 28682, 25697, 22164, 11334, -4818, -1123, 9523, 3964, -6461, 11168, 10162, 7964, -1841, -2527, -3858, -20567, -24036, -19947, -28877, -27132, -22239, -25036, -16097, -10422, -7310, 3735, 13760, 27737, 17353, -7595, -19369, -15446, -14071, -11203, -4295, 1016, 2802, 14126, 21968, 26519, 30306, 25048, 18578, 8046, 6389, 15634, 16918, 12026, 15238, 21626, 24446, 36935, 46507, 48080, 33556, 22845]
14995B2845J2617n296j1234j995J446n704j1030K0015m907k0134N440J3423j4100
14982A386J720l510J487K450J76j478M639l013L141J2256L586j2314J9512M816
14968C4854r059j2847j4062j2533l398J257J5375O937n219n308N623L931J9026
14955B4577l012j2646l297m708o01K631j5113q799K000J7310N944K347Q701R369
14941B4703l440k300n058k428j4234j898J0414P875J3303j0434k1982M633L674
14928B828l038K205l63p367J603j420O78j71p869J0449P492M106M553q749p850
14913b913o46N022p22O406p710j4978l854J1636Q021O527M363Q718J243j604L799
14898B3308j1394j4351M96J186O463J676J6915N018q134n164K367k74M426J8013
$$ y = [22845, 35462, 30166, 18932, 16937, 18383, 12679, 1649, 21664, 16757, -3377, 2063, 15486, 1386, 3106, -404, 1083, 3533, 3709, 2231, 6870, 3857, 6998, 19254, 22840, 10526, 30038, 34854, 25795, 12948, -1114, -13647, -17045, -15788, -413, 6524, 1305, -4003, 1620, 5551, 24577, 21565, 8919, 5622, 914, 313, 2944, -12169, -20968, -18968, -1658, 4286, 6633, 15334, 24703, 21263, 18963, 13905, 11477, -2757, -4655, 5759, 13634, 26937, 16503, -5479, -846, 2828, -210, 1995, 1632, -5735, -4132, -5552, -4874, -5045, -12914, -2465, 5027, 9133, 13686, 4937, -2913, -3559, 1463, 741, 7147, -563, -15541, -19395, -7759, 262, 6789, 11152, 19870, 21113, 19509, 23308, 11914, -2437, -1941, -755, 5708, 7384, 24299, 29317, 21183, 16019, 18386, 18112, 22538, 40551]
14884D0551O109j6116r087r234k281J0014j1279Q26J1707K035j0248k256R544
14871B0285Q275j1386q488n0l202K499j3092N98L539J0744J079N98O455n416Q838
14856B1276m498j2614M047R981K0600r306j6448p290l596R13j579Q107q186j7385
14842a5978n226M023J8781J3691N991k2061j3872M287J5072R160M604J0009M421
14829C2902p343r234K604M269P659q05j5324o577j669J55J1409J7312l834j3395
14815A8129j4582Q57j63M185p756j998O421M042k827N695O047M7n655r03j2887
14800a348j6747l639R137R488q371R028J2033j0777j2107r207R025J4608Q108
14787I231n000p043O637n439Q3o192m813K07K23l65N90J3454J955J709J1445L750
$$ y = [40551, 46660, 30544, 21457, 12223, 9942, 19956, 8677, 9503, 21210, 23245, 12997, 10741, 20285, 28560, 17174, 8686, 8636, 5434, 7933, -5159, -4561, -1022, 9722, 10801, 11399, 17854, 12438, 21276, 16778, 4164, 8211, 18192, 38792, 29486, 13038, 5748, 2152, 3065, 1486, 9593, 1407, -15978, -21204, -17181, 1600, 15291, 21282, -779, -14651, -10364, 4708, 13868, 18472, 28481, 32902, 25559, 16325, 18929, 23198, 30857, 30052, 14728, 8151, 6482, 6637, 18046, 35358, 31524, 18129, 3547, 4404, 4241, 8426, 670, -1328, 5093, 9135, 6308, 12003, 18050, 18097, 12442, 11539, -1348, -18095, -21734, -12597, -3109, -11480, -2452, 9581, -1196, -13303, -22510, -13485, 1123, 9231, 4231, -2812, 3825, -1614, -1531, -7723, -12536, -12329, -12106, -12471, -11881, 1573, 3528, 5237, 16682, 20432]
14771B0432j1616j1192j3414P157J2618n60m263q390J3418K0498J3943k703J340
14758C7268j6741j5802QP306J5381P866J733j6128m332K333N760Q7p612p508K389
14743A2008Q376R116j736J650J0182L095J83j6684k2912k723K0348l552p552k063
14729G736n844q894J0658N230o963J4030J2504K050j929J790r355n370m913j6566
14715e836J4523M392j882m774j205n47P461J5089J6858r201k109J3636j0469j2545
14701B3391j6305J0558L353L8o708K15k057M593J951j2748n925J550J6798J4099
14687C2803Q239j9690r976j0449n282j1797Q969J6381j520j3688l899r800N542
14674a4167K634J4279j458j3473j000P26j2259N757O140K782J6035R138l818l784
$$ y = [20432, 8816, -2376, -15790, -8633, 3985, 3425, -838, -9228, 4190, 24688, 38631, 35928, 37268, 20527, 4725, 4733, 12039, 27420, 35286, 37019, 20891, 16559, 18892, 24652, 24739, 17127, 9619, 12008, 20384, 29500, 27764, 29414, 39596, 42691, 42874, 26190, 3278, 555, 20903, 17351, 9799, 7736, 1892, -7002, 3656, 8886, 1923, 15953, 28457, 30507, 28578, 30368, 21013, 15643, 10730, -5836, 8687, 13079, 11197, 6423, 5218, 4671, 12132, 27221, 44079, 34878, 32769, 46405, 35936, 23391, 7086, 17644, 20997, 21035, 14327, 14542, 12485, 17078, 19029, 6281, 356, 1906, 18704, 32803, 41042, 21352, 11376, 927, -4355, -16152, -7183, 9198, 7678, -6010, -9909, -19709, -14167, -11533, 2746, 1288, -12185, -13185, -12459, -24718, -18961, -12821, -10039, 5996, 15134, 11316, 7532]
14660G532L562q479j425N084J7050M542N787k4642j2805J0063k913M982K640J6593
14646B7571J706k494k0056K935K0390m384j4563k12q654M782R052o967n629r651
14632f174k386R473M883P590j285K345J2804m122M908j022k211k304L415q983
14618A6931n361N293k97m370L243J511l783N181M264m922Q661J0521p04K512j7275
14603B1405j2532l787p74P866N469m649j7176j0926j3712j1522Q144K8779J5227
14590A1812K443Q709n214j0480L8J653m035Q16J6030k900p858p929l956o8k247
14575c186Q447J8152K51l530p51M687Q744j984j1106P719J1868j2996r42j8162
14561G211j3182N316J0525N783O093l844rN141N377p376j5904N45N006O348J5524
$$ y = [7532, 11094, 2615, 1190, 6274, 23324, 27866, 33653, 9011, -3794, 6269, 3356, 8338, 10978, 27571, 29277, 26783, 6727, 9662, 30052, 25668, 11105, 10893, 2239, 7021, 16073, 9106, 3477, -6174, -8560, 913, 5796, 13386, 12101, 14446, 27250, 23128, 28036, 27014, 24803, 22499, 25914, 16931, 11570, 16863, 16566, 12196, 15439, 16950, 13167, 18348, 22612, 17690, 26351, 36872, 36168, 38680, 21405, 8873, 5086, 4312, 12178, 17647, 12998, -4178, -15104, -28816, -40338, -32194, -3415, 11812, 14255, 22964, 17750, 7270, 7308, 8961, 4926, 5742, 21772, 18872, 11014, 3085, -871, -939, -3186, 5261, 23413, 23664, 20134, 19383, 24070, 32814, 30830, 19724, 27443, 39311, 26315, 25373, 7211, -5971, -655, 9870, 15653, 21746, 17902, 17893, 23034, 28411, 21035, 5131, 5676, 10682, 17030, 32554]
14546C2554m538j7697k782J1528J2641j23P174m752j7207j2967O040P996j085
14533A6782j2247k17Q36j5091n953Q833J7497n674n905lJ124j0259j0099J6312
14519d064J3791J1597J407q063J5878J3549M873K477R47q083j3117q256l085p07
14505A9144p75j0511p53J2139R826o898k125r89L913M211N597m615l911J604j107
14490B4750J64K892k551l173M92l684j5001J2699N306j2604m99J949J4044J3716
14476C8500O172j3987k401o125J021N133M960K791j0255J808Q314o63O0r444M75
14461B6359j2956K205J450J5025N083N52p307L850M348N036n245P513L1277J8629
14447I5819J9850N2347M6961J7264K9628M3767L5984l39l8002n5144k9051l0328
$$ y = [32554, 28016, 10319, 7537, 19065, 31706, 31583, 38757, 34005, 16798, 3831, 9871, 17867, 16782, 4535, 4318, 5154, -9937, -15890, -7057, 10440, 4766, -1139, -1142, -18, -10277, -20376, -4064, 9727, 21324, 22731, 14668, 30546, 44095, 48968, 51445, 52392, 44309, 31192, 22936, 19851, 19144, 18369, 7858, 7105, 19244, 29070, 22172, 20047, 19058, 22971, 27182, 32779, 28164, 24253, 25857, 24750, 24914, 27806, 25255, 22082, 22574, 18890, 3889, 16588, 21894, 9290, 8791, 10740, 24784, 38500, 44672, 30685, 28284, 22159, 23180, 28313, 33273, 36064, 25809, 27617, 35931, 35268, 35328, 25884, 26359, 13403, 15608, 17058, 32083, 37166, 37718, 30411, 34261, 38609, 43645, 38400, 45913, 77190, 95819, 115669, 168016, 214977, 232241, 261869, 305636, 341620, 341281, 303279, 248135, 219084, 188756]
14435A88756l4789k2863m950n057l858j9785j4616K173J7327r568j0946j452o212
14422G4160O053L464Q611K995o269p185L665N887l010j3198r075N832K2511K5210
14408A19651L0331K6349L9343L4721M0928L9415K553k0633k4527m5297m2770m3708
14396A56356l4801j7238j6707p338j893j3256o268k3218j3103o625n812L983L072
14383A7152n350P025P648p094J427L80q436M714J357Q192L904N926N919j0876
14369C1888j0056P446J0563r998j1987j1224J1101J9297p033N305R268j3402j0312
14356B0856K986K695L301Q641K0133q35j314Q211Q007j277Q360J8724K6026M3939
14342A68453P1109Q7270Q2519O1268L6296N787o234j4962k6364m3222n7442p4146
$$ y = [188756, 153967, 131104, 126154, 121097, 117239, 97454, 82838, 85011, 102338, 92770, 81824, 80372, 74160, 80213, 83677, 92288, 95283, 89014, 81829, 85494, 91381, 88371, 75173, 66098, 71930, 94441, 119651, 149982, 176331, 215674, 250395, 291323, 330738, 333291, 312658, 288131, 242834, 200064, 156356, 121555, 104317, 87610, 80272, 78379, 65123, 58855, 35637, 22534, 15909, 10097, 14080, 17152, 11802, 18827, 26475, 19381, 20808, 21188, 12752, 17466, 18823, 27015, 30919, 36845, 42764, 31888, 21832, 29278, 39841, 29843, 17856, 6632, 17733, 37030, 29997, 35302, 44570, 31168, 20856, 23842, 26537, 29838, 38479, 58612, 57777, 56463, 64674, 72681, 71404, 79764, 98488, 124514, 168453, 239562, 326832, 409351, 470619, 506915, 512702, 506468, 491506, 465142, 421920, 364478, 290332]
14330B90332n4114l7269l6002r878Q39j0070j9927m978j532k3135k5252j5725
14318E3289N1K464p589k3727k39O624N002P277o262j0934J507o257n340L978P03
14303B0547o185J937N741q978Q04l146q501M289J5375J63P649P665n748l341j189
14288B7082K610J648J740K810l390j2246p420l875K534P83J2152r205n026J9350
14274B9547o542r201P50J2470r805K39K267J001J3000Q92j4361j2779l094m807
14260d23n896j1258L785P011Q416J0083R717J1640O203J2478r19k866p387l50
14246D0234R478M625Q4L754J4839J3341o039j6875j4671m103l03l616M531Nj4340
14231C0944J448J023o9O548K09M515o0l133J9048L830j707L23o148r204k912m831
$$ y = [290332, 236218, 198949, 162947, 153069, 153908, 143838, 123911, 118933, 117401, 94266, 69014, 53289, 53340, 55804, 48215, 24488, 24249, 30873, 35875, 43152, 36890, 25956, 27463, 21206, 15866, 19844, 20547, 14362, 16299, 22040, 13062, 13866, 10720, 2219, 6508, 21883, 22046, 29695, 37360, 31612, 28271, 27082, 29692, 31340, 33080, 35890, 32500, 20254, 12834, 8959, 11493, 12276, 24428, 15223, 10197, 29547, 23005, 13804, 14554, 27024, 17219, 17458, 19725, 20726, 33726, 34618, 20257, 7478, 4384, -423, -6319, -17577, -13792, -6781, 1635, 11718, 21435, 33075, 39278, 51756, 50837, 47971, 40584, 40234, 49712, 54337, 54421, 58175, 73014, 86355, 80316, 63441, 48770, 44667, 44364, 40748, 45279, 45284, 30944, 32392, 33415, 33346, 39894, 40103, 44618, 44558, 41425, 60473, 64303, 62596, 62919, 56771, 47567, 44655, 39824]
14215C9824O614R5P739r784l493j6435p409J4256k145R041J975l700N641J2061
14201E4280o019o691J1361O094J421p268j174j8788r07J4312J0639m562K807J051
14187E6556l675j0163J575n890q825J953O285L032M4k6891j6627J4748J4329J6220
14173D2671m708j6107j5133K2087K9666k92j0153n844k500K387m065k820M758
14160C9947J576j5857n315j1757P121K188j0132j044O572o611j3773n992Q955
14147d122k629J3610O942j1844j3366j094M460P347J5337J5883Q406P665r065
14134C7530j2684K078J6276j49K992M497q741j2970r147J0503K245O623n04q908
14120B9641j402J2520J4903J3673J786n363r112N822J3179n004r242M151j0704
$$ y = [39824, 46438, 46533, 54272, 44488, 40995, 24560, 17151, 31407, 29262, 38303, 40278, 36578, 42219, 54280, 48261, 41570, 52931, 59025, 60446, 53178, 52004, 33216, 32309, 46621, 57260, 52698, 55505, 56556, 52881, 42718, 44293, 38403, 29578, 31531, 37816, 40848, 40892, 14001, -2626, 12122, 26451, 42671, 37963, 21856, 6723, 28810, 58476, 58184, 48031, 42187, 39687, 42074, 38009, 35189, 39947, 41523, 25666, 20351, 8594, 15715, 17903, 7771, 6727, 13299, 6688, -7085, -13077, -4122, -6751, 6859, 13801, 1957, -11409, -12503, -8043, -696, 14641, 30524, 38930, 46595, 37530, 24846, 26924, 43200, 43051, 46043, 50540, 41799, 28829, 19682, 30185, 32430, 39053, 38549, 29641, 28239, 40759, 55662, 69335, 71121, 65758, 56646, 62468, 75647, 70643, 61401, 65552, 54848]
14107E4848n810p559J1713N354j249J533N637J4403J8075J650K2599N487j1836
14094A14845O299P765L122K684r185j0919j5482j2285K524J2653M359K771l724
14081A05427j0325K688M391J4508K2037J9335J3012K762J2731J1381j745j657
14069A94545j974J0876n641k3170P719J4584p014j1027Q539L276P055L016L70
14056B01154k98R356J6584N830J2849K3104N487j7770J5237Q533R584P286L123
14043C00059J058N030j6331M164J1134J7947K4685K4922J3508L720R905N668K5190
14030D30659K9909Q863K5688L6904K7237K3931K1884M0913N0405N3767N5458O9649
14018H75267R6621J12541J38942J51654J75136J78849J62662J48641J38152J37743
$$ y = [54848, 49038, 41479, 53192, 58546, 57297, 58830, 64467, 78870, 96945, 98595, 121194, 126681, 114845, 121144, 128909, 132031, 134715, 125530, 114611, 99129, 86844, 89368, 102021, 106380, 109151, 105427, 95102, 97790, 102181, 116689, 138726, 158061, 171073, 173835, 186566, 197947, 196202, 194545, 192571, 203447, 197806, 174636, 182355, 196939, 189925, 178898, 187437, 190713, 197768, 200784, 201154, 200856, 210212, 226796, 232626, 245475, 268579, 274066, 256296, 271533, 280066, 289650, 296936, 300059, 301117, 306147, 289816, 293980, 305114, 323061, 347746, 372668, 386176, 389896, 399801, 405469, 430659, 460568, 469431, 495119, 532023, 559260, 583191, 605075, 645988, 696393, 750160, 805618, 875267, 971888, 1084429, 1223371, 1375025, 1550161, 1729010, 1891672, 2040313, 2178465, 2316208]
14008B316208J48871J71356K14814K93446L52869M59728N59098O88702Q31643
13999F036735R93405J250219J666320K255238L087089M289479N776233P429764
13991C2784482Q702818Q898997P341262M048839j50484m123915o816574p779756
13983D2905669p317609o103876m777240l627159k739610k062937j580772j210891
13975A3485575r76974q29215o75439n63588m94941l78423k57796j43069j1435
13966I154695J11338K64434M17575N69805P28683R10563J150533J471537J928168
13957A6707331K572817L454143M625109O010737P354930Q151057P667024N404221
13949F1947369J627199k755081o478331q583779q919131p862432o258614m732061
$$ y = [2316208, 2465079, 2636435, 2851249, 3144695, 3497564, 3957292, 4516390, 5205092, 6036735, 7030140, 8280359, 9946679, 12201917, 15289006, 19578485, 25354718, 32784482, 41487300, 50386297, 57727559, 61776398, 61625914, 57501999, 50685425, 42905669, 35588060, 29484184, 24706944, 21079785, 18340175, 16277238, 14696466, 13485575, 12508601, 11679386, 11003947, 10440359, 9945418, 9566995, 9309199, 9166130, 9154695, 9266033, 9530467, 9948042, 10517847, 11246530, 12157093, 13307626, 14779163, 16707331, 19280148, 22734291, 27359400, 33370137, 40725067, 48876124, 56543148, 61947369, 63574568, 60819487, 54341156, 45757377, 36838246, 28975814, 22717200, 17985139]
13941A7985139l518077k611670j958946j531586j211841r64317q02030p02967
13933D683705o16262n27183m39570l77211l24862k67494k24721j93212j68872
13924A544318j25270j00850r5015r6272q9972o2327o4327n4664p5073p1564n7553
13913F51431m5243m8366m2966l6798j8667k4877k0500k3376j5903j9556k588j0709
13901C41882k0880j8952j6614j8058p707l0402l757j4611k2341o415J6081R158
13889B07384o757j1835k2105k7383j4235j934O820k387m807j7095j732K29J734
13876A05897M842P602N060q572q203l015j6436j1556J722P116j999p29M606m35
13862H5900O479j6O187k033J761j031q906j0361N268J1598j626j4124l442K561
$$ y = [17985139, 14467062, 11855392, 9896446, 8364860, 7153019, 6188702, 5386672, 4683705, 4067443, 3540260, 3100690, 2723479, 2398617, 2131123, 1906402, 1713190, 1544318, 1419048, 1318198, 1223183, 1126911, 1036939, 974612, 910285, 855621, 780548, 708984, 651431, 606188, 557822, 514856, 478058, 459391, 434514, 414014, 390638, 374735, 355179, 352591, 341882, 321002, 302050, 285436, 267378, 259671, 229269, 225512, 210901, 188560, 182145, 198226, 207384, 200627, 188792, 166687, 139304, 125069, 123135, 129955, 127568, 122761, 105666, 103934, 104163, 105897, 110739, 118341, 123401, 114829, 106626, 103611, 87175, 75619, 77341, 84457, 82458, 81729, 86335, 85900, 92379, 92363, 98550, 96517, 98278, 97247, 88341, 77980, 83248, 94846, 93220, 79096, 75654, 78215]
13848G8215M366j0873q528j3219J027p270j4314R266O867L423l675J3670K3370
13835H2325K0462o3n715r835Q953P569n210j2862q457k397J0908J3688N829M127
13821A09322R62N664R487L40k2700k2174p916K471j4739J893K229M798J1796J1569
13807I3002k618j4154j3845P491K200j6648J494Q981J2361P950q66l030L195L203
13793H8716J0421N941j2711q990m952l735J603K455j3867j9531p086K114j1343
13780B9035J4807L864K856l467J3751J7616l655r204Q442O203k0778j0989k680
13767D5801r045m027R169J2335L346k4051j3933R792J972j4030q996O075J5188
13754B9596K389k420n650Q896L962k816n353J2865p359j4287K990q793P398J8172
$$ y = [78215, 82581, 71708, 63180, 49961, 50988, 43718, 29404, 38670, 45537, 48960, 45285, 58955, 82325, 102787, 102724, 97009, 87174, 96127, 103696, 98486, 85624, 77167, 74770, 85678, 99366, 105195, 109322, 110284, 115948, 125435, 125775, 103075, 80901, 72985, 75456, 60717, 62610, 64839, 69637, 81433, 93002, 90384, 76230, 62385, 69876, 72076, 55428, 56922, 65903, 78264, 86214, 85348, 82318, 85513, 88716, 99137, 105078, 92367, 83377, 78425, 74690, 76293, 78748, 64881, 45350, 38264, 40378, 29035, 43842, 47706, 50562, 47095, 60846, 78462, 74807, 65603, 74045, 80248, 59470, 48481, 45801, 36756, 32729, 41898, 54233, 57579, 33528, 19595, 29387, 31359, 17329, 8333, 14408, 29596, 31985, 29565, 23915, 32811, 36773, 33957, 28604, 41469, 34110, 19823, 22813, 14020, 21418, 39590]
13740C9590Q789N67N76l55J64r416R73l632l551m89J615J2572K325j4224n364
13725C0140o94l81N288K712J7715K574j1840q294l117O298j1525j9222Q287J4704
13711C2645J2574j4333m847n184Q86j3118K004p82n346J2471k533J2249K660k396
13697B6950O046J2781k3188k7222m650R016L664Q775K353m626J3561O565p353
13684B2672n078n742r4J4829J6194J507q213k875N87J999k948J157p796L252j0100
13669A9351p946P39O375Q834o591K979n048R612O860j2088q120k651J2878J0882
13655C6066K589l834L748O529j0317J724N1L861j2409j0675O515l610m374L861
13641A9725N001J4454L656j2561o2o260n447J530j557Q053l365Q869j726J176
$$ y = [39590, 48379, 48946, 49522, 49167, 49331, 39915, 40888, 37256, 33705, 33216, 34831, 47403, 49728, 35504, 30140, 29446, 29065, 34353, 37065, 54780, 57354, 45514, 37220, 34103, 40401, 28876, 9654, 17941, 32645, 45219, 30886, 26039, 20855, 21741, 8623, 10627, 9845, 4499, 16970, 14437, 26686, 29346, 26950, 32996, 45777, 22589, -4633, -9283, -267, 3397, 12172, 14525, 9899, 23460, 30025, 22672, 17594, 11852, 11758, 26587, 42781, 44288, 36075, 33200, 33787, 35786, 32838, 33995, 26199, 29451, 19351, 11405, 12144, 18519, 27353, 20762, 23741, 18693, 28305, 35165, 23077, 14957, 12306, 25184, 36066, 38655, 34821, 38569, 45098, 34781, 36505, 36556, 40417, 28008, 17333, 23848, 20238, 15864, 19725, 24726, 39180, 42836, 30275, 30213, 23953, 18506, 20036, 18479, 26532, 23167, 32036, 30310, 31486]
13627C1486L773q471j806k303k6674j37J7728K2055M869j3044j0505k100N373
13614B0244j1615j889k014P148N419j419J896R109j7540r264j42P452J4859Q55
13600B3099q96p491q689k867J9183Q507q888N120J846q659n646j5966p099J6996
13586H550R087P171N602j6938r859m845m097K726j208O329K025N949O489r970
13572G011J0780N945Q594k853Q351m369o383P51j0732p166n800N425J0079J380
13558B1013l869J3709J1478j2596M942r610j031P876l169j019M473j356K711L193
13544C6745J219n087K656J9198J2987P510M562K1872R891l935Q194K8102M0594
13531A84508O0854N1409N1314L2129o464l1139l8915m9416k7331k4570l4201l4390
$$ y = [31486, 35259, 26788, 24982, 22679, -3995, -4132, 13596, 35651, 40520, 27476, 16971, 14871, 20244, 8629, 6740, 4726, 11874, 17293, 15874, 17770, 26879, 9339, 75, -67, 7385, 22244, 23099, 22203, 14712, 6023, 3156, 22339, 30846, 21958, 27078, 28924, 20265, 14619, -1347, -8446, 8550, 17637, 24808, 30410, 13472, 3613, -1232, -5329, -2603, -3811, 2518, 4543, 10492, 16981, 7011, 17791, 23736, 32330, 29477, 37828, 33459, 27076, 27827, 17095, 9929, 4129, 9554, 19633, 21013, 17144, 30853, 42331, 29735, 34677, 25067, 24036, 31912, 28743, 27724, 32197, 30841, 33552, 36745, 37964, 32877, 35533, 54731, 67718, 75228, 79790, 101662, 111553, 107618, 115812, 143914, 184508, 245362, 296771, 348085, 380214, 373750, 342611, 303696, 254280, 226949, 202379, 168178, 133788]
13519A33788j9885j060j0448k7155k149j17K72m071M44k177N261J361l562j2400
13505E8102P800j0592J3487J6507Q581P273L991P567k839J2472K1189L1098N7443
13492B32079N2504L4298K2818O145j3099l8521k8598l6874n5134l7783j6744k7493
13480I3598j8093m009l784q179k7437j7179j603K5243J1046q391j3721o362j857
13467A9272q863q080o626J0148L333m434q274J948J0521N726M65l749j4016M542
13453A913J0539J853q325L089K36q055l789J8102K0009m278j8182m540K647j8418
13439g199R885p558q796n099L609l337k281P427L348J811O485N354L227o18j1991
13424e733m572M919Q916J1829K301K33k395n664N490K602l240P920p89R637q652
$$ y = [133788, 113903, 112843, 102395, 75240, 73091, 72974, 73246, 69175, 69619, 67442, 72703, 74064, 70502, 58102, 65902, 55310, 68797, 85304, 93885, 101158, 105149, 112716, 109877, 122349, 143538, 174636, 232079, 284583, 318881, 341699, 347844, 334745, 296224, 267626, 230752, 175618, 137835, 121091, 93598, 75505, 71496, 67712, 59533, 32096, 14917, 13314, 38557, 49603, 41212, 27491, 21129, 19272, 10409, 2329, -4297, 5851, 9184, 4750, -3524, -1576, 8945, 14671, 15136, 11387, -2629, 1913, 12452, 14305, 5980, 9069, 9305, 1250, -2539, 15563, 35572, 31294, 13112, 8572, 11219, -7199, 2686, -4872, -13668, -18767, -15158, -18495, -20776, -13349, -10001, -8190, -1705, 3649, 6876, 6258, -5733, -10305, -5386, 3530, 15359, 17660, 17893, 15498, 9834, 15324, 17926, 14686, 22606, 21817, 31454, 22802]
13409B2802k552L614j1167O075J3063j5361j5067j731L373J1805J6203M467p774
13396B7750j6648j0951o533O031r721J4076J4812m412r599N182J687m55m156j9703
13382a2640j0288J4620R948J8413k118j1685j606J0016l384n647J63O812p664
13369D940O503O504N871Q692J25q879p12j9153q512j1235l728J6805J7041o156
13355H106j5283r423N286J2197L194K015j042m725O02N980O555m733j3187J0270
13341E812kj648K979m240Q739J4108L594j1189q092M846k383p339L657m295m315
13326B32j2205j058P493M66j4984M462M38J216J3933J2753J1749p822j2838k461
13312A374P609j88M807L429j1807J0596O348j958l132N19O524N281q715r986K314
$$ y = [22802, 20250, 23864, 12697, 18772, 31835, 16474, 1407, -324, 3049, 14854, 31057, 35524, 27750, 11102, 151, -6382, -351, -10072, 4004, 18816, 14404, 4805, 9987, 11674, 11219, 7063, -12640, -22928, -8308, 1640, 20053, 17935, 6250, 4644, 14660, 11276, 5629, 5792, 12604, 4940, 11443, 17947, 23818, 32510, 32635, 23756, 23044, 3891, -4621, -15856, -19584, -2779, 14262, 8106, -7177, -16600, -11314, 883, 4077, 6092, 5050, 325, 927, 6907, 13462, 8729, -4458, 5812, 5810, 4162, 7141, 2901, 11640, 25748, 29342, 18153, 10061, 14907, 12524, 5185, 8842, 4547, 232, -11973, -13031, -5538, -5072, -20056, -15594, -15156, -13940, -7, 12746, 24495, 16673, 3835, 1374, 8983, 8795, 13602, 17031, 5224, 15820, 22168, 20210, 17078, 17597, 24121, 29402, 20687, 10701, 13015]
13297A3015R728j9300j0308n227J1774Q614J44n311K654J2327L063j3668j194
13284F311J1068K883n255j411Q371j432k8456R58J5931j0780o540K205J0694R462
13270A4009J1659l846n184Q231o679m815n20J7711P36j4464l555J0094l14K532
13256B5595l294J82r156Q728O937q366M277R312L576k0091j6745j7452J5358J2401
13242A1262O168J267p355J2654J2246R654N23l76J4682J0799q042J349p366M163
13228F1628o857j1828q945j4912l603J2227J4279K647q825m967J905j2639o999
13215A3111j747M647R058O67m57r138j8877r13J1479M005Q611K866M546j2406
13201A5452o134k776k956J6264K105K384n199M1486L6088J1375L88k2482j9123
$$ y = [13015, 22743, 3443, -6865, -12092, -318, 8296, 8440, 3129, 5783, 18110, 21173, 7505, 6311, 17379, 20262, 15007, 13596, 21967, 20535, -7921, -6963, 8968, -1812, -8352, -6147, 4547, 14009, 25668, 21822, 16638, 24869, 18190, 13375, 12855, 30566, 31302, 16838, 13283, 23377, 23063, 25595, 22301, 22483, 13327, 22055, 28992, 20626, 24903, 34215, 37791, 17700, 955, -16497, -1139, 11262, 17430, 18697, 11342, 23996, 36242, 45896, 46419, 46043, 60725, 71524, 63482, 64831, 57465, 61628, 54771, 42943, 33998, 19086, 15483, 27710, 41989, 44636, 35811, 30844, 32749, 20110, 13111, 11364, 16011, 25069, 25736, 25279, 16141, -2736, -3649, 7830, 11835, 20446, 23312, 27858, 15452, 9318, 6542, 3586, 19850, 21955, 24339, 19140, 60626, 96714, 108089, 108477, 85995, 66872]
13188F6872j9978k1538r804j3845j1655o246M352J8802L5957K7096K4811M465
13176I9289J278K956N802J8591K6634L7774M8602R2421J54283K43191L69564L75237
13164A475622J84211m9568k71885l70080l23075k13292j17648n5287k9410m1630
13154A87958n2905k8317J4660J51m057J2537L7837M7769J0709k8127n1194n2703
13142I4318j2818l458l232j8487o823J15m706j1988K09k236K108K123J572q899
13128B7798L004N150J1149l618k0743q741p72J8420J1096N118p319l163j5754
13115B1625q736P871J1843k4953q249J0194J6669J7721K278J4859K6999K8648
13103A16769M6755M2598J5046k9444m5582l5958k8484j5653o747j2758n727Q114
$$ y = [66872, 46894, 25356, 15552, 1707, -9948, -16194, -11842, 6960, 42917, 70013, 94824, 99289, 100567, 103523, 109325, 127916, 154550, 192324, 240926, 333347, 487630, 730821, 1100385, 1475622, 1659833, 1610265, 1338380, 968300, 645225, 431933, 314285, 258998, 229588, 187958, 135053, 106736, 121396, 121547, 117490, 130027, 167864, 215633, 226342, 198215, 147021, 94318, 81500, 78042, 74810, 56323, 49500, 49615, 44909, 32921, 33130, 30894, 33002, 35125, 36697, 27798, 30802, 35952, 47101, 43483, 22740, 13999, 13227, 31647, 42743, 47861, 40542, 37379, 21625, 12889, 20760, 32603, 7650, -599, 9595, 26264, 43985, 46263, 61122, 88121, 116769, 163524, 206122, 221168, 191724, 146142, 110184, 81700, 66047, 59300, 46542, 40815, 48929]
13091D8929m931j7730Q104Q47J0432j800o732p009l588J0791J6297J1038j5163
13078D9485l614k625j1046K624q320N047k155p701P217J2870j3752j1686p433
13065H911j862L106N157J0878K4239M425j437K1026J3336m606J9692J0879k0192
13052I3552k4166l0191j3548M869k348J086P37J683j297o804o098q80q464R58
13038I089j7050j2184K561p649q635j6330m17J8609M1387M0074L0612J646j5011
13025F6702j3124q433j3094j7800o822J1003P482J6287J0304j0228j0120j4004
13013A8153j71P079k828j676N949r955o452N43J1477j6073j2695K640J5584K045
12999A3620J7277M023M11n617J405m904P551M456J4401J068j5634j3217K877J022
$$ y = [48929, 43998, 26268, 34372, 35219, 45651, 43851, 37119, 30110, 26522, 37313, 53610, 64648, 49485, 45871, 43246, 32200, 34824, 26504, 31551, 29396, 21695, 28912, 41782, 28030, 16344, 8911, 7049, 10155, 15312, 26190, 50429, 54854, 53417, 74443, 87779, 83173, 102865, 113744, 93552, 69386, 39195, 25647, 30516, 28168, 29254, 29991, 31674, 30377, 23573, 17475, 16595, 8131, 9089, -7961, -20145, -17584, -25233, -33868, -50198, -50615, -32006, 9381, 49455, 80067, 81713, 66702, 53578, 45145, 32051, 14251, 7429, 18432, 25914, 42201, 52505, 42277, 32157, 18153, 17982, 25061, 22233, 20557, 26506, 16551, 10099, 10642, 22119, 6046, -6649, -4009, 11575, 13620, 30897, 34920, 35331, 29714, 31119, 26215, 33766, 38222, 52623, 53691, 38057, 24840, 27717, 28739]
12985B8739J947R704J529J5300K0311K0870K5069J2088K4585J8128R764o082l8411
12972A43541k5724l1382l7364k3669P780J3790J0964K0056M549j8065j0571J0470
12960F4375J7379j6981j6018j2363j0527q986j3412j6372n297k956l065R422q744
12947b3545K222J8647J3020m48m154j956J2631P99j815l249O506O418R273K6091
12933F0440o497j4600j001K1056J0231L432k953p379l06p732m674J0234K3779
12920H4030K3870L770q441N401K324k1939j3121j4203J090n640J4024L2938M6247
12907A50350O4826M6320R973k3426m5807o0324l9955j9324r306R88o430r953q723
12894D9209p971M144j706j3118M322n354j4907k1773j7922r240l4645k9171j8350
$$ y = [28739, 30686, 40390, 41919, 57219, 77530, 98400, 123469, 135557, 160142, 178270, 188034, 181952, 143541, 117817, 86435, 49071, 25402, 33182, 46972, 57936, 77992, 82541, 64476, 53905, 64375, 81754, 64773, 48755, 36392, 25865, 16879, 3467, -12905, -18202, -21158, -24223, -14801, -23545, -21323, -2676, 10344, 9896, 5742, 3786, 16417, 17216, 15401, 12152, 18658, 25076, 34349, 60440, 53943, 39343, 38342, 59398, 69629, 73061, 70108, 62729, 62423, 54691, 50017, 60251, 84030, 107900, 111670, 103229, 108630, 110954, 89015, 75894, 61691, 62781, 57141, 71165, 104103, 150350, 215176, 261496, 271469, 248043, 202236, 141912, 101957, 82633, 73327, 74315, 67885, 57932, 49209, 41238, 45382, 43676, 30558, 34880, 29526, 14619, -7154, -25076, -34316, -68961, -98132, -116482]
12881a16482k0448q994k3387k4389r48L2581P4547Q4261P3175L2152J4100n602
12869A10566j4595L416m794q052l034k990J1851j3167k2116k2965k1132j1735
12857A253j570l436J3428p799L90K6985O5529P3933M9952L3968J1694j186KO530
12843B69673O193m792j4190r979p427j672L096P385j1882j3461j0318R057J473
12830B23156N452J8456J3345m299j1721J445j3985l632J9261J1693K692q205K72
12817B53930l201k195r201K685J6749P62m435j7186o287J0335J3806K5083J0133
12804B90978j0787K757p603J698N615J125j0386m953Q960J2713J8074O380Q443
12791C23014K4687K2356J3787J7375J485K2443J1199P211J8316J8316L777J7277
$$ y = [-116482, -136930, -145924, -169311, -193700, -194648, -162067, -87520, -3259, 69916, 102068, 116168, 110566, 95971, 99387, 94593, 86541, 83507, 80517, 92368, 79201, 57085, 34120, 12988, 1253, -317, -3753, 9675, 1876, 2266, 29251, 94780, 168713, 218665, 252633, 264327, 263141, 263143, 269673, 275866, 271074, 256884, 246905, 239478, 237806, 240902, 248287, 236405, 222944, 212626, 221683, 223156, 228608, 247064, 260409, 256110, 244389, 245834, 231849, 228217, 247478, 259171, 261863, 253658, 253930, 250729, 248534, 239333, 242018, 258767, 259529, 255094, 237908, 231621, 241956, 255762, 280845, 290978, 280191, 282948, 275345, 277043, 282658, 283783, 273397, 268444, 277404, 290117, 308191, 314571, 323014, 347701, 370057, 383844, 401219, 402704, 425147, 436346, 443557, 461873, 480189, 483966, 501243]
12779E01243K8104R300q114N015K2034J3134J0899J7646J4383K1227K8369N2404
12767G15644N1202L7562M2868M4323L5425L4422L6326L7796L0436J5764J0786
12756A092554J1048K1396L4493N7449J08441J43101J85732K18067K53168K42734
12746B368183K73055L51025N09972P16564J068813J401094J440972J100673N92309
12737I822660J99972K04998O93857J500687K410789L367355M596213O626963J0369408
12728C9792902J7518929L0427255N0406878P0529132P0704402L8654453r752282
12721C08281669n3723116p3225366o2449698m0168564k3240591j3816301q896922
12714C2761111o325731m833232l852122l084932k401397j852739j461217j177563
$$ y = [501243, 529347, 538647, 530533, 535548, 557582, 570716, 581615, 599261, 613644, 634871, 663240, 715644, 766846, 804408, 847276, 891599, 927024, 961446, 997772, 1035568, 1066004, 1081768, 1092554, 1103602, 1124998, 1159491, 1216940, 1325381, 1468482, 1654214, 1872281, 2125449, 2368183, 2641238, 2992263, 3502235, 4218799, 5287612, 6688706, 8129678, 9230351, 9822660, 10022632, 10227630, 10921487, 12422174, 14832963, 18200318, 22796531, 29423494, 39792902, 57311831, 87739086, 138145964, 208675096, 279379498, 318033951, 308281669, 254558553, 181333187, 118883489, 78714925, 55474334, 41658033, 32761111, 26435380, 21602148, 17750026, 14665094, 12263697, 10410958, 8949741, 7772178]
12706G772178r29425p62047o32125n22981m36517l39550k34511j61390j32350
12697C621282j72726k29122k82106k86084k56675k36447j98288j63567j44832
12688A651435j32122j10074j13633j17385q4857n9006o3232n6532n3006m0590
12678H20998k2753l3784l6382l3311l3811m0610l7979j4957o539k2414k3840l1964
12666D82654l3002k7580q637k501N735r975j6003j3619j796L608O160j011m735
12653C79298N376j2329r838M065J337j9274j6399j4458k1329k8903k8939n781
12641B32826j3816j1888Q964J0718l791q454j2730q090k5010j0074m897K337J2079
12628A68174k382J627K8333N000q798M431r85l3603l6072j6973o155r445j2032
$$ y = [7772178, 6842753, 6080706, 5448581, 4925600, 4489083, 4149533, 3915022, 3753632, 3621282, 3448556, 3219434, 2937328, 2651244, 2394569, 2158122, 1959834, 1796267, 1651435, 1519313, 1409239, 1295606, 1178221, 1093364, 1034358, 971126, 914594, 861588, 820998, 798245, 764461, 728079, 694768, 660957, 620347, 582368, 567411, 560872, 538458, 514618, 482654, 449652, 422072, 413435, 410934, 416669, 406694, 390691, 377072, 375276, 378884, 385044, 384033, 379298, 384674, 372345, 362507, 366572, 367909, 348635, 332236, 317778, 296449, 267546, 238607, 232826, 219010, 207122, 216086, 226804, 223013, 214559, 201829, 193739, 168729, 158655, 153758, 156095, 168174, 165792, 167419, 195752, 200752, 191954, 196385, 195400, 161797, 125725, 108752, 102597, 93152, 81120]
12615H1120j3482j2372j0290M755O161j4414j3937P826j052r996J978j5638M63
12602A1122J6731K5922L3806M6641K3215K9150L9589L7154K2330j019j2962k7847
12590B43832j8320j5633o724q812j8850k0644o075j8287j2746j445M823j903k7417
12577I1799k1376j990O100J2872J8185L3459P1978P8849N9360J9058j4882l6726
12565C16686k8667k1992k5764k2488j4457j1073j5327q619j3818p022j8995k7310
12553A01154k7025j5968J7140J3674q428k396q313K091R628J3299J0762r599j7432
12540G8587j7719q077P866P059J1896j999j4220o917o704j6589O277K2645r330
12527E2775o980N277k962M298K0884M274n513j9122j2370J1101K939q91N554L243
$$ y = [81120, 67638, 55266, 44976, 49731, 55892, 41478, 27541, 35367, 34315, 24319, 26297, 10659, 11122, 27853, 53775, 87581, 134222, 157437, 186587, 226176, 263330, 285660, 284641, 271679, 243832, 225512, 209879, 203155, 194343, 175493, 154849, 148774, 130487, 117741, 116296, 121119, 119216, 91799, 70423, 68433, 74533, 87405, 105590, 139049, 211027, 289876, 349236, 368294, 353412, 316686, 288019, 266027, 240263, 217775, 203318, 192245, 176918, 168299, 154481, 147459, 128464, 101154, 74129, 58161, 75301, 88975, 80547, 78151, 69838, 71929, 81557, 94856, 105618, 96019, 78587, 60868, 52791, 60657, 67716, 79612, 77613, 63393, 56476, 49772, 33183, 39460, 62105, 52775, 45795, 51072, 48110, 52408, 73292, 77566, 72053, 52931, 40561, 51662, 54601, 53710, 59264, 62507]
12513F2507J0249L890q68n565q726o834J1425K0395j7175k0393q27O468j5518
12500C9028p195K1355J4077J7783L446K59j5123m790O868j298j5382j935n416
12487E1677j2948j0327j8909J1111R412L437P862j785J356J6841J0307o645R856
12474G1245l696r508q261l641P650R635O497J3717M257k1195k0492j6078P65k324
12460B8571j6501Q394J2594m690K831K872j9562r488m61R48J5916L696j4830k760
12446G530l090P357o003l885J4532J1703M176P915L317Q141m667q205n952K796
12432C5665m799O68J264j7357r178j7246j0647N515Q525J820q502K823o862q520
12418b6831J1374J4737K1204L0263J4263K7962M978K692j2327l3338l0763R979
$$ y = [62507, 72756, 76646, 75778, 70213, 61487, 54653, 66078, 86473, 69298, 48905, 48078, 54546, 39028, 31833, 53188, 67265, 85048, 88494, 88753, 73630, 68840, 75708, 74410, 59028, 57093, 51677, 38729, 28402, 9493, 20604, 30016, 33453, 41315, 39530, 40886, 57727, 68034, 61389, 71245, 67549, 58041, 49780, 46139, 53789, 63424, 69921, 83638, 87895, 66700, 46208, 30130, 30895, 28571, 12070, 20464, 33058, 28368, 31199, 34071, 14509, 5021, 4560, 5508, 21424, 25120, 10290, 7530, 4440, 11797, 5794, 1909, 16441, 28144, 32320, 40235, 43552, 51693, 47026, 38821, 32869, 35665, 30866, 31534, 32798, 15441, 6263, -10983, -21630, -16115, -7590, -5770, -14272, -11449, -18311, -26831, -15457, -720, 20484, 50747, 65010, 92972, 97950, 100642, 88315, 54977, 24214, 34193]
12406C4193O673p118k710M190P654p556M614M61r255j1305O519j633j1494p209
12392F024l375L449N237j498l845P594J1565J1795P648p954j2932R837J861J944
12378C7350j5371n76M47O167p3j659P562J387L710M51j7094j5333J6639P938J199
12363C2744m522M725r996L941O253O004o790j9534r152O601M034r1l88p335L858
12348A0352J5841O768J041p588L132J7882O958k17j8352k891n354L051O766O09
12334C7998L53o194j0541p005R703j400j4283j5040J916K780J2768J4970l530
12321B2495r962o135R61M182Q730l448J116O672N791L389l043o487P659K227o120
12306B8027j8256K7J1369J8569K53L518Q520j9853n007o84J1621M838o00Q311
$$ y = [34193, 40866, 33748, 31038, 35228, 42882, 35326, 39940, 40401, 31146, 19841, 26360, 24727, 13233, 6024, 2649, 6098, 11335, 9837, 5992, 13586, 25151, 36946, 44594, 36640, 23708, 33545, 35406, 37350, 21979, 21403, 21850, 28017, 27944, 26285, 33847, 35234, 38944, 39395, 22301, 6968, 23607, 31545, 32744, 28222, 32947, 22951, 26892, 33145, 39149, 32359, 12825, 3673, 10274, 14308, 14217, 13829, 6494, 10352, 26193, 32961, 34002, 26414, 29546, 47428, 54386, 54169, 35817, 32926, 27572, 30623, 37389, 37998, 38351, 32157, 21616, 14611, 24314, 22914, 8631, -6409, -4493, -1713, 11055, 26025, 22495, 12533, 6398, 7359, 11541, 20271, 16823, 17939, 24611, 30402, 33791, 30748, 24261, 31920, 34147, 28027, 9771, 9798, 21167, 39736, 39989, 43507, 52027, 32174, 27167, 26483, 38104, 42942, 42342, 50653]
12292E0653o100M143m70N659l210J4208N157L7K3726L8066M2651N5922J06085
12279C36527J68915K65138L62068L63762K02548n5591k83144l89714l27321k02477
12269D40711j21861o3093l2937k7307l1283k383K543j2894l4068l4190j7542j4816
12257E0880j5003j3123p4K2803J7382j4851j0075j4062r268O548J3099Q973m363
12244C8866q945k1530L673R647J9756J0435n429j4721j0931N749J2389j6728j0697
12231A1534K0007o44j3015r405n704m271q570K388M027l248Q988R88j295R87M699
12216G466k415r783L878J2431m72j4152K515K863j0908N229N706N727l416p067
12202b398q565L833P220Q654N096J217j322L315j1514j6551l925L134k343J533
$$ y = [50653, 44553, 48696, 48226, 53885, 50675, 64883, 70040, 70077, 93803, 131869, 174520, 230442, 336527, 505442, 770580, 1132648, 1496410, 1698958, 1643367, 1360223, 970509, 643188, 440711, 318850, 255757, 222820, 195513, 164230, 161847, 164390, 151496, 117428, 83238, 65696, 50880, 35877, 22754, 22680, 45483, 62865, 48014, 37939, 23877, 14609, 21157, 34256, 43229, 38866, 29921, 8391, 12064, 21711, 41467, 51902, 46473, 31752, 20821, 26570, 38959, 22231, 11534, 31541, 30897, 17882, 8477, 2773, -1498, -10068, -7680, -3653, -6901, 2087, 3075, 1780, 2767, 7466, 5051, -4732, -854, 11577, 11105, -3047, -532, 2331, -8577, -3348, 2358, 8085, 4669, -2398, -10963, -7130, 90, 8744, 13840, 15057, 13735, 17050, 5536, -11015, -14940, -11806, -14149, -12616]
12188a2616J6785l482j136j431m580R40O670J525k089j903j929L532J0839k506
12174H619j1251r572O608O337m84k009K039P63p16l912j1290j822l659N094J1172
12159d083Q429j805j1103K4290J0824j9530j3981p510M868J9411J3220N188K580
12146C0798j5498m770J2577J7207j7283k0069m534l194n032K069O636J345K493
12133B745q624K502j0226p743J7013Q245Q467j693l540l901j1272r235j1595J5681
12119a3176J9687N052Q921K062N073j373J82j1741j3444j6353M920N061J816O730
12105C417J2921q395j4152Q842k010r037J3321L851m773o994P83r566N701l761
12091i852r412O721K2394j156j2361o09p80P895K174O704p914r58j5166J100K731
$$ y = [-12616, 4169, 687, -449, -1880, -6460, -5520, 1150, 2675, 586, -1317, -3246, 286, 11125, 8619, -2632, -12204, -5596, 741, 257, -1752, 287, 1050, 334, -3578, -14868, -16690, -20349, -15255, -4083, 4346, 2541, -8562, 15728, 26552, 7022, -6959, -14469, -9601, 9810, 23030, 28218, 30798, 15300, 10530, 23107, 40314, 23031, 2962, -1572, -4766, -9798, -7729, -1093, 252, 2745, -5879, -3377, -13603, -21346, -4333, 3912, 12379, 10686, 7146, 3245, -8027, -17262, -28857, -13176, 6511, 11563, 20484, 22546, 27619, 26246, 26428, 14687, 1243, -15110, -10190, -5129, -3313, 3417, 16338, 7943, -6209, 2633, 623, -8414, 4907, 8758, 3985, -3009, -2226, -11792, -6091, -9852, -19264, -12543, 9851, 8695, -3666, -4275, -5055, 2840, 5014, 11718, 3804, 2846, -12320, -11220, -8489]
12076h489K098J0428j05p799j0612M462P778J557M585m659p121Q99R964M230j381
12061E835J0984j097o346N297J5875j2273K719k610k584m426j0375j1451k519
12048a2971Q20n762m62R006m04J1745O26m661N54k5118l767J1421N217M500Q651
12033f05O874R391J46j4364m120m143L349k23n712N867L565N173J8445p90j1595
12018A1258j1977n094j0832Q069J1772N98m686m084K038j2399M217N032l215J777
12004g526J2056P665m470j4374K118K703k629J4499J1817k319j3046j1425n492
11991a0423J856k732O173J9671Q007Q76p251m302R090j7539l191r539o30K743
11977g191k57Q730k306L381J220j243j569J1239M771l74m432k0693M262R147r997
$$ y = [-8489, -6391, 4037, 3932, -3867, -14479, -10017, -2239, -682, 3903, -756, -7877, -6978, 2986, 7216, 5835, 16819, 15722, 9376, 14673, 30548, 18275, 20994, 18384, 15800, 11374, 999, -10452, -12971, -12151, -17913, -18375, -9369, -9773, 1972, 2598, -2063, -1509, -26627, -30394, -18973, -13756, -9256, -605, 6269, 15660, 15806, 1442, -2678, -6821, -3472, -3695, -9407, -3540, 25, 5198, 23643, 22853, 11258, -719, -5813, -16645, -8576, 3196, 3794, -892, -4976, -2938, -15337, -11120, -6088, -9303, -7526, 4530, 12195, 7725, -6649, -4531, -1828, -4457, 10042, 21859, 19540, 6494, -4931, -10423, -8567, -11299, -5126, 14545, 22552, 23428, 16177, 11875, 20965, 3426, 235, -9304, -9934, -7191, -7448, 1282, -1024, 2357, 3577, 2334, 765, 12004, 16775, 16401, 11969, -8724, -4462, 4685, -5312]
11962e312r406q888O842l650q254J3370J0615j4286n267P473J4415L257Q461n915
11948C455j0134K400M420M256P720p896M922J254j8022m016l200K558l570N053
11934a0800J2311K584j645N229Q520o717L26Q313p849j9011j6052O850J3851p90
11920d880l169K810O273J2459P354R552q038j0893k2914j1084J3017O850j4655
11907a7318K317j2472N589J6112o982M423M768j0942K475J06M12N025J6749L673
11893A3935p260j5996p925J4503J203L020K370Q698j1297j176Q790j793p258o064
11879f250Q901J3306l011q297r983j320j2887R14M546K590k583J4514P737m950
11865C227O350R060J7091P21j1914M805J026p889k3914j7959j830L752j812J314
$$ y = [-5312, -14718, -23606, -16764, -20414, -28668, -15298, -4683, -18969, -24236, -16763, -2348, 909, 9370, 3455, -6679, -4279, 141, 4397, 12117, 4221, 9143, 10397, -7625, -11641, -14841, -12283, -15853, -10800, 1511, 4095, 2450, 7679, 16199, 9482, 9808, 18121, 10272, -8739, -24791, -17941, -4090, -4880, -8049, -5239, 1034, 13493, 20847, 30399, 22361, 11468, -11446, -22530, -9513, -2663, -17318, -15001, -27473, -21884, -5772, -12754, -8331, -3563, -14505, -12030, -11924, -11512, -6487, 10262, 13935, 6675, -9321, -17246, -2743, -1540, 1480, 3850, 12548, 1251, 75, 8865, 7072, -186, -6250, 2651, 15957, 12946, 4649, -5334, -6654, -19541, -18627, -14081, -11491, -14074, 440, 8177, 3227, 9577, 18637, 35728, 36449, 24535, 29340, 30366, 22477, -1437, -19396, -21226, -17474, -19286, -17972]
11851a7972J0498J7230L412O760k278n490j1760l773o921l401O14N320j013j1792
11837b0566j100Q546J0277J0375N916j4N625L530j7325j2154o367n740m359p222
11823c0578j4310J498J03k897J3750J1824J3004J0241J210m20j7251p694J0503
11810a1017R813M18J2278K058q848j453P550K049m693M25Q167J4962j4996j0347
11796F366j5542k0867l043J1307L0520J48j4254j2482q95J2327j423J224N245
11783a369J5069K259l26p965Jr569k91J681p979j4779m038J2646M478l166P258
11768f090o260J178Q618n740L399R502K497j0799j085L566K940M624P077J195
11754A4622k3270o515L400L768P848P257n762j3539j557J3263j6466j5372K231
$$ y = [-17972, -7474, 9756, 13168, 19928, 17650, 12160, 400, -3373, -10294, -13695, -13081, -7761, -8774, -20566, -21666, -13120, -2843, 7532, 13448, 13434, 19059, 22589, 5264, -6890, -13257, -18997, -23356, -30578, -44888, -43390, -43287, -46184, -32434, -20610, -7606, 2635, 3845, 3425, -13826, -21520, -11017, -1204, -786, 11492, 13550, 4702, 3249, 10799, 12848, 8155, 8580, 16747, 31709, 16713, 6366, -9176, -30043, -33086, -21779, 8741, 8889, -5365, -17847, -18742, -6415, -7838, -6614, -1369, 13700, 15959, 15633, 7668, 7669, -1900, -2191, -510, -8489, -23268, -27306, -14660, -10182, -13348, -6090, -12350, -11172, -2554, -8294, -4895, 4607, 7104, -3695, -4780, -1214, 1726, 6350, 13427, 14622, -8648, -15163, -11763, -7995, -147, 7110, 1348, -12191, -13748, -485, -16951, -32323, -30092]
11741c0092R254R338O354k023k91N203n449q621j9834N252M559j461J589J1502
11727a4720L785Q95Q214N065P157R78K394j7527q320l697K683k938n1J3307r54
11712c729k697J4924Q450R07n001k3607N162o726j6704N768M986K920P105N045
11698c197L23o304j0600J1809M266OJ2258j0042j0925m880P826J0199P424Q212
11684A6375M677l432L019k610k4997m779k137J141J379o057o385J078m098j0005
11670c6831J2547J293n168L547n720J201j016J140J2187J837Q464k21R879k960
11656A79l878J8418O786j9390j0888r726O847J6106K090k7177j2671l156K078
11643c4382N752Q837P09o650L648J0257L238J1575p366k0195o929O966J1166o21
$$ y = [-30092, -20838, -11500, -5146, -7169, -7460, -2257, -7706, -16327, -36161, -30909, -26350, -27811, -26222, -14720, -10935, -10040, -1826, 3239, 10396, 11374, 13768, -3759, -12079, -15776, -13093, -16031, -16082, -2775, -3729, -6426, 8498, 16948, 17855, 12854, -10753, -5591, -12317, -29021, -23253, -18267, -15347, -8242, -3197, -2874, -9178, -19778, -7969, -3703, -3697, 8561, -1481, -12406, -17286, -9460, 739, 8163, 16375, 21052, 17620, 20639, 18029, -6968, -11747, -13884, -12743, -11364, -17421, -23806, -22728, -26826, -36831, -24284, -22991, -28159, -24612, -30332, -29131, -30147, -29007, -16820, -14983, -6519, -6740, 3139, 179, -3699, 14719, 21505, 2115, -8773, -18499, -11652, 4454, 6544, -20633, -33304, -36460, -34382, -28630, -19793, -19084, -25734, -22086, -11829, -8591, 2984, -4382, -24577, -31506, -24540, -13374, -13995]
11629a3995j0734N526J1309L621j1717m145Q12K7739J3252n055q183j2015l008
11616f593M602p974p619m160M809M624o431p601Q621Q236m889j1074k0j0356M252
11601c1573J5350J210o619o946J229J0673R991J0701L084m579L512j88l095n080
11587b330j2194o152J0166L0844J2492k016j0834j3332r37r828J269Q577j3347
11574g622p85Q69m135M999L247j991m4O230o631j9176j320J1652J1129K530J05
11559i43l949J687J3333O900r290K209n414j5886N87k027O359n004q643J32J8039
11544a910j3761k2616J2667J4165J090K0287J8167o798q393j0344l913J5617M618
11531A8876q958l008J998J584K400J034o169k2660N439J2887j2531l043O841J3066
$$ y = [-13995, -24729, -19203, -7894, -4273, -15990, -20135, -19323, 8416, 21668, 16613, 8430, -3585, -6593, -1991, -9965, -17584, -21744, -16935, -12311, -18742, -26343, -17722, -9486, -14375, -25449, -25469, -35825, -31573, -16223, -15013, -21632, -28578, -27349, -16676, -6685, 4016, 7100, 2521, 6033, 5845, 2750, -2330, -14524, -20676, -10510, 20334, 32826, 30810, 19976, 6644, 5707, -4121, -2852, 5725, -7622, -8407, -7538, -11673, -6674, -3427, -5418, -5462, 768, -5863, -25039, -26359, -14707, -3578, -1048, -943, -4892, -3205, 10128, 17028, 7738, 9947, 4533, -11353, -10766, -12793, -6434, -11438, -20081, -19949, -1910, -15671, -38287, -25620, -11455, -10365, 9922, 28089, 21291, 12898, 2554, -1359, 14258, 18876, 9918, 6910, 8908, 10492, 12892, 13926, 7757, -14903, -9464, 3423, -9108, -12151, -5310, 7756]
11517G756J1310j2322o690l599j0859j119L245j14Q364N605k181p898m028J1441
11503a089J6929j123j460N020o23J75q590n516J3610K289P059j5639k4122r850
11489b2930K515k102J5801K0139l251p927J846Q304p463j2544m126j28j960J1792
11475b034L229N41M469K369o994n868N114j275j60n251j2508j0661J1716J3960
11461c353K34J0634J1901J130j3455j7763m776N240K791j1296L693J2795L983
11448A758K216j4358j4669K901l723K434J65r686P093K1463J2588j50p11R831
11434A7152n085O04j645j3368j0107j1481M522R391m3q670J755M791j534j923
11420a5641N752o959r336J873q810J369J8853R884M068n988o164M475l248K135
$$ y = [7756, 19066, 6744, 54, -3545, -14404, -15523, -12278, -12392, -4028, 1577, -604, -8502, -12530, -1089, 15840, 14717, 13257, 18277, 17654, 17829, 9239, 3723, 17333, 19622, 26681, 11042, -13080, -22930, -20415, -22517, -6716, 13423, 10172, 2245, 4091, 12395, 4932, -7612, -11738, -11866, -13826, -2034, 1195, 1736, 6205, 8574, 1580, -4288, 826, -449, -609, -5860, -18368, -29029, -17313, -3353, -3119, 7515, 19416, 20546, 7091, -10672, -15448, -10208, -7417, -18713, -15020, -2225, 1758, 3974, -10384, -25053, -22152, -25875, -23441, -23276, -32962, -25869, -4406, 8182, 8032, 7321, 17152, 12067, 12671, 11026, -2342, -12449, -23930, -19408, -10017, -10060, -18730, -16975, -12184, -13718, -15641, -9889, -16848, -26184, -24311, -33121, -31752, -12899, -3015, 1053, -4935, -11099, -6624, -9872, -7737]
11406g737Q834J325K096N211O307o027k699O996J6304o016j0508j6150j8721j747
11392b2532J6734J6294j7794o741K936j1457j2865L355J3143O067o478J622J5323
11379b393J819k473j6682j7221k854J4188R444J8219L947l540o463j421L698o795
11365h527L068N601j3520M626J0194O362j6134P322K44p337r424J5428K214Q227
11351H344p32K331o772l129n215m843L064J875n670l603j0473O446P918k071j087
11336a3617J23M804p91o260m37J3115Q426L339K096N169j240r947l113L583K0195
11321B5445O518q480j571o946j5106q163J4766J973j5256J5580p081J476j2354
11308i199j3866P283J5089N668j7801r498J3996J8032n339j019M02n494r118q466
$$ y = [-7737, 1097, 2422, 4518, 9729, 16036, 10009, 7310, 14306, 30610, 24594, 14086, -2064, -20785, -22532, -5798, 10496, -7298, -14039, -11103, -22560, -35425, -32070, -18927, -12860, -19338, -17716, -2393, -574, -3047, -19729, -36950, -39804, -25616, -16172, 2047, 5994, 2454, -4009, -5430, -1732, -8527, -5459, 142, -13378, -8752, 1442, 7804, -8330, -1008, -764, -8101, -17525, -2097, 117, 8344, 7612, 9943, 3171, 42, -5173, -10016, -6952, -5077, -10747, -14350, -24823, -18377, -10459, -12530, -13617, -13494, -8690, -9481, -15741, -16178, -3063, 5363, 8702, 10798, 15967, 14727, 4780, 1667, 5250, 25445, 31963, 23483, 21912, 14966, -140, -8303, 6463, 8436, -6820, 8760, 1679, 3155, -9199, -23065, -15782, -693, 4975, -12826, -22324, -8328, 9704, 4365, 3346, 3748, -1746, -10864, -19330]
11294a9330J9757Q365j1068n691J2622L780O731j2909J154M740K84p348L3n427
11280d307m541J4163n260o797O442M893l866j481m300J3032j0233j0794q864J0895
11266a1018J3506m466j722R183q654o284P651k4P386J7942J0160p969j0406j5618
11252c33j4671l698J261R984M398L862j17n996R01J348p524J2508P268J21p633
11237A679j4062J5840J0224q383j0204J2193M593l011N98m648p912L043l984o902
11223a0936R704J068J226j5503l914q739J3150J2974N090m479j09p649j964j5381
11209b5462j3653k199J3845r26J4081P704L671K0754L669k2486j7599J1177M087
11196c337j1299o903p48J1693J4254O199r833p123J3598P540j6575j633k932M499
$$ y = [-19330, 427, 8792, -2276, -7967, 4655, 8435, 15166, 2257, 3411, 8151, 8435, 1087, 1120, -4307, -8848, 5315, 55, -6742, -300, 4593, 727, -754, -5054, 7978, -2255, -13049, -21913, -11018, 2488, -1978, -3700, 5483, -3171, -9455, -1804, -1828, 5558, 23500, 33660, 25691, 15285, -333, -15004, -18702, -17441, -7457, -3059, 803, 686, -5310, -4409, -3061, -10585, 1923, 9191, 9312, 1679, -12383, 3457, 13681, 5298, -4906, 7287, 11880, 8869, 9467, 4819, -3093, -50, -4034, -10936, -1232, -164, 1062, -14441, -18355, -27094, -13944, -970, 4120, -359, -468, -8117, -10081, -25462, -39115, -41314, -27469, -28395, -14314, -6610, -2939, 17815, 21484, -1002, -18601, -7424, -3337, -14636, -21539, -22287, -10594, 3660, 9859, 26, -7097, 6501, 14041, -2534, -4167, -7099, -2600]
11182b600l054K044r323k122J3989n02J2016J346j8186o492J1978J2146l904P41
11168H077M600Q892P937L661l676j4250P077o976j1492k708n613o284l95Q060
11154c090R031P685j1556M294M311P052M621r600q909N957L897m116n180n96M081
11139G882J1892n747j435J1662J415j9435N30j5441p597Q425Q166J763J1947R297
11125B3324j2698q345N249J8818J3313p658q650r961j9506N960J2190q2m194J296
11111I056l916j2172j1774J6171J3956j0428J493Q638n797q530o910J0799m927
11098d341M622J2694n812p316R678O509j917m609M43M914L139j275q698o710K431
11083C752n896j2974j281j31J0522p595q569N494K1465o077q759k898Q559J2575
$$ y = [-2600, -5654, -3610, -12933, -15055, -1066, -1568, 10448, 11794, -6392, -12884, -906, 11240, 7336, 8077, 12677, 21569, 29506, 33167, 29491, 15241, 22318, 15342, 3850, 1142, -4471, -10755, -11150, -3090, 5941, 13626, 2070, 6364, 10675, 17727, 22348, 12748, 3839, 9796, 13693, 9577, 4397, 3801, 7882, 19774, 14027, 12592, 24254, 25669, 6234, 6764, -8677, -16274, -7849, 317, 2080, 14027, 23324, 10626, 2281, 7530, 26348, 39661, 32003, 23353, 13392, -6114, -154, 12036, 11954, 7760, 9056, 5140, -7032, -18806, -2635, 11321, 893, 2386, 11024, 5227, -3303, -10213, 586, -4341, 281, 12975, 7163, -153, 9525, 16034, 14117, 9508, 9951, 14865, 18004, 16729, 8031, 1321, 3752, -2144, -15118, -16399, -16530, -6008, -13603, -22172, -16678, 4787, -1290, -10049, -12947, -4388, 8187]
11069H187J161j4399K646R561l408q815j5341J0948P405l486j0765O723P706n898
11055g775J2286k695n188J5271o212j230J9013l921j5414k336n31R581J4104j3336
11041A1617r925p130L355N809j988j181J9441O932m937p393L518K330q221m569
11027G658N573R223p445o374n714L935P024L55k720r569o27L730J5976k044n043
11012A3938L507q610P230L219K186J575J2256p896j6635k2972k5158k533p2J3628
10998b6337J2625m01J4711R819M852K089l253r283R225J8188m82j2468j1384q184
10984b83j372j558J651P593o503m722K220Q141K348j1875J0103l647j2158j6369
10970b6431j0419K4882J5633N706o685J0302Kj1023j0276J3062K7545j880n163
$$ y = [8187, 9348, -5051, -2405, 7156, 3748, -5067, -20408, -9460, -2055, -5541, -16306, -9583, -1877, -7775, 4511, 1816, -3372, 11899, 5687, 4457, 23470, 19549, 4135, 1799, 1268, 10849, 24953, 11617, 1692, -5438, -2083, 3726, 1738, 557, 19998, 26930, 21993, 14600, 18118, 20448, 12227, 7658, 13231, 22454, 15009, 8635, 2921, 6856, 13880, 14235, 11515, 1946, 1319, 5049, 21025, 18981, 13938, 17445, 8835, 16065, 19284, 21470, 23045, 35301, 27405, 10770, -12202, -37360, -39893, -39965, -26337, -13712, -14113, 598, 10417, 15269, 17358, 14105, 4822, 14047, 32235, 31753, 19285, 7901, -283, -1655, -3213, -1562, 6031, -472, -5194, -2974, 5167, 7515, -4360, 5743, 2096, -10062, -26431, -36850, -11968, 3665, 9371, 2686, 12988, 12990, 1967, -8309, 4753, 32298, 30418, 25255]
10957B5255k0258j8707q165K134O013P273P829j2893N078q929k39M653L374P196
10943c86o195K918n430J029J1001p384j244J376J40k665M799L303j2062p336o971
10928b5107j255O34j775J010Q132J3108J2810q400k801q281n021J8505K1913j861
10914B1611r037j4429q024J0823p89K083N382p583J0364O533l778j2132m694N669
10900A999O005J0498m248j2722k48N846J83J0715m524m146q076l542M909L784
10886F433l365j7465o688Q799J0580r48k291J2342O693n617l399o132j0772O895
10872d935K5440R802k2750j1155j2596J260K3365K836M05j986n513N064r310j0731
10858a0804q183P242K5784N39j9805P332Q506o494J722j650O680N268r810j9340
$$ y = [25255, 4997, -13710, -21875, -19741, -13728, -6455, 1374, -11519, -6441, -15370, -15609, -10956, -7582, -386, -6581, -3663, -9093, -8064, 2937, -4447, -5691, -4315, -4175, -6840, -2041, 1262, -10800, -18136, -25107, -26362, -25728, -27503, -26493, -18361, -5253, 7557, -843, -3644, -11925, -16946, 1559, 23472, 21611, 12574, -1855, -9879, 944, 155, 2238, 7620, 37, 10401, 16934, 13156, 1024, -3670, 1999, 8004, 18502, 14254, 1532, 1284, 7130, 7313, 18028, 13504, 9358, 1282, -2260, 2649, 6433, 3068, -14397, -21085, -12286, -1706, -2654, -4945, 7397, 14090, 8473, 5074, -1058, -11830, -4935, 20505, 30307, 7557, -3598, -16194, -14934, 8431, 11267, 11672, 9686, 4173, 9237, -73, -10804, -18987, -11745, 14039, 14578, -5227, 2105, 10611, 4117, 5839, 4189, 10869, 16137, 6327, -13013]
10844a3013J9778K0655o238p686p764l070j3362K184k083M797J6950q357j8182
10831a5391n285Q730Q277Q701O679l69l63M253l86p723j7583j6774J5953J5609
10817D328J4916J4413j9269o911J0369M89j145o395p272P685P707j4836p016l57
10803c294k87p020q586m882J7810P144r597j1061O242R696M855k547j4633N32
10789a5628J9233P908q228J482j3084j9643k61J4112q846J2779K6508L65p276
10776I421M023m753m121p30j081m120R322Q070R777m769j1812J3468L354p284
10762A8765j5442m062N804L262R571m34n124k049j717n242R95O960J2310R272
10748C2869o533l021j854k460j6746j2072k172K0887L083k5188J0326J5869l357
$$ y = [-13013, 6765, 27420, 21182, 13496, 5732, 2662, -10700, -8516, -10599, -5802, 11148, 2791, -15391, -20676, -11946, -3669, 5032, 11711, 11342, 10979, 15232, 14846, 7123, -10460, -27234, -11281, 4328, 19244, 33657, 14388, 7477, 17846, 18335, 17190, 10795, 3523, 11208, 18915, 4079, -2937, -3294, -3581, -10601, -19187, -24069, -6259, 885, -8712, -19773, -13531, -3835, 1020, -1527, -16160, -15628, 3605, 11513, 3285, 4767, -8317, -27960, -28221, -14109, -22955, -10176, 16332, 16697, 9421, 13444, 8691, 4570, 3840, 2759, -1361, 7961, 16031, 25808, 21039, 9227, 22695, 26049, 18765, 3323, -739, 5065, 8327, 17898, 17464, 12340, 10291, 8574, 3332, 4327, 11287, 23597, 32869, 26336, 23315, 21461, 19001, 2255, -9817, -11989, 8898, 11981, -13207, -2881, 12988, 9631]
10735I631n831j5132J0137J3207L627o446J820P255j2153n327O664N771Q637m903
10721A6957m160j550K282L193r998j4609L40N430l138Q385o665j0522N785K0317
10707A2047K2052J9544M237k9721j1000K41P430J3172l82j178n0j3957r289o133
10693G013O418J3298j0874j2728L007p117R825J2331J0311q052j3815n780j462
10680B375j7315q909R00Q322J253J0241m061j1530J1485p478K652K2661M225J0624
10666B5445l340j6361N250J2786P099J781j183O30O233j4873j380O326M601J293
10652C4307m026J3493J4073j7091j9943Q711P730N801K232q667j6943j6197j508
10639A972j0517m405J5050J0094R612j0267P466P050kJ9631J3754Q104j2460q91
$$ y = [9631, 3800, -11332, -1195, 12012, 15639, 9193, 11013, 18268, 6115, 788, 7452, 13223, 21860, 16957, 12797, 11247, 13529, 16722, 6724, -7885, -7545, -2115, -5253, 3132, -3533, -14055, -8270, 12047, 34099, 53643, 57880, 28159, 17159, 17400, 24830, 38002, 37620, 36442, 36392, 22435, 13146, 7013, 13431, 26729, 15855, 3127, 6134, -983, 8842, 21173, 31484, 23432, 9617, 3837, 2375, -14940, -23849, -22949, -14627, -13374, -3133, -7194, -18724, -7239, -14717, -12065, 10596, 14821, 25445, 22105, 5744, 10994, 23780, 30879, 32660, 31477, 32107, 38340, 23467, 22087, 28413, 33014, 34307, 30281, 43774, 57847, 40756, 20813, 29524, 37254, 43055, 45287, 36620, 19677, 3480, 1972, -8545, -12950, 2100, 12194, 21806, 11539, 19005, 26055, 26053, 45684, 59438, 67542, 55082, 54191]
10625E4191l576L292P552K848j625K648p140o664Q6Q858J2934N397l685k905K4
10610G2235j4839j4675J671Q608J2953N915j4952q277K0691P989m826k681l449
10597F6363q824N007Q797Q764J5194J846N617l490Q382P670p219K167l149Q011
10583A15136J9483J0973j3738r996J6579N333j5351m306J7288P025k885j004K292
10570A46829O829J3806J4834r533r452K2895J9865Q061K3070J9573K3015N415
10558B85207m647J404O880P719Q180P68J4421L6903K9796K0525K5577L4437M5239
10545E12409M1327L9482M7663N1717O3176O6632P6989Q1291R7224J18722J34927
10534A331559J72952K01487K18367K34118K62289K83084L21876L32908L37554
$$ y = [54191, 50615, 53907, 61459, 64307, 62682, 65330, 58190, 51526, 51612, 60470, 73404, 78801, 75116, 72211, 72235, 57396, 42721, 44392, 53000, 65953, 71868, 56916, 48639, 69330, 77319, 72493, 69812, 66363, 57539, 62546, 71343, 80107, 95301, 97147, 102764, 99274, 107656, 115326, 108107, 110274, 107125, 115136, 134619, 145592, 131854, 121858, 138437, 143770, 128419, 124113, 141401, 148426, 145541, 144537, 146829, 153658, 167464, 182298, 172765, 163313, 186208, 206073, 214134, 237204, 256777, 279792, 285207, 280560, 281964, 288844, 296563, 304743, 305511, 319932, 356835, 386631, 407156, 432733, 467170, 512409, 553736, 593218, 640881, 692598, 755774, 822406, 899395, 980686, 1077910, 1196632, 1331559, 1504511, 1705998, 1924365, 2158483, 2420772, 2703856, 3025732, 3358640, 3696194]
10525C696194L32164L51351L51404L60205L74455L52417L36894L16128K80313
10516F751525K38298K01431J47081J16366P0631O2645O4095J3268j9789p9528
10506G566023j75735k86204l48606m00589l95471l66031l16114k52209j68183
10497D856881r2071J0664J19776J87356K67349L43667M02913M76638N16176N53881
10487G643230N70187O04473O30170O26104O35531O33358O45144O15874N40672
10478A3144743M70652L59241K43215J57867R9784N5764M3884k743o1621j98818
10468A4311968l85872n81883q05693r81928j096675j110426j041664r07297p62816
10459F637714o28369m92771l65599k85614j99034j24654m6849J9139N6256J05135
$$ y = [3696194, 4028358, 4379709, 4731113, 5091318, 5465773, 5818190, 6155084, 6471212, 6751525, 6989823, 7191254, 7338335, 7454701, 7525332, 7587977, 7652072, 7665340, 7645551, 7566023, 7390288, 7104084, 6755478, 6354889, 5959418, 5593387, 5277273, 5025064, 4856881, 4764810, 4775474, 4895250, 5082606, 5349955, 5693622, 6096535, 6573173, 7089349, 7643230, 8213417, 8817890, 9448060, 10074164, 10709695, 11343053, 11988197, 12604071, 13144743, 13615395, 13974636, 14217851, 14375718, 14475502, 14531266, 14575150, 14572407, 14510786, 14311968, 13926096, 13344213, 12538520, 11556592, 10459917, 9349491, 8307827, 7400530, 6637714, 6009345, 5516574, 5150975, 4865361, 4666327, 4541673, 4494824, 4513963, 4570219, 4675354]
10449D675354J46984J80977J68536J82445K19654K03397K22456K09809J93912
10440F403524J73797J53124J10604O5231L2814N932l6248o1134o6766p7564j30675
10429F572639k23494k94359l77858m46104n01733n05946m74665m55147m09023
10420B884310l56782l01775k59413k25487j76298j63142j32429j16448j20527
10411A032009r6922p6222o5435n2890n6637m9243m0360k7631j9995r673k6300
10400E10701l5433j8921k4342j9683k1460j9753j7936k1426m628J772p927r678
10388C11286j5760j0637j1302r454p579j5894M12j1752j1302m669j291J385j1257
10375B02186j6212j0901j1297n729r117j3962n106M395J540N757j1879j0048M563
$$ y = [4675354, 4822338, 5003315, 5171851, 5354296, 5573950, 5777347, 5999803, 6209612, 6403524, 6577321, 6730445, 6841049, 6906280, 6939094, 6945026, 6908778, 6847644, 6780878, 6703314, 6572639, 6349145, 6054786, 5676928, 5230824, 4729091, 4223145, 3748480, 3293333, 2884310, 2527528, 2225753, 1966340, 1740853, 1564555, 1401413, 1268984, 1152536, 1032009, 935087, 858865, 793430, 740540, 683903, 634660, 594300, 566669, 546674, 537001, 510701, 475268, 456347, 432005, 412322, 390862, 371109, 353173, 331747, 327119, 328891, 320964, 311286, 295526, 284889, 273587, 264133, 256554, 240660, 241072, 229320, 218018, 213349, 212058, 213443, 202186, 185974, 175073, 163776, 158047, 148930, 134968, 129862, 134257, 135797, 141554, 129675, 119627, 124190]
10362A24190k803K912J126j7861L57j0913L671J0615j4298j8397Q102J3316j383
10349I8634j721R569p78J0195j0233j0635j1951j990J0805K567L256j8536q443
10336G0739k822K994K215q1J0356J179j8446k0609j755J1537J4018j395j5432
10323E2498P434J8160J0420O478p157m792j7917k0822p29J4012J9680o178m700
10310F6387J2109j4636o902K40j87l93p058o697o478J1960J2992j356l957j994
10296E4030o090p178Q778J219J1105j0382j3632M599P579J3155j3263l722M220
10283E0418J651j59Q854K181m399p419n635l868O41Q73M40p061j4235M624l416
10268B3490j052J1204l493j3632N177k873k772l079L758K067k216J1527M259J725
$$ y = [124190, 121387, 124299, 125425, 107564, 107921, 97008, 100679, 111294, 96996, 78599, 86701, 100017, 98634, 96913, 106482, 105704, 115899, 105666, 95031, 83080, 81090, 91895, 94462, 97718, 79182, 70739, 67917, 70911, 73126, 73045, 83401, 84580, 66134, 45525, 43770, 55307, 69325, 67930, 52498, 59932, 78092, 88512, 94990, 87833, 83041, 65124, 44302, 43573, 57585, 77265, 71087, 66387, 78496, 63860, 56958, 57198, 57011, 56618, 49560, 42863, 36385, 48345, 61337, 59981, 56024, 54030, 47940, 40762, 49540, 50759, 61864, 51482, 37850, 42449, 50028, 63183, 49920, 46198, 50418, 52069, 51910, 60764, 62945, 58546, 51127, 45492, 41624, 42265, 43138, 43578, 36517, 22282, 26906, 23490, 22438, 33642, 30149, 16517, 21694, 18821, 16049, 12970, 16728, 18795, 16579, 28106, 32365, 34090]
10254C4090k423j03Q286l608j1461o281j48j1649k643k64L441J4379N802j8548
10240H870j0195J1689j7003J826J6429m92J98j2629j0084J5791R805O62k2261
10227g394p86k69K249k238R316n004R012Q845j3J0276K098p489N062R571o349
10212B6887k749Q834J542j293j1727j852k239j1516J3325M503j6687q879P157
10199E306J7114P607j4317j6440J0984J82j5224j4802M498J6906J9413J3500r757
10186B4970R669o229j6776l604K774K337k77n822j594P575M364q231M894M729
10172A8779k46J0967N147J0560r198o703j2750m269n843n31L181k75n476J2438
10158A5781J4446p545K0k851n004N755K980q470m059J8347N261m294j2178k0692
$$ y = [34090, 31667, 31564, 39850, 36242, 24781, 18500, 18352, 6703, 4060, 3796, 7237, 21616, 27418, 8870, -1325, 10364, -6639, -4813, 11616, 11124, 11322, -1307, -11391, 4400, 14205, 14867, -7394, -8180, -8449, -6200, -8438, 878, -4126, 4886, 13731, 13718, 23994, 26092, 18603, 23665, 33236, 26887, 24138, 32972, 34514, 33221, 21494, 19642, 17403, 5887, 19212, 23715, 7028, -1851, 5306, 22420, 30027, 15710, -730, 10254, 10436, -4788, -19590, -15092, 1814, 21227, 34727, 24970, 34639, 28410, 11634, 8030, 10804, 13141, 12864, 7042, 5448, 13023, 17387, 9156, 14050, 18779, 18533, 29500, 34647, 45207, 36009, 29306, 16556, 12287, 6444, 5913, 9094, 8819, 3343, 15781, 30227, 22682, 22702, 19851, 14847, 20602, 23582, 15112, 11053, 29400, 34661, 30367, 18189, -2503]
10144b503j802K459L884j401r634P21R263o307J0344J5265N364j903k0245j5754
10130a2249P195n705J789K2392J2057m45n912j0538k683M864o755J536l240J0904
10116A3210J6470p79j3953k919L512O296n222L215j5055j932K1977J0927l815
10103C1932j4666j8596l378Q226K4835l63K343L59q103r69n945k60J312J0393
10089B7120m917K796J3048j0435n441o887j6615o498m530J0580P093q996n056
10076h738O267J1194o174j4896K1716P989j1230J1354K264m241k0776j8180Q487
10063a4964J8458k161J909N672O112o446J7852K2443l765k1829k1747j3738P388
10050d816L313n50r578j4040J1182L523J3494N883J722N856P023Q394p615m30
$$ y = [-2503, -4305, -1846, 2038, 637, -8997, -8276, 987, -5320, 5024, 20289, 25653, 23750, 3505, -12249, -5054, -10759, -8970, 13422, 25479, 25034, 19122, 8584, 5901, 10765, 4010, 5546, 2306, 13210, 29680, 28901, 14948, 12029, 15541, 21837, 16615, 19830, 4775, 2843, 24820, 35747, 31932, 17266, -1330, -4708, 3518, 28353, 27990, 30333, 30692, 22589, 21620, 15675, 15415, 16727, 27120, 22203, 24999, 38047, 27612, 22171, 15284, -1331, -7829, -12359, -1779, 5314, -3682, -8738, -2471, 8723, 2549, -12347, 9369, 17358, 6128, 17482, 19746, 15505, -5271, -23451, -14964, 3494, 1333, 3242, 8914, 15026, 8580, 26432, 48875, 45110, 23281, 1534, -12204, -4816, -1503, -2053, -11631, -25671, -14489, -10966, 2528, 8411, 10133, 15989, 23012, 31406, 23791, 23361]
10036B3361o29o447J8093m008j7298m588J7608Q739j4290K144J86j025J0095P564
10022C9505J326n104J989o482J70n095j1288j6657j2940J7194J3568m48p708k370
10008E660m65n654n514j5666m983m362N134j250Q473J0113J0029L871q807j460
9994d881K888n015j5680k29L63K255k36J6607J4059j346n667N971P807L927K530
9979B3353j695j5162q927j205R008M340J989j0460N637L872N882R422j4674q866
9965B514K726L570k901J159J617L059p930O926J815k272L48k870P672J8864Q371
9950D2668J701j9447p817K889l325r152p142j006m04N257O81j1295N391L659O926
9935I584O265R07j5043r684Q028R695j4157j0884l913J3186J3618P777J950j5816
$$ y = [23361, 22732, 16285, 34378, 30370, 13072, 8484, 26092, 34831, 20541, 22685, 22871, 21846, 31941, 39505, 40831, 35727, 37716, 31234, 31404, 26309, 15021, -1636, -14576, 2618, 16186, 15738, 8030, 5660, 5195, -459, -5973, -21639, -26622, -30984, -25850, -27100, -18627, -8514, 1515, 5386, -3421, -4881, -1993, -7008, -22688, -22917, -22554, -20299, -20535, -3928, 10131, 8785, 3118, 9089, 16896, 20823, 23353, 21658, 6496, -2431, -3636, 5372, 9712, 11701, 1241, 6878, 10750, 16632, 26054, 11380, 2514, 5240, 8810, 5909, 7068, 8685, 11744, 3814, 10740, 12555, 10283, 10631, 7761, 15433, 34297, 42668, 44369, 24922, 17105, 19994, 16669, 7517, 375, -631, -1035, 4222, 4903, -6392, -1001, 2658, 9584, 15849, 16756, 1713, -7971, 57, 9752, -4405, -15289, -19202, -6016, 7602, 15379, 17329, 1513]
9921A513l375m109p385R416L158N906N930k7p859m942R031o604j4931J780L515
9906h983j402P240J027O052M015J400K058r081l756r28R63K763M36q466O312J1967
9890A1617J1733n213j9338j766j159R527O157J3092Q92j2232l899n699n441q917
9876a0646J763O427K517Q239P032N24j3560R720j1136L551J0654q813m266j460
9862E46M062J2027J0486n522r858j0405J055J6174R553m827j8880O400J2454Q325
9848C1590P401J0164J0828J4146K6860O5575J40141K28119K65623J71151q2710
9837H88888k60256k41591j44196q0980l2415l3689j9600o609l0863k0499n471
9826A2719k249R39k444L232K404k3510j5370K940L723M615R722L814K2034k213
$$ y = [1513, -1862, -5971, -13356, -3940, -782, 5124, 11054, 11027, 3168, -1774, 7257, 653, -14278, -12498, -8983, -10385, -3145, -2118, 3934, 7949, 9349, 11407, 2326, -1430, -2358, -1395, 1368, 1804, -6662, -350, 11617, 23350, 18137, -1201, -2967, -4126, 5401, 11558, 24650, 25542, 13310, 9411, 3712, -1729, -10646, -8883, -2456, 61, 8300, 15332, 15856, 2296, 12016, 880, 4431, 15085, 6272, 2006, 546, 4608, 16635, 27121, 21599, 11741, 1336, 2391, 18565, 28118, 23291, 4411, 10811, 23265, 31590, 38991, 49155, 59983, 74129, 100989, 166564, 306705, 534824, 800447, 971598, 888888, 628632, 387041, 242845, 161865, 129450, 95761, 76161, 69552, 38689, 18190, 12719, 10470, 11409, 8965, 12197, 14601, -8909, -24279, -21339, -17616, -13001, -3279, 535, 22569, 20356]
9812B0356q613o75QJ6570N772q71Q045j1194j9709j6532M978R672L30J9602J6428
9797D4167K943K413J8366k421j1573N676j9623k0544n841j9809K973j4234q466
9784b5973Q529J2059L264l900l748J0809P288q91m449M54K074J189J496m439j2225
9769h463k388K8o699l39O937N68O201J5123J1988o743j2359j0509N259J5218Q449
9754B2271j1787J984R312q076m632J266p618R415Q335p619j5185j0734K197m391
9740a5262J152O579q712M024J4515j710M050p397k57K1447J8598K836q300r379
9726B2184M64M622j1940q525q469j550oQ249j2069q164J0138o142l665k561m260
9711b1694N267Q414K133O476o43l62j0808J5059J7339m999j3179j0964o952j642
$$ y = [20356, 11743, 11068, 11076, 27646, 33418, 32547, 40592, 29398, 9689, -6843, -1865, 7807, 8137, 27739, 44167, 47110, 49523, 67889, 65468, 53895, 59571, 39948, 19404, 13563, -6246, -3273, -17507, -25973, -17444, -5385, -2121, -6021, -9769, 1040, 8328, 7437, 2988, 3442, 5516, 6705, 8201, 3762, -8463, -10851, -10823, -17522, -17861, -10924, -10356, -4155, 10968, 22956, 16213, 3854, -6655, -1396, 13822, 22271, 10484, 12468, 21780, 13704, 9072, 10338, 2720, 12135, 20470, 12851, -2334, -13068, -10871, -15262, -14110, -7531, -16243, -12219, 2296, 586, 4636, -2761, -3018, 18429, 37027, 39863, 31563, 22184, 22648, 27270, 15330, 6805, -1664, -3214, -3220, 5029, -7040, -15204, -5066, -11208, -14873, -17434, -21694, -16427, -8013, -5880, 596, -47, -409, -11217, 3842, 21181, 16182, 3003, -7961, -14913, -16555]
9697a6555M49j163j1292J985J9771O806J580n065r9J9725j020n733p783L534J5522
9682B0662N28l701n604j903K452q018j2037M121M83J0160R994j955j1303r98k0023
9667a7142o692N479M298P61k015m116R977J5080P302N54n191q174n104J6194j2385
9652a174M075J751j0252n680N17O970P720J2584j6033k2699O182J1117J2005m448
9638B635Q318M126o01m92j42l026j1261l573n102j587J0667J0893j6061j211l69
9623f786j6790N774j872j170O134J2321N912L794p939q53J0531K6480o138m018
9609B5380j3579k5177r15J5482n726j7822k368J4884k625J1654j5365k1612R332
9596b8457R871k505J0027J2466J2413o093r413J635p147J1305M582L93J3552K203
$$ y = [-16555, -16106, -17269, -28561, -26576, -6805, 1, 1581, -3484, -3583, 16142, 15122, 9389, 1606, 5140, 20662, 21190, 17489, 11885, 9982, 12434, 4416, -7621, -3500, -3017, 7143, 17137, 15182, 3879, 2881, -17142, -23834, -18355, -14057, -13296, -15311, -19427, -9450, 5630, 12932, 13486, 8295, 121, -4983, 11211, -1174, 2901, 4652, -5600, -11280, -10763, -3793, 3927, 16511, 478, -22221, -16039, -4922, 7083, 2635, 10953, 15079, 14478, 13986, 13844, 10818, -443, -4016, -9118, -10705, -38, 10855, -5206, -6417, -6786, -23576, -17802, -19674, -20844, -14710, -2389, 3523, 7317, -622, -1475, 9056, 35536, 29398, 25380, 11801, -13376, -14291, 1191, -4535, -22357, -24725, -9841, -12466, -812, -16177, -37789, -28457, -18586, -21091, -11064, 1402, 13815, 7722, -1691, -56, -7203, 4102, 8684, 9077, 22629, 24832]
9582B4832l884L104Q597K942n798J704l438N954M217P091P172k4633j4098P623
9568B1385M710j562J449j5193j186j0166j3418r500O562J9894o476q434q822P279
9554a3478K714N854J8402O256l752n078n786Q943m665q075J4623J5718M36j1221
9540B0891N08j1646K767j004m286q997K495Q642o510p597k863J2998K439j2444
9526d607j4358l892K0305J932k043O407p348R674N371j714k175k080r890j208
9512e626J5706J600j3884j1810k471J991j030L527J5610K329j2090r109m407R22
9498a8742O800Q268R363L649J2025L685R144l283J650q890l488N647n372l67j286
9483A8803l39k417j4735j7379N776N952J2200J1242L233o929M70l577r551K310
$$ y = [24832, 20948, 24052, 32649, 35591, 29793, 31497, 28059, 34013, 38230, 45321, 52493, 27860, 13762, 21385, 26095, 24533, 25982, 10789, 9603, -563, -13981, -23481, -16919, 2975, -3501, -11935, -20757, -13478, -10764, -4910, 13492, 19748, 15996, 10918, 5132, 14075, 9410, 1335, 15958, 31676, 32112, 20891, 21399, 9753, 12520, 11516, 7230, -1767, 728, 9370, 2860, -4737, -7600, 5398, 7837, -4607, -18965, -22857, -2552, -620, -2663, 3744, -3604, 6070, 11441, 9727, 7552, 5472, -4418, -5626, 10080, 11680, -2204, -14014, -16485, -14494, -15524, -11997, 3613, 5942, -6148, -15257, -19664, -18742, -11942, -3674, 5689, 9338, 21363, 25048, 34192, 30909, 32559, 23669, 20181, 25828, 20456, 20089, 18803, 18464, 16047, 1312, -16067, -10291, -4339, 7861, 19103, 22336, 15407, 15877, 12300, 2749, 5059]
9469E059P659m326P31Q733k219l69p990O13J3401k515j7000j4383J8152K4434
9455B9980k34l854P507m880n612J0644N809p09r403l640k705r849R254J3431M385
9440D0124n592l229R63J5245J2552r07j564r561n324m360k1242q314J1419J1162
9426C1372M673k034m095j6067O710N431o965p201l57O495j727J5362J7392K824
9412E1813n080j086J4949R716j3876j3402J1057R434N935l585J74L232Q118J2115
9398H9514J794J8810J9972Q646J843m612L088P411N972M286K4249K6937J6299
9385B24209n90J3831L9628L5628K3229K4573L4030N4547P1557P9058O8957Q5529
9373G54186P9554J03685J32012J20643J33316J64986J47635J28750J11703Q7594
$$ y = [5059, 12718, 8392, 9123, 17856, 15637, 15268, 7278, 7891, 21292, 18777, 1777, -12606, 5546, 29980, 29746, 25892, 33399, 28519, 22907, 33551, 39360, 38651, 29248, 25608, 22903, 13054, 22308, 35739, 40124, 34532, 31303, 32266, 47511, 60063, 59156, 57592, 48031, 42707, 38347, 17105, 8791, 20210, 31372, 36045, 34011, 29916, 13849, 20559, 25990, 19025, 11824, 11467, 17962, 16235, 31597, 48989, 51813, 46733, 45647, 60596, 70312, 56436, 43034, 54091, 63525, 69460, 65875, 66049, 69281, 77399, 89514, 91308, 110118, 130090, 138736, 140579, 135967, 139055, 146466, 152438, 156724, 180973, 207910, 224209, 223619, 237450, 277078, 312706, 335935, 360508, 394538, 449085, 520642, 599700, 668657, 754186, 833740, 937425, 1069437, 1190080, 1323396, 1488382, 1636017, 1764767, 1876470, 1964064]
9363A964064O4647J9847k4362m4490q3828j11190j37702j52574j44045j38099
9353A212268j23569j29332j23812j04862q4647o6697m2210l7799m7247m0729k7895
9342C83469k7423m2626k7688k7052k9216j8437K371j6504k0905j544L055j6775
9330A60725j5199j2419L838j2950k3477j3338j0694k066j5903M036P782j0316
9318F0019j1313O622L227L140n776l668K294m65j5100j9216N729J8915r942M263
9304C8729K4010q324k6301j5479L462Q731r74N537J4070L877K395l756j1381j0962
9290B3634M238Q557J803j0193m856p546n624l35J4979k266L985m153J747R399
9276C3369j8162k6665m295K1934M715j2639N514l123j4938Q44q946J158M680j974
$$ y = [1964064, 2028711, 2048558, 2024196, 1979706, 1895878, 1784688, 1646986, 1494412, 1350367, 1212268, 1088699, 959367, 835555, 730693, 646046, 579349, 537139, 499340, 452093, 411364, 383469, 356046, 313420, 285732, 258680, 229464, 211027, 213398, 196894, 175989, 174445, 177500, 160725, 145526, 133107, 136945, 123995, 100518, 87180, 76486, 74420, 58517, 62553, 70335, 60019, 48706, 55328, 58555, 61695, 55919, 52251, 54545, 54080, 38980, 19764, 25493, 44408, 34466, 38729, 62739, 54415, 28114, 12635, 16097, 24828, 23854, 29391, 43461, 47338, 49733, 45977, 34596, 23634, 27872, 36429, 38232, 28039, 23183, 15637, 10013, 9678, 24657, 22391, 26376, 22223, 23970, 33369, 15207, -11458, -15753, 6181, 10896, -1743, 3771, 648, -14290, -13446, -22392, -21234, -16554, -18528]
9262a8528J104J3552L866l072Q86q82m768n08J3134J6300M986j3054j982J1537
9248B2571j382j9219q110R671J724N013O128p021j5945m884K3532J6451M397J809
9234C4735M33j8187j990N274j1327O282k484q762n407j2392p575L246k01N132
9220a3223l66J3674l463r216J710M423j1018K48J1952O838J6656n545q675L004
9206F999P524J983o389j5797m05P401j758R902l624l854o047P891K267O795r358
9191C530K033Q81L14J422q501k888j3440j2266J5406R506M662j0160k006p322
9177a8829L553K63L004J0558Q395P078O54P421N690J0460p161j0579r483j2190
9163a166q134J1577L575J872N808j1528p733J2700J4642N134j1022r660r776q495
$$ y = [-18528, -17424, -3872, -6, -3078, -2192, -3074, -7842, -8350, 4784, 21084, 26070, 13016, 11034, 22571, 21189, 1970, -6140, 3531, 5255, 10268, 16396, 9375, -6570, -11454, 12078, 28529, 32926, 34735, 35168, 16981, 14991, 20265, 8938, 15220, 12736, 3974, -1433, -13825, -21400, -18154, -18355, -13223, -13589, 85, -3378, -12594, -10884, -6461, -17479, -17231, -5279, 1559, 18215, 12670, 3995, 6999, 14523, 16506, 10117, -5680, -6085, 1316, -442, 9460, 5836, 1982, -4065, 3826, 6093, 12888, 3530, 5563, 6444, 6758, 8180, -321, -3209, -16649, -28915, -13509, -4003, 659, -9501, -11507, -18829, -15276, -15013, -12009, -1451, 6944, 14022, 14676, 22097, 27787, 38247, 31086, 20507, 11024, -1166, -9300, 2277, 5852, 7724, 13532, 2004, -5729, 6971, 21613, 26747, 15725, 6065, -3711, -12206]
9149a2206L84M559k210N954Q894j80m523P243N256K503o224L246l571j497j5298
9134g670J047m424K909M227o091q81K568P107J465l048j408L41j3798l267K3696
9119B773J6484m362j5038j1059J1533K053M206l642N290J0718j437P32P200j0659
9105A4792j8571j1343O203Q105J2066K440m722k047M200N147L564p656m343J317
9091I152P1k196r590o89K402J963M099r154q989K982O597R775J0036k57r47m649
9075A0606k353m776j0995o768n300m417K062P698L196J8014J5941K145j1350N782
9061A9485p090r414k242R217K553j206p734K948J442l016J157k808p223K160M601
9046B830l32M242K2929Q457j9603k8072n900m317K380o673J839k26Q722J6436
$$ y = [-12206, -11822, -7263, -9473, -3519, 5375, 5195, 672, 7915, 13171, 15674, 9450, 12696, 9125, 7628, -7670, -6623, -11047, -8138, -3911, -10002, -10883, -8315, -1208, 257, -2791, -4199, -3858, -17656, -20923, 2773, 19257, 14895, -143, -11202, 331, 2384, 6590, 2948, 8238, 18956, 17519, 18251, 25451, 14792, -3779, -15122, -8919, -814, 11252, 13692, 8970, 6923, 11123, 16270, 19834, 12178, 7835, 9152, 9223, 7027, -2563, -3252, -850, 1113, 5212, -3942, -12931, -9949, -3352, 6423, 16459, 16202, 15255, 10606, 8253, 3477, -7518, -14286, -19586, -24003, -21941, -14243, -11047, 6967, 22908, 25053, 13703, 19485, 12395, 2981, 739, 9956, 12509, 11303, 3569, 6517, 7959, 4943, 6100, 3292, -3931, -1771, 2830, 2498, 6740, 29669, 38126, 18523, -9549, -15449, -19766, -17386, -24059, -22220, -22446, -13724, 2712]
9032B712j5583r426J188P451R857M404J382o761j0328n398R636k532J1421j412
9018c389n769K118J0027M899o747j4135j2130j650m144J2312J5061O451r882p502
9004a4480J0504Q10m818j152M843L374K385L546l740k177O745p438N448J3890
8990A7740q980k695M908K243l945j831o510M985L380Q98n541k0432L518J1213
8976a049j2216l660J4360N326m650P41k602Q0q15n951O987K3697J2695j183j4320
8961A7440k0467j0121N816J2899L176j024n035J0385j120j5546j7675O27k307
8948b2952J6712J6207j0029k171K1797P032j8142o023L551q79j2900j3524m260
8935b5581J6637J7129p596o548M108m958J2865l568n495J3490Q392J2475n078
$$ y = [2712, -12871, -22297, -21109, -13658, -3801, 603, 1985, -4776, -15104, -20502, -10866, -13398, -1977, -3389, -9158, -7040, 2987, 7886, 1139, -12996, -25126, -26776, -30920, -18608, -3547, 2904, -6978, -14480, -3976, -3166, -7984, -9136, -4293, -919, 1466, 5012, 1272, -905, 5840, -1598, 3850, 17740, 8760, 6065, 10973, 13216, 9271, 7440, 930, 5915, 9295, 10193, 4652, -15780, -12262, -1049, -13265, -16925, -2565, 2761, -1889, -1148, -3750, -3670, -4485, -10436, -3449, 20248, 32943, 31760, 17440, -3027, -13148, -7332, 5567, 8743, 7719, 2684, 13069, 11949, -3597, -21272, -20645, -22952, -6240, 9967, -62, -2233, 19564, 26596, 8454, 2431, 5982, 5103, -7797, -21321, -25581, -8944, 8185, 589, -5959, -1851, -6809, 6056, 2488, -3007, 10483, 18875, 31350, 26272]
8922B6272n523q940q932J405J3841n62j5425k972K676o610o104L14l074N951O755
8907i28J0672l465J894O677R020J660p722J975n460L173j4955j0380M910l237
8893f166j481o95P322k541r885P45M139J1199K2990m464j468Q9q848r343j3493
8878a1900L0j0816j4160R307N078L833K596j5709k519J2564R63J2764P893j1789
8864a1865p318M228k913R932q458j0219M900R417k74n513n249J4550J4633J4059
8850A9910Q005r639r854O416n178K590O85o695o208j2133k122j749p338J54J3008
8835a0148q84j688O145K2043k831o813J654J0299J5612j1080j4344M638q810m520
8821g27Q405j993M401j1713j7l050j0955k639Q436J1229q798p282J0284J827j3716
$$ y = [26272, 20749, 11809, 2877, 4282, 18123, 17561, 2136, -836, 1840, -4770, -10874, -10560, -13634, -7683, -928, 9744, 6279, 8173, 14850, 23870, 25530, 17808, 19783, 14323, 17496, 2541, -7839, -2929, -6166, -7647, -8342, -1020, -3561, -13446, -12701, -8562, 2637, 25627, 21163, 19695, 19784, 10936, 1593, -11900, -11870, -22686, -36846, -27539, -22461, -18628, -16032, -31741, -34260, -21696, -20733, -7969, -76, -11865, -19183, -14955, -17868, -7936, -16394, -26613, -21713, -12296, -12570, -18083, -23332, -8782, 5851, 19910, 27915, 18276, 8422, 14838, 9660, 12250, 12935, 6240, 32, -12101, -14223, -15972, -23310, -23156, -10148, -11032, -12720, -6575, 15468, 12637, 5824, 7478, 17777, 33389, 22309, 7965, 12603, 3793, -727, 7678, 5685, 10086, -1627, -1644, -4694, -15649, -18288, -9852, 1377, -7421, -14703, -4419, -2592, -16308]
8806a6308k552O702q557m656J5808J1609m92r541k361J0338O691j4427M0K1565
8792A3859p725p041Q7K1834l651j1133j9940r823k731Q273K484O37j835k524j0904
8777c0133O085J5116K65l623J4343J6537L739j848j3524q246l60J222l251p972
8763a1650J2403P36j5532o72j583N553R226j8718r053J024J1526L195o948J338
8749a9155l231n476m228J5188K4714J345j6893m710j564J840k151j662k750L661
8735a5072J8453J5066L171J385N98N581k077j5298j7216P804J0279J4308Q930
8722C5912o580j0718p069m247M310j5098J582L738K375j022j5157r981J9316K0526
8708A7887N668q966j7962k769l317r67o376M524N1M600J5128n887j0086q174K337
$$ y = [-16308, -18860, -12158, -20715, -25371, -9563, 2046, 1554, -7987, -10348, -10, 6681, -7746, -7706, 13859, 6134, -907, -820, 21014, 17363, 6230, -13710, -23533, -26264, -17991, -15507, -14870, -16705, -19229, -30133, -24048, -8932, -8667, -12290, 2053, 18590, 22329, 20481, 6957, -1289, -1649, -427, -3678, -11650, 753, 1489, -14043, -14715, -16298, -10745, -1519, -20237, -29290, -28266, -16740, -13545, -20493, -19155, -22386, -27862, -32090, -16902, 7812, 9157, -7736, -12446, -14010, -12170, -14321, -15983, -18733, -15072, 3381, 18447, 21618, 23003, 23601, 29182, 27105, 11807, -5409, 2395, 12674, 26982, 35912, 29332, 18614, 11545, 7298, 11608, -3490, -1908, 1830, 4205, 3183, -11974, -21955, -2639, 17887, 23555, 14589, -3373, -6142, -9459, -10426, -16802, -12278, -12227, -7627, 7501, 1614, -8472, -16646, -14309]
8693a4309J3667r2l718j4395l281M230J7685J3066l388o039O54J484k213Q357
8679A1708J3499j523J1993p468q40n633M690R88j2265p248n865L29J4139Q686
8665B5190L987j4313q238O140j768j0081J189N032P19L183L515m364o455J2668
8651A6404J1139K77P832k499l389J448j8907j5334N768K8669M3383N5983R2464
8638B23238N9019k5286p5844o7458l2327j6571j0791r928K869J022n573k438n416
8625C4516J0992R322j2849j0135n426p467j587L746P811O438J1726J7680K9947
8612I4714K1099R149j0179j1156k4898j0164j2621j0329M799M398J7040J3592
8600H5444p41M155R194M0181O6739J07814J43901J50039j0706j60558j31787n8540
$$ y = [-14309, -642, -734, -4452, -18847, -22128, -17898, -213, 12853, 9465, 3426, 4080, 5564, 3351, 11708, 25207, 23684, 35677, 28209, 27369, 21736, 26426, 27414, 15149, 7901, 2036, 2365, 16504, 25190, 29177, 14864, 6626, 12766, 10998, 917, 2106, 7138, 7857, 11040, 14555, 10191, 3736, 16404, 27543, 27820, 35652, 33153, 29764, 31212, 12305, -3029, 2739, 31408, 74791, 130774, 223238, 282257, 256971, 181127, 113669, 81342, 64771, 53980, 44052, 46921, 47943, 42370, 39932, 34516, 45508, 54830, 41981, 31846, 26420, 18953, 17366, 21112, 28923, 35361, 47087, 64767, 94714, 115813, 124962, 114783, 103627, 78729, 68565, 55944, 45615, 50414, 54812, 71852, 85444, 84703, 88858, 98052, 138233, 204972, 312786, 456687, 606726, 596020, 435462, 303675, 245135]
8588B45135k9883j5776o986m803n793j7384k2647j4126k2741j3604q745n828m417
8575G2402k6842l505j453m80M916l362k320Q986J994P098q671j8777L723Q760
8561D2469n108m482j1555N57O634m277K0491R970j2204o105K5393M2346O9043
8548A73172P9090Q747o9173p2292l6277j8649j1923j0865j2155j3627o06M758
8536B0200O708p573n942k221K261K1770k687k7578O186K598R278L617M385m904
8522B6098j2188q21K339N747p896j0125o195m149L253N363M847J2853k760j4422
8508A944K396J4636N224m630j0547n942j3569K350q4j624J0748K625m738j0856
8494a2067r860o7J2331j2198k263J9538J3526J985k581j6104M935K1451Q32J878
$$ y = [245135, 215252, 199476, 192490, 187687, 181894, 164510, 141863, 127737, 104996, 91392, 82647, 76819, 72402, 45560, 42055, 40602, 40122, 45038, 41676, 39356, 48342, 50336, 57434, 48763, 29986, 33709, 42469, 37361, 32879, 21324, 21881, 28515, 24238, 44729, 54699, 42495, 36390, 61783, 104129, 173172, 252262, 261009, 191836, 119544, 83267, 64618, 52695, 41830, 29675, 16048, 15442, 20200, 26908, 19335, 13393, 11172, 13433, 35203, 32516, 4938, 11124, 13722, 23000, 26617, 31002, 26098, 13910, 13089, 15428, 21175, 13279, 3154, -3041, -7190, -3937, 1426, 6273, 19126, 16366, 1944, 4340, 18976, 24200, 19570, 9023, 3081, -10488, -8138, -8222, -9846, 902, 3527, -1211, -12067, -21927, -21994, -9663, -21861, -24124, -4586, 8940, 10925, 8344, -7760, -2825, 18626, 19458, 21336]
8480B1336j6799l617N072M163K466o847k425K140l086O659n313j1125J0484M716
8466G824R590J272j5547j6216m560J0298R029l017K706L409P078r393q876M539
8452a864j971q923k453K119M701j1184L436J2040M292j2942k421J7693J1418k327
8438A1614r387o811N484J1967p683k051J5958K440L764l894o27m807J3902p0o124
8423B3675k107j1594o960j0807L822J0691J865N438J2414K792o794l765j819o149
8409A0702j2059N521o431j2693O147k317M151j3748J04N17m748O885R181K393
8395f395L145J343N79J912R335J1230p792n672j216l407j374M725o66j1010r86
8380f249O927N794O301j3841M415j5467j4186M745J320j6271J3865L3078K344
$$ y = [21336, 4537, 920, 5992, 10155, 12621, 5774, 3349, 5489, 2403, 9062, 3749, -7376, 3108, 7824, 17414, 18686, 3139, -13077, -17637, -7339, 1690, -1327, 1379, 4788, 11866, 2473, -6403, -1864, -3835, -12758, -15211, -13092, -8391, -19575, -16139, -4099, 193, -12749, -15170, 2523, 13941, 11614, 2227, -4584, 900, 12867, 5184, 3133, 19091, 21531, 25295, 21401, 20774, 15967, 29869, 29799, 23675, 21568, 9974, 3014, -7793, -3971, 6720, 8585, 14023, 26437, 29229, 22435, 18670, 16851, 10702, -1357, 4164, -2267, -14960, -8813, -11130, -6979, -20727, -20623, -20106, -24854, -17969, -8788, -6395, -3250, -1907, -1328, 584, 9919, 21149, 13357, 7685, 6469, 3062, 1688, 6413, 5747, -5263, -6249, 678, 6472, 12773, -1068, 3347, -12120, -26306, -21561, -20241, -36512, -22647, 10431, 12775]
8367A2775j2858q504Q940M061j0228r044J046J3567J0784O212J618k206q789j8903
8353a1529o102O482P097J4130j088q791j3920N447M545R261j423j2377j4544j0314
8339c3126M912J3505K6749j0964j0909K354n057P714J3507J6464j6265J585p943
8326B526o344J0002N156n536j4518M149J8207q72q696n453n555M117J536J0770
8312I489N737k813R490p125j7028j3441Q40j529P019J0738J511j1423j5606P358
8298a6783m923k494Q785j318j76J1850J8974o009r256r853j3855r88J2495m837
8284a8388K819O857j684P689N377o941q040p088J9565N743p292Qj176J6401P761
8269B1611k385O723j1984p174J682N198m72n777o692o985K716J3452k949j4988
$$ y = [12775, -83, -8587, 353, 4414, -5814, -14858, -13812, -245, 10539, 16751, 18369, 16163, 7374, -11529, -17631, -11149, -4052, 10078, 8990, 199, -13721, -8274, -3729, 5532, 4109, -8268, -22812, -33126, -28214, -14709, 12040, 1076, -9833, -7479, -12536, -4822, 8685, 25149, 8884, 10469, 2526, -3818, 6184, 11340, 5804, -8714, -4565, 13642, 12770, 4074, -1379, -6934, -2817, -1281, 9489, 15226, 12413, 21903, 14778, -2250, -15691, -14851, -16380, -9361, 1377, 2888, -8535, -24141, -16783, -21706, -24200, -15415, -16733, -16909, -5059, 13915, 7906, -1350, -11203, -25058, -26046, -13551, -18388, -15569, -8712, -10396, -2707, 2670, -4271, -12311, -19399, 166, 5909, -1383, -1375, -2551, 13850, 21611, 19226, 25949, 13965, 6791, 8473, 13671, 13199, 7422, 730, -6255, -3539, 9913, 6964, -8024]
8255h024j0638N139J0979M247j2398j331n133J171J4402O109K782J648m8p553
8241A352n777J0594P714o51n216j2655m169k882J907J4506j458p399j0443j741
8227a6318m362q952Q221J1876P551j0951j3695Q550L549r442M012J4248J4300
8214H587m243j1254k0554m920J0031J5017K0551J3537j1178j6747J7250J5993
8202C2070q372j5236k815J7767J3542j4284l528j063k148L420J0852j8997k0124
8189h916r635l387J3140R953J354j883O142N533M497n451j183o517J356p359j2899
8174a5255P030J6968R178M423N490M017J074L209r216j5374j0061m736j034P354
8160C067K3501j8p743l733p162Q601R45L464J879l557p659q377r60N36l160m828
$$ y = [-8024, -18662, -13523, -2544, 1703, -10695, -12026, -17159, -15988, -1586, 4523, 7305, 8953, 8905, 1352, -4425, 6169, 13883, 13232, 8016, -4639, -8808, -11690, -9783, 4723, 3265, -4134, -14577, -16318, -20680, -29632, -21411, -9535, -1984, -12935, -26630, -18080, -14531, -23973, -19961, -5713, 8587, 4344, -6910, -27464, -32384, -22353, -7336, 13215, 26752, 15574, -1173, 16077, 32070, 23698, 8462, 5647, 23414, 36956, 22672, 19144, 18081, 15933, 19353, 30205, 11208, -8916, -18551, -21938, -8798, 1155, 2509, 626, 6768, 12301, 16798, 11347, 10164, 3647, 5003, -2356, -15255, -8225, 8743, 17921, 22344, 27834, 31851, 32925, 36134, 26918, 11544, 1483, -3253, -4287, 3067, 26568, 26550, 18807, 15074, 7912, 16513, 17458, 20922, 22801, 19244, 11585, 3208, 2248, 2784, -376, -5204]
8144e204r718o240J10J8113J3428J4336j3471r004j6217J673J0938k638J6536
8131A2642J1864r708j8826j6464j703P143R859J6779K869p038p242O584q212p714
8117i167J4010k454p507o358j1405J5167M959P019L411j5841j0354j2396n211
8104c6127R540N816Q681p539L347J8654O629q166j2683j0541j20R738J6036N557
8090H822m184n210q592k193j1938m069j7012J6971J2808M512r849J17J8620q999
8076a0196o071n929J763J6642p497j0612J3269K2581k539Q313Q712j2168p169
8063I099p925n514K086n858r892N804K437l286K825O265J202K667N962J828K1120
8048B8820m954j9909n869p357J5541M008k594m274j2316l579M992M145M639J0753
$$ y = [-5204, -14922, -21162, -21052, -2939, 10489, 24825, 11354, 2350, -13867, -12194, -1256, -3894, 12642, 24506, 14798, -4028, -20492, -22195, -15052, -5193, 11586, 14455, 7417, 175, 6759, -1453, -9167, 4843, 2389, -5118, -11476, -22881, -7714, -2755, 4264, 7675, -8166, -18520, -30916, -36127, -26587, -20771, -12090, -19629, -16282, 2372, 9001, 835, -11848, -22389, -22509, -12771, 3265, 8822, 4638, -572, -9164, -11357, -23295, -27364, -44376, -27405, -14597, -10085, -19934, -19817, -1197, -10196, -16267, -22196, -20433, -3791, -11288, -21900, -8631, 13950, 11411, 19724, 28436, 16268, 9099, 1174, -4340, -2254, -8112, -18004, -12200, -9763, -13049, -10224, -3959, -2757, -90, 5872, 7700, 28820, 23866, 3957, -1912, -9269, 6272, 10280, 7686, 3412, -8904, -12483, -7491, -3346, 1293, 12046]
8034A2046J0658n592k3442j3622K235P010R180l609o327L446j595J5200R715L196
8020A8499r06q160m22j946j5071o592M508J2663M419l126j0774j7417Q939K1910
8006F524j963N81Q894M497P208N171q814o332J3j9206j2728J578J9381K2753j692
7991B5865J331j5448j1697P261k852p976k695J1932P544j321p138r447j0381j3545
7977b8567J0464K0767K106l768j0052j4379Q112M196J1656P132P413O613M349
7964B6042M354M404k09r781j1496k4793j67Q472R55l599r836K5J6210P006M71
7949H058J2323L320J7430P486k66n155K432m90q450j1125o719l979k2645K764
7935e016M812J1293m390j3533J504M984J0570K316J2595l406q067p315m377j1326
$$ y = [12046, 22704, 17112, -6330, -19952, -17717, -10707, -1527, -5136, -11463, -8017, -9612, 5588, 15303, 18499, 17593, 9433, 9011, 7065, -8006, -14598, -10090, 2573, 6992, 3866, -6908, -24325, -15386, 6524, 4561, 5142, 14036, 18533, 25741, 30912, 22098, 15766, 15779, -3427, -16155, -14577, 4804, 27557, 25865, 27196, 11748, 51, 7312, 4460, -3516, -6211, 5721, 13265, 11944, 4806, -4641, -15022, -28567, -18103, 2664, 4770, 1002, -9050, -23429, -15317, -11121, 535, 7667, 15080, 21693, 26042, 30396, 34800, 34591, 24810, 13314, -11479, -11646, -3174, -2219, -5818, -15654, -15629, 581, 7587, 8058, 20381, 23701, 41131, 48617, 48351, 43196, 45628, 45138, 36688, 25563, 18844, 14865, -7780, -5016, -204, 11089, 6699, -6834, -5330, -346, 10224, 12540, 25135, 21729, 13662, 6347, 1970, -9356]
7921i356r691k013J954K225j0735R479J5352J2466j864j9998k679r068K224N837
7907a5867r39N666K665L34J1597L592l68Q706r03k256L294J968j0440J288j1589
7892c252p21J4240J703L884M830o357j943l529J779n932q06q574j707J0906j1939
7877g418l611P93K105M735r57J5497J1353N506K980l204j1878q386r507m328j680
7862h000J0662J7596j0685j8987M426m212j2436L255K87J2019M184N125q089k9323
7848c4178l904K0576J3095R118k141j070n14r923j9238r72J0994j153r73p293
7834b7576O113K716J125J3760j0473K018M238J7876M845l282n186p01k771J341
7820D043k603q23n054K259J4664r373L472r199m935J0917K4073J118j6720l674
$$ y = [-9356, -19047, -21060, -19106, -16881, -27616, -18137, -2785, 9681, 7817, -12181, -14860, -23928, -21704, -15867, -16806, -11140, -8475, -8141, 3456, 7048, 6680, 15386, 14483, 12227, 15521, 17489, 7049, 8337, -3252, -3973, 10267, 11970, 15854, 20684, 14327, 12384, 8855, 10634, 4702, 3896, -4678, -6385, 4521, -7418, -11029, -10236, -8131, -3396, -4353, 11144, 22497, 28003, 30983, 27779, 15901, 7515, -1992, -6320, -8000, 2662, 20258, 9573, -9414, -4988, -9200, -21636, -18381, -18094, -6075, -1891, 3234, -4855, -34178, -38082, -17506, -4411, 4707, 2566, 1496, 982, -8941, -28179, -29151, -18157, -19310, -20283, -27576, -21463, -18747, -17622, -3862, -14335, -12317, -8079, 9797, 14642, 11360, 6174, 5473, 2702, 4043, 1440, 617, -4437, -2178, 12486, 3113, 6585, -2614, -7549, 3368, 27441, 28559, 11839, 8165]
7806H165K347k844J1557o282J565N367r20q75m261N218j0293j5369q537m016L071
7791a6107J019N668J5486R395K115J0230l748q868o571o456j4589q753J3919k211
7777i471l900K0179J884r529j444Q159L967n809m846O814M738m492j3502r677
7763a6929Q008K09j702M544R790j4323k0516Q437J9980P03n036k347n477P534
7749g125L551k584L243j886n076r921J1749J2104L046P87p77P294p731j0945l393
7734g664j0522P174J6498Q85k362j2476p134J1210N561q861R454M81j3863R08
7720a0711Q172J372J197m12k1485r464N87k783n646J1490K3279n153p240O811
7706i986M379P653q753n570q517p383m936L362K3085J1902j4153o857r937J2111
$$ y = [8165, 10512, 7668, 19225, 12943, 14508, 19875, 18955, 18080, 13819, 19037, 8744, -6625, -15162, -19178, -16107, -15088, -9420, 6066, 15461, 17576, 27806, 24058, 15190, 8619, 2163, -12426, -21179, -7260, -9471, -13371, 6808, 8692, -837, -2281, 5878, 9845, 4036, -810, 6004, 10742, 6250, -7252, -16929, -8921, -8712, -10414, -5870, 3920, -10403, -30919, -22482, -2502, -1799, -6835, -9182, -14659, -7125, -3574, -6158, -2915, -4801, -9877, -19798, -8049, 4055, 7101, 7888, 7111, 14405, 6674, -4271, -7664, -18186, -11012, 5486, 6371, 4009, -8467, -15601, -4391, 1170, -7691, 1763, 2244, -11619, -10711, -2539, -1167, 30, -382, -21867, -31331, -30744, -33527, -39173, -27683, -4404, -9557, -16797, -9986, -5607, 2046, -6707, -12277, -20794, -28177, -33113, -29751, -6666, 5236, -8917, -15774, -25711, -13600]
7692a3600Q692K1L871r346Q327K0566j0483k964r530l75P124N448J958k239o054
7677A416o694m794j4366J6412K0994j044M77n247m738p655L478M071k457K413
7663B266K920O149M211j945j3673n488L62j0488n291K052o250N466j292J3974
7649g027k068n424Q177O81m037j275l514J046N482Q118P929k07j957J1946P908
7634B5778j1927q120l488j6512k2758j420L025K307J7563Q464j9080J273k338
7621b7233j3234R906R661L696M471l992O81N075J3373Q682J6055k2643j4538L598
7607f442J283l735j775o009J2245J692m111J534J812J5845j15N998M250k3313
7593h41j5341j5348J6413J4887j244M40j1968l937K184N514J2997P296l336K835
$$ y = [-13600, -4908, -4887, -1016, -10362, -2035, 18531, 8048, 5084, -4446, -4821, 2303, 7751, 9709, 7470, 1416, -5278, -10072, -24438, -8026, 12968, 11924, 12401, 7154, 2416, -5239, -1761, 2310, -147, 2266, 5186, 11335, 15546, 13601, -72, -5560, -5198, -15686, -20977, -18925, -25175, -19709, -21001, -7027, -9095, -14519, -6342, -5661, -9698, -10973, -14487, -13441, -7959, 159, 8088, 7881, 5924, 17870, 25778, 13851, 5731, 2243, -14269, -37027, -38447, -35422, -33115, -15552, -7088, -26168, -24895, -27233, -40467, -30561, -20900, -17204, -12733, -16725, -16044, -10969, 2404, 11086, 27141, 4498, -10040, -6442, -5159, -8894, -10669, -16678, -4433, -2741, -6852, -5318, -3506, 12339, 12224, 18222, 22472, -841, -16182, -31530, -15117, -230, -1474, -1034, -13002, -16939, -14755, -9241, 3756, 11052, 7716, 10551]
7579A0551j2623l809O021j2206j052L430L380l878j1462j055P188J458j398k86
7565a5741j3177Q022J3418Q090j0139m157o17p073k074R054J0294J7291M710P24
7551A8625j4648p962J0898L174m773M939k022j312J1664L095j2630p097j1049
7538i098r657K361R409J1423J4483j1674j1192j0147j0379O125K3458J6024o601
7525A4535j3777n062R516j181j1627m726k248N424K303p457M439L208P030L357
7511C734k0641M041J3393P838k717m510r693K126r84J5148k270j642j3032k473
7497a1682K1901R913o623j1538j0360J1859j1639k6997N233J7629Q464M267K720
7484C147K040j4201o62Q837J0872K230M444K232j2273q215o115j5788r292K588
$$ y = [10551, -2072, -5881, 140, -12066, -13118, -9688, -6308, -10186, -21648, -22703, -15515, -14057, -15455, -15741, -28918, -20896, -7478, 612, -9527, -13684, -14301, -21374, -23448, -14394, -4100, 13191, 17901, 18625, 3977, -3985, 6913, 10087, 5314, 10253, 8231, 6919, 18583, 21678, 9048, 1951, -9098, -18755, -16394, -6985, 4438, 18921, 7247, -3945, -14092, -24471, -18346, 5112, 21136, 14535, 758, -4304, 5212, 4031, -7596, -12322, -14570, -9146, -6843, -14300, -9861, -6653, 377, 3734, -16907, -12866, 527, 8365, 5648, 1138, -8555, -6429, -7413, 7735, 5465, 3823, -9209, -11682, 10219, 20132, 13509, 1971, -8389, 3470, -8169, -35166, -29933, -12304, -3840, 427, 3147, 5187, -9014, -9676, -839, 10033, 12263, 16707, 18939, 6666, -1549, -7664, -23452, -32744, -30156]
7470c0156O139J3854N286M563l673j559K837o017L111N654L906q116J946J1587
7456I362p440j1154Q094K333J498P779r902m906l556p729Q182k915j2883J2308
7442a0929K2948K086q644p857k478J426R756p260m586l951j8468j7840J9482P563
7428a8752k408M716N605R474j4174p461r69K4013P113R056k392r302j4674o167
7414a6322Q306m881l027M199J009n646r62J4321R891o811l068k1067l948o505
7400c4511p652R705J688J5053J1330J0343Q720o481m785j696j7530N530O874l038
7386f450K559p14K397J0123k734o215j7740K449J4106j306j091m358j915m931
7372a5820K031k689L516L284j2210K36P803j976n9K875m111P12J6285J805K849
$$ y = [-30156, -24017, -10163, -4877, -314, -3987, -5546, -2709, -8726, -5615, 39, 3945, -4171, -2225, 9362, 1922, -9232, -1138, 1195, 2693, 10472, 570, -4336, -7892, -15621, -7439, -10354, -23237, -10929, 12019, 14105, 5461, -2396, -4874, -3448, 6308, -952, -5538, -9489, -27957, -45797, -26315, -18752, -21160, -16444, -10839, -1365, -15539, -23000, -23969, 44, 7157, 16213, 13821, 4519, -10155, -16322, -8016, -12897, -15924, -11725, -10716, -16362, -17324, -3003, 6888, 77, -2991, -24058, -28006, -34511, -42163, -32458, -30770, -15717, -4387, 5956, 14676, 8195, 3410, 1714, -15816, -10286, -3412, -6450, -3891, -4605, -2208, 7915, 5181, -1034, -18774, -16325, -2219, -3525, -4616, -8974, -10889, -15820, -13789, -16478, -12962, -9678, -21888, -21652, -13849, -15825, -15884, -13009, -17120, -16408, -123, 1682, 4531]
7357D531O803N757o880j6050j2966P044R666n190n756l413J5734M345p015j7778
7343b1168O941q401j0894K82L671J7618J1585l47j1192p650m70K1336M612p571
7329a648n538j9941K434R39j2753J0764J3232J5563l070k0513k475P140Q824l048
7315a0090j3788Q273J4672N467J4932q858j6753p436M471J386k469K034j392j134
7301a0685r845r917m98J4129L100j2276k366Q469k146l025M768L632q416m932
7287c0008J6389J4266J757M385m544j318q847o288j3103M106J3130J0232M068
7274D225j8219j1135R885o36p199M269Q902m21O276L569M148O304j6176K143m524
7259h589N039K429j2292l744Q03r037q55J6861j0383q131L223J5183J5107O484
$$ y = [4531, 11334, 17091, 10211, -5839, -18805, -11761, -2095, -7285, -13041, -16454, -720, 3625, -3390, -21168, -14227, -22628, -33522, -33240, -29569, -11951, -366, -713, -11905, -19555, -20025, 1311, 5923, -1648, -7186, -27127, -24693, -23754, -36507, -25743, -12511, 3052, -18, -20531, -23006, -15866, -7042, -10090, -23878, -15605, -933, 4534, 19466, 10608, -6145, -13581, -9110, -7724, -10193, -8159, -9551, -10685, -20530, -30447, -30945, -16816, -13716, -25992, -28358, -19889, -22035, -25060, -20292, -16660, -25076, -30008, -13619, 647, 2404, 6789, 2245, 927, -7920, -14208, -27311, -23205, -10075, 157, 4225, -13994, -25129, -15244, -15880, -23079, -18810, -9908, -10329, -4053, -484, 3664, 9968, -6208, -4065, -8589, -3550, -1121, -13413, -17157, -16354, -25391, -26246, -9385, -19768, -27899, -24676, -9493, 5614, 12098]
7245A2098k01j1969r930J090m157n1m002L005R59Q28N247k226r759R197M835L345
7229a691k12M956k065J8830j217k8887O297J3558n27K459j2513n094M2J1640k761
7214B815M941q601j6913K08K2401P215J524R06k1025M599K474L830J4472J879
7200B0725m692n803j1150j0066M980J5292K966P046J700j1536r838k265j2676
7187a5317j066R058J4464j6086j3710Q765J7022O433K392o575p347P055l700J0598
7173A1986J5443j1509j4658n45j5218p102J999J9038N655k340J9900p330k116
7160A3203k054j0620j966k335m537l705j20N839P593q530p422J2624j86N09J542
7145a65j406j218n784j3307K2360J2964n236j6036K505L135j301m395L272O394
$$ y = [12098, 11897, -72, -10002, -8912, -13069, -13120, -17122, -14117, -13158, -12330, -7083, -9309, -19068, -9871, -5036, -1691, -1903, 3053, 988, 19818, 18601, -10286, -3989, 9569, 9042, 11501, -1012, -6106, -6064, 5576, 2815, 7756, -845, -17758, -17550, 4851, 12066, 13590, 14496, -6529, -1930, 544, 4374, 18846, 20725, 16033, 10230, -920, -10986, -6006, 9286, 12252, 19298, 20998, 9462, -376, -2641, -15317, -16383, -7325, 7139, -8947, -22657, -13892, 3130, 9563, 11955, 5380, -1967, 5088, 1388, 11986, 27429, 15920, 1262, 717, -14501, -21603, -19604, -566, 5089, 2749, 22649, 15319, 13203, 11149, 529, -1437, -3772, -8309, -12014, -12134, -6295, 1298, -7232, -14654, -2030, -2216, -1707, -165, -1571, -2789, -8573, -21880, 480, 13444, 8208, -7828, -5323, -2188, -3489, -7884, -4612, 1782]
7131A782q85j0278k8372j0831J0258J1214M035K5188m288n28O019n893m906o819
7117a4304r814J1310k187J502J57M579n211l300n689r054k045J0814J3487n971
7103a5726n27P0M524P887J4139M390l846j3715r497o328k208j6078L677J7944
7089a5294J0243l94R36K228J5263O632n464o292j835j7673o478j1900n798J1266
7075b4560N029J3316P241k747J0035r83r565j0075N080l945m402L021N969l844
7061a0430j6821o132K3229J5373M431j6083j6222K687R271k525O510m565N157
7048f120J2680Q114j1321M41q981j2723L496j894o112o815J3226k060j0201N994
7034b2276J1555L520L301J2663j181n727q921j5275K1856R336k271o701j4378
$$ y = [1782, 897, -9381, -37753, -48584, -38326, -27112, -23077, 2111, -2177, -2705, 3314, -2579, -7485, -14304, -24118, -12808, -14995, -13493, -13336, -8757, -13968, -17268, -22957, -32011, -34056, -23242, -9755, -15726, -16253, -16183, -11659, -3772, 10367, 14757, 10911, -2804, -12301, -18629, -20837, -36915, -33238, -15294, -5051, -5445, -4509, -2281, 12982, 19614, 14150, 7858, 6023, -11650, -18128, -30028, -35826, -24560, -19531, -6215, 1026, -1721, 8314, 7331, -2234, -12309, -7229, -11174, -15576, -12555, -6586, -10430, -27251, -33383, -10154, 5219, 9650, -6433, -22655, -19968, -10697, -13222, -6712, -11277, -6120, 6560, 14674, 3353, 3794, -5187, -17910, -14414, -16308, -22420, -29235, -16009, -18069, -28270, -22276, -10721, -7201, -3900, 8763, 7582, 1855, -7066, -22341, -485, 8851, 6580, -121, -14499]
7021a4499n503J7631J0516O093L951J629R17k0858J9K1378N933K961q901L757
7007B5024J180J382j2777p956j3153k0229P196K1777k853o586J755J629O783q943
6993e771o120J108J3260J391j2784j7018L036J6918J2742j7328K905N511N498
6980C348q345p891K830k525R910Q837N349M935N643M971k5084j1546J4607J0325
6966A5364j2268N776J10J36J2873O57j1758j0456PJ4063r58p378P741j1619n823
6951c533J0398M993Q944k390K11k564m100l25k401k4842k676J880p237L917O641
6936a3084k815j68m177J864j019j1623m188q511O074K3022P462M21j7885l93R100
6921a5920J0045K440r961O60R651K634q285p525Q509L219J983o992L676J4591
$$ y = [-14499, -20002, -2371, 8145, 14238, 18189, 19818, 20735, -123, -104, 21274, 27207, 30168, 21267, 25024, 26204, 27586, 14809, 6853, -6300, -26529, -19333, 2444, -409, -6995, -5240, -3611, 3172, -5771, -11891, -10783, 2477, 3868, -8916, -25934, -22898, -5980, 6762, -10566, -7661, -2150, 3348, -4997, -12888, -10058, -12583, -2673, 6164, 11513, 16448, 22091, 27062, 1978, -9568, 5039, 15364, 3096, 8872, 8982, 9118, 21991, 22648, 10890, 434, 441, 14504, 13546, 6168, 13909, 2290, -3533, 6865, 11858, 20802, 18412, 18623, 16059, 11959, 11634, 9233, -15609, -18285, -16405, -23642, -19725, -13084, -15899, -16067, -20244, -18380, -19399, -31022, -35210, -43721, -37647, -14625, -7163, -6742, -24627, -25020, -15920, -5875, -3435, -13396, -12736, -3085, -451, -8736, -16261, -7752, -4533, -2550, -9542, -5866, 8725]
6907H725J4049l917m098j497o296j2895p077J0519k320N547K410M751K705J3033
6893B3639j0271k3936J641K90p652k654l420J3590J6809m20l429Q057n595N938
6879A2587o196P029O259P244m189p797m703p61j4924M979M901r083j9837L587
6865b0904Q680J2609O443j1809j3184k846j622r564Q805J4307J0393Q924j723
6852H509j878K706M198j1189l540R162l019j2004R086R755N221j9834j4918R979
6838g766P050o438l795O396J5899P328o525J700q596j8995q460P700J1530J1850
6824H878O109j8822j4066P687k008P091Q224m71j5472P806J0684j36q793j428
6810d717J2112m082r786j879l61r319P588N491q725l590o893q51J140p608M7J2195
$$ y = [8725, 22774, 18857, 14759, 13262, 6966, -5929, -13006, -2487, -4807, 740, 3150, 7901, 10606, 23639, 13368, -10568, -8927, -8637, -16289, -18943, -22363, -8773, 8036, 7616, 4187, 12244, 6649, 12587, 6391, 13420, 19679, 26923, 22734, 14937, 10234, 9473, -5451, -472, 4429, -4654, -24491, -20904, -12224, 385, 6828, -4981, -18165, -21011, -22633, -32197, -23392, -9085, 1308, 10232, 8509, 6631, 9337, 13535, 2346, -1194, 7968, 4949, -7055, 2031, 11786, 17007, -2827, -17745, -7766, -716, -7154, -10949, -4553, 11346, 18674, 12149, 13849, 5253, -13742, -22202, -14502, -2972, 8878, 14987, -3835, -17901, -10214, -12222, -5131, 3093, 2622, -12850, -5044, 5640, 5504, -3289, -4717, 7395, 3313, -6473, -8352, -8713, -18032, -10444, -4953, -13678, -17268, -24161, -25012, -23872, -31480, -31433, -19238]
6794a9238J8432K386m750k073L506M299R28j2774k2166m899N131L928K200k882
6780b7972L624l849k132J2086R895K0733J115q687q483o772P230o64k1040N462
6766a9454J0214Q882R553j0897n765P388p491j6824j0079K7684K5001j2154n925
6753A33o525P787R064Q082J8373P736j3276K620K875k3312k0483N259Q43Q08M392
6738D376R610O141J6659J1959K955Q282P697l3039k3938l722O980J2315J2903
6725C9178J7788K935o988L178J3424Q972J7829K6801K8744N1250P9189J20014
6713D02314J84211K63831L96360M89177K50607l02938n50930l95850k36591j56390
6703C43801r0628o5162n3972k0755J728j1866k8081j2608q234j304m126m365r799
$$ y = [-19238, -806, 1580, -3170, -5243, -1737, 2562, 3490, -9284, -31450, -36349, -31218, -27290, -25090, -27972, -24348, -28197, -30329, -18243, -8348, 12385, 13500, 4813, -3670, -10442, -3212, -3876, -24916, -19454, -9240, -358, 9195, -1702, -7467, -79, -7570, -24394, -34473, -6789, 18212, 6058, 133, -6392, 1395, 10459, 18541, 36914, 44650, 31374, 33994, 36869, 13557, -6926, -1667, -824, -16, 4376, 13986, 20127, 36786, 48745, 51700, 59982, 67679, 34640, 10702, 6980, 13960, 26275, 39178, 56966, 59901, 52913, 56091, 69515, 78487, 96316, 123117, 151861, 203111, 282300, 402314, 586525, 850356, 1246716, 1735893, 1986500, 1683562, 1132632, 736782, 500191, 343801, 253173, 188011, 134039, 113284, 115012, 103146, 75065, 62457, 54223, 52919, 48793, 44428, 34629]
6690C4629n36R610K290J259J3011q928j518L936l768j6027j776O048j315j1480
6676B5435j6652r019J2091k068P273J8390R943j4768q538O006j603r156L188J0810
6662C1332k0524J839O713p862j5081L590J433n440r033o193N017J0967q721j6327
6648b8290R274J8813L295Q270N894j1282N316j845K523j5287J03M945l583p791
6634i645K205J0335M701m914L334j469l944M845J661l801q19n843J881J917L12
6619G56M257K815R258l913k7264J5096J7440k447p099j4102Q722o569l798k691
6605i539J0672J3657K544Q523j115l273j2474o746l042q441j4635m833J4343J3485
6591h74k231Q898J0384K680j3136o923J983r23q86N42L605k486k470j634L314
$$ y = [34629, 34093, 43703, 45993, 47252, 60263, 51335, 49817, 53753, 49985, 33958, 32182, 38230, 36915, 25435, 8783, -236, 11855, 9787, 17060, 35450, 45393, 30625, 22087, 28093, 26490, 17334, 20522, 31332, 10808, 12647, 19360, 11498, -3583, 7, 1440, -4000, -13033, -19226, -14209, -3242, -11963, -28290, -19016, -203, 3092, 11362, 17256, 5974, 11290, 9445, 11968, -3319, -3216, 1729, -1854, -9645, -7440, 2895, 7596, 2682, 6016, 4547, 603, 5448, 7109, 3308, 2489, -3354, -1473, 444, 756, 5013, 7828, 17086, 13173, -14091, 1005, 18445, 15998, 8899, -5203, 3519, -3050, -6848, -9539, 1133, 14790, 17334, 25857, 24742, 21469, 8995, 2249, -793, -9234, -23869, -28702, -14359, -874, -3105, 5793, 16177, 18857, 5721, -1202, 781, -142, -1028, -486, 3119, 633, -1837, -3471, -157]
6576a57p961m530M329j49m143n223J3032M807Q352k991j3805J3103q60l734k891
6561b821J617P86n428Q047K552m428l205J5380J3411j6723j1307O03J1058J1424
6547B0966J224r403k933q091m053j718J45p908j2050N604l933r002P920J0705
6533a2527k212o774j2863p05J7317J9294k63r970o910r857N554n50n198j4377
6519d0041L39J8492J913o006n581n248r11J7672n720L475P168o843J2081l245
6505a2455P6n702l545L900r025o852L576m324J1610K1887J2295J122m828j3987
6491f252p296O100K2011L214K287p679k3084j8531l106J0266P684J0690O247j0954
6477h403j0348j052J3429N368o928P085J3436K59J93r778J815O271N680o32K311
$$ y = [-157, -8118, -12648, -8319, -8468, -12611, -17834, -4802, 5, 8357, 5366, -8439, 4664, 3804, 70, -2821, -1204, -418, -5846, 2201, 4753, 325, -2880, 12500, 25911, 9188, -2119, -1516, 9542, 20966, 22190, 12787, 9854, 1763, -2290, -4008, -3863, -11771, -23821, -18217, -22150, -31152, -23232, -12527, -14739, -21513, -34376, -35081, -17764, 1530, 1267, -8703, -15613, -25470, -19916, -20466, -25664, -40041, -39702, -21210, -19297, -25303, -30884, -36132, -37043, -19371, -25091, -21616, -14448, -21291, -9210, -12455, -12379, -18081, -21626, -17726, -26751, -33603, -30027, -34351, -22741, -854, 11441, 12563, 7735, -6252, -13548, -7448, 14563, 17777, 20064, 12385, -10699, -29230, -32336, -22070, -14386, -3696, 2551, -8403, -18751, -19803, -6374, -1006, -7934, -849, 12587, 12846, 13039, 3261, 5076, 11347, 17027, 16395, 18706]
6462A8706j2290L347o352p70r567J4323J154n272K053O365l559j997J0846j4730
6448B257j3359K5111m287n665N807L96J5111j7682k93J7602K544o479k8940p285
6434a5162o185m047J3924J2612P436j2033n423N796l924j165P144K181r50N876
6420F080o247r674k056L317O089N10L934P949j0634p802p30K825J770O558K622
6405D511p232n450Q511J0436M229o709N171m286p92n085m225L279k214p058N257
6390a657J2194J654k263M240n655k587n652M418P220L559j9926j7481p467m162
6376c3565K51R774N156J5312P864p8l956J161M151q19P735J2233q314j6025J373
6361B253N678n268j669J757J594j0274K349O697k802P743p053o148n463p789R202
$$ y = [18706, 6416, 9763, 3411, 2641, -6926, 7397, 8551, 3279, 5332, 11697, 8138, 6141, 16987, 2257, -11102, 14009, 9722, 4057, 9864, 10260, 25371, 7689, 7396, 24998, 27542, 21063, -7877, -15162, -21347, -25394, -11470, 1142, 8578, -3455, -8878, -3082, -7006, -8171, -1027, 1154, 204, 6080, -167, -9841, -11897, -8580, -2491, -1981, 1953, 9902, -732, -8534, -9264, -6439, -4669, 1889, 4511, -2721, -8171, 340, 10776, 15005, 8296, 13467, 9181, 8389, 3304, -921, 2358, 144, -6914, -1657, 10537, 12191, 9928, 14168, 8513, 5926, 274, 4692, 11912, 15471, -4455, -21936, -29403, -33565, -33314, -23540, -18384, -3072, 4792, 4714, 758, 1919, 6070, 5251, 12986, 25219, 16905, 880, 2253, 7931, 2663, 994, 2751, 4345, -5929, -3580, 3117, 315, 8058, 1005, -5143, -10606, -18395, -9193]
6346i193N11j60O722N879k30j5816K288J1894j343q418j3906o290J830q251n093
6331c9576P734O60M044J1193J4870J0941l386j3598Q994Q747j289j1995K634q323
6317h350Q389J2391k420J0482J387r692j0821p874n500l796L03O682P629Q571
6303G381r57p781K1015k674j207o226q830j697j805l2M1J6694R638n774l856j5147
6287a217q776Q904P732l681N130o390M669P38j838j4716j953J4747j2093L825
6273d919Q887r272r076n739j3593Q988L046J1255J5289J5290o601j2197l066j9000
$$ y = [-9193, -8682, -8842, -2120, 3759, 3529, -12287, -9999, 1895, 552, -7866, -21772, -28062, -26232, -34483, -39576, -31842, -31182, -27138, -15945, -1075, 9866, 6480, -7118, 1876, 10623, 9334, -2661, -27, -8350, 39, 12430, 10010, 20492, 21879, 12187, 1366, -6508, -12008, -15804, -15501, -8819, -1190, 7381, 6424, -1357, 19658, 16984, 15777, 9551, 721, -976, -2781, -2813, -2772, 13922, 23560, 17786, 13930, -1217, -9993, -1089, 6643, 2962, 8092, 1702, 6371, 7109, 5271, -9445, -11398, 3349, -8744, -4919, 3968, -5304, -14380, -20119, -33712, -24724, -21678, -10423, 4866, 20156, 13555, 1358, -1708, -20708]
$$ [...]
##END NTUPLES=NMR SPECTRUM
##END=
