##TITLE=Analysis number 327003
Compound Code cc 63924
Book Reference 470/166
Project Code adrs
Chemist Name mikem
##JCAMPDX= 6.0         $$ Bruker NMR JCAMP-DX V2.0
##DATA TYPE= NMR SPECTRUM
##DATA CLASS= NTUPLES
##ORIGIN= Bruker BioSpin GmbH
##OWNER= nmr
$$ XWIN-NMR		Version 3.5
$$ Wed Mar  7 12:11:25 2007 GMT Standard Time (UT+0h)  MAYBRIDGE\nmr@NMR_250MHZ
##.OBSERVE FREQUENCY= 250.131544655141
##.OBSERVE NUCLEUS= ^1H
##.ACQUISITION MODE= SIMULTANEOUS (DQD)
##.ACQUISITION SCHEME= undefined
##.AVERAGES= 16
##.DIGITISER RES= 18
##SPECTROMETER/DATA SYSTEM= dpx250
##.PULSE SEQUENCE= zg30
##.SOLVENT NAME= CDCl3
##.SHIFT REFERENCE= (INTERNAL, CDCl3, 0, 16.4548)
##AUDIT TRAIL= $$ (NUMBER, WHEN, WHO, WHERE, WHAT)
$$ ##TITLE= Audit trail, XWIN-NMR		Version 3.5
$$ ##JCAMPDX= 5.01
$$ ##ORIGIN= Bruker BioSpin GmbH
$$ ##OWNER= nmr
$$ C:\u/data/dgb/nmr/ADRS/460/pdata/1/auditp.txt
$$ ##AUDIT TRAIL=  $$ (NUMBER, WHEN, WHO, WHERE, WHAT)
(   1,<2007-03-07 12:11:02.50 +000>,<MAYBRIDGE\nmr>,<NMR_250MHZ>,
      <created by zg, POWCHK disabled, PULCHK disabled
       configuration hash MD5:
       49 4B E0 1D 92 C2 6B 37 9F E6 65 BC 52 41 86 1D
       data hash MD5: 64K
       67 14 57 2F E7 AE 86 74 2B D0 DD 7A 7B A3 10 25>)
(   2,<2007-03-07 12:11:17.42 +000>,<MAYBRIDGE\nmr>,<NMR_250MHZ>,
      <Start of raw data processing
       ef LB = 0.3 FT_mod = 6 PKNL = 1 SI = 32K 
       data hash MD5: 32K
       44 DA 31 8F B8 5F 2F F2 3D D4 BD 3F A9 6A 7B 25>)
(   3,<2007-03-07 12:11:19.19 +000>,<MAYBRIDGE\nmr>,<NMR_250MHZ>,
      <apk 
       data hash MD5: 32K
       C4 57 1D 0A 24 3C 41 37 CB C0 86 B2 6A B4 11 90>)
(   4,<2007-03-07 12:11:19.88 +000>,<MAYBRIDGE\nmr>,<NMR_250MHZ>,
      <abs ABSG = 5 
       data hash MD5: 32K
       1B 10 9B F4 5F 82 66 E0 7C 16 63 37 EC 1C 26 3C>)
$$ ##END=
$$ 
$$ hash MD5
$$ 58 34 54 9A E8 13 A1 A7 C6 33 68 A2 4D 64 4F 54
##$RELAX= 
##$RELAX= 
##$RELAX= 
##$RELAX= 
##$RELAX= 
##$RELAX= 
##$RELAX= 
$$ Bruker specific parameters
$$ --------------------------
##$DU= <C:\u>
##$EXPNO= 460
##$NAME= <ADRS>
##$PROCNO= 1
##$TYPE= <nmr>
##$USER= <dgb>
##$AMP= (0..31)
100 100 100 100 100 100 100 100 100 100 100 100 100 100 100 100 100 100 
100 100 100 100 100 100 100 100 100 100 100 100 100 100 
##$AQSEQ= 0
##$AQ_mod= 3
##$AUNM= <au_zg>
##$AUTOPOS= <22 >
##$BF1= 250.13
##$BF2= 250.13
##$BF3= 250.13
##$BF4= 250.13
##$BF5= 500.13
##$BF6= 500.13
##$BF7= 500.13
##$BF8= 500.13
##$BYTORDA= 1
##$CFDGTYP= 0
##$CFRGTYP= 5
##$CHEMSTR= <none>
##$CNST= (0..31)
1 1 145 1 1 1 1 1 1 1 1 1 1 1 1 1 1 1 1 1 1 1 1 1 1 1 1 1 1 1 1 1 
##$CPDPRG= <>
##$CPDPRG1= <>
##$CPDPRG2= <>
##$CPDPRG3= <>
##$CPDPRG4= <mlev>
##$CPDPRG5= <mlev>
##$CPDPRG6= <mlev>
##$CPDPRG7= <mlev>
##$CPDPRG8= <mlev>
##$CPDPRGB= <>
##$CPDPRGT= <>
##$D= (0..31)
0 1 0 0 0 0 0 0 0 0.06 0 0 0 0 0 0 0.0002 0 0 0 0 0 0 0 0 0 0 0 0 0 0 
0 
##$DATE= 1173269461
##$DBL= (0..7)
120 120 120 120 120 120 120 120 
##$DBP= (0..7)
150 150 150 150 150 150 150 150 
##$DBP07= 0
##$DBPNAM0= <>
##$DBPNAM1= <>
$$ [...]
##$SUBNAM7= <"">
##$SUBNAM8= <"">
##$SUBNAM9= <"">
##$SW= 20.6930455092707
##$SWIBOX= (0..15)
0 0 3 0 0 0 0 0 0 0 0 0 0 0 0 0 
##$SW_h= 5175.983436853
##$TD= 65536
##$TD0= 1
##$TE= 295.16
##$TE2= 300
##$TE3= 300
##$TEG= 300
##$TL= (0..7)
0 120 120 120 120 120 120 120 
##$TP= (0..7)
150 150 150 150 150 150 150 150 
##$TP07= 0
##$TPNAME0= <>
##$TPNAME1= <>
##$TPNAME2= <>
##$TPNAME3= <>
##$TPNAME4= <>
##$TPNAME5= <>
##$TPNAME6= <>
##$TPNAME7= <>
##$TPOAL= (0..7)
0.5 0.5 0.5 0.5 0.5 0.5 0.5 0.5 
##$TPOFFS= (0..7)
0 0 0 0 0 0 0 0 
##$TUNHIN= 0
##$TUNHOUT= 0
##$TUNXOUT= 0
##$USERA1= <user>
##$USERA2= <user>
##$USERA3= <user>
##$USERA4= <user>
##$USERA5= <user>
##$V9= 5
##$VALIST= <valist>
##$VCLIST= <CCCCCCCCCCCCCCC>
##$VD= 0
##$VDLIST= <DDDDDDDDDDDDDDD>
##$VPLIST= <PPPPPPPPPPPPPPP>
##$VTLIST= <TTTTTTTTTTTTTTT>
##$WBST= 1024
##$WBSW= 4
##$XGAIN= (0..3)
0 0 0 0 
##$XL= 0
##$YL= 0
##$YMAX_a= 391766
##$YMIN_a= -405111
##$ZGOPTNS= <>
##$ZL1= 120
##$ZL2= 120
##$ZL3= 120
##$ZL4= 120
##$ABSF1= 16.45479
##$ABSF2= -4.238382
##$ABSG= 5
##$ABSL= 3
##$ALPHA= 0
##$AQORDER= 0
##$ASSFAC= 0
##$ASSFACI= 0
##$ASSFACX= 0
##$ASSWID= 0
##$AUNMP= <proc_1d>
##$AZFE= 0.1
##$AZFW= 0.1
##$BCFW= 0
##$BC_mod= 0
##$BYTORDP= 0
##$COROFFS= 0
##$CY= 12.5
##$DATMOD= 1
##$DC= 0
##$DFILT= <>
##$DTYPP= 0
##$F1P= 14.0000005364418
##$F2P= -0.99999901652339
##$FCOR= 0.5
##$FTSIZE= 32768
##$FT_mod= 6
##$GAMMA= 0
##$GB= 0
##$INTBC= 1
##$INTSCL= 1
##$ISEN= 128
##$LB= 0.3
##$LEV0= 0
##$LPBIN= 0
##$MAXI= 10000
##$MC2= 0
##$MEAN= 0
##$ME_mod= 0
##$MI= 0
##$NCOEF= 0
##$NC_proc= -2
##$NLEV= 6
##$NOISF1= 0
##$NOISF2= 0
##$NSP= 0
##$NTH_PI= 0
##$NZP= 0
##$OFFSET= 16.45479
##$PC= 1
##$PHC0= 225.1793
##$PHC1= 10.79681
##$PH_mod= 1
##$PKNL= yes
##$PPARMOD= 0
##$PSCAL= 4
##$PSIGN= 0
##$REVERSE= no
##$SF= 250.130016810895
##$SI= 32768
##$SIGF1= 0
##$SIGF2= 0
##$SINO= 400
##$SIOLD= 32768
##$SREGLST= <1H.CDCl3>
##$SSB= 0
##$STSI= 32768
##$STSR= 0
##$SW_p= 5175.98343685301
##$SYMM= 0
##$S_DEV= 0
##$TDeff= 65536
##$TDoff= 0
##$TI= <Analysis number 999999
Compound Code 99
Book Reference 9
Project Code 9>
##$TILT= no
##$TM1= 0
##$TM2= 0
##$TOPLEV= 0
##$USERP1= <user>
##$USERP2= <user>
##$USERP3= <user>
##$USERP4= <user>
##$USERP5= <user>
##$WDW= 1
##$XDIM= 32768
##$YMAX_p= 317888607
##$YMIN_p= -60671
$$ End of Bruker specific parameters
$$ ---------------------------------
##NTUPLES= NMR SPECTRUM
##VAR_NAME=  FREQUENCY,     SPECTRUM/REAL,   SPECTRUM/IMAG
##SYMBOL=    X,             R,               I
##VAR_TYPE=  INDEPENDENT,   DEPENDENT,       DEPENDENT
##VAR_FORM=  AFFN,          ASDF,            ASDF
##VAR_DIM=   32768,         32768,           32768
##UNITS=     HZ,            ARBITRARY UNITS, ARBITRARY UNITS
##FACTOR=    0.157963299565203, 1,           1
##FIRST=     4115.83692817386, 0,            0
##LAST=      -1060.14650867915, 0,           0
##MIN=       -1060.14650867915, -60671,      0
##MAX=       4115.83692817386, 317888607,    0
$$ Real data points
##PAGE= N=1
##DATA TABLE= (X++(R..R)), XYDATA
$$ [...]
19044B910K691J999p317j4377K871Q049O397J3043Q455j5023p704P111R82r40
19030I147r507P435K790L549o765N009J3863P109p079k3547j1787K261J9392J7343
19016B9213r219L628q832r256l612K977K583j6647n836O250P077Q121J6058N983
19002B8488j451j022R116j2911K389L760o291q811p926n311O750J4911k224j0944
18988H523j1132p258m296M643J8105J3149j3092k7707J564J0784J1357m135n407
18975d902k927j518l093O260K421n76m897M277L585l378l996j664j893P894M420
18960A3M883Q128k599k149j2099l004J8256M898J4386O114j9708j8880m537k683
18946h981j47J1441J3982q883j752Q752l911o924Q408n080N958k532j2146N571
$$ plain form
19044 2910 5601 7600 283 -14094 -11223 -3174 3223 16266 24721 9698 1994 9105 10087 9147
19030 9147 -360 7075 9865 13414 6649 11658 25521 32630 25551 2004 -9783 -7522 11870 29213
19016 29213 19994 23622 14790 5534 1922 4899 7482 -9165 -15001 -8751 -1674 6447 22505 28488
19002 28488 27037 26015 35131 22220 24609 28369 22078 13267 5341 30 6780 21691 19467 8523
18988 8523 -2609 -9867 -14163 -9520 8585 21734 8642 -19065 -17501 -6717 4640 505 -4902
18975 -4902 -7829 -9347 -12440 -6180 -3759 -4335 -9232 -4955 -1370 -4748 -8744 -10408 -12301 -4407 13
18960 13 4896 13024 10425 8276 -3823 -6827 11429 16327 30713 36827 17119 -1761 -6298 -8981
18946 -8981 -9128 2313 16295 7412 5660 14412 10501 3577 11985 6905 12863 10331 -1815 3756
18932C756k943m306N744J2925J7557N434j8610l0572j085J7572R934J0285j3196
18919A2495q198o638K647j112O587k528N71J6332p594J08l708Q446N353K725r473
18904A6013L816L362K897q918m123j1580R449P912O409L526p080J565J0451k432
18890C1267j4359k493J9830O475j1824q539J8370K0992J6459K3383L6653N1641
18878A87855L0684L1732L9014O3735O4732K6215P321n110l5758m9418p2220p2447
18866B16335n3513l5483l3671k3139k403j7536n733j2171j4798o746J8852J3393
18854D3387J3057N554o216j2107j5171K501q377k787n712j0602n342O967J800
18841F952L456N876M755j1717O370L202l795K3541Q4k7144j1150r263Q146R58
$$ plain form
18932 3756 813 -3493 2251 15176 32733 38167 19557 -11015 -12100 5472 15406 25691 12495
18919 12495 4297 -2341 306 -806 5781 3253 3824 20156 12562 12670 8962 17408 22761 25486 16013
18904 16013 19829 23191 26088 17170 13047 1467 10916 18828 25237 28763 21683 23248 33699 31267
18890 31267 16908 14415 34245 40720 28896 20357 38727 59719 76178 99561 136214 187855
18878 187855 218539 250271 289285 353020 417752 443967 451288 446178 410420 361002 288782 216335
18866 216335 162822 127339 93668 70529 68126 50590 44857 32686 17888 11142 29994 43387
18854 43387 56444 61998 55782 43675 28504 31005 22628 19841 14129 3527 -1815 5152 6952
18841 6952 10408 16284 21039 9322 15692 18894 15099 38640 38724 11580 430 -8833 -687 271
18827B71J025k625j6739R948L423O786R316l828q382N162J4650O68J3043l818
18813B8900r810j3878q52j0024q396J3166J6140J142p903j73K109r505J2222J6985
18799C0123m953J1719O895k0694k1480p801J413J2770Q378M075o560o175j0364
18786b654j0942J6124K3078l167j0580k326j0821L928N828J7565P446M16J1206
18773D5101J954m757J3974r70J1179J2187L2860K9236L4084j5845n6616m2642
18761E9745o695r729j1206j1421j5234P912J1988m065p967M422J0128o337q858
18748A2683L907n50M898J5529Q395L368N82O835l509J454m668r476o576j8685
18734A4187o657L855M891K15j9j8406j7090q787J9957J2578J1970L779J3065R479
$$ plain form
18827 271 1296 -1329 -18068 -8120 -4697 2089 11405 7577 -805 4357 19007 19675 32718 28900
18813 28900 19090 5212 4360 -5664 -14060 -894 15246 16388 8485 8312 10421 916 13138 30123
18799 30123 25170 36889 43784 23090 1610 -6191 -4778 7992 16370 20445 13885 7710 -2654
18786 -2654 -13596 2528 25606 22439 11859 9533 -1288 2640 8468 26033 33479 33895 45101
18773 45101 47055 42298 56272 55302 66481 78668 111528 140764 174848 159003 102387 59745
18761 59745 53050 43321 32115 20694 5460 13372 25360 21295 13328 17750 27878 21541 12683
18748 12683 16590 16040 20938 36467 44862 48230 48812 55647 52138 53592 48924 39448 32872 14187
18734 14187 7530 11385 16276 16491 16472 -1934 -19024 -27811 -7854 4724 16694 20473 33538 43017
18720D3017j6514j0044L050M724q772O466n550j4773m9Q635k851j0730J002N176
18706B787R131R741j3482R365J3111N187k3185k0023J3627P647j6049j7913J9615
18693d41m265q387l934p299P088J4911J1936R281k812N911l606r928J5574J7659
18679D1688j0935m113j2799l599K572J0117J9953p354j0930l333r467K5916J5363
18666E3079l753j0769r661j1891k97O129j356q275K652J9026J5424l828k9322
18653A7158j9461l297J0658K4085Q96q271j8214Q58O778P227K088n594j1583o863
18639c535j0336J174J3618J1634K377M502R118r399j7454m62K401q274j0366J2697
18625b305J0954L736R22m407j5280L744j225j207N714O058J1698N387K338M669
$$ plain form
18720 43017 26503 16459 19509 24233 15461 21927 16377 1604 1555 10190 7339 -3391 -2389 2787
18706 2787 11918 21659 8177 17542 30653 35840 12655 -7368 6259 13906 -2143 -20056 -441
18693 -441 -4706 -13093 -17027 -24326 -17238 -2327 9609 18890 16078 21989 18383 8455 24029 41688
18679 41688 30753 26640 13841 10242 12814 22931 42884 35530 24600 21267 11800 37716 53079
18666 53079 49326 38557 28896 17005 16708 22837 21481 13206 15858 34884 50308 46480 17158
18653 17158 -2303 -5600 5058 29143 30039 21768 3554 4412 11190 18417 20505 14911 3328 -3535
18639 -3535 -13871 -12697 921 12555 14932 19434 28552 19153 1699 1237 3638 -4636 -15002 -2305
18625 -2305 8649 12385 13307 8900 -6380 -2636 -3861 -5068 646 6704 18402 23789 26127 30796
18611C0796J1599J828j2324M103n364j4367j1249N319P91j336J831J0850n352
18598A7125L991k695P92J8048N176l633k0630p779N451R288J6533N334n538q358
18584C3105l705k511j2383j0161m989P301R941O036J877j326P137j1771r78J2759
18570C0332M873m782k967n288m679L31M99J3179K571j1442j8019o712J221Q257
18556G374N013J525J6694k511l570N463L515j077R734j1014j8909m302R490N839
18542B3264O737K5572R357j7498p052m098r323o989k430Q824Q946J1639L958N311
18528E6218P642J209l6J5905J0728M483L882J8304p060j9906o934j906j8235j1010
18514E3284j1284k45O375l734j3741j520o65J4572M079J316j0570J389L475O222
$$ plain form
18611 30796 42395 44223 31899 36002 30638 16271 5022 10341 11132 9796 11627 22477 17125
18598 17125 21116 18421 19213 37261 42437 38804 18174 10395 15846 25134 41667 47001 41463 33105
18584 33105 29400 26889 14506 4345 -644 6657 16598 22634 24511 23185 30322 18551 17573 30332
18570 30332 35205 30423 27456 22168 17489 17820 18319 31498 34069 22627 4608 -2104 -883 7374
18556 7374 12387 13912 30606 28095 24525 29988 33503 32426 42160 31146 12237 7935 17425 23264
18542 23264 30001 55573 64930 47432 40380 36282 26959 19970 17540 26364 35310 46949 50907 56218
18528 56218 63860 65069 65033 80938 91666 96149 100031 118335 111275 91369 84435 82529 64294 53284
18514 53284 42000 41755 48130 44396 30655 29135 28470 43042 47121 48437 37867 39256 42731 48953
18500D8953O029q571n013J3528Q616n577o930n252k616r212l531N318J3370J429
18486E0541J4587M31p463n495q779r235P62Q505O412J1979K144j2426j2632j543
18472C7788N615m802j2795Q937K0327J4737m175k227N378J0189m490j5812p000
18459E1670k896n46L268n525p655j1130J2447J4875j1086p242q417J373K4091
18446E3227J3823l731p466k245j0790r357M67J9760Q589p645k844l883R195J3812
18432G0912J5177P998j0334j0755P06Q752l915j2765m363j488J0547K2010k191
18419I0291j8566j0514K693L380l493L188j2999n005n06k642j250J2279J8208
18406G5064J0597N762n775K15N715J5193L396r735Q769R422j2914o640j806o062
$$ plain form
18500 48953 54982 46411 41398 54926 63542 57965 51035 45783 43167 33955 30424 35742 49112 50541
18486 50541 65128 65559 58096 52601 43822 34587 35349 43854 50266 62245 64389 51963 39331 37788
18472 37788 43403 38601 25806 34743 55070 69807 65632 63405 68783 78972 74482 58670 51670
18459 51670 48774 48228 51496 45971 38316 27186 39633 54508 43422 36180 27763 29136 53227
18446 53227 67050 63319 55853 53608 42818 33461 33928 53688 62277 54632 51788 47905 57100 70912
18432 70912 86089 94087 83753 72998 73704 82456 78541 65776 61413 59925 70472 92482 90291
18419 90291 71725 61211 63904 67284 63791 66979 53980 48975 48469 45827 44577 56856 75064
18406 75064 85661 91423 85648 85863 91578 106771 110167 100432 109201 118623 105709 99069 97263 91201
18392I1201n840J3874M443l519l454O973k17k348p398P820M81k36P523Q674J0444
18377A28421p998j2659p6m23N284j922k760J1087J1347R49j0603n483J7682J7551
18363A50397n223J4438k344q308j12R11J2313J450p040j0601K357J0253K1302
18350A79793l424l359p617J4367P606m537P224Q974N043J6158L653N585O803N719
18336B41988O370j623j9130K54q95Q495J2059J4601L454L575J0636r73M311K3269
18322C06391J1089J307J5455Q966L303J2810K0461J9644K7729J4659J5124K5403
18310D82341J9431K1137K9965M0415L5713K7174L5537L4720N6787O2740N7827
18299I03787N2123N5952Q6935J13777J58969J58496J71368J74312J82435J84833
$$ plain form
18392 91201 85361 99235 103678 100159 96705 103678 103461 101113 93715 101535 102016 101780 109303 117977 128421
18377 128421 120423 107764 107688 107265 112549 110627 107867 118954 130301 131250 120647 115164 132846 150397
18363 150397 145174 159612 157268 148960 148848 149759 162072 163522 156482 145881 148238 158491 179793
18350 179793 176369 173010 165393 179760 187366 182829 190053 199027 204070 220228 223881 229466 236269 241988
18336 241988 248358 246735 227605 227859 226964 235459 247518 262119 265573 269148 279784 278811 283122 306391
18322 306391 317480 318787 334242 343208 346511 359321 379782 399426 427155 441814 456938 482341
18310 482341 501772 522909 552874 593289 629002 656176 691713 726433 783220 845960 903787
18299 903787 955910 1011862 1098797 1212574 1371543 1530039 1701407 1875719 2058154 2242987
18289B242987J86859K04063K23814K25628K72944L46211M67328O28774Q84142
18280E682750J293378J853074K631981L648746M833451O072788P348370Q505652
18272D1870190R424825R841395R426570P604400M914435M08662m519285q250850
18264G0720342j1812322j2632366j1777842j0007631p405296n103365l295255
18257H686265k076544j352090q97034o11848m23560l01321k36892j81990j29455
18248B475531j18645j30467j25039j50152j82008j88884j82566j70873j49151
18239A077746j21506r7062o3713l2946m9732o4440m5696m7189n6661m9364l2996
18228D16441l9457k8967o836j5045l927j2149k1526k1182j8363J077k58k842k1479
$$ plain form
18289 2242987 2429846 2633909 2857723 3083351 3356295 3702506 4169834 4798608 5682750
18280 5682750 6976128 8829202 11461183 15109929 19943380 26016168 33364538 41870190
18272 41870190 51295015 61136410 70562980 78167380 83081815 83490477 78971192 70720342
18264 70720342 58908020 46275654 34497812 24490181 17084885 11981520 8686265
18257 8686265 6609721 5257631 4360597 3748749 3325189 3023868 2786976 2604986 2475531
18248 2475531 2356886 2226419 2101380 1951228 1769220 1580336 1397770 1226897 1077746
18239 1077746 956240 859178 795465 762519 712787 648347 602651 555462 498801 449437 416441
18228 416441 376984 348017 341181 326136 322209 310060 288534 267352 248989 250066 249808 246966 225487
18215B25487j3499j5672k5534j1782j5434j5269j1923J5298J8976J214j7179N679
18203A40362m454j5127L405K983o726j4664r379k923o99p99J7242K5468J9853
18190A54542P692r89o411m390r843k2647l657j901J051n605p52M223M235N634
18176A21182J6647J716O97K433R453j0119j7130K431k249k8086j3335O878q727
18163H1791N892M207l14n840K737O162M661O331J5464J4555p845J503R046R032
18149A47382P177J7788Q648j1415P193J6089j173l455O123K628J9105J4654j0646
18136B20098m783K1486R093J6046K1374K536K0981L8625K9632K7803L1404L3137
18124D67432N5804P0740P6704J14679J78463K28103K96654M09935O77622J146134
$$ plain form
18215 225487 211988 196316 170782 159000 143566 128297 116374 131672 150648 151862 134683 140362
18203 140362 135908 120781 124186 127169 120443 105779 96400 93477 92778 91979 109221 134689 154542
18190 154542 162234 161245 154834 150444 140601 117954 114297 112396 113447 107842 107090 111313 115548 121182
18176 121182 137829 139545 140242 142675 152128 142009 124879 127310 125061 96975 83640 90518 81791
18163 81791 87683 91890 91576 85736 88473 94635 99296 105627 121091 135646 127801 129304 138350 147382
18149 147382 154559 172347 180995 169580 176773 192862 191689 188234 194357 196985 216090 230744 220098
18136 220098 215315 236801 245894 261940 283314 285850 306831 345456 375088 402891 434295 467432
18124 467432 523236 593976 670680 785359 963822 1191925 1488579 1898514 2576136 3722270
18114C722270J669917K220836K540853K385308J828815J811755L421266N705604
18106B5306624K504152p273850r163740m964165k355086j266392p76547n08027
18098A502969l09103k08266j60161j33644j08037o6239n2334k2044m2831m6209
18088C54101l8068l1579k2043j9403k7681j7424k6465k1948j4178n716j4129m2449
18076G3018p593p52r031J0092q916j5438o967j2326p996J627J5338Jn407J0483
18062C6133n498M260o314m823N283L833R207Q480J8075N958L158K1065N815j3128
18048I1504k1828k1121M60J5405r681J661m533l474j3722r298J501j5021m772
18035G081K249Q767p063p707Q065j597p030N941P835P494M848L235j2057j9412
$$ plain form
18114 3722270 5392187 7613023 10153876 12539184 14367999 16179754 19601020 25306624
18106 25306624 27810776 20536926 11373186 6409021 4053935 2787543 2010996 1502969
18098 1502969 1193866 985600 825439 691795 583758 517519 465185 443141 400310 354101
18088 354101 316033 284454 262411 243008 215327 197903 171438 149490 135312 129596 115467 73018
18076 73018 65425 64673 55642 65734 56818 41380 34413 22087 14091 15718 31056 31057 25650 36133
18062 36133 30635 34895 28581 23758 29041 32874 42081 50561 68636 74594 77752 98817 104632 91504
18048 91504 69676 48555 49015 64420 54739 56400 51867 48393 34671 25373 26874 11853 7081
18035 7081 9330 18097 11034 3327 11392 9795 2765 8706 16541 24035 28883 32118 20061 649
18021F49J452J6072N283o066j881p573M631n352m154o721o216J9254K636R388
18007B1402P790M116j2054L422N011q858M150l593P384J3845P309o919Q0j524
17993D1561L591J9187J0982R295N114n139p257J615J0962M198L115K661N339m444
17979A00780r846p667k5786j3835q745p784K48R901o89k440m328M655Q49q460
17965B6853j9743k7228J6443L758j5192k479P178J2798J3953J8218J1075N698
17953E1332M558j415l79N770O34K36M940L29r501q554p268M101M068o88L442r354
17937D2251J1097M686J914j1212o204L09j23R73q018j954J953n403N548m328j2976
17922A8513J0235P446r224n147L44J3877Q673o372p683j409j1484j2570K881J2900
$$ plain form
18021 649 2101 18173 23456 17390 15509 7936 12567 7215 3061 -3660 -9876 9378 12014 21402
18007 21402 29192 33308 21254 24676 29687 20829 24979 21386 28770 42615 49924 43005 43085 41561
17993 41561 45152 64339 75321 84616 89730 84591 77334 78949 89911 94109 97224 99885 105224 100780
17979 100780 90934 83267 57481 43646 34901 27117 27365 37266 36577 34137 29809 34464 35313 26853
17965 26853 7110 -20118 -3675 83 -15109 -17588 -10410 2388 16341 34559 45634 51332
17953 51332 55890 54475 54096 59866 60500 60736 65676 66005 56504 47950 40682 44783 48851 48163 51605 42251
17937 42251 53348 58034 59948 48736 42532 42841 42718 43691 35673 33719 35672 30269 35817 31489 18513
17922 18513 28748 36194 26970 21823 22167 36044 44717 38345 30662 29253 17769 5199 8080 20980
17908B0980O814J2869J060j8137j1067L191J2212J2050l879j908J5625J1346r734
17895E1422j2201P365Q436P798O177m457k22o23K227J0497J3986L2771K4514j3520
17881A34170k2816l453J3611O960k5370k2815k6566l0507k553J2673j9329j4430
17869d25L849J614l074K774J1494J634L458J2421K791P081r202j2193j592o606
17855A4024j6849m670O133Q68R650Q5l840J0165N832J1880J8938r479j678J5827
17841E6886O485j6400j4101P970k115j4291r313Mj582j506r435j7736P820J2538
17827E224j5657l737r36m483N215N099J9250M813j910n558j4654l148J4436K0105
17813B4059j3579o39RK633j4758O836q946p685M592o479o720J1882R128O763N524
$$ plain form
17908 20980 27794 40663 41723 23586 12519 15710 27922 39972 36093 34185 49810 61156 51422
17895 51422 39221 46586 55022 62820 68997 64540 64318 63695 65922 76419 90405 123176 147690 134170
17881 134170 111354 107901 121512 128472 103102 80287 53721 23214 20661 33334 14005 -425
17869 -425 3424 5038 1964 4738 16232 17866 21324 33745 36536 43617 34415 22222 20630 14024
17855 14024 -2825 -7495 -1362 -494 9156 9241 5401 15566 21398 33278 52216 42737 41059 56886
17841 56886 63371 46971 32870 40840 38725 24434 15121 15125 13543 12037 2602 -15134 -7314 5224
17827 5224 -10433 -14170 -15106 -19589 -14374 -9275 9975 14788 12878 7320 -7334 -10482 3954 24059
17813 24059 10480 9841 9850 12483 -2275 4561 -4385 -12070 -7478 -13957 -20677 -8795 333 7096 12620
17798A2620O57m931J634N300j2121l976q959j322P864q3j2222m915r499p083J0695
17783b6341J0557k063R128R340L498M521j2638N405K650q780l569J362m83P898
17769D85R227m041j0635N326k940j3876N439P966O194n908q707o509Q732J2351
17755C104J7199M163j2147k0173j7280Q035r450j154J6650J9661j695j3395r490
17742a5972q293j0613O627P076L357L048m115m486M480J5797K6911k826k1876
17729h85j2607L18P223l869J672k123N92o919M500J9045o981J621O140k69n052
17714B406m16k3682M447J5328m174j5637k381J0597r724J0838Q776m980q332o231
17700b3165J031o066K3570J416j7973J6779l085p82N263k319q999j052J094J4076
$$ plain form
17798 12620 13277 8346 9980 15280 3159 -817 -9776 -11098 -3234 -3317 -15539 -20454 -29953 -37036 -26341
17783 -26341 -15784 -17847 -8719 621 4119 8640 -3998 1407 4057 -4723 -8292 -6930 -7413 485
17769 485 9712 5671 -4964 362 -2578 -16454 -11015 -3049 3145 -2763 -11470 -17979 -9247 3104
17755 3104 20303 24466 12319 -7854 -25134 -17099 -26549 -27703 -11053 8608 6913 -6482 -15972
17742 -15972 -24265 -34878 -28251 -21175 -17818 -14770 -18885 -23371 -18891 -3094 23817 20991 -885
17729 -885 -13492 -13174 -5951 -9820 -8148 -10271 -9679 -16598 -12098 6947 -34 1587 7727 7458 2406
17714 2406 1990 -21692 -17245 -1917 -6091 -21728 -24109 -13512 -23236 -12398 -3622 -8602 -16934 -23165
17700 -23165 -22134 -28200 -4630 -3214 -21187 -4408 -7493 -8275 -3012 -5331 -14330 -15382 -14288 -212
17686b12m899m070M818R102j0750j5775o667K1158J8475n581n740o534o777l326
17672a6778Q788P444J2895J9224J5469M500K532K4525K4952K5242J6464L1311
17660A76568N1082M1187N6538M0924L2717J8009j0689k6622n4104n0744o2581
17649B12285p3627m7210k4925j4738k1120k2434l722J1611k660l572j6505K69
17637f348O035J0479J932j3593n806J2007r122p304j146k742M996J3627l916r026
17623i927p558j562k024k819J68k072M8r403r661J421J8008Q047P633M820l130
17608h011l188M84j3841K661N39J719R731K96L348J1099R333j2186k6355l830
17594b8201J7859O012m897J192O118J4917L899j3155o305R462n44j9658k4608
$$ plain form
17686 -212 -5111 -9181 -4363 4739 -6011 -21786 -28453 -7295 11180 5599 -141 -6675 -13452 -16778
17672 -16778 -7990 -546 12349 31573 47042 51542 54074 78599 103551 128793 145257 176568
17660 176568 227650 268837 325375 366299 399016 417025 406336 379714 325610 274866 212285
17649 212285 138658 91448 66523 51785 30665 8231 4509 16120 13460 9888 -6617 -6348
17637 -6348 -313 10166 12098 -1495 -7301 4706 -4416 -11720 -12866 -15608 -10612 3015 -901 -9927
17623 -9927 -17485 -19047 -21071 -23890 -23722 -25794 -25746 -35149 -44810 -43389 -25381 -17334 -9701 -4881 -8011
17608 -8011 -11199 -10715 -24556 -21895 -21356 -19637 -9906 -9610 -6262 4837 14170 1984 -24371 -28201
17594 -28201 -10342 -4330 -9227 -8035 -1917 13000 16899 3744 -2561 6901 6357 -13301 -37909
17581c7909K110R277l081K798o793L024J1993K819R878J7492K370j8658m095J1276
17567B501j809k3028m732J5823L232k170m503p938m359j2245l114P197j2249n730
17553e3124J1590J0111O434n160J399P876L656J7665M446j3260j701M092j9035
17540b5011r867J5778O155j1567p800N70P277Q144K396J719m248Q072J3393Q98
17526E909r210l429k4529j3958J0920Q92j6036K488M982j5216R070K2004J2634
17513a3479N726N870n088L93M352l376m317j969o247J5503J5947k3776j6978n822
17499c3261P259N663O8R311m124o647J1687J3586k259j2322l570J0510k452n454
17485a2005j4713m071M443J1667Q852m574L447L884L964P366J1363o259j1752
$$ plain form
17581 -37909 -35799 -26522 -29603 -26805 -33598 -30574 -18581 -15762 -5884 11608 13978 -4680 -8775 2501
17567 2501 692 -22336 -27068 -11245 -8013 -10183 -14686 -22624 -26983 -39228 -42342 -35145 -47394 -53124
17553 -53124 -41534 -31423 -24989 -30149 -28750 -20874 -17218 447 4893 -8367 -10068 -5976 -25011
17540 -25011 -34878 -19100 -12945 -24512 -32312 -31742 -24465 -16321 -13925 -12206 -16454 -8382 5011 5909
17526 5909 -3301 -6730 -31259 -45217 -34297 -33405 -49441 -46953 -41971 -57187 -48117 -26113 -13479
17513 -13479 -7753 -1883 -6971 -6578 -2226 -5602 -9919 -11888 -18135 -2632 13315 -10461 -27439 -33261
17499 -33261 -26002 -20339 -20271 -10960 -15084 -21731 -10044 3542 1283 -11039 -14609 -4099 -6551 -12005
17485 -12005 -26718 -30789 -26346 -14679 -5827 -10401 -6954 -3070 894 8260 19623 13364 1612
17472A612j4741j2846k37j218o508O711J5572J06j335M751J0839L197p855j5551
17458a7503Q962J8349r685L532l915o855L216M367K886p140J984J1116K1280K2294
17444E2888J1738J1136K3004L2559K0871l1120m6142k1227k6509l019o624o8r859
17431G628k2038M469J6321P146L637r079n568o518k796P515j0157O091P981K814
17417G446L077j3760p412j1837o670r66R967N591Q100K798j8050o599R95l33L796
17402b3857N009j8558j4821J3527J8291J4040N10K765Q08J665J33r324o656J5262
17388a206o57k474P491J0937J15m383j2908j7172N995%M917R433J261p086p280
17373a3017o031q436m836L251J3033K6214L495j8327j7031o11R158j4157O357
$$ plain form
17472 1612 -13129 -25975 -26212 -27430 -33938 -27227 -11655 -11549 -12884 -8133 2706 5903 -1952 -17503
17458 -17503 -8541 9808 123 3655 -260 -7115 -3899 468 3354 -3786 -1802 9314 30594 52888
17444 52888 64626 75762 98766 131325 152196 121076 74934 53707 27198 24179 17555 17487 7628
17431 7628 -14410 -9941 6380 13526 17163 8084 2516 -4002 -6798 717 -9440 -3349 4632 7446
17417 7446 10523 -3237 -10649 -22486 -29156 -30122 -20155 -14564 -6464 -3666 -21716 -28315 -27320 -27653 -23857
17402 -23857 -18848 -37406 -52227 -38700 -20409 -6369 -5859 -3094 -2286 -621 -488 -9812 -16468 -1206
17388 -1206 -1863 -4337 3154 14091 14206 9823 -3085 -20257 -14262 -14262 -9345 88 1349 -5737 -13017
17373 -13017 -19048 -27484 -32320 -29069 -16036 10178 13673 -4654 -21685 -22296 -13138 -27295 -20938
17360b0938J4519l003j047o004o033K989J9864O294L491j646j981P142j0409j7612
17346a4374q200k348J5021K6501O595j4253p34m077N36J4352o888o278q625m955
17332g727Q60L682R851Q960k0398j565P120M921P32K415O411n031J776q307k2893
17317a9193n634J0998J528J0186N40j5342k6353P607J2674k251J4454q015j8974
17304c7775J974K974m51O284J5329L96j8Q173j241j822j5936r16L355J2839R859
17289C024L312m684j038O078p603j9177j4753q382j070J171J6490J4116q982N172
17275a6326l608L437J1451l195M066j811l172L873k436m329J3816j302p410k360
17261i306O633Q348J2757M476j2863j3784K516j5027M011P272p590P283m036m824
$$ plain form
17360 -20938 -6419 -9422 -10469 -16473 -22506 -19517 347 6641 10132 8486 6505 13647 3238 -14374
17346 -14374 -22574 -24922 -9901 16600 23195 8942 8208 4131 4667 19019 12131 5853 -2772 -7727
17332 -7727 -6867 -3185 6666 15626 -4772 -6337 783 5704 6436 8851 15262 10231 12007 3700 -19193
17317 -19193 -24827 -13829 -12301 -2115 -1575 -16917 -43270 -35663 -22989 -25240 -10786 -18801 -37775
17304 -37775 -35801 -32827 -33278 -26994 -11665 -11269 -11287 -3114 -4355 -6177 -22113 -23029 -19674 -6835 3024
17289 3024 6336 1652 614 6692 -911 -20088 -34841 -43223 -44293 -43122 -26632 -12516 -21498 -16326
17275 -16326 -19934 -16497 -5046 -8241 -4175 -5986 -9158 -5285 -7721 -12050 1766 464 -6946 -9306
17261 -9306 -2673 5675 18432 22908 10045 -3739 -1223 -16250 -12239 -4967 -12557 -5274 -9310 -14134
17247a4134M520J0181l920N131j94J3032R446J984j1434r683q878J6001m363j6309
17233h620l088n592M485Q794R451n152N58L852j1804k175K2892r496n993n640
17219g528q21q919L571K124p592J2951P36j7793q487K612K0309o316j4832n492
17205c5477o155O598J2893J1306j7k678J222K832M870j454P057P257l554j866
17191B834K786k666K66o126m258R980L173j0065l617l512n298J815J4290n478
17177e876N428K001m431l391r627j1679K52J4688M937N580q964r770j3192J5140
17163a8904J1320L387J2240j0953l252K1308J9453J94r948L26j7838j3178m200
17150a0045J0198M520q981n43j1396P43K54J2192O352q355l624q091j0211l013
$$ plain form
17247 -14134 -9614 567 -3353 1778 1584 14616 24062 26046 14612 4929 -3949 12052 7689 -8620
17233 -8620 -11708 -17300 -12815 -4021 5430 278 836 4688 -7116 -9291 13601 4105 -1888 -7528
17219 -7528 -8349 -17268 -13697 -11573 -19165 -6214 -5478 -23271 -31758 -29146 -8837 -15153 -29985 -35477
17205 -35477 -41632 -35034 -22141 -10835 -10852 -13530 -12308 -9476 -4606 -6060 997 8254 4700 2834
17191 2834 5620 2954 3220 -2906 -7164 2816 5989 -4076 -7693 -11205 -16503 -14688 -398 -5876
17177 -5876 -448 1553 -2878 -6269 -15896 -27575 -27323 -12635 -7698 -2118 -11082 -20852 -34044 -18904
17163 -18904 -7584 -4197 8043 -2910 -6162 15146 34599 34793 24845 25171 7333 -5845 -10045
17150 -10045 153 4673 -4308 -4851 -16247 -15504 -15250 -3058 3294 -5061 -8685 -16776 -26987 -30000
17136c0000j695J7894m817o450J406K623o572K855M161J3197J0744r025k0387
17123b6066J064j24o587p854J3732K4004l069P435k498j8220j3529l671j677J6157
17109b0903N38j2710P996J3052K0223m682n834j2224r609Q000R611k438K400M868
17095a712J490N763l821j2818M599N425J480J865j0400q293O67J367O71k607R738
17080f586J173j1950K872M217n71N89p720n296N399k896L220j546R62o975L38
17065b4770o82N799l96j1469j615m181J0621K6792j965k805J606k756p347r25
17051a4093k486N334J2577J4851k36r757j4506j950N561M728n313j0045j0572
17038b5907j941M544K3306K508j567J0188J5006Q19J51j1759j2467j3546j5059
$$ plain form
17136 -30000 -31695 -13801 -18618 -25068 -23662 -21039 -27611 -24756 -20595 -7398 3346 -5679 -26066
17123 -26066 -25002 -25126 -31713 -39567 -25835 -1831 -4900 2535 37 -18183 -31712 -35383 -37060 -20903
17109 -20903 -20365 -33075 -25079 -12027 8196 3514 -2320 -14544 -24153 -16153 -6542 -8980 -6580 -1712
17095 -1712 -222 5541 1720 -11098 -6499 -1074 406 2271 -8129 -16422 -15755 -14388 -13717 -16324 -6586
17080 -6586 -5413 -17363 -14491 -10274 -10845 -10256 -17976 -23272 -17873 -20769 -17549 -19095 -18133 -25108 -24770
17065 -24770 -25452 -19653 -20049 -31518 -33133 -37314 -26693 99 -1866 -4671 -3065 -5821 -13168 -14093
17051 -14093 -16579 -11245 1332 16183 15947 6190 -8316 -10266 -4705 23 -5290 -15335 -25907
17038 -25907 -27848 -23304 2 2510 943 11131 26137 26956 27107 15348 2881 -10665 -25724
17025b5724q02m100m411J1844J1323L625m596J5605R429R06p738n616j7124r145
17011b6524J847R152K300L547j0943O237J6186J494n051n473J1929J933j3070
16998f436J547J5415J566j528O857j1235k2457J4357m61r889k0763N638L194j594
16984b5789K496P690R851r04N216O325j006K682R449j5159j102o96o213j470l067
16969a1697l290R510K115r797R43k13k219N641m273N279J824p802L933p924j535
16954a9505J8102K4539l983r279j4811k4392O675J7021o122n882R680L804j9097
16941b3250N8l768N629N316r159J0994O542N234m378l750j4994n312J4188J4573
16927b077m734k10O69n557N915J4813J595j8391j6208m545n140r6J6051J9185
$$ plain form
17025 -25724 -26526 -30626 -35037 -23193 -11870 -8245 -12841 2764 12193 13099 5361 -255 -17379 -26524
17011 -26524 -24677 -15525 -13225 -9678 -20621 -14384 1802 3296 -1755 -7228 4701 6634 -6436
16998 -6436 -4889 10526 12092 10564 17421 6186 -16271 -1914 -2375 -12264 -33027 -27389 -24195 -25789
16984 -25789 -23293 -15603 -5752 -6656 -1440 4885 3879 6561 16010 851 -251 -947 -7160 -8630 -11697
16969 -11697 -14987 -5477 -3362 -13159 -12216 -12429 -14648 -9007 -13280 -8001 -6177 -13979 -10046 -17970 -19505
16954 -19505 -1403 23136 19153 9874 -4937 -29329 -22654 -5633 -11755 -17637 -7957 -4153 -23250
16941 -23250 -23192 -26960 -21331 -16015 -25174 -14180 -7638 -2404 -6782 -10532 -25526 -30838 -16650 -2077
16927 -2077 -6811 -7021 -6352 -11909 -5994 8819 10414 -7977 -24185 -28730 -33870 -33966 -17915 1270
16913A270o857m201N009p373m939J1352R452L568n948J259M488J324m180O433
16899A0657j0354j962K769l920p232k470j0082Q060J436L0648N181l3955r742
16886b0966L324j0623l165J0854K970j2996k230Q427K3855P858J1828p790j3522
16873b176j310o949k888j2575J818J5039L86P48R582P660L08o093o541Q690m896
16858H03J791K633j4593J22M09l288Q240R577q23r924j4525J5689L433k0691K269
16843a8878M964n001K57j562j24r06n76J14l124K879r718M161J3544J170j518
16828a4318J7763m512J0299O828j5405n269l325k962N134l057R569O272N394n246
16814G165j3104j961j4068l516N975M039J7648J2131Q747J013j3382K06P719N23
$$ plain form
16913 1270 -5587 -9788 -4779 -12152 -17091 -5739 3713 7281 1333 2592 7080 8404 4224 10657
16899 10657 303 -1659 1110 -2810 -10042 -12512 -22594 -14534 -13098 17550 22731 -11224 -20966
16886 -20966 -17642 -28265 -31430 -20576 -17606 -30602 -32832 -24405 -550 7308 19136 11346 -2176
16873 -2176 -3486 -10435 -13323 -25898 -24080 -9041 -8655 -7907 1675 9335 9643 3550 -2991 5699 803
16858 803 2594 5227 -9366 -9244 -8835 -12123 -3883 5694 4871 -5053 -19578 -3889 -456 -21147 -18878
16843 -18878 -13914 -18915 -18658 -20220 -20344 -21250 -21826 -21712 -24836 -21957 -31675 -27514 -13970 -12800 -14318
16828 -14318 3445 -1067 9232 16060 655 -4614 -7939 -10901 -5767 -8824 745 7017 12411 7165
16814 7165 -5939 -7900 -21968 -25484 -19509 -15470 2178 14309 23056 24069 10687 10893 18612 19135
16800A9135k765l268l782K027J530P708j616j8118l193J4108J600J1226j4046
16787A0546J1131K417l809J426j813p097j6176j2853R597P953k200j0181M448
16774f611o033J2095M506j6646n471J3674K302m023l619l251k264n115l864M754
16760a9566R704J5528Q951k6611j0254Q067k568M667J1901n176k2273k599J6262
16747a3967q222r431P055L2574J0208j5478m424O338j1j506q242P803J3069J334
16733A7100o91l622m015L52K712j0971r029q685L6J4242J508j4574l446O695K757
16718i631j2847J2916J650p421J0979K846q147n602Q179J327Q820R685L172j5446
16704D80k3422N963J5130J4210k577j7150j086k248j650J165P382J0570r58q496
$$ plain form
16800 19135 16370 13102 9320 11347 12877 20585 18969 851 -2342 11766 13366 24592 10546
16787 10546 21677 24094 20285 21711 19898 12801 -3375 -16228 -6631 1322 -878 -11059 -6611
16774 -6611 -12644 -549 3957 -12689 -18160 -4486 -2184 -6207 -9826 -13077 -15341 -20456 -24320 -19566
16760 -19566 -9862 5666 14617 -11994 -22248 -14181 -16749 -12082 -181 -5357 -27630 -30229 -13967
16747 -13967 -22189 -31620 -24565 8009 18217 2739 -1685 4653 4642 3136 -5106 2697 15766 17100
16733 17100 16409 12787 8772 9124 11836 865 -8164 -16849 -16813 -2571 -1063 -15637 -19083 -12388 -9631
16718 -9631 -22478 -9562 -7912 -15333 -4354 -1508 -9655 -15257 -7078 -5751 3069 12754 15926 480
16704 480 -22942 -16979 -1849 12361 9784 -7366 -8452 -10700 -12350 -11185 -3803 6767 5809 -2687
16690b687l481K963R555q469o633M286K292j0705k90R052j952P767N576K10p05
16675F779p357k18M314L897j0193J0304k283r245j0639m261m871K269m264j1375
16661c7143O172J5206R164r80l746M153Q476P36p515K95K7976N821j6676k4825
16647a2886n949O115J0264o622L919Q841Q140L783m138J0573j1217o348p993K100
16633a418K704k173q28r063P876J468j0081K220J4640j370j8191R838J4438j3770
16619c710j7399j2418J6000J6826p216p460p502P846J1199k988k043Q157m403
16606e111j4677k226R185L952J670K121J2323J5989j768p74o90m843k199j2044
16592I08m14l076L143J5471J1634j1021l788n725K003O887k310N032j1140J2830
$$ plain form
16690 -2687 -6168 -3205 6350 -2119 -8752 -4466 -2174 -12879 -13169 -4117 -6069 1698 7274 7484 6779
16675 6779 -578 -796 3518 7415 -2778 7526 5243 -4002 -14641 -18902 -23773 -21504 -25768 -37143
16661 -37143 -30971 -15765 -6601 -7581 -11327 -7174 1302 2038 -5477 -5182 22794 28615 11939 -12886
16647 -12886 -18835 -12720 -2456 -9078 -5159 3682 11822 15605 11467 22040 10823 4475 -3518 -1418
16633 -1418 1286 -887 -1715 -10778 -2902 -1434 -11515 -9295 5345 3975 -14216 -4378 10060 -3710
16619 -3710 -21109 -33527 -17527 -701 -7917 -15377 -22879 -15033 -3834 -6822 -8865 -708 -5111
16606 -5111 -19788 -22014 -12829 -8877 -7207 -5086 7237 23226 21458 20684 19994 15151 12952 908
16592 908 494 -2582 561 16032 27666 16645 12857 7132 9135 16022 13712 18744 7604 20434
16578B0434J2584O412m744r529k0852j4743J0113J339L38J603J9725J1549q368
16565B5861K989j555r25J053q607n625j143p306M582K762M619m560j0120M99M361
16550F885q866J993J5265P676L457L760r877k1660j4609j3515M510Q465M091J1992
16536d33J1687k790J712m240r452k384M333n905r739J721j43r092N203O301j6070
16521b9291q614O042M805L959K416N62P467j459n252j0235N439J3223K446J7212
16507H720k226k804o559q257M38Q212J2010L742j919j0538o962k128m103o881
16493a9255K889J1516j1894m421N586N121P192l871L884J110R718j813n056N629
16479F335m451Q42p721M017J5333o433L94j1170n19J1510Q120j493r936K328J752
$$ plain form
16578 20434 33018 39430 34686 25157 4305 -10438 -325 1014 1352 2955 22680 34229 25861
16565 25861 28850 27295 26370 27423 18816 13191 12048 4742 9324 12086 16705 12145 2025 2524 6885
16550 6885 -1981 12 15277 22953 26410 30170 20293 -1367 -15976 -29491 -24981 -16516 -12425 -433
16536 -433 11254 8464 10176 5936 -3516 -5900 -1567 -7472 -17211 -15490 -15633 -24725 -19522 -13221 -29291
16521 -29291 -37905 -31863 -27058 -23099 -20683 -20121 -12654 -14113 -19365 -29600 -24161 -10938 -8492 8720
16507 8720 6494 3690 -2869 -11126 -10688 -2476 9534 13276 11357 819 -6143 -8271 -12374 -19255
16493 -19255 -16366 -4850 -16744 -21165 -15579 -10458 -3266 -7137 -3253 -2143 7575 5762 706 6335
16479 6335 1884 2726 -4995 -978 14355 7922 8316 -2854 -3373 8137 16257 14764 4828 7156 8908
16464H908p423P840q047m194O811Q05j112o506l465j655j5498q847K052J001K2252
16449g078O783p811j0922k499K855q616K0784R112p923o294P537R04N494m571
16435b245j3972J941J844o775N995q379Q46J0128K88K0034J6226q2j3401k3371
16421a0923j0929J3852N603J0678n140N25J625l615q485k3248N358J8981R151
16408C433N550Q90l03j239j149p314j836N842R040j0057p52J4853L860l506n807
16393A1505R427K964r522q572o04N134j2817K372R332p393j1712N922l126k290
16379i380J5687j1804J127N7L780J059l991r463O245N150r56R481J5855q40j7008
16364D999j0844r004m2Q822k396k575N033N115J178p997O240j7478j76J8951Q805
$$ plain form
16464 8908 1485 9325 1278 -2916 3895 4700 3588 -2918 -6383 -8038 -23536 -32383 -30331 -29330 -7078
16449 -7078 -295 -8106 -19028 -21527 -18672 -27288 -6504 2608 -5315 -11609 -4072 -3168 2326 -2245
16435 -2245 -16217 -14276 -12432 -19207 -13212 -21591 -20745 -10617 -10329 9705 25931 25849 12448 -10923
16421 -10923 -21852 -8000 -2397 8281 3141 3666 5291 1676 -6809 -30057 -24699 -5718 3433
16408 3433 8983 9873 9570 8331 7182 -132 -1968 3874 12914 2857 2105 16958 20818 17312 11505
16393 11505 20932 23896 14374 5802 5198 10332 -2485 -113 9219 1826 -9886 -3964 -7090 -9380
16379 -9380 6307 -5497 -4370 -4313 -533 526 -3465 -12928 -6683 -1533 -2489 6992 22847 22007 4999
16364 4999 -5845 -14849 -14891 -6069 -8465 -11040 -6007 -892 286 -7711 -1471 -18949 -19125 -174 8631
16349H631J2006n79j4463k3366o520J5765J2115Q474j26Q854l774j3492k694J2725
16335A3556J1848j0652j0958l794o876j6782l352Q289J3023J1837n181n760J173
16322c629K927r698j787L788j5860j061J4865J0204j0924m587N645j400j5971
16309b7488j3073Q821J6037O078L580K826L388m143n367R296n470j0464L225r531
16295b2285L699O836J036O896J9664L955j2106j5786o409Q499m565o762N669k529
16281a4188k363J4114n634M430J373N985j1880P500l889M763Q18k0225O851M68
16267a1877J243k513J0878K080L822j5046m437n94P762K981j5095N273R058k404
16253h869O49n912R334l713P063M334j0011q152K115o231o582L925J3891j2967
$$ plain form
16349 8631 20637 20058 5595 -17771 -24291 -8526 3589 12063 11937 20791 17017 3525 831 13556
16335 13556 25404 14752 3794 0 -6876 -23658 -27010 -18721 -5698 6139 958 -4802 -3629
16322 -3629 -702 -10400 -12187 -8399 -24259 -25320 -10455 -251 -11175 -15762 -10117 -11517 -27488
16309 -27488 -40561 -31740 -15703 -9625 -6045 -3219 169 -3974 -9341 -45 -5515 -15979 -12754 -22285
16295 -22285 -18586 -11750 -10714 -3818 15846 19801 7695 -8091 -14500 -6001 -10566 -17328 -11659 -14188
16281 -14188 -16551 -2437 -8071 -3641 -2268 3717 -8163 -663 -4552 211 1029 -19196 -12345 -11877
16267 -11877 -10634 -13147 -2269 -189 3633 -11413 -15850 -16444 -8682 -5701 -20796 -15523 -6465 -8869
16253 -8869 -8220 -14132 -4798 -8511 -1448 2886 -7125 -15277 -13162 -19393 -25975 -22050 -8159 -21126
16239b1126K518M464r72L087k855j0556M223O576J4180K442J6682k342j958P783
16225B2146N164j0410K352j856P792n485n498j2099j6392p918R413K1065L637
16212A1911j40j3477j8996M448K46J512K954L496k098o602L727m25l409R827L035
16197c991o730M945m406N791P861J378J0356j0399n109l675P995R171o903j9503
16183a3219n816J888k316O310Q659l530o481r004J6226J8383P37k53M764K693
16169A9041r844J167j4352k395l049m816n348K800K2236P118O910j1518m224j6992
16155a3266l872L403q837J275O782N145j3286J6394P537R184Q406j0681k7656
16142a9472k3927n362J0691M672Q819q48k945R792N531L787k945o184N936L546
$$ plain form
16239 -21126 -18608 -14144 -15116 -12029 -14884 -25440 -21217 -14641 -461 1981 18663 16321 14363 22146
16225 22146 27310 16900 19252 17396 25188 19703 14205 2106 -14286 -22204 -12791 8274 11911
16212 11911 11771 -1706 -20702 -16254 -16008 -14496 -11542 -8046 -10144 -16746 -13019 -13444 -16853 -7026 -3991
16197 -3991 -10721 -5776 -10182 -4391 3470 4848 15204 4805 -304 -3979 4016 13187 6284 -13219
16183 -13219 -19035 -17147 -19463 -13153 -4494 -8024 -14505 -23509 -7283 11100 11837 11584 16348 19041
16169 19041 9197 10364 -3988 -6383 -9432 -14248 -19596 -16796 5440 12558 19468 7950 3726 -13266
16155 -13266 -17138 -13735 -22572 -21297 -14515 -9370 -22656 -6262 1275 10459 18865 8184 -19472
16142 -19472 -43399 -48761 -38070 -33398 -24579 -25427 -28372 -18580 -13049 -9262 -12207 -18391 -12455 -8909
16128h909r145Q364O331R656K465n609r800l217J8248R255j2032r083n281J5885
16114G128M846j8471p763j0183N032p641J2739K1839q031j4261K323N047K017
16101e379k0019l426L717l869J6821J9636j842j1578J4353J3286N668k1876k8591
16088b3099o572K3624J2316q954n746k137m807P071m449l9J1533o566j3151J11
16074b0865l045J4651j4720k328N351J2163r989j4634K1022K0848q254n205n569
16061a0574k88J3190R75l432k198m646Q479k0977j4795O133k744O786j886j040
16047b7017J8057M621q921q575o111q44P919P346J7802J4155j2092j6588R622
16034f26J9191j459o662j1957m31m004p600j8978R19K1624J650k424M525J119
$$ plain form
16128 -8909 -18054 -9690 -3359 6297 8762 3153 -6647 -9864 8384 17639 5607 -3476 -8757 7128
16114 7128 11974 -6497 -14260 -24443 -19411 -27052 -14313 7526 -505 -14766 -12443 -7396 -5379
16101 -5379 -25398 -28824 -25107 -28976 -12155 7481 5639 -5939 8414 21700 27368 5492 -23099
16088 -23099 -29671 -6047 6269 -2685 -8431 -10568 -15375 -8304 -12753 -12792 -1259 -7825 -20976 -20865
16074 -20865 -23910 -9259 -23979 -26307 -20956 -8793 -18782 -33416 -12394 8454 200 -5005 -10574
16061 -10574 -10862 2328 3303 -129 -2327 -6973 1506 -19471 -34266 -28133 -30877 -24091 -25977 -27017
16047 -27017 -8960 -4339 -13260 -21835 -27946 -28790 -20871 -13525 4277 18432 6340 -10248 -626
16034 -626 18565 17106 10444 -1513 -1944 -5948 -13548 -32526 -31607 -9983 -8333 -10757 -6232 -5113
16020e113J1713K706q663o462j2025l283q237q721O255O677p096J8454J8308p386
16006b873r476J004N75o030J0233k245n940J743n324j2420R754N35k319R261N823
15991g699M881Q387J27R073m9m584j5114j5731j2458Q370M161K995O159L076l199
15976a1605l172j590O609J8060L750j1552j0048l23N37L752N127K044K275q41
15962C023o105j5813j1079J1187N401K077N879J3850R103K531r539n357P61r093
15948c174k5M64j631m520r643Q356j944K149p156R065k081k1229J610Q377K8679
15933G297J0654k4564j4968L773J263O407J1226J5099m776j0806j4839P402j565
15920h397r40J7737M211Q4r443q132J6856Q711j3244J0042J866N314p409j0921
$$ plain form
16020 -5113 6600 9306 643 -5819 -17844 -21127 -29364 -38085 -31830 -25153 -32249 -13795 4513 -2873
16006 -2873 -12349 -11345 -10770 -16800 -6567 -8812 -14752 -13009 -18333 -30753 -20999 -20464 -22783 -13522 -7699
15991 -7699 -2818 5569 5696 14769 14720 10136 -4978 -20709 -33167 -24797 -20636 -17641 -11482 -8406 -11605
15976 -11605 -14777 -16367 -9758 8302 12052 500 -9548 -9871 -9334 -5582 -455 1589 3864 3023
15962 3023 -3082 -18895 -29974 -18787 -13386 -11309 -5430 8420 17523 20054 10515 5158 5919 -3174
15948 -3174 -3199 -2735 -4366 -8886 -18529 -10173 -12117 -9968 -17124 -8059 -10140 -31369 -29759 -21382 7297
15933 7297 17951 -6613 -21581 -17808 -16545 -10138 1088 16187 11411 605 -14234 -6832 -8397
15920 -8397 -9337 8400 12611 12695 3252 -4880 11976 20687 7443 17485 19351 24665 17256 6335
15906F335p858j963J6384j7853o666j0036M580J2073J586L389q043L274J237m008
15892g569J1753N84p568l068Q735k607l681J920P15L095J4460j249j1330j5231
15878a1041K5385O615j2938j0599L412J4967Q448l482p014n691r728K198k31n444
15864e143j157K855N77q638Q87l01M716J5977M326l926p804n811M409n00K775
15849C242o248p614n84P92j644P501m846N009j2800j3680k408K138N284K953q25
15834b3730J249K7879J0841n932p864J5352o274j4071k0129q618J6664J5198j227
15821f62n300J6954o145r88L908L356l791L927n229J897j2621O04J4057L440j82
15806A3225j7862j7744Q355M341o544L085R90j7551O554J8568J8117j5041k7801
$$ plain form
15906 6335 -1523 -3486 12898 -4955 -11621 -21657 -17077 -5004 -3418 -29 -8072 -4798 -3561 -7569
15892 -7569 4184 4768 -2800 -5868 2867 260 -3421 -1501 -786 2309 16769 15520 4190 -11041
15878 -11041 14344 20959 8021 -2578 834 15801 24249 20767 13753 8062 -1666 532 301 -5143
15864 -5143 -6300 -3445 -2868 -11506 -10619 -10920 -6204 9773 14099 10173 2369 -3442 967 467 3242
15849 3242 -3006 -10620 -11204 -10412 -12056 -4555 -9401 -4392 -17192 -30872 -33280 -31142 -25858 -22905 -23730
15834 -23730 -22481 5398 16239 10307 2443 17795 11521 -2550 -22679 -31297 -14633 565 -662
15821 -662 -5962 10992 4847 3859 7767 11123 7332 11259 6030 7927 -4694 -4090 9967 13407 13225
15806 13225 -4637 -22381 -14026 -9685 -16229 -13144 -12154 -29705 -23151 -4583 13534 -1507 -29308
15793b9308P131N35J0177O407l597M729J2551P235L269k129j4361P864Q551p188
15779A1866q697k378j0767j2958j588L762P148n815l539J8451J0603k750j1740
15766h402k827J1376o080o234j3629J3105Q629j936q797n859O57J9008j7103j3457
15752c1549K8366K1129r305J5320J5579o821r322l190j5807M020R594J712j709
15739A8017J162m280k1872j329j1853M33m364O515J3275j8220k3338L24K704J3746
15725b9080K6967J9040q361o233o772n18O688r46j7115n392M15J5343R646L394
15711G076N319m041J3132J0597j4271n518J409k711J186j2317k025n225P576R331
15697I518p730j175J0337k128j230N611J1579k425N863j3745m251j3442N417O053
$$ plain form
15793 -29308 -22177 -21642 -11465 -5058 -8655 -3926 8625 15860 19129 17000 2639 10503 19054 11866
15779 11866 3169 791 -9976 -22934 -24522 -20760 -13612 -19427 -22966 -4515 6088 3338 -8402
15766 -8402 -11229 147 -5933 -12167 -25796 -12691 -4062 -5998 -14795 -20654 -19997 -989 -18092 -31549
15752 -31549 -3183 17946 8641 23961 39540 32719 23397 20207 4400 8420 18014 19726 18017
15739 18017 19179 14899 -6973 -8302 -20155 -19722 -24086 -17571 -4296 -22516 -45854 -45530 -42826 -29080
15725 -29080 -2113 16927 8566 2333 -4439 -4957 1731 785 -16330 -21722 -21307 -5964 3682 7076
15711 7076 12395 8354 21486 32083 17812 12294 13703 10992 12178 -139 -2164 -7389 187 9518
15697 9518 1788 613 10950 8822 7592 13203 24782 22357 28220 14475 10224 -3218 2199 8252
15683H252m044j1687Q01r607J4649J2733k766j81j4932j8748O164L161K61J3868
15669b076k120O956j1864N098J2140j151n485k915k8611j1527Q934J1718J9912
15656i91Q660O851q54j3757j003J4372O540N383j996n105m639J0552l575k3661
15642c223j2970K117P418o113p791J8224J2515k2944j0365M530L302Q808j6270
15629b2762k593j575R358R56m510P002M976K002K092r520j7760j084J3076j5648
15615c5990P460J3904J2596R01j515p751O328L240J367j7193O23J0366J770J1817
15601G923M365j5753J0920J3836n322o287P527l291l624Q208k0407j5547N85J3250
15587c617j36r791J0669L958j4694n25M041p954m317J18o029J912J172K485k297
$$ plain form
15683 8252 4208 -7479 -6678 -16285 -1636 11097 8331 8150 -6782 -25530 -19366 -16205 -15944 -2076
15669 -2076 -4196 2760 -9104 -4006 8134 6983 1498 -1417 -30028 -41555 -32621 -20903 -991
15656 -991 7669 14520 13666 -91 -1094 13278 19818 25201 23205 18100 13461 24013 20438 -3223
15642 -3223 -16193 -14076 -6658 -12771 -20562 -2338 10177 -12767 -23132 -18602 -15300 -6492 -22762
15629 -22762 -25355 -26930 -17572 -16616 -21126 -14124 -9148 -7146 -5054 -14574 -32334 -33418 -20342 -35990
15615 -35990 -28530 -14626 -2030 -1129 -2644 -10395 -4067 -827 540 -16653 -16030 -5664 -3894 7923
15601 7923 12288 -3465 7455 21291 15969 9682 17209 13918 10294 18502 -1905 -17452 -16867 -3617
15587 -3617 -3753 -13544 -2875 1083 -13611 -14136 -10095 -18049 -22366 -22248 -28277 -26365 -25193 -22708 -25005
15572b5005K3156J1165r445j3011N479Q976Q012J769j7k353P263O177K869j7051
15558G984j4690J540N339n116q814Q437K751j3315p71L909k763N163P320m869
15544g895o150R808p826L904J1264M946j4252l525K900K656o900k296p730j3913
15530c5009J1068Q200p935n29P272J1553Q89J665r446j1225j2066P954J0213J2123
15516e273J0200P51R278l308q455k238M931k167q474N029j1219j750J3610J751
15502B666p051J685n023m113J031m755K035L479l427R177J9103L838p326j9568
15488h249j5269l877J2154L113O416J052m165j621p467l562Q7J8281Q224j3226
15474h109j7659O466K1014M388K401j998M72l331q075K726l449j452L403k98l320
$$ plain form
15572 -25005 -1849 9316 -129 -13140 -7661 1315 9327 11096 11079 8726 15989 22166 25035 7984
15558 7984 -6706 -5166 173 -4943 -13757 -5320 -2569 -15884 -16655 -12746 -15509 -10346 -3026 -7895
15544 -7895 -14045 -4237 -12063 -8159 3105 8051 -6201 -9726 -6826 -4170 -11070 -13366 -21096 -35009
15530 -35009 -23941 -15741 -23676 -24205 -16933 -5380 -4491 -2826 -12272 -23497 -35563 -27609 -17396 -5273
15516 -5273 4927 5678 14956 11648 3193 955 5886 3719 -4755 274 -10945 -12695 915 2666
15502 2666 -4385 -2700 -7723 -11836 -10805 -15560 -13525 -10046 -13473 -4296 14807 18645 11319 -8249
15488 -8249 -23518 -27395 -15241 -12128 -5712 -4660 -8825 -10446 -17913 -21475 -21388 -3107 5117 -8109
15474 -8109 -25768 -19302 1712 6100 8501 6503 6975 3644 -4431 -1705 -5154 -6606 -3203 -3501 -6821
15459f821m279J120n149O058J1150j0397m865Q794J2963K999r749L868r057k273
15445e638K2425k002r748R764l598k1712j1521L38N026J0259j4368j4094K2123
15432a2746K3172r965j5473J0039K1085r218j6665r487J506J9416J8226j175q394
15419A0321l323o002O138k667R837l788r0L308k728l306k992M148l519m378m323
15404c364L728L961q93j1349n62P294N948n470O946P742j587k066q269l194k268
15389c403K063p4r701M847J216n624J14J4138J75K084O637n979j3536J638L712
15374a693o997J5422J4959j0474j997K151R27k959j2641k721j3665l083k468N193
15360b0046J2676M983J3321o228m774j0770Q193J6378k444j1397K413J1456j7093
$$ plain form
15459 -6821 -11100 -9980 -15129 -9071 2079 -8318 -13183 -4389 8574 11573 1824 5692 -3365 -5638
15445 -5638 16787 14785 5037 14801 11203 -10509 -22030 -21692 -16666 -6407 -20775 -34869 -12746
15432 -12746 10426 461 -15012 -4973 16112 6894 -9771 -19258 -17752 1664 19890 18715 10321
15419 10321 6998 996 7134 4467 14304 10516 10426 13734 11006 7700 4708 8856 5337 959 -3364
15404 -3364 364 4325 3432 -7917 -8479 -1185 4763 -707 6239 13981 12394 10328 2059 -1135 -3403
15389 -3403 -1340 -1414 -11115 -6268 -5052 -10676 -10562 3576 3751 5835 12472 6493 -7043 -5405 -1693
15374 -1693 -8690 6732 21691 11217 9220 11371 12298 9339 -3302 -6023 -19688 -22771 -25239 -20046
15360 -20046 -7370 -2387 10934 4706 -68 -10838 -2645 13733 11289 -108 2305 13761 -3332
15347c332j1391j460M029P092n689R114l365n336R278o14l369p034J271P810p059
15332a0055p308j1697p982O873J0571J5473l539J4520Q728J0951j5678j9747P882
15319a008J2796O655l945R437r764j0931m683l415j67J677M841l787j1682q781
15305b2757K963n62N021J0516K348J3267P185J97N21o317q396o855N618O836Q683
15290A8268p171k40k628M366j1313j131J6700K376o520j1938j3807J3279J0912
15277A1153J1760Q172l164j5753j1546p420J5328k542l078j007k042K828J0551
15264A3240J638J506J202o043k685j1257P31L83J441q96J2474Q472L64p269m510
15249H791j0707j877k731J5492R64j2032n273J0143Q445O117j3383p063n176J314
$$ plain form
15347 -3332 -14723 -16183 -12154 -5062 -10751 -1637 -5002 -10338 -1060 -1674 -5043 -12077 -10806 -2996 -10055
15332 -10055 -17363 -29060 -37042 -30169 -19598 -4125 -7664 6856 15584 26535 10857 -8890 -1008
15319 -1008 11788 18443 14498 23935 14171 3240 -1443 -4858 -5025 -3348 1493 -2294 -13976 -22757
15305 -22757 -19794 -20356 -15335 -4819 -2471 10796 17981 18178 18699 12382 3986 -2869 2749 9585 18268
15290 18268 11097 10857 8229 12595 1282 151 16851 19227 12707 769 -13038 241 11153
15277 11153 22913 31085 27921 12168 622 -6798 8530 5988 2910 1903 -139 2689 13240
15264 13240 14878 16384 17586 11543 8858 -2399 -1668 -1285 156 -740 11734 20206 20570 13301 8791
15249 8791 -1916 -3793 -6524 8968 9932 -2100 -7373 2770 11215 17332 3949 -3114 -8290 -6976
15235f976P533j929o497K882J1003R782R349O21j564r749o009j5595n464P673
15221d940J7817p194p906P028n420j1641k601Q937L358P448n190j0022L036M96
15207f794R458J5563k31j4162p281p21k887O949L100J5335J8648j2532r689j7231
15193b475o086J3765L576k823O087J2248M489j8586N134j742P545J3632O271r197
15179C1838j5394j843M307J918k067q949l946j0230l066J1945R155p329q148j0871
15165a2680j2208Q20n827o57L009J4970J0672j305N0M413O97l632j2230j705Q876
15150f737P752p2m53J8103o451k455q214J067m882o59m488k40M256p770J5463
15135D220k485o198n063O897J579R66n868k679J1477L674q105j842J0380M783
$$ plain form
15235 -6976 557 -1372 -7869 -4987 6016 15798 25147 25768 24204 14455 8446 -7149 -12613 -4940
15221 -4940 12877 5683 -2223 4805 -615 -12256 -14857 -5920 -2562 4886 -304 -10326 -7290 -6794
15207 -6794 2664 18227 17996 3834 -3447 -4168 -7055 -106 2994 18329 36977 24445 14756 -2475
15193 -2475 -8561 5204 8780 5957 12044 24292 28781 10195 15329 13587 21132 34764 41035 31838
15179 31838 16444 14601 18908 20826 18759 9810 5864 -4366 -7432 4513 13668 6339 -1809 -12680
15165 -12680 -24888 -24068 -29895 -30552 -27543 -12573 -1901 -3206 -3156 1257 1954 -1678 -13908 -15613 -6737
15150 -6737 1015 943 490 18593 12142 9687 1473 2540 -2342 -3001 -7489 -7729 -3473 -11243 4220
15135 4220 1735 -4463 -9526 -2629 -1050 -84 -5952 -8631 2846 6520 -1585 -3427 6953 11736
15121A1736r005K386j246p582m4J545l879j1529l700J0569K1238R954o933L815
15107A7325O028n638j3231L539q336j426j39k366l384j6597L650K4119J0197o49
15093A3092J203K818J661K621L482K01O759q62j4355j3342o668P22q575j136k995
15078a5374Q39R715P601k233M112P082j346n039Q549M350J2100q649j3731j0101
15064b125L898N089J0635q27k207j5818J902n242J4297R554o521k691J356m760
15050F540J653P984m712j2595J758J0235l22J1296j5543r928j5439L085J2218
15037c770J5039j731O078N631j3027n606j6686p769j908M446J0304O439j8565
15024b1125N809M488Q09J7871Q400k697m966N961j676r805q592J3423J3659l25
$$ plain form
15121 11736 2731 5117 3871 -3711 -3755 -2210 -6089 -17618 -21318 -10749 10489 20443 13510 17325
15107 17325 23353 17715 4484 8023 -313 -1739 -1878 -4244 -7628 -24225 -20575 3544 13741 13092
15093 13092 14295 17113 18774 21395 24877 25078 31837 30975 16620 3278 -3390 -2668 -11243 -12379 -15374
15078 -15374 -14535 -4820 2781 548 4660 11742 10396 5357 13906 18256 30356 21707 7976 -2125
15064 -2125 1773 6862 17497 16670 14463 -1355 547 -4695 9602 19156 12635 9944 11300 6540
15050 6540 8193 16177 11465 -1130 628 10863 10541 21837 6294 -3634 -19073 -15988 -3770
15037 -3770 11269 9538 15616 21247 8220 2614 -14072 -21841 -23749 -19303 -8999 -2560 -21125
15024 -21125 -15316 -10828 -10019 7852 16252 13555 8589 14550 12874 3069 -5523 7900 21559 21234
15010B1234L089j0043r609N492r5j1016l742p959N61J252J0282J2129j0801j0169
14996i395O619M110Q64n01K002J770Q36r544k480J0077N47J3257p622j2266j5049
14981a6775j4568J168K455R012K9355k843l131K377j0346p512k43J175P585L121
14967H30n362j5362l130k1117o880J0829K5692J4234L987j1910j2392Q024O318
14954f239Q760J33J4887n759r037K0010J4296k608j3066n712N550P562l723L023
14940B8077M531q738k2819j57K627L28L923R338N79M095J797L594K028r778j1491
14925G934n371P364P016j0421j1739M337L900N736j5903p373M201K036m462K885
14911i860J8085J0160K851k088r251l575m849K970q909J407N523P75O610Q888
$$ plain form
15010 21234 24323 14280 4671 10163 10068 -948 -4690 -12649 -12088 -10836 -554 11575 774 -9395
14996 -9395 -2776 1334 2198 1697 3699 5469 6305 -3239 -5719 4358 4905 18162 10540 -1726 -16775
14981 -16775 -31343 -30175 -27720 -18708 10647 7804 4673 7050 -3296 -10808 -11051 -9876 -2291 830
14967 830 -4532 -19894 -23024 -44141 -51021 -40192 -14500 -266 3721 -8189 -20581 -12557 -6239
14954 -6239 2521 2654 17541 11782 2745 22755 37051 34443 21377 15665 21215 28777 25054 28077
14940 28077 32608 23870 1051 894 3521 3849 7772 17110 17689 21784 23581 27175 29203 19425 7934
14925 7934 2563 9927 16943 6522 -5217 -880 3020 8756 -7147 -14520 -10319 -8283 -12745 -9860
14911 -9860 8225 18385 21236 19148 9897 6322 1473 4443 -4466 -3059 2464 3239 9849 18737
14897A8737Q674L026p856j1045J0936m569j0629j984j5566n077R599O640O717
14884G603J4748K765o361r153j5270j0369r736J672J8192O64o317N680J8386J1321
14870B3825o718l04R186j4566j229m985r972Q688P7J784M576m629j8303j6188
14856b8758J7443J4801l042n008j1329N892Q936O867K1402L5o587j2500n421O6
14842B797L352J0736p136n943k067L059L818n76R165P412j8593j0021M773Q35
14828A611j2470j4753j487J5854J2735J318k754J881n484k008L510L916j289N040
14814E620K896R739N607l748N685m376p888k0334j1606J9404q200l367O081m303
14800h790j1641n962R756l800N590J0541j4616j829O520J2627J0495R45Q465j1574
$$ plain form
14897 18737 27411 30437 22581 11536 22472 17903 7274 5290 -10276 -15353 -5754 886 7603
14884 7603 22351 25116 18755 9602 -5668 -16037 -25773 -24101 -5909 -5245 -11562 -5882 12504 23825
14870 23825 17107 16803 25989 11423 10194 5209 -4763 3925 4002 5786 10362 5733 -12570 -28758
14856 -28758 -11315 3486 444 -4564 -15893 -10001 -1065 5802 27204 27239 20652 8152 2731 2797
14842 2797 6149 16885 9749 3806 1739 4798 8616 8040 17205 24617 6024 -3997 776 1611
14828 1611 -10859 -25612 -27099 -11245 1490 2808 54 1935 -3549 -5557 -2047 1869 580 5620
14814 5620 8516 18255 23862 20114 25799 21423 13535 -6799 -18405 999 -7201 -10568 -4487 -8790
14800 -8790 -20431 -26393 -16637 -20437 -14847 -4306 -18922 -20751 -14231 -1604 8891 9836 18301 6727
14786F727q458j4676r569J0531L626q324J6141N678p069J1130M637j434P337j7948
14772a671j2161r373N945M03j1556Q015K6201k107j0983j1329l027K0195R855
14759H407J333n241M771j7481N622J0468J4354P0j7985Q735k529q090J062j5973
14745a2477j593O602J0684L671k703K946R835k681k1719R329j7771j0014J0565
14732a5326K2625J1208M775J248k306r585m983J154m571j1971K1466Q241M238
14719B6213J706O643m330M77Q529l022j9533K430l357j546j269o63n597o090M324
14704D915J0053P571L262J810p302q111m330J1951O161p705k10j6754l681J8327
14690A5957K804j855L849J546R573r063j1984m962j886n7l86N619l041m484j732
$$ plain form
14786 6727 -1731 -16407 -25976 -15445 -11819 -20143 -4002 1676 -5393 5737 10374 8940 16277 -1671
14772 -1671 -13832 -23205 -17260 -16857 -28413 -20398 5803 3696 -7287 -18616 -21643 -1448 8407
14759 8407 9740 4499 9270 -8211 -2589 7879 22233 22303 4318 13053 10524 2434 3496 -12477
14745 -12477 -14070 -7468 3216 6887 4184 7130 16965 14284 -7435 1894 -15877 -25891 -15326
14732 -15326 7299 18507 23282 24530 22224 12639 7656 8810 4239 -7732 13734 21975 26213
14719 26213 27919 34562 30232 30709 39238 36216 16683 19113 15756 14210 12941 12278 6681 591 4915
14704 4915 14968 22539 25801 27611 20309 12198 7868 19819 25980 18275 18065 1311 -2370 15957
14690 15957 18761 16906 20755 22301 31874 22811 10827 5865 3979 3922 3536 9155 6114 1630 -102
14675a02M188N060p859P872P379R646M123O889o783l885j6795r507N024J1457
14661A6707L77j1336m337J633Q1j775j440k362J832j248M465L846Q45M157j716
14646I729J1681l490j679m691j2491R299Q176J0857j5271j2293o209o597J4428
14633A449J5570o460R528m592m796j5374O281J0385P812j496J2399m185q978k956
14619A4587k351Q959p785k680K917n147K163Q634l756o808N858j9050r565J1450
14605b574J9158o009q359j2981j46l440l981J5183Q027L666J981N683L519q797
14591A0930p52o62l799N25n075L830M33l075K204J6769n447q849J3490K131k0144
14576B509j977J968P054j1820L513M258n166n08o566m98J3605O563K52p587j4815
$$ plain form
14675 -102 4086 9146 1287 9159 16538 26184 30307 37196 30413 26528 9733 226 5250 16707
14661 16707 17084 5748 1411 3044 3125 1350 -90 -2452 -620 -1868 2597 6443 7288 11445 9729
14646 9729 21410 17920 16241 11550 -941 8358 16534 27391 12120 -173 -6382 -12979 1449
14633 1449 17019 10559 20087 15495 10699 -4675 1606 11991 19803 18307 30706 26521 17543 14587
14619 14587 12236 21195 13410 10730 13647 8500 10663 19297 15541 8733 14591 -4459 -14024 -2574
14605 -2574 16584 10575 2216 -10765 -10911 -14351 -18332 -3149 4878 8544 10525 16208 19727 10930
14591 10930 10178 9516 5717 6242 1167 4997 5430 2355 4559 21328 15881 7032 20522 22653 2509
14576 2509 532 2500 9554 -2266 1247 5505 339 -169 -6735 -7233 6372 12935 13187 5600 -9215
14561i215l169L112J6363J3891n683j5369l965J6155Q008p720m351J0378J1781
14548C0216n104N15j3366q074K1258P244q694j2242O321j225j4681j1544m9J2646
14534C221p966r398K2828J8505N334r661l830j2202K054J413p181O321J6255j0381
14520A5312o052L920j522j5246N405R104J0568K876j3796j30j4857N436J9118
14507B0136k070j4312o644j5013K599J0885k484k171J3061j622p745k254J8051
14494A0417J2734j528m788q031J1205N474j1833m721j1690k4547Q691K0748K0473
14481B2604l270o391k517j184m574j3396k801K8946L044j6754j053R972M800N894
14467B3320P881K431j4657j2259k895K246r407l944J3628M472k199k815J5332
$$ plain form
14561 -9215 -12384 -9272 7091 20982 15299 -70 -4035 12120 20128 12408 8057 18435 30216
14548 30216 25112 25627 12261 4187 25445 32689 23995 11753 18074 16849 2168 -9376 -9425 3221
14534 3221 -4745 -14143 8685 27190 32524 22863 19033 6831 8885 10298 3117 9438 25693 15312
14520 15312 9260 13180 11658 -3588 1817 10921 21489 24365 10569 10439 -4418 1018 20136
14507 20136 18066 3754 -2890 -17903 -15304 -4419 -6903 -9074 3987 2365 -5380 -7634 10417
14494 10417 23151 21623 16835 8804 20009 25483 13650 8929 -2761 -27308 -18617 2131 22604
14481 22604 19334 12943 10426 9242 4668 -8728 -11529 17417 20461 3707 2654 12626 17426 23320
14467 23320 31201 33632 18975 6716 3821 6067 -3340 -7284 6344 10816 8617 5802 21134
14454B1134O075m072j2498j1846k403O657n540j318M411O283M276l556M700l780
14440H523L57Q865K3727m733k2439m758k842R558j6629j8737J525M810K618J800
14426h355j793J3048O242P517Q540M812K351o65l279k694M027n169l623n05J5123
14411C5577J296j1924j3070m492J751J304l052n879O074m425j2825Q183k785j395
14397e662j8741q841J6821J0402r760J36R739P075J0722P173N780j992l281q272
14383A1299r84o915k743K577k245J3877j754n626l60J4669K897L52J5228j7314
14369B2958j3264L839J992K804o373n414M158J4038J0239N83P250j265j1782m929
14355B4834J3893M806O312j589J6907J6746J5692J8634L0743M3308O3165Q6904
$$ plain form
14454 21134 27209 23137 10639 -1207 -3610 3047 -2493 -3811 600 6883 11159 7603 12303 8523
14440 8523 8880 17745 41472 36739 14300 9542 6700 16258 -371 -19108 -17583 -12773 -10155 -8355
14426 -8355 -10148 2900 9142 16659 25199 30011 32362 31697 28418 25724 29751 24582 20959 20454 35577
14411 35577 36873 24949 11879 7387 9138 10442 7390 1511 7585 3160 -9665 -1482 -4267 -5662
14397 -5662 -24403 -33244 -16423 -6021 -15781 -15645 -5906 1169 11891 19064 24844 22852 19571 11299
14383 11299 10315 3400 657 3234 989 14866 13112 7486 7126 21795 24692 25044 40272 22958
14369 22958 9694 13533 15525 18329 11956 6542 10700 24738 34977 35560 42810 41545 29763 24834
14355 24834 38727 43533 49845 48256 65163 81909 97601 116235 146978 190286 253451 340355
14343C40355R5623J02285J24707J33970J24652J11093K8980p4339j37741j89289
14333F60296k06684j51590p8667m6187l5486l7928j9072j2063j0136p572j921
14322E2990o780N712J662k2238n641k187J0838J0441r680j3895J1616l592j2858
14309A6388o427Q346m1o651k31N820j6021j7306J1567P055J7616J1034L62p35
14295C0776l273p953O56q472J30L283J384J0850K2234J962o651j516k3924n199
14281A4287J0516l971O67n201j978j905J792n803p405J0410m378j1801J0810J6504
14267B2544J5646k579j2225q836J7944J2732K653k049j3079n865Q527n800k1360
14254H253J375J4852l772N033J4073J479R064r003o787j7j934k839R038L856m064
$$ plain form
14343 340355 435978 538263 662970 796940 921592 1032685 1061665 987326 849585 660296
14333 660296 453612 302022 223355 177168 141682 103754 84682 72619 62483 54911 52990
14322 52990 46210 51922 53584 31346 25705 23518 34356 44797 35117 21222 32838 29246 16388
14309 16388 9961 18307 18266 11615 11384 17204 1183 -16123 -4556 2499 20115 31149 31511 30776
14295 30776 27503 19550 20206 11734 11864 15147 16531 27381 49615 51577 44926 43410 19486 14287
14281 14287 24803 20832 21499 16298 14320 12415 14207 8404 999 11409 7031 -4770 6040 22544
14267 22544 38190 35611 23386 14550 32494 45226 47879 45830 32751 26886 35413 29613 8253
14254 8253 9628 24480 20708 25741 39814 41293 50357 41354 34567 34550 32616 29777 38815 42671 38607
14239C8607l693j9092j4920M176Q814J2352m837J630j0098N301k888j79J400j345
14225A5228q719k64J4822K2626r919L681P166m549j3660o270K191M00K116Q279
14211C3128J0985m945q543M274m355p8N864P949J7403K057r483o344j6028j1140
14197B0744k762j557J044n395m34J3537j910r248J709P368J012j1524p932M307
14183H959P670J1008q511L904n90j3124J504J681K046r71l928p24N25L912J0382
14168B3743J6893M587k2336r298k016q957j716K42l344R918p14P224J359J72J280
14153A7037N360m599M43j939J3543R453L707o443j4408m042M882K643J0178N231
14139D1046j732K601j1592K066L045j0828R37J2903q124k091J482K0978k511j4184
$$ plain form
14239 38607 34914 15822 902 5078 13892 26244 21407 23037 12939 18240 15352 15173 16573 15228
14225 15228 6509 6245 21067 43693 33774 37455 44621 40072 26412 20142 22333 22733 24849 33128
14211 33128 44113 39168 30625 34899 30544 30466 36330 44279 61682 63739 54256 47912 31884 20744
14197 20744 17982 16425 17469 12074 11640 25177 23267 14019 15728 23096 24108 12584 4652 8959
14183 8959 16629 27637 19126 23030 22440 9316 10820 12501 14547 13576 9648 8924 9449 13361 23743
14168 23743 40636 45223 22887 13589 11573 2616 900 1142 -2202 7716 7002 14226 15585 15757 17037
14153 17037 22397 17798 18241 16302 29845 39298 43005 36562 22154 18112 22994 25637 35815 41046
14139 41046 39314 41915 30323 32389 35434 24606 25543 38446 30322 28231 29713 50691 48180 33996
14125C3996p698J1242J3520o879l956J8486L275J8418K6976J5470J1666J3724
14113A48240L1336J2812L230j283p089k2556l2636k7854k0752j9881o929J33p184
14100D9587N022Q659r00M430L435K4614j458k8251n377p772k1569J477Q288j3338
14086B6847j3168n373P705J2171o655R480J7188k291L645J940M84J5249N8n7L799
14071G1022r986K239q869r91J2396J5158n36L666j75J059O331q59j3979k031l269
14056G1176J4387J3240m557k801M930Q859l1289j5189k641K0643N474j4366j1933
14043E5933J0874j933j0186R218K0593J7779j8463k1201P133J0356J1345P081
14031I8529j3335M161j1829L85l945L745J4106M250m589J2223J0232J1897L9116
$$ plain form
14125 33996 26298 37540 51060 44181 40225 58711 61986 80404 107380 122850 134516 148240
14113 148240 179576 192388 195618 194335 187246 164690 132054 104200 83448 63567 56638 56771 49587
14100 49587 54609 63268 62368 66798 70233 94847 93389 65138 59761 51989 30420 31897 40185 26847
14086 26847 13679 8306 16011 28182 21527 31007 48195 45904 49549 51489 51973 67222 67280 67223 71022
14071 71022 61036 63275 54406 53415 65811 80969 80433 84099 83924 84983 91314 90455 76476 74445 71176
14056 71176 85563 98803 94246 91445 96375 105234 73945 58756 56115 76758 82232 67866 55933
14043 55933 66807 64874 54688 63906 84499 102278 83815 62614 69747 80103 91448 98529
14031 98529 85194 89355 77526 77911 73966 77711 91817 96067 91478 103701 113933 125830 164946
14018A64946K9464L1641N5976L6243L9521O2136J01106J11167J30652J71618K05094
14007A139564K17679K29300K33038K01321J00162p2421k45310l64183l59392k87525
13997G92233j80647j19142p0531l9197l2305j5016n759j0130j5031j629j0242
13986B92604m526n716K128j095q146J0185J6541J1300M533L7132N4906O5798Q2186
13973E57830J11617J51813J84567J95162J93492K23914K25425J96392J20961k1296
13963B139877j89612l17146l74924l18298k38660j60226q9521m8573m2451j3484
13953C46982j8952k6763j2685K755N313N548N721j6008j2542k1497M926J0247
13941B73045m946n80j592k222M722l987J0613K0220R370l512N224P603O719o181
$$ plain form
14018 164946 194410 226051 282027 318270 357791 419927 521033 632200 762852 934470 1139564
14007 1139564 1357243 1586543 1819581 2020902 2121064 2048643 1803333 1439150 1079758 792233
13997 792233 611586 492444 421913 382716 350411 335395 329636 319506 304475 302846 292604
13986 292604 288078 282362 284490 283395 275249 285434 301975 313275 317808 354940 409846 475644 557830
13973 557830 669447 821260 1005827 1200989 1394481 1618395 1843820 2040212 2161173 2139877
13963 2139877 1950265 1633119 1258195 939897 701237 541011 451490 402917 360466 346982
13953 346982 328030 301267 288582 291337 296650 302198 307919 291911 279369 257872 262798 273045
13941 273045 268099 267519 265927 263705 268427 264440 275053 295273 304643 301131 306355 313958 320677 314496
13927C14496k499k485J3182K3162J1962J4424J4013J1879j3010M522K4230J6281
13915D30157R98K357N643Q911N668L9480L4290K6195L8308L0756L5694K9918L5617
13902G23992M5357L1501L9048O0259P9508Q4465Q5910Q0431R9313Q4365O8772
13891A482921M8912K1343L2302N1428Q5799J04484J23976J44569J77668K15519
13881B488921K74409L46581M47352N49009O31100P12962Q32199J026760J275807
13872H585100J506765J779661K245645L145646M734895P158460J0426288J4199601
13864E3782061J7358403J9121189K0028066K2042859K6097073K6570181J4013596
13857A99013428n236703j8104577l1271507m1971398l6845502k3275086j3061916
$$ plain form
13927 314496 311997 309512 322694 345856 357818 372242 386255 398134 385124 389646 413876 430157
13915 430157 431155 433512 439155 448066 453734 493214 527504 553699 592007 622763 658457 688375 723992
13902 723992 769349 800850 839898 900157 979665 1064130 1150040 1230471 1329784 1414149 1482921
13891 1482921 1531833 1553176 1585478 1636906 1722705 1827189 1951165 2095734 2273402 2488921
13881 2488921 2763330 3109911 3557263 4106272 4737372 5450334 6282533 7309293 8585100
13872 8585100 10091865 11871526 14117171 17262817 21997712 29156172 39582460 53782061
13864 53782061 71140464 90261653 110289719 132332578 158429651 184999832 199013428
13857 199013428 193776725 175672148 144400641 102429243 65583741 42308655 29246739
13850B9246739p563295m681419l067961k108583j488989j135257r22748p98455
13842G480032p91862q10221p83705p34002o30578n05574l68954k70303k10255
13833B374578j76511j81001j54362j42852j29587j11836q7611r0088n3449k8097
13823A219184k0127j0784j1597k5117m3458n4085o6809q9860o7111o3588p5760
13812F90888n9370l3865l3581j7152j4927j2201l243j0319j4280k9447m3717k1591
13800C97195k938k0215k6529j4867j6914q229J2698p745j5194M659j1746k0944
13788B69231j1455j1375j1705l517q195l789J592Q28O696n933j2322j2725p320
13775A90011j3871j6131N191Q48r017n017l513j2561k649q212J1876M953j0596
$$ plain form
13850 29246739 21683444 17002025 13934064 11825481 10336492 9201235 8278487 7480032
13842 7480032 6688170 5877949 5094244 4360242 3729664 3224090 2855136 2584833 2374578
13833 2374578 2198067 2017066 1862704 1719852 1590265 1478429 1390818 1300730 1247281 1219184
13823 1219184 1199057 1188273 1176676 1151559 1108101 1054016 987207 897347 830236 766648 690888
13812 690888 631518 597653 564072 546920 531993 519792 516549 506230 491950 462503 418786 397195
13800 397195 394257 374042 347513 332646 315732 307503 320201 312456 297262 301921 290175 269231
13788 269231 257776 246401 234696 231179 222984 219195 220787 221615 228311 222378 210056 197331 190011
13775 190011 176140 160009 165200 166048 157031 152014 148501 135940 133291 125079 136955 141908 131312
13762A31312j266J8057R143k224L284J8475J4562o462j8785k3755l113n44J788
13749A40472p902q375r239L328k633n037K640N430N683J3060Q194o694J5438O541
13735A60906j801J3437J2704P620J2675J5383j3339k0243m0983k1528k72o927
13723A17632Q187k492n945K391J6056O457l525q81R810p572l693j7515l2170r736
13709G7004l873j3544j6576j4746q988r806o637K848n229R385J1071J8586J4793
13696E4288J7662N020M675q239J2610P643r247k861K872J30J659j492j3953j7126
13682E3641P719j505N89j465J3677M200p075j6526p967J7320P718L472R801J0092
13668I3691j4316j8842L156m678q712r888J3345q893p811j6938j2865r38O406
$$ plain form
13762 131312 130046 148103 157246 155022 158306 176781 191343 184881 166096 142341 139228 138684 140472
13749 140472 132570 124195 114956 118284 115651 110614 113254 118684 124367 137427 145621 138927 154365 160906
13735 160906 159105 172542 185246 192866 205541 220924 207585 187342 146359 124831 124559 117632
13723 117632 125819 123327 117382 119773 135829 142286 138761 137880 147690 140118 136425 118910 86740 77004
13709 77004 73131 59587 43011 28265 19277 9471 2834 5682 453 9838 20909 39495 54288
13696 54288 71950 76970 81645 73406 86016 93659 84412 81551 84423 84553 86212 84720 70767 53641
13682 53641 61360 59855 60444 58979 72656 76856 69781 53255 45288 62608 70326 73798 83599 93691
13668 93691 79375 60533 63689 59011 50299 40411 53756 44863 37052 20114 7249 6311 12717
13655A2717o342L671J8937J9597L841r215K419n157p906j0570K657M082p253m546
13641A6932l177n091N117N707m776M349M192R062J8395j200J3170P88k938J771
13627F2301j6176j3553j2003J848L001J1630K705N486J8220J1139j7133n196N323
13614E7592j0169j2894o292J0959l548k0630l829J5940J1963j0705k444P019q147
13601B4815j5893L04o526J0540K549K60k71o916j1918J0333J2189K850J2759J3504
13587D8579J092j6234N077n830j5843k363J5106L025R59r36p41j372J381j3999
13573A7901P961J0170K0121j6065o088q073p952N338K307N297m859j5816J4828
13560B5070J0674L604m892j142N307M876j3402M989O673o791q046n519p090J0900
$$ plain form
13655 12717 6375 10046 28983 48580 52421 43206 45625 40468 32562 21992 24649 28731 21478 16932
13641 16932 13755 8664 13781 19488 14712 19061 23253 32315 50710 49510 62680 63468 60530 62301
13627 62301 46125 32572 20569 22417 25418 37048 39753 45239 63459 74598 57465 52269 57592
13614 57592 47423 34529 28237 39196 35648 15018 11189 27129 39092 28387 25943 32962 24815
13601 24815 8922 9226 2700 13240 15789 16049 15778 8862 -3056 7277 19466 22316 35075 48579
13587 48579 49671 33437 38514 32684 16841 14478 29584 32609 33568 32632 31891 30519 31900 17901
13573 17901 25862 36032 56153 40088 34000 25927 17975 23313 25620 30917 26058 10242 25070
13560 25070 35744 39348 34456 33314 38621 43497 30095 35084 41757 34966 26920 21401 14311 25211
13546B5211r303l05k6198m176J8655K5567l088j2323j1888p910q773J2588K272
13533C29l263M509l893M432M408J3954j790n432J814k251Q671P112j2324j8393
13519b117l728J0402J1995j126n255j3894r546r267J0142J7217N221r57n331O13
13505D369J3001J4187M729j4681n672j1784l357k984p973J1017P477P784l278
13492A2835N221Q911L291Q07q148j664p880K143L596P286L689l261j4374J410
13478A3862j5223J67N919M7k167P913m648o087o660J3446L277L717j0876o365
13464c678K072R061q391M923r147J902M547O37J4935j0935j583l322K893O083
13450I997N404n821j2379o314J2863O047k282J3978K704j2790p126n912o372O767
$$ plain form
13546 25211 15908 15603 -10595 -14771 3884 29451 26363 14040 2152 -5758 -14531 -1943 329
13533 329 -2934 1575 -2318 2114 6522 20476 18686 13254 15068 12817 21488 28600 16276 -2117
13519 -2117 -5845 4557 16552 15426 10171 -3723 -13269 -22536 -12394 4823 10044 9087 3756 4369
13505 4369 17370 31557 36286 21605 15933 4149 792 -2192 -10165 852 8329 16113 12835
13492 12835 18056 26967 30258 31065 22917 21253 13373 15516 19112 26398 30087 26826 12452 13862
13478 13862 -1361 -1194 4725 4772 2605 10518 5870 -217 -6877 6569 9846 13563 2687 -3678
13464 -3678 -1606 7455 -936 3987 -5160 -3258 1289 1926 16861 5926 4343 1021 3914 9997
13450 9997 15401 9580 -2799 -9113 3750 9797 7515 21493 24197 11407 4281 -1631 -8003 -1236
13436a236J4317K012J1176r332r217j827l376L20J297J936j793J903Q544J2353
13422B7077q022p467N475m61j1983j3345J995L704J9900J0855J549j836o427n81
13408B0433P347N824j4036n085L794M155N401O35J0602J1950j138j0100l671Q219
13394D4330J1695K065j1835j6119R006O337J70J6412J7388O803N861K225J9413
13381A13751L4521M4293O8382P3373O4907Q5978J08872J39666J43573J20044O8898
13370A066258k0809j02282j72298k02192j81981j36888p5618l4387k6166k2278
13360I1359j8204j4328P174j1738k0718k399J0914q774j1694N819J2516j1275
13348B8652P782L831q304n613L3P321J7529k792m0211j2626K379j512J1118J4094
$$ plain form
13436 -1236 13081 15093 26269 16937 7720 5893 2517 2837 4134 6070 4277 6180 14724 27077
13422 27077 19055 11588 17063 16602 4619 -8726 -6731 -3027 16873 27728 29277 27441 21014 20433
13408 20433 27780 33604 19568 14483 18277 22432 27833 28468 39070 51020 49882 39782 36111 44330
13394 44330 56025 58090 46255 30136 39142 45479 45649 62061 79449 86252 92113 94338 113751
13381 113751 148272 192565 260947 334320 399227 485205 594077 733743 877316 997360 1066258
13370 1066258 1045449 943167 770869 568677 386696 249808 174190 139803 113637 91359
13360 91359 73155 58827 66001 54263 33545 31146 42060 33286 21592 27411 39927 28652
13348 28652 36434 40265 31961 26348 26381 33702 51231 48439 8228 -4398 -2019 -3531 7587 21681
13334B1681j1943j4178P967J5244j6p12n030J95J161N200K249o590N376J4306
13320C4910L604p207q093j2754J565K0482o41p987L200Q71L111p748n790o864
13306A0659r359j2037r799p37M969J0764J5221J1665J9106q493k5326o365j2812
13293a2544J3869J2482O939q323p026m544L041O390q174N545L43q847j31R171
13279H191M424l710K331R021L975J048j0001j0194K834O978Q220j1442q564O62
13265C773J1832J4578N444k0866p302O217J7446j444j9403k235P273J8508R942
13252D3763p133Q55R02j3975N444k478K655P068p958j7416J3459Q794J0037M791
13238D8808j1384n370R04p518q22j0879n766O827Q601J0018o850n144j1233O508
$$ plain form
13334 21681 9738 -4440 3527 18771 18755 18043 13013 13208 14369 19569 21818 15228 20604 34910
13320 34910 38514 31307 23214 10460 12025 32507 31866 23879 27079 27950 31061 23313 17523 10659
13306 10659 1300 -10737 -20536 -21273 -16304 -5540 9681 21346 40452 31959 6633 268 -12544
13293 -12544 1325 13807 20746 12423 5397 853 3894 10284 2110 7655 7998 -849 -980 8191
13279 8191 12615 8905 11236 20257 24232 25280 15279 5085 7919 14897 23117 11675 3111 3773
13265 3773 15605 30183 35627 14761 7459 13676 31122 29678 10275 8040 15313 33821 43763
13252 43763 36630 37485 38387 24412 29856 27378 30033 37101 29143 11727 25186 33980 44017 48808
13238 48808 37424 32054 32958 25440 24618 13739 7973 14800 23401 33419 26569 21425 10192 16700
13224A6700Q240r44K954J2269O178L807l997j7582k0576O223J0661J66N773J110
13210C0982m947P166O525J8003n983J097L2078L680K2722J3103K9167M4435Q9562
13197B87590J06968J30031J42149J57286J63058J88637K22644K24603R6471j29366
13187A590071l09566l84942l07839j78574j02290o2856l6913k8325k5455j4941
13177A38370j9558k7158k5059J4498K5362J682j200p549p665j3633j8840j1695
13165D7555j6793j1481M12O354P645L809N864o868n155j4066p478P96l245J765
13151I114N411J9261J347p661n233n426K744K193o670M123n364p270j658M094
13137I005Q033J749l197k15J3553P219o124n715K473J0575j0069J122L127N549
$$ plain form
13224 16700 24940 23996 26950 39219 45397 49204 45207 27625 7049 13272 23933 24099 29872 30982
13210 30982 26035 33201 39726 57729 51746 52843 84921 88601 111323 124426 153593 198028 287590
13197 287590 394558 524589 666738 824024 987082 1175719 1398363 1622966 1719437 1590071
13187 1590071 1280505 895563 587724 409150 306860 244004 207091 178766 153311 138370
13177 138370 118812 91654 66595 81093 106455 108137 106937 99388 91723 78090 59250 47555
13165 47555 30762 19281 19693 26047 33692 37501 43365 36497 31342 17276 9798 10594 7349 9114
13151 9114 14525 33786 35133 27472 22239 16813 19557 21750 15080 19203 13839 6569 4911 9005
13137 9005 17038 18787 15590 15375 28928 36147 30023 24308 26781 37356 27287 28409 31536 37085
13123C7085n670j0091j2190j592L858J3891J1015j1039j1942m772L734k360j1115
13110a188r892J7181M727o446Q533M014m809N952O807o345k1419r494J6837M374
13096H832Q33r257J2438R377k081N75N634O867j2881M118L66j093m807p046k082
13081I793m386K141O072L524J0297j888K652m420j6345r414p199J0883m544q493
13067a1327m299O05J3563R624j2858o488N774J2015O364P239M771p01o934m111
13053A3237k655p834q57Q286P978k795m438o904O305J3843K532r67K100M934p370
13038B5395m157N82Q452p739m616m977r168Q403Q115J6845O71n482j7140j836
13024A3348Q167k968p695R726K240l105R595J046j8514J4502J2042J6852K0275
$$ plain form
13123 37085 31415 21324 9134 7542 11400 25291 36306 25267 13325 8553 12287 9927 -1188
13110 -1188 -11080 6101 10828 4382 12915 16929 12120 18072 24879 18534 -2885 -12379 4458 8832
13096 8832 9665 408 12846 22223 20142 20717 26351 33218 20337 24455 24821 23728 18921 11875 9793
13081 9793 5407 7548 13620 17144 27441 25553 28205 23785 7440 -1974 -9173 1710 -2834 -11327
13067 -11327 -15626 -15021 -1458 8166 -4692 -11180 -5406 6609 12973 20212 24983 24282 17348 13237
13053 13237 10582 2748 1891 10177 18155 15360 10922 4018 10323 24166 26698 25731 27831 32765 25395
13038 25395 21238 21820 30272 22533 17917 12940 3772 12175 20290 37135 37806 32324 15184 13348
13024 13348 21515 18547 10852 20578 22818 19713 29308 30354 11840 26342 38384 55236 75511
13011G5511J1033J7709L3329N082p959J30K4193K9775L2207K0074J9808R843o048
12998B64687k8327n7444o1286l2371j9745n979o857j3096n925k35J405J9156K0952
12985G4935Q517o256j3471p118P010j4449m835m327o560R686N2n559p879P857
12971C7603n27j310M264q082P450J0829p493Q568J0685N03k102L118P958L423
12957G4887P150j935j2189K161N112O783j3331r050m941r256J1976J0980J0637
12944G8984P024M508l861k991j377k076K423j2374j0357J4474m867j3324L815
12931F0001k720r127k734k755j3489P525R902m9j0118q450K965J4783J48j2995
12917C2887j1847M038l347J3576K2067J0844J6995K3654K1065L3541J7245K2333
$$ plain form
13011 75511 86544 104253 137582 142664 134705 134835 159028 188803 221010 241084 260892 270735 264687
12998 264687 236360 178916 117630 85259 65514 59535 52678 39582 33657 33422 34827 53983 74935
12985 74935 83452 77196 63725 56607 63617 49168 44333 40006 33446 43132 43184 37625 29746 37603
12971 37603 37076 35766 40030 31948 39398 50227 42734 51302 61987 62490 60388 63506 71464 74887
12957 74887 82037 80102 67913 70074 75186 81969 68638 59588 54647 45391 57367 68347 78984
12944 78984 86008 90516 86655 83664 82287 80211 82634 70260 59903 74377 69510 56186 60001
12931 60001 57281 48154 45420 42665 29176 36701 46603 46554 36436 27986 30951 45734 45882 32887
12917 32887 21040 25078 21731 35307 57374 68218 85213 108867 129932 163473 180718 203051
12905B03051o092j0106j5240j7384k2659j8140j4864j7021J067J320r972m620
12893F9340n068R172J4382J509o839n419K369O384J3588K9045M0974K6535R149
12880B05121M222R931J0851k7700j8085j264l143K510R518j1453j6978k2847j688
12867A38995K04K053j179m757M431P550J9739J5939R457m19j8258q136m739J288
12853A62168P312j429q952q848P281K5035L5476J2125K868J8635j977O649P614
12840B63957J3343K8633K0800J7954j2108j3731l447j3021j6788J416P253Q369
12828C02630K2341J4729l750M251K7732M2572L3213L9870K5520J7701J2857J0958
12816E50624J7864K4493J3760J8976K7985J6775q65j485P678K2615J8217m305
$$ plain form
12905 203051 196959 186853 171613 154229 131570 113430 98566 81545 82612 83932 73960 69340
12893 69340 64272 73444 87826 89335 82496 77077 79446 85830 99418 128463 169437 195972 205121
12880 205121 209343 219274 230125 202425 184340 183076 179933 182443 191961 180508 163530 140683 138995
12867 138995 139199 141252 140073 135316 139747 147297 167036 182975 192432 192013 173755 165619 160880 162168
12853 162168 169480 168051 159099 150251 157532 182567 218043 230168 233036 251671 249694 256343 263957
12840 263957 277300 305933 326733 344687 332579 318848 315401 302380 285592 287008 294261 302630
12828 302630 324971 339700 335950 340201 367933 410505 443718 483588 509108 526809 539666 550624
12816 550624 568488 592981 606741 625717 653702 670477 669612 668127 675805 698420 716637 712332
12804G12332L131l320l058K9914K8530K4956L5467Q1317O0246K3498Q705K1521
12792A023239K4208M1911N2973Q3192J00035R9472J15345R7906Q4317R0109P6555
12781A889262Q1956P3082R6055J05395J33033J61411J93289K18608K45849K73626
12771C471566L11050L85042M80750N72857O83226Q18901R65560J201148J577741
12762A0467841K088418K738428L601898M955877P301412J1026083J5997829K1867690
12754H0045476K7253320L0311982L0484926L0304973L4929089M3084134L7035808
12747C13449708M438899l4610567o6244969p3368121n2711060l0054316j6834350
12740D4065224j0074633o424342m344418l118390k343421j688304r99464l43923
$$ plain form
12804 712332 715463 712143 709085 738999 767529 792485 827952 909269 969515 993013 1001718 1023239
12792 1023239 1047447 1089358 1142331 1225523 1325558 1425030 1540375 1638281 1722598 1812707 1889262
12781 1889262 1971218 2044300 2140355 2245750 2378783 2540194 2733483 2952091 3197940 3471566
12771 3471566 3782616 4167658 4648408 5221265 5904491 6723392 7688952 8890100 10467841
12762 10467841 12556259 15294687 18896585 23852462 31153874 42179957 58177786 80045476
12754 80045476 107298796 137610778 168095704 198400677 233329766 276413900 313449708
12747 313449708 317888607 283278040 217033071 143664950 90953890 60899574 44065224
12740 44065224 33990591 27566249 23221831 20103441 17760020 16071716 15072252 14728329
12732A4728329j6599l33347j103956j846110k141117j822951j222973p49275n00411
12723D991590l56531l07533l44453l86451m02746l44520k95095k56613k07941
12714B089707j75480j47200j18102j02156p8022n9663l3053k0273k5977l0037
12704A299744m4855n9435p8938o3323m8750k7985l151j0099j5368k9343l3065
12693H85432l9450m4203m6931n5909n1337k6196O447P254j3006p232m515j2770
12681E97584R231m018k0274M301K2471J945k844L7942K5442L8112L8946K2937
12669G71775K1153j0809o5597r2387q9480p3409m8286k9602k6900k1425n122j9956
12657C09955j6743q093O670K5980o944j2666M852R940J3546J2266J0353J99K506
$$ plain form
12732 14728329 14711730 14378383 13274427 11428317 9287200 7464249 6241276 5492001 4991590
12723 4991590 4635059 4327526 3983073 3596622 3193876 2849356 2554261 2297648 2089707
12714 2089707 1914227 1767027 1648925 1546769 1468747 1409084 1376031 1355758 1329781 1299744
12704 1299744 1254889 1195454 1116516 1053193 1004443 976458 973307 963208 947840 918497 885432
12693 885432 845982 801779 754848 698939 647602 621406 627853 635107 622101 614869 610354 597584
12681 597584 606815 602797 582523 586824 609295 611240 608396 646338 671780 709892 748838 771775
12669 771775 792928 782119 716522 624135 534655 461246 412960 383358 356458 335033 329911 309955
12657 309955 293212 285119 291789 317769 310825 298159 303011 312951 326497 338763 349116 349315 351821
12644C51821Q494j9126j1508p372q198l761j2591j2791q775j6110l994m008j791
12631B50290J3276j512J3556Q936J396k93M457O44R569L4343J8720p22j6459l3706
12617C02495l1952l3669j8412M420j212K145L361j0946j7878j056j1525k146l06
12604A83319j4635k7045j2820j4588q51K204r0q177k188j3368j4765k1578j8506
12591C6912R205J4923J7297M355R336K3302J3366P077j189P247P96M010n52N281
12577A51366o910j1612j1285m065O826p093m690j841J235j1357j8584j521M542
12564H5011J5253Q536M828q221j2822k300j8978j5472p663R340P815N802Q919
12551H0048q66l800j3257q89j6027j5598J1743K898L240l870j9017k531L016k853
$$ plain form
12644 351821 360315 341189 329681 322309 314111 310350 297759 284968 276193 260083 256089 252081 250290
12631 250290 263566 262054 275610 284546 285942 285649 290106 290750 300319 334662 353382 352660 336201 302495
12617 302495 270543 236874 218462 222882 221670 223815 227176 216230 198352 197296 185771 183625 183319
12604 183319 168684 141639 128819 114231 113380 115584 115494 107317 105129 91761 76996 55418 36912
12591 36912 46117 61040 78337 82692 92028 115330 128696 135773 134584 141831 142627 146637 146085 151366
12577 151366 144456 132844 121559 117494 124320 117227 112537 110696 111931 100574 81990 80469 85011
12564 85011 100264 108800 113628 105407 92585 90285 71307 55835 48172 57512 65327 71129 80048
12551 80048 79182 75382 62125 61236 45209 29611 41354 44252 47492 43622 24605 22074 25090 22237
12537B2237O468K774K953L975J5224J2257Q821L787j8279J2120R958L481O146
12524I1922J6967q657o134q736j6307J960n334m489J2190n62M63j5465o573M345
12510E5590J9532J1773q88k5933j2486R277J5313P913J2258J2063J553j4808j5583
12497G5574j906J2207J3427j3018p583j7579q349m00k048p799j2137q716K781
12484B4454O409R884M184m898o067K951J2919O512N19K599L262k290Q066r157
12470E9347j2848j3375j4004j321l884P70L0429K7649r89o260q498r920j0248
12457C6848q270J6753K0064K454r948K811j5482j7911n449M022O655R886J031
12444D3464N195j0507j9057j8218J0527J7724J004Q962Q587p909n847R148q145
$$ plain form
12537 22237 28705 31479 34432 38407 53631 65888 74709 78496 60217 72337 82295 85776 91922
12524 91922 108889 100232 94098 85362 69055 71015 65681 61192 73382 72820 73283 57818 51245 55590
12510 55590 75122 86895 86007 60074 47588 56865 72178 80091 92349 104412 105965 91157 75574
12497 75574 73668 85875 99302 86284 78701 61122 52773 52373 50325 42526 30389 21673 24454
12484 24454 30863 40747 44931 40033 33966 36917 49836 56348 56867 59466 62728 60438 68504 59347
12470 59347 46499 33124 19120 17799 13915 14685 45114 72763 71774 65514 57016 47096 36848
12457 36848 28578 45331 65395 67849 57901 60712 45230 27319 21870 25892 32547 42433 43464
12444 43464 48659 38152 19095 877 11404 29128 30132 39094 47681 39772 33925 43073 34928
12431C4928q602Q35J591m521k891M871o676j5406J1468n473L776J3377O428K628
12417C6333M606l663P182J191k5661j5271l184r65P309O86J789k709o73l51J3302
12402A9921K338J1163M718P590l507k5033o223M958o144K19N679M894n895j3465
12388A213j2806J1532J3071J2694j3253K877L337l562Q741J52j0714n250l917
12375D115L007K0873M730r027m71o879K852j1863r722Q43l480J0031J5147K692
12361B2848M125j2981O842o331J1155j596r18j2569o664p178J111N010J850J5606
12347B0310n888j1931p365l204J0747J233J1501n130J2243J8663j843N621O9j6253
12333B8773j5259J6490L627r873n993Q999j215o018J5211j5k314l460J8758P077
$$ plain form
12431 34928 26326 27161 28752 24231 21340 26211 19535 4129 15597 10124 13900 27277 33705 36333
12417 36333 40939 37276 44458 45649 19988 4717 1533 568 7877 8563 10352 7643 6970 6619 19921
12402 19921 22259 33422 38140 45730 42223 17190 10967 15925 9781 10000 15679 20573 14678 1213
12388 1213 -11593 -61 13010 25704 12451 15328 18665 15103 23844 23996 13282 8032 4115
12375 4115 7122 27995 32725 23698 23227 16348 19200 7337 -2385 -1542 -5022 5009 20156 22848
12361 22848 26973 13992 20834 14503 25658 24062 23144 10575 3911 -3267 -2156 2854 4704 20310
12347 20310 14422 2491 -4874 -8078 2669 3902 15403 10273 22516 41179 39336 44957 45026 28773
12333 28773 13514 30004 33631 23758 17765 26764 25549 19531 34742 34727 32413 28953 47711 54788
12319E4788p771J2261k749P619P202K1321o845L640J3410K5681O3367O6479R5872
12306C54275J36193J58925J61408J71153J64307J86318K24741J33285m1402k59324
12296A389879l84686l38910k33538j33349m5776m6823l0709k8219j5056o789r026
12285A16998l081m307M00j093j2823k0459j7273k1190j1317M980k637j2578O707
12272B2327K751k019J676K564K533p988j092k76j3654p22J1004k220m818J5132
12258B5198J0893J2714K537k3113j3650n584k656j2366r504o2J9304K345p398
12245a342J7817K0490k58j7404p626p80j3044l461R641l9R280R95Q763J916p720
12230A7228p441j3397N648K0238j303l935j7880p667M093l196m146J0945K877
$$ plain form
12319 54788 47017 59278 56529 64148 71350 92671 85826 89466 102876 128557 191924 258403 354275
12306 354275 490468 649393 810801 981954 1146261 1332579 1557320 1690605 1649203 1389879
12296 1389879 1005193 666283 432745 299396 253620 206797 176088 147869 132813 126024 116998
12285 116998 113917 109610 110010 108917 96094 75635 58362 37172 25855 30835 28198 15620 22327
12272 22327 25078 23059 24735 27299 29832 21844 20752 20476 6822 6100 17104 14884 10066 25198
12258 25198 36091 48805 51342 28229 14579 8995 6339 -6027 -15531 -15593 3711 6056 -1342
12245 -1342 16475 36965 36707 19303 11677 10897 -2147 -5608 4033 3994 13274 14269 23032 24948 17228
12230 17228 9787 -3610 2038 22276 20973 17038 -842 -8509 -4416 -7612 -11758 -813 2064
12217B064k057R48L831Q495J4425J7925n472j7953K30j3266j7474J7067N406q778
12203E391M987o644p515j2290J3298O656l359R139K441n143O629J3191m887j5700
12189F194j8420r79j1939P879J0876J0956K011k820p361l904j963J4335R138o21
12175A3382p658R58k177J993O751K774N32L115J0994Q238k090k6536j5401q13
12161e938N29n426k903m136l156P379K7823O453O623m31p780P492o651l257l787
12146A2834J997j5588L532K4939r99q089M414p741n849q423n345j024r92r05J512
12131e727l996O365M527j297j2465l258P003O167R685K7235J3827k181r890j6580
12117A9415o116q395o120m366m88L712J2501j556p034p91k542J4421M95l574M176
$$ plain form
12217 2064 7 955 4786 13281 27706 45631 40159 22206 22436 9170 -8304 8763 14169 5391
12203 5391 10378 3734 -3781 -16071 -2773 3883 524 9663 12104 6961 13590 26781 21894 6194
12189 6194 -12226 -13205 -25144 -17265 -6389 4567 6578 3758 -3603 -7507 -9470 4865 14003 13382
12175 13382 5724 6682 4505 6498 13249 16023 16555 19670 30664 38902 36812 10276 -5125 -5938
12161 -5938 -5409 -10835 -13738 -17874 -21030 -13651 14172 20625 27248 26817 19037 26529 19878 16621 12834
12146 12834 14831 -757 2775 27714 26715 18626 23040 15299 9450 1027 -4318 -5342 -6334 -7239 -5727
12131 -5727 -9723 -3358 1169 -128 -12593 -15851 -8848 -2681 7004 34239 48066 45885 35995 19415
12117 19415 13299 4904 -1216 -5582 -6070 -2358 10143 8587 1553 762 -1780 12641 13136 9562 13738
12102A3738J1778j2153j545M297r489r421j2254l281P855J1215R684q890o697
12089e163m714N351N942j491j56j6472j782O427n232M07j0230R57J4634J0321
12075a201J1561J4226j1373L006K503k0704m612P124o207n634J0816r340m355
12062a4190P184J1048r423j0805K672J930M671q507M124N032N057M87J318p537
12048f939k620L189R320Q684N088R122J2894j1200k0489j0414J2311J1716m014
12035A6648o007J127R948j4206j8069o272j690O096j14J1981m986m712J6338l455
12021B627r29J2074r18j8065q114M402R303K0920j137j0083K751M702m233j6456
12007c156j4960R488K228K883L378L420N112L624K983n027j1983p688L988P706
$$ plain form
12102 13738 25516 13363 11818 16115 6626 -2795 -15049 -18330 -10475 740 10424 1534 -5163
12089 -5163 -9877 -4526 1416 -75 -231 -16703 -18485 -12058 -17290 -16883 -27113 -26156 -11522 -1201
12075 -1201 10360 24586 13213 16219 18722 -1982 -6594 530 -5677 -11311 -495 -9835 -14190
12062 -14190 -7006 4042 -5381 -16186 -13514 -11584 -6913 -15420 -11296 -6264 -1207 -720 598 -6939
12048 -6939 -9559 -6370 2950 11634 16722 25844 38738 27538 7049 -3365 8946 20662 16648
12035 16648 10641 11768 21716 7510 -10559 -16831 -18521 -12425 -12539 -558 -5544 -10256 6082 2627
12021 2627 1698 13772 12854 -5211 -13325 -8923 380 21300 20163 10080 12831 17533 13300 -3156
12007 -3156 -18116 -8628 -6400 -3517 -139 3281 8393 12017 15000 9973 -2010 -9698 -5710 1996
11993A996n169j4914J2401J9477M454k373J1284k784j8412P36j139J5762k6m745
11979A6548p972j2850P117R776J546k148j1598n960O115Q580R584Q345k999o969
11965A7115L215j0148J0834P539j7361j4099M257J0604J3542j2567K255N477J912
11952B2575N725l301j0746j1213n699J910J7237J1738n570n21K071q934J0827
11939B6099J1873j5703j8444j0457J1430J3544M720l942J6870L351p835q348o955
11926A6203N72j9485j7383K766K94O328J5608J6134k483n897m765j753q180K561
11912E20J2123L468j2639j8396l268n20j298K794K110j1846L085J8176J9438q071
11898E676j4507j2889L734J2512J5560k306M642p610q828R848j805l733j2008
$$ plain form
11993 1996 -3173 -18087 -5686 13791 18245 15872 27156 24372 5960 6696 5557 21319 21293 16548
11979 16548 8576 -4274 2843 12619 14165 12017 419 -5541 574 9154 18738 27083 24084 17115
11965 17115 20330 10182 21016 28555 11194 -2905 1352 11956 25498 12931 15186 20663 22575
11952 22575 28300 24999 14253 3040 -2659 -749 16488 28226 22656 22135 24206 15272 26099
11939 26099 37972 22269 3825 -6632 4798 18342 23062 19120 35990 39341 31506 23158 16203
11926 16203 16775 -2710 -20093 -17327 -17033 -10705 4903 21037 18554 12657 7892 6139 -2041 520
11912 520 12643 16111 3472 -14924 -18192 -18712 -20010 -17216 -15106 -26952 -23867 -5691 13747 5676
11898 5676 -8831 -21720 -17986 -5474 10086 7780 12422 4812 -4016 5832 4027 294 -11714
11885a1714J205L991J1502m015j36O976M641j9394p191Q478R59P428J4501L771
11871B1002P314k875m87M333j0987k1725P19J265m334J0490k815l943J4060K988
11857A5005j7746K026O344n951n406M906J0678M904M188o489r809J0475N902k1398
11843b371M87J5738o515K233K230O898k620m217M205J338q42j2139j1971o302
11829a3848M273J0013R5j1373m592n929J0811Q478J632J0433n673j2551J1628
11816C397K162L269J709j9524M102K444k057p702J771k871p124l504O029Q578
11802i321J1176K2210N337J041j689q882J1677J017j1114q648j0504L845Q67J3954
11788B0966L204j3119M945O175k332o092l489K451j3440m774k139K1580o249r608
$$ plain form
11885 -11714 -10509 -6518 4984 969 833 7809 12450 -6944 -14135 -5657 -4698 2730 17231 21002
11871 21002 28316 25441 24954 29287 18300 -3425 -2706 -1441 -5775 4715 1900 -2043 12017 15005
11857 15005 -2741 -715 5629 -322 -5728 -822 9856 14760 18948 12459 2650 13125 19027 -2371
11843 -2371 -1884 13854 7339 9572 11802 18700 16080 11863 16068 17406 16564 4425 -7546 -13848
11829 -13848 -9575 438 533 -10840 -15432 -21361 -10550 -2072 -440 9993 4320 -8231 3397
11816 3397 5559 8828 10537 -8987 -4885 -2441 -4498 -12200 -10429 -13300 -20424 -23928 -17899 -9321
11802 -9321 1855 24065 29402 30443 28754 19872 31549 32566 21452 12804 2300 6145 7012 20966
11788 20966 24170 11051 15996 22171 19839 13747 10258 12709 -731 -5505 -7644 13936 7687 -1921
11774a921l785j221l09k663J1719j0943j0578j337R818k531j0680m480R160J2371
11760g380J7636j8908r96P744M904L890j5220Q408J2788p025o911K880n079K773
11746d96k302j5317J0456k808m996K926J7607Q634J948l908j7070j9415J515J0119
11732a3107J4940K361N119j2588M651J6779j6297r998j5034O11K1935o17k196
11719c441m158n270J4879K2000j2366k0206k5180q341K0490J0252J054N675l15
11706d927k837j9092J4344J6102J8187J2411j2825j4205r889P109Q028j1112j3234
11693a1940N65J371K457N624L527P01K430n139J498j180j068j967j1289j312L855
11678a1867Q042K342O566l880l51k963j0346j2135l392l741J0340J2730l602J1760
$$ plain form
11774 -1921 -5706 -6927 -7236 -9899 1820 -9123 -19701 -21038 -11220 -13751 -24431 -28911 -19751 -7380
11760 -7380 10256 -8652 -9648 -1904 3000 6890 -8330 78 12866 5841 -1070 1810 -3269 -496
11746 -496 -2798 -18115 -7659 -10467 -15463 -12537 5070 13704 15652 11744 -5326 -24741 -23226 -13107
11732 -13107 1833 4194 9313 -3275 1376 18155 1858 -8140 -23174 -22563 -628 -1245 -3441
11719 -3441 -7599 -12869 2010 24010 11644 -8562 -33742 -42083 -21593 -11341 -10287 -4612 -4927
11706 -4927 -7764 -26856 -12512 3590 21777 34188 21363 7158 -2731 4378 12406 1294 -11940
11693 -11940 -11375 -10004 -7547 -1923 1604 2305 4735 -404 1094 -86 -1154 -3121 -14410 -15722 -11867
11678 -11867 -3825 -1483 5083 1203 852 -2111 -12457 -24592 -27984 -31725 -21385 -8655 -12257 -497
11664d97J5445o174r575k82j214n226j2298m673O908O861R16J0761k268K956K589
11649D229l933j7160k957m960K499K0296K8965q206j5598K1479J8267K5464J5662
11636H4047q992k7316l5446j3053j0655J577L853J7523p917n777K537p85l182
11623c586m094J649L323L588l872m877k007m323R25O788P870p967l919P736R365
11608F599J2291K686j741r699R12o783l450J2879M738j2354p798J0227j993l471
11594C043K23p201Q695q565J917R548r318p951j463K93J571k1393l890J1901J3301
11579i289J7367P767j1008Q87r364L208J373P210O260j1950k871j0839M455q600
11565a5394J328J0911K879m86p92m342l397l079R225m807p67O773L468l356r774
$$ plain form
11664 -497 14948 8774 -801 -1083 -2297 -7523 -19821 -24494 -17586 -10725 -9809 952 -1316 1640 4229
11649 4229 296 -16864 -19821 -24781 -22282 -1986 26979 18773 3175 24654 42921 68385 84047
11636 84047 75055 47739 12293 -760 -11415 -9838 -5985 11538 3621 -2156 381 -404 -3586
11623 -3586 -7680 -6031 -2708 880 -2992 -7869 -9876 -14199 -13274 -6486 1384 -6583 -10502 -2766 6599
11608 6599 18890 21576 19835 10136 11048 4265 815 13694 18432 6078 -1720 8507 6514 3043
11594 3043 3266 -3935 4760 -3805 -1888 7660 -1658 -9609 -11072 -10779 -9208 -30601 -34491 -22590 -9289
11579 -9289 8078 15845 4837 5724 -3640 -432 941 8151 14411 2461 -410 -11249 -6794 -15394
11565 -15394 -14066 -3155 -276 -762 -1554 -5896 -9293 -12372 -3147 -7954 -8721 -1948 1520 -1836 -11610
11550a1610j845J2628R166j1530n210o47j161J1761N033J631L426J3546j0699
11537A4489m113r565m375l450j566n950J5010m127k0884j0291J3896R99m359J0882
11523a3404k349J2608R2o501j0956N224M37K096R649m366R124m997j7683M784
11509a6242K154P718o676k3832P487j270J6880P260j3720m34J0157J7250M102
11496A0834r123p54O011M791N453j2673q840L508j436p171P694J8832L738j4947
11482E917r062P673L030k182j1118q319j2499L932O250Q659L713J9864j5504m828
11468d474k863r54J0916N56o887N49m700j4952l919K853Q694J2146j0601j2486
11454b6122r288j51M206R797J1119j812J5400J4933J776j4424j632m210j1006
$$ plain form
11550 -11610 -13455 -827 8339 -3191 -8401 -9048 -10209 1552 6585 8216 11642 25188 14489
11537 14489 10376 811 -3564 -7014 -8580 -14530 480 -3647 -24531 -34822 -20926 -19927 -24286 -13404
11523 -13404 -15753 -3145 -3053 -9554 -20510 -15286 -14849 -12753 -3104 -7470 1654 -3343 -21026 -16242
11509 -16242 -14088 -6370 -13046 -36878 -29391 -30661 -13781 -6521 -20241 -20675 -10518 6732 10834
11496 10834 1711 957 6968 11759 17212 4539 -4301 -793 -2229 -9400 -1706 17126 20864 5917
11482 5917 -3145 4528 7558 5376 -5742 -14061 -26560 -22628 -16378 -7719 -4006 15858 354 -4474
11468 -4474 -7337 -8291 2625 3181 -3706 -3157 -7857 -22809 -26728 -23875 -15181 -3035 -13636 -26122
11454 -26122 -35410 -35561 -31355 -21558 -10439 -12251 3149 18082 19858 5434 3802 -408 -11414
11441a1414j7481k356j1758K5539J6802J3836l725j1332J6998K237p217m166L960
11428I923l655j070p38p613m451J5940J6806L512j3712k2406k364J1696k185N08
11414A91K047j5255J531j5490P79J0421J1640j0600j0410r699K0685K518N194
11401f448j0962R568J9833o311n522j0642k2142k805J0073N861k022k281p165
11388c0965P993j0619j6431K6350J7776N963M280l772L491J1528R617j0597j0826
11375C788N822j900j0826j093P541J4134q798q497j0510r277J0913L199K276N328
11361B100j2593l549K1765j5332o164k438J0873J1835k992l308q834L151J1702
11348F216j0477k543Q45o643J5315N489L210j3460j979k57n093O687o969O333
$$ plain form
11441 -11414 -28895 -31251 -43009 -17470 -668 13168 9443 -1889 15109 17346 10129 5963 9923
11428 9923 6268 5198 4460 -3153 -7604 8336 25142 28654 14942 -7464 -9828 1868 -317 191
11414 191 2238 -13017 -11486 -26976 -26197 -15776 -4136 -14736 -25146 -34845 -14160 -11642 -6448
11401 -6448 -17410 -7842 11991 5680 158 -10484 -32626 -35431 -25358 -19497 -21519 -23800 -30965
11388 -30965 -22972 -33591 -50022 -23672 -5896 67 4347 575 4066 15594 25211 14614 3788
11375 3788 9610 7710 -3116 -4209 3332 17466 8668 171 -10339 -19616 -8703 -5504 -3228 2100
11361 2100 -10493 -14042 7723 -7609 -13773 -16211 -5338 6497 3505 197 -8637 -5486 6216
11348 6216 -4261 -6804 -5959 -12602 2713 8202 11412 -2048 -4027 -4284 -9377 -2690 -9659 -3326
11334c326J8547n710j2415n14J4257R011J5844N88j2509l227j1010j1301M996
11321C231j3880L26j787J5579O959j9227o517J0115M190p875J800J4973J0074
11308A7961o160l446J6783q937k1353K562m570n498j7233K807o172K0325j3041
11295b5972j0877J3573K4740N006J528K52Q796J2093k1160q690J6500R95j3458
11282C326p88m52R4k737O142j1440j0565J567Q926K6554j767j0785q548j0876
11268a1349j1725Q02K667j190M108J242k928n557K730N727M486L760M006L296
11254G5K972J8836J8126p770r718j4785j3865n847L974M82J459R188M262K420
11240I809j5450j3077P63K6185K2916p079o152o898O57l571M690k868k799n283
$$ plain form
11334 -3326 15221 9511 -2904 -3418 10839 19850 35694 36282 23773 20546 9536 -1765 3231
11321 3231 -10649 -10323 -12110 3469 10428 -8799 -15316 -5201 -1011 -8886 -7086 7887 17961
11308 17961 11801 8355 25138 16201 -5152 -2590 -7160 -12658 -29891 -27084 -33256 -12931 -25972
11295 -25972 -36849 -23276 1464 6470 7998 8250 17046 29139 7979 -711 15789 16784 3326
11282 3326 2538 2086 2180 -557 5585 -5855 -16420 -14853 -5927 20627 18860 8075 -473 -11349
11268 -11349 -23074 -22272 -19605 -20795 -16687 -15445 -18373 -23930 -21200 -15473 -10987 -7227 -3221 75
11254 75 3047 21883 40009 32239 22521 7736 -6129 -11976 -8002 -7520 -6061 3127 7389 9809
11240 9809 -5641 -18718 -17955 8230 31146 24067 17915 11017 11674 8103 12793 9925 7126 1843
11226A843j079Q185k353n11j4199J3278O984L907r12j336n598p833K39P687J436
11211I738j3262J032q065j7060j0738j11J9427N627J297Q128O36J0353N639k735
11197I906m639o762j1968k23j940K996J1203J0763n869j1300J633J70j0402k082
11183a8514q681n832J2834M052J7890k674j6016l583L511P313J0146R911j071
11170I286r065l111j2487n17M037n76o549J901P649k498J6050j609o758j432M385
11155a294n58j4634q04J2090P629N430o095L907q938R244R169q322j5796k178
11141a1150J8225o496n696j255l953Q72n542L489o173n39m911L897K0367M185
11127E320J1929Q493q289q244Q487P622j0277k215K778n378j9080j1890k055P538
$$ plain form
11226 1843 764 8949 6596 6085 -8114 5164 12148 16055 15143 13807 8209 376 615 8302 9738
11211 9738 -3524 -2492 -10557 -27617 -38355 -38466 -19039 -13412 -12115 -3987 -3351 7002 12641 9906
11197 9906 5267 -1495 -13463 -13686 -15626 -12630 -1427 9336 3467 -7833 -6200 -6030 -16432 -18514
11183 -18514 -27195 -33027 -20193 -16141 1749 -925 -16941 -20524 -17013 -9700 446 10357 9286
11170 9286 221 -2890 -15377 -15894 -11857 -12433 -18982 -17081 -9432 -11930 4120 2511 -4247 -5679 -1294
11155 -1294 -1852 -16486 -17290 -5200 2429 7859 1764 5671 -3267 5977 15146 6824 -8972 -11150
11141 -11150 7075 579 -5117 -6372 -10325 -9453 -14995 -11506 -17679 -18218 -23129 -19232 1135 5320
11127 5320 17249 25742 17453 9209 17696 25318 15041 12826 15604 10226 -8854 -20744 -22799 -15261
11113a5261J4060k57M395J2724J5576o825j3816P279q890o177p788q540j821m256
11099a9597Q453J2765l147K353k278j1836l353J0552J7495r780l735r084r60n777
11085a7929o40o350J2473K5168j5502p217N738j0238j2627J4357O972p989P13
11072a3071O716p484k700O264q571O340R45q454O411p042L849L022r82l301j348
11057a9406Q672L732R799J1384j0965j7628J2180J4901k934j3693j1236L956K900
11044h338k183R96M439J0978J0468J0710n931j2389q075J3280q067n407L3j662
11030a148q85n618o459o79J0476J1613K37j3075N790J986j8696n667R992J98m508
11015a6443r203k379J9125M940J1316R457m872j1881j0551o367L331J3068L510
$$ plain form
11113 -15261 -1201 -1458 2937 15661 31237 24412 10596 17875 8985 2808 -4980 -13520 -15341 -19597
11099 -19597 -11144 1621 -1526 827 -1451 -13287 -16640 -6088 11407 1627 -2108 -11192 -12152 -17929
11085 -17929 -18569 -24919 -12446 12722 -2780 -9997 -4259 -14497 -27124 -12767 -5795 -13784 -13071
11072 -13071 -6355 -13839 -16539 -10275 -18846 -12506 -11561 -20015 -13604 -20646 -16797 -13775 -14757 -18058 -19406
11057 -19406 -10734 -7002 2797 14181 3216 -14412 -2232 12669 9735 -3958 -15194 -11238 -8338
11044 -8338 -10521 -9525 -5086 5892 16360 27070 21139 8750 675 13955 5888 481 514 -1148
11030 -1148 -2033 -7651 -14110 -14789 -4313 7300 7537 -5538 252 2238 -16458 -22125 -12133 -11935 -16443
11015 -16443 -25646 -28025 -8900 -3960 7356 16813 11941 60 -10491 -16858 -13527 -459 3051
11002C051j384J2582k880J006r293j679N821R462j0554M67j008Q330P823n525
10988A6219l282j0596n838o871j1401M413J0966Q015O565k01m072o862l362J295
10974e012n627M770j383q766N299P482K354J373l731k230J5145R169J0453n225
10960B4071k1756l911M252j8776m663r06p364N664m036k2947O864J1572J7541
10947a4395Q978j880l866m721n152J7626K252j611j518Q009n010K938j745J0386
10933A0291k473O882M780P111m596j7765p118L713j8015L847o047k74o47J925
10919a8386M427J5211j003j5779L938J2581J0000o343k7064p917J0965J6527l140
10906e983J3625J5902o357q11J0419j2470j5440l935L877R973P813K875M701k0200
$$ plain form
11002 3051 1667 14249 11369 12375 3082 1403 7224 16686 6132 6599 5591 13921 21744 16219
10988 16219 12937 2341 -3497 -10368 -21769 -17356 -6390 1625 8190 7989 3917 -2945 -6307 -5012
10974 -5012 -10639 -5869 -7252 -16018 -10719 -3237 -883 490 -3241 -5471 9674 18843 29296 24071
10960 24071 2315 -1596 2656 -16120 -20783 -21689 -29053 -23389 -27425 -50372 -43508 -31936 -14395
10947 -14395 -5417 -7297 -11163 -15884 -21036 -3410 -1158 -2769 -4287 3722 -1288 1650 -95 10291
10933 10291 7818 14700 19480 26591 21995 4230 -2888 825 -17190 -13343 -19390 -19664 -20311 -18386
10919 -18386 -13959 1252 249 -15530 -11592 989 10989 4646 -22418 -30335 -19370 -2843 -5983
10906 -5983 7642 23544 17187 16376 26795 14325 -1115 -5050 -1173 8800 16613 19488 24189 3989
10892C989n619l374j8600l358J5931J5735O072j291J3670l264k7984j0957L00
10879a8750L121q148J903Q142n033j4719Q084j2287Q498O333J5092J5198j5669
10866h235N438P383k7022o66l13J2037L18P605j3655j8805L453J3085o98K596
10852a7479l828n639R52p641J1062n136N889R742Q301l474p387J923L189P154
10838b372O757K693j580j3879j2151j3180k706Q838n70j7158R408J8696J4366
10825b838M866N919M865M424N602m3j8503r53j0154K42J1295O017j5486n927J5490
10810D816M885r462J312K93j0647O003R29P272O719j1296k5096Kj2601k817K6577
10795a3111J4621k267r818O553q227O634O364R543K431M542L646k4413o064J581
$$ plain form
10892 3989 -1630 -5004 -23604 -26962 -11031 4704 10776 9485 23155 19891 -8093 -19050 -18750
10879 -18750 -15629 -23777 -21874 -13732 -18765 -33484 -25400 -37687 -29189 -22856 -7764 7434 -8235
10866 -8235 -2797 4586 -22436 -23102 -23415 -11378 -11060 -3455 -17110 -35915 -32462 -19377 -20075 -17479
10852 -17479 -21307 -26946 -25994 -33635 -22573 -27709 -21820 -12078 -3777 -7251 -14638 -12715 -9526 -2372
10838 -2372 4385 7078 5498 -8381 -20532 -33712 -36418 -27580 -28150 -45308 -35900 -17204 -2838
10825 -2838 2028 7947 12812 17236 22838 22795 4292 3339 -6815 -6573 4722 10739 -4747 -10674 4816
10810 4816 9701 239 1551 1844 -8803 -2800 -1871 5401 12120 824 -24272 -24270 -36871 -39688 -13111
10795 -13111 1510 -757 -10575 -4022 -12249 -5615 749 10292 12723 17265 20911 -3502 -9566 -7985
10781g985J3431jQ42P411j2560r350J4277J800n899M954Q932j0893k0297j8197
10767c3535r677J8182n830Q797J5939R376l2074k3399O392K3532K3512Q950J814
10754A1979r325J800O997L401q174l40M204K809m729L2j123K066j1090n062O432
10739a23M119r719p00j831q662j282J2862Q796m838k919q353L102p28J4111J4341
10724A8176n226j896j5843j796M663N243R581M292j1072m843j3596o034R255K182
10710f914r026P089M037P928j753j418m352j1756l421p61k840n138m3M055L040
10695b1273j533L94J8915J772k400M816J35J798m619n123j3895m561J1786M226
10681i562Q652r239N502m348l733L613R302q237M024L238J2890j5195l714O96
$$ plain form
10781 -7985 5446 5445 6287 13698 1138 -8212 6065 7865 1966 6920 15852 4959 -15338 -33535
10767 -33535 -43212 -25030 -30860 -22063 -6124 3252 -28822 -52221 -45829 -22297 1215 10165 11979
10754 11979 2654 4454 11451 14852 6678 6338 10542 13351 8622 8654 7531 9597 -1493 -6555 -123
10739 -123 3996 -5723 -6423 -8254 -16916 -18198 -5336 3460 -1378 -4297 -12650 -9548 -10276 3835 18176
10724 18176 12950 11054 -4789 -6585 -1922 3321 12902 17194 6122 1279 -12317 -18351 -9096 -6914
10710 -6914 -15940 -8851 -4814 3114 1361 -57 -4409 -16165 -19586 -20347 -23187 -28325 -28368 -24313 -21273
10695 -21273 -22806 -22412 -3497 -1725 -4125 691 826 2624 -1995 -7118 -21013 -25574 -13788 -9562
10681 -9562 -910 -10149 -4647 -8995 -12728 -9115 187 -8050 -4026 -788 12102 -3093 -6807 -6111
10667f111M741Q351j1537j188O08j3525j164J852M29R719N185R606J4825m595
10653A7196K90k714L914j6841r486l961P452J4932j708M373n740j0164N01M061
10639B105K889j1845k249K286J596j262Q352M964n419q042j5926R393m001M702
10625a2457L503p373k232o717J4222O992O300q288j5697j435n045o017m922j657
10611d0823O845K5789J4656J0294j1834k408r196j2357Q739P182j6184k79j0995
10598c0571l574K2558Q976n724N395n42k135J7436N207j2251l332q314j948j5728
10584b4547O81R512J382j555l500J0831M975J3453k237K536K820j1718q169R486
10570C950P953j627r424L391j4762k839J261J6484j762n818K163m040O816o92
$$ plain form
10667 -6111 -1370 6981 -4556 -5744 -5136 -18661 -19825 -17973 -17544 -7825 -2640 6966 21791 17196
10653 17196 17486 14772 18686 1845 -7641 -11602 -4150 10782 9074 13447 7707 -2457 -1956 2105
10639 2105 4994 -6851 -9100 -6814 -5218 -6480 1872 6836 1417 -6625 -22551 -13158 -17159 -12457
10625 -12457 -8954 -16327 -18559 -25276 -11054 -4062 2238 -6050 -21747 -23182 -28227 -34244 -39166 -40823
10611 -40823 -33978 -8189 6467 16761 4927 2519 -6677 -19034 -10295 -3113 -19297 -19576 -30571
10598 -30571 -34145 -11587 -2611 -8335 -2940 -3482 -5617 11819 17026 4775 1443 -6871 -8819 -24547
10584 -24547 -23866 -14354 -12972 -14527 -18027 -7196 -2221 11232 8995 11531 14351 2633 -5536 3950
10570 3950 11903 10276 852 4243 -10519 -13358 -12097 4387 2625 -3193 -1030 -5070 1746 1054
10556A054O106K830J458p450o874p396n147J1937J2428J714L764M755l442j8203
10542b466j0008m061J2204L82j068l571j592N882L714j4477j0853k1627R77J2949
10528c3615R575q107j4565J1803K4029P859j0094m321n971M981L688N314k2776
10515c2200J2539J5859n804j001J0953Q030m748p102L712J0145p388m957l984
10502e946j1910J0441M274k704l562J1497J5543j0959r425Q204K412O503P516
10489B1884j1498L796m559P505M921r937o961J126j196q990K537Q827J0167p821
10475I801k0551m006J695P744M744j5530j6936P870J407M995L528M747P02q613
10461a8403m034K304J151M062J1969m227q360J1899n259k678N645j908j3228n182
$$ plain form
10556 1054 7160 9990 11448 3998 -2876 -10272 -15419 -3482 8946 10660 14424 19179 15737 -2466
10542 -2466 -12474 -16535 -4331 -3949 -5017 -8588 -10180 -4298 -584 -15061 -25914 -47541 -46564 -33615
10528 -33615 -24040 -32147 -46712 -34909 -10880 -3021 -13115 -17436 -23407 -18426 -14738 -9424 -32200
10515 -32200 -19661 -3802 -9606 -10607 346 8376 3628 -3474 238 10383 2995 -1962 -5946
10502 -5946 -17856 -7415 -3141 -5845 -9407 2090 17633 6674 -2751 5453 7865 14368 21884
10489 21884 10386 14182 9623 17128 22049 12112 5151 6277 5081 -3909 -1372 7455 17622 9801
10475 9801 -10750 -14756 -13061 -5317 -573 -16103 -33039 -25169 -23762 -18767 -15239 -10492 -9790 -18403
10461 -18403 -22437 -20133 -18982 -14920 -2951 -7178 -15538 -3639 -8898 -11576 -5931 -7839 -21067 -26249
10447b6249J4254p01n510l946l108J7655J4002o871j2114N937J333K964R126L847
10433A0619j1287n288J849J337j719j2888k2721M233J6416K488q15Q364r437o97
10419a9546J227o389j0887J4208J3150J3885j4083o188O198m640j6115m989M517
10406b9652J4102J2498j1765k257l06k744K434N995o112lJ7088M476j1973j3555
10392b1774J7123J6417k782M42O852R076j5625p748q090j6566n913K4679J0943
10379G034J3609k182m491L114k768J3122J5865K0700K3373K2596M3561K7849J5707
10366A97089J4607k702p694j0744k9615l1811l1101k0432l1936o258L039J826
10354D4268j1796j5959M004J6138l940K101o92o119J0295j052k1412J3450P424
$$ plain form
10447 -26249 -11995 -12696 -18206 -22152 -25260 -7605 6397 -474 -12588 -6651 -5318 -2354 6772 10619
10433 10619 -668 -5956 -4107 -2770 -4489 -17377 -40098 -35865 -19449 -16961 -17776 -9412 -18849 -19546
10419 -19546 -18319 -24708 -35595 -21387 -8237 5648 -8435 -14623 -8425 -13065 -29180 -34169 -29652
10406 -29652 -15550 -3052 -14817 -17074 -17380 -20124 -17690 -11695 -17807 -17810 -722 3754 -8219 -21774
10392 -21774 -4651 11766 8984 9426 16278 25354 9729 1981 -6109 -22675 -28588 -3909 7034
10379 7034 20643 18461 13970 17084 14316 27438 43303 64003 87376 109972 153533 181382 197089
10366 197089 211696 208994 201300 190556 160941 129130 98029 77597 45661 39403 42442 44268
10354 44268 32472 16513 20517 36655 32715 34816 34124 28005 38300 37248 15836 29286 36710
10341C6710K0618J9669K7402J0591J6587L1036J9547J0685N419Q560j2695j7016
10329A77113j0672q622j5654k2446k5233k5796l5114o187j1362j2471n460m960
10317f864O402O894p78m566J234P530j716p408n719J6454M729j147m085j2265
10303a305p309L791P211L376N454Q362J0540p14j5944q951m521P218M64m709j0552
10288g589O287J0590j442J1449R737J5737j7589j9360o634j6589J7673O70j490
10275A450J2535R585l539m168P207K186K585M765L099J691J177L906L683k329
10261D3833N013o699j6495j0111K157P435j22r52n514R736J1432L435l137o287
10247C3724n587J6022p698J1669L0073J3905J9953J7924j0011n749j160j3021
$$ plain form
10341 36710 57328 76997 104399 114990 131577 162613 182160 192845 198264 206824 194129 177113
10329 177113 166441 157819 142165 119719 94486 68690 33576 27389 16027 3556 -1904 -6864
10317 -6864 -462 6432 5654 1088 2322 9852 8136 728 -4991 11463 16192 15045 10960 -1305
10303 -1305 -8614 -4823 2388 5764 11218 19580 30120 29406 13462 4511 -10 7208 7672 2963 -7589
10288 -7589 -1302 9288 7846 19295 29032 44769 27180 7820 1186 -15403 2270 2940 1450
10275 1450 13985 23570 20031 15863 23070 25256 27841 32606 35705 37396 38573 42479 46162 43833
10261 43833 48846 42147 25652 15541 17698 25133 25011 24059 18545 28281 39713 43148 40011 33724
10247 33724 28137 44159 36461 48130 78203 92108 112061 129985 119974 114225 113065 100044
10235A00044k1778j8933j0743q76j9535k0619m874J088o327J510O584J0839J4131
10222C0511M019p119L686l611j2342o873j9599N478p83r161J7507J5205r632j2172
10208d886q463J0227N167J1759q704R10Q39l80r631m610K173J823n950M377j579
10193f928J8949R83j927J393J103O406n741o68j2316J223J5324K477j1966j6294
10179g982K186J7287N182j1705j2821n63n985k033m768O827j4243j8038J2698
10166c3958K5636J8054L578j5181j2567n978j084J0856P166O664j07r42j5651
10153a3514o853J3317J416K028K816Q84K612k522n142M187J0556J2889k736j3749
10139F189M635l775j0450k813r49o391K191J082o880q205P166k004Q389N728k006
$$ plain form
10235 100044 78266 59333 48590 47714 28179 7560 2686 3774 -2553 -1043 5541 16380 30511
10222 30511 34530 27411 31097 27486 15144 8271 -11328 -5850 -6633 -15794 1713 16918 7286 -4886
10208 -4886 -13349 -3122 2045 13804 5100 6010 6849 6469 -3162 -7772 -5599 -3776 -9726 -5349 -6928
10193 -6928 12021 13004 11077 12470 13573 19979 14238 13570 1254 2477 17801 20278 8312 -7982
10179 -7982 -5796 11491 16673 4968 -7853 -8416 -14401 -16434 -21202 -14375 -28618 -46656 -33958
10166 -33958 -8322 9732 13310 -1871 -14438 -20416 -21500 -10644 -3478 3186 3079 2137 -13514
10153 -13514 -20367 -7050 -5634 -3606 -790 94 2706 184 -4958 -771 9785 22674 19938 6189
10139 6189 10824 7049 -3401 -6214 -7163 -13554 -11363 -10281 -17161 -25366 -18200 -20204 -11815 -6087 -8093
10124h093J4452L674j936M39P22O04k946o90L883O348J662j76l620p483J5324
10109B2164j0956j4171o411M391n10j3335J995K0596J5388j1186j8062j213p543
10096a8853N929K9639R135j1063n846k2j6179q603n996n163K330P788L619Q438
10082d847J8787L584J2756J6273j5757j0432M695j149J558r582n373k500M862
10069A2875K818q313j8249J054O117J5089J2004R082J919J14j552r347j9141k851
10055A619J2584J1858R339k813k685Q019L8805O1592O6325O9215O9770N6017M3460
10042D43105Q9491J70781J08235j74785k68060j51159q0266m8140l0113j5440
10032D3649j6128N226N114p565j6266J069k0019j589m933Q926N576J8936q97m073
$$ plain form
10124 -8093 6359 10033 8097 8536 9258 9862 6916 6226 10109 16457 18119 17943 14323 6840 22164
10109 22164 11208 -2963 -9374 -4983 -5493 -18828 -16833 3763 19151 7965 -10097 -11310 -18853
10096 -18853 -12924 16715 25850 14787 8941 8919 -7260 -15863 -21859 -27022 -24692 -16904 -13285 -4847
10082 -4847 13940 17524 30280 46553 30796 20364 25059 23910 25468 15886 10513 8013 12875
10069 12875 15693 7380 -10869 -9815 -3698 11391 23395 32477 34396 34510 32958 23611 4470 1619
10055 1619 14203 26061 35400 32587 29902 37921 76726 138318 204643 273858 343628 399645 443105
10042 443105 532596 703377 811612 636827 368767 217608 137342 89202 59089 43649
10032 43649 27521 32747 37861 30296 14030 15099 -4920 -6509 -11442 -2516 3060 21996 21099 17026
10018A7026p121p880Q030M616j6898q308M957P121Q267l091O535r567o682J6142
10004A3147N306r021m05M604j3310L211j862p689l372L537O430j7253q73L3816
9990A6266R458r903N108N249n052n19p371p551p758j579Q764M13O206o75k519
9975H537O595k681j2191l228q823J2185N991q733N275J4569Q55J869j1600q396
9961B24P541P987K30r993j096K43r455L077K252j907N233M337N23R609O746Pj6911
9944H647q710r79m427N329j1520P58O398J07n190o906Q002J799J61J874j855q848
9928a5360q750P160K632k727M669K320J3066o893m428j674r09j662J4187J6434
9914A8065N859p258j1289l37m274J0679J821J1270J215m953K287j2959q64P504
$$ plain form
10018 17026 9905 2025 10055 14671 -2227 -10535 -5578 1543 9810 6719 13254 3687 -2995 13147
10004 13147 18453 9432 9027 13631 321 3532 1670 -6019 -9391 -5854 576 -16677 -17550 16266
9990 16266 25724 15821 20929 26178 21126 20607 13236 5685 -2073 -3652 5112 5525 11731 11056 8537
9975 8537 15132 12451 260 -2968 -11791 394 6385 -2348 2927 17496 18351 20220 8620 224
9961 224 7765 15752 15982 5989 4893 5136 -4319 -1242 1010 -897 4336 8673 9196 18805 25551 25558 8647
9944 8647 -63 -1042 -5469 -140 -11660 -10902 -4504 -4397 -9587 -16493 -8491 -6692 -6531 -4657 -6512 -15360
9928 -15360 -24110 -16950 -14318 -17045 -12376 -10056 3010 -3883 -8311 -9985 -10894 -12556 1631 18065
9914 18065 23924 16666 5377 5040 766 11445 13266 24536 25751 20798 23085 10126 9262 16766
9900A6766j840o441m616m108O045j4095n09J1988n518n990j0687N530N672O061
9886a742j2665R120J0979n169k0731L564J3108L422p093N458J6170q761j1101
9873e441K807j2015l400Q233j421O174n427J5566P540l32m903P518o832k059j0932
9858d924l241N968p064m744O633p2M17J2849R658r665l747J0830k685K969q618
9843D564N22N274P424O92r749p001L800o263j3430J0773R755N584k634L998K021
9828A5330J2856O86K60j6458J0034K5148R364M954O848K0104L7511M2328M0090
9815B09055N5270M8507M1236L9807O4611O1813K7812p4500j12372j10402n7429
9804A93408m1910l9414j3832j0878j6630m442l245j859l650J078M885p963j2089
$$ plain form
9900 16766 14926 8485 3869 -239 5806 -8289 -8798 3190 -2328 -8318 -19005 -13475 -7803 -1742
9886 -1742 -14407 -5287 5692 523 -20208 -16644 -3536 -114 -7207 -1749 14421 5660 -5441
9873 -5441 -2634 -14649 -18049 -9816 -11237 -5063 -10490 5076 12616 12284 7381 14899 8067 6008 -4924
9858 -4924 -8165 -2197 -9261 -14005 -7372 -7444 -7027 5822 15480 5815 2068 12898 10213 13182 4564
9843 4564 5086 10360 17784 18476 8727 1726 5526 -737 -14167 -3394 6361 11945 9311 13309 15330
9828 15330 28186 28872 29132 12674 22708 47856 57220 62174 69022 89126 126637 168965 209055
9815 209055 264325 312832 354068 393875 458486 520299 548111 473611 361239 250837 193408
9804 193408 151498 112084 98252 87374 70744 66302 63057 61198 57548 58626 63511 55548 43459
9791D3459m455R328J1497R40K43P30L425J2503M0793L6606L7161L7578N7452R2806
9777C80066R6143R2867J03359Q7467J10256J19265P4828p0977k07981k08686j57115
9766D19492j12557p9730m8795m0695l3333j1769r768j579M481J0567m208j8869
9754G3237j8644q153k699q556M556J4774J4018l521p518j486K20J3817K5923L2501
9740A28469L8196L8420N9613N0728M6407M5675N2003L7897r509p9669j10614p4507
9728B23109n3551m8951l3363j4446j6314j4509j1079O860J050j5398m817O04L087
9715B2282r47l613q070o733Q494K298K253k639J023l460L809Q634N884j892k203
9700B5120Q636p967q232q706N222m406r287q486o012R370J231j2576j9469k989
$$ plain form
9791 43459 39004 48332 59829 60769 61012 61742 65167 77670 118463 155069 192230 229808 287260 380066
9777 380066 476209 569076 672435 759902 870158 989423 1064251 993274 785293 576607 419492
9766 419492 306935 227205 178410 137715 104382 92613 82845 81266 85747 96314 92106 73237
9754 73237 54593 46440 43741 35185 39741 54515 68533 65012 57494 56008 56228 70045 95968 128469
9740 128469 166665 205085 264698 315426 361833 407508 459511 497408 487899 408230 297616 223109
9728 223109 169558 120607 87244 72798 56484 41975 30896 37756 38806 23408 18591 19195 22282
9715 22282 21335 17722 9652 2919 11413 13711 15964 13325 14348 10888 14697 23331 29215 27323 25120
9700 25120 33756 25789 17557 8851 14073 9667 380 -8106 -14118 -4748 -3517 -16093 -35562 -38551
9686c8551R905J3113R221P85l922j980p047O990J6874N483k51j497M343j0494
9672B972M549O351O705j3706k3789q392R427k491J8590J5552J630n59r127n080
9658B632p865J9073J3243o91m241m151j558j2503m440j4286j097K2298J1195l597
9644A4012q68O47j6323l651J6440m199O275j100r231P482R515l173q367q487q571
9629i599O335q83n587K864K1962p296j3831P960j8165p407J0731k107P863P322
9615A62J0923j688r05p705j2035j5423j0807J8130M791j2797P38P280K4032O46
9601E342j8165j3220J2172J2764P946j282j0191j2748K081J3775n4p518P662m717
9587f153m300M911J5669M32L307m05j6025j1113l74k016L433J726R138P741k2611
$$ plain form
9686 -38551 -28646 -15533 -6312 -5527 -9449 -11429 -18476 -11486 5388 10871 10620 9123 13466 2972
9672 2972 7521 13872 20577 6871 -16918 -25310 -15883 -18374 216 15768 17398 16839 7712 2632
9658 2632 -5233 13840 27083 26392 22151 18000 16442 3939 -501 -14787 -15884 6414 17609 14012
9644 14012 13144 13791 -2532 -6183 10257 6058 12333 11233 2002 9484 18999 15826 7459 -1028 -9599
9629 -9599 -3264 -4147 -9734 -6870 15092 7796 -6035 1925 -16240 -23647 -12916 -15023 -7160 162
9615 162 11085 9397 8492 787 -11248 -26671 -37478 -19348 -14557 -27354 -26616 -19336 4696 5342
9601 5342 -12823 -26043 -13871 -1107 6839 5557 -4634 -17382 -15301 -1526 -1580 -9098 -1436 -6153
9587 -6153 -10453 -5542 10127 10559 13866 13461 -2564 -13677 -14051 -16067 -12634 -10908 -1770 5971 -16640
9572a6640q125N234M62q242j0316n203N400J4307j0704j4803R018K1420R870P472
9558h50m924j0662Q776p924Q154P435R55r780j4972L283J7252N6J98k510m840
9543a0353P546R837O252p184m129j3398J238Q404r882L097K2318J4871m515n926
9529A8176j5294j1664k176K012J8457K045j3427o234K0312J1372j3359k2100k511
9516a4391J2586O543n304m438j393J3463N652p254K052J701j7750Q598r455r054
9502a8444j5898k858J6115J6382O867R749J4788M739l187j255r728j2682j8886
9489a4298o868K6682J5167M013P566j1277j8053r073J1049N568r597k2385o391
9476b7897Q999J878k622Q412P100r06k525n702M503n481P352J0470O879m336r747
$$ plain form
9572 -16640 -24765 -19531 -19069 -27311 -37627 -42830 -37430 -23123 -33827 -48630 -39612 -18192 -8322 -850
9558 -850 -5774 -16436 -7660 -15584 -7430 5 960 -8820 -23792 -20509 -3257 -3201 -3003 -5513 -10353
9543 -10353 -2807 7030 13282 6098 1969 -11429 -10191 -1787 -11669 -8572 13746 28617 24102 18176
9529 18176 2882 -8782 -10958 -8946 9511 11556 -1871 -8105 12207 23579 10220 -11880 -14391
9516 -14391 -1805 4738 -566 -5004 -6397 7066 12718 5464 7516 9217 -8533 65 -9390 -18444
9502 -18444 -34342 -37200 -21085 -4703 2164 11913 26701 31440 28253 26998 17270 4588 -14298
9489 -14298 -21166 5516 20683 24696 32262 20985 2932 -6141 4908 10476 879 -21506 -27897
9476 -27897 -18898 -17020 -19642 -11230 -4130 -5036 -7561 -13263 -8760 -14241 -6889 3581 10460 6124 -3623
9461c623l363P720K664j930l223R235J1732M84o833n451P931l599p216N215l113
9446F630m349M489r7q421o085J573R103j765o246q03m462J0233K081N751L176
9431A0808j0133q082r866J0387P747N181o125m489L702L634J6164k859k508O192
9417A9753K611p759N09k3412k1265R37K0182J7702O161M142l282q661o265n295
9403c942l4j5385j0968O114J275O385M199j127K2828Q223p828j1307q335l729
9389a3631J699k286K455m932l160R375J0375J3746o341j571M700M481P423n555
9375A6778k375j3021j7401N953K408L485J1104O877j9401J5k332n544J9615n681
9361D80m200O143R111J5236o244m651j219J212j0868p750Q780j2915r47J3810
$$ plain form
9461 -3623 -6986 734 3398 1468 -1755 7480 19212 19696 12863 7412 15343 11744 4528 9743 6630
9446 6630 2281 6770 6673 -1748 -7833 -6260 2843 1078 -5168 -5971 -10433 -200 1881 7632 10808
9431 10808 675 -7407 -17273 -6886 861 6042 -83 -4572 -870 2764 18928 16069 13561 19753
9417 19753 22364 14605 15114 -8298 -29563 -28626 -8444 9258 15419 19561 16279 7618 1353 -3942
9403 -3942 -3976 -19361 -30329 -24215 -22940 -16555 -12356 -13483 9345 17568 9740 -1567 -9902 -13631
9389 -13631 -11932 -14218 -11763 -16695 -19855 -10480 -105 13641 7300 5729 10429 14910 22333 16778
9375 16778 14403 1382 -16019 -10066 -7658 -4173 6931 13808 -5593 -5578 -7910 -13454 6161 480
9361 480 -3720 2423 11534 26770 20526 15875 14656 15868 5000 -2750 6030 -6885 -7832 5978
9347E978k275q947l55O438k920L263R466j25m954j0309j109M488n906l633l537
9332a4437n812J4112J6483n94j6056J1029J7270N224j4113j5898l421m443L407
9319g249Q865O468N245j0272n516M496k657L861n814j0083K858J732M173J2451
9305H558j1877O749M725q332l358l671k442O439j0848j318P85j3063K540K630
9291b2483M771J5191J4341J1122K360n958p290j017m063m50l803j0954K542Q832
9277C141J7064Q434l510j246J0484L068O841j0663J651o434n827P248k206N179
9263C3224J0531n580r473n985m316j3079J166j19M008k129l485k927O48J940M367
9248H791j420o689l419J7523J1040q396j4330J1595n012J929J1649M378j0902
$$ plain form
9347 5978 3703 -5244 -5599 839 -2081 1182 10648 10523 5569 -4740 -5849 -1361 -7267 -10900 -14437
9332 -14437 -20249 -6137 10346 9752 -6304 4725 21995 27219 13106 -2792 -6213 -10656 -7249
9319 -7249 1616 8084 13329 3057 -2459 2037 -620 3241 -2573 -12656 -9798 -8066 -3893 8558
9305 8558 -3319 3430 8155 -177 -3535 -7206 -9648 -3209 -14057 -15375 -14590 -27653 -25113 -22483
9291 -22483 -17712 -2521 11820 22942 25302 19344 12054 11037 6974 6524 2721 -8233 -5691 3141
9277 3141 20205 28639 25129 23883 34367 37435 44276 33613 35264 28830 23003 30251 28045 33224
9263 33224 43755 38175 28702 22717 18401 5322 6488 6369 10377 8248 4763 1836 2484 4424 8791
9248 8791 7371 682 -2737 14786 25826 17430 3100 14695 9683 11612 23261 27639 16737
9235A6737J1125L421J3500M743r306q684j415q697p2J3049J681Q671J3085J9657
9221G7495K1849M130o956J0984J8858J5330L945J6523K0379K9308M2653O1286
9209C15784Q6400J20752J69109K62350L52779M42949N20266N26567M49877M68626
9199C715459O44846P83371K59652q79493j388268j072991o46602l90813k56233
9190G68928j74355j26216p6923n7676m8075m7760k7649j8127k4771l3560j6426
9179A17390p222o881o236J0061J000l1671k3399J348L279l655q550j4782j3686
9166A6996O986J4173J971j761J5961m034r431R97q177m117O070j775j0251j0665
9152A2943q605N211Q012m656n855O796p12p464K387J1183K122L749m061m291o217
$$ plain form
9235 16737 27862 31283 44783 49526 40220 31536 30121 21424 21352 34401 36082 44753 57838 77495
9221 77495 99344 103474 96518 107502 126360 141690 145635 162158 182537 211845 254498 315784
9209 315784 402184 522936 692045 954395 1307174 1750123 2270389 2796956 3246833 3715459
9199 3715459 4360305 5143676 5403328 4523835 3135567 2062576 1415974 1025161 768928
9190 768928 594573 468357 391434 333758 285683 237923 210274 192147 167376 133816 117390
9179 117390 110168 103287 97051 107112 108112 76441 53042 54390 57669 54014 45464 30682 16996
9166 16996 23982 38155 40126 38365 54326 50292 40861 41858 33681 29564 35634 33859 23608 12943
9152 12943 4338 9549 17561 12905 7050 13846 13134 5670 8057 19240 21362 25111 21050 16759 10542
9137A0542M273J9319j8314j907L455k996j3408q74J0846N533L238k54n066p404
9123F983l880n884Q017l99m955l449n405Q250J4848j0229J0868j762q2l470J2855
9108B2306l287j4674m707N957Q809J546J7209R922k0525j3797O220m772j403n276
9094C528r91j225m776l066j0953r92K0306J0435j1071j884K5827n713j8986J608
9080B047R133J8411o608q137j5078o161Q507L980j6254j270q542J4426l234k1016
9066b9796J546Q258P338L94P872Q908l959l602l32N230Q36k419N243J664p601
9051d20m600J1126j2046Q602J2446q535j6273q200j091M571K637J399J91P011
9037c182m587j3991r062J6221J3785j568J575r2k428K296m237m929L410J1155
$$ plain form
9137 10542 14815 34134 15820 13913 17368 14372 964 90 10936 16469 19707 19453 14387 6983
9123 6983 3103 -2781 5236 4837 -118 -3567 -8972 -722 14126 3897 14765 13003 12921 9451 22306
9108 22306 19019 4345 -362 5595 14404 15950 33159 43081 22556 8759 14979 10207 8804 3528
9094 3528 2537 1312 -3464 -6530 -17483 -18475 1831 12266 1195 -689 25138 19425 439 2047
9080 2047 11180 29591 22983 14846 -232 -6393 2114 6094 -10160 -11430 -19972 -5546 -8780 -29796
9066 -29796 -28250 -19992 -12654 -12260 -4388 4520 561 -3041 -3373 1857 2693 274 5517 7181 -420
9051 -420 -5020 6106 -5940 2662 15108 6573 -9700 -17900 -18991 -14420 -11783 -10384 -10193 -3182
9037 -3182 -7769 -21760 -30822 -14601 -816 -2384 -809 -901 -3329 -1033 -5270 -10199 -6789 4366
9023D366r050R76J6903L873l471n64n669o329P51J156n64L483o132m140R40m439
9007g910P701K093M715k1387p762J6096Q552J514j0848k923k046O047L868J5852
8993A3562L617q997r37j587p331k610J2024M048J4807M385r553p603j0294j1911
8979h380N724Q080k502Q140j0814j5808J8507k386q826R928M189j5862M884J2778
8965G652J4275o832M65l808j183j4228j3198M394O981J1663M004K912k1497m029
8951a2429N361L969J84L383M466l32p111J2189J0461M724k287Q196j272m391k974
8936B2137l299p613m291k483P054N578M330n296J195Q468J31J1j2861l35m701
8921H025m324L205q223J3383K398n537M92P790J439Q854R846m402j6312j7333
$$ plain form
9023 4366 -4684 -3708 13195 17068 13597 13033 7364 1035 1786 2942 2378 5861 -271 -4411 -3471 -7910
9007 -7910 -209 1884 6599 -14788 -22550 -6454 2098 3612 -7236 -10159 -12205 -6158 -2290 13562
8993 13562 17179 8182 7245 5658 -1673 -4283 7741 11789 26596 30981 21428 13825 3531 -8380
8979 -8380 -2656 5424 2922 11062 248 -15560 2947 561 -8265 1663 5852 -10010 -5126 7652
8965 7652 21927 15095 15560 11752 10569 -3659 -16857 -12463 -5482 6181 10185 13097 -8400 -12429
8951 -12429 -7068 -3099 -2915 468 4934 4602 -2509 9680 20141 24865 22578 30774 29502 25111 22137
8936 22137 18838 11225 6934 4451 11505 17083 21413 16117 17312 25780 25911 25922 13061 12726 8025
8921 8025 3701 6906 -1317 12066 14464 8927 9419 17209 18648 27502 37348 32946 16634 -699
8907f99j824q296Q65k004J1310N341j0596p348J0832P781R537M46j6623l581R361
8892D502n170j3485O21M880J1599j079J904m707j8293j91M354R290M066p392l510
8877a2611K946M426n157l863J726O719J0301J1567j4542j3515j5389L14J1195
8864a5883R785k917l497j209L426J8419N108o640O11m762P107o842M015J3222
8850A9943j4007j5338p166R499J717m265p50p329r350P763K8545k700k371o575
8836b384j1227m027P838J2910k184R234P985p890l880k464Q847M804k711o485
8822H366n615R74k230j0372k5434j4066Q371J2475J5070J0521j5074o603j2182
8809c5799p361J4495J7489J5450j0240p353r389R22Q18R025r851N086O5o765M462
$$ plain form
8907 -699 -2523 -10819 -9954 -11958 -648 4693 -5903 -13251 -2419 5362 14899 15345 -1278 -4859 4502
8892 4502 -668 -14153 -13532 -8652 2947 1868 3772 -935 -19228 -19419 -15065 -5775 -1709 -9101 -12611
8877 -12611 -9665 -5239 -10396 -14259 -12533 -5814 4487 16054 1512 -12003 -27392 -27078 -15883
8864 -15883 -6098 -9015 -12512 -13721 -10295 8124 13232 6592 7203 2441 9548 2706 6721 19943
8850 19943 5936 -9402 -16568 -7069 -5352 -9617 -10367 -17696 -27046 -19283 9262 6562 4191 -2384
8836 -2384 -13611 -17638 -9800 3110 926 10160 18145 10255 6375 3911 12758 17562 14851 8366
8822 8366 2751 3725 1495 -8877 -34311 -48377 -40006 -27531 -12461 -1940 -17014 -23617 -35799
8809 -35799 -43160 -28665 -11176 4274 -5966 -13319 -22708 -21786 -20968 -11943 -21794 -16708 -16643 -23408 -18946
8794a8946J804r942m35P407J4466l900j988J8855O987n228j0964q575j711p227
8780a9397j62P484R80j3395k852J0440R243R926j2814p21J0347Q096L46M080p056
8765D545P75j599Q704J6817j718J309m390j8971P14J530Q50l08k30r73o702Q35
8749A188n151N914K544j25o44N38j835l687K0018q34p948k634O751m481N288j931
8733A2971j4769K4Q814k069n495M098J4388N056K446J2304k967j3434o83N116
8719B5800j0335K291O061m021q038m137J8739O787k1707k8758r668J2594K591
8706a1801J3855O406Q009j2372K30j415m268r111J000J1518O025Q816K392m009
8692A5275j2438M086N411j5532N896L975n027Q506J7630J4062p031k2016j388
$$ plain form
8794 -18946 -17142 -27084 -27519 -20112 -5646 -9546 -11534 7321 14308 9080 -1884 -10459 -12170 -19397
8780 -19397 -19559 -12075 -11095 -24490 -27342 -16902 -7659 2267 -10547 -11268 -921 7175 7521 11601 4545
8765 4545 5320 3721 12425 29242 27524 28833 24443 5472 6186 7716 8566 8258 8028 7055 353 1188
8749 1188 -3963 1951 4495 4370 3726 4264 2429 -1258 18760 17926 9978 7344 14095 9614 14902 12971
8733 12971 -1798 -1774 7040 4971 -524 3574 17962 23018 25464 37768 34801 21367 20684 25800
8719 25800 15465 17756 23817 19796 11758 7621 26360 33147 11440 -17318 -26986 -14392 -11801
8706 -11801 2054 8460 16469 4097 4327 2912 -1356 -10467 -9467 2051 8076 16892 19284 15275
8692 15275 2837 6923 12334 -3198 2698 6673 1646 10152 27782 41844 34813 12797 11409
8679A1409m633J772q174n975J0087Q360J6P207Q837p963q775m004N78K217N277
8664A6236r910q459J1394P105j068k450j3492R328P902j149j8681r383J4282O157
8650G812J396R327J1402k104O85J6289N951r409j3564r020K009m356J868O447
8636B4733O44q510q535k682L643J3770J3728K8n827L591j4664J261M585O516R065
8621D1346k2809l854J6243J0875k185J6488N751J255j0376K619J0931l646j9825
8608D2813K0051J575P023N24p076j1826J0603n39l652K281Q376o74p080N112J649
8593F9160l329J2969L312r762m248J4487j1467n724j3958j2362K94J9948j479
8580E7841k4182q703M378k377O253j3123n668J2837J0369J3232P697p942j2818
$$ plain form
8679 11409 6776 8548 374 -5601 4486 12846 12862 20069 28906 20943 12168 8164 8742 10959 16236
8664 16236 6326 -2133 9261 16366 15298 12848 -644 8684 16586 15437 -3244 -12627 1655 7812
8650 7812 9208 18535 29937 27833 28518 44807 50758 41349 27785 18765 20774 16418 18286 24733
8636 24733 25377 16867 8332 5650 9293 23063 36791 36819 30992 34583 19919 21180 25765 32281 41346
8621 41346 18537 14683 30926 41801 39616 56104 61855 63110 52734 55353 66284 62638 42813
8608 42813 62864 64439 71462 71986 64910 53084 63687 63148 59496 61777 70153 69479 62399 67511 69160
8593 69160 65831 78800 82112 72350 68102 82589 71122 65398 51440 39078 39372 59320 57841
8580 57841 33659 24956 29334 26957 33210 20087 14419 27256 37625 50857 58554 50612 37794
8567C7794j1951L447O898k04N340L525j1165j0715j2738n282J3029l256k409r161
8553C152j632K977j2802j1678J8379N401J598l374M20N555N649j582K613j5131
8539d55J702L85k262m513P177K377o588j2744p591M784K0234J5176j3312N84J156
8524F110K172q812m880N099l952N72M004p981J0662L26l969M777M829l609r11
8509D437J1418Q102n051k4964N579p81L013Q534j5528r74N434k936q399m786Q686
8494h216P488M274j27k915K073R650j1228p236l720O972J1059L395o827p259N238
8479B621N741l754M090J579j086j680l921j0771p493J2223k277j278J6331k498
8465G827P304J4745j923j1463k594j0420r065L273l000J838J4829L184N595r504
$$ plain form
8567 37794 25843 29290 36188 35984 41324 44849 33684 22969 10231 4949 17978 14722 12313 3152
8553 3152 1520 4497 -8305 -19983 -1604 3797 5395 2021 2441 7996 13645 12063 14676 -455
8539 -455 1247 1632 -630 -5143 2034 4411 -2177 -14921 -22512 -17728 2506 17682 4370 4954 6110
8524 6110 8282 -530 -5410 -311 -4263 -3691 313 -7668 2994 3320 -649 4128 8957 5348 4437
8509 4437 15855 23957 18906 -6058 -479 -1260 1753 10287 -5241 -6215 -781 -3717 -12116 -16902 -8216
8494 -8216 -728 3546 3419 504 2577 12227 999 -6237 -9957 -2985 8074 11469 4642 -2617 2621
8479 2621 8362 4608 8698 10277 9191 7511 3590 -7181 -14674 -2451 -4728 -6006 10325 7827
8465 7827 15131 29876 27953 16490 13896 3476 -5589 -2316 -5316 -3478 11351 14535 20130 10626
8451A0626o420Q124l992j4201q079k246K2164l57r537j0416P536J0517J1482k416
8437A2785L821n437q685J403k207p276N072J0597P526r333j0611K56M030j216
8423G25j036j5221L288l250M574j771o993L378J3801Q225J409l81r568J59l843
8408f504p833K084o998j7525l652J2068R863J287N918J2942J0806R970J1139l810
8394B9755j9133n918M697J7253J325j3240o078P716q95p205j2275k189K230p617
8380a1574p939R252Q179j0022M564K805q391R084K234J026O844j1559N051O530
8366F084j656L508M176j2576P414p838P428Q236k627J1378j0847k4159l982K0821
8352E360J0294q223k584j9568j1976L281K786P448j0997q633J1582J109l728p057
$$ plain form
8451 10626 4206 12330 8338 -5863 -13942 -16188 5976 5619 -3918 -14334 -6798 3719 15201 12785
8437 12785 16606 11169 2484 3887 1680 -5596 -524 10073 17599 8266 -2345 -2089 1941 725
8423 725 -311 -15532 -12244 -15494 -10920 -12691 -19684 -16306 -2505 5720 7129 6748 -2820 -2661 -6504
8408 -6504 -14337 -12253 -19251 -36776 -40428 -28360 -18497 -17210 -11292 1650 12456 22426 33565 29755
8394 29755 10622 4704 9401 26654 27979 14739 8661 16377 15482 8277 -3998 -6187 -3957 -11574
8380 -11574 -19513 -10261 -2082 -12104 -7540 -4735 -13126 -4042 -1808 -782 6062 -5497 -446 6084
8366 6084 4428 7936 12112 -464 6950 -888 6540 14776 12149 23527 12680 -11479 -15461 5360
8352 5360 15654 7431 4847 -14721 -26697 -23416 -20630 -13182 -24179 -32812 -21230 -20121 -23849 -30906
8338c0906L253P651J8883j687j923k451O646l511k829k093R662K067j7698j6472
8324c1408J2815J1451J0031p36m670L440O370J1082J665j3271j685M16m35p589
8310b524q663q302L252J8773R728o172p336k057M767k163n547J9292J0392j1180
8296A2260q723r089j3107p91Q315P862M186k458k749J738K223J175j1016O780
8282c394J1808p705j8119M805J1295L634J4044R226l356q404j1253J0827p582
8269E826j2810m938K967K980K936J0115j782k0576R044J0373Q423p92n398p259
8255h91l114m40q496p90q987R694J4669j231k466m758j0316K551J861j2222j204
8240b6140O408Q68J0233l605N943J2586L893n88J1277J134n725l556m404k641
$$ plain form
8338 -30906 -27653 -20002 -1119 -2806 -4729 -7180 -534 -4045 -6874 -8967 695 2762 -14936 -31408
8324 -31408 -18593 -7142 2889 2153 -2517 923 7293 18375 20040 6769 5084 5500 5065 -2524
8310 -2524 -11187 -19489 -16237 2536 12264 6092 -1244 -3301 1466 -697 -6244 13048 23440 12260
8296 12260 3537 -5552 -18659 -19450 -11135 -3273 913 -1545 -4294 -2556 -333 842 -10174 -3394
8282 -3394 8414 709 -17410 -12605 -1310 2324 16368 25594 22238 13834 2581 13408 5826
8269 5826 -6984 -11922 -8955 -5975 -3039 7076 5294 -15282 -6238 4135 12558 11766 6368 -891
8255 -891 -4005 -4445 -12941 -13731 -22718 -13024 1645 414 -2052 -6810 -17126 -14575 -12714 -24936 -26140
8240 -26140 -19732 -18864 -8631 -12236 -6293 6293 10186 9598 20875 22009 16284 12728 8324 5683
8226E683N721j0361P305J4869r680l377J644O272J1439l479o828l89k342r981
8212F496l339o322j98M210O626l020K34j0780j7222K345Q867M94j659M527N932
8197b809L277L575l975j367j773j351n120R675O486p651j3623P893k385M977P902
8182C731l003j4826n399k642O134J72j4306L049l222j667K2898R005J794o629
8168d911p101J082m262q647J1194O68N314q854m473J2464J3613j677k851J4251
8154A5810k236k782j5016m446K6533k416J764J498j4260j1051P875M85L882n000
8140F40r33L114p863P448P309l970P536J6650L568p335n784L342O51j0093j7802
8125c522j1430K630J3888p18l00K1540N649j2432L935p751n212K681K724l929
$$ plain form
8226 5683 11404 1043 8348 23217 13537 10160 11804 18076 29515 26036 19208 18819 16477 6496
8212 6496 3157 -3165 -3363 847 7473 4453 4687 -6093 -23315 -20970 -12103 -11609 -13268 -8741 -2809
8197 -2809 468 4043 68 -1299 -3072 -4423 -9543 132 6618 -1033 -14656 -6763 -9148 -4171 3731
8182 3731 728 -14098 -19497 -22139 -16005 -15833 -30139 -27090 -30312 -31979 -9081 -76 1718 -4911
8168 -4911 -12012 -10930 -15192 -23839 -12645 -11977 -6663 -15517 -19990 -7526 6087 4410 1559 15810
8154 15810 13574 10792 -4224 -8670 17863 15447 17211 18709 4449 -6602 1273 1758 5640 640
8140 640 -293 2821 -5042 2406 9715 5745 13281 29931 33499 26164 20380 23722 24373 14280 -3522
8125 -3522 -14952 -12322 1566 848 548 22088 27737 15305 19240 11489 6277 8958 11682 7753
8111G753m151L534n78n215j9828l885L704L0208J2138j9847n675q595n312k803
8097a8552J2644J0067M74Q861J4436j207j0540n116k051L637l177J683O459J2015
8083B9633l632M051k890k229m933k3725l03o06j6558J8132O478p060n588P626
8069a604q438K986J1951q992j4153P073J8345Q944o832J563m503k418p036r326
8055a2440K076L39j0268j90P528J6491N655m120l760J9866M162j0665j0796L149
8041G027k1100Q735m571l978J7708P380J1123J0231k4100j704J1045O92p043k209
8027I236P234O432k546m643r658K21R684n15M635Q133m489l028P978R183n651
8012C2206J0663m553o258k147L971L662m587L750J580l041J0035J2570J6595J8301
$$ plain form
8111 7753 3602 7136 6558 1343 -18485 -22370 -18666 11542 23680 3833 -1842 -10437 -15749 -18552
8097 -18552 -5908 4159 4633 13494 27930 26723 16183 11067 9016 12653 9476 11159 17618 29633
8083 29633 26001 30052 27162 24933 20000 -3725 -4028 -4634 -21192 -3060 3418 -3642 -9230 -1604
8069 -1604 -10042 -7056 4895 -4097 -18250 -11177 7168 16112 9280 10843 6340 3922 -3114 -12440
8055 -12440 -10364 -10025 -20293 -20483 -12955 3536 9191 5071 1311 21177 25339 14674 3878 7027
8041 7027 -14073 -5338 -9909 -13887 3821 11201 22324 32555 8455 6751 17796 18488 11445 9236
8027 9236 16470 22902 20356 15713 6055 6276 15960 15445 20080 28213 23724 20696 28674 37857 32206
8012 32206 42869 38316 32058 29911 33882 37544 32957 36707 38287 35246 45281 57851 74446 92747
7998I2747n48j7160j2947j0215j9550j4896N60K2033j2862M617o451j862J0128
7985C3594O524n976N297m404L294J300j6244j5480o7N553O559r395p017j2749
7971i211j976O26M510J4875K2100L686k0524R440J8755K023M794J457K802j1732
7957D1625j7666K6684R921j5712Q586O576J155q466l2486n682K3116N405j880
7944D1176J3603j3314q572j1683j7251l113M72m237L630J1714o311j1076j5067
7931b0029K3297J8354m332L67L041N384M6j612j4663l947J150k768J7040J0724
7917C2052j4416p42L185M451N254R448J2700Q168j5062j2309j2817q04J179p85
7903A9502Q917K058o838r357l571n005K204J1578M75j2327O645R376k630n621
$$ plain form
7998 92747 92199 75039 62092 51877 32327 17431 17991 40024 27162 31779 25328 23466 33594
7985 33594 40118 34142 39439 35035 38329 39629 23385 7905 7838 13391 19950 10555 3538 -9211
7971 -9211 -11187 -10561 -6051 8824 30924 34610 14086 23526 42281 44304 49098 50555 53357 41625
7957 41625 23959 50643 60564 44852 53438 60014 61169 52703 20217 14535 37651 43056 41176
7944 41176 54779 41465 32893 21210 3959 846 1318 -2919 711 12425 6114 -4962 -20029
7931 -20029 3268 21622 17290 17657 20698 26082 26128 24516 9853 5906 7056 4288 21328 32052
7917 32052 17636 16894 20079 24530 29784 39232 51932 60100 45038 32729 19912 19108 20287 19502
7903 19502 28419 30477 23639 14282 10711 5706 7910 19488 19963 7636 14281 23657 21027 15406
7889A5406k860M255k318r654R005J763O076p893j4869O756J2849k0025m961p342
7875a3812J1751n923o175r553J2656R170j180j3759K528p930n813L59R069M587
7861a4025j539l173J3592J8123M336j061M332l0p555p464j1151l540J165J0527
7847B537N58R677j7299j7512Q80N595K889J8201Q358j6727k261n199L702J5237
7833H636n881O238j1572p773P731M683m304o959m590p733q879J9511K3363L841
7819A6312j5007k1779R25l618P246J2103M26J2704K944j2226m023r420R78P226
7805e209K871M946P426l132j0014m598J4582O06k560j2313k345M061Lm086j2720
7790b2482O739o812K0130J2548J0189M483k7638j1074L789m06l530J4515M203
$$ plain form
7889 15406 12546 16801 14483 4829 13834 15597 21673 13780 -1089 5667 18516 -1509 -6470 -13812
7875 -13812 -2061 -7984 -14159 -23712 -11056 -1886 -3066 -16825 -14297 -22227 -28040 -27681 -18612 -14025
7861 -14025 -15564 -18737 -5145 12978 17314 16253 20585 20555 13000 5536 -5615 -9155 -7990 2537
7847 2537 3095 12772 -4527 -22039 -21159 -15564 -12675 5526 13884 -2843 -5104 -10303 -6601 8636
7833 8636 2755 8993 -2579 -10352 -2621 2062 -2242 -9201 -13791 -21524 -30403 -10892 12471 16312
7819 16312 1305 -20474 -19549 -23167 -15921 -3818 -3392 9312 12256 30 -3993 -13413 -12435 -5209
7805 -5209 -2338 2608 10034 6902 -3112 -7710 6872 7478 4918 -7395 -9740 -5679 -5676 -9762 -22482
7790 -22482 -15743 -22555 -2425 10123 20312 24795 -2843 -13917 -10128 -10534 -14064 451 4654
7777D654n291J0404M833j1647j9171r59J6733P052q575k2130o293J3075N299n552
7763a7568L585J3081k37k388K125M09J2017n298k7303j1364J7578M894J9188P627
7749A6346k6530p89N768K226j634j1216m753M501P180J2103J9233q779q549P412
7735A2519m091r019j6857O321J5512J8152r611p015K073Q932l921j152J1127p641
7721A5329r295R3N447P175k006R111J706j7413j3261r901o473K815K93J53J5748
7706d79N661P655J273r501j963j6992O977P260j841j0187N006J5002l746q905
7692d780n740j2014M21m963o905J3028M789J1365J1795J4700l922m29p257r95
7678I093K731Q878Q95j4764m598N535M82k118J2147J0983k3044r499J452K205
$$ plain form
7777 4654 -637 9767 14600 2953 -16218 -17177 -444 6608 -1967 -24097 -30390 -17315 -12016 -17568
7763 -17568 -13983 -902 -1139 -3527 -1402 -993 11024 5726 -21577 -32941 -15363 -10469 8719 16346
7749 16346 -10184 -10973 -5205 -2979 -4613 -15829 -20582 -16081 -8901 3202 22435 13656 5107 12519
7735 12519 8428 -591 -17448 -11127 4385 22537 12926 5911 7984 16916 12995 11843 22970 15329
7721 15329 6034 6127 11574 18749 16743 25854 27560 10147 -3114 -13015 -19488 -16673 -16380 -16227 -479
7706 -479 5182 12837 14110 4609 2646 -14346 -7369 -109 -1950 -12137 -7131 7871 4125 -4780
7692 -4780 -10520 -22534 -22113 -27076 -33981 -20953 -16164 -4799 6996 21696 17774 17345 10088 9093
7678 9093 11824 20702 21597 6833 2235 7770 8252 6134 18281 29264 6220 -3279 -1827 378
7664C78M264o582r93j293Q6P862Q274q5k835M349l901q558N894J738q177j9925
7648a9504P1J1740K5380J0764o29k1364j4067Q539J1967k85j1735j1572J6313
7635E618L396l931n253j485r44r76l682k680J1190m660j4398j0819L899p400j0677
7620d2802n649o66J1132J0582J1649J4195L58Q262M095j4150r313K155j1051m875
7606b6078L725Q257N086J3361j0936k0204q55J0743q377m594m855J3155J3456
7593h116Q053n646L453m314q562L711M740n896K455J7090k945o951J0961k0196
7579a2163m208N768J9290J0441k649r871n068M123Q39K61Q744P298m639j0811
7565G355r16n905o405j2804J1295K1548J785o335o727j6028j6219M886O492J4586
$$ plain form
7664 378 4642 -1940 -2933 -4226 -4140 3722 11996 11911 9076 13425 9524 966 6860 8598 421 -19504
7648 -19504 -19433 -7693 17687 28451 27822 6458 -7609 930 12897 12612 877 -10695 5618
7635 5618 9014 5083 -170 -1655 -2599 -3575 -7257 -9937 1253 -3407 -17805 -28624 -24725 -32125 -42802
7620 -42802 -48451 -49117 -37985 -27403 -15754 -1559 -1201 7061 11156 -2994 -12307 -10152 -21203 -26078
7606 -26078 -22353 -14096 -9010 4351 -6585 -26789 -27644 -16901 -25278 -29872 -34727 -21572 -8116
7593 -8116 -63 -5709 -2256 -6570 -15132 -11421 -6681 -12577 -10122 6968 4023 -2928 8033 -12163
7579 -12163 -16371 -10603 8687 19128 16479 6608 1540 5663 6502 6763 15507 22805 18166 7355
7565 7355 6439 534 -5871 -18675 -7380 14168 15953 9618 2891 -13137 -29356 -24470 -17978 -3392
7551c392j0538r070K814J9583M430j146j3908k154k753J0058n10R328K329l336
7537A735r601j0083j516J299R644J5311J7462J565l634p305Q68J8182M800r006
7523B9721r055j2395p827J5665L272j2023j4712j1478r71o52K276k864J441J9644
7509D2k103N016j43j8189M654j529j519L856P84L027j572m522K333N822J389L178
7493E24q1L103n308j5627j3313l612L991J6625K173j0703J2611L358j3872j460
7479b1591Q660N986j358J855J7085K504j4330J0078N013J742j0138j897Q321j769
7465A0161j4483j3540J2730J3513j983r792k003N952m019J2458j0114p34q811
7452a0665J56P941K1529J6894k610O324n410j4480o112j4395q630K442L482p583
$$ plain form
7551 -3392 -13930 -23000 -20186 -603 3827 2681 -11227 -13381 -16134 -6076 -6586 2742 5071 1735
7537 1735 -7866 -17949 -19465 -18166 -8522 6789 24251 25816 22182 14877 15745 33927 38727 29721
7523 29721 20666 8271 444 16109 19381 7358 -7354 -18832 -19803 -20455 -18179 -21043 -19602 42
7509 42 -2061 2955 2812 -15377 -10723 -12252 -13771 -9915 -9131 -6104 -7676 -12198 -9865 -4043 -2654 524
7493 524 443 3546 -1762 -17389 -30702 -34314 -30323 -13698 -11525 -22228 -9617 -6259 -20131 -21591
7479 -21591 -12931 -6945 -8303 -6448 10637 13141 -1189 8889 13902 15644 5506 3609 11930 10161
7465 10161 -4322 -17862 -5132 8381 6398 -3394 -5397 555 -3464 8994 -1120 -1854 -10665
7452 -10665 -10509 -2568 18961 35855 33245 39569 34159 19679 13567 -828 -9458 -7016 -3534 -11117
7438a1117L018R640M652K039J4260O272j9867k2854j5855J6157R791n298M398
7425d764j9446n984J2040J7579N389p343m798j4529R02J3325N181K162n94j3885
7411a4765j6299L396M627j3913m646J4564K4510L358l061l24N295j193l360J1029
7397I218n42n278j693O444l246J302k907q726k887N368J1799K706m853l418M128
7382G415j1039l179J0517L108m596O191J4671j4604j9832j1020j1437J9158J4611
7369c6J7381j0325j3868m281l966J7486L990k7349n66J8233R7p664J9159J9041
7355B7332m769j5986j052k151k18q287k041K2203o53j4950k839k510M714J2180
7341A0973m288o374J0253J506Q047j2564k4430q496q035J1194K7765N897r56J7254
$$ plain form
7438 -11117 -8099 1541 6193 8232 22492 28764 8897 -13957 -29812 -13655 -3864 -9162 -4764
7425 -4764 -24210 -30194 -18154 -575 4814 -2529 -7327 -21856 -20954 -7629 -2448 -286 -880 -14765
7411 -14765 -31064 -27668 -23041 -36954 -41600 -27036 -2526 832 -2229 -2553 2742 1549 -1811 9218
7397 9218 8676 3398 1705 8149 4903 6205 3298 -5428 -8315 -2947 8852 11558 6705 3287 7415
7382 7415 -3624 -6803 3714 6822 2226 8417 23088 8484 -11348 -22368 -33805 -14647 -36
7369 -36 17345 7020 -6848 -11129 -15095 2391 6381 -20968 -21534 -3301 -3204 -10868 8291 27332
7355 27332 22563 6577 5525 3374 3156 -5131 -7172 15031 14378 -572 -3411 -5921 -1207 10973
7341 10973 6685 311 10564 12070 20117 7553 -16877 -25373 -33408 -22214 5551 11448 10492 27746
7327B7746L400o174m513r732j2597j0608L992j502R69J3830J9083J4q103j0589
7313E216j3671Q59n946J5105J8134J9062M679j5135j6388r415O276N258n874o545
7299A615L259o570o997O105k474n917N682K777O510L066r897k28M268J2947p93
7284A3353j15q391k9377m995J818j0965M651L086J388N587J5974m677M369j305
7270i599k524k578m598O328M833r078M008m032o451j871O12R561N173j6689J646
7255b5259K0304L266k203l736N7l807j655m057m031K7427K7203k2180k4463r109
7241b2243J4874J0993M454K931l210n515O107l002L467j7699L930J4167K672L256
7227A5182j0258n57q151N485j401q057k305q04O174K2052K534k309o197k538M01
$$ plain form
7327 27746 31146 24972 20459 10727 -1870 -12478 -8486 -9988 -9019 4811 23894 23908 15805 5216
7313 5216 -8455 -7596 -13542 1563 19697 38759 43438 28303 11915 2500 8776 14034 8160 1615
7299 1615 4874 -1696 -8693 -2588 -5062 -10979 -5297 -2520 3990 7056 -2841 -3069 1199 14146 13353
7284 13353 13238 4847 -24530 -29525 -27707 -38672 -34021 -30935 -29547 -23960 -7986 -12663 -8294 -9599
7270 -9599 -12123 -14701 -19299 -12971 -8138 -17216 -13208 -17240 -23691 -25562 -24950 -15389 -10216 -26905 -25259
7255 -25259 -4955 -1689 -3892 -7628 -7571 -11378 -13033 -17090 -21121 6306 33509 11329 -13134 -22243
7241 -22243 -7369 3624 8078 11009 7799 2284 8391 5389 8856 -8843 -4913 9254 11926 15182
7227 15182 4924 4367 -3784 1701 300 -7757 -10062 -10866 -4692 17360 19894 17585 11388 8850 9251
7212I251L859j064o084o733p651R97P722m24n071j8601r803N398J1833J1736L415
7197a220p841K020Q790q958k7285Q691J1274j4610R176J2321N608r485k092M156
7183i455R192J44p146O46o854N419n292P008q46j7266J030J6760J5947P816j4455
7168B648k7850K014J8631M071R37N82j0229J1117J0171r398j6476k452N36j7286
7154c2984n890K58J4661K720J159J0137J2025r598m379k535K573J7428N713j102
7140A0186J5908M134k356n385j0379o169R158m482M005K171j4220q273K525J1393
7126H216J1980j2028j3297k420j964m515k939J779R991N70K489j4754k536O288
7112a3140Q78J0233J470r182j5069n763J1915R932m047j5449j670R380N649n481
$$ plain form
7212 9251 13110 12046 5962 -771 -8422 -7425 297 -127 -5198 -23799 -33602 -28204 -16371 -4635 -1220
7197 -1220 -9061 -7041 1749 -7209 -34494 -25803 -14529 -29139 -19963 -7642 -2034 -11519 -13611 -9455
7183 -9455 -263 -119 -7265 -6619 -13473 -8054 -13346 -6338 -7184 -24450 -23420 -6660 9287 17103 2648
7168 2648 -25202 -23188 -4557 -486 451 1033 -9196 1921 12092 2694 -13782 -16234 -15698 -32984
7154 -32984 -38874 -38616 -23955 -21235 -20076 -9939 2086 -7512 -11891 -14426 -11853 5575 11288 10186
7140 10186 26094 30228 27872 22487 12108 5939 15097 10615 14620 16791 2571 -5702 -3177 8216
7126 8216 20196 8168 -5129 -7549 -9513 -14028 -16967 -15188 -5197 -4627 -2138 -16892 -19428 -13140
7112 -13140 -12262 -2029 -559 -9741 -24810 -30573 -18658 -8726 -12773 -28222 -29892 -20512 -14863 -20344
7098b0344J915j755n777j0974M021J5093J5794L553l942k424Q843N435j3137j1801
7084a5500K243l845R052K119L581J3348O244N65j0796N191P112j1799q721J7330
7070A6124Q211j8923O271J0783j2768j4035N077O695J6355J0582q308j2451p974
7057E639m701l816L668N951l515n744J642K227Q643R351r811r663j499J5674L818
7042A7864j1313j4773j4852R472J0336R691O023l506J0436J7337j72r734j4103
7029A2706j4527j9976j540K3537P064j5916o092P818j655l135M966R066L319r194
7015c559j0802P969J963j347p211q95M747Q634k064M32j2657j0442n76J3014k668
7000a5462n328N068k108k148L794q733m429K0835J3252J584j1392j2228o094q61
$$ plain form
7098 -20344 -18429 -20184 -25961 -36935 -32914 -17821 -2027 1526 -2416 -4840 4003 9438 -3699 -15500
7084 -15500 -13257 -17102 -8050 -5931 -2350 10998 17242 17807 7011 12202 19314 7515 -1206 16124
7070 16124 24335 5412 11683 22466 9698 -4337 740 7435 23790 34372 26064 13613 5639
7057 5639 938 -2878 790 6741 3226 -2518 -876 1351 9994 19345 9534 -129 -1628 14046 17864
7042 17864 6551 -8222 -23074 -13602 -3266 6425 12448 8942 19378 36715 36543 26809 12706
7029 12706 -1821 -21797 -23337 200 7264 -8652 -14744 -6926 -8581 -11716 -6750 2316 5635 -3559
7015 -3559 -14361 -6392 -4429 -5776 -12987 -13882 -9135 -501 -2565 -2133 -14790 -25232 -25808 -12794 -15462
7000 -15462 -20790 -15722 -17830 -19978 -16184 -24917 -29346 -8511 4741 6325 -5067 -17295 -23389 -24250
6986b4250j1892P545J9598J776q688k342o417Q053Q284J0963Q96O721k294j4021
6972f068Q638m0q773Q363j660J357K079Q944J808j4534o966L429N258Q761O767
6957A7363j0929q381j4539l852Q398J5322k593j311j0025m102J1605J5308J9o909
6943E374M007j2364j5660n687O074P896R280Q516j5113l880O203J1812K749L934
6929A3141j8683j6686J922M357P531k719M404K337l992q97J8027P978r577p697
6915e54L239j0459J1243J7657m18o174J5655n336j2050j2668J890Q637O26q545
6901B743n590N543k1M724N054j6212L321q31j5677n574J4173k943M732J6442m802
6886E082j1606m250m486o106M657P923O120N545p34j1388Q472q95r783r485O288
$$ plain form
6986 -24250 -36142 -28597 -8999 -7223 -15911 -18253 -24670 -16617 -8333 2630 3526 10247 7953 -6068
6972 -6068 2570 2530 -6243 2120 460 1817 3896 12840 14648 114 -6852 -3423 1835 10596 17363
6957 17363 6434 -1947 -16486 -20338 -11940 3382 789 -522 -10547 -14649 -3044 12264 12283 5374
6943 5374 9381 -2983 -18643 -24330 -18256 -10360 -1080 7436 -7677 -11557 -5354 6458 9207 13141
6929 13141 -5542 -22228 -20306 -15949 -8418 -11137 -6733 -4396 -8388 -9285 8742 16720 7143 -554
6915 -554 2685 -7774 3469 21126 20708 14534 30189 24853 12803 135 2025 10662 11288 2743
6901 2743 -2847 2696 2675 7399 12453 -3759 -438 -1269 -16946 -22520 -8347 -11290 -6558 9884 5082
6886 5082 -6524 -10774 -15260 -21366 -16709 -8786 -2666 2879 2145 -9243 -771 -1666 -11449 -20934 -14646
6871a4646P221J0609j1586r00L590j5176J457L923p741R675O944J038j1619p96
6857a8007l139j826N486K5399j0093q93J0732Q840r585j2472l872q311Q936M803
6843d002O228j0542M909N702M748k5k325p645r137j1292J3852m903j5749m647
6829c4828n278J5114L018R710R550R7k603P084K412j834K990r973N08L190K603
6814A760O528J867K466n198q869P54J9078P721j8439j0045j2653r687L12J0521
6800a3884Q611k322L953p304j3001o025l789R332K2814n285L92J824o752j0357
6786b1793P23J5010k63P213k472J840Q276J2201L093k275j4291j219n108o415
6772e480N54k839q889p127o646J4437N864l527N190M239o548J0196K6262p620
$$ plain form
6871 -14646 -7425 3184 -8402 -9302 -5712 -20888 -19431 -15508 -23249 -13574 -6630 -5592 -17211 -18007
6857 -18007 -21146 -22972 -17486 7913 -2180 -3073 7659 16499 6914 -5558 -9430 -17741 -8805 -4002
6843 -4002 2226 -8316 -3407 2295 7043 7018 4693 -2952 -12089 -23381 -9529 -14432 -30181 -34828
6829 -34828 -40106 -24992 -21974 -12264 -2714 -2617 -5220 1864 4276 2442 5432 -4541 -4033 -843 1760
6814 1760 8288 10155 12621 7423 -1446 -692 18386 26107 7668 -2377 -15030 -24717 -24405 -13884
6800 -13884 -5273 -7595 -3642 -10946 -23947 -29972 -33761 -24429 -1615 -6900 -6508 -4684 -11436 -21793
6786 -21793 -21070 -6060 -6323 890 -1582 258 8534 20735 23828 21553 7262 6043 935 -5480
6772 -5480 -4926 -7765 -16654 -23781 -30427 -15990 -10126 -13653 -8463 -4224 -10772 -576 25686 18066
6758A8066j1470l605q404j4543M26J3660M520K3051o070l480J536M34k867L378
6744A4632J7047j6270j710J6372M623l781q168k524J1806K2205J4671j1708j6829
6731D0366k0095L492P859M44J2514j470n277k966J5418L6800N1503M9539L6983
6718B25110P2404R3212O0404M6394Q1200J10287J02235o285j76906k22215j37719
6707B48121p5624l2344k5177k1735k3174k3563k6187r38p378j0872M228R826P486
6694B2669j777r489m627N557J1946O82L29l973P938j2591j7625O388Q057Q56j1044
6679C296J835K530j1811r613n442J6523K734k505Q838j2111n035P414J568l430
6665e209p331J0539p892p616L338J6166n869J348R561o339n865J071J876O379
$$ plain form
6758 18066 6596 2991 -5413 -19956 -19530 -5870 -1350 21701 15631 12151 13687 14121 11254 14632
6744 14632 31679 15409 13699 30071 34694 30913 22745 20221 32027 54232 68903 57195 40366
6731 40366 20271 23763 31622 32066 44580 43110 37833 34867 50285 87085 138588 188127 225110
6718 225110 297514 390726 451130 497524 578724 689011 791246 784961 608055 385840 248121
6707 248121 172497 140153 114976 93241 70067 46504 20317 19379 12001 1129 5357 15183 22669
6694 22669 20892 11403 6776 12333 24279 24961 25290 21317 29255 16664 -961 5427 13484 14340 3296
6679 3296 5131 7661 -4150 -13763 -19205 -2682 52 -2453 6385 -5726 -10761 -3347 -1779 -5209
6665 -5209 -12540 -2001 -9893 -17509 -14171 1995 -3874 -2526 7035 696 -5169 -4098 -2222 4157
6651D157L813o73j0108L317J2894p313m786J036J67n386q546m584Q521R701P317
6636I527J2351k625o343j8344O762r6k584L963O097J9766Q445j0687j1580j54
6622A4498N046k2417m216Q077O575O190P089m159K023n008j952J6093J510K551
6608C1900o490q792r892p342O528J170j29r97j1353q811L266R29l226j8101K390
6593b8950K0908P75J648r89n931k555R943Q225Q249k72j5505j8225j6142J2068
6579b6753K4079J5412J0575L221j7264j6805o045k847m623J1210o489J3313J288
6566a728j5844m486j13m540M655M335O462M77Q708J066j7150o582P102J7289J2373
6551A2024P946q517n318j0750k95L817k158j2198j7497Q906O384L563N944n975
$$ plain form
6651 4157 7970 7297 -2811 506 13400 6087 1301 2337 2504 -2882 -11428 -16012 -7491 2210 9527
6636 9527 21878 19253 12910 -5434 1328 1232 -1352 2611 8708 28474 36919 26232 14652 14498
6622 14498 19544 -2873 -7089 988 7563 13753 20842 16683 18706 13698 11746 27839 29349 31900
6608 31900 25410 16618 6726 -616 5912 7082 6953 5956 -5397 -14208 -10942 -10013 -13239 -31340 -28950
6593 -28950 -8042 -7267 -5619 -6608 -12539 -15094 -5151 3074 11323 11051 -4454 -22679 -38821 -26753
6579 -26753 -2674 12738 23313 26534 9270 -7535 -13580 -16427 -21050 -9840 -16329 -3016 -1728
6566 -1728 -17572 -22058 -22171 -26711 -22056 -17721 -11259 -10782 -2074 -1008 -18158 -24740 -17638 -349 12024
6551 12024 19970 11453 6135 -4615 -4910 -1093 -3251 -15449 -32946 -24040 -17656 -14093 -8149 -14124
6537a4124P185O450N180M791j5927j2607J5884O499n059j0830K338J1108J2675
6524A3563n822j5438j1378J2514J988n91p070Q365o738n633n8k693J053o19J4506
6509d051J5290r332j8754j73J3549l173q930l756L637Q627N432L584r005l105
6495a0160j765O81J1557o902l087J1456J852j474R009J4931r693p950j2433J0228
6481F250P060p175j7222n085R072R845J2711N562j2676K655K912M379K549L414
6467B4251j1495r633m415M346n084m907J598k028k067q706K522Q262J6753J0625
6453B0022K613j3325O31j4637j589J310k697Q806P77o800n693P362Q503j1694
6439f411j6210j32Q391Q435k791M327j09j780o773k787R265q141p261J3299n250
$$ plain form
6537 -14124 -6939 -489 4691 9482 -6445 -19052 -3168 3331 -1728 -12558 -10220 888 13563
6524 13563 7741 -7697 -19075 -6561 -4573 -5164 -12234 -3869 -10607 -16240 -16298 -18991 -17938 -18557 -4051
6509 -4051 11239 1907 -16847 -17020 -3471 -6644 -15574 -19330 -15693 -7066 -1634 1950 -7055 -10160
6495 -10160 -11925 -11244 313 -6589 -9676 1780 3632 2158 11167 26098 16405 8455 -3978 6250
6481 6250 13310 6135 -11087 -16172 -7100 2745 15456 21018 8342 10997 13909 18288 20837 24251
6467 24251 12756 3123 -1292 3054 -2030 -6937 -5339 -7367 -9434 -18140 -15618 -7356 9397 20022
6453 20022 22635 9310 9941 -4696 -6285 -4975 -7672 1134 1911 -4889 -10582 -3220 5283 -6411
6439 -6411 -22621 -22753 -14362 -5927 -8718 -4391 -4500 -6280 -13053 -15840 -6575 -14716 -21977 -8678 -13928
6424a3928j0665J0466M141k788Q566J1307J0397K612q375j7561Q25M176n3O814
6410E934M410J0429L432J7099j1930j6509m775j0384q832k384K785J5382N449
6397A0106n777o078r898q755p478n17J3714M153J1976M287k701j1229n078J8591
6383E316Q916L65r123j4506l431L281j3050j3468J5960O360l961k215n599l982
6369b9137j596M412O590P21p09L802J6543Q25j966J1730Q756o837j5558j573O143
6354B146k168M466R349m208p256q741k783m345J710J7525J6007o32j0463j8574
6340g967R883J1621l025j4723k1437L336J6240j253J994J126j4659O860K455L873
6326e676m638J9210k626k5053j638N370J067J9012K0421J8j8476k4297O435O790
$$ plain form
6424 -13928 -24593 -14127 -9986 -12774 -4208 7099 17496 20108 11733 -5828 -5003 -827 -880 5934
6410 5934 10344 20773 24205 41304 29374 12865 8090 -2294 -11126 -13510 -10725 4657 10106
6397 10106 4329 -1749 -11647 -20402 -27880 -28397 -14683 -10530 1446 5733 3032 -8197 -13275 5316
6383 5316 14232 14597 5474 -9032 -12463 -9182 -22232 -35700 -19740 -13380 -17341 -19556 -25155 -29137
6369 -29137 -30733 -26321 -19731 -19010 -19719 -15917 626 1451 -515 11215 19971 13134 -2424 -3997 2146
6354 2146 -22 4444 13793 9585 2329 -6412 -9195 -13540 -11830 5695 21702 21070 10607 -7967
6340 -7967 1916 13537 10512 -4211 -25648 -22312 -6072 -7325 -5331 -4205 -18864 -12004 -9549 -5676
6326 -5676 -10314 8896 6270 -18783 -20421 -15051 -13984 5028 25449 25467 6991 -17306 -10871 -4081
6312d081P299K240M300K729J2902l611j2538m951q925p262L047K428k995M113
6298e305J1049N43j501j3558O234R790J0303O599j435j4833Q465O274K83r384
6284A3524k0909N411R693l028j2538j880L535q945Q456L252P648J5750k368j0964
6270F637J0816K930j7349j1802j123L124k692P306m21k810m609N257m092P277
6256a551J3827J7250J295k2878q657r909k151J2896P235j1206j8485k327J2807
6243a1854J3890o83K12K413n108j6585n707L0193Q504o202j5k5913l366K086L868
$$ plain form
6312 -4081 3218 5458 9758 12487 25389 21778 9240 4289 -4636 -11898 -8851 -6423 -9418 -5305
6298 -5305 5744 6287 4786 -8772 -2538 7252 17555 24154 22719 7886 16351 22625 22908 13524
6284 13524 -7385 -1974 7719 4691 -7847 -9727 -6192 -15137 -6681 -3429 4219 19969 17601 6637
6270 6637 17453 20383 3034 -8768 -9891 -6767 -9459 -2153 -2574 -5384 -9993 -4736 -8828 -1551
6256 -1551 12276 29526 30821 7943 -714 -10623 -12774 122 7357 -3849 -22334 -24661 -11854
6243 -11854 2036 1353 1565 3978 -1130 -17715 -23422 6771 15275 9073 9058 -16855 -20221 -18135 -14267
$$ [...]
##END NTUPLES=NMR SPECTRUM
##END=
