##TITLE=Analysis number 330443
Compound Code cc 62108
Book Reference 540/46
Project Code adrs
Chemist Name mikem
##JCAMPDX= 6.0         $$ Bruker NMR JCAMP-DX V2.0
##DATA TYPE= NMR SPECTRUM
##DATA CLASS= NTUPLES
##ORIGIN= Bruker BioSpin GmbH
##OWNER= nmr
$$ XWIN-NMR		Version 3.5
$$ Mon Nov 26 11:40:03 2007 GMT Standard Time (UT+0h)  MAYBRIDGE\nmr@NMR_250MHZ
##.OBSERVE FREQUENCY= 250.131544655141
##.OBSERVE NUCLEUS= ^1H
##.ACQUISITION MODE= SIMULTANEOUS (DQD)
##.ACQUISITION SCHEME= undefined
##.AVERAGES= 16
##.DIGITISER RES= 18
##SPECTROMETER/DATA SYSTEM= dpx250
##.PULSE SEQUENCE= zg30
##.SOLVENT NAME= CDCl3
##.SHIFT REFERENCE= (INTERNAL, CDCl3, 0, 16.4477)
##AUDIT TRAIL= $$ (NUMBER, WHEN, WHO, WHERE, WHAT)
$$ ##TITLE= Audit trail, XWIN-NMR		Version 3.5
$$ ##JCAMPDX= 5.01
$$ ##ORIGIN= Bruker BioSpin GmbH
$$ ##OWNER= nmr
$$ C:\u/data/dgb/nmr/ADRS/2250/pdata/1/auditp.txt
$$ ##AUDIT TRAIL=  $$ (NUMBER, WHEN, WHO, WHERE, WHAT)
(   1,<2007-11-26 11:39:15.93 +000>,<MAYBRIDGE\nmr>,<NMR_250MHZ>,
      <created by zg, POWCHK disabled, PULCHK disabled
       configuration hash MD5:
       76 6E 9A 78 1E 09 19 81 EC 84 63 8F B0 6A 59 2D
       data hash MD5: 64K
       2C 05 81 5A B2 39 22 70 AC 79 32 85 9B B8 22 AC>)
(   2,<2007-11-26 11:39:36.42 +000>,<MAYBRIDGE\nmr>,<NMR_250MHZ>,
      <Start of raw data processing
       ef LB = 0.3 FT_mod = 6 PKNL = 1 SI = 32K 
       data hash MD5: 32K
       7D 87 02 90 51 0C 8C AA 39 85 3A 31 6F 85 CB E3>)
(   3,<2007-11-26 11:39:40.86 +000>,<MAYBRIDGE\nmr>,<NMR_250MHZ>,
      <apk 
       data hash MD5: 32K
       6E 52 39 F7 37 00 75 18 24 71 A3 B0 B1 CF FC 36>)
(   4,<2007-11-26 11:39:42.48 +000>,<MAYBRIDGE\nmr>,<NMR_250MHZ>,
      <abs ABSG = 5 
       data hash MD5: 32K
       62 0C B8 C6 B1 E1 40 DD EB 58 2E DF 88 33 E9 B4>)
$$ ##END=
$$ 
$$ hash MD5
$$ B7 BB DB A8 CC 0D C7 CE A6 B7 B7 B3 4A 81 53 AF
##$RELAX= 
##$RELAX= 
##$RELAX= 
##$RELAX= 
##$RELAX= 
##$RELAX= 
##$RELAX= 
$$ Bruker specific parameters
$$ --------------------------
##$DU= <C:\u>
##$EXPNO= 2250
##$NAME= <ADRS>
##$PROCNO= 1
##$TYPE= <nmr>
##$USER= <dgb>
##$AMP= (0..31)
100 100 100 100 100 100 100 100 100 100 100 100 100 100 100 100 100 100 
100 100 100 100 100 100 100 100 100 100 100 100 100 100 
##$AQSEQ= 0
##$AQ_mod= 3
##$AUNM= <au_zg>
##$AUTOPOS= <16 >
##$BF1= 250.13
##$BF2= 250.13
##$BF3= 250.13
##$BF4= 250.13
##$BF5= 500.13
##$BF6= 500.13
##$BF7= 500.13
##$BF8= 500.13
##$BYTORDA= 1
##$CFDGTYP= 0
##$CFRGTYP= 5
##$CHEMSTR= <none>
##$CNST= (0..31)
1 1 145 1 1 1 1 1 1 1 1 1 1 1 1 1 1 1 1 1 1 1 1 1 1 1 1 1 1 1 1 1 
##$CPDPRG= <>
##$CPDPRG1= <>
##$CPDPRG2= <>
##$CPDPRG3= <>
##$CPDPRG4= <mlev>
##$CPDPRG5= <mlev>
##$CPDPRG6= <mlev>
##$CPDPRG7= <mlev>
##$CPDPRG8= <mlev>
##$CPDPRGB= <>
##$CPDPRGT= <>
##$D= (0..31)
0 1 0 0 0 0 0 0 0 0.06 0 0 0 0 0 0 0.0002 0 0 0 0 0 0 0 0 0 0 0 0 0 0 
0 
##$DATE= 1196077150
##$DBL= (0..7)
120 120 120 120 120 120 120 120 
##$DBP= (0..7)
150 150 150 150 150 150 150 150 
##$DBP07= 0
##$DBPNAM0= <>
##$DBPNAM1= <>
$$ [...]
##$SUBNAM7= <"">
##$SUBNAM8= <"">
##$SUBNAM9= <"">
##$SW= 20.6930455092707
##$SWIBOX= (0..15)
0 0 3 0 0 0 0 0 0 0 0 0 0 0 0 0 
##$SW_h= 5175.983436853
##$TD= 65536
##$TD0= 1
##$TE= 296.16
##$TE2= 300
##$TE3= 300
##$TEG= 300
##$TL= (0..7)
0 120 120 120 120 120 120 120 
##$TP= (0..7)
150 150 150 150 150 150 150 150 
##$TP07= 0
##$TPNAME0= <>
##$TPNAME1= <>
##$TPNAME2= <>
##$TPNAME3= <>
##$TPNAME4= <>
##$TPNAME5= <>
##$TPNAME6= <>
##$TPNAME7= <>
##$TPOAL= (0..7)
0.5 0.5 0.5 0.5 0.5 0.5 0.5 0.5 
##$TPOFFS= (0..7)
0 0 0 0 0 0 0 0 
##$TUNHIN= 0
##$TUNHOUT= 0
##$TUNXOUT= 0
##$USERA1= <user>
##$USERA2= <user>
##$USERA3= <user>
##$USERA4= <user>
##$USERA5= <user>
##$V9= 5
##$VALIST= <valist>
##$VCLIST= <CCCCCCCCCCCCCCC>
##$VD= 0
##$VDLIST= <DDDDDDDDDDDDDDD>
##$VPLIST= <PPPPPPPPPPPPPPP>
##$VTLIST= <TTTTTTTTTTTTTTT>
##$WBST= 1024
##$WBSW= 4
##$XGAIN= (0..3)
0 0 0 0 
##$XL= 0
##$YL= 0
##$YMAX_a= 283186
##$YMIN_a= -402823
##$ZGOPTNS= <>
##$ZL1= 120
##$ZL2= 120
##$ZL3= 120
##$ZL4= 120
##$ABSF1= 16.44772
##$ABSF2= -4.245453
##$ABSG= 5
##$ABSL= 3
##$ALPHA= 0
##$AQORDER= 0
##$ASSFAC= 0
##$ASSFACI= 0
##$ASSFACX= 0
##$ASSWID= 0
##$AUNMP= <proc_1d>
##$AZFE= 0.1
##$AZFW= 0.1
##$BCFW= 0
##$BC_mod= 0
##$BYTORDP= 0
##$COROFFS= 0
##$CY= 12.5
##$DATMOD= 1
##$DC= 0
##$DFILT= <>
##$DTYPP= 0
##$F1P= 14.0000005364418
##$F2P= -0.99999901652339
##$FCOR= 0.5
##$FTSIZE= 32768
##$FT_mod= 6
##$GAMMA= 0
##$GB= 0
##$INTBC= 1
##$INTSCL= 1
##$ISEN= 128
##$LB= 0.3
##$LEV0= 0
##$LPBIN= 0
##$MAXI= 10000
##$MC2= 0
##$MEAN= 0
##$ME_mod= 0
##$MI= 0
##$NCOEF= 0
##$NC_proc= -4
##$NLEV= 6
##$NOISF1= 0
##$NOISF2= 0
##$NSP= 0
##$NTH_PI= 0
##$NZP= 0
##$OFFSET= 16.44772
##$PC= 1
##$PHC0= 165.3056
##$PHC1= 11.24433
##$PH_mod= 1
##$PKNL= yes
##$PPARMOD= 0
##$PSCAL= 4
##$PSIGN= 0
##$REVERSE= no
##$SF= 250.130018577747
##$SI= 32768
##$SIGF1= 0
##$SIGF2= 0
##$SINO= 400
##$SIOLD= 32768
##$SREGLST= <1H.CDCl3>
##$SSB= 0
##$STSI= 32768
##$STSR= 0
##$SW_p= 5175.98343685301
##$SYMM= 0
##$S_DEV= 0
##$TDeff= 65536
##$TDoff= 0
##$TI= <Analysis number 999999
Compound Code 99
Book Reference 9
Project Code 9>
##$TILT= no
##$TM1= 0
##$TM2= 0
##$TOPLEV= 0
##$USERP1= <user>
##$USERP2= <user>
##$USERP3= <user>
##$USERP4= <user>
##$USERP5= <user>
##$WDW= 1
##$XDIM= 32768
##$YMAX_p= 521187920
##$YMIN_p= -327952
$$ End of Bruker specific parameters
$$ ---------------------------------
##NTUPLES= NMR SPECTRUM
##VAR_NAME=  FREQUENCY,     SPECTRUM/REAL,   SPECTRUM/IMAG
##SYMBOL=    X,             R,               I
##VAR_TYPE=  INDEPENDENT,   DEPENDENT,       DEPENDENT
##VAR_FORM=  AFFN,          ASDF,            ASDF
##VAR_DIM=   32768,         32768,           32768
##UNITS=     HZ,            ARBITRARY UNITS, ARBITRARY UNITS
##FACTOR=    0.157963299565203, 1,           1
##FIRST=     4114.06840259984, 0,            0
##LAST=      -1061.91503425317, 0,           0
##MIN=       -1061.91503425317, -327952,     0
##MAX=       4114.06840259984, 521187920,    0
$$ Real data points
##PAGE= N=1
##DATA TABLE= (X++(R..R)), XYDATA
$$ [...]
22323 76114 113865 52952 -1519 -18757 -58292 -90187 -71875 -39266 40391 64670 25594 -44305
22311 -44305 10174 119523 160552 138617 8178 -16590 -59686 -87493 -49584 -6916 14991
22300 14991 -8020 -29105 -63819 -73545 -83404 -50263 4523 6782 -50313 -49582 -2037 -19027 -39457
22287 -39457 -85510 -117966 -113868 -44186 1753 -7802 70965 63240 26216 14712 42511 -15678
22275 -15678 -8444 -15692 -20358 7377 -29158 -13791 8279 -23040 -2099 73407 107293 55143
22263 55143 50252 56459 44345 -19250 -70306 -94542 -146558 -102316 -49674 -19133 -2697 -39541
22251 -39541 -66781 -55566 -20745 -6536 39983 45062 -33745 16143 29763 -23289 -102994 -90204
22239 -90204 -77771 -15098 104444 94048 59890 75722 30383 37185 65265 50982 -27063 -103159
22227 -103159 -39824 -34165 -32701 85138 149053 131450 50458 32339 53207 31553 -19474 11825
22215 11825 -563 -47081 -27253 -39725 -55585 -44621 -21563 -19809 -44679 -10416 -9370 1541
22203 1541 -18653 -30228 -53301 -110530 -9385 83657 38922 28386 76575 94784 72415 21663
22191 21663 -24850 -44687 -53496 1 59730 -892 -40429 -5094 1307 20071 -9827 12698
22179 12698 4596 -20076 8 25382 84997 141948 160967 214954 142985 85351 51076 64920
22167 64920 68214 27466 38710 28399 28166 34655 58109 -7153 -58401 -50732 -43100 -61855 31098
22154 31098 88405 138098 30111 -29643 60062 84483 42782 9912 8676 5006 -37053 -71287
22142 -71287 -80009 -82994 -15240 -39204 -66639 -16341 -56614 -57127 4853 -2513 50792 43205 23996
22129 23996 18964 -18803 -32852 -78965 -88122 13698 86497 49200 -61417 -74426 -65644 -58311
22117 -58311 -70911 -100813 -95228 -6756 64983 -3855 43551 128280 109397 71972 50419 2140
22105 2140 -55213 -76654 -61159 -39544 -65860 -71683 -58433 -80215 -17386 11271 1395 -5060
22093 -5060 -40542 -40684 18135 20851 31669 11924 17387 -21644 -36352 11401 9372 63456 24260
22080 24260 -40534 -79689 -139841 -144521 -110312 -45765 -56660 -10756 64945 67042 29295 -8730
22068 -8730 -28033 -13784 -65435 -96194 -74238 -35125 -61309 -67057 -100876 -110246 -77453 -44034
22056 -44034 -31979 -21137 3524 -65961 -123975 -119574 -94576 -42925 -32421 8274 65430 66868
22044 66868 75707 50189 15377 -46416 -55994 7301 79525 107157 110732 131184 71847 38172
22032 38172 36369 24282 16415 101825 148494 125958 80776 32362 -16979 -50587 -96316 -98541
22020 -98541 -65927 -22656 52969 67383 104654 29834 -6123 21619 8267 -8002 50871 45882
22008 45882 51661 105215 106734 64246 42595 46391 27177 -9110 -17220 -6564 26087 50653
21996 50653 -2937 -19331 8230 42719 45342 -22668 -88339 -93315 -79163 -65827 6805 89599
21984 89599 80321 -26991 -45788 18841 16599 -62837 8704 23043 -62449 -98386 -41336 -9398
21972 -9398 -21232 40102 89919 75804 11128 1962 54921 93515 84935 40706 -20156 13211
21960 13211 34666 21778 5380 41719 60744 20455 18574 25669 41053 69575 72568 43938
21948 43938 47550 -8717 -28551 -43472 -41272 -62700 -93067 -110963 -135200 -86540 -7866 -13529
21936 -13529 -76012 -101453 -89526 -104002 -123358 -45981 98715 77336 68079 94962 69266 9594
21924 9594 -36439 25968 56674 86199 63657 -16680 -43206 -37449 -41583 -44579 -16376 55368
21912 55368 85923 101471 123927 126856 151273 143147 79738 2086 956 6728 23563 2912
21900 2912 -15004 -54417 -97667 -133505 -147279 -130657 -126888 -103342 -15925 21869 -23896 -65357
21888 -65357 -36193 -66084 -114575 -95361 17362 60383 -18670 -61721 -13630 -30670 -69740
21877 -69740 -34945 -42232 -51402 -80558 12737 124606 8211 -26369 7964 45427 93272 138614
21865 138614 135833 52266 39241 28127 76185 76558 66113 72371 86678 102393 152518 61155
21853 61155 -23109 -20805 18209 7572 -33853 -1041 31270 18565 52918 122032 150222 100687
21841 100687 18957 38474 142319 124388 99930 73317 62212 39440 95513 160307 128271
21830 128271 50250 113495 129152 42842 32045 8161 39321 30581 -3564 29677 128661 139200
21818 139200 121290 81285 51483 45829 22601 -31890 -77343 -58013 26626 65639 13800 -30146
21806 -30146 -47553 -68867 -51804 -32366 45042 74589 -7714 -101115 -126375 -53844 -40295 -13195
21794 -13195 66960 34692 -22848 -28258 -91023 -56131 15756 -6847 6953 51436 67832 101077
21782 101077 53742 43115 -16280 -50073 -71237 -84910 272 4169 7750 62259 -2768 -12309
21770 -12309 30696 -16993 -9463 35237 23202 -48762 -17971 12912 -28108 -67694 -96776 -95582
21758 -95582 -16698 -5474 -15338 -58894 -59161 -35389 17931 53747 24762 71360 42248 -23439
21746 -23439 -97262 -126022 -89320 -94687 -120211 -101236 -91529 -138566 -123963 -91658 -81154 -50173
21734 -50173 -38900 9757 27432 69216 101668 87439 53013 67458 111402 32169 -24988 -110958
21722 -110958 -106805 -32486 1253 -41982 -64917 -40642 -104236 -50212 -53390 -47492 -41163 -89071
21710 -89071 -140523 -146166 -178840 -136184 -18169 -41303 -50554 -72960 -26031 -43676 -8636 36426
21698 36426 48526 47893 19383 59212 118611 107984 42225 -27486 -26699 -6905 -15947 10513 57294
21685 57294 41140 -21034 -48876 -100232 -122431 -100516 -60120 -55511 -36220 -56679 -59141 8430
21673 8430 99055 157344 145171 109449 69015 -45025 -129068 -83608 -69886 -57091 -17794 5584
21661 5584 41580 73253 90495 22331 16132 88948 19386 30069 47809 15485 -24468 -46892
21649 -46892 -109363 -59481 -621 -12294 -24058 -14614 -31007 -77298 -57776 45158 135771 139823
21637 139823 146385 108329 69543 68714 37456 35277 28690 48731 55614 91654 41641 -6426 -100113
21624 -100113 -152622 -115294 -89388 -41239 -9669 36814 10107 -27514 17314 51849 36603
21613 36603 -19012 -80906 -66853 -25177 26266 33178 33781 -13232 -69792 -13506 -21004 -50761
21601 -50761 -28088 12084 61763 136781 181612 71723 -16993 -8453 49104 -47888 -91337 -75565
21589 -75565 -32332 -46219 -28962 -40887 -25593 -27314 -86469 -84930 -78716 -87625 -80160 -20043 -12992
21576 -12992 1159 32039 29224 46120 52775 56572 57134 101643 103997 59611 42613 44142 10915
21563 10915 -88199 -102052 -28368 76400 41727 -49526 1228 -10571 -43368 -58040 -65191 -77892
21551 -77892 -87569 -85320 -109086 -94104 -48360 9710 9069 -6141 1297 50947 67324 21575 33326
21538 33326 55691 -7961 -31811 -22967 -38884 17280 -166 -30638 357 51626 50409 744
21526 744 -42037 -48539 -19774 -48412 93 -16499 -3519 -15543 -17301 -86867 -80279 -43423 -102575
21513 -102575 -94196 -16766 76898 117017 160014 126767 41635 26615 -177 15810 64400 72862
21501 72862 131647 77459 18672 32942 3758 16734 108948 76213 93695 63869 68656 41286
21489 41286 45553 56728 28101 25574 6037 -40905 -10398 29237 -12308 -36985 -33849 12035
21477 12035 5921 -22646 -13784 -3230 -38034 -27319 -9766 -94732 -106061 -145075 -75580 5153
21465 5153 29501 102878 151580 105469 4495 -7972 15488 90674 150523 81283 91068 86631
21453 86631 29373 20829 30314 5351 17732 30585 -3375 -63668 -18789 -18907 -38337 -103666
21441 -103666 -90070 -49417 -4320 -10949 -45150 -53507 -42599 -47920 -26519 -9052 21934 14031
21429 14031 -71067 -53726 -32899 -52270 -72323 -22486 39068 -28296 -18616 10149 -1517 20568
21417 20568 -17188 -12365 53030 75308 3279 -6094 9765 -24693 9298 74090 50782 19120
21405 19120 52414 71312 52073 10879 -18732 -9606 -37837 -40179 -16173 99715 153732 62112
21393 62112 -28174 -42448 26238 34622 59118 60608 -5718 -38978 -39560 -33021 -80768 -106364 -166112
21380 -166112 -207017 -138620 -7778 63376 114557 58205 46460 49738 23971 -8134 -11594 -16580
21368 -16580 17551 35559 7616 12383 -222 11632 -22884 -1684 -41088 -78990 3816 74496
21356 74496 22726 -15107 -17855 -109886 -133356 -116860 -11807 -7317 4576 -65275 -89448 -124056
21344 -124056 -228368 -262834 -220984 -194982 -154059 -130482 -129117 -154325 -124610 -104525 -91992
21333 -91992 -38439 -94956 -149925 -136899 -69546 28202 8586 18847 -576 -21692 -60804 -5468
21321 -5468 29099 31273 -25064 -35931 -73585 -71252 -40599 -21118 -15544 18073 25129 53841 53248
21308 53248 -35010 -11095 -8587 -41350 -100342 -132571 -78776 -21503 -1982 -46415 28005 61476
21296 61476 18267 -4700 11503 24448 50341 20429 13120 -5635 24328 98817 93995 75900
21284 75900 -19077 -50833 -106247 -122513 -52009 -63052 -101586 -92485 -108173 -115949 -85054 -47321
21272 -47321 -92595 -147828 -113972 -98928 -140851 -143379 -145184 -119824 -140492 -137412 -123609 -87339
21260 -87339 19929 20765 -17691 -50262 2938 51519 6105 -26690 -17766 55793 34564 15141
21248 15141 43510 456 -1369 -62504 -130921 -56211 26560 47260 75760 45508 25930 -77872
21236 -77872 -89012 -21094 47852 33260 16373 20278 -4345 -29127 -64509 -103940 -98382 -105213
21224 -105213 -38745 60743 156752 214289 158840 147351 27287 -28459 2659 -342 -21621
21213 -21621 14468 83815 125190 120048 71502 98237 135779 84904 27754 11953 17303 -18666
21201 -18666 -32293 -50442 -62275 -102766 -102273 -70608 -47893 -26987 -42338 -18187 -14404 -12835
21189 -12835 32608 15833 -69042 -71159 -16179 32562 48127 -9540 -39943 165 -8500 9553
21177 9553 39409 27359 14100 -13323 -33467 -2103 20229 5701 24738 -3341 -32009 -59401
21165 -59401 2431 -7333 -30503 -73766 -82936 -27379 -112043 -160978 -80612 2301 -8926 -54027
21153 -54027 -75306 -22642 40807 39960 17433 -56984 -11593 66965 47687 33629 54614 133466
21141 133466 121452 40846 23712 15180 -15518 33589 40559 75794 119047 138724 82431 44639
21129 44639 44938 128189 164005 118371 86994 45130 -44118 -37325 -25952 16294 24471 30074 45408
21116 45408 -698 -25923 10700 111472 153426 166204 99078 38942 61923 -30181 -84317
21105 -84317 -70880 -36131 -11334 -10922 -57551 -76541 -42565 -72161 -59648 -1356 63526 80414
21093 80414 87465 111988 60680 -8041 -43352 -15187 -56234 -34090 -20404 -68085 -47487 -55879
21081 -55879 -105814 -128302 -126301 -107953 -35516 38833 91489 72804 25706 -8942 51072 31372
21069 31372 16830 39113 18645 27226 -69545 -108701 -64305 -59449 -7163 14746 47936 51705
21057 51705 -77203 -86187 -36826 -44544 -74376 -49116 -35953 -28045 48838 93149 68249 27062
21045 27062 -21639 -45612 -33199 -30889 -2165 57291 -17828 -50659 269 -24190 -34252 -71296
21033 -71296 -84337 -10753 -33612 -126140 -133740 -12965 -32279 -111648 -156003 -53608 42423
21022 42423 93892 20526 -77837 -69225 -22885 -42786 -35976 -60281 -12991 45906 59030 14808
21010 14808 19623 26501 -22643 -19639 -3708 18348 36844 -67419 -80032 -57565 -81823 -117731
20998 -117731 -111608 -94565 -103499 -82039 -33783 -13535 -834 62136 97937 21251 -50031 -84012
20986 -84012 -48433 1314 7109 -8261 25720 -22811 -23578 26656 78634 86949 6572 -1834 -54847
20973 -54847 -107378 -76189 268 31507 7665 -4967 21527 68853 4040 -73381 -4386 3934
20961 3934 -29279 -80446 -125075 -103167 -37268 -44631 -121397 -103031 -51644 -79790 -60453 -68103
20949 -68103 -80881 -21264 34491 -9221 -108682 -95552 -18261 -58489 -73676 -44590 -55926 -122461
20937 -122461 -116541 2173 55513 41586 5585 21709 38753 7144 -29918 -79930 -132099
20926 -132099 -33324 -10887 -6847 14226 34660 38056 27439 29605 47991 79510 50821 44101
20914 44101 -678 -56056 -44254 -66781 -53675 -62434 -52942 43063 95655 102793 68651 54458
20902 54458 19849 60528 101336 62284 83495 58404 7334 37974 49318 48177 -4563 -46218
20890 -46218 -19619 -84265 -181860 -156802 -140369 -22584 17319 -45787 -69332 -63697 26635 82681
20878 82681 94515 105558 14922 63586 43236 10074 53808 72063 54691 44705 3072 2671
20866 2671 -7329 -5610 6550 -32084 -14905 -8649 -38793 -71611 17570 64500 -5445 -34158
20854 -34158 -23517 -13239 -31418 9920 26396 -93428 -81677 -72706 -38092 -11385 -64358 -80934
20842 -80934 -110072 -85075 -88295 -113886 -136661 -141468 -121329 -141632 -162354 -63621 -13957 8618
20830 8618 111085 118665 76646 25494 49851 39053 19154 378 46250 45046 -12444 6127
20818 6127 57926 14540 -20268 3439 16451 -8027 -17027 -73050 -106427 -144555 -113197 -33571
20806 -33571 -14487 -54555 -153295 -150496 -99981 -145860 -135599 -108154 -82673 -52694 -67712 -79793
20794 -79793 -45754 -69006 -73321 -53424 -25248 24806 44319 42050 35535 -15744 -51821 -43790
20782 -43790 11392 98481 63932 2246 -6685 -28751 -55018 -20373 14217 31098 28569 38024
20770 38024 61194 57410 74093 19647 13012 30242 27064 -7721 12393 -37768 -94433 -78179
20758 -78179 -72854 -65050 -14224 -21987 -70657 -55194 -84561 -63955 -266 -67746 -145756 -101280
20746 -101280 -34013 24346 -47906 -46438 -42109 -7734 -14334 -6698 -23892 -44671 -21896 20417
20734 20417 -11991 -11519 -21460 -34647 22856 12272 -9859 18438 54095 47511 47493 35009 79438
20721 79438 102685 47577 10496 -48215 -56302 -21646 14271 24435 -44611 -61742 -95892 -91837
20709 -91837 -53634 -67764 -60299 -35245 71035 86500 19021 2990 83103 48036 23688 -7273
20697 -7273 10002 46158 26799 6851 36034 82800 76468 117359 118281 57029 105780 93287
20685 93287 64877 35245 -36023 -56162 -7209 75633 -8160 -36630 -87041 -109494 -78386 -56291
20673 -56291 -59565 -28871 24990 54890 43760 -28081 -107618 -125782 -134518 -141403 -182321 -125955
20661 -125955 -125243 -89691 -103695 -91647 -114591 -75799 -80602 -88020 -35187 -21343 32054 34051
20649 34051 -59706 -71946 -67062 -79393 -59524 -16803 15209 -21958 -54038 -2708 41308 -12530
20637 -12530 -19853 -15445 -3861 11993 18662 21362 6288 19355 15813 -18742 -62385 -118741 -148833
20624 -148833 -138296 -80303 -99008 -56479 -11541 38927 -9263 -108961 -172638 -113425 -60845
20613 -60845 39332 92295 52423 14415 -29616 -24426 9037 51468 32513 36617 62234 -12189
20601 -12189 -96324 -121708 -122653 -110576 -104952 -110132 -99447 -95712 7337 -6480 571 79657 61171
20588 61171 38860 -21791 23449 68056 14003 -21922 20005 -5582 -45187 -46091 -65598 -57546
20576 -57546 -20830 -75195 -97640 -109454 -30010 76873 100881 61901 38081 4789 -29043
20565 -29043 -47023 -65801 -41084 608 -1187 -94833 -90027 -35605 16298 -7034 42324 5692
20553 5692 -6860 -25839 -40807 -48172 -49423 -43503 -16537 -9393 -69697 -76076 -42989 -11696 -16665
20540 -16665 -27635 24104 34152 -24188 -12106 126942 52732 13570 -30858 -39307 14049 44711
20528 44711 35483 4388 31914 54898 50488 10899 16461 69287 105321 77798 18446 -69856
20516 -69856 -43433 -18862 -27939 -97786 -93277 -36534 -38891 -61203 -52351 -297 3729 -9915 95692
20503 95692 91580 2162 -45247 -30657 -32414 3761 -25784 -44322 -95168 -85375 -108553 -130526
20491 -130526 -146683 -92291 -48145 -43589 -38476 19182 35510 38904 -35123 10240 22754 21391
20479 21391 1835 -17782 -13755 -30714 -58634 -66134 24108 79883 -19099 -14191 3096 -38193
20467 -38193 -42875 16531 736 -19195 -45902 19069 49534 62985 58877 83450 27172 6762
20455 6762 -30442 -40052 -32235 -11941 -16430 16542 32898 55728 68399 -13897 -61978 -94335
20443 -94335 -19319 2116 4901 -53895 -67599 -145893 -163148 -61116 -2248 19270 58882 64647
20431 64647 53136 58860 16570 52967 64205 41928 -9419 6454 -1265 -15699 27090 43175
20419 43175 -36587 -61647 -49635 -49808 6174 19424 -54649 -38457 -49262 -12544 -12063 -59292
20407 -59292 -65732 -143448 -48836 -7873 35994 99891 18698 -70017 -66904 -56650 -24856 -7034
20395 -7034 118 13440 -26834 -79095 -63014 -46265 -26677 13519 58452 115368 48456 -42077
20383 -42077 -9763 77373 137156 87899 -19502 -45118 -24464 24061 71904 76224 51416 18208
20371 18208 4955 6440 85173 118283 139365 246169 253793 194903 106118 27722 31976 53942
20359 53942 -12787 -62331 -44863 -64325 -90008 -88176 -73103 -13743 2536 36902 45709 73193
20347 73193 57533 1247 13084 -8834 24436 92414 92241 72434 31868 60427 51729 24048
20335 24048 23962 49955 28212 18106 27803 47804 69119 72239 1680 -17141 -39588 30564 12775
20322 12775 -2346 32250 57460 28099 -17669 -60083 -61449 -18426 -12385 -12751 -11013 40031 41632
20309 41632 -49355 -51940 -71106 -54087 -8998 45051 39564 37701 29731 50152 18083 -67916
20297 -67916 -21371 43577 -12249 789 -30619 -61862 -27101 59644 112656 99922 127714 122944
20285 122944 84497 84201 86063 31367 -35613 19069 -17653 -55312 -80067 -64337 -15867 -19503
20273 -19503 23353 30614 44478 48983 38336 46385 -435 -50502 -43031 -29123 -79196 -65758
20261 -65758 -14622 26586 35470 -5195 978 -7223 -67339 -96641 -106143 -116395 -93059 -27300
20249 -27300 -3581 -59860 -136265 -106418 -45805 3594 40026 22461 -13434 -35877 -66758 -61912
20237 -61912 -53227 -57790 -82516 -101238 -125939 -110903 -79537 -86329 -63937 -3043 44262 53130
20225 53130 41884 42169 29922 -45442 -13236 -22308 -28829 -60823 -111554 -103016 -95992 -89532 -92284
20212 -92284 -46595 24451 77500 33100 -21748 -104076 -114274 -50781 46990 25207 6743 42695
20200 42695 65754 51043 15740 -48818 -87835 -59065 -29272 -36120 -44106 -11760 2285 -47820
20188 -47820 -71868 -64858 -62780 -131651 -130872 -114892 -84891 -25480 -54897 -68082 -66051 -83829 2874
20175 2874 115472 129109 133754 118150 43851 5092 11117 42544 12606 -84373 -86684 -30781
20163 -30781 -59343 -48664 3872 -15130 -27606 -18502 -17175 -95024 -115328 -20197 -36192 -30430
20151 -30430 35463 22608 -16390 -64255 -71531 -16867 5793 -5532 -16077 -17622 -17742 24021
20139 24021 17870 7183 -18768 38638 77029 62861 55448 50765 -7221 -42480 -40534 -32404 -100086
20126 -100086 -107290 -76417 11493 56176 93551 30616 -21541 -20706 -45402 -9474 25990 -9026
20114 -9026 -53744 -24255 -19530 25885 -98648 -135778 -130745 -104134 49700 102471 96970 -4437
20102 -4437 -12264 9326 1547 2637 -19897 -16700 -9515 -55724 -64903 -62704 -81550 -123422 -119071
20089 -119071 -64642 -19959 -26215 -34075 17058 -74959 -102879 -48154 -5064 -13750 -11480 -113868
20077 -113868 -155258 -111430 -26873 3289 17489 -34489 -81457 -73457 -85691 2511 27541 100317
20065 100317 64650 -5505 30749 -5011 -38725 -28810 -29255 32560 2863 -33511 -29541 -73713
20053 -73713 -82555 -56880 26306 73726 17405 -53120 -30257 3531 -18540 10266 30685 48952
20041 48952 37863 -13793 -61744 -47194 -52779 -48645 -9868 -45650 -41277 40915 77304 73330
20029 73330 40315 -25985 -51112 -47833 18206 81722 97048 51411 -18750 -50927 -24684 -32291
20017 -32291 -51396 -46971 -40389 7681 35445 72039 135416 93150 43495 38326 35408 291
20005 291 20763 94845 76116 43682 76837 58153 25815 20025 -5591 8288 -76147 -92437
19993 -92437 -91080 -66744 -59230 -59670 -41142 50 29166 44946 29837 10342 54087 60843 31895
19980 31895 19589 37386 47690 -19019 -127990 -133427 -113688 -69755 -30954 -79907 -59635 -109717
19968 -109717 -74161 -39251 31212 72959 -41442 -78003 -127225 -86536 -25367 -89754 -83194
19957 -83194 -17532 -2085 3985 9689 -9299 -32638 -21443 -23759 -47190 -94709 -47574 -57250
19945 -57250 -85914 -30146 -15076 -20875 -24678 11675 12431 -453 -53018 -61958 -38211 -77248 -90983
19932 -90983 -35967 11169 -1773 20010 21315 -7558 -68133 -46368 -77277 -55368 -19810 16550
19920 16550 42611 48402 56158 66703 8712 -4464 33659 3068 -61695 -35342 1816 13558
19908 13558 62939 -5151 52227 36899 -10320 21348 22168 24950 51718 -829 -44413 14802
19896 14802 25260 -48626 -6906 -37472 -59311 -60626 -126541 -83085 14762 28251 5959 -14754
19884 -14754 -35624 -7204 17249 39440 18391 -59055 -59896 -54806 31913 99670 47491 3881
19872 3881 25061 25616 -6727 -34045 -39119 -50836 8219 98409 132675 162324 177121 148348
19860 148348 128681 49381 17150 72960 124263 71738 53187 3921 36197 62432 30663
19849 30663 6865 -20259 -66236 -66601 7229 49288 57902 73882 47095 35136 58908 95301
19837 95301 49858 7119 -19297 52049 95242 24605 13731 21618 46281 61716 98628 17419
19825 17419 -79123 -52718 -40996 -34232 10468 26640 12223 -5093 6114 22354 46184 82818
19813 82818 71329 87095 61357 25514 10515 -14892 -12179 -3730 -1939 45510 84618 26034
19801 26034 -48177 -57144 -14993 16470 -5036 -64398 -98256 8404 58224 67532 18133 -21848
19789 -21848 -107195 -64093 27649 56629 25505 24461 -46934 -79120 -91752 -132450 -118963 -81116
19777 -81116 -42939 -69765 -80767 -40759 74318 118894 137820 129052 101500 70902 170136 131384
19765 131384 110026 64333 -1656 -20186 6860 26052 -23352 -18147 21563 64538 76506 89038
19753 89038 117673 163818 91397 34131 -55330 -99277 -99635 -89956 -36012 73949 47229 -8978
19741 -8978 18005 31238 -4191 -15085 46810 74396 149590 179923 156135 84958 -3118 20844
19729 20844 1780 9174 -38139 -116098 -64554 -4540 26424 23875 54473 45023 81006 71429
19717 71429 26539 -31181 30946 -11503 -21001 31380 22115 -17730 -70824 -102444 -56896 26480
19705 26480 -20021 -7104 26274 47217 -8989 -104804 -161427 -84543 -28236 -39349 -30782 -8670
19693 -8670 -13735 -74184 -46226 -17106 -30933 -22905 -51428 -94750 -108104 -95008 -47054 600
19681 600 -9641 -39078 -73369 -56736 -81088 -44863 -4771 30409 -4236 -23208 76621 165460
19669 165460 144978 86702 37478 100651 145464 65221 69794 164019 207941 224556 207750 133496
19657 133496 61643 -30678 -55338 29317 107297 104775 63306 108539 122331 99816 66359 28017
19645 28017 -12584 -639 -13512 4489 2411 11960 21991 -38491 -59010 -15456 6051 77945
19633 77945 86922 50143 88835 73973 63616 43274 8886 9661 -3644 13338 -32331 -88238
19621 -88238 -36854 318 9447 -50022 -120751 -98683 -75745 -57657 -5454 14378 -15876 1182
19609 1182 -1101 -7334 23868 7126 -7744 80166 109130 46975 16581 -16801 -24502 8322
19597 8322 42166 49710 59684 26452 -38591 -48265 -4100 -20579 14870 101102 83979 50474
19585 50474 17085 128094 85278 104288 107481 69251 -2642 -69018 -36672 4878 7982 -47758
19573 -47758 -54239 -57017 -12416 -13063 4828 82776 33834 9293 25098 15657 -34442 -16719 44046
19560 44046 66712 -20714 -20182 2940 21221 -35988 -16768 40215 59563 42492 33282 37828
19548 37828 55021 24601 -37344 -63063 25140 80491 82620 75066 55337 84000 121428 125764
19536 125764 90727 43653 78217 57751 42228 41157 82346 41052 24825 -21779 -49706 46102
19524 46102 88403 81439 21040 12171 -600 -24517 -27411 -27985 -58945 -76159 -25181 -22110 -59073
19511 -59073 -25327 44627 12388 -50809 -76828 -15870 48343 64694 41796 70187 70359 -6605
19499 -6605 -20505 9769 24925 -8173 -36292 -29993 -58003 -83461 -52193 10073 60677 20045
19487 20045 11437 49711 71683 93728 113705 121067 90916 48398 62753 69171 18082 -5540
19475 -5540 -7538 11617 60749 44459 -2905 -77006 -99169 -31832 -8168 24706 9096 -29182
19463 -29182 -8431 55790 44905 12608 -31107 -61533 -21458 70869 111220 139817 91880 -28192
19451 -28192 -84492 -20472 42948 28109 -31663 -71692 -57145 5634 80328 130912 248207
19440 248207 338036 329516 251786 261195 246207 191881 164900 85060 -3200 4020 -5914 5863
19428 5863 83395 152611 181169 195986 213561 262713 258942 181495 164291 123009 94841 115702
19416 115702 150520 127753 176587 187179 141781 84128 88858 60504 48491 29106 19720 35769
19404 35769 53546 73521 80329 152388 226697 221510 166166 134695 175900 193911 169917 148748
19392 148748 130409 110815 72984 73937 91224 96738 110278 129674 102123 99691 100037 154335 231096
19379 231096 248221 240771 185113 124253 118628 96419 80504 101723 65537 56391 48652 13554
19367 13554 33944 29950 44672 45917 98837 152990 102988 86549 44304 70798 29375 -21377
19355 -21377 -32082 -6891 -67104 -99490 -22867 76227 129924 103492 60780 69336 69322 86224
19343 86224 80367 55459 77372 126878 120375 94502 46721 47208 26243 -8390 -23070 47018
19331 47018 101664 125049 159510 111365 94020 70411 21220 27623 107896 114121 158085 241489
19319 241489 136135 56396 51746 38835 9406 15931 653 -123912 -91599 15650 1525
19308 1525 -6720 -3889 -14167 -8659 21395 45739 83412 113186 94642 83713 60771 -13311
19296 -13311 -71189 -27366 -553 43582 82653 111678 50155 -38884 -23475 -6899 3339 -1252
19284 -1252 -77916 -155158 -136539 -120856 -67502 22988 52057 66147 59837 52983 57293 17303
19272 17303 -35074 -30091 -48605 -75398 1494 31128 61002 51650 25614 -19450 -27774 -36863
19260 -36863 -66205 -56142 -29857 -6986 98112 104644 43704 45984 71919 97709 90093 137468
19248 137468 114600 84688 63117 97422 116760 54195 -16434 -84180 -129415 -111892 -83884
19237 -83884 -69720 -86470 -59579 7895 28691 30359 49111 55695 68366 54021 20813 57756
19225 57756 18412 7873 13592 -55645 -79063 -9380 54083 63277 110317 80191 62736 65255
19213 65255 108188 90015 163015 138330 77847 123137 168938 119077 73045 14348 -3378 16422
19201 16422 -48507 -21630 63445 101129 25058 860 -34177 -35570 -17976 16454 -4434 -53994
19189 -53994 52675 16137 11186 29021 42451 60057 33490 48281 60010 72696 170314 181861
19177 181861 108645 29071 5629 92952 146400 100226 28428 14426 -8937 -14975 -43099 -58583
19165 -58583 9876 53191 112544 109289 134057 156006 159047 112097 59970 30311 58894 53961
19153 53961 59852 159977 236139 276553 291613 340199 339934 357630 279851 272549 308391 327432
19141 327432 275409 296241 327675 328091 344614 368481 369048 402449 447292 385147 276621 168864
19129 168864 111676 126538 198166 227062 140168 85340 12189 8174 34342 72100 103484 148338
19117 148338 155048 115260 45229 71539 50308 -12373 -2567 48909 48050 89489 109730 181366
19105 181366 220987 232189 222077 242764 284117 284901 353763 387447 309395 290385 284475 248878
19093 248878 294164 341713 340508 328643 344900 316970 306687 290418 205141 180195 128035 114477
19081 114477 154343 189694 152642 159505 136669 77833 32010 26116 122219 177206 158499 98512
19069 98512 74060 104069 147646 139653 119530 108304 146063 221502 216571 136728 113465 102738
19057 102738 151794 181817 141540 135742 125533 134034 87499 72173 98117 98938 175840 191403
19045 191403 180311 127996 85189 122432 155889 184226 143908 132395 99115 54821 124379
19034 124379 152904 117465 96118 92570 134206 136759 47453 -17494 -2037 -9504 50805 145794
19022 145794 141224 154231 161815 137176 166414 170619 121350 125807 178771 217003 188128 127363
19010 127363 212272 281680 351548 405262 432821 436311 407348 345071 332993 411397 411478 422826
18998 422826 386740 362913 349912 215398 113017 79177 149140 155264 198231 168755 160899
18987 160899 162436 170998 159674 106506 89638 109668 158227 144745 126987 26769 37985 121550
18975 121550 92781 105598 135194 147715 115886 51032 24145 -12372 23026 54113 152610
18964 152610 168061 116279 152204 217118 231259 277955 310250 349275 314839 248489 298045
18953 298045 304667 302477 344335 329376 313940 333692 350618 374502 314170 273532 237981 235547
18941 235547 278376 265855 288652 313261 316540 312132 327543 303769 259634 182023 176823 199613
18929 199613 244714 245132 144678 83015 24215 -21381 20151 71513 54381 32945 17848 44346
18917 44346 143919 143414 120899 118819 144860 98355 109806 123075 137479 140190 125147 180378
18905 180378 243707 207187 191046 179441 226797 322092 362352 410924 544427 582276 514065
18894 514065 466252 344887 302439 418021 447756 391931 425172 486962 432364 368363 290814
18883 290814 243725 202025 213694 323684 228531 146087 122986 121524 91355 135634 227927
18872 227927 250447 271856 293959 268983 201344 193397 156775 161126 195599 263256 271840 202509
18860 202509 189377 249498 214610 195980 226502 284657 291527 291029 320390 351382 400977 373706
18848 373706 304501 327211 348103 412815 461972 435308 363722 356621 412904 391561 371703 341454
18836 341454 341429 273636 196121 157946 135751 164656 186982 139498 160780 140854 137426 150712
18824 150712 203131 217842 199399 195631 222415 232984 251619 237755 213029 196006 190415 200212
18812 200212 177818 182788 211530 202357 193321 184003 199389 192114 177911 166000 138506 143298 162751
18799 162751 91751 118943 213880 196692 75971 47073 159140 188780 199314 216780 242837
18788 242837 273119 230148 234147 297486 262801 205514 192671 242808 295134 341629 318204 320657
18776 320657 311802 301957 328426 344309 398851 435749 491604 668757 922889 998459 843980
18765 843980 686792 523464 407047 305266 265519 219053 161803 207765 290631 309891 331771
18754 331771 369179 340493 314187 348590 318647 312266 350108 375122 360924 292217 222918 282398
18742 282398 293916 333347 394229 372337 396765 418755 451413 418063 365395 336340 257781
18731 257781 285538 330408 309307 305898 397142 485204 468370 467221 491658 471929 464237 489040
18719 489040 501418 558353 614226 607313 492293 417569 341025 361407 400476 479568 609860
18708 609860 593425 631344 644045 601950 634895 610169 521391 513475 511459 543221 566815 569090
18696 569090 517136 450496 440420 510975 610917 672586 664833 694812 802461 918866 956739
18685 956739 878383 804487 796515 750086 717785 780206 850933 950056 1092398 1335481 1484148
18674 1484148 1580006 1689973 1799579 1874320 1862931 1778166 1814548 1930147 2135331 2363176
18664 2363176 2572748 2767096 3082954 3490956 4123559 4771646 5575163 6611719 7963255
18655 7963255 9942631 12888781 17077888 21946320 26372958 29290521 31254852 32405639
18647 32405639 31777013 29423929 26712922 24639754 24082222 25739111 29600909 34622207
18639 34622207 38391666 39914292 38857743 34695862 29110746 23325791 18221490 14300487
18631 14300487 11446028 9337840 7875408 6911093 6312591 5892795 5636640 5414751 5312974
18622 5312974 5213891 5211991 5299469 5443054 5663528 5968496 6409623 7005262 7717937 8592382
18612 8592382 9655842 10974149 12821808 15386292 19132536 24664314 32296822 41311980
18604 41311980 50013499 55318059 58662509 61380286 64011639 65339930 62790261 58718356
18596 58718356 55360627 55074102 58475654 64634008 70429201 73231110 74030530 72377803
18588 72377803 66153321 56549679 45954107 35857775 27518007 21244904 16722217 13476539
18580 13476539 11200952 9577933 8382707 7426741 6713144 6132054 5644191 5252958 4870130
18571 4870130 4584690 4326349 4127857 3880665 3753727 3650704 3561093 3379451 3127596 2916083
18561 2916083 2840664 2861122 2943609 3032133 3184076 3439192 3702766 4010614 4449507 5014287
18551 5014287 5688953 6626468 7826242 9454553 12177760 16531477 22641251 28989801
18543 28989801 32143700 30937284 27515693 23865138 20895092 19356759 20055031 23285365
18535 23285365 28561656 33825926 35370280 32477570 27332620 21691788 16695175 12839850
18527 12839850 10222381 8618195 7575061 6746235 6125468 5755876 5489625 5241873 4930535
18518 4930535 4673973 4413007 4215216 4157358 4223822 4387950 4706707 5099090 5574978 6125440
18508 6125440 6751315 7643231 8723473 10076495 11731678 13932876 17092590 22040876
18500 22040876 29694528 40805357 53936035 63576961 64550381 59061567 51040122 43727740
18492 43727740 38854907 37642328 40875949 48283099 57747500 64145385 63482293 57179152
18484 57179152 47303183 37051444 28195667 21378383 16447466 13021243 10663024 9062062
18476 9062062 7940390 7134972 6492219 5974777 5461746 4993847 4572735 4223099 3986093
18467 3986093 3928898 3907293 4021674 4288053 4627087 4854057 5079173 5451863 5858955 6408669
18457 6408669 7168735 8279952 9852151 12310181 16083380 21919667 29640385 36070575
18449 36070575 37117817 33789724 28994098 24531324 21085154 19266345 19416109 21803851
18441 21803851 26670864 33169939 38554701 39392055 36360773 31811738 27657118 25123227
18433 25123227 25116349 28425849 35241608 43254975 47361090 44901734 38927291 32355848
18425 32355848 26671456 22636881 20493860 20308435 22398958 27362299 34957001 41663136
18417 41663136 42047296 36960870 30022443 23178463 17437252 13204238 10372405 8570688
18409 8570688 7418346 6677576 6156219 5686421 5264682 4919160 4602757 4328931 4198253
18400 4198253 4169951 4211219 4384786 4755300 5201290 5632453 6213152 6943642 7833412 8888920
18390 8888920 10218038 12051441 14534874 18000624 23292083 31577722 43637697 56941266
18382 56941266 65587581 65170178 58250484 49291387 41099998 35290602 32521516 33401148
18374 33401148 38675227 48320229 58790175 62378838 56793340 46965428 36535195 27336847
18366 27336847 20166751 15165491 11897274 9776857 8307516 7264629 6413322 5771682
18358 5771682 5200807 4671827 4263156 3904089 3642889 3458842 3433652 3397708 3441999 3545597
18348 3545597 3695325 3867312 4105296 4359018 4690252 5220719 5899821 6959144 8574929
18339 8574929 11047152 15042794 20640732 26381043 28746046 26997249 23351683 19489082
18331 19489082 16322944 14412483 13938073 15185198 18398673 22802567 25633950 24433535
18323 24433535 20678885 16340289 12271107 8974370 6700576 5214760 4184666 3439071
18315 3439071 2897714 2527879 2215344 1997896 1867171 1698005 1583513 1401363 1166950
18306 1166950 1067431 1011835 970139 915494 841026 875774 888303 848760 789223 668064 661814
18295 661814 628571 529617 465615 406925 339717 387463 411158 469844 462027 481713 383769 301653
18283 301653 287810 311123 308554 304743 283191 241470 262760 266592 311321 374733 343174 321368
18271 321368 264473 214309 293611 423871 475691 478279 353609 355169 377660 433325 438377 397399
18259 397399 367152 297184 342000 323570 327881 358018 346182 390718 420606 485878 505290 547663
18247 547663 614380 603140 564540 486854 413779 391131 416757 399224 392504 337989 393416 505697
18235 505697 488160 445386 469467 420673 414188 528545 495671 395800 363119 376381 393051
18224 393051 440858 528595 514761 481029 481520 422008 408712 438773 457674 478401 445411 370678
18212 370678 350526 336062 303880 301238 284524 287056 341038 390246 441131 386911 387244 386323 391411
18199 391411 393839 384083 347283 368519 376995 442139 555127 520724 558331 655679 736287 805643
18187 805643 862983 934946 876038 787883 814554 821420 775400 745125 718420 590353 519459
18176 519459 503757 582372 564705 613297 699053 731365 722106 731455 731190 755029 776607 784678
18164 784678 792228 786698 772133 749188 762291 865506 1019198 1044380 1023969 1014874 990602 1104862
18152 1104862 1182977 1197046 1245582 1364681 1510480 1675052 1855409 2074216 2337881 2488422
18142 2488422 2661280 2851648 3087848 3361982 3696429 4093000 4676157 5252605 5895293
18133 5895293 6683426 7618209 8697167 9949349 11574550 13761406 16795886 21207114
18125 21207114 27566184 36014406 45898659 55576641 62844839 68413251 72419132 73461504
18117 73461504 71496714 69350216 69399640 73195938 81625874 95429526 119930471 164704643
18109 164704643 186699178 161240750 134265978 106027895 79011125 57679493 42503811
18102 42503811 32122280 24996744 20043585 16593098 14183727 12318071 10928794 9869008
18094 9869008 8970301 8182912 7634173 7251047 6991021 6872866 6850678 6885813 7117942 7439021
18084 7439021 7945281 8616040 9435779 10555689 12174722 14624474 18364263 23849443 31069377
18075 31069377 39260990 46294035 50719956 51712330 48520957 43307722 38175427 34950343
18067 34950343 34503978 36403067 39697020 42340429 43623252 43654157 41777696 37082963
18059 37082963 30965788 24608646 18934537 14394696 11051985 8634801 6919428 5736217
18051 5736217 4901216 4228371 3713478 3301812 2941495 2652454 2372135 2150150 1988083
18042 1988083 1860295 1781575 1698118 1577574 1468301 1332511 1165771 1032482 940633 875705
18032 875705 878180 826434 753666 727239 729110 691485 706654 728253 736017 744228 670809 580558
18020 580558 557962 557846 526631 566271 543737 491252 439272 465402 415135 271646 233497 185177
18008 185177 188953 201646 195687 188420 132414 99987 121793 141543 81569 102480 128440 160167
17996 160167 182714 164536 198731 328573 353099 269221 297069 325533 255745 161256 111100
17985 111100 141244 189465 113526 97392 138375 234700 306305 435252 437487 342230 303390
17974 303390 326348 367763 373282 300537 259381 295066 325203 218648 208076 240644 190462
17963 190462 189834 193366 128014 112090 176122 151188 99586 83689 61517 58236 57802 -192 19413
17950 19413 108064 95836 32891 -7309 -1764 66184 80881 111448 114079 103503 111709 75906
17938 75906 -16743 -41943 -93673 -13312 9206 61118 100931 99136 99978 12207 10043 39550
17926 39550 93038 103112 92645 96613 59704 65430 86313 50548 35349 53046 76663 114124
17914 114124 169357 176367 154601 221135 272814 236290 226762 221482 226633 198371 185892 185008 241285
17901 241285 192213 189851 178650 92298 15046 13824 33177 46217 81518 18731 -46622 -107300
17889 -107300 -103550 -69279 -20141 -11085 -77907 -100409 -104576 -125187 -125494 -105717 -44682 3383
17877 3383 -10584 33008 22990 42292 24139 638 -9724 14346 65906 66209 158090 172092
17865 172092 156743 189917 203202 161876 135393 136774 194929 312008 330900 303827 285510
17854 285510 277601 293289 229584 129555 33333 13602 24748 -6198 16542 -8194 -55091
17843 -55091 -112219 -104291 -47104 -38308 -5392 46619 -8537 607 43086 -8971 13477 48614
17831 48614 63897 12909 -20836 19907 23031 17288 -36532 -50524 45501 114362 130311 116017
17819 116017 124769 119080 68545 32357 -4844 8937 15800 44835 93131 124307 73918 66119
17807 66119 76765 31648 -63921 -52080 18165 -5249 -43148 -68623 -74441 9833 15371 19759
17795 19759 49783 54653 103256 75548 4151 -25214 -69334 -98687 -140003 -107378 -29053 74795
17783 74795 123389 98315 41462 22526 -15808 -16380 14586 20135 -7382 -13627 -44840 -66940
17771 -66940 -70382 -46239 17005 21786 -89928 -72411 -62596 -38642 -36371 -8963 39909 27460
17759 27460 -67674 -132912 -134994 -64623 -45633 -51462 -14251 15984 935 -11454 -19148 -75876
17747 -75876 -51343 -20420 -37620 -52608 -38991 -71132 -100318 -173132 -146060 -163940 -162998 -106412
17735 -106412 -100698 -137147 -132719 -129423 -138853 -116029 -51263 -41023 -15066 22319 21905 22314 28768
17722 28768 17708 -4670 -88570 -128161 -115647 -132562 -125398 -142224 -156758 -105092 -85898 -32739
17710 -32739 8799 21876 38846 107065 50697 19463 28127 -16520 -59182 -92191 -44227 58217
17698 58217 132817 111412 75935 120255 158237 220377 299781 344150 406506 504607 577771 683244
17686 683244 725786 714155 734385 796559 782195 760712 725845 612524 508613 404598 359926
17675 359926 319203 275412 215824 139176 35625 -9202 59204 37743 30583 4049 1894 55579
17663 55579 -3137 -19916 -41321 -46717 2795 53026 24082 19126 30726 -7335 47755 65105
17651 65105 -18563 2548 37049 22955 36921 8101 32822 30155 -29608 -44984 -51368 -46726
17639 -46726 -21708 -92882 -131605 -129158 -22847 31046 -43400 -71103 -78199 -55672 -59364 -83869
17627 -83869 -55919 18026 47137 21951 -28618 -45624 -58991 -37359 50476 44341 6310 79488
17615 79488 95523 176194 226077 226243 215589 232805 256152 277284 382542 342242 258295 283379
17603 283379 334820 318558 259178 230386 208659 167131 156207 117988 142843 140195 48092 32776
17591 32776 59299 36851 56474 104531 123254 80803 16723 -40218 -98665 -105514 21527 107464
17579 107464 109053 -4050 -65743 -99328 -87384 -37459 39664 42765 70434 162550 189546 157125
17567 157125 80048 109900 183620 234054 225516 217909 249311 235197 197279 211728 165667 127165
17555 127165 190159 148257 91571 131028 144806 157810 123037 85837 52926 1673 -10764
17544 -10764 -22324 15770 -17533 47087 96075 43977 44888 87192 106822 65340 6821 -39414
17532 -39414 23083 50942 8600 -2313 4952 29524 33144 -66725 -143953 -103274 -3714 42162
17520 42162 50023 25981 -6988 -29208 -246 12890 59536 68799 67946 95530 61590 -22968
17508 -22968 -72548 -118212 -75603 -68864 -141412 -164484 -90495 -9034 -24576 -37213 -37207 -2821 -39061
17495 -39061 23617 12253 -10440 83588 79862 110506 81764 37095 17700 -3587 -33367 -70001
17483 -70001 -115337 -87063 -70616 -119604 -128182 -44454 40135 -5995 -75075 -15990 20907 31887
17471 31887 39063 8846 29081 32238 34645 65759 18746 -26460 -17158 -43044 -78804 -100531
17459 -100531 -71264 29115 99080 91780 53874 35459 16981 62471 118020 129547 224043
17448 224043 250286 180093 221523 346721 527072 610144 565127 535047 414654 323444 243506
17437 243506 194229 112988 60024 18196 -49090 -106454 -104121 -81791 -23079 49355 78783 65858
17425 65858 44737 17077 -50863 -114125 -92073 -17987 -75492 -89658 -16291 81430 123932 105168
17413 105168 84168 23164 -48608 -142756 -179081 -106742 -43932 -55143 -52233 -92269 -111804 -59697
17401 -59697 -28497 -27333 -51705 -88122 -111945 -80438 -81105 -84497 -31320 -23897 -67357 -52074 -46250
17388 -46250 -37505 -1771 9410 -56743 -150881 -159149 -135729 -106029 -41176 37238 14980 32003
17376 32003 132067 151827 111259 93769 114054 73574 25423 -18370 -28772 59990 63337 67492
17364 67492 99486 44104 23372 -45544 -127973 -203250 -154663 -101551 -87501 -71447 -57659 -49980
17352 -49980 -1611 12204 37232 38339 51232 5522 27968 66655 48077 2317 20720 7048
17340 7048 -29354 -63291 -43356 -44387 -19032 17176 36687 -17737 -77603 -91026 -119963 -100149
17328 -100149 -43449 -45825 -47258 -65123 -83001 -7556 18164 21709 18467 22039 5066 -100101
17316 -100101 -126078 -74577 -25046 -6143 5361 -12069 -61839 -62750 -26771 -7723 47314 108510
17304 108510 89443 47927 52840 29132 16356 -15739 30467 59243 104851 71261 31258 -8724
17292 -8724 2226 39950 71144 37026 -28301 8601 20041 9472 -37966 -23131 -13361 11766
17280 11766 37854 -446 4574 35775 91594 77248 70961 86070 88770 46571 37978 42378 98947
17267 98947 121830 77400 106841 121789 76203 81360 84467 92063 84222 87642 142446 112680 101398
17254 101398 148868 119687 19787 -33528 6472 43520 69113 67328 140646 158314 185392 236501
17242 236501 232839 161969 77685 78105 66062 123286 171595 124683 62236 50905 54681 67637
17230 67637 40152 26192 66288 167544 109030 20839 14447 39621 7832 56339 109570 113256
17218 113256 145436 113218 82686 73078 126515 85648 73886 76231 65784 78935 114181 124812
17206 124812 109737 144339 144817 71620 131810 172751 135657 157388 222761 214023 194742 164597
17194 164597 151394 106868 80928 103259 188604 253779 276676 292205 295381 230574 217016 265477
17182 265477 439077 492842 439066 391056 382456 377262 342082 348573 384082 355247 386506 458472
17170 458472 540658 630478 576253 516571 523914 544099 542033 595818 586398 617202 646788 696218
17158 696218 710988 765968 810440 902785 972518 978207 976740 1064260 1169813 1303904 1413172
17147 1413172 1482182 1658564 1814350 1973867 2150231 2446379 2804885 3146187 3476858 3879925
17137 3879925 4268639 4643361 5046199 5556157 6245546 7103671 8309571 9744495 11458678
17128 11458678 13617421 16432472 20082306 24794252 31239634 40578043 53630242 69093619
17120 69093619 84735672 102602222 125331936 145350689 154020386 158060863 162712157
17113 162712157 159588535 144394464 125577649 107121456 87864426 69101468 53142187
17106 53142187 40625567 31126286 24192050 19339145 15857925 13358689 11491269 10063261
17098 10063261 8845453 7783281 6964021 6191876 5458976 4866802 4442269 4105941 3872127
17089 3872127 3598319 3305379 3101161 2840115 2574550 2271623 2033394 1878872 1703977
17080 1703977 1485150 1314822 1161017 994485 965603 959272 913359 841855 834760 800905 683432
17069 683432 599253 580205 472204 432969 451867 450831 424199 326209 286146 258895 267504 286615
17057 286615 257617 265557 299399 291974 276833 255929 208279 183093 120504 103879 136759 227301
17045 227301 261227 226952 225718 259395 247320 201251 184116 180163 168855 176232 191332 213365
17033 213365 215781 211348 202843 152972 161520 157708 147792 141866 161678 174767 111209 167049 196364
17020 196364 196911 154161 136825 76946 67757 145191 213537 248872 267493 344439 309226 221204
17008 221204 143910 87310 40604 48494 66520 79824 84022 45428 22956 -1856 72982 57511
16996 57511 88830 108367 154824 124027 144232 125945 115081 127370 172397 132218 45694 -6807
16984 -6807 13251 -805 -77364 -87645 -44142 -53126 -20490 14861 -68178 -107752 -47423 44997
16972 44997 27834 -48802 -18805 44672 70709 84380 127126 179295 164427 227571 304843 297140
16960 297140 303576 258893 195975 161881 131089 115680 143031 114468 96946 73108 46137 23224
16948 23224 43765 26071 25729 -3412 -4888 20294 21720 34525 26063 -23502 -15790 -15138 -41600
16935 -41600 5840 -40566 -51746 -47905 -85388 -93482 -53063 -14404 -5921 12091 -8244 -26773
16923 -26773 -1706 113 1763 7493 4596 72413 84827 76667 73179 38417 -30100 -40310 62237
16910 62237 65100 20892 18139 5686 -37665 -40756 -3281 67844 141975 152681 109888 -5036
16898 -5036 -113554 -135688 -90713 21996 61895 86076 38834 9782 -7302 -14527 -6826 -45635
16886 -45635 -8866 50680 122204 94985 26422 27477 70041 77477 65794 58153 21257 -19891
16874 -19891 -5633 -40692 28279 22770 40329 100330 119422 121134 79354 831 -312 23088
16862 23088 17975 35226 3935 -16019 39517 12183 58057 61250 -38916 -42902 2572 14407
16850 14407 -18180 51175 67058 -3049 -16438 8617 56935 30429 -67371 -17670 47431 71982
16838 71982 120940 147964 150559 103128 49688 -54776 -83626 -61775 -29905 22596 42472 42151
16826 42151 38359 83460 129375 105862 47757 52142 81839 108226 120688 127487 182843 241111
16814 241111 256688 212979 287892 413744 561393 612118 545504 468749 446110 417611 365322
16803 365322 311772 279056 220146 99855 52852 64030 -33663 -19447 -36957 -54742 13410
16792 13410 -3932 -54909 -103395 -124857 -144785 -165872 -122086 -129461 -108125 -51883 16331 45520
16780 45520 47955 13375 24364 -26480 -76756 -61870 -75838 -96453 -70679 4075 535 -119491
16768 -119491 -189646 -111129 -72331 -48873 -139189 -135238 -56439 -101335 -153561 -168251 -159463 -108190
16756 -108190 -65463 -30119 -42642 -57803 -25514 -1940 8457 35259 92635 71847 -13722
16745 -13722 -115622 -146407 -95364 -87411 -85889 -17526 -4415 -43388 -75826 -77773 -104724 -96877
16733 -96877 -77226 -48346 16357 81040 38826 42729 72483 61668 73900 85002 16724 -10530
16721 -10530 -24887 -66455 -61004 -83652 -125178 -133190 -110188 -34609 -109470 -86849 -27927 5477
16709 5477 28882 -7564 -52543 -92950 -88619 -10258 -101605 -170609 -190498 -148947 -131261 -95489
16697 -95489 -49413 -7714 46871 29015 1182 48478 68432 50221 -2640 -68580 -42046 -14746
16685 -14746 24905 -40067 -49876 11084 38105 33367 67600 117659 94364 37005 33544 24201
16673 24201 -64837 -159367 -111548 -179536 -150087 -105925 -89562 -50793 -79570 -102920 -104664 -95347
16661 -95347 -73724 -61573 -129657 -118397 -145368 -196998 -205160 -189980 -111490 -110763 -122292 -142785
16649 -142785 -87153 -74265 -101056 -139798 -165310 -128624 -119178 -151262 -135212 -96815 -123314 -91212
16637 -91212 -4093 -11823 -62205 -20813 -81857 -146959 -172021 -123915 -151632 -131139 -105114 -83311
16625 -83311 -29391 -4085 -23365 -47018 -27728 -63123 -3324 92857 88019 -23389 -91491 -35961
16613 -35961 -16045 -26914 -85928 -107079 -89887 -37009 -4243 -67560 -79265 -84187 -39623 -8890
16601 -8890 3600 2586 -17627 -23740 -61806 -134213 -116740 -103688 -98384 -70602 -86415 -70610
16589 -70610 -30263 -15991 -72135 -129119 -105850 -59647 -38598 -67995 -45236 -74476 -108166 -82060
16577 -82060 -143521 -142829 -78563 -98460 -61448 -18160 -4462 -47696 -41561 -63338 -22032 -9968
16565 -9968 23479 6357 -99393 -105349 -138603 -129729 -51943 -67634 -56220 -61029 -82697 9746
16553 9746 -11810 -207 43054 26601 105673 215102 294909 356240 397900 412902 472626 522113
16541 522113 642696 734313 736079 783147 769004 707753 688923 590715 514112 371825 249704
16530 249704 101810 56164 44203 51187 114180 61993 -16452 -72182 -58048 -5718 8473
16519 8473 -46364 -29768 35428 98082 95654 44811 4632 18755 -14385 -17276 -18427 -14275 -30866
16506 -30866 25740 21882 -29192 -39980 -12199 12240 48612 39664 -12567 -33285 -66273 -143766
16494 -143766 -170397 -70116 -93215 -136556 -69429 6230 -21964 -75407 -126696 -83728 -50185
16483 -50185 -85614 -93642 -117175 -68737 -43488 -14746 36569 13139 -12688 7843 19081 5213
16471 5213 -114348 -157210 -140567 -89248 -64425 -84506 -48631 -91429 -146224 -174482 -110092 -88155
16459 -88155 -97132 -112626 -60664 -31686 -19143 -43698 -53501 -78751 -110926 -123231 -101852 -68988
16447 -68988 -44993 1968 -54362 -66144 -50559 2418 79392 99476 42036 -67993 -127036
16436 -127036 -28064 -46131 -10448 51112 86452 27855 -41013 -7336 -36012 -72185 -44783
16425 -44783 -52250 -83681 -125570 -60810 -4681 -59031 -69490 -58878 -61410 -60460 -69040 -19194 15791
16412 15791 -23860 -45531 -70654 -95778 -138788 -19968 48967 -10145 -28024 -14317 -4546 -43835
16400 -43835 -71519 2141 -20107 -85996 -78262 -135600 -161428 -83879 -92409 -98537 -79179 -64888
16388 -64888 12679 -41430 -39270 4330 -27780 -66647 -44254 20418 -3376 -35354 -40822 -7819
16376 -7819 12833 -18484 -67251 27088 46853 -58910 -105180 -179216 -111376 -105165 -90627 -119422
16364 -119422 -160954 -173961 -103580 -87051 -87714 -149412 -136743 -62622 17246 -10388 -13602 -16750
16352 -16750 -55413 -51761 -7576 18977 22840 31126 523 17260 74851 59611 76947 6748
16340 6748 -24668 -55556 -68501 -71052 -135613 -177822 -177114 -81479 -46326 21464 -32121 -91466
16328 -91466 -62815 -40565 -41020 -68582 1793 -15345 -10509 22884 -63956 -111444 -58566 -5786
16316 -5786 -5971 37718 57731 57073 24788 -33687 -42371 -17813 -49165 -6126 27904 10720 42747
16303 42747 25197 -3038 -39153 -48050 52778 -6715 -33314 -55328 20182 5145 12472 -61984
16291 -61984 -126007 -157311 -123211 -131257 -141738 -41278 -16098 -8856 -39704 -55970 -58012 -76113
16279 -76113 -83876 -17072 -23621 -20218 19157 -7359 -68910 -59352 -81754 -54576 -73698 -82730 -123010
16266 -123010 -95329 -84804 -35469 5678 -3304 -43351 14751 10903 -24673 13248 7257 -51160
16254 -51160 -20432 -21033 -14527 -11510 -15774 -40967 -19112 54440 87484 19342 -68302 -68956 50574
16241 50574 -23557 -16312 33113 21086 15892 -36606 -11364 24180 16403 -28875 -79743 -138848
16229 -138848 -136072 -106984 -49507 -13408 -6724 -21132 -63219 -138986 -160900 -100800 -67379 -54469
16217 -54469 16472 57682 90266 50530 139 -63038 -80389 -59354 -49876 -22550 -13937 -7219
16205 -7219 -4585 61715 7868 -10917 56051 34155 64462 57433 8274 -34422 -84230 -109927
16193 -109927 -55221 -111090 -135126 -106239 -46956 -6853 -94425 -60457 10252 -61534 -85892
16182 -85892 -17171 -25636 -91500 -82117 -63912 -98622 -72215 -25673 2628 -20706 -50591 -76800
16170 -76800 -48788 -35590 -46600 -84791 -27866 21466 16348 -31080 -48547 -95614 -107136 -104354
16158 -104354 16373 34328 78343 80398 40485 14053 31638 -14490 -29510 -32231 -45671 -51268
16146 -51268 -34962 -59032 -18709 47738 84665 52432 -7053 -52463 15554 90801 107743 109359
16134 109359 100085 110720 17817 -51386 -33851 -35465 -49983 -72360 -114467 -62667 -62389 34
16122 34 103803 54010 -12792 14106 21927 91734 75641 -11792 -142410 -228745 -149682 -49504
16110 -49504 28369 23171 23170 -15276 -39758 -92304 -69152 -13975 20455 26284 33419 -35778 -71735
16097 -71735 17324 99990 96125 39325 -44420 -55941 -535 55036 7865 -48061 -13321 8994
16085 8994 46642 3651 -58465 -57832 -59792 -89843 -100553 -43816 -36353 -77124 -50277 3230 -8133
16072 -8133 -27518 -55333 -24763 -20884 -98503 -95623 -43874 33653 74698 56348 -79448 -61912
16060 -61912 -11484 2867 -45739 -48361 24362 41947 21391 -53515 -74055 -46937 -16281 -58759
16048 -58759 -88704 -62923 -83918 -115990 -86887 -56380 4218 59084 -511 55600 108317 86994
16036 86994 31312 6877 -2176 10666 -33032 -20747 -13948 2016 4887 -63018 -79433 -22746
16024 -22746 26128 -48962 -60945 -88769 -162449 -113047 -46023 -77060 -161120 -100701 -75801 -110333
16012 -110333 -57700 460 38852 19045 -9756 3435 14569 26232 -13645 1006 50436
16001 50436 82915 45976 67265 36042 -48928 -39787 -19356 -69386 -69805 -64221 -82219 -162327
15989 -162327 -147148 -77232 -79718 -26650 -79132 -60843 15133 116127 144717 67529 44466
15978 44466 -13423 -45584 -58417 -31108 -66040 18357 65100 54844 49492 42712 -15802 -53232
15966 -53232 -13256 -32872 -58062 -111480 -118094 -67214 -70238 -105743 -118699 -90752 -104453 -156045
15954 -156045 -125046 -56407 26993 4624 -44879 -44585 -10514 -4131 765 23922 -50122 -138589
15942 -138589 -111340 -70128 -37567 -23227 -27971 -12222 9126 16893 -2553 -11754 34739 -27472
15930 -27472 16259 24943 -66939 -163365 -127195 -117512 -57601 -19007 -103257 -126081 -158362 -156847
15918 -156847 -128270 -46628 -3045 5911 23453 43115 -20717 -64366 -62855 -29304 -24089 -303
15906 -303 -50558 -50014 -12838 -26964 -15257 -31658 -61801 -46790 -42102 -71120 22746 15698 -24668
15893 -24668 -71530 2461 41493 64238 55670 45242 -24476 -39530 4466 74394 62968 52718
15881 52718 16399 6838 14251 34206 30050 -29299 -43075 -14087 -26899 -41767 -38044 -5652
15869 -5652 -34762 -103972 -95002 -93297 -146692 -143860 -55007 45352 80412 50129 36250 20412
15857 20412 -3687 -107393 -170207 -200871 -205445 -113098 -100499 -105199 -80569 -15294 28876 61253
15845 61253 17507 -17432 -4393 -11704 -52632 -13704 9856 41887 99850 62248 -23872 -36118
15833 -36118 -31392 -47812 -72326 -41684 -56736 -47931 -36181 -100306 -81106 7099 -11643 -40687
15821 -40687 -28898 25622 54774 -23364 -845 -62660 -88002 -52170 -62306 -118899 -157309 -158066
15809 -158066 -126097 -122499 -170142 -135195 -109364 -159457 -167845 -170432 -228772 -168108 -133450 -77177
15797 -77177 -24244 -36759 -93742 -128907 -118711 -121773 -123287 -119447 -120195 -74918 -58762 -65003 -112825
15784 -112825 -117323 -167771 -165079 -124867 -85589 -115773 -145939 -172604 -126902 -97046 -131624 -188600
15772 -188600 -63523 -42817 -70708 -45732 -48360 332 -96103 -142934 -54585 20096 -11229
15761 -11229 24906 7380 21586 13 -4945 -63190 -83564 -102855 -66502 -13969 9774 12296
15749 12296 30907 85794 58651 1762 -24562 -14125 20167 20511 -14142 -67565 -56920 1428
15737 1428 16590 -17353 -55942 -80110 -57113 -67674 -28503 19445 40056 -47020 -38090 -39009
15725 -39009 -41825 11281 44439 49487 61990 -3836 -3950 -9597 -21735 -23114 -92596 -73224 -91228
15712 -91228 -70165 -95594 -141879 -169166 -169448 -136491 -89409 -39843 11138 -28117 -131277 -76420
15700 -76420 16078 80670 109082 78364 43298 -3838 -49620 -65722 -34802 38999 8391 -13531
15688 -13531 50641 83685 27239 17476 -4595 14781 25855 43299 22516 29821 9390 3857
15676 3857 -6258 32701 17232 -22986 -72786 -6581 -30206 -68727 -5743 60982 51481 15983
15664 15983 -59999 -127772 -72709 -44168 -127214 -134417 -105358 -116716 -108693 -55673 -1192 4256
15652 4256 -18485 -70921 -61139 -35035 -18241 -37397 -78163 -28319 -53889 -52744 10504 7191
15640 7191 -52613 -44418 -39331 -75505 -66762 -120901 -169418 -139300 -57044 -97741 -132794 -83304
15628 -83304 -24898 -15728 -34886 -22311 -69576 -115300 -97899 -30268 49920 37235 48723 114972
15616 114972 147511 93680 20210 42462 29680 58434 86621 82961 6262 -85018 -92568 -59715
15604 -59715 8252 37996 12682 -43171 16972 48555 -5071 -74945 -94696 -97931 -74160 -92817
15592 -92817 -126004 -122612 -97642 -60819 -56047 -2285 -63259 -71163 -16980 -60875 -63398 -26738
15580 -26738 -6830 44941 54851 9526 -49598 -15178 85320 116675 77107 -36024 -44040 -43625
15568 -43625 31240 10112 -69032 -57153 265 -7548 -33252 11532 56566 58797 -32880 -88527
15556 -88527 -59905 -28236 -87728 -150593 -174606 -140228 -90055 -90172 -85088 -20494 -55905 -74500
15544 -74500 -109471 -113540 -77020 -62673 -39598 -20620 -765 32248 -10899 -63386 -83187 -95871
15532 -95871 -64076 -16321 -3570 31520 47109 3048 31911 219 -7038 -38530 -74766 -107349
15520 -107349 -96853 -47796 -21655 -32730 13118 -42089 -33329 -54169 -75712 -48935 281 -599
15508 -599 31382 3665 -63038 -57193 -6106 -105027 -143542 -135246 -53595 429 -50382 -110277
15496 -110277 -140206 -157194 -145312 -171298 -144279 -137276 -51214 -60751 -64993 -10645 -31599 -80731
15484 -80731 -27786 -5817 -36390 -85409 -50147 41114 71896 -11077 -46641 -23012 6865 78660
15472 78660 89969 101886 127810 66110 52442 42851 59528 32018 -7867 -1128 49532 27450
15460 27450 -4113 -6651 -18646 -85399 -94264 -37783 -76667 -9763 89636 118219 73221 -26157
15448 -26157 -87254 -84978 -125945 -108146 -73194 -38809 70061 48569 73070 54386 35235 43013
15436 43013 11606 93031 69314 -8502 -24725 -8400 61476 105838 6000 -44218 -51637 -27931
15424 -27931 -9745 -15373 -57543 -93809 -94588 -41223 17147 68864 77802 121545 38792 -41208
15412 -41208 -24551 -19955 -74828 -41169 13299 -13621 -75390 -102327 -108109 19639 38961 3027
15400 3027 3275 11882 85712 95907 133780 83922 31346 -64083 -111779 -74439 -27985 -55747
15388 -55747 -95575 -72019 -16819 -50641 -70067 -38678 -70123 -72043 -100885 -64539 16529 20544
15376 20544 -54056 -42399 25266 88504 44372 2871 3108 -85323 -83658 -35249 -36061 -18326 -2860
15363 -2860 -35637 -55781 -25218 -24197 -124181 -135497 -66551 -98320 -83521 -45742 -33521 7729
15351 7729 27608 7688 -19924 45989 -1804 -71054 -118145 -103298 -37278 -53318 -83259 -87324
15339 -87324 -93938 -106974 -52647 -36114 21338 80011 54638 22602 20463 41221 60487 53102
15327 53102 22437 -8886 -50016 -10637 62520 71170 22011 -9418 -4442 -24937 -670 1235
15315 1235 -5363 -9819 31820 73663 62353 1724 -18120 -28959 -72423 -85123 -25418 17397
15303 17397 58930 81746 80719 33870 -9607 -5699 11704 9717 11591 68427 102158 -10703
15291 -10703 -83913 -615 29929 35758 13393 -9288 14929 -10426 3544 15264 -3502 -30630
15279 -30630 -23704 -48848 -54607 -23282 -42964 -61115 19294 -16254 -92392 -122404 -142462 -94016
15267 -94016 -86450 -97629 -140947 -135319 -99308 -31001 -20306 -30481 -51965 -84717 -51530 -44089
15255 -44089 -29984 54373 69149 33516 10270 22916 53448 57535 102015 116840 30122 25836
15243 25836 -31078 -155438 -148311 -94355 -72919 -72590 -69023 -89578 -89308 -31612 6690 39915 -37684
15230 -37684 -81978 -38477 -25527 21848 21011 10501 14094 26714 64080 17529 -41487 11639
15218 11639 -155 -20961 27854 74896 137098 129417 46542 8585 37597 59680 16734 70885
15206 70885 110765 121786 26851 10962 -10563 -43480 -71352 -15443 78440 112196 127996 53543
15194 53543 -2371 -58705 -66858 -16781 20386 34264 54805 136349 112083 -18583 -88840 -146299
15182 -146299 -126814 -56995 -41261 -38484 -57184 -54066 -106794 -71938 -12800 31986 35028 8797
15170 8797 -16318 -48387 -25625 -31432 -10103 49579 41941 31832 52143 1812 -39217 -30388
15158 -30388 3453 60862 28020 -36171 -48475 -17311 31748 9815 -938 -21615 -36587 -10152
15146 -10152 -3416 -136525 -144024 -90541 -61467 -71013 -94632 -103235 -35278 42205 54840 -2418
15134 -2418 -47529 -97120 -130984 -111137 -57068 -13302 30612 -282 -66271 -59268 -45437 -40275
15122 -40275 -26627 4644 97563 104753 103764 75278 12638 18308 17494 28966 -11041 -20051 22965
15109 22965 -17464 -6453 58376 -2804 -26958 -50165 -37964 -69179 -151676 -111498 -85386 -22005
15097 -22005 26383 -3903 12542 85400 127008 111126 70282 67967 -10222 -85622 -122223 -97840
15085 -97840 -55774 -55209 -95653 -47790 36303 -14772 -19379 -9209 42526 18091 -33865 -86837
15073 -86837 -131078 -205891 -297627 -327952 -263142 -201376 -197973 -98289 -56225 -32598 15000 -57558
15061 -57558 -114740 -181272 -125987 -46199 33667 14396 24169 52699 79760 1047 -41186 -54577
15049 -54577 -95546 -68821 -84324 -70808 -107638 -172137 -222659 -224801 -154063 -145090 -94629 -64790
15037 -64790 -90889 -104729 -97305 -116145 -117216 -69836 -116950 -180301 -146393 -72929 -53577 -85876
15025 -85876 -56987 -79340 -46981 -58780 -32143 -37307 -31117 1220 -758 -14102 55329 -10899
15013 -10899 17687 -15816 -15372 -53045 -23206 -33811 -39606 -57998 -38948 -67075 -77793 -104166
15001 -104166 -52851 -44383 -89030 -112526 -96855 -73172 -70944 -41241 -27585 -17842 -9777 534
14989 534 -12212 6016 -7050 -41710 11792 73866 28074 -52091 -121976 -161757 -145090 -62583
14977 -62583 -29115 -1302 -52056 -85974 -90997 -59232 -6449 -996 -71201 -35633 21276 3063
14965 3063 13095 15747 -6055 -657 41960 31134 -5944 -34597 -16902 -104269 -165655 -190510
14953 -190510 -110258 -96024 -77005 -36055 -16591 -77579 -79881 -80396 -121260 -164358 -152997 -125199
14941 -125199 -81564 -92007 -72994 -68531 16536 37076 31437 -2562 -76746 -116451 -50687 -29175
14929 -29175 31444 -27887 -125797 -148853 -86748 -45362 -42051 -49569 -59778 -88848 -89319 -58242
14917 -58242 -24645 -56179 -110989 -66260 12950 36482 117110 179274 73275 -46849 -72311
14906 -72311 -54768 2090 13944 -35490 -77053 -82180 -49784 -7995 -29998 32174 40457 24661
14894 24661 -555 11420 -8079 -55468 -5794 3588 46543 16869 17005 65145 94556 17380
14882 17380 -24383 -133021 -198209 -162951 -49898 -47320 -73959 -59309 -25852 -31599 -39066 -62333
14870 -62333 -63158 -2108 36958 -28395 -66925 -2951 -6241 -3034 -81574 -108916 -86238 -99430
14858 -99430 -120876 -118358 -135971 -112503 -65165 14342 17035 -2212 12101 29044 -7436 -16719
14846 -16719 22532 -7792 -37390 -55753 -66584 -57248 -48271 -23898 20476 6579 -14322 12771
14834 12771 15473 74930 158405 169100 153764 104127 51975 -15609 -73474 -50749 -45546 -63422
14822 -63422 -68395 -103479 -138034 -124391 -58624 10685 -3516 40782 19818 -67380 -166230 -162241
14810 -162241 -115064 -19635 71530 117454 78535 83214 114731 68001 32785 40590 74253 92409
14798 92409 69376 42928 2464 -102060 -84908 -116 -48656 -60779 20814 36474 -26356
14787 -26356 -69288 -75973 -24253 -20718 3834 32117 25014 13837 -10067 -5926 -88683 -64858
14775 -64858 -21123 -20329 -68123 -136469 -95957 -96202 -47728 1692 11309 59793 61218 8079 -65280
14762 -65280 -75909 -106610 -107377 -39709 -52983 -62199 -40043 -67250 -104103 3559 53513 8924
14750 8924 -31428 -53007 -56520 -20699 -30376 -45327 31249 15878 19039 -25777 -75812 -65534
14738 -65534 -10358 -12459 -20094 19556 -3817 -65492 -43165 -42717 -65342 -56862 9114 -6506 -19356
14725 -19356 -15125 -98229 -80477 19430 41416 26537 -74152 -90105 -43912 -72136 -118099 -21043
14713 -21043 -13537 14479 27068 -41845 -47540 -55459 -108373 -82835 -90135 -71410 -53559 -4573
14701 -4573 -27198 -44594 -87879 -121661 -59113 2824 4496 18986 48261 18114 -67365 -17104
14689 -17104 -46722 -85485 -130602 -110487 -82631 -96031 -110750 -11909 75846 74805 6921 -15567
14677 -15567 -28213 -32889 -18569 -24409 35162 129605 83131 34058 42720 90515 67427 9095
14665 9095 -13191 -57399 -124288 -111051 -80933 -110529 -87307 3588 -14125 -31969 29895 94045
14653 94045 90690 55015 57404 42597 68113 106483 139617 38505 28067 58818 69064 88213
14641 88213 63376 38449 62140 94357 98880 43785 88251 95045 66567 118729 113135 127389
14629 127389 114593 86100 55564 78299 71225 63235 73736 17391 -66832 -101994 -103418 -75029
14617 -75029 -93716 -30067 15117 -38758 -6704 69135 74470 -14429 -3067 26761 42870 59045
14605 59045 61657 50978 27642 13542 -1997 -3433 58435 37588 27178 58650 104040 111666
14593 111666 92623 110024 98973 93884 57225 22557 16541 81885 144149 121939 40052 -29372
14581 -29372 7217 39059 24305 20918 -13782 -46172 -32144 26836 5204 -2350 -23213 -59087
14569 -59087 -19751 20421 25193 -16450 -70240 -74380 -16678 69736 80472 8407 27562 37459
14557 37459 16967 32767 137800 153453 115082 19185 -35449 38996 90396 34791 -15648
14546 -15648 -30394 -18214 -7312 -40202 -74090 -67397 -92408 -129727 -76833 -6767 94959 174561
14534 174561 43666 -48961 -22005 56788 72876 45144 17283 -31710 -88352 -112308 -150677
14523 -150677 -111337 -65604 -44379 65150 98468 42803 -18239 -92606 -60242 -17315 -15432
14512 -15432 -13075 -33521 -98458 -103940 -100697 -29243 18349 41469 70533 81395 78653 80183 27051
14499 27051 -14712 -52606 30178 123025 130241 52771 56946 74244 14414 -7952 -8598 -34251
14487 -34251 -53843 -104955 -94525 -75746 -87892 -40892 -3946 12582 -22711 -36622 27751 8986
14475 8986 -8058 -73055 -39548 -96983 -144290 -72888 -9756 22416 61702 54642 54961 26204
14463 26204 12790 -23147 -76667 -61680 -86859 -168742 -127491 -92817 -3517 5941 -12387 -11162
14451 -11162 -91807 -43082 12077 -14124 -52431 -5178 50204 54447 12195 -1929 43811 68879
14439 68879 78874 22777 -56538 -37715 24250 97355 198969 166587 90701 43828 95471 81221
14427 81221 30676 24883 6105 -67505 -37489 10823 -10500 -125456 -198127 -161856 -108464 -33129
14415 -33129 66368 86494 39159 28693 42829 76151 72735 72035 31787 -4440 5281 -4275 -54147
14402 -54147 -60641 -32098 -10051 -2471 4437 -16485 -124651 -93445 -14628 -22143 139 -14319
14390 -14319 -39151 -16250 16974 -11460 -56856 -10363 59253 71279 22522 -19930 40076 33333
14378 33333 -58689 -102319 -108895 -120178 -77587 -46484 -26386 -23740 -28514 -86043 -79343 -32475
14366 -32475 2232 19055 -23762 -91831 -168724 -162757 -83261 -37519 -120323 -133626 -97596 -59279
14354 -59279 -30636 567 20680 77756 51390 6577 -43652 -147118 -131578 -74976 -80150 -86417
14342 -86417 16460 43642 63665 53529 109196 86123 19114 -3293 42275 7758 32112
14331 32112 59765 69385 78484 60253 90927 76488 12439 2200 -27896 -28117 -94859 -98260 -91276
14318 -91276 -77612 -74184 -77350 -108600 -83606 -64832 -63039 12248 -13656 -38564 -78188 -17745
14306 -17745 3702 5823 -29991 -29064 -26832 -24567 -52112 -41985 -31548 3828 -14975 -44816 -55619
14293 -55619 -88834 -113851 -114648 -84861 11207 95466 60298 7253 -51530 -88553 -38747 25680
14281 25680 29046 15787 4973 19732 29863 13614 -32960 -31063 -100496 -137576 -126693 -102449
14269 -102449 -113862 -58140 -18631 63203 60492 2227 9609 -24428 -121903 -119892 -68881 -14506
14257 -14506 43137 99455 88383 65371 -34522 -80017 -137544 -184864 -138600 -64354 2718 68538
14245 68538 6189 -85747 -133584 -73508 -83372 -61618 -67886 -33330 10024 -13388 -64106 -80053
14233 -80053 -22529 -29781 -67754 -70332 -117289 -199454 -167748 -96791 -18229 2288 -46671 -19323
14221 -19323 19182 -4367 -11223 21479 62682 106822 42300 -4045 19896 -72972 -130927 -68033
14209 -68033 -19663 -16190 -43659 -91593 -110502 -26860 -40779 -65531 -83225 -94311 -92233 16280
14197 16280 11217 638 17618 8206 -15991 -4536 -66328 -113852 -131356 -72092 4647 74448
14185 74448 115883 137382 87474 28325 -27141 -24108 -57007 -117120 -133522 -31576 -733 -53689
14173 -53689 -22441 29725 4391 27432 10034 55682 64926 50199 33266 -5667 2270 4423
14161 4423 15785 6166 -42331 -5088 17227 32222 1507 -35579 -84198 42126 42614 -20926
14149 -20926 -63592 -21823 -16264 -69779 -67419 23604 57146 9335 -105236 -136607 -85068 -78467
14137 -78467 -85092 -6687 40404 -5929 -56854 -108957 -159946 -214032 -188252 -112767 -88978 -80052
14125 -80052 -67200 -73910 -68960 -26437 65131 95169 118626 112225 68508 9316 -30359 -8978
14113 -8978 -30916 -10281 4924 -12055 -16901 -28816 -45820 -17682 34589 19418 -13481 -7292
14101 -7292 42728 61337 7540 43146 90025 51191 86140 66705 20979 -8905 -67236 -88470
14089 -88470 -68411 -21977 -31203 -49611 -19259 38266 44491 -3329 21436 38520 -19876 29578
14077 29578 34887 -13829 -4091 56233 21448 45009 19532 -52928 -57686 -36136 -45564 -49985 -100105
14064 -100105 -100274 -115868 -127769 -73104 -19848 31834 56931 19695 -15489 -30785 -64887 -115992
14052 -115992 -159682 -143633 -35052 -4112 672 -5849 -45853 -65400 -54175 28656 26805 -15850
14040 -15850 -16453 12000 5351 -2257 34958 70546 58116 27628 -2347 21730 36616 45283 -6831
14027 -6831 17703 40559 72154 72888 -23653 -23343 40971 49916 45529 108110 83286 90808 141673
14014 141673 109591 75277 113693 184608 169189 211356 267906 240491 208256 161913 215680
14003 215680 278215 269504 373354 610031 771166 914462 1167336 1458933 1679291 1845044
13993 1845044 1875876 1813990 1631398 1315867 1028618 808072 609756 493181 440352 402404
13983 402404 297864 272445 245198 208324 166729 176176 210083 202022 111944 -18267 -71584
13972 -71584 -83746 -46084 -43582 -67453 -5133 45061 -12467 -70636 -29500 16994 24834 51385
13960 51385 9752 18386 58 -22427 -70960 -50150 -8684 55109 68238 97903 106705 69393
13948 69393 15476 -26653 15700 19521 60280 40547 -11670 -28548 55934 87369 103923 49584
13936 49584 -1473 30476 130030 193610 177061 61847 41926 -27804 -49537 -20843 -37034
13925 -37034 -18636 31565 14644 -39871 -94304 -39991 57006 75222 112326 163203 119199 46661
13913 46661 88622 114345 89270 48626 15975 36970 33746 -13394 -21458 33810 25083 19619
13901 19619 -54096 -101116 -83751 -32991 -78 -58809 -47393 -56788 -71821 -36352 -35161 -16206
13889 -16206 8878 42851 38542 -40411 -112334 -131339 -51118 11401 44444 91560 83207 11882
13877 11882 16476 -20324 31423 -14902 -76132 -33907 -7185 5239 -2321 18720 15537 69841
13865 69841 58554 26364 13442 57192 69370 109431 87815 113742 100850 122809 98042 63608
13853 63608 14161 24716 35932 -58786 -90197 -50834 -85609 -77297 -94610 -76589 -55550 24968
13841 24968 72925 123168 84139 39707 48510 29231 -26882 -19594 -19972 -20791 -23522 -43616 -12339
13828 -12339 13480 34327 35101 3626 42404 86284 66503 62597 69294 42824 56490 70047
13816 70047 32802 -26357 5247 -33387 -93777 -39333 5173 54473 44205 39076 77666 126774
13804 126774 193870 261210 206601 230138 213333 229545 236697 214236 158657 193784 188387 134402
13792 134402 86002 137678 80338 77198 97755 80684 18655 14999 -36122 -41378 -48090 3015
13780 3015 -14782 29203 115519 186545 234969 234152 241603 268316 246680 258723 312941 400064
13768 400064 399364 347787 378866 409413 439898 436977 324581 163214 91580 63033 143648 177250
13756 177250 163853 158120 154398 54092 -25056 -38395 28352 70268 43020 28155 -25835 -12542
13744 -12542 51937 -1150 -54753 -21913 92271 144201 197637 144270 119241 151844 165837
13733 165837 130172 46045 71551 127179 65768 66104 52417 65901 112265 73805 81345 120648
13721 120648 80149 34083 -1080 44322 144693 186953 213500 146754 69263 7427 19569
13710 19569 70590 48943 48122 117875 109640 76320 37900 108950 86258 112880 124208 90391
13698 90391 62910 72007 43692 18316 4422 49197 76509 101776 96911 80049 106414 102056
13686 102056 48409 12044 19888 11371 24022 59712 54940 72744 89436 111300 136997 101004
13674 101004 32614 55085 47576 53971 8512 57057 166067 155218 87803 25705 48253 124279
13662 124279 219365 209493 162235 159807 233432 212626 160443 197845 173667 160419 155318 231787
13650 231787 275689 244357 153849 129597 179365 253335 306138 324520 309567 302648 327321 379976
13638 379976 391982 290773 231551 218987 236728 187674 109996 130126 149821 102231 137027
13627 137027 109679 89483 159707 184282 182116 195566 254335 224229 127511 134345 122977 233762
13615 233762 202443 84038 26159 -9457 69880 128485 130116 138108 104374 180944 269795 230275
13603 230275 209071 180975 183570 164536 152667 109521 158085 258866 326976 311330 363466
13592 363466 368182 447937 492784 440147 383763 424947 497164 508036 499725 507878 551442 535074
13580 535074 576664 659452 736880 796791 816515 809315 896189 900773 911767 895427 853343 842666
13568 842666 938768 967751 987322 1105154 1157853 1277179 1326069 1369912 1401879 1483453 1471647
13557 1471647 1434112 1470734 1432348 1422267 1596691 1728456 1832011 1971304 2173467 2377316
13547 2377316 2516743 2618352 2806407 2998118 3270694 3585544 3891895 4267676 4681578
13538 4681578 5092244 5584090 6194936 6914858 7836432 8879388 10197527 11812634 13594266
13529 13594266 15505727 17668286 20052277 22820751 26209894 30567087 36025994 42782407
13521 42782407 51073672 61350515 74435915 92104862 117255372 154046328 205901973
13514 205901973 270058465 334674987 383152850 401595770 385595523 341335922 282421066
13507 282421066 222370789 170056567 128916734 98661189 77241041 62239910 51579029
13500 51579029 43607848 37548337 32849584 29185440 26234301 23705530 21370946 19108108
13492 19108108 16950926 14979133 13255944 11674557 10310538 9174297 8194509 7439955
13484 7439955 6878489 6364549 5851804 5368900 4960877 4618255 4300947 4029963 3777712
13475 3777712 3550391 3380916 3241689 3063616 2926610 2814619 2593381 2455846 2314562
13466 2314562 2144721 1970571 1892374 1748414 1657806 1574466 1593004 1561731 1384542 1324560
13456 1324560 1347508 1339699 1297475 1247423 1230972 1200731 1100230 986750 993632 982480 949671
13445 949671 900093 925569 989480 996422 956578 908888 852790 814139 837156 815127 828555 800403
13433 800403 777348 811827 809971 829408 815687 734170 762903 796816 834781 785603 743116 728317
13421 728317 693396 631882 519900 506250 567243 622265 668417 658859 636529 607306 549377
13410 549377 544136 562022 658983 718601 692259 674622 580527 497028 467812 464838 481877 467104
13398 467104 492796 499358 514176 528228 483496 424017 401189 393495 437803 454278 440127 433059
13386 433059 344562 266514 277804 272892 238373 230565 271268 306478 309028 266093 195578 182806
13374 182806 172073 179499 158796 167430 206202 180968 197561 172389 151874 93902 72630 174041
13362 174041 208789 204804 105655 138398 185176 247027 279936 211597 193784 218992 246680 266067
13350 266067 252195 243097 260680 178199 101134 113833 198438 258538 225429 149499 177383 229860
13338 229860 249252 204622 240264 318565 275546 263237 267608 241350 181893 197147 178716 145464
13326 145464 114580 71941 56770 34192 112512 167408 204304 209324 197572 217366 234499 225120
13314 225120 192392 189057 185975 124971 78147 48988 -20882 -21791 28841 55261 33389 63116
13302 63116 104712 100522 48759 61707 52932 29438 52752 42956 46773 97764 97968 63285 80186
13289 80186 78471 82402 111945 74619 69076 103817 86115 99926 136861 157649 201741 217644
13277 217644 218262 248096 282977 245614 166218 106286 66277 -10587 -20956 80391 165901 135163
13265 135163 134838 103489 101188 86856 78937 87052 24223 12637 13024 53946 122430 95288 68155
13252 68155 49724 91342 121403 118241 98594 41519 77603 92852 142696 65635 16808 51275
13240 51275 127482 155281 125666 52350 13917 26068 80801 77535 116957 166141 141276 128428
13228 128428 100828 65851 77183 106731 76376 97330 121997 75655 84982 141928 102045 119207
13216 119207 79413 28316 36019 75341 105659 105092 98073 103725 88514 148674 165642 113641
13204 113641 112353 121259 139742 171280 330185 485011 559607 516546 434931 335089 227092
13193 227092 164630 187134 156434 151608 151180 121098 137949 101624 102561 61845 70240 84460 134205
13180 134205 123873 21833 -4337 35371 35681 26978 -22866 -27727 799 24257 624 15745
13168 15745 18209 -32106 -25147 -28691 -50360 13395 66988 58391 60900 41469 37048 58004 142106
13155 142106 90718 44763 19388 2054 66026 100888 106614 129903 137185 93849 136407 149610
13143 149610 97540 70570 58217 -12472 -49988 -48526 -62426 -31112 -15061 28271 28630 -18193
13131 -18193 -53695 -43534 24766 62676 50873 126063 158067 105797 116914 129966 132038 126566
13119 126566 113568 113236 99314 88032 74700 65732 90770 109494 106017 3131 -67065 -71273
13107 -71273 -19479 23881 5291 -18247 17359 20036 -61598 -77339 -28560 71284 65353 98276
13095 98276 97660 58550 119875 109762 35050 39851 46217 18775 -12892 -34723 -9539 -15007 -48603
13082 -48603 -29678 -1495 26945 59369 109152 99301 10149 65822 82303 78252 23995 48335
13070 48335 99670 84491 31371 65960 83515 55687 2241 866 29501 132143 172378 147472
13058 147472 66368 24596 31523 28323 -2582 86009 92429 113368 98812 -20046 -4426 56493
13046 56493 136832 154937 61980 65317 165055 104837 60571 68765 91436 99866 115465 117186
13034 117186 182139 279310 378647 428630 496847 567730 661546 838565 1071183 1249057 1546437
13023 1546437 1833628 1960690 1952721 1830531 1528410 1271963 1074860 936952 744117 585108
13013 585108 573764 628572 584119 526070 519189 516446 616419 873311 1134094 1371435 1658767
13002 1658767 1901969 2216785 2488453 2632673 2702951 2672438 2446065 2134854 1830138 1513467
12992 1513467 1199839 965957 783222 610601 443074 355966 308594 222258 239471 224855
12982 224855 168267 163885 120021 108139 61755 -30045 -32812 -62295 -9740 65137 -2987 -57161
12970 -57161 -88256 -76024 -37718 7090 13122 11440 -36317 -29540 11399 -81 -48944 -43157
12958 -43157 1199 86931 116334 109858 112148 84505 30237 -37460 -22904 64604 -1906 -44620
12946 -44620 75282 159357 45037 -92304 -81825 -56259 -61983 39328 106946 150119 113074
12935 113074 76042 9077 -20162 -6312 17212 -34996 -23661 54265 46327 10217 4681 8015
12923 8015 -7621 -26525 5831 14928 -16824 8275 23753 40464 65890 94139 110026 94728
12911 94728 92802 78214 80518 40580 779 -28863 -39047 7075 12566 -5332 -11945 9059
12899 9059 106055 147527 112887 29168 -18277 26778 65076 74656 74794 48075 11014 -33560
12887 -33560 -42894 -5384 48294 92768 92440 66946 -53279 -37930 -19069 21121 -22811 -91839
12875 -91839 -145652 -86415 -26362 38176 86168 41103 -2122 -8669 -23630 -13899 -20152 39726
12863 39726 37568 24194 -15913 -26093 -8333 42115 22826 -5298 -33691 -76540 -108622 -14999
12851 -14999 107241 93430 70233 51243 93568 136563 45792 -70309 -51802 -64694 -137693
12840 -137693 -154837 -123788 -54472 -50579 -17124 30349 32143 48548 63407 35821 -2959 45490
12828 45490 131797 71766 -4032 -19827 28047 26179 -9531 -6390 -39648 -24060 47427 105797
12816 105797 118158 43736 69890 153876 209940 236580 227838 286811 353968 378845 355931 215696
12804 215696 151722 165588 155377 116170 57636 68062 64784 32431 35798 61409 104082 94479
12792 94479 86108 84072 60349 89885 91665 17499 -51994 -5909 -5670 24073 64565 -19206 -29070
12779 -29070 24344 4220 -11989 13705 71889 100068 45400 55047 86064 34525 90118 81693
12767 81693 41241 63931 95243 71832 94859 89047 108447 129736 108143 68122 117343 151760
12755 151760 158625 110434 55258 40018 -25708 -37286 -46205 -32720 41842 95341 98172 109065
12743 109065 154246 183714 169731 94002 9174 -13824 -4237 39230 88703 102229 64136 -476
12731 -476 17020 27697 70990 34059 63726 54542 -37563 -45064 -116455 -53531 43731 68553
12719 68553 35658 60467 48073 33469 132800 137043 107029 129099 99502 146378 177496 147856
12707 147856 165667 200506 229615 203832 210129 134288 127414 189411 236324 215323 108387 131318
12695 131318 171671 207229 251405 319761 346945 369364 454366 410840 424061 436357 443921 390400
12683 390400 320787 385202 488046 540105 520260 506043 518125 530364 527475 578141 566178
12672 566178 519467 499057 500123 412162 423812 359958 281030 308984 275537 188465 233665 194371
12660 194371 103338 74120 76147 87110 107556 127914 140177 149727 95982 77666 52815 11398
12648 11398 89844 120022 149674 157718 122681 135433 108079 92077 134472 198969 236483 261048
12636 261048 294678 272301 219433 258639 319975 350866 397062 493015 599603 647906 674349
12625 674349 738850 762463 713772 759111 871657 862597 879972 898717 868239 824314 848514
12614 848514 867935 985701 957343 1007853 1123652 1170644 1267407 1348796 1449278 1471915 1504411
12603 1504411 1516149 1550544 1640777 1618796 1607194 1663463 1767966 1868645 2006484 2072361 2187829
12592 2187829 2433235 2653947 2898703 3120635 3335716 3613191 3914938 4320296 4761116
12583 4761116 5123781 5672119 6224797 6771082 7427216 8244435 9308989 10533881 12117424
12574 12117424 14030985 16340950 19301045 23192200 28226947 34553575 42548603 52477521
12566 52477521 65126591 81580430 103592530 134836485 178752957 231648007 287568120
12559 287568120 354474239 431814643 481751182 499451299 518281721 521187920 477200994
12552 477200994 416168631 359269890 297858247 234574533 180942816 139098963 107242032
12545 107242032 83824704 67055524 54845532 45606405 38429543 32790339 28396450
12538 28396450 24809269 21803801 19220346 17043070 15253283 13750192 12474142 11290253
12530 11290253 10285943 9462580 8660797 8053218 7547716 6997655 6482281 6095549 5711281
12521 5711281 5374929 5183616 4965331 4714747 4517213 4466152 4418540 4313246 4150453 3951472
12511 3951472 3695997 3480058 3340129 3129925 2963109 2771519 2538842 2318911 2159577
12502 2159577 2107938 2006448 1948428 1891280 1754032 1605154 1574125 1588678 1524140 1472495 1408210
12491 1408210 1370137 1371624 1327218 1307844 1307432 1231348 1192002 1218576 1247944 1242361 1267426 1258072
12479 1258072 1275905 1272092 1278288 1228166 1111011 1068626 1127596 1214594 1196352 1087105 1031192
12468 1031192 1071932 1113407 1076786 1107765 1113692 1026371 944330 970157 1012052 1001379 1022409
12457 1022409 1123977 1135757 1097149 1112471 1114180 1117994 1033799 974861 944669 885381 857739
12446 857739 807244 750249 632467 656555 674425 666446 645838 594518 645515 719217 710997 671857
12434 671857 657698 686935 627542 547145 527178 519408 550618 593089 551047 495788 486165 500879
12422 500879 512829 600385 693543 659920 696294 734905 769419 776969 863744 1041927 1301584
12411 1301584 1487110 1594874 1737629 1800105 1883871 1915766 1871149 1742047 1555367 1358603
12401 1358603 1106794 879800 778497 783277 763923 684289 620517 550842 554102 504883 398842
12390 398842 313568 350729 414822 429437 491265 483464 498276 515389 436498 336986 337354 331077
12378 331077 307478 294249 312886 380001 371554 328780 308744 313964 316521 349658 316160 313674
12366 313674 299815 225568 188428 168412 251876 318035 396329 367330 373272 359914 379598 377725
12354 377725 407662 374935 349121 417388 418399 343842 311343 277530 199101 134221 176996 171247
12342 171247 182486 154346 165720 224630 260095 256426 247793 230990 236376 208908 199529 234411
12330 234411 268802 224866 166769 203513 203971 244972 252229 241376 229406 196972 142991 88105
12318 88105 105177 121049 163091 135354 87586 180781 234779 294558 290271 303138 293635 238498
12306 238498 217713 180265 212668 188303 162612 151739 217215 220771 198874 163038 169043 216597
12294 216597 194243 214383 250780 301575 287033 240336 183807 179242 202098 252894 286518 261353
12282 261353 273713 234431 261454 266307 220637 209474 178218 150442 233430 253017 240056 209352
12270 209352 132601 88559 167866 179666 112896 100002 103778 176377 247142 230878 178012 141076
12258 141076 217012 291981 270561 211973 182179 136999 112871 169048 160260 110534 124847 167953
12246 167953 128791 138799 155124 62955 54380 63520 19187 22473 53142 106954 87777 53720
12234 53720 -16494 -5509 9417 31033 72594 112213 87156 75683 47031 54888 105098 133475
12222 133475 142341 83812 46751 97871 129858 191123 166855 127159 113290 170613 116788 117088
12210 117088 41797 -48984 7507 25122 30814 14514 813 9355 6916 6669 6007 32574 29455
12197 29455 39303 62445 133566 109879 70668 121883 223398 275190 387970 563098 607879
12186 607879 532628 443362 359496 341492 310612 230311 193054 165637 145349 164465 183475
12175 183475 215541 159408 110767 104462 32984 27955 131155 120819 147718 138627 172217 106684
12163 106684 72337 121278 149720 135994 75553 39978 48617 63881 70539 102446 189922 236803
12151 236803 276506 290069 315301 360590 459426 631117 856778 1179627 1497772 1499479 1262365
12140 1262365 1071336 814442 513135 321018 244550 192866 249362 316820 280982 213830
12130 213830 115645 46419 96035 121972 168071 229347 243456 266512 255768 273849 238510
12119 238510 261629 287537 362078 477220 606971 648305 794635 1018090 1278618 1597820
12109 1597820 1993840 2366776 2655209 2723881 2823865 2897217 2770419 2568067 2463296 2544679
12099 2544679 2644575 2646137 2220376 1703074 1277266 975367 729677 558188 445451 393082
12089 393082 309422 241459 233676 234544 247477 249637 154572 64256 53733 82303 106604 101098
12077 101098 94324 60896 71811 79313 131535 160115 139569 108882 87142 67549 121771 140434
12065 140434 144680 122606 44760 146380 248559 220341 159806 163969 253363 334680 513834
12054 513834 625011 490905 387047 346113 265953 151397 79587 55828 77093 50638 53942
12043 53942 61601 62882 105213 103340 69066 78377 161669 196707 147611 141744 124680 129122 143556
12030 143556 145453 87349 72726 58146 5780 1348 -9747 94032 137217 139511 75253 74081
12018 74081 100856 135323 130279 121475 96594 61913 53657 71490 75414 98233 93560 100755 88128
12005 88128 73336 91531 50793 -47512 -73036 -26754 12120 41111 86852 37955 26728 29825
11993 29825 32165 39850 45220 45772 16883 -83279 -68342 37731 107443 103193 63945 32644
11981 32644 -12254 7129 86892 69159 58777 19162 49128 24855 -1439 20961 -4974 -11030
11969 -11030 -97570 -153704 -40333 107768 134193 112012 -13293 -64890 -23616 -22482 17084
11958 17084 76384 141348 166333 131433 49718 50439 2341 -27732 -67233 -62618 -65285 -34063
11946 -34063 16872 64295 68854 97133 46680 -31829 -36871 -10607 -21992 40069 110749 94082
11934 94082 80019 43792 -34166 6960 51760 31275 -2315 35609 36105 22685 -5463 -72970
11922 -72970 -22750 64304 25749 42588 33809 -59346 -107160 -81889 -564 25549 -25319 -66417
11910 -66417 -17044 51667 59516 -27365 -13484 -15690 15605 5613 1719 -31353 691 47494
11898 47494 51935 94378 148001 97497 604 -51998 -39895 -58253 -59137 -51828 -18189 -26524 -77216
11885 -77216 -41677 16701 32171 77080 77980 30408 61241 70215 47321 24340 59699 80455
11873 80455 65521 32648 14166 12520 -25185 -89064 -102107 -130656 -84693 -20747 11810 51909
11861 51909 53628 67149 59567 36777 11453 -13683 11344 15402 10911 25429 61527 69209 48540
11848 48540 52048 37197 73213 43128 54562 39380 -9326 14957 99105 100681 51594 27224
11836 27224 48309 62410 63064 8075 -12545 12137 -29725 -32690 -22562 30849 52973 13990
11824 13990 27696 81557 89244 26855 -37048 9020 44066 31789 40231 1352 -50857 -89556
11812 -89556 1490 66603 48415 54966 48026 59132 34452 13000 7594 14969 28010 8280
11800 8280 11586 49747 77079 14827 -12616 -52964 -81136 -93858 -87727 16771 43626 -33913
11788 -33913 -35953 -45503 -34350 -45588 -27599 -32602 -36408 -28641 -38719 -14826 -24151 37214 42498
11775 42498 -15915 20135 23315 31864 -3003 -38386 -22846 35872 27958 -12989 -35386 -25787
11763 -25787 -8622 7259 14768 -551 -61984 -165396 -224611 -152867 -28351 -826 -84502
11752 -84502 -96565 -114041 -59578 36894 115074 61313 12302 -47123 -37995 -7528 14019 3093
11740 3093 -19868 -68877 -22323 8304 59798 83718 114098 90392 21192 -2193 -40434 -29455
11728 -29455 10991 30000 -8357 32169 103639 91003 44712 47148 23524 32157 57677 36783
11716 36783 -262 -35935 -46487 14993 7927 -40074 -74670 -135206 -133592 -82447 -69668 -89872
11704 -89872 -56302 -23133 -25101 -31763 -40071 7332 30036 -39423 -32677 -31568 -41004 -40637 -111881
11691 -111881 -102129 -87165 -118628 -128289 -135156 -145166 -114729 -19602 -15515 12179 40992 48159
11679 48159 18090 21605 -17801 -30566 -61279 -6412 3400 1600 44355 80129 110322 44082
11667 44082 4392 13732 29082 36486 62912 68704 17866 -2359 34822 24649 26697 15382
11655 15382 -54132 -111908 -77146 -2464 39405 8533 -14160 -15949 2193 7716 40750 24209
11643 24209 -2016 27524 -26875 -5776 -5448 -202 -33390 -44977 -48438 -37277 -13156 -6634 -45134
11630 -45134 -56697 -42269 -57248 -83927 -81291 -60348 -58738 7195 11563 -19967 -49460 -60385
11618 -60385 -8050 -527 -66234 -106376 -72718 -45513 -76330 -31052 29679 10031 -2177 44810
11606 44810 165291 130643 71206 78484 77952 51088 96313 117236 124753 121307 63528 84697
11594 84697 49747 -74997 -99690 -137591 -218874 -225620 -101488 13303 49974 114457 159874
11583 159874 173828 111619 86860 45082 -3147 -58468 -21753 16749 113344 110523 75651 39037
11571 39037 23140 44440 27119 62804 98374 43945 6693 18004 32902 29666 -19506 4791
11559 4791 87811 115442 90475 51520 -7222 -17431 14623 49474 83740 13690 -42603 -64825
11547 -64825 -64637 -58551 -28282 -29494 -47162 29645 9699 45472 68325 -11862 42871 143556
11535 143556 97101 -6963 -65598 -79505 -20930 -44237 -5827 59309 80536 45359 -12696
11524 -12696 -56686 -44065 -59121 -35672 -82211 -81899 -84451 -13526 41865 42880 -41106 -100457
11512 -100457 -123198 -134348 -107441 -98027 -65216 16795 61047 69633 157763 168400 95368 96822
11500 96822 91703 55346 -29990 -39579 25948 -19666 -43203 -84359 -51141 11611 -56471 -105094
11488 -105094 -44126 1814 70099 60067 13662 8342 -22767 -23736 -16891 -60000 -37471 -70717
11476 -70717 -105814 -106182 -143067 -162582 -100009 -1702 20786 -45791 -83642 30612 85651 98319
11464 98319 70030 46816 59377 14972 -67208 -145237 -77878 17242 93749 88541 78373 -10201
11452 -10201 -38518 -57513 -91202 -75061 -29566 4327 2616 -95971 -102535 -114973 -151965 -126879
11440 -126879 -77451 -64460 -37347 -25790 24450 10670 -26111 -14881 -9429 23255 87946 101288
11428 101288 100898 71075 23244 -21242 31150 39836 -13150 -27377 -13824 15345 -35324 -39886
11416 -39886 -30843 32359 3589 7995 81413 112560 76584 -44591 -6992 -6761 2825 -53429
11404 -53429 -64305 -8870 1787 -26943 -5864 55013 113797 103757 74494 30201 -29968 -3266
11392 -3266 -23581 -26298 -10707 -16792 -63270 -57507 13147 39753 -22546 -57107 -27171 -43370
11380 -43370 -53175 -66888 -22866 47174 60601 67233 -8933 -6593 -46437 -11102 31859 39863
11368 39863 1385 36274 42331 -1158 19316 -36699 -6637 29568 57169 22016 -40428 -106796
11356 -106796 -139837 -91332 -36685 6570 28238 28920 -13768 -67165 -112966 -99141 -98760 -51946
11344 -51946 17411 -22988 -78815 -94180 -68406 -16760 -13087 -6512 37216 5173 -28997 -39870
11332 -39870 -6420 -9842 -83436 -60940 -30002 -71803 -94570 2846 44340 15731 28710 6790
11320 6790 -31107 -20994 -16069 -54416 -62133 -1390 61280 61983 89619 106502 88425 -4083 -49039
11307 -49039 -43990 -47773 -85513 -69176 -4158 77941 124028 152400 149892 141605 126214 89674
11295 89674 64188 -9667 29120 65059 51091 -4884 -2923 46574 -11317 -70725 -115149 -129170
11283 -129170 -83167 -22292 46033 43849 -35717 -13536 10215 -41246 -77977 -20055 -4743 27995
11271 27995 34724 32652 34870 -4506 3030 80424 91298 80199 119473 94587 44007 17186
11259 17186 -13839 -37293 -53815 -24543 20766 46324 121103 102396 -5473 1221 -10969 21524
11247 21524 16914 713 44236 101336 78568 68750 83204 111992 151235 167389 358972 516885
11235 516885 568461 518664 445181 369049 314536 255707 199973 112154 108873 80461 34117 -11478
11223 -11478 -64966 -56592 21262 39137 9275 30329 53886 34545 -6428 -30434 -62368 -43102
11211 -43102 37916 11519 -36291 -39427 -1232 16320 9127 5118 16361 20454 33860 33997 69777
11198 69777 41708 -44050 -92861 -50863 13954 94170 121161 68591 18187 -41760 -37321 -23983
11186 -23983 -63273 -121913 -81959 -15011 -26881 -60647 -9860 -44232 -22023 42884 89396 124048
11174 124048 122008 80514 67727 21693 -27950 -34929 -42504 -31400 68207 54221 -5465 -27180
11162 -27180 -32108 -72976 -82601 -8795 19937 -12228 -75041 -113238 -115272 -88492 -10411 -68601
11150 -68601 -112370 -69493 -3598 -22712 -59139 -39887 18170 83613 94839 53688 27661 38055
11138 38055 14932 -8858 -1839 -24735 -41146 6391 25527 18444 -18613 11906 19621 16920
11126 16920 76509 115204 118261 57294 4227 11012 3176 67421 48957 -9289 -45242 -54820
11114 -54820 -28926 -107 5806 40077 136231 106910 75809 72890 -37147 -109382 -155988 -107013
11102 -107013 -21831 -57925 -75557 -39563 46960 47051 -35794 -79677 -48333 -34424 -5336 3189
11090 3189 29782 39676 20144 -4649 -12290 53795 38365 41124 33684 80892 19654 -23252 11818
11077 11818 44468 92967 105608 111695 144949 18461 -33914 9695 39957 47449 -25668 -101140
11065 -101140 -70807 -17031 15189 -22051 -2958 39164 88662 30888 16182 18074 -7298 -49739
11053 -49739 -74030 -59319 -63922 -111543 -104324 -58369 15752 40541 45392 41716 -9240 -40938
11041 -40938 -25797 3355 1957 -6596 -59850 -109024 -113096 -121201 -126147 -97666 19930 21383 -4536
11028 -4536 -102862 -96044 -59156 -63467 -66937 -65871 19371 90895 74073 21929 -38603 -36221 -23612
11015 -23612 -8374 -39392 -70097 -21072 25227 47242 44597 65048 33620 46272 78757 81821
11003 81821 47102 -46570 -23555 47289 20640 -53534 -66937 -12867 -22721 1072 31183 -41337
10991 -41337 -61793 -110997 -65366 -44687 -22408 -35233 -29293 -42845 -9190 77342 42346 10847
10979 10847 12698 -8253 13005 -2372 -32496 -10160 28244 -8268 -52706 -79967 -18761 -43132
10967 -43132 -83076 -110604 -141322 -143955 -137678 -38977 19781 24545 14171 42648 105723 137532
10955 137532 174369 114620 121739 28379 16069 -28800 -64037 -64422 -99216 -72524 -29685 -68549
10943 -68549 -70717 -2351 2573 18989 106080 106349 123027 71034 84140 65285 62888 50962 71713
10930 71713 40509 -51310 -22760 -6734 55648 62488 -4223 -29584 56306 86360 69393 -34324
10918 -34324 -62475 -46210 -27451 9896 -24751 -4077 -21186 -15793 -57577 -118368 -140488 -91330
10906 -91330 -57049 -58886 -90303 -66622 -122895 -114343 -57312 -36918 3545 -44095 -43363 19880
10894 19880 37029 43697 22554 35503 95885 119350 29405 1669 17754 38122 -39103 -95603
10882 -95603 -47939 -34082 -74482 10410 26246 -46060 -66074 -50513 -59458 -142609 -228502 -244669
10870 -244669 -180220 -108781 -110881 -27479 -5613 -38344 -45384 -43825 -31795 -102185 -114513 -73575
10858 -73575 -44119 -114359 -81381 -42530 6571 4829 -11546 -42835 -14275 60837 27027 -34940
10846 -34940 -28336 -49731 51152 120061 138844 132116 177828 286532 397953 428360 356169
10835 356169 259509 119377 48443 3674 91742 93132 79001 108599 68154 55031 -37718
10824 -37718 -40036 -7265 21768 -2126 29397 21955 18832 57285 32124 33736 52050 76607
10812 76607 41382 47222 1918 -34 -2122 -42155 -39199 2661 -10141 -29303 -35944 6091 15829
10799 15829 -15834 20862 28272 -7736 -59154 -70235 -28006 -23138 -81871 -92647 -65911 -7335
10787 -7335 43868 64336 62571 5215 27309 60112 89086 122478 102867 85104 51905 35387
10775 35387 71247 91021 38877 -9942 -52928 -62335 -32596 40646 48859 -36189 -67055 -58331
10763 -58331 -68326 -76131 -77598 -52714 -32972 -32885 -32461 44516 7185 -37932 -49240 -39203 -68730
10750 -68730 -60537 -49002 -39462 -43147 -87313 -107686 -29413 17278 -12254 27364 34106 102698
10738 102698 125986 66612 107792 93587 95984 140791 115853 29483 -11289 -30183 -44926 -9678
10726 -9678 33469 24171 -52938 -74125 -25069 334 21116 19803 17107 74659 105669 9702
10714 9702 24037 38801 -4197 -56848 -60421 -150802 -153380 -132462 -167434 -94674 16573 101674
10702 101674 110946 14488 -43150 -64268 -69712 -88104 -105091 -29184 57354 157566 112897 93571
10690 93571 78157 30280 36011 54309 27937 -14222 -7907 -19477 -26254 -27528 -42559 -6990
10678 -6990 14872 -4801 1071 -790 -30828 -21523 -18682 51218 107893 89728 16236 -17853 -31721
10665 -31721 -48856 -68949 -79444 -85924 -65255 -733 38350 47726 35034 49385 28060 32833
10653 32833 6936 47718 19254 60931 6023 -66430 -74513 -73798 -132024 -163628 -87274 -42136
10641 -42136 1427 5975 38509 38863 -12476 -46818 -44580 -54410 -63827 -53356 -21438 1091 -34754
10628 -34754 -70879 -109523 -68868 -5780 -25855 -55365 -99005 -50364 4499 -22658 -23296 -26820
10616 -26820 -7133 -35780 -72045 -49626 -22289 7976 -47326 -38017 -54447 -39898 -46924 -25889
10604 -25889 -57841 -59631 2533 14804 31623 7747 32910 66752 106825 88875 85109 54909
10592 54909 68737 23613 51463 85385 116551 114786 24804 -3064 21283 65462 62184 47668
10580 47668 5860 -41231 -106503 -59251 66122 121937 99431 75106 135542 130730 180573 169604
10568 169604 164643 206968 168560 120413 53831 40552 26185 9478 47161 14989 -42428 -9620
10556 -9620 -24785 13743 44417 41291 31328 111560 121367 51070 17400 7357 66233 199575
10544 199575 166489 101726 42958 -8475 -32377 -44913 -16676 332 -56680 -87481 -79523 -48223
10532 -48223 -24825 -10598 -24750 -13970 -20317 -17028 -25090 -20459 6059 27138 46010 116202
10520 116202 99958 19666 12512 12395 12166 -10635 -20881 -56876 -117965 -86340 -80682 -38601 -12717
10507 -12717 42747 51894 31237 -10605 -21398 72914 50152 -3111 -10425 49045 63512 48309
10495 48309 17092 19126 62473 48407 68084 12507 -63583 -127399 -110521 -43675 -48857 -64971
10483 -64971 8992 -17711 -118931 -93804 -104293 -84271 -82781 -33772 2332 -38584 -68300 -39477
10471 -39477 3963 30594 57781 49415 -20620 -116501 -124537 -80209 -94870 -16490 18706 -31864
10459 -31864 -8541 15624 66027 58620 30407 104339 104019 5522 14670 -18936 -79431 -60690
10447 -60690 -60827 -45575 54586 86043 138892 160980 156314 149859 75988 115669 122143 46979
10435 46979 10392 33063 44779 38552 42019 -16512 -46383 -50375 12201 45482 54419 56150 76925
10422 76925 102113 79676 13509 25993 92954 154069 137179 174247 145343 83234 48360 62298
10410 62298 97748 37287 9374 -32592 -28488 -48984 -127707 -106669 -52607 -20681 -9037 -31070
10398 -31070 1175 58334 29943 -19640 -59498 -126335 -86749 -14194 -54786 -53365 -80453 -57228
10386 -57228 -54467 -37710 26933 121227 106540 51926 -43156 -62907 -9042 1112 9436 -9401
10374 -9401 -33227 -6892 -1297 -5629 9650 -36798 -52263 -784 24111 18156 32369 38645 61866
10361 61866 52490 46517 10659 -13515 -39233 40306 89031 125172 108458 4018 -7625 56816
10349 56816 61134 -13019 -16932 -81000 -119189 -89231 -93868 -75372 -15805 24864 39088 52354
10337 52354 80146 54935 -15325 39178 57780 49285 73175 108655 51744 74216 90460 -10572
10325 -10572 -45675 -19204 12657 7485 -33907 -34704 45790 85324 29050 15176 23816 36620
10313 36620 156153 147491 84507 57266 107523 62044 73804 44050 84847 47548 -3267 22959
10301 22959 45962 15423 -8172 -64503 -45874 25392 36880 -58789 -89378 -110417 -105622 -59714
10289 -59714 -48872 -53680 -53182 -43570 -63491 -24477 23990 -87 -31523 -40702 -20871 -21402 40035
10276 40035 59973 -34475 -104515 -49828 -58772 -18143 -17512 -76422 -178010 -159465 -183165 -110709
10264 -110709 373 -32713 -5476 42310 32786 -51683 -128294 -138476 -126228 -91229 -58166
10253 -58166 -71416 -26116 -33541 -21990 -4957 -43385 -88283 -80621 -97567 -43343 65968 109897
10241 109897 76459 17187 -31015 -26383 -92942 -56531 8985 63704 30331 11037 34021 14219
10229 14219 -15468 -21813 -20232 -49131 -30831 -11373 -36678 -12984 106607 55984 10685 6677
10217 6677 -45157 -29514 14064 51759 121952 67026 38261 52052 13821 66549 156571 130471
10205 130471 76162 55628 87677 36205 57168 43970 18435 15694 49317 9292 31593 48426
10193 48426 44498 8228 1832 -21957 30744 17210 -8430 -37398 -38472 -50029 -14415 1407
10181 1407 -16718 -49561 -7682 26419 35073 55209 30378 -33333 -37483 -50864 -66555 -31010
10169 -31010 -30605 -51996 -102138 -183755 -156883 -341 14297 -14001 16507 21969 -22754 -35757
10157 -35757 -62066 21786 118281 124667 18006 -38244 -18932 -66651 -89462 -91311 -104627 -98167
10145 -98167 -80847 -88053 -36113 20343 71945 44583 47164 47508 101955 65464 16309 -18860
10133 -18860 -65475 -6892 55818 92737 123307 48700 -8771 -22410 38534 96664 96081 47494
10121 47494 7227 16283 -34631 -116272 -89162 -52240 -11600 -17302 71215 60593 33339 22215
10109 22215 31108 28134 -28670 9820 60602 50913 102598 80895 28136 -32225 -110032 -122712
10097 -122712 -42836 -21795 -51566 -84701 -97073 -61804 -21834 -48023 -33173 -33932 26828 70868
10085 70868 94271 17524 -60847 -23539 -47466 -62056 -69632 -59918 -39085 -86051 -38080 -27004
10073 -27004 -54777 -73194 -58233 -55343 -7212 -6641 47844 101338 85975 73619 113703 135056
10061 135056 126440 89115 101690 91176 17408 9948 55545 29884 10914 47557 43280 20393
10049 20393 13245 26093 -37793 -88166 -30480 -54922 -91402 -91328 -14657 -14425 -55783 27681 46201
10036 46201 -15286 1037 50859 17744 -35929 -66952 -59735 -12683 42177 36436 -31226 -71625
10024 -71625 4351 45142 36964 60910 4773 -40556 -13622 43257 15221 -36924 -44251 -104
10012 -104 -55113 -61007 -58759 -1809 55077 18157 -6007 -31356 -35110 15514 72916 40015 -59815
9999 -59815 -59347 4287 27948 -27690 -111458 -200188 -151900 -112590 -120986 -110147 -84483 -60557
9987 -60557 -125807 -159679 -124805 -77379 -52466 -56900 3643 5131 -8836 -65654 -56262 -67444
9975 -67444 -103000 -82482 35246 56419 61956 83361 34595 -23606 -17147 27677 84143 53623
9963 53623 3792 -19333 -41092 -74502 8601 11288 -32582 -110311 -97365 -37740 -123203 -77589
9951 -77589 -35975 -47566 -93082 -86468 -29689 -42459 -44649 -42932 -14700 556 2942 -18060 -14662
9938 -14662 -9981 -24323 -2304 -2353 -26969 25553 -15083 -60887 9463 40005 -32951 -43068 24445
9925 24445 82250 40082 18735 -20649 -53647 -25689 12762 44311 74367 36031 -77752 -97609
9913 -97609 -64083 -24452 -4593 6256 11923 23152 -6249 25961 -19590 -96236 -69783 52540
9901 52540 51067 4294 13692 78121 85109 94315 108249 106301 77254 149226 54649 -4436 -10550
9888 -10550 -21058 -48891 -43307 -28232 -49710 -52017 72651 126533 114759 74938 101078 175099
9876 175099 162515 126156 110187 34159 -82117 -53468 -4920 5982 -8122 18383 24601 8438
9864 8438 -2635 46352 149290 140720 41358 4644 -20440 -25628 -30352 8718 -24623 -86191
9852 -86191 -54058 -10284 15755 25557 20246 50275 4519 -9043 -11820 -3627 -5935 -58167 -84498
9839 -84498 -22061 -23368 -86096 -152102 -153077 -125618 -6258 33619 -8851 7288 -6617 -39116
9827 -39116 -41095 32197 32076 -22117 -19994 -9702 74368 105304 112532 143321 33507 -79094
9815 -79094 -5312 33374 -22326 -35418 11106 -4727 -30642 -30612 -27844 50162 75235 98638 37286
9802 37286 -43062 -18236 59456 108666 63967 42360 60719 -3351 -62287 -110558 -118804 -104527
9790 -104527 5726 73725 96711 112558 58666 64915 88710 59490 5753 -2053 78749 123916
9778 123916 48040 -3994 63131 143663 53381 -21939 -14783 -23883 -5599 -18492 -28285 -41499
9766 -41499 -7967 -39638 -62848 -12583 29283 -13823 -64315 -37198 24082 -25865 -80274 -102924
9754 -102924 -96359 -89882 -28321 18282 2309 -8276 -16651 -11703 -55707 -78583 -42670 14746
9742 14746 4308 17974 -11796 -2573 49253 23066 -48002 -128199 -170602 -191659 -182080 -39635
9730 -39635 33640 -13575 -22700 23568 -34396 -27219 11646 73261 47450 -66153 -45430 -49610
9718 -49610 -74830 -29013 43649 10750 -10387 -42039 -26391 30934 29510 -14521 -49074 -36395
9706 -36395 -53621 -39401 -48432 -19864 -23364 -51535 -82294 -42175 6072 -43922 -55710 -46675
9694 -46675 -35896 41594 51322 42679 -16687 -19859 26552 50469 33024 116368 119541 75398 18059
9681 18059 18981 38484 29075 13497 4484 28076 37017 23179 32596 -7909 -21947 5889 21905
9668 21905 -46242 -66915 -39695 3604 50186 -33487 -55853 -70961 -56018 -61703 -27815 -92398
9656 -92398 -72726 9628 37227 48216 -14067 -11917 -40703 -35619 32384 42031 19152 36516
9644 36516 -27346 -4753 34869 45339 29030 -52827 -83596 -81350 -84307 -117474 -119633 -101739
9632 -101739 -55147 -19266 29791 56061 68152 89821 61335 5156 20053 72127 61258 83275
9620 83275 104570 80914 52711 39467 -36029 -62232 36746 68589 -9178 -38375 -5974 -21169
9608 -21169 -2666 83420 152393 99767 132607 123992 101924 152475 158661 106693 69800 126567
9596 126567 88385 29046 16081 40058 28048 59862 -26330 -196417 -221684 -169156 -145430
9585 -145430 -136367 -65688 -91214 -72693 -66625 -45900 -29482 -67070 -106410 -53991 -42545 -34528
9573 -34528 -38236 -81578 -28585 -7033 -38113 -89726 -59394 6913 51672 62797 55840 67473
9561 67473 70867 59476 47244 33520 27962 71640 66690 19292 -43078 -71423 6396 74739
9549 74739 47259 68177 107459 90750 38966 73613 77868 51541 55727 120445 222064 204163
9537 204163 135744 87414 114345 103472 82320 27894 23702 438 97736 160212 113099 118583
9525 118583 32680 41369 38591 39480 26320 -28857 -116550 -111426 -56822 6126 31252 80743 44403
9512 44403 3810 38813 79597 26097 -1597 -34801 25702 32513 15861 57282 47810 82851
9500 82851 55531 -9878 -51857 -29413 12745 22473 15692 32219 15845 22702 55639 100944
9488 100944 96248 5250 32581 43127 22206 21888 31364 40781 48477 27623 70046 53753 -39822
9475 -39822 -87692 -77539 -43193 -79703 -62672 -46310 -42492 -69613 -99196 -136854 -110731 -63464
9463 -63464 -47800 -10986 100911 85960 15777 -27891 1260 46271 -2539 3791 67395 105830
9451 105830 87747 107440 80010 38542 31108 105315 61767 -9496 -18946 -84798 -143810 -130758
9439 -130758 -56410 -19905 -34569 -90916 -63649 -21786 -3834 -65533 -7374 4465 20971 41343
9427 41343 63700 -11817 -59172 -41807 -1843 36304 50375 7176 -37014 -43062 -6916 43084
9415 43084 81908 128794 97972 68118 72650 28370 -9338 -28981 4266 41606 -49137 -7140
9403 -7140 30656 -42659 -55453 -53952 -64369 -20286 47947 42743 -22363 -29487 -8738 12039 -11236
9390 -11236 -46507 -45000 -19560 10290 20801 -8483 -1005 27439 -1284 18028 -3603 21109
9378 21109 47580 -1276 18751 113460 110193 69651 74953 55760 11020 42956 76261 82961
9366 82961 90870 87908 97780 138153 163714 156538 189795 175420 131401 110845 117790 86387 99468
9353 99468 108900 37393 41120 90052 91020 133720 101006 66369 90163 83557 73843 83882 132571
9340 132571 125226 115293 89290 44337 25140 82066 113940 62814 56940 16888 24912 66669
9328 66669 79859 72860 52826 54396 9140 -37435 44019 106849 32229 4751 25370 -37323
9316 -37323 15562 106907 112011 97945 90242 99212 110597 81868 42583 14024 69149 124201
9304 124201 176278 152014 76075 74280 85816 123164 164637 140190 93614 57282 51645 43807
9292 43807 40932 -2380 -45065 -61394 -61373 42317 113444 144163 120216 94195 76561 95709
9280 95709 135641 108604 53301 -12 9110 51390 107073 110266 157241 160916 225186 187944
9268 187944 87210 37945 -9363 35503 82710 42408 62407 195913 202752 174097 154433
9257 154433 174583 208887 179344 223137 310043 295272 219810 115492 92173 96612 163253 212395
9245 212395 188761 133238 62233 114801 194085 173818 131751 116317 97768 136445 140029 112560
9233 112560 57269 103491 190589 146784 87829 71170 87604 91099 107691 173632 130067 109979
9221 109979 151679 120036 174451 193268 123159 99063 113941 92943 73124 114938 106733 93036
9209 93036 74883 48700 31312 8251 8478 24429 77385 131907 140062 94442 96060 89240 81949
9196 81949 76588 143739 175369 137181 139493 155279 128378 174663 217231 114889 46256 148095
9184 148095 155528 71524 121728 155284 172383 215401 253834 252761 267265 217542 235586 279264
9172 279264 217621 199226 175368 144575 89837 125823 184616 188596 202689 260796 262109 227051
9160 227051 244602 214585 178784 173369 183709 243920 269112 243166 189607 185251 195631 211956
9148 211956 232427 199706 234985 298287 279982 228587 257999 304391 290631 335677 309691 243340
9136 243340 269107 279459 367516 499799 555486 589777 651128 730946 726154 716863 724666 797876
9124 797876 950234 1048946 1144050 1334533 1555814 1905623 2303562 2800760 3344888 3944792
9114 3944792 4706317 5735120 7052050 8933915 11737165 15746024 20578020 24420156
9106 24420156 24777649 22411291 18892834 15137397 11774613 9059113 7111766 5713505
9098 5713505 4601539 3776604 3203137 2748615 2350619 2061781 1839952 1648111 1484636
9089 1484636 1406103 1303830 1162717 1080381 997354 944369 864667 786075 740724 678280 565502
9078 565502 489881 446130 359697 370368 349431 312321 302669 284857 268492 311021 297231 357159
9066 357159 418431 373645 320752 307101 282889 285429 256609 305983 291020 246830 284062 265985
9054 265985 263600 270326 243122 179872 180695 266638 282761 242121 271167 267427 263285 270096 257905
9041 257905 204653 178329 192157 215016 213340 185389 195164 220580 201509 233269 267758 286161
9029 286161 272457 237301 168681 191778 185532 181945 192635 159494 107962 81229 106258 115932
9017 115932 125676 150491 63922 63425 113794 97851 92923 86948 73262 84613 92761 68886 122104
9004 122104 88824 75444 110124 5734 -37912 8763 168867 217355 150689 81152 132743
8993 132743 185960 151596 157162 159382 169538 136977 126264 102086 60049 19319 292 58086
8981 58086 111902 172725 172764 143011 204992 174542 132312 59989 66194 82183 48154 71438 178012
8968 178012 180048 182945 143027 180312 179425 205128 207538 169985 150816 140987 126676 141612 147100
8955 147100 174206 129058 67741 34459 16982 14795 33010 -17699 -11115 -56908 -48336 -27975
8943 -27975 -12474 -11758 -39899 -25610 -52062 -97351 -93141 -55370 43765 56568 11235 -20783
8931 -20783 19171 91886 112585 16932 -8357 30940 1194 90038 113703 147411 213580 192745
8919 192745 141406 123990 120040 43480 -31242 -95226 -104001 -10924 70405 93262 37632 -43845
8907 -43845 -20349 18923 96794 133794 116317 105922 120229 146829 155133 167785 165233 150445
8895 150445 100270 119692 117747 80685 87336 59043 75806 83464 78979 93250 149003 113931
8883 113931 51664 70139 142183 145929 156531 229638 198122 179705 147132 142699 128738 100195
8871 100195 112367 140460 74043 71082 36102 83894 103099 -6219 2827 60721 67631 15969
8859 15969 7702 -51727 -110306 -89092 -39829 5458 32255 12114 -31573 -15512 1327 40234
8847 40234 57432 59620 21487 48020 68958 132794 110385 90240 98081 25589 -46949 -11007
8835 -11007 85374 54426 12500 22594 -1599 -129 77944 112378 58764 -3355 27375 32763
8823 32763 21199 24909 24910 33046 42687 35606 12894 -41867 -18687 69930 42742 61516 62688 103350
8809 103350 144257 86772 80893 134666 136699 113453 64319 94640 181201 232706 232054 211067
8797 211067 199304 128384 68968 13099 -4372 9578 46172 21867 22783 28434 -57043 -102485
8785 -102485 -16784 59284 89813 56996 109978 141814 137614 162956 69127 54850 23138 -28027
8773 -28027 -12311 -19303 22137 54314 22546 -4333 -2862 9479 84283 120318 121162 83566 51818
8760 51818 89205 153404 146278 112976 109528 106244 162314 210355 157548 36936 16106 61008
8748 61008 35667 117033 111784 86943 66259 57291 56088 85391 118290 60964 8924 -4701
8736 -4701 6697 95260 94966 114589 93080 43963 17148 68406 164347 98726 46422 86815
8724 86815 110457 93304 177712 241456 246440 131670 82131 115314 139344 175908 196599 204127
8712 204127 147608 132494 30922 -19760 84644 113812 84897 18234 -60720 -65512 -61764 -1610
8700 -1610 101558 129002 44733 7525 15487 46933 43283 36771 36798 27897 13440 58348 61754
8687 61754 652 -47124 -5530 -11150 16914 97422 68768 47921 57157 73417 78243 130758
8675 130758 123902 116525 147056 148359 91442 109552 76504 7346 36525 -17777 5443 53005
8663 53005 21602 -3881 -44579 -16187 28527 73821 53582 70385 80204 116116 116594 159288
8651 159288 172333 234175 181275 103189 111557 97385 66409 143742 174152 166647 174407 127491
8639 127491 82220 99330 62858 45653 18107 65267 82193 77566 74493 129730 153223 101653
8627 101653 72238 81168 70502 55170 54115 58609 75797 49421 48184 38872 36528 -35685 -16999
8614 -16999 118111 164797 243171 160940 180071 231166 236018 265925 321002 339759 335196 348734
8602 348734 382798 442303 433148 423634 491764 520519 450021 404919 407884 399723 390711 386294 316581
8589 316581 288301 216825 176491 207008 193151 186990 186280 182196 151289 207564 235787 252633
8577 252633 248004 307560 418231 512048 563910 649231 964634 1393644 1638186 1497141 1240208
8566 1240208 988150 731727 548176 361542 244047 239852 249886 275568 248522 179711 166066
8555 166066 233328 270771 200115 195612 205527 219024 164012 163915 107374 63445 -46431 -16998
8543 -16998 24283 91768 62137 104451 192097 261652 266146 180895 184516 246329 359570 440016
8531 440016 511829 598859 761724 981831 1489141 2396631 3317238 3287724 2771771 2182793
8521 2182793 1569123 1092602 802176 637184 488374 401266 294971 205142 187295 168033
8511 168033 171035 105534 130725 171089 169976 136845 97216 115424 156641 119382 125829 60336
8499 60336 56745 57933 65940 132982 132339 100790 126980 156858 159364 134491 121635 160213 251582
8486 251582 348543 430734 515112 703534 1080430 1541037 1714129 1500812 1202661 925524
8476 925524 673512 494414 345092 285916 241290 183138 105438 94270 138518 141927 152345
8465 152345 137450 101795 116951 127669 38450 -52401 -55608 16080 70999 81977 34170 72380
8453 72380 97900 113281 79720 96664 32273 20497 51041 49996 -2286 37180 52358 102142
8441 102142 64332 24199 38664 42794 116902 141884 141875 88305 17624 -8145 7605 -9410 14899
8428 14899 26282 34696 50274 7585 71821 43863 -12702 11635 50259 140870 147344 133565
8416 133565 75303 6260 26420 65915 36690 -15108 12924 1719 -6141 32020 5336 -12697
8404 -12697 -68494 -18784 -14464 -57175 -87832 -64617 -38105 -78242 -105582 -40002 64013 110702
8392 110702 64351 4862 46836 140409 117988 63611 82439 106404 80119 9710 7714 60086
8380 60086 77910 88334 43066 -15003 122700 215856 233322 204704 236127 287012 367584 335079
8368 335079 280638 342495 408570 521055 709478 992801 1433686 2064979 2445410 2268837
8358 2268837 1802823 1421407 1122055 866457 703065 497764 316349 256159 253143 201146
8348 201146 165558 157637 218045 214284 204050 181499 146785 114796 86673 118741 132873 107252
8336 107252 80745 101645 99951 94337 123864 240254 349865 378236 430881 534298 684808
8325 684808 792891 954181 1264024 1694634 2209993 2434699 2129142 1735070 1317503 985165
8315 985165 689741 506459 473067 452237 370170 285507 207448 212597 209060 206479 210155 230987
8303 230987 221187 253134 243022 149665 31581 21118 41544 59061 76986 33806 73711 109762
8291 109762 100607 53980 32028 15849 63246 22530 -7681 -25498 23670 137324 134769 132090
8279 132090 141118 78028 51553 -8088 -4455 41667 65472 117712 139517 113563 121785 16881
8267 16881 -9045 -24757 54881 72070 43566 -10243 -28513 84510 200324 224561 174751
8256 174751 100866 86048 36255 -45343 -63350 -52119 -11765 64039 113907 95885 94603 84984
8244 84984 77638 23949 41398 25325 -59973 -9092 25686 34603 4030 26948 30851 75977
8232 75977 82557 94168 5701 -68302 -19653 -16495 -18195 3222 -37533 -46285 -11799 45657 115028
8219 115028 136911 109324 45522 5432 -3829 19055 71729 155921 173359 125106 104537 43647
8207 43647 37879 -13063 -10404 -3794 -72139 -4981 57006 59453 51518 -6555 -58804 -45857 -76224
8194 -76224 -45710 -24712 -47554 -6169 4421 18244 21056 80543 47045 14504 8367 7345
8182 7345 22235 72627 97397 143855 236467 189233 102086 56284 75984 115551 125982 64062
8170 64062 34191 49471 100276 88913 101673 137807 120058 130184 124729 151412 175845 139414
8158 139414 35054 -3006 38051 25273 40351 52849 67574 107289 50329 19153 67717
8147 67717 6868 -35636 -6631 11783 -24992 -69499 -65287 -100472 -94122 -106515 -12396 6186
8135 6186 42211 62259 51878 102292 119573 89800 20012 -15255 -62383 -86238 -23116 -31084
8123 -31084 -21757 -34821 30658 77181 64798 35221 19289 -35591 -30819 10167 129675 161729
8111 161729 61394 21427 97492 92674 39604 10733 75053 55050 31674 -32786 -60201 -15328
8099 -15328 68573 60674 -4341 38819 62802 64277 53393 58530 20845 12133 27147 2752 20020
8086 20020 -41650 -107854 -52302 -26941 10527 91403 86318 40069 103801 118289 81969 61996
8074 61996 13344 -36743 61189 196918 166489 56416 33487 71924 102565 38052 28049
8063 28049 64924 50966 -29909 -62020 -68247 -5397 62162 137395 148346 110544 124869 103903
8051 103903 69915 483 46550 108455 126484 74218 -48450 -42331 44345 80028 106623 139616
8039 139616 84252 16541 -18693 58381 67305 157953 159993 123883 106448 111718 98335 125545
8027 125545 125357 78997 89795 32383 41577 112963 107620 95232 -35200 -86636 -80792 16393
8015 16393 74885 81710 68762 90722 103488 89905 131934 154121 89031 45733 37180 10751
8003 10751 53849 45636 46176 69020 188385 204460 187417 176472 143569 79584 29721 -25571
7991 -25571 -26090 4498 15998 -3754 26115 61830 58054 -26766 -62590 49602 52901 -42663
7979 -42663 -32543 -17011 -9418 -31988 -1795 20452 43872 93987 87491 105516 83732 86060
7967 86060 48309 11352 15117 40865 66763 127088 116784 168173 193550 195238 144675 125767
7955 125767 82373 74080 91436 154122 126732 160467 182805 94940 125295 100610 55779 85237
7943 85237 152950 207654 169475 120591 138022 135178 174733 265737 224701 137141 117023 144551
7931 144551 142153 206017 223260 173798 145091 93949 112671 101262 97125 92743 98447 85055
7919 85055 104740 113664 143497 162146 211729 202267 167370 141597 110838 152488 148091 96362
7907 96362 73949 60376 1723 -59518 24633 89741 144997 165216 168754 179832 221663 213988
7895 213988 206510 168977 136755 75566 53066 62458 122750 114016 122136 145414 153652 35388
7883 35388 39081 102677 100975 119794 78196 6860 -32009 8584 43019 103181 113576 78891
7871 78891 4668 -16064 -2564 43326 19980 -14181 -83762 -98008 -33064 16586 24753 35395
7859 35395 34237 75495 84289 35796 -17889 -49393 2959 -55948 -103699 -71262 -14683 -16486
7847 -16486 -11204 34387 41984 -19495 -46828 23529 28863 53291 77777 106272 130668 128720 115769
7834 115769 50180 -12242 -2899 -50776 -4001 20114 26381 30057 -24701 -62314 -86295 -21514
7822 -21514 60651 32833 -54413 -75821 -60433 -38647 -63548 -63028 -20412 55187 84478 3532
7810 3532 1390 -11189 23235 71653 52142 -6655 -50589 -5518 -16487 -18812 -72038 -144312
7798 -144312 -61442 -50855 -74352 -97896 -70741 -43275 -48913 -41001 68 -10277 -53236 -813
7786 -813 39472 31409 67900 102327 117890 104781 111786 171964 154381 14836 -39101 -37213 -4025
7773 -4025 -53992 -24806 -23333 -47926 -76275 -49671 -9278 -24643 -1529 15822 80463 118641
7761 118641 66797 -12863 -58862 -48654 -103463 -23062 -34943 -32462 -49918 -37058 60071 69302
7749 69302 9754 12906 -21187 -42825 -81770 -21198 -13662 14593 14631 15719 61775 84285 103449
7736 103449 5011 43750 92478 54815 36558 40891 7442 -24689 -38002 -37720 23447 15427
7724 15427 -15484 6592 -8009 -70725 -65586 -43400 -56429 -83644 -38648 18970 29223 73516
7712 73516 123084 148624 128042 132482 65163 -41509 -118212 -129781 -85409 -5071 -10153 6676
7700 6676 101282 86672 35635 -15652 -47198 -69374 -44576 -1763 36208 66570 45521 123846
7688 123846 145152 44140 10934 14398 -48146 -41846 42506 42424 -66106 -55487 -47579 -119464
7676 -119464 -120319 -78630 -12336 11963 49019 20207 -21747 -53333 -54321 -99732 -93230 -31700 -14102
7663 -14102 -31920 -44633 -84897 -139906 -151085 -65335 -26032 33806 67637 93788 47601 51291
7651 51291 63613 -40565 -69493 -26693 -34881 -65296 -113955 -149875 -183013 -134945 -49095 -12929
7639 -12929 -12206 -33275 -111433 -119681 -68514 -15008 -928 -11033 -81863 -19389 79760 63551
7627 63551 17069 33674 30738 78473 61710 -10234 3657 -37466 -97298 -117947 -65699 28934
7615 28934 -9717 -68978 -25048 21942 20477 225 -44923 -74288 -136361 -131434 -83907 -40033
7603 -40033 -24899 -5757 -30545 -8131 -3315 76748 122514 44491 -22663 -15692 -24175 -43480
7591 -43480 -61344 -39121 -75206 -185041 -194675 -116405 -43907 -63907 -73821 -83257 -36394 30757
7579 30757 6042 -125594 -109768 2206 36262 -1156 -32420 -13996 53115 79045 95526
7568 95526 85944 19779 18784 45935 14832 -53405 929 13030 16522 25383 -75238 -64875 -6181
7555 -6181 -17197 -59246 -73002 -53306 -11936 -10200 -34446 -53712 -58593 -104632 -172834 -135066
7543 -135066 -73870 -36215 -32852 -42994 -62866 -91537 -38104 -54071 -86825 -62347 -57819 -52757
7531 -52757 -7698 -14780 -60769 -10288 1543 -15231 9953 40643 71379 31394 8951 66189
7519 66189 29701 -15005 -65258 -21217 17499 37823 23328 47457 20171 -53569 -115686 -120972
7507 -120972 -85152 -124177 -48583 -55277 -39988 -6596 -2159 7970 -17018 30863 24858 9850
7495 9850 10833 37962 86627 31086 48865 55626 90772 136267 77884 -20021 -44561 -42441 -2618
7482 -2618 21320 39226 81666 90819 170056 150677 39170 -39853 -42310 7408 22520 -40770
7470 -40770 1823 -12915 -12255 -2657 8579 -27093 -75503 -101130 -85034 -54987 -82208 -64311
7458 -64311 -85090 -107863 -25292 71522 91907 36408 29443 -49865 -194026 -131083 -18476 -40980
7446 -40980 -77483 -72435 -34916 54675 60910 46738 10860 19054 2963 -33004 -27322 23867 72899
7433 72899 10455 5352 46474 83902 23346 -25383 -11114 -18090 -18277 -17363 -81029 -19509 42043
7420 42043 13562 -52950 -1715 50931 28369 -9406 34447 47800 -23166 -56454 -35750 74768
7408 74768 44077 12413 46044 -25014 -57434 -9627 -57052 -58891 -101538 -158432 -160050 -144903
7396 -144903 -120788 -133082 -63234 -54730 -89269 -77834 -60935 -62504 -82796 -63369 -45932 -47022
7384 -47022 1428 43136 11393 -6884 7433 26869 2202 -31695 -27907 -75799 -75915 -76695 -32212
7371 -32212 50981 40189 23658 105440 140486 88954 62613 13269 -52033 -6254 2927 16622
7359 16622 51935 43667 -830 -14307 14195 23479 -13930 -34315 -64085 -13839 -3441 -1406
7347 -1406 -52970 -113834 -135054 -66733 -20693 -1135 -10374 -58525 -40482 -29888 -4359 -10594
7335 -10594 -70841 8806 -28402 -11642 38666 -24490 -29510 -11071 -51666 -40887 -27489 -43197
7323 -43197 -38921 -12011 38332 31548 11490 44498 33305 -32623 -24381 -14671 49347 71514 34709
7310 34709 29497 55828 68412 9490 -43143 -129239 -138319 -133500 -68746 19165 -13244 -74640
7298 -74640 -158931 -185756 -124869 -74327 -89482 -89561 -107748 -71248 -48575 -21508 -88259 -25887
7286 -25887 8144 9906 -41965 -75604 -76226 -74656 -9245 7030 -7065 29088 63449 30646 9643
7273 9643 4645 14021 40336 64162 71429 113436 77148 63161 -13076 -50925 -27481 -20077 -39661
7260 -39661 -87897 -161273 -154921 -93128 -81583 -87359 -75842 -93537 -80914 -74280 -22456 63780
7248 63780 78369 56815 15615 3257 38944 65967 103246 96945 48036 -503 -47311 -104344
7236 -104344 -83983 9084 -9311 -26393 -53569 -62980 -37808 16108 -33507 -113034 -124524 -77293
7224 -77293 -83663 -59606 13762 19434 -51132 -64294 -4594 -2372 -3074 -25537 -48662 -10654 -19603
7211 -19603 -45487 15348 20844 -24832 -93730 -88593 -44978 -55714 -11383 26939 42474 29671
7199 29671 54441 138982 71260 -18473 -59795 -74005 -80656 -19544 10635 22680 -85784 -118709
7187 -118709 -77142 -57963 -61683 -42283 -48152 -87516 -91890 -71681 -82032 -120549 -148539 -99069
7175 -99069 -48176 -67756 -122165 -58711 -74825 -89514 -107130 -94769 -44051 -47998 -101064 -100836
7163 -100836 -91220 -66346 -81798 -56836 -61582 -51700 59011 32627 29114 45298 -5057 -32075
7151 -32075 -42540 -30691 -17891 59587 115082 87776 36452 -42687 -83039 -100183 -49411 -56806
7139 -56806 -40330 -15408 -90675 -90710 -154695 -86565 -49079 -122694 -170754 -158615 -151413 -89053 -8930
7126 -8930 28855 -105015 -152581 -104025 -76954 -128591 -109108 -80623 -20010 74294 113068 116445
7114 116445 81207 -15919 -23717 27753 -18533 -70169 -107051 -136739 -143123 -61484 -22009 -48649
7102 -48649 -24768 13595 -37331 -57560 -95561 -119157 -78439 728 19807 5268 -902 54116
7090 54116 82310 50867 49915 7440 -36851 -44095 -10975 -4558 -84216 -99698 -63854 -21574 -40563
7077 -40563 -7410 -41917 -28795 4203 12578 5384 -10907 24785 -55186 -137911 -71150 20478
7065 20478 90966 68288 29800 64297 37909 -14718 7622 46526 6188 5316 -148 14756
7053 14756 13344 -36590 -11581 -20994 65555 66253 -40477 -86438 -24448 -32315 -78545 -88663 -67206
7040 -67206 -60032 -36768 -9650 -9004 -57164 -47644 54873 61857 14326 -3343 17486 30954 -13102
7027 -13102 -71479 -62609 -22890 -29405 -84537 -132192 -131782 -89810 -39494 -110813 -194799 -144377 -76989
7014 -76989 -26033 -72517 -51449 -28316 -4394 31881 7397 -62510 -71012 -36884 -550 -9697
7002 -9697 11367 16095 40144 21095 7926 -37554 -54970 -65798 -70501 -36540 -34946 -25347 1905
6989 1905 -27186 -25510 -21257 14543 11661 40565 17573 -53259 -96585 -117074 -110295 -112894 -33920
6976 -33920 -4018 -77014 -86665 -13516 -64038 -46182 13832 30088 -4116 -23054 -23408 -7412
6964 -7412 -17601 -41382 -39260 -80404 -112721 -45623 1181 -30094 -36514 -24187 20662 17629 30805
6951 30805 37370 16703 6454 -467 -65860 -60465 -7687 -66400 -95267 -114418 -104672 -100845 -154188
6938 -154188 -158575 -86966 -62140 -43646 -71922 -86768 -88422 -54316 -67164 -46108 -20372 66270
6926 66270 54268 9224 32399 109534 93591 18665 -58083 -78178 -78272 -58647 -86945 -95963 -110947
6913 -110947 -68376 -84092 -115286 -123754 -40791 35942 -7324 -92063 -100470 -80724 -124416 -101260
6901 -101260 -143990 -147543 -88604 -65781 -22372 -30041 -64190 -10161 -13445 -43990 -58486 -78583
6889 -78583 -76974 -55103 -40357 -53441 -71620 -83770 -68193 -78704 -51641 14679 44563 39128
6877 39128 58843 68018 21709 -20159 -22617 -38219 -33449 -36877 -5414 14925 -49873 -57062 4534
6864 4534 17897 72872 40020 78826 130340 51619 71427 131629 130332 181142 166565 83052
6852 83052 55242 -13593 -56548 33919 80645 61167 83586 70846 73393 50023 -26884 -26195
6840 -26195 -34974 -86155 -99504 -72161 -127192 -125792 -139708 -67889 -16086 -49486 -63384 -19223
6828 -19223 36779 118534 162492 137655 109575 61799 33475 -13280 -98668 -71165 5323 -12296
6816 -12296 8992 -41526 -60289 -75529 -43245 -31365 6739 39103 -30107 -125675 -162265 -125199
6804 -125199 -111433 -115549 -66541 -60027 -36861 5015 -22495 -58413 -15110 8252 -8299 -38244
6792 -38244 -113532 -186895 -222343 -199835 -148477 -78282 13277 38300 -67851 -61202 656 -17939
6780 -17939 -75265 -88250 -88761 -75655 -46783 -32992 25818 14323 30935 67714 33689 -40497
6768 -40497 3375 55460 54279 46663 57214 49274 23071 -39644 -75104 -109602 -87199 -116105
6756 -116105 -117158 -64127 -107340 -84068 -55007 -93659 -33299 810 78788 122076 139352 148585
6744 148585 146167 131327 131446 124618 132451 119950 112895 140709 195852 250128 265328 281773 311586
6731 311586 419526 550357 780888 1008193 1276099 1671099 2318778 3299584 4021981 3789433
6721 3789433 3082745 2396098 1746505 1253652 939682 777706 640410 499875 378075 255792
6711 255792 213835 148334 114411 140681 186877 187305 170548 76668 124869 162161 220178 217177
6699 217177 166193 192244 244753 259558 222784 195058 97735 59772 56877 49450 72280 68511
6687 68511 66466 42876 35535 89538 92186 60781 785 52741 107352 37477 -25403 2801
6675 2801 23023 -17208 59464 120171 114485 39777 -10906 24147 -422 -86000 -82522 -50833
6663 -50833 12778 9143 19352 47361 7043 -24083 -9817 -12020 -82866 -135903 -91566 -66357
6651 -66357 -74629 -92965 -93460 -128412 -107740 -127747 -108323 -91162 -88910 -108214 732 81719
6639 81719 60876 56995 24586 14785 -13526 -32190 -75467 -15204 50606 27163 -48145 -67310
6627 -67310 -57870 62652 104714 160023 162441 143663 132300 135165 114729 18153 -53853 -37022
6615 -37022 -35213 -62671 -79578 -50076 -43754 -4047 40443 -9750 -36253 15278 12113 4220 -24150
6602 -24150 -290 -56382 -83161 -14276 12316 -3096 -25733 -69895 -94200 -23143 -38727 -81404
6590 -81404 -76647 -42564 10608 -21613 -17113 1600 -95542 -97386 -102675 -146076 -150981 -100420 19952
6577 19952 5601 -58908 -4730 12741 -29829 8575 -68189 -47033 -20192 -8745 3309 2480
6565 2480 35517 48766 8859 -50026 -84994 -67656 -14478 11577 -4131 6988 -50929 -39785
6553 -39785 -70649 -129434 -120894 -37114 -20723 -5217 -20446 -124670 -139676 -59693 -11105 -29214
6541 -29214 -29010 26291 49372 25948 17965 -43429 -56314 -30737 -7121 -7356 2269 -33140 -31347
6528 -31347 -16836 16647 6405 6842 -27373 -63259 -62594 -53808 -28174 10844 53937 100020 138411
6515 138411 79111 -14794 -26638 -62220 -122408 -127776 -49789 -53516 -31615 -49420 -101552 -66831
6503 -66831 -84368 -104123 -67102 -54959 -53434 -47099 2811 7729 65175 114272 63990 75692
6491 75692 79218 26217 -8383 -9064 20289 -5630 -14641 -30880 -41163 -24168 -44533 22262 15161
6478 15161 -17160 45908 24029 12777 24439 -29807 -57290 -49383 -45401 -60117 -45464 -5369
6466 -5369 -30640 -106937 -110655 -78222 -61747 -31319 5604 -3552 -50547 -26930 -80492 -111903
6454 -111903 -149698 -157782 -147182 -88409 -118185 -124976 -64205 -45111 -44699 -9025 -2892 52398 41432
6441 41432 41591 41053 12391 10312 14662 -17542 -70361 -22782 33811 45912 110873 70891 40831
6428 40831 78708 31694 32274 25286 65304 97723 53207 -16030 -43473 -42720 -96846 -103611 -98932
6415 -98932 -80112 -44852 -72874 -168913 -190042 -166511 -131513 -149458 -145502 -83344 14324 31871
6403 31871 36730 7002 8504 -38916 -30956 29746 -8914 -51541 -27270 8564 35121 29314 27423
6390 27423 -19620 4500 -6892 -75639 -107142 -159979 -31435 105189 119226 71527 49993
6379 49993 -28303 -70608 -52541 -66192 -107388 -39318 -36075 50700 68167 102054 124374 52712
6367 52712 -33365 -64837 -60044 -46213 -57192 -40528 28148 49705 78444 64794 5434 18082
6355 18082 26887 -20145 14083 21625 -5991 -57165 -25199 -40366 -55880 81468 102837 55317
6343 55317 15033 -34696 -93137 -24225 59570 76097 85573 9491 4896 19866 6779 -1739
6331 -1739 -26166 -20732 -4357 -29385 8265 17461 303 -31070 -39880 -3901 -93468 -58626 -33384
6318 -33384 25518 13047 -2417 -45110 -80877 980 52684 59478 37796 22310 -22377 -87527
6306 -87527 -40804 9596 23802 -57982 -68618 -41276 11447 -15720 -134881 -153540 -111672 20834
6294 20834 42616 -11748 -21767 -32989 -89257 -139008 -110727 -108811 -87528 -18714 15729 8179
6282 8179 -822 -65174 -49323 -21621 -11381 11306 -29383 -74373 -60268 -17400 -64451 -53288
6270 -53288 -55784 -60573 -141977 -156160 -45560 -26224 -3000 9780 2947 -50918 -21253 -14459
6258 -14459 -11550 -30845 8722 87032 95769 45082 63634 66601 -11951 -111922 -118142 -153340 -206899
6245 -206899 -153977 -98769 -124592 -98426 -33078 -79406 -59202 -23596 12097 13154 37301 24132
6233 24132 -56993 -101664 -102842 -39575 -62282 -65397 -38036 -28807 -38681 -71002 -26727 -11166 -20618
6220 -20618 -48434 -89186 -51824 -55645 -108030 -99158 -62225 -44183 6900 12024 35317 16788
6208 16788 22838 -14382 -46753 -94307 -65236 30077 25892 -56517 -79119 -15282 -20105 -45431
6196 -45431 -57133 -99617 -68136 -10667 4499 53417 43283 14459 56680 61950 84284 76194
6184 76194 25483 -18468 -26470 -40468 -72509 -69114 -99804 -85997 -37794 -21289 -19986 25574
6172 25574 28668 1373 1895 74216 88650 94048 16405 -30704 -12928 -65242 -99950 -68587 -1485
6159 -1485 17041 -14328 6428 -17893 -18346 -38997 -26915 8101 51494 28565 33215 -2624 -60948
6146 -60948 -87994 -78087 -79439 -83876 -31283 43538 96194 82920 67046 97029 62609 22814
6134 22814 6156 -47373 -54537 -21327 4308 -8278 -42736 -63024 -36338 -50534 -57557 16595
6122 16595 106254 64724 4920 -19134 -20876 -74799 -103550 -87497 -14774 36468 44896 -24470
6110 -24470 -70938 -94805 -108201 -56477 -35491 -78162 -91438 -104570 -74531 -77616 -17688 -34744
6098 -34744 -93852 -140930 -114197 -84761 -72826 -24290 1832 -33415 -39444 -67280 -27656 3005
6086 3005 41689 44967 99376 35133 30447 58734 53657 631 -42167 -64284 -97200 -67055 -19506
6073 -19506 12785 56342 62697 27394 7430 29267 46668 -18 -26057 -3581 25314 81766
6061 81766 32768 -23847 -5313 -38640 -30673 -11231 -16980 -60540 -94742 -55949 -93948 -91356
6049 -91356 -111904 -96874 -73698 -80031 -135754 -171508 -103684 -27431 42777 -49308 -82720 9563
6037 9563 23058 12344 -5033 -40760 -14700 6469 -38016 -95755 -90883 -105296 -144026 -179579
6025 -179579 -165542 -66462 51220 115657 27276 -70857 -68858 -85407 -68412 -514 -12008 -73299
6013 -73299 -56757 6328 73483 46316 41187 32773 19192 -2178 6816 61985 90875 63622
6001 63622 -73261 -154849 -89769 -69696 -64612 -99733 -108274 -137185 -204425 -185591 -49085 -21102
5989 -21102 -39538 -25367 -36270 -29483 -20966 -10559 1483 3346 39153 340 -45320 -84170
5977 -84170 -65358 -9766 -26794 -75507 -17276 -32339 -10161 3116 -9497 -19885 -85086 -114775
5965 -114775 -114707 -113366 -87030 -43543 -58316 -25797 -4208 41169 50866 13968 5310 24619 72179
5952 72179 67422 24476 92678 161210 123184 60382 -4279 43476 83332 127820 90427 85415
5940 85415 105791 27028 70844 109895 29432 -42161 -17556 54465 29358 -36714 -21521 53396
5928 53396 78065 81927 86869 32808 37464 31329 -41263 -57597 1979 24729 -17087 -51842 -3411
5915 -3411 70042 24155 -82666 -39010 -43867 -54219 -53082 -49425 -76714 -55952 -57011 -86270 -43757
5902 -43757 -44795 -23501 -24294 -16940 -83741 -87348 2187 68412 52284 46672 11706 -21177 12471
5889 12471 40719 119802 97387 705 -36014 -27036 -44784 -73650 -110698 -129084 -94534 -57569
5877 -57569 -29513 -6526 39177 81213 -5376 -49447 -51020 32815 31407 -76558 -102248 -100516
5865 -100516 -41569 -15568 -33757 -9749 18597 23046 -40715 -153279 -196823 -150594 -167327 -167463
5853 -167463 -145267 -39743 -50027 -91833 -40610 -23353 -60480 -36935 -7840 1022 -74243 -90228
5841 -90228 -61377 -73010 -110949 -92365 -31189 -64809 -121803 -126330 -78388 -71476 -41729 -99127
5829 -99127 -173081 -120170 -46441 12718 24512 -17023 -105080 -104275 -48290 -65690 -4670 17990
5817 17990 -70932 -64964 16230 48472 49048 -6374 -43275 -23793 -20578 -42534 -33124 -116191 -92525
5804 -92525 -52860 -63886 -124127 -85722 37416 119255 102446 59578 73286 39446 118335 97566
5792 97566 23249 20520 -28980 -59008 -54542 -86379 -62551 -40627 -34380 666 -8773 -38979 -56721
5779 -56721 -44030 -23505 -31287 -95638 -24972 -26794 -50986 -36473 4187 9250 31405 19281
5767 19281 -18479 11898 55777 751 9061 -37550 -107443 -129923 -138889 -184504 -176954 -109913
5755 -109913 -27784 39532 81608 62258 56911 13082 -7213 75640 108499 20912 -16096 15158
5743 15158 44974 20709 -1882 -95975 -141576 -124356 -113848 -157271 -161001 -211022 -115905 -10846
5731 -10846 -7671 -43723 -121895 -75772 -59651 -60286 -63965 3658 44789 41801 42354 89412 94418
5718 94418 116649 59509 72354 69998 10934 -61174 -90332 -137461 -120909 -82243 -22109 83272
5706 83272 57773 -23260 -40031 -16173 -10980 54576 54397 -3241 23714 7510 -47273 -50189 -89
5693 -89 562 20421 -11128 -48227 -39786 -36255 23796 24793 15722 17315 4963 -28122 -38996 -8088
5679 -8088 -23404 -26605 -20090 28326 128451 177364 152002 87604 57308 30435 70110 77576
5667 77576 56105 29740 -20113 -8077 30764 -1368 -41516 2022 8008 -1827 39126 20682
5655 20682 -42287 -58633 -153628 -185161 -151553 -107850 -72354 -15626 80047 59614 -4051 -45553
5643 -45553 -24889 -43351 -81560 -60697 -66641 -59741 -63515 -41420 55075 96986 61074 73807
5631 73807 109013 104960 81280 19383 -37685 -68457 -15170 37823 65600 44417 99605 88553
5619 88553 46933 82869 70472 -32206 -70123 -37108 14139 -276 -32871 -52610 -101518 -50753
5607 -50753 -19338 56636 23143 47219 58429 45240 51953 -839 -5121 9281 -27469 -114786
5595 -114786 -118664 -16100 4333 -22528 -6279 -18420 -100349 -80714 -31083 -88519 -60857 28640
5583 28640 28912 -23281 -7381 42522 64658 10971 -24629 -70997 -86956 -63523 -103223 -167739
5571 -167739 -142800 -97914 -127296 -74671 -45848 -9386 18897 -2363 -3061 -60212 -152899 -143436
5559 -143436 -118321 47519 45550 -18963 -43876 -66840 -89113 -65990 -9626 -33715 -104492 -95792
5547 -95792 -8654 -11467 -11700 21436 67629 112571 91137 93333 62076 5065 -13333 -43970 -59423
5534 -59423 -102525 -118501 -90226 -48549 -8410 -9857 -39696 -118399 -96354 -42403 1928 33639
5522 33639 3400 -17021 -1982 42901 73766 56235 -4570 8780 -30150 -89868 -142419 -147114
5510 -147114 -75854 -23832 53577 82113 40452 36835 24832 16588 -11047 -51808 -57240 -81867
5498 -81867 -139080 -81468 -32217 -8980 -38579 -63591 -95444 -142711 -113292 -52567 13883 85
5486 85 -80620 -62797 -51917 -50426 -22942 24040 48516 88069 104228 55810 22524 34306 12250
5473 12250 -49508 -52206 -64552 -89194 -94547 -102808 9198 62467 15747 -6886 -9341 7959
5461 7959 -966 44925 32221 48196 48515 33905 -45556 -50348 -45984 -18169 10671 5011 -64235
5448 -64235 -52714 -84004 -38493 38133 23666 19755 30924 -8244 11413 -26996 -51378 -35838
5436 -35838 -16162 -6781 -4090 2322 -10475 -56830 -106070 -87322 -44405 -2563 13477 -11583
5424 -11583 -73920 -16950 57725 90747 79765 73738 56924 62463 -2875 -55853 -26252 -44732
5412 -44732 -33932 1393 24167 -30787 -106478 -59602 -28989 -16298 -33467 -29382 -24992 6634
5400 6634 10485 -31336 121 67988 71073 -17310 -73201 -17614 39769 27865 26472 37153 -7196
5387 -7196 -34605 1026 -13826 -56459 -41052 -55069 -113967 -154214 -138788 -92376 -53677 -91369
5375 -91369 -124817 -125496 -155177 -179677 -123065 -74393 -129344 -169411 -97534 -105977 -95505 -111959
5363 -111959 -81325 28252 133683 145689 128926 44621 11464 27147 27390 -50325 -110502 -139671
5351 -139671 -112461 -56338 -89952 -86078 -85857 -63308 -93408 -82064 -18956 39754 60240 104897
5339 104897 69276 -20194 6363 65546 47583 -35838 -20047 23318 4350 -34083 26594 14632
5327 14632 -86944 -113812 -116734 -106562 -43276 15526 -30264 -72487 -49250 -35693 -10617 -24804
5315 -24804 -18441 -48546 -57705 -58139 -56566 -57075 -8242 -15749 -60887 -84273 -134173 -103462 -50227
5302 -50227 -5886 -4484 4583 -91241 -107338 -34558 -15613 33695 64807 63243 36191 78177
5290 78177 94260 6927 -75769 -44336 -8825 -11316 19500 -18187 -5119 -25404 -20335 -30540
5278 -30540 -100418 -75322 -55241 -75393 -102119 -124750 -50443 -49763 -96123 -57544 -30524 -29838 -24235
5265 -24235 -25877 2292 28472 -2320 2604 -41333 -44297 15755 -47873 -94316 -95987 -124559 -139671
5252 -139671 -108354 -110603 -103134 -66175 -83641 -66607 -21577 -27789 18381 30015 9585 83
5240 83 -72390 -78609 -27119 30605 68161 82241 -938 -14856 -77851 -94293 -86227 -59741 9903
5227 9903 53663 38898 36100 -1041 -49588 -36680 2711 61497 34675 -27284 14121 -17747
5215 -17747 -122261 -153548 -139929 -80444 -59987 -31789 2752 47617 2217 1589 3553 476
5203 476 -9960 -14153 -317 13764 -17541 -19646 -23664 -28341 -6990 64428 107785 146962 123332
5190 123332 128222 122024 73783 37701 71873 36216 -9256 10058 16656 41667 36494 -33744
5178 -33744 -77749 -90407 568 30258 18941 -30857 -101676 -114648 -60538 52643 88662 86372
5166 86372 93551 87349 20768 -17278 -74159 -125459 -129109 -45467 -32319 -19192 -31110 -59011
5154 -59011 -65978 -77926 -109174 -126924 -115241 -88234 -34729 -32742 -31504 44562 102434 83101
5142 83101 19326 -19584 -13385 5495 77429 126599 130160 101997 54868 18800 -14274 -15140 -37074
5129 -37074 -14245 41599 19392 6334 -34874 -78463 -100413 -99367 -75524 -19456 -53999 -75765
5117 -75765 -75811 -103398 -79380 378 60679 110605 76825 44844 -49740 -85349 -32241 -15759
5105 -15759 4853 -42228 -80414 -92222 -34164 -67937 -89446 -75542 -40042 -762 11444 11848
5093 11848 -37396 -108933 -137578 -77753 -37109 -45439 -64980 -33294 -37399 -66289 -62439 -20763
5081 -20763 37852 18223 45544 21345 8773 32161 38021 -17181 73491 136219 77736 -14640
5069 -14640 -19589 15966 7481 21981 7339 -32597 -93490 -123983 -113581 -122119 -108759 -103906 -64229
5056 -64229 -56842 -26476 20287 75173 45232 -3643 -35956 -13780 -47756 -72789 23420 16545
5044 16545 -58014 -98563 -54352 46157 53960 31220 -77178 -63398 -19283 3099 -965 -64356
5032 -64356 -53155 -17595 -5092 -11151 16405 -15644 -88234 -97487 -99081 -77065 27498 54836
5020 54836 18647 3089 -49133 -421 -3769 -19090 24702 18791 -6653 -1053 38550 29207 -3526
5007 -3526 -44181 -80401 -113535 -154911 -159198 -121823 -116235 -102590 -86776 -1979 3501 -6038 -6669
4994 -6669 23532 52904 -3167 -19114 -37846 -58777 11536 27906 70797 45622 22054 -9486
4982 -9486 -49898 -84043 -62525 -12366 -7167 40376 27188 -28915 -50307 -27024 5383 71989
4970 71989 99642 34894 18491 6204 2040 5705 -20871 1774 -9552 27352 76616 76337 94240
4957 94240 76679 -7560 -79579 -141359 -73163 -16970 -140 26982 13612 45804 49886 63290
4945 63290 50864 53210 55915 40666 -814 -6067 -17235 33635 47002 46084 13141 -47703 -2147
4932 -2147 27958 -16716 7211 75910 80394 34845 32196 -4426 -5946 -11874 20135 20756 -53453
4919 -53453 -74468 -50364 -67767 -136773 -137725 -49612 30288 50264 26702 49675 105010 69511
4907 69511 96383 128719 128806 78246 77510 46386 -72543 -163636 -156474 -93335 8272 30283 -6608
4894 -6608 3734 -5631 65717 51189 -11258 -9045 68663 71479 45224 98302 135081 46195 -41072
4881 -41072 -86009 -45472 -75001 -94583 -81516 -8004 40671 56554 36485 -26135 -76983 -131890
4869 -131890 -123570 -62290 -46201 15575 46780 -1426 64405 49498 48713 14357 24347 37306
4857 37306 17237 -31343 -78169 -65101 -42813 -104826 -82989 -40205 -102212 -172987 -109759 -34303
4845 -34303 -27836 -43327 -51498 -35428 5251 -497 7469 51917 34028 571 -5726 48847 62043
4832 62043 67742 43596 67021 10908 -27067 -52212 -10671 -7927 10865 24289 25282 -47295 -61177
4819 -61177 -97872 -31721 77746 26822 -92723 -152074 -119266 -29404 11935 -38210 -104198
4808 -104198 -112493 -99193 -32613 -72672 -175840 -124147 977 64146 33450 -29621 13091
4797 13091 18086 42641 11154 64326 105859 43372 26748 44663 32870 -13571 -67761 -37201
4785 -37201 33224 -39864 -58399 -59955 -69067 -73954 -119581 -140138 -97981 -293 38864 41520 -30069
4772 -30069 -9583 45134 25969 -27450 -82033 -53775 -87119 -109811 -54419 -51153 -51199 46823 53453
4759 53453 21323 12844 1245 -78774 -77945 -47374 -1912 43574 25352 -20783 -13240 -23447 -4834
4746 -4834 -4388 -49764 -48142 -17190 -41940 -72838 -82122 -79932 -37084 4502 24798 50761 34228
4733 34228 -2631 31398 24042 12003 55867 144194 193297 107338 26348 9857 34700 44759
4721 44759 17236 -1775 -63210 -42267 16264 -3600 -689 91935 91884 62295 51490 12091 -105353
4708 -105353 -105974 -62455 -29535 -36746 -29598 34313 48056 54460 -10662 15310 18773 8590 55808
4695 55808 28158 24843 -50499 -49108 7356 23700 21592 -21309 -33958 -31200 -28200 -2874 83597
4682 83597 138112 135451 80501 64351 98938 122812 153307 120170 70789 49115 23311 -69571
4670 -69571 -119211 -59078 49380 85659 36450 38096 44576 25997 95528 30418 -88101 -64101
4658 -64101 -7450 -20279 -28131 -72474 -97212 -63475 -61432 -46940 -48747 3008 86574 88083 72966
4645 72966 33876 -69006 -82851 33506 68244 -8089 -55652 -72398 -54415 -93669 -156869
4634 -156869 -151577 -103071 -84536 -46759 -33427 42532 125150 105910 31458 -155 72774 101910
4622 101910 -35748 -42998 -35260 -24002 -75757 -126096 -39992 -37816 -16092 -12859 46799 121836
4610 121836 148475 77425 11989 76314 107498 51866 87339 119721 62788 12173 14428 68917
4598 68917 99138 88173 115836 176251 106531 3379 -38962 -45293 -25246 -15313 -40002 -81817
4586 -81817 -89747 16487 93412 98455 86862 57368 83180 68285 -8557 -90702 -87198 -61132
4574 -61132 -78461 -23588 73384 136645 95122 17197 13311 -76572 -128179 -94936 -88541 -95527
4562 -95527 -69038 -41180 -63147 -2407 -19269 3250 8223 38492 9018 -58997 -97643 -113314
4550 -113314 -151985 -107024 -45132 -61456 -106773 -63806 14732 -41897 -99485 -159309 -169820 -102659
4538 -102659 -74856 -61015 -48573 -16202 -54009 -87762 -69695 -38246 -63758 -56531 20295 19382
4526 19382 -59424 -29088 -32414 -59632 -59153 -41479 -7576 7991 60170 37412 98253 104539 39178
4513 39178 40422 -28149 -78304 -104619 -129052 -143048 -137998 -152760 -152024 -114285 -126724 -42382 15829
4500 15829 29910 43723 39123 60939 81408 3950 -38873 -31782 -38550 -40719 3020 -36886 -136447
4487 -136447 -119707 -47214 29028 44850 -3803 21185 -18736 -80228 -93554 14559 -11345
4476 -11345 -97551 -90402 -106451 -113785 -63959 -13969 -85971 -102030 -61883 32284 51354 9856
4464 9856 -26886 -16899 -49205 68393 117274 187847 82335 -46 7260 6462 2384 -4927 9249
4451 9249 44362 62139 -18561 -90285 -129402 -111395 -94534 -25739 -42082 -107342 -139826 -81149
4439 -81149 -38725 975 -31424 -56905 -85216 -78684 -85676 -113280 -150089 -53587 -28070 -29318
4427 -29318 -27713 41339 66082 85731 30207 -30125 -85146 -75210 -87524 -109709 -73847 -33380
4415 -33380 4446 48105 124230 139998 102369 27337 -5183 -39277 32101 -17776 -59092 -25035
4403 -25035 19084 -6834 42793 35217 8234 -21017 -97882 -142784 -93804 -63952 -52533 23909
4391 23909 80382 6740 -16331 37787 88502 46094 10092 23627 45494 51841 43038 -19078
4379 -19078 17644 25749 75320 97845 117829 126325 64692 1744 -10703 -23245 -43250 -20844
4367 -20844 5726 -29715 -76298 -17383 29774 -53417 -150678 -108990 -15490 15613 14086 69473
4355 69473 -544 -12340 -15382 -6181 -9904 17988 -9728 -35782 -116542 -152706 -90874 -97047 -54341
4342 -54341 -47804 -137596 -184231 -118405 -64546 -99893 -137475 -124867 -57534 -17901 -11884 25734
4330 25734 3353 -10757 28848 40436 23617 56668 72194 1134 -30439 8755 -38248 -67215
4318 -67215 -83286 -107817 -71809 -46285 -2245 19623 -35893 -27447 -40359 -8989 -37341 -5126
4306 -5126 -6271 -39802 -46584 -31190 -12679 -1615 -29341 -66434 -25112 8479 69568 90332
4294 90332 32335 47185 19367 23647 69623 46497 27171 57738 41085 52527 -24401 -39128
4282 -39128 23360 17465 83003 147733 105627 87146 78562 73735 138319 172939 139572 84479
4270 84479 31927 -36637 7154 58662 62173 39698 27144 50830 31687 6713 10460 50288
4258 50288 78556 51181 21532 1736 -64498 -88677 -43348 -32562 50889 96603 124576 61414
4246 61414 -32347 -47272 -8726 2626 3672 37023 21778 -63768 -116166 -70050 -79593 -109864
4234 -109864 -64216 -655 -1101 -106012 -92970 -12100 -5679 5590 -36675 -19363 -18777 -60397
4222 -60397 -107940 -72770 -33570 -7126 -58965 -108941 -71967 -50839 -62114 -70751 -25595 -42182
4210 -42182 -7941 71939 63205 22071 13235 882 -43404 -47519 -53013 -37071 9381 -39861 -62091
4197 -62091 -62998 -66704 -39180 -27630 -27210 -44854 -50462 11661 48393 -4656 -19760 -111079 -114558
4184 -114558 -84730 -34055 20575 59749 43405 -42813 -39541 -62189 -57402 -71510 -95084 -102970
4172 -102970 -128790 -134052 -56321 -40324 -101793 -101106 -85162 -112232 -49847 -35234 -23580 -17998
4160 -17998 915 58949 112505 106334 82755 45140 4044 17816 59260 69131 59880 -6673
4148 -6673 -30108 -43582 -40757 -63146 -91115 -43301 25890 18526 18527 -44526 -60870 -91518 -79303
4135 -79303 -41028 -36255 -82460 -76454 -55636 -108094 -44434 4799 61158 49620 26518 48901
4123 48901 85693 45386 35330 23924 -34930 4331 62913 87806 87164 63372 -23681 -28358
4111 -28358 42320 32255 31020 74583 98030 193864 166599 102633 80601 72597 36778 -1322
4099 -1322 -50656 -59644 -69536 -102967 -49335 -3626 -2575 -45264 -37735 4971 35959 -61686 -157108
4086 -157108 -110711 -84423 -35010 18021 21620 -198 -103831 -88154 -54258 30369 23856 -32289
4074 -32289 -102029 -1513 59946 11547 9971 -8564 -1254 3682 -18979 -29157 -76432 -112815
4062 -112815 -116863 -110427 -107624 -129541 -181086 -160978 -149125 -95636 -102255 -125701 -122509 -109280 -156536
4049 -156536 -148265 -104828 -63377 -28676 4793 25879 44300 -19728 -40694 -6072 34629 55697
4037 55697 76488 94702 73750 36712 6115 1524 6087 -30215 -8734 30468 51975 73901
4025 73901 63948 -9451 34829 90415 93117 32878 -6065 -22579 -88789 -115157 -181656 -178568
4013 -178568 -153299 -81672 -79854 -106222 -98361 -49317 24306 -17063 9460 3691 -3728 30810
4001 30810 77822 98785 46676 -91130 -104300 -42235 18950 40596 16086 14372 2148 -36371
3989 -36371 -23984 16741 9879 -10859 -6692 63512 60461 16802 31977 -12345 8469 15000 90080
3976 90080 86895 28329 -7995 -45759 -74504 -94740 -62976 1551 -4437 -47012 -96719 -103183
3964 -103183 -18909 -29739 400 -23430 -9399 73073 84689 21202 15784 32635 -12975 -64946
3952 -64946 11499 54225 75650 90352 58234 37024 10411 -5854 -41337 -55777 -29232 -26885
3940 -26885 -7083 -2323 23491 -5654 -104311 -86057 -89989 -121866 -70720 -51348 -12838 43731
3928 43731 69742 58269 39410 40793 53036 39069 -13559 15758 49262 65096 113447 134632
3916 134632 76437 16707 49995 72541 40398 -29215 -46578 -32927 -12801 63646 115875 113060
3904 113060 22645 -23328 -29104 34928 65573 39256 -20507 -68522 -58407 -56537 -86503 13985
3892 13985 -17855 -46150 -20614 -21000 -33163 -74556 -51509 42856 7148 -55369 -59884 36413
3880 36413 86545 75497 55495 34264 -28798 -66975 -32443 -9364 20121 5898 12878 78157
3868 78157 119563 110461 76247 38535 3185 -4066 2346 -32230 -84019 -64556 -11801 327
3856 327 -54373 -122382 -77853 18765 40492 38827 40678 12876 -4701 -682 35277 68114 49139
3843 49139 76326 47368 -28441 -25455 -47790 -81393 -91748 -37981 -5475 -29371 -84762 -89081
3831 -89081 -75421 -66425 -64177 -2154 -25521 10166 36920 41097 90238 5804 -111728 -108838
3819 -108838 -39603 58838 119472 41542 54669 38060 -25389 -38694 -51302 36627 7101 -7297
3807 -7297 5018 -53757 -68811 -24977 53031 82949 85520 92551 81009 92263 41985 -21530
3795 -21530 -42625 -40962 -22734 258 45334 -13207 -8656 20346 -9885 -87155 -109387 -14292
3783 -14292 71635 35944 951 -23767 5907 66157 99172 -92 28809 51899 47993 1929
3771 1929 8633 -9617 -28871 -6870 -35710 -53254 28895 19329 -17586 19134 31989 -6154
3759 -6154 14955 121278 116532 24879 -52720 -1117 -2534 -46413 -36881 -7454 57 263 -2730
3746 -2730 -31375 -5517 -35548 -42445 -57123 -112703 -144897 -95392 -59699 -25433 -45585 -28115
3734 -28115 8684 15766 -31355 -6741 -39081 -56862 6030 -14936 11707 2053 -3246 -14231
3722 -14231 -34092 -51405 -39885 -27660 -49017 -16538 13700 -2166 5870 45584 65445 45698
3710 45698 107265 85184 8364 8208 24482 -10466 -83429 66667 112279 77249 57096 29044
3698 29044 6541 44276 37758 34424 36822 -21696 -37790 -30765 -31988 -88060 -121000 -93806 -49988
3685 -49988 -3603 9141 -8880 -54875 -41337 45475 51846 47448 17155 -13439 -14668 -13271 -11418
3672 -11418 -15655 -1628 63085 27232 -35048 24792 66379 -6544 -10439 7363 52153 83226
3660 83226 85626 81908 20130 13271 26712 74043 131504 115620 5451 -67452 -99678 -105307
3648 -105307 -79832 -87141 -81659 -76440 -51995 -62732 -92179 -66873 -10554 70950 108134 38211
3636 38211 -3115 -25770 -52705 9163 91283 114049 60157 21225 -26776 -117616 -122316 -77778
3624 -77778 -51604 -41908 -30039 -17389 -23196 -28086 -68 16975 -1727 -14153 -18325 8783 8797
3611 8797 -94753 -68481 -91026 -25053 -15799 -20053 -5171 36515 12022 -30067 -43540 568
3599 568 35669 -35344 -17457 67286 101032 121264 43774 -23844 -35993 -43000 -78671 -59710
3587 -59710 -37221 -43656 -62667 -33649 33301 45087 -22002 -73119 -3212 39187 48170 32690
3575 32690 27828 31343 -31745 -31937 26789 -21091 -37766 -18998 -16043 43258 107483 92570 105013
3562 105013 2463 -13439 6490 2575 -71400 -86507 1010 11723 3334 2806 10347 24137
3550 24137 30490 29116 -54138 -140246 -126284 -71926 -39422 -35878 -63550 -91946 -117722 -17888
3538 -17888 12362 49525 84522 108575 154946 146196 136256 142705 186652 202525 160602 124714
3526 124714 97422 93224 59258 93957 25666 3489 -72012 -108137 -49075 -12872 -13470 -24673
3514 -24673 20944 47619 78052 104628 86205 26256 3744 103145 135176 58930 15794 10929
3502 10929 20994 -29918 -32165 -2219 -20833 -6578 -46549 -67318 8547 64045 148258 182068
3490 182068 84025 78073 68140 84008 72406 40567 127398 115277 60636 -8297 -30793 -10151
3478 -10151 -32382 -61499 -25441 -24973 -50289 -95614 -100674 -34296 1482 11885 -22398 -39017
3466 -39017 -8835 -2960 -6055 24704 51653 103580 112052 105969 92592 29459 38247 114929 103978
3453 103978 33444 -8250 -253 41559 66261 9328 1313 67453 43362 49682 -46693 -81069
3441 -81069 -99452 -104433 -107740 -112098 -159276 -108805 -86292 -48639 -46395 -135519 -106340 7448
3429 7448 26598 14622 -19097 -55849 -50362 -13060 -22141 7700 -24794 -37816 13270 -23595
3417 -23595 -35771 -73721 -40715 -11216 -63583 -128808 -28964 29384 78951 24899 -7271 -1685
3405 -1685 -20497 11152 -12217 -9012 5479 2843 -19726 -1434 -27685 -5833 45281 -11370
3393 -11370 -113998 -84416 -17919 -9135 -46742 12481 30427 51835 -14354 -54860 -8398 16743
3381 16743 -23890 -44900 15398 50859 63402 19487 31924 -17323 -53128 -66449 -36519 9428
3369 9428 44509 77723 62684 68735 67332 83137 79487 77952 131577 127334 131705 106055 54887
3356 54887 15065 28868 -53169 -28313 8930 20589 4953 -49457 -98996 -101275 -82609 -94797
3344 -94797 -103578 -89348 -107404 -104579 -88629 -110424 -52412 31516 65707 29559 44418 56834
3332 56834 69250 33944 4749 27326 33172 40708 53547 22330 19460 -25262 -21433 90950
3320 90950 98779 -2316 -63035 -75903 -45212 -46387 -50412 -57600 -38126 -34384 -59553 933 54228
3307 54228 92911 15974 -23584 -44078 -11377 -38305 -76103 -29499 30996 -10281 -23633 11864
3295 11864 12877 -46378 12846 26635 23879 109580 122910 115662 68265 72179 123542 163402 133646
3282 133646 145657 171112 158639 150727 11429 -34356 -61340 -51038 -45448 -19387 34324 53193
3270 53193 30391 -10510 -45886 -57269 13268 25721 50909 100418 87470 34652 -13007 -30948
3258 -30948 3088 13328 -29245 -47696 4656 60275 106275 66631 43466 104797 65233 68091
3246 68091 101811 35579 23298 9297 -11100 -83660 -103054 -75170 -33557 2658 -41075 42324
3234 42324 140428 125820 87216 106966 123244 82475 39392 89607 102983 120232 143817 109358
3222 109358 44254 454 64775 80260 42865 -15504 -21558 -8614 -36808 -10341 3848 19520
3210 19520 40479 14134 -36992 -62775 -42025 -6879 18602 -43106 -69848 -35453 -31316 3168
3198 3168 58026 50798 36646 10869 -62853 -113133 -80660 18927 83689 69814 40501 19983
3186 19983 -4876 -67971 -58738 20120 2773 -11218 -88085 -62165 -6338 -3652 -44542 -93581
3174 -93581 -58886 -53233 -22934 21728 -26352 -143270 -108606 -42518 -54576 -29607 40306 45615
3162 45615 17516 30692 29273 25265 -17444 -43711 -52518 -62326 -97136 -104412 -24828 -9934 5024
3149 5024 88696 17950 -39682 -77279 -91621 -111461 -73994 -62651 -36326 -56550 -81751 -20811
3137 -20811 -21581 -70605 -75554 -70703 -42610 -65871 -58275 8675 44772 60072 42533 -1158 -53109
3124 -53109 -4974 -6988 23602 49711 44005 50843 24723 -10767 -65986 -5433 40511 52291
3112 52291 27369 -25572 -66397 -40507 46195 53541 5686 -28597 -51528 -44515 -39807 14947
3100 14947 100084 63684 -12165 -40932 -59971 -86006 -88078 -25917 -93021 -92075 -75194 -126665
3088 -126665 -54768 -110517 -130985 -135323 -49241 -15965 -37185 -59276 -48745 -54331 -63801 -43898
3076 -43898 -41342 -56099 -33077 -55846 -80262 -15724 26612 51944 10947 -11215 -34394 -68255
3064 -68255 -94600 -162578 -144913 -144971 -81727 27697 51215 42007 45072 -3291 -23791 22670 21648
3051 21648 -22073 5058 17188 26963 98253 154066 111994 104428 89444 34972 -5008 847
3039 847 -40976 -75404 -68428 -49276 -82124 -178500 -152983 -81915 -10561 14777 9950 -27221 -31906
3026 -31906 84176 106047 79943 113365 110434 85150 -9845 -89789 -75383 -66867 -28671 -83931
3014 -83931 -76266 2521 41528 21184 22839 10173 -1756 -40044 -29153 -5434 17642 36659
3002 36659 8730 5072 -41676 -35140 -42421 -50745 2600 24277 17062 -45528 -72537 -20997 38370
2989 38370 48284 -9192 -28536 -14702 -877 33383 -17923 -86569 -23166 -36761 31876 54220
2977 54220 86116 32856 -52631 -102883 -35559 -11629 -23049 -67937 -43479 14384 -73 -4125
2965 -4125 -30692 -142330 -168636 -126706 -71867 -106516 -131883 -180178 -161201 -75029 -76932 -67436
2953 -67436 -61324 -39386 -46634 -37911 -38360 -11568 55791 75977 15444 29266 24984 4468 29544
2940 29544 -7415 8563 59775 71980 44264 10527 -12959 29199 -8775 -9041 30449 32962
2928 32962 -3556 10167 40729 -22196 -20600 -23255 -9721 11087 40007 70883 81666 51042
2916 51042 67031 93396 55862 57874 60465 49511 10224 -6986 8803 -986 8391 66858 129814
2903 129814 111635 59142 11521 62625 40942 25475 -12605 -65916 -87825 -93629 -92247 -78850
2891 -78850 -17603 19927 65733 121446 117333 86799 72765 53207 -19117 -48046 -59030 -46600
2879 -46600 -20603 -1571 33318 54877 -27701 -53472 -98951 -17454 42194 64692 111660 67277
2867 67277 115968 162254 135197 88014 48245 31965 -37857 -18000 35716 -19633 -69989 -29615
2855 -29615 46164 66233 23460 -5299 -11120 -53452 -42682 -5691 -97316 -35982 6372 -6289
2843 -6289 -70855 -47707 21122 -5267 -24011 23303 -23370 -56701 -25626 31224 -8404 -77928
2831 -77928 -109581 -89505 -72324 -51317 -37473 -19810 -63405 -71104 -22690 19927 -4459 -24867
2819 -24867 -60540 -30751 67215 93386 16665 -73733 -36389 66892 85792 123008 111362 35030
2807 35030 10551 7972 -46185 -80415 -24273 28643 64723 15631 -36310 -39214 -40047 -54327 -20545
2794 -20545 15160 -35848 -22182 52985 15865 10367 103140 165628 159944 123286 48663 17264
2782 17264 -36136 -76424 -72910 -53418 -55294 -108641 -100336 -34595 27556 2339 -60550 -116125
2770 -116125 -80343 4481 -12284 -13501 -3260 -53110 -69200 -54315 -33915 -59236 -97480 -83715
2758 -83715 -75393 -62395 -105286 -90071 -16589 63703 77441 14342 -18268 -64128 -2650 44182
2746 44182 18712 8143 -24352 -5858 50725 53546 95099 124037 80033 39900 23201 63714
2734 63714 6899 8245 58261 49760 7437 -31930 -58653 -41296 43355 71612 71142 39255 6474
2721 6474 18083 7850 86584 54419 -44460 -50604 -23624 -17815 10007 -36422 -48328 -58642
2709 -58642 -67502 -34546 -30243 10385 66833 55510 -24100 -39132 -1351 279 -20113 -3810
2697 -3810 61804 29736 6591 -16926 38801 50221 61839 30056 -44809 -54781 10258 -29572
2685 -29572 -34794 -21313 -16479 41851 45132 -16602 -47309 -5042 37833 24226 7481 32471
2673 32471 42746 43789 60546 87371 32406 -35964 -159556 -186574 -57893 11919 1333 -17360
2661 -17360 -29104 -17144 7290 62871 42782 15842 19627 13202 7736 8294 3648 -20930 -664
2648 -664 19838 15132 -9198 -10881 -17522 -871 -2381 -35103 -51736 8616 50837 28605 181
2635 181 -6328 -31012 -13222 -1626 46074 -7901 -22797 -27770 36129 123829 61692 -812 8848
2622 8848 49721 21825 -20962 -1863 6643 -9389 82866 133346 83957 45980 -45793 -139204
2610 -139204 -128141 -69353 -57892 -49127 -34468 -24101 -46309 -53654 25635 38044 47275 54937
2598 54937 80332 55958 60909 51498 64397 38571 751 30180 22154 453 -30901 37916
2586 37916 107762 67384 34101 49776 53180 68073 59035 58285 12755 31507 -5988 -718 37756
2573 37756 -457 -32872 -4383 11104 56253 55744 -55205 -108680 -54552 -34142 -56762 -32482
2561 -32482 -44104 -38175 -77578 -117056 -103694 -78809 -47706 -33298 -67792 -68134 10051 20375
2549 20375 -27114 -49030 -1632 33354 60100 16380 70537 93318 51229 47224 16965 -7734
2537 -7734 -69035 -12121 42737 100411 131579 76007 -6855 -13531 -25403 -40460 -17145 -29132
2525 -29132 -69944 -67707 -586 18841 1354 -9577 -78191 -74702 -33500 4115 35731 -47568
2513 -47568 -20077 12730 -86747 -134660 -159111 -144395 -97085 -56839 -5987 -30623 -37539 -30409
2501 -30409 -80042 -144161 -124133 -64085 -24946 5172 -51508 -65647 -52840 -86813 -37950 11869
2489 11869 6835 19493 34262 57920 -26356 -99347 -63428 18570 12449 17480 5474 -37436
2477 -37436 -40747 336 -23350 -76057 -27274 -2606 18030 -15810 -34901 -28030 -21589 -60003
2465 -60003 -32185 -25940 -15107 62739 26360 30450 41567 49166 15786 61102 147432 114630
2453 114630 53065 42704 -9038 -22462 41148 36937 -30958 -68208 -43031 76515 96577 26556
2441 26556 -12606 24443 98350 103627 68072 6878 -45817 -73632 -5394 43418 92670 43348
2429 43348 -1684 45055 60695 40101 3292 10840 -6884 4698 4480 -8438 -51681 15796
2417 15796 57018 18523 -55116 -54528 -5704 -42459 -58320 15475 47247 78769 66484 39977
2405 39977 16526 -49314 -86432 -97025 -86797 -128886 -96087 -29571 1520 -16693 25080 -23357
2393 -23357 -4795 932 36399 34722 -22081 -65681 -91662 -106163 -103651 -84519 -47821 -51611 -67258
$$ [...]
##END NTUPLES=NMR SPECTRUM
##END=
