##TITLE=Analysis number 330086
Compound Code cc 62703
Book Reference 521/129
Project Code adrs
Chemist Name evam
##JCAMPDX= 6.0         $$ Bruker NMR JCAMP-DX V2.0
##DATA TYPE= NMR SPECTRUM
##DATA CLASS= NTUPLES
##ORIGIN= Bruker BioSpin GmbH
##OWNER= nmr
$$ XWIN-NMR		Version 3.5
$$ Thu Oct 25 11:20:31 2007 GMT Daylight Time (UT+1h)  MAYBRIDGE\nmr@NMR_250MHZ
##.OBSERVE FREQUENCY= 250.131544655141
##.OBSERVE NUCLEUS= ^1H
##.ACQUISITION MODE= SIMULTANEOUS (DQD)
##.ACQUISITION SCHEME= undefined
##.AVERAGES= 16
##.DIGITISER RES= 18
##SPECTROMETER/DATA SYSTEM= dpx250
##.PULSE SEQUENCE= zg30
##.SOLVENT NAME= CDCl3
##.SHIFT REFERENCE= (INTERNAL, CDCl3, 0, 16.522)
##AUDIT TRAIL= $$ (NUMBER, WHEN, WHO, WHERE, WHAT)
$$ ##TITLE= Audit trail, XWIN-NMR		Version 3.5
$$ ##JCAMPDX= 5.01
$$ ##ORIGIN= Bruker BioSpin GmbH
$$ ##OWNER= nmr
$$ C:\u/data/dgb/nmr/ADRS/1350/pdata/1/auditp.txt
$$ ##AUDIT TRAIL=  $$ (NUMBER, WHEN, WHO, WHERE, WHAT)
(   1,<2007-10-25 11:20:11.57 +100>,<MAYBRIDGE\nmr>,<NMR_250MHZ>,
      <created by zg, POWCHK disabled, PULCHK disabled
       configuration hash MD5:
       76 6E 9A 78 1E 09 19 81 EC 84 63 8F B0 6A 59 2D
       data hash MD5: 64K
       FD BD 53 74 BB 30 DF 95 88 52 4F 29 FB DF 05 E0>)
(   2,<2007-10-25 11:20:22.40 +100>,<MAYBRIDGE\nmr>,<NMR_250MHZ>,
      <Start of raw data processing
       ef LB = 0.3 FT_mod = 6 PKNL = 1 SI = 32K 
       data hash MD5: 32K
       9C 23 03 A8 5E 21 F0 8B BC 92 E2 C6 5C E0 7B B6>)
(   3,<2007-10-25 11:20:24.04 +100>,<MAYBRIDGE\nmr>,<NMR_250MHZ>,
      <apk 
       data hash MD5: 32K
       B0 13 5B 37 DE AA D5 72 5D C0 2D 74 14 F3 38 2B>)
(   4,<2007-10-25 11:20:24.74 +100>,<MAYBRIDGE\nmr>,<NMR_250MHZ>,
      <abs ABSG = 5 
       data hash MD5: 32K
       FE 2F C5 C3 FE 4C 17 AC 64 0A 57 E1 29 3E 8D 7E>)
$$ ##END=
$$ 
$$ hash MD5
$$ D9 ED 72 84 45 E1 29 86 DE 70 81 F8 65 19 7F 00
##$RELAX= 
##$RELAX= 
##$RELAX= 
##$RELAX= 
##$RELAX= 
##$RELAX= 
##$RELAX= 
$$ Bruker specific parameters
$$ --------------------------
##$DU= <C:\u>
##$EXPNO= 1350
##$NAME= <ADRS>
##$PROCNO= 1
##$TYPE= <nmr>
##$USER= <dgb>
##$AMP= (0..31)
100 100 100 100 100 100 100 100 100 100 100 100 100 100 100 100 100 100 
100 100 100 100 100 100 100 100 100 100 100 100 100 100 
##$AQSEQ= 0
##$AQ_mod= 3
##$AUNM= <au_zg>
##$AUTOPOS= <20 >
##$BF1= 250.13
##$BF2= 250.13
##$BF3= 250.13
##$BF4= 250.13
##$BF5= 500.13
##$BF6= 500.13
##$BF7= 500.13
##$BF8= 500.13
##$BYTORDA= 1
##$CFDGTYP= 0
##$CFRGTYP= 5
##$CHEMSTR= <none>
##$CNST= (0..31)
1 1 145 1 1 1 1 1 1 1 1 1 1 1 1 1 1 1 1 1 1 1 1 1 1 1 1 1 1 1 1 1 
##$CPDPRG= <>
##$CPDPRG1= <>
##$CPDPRG2= <>
##$CPDPRG3= <>
##$CPDPRG4= <mlev>
##$CPDPRG5= <mlev>
##$CPDPRG6= <mlev>
##$CPDPRG7= <mlev>
##$CPDPRG8= <mlev>
##$CPDPRGB= <>
##$CPDPRGT= <>
##$D= (0..31)
0 1 0 0 0 0 0 0 0 0.06 0 0 0 0 0 0 0.0002 0 0 0 0 0 0 0 0 0 0 0 0 0 0 
0 
##$DATE= 1193307610
##$DBL= (0..7)
120 120 120 120 120 120 120 120 
##$DBP= (0..7)
150 150 150 150 150 150 150 150 
##$DBP07= 0
##$DBPNAM0= <>
##$DBPNAM1= <>
$$ [...]
##$SUBNAM7= <"">
##$SUBNAM8= <"">
##$SUBNAM9= <"">
##$SW= 20.6930455092707
##$SWIBOX= (0..15)
0 0 3 0 0 0 0 0 0 0 0 0 0 0 0 0 
##$SW_h= 5175.983436853
##$TD= 65536
##$TD0= 1
##$TE= 295.16
##$TE2= 300
##$TE3= 300
##$TEG= 300
##$TL= (0..7)
0 120 120 120 120 120 120 120 
##$TP= (0..7)
150 150 150 150 150 150 150 150 
##$TP07= 0
##$TPNAME0= <>
##$TPNAME1= <>
##$TPNAME2= <>
##$TPNAME3= <>
##$TPNAME4= <>
##$TPNAME5= <>
##$TPNAME6= <>
##$TPNAME7= <>
##$TPOAL= (0..7)
0.5 0.5 0.5 0.5 0.5 0.5 0.5 0.5 
##$TPOFFS= (0..7)
0 0 0 0 0 0 0 0 
##$TUNHIN= 0
##$TUNHOUT= 0
##$TUNXOUT= 0
##$USERA1= <user>
##$USERA2= <user>
##$USERA3= <user>
##$USERA4= <user>
##$USERA5= <user>
##$V9= 5
##$VALIST= <valist>
##$VCLIST= <CCCCCCCCCCCCCCC>
##$VD= 0
##$VDLIST= <DDDDDDDDDDDDDDD>
##$VPLIST= <PPPPPPPPPPPPPPP>
##$VTLIST= <TTTTTTTTTTTTTTT>
##$WBST= 1024
##$WBSW= 4
##$XGAIN= (0..3)
0 0 0 0 
##$XL= 0
##$YL= 0
##$YMAX_a= 271217
##$YMIN_a= -351286
##$ZGOPTNS= <>
##$ZL1= 120
##$ZL2= 120
##$ZL3= 120
##$ZL4= 120
##$ABSF1= 16.522
##$ABSF2= -4.171173
##$ABSG= 5
##$ABSL= 3
##$ALPHA= 0
##$AQORDER= 0
##$ASSFAC= 0
##$ASSFACI= 0
##$ASSFACX= 0
##$ASSWID= 0
##$AUNMP= <proc_1d>
##$AZFE= 0.1
##$AZFW= 0.1
##$BCFW= 0
##$BC_mod= 0
##$BYTORDP= 0
##$COROFFS= 0
##$CY= 12.5
##$DATMOD= 1
##$DC= 0
##$DFILT= <>
##$DTYPP= 0
##$F1P= 14.0000005364418
##$F2P= -0.99999901652339
##$FCOR= 0.5
##$FTSIZE= 32768
##$FT_mod= 6
##$GAMMA= 0
##$GB= 0
##$INTBC= 1
##$INTSCL= 1
##$ISEN= 128
##$LB= 0.3
##$LEV0= 0
##$LPBIN= 0
##$MAXI= 10000
##$MC2= 0
##$MEAN= 0
##$ME_mod= 0
##$MI= 0
##$NCOEF= 0
##$NC_proc= -4
##$NLEV= 6
##$NOISF1= 0
##$NOISF2= 0
##$NSP= 0
##$NTH_PI= 0
##$NZP= 0
##$OFFSET= 16.522
##$PC= 1
##$PHC0= 164.2996
##$PHC1= 7.105068
##$PH_mod= 1
##$PKNL= yes
##$PPARMOD= 0
##$PSCAL= 4
##$PSIGN= 0
##$REVERSE= no
##$SF= 250.13
##$SI= 32768
##$SIGF1= 0
##$SIGF2= 0
##$SINO= 400
##$SIOLD= 32768
##$SREGLST= <1H.CDCl3>
##$SSB= 0
##$STSI= 32768
##$STSR= 0
##$SW_p= 5175.98343685301
##$SYMM= 0
##$S_DEV= 0
##$TDeff= 65536
##$TDoff= 0
##$TI= <Analysis number 999999
Compound Code 99
Book Reference 9
Project Code 9>
##$TILT= no
##$TM1= 0
##$TM2= 0
##$TOPLEV= 0
##$USERP1= <user>
##$USERP2= <user>
##$USERP3= <user>
##$USERP4= <user>
##$USERP5= <user>
##$WDW= 1
##$XDIM= 32768
##$YMAX_p= 510244770
##$YMIN_p= -387715
$$ End of Bruker specific parameters
$$ ---------------------------------
##NTUPLES= NMR SPECTRUM
##VAR_NAME=  FREQUENCY,     SPECTRUM/REAL,   SPECTRUM/IMAG
##SYMBOL=    X,             R,               I
##VAR_TYPE=  INDEPENDENT,   DEPENDENT,       DEPENDENT
##VAR_FORM=  AFFN,          ASDF,            ASDF
##VAR_DIM=   32768,         32768,           32768
##UNITS=     HZ,            ARBITRARY UNITS, ARBITRARY UNITS
##FACTOR=    0.157963299565203, 1,           1
##FIRST=     4132.6476996994, 0,             0
##LAST=      -1043.33573715361, 0,           0
##MIN=       -1043.33573715361, -387715,     0
##MAX=       4132.6476996994, 510244770,     0
$$ Real data points
##PAGE= N=1
##DATA TABLE= (X++(R..R)), XYDATA
$$ [...]
16060b3451K1262P9648L4009q1717j39641j23857J47344L1130p2445N5609M7678
16049b4431o3351j4681R0411L6821m5771k0875J14248J9872J0757l6761l0341
16038C5898O89q0735L5456M5764j9704q432L0558k1336j64081K7362J05956l9312
16026e1917N2814j5969l9774k7179N0420P2024N787j25519l1944L3108N6242n7058
16014g8965j8256L7937O1616N1793j7688K832J7649K7597O146K4424j5939m4888
16002E4258R7572m6882k25318J1762k836R315N9359P9433O1937j734m9956O1399
15990A08309P5568o1591J0526J6696J9825p4607l8767M0613J613j45988n8758
15979a06561P6751R4047r716o9918J6521Q3857J2588M1463n477j96015q2601M0796
$$ plain form
16060 -23451 -2189 77459 111468 29751 -109890 -233747 -86403 -55273 -127718 -72109 -24431
16049 -24431 -87782 -102463 -12052 24769 -21002 -41877 72371 92243 103000 66239 35898
16038 35898 36587 -44148 -8692 37072 17368 8936 39494 18158 -145923 -118561 -12605 -51917
16026 -51917 897 -15072 -54846 -82025 -31605 40419 46206 -79313 -111257 -78149 -21907 -78965
16014 -78965 -97221 -59284 2332 54125 36437 39269 56918 84515 90661 115085 99146 54258
16002 54258 151830 104948 -120370 -108608 -111444 -102129 -42770 36663 98600 96866 46910 108309
15990 108309 183877 122286 132812 149508 169333 94726 55959 96572 98185 -47803 -106561
15979 -106561 -29810 64237 54521 -15397 1124 84981 97569 139032 133555 -62460 -145061 -104265
15967a04265M0600M5714M755M625m3245R5367l3125o4954o2544O6812R0309K3744
15955F3793n721k3854n8328j8973k7269j3606n2516J8405L4014L7002P917K4347
15943a4789L1031k7264M8518O5616r872j3247L5498j3593r8070j5669M7210M290
15931C9659o1r0104Q3475N0181j05072n0167Q2846k9360m5642p8738P5645J21719
15919E4381j5395o1454Q5332m9329r3687j05683M322P4982l6771l1182K0672k2621
15907a76433J32559Q4674o2237n8999k7088K1276K5670N2175l8853m3424j47160
15896b37840j4408J65968J4048m5327R631l915k7208l5191m7718q0044O5344J64727
15884g1933J255j15493j123M2685N7206m3013M8875R8655k7680j13216P8757P8653
$$ plain form
15967 -104265 -63665 -17951 -13196 -8571 -51816 43551 10426 -54528 -117072 -50260 40049 63793
15955 63793 58072 34218 -24110 -43083 -70352 -83958 -136474 -118069 -84055 -47053 -39136 -14789
15943 -14789 16242 -11022 37496 103112 93240 79993 115491 101898 3828 -11841 35369 39659
15931 39659 39598 -50506 32969 83150 -21922 -72089 10757 -18603 -64245 -142983 -67338 54381
15919 54381 38986 -22468 62864 13535 -80152 -185835 -181513 -106531 -143302 -174484 -153812 -176433
15907 -176433 -43874 40800 -21437 -80436 -107524 -86248 -60578 -8403 -47256 -90680 -237840
15896 -237840 -252248 -86280 -72232 -117559 -107928 -111843 -139051 -174242 -221960 -302004 -236660 -71933
15884 -71933 -70678 -186171 -187294 -144609 -87403 -130416 -81541 17114 -10566 -123782 -45025 33628
15872C3628m132Q1943K7787m5324n2834j06401K239m0734q3390L7887j7987O0011
15860a07307M7724l4734J3101J53079O7075j12702j20460m2399Q1847J0568L1011
15849a3197j09870L092O3986L4470P7285k5863J8817K2396k8462N3159j7493k7310
15837E1010j1551o1507o3836j5688k7071n656l939k5862L7826L7886K7002j07720
15825a69106l7661L0011R2212R2109q9244n3198j8182M8220O9625m2535o1278
15814a39027M6682k1855M580l2156o0787n1149O6432N2202J17859n8313Q0656
15803E124J8065R4676M2213j25999o8800m4606j12241r990K0957J08617P496J175
15791f3313R94Q6908J65963j01697j09765l388O9080p062q7585n5542l5414N0441
$$ plain form
15872 33628 29496 111439 139226 93902 41068 -65333 -63094 -103828 -187218 -149331 -167318 -107307
15860 -107307 -59583 -94317 -81216 71863 138938 26236 -94224 -136623 -54776 -44208 -13197
15849 -13197 -123067 -119975 -55989 -21519 55766 29903 48720 71116 42654 95813 78320 51010
15837 51010 39459 -22048 -85884 -101572 -128643 -134299 -138238 -164100 -126274 -88388 -61386 -169106
15825 -169106 -206767 -176756 -84544 7565 -81679 -134877 -153059 -104839 -35214 -77749 -139027
15814 -139027 -92345 -114200 -109620 -141776 -202563 -253712 -187280 -135078 -17219 -75532 5124
15803 5124 23189 117865 160078 34079 -34721 -79327 -191568 -201558 -180601 -71984 -64488 -63313
15791 -63313 -62319 24589 190552 88855 -20910 -24298 44782 37720 -49865 -105407 -140821 -90380
15779i0380q760L5491k7674L8341J25535o267q8113j17766M3427O8410J00981
15768G3225J0675o6860K0684J03178N5238j25470o1655M954J2950m6009l8218
15757e7308P8872P1366l8469n0278k5169n3007Q7103K9668J5141j9461l4190J5293
15745A9561n2896O934Q0066L245o1245K0685o2855O0454P4290N3815o2134r0745
15733a0825l8839J1681q167k1186J1532k5278M284J21l3643J4955J4597J76737
15721I5969P3729j23699L3548j9666m2577M6482j10996m6524J3903L2350R6117
15710D8636n702m6693r8950o7786J01001L2433l0866q2224m8658J50724L664j2477
15698e6898K7667Q0060p3922r1462N7859J54784N6493j62179o0664K8445M444
$$ plain form
15779 -90380 -99140 -63649 -91323 -52982 72553 66286 -21827 -139593 -96166 -27756 73225
15768 73225 83900 17040 37724 140902 196140 70670 9015 13969 26919 -19090 -57308
15757 -57308 21564 92930 54461 4183 -20986 -73993 13110 42778 57919 38458 4268 19561
15745 19561 -33335 -26401 53665 56910 -4335 16350 -46505 13949 88239 142054 79920 -10825
15733 -10825 -49664 -37983 -46150 -67336 -55804 -81082 -76798 -76677 -110320 -95365 -80768 95969
15721 95969 169698 45999 79547 59881 17304 63786 -47210 -93734 -79831 -47481 48636
15710 48636 42934 -3759 -102709 -170495 -69494 -37061 -67927 -150151 -198809 -48085 -44421 -56898
15698 -56898 -29231 50829 -23093 -114555 -56696 98088 154581 -7598 -68262 -39817 -35373
15687c5373L6196J14279m4064q9459m2728m6346K1123O1484o1037m8346p3340
15676b07611Q4541J21036L0246k1782m8452J7144N4261l3751k3348K2049o7788
15665g3455n0988O8206Q0982p699L894N3055j9654K3419q6937k6019k224k1017
15653e8437J78413J03650K209j35819m1692n9518p6006K4917m4826Q2629l3484
15642e7964J04419K3743j5595j5726o9043r9738K6139M5769n4996n9371k0843
15631a93206O49J13454N6417N8888L817Q3040l0482n5738j7361m6530p732k2186
15619e6970n3455j6212Q2127Q7494J454Q646N3975j5100j55732P9445l1789j4200
15607c0317K1263O3070p4570q0340L4737o0640q776m9584J5734J07737O8295N6428
$$ plain form
15687 -35373 823 115102 71038 -18421 -61149 -107495 -86372 -24888 -85925 -134271 -207611
15676 -207611 -123070 -2034 28212 6430 -42022 -24878 29383 -4368 -27716 -5667 -73455
15665 -73455 -124443 -56237 24745 17046 20940 73995 54341 77760 -9177 -35196 -37420 -58437
15653 -58437 119976 223626 225835 90016 48324 -11194 -87200 -62283 -107109 -24480 -57964
15642 -57964 46455 70198 54603 38877 -30166 -129904 -103765 -57996 -112992 -172363 -193206
15631 -193206 -192557 -79103 -22686 36202 40019 123059 92577 36839 19478 -27052 -34784 -56970
15619 -56970 -110425 -126637 -44510 42984 44438 53084 107059 91959 -63773 15672 -16117 -30317
15607 -30317 -9054 54016 -20554 -100894 -66157 -126797 -135573 -185157 -169423 -61686 6609 63037
15595F3037O441k8985N0126J6529j30430p9599m3174L3538j5255N184n1048M8118
15583a25518P6290l2095m7794J20102J06560J00840J8767K4285m1607j14428n3129
15572C2273L2867k90l7406p9914k78p0563M7118O9962m5622q2598Q1707j3689
15560f6433j0628M8971j5560R3438L7600j05798O5460J0073k4216m7282k4931
15549c9306R246m4518n0124M8151J40363J2365k4688l4844n7349j05979L3779
15538a12904J17490k9596J3986O7072K3674l1612k1804r271o0539l9810J11233
15527B7919Q891o4276l1414O4079L2729K143m7755l4756J0584O021N9213L0215
15515F3593j15177K8918p2883r2383L3178L9550L0960o3962N2141K2740N5361
$$ plain form
15595 63037 69478 40493 90619 107148 -23282 -102881 -146055 -112517 -127772 -122588 -173636 -125518
15583 -125518 -49228 -81323 -129117 -9015 97545 198385 217152 241437 199830 85402 32273
15572 32273 65140 64850 27444 -52470 -52748 -123311 -76193 -6231 -51853 -134451 -52744 -66433
15560 -66433 -77061 -28090 -43650 49788 87388 -18410 47050 57123 32907 -14375 -39306
15549 -39306 -30060 -74578 -124702 -76551 63812 76177 51489 16645 -40704 -146683 -112904
15538 -112904 4586 -25010 -11024 56048 79722 48110 26306 17035 -43504 -83314 27919
15527 27919 36810 -27466 -58880 5199 37928 40071 -7684 -42440 -31856 -25835 33378 63593
15515 63593 -51584 -22666 -95549 -187932 -154754 -115204 -84244 -148206 -96065 -73325 -17964
15504a7964j5603o1276P2947M5076j581p0178P2024J19155O2835J0237p9119j20601
15492A5952n8675K4403N5505l3170n9149k568L7665N0944J0473o9121N0006R7975
15480A20240o7446j26496N2400M7352R1865L840L6059m0029o9961M0353j23200
15469c5023k1113N0567O5440m9390j07465O9839L0006O1802k6474o9076p067P1307
15457C3353R8382q4307j32380K0385o5596P1470P9077O348J1233l1367K1257n8442
15445c0587j3279n7016K4589q7740Q7159K3563J545M2016J6120q3398j8019M9927
15433d5120J01000N9605q7811J1296Q700m6249p1949K4355m3651r3223O3423l2068
15421a51692J26792Q2772K156L6123O1046n2032p4984o4288R2003J46957p14j33506
$$ plain form
15504 -17964 -33567 -94843 -21896 23180 21599 -48579 23445 142600 205435 215672 136553 15952
15492 15952 -42723 -18320 37185 4015 -55134 -57702 -20037 30907 41380 -27741 22265 120240
15480 120240 52794 -73702 -21302 26050 117915 121755 157814 117785 47824 88177 -35023
15469 -35023 -56136 -5569 59871 10481 -96984 -27145 2861 64663 38189 -30887 -37954 33353
15457 33353 131735 47428 -84952 -64567 -130163 -58693 20384 26732 37965 6598 27855 -30587
15445 -30587 -43866 -100882 -76293 -164033 -76874 -53311 -51766 -9750 6370 -77028 -95047 -45120
15433 -45120 55880 115485 27674 38970 47670 1421 -70528 -46173 -89824 -183047 -119624 -151692
15421 -151692 -24900 57872 60028 96151 157197 105165 30181 -34107 57896 204853 204139 70633
15409G0633o9658L3440j6182m0550M3846Q9313o7609o6128m8547p200O2698J05448
15397H9504K3033l379m8237k8474J28554P5374j25743r4255j113K1965n7161j24338
15385a44270m821P7951L5191m618K8075N5522Q07L5627R1832R637p5648m3740
15373F1545m8071l4188R3391l0481n382K15780m2435r4264k4155K3822j6788p974
15361I0800p3k4399j26060r1739K3356J44907J4044j5036o9920K2072K2475n395
15349a4968O3588J714L5175P6727J19262J6281j2405R8911M36j90787j03282j02392
15337a1740r0637O5754P583j1062K309K6510l5948J5577J1250K8577P0833n4448
15325B4558r0163m9388j01066j7386N2553N0337N2030m7631J1593J2078M8916
$$ plain form
15409 70633 975 34415 18233 -22317 21529 110842 43233 -22895 -71442 -78642 -15944 89504
15397 89504 112537 109158 60921 32447 161001 236375 110632 16377 15264 37229 -19932 -144270
15385 -144270 -149091 -71140 -35949 -40567 -12492 43030 43837 79464 171296 180933 105285 61545
15373 61545 13474 -20714 72677 42196 36814 252594 210159 115895 91740 115562 98774 90800
15361 90800 90727 66328 -59732 -151471 -128115 16792 30836 15800 -54120 -32048 -9573 -14968
15349 -14968 48620 50334 85509 162236 281498 297779 285374 384285 384721 193934 90652 -11740
15337 -11740 -102377 -36623 -29040 -40102 -37793 -11283 -47231 -31654 -20404 8173 79006 24558
15325 24558 -65605 -114993 -216059 -233445 -180892 -130555 -78525 -126156 -114563 -102485 -53569
15314e3569J14453M034j09683J8740o556l8469M8272O9543k8204o3073O3876j9004
15302C60O2188o1107Q6382M6472p7446r2769m8520J37579M1917p8956n9293Q4776
15290D1583N7858K8491K1768k3144r3388j17472P3662Q3917J999j29491O7860
15279A3643N6985M2916j00718P552K8030k2790J433n6286j22855j2870P8928J76077
15267I0045J5632j94239o720K6073L2113J67299K8477J237m8047r5525q8497K1154
15255e0998P665m2668L2348P0682K2568q7076n2132j04008N4068K1628p036R9858
15243c5101n6984j04921o2958J05387M1825r0829j3714k135M6714Q389R1355N8836
15231a4136j9852Q7485j7624q9711q909j2071o2426J04813J21400n9367l2908
$$ plain form
15314 -53569 60884 64918 -44765 -26025 -32581 -71050 -22778 46765 18561 -44512 19364 360
15302 360 62548 1441 87823 134295 56849 -35920 -84440 53139 95056 16100 -43193 41583
15290 41583 99441 127932 149700 126556 33168 -84304 -10642 73275 75274 -54217 13643
15279 13643 70628 113544 12826 20378 48408 25618 27051 -29235 -152090 -164960 -86032 90045
15267 90045 105677 -88562 -95282 -69209 -37096 130203 158680 159917 111870 16345 -72152 -50998
15255 -50998 -43333 -86001 -53653 17029 39597 -47479 -99611 -203619 -149551 -127923 -134959 -35101
15243 -35101 -92085 -197006 -259964 -154577 -112752 -203581 -217295 -219430 -172716 -164327 -72972 -14136
15231 -14136 -33988 53497 35873 -53838 -62747 -74818 -137244 -32431 88969 29602 -3306
15220c306O6080q1115P357N8371J3334r0452L5439J2652j57176m7680M0443P5786
15208g0267K2316p366J24532j2858l9025P0277K7542r4527M4297k3890j3335k3184
15196D512P276k7488o5129O2940J27184n1280m8050M464L1720o4370N4892j3640
15184B3031k0622N1940k3274n5935m4677K3019j31034O7951M1036J664l7827P6737
15172b7991j0522k0207q1804J8741L5406j5916K5136R6836l5893K5857q1575o6408
15160a38340q3626M9302Q7313L1251M7493J9617M1120j1013j05010j82486p938
15149b52317R9263K7698O0671J17744P153j15111n4359N6061Q7049K8309m7352
15138A4809o093O4263R94j24806J1634k8410R6340K7423q2557j7640M8039L6596
$$ plain form
15220 -3306 62774 -18341 -10984 47387 60721 -29731 5708 18360 -138816 -186496 -146053 -70267
15208 -70267 -47951 -55317 69215 56357 17332 87609 115151 20624 64921 41031 27696 4512
15196 4512 11788 -15700 -80829 -17889 109295 58015 9965 14429 46149 -18221 36671 23031
15184 23031 2409 54349 31075 -24860 -69537 -46518 -177552 -109601 -68565 -66901 -104728 -27991
15172 -27991 -38513 -58720 -140524 -121783 -86377 -102293 -77157 19679 -16214 9643 -71932 -138340
15160 -138340 -221966 -172664 -85351 -54100 -6607 13010 54130 43117 -61893 -244379 -252317
15149 -252317 -153054 -125356 -64685 53059 60212 -54899 -109258 -53197 33852 62161 14809
15138 14809 8716 72979 73973 -50833 -39199 -67609 28731 56154 -26403 -44043 3996 40592
15126D0592o2086l2280p6554l2165k8566J2607M7394P0775P8528K991q7675j8350
15114h4789N5744Q830P4430r714k6326m4930N4388o6100O6426J37082l5047r1950
15102C8044r7733J18279P5349m523j3863j8186m1335o2759k2538O7781k3037L521
15090A9000k6336m4950l0622p218m9804k8175m870R76j9781O3035Q0263Q9284
15078D0802n423l1162l9925k6825j54401L0096J35730J75174Q736o2686o4639
15067E477L5392J37411N7583p6030r3974j8103Q8249k0188r0067m01j9745j075
15055D529K0832l76J56415L0253o1362j20049n3239K2594J8826o3258j0799m963
15043f0597N1776n7201M8597R5578p8752m3137N4283J20247o4231n5633R621K3852
$$ plain form
15126 40592 -21494 -53774 -130328 -162493 -191059 -178452 -131058 -60283 18245 21236 -66439 -84789
15114 -84789 -29045 -20215 54215 44501 18175 -26755 27633 -38467 27959 165041 129994 38044
15102 38044 -59689 58590 133939 129416 115553 97367 56032 -6727 -29265 38516 15479 19000
15090 19000 -7336 -52286 -82908 -90126 -139930 -168105 -172975 -171999 -191780 -128745 -48482 40802
15078 40802 35379 4217 -35708 -62533 -216934 -186838 -51108 124066 132802 70116 5477
15067 5477 40869 178280 235863 159833 65859 47756 136005 115817 25750 25349 5604 4529
15055 4529 25361 24985 181400 211653 150291 30242 -22997 -403 18423 -44835 -55634 -60597
15043 -60597 -8821 -66022 -17425 78153 -599 -43736 10547 130794 66563 10930 20551 44403
15031D4403L7210O6251O5427r1331L7269J1338L1752m1349l2021L1280l7899l0853
15019I1477K3345J967N6091R149J18571J13078J42380k0336j2906K28426J62036
15008I13278L41604O41402P85275J390373K315531J547702j048849j944595j773247
14999C168474j148678p08107m43351k57870j87740j35118j38070K9096J152j02184
14989G7604n8054N6252J03732O6372o120j0814j4002p5355j1940M0813R771j5616
14977A62643j46294q7769j4410L4883k0856J10105J18388o4959n145m256n6325
14966B6005p2619m0825n1249N4731K9950l2588K7693J04392O5043l975j08403
14955a845q8290R514k8460m4072q0328R2254N6765Q2848M1156O656k9895m5654
$$ plain form
15031 44403 81613 147864 213291 121960 159229 170567 202319 160970 128949 160229 122330 91477
15019 91477 114822 116789 172880 182029 300600 413678 556058 535722 522816 751242 913278
15008 913278 1254882 1896284 2681559 4071932 6387463 7935165 6886316 4941721 3168474
14999 3168474 2019796 1311689 868338 610468 422728 287610 149540 178636 179788 77604
14989 77604 19550 75802 179534 245906 239786 228972 214970 139615 127675 168488 178259 162643
14977 162643 16349 -71420 -85830 -50947 -71803 38302 156690 91731 86586 82330 26005
14966 26005 -46614 -87439 -138688 -83957 -54007 -86595 -58902 45490 110533 106558 -1845
14955 -1845 -90135 -80621 -109081 -153153 -233481 -141227 -84462 -1614 39542 46198 16303 -29351
14943b9351N2700n6027O2851L5912m9018L1372k9285o2326P50j00734N8384K7685
14931e7087J9544N2677J08748o2254l095m5586j7388L2790J030n4506m5434q2723
14919a53284N5477J23301L1593O4449l7752J0795Q000o9107r6449m7531o5947
14908a76455J52828J25877q5782M2787M773j03442P81J9577m7131l8188K8276
14897g6099K2209n261N6156O5949n7916n5410k3357K2904M2391m6396m3847L6679
14885f1998Q7282K9028n024j23332j00843R299J05138L3895P477M4518L5934J7325
14873G8699m5764p0020q9380k2988N1991M2984J31273J4589n1692n1134j03668
14862a15110k3083J25144Q0460K8133n2709l6701O8187R3874k4546p8573N006
$$ plain form
14943 -29351 23349 -32678 30173 66085 17067 48439 19154 -43172 -42422 -143156 -84772 -57087
14931 -57087 -37543 15134 123882 61628 58533 12947 -4441 28349 29379 -25127 -70561 -153284
14919 -153284 -97807 25494 57087 121536 83784 94579 102579 33472 -62977 -110508 -176455
14908 -176455 -23627 102250 16468 59255 64028 -39414 -38633 -19056 -66187 -104375 -76099
14897 -76099 -53890 -59151 -2995 62954 5038 -50372 -73729 -50825 -8434 -54830 -98677 -61998
14885 -61998 25284 54312 49288 -74044 -174887 -165588 -60450 -26555 -19078 25440 61374 78699
14873 78699 32935 -37085 -126465 -149453 -97462 -54478 76795 91384 39692 -11442 -115110
14862 -115110 -138193 -13049 67411 95544 42835 6134 74321 168195 143649 65076 70082
14851G0082k8049l2991j089m261j6731o6251m070p0681L3649j7605P8073J41160
14839H1236l0762j00808k6267k0146o1357o74l0922P0724L9961O3455j236r4964
14827a11760j9125K9249J1087R2177m924n8088r2846K6605J4554r127J5469J9283
14815h7446L8996J4677P9928j1633P1294N3885j5458N1719K9009k8946j5985q2199
14803I7841j22623p3857J50117P2521j04681j5528n3115L0305M6785p954n479
14792A4332k5099Q6258J5680m8815o0530n3521Q3526J02641q907k3342l2308J991
14780E1906K880M3532n9810r3052O4226J16139n2413n9595o2183k5699j14681
14769a88750R5150J18492j2771m9095J9123P3061J001j9678J9380o4568n6481
$$ plain form
14851 70082 42033 9042 7953 3692 -13039 -79290 -83360 -154041 -120392 -137997 -59924 81236
14839 81236 50474 -50334 -76601 -96747 -158104 -158778 -189700 -118976 -79015 -15560 -16796 -111760
14827 -111760 -130885 -101636 -90549 1628 -3296 -61384 -154230 -127625 -113071 -122198 -106729 -87446
14815 -87446 -48450 -33773 46155 34522 105816 159701 144243 195962 224971 196025 180040 97841
14803 97841 -24782 -98639 51478 123999 19318 3790 -49325 -19020 27765 19811 14332
14792 14332 -10767 75491 91171 42356 -18174 -71695 11831 114472 105565 82223 49915 51906
14780 51906 54786 98318 38508 -54544 9682 125821 73408 13813 -48370 -74069 -188750
14769 -188750 -93600 24892 12121 -36974 -17851 55210 56211 36533 55913 -8655 -65136
14758f5136L9977m8334p420o6489O0312L8045q6881L8533o877K6745P8805O2054
14746F3334Q6204P8949j8682j35688j35257l2875M0840J00576L533j66179m2016
14735a57261M4786n7172r496Q2139Q2178o5764K1824j9391P2241O1727j6240p0798
14723c1227K5609m5747N5528n4582J9000o2679M8558R2552J44824P7696q9265
14712A80267k8372o9390k5310J1293J6768l4667L2154j01845r521R2643L2506
14701I6526J1060M7559k1547M025j34190n8339J1360K7313L243K8785Q3725J8167
14689A17687q6878K3302o316r3948p2271J1778K3840Q8410l1451R7543P5797o8060
14677G9433n6405o4639l6504J502m7425K3087L0425K7380K014K376M6008J46671
$$ plain form
14758 -65136 -25159 -73493 -80913 -147402 -87090 -49045 -135926 -97393 -104270 -77525 1280 63334
14746 63334 149538 228487 209805 74117 -61140 -94015 -53175 47401 50934 -115245 -157261
14735 -157261 -112475 -169647 -179143 -97004 -14826 -80590 -58766 -78157 -5916 55811 39571 -31227
14723 -31227 -5618 -51365 4163 -50419 -31419 -94098 -45540 47012 191836 269532 180267
14712 180267 151895 82505 57195 68488 85256 50589 82743 -19102 -28623 64020 96526
14701 96526 107586 155145 133598 137623 3433 -54906 -43546 -16233 -12990 15795 99520 117687
14689 117687 30809 54111 47795 -46153 -118424 -106646 -82806 5604 -25847 71696 147493 79433
14677 79433 23028 -41611 -78115 -76613 -124038 -100951 -70526 -43146 -41132 -38756 7252 153923
14665A53923J24434o361j66666K832O2352q7922k9764M6802m4565m8349l3222
14654b6506J5287n3235j9541l6606P232N5236r451q4094J0218J16423R6208n0645
14642B0526q2239R514P3761K3395r199o021L3715j2658J0515P7574p805q1550
14630D9528l1659m958p1542J0670j9320J0066J9340l3476j2460r7055J17212J21324
14618E7670k7333o4320J9621J40335J52362L8232j09768L2334l0612o2497r9482
14607D6542m8126k6827K9853N7510N6860K5864J887J9507k6455m5783l2749o9672
14595a1589N9626p1757L041K9954o5818J5610R798N1089K4399q0954M8563K0068
14583C2030o4017p8794J23814K00170j491j38213k219j17324n8217K2818J9729
$$ plain form
14665 153923 278357 271996 105330 108162 170514 82592 52828 99630 55065 6716 -26506
14654 -26506 -11219 -64454 -83995 -120601 -113369 -58133 -67584 -151678 -141460 -25037 71171 20526
14642 20526 -61713 -52199 21562 44957 35758 29737 63452 50794 61309 138883 131078 49528
14630 49528 17869 12911 -58631 -47961 -67281 -57215 -37875 -71351 -83811 -180866 -63654 57670
14618 57670 30337 -33983 -14362 125973 278335 316567 206799 239133 208521 146024 46542
14607 46542 -1584 -28411 1442 58952 115812 141676 143563 163070 136615 90832 58083 -11589
14595 -11589 48037 -23720 -20679 9275 -56543 -40933 -31135 19954 44353 -36601 11962 32030
14583 32030 -31987 -110781 13033 213203 211712 73499 71280 -46044 -104261 -81443 -61714
14572f1714P2487q417p9941M119N9948J37884k3308r8420n2450r1396k4147O9688
14560i5667R1392M3302p3709O239l792k6318N0532J10626j04914k5937K2122j14731
14548a20855k5057M1055J6482M804J00721J3349J9226n4206p9368q9142O0793
14537a12198J005J4893j13940L5797J75952J32938o6843n4733l8635L5216q314
14526A138l2546o9784Q5517N4680P368L8875p338J6190m4055j2101Q6274o4450
14514E9768q6586j71803K6763l8446K2412Q2292j3075m7103j4468J7164K0770
14503a42312j3828L0560P6983O9412N468l1123m2026m0458m1923K611K1386M1103
14491f4147J14344O6717k0992r6139k1074j8208r3377R5478R8138R323p6954k118
$$ plain form
14572 -61714 10773 2356 -77585 -73466 -13518 124366 101058 2638 -49812 -141208 -165355 -95667
14560 -95667 -4275 39027 -34682 -28443 -32235 -58553 -8021 102605 -2309 -28246 -6124 -120855
14548 -120855 -145912 -104857 -88375 -83571 17150 30499 49725 -4481 -83849 -172991 -112198
14537 -112198 -111193 -96300 -210240 -174443 1509 134447 67604 12871 -25764 9452 1138
14526 1138 -31408 -101192 -15675 39005 46373 85248 77910 94100 50045 37944 124218 59768
14514 59768 -26818 -198621 -171858 -210304 -187892 -105600 -118675 -165778 -180246 -163082 -142312
14503 -142312 -156140 -125580 -48597 20815 26283 -4840 -46866 -87324 -129247 -126636 -105250 -64147
14491 -64147 50197 116914 95922 -217 -21291 -39499 -132876 -37398 60740 70063 -6891 -9009
14479i009P2041p5092m7388J7183O9366j6692L9559P9021n1635O715L0244j29782
14467a5469j46374l6282J01462O3019j4986J0562m6227J5940j0075q0075M2995
14456a15510J43979L4171n0474o9315n4663N4312O40j36Q7980o0319n2389M7390
14444c4334N4328N580q9247m7142R0100M1948P9055J01154p892o3495j24833P5143
14432H0365J8213N669K4707O1112J4839k9840j07928q8481Q7259P1701r4595n8792
14420a5771k4089k2145P415J08177N2781q5434j86565L278J16064j6507m1320
14409a04116k9598O8206J29015l6238r5948j8910o4285K5442L4928L3741Q8763
14398C1000j7085J5711j07823n3241m2262J7900L3191l1058l4279O8355R6433
$$ plain form
14479 -9009 63032 -12060 -59448 -42265 27101 10409 49968 128989 77354 84069 114313 -15469
14467 -15469 -161843 -198125 -96663 -33644 -48630 -38068 -84295 -68355 -78430 -158505 -115510
14456 -115510 28469 62640 12166 -57149 -111812 -57500 -56860 -56996 30984 -29335 -81724 -34334
14444 -34334 19994 25574 -63673 -110815 -20715 21233 100288 201442 193550 130055 5222 80365
14432 80365 98578 104247 128954 190066 204905 175065 67137 -21344 65915 137616 43021 -15771
14420 -15771 -39860 -62005 -54590 53587 106368 20934 -165631 -162353 -46289 -62796 -104116
14409 -104116 -133714 -65508 63507 27269 -68679 -87589 -151874 -126432 -91504 -57763 31000
14398 31000 13915 29626 -78197 -131438 -173700 -155800 -122609 -153667 -187946 -119591 -23158
14387b3158M9209k159j04318J0050Q6583l9465j09232j1750J05747O5323L6840
14376F3670N4792m574j52333p5199J28958O9217n3038j37695j3666N7452j9457
14365h1873M8818m044P5499K1696L2373L4853l6915j9902k7813o0949n4274J7404
14353e5127J30591P2471n4984o207J5851K4174K3879n8378p0731k8930K109q612
14341a3894M4846J600p6173L4071J0480l2840K5016K967k0416m9332n8374L1237
14329a00812j1619L0535O7951J436j7986j2611J633P6329n4903q1668L1421j7062
14317h7356j9839p0933O3797O3243N3797m4711L2646M7833O2406J17164P6806
14306B94853j16507j46664j21983l7256K3316J43703M5281q6753o8341J6578K225
$$ plain form
14387 -23158 26051 23892 -80426 -70376 16207 -23258 -132490 -144240 -38493 26830 63670
14376 63670 118462 113888 -38445 -113644 15314 84531 31493 -106202 -119868 -62416 -81873
14365 -81873 -33055 -37099 38400 60096 92469 127322 90407 70505 42692 -18257 -72531 -55127
14353 -55127 75464 147935 92951 86744 102595 126769 150648 92270 21539 -7391 -5282 -13894
14341 -13894 30952 32552 -43621 -9550 930 -31910 -6894 -3927 -24343 -73675 -132049 -100812
14329 -100812 -112431 -81896 -13945 -12509 -30495 -43106 -41473 34856 -20047 -101715 -70294 -87356
14317 -87356 -107195 -178128 -114331 -51088 2709 -42002 -9356 38477 100883 218047 294853
14306 294853 178346 31682 -90301 -127557 -104241 39462 84743 -2010 -70351 -53773 -51548
14295e1548m2022l5834k3095j9701P7762L7786Q5564K8400n4622m8053p407J38974
14283H6204Q4273m6611j16527m2005n612J31108L4415q3145J8403O2304j4951
14272A07856L8573k7998q8249J4926M2962n362k630K80L6077m5136q7498n5276
14260g1475M036K8085k3942N204P6728O7923L9921r4236r6825m5751J709J32489
14248B3866R8664R709J5676j5155M3048j6286p1308p2186n6866j8204K0652Q2962
14236D4572k6027j6498m6627m8855J4091p289L850m914P7662N3962j02862o395
14224f5330P5173L6491k1021j8446n1960J09176k9453j47110k546J17511P773
14213A0258J1146j7057n5691K7552J16173L5353j1814m3824j0694j48684j04030
$$ plain form
14295 -51548 -93570 -129404 -152499 -172200 -94438 -56652 28912 57312 2690 -45363 -52770 86204
14283 86204 170477 123866 7339 -34666 -40278 90830 125245 42100 60503 122807 107856
14272 107856 146429 118431 30182 45108 88070 82708 80078 80358 116435 71299 -16199 -71475
14260 -71475 -67439 -39354 -63296 -58092 18636 86559 126480 32244 -64581 -110332 -108623 23866
14248 23866 122530 132239 147915 132760 175808 159522 88214 16028 -40838 -59042 -38390 44572
14236 44572 18545 2047 -44580 -93435 -79344 -86633 -82783 -87697 -10035 43927 -58935 -65330
14224 -65330 9843 46334 25313 6867 -45093 64083 34630 -112480 -115026 2485 10258
14213 10258 21404 4347 -51344 -23792 92381 127734 115920 72096 61402 -87282 -191312
14202a91312K288K8675M2528K545n3921m0896J12763Q2015o5196j2382P8864J7196
14190C167j331m754R119p6514m3596q1970j2167K238L6546j7013j08833M3746
14178b51362R3532J41950k3561J9793j2418j23595L2522P2398r853M3181P0937
14167E3524l0443m0541K9859J11747k0187k2936m5784n5066k0601j8099J03558
14156D5031K9448p0375P197q8058J1477K840r168m2417O7127n5365l5978j9386
14144a57627N2639j0196P9625R1992p358k3991N2095J8783k1062L7354O971P2747
14132A91972j0344l9496l4701k8316K2825M4242m2076o563J3398r5773K1278j6234
14120B0212n0471M165N0277J612k8060k7918J07583j11673m3783n6205J05607
$$ plain form
14202 -191312 -189024 -160349 -117821 -115276 -169197 -210093 -97330 -15315 -80511 -92893 -14029 3167
14190 3167 1836 -2918 6201 -70313 -113909 -195879 -208046 -205808 -169262 -186275 -295108 -251362
14178 -251362 -157830 -15880 -39441 -19648 -32066 -155661 -123139 -50741 -60594 -17413 53524
14167 53524 23081 -17460 12399 124146 103959 81023 35239 -19827 -40428 -58527 45031
14156 45031 74479 4104 11301 -76757 -65280 -62440 -71608 -114025 -46898 -102263 -138241 -157627
14144 -157627 -104988 -115184 -35559 56433 49075 25084 77179 95962 74900 112254 119225 191972
14132 191972 181628 142132 107431 79115 101940 146182 104106 97543 110941 15168 36446 20212
14120 20212 -30259 -26094 24183 25795 -2265 -30183 77400 -34273 -78056 -134261 -28654
14109b8654J22792Q32n3384K2417J9916k3614p3120J1905K3644P4508K6132m1124
14097H2250M3037k1729j9193n9601r6322R5179L9156j9829j9760j7224m14R0272
14085I5822o3733j9417R7842J52j33856j7599j6244o7666L0866J9805o6294J8685
14073a21637Q7270m5922o4873J16463K28284O3768q1454n6787j06715J558l0032
14062a0077o3862L7304M229n863P0778k3651r7557Q4142M7681j62699j8973L8375
14050a00173O8602J07153o7362n2104k4450K1676P7484q1110q9412Q4733P2445
14039A7482P565p1716m7243J1302l2214o9273J05928N2022q4430J8461m904l4036
14027a31056M4134m6771J1629O5868J21542J43848n8096j44018q8541M9594J06563
$$ plain form
14109 -28654 94138 94970 41586 64003 83919 60305 -12815 -910 22734 97242 123374 82250
14097 82250 125287 103558 84365 24764 -71558 23621 62777 42948 23188 5964 5550 95822
14085 95822 32089 12672 110514 110666 -23190 -40789 -57033 -124699 -93833 -74028 -140322 -121637
14073 -121637 -34367 -80289 -145162 -28699 199585 263353 181899 125112 18397 19955 -10077
14062 -10077 -73939 -36635 -32406 -38269 32509 8858 -88699 -4557 43124 -119575 -138548 -100173
14050 -100173 -31571 75582 8220 -43884 -68334 -46658 30826 -50284 -139696 -54963 17482
14039 17482 25047 -46669 -93912 -82610 -114824 -184097 -78169 -26147 -110577 -92116 -97020 -131056
14027 -131056 -86922 -133693 -122064 -56196 65346 209194 151098 7080 -81461 -31867 74696
14016G4696N2831M3683j49591l4226o693n3392j7474j5912L8833M1818K8184L9543
14004D2300O167k9881q0764m9748r138J37636Q3940K3599k4680k682l4477k3317
13992C8955O0546J2739j7365n0144r4189j14214J7003P3232K6141L5646r0061
13981a01711j09885M2280K9300j2839K6029M0313M5522m4488n1992L6879L1386
13970f9206N5976M4757o9294o7205O6246M2733q6444p1923K6394R4751N7839K5776
13958E0400K0032j5815n8576k3774J56929n872o7848k6462R0693j1724j01596
13947F387m3965M4154k8830K6470k4040j09209P0801J66843k2347O0993l0604
13936A16653p3143n8016R484j11224m5555J58728M6480J6007L4716J9456l9207
$$ plain form
14016 74696 127527 171210 21619 -12607 -19300 -72692 -90166 -106078 -67245 -25427 2757 42300
14004 42300 48467 18586 -62178 -111926 -121064 16572 100512 124111 99431 96749 62272 38955
13992 38955 99501 112240 94875 44731 -49458 -163672 -146669 -73437 -47296 -11650 -101711
13981 -101711 -211596 -169316 -140016 -152855 -126826 -86513 -40991 -85479 -137471 -100592 -69206
13970 -69206 -13230 31527 -37767 -104972 -38726 4007 -82437 -154360 -127966 -33215 24624 50400
13958 50400 70432 54617 -3959 -27733 129196 123324 55476 29014 119707 107983 6387
13947 6387 -37578 6576 -22254 4216 -19824 -129033 -58232 108611 86264 147257 116653
13936 116653 43510 -14506 -5022 -116246 -161801 -3073 43407 59414 94130 113586 74379
13925G4379r5490r7438J6188J6416K677l4797l4437K4440n3240j0938M9885K8742
13913a13613N0712M5282l391j8554K512q8201p4990N5622R6484L3504P277L3498
13901B6142m9419M515l814k672l3254Q0065o4365o4966N5112R5501J26111n9013
13889A09943j11419m2175M966o3098l7967M6000j4379o768k1479l7960k0221J11033
13877h3524J50822L9176j13645k6250Q255J2976J12249Q0700l5671l0857m8196
13866F6035k029O5247M0260k4848k7750j101m1988j02602q208l2253N1477Q9359
13854G1599p6411j6326K2537r60k5300n7707P04P7563J8000L7113j8803m4606
13842a2597r2137M5427m6524j6223K1692N4760M8068l0130M4201Q795q5012L9772
$$ plain form
13925 74379 -21111 -118549 -102361 -85945 -83268 -118065 -152502 -128062 -181302 -192240 -142355 -113613
13913 -113613 -62901 -17619 -21010 -39564 -37052 -125253 -200243 -144621 -48137 -14633 -7356 26142
13901 26142 -23277 -18762 -22576 -25248 -58502 21563 -42802 -107768 -52656 42845 168956 109943
13889 109943 -1476 -43651 -38685 -101783 -139750 -93750 -108129 -114897 -136376 -174336 -194557 -83524
13877 -83524 67298 106474 -7171 -33421 -25166 -12190 100059 180759 145088 114231 66035
13866 66035 64006 129253 169513 144665 116915 115814 73826 -28776 -36984 -69237 -17760 71599
13854 71599 -4812 -21138 1399 439 -24861 -82568 -81864 -4301 13699 50812 32009 -12597
13842 -12597 -104734 -59307 -105831 -122054 -100362 -45602 2466 -27664 16537 25332 -59680 -19908
13830a9908q2991o7163q763N2848K9245L9336J0825O6409J2836l8791J9996R5003
13818A08882N0408q1970Q1759K07l870L8128J6855o7558o0920j20660J3105Q9983
13806F4349J5541k5715P8824n9434p1168k928m571m5980J8505o8630l6542J46705
13794H956J7181k851k2514j9473r9157m237M1697J8861m6386O9447q278M4377
13782b377L2063l8873n8293J19117J4764l5755R1099K0832o0428j03921K814J24932
13770A05974l15r4944p9202J12814L2930j69954n8579J02915k1246K437J20639
13759E3469K1056J7272k3448m377p26r3703m9862L6643n0970n9217J11016J20113
13747G7266N7667j36613o4483q64R0192J63756O2626m5224q2268L2825J0068o6740
$$ plain form
13830 -19908 -102899 -170062 -178825 -125977 -96732 -57396 -46571 19838 32674 -6117 13879 108882
13818 108882 159290 77320 159079 159286 155416 193544 210399 142841 81921 -38739 -25634 64349
13806 64349 79890 54175 132999 73565 2397 -531 -5102 -51082 -32577 -101207 -137749 8956
13794 8956 26137 23286 772 -18701 -117858 -122095 -80398 -61537 -107923 -38476 -46754 -2377
13782 -2377 29686 -9187 -67480 51637 66401 30646 121745 142577 82149 -21772 -18958 105974
13770 105974 105659 10715 -68487 44327 77257 -92697 -151276 -48361 -69607 -67170 53469
13759 53469 74525 91797 68349 63972 63246 -30457 -80319 -43676 -94646 -153863 -42847 77266
13747 77266 134933 -1680 -66163 -67027 23165 186921 249547 204323 122055 154880 164948 98208
13735I8208k9401o4886p2089K4010K4775L2304L7255k5822k2841k5559o1107o3449
13723a48602J6771O5832J4594J5135Q490L7444k1431j19244j1447L0271J1141
13712a01046N5024N0802j1338k7682N4422R8180L2k5096m3682o6972M344q4920
13700i7932M883K9869q3944m4047J13678J15264k7474P380K6356J14596N009l6010
13688A27628m7059Q850j15983j42386j039R2140m495J8734K6958J14778K2368
13677A00494j233M9883M1319N118n1197r9437o5893J33224J18853j9287l2899
13666A78945M5419j35442j14032K3093N533N0101l5560N6868P9804m6304j7700
13655I0725O4910J3010k3142j03114j9768o6920P588l5034q809M0023q596O8021
$$ plain form
13735 98208 68807 3921 -68168 -44158 -19383 12921 50176 24354 1513 -24046 -85153 -148602
13723 -148602 -131831 -65999 -51405 -36270 -27780 9664 -11767 -131011 -142458 -112187 -101046
13712 -101046 -46022 4780 -6558 -34240 20182 118362 118394 93298 49616 -17356 -13012 -97932
13700 -97932 -93049 -63180 -147124 -191171 -77493 37771 10297 17677 44033 158629 163638 127628
13688 127628 80569 89419 -26564 -168950 -169989 -77849 -82344 -63610 -36652 78126 100494
13677 100494 99261 149144 190463 195581 144384 44947 -20946 112278 231131 211844 178945
13666 178945 224364 88922 -25110 -2017 3516 53617 18057 74925 154729 108425 90725
13655 90725 155635 168645 145503 42389 22621 -44299 -36711 -71745 -80554 -40531 -49127 18894
13643A8894j0422k6946O3499N2094j981r419J5307m6441j37237n1792J14434N0507
13631C0497o8032J2959m2744L0576K0830q5354P1611K6172r291o0444N966O0030
13619g224k6876M1760k1844l4383j4130P087m4505j01708j4764L1932j5842M1287
13607a59210J36125N3478q5614l9040j5663J34770k1034K0370N4568m7997L4320
13596F5073Q2273o2354j0523j043m3521m8270j12503n7765R5765L8602J09398
13585E5132L2794q275j2437j39433k1198N0502P1845N3792N4849p2574m4510r8572
13573g8085m6504K3647L1237P3528L50L829j8437m9770L6521q508j08366J6170
13561a24388J888k016N5137L8279l2997O3328M0652J52J7608k2237M0754J4465
$$ plain form
13643 18894 8472 -18474 45025 97119 95138 85719 101026 54585 -82652 -134444 -20010 30497
13631 30497 -37535 -24576 -67320 -36744 -15914 -101268 -29657 -3485 -12776 -73220 -67254 -7224
13619 -7224 -34100 7660 -14184 -48567 -62697 -55610 -100115 -201823 -216587 -184655 -200497 -159210
13607 -159210 -23085 30393 -55221 -94261 -109924 24846 3812 24182 78750 30753 65073
13596 65073 147346 84992 74469 73426 29905 -18365 -130868 -188633 -92868 -54266 55132
13585 55132 87926 79651 67214 -72219 -93417 -42915 28930 82722 137571 64997 20487 -78085
13573 -78085 -124589 -100942 -69705 3823 4173 8002 -10435 -60205 -23684 -32192 -140558 -124388
13561 -124388 -122500 -124516 -69379 -31100 -64097 -769 39883 40035 57643 35406 76160 90625
13549I0625j9372o8154n5840L6879k5238Q961M9443J00062L5450r8466q6614j1304
13537d3568Q623n5198k690O3292Q5077M5298j40743j57768l5995P1129N1919L3146
13525g7478O9246k8834O8430L1098J3818m6715M2181M9618L07L3964J3049n4597
13513A14087m0063o9556J0701m2881l3994O7430O7489q3261o018P2185n6321o268
13501f470o1817j328Q9439P9487N319j09704n7988L1006o348k503J23598O7114
13489A49805p376m0919r5229O2q68k1137J3690L0107m2344j1319k5361j19424
13477a70313K4269J13940O6085n1001j677O2613q3489O2727K6212O4321p3921
13466C9766j38582J43339M1734k5419L0405k4053N8589K4968o4130q4887M415
$$ plain form
13549 90625 71253 3099 -52741 -15862 -41100 -32139 17304 117366 152816 54350 -32264 -43568
13537 -43568 -34945 -90143 -92833 -29541 55536 100834 -39909 -197677 -233672 -162543 -110624 -77478
13525 -77478 -8232 -37066 31364 62462 76280 29565 71746 121364 121671 155635 168684 114087
13513 114087 74024 4468 15169 -27712 -61706 5724 73213 -10048 -16066 56119 -202 -6470
13501 -6470 -68287 -69615 19824 99311 104630 -5074 -63062 -32056 -38404 -40907 82691 149805
13489 149805 142429 101510 6281 6343 5475 -15662 -1972 28135 -14209 -25528 -50889 -170313
13477 -170313 -146044 -32104 33981 -17020 -18697 43916 -39573 23154 49366 113687 39766
13466 39766 -98816 44523 86257 60838 91243 67190 125779 150747 86617 1730 6145
13455F145j9147k2648J3899q9781j1812N0700M6781L9602O1500l760j02645M2951
13443A1785M2096J0492L0536M2318J0924P390k0581o8163O5593P1906n5708p3130
13431G5458o9292k849l5226j8038m1268O2848k4033k3524Q2619n9042q7545P6414
13419f3478j831n1154J08899M1687k3017j31059L5937L7995m5020J6068M7487
13408b7486O1329j7752K000k4097L9872p2204J7748m880L9489o9227R101R7187
13396E1080n8129p2807J05246r737o3261N3806j6856n1597J9717J1004q4721l4067
13384a50322k3415L8650K6570l2831l1985O0210J20280Q6365p7078k2654M8442
13373D2232M9683N9598M765O9295o1772p2877j23642j42190l7158l6166P6930
$$ plain form
13455 6145 -13002 -35650 -21751 -111532 -123344 -72644 -25863 13739 75239 71479 -31166 11785
13443 11785 53881 64373 94909 137227 148151 155541 134960 66797 132390 204296 148588 75458
13431 75458 6166 3317 -31909 -49947 -91215 -28367 -52400 -75924 6695 -52347 -139892 -63478
13419 -63478 -65309 -116463 -7564 34123 11106 -119953 -84016 -46021 -91041 -74973 -27486
13408 -27486 33843 16091 18091 -6006 33866 -38338 -20590 -25470 14019 -55208 -46107 51080
13396 51080 -7049 -79856 25390 15653 -47608 6198 -10658 -62255 -42538 -31534 -116255 -150322
13384 -150322 -173737 -135087 -108517 -141348 -173333 -113123 7157 93522 16444 -6210 42232
13373 42232 91915 151513 156278 225573 163801 90924 -32718 -174908 -212066 -248232 -171302
13362a71302M2812M4109J41700J18860n0861n9756K2254L7719q2476j40257M471
13351i2727O647M9131j799k1527j09168l9499k2951Q1911R3845J2632J313l797
13339d5989m3384O1569O0465p9041j09291J8711L2092L3666J31130j2775J8869
13328F6022K8257r672j1676K4360q3422j03563q6856M5400J14388m966L5607P0197
13316H4076m685o5636N8937o728l7629m5924K6085Q251M6045J5133l1098k1395
13304B5432j3439O346N7236J58j3777k6317J2577K8602p3p0288m813p1115o3374
13291a32845m539p7140O893J42812Q4523n2632r0996M66P7151n829J08737N7523
13279A14124K323j6983q1396O925l2004K013R406J0487R8392L3735q9008m4529
$$ plain form
13362 -171302 -128490 -84381 57319 176179 125318 65562 87816 125535 43059 -97198 -92727
13351 -92727 -86080 -36949 -38748 -60275 -169443 -208942 -231893 -149982 -56137 -43505 -42192 -45989
13339 -45989 -89373 -27804 32661 -46380 -155671 -136960 -104868 -71202 59928 47153 66022
13328 66022 94279 84607 72931 97291 13869 -89694 -176550 -131150 -16762 -21728 13879 84076
13316 84076 79391 13755 72692 65964 28335 -17589 8496 16747 62792 77925 46827 25432
13304 25432 11993 18339 75575 75733 61956 35639 48216 76818 76745 6457 1644 -69471 -132845
13291 -132845 -137384 -214524 -207631 -64819 19704 -32928 -123924 -123458 -46307 -52136 56601 114124
13279 114124 116447 99464 18068 24993 -7011 -4998 4408 14895 113287 147022 58014 13485
13267A3485q6353k8467R2622L2689l6382m2352O0951n134j3924n5933o6072j2649
13255a47519J7305m4960L2407N7559J5068J7192N5156K3223M6846o4638M9550
13244E7189M8061l9067J4396j02965j8652R5685J4981j851k326o4695j3541m0662
13232e3447q8814L6125Q3209O5019j6552J199P8562j3106j04393n6645k8167L399
13220i3611Q4195L7550M8819r064j4164L2051o0776j02944J7918J38504J13350
13209A91828J3001l8475j78231o8909J04658j9270M9860O1780n0391p3544p0541
13198g8234j5447J28743m1353j6746J31262q0924q0861M4242j4911k401J00921
13187G4291o1302k254J23118J15994n1860o5271p4177l3307p7089O4629O6944
$$ plain form
13267 13485 -72868 -101335 -8713 23976 -12406 -54758 6193 1059 -12865 -68798 -134870 -147519
13255 -147519 -130214 -175174 -142767 -85208 -70140 -52948 2208 25431 72277 7639 57189
13244 57189 105250 66183 80579 -22386 -41038 54647 69628 67777 65451 756 -12785 -53447
13232 -53447 -142261 -106136 -22927 42092 25540 26739 105301 92195 -12198 -68843 -97010 -93611
13220 -93611 -9416 28134 76953 67889 53725 85776 25000 -77944 -60026 78478 191828
13209 191828 204829 166354 -11877 -80786 23872 4602 54462 116242 65851 -7693 -78234
13198 -78234 -93681 35062 -6291 -23037 108225 27301 -53560 -9318 -24229 -26630 74291
13187 74291 12989 10735 133853 249847 197987 132716 58539 25232 -51857 12772 79716
13176G9716n7203j8824P254R9543L7764k7191m2577n66J062K7934l6697m5172
13164B5043N3996L7316o3312p1923K3243N5495j3792j8985n4392o307p0310K2404
13152h1524N4564M0754J20182m4090j02398O3415p6887p0643J46713J55772p4269
13141A31589j55078m252K6426P6823N9993l3934j2610m0401o7373N6523J40165
13130A77871j40304J8539J74569J1123n6610n8284M2156j33756q4554R3340j8577
13119B5513O6388J2514j23307q715Q0j3553K6220O969K2072O5665J3823K3765
13107A17434l5348K7263M8499K6550p026j3687j46643l709L3K6471l7334j7114
13095a4611J9812L4436k3332j758J06857M6743q1956L6424O172n0829k8232m4798
$$ plain form
13176 79716 22513 3689 10943 110486 148250 121059 78482 77916 78978 106912 70215 25043
13164 25043 79039 116355 53043 -18880 4363 59858 46066 27081 -27311 -33618 -103928 -81524
13152 -81524 -26960 13794 133976 89886 -12512 50903 -25984 -96627 50086 205858 131589
13141 131589 -23489 -27741 -1315 75508 135501 101567 88957 48556 -18817 37706 177871
13130 177871 37567 56106 230675 241798 185188 126904 169060 35304 -49250 44090 25513
13119 25513 91901 104415 -18892 -27607 -27527 -41080 -14860 -7891 14181 79846 93669 117434
13107 117434 82086 109349 157848 184398 177372 163685 17042 13333 13366 39837 2503 -14611
13095 -14611 5201 39637 16305 14547 121404 168147 86191 122615 128787 77958 49726 4928
13083D928P4342L675o2234q1603k3826Q50L8069O8733O3158M432j55998K110O1799
13070a565m029j6165P47L4838n679K9554O0831k1102j01454j39202p4074Q4474
13058a52826J2064j9570L3402J05353O5146o7593j4861k3943O9756K770o9812
13047f0114Q5275O6631M8631n4896l6042j8927K6023l9837L3128n3199r8215j7415
13035a18957M5086M2828K1691O8993P088N0365p4236q3596q198K659L2M5007J25884
13022A24646J20218j4611m9640l676j14294k0323j2644m4863K2559P5462r3188
13011a0354o5151j13J9797O9148J00024l5046p0054n0980J02670R7652O2475k2259
12999A97809r4331j52842q7502Q5836N1819l6566l1762j4108O5598P5746N6476
$$ plain form
13083 4928 79270 82945 20711 -60892 -84718 -83868 -45799 22934 86092 90524 -65474 -63364 -1565
13070 -1565 -5594 -21759 -21012 13826 8147 37701 98532 77430 -24024 -163226 -237300 -152826
13058 -152826 -140762 -160332 -126930 -21577 43569 -24024 -38885 -62828 6928 9698 -60114
13047 -60114 25161 91792 140423 85527 49485 30558 56581 16744 49872 -3327 -101542 -118957
13035 -118957 -73871 -31043 -9352 59641 66729 117094 42858 -40738 -48936 -46277 -46245 -1238 124646
13022 124646 244864 230253 180613 176937 62643 42320 29676 -15187 7372 82834 -10354
13011 -10354 -75505 -75618 -55821 13327 113351 78305 8251 -42729 59941 157593 220068 197809
12999 197809 103478 -49364 -136866 -51030 789 -35777 -67539 -81647 -16049 59697 116173
12988A16173j27015q9588j0126n8338o4974K032Q0120R3141O9936O251n7987m53
12976d0828q0877j7515J8593j0387J03356N1945n8973J2352K4832O8748J0234
12965H1480m1201j49592j53823m2989J73352J20898J20486J19666o5022r2755
12955G0500l4053K6867K7495p3804p3253L1345K8313J24185l3969r3285L1723
12944C2064Q6797k0700k8949n8748K7668O3427j6813m3276n7582l0692j13349
12933a60153j7499J07898J03497N4098j6393l175L779J03430J3627n5369j8240
12922A15500l5331J0231J2422r6672J9417N8566J2264r1751L0510r82l7791L369
12910b48o7710M8180m5134l762M1091J11646r7787o9025m9863Q5854K590L1777
$$ plain form
12988 116173 -10842 -100430 -110556 -168894 -233868 -231836 -151716 -58575 11361 17612 -40375 -40828
12976 -40828 -121705 -139220 -120627 -131014 -27658 24287 -34686 -22334 2498 71246 81480
12965 81480 40279 -109313 -263136 -306125 -132773 -11875 108611 228277 163255 70500
12955 70500 36447 63314 90809 17005 -56248 -24903 3410 127595 93626 341 32064
12944 32064 118861 98161 69212 10464 38132 101559 84746 41470 -16112 -46804 -160153
12933 -160153 -177652 -69754 33743 87841 71448 68273 72052 175482 189109 133740 115500
12922 115500 80169 90400 102822 6150 25567 84133 96397 4646 35156 34174 -3617 -248
12910 -248 -67958 -19778 -64912 -68674 -27583 84063 -13724 -82749 -132612 -46758 -44168 -12391
12898a2391Q0116p6207j43525p3373p89O5392J01960j8026o4894Q8360k7786k8904
12886a10067L1239O9945k8627r5737P9648R2305n0750q9810o2631k9956k2137
12875b16578o2513M7959J30371M1754Q1891k6322p7755m8932J1227j0711j14541
12864b44150J44753L0801k9767k2319n2812L9643J5148O7830O9960r3174m3652
12853a17739m5703J9626Q2880J35495O015k4088M7644m3939K9256l0466o8409
12842i428M6430K7126k8766k0566o259M5490o855m5030J6979j3363M094l9472
12830b9620O7562m5120m6975M5030m9847M5971O7848R5838N3555o5859m7400m5080
12818D5903N405L993L0595N7808j53468j00245P2311n5926n0006K7542L3965Q991
$$ plain form
12898 -12391 67725 -8482 -152007 -225380 -226169 -160777 -58817 -76843 -141737 -53377 -81163 -110067
12886 -110067 -78828 -8883 -37510 -133247 -53599 38706 -12044 -101854 -164485 -194441 -216578
12875 -216578 -279091 -231132 -100761 -59007 22884 -3438 -81193 -130125 -118898 -129609 -244150
12864 -244150 -99397 -68596 -98363 -120682 -173494 -133851 -118703 -50873 19087 -74087 -117739
12853 -117739 -163442 -143816 -60936 74559 80574 56486 104130 60191 89447 58981 -9428
12842 -9428 37002 64128 35362 14796 8537 54027 47172 2142 19121 5758 9852 -29620
12830 -29620 37942 -7178 -54153 -9123 -58970 -12999 54849 150687 204242 138383 90983 45903
12818 45903 51308 55301 85896 143704 -9764 -110009 -37698 -93624 -143630 -116088 -82123 -73132
12806g3132l9368j1937O9582j199P1482J4152j75774N7109J40689M7507p6589
12795B2522j3634l6935j23309M6609K6346J19165L3729q2076j1454Q403K7980
12784A7346L6340L1000m3044n1081j24509K818j8373P6061j7456o2609O7806Q3922
12772a779L8992q2036k7352o988P1303j1581r9931k8868P5200J32826J7368R257
12760H6411k3447M4117j13030J4888j4691M5708J5129l1785j1575o2549o896J8632
12748c9088r0038j4432p7272m5425Q8327J3792m9124J47646L0772N1742O6890
12737H3790l033p3585j6661l9864m0091J6161R0391M5785j5562j17673r8675K0864
12725a48153O8221K6039M6528J08026N707j232k6327n1146L605K1238j06571M8719
$$ plain form
12806 -73132 -112500 -124437 -54855 -56054 15428 29580 -146194 -89085 51604 99111 22522
12795 22522 8888 -28047 -151356 -104747 -78401 40764 74493 -7583 -19037 -10634 17346
12784 17346 53686 84686 41642 -9439 -133948 -131130 -149503 -73442 -90898 -153507 -85701 -1779
12772 -1779 37213 -44823 -72175 -79163 -7860 -19441 -119372 -148240 -73040 59786 77154 86411
12760 86411 62964 107081 -5949 8939 -5752 39956 55085 23300 11725 -50824 -57720 -39088
12748 -39088 -129126 -143558 -220830 -266255 -177928 -164136 -213260 -65614 -34842 16900 83790
12737 83790 80757 7172 -9489 -49353 -89444 -73283 17108 62893 47331 -70342 -169017 -148153
12725 -148153 -79932 -53893 -7365 100661 106368 105136 78809 27663 31268 52506 -54065 -5346
12713e346P6135O1195m852n0661j7370n2225o5185q1763j9845r947N7588J15764
12701C488N2718n0685o5637M9217J9660j26452K449J16649L2789M5938k1313j01692
12689d2871k3903N6867J70551N7931k1104O607j41566m5921L1254M0107p3358
12678A4594j29626j8823J4440O0250j4630K2999N2344m9129N24k3505O9463O9831
12666F8732o5032j03333J64100L1473j13123q8738l9882M975L5129n0580P36J09933
12654d5610J03755R7309p1382j63137n3205M7225Q5336K6137L3164m9053N6930
12643F7469L7760P3621r0257j45294n5574J7856L2312R9388R5937j5083p6021
12632D2114J2457l9748q6493l4953J10153j4726J12759n0192o8434L8456l9000
$$ plain form
12713 -5346 70789 131984 127132 76471 59101 6876 -58309 -140072 -159917 -169864 -112276 3488
12701 3488 56206 5521 -60116 -10899 8761 -117691 -115242 1407 34196 80134 58821 -42871
12689 -42871 -66774 -9907 160644 218575 197471 204078 62512 16591 47845 87952 14594
12678 14594 -115032 -133855 -119415 -59165 -73795 -50796 1548 -47581 -47057 -70562 -1099 68732
12666 68732 3700 -99633 64467 95940 -17183 -105921 -145803 -140828 -105699 -156279 -155543 -45610
12654 -45610 58145 155454 84072 -79065 -132270 -85045 291 26428 59592 10539 67469
12643 67469 105229 178850 88593 -56701 -112275 -94419 -62107 37281 133218 118135 42114
12632 42114 54571 14823 -71670 -106623 3530 -11196 101563 51371 -17063 21393 -17607
12621a7607k8197Q586N6539M7084P0463Q71p450k0085k478q4160p3109K1770l0369
12608e8142o5450r836J9676Q713J7258o6912J02666L9741l1362J9885l6590r374
12596f9727Q3749K4622P855k5034O6213N8564p1742j28172p3006O5494O3945n8333
12584e5572n3871M6220P0866l069M2011J3186M6951j0834k4550m5974K550N0405
12572G8319o6570k9330o259o1551J6958J1272j45503m731J46682l524L7935p1299
12560i7601o8678L5412R3654J05242j7976j01107j0491M7082R318J0558m3556
12549c8143m0791N2564J31451N0696r8605j17268k889Q8529n6050k9227M7429
12538a2304o1780j7502M7865J12574O1087q0066M9635M0061P70j3559P3467n0625
$$ plain form
12621 -17607 -45804 -37218 19321 66405 136868 137739 130289 110204 107726 23566 -49543 -27773 -58142
12608 -58142 -123592 -133428 -113752 -105039 -87781 -154693 -52027 -12286 -43648 -23763 -60353 -69727
12596 -69727 14022 38644 46499 21465 87678 146242 74500 -53672 -126678 -61184 2761 -55572
12584 -55572 -109443 -63223 7643 4574 46585 59771 106722 95888 71338 25364 27914 78319
12572 78319 11749 -17581 -23840 -85391 -68433 -57161 -202664 -207395 -60713 -64237 -26302 -97601
12560 -97601 -166279 -130867 -37213 68029 50053 -51054 -61545 -14463 -5145 5413 -38143
12549 -38143 -78934 -26370 105081 155777 57172 -60096 -62985 25544 -30506 -59733 -12304
12538 -12304 -74084 -91586 -43721 68853 129940 49874 99509 139570 140340 126781 200248 149623
12526A49623o8190K8438k5029k8972l3268J00612o6488o1924O3935o7634n2511
12515f1408N5554J09698j5376o7201j11516j8885K4328k215N9585N1069J3917
12504C7550N8739o87l9042k5712m0109O5190N2842K1250k5239J1547k1412o3896
12492C1021k534p443n3771P2428L3170K8972k329m8641j681j38Q7774n516O5571
12479A96883p0850j54338p2026j6152M7275R0804J4090l7727K3245n8706j5978
12468e3480L8929J41145R6154j25060p7049J669N210m7294j2304r9745l862K2830
12456a12857n6292J33451K4888p2565j8712J7429J9562M3423Q7277q2028O7747
12445E1323J45192p5064j43407o3894k3087r0021R1094J2417O6695n059o9946
$$ plain form
12526 149623 81433 109871 84842 55870 22602 123214 56726 -5198 58737 -8897 -61408
12515 -61408 -5854 103844 88468 21267 -90249 -109134 -84806 -87021 -27436 23633 37550
12504 37550 96289 95602 56560 30848 -9261 55929 108771 130021 104782 116329 94917 31021
12492 31021 28487 21044 -32727 39701 72871 101843 99514 50873 49192 49054 136828 131312 196883
12479 196883 126033 -28305 -100331 -116483 -69208 21596 35686 -2041 21204 -37502 -53480
12468 -53480 -14551 126594 222748 97688 20639 22308 27518 -19776 -32080 -131825 -135687 -112857
12456 -112857 -169149 -35698 -10810 -83375 -102087 -84658 -65096 -21673 65604 -16424 51323
12445 51323 196515 121451 -21956 -85850 -108937 -198958 -107864 -95447 -28752 -33811 -103757
12434a03757n7500k1406J15339n041o365J180m5763k2116K2865Q8967M2301L552
12422A2256p182R8411M2825j6292j18660o8761k7719N8420N7277l6453o2149J1324
12410e6703L7471j7282Q7447n118m9841l0659o8681L4835R3015K3624m7286j5526
12398a4704m0231j0436J6963J606j6549K1103R9212L3372J0845J03787r0308j77445
12386f2785m4937O9840l3221M0671J5644k9047j7146p5559K1200O3698q8415p7826
12374b17883M0020P1968O6596p241m7541O5433Q4990L0028L6593M5268l543m3957
12362A20731q3278P6638l416r375p7763r6518L5595o76l4045K8154J2447J9648
12350a1858P4028J5156j5208M3196J0151j8116J3072K0706n4572j02329o2203
$$ plain form
12434 -103757 -161257 -182663 -67324 -72365 -78730 -77550 -123313 -145429 -122564 -33597 8704 12256
12422 12256 5074 103485 146310 130018 11358 -57403 -85122 -26702 30575 -5878 -68027 -56703
12410 -56703 -19232 -36514 50933 45815 -4026 -34685 -103366 -68531 24484 48108 822 -14704
12398 -14704 -54935 -65371 -48408 -46802 -63351 -42248 56964 90336 101181 204968 114660 -62785
12386 -62785 -107722 -37882 -71103 -30432 -14788 -43835 -60981 -136540 -115340 -51642 -140057 -217883
12374 -217883 -177863 -105895 -39299 -46540 -94081 -28648 56342 86370 122963 168231 164688 120731
12362 120731 37453 114091 110675 101300 23537 -72981 -37386 -38062 -72107 -43953 -31506 -11858
12350 -11858 62170 77326 62118 105314 115465 97349 110421 131127 76555 -25774 -87977
12339h7977j1080n6841O1550Q4009o944m3169J2844J6348p1114j53794m0586L5213
12327b61541J67145J07559j1319q029K5296n3524n9020Q172K9334L6254J8896
12316g77J0355J9289Q36M9826j7398j4671l6186J3898P7668m5554J093j1632M1071
12303H7818n353o3836q1213R076L8665q0896j3754J36921K6958M2960q3171L0468
12291D4643n418J0975M1780j24886j07953O6968O2856M2794L674M482N661N4281
12279I9857M8839k1911q2971m1290n9684n1652O2186J64697R9371k6805k1132
12268A69505l5158j24482m0667O698j462j00055M6706O2843N9139K0540k4302
12257C9305n9839K1431J9275L7878r2776o9783j28443l9698P4268J09413R6445
$$ plain form
12339 -87977 -99057 -155898 -94348 -10339 -17283 -60452 -47608 -31260 -102374 -256168 -296754 -261541
12327 -261541 -94396 13163 1844 -6185 19111 -34413 -93433 -85261 -55927 -19673 -777
12316 -777 9578 28867 29703 79529 62131 47460 11274 25172 102840 57286 58379 46747 87818
12303 87818 82465 18629 -62584 -53508 -14843 -95739 -109493 27428 54386 97346 14175 44643
12291 44643 39225 50200 91980 -32906 -140859 -73891 -11035 31759 35433 39915 45576 99857
12279 99857 148696 126785 43814 2524 -57160 -108812 -46626 118071 217442 190637 169505
12268 169505 134347 9865 -30802 -24104 -25566 -125621 -78915 -16072 43067 63607 39305
12257 39305 -20534 897 20172 58050 -34726 -104509 -232952 -272650 -198382 -88969 7476
12246G476O6214m3676N0230p571n2248p0378n9878j2260N4899J38297L457m3218
12234C1344M194j0012m5945k232k96j3169J8884o9774j06363M7032m35O0405J2388
12221g3979N8439p0096l7034j3388j5810L8997N6399N8551m1333l7787p1673k9079
12209a77793J76179J58288N6802l1051o6438o3156L7426N0354k6912m7165l7791
12198B8743k8022O536K9851m5465m3083p4693j4789n6453N5411J82616J25670
12187A66322k6984n6131l8644j51428l1406Q7839J4452j816M799R042J1873Q1105
12175F9023J8813J5384k8085p1953L9862P6356L0666O1084q8613j43118Q5136
12164F4555J0115k7553m7607j7329Q4344l5522o2446J0616n1101J1073J31458
$$ plain form
12246 7476 73690 30014 80244 72673 20425 -49953 -109831 -122091 -67192 71105 74562 31344
12234 31344 35538 25526 -20419 -22651 -22947 -36116 -17232 -87006 -193369 -146337 -146772 -86367 -73979
12221 -73979 -15540 -85636 -122670 -136058 -151868 -112871 -56472 2079 -39254 -77041 -148714 -177793
12209 -177793 -1614 156674 213476 182425 115987 52831 90257 140611 113699 66534 28743
12198 28743 721 7257 37108 -8357 -51440 -126133 -140922 -197375 -141964 40652 166322
12187 166322 139338 83207 44563 -106865 -138271 -50432 -35980 -37796 -32997 -23955 -12082 69023
12175 69023 87836 103220 75135 3182 43044 119400 150066 211150 122537 -20581 64555
12164 64555 74670 47117 -490 -17819 66525 31003 -31443 -20827 -71928 -60855 70603
12153G0603J02952L4007l5650l9463r8161j7251J4823q1294O9353Q0272N9826
12142A60017j15330J3976R337O504R1283M9917j0853O6632m6098j30741n3918
12131D0726q922m0498q5939l7330l0475O179L2475J2119R2541O7587R039k8273
12119B9229O2997N4881k2589j79249m9322N5065K4701l0765l5160J3128J9597
12108e7487L1322j05046n8039M6574J37157M7756M4356M8787P8430q6942l9129
12097H7739q967o4682j50262N8471J19721O7872j8327J0803m2907k560J03790
12086A60691l9378j01994l09m269N7820j3076n5299J01k3699N0874k556j2095
12074A6811n3112q5014N0779M5145P0781L2706O21o030L0720r1364m7981k9600
$$ plain form
12153 70603 173555 207562 171912 132449 34288 17037 31860 -49434 19919 100191 160017
12142 160017 44687 58663 68000 74504 165787 215704 204851 271483 225385 94644 40726
12131 40726 31804 -8694 -94633 -131963 -162438 -156259 -123784 -111665 -19124 48463 57502 29229
12119 29229 92226 147107 124518 -54731 -104053 -48988 -24287 -55052 -90212 -77084 -57487
12108 -57487 -26165 -131211 -189250 -142676 -5519 42237 86593 135380 213810 126868 87739
12097 87739 78772 14090 -136172 -77701 42020 109892 91565 102368 59461 56901 160691
12086 160691 121313 19319 19010 14741 72561 59485 4186 4287 -19412 31462 28906 16811
12074 16811 -36301 -121315 -70536 -25391 45390 78096 78717 72687 103407 12043 -35938 -65538
12062f5538k6200K189Q8605O6466K2323p6830j37061o0207j0414L7537P42l7771
12050a96159J5125J95136L7379q718j65317O6756K6078m0432p0051R3288M3580
12039c335l0008P4932R4719m8166j09584n4428k8790K0966l163j5857Q1089j11838
12027a33463o751M859K5379J38537N2365k7355p4133q0677M3098J77040j1563
12016A07336q5080N3654r240o0408P0142Q079n8216n8151O613K4668m6557J6587
12004c0573R3554N494j23779p1423J0735P2512l0534j906J8461j9013o839k4413
11992a07724O5719Q9842K3592M5542N8020Q9027J0153m5711j5550l8516q131q8037
11980G8226l5373p0510J6775M2184O1944Q302r5307J0513k7844o2335N829O9299
$$ plain form
12062 -65538 -91738 -89549 -944 65522 87845 11015 -126046 -186253 -196667 -159130 -158388 -196159
12050 -196159 -181034 14102 51481 42763 -122554 -55798 -29720 -70152 -140203 -46915 -3335
12039 -3335 -33343 41589 136308 88142 -21442 -75870 -104660 -83694 -86857 -102714 -21625 -133463
12027 -133463 -140214 -135355 -109976 28561 80926 53571 -20562 -101239 -58141 118899 107336
12016 107336 22256 75910 66670 6262 76404 84483 26267 -31884 -25271 -603 -47160 -30573
12004 -30573 62981 68475 -55304 -126727 -115992 -43480 -74014 -75920 -57459 -76472 -83311 -107724
11992 -107724 -42005 47837 71429 116971 174991 264018 274171 228460 212910 174394 166263 78226
11980 78226 42853 -27657 -10882 31302 93246 101548 6241 16754 -11090 -73425 -67596 1703
11968A703R4122r4805l6110o703P7752J23671n2260p1357m3711p4822n5518N2921
11956h5117Q8096p460l6066m2311j2954K5157M5734P3261J08953k4746o2188o5447
11944D912p2201N3056m5892l3424j3764J7147K5135J54802J06124o5368j02650
11933B7877k0884J0789N5041j7644o6662N2583J0969p0159L3201j9171j3086k171
11921a9317R3081p8130j02449j7042J29j2442K1894J47095J6336o3629k0281O8520
11909C3765J73414L0505o6960q9596j22315Q3113m2061K440J4913O9379j6414
11898G0183O7110M1936n9703j15686p4773M1822j2636M6477Q49K2012o6904n3330
11886i2643Q6094N7387J6666K7801m5605K4080m7397n8568L0715K1368j10130
$$ plain form
11968 1703 95825 1020 -35090 -41793 35959 159630 107370 36013 -7698 -82520 -138038 -85117
11956 -85117 2979 -4481 -40547 -82858 -95812 -70655 -24921 48340 157293 132547 70359 4912
11944 4912 -67289 -14233 -60125 -93549 -107313 -90166 -65031 89771 195895 130527 27877
11933 27877 6993 17782 72823 55179 -11483 41100 52069 -18090 15111 -4060 -17146 -19317
11921 -19317 73764 -4366 -106815 -123857 -123728 -136170 -114276 32819 49155 -14474 -34755 33765
11909 33765 207179 237684 170724 81128 -41187 41926 -135 2305 17218 86597 70183
11898 70183 137293 179229 119526 3840 -70933 -29111 -41747 4730 5579 27591 -39313 -92643
11886 -92643 -6549 50838 67504 95305 49700 73780 26383 -32185 -1470 19898 -90232
11875i0232j7946J3928M2964L7293M601K3622j6494L3779k4313K5530k439o5840
11863c5547n2804N0350l0577P3777N5862j15188k6057M4606M966m4493p4801Q5492
11851f4414R5836P6358r9941q8772L5809O2936p7287N6871N1296l3077p9681m5221
11839a09287L1452q3758N1497m0562l5177P9682J01630O6492k1439P5839j8928
11828I7441q9256q9656o7218M6087P0821O6555K5711j9136n0615j1457O827k8597
11816d2493J6184J00286J36078M8702p983q9952q8061O2088j2560k0417j1577
11805I0295q0602m1052M7204N4665m3231R051N5845l063l3251r3472K3324M4428
11793C0141n0875p6824o655O7484m4237K6686N5892k0696O4467L3277N8820K425
$$ plain form
11875 -90232 -108178 -94250 -51286 -13993 -9392 14230 -2264 31515 7202 32732 30293 -35547
11863 -35547 -88351 -38001 -68578 5199 61061 -54127 -80184 -35578 -30612 -75105 -149906 -64414
11851 -64414 31422 107780 7839 -80933 -45124 17812 -59475 -2604 48692 15615 -64066 -109287
11839 -109287 -77835 -161593 -110096 -150658 -185835 -106153 -4523 61969 40530 116369 97441
11828 97441 8185 -81471 -148689 -102602 -31781 34774 60485 41349 -9266 -20723 -13896 -42493
11816 -42493 -26309 73977 210055 258757 250774 160822 72761 134849 122289 101872 90295
11805 90295 9693 -31359 15845 70510 27279 36330 92175 89112 55861 -37611 -14287 30141
11793 30141 -20734 -97558 -104213 -36729 -80966 -54280 1612 -19084 45383 78660 137480 139905
11781A39905l5473K4589K3025k6609l4243n2452m0475j0977o5039n5966J36954
11770C239N6655p1968k6320j7708m4699N4380J61217o818q6975O3215N3503j03401
11758C4320q3107n8326l4816K9106m0403P1881k5435M3555m3881p5623J41600
11747d1129P6516M6495k1284k1498m7925l6687M2371J39896l9750j31548K4563
11736i980L961l7246N0783J7011p22N3021k1025J5787r603p2619j6801N3286J8636
11723D4489k3909Q473m1360J4145J2852J61758O8023o3136N7656M0741j21376
11712A58356l8260o721Q385J11197J7490j64316j43609O5941K0098J1884P43l0555
11700A0633j3776L6035J51427J7514n4299k6066N1857m9720j39425r848K972n5700
$$ plain form
11781 139905 104432 129021 152046 125437 91194 38742 -1733 -12710 -77749 -133715 3239
11770 3239 59894 -12074 -38394 -56102 -100801 -46421 114796 107978 21003 84218 137721 34320
11758 34320 -48787 -107113 -141929 -112823 -153226 -81345 -106780 -63225 -107106 -182729 -41129
11747 -41129 35387 81882 60598 39100 -8825 -45512 -3141 136755 97005 -34543 -9980
11736 -9980 -6019 -43265 7518 24529 23807 76828 55803 71590 61987 -10632 -27433 25853 44489
11723 44489 20580 29053 -12307 1838 14690 176448 244471 181335 238991 279732 158356
11712 158356 120096 113375 121760 232957 250447 86131 -57478 8463 28561 40445 41188 10633
11700 10633 -3143 32892 184319 201833 147534 121468 173325 123605 -15820 -25668 -22696 -78396
11688g8396J0785P3107q834p7738J01517O3963k8637l7071l2128J7184m2622o1744
11676a00614J3801K5115p0936M2335J17701n7519o021J5702N5735m5060m2837
11665e2598N8087Q9486O4544q0072l5170p3069n4606N7168N5126M9019P7505j53409
11653B011n8957K2373M0815N6468j08817r7723L6514K4904o5635J7415N0527J3184
11641f6921k6472q4782p3614J51919J26736M6078P9214L534r0088p3303m3769
11630e1468O5904p2479m3965k204O6832q498J41223N0792o4882m0260l5771O3574
11618F8798j3195p4647Q860p436k4695l2444q3106K0548j0713n6299M0049J00016
11606f4264J33763K4248r3056M54l4978l3227o816j6699O3126j096M3300Q6898
$$ plain form
11688 -78396 -67611 5496 -3338 -81076 20441 84404 55767 18696 -13432 3752 -38870 -100614
11676 -100614 -86813 -61698 -132634 -90299 27402 -30117 -36138 -20436 35299 -9761 -52598
11665 -52598 5489 94975 159519 79447 44277 -28792 -83398 -26230 28896 77915 155420 2011
11653 2011 -56946 -34573 6242 62710 -46107 -143830 -107316 -82412 -148047 -130632 -80105 -66921
11641 -66921 -93393 -178175 -251789 -99870 26866 72944 152158 155692 65604 -7699 -51468
11630 -51468 14436 -58043 -102008 -104212 -37380 -45878 95345 146137 81255 40995 5224 68798
11618 68798 55603 -19044 -10184 -17620 -42315 -74759 -157865 -137317 -148030 -204329 -164280 -64264
11606 -64264 69499 93747 691 1145 -33833 -67060 -73876 -90575 -27449 -28545 14755 101653
11594A01653L5540j6811n699j7969j10440J7365J199J6851j6574K0992k4517J4519
11582A6109Q958k9358M3397J1141j737K2535M0718r8228j19660m7832N2834N163
11570i5960P2104O5302j07270j43832N5147M2718k413J5659L734r592N9905L7622
11558f876q2883O98M5487n5408p365O7606N7979o9o17N2195L892J06099n0990
11545A29748N159p695m8801n7597M6865N0582o3038p7792K7098N0325N4759j12289
11533b676p9068n4476m1167P2314M8542l3978j141R7735J2659q4956N8594O7057
11521E9439j0112K1107L278n2247N5502q1608p2717m7224j6364Q9443J32176L2541
11509A13214p8288q1851j16973l1116q584J17688J26232M1517q420M0559q9155
$$ plain form
11594 101653 137193 120382 114683 96714 -13726 3639 4838 21689 5115 26107 1590 16109
11582 16109 25067 -4291 39106 50247 48510 71045 111763 13535 -106125 -153957 -101123 -95960
11570 -95960 -23856 41446 -65824 -209656 -154509 -111791 -114204 -98545 -94811 -104403 -44498 -6876
11558 -6876 -89759 -89061 -43574 -98982 -106347 -38741 19238 19169 18552 70747 74639 180738 129748
11545 129748 134907 127212 78411 20814 67679 118261 55223 -22569 4529 54854 109613 -2676
11533 -2676 -81744 -136220 -177387 -105073 -56531 -90509 -91650 6085 18744 -66212 -7618 59439
11521 59439 49327 70434 73712 21465 76967 -4641 -77358 -124582 -140946 -51503 80673 113214
11509 113214 34926 -46925 -163898 -195014 -203598 -85910 40322 81839 73419 113978 24823
11498B4823n9222O2904R3434n8116R145J9484j3014P9986M0909o3532m2851k1078
11486G2872q4870r2637m2000K0680Q8687R9899Q5763q1592r4939p7063J1069Q8462
11474e669m7079r1671q6812j6087R1082k6844K7168R3638J3193K1256N6794Q3058
11462A12027j0902r360J1534q5287q506j06774l0283J12905J499j22614j5806
11451a51567l3819R7712Q7516Q4921J8852l6342j10303M2643M1883n2510m0501
11440e1515j9636n7761n646q226L0255O9666p636L5891O9166Q2492P025r031Q1834
11427B16878J3763j40481j13905j43761J1832K7918M8495J2164p1194p9503P8375
11416a39419Q3537k0766m4351R6151P357k1722R2399K1682p8453J19495K7569
$$ plain form
11498 24823 -34399 28505 121939 63823 72968 92452 79438 159424 200333 136801 93950 72872
11486 72872 -11998 -104635 -146635 -125955 -37268 62631 148394 66802 -28137 -105200 -94131 -5669
11474 -5669 -52748 -144419 -231231 -247318 -156236 -183080 -155912 -62274 -49081 -27825 28969 112027
11462 112027 101125 91765 103299 18012 9506 -97268 -127551 -14646 -13147 -135761 -151567
11451 -151567 -185386 -87674 -158 84763 103615 67273 -43030 -387 41496 -11014 -51515
11440 -51515 -71151 -128912 -134558 -142784 -112529 -42863 -50499 -14608 54558 137050 144075 135044 216878
11427 216878 230641 90160 -23745 -167506 -155674 -127756 -79261 -67097 -138291 -217794 -139419
11416 -139419 -55882 -76648 -120999 -24848 -17491 -39213 53186 74868 -3585 115910 143479
11405A43479j07253j30128q4514J10969J56202o756m2067r7970k0944N7757P7776
11394E6551P0013j5005P048J714M6015K6446K3524K9918P9705N6708l6585m2889
11382C03163j6612n4932q6316L1068Q9634n0564r9707p9398N7371M6136j31690
11371H153m9210J14343M4908o520L1472N215J01025L6277j57423j02945J5073
11360D0368j1821L0790R987n17L9301O8053k5330n0917j14779J8600j0909K773
11348d401j3018k7850J1694j8370n9284m8692q731Q2399r329j03808J23590L7384
11336c8416l4058N0454J18306o9290m2074k3837L0836N2288J00350l2558j31318
11325a9317J2691q467O169k237L4562O709M9795M262m5005M2270N6188N0200l106
$$ plain form
11405 143479 36226 -93902 -178416 -67447 88755 81999 39932 -58038 -78982 -21225 56551
11394 56551 126564 111559 118607 120321 166336 192782 216306 246224 325929 382637 346052 303163
11382 303163 286551 231619 145303 176371 266005 215441 115734 36336 93707 139843 8153
11371 8153 -41057 73286 118194 111674 143146 148361 249386 285663 128240 25295 40368
11360 40368 28547 59337 69324 68807 108108 176161 150831 99914 -14865 3735 -7174 -4401
11348 -4401 -17419 -45269 -33575 -51945 -111229 -159921 -168652 -86253 -95582 -199390 -75800 -38416
11336 -38416 -72474 -22020 96286 26996 -15078 -38915 -8079 44209 144559 112001 -19317
11325 -19317 -6626 -15093 -8924 -11161 23401 30110 79905 84167 39162 81432 137620 187820 184714
11312A84714o0046o4677k6908P504P6983l0174p7127m0361Q5457L1309m3690O1767
11300A04751K549q1734k3762J01500R0944r6485m9522j0676l2060n7407J8342
11289c3560Q0210O5749L6105r6264o6319P140O6269j5596R267m3805N0565P1575
11277A31336m6288K9598m0961q7896j26373L38O9293Q5869J53481N9530m0340
11266A87587m1406R478J27548j04086q3393j01239q0342M671J40318R083p8450
11255a0231J8854M3758j9621n3748L5775j9909m0943k1366k3463J8911L1074L7151
11243c758o0302L3773R4315M473L6843p0178m9951L1698N855j67686k62J1806
11231a33374L4386O835M232R334O7528r263N8077J08886K1251J1304Q865l5710
$$ plain form
11312 184714 124668 59991 33083 40587 117570 87396 10269 -30092 55365 86674 42984 104751
11300 104751 107300 25566 1804 103304 194248 97763 48241 37565 5505 -51902 -33560
11289 -33560 46650 112399 148504 52240 -14079 -6939 59330 43734 53001 9196 59761 131336
11277 131336 85048 114646 73685 -14211 -140584 -140246 -70953 14916 168397 227927 187587
11266 187587 146181 155659 283207 179121 95728 -5511 -85853 -81182 59136 68219 -10231
11255 -10231 8623 52381 32760 -20988 14787 -5122 -46065 -67431 -90894 -71983 -40909 -3758
11243 -3758 -64060 -30287 64028 68501 105344 35166 -14785 16913 22768 -144918 -145180 -133374
11231 -133374 -98988 -92153 -87921 -78587 -11059 -20322 37755 146641 167892 179196 188061 152351
11219A52351k5395O2067K6140j2456m9928l6250K2114j07202L6274L5086P706
11208A10507k4800o787q4380L5749R3696l2633q4430k8679R1372L3608q6785K1086
11196C7524p8049q7034P3880Q4929l0709L9584j4312l4408l8289j6913M7857J03510
11184H7570r7400q1602M5388J31406K9797J4601K7347q6795p7957P1886O2848
11173A27089R1347o1602j02653k4609K1871L4629O0677m2233j04132M2586o7368
11162b4398p3795K7385M2728M6965J59933M3237j15096o7668m474k4295l2067
11151b1545k1235n2644q113J8867m1732j8689J01083J55409O574n3414N6718l5936
11139H5343o0374q4741P4851J9004l1181j9535k7850o1631K3038O9351K0687J01625
$$ plain form
11219 152351 126956 189023 215163 202707 152779 116529 138643 31441 67715 102801 110507
11208 110507 85707 78920 -5460 30289 123985 91352 6922 -21757 69615 103223 16438 37524
11196 37524 -40525 -127559 -53679 31250 541 40125 25813 -8595 -46884 -63797 -15940 87570
11184 87570 -9830 -91432 -46044 85362 115159 129760 157107 70312 -7645 64241 127089
11173 127089 218436 156834 54181 29572 51443 86072 146749 104516 384 42970 -24398
11162 -24398 -98193 -70808 -28080 18885 178818 222055 106959 39291 34817 10522 -21545
11151 -21545 -42780 -95424 -103537 -84670 -126402 -145091 -44008 111401 117975 64561 121279 85343
11139 85343 24969 -59772 15079 34083 2902 -16633 -44483 -106114 -83076 -13725 6962 108587
11127A08587j8222J5265O0492n5449l3686P8401M7277q1128J1037l005p79o8248
11115F0542L6369L6862q8738M0857R5266q1591j43427L6493M4142L5312j6557
11104E5530n1383l7572k4057O3796O4155l2965o5965K208J8830M7740M6585l5659
11092E1243j4132r1572L6549J35752L4639p9791K1116j6348q478l1477j10670
11081g3169M7124M6522O7176k4438q0375L4547M201j21570q520K7663P092N2392
11069b1355l5888K2530Q2142J15230k3123q6358K7311Q6284o02o8487o370j12152
11057b0838q6702M822L2972Q6823M6277N404l9140k7029R0501Q714n2700L4049
11045H3153o8089p4157l5130L3701P8526N1509K3457K9490j11038O3593J8990
$$ plain form
11127 108587 90365 105630 166122 110673 76987 155388 202665 121537 132574 129569 128790 60542
11115 60542 96911 133773 45035 85892 181158 99567 -43860 -7367 36775 72087 55530
11104 55530 4147 -33425 -57482 6314 70469 37504 -28461 -26253 -7423 40317 86902 51243
11092 51243 37111 -54461 -17912 117840 152479 72688 93804 77456 68978 37501 -73169
11081 -73169 -26045 20477 87653 63215 -17160 17387 21588 -99982 -108502 -80839 -73747 -21355
11069 -21355 -57243 -34713 47429 162659 139536 53178 80489 166773 166171 97684 91314 -20838
11057 -20838 -107540 -102718 -69746 17077 63354 68758 29618 2589 93090 101804 49104 83153
11045 83153 15064 -59093 -94223 -60522 18004 69513 92970 122460 11422 75015 94005
11034I4005j4664M2476J6737L4733j15791k429J69333k3282M3798m5173k2922
11023A76821r8604J4044r183M7418L20j10440n4916M1787N4551Q9285M7760q7754
11011A11089j05411Q660M8670J46789L7559o0753m9558j12959N10M566L7953N1876
10999A18991m0055L926k1221J6575P3115M3933o4381q2037M3597N4459l0502q386
10987A08014m2044k0854M4584J43264N5706l990k2340q6361N973N6191J4989j8549
10975B34583m6400n442m2198k6144o3088L9263L2478j0750J6926J2123L125K6805
10963A71281N4098j46701N3818J7198o7125M9317k002J939m9703J277O2814O518
10951A52729J23885J51619j05715m5183M6358o046k01541J1146K31497J4423O292
$$ plain form
11034 94005 79341 121817 138554 173287 57496 55067 224400 201118 244916 199743 176821
11023 176821 78217 92261 83078 130496 130816 20376 -34540 7247 61798 151083 198843 111089
11011 111089 5678 14338 63008 209797 247356 186603 137045 24086 24596 29162 67115 118991
10999 118991 78936 82862 61641 78216 151331 195264 130883 48846 92443 146902 116400 108014
10987 108014 65970 45116 89700 232964 288670 284680 262340 175979 181952 238143 253132 234583
10975 234583 188183 182741 140543 114399 51311 90574 123052 112302 129228 141351 144476 171281
10963 171281 225379 78678 132496 149694 82569 131886 129884 131823 82120 83397 146211 152729
10951 152729 276614 428233 322518 277335 323693 317647 116106 127252 358749 373172 379464
10940C79464j2237J2497N8819R1359M685L4514O2037L42588M21202L30169J92194
10929A917291L53438M08394K45573j0572k33471l28315k06624k46483m07068l61864
10919A130299l14110j59244j41767j25159k5006O125K8440r239k1083o2151n4721
10908B52384j616q6651J4973Q7849N5986J20109O9044j40413j19610j05416l9811
10897A06828K6366M5623L425m5280Q5783n9600q2222N4746j00604l019J48190
10886A80236n6844j0594O8162J3666j6679n2281p8931m3196q2404M6903O9565
10875C7603J00410M0022P5616j5317P7782j7819q7322J7943J9733m4853k8764
10864A75034M8552K6882L7283Q360m016r483K3188j0275R93J8488R9263j3712
$$ plain form
10940 379464 367227 379724 438543 529902 534587 569101 631138 973726 1394928 1725097 1917291
10929 1917291 2270729 2679123 2924696 2914124 2680653 2352338 2145714 1899231 1492163 1130299
10919 1130299 816189 656945 515178 390019 365013 371138 399578 390339 369256 307105 252384
10908 252384 250768 164117 179090 266939 322925 443034 512078 371665 252055 146639 106828
10897 106828 133194 178817 182242 136962 222745 163145 80923 135669 35065 32046 180236
10886 180236 123392 112798 180960 194626 177947 125666 46735 3539 -78865 -31962 37603
10875 37603 138013 178035 253651 238334 316116 298297 210975 228918 248651 203798 175034
10864 175034 223586 250468 287751 296111 292095 282612 305800 295525 296518 315006 414269 400557
10852D00557j02389o274N9625L1219j14782l5346j36439j23312m8850M1607R5565
10841F1181K9138O7767j870P038J5998j788n905J5189P5528l5788q0646o1995
10829H3847K882M8297o0518j16240j8304M2317L0228M2220J01955M5203Q255j27448
10817H2694M1670K1852J1589m8567j19118Q6817L1360L6527M5080j2520k0242
10806A57142j9424m9752o3929N1610J7568n640k0010L4281J66097q4540o4006
10795A19397K7351k218R921k329M0144l4344k0668N7905j8658r6098P945J41233
10783B29581M0675N513M6432J33968O6484M9730J7174q806o8594K1293j3122o2260
10771D58068q8493Q633q4091q6151O6006o2001o4616j5550Q5659k06j12743J069
$$ plain form
10852 400557 298168 291894 351519 382738 267956 232610 96171 -27141 -75991 -34384 61181
10841 61181 90319 158086 156216 163254 179252 177464 171559 186748 262276 226488 145842 83847
10829 83847 86729 135026 74508 -41732 -60036 -17719 12509 54729 156684 201887 210142 82694
10817 82694 124364 146216 157805 109238 -9880 76937 108297 144824 189904 177384 157142
10806 157142 137718 87966 24037 75647 93215 87575 67565 101846 267943 183403 119397
10795 119397 146748 144530 154451 152122 192266 157922 137254 195159 176501 80403 88348 229581
10783 229581 270256 275769 322201 456169 522653 572383 589557 580751 512157 533450 520328 458068
10771 458068 369575 378208 294117 207966 273972 211971 147355 131805 217464 217258 104515 105584
10759A05584N2338O5815O5707q54L2241L9736m288p4121j22496N5776k446q8737
10747A24255r676L2959J7284k7022J2174M4477N1077m1950l7890j01793L6174
10736A00069K3413l8244Q076J42406O9012M8909m223N8412J14263J41865R6971
10725G60929P8722J44247Q6166J38976N5198q460o4298p5175K2349J71990K35765
10714A546409L21021M75367P90835J014639R27184O6577n77760p67106p16680
10705C080486m99955k83493j35561q1234j3272O9777R8161K60428N70873R08948
10695C975158J364251J536573O69131o38220j288956j297582j104302p37285n12555
10686A966213l99096l18764o6821j74852n4230m6722p5841p391m7947l7988o3528
$$ plain form
10759 105584 157922 223737 289444 288590 320831 360567 356279 282158 159662 215438 212992 124255
10747 124255 114579 147538 164822 137800 149974 194451 245528 203578 165688 63895 100069
10736 100069 123482 85238 93314 235720 304732 353641 349418 407830 522093 663958 760929
10725 760929 839651 983898 1070064 1209040 1264238 1255778 1191480 1116305 1138654 1310644 1546409
10714 1546409 1867430 2342797 3133632 4148271 5075455 5142032 4564272 3797166 3080486
10705 3080486 2580531 2297038 2161477 2080243 2066971 2136748 2234909 2495337 3066210 3975158
10695 3975158 5339409 6875982 7545113 6906893 5617937 4320355 3216053 2478768 1966213
10686 1966213 1567117 1248353 1181532 1006680 952450 905728 829887 822496 774549 736561 673033
10675F73033o2492m9617q1191p2559k2300O2592j6141J8789k6746j0273j9562
10664C93533L0547N7141N4345L6745K1779N4544J4366N6676M6993l1338J32272
10653H67603J2634r2328p1654J3657L0333k8050j08977J41258M6897k5905j63354
10642F22114j4956l1723l3699n27Q5J155n1230l1027O1479l2180L446Q9557M7699
10629F30193J6726n9425j55771q792M9057n284o6658k1482r1194Q786J89550R3267
10617E78973O4678Q5798o21P3835Q6150K5301J8217M3238j6701J0043J6212J3671
10605I98794r3342p1649J23908J35414R0209R8041O3042J10151L9426K0093L8507
10594A552594R6681J64112L02184L78936N22169N76138K73110L6500l2085O9915
$$ plain form
10675 673033 610541 560924 479733 407174 384874 447466 431325 450114 423368 413095 393533
10664 393533 424080 481221 535566 572311 594090 648634 663000 719676 766669 735331 867603
10653 867603 880237 787909 716255 729912 760245 732195 623218 764476 811373 785468 622114
10642 622114 607158 575435 541736 541209 541294 542449 491219 460192 521671 489491 492937 582494 630193
10629 630193 646919 587494 431723 422931 471988 466704 400046 378564 287370 296156 485706 578973
10617 578973 643651 729449 728828 802663 888813 914114 932331 975569 958868 968911 985123 998794
10605 998794 905452 833803 957711 1093125 1183334 1281375 1344417 1454568 1493994 1514087 1552594
10594 1552594 1649275 1813387 2115571 2494507 3016676 3592814 3865924 3902424 3870339 3940254
10584C940254J29847j77220m45077l32039k73886l13838j60514L240L4623Q9442
10574B494832n1739o7695m5458j0739J81045J75274R6524J93830L36666K34009
10564C536549R8722J04512K81817M01406M26585M25662M63700N05805N35776M47732
10554G228266O27401P03813Q00703J078788J367060J723675K038028K205112K532681
10545B0305527K916061K956015K838578K920752K917692K995650L440262L864687
10537D5155224M342660N364246P256355J0119578J4172579K0577709L1337285
10530A38325636M8941055P0630553O8977716L5290561K9926627N4258461O0288868
10523E06639477L605293n2380281n5208995l5157675m0075838o5547841o7458233
$$ plain form
10584 3940254 4070101 3892881 3447804 3115765 2841879 2528041 2367527 2370767 2405390 2494832
10574 2494832 2443093 2375398 2329940 2319201 2500246 2675520 2772044 2965874 3302540 3536549
10564 3536549 3635271 3739783 4021600 4423006 4849591 5275253 5738953 6244758 6780534 7228266
10554 7228266 7855667 8559480 9360183 10438971 11806031 13529706 15567734 17772846 20305527
10545 20305527 23221588 26177603 29016181 31936933 34854625 37850275 41290537 45155224
10537 45155224 49497884 54862130 62118485 72238063 86410642 106988351 138325636
10530 138325636 187266691 257897244 326874960 362165521 392092148 446350609 506639477
10523 506639477 510244770 457864489 402655494 367497819 327421981 261874140 194415907
10516A94415907n6922718l9895165k4988851j5808285j0577352p268302n385626
10509C3569608m505078l686201k823753k373476k111898j679610j310776j260969
10501A3817847j279884j213913r97276q82159r72668j114160r49136o91863n98325
10492E118463m15220l11661l43697k33327q8017j4389j72287r2004J32126J54877
10482C734864J48440R6138J11276J24615J49315J59537J88421n9983k01429j23060
10472D328134j27794j21067n4404L603R4689J12405J95436M92131P60415O70386
10462F353934N64258O67590O68168M16852k04083l50402l29548l08805m30617
10453G047347k42897k13709j83329k17244m1686L53826M19708j91312m73447m10156
$$ plain form
10516 194415907 137493189 97598024 72609173 56800888 46223536 38955234 33569608
10509 33569608 29064530 25378329 22554576 20181100 18069202 16389592 15078816 13817847
10501 13817847 12537963 11324050 10326774 9444615 8471947 7357787 6408651 5716788 5118463
10492 5118463 4703243 4391582 4047885 3814558 3726541 3712152 3539865 3447861 3579987 3734864
10482 3734864 3883304 3979442 4090718 4215333 4364648 4524185 4712606 4652623 4451194 4328134
10472 4328134 4200340 4079273 4024869 4028472 4123161 4235566 4431002 4923133 5683548 6353934
10462 6353934 6918192 7585782 8253950 8670802 8466719 8116317 7786769 7477964 7047347
10453 7047347 6804450 6590741 6407412 6190168 6148482 6502308 6922016 6730704 6257257 5847101
10443E847101m45694o04349n33744n05184n40982m56051m39082k90181k53156
10434A778678j49092j84890j27765m0363p4256r8469n1270o1625m4084n2158p793
10423H86913P8167k881O8633l0478r7634R8982q8001j32303q4491K3118O2474
10412G82499j45279j38191j07231N1536o0702K9073R1237J13895p0420k9218l9586
10401D77613j54443r4924l0344J8532K8848Q4903Q9404M7404q266O7155P7528
10390F03410J57257J20592k4316J06071J28507j5278N9784R1670N9349k2162l5332
10379A229552l8993j85493j15210m9181N3339Q3582r8891m825K44278L28804L34606
10368A781568N01387O33517O40005L26723J5023k5775Q6208N7011m31125p26547
$$ plain form
10443 5847101 5401407 4797058 4263314 3758130 3217148 2761097 2322015 2031834 1778678
10434 1778678 1629586 1444696 1316931 1276568 1202312 1103843 1052573 990948 946864 894706 886913
10423 886913 965080 962199 1030832 1000354 902720 1001702 913701 781398 696907 720025 782499
10412 782499 637220 499029 391798 443334 382632 411705 502942 616837 546417 517199 477613
10401 477613 323170 228246 197902 216434 245282 330185 419589 466993 458727 525882 603410
10390 603410 760667 881259 856943 963014 1091521 1076243 1136027 1227697 1287046 1264884 1229552
10379 1229552 1190559 1005066 889856 840675 894014 977596 878705 873880 1118158 1446962 1781568
10368 1781568 2282955 2916472 3556477 3883200 3898223 3872448 3958656 4015667 3584542 2857995
10358B857995p32889o04315m10382k47387j95394j12238N584q1897l1922Q6889
10348E34044O1412j2781o8849j9626O0106O6429p8249N3954J5794O8329Q9651
10337G70214R7174Q4904R4305L4205p9214k7508K2271m6146j06499j06475l1680
10326G05551j00028r3674r2547j16745j63181J9187K8072k7474N8960N5824m2563
10315B31382L477m2296O1290P4337l5066j8301q0132J0L4215L8342k0683q76O0902
10302C06601L3599m601p2347j9825m2780N0822r4064j04699o7407n0472k1155
10291h6328R1967n524j2839K1984P51n0519R4793O1133K3171N4160o1301k3042
10279A08406R4867j8411j42082Q6063J18626J2248j25378p1416l7931L2332O7173
$$ plain form
10358 2857995 2125106 1520791 1110409 863022 667628 555390 560974 479077 447155 534044
10348 534044 595456 582675 513826 494200 554306 620735 542486 596440 612234 680563 770214
10337 770214 867388 952292 1046597 1080802 1001588 974080 996351 950205 843706 737231 705551
10326 705551 605523 511849 419302 302557 139376 158563 186635 159161 218121 273945 231382
10315 231382 234859 192563 253853 328190 293124 274823 194691 194701 228916 267258 246575 245699 306601
10302 306601 340200 335599 263252 243427 200647 251469 157405 52706 -14701 -65173 -86328
10291 -86328 5639 115 -12724 9260 10011 -40508 54285 115418 138589 192749 131448 108406
10279 108406 203273 184862 42780 128843 247469 259717 134339 62923 24992 57324 124497
10268A24497L2013Q9700j1119m7545K6022n9066j70432n571J19170M4827q3173
10257E9323l0686p8644k9036P9168o3698m2113R6124J22684o41p1j6158J1153
10245A07405L5937Q025l9058j36191r105J474J4711J92923Q7784q0226n4921M7361
10233A76119Q7325J5050j7056r8610n7841k2549L4571J3740p3431m2513M6744
10222F1549J19976K5575p7927n6839L2516r595j30169N2005M0967l1457J2974
10211C9575r661L5289L1289k4209j5879P792k1264Q9656M0394j3713K0468O5890
10199B45627j5736j06196j04234L6708o1336j869J8555K6218J18978j09776r0671
10188d3732J5635r5198n3343l4352O1952L9702N8331k8643J9054p8162K4947J53562
$$ plain form
10268 124497 156510 246210 235091 187546 213568 154502 -15930 -21501 97669 142496 59323
10257 59323 28637 -50007 -79043 125 -63573 -105686 -9562 113122 112481 112410 96252 107405
10245 107405 143342 151367 112309 -23882 -32987 -31513 -16802 176121 263905 183679 128758 176119
10233 176119 263444 278494 261438 162828 104987 82438 117009 130749 57318 14805 61549
10222 61549 181525 207100 129173 72334 104850 95255 -34914 17091 58058 26601 39575
10211 39575 29914 65203 96492 72283 56404 64196 42932 132588 172982 159269 179737 245627
10199 245627 229891 123695 19461 56169 -5167 -7036 11519 37737 156715 46939 -43732
10188 -43732 -28097 -123295 -176638 -210990 -149038 -109336 -51005 -79648 -60594 -138756 -113809 39753
10176C9753P1881n7686l8255Q4448j0488J8622m4527m2365L6018j891K3839j20893
10164d1544p8974R005J21706N7819O0750L1023L2040q1928J3682j6383n8289J8872
10152F7779l739O6199m4489j19017m374l758r371N2944J13924M9256n3855J48
10140A11647R9198n2695r0161O4184M6591N6642J5174r2444m7669J03465P189
10129B21121j01432M3920P4813J11624j9096N8727J52570J91220L67728M04536
10119A505731K76737K06593J84888K66982K48271l6036k59525k75130j86197k27608
10109A704706l57285k86225k39014k63530m0937p1867n4420k9147j06624p4258
10099A81399M1175J0472o3841n1375J2512J31532j0581o0872q1115j09596j39502
$$ plain form
10176 39753 111634 53948 15693 100141 89653 108275 63748 21383 57401 55510 79349 -41544
10164 -41544 -120518 -111513 10193 68012 128762 159785 191825 109897 123579 107196 48907 67779
10152 67779 64040 130239 85750 -33267 -37641 -41399 -50770 2174 116098 165354 111499 111647
10140 111647 210845 158150 67989 132173 178764 235406 250580 158136 110467 213932 221121
10129 221121 119689 163609 238422 350046 330950 389677 542247 733467 1101195 1505731
10119 1505731 1782468 1989061 2173949 2440931 2689202 2653166 2393641 2118511 1932314 1704706
10109 1704706 1347421 1061196 822182 558652 517715 445848 391428 362281 255657 181399
10099 181399 222574 233046 169205 117830 130342 261874 251293 190421 109306 -290 -139792
10088a39792L3568J49919M4829m0751k0064O8343k1822j5436J2175k721J1059
10077G9307m6140P6064R253L8097j03400p0120J4359J9124j7077O0098J17177
10066A76742J193j11683m3926o3820o1796l9060l428Q621l950J08475M9342K6550
10054D3260J16576M2071M6155L9008K6139j33897n1931m7845J3091r2195K5652
10043B6084K9567p0002j05710m4577N6360K25748r354q647L082k2246m3556o8657
10031c1908o2452O520K4352P2060Q7671q877k57357r5868J37150O7290N3734M5735
10019C8050P1145l614L2019J2567r4084m8037l203k3960J5220J03385N8083q412
10007A49159o1642q9391o8699L5027k3997J9513N4407N3690l356r1219l755L1399
$$ plain form
10088 -139792 -106224 43695 88524 47773 27709 96052 74230 58794 70969 68248 79307
10077 79307 33167 109231 118484 156581 53181 -16939 -2580 16544 -533 59565 176742
10066 176742 177935 66252 22326 -41494 -103290 -142350 -145778 -137157 -141107 -32632 16710 43260
10054 43260 159836 201907 248062 287070 313209 179312 127381 79536 92627 432 26084
10043 26084 55651 -14351 -120061 -164638 -108278 117470 108116 99469 102551 80305 36749 -31908
10031 -31908 -94360 -87840 -63488 8572 96243 87366 -169991 -265859 -128709 -61419 -7685 38050
10019 38050 109195 105581 137600 150167 56083 8046 4843 -19117 -3897 99488 157571 149159
10007 149159 87517 -1874 -70573 -35546 -59543 -40030 14377 68067 64711 -26508 -30263 1136
9995A136O6401P9938M2954m7088n7498p1669N2419l2854n0952p7518r3521R6650
9983i1602R2497J16305m157j1535m718J0480L4398L2495J4685n8574p1178q4242
9971b5146O7845m9908p6452Q7249M5733p7513J9986J2919Q3633M1899q291J7782
9959A39736l7093m0330o3057l1590j9327J1864R4054L470j17008K1793M2708K2443
9947B7663r7498n5412m523K8508l134o8048O4045O6816k6288J48892J41849l9346
9935A83524j64546o0588K2825J01236R2484n5390J4128q815r0107M7086J7124
9924I8961r9146r2343O5696N0701O5164O0076p9413q7514n0410K9772j37984J1551
9912a64889L4189j5575l4094J6604Q9479J10517O3985P4079n4414m3888k8819
$$ plain form
9995 1136 67537 147475 190429 143341 85843 14174 66593 33739 -17213 -94731 -188252 -91602
9983 -91602 895 117200 113043 101508 96790 107270 141668 174163 188848 130274 59096 -25146
9971 -25146 42699 -7209 -83661 3588 49321 -28192 -8206 4713 88346 130245 121954 139736
9959 139736 102643 62313 -744 -32334 -51661 -39797 54257 57727 -59281 -37488 5220 27663
9947 27663 -69835 -125247 -129770 -101262 -104396 -172444 -108399 -41583 -67871 81021 222870 183524
9935 183524 18978 -41610 -18785 82451 174935 119545 133673 124858 34751 81837 98961
9924 98961 -185 -92528 -26832 23869 89033 149109 69696 -17818 -68228 -38456 -176440 -164889
9912 -164889 -130700 -146275 -180369 -163765 -74286 36231 100216 174295 119881 75993 47174
9901D7174K4429O7640p4446L9995j819J28926K4952r7837q150L8662k2719m9167
9889A17640q5186r2655M3210N6689j8974L8900J22760M9406k1353j34982p5932
9878d77o0955R880P3765R3239M8863J4376j3126q408m0232O3678n6806j5418K9008
9865A37387p4968k8037l8787M7059m5512l5789N3080R1719M5205K1124k1048R10
9853A52343k2858J36031K60332J29481O3563o9690k53132k06722m2303n3164l0463
9842F3418L5371J0337j23133n5648M6279L6714N7093m6263m9235k6989L4265m604
9830b2395K3623m778l8394k0528P3439K5076l80J26990O2568q3496o4065r6888
9818a9228M3266Q7632N2783L6769m3355n6972p7052M6095p9316p9514j6308l3452
$$ plain form
9901 47174 71603 139243 64797 104792 102973 231899 256851 159014 150864 189526 166807 117640
9889 117640 32454 -60201 -16991 39698 20724 59624 182384 231790 210437 75455 -477
9878 -477 -61432 -51552 22213 115452 164315 178691 165565 157157 116925 180603 123797 108379 137387
9865 137387 62419 34382 -4405 42654 -2858 -38647 14433 106152 151357 172481 151433 152343
9853 152343 129485 265516 525848 655329 718892 649202 396070 189348 147045 93881 63418
9842 63418 98789 109126 -14007 -69655 -23376 13338 70431 24168 -25067 -52056 -17791 -22395
9830 -22395 1228 -3550 -41944 -62472 10967 36043 35663 162653 225221 141725 77660 -19228
9818 -19228 24038 111670 164453 201222 157867 100895 23843 69938 -9378 -88892 -105200 -138652
9806a38652M7833N5027k598O132j1324p6343r5323M3529J40531J03048K8474L4278
9794A34612j9899j19426j07357n7064L2313J0429L9999l706m220p494K3531M2790
9782c5492n297j5609k479K6390q969N309J8856J2336J2482J9002O149r3801k7904
9769h9027n6473q9534n6724J13267O5667n8473o3942o946K8253J37318N5074l5443
9757e6983l3357P1208k7255j7432j3501o441L2126j8333n0638L5828Q9023J54963
9745A59208J7461l3588j38052n6420J58359J69854L5637J0023m048K1568p5657
9734B64345K63p22j01617p0594p8827M017J6069m6153j47937p3581M960l1074
9722b60851L1251J44871J00269l2122q9913J5656K3408P8852J03888J16769k1229
$$ plain form
9806 -138652 -90819 -35792 -38390 -32258 -43582 -119925 -215248 -171719 -31188 71860 100334 134612
9794 134612 114713 -4713 -112070 -169134 -136821 -126392 -86393 -90099 -94319 -101813 -78282 -35492
9782 -35492 -40789 -56398 -58877 -32487 -41456 -36147 -17291 -4955 7527 26529 32678 -61123 -89027
9769 -89027 -145500 -235034 -291758 -178491 -112824 -171297 -235239 -242185 -213932 -76614 -21540 -56983
9757 -56983 -90340 -19132 -46387 -63819 -77320 -83761 -51635 -69968 -120606 -84778 4245 159208
9745 159208 176669 143081 5029 -51391 106968 276822 312459 322482 318434 340002 264345
9734 264345 264608 263886 162269 91675 12848 16865 32934 -13219 -161156 -234737 -229777 -260851
9722 -260851 -229600 -84729 15540 -16582 -106495 -90839 -67431 11421 115309 232078 210849
9711B10849q6757l9925L0162m5157o2509n1639J732n4730K0410P0882P3503Q4557
9699A51378o5755K5617l9256n5416n1386J50j3175N5290J06718r751Q7370N5625
9687B47409m3919k7805J3341J02628K6672j14857l9239l7749J739K1135M3392
9676A92747O367k8011K476j5753l6898l0034m7394O2446M9370q7437k6429L6014
9664G7464O6290n9102l3316l5378J22423J8870o5960N2801J5752O1131j0889M4842
9652B54928o6156m4602n9581k6887N1337M3301k0468o2091k2918j431N7217q7685
9640A4964j3052N1499N0412k3562j428N5841K4958o3697p7435J4572K644P969
9628D3685l7136j9931k0499l628P5998K8275K6143j26968k9086J20063J17469
$$ plain form
9711 210849 124092 84167 114329 69172 6663 -44976 -43244 -97974 -77564 -6682 66821 151378
9699 151378 85623 111240 71984 16568 -34818 -34668 -47843 7447 114165 104414 191784 247409
9687 247409 203490 175685 189026 291654 318326 203469 164230 126481 128220 149355 192747
9676 192747 199114 171103 173579 157826 120928 90894 43500 105946 155316 67879 41450 77464
9664 77464 143754 84652 51336 15958 138381 157251 91291 144092 159844 220975 210086 254928
9652 254928 188772 144170 84589 57702 109039 152340 131872 69781 46863 45432 102649 14964
9640 14964 1912 53411 103823 80261 78833 134674 159632 95935 18500 33072 35716 43685
9628 43685 6549 -13382 -33881 -37509 38489 66764 92907 -34061 -63147 56916 174385
9617A74385J7799k8437j05831n409J0811L4809o8676m9527n3375n028j888J52639
9605G2272O4549J939l4784p543r578l6345j07823m1291K8932P5673R0787l0743
9593F6045J6206Q5387n5561q2791q7511N4038m8555M5613O2243l2630M0908N1911
9581A15303j62797q9661P5695O7866O2003k4577l8291N3965j7861m9584M5476
9570C7537J18549M7396m0505P945m5258l8292o9467N76l548k3141m67L811K1716
9557A6852N8872O354j5260J0212l7716O0431n2925M9217J17327m0078j20257p0748
9545a7719R8156J12814J4118r609r4649j09064O1816L717k7972l201K2670O8402
9533A19479N9823m9711J1088k1230M7257m7124L9122M5225K2876K1327j0292n312
$$ plain form
9617 174385 192184 163747 57916 52507 63318 98127 29451 -20076 -73451 -78479 -80367 72272
9605 72272 136821 138760 103976 96433 86855 50510 -57313 -98604 -69672 6001 96788 66045
9593 66045 82251 167638 112077 29286 -58225 -4187 -52742 -7129 55114 22484 63392 115303
9581 115303 -47494 -137155 -61460 6406 68409 43832 5541 59506 41645 -7939 37537
9570 37537 156086 203482 162977 170922 125664 87372 17905 18481 14933 -8208 -8675 -4864 16852
9557 16852 75724 82078 66818 77030 39314 99745 46820 96037 213364 173286 53029 -17719
9545 -17719 80437 193251 207369 197760 103111 -5953 55863 59580 31608 28407 51077 119479
9533 119479 179302 129591 140679 119449 166706 119582 158704 203929 226805 248132 237840 232528
9521B32528j6804q3255q7542m2291P8799K3737n4372M1838L6371L7385j0694l3405
9509A22295q443o578J3393J04023N9928P4332j26567n8194J0420p2653o1664N8761
9497A09053R933q261O8898j13387r0353o3128R9893J10916m7200l3485K1012L3561
9485I7452m7546p3241P6447Q9731k4343n431O6637j09241r2171J5100N0640Q2455
9473A26489j2771j09802P4466O1795j6818j13115o5628J9994P6881J10018L9843
9462A91352K5961j05922j2907M2210n4695P1965n4416l1271L5528J2122p6989
9451D2938j73216r769J12378O5845J6438O7390j9j1707p6468m6613M4895j4630
9439A7462J42835k8763m8587n5721O4140R3983n1316o2464q4357J1786Q6531Q3839
$$ plain form
9521 232528 215724 132469 44927 2636 81435 105172 50800 92638 129009 166394 155700 122295
9509 122295 113852 107274 120667 224690 284618 358950 232383 174189 184609 111956 50292 109053
9497 109053 118986 110725 179623 66236 -24117 -87245 12648 123564 76364 42879 63891 97452
9485 97452 49906 -23335 53112 142843 118500 113069 179706 70465 -21706 -6606 44034 126489
9473 126489 113718 3916 78382 140177 123359 10244 -55384 -35390 41491 151509 191352
9462 191352 217313 111391 98484 140694 85999 157964 103548 72277 107805 119927 42938
9451 42938 -130278 -140047 -27669 38176 54614 122004 121985 110278 33810 -12803 32092 17462
9439 17462 160297 131534 82947 27226 91366 185349 134033 71569 -12788 -1002 85529 169368
9427A69368j393O3185J8668p2125j06646N4548J1856L5946m1110l0862M4050n250
9415A40235m641J2395K997O6386j6506l9392O9523j2111K9266L1487q8807o3953
9403A26879P760p6835m002J9174J17979N222m0772J06766l0912k7561j1035K6755
9391B19418k1307n9813k11760n7248J33168J08385J62438m7346q1764p0842K2421
9380I5750K3587o6530L1495J10218l7569P0662Q3080j8002R6159N1436l2422N7678
9368D65542K3177p7269j91713p1027P6576m3330Q9424R8479p0369j24018j156
9357A74316l8702l9378K7498O5264M7110k3710M7015n9365n992P8328K4483k7427
9345B69440j60347n795k498l1119M1929J28189n5531K4803o292m032j9934j06063
$$ plain form
9427 169368 167975 231160 249828 177703 71057 125605 137461 173407 132297 101435 145485 140235
9415 140235 135594 147989 150986 217372 200866 161474 230997 218886 248152 279639 190832 126879
9403 126879 134639 57804 53802 72976 190955 196177 155405 262171 231259 203698 192663 219418
9391 219418 198111 138298 -73462 -130710 2458 110843 273281 225935 144171 73329 95750
9380 95750 119337 52807 84302 194520 156951 227613 310693 292691 388850 440286 407864 465542
9368 465542 488719 411450 219737 148710 225286 181956 271380 369859 299490 175472 174316
9357 174316 135614 96236 123734 188998 236108 212398 259413 200048 194056 272384 296867 269440
9345 269440 109093 103298 100800 69681 111610 239799 184268 209071 202779 198747 178813 72750
9333G2750K1855L4036O6796N1076q996r6212k3611P9618J30098j0540m0002p7805
9321A99063O6662L8409K3570n206L5997j2590p8477N6367j9950k1916R555k4182
9309B67302o3721J6773m6156M0753j3625j02916P6203J14203M8273l0131n792
9298C01166m2790j00740j88050m1613P8478N5569q2865J8066J13580n556o9577
9287C5668R8721N6154q1047l3427J8569m329l514P4480M0423J1996j5912p3500
9275A24282j5148j3826k9005Q9928J38986j27346K0549R6267n272l1218k0298
9264B27899m4990k369K5910k3167q986o0473k0205K3481k5935K8319J02129L3992
9252B55605M3133K4624j27969L4180O0546p5371J12326R0597l3173j07669p9134
$$ plain form
9333 72750 94605 128641 195437 246513 237517 141305 117694 197312 327410 316870 276868 199063
9321 199063 265725 304134 327704 322498 358495 345905 267428 323795 303845 281929 291484 267302
9309 267302 203581 220354 174198 214951 201326 98410 174613 288816 337089 306958 301166
9298 301166 258376 157636 -30414 -72027 6451 62020 -20845 -2779 110801 105245 35668
9287 35668 134389 190543 109496 76069 94638 90309 86795 161275 201698 213694 197782 124282
9275 124282 109134 95308 66303 156231 295217 167871 188420 284687 279415 248197 227899
9264 227899 182909 180540 206450 183283 174297 113824 93619 117100 91165 119484 221613 255605
9252 255605 298738 323362 195393 229573 290119 214748 327074 417671 384498 276829 197695
9241A97695l423O2912N080J0391L7453P5138l5930m2739q831J9918m1697j13915
9229A62052m5906j5759J09684O3365j1853l7913M495O6693J44303K687r8980k0334
9217C22534M987P4950j8835k5779L3076r643j2262q3740n8440P9454R7244l3850
9205C69696k6538m3945p1020r276J10597r7281n0304R0763Q5020O2739k8486J5751
9193D07716J43441J24927p2081j79485J2571N8138J8976M988L3028o3202j1912
9182D77105l7765r4405q4620M0325J46781Q0105o1319n0881Q8621J28029J17493
9171G49469l0114L0562J8205M4868J02504n6480J8478J3978k3851q726J10016
9160I68909n0903p3625O0620j8630M5333J16025R3561J61532M167o3719J10784
$$ plain form
9241 197695 194272 257184 262264 272655 310108 385246 349316 306577 297746 317664 275967 162052
9229 162052 116146 100387 210071 273436 261583 223670 228165 294858 439161 441848 342868 322534
9217 322534 327521 402471 383636 357857 390933 381290 369028 285288 226848 306302 403546 369696
9205 369696 343158 299213 228193 218917 329514 232233 181929 272692 357712 420451 391965 407716
9193 407716 551157 676084 604003 424518 437089 495227 514203 519191 552219 489017 477105
9182 477105 439340 344935 260315 300640 447421 527526 466207 415326 503947 631976 749469
9171 749469 719355 749917 768122 812990 915494 859014 877492 891470 867619 858893 968909
9160 968909 918006 844381 905001 886371 931704 1047729 1141290 1302822 1306989 1243270 1354054
9149A354054J04499J35852J96926K30659J30913K4984J02185J51058K45507K52708
9139B929345L09733L64361L89141N37012M97083M87728M96526O45179R18737J044333
9129H619178J176020J630285K090520K652784L304963M103799M746988M723342
9121C3047879L685893J324096j610981l864972n039497m965915m293058l459787
9113A4823658k630869k114289j640708j312936r30199p67636o81462o12829m65598
9104C667132l62494k50266l08744l78647k47236l4812j02906j48520j10337j49583
9094A573587r9541j05086p3856J1110P2993L5422K3045o4075j27391j14447K0645
9083A152406n1835j20471j2954n031n6424j14261P6826O5340j06833j44891j4039
$$ plain form
9149 1354054 1458553 1594405 1791331 2021990 2152903 2177887 2280072 2431130 2676637 2929345
9139 2929345 3239078 3603439 3992580 4529592 5026675 5514403 6010929 6656108 7574845 8619178
9129 8619178 9795198 11425483 13516003 16168787 19473750 23577549 28324537 33047879
9121 33047879 36733772 38057868 36446887 32581915 27542418 22576503 18283445 14823658
9113 14823658 12192789 10078500 8437792 7124856 6194657 5427021 4745559 4132730 3667132
9104 3667132 3304638 3054372 2745628 2366981 2119745 2084933 1982027 1833507 1723170 1573587
9094 1573587 1474046 1368960 1295104 1306214 1379207 1414629 1437674 1373599 1246208 1131761 1152406
9083 1152406 1100571 980100 967146 962115 905691 791430 868256 933596 826763 681872 667833
9072F67833n3319p5910r2074K1092Q1100O9017k0857K6492r5814o943m0860O6327
9060E46084J8558L6696N150J32073O1633l4340j56431j58325J9834m4531p5089
9049C51312J05307J5673n5876n353J9746M8525L120J1866J601M3518K0463q425
9037E51477m3934M751J07127O0834j07096r4661m6832r3803O0002J02387l9604
9026D60648j03198n6875k0581O7515J46330K3541p6361o5571j01012K7188M0607
9015C42231k6848l7723Q5787P0616m2683l0695q2634o69P3884k0827N1350O1831
9003D43620O4188J6658k3496j32692N606O0602l995m0299O1195k0894k1627n711
8991D03155r0588M6198J17942l0254J3783q9127k8735N2532q1912r5720m0131
$$ plain form
9072 667833 614514 538604 446530 467622 548722 617739 596882 623374 527560 520617 479757 546084
9060 546084 564642 601338 606488 738561 800194 765854 609423 451098 470932 426401 351312
9049 351312 456619 472292 416416 411063 430809 479334 482454 494320 495921 539439 559902 551477
9037 551477 507543 512294 619421 680255 573159 478498 431666 337863 397865 500252 460648
9026 460648 357450 300575 279994 347509 493839 517380 441019 375448 274436 301624 342231
9015 342231 315383 277660 363447 434063 391380 360685 278051 277382 351266 330439 381789 443620
9003 443620 507808 524466 500970 368278 373884 434486 430491 390192 451387 430493 408866 403155
8991 403155 312567 358765 476707 446453 460236 371109 342374 394906 312994 217274 177143
8980A77143n1300N1444J7773N0544J1884l0949J0217L5265k230P0202o5890l6997
8968B37106j3795M2167Q9778L1984k0874K9786M7401n5292j09992j3890L3054
8957B97433j5151o364m7082J05643N3849n0585Q600L3694j03825n9056R5110R0699
8945D02965L0338k1752q0372O7564J28559j09914j95538p4490J21352L7908l5096
8934B71524n4437R271k3091p8772k0625N9795Q8480k940r9905r6670K5470Q8113
8922A66213R0663N8810k7551J3282L6330n2370m3347m2913j839k5050R1304k9402
8910B34130L310P8832n7690n7342J8079N4889j16064j06267l7796j6918O2237
8899E9400j6939N7858O1089M0306L4089L4040K9642J5930j2357N7264j04624p7170
$$ plain form
8980 177143 125843 177287 195060 245604 257488 226539 236756 272021 269791 339993 274103 237106
8968 237106 223311 265478 355256 387240 366366 396152 443553 388261 278269 264379 297433
8957 297433 282282 275918 228836 334479 388328 337743 346343 380037 276212 217156 312266 402965
8945 402965 433303 411551 331179 398743 527302 417388 221850 147360 268712 306620 271524
8934 271524 217087 226358 203267 124495 103870 163665 252145 249205 149300 52630 78100 166213
8922 166213 256876 315686 288135 301417 337747 285377 242030 199117 197278 172228 263532 234130
8910 234130 237440 316272 258582 201240 219319 274208 158144 51877 14081 -2837 59400
8899 59400 42461 100319 161408 201714 235803 269843 299485 315415 303058 360322 255698 178528
8887A78528N4160q7582q7421J16902J17028j0669n3415K7924l208l0142P5826
8876B97931J21391q8604J2479L8184M0442K769j7907M5116J64470K93366K12080
8865A121717L33211L30320N7250k85879l44650k58760l04254j17779q6735R4665
8855E39106n0518p1424r076j12144j06461k3056O5628j25236M601M2565J2618
8844A66603m5769o8059j352l236L5262r0998j8940J00825L7730p0954r4718P7357
8832B3751l8333j7298R5691K2605J1502l0582o4526L9291J55966J9871p8015j9936
8820A19987l5268p3685P5211m1294p2485J2938N1637J7292p1004Q2881l014L1125
8808I4321p6134l7470K0868M4534m1292J7233M0218l6061K1546q436o1345L8878
$$ plain form
8887 178528 232688 145106 57685 174587 291615 280946 227531 255455 252247 222105 297931
8876 297931 419322 330718 343197 381381 421823 424592 406685 451801 616271 909637 1121717
8865 1121717 1454928 1785248 1842498 1556619 1211969 953209 648955 531176 444441 539106
8855 539106 488588 417164 408088 295944 189483 166427 232055 106819 111420 153985 166603
8844 166603 120834 52775 51423 48187 83449 -7549 -26489 74336 112066 41112 -53606 23751
8832 23751 -14582 -31880 63811 86416 97918 67336 2810 42101 198067 217938 139923 119987
8820 119987 84719 11034 86245 44951 -27534 -14596 37041 54333 -16671 66210 63196 94321
8808 94321 18187 -19283 1585 46119 4827 22060 62278 26217 47763 39327 -22018 16860
8796A6860J10557J50872r4193o9354Q3653l4102j36950N503L6051O2501O5132
8785A96530M8948j9577O540q2779L5347k3038r1223K8586R8365j7869N0661J00067
8773C30558R3890r1652m2445n2599m7903n908j0767Q8326R5059K2679q6691K4073
8761C16620K1365N3466j12058n1411J9029l6355j27442p5393P4743J57684P8355
8750C18603q1015J979n2741o5626O9666M4913j6239k6235J2986N3182M6513m2255
8738B63731O175k6834J6187K9542O053l8797L7460M1339K5186K8073m0927Q3438
8726D30626o541q6989K3625L5405l818j08918J9716Q5217k1584j33726n3652J55069
8714C34430J04955N5398K4631J6419m5149n9038j2579P8039n6215q7547l218Q474
$$ plain form
8796 16860 127417 278289 184096 114742 198395 164293 27343 32846 68897 131398 196530
8785 196530 245478 225901 232441 149662 185009 161971 70748 99334 197699 179830 230491 330558
8773 330558 424448 332796 290351 237752 189849 183941 173174 261500 356559 379238 292547 316620
8761 316620 337985 391451 279393 227982 247011 210656 83214 7821 82564 240248 318603
8750 318603 237588 239567 186826 121200 190866 235779 219540 193305 206291 259473 305986 263731
8738 263731 269906 243072 259259 288801 294854 256057 293517 334856 360042 388115 347188 430626
8726 430626 424085 337096 360721 396126 392308 283390 303106 388323 366739 233013 179361 334430
8714 334430 439385 494783 519414 535833 490684 431646 419067 497106 440891 353344 350126 358600
8702C58600l191J36408J64900O7459o369N6307O0858q626o8792l8970p9506R0913
8690G29991J21598q6262j34294L158J7055N0628J27945k2584p9312J6694o1887
8679F82730n8957N1815P5343m1412N5081J9272o3597j22436o346Q4967O656p0890
8667F12226m3770J05395J09683n3713k4928m5209K4468J609N5380P9779N3814
8656H74734R0825J00720K3012k9246L0242O7158N2988R2677P3005k0282j21448
8645A234385o2695M8809N4539J5966L0492j5081M6681N6915P085l1763N1671J12425
8633A549429J62900N2723L972K1629K6990K51660K36748J02323P2342O0989K00788
8622B742493K22159J74772N2914P0991J50450J71829J47845J33899L2044o6014
$$ plain form
8702 358600 355409 491817 656717 724176 717807 774114 834972 826346 757554 718584 639078 729991
8690 729991 851589 765327 631033 634191 651246 701874 829819 807235 727923 744617 682730
8679 682730 623773 675588 750931 709519 764600 783872 720275 597839 591493 676460 683116 612226
8667 612226 568456 673851 783534 729821 704893 659684 684152 685761 741141 820920 874734
8656 874734 965559 1066279 1089291 1060045 1090287 1157445 1210433 1303110 1376115 1355833 1234385
8645 1234385 1171690 1220499 1275038 1291004 1321496 1306415 1353096 1410011 1417096 1385333 1437004 1549429
8633 1549429 1712329 1765052 1769024 1790653 1817643 2069303 2306051 2408374 2480716 2541705 2742493
8622 2742493 2964652 3139424 3192338 3263329 3413779 3585608 3733453 3867352 3899396 3833382
8612C833382r0798l1829j28644k3127j10605q7035n2399o6345j20563j21824j09080
8601B891133r9778p3834q9452l1377J6830j9093p0469q7280j85579k04778j08574
8590A937749q5255j46280j66584j78016n5665j83057r8475p460m1311p4877o2438
8579H38331l49m3820n234m4268j37656j08163l923o6560n0037L3718N4037q2365
8567C83711r4035l6128j7265k2727Q9443p970L5234J4788J67212K9715j7706o7068
8555D57204j26601j07027q3157l5730m8014J8357K3002m9328Q5075J70004N8394
8544C62179j3618N6832j455o1894m8760l4650n2602O4244o7611o5083P8526R5520
8532C11628R052J9273r496j32864N068L4512K4449L0972L1992j2769q6471J5413
$$ plain form
8612 3833382 3742584 3710755 3582111 3558984 3448379 3361344 3308945 3242600 3122037 3000213 2891133
8601 2891133 2791355 2717521 2628069 2596692 2613522 2594429 2523960 2436680 2251101 2046323 1937749
8590 1937749 1852494 1706214 1539630 1361614 1305949 1122892 1024417 1016957 975646 900769 838331
8579 838331 837982 794162 788928 744660 607004 498841 494918 428358 378321 412039 466076 383711
8567 383711 289676 253548 236283 213556 302999 295029 330263 345051 512263 541978 524272 457204
8555 457204 330603 223576 140419 104689 56675 75032 98034 48706 133781 303785 362179
8544 362179 348561 405393 403938 342044 293284 258634 206032 270276 202665 137582 216108 311628
8532 311628 320680 339953 330457 197593 202661 237173 261622 292594 324586 311817 225346 240759
8520B40759K769j45188j4925K1865m5575l619j52057J9594J15718k1841O9224
8509H6724K3598Q8593P2098M0841Q529m9738r2472M115O1317j6127n3899K3271
8497A96850j6963M8381R6832o1401j21253n9990m131k3907m2729n117N7443J66198
8485B30213O3086j47887j28971J6967P6885J03797M748j11887r9556k5339k4573
8474d2517j9718J19886M7764L473Q0681M5748J08722L3575j5548m5036r185j60453
8462A47392k593N2358J4197L4542l9992J9361j5486M3867K5731P275m4448o9252
8450A72952J5301n9943m0240L1792P6291J9573M0568Q3799J170k886n9945l9862
8438B38570j35206L7578K8819l0029Q0116K3843K8881l1252j8965J04080l9662
$$ plain form
8520 240759 243528 98340 83415 105280 59705 56086 -95971 -76377 39341 17500 86724
8509 86724 110322 198915 271013 311854 320383 270645 178173 182288 243605 227478 173579 196850
8497 196850 179887 228268 325100 263699 142446 82456 78325 54418 11689 6572 64015 230213
8485 230213 293299 145412 16441 33408 110293 214090 218838 106951 7395 -17944 -42517
8474 -42517 -62235 57651 105415 108888 189569 235317 344039 377614 362066 317030 307845 147392
8462 147392 144799 197157 211354 245896 205904 225265 209779 253646 279377 286652 242204 172952
8450 172952 188253 128310 88070 119862 196153 215726 256294 340093 341263 338377 278432 238570
8438 238570 103364 140942 169761 139732 219848 243691 272572 241320 222355 326435 286773
8427B86773j12839p3463K8006Q2860K7104j5228r801r7398L0532o310o9728J19613
8415A90121P6656r1043p8377J5460J5385Q5340r0n6604n549J5485K1576m9839
8403A38521k2999k0012l9400O4575K1332j944Q5919j1168n3122m9636J9732K2063
8391A53861m1699L1310O5346Q2514P8204l7728M6143R1018o1998j9595L4834j6629
8379D05581q110n8836l6216m2207n2355O0583k9546M225P2928J4004m9077N9868
8367C40842p0635m921k4281m9806j6622q7748n3667M1822L0943L7429N734j21971
8355B7119j23862j0445Q6060R409M4574j6777J5285K4568Q7071P2782Q412J58453
8343C82649N3496m2686l6635m4191J1360m4109j7994J6675j5833j0377p5183k8057
$$ plain form
8427 286773 173934 100471 128477 211337 238441 223213 213412 116014 146546 140236 70508 190121
8415 190121 266777 175734 97357 112817 128202 213542 213452 156848 151299 166784 188360 138521
8403 138521 115522 95510 56110 120685 142017 140073 225992 214824 161702 112066 131798 153861
8391 153861 112162 143472 208818 291332 369536 331808 377951 468969 406971 387376 422210 405581
8379 405581 397471 338635 302419 260212 207857 268440 238894 243119 316047 330051 280974 340842
8367 340842 270207 265286 241005 191199 174577 86829 33162 74984 105927 143356 149090 27119
8355 27119 -96743 -107188 -21128 -11719 32855 16078 31363 55931 143002 215784 224196 382649
8343 382649 436145 393459 356824 312633 323993 279884 261890 278565 262732 252355 177172 149115
8331A49115n0126J59460k8479p4660k9684M1080p815p9573k5313N2521K3275M9181
8319A78982K1767l8140j07773j26650k5988N5578R4600O0150J5827M2819k5798
8308A45374K7747J911N3106o5052Q8025J17334o0186j34714R3153m63m8053p4497
8296A43685k9446N7025O4564Q6098j8201j9791q7901q2637m7598O6369j3132q5953
8284C3082J0659J73414M7062n1755k467n349j46846K7113M0484J9592j8367m2082
8272H4540L1394L4136J56673J4964n5351k1336M4348q5657r8458K1915p0615j44958
8260h8405O0513N1470N8348K2717p3421n697Q3345k416O8106j7083l4062n5497
8248F7918j9214L7971N1589M7854l4696k9360j1155m5684j9064L6815L9450r3435
$$ plain form
8331 149115 98989 258449 229970 155310 125626 166706 158891 79318 54005 106526 129801 178982
8319 178982 200749 162609 54836 -71814 -97802 -42224 52376 112526 128353 171172 145374
8308 145374 173121 175032 228138 163086 251111 368445 308259 173545 266698 266235 218182 143685
8296 143685 114239 171264 235828 321926 303725 283934 196033 113396 65798 132167 119035 33082
8284 33082 43741 217155 264217 212462 209995 204646 57800 84913 125397 144989 126622 84540
8272 84540 115934 150070 306743 321707 266356 245020 289368 203711 105253 127168 56553 -88405
8260 -88405 -27892 23578 81926 104643 31222 25525 108870 106454 174560 157477 123415 67918
8248 67918 48704 86675 138264 186118 151422 122062 110907 65223 46159 82974 122424 28989
8236B8989l4158L6676k3415l0802Q6576J01644J2871p2941r5013n3747O4044P6563
8224I7287N59J4925K5227O8396M0910q986o5937r7261M387m522Q184k3787j54299
8211i4917L5640L3365K9410N1142M9049K2413K346r979n3925j937o2165k3794
8199b3352M1490N9567j1973N0771l1427n5682n2462j0608P9451Q02l25j0640J31215
8186A66827J02347o0131M378l9222M1519l8484J1507n5321n9682J2600M4355m7220
8174H3473J142R57P6955N9297j1106n6623j3989o2201P0542M6728M9437J7256
8162B61868m5507J1724P4170J52813L09305L24812K11377q4166k34233k62777
8152G19386k52475j23283j21234l4122m9111r7923p376O0438j6209m1297j1845
$$ plain form
8236 28989 -5169 31507 8092 -22710 63866 165510 178381 105440 10427 -43320 20724 97287
8224 97287 97846 112771 137998 206394 247304 238318 172381 75120 79507 74985 83169 59382 -94917
8211 -94917 -59277 -25912 3498 54640 103689 126102 128448 118469 64544 62607 442 -23352
8199 -23352 18138 77705 65732 116503 85076 29394 -23068 -33676 45775 46577 46252 35612 166827
8186 166827 269174 209043 213421 174199 215718 177234 188741 133420 73738 86338 130693 83473
8174 83473 84615 85572 162527 221824 210718 154095 140106 77905 148447 195175 244612 261868
8162 261868 216361 228085 302255 455068 764373 1089185 1300562 1216396 982163 719386
8152 719386 466911 343628 222394 188272 139161 41238 33862 94300 78091 36794 24949
8141B4949N5544K9866L4276J4492P954k0934k7445J9897N5565K7188p7303N5420
8129A99469L5907M5108J09788m8461j30890m08P3276R4514k5250M648N492N0245
8117D13438L13225K73956J03204J9211j93472l31664k66890j05576m7854p3405
8107A04173p1268r6027O6755M5372k1098K4002N5328N2481M5216N7501j21410
8096A41025n3273O8037L6097q0575m5160R780l2261M691L6693l6164j706j3584
8084C3600K6022K0774j5396O7002M0162M6805n431P1579j62782l7188Q1624m230
8072A62541k5293l4411j5889M7980N780l733O7025Q1046j4254o5639M1321P0212
8060C16686L2774J18359J24185L0394k9059p5808L976J1579R7741L05379K48916
$$ plain form
8141 24949 80493 110359 144635 159127 167081 146147 118702 138599 194164 221352 144049 199469
8129 199469 235376 280484 390272 341811 210921 210513 283789 378303 353053 357701 363193 413438
8117 413438 726663 1000619 1103823 1123034 929562 597898 331008 225432 177578 104173
8107 104173 32905 -63122 3633 49005 27907 51909 107237 159718 204934 262435 141025
8096 141025 87752 155789 191886 111311 66151 75931 43670 48361 85054 48890 47184 33600
8084 33600 59622 80396 65000 132002 172164 218969 213538 285117 122335 85147 166771 162541
8072 162541 137248 102837 86948 134928 140708 136975 204000 285046 270792 205153 246474 316686
8060 316686 349460 467819 592004 622398 593339 517531 521507 533086 630827 936206 1185122
8049A185122R8548N3895L8838n4624J0372K0884o5930j26242K9054O2327R6199
8038A348443J43856L2251k3762k2144j12087j18110j11582l5179l0355l8325l8987
8027I94019J4187O1882R3413J11525Q0701o840m770J5758n9630q6598O3962Q2898
8015A360507Q7800J45564K04582J60943K04663K73840K77366N08428P00436P12260
8005D636389O31776J74835l49250p64559p74386m56663l50374j88882j66240J09916
7995B502562K50505M57770M37533K41916j59309n73023p53282n72677l36447k19761
7985A275787j01990j48886m6155o4797M4352l2986n9158P8301M7913K5552m7167
7974I70766L3475J54583J75076j0007O661R2281J36191K13821J63962J56393K67852
$$ plain form
8049 1185122 1283670 1337565 1376403 1321779 1332151 1353035 1287105 1160863 1189917 1252244 1348443
8038 1348443 1492299 1524550 1500788 1478644 1366557 1248447 1136865 1101686 1071331 1033006 994019
8027 994019 1008206 1070088 1163501 1275026 1355727 1348887 1344117 1359875 1300245 1213647 1277609 1360507
8015 1360507 1448307 1593871 1798453 1959396 2164059 2437899 2715265 3223693 3924129 4636389
8005 4636389 5268165 5443000 5093750 4329191 3554805 3098142 2747768 2558886 2392646 2502562
7995 2502562 2753067 3210837 3648370 3890286 3730977 3157954 2404672 1831995 1495548 1275787
7985 1275787 1173797 1024911 978756 913959 958311 925325 866167 944468 992381 1017933 970766
7974 970766 1004241 1158824 1333900 1323893 1330554 1422835 1559026 1772847 1936809 2093202 2361054
7963B361054L07295L35042K50986J90938p0401k43782k96526k78716k90584n5356
7953B209950J69860M00433K85572M8363j87928n33494n51895l94775l09743j23436
7943A012907l1449j26262j42485p9262r1334p1836J3974M6559q9415n0252J06948
7932D98093O4677j32950p5810N6839K9367j674J1842l7754m8784J22038J62518
7921F48402J56981K46811J53143K9374j92762p8119j15218o1307k0830M7125J156
7910H14756n0511p0455j23631j10910P701n2870j05226k4410N888j1161p8352
7899B00819n4955m0992r3641L8479l1762r417O1947O8901n9068J7032M2502o6323
7887G3522k5057k1017K2179J1250q4855q259K9336Q91o6669K4165P8763l7198
$$ plain form
7963 2361054 2668349 3003391 3254377 3445315 3374914 3131132 2834606 2555890 2265306 2209950
7953 2209950 2379810 2780243 3065815 3114178 2926250 2392756 1840861 1446086 1136343 1012907
7943 1012907 981458 855196 712711 633449 542115 470279 484253 530812 441397 391145 498093
7932 498093 562770 429820 354010 410849 440216 438542 450384 412630 363846 485884 648402
7921 648402 805383 1052194 1205337 1234711 1041949 963830 848612 787305 766475 813600 814756
7910 814756 764245 693790 570159 459249 466950 414080 308854 284444 290332 279171 200819
7899 200819 145864 104872 11231 49710 17948 8531 70478 139379 80311 97343 139845 73522
7887 73522 48465 27448 49627 60877 -23978 -32237 -2901 -2010 -68679 -44514 34249 -2949
7875b949q8932N3309m5276R019K1771o3582J00262O3863p19n8872n6450j3451
7863h2007o3713j5043k7448M1430M8761O9684J5985R232P549K1468p5254r4917
7851a44273J15281J25870J2772Q93R0344k4776j52361K7080k1342p2603N2080
7840H965m7247M0742k5571n3366o1524P1854N9494q1061o8990l3680R8268P5902
7828a6214q284k7228k7656r5933k2753N5619p7557K0262Q6850J68241O19j6356
7816C9610n3836J24727Q5412k273m695M0363r075L5457n1646p5214j59749j2047
7804d2966Q2694l1845M3348j0293n3113j12510P711n0419N6425J18312O1636j8465
7792E0515j33040q05L7165p122J322M9139L1469l5792L805o279J4057K2698k9257
$$ plain form
7875 -2949 -91881 -38572 -83848 -74829 -53058 -116640 -16378 47485 46766 -12106 -68556 -82007
7863 -82007 -145720 -160763 -188211 -146781 -98020 -28336 -12351 -3119 4430 25898 -49356 -144273
7851 -144273 -28992 96878 109650 110543 200887 176111 23750 50830 29488 -43115 8965
7840 8965 -38282 2460 -23111 -76477 -138001 -66147 -6653 -87714 -156704 -190384 -92116 -16214
7828 -16214 -24498 -51726 -79382 -175315 -198068 -142449 -220006 -199744 -112894 55347 55966 39610
7816 39610 -14226 110501 195913 193640 188945 229308 220233 255690 204044 128830 -30919 -42966
7804 -42966 39728 7883 51231 40938 -12175 -124685 -116974 -167393 -110968 7344 68980 50515
7792 50515 -82525 -83330 -46165 -53287 -51965 -2826 28643 -7149 -3344 -9623 4434 27132 -2125
7779b125j44544q7287J61547Q3626j38939k2005O7784P5389l5641k3795o1907
7768a27897O9480n2476k1288K4764L9273N3443J01031K2265l6090j21627M8851
7757b71N9191p3297o2280m3942N1451R5102Q7678J20253n2579j20545j9510m9965
7745h714q8569N5931R2258j059J4292L2751l7156j7964m5444J721J2730N240p8990
7732f2973r5130M9221J3125J20105K3960J6005N1391k6433J17418K7857j63233
7721G1313j52156j6772n534J21821k9640p1889K0084q1255K6939p491M4649M7221
7709c2710O100j1394p391k3294Q8563K8159n832l9180j22268j46671m3252J67480
7697a41690J14917p620p6117p8158P1089J05335M1988J08687m2662q508l579j9474
$$ plain form
7779 -2125 -146669 -233956 -72409 11217 -127722 -149727 -81943 -6554 -42195 -65990 -127897
7768 -127897 -58417 -110893 -132181 -107417 -68144 -14701 86330 108595 72505 -49122 -271
7757 -271 58920 -14377 -76657 -120599 -69148 25954 113632 233885 181306 60761 41251 -8714
7745 -8714 -97283 -41352 50906 49847 64139 96890 59734 41770 -3674 -1953 10777 16017 -62973
7732 -62973 -158103 -108882 -95757 24348 48308 64313 115704 89271 206689 234546 71313
7721 71313 -80843 -97615 -103149 18672 -10968 -82857 -62773 -144028 -117089 -124580 -79931 -32710
7709 -32710 -26610 -38004 -45395 -68689 19874 48033 42201 3021 -119247 -265918 -309170 -141690
7697 -141690 -26773 -34393 -110510 -188668 -117579 -12244 29744 138431 95769 87261 83682 64208
7685F4208j7569j5859q7414L3272Q0915L3103l9263o631Q2364q7061N3807m6663
7673D7209p7618p3713m762j1970p3796M472J1585l6630J19044N8283O3825o0907
7661c4978n5579m3929j7974j0996P4103J8175k2657N237J45207J48184l5730j12028
7649E7035p2217l8496Q640O4553l9543k6252J04492P8610m3043j1780o625p3158
7637B216n4956m9668j3110K5235N9429O4795R9217l4548l8401j0390j1412p748
7625C0659n0795N5013k7511p6898L4361k0635m443J4151K0196L1497M3660Q4658
7613A33913J52114j35542j21021j8167m7313R458K22j9003j01007m3171P6128
7602a13389J22007N3607p5091m885o8612J3825N241M4602L4325N3054p0446L047
$$ plain form
7685 64208 46639 30780 -56634 -23362 57553 90656 51393 44762 127126 40065 93872 47209
7673 47209 -30409 -104122 -108884 -120854 -194650 -190178 -178593 -215223 -96179 -37896 25929 -34978
7661 -34978 -90557 -134486 -152460 -163456 -89353 -71178 -93835 -88598 56609 204793 169063 57035
7649 57035 -15182 -53678 -45038 19515 -20028 -46280 58212 136822 93779 81999 75374 2216
7637 2216 -52740 -102408 -115518 -90283 -30854 33941 133158 98610 60209 49819 38407 30659
7625 30659 -20136 34877 7366 -69532 -35171 -55806 -60249 -46098 -25902 5595 49255 133913
7613 133913 286027 150485 29464 11297 -36016 -26558 -26336 -45339 -146346 -189517 -113389
7602 -113389 8618 62225 -12866 -17751 -86363 -72538 -67297 -22695 11630 64684 -5762 -2715
7590b715L576l2547l1497q6005O8090J24863O7754l2130o5965m2243o5299m914
7578i9032K6751P7284L609K4986m6502q4672L1440N4308L4777L3907p0261l0284
7566d3689n8544J6624L1569N6387m9705j04683k1063j5897K1603Q0356l6201p4089
7554a97332M0493J21166L1039k8882R797M6592m2019k1816P1032K7990p1938r5547
7542a09425J11863P7735Q773j5208j6863n0685N3133K0728L4676q2064l7132r2900
7530i7369j18273J01942J26954o2586o7923L0104R3433J1683N4836p0926m9334
7519d7459P3059m729q4096m7408K0768O5748R5063L5096p7936n3121O5006M5872
7507H5863J2649l1059M9791m2719K2977l8544p2888J10759O1597j16058J0658
$$ plain form
7590 -2715 861 -31686 -63183 -149188 -81098 43765 111519 79389 13424 -28819 -94118 -99032
7578 -99032 -72281 5003 8612 33598 -12904 -97576 -66136 -11828 22949 56856 -13405 -43689
7566 -43689 -102233 -85609 -54040 2347 -47358 -152041 -173104 -189001 -167398 -87042 -123243 -197332
7554 -197332 -156839 -35673 -4634 -33516 -23719 22873 -19146 -40962 30070 58060 -13878 -109425
7542 -109425 2438 80173 88946 73738 56875 6190 59323 80051 114727 32663 -4469 -97369
7530 -97369 -215642 -113700 13254 -49332 -117255 -87151 6282 17965 72801 1875 -47459
7519 -47459 25600 20871 -63225 -110633 -89865 -24117 70946 106042 28106 -25015 39991 85863
7507 85863 98512 67453 117244 74525 97502 58958 -13930 96829 158426 42368 53026
7496E3026K4302L350l0765Q7282n95l0120n2918m825k3388o5330m6385L2021j4646
7483f8991j0410P0403O6217q4435n8349O4391N1340K7784L760m1509q2661P596
7471e4864q6154n1794p2304M767R7756R22j1574L5696Q206n5319L0561O3417l7530
7458a28214J14882M9877k3768o945p463M8965J02136k9785j07645n6310l7743
7447h2013j27135l2530J18466M6206n8241o5648J955J11733Q5142m1216l5223
7436g8504j4618o0797J4732P3136K1219j05836k9329Q1046J01024k5716K9365
7425E722j5272o9757R0830O3708j28443j19755L7744Q4391J20400o0756L9199
7414D8011K1480L6716q6228N0945M1833k8140n7658l1295j71m4777j0251p8711
$$ plain form
7496 53026 77328 80678 49913 137195 136600 106480 53562 48737 25349 -39981 -86366 -54345 -68991
7483 -68991 -79401 -8998 57219 -27216 -85565 -21174 30166 57950 61710 20201 -62460 -54864
7471 -54864 -141018 -192812 -265116 -260349 -162593 -161671 -173245 -137549 -129343 -184662 -154101 -90684 -128214
7458 -128214 -13332 36545 12777 5832 -1631 47334 149470 119685 12040 -44270 -82013
7447 -82013 -209148 -241678 -123212 -77006 -135247 -200895 -198940 -87207 -2065 -43281 -78504
7436 -78504 -93122 -153919 -139187 -66051 -44832 -150668 -179997 -98951 2073 -23643 5722
7425 5722 -9550 -79307 11523 75231 -53212 -172967 -135223 -50832 69568 8812 48011
7414 48011 69491 106207 19979 70924 112757 84617 26959 -4336 -4507 -49284 -59535 -138246
7402a38246N3629L0146K5574k3076J42385J9520l9795l8773o8608J00300Q9755
7391A52811L8452j03207m5427l6773k8835m16n4187m2641L6438J7254J24725K4634
7379H2828N029J3827l5273r7046N1839j3081P1784K9608L9510m1632q7263j05192
7367h5062k1944m3940Q357R8426k1067p086L1362J5887L0273K6879J320K7784
7355F1189J3259k2169q401l0682k2507K65m2317N479P7695Q993R205Q4856K35
7342A35100j35462q5973o1933L0295m7278l0138J05259J486k5603q182R7003J06590
7330H1164J209k456J8460K884l9979r8784m0723J1532J8047J07115M7845m8553
7318E7761L4427m0250l2627L9258k1355n725n1445q0101N0626m4218k9540L2589
$$ plain form
7402 -138246 -84617 -54471 -28897 -51973 90412 109932 70137 31364 -37244 63056 152811
7391 152811 191263 88056 42629 5856 -22979 -23395 -77582 -120223 -83785 -66531 58194 82828
7379 82828 87857 101684 66411 -30635 21204 8123 79907 109515 149025 107393 20130 -85062
7367 -85062 -107006 -150946 -142589 -44163 -65230 -72316 -40954 -25067 5206 32085 33405 61189
7355 61189 74448 52279 43878 13196 -9311 -9046 -51363 -45884 31811 40804 50009 134865 135100
7342 135100 -362 -86335 -148268 -117973 -165251 -195389 -90130 -88644 -114247 -122429 -25426 81164
7330 81164 82373 79917 98377 101261 61282 -37502 -78225 -66693 -48646 58469 106314 57761
7318 57761 92188 51938 19311 58569 37214 31489 -19956 -100057 -49431 -93649 -123189 -90600
7306i0600l3429N169J3602k5103M4594M425l8983R474J4560J48598L6830o0005
7294B9132r782L8117K0688r8271P226l5545J7681r213K922M3809j05479o2068
7282a60783M3741N3612m5855j608L1706O4979L5411J9334k6472m8487n8342K1805
7270g0959k3941p1923j78325N701R6620P8248Q7447O498o2046j475Q415k1470
7258a47210m1044K4958Q8274Q0372K546M8974l6531j1468Q9710L9949j51763q8087
7246a01320K5475k6442J21981P7677K2572j22083l2956K095j17991m6706j0005
7235b07703K7930Q9921L1455l8396P9615r3908o5283O8363O8484J10779P0439
7224A41696j20065j2408J5683k7459k5311q90M557K4071J13855p4416l2128K6315
$$ plain form
7306 -90600 -124029 -118860 -105258 -130361 -85767 -81342 -120325 -110851 -96291 52307 89137 29132
7294 29132 19350 57467 78155 -20116 -12890 -48435 -30754 -39967 -37045 6764 -98715 -160783
7282 -160783 -117042 -63430 -109285 -110893 -79187 -14208 21203 40537 14065 -34422 -92764 -70959
7270 -70959 -94900 -166823 -345148 -339447 -242827 -164579 -77132 -70634 -132680 -134155 -125740 -147210
7258 -147210 -188254 -163296 -75022 5350 7896 56870 20339 8871 98581 138530 -13233 -101320
7246 -101320 -75845 -102287 19694 97371 119943 -2140 -35096 -33001 -150992 -197698 -207703
7235 -207703 -179773 -89852 -58397 -96793 -17178 -111086 -176369 -108006 -39522 71257 141696
7224 141696 21631 9223 24906 -2553 -27864 -28754 -24197 -126 113729 39313 7185 33500
7212C3500J2j0207l1908J1147L0975l006R1451n9506m8649L8466J7459m9348J779
7199B2165P3432m7321O594m9631m5809N2472k8674k1954o3607k5920l7526k1161
7187a86940J04088P6089J26484J5219j15215l4886q1867O9447n6547m9116J3863
7176a19381M2105p6829o6082K1703J02882m2523q4373Q1675J33214p634m3080
7165e8323k9900m9150j428M8049J13299n6792j7446Q0354n2251k5467P8498P3931
7153A03374j0803j91218p4234P8185R8239j08427l9737o773N0555O1266k9706
7142f9279j9475L3877P4935J02998N2356K885j31693k1540P3096Q4401Q4265M8268
7130C15094J8511m7451K1891j06105j51743q8545Q0883K3886o9741K0044p7439
$$ plain form
7212 33500 33512 23305 -8603 2544 33519 30513 121964 62458 13809 52275 69734 20386 22165
7199 22165 95597 48276 54870 5239 -40570 11902 -16772 -38726 -102333 -128253 -165779 -186940
7187 -186940 -82852 -6763 119721 134940 19725 -15161 -97028 -27581 -84128 -133244 -119381
7176 -119381 -77276 -154105 -220187 -198484 -95602 -138125 -222498 -140823 -7609 -15243 -58323
7165 -58323 -88223 -137373 -138801 -90752 22547 -34245 -51691 28663 -23588 -49055 29443 103374
7153 103374 92571 -98647 -172881 -94696 3543 -104884 -144621 -151394 -100839 -39573 -69279
7142 -69279 -88754 -54877 20058 123056 175412 178297 46604 25064 98160 182561 266826 315094
7130 315094 333605 286154 308045 201940 50197 -38348 42535 66421 -3320 16724 -60715
7119f0715j17929l6933p1513L4559J63282n8844p6743M5789J3187L6990R6566
7108c2304J37793L501j25728r778k646l2634j37555M1865K6624J84341j5005r2852
7096e4378Q0791O8596J4947K364P101J24055j8246l7795K7940O258p2137j18398
7084C1098J8034K24M1401j27713j21630o7854L3448L345Q2359J1884n6853j24901
7072b77158m0495P3523K5801N2697L5126O7931k0146k7875J6773J5468o8680J0649
7060a36386j7121n8684L3014J59077J0301Q309M321j6867p9045j39483N2764O1413
7048a18387N38o3529M2965L5815P8090K4769M3824l0771j41928o6376L4206J4152
7036a46632p356K0318N3373L5033l0376Q1961p4057m4064J39384J32126L1995
$$ plain form
7119 -60715 -178644 -215577 -287090 -252531 -89249 -148093 -224836 -179047 -165860 -128870 -32304
7108 -32304 105489 108990 -16738 -26516 -29162 -61796 -199351 -157486 -130862 53479 38474 -54378
7096 -54378 26413 95009 109956 112320 119421 243476 225230 187435 215375 221633 149496 31098
7084 31098 49132 49356 90757 -36956 -158586 -226440 -192992 -189647 -107288 -95404 -152257 -277158
7072 -277158 -317653 -244130 -218329 -165632 -130506 -62575 -82721 -110596 -93823 -78355 -147035 -136386
7060 -136386 -153507 -212191 -179177 -20100 -9799 -1490 2831 -14036 -93081 -232564 -179800 -118387
7048 -118387 -117849 -181378 -138413 -102598 -24508 261 44085 13314 -128614 -194990 -160784 -146632
7036 -146632 -153988 -133670 -80297 -45264 -75640 6321 -67736 -111800 27584 159710 191705
7025A91705l3865j17676l5389N8996M053k1687l3434n9171q5687N8624K2053p3665
7013a25143N7209R1080q421J78913r4239l8457M7629L2076j2020j39254j19550
7002a30177K2446M1031J31294j2378r519j91n9616k5843J60653R9689j25851j28474
6990c6936r2799p5142M8101M7224n7710M5595R3909R2588J04684L556j31663j51917
6978a10510j19536L6623O6983j3011P2985J21795n5199q7439l5622o9291j094
6967a93316R6336N6331j15291m4208K9270L8044N1439K0781N0487p3392m7275
6956a30794l0544P3375p208n927k292Q8492k3712n2469l4257m7537j3418L6877
6944a49414n2251K2599P9679K0790Q6276Q7494m6435m8781m6623M8255p756q0396
$$ plain form
7025 191705 157840 40164 4775 63771 67824 46137 12703 -46468 -132155 -73531 -51478 -125143
7013 -125143 -67934 23146 14725 193638 99399 60942 108571 140647 128627 -10627 -130177
7002 -130177 -107731 -66700 64594 52216 42697 42506 -17110 -42953 117700 217389 91538 -36936
6990 -36936 -129735 -204877 -156776 -109552 -167262 -121667 -27758 64830 169514 173070 41407 -110510
6978 -110510 -230046 -193423 -126440 -139451 -66466 55329 130 -87309 -122931 -192222 -193316
6967 -193316 -96980 -40649 -155940 -200148 -170878 -132834 -81395 -60614 -10127 -83519 -130794
6956 -130794 -161338 -87963 -95171 -101098 -103390 -14898 -38610 -91079 -125336 -172873 -186291 -149414
6944 -149414 -201665 -179066 -99387 -78597 7679 95173 48738 -43 -46666 1589 -6167 -86563
6932h6563m2962K2155L2664N3259M859m9431n4637J0565n2771n8018K5168J33300
6920f2412J06725j2918j22126q1905L4979J7008K4769J1416k8146J09683K6721
6909B3794n7322j3398q1838j1555n1117k663L455q6438P1829R4806M7258K610
6897f0579l25l7022M48q5889N1116O2331K3590l451m4246J8283j6016J8050o1021
6884a34731m9906Q3575q2005o9237r477J6663J4011J7622J18285n7411M5508l4187
6872a41290q7583K4932J03150L1967k0009N6103N9692m2577p379p4449n180k6904
6860a29527l4023O7413L5278P2696J698k7303N393L8303J0162o1409J7530N7192
6848E3403l1249j03397O4818r153o156K3157m5343K9276p0370n5451j548K2570
$$ plain form
6932 -86563 -129525 -107370 -74706 -21447 -16588 -66019 -120656 -110091 -162862 -220880 -195712 -62412
6920 -62412 44313 31395 -90731 -172636 -137657 -120649 -95880 -84464 -112610 -2927 23794
6909 23794 -33528 -46926 -128764 -140319 -191436 -194099 -190644 -277082 -205253 -110447 -63189 -60579
6897 -60579 -60904 -97926 -97478 -183367 -132251 -69920 -46330 -49781 -94027 -75744 -91760 -73710 -134731
6884 -134731 -184637 -101062 -183067 -252304 -261781 -245118 -231107 -213485 -95200 -152611 -107103 -141290
6872 -141290 -228873 -203941 -100791 -68824 -88833 -32730 26962 -15615 -22994 -97443 -102623 -129527
6860 -129527 -163550 -96137 -60859 11837 13535 -13768 -8375 29928 40090 -21319 -3789 53403
6848 53403 22154 -81243 -16425 -25578 -31734 -8577 -53920 -24644 -95014 -150465 -152013 -129443
6836a29443O8407J14666K566m8269o8572K5726l8002J11008P0045Q6268o9738
6825A24662p0193l8210o3066p723J4900K2401k545O3050l8832J0699p976l4300
6813b7133j10594j9174R0819J5611q0228r3559M4676M5737J84026L6846m0050
6802D6977l4995n274P717J58793O656k19395l037J8744l4401j02085N7504L2762
6790g0034j67504q7982J7531N9400O8045J29608M4229j1770M483M3518K5199l4129
6778B0594k7706R8629O3129M0128j63971K825N7438k4883m2835k1551Q6964L829
6766I2590J9345J4514k634N0240O017m9175L5421J1985n7425J8913P334l0774
6754A16351m5127j22422j9948M5714o1525L0770R4831J0499j7248O4058k8139
$$ plain form
6836 -129443 -61036 53630 56196 7927 -60645 -34919 -72921 38087 108132 194400 124662
6825 124662 54469 16259 -46807 -54530 -39630 -17229 -19774 43276 4444 15143 7167 -27133
6813 -27133 -137727 -156901 -66082 -50471 -130699 -224258 -179582 -133845 50181 87027 46977
6802 46977 11982 6708 14425 173218 179874 -39521 -42558 -23814 -58215 -160300 -102796 -70034
6790 -70034 -237538 -325520 -307989 -248589 -180544 -50936 -6707 -18477 -13994 29524 54723 20594
6778 20594 -7112 91517 154646 194774 30803 33628 91066 66183 23348 1797 88761 92590
6766 92590 111935 126449 123815 174055 180072 130897 166318 178303 120878 139791 147125 116351
6754 116351 71224 -51198 -71146 -25432 -86957 -56187 38644 49143 31895 95953 67814
6743F7814j43935j58320k0085J10137N2526N2741K3917K1507k360L2224J08620
6732A44786r3487M8059K1210l3257r921o6515Q815j2881n095n050P0098P5356
6720A42118O4366k4463k6087K594m9554L4499J4718m4400M068O258J4374n7799
6708H0692M4504J7644n7743j10131p3543J5786R6932K9861j6797k9532k3277q8275
6696a13879j40580L4786J68296J13100N9416l1672o6938N9121o0228N7763k452
6685G6733l4321j7064L8147j3349k5395L8102J2662j25959q2896l0212N5484j1186
6673a19254l8785J6589K345k0344K1450N3506K7799k0057m5855J8173O3964m8539
6661h9008j1697J02767k8809m7986k6898o2005m8337J3899M4095K8546l4666R926
$$ plain form
6743 67814 -76121 -234441 -254526 -144389 -91863 -39122 -15205 6302 3942 36166 144786
6732 144786 51299 99358 120568 87311 77390 10875 19690 6809 1714 -3336 66762 142118
6720 142118 206484 182021 155934 158528 108974 143473 158191 113791 117859 124117 138491 80692
6708 80692 125196 142840 85097 -25034 -98577 -82791 14141 44002 27205 -2327 -25604 -113879
6696 -113879 -254459 -219673 -51377 61723 121139 89467 22529 81650 21422 79185 76733
6685 76733 42412 25348 63495 50146 24751 62853 75515 -50444 -133340 -163552 -108068 -119254
6673 -119254 -158039 -141450 -139105 -159449 -137999 -84493 -56694 -76751 -122606 -104433 -40469 -89008
6661 -89008 -100705 2062 -26747 -74733 -101631 -163636 -211973 -198074 -153979 -125433 -160099 -150173
6649a50173J54017N2295P941j09009L1832N5420m1823j75542m8049O3080P3449
6638h6562M0052l4908n5520M7493P5309K5876M2093n3685m6625q8278N7062J07612
6626B9919O6840l5360r4403L6392J42388K6200r0394O5464Q7644o9738j31080
6615C3872p3865J42778M5382j52357k7894J1522k1142n7270Q8464O3022j2679
6604C9833n792o1043R465J9903p552N1769l3222p5073N6674N4726Q6714o8628
6592F7774p9354j3845k017O349n2385r517j8065J15471K5602j05921K936J1991
6580e0981J5678j2354q3470k0135J0824L6173K8734R5407N4251q4442M2074N2267
6568H4026m2867M6371M9945j07349p0361J0165l498m7552K8199N2309n8543j2552
$$ plain form
6649 -150173 3844 56139 64080 -44929 -13097 42323 500 -175042 -223091 -160011 -86562
6638 -86562 -46510 -81418 -136938 -89445 -14136 11740 53833 148 -46477 -134755 -77693 29919
6626 29919 96759 61399 -33004 3388 145776 171976 81582 147046 234690 164952 33872
6615 33872 -39993 102785 148167 -4190 -32084 -20562 -41704 -98974 -10510 52512 39833
6604 39833 34041 -27002 -17537 2366 -5186 46583 13361 -61712 -5038 49688 136402 67774
6592 67774 -11580 -25425 -27442 -21093 -73478 -82995 -101060 14411 40013 -65908 -62972 -50981
6580 -50981 -35303 -47657 -131127 -151262 -140438 -104265 -75531 19876 74127 -10315 31759 84026
6568 84026 41159 87530 137475 30126 -40235 -30070 -33568 -81120 -52921 -612 -59155 -71707
6556g1707L7757P0281Q7921n1943K2606P931j14403j03254o367o482j070L8260
6544i0470k5147n8014Q0768J04260P684j4988J613k9819n8054M3991L2150j12095
6532a18121l7685M4270L2485l1491m8741M83J7271m1410J6007M8185O3513p25
6520e5959n2737M1853L4472J257p0439l0519Q077J25863M0253j66224m4258M8583
6508a19778J98K6608O5434N924p3826q1732n0440J19868P3007Q8632q9499j07817
6496a43421N1960l8716Q4952J23734J9120j8889M1430m29n5653k4482q5042p8485
6484a23921R8739L6231J49308N166o4693j46483j18595N7048K4576J2940p1153
6473a40837O187J1285k3617N3497J09076K6895O2107N8127l0292J8810n6006n3633
$$ plain form
6556 -71707 -33950 36331 124252 72309 94915 102846 -11557 -114811 -121178 -127660 -128730 -90470
6544 -90470 -115617 -173631 -92863 11397 19081 4093 5706 -24113 -82167 -38176 -6026 -118121
6532 -118121 -155806 -111536 -79051 -110542 -159283 -158800 -141529 -182939 -166932 -118747 -55234 -55959
6520 -55959 -108696 -66843 -32371 -31114 -101553 -132072 -123995 1868 42121 -124103 -168361 -119778
6508 -119778 -119580 -92972 -27538 -21614 -95440 -177172 -227612 -107744 -34737 53895 -35604 -143421
6496 -143421 -91461 -130177 -45225 78509 97629 78740 120170 119741 64088 39606 -45436 -123921
6484 -123921 -25182 11049 160357 165523 100830 -45653 -164248 -107200 -82624 -69684 -140837
6473 -140837 -134650 -123365 -146982 -93485 15591 42486 104593 162720 132428 151238 95232 41599
6461D1599p1482M3724k089j42814k7678P9793J18879R6906Q9423m851L0264m3573
6449B08101k8496n6625p1849N319L6800o1586p8676p439J1790N1393k5672j48037
6437a64977m3899J9751Q1963k1447M3305J6311n2211l7089M0290O1558l6697N0856
6425d2286m5734J933J05330P9252K6608n4721q9003o2678K7175M8922N5009j9574
6413C0233l6188J1340J1090r1168M6470n9503L1391J10239K4484l0051R179j0499
6401D7017Q242j59591m7975o5586K2328O1402O9315J6991R578j4744M5495J95982
6389A88454M3486l3875J1106j28149k9745r9837p8787Q0657J0812Q6175Q4436
6378A34733j2821R920L8805j60831k0398J01990J2030q1935j01192L3143P4684
$$ plain form
6461 41599 -29883 13841 11752 -131062 -158740 -78947 39932 136838 226261 221410 251674 208101
6449 208101 179605 122980 51131 56450 93250 31664 -47012 -54451 -42661 8732 -16940 -164977
6437 -164977 -208876 -189125 -107162 -128609 -85304 -68993 -121204 -158293 -118003 -56445 -93142 -42286
6425 -42286 -88020 -86087 19243 98495 125103 70382 -18621 -81299 -54124 -5202 49807 30233
6413 30233 -5955 5385 16475 -74693 -28223 -87726 -56335 53904 78388 48337 57516 47017
6401 47017 55259 -104332 -152307 -217893 -195565 -134163 -64848 -47857 -38279 -53023 -7528 188454
6389 188454 231940 198065 209171 81022 51277 -48560 -127347 -46690 -35878 50297 134733
6378 134733 121912 131832 170637 9806 -10592 91398 103428 21493 -79699 -46556 28128
6367B8128j18021k3596O2816N5118p0649m2326j8030L986N5007K14913Q4278j16795
6355A14829j17027K3392Q8088n5975r1337J7441O672M9323o903p5442p6005M3620
6343g9324K6725o0283q9479P7368M7975O1726O9795p2554Q005l2714l3885J200
6331g5445K9957l0016L9574P7128J9334r154N852L0290m4642o4061o8438J29082
6319C9461R3206k2087O16j2926o6414l5349l0626J0698n5225j52053j2221J51194
6307i1726l859J37221k7076o3927q167n5636Q1698J9185J7830K179O9826j1898
6295F5650n351j7987J5962r339r3145k3883j0726l0111k2899J8781L3368n342
6283h5022K531R1194J42954L3202j01318j9405o0010l9596q4760J5441J00647
$$ plain form
6367 28128 -89893 -113489 -50673 4445 -66204 -108530 -126560 -122574 -67567 147346 231624 114829
6355 114829 -2198 21194 109282 53307 -38030 -20589 -13917 35406 28503 -46939 -122944 -79324
6343 -79324 -52599 -112882 -202361 -124993 -77018 -15292 54503 -18051 -10046 -42760 -76645 -75445
6331 -75445 -45488 -75504 -35930 41198 60532 51378 57230 87520 42878 -21183 -89621 39461
6319 39461 132667 110580 111196 98270 31856 -3493 -34119 -23421 -78646 -230699 -242920 -91726
6307 -91726 -95585 41636 14560 -49367 -57534 -113170 -31472 -12287 5543 7722 77548 65650
6295 65650 60299 42312 58274 48935 -44210 -68093 -78819 -108930 -131829 -113048 -79680 -85022
6283 -85022 -82491 8703 151657 184859 83541 64136 4126 -35470 -120230 -104789 -4142
6272d142M5798q1056l4225N6552p4951q0970Q0113R3446n9847j01689M5492P6345
6260c9134J6181O2943o66m6955m5525l0829o0339l9909J05757p636O8419m447
6248b2140k8563k5998k1766L5427J63416K9056M5473k4040o872l861p3824j02941
6236c6633j1817k1293O2352k1668k7534o5754N7193J11581n212o4629o9491O3747
6224b9158M7449J1441N1838o338J9117j2251j7776p1689M1217m478N75p3121o7945
6211a11119n6247L5016N6904J4074M8549j57543j17879Q4924O5198J0599O0572
6200f6952l3767m4187p7669L9171J27390R7270N2383K898O290N5996j37660k1019
6188A44O7740m5640M5507L971P875j5450l6118j0972m3220r4652M6277R8544o7382
$$ plain form
6272 -4142 41656 -39400 -73625 -17073 -92024 -172994 -92881 565 -59282 -160971 -115479 -39134
6260 -39134 -22953 39990 39324 -7631 -53156 -83985 -144324 -184233 -78476 -86112 -17693 -22140
6248 -22140 -50703 -76701 -98467 -63040 100376 129432 174905 150865 143993 140132 66308 -36633
6236 -36633 -48450 -69743 -7391 -29059 -56593 -122347 -65154 46427 41215 -23414 -92905 -29158
6224 -29158 18291 29732 81570 75232 94349 82098 64322 -7367 33850 29372 29947 -43174 -111119
6211 -111119 -167366 -132350 -75446 -61372 -12823 -170366 -288245 -203321 -138123 -127524 -66952
6200 -66952 -100719 -144906 -222575 -183404 -56014 41256 93639 96537 102827 158823 21163 144
6188 144 67884 22244 67751 71722 79597 64147 28029 17057 -26163 -120815 -74538 24006 -43376
6175d3376q255n650Q3352j9200j44732Q926J24698n063O46N3744K9941j04125
6163b9094K2336N7571m8L5153P2637P9398m3720k1206l2401q9525k9812J18866
6151A40155O657l7256j09289O2467L4464M1523l0758l7734L274L4591k5850n6846
6139B5398J9081K3480j1747n1116N1365Q7635o6454p4388J2556O4003Q4933n2910
6127A11836L582L6508o1663J3099M6523J03349o127J7771p4659j82404o4982m2143
6115i9310m2501N259N5528k5598L2313L4646j5361K33J2690J9671P9409O1162
6103A18141l8372J6575J6367j63825j60542J79331J57965j38947m2441l2119M343
6092h3524n1139O5K8429K0065k1283m4694J2230J65523Q8422o3318j59430j2825
$$ plain form
6175 -43376 -51631 -57281 26071 6871 -137861 -128935 -4237 -9300 -8654 45090 75031 -29094
6163 -29094 -6758 50813 50765 85918 158555 237953 194233 173027 140626 51101 21289 140155
6151 140155 146812 109556 267 62734 97198 138721 107963 70229 73503 108094 82244 25398
6139 25398 44479 67959 56212 5096 56461 144096 77642 3254 15810 79813 164746 111836
6127 111836 115418 151926 90263 103362 149885 253234 247107 264878 190219 7815 -57167 -99310
6115 -99310 -141811 -136552 -81024 -106622 -74309 -39663 -55024 -54791 -42101 -22430 56979 118141
6103 118141 79769 96344 112711 -51114 -211656 -32325 125640 -13307 -55748 -87867 -83524
6092 -83524 -134663 -134598 -106169 -86104 -107387 -152081 -139851 25672 114094 50776 -108654 -121479
6080a21479L0387k4065M4086L3725Q4430K4787K8629j17179q3535l5017R192N5318
6068g0721J8992q284j8415n0394M6480K0310L6188M9032l2460k9081M9679q2398
6056g1072r1742P1739N9337l1946N176m580M3181O630N7249l8158L5310m6797
6044e673j8845l0809J2721P6356J12764O6954q5707q6004m9698q6499k6069l1070
6032a51579N1528J00968k6304p3641p8839P0996J29062J471M7824Q0979l5097
6021A17368P9k3957J1253K4711l5617p2796p2118j022J06977N3525j00582n3608
6009d5787n9693p031j0252R3104O5827J4278q3523J15686l5521o4001p307O5152
5997D0932J4519O0735P5272j8353j59310p0823Q106k4838p5276J08185J00807
$$ plain form
6080 -121479 -91092 -115157 -71071 -37346 47084 71871 100500 -16679 -100214 -135231 -126039 -70721
6068 -70721 -51729 -60013 -78428 -128822 -82342 -62032 -25844 23188 -9272 -38353 11326 -71072
6056 -71072 -162814 -91075 -31738 -63684 -58508 -63088 -19907 -13277 43972 5814 41124 -5673
6044 -5673 -24518 -55327 -42606 33750 146514 213468 127761 41757 -7941 -94440 -120509 -151579
6032 -151579 -100051 917 -25387 -99028 -177867 -106871 22191 23662 71486 152465 117368
6021 117368 117447 93490 104743 129454 93837 21041 -51077 -52099 54878 108403 7821 -45787
6009 -45787 -105480 -112511 -122763 -29659 36168 50446 -33077 82609 47088 -16913 -24220 40932
5997 40932 55451 116186 191458 173105 13795 -57028 -48922 -73760 -149036 -40851 59956
5986E9956n9589K9555N722m9008L9058L3820l5615m695K0154J08301q4595k04599
5974a41535J08621R3654P4335N4532m8023L2741n9948m7311j7139j02001q4731
5963a36805J9704Q1067K749r2083K606K7615J20965m6077J3510j8252r4789n6379
5951a76169N6389j0760M1708J0669o1875l7258J23153J1133N6020N627M136M625
5939B7398n2093n539P4523J08747N7931j7133j11054j7510m4923m7705M2983K9636
5927D5261m2608n2933K8861J1689p3475o1822Q0152n3182q3133k4812N0700J46838
5915b8464R0095k783q7100n2375R149M1642r1871r359O8477k3948j4289J3046
5903h7780J4423Q567J02078m4147k9957m1064J5543Q5591J0202k4475R400N158
$$ plain form
5986 59956 367 29922 35644 -13364 25694 59514 23899 19204 39358 147659 63064 -141535
5974 -141535 -32914 60740 135075 189607 141584 174325 114377 67066 49927 -52074 -136805
5963 -136805 -117101 -36034 -33285 -125368 -122762 -95147 25818 -20259 -6749 -25001 -119790 -176169
5951 -176169 -119780 -130540 -88832 -78163 -140038 -177296 -54143 -43010 13010 18637 22773 27398
5939 27398 -24695 -30234 44289 153036 210967 193834 82780 65270 20347 -27358 15625 45261
5927 45261 2653 -50280 -21419 -9730 -83205 -145027 -64875 -118057 -201190 -226002 -175302 -28464
5915 -28464 61631 58848 -28252 -80627 -71478 -29836 -121707 -131066 -62589 -86537 -100826 -87780
5903 -87780 -73357 -64790 37288 -6859 -36816 -77880 -62337 23254 33456 8981 18381 23539
5891B3539n802L6114l9187r2820m2304L5237N4807K4189p0805m7158n7334k7072
5879b08596N4962J02557K8321p4602l3693R0529J5178O3006q0809q8233P7970
5868e3410P6798j0732o8968m2572Q1179J4341J38737J22940q185m0330j77063
5857C2735j0139N0692j6920l2715q560m115L6737P830M0917J04646j3646J5080
5845B02542L9330m6594o4837j21040o2745l1725J08107J45145j193p3930p0515
5834B2545M7061o342n50j17898J0878J07928p4509o793J8039N6488P3551m9035
5822H1363o6614M4122j0524M4262m51M1592j1696j8741K4893l6679k4707q7519
5810b0699o3318k2698L9546L8543M1500K9702q8624m0475J6267M6105J01159R5548
$$ plain form
5891 23539 17737 53851 14664 -78156 -120460 -85223 -30416 -6227 -77032 -124190 -181524 -208596
5879 -208596 -153634 -51077 -22756 -97358 -131051 -40522 -25344 37662 -43147 -131380 -53410
5868 -53410 23388 12656 -56312 -98884 -17705 -3364 135373 258313 250128 209798 32735
5857 32735 22596 73288 56368 23653 15093 10978 47715 55545 96462 201108 187462 202542
5845 202542 241872 195278 130441 9401 -53344 -85069 23038 168183 166990 93060 22545
5834 22545 69606 63264 62714 -55184 -44306 63622 -10887 -17680 359 56847 130398 81363
5822 81363 14749 58871 48347 92609 92158 133750 122054 103313 128206 91527 66820 -20699
5810 -20699 -84017 -106715 -67169 -28626 12874 42576 -46048 -86523 -70256 -24151 77008 172556
5798A72556K8609j01544j56713N6190J03920o7265n6254n7984M7316L8106k4882
5787a7945j25879J1490J26911O6360o9430n4017p9172M8715N5267N3031m174j05347
5775i4190K3413R3878m0307J1796n1431P0157R7368k2978o7903k9220Q995n540
5763e962M0613K1086q8990L1193j02256p0124K9733N5702M6746J82423K537m8231
5751I4470l5086J895N951n4068m6342J2765j3851Q7902m5630p7307j6615O8848
5739a7068O0851m1914K1282M702j5700k6770q7836n4338M3311K0133k1042J1945
5727a02444P4861J37518J0037o8370L0798N9705R792m4982r2309k0315m5748m9356
5715a00813R7769m1797n7826J6681M7387n1820J9203Q6859O7562m153j9685k2022
$$ plain form
5798 172556 201165 99621 -57092 -902 103018 35753 -20501 -78485 -31169 6937 -17945
5787 -17945 -143824 -132334 -5423 60937 -8493 -62510 -141682 -92967 -37700 15331 11157 -94190
5775 -94190 -70777 23101 -17206 -5410 -56841 13316 110684 87706 19803 -9417 -422 -5962
5763 -5962 34651 55737 -33253 -2060 -104316 -174440 -144707 -89005 -42259 140164 142701 94470
5751 94470 59384 61279 67230 13162 -33180 -20415 -34266 53636 8006 -69301 -85916 -17068
5739 -17068 43783 1869 23151 27853 12153 -14617 -102453 -156791 -113480 -93347 -114389 -102444
5727 -102444 -27583 109935 119972 51602 82400 142105 151897 106915 14606 -5709 -51457 -100813
5715 -100813 -3044 -44841 -102667 -85986 -38599 -90419 -71216 15643 83205 79052 59367 37345
5703C7345j6333l6147J2421l92N1173k6665j0133L0714K3594J5910Q6870M8432
5691B16789j61239p6240m7104N3457K4478p1918P8280Q5183j7589o9038R279o9973
5679d5635n4986N9971k0078q123R1383P0016M676k8848j5423n8285j8774L1809
5667G703R1751P8349m2032j8207j06660K7987k3897p6179m2769l734o0707J22216
5655d6179K802o6231l6215N3193J5925p1045O7155O2746O9607q272j32084j04129
5643a92727O636k2734N1329P6913O952P5515N7915M4387N6186m8996N2r78j4143
5630I6307k4280J11714n6333k0713q6314J1737L8935k8007l9886o6484J48j4440
5618g7616n0729j2552N6793K6428r5788j239k4056Q4647N6736j2634K4233N3832
$$ plain form
5703 37345 21012 -15135 -2714 -3106 48067 21402 11269 41983 65577 81487 168357 216789
5691 216789 55550 -20690 -67794 -14337 10141 -61777 16503 101686 84097 15059 24338 -45635
5679 -45635 -100621 -40650 -60728 -68851 22532 92548 97224 68376 52953 -5332 -24106 7703
5667 7703 99454 177803 135771 117564 10904 38891 14994 -61185 -103954 -107688 -168395 -46179
5655 -46179 -43377 -109608 -145823 -92630 -76705 -147750 -80595 -17849 51758 43486 -88598 -192727
5643 -192727 -186091 -208825 -157496 -80583 -73631 1884 59799 104186 160372 111376 111428 110450 96307
5630 96307 72027 183741 127408 106695 20381 32118 71053 43046 3160 -63324 -63176 -77616
5618 -77616 -128345 -140897 -84104 -57676 -153464 -154703 -178759 -94112 -37376 -50010 -25777 28055
5606B8055o610o8069q5078m5042L9037J57979J23772j8033j36537r0366K4890
5595g6002J34476L5170M0037Q4103n6275o8078k4929r5619r3722P0176j8519K9322
5583c9860Q3353J18198k7917j07883p0830o3163n6781L9166l9042n5244K2786
5572a97217N7775l9279j00373J26122l7313J5330Q7132J14075N5498j3198o5637
5561B915P3789j560l9645L6499k316j1941o1682j28867l9455j5435j4678P89L9016
5548a62571P0029o4208M6651Q211Q3300M4751K7839l2445j8751K1387n2701o0920
5536h9428n0606R2444J59015o8373r0717j00666M9054M8491r4752l5143O1222
5525a19459R0732O9498q3576j18782K9382O3961J16946R695m4749j12668j5000
$$ plain form
5606 28055 21445 -46624 -131702 -176744 -137707 20272 144044 126011 -10526 -100892 -76002
5595 -76002 58474 93644 133681 217784 161509 93431 68502 -27117 -120839 -50663 -69182 -39860
5583 -39860 43493 161691 133774 25891 -44939 -108102 -164883 -125717 -164759 -220003 -197217
5572 -197217 -139442 -178721 -279094 -152972 -190285 -174955 -87823 26252 81750 68552 2915
5561 2915 76704 75144 35499 71998 69682 57741 -3941 -132808 -172263 -187698 -202376 -201587 -162571
5548 -162571 -92542 -156750 -110099 -101888 -18588 26163 54002 21557 2806 24193 -28508 -89428
5536 -89428 -140034 -47590 111425 43052 -47665 -148331 -99277 -50786 -145538 -180681 -119459
5525 -119459 -28727 40771 -42805 -161587 -132205 -68244 48702 58397 13648 -99020 -114020
5514a14020J9149P1563j3504l8604O5426L3544m6954M8355J7194l0779N5339n829
5502F0880J9233j02600l1204J7139o7132M8415L755J2109N2778j01148J52446
5491F4671Q7702k3416p2744j48407q2519J4843O6124n0862j7004J24006P5391
5480C7785J5535M8316L3858r081p6829j36380o5910J7627L9495m2955o7310j0215
5468b16064O0410N8366n1270K0707N7869P6779N6136K6114R0130j66067j12481
5457i9371J2763N4785J0542o2757M0404j1292Q4058l6595M1295M5850k348J5373
5445I2707j7884q3343q6887n9788j5215P7213M7123L1809P0160Q387K1549J4704
5433A00535r0348n6308m2150N6064R2664l9566l3936L5551K6749r7845r2378j35780
$$ plain form
5514 -114020 -94871 -23308 -36812 -75416 -9990 23554 -23400 24955 42149 11370 66709 60880
5502 60880 80113 -22487 -53691 -36552 -103684 -55269 -51514 -39405 13373 -87775 64671
5491 64671 152373 128957 56213 -92194 -174713 -159870 -93746 -144608 -161612 -37606 37785
5480 37785 53320 101636 135494 126413 49584 -86796 -152706 -135079 -95584 -138539 -205849 -216064
5468 -216064 -155654 -97288 -148558 -127851 -69982 6797 62933 89047 179177 13110 -99371
5457 -99371 -86608 -31823 -21281 -84038 -43634 -54926 29132 -7463 33832 79682 77334 92707
5445 92707 74823 -8520 -95407 -155195 -170410 -93197 -46074 -14265 55895 64282 85831 100535
5433 100535 10187 -46121 -88271 -32207 60457 20891 -13045 22506 49255 -48590 -140968 -276748
5421b76748J23042O7789O2410N1738M9853k9877J2463R703m7239M4752M2372m6133
5409F4125o4641j9313k0515j9687l81j7524j0119J24993O0053M5996m5787Q0276
5397A77476K0533m2294l8459K2701p0635j32312j27464P525M4589M4967o673J1685
5385h8361m6004o0893R9264L2110p2895k845J8817m2884m8386R8247J41467L3049
5373F0686O443o239l6947k0569O5527J3636O703L7120L1404p8009o3985L8719
5361E4489M2832m7498o749R2286M2521j03107r3560p6397k3027r6604m6200M8394
5349b12620J8538K2993M7074P2533m5901L6996K7033J13928p749j33716n2236
5338a13127R494J01667O972J8641l797J5957N9651K072l4012l3202m6351m6741
$$ plain form
5421 -276748 -153706 -85917 -23507 28231 78084 48207 60670 70373 23134 67886 110258 64125
5409 64125 -516 -19829 -40344 -60031 -60412 -77936 -88055 36938 96991 142987 97200 177476
5397 177476 198009 155715 117256 139957 69322 -62990 -190454 -182929 -138340 -93373 -100046 -88361
5385 -88361 -134365 -195258 -95994 -63884 -136779 -139624 -120807 -163691 -212077 -113830 27637 60686
5373 60686 67129 60890 23943 3374 68901 82537 89240 126360 157764 79755 15770 54489
5361 54489 97321 49823 43074 135360 177881 74774 -18786 -95183 -118210 -214814 -261014 -212620
5349 -212620 -194082 -171089 -124015 -51482 -97383 -60387 -33354 80574 72825 -60891 -113127
5338 -113127 -103633 -1966 5006 23647 19850 35807 95458 97530 63518 30316 -16035 -62776
5326f2776M9216M5191n0165r0779n0172j2506J36361J69921L0925o6930m7983
5315E0303m2522m8202l4162J3221m0945L474j9785m9059J3018K0658K7091K1589
5303h5321n312N02l9205J09459J77441O8915n4788r0970j15819k4888q605o4566
5291a33157m0028o752R6888O4063m649j0621k258m5320j9201J8636L7578K3108
5279b1713j88698k2989L4067K7127m2977J02885N6127J5218m8312j23985o9330
5268b82580N5541M0207L209Q4527N5948l9341p0633j3986m5421l8439J1775O6670
5256a72523J72901N4798p0598m3071K4510O1218j1467o6563K3560N9484j0266
5245B1983M4513m0807j56873j01466K6794O9396o108O2547J14128K3629l058J91
$$ plain form
5326 -62776 -13560 31631 -18534 -109313 -159485 -171991 -35630 134291 165216 98286 50303
5315 50303 7781 -40421 -74583 -61362 -102307 -98833 -118618 -167677 -154659 -134001 -106910 -85321
5303 -85321 -90633 -90131 -129336 -19877 157564 226479 171691 80721 -35098 -59986 -68591 -133157
5291 -133157 -173185 -179937 -83049 -18986 -23635 -34256 -36514 -81834 -101035 -82399 -44821 -21713
5279 -21713 -210411 -233400 -199333 -172206 -215183 -112298 -56171 -40953 -89265 -213250 -282580
5268 -282580 -227039 -186832 -183623 -99096 -43148 -82489 -153122 -167108 -212529 -250968 -239193 -172523
5256 -172523 378 55176 -15422 -58493 -33983 27235 15768 -50795 -27235 32249 21983
5245 21983 66496 25689 -131184 -232650 -205856 -136460 -142568 -80021 34107 57736 54678 54869
5233E4869J3393l2524R0744L0527n4427j33092n1587L9156J51847L3946k5975
5222A16877j4929K3246k863j30402n7184o4138Q1288N9989m1802j28885L7097
5211a21706N5013M2539N3587O9381M3955m2479n7506j8056l6532j9548M5101O8312
5199H2061M2228Q41j27594m8413K4668L3331l7905p5023n8257n879L5428Q0081
5187e4433n4228j7626j631R1550o2012n3196L6434O9994L9575l7826K3095l5670
5175e5974n2659p0405l7682O3398N0360O1691k0691L1806O856o9599j3164L2786
5163g3277K1411l379N3008K3210p2383L1742N3199j21837J4422P5335Q6115m3181
5151D4385o7812j8969Q2361n1942N0866N5846O6671k8890j11995o6058p999N8971
$$ plain form
5233 54869 68262 35738 126482 157009 102582 -30510 -82097 -42941 108906 142852 116877
5222 116877 101948 125194 122331 -8071 -65255 -129393 -48105 11884 -29918 -158803 -121706
5211 -121706 -66693 -24154 29433 98814 142769 100290 42784 24728 -11804 -31352 13749 82061
5199 82061 124289 125130 -2464 -50877 -26209 7122 -30783 -105806 -164063 -169942 -134514 -54433
5187 -54433 -108661 -126287 -127918 -36368 -98380 -151576 -115142 -45148 -5573 -43399 -20304 -55974
5175 -55974 -108633 -179038 -216720 -153322 -102962 -41271 -61962 -30156 -23300 -92899 -106063 -73277
5163 -73277 -51866 -55245 -2237 20973 -51410 -19668 33531 -88306 -73884 1451 87566 44385
5151 44385 -23427 -42396 39965 -11977 38889 94735 161406 132516 20521 -45537 -53536 5435
5139E435N7749m2186q9606n8149M966N9655n0208n8251P3222P1901R5225P3370
5127A43123p5957j08576r1P9295q6693n9836J2477n010Q6503N7027O1050K647
5115A05959j04298k11433p5951R548J85349N6311m7974P141m8814O6844M6871
5104a0447Q168m6461n9811n4891J0910o281M5470M5844K5347J533M1717K1675
5092B2773p246j9789O1690l7425j03019q7416j4296Q2521N0324Q2937n0112J3488
5080e570J8887j19835Q836Q7701P9848j2769K4100p1574O4995n5981j74440r9284
5068b55086R865O9350M4067L8929Q7045N266J891N6068P8993Q1843J5840j44100
5056H9971r5871J07427l0976N3086n4660r7060p4836M208K0272J06495n0203m4546
$$ plain form
5139 5435 63184 20998 -68608 -126757 -121791 -62136 -112344 -170595 -97373 -25472 69753 143123
5127 143123 67166 -41410 -41501 37794 -48899 -108735 -96258 -101268 -14765 42262 103312 105959
5115 105959 1661 -209772 -285723 -276175 -90826 -34515 -82489 -75348 -124162 -57318 -10447
5104 -10447 -2279 -48740 -108551 -163442 -152532 -158813 -113343 -67499 -42152 -40619 1098 22773
5092 22773 15527 -4262 57428 20003 -83016 -170432 -184728 -102207 -51883 31054 -19058 -5570
5080 -5570 13317 -106518 -97682 -9981 69867 57098 81198 9624 74619 18638 -155802 -255086
5068 -255086 -245221 -175871 -131804 -92875 -5830 -564 1327 57395 136388 218231 234071 89971
5056 89971 -5900 101527 70551 123637 68977 -28083 -102919 -98711 -78439 28056 -22147 -66693
5044f6693k0698J459q1433k8855P6615J48877n227j08374O0363n1772m3843Q3432
5032c6149k2741K9231o434K3709m5187J20818N6713o0188n4840M228q5057L4103
5020d1794J8094M5097P646o2625j1351j3737j5971P0067p5297l3347L5424l8767
5008a16561M6431O6978O787L6767p094j36078o2190M0825K2141J3001j7405N8643
4996d7755k2152l9021q9070L500J61469J2319p0740k1360J05475L6569j9364n0353
4984d0483j9795n4659m2429K6455j04774Q4921M7998J09045N4464K1118K2688
4973A04549j10352k8874Q9339P6918L2345j30151j6077q6503l4826J7537j01940
$$ plain form
5044 -66693 -87391 -85932 -167365 -196220 -119605 29272 24045 -84329 -23966 -75738 -119581 -36149
5032 -36149 -58890 -29659 -36093 -12384 -57571 63247 119960 59772 4932 9160 -75897 -41794
5020 -41794 -23700 21397 29043 -33582 -44933 -58670 -74641 -4574 -79871 -113218 -77794 -116561
5008 -116561 -70130 -3152 3635 40402 33308 -102770 -164960 -124135 -101994 -88993 -106398 -47755
4996 -47755 -69907 -108928 -197998 -194498 -33029 -20710 -91450 -112810 -7335 29234 9870 -40483
4984 -40483 -60278 -114937 -157366 -130911 -235685 -150764 -102766 6279 60743 81861 104549
4973 104549 -5803 -34677 54662 131580 163925 33774 17697 -68806 -103632 -86095 -188035
$$ [...]
##END NTUPLES=NMR SPECTRUM
##END=
