##TITLE=Analysis number 330030
Compound Code cc 63708
Book Reference 464/190/1
Project Code adrs
Chemist Name chrisr
##JCAMPDX= 6.0         $$ Bruker NMR JCAMP-DX V2.0
##DATA TYPE= NMR SPECTRUM
##DATA CLASS= NTUPLES
##ORIGIN= Bruker BioSpin GmbH
##OWNER= nmr
$$ XWIN-NMR		Version 3.5
$$ Mon Oct 22 12:24:39 2007 GMT Daylight Time (UT+1h)  MAYBRIDGE\nmr@NMR_250MHZ
##.OBSERVE FREQUENCY= 250.131544655141
##.OBSERVE NUCLEUS= ^1H
##.ACQUISITION MODE= SIMULTANEOUS (DQD)
##.ACQUISITION SCHEME= undefined
##.AVERAGES= 16
##.DIGITISER RES= 18
##SPECTROMETER/DATA SYSTEM= dpx250
##.PULSE SEQUENCE= zg30
##.SOLVENT NAME= CDCl3
##.SHIFT REFERENCE= (INTERNAL, CDCl3, 0, 16.4388)
##AUDIT TRAIL= $$ (NUMBER, WHEN, WHO, WHERE, WHAT)
$$ ##TITLE= Audit trail, XWIN-NMR		Version 3.5
$$ ##JCAMPDX= 5.01
$$ ##ORIGIN= Bruker BioSpin GmbH
$$ ##OWNER= nmr
$$ C:\u/data/dgb/nmr/ADRS/1010/pdata/1/auditp.txt
$$ ##AUDIT TRAIL=  $$ (NUMBER, WHEN, WHO, WHERE, WHAT)
(   1,<2007-10-22 12:24:10.96 +100>,<MAYBRIDGE\nmr>,<NMR_250MHZ>,
      <created by zg, POWCHK disabled, PULCHK disabled
       configuration hash MD5:
       76 6E 9A 78 1E 09 19 81 EC 84 63 8F B0 6A 59 2D
       data hash MD5: 64K
       96 B3 A7 28 B5 9C 15 77 6A 71 DA 78 AA 4E 22 29>)
(   2,<2007-10-22 12:24:26.57 +100>,<MAYBRIDGE\nmr>,<NMR_250MHZ>,
      <Start of raw data processing
       ef LB = 0.3 FT_mod = 6 PKNL = 1 SI = 32K 
       data hash MD5: 32K
       FC C9 25 62 F4 BC D8 1C 11 E6 E0 40 83 C5 52 5F>)
(   3,<2007-10-22 12:24:28.20 +100>,<MAYBRIDGE\nmr>,<NMR_250MHZ>,
      <apk 
       data hash MD5: 32K
       C1 27 79 35 E9 08 5D 3D 4D D5 C9 FA 89 0C 6C D4>)
(   4,<2007-10-22 12:24:28.92 +100>,<MAYBRIDGE\nmr>,<NMR_250MHZ>,
      <abs ABSG = 5 
       data hash MD5: 32K
       63 92 AB 13 CF 25 D6 AF BD 75 3B 52 31 68 1C AC>)
$$ ##END=
$$ 
$$ hash MD5
$$ DC 7F C9 00 25 59 20 BD 15 C2 A3 E5 A1 62 80 D5
##$RELAX= 
##$RELAX= 
##$RELAX= 
##$RELAX= 
##$RELAX= 
##$RELAX= 
##$RELAX= 
$$ Bruker specific parameters
$$ --------------------------
##$DU= <C:\u>
##$EXPNO= 1010
##$NAME= <ADRS>
##$PROCNO= 1
##$TYPE= <nmr>
##$USER= <dgb>
##$AMP= (0..31)
100 100 100 100 100 100 100 100 100 100 100 100 100 100 100 100 100 100 
100 100 100 100 100 100 100 100 100 100 100 100 100 100 
##$AQSEQ= 0
##$AQ_mod= 3
##$AUNM= <au_zg>
##$AUTOPOS= <23 >
##$BF1= 250.13
##$BF2= 250.13
##$BF3= 250.13
##$BF4= 250.13
##$BF5= 500.13
##$BF6= 500.13
##$BF7= 500.13
##$BF8= 500.13
##$BYTORDA= 1
##$CFDGTYP= 0
##$CFRGTYP= 5
##$CHEMSTR= <none>
##$CNST= (0..31)
1 1 145 1 1 1 1 1 1 1 1 1 1 1 1 1 1 1 1 1 1 1 1 1 1 1 1 1 1 1 1 1 
##$CPDPRG= <>
##$CPDPRG1= <>
##$CPDPRG2= <>
##$CPDPRG3= <>
##$CPDPRG4= <mlev>
##$CPDPRG5= <mlev>
##$CPDPRG6= <mlev>
##$CPDPRG7= <mlev>
##$CPDPRG8= <mlev>
##$CPDPRGB= <>
##$CPDPRGT= <>
##$D= (0..31)
0 1 0 0 0 0 0 0 0 0.06 0 0 0 0 0 0 0.0002 0 0 0 0 0 0 0 0 0 0 0 0 0 0 
0 
##$DATE= 1193052250
##$DBL= (0..7)
120 120 120 120 120 120 120 120 
##$DBP= (0..7)
150 150 150 150 150 150 150 150 
##$DBP07= 0
##$DBPNAM0= <>
##$DBPNAM1= <>
$$ [...]
##$SUBNAM7= <"">
##$SUBNAM8= <"">
##$SUBNAM9= <"">
##$SW= 20.6930455092707
##$SWIBOX= (0..15)
0 0 3 0 0 0 0 0 0 0 0 0 0 0 0 0 
##$SW_h= 5175.983436853
##$TD= 65536
##$TD0= 1
##$TE= 296.16
##$TE2= 300
##$TE3= 300
##$TEG= 300
##$TL= (0..7)
0 120 120 120 120 120 120 120 
##$TP= (0..7)
150 150 150 150 150 150 150 150 
##$TP07= 0
##$TPNAME0= <>
##$TPNAME1= <>
##$TPNAME2= <>
##$TPNAME3= <>
##$TPNAME4= <>
##$TPNAME5= <>
##$TPNAME6= <>
##$TPNAME7= <>
##$TPOAL= (0..7)
0.5 0.5 0.5 0.5 0.5 0.5 0.5 0.5 
##$TPOFFS= (0..7)
0 0 0 0 0 0 0 0 
##$TUNHIN= 0
##$TUNHOUT= 0
##$TUNXOUT= 0
##$USERA1= <user>
##$USERA2= <user>
##$USERA3= <user>
##$USERA4= <user>
##$USERA5= <user>
##$V9= 5
##$VALIST= <valist>
##$VCLIST= <CCCCCCCCCCCCCCC>
##$VD= 0
##$VDLIST= <DDDDDDDDDDDDDDD>
##$VPLIST= <PPPPPPPPPPPPPPP>
##$VTLIST= <TTTTTTTTTTTTTTT>
##$WBST= 1024
##$WBSW= 4
##$XGAIN= (0..3)
0 0 0 0 
##$XL= 0
##$YL= 0
##$YMAX_a= 388813
##$YMIN_a= -492279
##$ZGOPTNS= <>
##$ZL1= 120
##$ZL2= 120
##$ZL3= 120
##$ZL4= 120
##$ABSF1= 16.43883
##$ABSF2= -4.254343
##$ABSG= 5
##$ABSL= 3
##$ALPHA= 0
##$AQORDER= 0
##$ASSFAC= 0
##$ASSFACI= 0
##$ASSFACX= 0
##$ASSWID= 0
##$AUNMP= <proc_1d>
##$AZFE= 0.1
##$AZFW= 0.1
##$BCFW= 0
##$BC_mod= 0
##$BYTORDP= 0
##$COROFFS= 0
##$CY= 12.5
##$DATMOD= 1
##$DC= 0
##$DFILT= <>
##$DTYPP= 0
##$F1P= 14.0000005364418
##$F2P= -0.99999901652339
##$FCOR= 0.5
##$FTSIZE= 32768
##$FT_mod= 6
##$GAMMA= 0
##$GB= 0
##$INTBC= 1
##$INTSCL= 1
##$ISEN= 128
##$LB= 0.3
##$LEV0= 0
##$LPBIN= 0
##$MAXI= 10000
##$MC2= 0
##$MEAN= 0
##$ME_mod= 0
##$MI= 0
##$NCOEF= 0
##$NC_proc= -3
##$NLEV= 6
##$NOISF1= 0
##$NOISF2= 0
##$NSP= 0
##$NTH_PI= 0
##$NZP= 0
##$OFFSET= 16.43883
##$PC= 1
##$PHC0= 157.3335
##$PHC1= 8.828093
##$PH_mod= 1
##$PKNL= yes
##$PPARMOD= 0
##$PSCAL= 4
##$PSIGN= 0
##$REVERSE= no
##$SF= 250.130020801506
##$SI= 32768
##$SIGF1= 0
##$SIGF2= 0
##$SINO= 400
##$SIOLD= 32768
##$SREGLST= <1H.CDCl3>
##$SSB= 0
##$STSI= 32768
##$STSR= 0
##$SW_p= 5175.98343685301
##$SYMM= 0
##$S_DEV= 0
##$TDeff= 65536
##$TDoff= 0
##$TI= <Analysis number 999999
Compound Code 99
Book Reference 9
Project Code 9>
##$TILT= no
##$TM1= 0
##$TM2= 0
##$TOPLEV= 0
##$USERP1= <user>
##$USERP2= <user>
##$USERP3= <user>
##$USERP4= <user>
##$USERP5= <user>
##$WDW= 1
##$XDIM= 32768
##$YMAX_p= 490595914
##$YMIN_p= -132718
$$ End of Bruker specific parameters
$$ ---------------------------------
##NTUPLES= NMR SPECTRUM
##VAR_NAME=  FREQUENCY,     SPECTRUM/REAL,   SPECTRUM/IMAG
##SYMBOL=    X,             R,               I
##VAR_TYPE=  INDEPENDENT,   DEPENDENT,       DEPENDENT
##VAR_FORM=  AFFN,          ASDF,            ASDF
##VAR_DIM=   32768,         32768,           32768
##UNITS=     HZ,            ARBITRARY UNITS, ARBITRARY UNITS
##FACTOR=    0.157963299565203, 1,           1
##FIRST=     4111.84474527654, 0,            0
##LAST=      -1064.13869157647, 0,           0
##MIN=       -1064.13869157647, -132718,     0
##MAX=       4111.84474527654, 490595914,    0
$$ Real data points
##PAGE= N=1
##DATA TABLE= (X++(R..R)), XYDATA
$$ [...]
28956 -58449 -37113 35290 44837 32215 12276 10331 26589 26811 47786 6710 -17473 -48130
28944 -48130 -53135 -30440 -14581 15215 26293 29648 -11616 2556 21858 -23538 -52435 -30942
28932 -30942 -28474 -19071 81 -1963 -20922 21884 10609 1601 -20932 -26542 -41867 -27032 7947
28919 7947 23538 -8547 -5726 9875 38728 32347 17041 50590 58326 39058 -14545 -19672 -12532
28906 -12532 5330 -18325 -30463 -6106 -7944 -27551 -18149 9764 6099 6961 11034 20560 39061
28893 39061 63695 36358 42364 82721 33453 38058 50927 21518 11613 8377 6737 25687 18147
28880 18147 -1849 12506 47021 32570 15430 9776 -4383 -8874 -26533 -32761 4236 25696
28868 25696 47467 15135 -18477 -12045 7373 -4037 -7890 23711 36412 17538 15633 7920
28856 7920 4208 30307 10929 -31140 -3333 6914 -13288 3407 24405 23681 18134 11921 -1726
28843 -1726 -6600 -20272 -9794 30665 24709 14259 -3326 -39355 -42171 -16246 20724 8452
28831 8452 -27290 -32153 -29124 -16902 -17405 -13476 -42556 -33316 -11989 -15333 8783 7506 18900
28818 18900 37512 34239 25457 22702 31481 12682 -18596 -6024 -24038 -35576 -21403 -6539
28806 -6539 -19110 695 8684 5972 2290 -2054 415 18946 3606 -10511 2422 10266 29339
28793 29339 45377 9187 10795 13990 19901 -5502 -32903 2132 41297 68923 27378 -15518
28781 -15518 -24771 -12357 -5519 33729 54929 74197 61471 46639 36797 -25385 -27272 -51161
28769 -51161 -55427 -42414 -44277 -12022 -37022 -53191 -75115 -11046 19124 11375 24027 29437
28757 29437 11293 4697 -27901 -14053 3221 -20362 -33273 -16106 -20941 -11571 -21689 -867
28745 -867 -4606 -1530 6490 7460 674 -16415 -24260 8984 41024 21331 20118 -3218 -24370 -32439
28731 -32439 1748 8979 -5071 -22470 -31161 -33004 -19722 -11760 -31340 -12698 27760 33537 24245
28718 24245 34166 -1554 -7450 -7419 -12896 -9310 -21328 -5859 -5049 -6559 -14814 -33300 -40115 -41862
28704 -41862 -47919 -32028 -9074 594 -14899 -2914 -26367 -21058 10700 -2752 -13100 -24485
28692 -24485 -28495 -5227 4435 -18725 23448 18809 -11885 -18271 -20565 -21404 -60012 -30308 -37666
28679 -37666 -74894 -67735 -28292 -3680 16 7602 13051 18777 10093 -13495 -40725 -38469 -67713
28666 -67713 -92405 -67221 -28078 7451 -717 -17315 -1362 -340 -6315 -18578 4968 -12071
28654 -12071 -25689 -28749 -4250 6402 -1972 -23709 -50510 -68407 -39827 -38185 -55379 -28680
28642 -28680 -21059 -43729 -30483 5023 12582 58535 59202 35630 49837 3133 -23537 -13593 -31452
28629 -31452 -42879 -24077 4418 11592 2867 12898 -1300 12928 13668 30549 30885 -9684 15129
28616 15129 40235 37242 30580 23214 12484 11069 15191 8716 -13786 -31024 -39508 -32743 -47997
28603 -47997 -50204 -79268 -43327 -28567 -42692 -28143 -12192 -16581 -58884 -51776 -17174 19453
28591 19453 34060 14021 -2105 -28885 -74479 -79071 -51029 -49168 -47369 -39689 -30273 -15341 -49131
28578 -49131 -54205 -22874 -3505 18854 37156 46794 52209 55044 15748 17099 51627 38837 25820
28565 25820 -8687 -4304 -16712 -32239 -9878 -1573 -15459 29329 53765 59877 37275 31942
28553 31942 30285 7458 4358 14592 7664 -49025 -77144 -74350 -47011 -13710 -29543 -5039
28541 -5039 19946 36038 -8922 -39623 -38634 -53728 -45275 -12002 14557 35988 29469 26066 22809
28528 22809 3019 11746 26009 12795 3977 -500 -7073 -25803 -45686 -29160 -5829 32584
28516 32584 14061 -7599 -36632 -36703 -14350 -5387 2183 2441 -19191 -54842 -89554 -107492 -107239
28503 -107239 -91185 -79090 -62591 -39651 104 12948 746 267 10179 -23323 -52406 -19512
28491 -19512 42177 48347 42071 70293 93369 102101 102528 85122 51354 32196 39403 20613 10080
28478 10080 7253 11205 26336 43987 30265 8329 -5655 8267 -5171 -27031 -40713 -63132
28466 -63132 -63141 -41404 907 -1175 -13569 7139 57096 83295 97656 86414 55453 52857 44383
28453 44383 55317 63306 41826 11586 -13227 -14616 -11161 -3222 -24698 -3779 23983 1540
28441 1540 -6983 5420 907 31657 32869 38374 24305 29310 27740 26967 16560 16495 -6737 -46551
28427 -46551 -33793 -13517 8458 -375 35636 81932 81204 66691 36898 17446 7683 18072
28415 18072 47839 11582 15785 46209 38059 27378 9679 -27664 -28577 941 -6753 -27553 -22649
28402 -22649 -42631 -50623 -1633 51838 39154 21203 43605 39405 19763 -2208 -3068 8991
28390 8991 -23170 -42888 -45641 -23718 -60386 -82636 -60666 -52777 -52381 -33952 -53855 -27579 -3886
28377 -3886 -27757 -21295 -9370 24803 59290 21900 -3494 -39706 -61969 -30404 -41554 -60929
28365 -60929 -75131 -76044 -68473 -32265 19052 32777 19765 12062 18958 43730 51386 58562 12687
28352 12687 -24075 -35520 -17070 6690 35070 19215 7714 -6315 -67335 -62208 -49093 -63441
28340 -63441 -51427 -24714 -10755 13557 31240 54333 67970 80929 92555 121189 119060 67975
28328 67975 52534 31730 33203 46086 39011 26082 40178 24279 18099 21462 1197 1953 33486
28315 33486 51957 57620 47239 49016 14004 28496 62706 51975 11606 -31175 -36905 -14764
28303 -14764 1799 -2983 -14895 -34315 -42944 -23557 -15526 5460 -25502 -29927 -29727 -32270 -22119
28290 -22119 -12508 -39484 -22893 -10351 34495 59661 -4386 -20093 139 7162 -14812 -37801
28278 -37801 -36709 -37679 -26241 -21599 -26052 -9952 24999 21316 1931 -6147 3602 42848 40749
28265 40749 17661 27830 40006 41570 14615 3450 5127 6651 10490 -7155 -59069 -71550
28253 -71550 -31397 -45838 -29950 -23956 -7597 20312 -7961 -30571 176 25604 43845 3572
28241 3572 -7978 -9630 -28341 -68652 -53124 -43363 -22029 7284 -5864 3231 30494 34795 -13411
28228 -13411 -33155 -8991 9876 18424 -1173 -19699 -22339 5444 -21571 -19398 -4699 16579
28216 16579 19960 16785 26513 -1189 -12442 -35326 -29119 -18893 -24600 -19937 2783 6808 -10893
28203 -10893 -11155 19983 8358 9689 -11605 -51921 -20241 -3955 2038 27657 21747 15615 17687
28190 17687 831 -909 -24316 -27924 -34899 -41543 -67728 -50608 -22118 -865 4486 1792 35639
28177 35639 36488 33735 37249 51567 37024 -2303 -25064 4408 6141 912 19031 35026 46598
28164 46598 47275 64211 38057 34551 63198 70971 65096 32345 32630 23371 26595 -2409 -27536
28151 -27536 -24366 -1655 -11769 -24127 -37608 -37647 -4516 16346 11863 753 5096 15549 3471
28138 3471 -3706 36732 65245 59391 52679 28881 12609 -8105 -11555 -6202 -37240 -53688 -16229
28125 -16229 -3547 15147 17297 40279 56020 69481 67345 77964 74721 29912 -1505 -24071
28113 -24071 -1976 -650 -8359 -4657 -5121 -910 -26106 -28061 -28587 -32921 -37797 -12376 -4161 -3926
28099 -3926 -26664 -21555 -40007 -54818 -13148 -30802 -46513 -31962 -24320 -30946 -56806 -107424
28087 -107424 -100433 -78497 -79003 -77512 -43467 29 3902 -4371 -48416 -77812 -56623 -43498 -23416
28074 -23416 -37651 -57838 -12000 -2866 -32570 -18779 -3403 2213 -13501 -19841 6070 19190
28062 19190 4231 15236 35888 21961 -13692 -30407 -9106 -34731 -30803 -24173 4832 -405
28050 -405 -10337 -305 -5650 1554 -1246 6011 -46699 -87298 -62563 -22238 -14957 -22907 -15330 -20477
28036 -20477 -25968 -12342 -9288 376 -4036 -10729 -16998 -3938 139 -6429 -6338 -26781 -24838 2624
28022 2624 16553 25033 37102 31071 9394 22835 22359 29636 27275 23843 10964 -14303 -6509
28009 -6509 2884 -6356 -12149 6725 24927 3746 -23731 -2666 9478 -5829 -2152 11245 17521
27996 17521 33473 10856 14591 -12740 -22464 -10809 -4046 33990 10696 -17573 3331 16889
27984 16889 14821 11491 16935 -3711 -34377 -34139 -33267 -10910 -13070 -26716 1036 19409 19126 5551
27970 5551 -7940 -20358 -57337 -41069 -2154 35645 38910 12634 1988 5952 -9587 -16875
27958 -16875 2727 36037 47615 71815 37705 -9452 13442 30112 -9406 -25799 -14769 -19664
27946 -19664 -23305 -21599 11176 52346 65562 70497 48084 -1069 -2049 17321 511 -5340 -27449
27933 -27449 -13870 1636 -5266 13084 16299 5819 17023 4078 8083 36922 37071 10243 -25244
27920 -25244 1783 5757 -1443 8717 -20864 -11864 -11530 -19014 -10317 -15971 -17840 -13413 -23558 -40671
27906 -40671 -55663 -65319 -72918 -63450 -54373 -71533 -70729 -45133 -46914 -32587 2131 -12511 -47790
27893 -47790 -60184 -30622 2036 11817 25244 33968 25759 -1670 4920 -4202 1971 231 -9098
27880 -9098 -10590 9265 3564 -15428 -22533 -15561 -25458 -8666 20513 -58 -19639 -12470 -15699
27867 -15699 -11653 -7474 -976 20853 49363 2483 -19952 -9054 11211 38719 25441 22448
27855 22448 25271 38364 43131 29199 39729 81926 76177 21269 8105 -28727 -20139 26710
27843 26710 20296 -10353 18426 24893 1896 -16320 -17916 -4766 -12174 -18460 5184 25776 30674
27830 30674 14312 32303 51696 39959 21460 -14863 -2507 9683 -22539 -51315 -71544 -43542
27818 -43542 -27580 -28493 -1624 24093 47435 35795 47705 23183 9527 3989 -8878 2424
27806 2424 13833 18653 11128 7888 8106 -9281 -2264 -26120 -8327 -871 -6310 22048 25951 -4162
27792 -4162 -79995 -79055 -55902 -33755 -29185 -41116 -27694 -10184 8514 1886 -2522 -1666 -14574
27779 -14574 -17 20215 26019 31016 32776 -6696 -20225 -14712 -21586 -39040 -25010 -44128 -59011
27766 -59011 -23651 18219 19891 -16794 -45527 1481 7307 14256 5451 -19271 -18574 3133 -24611
27753 -24611 -14390 23273 49113 39516 30217 -7906 -27115 -29811 -4155 -474 8090 -22134 -60434
27740 -60434 -32418 -660 -24065 -16652 27211 49852 57552 56501 27522 -21225 -7520 -5501
27728 -5501 -468 40569 37310 36687 13524 23449 25582 25518 9640 -20234 -24175 -22589 -674 -9573
27714 -9573 -26876 -29817 -14760 -4446 -5240 20664 73151 138849 185756 105529 46846 55250 74881
27701 74881 64548 9830 -14330 22346 69063 79136 54999 21979 -15897 -47279 -68924 -76447
27689 -76447 -47141 -18524 19983 4155 -3279 2477 14636 43486 6033 -15153 4622 15818
27677 15818 36353 32711 31206 2416 -16122 -21453 -28974 -39575 -44524 -10469 23640 55008 50916
27664 50916 29046 10368 11018 8358 4772 -13359 -28555 21261 39483 38732 13830 7612 -7259
27651 -7259 -39868 -51853 -57826 -46109 5236 4772 -4385 1042 -17205 -34190 -26870 -9817 6118
27638 6118 24315 15093 -6844 -18918 118 26143 -5415 11359 10305 -7409 -19982 -31568
27626 -31568 -20162 -16107 -7961 -3788 14724 20628 -4248 -2938 -2273 5496 26130 72801 60077
27613 60077 44697 80803 82467 14524 6450 439 17681 -8738 -48641 -61314 -28160 -4928
27601 -4928 21159 31785 52066 37949 8311 26034 33664 14900 25009 40556 57005 3045
27589 3045 -48210 -41747 -2169 -3760 6445 27703 25376 19710 8383 -9936 -25452 -35520 -58585
27576 -58585 -42858 -12911 -1583 9054 15684 -14466 -40913 -47805 -9391 21405 11036 -21451
27564 -21451 -29694 -33090 -46894 -45771 -48047 -19279 -4753 -23835 -45974 -73535 -62285 -56156 -44514
27551 -44514 -64918 -59020 -29415 -17669 -39064 -53196 -36349 -22751 -6706 20734 26106 19941
27539 19941 17830 -123 18986 8297 -14039 -21175 985 34076 51742 66589 66254 83135
27527 83135 54084 4938 4485 19143 35069 22104 -8786 -59285 -68690 -6657 11807 -11603
27515 -11603 -26523 -15722 -9637 -2480 6828 38576 30352 32683 66309 29756 33428 46988 35251
27502 35251 -3738 5859 35493 -6692 -32804 -16490 -4237 -42281 -42199 -19551 -22144 -22829 -12162
27489 -12162 27752 11737 -14616 9376 16985 13738 22597 46658 20259 -16119 -42841 -47432
27477 -47432 -67444 -82514 -48898 -36691 -31198 3547 14186 12109 -2012 -56617 -68327 -62918
27465 -62918 -31842 -19268 -20213 -30372 -32658 -42015 -45667 -37562 -28752 -28167 10130 29727 7276
27452 7276 9 13741 -143 -9475 4266 5216 -15056 6599 9662 -30603 -21412 12828 3623
27439 3623 -12973 2933 -2473 1355 14403 32406 2198 -12293 23968 79540 52563 62622
27427 62622 49509 22925 -6726 25669 47229 28275 22334 25000 10329 -57620 -81260 -78061
27415 -78061 -58193 -16767 7962 45881 63761 48324 5899 1547 -1056 -3432 -34041 -14348
27403 -14348 -16943 -7722 45006 35383 7572 13568 8429 -9251 -7840 -1428 -3148 -8671 -8053 19961
27389 19961 39122 24932 15158 -9475 -10040 -16755 -24362 -15831 -10568 -5893 -23881 -32245 -37883 -35615
27375 -35615 -34995 -6550 -20310 -22619 2822 8804 25022 17211 2066 36911 33071 33086 31113 4330
27361 4330 -725 6466 -7292 18868 32105 22356 40552 28226 5501 10793 10351 18368 5496
27348 5496 -986 3084 -5446 -8248 9090 20179 15450 -8752 14722 13069 26491 29191 11107
27335 11107 15405 11751 10337 31575 73027 57844 47757 39327 16171 41674 71704 43286
27323 43286 28387 27622 23530 -576 23664 25758 21089 35526 20488 -6341 -6983 20305 10050
27310 10050 -25737 -24456 11478 19208 -5270 -13457 -50986 -42600 -11686 12250 -5072 -31760
27298 -31760 -56188 -50019 -27107 -24765 -21560 -48441 -30679 -14841 179 19721 39746 50613
27286 50613 53386 51587 65347 32719 24855 29843 22437 22451 16485 26943 31183 46719 69400 53298
27272 53298 32944 50199 30181 11734 22197 36590 48815 36586 28979 37481 62129 37833
27260 37833 9224 -23483 -44359 -69278 -79991 -62002 -50419 -18390 -5092 -1307 -7419 -11975
27248 -11975 6839 2410 9048 11918 16229 -12708 -55294 -30808 -25377 -33103 -38317 -39657 -65275
27235 -65275 -64949 -74164 -53412 -34211 -1694 26348 50820 48429 76438 66937 23650 -27599 -33407
27222 -33407 -13173 -4631 16201 7805 7025 8640 17594 23779 5474 1522 4638 -6862 7927
27209 7927 27110 35831 25267 13477 6750 19090 8192 -22164 -17618 -5134 -23579 -18583 -24240
27196 -24240 -44249 -31847 -5713 19409 56324 50397 30348 5329 -17560 -3151 8893 5053
27184 5053 -7630 -10500 15477 23821 32239 13928 1638 -20124 8399 38914 59675 20551
27172 20551 4015 11564 67208 77881 59066 56073 37344 36877 21474 -4091 -11603 -33164 -16518
27159 -16518 -26834 -3243 -284 -7927 -40836 -61811 -736 72906 51085 44662 31009 938
27147 938 -3009 -1030 -12777 -7689 30883 53994 55915 46776 50164 57337 31492 5684 -4099 4984
27133 4984 20967 42196 43476 42089 9990 -11115 -2961 40409 24453 748 24330 675
27121 675 -22469 -32299 -19915 16779 28077 1441 -52010 -38828 -13640 11144 18840 1184
27109 1184 19708 18852 5240 -27697 -59113 -42345 -40792 -22159 31947 38144 37935 45552 27207
27096 27207 13320 19414 11111 16468 19694 51774 69093 41792 9120 -9059 -11448 14036 19015
27083 19015 18228 38681 23723 18182 -3326 -1455 37167 33994 35096 48435 38263 43109 57199
27070 57199 82575 81205 82723 73888 44456 2204 3224 12701 35414 24844 10308 6763 2748
27057 2748 -6086 -6113 1285 19998 54347 16293 17325 9313 6416 11929 -31320 -58064 -47908 4546
27043 4546 5118 17954 20096 4781 10189 10012 -25934 -62883 -66216 -18710 -11867 -24200 -37243
27030 -37243 -12354 9066 21710 33125 22111 28522 13366 -33543 -57798 -12966 -3007 -2561
27018 -2561 -9888 -11389 5524 -7856 -30882 14347 57431 49202 7049 -845 14648 38864 22360
27005 22360 -1927 -5811 31071 33033 28122 3521 -27728 -1950 -9719 20350 17402 -10214 1807
26992 1807 20383 57431 56468 55825 27065 -11292 -26674 -52583 -52197 -18265 -7760 -15909 -16571 -13030
26978 -13030 -22190 -23585 4171 -7838 -13289 -18044 -21882 -2757 -7115 -40492 -55349 2752 13902
26965 13902 -5041 -3261 -10609 -40274 -47774 -26750 -25680 -24024 -22126 24 10909 -64 -1307
26952 -1307 13941 24385 60129 91457 65081 65100 50248 29025 59655 33515 13849 23441 3256
26939 3256 -9084 17765 20466 -12791 -17177 939 7566 10900 15514 -18440 -7889 991 18392
26926 18392 41579 47539 27400 -4331 -12743 -4890 15747 42089 61719 39113 -6175 -28134
26914 -28134 -19221 -6380 -1878 19225 31308 13364 357 -4907 1248 29836 -10878 -50545
26902 -50545 -49460 -27328 -1508 -16 19387 37664 147 -19947 3120 20468 7588 -4280
26890 -4280 -3465 9601 10054 25067 10192 33 24871 24670 4534 -912 9017 -28442 -35490 -51815
26876 -51815 -18641 16205 58814 91751 76580 36327 35944 32787 23006 -89 -37971 -33379 -45568
26863 -45568 -47213 -39641 -45467 -30057 -8303 10545 -1538 5323 23119 42424 4343 -19805
26851 -19805 21928 41902 39086 -11161 -31728 -43813 -58782 -44835 -24387 -22156 -33071 -56975
26839 -56975 -21929 -7111 -8605 3123 -14991 -42422 -51516 -21385 9877 21904 -110 -8657
26827 -8657 156 24046 41345 36856 31834 -6406 -12819 -3479 -27670 715 27144 16406 -16753
26814 -16753 -25452 26918 20035 -6091 8764 14131 17145 8896 19612 36916 36416 -1674 -17312
26801 -17312 5801 22093 57136 59554 20108 2880 -15945 -14950 -8116 10304 11498 13024 -5950
26788 -5950 -31993 -67735 -57407 -21143 -32263 -47772 -69722 -68996 -37786 -24195 -315 8665
26776 8665 -13085 -20928 -31988 -40697 -55907 -27060 14423 22581 24151 -20868 -49659 -23756 -12274
26763 -12274 -16331 -15081 -20002 -11534 33769 26958 22048 11284 4328 -406 -4891 10699 51746
26750 51746 34620 28023 11474 15175 9569 34238 53311 29714 14898 25476 46960 70837
26738 70837 89075 78634 51067 28388 14485 6676 34582 49244 57443 83997 53933 42957
26726 42957 42445 25920 25285 42864 44058 27294 18481 21555 57836 84189 55420 50456 49861 56162
26712 56162 67705 38846 12663 -20337 -19442 -29023 -16779 -15672 6415 -15432 -4529 7628
26700 7628 -9630 -24264 -43632 -30927 -15606 -4000 2106 -8461 -31941 -21211 -11646 -20455
26688 -20455 -63144 -62501 -38226 3527 15213 -440 2005 24420 40076 19391 -18870 6196
26676 6196 10037 -29411 -27458 -10507 -2255 31765 34229 27363 -11356 -29254 -29101 -6253 -10643
26663 -10643 4553 13258 54824 79169 85830 54656 19102 -11849 -30441 -38519 -57712 -100313
26651 -100313 -88365 -18756 6489 13744 5347 -1624 -23198 -3879 24816 16761 46066 54102
26639 54102 41338 38942 29774 35460 16125 -19599 -23150 -2044 11135 -9604 -2722 -2312 -11825
26626 -11825 -10195 -2851 11475 28932 7069 -16816 -25132 -18451 -29798 -10122 10767 20368 21014
26613 21014 10336 1458 -20444 -13371 2006 4996 4789 -3438 -3734 -11707 -24498 -19526 22481 51749
26599 51749 34479 30933 23057 31165 33368 12417 13142 34015 -5480 -12763 20449 7443 4114
26586 4114 -3780 18217 34244 31345 25866 27910 -3079 -9184 -30186 -3888 8388 21125 -22087
26573 -22087 -26695 -10665 12154 53719 55656 25090 3270 -4370 -25781 -46169 -22375 -14375
26561 -14375 -17442 -22034 -19115 -2232 -27115 -52283 -17725 -20201 -38450 6703 35964 55811
26549 55811 58211 50251 21182 22138 21245 -8032 -35414 8753 21084 -19374 -32421 -13800 -45420
26536 -45420 -64424 -22680 19658 33325 5900 10787 20512 31067 18319 12296 -16203 -15422 14607
26523 14607 43110 37309 56708 62921 48228 1730 -14986 -26067 -14012 -8153 -11729 -17765 -22665
26510 -22665 -5150 2479 6895 34348 15530 5832 2436 25825 37867 40621 22256 -17525 -13262
26497 -13262 32958 37423 29231 30780 45058 31313 19864 -13574 -21208 5694 772 -10678 16482
26484 16482 25103 54953 55790 57412 68390 73127 73482 55514 34948 10198 8764 7808 4390 -17198
26470 -17198 -13561 -2907 -16914 18886 38762 16271 11535 15881 -15698 -43301 -60649 -78658
26458 -78658 -73350 -24484 -19560 -28352 -39977 -37579 4254 154 -51255 -66822 -32801 -22876 -36326
26445 -36326 -25475 -4987 12375 -3552 -29400 -58099 -43384 -41323 -23427 7439 2503 27213
26433 27213 44557 50504 2874 -17491 -17889 -14764 -1074 29785 50174 72879 65963 58599 56975
26420 56975 27336 20742 6746 23678 47678 48467 44456 57324 45575 38791 45866 44217 -13954
26407 -13954 -47857 -6473 26942 37004 34002 26515 5457 -34640 -30814 -3630 31443 57855
26395 57855 44198 7200 -4188 10711 9253 -6530 2333 2893 -2660 -16392 -44658 -13580 20418
26382 20418 39620 52718 26549 36192 -22290 -22808 -15256 -23511 -24251 -32713 -24335 -17883 17270 11048
26368 11048 -8715 8549 8636 1960 -10974 3250 -31114 -45364 -20847 -6215 -11685 5593 25686
26355 25686 50675 67272 71077 54401 24067 6871 12874 23340 14060 2482 4352 9257 -6431
26342 -6431 -14032 -25911 -20786 9770 -31034 -6879 4502 -21448 -43626 -38009 -17160 2453
26330 2453 16175 48973 45332 -339 6448 -18465 -38369 -44709 -29802 -28889 -24838 -39989 -22652
26317 -22652 -13177 4724 23706 -5176 -14275 -9984 -6911 14580 -2673 -12298 7590 -2048 -29323
26304 -29323 -902 22304 5321 13043 13369 31123 61446 36679 15301 -17537 -37053 -47292
26292 -47292 -26977 -9870 2260 6354 21489 28958 7079 -9879 5586 31042 2514 -27857
26280 -27857 -11695 -16303 -11178 29266 47922 71563 79194 79399 62516 17955 39786 71781 71525
26267 71525 25613 33990 52259 48596 46079 13461 -6581 -7164 -13594 -37121 -38850 228 39933
26254 39933 55591 49894 45470 28844 20899 36693 44607 19211 9322 21493 12163 6346 12761
26241 12761 6963 -9220 -16166 -11014 -32139 -26161 -20004 -5133 7053 12432 1582 19131 19669
26228 19669 28761 56827 66007 44108 17371 15312 -945 14652 23953 28662 23794 18044 24567
26215 24567 28993 26849 -5031 -4994 -7497 4564 15529 24534 -3628 -11613 729 -2480 -28451
26202 -28451 -34056 -26283 -37637 -52748 -61368 -51549 -30375 -11199 -5249 12376 11074 -11591 -48138
26189 -48138 -69649 -49912 -44743 -40308 -31899 -35348 -36395 -36428 -1588 -6405 -12719 -19157 -28631 -36468
26175 -36468 -18879 -40096 -25682 23094 30607 1127 -21991 -16156 -5959 1194 -23848 -63881
26163 -63881 -40993 -35481 -26809 -44836 -47993 -22995 17584 5976 6472 -426 -4150 1280 -9292
26150 -9292 -6245 965 8222 -10482 -4693 -39730 -16881 -47517 -52720 -34644 1614 -4069 -9946
26137 -9946 -15149 -46220 -48154 -20835 -6029 -30271 10990 31538 996 -30109 -38426 -16419
26125 -16419 -29228 -31841 -27400 -39522 -53451 -61373 -57804 -63197 -25167 9708 19592 44336 64380
26112 64380 68472 73971 57251 33035 35159 24943 222 -29420 -54258 -30181 19021 14780
26100 14780 9475 49852 36794 -2605 3419 10870 19725 29274 78411 77210 14065 24753 43765
26087 43765 39005 14746 -8468 16387 42911 47089 50058 64538 67379 40502 30461 35596 24751
26074 24751 2730 -10666 7507 -9420 -34376 -20728 27455 34021 -13345 -2018 23561 34749
26062 34749 37278 7499 -21971 -34964 -25357 -32178 -57076 -49537 -11617 16918 -5673 -18191
26050 -18191 -5793 -18872 -12725 -15079 -15068 4263 -21505 -53379 -37042 -23803 -17169 -21516 4008
26037 4008 58437 46034 48502 28332 23464 21002 29083 22981 32063 9132 3365 31857 34677
26024 34677 10066 -11367 -14518 -18694 -34681 -59244 -93998 -105784 -79106 -52020 -30791 13909
26012 13909 39246 20805 8187 65311 85367 37278 37121 41834 31980 41955 29036 24548 21216
25999 21216 -3679 24999 27328 27348 -7684 17946 25233 13143 44908 67316 33491 -18528 -11783
25986 -11783 64 -9726 -19328 12096 27794 38589 45636 40070 -4742 -47076 -12372 7056
25974 7056 12553 5914 18720 36453 7150 16971 47452 29132 -18928 -55018 -51253 -59063 -63003
25961 -63003 -69354 -33844 -11084 9836 18522 50128 42778 24882 22018 36810 54420 39825
25949 39825 21532 15860 -2943 -9081 24088 45939 60971 52511 23592 2719 -20845 -37842
25937 -37842 -21165 4674 -2698 -6132 4977 -7718 2085 58398 75139 44477 34114 -2087
25925 -2087 -13976 14143 44680 36654 14475 -10701 -21696 -28251 -35460 -47087 -56704 -36689 -7141
25912 -7141 -17838 -35237 -16440 -6581 -16958 23685 8653 -35725 -45339 -47470 -32825 -37746 -42622
25899 -42622 -2523 10057 35708 18648 2953 -42250 -59445 -47265 -43029 -11118 -172 -9291
25887 -9291 -48773 -40737 -25350 7168 5341 -2556 21607 9255 28493 52116 48430 62021 51295
25874 51295 36712 13018 -34091 -28712 -3837 -36 -7173 -15930 -39202 -29737 -10604 -25275 -30267
25861 -30267 -31891 -1748 -6587 -24382 -18314 -15526 37344 54978 37154 36834 33862 19778 4523
25848 4523 -25572 -18803 -31100 3944 36317 2958 -37166 -19055 -7131 -955 5917 17935
25836 17935 11204 7312 15230 27581 40674 1762 -22253 9122 5103 -30669 795 11091
25824 11091 23171 36265 48954 68664 45931 -3557 -32337 -52403 -19649 17819 11801 47523
25812 47523 66918 57071 42563 35362 49797 50150 -6154 -11654 -3708 -3076 13748 37261 34599
25799 34599 21381 36363 44025 41505 7662 2959 27646 41173 31853 24876 9666 3365 26983
25786 26983 58007 54664 10778 -32266 -16187 -8706 10429 31717 49043 79227 50069 22555
25774 22555 10783 23993 17110 17741 21348 6521 3176 14658 -9870 -26029 -4136 10777 -9426
25761 -9426 -26342 -21375 -22121 -34305 -41645 -38961 -25189 -6570 5932 1048 17494 30682 31345
25748 31345 -6292 -41563 -4579 -24102 -5212 24110 31487 47114 65924 67925 61447 41039
25736 41039 -941 -8827 14567 19092 -16973 -77392 -61702 3474 54736 54341 119 -34507
25724 -34507 -24034 -23589 7766 35132 66666 40418 13829 -2701 -13413 -17760 16086 36928
25712 36928 40567 34065 19514 11071 -42595 -81131 -72313 -33296 -15546 -42867 -46478 -65171 -59263
25699 -59263 -45448 -26252 -29348 -46648 -50542 -20400 -6639 -9686 -2607 22482 20144 -14351 -41227
25686 -41227 -34220 -18311 2464 -13535 -19976 3645 -11965 -41230 -52115 -11335 35220 56601
25674 56601 87739 73972 51142 48121 43591 26373 13382 -10297 -15795 7501 -22634 -49999
25662 -49999 -49782 -24061 -10968 2610 -1385 1121 3287 27185 41618 27849 2079 -24864 -28534
25649 -28534 -16830 -18270 -32402 -13489 -9676 -27757 -25200 -15836 -36271 -36911 3890 4085 -15582
25636 -15582 -14164 2519 -1241 -8331 -2898 1555 36359 81520 68138 25065 36370 56536 36039
25623 36039 38469 37586 44604 46016 16865 52984 50433 43539 34986 25787 46486 65468 29241
25610 29241 -14957 -1034 -22119 4478 19404 15591 36852 35731 43750 46878 19820 17492 38362
25597 38362 44634 27163 14982 1729 11423 51964 77980 28966 -19722 -56150 -68701 -29743
25585 -29743 11921 11479 18218 18323 7553 17331 -6924 -23589 -27907 -17086 -33653 -25641 -23342
25572 -23342 -46664 -47795 -22067 -17042 -20417 -23124 -1264 16573 3104 -6643 -18434 -7302 688
25559 688 -12573 -42107 -38106 -23788 -2170 18170 40449 14609 -43564 -53564 -35000 -9456
25547 -9456 2927 19794 14392 251 5929 -1928 -7533 -17120 8409 30851 46687 47416 56731
25534 56731 47010 38972 30799 31840 30869 23435 -3677 32560 27383 -5993 -2435 -10047 -22132 -25307
25520 -25307 -33850 -21357 -17199 -25171 -20824 -16690 -46445 -47262 -29207 -7061 3326 -11915 -728
25507 -728 -7889 -60765 -114310 -103174 -66662 -13440 20161 40866 26634 -11788 -30177 -16620
25495 -16620 17894 15027 -11360 -5055 -2473 -37097 -62041 -55255 -32627 -18394 12541 9477 20585
25482 20585 -12026 -29711 -26708 -13942 4781 4942 17014 16551 21515 19572 10529 23556 -1159
25469 -1159 -2851 -1706 -12545 33261 69305 24702 -1645 6582 28830 45639 29182 6509
25457 6509 6127 20607 10125 -23203 -90029 -76849 -37777 -10846 -18855 -34014 -12168 -11729 -11296
25444 -11296 -14434 19757 37908 36163 33787 29879 3815 -10361 442 -26418 -26103 -36644 -39606
25431 -39606 -30516 -16873 -43627 -44948 -38212 -31458 15155 44447 34064 22641 33298 30679 33020
25418 33020 -2680 -20036 -23909 -12937 -39966 -43704 -45426 -8783 2277 -12634 -1108 23377
25406 23377 16730 -5976 15709 19217 -22259 -34112 -4791 -1107 -16271 -9704 -16817 -3360 -10524
25393 -10524 -40234 -58081 -48368 -16897 -18629 -17912 8642 -5806 -12071 -29289 -37161 -64722 -40863
25380 -40863 -27392 -13422 11338 20349 -10723 -5931 21011 30296 15091 20291 38969 36679 31163
25367 31163 7358 -12347 4660 -7574 -25456 440 16016 9672 10840 39535 46750 59324
25355 59324 51116 59242 71986 36487 27674 60203 66426 73983 76369 41566 28207 1176 -77487
25342 -77487 -67885 -55374 -31207 -2316 -24098 -34076 -18245 7392 -4055 10246 16598 10511
25330 10511 -12404 -38769 -37028 -21461 17927 -7755 -1208 36489 42163 -12863 -38857 -17895
25318 -17895 -13993 -16488 -7571 1352 23014 23934 -5674 -11010 11648 32486 10137 -16465 -3372
25305 -3372 -24237 -31102 12705 26641 45074 62913 47340 14517 259 6416 21833 51391
25293 51391 54806 13273 -21049 -37811 -31822 6381 13069 19730 29637 38133 14590 -9456 11270
25280 11270 18149 15852 7470 -7668 -4305 22144 10286 11778 520 -7346 -26113 -61540 -46732
25267 -46732 -34703 -21638 -13182 -6862 -25547 -24858 11431 16075 5704 -6693 -31968 -15486 -23711
25254 -23711 -37792 -37080 7036 25814 11469 1968 17193 6343 -24069 -13886 -27319 -28732
25242 -28732 -4537 14423 10453 -4357 -5143 -10505 -24390 620 20293 38974 38091 32883 18552
25229 18552 15406 -24341 -60172 -7743 4027 -10662 -9315 -26184 -49129 -42172 -36975 -41869 -57813
25216 -57813 -68526 -74637 -94055 -68995 -36324 -37563 -5951 1426 -14280 -11260 14567 29563
25204 29563 21639 24189 22008 28761 57600 40602 45438 33677 20277 34003 16696 42691 36628
25191 36628 6832 -263 19700 29372 49152 30089 1437 -8856 -30315 -53958 -47961 -20111
25179 -20111 951 9966 -7992 -19914 -18597 4331 29980 78364 72570 59052 60199 46127
25167 46127 29733 15798 31930 42403 42693 49514 47323 38373 36813 61851 37648 -34454 -43713
25154 -43713 -34483 -38046 11435 13742 -24057 -41695 -29575 -21475 -39249 -36441 -9823 -7275 12261
25141 12261 9595 -21361 -39974 -27547 -1034 18990 -19921 -24405 -25981 -37067 -25682 -3367
25129 -3367 -26865 -22214 10605 7464 28925 -608 -45497 -54734 -58748 -57533 -62357 -40444 -33854
25116 -33854 -10860 1805 -10974 4178 -17322 -54736 -60132 -40708 23473 16709 -6458 17546
25104 17546 21718 24160 3500 -33518 -39091 -40966 -68436 -43425 -4342 -26547 -34357 27356 44138
25091 44138 3978 -43396 -33675 -10587 19907 27550 24423 -6195 -29059 -46085 -10459 17046
25079 17046 18230 10852 -3844 -14792 -32146 682 -3418 184 10635 12854 3909 28993 42737
25066 42737 36050 33457 6408 -18305 -64764 -68677 -61865 -41961 -12013 -17258 -34618 -31203 -11661
25053 -11661 -27371 -47126 -18825 27470 16500 -28363 -24973 -24822 -40616 -44452 -15600 -19697 -39244
25040 -39244 -8986 -3307 -29296 -30024 -25314 -48926 843 33115 18600 25078 19339 11421 56252
25027 56252 58184 60370 68774 74381 45519 44690 16506 -12283 -10931 -35082 -13800 -12417 -39485
25014 -39485 -42556 -44852 -64239 -33622 -43515 -69462 -58396 -33009 -38991 -7391 4983 -4090 -12522
25001 -12522 37040 44159 55332 39711 24669 16211 24368 31772 -2297 -12473 10360 21625
24989 21625 36917 55935 58944 64492 58244 43170 28295 18365 -18491 -7666 12609 -1903
24977 -1903 -21609 -25273 -26638 -14342 17897 699 -4567 33391 52591 44033 35281 33943 73346
24964 73346 71392 44101 69525 57928 18078 33762 43114 44740 45709 49134 48180 22966 -4492
24951 -4492 -4446 3315 18694 49253 74820 77463 73968 45821 25068 7205 2537 15298 6531
24938 6531 -8360 -2643 16199 9420 -2663 8379 37242 26217 40740 73514 43740 8201
24926 8201 16666 21219 33526 14248 13850 3057 -12765 -11148 -17387 14621 24684 -19963 -19235
24913 -19235 14777 57376 73783 46433 34146 20129 -3794 20866 31219 39819 4323 -30877
24901 -30877 -20466 -28637 -6485 16825 43306 36503 -23108 -63049 -42484 -20013 -15330 -6163
24889 -6163 -35682 -16226 56979 61336 37385 13288 3097 12259 30138 3567 -4356 -20100
24877 -20100 -3710 11676 16377 7433 -10520 -22084 -11883 24951 29006 6263 5087 -25977
24865 -25977 -4927 5839 20034 31238 42315 47609 60053 72255 39421 23330 21657 12580
24853 12580 13296 386 6170 42204 57676 41282 53278 26874 14495 24411 -19216 -58546
24841 -58546 -53957 -36714 -6599 -11736 -16390 -5006 794 18560 37806 6059 -18217 -8955 4952
24828 4952 8103 -13946 13112 22157 33580 42333 18733 -1001 996 30101 27295 9123 -3427
24815 -3427 -10885 -6300 -23629 -69063 -84228 -61713 -47297 -60004 -44746 -17885 -15969 -24775 -9560
24802 -9560 -979 1864 13741 6094 -38235 -51384 -55256 -27395 -29271 -57671 -75448 -59107 -7667
24789 -7667 -7693 8009 24585 8994 12464 36008 54119 66662 52904 32715 41758 49073 36427
24776 36427 53871 71019 61160 48539 53613 45454 39749 18750 5020 -1602 -12059 -17230 -12985
24763 -12985 -11823 -4629 -7397 13437 57492 58201 25422 -124 -18285 -12959 -14302 -2244 30528
24750 30528 46437 5929 -22767 -8513 5755 2834 -2714 34482 68527 56773 65390 45976
24738 45976 8709 32096 19005 -2967 -15209 -15 10591 2863 19448 18007 25620 34025
24726 34025 41436 35564 17301 17540 23263 -25387 -51859 -44366 -27304 -3297 -593 -11894 -35383
24713 -35383 -61236 -88793 -72297 -16925 7904 28839 32144 27540 16853 3332 36683 44956
24701 44956 41820 26928 -3604 -30216 -7149 51130 84744 79443 69882 78417 38032 -6973
24689 -6973 25541 78350 55912 6981 -14934 -4490 15692 43605 37165 32587 42253 2240
24677 2240 5649 11156 -1500 -13840 -19255 -30986 -51941 -57621 -14509 784 9132 -26183 -23380
24664 -23380 -41624 -47127 -47945 -61894 -61026 -34999 4830 23849 20260 4459 13829 29697 39281
24651 39281 13916 42475 45696 9581 16503 22019 27778 27901 43507 23112 -10635 -38518 -48210
24638 -48210 -11886 17130 8666 7097 -23136 -27954 -12861 1714 -9496 -30547 236 8766
24626 8766 -16450 -27831 -25460 -24606 -14905 7488 20622 23387 53773 49152 93381 87276 78789
24613 78789 37440 -15482 -22867 -16473 -20126 -34302 -31947 -22538 -35382 -25500 -23489 -36822 -69923
24600 -69923 -74908 -66204 -48745 -21490 -46772 -61685 -47942 -16398 2235 -4811 -21613 2229
24588 2229 32837 34636 30751 29911 39243 14094 -13957 -35152 -26588 -23335 -41762 -40036 -60293
24575 -60293 -70752 -57338 -36439 -17475 11352 -21097 -13635 17983 22863 27866 33331 20779
24563 20779 19566 29225 50141 55661 19320 -10877 -2151 34163 27044 -5622 -21463 -19404 -9500
24550 -9500 -32176 -58785 -44732 -30748 -5914 -15318 -16200 2235 15541 28227 33877 35960 18263
24537 18263 26593 29799 62660 88618 84663 111022 105093 86071 53204 17828 31941 26261 22397
24524 22397 27736 -9585 -22104 15891 51788 31963 37179 21840 33681 28865 29124 19430 8978
24511 8978 4248 26112 27089 58694 50334 27532 35543 18430 -15035 -33091 -57592 -27720 -7994
24498 -7994 1330 -147 25014 21656 -38510 -42766 -33260 -29669 -13667 5061 5682 -1305 -10921 -23387
24484 -23387 -65486 -73692 -26244 1802 -24773 -46524 -45521 8196 29990 38360 27405 27691 11754
24471 11754 14391 69998 84061 49673 19039 -1045 -33795 -40584 4668 16074 1947 -35637
24459 -35637 -50809 -35392 -28820 -51112 -41800 -30795 -22361 -33802 -43331 -33263 -1160 43104
24447 43104 29626 17134 24823 5939 -4527 -24428 9729 26593 21930 22851 26080 35698 66458
24434 66458 56167 44119 39643 8959 -21035 -6785 -8328 -15597 -25485 -40321 -29261 -27520 -27865
24421 -27865 -16235 -10072 -11532 -25604 -39406 -19600 -8488 -28270 -34165 -16201 -9851 -9679 -14074
24408 -14074 -8049 665 -1626 -22540 -40228 -54145 6933 15017 -14694 -35470 -60984 -46731
24396 -46731 -48209 -64695 -39323 -18424 -24904 -28677 -39043 -41326 -3225 6162 -39942 -50295 -46208
24383 -46208 -36805 -28745 -5481 8302 18390 -11533 -8934 6682 -2290 16639 38970 36407 31018
24370 31018 28365 -15998 -33053 -7482 43243 28527 -1391 -20526 -5605 1473 -20003 -42241
24358 -42241 -25159 24429 28479 27919 30650 16860 37391 18954 15237 28093 40957 27763 -22554
24345 -22554 -61788 -49512 12374 36862 14609 -10440 -13096 2954 26560 28816 5964 -18826
24333 -18826 -43957 -34934 5741 40139 55157 48302 35233 13903 3357 -22326 -74432 -98734
24321 -98734 -68555 -32223 -17033 -24037 -41858 -48154 -47945 -35977 -20764 -35593 -28047 22486 22078
24308 22078 -2060 -16073 -27483 -23455 -11986 -25555 -41759 -23197 7286 29913 37134 -20865
24296 -20865 -23825 -3420 20344 37794 68634 66394 41197 17555 -9314 2056 13773 -4597
24284 -4597 -16065 -3050 -3658 9059 -19519 -21034 -21337 -2216 7452 9156 58911 95840 45818
24271 45818 3741 -20796 -27684 -20484 16735 5469 -33526 -29059 11321 24311 -204 -2379
24259 -2379 -7399 -40535 -35365 -36091 -3799 17130 23655 -3568 -3235 2724 -28816 -18712 14606
24246 14606 18118 40647 50643 55970 32340 -9152 -48100 -4718 7085 -4706 -19753 809
24234 809 -20273 -60233 -56482 -54361 -20673 -11166 -46682 -18834 18808 10590 -8221 -23729 -36661
24221 -36661 -43712 -64602 -84323 -42439 -23814 -23895 -4959 6805 -218 -3116 -17477 -27002 -47497
24208 -47497 -56003 -29842 14442 67269 45117 40041 38975 -16229 384 37442 42504 29219
24196 29219 24195 51348 55580 29462 34094 37834 -10091 -55752 -33139 -35507 -6741 23984 21001
24183 21001 25997 12484 39228 75222 61797 36601 75607 60786 34165 40045 40571 39372 38654
24170 38654 36345 52621 48354 40381 27197 19956 36360 -31620 -41989 -33363 -16751 36913 32865
24157 32865 48473 31304 2067 1095 23410 19063 6014 -15861 -18156 7746 -18095 -21796 -10720
24144 -10720 -4446 -19153 -32800 -22588 -15783 -29767 -32731 -37786 -46143 -51226 -66086 -37072 -16261
24131 -16261 -17923 -49035 -61383 -14827 21247 27569 49444 63869 29083 -27866 -56415 -28406
24119 -28406 8338 5498 -16761 26804 57558 31794 -13510 -55536 -51737 -13907 -28358 -6302
24107 -6302 29135 44434 47330 31562 15002 12982 1909 -4635 -22405 -15337 -9276 10970 43037
24094 43037 74991 70586 37084 33849 4004 -20173 -53732 -8204 19306 2729 9490 35256
24082 35256 27331 21615 20749 41388 75822 93372 71847 69900 20035 -21235 -34367 -17884 13817
24069 13817 35600 32764 15037 -4669 8596 23077 -7755 5377 31554 21585 23099 49006
24057 49006 39746 7246 -44386 -72484 -42275 -25195 -6801 5127 -12400 -3162 -3390 -7010 -12017
24044 -12017 -44131 -56669 -53009 -34980 -2123 4925 -2186 -18045 -6003 7474 1655 9681 -5595
24031 -5595 -12596 3775 -9583 -67304 -68368 -49375 -56914 -52239 -47516 -61416 -43023 -41011 -41791
24018 -41791 -21501 -10498 16806 23643 12887 -20541 -51374 -50904 -40773 -68718 -51938 -58178
24006 -58178 -35086 -45269 -37917 -35603 -37756 -19921 -38966 -25521 -11026 -30676 -44575 -14798
23994 -14798 -4235 -30370 -20758 32069 39204 -2660 -34725 9197 3208 8277 16535 12755 -7849
23981 -7849 -22241 -10660 -8144 14861 13010 10348 8212 -2561 -19094 -28587 -34856 -18909 -3728
23968 -3728 -27864 -48348 -48120 -36904 -34062 -21414 -16062 -8824 12454 13239 -26853 -43308 -91241
23955 -91241 -87496 -46567 -33719 -9565 23713 12358 -12107 -33879 -27839 -34755 -25747 -68252
23943 -68252 -91657 -71078 -54862 -52754 -45107 -650 15688 332 -42142 -67045 -72529 -93469
23931 -93469 -83085 -53344 -46889 -23579 -10371 -4800 -33467 -56972 -56198 -56648 -50666 -23531 -43876
23918 -43876 -13666 15869 25115 30544 27119 -1212 -19377 -44716 3980 33616 5316 -11705
23906 -11705 -22547 -15886 -27174 -11852 22080 42728 10061 10471 42205 58472 6586 -35998
23894 -35998 -21110 -20813 -6647 31122 54461 61597 31288 5303 16767 19274 37543 36126 31755
23881 31755 15097 -28281 -19473 -20523 1205 -4748 6994 -2312 -37532 -9716 4019 -37929
23869 -37929 -60412 -41696 8086 14808 23683 1936 -11967 3633 9195 -8657 14678 24357
23857 24357 43292 54508 3039 -4349 -1263 -16563 -25360 -45863 -14411 33331 33926 545 -10530
23844 -10530 -17601 1125 29381 16864 5225 -13565 -28638 -24852 -10428 -2551 8354 23039
23832 23039 -4518 -26280 -51856 -47720 -12315 -8112 -6878 10343 35387 33919 -27792 -48672
23820 -48672 -17775 -5452 -27017 -70654 -81632 -38007 -38509 -40567 -34783 -37686 -16158 -3498 -5598
23807 -5598 -42254 -86021 -63597 -40752 -38599 6389 30440 20005 24617 24369 25853 34041 59986
23794 59986 66757 57083 35204 41161 -9506 -44913 -66695 -46107 -16010 -28605 -35070 -13001
23782 -13001 -3177 25737 16646 -8257 -7070 -1495 5400 5930 -23398 -48516 1209 23763 -5870
23769 -5870 -25394 -10026 -23579 -52408 -52311 -3298 17542 19472 13248 -15185 -10635 6313 35808
23756 35808 38173 38967 27770 9225 35178 43642 39650 -3647 -12122 2399 6716 -745 -17128
23743 -17128 -47618 -36303 -8977 3786 -3384 23486 23470 -19965 -41437 -3524 41911 44416 12114
23730 12114 15957 531 325 45866 53346 23079 34250 43062 42185 46451 30610 21465 21166 -847
23716 -847 -27624 -59915 -44426 -37228 -25868 -11225 -50065 -70186 -121981 -100837 -44924 -21015
23704 -21015 2951 -3519 -22162 -12757 7101 9395 5590 11653 5438 -2862 1511 10189 23223
23691 23223 40416 39755 17500 21697 30994 26633 46587 67936 48403 11483 35436 34087 -13849
23678 -13849 -5774 -34537 -66176 -69927 -65788 -22259 -6432 -34234 -39801 -35024 -28056 -23571 -36132
23665 -36132 -40824 -73400 -72425 -70619 -21294 -943 32917 27505 -11662 -36541 -38893 -44047 -12281
23652 -12281 13385 14945 26404 -15682 -74755 -63394 -28927 6993 -1774 -29407 -47849 -33958
23640 -33958 -4599 838 -37941 -34565 -53319 -66800 -54221 -42550 -27007 -2337 -9605 -37896
23628 -37896 -48289 -85317 -96158 -50004 -21521 -22205 -19580 -1272 -45293 -35502 -15648 -10360 -14548
23615 -14548 9878 2001 -7152 9486 -13633 -29371 -26435 -24993 -13700 -13158 -38388 -4713 25125
23602 25125 10967 16076 6569 -4472 5712 17776 36593 3443 -27897 -29193 5747 20275
23590 20275 10057 2594 -19079 -10206 2845 9007 21386 31815 9376 -16207 -7318 -9392 -28640
23577 -28640 -12378 48686 81653 54355 25685 18327 25095 24752 33708 47932 60894 39939 44808
23564 44808 51248 45395 27100 -1570 2265 -6526 -14613 25977 52945 22531 13342 46989 53498
23551 53498 42417 25387 28895 27339 28687 32840 44102 46559 19777 6468 7731 37355 46633
23538 46633 15800 6794 -14146 3331 23157 10898 19775 -9110 -38062 -26393 -15197 -1059
23526 -1059 12871 11490 -4105 -5784 4876 872 9643 6000 664 -18846 -23681 -22844 -45146 -41514
23512 -41514 -17009 -8699 -559 14138 25059 14047 -14949 5722 27056 -19860 -62440 -48075
23500 -48075 -44276 -66238 -71339 -54481 -65023 -79841 -79302 -53338 -15205 26421 4781 -23142
23488 -23142 -24663 6067 9280 16460 40674 34542 36073 19946 -21749 -17738 -19658 -1091 15858
23475 15858 16249 -21320 -14557 -23240 -29060 -6033 243 -4343 -15298 -32926 -19622 -7850 -1971
23462 -1971 5476 -5389 -8948 -2011 -9322 -11251 -13872 -21700 18299 19929 -33903 -45821 -17359
23449 -17359 18122 40182 9770 -21357 3457 15386 49599 40748 -625 -68857 -81456 -59163
23437 -59163 -11579 7671 -5047 -22517 -35696 -47726 -23785 -16339 -18056 -11579 6368 1955
23425 1955 -9715 -27917 -37109 -33640 -39158 -25635 -9505 -3411 -19613 -18316 567 6065 -14211
23412 -14211 -13519 -18131 10475 27735 17726 25757 44543 15522 -7205 15125 11529 -13757 -43498
23399 -43498 -23789 -5820 -2539 6924 13801 15149 11840 5482 -31389 -4395 29717 16791 35907
23386 35907 43053 25847 48669 44197 8340 1116 12543 17522 18635 12410 2094 16869 29285
23373 29285 33862 44458 35625 34493 36823 18367 9444 11562 28297 25335 15500 -5051 8801
23360 8801 33353 32389 48323 59851 57506 35573 5680 3620 2865 12106 16029 18610 8044 -27351
23346 -27351 -41626 -36676 -25717 3044 -1914 -22646 -48157 -66619 -56541 -27433 -37878 -25821
23334 -25821 -11158 -34013 -59564 -22410 6739 36082 40870 28151 16295 16012 -6019 -11455
23322 -11455 -26839 -12971 3913 2160 5599 37759 34705 -8928 -41983 -43119 -35682 -3322 -10258
23309 -10258 -2352 -12085 -25382 -42753 -11591 37184 67312 53706 28068 15425 18842 3462
23297 3462 -25481 -21293 -10451 -25725 -5264 -39461 -33120 -17570 20423 14956 7794 -2689 16346
23284 16346 26966 9285 16790 11509 13271 25506 23919 17662 4294 24890 42563 56470 37382
23271 37382 24491 11815 21559 10778 9949 -6556 19569 34125 18200 54651 62456 55295 27810
23258 27810 32360 56957 58389 45831 22968 -5078 375 23454 32894 21037 -5651 -7433 -17946
23245 -17946 -23309 -37017 -45401 -12855 43957 54695 31252 49724 63792 50488 37409 31420
23233 31420 14055 -16528 -21583 -7838 -2576 20888 36308 14995 525 -11912 -7843 22444
23221 22444 46973 53157 47218 53475 19103 2011 16546 13402 -2465 -25620 -45865 -40743 -18634
23208 -18634 9722 -18038 -72674 -76262 -69132 -40096 -5611 19956 27541 39731 16411 2222
23196 2222 18861 27818 22963 17164 4867 -6805 -2234 -22046 -54447 -54821 -10883 29967 26233
23183 26233 28019 -23628 -33121 -8538 -27858 -42840 -17111 -10816 1231 -1676 -8497 -11940 -1194
23170 -1194 -29516 -49898 -50433 -47296 -43237 -41923 -66940 -57335 -72537 -95620 -55381 -50505 -68044
23157 -68044 -39054 -31902 -29659 -29734 -13617 -21045 -48400 -39091 -2061 12414 -11128 1320 4964
23144 4964 3255 -31658 -36168 9972 28088 34041 26269 19646 77859 59056 25117 -5275 -40113
23131 -40113 -35035 -49715 -39648 -9401 -6066 -4352 17524 49847 85821 75164 63809 16398
23119 16398 -2997 -4969 8752 -27016 -49474 -78315 -65318 -43707 -4962 -34136 -40705 3185
23107 3185 11213 -26617 -25869 -12935 -17651 -28754 -20913 19836 37799 15422 -25740 -51348 -35881
23094 -35881 -8798 -6864 -10937 21 -15579 -4375 -16002 -50390 -59118 -46293 -15501 -10042
23082 -10042 11130 7236 -3338 -8948 34564 83430 8559 -4045 4661 -11470 -9101 8396
23070 8396 34678 46522 52993 27092 38804 43801 37688 19455 -17046 3532 -3889 -27664 -2583
23057 -2583 4698 362 5897 34184 37561 25526 21221 38991 25919 13239 15037 20599 8950
23044 8950 -5895 -13727 -17827 3858 3732 -9129 10179 13785 25777 17668 40574 7522 7645
23031 7645 24139 12287 2193 6208 11758 5826 21952 19362 -2005 14595 24876 23164 26243
23018 26243 31466 21628 14224 20460 -13347 -25677 8764 36774 9245 20625 14353 -8355 182
23005 182 -8274 -3552 15388 26424 23135 -8800 -16233 -30499 -57179 -32395 -62553 -102691 -72747
22992 -72747 -35067 7243 2934 -10463 -1648 -6584 -33080 -6617 3386 -16074 -30968 -47824
22980 -47824 -35020 -32258 -55460 -40039 2348 2542 -1396 3900 7373 33596 119962 120076 86005
22967 86005 33894 -8860 371 -5555 -25913 -33866 -24538 -46159 -49629 -11671 -357 -11034 -16021
22954 -16021 -26445 -29816 -26513 -50346 -45537 -13523 -16155 -31391 -15968 1082 47049 41961 8967
22941 8967 20522 28262 30565 32664 57216 39571 6028 -20342 -29573 -18296 7090 -8432 -21149
22928 -21149 -19951 -37050 -29894 -7366 -16427 -42579 -44314 -54365 -30441 -52906 -48440 -45467 -60741
22915 -60741 -34767 -20880 -17480 5108 56945 69101 44921 26533 -8627 2474 -8041 -20352
22903 -20352 -311 17335 22115 -1436 -10317 -28255 -15284 -26668 -28706 -42171 -26441 -10545
22891 -10545 -13718 -30926 -30720 -35421 -2288 -2672 23793 27175 34055 71907 76916 47144 35213
22878 35213 68420 59970 1654 1758 35109 38565 12489 9059 24720 24273 42886 30998 13621
22865 13621 3733 9239 40269 65248 80481 47678 5850 25054 -27317 -21481 32046 20562
22853 20562 26104 11521 -1849 3023 19012 -14967 -14692 -14803 -24101 5758 17108 -6256 -36343
22840 -36343 334 8504 -38706 -20308 -11903 6602 30601 63968 58848 64886 59111 27820 -3912
22827 -3912 -16615 20075 69132 97141 87209 49395 24793 24725 15989 1238 -12252 -21739 -857
22814 -857 17586 31834 16203 17477 61916 59209 35712 -3567 -6953 21728 30825 -30139 -50756
22801 -50756 -48217 -57960 -34121 -33918 -15026 5925 -6578 9208 37381 18173 140 20565
22789 20565 39660 58048 54419 46599 21736 5493 6986 -18842 -61091 -65504 -38033 -12106
22777 -12106 -8357 7220 -14922 -39672 -43836 -15821 -24113 -39466 -12618 36108 64819 45731
22765 45731 37146 13491 -1152 7445 -1392 -5379 -4707 16277 13525 3000 -21084 -43857 -42791
22752 -42791 -48149 -47813 -43687 -39821 -32410 -26013 -7122 -7682 4522 -214 7905 -3058 -12453 1576
22738 1576 12751 -7206 14506 43379 40062 48927 45627 20131 -748 -11478 -34603 -57412
22726 -57412 -48260 -31863 -18154 12337 -8606 670 47360 35981 39416 78317 98152 57348
22714 57348 45996 36997 12358 2703 14344 2436 -25598 -38773 -3857 6969 -24833 -45679
22702 -45679 -38761 4775 6489 26816 44208 43214 35605 30388 20834 6613 27960 28216 -8969
22689 -8969 -4397 1418 26962 59015 38606 35029 18206 12467 762 -931 -16003 -44062 -52975
22676 -52975 -11504 6419 -14593 -35301 -28472 -1742 -36283 -61434 -22021 718 13767 11648
22664 11648 43298 51907 34465 30423 11548 -4023 3779 -1215 4556 18491 -3810 -8450 -12235
22651 -12235 -6494 -11993 -7757 10259 16537 1163 8872 -23003 -31442 -36099 -23610 -13934 -19867
22638 -19867 5225 37373 5011 -40223 -43607 -31412 -29351 -67721 -70265 -75090 -77614 -34718 16173
22625 16173 40304 34081 32002 42096 17239 -18764 3828 8540 8932 9584 -28278 -25723 -4960
22612 -4960 36691 65875 42946 58747 59975 34293 40680 20529 24882 6897 -9433 -14842 -7012
22599 -7012 -7498 -29309 8331 45368 18034 14536 -24880 -31934 -3977 -11707 -19713 -32511 -44396
22586 -44396 -20134 -15616 -22557 -23669 -20744 -12153 -17103 -9793 5083 20142 8301 5744 -4307
22573 -4307 -21939 7075 31620 -2197 -28223 -28465 -37841 -7402 -25692 -38270 -60074 -48194
22561 -48194 20706 32732 31448 30904 19089 21373 61096 62473 25003 -14156 -20301 3790 12020
22548 12020 -11713 -4358 19698 30053 30395 20823 29276 49051 23742 -319 8654 47184 37064
22535 37064 3840 22577 44467 50383 55432 25969 18780 28008 28706 24955 16532 11041 -216
22522 -216 -6139 -19249 2676 18368 -23488 -36891 -4199 -12054 -23379 3534 13022 3314 12711
22509 12711 28004 15883 482 11178 17900 24674 52758 63398 58503 24875 23464 43364
22497 43364 7525 -17108 15717 -1505 -18758 -40016 -5152 1169 -12123 15626 17401 -10043
22485 -10043 -41115 -32212 4428 36403 46585 22341 1413 -19606 2846 52737 39483 35874
22473 35874 59840 47228 82767 74228 65769 20244 -4931 -17659 -29094 -29411 -16625 10412
22461 10412 14993 32361 58642 66049 73285 76888 42304 -22970 -53929 -19743 533 24029
22449 24029 23696 -10930 -12691 -8902 21538 13788 -10012 -3593 7581 -11304 -35755 -60494 -42865
22436 -42865 -36597 -42017 -42222 -49911 -66455 -47388 2697 -16763 -26481 -48374 -38529 -21130 -35235
22423 -35235 -29313 -14918 -22928 -48897 -48484 -49903 -34975 -42510 -47598 -24242 -23048 -14934 2497
22410 2497 8142 18834 20341 28055 3348 -45247 -55334 -20889 -5505 -19863 -24795 -4609 -12967
22397 -12967 -69305 -53357 -40281 -16870 -10929 -13558 -19791 -33250 -20723 -7596 -37354 -43979
22385 -43979 -15632 -15610 -21827 -46006 -51199 -26676 26896 16185 -11092 -13960 16331 41065 36568
22372 36568 62790 71076 61112 26996 -5284 -29123 -40642 -45916 -42543 -27330 -12816 -27049
22360 -27049 -57393 -62466 -37906 -23273 13368 18108 -3328 -647 20187 5311 -32009 -78312
22348 -78312 -51149 -53017 -55473 -43778 -9713 18563 30221 33333 11656 14442 45428 44495 11689
22335 11689 -2422 -8074 -23921 -38545 -20498 -38247 -58923 -33197 -22871 -29539 -1868 26495
22323 26495 14538 -4091 -21188 -25515 -24585 -14006 -3112 -14174 -16835 -38194 -49306 -75725
22311 -75725 -48647 -23247 -36611 -58066 -73643 -33273 14868 38971 53464 31608 -3458 -2140
22299 -2140 -22678 -30404 -28788 -18799 -18949 -27806 -24447 -7377 -25651 -38854 -42793 -49178 -73481 -45136
22285 -45136 -5770 -2440 -24205 -31812 -21547 -27266 6383 14082 -21234 -42466 -45252 -38546 -46172
22272 -46172 -46959 -34439 -93 21624 7422 749 -8767 16073 33037 38331 20283 43276 26674
22259 26674 17288 15887 3878 -11098 -12951 -3696 7278 26865 17514 4451 12292 27546 13791
22246 13791 -3922 -29492 -28972 -21014 -27459 -2021 22954 30605 51519 36927 10976 26674 -23774
22233 -23774 -39100 17015 40085 55789 64819 40588 10611 7525 32181 20042 24138 11361
22221 11361 -972 9525 41711 29747 35235 55927 53205 26417 15912 33922 -443 -21649
22209 -21649 -4407 -6458 -24223 -1316 2834 1415 2970 -8465 7572 21574 3325 9063 -4233
22196 -4233 -27693 -73987 -77294 -32769 -34876 -38215 -49198 -56415 -49848 -42142 -29302 4784 6313
22183 6313 -16513 -3814 14380 -17532 -5813 17441 6676 -8829 -32482 -36883 -2854 3435
22171 3435 10840 -20454 -14248 -4707 -23103 -39775 -28233 -17152 18764 35272 17831 935
22159 935 -20724 -50332 -89138 -72955 -69492 -28658 -29918 -43572 2496 49444 80649 58326
22147 58326 16285 -15832 -20889 -11838 28303 915 -21891 11819 17692 28204 -6128 -5690 2994
22134 2994 22615 10329 8109 40660 36665 23381 -506 -2913 9126 -9299 2845 7230 -14903
22121 -14903 -10336 -20280 -6233 15179 9461 -9083 -32428 -47713 -40914 -14770 9939 -1132
22109 -1132 -18716 -35154 -30877 -33653 2 5314 2327 -16455 -22200 11996 21819 17595 52739
22096 52739 53006 35109 48337 54084 41288 63617 57863 83356 82016 54899 43538 2305 -39588
22083 -39588 -6815 17572 7262 32303 42414 30078 8232 -3280 -9058 -42065 -31976 -13617
22071 -13617 1580 -15664 -60868 -19247 24343 1781 -14002 -25488 -24929 -17344 -16794 16157 8804
22058 8804 -1841 6490 22457 28412 1012 -4911 -7813 -1955 -5508 -6029 1153 10919 29978 2519
22044 2519 -8798 -36625 -54549 -50118 -59192 -21152 21847 19204 -2035 -39099 -55013 -52081 -15151
22031 -15151 4928 4314 -13153 -13382 -41115 -71275 -54102 -20459 7151 -526 14304 7097 -56572
22018 -56572 -73796 -86418 -62522 -64592 -71705 -68590 -31943 23247 19458 31489 46589 45640 44292
22005 44292 18873 32902 22938 -12680 -42929 -10262 9684 -25190 -7880 -16410 -23346 -27795
21993 -27795 25933 50331 13256 -17786 -39822 -27657 6662 13402 -10770 -32437 -38592 -50885
21981 -50885 -16997 8466 58178 70575 38039 22734 22193 -660 3873 9273 36478 61900
21969 61900 42863 64549 85713 37606 14647 -17290 -36894 -55359 -49922 -52242 -31431 -2323
21957 -2323 10970 30802 39224 36713 48630 48117 -10313 -52962 -76204 -30704 -1505 -2316 -29590
21944 -29590 -26033 2146 29931 43681 26766 12482 23437 -11172 -53856 -48138 -38580 -11132
21932 -11132 9918 30693 27734 15810 25638 18875 23944 -18009 -30767 -19366 -42069 -11253
21920 -11253 13600 35671 16569 -3346 3322 -22076 -42065 -23519 1210 -10624 -1692 -10942
21908 -10942 2064 33803 3774 -44048 -37834 -14187 -19440 -24761 -44029 -44381 3830 27805 39829
21895 39829 53619 45234 21755 10321 8766 3685 -14812 4516 21335 19220 -6687 -14724 -49959
21882 -49959 -44220 -35198 -39732 -58193 -36643 -17080 -11261 -15310 -4866 -6681 -5567 -36514 -53164
21869 -53164 -54238 -45304 -21475 -24224 -25378 -23829 -10608 12587 2480 28838 38676 23473 -29409
21856 -29409 -62503 -63826 -77571 -57694 17001 54510 97992 80251 24503 -6600 11202 37920
21844 37920 48622 16681 -29309 -7625 26838 8762 11190 -4520 -19315 2857 16326 2727
21832 2727 -31886 -6029 -5624 -1276 3003 -5873 -14797 -42816 -34839 -8508 -2013 -20707 -19789 -33179
21818 -33179 -39024 -34211 -29607 -55392 -40645 -23171 -42294 -40817 -17332 -19810 -61485 -72295 -47550
21805 -47550 -26749 -7029 -22466 -60431 -76949 -62707 -39888 -17306 -8282 16741 -4721 -2804
21793 -2804 -12480 -40919 -36543 3450 16009 -16474 -71663 -84912 -56000 -58276 -79988 -37369
21781 -37369 -2364 4714 6405 19409 -11411 -32455 -20477 -9071 27411 71110 87051 83076
21769 83076 37107 -11873 4178 15924 -3685 -11098 -44075 -59693 -28686 12141 32037 13994
21757 13994 566 -28586 -45347 -47226 -56818 -66772 -65779 -83571 -77910 10806 36169 32811 41444
21744 41444 25857 8337 21029 20072 19128 24467 8530 -31814 -28842 -34024 -45978 -15538 -36805
21731 -36805 -35255 -20757 -10290 -24859 -9735 -848 -16936 -21110 22644 18606 8947 23637 25330
21718 25330 -3837 -44021 -70725 -75141 -75444 -54546 -40421 -10674 2026 12517 -11213 -27572
21706 -27572 -41968 -27898 -46511 -39970 -20895 -22270 -27864 -53409 -64633 -9242 41535 70750
21694 70750 40696 -8076 -6251 13885 27898 47726 41309 23973 39405 42252 19465 4351
21682 4351 -1464 35210 62074 52672 11116 -47196 -55099 -9366 37829 47240 21644 2994 -5595
21669 -5595 3853 858 85 -11465 5144 -13679 -35115 -19802 1233 -24574 -10825 -14932 -36415
21656 -36415 -29868 -5885 5298 7785 -12272 15568 30770 11350 -3194 9932 12340 23702
21644 23702 -3442 -24166 -48514 -52031 -55129 -39669 -19702 -39308 -26171 -34147 -24708 -24274 17049
21631 17049 45478 57774 51179 -3777 -17647 -14142 2654 27207 43113 18374 -10634 -8917
21619 -8917 -37141 -10816 19908 15471 -15286 -20116 -5651 -6235 2328 19555 863 -20742 -32490
21606 -32490 -42110 -43489 -29050 -26531 8705 26496 10104 -13130 -5573 10253 -26177 -42306
21594 -42306 -35934 -13304 7805 12775 3513 5545 8497 1081 473 -21192 -39584 -27826 -17079
21581 -17079 -18820 -13754 -32059 -67929 -71930 -66846 -96990 -121442 -111131 -99812 -93117 -79040 -41383
21568 -41383 -1492 -7000 -4685 659 -4859 8711 32285 22778 34251 36672 23492 -8739 -15404
21555 -15404 10154 44082 33938 17125 69474 111518 97809 82037 28832 -4002 -17736 -1032
21543 -1032 10538 18147 3470 3396 -7207 -35779 -43228 -34047 -3242 -3927 6170 11747 -24638 -45978
21529 -45978 6129 34188 24216 14329 542 3840 41052 65670 18305 4543 -4614 -11110 -19134
21516 -19134 1638 -1311 7041 9258 -11637 -21251 9153 -889 32919 26559 19128 -13213 -10455
21503 -10455 6084 37186 34933 24654 16991 6138 13405 -1182 -30825 -16837 7658 5157
21491 5157 -12864 4516 11223 -6827 -4161 -9159 -27502 -60046 -87718 -75776 -48769 -84873
21479 -84873 -79433 -54545 -31598 -9495 -8083 -21521 -44048 -59720 -40002 -9484 -11584 -48349
21467 -48349 -28602 -12961 -30720 -31553 -4774 8594 -10897 -19953 1112 20784 20843 3268 -14858
21454 -14858 -19106 3622 6513 32465 39791 42372 21939 -9676 -13988 -6989 -20372 -24295 10054
21441 10054 23136 24747 -339 -31591 -28038 -22528 -18914 11618 5760 -1035 1083 -5405 -19215
21428 -19215 -45967 -24205 14518 15960 5527 28394 37231 4592 -17933 11861 29923 14196
21416 14196 -1918 -7383 -22608 9341 35043 60683 70941 66951 60088 62190 65200 87921 95993
21403 95993 102263 84249 33008 8191 11305 21847 33936 47623 20479 -8579 -38213 -13301
21391 -13301 4200 24670 41685 5091 -3722 3962 -9744 -867 -7297 -14325 -31581 -39628 219
21378 219 6443 14461 22296 1367 -33769 -23667 -28928 -23718 24047 25137 13999 3618 1468
21365 1468 13240 28139 26794 32200 11826 43369 73110 78099 56490 6050 -28282 -10934
21353 -10934 16826 20548 1424 38 -24838 -1992 -10567 -11040 -11110 -12665 -11436 10289 5191 -3565
21339 -3565 -16338 -20935 -20196 -17463 -19675 -2565 20920 32502 6432 -45237 -73485 -59948 3524
21326 3524 -14200 4880 31947 994 -12335 32997 49091 47077 17512 -29390 -56226 -46926
21314 -46926 -16399 -17040 -23730 11371 43029 16114 -33247 -62292 -27301 -918 -27017 -37670
21302 -37670 -19066 237 -16410 -25906 -6188 -25338 -42725 -25197 14264 12010 3409 -11193
21290 -11193 -18963 -10670 7043 30190 29498 50030 38429 14610 -11247 -34850 -42220 -45128 -61779
21277 -61779 -45970 -21555 -26122 -59090 -78972 -34368 -24690 -34115 -44768 -48980 -36440 -9892
21265 -9892 18915 26493 13461 3280 1416 -10300 -16477 -25598 -14812 -5039 -1846 -28614 -38844
21252 -38844 -38151 -25448 -35553 -37436 -62285 -674 24838 49713 41351 26588 14220 -22089
21240 -22089 -159 13069 -22253 -19835 -2618 -4862 -16095 -18830 -26796 -28003 -29860 -13927 2427
21227 2427 6793 33904 33637 46406 64405 29138 -53 -29382 -43364 -34358 -59107 -38201 -22203
21214 -22203 237 15703 2368 7470 -27936 -60764 -42344 -21686 6791 -25871 -24192 3999
21202 3999 10708 20776 29222 64258 76992 57067 44547 33434 34143 28779 5082 -22291 -10933
21189 -10933 17762 27528 52670 27588 331 24318 27663 6782 50766 8427 -39192 -44903
21177 -44903 -71894 -66351 -34339 -12381 -12448 -24362 -47660 -29218 -46673 -47348 -23459 -17812 -16398
21164 -16398 -10738 -5064 7102 6854 -18507 -14350 -5931 -3162 5707 4696 -5682 4062 8461 19403
21150 19403 -2767 -22187 -8223 -43122 -38150 -13184 7175 6052 12581 17219 11155 11094 12656
21137 12656 -5735 14775 15025 15211 -9147 -4325 -8660 -23106 -10247 -2571 -22207 4380 7784
21124 7784 2542 19655 55022 50869 6309 -15364 -5016 30120 49792 48142 25281 18943 -8740
21111 -8740 -38377 -12036 25186 48022 30143 26850 24319 -1608 -6472 1977 4626 2164 28023
21098 28023 25041 46914 54916 26760 7183 -5862 -15743 -14790 12212 34133 11319 10168 23843
21085 23843 10866 15360 19009 39985 33130 5640 -14107 -12441 -3142 -40534 -40004 -36240 -55740
21072 -55740 -16976 359 -8880 -28372 -1876 -5213 -7983 7658 -12513 -28182 -10977 -12780
21060 -12780 -15205 -24109 -48415 -52753 -16754 26865 21871 42891 70437 74813 38025 3245 6182
21047 6182 21437 48001 29572 42747 44489 11210 1288 427 15272 23397 -6965 -5170 11436
21034 11436 -2326 -6159 1447 10982 11829 25097 57550 35032 -1697 -7883 10791 22814 -6808
21021 -6808 -27515 -15216 -12001 12559 49564 31409 11890 -6413 2225 26571 10185 2628
21009 2628 -4237 6100 -3491 -37646 -43628 -58883 -67592 -73282 -64617 -31928 10580 13249 -25047
20996 -25047 -28704 -27968 -29750 -41831 -41389 -25467 10196 35380 13652 1295 -9690 9529 3309
20983 3309 -15682 -14043 -7827 -17525 -13326 -27936 -55266 -39080 -68524 -76298 -46544 -37035 -8107
20970 -8107 19950 35631 29711 22105 -943 7154 -8627 -23505 -25134 -33152 -48104 -60020 -55761
20957 -55761 -59862 -31397 -32143 -43649 -37949 -57737 -63090 -65536 -58829 -49072 -58600 -47955 -23738
20944 -23738 -37358 -55298 -54286 -30239 -16612 -28599 -57473 -74463 -64821 -40333 -2747 5143
20932 5143 -13152 4939 12504 10604 -17952 -43766 -27796 -14841 -1370 53110 53911 17089 18958
20919 18958 5226 13081 24043 10299 11925 38060 9280 -16465 -18513 10949 24787 5825
20907 5825 16581 572 228 2291 8751 16433 5638 -7719 14034 16080 -9556 -2178 5056
20894 5056 8414 -729 24653 21004 13615 -9872 -9374 -7956 15545 32684 41131 29838 27319 27048
20880 27048 31888 5763 578 8643 17020 11377 -13003 -38846 -31983 -6267 18095 19887 34664
20867 34664 5865 -23957 -18876 -5056 -1325 -48915 -66441 -34247 -44376 -58237 -43909 4405
20855 4405 29418 -23441 -28269 -17713 -16361 -33171 -28612 9140 25487 25805 32590 26919 2327
20842 2327 -17238 -10521 -20366 -28828 842 2636 3000 25585 15857 -3614 -22353 -26710 -14225
20829 -14225 18605 48591 71059 57938 43051 -10017 -36194 -52031 -22501 -6107 3726 -33833
20817 -33833 -15457 -19387 -55687 -54029 -32771 -6841 5758 11099 24355 28847 29599 16278 -10053
20804 -10053 -20583 -15617 -24532 -20226 -1324 6444 -11909 2842 14655 46641 48362 28027 35171
20791 35171 43545 78039 63875 65532 74121 43405 4496 8776 860 -28204 -15570 -23337 -23491
20778 -23491 -13123 -23061 -29506 -22129 -12680 -5105 3186 14397 19961 3100 3980 21512 28978 16972
20764 16972 5479 14503 42522 49167 38465 26366 -11582 -11359 -10547 -20484 26019 16941 -21204
20751 -21204 -57389 -36997 14019 3931 18638 40649 19225 17716 12861 -8546 -26108 -4671
20739 -4671 21765 321 -3998 -6088 -16023 -21899 -24866 -21633 -33993 -20094 -13062 -22374 -24672 -26158
20725 -26158 -27406 17861 19134 19119 -707 -37185 -46390 -26884 12942 29894 28565 36593 31691
20712 31691 2955 -21941 -21144 2523 -20099 -41060 -44699 -18044 -39389 -20220 -5378 -11127
20700 -11127 -35204 -23806 -25084 -5485 4469 3353 12696 -4373 -14654 -34404 -30047 822 23421
20687 23421 19598 37266 24263 3479 -8340 5272 49700 34813 16334 24631 15708 6011
20675 6011 15024 13522 -8042 -37676 -52797 -45011 -35343 -2226 10389 -5652 -23764 225 37857
20662 37857 46361 69493 51617 42726 32281 17853 -2727 13874 16334 -2775 -35217 -39426
20650 -39426 14391 41678 31588 -15318 -29654 -15896 -9948 -7087 19365 -13399 -25489 1136
20638 1136 470 -13531 -17215 13146 -17658 -57323 -59866 -53787 -31273 -8893 19168 45439 11113
20625 11113 -5443 -16083 -59879 -46135 -35082 -45790 -48207 -32716 -12030 -863 16075 8216
20613 8216 4123 17307 9352 -10674 -15958 9206 26536 366 9775 -1210 20323 55288 39505
20600 39505 -2654 -12908 -8180 12755 46814 12819 -13341 -37077 -22444 17829 36485 52001
20588 52001 48801 10551 6803 13824 13126 -7330 -33078 -27012 -33849 -34474 -14755 -11130 -13942 -23684
20574 -23684 172 28992 22997 -14092 -34579 -46328 -36292 -14408 -5613 16033 32741 -5042
20562 -5042 -16117 -38589 -31621 -27986 2739 -8919 -2870 16207 21707 20390 10007 -2815 -4033
20549 -4033 32156 65121 80588 91829 34625 -597 -17892 -14370 -45655 -48465 -21810 5215
20537 5215 9921 32472 19867 17364 62682 68639 60300 51669 41524 55478 44024 53001 60997
20524 60997 59219 40490 25645 24016 21621 17166 2200 -10451 712 -7956 -27572 -14113 24321
20511 24321 21559 -5251 -12700 -38460 -43106 -36735 -13077 -8875 -6554 -17189 -38834 -32201 -25443
20498 -25443 -23051 760 32962 36316 35950 44393 32780 31133 49454 71269 85649 70593 45553
20485 45553 13509 -31316 4768 18496 11942 6670 28901 28697 15100 40962 47884 32234 23565
20472 23565 41353 44151 38700 38486 -869 -40039 -49640 -17679 16730 15724 20803 45058 59244
20459 59244 14580 1681 2527 -11436 -43133 -46203 -61528 -61583 -53238 -31841 -12821 -18964 -10917
20446 -10917 21311 45961 17108 4673 6091 7986 -3426 20395 42994 60126 63354 29406
20434 29406 21625 5227 -6896 -18628 7970 3571 5325 22665 38712 38745 24802 8926 48697
20421 48697 64981 69484 76297 53807 50838 49265 35587 9993 -7145 -16388 -17592 12231 7902
20408 7902 11219 10223 -26355 -3943 56723 35424 571 -19384 10065 14554 3098 -9293 -5443
20395 -5443 -17273 -2119 31116 19701 -32465 -20549 -27107 -22850 -6898 -12647 -38804 -28935 -26297
20382 -26297 -40834 -32513 -29562 -23821 -2319 11448 -14803 -54699 -68970 -39520 -10726 12183
20370 12183 -8832 15191 33144 10183 7990 10551 13052 -6352 -38731 -18345 -5058 -1951
20358 -1951 -8712 6027 -4811 -16799 -24757 9267 -28309 -60693 -59533 -26124 8556 29707
20346 29707 24081 14262 -24043 -5558 7596 20253 2169 -15952 -23695 -48606 -42847 5788
20334 5788 19776 20025 -21751 -26010 -26755 -39827 -47284 -28917 21171 38132 26684 43570 58381
20321 58381 -17253 -39256 3801 36052 13462 5844 -24278 -42578 -10536 -24046 -28462 -9251
20309 -9251 -14546 -31661 -20743 21413 17035 3471 4377 18122 26843 -2293 -20657 -19001 -7306
20296 -7306 4399 25812 16355 -2971 -10425 -26016 -47908 -49155 -29110 -2729 33421 2745
20284 2745 -32374 -24585 -24859 -13387 -24768 -34890 -9733 -5229 12679 14738 15659 11295 -16489
20271 -16489 -9247 1424 -7052 -28236 -31795 -14958 -1179 5515 11206 9232 38088 32687 24619
20258 24619 3103 -8361 19133 34605 3109 -2834 -15385 -22209 -481 -13210 -47040 -39042
20246 -39042 -43638 -31232 -499 41017 29806 23456 41620 46194 12689 -4179 -35336 -34717 12331
20233 12331 19427 4130 -8366 1267 -12479 -788 -9580 -6857 5901 13138 7194 2332 7416
20220 7416 -11683 -16793 -35213 -37647 -36879 -27288 -26951 -22130 -32212 -30951 -3440 14388 26742 26074
20206 26074 2053 -8255 4722 26626 3472 -6588 -27308 -30915 -8634 21322 30437 6408
20194 6408 2224 -709 -11494 -23700 -33219 -44655 -39509 -50752 -27628 -5567 -1457 -12070 -11637
20181 -11637 -21384 -22840 -11982 -34372 -52950 -68547 -31224 -22073 -21175 -9184 -3901 -11076 -28172
20168 -28172 -31547 -14267 -29361 -21967 1961 -9435 6775 32106 26197 -16903 -30685 -16778
20156 -16778 52 13458 18874 -7512 -1553 -2469 -14667 262 -8973 -44701 -59577 -16666 1290
20143 1290 -10730 -58500 -67125 -35462 -20895 -16799 -7176 -25955 -37835 -33656 -20122 28686 30163
20130 30163 29094 3008 -5751 -38530 -41556 -28650 -18637 -10810 -2853 10390 4375 5758 21586
20117 21586 22533 21396 3758 6166 17723 -24159 -36241 -27209 -34321 -12300 -13133 -18352 -23318 -16118
20103 -16118 -7400 -3868 -11683 -2229 14751 37618 29860 -6838 -23193 2192 19340 12016 41059
20090 41059 30753 -7038 -19031 -20862 -3742 7283 -16931 -16402 -33474 -29427 749 7544 33482
20077 33482 31185 1474 23015 36747 4459 -45748 -5152 32919 20677 29738 18638 -24797
20065 -24797 -12506 8056 -7422 -20254 -17828 2072 6796 -11374 -3204 23225 6978 29809
20053 29809 55219 40361 15124 9428 40932 49077 8898 112 1139 9847 -856 -12323 -30185
20040 -30185 -26989 -43886 -26574 13647 28833 6649 -4101 -4232 -22108 -30531 -35803 -54817 -35581
20027 -35581 3025 -10426 -46598 -55620 -48947 -54147 -16020 11223 -12029 4411 17629 16597
20015 16597 38272 74644 79579 34209 20276 30445 18459 3664 -31010 -16773 22874 33148
20003 33148 25131 11434 19151 34305 45939 26268 4922 11667 33425 45750 27926 6650
19991 6650 2897 31267 33555 4493 31489 -21078 -15045 -445 -29470 -46675 -46776 -54933 -8494
19978 -8494 -183 -19503 -25963 -23113 -19136 -2552 12000 3713 -18884 -22439 -33901 -23451 -9070
19965 -9070 -564 5539 1534 -12582 -23005 -22848 -16039 -7216 1162 -12286 -24354 -26018 -17592 12487
19951 12487 45660 38998 26684 24443 20808 28798 43002 37796 12235 -7079 -2529 -3620 -4108
19938 -4108 790 112 -25108 914 28217 16984 16038 21756 27731 25653 28770 48953 59151 44460
19924 44460 -15057 -12699 -34416 -21101 15348 23989 44847 20293 30359 13452 -1497 -30328
19912 -30328 -24610 594 -12475 11061 46959 76301 70896 33120 9467 -10226 -21496 -39225
19900 -39225 -40370 9149 57926 64587 70204 46315 38413 9315 6813 28559 47714 43266 36147
19887 36147 2749 -15971 -16878 -17010 -8719 -21955 21960 57023 41219 47322 48952 35988 20365
19874 20365 23310 38985 66703 90915 108249 150153 201142 271254 334675 444446 570876
19863 570876 710902 807355 742511 589985 445003 323933 188974 121093 76670 50474
19853 50474 38619 38141 48580 19799 27310 38398 43552 5820 -35 6025 20900 -1528 -35445
19840 -35445 -36952 -27347 -33754 -41386 -27087 -12907 -40334 -45403 -25455 -25 19896 19658 24712
19827 24712 45248 32317 52565 54626 33415 28759 43060 38389 31008 19552 1135 26859
19815 26859 51331 45007 29087 39647 30305 14912 23755 26902 249 -34899 -28384 -11077 11257
19802 11257 14745 -17724 -38217 -33801 -10510 25453 10827 -14339 -8914 -16910 2777 8482 9078
19789 9078 -15408 -64199 -75103 -22467 35941 36825 5348 -5826 4370 2993 19214 16185 2129
19776 2129 5220 29042 10418 -7688 10871 -22679 -45790 -48354 -49791 -44472 -29834 -51070 -41008
19763 -41008 -13436 6693 8796 16606 29438 23329 18570 -6981 -34057 -25065 -10753 -23832 -12177
19750 -12177 30783 -4503 -36109 -31924 -24423 -31286 -30344 -18689 -24835 -61380 -90970 -73635 17147
19737 17147 44452 42171 28232 9850 23308 -28363 -47086 -12276 22004 25948 -15382 -26740
19725 -26740 -1765 -3705 -24476 -32812 -8192 -7069 -18643 6153 -237 29052 66831 54621
19713 54621 2434 -24141 45 32483 21795 969 -876 17728 34559 51231 64101 75438
19701 75438 33668 -24307 -65801 -35663 -22103 -25775 7314 20323 22022 3400 24050 52935
19689 52935 52298 48087 53079 59475 81388 69943 47597 46147 10415 -31653 -31750 -3875 15984
19676 15984 35550 35172 23907 15549 29283 43951 33019 -606 -24569 -31759 -25483 -12711 -13727
19663 -13727 -21657 5756 19472 -17960 1720 19608 104 -10550 -21451 -34472 -15203 -3679
19651 -3679 19552 8968 -13581 -24753 4808 22876 13470 37250 68872 108488 76391 10264
19639 10264 -9257 -33790 -18878 12649 17181 54451 61326 -4765 -28570 -37989 -11669 34696
19627 34696 22892 2384 -11908 21065 22558 59721 65243 49523 27598 14666 3657 -21327
19615 -21327 9514 38575 18952 24305 54721 73719 51159 52787 50435 47998 24750 23851 24522
19602 24522 38122 26779 23617 15401 17203 9157 8937 19611 48130 39775 21329 -3555 -39252
19589 -39252 -33753 -36691 -13335 3604 -6247 -18645 -18681 -72107 -78802 -51715 -16570 -2564 22770
19576 22770 17127 5495 4287 -7677 -45114 -29205 -24713 -19117 -18593 -35443 -33441 -28953 -13790
19563 -13790 6064 -18787 -23709 -13868 -3820 37003 6832 15899 23350 18876 -8097 -34268 -33638
19550 -33638 -6404 21186 27842 24971 40754 7319 8617 33551 -4729 -12668 -7957 -25253 15744
19537 15744 -4941 -4530 44464 52385 47723 30476 1291 -4113 -10741 29557 36668 44099 23750
19524 23750 39305 39969 31013 18615 4507 2564 57418 87688 92842 60466 38226 17714 11445
19511 11445 30339 22563 9533 25199 49098 56129 79388 61690 43524 31954 25485 30219
19499 30219 30862 10691 -24178 -42471 -5322 13518 -10180 18649 1353 -11866 -900 -23514
19487 -23514 -22839 -16650 14583 34500 43369 55846 24188 -30968 -54926 -74354 -63583 -77895
19475 -77895 -26284 -17375 121 -740 -15994 -24385 14225 29818 40795 81505 65714 -1790
19463 -1790 -8518 23316 78540 63435 41760 29566 31236 46016 45310 51292 37384 -5340 2136
19450 2136 15661 26874 31214 36043 37581 9753 4896 21226 37957 16185 13042 15191 5275
19437 5275 21884 -12238 -8475 23098 19780 20404 27793 26477 19611 15378 11032 16288 7970 -16742
19423 -16742 4696 28166 21765 -632 -2044 24318 37341 -3482 -17910 1542 -30745 -56947
19411 -56947 -29827 -20061 -1946 -13694 -8976 -18437 -26788 -28367 -24440 25270 44595 22582 24437
19398 24437 17219 -25132 -44978 -23642 -15592 -14923 -38403 -76090 -34534 11130 44749 31152
19386 31152 14687 12655 -7080 -14888 -39384 -22401 31080 68388 43614 18544 25117 30481
19374 30481 25832 26784 47887 45109 36111 16691 9559 35641 42334 25797 556 2956 6047
19361 6047 36814 45392 20003 14482 47298 68055 67949 60042 19201 20720 25603 20696 17962 26719
19347 26719 45906 36296 29254 31108 15960 3547 8643 26496 32184 11698 12999 55801 98853
19334 98853 102591 65162 45123 51533 27683 12714 12711 13662 5816 -17307 -7378 29105 37562 58555
19320 58555 62131 47844 20440 31886 24001 -21780 -25819 -36970 -51748 -39985 -53224 -20005
19308 -20005 -25037 -15837 -36628 -34616 -31250 -13483 5985 28011 10029 22704 31036 2560 -31965
19295 -31965 -34769 -33104 -19833 5017 14044 13573 9062 -29334 -23081 24170 60200 50661 57089
19282 57089 65527 76356 53725 59415 65582 48679 26246 9812 6850 24805 47523 41857 39393
19269 39393 31639 26582 18676 42566 62580 47770 59291 53751 54340 11627 -4540 -9992 -8881
19256 -8881 -8027 -10774 27349 62646 74001 41122 21787 21521 30246 20491 1801 7034 -1203 12518
19242 12518 57289 47066 -2043 -15979 -416 23887 50292 24345 11616 20929 38704 48188
19230 48188 48921 56775 72730 62494 50659 7395 -38706 -24055 -27610 -6075 12058 15412 7728
19217 7728 2695 15061 29850 66877 49150 23408 33567 63092 58275 48327 57875 52902 32462
19204 32462 37951 34101 30232 52962 52808 30184 38284 21459 -38253 -46810 1508 34546 12783
19191 12783 9543 30985 37487 33750 11812 -14957 1132 39122 61291 58512 16573 30575
19179 30575 30017 37029 45209 30805 33889 26823 4922 2949 -14730 -9167 20340 29803 11682
19166 11682 26707 49445 62177 59522 43194 26613 48282 49884 49574 28321 -2453 14017
19154 14017 -3185 -4053 -31358 -72259 -60705 -30700 -16547 -23283 -22540 -7606 1129 14475 3865
19141 3865 -14384 8567 32854 53763 45499 50717 45633 31563 26494 19302 34041 46279 8746
19128 8746 -12277 -6062 6253 32072 22547 14365 23910 15810 14051 22316 7229 16796 7613 -27949
19114 -27949 -25942 -37820 -30091 -4938 24316 44095 55757 44754 28414 -12692 -31352 -18603
19102 -18603 13462 51359 69340 53226 57237 40018 55707 77236 43111 26746 42478 49922
19090 49922 34849 20492 28747 11845 -11680 -9283 -15444 -16832 17134 57914 37872 61798
19078 61798 42603 11270 -2762 7620 33294 34396 63354 103051 87694 85644 91114 76798
19066 76798 33228 15320 22784 15071 29599 51231 36586 35417 66913 78893 46007 51468
19054 51468 53044 65244 82321 98017 109186 114291 122520 121090 93913 73354 72610 83751 71047
19041 71047 67977 81795 79404 80773 65455 31377 27887 35128 47339 65847 70359 90605 73842
19028 73842 37249 31444 21502 26163 30039 56257 82242 55793 17607 34442 2421 -25126
19016 -25126 22385 48895 59778 64369 69655 62291 25610 20011 30530 53550 63239 56148 40989
19003 40989 32734 68006 117871 131959 111209 70340 77214 62404 21640 50554 78408 69772
18991 69772 87975 82266 63935 75722 65626 56414 73862 67805 45410 28067 41022 20574
18979 20574 27210 35396 19354 20761 15463 67533 91072 87377 111505 112730 91014 61218 29422
18966 29422 46813 53457 56888 33925 39970 45917 55465 55290 57262 60228 97320 113372 88012
18953 88012 34830 19541 47459 57303 37735 19302 25268 29255 20754 49112 65747 59691 49668
18940 49668 34469 29563 69494 73883 54687 60020 74382 98663 104106 82567 57570 47858 67089
18927 67089 64644 25041 9650 44411 75862 50880 50381 57153 58828 81051 104293 123846 128112
18914 128112 102954 73834 62888 59549 103712 128704 127757 169161 190351 196222 199780 218000
18902 218000 215910 278670 278392 286349 270450 312181 344239 372248 396000 410431 420397 426420 471213
18889 471213 463434 430861 429775 452534 448359 434026 418461 353282 328879 309527 268693 269774
18877 269774 269324 270372 254891 235719 213635 224061 243046 266547 262671 226551 216974 213201 191607
18864 191607 197720 225829 230219 212865 196210 168325 159142 134882 128303 152489 149533 160870
18852 160870 197610 214599 270786 337495 394326 423559 420975 402066 391669 422481 484193 529514
18840 529514 538250 518986 485133 510485 571094 611116 619189 601897 554773 531953 500908 484067
18828 484067 428545 356736 259451 189413 147464 131699 122879 133679 130154 143994 168522 142508
18816 142508 109626 108755 94992 92421 100378 107751 137373 129774 108854 96446 97896 90769 75323
18803 75323 91536 87476 99738 98072 104135 94117 99549 107015 101765 71986 80763 111858 101384
18790 101384 98933 122467 125676 112068 108833 104756 109147 110868 96802 81928 76473 77480 65185
18777 65185 101767 98932 82580 60324 98064 112580 121732 168009 234180 331897 400560 361840
18765 361840 324808 256507 192997 133397 75223 100882 135311 151454 126162 112757 89650
18754 89650 86410 81356 90390 91763 108808 86277 52087 33915 48828 72068 97617 110347
18742 110347 145392 170677 157587 134215 124657 122883 124985 117501 115628 126292 137945 169662
18730 169662 201971 190948 166424 150134 159820 160974 130459 147375 166214 200555 204122 184914
18718 184914 152665 119946 100309 96874 101075 151752 177008 185775 173893 147908 135627 132381
18706 132381 114857 123299 122327 143767 138831 113235 110706 88849 114622 134773 124220 142544
18694 142544 152561 175075 112116 97309 116834 133313 129544 170558 209343 250456 229146 213133
18682 213133 164976 209397 238908 205842 189022 191316 225553 233590 252439 253641 215413 188270
18670 188270 192791 232184 228757 229199 248274 288928 317921 288665 221877 166600 129324 160307
18658 160307 172151 146667 156515 138761 104155 85591 91627 103343 102107 116966 120733 106550
18646 106550 118478 120077 141171 134608 110979 126986 135381 152878 135240 155850 201348 241165
18634 241165 229934 223732 235034 256007 288383 307096 304893 260996 253278 243665 193255 182590
18622 182590 207852 226043 261975 293000 330936 425208 496016 518388 438585 332693 264121
18611 264121 263653 294937 276871 222742 193341 181846 148753 144712 142622 153457 159474 171385
18599 171385 167623 153846 154277 139113 123986 116246 133785 145266 143154 125168 82335 86293 102986
18586 102986 121107 122983 107701 135044 151021 129124 119116 109599 114063 146220 151706 163129
18574 163129 129191 105225 62801 57167 78387 69802 62260 72518 99535 108481 173700 197713
18562 197713 158454 197308 255894 300219 337817 341688 355357 324981 274080 280769 269952 229444
18550 229444 192510 157848 141876 145655 133309 118543 86604 95915 101769 123966 148894 183209
18538 183209 207175 191734 175332 166920 170490 176309 192945 188121 186241 199985 226768 215683
18526 215683 192936 200682 224525 233496 255842 299453 314522 313936 283646 307676 390921 478280
18514 478280 496934 463319 393481 311912 223080 188511 199640 210435 169664 137698 164398
18503 164398 204310 220319 259503 272392 246357 278197 273924 275321 280903 288869 284663 287866 333839
18490 333839 440721 512646 508834 473223 425513 375835 315882 291979 287300 283103 320727 338419
18478 338419 348731 348963 343778 335912 357237 352374 334264 328505 299718 297435 316356 351497 382145
18465 382145 370677 374078 374933 380444 385995 413883 425967 424793 410250 407169 409004 402234 357069
18452 357069 348227 365129 397794 418458 417143 450293 497647 529349 575681 622819 691760 694391
18440 694391 685853 721897 729750 767308 837836 895762 968299 1029420 1103125 1202053 1299007 1397594
18428 1397594 1453546 1562630 1693048 1840729 1933813 1964099 2051901 2165970 2245323 2375274
18418 2375274 2438878 2456745 2405314 2285087 2206833 2161173 2149363 2196778 2242174 2261714 2270509
18407 2270509 2233134 2146583 2068415 2049160 2041552 2063214 2155828 2329711 2568852 2774800 2967667
18396 2967667 3179354 3427634 3681531 3901848 4080373 4261193 4459264 4711256 5048489
18387 5048489 5483433 6026635 6678412 7403760 8245032 9245186 10405689 11739406 13174703
18378 13174703 14787926 16731440 19235747 22369332 26177590 30776908 36416727 43017712
18370 43017712 50784771 60689292 74469659 95323054 129254963 186998231 280712408
18363 280712408 402822675 490595914 481705719 402117302 302087544 208851823 139466382
18356 139466382 96798173 72324071 57468654 47431206 40092598 34377434 29781124
18349 29781124 25977869 22726583 19826493 17274510 15129404 13360504 11938503 10764835
18341 10764835 9818288 9010097 8293783 7617717 6964152 6346732 5747215 5233370 4770980
18332 4770980 4429272 4112371 3861609 3554670 3295647 3019011 2758027 2586513 2445185
18323 2445185 2315177 2224034 2151693 2092023 2058963 2049299 2094162 2189099 2241761 2255895 2217893
18312 2217893 2234676 2361640 2564781 2860964 3226307 3545378 3712920 3752981 3720933 3577067
18302 3577067 3322845 3036233 2756230 2489953 2229642 2005033 1834855 1759790 1748023 1809803
18292 1809803 2006224 2304838 2414642 2219506 1941223 1678121 1411438 1199188 1021774
18283 1021774 901464 805823 753094 709699 708116 698730 699094 723079 735583 716680 744085 769158
18271 769158 761491 774587 769445 751147 756416 800412 871970 923040 962223 1033606 1130436 1223203
18259 1223203 1334396 1414711 1512089 1632693 1732445 1809781 1893370 1946514 2002620 2085674 2108677
18248 2108677 2126200 2211392 2449893 2911407 3588654 4040585 3985902 3660101 3294061 3006347
18238 3006347 2845553 2860403 3044737 3386501 3968123 4784914 5985859 7770702 10570292
18229 10570292 15114195 21468406 27151643 30328186 30694259 27872310 24180545 21351627
18221 21351627 18487435 15363705 12797927 11015987 10037876 9987470 10898497 12140555 12293885
18212 12293885 11146608 9433001 7688432 6283449 5326438 4724917 4415592 4281436 4239432
18203 4239432 4213552 4314462 4611697 5094277 5703905 6489903 7293176 7987016 8634892 9270976
18193 9270976 9533572 9365048 9223563 9501192 10449371 12374984 15267551 17911449 19187593
18184 19187593 19912012 21364826 24662892 30394426 36844790 41790351 45710088 48406681
18176 48406681 50372001 50512377 47256085 42252469 38381599 37416925 39433353 41458639
18168 41458639 40159323 35437945 29044700 22818004 17936333 14626062 12707985 11780029
18160 11780029 11463311 11842610 13056002 15026735 16857494 17525142 16691723 14752055 12447411
18151 12447411 10293910 8566794 7364172 6532725 5951217 5559390 5208831 4919234 4725891
18142 4725891 4697047 4855426 5225330 5813353 6672252 7898256 9802246 12503544 15147386
18133 15147386 16728601 17945432 19988235 22582090 24357747 26211606 30083730 36201108
18125 36201108 42104370 46350902 46099814 39877731 31634448 24198061 18442759 14887492
18117 14887492 13207298 12791472 13374653 15092407 18518653 25135177 38103590 58601843
18109 58601843 68326538 60737929 47903060 34422641 22566511 15053686 10779980 8237400
18101 8237400 6551288 5357814 4492644 3789675 3259481 2885269 2598421 2348236 2130293
18092 2130293 1957109 1768946 1540124 1310568 1110679 979151 909896 870950 836688 738330
18082 738330 721359 667404 598666 563241 550475 525479 462850 386924 357993 348392 358784 320170
18070 320170 301100 311964 306210 280506 272152 264857 283670 322831 350078 341997 305509 288007
18058 288007 189819 140467 131661 140411 173793 165305 158904 164928 201023 191685 198607 180276 153508
18045 153508 141020 158023 161003 147466 129390 124022 109429 151266 158706 145569 149476 131876
18033 131876 164901 179266 150253 125283 126058 91044 64460 64839 82326 123316 120575 104441
18021 104441 101631 104062 109726 96220 86931 80067 121329 145671 171306 147998 92783 93374 112740
18008 112740 104066 80295 89802 105253 122297 122265 83082 87156 91285 60390 41784 50308 62849
17995 62849 50026 38709 61447 67636 29517 9156 32543 63832 61292 58312 51091 43675 27868
17982 27868 6495 -11917 -2838 19003 57492 75597 104087 107948 74171 32482 -15875 3891
17970 3891 51753 69839 69265 80743 83511 61644 85353 75251 96796 137631 133403 74150 29192
17957 29192 -869 -16620 -5709 17670 95420 123115 126947 100300 60123 43025 32964 -957
17945 -957 -12011 -2091 5037 15127 32 1788 29946 41994 35557 25867 29419 57823 75252
17932 75252 84812 82218 65448 46224 82514 80929 49285 25144 48623 70294 51735 42156
17920 42156 78847 104654 129406 91921 94149 111270 88296 76250 107598 112446 83397 74807
17908 74807 88780 107372 124843 160797 178599 200555 191768 187586 200786 217345 196661 213772
17896 213772 215553 187661 199074 208605 240307 262342 332976 383004 435791 476699 502936 506914
17884 506914 555782 592353 618804 658182 634449 599834 574794 591813 543996 508369 500391 451202
17872 451202 391987 359274 335557 380332 385821 328547 287156 246622 226333 194480 182289 183183
17860 183183 179341 184915 173470 191565 177572 171006 173720 213506 237173 240177 265870 309808
17848 309808 341177 269271 229555 245963 243401 242600 254380 248255 239430 269089 308130 336214
17836 336214 392360 415118 427814 477886 526418 526159 537526 564037 558699 559822 561647 510483
17824 510483 441112 403633 432956 440868 430405 427111 423550 389728 359868 329063 259149 216885
17812 216885 188727 170422 171149 196185 220733 212746 158800 144942 148277 163351 166292 147225
17800 147225 150826 163285 177236 207340 184363 183628 184454 158059 167777 178267 155496 118345 126091
17787 126091 146843 181679 196292 179349 157205 140069 134147 166076 219527 212494 191275 175861
17775 175861 193081 218376 208467 199285 223970 241014 235391 211932 202029 205021 269610 280268
17763 280268 275461 252975 254860 248169 270643 268755 266254 264786 314192 361533 370066 381757 401291
17750 401291 410238 394081 369917 365796 381771 366962 393925 415884 452574 449930 477184 489594
17738 489594 484433 505676 524661 559484 614301 681760 705180 708458 756009 839270 890336 900611
17726 900611 909950 942064 998615 1071906 1169286 1279016 1456406 1643057 1849356 2152027 2545366
17715 2545366 3029569 3702948 4679461 6068851 7516315 8472897 9260003 10401439 12009051
17706 12009051 13531856 14812277 16729816 19545642 21995640 23544025 25291976 28207381
17698 28207381 31477194 32267112 30253533 26928832 23401655 20813512 19856931 20733962
17690 20733962 23522503 28178845 34994117 44312697 54138029 60130056 60149556 56783325
17682 56783325 53950240 53446030 53994866 53628828 52457946 50774115 47926758 43253225
17674 43253225 37300139 31378186 26618386 23638852 22628319 23464618 25766358 28558940
17666 28558940 30637884 31631246 31154613 29288688 27584898 26521411 25868095 26363132 29020189
17657 29020189 34328561 40916833 45332504 44650571 40047139 34482887 29659450 25633605
17649 25633605 22413396 20470885 19988797 20868984 22548771 24413559 25437436 25067487
17641 25067487 24148771 23791571 24612367 26477274 28033493 28469557 28398355 29223149 32173029
17632 32173029 37070205 41685943 44039481 43885245 42387923 42053655 44755100 49091518
17624 49091518 50011767 45355109 37877443 30434053 24766564 21575461 20517236 21057575
17616 21057575 22005844 21265402 19201172 17031013 15458043 15349856 16943345 18571964
17608 18571964 18406480 16688217 14249266 11815825 10098133 9318148 8764566 7736059
17600 7736059 6489916 5312830 4264312 3442477 2856411 2397712 2059779 1806488 1612512
17591 1612512 1504738 1382344 1241956 1098151 989368 882388 855082 795281 755009 684159
17581 684159 609462 588454 552553 517388 454382 398999 346173 339473 333585 324833 334317 293298
17569 293298 259028 253259 247585 225235 220531 240437 235495 221616 222323 240184 258899 225628 204691
17556 204691 186455 145001 136787 159082 162938 157551 148658 141546 111576 114476 105773 93802 87474
17543 87474 87257 118098 125175 116188 95831 98312 95785 78539 45078 29483 38996 43009 57410
17530 57410 37177 41678 87793 93844 56500 44429 62660 80813 83831 58436 30667 78326
17518 78326 94544 94880 88381 57199 51183 60897 59223 74636 83516 66441 74794 60708 40382
17505 40382 30471 22918 11160 14405 18979 52989 52510 33020 8378 -1740 -1460 -11289 -9947 -16396
17491 -16396 -12650 -30595 -23983 -24811 -21268 -20756 -31767 209 1815 49 24301 9459 1064 22971
17477 22971 38136 7574 -42213 -80341 -72759 -61213 -47312 -53483 -19491 -6483 -27739 -6969
17465 -6969 -5613 -886 41580 62363 42087 22986 -8422 -30745 -33735 -3114 -4646 222 -18808
17452 -18808 -18819 -26192 -7273 -4226 -9446 39749 107969 147124 222548 289617 293037 240496 169759
17439 169759 130454 103011 101860 68910 42513 39423 31119 31362 22493 42083 31708 8302 -38420
17426 -38420 -24675 -23551 -31601 -8678 21402 37401 22158 2701 6023 4519 1065 -6020 -9286
17413 -9286 -52433 -84989 -72532 -39061 -36095 -32217 -26330 -4180 -10552 -12039 9225 30084 8003
17400 8003 -10822 -17688 -35282 -43366 -15378 -12389 -41377 -42270 -41872 -54945 -29024 -6987 -14120
17387 -14120 -18717 -31578 -5021 19958 42506 26120 3230 -3548 -21288 -27595 -17189 -21281
17375 -21281 -39270 -25682 -35629 -46301 -21293 -19230 6176 20199 -9881 -10707 -8963 -36144 -56947
17362 -56947 -30752 -33478 -55133 -21476 -11663 -6920 -24896 -31725 -10324 -15269 -20496 -36313 -15627
17349 -15627 -15587 -19079 -7784 -24089 -38165 -65978 -63303 -28608 -16888 -40908 -41733 -10511 17731
17336 17731 -22852 -40567 -47398 -25185 -24820 -44204 -64998 -92526 -102746 -41663 -7240 -5950
17324 -5950 -10997 -21694 -18651 -8308 -12383 -27484 -24254 -26279 -46913 -67228 -55640 -80457 -85259
17311 -85259 -42164 -22941 -69651 -40100 -47663 -46379 -31056 -15048 -50774 -88132 -91434 -94482
17299 -94482 -84876 -68551 -37922 -54747 -34994 -13049 15824 -9955 -15635 -7110 -7235 -30262 -13331
17286 -13331 -15593 -5775 -4709 -8025 20 -5173 352 -2763 -4213 4681 -22172 -49186 -48448 -30659
17272 -30659 -16956 -12362 -13902 -56116 -86462 -59836 -61878 -62252 -45796 -33560 -17496 -17217 -31866
17259 -31866 -40759 -38163 -30990 -26147 -11756 -18824 -19618 -40928 -47514 -47842 -31666 -11672 -11062 -9279
17245 -9279 -26895 -8066 -22814 -19954 -12660 -14893 -15118 -28981 -68148 -44676 -12440 -604 -16233
17232 -16233 -16563 -21419 -49519 -63690 -47405 -43206 -44316 -55493 -53396 -60721 -57618 -39972 -40605 -27901
17218 -27901 3906 31125 28841 14422 -19944 -47375 -49384 -50133 -63730 -49639 -47435 -28179 -4879
17205 -4879 24243 27258 10046 -7909 27296 49082 100430 103094 86245 63807 72893 90164
17193 90164 89742 130349 153538 177810 200758 229314 255059 265154 247512 225809 190282 160177
17181 160177 141939 126083 134296 140538 112446 122748 148038 177944 188812 194499 198219 173852
17169 173852 146944 122581 123702 139640 151904 159178 151818 100671 50673 53834 50369 75707
17157 75707 76004 70499 43755 24218 58778 104124 107592 111237 127444 119274 126010 139593 177162
17144 177162 185067 172508 158141 134471 126599 143226 168661 205542 190707 195841 208972 181634
17132 181634 165885 153537 159460 168083 178258 129543 104577 87736 74929 82487 66610 52814
17120 52814 46359 81575 150630 166412 187559 159605 111885 89311 73079 100954 125388 156473
17108 156473 146090 101106 77169 73323 73387 68780 35981 30383 39437 50809 70625 37518 44470
17095 44470 15106 20349 15423 7215 -14933 -13129 -11863 -9307 17977 18534 5589 -20578 -69850
17082 -69850 -64293 -33821 -4293 15084 49534 30868 5184 -29317 -14489 -3164 -2554 -287
17070 -287 -64073 -67822 -54813 -36076 -60362 -46670 -42279 -43340 -27295 -18310 13861 39166 21315
17057 21315 17081 2078 -12368 -32399 -41456 -45938 -52780 -78676 -79176 -77711 -64797 -15256 16016
17044 16016 -19013 -60673 -77458 -75771 -71170 -36125 -22025 -23972 -19775 -23056 -45126 -62208 -67306
17031 -67306 -18616 37862 25393 2802 -4721 -887 2018 -16576 -26946 -7872 -11930 -15719 -44333
17018 -44333 -41949 -50237 -56777 -24668 -20566 -6790 -6502 -15468 -30308 -84582 -104987 -109009 -67027
17005 -67027 -19964 -26894 -40587 -49496 -35172 -31223 -42667 -40960 -53489 -33179 -17195 -73763
16993 -73763 -108522 -92372 -30449 -12632 -18375 -49012 -72507 -67314 -47262 -25989 -14336 -26297
16981 -26297 -34939 -37563 -21747 -21770 -53837 -45133 -39850 -57321 -77981 -82414 -59864 -25726 3435
16968 3435 6700 36902 38984 21249 11673 -8978 40126 22427 5622 2051 -18449 -3142 -11009
16955 -11009 -22431 16684 11845 6708 17820 -13109 -27496 -2560 10705 -9186 18724 13050
16943 13050 323 25495 36705 32518 31242 -5998 -10694 7567 2658 -36346 -67312 -59518 -16245
16930 -16245 5041 11371 18470 -9135 -30313 -22095 -40535 -47546 -60027 -61229 -8920 5304 -51547
16917 -51547 -69352 -36045 5564 24315 9612 -4254 -22208 -12379 12741 5039 -13222 -23333
16905 -23333 -42645 -38795 -5254 4470 13345 48573 25456 -21307 -36260 -63265 -47962 -47546 -11647
16892 -11647 -9577 -75230 -81838 -52760 -37425 -47571 -31595 -34687 -21301 -47938 -41305 -28918
16880 -28918 -10270 15160 -722 -64845 -56780 -46162 -39861 -49832 -63122 -54865 -50906 -44373 -35972
16867 -35972 -33208 -23114 -14273 -31302 -26253 -18690 -3008 21020 13401 17540 1416 -19650 -43341
16854 -43341 -26766 -56955 -91264 -65310 -21790 18280 35556 -194 -11698 -8079 -21848 -64593
16842 -64593 -87259 -56232 -19280 -32414 -45211 -45203 -40135 -57322 -75166 -115771 -110503 -70939 -70626
16829 -70626 -49207 -31979 -8263 -33355 -33350 -20511 -31743 -60930 -66451 -46266 -4830 -13478 -10150
16816 -10150 -14320 5024 3380 -26422 -48723 -36972 -24115 -23617 -36444 -39176 -30424 -23326 3055
16803 3055 -1986 -52116 -80948 -65376 -79292 -125398 -131836 -108191 -117492 -109691 -82282 -22215 -29334
16790 -29334 -37453 -23234 -34855 -56683 -66941 -58444 -29974 -47589 -49646 -55608 -54378 -43066 -32111
16777 -32111 -7129 28860 17080 -38747 -36156 -30018 -33820 -38471 -34432 -66175 -72179 -71813 -48191
16764 -48191 -33425 -11693 17000 -6158 -35517 -43465 -34644 -32562 -43822 -43197 -38873 -6319 13747
16751 13747 15276 2902 -50988 -76745 -105688 -90835 -36776 -19760 -41100 -50701 -66694 -33409
16739 -33409 -36562 -29598 -8289 -9252 -17657 -3856 -8587 -13 -5160 -38502 -36612 -72745 -62535
16726 -62535 -36763 16647 24932 3038 -15202 -5809 -6439 -13398 4404 22051 3273 -6953 -15539
16713 -15539 -16807 10868 2001 -14263 24856 63166 56556 -10670 -26556 12481 27702 15653
16701 15653 11940 -4633 -18818 -50733 -86950 -96286 -64200 -37646 -45232 -45124 -58093 -65441 -60222
16688 -60222 -57969 -61163 -29935 -32384 -31660 -12318 -3331 28585 51278 45656 24876 -13720 -22709
16675 -22709 -2065 225 15965 29695 51958 15302 -30709 -27267 -8669 8618 34011 45160
16663 45160 38469 18075 21224 -9410 -37799 -27087 1410 10431 24622 18630 25369 7181 -48958
16650 -48958 -55331 -50653 -34559 -34276 -48695 -44938 -40801 -37758 -45694 -60795 -49435 -47367 -69317
16637 -69317 -88491 -115466 -102633 -95991 -94056 -103886 -88168 -63144 -23659 7641 -8777 -20884
16625 -20884 -44139 -20200 29222 -80 -42172 -46303 -2325 -9330 -26338 -19465 -15284 -22418 -33078
16612 -33078 -40064 -57521 -57002 -45944 -63621 -36711 -14229 -38461 -48080 -48585 -31645 3248 -7437
16599 -7437 15766 6665 -52348 -79187 -74727 -81669 -86611 -45835 -52785 -67204 -48845 -30857 -32161
16586 -32161 -41045 -44207 -23610 -21254 -45512 -87956 -70170 -21493 -29771 -64915 -67021 -48009 -39406
16573 -39406 2348 13685 -17127 -28823 16379 30442 1060 -26432 -50135 -9871 -29053 -64087
16561 -64087 -58454 -42419 -3761 -21797 -52281 -49733 -24739 -9060 27565 24373 3215 63601
16549 63601 44976 -7643 -9690 -18685 -60911 -61040 -16400 -2098 4756 -16379 -26419 -65393 -84411
16536 -84411 -63514 -34053 -29632 -38693 -36319 -62026 -44392 -33519 -66947 -98367 -68748 -57064
16524 -57064 -47747 -26242 -25817 -42594 -30842 -19288 -20162 -15195 -22104 -8422 -39553 -55910 -52306
16511 -52306 -49641 -37089 -89459 -95015 -38946 -24063 -14376 -35769 -55683 -53666 -29137 -36974 -29536
16498 -29536 -8293 -2631 -13589 -25177 -44300 -64151 -48573 -20459 -13614 2537 7668 4227
16486 4227 8228 -21461 -16440 -30791 -19962 -5363 -22967 -52133 -50022 -50030 -52761 -36136 -2718
16473 -2718 32356 34788 11602 -25323 -37727 -12307 417 18985 -556 1857 -1751 10679
16461 10679 37976 46189 36055 31997 17957 -11332 -1606 5141 -25857 -47619 -34785 14778
16449 14778 27413 585 3963 32355 40388 28029 7899 -11726 -15285 -24160 -46072 -50186 -34872
16436 -34872 -39847 -669 19666 20878 36798 15907 -21541 -8637 -22096 -5230 -13131 -22025
16424 -22025 -24856 -34474 -71566 -78372 -47858 -30689 -10637 7429 5254 -12652 -9869 12239 7209
16411 7209 4777 -9314 -3715 4935 -4087 18156 7652 20382 6441 -46964 -60485 -52934 -19417
16398 -19417 -12503 12707 29563 -510 -23386 10083 15090 13428 23204 12761 31945 4859
16386 4859 -45829 -75410 -54372 -26626 -13653 6420 -56984 -82642 -48469 -53706 -86276 -70053
16374 -70053 -67474 -50772 -37738 -46790 -29059 -41022 -14851 -7329 -45920 -72159 -43201 -20624
16362 -20624 14452 1398 -3676 3099 25701 29233 7999 6317 26402 30647 38429 48584 35098
16349 35098 32560 -1003 -52713 -60365 -72288 -64095 -57832 -51795 -52701 -38489 -21650 -18429 -25214
16336 -25214 -38543 -38758 -41547 -46501 -14341 8608 2232 -13636 -53437 -47296 -32275 -35251 -12546
16323 -12546 -72990 -79736 -75618 -80735 -62336 -45568 -35689 -3414 5218 -6071 -37467 -31486 -6700
16310 -6700 36255 43769 14091 25372 -201 -15193 -32339 -79717 -93010 -45653 -10348 -5619
16298 -5619 6057 -28287 -79598 -87271 -98970 -95440 -63998 -19953 -36880 -50674 -33218 -30039
16286 -30039 -33252 -11849 4718 15533 17935 -12888 -70908 -60930 -23228 -19441 -52408 -44639 -27579
16273 -27579 4238 12543 -38276 -49413 -18337 -15244 6393 17578 18684 19384 -8051 -28057 -4346
16260 -4346 40934 37994 37691 14012 -34003 -68172 -57255 -45235 -22069 -26687 -4453 -8355 -50001
16247 -50001 -82780 -49891 -20521 11650 3421 -25998 -21022 7736 11229 8890 -186 -21909 -5762
16234 -5762 20787 34228 32330 3775 -37661 -32794 -4951 4085 13105 15494 19006 15927 4872
16221 4872 -30852 -19261 -22697 -6149 13786 4733 -30477 -29679 -12576 15956 10367 -5852 -6872
16208 -6872 11711 33376 28404 19594 8812 -20657 -12150 -10901 -14001 -2847 -170 -24697 -57776
16195 -57776 -86888 -116336 -76635 -40824 -35701 -27157 -22786 -15913 -37206 -51487 -38053 -31144 -42250
16182 -42250 -54947 -44221 -9472 20905 9846 -42054 -55845 -44093 -42571 -15232 14081 10330
16170 10330 -54049 -84714 -68994 -71041 -74126 -81896 -62695 -15090 446 -41097 -102542 -96186
16158 -96186 -81344 -54262 -30017 -16352 -24237 14172 30276 5065 -2775 16731 25764 3960
16146 3960 25318 25477 21945 27523 36952 46932 7681 3285 -27867 -46185 -50501 -36751 -37563 -60527
16132 -60527 -50988 -11241 -3337 6981 22047 58794 37446 38403 32504 5313 4627 22112 3423
16119 3423 -20810 -12709 -27525 -16816 -28232 -45323 -15661 -17281 -33350 -24810 -7701 -13754 -33540
16106 -33540 -32359 3047 5152 5399 7695 -1766 14520 33621 2939 -46242 -23084 -3119 -19580
16093 -19580 -44281 -51913 -57836 -53591 -52458 -41000 -23000 -33219 -33272 -32648 -28331 -28102 11644 53179
16079 53179 63938 59850 49978 29231 -5478 -30032 -47457 -33718 -40034 -25778 -2719 -20633
16067 -20633 -32140 -2024 -9756 -32108 -22485 -48110 -36976 20344 14881 -4722 13511 855
16055 855 -1735 24801 20296 36155 15343 -13446 -19572 -24250 -22015 -6503 -24494 -40732 -42826
16042 -42826 -2360 21037 42987 36612 34001 -966 -5125 -5929 8746 29388 7517 -25880 775
16029 775 -1817 9128 20370 17075 11380 8967 11615 97 3349 10986 15101 48434 38167 -19551
16015 -19551 -50915 -37792 -44598 -68656 -84857 -86519 -74619 -39165 -26553 -49306 -40237 -29109
16003 -29109 -45414 -71978 -72464 -84272 -118802 -82399 -85288 -112851 -69422 -35189 -7635 -10868
15991 -10868 -39517 -53354 -43661 -34732 -42320 -9363 25117 19896 -15914 9352 26870 7136
15979 7136 -11906 17704 24533 31577 26478 7616 28338 1987 3731 13948 3594 10312 -15698
15966 -15698 -38848 -48501 -17076 65799 65191 -16212 -36572 1865 17060 10155 -8916 -6822 348
15953 348 3500 -20948 -12468 -2398 19813 42828 57649 23784 -10033 -12802 -31605 -24885 -47168
15940 -47168 -62646 -65724 -45533 -52721 -32098 16940 9890 3985 -56444 -57624 -36362 -17696 -11747
15927 -11747 -36738 -24019 -17154 -60976 -37490 2155 1648 25488 29415 33183 -26356 -32594 719
15914 719 2287 13219 16524 8047 26969 16963 -12094 -2031 353 -8628 -49949 -40732 -42177
15901 -42177 -30011 -17625 -29359 -29011 -59330 -53766 -55039 -51293 -12423 31785 11426 6510 -3845
15888 -3845 -15541 -9844 -9181 -1215 748 18209 53677 37469 15010 3034 6245 -7218 -37232
15875 -37232 -15464 5682 -20360 -15113 14946 9178 28 21908 42848 37100 20836 35485
15863 35485 32003 9057 43356 71212 24992 650 12056 -6923 22699 61400 73293 59107
15851 59107 40827 37142 22512 -1916 -18937 -41763 -46446 -40737 -32189 4012 4622 -22602 -52044
15838 -52044 -46094 -31231 -37930 -37354 -21545 8216 5700 1809 8663 -9522 -38088 -59091 -74689
15825 -74689 -52514 -49933 -48299 -77887 -81165 -63588 -72955 -60189 -53185 -41956 -39426 -40319 -54416
15812 -54416 -48783 -55367 -68528 -57330 -11433 3751 -37357 -75234 -74236 -72708 -93731 -83263 -59273
15799 -59273 -27208 -379 1700 -23534 -32354 -29962 -34095 366 54609 71177 56136 65933 43221
15786 43221 38490 26745 18381 16830 30793 39789 34837 42593 38943 33313 18857 16126 23823 27015
15772 27015 37480 27230 44490 39336 18215 23141 22078 -313 -14836 20059 43107 62797
15760 62797 90335 75246 39941 7922 -28728 -67672 -48984 -37626 -18696 -24449 -55539 -52761
15748 -52761 -21577 6701 -12289 -29701 -14403 -32540 -27572 -12429 -18787 -664 14683 54505
15736 54505 69815 65003 47002 53294 58476 16934 -28197 -89006 -91940 -79693 -45831 -31751
15724 -31751 -11540 -4196 -16033 -43280 -47122 -30865 -32434 -46988 -56027 -36488 -36774 -32784 -9284
15711 -9284 -6017 1198 35956 61627 42577 10962 -10020 9643 -11196 -45679 -972 -15092
15699 -15092 -33773 -27888 64 31974 14367 4749 -43585 -60398 -46705 -35642 -40217 -40363 -21721
15686 -21721 -7964 -6298 -1993 -17276 -37435 -15901 -11371 -23306 13513 -23464 -55880 -32718
15674 -32718 -25508 -20259 -10920 -24624 -36776 -33979 -34923 -16840 -22629 -12728 16357 17260 28937 31798
15660 31798 4459 -32775 -54556 -4699 -12063 8059 6078 -4674 22899 25258 15082 -9157
15648 -9157 -21390 -16343 5715 424 20877 3749 -69187 -56401 -5688 51901 72922 17134
15636 17134 -37909 -56221 -45000 -30348 -33330 -9005 12861 15144 -186 -11731 -16980 -20327
15624 -20327 -54033 -12183 16506 29790 9305 2530 504 -13090 -2503 -901 32845 23905
15612 23905 -13107 9911 13325 5051 -3306 16050 37613 8275 15275 1905 -1922 -23225 -90884
15599 -90884 -101563 -59053 -35247 -26221 -20927 -46838 -44214 -41622 -25705 -31365 -15971 -33202 -26301
15586 -26301 -11247 -6361 6285 -17921 -32538 -39237 -52581 -39362 -32204 -27712 -20659 -3230 -1789
15573 -1789 -8019 -6553 10181 32838 54143 26650 15905 8414 -9358 31499 39544 8529 -38136
15560 -38136 -7349 -11794 -13161 -23984 -17187 -2280 14017 10693 14091 -12713 -21396 6924 193
15547 193 24127 46906 22434 434 -1128 -5316 -3829 -28495 1820 11810 17153 -8078 -36701
15534 -36701 -44367 -14572 30707 15276 -12287 -21595 1424 -7295 3488 29361 12367 -2631
15522 -2631 -18013 -28473 -9925 4850 16270 28889 39351 18400 14585 5192 48510 45850
15510 45850 50537 42918 15646 -1223 -22917 -14523 -37586 -41479 -17316 18691 40781 17314
15498 17314 20788 11508 -15439 2118 21271 6358 -29346 -22990 12126 52852 80732 61422
15486 61422 37940 39822 35668 45498 55118 16637 -18349 -56692 -49395 -33111 -41440 -58514 -5533
15473 -5533 9271 2686 2661 -7664 -11342 10046 7804 -28367 -43303 -30061 18801 8785 -37482
15460 -37482 -55463 -47951 -63255 -58387 -50629 -29332 6450 468 -4011 15623 -6921 2 -13453
15447 -13453 -20268 -2192 -861 -5578 -4304 -25422 -61765 -71314 -62660 -64747 -34690 -4617 7850
15434 7850 -10123 -16366 -20266 15038 45793 50126 57027 32745 1052 -14460 -15939 -11719 -17084
15421 -17084 -56140 -80398 -37443 -10137 16416 10680 -2788 6308 -8284 -18065 -1652 -28525
15409 -28525 -10085 -17332 -21995 2182 17099 -1849 -18437 5180 1835 -21631 -55155 -71490
15397 -71490 -53704 -23104 11350 37143 62485 82559 107119 183279 255800 359782 514085
15386 514085 705431 806919 792644 692084 538113 386346 305016 250552 171077 106229
15376 106229 86216 88116 68837 40013 1033 -36607 -21889 13971 36762 -1329 -25916 -35500
15364 -35500 11550 37464 32661 23203 16298 -28438 -22226 4764 25970 30083 13311 -16037 -12074
15351 -12074 -8038 27852 31158 -10919 -6831 2626 5779 -9230 -12844 16408 5402 19918 44730
15338 44730 29849 22467 33881 49127 76569 61387 10405 17600 10474 -19421 -4837 6605
15326 6605 -16030 -50459 -36752 -10242 -39393 -50482 -9728 19550 36820 47239 46642 35731
15314 35731 48647 22127 18484 45070 54805 54604 35977 -8566 15563 28368 6247 -9511
15302 -9511 -27161 -30762 -60853 -64573 -31986 -6548 -11235 -15026 -35172 -53974 -22425 -19923 -22749
15289 -22749 -2865 -6207 -4108 60238 44909 -13344 -27646 4099 60761 84762 61313 69759
15277 69759 72465 71398 41986 2200 -20493 -23429 9281 25581 20339 9918 -10556 2026
15265 2026 -17577 -22325 -9511 -36637 -27338 2592 19559 -2141 5994 -1006 -19980 -15633 -28622
15252 -28622 -37280 -25323 9797 25737 35824 15223 26242 6978 -30215 -28082 -33105 -49581
15240 -49581 -45115 -26472 -11110 8904 -24618 -32827 -21975 -13602 -25992 3798 -5145 -8095 4912
15227 4912 20202 29373 26790 22074 -5536 -6826 -290 10273 31392 12270 22144 43248 47802
15214 47802 10195 -1318 4197 26280 41024 23318 44586 47944 34419 26899 46389 35951
15202 35951 -1747 -8011 -1175 12900 34499 56624 34040 3258 8933 31237 32735 37886 8554
15189 8554 -14653 -1448 -11682 1184 -3362 -30795 -28628 -12946 -13216 -16278 -14828 -19166 -24523
15176 -24523 -6091 647 -4835 -31999 -42796 -67474 -47264 -15516 -16086 -8053 -5109 -1421 17323
15163 17323 43385 35256 46040 61139 70386 34949 16108 9017 2985 2914 -2064 8589 35845
15150 35845 13956 9981 7394 11915 -3717 10252 3488 17398 38898 50947 56222 27837 41842
15137 41842 62765 25802 -7801 -22115 -22955 -4150 15276 28966 25094 55721 63552 36882
15125 36882 37533 44850 15868 11821 25647 3564 453 23410 40660 43390 33057 28344 19064
15112 19064 17179 13677 57690 62010 63711 46762 50784 43436 53790 82676 83834 59174 62058
15099 62058 72112 71704 77791 128833 181058 220915 255426 348018 447894 563698 718356 870016
15087 870016 973582 1032800 1004695 834060 643520 487777 394549 312241 238384 215376 175041
15076 175041 139383 137112 129871 108474 101005 77418 61933 70553 95059 107203 88214 82799
15064 82799 77911 36260 10797 3430 19888 31703 44049 78774 88368 81953 88969 85452 81518
15051 81518 42317 7610 -7737 23185 54706 75757 84671 50717 50435 49016 45469 -1323 -28988
15038 -28988 -14234 22208 11005 -8537 -16033 -3496 -3738 -24202 -22777 -13159 -414 13808 2169
15025 2169 -14390 -7579 7498 -14842 -16380 8012 -1301 -3231 16083 24660 25943 36934 47355
15012 47355 8253 -5618 16777 31422 11636 -26165 -31800 7830 -16863 -44980 -32303 -40226
15000 -40226 -63893 -51648 -34406 -39749 -57368 -79991 -39317 -33500 2226 4127 6096 231 9915
14987 9915 -1059 1316 2103 -20481 -27245 -32817 -53431 -56723 -35538 -5649 10364 5080 31399
14974 31399 42788 49918 53202 39587 206 -8607 -48108 -58956 3155 56594 36180 2699
14962 2699 5145 49121 70340 47089 42299 46349 32959 65682 61357 55583 48211 26420 -6116
14949 -6116 -17547 -29209 6547 58636 88151 84618 60259 49901 27812 30253 48393 61057
14937 61057 38243 -14482 -7631 4043 18340 25569 31695 24848 5405 8192 24434 -1547 -18346
14924 -18346 28756 100510 99936 59633 45195 25403 3636 8477 -12529 -19708 24938 44401
14912 44401 43709 13365 29989 72895 69524 65350 58000 54964 62102 40610 49068 73740 73010 66300
14898 66300 61716 18711 -22296 -3413 40351 54366 57781 67008 108800 136668 150427 170418
14886 170418 140295 114296 135713 129215 87332 45557 51333 61192 55816 47349 22881 9735
14874 9735 5144 37517 65548 55352 36077 26757 26810 10150 9813 34017 9562 -699 -2620
14861 -2620 2600 9469 -7850 -25233 -16096 6891 -2693 -27426 -4553 21358 14590 24102 48020
14848 48020 24960 6351 14216 3688 -5788 -13167 -13248 -49206 -57230 -48090 -27639 9862 35743
14835 35743 61269 112928 136867 138606 104867 77482 74154 96242 89912 94877 131114 122597 123908
14822 123908 116168 108620 93270 63838 61626 63791 56570 90365 96709 105262 59413 19096 19306
14809 19306 15683 2042 3339 -16346 -12537 39237 42208 23357 15903 33005 8643 35782 61561
14796 61561 45402 37702 65215 85180 132603 163875 165831 178288 148584 143782 114748 95656
14784 95656 105923 114310 106493 68346 49321 22739 29416 17060 41209 56961 94360 141109
14772 141109 145520 158058 168231 149097 118807 85328 68873 98449 151426 226639 269531 292189
14760 292189 321482 295441 219571 191948 203219 177132 174980 178902 198082 175445 124555 93224
14748 93224 74547 88372 128467 131693 96204 80043 64948 86127 115299 122917 113602 127935
14736 127935 145659 117208 141982 161064 133499 100398 115258 151313 178165 149880 165475
14725 165475 189820 151957 156161 171487 142190 183758 198149 218002 241741 240815 261522 280544
14713 280544 276046 277937 263892 280346 308203 305061 326148 350118 399222 402919 397591 427355
14701 427355 463894 507857 502565 486859 534454 580328 610988 678896 731919 810032 948174
14690 948174 1103986 1257798 1417937 1516471 1561715 1581277 1589276 1573136 1533816 1492390 1426654
14679 1426654 1334151 1239512 1133355 1092715 1121806 1146151 1174944 1240827 1380013 1501533 1648348
14668 1648348 1830531 2035755 2250716 2416465 2599660 2799250 2946928 3048272 3166076
14659 3166076 3304807 3494886 3752979 4119897 4629486 5262548 6077788 7073959 8268465
14650 8268465 9649850 11229170 13042992 15185604 17744668 20822703 24633473 29539685
14642 29539685 36114163 45424615 59142612 79118854 106316140 139041352 171558800
14635 171558800 194997603 201513743 188945114 161817642 128467025 96582487 70705760
14628 70705760 51948933 39302248 31015949 25447723 21503380 18517305 16170556 14193846
14620 14193846 12465976 10866133 9373891 8006358 6853353 5941047 5176443 4531616
14612 4531616 4071898 3744697 3467988 3259509 3097185 2978716 2872715 2773026 2673844 2548507
14602 2548507 2434238 2315592 2137584 1988492 1832396 1616753 1447737 1366373 1292044 1203049
14592 1203049 1128037 1119859 1094641 1077364 1030531 983385 968577 961888 935047 911013 902077 906832
14580 906832 907311 840138 775632 699195 625692 584896 580655 597783 591595 557287 548164 546638 468686
14567 468686 408847 404375 441490 483732 554469 643728 677490 683978 661876 619096 547147 457442
14555 457442 387120 335986 266460 238211 214312 195745 221845 204502 175382 213150 222802 216175
14543 216175 187448 178516 200624 190847 172485 152531 129597 171047 188457 192389 197244 213331
14531 213331 278525 276044 285932 305066 292043 253226 259963 235808 190650 182560 148718 148938 170484
14518 170484 161749 153830 147180 116824 105433 109601 123409 102113 68809 60196 70406 88116
14506 88116 60255 32041 56211 41713 41664 102009 153911 154018 126802 116815 132337 129393 108553
14493 108553 91513 120868 104964 97614 124349 116689 62012 33332 13049 -32927 -76283 -54964
14481 -54964 -52275 -47293 -33573 -17363 19165 15851 -2092 -6596 -10458 -17276 -14344 5111 15866
14468 15866 23803 29412 80096 82107 81849 116861 87589 46749 50600 53064 32453 -6777 -6871 27706
14454 27706 16690 31243 53080 70061 100292 117232 107126 96846 79128 59785 38089 13675
14442 13675 -4435 -5255 15976 325 -2882 2954 22605 49487 60712 46910 22753 30865 59966
14429 59966 74414 71188 39268 13675 -434 -6830 6343 18895 11957 15590 35984 54790
14417 54790 30694 20905 10894 -3369 8368 10278 38423 46304 35611 48172 3488 -45129
14405 -45129 -35439 -31046 -17274 38883 86750 106606 84341 11567 3416 2931 22630 3452 1671
14392 1671 18213 23024 46218 62455 72783 54801 44133 61108 34068 8318 36092 52855
14380 52855 27264 8848 31308 29884 27266 49234 25860 21080 22596 -12877 -17780 -501 -49539
14367 -49539 -51870 -34408 -26539 -13602 19446 8361 -5914 20569 3274 -5921 1828 -1408 -4077
14354 -4077 16178 20346 47245 47923 51333 39579 42414 16034 8204 40865 58293 17939 17588
14341 17588 36592 34295 6719 -16817 -6786 -1437 20847 -5795 -11006 24667 36818 25537
14329 25537 10545 7259 -5433 -33260 -27397 9088 40101 37331 62491 76360 47200 25767
14317 25767 5163 -2432 1627 -8991 -10957 6008 24198 -1990 -5662 -13886 -14170 31863 29692
14304 29692 6512 -13229 -19006 286 9127 29490 26089 27926 23483 23456 17567 10640 22618 33545
14290 33545 42732 41590 12192 -4557 -1360 35867 30371 25023 18321 36957 31337 36789 50181
14277 50181 58323 66031 30416 18095 54428 63664 42563 40989 80517 86751 51569 34161 59110
14264 59110 81615 86578 77906 67785 41735 57484 30670 26486 32028 70756 76052 73210 59749
14251 59749 58687 49187 42101 82871 130832 130357 117362 112409 124818 154684 186489 226002 268010
14238 268010 394546 558708 793734 1015386 1157715 1149337 1015457 800986 577982 402206
14228 402206 313130 247388 217590 137354 70169 78765 66583 53118 58622 67594 90226 88260
14216 88260 58455 36613 172 11333 25833 56583 86304 65343 53190 45766 24941 4403
14204 4403 9081 35044 22303 18519 13559 18586 -15229 -8626 3241 13601 10343 45686 67916
14191 67916 64145 63552 82347 92694 111323 151553 167038 190277 226339 246885 299448 412047
14179 412047 566259 766411 937681 1016873 1032170 1011610 886355 715542 578534 439589
14169 439589 321925 277583 216753 194708 161273 136539 115340 119706 112729 126316 116550 105657
14157 105657 87298 51972 32292 38060 55257 30188 -8364 9475 -90 3455 37433 82001
14145 82001 52962 36178 55093 103135 80107 75057 84549 62528 21645 17686 27169 15313
14133 15313 -5087 22919 12652 -17614 2675 -3675 27552 31473 -2004 -10725 -223 7565
14121 7565 54144 80348 51793 20071 23074 18866 -21305 -13397 -3562 16839 39968 10334 4441
14108 4441 30032 52257 19834 -11480 176 -14736 -13595 -5419 20508 21666 1800 28010
14096 28010 40735 21085 28622 35366 7830 -3623 -5909 -6841 -46892 -39332 3751 16058 27056
14083 27056 38334 59673 73774 43130 2779 18473 59865 34711 12737 34430 46930 36880
14071 36880 38987 70161 100315 50424 20078 31136 445 4537 35120 23431 39185 41705
14059 41705 40872 22156 7297 -36307 -49464 -49483 -26888 -29871 -21219 168 11164 25544 18316
14046 18316 5487 6197 32815 39646 13731 -10409 -26514 8906 237 19481 39301 68574
14034 68574 104631 69939 30197 30532 57590 40111 22765 32728 9056 -8801 -9212 -2341 39134
14021 39134 51867 26033 -2706 -3371 -6020 -729 15968 17237 19969 52029 83048 132053 196755
14008 196755 245382 220775 194769 197500 165947 111001 87068 66952 72165 64378 9293 -35502
13996 -35502 -24615 -25697 -6173 -17025 -41968 -7940 7736 -25473 -17769 -1479 30497 54570
13984 54570 42115 16984 2656 28772 51640 58588 92657 112257 126288 120250 56970 -3751
13972 -3751 4315 5764 22261 43209 54775 58079 53867 42890 24085 31311 47955 45994 31291
13959 31291 -9676 -4043 29464 62316 85935 84783 77094 89283 72621 85275 79215 89916
13947 89916 122295 147761 150646 112631 56612 30722 39450 58067 101682 118441 110828 92540
13935 92540 108787 132012 139860 105149 62006 63775 53021 48371 46195 55682 44238 47441 78104
13922 78104 94984 49398 51416 62984 32646 3325 3713 44006 104479 124957 111208 119795
13910 119795 109707 131479 204919 246602 231169 201445 175356 162036 95031 55920 68456
13899 68456 81129 84904 81063 76658 59909 67221 88964 90507 90495 75957 46346 54118 59097 75153
13885 75153 108048 130362 166832 186037 200565 181304 168499 174305 174310 137099 122994 144588 195695
13872 195695 203456 175106 184459 215013 263062 284581 305033 353067 405499 494824 578088 667803
13860 667803 782109 817605 846582 847600 837934 785658 715970 626463 529278 463190 399645 328841
13848 328841 273536 214589 196086 172332 150486 133376 93608 84791 107483 115454 150676 185301
13836 185301 196943 226016 236619 228679 214359 218758 231422 215283 200533 177512 181417 203847
13824 203847 237831 263126 248827 228406 211064 243006 263118 269908 274636 321651 352613 379393
13812 379393 376182 427554 478709 499189 488841 497362 533860 543038 510084 504332 565194 628867
13800 628867 648428 648882 677465 660181 649572 661580 692807 759199 825040 896937 993357 1021758
13788 1021758 1086130 1173291 1256754 1332869 1362534 1404032 1528103 1671722 1801895 1994333
13778 1994333 2233373 2487116 2896794 3451739 4109876 4860115 5653868 6464458 7264206
13769 7264206 8013017 8899315 9987057 11443372 13351489 15700856 18815501 23082106
13761 23082106 29144577 37988721 51460492 72861415 106620129 153153094 201436178
13754 201436178 230483111 226341177 195613288 152753022 110591412 77135370 54059234
13747 54059234 39248442 29888391 23819577 19677120 16693701 14455083 12761550 11359173
13739 11359173 10209760 9227910 8315436 7427446 6523776 5669729 4939466 4288981 3784546
13730 3784546 3375453 3019331 2727803 2496166 2290246 2087514 1899673 1713436 1521117
13721 1521117 1378026 1299184 1258174 1199528 1140910 1110559 1059058 1047845 1066774 1090308 1221609
13710 1221609 1472510 1726523 1760377 1581346 1338538 1110510 904412 802106 730523 685871
13700 685871 655809 650062 639463 610428 596499 587090 509581 442094 402358 354528 312324 307746
13688 307746 303000 269649 292069 293954 259891 257721 235467 237107 219942 228088 242033 255039
13676 255039 248423 239824 195120 164362 170352 196700 201320 195874 180095 187253 192552 193433 186348
13663 186348 202332 204422 199712 194644 152715 135678 154160 192719 180807 133070 117040 132482
13651 132482 130111 151244 141937 159638 174494 136478 133313 122650 100182 97597 95261 111539
13639 111539 96649 69414 76469 69964 87695 125868 170828 151083 116437 101713 92686 48591
13627 48591 18932 59230 99446 111251 119764 121956 91182 90222 84458 99058 82212 83294 101624
13614 101624 90057 90360 79031 65940 84071 113968 154905 131839 132640 93632 33406 5245
13602 5245 -15329 -85359 -92762 -85558 -72049 -48044 -19555 -31513 -52999 -52585 -22958 -24529 -25672
13589 -25672 2191 18322 43040 41000 48377 63878 91351 99513 96975 78037 47420 31155
13577 31155 37122 31190 33420 45212 94767 103907 91471 62467 14108 1475 -7969 1549 7912
13564 7912 -19768 -23818 -40321 -65865 -87084 -40726 -55968 -91252 -102507 -89312 -85256 -45579
13552 -45579 -12841 17317 30558 61223 68341 75382 44826 29809 31354 1908 29949 73781
13540 73781 85243 57453 14642 -275 -25667 -24519 -8844 11871 -26900 -16706 20477 35898
13528 35898 13898 -2705 6495 -2441 -1885 35270 31108 18973 21527 43886 25868 254 25671
13515 25671 60202 50289 42584 37080 24862 40412 49417 68694 90104 51707 23484 27544 33322
13502 33322 67744 96156 97311 114701 110616 84312 68140 76788 85904 53457 51024 21598 -8099
13489 -8099 13423 66666 77995 62160 97018 94558 86030 53579 35043 26007 -24890 -27343 -17440
13476 -17440 -27088 8327 38975 35529 33425 16282 -8034 6390 21135 34544 16596 27056
13464 27056 70504 96919 53351 -12630 -25011 -1300 21164 38231 47458 21666 18734 42229
13452 42229 72357 58611 -3586 -53377 -24766 24723 62955 83866 92286 49571 42471 46054
13440 46054 30738 12321 3564 -6606 28690 53021 49739 22049 14907 10831 -19285 -35020
13428 -35020 -28894 482 23068 11995 6019 -21463 -10994 -19704 -7421 4352 17261 14865
13416 14865 10711 11680 60699 90385 73711 61545 76392 82170 68765 87340 42082 -9112
13404 -9112 -5973 -1088 5645 14077 14892 -6705 -18031 -17764 -5230 -4235 -40578 -67861 -73232 -34676
13390 -34676 -33645 -24099 13589 33130 14603 -26933 -31820 -7626 5435 2586 -23427 -15218 -16453
13377 -16453 -33738 -32194 -4188 12253 11585 7078 33286 12655 8629 24311 -2203 -15648 -33530
13364 -33530 -63216 -65671 -33580 -3734 9015 18456 4992 -20618 -2435 29736 50723 43165
13352 43165 41547 35579 31772 18172 -22760 -58631 -28615 10451 12367 17439 48336 52522 35023
13339 35023 44878 20268 12647 6075 1272 41791 20993 -5692 -4578 -18421 -5221 2574 3672
13326 3672 35649 21867 18084 34879 6198 -24942 1465 -18 2703 11935 28716 27581 -49
13313 -49 -24917 -10365 33572 49953 30296 14016 -7186 2862 10516 28684 18833 6538 -15199
13300 -15199 -41371 -12425 3041 182 22546 51687 51533 58625 57319 28768 51761 69744 80328
13287 80328 57049 12405 -10838 14325 15863 -8505 -29899 -28148 29720 49082 64096 90820
13275 90820 120410 168661 227301 276480 373935 535921 765989 956920 1098554 1117274 1020500
13264 1020500 836794 621460 456566 321844 226260 151757 112650 99059 89212 85451 62401
13253 62401 54658 39492 57126 60743 67756 59896 49715 49458 31565 28193 39162 51659 46133
13240 46133 -303 -5602 2533 17252 13438 -31 26799 46412 21413 31270 26626 -7133 -42000
13227 -42000 -41793 7355 43753 37425 8938 11648 13319 28384 48488 61944 64324 35012 23002
13214 23002 21868 38095 50153 48085 44737 15592 -11749 18086 52145 29966 9800 10996
13202 10996 25361 -10524 -21854 -12879 -9180 -10017 -518 -4877 -55229 -64537 -18317 23420 64336
13189 64336 47338 -4277 9904 12927 27767 50649 26756 10680 288 -7411 -13497 22587
13177 22587 84032 126224 136772 180729 231461 249918 238392 195950 145092 88741 81459 60927
13165 60927 59061 44507 23817 24685 28062 11379 41128 59210 42648 13605 20431 26807 9555
13152 9555 -9151 11203 19954 6897 -10771 -13159 -8835 -14419 -10910 -32253 -41236 -16306 -9287
13139 -9287 -19742 -14074 19448 7079 31155 62342 75466 104108 159832 209652 212861 227653
13127 227653 240878 244271 220172 192220 139365 92959 65829 28270 18047 26697 45195 27823
13115 27823 -11245 -20559 -16392 -27829 -59052 -16986 38033 51058 65498 54548 20923 -5151
13103 -5151 -17104 -25746 -18973 -45199 -85915 -41956 -21552 -47709 -66507 -70948 -71783 -74240 -58091
13090 -58091 22498 58545 12402 11790 52760 51740 65944 76382 97603 103807 104909 91436 91916
13077 91916 67300 57880 46689 37977 7813 -8931 243 -10298 -6419 -4844 -22136 -29614 -22029
13064 -22029 -11889 -8570 -332 -16544 -1137 36419 56353 38176 2349 -10146 -31563 -59300
13052 -59300 -63954 -46080 -15348 -243 21332 17774 -15958 -27294 -27458 -27632 -54372 -60034 -10799
13039 -10799 47889 43110 23592 6311 -3440 -39452 -24248 -22872 -25843 -7706 46171 57714
13027 57714 32872 14457 32720 20148 8812 2643 10820 13147 21549 10658 -13563 -47101
13015 -47101 -22934 4849 23370 4551 -328 10142 -11568 -13759 9516 276 905 -1986 9048
13002 9048 33360 45113 70784 50964 29520 8082 13462 39692 20632 15976 -12845 -12363 428
12989 428 -10014 13054 44727 25121 17900 30816 34638 16902 26855 65514 72559 61243 38251
12976 38251 -15249 -14838 7691 14283 6546 41868 25441 17308 46081 30117 6046 -12898 -12332
12963 -12332 -9340 6231 6075 16159 32325 47471 26503 3198 -12243 -22308 -32337 -39651
12951 -39651 -42129 -22765 1707 8697 7452 9494 -1781 -27748 -47329 -46131 -33307 -9570 27943
12938 27943 13337 -12432 -19314 -24270 -27646 -28348 -44873 -34614 -46472 -75253 -79861 -53685 -30483
12925 -30483 -31788 -31005 -13089 15947 26862 12178 -1144 -14109 -18974 -22089 -24043 10665 -9400
12912 -9400 -36708 -43891 -24532 -19000 -32804 -65043 -54554 -16509 -8133 -1853 12229 27053 10585
12899 10585 -18646 -1668 56003 53165 -2004 -9689 -13490 -4298 -14238 -4690 4621 16921 941
12886 941 -16437 -29392 -50038 -69606 -31557 -378 5670 -9350 -12612 -5226 -9562 36419 24259
12873 24259 16786 -13151 -10561 -3255 30762 -21748 -32552 -29585 -29657 -19205 10140 -14970 -16779
12860 -16779 -16418 -23545 -38580 -54265 -48779 9445 2320 -31147 -40857 -49845 -1339 28302 23947
12847 23947 -13907 -19443 8176 22568 24174 11898 20749 22263 14610 8125 -20170 -29333 -25501
12834 -25501 -23574 -7816 -14950 -27432 -30079 -6531 -1311 -10395 -1882 15266 -4777 -27562 -13780
12821 -13780 -11030 4007 28883 27665 -10245 -26643 -36238 -39902 -16562 -26864 -73294 -85752
12809 -85752 -83131 -28899 15414 25018 12397 6718 -11063 -7933 -14536 4342 34325 20840 22074
12796 22074 42422 36723 23379 17585 189 -30996 -39294 -37808 -42993 -24712 -1083 26195 -2347
12783 -2347 -62667 -56795 -42775 -13408 -32169 -45439 -42306 -8174 30630 41183 36352 19896
12771 19896 5190 -13771 10150 63544 74433 55868 17768 2001 -7555 -19760 -16971 -32402
12759 -32402 -30883 -10965 18053 8157 -4510 28490 40797 25994 -21195 -10723 13740 11858
12747 11858 49016 44269 57305 62330 20258 -43092 -47023 -3773 16325 29212 18955 24027
12735 24027 13222 -20292 -21225 13304 28921 -17506 -35096 -26861 -18468 2813 27790 45967
12723 45967 66087 27543 37631 45130 14125 -20574 -27719 -44367 -71437 -83015 -48397 -45576
12711 -45576 -47713 -16659 -4745 33211 26276 13795 19097 9808 -28733 -47071 -28518 -17620
12699 -17620 -25809 -6358 -17900 -47925 -36803 1027 31191 22551 39845 35524 1304 -22626
12687 -22626 -1523 -5100 30838 37303 -5447 -48039 -91262 -94163 -50689 -31802 -68446 -66190
12675 -66190 -51032 -36150 -49053 -71047 -66936 -29145 -25576 -934 -9970 -24328 -8296 9834
12663 9834 -25519 -36043 -32813 -30654 -30281 15589 38831 44196 43811 69921 90245 69980 15662
12650 15662 -41296 -29929 -29744 -24778 -28893 -28404 -19940 15812 22142 3462 6641 9648 6966 31106
12636 31106 33541 31091 19022 2376 3972 -9547 -19591 -57743 -63793 -41460 -38394 -13978 -3303
12623 -3303 -22131 -29162 -46572 -41214 -15270 -6308 -11525 1961 -4477 541 -15269 -7139 -7590 -10396
12609 -10396 -42199 -72231 -59439 -20768 20192 44685 20900 16756 23821 32364 31305 17200
12597 17200 5847 10784 21520 7079 -33997 -43648 -24110 -11856 15266 6257 5783 29848 33905
12584 33905 32225 13466 -9804 -11167 -23649 -36642 337 19471 13044 -19842 -39218 -51420
12572 -51420 -44495 -10584 36502 68104 62511 46022 40942 25203 18309 -26332 -26840 10785 4422
12559 4422 -21090 -30201 -43410 -26721 -48034 -72213 -19832 34794 27780 7759 3743 -13211
12547 -13211 -30977 -39212 -61988 -105871 -61615 -7960 -4737 2925 8926 -22846 -56005 -14494
12535 -14494 -14458 -19941 -25774 -58874 -75468 -39160 -8250 -17981 -46777 -40779 -45638 -30208 -12738
12522 -12738 -5459 -36505 -33914 1518 24911 18277 19225 30134 17896 3869 5463 -2429 -23363
12509 -23363 -30107 -66393 -78409 -65789 -28574 -27376 -3755 15949 -11858 -1360 19547 15961
12497 15961 -20377 -25887 -31221 10083 15202 -17680 -31244 -6926 25439 9104 -28705 -38336
12485 -38336 -42345 -51288 -70556 -74374 -53286 -16045 21167 24815 36987 26200 25027 25176 5942
12472 5942 -32201 -33826 14814 36585 17119 56111 78112 62046 39353 32315 46379 34353
12460 34353 -1763 -33166 -6294 7652 11255 -23235 -297 26902 -5791 -26115 -30759 -52727
12448 -52727 -50212 -38956 -1419 28840 19545 2975 -8971 -16495 7022 -269 -8122 -14671 20430
12435 20430 27193 41590 62292 50635 8262 -12680 -24952 -36393 -59604 -24603 -4065 678
12423 678 9337 -296 -24310 -30569 -50952 -87911 -46237 14561 -2356 -9816 4651 -17556 -27899
12410 -27899 -31626 -10068 40499 37256 7153 -9443 -26454 -41444 -37996 -21346 -26834 -31928 -19589
12397 -19589 -24218 -29442 16812 32785 12265 -32613 -4928 -8542 -19109 -30516 -21870 12421
12385 12421 28353 12064 -3594 -11825 8637 50590 67995 59845 39377 39987 58410 55936 20672
12372 20672 18735 -2673 9082 22828 14852 1627 10582 19478 54257 92355 66753 54786
12360 54786 70042 108789 102347 51645 21116 12484 25314 8586 -7299 -42171 -56984 -35800
12348 -35800 -9581 31033 6155 -8807 -4383 -14305 9579 -1092 -21660 -71264 -72936 -63091
12336 -63091 -56231 -32575 -18928 -32396 -38039 -38031 -21476 33805 19142 8338 -10460 -57796 -65404
12323 -65404 -36365 9844 -10248 -9456 -25098 -21825 -31203 -40112 -64888 -67987 -31094 -17148 -27769
12310 -27769 -36362 -33101 -35820 -18292 -5773 16086 40013 34825 -4127 -16063 16144 2550
12298 2550 -2611 3209 4605 23377 28449 41670 32289 23476 26549 26392 11572 7777 21575 23725
12284 23725 18806 -20774 -28394 9372 25023 -87 4577 -4885 -30665 -32896 -40920 -28027 -38113
12271 -38113 -22473 -29593 -25301 -8157 -8197 7995 -14210 -17301 9083 -10457 -33084 14777 41667
12258 41667 37995 44469 40247 7402 -12238 -14331 -37263 -48499 -31658 5131 -6065 -30383
12246 -30383 -32821 -19482 3061 -539 -3571 -14610 -18579 5527 17921 -5435 -8672 3044 -2146
12233 -2146 -19728 -21499 6655 -10863 -23597 31005 52840 26382 -19041 -33452 -18512 -4674
12221 -4674 -15615 2437 -4916 -2125 13848 43494 55160 43600 24984 11845 26195 14859
12209 14859 -1058 13008 1722 -20984 -8282 4664 45462 50430 15612 -10917 20118 19589
12197 19589 -10251 -26166 -10096 -10048 -28688 -46449 -55178 -63003 -53858 -35506 -32031 -31795 -11480
12184 -11480 2116 -26075 -37355 -64990 -47178 -7363 18780 17583 35908 23579 -27234 -46555
12172 -46555 -33785 -16133 3889 54848 31271 4212 -12114 9035 -23777 -39796 -43408 -30185
12160 -30185 -33378 -74321 -53956 -30361 -28029 -44808 -33667 5509 -18163 -47735 -20095 43804
12148 43804 46357 22026 13606 4036 -9402 -20835 -8647 2224 3636 7575 3460 13036 -1426
12135 -1426 -5964 -23508 -32446 -59549 -43294 -24786 -32067 -52753 -59453 -59657 -55498 -39996 -6657
12122 -6657 28993 25568 -24917 -50930 -102205 -105426 -17157 11030 15804 4020 20463 4679
12110 4679 -3268 -10880 -15541 -8343 -9211 -31527 -38799 -39707 -30904 -3918 -17495 -47811 -39921 -2330
12096 -2330 19194 17208 18366 -13172 -33740 -13758 -14856 -20285 5364 -796 -14513 -3392 6328
12083 6328 4088 -16282 -37701 -40140 1880 -1500 -22261 -24483 -26701 -14091 33335 36467 27346
12070 27346 22111 -7888 -18657 -3648 7951 26212 20800 30553 45302 43659 36874 27371 10813
12057 10813 5207 11623 6904 36421 30678 21605 15041 3319 -37770 -12753 -4134 -11704 -11309 -3417
12043 -3417 34365 30200 9926 -279 -23136 -16290 -28746 -19761 -17265 -16802 -10247 -21096 -42779
12030 -42779 -24178 -7189 18875 17674 1336 124 11205 3408 6034 15739 14919 -5669 -21481
12017 -21481 -37068 -43493 -28220 -9817 7527 -1079 9720 21669 -18278 -15180 -36812 -28745
12005 -28745 5305 -4737 -27825 14879 7450 -4452 -16566 -15262 -21631 -61219 -62351 -65006 -27805
11992 -27805 1459 39914 42429 9389 3148 17380 35435 61292 65860 48355 38273 43481
11980 43481 82872 145051 176170 126868 42513 8408 4518 -20380 -58288 -55390 -12664 12947
11968 12947 38807 52026 18164 -4453 12398 12056 -4329 -16704 -8849 -28490 -51031 -96857
11956 -96857 -118847 -79246 -46249 -41828 -69018 -40637 -14660 -14120 -23677 -4157 13899 27726
11944 27726 37166 45962 39215 12878 -15887 -29351 -40491 -48728 -62686 -31462 -42635 -37103 -37029
11931 -37029 -23160 11478 42976 28772 -23769 -24105 -18568 -22109 -38887 -40222 -19253 -12396 -14316
11918 -14316 9156 2626 -27275 -39241 -22797 -19997 -11905 32423 32654 8757 19636 11646 -14469
11905 -14469 -31685 -74357 -67273 -30437 -7419 19428 20429 7083 59409 50354 -30896 -98829
11893 -98829 -75255 -74818 -32750 -19114 -32254 -43594 -46546 -36092 -11248 29868 15652 20011
11881 20011 -14267 -19690 -14149 -17809 -12763 -5823 -19253 -9829 -210 -177 2521 20172 43199 34210
11867 34210 -184 -35184 -5005 23368 -13631 -24201 -52951 -43792 -5171 5713 13064 39475
11855 39475 58819 77061 43663 -25085 -26887 -18423 10493 16140 3117 -28916 -38742 -22869
11843 -22869 11860 15070 20330 -16867 -63244 -56705 -35548 -41293 -57892 -60910 -51097 -47080 -62184
11830 -62184 -52891 -27842 -26295 -36758 -27692 -56888 -80180 -66626 -43875 -16489 2592 12303
11818 12303 4173 -7384 -13281 -9978 -38583 -50030 -26503 -25266 -26249 -7020 24703 2061 -38105
11805 -38105 -7107 6039 20206 26916 20123 23645 15585 -20011 -5330 3584 4967 -10057 -24345
11792 -24345 -23826 -40615 -59579 -69433 -18054 12217 18135 8745 -33491 -54157 -34840 -21258 -37798
11779 -37798 -32561 -12748 -33349 -33040 -6252 13368 45356 68865 60166 27232 30925 11272 -8834
11766 -8834 1630 -9032 -12224 -10707 -2022 8918 -18552 -46429 -67723 -47821 -46718 -36976 -28406
11753 -28406 -15951 -22332 -27856 -39340 -56455 -33662 -47934 -61882 -55399 -122 31561 17073
11741 17073 -3257 -13380 -34320 -40896 -22614 19539 57450 52607 31282 7476 -16251 -18795
11729 -18795 -5128 -31672 -69912 -65912 -47140 6328 -3692 -8001 -6935 -14966 -42265 -59351
11717 -59351 -65852 -65445 -10448 15495 11048 -17653 -38518 -32339 -67378 -83504 -84292 -49545 -12411
11704 -12411 -11514 -31978 -24985 -14695 -8365 -10629 -20611 -13903 830 10737 14443 17437 -165 -19147
11690 -19147 11138 7374 3321 401 29276 34020 28069 27098 13679 4818 11546 2444 -29136 24300
11676 24300 28443 31161 14700 -5092 -17064 -10868 3593 -20610 -28330 39576 13572 -26396
11664 -26396 -29233 -17246 -7182 -5892 -4267 -6702 -24362 -36219 -34315 -38688 -38673 -45190 -13847 13008
11650 13008 41900 5915 -26928 -23647 18547 45683 37887 6023 -43974 -61575 -40564 -14486
11638 -14486 -20606 -4016 -23393 -39212 -35678 -23299 8834 32959 33411 26729 49162 7009 -17856
11625 -17856 -21412 -6346 23600 -13418 -23231 4857 14032 -1747 -8856 -47382 -25315 -27814 -29283
11612 -29283 -25381 -26381 -24913 -5797 -28033 -48658 -26947 -7938 -2328 11538 19706 7373 -17815
11599 -17815 -51478 -58735 -58966 -55046 -21197 -29155 -17687 5343 7145 5248 -12585 -3792 -5004
11586 -5004 -7350 -13975 -47305 -78993 -78800 -63826 -74930 -65590 -56972 -25026 -29651 6793 60869
11573 60869 51236 13404 9524 -12580 -6797 -3485 -7957 26923 20462 -10433 -4387 2698 11893
11560 11893 18329 3891 -6905 11194 16110 -5230 -16936 -30971 -32634 -30821 -30675 -31654 -44331
11547 -44331 -65753 -62217 -38511 -29167 -57500 -44424 -23625 -4209 23563 -7952 -46970 -53599
11535 -53599 -27053 -20212 -20838 -57648 -72531 -59326 -58310 -12474 -4038 4182 -8060 -18273 -17769
11522 -17769 -12932 7040 -25041 -36790 -7207 16093 4864 -39487 -11743 16532 -6730 -33867
11510 -33867 -20840 758 -8109 -15439 -22034 -54190 -32980 -33124 -37765 -8154 18872 2081 -21572
11497 -21572 -8765 -4613 -18041 -32256 -53561 -30614 -19948 -8879 -5196 9530 28731 159
11485 159 -32769 -47020 -42409 -22393 -32819 -27666 -35618 -14970 -24553 -52655 -42396 7378 13627
11472 13627 -9017 -16937 -23202 -17752 -2750 -4408 8357 22605 49056 36151 -10499 -10891 -11921
11459 -11921 -19148 -19338 -4120 -2550 -2583 10214 -10428 -37823 -44799 -60579 -68507 -39693 -43096 -35982
11445 -35982 -36086 -67124 -55970 -25264 -8158 -27754 -10150 -2045 18466 20962 -2319 -17800
11433 -17800 -10002 9903 -1587 -27158 -65484 -69418 -62069 -29609 -22365 -37210 -22352 -14852 -24462
11420 -24462 -3829 -9307 27941 31404 4251 -17582 -18383 -10184 -11855 -25283 -15046 -19690 -6037
11407 -6037 2734 -11243 -62838 -71276 -83053 -77696 -63688 -46718 -18318 -8880 -11852 -9694 19215
11394 19215 24515 -19585 -10525 4602 16953 5252 7039 2389 -17764 -44056 -81642 -90124 -100544
11381 -100544 -86183 -49330 -3419 31850 17896 -30027 -40823 -70327 -56377 -40523 -62770
11370 -62770 -52105 -17448 -20072 -42966 -78860 -105151 -66461 -17537 -23195 -10188 5321 -34545
11358 -34545 -50672 -38145 -8208 18546 13008 13277 13364 15786 -23315 -40530 -50577 -47245 -35451
11345 -35451 -9796 4026 -7676 -31031 -21779 -14824 31256 46800 8337 -13766 14288 9993
11333 9993 13144 -13539 -28987 -24326 -52529 -47252 -33695 -35060 -32260 -15421 2509 -15662 -10485
11320 -10485 4203 6559 19896 -15639 -21745 -19631 12501 34846 10473 -1219 4674 -522 4031
11307 4031 32401 16921 -24901 -34715 -22938 2003 49999 46624 15703 -33714 -25902 -16154 -7024
11294 -7024 -15386 26840 65944 42607 -3147 -8603 -33500 -33013 -14734 -22153 -32065 -36356 3430
11281 3430 1505 -12408 -16722 -20465 -33122 5810 44700 43688 225 -5407 8950 6855 -6887
11268 -6887 -6437 11681 22001 814 -49621 -51911 -37652 -17917 -28351 -43520 13237 53920
11256 53920 29944 11557 32862 34100 22683 3124 -38582 -33254 -41289 -44221 -23925 -56602
11244 -56602 -77148 -26696 675 -4920 -18387 -14815 6242 4290 23720 31511 17863 17
11232 17 26208 60200 41209 753 -28513 -2006 13264 3514 9896 -28231 -34024 -19816 26126
11219 26126 11357 -5452 -30695 -22119 32601 46943 38418 33346 16638 848 -11667 -26058
11207 -26058 -34869 -23893 -9215 -9156 -2173 24491 24949 11890 -4039 -28545 1781 -20904 -26853
11194 -26853 -17974 26117 27712 6724 4574 4221 16373 44830 49971 36097 13487 -10900 -32777
11181 -32777 -24018 6210 28743 39630 41709 11288 -10622 -16537 -43998 -46830 -50651 -40948 10740
11168 10740 29998 33198 -197 -34412 -38715 -58539 -51982 -26570 -10163 -2227 -27269 1895
11156 1895 18873 12512 -21504 -31955 -26289 -8997 -15365 -18969 -24398 -30824 -37631 -51097 -30512
11143 -30512 3639 -1706 -13292 -27875 -29548 11653 11325 -489 7792 39537 7328 -14139 -23589
11130 -23589 -27858 -51077 -42602 -25427 -32464 -55614 -78194 -54122 -48985 -52456 -37001 -18835 -21481
11117 -21481 -19012 -26230 -39075 -58089 -39056 -60377 -60088 -55558 -10579 -2192 -38469 -11471 17116
11104 17116 20409 -18724 -20261 -29766 -41382 -41256 -28846 -17802 -16214 -1251 -12080 -22893 -55435
11091 -55435 -26553 12033 -4592 -9715 -12657 43 23166 14640 -28731 -23809 -2748 12595
11079 12595 -2524 -20538 -35800 -31273 -48466 -18826 -16384 -20962 -36860 -34003 7518 35536
11067 35536 62248 39694 9859 -6931 -6095 17407 23897 39278 45013 21218 22692 -10646 -22017
11054 -22017 -10828 -5378 -11540 17844 17057 7869 18660 18444 22554 34918 51047 16930 -20424
11041 -20424 -21781 -6296 -13834 -33457 -38855 -31772 -4617 -145 4576 12447 -6180 -13887 4716
11028 4716 7969 8403 13398 33025 44809 12606 -19429 1936 26722 26004 41043 44204 67411
11015 67411 90533 100057 61701 44195 37196 14923 -17152 -33429 -50315 -54666 -54950 -44059 -14415
11002 -14415 1248 -10417 -27233 -43599 -18133 9832 36277 28759 20655 3913 -52006 -15700
10990 -15700 18336 44394 71232 38113 7233 -296 -5746 4731 -4188 -30799 -8428 930
10978 930 -10608 -3278 -30351 -35203 -40557 -65051 -20536 23177 43283 46343 -324 -36941 -34378
10965 -34378 927 -29150 -27828 -37874 -80968 -99708 -76865 -54201 -20222 21234 9641 2501
10953 2501 -33417 -39391 -22145 -2202 -13379 -48480 -62363 -68145 -38316 -9501 -1451 7801 20983
10940 20983 729 -18638 11524 20035 3642 -2019 -3366 -19497 -37491 -60336 -62871 -43561
10928 -43561 -57028 -34361 -23021 -13265 9118 1392 -4912 -17032 -33054 -41825 -47133 -47989 -57379
10915 -57379 -85153 -78548 -63508 -54637 -32232 -48556 -51819 -39694 8003 15256 17690 3488 4460
10902 4460 -4389 -40487 -33141 -3378 23280 5064 -23214 -18595 -13010 -37995 -47845 -21662 -42032
10889 -42032 -58283 -37751 -14008 -31819 5265 23696 20566 7371 -2059 -11751 -17732 10821
10877 10821 23317 29608 27182 -24945 -55459 -38107 -22628 4400 -5435 -29125 -17321 -30059
10865 -30059 -66225 -49447 -8040 21545 174 -5582 -4378 -22137 8498 56100 52610 31654
10853 31654 10941 40232 33857 6218 8565 43786 56902 44599 23965 28881 53511 33781
10841 33781 184 20079 16334 -3178 -15398 -12952 5721 13584 30562 39810 10930 13442 -15887
10828 -15887 12693 45342 24434 20726 28363 -142 -28294 -44540 -27901 -1546 7741 -33518
10816 -33518 -2398 -7476 -39883 -24717 -7468 25792 46548 79016 71604 38783 -16339 -37692
10804 -37692 -57968 -25226 -34423 -61382 -38062 30204 42440 11596 1483 35727 47214 12652
10792 12652 3642 1690 16634 51795 64534 60214 56062 55302 62909 54937 30931 31162 2100 -11754
10778 -11754 -32720 -11095 -8355 31707 26399 -7552 -15767 -27993 -24637 10709 8009 3589 14451
10765 14451 9907 -10666 18949 15658 4304 -15687 -17287 -25213 25789 33678 -3986 -35076 -12754
10752 -12754 8080 30868 91114 119051 99850 51168 34561 40067 18955 34959 18242 44392
10740 44392 69595 86585 58228 30928 -9421 -44566 -22696 -35186 -53452 -40208 -24470 4088
10728 4088 33974 43690 29749 -3134 3149 2366 -12780 -12763 2400 13060 -3363 15030 25636
10715 25636 10595 -6961 -19541 -17010 -20080 -26118 -10381 -6434 -7908 12928 37 -6183 6587
10702 6587 5913 9880 13599 7893 12413 -15581 1971 12639 -488 12372 21590 28892 10697
10689 10697 2743 3519 5877 32952 4522 -66706 -58540 -39581 -28878 -7560 4772 14977 47946
10676 47946 29389 -344 -13438 14138 -7327 -7194 7579 11132 19323 -4273 -7578 27929 44129
10663 44129 4532 -2577 14389 14539 -3990 10093 16613 31245 21262 -16345 3856 16463 -23542
10650 -23542 -34291 -24193 -17857 -16505 -11126 -10705 -7869 -4985 9021 32935 23962 13615 -25540
10637 -25540 -20529 -21953 -3841 -3521 -9002 12991 29060 39733 -4207 -19035 6343 32050 50713
10624 50713 63078 27266 -9003 -23582 -29143 -23821 -19369 5579 -17462 -34370 -36665 -5824
10612 -5824 4003 15165 24804 2297 -4337 17557 7695 15870 33498 1845 -31382 -24877 8909
10599 8909 1968 1210 -14800 -46803 -11419 -3134 17453 6615 -8124 6309 -14438 -26095 -45542
10586 -45542 -35245 -55490 -66139 -58436 -36722 -12543 -13080 -24007 -6612 17345 35485 -13233
10574 -13233 -23253 -22091 -42665 -35135 -43651 -23902 7532 6042 2735 10873 -14267 779 25177
10561 25177 23802 23041 9344 34581 23119 2262 28687 27050 31754 19293 -11299 -2131 4539
10548 4539 2597 19688 7662 11982 18832 27099 32490 25073 -16822 -44394 -7830 10946 -1313
10535 -1313 26080 82364 53788 3745 26885 58958 44859 -894 17551 10019 18806 40505
10523 40505 35569 -2130 -30515 -8929 1845 -7527 -10618 -26369 -32267 -30322 -45429 -31134 -7878
10510 -7878 -10878 6608 21076 3460 583 2971 -7970 -19231 -6399 -9030 -24099 -28681 -32354
10497 -32354 -7363 17868 1847 -35555 -45749 -22267 -2445 -10528 -17291 -27918 -38519 -7303
10485 -7303 -17503 -38976 -42357 -58929 -65053 -77619 -99737 -103984 -84409 -31172 5829 5742 5234
10472 5234 15394 6697 -8736 -13640 -21201 -9389 -29491 -26383 -3835 -5661 1914 -3093 -7848
10459 -7848 -15531 2055 11015 -9258 2695 8175 -6049 17456 38836 30112 21498 25495 10728
10446 10728 -22001 -28227 -47683 -34084 -3522 50 -33421 -71524 -63130 -49059 -38219 -32293
10434 -32293 -63166 -63799 -88173 -49391 704 6508 21168 17383 -1332 18211 23043 -10449 -186
10421 -186 10340 -9466 -16291 -47409 -37570 14460 75917 42530 3428 2713 1437 344 -17247
10408 -17247 -14374 3294 23928 13160 -1598 -8836 -36827 -55953 -32116 -29232 -26223 -7675
10396 -7675 3248 2523 9649 7261 -22369 -32242 -14050 2673 -12696 -21279 -9737 -19401 -16640
10383 -16640 -25148 -5253 10167 21951 17717 -813 -6759 -23033 -11107 -4029 1771 -1942 -21866
10370 -21866 -50817 -31523 -4168 -24046 -8411 27809 35770 74418 91172 71774 38280 17652
10358 17652 27605 29610 33102 28211 38791 16942 6804 -10340 -23280 -14553 -36101 -22105 4983
10345 4983 4110 -4820 11594 35768 51375 18771 18629 42522 46507 38104 38108 48874 15847 -1102
10331 -1102 7635 -11260 -40316 -58117 -83183 -64199 -32146 6019 20465 23011 30476 16237
10319 16237 5934 7903 -6509 -40731 -73642 -77881 -68318 -36623 -30899 -23350 -7394 14585 33395
10306 33395 34800 34213 13113 -10425 -5143 -12842 -21671 -53241 -55367 -24900 6033 39387 49052
10293 49052 51762 18259 10026 25525 51938 63603 42151 13665 13922 25452 20747 12198 12885
10280 12885 20514 5893 -20632 -13589 -28605 -42792 -45582 -25332 -9986 21403 39875 49387
10268 49387 61549 60499 41150 34744 33855 47189 72828 81784 75111 79313 50538 60760 26981
10255 26981 18209 43711 51775 71320 57268 29714 48575 52772 20379 19847 52010 51963 60790
10242 60790 88663 92901 81927 40124 18407 49234 80725 91158 96216 117279 167223 240063
10230 240063 295888 395716 534665 631568 706825 838540 997711 1053464 968100 877165 820581
10219 820581 736433 616482 488471 368448 254220 175854 151949 108327 114880 115490 66785
10208 66785 63567 67876 56627 25721 16574 10087 -1221 22471 42632 41285 17321 10455 11185
10195 11185 10706 -2599 -23953 -16488 -30547 -11281 -10907 -26906 -46933 -60488 -56466 -47530 -3108
10182 -3108 40458 49041 27583 26372 28982 5968 4811 -484 16422 38164 26194 44137 15557
10169 15557 -2336 -761 -12479 -15422 -25402 -8490 11589 27160 -7997 -1949 12423 10580 -7674
10156 -7674 -24024 -15387 -17569 -44007 -27925 -37458 -49903 -23536 -13162 8830 10501 20549 13514
10143 13514 -969 -5276 -20393 -19619 -3056 3435 -15134 -750 -1197 15291 19564 39048 44480
10130 44480 52684 57802 41594 31749 35567 53375 25985 -10162 -24376 -15490 21362 14648 -3643
10117 -3643 16017 29983 33385 31708 31407 3996 -4312 -22984 -26057 18761 40085 32382 41076
10104 41076 67456 61366 37907 28415 21178 31558 13647 20990 41905 34080 19607 22140 18985
10091 18985 7772 1781 -12889 -5138 7424 -4958 -10127 9410 28252 32060 22954 18460 21315
10078 21315 19935 2294 42480 57691 52945 57411 56858 8553 -17663 -25932 -6072 5290 14456
10065 14456 28651 31204 27479 12017 8945 3004 2819 4230 -3447 -17912 -5365 -8529 -23151
10052 -23151 -9835 -20363 -54270 -35618 -24518 -10310 21268 18603 16582 22401 28688 57653
10040 57653 48969 21808 -3417 -8489 12671 58799 43082 37798 29306 2114 28179 33939 51684
10027 51684 94452 90447 62375 55754 42136 50841 59381 59967 49755 56198 53963 46274 24512
10014 24512 22184 20714 -20586 -19236 8579 14189 -16475 -9786 -1834 -14383 19876 19427 -1455
10001 -1455 -17719 -9114 4645 37851 58902 68814 80163 64931 51886 34819 15287 -10971
9989 -10971 -45460 -48097 -47415 -56518 -38293 -28487 -26108 -42700 -7224 4168 -5832 11063 24400
9976 24400 53244 53713 48442 62529 25820 6242 3292 8221 24923 14323 -25812 -43694 -36195
9963 -36195 -4838 -7507 18794 50968 29951 31683 19779 -24331 -17167 -25554 -22015 27302 64155
9950 64155 84508 60655 7595 -7666 -9738 7803 24913 1459 572 16012 38006 49977
9938 49977 19927 14901 -25534 -3252 23316 10180 17613 7767 -10344 3979 -6352 -4461 -31052
9925 -31052 -67103 -48264 -32322 -37203 -18959 18563 6075 -16 -11466 -7453 -16214 -16172 -14162
9912 -14162 1022 15876 20095 23493 8438 12270 46365 72674 48684 -5605 -17513 999
9900 999 26710 45408 54261 42686 9744 -1711 -22536 -6462 -12518 -12214 -18000 15026 28489
9887 28489 20437 8421 41573 23888 44228 58353 47656 27337 12185 32093 42383 49938
9875 49938 45262 29674 14405 -6808 44144 92607 142197 185324 254621 367100 567632 835786
9863 835786 1092906 1190284 1072633 836828 611413 410491 268562 208811 178799 136194
9853 136194 103013 91126 61310 79997 83874 59016 32332 17130 31202 43636 -543 -22236
9841 -22236 -9231 -33614 -3666 29993 40347 18190 -1744 8425 -7679 -9489 7364 -26789
9829 -26789 -44754 -24976 -3354 48938 77170 88654 57446 29895 38318 42270 25794 -11621
9817 -11621 -18881 -30628 -45496 -34170 -48984 -72240 -58715 -43396 -46777 -50568 -63221 -35272
9805 -35272 -36586 -22953 -13533 -29954 -65238 -64669 -11294 -7371 -48854 -56442 -51567 -34117 -326
9792 -326 7182 21122 -365 -1917 4016 22258 48293 56586 70591 82926 65246 58679 53122
9779 53122 55356 58943 31200 -3236 -12527 -26418 -14164 6996 17933 38872 59360 62344 62239
9766 62239 78609 42908 43276 56690 46122 38326 37947 41423 37228 34470 20127 29235 15846 16972
9752 16972 38990 66282 73298 59634 66292 28409 30225 44021 46240 53684 26881 18413 -2269
9739 -2269 -34302 -13208 21608 29413 21310 -17190 -6257 12626 -1498 -3633 67 10931 8988
9726 8988 2215 2927 499 12065 29939 38353 48983 27008 10313 6181 -19078 -18272 21814 77551
9712 77551 75543 75271 51167 29482 -3889 22658 49837 29652 2219 -12531 -8107 -14007 -14862
9699 -14862 -14373 -11224 10768 31195 38842 38076 23305 21388 34969 33848 34872 14736 -3728 23763
9685 23763 41228 -2123 -32626 -25582 -11632 -6921 1163 8956 21718 25596 26420 37851 46976
9672 46976 30573 24568 8466 16633 96 1515 -11251 -7394 3486 7382 435 -4956 6200
9659 6200 3439 42140 42822 19307 23126 29682 43112 26206 23835 5101 3810 30561 64861
9646 64861 76337 48969 48738 56065 38776 2758 -25305 -51368 -45947 -4351 34019 12441 -10829
9633 -10829 -17666 -10271 -17199 -8457 -6907 -27834 -40876 -20239 45518 93845 105849 99974 37766
9620 37766 19079 31971 20391 28600 32460 26185 -3812 3255 -23666 -3232 3377 -5457 7371
9607 7371 21923 31547 4872 9093 2154 -14747 114 3615 -18117 14317 7325 18486 37533
9594 37533 18430 20274 3348 19549 37867 50196 60459 58381 23737 -7151 14198 53616
9582 53616 70480 55564 45581 29755 33737 54357 39771 21121 22527 -7201 -8590 -24427 -25005
9569 -25005 -31230 -36658 -256 8456 -3378 -28411 -33439 -39160 -26823 -29363 -4650 10198 7841
9556 7841 36009 51748 41946 52397 38141 27057 30628 52885 47451 39161 9793 -2080 5027
9543 5027 26243 33728 23947 12359 27580 29326 17537 39282 21278 18372 18962 -14763 -23593
9530 -23593 -25577 -19528 -5986 -330 20822 29596 8555 -46191 -38497 -20721 -16502 -3658 -23734
9517 -23734 -50031 -4540 35896 47982 55210 60454 59101 52081 29771 3765 -1891 -6083 12089
9504 12089 19543 34612 38624 65603 48000 56249 62047 46430 18101 23353 27508 43644 49242
9491 49242 26424 -21572 -18554 -2152 517 31484 45463 30906 9675 34310 43328 39942 6425
9478 6425 -27299 -26738 -383 24351 65212 67993 35628 26071 -2119 -16917 2639 40473 98295
9465 98295 101665 52151 39210 39537 20041 674 8458 37865 4725 -18397 -24793 -17564 -6601
9452 -6601 10354 75163 75928 49505 28382 31668 69728 66171 62086 61516 72998 100576 100519 108462
9438 108462 80545 65522 52023 37019 27717 58605 73473 73422 84130 46182 28415 11592
9426 11592 25170 41642 53703 30554 18481 26180 39477 24758 61085 62893 35362 47665
9414 47665 96676 108334 95575 84663 59365 60661 58329 56770 30116 32051 41092 27542 8207
9401 8207 21649 41482 22961 -11537 21072 70881 76275 99595 90021 72768 34462 18409
9389 18409 -15028 -44994 -36602 -2954 6832 -12259 -11289 13325 -4413 -19135 -1799 27714 38804
9376 38804 63454 56633 7426 -22428 -3269 -9301 30811 67707 74809 65787 58295 54162 52439
9363 52439 18439 22868 37560 79236 95405 71265 60572 52576 51298 65235 52744 3496
9351 3496 2442 33208 26732 28546 35079 54547 47620 10973 486 8322 46583 38074 28721 37535
9337 37535 51592 57718 50009 47346 37613 45840 47584 41503 56128 47199 46223 23736 9174 -14012
9323 -14012 -21447 10416 40686 70264 62213 52450 41790 30413 31810 24993 10275 26363 37998
9310 37998 35036 52121 45899 58486 45080 57118 102916 87700 29737 -18146 -12184 11149
9298 11149 16981 23748 31685 59791 81099 35268 67541 97862 89311 63901 60091 73660 69874
9285 69874 86743 122065 142844 111672 99122 91495 101485 74638 62580 57526 49747 71912 55793
9272 55793 15741 7511 5182 -3426 -17702 7730 14547 5540 -7238 14730 -8840 -44806 -22126
9259 -22126 -6425 26734 48776 41195 52755 54899 31244 29773 28300 42653 70672 104425 102272
9246 102272 94892 123482 146693 162815 168872 124966 112051 83043 65459 88338 92624 95634
9234 95634 73772 77160 81893 86128 94863 97046 61223 57944 76668 64990 16183 30568 59094
9221 59094 62504 72973 58595 61945 77931 93326 71034 66728 85221 105060 132803 125457 114344
9208 114344 89610 111183 80919 55257 34044 66251 90947 103685 108012 98418 64237 71410
9196 71410 94413 90211 90320 102747 74222 35091 63638 92758 81185 88586 93266 69863 72345
9183 72345 92588 88661 92911 114523 126507 117031 131251 89946 81887 115267 119716 104831 104759
9170 104759 86867 97659 93916 81772 84068 71583 28552 27948 62789 100411 104799 71961 56046
9157 56046 78946 93379 120969 144524 140512 157996 131921 92140 103649 108212 104753 151789
9145 151789 163234 171679 168236 154107 126782 138911 154360 171035 185150 171123 125518 139814
9133 139814 164504 124232 109009 137976 131204 144124 151636 126138 124255 141618 132075 141429 165499
9120 165499 149345 167043 171169 160306 174904 177294 162260 147808 110493 114154 102420 102272 132292
9107 132292 149050 168124 172034 199987 228545 215730 178661 138004 135921 159996 203695 214154
9095 214154 216081 232757 235754 262290 267067 260293 249400 240494 256838 297205 315460 299377 311495
9082 311495 300621 306158 338207 381040 435843 494506 566238 620611 645609 719285 845448 959207
9070 959207 1126064 1335681 1606844 1930708 2328968 2885651 3643877 4692463 6272426
9061 6272426 8665830 12281828 16945667 20400336 20303183 17532559 13819610 10188240 7334753
9052 7334753 5402003 4150349 3268782 2612906 2147674 1812075 1555144 1325756 1160816
9043 1160816 1035580 906563 820586 742093 705780 670067 632713 570872 507951 482904 426961
9032 426961 379295 357612 324488 296494 265658 223226 200789 227376 222628 198115 195534 174627
9020 174627 217515 255222 256069 236422 229915 218433 207091 173407 169446 165683 142885 146096 127229
9007 127229 104766 75039 93159 74798 80861 105944 117455 120777 131863 159535 154692 163855
8995 163855 170198 159418 171002 172427 146713 152988 166922 172904 168779 185169 164614 128534 121972
8982 121972 112658 119169 123298 144635 136518 140458 168871 138080 85685 46959 65374 95780 71894
8969 71894 63169 72733 81216 94739 80429 65941 64664 68695 66739 52103 50136 56943 87147
8956 87147 107564 106564 77761 47459 7545 36762 31804 25597 56502 78436 81207 113917 99936
8943 99936 49933 62067 99296 100167 105837 140582 150530 153223 109787 30672 22841 38410 61726
8930 61726 67211 79499 76893 98781 127443 139464 124454 128257 145304 163638 163838 152900 150673
8917 150673 138136 118266 130533 163481 174065 220230 211981 217610 277148 316524 362092 410341
8905 410341 500955 542285 593511 679615 782067 932084 1091781 1334139 1752186 2398822
8895 2398822 3367721 4873784 7023718 8764723 8810608 7573294 5927034 4280984 2993109
8886 2993109 2109930 1606985 1306962 1040081 826228 733566 676298 636883 606673 520299
8876 520299 448077 375684 301548 267082 258030 239018 226538 195945 164515 139626 163078 156530
8864 156530 122977 87163 97086 109178 131448 145627 133861 98053 48435 52785 81023 91863
8852 91863 88207 60789 61562 52929 58115 49489 43462 47917 33288 22016 37663 39137 52992 48264
8838 48264 63884 71908 61995 35409 64294 76598 46181 48237 40924 25393 27711 6385 -35148
8825 -35148 -24706 31948 47223 41708 54247 60074 78249 95486 64336 9042 22847 67703
8813 67703 85188 81700 52754 27946 3924 8541 49185 60453 65438 114315 136924 102459
8801 102459 68955 61689 93450 49031 37694 77757 63429 17921 33096 53818 70229 59574
8789 59574 62805 72187 85141 98648 82505 74338 86980 89835 71906 49921 10158 -2997 -7924
8776 -7924 15777 22370 20750 48145 51907 62477 69434 41428 25642 7517 17217 44637 55523
8763 55523 40967 32762 55002 62542 34739 38580 38885 34573 25199 21911 50748 68762 31484
8750 31484 8143 20102 35936 53305 61508 47841 24358 40958 58503 5507 965 14808
8738 14808 -22700 -39789 -22103 -25967 -9005 30665 52556 43862 61552 90673 71836 44705
8726 44705 66057 71888 60261 95589 94493 92549 63374 62970 47344 49143 85800 127499 125817
8713 125817 103420 85972 89876 68508 70976 68192 52383 76131 75113 83150 101216 80972 51986
8700 51986 26072 -3066 -2093 -10841 3649 8712 15921 42257 46786 42372 56838 93228 90689
8687 90689 80232 55066 51834 25175 11538 65147 58750 83699 95870 91438 104835 86203
8675 86203 62632 86539 62235 39879 37707 66258 102959 107169 107053 105496 143070 280545 399812
8662 399812 399643 353694 306649 271348 186737 148463 122512 79734 79098 91235 87790 60310 37895
8649 37895 48221 55132 56489 16368 15116 34607 68251 75183 76121 86544 101983 117677 123061
8636 123061 112062 90188 122524 140734 145447 145405 160344 156474 160540 170109 205694 280612 274224
8623 274224 257550 271944 316986 403710 535198 742555 881722 848320 771213 665702 577952
8612 577952 497983 428675 373176 324619 277734 263959 253028 207524 170923 150414 150851 165382
8600 165382 153243 122257 99792 108975 118341 128939 126237 109145 96274 79759 101296 109963
8588 109963 93663 58478 29513 15320 55279 85918 108513 103074 103164 113605 109290 85485 114723
8575 114723 126587 160051 262314 346475 343220 290124 240355 199501 150991 145029 120269 117184
8563 117184 99112 93071 92843 90844 77941 46572 13383 38276 61338 83645 69296 57640
8551 57640 34483 30832 42714 47201 42390 53831 47335 39621 42028 30034 3381 4047 15488
8538 15488 7820 -14241 -23440 5717 41682 56244 31219 35841 26748 -762 -100 15210 2329
8525 2329 -5143 -17568 -10259 -20408 -10123 -9854 37751 55239 17825 10643 34445 60048 56859
8512 56859 43494 70475 72312 90869 107703 117476 81793 53987 50689 55127 70490 87809 68803
8499 68803 81216 92125 76806 45583 56821 72614 103732 146501 128778 108400 82548 59386
8487 59386 73775 49479 30638 28277 6084 4164 -22195 2359 24187 22209 -36818 -61618
8475 -61618 -24233 36197 50671 -6992 -13866 18267 14307 12263 27019 20174 39386 24817 20161
8462 20161 41689 80744 67498 32668 12235 21784 57457 92353 100757 76723 60525 26793
8450 26793 14697 16259 23887 11997 22596 45347 40752 31044 19143 18853 20897 38676 76550
8437 76550 94275 88241 82538 83262 39100 -4513 -24485 -4632 -376 2778 12098 -2149 14494
8424 14494 17261 39835 65397 85199 103974 105817 81997 58651 14041 33902 27482 14979
8412 14979 16465 45684 69641 67055 49799 18969 27725 50333 34736 20259 30326 33264 28728
8399 28728 12600 541 27571 36268 19578 11933 24047 38426 13035 -25078 -13174 21347
8387 21347 32071 8266 4825 5504 20279 29675 52271 59856 74961 34394 16003 18037 20144
8374 20144 32447 30665 17078 20744 48782 42962 27263 43340 39785 39106 56339 40194 48228
8361 48228 34404 45311 49853 42373 30469 28281 20743 30741 4421 -998 -8552 -10339 -4642 7246
8347 7246 38341 36896 40028 44917 53114 22586 -5267 -15619 -25664 4645 58937 38203 19877
8334 19877 11130 12335 -12444 19018 30235 2486 -24562 -69806 -66916 -35936 -5007 5924
8322 5924 18676 39582 48545 42573 -885 35726 75297 64414 45814 54933 32742 -4165 -38527
8309 -38527 -62901 -82907 -57711 -24651 -7012 -2461 -14869 -9975 8835 11628 21494 60048 55866
8296 55866 30127 -521 15428 15370 32791 24277 5629 -13113 -14479 -20886 -14756 -4793 -14818
8283 -14818 -20938 -32004 -13536 11782 48787 77075 32100 8124 39055 103008 109482 127741
8271 127741 127641 86842 56507 46616 47453 51380 26686 1105 -914 37995 50275 34218 20767
8258 20767 36913 13880 18834 33854 11718 -12253 -20273 -29314 -27108 -28796 -28046 -14157 -29454
8245 -29454 -58220 -38233 -15131 -12237 8206 27146 56036 37470 -4896 -18831 -69006 -81466
8233 -81466 -52934 -23489 -1981 41526 52323 63721 61637 32637 46203 31780 20640 52003
8221 52003 40368 6596 5991 26202 49404 63331 54356 52807 24624 -961 23651 17529 -14119
8208 -14119 3150 4100 -2174 19380 13818 -15775 -13930 -1704 14566 19889 -5715 13240 8960
8195 8960 18654 26755 3821 -8347 -38737 -22926 15329 37713 33734 17502 25508 27638 -2963
8182 -2963 -2835 7364 13588 -13305 -28997 -27948 -44404 -15012 42644 59451 29263 -11443 -60086
8169 -60086 -57546 -32093 -1634 7550 -5348 20976 34511 53521 11706 -11658 -13164 10065
8157 10065 49578 21010 -7871 17921 4314 -15994 23496 36223 19503 31202 24074 25891
8145 25891 13341 -6713 1158 -4132 -8681 3912 36940 32799 3848 13115 1640 -18999 -22055
8132 -22055 -35042 -55368 -61850 -31911 -1187 17550 1622 506 10725 14192 -10526 29340
8120 29340 46168 37495 47472 53298 5936 9503 40760 55457 39274 28035 -2740 2157 -4267
8107 -4267 47294 65857 68761 61515 56928 41875 47835 29993 25300 60122 60749 31069 14962
8094 14962 21437 26514 44208 55850 57410 41140 17643 19110 -3825 40494 48317 30725 24761
8081 24761 2040 -1224 10082 14191 22407 22448 12811 28721 17708 10125 29587 38793 44521 30455
8067 30455 21731 26324 13273 12005 43459 71882 61004 83323 77438 39342 30774 21722 -11754
8054 -11754 -7560 40735 71907 53493 55707 76652 117165 112144 94703 66405 42966 30991
8042 30991 73556 61275 -321 -31709 7579 20179 31126 48051 26508 8645 22576 62045
$$ [...]
##END NTUPLES=NMR SPECTRUM
##END=
