##TITLE=Analysis number 330227
Compound Code cc 63746
Book Reference 464/196/2
Project Code adrs
Chemist Name chrisr
##JCAMPDX= 6.0         $$ Bruker NMR JCAMP-DX V2.0
##DATA TYPE= NMR SPECTRUM
##DATA CLASS= NTUPLES
##ORIGIN= Bruker BioSpin GmbH
##OWNER= nmr
$$ XWIN-NMR		Version 3.5
$$ Thu Nov  8 14:12:23 2007 GMT Standard Time (UT+0h)  MAYBRIDGE\nmr@NMR_250MHZ
##.OBSERVE FREQUENCY= 250.131544655141
##.OBSERVE NUCLEUS= ^1H
##.ACQUISITION MODE= SIMULTANEOUS (DQD)
##.ACQUISITION SCHEME= undefined
##.AVERAGES= 16
##.DIGITISER RES= 18
##SPECTROMETER/DATA SYSTEM= dpx250
##.PULSE SEQUENCE= zg30
##.SOLVENT NAME= CDCl3
##.SHIFT REFERENCE= (INTERNAL, CDCl3, 0, 16.4344)
##AUDIT TRAIL= $$ (NUMBER, WHEN, WHO, WHERE, WHAT)
$$ ##TITLE= Audit trail, XWIN-NMR		Version 3.5
$$ ##JCAMPDX= 5.01
$$ ##ORIGIN= Bruker BioSpin GmbH
$$ ##OWNER= nmr
$$ C:\u/data/dgb/nmr/ADRS/380/pdata/1/auditp.txt
$$ ##AUDIT TRAIL=  $$ (NUMBER, WHEN, WHO, WHERE, WHAT)
(   1,<2007-11-08 14:11:41.13 +000>,<MAYBRIDGE\nmr>,<NMR_250MHZ>,
      <created by zg, POWCHK disabled, PULCHK disabled
       configuration hash MD5:
       76 6E 9A 78 1E 09 19 81 EC 84 63 8F B0 6A 59 2D
       data hash MD5: 64K
       B2 D4 48 AF 7A 15 72 0F C4 50 CD 9A 27 87 47 FF>)
(   2,<2007-11-08 14:11:58.72 +000>,<MAYBRIDGE\nmr>,<NMR_250MHZ>,
      <Start of raw data processing
       ef LB = 0.3 FT_mod = 6 PKNL = 1 SI = 32K 
       data hash MD5: 32K
       BC 67 67 07 26 F9 3F D7 C8 B8 5E BA B1 A2 F4 91>)
(   3,<2007-11-08 14:12:00.60 +000>,<MAYBRIDGE\nmr>,<NMR_250MHZ>,
      <apk 
       data hash MD5: 32K
       AC C8 9E 79 72 D6 6D FE 78 09 73 06 EC 92 3E 07>)
(   4,<2007-11-08 14:12:01.43 +000>,<MAYBRIDGE\nmr>,<NMR_250MHZ>,
      <abs ABSG = 5 
       data hash MD5: 32K
       99 B4 6A 5D AE C4 40 43 46 4E 33 C6 FA 84 0A 1B>)
$$ ##END=
$$ 
$$ hash MD5
$$ 62 C6 65 A8 63 CE 91 71 61 CD 63 E4 5A 1F 2D C3
##$RELAX= 
##$RELAX= 
##$RELAX= 
##$RELAX= 
##$RELAX= 
##$RELAX= 
##$RELAX= 
$$ Bruker specific parameters
$$ --------------------------
##$DU= <C:\u>
##$EXPNO= 380
##$NAME= <ADRS>
##$PROCNO= 1
##$TYPE= <nmr>
##$USER= <dgb>
##$AMP= (0..31)
100 100 100 100 100 100 100 100 100 100 100 100 100 100 100 100 100 100 
100 100 100 100 100 100 100 100 100 100 100 100 100 100 
##$AQSEQ= 0
##$AQ_mod= 3
##$AUNM= <au_zg>
##$AUTOPOS= <39 >
##$BF1= 250.13
##$BF2= 250.13
##$BF3= 250.13
##$BF4= 250.13
##$BF5= 500.13
##$BF6= 500.13
##$BF7= 500.13
##$BF8= 500.13
##$BYTORDA= 1
##$CFDGTYP= 0
##$CFRGTYP= 5
##$CHEMSTR= <none>
##$CNST= (0..31)
1 1 145 1 1 1 1 1 1 1 1 1 1 1 1 1 1 1 1 1 1 1 1 1 1 1 1 1 1 1 1 1 
##$CPDPRG= <>
##$CPDPRG1= <>
##$CPDPRG2= <>
##$CPDPRG3= <>
##$CPDPRG4= <mlev>
##$CPDPRG5= <mlev>
##$CPDPRG6= <mlev>
##$CPDPRG7= <mlev>
##$CPDPRG8= <mlev>
##$CPDPRGB= <>
##$CPDPRGT= <>
##$D= (0..31)
0 1 0 0 0 0 0 0 0 0.06 0 0 0 0 0 0 0.0002 0 0 0 0 0 0 0 0 0 0 0 0 0 0 
0 
##$DATE= 1194531100
##$DBL= (0..7)
120 120 120 120 120 120 120 120 
##$DBP= (0..7)
150 150 150 150 150 150 150 150 
##$DBP07= 0
##$DBPNAM0= <>
##$DBPNAM1= <>
$$ [...]
##$SUBNAM7= <"">
##$SUBNAM8= <"">
##$SUBNAM9= <"">
##$SW= 20.6930455092707
##$SWIBOX= (0..15)
0 0 3 0 0 0 0 0 0 0 0 0 0 0 0 0 
##$SW_h= 5175.983436853
##$TD= 65536
##$TD0= 1
##$TE= 296.16
##$TE2= 300
##$TE3= 300
##$TEG= 300
##$TL= (0..7)
0 120 120 120 120 120 120 120 
##$TP= (0..7)
150 150 150 150 150 150 150 150 
##$TP07= 0
##$TPNAME0= <>
##$TPNAME1= <>
##$TPNAME2= <>
##$TPNAME3= <>
##$TPNAME4= <>
##$TPNAME5= <>
##$TPNAME6= <>
##$TPNAME7= <>
##$TPOAL= (0..7)
0.5 0.5 0.5 0.5 0.5 0.5 0.5 0.5 
##$TPOFFS= (0..7)
0 0 0 0 0 0 0 0 
##$TUNHIN= 0
##$TUNHOUT= 0
##$TUNXOUT= 0
##$USERA1= <user>
##$USERA2= <user>
##$USERA3= <user>
##$USERA4= <user>
##$USERA5= <user>
##$V9= 5
##$VALIST= <valist>
##$VCLIST= <CCCCCCCCCCCCCCC>
##$VD= 0
##$VDLIST= <DDDDDDDDDDDDDDD>
##$VPLIST= <PPPPPPPPPPPPPPP>
##$VTLIST= <TTTTTTTTTTTTTTT>
##$WBST= 1024
##$WBSW= 4
##$XGAIN= (0..3)
0 0 0 0 
##$XL= 0
##$YL= 0
##$YMAX_a= 442903
##$YMIN_a= -595334
##$ZGOPTNS= <>
##$ZL1= 120
##$ZL2= 120
##$ZL3= 120
##$ZL4= 120
##$ABSF1= 16.43439
##$ABSF2= -4.258781
##$ABSG= 5
##$ABSL= 3
##$ALPHA= 0
##$AQORDER= 0
##$ASSFAC= 0
##$ASSFACI= 0
##$ASSFACX= 0
##$ASSWID= 0
##$AUNMP= <proc_1d>
##$AZFE= 0.1
##$AZFW= 0.1
##$BCFW= 0
##$BC_mod= 0
##$BYTORDP= 0
##$COROFFS= 0
##$CY= 12.5
##$DATMOD= 1
##$DC= 0
##$DFILT= <>
##$DTYPP= 0
##$F1P= 14.0000005364418
##$F2P= -0.99999901652339
##$FCOR= 0.5
##$FTSIZE= 32768
##$FT_mod= 6
##$GAMMA= 0
##$GB= 0
##$INTBC= 1
##$INTSCL= 1
##$ISEN= 128
##$LB= 0.3
##$LEV0= 0
##$LPBIN= 0
##$MAXI= 10000
##$MC2= 0
##$MEAN= 0
##$ME_mod= 0
##$MI= 0
##$NCOEF= 0
##$NC_proc= -3
##$NLEV= 6
##$NOISF1= 0
##$NOISF2= 0
##$NSP= 0
##$NTH_PI= 0
##$NZP= 0
##$OFFSET= 16.43439
##$PC= 1
##$PHC0= 169.2133
##$PHC1= 0.1099373
##$PH_mod= 1
##$PKNL= yes
##$PPARMOD= 0
##$PSCAL= 4
##$PSIGN= 0
##$REVERSE= no
##$SF= 250.130021911226
##$SI= 32768
##$SIGF1= 0
##$SIGF2= 0
##$SINO= 400
##$SIOLD= 32768
##$SREGLST= <1H.CDCl3>
##$SSB= 0
##$STSI= 32768
##$STSR= 0
##$SW_p= 5175.98343685301
##$SYMM= 0
##$S_DEV= 0
##$TDeff= 65536
##$TDoff= 0
##$TI= <Analysis number 999999
Compound Code 99
Book Reference 9
Project Code 9>
##$TILT= no
##$TM1= 0
##$TM2= 0
##$TOPLEV= 0
##$USERP1= <user>
##$USERP2= <user>
##$USERP3= <user>
##$USERP4= <user>
##$USERP5= <user>
##$WDW= 1
##$XDIM= 32768
##$YMAX_p= 324969419
##$YMIN_p= -588637
$$ End of Bruker specific parameters
$$ ---------------------------------
##NTUPLES= NMR SPECTRUM
##VAR_NAME=  FREQUENCY,     SPECTRUM/REAL,   SPECTRUM/IMAG
##SYMBOL=    X,             R,               I
##VAR_TYPE=  INDEPENDENT,   DEPENDENT,       DEPENDENT
##VAR_FORM=  AFFN,          ASDF,            ASDF
##VAR_DIM=   32768,         32768,           32768
##UNITS=     HZ,            ARBITRARY UNITS, ARBITRARY UNITS
##FACTOR=    0.157963299565203, 1,           1
##FIRST=     4110.73410927745, 0,            0
##LAST=      -1065.24932757556, 0,           0
##MIN=       -1065.24932757556, -588637,     0
##MAX=       4110.73410927745, 324969419,    0
$$ Real data points
##PAGE= N=1
##DATA TABLE= (X++(R..R)), XYDATA
$$ [...]
16521a0924P062m338J218J7682o047M108j4072Q835L768j1898m383K613r029j418
$$ -10924 -3862 -8200 -6982 10700 4653 8761 -5311 3524 7292 -4606 -8989 -6376 -15405 -16823
16507a6823m672J1165O642j1299L881l756Q424m15j7114j5183m541j0331j092
$$ -16823 -21495 -10330 -3688 -14987 -11106 -14862 -6438 -6853 -23967 -39150 -43691 -54022 -55114
16494e5114O729k001j2895J374Q68L931R755J7013m35R42J1851J1640J011l278
$$ -55114 -48385 -50386 -63281 -61907 -61039 -57108 -47353 -30340 -30775 -29833 -17982 -6342 -5331 -8609
16480h609o358j0475j9948Q88J8582N198M695q266Q199J2475q449J08j6291L490
$$ -8609 -14967 -25442 -45390 -44502 -25920 -20722 -16027 -24293 -16094 -3619 -12068 -11960 -28251 -24761
16466b4761L569O929l554j4328L901J6326J6048J368j2918J1419l170k1860j2752
$$ -24761 -21192 -14263 -17817 -32145 -28244 -11918 4130 5498 -7420 3999 829 -21031 -33783
16453c3783J3876N780l754J3885O963L44j4852j9331J843J9999o297P563J0778
$$ -33783 -19907 -14127 -17881 -3996 2967 3311 -11541 -30872 -29029 -9030 -15327 -7764 3014
16440C014l327p085m22j5644j1630r252n682L753k990J2357K5625r337m393J0839
$$ 3014 -313 -7398 -7820 -23464 -35094 -44346 -50028 -46275 -49265 -36908 -11283 -20620 -25013 -14174
16426a4174J0425k974j5698M072J5485p336M660M831j9964L465J4628r680m557
$$ -14174 -3749 -6723 -22421 -18349 -2864 -10200 -5540 -709 -20673 -17208 -2580 -12260 -16817
16413a6817k244j5300M804o207M895K3077J1380K766l9072j8605k371L550J7053
$$ -16817 -19061 -34361 -29557 -35764 -30869 -7792 3588 6354 -32718 -51323 -53694 -50144 -33091
16400c3091L0702O136o334j0579j5218P680q651j7434J7867Q905k954R43J1951
$$ -33091 -2389 3747 -2587 -13166 -28384 -20704 -29355 -46789 -28922 -20017 -22971 -22028 -10077
16387a0077q184j9477J2590R976j0653M539J5314k9373j2740J0512m472Q268N201
$$ -10077 -18261 -37738 -25148 -15172 -25825 -21286 -5972 -35345 -48085 -37573 -42045 -33777 -28576
16374b8576K566K477j0710q31k084J5513O384p49J1369P137J4670k94l874p876
$$ -28576 -26010 -23533 -34243 -35074 -37158 -21645 -15261 -16010 -4641 2496 17166 16872 12998 5122
16360E122l1228K402Q875L728K2Q493J0796n751m498M623J461J1493q890k9073
$$ 5122 -26106 -23704 -14829 -11101 -11079 -2586 8210 2459 -2039 2584 4045 15538 6648 -22425
16346b2425j8590J5537p07K791Q861p913R564M132k562J1848K3274j0908j6953
$$ -22425 -41015 -25478 -26185 -23394 -14533 -22446 -12882 -8750 -11312 536 23810 12902 -4051
16333d051k57K479O049k4681j3906Q892O284Q661J6586j7581j0326J6980N823
$$ -4051 -4308 -1829 4220 -20461 -34367 -25475 -19191 -10530 6056 -11525 -21851 -4871 952
16320I52O349j1510q650k089K5924J510j3327k610L653o729L829J4864O869p683
$$ 952 7301 -4209 -12859 -14948 10976 12486 -841 -3451 202 -6527 -2698 12166 19035 11352
16306A1352j1754j6835n944n356r927J1124Q080k751n275j734J5393J3739r401
$$ 11352 -402 -17237 -23181 -28537 -38464 -27340 -19260 -22011 -27286 -29020 -13627 112 -9289
16293i289k5189J2262K0731m912j1545M594P126Q795k193K360M262j4225j7563
$$ -9289 -34478 -22216 -1485 -6397 -17942 -13348 -6222 2573 380 2740 7002 -7223 -24786
16280b4786o875o673J993J0571K771J300p090m913O8j3994O40J3632J5332P626
$$ -24786 -31661 -38334 -36341 -25770 -22999 -21699 -28789 -33702 -33634 -47628 -46988 -33356 -18024 -10398
16266a0398Q058k069k4559J1808J4103L074q800k5824j1873p922L842O732R18
$$ -10398 -2340 -4409 -28968 -17160 -3057 17 -8783 -34607 -46480 -54402 -50560 -43828 -42910
16253d2910J9095K8782q963k5791K880J9831r440m373o905k793J889J5301R648
$$ -42910 -23815 4967 -3996 -29787 -26907 -7076 -16516 -20889 -27794 -30587 -28698 -13397 -3749
16240c749k480j4624j9236K8330J1762l5319j856J2180l74K229K4954j7918n288
$$ -3749 -6229 -20853 -40089 -11759 3 -35316 -37172 -24992 -25366 -23137 1817 -16101 -21389
16227b1389l886k702J7836N428J909k510n656J3713N014K325L54Q318j1110k4162
$$ -21389 -25275 -27977 -10141 -4713 -2804 -5314 -10970 2743 7757 10082 10436 18754 7644 -16518
16213a6518k03L870N403J631N151K3713l700j6824K916K6433K077q635J295M702
$$ -16518 -16721 -12851 -7448 -5817 -666 23047 19347 2523 5439 31872 33949 25314 26609 31311
16199C1311J4566n034j1388R216k1946j2589M620J5735J4394m392j1857J062j4779
$$ 31311 45877 40843 29455 38671 16725 4136 8756 24491 38885 34493 22636 23698 8919
16186H919j4219O473j356K825l921j7646J421l592l347K7256L666l044r81p537
$$ 8919 -5300 1173 -183 2642 -1279 -18925 -17504 -21096 -24443 2813 6479 3435 2454 -5083
16172e083K735L14J9112n781k141J570n375j55l278k652q867J860n223j0797o672
$$ -5083 -2348 -2034 17078 11297 9156 10726 5351 5196 1918 -734 -9601 -7741 -12964 -23761 -30433
16157c0433J9576J6566J5527j377m562J2576o646j4733m786K0122P697j7367k4683
$$ -30433 -10857 5709 21236 19859 15297 27873 21227 6494 1708 21830 29527 12160 -12523
16144a2523j0321L341j2040k997K0320R888k0459j141n498J1379K7260k800j7294
$$ -12523 -22844 -19503 -31543 -34540 -14220 -4332 -24791 -25932 -31430 -20051 7209 4409 -12885
16131a2885K714j723j6703K2017J1826j9472J279J0195O307K80k1117k3177O234
$$ -12885 -10171 -11894 -28597 -6580 5246 -14226 -12947 -2752 3555 3835 -17282 -40459 -34225
16118c4225P650l235k362J0801J6296j6744m424J2144J1146k960L008M055k035
$$ -34225 -26575 -29810 -32172 -21371 -5075 -21819 -26243 -14099 -2953 -5913 -2905 1150 -885
16105h85J2948J2555J630J599j2042j3880J3286M269k0376M768j0583J115k015
$$ -885 12063 24618 26248 27847 15805 1925 15211 19480 -896 3872 -6711 -5596 -7611
16092g611j1062l819K1326q810J52J7417o004K2831l846k5050j5281K428J0179
$$ -7611 -18673 -22492 -1166 -9976 -9824 7593 1589 24420 20574 -4476 -19757 -17329 -7150
16079g150O607q044k3811j819K3686J9187n282r763J6243N588r790q155o345q474
$$ -7150 -543 -8587 -32398 -34217 -10531 8656 3374 -6389 9854 15442 5652 -2503 -8848 -17322
16065a7322K2579j978J94m771o940j3188l686n678j095j1666J9453J9618K837
$$ -17322 5257 3279 3473 -1298 -8238 -21426 -25112 -30790 -31885 -43551 -24098 -4480 -1643
16052a643N623O487r811q720j0165m457n549M002N826J1538m203m680k422l97
$$ -1643 3980 10467 656 -8064 -18229 -22686 -28235 -24233 -18407 -6869 -11072 -15752 -18174 -18571
16038a8571O229J909R83l103Q582l102q355m664k96J18k1859R404j040N506O637
$$ -18571 -12342 -10433 -9450 -12553 -3971 -7073 -15428 -20092 -20388 -20270 -42129 -32725 -33765 -28259 -21622
16023b1622K0966J7912n332m983p097j925J5303M927J490j5965l61M163p875p862
$$ -21622 -656 17256 11924 6941 -156 -2081 13222 18149 19639 3674 3313 7476 -399 -8261
16009h261R791m219q696O682k016j3881j6229J506J2107o37k7166J665O61l312
$$ -8261 1530 -2689 -11385 -4703 -6719 -20600 -36829 -35323 -23216 -23853 -51019 -49354 -48693 -52005
15995e2005K5162J1078r926P654J4668J1433k1409Q16Q388r21m447j2418J092
$$ -52005 -26843 -15765 -25691 -18037 -3369 8064 -13345 -12529 -4141 -5062 -9509 -21927 -20835
15982b0835l586K1561L268J6318O890o106q214j3178m987Q15L773K364K2187Q715
$$ -20835 -24421 -2860 408 16726 23616 17510 9296 -3882 -8869 -8054 -4281 -1917 20270 28985
15968B8985r905j1185k307L884j9891j365j302n818R699j1800k5877K0666J7343
$$ 28985 19080 7895 5588 9472 -10419 -11784 -13086 -18904 -9205 -21005 -46882 -26216 -8873
15955h873P276r206k952J5654Q207j1947j1345Q38K530Q339K823P195J1517J9373
$$ -8873 -1597 -10803 -13755 1899 10106 -1841 -13186 -12348 -9818 -1479 1344 8539 20056 39429
15941C9429j2085M300N655p801p066k2191k2325j719J6722J0887o47k1976j8326
$$ 39429 27344 31644 37299 29498 22432 241 -22084 -23803 -7081 3806 3159 -18817 -37143
15928c7143K5684J3237L799j0690p650j684j0367q644J5683P315r958j9959k608
$$ -37143 -11459 1778 5577 -5113 -12763 -14447 -24814 -33458 -17775 -10460 -20418 -40377 -42985
15915d2985K2934J3000o525M280J1639j000Q187K424j0805j6208j14K9137P675
$$ -42985 -20051 -7051 -13576 -9296 2343 1343 9530 11954 1149 -15059 -15173 13964 21639
15902B1639j926o612j08L111j6383n573J3119k243r174q865M456L861M168p332
$$ 21639 19713 13101 12993 16104 -279 -5852 7267 5024 -4150 -13015 -8559 -4698 -530 -7862
15888g862l336K3812j2716q856J1727j2898j864J2035k0006p807R538J54n651
$$ -7862 -11198 12614 -102 -8958 2769 -10129 -11993 42 -19964 -27771 -18233 -18079 -23730
15875b3730N605J0330o788J924r331j5016J2593K7029J7898K563j0755M282J1585
$$ -23730 -18125 -7795 -14583 -12659 -21990 -37006 -24413 2616 20514 23077 12322 16604 28189
15862B8189j2435p584K610j3627j7110P052K5473N136l249q899o980J6681n341
$$ 28189 15754 8170 10780 -2847 -19957 -12905 12568 17704 14455 5556 -1424 15257 9916
15849I916j209P059P720q310P232j3421M258j814J8118j6948Q2J0307k5812j9
$$ 9916 8707 15766 23486 15176 22408 8987 13245 11431 29549 12601 12683 22990 -2822 -2841
15835b841r688j0856l248J9481J9387p904j5217O550R473j3537R558J355k4033
$$ -2841 -12529 -23385 -26633 -7152 12235 4331 -10886 -4336 5137 -8400 1158 2513 -21520
15822b1520j950J0747r99o767n877J180O927J0299L831K264n512O293M271J4386
$$ -21520 -23470 -12723 -13722 -20489 -26366 -25186 -18259 -7960 -4129 -1865 -7377 -1084 3187 17573
15808A7573j7491p391Q40J6591O543j4142J1982J1970j3800o466n341l037k670
$$ 17573 82 -7309 -6469 10122 16665 2523 14505 26475 12675 6209 868 -2169 -4839
15795d839O828L82j500r582K507K6479N797j0314q747k1292R250Q456P536r910
$$ -4839 1989 2371 871 -8711 -6204 20275 26072 15758 7011 -14281 -5031 3425 10961 1051
15781A051j558l21N157j9415r728j3753O989K5513N396q810N892p021l018K2012
$$ 1051 -507 -828 4329 -15086 -24814 -38567 -31578 -6065 -669 -9479 -3587 -10608 -13626 8386
15767H386m4j0821O182L774P249j2319J0045o165J73p681J2560J026j189m310
$$ 8386 8342 -2479 3703 7477 14726 2407 12452 6287 6460 -1221 11339 12365 11176 6866
15753F866J55J9264K9332Q432j7482j3418J785M667p091k4090j1557O00o090N187
$$ 6866 7021 26285 55617 64049 46567 33149 34934 39601 32510 8420 -3137 -2537 -8627 -3440
15739c440l138j1158p250p488K4451N269p001k906M573J2358K1684n085q877J3548
$$ -3440 -6578 -17736 -24986 -32474 -8023 -2754 -9755 -12661 -8088 4270 25954 20869 11992 25540
15725B5540j8779j0105j3207L875L2619N088j6076M050Q823k68o188j1019K9634
$$ 25540 6761 -3344 -16551 -12676 19943 25031 8955 13005 21828 21560 15372 4353 33987
15712C3987r5q218K565m583K857j804j7811J0481K1933j461J2191j5193o011m871
$$ 33987 33892 25674 28239 23656 26513 24709 6898 17379 39312 37851 50042 34849 28838 23967
15698B3967j1494j411j0350l33J1726r211j1933N624J2196m399j7409L839j473
$$ 23967 12473 11062 712 379 12105 2894 -9039 -3415 8781 4382 -13027 -9188 -10661
15685a0661J95J1303J2894L031k775j0833l954k2095pM24m02J3614R118N417j1449
$$ -10661 -10466 837 13731 16762 13987 3154 -800 -22895 -22902 -22478 -22880 -9266 -148 5269 -6180
15670f180j4402m795J085K5750L0402j6332j1294j556K2980R637j7384j1173n581
$$ -6180 -20582 -25377 -24292 1458 31860 15528 4234 2678 25658 35295 17911 6738 1157
15657A157J4185p123j2929r133j243l408P186J1453L5472J5805j528j1763r420
$$ 1157 15342 8219 -4710 -13843 -15086 -18494 -11308 145 35617 51422 49894 38131 28711
15644B8711j471O159N531p828j3760J1171q140k0259j7750L988J3600Q666K3565
$$ 28711 27240 33399 38930 31102 17342 28513 20373 114 -17636 -13648 -48 8618 32183
15631C2183J0367j5068j7138q604q395j717j078N826r208q927p256J281J4744
$$ 32183 42550 27482 10344 1740 -6655 -8372 -9450 -3624 -12832 -21759 -29015 -27734 -12990
15618a2990K2246j389J4187K0625j9958l0075j5506O466J1947M363n16o817J5627
$$ -12990 9256 7867 22054 42679 22721 -7354 -22860 -16394 -4447 -84 -600 -7417 8210
15605H210n678j6156k4096o793J4795L0732L3321n210j1305n669j1079J4O169
$$ 8210 2532 -13624 -37720 -44513 -29718 1014 34335 29125 17820 12151 1072 1086 7255
15592G255J1028k075r716j4811R103r99J2293J0085r121j8143o709J3122M169
$$ 7255 18283 16208 6492 -8319 784 -215 12078 22163 13042 -5101 -11810 1312 5481
15579E481q154j6883J0265J0415J947J751l764j5446l547n828M143J2692J0521
$$ 5481 -2673 -19556 -9291 1124 3071 4822 1058 -14388 -17935 -23763 -19620 -6928 3593
15566C593k219J5327l62j1186j1491o472K4182J5586K2572J796j4152k1510l950
$$ 3593 1374 16701 16339 5153 -6338 -12810 11372 26958 49530 51326 37174 15664 11714
15553A1714P997J2638O97j5057O186m412q146J2824L508P049j5167O44k823k415
$$ 11714 19711 32349 33046 17989 24175 19763 11617 24441 27949 34998 19831 20475 17652 15237
15539A5237Q717n153K284K033q935r955k669N395k453p064k12M882K59j959q971
$$ 15237 23954 18801 21085 23118 14183 4228 1559 6954 4501 -2563 -2775 2107 2366 407 -8564
15524h564L409Q214K214J1272M113J3477J1604k5294j3880J1247j270j1114R395
$$ -8564 -5155 3059 5273 16545 20658 34135 45739 20445 6565 17812 16542 5428 14823
15511A4823K365J4593j8727k603K1889l015l1420k398L393j5158o476J3118n475
$$ 14823 17188 31781 13054 10451 32340 29325 -2095 -4493 -1100 -16258 -22734 -9616 -15091
15498a5091j3785P148K2789K1432J6141j5639N316j0704K861j080k263N164J3450
$$ -15091 -28876 -21728 1061 22493 38634 22995 28311 17607 20468 19388 17125 22289 35739
15485C5739j42j4436M187N534n909p016k883j917N072L584J9196j3110j854J2080
$$ 35739 35597 21161 25348 30882 24973 17957 15074 13157 18229 21813 41009 27899 26045 38125
15471C8125N04r186j1304l187J1182n039j5975J076k450N760N925o268k617J3440
$$ 38125 38629 29443 18139 14952 26134 21095 5120 6196 3746 9506 15431 9163 6546 19986
15457A9986J3484r07j6546j4625M336K371P036j171P091J1248j788r753j4685
$$ 19986 33470 32563 16017 1392 5728 8099 15135 13964 21055 32303 30515 20762 6077
15444F077j9079j2909J6243N405N979J6423P949R69k005j8129J525n76J1030Q438
$$ 6077 -13002 -25911 -9668 -4263 1716 18139 26088 27057 25052 6923 8448 7872 18902 27340
15430B7340j2810k903N877Q285l398j3374o404J8147j5646k240M371J6048R689
$$ 27340 14530 11627 17504 25789 22391 9017 2613 20760 5114 2874 7245 23293 32982
15417C2982o40q52K3291j6528l8665j9268p066P447K3562J7690J9120L498j4650
$$ 32982 32342 31490 54781 38253 -412 -19680 -26746 -19299 4263 21953 41073 44571 29921
15404B9921R886n919l4919j4355O042J5194J4391q346j4520r578J1442K1038j1581
$$ 29921 39807 33888 -1031 -15386 -9344 5850 20241 11895 -2625 -12203 -761 20277 8696
15391H696n813r356J2698K3886j1294j0375K834O95M722r684J5772J0165M916
$$ 8696 2883 -6473 6225 30111 18817 8442 11276 11971 16693 7009 22781 32946 37862
15378C7862J3477k785k0249O121p128j2921j3084L172j0032j5124J2455L0054
$$ 37862 51339 48554 28305 34426 27298 14377 1293 4465 -5567 -20691 -8236 21818
15366B1818K0472j1055j2528j4781R866m738l758J0848j833j5080J2440K7517
$$ 21818 42290 31235 18707 3926 13792 9054 5296 16144 14311 -769 11671 39188
15354C9188K7430R026j1189q696k0703n588l485j159r016L50L10J3561J739M773
$$ 39188 66618 75644 64455 55759 35056 29468 25983 24824 15808 16158 16468 30029 31768 36541
15340C6541l311J1067o294j0060k508k0864J216O883j88o277k7637J5484O734
$$ 36541 33230 44297 38003 27943 25435 4571 5787 12670 12482 6205 -21432 -5948 786
15327G86J7540L182J3470P850j1763j1436J0075l384j6725j1861j4338L241J5205
$$ 786 18326 21508 34978 42828 31065 19629 29704 26320 9595 -2266 -16604 -13363 1842
15314A842J1497N406N23j4765j8924j7950N921J8715Q956k220N427J733K0393
$$ 1842 13339 18745 19268 4503 -14421 -32371 -26450 -7735 1221 -999 4428 6161 26554
15301B6554J2637j903l714j6555m013l908J053j6230p840J0316k3660n144K9811
$$ 26554 39191 37288 33574 17019 13006 9098 10151 -6079 -13919 -3603 -27263 -32407 -2596
15288b596j5414p293m223M612J4137R362m6o705K5758J6754j7699m646j444l685
$$ -2596 -18010 -25303 -29526 -24914 -10777 -1415 -1461 -8166 17592 34346 16647 12001 10557 6872
15274F872Q653q610r637P612M90j4664K329L5901J4434p833L6845J4018l0312
$$ 6872 15525 6915 -2722 4890 5380 -9284 -6955 28946 43380 35547 72392 86410 56098
15261E6098j2537j2528K1979K0039J041j717k028j9168j7492j3145j116J5031
$$ 56098 43561 31033 53012 73051 74092 72375 70347 51179 33687 20542 19426 34457
15249C4457K358K855j3680M874P755r348j4741J356R054k5558p252M118J9388
$$ 34457 36815 39670 25990 30864 38619 29271 14530 15886 24940 -618 -7870 -3752 15636
15236A5636O640r794O44k794m275J534J2894K491r139M493P325Q615p002p773
$$ 15636 22276 12482 13126 10332 6057 7591 20485 22976 13837 18330 25655 34270 27268 19495
15222A9495K9067J4589r582J6904m797r899q14p999m142j4778j2552J453J1216
$$ 19495 48562 63151 53569 70473 65676 55777 54963 46964 42822 28044 15492 16945 28161
15209B8161j9013J2577K2279j601j4048j5458J2126J8436J8051R505j1796j2107
$$ 28161 9148 21725 44004 42403 28355 12897 25023 43459 61510 71015 59219 47112
15197D7112J5296Q329k3211j2161R58j8005J3891R135Q151K2029n098L757m329
$$ 47112 62408 70737 47526 35365 36323 18318 32209 41344 49495 71524 66426 70183 65854
15184F5854J8186L315j6463j0038l0767k5025j3752N794J440J8221J2855J1269
$$ 65854 84040 87355 70892 60854 30087 5062 -8690 -2896 -1456 16765 29620 40889
15172D0889J0511Q446K3142k810l5051k1304P995n674p852J0337J3353M73J0404
$$ 40889 51400 59846 82988 80178 45127 23823 31818 26144 18292 28629 41982 42455 52859
15159E2859R236L234j3803j6097q680k105l090n989O181K669q079j2032J0930
$$ 52859 62095 65329 51526 35429 26749 24644 21554 15565 21746 24415 16336 4304 15234
15146A5234K7545q766P867K4566J391j1797M656L184k5091r72K593j5478R676
$$ 15234 42779 34013 41880 66446 67837 56040 60696 63880 38789 37817 40410 24932 34608
15133C4608j5050Q164J3723Q181k849n402K2553J2482j8051P508J8343j4068k7448
$$ 34608 19558 27722 41445 49626 46777 41375 63928 76410 58359 65867 84210 70142 42694
15120D2694n497J492J5598P459J5508L11J7487k5079k4783m085J4611N156J306
$$ 42694 37197 38689 54287 61746 77254 77565 95052 69973 45190 41105 55716 60872 62178
15107F2178k7128K171J1454m861J5564R053M056j2876j4053k521O534P593j3n542
$$ 62178 35050 37221 48675 43814 59378 68431 72487 59611 45558 43037 49571 57164 57151 51609
15093E1609R586K5603Q761P835J7427L752j2740j1859P47O597O61J5853K9323
$$ 51609 61195 86798 95559 103394 120821 124573 111833 99974 100721 107318 107979 123832 153155
15080A53155J4812J8080L8436L2833L5367P9424J06873P9805N9065P9651P5270
$$ 153155 167967 186047 224483 257316 292683 372107 478980 558785 617850 697501 772771
15069G72771N0241R887k3123l2151n9195r0513r9038q6346q0066o6605p0544m4661
$$ 772771 823012 832899 809776 777625 718430 627917 528879 442533 362467 295862 225318 180657
15057A80657k1232r303k2415l902m580j6203o949k990K450j2875j1407j606o770
$$ 180657 159425 150122 127707 123805 119225 103022 96073 93083 95533 82658 71251 69645 62875
15044F2875L662J1200j019k809p347J031j63N420J2927k1j4978j533n681r045
$$ 62875 66537 77737 76718 73909 66562 67593 67430 72850 85777 85756 70778 69245 63564 54519
15030E4519M763n559j3188k947R336J67J4251J4226M61J079J2840l089j9991o000
$$ 54519 59282 53723 40535 37588 46924 47091 61342 75568 76029 77108 89948 86859 66868 60868
15016F0868N362l61j1901n831R050J9832K4217J7784O501J0582R592J7688L8350
$$ 60868 66230 65869 53968 48137 57187 77019 101236 119020 125521 136103 145695 163383 201733
15003B01733M9939N7790R1110J25621K45258M41600O32467L81025l58760o85982
$$ 201733 251672 309462 400572 526193 771451 1213051 1845518 2226543 1867783 1181801
14993A181801m98978k49518j39615p8168m7134j1920j8955k2470j4140o883r063
$$ 1181801 682823 433305 293690 215522 168388 156468 137513 115043 100903 94020 84957
14982H4957k4528J681K2M609Q239J5739q343k2534k1643J744K949Q160J8760j796
$$ 84957 60429 62110 62132 66741 74980 90719 82376 59842 38199 39943 42892 51052 69812 68016
14968F8016j0772l107N197R118J0457l830N868J0302N148l966m195L317K726m826
$$ 68016 57244 54137 59334 68452 78909 75079 80947 91249 96397 92431 88236 91553 94279 89453
14954H9453j9172N948O401P704j0704J8609n170j2834o902P940r62j8188j2626
$$ 89453 70281 76229 82630 90334 79630 98239 93069 80235 73333 81273 80311 62123 49497
14941D9497J0288R805n510j2295R844K4155P605k1842N942J6971j536Q781j1159
$$ 49497 59785 69590 64080 51785 61629 85784 93389 71547 77489 94460 92924 101705 90546
14928I0546M846J901k6207K439J0531J9236J9222p79j4479J334n41o201k7140
$$ 90546 95392 97293 71086 73525 84056 103292 122514 121735 107256 108590 108049 101848 74708
14915G4708k9251j0450J5454J6338J631j0794O24k053J0824r025j2594K321R847
$$ 74708 45457 35007 50461 66799 68430 57636 58260 56207 67031 58006 45412 47733 57580
14902E7580L484l980J0983K0208p026o442j113q070p113n58J6407J7585K932M579
$$ 57580 61064 57084 68067 88275 81249 74807 73694 65624 58511 57953 74360 91945 94877 99456
14888I9456N758j9776r417o26J1385n310L33K153R933L203l077J4758L2088K7959
$$ 99456 105214 85438 76021 75395 86780 81470 81803 83956 93889 97092 94015 108773 140861 168820
14874A68820p140J082L0030J16j6418N048j261l230p299j5194j9137j2467J95
$$ 168820 161680 162762 192792 192908 176490 181538 180277 177047 169748 154554 135417 122950 123145
14861A23145j7246k440J0677l779K0999k181k0304j7071K52J358Q944K4700R93
$$ 123145 105899 103459 114136 110357 131356 129175 108871 91800 92052 93410 102354 127054 128047
14848A28047l446o884M14O452L2066r21k5679k7511r496K4027M565K50j255q700
$$ 128047 124601 117717 118131 124583 156649 155728 130049 102538 93042 117069 121634 121884 120629 111929
14834A11929j3894o923J24Q480K6955l226N172K6238r465k2765p262r532J428
$$ 111929 98035 91112 91236 99716 126671 123445 128617 154855 145390 122625 115363 105831 107259
14821A07259J1807J1181j4690K271J2147j3345l47J3955J019N615j3360p461Q917
$$ 107259 119066 130247 115557 117828 129975 116630 116283 130238 131257 136872 123512 116051 124968
14808A24968Q785j2245k0320p50k41K8492J4317M995J500N18j2624o407J4845
$$ 124968 133753 121508 101188 100438 100197 128689 143006 148001 149501 150019 137395 130988 145833
14795A45833N394Q851k8844j9602o19O117M047m515r406l669j0305Q034J014O152
$$ 145833 151227 160078 131234 111632 111013 117130 121177 116662 107256 103587 93282 101316 102330 108482
14781A08482k168q790K0186J0109Q139j224k5526j5484p21R573J2684J7461J9306
$$ 108482 106314 97524 117710 127819 135958 134734 109208 93724 93003 102576 115260 132721 152027
14768A52027j826J1902R079J573j4165m861L8098J1537J1301K0791J6409M490
$$ 152027 150201 162103 171182 172755 158590 153729 191827 203364 214665 235456 251865 256355
14756B56355K2731M852J1966O70K7390L6774K9665K8094K5143J5503L8310M2581
$$ 256355 279086 283938 295904 296574 323964 360738 390403 418497 443640 459143 497453 540034
14744E40034R392L881k1370k5185l5221m1831m2868m5894j8108P98j6614j4937
$$ 540034 549426 553307 531937 506752 471531 429700 386832 340938 322830 323628 307014 292077
14732B92077r615Q054m926k2630j042P026Q943L6J970J2879j521J8531J3164L115
$$ 292077 282462 290516 285590 262960 261918 268944 277887 277923 279893 292772 291251 309782 322946 326061
14718C26061r676J0520n281k474k34p2O266k291R077k452P07l494J6795K2310
$$ 326061 316385 326905 321624 319150 318916 318844 325110 322819 331896 329444 330151 326657 343452 365762
14704C65762J9562Q310N838J5704K4990N564k272J2334K4057J1655J2851n813
$$ 365762 385324 393634 399472 415176 440166 445730 443458 455792 479849 491504 504355 498542
14692D98542j0212n378M221j4538j0463Q268L1844J8732J271K9585M8370L1051
$$ 498542 488330 482952 487173 472635 462172 470440 502284 521016 522287 551872 600242 631293
14680F31293L0840L3542N6114M1530L8502P2330Q3696P4727Q4633R9444J55555
$$ 631293 662133 695675 751789 793319 831821 904151 987847 1062574 1147207 1246651 1402206
14669A402206K02869K56143L23280L83550M07923M10822M08377L48271K67294
$$ 1402206 1605075 1861218 2184498 2568048 2975971 3386793 3795170 4143441 4410735
14660D410735J59483N8344p4846j70625k63842l06065l04078k51367j93331j15441
$$ 4410735 4570218 4628562 4553716 4383091 4119249 3813184 3509106 3257739 3064408 2948967
14650B948967k2725N5442J96600K78539L76482M82409O13442P07985P39752P42186
$$ 2948967 2926242 2981684 3178284 3456823 3833305 4315714 4929156 5637141 6376893 7119079
14640G119079P25834O39998N47112M59826M12309M70495N99850P82741J089030
$$ 7119079 7844913 8484911 9032023 9491849 9904158 10374653 10974503 11757244 12846274
14631A2846274J487991K006455K682726L621185M903581O683046Q945891J1649204
$$ 12846274 14334265 16340720 19023446 22644631 27548212 34231258 43177149 54826353
14623E4826353J4438641J6688900J7776295J7337393J5087636J1098071N528039
$$ 54826353 69264994 85953894 103730189 121067582 136155218 147253289 152781328
14616A52781328r77137p367028j2654096j6309433j8200971j8367491j6936211
$$ 152781328 151804191 144437163 131783067 115473634 97272663 78905172 61968961
14609F1968961j4335460j1219077q262483n876364m156126l045801k378893j910290
$$ 61968961 47633501 36414424 28151941 22275577 18119451 15073650 12694757 10784467
14601A0784467j570594j313019j135447r81802q36930o82530n50031m52814l82525
$$ 10784467 9213873 7900854 6765407 5783605 4946675 4264145 3714114 3261300 2878775
14592B878775k92399k44412j98047j85408j61802j50872j23024j07364j31567
$$ 2878775 2586376 2341964 2143917 1958509 1796707 1645835 1522811 1415447 1283880
14583A283880q5082q7185p3864o5104p0222n7805m2714o3162l6626k7875l9139
$$ 1283880 1198798 1111613 1037749 972645 902423 844618 801904 738742 702116 674241 635102
14572F35102m4651l2024k8257k0202j3724j2442p439j6236k6331j8890j5390k7469
$$ 635102 590451 558427 530170 509968 496244 483802 476363 460127 433796 414906 399516 372047
14560C72047j6603j0378K771r508j2502p382j7016k3022p787j2788o068j4987
$$ 372047 355444 345066 347837 338329 325827 318445 301429 278407 270620 257832 251764 236777
14548B36777k2978k3735O052L140j5569k2778m196k678j5109j1463j7771l8836
$$ 236777 213799 190064 196116 199256 183687 160909 156713 154035 138926 127463 109692 70856
14536G0856l644K917M307J3830J7558N742m486j3558j5536k788J107j7581Q531
$$ 70856 67212 70129 74436 88266 105824 111566 107080 93522 77986 75198 76305 58724 67255
14523F7255J0195J488O346j5766k8928P149Q777o993k1056l111L926j1669j2843
$$ 67255 77450 78938 85284 69518 40590 47739 56516 49523 28467 25356 29282 17613 4770
14510D770J3742K5905M626N478J4944n953L559r779O238j8339k8643R070J1987
$$ 4770 18512 44417 49043 54521 69465 63512 67071 57292 63530 45191 16548 25618 37605
14497C7605k5523m6950m6760l6348j6737k1515k2072j9999k1198l760M01K7797
$$ 37605 12082 -34868 -81628 -117976 -134713 -156228 -178300 -198299 -219497 -223257 -222856 -195059
14485a95059K6396K1218L1292K6697K2394j183r768M954K6674K3521l365n949
$$ -195059 -168663 -147445 -116153 -89456 -67062 -68245 -78013 -73059 -46385 -22864 -26229 -32178
14473c2178O905J1860J6774J4474j1483Q602N737J6151J5610l983j8065K3K2127
$$ -32178 -25273 -13413 3361 17835 6352 14954 20691 36842 52452 48469 30404 30427 52554
14460E2554J3719k3337N199p55l123j6030j2461n564j036J039m819Q306j017p578
$$ 52554 66273 42936 48135 47380 44257 28227 15766 10202 9166 10205 5386 13692 12675 5097
14446E097J3913Q282J0142q93l0985j8634q237m840p462Q553J3268P254q125j3699
$$ 5097 19010 27292 37434 36541 5556 -13078 -21315 -26155 -33617 -25064 -11796 -4542 -12667 -26366
14432b6366J2885J3772J7926J373K243j5966k58O720J0481j0847j7546k5484R79
$$ -26366 -13481 291 18217 19590 21833 5867 5609 12329 22810 11963 -5583 -31067 -30088
14419c0088P121J9288L801J381k8089j6278K5598O270j1350l767K714j7885o997
$$ -30088 -22967 -3679 122 1503 -26586 -42864 -17266 -10996 -22346 -26113 -23399 -41284 -48281
14406d8281Q43J4210K2906K335j6861k7215P015j0801l087J279q151M023K471
$$ -48281 -47438 -33228 -10322 -7987 -24848 -52063 -45048 -55849 -58936 -57657 -65808 -61785 -59314
14393e9314J8388J3899j2027k9315J7500L1802J3317k0858k588J8894J8694j4380
$$ -59314 -40926 -27027 -39054 -68369 -50869 -19067 -5750 -26608 -29196 -10302 8392 -5988
14381e988k3032Q067P182o707j0041n241p445J0423L3754J3861j2831j2545m891
$$ -5988 -29020 -20953 -13771 -20478 -30519 -35760 -43205 -32782 972 14833 2002 -10543 -15434
14368a5434N297m3o293P255M486J8352J990R693j733n576j1859K162j8772N235
$$ -15434 -10137 -10180 -16473 -9218 -4732 13620 15610 25303 23570 17994 6135 8297 -10475 -5240
14354e240J1585Q738p419k952j6737j5950J0192J6757K1695R247j4644j0420r688
$$ -5240 6345 15083 7664 4712 -12025 -27975 -17783 -1026 20669 29916 15272 4852 -4836
14341d836m460j8239N406O437K722M794n582j1076p833j5571N311q45L640J2581
$$ -4836 -9296 -27535 -22129 -15692 -12970 -8176 -13758 -24834 -32667 -48238 -42927 -43772 -40132 -27551
14327b7551P823l966o869J6067P028J1378k45j3752O331K1453M131k5242k0216
$$ -27551 -19728 -23694 -30563 -14496 -7468 3910 3665 -10087 -3756 17697 21828 -3414 -23630
14314b3630j8822k0886r621J7638J8860J926j3641l272j55J9385j029J1486J8856
$$ -23630 -42452 -63338 -72959 -55321 -36461 -34535 -48176 -51448 -51603 -32218 -33247 -21761 -2905
14301b905M202p127j4883k2931N336L758J0966M127K855q91K138o366R33J8647
$$ -2905 1297 -5830 -20713 -43644 -38308 -34550 -23584 -19457 -16602 -17493 -15355 -21721 -20788 -2141
14287b141q29k0182n389n367k996m177j381O480p382k779K770o403p359m02N889
$$ -2141 -2970 -23152 -28541 -33908 -36904 -41081 -42462 -35982 -43364 -46143 -43373 -49776 -57135 -57537 -51648
14272e1648J5190K354j2151L091K2075p179j6042l365m498J6541K7635n086j0334
$$ -51648 -36458 -34104 -46255 -43164 -21089 -28268 -44310 -47675 -52173 -35632 -7997 -13083 -23417
14259b3417P946O465M9J6167l684k1012p040J5663O445j3722k627N970J433P884
$$ -23417 -15471 -9006 -8957 7210 3526 -17486 -24526 -8863 -2418 -16140 -18767 -12797 -11364 -3480
14245c480j2932m932l515K358M611O03L103J7034M454K701O814K197p986k3061
$$ -3480 -16412 -21344 -24859 -22501 -17890 -17287 -14184 2850 7304 10005 16819 19016 11030 -12031
14231a2031q313J1627L626j0413j8232m481m983l020N677j2740J0009K1438l687
$$ -12031 -20344 -8717 -5091 -15504 -33736 -38217 -43200 -46220 -40543 -53283 -43274 -21836 -25523
14218b5523j3842l495R917O433j0628n806L4293J4512o193R427M212k991j5001
$$ -25523 -39365 -42860 -32943 -26510 -37138 -42944 -8651 5861 -332 9095 13307 10316 -4685
14205d685l839K913o111K179J0387R676O550n545r703k8619k3352P399J5562J606
$$ -4685 -8524 -5611 -11722 -9543 844 10520 17070 11525 1822 -26797 -50149 -42750 -27188 -25582
14191b5582J5990K9181J621j3208r368L128J8865P426j9819j800L709J0420J6808
$$ -25582 -9592 19589 21210 8002 -1366 1762 20627 28053 8234 6434 10143 20563 37371
14178C7371R999k596J1432J5421p554m507J5678O517J4683K1796L4714M2356N7189
$$ 37371 47370 44774 56206 71627 64073 59566 75244 81761 96444 118240 152954 195310 252499
14165B52499P2229J09445R7673Q2315N1126N4516K7144L767k7111l8883n1041
$$ 252499 324728 434173 531846 614161 665287 719803 746947 750714 723603 684720 633679
14154F33679q1208o0684p3759j02979p7708n6066m0802j6534k0835k3312j5852
$$ 633679 552471 491787 418028 315049 237341 181275 140473 123939 103104 79792 63940
14143F3940k0545j1902j1117P500K823j596k2585L356q779j4174n292N558q419
$$ 63940 43395 31493 20376 27876 30699 29103 6518 9874 1095 -13079 -18371 -12813 -21232
14130b1232L516J1187P624p764M029P122J1522o387p149m930J5925J5229m17n828
$$ -21232 -17716 -6529 1095 -6669 -2640 4482 16004 9617 2468 -2462 13463 28692 28275 22447
14116B2447o62n11j9307j1007O640J5519k338n743J1553r137j1372j7765L276
$$ 22447 21785 21274 1967 -9040 -2400 13119 10781 5038 16591 7454 -3918 -21683 -18407
14103a8407N236r219J341J7580l505j7860K1002J9355Q275p363o076j387l679
$$ -18407 -13171 -22390 -21049 -3469 -6974 -24834 -3832 15523 23798 16435 10359 8972 5293
14090E293J3830M641j5455j126J4189N87O647j4385p492j2148q265K4070K6520
$$ 5293 19123 23764 8309 7183 21372 21959 28606 14221 6729 -5419 -13684 10386 36906
14077C6906J2927O258Q133j6721o492j025p204j0474j533P073M315J5720P781
$$ 36906 49833 56091 64224 47503 41011 39986 32782 22308 20775 27848 32163 47883 55664
14064E5664K315J3738O330J5767K5847j0010L164J3226J5526J6924M3063J6806
$$ 55664 57979 71717 78047 93814 119661 109651 112815 126041 141567 158491 201554 218360
14052B18360L8912N7529P6177Q4622R8782J33376J89645K46826L20368L78046
$$ 218360 257272 314801 390978 475600 574382 707758 897403 1144229 1464597 1842643
14042A842643M72633N12410M76108M05167K87886J51632l6542k28341l81056m73525
$$ 1842643 2315276 2827686 3303794 3708961 3996847 4148479 4111937 3883596 3502540 3029015
14032C029015n20740n06663m64435l80286k88518k03548j43625r7460n4785o6999
$$ 3029015 2508275 2001612 1537177 1156891 868373 664825 521200 423740 368955 301956
14022C01956o4882l8344k3231k0184n265j0579k1307M172n299j8524k8620J530
$$ 301956 237074 198730 175499 155315 150050 139471 118164 122336 117037 98513 69893 71423
14010G1423m06n863j1585O549O483L330l590K949j877k59n677l0650j0659j3671
$$ 71423 71017 65154 53569 60118 66601 69931 66341 69290 67413 67154 61477 30827 20168 6497
13996F497J202J0720o18J1223O448L798j6627q26j976N033p072j8135j6007J1248
$$ 6497 7699 18419 17801 29024 35472 39270 22643 21817 19841 24874 17802 -333 -16340 -5092
13982e092R757J4349K520M911p69j3056o242m391R151n962j7356k533J5628j2034
$$ -5092 4665 19014 21534 26445 25676 12620 6378 1987 11138 5176 -12180 -14713 915 -11119
13968a1119o213L916P586Q657J0724K2418J704N986K7672L8775N6304M1181N7230
$$ -11119 -17332 -13416 -5830 2827 13551 35969 37673 43659 71331 110106 166410 207591 264821
13955B64821J01017J54139J97134R6721r7519k13383j90067r7742o0592n1288
$$ 264821 365838 519977 717111 813832 716313 502930 312863 215121 154529 103241
13945A03241k4952j3764k6537p553K381m649l198o301n214l111m811o314K145
$$ 103241 78289 64525 37988 30435 32816 28167 24969 18668 13454 10343 5532 -782 1363
13932A363m339j0388j232J4247q975K234L093O798j0657N306l398m649j2355J3730
$$ 1363 -2976 -13364 -14596 -349 -9324 -7090 -3997 2801 -7856 -2550 -5948 -10597 -22952 -9222
13918i222J3593o551j2482J1127J4768n70J501J858M804p631k0311p009J0716
$$ -9222 4371 -2180 -14662 -3535 11233 10663 12164 14022 18826 11195 -9116 -16125 -5409
13905e409k424J861Q810m625L373m644j0575K876J3817J4497n428q451j644J3546
$$ -5409 -7833 -5972 2838 -1787 1586 -3058 -13633 -10757 3060 17557 12129 3678 2034 15580
13891A5580r813K445R914R429l049k0660p752P589K771l83q271J649K915J097
$$ 15580 5767 8212 18126 27555 24506 3846 -3906 3683 6454 6071 -2200 -551 2364 3461
13877C461R205L550J1527k993j4031j0743o969K642O991J4439K91j4164N393l650
$$ 3461 12666 16216 27743 24750 10719 -24 -6993 -4351 2640 17079 17370 3206 8599 4949
13863D949j270J2256l161j7419k61J6516J3635k4517l1516n936M428K0015L8838
$$ 4949 3679 15935 12774 -4645 -4906 11610 25245 728 -30788 -36724 -32296 -12281 26557
13850B6557J2020k5572L354J0149J3970R956j6739j6657j3054O880P357J4671
$$ 26557 38577 13005 16359 26508 40478 50434 33695 17038 3984 10864 18221 32892
13838C2892j0321q837Q4n799k722L510l379j9684l130L433K7651j0718j0195q101
$$ 32892 22571 13734 13818 8019 5297 8807 5428 -14256 -17386 -13953 13698 2980 -7215 -15316
13824a5316n458p656K592J1928J7325J495k9401J2717L9302j3309k5106j4200
$$ -15316 -20774 -28430 -25838 -13910 3415 4910 -24491 -11774 27528 14219 -10887 -25087
13812b5087J6718K4206o814J4042j11r668K771O121j646p608p518M461J0527j0127
$$ -25087 -8369 15837 9023 23065 22954 13286 16057 22178 20532 12924 5406 9867 20394 10267
13798A0267k2444O362J5969m92p266j0300J9772R447j0538J1772R196j339Q117
$$ 10267 -12177 -5815 10154 9662 2396 -7904 11868 21315 10777 22549 31745 30406 38523
13785C8523o946n495L80q02l504j1983j683J110K1636L129k1834j6597o679Q575
$$ 38523 31577 26082 26462 25660 22156 10173 8490 9600 31236 34365 12531 -4066 -10745 -2170
13771b170j966J8442q013M392l624N902P377j1418O889M801R697m153p960j7443
$$ -2170 -4136 14306 6293 10685 7061 12963 20340 8922 15811 20612 30309 26156 18196 753
13757G53M279K9840P24N446J0436o472j8437j1406j2826o41L739l989Q327j580
$$ 753 5032 34872 35596 41042 51478 45006 26569 15163 2337 1696 5435 1446 9773 8193
13743H193L333J1988Q862L480K821M804K752j4248j2222l071q169N824o273J2595
$$ 8193 11526 23514 32376 35856 38677 43481 46233 31985 19763 16692 8523 14347 8074 20669
13729B0669P177J5352k099j1748o410P807J3811j0925l06O79j749P17o131j0367
$$ 20669 27846 43198 41099 29351 22941 30748 44559 33634 33328 34007 32258 32975 26844 16477
13715A6477j3565R51n829M2J4511K1026J0637r881k511j7276l2346N74L0249J4655
$$ 16477 2912 3863 -1966 -1924 12587 33613 44250 34369 31858 14582 -17764 -17190 13059 27714
13701B7714J444p437J1709m46o600J491q973P631J6483O700j2817j2079M476m327
$$ 27714 29158 21721 33430 32984 26384 27875 18902 26533 43016 49716 36899 24820 29296 24969
13687B4969l6j2925K192J3769M923o760j5474j028Q320q633j5023Q290J3868J6946
$$ 24969 24933 12008 14200 27969 32892 26132 10658 9630 17950 9317 -5706 2584 16452 33398
13673C3398k1638j7003J1197O44P400K187J1592j1420n915j0851k219L262j9213
$$ 33398 11760 -5243 5954 6598 13998 16185 27777 16357 10442 -409 -2628 634 -18579
13660a8579M933J2470J9655K2996o563j3995j634m983j3048J855j3529j2022J2639
$$ -18579 -13646 -1176 18479 41475 34912 20917 19283 14300 1252 3107 -10422 -22444 -9805
13647i805J0259p793j8649K54K8474K3233R391j8418j8696q786J1092K7525P092
$$ -9805 454 -7339 -25988 -25734 2740 25973 35364 16946 -1750 -10536 556 28081 35173
13634C5173j5295o981q110J043L856J4930K0882J7009j1250p865j1471j1214j610
$$ 35173 19878 12897 4787 5830 9686 24616 45498 62507 51257 43392 31921 20707 19097
13621A9097J4267K0854J0655k4761L047p88j0427j9106R06j3472j093O151P488
$$ 19097 33364 54218 64873 40112 43159 42371 31944 12838 13744 272 -821 5330 12818
13608A2818J5028p332j6254J0971J1056O97o175j2340m741J5002N472P2J4484
$$ 12818 27846 20514 4260 15231 26287 26984 20809 8469 3728 18730 24202 24274 38758
13595C8758J4348l2141j7462P088R019J0481l046j164j0261j2092k271M3383M097
$$ 38758 53106 20965 3503 10591 19610 30091 27045 25881 15620 3528 1257 44640 48737
13582D8737p056k204J700k3091l507L436o2j3811m604j6620Q394K4775J137n690
$$ 48737 41681 39477 41177 18086 14579 18015 17953 4142 -462 -17082 -8688 16087 17224 11534
13568A1534j0050J4492o519M218K2031k1145j156J9375p604j7137P42K5P997R301
$$ 11534 1484 15976 9457 13675 35706 14561 13405 32780 25176 8039 8781 8806 16803 26104
13554B6104K6768n322j2591K849J5651N624k871q889j2329k4170J4953J6473k1496
$$ 26104 52872 47550 34959 37808 53459 59083 56212 47323 34994 10824 25777 42250 20754
13541B0754J04J3036K2351q041k1628J593J64K935J982m041o720j7239p314n491
$$ 20754 20858 33894 56245 48204 26576 28169 28333 31268 33250 29209 22489 5250 -2064 -7555
13527g555J1354J5491J6693J2250j3555k739n532J419J5442k491m710k1510j0457
$$ -7555 3799 19290 35983 48233 34678 31939 26407 27826 43268 40777 36067 14557 4100
13514D100j341M007q505o090n38J0567K0386R024j2793O76J3476n325l479p431
$$ 4100 2759 6766 -1739 -7829 -8367 2200 22586 31610 18817 19493 32969 27644 24165 16734
13500A6734o257N22r461l85R411n581n405J7360j4216k386J739k099Q766O739
$$ 16734 10477 10999 1538 1153 10564 4983 -422 16938 2722 336 2075 -24 8742 15481
13486A5481O115p601j559O975J1718J4910m29L7J90p066n455n245M864J5668L259
$$ 15481 21596 13995 12436 19411 31129 46039 45610 45647 45837 38771 33316 28071 32935 48603 51862
13471E1862q994k6731K699j1722K023K7977K3025k1536j6479J0680P228N078N268
$$ 51862 42868 16137 18836 7114 9137 37114 60139 38603 22124 32804 40032 45110 50378
13458E0378J3902j0493j683q060K141R182N251n837m890n295J7936M635l122J2016
$$ 50378 64280 53787 52104 44044 46185 55367 60618 54781 49891 44596 62532 67167 64045 76061
13444G6061n881r872N425J7874P234N155J9834L751R263q71J6037L3012K4015
$$ 76061 70180 60308 65733 83607 90841 95996 115830 119581 128844 127973 144010 177022 201037
13431B01037N1831N6070M6119M5731k806j897j0389j9109J7805K123k3479m0447
$$ 201037 252868 308938 355057 400788 397982 396085 385696 366587 384392 386515 363036 322589
13419C22589n1447j2833J921M258r005J484L0123L3556L0634L2915J9132J2164
$$ 322589 271142 258309 260230 264488 255483 256967 287090 320646 351280 384195 403327 415491
13407D15491K2496j3843l3022l5858m6949k4225l0372n2380k6249m2510l9024
$$ 415491 437987 424144 391122 355264 308315 284090 253718 201338 175089 132579 93555
13396I3555k7261j7023j656r850n226L80K1077K823q860Q284n138j0896R097J1495
$$ 93555 66294 49271 47615 37765 32539 32919 53996 56819 47959 56243 51105 40209 49306 60801
13382F0801q24M147r022J2098m612j7230j4674r318J0262L2O860m263K629L201
$$ 60801 59977 64124 55102 67200 62588 45358 30684 21366 31628 31660 38520 34257 36886 40087
13368D0087j620k5758j503m317L93K8847J4979J340j7487o458N720J950K5890
$$ 40087 38467 12709 11206 6889 7282 36129 51108 52448 34961 28503 34223 36173 62063
13355F2063P843l0898J2368J4767K2813J4440J6948K4056J8048M7255M8040L0843
$$ 62063 69906 39008 51376 66143 88956 103396 120344 144400 162448 209703 257743 288586
13343B88586L5485L4294M7145L1056K1172Q076r148j8593l3247l2091k3133k8591
$$ 288586 324071 358365 405510 436566 457738 465814 456666 438073 404826 372735 349602 321011
13331C21011k6521j5673O844N88J9364K4247K3654M4439L1060J7896Q222o770
$$ 321011 294490 278817 285661 286249 305613 329860 353514 397953 429013 446909 455131 448361
13319D48361n942p138l4307o2200m3101k8173k2393m1043l8353k3300l6510l0851
$$ 448361 442419 435281 400974 338774 295673 267500 245107 204064 165711 142411 105901 75050
13307G5050k230L438N752l167K679P244k69k5430j6731P103k259J621j4862j8198
$$ 75050 72820 76258 82010 78843 81522 88766 88497 63067 46336 53439 51180 52801 37939 19741
13293A9741L469L592j6327l987P969J196K122K731j5577n046J0834J4096l041
$$ 19741 23210 26802 10475 6488 14457 15653 17775 20506 4929 -117 10717 24813 21772
13280B1772l404K5479N552j7219j1013j1925m273J2709M250k437J2009J2914o759
$$ 21772 18368 43847 49399 32180 21167 9242 4969 17678 21928 19491 31500 44414 37655
13267C7655p425k89J7344j7671j4113n935j306R905K3312M643o124j3657o502
$$ 37655 30230 29941 47285 29614 15501 9566 8260 18165 41477 46120 39996 26339 19837
13254A9837k595M928P55j74o111j3345o373J0814J8597j6584M954K3576J7823
$$ 19837 17242 22170 22925 22751 16640 3295 -3078 7736 26333 9749 14703 38279 56102
13241E6102k0289j0281Q112p145J2865M145j1274L361j9694k7254P930M385K0666
$$ 56102 35813 25532 33644 26499 39364 43509 32235 35596 15902 -11352 -3422 963 21629
13228B1629J9098J7849N391m783j5665j0542k49K0104J4602k1986j6977l370j1299
$$ 21629 40727 58576 63967 59184 43519 32977 32728 52832 67434 45448 28471 25101 13802
13215A3802m246K2199K0924R136j984j7749p818l976j8852l1258P358N779M510
$$ 13802 9556 31755 52679 61815 59831 42082 34264 30288 11436 -19822 -12464 -6685 -2175
13202b175J0075K1769M218n999r757J1715P859Q461r829Q92k470O027m773j5732
$$ -2175 7900 29669 33887 27888 18131 29846 37705 46166 36337 37229 34759 40786 36013 20281
13188B0281n565K261j858R416O414J4340Q579p633l663j0877p883k6005R344J9882
$$ 20281 14716 16977 15119 24535 30949 45289 53868 46235 42572 31695 23812 -2193 7151 27033
13174B7033k1734n812K9823J2870J1868P302j1082o421j4632m438R157Q672m154
$$ 27033 5299 -513 29310 42180 54048 61350 50268 43847 29215 24777 33934 42606 38452
13161C8452M114J277O070m0372j2795J7238O055J7148K3228j3544j632q07k195
$$ 38452 42566 43843 49913 9541 -3254 13984 20039 37187 60415 46871 45239 44432 42237
13148D2237O915O497O67J4780k0690j4471R118N631Q855j9187o815m119j5756
$$ 42237 49152 55649 56316 71096 50406 35935 45053 50684 59539 40352 33537 29418 13662
13135A3662O944P480J087j4611j546j5647n664K6728J6097k396o296K816P053
$$ 13662 20606 28086 29173 14562 13016 -2631 -8295 18433 34530 32134 25838 28654 35707
13122C5707M179J579r717j6901p214Q691n875J6568K7042J0338k264p436k2459
$$ 35707 39886 41465 31748 14847 7633 16324 10449 27017 54059 64397 62133 54697 32238
13109C2238j3678J6284N126j0049q990J2549p181O19N742P66j0421Q591n839p468
$$ 32238 18560 34844 39970 29921 20931 33480 26299 26918 32660 33426 23005 31596 25757 18289
13095A8289K1290J3458j1021Q107j3347j3474L015J1810J3642j74J636K344l478
$$ 18289 39579 53037 42016 50123 36776 23302 26317 38127 51769 51595 53231 55575 52097
13082E2097K402J407J0332O238Q2R305M179j9962k485m512j78N90K1499p939j8335
$$ 52097 54499 55906 66238 72476 72558 81863 86042 66080 63595 59083 58905 59495 80994 73055 54720
13067E4720k791K20J1085O231j7866j3289o398J7496J4747j3048j4168k372P376
$$ 54720 51929 52149 63234 69465 51599 38310 31912 49408 64155 51107 36939 34567 41943
13054D1943j0620J895J2449O083K3328K518j2115L803J2601k3533k3074o171J0377
$$ 41943 31323 33218 45667 51750 75078 77596 65481 69284 81885 58352 35278 29107 39484
13041C9484O396P605r812j753K434R350J7516j6234k446k091r792L902J9918K1066
$$ 39484 45880 53485 43673 41920 44354 53704 71220 54986 52540 50449 40657 44559 64477 85543
13027H5543j206m819o26j9462j6239K1916K2448l894L253J1383K0582K3137m257
$$ 85543 84337 79518 78892 59430 43191 65107 87555 83661 86914 98297 118879 142016 137759
13014A37759k1177P761J2182J5523R44K4371L3594L8069L5362M9373O3680P0326
$$ 137759 116582 124343 136525 152048 152992 177363 210957 249026 284388 333761 397441 467767
13002D67767N6707O3055O1693O2287K6118n992k4032l6067n8128q5093o5333n3242
$$ 467767 524474 587529 649222 711509 737627 731635 707603 671536 613408 528315 462982 409740
12990D09740n5840o6620p3416l3300k812r183j6865l1120q862n694j3636j018
$$ 409740 353900 287280 213864 180564 177752 168569 151704 120584 111722 106028 92392 91374
12978I1374K4048Q583j4710j3726O460O755j0964o76J3023J443k0177j3001J205
$$ 91374 115422 124005 109295 95569 102029 108784 97820 97144 110167 111610 91433 78432 79637
12965G9637Q21O458O00K1311J3607P701o895k5924j6384K35q227Q034L548J4116
$$ 79637 80458 86916 87516 108827 122434 130135 123240 97316 80932 81167 72940 80974 84522 98638
12951I8638J3240R30P409l1060p184K4731K0087j6011k4957l052K5331J1525k894
$$ 98638 111878 112808 120217 89157 81973 106704 126791 110780 85823 82771 108102 119627 116733
12938A16733j7265j3812j3815O186Q657m525k373J8752j5397l404J4914j2438
$$ 116733 99468 85656 71841 78027 86684 82159 79786 98538 83141 79737 94651 82213
12926H2213r269J1692N051N411N393j0637k3554j3795l376J1962N166j2749j035
$$ 82213 72944 84636 89687 95098 100491 89854 66300 52505 49129 61091 66257 53508 52473
12913E2473Q616r055k716K3450K2467o851j6330K9689N055r446j0594n197q851
$$ 52473 61089 52034 49318 72768 95235 88384 72054 101743 106798 97352 86758 81561 72710
12900G2710l777j456J1879J6167K601r316k3664j3505N771R44j428J6052L2917
$$ 72710 68933 67477 79356 95523 98124 88808 65144 51639 57410 58354 56926 72978 105895
12887A05895K7450L535j2677j671K0625L695j3287j0881K987j4343J1828j205
$$ 105895 133345 136880 124203 122532 143157 146852 133565 122684 125671 111328 123156 121951
12875A21951n604j6568k0281M95J0099L336N646J3291l291k1940j0959J8997M883
$$ 121951 116347 99779 79498 79993 90092 93428 99074 112365 109074 87134 76175 95172 100055
12862A00055J533q519r18M157j1364L207N359J6293j0328o494J5310j846k913
$$ 100055 101588 93069 92151 96308 84944 88151 93510 109803 99475 92981 108291 106445 103532
12849A03532j585M659k021o269o838J3644l731O075K9853k6932J4243K5759J7552
$$ 103532 101947 106606 104585 98316 91478 105122 101391 107466 137319 110387 124630 150389 167941
12836A67941K1041J5302J1122K0071K190p310j5803J460Q646r036k1688j5684
$$ 167941 188982 204284 215406 235477 237667 230357 214554 216014 224660 215624 193936 178252
12824A78252k2357k0060o730k42o380O653P322R898p875j0273Q910j8906N580
$$ 178252 155895 135835 129105 128863 122483 129136 136458 146356 138481 128208 137118 118212 123792
12811A23792P985k078k402n507k318K2260K5848r981J557J5309O059K872m59o317
$$ 123792 131777 129699 127297 121790 119472 141732 167580 157599 159156 174465 180524 183396 182937 176620
12797A76620l721q184r849j594L345J0961j2265J4063j6152j5191J1309K2862
$$ 176620 172899 164715 154866 153272 156617 167578 155313 169376 153224 138033 149342 172204
12785A72204K0186R614k0590n139J0897j2399j4262O02J2495l485p749p119J960
$$ 172204 192390 202004 181414 176275 187172 174773 160511 161113 173608 170123 162374 155255 157215
12772A57215P733j6868j0882P62N092l190M974J3123k37J4275L773o536k2240
$$ 157215 164948 148080 137198 137960 143052 139862 144836 157959 157722 171997 175770 169234 146994
12759A46994L038K4207J1523R313q727j9729P860j099k987o066O033N610l585
$$ 146994 150032 174239 185762 195075 186348 166619 174479 173380 170393 164327 170360 175970 172385
12746A72385K265j6203P644M982M815l633N004N780k0837m593k0445J4210L1770
$$ 172385 174650 158447 166091 171073 175888 172255 177259 183039 162202 157609 137164 151374 183144
12733A83144K8486k340M52Q267m323j6271N201K6177M593J3684J6230J3268K7853
$$ 183144 211630 209290 209742 218009 213686 197415 202616 228793 233386 247070 263300 276568 304421
12720C04421J6195K619Q282K275K904J9728K2031J9525L7007L2548N5741L3622
$$ 304421 320616 323235 331517 333792 336696 356424 378455 397980 434987 467535 523276 556898
12708E56898J0430O897L6836J3014k6319k8803k9390r862r759l7159l0658l9879
$$ 556898 567328 574225 611061 624075 597756 568953 539563 529701 519942 482783 452125 412246
12696D12246r145m058j0197J0069J2185P212m237j9918j0468J3160Q294N205O340
$$ 412246 403101 399043 388846 398915 411100 418312 414075 394157 383689 396849 405143 410348 416688
12683D16688N495j454p423j420L9381K4823j7044k313L060j4122j110Q501J7176
$$ 416688 422183 420729 413306 411886 451267 476090 459046 456733 459793 445671 444561 453062 470238
12670D70238K2137J9907K0201M962Q06J1228Q361J8892J0614J8206J1955J8356
$$ 470238 492375 512282 532483 537445 538251 549479 557840 576732 587346 605552 617507 635863
12658F35863P882K1908j572o971j1533k659J3098K9887K8987j985q65J1320j8312
$$ 635863 643745 665653 664081 657110 645577 642918 656016 685903 714890 712905 712040 723360 705048
12645G05048J555L0697J1947J5467J8904J4181L2298N3129K9268J6520J1159K8974
$$ 705048 706603 737300 749247 764714 783618 797799 830097 883226 912494 929014 940173 969147
12633I69147K4992O1243N8212J4990K7615K8594M7335O5827K8759K9737M7580
$$ 969147 994139 1055382 1113594 1128584 1156199 1184793 1232128 1297955 1326714 1356451 1404031
12622A404031N7426N2226N2291N7772P0248P5384P9537P7532P6498J00199J28853
$$ 1404031 1461457 1513683 1565974 1623746 1693994 1769378 1848915 1926447 2002945 2103144 2231997
12611B231997J41343J30198J47977J52074J74519K11791K46051K77658L20993
$$ 2231997 2373340 2503538 2651515 2803589 2978108 3189899 3435950 3713608 4034601
12602D034601L76354M37124N31272O28461P42296Q80070J020951J171250J349772
$$ 4034601 4410955 4848079 5379351 6007812 6750108 7630178 8651129 9822379 11172151
12593A1172151J553259J785037K092841K516890L142754M003647N219131O860873
$$ 11172151 12725410 14510447 16603288 19120178 22262932 26266579 31485710 38346583
12585C8346583Q875413J1146313J3312016J4871808J5316581J4294006J1697631
$$ 38346583 47221996 58368309 71680325 86552133 101868714 116162720 127860351
12578A27860351P696720K577695l017807q309197j2527369j5171776j6151493
$$ 127860351 135557071 138134766 135116959 126807762 114280393 99108617 82957124
12571H2957124j5635407j3944835j1535104r029347o713425m827576l465568k561481
$$ 82957124 67321717 53376882 41841778 32812431 26099006 21271430 17805862 15244381
12563A5244381j953041j568143j353149j210389j078201r79427q86189p78192
$$ 15244381 13291340 11723197 10370048 9159659 8081458 7102031 6215842 5437650
12555E437650o85436n94949m84550m01542l31316k62969k30406j98545j66566
$$ 5437650 4752214 4157265 3672715 3271173 2939857 2676888 2446482 2247937 2081371
12546B081371j51177j36766j17795j22704j05332j02588r3848n8655n8804p4409
$$ 2081371 1930194 1793428 1675633 1552929 1447597 1345009 1251161 1192506 1133702 1059293
12536A059293p4694m9509m7726m9317m5975m8209l8359l7355l5607m098j0098
$$ 1059293 984599 935090 887364 838047 792072 743863 705504 668149 632542 628444 618346
12525F18346l1844l6415l1462k5206k3642k1818j4886j0381p863j0522L918Q447
$$ 618346 586502 550087 518625 493419 469777 447959 433073 422692 414829 404307 408225 416672
12513D16672k7971k3880j8915O23j3789k4506j6846r602j1082j5311J2025j842
$$ 416672 388701 364821 345906 346529 332740 308234 291388 281786 270704 255393 267418 265576
12501B65576l4963m7565k874r850r412j393m470p534j2739j71K627j5410O078
$$ 265576 230613 183048 180174 170324 160912 159519 155049 147515 134776 134605 137232 121822 127900
12488A27900j8390J0997L348Q31p13R196p194k0380k4931O758K1953j2167j7659
$$ 127900 109510 120507 123855 124686 123973 133169 125975 105595 80664 87422 109375 97208 79549
12475G9549q222r651P018J3108j589J3570j756N554m828j5202j6176k000j0320
$$ 79549 71327 61676 68694 81802 80213 93783 92027 97581 92753 77551 61375 59375 49055
12462D9055Q675J6076j1916j6947m312j2330j8916j2796k4616m5632m7367l8746
$$ 49055 57730 73806 61890 44943 40631 28301 9385 -3411 -28027 -73659 -121026 -159772
12450a59772k0541j4017j6147R026L7035J4627L3409L9521K2872J3718j4781l194
$$ -159772 -180313 -194330 -210477 -201451 -164416 -149789 -116380 -76859 -53987 -40269 -55050 -58244
12438e8244J6323N047K185Q547M027J5164J5522J8240J863N141R376K2826L8419
$$ -58244 -41921 -36874 -34689 -26142 -22115 -6951 8571 26811 28674 33815 43191 66017 104436
12425A04436M4779J7058n065m365L847j7955k1510j2180j3664n094L1144Q377
$$ 104436 149215 166273 161208 156843 160690 142735 121225 109045 95381 90287 121431 129808
12413A29808j8532k7671k0243O604P493r637J5601Q916j0913R088K9302J2397
$$ 129808 111276 83605 63362 69966 77459 67822 83423 92339 81426 90514 119816 132213
12401A32213J3595K2163L7005M8792N0864N4942O9804P0032J01546J32580J21167
$$ 132213 145808 167971 204976 253768 304632 359574 429378 499410 600956 733536 854703
12390H54703Q8246P6821O1742J7295l1436o0471q7722j21336j12238j21490r8408
$$ 854703 942949 1019770 1081512 1098807 1067371 1006900 919178 797842 685604 564114 465706
12379D65706p9784o2536p6850o1571m2642k7164n902k1118k3697j4904j1992q493
$$ 465706 385922 323386 246536 184965 142323 115159 109257 88139 64442 49538 37546 29053
12367B9053j749Q967p641j6576p432o360j2190J378j9520j032M1957J2418k4322
$$ 29053 27304 36271 28630 12054 4622 -1738 -13928 -12550 -32070 -33102 8855 21273 -3049
12354c049j1121O400n392j7268J2036M153r922m169M854L7393J9325N307o491
$$ -3049 -14170 -7770 -13162 -30430 -18394 -14241 -24163 -28332 -23478 13915 33240 38547 32056
12341C2056n45j6923r470m59n497K0474J0399k353j0386J600M558l4405m02J4027
$$ 32056 31511 14588 5118 4659 -838 19636 30035 27682 17296 18896 23454 -10951 -11353 2674
12327B674J3503N67n301j3443R015J1401j750j7485k477J989j729J3464J3641
$$ 2674 16177 16744 11443 -2000 7015 18416 16666 -819 -3296 -1307 -3036 10428 24069
12314B4069j2295m556j0752j4364Q056j5394m075l949J209K1498K0671L362j3171
$$ 24069 11774 7218 -3534 -17898 -9842 -25236 -29311 -33260 -32051 -10553 10118 13480 309
12301C09l317J9410K242k4096k3017K399K3813O14j5232j1507J7482J4314k880
$$ 309 -3008 16402 18644 -5452 -28469 -26070 -2257 -1643 -16875 -28382 -10900 3414 534
12288E34k1493o18R094J1308j650p278J1427K943p49L705k393L827j1147n657
$$ 534 -20959 -21577 -12483 -1175 -2825 -10103 1324 4267 3518 7223 4830 8657 -2490 -8147
12274h147j7646j329J0275K1054J1847N781J338o629J8544l215l277L5157J7375
$$ -8147 -25793 -27122 -16847 4207 16054 21835 23173 16544 35088 31873 28596 63753 81128
12261H1128j0068p293J0256L6958M8364L2114M1761P2980P5498P1924J05289P8319
$$ 81128 71060 63767 74023 110981 159345 191459 233220 306200 381698 453622 558911 637230
12249F37230K9483l2972o6238r9271j05144q5621n3065l7589k0289k6331k4173
$$ 637230 666713 633741 567503 468232 363088 277467 224402 186813 166524 140193 116020
12238A16020j6036l4287l102J5385J3535r470L580J54m210J0983J286J899K4793
$$ 116020 99984 65697 62595 77980 91515 82045 85625 85779 81569 92552 93838 95737 120530
12225A20530R879P286L7358K7821R365K7611O4245R9877J10623J10784P7086L4601
$$ 120530 130409 137695 175053 202874 212239 239850 304095 403972 514595 625379 702465 737066
12213G37066J8567j5332m6631o0920q5209q6758r1751q0645n4457m8990m372k5224
$$ 737066 755633 740301 693670 632750 547541 460783 369032 288387 233930 184940 180568 155344
12201A55344j5462Q019k827n409P427p119K546K203K3824L3960M8469N7033O8946
$$ 155344 139882 147901 145074 139665 147092 139973 142519 144722 168546 202506 250975 308008 376954
12188C76954L4720L5701L2287j7054o4607n2683l5005n3994n3033k7758J940j9671
$$ 376954 411674 447375 479662 462608 398001 345318 310313 256319 203286 175528 177468 157797
12176A57797k6272k5510k5378L2832K0699K1737M1675M7524M9680P2592P3504
$$ 157797 131525 106015 80637 113469 134168 155905 197580 245104 294784 367376 440880
12165D40880N7245P8907O0276J7663j6760m1196k3593j3403l085L5361M9818M2533
$$ 440880 498125 577032 637308 654971 638211 597015 573422 560019 556934 592295 642113 684646
12153F84646N5730K8390j2501l0134k5629n1547p6474n5413p1441m7482k2826
$$ 684646 740376 768766 756265 726131 700502 648955 572481 517068 445627 398145 375319
12142C75319l7574j6080j6815k8275m73J1251k5837j1539r990l1161l5555m6710
$$ 375319 337745 321665 304850 276575 276102 287353 261516 249977 239987 208826 173271 126561
12130A26561j0091q183j5543l0099k0794n62J339J163Q554P435q029L799M454
$$ 126561 116470 108287 92744 62645 41851 41289 42628 43791 52345 59780 51751 55550 60004
12117F0004o829J3047l337O213p508j4117P348K7579K4058K4280L1247M2715O3619
$$ 60004 53175 66222 62885 69098 61590 47473 54821 82400 106458 130738 161985 204700 268319
12104B68319P6787R0618P9260M4324K3757K471l0564n7523p0288n7870n5739m5621
$$ 268319 345106 435724 514984 559308 583065 585536 554972 497449 427161 369291 313552 267931
12092B67931n6800n6137l2171k4641j8694J142j2648j0221j4700j6228m113k862
$$ 267931 211131 154994 122823 98182 79488 80630 67982 57761 43061 26833 22720 19858
12080A9858L617p01J6742o40p219O083l15K453j1479q579M009P39L16m310J790
$$ 19858 23475 22774 39516 38876 31657 37740 37425 39878 28399 19820 23829 24568 24884 20574 22364
12065B2364r087j6099L15K4842L1587L1394K7291M2265N8828M6825M6363N6339
$$ 22364 13277 -2822 -2507 22335 53922 85316 112607 154872 213700 260525 306888 363227
12053C63227N1789M7135K5749J2304j6020l8765n4581o8006m9788m1820m9492
$$ 363227 415016 462151 487900 500204 484184 445419 390838 322832 273044 231224 181732
12042A81732l1828m5174m1550j3504j5816j3921j2187R957j520j6074m177J1117
$$ 181732 149904 104730 63180 49676 33860 19939 7752 17709 16189 115 -4062 7055
12030G055N428o732n249M28O177P101n564j2004o058R171P53j27J6168J0506L324
$$ 7055 12483 5751 502 930 7107 14208 8644 -3360 -9418 -247 506 379 16547 27053 30377
12015C0377L220o512k7962q011K459K5989l029j318j113R32Q070R892j277r531
$$ 30377 33597 27085 -877 -8888 -6429 19560 16531 15213 14100 15032 23102 32994 31717 22186
12001B2186R418J812q033L059J944j9060j6354R060j5277p305L017K1668J7490
$$ 22186 31604 33416 25383 28442 30386 11326 -5028 4032 -11245 -18550 -15533 6135 23625
11988B3625o79l179q306k818m619K746o45r267P485J2453L203J2716j2999o292
$$ 23625 22946 19767 11461 8643 4024 6770 6125 -3142 4343 16796 19999 32715 19716 13424
11974A3424p214N23P87k965n543R493j609L731J2893J2220J6257J4216J9744j1091
$$ 13424 6210 6733 7520 4555 -988 8505 6896 10627 23520 35740 51997 66213 85957 74866
11960G4866m0980j9070J2631K0805p351k8021j6488n376q491l107P256L6540J3175
$$ 74866 33886 14816 27447 48252 40901 12880 -3608 -8984 -17475 -20582 -13326 23214 36389
11947C6389k648j5927m708j2910K431K1338J2467J6733l897j7647m795m7j2100
$$ 36389 33741 17814 13106 196 2627 23965 36432 53165 49268 31621 26826 26779 14679
11934A4679j3067j6403j3459o072P46K1567K5309k328r456P37Q396k709j8802
$$ 14679 1612 -14791 -28250 -34322 -33576 -12009 13300 10972 1516 2253 10649 7940 -10862
11921a0862j3063J650n578j0367J1704J4577j1862J936j559j585L789P037L1956
$$ -10862 -23925 -22275 -27853 -38220 -26516 -11939 -23801 -21865 -23424 -25009 -21220 -14183 17773
11908A7773J0257J482j2156P081j8204k0488P094J4039J302N025m243O20K287
$$ 17773 28030 29512 17356 24437 6233 -14255 -7161 6878 8180 13205 8962 9582 11869
11895A1869r172m649R222L389J2248k835q260J2196n528m601r662j3527j6833
$$ 11869 2697 -1952 7270 10659 22907 20072 11812 24008 18480 13879 4217 -9310 -26143
11882b6143k0959O474P798J0726R033k730M15J1069J601k915J2737J2944o108
$$ -26143 -47102 -40628 -32830 -22104 -13071 -15801 -15386 -4317 -2716 -5631 7106 20050 13942
11869A3942j2420o735J764J7018P141j7770k018o449j0850m757J1892J4130L808
$$ 13942 1522 -5213 -3449 13569 20710 2940 922 -5527 -16377 -21134 -9242 4888 8696
11856H696j4704j3597Q45jJ3164J0447o180j7230J761M547J0297K516J2018N214
$$ 8696 -6008 -19605 -18760 -18761 -5597 4850 -1330 -18560 -16799 -12252 -1955 561 12579 17793
11842A7793O875J9336j3991j8612k1041q871N163M386J853J146K0710p336p636
$$ 17793 24668 44004 30013 11401 -9640 -18511 -13348 -8962 -7109 -5963 14747 7411 -225
11829b25j2496J4615m009o274J1323J27J8419j631k688n461j0802j2933K6665
$$ -225 -12721 1894 -2115 -8389 2934 3061 21480 19849 17161 11700 898 -12035 14630
11816A4630j4731j9287J2938L146J3641j5722j0556J814M331K395J1736j0098
$$ 14630 -101 -19388 -6450 -3304 10337 -5385 -15941 -14127 -9796 -7401 4335 -5763
11804e763J197k292J5710P205o701k801l256J1608l561j2445j1422K423m6j3045
$$ -5763 -4566 -6858 8852 16057 9356 6555 3299 14907 11346 -1099 -12521 -10098 -10144 -23189
11790b3189O39Q36m041L531k384N516J0776J58n17L989K1933J0570j4531j3674
$$ -23189 -22550 -21714 -25755 -22224 -24608 -19092 -8316 -8158 -8675 -4686 17247 27817 13286 -388
11776c88N611J9990l757k4145r674M459K202L923k280J2961L605j0060L676M929
$$ -388 5223 25213 21456 -2689 -12363 -7904 -5702 -1779 -4059 8902 12507 2447 6123 11052
11762A1052J537P013j450j8770k581J082k498L512o879k8277l95K2159n553p702
$$ 11052 12589 19602 18152 -618 -3199 -2117 -4615 -1103 -7982 -36259 -36654 -14495 -20048 -27750
11748b7750J0777Q691l352k155j684Q296J5341j1096j0150l73J3298j2272m499
$$ -27750 -16973 -8282 -11634 -13789 -15473 -7177 8164 -2932 -13082 -13455 -157 -12429 -16928
11735a6928K010R470J1964O899K790M054j0827J6239M502N623J0125p843l22r402
$$ -16928 -14918 -5448 6516 13415 16205 20259 9432 25671 30173 35796 45921 38078 37756 28354
11721B8354r590o124L900p677j2143J5871L6043n061j7069j5489j2592J460o336
$$ 28354 18764 12640 16540 8863 -3280 12591 48634 43573 26504 11015 -1577 -117 -6453
11708f453p671q986O869J4639K657r561N832J5299R394p564j7776j6654r46L223
$$ -6453 -14124 -23110 -16241 -1602 1055 -8506 -2674 12625 22019 14455 -3321 -19975 -20921 -17698
11694a7698R704k677l41P529M461J4468R604l434n481j0411k3701N078K0797P256
$$ -17698 -7994 -10671 -11012 -3483 978 15446 25050 21616 16135 5724 -17977 -12899 7898 15154
11680A5154j5422l578J4842q870K084L346P049m961j6338P566J0166p167M806
$$ 15154 -268 -3846 10996 2126 4210 7556 14605 9644 -6694 872 11038 3871 8677
11667H677Q99j9466k554J6525K2613K3855k0276o649k3457n887J3590l463O37
$$ 8677 9576 -9890 -12444 4081 26694 50549 30273 23624 167 -5720 7870 4407 5044
11654E044k896Q322M266j8672K0315K1821m854j2954Q821m46p248J0060R875k2750
$$ 5044 2148 10470 14736 -3936 16379 38200 33346 20392 29213 28767 21519 31579 41454 18704
11640A8704n42K131R851K1081L060j7878m503j7040k063R039K969j5753j6870
$$ 18704 18162 20293 30144 51225 54285 36407 31904 14864 12801 21840 24809 9056 -7814
11627g814o453R594J4835n507r108J020n166K8583Q576j8186m715j4775r889O463
$$ -7814 -14267 -4673 10162 4655 -4453 -3433 -8599 19984 28560 10374 5659 -9116 -19005 -12542
11613a2542j6851N422K1282Q481j759J469K2845N749p143j995j0865q747m95P31
$$ -12542 -29393 -23971 -2689 5792 4033 5502 28347 34096 26953 24958 14093 5346 4851 5582
11599E582J0868q60R42q863R009q20r264J697j0269l470K4601J5090J2312J1300
$$ 5582 16450 15590 16532 7669 16678 15858 6594 8291 -1978 -5448 19153 34243 46555 57855
11585E7855k581j0663k6468n709P708Q369r409k4020q310M730L212J4942K7237
$$ 57855 55274 44611 18143 12434 20142 28511 19102 -4918 -13228 -8498 -5286 9656 36893
11572C6893Q052m5171j133K2273J7352j661j1402J6480L099k0111k2524M714k348
$$ 36893 44945 -226 -1359 20914 38266 36605 25203 41683 44782 24671 2147 6861 4513
11559D513Q53j680m107J9147P219o572m576q279n56Q416L75R722N414j52q951
$$ 4513 5366 3686 -421 18726 25945 19373 14797 6518 5962 14378 14753 24475 29889 29737 20786
11544B0786q200L235K478l138o243M252J2290N090M123J466j7791O233J4396J1945
$$ 20786 12586 15821 18299 15161 8918 13170 25460 30550 34673 36139 18348 24581 38977 50922
11530E0922r051k1595L572O289n752r04j5428K32J6134j1982J2464K588k3279
$$ 50922 41871 20276 23848 30137 24385 23481 8053 8285 24419 12437 24901 27489 4210
11517D210o498J4633J1583J3232j8836r031J8654o4j1452j1180P389l956m101
$$ 4210 -2288 12345 23928 37160 18324 9293 27947 27883 16431 5251 12640 8684 4583
11504D583J3347J5666J3713o808r432m082j7538J158L0737Q797k2564o129L6N598
$$ 4583 17930 33596 47309 40501 31069 26987 9449 10607 41344 50141 27577 21448 21484 27082
11490B7082r614r914M251l01m136m051p677K0752J7593n211k36R648N175M053
$$ 27082 17468 7554 11805 11504 7368 3317 -4360 16392 33985 28774 28538 38186 43361 47414
11476D7414m440j9008j228J7762L85J764k441j4179K1701N031Q346O875r533q862
$$ 47414 42974 23966 22738 40500 40885 42649 40208 26029 47730 52761 61107 67982 58449 49587
11462D9587j0235M495L144j3755j1852p968j1650J0999L2364P846j2496K395J9217
$$ 49587 39352 43847 46991 33236 21384 13416 1766 12765 45129 52975 40479 42874 62091
11449F2091N233l39Q603J1622L6295J1526j1432M588M9659N4155K2548L7743N9201
$$ 62091 67324 66985 75588 87210 123505 135031 123599 128187 177846 232001 254549 292292 351493
11436C51493Q9709Q3103Q1578Q8335L5418l3895q1200r8203j03302q5811n2793
$$ 351493 441202 524305 605883 694218 729636 695741 614541 516338 413036 327225 274432
11425B74432n7088m8696l2701k1520j9022k2193P621O912k077p991k490K985p290
$$ 274432 217344 168648 135947 114427 95405 73212 80833 87745 85668 77677 75187 78172 70882
11412G0882k11Q272P371J0190p093p028p849k2336K85M096r098Q236K815q947
$$ 70882 70671 78943 86314 96504 89411 82383 74534 52198 52483 56579 47481 55717 58532 49585
11398D9585R054j5269j1898J3123M940K965k0806j8462J8587J0568J6288j8178
$$ 49585 58639 43370 31472 44595 49535 52500 31694 13232 31819 42387 58675 40497
11386D0497k1746N290J4519J4527j0069j2155n5J7778J6166j1557l694n417j0110
$$ 40497 18751 24041 38560 53087 43018 30863 30808 48586 64752 53195 49501 44084 33974
11373C3974J2305J749q228M357k470l624o961M419O541R358J0733k00M43m294
$$ 33974 46279 48028 39800 44157 41687 38063 31102 35521 42062 51420 62153 61953 62396 58102
11359E8102k298j5279p136r775J9160j2456o383j836r797r93Q30J3241J168m085
$$ 58102 55804 40525 33389 23614 42774 30318 23935 22099 12302 11309 12139 25380 26548 22463
11345B2463j665J0984K643n80j116j3018j2380O773O342j3064M944K7095K3760
$$ 22463 20798 31782 34425 33845 32729 19711 7331 14104 20446 7382 12326 39421 63181
11332F3181m681J201p03j1402m914J0765j8056j7826M627J089K0519L514m828
$$ 63181 58500 59701 58998 47596 42682 53447 35391 17565 22192 23281 43800 47314 42486
11319D2486M740j733O990o801J078n933K751k41o962J329O702k1386j949M300
$$ 42486 47226 45493 52483 45682 46760 40827 43578 43337 36375 37704 44406 23020 21071 25371
11305B5371n846o596J3916K5909M192r368r756j3014q853k512J3639J6209n177
$$ 25371 19525 12929 26845 52754 56946 47578 37822 24808 15955 13443 27082 43291 38114
11292C8114L565Q328m737J1082j4266l0062M387j2120q45K6643J8541o777n832
$$ 38114 41679 50007 45270 56352 42086 12024 16411 4291 3446 30089 48630 41853 36021
11279C6021r418R134r560k381O590o1l069p282P981j138j3507j69J2908k527K1446
$$ 36021 26603 35737 26177 23796 30386 30325 27256 19974 27955 26817 13310 13141 26049 23522 44968
11264D4968O673j9110n791J6253P850N486J4099Q449m849Q029O010o416m870N612
$$ 44968 51641 32531 26740 42993 50843 56329 70428 78877 74028 82057 88067 81651 76781 82393
11250H2393P851R58J6983k65M82j2450j2429M661j2230m733l568K847K881j8583
$$ 82393 90244 91202 108185 107920 108402 95952 83523 88184 75954 71221 67653 70500 73381 54798
11236E4798R627l900Q411J9054J805P689k2135k8004j7422J379J728k130M474
$$ 54798 64425 60525 68936 87990 89795 97484 75349 47345 29923 31302 33030 30900 35374
11223C5374l348J2864k461Q384q079J0995p17N847M43l755o821J585J2912M398
$$ 35374 32026 44890 42429 50813 42734 53729 53012 58859 59302 55547 48726 50311 63223 67621
11209F7621p92N279k6300M714K4437M37j0519k5874R253o889O769N817J962j622
$$ 67621 66829 72108 45808 50522 74959 75396 64877 39003 48256 41367 48136 53953 55915 54293
11195E4293j7623N149K0752O134K860j8590n873l506J6190K2880K112r592J575
$$ 54293 36670 41819 62571 68705 71565 52975 47102 43596 59786 82666 84778 75186 76761
11182G6761r228Q706k362J7000j3328q012o063n171P332P096L277L241j6699r562
$$ 76761 67533 76239 73877 90877 77549 69537 63474 58303 65635 72731 76008 79249 62550 52988
11168E2988R142J8114l651j2671j07R980L240j1193l194Q347J3933o951P072J2471
$$ 52988 62130 80244 76593 63922 63815 73795 77035 65842 62648 70995 84928 77977 85049 97520
11154I7520n383j0710Q170m932L842P36p496n459k732q053M859O789J6459j1965
$$ 97520 92137 81427 89597 84665 88507 89243 81747 76288 73556 65503 70362 77151 93610 81645
11140H1645j1920J5570O555j0089j0941j3563L937k816K3765J0265j5721j0166
$$ 81645 69725 85295 91850 81761 70820 57257 61194 58378 82143 92408 76687 66521
11128F6521j795J0101K7433L157M157J293j0043J0481k6159p624p528j0830J3601
$$ 66521 64726 74827 102260 105417 109574 110867 100824 111305 85146 77522 69994 59164 72765
11115G2765p06j3616l086J1161L185L444J1906J599l902k2372j8422j5249J2899
$$ 72765 72059 58443 55357 66518 69703 73147 85053 86652 82750 60378 41956 26707 39606
11102C9606J2114J8837J6614K231P842j1382q708Q105J687L504J191J5852R305
$$ 39606 51720 70557 87171 89402 97244 85862 77154 85259 86946 90450 91641 107493 116798
11089A16798K584j2410k6754m402q573k835J367m081m481J7290R07L414p410l555
$$ 116798 119382 106972 80218 75816 67243 64408 65775 61694 57213 74503 75410 78824 71414 67859
11075F7859j1882P898J4430m361R176K7842j518j4134p857k4301O877K1215J0425
$$ 67859 55977 63875 78305 73944 83120 110962 109444 95310 87453 63152 70029 91244 101669
11062A01669r401p682J444J3908Q646J549p280j5606j9062j2440Q409Q614n375
$$ 101669 92268 84586 86030 99938 108584 110133 102853 87247 68185 55745 64154 72768 67393
11049F7393j1552r325J9815K0721l675q98q184p037J687m155J7102J7598L508
$$ 67393 55841 46516 66331 87052 83377 82479 74295 67258 68945 64790 81892 99490 102998
11036A02998j1048j0463k243m464L104k446r803q690K0815J4277R610K9627J5942
$$ 102998 91950 81487 79244 74780 77884 75438 65635 56945 77760 92037 101647 131274 147216
11023A47216K4372r268o457k4323L314j0086j9462J405j6251j1185j949o67O574
$$ 147216 171588 162320 155863 131540 134854 124768 105306 106711 90460 79275 77326 76659 83233
11010H3233Q229M364k733j4020p480N195j3k63K564K444m598k1096O841K2195
$$ 83233 91462 95826 93093 79073 71593 76788 76775 76512 79076 81520 76922 55826 62667 84862
10996H4862Q771j1496n092K3710Q392k907k5948p096o806N433K6108J3830j6549
$$ 84862 93633 82137 77045 100755 109147 106240 80292 73196 66390 71823 97931 111761 95212
10983I5212j2795j2818N241J7173P55R0L626K489K804N087M139k472P769K2720
$$ 95212 82417 69599 74840 92013 92768 92858 96484 98973 101777 106864 111003 108531 116300 139020
10969A39020J4705j554m2284l3484P864R908l58J5426l088j1717J6964Q639J5014
$$ 139020 153725 152171 109887 76403 84267 94175 93817 109243 106155 94438 111402 120041 135055
10956A35055p476n386M018K8834K822Q939J0946R031N197O684L0000K3541K7016
$$ 135055 127579 122193 126211 155045 157867 166806 177752 186783 191980 198664 228664 252205 279221
10943B79221L7225O7842N8218P9518J17945J65838K28812K86851K83945J50948
$$ 279221 316446 384288 442506 522024 639969 805807 1034619 1321470 1605415 1756363
10933A756363p5333k63158l21139k84580j83977j28846p3447o2701n1017l7708
$$ 1756363 1681030 1417872 1096733 812153 628176 499330 425883 363182 312165 274457
10923B74457l2510j2670k1115j8856j1734k2624P469N906n103k789L16K1781l205
$$ 274457 241947 229277 208162 189306 177572 154948 162417 168323 163220 160431 160747 182528 179323
10910A79323Q155J20k1160p38j7341q308o583J6510K806k4650r691N581j0008
$$ 179323 187478 187598 166438 165700 148359 140051 133468 149978 152784 128134 118443 124024 114016
10897A14016N21K6171J9071n211l2240n616N261j0853N905J1447j7440J1365q921
$$ 114016 114537 140708 159779 154568 122328 116712 121973 111120 117025 128472 111032 122397 113476
10884A13476j8768Q409L0545J3232q866M848R59l353M090L571r405j3270J962
$$ 113476 94708 103117 133662 146894 138028 142876 143835 140482 144572 148143 138738 125468 127430
10871A27430J8277J9115j1165j589j641j4396p727O604J9049J90j2064n012r360
$$ 127430 145707 164822 153657 152068 150427 136031 128304 134908 153957 154147 142083 137071 127711
10858A27711J6294K4320o763m340j4850Q874n88M521L687P959j9401k7941o349
$$ 127711 144005 168325 161562 157222 142372 151246 150658 155179 158866 166825 147424 119483 113134
10845A13134N950J6494K1451p355l8328j7628J0912j602K819J1616j1690j841
$$ 113134 119084 135578 157029 149674 111346 93718 104630 103028 105847 117463 105773 103932
10833A03932Q755k005J1299K5786P037m303j906o137l217J2890K5959J4654K7133
$$ 103932 112687 110682 121981 147767 154804 150501 148595 142458 139241 152131 178090 192744 219877
10820B19877R208J7498K0008j8876k2577m9204m2237j2734K9319L3437n995j7332
$$ 219877 229085 246583 266591 247715 225138 175934 133697 120963 150282 183719 177724 160392
10808A60392O606K4074j1217J4036j0539p542n807n536j2093O767j147m487k774
$$ 160392 166998 191072 179855 193891 183352 175810 170003 164467 152374 159141 157994 153507 150733
10795A50733J1308o872O72r523p278j3536l033L0226Q153J3125n01qp242j8497
$$ 150733 162041 155169 155841 146318 139040 125504 122471 152697 160850 173975 173474 173466 166224 147727
10781A47727O462L997J9564K1439J4205Q961R444L9475K5827K2178M9520K9507
$$ 147727 154189 158186 177750 199189 213394 222355 231799 271274 297101 319279 368799 398306
10769C98306L5025O294j6447k4442n4166l5701j6483j8450k1446o858M761j4121
$$ 398306 433331 439625 423178 398736 344570 308869 292386 273936 252490 245632 250393 236272
10757B36272j4160o067o586p49j076J7053R814m020n750K839l393R770J788j3939
$$ 236272 222112 216045 209459 208710 207634 224687 234501 230481 224731 227570 224177 233947 235735 221796
10743B21796m419J9163N981M208J3178K00l5555k6948l606J0731K0423K8250J2497
$$ 221796 217377 236540 242521 246729 259907 260107 224552 197604 193998 204729 225152 253402 265899
10730B65899j3232L235p013k994p489J304j759j8397P22K211m019M360J3524M7362
$$ 265899 252667 255902 248889 245895 238406 239710 237951 219554 220276 222487 218468 222828 236352 283714
10716B83714K3688m325j1112k3941o879j5724k9531j9852o523j0373k779K1186
$$ 283714 307402 303077 291965 268024 261145 245421 215890 196038 189515 179142 176363 197549
10704A97549J8157K2188L1355K5951J639M317K147p693j761r177r121J0261K5459
$$ 197549 215706 237894 269249 295200 296839 301156 303303 295610 293849 284672 275551 285812 311271
10691C11271Q596l876k1965m83j1406j6407j1078j4660n540J0416J0239O380o12
$$ 311271 319867 315991 294026 293543 282137 265730 254652 239992 234452 244868 255107 261487 260875
10678B60875Q892P914l327J4896O009K117l926j7441k2723J2817l279K0455L4058
$$ 260875 269767 277681 274354 289250 295259 297376 293450 276009 253286 266103 262824 283279 317337
10665C17337K5824M0599M7233L0498K6760M637R139l71r155k0797k2550J8519
$$ 317337 343161 383760 430993 461491 488251 492888 502027 501656 492501 471704 449154 467673
10653D67673M1602K7303K888K7747M9640M1691N5475P1446J20149J01226R2627
$$ 467673 509275 536578 539466 567213 616853 658544 714019 785465 905614 1006840 1099467
10642A099467N1149n9171j56072j67389j23832p6457m5351j0241K5934J9974m464
$$ 1099467 1150616 1091445 935373 767984 644152 567695 522344 512103 538037 558011 553547
10631E53547j7158k879J0450K0727L1072K2060J8913K4004J2896J4919K7218L7969
$$ 553547 536389 533510 543960 564687 595759 617819 636732 660736 673632 688551 715769 753738
10619G53738n137k7406j6309k8466l3989l4817k5736K088J8033L5833R453J6307
$$ 753738 748601 721195 704886 676420 642431 607614 581878 583966 601999 637832 647285 663592
10607F63592K7519K4555J3657K1405K1704J7382J7644K0023K2145M993O935M310
$$ 663592 691111 715666 729323 750728 772432 789814 807458 827481 849626 854619 861554 865864
10595H65864q947M677J9713K9237K0788K0957j1646j4220R141j496R867K5109
$$ 865864 856917 861594 881307 910544 931332 952289 940643 926423 935564 934068 943935 969044
10583I69044K7850L0830K8854N5407N3372N3815J6385K4146M6394O2902L3802
$$ 969044 996894 1027724 1056578 1111985 1165357 1219172 1235557 1259703 1306097 1368999 1402801
10572A402801L7033L0230M9528L6259M7733N7651O7249N3279L4336N1221Q4957
$$ 1402801 1439834 1470064 1519592 1555851 1603584 1661235 1728484 1781763 1816099 1867320 1952277
10561A952277J01100J17054J08748R5545Q7907O9846J03584J19479R4218J26901
$$ 1952277 2053377 2170431 2279179 2374724 2462631 2532477 2636061 2755540 2849758 2976659
10551B976659J43208J51604J74285J92215J95072J88914K00216K45525K86138
$$ 2976659 3119867 3271471 3445756 3637971 3833043 4021957 4222173 4467698 4753836
10542D753836L45379M19818M68854N29248O04067O80551Q16772R74430J152968
$$ 4753836 5099215 5519033 5987887 6517135 7121202 7801753 8618525 9592955 10745923
10533A0745923J289562J338769J373207J515243J902322K596176L463697M556475
$$ 10745923 12035485 13374254 14747461 16262704 18165026 20761202 24224899 28781374
10525B8781374N963500P713213R849690J2651438J6693136K2799914L1846990
$$ 28781374 34744874 42458087 52307777 64959215 81652351 104452265 136299255
10518A36299255M3970565N6043462N7194400L1461737j7241347n7063467o6463174
$$ 136299255 180269820 236313282 293507682 324969419 307728072 250664605 184201431
10511A84201431n4269748l7860050k5160695j6748804j1353116p902744n709808
$$ 184201431 129931683 92071633 66910938 50162134 38809018 30906274 25196466
10504B5196466m282779l242190k468323j874552j418299j073161q58437q21199
$$ 25196466 20913687 17671497 15203174 13328622 11910323 10837162 9978725 9157526
10496I157526r23051r97323r18917p81729o41336m82337l59456k88416k33464
$$ 9157526 8234475 7237152 6318235 5536506 4895170 4412833 4053377 3764961 3531497
10487C531497j81701j37102j27862o7461r478K5995Q6928J47309K08624K51062
$$ 3531497 3349796 3212694 3084832 3017371 3007893 3033888 3120816 3268125 3476749 3727811
10477C727811K20438J21615l3373k09736l40390m23348m19971l86092l29120k48018
$$ 3727811 3948249 4069864 4036491 3826755 3486365 3063017 2643046 2256954 1927834 1679816
10467A679816j91210j63872j45154r5906p3150p4098m3987n6327l7424l4292j8422
$$ 1679816 1488606 1324734 1179580 1083674 1010524 936426 892439 836112 798688 764396 745974
10456G45974K261r9o466Q315K1506L4015N3588O0391R4124J10034J46382J79605
$$ 745974 748235 748136 741670 749985 771491 805506 859094 919485 1013609 1123643 1270025 1449630
10444A449630K31595K54985L08560K98744K41590J22855o3757k32467l33326l81752
$$ 1449630 1681225 1936210 2244770 2543514 2785104 2907959 2844202 2611735 2278409 1896657
10434A896657l86127l32798k56923k01811j37857r8045q3231p0778l4116m0251
$$ 1896657 1510530 1177732 920809 718998 581141 483096 399865 329087 294971 254720
10424B54720k5461k3469l8116K666j2597l304R029M249j8575l5016o947k0831
$$ 254720 229259 205790 167674 170340 157743 154439 163468 167717 149142 114126 107179 86348
10412H6348l8133j1387N759J1126j660P482Q094J7633N532n198l9806j0680K056
$$ 86348 48215 36828 42587 53713 52053 59535 67629 85262 90794 85596 45790 35110 37166
10399C7166j2044r5J1383J8753k7428k5794n619k5108p4516j27535j73329j47660
$$ 37166 25122 25027 36410 55163 27735 1941 -3678 -28786 -103302 -230837 -404166 -551826
10387e51826l6811P0220J19591Q8574M9007L1189L7207L7776K7151J4567P662
$$ -551826 -588637 -518417 -398826 -310252 -261245 -230056 -192849 -155073 -127922 -113355 -105693
10376a05693M181k3890j4856J6167J6517j724L5675K6583j1879m677K4101M8166
$$ -105693 -101512 -125402 -140258 -124091 -107574 -109298 -73623 -47040 -58919 -63596 -39495 8671
10364H671M8932J5443N634N763j4959j3819k2731q723j9666j3937q258L390k685
$$ 8671 57603 73046 78680 84443 69484 55665 32934 24211 4545 -9392 -17650 -14260 -16945
10351a6945L7K4292j0829j6660j7728j0572j3450l880q278j297K0075O417p799
$$ -16945 -16908 7384 -3445 -20105 -37833 -48405 -61855 -65735 -74013 -75310 -55235 -48818 -56617
10338e6617r703k1794p678J8922j906Q204L4107j4105j3125M056K4283L7098K3011
$$ -56617 -66320 -88114 -95792 -76870 -78776 -70572 -36465 -50570 -63695 -59639 -35356 1742 24753
10325B4753J2132R892j2252j5439m209k8268m1815k1731k2021n355J3309O75j552
$$ 24753 36885 46777 34525 19086 14877 -13391 -55206 -76937 -98958 -104313 -91004 -90329 -91881
10312i1881L247k102M924J083J3000r99l800J1037O676k503l052K2165K051j5249
$$ -91881 -88634 -90736 -85812 -84729 -71729 -72728 -76528 -65491 -58815 -61318 -64370 -42205 -40154 -55403
10298e5403N784R804J0158k1315l513m071n789j6420R748J6108R606J0318M505
$$ -55403 -49619 -39815 -29657 -50972 -54485 -58556 -64345 -80765 -71017 -54909 -45303 -34985 -30480
10285c0480p067p230J4124l856r074j4582N183N607r875l838N224p316p81l049
$$ -30480 -37547 -44777 -30653 -34509 -43583 -58165 -52982 -47375 -57250 -61088 -55864 -63180 -63961 -67010
10271f7010j671j0286J7738K0431l413j322J4537K4659k505j271j4572p413n683
$$ -67010 -68681 -78967 -61229 -40798 -44211 -45533 -30996 -6337 -8842 -10113 -24685 -32098 -37781
10258c7781J692q914L795Q250j075J9889J240j6929j5859K3248J3118R770j128
$$ -37781 -36089 -45003 -41208 -32958 -34033 -14144 -12904 -29833 -45692 -22444 -9326 444 -684
10245f84j7158N597q268J1052J7552M86k1040l013J0912q60P675r529P663l4340
$$ -684 -17842 -12245 -20513 -9461 8091 8577 -12463 -15476 -4564 -5424 2251 -7278 385 -33955
10231c3955j2051K2817P723l635P026l143M677M363o780j728m28o186M260q4O971
$$ -33955 -46006 -23189 -15466 -19101 -12075 -15218 -10541 -6178 -12958 -14686 -15114 -21300 -17040 -17124 -10153
10216a0153J0379m0455k3190k6283j8955J4746J1567J8725K8116J8531K6029K4951
$$ -10153 226 -40229 -63419 -89702 -108657 -93911 -82344 -63619 -35503 -16972 9057 34008
10204C4008Q853Q03k450l229rj1768J8262Q446p515j7670K9811M1106O258j3866
$$ 34008 42861 43664 41214 37985 37976 26208 44470 52916 45401 27731 57542 98648 104906 91040
10190I1040J4352M0110K6772L6506L8239N3484P2476P2847J11210J62832K49878
$$ 91040 105392 145502 172274 208780 247019 300503 372979 445826 557036 719868 969746
10179I69746L58808M49616M36013J89256j76991m45731m86655l78455k30833j37975
$$ 969746 1328554 1778170 2214183 2403439 2226448 1780717 1294062 915607 684774 546799
10169E46799q3452l1527p639M2091N6810P5693J09955J52304J70223K15432K88926
$$ 546799 463347 431820 424181 466272 523082 598775 708730 861034 1031257 1246689 1535615
10158A535615L14650K91466J55260m8952k47122l45756l60597l24466k38310j70441
$$ 1535615 1850265 2141731 2296991 2248039 2000917 1655161 1294564 970098 731788 561347
10148E61347j05790q8160n7192l5667n0014m1756k8686j6799k8152k7364M084
$$ 561347 455557 367397 310205 274538 224524 182768 154082 137283 109131 81767 85851
10137H5851K261j9278k2677N364L736J2246m979j5711r050J1095J4951r325j0690
$$ 85851 88112 68834 46157 51521 55257 67503 62524 46813 37763 48858 63809 54484 43794
10124D3794K3039L3589O541J5845K9443M1955N2356M8683N7678M5790j318l1067
$$ 43794 66833 100422 106963 122808 152251 194206 246562 295245 352923 398713 397395 366328
10112C66328m0637m2396n0434m3209k3810L71q299J4188K5411K5811J7112M7923
$$ 366328 325691 283295 232861 189652 165842 166213 157914 172102 197513 223324 240436 288359
10100B88359N1287O3683Q3692R0292J53423K03412K45422K77790K97390K69206
$$ 288359 339646 403329 487021 577313 730736 934148 1179570 1457360 1754750 2023956
10090B023956J25887j06457l43262m18752l54675k54100j85793j11387q5604o4891
$$ 2023956 2149843 2043386 1700124 1281372 926697 672597 486804 375417 289813 224922
10080B24922m6397l2065j9990k0679k4220k0839j4087J9571J6520l671p425j6068
$$ 224922 178525 146460 126470 105791 81571 60732 46645 66216 82736 79065 71640 55572
10068E5572j6141j4634p001J2184k5272r025P417o984K246J049O081q444J261
$$ 55572 39431 24797 17796 29980 4708 -4317 3100 -3884 -1638 -589 5492 -2952 -1691
10055a691J0376N823j4637k0540j5299j224K4745J9374q825k691J5468J4672j1053
$$ -1691 8685 14508 -129 -20669 -35968 -37192 -12447 6927 -1898 -4589 10879 25551 14498
10042A4498J7602o20k2995m307L655p182p906P729l793J2529O987j508j4433l1015
$$ 14498 32100 31480 8485 4178 7833 651 -7255 474 -3319 9210 16197 14689 256 -30759
10028c0759j5331Q339J787J6965J5665j3477K396P872P037k072J0544k7663j3781
$$ -30759 -46090 -37751 -35964 -18999 -3334 -16811 -14415 -6543 494 -1578 8966 -18697 -32478
10015c2478N068K8355j1588r884l437K191P436J5055J1754m874j9865j0372l970
$$ -32478 -27410 945 -10643 -20527 -23964 -21773 -14337 718 12472 7598 -12267 -22639 -26609
10002b6609N021J1543Q768k108P476Q135j1356j0886K5116Q848o037R999m121
$$ -26609 -21588 -10045 -1277 -3385 4091 12226 870 -10016 15100 23948 17911 27910 23789
9989B3789k5438L00p0l755o939q601J0176O317J0856j039O393M634p243j2169
$$ 23789 -1649 -1349 -1419 -5174 -12113 -20714 -10538 -4221 6635 5596 11989 16623 9380 -2789
9975b789j931o810j627r586J4722K2678j7971j626Q892N458P025J2268M043j616
$$ -2789 -4720 -11530 -13157 -22743 -8021 14657 -3314 -4940 3952 9410 16435 28703 32746 31130
9961C1130m948j9400j000O884J5105L829j7290j8473j194j575Q269J5894N1K642
$$ 31130 26182 6782 5782 12666 27771 31600 14310 -4163 -5357 -6932 1337 17231 17282 19924
9947A9924Q030p347r871j565o754n377J3458K9680j935l3916j0588R033k50j4206
$$ 19924 27954 20607 10736 9171 2417 -2960 10498 40178 38243 4327 -6261 2772 2522 -11684
9933a1684R690P454n314N750K1623o55p991j2969P93K9036J4035k0589j6223J1580
$$ -11684 -1994 5460 146 5896 27519 26864 18873 5904 6697 35733 49768 29179 12956 24536
9919B4536K65r018J6245m82R32K587j8966r339J296K5033L428j3690k9219j726
$$ 24536 24801 15783 32028 31546 32478 35065 16099 6760 8056 33089 36517 22827 -6392 -8118
9905h118K6892J5374J4649q063o890q819r033K1329J9855n796j2083R592p818
$$ -8118 18774 34148 48797 40734 33844 25025 15992 37321 57176 51380 39297 48889 41071
9892D1071m300J490M007J0683k0633j8825K192J0641j3318m293L989J6188J189
$$ 41071 36771 38261 42268 52951 32318 13493 15685 26326 13008 8715 12704 28892 30081
9879C0081k2312R57Q822L792k931k1815K288Q222j8588j760Q554P930q967R183
$$ 30081 7769 8726 17548 21340 18409 -3406 -1118 7104 -11484 -13244 -4690 3240 -5727 3456
9865C456J2654K8509K8679K252j5709N072J6614l077r598k1805j897k2826r293
$$ 3456 16110 44619 73298 75550 59841 64913 81527 78450 68852 47047 45150 22324 13031
9852A3031J2898R633M246R064p365k8677j3457j144J0169p908r902J5513J9571
$$ 13031 25929 35562 39808 48872 41507 12830 -627 -1771 8398 490 -9412 6101 25672
9839B5672N270q654j915J7181O678k9401l367N032R050K5202J4030r279k152m543
$$ 25672 30942 22288 20373 37554 44232 14831 11464 16496 25546 50748 64778 55499 53347 48804
9825D8804j5451k6077n53j256Q73L739J2342j2096J3024j335r540N342M533K545
$$ 48804 33353 7276 6723 5467 6340 10079 22421 10325 23349 22014 12474 17816 22349 24894
9811B4894j392K980K0241K3379j3435o325j1194q326J2929J1502j4204j0675k0954
$$ 24894 23502 26482 46723 70102 56667 50342 39148 30822 43751 55253 41049 30374 9420
9798I420q609P940J980o200k305J8495J3329M206J7074k3440j6892K2624J4976
$$ 9420 811 8751 10731 4531 2226 20721 34050 38256 55330 31890 14998 37622 52598
9785E2598j460j243j0842k4188K047J0452K397j3023j680J52J0538J1991l323
$$ 52598 51138 49895 39053 14865 16912 27364 29761 16738 15058 15210 25748 37739 34416
9772C4416m020j0542p242K6065M580J0910Q800q372L506j7055k766J6237N031
$$ 34416 30396 19854 12612 38677 43257 54167 62967 54595 58101 41046 38280 54517 59548
9759E9548j3170Q57R904K76l99o212R784l151p864k870k272J5904m383m949J3470
$$ 59548 46378 47235 57139 57415 57016 50804 60588 57437 49573 46703 44431 60335 55952 51003 64473
9744F4473j404k4563o693L089J2188K1864k648r460n028l00L888q714m215Q546
$$ 64473 63069 38506 31813 34902 47090 68954 66306 56846 51818 51518 55406 46692 42477 51023
9730E1023K307p967O849j631R974m159k586r949j683o892J2857l268J2375j4945
$$ 51023 53330 45363 52212 50581 60555 56396 53810 43861 42178 35286 48143 44875 57250 42305
9716D2305L950K930m947O355J2291o808j9736k453Q817j771M920m654J5135n55
$$ 42305 46255 49185 44238 50593 62884 56076 36340 33887 42704 40933 45853 41199 56334 55779
9702E5779q819l440k916r735j0344J6173P453J4944k294k3058O442J4490n662
$$ 55779 46960 43520 40604 30869 20525 36698 44151 59095 56801 33743 40185 54675 49013
9689D9013P526K23l753k969j0800q569K1285J432k5375R525R152N712K2675j4899
$$ 49013 56539 56762 53009 50040 39240 30671 51956 53388 28013 37538 46690 52402 75077 60178
9675F0178o478k1932L451O274j26P939J2140K82K6223l749k7153m937k68M464
$$ 60178 53700 31768 35219 41493 41367 49306 61446 61728 87951 84202 57049 52112 51844 56308
9661E6308K182r877n820m587J9506L1349L518j2220r425p027l727p06j1051Q711
$$ 56308 58490 48613 42793 38206 57712 89061 92579 80359 70934 63907 60180 59474 48423 57134
9647E7134N079J7625J38j035k8055q030j650R196n645M157Q720J0494j0336j1230
$$ 57134 62213 79838 79976 78941 50886 42856 41206 50402 44757 48914 57634 68128 57792 46562
9633D6562m664J5172j985J244j1905O261J2998J6353L810p337J2642J8250J0825
$$ 46562 41898 57070 55085 56329 44424 50685 63683 80036 83846 76509 89151 107401 118226
9620A18226k4750j6439k4842J787K702K90m396n764R437J0880j93r163q708J6879
$$ 118226 93476 77037 52195 53982 56684 56974 52578 46814 56251 67131 66938 57775 49067 65946
9606F5946P586K920j4641k0509O959J4021M415J6497j1788R065q825j1941J4021
$$ 65946 73532 76452 61811 41302 48261 62282 66697 83194 71406 80471 71646 59705 73726
9593G3726R843m921L768M467p609j0325o679J5157O130l95j9013N458m166L920
$$ 73726 83569 78648 82416 86883 79274 68949 62270 77427 83557 83162 64149 69607 65441 69361
9579F9361k963L544R865K071N214j3356J1783o002j7205j3610o656j1885J4193
$$ 69361 66398 69942 79807 81878 87092 73736 85519 79517 62312 48702 42046 30161 44354
9566D4354N027M720J0526j8231M286J7337o720n068R648J0333O310J1158k4322
$$ 44354 49381 54101 64627 46396 50682 68019 61299 56231 65879 76212 82522 93680 69358
9553F9358N421P975q909n399o923j3312J9002M2745k663l586j5318p449P497O141
$$ 69358 74779 82754 73845 68446 61523 48211 67213 109958 107295 103709 88391 80942 88439 94580
9539I4580J3691j9670j0179Q908j4231j4604R417J0309r39J08Q24J051p913p094
$$ 94580 108271 88601 78422 87330 73099 58495 67912 78221 77282 77390 78214 79265 71352 64258
9525F4258N570n911O980K2774J7198k0287r287n83J6874J6466J1377j8895l5919
$$ 64258 69828 63917 70897 93671 110869 90582 81295 80712 97586 114052 125429 106534 70615
9512G0615k494J6647p43l210K0143J5133J270Q201l523o316j7571k0132O502J1826
$$ 70615 68121 84768 84025 80815 100958 116091 117361 125562 122039 115723 98152 78020 84522 96348
9498I6348K755j010j091J7563q952l3053o932p350K5677J7246j1898k2444j1933
$$ 96348 99103 98093 97002 114565 105613 72560 65628 58278 83955 101201 89303 66859 54926
9485E4926J1713J5442j6387j5482L224O258P696j278r010J7616R905J5338R521
$$ 54926 66639 82081 65694 50212 53436 59694 67390 66112 57102 74718 84623 99961 109482
9472A09482p655R313R197J2165l516r409m256r459k2339o945J2036J404K7311
$$ 109482 101827 111140 120337 132502 128986 119577 115321 105862 83523 76578 88614 90018 117329
9459A17329N702m068j9705J472K162n644L761J9628k053j481J8881o23M703j3300
$$ 117329 123031 118963 99258 100730 102892 97248 101009 120637 118584 117103 135984 135361 140064 126764
9445A26764p179p420j4224m808J5380J2428m703o06J1922n56j9198j6034q039
$$ 126764 119585 112165 97941 93133 108513 120941 116238 115632 127554 126998 107800 91766 83727
9432H3727J3199Q544n395j7313j7529Q919J318N21p95K305R6P012j4435J340K857
$$ 83727 96926 105470 100075 82762 65233 74152 75470 75991 75196 77501 77597 84609 70174 71514 74371
9417G4371q25J575m215J1135L243J2208j0020j5060J8983L1594j8904l97J1656
$$ 74371 73546 75121 70906 82041 85284 97492 87472 72412 91395 122989 104085 103688 115344
9404A15344P346P96p022M411R111r00L859r931l64J4957o065k950J3798j8293
$$ 115344 122690 123486 116464 120875 129986 129086 132945 123014 122650 137607 131542 128592 142390 124097
9390A24097j1491N260N661M299k359l541J0015M417j0751j9082n222r346O995
$$ 124097 112606 117866 123527 127826 125467 121926 131941 136358 125607 106525 101303 91957 98952
9377I8952P250N140L168Q161M394k662j4124L520J031Q599J6173O132Q509J423
$$ 98952 106202 111342 114510 122671 127065 124403 110279 113799 114830 123429 139602 145734 154243 155666
9363A55666j1929q114j2737r533j0080J9987J0726r595j291N617l66j200n190
$$ 155666 143737 135623 122886 113353 103273 123260 133986 124391 123100 128717 128351 127151 121961
9350A21961J2839Q673j930J5034K258j7691j7585o41R554J1209J6579M082n044
$$ 121961 134800 143473 141543 156577 158835 141144 123559 122918 132472 143681 160260 164342 159298
9337A59298j1094j4688J2060j469O897K0629l233r483J523k196J0590l174j4800
$$ 159298 148204 133516 145576 144107 151004 171633 168400 158917 160440 158244 168834 165660 150860
9324A50860O756Q223M04P511J4771J1056q16R138r00N97j1308J307n063J3532
$$ 150860 157616 165839 166243 173754 188525 199581 198765 207903 207003 207600 196292 197599 192536 206068
9310B06068L528o781o315J2414K0908O47r38l85o131k550j0001K627J2535n47
$$ 206068 209596 202815 196500 208914 229822 230469 229531 229146 223015 220465 210464 213091 225626 225079
9296B25079M449n59r196j9596R277m517J895k0205n418M582J1018J0040j0189
$$ 225079 229528 228969 219773 200177 209454 204937 206832 186627 181209 185791 196809 206849 196660
9283A96660L91J5894n098L268J6184Q728j6798j113p961N723o78n345N498k902
$$ 196660 197051 212945 207847 211115 227299 236027 219229 218116 210155 215878 215200 209855 215353 212451
9269B12451n274J9834N192n154j0045L015n391L662N04J4242J6890J8634M341
$$ 212451 207177 227011 232203 227049 217004 220019 214628 218290 218794 233036 249926 268560 272901
9256B72901P184J0513o872k2782k1785j4722P05L719p13J4414K313p534j1790
$$ 272901 280085 290598 283726 260944 239159 224437 225142 228861 228148 242562 244875 237341 225551
9243B25551J992K2104J5719R537m353J4188l87n183M564o398K657J3528j3404
$$ 225551 227543 249647 265366 274903 270550 284738 284351 279168 283732 277334 279991 293519 280115
9230B80115j2775j2458K3428J6134J587J0083K794K724J2003J743O600K1037K097
$$ 280115 267340 254882 278310 294444 296031 306114 308908 311632 323635 325378 331978 353015 355112
9217C55112q793q089n992q318J1887K0532Q751J5806p536j8502k1488q323J8217
$$ 355112 346319 338230 332238 323920 335807 356339 365090 380896 373360 354858 333370 325047 343264
9204C43264L533K4933J6477L2215K1830m575p793o943J6562O257R250R697m499
$$ 343264 346797 371730 388207 420422 442252 437677 429884 422941 439503 445760 455010 464707 460208
9191D60208J8602j2817j3444M77J0403K0185K9090j409n179K088j6987N149J3328
$$ 460208 478810 465993 452549 453026 463429 483614 512704 511295 506116 508204 491217 496366 509694
9178E09694K575K4324J1470N862O531q248O684Q774N870J1305J4888O956K2538
$$ 509694 512269 536593 548063 553925 560456 552208 558892 567666 573536 584841 599729 606685 629223
9165F29223J5736j4232n465Q188J2141Q411K2197J9845Q085p941K8145M171j2923
$$ 629223 644959 630727 625262 633450 645591 654002 676199 696044 704129 696188 724333 728504 715581
9152G15581J7462J7770K2776K3989J1077J1112K4468P587O258p390J9168M7063
$$ 715581 733043 750813 773589 797578 808655 819767 844235 851822 858080 850690 869858 916921
9140I16921L5083K2230K7469q084J4321N3374M5139L1444K6027L2893L7150K4722
$$ 916921 952004 974234 1001703 993619 1007940 1061314 1106453 1137897 1163924 1196817 1233967 1258689
9128A258689Q069M1011M0519L2729M5550N4197L9642P0808N3946K8885M9453O9361
$$ 1258689 1266758 1307769 1348288 1381017 1426567 1480764 1520406 1591214 1645160 1674045 1723498 1792859
9116A792859R7730O7099O5983N6990R9016J15499J10448J11778J23532J25001
$$ 1792859 1890589 1957688 2023671 2080661 2179677 2295176 2405624 2517402 2640934 2765935
9106B765935J13390J50291J70837J76730K10192K26963K69777K70154K84374L04145
$$ 2765935 2879325 3029616 3200453 3377183 3587375 3814338 4084115 4354269 4638643 4942788
9096D942788L60978M38017M41842M96292N64567N95538O72110P21291P24019P56252
$$ 4942788 5303766 5741783 6183625 6679917 7244484 7840022 8512132 9233423 9957442 10713694
9086A0713694P65552P52401O96747O14064N21443M03372K86002J95830J54136
$$ 10713694 11479246 12231647 12928394 13542458 14063901 14467273 14753275 14949105 15103241
9077A5103241J03109M9920L3981K1858L6084Q4025J21494J50941K25168L00109
$$ 15103241 15206350 15256270 15290251 15312109 15348193 15432218 15553712 15704653 15929821 16229930
9067A6229930L35600L65806M22244N28360O07384O59137P16322Q00249Q52524
$$ 16229930 16565530 16931336 17353580 17881940 18489324 19148461 19864783 20665032 21517556
9058B1517556R11562R33008Q94106Q34090P53573N91499L95143J32376j58074
$$ 21517556 22429118 23362126 24256232 25090322 25843895 26435394 26830537 26962913 26804839
9049B6804839m83881q25774j137485j359009j535794j617253j647004j601721
$$ 26804839 26320958 25495184 24357699 22998690 21462896 19845643 18198639 16596918
9041A6596918j509180j403653j276820j142097j037362r40066q23928p11497o56134
$$ 16596918 15087738 13684085 12407265 11265168 10227806 9287740 8463812 7752315 7096181
9032G096181n64824n02786m52050m17752l73803l36197l08535k59697k33393k19090
$$ 7096181 6531357 6028571 5576521 5158769 4784966 4448769 4140234 3880537 3647144 3428054
9022C428054k19903j90040j71928j66712j47883j45593j28378j06779q2140r0305
$$ 3428054 3208151 3018111 2846183 2679471 2531588 2385995 2257617 2150838 2068698 1978393
9012A978393j00250r0172q0020r2641q4120o9590n8181o0149o0246n1854k8063
$$ 1978393 1878143 1787971 1707951 1615310 1531190 1461600 1403419 1343270 1283024 1231170 1203107
9001A203107l2221m6905m2427n3144l6758j2996k2327l9768m5500k3471k3844
$$ 1203107 1170886 1123981 1081554 1028410 991652 978656 956329 916561 871061 847590 823746
8990H23746K063j2476l7016j9166J6814j042L978J5543L2460O2682L2719k5518
$$ 823746 825809 813333 776317 757151 773965 772923 776901 792444 824904 887586 920305 894787
8978H94787p5089q1331o4946n6163l6920l1148l0890r674j2630q56j745q183j2034
$$ 894787 819698 738367 673421 617258 580338 549190 518300 508626 495996 495140 493395 485212 473178
8965D73178l1345k1912j1238j1713k3605k0539p755j7078P39Q825q954K589p171
$$ 473178 441833 419921 408683 396970 373365 352826 345071 327993 328732 337557 328603 331192 324021
8952C24021j6840r564m623p490L071j1823l822N184J5923q66J8074L920m245k1993
$$ 324021 307181 297617 292994 285504 288575 276752 272930 278114 294037 293171 311245 315165 310920 288927
8938B88927K2640l972q371J3156P975K2528K1983r898p151L2290K6380K7623L9491
$$ 288927 311567 307595 299224 312380 320355 342883 364866 354968 347817 380107 406487 434110 473601
8925D73601N1423M8228O7958R3703J22022J23081J14681J26218J58099K57381
$$ 473601 525024 573252 641210 734913 856935 980016 1094697 1220915 1379014 1636395
8915A636395M31986N23542M65017J93519j66775l59642l80350l38486l55458l52691
$$ 1636395 2068381 2591923 3056940 3250459 3083684 2724042 2343692 2005206 1649748 1297057
8905A297057k57754j89238j30204j00409n3843n3041l9411j862Q401J698L2614
$$ 1297057 1039303 850065 719861 619452 565609 512568 473157 471295 479696 481394 514008
8894E14008K6579J5065n0786n6111p9986o3441l6251k1717j0035j341l3042p964
$$ 514008 540587 555652 504866 448755 368769 305328 269077 247360 237325 235984 202942 194978
8882A94978j5948k2565O818L897j7237p708j581J1383P671j8912j7297j3696O02
$$ 194978 179030 156465 163283 167180 149943 142235 140654 152037 159708 140796 123499 109803 110405
8869A10405J3253O788O925K2571L5929L8419K1087J4720L0687M4316M9602O9200
$$ 110405 123658 130446 137371 159942 195871 234290 255377 270097 300784 345100 394702 463902
8857D63902N0977j5662m9272j03063p8420n1757l7272j9485l4794k3801k4499
$$ 463902 514879 499217 449945 346882 268462 216705 179433 159948 125154 101353 76854
8846G6854P74J601j3530o771J6034J5047K254K244K22N795j1198Q733k191j2503
$$ 76854 77628 79229 65699 58928 74962 90009 92263 94507 94729 100524 89326 98059 95868 83365
8832H3365l345j527j2171j3779R535O305J8570J4721K478j7327m115J652J0390
$$ 83365 80020 78493 66322 52543 62078 68383 86953 101674 104152 86825 82710 84362 94752
8819I4752l745j4193j2904p530j9978o500J1048K3836j1768k4919p792J3289R202
$$ 94752 91007 76814 63910 56380 36402 29902 40950 64786 53018 28099 20307 33596 42798
8806D2798j261j392o812q789J5612J0541m935O466M028Q85R926p122m165K136
$$ 42798 41537 40145 33333 24544 40156 50697 45762 52228 56256 57141 67067 59945 55780 57916
8792E7916j1276K024J3750J0588m326j4003r826L094J1170K933j3781k3969n191
$$ 57916 46640 48664 62414 73002 68676 54673 44847 47941 59111 62044 48263 24294 19103
8779A9103K554J1309P552J6144j6900j4955J2973n320k008P725N585q293j1919
$$ 19103 21657 32966 40518 56662 39762 24807 37780 32460 30452 38177 43762 35469 23550
8766B3550o059J0895J1101J7007R199r861o208J797r775K341m931K849n815j8173
$$ 23550 17491 28386 39487 56494 65693 55832 49624 51421 41646 43987 39056 41905 36090 17917
8752A7917j7493K4735J7722j3558j5005o382J2439O087O228Q418J1122J9392j1395
$$ 17917 424 25159 42881 29323 14318 7936 20375 26462 32690 41108 52230 71622 60227
8739F0227k4117q568J935K0007q825j1823l054N985p205k625M903j0580J861p952
$$ 60227 36110 27542 29477 49484 40659 28836 25782 31767 24562 21937 26840 16260 18121 10169
8725A0169M019J2323R510j7486l644K972P131p181q801N064J9883j5669p93l913
$$ 10169 14188 26511 36021 18535 14891 17863 24994 17813 9012 14076 33959 18290 17497 13584
8711A3584o805P298Q787k740l044k274r317r912m849r539n672J3247J4681K0177
$$ 13584 6779 14077 22864 20124 17080 14806 5489 -4423 -9272 -18811 -24483 -11236 3445 23622
8697B3622m748p628j7875O522K0651J1795J1284l761J0112K0389Q568j8120j1019
$$ 23622 18874 11246 -6629 -107 20544 32339 43623 39862 49974 70363 78931 60811 49792
8684D9792P555j0008j242Q607n556j4779J0462J4142K547N413O363j469N195P278
$$ 49792 57347 47339 46097 54704 49148 34369 44831 58973 61520 66933 73296 71827 77022 84300
8670H4300K298K4046K736L4490L9734N9539O0307Q0824M6489J093o1516r4166
$$ 84300 86598 110644 113380 147870 187604 247143 307450 388274 434763 435856 374340 280174
8658B80174p4928n7947m5992j2517J5091j8597m458r814o969P232j0672o930m015
$$ 280174 205246 147299 101307 88790 103881 85284 80826 71012 64043 71275 60603 53673 49658
8645D9658j249N186P975J515j0115n498q649j9375K318J5157J2134J0798J679
$$ 49658 48409 53595 61570 63085 52970 47472 38823 19448 21766 36923 49057 59855 61534
8632F1534j0334M742J5423Q43q755M335p36M240J9q803k017k160N723J8462O698
$$ 61534 51200 55942 71365 72208 63453 67788 67052 71292 71311 62508 60491 58331 64054 82516 89214
8617H9214J2701j211k768k14J5795Q731O537o908n916m07j0894r668j6301R988
$$ 89214 101915 100704 97936 97722 113517 122248 128785 121877 115961 115554 104660 94992 78691 88679
8603H8679M868k936l232q371j246m936j6320j0868k739K0508N485L961K9937M1703
$$ 88679 93547 90611 87379 79008 77762 72826 56506 45638 42899 63407 68892 72853 102790 144493
8589A44493R667K82j5654k3222n677j2428j3265j1372O067J2704l686j1322N436
$$ 144493 154160 154442 138788 115566 109889 97461 84196 72824 78891 91595 87909 76587 82023
8576H2023R53r423j1580j0929M295j0939j1740K366j0460m550r636j8073J2213
$$ 82023 82976 73553 61973 51044 55339 44400 32660 35026 24566 20016 10380 -7693 4520
8563D520J0065L955l991j8373Q260Q515Q785N201k0609j5297R838L1505J4114
$$ 4520 14585 18540 14549 -3824 4436 12951 21736 26937 6328 -8969 869 32374 46488
8550D6488j1792r922q041l003j1038J482l360j1116M630J4564n273q975N09J0991
$$ 46488 34696 24774 16733 13730 2692 4174 814 -10302 -5672 8892 3619 -5356 -4847 6144
8536F144p008j8j2328P312J2835J6834q119k7929j1666M294J2742J4753K382R104
$$ 6144 -864 -882 -13210 -5898 6937 23771 15652 -12277 -23943 -19649 -6907 7846 10228 19332
8522A9332j0704j982l768r593P660J9923J314j6076R788Q476k253j2833Q810J2353
$$ 19332 8628 6646 2878 -6715 945 20868 22182 6106 15894 24370 22117 9284 18094 30447
8508C0447l671j4222m94J4219J0160k207k2777j7939O988L122N025q658j3701
$$ 30447 26776 12554 12060 26279 36439 34232 11455 -6484 504 3626 8651 -7 -13708
8495a3708Q42O002l39J5448P032m726j0613m767M63j0509R551j7846L82r838J1346
$$ -13708 -12866 -6864 -7203 8245 15277 10551 -62 -4829 -4366 -14875 -5324 -23170 -22788 -32626 -21280
8480b1280J4399K1269K0697P648q448Q684P715k309j7123j7902l590P75q864m88
$$ -21280 -6881 14388 35085 42733 34285 42969 50684 48375 31252 13350 9760 10535 1671 1183
8466A183j9659p494J020n15Q57J2887N123K2093K1035J4103J861m401p768j4118
$$ 1183 -18476 -25970 -24950 -25465 -24608 -11721 -6598 15495 36530 50633 52494 48093 40325 26207
8452B6207j3900m069J6453m995k1230j9539j0866n166J498J5083n726q36J1242
$$ 26207 12307 8238 24691 19696 -1534 -21073 -31939 -37105 -35607 -20524 -26250 -27086 -15844
8439a5844K4273J4017j2692l9580K649J8338L014N779j4758K2955J4905j8602
$$ -15844 8429 22446 9754 -29826 -27177 -8839 -5825 -46 -14804 8151 23056 4454
8427D454l0339o350J0076j329K025K4014J0663j1757k0511J2915Q622k2113j5506
$$ 4454 -25885 -32235 -22159 -23488 -21463 2551 13214 1457 -19054 -6139 2483 -19630 -35136
8414c5136j4270K0002R338j3760K2332K3410l0371o032p553O911n542r600P177
$$ -35136 -49406 -29404 -20066 -33826 -11494 11916 -18455 -24487 -32040 -25129 -30671 -40271 -33094
8401c3094K1591N067j282m216K0950J7727r286j6918j6614M947J4650L568k503
$$ -33094 -11503 -6436 -7718 -11934 9016 26743 17457 539 -16075 -11128 3522 7090 4587
8388D587l154j777J228j5373j107k435J3341R438J4761o823o764o152o752o995
$$ 4587 1433 -344 884 -14489 -15596 -18031 -4690 4748 19509 12686 5922 -230 -6982 -13977
8374a3977K189N834J8716k9902j6138R464R493L919r314J589J1501J1442Q366
$$ -13977 -11788 -5954 12762 -17140 -33278 -23814 -14321 -10402 -19716 -18127 -6626 4816 13182
8361A3182j582k0987j1138j7075r043Q146J5701J6789R638J9808L720k1639k6827
$$ 13182 11600 -9387 -20525 -37600 -46643 -38497 -22796 -6007 3631 23439 27159 5520 -21307
8348b1307q472R007J7854Q501r872l489j3505j861P185p858K0697k8j2199J551
$$ -21307 -29779 -20772 -2918 5583 -4289 -7778 -21283 -23144 -15959 -23817 -3120 -3148 -15347 -13796
8334a3796R343N852N188k280k1232N541K947k273J2507j661M833q10K217J2799
$$ -13796 -4453 1399 6587 4307 -16925 -11384 -8437 -10710 1797 136 4969 4159 6376 19175
8320A9175O118l0627j0610J4800J1385K183q816j6942j9263p429N564J419J1267
$$ 19175 25293 -5334 -15944 -1144 10241 12424 3608 -13334 -32597 -40026 -34462 -33043 -21776
8307b1776J0647l191O432J616j2904j0238N726K7083J2914k027j0611j1402J0604
$$ -21776 -11129 -14320 -7888 -6272 -19176 -29414 -23688 3395 16309 14282 3671 -7731 2873
8294B873m36k0527O55j2611P579K1514k424K695l442K303p603m668J970J7622
$$ 2873 2437 -18090 -17435 -30046 -22467 -953 -3377 -682 -4124 -1821 -9424 -14092 -12122 5500
8280E500O790l472P658m543m054j6365j2134L424P795k1075R568J6332Q315N57
$$ 5500 12290 8818 16476 11933 7879 -8486 -20620 -17196 -9401 -30476 -20908 -4576 3739 4296
8266D296j3545n921J2259Q281p664j5541L131J0123O352k1599J4793p962J0015
$$ 4296 -9249 -15170 -2911 5370 -2294 -17835 -14704 -4581 1771 -19828 -5035 -12997 -2982
8253b982n028j2835p710j3231L935R156K689K0028J0386L826j1684j3397q681
$$ -2982 -8010 -20845 -28555 -41786 -37851 -28695 -26006 -5978 4408 8234 -3450 -16847 -25528
8240b5528m876P38o452j3623q532N536N428j245k320N822O632o646O628K1125
$$ -25528 -30404 -29666 -36118 -49741 -58273 -52737 -47309 -48554 -50874 -45052 -38420 -45066 -38438 -17313
8226a7313J760J1171R736p449N105J8749R418r378j6427p418k6591K821J3044
$$ -17313 -15553 -4382 5354 -2095 3010 21759 31177 21799 5372 -2046 -28637 -25816 -12772
8213a2772p392k434p401J8189J3124j338j1561J961J527j1859o550o765j3529
$$ -12772 -20164 -22598 -29999 -11810 1314 -24 -11585 -9624 -8097 -19956 -26506 -33271 -46800
8200d6800J9760J3666J346k214j0602j903O912Q34P896j7295Q313P890Q441P430
$$ -46800 -27040 -13374 -12028 -14242 -24844 -26747 -19835 -19001 -11105 -28400 -20087 -12197 -3756 3674
8186C674J8584p874j7299l413O362K3564o307j6035j2489Q267l615L235M756m519
$$ 3674 22258 14384 -2915 -6328 34 23598 17291 1256 -11233 -2966 -6581 -3346 1410 -3109
8172c109J2560O529k464k3440j3817l5515N675J0690J7185L0887K0907r04J3290
$$ -3109 9451 15980 13516 -9924 -23741 -59256 -53581 -42891 -25706 5181 26088 25184 38474
8159C8474j0394k0323J2072K81j2713j7887j6031j900R803J6938O69M815k56l516
$$ 38474 28080 7757 19829 20110 7397 -10490 -26521 -28421 -18618 -1680 -1011 3804 3548 32
8145C2K1203J3459j8156j1740j2158j2044p400N691o987o739J6672n476o424K363
$$ 32 21235 34694 16538 4798 -7360 -19404 -26804 -21113 -28100 -34839 -18167 -23643 -30067 -27704
8131b7704l821K504R294j926N377k024k615K466j0140Q514P833N533o07j872o196
$$ -27704 -31525 -29021 -19727 -21653 -16276 -18300 -20915 -18449 -28589 -20075 -12242 -6709 -7316 -9188 -15384
8116a5384m548P486J8025j3138l058r75j3289P697L524j827K071J900L341J5082
$$ -15384 -19932 -12446 5579 -7559 -10617 -11592 -24881 -17184 -13660 -15487 -13416 -11516 -8175 6907
8102F907J4322j852k2188j5607n078j221Q961M126M516o601j5173M949Q897j0306
$$ 6907 21229 19377 -2811 -18418 -23496 -24717 -15756 -11630 -7114 -13715 -28888 -23939 -15042 -25348
8088b5348Q285p545j3530M476J7582J1454j1101k7717q9J2277J2074K0691j52
$$ -25348 -17063 -24608 -38138 -33662 -16080 -4626 -15727 -43444 -43533 -31256 -19182 1509 1357
8075A357J784J171N74q792j0373k687m451K5529R444j9080j0156m78N687k189
$$ 1357 3141 4312 4886 -3906 -14279 -16966 -21417 4112 13556 -5524 -15680 -16158 -10471 -12660
8061a2660q025K640P789j8639q299N31K1614P664P080o693M153k2566l01O021
$$ -12660 -20685 -18045 -10256 -28895 -37194 -36663 -15049 -7385 -305 -6998 -2845 -25411 -25712 -19691
8047a9691J066L84J2170J0238K23j0043M54J0304P955J7929j3218k5939j871J02
$$ -19691 -18625 -18241 -6071 4167 4390 -5653 -5199 5105 13060 30989 17771 -8168 -10039 -9937
8033i937O717r358L427k255q107K3455J2958j6597k026K726J0611l833j1536k861
$$ -9937 -3220 -12578 -9151 -11406 -19513 3942 16900 303 -1723 1003 11614 7781 -3755 -6616
8019f616m61J2243J8071n096K79j2109k5921q658J376J2216M547P009j5k791j9267
$$ -6616 -7077 5166 23237 18141 18420 6311 -19610 -28268 -26892 -14676 -10129 -3120 -3135 -5926 -25193
8004b5193r842J2630J2555M719q584l822K948Q073r492j0882J1549J2178m26j458
$$ -25193 -35035 -22405 -9850 -5131 -13715 -17537 -14589 -6516 -16008 -26890 -15341 -3163 -3589 -5047
7990e047J6784Q332p497j958m423P915J351j6672k7013j216J911O900L231J0269
$$ -5047 11737 20069 12572 10614 6191 14106 15457 -1215 -28228 -29444 -27533 -20633 -17402 -7133
7976g133j73j4950m810M941J7141J5456k5991K385M833j4717j050J8480M873N01
$$ -7133 -7306 -22256 -27066 -22125 -4984 10472 -15519 -13134 -8301 -23018 -24068 -5588 -715 -214
7962b14j3450M75O673N908J691m613m213j5378q771p15Q569P848M867M153O253
$$ -214 -13664 -13189 -6516 -608 1083 -3530 -7743 -23121 -31892 -32607 -24038 -16190 -11323 -7170 -917
7947i17J0926j428J4548p557j6974Q565O784p554J925j4042j0250J740j5564j8998
$$ -917 10009 8581 23129 15572 -1402 7163 13947 6393 8318 -5724 -15974 -14234 -29798 -48796
7933d8796m640k418N674K7095R620J3455J8551L215r191j4989O172P470K131j2359
$$ -48796 -53436 -55854 -50180 -23085 -13465 -10 18541 21756 12565 -2424 3748 11218 13349 990
7919I90j5011j1010j1497R714R042K0169J0517k1j5893J2264P898r284j3904o195
$$ 990 -14021 -25031 -36528 -26814 -17772 2397 12914 12893 -3000 9264 17162 7878 -6026 -12221
7905a2221K680l993j2474j5368o515j1245P190J3378K995j0585n114k854K1676
$$ -12221 -9541 -13534 -26008 -41376 -47891 -59136 -51946 -38568 -35573 -46158 -51272 -54126 -32450
7892c2450K3614P827l114k0612J2706j0883j7634J6372K1848j392j1177j4734
$$ -32450 -8836 -1009 -4123 -24735 -12029 -22912 -40546 -24174 -2326 -3718 -14895 -29629
7880b9629J1568k524r915J0021L174L307J9699r041k1011M550N676J0686J648
$$ -29629 -18061 -20585 -30500 -20479 -17305 -13998 5701 -3340 -24351 -19801 -14125 -3439 -1791
7867a791j1043j3028J6280k075J662k968q953J4351J87j3288j5612j0534m928
$$ -1791 -12834 -25862 -9582 -11657 -9995 -12963 -21916 -7565 -7378 -20666 -36278 -46812 -51740
7854e1740K2595J5250o198j0772N738J208O025P37r29j1855j0298l512J5849k37
$$ -51740 -29145 -13895 -20093 -30865 -25127 -23919 -17894 -17157 -18086 -29941 -40239 -43751 -27902 -28139
7840b8139P943J3j8565n845K309n745k295m33J0516j262n000Q422Q450j3380J0419
$$ -28139 -20196 -20183 -38748 -44593 -42284 -48029 -50324 -50757 -40241 -41503 -46503 -38081 -29631 -43011 -32592
7825c2592J1678J3872l421j4874J0586j9437J2941J1363j5829J1769J2604l809
$$ -32592 -20914 -7042 -10463 -25337 -14751 -34188 -21247 -9884 -25713 -13944 -1340 -5149
7813e149k809J7657j2846k9793m804L237K5293L556K398r461j3715J0357K3514
$$ -5149 -7958 9699 -3147 -32940 -37744 -34507 -9214 -5658 -3260 -12721 -26436 -16079 7435
7800G435m607q445o223j8555k8732J0766J0367J931L627j5269r037L712J3914
$$ 7435 2828 -5617 -11840 -30395 -59127 -48361 -37994 -36063 -32436 -47705 -56742 -53030 -39116
7787c9116k026M53j2927N145J3062J6645J1745k561J542J01m914R073l881J407
$$ -39116 -41142 -40689 -53616 -48471 -35409 -18764 -7019 -9580 -8038 -7937 -12851 -3778 -7659 -6252
7773f252o960N138J9803K526k2294L245j3691l081R761J116j6409R604r782O46
$$ -6252 -13212 -8074 11729 14255 -8039 -4794 -18485 -21566 -11805 -10689 -27098 -17494 -27276 -26630
7759b6630n81N710J8483M479k225q81q525K074r015l493l827O021j2549m0J393
$$ -26630 -27211 -21501 -3018 1461 -764 -1645 -10170 -8096 -17111 -20604 -24431 -18410 -30959 -30999 -29606
7744b9606J1322j8075M231j613j3003J268K2725J551M418k1362M694J006O430
$$ -29606 -18284 -36359 -32128 -33741 -46744 -45476 -22751 -21200 -16782 -38144 -33450 -32444 -26014
7731b6014n756j251M585N347L607K138K455m999q098J3938J3031M324p36p379
$$ -26014 -31770 -33021 -28436 -23089 -19482 -17344 -14889 -19888 -27986 -14048 -1017 3307 2571 -4808
7717d808o348j60R268J575M895r967j2557m067J0194K273j1079J939l918j0194
$$ -4808 -11156 -11316 -2048 -473 4422 -5545 -18102 -22169 -11975 -9702 -20781 -18842 -22760 -32954
7703c2954J5127O34o659M962j0128P794o408J7109K5615M967k3809j9594j948
$$ -32954 -17827 -17193 -23852 -18890 -29018 -21224 -27632 -10523 15092 20059 -3750 -23344 -25292
7690b5292J380o134k0664J2934K0690o642M180j484L183j9181l1278q385K915
$$ -25292 -23912 -30046 -50710 -37776 -17086 -23728 -19548 -21032 -17849 -37030 -68308 -76693 -73778
7677g3778K829R474P498K4612J7921J3052k7013r672M841j4685L485l23j179J0700
$$ -73778 -70949 -61475 -53977 -29365 -11444 1608 -25405 -35077 -30236 -44921 -41436 -41759 -42938 -32238
7663c2238K0383J5312R282k1679l8429k6875K1486L3581N43j6583j6749l1K5677
$$ -32238 -11855 3457 12739 -8940 -47369 -74244 -52758 -19177 -18634 -35217 -51966 -51997 -26320
7650b6320J1383p80j37K372J1835n364j2541k4574K5899K0549j5767j7916k4828
$$ -26320 -14937 -15717 -15854 -13482 -1647 -7011 -19552 -44126 -18227 2322 -13445 -31361 -56189
7637e6189J0076J979J4168K032j0329J802P195L972j2799J1802J3681k2615r2
$$ -56189 -46113 -44134 -29966 -27934 -38263 -36461 -29266 -25294 -38093 -26291 -12610 -35225 -35317
7624c5317M195j8882J4985J9530O084q513j2352l898o060j568L344J3834J520
$$ -35317 -31122 -50004 -35019 -15489 -9405 -17918 -30270 -34168 -40228 -41796 -38452 -24618 -23098
7611b3098K701J7698J5347j4101j3128j3639k0743M993J779J826R854j947k559
$$ -23098 -20397 -2699 12648 -1453 -14581 -28220 -48963 -43970 -42191 -40365 -30511 -32458 -35017
7598c5017j1830J0447K2185O345p766j1607O93M283p901K159P021r243j0346J2061
$$ -35017 -46847 -36400 -14215 -7870 -15636 -27243 -26550 -22267 -30168 -28009 -20988 -30231 -40577 -28516
7584b8516L637j8117k661j6636o871O588L438J8774J6853l589r044p921m264J1849
$$ -28516 -24879 -42996 -45657 -62293 -69164 -62576 -59138 -40364 -23511 -27100 -36144 -44065 -48329 -36480
7570c6480J0694J0183j001o534K7803k1049r169N384O022L101j7436n654j1801
$$ -36480 -25786 -15603 -16604 -23138 4665 -16384 -25553 -20169 -14147 -11046 -28482 -34136 -45937
7557d5937k023J7092j2634K646J5217K0392j2760j5361Q840J0363r283r976P753
$$ -45937 -47960 -30868 -43502 -40856 -25639 -5247 -18007 -33368 -24528 -14165 -23448 -33424 -25671
7544b5671O452q249P452j76k941n333M904K6425O772J37k1932J145q588n945o267
$$ -25671 -19219 -27468 -20016 -20192 -23133 -28466 -23562 2863 9635 9772 -12160 -11015 -19603 -25548 -31815
7529c1815o2J8067l826q513O603L2640j8300r943k278q691p655J982J0252O862
$$ -31815 -31877 -13810 -17636 -26149 -19546 13094 -5206 -15149 -17427 -26118 -33773 -31791 -21539 -14677
7515a4677P087R908N592j5112M404p284k7652j1133K0185K1640o650j8491j0759
$$ -14677 -7590 2318 7910 -7202 -2798 -10082 -37734 -48867 -28682 -7042 -13692 -32183 -42942
7502d2942l034Q546M310J751R905p88r760j3618J7932J7326J0288N553K3436j1488
$$ -42942 -45976 -37430 -33120 -31369 -21464 -22252 -32012 -45630 -27698 -10372 -84 5469 28905 17417
7488A7417j8650j8574q488J4103k096k2052O861J6868L697p76O856k3855R599
$$ 17417 -1233 -19807 -28295 -14192 -16288 -38340 -31479 -14611 -10914 -11690 -4834 -28689 -19090
7475a9090M245J67L638P458r992k958n981j7704j418j5322J9303J2737O425j373
$$ -19090 -14845 -14678 -11040 -3582 -13574 -16532 -22513 -40217 -41635 -56957 -37654 -24917 -18492 -19865
7461a9865J3702J9534q865n430M109k3632j8023J3640J2804r703m79R174J8321
$$ -19865 -6163 13371 4506 -924 3185 -20447 -38470 -24830 -12026 -21729 -22208 -13034 5287
7448E287J826q522j9603P151j4311j6239M79L686J0473J4567K1759n711p125O514
$$ 5287 7113 -1409 -21012 -13861 -28172 -44411 -43932 -40246 -29773 -15206 6553 842 -6283 231
7434B31N126k662j5311j2273j4250K635j2591J2179J776O295J7346m630j6749
$$ 231 5357 2695 -12616 -24889 -39139 -36504 -49095 -36916 -35140 -28845 -11499 -16129 -32878
7421c2878J0270q109K311J4652J5192J6697o506j5945l1379j3771M989Q797l457
$$ -32878 -22608 -30717 -28406 -13754 1438 18135 11629 -4316 -35695 -49466 -44477 -35680 -39137
7408c9137K3771K8489j0037k5047J2170j9432O280R640j2679K369k2620j5600
$$ -39137 -15366 13123 3086 -21961 -9791 -29223 -22943 -13303 -25982 -23613 -46233 -61833
7396f1833Q380N951M623P714O042m37P651K909J1928j1591n641R236P211M150
$$ -61833 -53453 -47502 -42879 -35165 -29123 -29560 -21909 -19000 -7072 -18663 -24304 -15068 -7857 -3707
7382c707j1827p22K904k4781j1688j3388O081L7604K0149J935j2124n597O926
$$ -3707 -15534 -16256 -13352 -38133 -49821 -63209 -57128 -19524 625 2560 -9564 -15161 -8235
7369h235l684o951N00q604L407J7034J4316m153K781j2362p415j0389M959J99
$$ -8235 -11919 -18870 -18370 -26974 -23567 -6533 7783 3630 6411 -5951 -13366 -23755 -18796 -18597
7355a8597j0056m252R586p31M994J6852L915k4194q113N770k0310J2274J7499
$$ -18597 -28653 -32905 -23319 -24050 -19056 -2204 1711 -22483 -30596 -24826 -45136 -32862 -15363
7342a5363n856M33l31q399q562O62K0705j2960l4795J6914O413l969j457J6802
$$ -15363 -21219 -20786 -21117 -29516 -38078 -37416 -16711 -29671 -64466 -47552 -41139 -45108 -46565 -29763
7328b9763J4699j8860q425n05n652J2021J7086J6383o706l881P993l000o402k234
$$ -29763 -15064 -33924 -42349 -42854 -48506 -36485 -19399 -3016 -9722 -13603 -5610 -8610 -15012 -17246
7314a7246j0196p486J2700J8315J796m488Q339j2982k578j0644l1968p63N421
$$ -17246 -27442 -34928 -22228 -3913 -2117 -6605 1734 -11248 -13826 -24470 -56438 -57201 -51780
7301e1780K8590Q839K479n093j1831j3657J4867J1267l431j6254o685J903R484
$$ -51780 -23190 -14351 -11872 -16965 -28796 -42453 -27586 -16319 -19750 -36004 -42689 -40786 -31302
7288c1302N644p3k2464j3064N307L6578M750P109O778n726N225O37m325l343R344
$$ -31302 -25658 -25731 -48195 -61259 -55952 -19374 -14624 -7515 -737 -6463 -1238 -601 -4926 -8269 1075
7273A075M033j87Q567j4858K064j6920j0484J3526J117j2801j4213j2052M559
$$ 1075 5108 4921 13488 -1370 694 -16226 -26710 -13184 -12067 -24868 -39081 -51133 -46574
7260d6574J4666m607J1148j419j2241J5561k513k436J4683J7650k1151L081J2714
$$ -46574 -31908 -36515 -25367 -26786 -39027 -23466 -25979 -28415 -13732 3918 -17233 -14152 -1438
7247a438K339q914p820M438p86J0815j2028j5320k675J0577L430J8693J748N005
$$ -1438 901 -8013 -15833 -11395 -12181 -1366 -13394 -28714 -31389 -20812 -17382 1311 3059 8064
7233H064j1603j8121j5240J3193O962J3388J7438r764k0743q239j0812M473M812
$$ 8064 -3539 -21660 -36900 -23707 -16745 -3357 14081 4317 -16426 -24665 -35477 -31004 -26192
7220b6192J7548J9931j941j9132j2794o216n291l02J3318l215n785R237P106k295
$$ -26192 -8644 11287 9346 -9786 -22580 -28796 -34087 -34389 -21071 -24286 -30071 -20834 -13728 -16023
7206a6023r554j2076J5511K2660J0225o705m886k0880k1151k293J9769J101O986
$$ -16023 -25577 -37653 -22142 518 10743 4038 -848 -21728 -42879 -45172 -25403 -24302 -17316
7193a7316n244m276Q810J0125J0392k450r951R840J8225J497O71o321j5437n218
$$ -17316 -22560 -26836 -18026 -7901 2491 41 -9910 -70 18155 19652 20323 14002 -1435 -6653
7179f653J7494o55k2950j8083j2975n964R571J6457J6495r615j1639J5829O177
$$ -6653 10841 10186 -12764 -30847 -43822 -49786 -40215 -23758 -7263 -16878 -28517 -12688 -6511
7166f511N906r091Q75J2536M907K301L297j1711j5886n588J393k0276n768J5902
$$ -6511 -605 -9696 -8821 3715 8622 10923 14220 2509 -13377 -18965 -17572 -37848 -43616 -27714
7152b7714J2364k523O467J265m84j078j1612p502J3275R688j4253q265Q502J9534
$$ -27714 -15350 -17873 -11406 -10141 -10625 -11703 -23315 -30817 -17542 -7854 -22107 -30372 -21870 -2336
7138b336l586j1620p46q455k866J2041n87J0272J0409o979n020m211j0973J373
$$ -2336 -5922 -17542 -18288 -26743 -29609 -17568 -18155 -7883 2526 -4453 -9473 -13684 -24657 -23284
7124b3284M112L144J568j456R828J2770r442j8656M650P649J19j2463J1445J4181
$$ -23284 -19172 -16028 -14460 -15916 -6088 6682 -2760 -21416 -16766 -9117 -8998 -21461 -10016 4165
7110D165L353j7254m282Q089L080j850k1617j3092J3698O981p316M586j427M733
$$ 4165 7518 -9736 -14018 -5929 -2849 -4699 -26316 -39408 -25710 -18729 -26045 -21459 -22886 -18153
7096a8153M09m700o009M429L77p960r030J1792l047J6272K573J5744J4407j0911
$$ -18153 -17744 -22444 -28453 -24024 -23647 -31607 -40637 -28845 -31892 -15620 -13047 2697 17104 6193
7082F193j2445j6J1894L643j7983j6725j4555l898Q913P24L666P212R799j292
$$ 6193 -6252 -6268 5626 9269 -8714 -25439 -39994 -43892 -34979 -34255 -30589 -23377 -13578 -14870
7068a4870r903L794j8111N957l668j5189R889J4190J5263j8953J5361J8155j7844
$$ -14870 -24773 -20979 -39090 -33133 -36801 -51990 -42101 -27911 -12648 -31601 -16240 1915 -15929
7055a5929J2919O382j0931J5576J081k5512j8562J4826K1579J2104N263L230k203
$$ -15929 -3010 3372 -7559 8017 9098 -16414 -34976 -20150 1429 13533 18796 22026 19823
7042A9823k0198j1109j8301K590q39j9097P68K1219Q953j1832j6403K4983K0313
$$ 19823 -375 -11484 -29785 -27195 -28034 -47131 -46363 -25144 -16191 -28023 -44426 -19443 870
7029H70l279l724k232J646Q457J7448q454k0713q120q634j6426J1115J0840m547
$$ 870 -2409 -6133 -8365 -6719 1738 19186 10732 -9981 -18101 -26735 -43161 -32046 -21206 -25753
7015b5753N990J726p125J7700N253L661o937j9583l569k357n429O767N756R771
$$ -25753 -19763 -18037 -25162 -7462 -2209 1452 -5485 -25068 -28637 -30994 -36423 -29656 -23900 -14129
7001a4129o470M723N624o013j2046N334N285n085R911j3498Q339J240n28O116
$$ -14129 -20599 -15876 -10252 -16265 -28311 -22977 -17692 -22777 -12866 -26364 -18025 -16785 -17313 -11197
6987a1197N54j2743j3071p089k568J2097L632j969Q064J4746K101k437j0591R829
$$ -11197 -10643 -23386 -36457 -43546 -46114 -34017 -30385 -32354 -24290 -9544 -7443 -9880 -20471 -10642
6973a0642O913L456l216q703j085k984K627N06J0727K6011j2498j2194M038P722
$$ -10642 -3729 -273 -3489 -12192 -13277 -16261 -13634 -13128 -2401 23610 11112 -1082 2956 10678
6959A0678o380j3955O787J865k3092j9754K1512J6392O502j8122j6047J1722K8940
$$ 10678 4298 -9657 -2870 -1005 -24097 -43851 -22339 -5947 555 -17567 -33614 -21892 7048
6946G048Q569p100j474O244o450p874j1780j67l184o55J2261J9835N576j2870
$$ 7048 15617 8517 7043 13287 6837 -1037 -12817 -12984 -16168 -16823 -4562 15273 20849 7979
6932G979Q271J7578j6914j5882L098j446k6771K2699M058j0714j9957P276J0785
$$ 7979 16250 33828 16914 1032 4130 2684 -24087 -1388 2670 -8044 -28001 -20725 -9940
6919i940k962L143L0069L529j0450q464j8747J2543R872o251j6442n124K3136
$$ -9940 -12902 -9759 20310 23839 13389 4925 -13822 -1279 8593 2342 -14100 -19224 3912
6906C912R755k0621j8115J1631J1154j2823p402Q526j7418j0206Q935p203J6123
$$ 3912 13667 -6954 -25069 -13438 -2284 -15107 -22509 -13983 -31401 -41607 -32672 -39875 -23752
6893b3752j302M665J9017P674k2549j5850P464J5905O943m542P602j0213K112
$$ -23752 -25054 -20389 -1372 6302 -16247 -32097 -24633 -8728 -1785 -6327 1275 -8938 -6826
6880f826q207J742J2728r958J0683Q383J8528n13j7492k527j6371j8133J775M524
$$ -6826 -15033 -13291 -563 -10521 162 8545 27073 26560 9068 6541 -9830 -27963 -26188 -21664
6866b1664M215m920j0243N99Q852j6127j6818P466K6347R597m033j8747K53R790
$$ -21664 -17449 -22369 -32612 -32013 -23161 -39288 -56106 -48640 -22293 -12696 -16729 -35476 -35223 -25433
6852b5433O209L739M752m365J68R777j4329j2114Q870L319R594l702R865Q529
$$ -25433 -19224 -15485 -10733 -15098 -14930 -5153 -19482 -31596 -22726 -19407 -9813 -13515 -3650 4879
6838D879k839k5693k2252J1576r79Q996L361L017n815o768N237J1393J0299N621
$$ 4879 2040 -23653 -45905 -34329 -35308 -26312 -22951 -19934 -25749 -32517 -27280 -15887 -5588 33
6824C3J581L915j048J599o584l0108j4593j1670J1626K4559R611o933J5738L454
$$ 33 1614 5529 4481 6080 -504 -30612 -45205 -56875 -45249 -20690 -11079 -18012 -2274 1180
6810A180Q21j681j066p00J2848Q814j237L313j7567q619j956r650M973R651P714
$$ 1180 2001 320 -746 -1446 11402 20216 18979 22292 4725 -3894 -5850 -15500 -10527 -876 6838
6795F838j2049Q996l259r159j0601L268L24j6172L715L1821J4174j6271l109M219
$$ 6838 -5211 3785 526 -8633 -19234 -15966 -15642 -31814 -28099 3722 17896 1625 -1484 2735
6781B735j510j3126K230K360o072r20o200q390n413K0719L2753j3507R35N525
$$ 2735 1225 -11901 -9671 -7311 -13383 -14303 -20503 -28893 -34306 -13587 19166 5659 6594 12119
6767A2119J310m832j0780p571L807j510q420q111j017J8861J1160J2693K2058
$$ 12119 13429 8597 -2183 -9754 -5947 -7457 -15877 -23988 -25005 -6144 5016 17709 39767
6754C9767q230q902J0453L5129N1466L0082K9637N0441Q9377Q5470O8819l6604
$$ 39767 31537 22635 33088 68217 119683 149765 179402 229843 319220 404690 473509 436905
6742D36905j10606j24024p6616m3625k3870l3585k2117k2469m477Q266j491J439
$$ 436905 326299 202275 125659 82034 58164 24579 2462 -20007 -24484 -16218 -17709 -16270
6730a6270r564j089L395J4006N695J081K960N617N389K358O854j7193q362j3423
$$ -16270 -25834 -26923 -23528 -9522 -3827 -2746 214 5831 11220 13578 20432 3239 -5123 -18546
6716a8546J38R6Q054J7125K3334q066j1316k6975k3255O411J2258J58j518M029
$$ -18546 -18408 -18312 -10258 6867 30201 22135 10819 -16156 -39411 -33000 -20742 -20584 -22102 -18073
6702a8073m095j8190Q172Q246J4533K1218J1650k506j4297q842l042Q615l039
$$ -18073 -22168 -40358 -32186 -23940 -9407 11811 23461 20955 6658 -2184 -5226 3389 350
6689C50j8352j2293J3864N496J853N357N948j3741j2791o629j56j020r934j0706
$$ 350 -18002 -30295 -16431 -10935 -9082 -3725 2223 -11518 -24309 -30938 -31094 -32114 -42048 -52754
6675e2754J0246J1387J0153J593J2169N893l562j5295r260j439J2434K5564n990
$$ -52754 -42508 -31121 -20968 -19375 -7206 -1313 -4875 -20170 -29430 -30869 -18435 7129 1139
6662A139o628j364J1641L618j3671l620j498l838P209O95l604q95l025r60J6481
$$ 1139 -5489 -6853 4788 8406 -5265 -8885 -10383 -14221 -7012 -6317 -9921 -10816 -13841 -14801 1680
6647A680j3248J349N531j8262P217M723L753M789M681M370K884j47p581L557k414
$$ 1680 -11568 -10219 -4688 -22950 -15733 -11010 -7257 -2468 2213 6583 9467 9320 1739 5296 2882
6632B882r609j0525j4023O846r584m735O308K1999J0489J2215q20q681j1468p51
$$ 2882 -6727 -17252 -31275 -24429 -34013 -38748 -32440 -10441 48 12263 11443 2762 -8706 -9457
6618i457P040K103j0394p228R484J8417K693j2459k1508k8040J4067L1260k75
$$ -9457 -2417 -314 -10708 -17936 -8452 9965 12658 199 -21309 -49349 -35282 -4022 -4297
6605d297j4999j647O642p15M976K0044J0235j863L961l711o920r857j3953q949
$$ -4297 -19296 -20943 -14301 -15016 -10040 10004 20239 18376 22337 18626 11706 1849 -12104 -21053
6591b1053r89j1237J9622K4238q31k1408j3022J7202J4060r186k733P223J059
$$ -21053 -22042 -33279 -13657 10581 9750 -11658 -24680 -7478 6582 -2604 -5337 1886 2945
6578B945L26L870q032M912l191k0063J1707K0099p12k728L589K982j193j1056
$$ 2945 3271 7141 -891 4021 830 -19233 -7526 12573 11861 9133 12722 15704 14511 3455
6564C455j8220R354j685J3106j1437p336p830M807L332j420k1892o621Q874K5398
$$ 3455 -14765 -5411 -7096 6010 -5427 -12763 -20593 -15786 -12454 -13874 -35766 -42387 -33513 -8115
6550h115J1403j1555J0790P084q336l751J428j3714p751O995Q445K990p430K78
$$ -8115 3288 -8267 2523 9607 1271 -2480 -1052 -14766 -22517 -15522 -7077 -4087 -11517 -11239
6536a1239k841J1913J954p956j7312j206j296J3225K0798l3p022K234j092j7962
$$ -11239 -14080 -2167 -213 -8169 -25481 -26687 -27983 -14758 6040 6007 -1015 1219 127 -17835
6522a7835K107L160L702J5912P230k981j0026j4729J5486K0490p02j041J2794
$$ -17835 -15728 -12568 -8866 7046 14276 11295 1269 -13460 2026 22516 21814 20773 33567
6509C3567R330r556k9203k0582K751l635p037L06m628O683J2584j918N220j6129
$$ 33567 42897 33341 4138 -16444 -13693 -17328 -24365 -24059 -28687 -22004 -9420 -11338 -6118 -22247
6495b2247j1861J2042K0513K014k54j2837j0480Q77m672L046J0051J5385p292
$$ -22247 -34108 -22066 -1553 461 207 -12630 -23110 -22233 -26905 -23859 -13808 1577 -5715
6482e715j7870K718J3481J9266O58l102j3573q84n414l61P950J4383n962j6993
$$ -5715 -23585 -20867 -7386 11880 12538 9436 -4137 -5021 -10435 -10796 -2846 11537 5575 -11418
6468a1418o18J9280O588j319j0387J867l491k2670k932k638K328l759j745K958
$$ -11418 -12036 7244 13832 12513 2126 3993 502 -22168 -25100 -27738 -25410 -29169 -30914 -27956
6454b7956Q308J5666P967M64m771r111K930R451j6606n987n023m530J000o843
$$ -27956 -19648 -3982 3985 4449 -322 -9433 -6503 2948 -13658 -19645 -24668 -29198 -28198 -35041
6440c5041L9632L5344m556k1701n206j2008J674O892L687k0805j3188m811l532
$$ -35041 4591 39935 35379 13678 8472 -3536 -1862 5030 8717 -12088 -25276 -30087 -33619
6427c3619j4108m374l259K2711K1811R653P091Q507j3528m317k089J0268J5431
$$ -33619 -47727 -52101 -55360 -32649 -10838 -1185 5906 14413 885 -3432 -5521 4747 20178
6414B0178p483R415J2171K3932k5963m9525j994m77R980k20j2179J8937P550j3808
$$ 20178 12695 22110 34281 58213 32250 -17275 -19269 -19746 -9766 -9986 -22165 -3228 4322 -9486
6400i486N879J393K1022K759p79J8023j5535r503l174l684o01p181m40p01m283
$$ -9486 -3607 -2214 18808 21567 20788 38811 23276 13773 10599 6915 6314 -867 -1307 -2008 -6291
6385f291l1901j0103K9700K3467J0721j1855k4273j9350j039K8910Q899j6257
$$ -6291 -38192 -48295 -18595 4872 15593 3738 -20535 -39885 -40924 -12014 -3115 -19372
6373a9372J826P879o287n279P223j835J4415N972r567N243J7115q593j1744q157
$$ -19372 -17546 -9667 -15954 -21233 -14010 -15845 -1430 4542 -5025 218 17333 8740 -3004 -11161
6359a1161n834J4114n778p072J3099M135j5199N553L636r652o624K1480K9056
$$ -11161 -16995 -2881 -8659 -15731 -2632 1503 -13696 -8143 -4507 -14159 -20783 697 29753
6346B9753P237Q338j2368j1958k703l230Q15k1888K1052J9137j4373l4640k0166
$$ 29753 36990 45328 32960 21002 18299 15069 15884 -6004 15048 34185 19812 -14828 -34994
6333c4994R399J0738K233K857J4421P814J289Q867O665j67j5937j1028k7275J150
$$ -34994 -25595 -14857 -12624 -9767 4654 12468 13757 22624 29289 29122 13185 2157 -25118 -23968
6319b3968R621J1861N135Q659J4448K2564r226j3436r317k7201q436k880p361
$$ -23968 -14347 -2486 2649 11308 25756 48320 39094 25658 16341 -10860 -19296 -22176 -29537
6306b9537O023K2976O655K555p29k782p652j6270j4000J4022M100r897P574J554
$$ -29537 -23514 -538 6117 8672 7943 5161 -2491 -18761 -32761 -18739 -14639 -24536 -16962 -15408
6292a5408j4678J4413O460J970j122j6192o189Q196q754O879J4598J6544J3814
$$ -15408 -30086 -15673 -9213 -7243 -8365 -24557 -30746 -22550 -31304 -24425 -9827 6717 20531
6279B0531P950k9567j2617k248K930p413L315R015k763j1175M830J829m397m904
$$ 20531 28481 -1086 -13703 -15951 -13021 -20434 -17119 -8104 -10867 -22042 -17212 -15383 -19780 -24684
6265b4684J4552L8528L470k885l376k1276J728j3732j1674j5725o530J6779j646
$$ -24684 -10132 28396 31866 28981 25605 4329 6057 -7675 -19349 -35074 -41604 -24825 -26471
6252b6471m444J455J0413o623R072O221P737J1513J2752p577j4871j0996k3542
$$ -26471 -30915 -29460 -19047 -25670 -16598 -10377 -2640 8873 21625 14048 -823 -11819 -35361
6239c5361J3025N794k058J9042J0210j0208k2197l886K044Q973j2740k046N227
$$ -35361 -22336 -16542 -18600 442 10652 444 -21753 -25639 -23595 -14622 -27362 -29408 -24181
6226b4181N693M318P653J2324k909j1311L595J1328P8O085K014J1077K944j2105
$$ -24181 -18488 -14170 -6517 5807 2898 -8413 -4818 6510 6588 12673 14687 25764 28708 16603
6212A6603m626L357r158j7654l08j5257K9871o45j5908J2921K9567l373j5850
$$ 16603 11977 15334 6176 -11478 -11786 -27043 2828 2183 -13725 -804 28763 25390 9540
6199I540j8004j0551K656J3092J2367j0836M600J0717j7187P74m902J2678m158
$$ 9540 -8464 -19015 -16359 -3267 9100 -1736 2864 13581 -3606 -2832 -7734 4944 786
6186G86M50J4627j587m0263k4660J2723J8310J6299K2709j7466m067q504N01L904
$$ 786 1236 15863 14276 -25987 -50647 -37924 -19614 -3315 19394 1928 -2139 -10643 -10142 -6238
6172f238J89J982m547j3686p484J6225J9779o699o955R747M376p039j3043J396
$$ -6238 -6049 -4067 -8614 -22300 -29784 -13559 6220 -479 -7434 2313 6689 -350 -13393 -11997
6158a1997J3104R223J4035J776j4834n326m636n104J4965J0147j0153j1687M275
$$ -11997 1107 10330 24365 26141 11307 5981 1345 -3759 11206 21353 11200 -487 3788
6145C788J8987m59k0983k3375r630L180K9896j7459r51N887J1091k899j2985r743
$$ 3788 22775 22316 1333 -22042 -31672 -28492 1404 -16055 -17006 -11119 -28 -2927 -15912 -25655
6131b5655r138R581l698J174j821J7249n659k3206K401L6039K0334j7515n031
$$ -25655 -34793 -25212 -28910 -27736 -29557 -12308 -17967 -41173 -38772 -2733 17601 86 -4945
6118d945J0584L154j7285l4J0416K0366o747k2313j3416q503L164p422j2463O873
$$ -4945 5639 8793 -8492 -8526 1890 22256 15509 -6804 -20220 -28723 -25559 -32981 -45444 -38571
6104c8571J7652J9117k0165M960L5605J793j0674P033n7r605j2079J073j061r046
$$ -38571 -20919 -1802 -21967 -17007 18598 20391 9717 16750 16693 7088 -4991 -3918 -4979 -14025
6090a4025k508P118N405p5r251J781J731m2Q186K7125j790l3468j5973J4678n737
$$ -14025 -16533 -9415 -4010 -4085 -13336 -11555 -9824 -9866 -1680 25445 23655 -9813 -25786 -11108 -16845
6075a6845J3982j219j0258P984q7R432r211j9810R85N203P019n39k1444J346O969
$$ -16845 -2863 -4082 -14340 -6356 -6443 2989 -6222 -26032 -25047 -19844 -12825 -13364 -34808 -33462 -26493
6060b6493j3130R204L083j445K475O508J1419P89J0393m742P324J2184l79k131
$$ -26493 -39623 -30419 -27336 -28781 -26306 -19798 -8379 -7590 2803 -1939 5385 17569 17190 15059
6046A5059J5438k0245k0048l913k51J6592N731j6763j0578J3005J4794J4952j1124
$$ 15059 30497 10252 -9796 -13709 -13960 2632 8363 -8400 -18978 -5973 8821 23773 12649
6033A2649j2761j6864J8541O711q655q26p504P981P267J8620j909Q527l763k773
$$ 12649 -112 -16976 1565 8276 -379 -1205 -8709 -728 6539 25159 23250 31777 28014 25241
6019B5241N17j0062j0335r844N986J6462j2867R082j6073l772N743j2489o124
$$ 25241 25758 15696 5361 -4483 1503 17965 5098 14180 -1893 -5665 78 -12411 -18535
6006a8535m00K0011j3857J6416L800k694J0343j8000L54Q70o687n318m194J5304
$$ -18535 -18935 1076 -12781 3635 7435 4741 15084 -2916 -2562 -1692 -8379 -13697 -17891 -2587
5992b587P494K954n022N281P735r685J3181j3397p065J4529r534R896L816k0020
$$ -2587 4907 7861 2839 8120 15855 6170 19351 5954 -1111 13418 3884 13780 17596 -2424
5978b424J079L243j7677k245N220J4955k267k1577n363K084R330J8396J0859O422
$$ -2424 -1345 1898 -15779 -18024 -12804 2151 -116 -21693 -27056 -24972 -15642 2754 13613 20035
5964B0035L055j701J35N987k661K018k1493k399k135j2697r213p629J6385K3597
$$ 20035 23090 21389 21524 27511 24850 26868 5375 2976 841 -11856 -21069 -28698 -12313 11284
5950A1284J5j9959j5179k780M201J4318J1069K458P08J4280r290r881J1311J4888
$$ 11284 11299 -8660 -23839 -26619 -22418 -8100 2969 5427 6135 20415 11125 1244 12555 27443
5936B7443p830j2258J1552j3975k2313Q670L092L310J4095k058j3444o977M612
$$ 27443 19613 7355 18907 4932 -17381 -8711 -5619 -2309 11786 9728 -3716 -10693 -6081
5923f081j3473l462J3112P423l684Q094N304q197j8248O178J0623o122m207N129
$$ -6081 -19554 -23016 -9904 -2481 -6165 1929 7233 -964 -19212 -13034 -2411 -8533 -12740 -7611
5909g611Q112j4039j3106K779K7039P208m132K819m556J655R495K0076j5189k498
$$ -7611 501 -13538 -26644 -23865 3174 10382 6250 9069 4513 6168 15663 35739 20550 18052
5895A8052M297J0951P09j4247j5151o097Q74J445J9060K448j069l280k708p715
$$ 18052 22349 33300 34009 19762 4611 -1486 -612 833 19893 22341 21272 17992 15284 7569
5881G569r35k640n467j0994k985J0871K080K917J9538M396O292j1532p719j2417
$$ 7569 6634 3994 -1473 -12467 -15452 -4581 -2501 416 19954 24350 30642 19110 11391 -1026
5867a026j513m561q482L076P484N567M720P457n283m308p663j8175L36R130M434
$$ -1026 -2539 -7100 -15582 -12506 -5022 545 5265 12722 7439 3131 -4532 -22707 -22371 -13241 -8807
5852h807J6636P072m281o039O309k863L833J410r245J528K730l821J0115N903
$$ -8807 7829 14901 10620 4581 10890 8027 11860 13270 4025 5553 8283 4462 14577 20480
5838B0480j3978j192J059k0596r22R322j0026N906J0811R618n246Q117K0292p492
$$ 20480 6502 5310 6369 -14227 -15149 -5827 -15853 -9947 864 10482 5236 13353 33645 26153
5824B6153l2290j8691J8626K9001J473j538j213j554k2154j801J0768P763O995
$$ 26153 -6137 -24828 -6202 22799 24272 22734 21521 19967 -2187 -3988 6780 14543 21538
5811B1538J13j6926J2905J3602O773q900l852j2170j3230L040J0064J7579j0711
$$ 21538 21651 4725 17630 31232 38005 29105 25253 13083 -147 2893 12957 30536 19825
5798A9825j3602J330N916r807k8351j4993L321J2648J8158N705l803n044Q319
$$ 19825 6223 7553 13469 3662 -24689 -39682 -36361 -23713 -5555 150 -3653 -8697 -378
5785c78Q906P365L846k1285k4252j827P230Q319j0485M350P71l347K761j404j978
$$ -378 8528 15893 19739 -1546 -25798 -27625 -20395 -12076 -22561 -18211 -17440 -20787 -18026 -19430 -21408
5770b1408p325O924j46n131J4861N125o100J1780n662j5663k612L909K6152l349
$$ -21408 -28733 -21809 -21955 -27086 -12225 -7100 -13200 -1420 -7082 -22745 -25357 -21448 4704 1355
5756A355m572r310j1108N406K1776J4075m199j447R840j7538m697n019m18k4279
$$ 1355 -3217 -12527 -23635 -18229 3547 17622 13423 11976 21816 4278 -419 -5438 -5856 -30135
5742c0135J291k07J675p669J1162K9165L925P585j1956O469r192j0505r325n530
$$ -30135 -28844 -29051 -27376 -35045 -23883 5282 9207 16792 4836 11305 2113 -8392 -17717 -23247
5728b3247K2345J4365r878J7374J0770k668k52n612j104l701r740J5420n803J7393
$$ -23247 -902 13463 3585 20959 31729 29061 28809 23197 22093 18392 8652 24072 18269 35662
5714C5662l185j2335n627k0217J2102O939J7951K1031o587k4603k8241j6389J733
$$ 35662 32477 20142 14515 -5702 6400 13339 31290 52321 45734 21131 -7110 -23499 -21766
5701b1766P827M815K442m098R239J4498o795j2146O579P722Q61J5692J225l896
$$ -21766 -13939 -9124 -6682 -10780 -1541 12957 6162 -5984 595 8317 9178 24870 26095 22199
5687B2199l795M905o313j6996j1585R512j898R828J1628j9898J4128J6574n601
$$ 22199 18404 23309 16996 0 -11585 -2073 -3971 5857 17485 -2413 11715 28289 22688
5674B2688o014n737l917l248J676j5697j0188j25K199N359J6016K6011Q233m88
$$ 22688 16674 10937 7020 3772 5448 -10249 -20437 -20562 -18363 -13004 3012 29023 37256 36768
5660C6768k587J0582Q13k043n520k0773P524p910r848l070j6656j1184P235m481
$$ 36768 34181 44763 45576 43533 38013 17240 24764 16854 7006 3936 -12720 -23904 -16669 -21150
5646b1150J1027J158r791n791n397J0205J3140K468k5194j128K5881j431M55R778
$$ -21150 -10123 -8965 -18756 -24547 -29944 -19739 -6599 -4131 -29325 -30453 -4572 -6003 -5548 4230
5632D230j3963j6231J1630P960j1407j9290k792Q671m087J5668L3986n66o748
$$ 4230 -9733 -25964 -14334 -6374 -17781 -37071 -39863 -31192 -35279 -19611 14375 13809 7061
5619G061r524r2p312R8L174M576j9944P007R890J1791n147N915n248j5487j5622
$$ 7061 -2463 -2555 -9867 -9769 -6595 -2019 -21963 -14956 -5066 6725 1578 7493 2245 -13242 -28864
5604b8864r256K426j438L394O425j746J4689K1916N783J5209k3099j0155N054
$$ -28864 -38120 -35694 -37132 -33738 -27313 -29059 -14370 7546 13329 28538 5439 -4716 338
5591C38o44R832J824j1437j0512J5061M330q119j1657L1880J2738k0629j2468
$$ 338 -306 9526 11350 -87 -10599 4462 8792 673 -10984 20896 33634 13005 537
5578E37j3223K740k758M426J6282n089M581P539j5973j4207O213p421l091l567
$$ 537 -12686 -9946 -12704 -8278 8004 2915 7496 15035 -938 -15145 -8932 -16353 -19444 -23011
5564b3011Q34N795M994j3104j1051L0514J4460j7180j385j173j8936Q523K2804
$$ -23011 -22177 -16382 -11388 -24492 -35543 -5029 9431 -7749 -9134 -10307 -29243 -20720 2084
5551B084J6074k7501r406L6560m43j1679j409J4629J224j1312k1913j5787O609
$$ 2084 18158 -9343 -18749 17811 17368 5689 4280 18909 20133 8821 -13092 -28879 -22270
5538b2270J2181k968J708Q950j1598k966K94N01J4145M698l715L216j2855k876
$$ -22270 -10089 -13057 -11349 -2399 -13997 -16963 -16669 -16168 -2023 2675 -1040 2176 -10679 -13555
5524a3555J4318k978n80M630J066N826O574j786L754j5021M132j4463J2096n72
$$ -13555 763 -2215 -2795 1835 2901 8727 15301 13515 17269 2248 6380 -8083 4013 3441
5510C441q494R03j3590k122J2427j2438r258J5533j870L648n832P461k94O358
$$ 3441 -5053 -4150 -17740 -19862 -7435 -19873 -29131 -13598 -15468 -11820 -17652 -10191 -10485 -4127
5496d127N144K0246K3408l918k2570j6719k049K062J865j0721j714o069o730M023
$$ -4127 1017 21263 44671 40753 18183 1464 -585 1477 3342 -7379 -9093 -15162 -21892 -17869
5482a7869O376J599j3098j0174n40Q562K1852j486j1902R953J1516O356r326L672
$$ -17869 -11493 -9894 -22992 -33166 -33706 -25144 -3292 -4778 -16680 -6727 4789 11145 1819 5491
5468E491q44k791l512k6531Q482j739J9932J2866j6279N559K287j0319J5898J2965
$$ 5491 4647 1856 -1656 -28187 -19705 -21444 -1512 11354 -4925 634 2921 -7398 8500 21465
5454B1465j728m109M893j2525l703M930k1376l069R158r690P528J3051k94k089
$$ 21465 19737 15628 20521 7996 4293 9223 -12153 -15222 -6064 -15754 -8226 4825 4531 2442
5440B442J1731M143M124o86k630K40p983p186j1566j9053L297J0775K3938k249
$$ 2442 14173 18316 22440 21754 19124 19364 11381 4195 -7371 -26424 -23127 -12352 11586 9337
5426I337p58p75O256J0892j911r211k472r699p213O361m986K2409K2404j8185
$$ 9337 8579 7804 14060 24952 23041 13830 11358 1659 -5554 807 -4179 18230 40634 22449
5412B2449r560k6492R35L569m234M37J763m126R591J5886J2436J825n934k2336
$$ 22449 12889 -13603 -12668 -9099 -13333 -12896 -11133 -15259 -5668 10218 22654 24479 18545 -3791
5398c791p424m244K313O170M508j4024j0659K4528K5212Q553o312q302m690j2236
$$ -3791 -11215 -15459 -13146 -6976 -2468 -16492 -27151 -2623 22589 31142 24830 16528 11838 -398
5384c98k250L060Q784n477m858k232J1749J0179q369k8198o791K553N193J4695
$$ -398 -2648 412 9196 3719 -1139 -3371 8378 18557 10188 -18010 -24801 -22248 -17055 -2360
5370b360L695r19P9j3990J620L837J6862K0421L672j5763M954j2846n471k2512
$$ -2360 1335 416 495 -13495 -11875 -8038 8824 29245 32917 17154 22108 9262 3791 -18721
5356a8721N036J5135p739j7685j2982M531Q235r437K2882J4286L434p371P399
$$ -18721 -13685 1450 -6289 -23974 -36956 -32425 -24190 -33627 -10745 3541 6975 -396 7003
5343G003K9659J1942j6430j7995R05k396l516M045O249j5812p266J1006J2147
$$ 7003 36662 48604 32174 14179 15084 12688 9172 13217 19466 3654 -3612 7394 19541
5330A9541J0307K982j5053l2242k3378M642J1729k595J3072J3001L892l913p801
$$ 19541 29848 32830 17777 -14465 -37843 -33201 -21472 -24067 -10995 2006 5898 1985 -5816
5317e816M931j8059j035Q339j1703q971K483l255m218K0978L0250l570r599k262
$$ -5816 -885 -18944 -19979 -11640 -23343 -32314 -29831 -33086 -37304 -16326 13924 10354 755 -1507
5303a507j5662o01J9737O043o124L541J935p857r24K391J2178j5289k8871R616
$$ -1507 -17169 -17770 1967 8010 1886 5427 7362 -495 -1419 972 13150 -2139 -31010 -21394
5289b1394o005j2674J006N844J2867J4612J3176j602J7381R391r780n079r02k3815
$$ -21394 -27399 -40073 -39067 -33223 -20356 -5744 7432 5830 23211 32602 22822 17743 16841 -6974
5275f974k2919J6754N303J3232j494K640o661j1209j4244J9124J1509P083J7517
$$ -6974 -29893 -13139 -7836 5396 3902 6542 -119 -11328 -25572 -6448 5061 12144 29661
5262B9661m288j4843j2076o657l389J0987J4752M100j6902j694j111N828Q395
$$ 29661 25373 10530 -1546 -8203 -11592 -605 14147 18247 1345 -349 -1460 4368 12763
5249A2763r540m548J2009q767j875P706L881m439Q70k412L435J7735j9064n559
$$ 12763 3223 -1325 10684 1917 42 7748 11629 7190 8060 5648 9083 26818 7754 2195
5235B195r26L008J060j907j6239j1777O235R394J9777L1943j0206j8033j4513
$$ 2195 1269 4277 5337 3430 -12809 -24586 -18351 -8957 10820 42763 32557 14524 11
5222A1P482Q522O426j4992K239j0576J530r9o006Q296m50j46K954j1979j0487
$$ 11 7493 16015 22441 7449 9688 -888 642 543 -5463 2833 2383 2237 5191 -6788 -17275
5207a7275j848l496J95j1274m405R605N093J2356J1580P570o39k8577k3738P046
$$ -17275 -19123 -22619 -22424 -33698 -38103 -28498 -23405 -11049 531 8101 7462 -21115 -44853 -37807
5193c7807J6962J8792j0655O225J2024R505j6197j3462Q135J1641M923Q637M838
$$ -37807 -20845 -2053 -12708 -6483 5541 15046 -1151 -14613 -6478 5163 10086 18723 23561
5180B3561j1973k3100L77J3801K272O97j695J8609p004k489R377M82J37j1273
$$ 23561 11588 -11512 -11135 2666 4938 5635 3940 22549 15545 13056 22433 22915 23052 11779
5166A1779k0292j0821J0410J5235l723j7368K764K3135J3101q369O666n987j5112
$$ 11779 -8513 -19334 -8924 6311 2588 -14780 -12016 11119 24220 15851 22517 16530 1418
5153A418p463L3192J7013j2239j9404r258P532p07N613j2294n369p675J343J3263
$$ 1418 -6045 27147 44160 31921 12517 3259 10791 10084 15697 3403 -1966 -9641 -8298 4965
5139D965l357r521K617J5281q546j3817r08J6133J822r745o164l332J4245J597
$$ 4965 1608 -7913 -5296 9985 1439 -12378 -13286 2847 4669 -5076 -11240 -14572 -327 1270
5125A270k427O164J0213J335j4967m438j823j3770j208N332N863M545J0109L174
$$ 1270 -1157 5007 15220 16555 1588 -2850 -4673 -18443 -19651 -14319 -8456 -3911 6198 9372
5111I372r255J5338L542m480j7223j3453J6832n657o867J0943n571o687k340j1024
$$ 9372 117 15455 18997 14517 -2706 -16159 673 -4984 -11851 -908 -6479 -13166 -15506 -26530
5097b6530J1999R419J251Q766J2580l273j2255n286R678J245L061j0537k833N896
$$ -26530 -14531 -5112 -3861 4905 17485 14212 1957 -3329 6349 7594 10655 118 -2715 3181
5083C181R145p197o712q037j0034m70J0393J2542J3575n93j1053r148P724k0824
$$ 3181 12326 5129 -1583 -9620 -19654 -20124 -9731 2811 16386 15793 4740 -4408 3316 -17508
5069a7508k0792K1881J8136J547j1755r187q040K0281K5554k719P73j3914o923
$$ -17508 -38300 -16419 1717 3264 -8491 -17678 -25718 -5437 20117 17398 18171 4257 -2666
5056b666n449J9682M08j7941j1164J0043J8416L828J8622J3734j4440k5274j1156
$$ -2666 -8115 11567 11975 -5966 -17130 -7087 11329 15157 33779 47513 33073 7799 -3357
5043c357J3901P37j8997M516on329l823J2706k016j0095j0755J945J8519j1696
$$ -3357 10544 11281 -7716 -3200 -3206 -8535 -12358 348 -1668 -11763 -22518 -20573 -2054 -13750
5029a3750J4606J7122l622j2575L235j6670R584J7698j3175j0546m031R026j547
$$ -13750 856 17978 14356 1781 5016 -11654 -2070 15628 2453 -8093 -12124 -3098 -4645
5016d645j640J8142J1704j30p769k6765j0986J5975P433p293j4820P334q964J0621
$$ -4645 -6285 11857 23561 23431 15662 -11103 -22089 -6114 1319 -5974 -20794 -13460 -22424 -11803
5002a1803J4889J8418K0016o102j8433j8571P534k1018J1024K1031P511k1859
$$ -11803 3086 21504 41520 35418 16985 -1586 5948 -15070 -4046 16985 24496 2637
4990B637j1558Q192J8560J3965m64j8889j0390j3670J4308r936j2299n63J3604
$$ 2637 -8921 -729 17831 31796 31332 12443 2053 -11617 2691 -7245 -19544 -20107 -6503
4977f503J548j1406p189K3308J2329l20K399l875j4027o396J0022K3643J8695
$$ -6503 -4955 -16361 -23550 -242 12087 11767 14166 10291 -3736 -10132 -110 23533 42228
4964D2228J346n591j9749k3468L285J5293j149r347K343n944m895O151j1379l774
$$ 42228 43574 37983 18234 -5234 -1949 13344 12195 2848 5191 -753 -5648 503 -10876 -14650
4950a4650J5925Q076r549o880m83J1097J4081j3382j988m179J1739M148m600p840
$$ -14650 1275 9351 -198 -7078 -7561 3536 17617 4235 2247 -1932 9807 13955 9355 1515
4936A515k2218o32J3285P977L290J35K962j0915j0982M726j0594p856Q737J2228
$$ 1515 -20703 -21335 -8050 -73 3217 3352 6314 -4601 -15583 -10857 -21451 -29307 -20570 -8342
4922h342m904j9784j4285P421N730P475m942J8753J3106k3128p819J3327J1930
$$ -8342 -13246 -33030 -47315 -39894 -34164 -26689 -31631 -12878 228 -22900 -30719 -17392 -5462
4909e462k82J6213j001j0060m733p865N853P006j686j8732o538n567J5426J4134
$$ -5462 -5744 10469 9468 -592 -5325 -13190 -7337 -331 -2017 -20749 -27287 -32854 -17428 -3294
4895c294M286L180p513j4299L737J8565J2773K033q915K073j3987k2550j2327
$$ -3294 992 4172 -3341 -17640 -13903 4662 17435 19468 10553 12626 -1361 -23911 -36238
4882c6238J4060Q321P357K0136j2368J194j5861k4612J4090J6665P960k253N870
$$ -36238 -22178 -13857 -6500 13636 1268 2462 -13399 -38011 -23921 -7256 704 -1549 4321
4869D321J6639J0018O77k245p239P405O50l5049M299J1809r594j2254j3414N439
$$ 4321 20960 30978 31655 29410 22171 29576 30226 -4823 -524 11285 1691 -10563 -23977 -18538
4855a8538J3689K387j1788O163J1038J8253J0039l921l2203p527J6873K3464N983
$$ -18538 -4849 -2462 -14250 -8087 2951 21204 31243 27322 -4881 -12408 4465 27929 33912
4842C3912k557k573j1477j5050k2029N525L450R394J1560J7534J0410k1899J474
$$ 33912 31355 28782 17305 2255 -19774 -14249 -10799 -1405 10155 27689 38099 16200 17674
4829A7674Q53Q583j0700j4908j0891j7966J3373M966O673J2123J117K401Q527
$$ 17674 18527 27110 16410 1502 -9389 -27355 -13982 -9016 -2343 9780 10897 13298 21825
4816B1825q652k1286j1415O455J3799k009J2548M136j4015k737n467q475O308
$$ 21825 13173 -8113 -19528 -13073 726 -1283 11265 15401 1386 -1351 -6818 -15293 -8985
4803h985n880j6807J7005J6161M179O876J7143n328j4909m253L730j4058P910
$$ -8985 -14865 -31672 -14667 1494 5673 12549 29692 24364 9455 5202 8932 -5126 2784
4790B784p182r229l675N269O042l84j7464j9552n67O534J1677L364j0707Q132
$$ 2784 -4398 -13627 -17302 -12033 -5991 -6375 -23839 -43391 -43958 -37424 -25747 -22383 -33090 -24958
4776b4958J7261P17n202m641q66j0746L675O440J3828J4667m827j9186L17O248
$$ -24958 -7697 -6980 -12182 -16823 -17689 -28435 -24760 -18320 -4492 10175 5348 -13838 -13521 -7273
4762g273Q505m49j6745J1924L4024m146m646p475j0679j0660k351J3463n369l278
$$ -7273 1232 783 -15962 -4038 29986 25840 21194 13719 3040 -7620 -9971 3492 -1877 -5155
4748e155J0805m614o002p753R157J1261K550q915Q79j547j7054j906j104k956
$$ -5155 5650 1036 -4966 -12719 -3562 7699 10249 1334 2213 666 -16388 -18294 -19398 -22354
4734b2354j5047R733K3143k153k3174r834K0134J2878R569Q851l302j5719j7556
$$ -22354 -37401 -27668 -4525 -6678 -29852 -39686 -19552 -6674 2895 11746 8444 -7275 -24831
4721b4831r093J4001Q714J275p894Q797o254j819N323J0839Q176J3418o703j2826
$$ -24831 -33924 -19923 -11209 -9934 -17828 -9031 -15285 -17104 -11781 -942 7234 20652 13949 1123
4707A123Q5J2576k714n598O430L495N312k580M204L774k6574k8867o153J2457
$$ 1123 1208 13784 11070 5472 11902 15397 20709 18129 22333 26107 -467 -29334 -35487 -23030
4693b3030L2543j18m688j2037r333J9724K4197Q943j3094p782j4600j4343K815
$$ -23030 9513 9395 4707 -7330 -16663 3061 27258 36201 23107 15325 725 -13618 -10803
4680a0803p317k0498n270J1556P441J4282j2499J9921K2668R009N97j6796r945
$$ -10803 -18120 -38618 -43888 -32332 -24891 -10609 -23108 -3187 19481 28490 29087 12291 2346
4667B346j100Q404j2758r621j4450P276p504K039J2473n836J916M961K3951R930
$$ 2346 1246 9650 -3108 -12729 -27179 -19903 -27407 -25368 -12895 -18731 -16815 -11854 12097 22027
4653B2027o736m482j1441J1664J1062j5687j0012j812J6327J3245j5868j3969
$$ 22027 15291 10809 -632 11032 22094 6407 -3605 -5417 10910 24155 8287 -5682
4641e682m600M589k346k663K000M67M413j6573J6036P577n571j4530N834M941
$$ -5682 -10282 -5693 -8039 -10702 -8702 -8235 -3822 -20395 -4359 3218 -2353 -16883 -11049 -6108
4627f108M38p732O381J6293K4840j529j2870m521o224l607M205m919j0821j1705
$$ -6108 -5670 -13402 -7021 9272 34112 32583 19713 15192 8968 5361 9566 4647 -6174 -17879
4613a7879J3437r486L80K1520J3537p336K0642n358j3006k003q439m798J2329
$$ -17879 -4442 -13928 -13548 7972 21509 14173 34815 29457 16451 14448 6009 1211 13540
4600A3540Q890j6200j5522J3948K4444K805J3561R72k0238j3574q972q822m959
$$ 13540 22430 6230 -9292 4656 29100 31905 45466 46438 26200 12626 3654 -5168 -10127
4587a0127L47J240j1658J3154K8954p185j2349o658J2591n335m433j7669n405
$$ -10127 -9780 -8540 -20198 -7044 21910 14725 2376 -4282 8309 2974 -1459 -19128 -24533
4574b4533J4106J8506n76p120K915M969l8k294Q959j003o839k728J1539n893j1157
$$ -24533 -10427 8079 7503 383 3298 8267 8229 5935 14894 13891 7052 4324 15863 9970 -1187
4559a187j1204L136J0611j2770p742j6104Q383K356O938L786N206k2650j4728
$$ -1187 -12391 -9255 1356 -11414 -19156 -35260 -26877 -24521 -17583 -13797 -8591 -31241 -45969
4546d5969k627J0218K685J4090K214J2900L1573p259j3563j9621j760K7979P079
$$ -45969 -48596 -38378 -35693 -21603 -19389 -6489 25084 17825 4262 -15359 -17119 10860 17939
4533A7939J872j2007r34j3796q549P922m639p187O488K7011Q268n759p876M503
$$ 17939 19811 7804 6870 -6926 -15475 -7553 -12192 -19379 -12891 14120 22388 16629 8753 13256
4519A3256l584k791K71L678p093j4047k52K637k755M811p770M729j2776L103J2470
$$ 13256 9672 6881 7152 10830 3737 -10310 -10562 -7925 -10680 -5869 -13639 -8910 -21686 -18583 -6113
4504f113j7697P920J9817K690r192Q753J629J3250J1971j1187k3171j8741K357
$$ -6113 -23810 -15890 3927 6617 -2575 6178 7807 21057 33028 21841 -1330 -20071 -17714
4491a7714J6106J299j2432K597m634k864J8712J0231p627R157Q980n515j5550
$$ -17714 -1608 -309 -12741 -10144 -14778 -17642 1070 11301 3674 12831 21811 16296 746
4478G46k608Q124m662L588j8655j2670k7K2300K0841n552o833j639R369m064R1
$$ 746 -1862 6262 1600 5188 -13467 -26137 -26164 -3864 16977 11425 4592 2953 12322 8258 8349
4463H349n712K5532J6225J0408j5953l5045m721o214N467m325L502n886k3096
$$ 8349 2637 28169 44394 54802 38849 3804 -917 -7131 -1664 -5989 -2487 -8373 -31469
4450c1469J0091Q155J043j2052R216j0910Q234J5355M179l435k931J4373R511
$$ -31469 -21378 -13223 -12180 -24232 -15016 -25926 -17692 -2337 1842 -1593 -4524 9849 19360
4437A9360k0278j7156j5152M75k389O154K3573l832J1668P294k684j2590N322
$$ 19360 -918 -18074 -33226 -32751 -35140 -28986 -5413 -9245 2423 9717 7033 -5557 -235
4424b35M110P723Q824r035m295M46l257j864J2902j377j3585k736m687J4418m68
$$ -235 3875 11598 20422 11387 7092 7538 4281 2417 15319 13942 357 -2379 -7066 7352 6884
4409F884o97l221m458R173P427q500o143L646q250j8673k022O229K1340p122K913
$$ 6884 6187 2966 -1492 7681 15108 6608 465 4111 -4139 -22812 -24834 -18605 2735 -4387 -1474
4394a474J4009q72L751j2504r199O170J8607M566J2610q635j1260n114K3733K3194
$$ -1474 12535 11663 15414 2910 -6289 -119 18488 23054 35664 27029 15769 10655 34388 57582
4380E7582k4332k78R574k1583k2242M989K5599j3298J509P394j0372j7563Q128
$$ 57582 33250 32972 42546 20963 -1279 3710 29309 16011 17520 24914 14542 -3021 5107
4367E107n522r679N616J0544j3246L585J4055J9049j5220q245k336m755M932k206
$$ 5107 -415 -10094 -4478 6066 -7180 -3595 10460 29509 14289 6044 3708 -1047 3885 1679
4353A679q886l76R106K950j4086K0491l250m416J0674K095l055o565R853n68O975
$$ 1679 -7207 -7583 1523 4473 -9613 10878 7628 3212 13886 15981 12926 6361 16214 15646 22621
4338B2621K854j798k2686j4032q555j1027m882Q419J1536K719O98P634N262n219
$$ 22621 25475 23677 991 -13041 -21596 -32623 -37505 -29086 -17550 -14831 -14133 -6499 -1237 -6456
4324f456O52k616p893O766k619k715J232O55k656q237J5519q38P270j2914J1763
$$ -6456 -5804 -8420 -16313 -9547 -12166 -14881 -13649 -12994 -15650 -23887 -8368 -9206 -1936 -14850 -3087
4309c087J5700R719o700j9054p171j371O394L626p635J5319P496Q206J6486k3185
$$ -3087 12613 22332 15632 -3422 -10593 -11964 -5570 -1944 -9579 5740 13236 21442 37928 14743
4295A4743m5613l76J0722P978J2515k040j8715R709M181K663o312l376K7735J2732
$$ 14743 -30870 -31246 -20524 -12546 -31 -2071 -20786 -11077 -6896 -4233 -10545 -13921 13814 26546
4281B6546M352p684m029k239K534M312j4940k612J0432J8304k3912j6957k0208
$$ 26546 30898 23214 19185 16946 19480 23792 8852 6240 16672 34976 11064 -5893 -26101
4268b6101j0236K8846J1391n262r839J368N579M592J0348j713k6276j6176L0937
$$ -26101 -36337 -7491 3900 -1362 -11201 -9833 -4254 338 10686 8973 -17303 -33479 -2542
$$ [...]
##END NTUPLES=NMR SPECTRUM
##END=
