##TITLE=Analysis number 330100
Compound Code cc 64204
Book Reference 467/198/10
Project Code adrs
Chemist Name benw
##JCAMPDX= 6.0         $$ Bruker NMR JCAMP-DX V2.0
##DATA TYPE= NMR SPECTRUM
##DATA CLASS= NTUPLES
##ORIGIN= Bruker BioSpin GmbH
##OWNER= nmr
$$ XWIN-NMR		Version 3.5
$$ Mon Oct 29 09:49:12 2007 GMT Standard Time (UT+0h)  MAYBRIDGE\nmr@NMR_250MHZ
##.OBSERVE FREQUENCY= 250.131544655141
##.OBSERVE NUCLEUS= ^1H
##.ACQUISITION MODE= SIMULTANEOUS (DQD)
##.ACQUISITION SCHEME= undefined
##.AVERAGES= 16
##.DIGITISER RES= 18
##SPECTROMETER/DATA SYSTEM= dpx250
##.PULSE SEQUENCE= zg30
##.SOLVENT NAME= CDCl3
##.SHIFT REFERENCE= (INTERNAL, CDCl3, 0, 16.522)
##AUDIT TRAIL= $$ (NUMBER, WHEN, WHO, WHERE, WHAT)
$$ ##TITLE= Audit trail, XWIN-NMR		Version 3.5
$$ ##JCAMPDX= 5.01
$$ ##ORIGIN= Bruker BioSpin GmbH
$$ ##OWNER= nmr
$$ C:\u/data/dgb/nmr/ADRS/1390/pdata/1/auditp.txt
$$ ##AUDIT TRAIL=  $$ (NUMBER, WHEN, WHO, WHERE, WHAT)
(   1,<2007-10-29 09:48:45.65 +000>,<MAYBRIDGE\nmr>,<NMR_250MHZ>,
      <created by zg, POWCHK disabled, PULCHK disabled
       configuration hash MD5:
       76 6E 9A 78 1E 09 19 81 EC 84 63 8F B0 6A 59 2D
       data hash MD5: 64K
       7D 17 1E AC 23 16 B0 27 16 55 92 54 91 FB 59 51>)
(   2,<2007-10-29 09:49:01.35 +000>,<MAYBRIDGE\nmr>,<NMR_250MHZ>,
      <Start of raw data processing
       ef LB = 0.3 FT_mod = 6 PKNL = 1 SI = 32K 
       data hash MD5: 32K
       95 CF B8 77 98 40 2D F1 5D CA B7 26 04 F6 43 1D>)
(   3,<2007-10-29 09:49:03.24 +000>,<MAYBRIDGE\nmr>,<NMR_250MHZ>,
      <apk 
       data hash MD5: 32K
       46 12 06 63 42 B8 A0 8B 19 37 0E 17 BC 7F 00 FB>)
(   4,<2007-10-29 09:49:03.96 +000>,<MAYBRIDGE\nmr>,<NMR_250MHZ>,
      <abs ABSG = 5 
       data hash MD5: 32K
       9B 3C 99 EA 65 41 51 41 35 98 A1 3F B3 13 D3 D7>)
$$ ##END=
$$ 
$$ hash MD5
$$ 47 67 A0 5E F1 04 1B AC 68 5B CA 23 5F C5 CC C5
##$RELAX= 
##$RELAX= 
##$RELAX= 
##$RELAX= 
##$RELAX= 
##$RELAX= 
##$RELAX= 
$$ Bruker specific parameters
$$ --------------------------
##$DU= <C:\u>
##$EXPNO= 1390
##$NAME= <ADRS>
##$PROCNO= 1
##$TYPE= <nmr>
##$USER= <dgb>
##$AMP= (0..31)
100 100 100 100 100 100 100 100 100 100 100 100 100 100 100 100 100 100 
100 100 100 100 100 100 100 100 100 100 100 100 100 100 
##$AQSEQ= 0
##$AQ_mod= 3
##$AUNM= <au_zg>
##$AUTOPOS= <7 >
##$BF1= 250.13
##$BF2= 250.13
##$BF3= 250.13
##$BF4= 250.13
##$BF5= 500.13
##$BF6= 500.13
##$BF7= 500.13
##$BF8= 500.13
##$BYTORDA= 1
##$CFDGTYP= 0
##$CFRGTYP= 5
##$CHEMSTR= <none>
##$CNST= (0..31)
1 1 145 1 1 1 1 1 1 1 1 1 1 1 1 1 1 1 1 1 1 1 1 1 1 1 1 1 1 1 1 1 
##$CPDPRG= <>
##$CPDPRG1= <>
##$CPDPRG2= <>
##$CPDPRG3= <>
##$CPDPRG4= <mlev>
##$CPDPRG5= <mlev>
##$CPDPRG6= <mlev>
##$CPDPRG7= <mlev>
##$CPDPRG8= <mlev>
##$CPDPRGB= <>
##$CPDPRGT= <>
##$D= (0..31)
0 1 0 0 0 0 0 0 0 0.06 0 0 0 0 0 0 0.0002 0 0 0 0 0 0 0 0 0 0 0 0 0 0 
0 
##$DATE= 1193651323
##$DBL= (0..7)
120 120 120 120 120 120 120 120 
##$DBP= (0..7)
150 150 150 150 150 150 150 150 
##$DBP07= 0
##$DBPNAM0= <>
##$DBPNAM1= <>
$$ [...]
##$SUBNAM7= <"">
##$SUBNAM8= <"">
##$SUBNAM9= <"">
##$SW= 20.6930455092707
##$SWIBOX= (0..15)
0 0 3 0 0 0 0 0 0 0 0 0 0 0 0 0 
##$SW_h= 5175.983436853
##$TD= 65536
##$TD0= 1
##$TE= 295.16
##$TE2= 300
##$TE3= 300
##$TEG= 300
##$TL= (0..7)
0 120 120 120 120 120 120 120 
##$TP= (0..7)
150 150 150 150 150 150 150 150 
##$TP07= 0
##$TPNAME0= <>
##$TPNAME1= <>
##$TPNAME2= <>
##$TPNAME3= <>
##$TPNAME4= <>
##$TPNAME5= <>
##$TPNAME6= <>
##$TPNAME7= <>
##$TPOAL= (0..7)
0.5 0.5 0.5 0.5 0.5 0.5 0.5 0.5 
##$TPOFFS= (0..7)
0 0 0 0 0 0 0 0 
##$TUNHIN= 0
##$TUNHOUT= 0
##$TUNXOUT= 0
##$USERA1= <user>
##$USERA2= <user>
##$USERA3= <user>
##$USERA4= <user>
##$USERA5= <user>
##$V9= 5
##$VALIST= <valist>
##$VCLIST= <CCCCCCCCCCCCCCC>
##$VD= 0
##$VDLIST= <DDDDDDDDDDDDDDD>
##$VPLIST= <PPPPPPPPPPPPPPP>
##$VTLIST= <TTTTTTTTTTTTTTT>
##$WBST= 1024
##$WBSW= 4
##$XGAIN= (0..3)
0 0 0 0 
##$XL= 0
##$YL= 0
##$YMAX_a= 347417
##$YMIN_a= -472675
##$ZGOPTNS= <>
##$ZL1= 120
##$ZL2= 120
##$ZL3= 120
##$ZL4= 120
##$ABSF1= 16.522
##$ABSF2= -4.171173
##$ABSG= 5
##$ABSL= 3
##$ALPHA= 0
##$AQORDER= 0
##$ASSFAC= 0
##$ASSFACI= 0
##$ASSFACX= 0
##$ASSWID= 0
##$AUNMP= <proc_1d>
##$AZFE= 0.1
##$AZFW= 0.1
##$BCFW= 0
##$BC_mod= 0
##$BYTORDP= 0
##$COROFFS= 0
##$CY= 12.5
##$DATMOD= 1
##$DC= 0
##$DFILT= <>
##$DTYPP= 0
##$F1P= 14.0000005364418
##$F2P= -0.99999901652339
##$FCOR= 0.5
##$FTSIZE= 32768
##$FT_mod= 6
##$GAMMA= 0
##$GB= 0
##$INTBC= 1
##$INTSCL= 1
##$ISEN= 128
##$LB= 0.3
##$LEV0= 0
##$LPBIN= 0
##$MAXI= 10000
##$MC2= 0
##$MEAN= 0
##$ME_mod= 0
##$MI= 0
##$NCOEF= 0
##$NC_proc= -4
##$NLEV= 6
##$NOISF1= 0
##$NOISF2= 0
##$NSP= 0
##$NTH_PI= 0
##$NZP= 0
##$OFFSET= 16.522
##$PC= 1
##$PHC0= 156.1073
##$PHC1= 11.87026
##$PH_mod= 1
##$PKNL= yes
##$PPARMOD= 0
##$PSCAL= 4
##$PSIGN= 0
##$REVERSE= no
##$SF= 250.13
##$SI= 32768
##$SIGF1= 0
##$SIGF2= 0
##$SINO= 400
##$SIOLD= 32768
##$SREGLST= <1H.CDCl3>
##$SSB= 0
##$STSI= 32768
##$STSR= 0
##$SW_p= 5175.98343685301
##$SYMM= 0
##$S_DEV= 0
##$TDeff= 65536
##$TDoff= 0
##$TI= <Analysis number 999999
Compound Code 99
Book Reference 9
Project Code 9>
##$TILT= no
##$TM1= 0
##$TM2= 0
##$TOPLEV= 0
##$USERP1= <user>
##$USERP2= <user>
##$USERP3= <user>
##$USERP4= <user>
##$USERP5= <user>
##$WDW= 1
##$XDIM= 32768
##$YMAX_p= 374977813
##$YMIN_p= -313410
$$ End of Bruker specific parameters
$$ ---------------------------------
##NTUPLES= NMR SPECTRUM
##VAR_NAME=  FREQUENCY,     SPECTRUM/REAL,   SPECTRUM/IMAG
##SYMBOL=    X,             R,               I
##VAR_TYPE=  INDEPENDENT,   DEPENDENT,       DEPENDENT
##VAR_FORM=  AFFN,          ASDF,            ASDF
##VAR_DIM=   32768,         32768,           32768
##UNITS=     HZ,            ARBITRARY UNITS, ARBITRARY UNITS
##FACTOR=    0.157963299565203, 1,           1
##FIRST=     4132.6476996994, 0,             0
##LAST=      -1043.33573715361, 0,           0
##MIN=       -1043.33573715361, -313410,     0
##MAX=       4132.6476996994, 374977813,     0
$$ Real data points
##PAGE= N=1
##DATA TABLE= (X++(R..R)), XYDATA
$$ [...]
27721c0485J7940Q274m6189J4823j1143l1186K4348L9788k7107l293P7730J925
27709C5425j4371o7363j0461M9595J5696N3543N500L7045R077k2570o1419J2438
27697D2135l5117j3005K6543k2593P185M3931l118l784m000M4460J093j2502Q837
27684H0065K8716R77o6398j14267n9541O6123N5022J0014K8344L1062k4538P423
27672D3002J1784m8260r296L6304J1757n4566q1259J1227M2836q356K5043l9422
27660e9206J5983O9361o3093l3401N7641k5452l8869j5305L9047N500l9182o799
27648i3775J09559Q8772k3335l8733O922P716q4179j0651J2326Q895j3251L8653
27636H919k4961J1432K1433J7276j5280K6177j5079k9827p6286j9612L6500L4554
$$ plain form
27721 -30485 -12545 -4271 -50460 -35637 -46780 -77966 -53618 -13830 -40937 -44230 33500 35425
27709 35425 21054 -46309 -56770 -7175 8521 62064 67564 104609 113686 91116 29697 42135
27697 42135 7018 -5987 20556 -2037 5148 49079 45961 42177 38177 82637 83730 71228 80065
27684 80065 108781 109758 43360 -70907 -130448 -64325 -9303 711 29055 60117 35579 43002
27672 43002 54786 6526 -2770 33534 45291 -9275 -90534 -79307 -36471 -44827 -19784 -59206
27660 -59206 -43223 26138 -36955 -70356 -12715 -38167 -77036 -92341 -53294 -47794 -86976 -93775
27648 -93775 15784 104556 81221 42488 49410 57126 -27053 -37704 -25378 -16483 -29734 8919
27636 8919 -16042 -4610 16823 34099 18819 44996 29917 90 -76196 -95808 -59308 -24754
27624b4754m088j2584K6103j4187n6010L9174K8545k7556K7621J5752Q484j4022
27612g522J2484M8658K7476j5718l753K4862L7261n0579L379J8358J0474n0860
27600E4520j4306M7520l4229j3249m2359j2093k3k6001J6376L2376M22Q867k5309
27587g488n2287K0241J7306J1900j5283M321N1190J0752R914N336Q830l7153j7514
27574A0065j8776k2273n2712j038M4216P6038M200l9935k4000l3074j9671N218
27562g1742J9781M8546L4272k3048m8063O166N3905j0767k1074R455O645J4472
27550A8548M47j3781Q400M715P9229k7234m2992p03M5947K5976l1805k6783l06
27537C9658p024L73K4401J7314l4110p1877K2524J4566j8959o5335L2687K072
$$ plain form
27624 -24754 -28842 -41426 -15323 -29510 -85520 -46346 -17801 -45357 -17736 -1984 6500 -7522
27612 -7522 4962 53620 81096 65378 61625 86487 123748 73169 76548 94906 105380 54520
27600 54520 40214 87734 53505 40256 -2103 -14196 -14219 -40220 -23844 8532 8954 17821 -7488
27587 -7488 -59775 -39534 -22228 -10328 -25611 -21290 29900 40652 50566 55902 64732 27579 10065
27574 10065 -8711 -30984 -83696 -84734 -40518 35520 39720 -215 -24215 -57289 -76960 -71742
27562 -71742 -51961 -3415 30857 7809 -40254 -34088 19817 9050 -12024 -2569 4076 18548
27550 18548 18995 5214 13614 18329 97558 70324 27332 26629 72576 98552 66747 39964 39658
27537 39658 32634 33007 57408 74722 40612 -31265 -8741 5825 -13134 -78469 -45782 -43710
27525d3710J7613O3495L1765l1143j7682K2159n8654j0600j8682m203k8268N2447
27513b5463J5620K5392J4353l146L0698K355n7613p3654n0174J1702M3386M4024
27501b2520k1435J924L9619r770m960m66n927M3259J2069K2527n489m3142J8554
27488B4243j1061n555K4787L6075M6105K4931M898q8004p9320M3567M907J4188
27476C9761J8863k4944o261j9614m0238o58r39K8347P38k7496r865k739k9103
27463g4148L164L1891L9528j4361r439k8699R594K4733k4674m245L9556n085k1179
27450c3364J569K3999J8056p8024n231J8450J5068J7920J6416K064M565j6984
27438a5496K9334L589R591j6036j9434J7287M1664k1649n952q747k0766j4833
$$ plain form
27525 -43710 -26097 37398 69163 38020 20338 42497 -16157 -26757 -45439 -49642 -77910 -25463
27513 -25463 -9843 15549 29902 26756 57454 59809 2196 -71458 -121632 -109930 -66544 -22520
27501 -22520 -43955 -42031 -2412 -12182 -17142 -17608 -23535 19724 31793 54320 48831 5689 24243
27488 24243 13182 7627 32414 68489 114594 139525 144423 56419 -22901 20666 25573 39761
27476 39761 58624 33680 27419 7805 -32433 -33091 -34030 -5683 -4945 -32441 -42306 -45045 -74148
27463 -74148 -70984 -39093 435 -13926 -23365 -52064 -42470 -17737 -42411 -46656 -7100 -12185 -33364
27450 -33364 -31795 -7796 10260 -67764 -72995 -54545 -39477 -21557 -5141 -3077 1488 -15496
27438 -15496 13838 17427 27018 10982 -8452 8835 50499 28850 22898 14151 -6615 -21448
27426b1448p775K4356q9m4355k0630j893k7117O0297P6984N738k0278n9961j1764
27413d7935J01903K8129O712J5873M383m3845j045j0449K1236m0187l5693l6091
27401c7009J8490N3220M3752l1490k451k7511n0760k0475k1897O4099K9950k4651
27389f733N0067Q902K7772K126n7790j4769K8349k3007k6631J0631p610Q603k378
27376b468r17M5050p3286K3658N2299L1547K5900j0933k8117L5879j7244K0815
27364A02183K4679J8404l8679N817q633m6919n9515K6539M7648n241r0414l6220
27352f0351N3398K7774k3875q1065J2054O6333L0601J6577n3909o6949p38N3166
27340b6984O0514K4410k3737o0168l2222n738l3587O2233N5848J7190j841J3717
$$ plain form
27426 -21448 -29223 -4867 -4956 -49311 -69941 -71834 -98951 -38654 38330 44068 23790 -36171 -47935
27413 -47935 53968 82097 88809 104682 109065 65220 64175 53726 74962 34775 -918 -37009
27401 -37009 -18519 34701 78453 46963 44512 17001 -33759 -54234 -76131 -12032 17918 -6733
27389 -6733 43334 52236 80008 82134 24344 9575 37924 14917 -11714 -1083 -8693 -90 -2468
27376 -2468 -3385 41665 -31621 -7963 44336 75883 101783 90850 62733 98612 81368 102183
27364 102183 126862 145266 106587 112404 103771 56852 -2663 23876 71524 66283 -24131 -60351
27352 -60351 -6953 20821 -3054 -84119 -72065 -5732 24869 41446 -12463 -79412 -80150 -26984
27340 -26984 33530 57940 34203 -25965 -58187 -63925 -97512 -35279 20569 37759 35918 49635
27328D9635n3360o815K8298L654m9068j9559O613N2933L1939p96O431K4378j1350
27315F2933o0790N2178j2794l3812O703L9047J2630j3308J5429p873o7440m5065
27303e2162m854M555j1652K094M2076j1334o4289k4387l8165M7334O0462j5733
27291f6055J1026r092o543M501J6509O6000o8p1132L312L0781L3049m1669m3482
27278g2863L5433Q0750L9020J6190P351l0001L5451M850l2540j3162j2741J9581
27266G7319m3246q8768J5492O4865Q110l2006l2419m4266M4132P7464j4544o0196
27254b8063n0208K0158o4918K3112Q4932M3773L152M624l9774j1625N555o7410
27242g6692o740N143k273j4093L8118N5958k7217j3110k1215m056N1841M2515
$$ plain form
27328 49635 -3725 -10540 17758 21412 -27656 -47215 -40602 12331 44270 43474 49905 74283 62933
27315 62933 2143 54321 41527 7715 14418 53465 66095 52787 68216 60343 -7097 -52162
27303 -52162 -57016 -52461 -64113 -62019 -19943 -31277 -95566 -119953 -158118 -110784 -50322 -66055
27291 -66055 -55029 -64121 -70664 -66163 -49654 16346 16278 -54854 -51542 -20761 12288 -29381 -72863
27278 -72863 -37430 43320 82340 98530 105881 75880 111331 116181 83641 70479 57738 77319
27266 77319 34073 -54695 -39203 25662 33772 1766 -30653 -74919 -30787 46677 32133 -28063
27254 -28063 -78271 -58113 -123031 -99919 -14987 28786 31938 36562 -3212 -14837 -9282 -76692
27242 -76692 -83432 -78289 -80562 -94655 -56537 -579 -27796 -40906 -62121 -66177 -14336 28179
27230B8179M6838K6132n4329r6391q276P3200M6487l2033o6514n2647N0282L7313
27218a759K8800l125M7261J6954k2044p1533n7206K07m8073j4408l763R9504O1721
27205C2536J7600J0556j3077o8724l2933k3432J867O4193k1971p2611j5004J5171
27193a05829k5808m649l6801M5738M4640O453k4002j743l5546J0386P1915M3892
27181a1354n454k2185p1810K4990N9879K6948k9205o421k0536j393O9330N6710
27169F9499N33j159k206j5680P3461L115m3669k9809k2383n4317L0614N5257l9992
27156B3264j7798n5870p398O8962K1772m9623j4352n469J1865M7543j1849n8905
27144d7858l4496p1133m1598L1766O9683J6102K9101N2129L9498o3460l5831J7219
$$ plain form
27230 28179 75017 101149 46820 -49571 -57847 15353 61840 29807 -36707 -89354 -39072 -1759
27218 -1759 27041 23916 71177 88131 66087 -5446 -62652 -62445 -110518 -124926 -128689 -29185 32536
27205 32536 50136 60692 47615 -21109 -54042 -77474 -75607 -11414 -33385 -105996 -121000 -105829
27193 -105829 -131637 -136286 -173087 -127349 -82709 -76256 -100258 -102001 -137547 -127161 -55246 -11354
27181 -11354 -16808 -38993 -110803 -85813 -25934 1014 -28191 -34612 -55148 -56541 12789 69499
27169 69499 70032 68873 66667 50987 124448 127563 83894 54085 31702 -22615 7999 63256 23264
27156 23264 5466 -50404 -57802 11160 32932 -16691 -31043 -36512 -24647 22896 11047 -47858
27144 -47858 -82354 -153487 -195085 -163319 -93636 -77534 -48433 3696 43194 -20266 -56097 -38878
27132c8878O7806N7063J3694J2196o0966l0630J4409K6428n9803k2114j206k8607
27120e0608J0103j0730j1242k4555N0540N5027L1967K8175o8510m5431K2199Q1166
27108F8101k1048m1709N582P3403j4003k4185p138q651K6772k0123m4024l4916
27096d1939N684L5783j8260K2113O2M8357L9478M85m7485k5132N1345J4367P823
27083I2681L196k2673n4955q3079o5618J2942O0654M0522P0406n3726o5269k3808
27071h8727j2489K8341N8642Q1173kk9867k9225l6822k2474N5008K0672P4672
27059I8902j5205k0040q5855k4896q215l9802K3951O9730N7984k5928m4461L3181
27047A9346K3756J3696m2885L7390j026J0754M545r0449n3793N3940M1195m0392
$$ plain form
27132 -38878 28928 85991 99685 111881 50915 20285 34694 61122 1319 -20795 -22001 -50608
27120 -50608 -40505 -51235 -62477 -87032 -36492 18535 50502 78677 10167 -35264 -13065 68101
27108 68101 47053 5344 10926 84329 70326 46141 39003 30352 57124 37001 -7023 -41939
27096 -41939 -36255 -472 -18732 3381 3443 51800 91278 91763 44278 19146 70491 84858 92681
27083 92681 95877 73204 18249 -64830 -130448 -117506 -56852 -16330 54076 350 -64919 -88727
27071 -88727 -101216 -72875 -14233 66940 66938 37071 7846 -28976 -51450 3558 24230 98902
27059 98902 83697 63657 -22198 -47094 -55309 -95111 -71160 -1430 56554 30626 -13835 19346
27047 19346 43102 56798 13913 51303 50277 61031 65576 -24873 -78666 -24726 16469 -23923
27035b3923P976N1201l282p7807J9152J2121k198l5693M1048J9117j680M0415
27023D6447o252p8982j5047N4551L6368l4608k0780K704P87p7347p220j5789k4483
27010a39651Q1379M8001K2092k8674l9239k1888O8092O0638j8457k4825k5394
26999a7926K4437j6469k892j0236K6440M2670L6775r446m8468j3093Q733K5859
26987D6384m7810o7422j0709r875j1105K0151P715M850j4166L6440j9771K106
26975f3212J2693J0777n707l1929L9996O625k2550L433q869p8654L1875N7211
26963d8311K0568M5962K403k0162L7399j1743l5474K1856K7206k6548k8923k6336
26951d2103P7896O4530j3619n0200J5039K7576k9140l3599K7124M9726J2792o8580
$$ plain form
27035 -23923 -15947 35254 31972 -45835 -26683 -14562 -16760 -52453 -11405 7712 6032 46447
27023 46447 40195 -38787 -53834 717 37085 2477 -18303 -15599 -14812 -92159 -99379 -115168 -139651
27010 -139651 -58272 -10271 11821 -16853 -56092 -77980 -9888 50750 32293 7468 -17926
26999 -17926 6511 -9958 -12850 -23086 3354 46024 82799 73353 24885 11792 20525 46384
26987 46384 -1426 -68848 -79557 -89432 -100537 -80386 -72671 -67821 -81987 -45547 -65318 -63212
26975 -63212 -50519 -39742 -45449 -77378 -37382 -30757 -53307 -49874 -58743 -137397 -105522 -48311
26963 -48311 -27743 18219 20622 460 37859 26116 -9358 12498 39704 13156 -15767 -42103
26951 -42103 35793 100323 86704 36504 51543 79119 49979 16380 43504 93230 106022 37442
26939C7442j9538k9796m2215M8301m7421K2983M0632J5397K5042K974j501m8090
26927D210k7771j2088L8954P3266l1080j9306L7858L924k2747l1273Q845p148
26915A5644Q703Q9296N4645J7276J6015q1494n5522L74q8162M13L2439j7381L9253
26902C1499J5115J6783N5608m7677l0526j1522L0116J3695K3154k7795k7944j4822
26890B5684K886k0179j4288j198j4449o8788l122N2550N8128J7762N277o7794
26878b7531q3059m992Q7911P3353K0103J106J7854n7725j2216J4680j5703k8187
26866a4406L76K9967m3943J7029J8641m395k2746K3331r966M0985Q173K1904J1337
26853G6287k305j5877q3501n526M1688l795M0412J2553j8197J7645N104k442k7132
$$ plain form
26939 37442 17904 -11892 -54107 -5806 -53227 -30244 10388 25785 50827 53801 52300 4210
26927 4210 -23561 -35649 3305 76571 45491 26185 64043 67967 45220 13947 22792 15644
26915 15644 24347 113643 168288 185564 201579 120085 64563 64937 -23225 -22812 9627 -7754 31499
26902 31499 46614 63397 119005 71328 40802 29280 59396 73091 96245 68450 40506 25684
26890 25684 28570 8391 -5897 -7095 -21544 -90332 -93454 -40904 17224 34986 40263 -27531
26878 -27531 -110590 -115582 -27671 45682 65785 66891 84745 27020 14804 29484 13781 -14406
26866 -14406 -14030 15937 -28006 -10977 7664 3269 -19477 3854 -6112 34873 43046 64950 76287
26853 76287 73982 58105 -25396 -30922 10766 6971 47383 59936 41739 59384 64488 62046 34914
26840C4914j1731K1569J801m6789n4865N710L933l043J8359J7558r457k0359J7511
26827b4889L7291L2306m406l1072l766k3321l580J5475K7637M0645P9176L2225
26815A73721l0832l7855R177n3872j2121o976n532L004o7809q822J0998Q304l933
26802b2548l1568n1208J1398L9910K140J3559M1834j7545o3872j5171M8308P656
26790c7107O839K8033j2115o701Q8241Q3580k7273q5552r4994o032l93q089K9006
26777d2557J2212j6436j3592K5131j1997o476K7138L4652M2509J7246o1573m9276
26765d3019L1684J9926L155M4844J3674p8190j0544j316L0126n056j8482l1195
26753d4393k4491k777P1325q116m1847J6773R549n4173k5642j5552O8226N9024
$$ plain form
26840 34914 23183 44752 46553 -236 -55101 -49391 -45458 -48501 -30142 -12584 -22041 -42400 -24889
26827 -24889 12402 44708 40302 9230 5464 -17857 -21437 -5962 21675 62320 141496 173721
26815 173721 142889 105034 114211 60339 48218 41242 35710 38714 -29095 -37917 -26919 -18615 -22548
26802 -22548 -54116 -105324 -93926 -54016 -51876 -38317 3517 -14028 -77900 -93071 -44763 -37107
26790 -37107 -30268 -2235 -14350 -21051 67190 150770 123497 37945 -57049 -63081 -63474 -71563 -42557
26777 -42557 -30345 -46781 -60373 -35242 -47239 -53715 -26577 8075 50584 67830 6257 -43019
26765 -43019 -11335 8591 11746 56590 70264 -7926 -18470 -19786 10340 5284 -13198 -44393
26753 -44393 -68884 -71661 -336 -8452 -50299 -33526 -23977 -78150 -103792 -119344 -51118 7906
26741G906l2831J4552J937j7505J53j827R04K3649K6959P2718K0184N938k8653
26728I4084q0879k2846K2260n2035n1336r949N0370R622M0971J52o79j1029K0185
26715H891p823L4463r403N590L6022q82j5239M2448K0923J4726j8823j978J3138
26702A22053l1349p4535o1603Q215K5625j3048l7824p153L6606o464j5095L7475
26690a7097o800l3790q601O8334O8228k755J019l1522k6814j2130K7446J9818
26678D5336O0566l2634n2844p376r995k1615M166O132L3510o577p2912N9681J8436
26665B3874m0983N493K2273j029j1380J633j7239l6144M0741L1845K3786k0062
26653B2808q9843j6200O0941p198J8720J6175P250k6042j3129k5325j740j5489
$$ plain form
26741 7906 -24925 -10373 -8436 -25941 -25788 -27615 -26711 -3062 23897 96615 116799 122737 94084
26728 94084 13205 -9641 12619 -39416 -90752 -100701 -50331 -40709 262 414 -265 -11294 8891
26715 8891 1068 35531 26128 31718 67740 66858 51619 94067 114990 129716 110893 108915 122053
26702 122053 90704 16169 -45434 -37219 -11594 -24642 -62466 -69619 -33013 -39477 -54572 -17097
26690 -17097 -23897 -57687 -66288 2046 70274 67519 68538 37016 10202 -1928 25518 45336
26678 45336 105902 73268 20424 13048 3053 -18562 -14396 -8264 25246 18669 -54243 5438 23874
26665 23874 -17109 -11616 10657 9628 -1752 -119 -17358 -53502 -12761 19084 42870 22808
26653 22808 -67035 -83235 -22294 -29492 -10772 5403 12653 -13389 -26518 -51843 -53583 -69072
26641f9072N2818N1715k0422J2635k8880j7922l8259K9107Q3767M2796m319r0516
26629C448n9297n842J0526L1950J8435k5499M9629J6442K2794k2366r8753r1115
26617a49648j8312K9490M0636k2172M2348R0241n197n6076j5517l0622J556j333
26605i4606P5229P1879J4288K2530k1230M123L3736K477p2667n6482n8493K4601
26593e4615l6890K2389O7888L4825l9794K0384j5572L0757L8666j8985k0141J10
26581B9022N8258J9136j3073l0579l686j00688j02844O9863K2047K364k3891J9677
26569e4394O7061L1961J2180m1724l7329j3282J6321L9214q483m6197N935J6515
26557a2222N6534j931n61J3938J023q9950o3116Q0176R3858l2458K0006M8259
$$ plain form
26641 -69072 -16254 35461 15039 27674 -1206 -19128 -57387 -28280 55487 98283 93964 3448
26629 3448 -55849 -61691 -51165 -19215 -780 -26279 23350 39792 62586 40220 -58533 -149648
26617 -149648 -167960 -138470 -97834 -120006 -77658 12583 7386 -48690 -64207 -94829 -93273 -94606
26605 -94606 -19377 52502 66790 89320 68090 72213 105949 108426 35759 -20723 -79216 -54615
26593 -54615 -91505 -69116 -1228 33597 -6197 14187 -1385 29372 68038 49053 28912 29022
26581 29022 87280 106416 93343 62764 59078 -41610 -144454 -74591 -52544 -50180 -74071 -54394
26569 -54394 12667 44628 56808 15084 -22245 -35527 -19206 20008 11525 -34672 -28737 -12222
26557 -12222 44312 42381 41820 55758 56781 -33169 -96285 -16109 77749 45291 65297 113556
26545A13556J4677m4691m5965m3719M153K6722j3750n9914J0377N0808J2353J9222
26533D3829N394Q2377m9094l111j3820j7458k0906K8534K8791l145l4925j0436
26521C6030j2606j4129k6163J2981L431k3030K538j7608j0298J1753J6302J5875
26509d924j336L7833q9R836K9022l5979p375o5213N9782L5137m6631l7762J4653
26496a3046L7845R882q7629p78K0008m974L1050n631L2612O9114l3143p1322O116
26483i896J1957J2747J3750p7581j1297L1889j244o4383N341L4014N5893L9994
26471D1184M658J1125q2458q1792m540K2242L6945M4999J8133m3965k4557Q012
26459e0014J9457K5782J1071k8p416O9681j0348K2846k6309k1056o9975n4892
$$ plain form
26545 113556 128233 83542 37577 -6142 -1989 24733 10983 -48931 -38554 12254 24607 43829
26533 43829 49223 131600 82506 79395 65575 48117 27211 55745 84536 81391 46466 36030
26521 36030 23424 9295 -16868 -3887 -456 -23486 -20948 -38556 -48854 -37101 -20799 -4924
26509 -4924 -6260 31573 31484 41320 70342 34363 26988 -38225 21557 56694 10063 -27699 -13046
26496 -13046 24799 34681 -52948 -53726 -33718 -38692 -7642 -13273 19339 88453 55310 -16012 -9896
26483 -9896 2061 14808 28558 -49023 -60320 -28431 -29675 -94058 -88717 -54703 1190 41184
26471 41184 45842 56967 -25491 -107283 -111823 -89581 -52636 -7637 10496 -33469 -58026 -50014
26459 -50014 -30557 -4775 6296 6268 -1148 68533 58185 81031 54722 33666 -36309 -91201
26447i1201r485J9641L909k91O4628J1884J2887k7480l3164K6164L4033J909l5170
26434b1736J059j1089n455M6547j4346j7732l3913j49j4406K5560j5892O6313
26422D761K5888j9631M819o5308L0660q805J2210P582J9442j6928J9694L6279
26410E0663M5244J825o7390n4051p384O211O4504K6979J3256K3463K2820n8985
26398F7155m2532k2219k052M2438q271j9191O116O666K0621L4275m7904j20765
26386h5663K99M3604M7513n2157J4308M0248J1791l7109j1215J1162l1064l9716
26374h7999k8502O3984O1533R166o493j816j1817L1823k3849K2583l6334n0853
26362e8574m2345j6323K4852O0205K1795J9980K0875J9299j2244k297l5077J6620
$$ plain form
26447 -91201 -100686 -81045 -77136 -77427 -12799 -915 11972 -15508 -48672 -22508 11525 13434 -21736
26434 -21736 -20677 -31766 -37221 9326 -5020 -22752 -56665 -56814 -71220 -45660 -61552 4761
26422 4761 30649 11018 15837 -49471 -18811 -27616 -15406 -7824 11618 -5310 14384 50663
26410 50663 95907 97732 30342 -23709 -31093 -24882 39622 66601 79857 103320 126140 67155
26398 67155 24623 2404 352 42790 34519 15328 21444 28110 48731 83006 35102 -85663
26386 -85663 -85364 -41760 5753 -46404 -32096 8152 19943 -17166 -28381 -17219 -48283 -87999
26374 -87999 -116501 -52517 9016 18182 11689 9873 -1944 29879 6030 28613 -7721 -58574
26362 -58574 -100919 -117242 -92390 -32185 -10390 9590 30465 49764 37520 35223 146 16766
26350A6766l6309j9421L0561J5979k8653n5969k7788j090N9995N6091L0107K831
26338D3100k6627j06596N0321N4343J4937n2569k6714N4222N576L695O184N43
26326B0415j5638k967K8728J1544o070m03J0256p314k604k8024j4267l9145n90
26313d6079L1874N2404k0964m7318l3286k5870N6452K384k9221J7294L7542L3226
26301B8438m538m4441k3306K5944K5934J5889J8957r7070j16225l153M7584K5264
26289a00723j9934Q1079Q2266j7351k8847K4380j0895P154P4911Q486N268m993
26277A00801J4349m1990p9800o066k96K0444J2433J8873m1253j7745j3584n892
26265c9726n333j8683k3145K3079m480J009N7836J4381l5409J0238o794M4345
$$ plain form
26350 16766 -19543 -38964 -8403 7576 -21077 -77046 -104834 -105924 -45929 10162 40269 43100
26338 43100 16473 -90123 -39802 14541 29478 -23091 -49805 4417 9993 13688 19872 20415
26326 20415 4777 1810 30538 42082 36012 35609 45865 38551 35947 7923 -6344 -45489 -46079
26313 -46079 -14205 38199 17235 -30083 -63369 -89239 -32787 -30403 -59624 -42330 -4788 28438
26301 28438 23900 -20541 -43847 -17903 8031 23920 42877 -54193 -170418 -173571 -125987 -100723
26289 -100723 -120657 -39578 42688 25337 -3510 20870 9975 17129 92040 100526 105794 100801
26277 100801 115150 73160 -6640 -12706 -13002 7442 19875 38748 -2505 -20250 -33834 -39726
26265 -39726 -45059 -63742 -86887 -63808 -68288 -67279 -9443 4938 -30471 -20233 -27027 17318
26253A7318K3425L4239L4775j8388m1419r4024l820M1239j8438J5498J5252p4834
26241f9177n972L8988l7049J8316K537k5903l779L6318J08245j2020m1791Q130
26229A6843k496l7525L9576J0566m7763j3391N3023J2510J7308j1267l4698j2799
26217a0113M6338N0751k1084n6897K3410k3023l8784J1995j3531J7825J1528m303
26205e888L6259N782l0945L0125J991n9078j128k4840l4806N1886M7496m2746
26193b5892m733k4324M7127M7173j9982N8730Q451j4506j4929K1271J0902k4675
26181F4613l3305l6315J8640P3241K1447Q269l3537k349m3429J116P249l1071
26169A4569l173k4324K3058M6336N292l5996j4908L3509J6803k2341M0669J6988
$$ plain form
26253 17318 40743 74982 109757 91369 49950 -44074 -47894 -6655 -25093 -9595 5657 -69177
26241 -69177 -75149 -36161 -73210 -54894 -52357 -78260 -82039 -45721 62524 50504 8713 16843
26229 16843 14347 -23178 16398 26964 -20799 -34190 18833 31343 48651 37384 2686 -10113
26217 -10113 36225 86976 65892 8995 32405 9382 -29402 -17407 -30938 -13113 -1585 -5888
26205 -5888 30371 36153 5208 35333 37324 -21754 -22882 -47722 -82528 -30642 16854 -25892
26193 -25892 -30625 -54949 -7822 39351 19369 78099 86550 72044 57115 78386 89288 64613
26181 64613 31308 -5007 13633 86874 108321 116590 83053 80704 37275 38391 45640 14569
26169 14569 11396 -12928 10130 56466 61758 25762 10854 44363 61166 38825 79494 96482
26157I6482k3368p3070K6844J6756l7527J4829j8217n0995M4031J2611j4553R437
26145C260j8621L715M2486l158M424j0559k0620J4968N9343L5851m7032m7375
26133A6682L8629j5355k8574k2128j3928J8446N7315n409J7683M6376k0725n9094
26121B9918m1051o3556o0589j7326J0034M1483M2127K0209k3096J012p638N2858
26109a5615K6377L9274J8604j9632j1331L7449k2065r241j3592n3254n4707j9313
26097i7046L9702P2577J5035l0761l6999M1233L8887R826j5536k3157J3685j5654
26085A1792p088q608j5771m4346K3820K5956R197L5575J9789L0913K2737j9557
26073H4409J2412n2022q0354o2790q067O5924L5761J1744O2916o6334k5367J4024
$$ plain form
26157 96482 73114 44 26888 43644 6117 20946 2729 -48266 -4235 8376 -6177 3260
26145 3260 -15361 -11646 30840 27682 32106 21547 927 15895 75238 111089 64057 16682
26133 16682 55311 39956 11382 -10746 -24674 -6228 51087 45678 63361 109737 89012 29918
26121 29918 -11133 -74689 -135278 -152604 -142570 -101087 -58960 -38751 -61847 -60835 -68473 -15615
26109 -15615 10762 50036 68640 49008 37677 75126 53061 43820 30228 -23026 -77733 -97046
26097 -97046 -57344 15233 30268 -493 -37492 3741 42628 52454 36918 13761 27446 11792
26085 11792 4704 -3904 -19675 -64021 -40201 -14245 -5048 30527 50316 81229 103966 84409
26073 84409 96821 44799 -35555 -98345 -106412 -40488 -4727 7017 69933 3599 -21768 -7744
26061g744N747K5231K5855j18835n1612J34Q6836N497n230K3199r137k0726m4086
26048h4871L3325L0914M9605J0495k2595k6828N5799L5351J3418k9161k8506N2216
26036H9162n768k1519K0296k2246K2407K4433k2035k2201K8714p4603j8735p7280
26024g9375l4467j0839K3978M2382O2066J3322n7369N5440J882l8415l2078K366
26012e1107K7965M8892K2642N2817k0633m6862m818K1045k6417l1906N3211j6020
26000B8809o453m0047p7579M0572L1773k5575l491K3129L3279Q712R0797j4067
25988H9859l4850j1195J2692m27k9605M351o452k3081L0067j5349K4560J2370
25976E2940m1016M1549K5028n0425k3656J0223j4348j6601j8797j831N734O216
$$ plain form
26061 -7744 -1997 23234 49089 -69746 -121358 -121224 -34388 -28891 -34121 -10922 -20059 -40785 -84871
26048 -84871 -51546 -20632 28973 39468 16873 -9955 45844 81195 94613 65452 36946 89162
26036 89162 83394 61875 82171 59925 82332 106765 84730 62529 91243 16640 -2095 -79375
26024 -79375 -113842 -124681 -100703 -58321 3745 17067 -40302 15138 17020 -21395 -53473 -51107
26012 -51107 -23142 25750 48392 101209 80576 33714 28896 49941 23524 -8382 44829 28809
26000 28809 22356 -17691 -95270 -54698 -22925 -48500 -51991 -28862 4417 13129 103926 89859
25988 89859 55009 43814 56506 56079 26474 30825 24373 1292 31359 16010 40570 52940
25976 52940 11924 53473 78501 28076 4420 14643 295 -16306 -35103 -36934 -31200 -24984
25964b4984j500P323k1232O8410l7087p7575p031L6388J728L2845O1542k2405
25952A6422m0797J7978L9278m2983k3868M8544l4416r827k1638J2738J2543k088
25940b8114j2506K9545k3826n1994J5980L3664J4236N0006l8262K5379N5204o397
25928F2915j32239m6420K6504J0218J9866L7576M3201n7375K0285M919o6424K6395
25916e0579M0566p9108j9555L6315J4383O774Q3709R0243k0606l3338l4413p9939
25904d5548K6346P313J3008M5492m5346Q655R8355p216m2692L7254j0832n0148
25892C4641k5690N991l9473k1124l3973n7440M223L5709L9717j4495Q1542N5108
25880F4736m1153N561L19Q270J0638k1650q067R189N4067l1934n1807l3717j614
$$ plain form
25964 -24984 -26484 -19161 -40393 28017 -9070 -86645 -93676 -57288 -55560 -22715 38827 16422
25952 16422 -24375 -6397 32881 -10102 -33970 14574 -19842 -29669 -51307 -38569 -26026 -28114
25940 -28114 -40620 -11075 -34901 -86895 -70915 -37251 -23015 26991 -11271 14108 69312 62915
25928 62915 -69324 -115744 -89240 -79022 -59156 -21580 21621 -35754 -15469 -10550 -76974 -50579
25916 -50579 -10013 -89121 -108676 -72361 -57978 -51204 32505 122748 102142 68804 34391 -45548
25904 -45548 -19202 -11889 1119 46611 1265 9920 108275 101059 58367 95621 84789 34641
25892 34641 8951 14942 -24531 -45655 -79628 -137068 -132845 -97136 -57419 -71914 9628 64736
25880 64736 23583 29144 29463 37733 48371 26721 18654 27843 81910 49976 -1831 -35548 -37162
25867c7162J2216K9362j6070o846M0966j4563K2986L43j751q291J5463L3869K794
25854G3316l5162n1266K8706r328l3621j0154N566M8227k0182l8379J5879M781
25842b1617L336j4673L0820J1079L8817K569N010J4609l2307L610o5973q9392
25830a14112M7047O5139P773j0143J9656Q82J6327j5261k7649o0410j2475J1155
25818g2071J4066M5413K1466k3325O767L2598J1005O770Q35N3618k0115r4478
25806a7451n8752M0796N5414J784K3779P1325k7849N14O028q45l667j8222J6784
25793H9638p7082k9320J949L0731l1161m2635M281O4876J0722j4245m2162J7020
25781a7388K5179k6373J4399l1622J9134N125n7561R393O9599L1597j3315l4073
$$ plain form
25867 -37162 -24946 4416 -11654 -18500 22466 7903 30889 31232 29481 21190 36653 70522 73316
25854 73316 38154 -13112 15594 6266 -27355 -37509 -31943 16284 -3898 -42277 -26398 -21617
25842 -21617 -18281 -32954 -2134 8945 47762 50331 55341 69950 37643 41253 -24720 -114112
25830 -114112 -67065 -1926 5847 -4296 15360 16242 32569 17308 -10341 -70751 -83226 -72071
25818 -72071 -58005 -12592 8874 -14451 -7684 24914 35919 42689 43524 97142 77027 -17451
25806 -17451 -76203 -35407 20007 21791 45570 116895 89046 89560 95588 94743 91076 72854 89638
25793 89638 12556 -16764 -14815 15916 -15245 -57880 -53599 11277 21999 7754 -34408 -17388
25781 -17388 7791 -18582 -4183 -35805 -16671 -11546 -69107 -59714 9885 41482 28167 -5906
25769e906N9067J7344j4030k6580j1970j4628O4232J6610J0601j3236j790m6124
25757C3590L938L2326o6075K492N1489o8970M6223p641m5442k8249K8644N2276
25745C4601K1659K3017m7204k273N6397m4032r4112r545M0971l3701l5830n199
25733i5251R2114K5120n0050K2143J1880m0431l1410L5354M009m0167l66K3536
25721d3519L5219J6681k1106Q884P634J2699N639l3087m4529L5954J2549M6269
25709C9287R97k4360j1021Q468o9276K8210P6783M7245j03099l1823j1163N0907
25697A155N8945n0534k6055j8926K0610N9882J5381k0066M0848L781J8038l6488
25685F6571o2203m8663J5873j1819L7428J3501N105m096N4294J0835n293k5002
$$ plain form
25769 -5906 53161 70505 56475 29895 17925 3297 67529 84139 94740 81504 79714 33590
25757 33590 37528 69854 3779 6271 57760 -11210 35013 27372 -18070 -46319 -17675 34601
25745 34601 56260 79277 32073 29800 86197 42165 -51947 -61492 -20521 -54222 -90052 -95251
25733 -95251 -3137 21983 -28067 -5924 5956 -34475 -65885 -30531 -26522 -66689 -67055 -43519
25721 -43519 -8300 8381 -12725 -3841 3793 16492 22131 -10956 -55485 -19531 -6982 39287
25709 39287 40284 15924 4903 13371 -55905 -27695 49088 96333 -6766 -38589 -49752 1155
25697 1155 60100 9566 -16489 -35415 -14805 45077 60458 40392 81240 85021 103059 66571
25685 66571 4368 -44295 -28422 -40241 -2813 10688 15793 11697 65991 76826 71533 46531
25673D6531m8190n2017j4994J6888L2567k0328k4812K6186Q744J2026l1773L684
25661d5488K9723k784J0941M2638m9283k9495j2414k4282J8843K1983J5432L6306
25649A2120p3Q496k2356N1119K289J3988J0064k0956j2467l0052l1895j1010J1433
25636a9300M5392j9337o9393k0904L3700j4420R813R057j7441N1610J7008q4137
25624g8352N0593Q3086M098l9679q69K7429m673o1366m7627K1187K5218l814N870
25611a8899L0347K8441L8131r536m5288J357M8796o4459l7002K7312j4439N5902
25599D0663K7846j1887m0320l1988o3303L1542M5238J1466J8478J69r745j4104
25587D055N4034j7800K1642L0690k8734m6014l6192j518R746L5834l8444K2263
$$ plain form
25673 46531 -1659 -53676 -68670 -51782 -19215 -39543 -64355 -38169 -29425 -17399 -49172 -45488
25661 -45488 -15765 -18549 -7608 35030 -14253 -43748 -56162 -80444 -61601 -39618 -24186 12120
25649 12120 12047 20543 -1813 49306 51595 65583 75647 54691 42224 12172 -19723 -30733 -19300
25636 -19300 26092 6755 -62638 -83542 -49842 -64262 -54449 -45392 -62833 -11223 5785 -78352
25624 -78352 -27759 55327 59425 19746 18877 46306 41633 -19733 -67360 -46173 -20955 -24769 -18899
25611 -18899 11448 39889 78020 68484 23196 24553 73349 8890 -28112 -800 -15239 40663
25599 40663 68509 56622 16302 -15686 -78989 -47447 -2209 9257 27735 27904 18159 4055
25587 4055 58089 40289 61931 92621 63887 17873 -18319 -19837 -10091 25743 -12701 9562
25575I562l3780j9123J6139J6895n7236k3242J18305J8564j7627n0930k8122J7547
25563c3048l0701k7694M1585R899Q414j00192q117J6335L1139K0749R576j939
25551f3994j5502P413P1830n060k7767J3038o5023q4520N8026O6385O8177m9341
25539b6338o968J6850P4287J389k3405l2086k1783j1846R2037m165n5802k0790
25527a8620K7361j0471L5771K7820l3163k7911j2312j9251L3670L7549K2859p0455
25515g153j2681O8341K2940n6186j257K8222l6788k9029k3639N3841k0641K3208
25503I178M6210j6404r236L2508q489J3744l1706l0971L2314K0756k5480k1047
25491A1377q500O117m7822k7700n8094N0587J04677P5103J872j6866l7650J1982
$$ plain form
25575 9562 -24218 -43341 -27202 -10307 -67543 -90785 27520 46084 28457 -22473 -50595 -33048
25563 -33048 -63749 -91443 -49858 -39959 -31545 -131737 -139854 -123519 -92380 -71631 -62055 -63994
25551 -63994 -79496 -72083 -253 -5313 -33080 -20042 -85065 -169585 -111559 -45174 23003 -26338
25539 -26338 -33306 -16456 57831 59220 35815 3729 -18054 -29900 62137 57972 2170 -18620
25527 -18620 8741 -1730 34041 61861 28698 787 -11525 -30776 2894 40443 63302 -7153
25515 -7153 -19834 48507 71447 15261 14004 42226 5438 -23591 -47230 6611 -14030 9178
25503 9178 55388 38984 29748 62256 53767 67511 35805 4834 37148 57904 32424 11377
25491 11377 2877 8994 -38828 -66528 -124622 -74035 30642 105745 107617 90751 53101 65083
25479F5083K5940o0218m0200j2086L3266k299K9026P2499k5073n1795m5563l9999
25467e1419L1913L9623M511m1399m5826k2200Q5225L0890j6909n3872J996M2009
25455D542O759j4549L2852O7491P4299K2671q3987m0792l0825o3726J1027J5845
25443A607m90n318m1681l7344K91M5738P0149O932k2175j9968k2453L8806J2993
25430B7087j5610o6656n2607m260M0083P6958K8981r200J5735J867n2566r258
25418a9446M683m787M7247m3856m7087O608P8012J1322L5194K7112K1559o994
25406A09567l1369l2121n1490l4256M341J4292J5359K5494j1188O131L7348j4606
25394C7502K0795K9288n0137k215N470J1985M5139k323r2957K7138L07J6359N0304
$$ plain form
25479 65083 91023 30805 -9395 -21481 11785 9486 38512 111011 85938 34143 -11420 -51419
25467 -51419 -19506 20117 24628 -16771 -62597 -84797 428 31318 14409 -39463 -37467 4542
25455 4542 11301 -3248 29604 97095 171394 194065 110078 69286 38461 -25265 -14238 1607
25443 1607 1117 -4201 -45882 -83226 -82935 -37197 32952 39884 17709 -2259 -24712 14094 27087
25430 27087 11477 -55179 -107786 -112046 -71963 4995 33976 24776 40511 42378 -10188 -19446
25418 -19446 -14763 -19550 27697 -16159 -63246 -56638 21374 32696 67890 95002 116561 109567
25406 109567 78198 46077 -5413 -39669 -35328 -21036 -5677 19817 8629 14760 52108 37502
25394 37502 58297 87585 37448 35233 40703 52688 97827 95504 2547 29685 29992 46351 96655
25381I6655l8804n4196q081m5822L6851L4339j1524J5850K6074K0364j38946m3079
25369a10319O5440Q6770N189l0950q1468l2982N2513K3971P922J4187l0703k3417
25357e3847l8142l5305k3928L1618J0369J5373K5164P519m3409K5687N9151J6317
25345c433l1551K0443m5322K1659O4386m8109L6427M5206J1401l6406j0034o33
25333B4034J310M0701M9751p6412o8478K4360J2735m2428M9025Q5092l6412m8742
25321A4536l6305K051M9317j0156M7815j3567j5970q507j0585j10956l8866J2714
25309a18479N6673O6218O871L2762m2200p8651J5068K6401M5120O0146K2626n891
25297H6664O449p506n5257j8625K3849J2951M1994l226k1395K0365J5461k6941
$$ plain form
25381 96655 57851 3655 -4426 -50248 -13397 20942 9418 25268 51342 71706 -67240 -110319
25369 -110319 -44879 41891 47080 16130 -65338 -98320 -45807 -21836 -13914 273 -30430 -53847
25357 -53847 -91989 -127294 -151222 -119604 -109235 -93862 -68698 -61179 -104588 -78901 -19750 -3433
25345 -3433 -34984 -14541 -59863 -38204 26182 -21927 14500 59706 71107 34701 24667 24034
25333 24034 25344 66045 115796 39384 -29094 -4734 8001 -34427 14598 99690 63278 14536
25321 14536 -21769 -19718 29599 19443 67258 53691 37721 29214 18629 -92327 -131193 -118479
25309 -118479 -61806 4412 11283 44045 1845 -76806 -61738 -35337 9783 69929 92555 86664
25297 86664 93113 85607 30350 11725 35574 48525 90519 87293 65898 86263 101724 74783
25285G4783o3433j6714J2288N5304N4825k9286k3643k0620m6144n9436k5114M7525
25273c9665l7183n3445l3918R1017P4793J583M0330M3525k3660J2446Q5997J2560
25261A74380m7053p7544m5294K564k8603n3119O2540K5776L386n573M619L2979
25249D9058j1482L4970K5514o3962n4607l57k8468n8215K5762K3400L7941J3229
25237g217O030L98k0613l2306K4719J8079j1082R762P4246j6855m8134k6938j5598
25224d5509J9073N8488P438o923j9279K453j0783L8611J9963n7129K697Q915M1226
25211E9241Q428j3953O9070m9011M0478K9782n7055o2338J3500k3511Q454N220
25199B8305j9996j8268J7643M638r260k0686m2476l7900l6617n0680M3321Q6278
$$ plain form
25285 74783 11350 -5364 6924 62228 117053 87767 64124 43504 -2640 -62076 -87190 -39665
25273 -39665 -76848 -130293 -164211 -73194 1599 3182 43512 87037 63377 75823 161820 174380
25261 174380 127327 49783 4489 7053 -21550 -74669 -12129 13647 17033 11460 16079 49058
25249 49058 37576 72546 98060 34098 -20509 -20866 -49334 -107549 -81787 -58387 -20446 -7217
25237 -7217 -1187 -789 -21402 -53708 -28989 -10910 -21992 -12230 62016 45161 -2973 -29911 -45509
25224 -45509 -26436 32052 39490 32567 13288 15741 4958 43569 63532 6403 9100 18015 59241
25211 59241 67669 53716 122786 73775 114253 144035 86980 24642 38142 14631 23085 28305
25199 28305 8309 -9959 7684 12322 3062 -17624 -60100 -98000 -134617 -185297 -141976 -55698
25187e5698P3601p362m0339l2827J4759j9313M1227O7052O011n3632l8386p0879
25175a15786M0326L8557j4364M1956R655j6597l4039j5264j5318L7456L5533q281
25163a6166k7695k409m3459M4126L6139r4888J209j748J3121L8437l579p9822
25151a36734J0682Q8321L8604n8399m365M0461O2671O2528j6910k8614n5222j9764
25139a6741l6458k0055L2702M611J1116m181l462K5031k6556q7367L1748o034
25127i5646k5323K9531J7508K6001K1563J9866j7965o1608k3687O7908L7570l2788
25115c7070l5673m8185O4028P4420M591l3629m1405M3785K092j9005p557l7551
25103g1159m9322n009k67K3542K1880K6561m8986P4706K2625k0991L2554k4942
$$ plain form
25187 -55698 17903 10541 -29798 -62625 -47866 -67179 -25952 41100 47111 -6521 -44907 -115786
25175 -115786 -75460 -36903 -51267 -9311 344 -16253 -50292 -65556 -80874 -43418 -7885 -16166
25163 -16166 -43861 -46270 -89729 -45603 -9464 -104352 -103143 -104891 -91770 -53333 -56912 -136734
25151 -136734 -126052 -37731 873 -57526 -61891 -21430 41241 103769 86859 58245 3023 -16741
25139 -16741 -53199 -73254 -40552 -35941 -24825 -29006 -32468 -7437 -33993 -121360 -89612 -95646
25127 -95646 -120969 -91438 -73930 -47929 -26366 -6500 -24465 -86073 -109760 -41852 -4282 -37070
25115 -37070 -72743 -120928 -56900 17520 22111 -11518 -52923 -9138 -7046 -26051 -33608 -71159
25103 -71159 -120481 -125490 -125757 -102215 -80335 -53774 -102760 -28054 -5429 -26420 6134 -18808
25091a8808q1575j2440Q5819K5880q502K6185J9628l4737n243m5832K5019N2491
25079B7885J3973K341j2288k1769n6873m9335J245r003N9009L9653N537L2196
25067C2571L5073n3890r436O0457J9263L6056k1446o9108M803O1647L4453j6193
25055A14250p254j6393j5443N665n0203p905O6244J4881k8665l5724J9705M1934
25043A01092j01061n0682k0169K3186J1086l3013k1625p112K0419K9040L704K8838
25031a6297Q811n8274l6563J07458M5388q563l8090j5540L607k28q665m4895Q914
25018e2937M7330M4866k0204k5758m945l3467k7260K0023J9046L0694K3469M6594
25006F7451L7380J0567P759p3398m5275J2077K4449l0444K4702R839J6218l554
$$ plain form
25091 -18808 -100383 -112823 -27004 -1124 -9626 16559 36187 1450 -3793 -49625 -24606 27885
25079 27885 41858 44199 31911 10142 -46731 -96066 -94821 -103824 -44815 -5162 375 32571
25067 32571 67644 13754 4318 64775 84038 120094 98648 29540 34343 95990 130443 114250
25055 114250 106996 90603 75160 80825 30622 22717 88961 103842 75177 39453 59158 101092
25043 101092 31 -50651 -70820 -47634 -36548 -69561 -91186 -98298 -77879 -48839 -45135 -16297
25031 -16297 -7486 -65760 -102323 5135 50523 41960 3870 -11670 -8063 -8291 -16956 -61851 -52937
25018 -52937 -5607 39259 19055 -6703 -11648 -45115 -72375 -52352 -33306 -2612 20857 67451
25006 67451 104831 115398 123157 49759 4484 16561 41010 10566 35268 45107 61325 57771
24994E7771r2941j3199L6154j5661m2978K5142M995o378k3596j0179Q2182M9067
24982E0379L0552m9170l2577L4645J7183k7785p4276n559Q9300o195l0081o7220
24970g0804K2057m3803L4326N2174J480L2001j7451K5731K7017k4065j7029p754
24958A3880J1123k1744j1211O1729j2093o4571k1582m4666P9415j6972n6681K4345
24946e9028M8423k981l0043J4863K4460K4711k4249J1073K0351m308k5642J036
24934a334j2857m3917p329Q7629o703p0528p1177K9105O1938Q5572J8861n7326
24922A1934l3035P542R311k45o936o067j6470j1803K8167j8141m2992M8400L3261
24909B926m2090n8720L8486N8772K7717l8877M6876M0586k9985l208r51L7627
$$ plain form
24994 57771 -35170 -48369 -12215 -27876 -70854 -45712 -40717 -47095 -70691 -80870 1312 50379
24982 50379 80931 31761 -816 33829 51012 23227 -51049 -56608 32692 26497 -3584 -70804
24970 -70804 -48747 -92550 -58224 -6050 -4570 27431 9980 35711 62728 38663 21634 13880
24958 13880 25003 3259 -7952 53777 41684 -22887 -44469 -89135 -9720 -26692 -83373 -59028
24946 -59028 -10605 -13586 -43629 -28766 -4306 20405 -3844 7229 27580 23272 -2370 -1334
24934 -1334 -14191 -58108 -65437 22192 15489 -55039 -126216 -97111 -35173 50399 69260 11934
24922 11934 -21101 -13559 -4248 -4493 -11429 -17496 -33966 -45769 -17602 -35743 -78735 -30335 2926
24909 2926 -39164 -97884 -59398 -626 27091 -11786 35090 75676 45691 42483 41532 79159
24897G9159J7823k1952j1229n881K3683j3949k9715J2734J4453L0869J0544n5149
24885E1390o2150k8651k2297m5304K8921J13822K7989p108L1508j7149M5456J8397
24873A34824k2533k5247K0596n202n836k8928N694n5775j2034N1992M168M182
24861F5901J5927K7494q264P762k8288m6631q93l0845l6235l2593M3093Q815n5088
24848f9845L985K8480l0241J5078Q5279L1670k2918k2979J5454o5767k8608N899
24836e4513K8458l8615k5377K3886K8468K4072K3482m1664o3526n2418J5485K851
24824a29411N7860K7801j4909j7339R61J0265M9847m0673k5711P1955Q344l8312
24812c9322j6696l9147Q248L2714m296P6709L1567l4112k3054j8838j1324m403
$$ plain form
24897 79159 96982 75030 63801 57920 81603 67654 37939 50673 65126 95995 106539 51390
24885 51390 -10760 -39411 -61708 -107012 -78091 35731 63720 56612 88120 70971 116427 134824
24873 134824 112291 87044 107640 102438 96602 67674 73368 17593 5559 57551 61719 65901
24861 65901 81828 109322 101058 108820 80532 33901 33008 2163 -34072 -66665 -23572 -14757 -69845
24848 -69845 -65860 -37380 -67621 -52543 32736 64406 41488 18509 33963 -31804 -60412 -54513
24836 -54513 -26055 -64670 -90047 -66161 -37693 -13621 9861 -31803 -95329 -147747 -132262 -129411
24824 -129411 -71551 -43750 -58659 -75998 -75037 -64772 -14925 -55598 -81309 -9354 -1010 -39322
24812 -39322 -56018 -95165 -86917 -54203 -58499 18210 49777 15665 -7389 -26227 -37551 -41954
24800d1954K1394Q3877k5036l4255M95K741K9488n125N4n6545L3070j2709p9654
24787h4159k1925N3497L7509j7028J454L9314k8118o921p968N071j9345p9469
24775a28088M6236K4543m765j9695J1358J00989k927n0861m1611K0387O3925p939
24763A1552M426j9904N497n9828K078j4205M4813J2896J0337M0841q114m7627
24751a7238J3955P110J9532j6909P262R56m986n2127m7651K4161p615J4436P2487
24738A3373L5472M4052Q4418Q907m7596o4074m2474L220m253K7428k3436j0524
24726B4513O5254L055m4677j0327K2788K7384m6058j12124J5603K4760N344J1433
24714a3052k7260P740j5136j9734k3543k8260K4894K0552r496k010n96K889k1259
$$ plain form
24800 -41954 -20560 63317 38281 4026 4521 7262 36750 31625 31679 -24866 8204 -4505 -84159
24787 -84159 -106084 -52587 -15078 -32106 -30652 8662 -19456 -26377 -34345 -29274 -48619 -128088
24775 -128088 -81852 -57309 -62074 -81769 -70411 30578 27651 -23210 -64821 -44434 19491 11552
24763 11552 15978 -3926 1571 -58257 -56179 -70384 -25571 -12675 -2338 38503 30389 -17238
24751 -17238 -3283 3827 23359 6450 13712 14668 9682 -42445 -90096 -65935 -73550 -59114 13373
24738 13373 48845 92897 177315 186222 138626 74552 32078 35298 31045 58473 35037 24513
24726 24513 89767 92822 48145 37818 60606 87990 41932 -70192 -54589 -29829 -24485 -13052
24714 -13052 -40312 -32572 -47708 -67442 -90985 -119245 -94351 -73799 -83295 -85305 -85901 -83012 -104271
24701a04271k1770K1192M2020K7368k1464M0118L6650n843n3413m3145L4402O0869
24689A2713J8479K2692J9189o5455N330r342J4284Q1076O158n4495j3494N8662
24677I5797j1386k0394o4052k552N0366K1348n5162J7174m4824j6713m3856l154
24665g7408L6555J8212N8302O879j1037K1569r8o1767j7411R4102M3256k4399
24653H6755m1283J115j3422k9775j8599K8311M2880n8119p6424q294R3639J0878
24641A7662l8983L3997N943j4991N305j4794l5251p386P398J8429N1279N1535
24629H0143O660o1785r894N472L1039O0868n043Q224l4749n1268K5058l8101m4913
24616b8289J0998K2864O212n7398l7941n503M5828J0876j0063R616O6533k6840
$$ plain form
24701 -104271 -126041 -104849 -62829 -35461 -56925 -16807 19843 14000 -39413 -82558 -48156 12713
24689 12713 31192 53884 73073 7618 12948 3606 17890 98966 105124 50629 37135 95797
24677 95797 84411 64017 -35 -2587 47779 69127 13965 31139 -13685 -30398 -74254 -77408
24665 -77408 -40853 -22641 35661 42540 31503 53072 52974 -8793 -26204 67898 111154 86755
24653 86755 45472 46587 33165 3390 -15209 13102 55982 -2137 -78561 -86855 6784 17662
24641 17662 -21321 12676 18619 3628 8933 -5861 -41112 -48498 -41100 -22671 28608 80143
24629 80143 86803 25018 15124 20596 51635 112503 107460 115684 80935 29667 54725 16624 -28289
24616 -28289 -17291 5573 11785 -45613 -83554 -89057 -43229 -32353 -42416 -32800 33733 6893
24604F893q1744K3787O7094J05005K7444l9512k2521l2523j5373r267k1162o700
24592A421M8296J8527N9339P973q2889n4891m9404N4374L2723k7032n5735j0066
24580e7364l4607L0413M3242k0896n5700k1441n392K8430K9462L8293L3177J6054
24568B3671J4008J5662p8002m9687O6294K6412l7871j9459j2893O2535M6279J0962
24556F7911p1464m0388j7255m8439J4089Q7307O4900J1533J4301k4813n6689o0936
24544e9943N024K1219L5274K0624r861m0736J614P1223l373J863n897N773j2114
24531C0690J4189P6522M46j2322q3177L3741n5086n1821l7321L9953N1632o5990
24519e8544j5180O5985k2478k4897J5744o764O2103R660k6877R94K603M4636m890
$$ plain form
24604 6893 -74851 -51064 16030 121035 148479 108967 86446 53923 38550 29283 8121 1421
24592 1421 49717 68244 127583 135556 52667 -2224 -51628 2746 35469 8437 -47298 -57364
24580 -57364 -91971 -61558 -18316 -39212 -94912 -116353 -121745 -93315 -63853 -25560 7617 23671
24568 23671 37679 53341 -24661 -74348 -8054 18358 -19513 -38972 -51865 10670 56949 67911
24556 67911 -3553 -43941 -61196 -109635 -95546 -8239 56661 68194 82495 57682 993 -59943
24544 -59943 -54919 -33700 1574 22198 12337 -28399 -26785 44438 41065 42928 37031 42804 30690
24531 30690 44879 121401 121847 109525 26348 60089 5003 -46818 -84139 -44186 7446 -58544
24519 -58544 -73724 -7739 -30217 -55114 -39370 -46134 15969 25629 -1248 -254 2349 46985 42095
24506D2095M4773Q168n0708k4254k8637J1719J8357M9861l2582k4375m4134m421
24494c4138j1188L9741J1309k0095j8163l485j9044O9339K9721m6826J0251k9174
24482b1752J4261L5989J8134J8617o6539J5677j8460k2469m9999J1291N2871J8337
24470E958K0514J2819J05502j9536p8452M0196p3629m1101M6801O762j1513j3101
24458A220m61K2009M3584j5363l9167j4134j0014M768Q492n8157k6282N622J3958
24445f3925o436N6925K8488M081o9987L9432K7655k7665o8347Q326J4666p2905
24433a29692j0508K4723q191K9671L5380k2809N9514N1582K4253m1293l9442m272
24421c1084k1768J1695M1018M4459n2972j5625N1716N3317j3813j24268m0750
$$ plain form
24506 42095 86868 95036 44328 20074 -8563 3156 21513 71374 38792 14417 -29717 -34138
24494 -34138 -45326 -5585 5724 -14371 -32534 -36019 -55063 14276 43997 -2829 7422 -21752
24482 -21752 -7491 28498 46632 65249 -1290 14387 -4073 -26542 -76541 -65250 -12379 5958
24470 5958 26472 39291 144793 125257 46805 87001 13372 -27729 19072 25834 14321 1220
24458 1220 759 22768 66352 50989 11822 -2312 -12326 -7558 934 -57223 -83505 -77883 -63925
24445 -63925 -70361 -13436 15052 19133 -50854 -11422 16233 -11432 -79779 -71453 -56787 -129692
24433 -129692 -140200 -115477 -123668 -93997 -58617 -81426 -21912 29670 53923 12630 -26812 -31084
24421 -31084 -52852 -41157 -139 44320 -8652 -24277 27439 80756 66943 -57325 -98075
24410i8075N1035M624j3841N8329M0033n2464j6265R796K3909l1796m1895o732
24398g3342k276R242L6292Q359K2269K067J3776j0417L629j2242p723Q118L543
24385A295l8563m3726l4065K1137K7804J0627J8424M6139m3107J007R694k8528
24373e1862k4191J0695L0909M4167J0653K2174J3419r491k0211K3171k906J7197
24361F3724J7836K3572p8382m0781P408J0503j026j925L1375l9937Q049L1311
24349C1727K5101j0399p9800k0942K1717K6860j5316K569M5842N3912k4802o5984
24337i515k6340N9255Q5355l6329n2955k3589J3856P6767l2680k7494l9154R778
24325c045M7714J0183m5350M0916M513j1712k3880k6921p574K8663p360J2831
$$ plain form
24410 -98075 -47040 -42416 -56257 2072 42105 -10359 -26624 -16828 7081 -24715 -66610 -73342
24398 -73342 -75618 -66376 -30084 -21725 544 2611 16387 5970 9599 -2643 -10366 -2248 1295
24385 1295 -37268 -80994 -115059 -93922 -66118 -55491 -37067 9072 -34035 -33028 -23334 -51862
24373 -51862 -76053 -65358 -34449 9718 20371 42545 55964 46473 26262 49433 46527 63724
24361 63724 81560 105132 26750 -14031 -6623 3880 2854 929 32304 -7633 416 31727
24349 31727 56828 46429 -33371 -54313 -32596 -5736 -21052 -18483 27359 81271 56469 -9515
24337 -9515 -35855 23400 108755 72426 19471 -4118 9738 86505 53825 26331 -12823 -3045
24325 -3045 44669 54852 9502 50418 54931 43219 19339 -7582 -15156 13507 6147 18978
24313A8978M0796J19l2883n5434J9207J1179k7493j7157M8512L5671k6848m2922
24301b8275k9527Q0238R0181j1509l2098k4663K5292k4384j5588M158l7976m0148
24289d4299L5087K3576n1191j4328J2738k842J1640J7933r708m7738l2881M8745
24277e3268J4156O0178L7286l5076j7405M93K2542J6136M4778N1009P784l4571
24265A14042n6325j3197q3927q94P0377k2435l7248l7631L2514j1062m2215L8197
24253d9804R488J7837Q3098L8770m1464o8702o498J0056k8379J6170L1808K4578
24241C6958O845j6128J966r028o6915k8141j8306M1939O1818k3623o9612L0953
24229e1274O4955q697l5531J5136k5782j1159N7480K812L3952j2857m1778O776
$$ plain form
24313 18978 59774 59893 27010 -28424 -9217 1962 -25531 -42688 5824 41495 14647 -28275
24301 -28275 -57802 22436 112617 101108 69010 44347 69639 45255 29667 33825 -4151 -44299
24289 -44299 -9212 14364 -36827 -51155 -38417 -41259 -29619 -11686 -21394 -69132 -102013 -53268
24277 -53268 -39112 21066 58352 23276 5871 6364 28906 45042 89820 140829 148613 114042
24265 114042 57717 44520 -39407 -40301 30076 7641 -29607 -67238 -34724 -45786 -88001 -49804
24253 -49804 -40316 -22479 60619 99389 57925 -10777 -17275 -7219 -35598 -19428 12380 36958
24241 36958 43803 27675 29641 20613 -46302 -74443 -92749 -50810 11008 -12615 -82227 -51274
24229 -51274 13681 4984 -30547 -15411 -41193 -52352 5128 7940 41892 29035 -12743 -5967
24217e967M9968l428r43n998k9285J0135Q2600j6423o417j0887n8883R620k8620
24204a4528J9772J917j2001n4730N5896Q4910O5950n6866o2396K6421p547R650
24192E6448o102k5508l1178M284J3389p038K0419O087k6934P907K2796P858n782
24179C6646j74N303j3892J7003N990q7862k1544j0463P4484K1524K4459k0725
24167C0749m8448m0456M0128J9195O4519l1506j05274n2716J0859O0658j4073
24156f6365L2822J873j2504L9437J6688l3856m1293P465J7773j4030n246k4215
24144h1451K2678L6999L866M0489L3284j8742j848J8537K3246l1920K6552j1261
24132F0429N120p380M0224N5618o3630l2693p2878p70l5036m2544N541m341p888
$$ plain form
24217 -5967 44001 40573 39630 33632 4347 14482 97082 80659 74242 63355 4472 14092 -14528
24204 -14528 5244 7161 -4840 -59570 -3674 81236 147186 90320 27924 54345 46798 56448
24192 56448 50346 24838 -6340 -2056 11333 4295 24714 30801 3867 11774 34570 42428 36646
24179 36646 36472 41775 27883 44886 50876 -36986 -58530 -68993 5491 27015 51474 30749
24167 30749 -17699 -58155 -18027 1168 65687 34181 -71093 -123809 -112950 -52292 -66365
24156 -66365 -33543 -31670 -44174 -4737 11951 -21905 -63198 -55733 -37960 -51990 -57236 -81451
24144 -81451 -58773 -21774 -17908 22581 55865 37123 35275 53812 77058 45138 71690 60429
24132 60429 65549 58169 98393 154011 90381 57688 -15190 -15960 -50996 -93540 -87999 -92340 -100228
24119a00228Q6378K5608k152j2858J0629j9429J1078L4648N223j6023j1609k7021
24107a5756P2659N9342J8864k0732k7518o8051k7692l057Q521M586k8403Q694
24095a8543Q109j050k229Q575L8301j1682J3404l4765L71N0899n1918K3374k5278
24082b432k1856m306K690J107q962N1828M1564k6920o2435j314N3104L8945o6391
24069e378m9594R192L4495p505L270o7675K0322M8306l8333q919K1760r423j9380
24056f8862J7805J8236j0841n2897J5731M8416K2217l3762q379J0777M151K2308
24044a5100P249n9474J3813J7865N0669N509l2014n2106j6308K9227J1678J389
24032c7603J4789N548l2885j1874K4860N4818J7830l1273J3757N5801j967m4697
$$ plain form
24119 -100228 -13850 11758 9606 -3252 7377 -12052 -974 33674 38897 22874 11265 -15756
24107 -15756 56903 116245 135109 114377 86859 18808 -8884 -11941 -3420 1166 -27237 -18543
24095 -18543 -10434 -11484 -13713 -5138 33163 21481 34885 120 491 51390 -528 22846 -2432
24082 -2432 -24288 -28594 -25904 -24797 -33759 18069 59633 32713 -29722 -31036 22068 61013 -5378
24069 -5378 -54972 -45780 -11285 -18790 -15520 -83195 -62873 -14567 -52900 -61819 -40059 -49482 -68862
24056 -68862 -51057 -32821 -43662 -96559 -80828 -32412 -10195 -43957 -52336 -41559 -37408 -15100
24044 -15100 -7851 -67325 -53512 -35647 15022 20531 -11483 -63589 -79897 -50670 -38992 -37603
24032 -37603 -22814 -17266 -50151 -62025 -37165 17653 35483 4210 17967 73768 71801 27104
24020B7104k1325l0698L3602k7191m0796m0290l0103J3845L5918K0102L7295N0959
24008B8422M7311j9434m9548k7063j0805K0831L4142j1902k1198K7047J422K9637
23996D8862n0674j10277K0720P0429q948l4605R584r457m0897J2657N5199J617
23984c5790p1871m6568P4319J938j7951M5753Q9232O7517k4309N863n5766o6062
23972c3695l7671n7338q163Q5709Q2725k6026j0794k5766M1001Q8672R136l4280
23960G3510o6849j9237J5377N722k049n6143P404L4358P2445K6069m0427k9242
23948B0938k0463j5181Q5378j6547n3233k0207J8071m1730k5042K7294o0588p6385
23936a77695L1255P5453L1897K9065K7392N739J7607k7732j039j5539l9388k7221
$$ plain form
24020 27104 5779 -24919 8683 -18508 -59304 -99594 -129697 -115852 -79934 -59832 -22537 28422
24008 28422 75733 56299 6751 -20312 -31117 -10286 23856 11954 -9244 17803 19225 48862
23996 48862 -1812 -112089 -91369 -20940 -29888 -64493 -54909 -64366 -105263 -92606 -37407 -35790
23984 -35790 -107661 -154229 -79910 -77972 -95923 -50170 39062 106579 82270 88133 32367 -33695
23972 -33695 -71366 -128704 -136867 -51158 31567 5541 -5253 -31019 9982 98654 107790 73510
23960 73510 6661 -12576 2801 8523 6474 -49669 -42265 -7907 64538 90607 50180 20938
23948 20938 475 -14706 70672 54125 892 -19315 -1244 -42974 -68016 -40722 -101310 -177695
23936 -177695 -146440 -70987 -39090 -10025 17367 23106 40713 12981 11942 -3597 -42985 -70206
23924g0206o556M9525L907j1524j8097O9965L196K7661m8394m3079J5415O239
23912b1948J1016J1936K4197l0156q3783K3717L4747Q4718k9197r8683l745L493
23900g3688j8753k3759k0577N3389L5755J8764K0782m823L1503k5043N1694m2853
23888B391j18608j2974N2038J8342j6189N4934R309l7488n5220K0966m3745m7236
23876a73480L3149Q1316p401m7130O1499M4025L8743m9690o079M425N1214J9966
23864E0557m8150l2514j6459N6405j2496k3144p1300k1758n054K1982L0077J8557
23852e3297P1492N0250K4301J4987L1476j3770m8790p4312m7647J3624L1086L6252
23840C5652J564k3766M9930j5614P85o7315l7820q069k2705P5124J7054n3514
$$ plain form
23924 -70206 -76762 -27237 -23330 -34854 -52951 17014 20210 47871 -523 -43602 -28187 -21948
23912 -21948 -10932 1004 25201 -4955 -88738 -65021 -30274 54444 25247 -73436 -77181 -73688
23900 -73688 -92441 -116200 -136777 -83388 -47633 -28869 -8087 -12910 18593 -6450 45244 2391
23888 2391 -116217 -129191 -77153 -58811 -75000 -20066 -10757 -48245 -103465 -82499 -126244 -173480
23876 -173480 -140331 -59015 -66416 -113546 -52047 -8022 30721 -18969 -25048 -20623 30591 50557
23864 50557 2407 -30107 -46566 9839 -2657 -25801 -97101 -118859 -123913 -101931 -71854 -53297
23852 -53297 18195 68445 92746 107733 139209 125439 76649 2337 -45310 -31686 -600 35652
23840 35652 37216 13450 63380 47766 48551 -18764 -56584 -64653 -87358 -12234 4820 -48694
23828d8694M6615M9214n2047n314m9006n2871K6231J21422n9347l0670J8400K085
23816c3982O419J9246K6147j8931n4780o5099l4656J6301J5621O5273K3052m910
23804d0299K121L0862M9191k1445q035O6012J3834n1333o072k3685o5441j0873
23792f5163m1462N215P9001O772j91j09o1888l8855L4159M0946L0808l9993k0526
23779g1286L674j1125j7139N6126m87j2362j8408l169k0577K0551j2981n62M5982
23766d1763P586k9267L6561j060n517L63j9482P5522K1778j4742j9132J8119K1177
23753E0143l9596K212L1031j0197l7343m042N3299n0733o7581J0142L4661o979
23741c4983n086R330L2360m37l5513L579M8590K1807j9191l1958l6800L3432P731
$$ plain form
23828 -48694 -2079 47135 -4912 -10226 -59232 -112103 -85872 35550 -23797 -54467 -36067 -33982
23816 -33982 -27563 -8317 17830 -1101 -55881 -120980 -155636 -139335 -123714 -58441 -35389 -40299
23804 -40299 -38178 -7316 41875 20430 12395 78407 92241 40908 34836 11151 -54290 -65163
23792 -65163 -106625 -101410 -22409 -15637 -15828 -15937 -77825 -116680 -82521 -41575 -10767 -50760 -71286
23779 -71286 -67612 -78737 -95876 -39750 -40237 -52599 -71007 -74176 -94753 -74202 -87183 -87745 -41763
23766 -41763 -34177 -63444 -26883 -27943 -33460 -33097 -52579 22943 44721 29979 10847 28966 50143
23753 50143 10547 12759 43790 33593 -3750 -7792 45507 -5226 -72807 -62665 -28004 -34983
23741 -34983 -40069 -30739 1621 1184 -34329 -30750 17840 39647 20456 -11502 -48302 -14870 -7139
23728g139N32Q477j5129J5613K7554m6724p0396n2529P3750O0057M8800K1777
23716F4643J2360j8729q4363l7727J1646L5364M200k0678M3393k0843l2196r8043
23704a40973m9888J4933Q6583N2945j2382J7514m1617p41j3039J1150j6283L7614
23692e4184L8598J6323j8383m241k2214K5854K2881N5836k5221l0861o5245k3453
23680h4310O734M5020L5952K7295M343r2943l1895M9032L1455M0958J6976o6740
23668a8123l8691J0847N0010M5443o9172q1929J921L1622O9970m2089o2253n914
23656a08358L5334O3316j6890q5774o3045K8660J8793l5994N219K4434N1060j095
23644h4340r997l5453K5761N2896j4083n591m108K3501K6907n130o010L3822l9
$$ plain form
23728 -7139 -6607 1870 -13259 2354 29908 -16816 -87212 -139741 -65991 -5934 42866 64643
23716 64643 77003 58274 -26089 -63816 -52170 -16806 -12606 -33284 10109 -10734 -42930 -140973
23704 -140973 -190861 -175928 -89345 -36400 -48782 -31268 -72885 -73626 -86665 -75515 -91798 -54184
23692 -54184 -15586 737 -17646 -21887 -44101 -18247 4634 60470 35249 4388 -60857 -84310
23680 -84310 -77576 -32556 3396 30691 35034 -57909 -89804 -40772 -9317 31641 48617 -18123
23668 -18123 -56814 -45967 4043 49486 -19686 -101615 -99694 -68072 1898 -40191 -102444 -108358
23656 -108358 -73024 -9708 -26598 -112372 -175417 -146757 -127964 -163958 -158739 -134305 -83245 -84340
23644 -84340 -94337 -129790 -104029 -51133 -65216 -70807 -74915 -51414 -24507 -29637 -35647 -1825 -1864
23631a864k5883K9768q747m5448k4592l5770j4669j8120l2884J9480k129J3983
23619a46875L7543K3810J8504J5383N737J7980J8297j1606J5115j5938k552m3424
23607f8026j9369M1889j879o7541P8914m1351j2710L3792n212J7463L1318M1188
23595B8476j8075j0011k1741l2964R818l90J1105M5323k1960L4218O0075m2550
23583D1324j2761J384m0379J1124L187M415Q080j5989M4299j8227l3619O677O146
23570E661L2591Q3635J0996l9041j4263K8365K4753k9253j9585n899l2189k9913
23558A5858m9201j3926k364K5616r3304n6576O3842J2920k8335N9025p202m0901
23546a14548k744N2386L5354L2107N0396r489j6257n2765k2331M5474l7508l3462
$$ plain form
23631 -1864 -27747 2021 -6726 -52174 -76766 -112536 -127205 -145325 -178209 -158729 -160858 -146875
23619 -146875 -109332 -85522 -67018 -51635 -45898 -27918 -9621 -21227 -6112 -22050 -24602 -68026
23607 -68026 -87395 -45506 -47385 -114926 -36012 -77363 -90073 -56281 -61493 -44030 -12712 28476
23595 28476 10401 390 -21351 -54315 -44497 -44887 -33782 11541 -10419 23799 83874 41324
23583 41324 28563 29947 -10432 692 3879 8294 16374 385 44684 26457 -7162 -485 5661
23570 5661 38252 121887 132883 93842 79579 107944 132697 103444 83859 77960 45771 15858
23558 15858 -33343 -47269 -49633 -24017 -117321 -173897 -110055 -97135 -125470 -66445 -73647 -114548
23546 -114548 -117292 -64906 -29552 2555 52951 43462 27205 -25560 -47891 -2417 -39925 -73387
23534g3387K6861J964K791M2452L3723m0981k9761J6409j3994K158O2827K6615
23522E7677k2568j2016M5428L832k861j0190j3989J3152J5081J530m1832j502
23510C1742L141k8801o0083J9404L7870L83K9941K0069K0732m342K1580k3368
23498F8268q7755l1275M566J9365K13J0211l9838k378j1205j8077N6484J0812
23486b0609k3063M4572O8441l3290j7212M496q2120j8608P2595K3293J228J440
23474B1163l3368j9607r930j1294o16J146l9551o2340L8855P1754p751O3287J6287
23461B8035L353q6565L0566K9021q608J6613j9716j9705K8091l8529m2957O2690
23449a7711M302K1841k2215m1770M5199M7116J5288J3699j00684k3463Q5612L7794
$$ plain form
23534 -73387 -46526 -44562 -41771 681 34404 -6577 -36338 -19929 -33923 -31765 31062 57677
23522 57677 35109 23093 68521 72353 69492 59302 45313 58465 73546 75076 33244 31742
23510 31742 34883 6082 -54001 -34597 3273 3656 33597 53666 74398 70056 91636 68268
23498 68268 -19487 -50762 -46196 -26831 -26618 -16407 -56245 -58623 -69828 -87905 -31421 -20609
23486 -20609 -43672 900 69341 36051 18839 23335 -58785 -77393 -4798 18495 19723 21163
23474 21163 -12205 -31812 -41742 -53036 -53652 -52506 -92057 -154397 -115542 -43788 -51539 11748 28035
23461 28035 31388 -55177 -24611 4410 -4198 12415 -7301 -27006 1085 -37444 -80401 -17711
23449 -17711 -13409 8432 -13783 -55553 -10354 36762 52050 65749 -34935 -58398 27214 65008
23437F5008p3828k6367Q971o7613k5491M4866K0147M3856J1869j1839r194K204
23425a7411N2067R8686M0546p4675j04958o5009n539L0476L0931P0383J2518K192
23413G0207m1874j01087o4698K1380L1602N3338M9858K6788m0854K7612J1453
23402D3725l6558O350j8083k4740J3985K9780Q732k4441J0700p177l0969r148
23390c7844K2226l3236r658N4414j4571q954K195L98K6091J3304M219J5558O597
23377D0739j7324J7640l7471p112L344J1128K6094j7758J053L0456n7288k7153
23365c3652j5876J8162L155J1610L7150R672J3433k5797j7852j0446l2521m3714
23353h6676O9501K8379M0889J4425k4834M72m6375m5644j1395N19N5264M0091
$$ plain form
23437 65008 -8820 -35187 -26216 -93829 -119320 -74454 -54307 -10451 1418 -10421 -19615 -17411
23425 -17411 34656 133342 173888 99213 -5745 -70754 -76293 -45817 -14886 55497 68015 70207
23413 70207 28333 -72754 -137452 -116072 -84470 -31132 18726 45514 4660 32272 43725
23402 43725 7167 13517 -4566 -29306 -15321 14459 23191 -1250 9450 2273 -28696 -37844
23390 -37844 -15618 -48854 -58512 -4098 -18669 -27623 -25428 -25030 1061 14365 18584 34142 40739
23377 40739 23415 41055 3584 -3528 -184 10944 37038 19280 20333 50789 -6499 -33652
23365 -33652 -49528 -31366 -28211 -16601 20549 30221 43654 17857 5 -10441 -42962 -86676
23353 -86676 -17175 11204 52093 66518 41684 42156 -4219 -49863 -61258 -60739 -5475 34616
23341C4616l01k9718m0508k7070M0547L2965N2563l2492L1461k6280m4445l5502
23329d4164K9770j1639p5081K3486L2365J0020M5835K1231n0935q3024q552l7367
23317a48055L8470m03J9224M4731N6450J910l9750K7406J5440l8660M5230M3902
23305F5895j5825p102l052J686M744M9866P020o5018o3095k0244n4572p734l2466
23292a39897p050R5394K9417l2164k0677N9176k9446q5205N1700P6205N184P2972
23280G5609N7987k6889m0269M0207J359o9562m7454m6355L1390N0945P0226L1223
23268A28417n0442M8797K43o4394k1935N708m4680o128Q4187O4761k1520n9381
23256F3633m7021L8268O2309q198L3096K5153k3477p4222n8414p171M8703q367
$$ plain form
23341 34616 34315 4597 -35911 -62981 -22434 10531 63094 30602 62063 35783 -8662 -44164
23329 -44164 -14394 -26033 -101114 -77628 -45263 -35243 10592 31823 -19112 -102136 -110688 -148055
23317 -148055 -109585 -109988 -90764 -46033 10417 12327 -27423 -17 15423 -23237 21993 65895
23305 65895 50070 42968 39916 41602 46346 96212 103232 38214 -24881 -45125 -99697 -107431 -139897
23292 -139897 -146947 -51553 -22136 -54300 -74977 -15801 -45247 -130452 -78752 -2547 2637 75609
23280 75609 133596 106707 66438 106645 108004 38442 -9012 -55367 -23977 26968 97194 128417
23268 128417 77975 126772 127015 62621 40686 46394 1714 -4414 79773 144534 123014 63633
23256 63633 16612 54880 117189 108991 142087 167240 143763 69541 11127 3956 52659 44292
23244D4292j2779n243j4858p566L7934K1605J7556m7773k6473n7029m2072R0946
23232a460O5493k5060J182M68J9669l4683k5319l4605k6590M8391L6451l812m607
23219A5518P275K8451N504l0137j7249J3600j8707n4367m823M4052l070L778K7202
23206A7027J5969p0959n5829J259J4137O7246j4891m0181N1387M9541p0170l7089
23194g2553M7681J9183R6245j9735j32o526n2266j3758q9759p1450L6018M5736
23182h1316J3538j1740K087J9851k1376K5140M4520q807J286K9442k4606J5315
23170C334K2461j2012l7478p852m4950m0492M909O1748M5432J5512O175l8553
23158b1766M4248K3978K0401q6922J3717R691o3141J1354P0560k1842m270O1454
$$ plain form
23244 44292 31513 26270 11412 3846 41780 63385 80941 33168 6695 -50334 -92406 -1460
23232 -1460 64033 38973 40155 40623 60292 25609 290 -34315 -60905 -12514 23937 20125 15518
23219 15518 22793 51244 56748 26611 9362 22962 4255 -50112 -54935 -10883 -13953 -10175 17027
23206 17027 32996 -37963 -93792 -92533 -78396 -11150 -26041 -66222 -14835 34706 -35464 -72553
23194 -72553 -24872 -5689 90556 70821 70689 64163 11897 -1861 -91620 -163070 -127052 -81316
23182 -81316 -67778 -79518 -77431 -57580 -78956 -53816 -9296 -18103 -16817 12625 -11981 3334
23170 3334 25795 13783 -23695 -31547 -76497 -116989 -112080 -50332 -4900 10612 16787 -21766
23158 -21766 22482 46460 66861 -20061 -6344 3347 -59794 -48440 22120 278 -3992 57462
23146E7462O679l187J470j2057n5728m3650p901j0173L4910R130j1124k3172l3489
23133i0830K5319o24J0139l9368O9015q29k5135J0886N0740k6050n2341L806P334
23120e7938L0686J653l3492k1248L8205O3489M7988L8728r804j11377p5184k8315
23108a16609j0608N8408O6658r366J4951O1756O971J3112L6743J9551j4210p4817
23096E2540n1939k5635N373m0384k1620L3061K6996m360l1994N051M6489Q951
23084B529l389p0696l2437K5129M5298m3090j9102q162m2909k862O4709Q6803
23072A821L4022K1116k5244k3812K3956J7487J999p035K9126J0400R879J3059
23060A06774r1064o9026J1759K1852K4351l3408r3909J530K2635M4555l62M4419
$$ plain form
23146 57462 64141 60954 62424 50367 -5361 -49011 -56912 -67085 -32175 -23045 -34169 -57341 -90830
23133 -90830 -65511 -66135 -55996 -95364 -26349 -27178 -52313 -41427 9313 -16737 -69078 -65272 -57938
23120 -57938 -27252 -25599 -59091 -80339 -42134 21355 69343 108071 98267 -13110 -88294 -116609
23108 -116609 -127217 -68809 -2151 -11517 3434 65190 72161 85273 122016 141567 127357 52540
23096 52540 601 -25034 -19661 -60045 -81665 -48604 -21608 -25968 -57962 -52911 -6422 2529
23084 2529 -860 -71556 -103993 -78864 -33566 -76656 -95758 -103920 -146829 -149691 -84982 1821
23072 1821 35843 56959 31715 7903 31859 49346 51345 44310 73436 83836 93715 106774
23060 106774 15710 -53316 -41557 -19705 4646 -28762 -122671 -121141 -98506 -53951 -54313 -9894
23048i894j7438N498j1326l567J1860m4924o204K3703K277M3278K1388L0749M8189
23035I3589J2459l6363k3062K5052p9191r4667K114K9407L8379K9392j9106O66
23023b1331k5892q0631k212K7348L7473K9986K4158K8202J4712n138J2693M3489
23011H2857l4812r1734K055M5915N671l3477j02393J5102L9289m1801L6031O7284
22999a0013j7283m5334J0595l8834m9988K4579O2036Q1684P8358K2716j5314q5874
22987A7328k4789r684q0584N408K0299j0070k7562j5350M9447Q9105J9395n9832
22975b6889l7831k7026r131N2477M4354K7904N439p5851o7137K3393M1397K8256
22963b0645J0183K7506k9808k0940r370M6328Q6796p274m8396p1534n829J0538
$$ plain form
23048 -9894 -27332 -21834 -33160 -36727 -24867 -69791 -75995 -52292 -50015 -6737 14651 45400 93589
23035 93589 106048 69685 46623 71675 -7516 -102183 -100069 -70662 -32283 -2891 -21997 -21331
23023 -21331 -47223 -127854 -130066 -102718 -65245 -35259 -11101 17101 31813 26675 39368 82857
23011 82857 48045 -43689 -41634 4281 9952 -23525 -125918 -110816 -71527 -113328 -77297 -10013
22999 -10013 -27296 -72630 -62035 -100869 -150857 -126278 -64242 17442 95800 118516 103202 17328
22987 17328 -7461 -17145 -97729 -92321 -72022 -82092 -109654 -125004 -75557 13548 32943 -26889
22975 -26889 -64720 -91746 -100877 -48400 -4046 23858 29297 -46554 -113691 -90298 -48901 -20645
22963 -20645 -10462 17044 -12764 -33704 -43074 3254 90050 82776 34380 -37154 -42983 -32445
22951c2445K2627K0829l570l9121n8118K4906J2058j5123R7838J4943k7166j9368
22939a710m5749J0007M681K537M3272k4997j7940K0721j6536k779P1963j9591
22927B3879n1359j2728k0626j0717j2203Q950N2342R88j4929j5259O0382N5402
22915F4122K1635l2264o5205J2368j31l3465k2437K3315L7489L4195M1581K1026
22903A02229q1491n7297L3437q220K6687L5037M5623J6235j6765p2351l9805M1141
22891B4460J5945k2495M2272L3189l4560J6482J0021K9210o1482m2678n6299k6966
22879g2901l7231L1932J2511O2877j516n6686k3867L5902N2044j1344p834K5154
22867I041K813k1016l0039J431J7313k1877l889m9743L9680K8553j0321k1699
$$ plain form
22951 -32445 -9818 11011 7441 -31680 -89798 -64892 -52834 -67957 29881 44824 17658 -1710
22939 -1710 -47459 -37452 -32771 -30234 13038 -11959 -29899 -9178 -25714 -28493 43470 23879
22927 23879 -27480 -40208 -60834 -71551 -83754 -74804 -22462 -21474 -36403 -51662 8720 64122
22915 64122 85757 53493 -11712 656 525 -32940 -55377 -32062 5427 39622 81203 102229
22903 102229 20738 -36559 -3122 -11342 15345 50382 96005 112240 95475 23124 -16681 24460
22891 24460 40405 17910 60182 93371 58811 75293 85314 114524 53042 10364 -45935 -72901
22879 -72901 -110132 -78200 -65689 -2812 -4328 -61014 -84881 -48979 3065 -8279 -16113 9041
22867 9041 11854 -9162 -39201 -37770 -20457 -42334 -46223 -95966 -56286 -27733 -38054 -59753
22855e9753K0697P5133K5757k4274J0965O141J7951n336m7701p5392L4218j9652
22843d1246L817M4975P6320j7412o129n852k8365N641m5412m0283j9865J2542
22831f1269M9255M9346M8742m4616k7566r810l0456n9146M4182J9567J667N3020
22819C2916m1653M0393O3495j2434o7499p05L6142k2800m6345P3107O3810J0420
22807A28847n4244n7716l1766J7251N459j4835L1297N1354O560l9458o4903l2869
22795e5023L9585l416M0314J3729j5538k6218J7552O577J0940P276k4030n894
22783E854k3379j5796M9964j52j2073k3482r847j5955J3924L6426K8272K5208
22771E8964n4576j1380k1449m1803P1120L3260m4479l3711n930L0121K7298j8810
$$ plain form
22855 -59753 -39056 36077 61834 37560 48525 54666 72617 67281 19580 -55812 -21594 -41246
22843 -41246 -37429 7546 83866 66454 60325 54473 26108 31749 -13663 -53946 -73811 -61269
22831 -61269 -12014 37332 86074 41458 13892 4082 -26374 -85520 -41338 -21771 -20104 32916
22819 32916 -8737 31656 95151 82717 15218 14513 50655 27855 -18490 54617 118427 128847
22807 128847 74603 16887 -14879 2372 7831 -7004 24293 75647 82207 42749 -22154 -55023
22795 -55023 -15438 -18854 21460 35189 19651 -6567 10985 17562 28502 35778 11748 5854
22783 5854 -17525 -33321 16643 16491 4418 -19064 -28911 -44866 -30942 5484 33756 58964
22771 58964 4388 -6992 -28441 -70244 876 34136 -10343 -44054 -49984 -19863 7435 -11375
22759a1375L971M7459K7910j2447j8606j2238K284J0549q8447o9172M7444L7064
22747c5604N5436L2953J1670N2002o796j0464Q93o7087k4109N3579r900p5380
22735b2807n6273N9764J0242n439m6160j9878L4969P4487N350o2871K4689m6147
22723e0074m8572j6383j5414O3758j3499J3267O752J2280L6410j9031l9134l6146
22711a05786N2885L5323K6550k0061q309j7471L0422O3284J8356k4750K5229n631
22699G0041l5891j8019K6646r744n1678l5136L2493M8962k6276n5509j2225O8979
22687B643L0110m3661m4215L1246J1245J5494L7735k1018l1712J8304L5590K2509
22675F4270j0700j6390k702N8583j2742k8803P040K0049J2722k2678k5791p697
$$ plain form
22759 -11375 -7404 40055 67965 55518 36912 24674 26958 37507 -50940 -120112 -72668 -35604
22747 -35604 19832 52785 64455 116457 109661 99197 100090 33003 8894 62473 52573 -22807
22735 -22807 -79080 -19316 -9074 -14513 -60673 -80551 -45582 28905 34255 -28616 -3927 -50074
22723 -50074 -98646 -115029 -130443 -66685 -80184 -66917 -60165 -47885 -11475 -30506 -69640 -105786
22711 -105786 -52901 -17578 8972 -11089 -19398 -36869 -6447 56837 75193 50443 75672 70041
22699 70041 34150 16131 42777 33033 -18645 -53781 -21288 27674 1398 -54111 -66336 2643
22687 2643 32753 -10908 -55123 -23877 -12632 2862 40597 19579 -12133 6171 41761 64270
22675 64270 53570 37180 34478 93061 80319 51516 58556 78605 91327 68649 42858 35161
22663C5161L2627j3657l7216k2507n1812N7237N0675Q327o5671n3447P1048O5746
22651G6511K7901l6306n8111m9795K5670j6813N0715l995l0422j1973k5904l2002
22639h4524l2684K3416p635L5337L6806m9264L504l3660K2688n589M5321K9839
22627a6445K5156O1975J0287n0148m7896J1689N985k5668K6127j3712L1189J059
22615A9598J6484j843J3876n599M1031o0861m6392J5051R739N116N888l6573m693
22602b9178j3110j603K2460j9116R972K2830n1633k0488J6653J04971N6309L9037
22590A37104k1691m4326L9067p863p4910k1126k2938M5845N8176J7803k7234l8022
22578C9885J9493j2929k3367M9932k8168j4707O7657R841j07532l2727j0050J1171
$$ plain form
22663 35161 67788 54131 16915 -5592 -57404 -167 50508 58835 -6836 -60283 10765 76511
22651 76511 104412 68106 9995 -39800 -14130 -30943 19772 15777 -14645 -26618 -52522 -84524
22639 -84524 -117208 -93792 -101427 -66090 -29284 -78548 -75044 -108704 -86016 -91605 -46284 -16445
22627 -16445 8711 70686 80973 30825 -17071 -5382 603 -25065 1062 -12650 18539 19598
22615 19598 36082 34239 48115 42516 83547 22686 -23706 -8655 1084 6200 12088 -24485 -29178
22602 -29178 -42288 -43891 -21431 -40547 -30575 -7745 -59378 -79866 -63213 41758 98067 137104
22590 137104 115413 71087 110154 102291 27381 6255 -16683 29162 87338 105141 77907 39885
22578 39885 59378 46449 23082 73014 44846 30139 97796 107637 105 -32622 -42672 -31501
22566c1501L0905N2793J2449j3984m3719n8608l5422M0743N944O969L3811K5280
22554B5660k3412K8152l0080p557l2586l1184K699Q9599N8571j7778q3867J71
22542b1612k4163N4183Q4317o808j09926p8144J0096K3792m7272j5862P7069L8566
22530a5764K8288k1308l5474K9708O2089l4243m4728L153j7297k5068Q0852M0208
22518E0416k3221K654l7240O0410K1739j8026j16146j8663M3598N6398j3749n5608
22506d7438M249L0899M3897M0250m8689l237m793m6210p9665L2587J5390p799
22494g0559N3465M6665p277k9473O303J5210p2866o5221L4589L1634n057J5445
22482d7142m5904N1048M9458M6522L861L5019J4176l260L5364M0439L3592N450
$$ plain form
22566 -31501 -596 52197 64646 50662 6943 -51665 -87087 -46344 -40400 -33431 380 25660
22554 25660 2248 30400 320 -7237 -39823 -71007 -68308 21291 79862 62084 -21783 -21612
22542 -21612 -45775 8408 92725 85917 -24009 -102153 -92057 -68265 -115537 -131399 -54330 -15764
22530 -15764 12524 -8784 -44258 -14550 47539 13296 -31432 -28279 -45576 -70644 10208 50416
22518 50416 27195 29849 -7391 53019 74758 56732 -59414 -78077 -34479 21919 8170 -47438
22506 -47438 -43189 -12290 31607 71857 23168 19931 15138 -31072 -110737 -78150 -62760 -70559
22494 -70559 -17094 29571 22294 -7179 -876 14334 -58532 -123753 -89164 -57530 -62587 -47142
22482 -47142 -93046 -41998 7460 53982 57843 92862 107038 103778 139142 179581 213173 218623
22470B18623Q4606Q1798M5921J57053K47801L74269M23911K04676j72098l55222
22460A311338l59375k60831k38307j54542n4448m0521m2205j672J0808q5884j05067
22449b0706J0376N265N852L3699K7157l1381j6577n5198k7303k4909N4677N9263
22437B0215K1992l9455L4463N7756J7745J0119N307k1013l6126k3139m5181j2351
22425i668J2447r059Q6730J8285o3068m33L2242j5807k3392J2283N309m9219m0493
22412d3843o3992M209J4849P536K9339p925r624l6315k0136O8700O7824Q597J7938
22399C7157L3144p824l028n123J945q694J1026L7150k4061r5514J7861k916N9437
22386E0560j0692o9915r6357O7341O7468Q228n6N0482n854N831N1747K2331L3737
$$ plain form
22470 218623 303229 385027 430948 588001 835802 1210071 1633982 1838658 1666560 1311338
22460 1311338 951963 691132 452825 298283 243835 203314 161109 159437 170245 84361 -20706
22449 -20706 -10330 -5065 787 34486 61643 30262 13685 -41513 -68816 -93725 -39048 20215
22437 20215 42207 2752 37215 94971 112716 122835 128142 107129 71003 47864 2683 -9668
22425 -9668 2779 -6280 80450 98735 35667 35234 67476 51669 28277 40560 45869 -3350 -43843
22412 -43843 -107835 -103626 -88777 -81241 -51902 -59827 -69451 -105766 -125902 -57202 10622 19219 37157
22399 37157 70301 62477 59449 54326 56271 47577 58603 95753 71692 -23822 -5961 -8877 50560
22386 50560 39868 -30047 -126404 -59063 8405 16633 16577 67059 61205 67036 118783 141114 174851
22373A74851n2735n0441M9631J056M910q0371p7017K8771P2501l762j2774n9815
22361e195J7122J5626r4446k5500L0466N3774p809M8117M6266k0461M456O183
22349F8599o3988l7435n0236k3941M5369P0549P8711j9922p3181J3516M5260J3458
22337F6759j0649l3110m3791K9658o81P485j5486K212q452j9361L6339P910k4135
22324e302K6987M8205O500k8524l4826l2745J0692L7050l4829l992N4342J9364
22312F2922m6761K6197n0652l2841J5845K2669M5111K7435k8328k3354K0994k7551
22300A1686n6959o8961L4506O1726L2885L6574J7125Q031l3713m9761J6864K4830
22288C4833L1949L4330m1837J1922K2403p4981O568N7134k1266m5036l6475P3766
$$ plain form
22373 174851 122116 71675 121306 122362 127272 46901 -30116 -1345 71156 67394 54620 -5195
22361 -5195 11927 27553 -66893 -92393 -61927 -8153 -15962 32155 78421 57960 62416 68599
22349 68599 4611 -32824 -83060 -107001 -61632 8917 87628 67706 -5475 8041 53301 66759
22337 66759 56110 23000 -20791 8867 8186 15671 185 2397 -6055 -25416 10923 18833 -5302
22324 -5302 21685 69890 76390 47866 13040 -19705 -9013 28037 -6792 -10784 43558 62922
22312 62922 16161 42358 -8294 -41135 -25290 -2621 42490 69925 41597 18243 39237 11686
22300 11686 -45273 -114234 -79728 -18002 14883 51457 68582 76613 42900 -6861 10003 34833
22288 34833 66782 101112 59275 71197 93600 18619 25187 82321 61055 16019 -20456 53310
22276E3310Q895l6580k6573k953K7161R664j8658n645N1091K8965j4783K6115
22264A00009n3591p0978n2372J5802K5253P076j112K6411K6558L2500j344K2319
22252G6531q572o1581k5772J4920K2652O462K731J0449L2506J8982J1052p771
22240I2589p4666k8831K2667L4878J0183K433k0092K0829K1728M1107l4248m2834
22228D5743j2694p1137p0939J9549J5890N4696J1992o8849l0022l1175j18012
22217b54958n8452R474Q8083J11675J25997O4468j0130M5755J6613K364k4412
22206A16477m2141j1039k5412J0726k3747L015L6124J2811o2205J0875M1949K8586
22194I6019k4875K780k4942n1209O6670J7254o4145O4756O5485m1366J477k1863
$$ plain form
22276 53310 62205 25625 -948 -3901 23260 32924 14266 8621 59712 88677 73894 100009
22264 100009 46418 -24560 -76932 -61130 -35877 -28801 -29913 -3502 23056 55556 54212 76531
22252 76531 67959 6378 -19394 -4474 18178 24640 27371 37820 70326 89308 100360 92589
22240 92589 17923 -10908 11759 46637 56820 59253 39161 59990 81718 122825 88577 45743
22228 45743 33049 -38088 -109027 -89478 -73588 -18892 -6900 -75749 -105771 -136946 -254958
22217 -254958 -313410 -303936 -215853 -104178 21819 86287 76157 121912 138525 140889 116477
22206 116477 74336 63297 37885 48611 24864 27879 64003 76814 14609 25484 67433 96019
22194 96019 71144 73924 48982 -2227 64443 81697 17552 82308 147793 106427 107904 86041
22182H6041j5889M8935O652m9404j3647Q7438l7380k7822L901K1243K0708m16
22170A30360M2139N7377Q8055L6952J3908j6286j54135p5197r1266o0857L375
22159b5575l0565j1141N1350M9090M7085L6688j9568l1944L0664J8156M417k9336
22147H9321r364m9734k0888N3396M6938O4131R257l3355r498n0325p7661K5939
22135C8157k9512L4173M686j3073N5298O3449j8731N2953M0871o24n1388j8613
22123A57646k1013K4967n6322k6224m063L672J621o654R809k0361J4773J8344
22111I6195j3661m9011O550P8879K8207n8206j04355m9532l7548N2248L623M4440
22099b171L5504M4969j372k421L3825n493j7840j68M341M5330m192l0322j4958
$$ plain form
22182 86041 70152 119087 125739 76335 62688 150126 112746 84924 88825 110068 130776 130360
22170 130360 172499 229876 317931 354883 368791 352505 198370 123173 31907 -28950 -25575
22159 -25575 -56140 -67281 -15931 33159 80244 116932 97364 65420 96084 114240 118657 89321
22147 89321 79957 30223 9335 62731 109669 173800 183057 149702 140204 89879 12218 38157
22135 38157 8645 42818 47504 34431 89729 153178 134447 187400 228271 227647 176259 157646
22123 157646 136633 161600 105278 79054 74991 78663 80284 73630 83439 63078 77851 96195
22111 96195 82534 33523 40073 118952 147159 88953 -15402 -64934 -102482 -50234 -46611 -2171
22099 -2171 33333 78302 76930 74509 108334 102841 85001 84833 89174 134504 130312 99990 85032
22086H5032L8674r5311o3135P6709Q4853Q875k4930K5843L9791l864l866K8405
22074A97076j7562J9788K152k6650o0460q1325o2273j3743L4385k6807n8188K4489
22062f9118K7803J3122M4208N9397J6093M2450L2847P596n3599o492n716N2064
22050A60655K69J188o9923m0523m4515l55Q2626N1656m0739j23738n0005P0858
22038b546N5734L6106M8462R177L078R104M4549J11834J01388N3130m6049K2880
22026D46847J04310J91366K28206L37688M99349M40699r6671m48757n23913l97320
22016G81804k58490r8025o4311l3746J6809n1039n9752n7954k3967K2262N1300
22005B24891N9930j0388p7044m9083k2838j1116n119k4420M0347M5834K157N7890
$$ plain form
22086 85032 123706 28395 -34740 41969 126822 135697 110767 136610 176401 172537 168671 197076
22074 197076 179514 199302 201454 174804 114344 33019 -29254 -42997 -8612 -35419 -93607 -69118
22062 -69118 -41315 -28193 16015 75412 91505 133955 166802 174398 120799 114307 108591 160655
22050 160655 160924 162112 92189 51666 7151 6796 89422 141078 100339 -23399 -73404 -2546
22038 -2546 53188 89294 137756 146933 150011 159115 203664 315498 416886 470016 423967 446847
22026 446847 551157 742523 970729 1308417 1807766 2248465 2151794 1703037 1179124 781804
22016 781804 523314 425289 360978 327232 344041 293002 233250 175296 151329 173591 224891
22005 224891 284821 274433 197389 148306 125468 114352 109233 84813 125160 170994 173151 231041
21993B31041p397J6033J4795N3547K3800K1954k2563m7398m1568n034P6938k4508
21981B89640q0551K5394O2320J7733P6823O6351o9284K9435N6752p101o834p197
21969D53481K8554K7599O0586N0662K8646m51O6962O7725N2037Q211P8699P2234
21957I94945N3686K2240j4882Q3099K6309J1124Q6900J14849Q5268Q8364O9273
21946A621175O7841J52300J31928J23480J88853J42496J39476K75368L06168L71717
21936C520802L80130M40820N20346O22173P35466P53575Q30434J193797J870134
21927A0867677K697899L500183M221584M669786N011131N650477O889281Q927982
21919E2436000J2928252K0011806L2930083N5427973Q6506064R4901938J9835697
$$ plain form
21993 231041 223644 239677 254472 308019 331819 353773 331210 283812 242244 237210 314148 289640
21981 289640 209089 234483 296803 314536 391359 457710 388426 417861 474613 467512 460678 453481
21969 453481 482035 509634 570220 620882 649528 649077 716039 783764 835801 844012 922711 994945
21957 994945 1048631 1070871 1055989 1139088 1165397 1176521 1263421 1378270 1463538 1551902 1621175
21946 1621175 1689016 1841316 1973244 2096724 2285577 2428073 2567549 2842917 3149085 3520802
21936 3520802 3900932 4341752 4862098 5484271 6219737 6973312 7803746 8997543 10867677
21927 10867677 13565576 17065759 21287343 25957129 30968260 36618737 43508018 52436000
21919 52436000 65364252 85376058 118306141 173734114 260240178 355142116 374977813
21912C74977813o1305103q3615128p9261943n4161616l1308962j8488728j1684581
21905C5151752p840570n592926l985300k881267k196814j766959j458199j265851
21897H163866j203993j039718q64543p28803m71684l10221k80021k36038k13420
21888B815425j86630j70134k04427j39094q0446p0404j44300j86301j46294j17982
21878A369413o5984q1685q3593j15419l1990N5969k7267j07807j23650m5148l3170
21867G09669j0837K7093M531l8326j5582J2055j0754m1201n2441P92L9351l8843
21855E85507m5378o7159q1459l7821K8092k0116l0683M6242N4168K1456k9582
21844D23267m8656r379M3702j8473p9846J2354j4915m4486k7493J3015J1432K5635
$$ plain form
21912 374977813 313672710 230057582 150795639 96634023 65325061 46836333 35151752
21905 35151752 27311182 21718256 17732956 14851689 12654875 10887916 9429717 8163866
21897 8163866 6959873 5920155 5055612 4326809 3855125 3544904 3264883 3028845 2815425
21888 2815425 2628795 2458661 2254234 2115140 2034694 1964290 1819990 1633689 1487395 1369413
21878 1369413 1303429 1221744 1138151 1022732 990742 1046711 1019444 911637 787987 742839 709669
21867 709669 698832 725925 730456 692130 676548 688603 677849 636648 584207 584999 624350 585507
21855 585507 540129 472970 391511 353690 381782 361666 330983 377225 431393 452849 423267
21844 423267 374611 365232 408934 390461 310615 322969 308054 263568 236075 249090 260522 286157
21832B86157j1145k2099j2628K405R725Q0506J6384j5388J3288n8710K046J3610
21820C04151j2051O710M0313J07842O300m2003m3535p093J5280N0576O4286J03834
21808E94610K12792K81669L96235N20067K57689k27407m64544m89824l09296j97360
21798E74631j84653r4150l4409m7372J6632K349l834K3853N2066n910M3534Q1983
21786D24720n1953r9442j11797J7349R436M467K891N2433R377k2486o1274l5429
21774A38292k5829j0966J1187K3837m9476P932N3095L4711K4434J4651L0463P4319
21762C26650m5938q4671j2637J1991j5476N727k6142j3045n4775m7346k1247J2580
21750C5671M7567M3805M2213J0679o4471l1665P941m0273m9754J7016P8974K2615
$$ plain form
21832 286157 275012 252913 240285 242690 252415 332921 349305 333917 347205 288495 290541 304151
21820 304151 292100 298810 339123 446965 453265 411262 367727 360634 375914 426490 490776 594610
21808 594610 807402 1089071 1485306 2005373 2263062 2035655 1571111 1081287 771991 574631
21798 574631 389978 295828 261419 214047 230679 233028 229194 253047 305113 299203 342737 424720
21786 424720 372767 273325 161528 178877 188313 192780 195671 248104 257481 234995 173721 138292
21774 138292 112463 101497 112684 136521 87045 94977 148072 182783 207217 221868 252331 326650
21762 326650 280712 196041 183404 195395 179919 185646 159504 146459 91684 44338 23091 35671
21750 35671 83238 127043 169256 179935 115464 83799 91740 51467 1713 18729 97703 120318
21738A20318k8915l1178o4587J3077l9490K4060L1980L7814j2730o811o1022j018
21726a8502O7254R3291m3136Q72M8229n4487K946q810L0381M6151R369L521j9813
21713A57266j4488r066n1053j10209m8898J924l2371p918M986N4242L1833q507
21701c2259m3260J3619J813L7075O0042j0497L995j4477p2082L4740J3899n0487
21689e7879k2406L1516O2919K6674J5943J9094m300j7585J7885J6618J9045J9979
21677A27503l1173l5119r760q451J662K9222J2267R060p5966L3037j8433l1629
21665B220r738p088k9777J8115P8804J0624o0442j8725J8419j7929L0165j1407
21653C241J0132K0621j4372m7064k728k2621j4269M2657O1086l025k6200j0925
$$ plain form
21738 120318 91403 60225 -4362 8715 -30775 -6715 25265 63079 50349 43538 -17484 -18502
21726 -18502 48752 142043 98907 99779 148008 93521 96467 87657 118038 164189 173558 177079 157266
21713 157266 142778 133712 82659 -27550 -76448 -74524 -106895 -114813 -109827 -55585 -23752 -32259
21701 -32259 -75519 -61900 -60087 -23012 37030 26533 30528 16051 -56031 -21291 -7392 -57879
21689 -57879 -80285 -48769 14150 40824 56767 75861 71561 53976 71861 88479 107524 127503
21677 127503 96330 61211 51451 43000 44662 73884 86151 95211 19245 52282 33849 2220
21665 2220 -7518 -14606 -44383 -26268 52536 63160 2718 -16007 2412 -15517 14648 3241
21653 3241 13373 33994 19622 -27442 -30170 -52791 -67060 -24403 36683 33658 7458 -3467
21641c467k3922P21n1881L4856P3407R599J2811k948m5638m4586K1888K3572n1703
21628d7291r092P621J4995j4994K8436N0760Q2n5377k0202L6067R258k7781k785
21615c0303J2776P2335R4901L3845k883m2626l5639K114j777J1647P778n7283
21603F4885l3890L154l3476l4489l7260j5990K2747N1198L4025k9839m0301j3523
21591f2759L9068r043J6137j0333K741L850J6389j8747l4007L1186O2206j426
21579C5262r126j1949J0099j8380O902M5491n4110n020K6743M4107k6612M602
21567D8009j0607K511k3238K6922L4807j6126K7616l0455l8904k0194q874M650
21555c883l4012r212L819k5951R551M2097K5275J4302J6372o1151j0635j3372
$$ plain form
21641 -3467 -27389 -26668 -78549 -43693 29714 39313 52124 49176 3538 -41048 -19160 4412 -47291
21628 -47291 -56383 -48762 -33767 -48761 -20325 30435 30517 -24860 -45062 -8995 263 -27518 -30303
21615 -30303 -17527 54808 149709 183554 180671 138045 102406 104520 102743 114390 122168 64885
21603 64885 30995 34149 673 -33816 -71076 -87066 -64319 -13121 20904 -8935 -49236 -62759
21591 -62759 -23691 -32734 -16597 -26930 -24189 -20339 -3950 -22697 -56704 -25518 36688 35262
21579 35262 26136 14187 24286 5906 12808 58299 4189 -831 25912 70019 43407 48009
21567 48009 37402 39913 16675 43597 78404 62278 89894 59439 20535 341 -8533 -3883
21555 -3883 -37895 -47107 -43288 -69239 -59688 -17591 7684 21986 38358 -22793 -33428 -46800
21543d6800k987l6181N7619Q0648K2068n0435n1034l3934L6843L3159O1386P541
21531G7893l8054M2599L8659j09435o8882L1753J7438L1816J8349l1888J1904
21520B2152K4284L5537l3149m4663l3990j2991K1091O3667o794j5512o763n4277
21508d1408J8260N1775M2869Q95m6823l8659M4001J8072j0402Q528j5050L246
21496C5304r540l7946L9389N3197K935L623N825l9872m8804r023k944l7955k3613
21483f9424k162K3576J1312m4110k2060J6463K6950N4777N0871P795O0043k1099
21471I2932m7089m5959K6725M1157j4877o328J2274L668M0695n8519n5843m4570
21459e5734j493l1113L6394O4053j0843K2466J4712j6086J3705k7300j7786j2603
$$ plain form
21543 -46800 -49787 -85968 -28349 52299 74367 23932 -27102 -61036 -24193 8966 70352 77893
21531 77893 39839 82438 121097 11662 -57220 -25467 -8029 23787 42136 10248 22152
21520 22152 46436 81973 48824 4161 -29829 -42820 -21729 41938 35144 19632 12869 -41408
21508 -41408 -23148 28627 71496 72391 25568 -13091 30910 48982 38580 47108 32058 35304
21496 35304 25764 -12182 27207 80404 83339 86962 92787 52915 4111 -4912 -7856 -45811 -69424
21483 -69424 -71586 -48010 -36698 -80808 -102868 -86405 -59455 -4678 46193 53988 114031 92932
21471 92932 45843 -116 26609 67766 52889 46561 58835 62503 103198 44679 -11164 -55734
21459 -55734 -57227 -88340 -51946 12107 1264 23730 38442 22356 36061 8761 -9025 -21628
21447b1628R569j2622O4527P305m3845N9473L2211J6280j9475l5622j8086j3486
21435B4601J8934J805k5099J123J7941n1300p207j1515J2631q29M7185Q864p227
21422B9907O1451p6979l4877N1993L5852J5426L8274q622l1091r586n0748k7737
21410f737K5645J8863K033l9688k0116O758L1042k4452j1064N3269j7508k2923
21398d878l7549l3584L2579L2194r712j7993m091K1934K4949r278m9314N1518
21386c225O1907n8594k5148l1616l1231L0522L1164L7679k9589N384J7015L2124
21374C6392j0422J0271n968k1802O5783M4297J5319k7020L3030J8808M5746J01754
21362C06188L6471p313L4618J13310K42008L08155M37413L84421J8362l13425
$$ plain form
21447 -21628 -12059 -24681 39846 47151 3306 62779 94990 111270 91795 56173 38087 24601
21435 24601 43535 45340 20241 21364 39305 -11995 -19202 -30717 -18086 -18915 28270 37134 29907
21422 29907 91358 14379 -20498 31495 67347 82773 121047 112425 81334 71748 21000 -6737
21410 -6737 18908 37771 39804 116 -20000 -13242 17800 -6652 -17716 35553 18045 -4878
21398 -4878 -42427 -76011 -43432 -11238 -20950 -38943 -43034 -21100 3849 -5429 -54743 -3225
21386 -3225 58682 88 -25060 -56676 -87907 -57385 -26221 11458 -18131 -12747 4268 36392
21374 36392 25970 36241 30273 8471 74254 118551 133870 106850 139880 158688 204434 306188
21362 306188 342659 335346 369964 483274 725282 1033437 1470850 1855271 1873633 1560208
21352A560208l54164l16975k63555k33522j29521p4921n7182j6170p4427J3292
21342E3063K3363j8148k7929l2548o1344o16R0643R7602J5545J9812o5997n5583
21330C7863r63l8568M8668l2123m3742L6901J9371J9064K5003J9766k1460m2393
21318B7387M391L3294K1343k2050r598m263j9086K8894J1305k2441k183m2513
21306D480m4509J9027M0115J0450k7891l8235l0187k8259J06376P4042r082k1715
21294E4612o5157N150J3906l1136J6564l1761o1075l462L7631j1397K6758N2468
21282C101n560j9946j2597J24Q097L9375O9113n916l1025j5228k1253M4521J6080
21269F8886j1330k0579N6230j9676K149k0298l6374j7232k8248n1636k6271R323
$$ plain form
21352 1560208 1206044 889069 625514 391992 262471 187550 130368 114198 39771 53063
21342 53063 76426 58278 30349 -2199 -63543 -64159 26484 124086 139631 159443 93446 37863
21330 37863 36900 -1668 47000 14877 -28865 8036 27407 46471 71474 91240 69780 27387
21318 27387 31778 65072 86415 64365 54767 50504 31418 60312 71617 49176 46993 4480
21306 4480 -40029 -21002 19113 29563 1672 -36563 -66750 -95009 11367 85409 76327 54612
21294 54612 -10545 -5395 8511 -22625 -6061 -37822 -98897 -102359 -64728 -76125 -49367 3101
21282 3101 -2459 -22405 -35002 -34878 -26781 12594 81707 75791 44766 29538 8285 52806 68886
21269 68886 57556 36977 93207 73531 75680 55382 19008 1776 -26472 -78108 -104379 -95056
21257i5056j2582Q508J2974k6562k0870K756J3833L7968M181J7773M5096l9301
21245e1282j1924j0772l6537R1385N0220j5922n811R45J4840L504K4892k0183
21233C3355P468N7958j9786l6185j1980n002J0064L2284k281n5153n1821n5916
21221i6995l8269m689j3905L3258R536Q7432Q126k7585q863L8321p58l1049k722
21208d8162J4539k158o0815j040K4791L0813K0686j361k546J501k9511k407M5132
21195a0538l4614K648P627O48m1396q5072n4609N66M8185R6952J419k8219N4355
21182d2048K7529q815o5910j8188p506j9002J4220L9826M0129L6944j9777m8036
21170g0634k2420L0359K7250k6795J7151m330P23K735m442J4207k2994J2579J0033
$$ plain form
21257 -95056 -107638 -99130 -86156 -112718 -133588 -130832 -116999 -79031 -74850 -57077 -11981 -51282
21245 -51282 -63206 -73978 -110515 -19130 31090 15168 9357 10302 25142 28646 53538 33355
21233 33355 40823 98781 78995 42810 30830 25828 35892 68176 65895 10742 -41079 -96995
21221 -96995 -135264 -139953 -153858 -120600 -111064 -23632 -15506 -43091 -51954 -13633 -14391 -45440 -48162
21208 -48162 -33623 -35781 -96596 -97636 -72845 -42032 -21346 -22707 -25253 -23752 -53263 -55670 -10538
21195 -10538 -45152 -42504 -34877 -34229 -75625 -160697 -215306 -214740 -166555 -69603 -68184 -96403 -42048
21182 -42048 -14519 -23334 -89244 -107432 -114938 -133940 -119720 -79894 -39765 -2821 -22598 -70634
21170 -70634 -93054 -62695 -35445 -62240 -45089 -49419 -48696 -45961 -50403 -36196 -59190 -46611 -36578
21157c6578L2600N8363r193n0374j8756N1601o854n5344p8636K5380N7111L1055
21145C75j8827q813M1481j0264n1344l2193M3372L0281n4777q1039O862J05236
21133b9650K1602J300k3594N886Q397q875L1841l0182m6308M1699j2638j9424
21121e9946k3519R416K4447m728N4222J1573k1032n5599J4206N1967K0858j8785
21109C080m2326m0374k7158L8883l3306P45M4694O3435j6647p531L3589m3366
21097b6282q714O5407m6812j3865M561o590l9463O0551N8O554M1698J9855o100
21084E0858k3589K498n5181J9689K7791J1338J9118O1779m0227o0826n3848Q1
21072d0519Q3871j2067n2943m7320k0699Q54k102j0879L6927r99K6296M6061k08
$$ plain form
21157 -36578 -3978 54385 45192 -5182 -23938 27663 20809 -34535 -113171 -87791 -30680 375
21145 375 -18452 -27265 14216 3952 -47392 -79585 -36213 -5932 -60709 -141748 -134886 -29650
21133 -29650 -8048 -6748 -30342 -24456 -16059 -24934 6907 -23275 -69583 -27884 -40522 -59946
21121 -59946 -83465 -74049 -49602 -54330 -108 11465 -9567 -65166 -50960 1007 21865 3080
21109 3080 -39246 -79620 -106778 -67895 -101201 -100456 -55762 7673 -8974 -16505 17084 -26282
21097 -26282 -34996 30411 -16401 -30266 -25705 -32295 -71758 -11207 -11149 -4595 37103 56958 50858
21084 50858 27269 29767 -25414 -5725 22066 33404 52522 114301 74074 13248 -40600 -40519
21072 -40519 43352 31285 -21658 -68978 -89677 -88823 -90925 -101804 -64877 -65876 -39580 6481 6273
21059F273K8801o512l2524k0509K401P4740J2590J6641o049j3577n7094k5132
21047a9951k398K7718j8802j5408P98m8091K6815L0552M1806R639o6458r5854
21035a29634j4231L0480M0832m0393l5069K4731J13581N1881J3246n8283l9224
21024d2083P0310J986l8586P906r9569k1264K1151N5531J8220n3820M749o1234
21012a36703J6317Q846j2612l6059J0042J5420M9430K7398J0670K1484K2547l1421
21000c4641L1850L0612l4115r358L8019K8009k6430K4781P883J7428M8342J7337
20988A39717k0339p1758k1403k7682J0200K9100j5479j9006j7580j3903R341j5353
20976c4145k9667K5754L6083j8108l594l2440k1034O4108J3995l4632K4891q0378
$$ plain form
21059 6273 35074 28562 -3962 -24471 -22070 52670 65260 81901 75852 62275 5181 -19951
21047 -19951 -22349 5369 -13433 -28841 -28043 -76134 -49319 -18767 23039 32678 -33780 -129634
21035 -129634 -143865 -113385 -72553 -112946 -148015 -123284 -9703 42178 55424 -2859 -42083
21024 -42083 28227 30213 -8373 -467 -100036 -121300 -100149 -44618 -26398 -80218 -75469 -136703
21012 -136703 -120386 -111540 -124152 -160211 -150169 -134749 -85319 -57921 -47251 -25767 -3220 -34641
21000 -34641 -2791 27821 -6294 -15652 22367 50376 23946 48727 56610 74038 122380 139717
20988 139717 119378 47620 26217 -1465 8735 37835 22356 3350 -14230 -28133 -18792 -34145
20976 -34145 -63812 -38058 -1975 -20083 -23677 -56117 -77151 -13043 952 -33680 -8789 -89167
20964h9167j3722N6144Q8452k2441r273L8581K4950O325n8002l0760o81n3935
20952f3529N741j677l8882j5873l7961J9923K0866K5670K6055r649k9260j1972
20940a10548j6742O6741O973k858M7789j731M6473P3197p133j5573J4898k3754
20928G7732r2282l9754n7329l3596M2055L0608O7078l6959l7624O370J7077J2060
20916d4564k9836l4297M0523j2645m9505k5416N6542j0818q874K5755J4167M3146
20904c5822R8686N933m5573k4800J0489j8988l1205M4044m0652o0891j4522r021
20892a22322l124k6311Q689P4436N0791K7840l8948J7208n0962n312N4980K7985
20880A4950l0191K1217k3229o4018O03N2327J3677l3463j751j6956l1452K4794
$$ plain form
20964 -89167 -102889 -46745 41707 19266 9993 48574 73524 79849 21847 -8913 -9594 -63529
20952 -63529 -57788 -59465 -98347 -114220 -152181 -132258 -111392 -85722 -59667 -69316 -98576 -110548
20940 -110548 -127290 -60549 -53576 -56434 -8645 -10376 36097 109294 102161 86588 101486 77732
20928 77732 -14550 -54304 -111633 -145229 -103174 -72566 -5488 -42447 -80071 -73701 -56624 -44564
20916 -44564 -74400 -108697 -68174 -80819 -130324 -155740 -99198 -110016 -118890 -93135 -78968 -35822
20904 -35822 62864 68797 23224 -1576 8913 -10075 -41280 2764 -37888 -98779 -113301 -122322
20892 -122322 -125446 -151757 -143068 -68632 -17841 9999 -28949 -11741 -62703 -68015 -13035 14950
20880 14950 -15241 5976 -17253 -81271 -80668 -28341 -14664 -48127 -49878 -66834 -98286 -73492
20868g3492L9219K7143j3172J955L151l4935J7506r575n532k0642o847P6388o25
20855E42k151m9330l8032J769L0670L616N5097N3495K6824m4816o9246l8422m5204
20842a15188l0103J3381L3025K8413k3242m9J8041L278O2075J6711Q526m7704
20830c2836q7006L5014p27K6250K7079k3192j7465k2348J1008L9666M5324J4205
20818A4972M102m5687j4167o58k7260j8971p252J8868l077K2015Q9025R640m501
20805C7049M6225M047k9350m3030M2643j1898n8872n0148n6340n667P6221R773
20793c9347k960j5508P524j0631L0749N3215Q71p42n7120j4428K3192l8954m9009
20780a13148P8027L9898k7094j1846R316Q276j3883q120m656M1777m4194l7358
$$ plain form
20868 -73492 -34273 -7130 -20302 -18347 -15196 -50131 -32625 -42200 -47732 -68374 -75221 1167 542
20855 542 -1609 -50939 -88971 -87202 -56532 -52916 2181 55676 82500 37684 -31562 -69984 -115188
20842 -115188 -145291 -131910 -98885 -70472 -93714 -93763 -75722 -72444 -10369 6342 14868 -32836
20830 -32836 -119842 -84828 -85555 -59305 -32226 -55418 -72883 -95231 -84223 -44557 767 14972
20818 14972 19074 -26613 -40780 -41438 -68698 -87669 -94921 -76053 -79130 -57115 31910 41550 37049
20805 37049 83274 87321 57971 14941 57584 45686 -13186 -63334 -119674 -125341 -49120 -39347
20793 -39347 -42307 -57815 -50291 -60922 -30173 23042 23913 23171 -33949 -48377 -25185 -64139 -113148
20780 -113148 -35121 4777 -22317 -34163 -24847 -16571 -30454 -38574 -43230 -1453 -45647 -83005
20768h3005K7256L4414j0326K6787l0857l5411L794J1226k9818K6953K7587M1267
20756I867P549l3915m5048K7816O6084L251l7330K9092n942k0644j3324k4602
20744c7146M6660m247o3884j4192J084k6669J4883N6590j4859j0823m0553J8630
20732g4526J2562j4443j6490M2274R2206k3167l8193J3141K0949k6262r180p168
20720b8297j6695j9302L3390j0530n988m5269l7147K5075K5756O353m813K969
20708g4498L8728K0924J5324N6289O704p0230m9939j7892l688j4194L7404L060
20696e2008K7781k2261l33L1873j1157m0856l0169R172K6529o302L2080j3608
20684d9259k7738o576p321L4842O8319j0911n0862l7040N8217N9731N236k2055
$$ plain form
20768 -83005 -55749 -21335 -31661 -4874 -35731 -71142 -67348 -56122 -85940 -58987 -31400 9867
20756 9867 17416 -16499 -61547 -33731 32353 35604 -1726 27366 21424 780 -12544 -37146
20744 -37146 9514 5267 -58617 -72809 -71725 -98394 -83511 -26921 -41780 -52603 -93156 -74526
20732 -74526 -61964 -76407 -92897 -50623 41583 18416 -19777 -6636 14313 -11949 -21129 -28297
20720 -28297 -44992 -64294 -30904 -41434 -47422 -92691 -129838 -104763 -79007 -72654 -77467 -74498
20708 -74498 -35770 -14846 478 56767 63471 -6759 -56698 -74590 -78278 -92472 -55068 -52008
20696 -52008 -24227 -46488 -46821 -14948 -26105 -66961 -97130 -87958 -61429 -67731 -35651 -49259
20684 -49259 -76997 -83573 -90894 -56052 12267 1356 -49506 -86546 -28329 31402 36638 14583
20672A4583j0235N1681M8415p5205m6716o1332J7601M119J8931L3881j8834O6592
20660D3481J1111j4759l6404L2095j2693k6250k9253l5358P3753J1854n9258j2670
20648e4351J4757k866K9634r57J3338J1372j5941j0203k4469K0165M5170k1905
20636C744P120K8827Q726n5884J720p134l9414J769m3336N495M3748M759L833
20623c6027L8488L906L412q98M0860m9813k7659K3781l16n7855L7400M8120L7073
20610F0472N6643o285k1378l8368m4945k5812m6943K9008k7265j4122j0075o7487
20598a56557M190M6321Q6848P4344J3003j5986p1979l0775K6039L8766K0634l8263
20586c415n0718K0731O2346J7351l1771K6092K5252j7330l8166k1732L1312k9180
$$ plain form
20672 14583 4348 56029 104444 29239 -17477 -78809 -61208 -57089 -38158 -4277 -23111 43481
20660 43481 54592 39833 3429 35524 22831 -3419 -32672 -68030 5723 17577 -41681 -54351
20648 -54351 -39594 -42460 -12826 -13783 -445 10927 -5014 -15217 -39686 -19521 25649 3744
20636 3744 10864 39691 48417 -7467 -5747 -12881 -52295 -50526 -93862 -88367 -44619 -39860 -36027
20623 -36027 2461 6367 9779 8881 49741 -72 -27731 -3950 -4266 -62121 -24721 23399 60472
20610 60472 117115 110830 89452 51084 6139 -19673 -66616 -37608 -64873 -78995 -89070 -156557
20598 -156557 -152367 -106046 -19198 55146 68149 52163 -19816 -50591 -24552 14214 34848 -3415
20586 -3415 -54133 -33402 28944 46295 14524 40616 65868 48538 10372 -11360 19952 -9228
20574i228o0230n793N662K6551K7305j2351j2599M3545J8545j5994q26J8616q051
20561A5152n211L904m0398l798j2716N1721J8415j5499j5876m0246l6421l2136
20549a13109l374k1629O9344Q5388K4489l2377O324r8727q2798l640K8602M1237
20537a00270L4513l2623Q1974p606J6726K8144k6701l0957J3150k2024M1944l10
20525d040j1908p9975j9305J1287P3115J7698K8471o0989q9220n1287j021L7545
20513a49629L9101k0992j7738N6378P1867j3511K5403n905K4537l7778q580j4511
20501e1358K3994Q2361N629n8665j6489l9905m7818p523N4043L1349J0722j4171
20489b7831o4441k8248N1314L6089M5829J3690k9900m6058j0423M6940J3734N3736
$$ plain form
20574 -9228 -69458 -75251 -69589 -43038 -15733 -28084 -40683 2862 21407 5413 4587 23203 15152
20561 15152 9941 13845 -26553 -30351 -43067 8654 27069 11570 -4306 -44552 -80973 -113109
20549 -113109 -116483 -138112 -68768 16620 41109 8732 15056 -83671 -166469 -170109 -141507 -100270
20537 -100270 -65757 -98380 -16406 -24012 -7286 20858 -5843 -36800 -23650 -45674 -3730 -4040
20525 -4040 -15948 -95923 -115228 -103941 -30826 -13128 15343 -45646 -134866 -186153 -187174 -149629
20513 -149629 -110528 -131520 -149258 -92880 -21013 -34524 -9121 -15026 9511 -28267 -36847 -51358
20501 -51358 -27364 54997 60626 1961 -14528 -54433 -102251 -109774 -55731 -24382 -13660 -27831
20489 -27831 -92272 -120520 -69206 -33117 12712 26402 -3498 -49556 -59979 -13039 695 54431
20477E4431J2259l3857R480l1367p8815j4202n5079n91J3165N1750O7371m0900
20465d6355J1834P5393L5907q0833m7120j5419k9844N7614N4521j9306L5308j651
20453C0049R234p4702l2903O9382L5759l2511o4940r740k095j1523K1500Q5965
20441B3475m96m7379k3145k94m2555n134O0396K3778n2121k5022k2868J9408j029
20428i2986N3270Q8080k968o5147p50j6950L7477L0825j9818l4871l9605J2267
20416e1176R6755o336m6068k4109K7913K8813m5253L459n6578p4002J6127M8874
20404h1581N5164N819J2333o589K038l5078o2578R401L7751j612K1620q0242j5256
20391a38810N0359M0896M766k8448M1680k3586l6159k1095M2377Q4089K5521m3129
$$ plain form
20477 54431 66690 32833 42313 10946 -67869 -82071 -137150 -137741 -124576 -72826 -5455 -46355
20465 -46355 -34521 40872 76779 -4054 -51174 -66593 -96437 -38823 15698 -3608 31700 30049
20453 30049 39283 -35419 -68322 1060 36819 4308 -60632 -70372 -72467 -83990 -62490 23475
20441 23475 22979 -24400 -47545 -47839 -90394 -95528 -35132 -11354 -63475 -88497 -111365 -91957 -92986
20428 -92986 -39716 48364 45396 -19751 -20501 -37451 26 30851 11033 -23838 -63443 -51176
20416 -51176 45579 39243 -6825 -30934 -3021 25792 -19461 -16002 -72580 -146582 -130455 -81581
20404 -81581 -26417 -20598 -8265 -14854 -12816 -47894 -110472 -101071 -63320 -64932 -43312 -123554 -138810
20391 -138810 -88451 -47555 -42789 -71237 -29557 -53143 -89302 -110397 -68020 16069 41590 -1539
20379a539q5887j215K0781L5020J1122j0253p9110K0797N4825j1231p891R311
20367d5270q075J9947O660m0524n7797L2867k8128Q008P8989o645L1234J945j0884
20354a7673j6939k0833J8868j0562j25K2642L7620l3989q2683J5622P5960k0765
20342c2857O541l6520k312M6075J9760j8473n1629l93K2951K1797J8531k0593
20330b7122j0251L1198j3450k4371O7644K824l0041l6502M9685k0818n5355L6532
20318c0027N850q2884J0597L7004O1673N0458l6385o1970P568r56P715O0582O4747
20305I3972l5270j30769J4133L2939J4087j7654L9705L9674J0069P084k9645o8683
20293c0358j5273J719n0502K915P9731P3705p875o3542m2325l7165L7250L3292
$$ plain form
20379 -1539 -87426 -88641 -67860 -32840 -21718 -31971 -111081 -90284 -35459 -46690 -54581 -45270
20367 -45270 -53345 -33398 -26738 -67262 -125059 -92192 -120320 -112312 -33323 -39968 -8734 -6789 -17673
20354 -17673 -34612 -55445 -36577 -47139 -47264 -24622 12998 -20991 -103674 -88052 -12092 -32857
20342 -32857 -26316 -62836 -65148 -19073 687 -17786 -69415 -69808 -46857 -25060 -6529 -27122
20330 -27122 -37373 -6175 -19625 -43996 23648 26472 -3569 -40071 9614 -11204 -66559 -30027
20318 -30027 -24177 -107061 -96464 -59460 2213 52671 16286 -45684 -38116 -39072 -31357 29225 93972
20305 93972 58702 -72067 -57934 -24995 -10908 -28562 11143 50817 60886 67970 38325 -30358
20293 -30358 -45631 -43912 -94414 -91499 -11768 61937 54062 -9480 -51805 -88970 -51720 -18428
20281a8428k1139n350l884M9839K3177J7644j8002m0943j6849L4256K0679L6337
20269E7337n507j143j7623k9925l0356o398L3071n5656O715L2227P695J3419K1736
20256B5592k0188m6996o305l2802M373M831J859j31L258L6957J0748K2744J3630
20243A7570l8795j0014J9110j4308L7691L1580M3455K7459k7275k1674L740k381
20231F6158l8702m8331o9750j9319M6853J12159k727l0732M4369l7146o7489k6595
20219g1252M9248j7943j1182P5727M9329p13M176k8040m0937n3348j3409o318
20207f4662Q399J5650k1627J7138J3537O6177N75k1987J962p05l6380O385L1251
20194A5713J0591m4174J1417K3616j9460m0702L226P7924J862p863n6553m5750
$$ plain form
20281 -18428 -39567 -44917 -48801 1038 24215 41859 23857 -17086 -33935 321 21000 57337
20269 57337 51830 50687 33064 3139 -27217 -33615 -544 -56200 -49485 -17258 -9563 3856 25592
20256 25592 5404 -41592 -47897 -80699 -76326 -71495 -69636 -69767 -66509 -29552 -18804 3940 17570
20243 17570 -21225 -31239 -12129 -26437 11254 42834 86289 113748 86473 64799 68539 66158
20231 66158 27456 -20875 -90625 -109944 -63091 49068 46341 15609 59978 22832 -44657 -71252
20219 -71252 -22004 -39947 -51129 24598 73927 73214 77390 49350 8413 -44935 -58344 -64662
20207 -64662 -56263 -40613 -62240 -45102 -31565 34612 35187 13200 15162 14457 -21923 -15538 15713
20194 15713 26304 -17870 -6453 17163 -2297 -42999 -39773 38151 40013 32150 -24403 -70153
20182g0153N013J8107k7275m5265M262P1067M5753o3902m2446L2366O8775N0537
20170D6839J402j1717m835J8216N5963j7089n2244Q554M1547J2903k8421o5189
20158E929j1510M2340K8273k0136r4313m8082P3667P5337j1006k3873m4140p4520
20146a02034K7470L9466l0406m9218K6617M6611L3203O76k892L5770K4877k4956
20134B5184J8673L246L7930J7342o8326j0303N5996M25l2711p2072k9361j3755
20122f7732L0129J7976p048k1924J5540l4514m927J3404L7456k1707j5893N0685
20110h555m3867k7908j331P8060K9243k8891J9887k8141K7876l0657O241p9128
20098h7171j8794O6176J9434M3458k3821o8088j2547L2650K4774Q235J1525p7622
$$ plain form
20182 -70153 -65140 -47033 -74308 -119573 -115311 -44244 1509 -62393 -104839 -72473 -3698 46839
20170 46839 48241 36524 31689 49905 105868 88779 36535 45089 86636 99539 71118 5929
20158 5929 -5581 36759 65032 44896 -49417 -97499 -23832 51505 40499 16626 -27514 -102034
20146 -102034 -74564 -35098 -65504 -114722 -88105 -41494 -8291 -7615 -10507 25263 50140 25184
20134 25184 43857 47103 85033 102375 34049 23746 79742 80167 47456 -24616 -53977 -67732
20122 -67732 -37603 -19627 -26675 -48599 -33059 -67573 -72500 -59096 -21640 -43347 -59240 -8555
20110 -8555 -52422 -80330 -81661 -3601 25642 -3249 16638 -11503 16373 -14284 -8043 -87171
20098 -87171 -105965 -39789 -20355 23103 -718 -68806 -81353 -48703 -23929 -15694 -4169 -81791
20086h1791j8056J2610L0870K1881p193k8695j8282K986K1010p412M9119P5975
20074E3022j7509o4742n5847K7820Q247N883N9673j3626j3397J9503L555j4914
20062b332q7715l8175K4510L7577L6683k0528l1137L2447J9721L7474L7236k9700
20050A6061k937p3715p2440L1938K4613k6763j1141k7221k6961J4892Q5691N2700
20038a5283L033Q1293M4192n2468m9534j1815o090j2646J946L6452j0327k0289
20026a1536m41K2722n1865O283j5047J6258N7118J3047M626k4875q059n2430L0407
20013a3792K9894N7668J1670R562k2836l1234n890n7147m3280M551K1958p966
20001d6842k8612n4690l50K4620n280k5908O5479j4842o3226J532P8875K8639
$$ plain form
20086 -81791 -99847 -87237 -56367 -34486 -41679 -70374 -88656 -85670 -64660 -72072 -22953 53022
20074 53022 35513 -29229 -85076 -57256 -49009 -43126 16547 2921 -10476 9027 12582 -2332
20062 -2332 -90047 -128222 -103712 -66135 -29452 -49980 -81117 -48670 -28949 8525 45761 16061
20050 16061 13124 -60591 -133031 -101093 -76480 -103243 -114384 -141605 -168566 -153674 -67983 -15283
20038 -15283 -12250 69043 113235 60767 11233 -582 -6672 -19318 -17372 19080 8753 -11536
20026 -11536 -11977 10745 -41120 -34837 -49884 -33626 23492 36539 41165 16290 8231 -44199 -13792
20013 -13792 16102 73770 85440 95002 72166 40932 35042 -22105 -65385 -60834 -38876 -46842
20001 -46842 -75454 -130144 -130494 -105874 -111154 -137062 -71583 -86425 -149651 -148119 -69244 -40605
19989d0605M172K6923j6301o3458J1118l107M855O6378J9823R150k364L7165M3394
19976I7143L1473m0989o3193o1047N177j9918Q582n097j2543K496L8056j7183
19964c7043L163M4363K7295Q4012j6874m8200n4479K7754l5973r36R993l864Q430
19951G641P504q713k7027q985m2939J4847J3524K0175q078m5626o9093M0932L7259
19938f8579k7683j5865j3986M2587m5063k616O0972O9904P1214j0022r403j2376
19926C9084m8783p859j7608J7462p3573J9280N9331o9349m7846K2514N9335J4306
19914c3706M574j52j8267M3201L7926l2883k4027m9543J2399J5312P361n7565
19902i5370K4275N9480r112q9109J0936L0092P6259M0204l4587q916n1940J9416
$$ plain form
19989 -40605 -36433 -9510 -25811 -89269 -78151 -81258 -76403 -10025 9798 18948 16584 53749 97143
19976 97143 128616 87627 24434 -36613 -31436 -51354 -42772 -47869 -60412 -57916 -19860 -37043
19964 -37043 -33880 10483 37778 121790 104916 56716 2237 29991 -5982 -6918 3075 -789 7641
19951 7641 15145 6432 -20595 -29580 -72519 -57672 -44148 -23973 -32051 -77677 -146770 -105838 -68579
19938 -68579 -96262 -112127 -126113 -83526 -128589 -131205 -70233 -329 70885 60863 51460 39084
19926 39084 -9699 -17558 -35166 -17704 -91277 -71997 -12666 -82015 -129861 -107347 -48012 -33706
19914 -33706 -29132 -29284 -47551 -4350 33576 693 -23334 -72877 -60478 -45166 -37805 -95370
19902 -95370 -71095 -11615 -20727 -109836 -98900 -68808 7451 47655 13068 4152 -47788 -28372
19890b8372N3590L9659n0193o3536j0896M0647L0917r182P757m6207n0427O8688
19878a7555M5665N6615k9079l7451Q830l963O354K4585J2018K7882n0210j9452
19866B4239M006m2287l5633k6782L1152K1888q372M5532J2930k9574O5466J8172
19854H0737m7840q0012n527l389p8065Q373P0812m985J7035N838k2697M7950K0894
19841I124n8936j7296p966k1970J6686M3609n8344J9215l1765K9175M5711k0129
19829e2886n8785O3381L1179M4303M3091j7364l1641n7014p0081L44n771P9025
19817c2219M0012q198j1258l1938K175m1991K0485j4802k3368J9450k1M3850K9928
19804g895r655J2999m7453l2147r796L2761N0192J2822p02j0720L9483O513k0634
$$ plain form
19890 -28372 25218 64877 14684 -48852 -59748 -19101 11816 2634 10391 -35816 -86243 -17555
19878 -17555 28110 84725 55646 18195 27025 23062 29416 54001 66019 93901 43691 24239
19866 24239 28245 -14042 -49675 -76457 -45305 -23417 -31789 13743 26673 -2901 62565 80737
19854 80737 32897 -47115 -52642 -56031 -134096 -125723 -54911 -59896 -42861 -37023 -59720 -11770 9124
19841 9124 -49812 -67108 -75074 -97044 -80358 -36749 -95093 -75878 -107643 -78468 -32757 -52886
19829 -52886 -111671 -48290 -17111 27192 70283 52919 21278 -35736 -105817 -105473 -111244 -32219
19817 -32219 7793 -405 -11663 -43601 -41426 -83417 -62932 -77734 -101102 -81652 -81673 -37823 -7895
19804 -7895 -17550 -4551 -52004 -84151 -93947 -61186 -10994 1828 1126 -9594 29889 36402 15768
19791A5768M650j4494N0630J4166j492n7053r4812J0902L6774n025k2978q536
19779g1500M7975k3987p4795K2025j9877N1778Q5072j1561P05k2468m0478J8137
19767c8974l0805j5424P460K5202l922o136P1783m9093p7844M9788N9188l857
19755a2634m0610m2539N8656L4365k9656M038K9358o904m5432m208l4061R861
19743g9766n608J8913M5673j2765K1147N4023M405n197K6675k431j8828j1596
19731C4645M627Q827n1946j6500k0928m5233K2037J11419K1977N0399N1586k6530
19719A44380q5088j7910K6407J2105k8050k5846j1288R349k5550R983M6580N378
19707F0450N1124j9838l9676l6208L4572Q064n2849p760L4085L0128j6766J1986
$$ plain form
19791 15768 20418 5924 56554 70720 69228 12175 -82637 -71735 -34961 -39986 -62964 -71500
19779 -71500 -23525 -47512 -122307 -100282 -120159 -68381 16691 5130 5835 -16633 -57111 -38974
19767 -38974 -69779 -85203 -77743 -52541 -56463 -62599 9184 -39909 -117753 -67965 -8777 -12634
19755 -12634 -53244 -95783 -37127 -2762 -32418 -28380 978 -5926 -51358 -55566 -89627 -79766
19743 -79766 -85374 -66461 -20788 -33553 -12406 41617 46022 40825 67500 65069 46241 34645
19731 34645 39272 48099 -3847 -20347 -41275 -86508 -64471 46948 68925 119324 170910 144380
19719 144380 59292 41382 67789 79894 51844 25998 14710 24059 -1491 8492 55072 60450
19707 60450 111574 91736 52060 15852 50424 58488 5639 -2121 31964 62092 45326 57312
19695E7312J3446P886J0529M064L985n257P726q0719q3959k6648K2697P103J5684
19682d6151P5503K0014K5484K7603M5867N1260P074k4323P9059Q0040J01541R3477
19670E36448R8632J46946K26072K89323K15448K3681j85296k61494l06211k42884
19660E40665j34356r2387p8066j29927j14412J9382O5952K824j3014J7422m4004
19649D0079p1792K2811M9749N623O809L4934M2282j1390k0177j2376j3936j6151
19637E6465j3207k069O96J3502N0350M0299j7037n3284o9971l4639K7899m1828
19625d2824n0406M1877j7065P412N4614j4675L585j0695m2300J7920P2240J313
19613B0996j811j122l275j734k4478M3136N8826Q115l0321p441o3315j0217O3578
$$ plain form
19695 57312 70758 78644 89173 93237 97222 91965 99691 18972 -64987 -91635 -68938 -61835 -46151
19682 -46151 29352 49366 74850 102453 148320 199580 206654 182331 261390 341430 442971 536448
19670 536448 635080 782026 1008098 1297421 1512869 1536550 1351254 1089760 783549 540665
19660 540665 406309 313922 235856 105929 -8483 10899 76851 79675 66661 84083 40079
19649 40079 -31713 -8902 40847 46470 53279 88213 130495 119105 98928 86552 72616 56465
19637 56465 43258 41189 41885 55387 105737 146036 128999 75715 5744 -28895 -996 -42824
19625 -42824 -93230 -51353 -68418 -61006 -6392 -21067 -17482 -28177 -70477 -52557 19683 20996
19613 20996 19185 18063 14788 13054 -11424 31712 90538 98653 68332 60891 -2424 -12641 50937
19600E0937K0088m4159l7349q1709J7221N5100K1907O813J0118N0998j194m6290
19588B2481J2994J7746J0973r43o7377o1185P4905M7205J1887n7047k7952M0977
19576B4664o414J8639L281j8355l1369k7339r5737J7183J03955L1341K1634N4260
19564I5743m2106K0104o636p825K6086R2301m4938l3055K8711k0951J6631L4516
19552A58581n529k7642p804m3687k7731J3068M845m1405n4377q437L1968K0606
19540A2456j9265k1109k970J2325L7538j3388M307j0304l3861J4071Q187O022
19528e991l4262p473k5404M5112N3963M4101L910l3666k2793o4011R574K0838
19516a6102L8416O618n542l1017J7284J529q5826p359M4907j2019K8705L8092
$$ plain form
19600 50937 71025 26866 -10483 -92192 -74971 -19871 2036 8849 18967 69965 68771 22481
19588 22481 35475 53221 64194 63251 -4126 -65311 9594 56799 68686 11639 -16313 24664
19576 24664 18250 36889 40170 21815 -9554 -36893 -132630 -115447 -11492 19849 41483 95743
19564 95743 53637 73741 67105 59280 85366 177667 132729 99674 128385 107434 124065 158581
19552 158581 153052 125410 117606 73919 46188 59256 64101 22696 -31681 -40118 -8150 12456
19540 12456 -6809 -27918 -30888 -18563 18975 5587 9894 -410 -34271 -20200 -12013 -5991
19528 -5991 -40253 -47726 -73130 -28018 25945 70046 73956 40290 17497 -46514 -36940 -16102
19516 -16102 22314 28932 23390 -7627 9657 11186 -74640 -81999 -37092 -49111 -20406 17686
19504A7686L6259J5638o6403m4980K2056R492M3304J3582J814l0061Q957P3790
19492A01134m4534j2384M2974R986o5023q068p630j5101l7637q6935j9735P5280
19480f7673J01192M0541M618m1609J628p946n079J9556p3412k0014K6489P4192
19468E2483n030n4079l6291j9375N411N1556j4877k87J1030k4918l2559n1440
19456a18376k8655L7685P5138k2587L5246k8069L6985R711k133N879R863j3730
19444c043n0064P266J07525R5523J8930m1370k3892J204K5638n2675p2642p4422
19432f2022j2691M32j0020K0756N5156R8974K857K9891m2139n5061J6840M4363
19420H7336k2363j1253L8629j4625k5481O663L2478O6218L9160K5390J2590p9505
$$ plain form
19504 17686 53945 69583 3180 -41800 -19744 -10252 33052 46634 48448 18387 27344 101134
19492 101134 56600 44216 87190 97176 32153 24085 16455 1354 -36283 -123218 -142953 -67673
19480 -67673 33519 74060 78678 37069 38697 30751 25672 45228 -28184 -48198 -21709 52483
19468 52483 47453 -6626 -42917 -62292 -56881 -5325 -20202 -20489 -9459 -34377 -66936 -118376
19456 -118376 -147031 -109346 -34208 -56795 -21549 -49618 -12633 -2922 -5055 824 10687 -3043
19444 -3043 -53107 -45841 61684 157207 176137 134767 110875 112079 137717 85042 12400 -62022
19432 -62022 -74713 -74281 -84301 -63545 -8389 90585 93442 123333 81194 26133 42973 87336
19420 87336 64973 53720 92349 77724 52243 58906 91384 157602 196762 222152 234742 155237
19408A55237p1410J8583j446m6221l6671L3117N60l0995o5035n9210j2848K9733
19396h6606m4563k6161Q2236P7724L2354J8777K5891N7440L2243M2883j1415k3743
19384A77060M718M8545J5491l0728K4323J8758l9543j9627k3307j4654J1949r223
19372A63762q658M6655k3916m7432Q7602M9500R6197R6933M3563K7607n9378j17841
19360C54594o3648r0835l3880N0130m3601K6608j7869l3836m6243m286N9064N2746
19348B08944M0131K8700K4792j6388k4492j1578n3529n4312q5295r0122k2887
19337e6036P4436K1243J436m0350J5815K6670J2170k4003Q064L0819K3709j216
19325I2757l889k9091K8128K8985j055k0574m1760j204k1280j6559J9825M6113
$$ plain form
19408 155237 83827 102410 100964 54743 18072 51189 51749 20754 -44281 -103491 -116339 -86606
19396 -86606 -131169 -157330 -75094 2630 34984 53761 79652 137092 169335 212218 200803 177060
19384 177060 181778 230323 245814 215086 239409 258167 218624 198997 175690 161036 172985 163762
19372 163762 155104 201759 177843 130411 218013 267513 363710 460643 504206 531813 472435 354594
19360 354594 290946 200111 166231 216361 172760 199368 181499 147663 101420 97134 156198 208944
19348 208944 249075 277775 302567 286179 261687 250109 196580 142268 56973 -33149 -56036
19337 -56036 18400 39643 41079 729 16544 43214 55384 31381 39445 70264 93973 92757
19325 92757 88868 59777 87905 116890 115835 95261 53501 52297 31017 14458 34283 80396
19313H0396L5414m5141l7222L2209O1316Q2308Q3591l5716n5484j9643m5658n2514
19301H3856J8429l5370p4319p6390J7077n6931K7295R0689M3164j6920k9299J648
19289g071L7722M7948J2758J8811m4753k6861J6893O148K079k8410k2666m878
19277G720K3095l1179j8566J5466Q127j7416L2272M7772P6988N1954n0516o7189
19265G8528K1554L748L9184m2387k6067j4581J7100J5804J3748J7413K285j02158
19253B4171J0191K255J9883m150m5912P701L8485p919o0578o86o4708r985K9803
19240f1449j018O0888R605m6283M528K4150M2094K9860M7373k1459j0882l709
19228G3698M3505o4022n9437L9088j0084k7474N194M067O812n162k928L4702j2510
$$ plain form
19313 80396 115810 70669 33447 65656 126972 209280 292871 257155 201671 182028 136370 83856
19301 83856 102285 66915 -7404 -83794 -66717 -123648 -96353 -5664 37500 20580 -8719 -7071
19289 -7071 30651 78599 91357 110168 65415 38554 55447 61595 63674 35264 12598 7720
19277 7720 30815 -364 -18930 -3464 4663 -12753 19519 67291 144279 196233 145717 78528
19265 78528 100082 103830 143014 100627 74560 59979 77079 92883 106631 124044 126329 24171
19253 24171 34362 36617 56500 52350 6438 14139 52624 44705 -15873 -16559 -81267 -91252 -61449
19240 -61449 -62467 -1579 8026 -38257 -33729 -9579 32515 62375 109748 88289 77407 73698
19228 73698 117203 53181 -6256 32832 22748 -4726 468 4535 11347 6185 3257 37959 25449
19215B5449J8607Q040j5388o292K6684l6838m6955N0970J9173J6426k3455r135
19203B7286K1621J30699L3104k3191l4024k1230P6081K5937o1824k7968O342Q53
19191A53686k1603M2526N3240r099O8510J7096m0561Q525J13622J08730n5672
19180D39000j15313o6820m1457m5169k8471n6403M4184N3267L4443M8344P5246
19169C40851l9687k33O775L2515k7201L804M7665N6577L5146L4883J1248J5536
19157E17879J00095J07544N6955J22217J46071J98242L00181L39847K50924o6612
19147B073343k56873k38078j50040j04497r2724J1926R5991j8785R6946K44865
19137A662074K73629L72475L77428J64376m7548k05750k32842j09015M793J00044
$$ plain form
19215 25449 44056 52096 36708 30416 57100 20262 -26693 24277 43450 59876 36421 27286
19203 27286 48907 179606 212710 189519 155495 134265 210346 236283 174459 146491 152833 153686
19191 153686 132083 174609 227849 218750 287260 304356 263795 272320 385942 494672 439000
19180 439000 323687 256867 215410 170241 141770 85367 129551 182818 217261 265605 340851
19169 340851 301164 300931 307706 340221 313020 316824 364489 421066 456212 491095 502343 517879
19157 517879 617974 725518 782473 904690 1050761 1249003 1549184 1889031 2139955 2073343
19147 2073343 1816470 1578392 1428352 1323855 1231131 1243057 1339048 1320263 1417209 1662074
19137 1662074 1935703 2308178 2685606 2849982 2802434 2596684 2363842 2254827 2259620 2359664
19127B359664J95759J13833p856j9079K3425L3741J08774J86417K78763K99438
19117C572879L05230L50723M50934N36894N56353P41034Q14659R18928J185535
19108I433169J576214K106313K788626L551486M272218M913433N631537O480179
19100D0753175P648778R786350J3797899K0484556L1302141M6469866O0486800
19093B30729565N4777567J4239257l3015427n6300646n7444234m5135225l0396294
19086G7454563j9644748j3060699r169093o792370n120150l934432l003701k355752
19078A4373618j920581j608751j383782j216023j025781q43868o38710n04246
19070E231876m37892m06735l33358j84116j62881k38840j55792j60101j63948
$$ plain form
19127 2359664 2555423 2669256 2661400 2642321 2665746 2699487 2808261 2994678 3273441 3572879
19117 3572879 3878109 4228832 4679766 5216660 5773013 6514047 7328706 8247634 9433169
19108 9433169 11009383 13115696 15904322 19455808 23728026 28641459 34272996 40753175
19100 40753175 48401953 58188303 71986202 92470758 123772899 170242765 230729565
19093 230729565 285507132 299746389 266730962 210430316 152986082 107850857 77454563
19086 77454563 57809815 44749116 35580023 28787653 23667503 19733071 16729370 14373618
19078 14373618 12453037 10844286 9460504 8244481 7218700 6374832 5736122 5231876
19070 5231876 4793984 4387249 4053891 3869775 3706894 3468054 3312262 3152161 2988213
19061B988213j42928o1094r583O8303N9314r2359j34651p8306j01546j4240Q9957
19050B571080J87993K61397P3374k11078l91829l35263k24981j42608m0049O2318
19040A810354P1412J20300J41368K24696K30795j6497k68877l01874l38401k84767
19030A388509j96569n4478p5579j08406j02590k6585K2068o2531M232l9485l5082
19019G13504n2970n9170o1559J7174M3606j340m0990l852L4608m2341o2757O037
19007D89950Q0687O7667l1030m6309L544m2031r9099J6314L2226J7946k6008k6957
18995D36900n545k3134j893n2341k7215M8174K1540k1860L6880l7517l1781q9260
18983B52948k0760L2290M6399K2538M1788q491p8376k1855p975P95k4916K1790
$$ plain form
19061 2988213 2845285 2784191 2774608 2842911 2902225 2809866 2675215 2596909 2495363 2481123 2571080
19050 2571080 2759073 3020470 3093844 2882766 2490937 2155674 1930693 1788085 1748036 1810354
19040 1810354 1881766 2002066 2143434 2368130 2598925 2582428 2313551 2011677 1673276 1388509
19030 1388509 1191940 1137462 1061883 953477 850887 824302 846370 783839 788071 748586 713504
19019 713504 660534 601364 539805 556979 600585 599245 558255 554403 589011 546670 483913 489950
19007 489950 570637 638304 607274 560965 564509 522478 423379 439693 471919 489865 463857 436900
18995 436900 431355 408221 406328 353987 326772 374946 396486 374626 411506 373989 342208 252948
18983 252948 232188 264478 310877 333415 375203 366712 288336 266481 258506 259301 234385 256175
18971B56175N1711P198k7589M2502j3150n434m5270j241k1709J908R560K1762
18959B76423M7183n2076m1752m4911L1819N5612k9211n8306j7405J5174J4452
18948A97002K0750j8253P2168J04437K5794k3149K6978J0546m7716n7438l007
18937C08112J7168j1424p9614n4938j1736J081K6925j4756l6504O72m0785l6373
18925F7828k1269k3569P361O192P6943M8496l3324j6702M4416Q3062O2506l1780
18913B70160l3208o7272l9246M4085Q797j8016j9937J7236R748k498j1172L3910
18901A92587J1346J4069L8711o1431j9559M274j9598l8898j3198L0987L4009m1416
18889A31883m8891k1605n3783M8135O3014M1480J5354r5124o0309n4499M4220
$$ plain form
18971 256175 307886 315084 287495 329997 316847 311413 266143 264902 243193 245101 254661 276423
18959 276423 323606 271530 229778 184867 216686 272298 243087 184781 167376 182550 197002
18948 197002 217752 199499 271667 376104 401898 378749 405727 416273 368557 311119 308112
18937 308112 325280 313856 234242 179304 167568 168649 195574 180818 144314 144986 104201 67828
18925 67828 46559 22990 30351 36543 113486 161982 128658 111956 156372 239434 301940 270160
18913 270160 236952 169680 130434 174519 183316 165300 145363 162599 172347 169849 158677 192587
18901 192587 203933 218002 256713 195282 175723 179997 160399 121501 108303 139290 173299 131883
18889 131883 82992 61387 7604 55739 118753 160233 175587 80463 20154 -34345 9875
18878I875K3757L2388O8601J7999o8279O156r651K5322J541k5359L0977J2831
18866A26158l4049k0326L7595N8146l6213r0489q4770N8415L3363j401M8747J8983
18854A14159L074j9550K502O229k1947o6785J767P379M3592P6399J3056l0296
18842A29579k7997k808k4843m1212O8588N3780m7620q5128r1976J5293K2863j7852
18830d9333n517K5507N0696J1667o5560l8685L6867Q9084Q7536L5822m6086r6322
18818C5676J379M3720K0465j7856j1128l0393n397K8698l5011l1794k3511K0195
18806d957q73P99l7086N5385M0381j62M186N3502k1194k8071o866P846P234K0501
18792I0625K0600M0105K0530n6243K5559K797l9618m0690l28l7837M8597l89K2726
$$ plain form
18878 9875 33632 66020 134621 152620 84341 90497 80846 106168 107709 82350 113327 126158
18866 126158 92109 71783 109378 167524 131311 40822 -43948 14467 47830 46429 95176 114159
18854 114159 117233 97683 100185 106414 84467 17682 19449 26828 70420 146819 159875 129579
18842 129579 101582 98774 73931 32719 101307 155087 107467 22339 -69637 -54344 -31481 -49333
18830 -49333 -54850 -29343 21353 33020 -32540 -71225 -34358 54726 142262 178084 131998 35676
18818 35676 37055 80775 101240 83384 72256 41863 36466 65164 30153 -1641 -25152 -4957
18806 -4957 -5830 -5031 -42117 13268 53649 53487 57673 111175 89981 61910 55044 62890 70124 90625
18792 90625 111225 151330 171860 115617 141176 143973 104355 63665 63337 25500 74097 73708 96434
18779I6434L6715j0664k0720j9688j141n143k1777K0427P9737J6532J01359J53347
18767D25418J45599m2248p8524j85441j05817o6557r5209J745K9081l157l4766
18756i876J784N7008Q627n6924J7147k9020J6023n2101L2541P4652M5646M3020
18744A48527r219k7166m9699j572M2008M0973m01k4532K6966p7292n0220J148
18732A9521K4537L4135K566k9237O205L615p6179k4162L7849K3512J7001K1037
18720F0400R799L2081n6809k1109m041N0344N76j1239j2792J8461l559m0697l3657
18707a2242k335L5938J8128J0767R640k4940l2302k9700j3741j7663J672M2165
18695a4613L0658K278K1568l0345n9528J344L4841O583n552j0866J2312P4244
$$ plain form
18779 96434 133149 122485 101765 82077 80936 75793 54016 74443 154180 170712 272071 425418
18767 425418 571017 528769 450245 264804 158987 92430 -2779 -1034 28047 24890 -9876
18756 -9876 -8092 48916 57543 619 17766 -11254 4769 -47332 -14791 59861 105507 148527
18744 148527 139308 112142 62443 60871 102879 143852 143451 118919 145885 68593 18373 19521
18732 19521 44058 78193 80759 51522 57727 61342 -14837 -38999 -1150 22362 39363 60400
18720 60400 70199 102280 45471 24362 20321 70665 71241 60002 47210 65671 62112 21415 -12242
18707 -12242 -14577 21361 39489 50256 59896 34956 2654 -27046 -40787 -58450 -56778 -14613
18695 -14613 16045 18323 39891 9546 -49982 -48638 -13797 -7214 -12766 -23632 -11320 62924
18683F2924N884O867Q459R358L9654J2820m9174l5382n1370n1981L8802O6217
18671F3078K2392l649n6909l7441J6636j87O0525L0250M0386l0964k2130L7612
18659A19599l9281n2190q5173m1717J1155N0522L6308n172M811J562m8058r394
18647e7028J7326O0718K8937J8243m573N4762o447n0522o985k3690J577m2132
18635i814l2725M158L0347j3652q838l9871L3253M9401M1483J0292J4097M6663
18623A24794l7904p1878L5003J6028L6655j1954J7220M0929p905q865k5836j0795
18611I5492m8126J4018j2159n3742r124J4101j0145K5346J6324k2329m8813Q061
18599c1096Q4362n8074m0245o114J6008m0815L5775K3151l766k8667m7240O5751
$$ plain form
18683 62924 68808 75675 84134 93492 133146 145966 96792 61410 10040 -41941 -3139 63078
18671 63078 85470 81821 24912 -12529 4107 3920 64445 94695 135081 104117 81987 119599
18659 119599 80318 28128 -57045 -98762 -87607 -37085 -777 -5949 -1138 424 -47634 -57028
18647 -57028 -39702 21016 49953 68196 63623 118385 111938 61416 54431 30741 32318 -9814
18635 -9814 -42539 -38381 -8034 -21686 -30524 -70395 -37142 12259 53742 64034 78131 124794
18623 124794 86890 15012 50015 66043 102698 90744 107964 148893 140988 132123 106287 95492
18611 95492 47366 61384 49225 -4517 -13641 460 -9685 15661 31985 9656 -39157 -31096
18599 -31096 53266 -4808 -45053 -51167 -35159 -75974 -40199 -17048 -20814 -49481 -96721 -30970
18587c0970R150k5447j9566O1648M7496K4438M6196j6153j3527l9657l5185J5868
18575B4291J1197k2307k0030J2306Q0123N7676n296l6274m0146p6079K8604O4668
18563G8733L5457L2220N7123o8662m0871P683J130l6500l4002k2717L6084M4657
18551I0335M068l1752l2599o631J1428R0058j3678j8643n6917l2831K0495K8463
18539E1796L0944n1882j2434k7356J4675K2403m3812k073J7495N946l260N2146
18527E4588N0592O760m7045k0592M5439J3983J4072M5744J39159R0246k2695P3570
18515D43821J26051K26284L22043L86675J95841q2865k86596l29557k43129j54945
18505F03623j65201j24856p3555l6590L2955j6382n1403j00578l7678k0355P77
$$ plain form
18587 -30970 -21820 -47267 -66833 -5185 42311 66749 112945 96792 83265 43608 8423 24291
18575 24291 35488 13181 -6849 5457 85580 143256 137960 101686 61540 -14539 14065 78733
18563 78733 114190 146410 203533 134871 94000 101683 102813 66313 32311 9594 45678 90335
18551 90335 94403 62651 30052 23421 34849 124907 111229 92586 35669 2838 23333 51796
18539 51796 82740 30858 18424 -8932 5743 28146 -15666 -17739 -244 5702 2442 54588
18527 54588 105180 111940 64895 44303 89742 103725 117797 163541 302700 392946 370251 443821
18515 443821 569872 796156 1118199 1504874 1700715 1617850 1331254 1001697 758568 603623
18505 603623 438422 313566 240011 203421 236376 219994 168591 68013 30335 9980 10757
18494A0757M0856N088j6079k4399L6827J3905l427J9648K4297l7338m4512n850
18482A9773M8383q791n8823l7838N2942J06564L8090k0282j6871J2274o5401j7004
18470E3016j9159l8331J1892N7760m9555m6130M4444L6497K20j3302m2559m1501
18458d6708k4662M3263K7233N0566l3479m8689N1977N2420j839k9568j8058j5704
18446F752m75j466N9366K715k5890j2624j7385K0900q473o5819j4370O5346P3234
18433H1811k8368m0828M259r99J2856k9980o593l210k099J8921N7125L1233k9256
18420F4872K2436o2429n9117K7787R0281j5333l9688j8668k4403L8644N781m3677
18408a3514M5586p577k0961M1152O3929J1450q1005J8816K6245M4052J441m4877
$$ plain form
18494 10757 51613 56701 40622 16223 53050 66955 63528 83176 107473 70135 25623 19773
18482 19773 68156 59365 542 -37296 15646 122210 160300 140018 123147 135421 70020 53016
18470 53016 33857 -4474 7418 65178 15623 -30507 13937 50434 50654 37352 -5207 -46708
18458 -46708 -71370 -28107 -874 49692 16213 -32476 19501 71921 70082 40514 22456 6752
18446 6752 6277 4811 64177 66892 41002 28378 10993 31893 23420 -42399 -56769 8577 81811
18433 81811 53443 12615 16874 15875 28731 -1249 -7842 -11052 -13151 5770 62895 94128 64872
18420 64872 87308 24879 -34238 -6451 83830 68497 28809 10141 -14262 24382 30163 -13514
18408 -13514 32072 24495 3534 44686 108615 120065 39060 57876 84121 128173 129614 84737
18396H4737m9048j9683L6900l7692N9902L5866L0996O5295o110q8904l8640k6362
18384D7257J9370L781L1545k9011K8028J6289L576l2468k9015m0927l2401k7561
18372d1537L9799N2240M3247K5843M4593O3482p015K1358j1404j9292L4487k8178
18360B17623n0502m9798J0588k75p8121K498J18525K0441o5026o3973l8289N6532
18348H0223L8060L1413K3142p2245j2547P5482Q6951K9484l7526J944O8154O1612
18336C74147N9246K1307j8603J0548o5683j21477n2978l7424n5032l5006j8263
18325F0782p0299K9148Q4624M3901M9049j7853o1086L4864L0527K0885K7841l9702
18313A92681n6440L7462m7156k6985O6630k1763o527m4348l9691L7367M5709j5662
$$ plain form
18396 84737 35689 16006 52906 15214 75116 110982 141978 207273 201163 112259 73619 47257
18384 47257 66627 70408 101953 72942 100970 117259 120835 88367 59352 18425 -13976 -41537
18372 -41537 -1738 50502 93749 119592 164185 227667 220652 242010 230606 211314 245801 217623
18360 217623 167121 117323 127911 127636 49515 52013 170538 190979 125953 61980 23691 80223
18348 80223 118283 149696 172838 100593 88046 163528 250479 279963 242437 244381 312535 374147
18336 374147 433393 454700 436097 446645 380962 259485 206507 169083 114051 79045 60782
18325 60782 -9517 19631 104255 148156 197205 179352 118266 153130 183657 204542 232383 192681
18313 192681 136241 173703 126547 99562 166192 144429 137902 93554 53863 91230 136939 121277
18301A21277o2336k0750l0125o926J5627L5310K651n0600m4658k0751N3718R132
18289A569K9791J4387K4367J6976j1685m9934l6371J586q91k500j1291M6823J0705
18276C3532N4524J4664k3573N7120N152l1299k1617j2925j6263M2590k8825O053
18264G9133O6226Q2813N5995k7282m7461n9604m4040l9017j533Q415J3985J4640
18252A02270K062m3704K5511n2069L2932O0250n7359m0042L4016L7637J0819n2989
18240E9334k0977r2J5910l6516q148N9034L9294M732k5596m466j8470N8j0113
18227E3984m2908L9647L6099j9233n7065l5456l6300m7267L9439J32911M8j7555
18215D6344k1880L844j4603N9201J9773J6110m4557l2079L544K1338M7420K0883
$$ plain form
18301 121277 58941 38191 8066 1140 16767 52077 54728 4128 -40530 -61281 -7563 1569
18289 1569 31360 45747 70114 87090 75405 25471 -10900 -9314 -10205 -12705 -23996 22827 33532
18276 33532 88056 102720 79147 136267 141419 110120 88503 75578 59315 101905 73080 79133
18264 79133 145359 228172 284167 256885 209424 149820 105780 66763 65230 73645 87630 102270
18252 102270 104332 60628 86139 34070 67002 127252 69893 29851 63867 101504 112323 59334
18240 59334 38357 38265 54175 17659 9511 68545 107839 112571 86975 82509 64039 64097 53984
18227 53984 11076 50723 86822 67589 10524 -24932 -61232 -108499 -69060 63851 63899 46344
18215 46344 24464 28308 13705 72906 92679 108789 64232 32153 35697 57035 104455 125338
18203A25338j9051N8823Q8905L1424p2468j7219N125k9119o7851l674l2771K1572
18191H9034L7644J011L1256O163L725m857j5323j27027l671O0440j363L550L4531
18178A15113Q2431l885k8311l1857p1844J7811O8181l4596j4464K682J9341l426
18166A17176k0790l4330j2946M106o956K0520L1372Q2565J07701R485k5913J5397
18154B87387l904K9012q2082o215Q7171r345l68K6587N9753N5293m1004r0916
18142C11369K1677P5765P5086L8113L0896M0814K419j1329O1713R5455J09682
18131H51660J04683J53097J82395O8412J37741J57052K32677L88810N21683P34388
18121C532598R38374J123388J201246J325015J489277J879189K452529L666956
$$ plain form
18203 125338 106287 165110 254015 285439 212971 195752 200877 171758 103907 100233 67462 89034
18191 89034 126678 127689 158945 165108 168833 163976 148653 21626 17955 78395 77032 80582 115113
18178 115113 197544 193659 165348 133491 61647 79458 147639 113043 98579 101261 120602 117176
18166 117176 96386 62056 49110 53216 46260 66780 98152 180717 288418 297903 271990 287387
18154 287387 283483 312495 230413 224198 311369 302024 301656 328243 387996 443289 402285 311369
18142 311369 333046 408811 483897 522010 552906 593720 596139 584810 646523 741978 851660
18131 851660 956343 1109440 1291835 1360247 1497988 1655040 1887717 2276527 2798210 3532598
18121 3532598 4470972 5594360 6795606 8120621 9609898 11489087 13941616 17608572
18113A7608572N729815R665522J6501774K5687918K3869047o980231j9835038
18106G2247379k2418257j8427050j0726121o057043l784524k482483j788772j272741
18098E290388r01262o35316m79243m05130l21291l22620l40325k74979j76676
18089A433546j44288j77463j17074r0704j8957m2847o2859j9802j9633p8458o0610
18078F00851k4181k4421l8432q332j11973j7952n4139o8734J1348M9129j7715
18067B95449j04583L3453L6126l3290k2226m3780k6365K5480L5796N2540J2612
18056B61212l7273L2045K4615l1657n5342r213k5703L3722Q042m9064N3985J3230
18044B18599p726K0237k2875n254k3006j4215j865J7411L9238l6109p1975k6022
$$ plain form
18113 17608572 23338387 33003909 49505683 75193601 99062648 92082417 72247379
18106 72247379 49829122 31402072 20675951 14618908 10834384 8351901 6563129 5290388
18098 5290388 4389126 3753810 3274567 2869437 2548146 2225526 1885201 1610222 1433546
18089 1433546 1289258 1111795 994721 904017 885060 842213 779354 759552 739919 661461 600851
18078 600851 576670 552249 513817 505485 393512 375560 321421 252687 264035 313164 295449
18067 295449 190866 224319 260445 227155 204929 161149 134784 160264 196060 248600 261212
18056 261212 223939 255984 280599 248942 193600 184387 158684 192406 200448 151384 205369 218599
18044 218599 210873 231110 208235 202981 179975 165760 163895 181306 220544 184435 112460 86438
18032H6438J0893N1985M1372j2544k7325J8689M7K468l1954j8744L2842m512K9206
18019A78861o610n7725o2403q597M2073Q892L1080q712m0372R198P6550L2792
18007A95027j26022n1086J7948L8919k7363J2239L8754j1848J0590K6625L3695
17996A57478M9770l6891K1266o9300J3293K0308n645m1608p253K2892O4181j8555
17984A69936l3894K3246O3859k3809m3792l7677j5899P02K4890k1944K2964n2159
17972G6423o2192Q697J1884M667j2404K6464K5073J0141O3011J1253J7254k5273
17960A54998k5160J7936M6637r084r0166o2542J6144K0790M3123k5279m4815l7936
17948D646L654j5586L5921J6098R966K7366j6107j7707J8003L763k2615j1620
$$ plain form
18032 86438 97331 149316 190688 178144 150819 169508 169555 172023 140069 121325 154167 149655 178861
18019 178861 172251 114526 52123 43526 85599 94491 125571 116859 76487 85685 162235 195027
18007 195027 69005 17919 35867 74786 47423 59662 98416 86568 97158 123783 157478
17996 157478 207248 170357 191623 122323 135616 155924 150279 108671 101418 124310 188491 169936
17984 169936 136042 159288 223147 199338 155546 117869 101970 102672 127562 105618 128582 76423
17972 76423 14231 22928 34812 39479 27075 53539 78612 88753 151764 163017 180271 154998
17960 154998 129838 147774 194411 185327 95161 32619 48763 69553 112676 87397 42582 4646
17948 4646 8300 -7286 28635 44733 54699 82065 65958 48251 66254 70017 47402 35782
17936C5782q162K7784M0533m6420k2365M7843L2085k962m860m2939k165K6108
17924H0262o4888k3843L0563K316o3905J6663N0710L4209P0576l2076j6439k3083
17912F1065L802l2146O893M5014J737l0517q012K284M8345M3580O941j9218J1006
17899A40774j7801n6310l5331o0302j1296M1471P6799L2766o4359o4913M567N0986
17887C7051K4697K0704L4497k3537k3967l6725j452k9705o667K5205k5949j6354
17875b2202l1322J3561j4178K8650K9445L0283N0865r1437l5452j540K4290J9844
17863H07l7550L9390Q414p413l615q67R8938P8360p38m0960m3933q2053l6025
17850b7245P0779K6194n1423N215L1399j6877K8325L1897J1148k78m1430n3687
$$ plain form
17936 35782 27620 55404 95937 49517 27152 74995 107080 104118 99258 56319 54154 80262
17924 80262 15374 -8469 22094 24410 -39495 -22832 27878 62087 132663 100587 84148 61065
17912 61065 64867 32721 39614 84628 86365 55848 47836 50120 98465 142045 148986 129768 140774
17899 140774 122973 66663 31332 -28970 -40266 1205 78004 110770 46411 -18502 -13935 37051
17887 37051 61748 82452 116949 93412 69445 32720 31268 1563 -5104 20101 -5848 -22202
17875 -22202 -53524 -39963 -54141 -25491 3954 34237 85102 -6335 -41787 -43327 -19037 807
17863 807 -36743 2647 11061 3648 33 -834 98104 176464 175726 134766 90833 8780 -27245
17850 -27245 43534 69728 18305 23520 54919 38042 66367 98264 109412 109134 67704 14017
17838A4017l9850L8301O1434R352j6120k807k6400o777J0768k7719M563J9854
17826C8616n9648L280O2696o553m5878J6104L5006N4878j4645K8094l5345m5312
17814C1293N9472N9767k2519m1665k4189Q313o7102R007J04894O3789o2524p4092
17802D4444n1474k7437K0529O4866M5676J736k5724j1143m3852K6929K7591q345
17790F3796m8733m570Q8955k4117p3882J5894k1595O9341L6320o363n1418j3506
17778C0122M768K6680L1032m0380k4193J9591K000L569J6837J0318J5016n193
17766I0167J4050j9573m2833k9030K6762n994j3442R1305K9469o665k3423k7193
17754H3600k2336J2971K0033J0097K2646L4998k4989o1588k2004K4416J3749k7872
$$ plain form
17838 14017 -25833 12468 73902 83254 67134 64327 37927 31150 41918 14199 18762 38616
17826 38616 -21032 -17752 44944 38391 -7487 8617 43623 98501 83856 111950 76605 31293
17814 31293 90765 150532 128013 86348 62159 70472 3370 12377 117271 181060 118536 44444
17802 44444 -7030 -34467 -13938 50928 96604 98340 72616 61473 17621 44550 72141 63796
17790 63796 15063 10493 99448 75331 1449 17343 -4252 65089 101409 95046 43628 30122
17778 30122 34890 61570 92602 52222 28029 47620 49620 53189 70026 80344 95360 90167
17766 90167 104217 84644 41811 12781 39543 33549 20107 111412 140881 134216 110793 83600
17754 83600 61264 74235 94268 104365 127011 162009 137020 75432 53428 77844 91593 63721
17742F3721Q127m111k7901k9564J22962M0428M512M317M5026R1249R8417R9039
17730E16222J3878q391j390k0326m0143o5404l1072K6300J7002j4016l34M3846
17718D36172l586K5486l4705m7757k4529k3688l7017m1449k8096j3718j8271j03
17706A88739m340O325o4301O313J187k2231j6677J4896j333k286j0996l0977k0076
17693D4243m8862O1687Q5021P8980N3220l7261n1404k7130K5516K6821k797j1555
17681A96479K127l6777r1505K8159L4429J2016l0270J6085k3465J0787m1765R323
17669H5623j6032m3252r135J3433L6582N299m8802n4662O3496K6839K525j5722
17657D6192l0931j7452L681J9605l6358J1845N0823L9434k8688Q0148M1813k2517
$$ plain form
17742 63721 71848 67737 39836 10272 133234 173662 178174 182491 227517 318766 417183 516222
17730 516222 530100 521709 520319 499993 459850 394446 363374 389674 406676 392660 392326 436172
17718 436172 432586 458072 423367 375610 351081 327393 290376 248927 220831 207113 188842 188739
17706 188739 184399 190724 126423 132736 133923 111692 95015 109911 108578 106292 95296 64319 44243
17693 44243 -4619 57068 142089 221069 274289 237028 185624 158494 184010 210831 208034 196479
17681 196479 198606 161829 70324 98483 132912 144928 114658 130743 107278 118065 76300 85623
17669 85623 69591 26339 17204 30637 67219 72518 23716 -30946 32550 59389 61914 46192
17657 46192 15261 -2191 1490 21095 -15263 -3418 47405 86839 58151 138299 180112 157595
17645A57595l166K1875J9949K5571m1061l308Q965L6907R869k0363n9336L291
17633A56788P1643l9544q5383o2586r088N242L2739L7014K9481l858m8113N1102
17621A35437L0037O783l1125j5102l4204J4477O0754Q8642P1915j3635m0630l4961
17609B38388m4070L5618k9552o6839K1358P65j1066J7854K9838m3505l4157k3198
17597I1434P010k3539m863K9335Q1489L9094j0855J3949n2048o6230P4032r206
17585A69602N496J05361L5609J5897l7505n491n1403o1779q4651K5948k134J0024
17573A24974P4367L7261P0610O0057O5039Q1414P8855O1545m3447l4183P8622
17562F55114R284M5692M3754r2822j20633j46533j10190p3485n2214n9166K7272
$$ plain form
17645 157595 154429 176304 196253 221824 180763 177455 186420 223327 233196 212833 153497 156788
17633 156788 228431 188887 103504 40918 31830 37072 69811 106825 136306 132448 84335 135437
17621 135437 165474 172257 141132 126030 91826 106303 167057 255699 327614 313979 273349 238388
17609 238388 194318 229936 200384 133545 154903 155668 144602 162456 192294 148789 114632 91434
17597 91434 98444 74905 70042 99377 180866 219960 209105 223054 171006 104776 178808 169602
17585 169602 175098 280459 316068 331965 294460 288969 237566 175787 91136 117084 114950 124974
17573 124974 199341 236602 307212 367269 432308 513722 592577 654122 610675 576492 655114
17562 655114 664398 710090 753844 661022 540389 393856 283666 210181 157967 98801 126073
17551A26073n750J5711M6040L1744k5919o1490n9095k6269m5581M9244R140O5770
17539A19618n600m73J8300k6384M800j3358K9796l579j6118K8058k4406k5668
17527H4986K7997r906m4779m9677m9491M001K1935K2826m642N6565M833m3808
17515B0840L6468K8356o6812n298M9840j5062n7381J5202Q266j9680o051K5089
17503A3777N4499j8679o887P3502L1838P2261L4081P573k3666j0388P1025J06920
17491D05856N488l7992j22217m2502J7880Q18l5403m4769L7159L282l5673m6856
17479A05071l4151j5440J5442K68l5533n2590L6538K9317l3216k918o870j05k5535
17466a9722k2057R143L100k0393n464k1809O9250K9894l296L9507J8005R370j2496
$$ plain form
17551 126073 120323 136034 182074 213818 187899 126409 67314 41045 -4536 44708 53848 119618
17539 119618 114018 113545 131845 105461 110261 96903 126699 123120 107002 135060 110654 84986
17527 84986 112983 103077 58298 8621 -40870 -36869 -14934 7892 3250 59815 64648 20840
17515 20840 57308 85664 18852 13554 63394 48332 -9049 6153 14419 -5261 -11312 13777
17503 13777 68276 49597 42710 116212 148050 220311 254392 261965 238299 227911 298936 405856
17491 405856 411344 373352 251135 208633 226513 227331 191928 147159 184318 187600 151927 105071
17479 105071 70920 55480 70922 71190 35657 -16933 19605 48922 15706 12788 5918 5813 -19722
17466 -19722 -41779 -32636 -29536 -49929 -55393 -77202 -7952 21942 18646 58153 76158 85528 73032
17453G3032p1667K6789j5779M0052Q5373j8783m6334J9769R6248J14211J05890
17442D08801J16852q6782q2873r3589l8788l1872q5797p0584n5880L2994J4614
17431B7096N567N5433N2l9938N236j8815N2031P1407R599m3640m2947l2268n338
17418D3475J4548K5782o1575j8915l9059M2673L1147p990J8186M8477k1876p929
17406F6944J6732J0026Q99l1832m1348o823O1393l4160l9819j8646k1973r835
17394d8442M4140K5880n9520l6506Q799P6629L8R187j090O752n2107K925M2543
17381A9228k5681J21Q252J3176k385r071M8695L7652j9335m6341J5016Q1237m4194
17368G6370n0785j2641J5077K3378j2701m0065J7352N3812L466k2293J5563k6227
$$ plain form
17453 73032 1365 28154 12375 52427 137800 119017 72683 92452 188700 302911 408801
17442 408801 525653 438871 355998 262409 223621 191749 105952 35368 -20512 12482 27096
17431 27096 32663 88096 88148 48210 53446 34631 86662 158069 167668 124028 81081 48813 43475
17418 43475 58023 83805 22230 3315 -35744 6929 38076 30086 48272 96749 74873 66944
17406 66944 83676 93702 94601 62769 21421 14598 75991 41831 2012 -16634 -38607 -48442
17394 -48442 -4302 21578 -37942 -74448 -65649 10980 11018 20205 19115 25867 -26240 -23315 19228
17381 19228 -6453 -6332 1920 15096 12711 3640 52335 89987 70652 24311 39327 120564 76370
17368 76370 25585 12944 28021 51399 38698 -1367 15985 69797 73263 50970 66533 40306
17356D0306l4494M9425k1935k5785o5001o262L9797J0879j9784m0152N3705N7663
17344C8362r2337k7223J0396l0281Q3011K7990j9974n5191L7702R5610K2384P730
17332I8179L7856o3778l8238K5229K256n0552p6061r3400Q5294N9437O054J9468
17320A1744k1917n0077L1868N4043L1321n0822n095P0596K9974q8696j6394n8564
17308f2019R954M6987L8575m927r2602L9609O0984n057l9043k1940J9650j452
17296a1281k3909j0853L2923l5861l1191M4449R4380l1695l4040j6135m6188K7354
17284d2047J5882M4946M130K216L2794L5644j0185j309m5422L0573l2542k100
17272C2580n1284k467j7303k9496L2945M5841K4599m277m2824o098r3270O745
$$ plain form
17356 40306 5812 55237 33302 7517 -57484 -63746 -23949 -13070 -32854 -73006 -19301 38362
17344 38362 -53975 -81198 -70802 -101083 -18072 9918 -10056 -65247 -27545 68065 90449 98179
17332 98179 136035 72257 34019 59248 61504 10952 -65109 -158509 -73215 -13778 -7724 11744
17320 11744 -10173 -60250 -28382 25661 56982 6160 1065 71661 101635 12939 -3455 -62019
17308 -62019 -52065 -5078 33497 28570 -64032 -24423 36561 31504 -7539 -29479 -9829 -11281
17296 -11281 -35190 -46043 -13120 -48981 -80172 -35723 58657 26962 -7078 -23213 -69401 -42047
17284 -42047 -26165 18781 22911 25127 57921 93565 83380 82071 36649 67222 34680 32580
17272 32580 -18704 -21171 -38474 -67970 -35025 10816 35415 31138 -11686 -17784 -111054 -104309
17260a04309k6009N4728M0642Q650J2776L0105q6039m504L1612k0468L4643O4869
17248C6696Q381l0357j3088L0052J4149J0318k7554L8778n0256l4458J6972r974
17236a0341K7379K1766M9314k3677m2099m0268k3196J7153Q1763N1199L380p2563
17224C9810L124K4271P068k2368O3317Q3579k6435o5175m2230l7232R583N0779
17212H8091N58k7369k1120l114N1197o216J7632m3113K6411K8546K4225j3105
17200A22623l0114K5710N8367N4305j6108l1443k8261Q925J3241K0413n3389q82
17188A43387k5174n4819m2198J01679L2048m0415q8188l4924P3965K944n0390
17177A7915n8269M8676m530r945n0891m5481L1906J8335N187l3796K049L8891
$$ plain form
17260 -104309 -130318 -75590 -34948 -26298 -13522 16583 -69456 -73960 -42348 -62816 -28173 36696
17248 36696 45077 14720 1632 31684 45833 56151 28597 67375 17119 -17339 -367 -10341
17236 -10341 17038 38804 88118 64441 22342 -17926 -41122 -23969 57794 108993 112373 39810
17224 39810 42934 67205 74273 51905 115222 198801 172366 107191 64961 27729 37312 88091
17212 88091 88649 61280 40160 37046 88243 82027 99659 56546 82957 111503 135728 122623
17200 122623 92509 118219 176586 230891 214783 183340 155079 164004 177245 197658 144269 143387
17188 143387 118213 63394 21196 122875 154923 114508 26320 -8604 65361 68305 17915
17177 17915 -40354 8322 3792 -6153 -57044 -102525 -70619 -52284 -47097 -80893 -78844 -39953
17165c9953J3451j4081J688O4957K1163m7406L7741n0487m7201M5270N5432L2729
17153G3303k2771o4339j01268J3938J7064K9534L6031L6207j955j1640l5949p8410
17141a10255j3324N1199q31J6711M1750L0554O7177J6349l7397R985L598q441
17129F7075k5338k0255m151p183K2678M4149q174j02325N62m410K8558J1980l3716
17116c0550j3170M2379l0448m8503K7655k8809J462J5297M3757M71k1437L0567
17104a1329L3856J3271l1980k998M9725j7837o0941M5561K6227L5015k1799m3043
17092A3728j0125J1823L7846K285L0134K8856l3735L4871j34l2499m6281k4701
17080A2068j5565R621l0829N5241M0109L7925K2676p2581n2733n4287P823O2446
$$ plain form
17165 -39953 -26502 -40583 -38895 26062 47225 -181 37560 -12927 -60128 -14858 40574 73303
17153 73303 50532 -13807 -115075 -101137 -84073 -54539 -18508 17699 15744 4104 -31845 -110255
17141 -110255 -123579 -72380 -73211 -56500 -14750 15804 82981 99330 61933 71918 75516 67075
17129 67075 41737 21482 17331 10148 32826 76975 68801 -33524 -32962 -37372 -8814 3166 -30550
17116 -30550 -43720 -1341 -31789 -80292 -52637 -81446 -79984 -64687 -20930 -20459 -41896 -11329
17104 -11329 22527 35798 3818 820 50545 32708 -28233 17328 43555 78570 56771 13728
17092 13728 3603 15426 53272 55557 85691 114547 80812 115683 115549 83050 36769 12068
17080 12068 -3497 6124 -24705 30536 70645 108570 131246 58665 5932 -48355 -40532 21914
17068B1914K2489q296p4449j7397Q1541P7308m1900m7500J4871J6183l4599j5586
17056e421O6020j43m0682j6411j663K8048L2948r5797l6814m1453K6341M6574
17044c8453M8621K6338L6940K1501o7662o8851n571K4228p692q213k895j6992
17032e8701K0496j5379k4803k4380j4106j9205O0880M0922m6178m7064r279M2647
17020i4150L7864M2494k8324r2711l8467L4361P8081O3815M5224n320P357K0047
17008G0271j9635m3998j1628n579L9503J8167o5808m8813L2492Q7396p399j258
16996D3711j6724n7245l9215J2947K7003r825N0709j884J8172M1718K2842l2142
16984F0067k9794k4219N859l9670n1989j996P5125L8719o0313K7505K136n0061
$$ plain form
17068 21914 44403 36107 -38342 -55739 25802 103110 61210 13710 28581 44764 10165 -5421
17056 -5421 60599 60456 19774 3363 1700 29748 62696 -33101 -69915 -111368 -85027 -38453
17044 -38453 10168 36506 73446 94947 27285 -41566 -47137 -22909 -30601 -38814 -41709 -58701
17032 -58701 -38205 -53584 -78387 -102767 -116873 -136078 -75198 -34276 -80454 -127518 -136797 -94150
17020 -94150 -56286 -13792 -42116 -134827 -173294 -138933 -60852 2963 48187 42867 50224 70271
17008 70271 50636 6638 -4990 -10569 28934 47101 -18707 -67520 -35028 52368 44969 43711
16996 43711 26987 -30258 -69473 -56526 -29523 -39348 11361 9477 27649 69367 92209 60067
16984 60067 30273 6054 11913 -27757 -79746 -81742 -6617 32102 -28211 -706 1430 -48631
16972d8631J0332K4459r572l7434R35M8594K9114l9873k9708M4032K2911m1913
16960b6754J494L3676J9371q711m6505k8000k1536j0153M2281K0578M0030M248
16948B0019m7122J8479K0276l68l3736o8343n3098j184P2876N5302N8766O684
16936D8551N9695j6126l7331k5117p5106l1865k3892K0272K7176j3363l5397P768
16924i4735M6640m635l2393K466P942M6970R645n5888j8294O405m0872M3536K2252
16911f0961j800j584M8875K3913p3815K529O257J1359J5613K2607N5019J1632
16899E9644J3046J2202l6274p314K0781l8107L1340n1588k0122J970J630k0913
16887c3705L3567K8909j9288k4463l9244j9519M5418J7552l2645L124K6610K1785
$$ plain form
16972 -48631 -38299 -13840 -23412 -60846 -59911 -11317 17797 -22076 -51784 -7752 15159 -26754
16960 -26754 -25260 8416 27787 19076 -27429 -55429 -76965 -87118 -44837 -24259 15771 20019
16948 20019 -27103 -8624 11652 11284 -22452 -90795 -143893 -145077 -72201 -16899 41867 48551
16936 48551 108246 92120 54789 29672 -45434 -77299 -101191 -80919 -53743 -67106 -102503 -94735
16924 -94735 -48095 -52730 -85123 -82657 -74715 -27745 -18100 -73988 -92282 -85877 -126749 -83213 -60961
16911 -60961 -62761 -64345 -15470 8443 -65372 -62843 -56586 -45227 -29614 -7007 48012 59644
16899 59644 72690 84892 48618 41304 62085 23978 55318 3730 -16392 -14422 -12792 -33705
16887 -33705 -138 28771 9483 -14980 -54224 -73743 -28325 -10773 -43418 -40294 -13684 8101
16875H101L5495P123j9587l5531l595N0700j8987n590l8608m5513o2625o3238
16863a91855Q7369L6039l8257j3422l7612l694Q2470N9873o80m674M9145M4745
16851F9447n5936k9430M771J4461J0174l6062J2294K5620L1269o6561k8285K4262
16839b3976K789J938M086l0966n256m1141j8331K3164j3033J2191K4166Q713L8050
16826a7606l0866k460K8488j8578N3711j4057q032l1140k6867n4001M1986J01974
16814B2552L7907m4144j02989K2698J5981r55N245N983j3255k6220K9831N1699
16802D333M5361l1471j0379k543J3495p6251l9174M0744O7239M089r5700K608
16790g7649N689J7165J09621J0067J3450l7544p7821j2136j4408Q735M1754k373
$$ plain form
16875 8101 43596 50719 31132 -4399 -7994 42706 23719 18129 -20479 -65992 -128617 -191855
16863 -191855 -104486 -68447 -106704 -120126 -157738 -161432 -78962 -19089 -19769 -24443 24702 69447
16851 69447 13511 -15919 -11148 3313 13487 -22575 -10281 15339 46608 -19953 -48238 -23976
16839 -23976 -21187 -19249 -15163 -46129 -51385 -92526 -110857 -87693 -100726 -88535 -64369 -55656 -17606
16826 -17606 -48472 -50932 -22444 -41022 12689 -1368 -9400 -40540 -67407 -121408 -79422 22552
16814 22552 60459 16315 -86674 -63976 -47995 -48950 -43705 -37722 -50977 -77197 -47366 4333
16802 4333 49694 18223 7844 5301 18796 -57455 -96629 -55885 11354 15443 -80257 -77649
16790 -77649 -71960 -54795 54826 64893 78343 40799 -37022 -49158 -63566 -54831 -13077 -15450
16778a5450o467j4716K0874M0694J3741j428k7228j2894j2379n2567j326M5804
16766b3342K0803p727N763M0389n7676l7658L3505m2071N180M5086M67K5728j0735
16753b288O3819r515j8036k1890j1346J9733K3974l5045j8355q86O731m9543l4756
16740h7403J8052K2143M840n9264l1138O3959O3673n1171o8323L5070J7527Q0608
16728H573K8092l3040j7503k43n162K3942m1714n3981K736L8772j6233R278K0072
16715c6411L5753N1503n3491j02754M3636L4124O09M0800L1099j7526l630l0681
16703f969j0605j1165L2876l3850J3949J7995J2508J5707K1755L2M7913o951J1934
16690A05129j9468L020J8995l6390n0638J0146M39k2884l0213n5497L832J4962
$$ plain form
16778 -15450 -21917 -36633 -15759 24935 38676 37248 10020 -2874 -15253 -67820 -69146 -23342
16766 -23342 -2539 -10266 -4503 35886 -21790 -59448 -25943 -68014 -62834 -17748 -17281 8447 -2288
16753 -2288 61531 52016 33980 12090 744 20477 44451 9406 -8949 -9835 -3104 -52647 -87403
16740 -87403 -69351 -47208 -42368 -101632 -132770 -68811 -5138 -56309 -124632 -89562 -72035 8573
16728 8573 36665 3625 -13878 -14121 -19283 4659 -37055 -91036 -88300 -49528 -65761 -56483 -36411
16715 -36411 -658 50845 -2646 -105400 -61764 -27640 -27031 13769 44868 27342 23712 -6969
16703 -6969 -17574 -28739 4137 -29713 -15764 2231 14739 30446 52201 52233 100146 93195 105129
16690 105129 85661 88681 107676 71286 20648 30794 31233 8349 -21864 -77361 -73529 -58567
16678e8567j6335l1974L1390K0412N620K0629K9768J7284J5048m6050j2748J523
16666b4000l4040l2604l4952K4785Q8970m659M0279J5362K9837J1925l9723Q969
16654E0149J7670j5334m1702J2431L8833J24j3497p2525L7397J4558l8071k4462
16642c4429P1067L4228m9856o3752p175P0256J0913j2454K3268L6382k9796p528
16630D1124K6568M4411q816k8894j1345j6904n213L4808J4055j8661n2916K0179
16618C8396J3858l3180o3766m9109J7617K9253J2406N883l2794L569K0725J9887
16606a7255k8498k7715J7361R607L4681P555k5636L6711O6619m296j0606o2267
16594c739J6995k8267r825N1088L548o2921o7544R821P1706M2103r6308n0505
$$ plain form
16678 -58567 -74902 -106876 -75486 -55074 -49454 -28825 943 18227 33275 -12775 -25523 -24000
16666 -24000 -58040 -90644 -125596 -100811 -11841 -16500 23779 39141 68978 80903 41180 50149
16654 50149 67819 52485 10783 23214 62047 62171 48674 -23851 13546 28104 -9967 -34429
16642 -34429 36638 70866 21010 -42742 -49917 20339 31252 18798 42066 78448 48652 41124
16630 41124 67692 112103 103287 74393 63048 46144 40931 75739 89794 71133 18217 38396
16618 38396 52254 19074 -44692 -93801 -76184 -46931 -34525 -28642 -61436 -57867 -37142 -17255
16606 -17255 -45753 -73468 -56107 -46500 -11819 -4264 -29900 6811 73430 69134 58528 -3739
16594 -3739 13256 -15011 -24836 26252 29800 -33121 -100665 -90844 -19138 22965 -73343 -123848
16582a23848M7542R1657L2312k049l5976m5416J0705k914Q203K9260L7044L0862
16570G7382j6159j0858J6634l9755J4232O3765l0403J2972l5223j12268J0164
16559d9517N3566J6185P988j5723P185l625j4538J1312N4080Q723j5550p1292
16547a1206L394J3658m9277k9607L2703J01205M3325j5472R620n5341p448k7754
16535G800n0179m3246K6809L9244J4948n3583k5268J5736m9193l7263N5673L6923
16523f1599O4023K8114J334k901l8787k3473k7551l7805J0510L9531M7852O0168
16511E9416N304n0992n8906k1173M6425N3856K2224k7003j0508K9367M360m7435
16499D935p810J925M295j7005J5526p2828J498J2532j5791l5101l9356M4110N4376
$$ plain form
16582 -123848 -76306 15351 47663 45614 9638 -35778 -25073 -27987 -19784 9476 46520 77382
16570 77382 61223 50365 66999 27244 41476 105241 74838 87810 52587 -59681 -49517
16559 -49517 4049 20234 28222 12499 19684 16059 1521 12833 66913 75636 60086 -11206
16547 -11206 -7812 5846 -43431 -73038 -40335 60870 104195 88723 98343 43002 35554 7800
16535 7800 -42379 -85625 -58816 -19572 -4624 -58207 -83475 -67739 -116932 -154195 -98522 -61599
16523 -61599 2424 30538 31872 28971 -9816 -33289 -60840 -98645 -88135 -48604 -752 59416
16511 59416 64720 13728 -45178 -66351 -19926 33930 56154 29151 18643 48010 52370 4935
16499 4935 -2875 -950 3345 -13660 1866 -70962 -69464 -56932 -72723 -107824 -147180 -103070 -48694
16486d8694L8552j4014o094J054k040r5442K8415N0444L8695m4359j4354N1846
16474a5991L4768o5840L0480k8946n9003l4425J75L552L5124j7108K1118J08977
16462A2881O5912k9896o1191L956J7932j8263M3289m2892p806K9527k0384M431
16450b504j6359j0052P3574K6939L751o8165p9729O2738N5131K6764n9734k3989
16438a1635k6100j7619j9952j004K9719L7954n0425L610k3990J720J9178M160
16426e4384q041L9234K4729j070n0522k1221K1353J5173m8151K3279L0749o1976
16414i0848k9672N2251M2968K3074K5372k9755j3527K4742K4437m447j4735l5134
16402b5274n1451K9936K8008K2977n3946j6685L0664R680L546j0631q7013J6830
$$ plain form
16486 -48694 -10142 -24156 -30250 -29196 -31236 -126678 -98263 -47819 -9124 -53483 -67837 -15991
16474 -15991 18777 -47063 -16583 -45529 -104532 -138957 -138782 -135230 -100106 -117214 -96096 12881
16462 12881 78793 48897 -12294 -8338 9594 -8669 34620 -8272 -16078 13449 -6935 -2504
16450 -2504 -18863 -28915 44659 71598 75349 7184 -72545 -9807 45324 72088 12354 -11635
16438 -11635 -37735 -55354 -75306 -76310 -46591 -8637 -59062 -55452 -79442 -77722 -58544 -54384
16426 -54384 -62425 -23191 1538 468 -50054 -71275 -49922 -34749 -82900 -59621 -28872 -90848
16414 -90848 -120520 -68269 -25301 -2227 23145 -6610 -20137 4605 29042 24595 9860 -25274
16402 -25274 -76725 -46789 -18781 4196 -49750 -66435 -35771 -26091 -22545 -33176 -120189 -103359
16390a03359J0425J2006J8662m0936r697K6096q26M5797J1219J991j2314M8629
16378G693n5285n4989q828L3999M7935J5326J4745M7815K4845K872k7111n0911
16366a894n5133q791n8049J5067L3767J6724l6193l0971K6657J8237R821j3006
16354h3764O3649K7770m5578o4737R285L2534L6919J0116l7779K7599N6381j8273
16342A4122l8926n8448J1047N2934O2182p2823j12730K4279J0932L8537K4303
16331d4591K0210m736J5264J3943J3256n4966k4006k954P6634L4264l8401l2140
16319b8223m261l8412l8430J1095P857j0534N0248P1308M9829n4400o8952N982
16307d6893N2556r034k2800J6775j5801k3080n9393n7736Q7725K7857k8321k303
$$ plain form
16390 -103359 -92934 -80928 -62266 -103202 -112899 -86803 -87629 -41832 -30613 -28622 -40936 7693
16378 7693 -47592 -102581 -111409 -77410 -29475 -14149 596 48411 73256 76128 49017 -1894
16366 -1894 -57027 -65818 -123867 -108800 -75033 -58309 -94502 -125473 -98816 -80579 -70758 -83764
16354 -83764 -20115 7655 -37923 -102660 -93375 -60841 -23922 -13806 -51585 -23986 32395 14122
16342 14122 -24804 -83252 -72205 -19271 42911 -29912 -142642 -118363 -107431 -68894 -44591
16331 -44591 -24381 -29117 -13853 90 13346 -41620 -65626 -68580 8054 42318 3917 -28223
16319 -28223 -32484 -70896 -109326 -98231 -90374 -100908 -50660 20648 70477 16077 -52875 -46893
16307 -46893 5663 -3371 -26171 -9396 -25197 -48277 -107670 -165406 -77681 -49824 -78145 -80448
16295h0448L9058L3775j7524m7783l7172N257J4124P596L2801K6022M059o331
16283b6566L4638J5893m0710M2858N3017l5873p3960k4632N4541O807N5750Q9955
16271A51718j3045r5676m7401j3461K6986n339j2734k0492L0733J8482r80m3775
16259b4984l3668o723k992l8445J6293L4938K2570P779j7548K843m4282O1010
16247b3209L0711m6070k4293j8341k27k4199N334k6939P1605L3644m7238j3086
16235h2308K4579k0617J4772K7049J7689J370j8494n943m2345K6974m367P488
16223e4153n352p8P1941J3987l5063o8533m297M7014K6001K4493J7012K9694j065
16210F1601m9207k1864p0037K7870M4670L3538J1702l1965N00M820m012J6850
$$ plain form
16295 -80448 -41390 -7615 -25139 -72922 -110094 -104837 -90713 -83117 -50316 -24294 -20235 -26566
16283 -26566 8072 23965 -16745 26113 79130 43257 -30703 -55335 -794 6013 61763 151718
16271 151718 138673 42997 -4404 -17865 9121 3782 -8952 -29444 1289 19771 18791 -24984
16259 -24984 -58652 -65375 -68367 -106812 -90519 -55581 -33011 -25232 -42780 -39937 -84219 -23209
16247 -23209 7502 -38568 -62861 -81202 -81429 -105628 -100294 -127233 -55628 -21984 -69222 -82308
16235 -82308 -57729 -78346 -63574 -36525 -18836 -17466 -35960 -41903 -84248 -57274 -61641 -54153
16223 -54153 -59505 -59583 12358 26345 -8718 -77251 -81548 -34534 -8533 15960 32972 62666 61601
16210 61601 12394 -9470 -79507 -51637 -6967 26571 38273 6308 6808 11628 7616 24466
16198B4466K4822m019k2802m2901j6059M6253N3354J3931L017K5395p3112r425
16186B2920r024J3385M2981R503p3160j5183L203n9643o7566M9398J33349M8050
$$ plain form
16198 24466 49288 45269 22467 -20434 -36493 9760 63114 77045 80062 105457 32345 22920
16186 22920 13896 27281 70262 79765 6605 -8578 -5375 -65018 -132584 -83186 50163 98213
$$ [...]
##END NTUPLES=NMR SPECTRUM
##END=
