##TITLE=Analysis number 329964
Compound Code cc 66346
Book Reference 464/182/8
Project Code adrs
Chemist Name chrisr
##JCAMPDX= 6.0         $$ Bruker NMR JCAMP-DX V2.0
##DATA TYPE= NMR SPECTRUM
##DATA CLASS= NTUPLES
##ORIGIN= Bruker BioSpin GmbH
##OWNER= nmr
$$ XWIN-NMR		Version 3.5
$$ Tue Oct 16 10:07:03 2007 GMT Daylight Time (UT+1h)  MAYBRIDGE\nmr@NMR_250MHZ
##.OBSERVE FREQUENCY= 250.131544655141
##.OBSERVE NUCLEUS= ^1H
##.ACQUISITION MODE= SIMULTANEOUS (DQD)
##.ACQUISITION SCHEME= undefined
##.AVERAGES= 16
##.DIGITISER RES= 18
##SPECTROMETER/DATA SYSTEM= dpx250
##.PULSE SEQUENCE= zg30
##.SOLVENT NAME= CDCl3
##.SHIFT REFERENCE= (INTERNAL, CDCl3, 0, 16.4488)
##AUDIT TRAIL= $$ (NUMBER, WHEN, WHO, WHERE, WHAT)
$$ ##TITLE= Audit trail, XWIN-NMR		Version 3.5
$$ ##JCAMPDX= 5.01
$$ ##ORIGIN= Bruker BioSpin GmbH
$$ ##OWNER= nmr
$$ C:\u/data/dgb/nmr/ADRS/810/pdata/1/auditp.txt
$$ ##AUDIT TRAIL=  $$ (NUMBER, WHEN, WHO, WHERE, WHAT)
(   1,<2007-10-16 10:06:37.80 +100>,<MAYBRIDGE\nmr>,<NMR_250MHZ>,
      <created by zg, POWCHK disabled, PULCHK disabled
       configuration hash MD5:
       76 6E 9A 78 1E 09 19 81 EC 84 63 8F B0 6A 59 2D
       data hash MD5: 64K
       33 7E F5 43 7A 36 7F 0C 1F 50 7C 70 83 D7 AF 07>)
(   2,<2007-10-16 10:06:52.16 +100>,<MAYBRIDGE\nmr>,<NMR_250MHZ>,
      <Start of raw data processing
       ef LB = 0.3 FT_mod = 6 PKNL = 1 SI = 32K 
       data hash MD5: 32K
       A4 2A E3 B6 28 65 3A 0F 17 4D 72 66 E4 49 C1 0B>)
(   3,<2007-10-16 10:06:53.93 +100>,<MAYBRIDGE\nmr>,<NMR_250MHZ>,
      <apk 
       data hash MD5: 32K
       F7 C0 3A 99 77 6E 1D 8D ED 17 F7 3F 97 68 BF DD>)
(   4,<2007-10-16 10:06:54.73 +100>,<MAYBRIDGE\nmr>,<NMR_250MHZ>,
      <abs ABSG = 5 
       data hash MD5: 32K
       59 68 B4 21 A9 39 4E 25 B2 B1 E7 AF 1C 5C 07 25>)
$$ ##END=
$$ 
$$ hash MD5
$$ 6A 00 BD 9A 46 88 28 18 9A 93 CF 00 7D 00 AB 0B
##$RELAX= 
##$RELAX= 
##$RELAX= 
##$RELAX= 
##$RELAX= 
##$RELAX= 
##$RELAX= 
$$ Bruker specific parameters
$$ --------------------------
##$DU= <C:\u>
##$EXPNO= 810
##$NAME= <ADRS>
##$PROCNO= 1
##$TYPE= <nmr>
##$USER= <dgb>
##$AMP= (0..31)
100 100 100 100 100 100 100 100 100 100 100 100 100 100 100 100 100 100 
100 100 100 100 100 100 100 100 100 100 100 100 100 100 
##$AQSEQ= 0
##$AQ_mod= 3
##$AUNM= <au_zg>
##$AUTOPOS= <12 >
##$BF1= 250.13
##$BF2= 250.13
##$BF3= 250.13
##$BF4= 250.13
##$BF5= 500.13
##$BF6= 500.13
##$BF7= 500.13
##$BF8= 500.13
##$BYTORDA= 1
##$CFDGTYP= 0
##$CFRGTYP= 5
##$CHEMSTR= <none>
##$CNST= (0..31)
1 1 145 1 1 1 1 1 1 1 1 1 1 1 1 1 1 1 1 1 1 1 1 1 1 1 1 1 1 1 1 1 
##$CPDPRG= <>
##$CPDPRG1= <>
##$CPDPRG2= <>
##$CPDPRG3= <>
##$CPDPRG4= <mlev>
##$CPDPRG5= <mlev>
##$CPDPRG6= <mlev>
##$CPDPRG7= <mlev>
##$CPDPRG8= <mlev>
##$CPDPRGB= <>
##$CPDPRGT= <>
##$D= (0..31)
0 1 0 0 0 0 0 0 0 0.06 0 0 0 0 0 0 0.0002 0 0 0 0 0 0 0 0 0 0 0 0 0 0 
0 
##$DATE= 1192525596
##$DBL= (0..7)
120 120 120 120 120 120 120 120 
##$DBP= (0..7)
150 150 150 150 150 150 150 150 
##$DBP07= 0
##$DBPNAM0= <>
##$DBPNAM1= <>
$$ [...]
##$SUBNAM7= <"">
##$SUBNAM8= <"">
##$SUBNAM9= <"">
##$SW= 20.6930455092707
##$SWIBOX= (0..15)
0 0 3 0 0 0 0 0 0 0 0 0 0 0 0 0 
##$SW_h= 5175.983436853
##$TD= 65536
##$TD0= 1
##$TE= 296.16
##$TE2= 300
##$TE3= 300
##$TEG= 300
##$TL= (0..7)
0 120 120 120 120 120 120 120 
##$TP= (0..7)
150 150 150 150 150 150 150 150 
##$TP07= 0
##$TPNAME0= <>
##$TPNAME1= <>
##$TPNAME2= <>
##$TPNAME3= <>
##$TPNAME4= <>
##$TPNAME5= <>
##$TPNAME6= <>
##$TPNAME7= <>
##$TPOAL= (0..7)
0.5 0.5 0.5 0.5 0.5 0.5 0.5 0.5 
##$TPOFFS= (0..7)
0 0 0 0 0 0 0 0 
##$TUNHIN= 0
##$TUNHOUT= 0
##$TUNXOUT= 0
##$USERA1= <user>
##$USERA2= <user>
##$USERA3= <user>
##$USERA4= <user>
##$USERA5= <user>
##$V9= 5
##$VALIST= <valist>
##$VCLIST= <CCCCCCCCCCCCCCC>
##$VD= 0
##$VDLIST= <DDDDDDDDDDDDDDD>
##$VPLIST= <PPPPPPPPPPPPPPP>
##$VTLIST= <TTTTTTTTTTTTTTT>
##$WBST= 1024
##$WBSW= 4
##$XGAIN= (0..3)
0 0 0 0 
##$XL= 0
##$YL= 0
##$YMAX_a= 346665
##$YMIN_a= -535130
##$ZGOPTNS= <>
##$ZL1= 120
##$ZL2= 120
##$ZL3= 120
##$ZL4= 120
##$ABSF1= 16.44883
##$ABSF2= -4.244343
##$ABSG= 5
##$ABSL= 3
##$ALPHA= 0
##$AQORDER= 0
##$ASSFAC= 0
##$ASSFACI= 0
##$ASSFACX= 0
##$ASSWID= 0
##$AUNMP= <proc_1d>
##$AZFE= 0.1
##$AZFW= 0.1
##$BCFW= 0
##$BC_mod= 0
##$BYTORDP= 0
##$COROFFS= 0
##$CY= 12.5
##$DATMOD= 1
##$DC= 0
##$DFILT= <>
##$DTYPP= 0
##$F1P= 14.0000005364418
##$F2P= -0.99999901652339
##$FCOR= 0.5
##$FTSIZE= 32768
##$FT_mod= 6
##$GAMMA= 0
##$GB= 0
##$INTBC= 1
##$INTSCL= 1
##$ISEN= 128
##$LB= 0.3
##$LEV0= 0
##$LPBIN= 0
##$MAXI= 10000
##$MC2= 0
##$MEAN= 0
##$ME_mod= 0
##$MI= 0
##$NCOEF= 0
##$NC_proc= -3
##$NLEV= 6
##$NOISF1= 0
##$NOISF2= 0
##$NSP= 0
##$NTH_PI= 0
##$NZP= 0
##$OFFSET= 16.44883
##$PC= 1
##$PHC0= 153.778
##$PHC1= 9.255017
##$PH_mod= 1
##$PKNL= yes
##$PPARMOD= 0
##$PSCAL= 4
##$PSIGN= 0
##$REVERSE= no
##$SF= 250.130018300703
##$SI= 32768
##$SIGF1= 0
##$SIGF2= 0
##$SINO= 400
##$SIOLD= 32768
##$SREGLST= <1H.CDCl3>
##$SSB= 0
##$STSI= 32768
##$STSR= 0
##$SW_p= 5175.98343685301
##$SYMM= 0
##$S_DEV= 0
##$TDeff= 65536
##$TDoff= 0
##$TI= <Analysis number 999999
Compound Code 99
Book Reference 9
Project Code 9>
##$TILT= no
##$TM1= 0
##$TM2= 0
##$TOPLEV= 0
##$USERP1= <user>
##$USERP2= <user>
##$USERP3= <user>
##$USERP4= <user>
##$USERP5= <user>
##$WDW= 1
##$XDIM= 32768
##$YMAX_p= 413157521
##$YMIN_p= -215002
$$ End of Bruker specific parameters
$$ ---------------------------------
##NTUPLES= NMR SPECTRUM
##VAR_NAME=  FREQUENCY,     SPECTRUM/REAL,   SPECTRUM/IMAG
##SYMBOL=    X,             R,               I
##VAR_TYPE=  INDEPENDENT,   DEPENDENT,       DEPENDENT
##VAR_FORM=  AFFN,          ASDF,            ASDF
##VAR_DIM=   32768,         32768,           32768
##UNITS=     HZ,            ARBITRARY UNITS, ARBITRARY UNITS
##FACTOR=    0.157963299565203, 1,           1
##FIRST=     4114.34606159949, 0,            0
##LAST=      -1061.63737525352, 0,           0
##MIN=       -1061.63737525352, -215002,     0
##MAX=       4114.34606159949, 413157521,    0
$$ Real data points
##PAGE= N=1
##DATA TABLE= (X++(R..R)), XYDATA
$$ [...]
16448D3623R159n499j5010j0453N726r47p092l305J3845p657l470J8886j4294
$$ 43623 52782 47283 32273 21820 27546 26599 19507 16202 30047 22390 18920 37806 23512
16435B3512j2112Q007j3336k0190J3711L4444L344j7019R274J5703k1380m3209
$$ 23512 11400 19407 6071 -14119 -408 34036 37380 20361 29635 45338 23958 -19251
16423a9251Q98K2430N1000k4821l8734o877n403K7068J4929J8465j9318q562o61
$$ -19251 -18353 4077 55077 30256 -8478 -15355 -20758 6310 21239 39704 20386 11824 11163
16410A1163L402J4283J0773m50j2970n694j5037K3841l106l1237j8257J4610J8548
$$ 11163 14565 28848 39621 39171 26201 20507 5470 29311 26205 -5032 -23289 -8679 9869
16397I869j0883n188J2182J0683Q447M888j831j0378J3972K0293l541n3091l984
$$ 9869 -1014 -6202 5980 16663 25110 29998 28167 17789 31761 52054 48513 -4578 -8562
16384h562J0947j4784J8005J9510P650K4982K508j1591j3344k1117O820j7529
$$ -8562 2385 -12399 5606 25116 32766 57748 60256 48665 35321 14204 21024 3495
16372C495J922o268k17k1013l3413j4079J0305K7578J7260J5215J4798j465l279
$$ 3495 5417 -851 -1068 -22081 -55494 -69573 -59268 -31690 -14430 785 15583 14118 10839
16359A0839l5311j9597K3683Q541q447n588N2k5481J869L5851J9840M2100J868
$$ 10839 -24472 -44069 -20386 -11845 -20292 -25880 -25828 -51309 -49440 -13589 6251 48351 50219
16346E0219j9294j4997j1631K2301N462r25l6626j5190N578R270P082j1989o821
$$ 50219 30925 15928 4297 26598 32060 31135 -5491 -20681 -15103 -5833 1249 -10740 -17561
16333a7561j5389R727L5333q729k7178O534K640j3917J5738J3838k464k1349k8697
$$ -17561 -32950 -23223 12110 3381 -23797 -17263 -14623 -28540 -12802 1036 -1428 -22777 -51474
16320e1474j4441J2356O022j2734K0430J8702J6477p299k4787J526K3645J4973
$$ -51474 -65915 -53559 -47537 -60271 -39841 -21139 -4662 -11961 -36748 -35222 -11577 3396
16308C396k344R991J8640K5250J73K733n48k2064j8352q617K2606n539p499l571
$$ 3396 1052 11043 29683 54933 55106 57839 57291 35227 16875 8258 30864 25325 17826 14255
16294A4255k0473P87j279o823K5460N814j3181l076p59j6093O181q970j6687J9151
$$ 14255 -6218 -5431 -6710 -13533 11927 17741 4560 1484 725 -15368 -9187 -18157 -34844 -15693
16280a5693L372p079J11J3086j4644j1709K6907k591K3840O734j8450j6648l959
$$ -15693 -12321 -19400 -19289 -6203 -20847 -32556 -5649 -8240 15600 22334 3884 -12764 -16723
16267a6723K5871O533j8540k0263j3696J9780J4621R843j724O344K2904J6610
$$ -16723 9148 15681 -2859 -23122 -36818 -17038 -2417 7426 5702 12046 34950 51560
16255E1560k4509j7063j3743j37J0265J977m431l588J1596J5440m423k7437M58
$$ 51560 27051 9988 -3755 -3892 6373 8350 3919 331 11927 27367 22944 -4493 -4035
16242d035R732r115R545N28l341l375q280J0712M915L799j0567j6386q025O130
$$ -4035 5697 -3418 6127 6655 3314 -61 -8341 2371 7286 11085 518 -15868 -23893 -17763
16228a7763J630j2461j7776K394K5038q11J2394J4085K829N980J1847p563j5005
$$ -17763 -16133 -28594 -46370 -43976 -18938 -19749 -7355 6730 9559 15539 27386 19823 4818
16215D818J0550L214p865J0846j5152j7758p194k5437l4877L4758K6528J6481
$$ 4818 15368 18582 10717 21563 6411 -11347 -18541 -43978 -78855 -44097 -17569 -1088
16203a088J5579K687j2281L285L6460K4030j2580l3973K2023J3575N613j8939
$$ -1088 14491 17178 4897 8182 44642 68672 56092 22119 44142 57717 63330 44391
16191D4391j0089m405k6333j9587J1453p142k2961L3813J7646j5762J595K052
$$ 44391 34302 29897 3564 -16023 -4570 -11712 -34673 -860 16786 1024 2619 4671
16179D671q056L204j7825K4220J3839P041k6732j6622j4339N624Q631K8313k3223
$$ 4671 -3385 -181 -18006 6214 20053 27094 362 -16260 -30599 -24975 -16344 11969 -11254
16166a1254k7780K3258j320J4203O259j456R269l338j9367R370R91M587P710j6128
$$ -11254 -39034 -15776 -17096 -2893 3366 1910 11179 7841 -11526 -2156 -1165 3422 11132 -4996
16152d996j6903L934J4001j8115J3160K8335m127m3441l618k4072K645J7783M183
$$ -4996 -21899 -17965 -3964 -22079 -8919 19416 15289 -28152 -31770 -55842 -53197 -35414 -31231
16139c1231K3210j3799P198J9131j1353p636k4075Q402J5175j533j7637j5761
$$ -31231 -8021 -21820 -14622 4509 -6844 -14480 -38555 -30153 -14978 -16511 -34148 -49909
16127d9909r205J1478K0140O242K0853K8143L0218l584M306l6294m3417M401J7635
$$ -49909 -59114 -47636 -27496 -21254 -401 27742 57960 54376 58682 22388 -21029 -16628 1007
16114A007J1393L4185K03k6495M43j1245l9018j8529O39L9092M1748K2217L603
$$ 1007 12400 46585 46788 20293 20736 9491 -29527 -48056 -47417 -8325 33423 55640 59243
16101E9243l5120j5942l3943j2400J8333M4420L1525r331p267k6557k3387n769
$$ 59243 24123 8181 -25762 -38162 -19829 24591 56116 46785 39518 12961 -10426 -16195
16089a6195n979j5713R478J8847J2314k4675M505J0927o566p54O847o394J27L882
$$ -16195 -22174 -37887 -28409 -9562 2752 -21923 -17418 -6491 -13057 -13811 -6964 -13358 -13231 -9349
16075i349J3946J8333J2495k03r568r904j9074l0302N638M0484O720R56n188j1767
$$ -9349 4597 22930 35425 35222 25654 15750 -3324 -33626 -27988 12496 19216 20172 14984 3217
16061C217L383J4087K5608k9323j6441n025L2588J0542o825k443j7020K9227K9854
$$ 3217 6600 20687 46295 16972 531 -4494 28094 38636 31811 29368 12348 41575 71429
16048G1429l3503m3453j7759M020J9862L65N805L0968J8293L453j3181l3742r128
$$ 71429 37926 -5527 -23286 -19266 596 961 6766 37734 56027 59480 46299 12557 3429
16035C429o234k3441j2028m668K7913J6420l2473J0324K9909P013N107j1381p297
$$ 3429 -2805 -26246 -38274 -42942 -15029 1391 -31082 -20758 9151 16164 21271 9890 2593
16022B593k5198n239N482K539j1693k5887K2350J8323j8115m84j8956l086R780
$$ 2593 -22605 -27844 -22362 -19823 -31516 -57403 -35053 -16730 -34845 -35329 -54285 -57371 -47591
16009d7591J0390j2886k2514L3102L8736J2025o378l8820K4794J0535k446J5323
$$ -47591 -37201 -50087 -72601 -39499 -763 11262 4884 -33936 -9142 1393 -1053 14270
15997A4270J9901K9102P223L945j1622q387N138j1205k5798O921M735q137K324
$$ 14270 34171 63273 70496 74441 62819 54432 59570 48365 22567 29488 34223 26086 28410
15984B8410J7072j3575O378k4913k1670k0959P968K1026N696K1083j0492l928
$$ 28410 45482 31907 38285 13372 -8298 -29257 -21289 -263 5433 26516 16024 12096
15972A2096L0186k0582j8199k8017l486J2746J9806J1661R973P713J945j9822
$$ 12096 42282 21700 3501 -24516 -28002 -15256 4550 16211 26184 33897 35842 16020
15960A6020n138j114R984K43k6277N438K6774k1767l2604K978N673O685o544N242
$$ 16020 10882 9768 19752 19995 -6282 -844 25930 4163 -28441 -25463 -19790 -13105 -19649 -14407
15946a4407J3704j1746l1349K2349m860J2975M791R89J4172K318K3333R31N831
$$ -14407 -703 -12449 -43798 -21449 -26309 -13334 -8543 -7554 6618 8936 32269 33200 39031
15933C9031J9173j4719l3108k217J3867j7489j9452J5537o85P35J5698K1383J5844
$$ 39031 58204 43485 10377 8160 22027 4538 -14914 623 -62 673 16371 37754 53598
15920E3598J8213O595j7074k7409k3625K47q789R355J4876o302L479j1204j4340
$$ 53598 71811 78406 61332 33923 10298 10545 1756 11111 25987 19685 23164 11960 -2380
15907b380J0717J9764k648k8985J6572J9450o879n125l880J8985n331j9738k5234
$$ -2380 8337 28101 25453 -3532 13040 32490 25611 20486 16606 35591 30260 10522 -14712
15894a4712p220K3673K0603K0892P843l936r499J1708k009j2149j1866j1692J6376
$$ -14712 -21932 1741 22344 43236 51079 47143 37644 49352 47343 35194 23328 11636 28012
15881B8012j32j1108j8903M151p912p907L2222J0851k8513m109K269J847M584
$$ 28012 27880 16772 -2131 2020 -5892 -13799 18423 29274 761 -3348 -1079 768 5352
15868E352j3682j5274P524J6506K3286K1227J2766O641m1419l2213M952J4965
$$ 5352 -8330 -23604 -16080 426 23712 44939 57705 64346 22927 -9286 -4334 10631
15856A0631o71j3571J1099K2935Q176M331m176j2737k7247j5840j1206K679n313
$$ 10631 9960 -3611 7488 30423 38599 42930 38754 26017 -1230 -17070 -28276 -25597 -30910
15843c0910J0720L9770J6369k7813l2164J6320m746m597J937j4886l0109O744
$$ -30910 -20190 19580 35949 8136 -24028 -7708 -12454 -17051 -15114 -30000 -60109 -53365
15831e3365L9389K629q183K354Q718j2107J4934N534k1187M024j3362l0585j249
$$ -53365 -13976 -11347 -19530 -17176 -8458 -20565 -5631 -97 -21284 -17260 -30622 -61207 -62456
15818f2456K8318L0417K3249l09j1479j6465J2798L1834J4178j9901k4682j8236
$$ -62456 -34138 -3721 19528 19219 7740 -8725 4073 35907 50085 30184 5502 -12734
15806a2734K5174K9038j2429l4745j0704K3567q680l064J2554L1130k1146k0419
$$ -12734 12440 41478 29049 -5696 -16400 7167 -1513 -4577 7977 39107 17961 -2458
15794b458m119J6599j2401O600K4349J9389k672j0842j2109k4876j3522l6334
$$ -2458 -6577 10022 -2379 4221 28570 47959 45287 34445 22336 -2540 -16062 -52396
15782e2396O980M7592J4829K580J9279P56r635K6j2568m393m2296j2523L6749
$$ -52396 -45416 2176 17005 19585 38864 39620 29985 30011 17443 13050 -29246 -41769 -5020
15769e020M5375q202l7102N944J9105j5652J7236L6745j6472m646k529P655j1010
$$ -5020 40355 32153 -4949 995 20100 4448 21684 58429 41957 37311 34782 42437 31427
15756C1427j6549J1027j2449m047L366k3934k4735J4582L4024J3112K617P092
$$ 31427 14878 25905 13456 9409 12775 -11159 -35894 -21312 12712 25824 28441 35533
15744C5533j6103j2631J5753J8346K038J5959l1483k7606k788m953J6691L0625
$$ 35533 19430 6799 22552 40898 42936 58895 27412 -194 -2982 -7935 8756 39381
15732C9381N768l0469j5183q022P011M556J29L330k115N212j1289j8781J9915
$$ 39381 45149 14680 -503 -8525 -1514 3042 3171 6501 4386 9598 -1691 -20472 -557
15719e57J5578j9544j1J2126l516M612j5082l3849J8728R203J9363J0003J0405
$$ -557 15021 -4523 -4534 7592 4076 8688 -6394 -40243 -21515 -12312 7051 17054 27459
15706B7459k163q833j790N021P684M348L22J472N752M916k3863j6528j8200J3888
$$ 27459 25296 16463 14673 19694 27378 31726 32048 33520 39272 44188 20325 3797 -14403 -515
15692e15K2633J0618j726O3l6633o490K4699j5295j8438K4272L6295Q957J8183
$$ -515 22118 32736 31010 31073 -5560 -12050 12649 -2646 -21084 3188 39483 48440 66623
15679F6623p821k9509l0961k1360K6776j252l6718k3199j349O031p988J8748N0480
$$ 66623 58802 29293 -1668 -23028 3748 2496 -34222 -57421 -58770 -52739 -60727 -41979 8501
15666H501L2354j0810k6384k2114j8850J0452j0224J0954J8925J5790J8396m3603
$$ 8501 40855 30045 3661 -18453 -37303 -26851 -37075 -26121 -7196 8594 26990 -16613
15654a6613K60J8352r760j0819j1790Q649o389o10K124j7120K2507J4848r749
$$ -16613 -16353 1999 -7761 -18580 -30370 -21721 -28110 -28720 -26596 -43716 -21209 -6361 -16110
15641a6110k412L044K4079j3750P602l578k657o771j9319J1258j2155K4879J5709
$$ -16110 -18522 -15478 8601 -5149 2453 -1125 -3782 -10553 -29872 -18614 -30769 -5890 9819
15628I819j0239q772K965O69j6278M647m104M597J5815P932j1111P897Q739l505
$$ 9819 -420 -9192 -6227 -5558 -21836 -17189 -21293 -16696 -881 7051 -4060 3837 12576 9071
15614I071n341n424M231K739k468r255p206J1535K6982K395j853k0105J021K8292
$$ 9071 3730 -1694 2537 5276 2808 -6447 -13653 -2118 24864 27259 25406 5301 6322 34614
15600C4614L2672K504m0562l4706l3693n070K0785K2947K9093n833k2305j3069
$$ 34614 67286 69790 29228 -5478 -39171 -44241 -23456 -509 28584 22751 446 -12623
15588a2623m535P393Q185n276p285K1484N453k947j1604k1420j0964j9524P543
$$ -12623 -17158 -9765 -1580 -6856 -14141 7343 12796 9849 -1755 -23175 -34139 -53663 -46120
15575d6120K3285K6037R998j949p324j5690L701K5744L2755l901l8591M024k3031
$$ -46120 -22835 3202 13200 11251 3927 -11763 -8062 17682 50437 46536 7945 11969 -11062
15562a1062p99L2663Q521k6781k286Q940j2939j3877J5183J9966o798j0539l924
$$ -11062 -11861 20802 29323 2542 256 9196 -3743 -17620 -2437 17529 10731 192 -3732
15549c732K4467p356k0149R355K8504j4879j9347o457J7750J280k0945j9319L2773
$$ -3732 20735 13379 -6770 2585 31089 16210 -3137 -9594 8156 9436 -11509 -30828 1945
15536A945M7054J9108j9895j7212l214k4623j8505J6106J0066R529j3739k1964
$$ 1945 48999 68107 48212 31000 27786 3163 -15342 764 10830 20359 6620 -15344
15524a5344K1005J9112J255j0554Q573R355k0409m0489q737J851P87K2430M0172
$$ -15344 5661 24773 26028 15474 24047 33402 12993 -27496 -36233 -34382 -33595 -11165 29007
15511B9007K1979k6011k1528j878M36N333k7558j5954J193J2556L3442j6890n912
$$ 29007 50986 24975 3447 1569 2005 7338 -20220 -36174 -34981 -22425 11017 -5873 -11785
15498a1785k020J1934J6063l255l396l5289j530L988J6937L6686O759k0125O534
$$ -11785 -13805 -1871 14192 10937 7541 -27748 -29278 -25290 -8353 28333 35092 14967 21501
15485B1501J307k936j1660K150j4671n819p660K3832J5684J6127m626J3844M297
$$ 21501 22808 19872 8212 10362 -4309 -10128 -17788 6044 21728 37855 33229 47073 51370
15472E1370j6500j4660P376j0190J3140M10k9687o562l41j9308q679P395j0495
$$ 51370 34870 20210 27586 17396 30536 30946 1259 -5303 -5644 -24952 -33631 -26236 -36731
15459c6731j4352J4564J5571m844R213P948J8492j995J641j6610M847J3780j9007
$$ -36731 -51083 -36519 -20948 -25792 -16579 -8631 9861 7866 9507 -7103 -2256 11524 -7483
15446g483M745M42K0531O80j9137K1426J1701l550L445J3133l994k0623k2081
$$ -7483 -2738 -2296 18235 18915 -222 21204 32905 29355 32800 45933 41939 21316 -765
15433g65J303K1766K330L486J5988K1788j6078k0209j2659l532L951q959r115
$$ -765 538 22304 24634 28120 44108 65896 49818 29609 16950 13418 17369 8410 -705
15420g05j1098L6809n439j7399r946j3281m573J4318K1780k9414m6051o389J2514
$$ -705 -11803 25006 19567 2168 -7778 -21059 -25632 -11314 10466 -18948 -64999 -71388 -58874
15407e8874J8716M4321J7849l73m230k1771J7070L913N117M835R098J2920k7408
$$ -58874 -40158 4163 22012 21639 17409 -4362 12708 16621 21738 26573 35671 48591 21183
15394B1183j53j4094j753P167j5096p518M6782p235k0242l086J1811q6k1982k7256
$$ 21183 21030 6936 5183 12350 -2746 -10264 36518 29283 9041 5955 17766 17680 -4302 -31558
15380c1558m203K3449J3383j4244Q008J6930L654j6689j1756j0926K6561J3549
$$ -31558 -35761 -12312 1071 -13173 -5165 11765 15419 -1270 -13026 -23952 2609 16158
15368A6158k0158l790Q928J8118m975O930Q627j1618j6157J5545J4965j4412q780
$$ 16158 -4000 -7790 1138 19256 14281 21211 29838 18220 2063 17608 32573 18161 9381
15355I381r025N036J1775K7657J0462j8050l0140j3004R339M446J2136m245j658
$$ 9381 356 5392 17167 44824 55286 37236 7096 -5908 3431 7877 20013 15768 14110
15342A4110o909K466p529J329O465p386n553j3854m807j887J6662J2842J4149
$$ 14110 7201 9667 2138 3467 9932 2546 -3007 -16861 -21668 -23555 -6893 5949 20098
15329B0098j7865R515K0674k6314L525K782l8422q45L0083J227J738J6165n037
$$ 20098 2233 11748 32422 6108 9633 12415 -26007 -26852 3231 4458 6196 22361 17324
15316A7324J935Q296L951O834k6531p214p667l705j2126k0117J8218K9773K8199
$$ 17324 19259 27555 31506 38340 11809 4595 -3072 -6777 -18903 -39020 -20802 8971 37170
15303C7170o042L983j3031j9508Q566J2219k7045n317R826J2153K243m497J1012
$$ 37170 31128 35111 22080 2572 11138 23357 -3688 -9005 821 12974 15217 10720 21732
15290B1732L996k1118j8901L605j3222k063R134j683R907O6j5L25K290j609Q326
$$ 21732 25728 4610 -14291 -10686 -23908 -25971 -16837 -18520 -8613 -8547 -8562 -8237 -5947 -7556 770
15275G70J6740J2199j5458l034R28l7536j3303J0028q025L997J3974M530M438
$$ 770 17510 29709 14251 11217 12145 -25391 -38694 -28666 -36691 -32694 -18720 -14190 -9752
15262i752L8644J4385l1533l4037O440J4442j2748j1484J3877J9794K3425L756
$$ -9752 28892 43277 11744 -22293 -15853 -1411 -14159 -25643 -11766 8028 31453 35209
15250C5209K654p2J1733O282l2729j8267O755j8943k5434J4035K4449j0163k1247
$$ 35209 37863 37791 49524 55806 23077 4810 11565 -7378 -32812 -18777 5672 -4491 -25738
15237b5738J8770q909r972R816K0363K480k7109j6503L5382O747l540J9863j43
$$ -25738 -6968 -15877 -25849 -16033 4330 6810 -20299 -36802 -1420 5327 1787 21650 21507
15224B1507j1205q808K5647q668l4920j194J380J5054R005j4494q676P838q835
$$ 21507 10302 1494 27141 18473 -16447 -17641 -16261 -1207 7798 -6696 -15372 -7534 -16369
15211a6369p704j802m352j7392M830R381rj1942k2420J8456K8424K9773R943j3633
$$ -16369 -24073 -25875 -30227 -47619 -42789 -33408 -33417 -45359 -67779 -49323 -20899 8874 18817 5184
15197E184j3445j9331K636J007J3804j0683j6494P946R760K5059j3003k1943j0260
$$ 5184 -8261 -27592 -24956 -23949 -10145 -20828 -37322 -29376 -19616 5443 -7560 -29503 -39763
15184c9763L1850K5374L77r20M281K541l1744J1717r344l923M437j4517q338K987
$$ -39763 -7913 17461 17838 16918 21199 23740 -8004 3713 -5631 -9554 -5117 -19634 -27972 -24985
15170b4985J4327J716J080j1381j2545N20K9208M240N145Q931k0794r189N445
$$ -24985 -10658 -8942 -7862 -19243 -31788 -31268 -2060 2180 7325 16256 -4538 -13727 -8282
15157h282Q581L182j5796p374j836Q076p397J9312J5874K9428k4047k1396k4364
$$ -8282 299 3481 -12315 -19689 -21525 -13449 -20846 -1534 14340 43768 19721 -1675 -26039
15144b6039l4486J8849L7297K4236N710j5300j3876l269L7177J2532r846k1035
$$ -26039 -60525 -41676 -4379 19857 25567 10267 -3609 -6878 30299 42831 32985 11950
15132A1950K062q46l4465q366R058q540L7588K8636j3296l0672n737j8450L066
$$ 11950 14012 13166 -21299 -29665 -20607 -29147 8441 37077 23781 -6891 -12628 -31078 -28012
15119b8012L32p776l710J3975J6009l595K092J7016q742j2623J908j7042j2657
$$ -28012 -27680 -35456 -39166 -25191 -9182 -12777 -10685 6331 -2411 -15034 -13126 -30168 -42825
15106d2825J1056N1344N628j6325P530q291r885n980j5638m748p548k6088P847
$$ -42825 -31769 19575 25203 8878 16408 8117 -1768 -7748 -23386 -28134 -35682 -61770 -53923
15093e3923P797L5462J9479L909j8426K323l186o024J491J4321j4407K0797j3390
$$ -53923 -46126 -10664 8815 12724 -5702 -3379 -6565 -12589 -11098 3223 -11184 9613 -3777
15080c777k157O060j4380j0271k976K329J6474M877Q670K361k6436N291M486k075
$$ -3777 -5934 126 -14254 -24525 -27501 -25172 -8698 -3821 4849 7210 -19226 -13935 -9449 -11524
15066a1524P502n019o526r918m644J2131K596k4134o920J3885k81N909j0313q417
$$ -11524 -4022 -9041 -15567 -25485 -30129 -17998 -15402 -39536 -46456 -32571 -32852 -26943 -37256 -45673
15052d5673M037L642n222K6203K4576K8706j4374q887j9969p805Q644l7790m177
$$ -45673 -41636 -37994 -43216 -17013 7563 36269 21895 13008 -6961 -14766 -6122 -43912 -48089
15039d8089K7079R987j2724j4880m629P755O669J9804K5010K4124j0989j0653
$$ -48089 -21010 -11023 -23747 -38627 -43256 -35501 -28832 -9028 15982 40106 29117 18464
15027A8464j1095k3042k943K7311j0130o316J9812K5373k5557k4979J1909n472
$$ 18464 7369 -15673 -18616 8695 -1435 -7751 12061 37434 11877 -13102 -1193 -6665
15015f665K350m078J752J5718l329o703j0944j1468m983J0557L3139J3284k556
$$ -6665 -4315 -8393 -6641 9077 5748 -955 -11899 -23367 -28350 -17793 15346 28630 26074
15002B6074J0605j2211r392K1013K5677J4940M7860L6337M0990J00366J61919
$$ 26074 36679 24468 15076 36089 61766 76706 124566 160903 201893 302259 464178
14991D64178K70500K55414o9290k67651k78780j69255r6602o7641j5905K9683
$$ 464178 734678 990092 920802 653151 374371 205116 108514 40873 24968 54651
14981E4651n015l3610j0606l9166n387L8188J2754j2266q330m854K9026k0120
$$ 54651 49636 16026 5420 -33746 -39133 -945 11809 -457 -8787 -13641 15385 -4735
14969d735R038J4944n186k2489k3280n152J2074p24J9015L3796N871j7616L529
$$ -4735 4303 19247 14061 -8428 -31708 -36860 -24786 -25510 -6495 27301 33172 15556 19085
14956A9085J2341n182m1984j9072K101J5437K0435K976m912p476N380p999J465
$$ 19085 31426 26244 -15740 -34812 -32711 -17274 3161 6137 1225 -6251 -871 -8870 -7405
14943g405J691n529Q38l537j1865m665J5503q905r494J6685M6217k384k6197m140
$$ -7405 -5714 -11243 -10405 -13942 -25807 -30472 -14969 -23874 -33368 -16683 29534 27150 953 -3187
14929c187k814J4689R732o478j1137k6993J1531l770J371J9768P569N305k647
$$ -3187 -6001 8688 18420 11942 805 -26188 -14657 -18427 -17056 2712 10281 15586 12939
14916A2939j7809o982J0019O272L577l6119j4133j5660j8083J8201K5936J179
$$ 12939 -4870 -11852 -1833 4439 8016 -28103 -42236 -57896 -75979 -57778 -31842 -30663
14904c0663L2179m462m554j9778M883o701O129K6920J575J038J5477l0226l9491
$$ -30663 1516 -2946 -7500 -27278 -22395 -29096 -22967 3953 5528 6566 22043 -8183 -47674
14891d7674O120L7189P256k823l512j9060j5744r16J2595K4382k155p910J744
$$ -47674 -41554 -4365 2891 68 -3444 -22504 -38248 -39164 -26569 -2187 -4342 -12252 -10508
14878a0508M192J3422J1305J670j2034j1671K0768j0162l6498k0988K6482r65
$$ -10508 -6316 7106 18411 20081 8047 -3624 17144 6982 -29516 -50504 -24022 -24987
14866b4987k211j0354m6952P968K7798K8397k447J100K3383J9905n238k1326N867
$$ -24987 -27198 -37552 -84504 -76536 -48738 -20341 -22788 -21688 1695 21600 16362 -4964 903
14853I03q341j3794K279Q208j849k0786l181J4336J5784O792j1286k4351N841
$$ 903 -7438 -21232 -18953 -10745 -12594 -33380 -36561 -22225 -6441 351 -10935 -35286 -29445
14840b9445L1365L3479m0196k7873J5006K7804R444m583j6401j6820r41j5581
$$ -29445 1920 35399 -4797 -32670 -17664 10140 19584 15001 -1400 -18220 -19161 -34742
14828c4742j392J1740J6457R95R642m381k0216J6441J5183O086k2112j62p929
$$ -34742 -36134 -24394 -7937 -6942 2700 -1681 -21897 -5456 9727 15813 -6299 -6461 -14390
14815a4390k2154L2328K389n781k4140O587J7984m293N850r290j6755Q035K5988
$$ -14390 -36544 -4216 -1827 -7608 -31748 -25161 -7177 -11470 -5620 -14910 -31665 -23630 2358
14802B358k074k9110r527M795j0477L2623p811j2249l114o976R991K5854p613
$$ 2358 284 -28826 -38353 -33558 -44035 -11412 -19223 -31472 -34586 -41562 -31571 -5717 -13330
14789a3330J0076J2950n744j6253j6723j4493n814K4020J6809o287r037j3677
$$ -13330 -3254 9696 3952 -12301 -29024 -43517 -49331 -25311 -8502 -14789 -23826 -37503
14777c7503r106J1166K5393r904k4151j5099O843R652R778K5411K2080q191N300
$$ -37503 -46609 -35443 -10050 -19954 -44105 -59204 -52361 -42709 -32931 -7520 14560 6369 11669
14764A1669q675r288J9850K892j9089j3796J3172J2037p083j7805K0630K1292
$$ 11669 2994 -6294 13556 16448 -2641 -16437 -3265 8772 1689 -16116 4514 25806
14752B5806k1282J4788R593j732J5139j2979L949R502r595k0054j8575Q41R124
$$ 25806 4524 19312 28905 27173 42312 29333 33282 42784 33189 13135 -5440 -4599 4525
14739D525J4914k169k93j0920J4231k703J0879K424J6389q932l4829k1455R878
$$ 4525 19439 17270 16977 6057 20288 17585 28464 30888 47277 38345 3516 -17939 -8061
14726h061k114q779K1101Q659O84k3164k3276M037K7714M165l986q982K1221K1381
$$ -8061 -10175 -18954 2147 10806 11490 -11674 -34950 -30913 -3199 966 -3020 -12002 9219 30600
14712C0600j6842n060J4702j1176k1084R070K4242K179k198j7989l8452q531j4279
$$ 30600 13758 8698 23400 12224 -8860 210 24452 26631 24433 6444 -32008 -40539 -54818
14699e4818J9329K0105J737L490m020k0998l528M4648J5425k5914n129R372k0752
$$ -54818 -35489 -15384 -13647 -10157 -14177 -35175 -38703 5945 21370 -4544 -9673 -301 -21053
14686b1053r191M701J9244M357l4384J6385K7846n06L538o655J2922k0953k3028
$$ -21053 -30244 -25543 -6299 -1942 -36326 -19941 7905 7399 10937 4282 17204 -3749 -26777
14673b6777Q353j3979J03K1950J9683N974J5658J664K684k9562J2007r931n782
$$ -26777 -18424 -32403 -32300 -10350 9333 15307 30965 32629 35313 5751 17758 7827 2045
14660B045k6206k2392p126P864l236L4688K8403j6155K060L25N106n884k1055
$$ 2045 -24161 -46553 -53679 -45815 -49051 -14363 14040 -2115 -55 270 5376 -508 -21563
14647b1563l388O340Q614j7319J4190K6686K2133n538k5362k7121o155J2108J2682
$$ -21563 -24951 -18611 -9997 -27316 -13126 13560 35693 30155 4793 -22328 -28483 -16375 -3693
14634c693Q693l664j2123J7214j0083r961l200N407N089o482J116J5499K9156
$$ -3693 5000 1336 -10787 6427 -3656 -13617 -16817 -11410 -6321 -12803 -11687 3812 32968
14621C2968J1740r891l1688Q655L3921J080k1503k6493l3586O355R106J878O176
$$ 32968 44708 34817 3129 11784 45705 46785 25282 -1211 -34797 -28442 -19336 -17458 -11282
14608a1282m622j6627j8155J8874J0906J2668J3706j2220j5432m655j7113J1587
$$ -11282 -15904 -32531 -50686 -31812 -20906 -8238 5468 -6752 -22184 -26839 -43952 -32365
14596c2365J2885L1039j3422L557J5178l125P998J658j0635M340J2420J6928k502
$$ -32365 -19480 11559 -1863 1694 16872 13747 21745 23403 12768 17108 29528 46456 43954
14583D3954q804m6796j6343r368k4582J7503L4920J1328j8583k0223k6774O614
$$ 43954 35150 -11646 -27989 -37357 -61939 -44436 -9516 1812 -16771 -36994 -63768 -57154
14571e7154L0148K8365j1188k1706L897P004j2817j4230L51J8823L7853j3738
$$ -57154 -27006 1359 -9829 -31535 -27638 -20634 -33451 -47681 -47330 -28507 9346 -4392
14559d392j3755j1541K2839N246j2048Q938J1792R188K8903m886k9344j2620j3504
$$ -4392 -18147 -29688 -6849 -1603 -13651 -4713 7079 16267 45170 40284 10940 -1680 -15184
14546a5184P842j4518j3142j8299L706N819r014J583N004Q517J1213J0891R033
$$ -15184 -7342 -21860 -35002 -53301 -49595 -43776 -52790 -51207 -46203 -37686 -26473 -15582 -6549
14533f549Q22P819J5717K907k7829l0422j4068P616J9533k2286Q179N835N021
$$ -6549 -5727 2092 17809 20716 -7113 -37535 -51603 -43987 -24454 -46740 -38561 -32726 -27705
14520b7705J5940K8749J0500Q386k713q101r947j8585l0474J5108L8294K6518
$$ -27705 -11765 16984 27484 35870 33157 25056 15109 -3476 -33950 -18842 19452 45970
14508D5970k1505k9611N18K7000n233k0009j5513O237J9529k6918j3921P442K2982
$$ 45970 24465 -5146 -4628 22372 17139 -2870 -18383 -12146 7383 -19535 -33456 -26014 -3032
14495c032N10r685O557J845o179K667K0Q949m429R427P488j8234k968Q148P276
$$ -3032 -2522 -12207 -5650 -3805 -9984 -7317 -7297 1652 -2777 6650 14138 -4096 -7064 1084 8360
14480H360K8543j317j9443k7903K779M838o181J596j4595K5942Q786j2757l5258
$$ 8360 36903 35586 16143 -11760 -8981 -4143 -10324 -8728 -23323 2619 11405 -1352 -36610
14467c6610Q62K3124o672o754L2652m636n665q522j4540k622J1898K4338P652
$$ -36610 -35748 -12624 -19296 -26050 6602 1966 -3699 -12221 -26761 -29383 -17485 6853 14505
14454A4505M980Q266o943j9237k0065J1847J6181P936P052j7445k2259J0791J5824
$$ 14505 19485 27751 20808 1571 -18494 -6647 9534 17470 24522 7077 -15182 -4391 11433
14441A1433J880j0440j8148j2234q230O655o938K5079K1761j8249j3219p526J885
$$ 11433 13313 2873 -15275 -27509 -35739 -29084 -36022 -10943 10818 -7431 -20650 -28176 -26291
14428b6291M690J436k62n039j8953j3043L462J2027K5598J3415R139r959q171
$$ -26291 -21601 -20165 -20427 -25466 -44419 -57462 -54000 -41973 -16375 -2960 6179 -3780 -11951
14415a1951K719j9693J7474R746q593j4878k5422k0801K3070J9588L8807L9729
$$ -11951 -9232 -28925 -11451 -1705 -10298 -25176 -50598 -71399 -48329 -28741 10066 49795
14403D9795J995m430N83l7140l5765L39M315k1452j2870L5353K8008J7275J50
$$ 49795 51790 47360 47943 10803 -24962 -24623 -20308 -41760 -54630 -19277 8731 26006 26156
14390B6156r139M964M605j1903j3213p968J9574R37k0492O256j3559k646J5086
$$ 26156 17017 21981 26586 14683 1470 -6498 13076 14013 -6479 -223 -13782 -16428 -1342
14377a342q302k0117P66J6000R808M034k6429j1628K6664K9979J5585n863j1263
$$ -1342 -9644 -29761 -28995 -12995 -3187 847 -25582 -37210 -10546 19433 35018 29155 17892
14364A7892k5880J6291L003p911m5J23n803J8216j0021k5288J9952J3862r894
$$ 17892 -7988 8303 11306 3395 3350 3473 -2330 15886 5865 -19423 529 14391 4497
14351D497o319j0534j5147k9275k219K8493r809J527j0818o470O314J6825K9355
$$ 4497 -1822 -12356 -27503 -56778 -58997 -30504 -40313 -38786 -49604 -56074 -49760 -32935 -3580
14338c580j7234P817J3515k1613j9549K844K2109J6748N723J5047j725m667M973
$$ -3580 -20814 -12997 518 -21095 -40644 -37800 -15691 1057 6780 21827 20102 15435 20408
14325B0408p816j3930p794k0242q305L3614L4466J104Q944l7544l1593j171J7151
$$ 20408 12592 -1338 -9132 -29374 -37679 -4065 30401 31505 40449 2905 -28688 -29859 -12708
14312a2708K0950L991J1474q228k0765o888M221q085j7528j1342L0061J5768Q459
$$ -12708 8242 12233 23707 15479 -5286 -12174 -7953 -16038 -33566 -44908 -14847 921 9380
14299I380l3227M76M885k5265k9064K3030L8819J2410m794l883o210n125n89k9338
$$ 9380 -23847 -23371 -18486 -43751 -72815 -49785 -10966 1444 -3350 -7233 -13443 -18568 -19157 -48495
14285d8495m396L9097J6143j8267O327K002J963K1608N47p95k0173R634j5346
$$ -48495 -52891 -13794 2349 -15918 -9591 -7589 -5626 15982 16529 15734 -4439 5195 -10151
14272a0151j4936J5215M886K5749K7064n020k6373k5803o446J0812M8018L717
$$ -10151 -25087 -9872 -4986 20763 47827 42807 16434 -9369 -15815 -5003 43015 46732
14260D6732l7700k827J3431k7066j1084M441j2545K556R025R95k2337k6676K2896
$$ 46732 9032 6205 19636 -7430 -18514 -14073 -26618 -24062 -15037 -14042 -36379 -63055 -40159
14247d0159J8263J4112K8144J0020L21Q837k570m1712J301J1017L654r789k8724
$$ -40159 -21896 -7784 20360 30380 30701 39538 36968 -4744 -3443 7574 11228 1439 -27285
14234b7285J5118J4345p146j5525J1479r482K445J8808k355K895m465j2738J4566
$$ -27285 -12167 2178 -4968 -20493 -9014 -18496 -16051 2757 402 3297 -1168 -13906 660
14221F60j171R381o413J8562J4993L988k868k2841j4081J2468J8413j8805l6474
$$ 660 -511 8870 2457 21019 36012 40000 37132 14291 210 12678 31091 12286 -24188
14208b4188k7475L0943j2169Q849K1994K3233Q306j4563j1928p425j0200R766
$$ -24188 -51663 -20720 -32889 -24040 -2046 21187 29493 14930 3002 -4423 -14623 -4857
14196d857Q923J3366k0570l6445R901K1184J8067J9948k372k1225k4776q280O898
$$ -4857 4066 17432 -3138 -39583 -29682 -8498 9569 29517 27145 5920 -18856 -27136 -20238
14183b0238K9560K3971J4895j5114l155j8537j0270M301j7651J2391K2083K719
$$ -20238 9322 33293 48188 33074 29919 11382 1112 5413 -12238 153 22236 24955
14171B4955k4943k2165k1338J4213K220m593K1806P611j2999J8304N496k3558
$$ 24955 12 -22153 -43491 -29278 -27058 -31651 -9845 -2234 -15233 3071 8567 -14991
14159a4991P265J3623J6955N200n228n796M613L637L13M360K2330p093j7873J9558
$$ -14991 -7726 5897 22852 28052 22824 17028 21641 25278 25591 29951 52281 45188 27315 46873
14145D6873J5526m203o044k113J7807L9057J9159L439M84J513l53L0925M0958
$$ 46873 62399 58196 52152 50039 67846 106903 126062 129501 129985 131498 131145 162070 203028
14132B03028O1200N5674Q2244J05145J75337K30696J76863R8255J24856K04038
$$ 203028 264228 319902 402146 507291 682628 913324 1090187 1188442 1313298 1517336
14122A517336N8310j31543k00395j37973j42590j84503k09876j74805j31792n2222
$$ 1517336 1575646 1444103 1243708 1105735 963145 778642 568766 393961 262169 209947
14112B09947n0286o739J4624l8145j8839j6707l6501q344j5806m6370k769J4192
$$ 209947 159661 152922 167546 129401 110562 93855 57354 49010 33204 -13166 -15935 -1743
14100a743J9932L135k6568k1043P063Q111J2131L2687L3606j0385k9181L007J1763
$$ -1743 18189 21324 -5244 -26287 -19224 -11113 1018 33705 67311 56926 27745 30752 42515
14087D2515j7937l2660j383l314q513J5739M236P348J1513n746Q815J7158L053
$$ 42515 24578 -8082 -9465 -12779 -21292 -5553 -1317 6031 17544 11798 20613 37771 40824
14074D0824J303j6517P41J984J1733k0743k7838R709j5040k951m171J0326n582
$$ 40824 42127 25610 26351 28335 40068 19325 -8513 1196 -13844 -16795 -20966 -10640 -16222
14061a6222N936J378j1769K508P417K691J4439k1325j8517J6658p984l029L4556
$$ -16222 -10286 -8908 -20677 -18169 -10752 -8061 6378 -14947 -33464 -16806 -24790 -27819 6737
14048F737Q932j1568k7803J4404L2221J2929r139m113J0102J7448K5795J8159
$$ 6737 15669 4101 -23702 -9298 22923 35852 26713 22600 32702 50150 75945 94104
14036I4104j0102p330l806k0895m8854k3634L931k502j717L904K1995J7878r130
$$ 94104 84002 76672 72866 51971 3117 -20517 -16586 -19088 -20805 -16901 5094 22972 13842
14023A3842r216p27O547L398J0583j6377j863k9072k6106K7964L4377q755j327
$$ 13842 4626 3899 10446 13844 24427 8050 6187 -22885 -48991 -21027 13350 4595 3268
14010C268J4032K4648J477j0345j7983O06l3952J2002K0699k376r693k1990J305
$$ 3268 17300 41948 43425 33080 15097 15703 -18249 -6247 14452 12076 2383 -19607 -18302
13997a8302K2421R70k187P483j2943k1602j0849Q073r316J4434J8803J111L1166
$$ -18302 4119 5089 2902 10385 -2558 -24160 -35009 -26936 -36252 -21818 -3015 -1904 29262
13984B9262j6470J0578r249l3979o330J5457Q153N43O450k787j1041N745p704
$$ 29262 12792 23370 14121 -19858 -26188 -10731 -2578 -2035 4415 1628 -9413 -3668 -11372
13971a1372Q021p569k6594r32O919R024K4474j529k1506k121K8748K1863j491
$$ -11372 -3351 -10920 -37514 -38446 -31527 -22503 1971 442 -21064 -23185 5563 27426 25935
13958B5935j8316o498l139J6149O079J9392L701j1445k9168o197Q777n329j9078
$$ 25935 7619 1121 -2018 14131 20210 39602 43303 31858 2690 -3507 5270 -59 -19137
13945a9137J2198J3120J7327m638O855J8859j9261k0897j3986l959k3136o315
$$ -19137 -6939 6181 23508 18870 25725 44584 25323 4426 -9560 -13519 -36655 -42970
13933d2970J7159L389p865K8134L1273K7866j922J0717j0435l2404n864j053j177
$$ -42970 -25811 -22422 -30287 -2153 29120 56986 55064 65781 55346 22942 17078 16025 14848
13920A4848l0031k206N285k5859K0584L4411m72j102M815J6573k0247k7464J4829
$$ 14848 -15183 -17389 -12104 -37963 -17379 17032 16560 15458 20273 36846 16599 -10865 3964
13907C964K7696r806j8798m679j0831o153K1994J4419J7513p56L6085K5230m408
$$ 3964 31660 21854 3056 -1623 -12454 -18607 3387 17806 35319 34563 70648 95878 91470
13894I1470n363k0253k9829k1709k6238J5838j756N970J38O862Q312K841O84j0375
$$ 91470 86107 65854 36025 14316 -11922 3916 2160 8130 8268 15130 23442 26283 26967 16592
13880A6592k0890J1993J3634K1731Q826J844J6392J0608p172J4875k883M787K5329
$$ 16592 -4298 7695 21329 43060 51886 53730 70122 80730 73558 88433 85550 90337 115666
13867A15666l275j5670K479j3521O008P563J9960J2366q016p332l4891n880k0856
$$ 115666 112391 96721 99200 85679 91687 99250 119210 131576 123560 116228 81337 75457 54601
13854E4601k6717j5156j2449k0817j7777J635K968K3732K1875O925j2888m0451
$$ 54601 27884 12728 279 -20538 -38315 -36680 -33712 -9980 11895 18820 5932 -34519
13842c4519k639J5457L0766J0647o646k078k2467O922r559j3267K017K9559L8126
$$ -34519 -37158 -21701 9065 19712 13066 10988 -11479 -4557 -14116 -27383 -25366 4193 42319
13829D2319K243l5007j4018J0145J2491K1733J330k8879j3934J073k2821j8219
$$ 42319 44562 9555 -4463 5682 18173 39906 41236 12357 -1577 -504 -23325 -41544
13817d1544J4484N512J1536J6262j9595J9350K1035j9950k8577K480J188L5490
$$ -41544 -27060 -21548 -10012 6250 -13345 6005 27040 7090 -21487 -19007 -17819 17671
13805A7671k740r781j4278L0685N6l450M689R495K8690j6673j1918O899k0502
$$ 17671 14931 5150 -9128 21557 21613 18163 22852 32347 61037 44364 32446 39345 18843
13792A8843k5470k69n602P415J6937J6840o178j6756Q258J0861q132n914Q376
$$ 18843 -6627 -6896 -12498 -5083 11854 28694 22516 5760 14018 24879 16747 10833 19209
13779A9209J1131j4057j2092J5080j2619j2046j4247Q81l182j2548O913J4197
$$ 19209 30340 16283 4191 19271 6652 -5394 -19641 -18760 -21942 -34490 -27577 -13380
13767a3380J43K6390J4802M859k5642j7367j1740N786L2669J8121j9325J1214
$$ -13380 -13237 13153 27955 32814 7172 -10195 -21935 -16149 16520 34641 15316 26530
13755B6530M868l8627L70J6641r227n069M580O796M814k3024j8687j0702K1884
$$ 26530 31398 -7229 -6859 9782 555 -4514 66 6862 11676 -11348 -30035 -40737 -18853
13742a8853L7569J7364j8170l901P969k3401j7154J048J6065K462J6397j2458
$$ -18853 18716 36080 17910 14009 21978 -1423 -18577 -17529 -1464 998 17395 4937
13730D937k3024N41Q593j8849j299J5861J659j7462M249N81K0726j4465j6158
$$ 4937 -18087 -17546 -8953 -27802 -29101 -13240 -11581 -29043 -24794 -24213 -3487 -17952 -34110
13717c4110Q055P480J3045K8955p379J0975k135j0357j8619L791J6775P54j4226
$$ -34110 -26055 -18575 -5530 23425 16046 27021 24886 14529 -4090 -299 16476 17230 3004
13704C004r485l71j754P742p507L653p372R245L1647K5959k8749j7761j5897J6407
$$ 3004 -6481 -6852 -8606 -864 -8371 -4718 -12090 -2845 28802 54761 26012 8251 -7646 8761
13690H761m349J0835k6080k2995L1759J7102p161j4945j6294K808K2371J3634
$$ 8761 4412 15247 -10833 -33828 -2069 15033 7872 -7073 -23367 -20559 1812 15446
13678A5446l8493j6104J9950L5637J0626j6768j7218o268n134K695n670M495r64
$$ 15446 -23047 -39151 -19201 16436 27062 10294 -6924 -13192 -18326 -15631 -21301 -16806 -17770
13665a7770J0244Q128k4232j4743J2888J0042m304j7556J5911O700j8792j5704
$$ -17770 -7526 602 -23630 -38373 -25485 -15443 -19747 -37303 -21392 -14692 -33484 -49188
13653d9188K3500k531l002p409P163P463M1874p584J3034R829p935K935k3213
$$ -49188 -25688 -28219 -31221 -38630 -31467 -24004 17870 10286 23320 33149 25214 28149 4936
13640D936k0392o920O5K041J2058K734r023k9017j5434J5893K0147J1808j1492
$$ 4936 -15456 -22376 -22311 -20270 -8212 -5478 -14501 -43518 -58952 -43059 -22912 -11104 -22596
13627b2596j6945K6944K3592J6020J1084j4099k1621J408K7579o7m6333j5565
$$ -22596 -39541 -12597 10995 27015 38099 24000 2379 3787 31366 31299 -15034 -30599
13615c0599K355N785q380M205R963L4931K22j1553j0698L0917K947k4435O222
$$ -30599 -28244 -22459 -30839 -26634 -16671 18260 18482 6929 -3769 27148 30095 5660 11882
13602A1882L1293r167L274Q100m645j7615k0595n703J4692r917M795K0105j0313
$$ 11882 43175 34008 37282 45382 40737 23122 2527 -3176 11516 1599 6394 26499 16186
13589A6186j8554j2704j6686r380J4799M683K223J705J492J7084K8738L207j4203
$$ 16186 -2368 -15072 -31758 -41138 -26339 -21656 -19433 -17728 -16236 848 29586 32793 18590
13576A8590l1820l2634J1311J6136q283m179J5695j0223N59m051j7217Q648J6554
$$ 18590 -13230 -45864 -34553 -18417 -26700 -30879 -15184 -25407 -24848 -28899 -46116 -37468 -20914
13563b0914Q627J2625M359l0658j3700N45J0708r1N318K0094J7450n718j1524
$$ -20914 -12287 338 4697 -25961 -39661 -39116 -28408 -28499 -23181 -3087 14363 8645 -2879
13550b879K483Q443l4039j4851j3028o650j517K0012J5819J1886K197p01J2564
$$ -2879 -396 8047 -25992 -40843 -53871 -60521 -62038 -42026 -26207 -14321 -12124 -12825 -261
13537b61K9571o169l4303j8720J0575L287q392N917K4328l314J0798J0520l2759
$$ -261 29310 23141 -11162 -29882 -19307 -16020 -24412 -18495 5833 2519 13317 23837 -8922
13524h922j721p894n942O951P816j4671j3777J3285N542K40K1791J7642k376j9815
$$ -8922 -10643 -18537 -24479 -17528 -9712 -24383 -38160 -24875 -19333 -19093 2698 20340 17964 -1851
13510a851k4495j0140j1352J0831L8821j1553j4770J4357O695j679M137R973j0266
$$ -1851 -26346 -36486 -47838 -37007 1814 -9739 -24509 -10152 -3457 -5136 -999 8974 -1292
13497a292j3100J8935J2116k6663n309j3687j1239p121J9082K2450K0414k2311
$$ -1292 -14392 4543 16659 -10004 -15313 -29000 -40239 -47360 -28278 -5828 14586 -7725
13485g725k5631Q664N614p113p410K106K6072J8034j2121l7437J1986j686j6536
$$ -7725 -33356 -24692 -19078 -26191 -33601 -31495 -5423 12611 490 -36947 -24961 -26647 -43183
13472d3183r029j2501J1429K9424K0937K853Q654K534r445j9805R808k4682J6032
$$ -43183 -52212 -64713 -53284 -23860 -2923 -70 8584 11118 1673 -18132 -8324 -33006 -16974
13459a6974N068o39K051K1267M464M570J0824L848j2529k9807q650P559j2259
$$ -16974 -11906 -12545 -10494 10773 15237 19807 30631 34479 21950 -7857 -16507 -8948 -21207
13446b1207o233r174k9518K7424K3060j0760n528n443k7545L655J9864J9818o908
$$ -21207 -27440 -36614 -66132 -38708 -15648 -26408 -31936 -37379 -64924 -61269 -41405 -21587 -28495
13433b8495m3051Q494L2823K4156p406j7918n52R040j1079j5825J4627K0533j9730
$$ -28495 -71546 -63052 -30229 -6073 -13479 -31397 -31949 -22909 -33988 -49813 -35186 -14653 -34383
13420c4383N45r704J2655L2081j87q589J9270m1004k1442P766l221K5714J8951
$$ -34383 -33838 -43542 -30887 1194 1007 -7582 11688 -29316 -50758 -42992 -46213 -20499 -1548
13407a548J1650q231j4440P395R786k6291j6798J9914J8115J5404j9308p753k1498
$$ -1548 10102 1871 -12569 -5174 4612 -21679 -38477 -18563 -448 14956 -4352 -12105 -33603
13394c3603l8020K1353K3169L046M151o950Q367J3245J3944q3k097o084J2072
$$ -33603 -71623 -50270 -27101 -24055 -19904 -26854 -18487 -5242 8702 8619 6522 438 12510
13381A2510l174Q662o383j477l836j5417n140J2038Q120J1093J7679k0791j6664
$$ 12510 9336 17998 11615 10138 6302 -9115 -14255 -2217 5903 16996 34675 13884 -2780
13368b780J6987j7937m153J6171J7910j0898l086L211K9373j0742j8467j469n412
$$ -2780 14207 -3730 -7883 8288 26198 15300 12214 15425 44798 34056 15589 14120 8708
13355H708k3192j6757J7896J6772K075j1982R91j6397q392K472J5612N625j5960
$$ 8708 -14484 -31241 -13345 3427 5502 -6480 -5489 -21886 -30278 -27806 -12194 -6569 -22529
13342b2529K1884K3414j7586k4373l3628J5653n115k539R767O196m081K0044j1319
$$ -22529 -645 22769 5183 -19190 -52818 -37165 -42280 -44819 -35052 -28856 -32937 -12893 -24212
13329b4212J0193p096j1106O968M4973K6380l4881k9844m622l3262j3857J3917
$$ -24212 -14019 -21115 -32221 -25253 19720 46100 11219 -18625 -23247 -56509 -70366 -56449
13317e6449K0000J715j2157p067j4621j2754R832K9629J3286j3736J4515M349
$$ -56449 -36449 -34734 -46891 -53958 -68579 -81333 -71501 -41872 -28586 -42322 -27807 -23458
13305b3458K656j8757m695m783Q496K6366K8007L468J1499o612l3468L079Q303
$$ -23458 -20802 -39559 -44254 -49037 -40541 -14175 13832 17300 28799 22187 -11281 -8202 101
13292A01K669o465q076k528p528O975P173j6434j3885j2520J787N7408N085j2591
$$ 101 2770 -3695 -11771 -14299 -21827 -14852 -7679 -24113 -37998 -50518 -48731 8677 13762 1171
13278A171j0450m003j9448OO710l474K6008J457o638r985J887J1545j7225j2555
$$ 1171 -9279 -13282 -32730 -32724 -26014 -29488 -3480 -2023 -8661 -18646 -16759 -5214 -22439 -34994
13264c4994q786K60J958K7698q828j7694k896o870j6446J6639M314m562j018j8628
$$ -34994 -43780 -43520 -41562 -13864 -22692 -40386 -43282 -50152 -66598 -49959 -45645 -50207 -51225 -69853
13250f9853o731K3603K4871J2996J0071J7429l2583j3312j551Q40K7345j288r760
$$ -69853 -76584 -52981 -28110 -15114 -5043 12386 -20197 -33509 -35060 -34220 -6875 -8163 -17923
13237a7923J001k6814k7227K1928J3325k1954p984M2782L6729J220k4762m683
$$ -17923 -16922 -43736 -70963 -49035 -35710 -57664 -65648 -22866 13863 15083 -9679 -14362
13225a4362J1007j660J3330o57L25N432o404l608l100K485q79j9696k618K7493
$$ -14362 -3355 -5015 8315 7658 7983 13415 7011 3403 303 2788 1909 -17787 -20405 7088
13211G088L3908J0319j6660J1111o032j0351j6545l1476j753K8718j4520n684
$$ 7088 40996 51315 34655 45766 39734 29383 12838 -18638 -20391 8327 -6193 -11877
13199a1877R374J2981K1685j2259p507p455j8988j2380K703J6061J57k1205L395
$$ -11877 -2503 10478 32163 19904 12397 4942 -14046 -26426 -23723 -7662 -7505 -28710 -25315
13186b5315M2176L5077k9014k3353Q590J5382L399j2787j5958j6780k4542j4956
$$ -25315 16861 51938 22924 -429 8161 23543 26942 14155 -1803 -18583 -43125 -58081
13174e8081J492J244K2885J6106J5476O615l4012j6654J0652K2181l1997k203
$$ -58081 -56589 -55345 -32460 -16354 -878 5737 -28275 -44929 -34277 -12096 -44093 -46296
13162d6296K869O248Q04N818M401j0494J8958n61m80J4234K3365n098k418K0978
$$ -46296 -43427 -37179 -36375 -30557 -26156 -36650 -17692 -18253 -18733 -4499 18866 13768 11350 32328
13148C2328J892k233R86j3169j6589o610j6132k2575j1730J1229K4418J1361k883
$$ 32328 34220 31987 32973 19804 3215 -3395 -19527 -42102 -53832 -42603 -18185 -6824 -9707
13135i707l852j8670m217J5165J6520j4277k3503j2707K3676K5802K0396j0326
$$ -9707 -13559 -32229 -36446 -21281 -4761 -19038 -42541 -55248 -31572 -5770 14626 4300
13123D300P144J7125k6115K2074n757p401J7722J0774j9458k448o478k5613k9601
$$ 4300 11444 28569 2454 24528 18771 11370 29092 39866 20408 17960 11482 -14131 -43732
13110d3732j212R096K13Q037p619Q293o95k63j0079o9R89L6254Q791j0955k5077
$$ -43732 -44944 -35848 -35635 -27598 -35217 -26924 -27619 -27882 -37961 -38030 -37041 -787 8004 -2951 -28028
13095b8028j2728J9431N440J1602r52N948j3370j0917k663K4886j7288j37K816
$$ -28028 -40756 -21325 -15885 -4283 -5235 713 -12657 -23574 -26237 -1351 -18639 -18776 -15960
13082a5960j8737J0957j4632j3512J218J0912P122j2042N295N485J4167J8445
$$ -15960 -34697 -23740 -38372 -51884 -50666 -39754 -32632 -44674 -39379 -33894 -19727 -1282
13070a282J4648P28r034j3603j0928L445J9467o871n582J818J0215J060J0549
$$ -1282 13366 14094 5060 -8543 -19471 -16026 3441 -3430 -9012 -7194 3021 4081 14630
13057A4630P119J1040m084q430K117J5762K3503J8509k316Q441J6544K8195L1659
$$ 14630 21749 32789 28705 20275 22392 38154 61657 80166 77850 86291 102835 131030 162689
13044A62689K5563M6277P1299Q4503Q4820J03987J06936R6475P5885O2668J8238
$$ 162689 188252 234529 305828 390331 475151 579138 686074 782549 858434 921102 939340
13033I39340p0810p0702n7054q1152j18729j50329j17259o3999k9014l8411j0191
$$ 939340 868530 797828 740774 659622 540893 390564 273305 209306 180292 141881 131690
13022A31690j5661j9625N639q522l5392k5395o24j0352m994m554j9816j7024M882
$$ 131690 116029 96404 102043 93521 58129 32734 32110 21758 16764 12210 -7606 -24630 -19748
13009a9748n631K6261K60J7356L6417M750j8080j2957j5313j2203n839Q649R881
$$ -19748 -25379 882 1142 18498 54915 59665 41585 28628 13315 1112 -4727 3922 13803
12996A3803j2268k0312j8471K3659K3810k150J310p924K4501j4737j124j253j0772
$$ 13803 1535 -18777 -37248 -13589 10221 8071 9381 1457 25958 11221 10097 8844 -1928
12983a928k7850k5395Q23J8560L10J3314L064J3482j920k2372k3220J2009J7471
$$ -1928 -29778 -55173 -54350 -35790 -35480 -22166 -19102 -5620 -7540 -29912 -53132 -41123 -23652
12970b3652m001k7424k893J9980J0140k4507j5343L0668N9155m336o585q248o551
$$ -23652 -27653 -55077 -57970 -37990 -27850 -52357 -67700 -37032 22123 17787 11202 2954 -3597
12957c597j0662J456M193J2289m4j5254j0703N397K227j3064J8525q06o495l2151
$$ -3597 -14259 -12803 -8610 3679 3635 -11619 -22322 -16925 -14698 -27762 -9237 -10043 -16538 -48689
12943d8689J62J2108o195K8996o319q630j947M820m842q878N545m706l5098l124
$$ -48689 -48527 -36419 -42614 -13618 -19937 -28567 -30514 -25694 -30536 -39414 -33869 -38575 -73673 -76797
12929g6797K6708p694k803J40q445j9679L940l83r303K7070L0566O4Q866l221
$$ -76797 -50089 -57783 -60586 -60446 -68891 -88570 -84630 -85013 -94316 -67246 -36680 -36616 -27750 -30971
12915c0971l4J9244j7222q591R257K1903K9944j820l0691k1270l470J9476L541
$$ -30971 -31005 -11761 -28983 -37574 -28317 -6414 23530 21710 -8981 -30251 -33721 -14245 -10704
12902a0704n733N169P225K026l2913m0952q859J064M735L7642L9483L050n211
$$ -10704 -16437 -11268 -4043 -2017 -34930 -75882 -84741 -83677 -78942 -41300 -1817 1233 -3978
12889c978q53P673M911r790J3934K3376K0776l905k6406k9990M077P483k5853
$$ -3978 -4831 2842 7753 -2037 11897 35273 56049 52144 25738 -4252 -175 7308 -18545
12876a8545J4739m983k2239K4239J1590N877K1256L3986L0170J2510L288K2697
$$ -18545 -3806 -8789 -31028 -6789 4801 10678 31934 65920 96090 108600 111888 134585
12864A34585m366j9327j5273j2446j133j3632N680l2318m2190k4176j8853K592
$$ 134585 130219 110892 95619 83173 82040 68408 74088 41770 -420 -24596 -43449 -40857
12852d0857L6649K5998r27J3312j0758l9063k0648P816j4512J7969K883N44J2808
$$ -40857 -4208 21790 20863 34175 23417 -15646 -36294 -28478 -42990 -25021 -22138 -21594 -8786
12839h786j7904O148O315k3886R072J9667J7852o543l4234j690j4315J730P680
$$ -8786 -26690 -20542 -14227 -38113 -29041 -9374 8478 1935 -32299 -33989 -48304 -46574 -38894
12826c8894m937j9845R238L1621J2331k9403l874k0615m718K1965M1691J5817
$$ -38894 -43831 -63676 -54438 -22817 -10486 -39889 -43763 -64378 -69096 -47131 -5440 10377
12814A0377k876j9982J591j4794j5583j2909j5531m033l98O440o44j1223j1916
$$ 10377 7501 -12481 -10890 -25684 -41267 -54176 -69707 -73740 -74138 -67698 -68342 -79565 -91481
12801i1481K3604J5872J5990P288K4770J5352K914l155l0339k5256J8041N642
$$ -91481 -67877 -52005 -36015 -28727 -3957 11395 14309 11154 -19185 -44441 -26400 -20758
12789b0758q993r55j344J9550K7641p631k158j9530k1319j6592j1041R001J2846
$$ -20758 -29751 -30706 -32050 -12500 15141 7510 5352 -14178 -35497 -52089 -63130 -54129 -41283
12776d1283O545K868K5952J0584J7492P147j2948q961k0268K5077K6053p156l3055
$$ -41283 -34738 -31870 -5918 4666 22158 29305 16357 7396 -12872 12205 38258 31102 -1953
12763a953o022J2284n466J2464R832L19N863j2687Q562K943j941j965R096J457
$$ -1953 -7975 4309 -1157 11307 21139 21458 27321 14634 23196 26139 24198 22233 31329 32786
12749C2786k857k40J402J0501J3700K0443P331K779J0635k0916k6307k6991l1026
$$ 32786 29929 29689 31091 41592 55292 75735 83066 85845 96480 75564 49257 22266 -8760
12736h760m576j1628k2855p399J4492J03l281j4319k374J7846L3025J9275P877
$$ -8760 -13336 -24964 -47819 -55218 -40726 -40623 -43904 -58223 -60597 -42751 -9726 9549 17426
12723A7426k5057O281K744k6996k4631p417J1319L9834k269q810J820J3700K0570
$$ 17426 -7631 -1350 1394 -25602 -50233 -57650 -46331 -6497 -8766 -17576 -15756 -2056 18514
12710A8514p190n617j267J6234l822J0217O88K2225L8942n437K653j3821J089
$$ 18514 11324 5707 4440 20674 16852 27069 27757 49982 88924 83487 86140 72319 73408
12697G3408J5302J7946j0969m246q633j91o712j5894N779K1515K9993P486J6990
$$ 73408 88710 106656 95687 91441 82808 82617 75905 60011 65790 87305 117298 124784 141774
12684A41774J2985M02P561L99J3589K4796P966R827K0676L8642m922k5027J589
$$ 141774 154759 155161 162722 163121 176710 201506 209472 219299 239975 278617 273695 248668 250257
12671B50257J8478O511O12j608M6530L8696M2863K2084K5575K3574L2406M0223
$$ 250257 268735 275246 275858 274250 320780 359476 402339 424423 449998 473572 505978 546201
12659E46201K8716K5211L7537M1439M7497O5595R3551Q3570P4178R5923J05868
$$ 546201 574917 600128 637665 679104 726601 792196 885747 969317 1043495 1139418 1245286
12648A245286J01243J15067J35963J46839J85804J85108J85369K29545K70814
$$ 1245286 1346529 1461596 1597559 1744398 1930202 2115310 2300679 2530224 2801038
12639B801038K78188L34098M45492N42102P00047Q37416J072545J265243J435024
$$ 2801038 3079226 3413324 3858816 4400918 5100965 5938381 7010926 8276169 9711193
12630I711193J561858J721291J896856K045448K198014K424293K853842L623565
$$ 9711193 11273051 12994342 14891198 16936646 19134660 21558953 24412795 28036360
12622B8036360M844493O637657R350722J3209341J7820110K1503088K2106352
$$ 28036360 32880853 39518510 48869232 62078573 79898683 101401771 123508123
12615A23508123J9811339J7448884J5273857R107745k081077j2393015j7228687
$$ 123508123 143319462 160768346 176042203 185149948 183068871 170675856 153447169
12608A53447169j9033468k1214760k2639670k1104281j6966877j2225054q356396
$$ 153447169 134413701 113198941 90559271 69454990 52488113 40263059 31906663
12601C1906663n647271l947441k862791k158587j674540j439522j355151j276849
$$ 31906663 26259392 22311951 19449160 17290573 15616033 14176511 12821360 11544511
12593A1544511j192711j113907j022999r37764q08017o45461n26161m54652l92265
$$ 11544511 10351800 9237893 8214894 7277130 6469113 5823652 5297491 4842839 4450574
12584D450574l55051l21485k60223k17897k15215j98492j83878j47282j21641
$$ 4450574 4095523 3774038 3513815 3295918 3080703 2882211 2698333 2551051 2429410
12575B429410j12547j10496p4317q9057p5923r7521o4846n5936m8850o2976q2800
$$ 2429410 2316863 2206367 2132050 2042993 1967070 1869549 1804703 1748767 1699917 1636941 1554141
12564A554141p0864n7204p0087m8602l2636l7355l3184k9679m9574l4169k0401
$$ 1554141 1483277 1426073 1355986 1307384 1274748 1237393 1204209 1174530 1124956 1090787 1070386
12553A070386m4389l8858k1090N089j6122j5604k103m2027l6584j0965M492k209
$$ 1070386 1025997 987139 966049 971138 955016 939412 937309 895282 858698 847733 852225 850016
12541H50016l3870k9223n0258n770j1823n0451j0127J4730o920l2232J948R704
$$ 850016 816146 786923 736665 730895 719072 668621 658494 673224 666304 634072 636020 645724
12529F45724k0654l8608j7342l217j5482l7608k926j1201k2202K2333j1834j7690
$$ 645724 625070 586462 569120 565903 550421 512813 509887 498686 476484 498817 486983 469293
12517D69293J4825n875j2576l425J9539J1128j406j0724l6727J8373M726j9745
$$ 469293 484118 478243 465667 462242 481781 492909 491503 480779 444052 462425 467151 447406
12505D47406Q251M568L755J122j7125l1316Q126P941j6824P811M102J5844J9067
$$ 447406 455657 460225 463980 465102 447977 416661 424787 432728 415904 423715 427817 443661 462728
12492D62728k1864p821P018j439j5566j0211k830l8020j7903m629j6524P03j0064
$$ 462728 440864 433043 440061 438622 423056 412845 410015 371995 354092 349463 332939 333642 323578
12479C23578m1036j8756r922K5009P861O284Q119P3K863R352k8222K0849L7231
$$ 323578 282542 263786 253864 278873 286734 293018 301137 301210 304073 313425 285203 306052 343283
12466C43283L9063K2719k390K0732J4725K2982L0199L8163M7960L8066O7382R0623
$$ 343283 382346 405065 402675 423407 438132 461114 491313 529476 577436 615502 682884 773507
12454G73507N8407N7974Q4902J35809K00603K51343L31432L59650L72286L87793
$$ 773507 831914 889888 974790 1110599 1311202 1562545 1893977 2253627 2625913 3013706
12444C013706L67649L16699K07814R6798o6069j90336k64694l66119m08873m12538
$$ 3013706 3381355 3698054 3905868 4002666 3936597 3746261 3481567 3115448 2706575 2294037
12434B294037l92349l14853k55860k11001j65377j01960o7243n8006p7403m3461
$$ 2294037 1901688 1586835 1330975 1119974 954597 852637 785394 727388 649985 606524
12424F06524l23m5299n3793l6073l9926j4291j6292k3615l9223m1434j1131j2501
$$ 606524 606201 560902 507109 471036 431110 416819 400527 376912 337689 296255 285124 272623
12412B72623l7961j1752j1361m251J8913M0664J949k1091P464P285q980m2609
$$ 272623 234662 222910 211549 207298 226211 266875 268824 247733 255197 262482 253502 210893
12400B10893O379L073N305k0274Q040R897j1857m420j7119l1333j7700n633j8591
$$ 210893 217272 220345 225650 205376 213416 223313 211456 207036 189917 158584 140884 135251 116660
12387A16660j4480K5416J8694R595n531m657L7234J0515k8171k6976K4505k203
$$ 116660 102180 127596 146290 155885 150354 145697 182931 193446 165275 138299 162804 160601
12375A60601l0233K2710J3972n012k1493o406K024L9004L47n812l263J151k3200
$$ 160601 130368 153078 167050 162038 140545 134139 136163 175167 175514 169702 166439 167590 144390
12362A44390q34N36k0994n631m754J034K0768j6179k397j458M321K3777p692O969
$$ 144390 143556 144092 123098 117467 112713 113747 134515 118336 115939 114481 118802 142579 134887 141856
12348A41856p133j7265k824J7762k58p612j7117J0990K1191K92m1175j9210J4693
$$ 141856 134723 117458 114634 132396 132138 124526 107409 118399 139590 139882 98707 79497 94190
12335I4190K532K2110M2073p513l1473l6784j6867oJ2794K0386R244O104r961
$$ 94190 96722 118832 160905 153392 121919 85135 68268 68262 81056 101442 110686 116790 106829
12322A06829O639p496k2194n2J8256L225L6l5632j6399M1676R657j5629J2840
$$ 106829 113468 105972 83778 83726 101982 105207 105243 69611 53212 94888 104545 88916 101756
12309A01756J8611K7579J8283k2168k2732N706Q516L159R466k903M4035O727k3296
$$ 101756 120367 147946 166229 144061 121329 127035 135551 138710 148176 145273 189308 196035 172739
12296A72739k1550l7577N582J9705L3857r568l8120J307k990p995k0430L534m508
$$ 172739 151189 113612 119194 138899 172756 163188 125068 126375 123385 115390 94960 98494 93986
12283I3986J7880J5507J0723j940N600j901k3003m816k355k478n727j1671P690
$$ 93986 111866 127373 138096 136156 141756 139855 116852 112036 109681 107203 101476 89805 97495
12270I7495q004J953j4000j330Q245L2584n603n629m981r5j8612L527R237j1947
$$ 97495 89491 91444 77444 76114 84359 116943 111340 105711 100730 100635 82023 85550 94787 82840
12256H2840j1426m413O806J8988K2096j8098j42L5196k2150j7984j3580J5582
$$ 82840 71414 67001 73807 92795 114891 96793 96651 131847 109697 91713 78133 93715
12244I3715J7234K6824K559O150J2399j4758l1248j447j0450n107j8826j5331
$$ 93715 110949 137773 140332 146482 158881 144123 112875 111428 100978 95871 77045 61714
12232F1714n280M7092L5683j5072j5047j6406K1766J2552R109k2200k4254L9154
$$ 61714 56434 103526 139209 124137 109090 92684 114450 127002 136111 113911 89657 128811
12220A28811K9119j6451p594J1674J2742Q693k461r042k2015r531n687J2876P253
$$ 128811 157930 141479 133885 145559 158301 166994 164533 155491 133476 123945 118258 131134 138387
12207A38387j9224l240J4068n339J4392J2636q842L0297J6675R051L1265N022
$$ 138387 119163 115923 129991 124652 139044 151680 142838 173135 189810 198861 230126 235148
12195B35148J7527J3309J4956O1336M7830M5994O9376J33321J50689J02529P8232
$$ 235148 252675 265984 280940 342276 390106 436100 505476 638797 789486 892015 970247
12184I70247M6225K7948j0639p2846j12789r8810j06226j13810q7013r6849o5421
$$ 970247 1016472 1044420 1033781 960935 848146 749336 643110 529300 442287 345438 280017
12173B80017l6903m1237m3431q780J2445K429k80m491j1697j2963L423n993l2014
$$ 280017 243114 201877 158446 149666 162111 164540 164260 159769 148072 135109 138532 132539 100525
12160A00525J4088N148Q654m961Q66k579J967N302J2053K2217p603l1168m2038
$$ 100525 114613 119761 128415 123454 124320 121741 123708 129010 141063 163280 155677 124509 82471
12147H2471m9580r749J0710J7244J3943J9770k0959l999L1515J4381j155j1651
$$ 82471 32891 23142 33852 51096 65039 84809 63850 59851 91366 105747 104592 92941
12135I2941j8539j4533k0028n268J6054j4653J6828J9236l158l1369q763R196
$$ 92941 74402 59869 39841 34573 50627 35974 52802 72038 68880 37511 28748 37944
12123C7944j224R3k601L0656L1282p894j4050K1175j777j8950k9878j978K2884
$$ 37944 36720 36813 34212 64868 96150 88256 74206 95381 93604 74654 44776 42798 65682
12110F5682r277m519n411L6159L8699L4116K2068J9436Q534J4941M0355L4916
$$ 65682 56405 51886 46475 82634 121333 155449 177517 196953 205487 220428 260783 295699
12098B95699L1132M8056L3212N9343J26943J25536K03188K78980L06905L27116
$$ 295699 326831 374887 408099 467442 594385 719921 923109 1202089 1508994 1836110
12088A836110K73196K46348J61021L2680q5435j84239k50888k96571l00020k89951
$$ 1836110 2109306 2355654 2516675 2549355 2463920 2279681 2028793 1732222 1432202 1142251
12078A142251k48935k21462j64538j17998m5686k7649m9996r222k3109l9j1982
$$ 1142251 893316 671854 507316 389318 343632 315983 265987 256765 233656 233617 221635
12067B21635j8872r497L393k9969k5524k5967j9798k7055j6910R63J5701k1573
$$ 221635 202763 193266 196659 166690 141166 115199 95401 68346 51436 52399 68100 46527
12055D6527j7254K3347J97j4588l888Q175j7232Q849K5807K3653R545J6947K284
$$ 46527 29273 52620 52817 38229 34341 42516 25284 34133 59940 83593 93138 110085 112369
12042A12369m880L54l2321o740p217k6752q787k210k225j1144o865K025n649K7776
$$ 112369 107489 107843 75522 68782 61565 34813 26026 23816 21591 10447 3582 5607 -42 27734
12028B7734J0367J0395J5314L2503k708j9336o989l4513p635O9102K5629m6587
$$ 27734 38101 48496 63810 96313 93605 74269 67280 32767 25132 94234 119863 73276
12016G3276J4592K1009r474m7o331R3R719L146O2k7967k2178j1091j9210M313
$$ 73276 87868 108877 99403 99356 93025 93118 102837 105983 106045 78078 55900 44809 25599 29912
12002B9912K3830Mj1807j2999o912N441K2769K4066k5362m357q193j480k574J1071
$$ 29912 53742 53746 41939 28940 22028 27469 50238 74304 48942 44585 36392 34912 32338 43409
11988D3409r376K5125J8580j3124r757j0362l547o43j5892M263N827k0878N890
$$ 43409 34033 59158 77738 64614 54857 44495 40948 40305 24413 28676 34503 13625 19515
11975A9515J942J97m289P831o163J4149J3321k428Q71R702K19j5588k2329K2264
$$ 19515 21457 21654 17365 25196 19033 33182 46503 44075 44946 54648 54867 39279 16950 39214
11961C9214q736k4449j30P206j295R181R993K1440p604j020j4676k4424j537j0152
$$ 39214 30478 6029 5899 13105 11810 20991 30984 52424 44820 43800 29124 4700 3163 -6989
11947f989L0361K2878j6888o599J7593j227R319j4277q318K330J9780q481l5955
$$ -6989 23372 46250 29362 22763 40356 39129 48448 34171 25853 28183 47963 39482 3527
11934C527j9023J3977j09K386K1719J8514J0904Q692j6095Q26o551j1351J4911
$$ 3527 -15496 -1519 -1628 758 22477 40991 51895 60587 44492 45318 38767 27416 42327
11921D2327K500k5616j5149N413J4904J0880M93j1353J5976L9357j7434k3605
$$ 42327 44827 19211 4062 9475 24379 35259 35752 24399 40375 79732 62298 38693
11909C8693Q992J2942J460K743j5949k4895M197P23R430j111O476K8848Q67r081
$$ 38693 47685 60627 62087 64830 48881 23986 28183 28906 38336 37225 43701 72549 73416 64335
11895F4335j1406j1626J857p242J4304j440Q750j3816j3398L674R033K2911k0073
$$ 64335 52929 41303 43160 35918 50222 48782 57532 43716 30318 33992 43025 65936 45863
11882D5863j3272M6957J4109j9417o365K6905J9228k8687j7120J2900Q605K7551
$$ 45863 32591 79548 93657 74240 67875 94780 114008 85321 68201 81101 89706 117257
11870A17257j9501k6950j2809j9054j306k0561O897K0513J1858N543n522k6562
$$ 117257 97756 70806 57997 38943 37637 17076 23973 44486 56344 61887 56365 29803
11858B9803l1541j0163J5402J9262J9850J0755P663k2352l421P367m38j1956k8273
$$ 29803 -1738 -11901 3501 22763 42613 53368 61031 38679 35258 42625 42187 30231 1958
11845A958J0734L4241K3015J6870j6580l1050Q324L306o825n077k4954m638j6953
$$ 1958 12692 46933 69948 86818 70238 39188 47512 50818 43993 38916 13962 9324 -7629
11832g629N712K3665l193k060J3416K1372p545k0444J904l478J0923L24K7026
$$ -7629 -1917 21748 18555 16495 29911 51283 43738 23294 25198 21720 32643 32967 59993
11819E9993K1928k2564l1523o089j398q923n301J636K8404j703j4927j0311k1096
$$ 59993 81921 59357 27834 21745 20347 11424 6123 7759 36163 34460 19533 9222 -11874
11806a1874K9252L1054m679m0034l0822J530L1952j1344l0139L1934M6529k872
$$ -11874 17378 48432 43753 3719 -27103 -25573 6379 -4965 -35104 -3170 43359 40487
11794D0487k4439k8101J1705K0762K5448K4402k348k4819p538L2435K0947j5281
$$ 40487 16048 -12053 -348 20414 45862 70264 67916 43097 35559 67994 88941 73660
11782G3660K897n482r86o326O077k3063j7128J0763j0835j0016J6058n836j2884
$$ 73660 76557 71075 70089 63763 69840 46777 29649 40412 29577 19561 35619 29783 16899
11769A6899p534k461j6175l974M736J3083j4820M170K1978O356J0645J5817l610
$$ 16899 9365 6904 -9271 -13245 -8509 4574 -10246 -6076 15902 22258 32903 48720 45110
11756D5110l5757r423R115R290K0334p063l244L72l717j874n781j4207J581L186
$$ 45110 9353 -70 9045 18335 38669 31606 28362 28734 25017 23143 17362 3155 4736 7922
11742G922J5947R863J131j7298J4693N550j2411j058P315J5648K776o626J9314
$$ 7922 23869 33732 34863 17565 32258 37808 25397 24339 31654 47302 50078 43452 62766
11729F2766j4972l1282l3650R421J1567R549K2087j6735o632J5654K5365j4220
$$ 62766 47794 16512 -17138 -7717 3850 13399 35486 18751 12119 27773 53138 38918
11717C8918p400o79M705l503j3976K486J30p602l5499k9967J6834L6089j276r416
$$ 38918 31518 30839 35544 32041 18065 20551 20681 13079 -22420 -52387 -35553 536 -740 -10156
11703a0156M492o049j1462O368J8490Q120J5752j5832j7073J8091L220j9559k0530
$$ -10156 -5664 -11713 -23175 -16807 1683 9803 25555 9723 -7350 10741 13961 -5598 -26128
11690b6128M372j578L849R199k0108o378J9733J0856K0802M746J2927P653J0763
$$ -26128 -21756 -23334 -19485 -10286 -30394 -36772 -17039 -6183 14619 19365 32292 39945 50708
11677E0708j7520k0851J6874l995l505J4075l4971M043J1081l5242j0245J7158
$$ 50708 33188 12337 29211 25216 21711 35786 815 4858 15939 -19303 -29548 -12390
11665a2390l751j391J8461Q511k0006k3315N0178M2782k5262J4899K9844J5954
$$ -12390 -16141 -17532 929 9440 -10566 -33881 16297 59079 33817 48716 78560 94514
11653I4514J0639o234k661j5722m4074k8472o6J551j0107J929J9077j1032j3352
$$ 94514 105153 98919 96258 80536 36462 7990 7924 9475 -632 1297 20374 9342 -4010
11640d010j2982P466m674J7055K0264K2423j5138L176p047Q402m919l286J4894
$$ -4010 -16992 -9526 -14200 2855 23119 45542 30404 33580 26533 34935 30016 26730 41624
11627D1624M847l0K0070p461j0180K3789L4833K658m8933J2130k588j5483j817
$$ 41624 46471 46441 66511 59050 48870 72659 107492 110150 61217 73347 70759 55276 53459
11614E3459j8359j5641J4258J475J906J2068k9666J4950q50j2774l01j974j1077
$$ 53459 35100 19459 33717 35192 37098 49166 19500 34450 33600 20826 20525 18551 7474
11601G474L7256L1955J4787r048O39j0203j0997M627J1697K9130J1455r307m2980
$$ 7474 44730 76685 91472 82424 83063 72860 61863 66490 78187 107317 118772 109465 66485
11588F6485m052J9421j205j141J0060P978J3813l338r099k0281k4131j1953p547
$$ 66485 62433 81854 80649 79508 89568 97546 111359 108021 98922 78641 54510 42557 35010
11575C5010J8921J4380k5593k393r631j2035K8603J2934o600K280r783O813o059
$$ 35010 53931 68311 42718 40325 30694 18659 47262 60196 53596 55876 46093 52906 46847
11562D6847p778k9402K3277J9923J1741j1587j35J3742j0571k9643O754K665j1550
$$ 46847 39069 9667 32944 52867 64608 53021 52886 66628 56057 26414 33168 35833 24283
11549B4283m27j7428j972Q406j2551j6739L4818k198j500R715J730l348O761P24
$$ 24283 23856 6428 4456 12862 311 -16428 18390 16192 14692 24407 26137 22789 29550 30274
11535C0274K6560K6331r92R949J441J6010n602j0566r075K1103p858K9418K6435
$$ 30274 56834 83165 82173 92122 93563 109573 103971 93405 84330 105433 97575 126993 153428
11522A53428K2518J6123l742J3250K4796j4613M3496M8194K9648N3488M1019P7581
$$ 153428 175946 192069 188327 201577 226373 211760 255256 303450 333098 386586 427605 505186
11510E05186R0105J15730J44178K04702L09582L64422L96056K98150J03842j15422
$$ 505186 595291 711021 855199 1059901 1369483 1733905 2129961 2428111 2531953 2416531
11500B416531l05622l88877l51643l01488k27990j85406j11267o8581n1499q1978
$$ 2416531 2110909 1722032 1370389 1068901 840911 655505 544238 475657 424158 342180
11490C42180o5700l6831k7689m708k3230l7634k4815O997m001L47o557l5450k2138
$$ 342180 276480 239649 211960 207252 184022 146388 121573 128570 124569 124916 118359 82909 60771
11477F0771k27L8742n487j2647r588R952K760K228M634N179j8766j3354j4103
$$ 60771 60544 99286 93799 81152 71564 81516 84276 86504 91138 96317 77551 64197 50094
11464E0094j6730K019j3610j1735J4812K6698J5606k479N765j2431j3102Q915
$$ 50094 33364 35383 21773 10038 24850 51548 67154 64675 70440 58009 44907 53822
11452E3822K2974r791j8874j9524j0527N336p909j757J424l800p382J7890K6925
$$ 53822 76796 67005 48131 28607 18080 23416 15507 13750 15174 11374 3992 21882 48807
11439D8807J3650q13j045j2975N326K613N562N258K2521R177l8695l2338R150
$$ 48807 62457 61644 60599 47624 52950 55563 61125 66383 88904 98081 59386 27048 36198
11426C6198J7376n630k9871K857M1131m686j827j8128n071L960P811J8818J239
$$ 36198 53574 47944 18073 20930 62061 57375 55548 37420 32349 36309 44120 62938 64177
11413F4177k9530q776J7841J7588j2415j7490J1133J2777Q090K5738M003l1628
$$ 64177 34647 25871 43712 61300 48885 31395 42528 55305 63395 89133 93136 61508
11401F1508j4610n084J5716Q736J1018J8169K2736J5413M7622J7900l5838n0547
$$ 61508 46898 41814 57530 66266 77284 95453 118189 133602 181224 199124 163286 112739
11389A12739k3415k9252r347j6050J769j380n568J1398K6285j798O669R053J5306
$$ 112739 89324 60072 50725 34675 36444 35064 29496 40894 67179 65381 72050 81103 96409
11376I6409L683K3089J6608L651r367L4556P094L1917O2041J7646p419L2772O9412
$$ 96409 100092 123181 139789 143440 134073 168629 175723 207640 269681 287327 279908 312680 382092
11363C82092P0154J09446Q7881L0963O0478R5762J29723J79782K65966L86685
$$ 382092 452246 561692 649573 680536 741014 836776 966499 1146281 1412247 1798932
11353A798932O16412R30809J376942J711317J288071j71671j441576j718368j383190
$$ 1798932 2415344 3346153 4723095 6434412 7722483 7550812 6109236 4390868 3007678
11344C007678r04719n60478l52607k33782j57463j38708j03083n7313o9330m8049
$$ 3007678 2102959 1542481 1189874 956092 798629 659921 556838 499525 430195 382146
11334C82146m8464n2427k0171P386k614R252j0579k4112k3534k9709j9789R980
$$ 382146 333682 281255 261084 268470 265856 275108 264529 240417 216883 187174 167385 177365
11322A77365o631n63j9935p511R272j416j9840J2122j416m0557K638m003j9019
$$ 177365 170734 170171 150236 142725 151997 150581 130741 142863 141447 100890 103528 99525 80506
11309H0506k4161j8325K173M829K7807J3544N809J6007l45J048p282l4656M737
$$ 80506 56345 38020 40193 45022 72829 86373 92182 108189 107844 108892 101610 66954 71691
11296G1691J2331O072P042K0741J329J0409J4116n444J1866R364k7644r518L8705
$$ 71691 84022 90094 97136 117877 119206 129615 143731 138287 150153 159517 131873 122355 161060
11283A61060K8321J1403L8588K3356K0162M0435K4298R764K5387l2752l7401l2589
$$ 161060 189381 200784 239372 262728 282890 323325 347623 357387 382774 350022 312621 280032
11271B80032m7740m3769l4457l6158m304J271J5777J377l2580j0819p212j3983
$$ 280032 232292 188523 154066 117908 113604 114875 130652 132029 99449 88630 81418 67435
11259F7435J1782j0454r903j0392k365M9486M3482k8817j3975k3350j1738R219
$$ 67435 79217 68763 58860 48468 46103 95589 139071 110254 96279 72929 61191 70410
11247G0410j959j7585m554L475K876Q814k6507k0998q42r406K54K7514J5506J6449
$$ 70410 68451 50866 46312 49787 52663 61477 34970 13972 13130 3724 3978 31492 46998 63447
11233F3447J8548R05j3463j9608j0034l1195O256P551K6782N0792J3243k2380
$$ 63447 81995 82900 69437 49829 39795 8600 14856 22407 49189 99981 113224 90844
11221I0844k399P050k075k6232J7366J703l7777l547K2634L3721r57r222l057
$$ 90844 88445 95495 93420 67188 84554 86257 48480 44933 67567 101288 100331 91109 88052
11208H8052k5465j7830j0434K8214L2932j4355l1717j0369L5286L5566J5675k7238
$$ 88052 62587 44757 34323 62537 95469 81114 49397 39028 74314 109880 125555 98317
11196I8317j0498J1038o110k920K3139J8444J6578k0473j5637J7303J5058p035
$$ 98317 87819 98857 92747 89827 112966 131410 147988 127515 111878 129181 144239 137204
11184A37204k605J5796p850m2005J8403J0141j0218o562l502m2438j3376l151
$$ 137204 134599 150395 142545 100540 118943 129084 118866 112304 108802 66364 52988 49837
11172D9837r839K084L7476L8338N320q223j77N597J2791k4717j3505j3564R805
$$ 49837 39998 42082 79558 117896 123216 114993 114816 120413 133204 108487 94982 81418 91223
11159I1223K5198Q194j0907q781L4523l394k5102J449P792m147P3J4966J7741
$$ 91223 116421 124615 113708 104927 139450 136056 110954 112403 120195 116048 116121 131087 148828
11146A48828l0764k5306k4836n797p201K2352P731O223K5299K2377L1220R665
$$ 148828 118064 92758 67922 62125 54924 77276 85007 91230 116529 138906 170126 179791
11134A79791J74j6950o258j8378n735R32K4797p347o257R783l635K3151Q958J0744
$$ 179791 179965 163015 156757 138379 132644 133576 158373 151026 144769 154552 150917 174068 183026 193770
11120A93770j014Q127O815k1320P481O772l4545M618K0702J5348p15Q351m68q85
$$ 193770 192756 200883 207698 186378 193859 200631 166086 170704 191406 206754 206039 214390 213922 213037
11106B13037k0408k909L8528K4882j8221l002O839J7489k645K3785O818N076j4501
$$ 213037 192629 189720 228248 253130 234909 231907 238746 256235 253590 277375 284193 289269 274768
11093B74768On539J4957J8816L129j3336L9257J4304J4611J4782L2812M9601M0001
$$ 274768 274774 269235 284192 303008 306137 292801 332058 346362 360973 375755 408567 458168 498169
11080D98169r531j9061k9740j1704J6735L7950K9865K9335J2272M224j7424l8338
$$ 498169 488638 469577 439837 428133 444868 482818 512683 542018 554290 558514 541090 502752
11068E02752j5026K2173k8674J2685K76k3566o6250o6421j1790J208l3820Q266
$$ 502752 487726 509899 481225 493910 494186 470620 404370 337949 326159 327367 293547 301813
11056C01813k6916l9000R486N5396P724k1809J34j2082k0083J0984K145n802j746
$$ 301813 274897 235897 245383 300779 308503 286694 286828 274746 254663 265647 267792 261990 260244
11043B60244l2822j3267j1638k5619M418K1789M864j6626p8J9304K3057r187j4175
$$ 260244 227422 214155 202517 176898 181316 203105 207969 191343 191265 210569 233626 224439 210264
11030B10264k9017j2590j4131M182j2541k883j4497J1918J7570K64n20O3L6964
$$ 210264 181247 168657 154526 158708 146167 143284 128787 140705 158275 158539 158019 158082 195046
11017A95046K6597J0495k2262k4138p787Q694N594m862m339j5539J3979J3105
$$ 195046 221643 232138 209876 185738 177951 186645 192239 187377 183038 167499 181478 194583
11005A94583N650j9106k1508k2528K2610j005M15l3575j0962O370j3400k2074
$$ 194583 200233 181127 159619 137091 159701 158696 159111 125536 114574 120944 107544 85470
10993H5470L0721K4284J0862k4747j4086M963J7469Q381m20P880K251j3705o470
$$ 85470 116191 140475 151337 126590 112504 117467 134936 143317 142897 150777 153028 139323 132853
10980A32853K5044K7028J4450j2478j60M3326L6602q982K973L1794M6567O7029
$$ 132853 157897 184925 199375 186897 186737 230063 266665 257683 260656 292450 339017 406046
10968D06046P1083Q5215J41631K36833K93547L80304L66870K12653j02181l74349
$$ 406046 477129 562344 703975 940808 1234355 1614659 1981529 2194182 2092001 1717652
10958A717652m23068l68763k59099j56634j03615o6471j2773m2904l4380k4551
$$ 1717652 1294584 925821 666722 510088 406473 340002 327229 284325 249945 225394
10948B25394k4834j9999m016o945m0106m0207k076K643M81K4153o219j4870r846
$$ 225394 200560 180561 176545 169600 129494 89287 87211 89854 90335 114488 108269 93399 83553
10935H3553j3379R631j0580O576O899P884k565l5558j8304q232J128N689K324
$$ 83553 70174 79805 69225 75801 82700 90584 88019 52461 34157 25925 27053 32742 35066
10922C5066J343j0710k7203j2278K2361K1213K2127Q235J106J9344J1356j4058
$$ 35066 36409 25699 -1504 -13782 8579 29792 51919 60154 61260 80604 91960 77902
10910G7902k1608j558n16j6392l4369Q098R057j2329K4442K8496L322k2263l214
$$ 77902 56294 54736 54220 37828 3459 11557 20614 8285 32727 61223 64545 42282 39068
10897C9068J414K2196L309j9624j2987P699n973M78J6811k2911j6417k7334K9729
$$ 39068 40482 62678 65987 46363 33376 41075 35102 35580 52391 29480 13063 -14271 15458
10884A5458K0213j601o168k5331j9239L523o905J7454K7020j2191R13J4659j1758
$$ 15458 35671 34070 27902 2571 -16668 -13145 -20050 -2596 24424 12233 13146 27805 16047
10871A6047j729j118M287j0572m663J0725j4137N565K0421O748n412R357R594
$$ 16047 14318 13200 17487 6915 2252 12977 -1160 4405 24826 31574 26162 35519 45113
10858D5113k245J2527k485k1288j0491l4967k061j7303k7928K5189j2837K504
$$ 45113 42868 55395 52910 31622 21131 -13836 -15897 -33200 -61128 -35939 -48776 -46272
10846d6272Q884L1451J9249J5762J1139r572m305L957j5527k7789Q848j0253P124
$$ -46272 -37388 -5937 13312 29074 40213 30641 26336 30293 14766 -13023 -4175 -14428 -7304
10833g304R178O676P258o999N86J7031L887l4817M640n919J521L4072K4214k549
$$ -7304 1874 8550 15808 8809 9395 26426 30313 -4504 136 -5783 -4262 29810 54024 51475
10819E1475L534j7060k0144k723K5993J8011mk6566j3049l2642j2193J829L751
$$ 51475 55009 37949 17805 15082 41075 59086 59082 32516 19467 -13175 -25368 -23539 -19788
10806a9788r116J9290K7559J2343J5044N806Q230M5471K7716K0569N4061O1940
$$ -19788 -28904 -9614 17945 30288 45332 51138 59368 104839 132555 153124 207185 269125
10794B69125K2078l9965o6881o5617n1438l1319r799l4065M414j1174j2628K186
$$ 269125 291203 251238 184357 118740 67302 35983 26184 -7881 -3467 -14641 -27269 -25083
10782b5083J5394J379j1563l286M804j2458L2702J1232k4940l9462P228k960j1707
$$ -25083 -9689 -8310 -19873 -23159 -18355 -30813 1889 13121 -11819 -51281 -44053 -47013 -58720
10769e8720R004J8481N5448K9327J3431j6925j6393J4923L6999k9305k7045k8585
$$ -58720 -49716 -31235 24213 53540 66971 50046 33653 48576 85575 56270 29225 640
10757F40j9606n909k026l429K8958L6595L774j5008j8036k7231j4761J1469K1617
$$ 640 -18966 -24875 -26901 -30330 -1372 35223 38997 23989 5953 -21278 -36039 -24570 -2953
10744b953L4951K5507l5754n3446P78l7703k7169k0544j1412K0596Q933P392K8050
$$ -2953 31998 57505 21751 -31695 -30917 -68620 -95789 -116333 -127745 -107149 -98216 -90824 -62774
10731f2774L783p12Q072O243J806P861J1685M166K0884K9638n16J6128M853j162
$$ -62774 -58991 -59703 -51631 -45388 -43582 -35721 -24036 -19870 1014 30652 30136 46264 51117 49955
10717D9955M96O364k1361j0804o689j8893N933J2963O069k3706J892n915j242
$$ 49955 50451 56815 35454 24650 17961 -932 5001 17964 24033 327 2219 -3696 -4938
10704d938J165M6504K9255K29M714P5j9827j0694o615O909k963k907l2055m279
$$ -4938 -3773 42731 71986 72215 76929 77004 57177 46483 39868 46777 43814 40907 8852 4573
10690D573K477j6140J97K8446N1285O714j9183j6389m017K3897K0005N470K0379
$$ 4573 7050 -9090 -8893 19553 70838 77552 58369 41980 37963 61860 81865 87335 107714
10677A07714J8931J8401O792j9857l476K196J4587L0121K8020l5813p2201q1078
$$ 107714 126645 145046 151838 131981 128505 130701 145288 175409 203429 167616 95415 14337
10665A4337p4440j2589L485K8269K821j3861j8734q403j8L5906K6811O971K3401
$$ 14337 -60103 -72692 -69207 -40938 -38117 -51978 -70712 -79115 -79133 -43227 -16416 -9445 13956
10652A3956K1037O4j7008p592Q546Q297l5741j7736J1212L6935M2553l642j9830
$$ 13956 34993 35057 18049 10457 19003 27300 -8441 -26177 -14965 21970 64523 60881 41051
10639D1051j4845k605M328K6955J5569j5402o206L4856L1980r124J3041j639k6792
$$ 41051 26206 23601 27929 54884 70453 55051 48845 83701 115681 106557 119598 117959 91167
10626I1167k1984j890k3434j9561p09K693J201K4495J6050N3422P6595K3546l4921
$$ 91167 69183 67293 43859 24298 23589 26282 27483 51978 68028 121450 198045 221591 186670
10613A86670j0936J1666L6995K7964R864L6941K5664n870M913O910K2210J8539
$$ 186670 175734 187400 224395 252359 262223 299164 324828 318958 323871 330781 352991 371530
10601C71530M1970K5882J2100K4119K3580L5954j56L7628K3819J7604K5156J0108
$$ 371530 413500 439382 451482 475601 499181 535135 534979 572607 596426 614030 639186 649294
10589F49294J3172N9154N6052O5364J00183Q2430Q6603J03218J29696J03688J19695
$$ 649294 662466 721620 777672 843036 943219 1025649 1112252 1215470 1345166 1448854 1568549
10578A568549J56951J58027J89303K06375J77234K37075K78295K66581K94178
$$ 1568549 1725500 1883527 2072830 2279205 2456439 2693514 2971809 3238390 3532568
10569C532568K71291L46870M71965O08799P63138R26069J129096J387729J599610
$$ 3532568 3803859 4150729 4622694 5231493 5994631 6920700 8049796 9437525 11037135
10560A1037135J787867J857197J885782K132275K527539L033002L566742M166883
$$ 11037135 12825002 14682199 16567981 18700256 21227795 24260797 27827539 31994422
10552C1994422M987773O339082Q413743J1424814J5846810K2439441L2699668
$$ 31994422 36982195 43321277 51735020 63159834 79006644 101446085 134145753
10545A34145753M8229252O7874567Q1499891O7368539J4039519m8671393q1781487
$$ 134145753 182375005 250249572 331749463 399118002 413157521 364486128 282704641
10538B82704641p9346173n9536327l9829086k6100093j7639934j2323952q878925
$$ 282704641 203358468 143822141 103993055 77892962 60253028 47929076 39050151
10531C9050151o663098n105355l951625k999727k267011j675640j187085q96495
$$ 39050151 32387053 27281698 23330073 20330346 18063335 16387695 15200610 14304115
10523A4304115q58499j067816j177938j116887r42862p42053o19635n32051n00146
$$ 14304115 13445616 12377800 11199862 10082975 9140113 8398060 7778425 7246374 6746228
10514F746228m85038m83762l99002l54582k96030k52113k31597k10077j75684
$$ 6746228 6261190 5777428 5378426 5023844 4727814 4475701 4244104 4034027 3858343
10505C858343j59289j50560j45334j52138j42255j00415p6339o1760m8981q1636
$$ 3858343 3699054 3548494 3403160 3251022 3108767 3008352 2932013 2870253 2821272 2739636
10495B739636r2174o8939m9561n6279j12286j55495j21167o0565o7281o9917m9970
$$ 2739636 2647462 2578523 2528962 2472683 2360397 2204902 2083735 2023170 1955889 1885972 1836002
10484A836002n6404n8791o2259o1383l4435l7207o4917o0371n7247l7885n412
$$ 1836002 1779598 1720807 1658548 1597165 1562730 1525523 1460606 1400235 1342988 1305103 1299691
10473A299691j1598j1842l7435k4056m3738q246J968L76Q641J3976m194n2806
$$ 1299691 1288093 1276251 1238816 1214760 1171022 1162776 1164744 1165120 1173761 1187737 1183543 1130737
10461A130737n8890k5385J5218k9505j7351j3826m0725m2809k9292J5256R578
$$ 1130737 1071847 1046462 1061680 1032175 1014824 1000998 960273 917464 888172 903428 913006
10450I13006k2388j1344q173q077P551p905k0040j2863j149j035k700P125J9485
$$ 913006 890618 879274 871101 863024 870575 862670 842630 829767 828618 827583 824883 832008 851493
10437H51493j7125k1035k4816n1634l6301P586P543j8635k523J2645K0761l7543
$$ 851493 834368 813333 788517 736883 700582 708168 715711 697076 694553 707198 727959 690416
10425F90416j4089J4281J2018P592P72M0940M5836r136k0263j4736m8847p4420
$$ 690416 676327 690608 702626 710218 710990 751930 797766 788630 768367 753631 704784 630364
10413F30364m9646k1627l9112k3627q100J0779j1991J068j7888j7906j519j7043
$$ 630364 580718 559091 519979 496352 488252 499031 487040 488108 470220 452314 450795 433752
10401D33752q180M58J8205j983K488N630J8225n693j6857J823k1335j0912J0895
$$ 433752 425572 426030 444235 442252 444740 450370 468595 462902 446045 447868 426533 415621 426516
10388D26516K1963q659p533j7930j4304k3571j4416K791J5527M085K452O028P725
$$ 426516 448479 439820 432287 414357 400053 376482 362066 364857 380384 384469 386921 392949 400674
10375D00674J1963M7k9025L765J3382J250n0607k4300M726K47O483J4026R460
$$ 400674 412637 412684 383659 387424 400806 402056 351449 327149 331875 332122 338605 352631 362091
10362C62091K071j994k89J9782k060J7097J7411R685O671K1692J8953l436j7265
$$ 362091 364162 362168 361879 381661 379601 396698 414109 423794 430465 452157 471110 467674 450409
10349D50409J4130J96k0253k1989j6730j3527k0426j5456m617k8008j5106J4804
$$ 450409 464539 464735 444482 422493 405763 392236 371810 356354 351737 323729 308623 323427
10337C23427K0088r755k937p444K0564j5274l5743M841N6959M9933K3181K2317
$$ 323427 343515 333760 330823 323379 343943 328669 292926 297767 354726 404659 427840 450157
10325D50157o475j4683P706K1217J9362L2557O1088R8187J13712J50245J15494
$$ 450157 443682 428999 436705 457922 477284 509841 570929 669116 782828 933073 1048567
10314A048567K1763Q2797J16101J16591J9814j05060j48926j03966o4898r9584
$$ 1048567 1070330 1153127 1269228 1385819 1405633 1300573 1151647 1047681 982783 883199
10304H83199j52994j57943o4894l8534j0717l221q570j746k244k8733l7205n004
$$ 883199 730205 572262 507368 468834 458117 454896 446326 444580 442336 413603 376398 371394
10292C71394j866K4327R295j609J1783r343m586l0617k9164P019q308k9235n856
$$ 371394 369528 393855 403150 401541 413324 403981 399395 368778 339614 346633 338325 309090 303234
10279C03234J4485K7487J4513J64j8461m8954l4699J010l804K3347J2757K447
$$ 303234 317719 345206 359719 359883 341422 292468 257769 258779 254975 278322 291079 293526
10267B93526J0452J9923j806J7508M7053J505K847J6129L754j675O078R12R443
$$ 293526 303978 323901 322095 339603 386656 388161 391008 407137 410891 409216 415294 416206 425649
10254D25649K9273k333L6436J6375K9946K3265K1676N4876P7189N7784M3202P7864
$$ 425649 454922 452589 489025 505400 535346 558611 580287 635163 712352 770136 813338 891202
10242H91202J09816J29442J30911J86340K06775K45860L00503L68621L87427M97621
$$ 891202 1001018 1130460 1261371 1447711 1654486 1900346 2200849 2569470 2956897 3454518
10232C454518P51366J004487J151841J185188R77755M77629k25740q58751j205663
$$ 3454518 4205884 5210371 6362212 7547400 8525155 9002784 8777044 7918293 6712630
10223F712630j141680r23156o29581l37614p5909J48404M47788Q67226J440156
$$ 6712630 5570950 4647794 4018213 3680599 3604690 3753094 4200882 5068108 6508264
10214F508264K016189K134546J335143l47067j808511k372076k101834j497347
$$ 6508264 8524453 10658999 11994142 11647075 9838564 7466488 5364654 3867307
10206C867307r77399o38508m26487k70757k12064j87220j31599q4648p7091n3246
$$ 3867307 2889908 2251400 1824913 1554156 1342092 1154872 1023273 938625 861534 808288
10196H08288o499j841k0816m5215n4368m1107m4834l2328l2724j3467k5858j1787
$$ 808288 801789 799948 779132 733917 679549 638442 593608 561280 528556 515089 489231 477444
10184D77444o464j5154p331p98M861j1309l791q876N792k1289k9633k1891K0708
$$ 477444 470980 455826 448495 447697 452558 441249 437458 428582 434374 413085 383452 361561 382269
10171C82269J3345j4088J875m029J2977k1081p899m63k1488J560m111l1716j7506
$$ 382269 395614 381526 383401 379372 392349 371268 363369 362906 341418 342978 338867 307151 289645
10158B89645L626J6012L2209Q398q622k8381J510m25k604j6350J3063Qm74J7393
$$ 289645 293271 309283 341492 349890 341268 312887 314397 313972 311368 295018 308081 308089 307615 325008
10144C25008J7494N7828O719L871K5823L0259K3201j0620j9852j6515J4930p120
$$ 325008 342502 400330 407049 410920 436743 467002 490203 479583 459731 443216 458146 451026
10132D51026l1833k1895J3489M3627L2328j59K5996L9039M4021O7009P8140J11014
$$ 451026 419193 397298 410787 454414 486742 486583 512579 551618 595639 662648 740788 851802
10120H51802K24564K91818L70568M01101L11119J6029k81516m10233l96006l13312
$$ 851802 1076366 1368184 1738752 2139853 2450972 2467001 2185485 1775252 1379246 1065934
10110A065934k01676j43199j01440n7390k9515m9545l7124l1724j5367k8330j5974
$$ 1065934 864258 721059 619619 562229 532714 483169 446045 414321 398954 370624 354650
10099C54650j0322k4313k1878j8896K075J5570l287m60j3360O107Q039q803j6157
$$ 354650 344328 320015 298137 279241 281316 296886 293599 293139 279779 285886 293925 285122 268965
10086B68965j9559J1706O548J0011J1619J1904k2589j5278j7287k2466K83J3924
$$ 268965 249406 261112 267660 277671 289290 301194 278605 263327 246040 223574 223857 237781
10074B37781m236k4343K0107j2436j9966K2294K7124l778j5442o262k049r032
$$ 237781 233545 209202 229309 216873 196907 219201 246325 242547 227105 220843 218794 209762
10062B09762P269j3883K7448N740K015O617K154k4241r03j3056J4117R395j6049
$$ 209762 217031 203148 230596 236336 238351 244968 247122 222881 221978 208922 223039 232434 216385
10049B16385k2294q518O604M4791J6884l372K86m656j0387o537Q121L0273O990
$$ 216385 194091 185573 192177 236968 253852 250480 250766 246110 235723 229186 237307 267580 274570
10036B74570j7586J3105J150j8426n4260l405L1105J5498J5483J078k9273k2871
$$ 274570 256984 270089 271239 252813 198553 195148 226253 241751 257234 258312 229039 206168
10024B06168r280J5201K8067K122m5417l786K643o760L208l3724P793K9135J897
$$ 206168 196888 212089 240156 242278 196861 193075 195718 188958 192166 158442 166235 195370 197267
10011A97267J198Q326K344q675J6612L451p319k1106j1410J171r288J1650M014
$$ 197267 198465 206791 209135 200460 217072 220523 213204 192098 180688 181859 172571 184221 188235
9998A88235R045j4328j0610K8303n73l0289k1977j40J3318j3385n604J2155L2333
$$ 188235 197280 182952 172342 200645 200072 169783 147806 147666 160984 147599 141995 154150 186483
9985A86483J6644n524j8226J2934l32j6021K5320R109M962p589j1440n246j4106
$$ 186483 203127 197603 179377 192311 191979 175958 201278 210387 215349 207760 196320 191074 176968
9972A76968P100k1522j5933J4738o788J3458R735J832R511K2399P766n99j0812
$$ 176968 184068 162546 146613 161351 154563 168021 177756 179588 189099 211498 219264 218665 207853
9959B07853k3946j1988M6911K8892r749J346K7480j206j1620n393k2850j7533
$$ 207853 183907 171919 218830 247722 237973 239319 266799 265593 253973 248580 225730 208197
9947B08197j5940J2166J1876k4069l051P702O630j9467k626n135K257p606P695
$$ 208197 192257 204423 216299 192230 189179 196881 203511 184044 181418 176283 178540 170934 178629
9934A78629J9089J5665j4586j3877p790k7028O708K7068q669k9567J825m700J2202
$$ 178629 197718 213383 198797 184920 177130 150102 156810 183878 175209 145642 147467 142767 154969
9921A54969m182j1540J2042K7857N437K006k6037J7929K5750l590L615j056j0012
$$ 154969 150787 139247 151289 179146 184583 186589 160552 178481 204231 200641 204256 203200 193188
9908A93188l0259J4893J1058M349j5495J375r26j1795L0377J0492k7703k890r922
$$ 193188 162929 177822 188880 193229 177734 179109 178183 166388 196765 207257 179554 176664 166742
9895A66742j8083L4564K3202k1517L831j2198j6129P533J5901J0485j3263j4657
$$ 166742 148659 183223 206425 184908 188739 176541 160412 167945 183846 194331 181068 166411
9883A66411j8896j0555j0808J7054l416K1116J2066j8287J4220L4121q055m0860
$$ 166411 147515 136960 126152 143206 139790 160906 172972 154685 168905 203026 194971 154111
9871A54111p699m696n21J5796K402K5211r627J8637K9848n354P22M0133J8538
$$ 154111 146412 141716 141195 156991 159393 184604 174977 193614 223462 218108 218830 258963 277501
9858B77501j4417l4731j7885q625J2600J7516J6462q73n783l7060j5758N01k761
$$ 277501 263084 228353 210468 201843 214443 231959 248421 247548 241765 204705 188947 189448 186687
9845A86687k3350K919j163J9454p126j9949L2926J2296P289J0816j5147l8631
$$ 186687 163337 166256 165093 184547 177421 157472 190398 202694 209983 220799 205652 167021
9833A67021k5972Q940O131J1777J28P825J9021m115j8277j9778k8094L6086L5854
$$ 167021 141049 149989 156120 167897 168025 175850 194871 190756 172479 152701 124607 160693 196547
9820A96547P948k064L990j1345o740R155k070j4494r118J8059j8347k2196k654
$$ 196547 204495 202431 206421 195076 188336 197491 195421 180927 171809 189868 171521 149325 146671
9807A46671J4034M3387L864j8084P97J9012k265k0282N438J2253P379o993M059
$$ 146671 160705 204092 207956 189872 190669 209681 207416 187134 192572 204825 212204 205211 209270
9794B09270j0938j3417j165M3569J9224Jn031r608k9951J2557J1365j4775L465
$$ 209270 198332 184915 183750 227319 246543 246544 241513 231905 201954 214511 225876 211101 214566
9781B14566q660k1041j8375j6223k255r347J7697J1085k139N817J2517K0653P299
$$ 214566 205906 184865 166490 150267 148012 138665 156362 167447 165308 171125 183642 204295 211594
9768B11594o520j2508r484j2021O292j2388k662Q960l79j4217n528Q544L0817
$$ 211594 205074 192566 183082 171061 177353 164965 162303 171263 170884 156667 151139 159683 190500
9755A90500J8535j3138m0542m240J7169J5719J3212j4878j6986k114Q237j6700
$$ 190500 209035 195897 155355 151115 168284 184003 197215 182337 165351 163237 171474 154774
9743A54774J3153J1449J1840K0510J4007J1632l3490o669j3176P138K3570M4363
$$ 154774 167927 179376 191216 211726 225733 237365 203875 197206 184030 191168 214738 259101
9731B59101m1668m7433q780r181L0022J0101j5587l966J559P024j1069J4020P329
$$ 259101 217433 170000 161220 152039 182061 192162 176575 172609 174168 181192 170123 184143 191472
9718A91472k1321J6678K5286r854j5244R102J5541N865n811k4497k3938K2922
$$ 191472 170151 186829 212115 202261 187017 196119 211660 217525 211714 187217 163279 186201
9706A86201K0445j9164k2593J7378m575j951l282N788K038J6797K8471m938j9165
$$ 186201 206646 187482 164889 182267 177692 175741 172459 178247 180285 197082 225553 220615 201450
9693B01450j0453k6890j6913l138J2696K950J4149J7097j1328R701j1158R529
$$ 201450 190997 164107 147194 144056 156752 159702 173851 190948 179620 189321 178163 187692
9681A87692j1601l597j0266O286M0823K6662k1150r253j9315J3847j756k563j7998
$$ 187692 176091 172494 162228 168514 209337 235999 214849 205596 186281 200128 198372 195809 177811
9668A77811J9139j861J6483p654j9297J609R511r312l452P672J962k6519l1299
$$ 177811 196950 195089 211572 203918 184621 186230 195741 186429 182977 190649 192611 166092 134793
9655A34793r370L5361O366J1792J3217P085N98J99Q995N047r93m019k2093j6236
$$ 134793 125423 160784 167150 178942 192159 199244 199842 200041 209036 214083 213090 209071 186978 170742
9641A70742J5519k3151j8265J9216j42R86m378n923J0933J8613L321J5021O898
$$ 170742 186261 163110 144845 164061 163919 164905 160527 154604 165537 184150 187471 202492 209390
9628B09390j0351J2369k5851j7681n032K703K0947Q004L920L070J2499K6605p603
$$ 209390 199039 211408 185557 167876 162844 165547 186494 194498 198418 201488 213987 240592 232989
9615B32989l7109m723K190J9571p251q797N160L023J6672k311P272r684l0443
$$ 232989 195880 191157 193347 212918 205667 196870 202030 205053 221725 219414 226686 217002 186559
9602A86559n824n702j938K1996m132j7916j5093l433K7030L8627K79j2757M640
$$ 186559 180735 175033 173095 195091 190959 173043 157950 154517 181547 220174 220453 207696 212336
9589B12336J8471q488n376k3868n853N440k0135p118L290J4003J193k516J542
$$ 212336 230807 222319 216943 193075 187222 192662 172527 165409 168699 182702 183895 181379 182921
9576A82921K150j0169k044o283R863L638P857J1606L18m300P250K553j6690N73
$$ 182921 185071 174902 172858 166575 176438 180076 187933 199539 199857 195557 202807 205360 188670 189243
9562A89243O513j3736N153J4728r637P884K4974P715k4095k1214n158J1769J6300
$$ 189243 195756 182020 187173 201901 192264 200148 225122 232837 208742 187528 182370 194139 210439
9549B10439J8065J1639p298P673J4848K5221l4044l6736N28K1906J0256j452j3962
$$ 210439 228504 240143 232845 240518 255366 280587 246543 209807 210335 232241 242497 241045 227083
9536B27083J3408K86j0288R182L0941j0334J644m984J331l228O348j0296K0070
$$ 227083 240491 240777 230489 239671 270612 260278 261922 256938 258269 255041 261389 251093 271163
9523B71163j512j8598l7230l0915p14J4123j1439k3159Q855K8271K7587j8615
$$ 271163 269651 251053 213823 182908 182194 196317 184878 161719 170574 198845 226432 207817
9511B07817l0710J5776L414K9893K6344K19N462m511j204k9294n489K9847L923
$$ 207817 177107 192883 196297 226190 252534 252753 258215 253704 252500 223206 217717 247564 251487
9498B51487L332R044J2056O389o326m601m2359l3212J7667J3793N425J0656r895
$$ 251487 254819 263863 275919 282308 275982 271381 229022 195810 213477 227270 232695 243351 233456
9485B33456K7030j7534J022K0415j4756N790k0583j8185k561m263J1346j1943
$$ 233456 260486 242952 243974 264389 249633 255423 234840 216655 214094 209831 221177 209234
9473B09234n826K4693K5760J0798l1110N51K3633J4070k2785Q0j3799n222O166
$$ 209234 203408 228101 253861 264659 233549 234100 257733 271803 249018 249098 235299 230077 236243
9460B36243l146j9136K0305K2625k5209N814R183J7960J0384j7031k7951K18M723
$$ 236243 233097 213961 234266 256891 231682 237496 246679 264639 275023 257992 230041 230259 234982
9447B34982O419K7294j6830N931l677O319J9351K3203r805j7812k4006j3191P686
$$ 234982 241401 268695 251865 257796 254119 260438 279789 302992 293187 275375 251369 238178 245864
9434B45864L1752L1664j267m5798N267q907j5265O260J3919J202K525J326j9833
$$ 245864 277616 309280 308013 262215 267482 258575 243310 249570 263489 264691 267216 268542 248709
9421B48709q198K6968k2363R740M3272k390J863j3074k2036K4304j681j9090P327
$$ 248709 240511 267479 245116 254856 298128 295738 297601 284527 262491 286795 285114 266024 273351
9408B73351k92k0542N52r734p378L3778J6776q674O203k2765J5200L1444j0589
$$ 273351 273059 252517 253069 243335 235957 269735 286511 277837 284040 261275 276475 307919 297330
9395B97330l4867j1916Q698l511K2427K2071K2733J5859j7746k3487l188j7609
$$ 297330 262463 250547 259245 255734 278161 300232 322965 338824 321078 297591 294403 276794
9383B76794r534J669q948O892J0214J5085J7180j6359k6645J4674p220Rl018J1717
$$ 276794 267260 268929 259981 266873 277087 292172 309352 292993 266348 281022 273802 273811 270793 282510
9369B82510K534j6471j0198j0004J3148K4890j5546J0556j6441j4618J2495j3842
$$ 282510 285044 268573 258375 248371 261519 286409 270863 281419 264978 250360 262855 249013
9357B49013q15k487M478J5097K1747K6395q232j7041j398r864L640l648r37K0068
$$ 249013 248198 245711 250189 265286 287033 313428 305196 288155 286757 276893 280533 276885 275948 296016
9343B96016m449O049j2251k0784O538m249K3917K4219j9333p972J7987r412o568
$$ 296016 291567 297616 285365 264581 271119 266870 290787 315006 295673 287701 305688 296276 289708
9330B89708J8197m174k3800r915j7004K755O10j6644J1329K1199M3685J0628j6918
$$ 289708 307905 303731 279931 270016 253012 255767 256377 239733 251062 272261 315946 326574 309656
9317C09656K2438K2281O440l6834k5881J9232P712p835K565j5698N453m970N246
$$ 309656 332094 354375 360815 323981 298100 317332 325044 317209 319774 304076 309529 304559 309805
9304C09805J8160j9017J4643N205j4635p081J262n38K2960J6406P275J7761r163
$$ 309805 327965 308948 323591 328796 314161 307080 308342 307804 330764 347170 354445 372206 363043
9291C63043l556j238k2017m9801k3981J5228N2631K403k1607l322M8525L048J7181
$$ 363043 359487 358249 336232 286431 262450 277678 330309 332712 311105 307783 356308 359356 376537
9278C76537K0311O285m0294o6088j8946K6716L6053K3371J461j5115j7666k4954
$$ 376537 396848 403133 362839 296751 277805 304521 340574 363945 365406 350291 332625 307671
9266C07671j3186K9230K9723J800j7428k9359j2487J1964J0744L2104K2777l0650
$$ 307671 294485 323715 353438 355238 337810 308451 295964 307928 318672 350776 373553 342903
9254C42903j3025L1255J0271q749K2848Q261l2311k0388J491K1245j677j7152
$$ 342903 329878 361133 371404 362655 385503 393764 361453 341065 342556 363801 362124 344972
9242C44972m352K3464J9585K3365j8542r700k3074o335J3841K0904J2680k3070
$$ 344972 340620 364084 383669 407034 388492 378792 355718 349383 363224 384128 396808 373738
9230C73738l1215P397K084n860j4298j2867J415L2353J0659J9986J5631j8854
$$ 373738 342523 349920 352004 346144 331846 318979 320394 352747 363406 383392 399023 380169
9218C80169k9431J3186K1799K4573k9852l111J7674j5031k0560J4396J5899L343
$$ 380169 350738 363924 385723 410296 380444 377333 395007 379976 359416 373812 389711 393054
9206C93054j447K4109L618j7496N815J0764Q086J0299j3673J1423R662Q565l2036
$$ 393054 391607 415716 419334 401838 407653 418417 426503 436802 423129 434552 444214 452779 420743
9193D20743k8084j293K5778l471M142j2755J6552J6252J0856o63J7482M429K161
$$ 420743 392659 391366 417144 413673 417815 405060 421612 437864 448720 448057 465539 469968 472129
9180D72129j0938l096q594j802n048j0215j816J3242M881J8301J6589j3204J1366
$$ 472129 461191 458095 449501 447699 442651 432436 430620 443862 448743 467044 483633 470429 481795
9167D81795L939j9739J99J0615M148n776O157j5268O758K4358k417j4359j710
$$ 481795 485734 465995 466194 476809 480957 475181 481338 466070 472828 497186 494769 480410 478700
9154D78700J0660p27j8168K058L3263Q289m753j7265P876Q895j533J1809L591
$$ 478700 489360 488633 470465 472523 505786 514075 509322 492057 499933 508828 507295 519104 522695
9141E22695r110j0487j6302J8170o182m0727R710L0483K1192m0316k3094l783
$$ 522695 513585 503098 486796 504966 498784 458057 467767 498250 519442 479126 456032 452249
9129D52249K079J7715q996k1848K7627L3289m644R42j7435k0476K8194L9826J5645
$$ 452249 454328 472043 463047 441199 468826 502115 497471 498413 480978 460502 488696 528522 544167
9116E44167j5206q552J331K0215P078J3966N003O345l2700r295L3631K7232J2599
$$ 544167 528961 520409 521740 541955 549033 562999 568002 574347 541647 532352 565983 593215 605814
9103F05814j2088K649K830Q830q873k6999n94J1910J1732q198l2744J0293P97
$$ 605814 593726 596375 599205 608035 599162 572163 571569 583479 595211 587013 554269 564562 565359
9090E65359o972J3992R370j4125J583L791r140j4869j3400Q102K9979O383L949
$$ 565359 558387 572379 581749 567624 569207 572998 563858 548989 535589 543691 573670 580053 584002
9077E84002J05r749j4252J8815N1324P125m2228j6700q143M851j2601R676L3499
$$ 584002 584107 574358 560106 578921 630245 637370 595142 578442 570299 575150 562549 572225 605724
9064F05724K7584Q144j4952k681l88R549j0470M005J760J134P290k7570m017J0617
$$ 605724 633308 641452 626500 623819 623431 632980 622510 626515 628275 629409 636699 609129 605112 615729
9050F15729J523Q445K2629L4076k124K113Q551j3074k698K5605p400l6428j3420
$$ 615729 617252 625697 648326 682402 680278 682391 690942 677868 675170 700775 693375 656947 643527
9037F43527N965k259K3446k095J918J6994Q946j7628j2014K0751L4028j7022m466
$$ 643527 649492 647233 670679 668584 670502 687496 696442 678814 666800 687551 721579 704557 700091
9024G00091j4133J825K5733j2440k7573m923k755Q551L407o595K0054J3996o419
$$ 700091 685958 687783 713516 701076 673503 668580 665825 674376 677783 671188 691242 705238 698819
9011F98819R015Q530J8302j6547j0057K382J4783l524n008n968J0137o455L884
$$ 698819 707834 716364 734666 718119 708062 710444 725227 721703 716695 710727 720864 714409 718293
8998G18293R200J7695J2675N664N194m813P203R093j2106q146J4476p050J7166
$$ 718293 727493 745188 757863 763527 768721 763908 771111 780204 768098 759952 774428 767378 784544
8985G84544J216J308L1306O300o1083l5804K4763M6569K4948J6709J5624l5065
$$ 784544 785760 787068 818374 824674 763591 727787 752550 799119 824067 840776 856400 821335
8973H21335j6408r486l0034L2044R962J9186J659Q913M742k4769j8496J568L0293
$$ 821335 804927 795441 765407 797451 807413 826599 828258 837171 841913 817144 798648 800216 830509
8960H30509N813j8091K5016K4747j5791R972j1941J2142K5514L89k0714K4475
$$ 830509 836322 818231 843247 867994 852203 862175 850234 862376 887890 888279 867565 892040
8948H92040R635N379K5721j8864j8700j720n570M222K758k3612j1614J4680J5522
$$ 892040 901675 907054 932775 913911 895211 893491 887921 892143 894901 871289 859675 874355 889877
8935H89877L3295R565j412k2872K6276P747O572K5784q979P322j236p515p651
$$ 889877 923172 932737 931325 908453 934729 942476 949048 974832 965853 973175 971939 964424 956773
8922I56773J7428k4991J2102L6406J6949j0384R30J4839Q633Q438J4238Q652M333
$$ 956773 974201 949210 961312 997718 1014667 1004283 1005213 1020052 1028685 1037123 1051361 1060013 1064346
8909A064346M7538Q0k7006l093j9123K111N635j012k1589N2073J8535k8087J4747
$$ 1064346 1111884 1111964 1084958 1081865 1062742 1064853 1070488 1069476 1047887 1099960 1118495 1090408 1105155
8896A105155L0645q059J3418L680j0524m938L4786Q121K1898k947j279J6129L7467
$$ 1105155 1135800 1127741 1141159 1144839 1134315 1129377 1164163 1172284 1194182 1191235 1189956 1206085 1243552
8883A243552K9838k0522l225r776j6459n723L850L579K1839L7196Q186o764k5073
$$ 1243552 1273390 1252868 1249643 1239867 1223408 1217685 1221535 1225114 1246953 1284149 1292335 1285571 1260498
8870A260498K242K6101O802K5035K9978L583J4755j4649j191L107K9920J6415
$$ 1260498 1262740 1288841 1295643 1320678 1350656 1354239 1368994 1354345 1353154 1356261 1386181 1402596
8858A402596n478j2594l512j351M479K9762K8677N573R338N892m129J7338O033
$$ 1402596 1397118 1384524 1381012 1379661 1384140 1413902 1442579 1448152 1457490 1463382 1459253 1476591 1482624
8845A482624K908j1571J5847K8400R321j3006J1021K3409Q143q949N300K3109
$$ 1482624 1485532 1473961 1489808 1518208 1527529 1514523 1525544 1548953 1557096 1548147 1553447 1576556
8833A576556M4598L6155p677Q517k721J6514J007j2014J0995K6291K8443R55J202
$$ 1576556 1621154 1657309 1649632 1658149 1655428 1671942 1672949 1660935 1671930 1698221 1726664 1727619 1728821
8820A728821l3414J8818K9762L028J8540J5212j7593R165K4258J5982j3142j2966
$$ 1728821 1695407 1714225 1743987 1747015 1765555 1780767 1763174 1772339 1796597 1812579 1799437 1786471
8808A786471L19L4238M2141J6125K7501J2441j1184L4521L4930J3148Q111K0483
$$ 1786471 1786790 1821028 1863169 1879294 1906795 1919236 1908052 1942573 1977503 1990651 1998762 2019245
8796B019245K6307l50k0852K039J3528J9224N186K7197L2479K2051L5686J5953
$$ 2019245 2045552 2045202 2024350 2026389 2039917 2059141 2064327 2091524 2124003 2146054 2181740 2197693
8784B197693J83N801K4257J9300L153J4328L0744K968j0210j5054K8730L6297
$$ 2197693 2197876 2203677 2227934 2247234 2250387 2264715 2295459 2298427 2288217 2273163 2301893 2338190
8772B338190M3932M214n303L250K9036K8647J3641r059k0868L2619J7126L7374
$$ 2338190 2382122 2386336 2381033 2384283 2413319 2441966 2455607 2446548 2425680 2458299 2475425 2512799
8760B512799K9227j1429K2055J9582J3516k772j2653N0929K8326N3330K9203j8018
$$ 2512799 2542026 2530597 2552652 2572234 2585750 2582978 2570325 2621254 2649580 2702910 2732113 2714095
8748B714095J0504L4701Q213M320l0394j7080L3343L6807L7629Q892l112L3868
$$ 2714095 2724599 2759300 2767513 2771833 2741439 2724359 2757702 2794509 2832138 2841030 2837918 2871786
8736B871786K9215J6697K0046j1063K2890L0493K9300L0939J355J6568K5521L716
$$ 2871786 2901001 2917698 2937744 2926681 2949571 2980064 3009364 3040303 3041658 3058226 3083747 3087463
8724C087463K6748J2462O389q743k85J3372N092K5304M8888L5566Q658N470r938
$$ 3087463 3114211 3126673 3133062 3124319 3124034 3137406 3142498 3167802 3216690 3252256 3260914 3266384 3256446
8711C256446J003K3081L8606O638m102J5688P116j0467J0267K47j4829K958K1138
$$ 3256446 3257449 3280530 3319136 3325774 3321672 3337360 3344476 3334009 3344276 3344523 3329694 3332652 3353790
8698C353790L5054K0819R707K5877O360j039K4533O899M41Q616R256P709J3756
$$ 3353790 3388844 3409663 3419370 3445247 3451607 3450568 3475101 3482000 3482441 3491057 3500313 3508022 3521778
8685C521778j3798Q109J3885K1705M735J5735m654p622J6082M818o010O612K1350
$$ 3521778 3507980 3516089 3529974 3551679 3556414 3572149 3567495 3559873 3575955 3580773 3574763 3581375 3602725
8672C602725J4955K8073j6008k6028j4937r23M463k5470P071M2506O9j0481j5374
$$ 3602725 3617680 3645753 3629745 3603717 3588780 3587857 3592320 3566850 3573921 3616427 3616496 3606015 3590641
8659C590641N2q932o074j155k134O876j7171j558R895R714n765k4037o092R608
$$ 3590641 3590693 3581761 3575687 3574532 3572398 3579274 3562103 3560545 3570440 3580154 3574389 3550352 3544260 3553868
8645C553868m879j19j0857R085P360J7246k714k2945k8252j3614l9513n73J6806
$$ 3553868 3548989 3548870 3538013 3547098 3554458 3571704 3568990 3546045 3517793 3504179 3464666 3464093 3480899
8632C480899K49k5222p245k1140j4979m569j7011j8576q558O920J721j1244k5790
$$ 3480899 3481148 3455926 3448681 3427541 3412562 3407993 3390982 3372406 3363848 3370768 3372489 3361245 3335455
8619C335455k6969P622q631k8648l0509j6310j9488q062p079J4670l726k0771
$$ 3335455 3308486 3316108 3307477 3278829 3248320 3232010 3212522 3204460 3197381 3212051 3208325 3187554
8607C187554j8187J1786N498l7049k3629j0255j3559j0686R369r281l9929j8449
$$ 3187554 3169367 3181153 3186651 3149602 3125973 3115718 3102159 3091473 3100842 3091561 3051632 3033183
8595C033183k4479j8092j7204q63j0047j5919M325n036p312k8174p5766n0083
$$ 3033183 3008704 2990612 2973408 2972545 2962498 2946579 2950904 2945868 2938556 2910382 2834616 2784533
8583B784533j5222k5194k1494m3090j6180k6384j1768K0267m2888k9785k8602
$$ 2784533 2769311 2744117 2722623 2679533 2663353 2636969 2625201 2645468 2602580 2572795 2544193
8572B544193M640p07m222q324k024m0102m729j8511j2283k0863l8563j7180l3811
$$ 2544193 2548833 2548126 2543904 2535580 2533556 2493454 2488725 2470214 2457931 2437068 2398505 2381325 2347514
8559B347514j9834j6109j4436o47j6370l2585r139O875j0301j4745m2839j9564
$$ 2347514 2327680 2311571 2297135 2296488 2280118 2247533 2238394 2245269 2234968 2220223 2177384 2157820
8547B157820j0199p376m9199j8507N286L551j0656k9616j5344j856p050k3511
$$ 2157820 2147621 2140245 2091046 2072539 2077825 2081376 2070720 2041104 2025760 2023904 2016854 1993343
8535A993343k3586q432j4368k5843k7183k5187j3101q036k3971k2104j8584N682
$$ 1993343 1969757 1961325 1946957 1921114 1893931 1868744 1855643 1847607 1823636 1801532 1782948 1788630
8523A788630j248P272j3737o528j2157j8687O811j9589n678j9200j6766R522o718
$$ 1788630 1787382 1794654 1780917 1774389 1762232 1743545 1750356 1730767 1725089 1705889 1689123 1698645 1691927
8510A691927k4027l0796l9516k5697j3772j3696K667J7590q458o553j4531k2970
$$ 1691927 1667900 1637104 1597588 1571891 1558119 1544423 1547090 1564680 1556222 1549669 1535138 1512168
8498A512168k1446J9919J5142j1952p808k5714n014p497N74m7214m1832p866j1039
$$ 1512168 1490722 1510641 1525783 1513831 1506023 1480309 1475295 1467798 1468372 1421158 1379326 1371460 1360421
8485A360421j8616N106k2140j6064r667j7415Q692J7170j3116k1773J1780j0986
$$ 1360421 1341805 1346911 1324771 1308707 1299040 1281625 1290317 1307487 1294371 1272598 1284378 1273392
8473A273392O626K0735j2478j1797o371k8826l4426k5029l870j1715k1275j737
$$ 1273392 1280018 1300753 1288275 1276478 1270107 1241281 1206855 1181826 1177956 1166241 1144966 1143229
8461A143229J4078j145k3306O897M535k5509m2248m361J3545J895k5122j0502
$$ 1143229 1157307 1156162 1132856 1139753 1144288 1118779 1076531 1072170 1085715 1087610 1062488 1051986
8449A051986N384j8879k1370q741N971J4364k187k367j6736R59o897k4816l2474
$$ 1051986 1057370 1038491 1017121 1008380 1014351 1028715 1026528 1024161 1007425 1008384 1001487 976671 944197
8436I44197j044j2345p409J2911j0886j4695J235M249Q25K2798o094k6672P690
$$ 944197 943153 930808 923399 936310 925424 910729 911964 916213 917038 939836 933742 907070 914760
8423I14760l134j4719N474K216j0294k279j6747l456l645j764k3776l0870J6666
$$ 914760 911626 896907 902381 904597 894303 892024 875277 871821 868176 866412 842636 811766 828432
8410H28432K7279j6954r936k6296q041K3721j6638l5738J3409o242J9196J4567
$$ 828432 855711 838757 828821 802525 794484 818205 801567 765829 779238 772996 792192 806759
8398H06759O804o113j3054j4617r026n925j2712l3347l197J8946o829J7854p682
$$ 806759 813563 807450 794396 779779 770753 764828 752116 718769 715572 734518 727689 745543 737861
8385G37861j3133k0849k0052J0627r963M307M8734q93k3650l4227j1845P203o148
$$ 737861 724728 703879 683827 694454 684491 688798 737532 736639 712989 678762 666917 674120 667972
8372F67972O787L709N586J74k7627m2311R782J3403r11P461r05l7739P333j4704
$$ 667972 674759 678468 684054 684228 656601 614290 624072 637475 636564 644025 643120 605381 612714 598010
8358E98010j4696M937J616L271K339L0417L4628k4528n6476k0488R679P246Q740
$$ 598010 583314 588251 589867 593138 595477 625894 660522 635994 579518 559030 568709 575955 584695
8345E84695L861l836R430j1282k3940q682n272j520k097q365J0451j4434k1134
$$ 584695 588556 584720 594150 582868 558928 550246 544974 543454 541357 532992 543443 529009 507875
8332E07875Q721p902J8840j653k7314j5900J3012l8610R043N790J0938J4137j170
$$ 507875 516596 508694 527534 525881 498567 482667 495679 457069 466112 471902 482840 496977 495807
8319D95807r177j3814k5382j4934N153K78r718K1393J8732K323k1605l4291L5
$$ 495807 486630 472816 447434 432500 437653 437931 428213 449606 468338 470661 449056 414765 414800
8306D14800N445J889M903r673l002K993R837j010k2996k6205j359L8540M0479
$$ 414800 420245 422134 427037 417364 414362 417355 427192 426182 403186 376981 375622 414162 454641
8293D54641J6130k5556k3276r870P263J1673J683o343k7368m193K9973j1622o62
$$ 454641 470771 445215 421939 412069 419332 431005 432688 426345 398977 394784 424757 413135 412473
8280D12473K972k9570K684K8375M621j3401k7378L5243J7851k5524m596l489j7206
$$ 412473 415445 385875 388559 416934 421555 408154 380776 416019 433870 408346 403750 400261 383055
8267C83055Q164J5179j8150K840P345j1301j4774k944j1406q647J7700J0944J1806
$$ 383055 391219 406398 388248 391088 398433 387132 372358 369414 358008 349361 367061 378005 389811
8254C89811k3431j0419K1093k5355j9814K5421K6687k6757j8543k0351k2685o045
$$ 389811 366380 355961 377054 351699 331885 357306 383993 357236 338693 318342 295657 289612
8242B89612J4506P567Q339L0096J1662J2987k7755k7610k7877o935L6704j281
$$ 289612 304118 311685 320024 350120 361782 374769 347014 319404 291527 284592 321296 320015
8230C20015j5424j4741L97j0173j602L451J5732N985N113J6582R584O125n786
$$ 320015 304591 289850 290247 280074 278472 281923 297655 303640 308753 325335 334919 341044 335258
8217C35258l381j2904L879j1173j0838l2967j6346J6594o442j0623R266l260K501
$$ 335258 331877 318973 322852 311679 300841 267874 251528 268122 261680 251057 260323 257063 259564
8204B59564J3685k682J2589j4371k675j1309p950J0043o706j3736J6615K2759
$$ 259564 273249 270567 283156 268785 266110 254801 246851 256894 250188 236452 253067 275826
8192B75826j0300J9905J6904q421J4464j8069N586J6559P223r928j5620O679k353
$$ 275826 265526 285431 302335 293914 308378 290309 295895 312454 319677 309749 294129 300808 298455
8179B98455k0785k8659k528K5224m735j8076j0102K3821K3464j3943l8486J3044
$$ 298455 277670 249011 246483 271707 266972 248896 238794 262615 286079 272136 233650 246694
8167B46694J8942k824L635j4723j948j4080m508J0030j4245j5712L831M955Q973
$$ 246694 265636 262812 266447 251724 249776 235696 231188 241218 226973 211261 215092 220047 229020
8154B29020K5623l4096j8154Q522J2633j839k1255j1641J505J5196K7334k4037
$$ 229020 254643 220547 202393 210915 223548 221709 200454 188813 190318 205514 232848 208811
8142B08811r766K1454O546k6553j827K0462K5863p771q231j7097J559M004O531
$$ 208811 199045 220499 227045 200492 198665 219127 244990 237219 228988 211891 213450 217454 223985
8129B23985J3895q151k660O059P802j2836k670R72O581P795l6295k5241O656L2064
$$ 223985 237880 229729 227069 233128 240930 228094 225424 226396 232977 240772 204477 179236 185892 217956
8115B17956q620k0757j3160J782L68l4859n364K2592m9R933l005K131m307J0120
$$ 217956 209336 188579 175419 177201 177569 142710 137346 159938 159889 169822 166817 168948 164641 174761
8101A74761K1933l902J003J0898j8396M166J2148p500J303J657k3857j0821M0234
$$ 174761 196694 192792 193795 204693 186297 190463 202611 195111 196414 198071 174214 163393 203627
8088B03627K1235j4097o156o527n691j2409J692J074J2220q010L637j0694j1339
$$ 203627 224862 210765 204609 198082 192391 179982 181674 182748 194968 186958 190595 179901 168562
8075A68562p959o940j6882j2285j8202N427L3151J5432j7063l570Q8J2089R094
$$ 168562 160603 153663 136781 124496 106294 111721 144872 160304 143241 139671 139759 151848 160942
8062A60942l1751j1273K6913L5824k249l3385k3299p693N268J2609J0417k812
$$ 160942 129191 117918 144831 180655 178406 145021 121722 114029 119297 131906 142323 139511
8050A39511k412J4593J8412k3953l9556J8238J2369J4869J5926l170j3432j0950
$$ 139511 137099 151692 170104 146151 106595 124833 137202 152071 167997 164827 151395 140445
8038A40445k3347J1057K1714L6302R206o531J0995K119k2508q118J293n141j216
$$ 140445 117098 128155 149869 186171 195377 188846 199841 201960 179452 171334 172627 167486 166270
8025A66270k0774P84J8565J4022J2289j3608n326L904K3423j2411m3834R657j2086
$$ 166270 145496 146280 164845 178867 191156 177548 172222 176126 199549 187138 143304 152961 140875
8012A40875J445j8280J1552J9571K254j9895J6184l994j0798K330K0960K6060
$$ 140875 142320 124040 135592 155163 157417 137522 153706 149712 138914 141244 162204 188264
8000A88264J9580j194k8473k245J0503M590j145j5023j4447K0048j7201l9763
$$ 188264 207844 206650 178177 175932 186435 191025 189880 174857 160410 180458 163257 123494
7988A23494K768K2257P826l641K1513J9368l4456J936M529J7876l934r260l217
$$ 123494 126262 148519 156345 152704 174217 193585 159129 161065 165594 183470 179536 170276 167059
7975A67059K712j0135k1888m455K576k6791j4341P512K5587J0754J2284K4022
$$ 167059 169771 159636 137748 133293 135869 109078 94737 102249 127836 138590 150874 174896
7963A74896k778l1535k785j2256J1838K1533j7141j8381J3867K4945K2435j2398
$$ 174896 172118 140583 137798 125542 137380 158913 141772 123391 137258 162203 184638 172240
7951A72240k4130k2817j3838K4814j6984k3608R461J5521J2826R070J3252m079
$$ 172240 148110 125293 111455 136269 119285 95677 105138 120659 133485 142555 155807 151728
7939A51728j1401j3166L0902J57k4470J348J1839r312j2207m181N758J050j4825
$$ 151728 140327 127161 158063 158220 133750 135098 146937 137625 125418 121237 126995 128045 113220
7926A13220j6557Q788J3347p673K473j0508L1533k4755j9721L5831K1544l7861
$$ 113220 96663 105451 118798 111125 113598 103090 134623 109868 90147 125978 147522 109661
7914A09661j3166j478J4033K8676J1268k6774k4p24q209J5996j0591j7378J3734
$$ 109661 96495 95017 109050 137726 148994 122220 122196 121472 113263 129259 118668 101290 115024
7901A15024l573j0893N316K0743N668j2100m144J5022l87k2660m597J0800j3334
$$ 115024 111451 100558 105874 126617 132285 120185 116041 131063 130676 108016 103419 114219 100885
7888A00885j7930J945J4983J346L3099J3085p030K0739J5519l9702k0972J2321
$$ 100885 82955 84900 99883 101229 134328 147413 140383 161122 176641 136939 115967 128288
7876A28288o796k534J0321K823j3075L515m87L305j713n414p209J66J5311k0384
$$ 128288 121492 118958 129279 132102 119027 122542 122055 125360 123647 118233 111024 111190 126501 106117
7862A06117j1036J4938M363J021J5757m192l837Q544q228n2258k8944R466K2706
$$ 106117 95081 110019 114382 115403 131160 126968 123131 131675 123447 71189 42245 51711 74417
7849G4417n393q575q42m336k4080M197P314K1408K3748j4089N882k080k5327l094
$$ 74417 69024 60449 59607 55271 31191 35388 42702 64110 87858 73769 79651 77571 52244 49150
7835D9150K2951J6038J856Q729P692J0279m807o781j8635j1691m958j1255j5085
$$ 49150 72101 88139 89995 98724 106416 116695 111888 105107 86472 74781 69823 58568 43483
7822D3483J299K3460J8271R130m098p058P738J7248l977j7273j6082l871j136
$$ 43483 44782 68242 86513 95643 91545 84487 92225 109473 105496 88223 72141 68270 67134
7809F7134K5635j2473k9356n371P848j7301K023J6133J1252J848j135Q867J1703
$$ 67134 92769 80296 50940 45569 53417 36116 38139 54272 65524 67372 66237 75104 86807
7796H6807M749o886j821R287k2648j2596L976L5174J1958O045k6410J445K3195
$$ 86807 91556 84670 82849 92136 69488 56892 60868 96042 108000 114045 87635 89080 112275
7783A12275J4196P291k8372K956m317k8264j6276J4066J8783q015K705J2539m583
$$ 112275 126471 133762 105390 108346 104029 75765 59489 73555 92338 84323 87028 99567 94984
7770I4984j2120k8462J2832M576m0946L18K1913J3490J1256j0709L1418j7975
$$ 94984 82864 54402 67234 71810 30864 31182 53095 66585 77841 67132 98550 80575
7758H0575l9085k741o67J0147J0778K2040p061j6059j517L338J3734o56P601K5889
$$ 80575 41490 38749 38082 48229 59007 81047 73986 57927 56410 59748 73482 72826 80427 106316
7744A06316J1175r994k2828J7748P927p475L884k0848j4406J2121K3748l855k0721
$$ 106316 117491 107497 84669 102417 110344 102869 106753 85905 71499 83620 107368 103513 82792
7731H2792l7517J6091J2243l1380J6821L4086m263J6595k4356m3477P34L5165
$$ 82792 45275 61366 73609 42229 59050 93136 88873 105468 81112 37635 38369 73534
7719G3534K233k1358P963K7823K7427j4433l6363O311K738j3773r103K0439l395
$$ 73534 75767 54409 62372 90195 117622 103189 66826 73137 75875 62102 52999 73438 70043
7706G0043J7639o203l2289j4135q749J169K3766J5832K0182J45K243J6431j8480
$$ 70043 87682 81479 49190 35055 26306 27475 51241 67073 87255 87400 89643 106074 87594
7693H7594l928n572j7467j4416K599J7198P501l0798K790J1780K1034K0557J293
$$ 87594 83666 78094 60627 46211 48810 66008 73509 42711 45501 57281 78315 98872 100165
7680A00165m844j6331m568k5329l588N189k994q189Q052K421J2158k3495k9238
$$ 100165 95321 78990 74422 49093 45505 50694 47700 39511 47563 49984 62142 38647 9409
7667I409K1235J2272Q839j3937n212k788K265M104J2360m166L380O873J0634m243
$$ 9409 30644 42916 51755 37818 32606 29818 32083 36187 48547 44381 47761 54634 65268 61025
7653F1025K561K045p12k0066J1112M805R928j0096j7893j6241k0198M057J3017
$$ 61025 63586 65631 64919 44853 55965 60770 70698 60602 42709 26468 6270 10327 23344
7640B3344K4817K878j3087n592k0694m646K0790J6082J1629L564j0251k128O557
$$ 23344 48161 51039 37952 32360 11666 7020 27810 43892 55521 59085 48834 46706 53263
7627E3263J5101L335j741l002j0572l3189r285K5447j1371k6790K3542P223J620
$$ 53263 68364 71699 69958 66956 56384 23195 13910 39357 27986 1196 24738 31961 33581
7614C3581L245K0795o309k1869k839J58j8942j4293J8999J0539L605P941R680
$$ 33581 36826 57621 51312 29443 26604 26762 7820 -6473 12526 23065 26670 34611 44291
7601D4291k974j9042J5808K3019j956j8928k8885L6396K0233k320r757K883J9386
$$ 44291 41317 22275 38083 61102 59146 40218 11333 47729 67962 65642 55885 58768 78154
7588G8154q127n648J6479j6758l1420k42j0128R051P690L527j6800k8189n3L000
$$ 78154 70027 64379 80858 64100 32680 32438 22310 31361 39051 42578 25778 -2411 -2464 536
7574E36r890p032J5406K0783J595J5441K960m638M963J663p380l425M094j0498
$$ 536 -9354 -16386 -980 19803 21398 36839 39799 35161 40124 41787 34407 30982 35076 24578
7560B4578L175j723J8796K5698J4642l1800o488q627J0592l454J0461o126J1502
$$ 24578 27753 26030 44826 70524 85166 53366 46878 38251 48843 45389 55850 49724 61226
7547F1226j9279k7262j1068J710O433L9158L3712j936P062j4326k1763j1407J1603
$$ 61226 41947 14685 3617 5327 11760 50918 84630 82694 89756 75430 53667 42260 53863
7534E3863O173m781l247N814j0069j4467j2749j3466P311J229L0717L1913R174
$$ 53863 60036 55255 52008 57822 47753 33286 20537 7071 14382 15611 46328 78241 87415
7521H7415q955l136m433n229l4019k9754l287K2422o43r46o748P626q57j8457
$$ 87415 78460 75324 70891 65662 31643 1889 -1398 21024 20381 19435 12687 20313 19456 999
7507I99J6202K2318k0130j3795k867j8K8851K2390J871N806k964j4042n149j1772
$$ 999 17201 39519 19389 5594 2727 2709 31560 53950 55821 61627 58663 44621 39472 27700
7493B7700k3599j9977Q347R772Q66Q46J0902K6750K1845k1504k2632O358R016
$$ 27700 4101 -15876 -7529 2243 3109 3955 14857 41607 63452 41948 19316 25674 34690
7480C4690O687M424j8767J864J5753Q730l0151j5266k282K3110K4488J0895p481
$$ 34690 41377 45801 27034 28898 44651 53381 23230 7964 5682 28792 53280 64175 56694
7467E6694k6800q760l819K4268n120r437J7308P557j1147m2125K263M3555J5417
$$ 56694 29894 21134 17315 41583 36463 27026 44334 51891 40744 -1381 882 44437 59854
7454E9854k5853j1686L442j7860j3408R338m467j969k126L06M3311L1792k4453
$$ 59854 34001 22315 25757 7897 -5511 3827 -640 -2609 -4735 -4429 38882 70674 46221
7441D6221q744M193l8442j2376K7968p468j1206K3570J6060r999j1532m179M786
$$ 46221 37477 41670 3228 -9148 18820 11352 146 23716 39776 29777 18245 14066 18852
7428A8852j6648k3828K400J2817J5932K2008O040q943j0161j803O611j4043K5044
$$ 18852 2204 -21624 -19224 -6407 9525 31533 37573 28630 18469 16666 23277 9234 34278
7415C4278K0007j8954P956r74P239j8871K392R10J263j0874j1610r045M60J6647
$$ 34278 54285 35331 43287 42313 49552 30681 33073 33983 35246 24372 12762 3717 4177 20824
7401B0824M905j555R21j1864k197K3624P487n777M0790K8321m535j1786k6056
$$ 20824 25729 24174 25095 13231 11034 34658 42145 36368 77158 105479 100944 89158 63102
7388F3102p483j8156J1634l469q812K9197R834k8541r951J3482K464k893j5732
$$ 63102 55619 37463 49097 45628 36816 66013 75847 47306 37355 50837 53301 50408 34676
7375C4676j3377K1609O096k5644j7136j2488l2594p872j402n43K1616L8595N50
$$ 34676 21299 42908 49004 23360 6224 -6264 -38858 -46730 -48132 -48675 -27059 11536 12086
7362A2086j1778J2638J1871N818k289P689K9927K6971o9j7848J3126l0066j5799
$$ 12086 308 12946 24817 30635 28346 36035 65962 92933 92864 75016 88142 58076 42277
7349D2277p592j8064r842K7289K7814L081J4291J6486J1661j1202m1394j8195
$$ 42277 34685 16621 6779 34068 61882 64963 79254 95740 107401 96199 54805 36610
7337C6610N206j0618N114J830p05l7896l7112J8258K9885n993m760J3150L2884
$$ 36610 41816 31198 36312 38142 37437 -459 -37571 -19313 10572 4579 -181 12969 45853
7324D5853j6145o464k747O160k2317j1182o12J0526J1063N157O601J7453J6392
$$ 45853 29708 23244 20497 26657 4340 -6842 -7454 3072 14135 19292 25893 43346 59738
7311E9738k458p294k383J0364J0571l364L157P03j0116j5751k2565m796J889J1325
$$ 59738 57280 49986 47603 57967 68538 65174 68331 69034 58918 43167 20602 15806 17695 29020
7297B9020J0644P773l817m1989q910o267Q39J7008K6748O241k9376J561N950M0698
$$ 29020 39664 47437 43620 1631 -7279 -13546 -12707 4301 31049 37290 7914 9475 15425 56123
7283E6123J2250k083O297J7763k8351j6158K2302k1144k4467j0461P952l2193
$$ 56123 68373 66290 72587 90350 61999 45841 68143 46999 22532 12071 20023 -12170
7271a2170J6070K4960r041K202R927k5444j1069J1707O604n00m816q216j561R64
$$ -12170 3900 28860 19819 22021 31948 6504 -4565 7142 13746 13246 8430 214 -1347 -383
7257c83J6810K832n593n109n926J7526L6142k6708j4044j0366n696R532K7040
$$ -383 16427 19259 13666 8557 2631 20157 56299 29591 15547 5181 -515 9017 36057
7244C6057N580k4935R569L605O720j3990L475K1755K570m24L0472q878l3398j1640
$$ 36057 41637 16702 26271 29876 36596 22606 26081 47836 50406 49982 80454 71576 38178 26538
7230B6538j4508k8036j0069J7749J5214L622r769j400K2524P1K8483m729k7527
$$ 26538 12030 -16006 -26075 -8326 6888 10510 741 -659 21865 21936 50419 45690 18163
7217A8163p842O143k054r466M967J5192K1831k7981N179J7093J4925m051m354
$$ 18163 10321 16464 14410 4944 9911 25103 46934 18953 24132 41225 56150 52099 47745
7204D7745r059r95j3381L084q455k95L213j6930L8J5008J3343j5640l7032K2871
$$ 47745 38686 37691 24310 27394 18939 18644 21857 4927 4965 19973 33316 17676 -19356 3515
7190C515r924J1047L803k4826L124M0591j3178j4318J352J0917j6170K6570L3163
$$ 3515 -6409 4638 8441 -16385 -13261 27330 14152 -166 1186 12103 -4067 22503 55666
7177E5666K2942k2917l2561l1707J1904J6843L331J319K937P322J1635n38k4281
$$ 55666 78608 55691 23130 -8577 3327 20170 23501 24820 27757 35079 46714 46176 21895
7164B1895N205m675j5127Q266N541j6262j3085L397O321m794J5819J4891M520
$$ 21895 27100 22425 7298 15564 21105 4843 -8242 -4845 1476 -3318 12501 27392 31912
7151C1912J9813m007r214j4393j8143L573K0025P517j0984l385M584j662l063
$$ 31912 51725 47718 38504 24111 5968 9541 29566 37083 26099 22714 27298 25636 22573
7138B2573j3317k5544j6009J8369N598J4786l393K504N424N316K1915J5559r794
$$ 22573 9256 -16288 -32297 -13928 -8330 6456 3063 5567 10991 16307 38222 53781 43987
7125D3987k0539j0609k4087J0466Q74p461m761j0924m825J1614J4226m187j7145
$$ 43987 23448 12839 -11248 -782 92 -7369 -12130 -23054 -27879 -16265 -2039 -6226 -23371
7112b3371j1067J0412J1261J0018j062O655n432m925N372l0842N012K0407K0952
$$ -23371 -34438 -24026 -12765 -2747 -3809 2846 -2586 -7511 -2139 -32981 -27969 -7562 13390
7099A3390O125j1876k3170L002J0390N422r925L944J9027J4420j1716L477R544
$$ 13390 19515 7639 -15531 -12529 -2139 3283 -6642 -2698 16329 30749 19033 22510 32054
7086C2054L1899J0804p484k0666k4802J5139j517m396J634J2781j8463l040J3872
$$ 32054 63953 74757 67273 46607 21805 36944 35427 31031 32665 45446 26983 23943 37815
7073C7815J9584N660j8038l335o348k0403k4413m430L4288K8003k8321k646k054
$$ 37815 57399 63059 45021 41686 35338 14935 -9478 -13908 20380 48383 20062 17416 15362
7060A5362j396J3950K0768j8903j6329r841J654j5170r815K3955M1757J9173N155
$$ 15362 13966 27916 48684 29781 13452 3611 5265 -9905 -19720 4235 45992 65165 70320
7047G0320K8771j9833m4094l0551N714M081p963M489K536n629J3039j3780o364
$$ 70320 99091 79258 35164 4613 10327 14408 6445 10934 13470 7841 20880 7100 736
7034G36j0205M536O091L21K4184J8152j6593J0620K1046r139m560J2414j5715
$$ 736 -9469 -4933 1158 1479 25663 43815 27222 37842 58888 49749 45189 57603 41888
7021D1888J4325m755l4154l623M496k005j1772Q808l340r998m709L699J5382J8212
$$ 41888 56213 51458 17304 13681 18177 16172 4400 13208 9868 -130 -4839 -1140 14242 32454
7007C2454l008j2240j6950p795q085R768K4659J6604j6675l9246J3919j2759J933
$$ 32454 29446 17206 256 -7539 -15624 -5856 18803 35407 18732 -20514 -6595 -19354 -17421
6994a7421K5264j2404l545K8233J6963J4940p779k6712r40Q823M676j1306r234
$$ -17421 7843 -4561 -8106 20127 37090 52030 44251 17539 16599 25422 30098 18792 9558
6981I558j2111q01J5334L413k6498k100k7378J488K6328P002J3478J2582o260
$$ 9558 -2553 -3354 11980 15393 -11105 -13205 -40583 -39095 -12767 -5765 7713 20295 14035
6968A4035J349j7878J7643J3851j2496k057N284J9252j7519J346M220J69j8120
$$ 14035 15384 -2494 15149 29000 16504 14447 19731 38983 21464 22810 27030 27199 9079
6955I079k0678p707m445J0363o257k5275q645J7699L3151l1418o753L2832L0971
$$ 9079 -11599 -19306 -23751 -13388 -19645 -44920 -53565 -35866 -2715 -34133 -40886 -8054 22917
6942B2917L0741j6583j9795o823J4536K3915k636q131n767j4618j1718p157J6531
$$ 22917 53658 37075 17280 10457 24993 48908 46272 38141 32374 17756 6038 -1119 15412
6929A5412J8444m4770R385Q273l957M41J3291j1582j9992K5474J2505k2622R055
$$ 15412 33856 -10914 -1529 6744 2787 3228 16519 4937 -15055 10419 22924 302 9357
6916I357L9087j0279j3093j909j9751l4163m453K2664J1571J8213J5462k378j0372
$$ 9357 48444 38165 25072 23163 3412 -30751 -35204 -12540 -969 17244 32706 30328 19956
6903A9956p765j3138L369K003K3570O715L012J2203k8230k4575j449J1624l243
$$ 19956 12191 -947 2422 4425 27995 34710 37722 49925 21695 -2880 -4329 7295 4052
6890D052N224p958o661O423J9817L799l618k0399j0079L2560M187k798p247k1356
$$ 4052 9276 1318 -5343 1080 20897 24696 21078 679 -9400 23160 27347 24549 17302 -4054
6876d054O632P070K234j60K0652k7699M14r309P205j990k786m749O34J7182J0573
$$ -4054 2578 9648 11882 11722 32374 4675 5089 -4220 2985 995 -1791 -6540 -5906 11276 21849
6861B1849R456J6186j5930l022J2093Q826l885l9429k3912J4868j9320j8634R612
$$ 21849 31305 47491 31561 28539 40632 49458 45573 6144 -17768 -2900 -22220 -40854 -31242
6848c1242L6698K7376k1241j1295J9059J1743l0411k7278P798o330p106L895M331
$$ -31242 5456 32832 11591 296 19355 31098 687 -26591 -18793 -25123 -32229 -28334 -24003
6835b4003J8115J0446j637J1016L0974Q686k0816j7387K6760L2510k5032k536
$$ -24003 -5888 4558 2921 13937 44911 53597 32781 15394 42154 74664 49632 47096
6823D7096m0450J409J479J8366j0368j5628J85m703J5453J6490n052j1899j7755
$$ 47096 6646 8055 9534 27900 17532 1904 2089 -2614 12839 29329 24277 12378 -5377
6810e377j8744J2294K4246N4798o006j2587k1918j1675r183J3937j0348p348L6646
$$ -5377 -24121 -11827 12419 67217 61211 48624 26706 15031 5848 19785 9437 2089 38735
6797C8735L1831j0717k8046l0722k4108p353K0K5962m18Q703L550K14o74J0133
$$ 38735 70566 59849 31803 1081 -23027 -30380 -30360 -4398 -4816 3887 7437 7651 6977 17110
6783A7110r029j004R515l529l3021j6327K1613K574J0617j7q797k1765j8850L6099
$$ 17110 8081 7077 16592 13063 -19958 -36285 -14672 -12098 -1481 -1498 -10295 -32060 -50910 -14811
6769a4811L7965K7004q417k4413j6065L618n153r47K2026q221J3478p323K0883
$$ -14811 23154 50158 41741 17328 1263 4881 -272 -1219 20807 12586 26064 18741 39624
6756C9624K7722J175J6583r470l1990p539o167L5593K1622r972l6262q702L4318
$$ 39624 67346 68521 85104 75634 43644 36105 29938 65531 87153 77181 40919 32217 66535
6743F6535K4052J385J1933k4336J123l681j1370j9649k3619j2995m620L9219L1211
$$ 66535 90587 91972 103905 79569 80692 77011 65641 45992 22373 9378 4758 43977 75188
6730G5188j0420J2330M1835l16N1276Q6588R9722J41409J35373P8770p5616j35377
$$ 75188 64768 77098 118933 118617 169893 256481 356203 497612 632985 711755 636139 500762
6718E00762j43321j00115n9035o6390m5464k3559j7566j7483o022R310L074K4898
$$ 500762 357441 257326 198291 131901 86437 62878 45312 27829 21807 31117 34191 59089
6706E9089L1746j3209k6767k7644k2948O883J5707J6249K5588M228j4868k5190
$$ 59089 90835 77626 50859 23215 267 7150 22857 39106 64694 68922 54054 28864
6694B8864j468O491q827j5731l239k198l671J6125J4327o299J2662J4341K656
$$ 28864 27396 33887 25060 9329 6090 3892 221 16346 30673 24374 37036 51377 54033
6681E4033K6958M91k6010k4256j5512n874R958L378j0553l671Q780k1408J3018
$$ 54033 80991 81482 55472 31216 15704 9830 19788 23166 12613 8942 17722 -3686 9332
6668I332M5421J7238j5366K190L076k5583k3670n075J2275J1685P436P341J5937
$$ 9332 54753 71991 56625 58815 61891 36308 12638 7563 19838 31523 38959 46300 62237
6655F2237j6016m1581M040K6065p182j2574K0174p502l4287R897J8468k0637l207
$$ 62237 46221 4640 8680 34745 27563 14989 35163 27661 -6626 3271 21739 1102 -2105
6642b105Q790k44j5378k1527j3446k2490r907M0508K2878k8855K8654M6617j2516
$$ -2105 6685 6441 -8937 -30464 -43910 -66400 -76307 -35799 -12921 -41776 -13122 33495 20979
6629B0979q114j4919j4201r850j7597k637J3737R833J6885j0645K998L0768k7468
$$ 20979 12865 -2054 -16255 -26105 -43702 -46339 -32602 -22769 -5884 -16529 -13531 17237 -10231
6616a0231k2086k863J7011J0997L647K0061K2719J8442J0189K108k9481q681P086
$$ -10231 -32317 -35180 -18169 -7172 -3525 16536 39255 57697 67886 69994 40513 31832 38918
6603C8918q231j7004j9097K6748K6461l7707k9477l896J051J1135J6507K1622
$$ 38918 30687 13683 -5414 21334 47795 10088 -19389 -23285 -22234 -11099 5408 27030
6591B7030j3045k0114K73K0822q168K0875J9883k0010K799J1647o994L170j5054
$$ 27030 13985 -6129 -5856 14966 6798 27673 47556 27546 30345 41992 34998 38168 23114
6578B3114l417n069l581k2414k040K7167M305k6909k6815J3367K1993J012J206
$$ 23114 19697 14628 11047 -11367 -13407 13760 18065 -8844 -35659 -22292 -299 713 1919
6565A919J1411l316k2540j4276J3105R907J039j1579k4605j1657J8755Q972P438
$$ 1919 13330 10014 -12526 -26802 -13697 -3790 -2751 -14330 -38935 -50592 -31837 -22865 -15427
6552a5427R988j0125m831J5133L927p050Q345K3552j8517m4769j6925N248K1875
$$ -15427 -5439 -15564 -20395 -5262 -1335 -8385 -40 23512 4995 -39774 -56699 -51451 -29576
6539b9576P985K2783R123j2974o226m171J3831r491q468k690P221J8536k3992
$$ -29576 -21591 1192 10315 -2659 -8885 -13056 775 -8716 -17184 -19874 -12653 5883 -18109
6526a8109M613O571j1543p655J3743J5035M842J1286K5180O957k0814j5038l7354
$$ -18109 -13496 -6925 -18468 -26123 -12380 2655 7497 18783 43963 50920 30106 15068 -22286
6513b2286l9209j300L2608L7091p77l627K224j1799J4809j5140L141o149J245
$$ -22286 -61495 -62795 -30187 6904 6127 2500 4724 -7075 7734 -7406 -4265 -10414 -9169
6500i169J108K2010N840N04P685k4454n50L676k8084r489n397R388R646j8077
$$ -9169 -8061 13949 19789 20293 27978 3524 2974 6650 -21434 -30923 -36320 -26932 -17286 -35363
6486c5363J6033K2374j2421J6441K1632r45o812j1395j4111L619K0045K2509J836
$$ -35363 -19330 3044 -9377 7064 28696 27751 20939 9544 -4567 -948 19097 41606 43442
6473D3442q427l1226o260j20K0046J1142j8460j3316K920o003J0145J8712J2993
$$ 43442 35015 3789 -2471 -2591 17455 28597 10137 -3179 -259 -6262 3883 22595 35588
6460C5588p041j0683K838K2014q572p6162j4363J1925K8558K4125l29n748M581
$$ 35588 28547 17864 20702 42716 34144 -42018 -56381 -44456 -15898 8227 7898 2150 6731
6447F731k065m793l3122q085q573L461M233J1686j4313j0094J100J8776L4670
$$ 6731 4666 -127 -33249 -41334 -49907 -46446 -42213 -30527 -44840 -54934 -53834 -35058 -388
6434c88M90n862M755J4414q554j7323L7101J5490o866J5684j8353j6514j4014
$$ -388 102 -5760 -1005 13409 4855 -12468 24633 40123 33257 48941 30588 14074 60
6421F0r681j3205j1902J0153R742K2805R925R880k6527j4473J8222L654Q12N226
$$ 60 -9621 -22826 -34728 -24575 -14833 7972 17897 27777 1250 -13223 4999 8653 9465 14691
6407A4691Q166j7311k5309j5107J6040M518m0224m514L6923R597j6705J2323J6973
$$ 14691 22857 5546 -19763 -34870 -18830 -14312 -54536 -59050 -22127 -12530 -29235 -16912 61
6394F1M09k8729j1691K4544K9074K7235M644l2649l6038k469M2826K1587j5389
$$ 61 470 -28259 -39950 -15406 13668 40903 45547 12898 -23140 -25609 17217 38804 23415
6381B3415J0257r49p854J1067J1323k027k8903k0137k549J3617J3720j0574j0188
$$ 23415 33672 32723 24869 35936 47259 45232 16329 -3808 -6357 7260 20980 10406 218
6368B18k3656r761R396Q632L6461J4451n206j5008J5791M2944J259l6800l0012
$$ 218 -23438 -33199 -23803 -15171 21290 35741 30535 15527 31318 74262 75521 38721 8709
6355H709k339o165K4615J5305k0148k0013j6141P578Q080J6827K4151L322j5278
$$ 8709 6370 205 24820 40125 19977 -36 -16177 -8599 -519 16308 40459 43781 28503
6342B8503k515j2972o670J4047j0936j5323L393J5490o441J1259J763k1183j5750
$$ 28503 25988 13016 6346 20393 9457 -5866 -2473 13017 6576 17835 19598 -1585 -17335
6329a7335J503k835k8833Q672K4879j3353j0655K0228R061O339L7824K675k8297
$$ -17335 -15832 -18667 -47500 -38828 -13949 -27302 -37957 -17729 -8668 -2329 35495 38170 9873
6316I873l1714J7485J0671J8800k1909k7624J3641K9577N940l918l453R95l9824
$$ 9873 -21841 -4356 6315 25115 3206 -24418 -10777 18800 24740 20822 17369 18364 -21460
6303b1460p277J8340J8376J7545P382j1021L350k3176m798J9529j2405j7292N35
$$ -21460 -28737 -10397 7979 25524 32906 21885 25235 2059 -2739 16790 4385 -12907 -12372
6290a2372J1504k63O559J1559j6175j4790N640K890P301j4726j6700J0831K6882
$$ -12372 -868 -1131 5428 16987 812 -13978 -8338 -5448 1853 -12873 -29573 -18742 8140
6277H140K3538r032J0205N733o778p995m348L3884J3311o315k9017l5568j8083
$$ 8140 31678 22646 32851 38584 31806 23811 19463 53347 66658 60343 31326 -4242 -22325
6264b2325K7L5134J9174j5363j9026k05J8842N777L223r108j7997j6249K0552
$$ -22325 -22298 12836 32010 16647 -2379 -2584 16258 22035 25258 16150 -1847 -18096 2456
6251B456M101j9431j2606L984m269k3745J1442o567K283J5685K3445j116N047
$$ 2456 6557 -12874 -25480 -21496 -25765 -49510 -38068 -44635 -42352 -26667 -3222 -4338 709
6238G09J4479K613l199R773J1311P250k2964j6130k2423o97m612J17K0747p56
$$ 709 15188 17801 14602 24375 35686 42936 19972 3842 -18581 -19278 -23890 -23773 -3026 -3782
6224c782j7823R386p151R999P863J0085K2731k386J8199J4473l1702j4952k1249
$$ -3782 -21605 -12219 -19370 -9371 -1508 8577 31308 28922 47121 61594 29892 14940 -6309
6211f309Q42M774p474j7710R48J4373j6013K3101J1088j7926k9792j0970J0011
$$ -6309 -5467 -693 -8167 -25877 -24929 -10556 -26569 -3468 7620 -10306 -40098 -51068 -41057
6198d1057N851m164J9997J894J6765M784k997p465J6445k0735l9036K122L6772
$$ -41057 -35206 -39370 -19373 -17479 -714 4070 1073 -6392 10053 -10682 -49718 -47596 -10824
6185a0824K7812j410j6696q85J129k819L5871J2593O782N524L768k9293q790J7483
$$ -10824 16988 15578 -1118 -2003 -874 -3693 32178 44771 51553 57077 60845 31552 22762 40245
6171D0245k4502l1792q622o153J3147J1913q954L7364K2787l0975o342L914P857
$$ 40245 15743 -16049 -24671 -30824 -17677 -5764 -14718 22646 45433 14458 8116 12030 19887
6158A9887O379k6060j1095J3079l054j7177J225N416j1933j9591K8679J6309K6071
$$ 19887 26266 206 -10889 2190 -864 -18041 -16816 -11400 -23333 -42924 -14245 2064 28135
6145B8135l1820j8395J4477M6762J1406m0780k0912J8749J313k93p936r752j4403
$$ 28135 -3685 -22080 -7603 39159 50565 9785 -11127 7622 8935 8642 706 -9046 -23449
6132b3449M2544J3900k0000l6495n590l892K4649M4565J2377k0632K235N790M105
$$ -23449 19095 32995 12995 -23500 -29090 -32982 -8333 36232 48609 27977 30212 36002 40107
6119D0107o978m1963m3831k4690J4757K0863O539K1056M734K149L996J1747k06
$$ 40107 33129 -8834 -52665 -77355 -62598 -41735 -35196 -14140 -9406 -7257 -3261 8486 8280
6106H280J2625J4744o582k9990j2923J6970J5533j9905k4137J203M659j910k0195
$$ 8280 20905 35649 29067 -923 -13846 3124 18657 -1248 -25385 -24182 -19523 -21433 -41628
6093d1628j2190L4271J127j2170K0982p7j353J7023j1786M175J6259j1425M942
$$ -41628 -53818 -19547 -18420 -30590 -9608 -9685 -11038 5985 -5801 -1626 14633 3208 8150
6080H150j1707o910j028j7946m465O505O287P769r7N766k7132k9992j7480J8027
$$ 8150 -3557 -10467 -11495 -29441 -33906 -27401 -21114 -13345 -13442 -7676 -34808 -64800 -82280 -64253
6066f4253K3924L0171J1289J0688j862k0884n902k3582J2662J3887j1703j0700
$$ -64253 -40329 -10158 1131 11819 9957 -10927 -16829 -40411 -27749 -13862 -25565 -36265
6054c6265L986j7960o071K1493J82L1580L1427J169P78P608k1595l443o611L567
$$ -36265 -32279 -50239 -56310 -34817 -34635 -3055 28372 29541 30319 37927 16332 12889 6278 9845
6040I845J0722k960k5427k2597N165J0016R033p206q90j0529J4169J0541m725
$$ 9845 20567 17607 -7820 -30417 -25252 -15236 -6203 -13409 -14299 -24828 -10659 -118 -4843
6027d843Q091K2322j0295j3280j2659k0242J907l116j4816j1756P265J8524O947
$$ -4843 3248 25570 15275 1995 -10664 -30906 -28999 -32115 -46931 -58687 -51422 -32898 -25951
6014b5951K1284j6485l297J3608J5383K2887p350N80J4323l3011q965j4168J0907
$$ -25951 -4667 -21152 -24449 -10841 4542 27429 20079 20659 34982 1971 -6994 -21162 -10255
6001a0255J502k4416l4364J4813M7603J029r045k1015P12J4300j1226R246J3040
$$ -10255 -8753 -33169 -67533 -52720 -5117 -4088 -13133 -34148 -33436 -19136 -30362 -21116 -8076
5988h076J4676J2386j2902n151l0454O867K3459l473N358q887P001O419n512J4055
$$ -8076 6600 18986 6084 933 -29521 -22654 805 -2668 2690 -6197 804 7223 1711 15766
5974A5766L5359l0796k3335M57J80p087p646k153n741k8941o673J4876K3906O64
$$ 15766 51125 20329 -3006 -2549 -2369 -9456 -17102 -19255 -24996 -53937 -60610 -45734 -21828 -21164
5960b1164l054J2574R390m58m78Q497K3874j2226j7633j3184J1431K948P331Q527
$$ -21164 -24218 -11644 -2254 -2712 -3190 5307 29181 16955 -678 -13862 -2431 517 7848 16375
5946A6375p950J1668l70k2146l5455l1102k357L6128K458j7383K0690Q478j4902
$$ 16375 8425 20093 19723 -2423 -37878 -68980 -71337 -35209 -32751 -50134 -29444 -20966 -35868
5933c5868j0276O541L9055R010j0232m694j8154K941J8225K8746k916j2645j0239
$$ -35868 -46144 -39603 -548 8462 -1770 -6464 -24618 -21677 -3452 25294 22378 9733 -506
5920e06j1053L0311L62L734Q596l3509j6631j606M184J5658O245P548K3162j3380
$$ -506 -11559 18752 19114 22848 31444 -2065 -18696 -20302 -16118 -460 5785 13333 36495 23115
5906B3115k0665M055J6126q123m967K9643J1859r969j521l8170j9957M286j2o599
$$ 23115 2450 6505 22631 14508 9541 39184 51043 41074 39553 1383 -18574 -14288 -14300 -20899
5892b0899P249L4457J7666r872j4445m00j833K289N610O878q943r886j2293K149
$$ -20899 -13650 20807 38473 28601 14156 13756 11923 14212 19822 26700 17757 7871 -4422 -2273
5878b273m877o944L89J5428J6856j9960n342j5934n759K6759L2487l3495n526
$$ -2273 -7150 -14094 -13705 1723 18579 -1381 -6723 -22657 -28416 -1657 30830 -2665 -8191
5865h191J5335L97k2025J2652J8747J6289J8629k6060l304J0573k1567j6213P892
$$ -8191 7144 7541 -14484 -1832 16915 33204 51833 25773 22469 33042 11475 -4738 3154
5852C154j1839j4313Q74k1064k476J7088J1801O508j473J807j0955j8053n80K4689
$$ 3154 -8685 -22998 -22124 -43188 -45664 -28576 -16775 -10267 -11740 -9933 -20888 -38941 -39521 -14832
5838a4832R808K6810p789m3894M46J35L66j2966L0059m569L281K2380K121N061
$$ -14832 -5024 21786 13997 -29897 -29451 -29316 -28950 -41916 -11857 -16426 -13145 9235 11356 16417
5824A6417l6985P904J5026k2765L472K5723K8000M806p285k0194p763K130j1328
$$ 16417 -20568 -12664 2362 -20403 -16931 8792 36792 41598 34313 14119 6356 8486 -2842
5811b842K391Q558m107n546J571J39m541J7247j1065k0525J4360L1411q326J4380
$$ -2842 -451 8107 4000 -1546 25 164 -4377 12870 1805 -18720 -4360 27051 18725 33105
5797C3105n571m3622k982j631R223j9459o007J5052k0867o495n005J0913K2622
$$ 33105 27534 -16088 -19070 -20701 -11478 -30937 -36944 -21892 -42759 -49254 -54259 -43346 -20724
5784b0724K2782n439k6764o531L3379p39k5762j2231N92o566j542L637L622k5957
$$ -20724 2058 -3381 -30145 -36676 -3297 -4036 -29798 -42029 -41437 -48003 -49545 -45908 -42286 -68243
5770f8243K383L9902K9647j4013R742J9662J4663N862o81k0881k5252L020Q438
$$ -68243 -65860 -25958 3689 -10324 -582 19080 33743 39605 38924 18043 -7209 -4189 4249
5757D249j2998k516J2072L185J1520K2325R856l2257n395j4919j2316K05K9876
$$ 4249 -8749 -11265 807 3992 15512 37837 47693 15436 10041 -4878 -17194 -16989 12887
5744A2887k798p380o217k4110k7699K8489L3101J2408J9368j1449Q091j8706r437
$$ 12887 10089 2709 -3508 -27618 -55317 -26828 6273 18681 38049 26600 34691 15985 6548
5731F548K511p949n21K2642L960k4819k4521K2561j068r790k3071m15K0016k3486
$$ 6548 9059 1110 589 23231 27191 2372 -22149 412 -656 -10446 -33517 -33932 -13916 -37402
5717c7402N227M5025M60j1837J1744m652j6310j8099k5526R741J9995j403O728
$$ -37402 -32175 12850 13310 1473 13217 8565 -7745 -25844 -51370 -41629 -21634 -23037 -16309
5704a6309o783R291O976J5482q91N135K732j4751N412J2400J8595J1447o207j6341
$$ -16309 -23092 -13801 -6825 8657 7766 12901 15633 882 6294 18694 37289 48736 42529 26188
5690B6188j1727k1315o639k2225k6112L8598M598R664p564J252j4258r175m573
$$ 26188 14461 -6854 -13493 -35718 -61830 -23232 -18634 -8970 -16534 -15282 -29540 -38715 -43288
5677d3288J3873J5699K0249J0943J1621J9489k5356j9197J7346m015k5529j5453
$$ -43288 -29415 -13716 6533 17476 29097 48586 23230 4033 21379 17364 -8165 -23618
5665b3618j8525J7364L719K0779n31j2647m464J2992L5422J910N18r014k7927
$$ -23618 -42143 -24779 -21060 -281 -812 -13459 -17923 -4931 30491 32401 32919 23905 -4022
5652d022q532j3731q731K2528J297j0098Q648p537L2255Q395O671k3935j1959
$$ -4022 -12554 -26285 -35016 -12488 -11191 -21289 -12641 -20178 12077 20472 27143 3208 -8751
5639h751k582J023j6282k9923J6794P975p121m815Q150Q806O651K0231O809r15
$$ -8751 -11333 -10310 -26592 -56515 -39721 -31746 -38867 -43682 -35532 -26726 -20075 156 6965 6050
5625F050k4963n201J277J3986j351l1145r442K4875J2085K034j8740k296K962
$$ 6050 -18913 -24114 -22837 -8851 -10202 -41347 -50789 -25914 -13829 -11795 -30535 -32831 -29869
5612b9869L2189J0388k5627l1609j6714O033K1198K6667J6099M44k5134j7213
$$ -29869 2320 12708 -12919 -44528 -61242 -55209 -34011 -7344 8755 9199 -15935 -33148
5600c3148J7009K9322j933j8692j0761k556L1771k384K222k465k1045P48O096
$$ -33148 -16139 13183 11250 -7442 -18203 -20759 11012 8628 10850 8385 -12660 -11912 -5816
5587e816l225J8654J1364j5463j0194J745j4315q313P333J0296j7418l46L2722
$$ -5816 -9041 9613 20977 5514 -4680 -2935 -17250 -25563 -18230 -7934 -25352 -25698 7024
5574G024L3261m110j4207n354J1227R25N21l2083l1705k5147M377K2313k1055
$$ 7024 40285 36175 21968 16614 27841 28766 29287 -2796 -34501 -59648 -55271 -32958 -54013
5561e4013R156L1208J0656j1828j4968o061j4444Q508K3970L2345K7207K1100
$$ -54013 -44857 -13649 -2993 -14821 -29789 -35850 -50294 -41786 -17816 14529 41736 62836
5549F2836j095k6099j9175l0523Q96J1713k4516K553N752M897L0746J6463j7132
$$ 62836 61741 35642 16467 -14056 -13160 -1447 -25963 -23410 -17658 -12761 17985 34448 17316
5536A7316q789J0674L947O803k981m1374j6272K5649j243k1510J674J2323K9501
$$ 17316 8527 19201 23148 29951 26970 -14404 -30676 -5027 -6270 -27780 -26106 -13783 15718
5523A5718J9451k3607n3911K0047L3879K1543R07m1603j8435j2583J0210J2092
$$ 15718 35169 11562 -42349 -22302 11577 33120 34027 -7576 -26011 -38594 -28384 -16292
5511a6292J0362J6455N1775R946k4507l4847l2275M390J5339J7191k880j6430
$$ -16292 -5930 10525 62300 72246 47739 12892 -19383 -14993 346 17537 14657 -1773
5499a773O51p284k966n999j0782q016n16K2517J5746j1079K0388o006k0680o81
$$ -1773 -1122 -8406 -11372 -17371 -28153 -36169 -36685 -14168 1578 -9501 10887 4881 -15799 -16480
5485a6480r624N468K475P253J7579P06K043J0878j4551J3013K9987k2335j3250
$$ -16480 -26104 -20636 -18161 -10908 6671 7377 9420 20298 5747 18760 48747 26412 13162
5472A3162m810j259n426N312L1805J3504n48o414j3682p819q821j7076j5610P886
$$ 13162 8352 7093 1667 6979 38784 52288 51740 45326 31644 23825 15004 -2072 -17682 -9796
5458i796M342m05p132l326j2443J8280K074Q102l649j1671j9779q829n455j0907
$$ -9796 -5454 -5859 -12991 -16317 -28760 -10480 -8406 -304 -3953 -15624 -35403 -44232 -49687 -60594
5444f0594k1075J9581J8926O337k953J1868N051K1806K6448m322L223m846j8074
$$ -60594 -81669 -62088 -43162 -36825 -39778 -27910 -22859 -1053 25395 21073 24296 19450 1376
5431A376j0578l911J0111J8009k611j8106P13O381q574K118J5770P932j3194J8597
$$ 1376 -9202 -13113 -3002 15007 12396 -5710 -4997 1384 -7190 -5072 10698 18630 5436 24033
5417B4033m325p068p323j1191j1388j777J4124r270l2950R771L2104K1432q431
$$ 24033 19708 12640 5317 -5874 -17262 -19039 -4915 -14185 -47135 -37364 -5260 16172 7741
5404G741P257J301K252L34j6842j8181j0287j8835J4111K7961K3148j0442j3267
$$ 7741 14998 16299 18551 18885 2043 -16138 -26425 -45260 -31149 -3188 19960 9518 -3749
5391c749o550J3698J5298r043j1791N817L9786m4992k4557o407l574O910L0901
$$ -3749 -10299 3399 18697 9654 -2137 3680 43466 -1526 -26083 -32490 -36064 -29154 1747
5378A747j0052O364j0362j0528j1803Q596J3133m179K645k977j5345K356M024
$$ 1747 -8305 -1941 -12303 -22831 -34634 -26038 -12905 -17084 -14439 -17416 -32761 -30405 -26381
5365b6381K7430j1578J0885k257r458R311J3154K2249k9881k3181J1839J0672
$$ -26381 1049 -10529 356 -1901 -11359 -2048 11106 33355 3474 -19707 -7868 2804
5353B804J8831k8429j5509J4568R497K5989k407j6290l1894J337L643k7397M501
$$ 2804 21635 -6794 -22303 -7735 1762 27751 25344 9054 -22840 -21503 -17860 -45257 -40756
5340d0756K6412K2266N894k8682p120R45j700p797j7458j1347K3552j6540p413
$$ -40756 -14344 7922 13816 -14866 -21986 -21041 -22741 -30538 -47996 -59343 -35791 -52331 -59744
5327e9744Q626L498m922K8943L0716j5114o968J3868L0700K0033k0188k0171k4634
$$ -59744 -51118 -47620 -52542 -23599 7117 -7997 -14965 -1097 29603 49636 29448 9277 -15357
5314a5357j2821N638N861k1262M435j109J8431j387R731l145j9913j5524O0K383
$$ -15357 -28178 -22540 -16679 -37941 -33506 -34615 -16184 -17571 -7840 -10985 -30898 -46422 -46362 -43979
5300d3979n405J2585J2435n227r294K2078m894m585n355Q221K942j4513j125J0601
$$ -43979 -49384 -36799 -24364 -29591 -38885 -16807 -21701 -26286 -31641 -23420 -20478 -34991 -36116 -25515
5286b5515M431J7217J3154l0166k033K326j740Q943J4539Q612N691L879j0839
$$ -25515 -21084 -3867 9287 -20879 -22912 -20586 -22326 -13383 1156 9768 15459 19338 8499
5273H499j7716R482m96k292j8154J3606J087j4821r111P933O851L700k2175o863
$$ 8499 -9217 265 -231 -2523 -20677 -7071 -5984 -20805 -29916 -21983 -15132 -11432 -33607 -40470
5259d0470j5914K7902R338l2209l945J4621J7018N724j0125L936n5M134k468N49
$$ -40470 -56384 -28482 -19144 -51353 -55298 -40677 -23659 -17935 -28060 -24124 -24179 -20045 -22513 -21964
5245b1964j9278O65J7518J3834Q22P395J6963K8996J2010M168l1791p678r612
$$ -21964 -41242 -40577 -23059 -9225 -8403 -1008 15955 44951 56961 61129 29338 21660 12048
5232A2048j7865j2334J4627N028K716k2493o6J8300K817Q057k9033o305J4382
$$ 12048 -5817 -18151 -3524 1504 4220 -18273 -18339 -39 2778 10835 -18198 -24503 -10121
5219a0121N218k408j7538n168j3298J4158K155j1579j3309J8736N4287L435k2688
$$ -10121 -4903 -7311 -24849 -30017 -43315 -29157 -27002 -38581 -51890 -33154 21133 24568 1880
5206A880O65P709r416J7076j1221k4952J069P939K192J2770J5086J518O817j9188
$$ 1880 2545 10254 838 17914 6693 -18259 -17190 -9251 -7059 5711 20797 22315 29132 9944
5192I944k4752J091L1515L885p510j3605j0734K583J985M66m4782j1786L5445
$$ 9944 -14808 -13717 17798 21683 14173 568 -10166 -7583 -5598 -5132 -49914 -61700 -26255
5179b6255r66K6415Q296N319j3587p83L860J6323N414o406j1156o519J0105J0272
$$ -26255 -27221 -806 7490 12809 -778 -1561 2299 18622 24036 17630 6474 -45 10060 20332
5165B0332L26j3776j439k8190l051J0062K3169J7212q909q463k3927J8186J8490
$$ 20332 20658 6882 5443 -22747 -25798 -15736 7433 24645 15736 7273 -16654 1532 20022
5152B0022M062K9444j9362l4566M045J7420J8383L343q40k6225R937j301j5043
$$ 20022 24084 53528 34166 -400 3645 21065 39448 42791 41951 15726 25663 24362 9319
5139I319J6402L146k675k5715l368K8591O733J1037l415J8296n888n367q347j6690
$$ 9319 25721 28867 26192 477 -2891 25700 32433 43470 40055 58351 52463 47096 38749 22059
5125B2059m3164j6444j744r037R700J4239J4683J2666l842k7636l2320j4483K4334
$$ 22059 -21105 -37549 -39293 -48330 -38630 -24391 -9708 2958 -884 -28520 -60840 -75323 -50989
5112e0989L8983q135J1476J7678K810p995j3565m679K0114l189q946O723L885
$$ -50989 -12006 -20141 -8665 9013 11823 3828 -9737 -14416 5698 2509 -6437 286 4171
5099D171n418K4618O743j9473j8968N45J1116L0654j0678j6804r35j1282j2056
$$ 4171 -1247 23371 30114 10641 -8327 -7782 3334 33988 23310 6506 5571 -5711 -17767
5086a7767K7520Q400N760j222j9309r361K0682J4188l875j9281l2618R762J2609
$$ -17767 9753 18153 23913 22691 3382 -5979 14703 28891 25016 5735 -26883 -17121 -4512
5073d512n559j3522J381k0078R441J6198J0673L707P150j7156k1858r236J6152
$$ -4512 -10071 -23593 -22212 -42290 -32849 -16651 -5978 -2271 4879 -12277 -34135 -43371 -27219
5060b7219J5118p186P429J2270j1031O425k9446o118K3675O402q448j7111J003
$$ -27219 -12101 -19287 -11858 412 -10619 -4194 -33640 -39758 -16083 -9681 -18129 -35240 -34237
5047c4237J8279R75K2369J9240j538j4778q850J7937o029j9612n767P322J319
$$ -34237 -15958 -14983 7386 26626 25088 10310 1460 19397 13368 -6244 -12011 -4689 -3370
5034c370l467j4015J2991n423m029O162q480Q724J2209l992k3102j4045L4172
$$ -3370 -6837 -20852 -7861 -13284 -17313 -11151 -19631 -10907 1302 -2690 -25792 -39837 -5665
5021e665N551J8137N38k3749K2562N355n078l2493k4313R754L3247K183J2347
$$ -5665 -114 18023 18561 -5188 17374 22729 17651 -14842 -39155 -29401 3846 6029 18376
5008A8376j9328n335M397K039j96r762q256J3302J2122P26J1425m558l235j1833
$$ 18376 -952 -6287 -1890 149 -47 -9809 -18065 -4763 7359 8085 19510 14952 11717 -116
4994a16j6069O182R880O260O877j9202k1516M729o511n700O416m332Q445K0764
$$ -116 -16185 -10003 -123 6137 13014 -6188 -27704 -22975 -29486 -35186 -28770 -33102 -24657 -3893
4980c893K0933j5133j0444r156J9514j4201k5316K1152J8038p643p742J4488j8143
$$ -3893 17040 1907 -8537 -17693 1821 -12380 -37696 -16544 1494 -6149 -13891 597 -17546
4967a7546J465L605L586P013K9415N64j8575k3099j94j3439j4844K8457K5212
$$ -17546 -16081 -12476 -8890 -1877 27538 28102 9527 -13572 -13766 -27205 -42049 -13592 11620
4954A1620K1994p499m23J5035K701l3364o993j0911q744J5353k883K6490J7653
$$ 11620 33614 26115 25692 40727 43428 10064 3071 -7840 -16584 -1231 -4114 22376 40029
4941D0029j3328l908l8739K052M104j1737J7373J2627k1724L320J2731J0705M5014
$$ 40029 26701 22793 -15946 -13894 -9790 -21527 -4154 8473 -13251 -9931 2800 13505 58519
4928E8519j4386l1078j0879j5412n043P284j2526q316K9998J5355j5030j7025
$$ 58519 44133 13055 2176 -13236 -18279 -10995 -23521 -31837 -1839 13516 -1514 -18539
4916a8539J3454K4818J159k2517N644M962n964K0818k902j8204j1772j7916j0986
$$ -18539 -5085 19733 20892 -1625 4019 8981 3017 23835 20933 2729 -9043 -26959 -37945
4903c7945K3364P386L931J2757J5026Q824l0569j3156J1710r889o397j2911r479
$$ -37945 -14581 -7195 -3264 9493 24519 33343 2774 -10382 1328 -8561 -14958 -27869 -37348
4890c7348J294J0863J8598k540n644J4868J1529k4047K749j0811k409J5220R93
$$ -37348 -36054 -25191 -6593 -9133 -14777 91 11620 -12427 -9678 -20489 -22898 -7678 -6685
4877f685o989J9467J9640O004j9770m1229K0122J8395l938J0730j5206k7290L19
$$ -6685 -13674 5793 25433 31437 11667 -29562 -9440 8955 5017 15747 541 -26749 -26430
4864b6430J7729j572L5255N275p85j2037N022j806j6895J0252j9J3062q862m288
$$ -26430 -8701 -10273 24982 30257 29472 17435 22457 20651 3756 14008 13989 27051 18189 13901
4850A3901r742Q181m256o621k3187K2761O651J0280m635l060j4481k0359K3006
$$ 13901 4159 12340 8084 1463 -21724 1037 7688 17968 13333 10273 -4208 -24567 -1561
4837a561K9104J4645Q593p220J96k1615q7R844o242J2941J1779n336k2716j9462
$$ -1561 27543 42188 50781 43561 43757 22142 22055 31899 25657 38598 50377 45041 22325 2863
4823B863P336R818k1486J1059J6239l9342p145L0687M650l739K674M236j841M5
$$ 2863 10199 20017 -1469 9590 25829 -13513 -20658 10029 14679 10940 13614 17850 16009 16054
4809A6054q559j575K864m605j4225j0444m371L6919O933j3307j2838J2788n91
$$ 16054 7495 5920 8784 4179 -10046 -20490 -24861 12058 18991 5684 -7154 5634 5043
4796E043k300R169j1150l858N088k3766J5175P205j5719j4828l1999J5122M5903
$$ 5043 2743 11912 762 -3096 1992 -21774 -6599 606 -15113 -29941 -61940 -46818 -915
4783i15K1603k0994j4151J4468R453j4929j9567p717m659Q477l811K897k7686
$$ -915 20688 -306 -14457 11 9464 -5465 -25032 -32749 -37408 -28931 -32742 -29845 -57531
4770e7531l2705K0100L0515J3534J1990J6621J4681j125R869K548r662N003j8169
$$ -57531 -90236 -70136 -39621 -26087 -14097 2524 17205 16080 25949 28497 18835 23838 5669
4757E669k4171q978j5563J2132J0405K772j1064J3303n912l177P256m258J7637
$$ 5669 -18502 -27480 -43043 -30911 -20506 -17734 -28798 -15495 -21407 -24584 -17328 -21586 -3949
4744c949m578j3393J5596j3274m2092r247O434J0154K5777O534j3387J6902k160
$$ -3949 -8527 -21920 -6324 -19598 -61690 -70937 -64503 -54349 -28572 -22038 -35425 -18523 -20683
4731b0683j778K6308K4908r680p018j7512j4732j6144j5439J4522L1949M108L600
$$ -20683 -22461 3847 28755 19075 12057 -5455 -20187 -36331 -51770 -37248 -5299 -1191 2409
4718B409k0970j3315Q768K8702j1518j3535J4922K7081p387k3043J9550J5920
$$ 2409 -18561 -31876 -23108 5594 -5924 -19459 -4537 22544 15157 -7886 11664 27584
4706B7584p277j9919j5492L593l083J2205n859k673j8884j4461l904q097K1634
$$ 27584 20307 388 -15104 -11511 -14594 -2389 -8248 -10921 -29805 -44266 -48170 -56267 -34633
4693c4633K7102L0121J9472m717j7946l6783j293j4112q215L3988l899j7547M472
$$ -34633 -7531 22590 42062 37345 19399 -17384 -18677 -32789 -41004 -7016 -10915 -28462 -23990
4680b3990j4702J4971J5023n512J0423O777j1181o010J5272J1549Q146J2223k027
$$ -23990 -38692 -23721 -8698 -14210 -3787 2990 -8191 -14201 1071 12620 20766 32989 30962
4667C0962j5807N361J1342n942j4985m901k9094K153q552J4941O111J29p078r277
$$ 30962 15155 20516 31858 25916 10931 6030 -23064 -20911 -29463 -14522 -8411 -8282 -15360 -24637
4653b4637J081q360j091J6394J8111o917k6743J3410K5870J5639m328l1469J459
$$ -24637 -23556 -31916 -33007 -16613 1498 -5419 -32162 -18752 7118 22757 18429 -13040 -11581
4640a1581L1449K1029n0064l1349J2757l0577n143R164j4855q846K2863M1383
$$ -11581 19868 40897 -9167 -40516 -27759 -58336 -63479 -54315 -69170 -78016 -55153 -13770
4628a3770j32J592P887j2296k244O198j5214n360O959J9513p756m483r645L2695
$$ -13770 -13902 -12310 -4423 -16719 -18963 -12765 -27979 -33339 -26380 -6867 -14623 -19106 -28751 3944
4614C944k524j2108m30R268j1661N958M803K7666J7725J4917k3795m0587j4830
$$ 3944 1420 -10688 -11118 -1850 -13511 -7553 -2750 24916 42641 57558 33763 -6824 -21654
4601b1654J1238k7089l1685M538l391j762k5266J6648K1939K4386O507j4031k7682
$$ -21654 -10416 -37505 -69190 -64652 -68043 -69805 -95071 -78423 -56484 -32098 -25591 -39622 -67304
4588f7304j8336J6678K6710j5215j2021K2245q387n17L4479L1074K8024o344k8045
$$ -67304 -85640 -68962 -42252 -57467 -69488 -47243 -55630 -56147 -21668 9406 37430 31086 3041
4575C041m4564m4871n326K3165K6458J0990J6792J3780j1176J1281J9040M2953
$$ 3041 -41523 -86394 -91720 -68555 -42097 -31107 -14315 -535 -11711 -430 18610 61563
4563F1563j2073r768R655n098j5633k2322q028K0925M772j1140k1031l135n740
$$ 61563 49490 39722 49377 44279 28646 6324 -1704 19221 23993 12853 -8178 -11313 -17053
4550a7053J949j2234R007K6917M804l725j1444j1951k8878n733K3735R120k4000
$$ -17053 -15104 -27338 -18331 8586 13390 9665 -1779 -13730 -42608 -48341 -24606 -15486 -39486
4537c9486k1876J0903L2910J0321K6553K0186q859Q018j3375j5600K9308k5701
$$ -39486 -61362 -50459 -17549 -7228 19325 39511 30652 38670 25295 9695 39003 13302
4525A3302k5905K2801J4575O314l695k1538j2533m267P438J5226Q976k2403K802
$$ 13302 -12603 10198 24773 31087 27392 5854 -6679 -10946 -3508 11718 20694 -1709 1093
4512A093J6879j8985l575p23l482m251J0002J9039j1409l6736o707L6087K0100
$$ 1093 17972 -1013 -4588 -5311 -8793 -13044 -3042 15997 4588 -32148 -38855 -2768 17332
4499A7332L0450R022j3441j7897k8810J272p324j837k815q20m6k5405O879r731
$$ 17332 47782 56804 43363 25466 -3344 -2072 -9396 -11233 -14048 -14868 -14914 -40319 -33440 -43171
$$ [...]
##END NTUPLES=NMR SPECTRUM
##END=
