##TITLE=Analysis number 329875
Compound Code cc 66601
Book Reference 518/199
Project Code adrs
Chemist Name colinb
##JCAMPDX= 6.0         $$ Bruker NMR JCAMP-DX V2.0
##DATA TYPE= NMR SPECTRUM
##DATA CLASS= NTUPLES
##ORIGIN= Bruker BioSpin GmbH
##OWNER= nmr
$$ XWIN-NMR		Version 3.5
$$ Mon Oct  8 11:58:24 2007 GMT Daylight Time (UT+1h)  MAYBRIDGE\nmr@NMR_250MHZ
##.OBSERVE FREQUENCY= 250.131544655141
##.OBSERVE NUCLEUS= ^1H
##.ACQUISITION MODE= SIMULTANEOUS (DQD)
##.ACQUISITION SCHEME= undefined
##.AVERAGES= 16
##.DIGITISER RES= 18
##SPECTROMETER/DATA SYSTEM= dpx250
##.PULSE SEQUENCE= zg30
##.SOLVENT NAME= TFA
##.SHIFT REFERENCE= (INTERNAL, TFA, 0, 17.5058)
##AUDIT TRAIL= $$ (NUMBER, WHEN, WHO, WHERE, WHAT)
$$ ##TITLE= Audit trail, XWIN-NMR		Version 3.5
$$ ##JCAMPDX= 5.01
$$ ##ORIGIN= Bruker BioSpin GmbH
$$ ##OWNER= nmr
$$ C:\u/data/dgb/nmr/ADRS/360/pdata/1/auditp.txt
$$ ##AUDIT TRAIL=  $$ (NUMBER, WHEN, WHO, WHERE, WHAT)
(   1,<2007-10-08 11:58:00.23 +100>,<MAYBRIDGE\nmr>,<NMR_250MHZ>,
      <created by zg, POWCHK disabled, PULCHK disabled
       configuration hash MD5:
       76 6E 9A 78 1E 09 19 81 EC 84 63 8F B0 6A 59 2D
       data hash MD5: 64K
       15 73 41 9A FC F6 A3 96 6B 70 6C 6A CA 40 BB AA>)
(   2,<2007-10-08 11:58:13.55 +100>,<MAYBRIDGE\nmr>,<NMR_250MHZ>,
      <Start of raw data processing
       ef LB = 0.3 FT_mod = 6 PKNL = 1 SI = 32K 
       data hash MD5: 32K
       4B 8A 8D A8 77 D3 37 AF 02 34 2A 44 7C F8 6F 4C>)
(   3,<2007-10-08 11:58:14.97 +100>,<MAYBRIDGE\nmr>,<NMR_250MHZ>,
      <apk 
       data hash MD5: 32K
       B2 FF 26 1A 29 4F 40 6B 98 21 5E A5 06 67 4F 58>)
(   4,<2007-10-08 11:58:15.83 +100>,<MAYBRIDGE\nmr>,<NMR_250MHZ>,
      <abs ABSG = 5 
       data hash MD5: 32K
       75 D4 DB D6 D6 F9 66 A1 CE 2B 72 6B 66 4E 02 C8>)
$$ ##END=
$$ 
$$ hash MD5
$$ 56 33 98 D1 BD BF 03 2A 73 D9 B6 C3 84 DE 01 FF
##$RELAX= 
##$RELAX= 
##$RELAX= 
##$RELAX= 
##$RELAX= 
##$RELAX= 
##$RELAX= 
$$ Bruker specific parameters
$$ --------------------------
##$DU= <C:\u>
##$EXPNO= 360
##$NAME= <ADRS>
##$PROCNO= 1
##$TYPE= <nmr>
##$USER= <dgb>
##$AMP= (0..31)
100 100 100 100 100 100 100 100 100 100 100 100 100 100 100 100 100 100 
100 100 100 100 100 100 100 100 100 100 100 100 100 100 
##$AQSEQ= 0
##$AQ_mod= 3
##$AUNM= <au_zg>
##$AUTOPOS= <56 >
##$BF1= 250.13
##$BF2= 250.13
##$BF3= 250.13
##$BF4= 250.13
##$BF5= 500.13
##$BF6= 500.13
##$BF7= 500.13
##$BF8= 500.13
##$BYTORDA= 1
##$CFDGTYP= 0
##$CFRGTYP= 5
##$CHEMSTR= <none>
##$CNST= (0..31)
1 1 145 1 1 1 1 1 1 1 1 1 1 1 1 1 1 1 1 1 1 1 1 1 1 1 1 1 1 1 1 1 
##$CPDPRG= <>
##$CPDPRG1= <>
##$CPDPRG2= <>
##$CPDPRG3= <>
##$CPDPRG4= <mlev>
##$CPDPRG5= <mlev>
##$CPDPRG6= <mlev>
##$CPDPRG7= <mlev>
##$CPDPRG8= <mlev>
##$CPDPRGB= <>
##$CPDPRGT= <>
##$D= (0..31)
0 1 0 0 0 0 0 0 0 0.06 0 0 0 0 0 0 0.0002 0 0 0 0 0 0 0 0 0 0 0 0 0 0 
0 
##$DATE= 1191841078
##$DBL= (0..7)
120 120 120 120 120 120 120 120 
##$DBP= (0..7)
150 150 150 150 150 150 150 150 
##$DBP07= 0
##$DBPNAM0= <>
##$DBPNAM1= <>
$$ [...]
##$SUBNAM7= <"">
##$SUBNAM8= <"">
##$SUBNAM9= <"">
##$SW= 20.6930455092707
##$SWIBOX= (0..15)
0 0 3 0 0 0 0 0 0 0 0 0 0 0 0 0 
##$SW_h= 5175.983436853
##$TD= 65536
##$TD0= 1
##$TE= 296.16
##$TE2= 300
##$TE3= 300
##$TEG= 300
##$TL= (0..7)
0 120 120 120 120 120 120 120 
##$TP= (0..7)
150 150 150 150 150 150 150 150 
##$TP07= 0
##$TPNAME0= <>
##$TPNAME1= <>
##$TPNAME2= <>
##$TPNAME3= <>
##$TPNAME4= <>
##$TPNAME5= <>
##$TPNAME6= <>
##$TPNAME7= <>
##$TPOAL= (0..7)
0.5 0.5 0.5 0.5 0.5 0.5 0.5 0.5 
##$TPOFFS= (0..7)
0 0 0 0 0 0 0 0 
##$TUNHIN= 0
##$TUNHOUT= 0
##$TUNXOUT= 0
##$USERA1= <user>
##$USERA2= <user>
##$USERA3= <user>
##$USERA4= <user>
##$USERA5= <user>
##$V9= 5
##$VALIST= <valist>
##$VCLIST= <CCCCCCCCCCCCCCC>
##$VD= 0
##$VDLIST= <DDDDDDDDDDDDDDD>
##$VPLIST= <PPPPPPPPPPPPPPP>
##$VTLIST= <TTTTTTTTTTTTTTT>
##$WBST= 1024
##$WBSW= 4
##$XGAIN= (0..3)
0 0 0 0 
##$XL= 0
##$YL= 0
##$YMAX_a= 282297
##$YMIN_a= -292558
##$ZGOPTNS= <>
##$ZL1= 120
##$ZL2= 120
##$ZL3= 120
##$ZL4= 120
##$ABSF1= 17.50585
##$ABSF2= -3.187344
##$ABSG= 5
##$ABSL= 3
##$ALPHA= 0
##$AQORDER= 0
##$ASSFAC= 0
##$ASSFACI= 0
##$ASSFACX= 0
##$ASSWID= 0
##$AUNMP= <proc_1d>
##$AZFE= 0.1
##$AZFW= 0.1
##$BCFW= 0
##$BC_mod= 0
##$BYTORDP= 0
##$COROFFS= 0
##$CY= 12.5
##$DATMOD= 1
##$DC= 0
##$DFILT= <>
##$DTYPP= 0
##$F1P= 14.0000005364418
##$F2P= -0.99999901652339
##$FCOR= 0.5
##$FTSIZE= 32768
##$FT_mod= 6
##$GAMMA= 0
##$GB= 0
##$INTBC= 1
##$INTSCL= 1
##$ISEN= 128
##$LB= 0.3
##$LEV0= 0
##$LPBIN= 0
##$MAXI= 10000
##$MC2= 0
##$MEAN= 0
##$ME_mod= 0
##$MI= 0
##$NCOEF= 0
##$NC_proc= -3
##$NLEV= 6
##$NOISF1= 0
##$NOISF2= 0
##$NSP= 0
##$NTH_PI= 0
##$NZP= 0
##$OFFSET= 17.50585
##$PC= 1
##$PHC0= 156.7765
##$PHC1= 10.82148
##$PH_mod= 1
##$PKNL= yes
##$PPARMOD= 0
##$PSCAL= 4
##$PSIGN= 0
##$REVERSE= no
##$SF= 250.129753913895
##$SI= 32768
##$SIGF1= 0
##$SIGF2= 0
##$SINO= 400
##$SIOLD= 32768
##$SREGLST= <1H.TFA>
##$SSB= 0
##$STSI= 32768
##$STSR= 0
##$SW_p= 5175.98343685301
##$SYMM= 0
##$S_DEV= 0
##$TDeff= 65536
##$TDoff= 0
##$TI= <Analysis number 999999
Compound Code 99
Book Reference 9
Project Code 9>
##$TILT= no
##$TM1= 0
##$TM2= 0
##$TOPLEV= 0
##$USERP1= <user>
##$USERP2= <user>
##$USERP3= <user>
##$USERP4= <user>
##$USERP5= <user>
##$WDW= 1
##$XDIM= 32768
##$YMAX_p= 341068957
##$YMIN_p= -663478
$$ End of Bruker specific parameters
$$ ---------------------------------
##NTUPLES= NMR SPECTRUM
##VAR_NAME=  FREQUENCY,     SPECTRUM/REAL,   SPECTRUM/IMAG
##SYMBOL=    X,             R,               I
##VAR_TYPE=  INDEPENDENT,   DEPENDENT,       DEPENDENT
##VAR_FORM=  AFFN,          ASDF,            ASDF
##VAR_DIM=   32768,         32768,           32768
##UNITS=     HZ,            ARBITRARY UNITS, ARBITRARY UNITS
##FACTOR=    0.157963299565203, 1,           1
##FIRST=     4378.73391209678, 0,            0
##LAST=      -797.249524756229, 0,           0
##MIN=       -797.249524756229, -663478,     0
##MAX=       4378.73391209678, 341068957,    0
$$ Real data points
##PAGE= N=1
##DATA TABLE= (X++(R..R)), XYDATA
$$ [...]
30794E012n8567K1390K4031K2409K0254m173l0775J4794K1832j9185R921M6547
30782G3490o996K5715J2072n1605l5071k5588j920L0570M6668m1301K6666j1003
30770D1697n9378p462R6847N1824J9963m4613M2322L823q8218l5576K0801J5842
30758E7872l0575p1229J5827K4710J7092m1512m7468K2414J9922o456j944K0750
30746b0597J9509j879j2542m600N57P312j4756J0438M9490J1633K7118r306j7473
30733D4904j0416l4584k8371n6308M6068Q539M5619L5759m454l0893r996M893
30721A0760p190j287j4916K2291N497J2610K8104k4014K3686L7713l7402k1344
30709C4508p719m2378l1044J6377J5032Q682j5946k5676M4593K6204o395j7068
$$ plain form
30794 5012 -53555 -32165 -8134 14275 34529 30356 -419 14375 36207 17022 26943 73490
30782 73490 66494 92209 104281 52676 17605 -7983 -9903 20667 67335 26034 52700 41697
30770 41697 -17681 -25143 71704 123528 143491 98878 141200 145023 56805 21229 42030 57872
30758 57872 27297 -43932 -28105 -3395 13697 -27815 -75283 -52869 -32947 -39403 -41347 -20597
30746 -20597 -1088 -2967 -15509 -20109 -19552 -12240 -26996 -16558 32932 44565 71683 62377 44904
30733 44904 34488 -96 -28467 -84775 -38707 -30168 15451 51210 46756 15863 5867 10760
30721 10760 3570 2283 -12633 9658 15155 27765 55869 31855 55541 93254 55852 34508
30709 34508 26789 -15589 -46633 -30256 -15224 -6542 -22488 -48164 -3571 22633 16238 -830
30697h30j698k0926l6745L7530L7156k5983m1007k2470O4315L9850L186P605j03886
30684f3903l3002L4466L9256j3033K5502n5079M5025L2650O9252J8013j8137l5120
30672D5890n5509n933O3303o2091j6827k928k3151p1617J2330J0036j3774j0422
30660a30693J9571j9487K180O2326P1003q122m692M2269j283m7092k5934N3287
30648A3333J2895P176M2825o7788m5259K0523M6879k7950l8453k2568K8868K2104
30636g415m2031K9424O7257k6949r813k677j3718k8993N413M551J7440K5354j576
30623A6267L3736j0684k3012j0251m2457j5353K2177q156j6146P3879J4003Q328
30611D2331J2984k5189L5250m687J0935L950J1350n4447l8096j7883j995N7667
$$ plain form
30697 -830 -2528 -23454 -60199 -22669 14487 -11496 -52503 -74973 -10658 29192 32378 39983 -63903
30684 -63903 -96905 -62439 -23183 -36216 -10714 -65793 -20768 11882 81134 99147 81010 45890
30672 45890 -9619 -15552 47751 -14340 -31167 -34095 -57246 -128863 -116533 -106497 -120271 -130693
30660 -130693 -111122 -130609 -128429 -66103 4900 -3222 -7914 34355 33072 -14020 -39954 13333
30648 13333 26228 33404 76229 8441 -36818 -16295 30584 2634 -35819 -58387 -29519 -7415
30636 -7415 -49446 -20022 47235 20286 10473 7796 -5922 -34915 -29502 -24951 -7511 17843 16267
30623 16267 50003 39319 16307 6056 -36401 -51754 -29577 -37733 -53879 20000 34003 42331
30611 42331 55315 30126 65376 60689 71624 75574 86924 32477 -5619 -23502 -25497 32170
30599C2170O9571l8325l9111m3432n9193l3977j0024K5605N4050M9528k0644R528
30587d254R962L5722J2933o397M7743m3131l814k2865J0660L915n6531j5904l4830
30574f6791K7950J4019m9326R417m7156M591L6457K6411k4881o7743k1265L0528
30562a27789K4523N4707J2244J3755M7712j9816k5075M4025L1411P559k4725j12917
30550g4386k6886P9048K2863j9264N41K0945J1265K8344J6817n3789o095L0747
30538C0150P454M3320r804j4304l6114p943k1454k0792j0945R4682N9376k3194
30526I0432J630J3635p9603l1946M9108L7648J3690k007J1218J9288o2995p9217
30514a9119l337M0562k390j7029l3730j9451J5166k4102k1806n594J7775N0470
$$ plain form
30599 32170 101741 63416 24305 -19127 -78320 -112297 -122321 -96716 -42666 6862 -13782 -4254
30587 -4254 5708 41430 54363 47966 95709 52578 48764 25899 36559 40474 -16057 -31961 -66791
30574 -66791 -38841 -24822 -74148 -64731 -111887 -107296 -70839 -44428 -69309 -137052 -158317 -127789
30562 -127789 -103266 -48559 -36315 -22560 25152 5336 -19739 24286 55697 63256 38531 -74386
30550 -74386 -101272 -22224 639 -18625 -18084 2861 14126 42470 59287 5498 -597 30150
30538 30150 37604 80924 71120 56816 20702 12759 -8695 -29487 -40432 54250 113626 90432
30526 90432 92062 105697 26094 -5852 43256 80904 94594 92587 103805 123093 60098 -19119
30514 -19119 -22456 18106 15716 -1313 -35043 -54494 -39328 -63430 -85236 -90830 -73055 -22585
30502b2585Q1641J4622J2220N485m2896p5151l050m1455m002M8585P2543M1761
30490H7718K3509m5559k5561j768l0899p7255m5825m9848K1909N3653L4716l798
30478e9008j7835l9046N3702L8487n4697L3363L3693j5676l5976qL0969J9448
30466a2584M4049N0545l6863m2776J4194o864n6844l2095l518m6172K677J6653
30454a09598J06603M0194l527K9612L5248j4721O395j1314j9973m8949J6218n4918
30442b8730m5815L7880M1661N090M2788K1115k0344q735K2818J0831n9618l0914
30430a1973k7345j0716Q5710j7516M1988o2422k7822J6083J804p113N3634P790
30418D2102l5355l5997m4985N2102K2043j1355Q023J4628j2350M3053L7575n2740
$$ plain form
30502 -22585 59056 73678 85898 91383 48487 -26664 -29714 -71169 -75171 -26586 45957 87718
30490 87718 111227 65668 40107 38339 7440 -69815 -115640 -165488 -143579 -89926 -55210 -59008
30478 -59008 -76843 -115889 -62187 -23700 -78397 -45034 -11341 -27017 -62993 -63001 -32032 -12584
30466 -12584 31465 82010 45147 2371 16565 9701 -47143 -79238 -82756 -128928 -126251 -109598
30454 -109598 -2995 37199 33672 63284 98532 83811 90206 78892 58919 9970 26188 -28730
30442 -28730 -74545 -36665 4996 10086 52874 73989 53645 44910 67728 78559 18941 -11973
30430 -11973 -39318 -50034 35676 18160 60148 -2274 -30096 -14013 -12209 -19322 34312 42102
30418 42102 6747 -29250 -74235 -22133 -90 -11445 -3422 11206 -1144 41909 79484 26744
30406B6744p820M090j6215n4226J507L7982l4800l3474L9466L3703N4432o530
30394D4859n0023P805q182K7335m1522q1881L1119L1786o692j1707K8614Q672
30382a9817l1392m5036M9318J2616l8231Q664k7820J413R6895M8903j6825o1748
30370b3060l2355p888N297q196q805L7967K89J5478N3956M1958K9202m0563l9195
30357B4085J9305K9802M9422n6977m5086k3344k6229L0453j4457M2550N3478n5273
30345B7729n7682K6671J9849K830j0059j0363J3154l034q619J6974J2797K6210
30333E6457K2852J9400o941o7563m3797J3701o426n0471K0748M2754O0203m5682
30321A5235l3292N8991P9946l0893q3482j2254j7741K8922M065p4852k772L2222
$$ plain form
30406 26744 18924 23014 6799 -47427 -45920 -7938 -42738 -76212 -36746 -3043 51389 44859
30394 44859 -5164 2641 -5541 21794 -19728 -101609 -70490 -38704 -45396 -57103 -28489 -19817
30382 -19817 -51209 -96245 -46927 -34311 -72542 -63878 -91698 -90285 6610 55513 38688 -23060
30370 -23060 -55415 -63303 -58006 -66202 -75007 -37040 -36751 -21273 32683 74641 103843 63280 24085
30357 24085 43390 73192 122614 65637 20551 -2793 -29022 1431 -13026 29524 83002 27729
30345 27729 -29953 -3282 16567 19397 9338 -1025 12129 9095 476 17450 30247 56457
30333 56457 79309 98709 91768 24205 -19592 -5891 -12317 -62788 -42040 714 60917 15235
30321 15235 -18057 40934 120880 89987 6505 -5749 -23490 5432 9497 -65355 -68127 -35905
30309c5905L3456L1988k2149m1565K676K7762m3353K1834N8626J3949j305p225
30297C8789m5342m032M6872K2115p7311l6841Q148L8103M8476n365j5848K4022
30285D1786J3936l530J0657k7051k2131q880P399j4048K5812L772j8136m1257
30273c1671j7270j8157J0381L5524J3990k7487L8006Q2897L97J7078N535j4552
30261I4671Q166q093l2794J8189J9137p751J1794K3557m8656R109p1360k7942
30249a1973m3871l6096n763K4256K0656K7947O1888J254k6116p815K7776l4992
30237b849O018r418l7481k1423R448N7602Q551J0033J331R557m1576n885J2106
30224c986k071j344M408J6326n7134K1254q363j616K3681m6278P403K775r395
$$ plain form
30309 -35905 -2449 29539 7390 -34175 -31499 -3737 -47090 -25256 33370 47319 46014 38789
30297 38789 -6553 -10585 36287 58402 -18909 -55750 -47602 -9499 38977 33612 17764 41786
30285 41786 55722 52192 62849 35798 13667 4787 12186 -1862 23950 27722 9586 -31671
30273 -31671 -48941 -67098 -56717 -21193 -7203 -34690 3316 86213 86610 103688 109223 94671
30261 94671 102837 94744 61950 80139 99276 91525 103319 126876 78220 87329 15969 -11973
30249 -11973 -55844 -91940 -97703 -73447 -52791 -24844 37044 38298 12182 4367 32143 -2849
30237 -2849 3169 -6249 -43730 -65153 -55705 1897 10448 20481 21812 31369 -10207 -16092 -3986
30224 -3986 -6057 -7401 -2993 13333 -43801 -22547 -30910 -32526 -8845 -55123 -47720 -44945 -54340
30211e4340J6500L0814K8722j6925j394K9446k1843r803J064p597K5836j8344
30199B136J9658N030R019p201k4628J772N1254k8899k715j2136M993k8558o308
30186a6583l438q99k9006j5541M0003P8053K2211o7774l1718L2684M536L3874
30174D6402O118R659j2411o7700q0577J5602P1358O1954o334m2023l0911j83P237
30161b1809L1772j9096k3051Q185J8254j535K8363k6520m56J6259j5572L5357
30149C0151P971J0637O6944m7401k1946n6302n7416M0628j0242l3607N4741N5138
30137C9296J7237n8970L495O3519n94Q722P1686L7429o9634r8995L1962L2128
30125G7281n6369L0637j3746l6481R699l797m6098M1285J4981m8113O6328K0426
$$ plain form
30211 -54340 -37840 -7026 21696 4771 3377 32823 10980 1177 2241 -5356 20480 2136
30199 2136 21794 26824 35843 28642 4014 5786 57040 28141 25426 13290 18283 -10275 -16583
30186 -16583 -20021 -20920 -49926 -65467 -25464 52589 74800 7026 -24692 7992 12528 46402
30174 46402 52520 62179 49768 -17932 -98509 -82907 -11549 50405 44071 2048 -28863 -29046 -21809
30161 -21809 9963 -9133 -32184 -23999 -5745 -7280 21083 -5437 -5893 10366 -5206 30151
30149 30151 38122 48759 115703 68302 46356 -9946 -67362 -26734 -36976 -70583 -15842 39296
30137 39296 56533 -2437 1058 64577 63983 72705 144391 181820 112186 13191 45153 77281
30125 77281 20912 51549 37803 1322 11021 7224 -38874 2411 17392 -30721 35607 56033
30113E6033p2726K4600N1105K2083l2779m0512k9222j2784J4309N068J371J759
30101a1695Q392K6586j1974K8270n474M704P5540K8204n3732l765j6636j9538
30089D8882L9324m2965m4809k1478j8920l1884K751j5549K5176K3128n275O4028
30077B2409N2285l8226m161M465K5960K143j0574J6061J6524j7717m0641l3719
30065e191m8972L344n8027l1613M3928Q3003j2833j8219l615m7484O4414k287
30053c3552j3553K7442m5838M1129k8266R636J5590k0119L1618K9791l604r1185
30041h0911P4059j2697J4979j9724j5866l581L6147K3754N0283j9913J8100k3653
30029D0977j2780j0096L046J1544l495K6991j481m2161L812M5967k6347q3926
$$ plain form
30113 56033 -16693 7907 59012 81095 48316 7804 -21418 -34202 -19893 -14825 -13454 -11695
30101 -11695 -3303 23283 11309 39579 34105 38809 114349 142553 88821 85056 68420 48882
30089 48882 88206 45241 432 -21046 -39966 -71850 -69099 -84648 -59472 -36344 -41619 22409
30077 22409 74694 36468 32307 36772 62732 64875 54301 70362 86886 69169 28528 -5191
30065 -5191 -54163 -50819 -108846 -140459 -96531 -13528 -26361 -44580 -48195 -95679 -31265 -33552
30053 -33552 -47105 -19663 -65501 -24372 -52638 -43002 -27412 -47531 -15913 13878 10274 -80911
30041 -80911 -6852 -19549 -4570 -24294 -40160 -43741 -7594 16160 66443 46530 64630 40977
30029 40977 28197 18101 21147 32691 29196 56187 54706 12545 16357 62324 35977 -47949
30017d7949l9748O4741o859O360n7582P197K3476J5681M1733K1037j5841N164
30005A7410n1082j1198K4213J7633m6604k0668j2771K4994J730j105J6980M2382
29993A914J7295l1282k0240K9228K4540J3171K6220o4668m9646Q7983k2835o4735
29981e3055N5223M9294j0550n3086l026j175N8156K2741j8044j0115q51N2884
29969H8396K7436n2568o8279L6013N0584k4403p2539K2828j4200k1552Q6921L4712
29957I3349p8163l5063k7774k391M8834P572J4933R772l4154m2653l3324J7762
29945f1300L8762l630K9591j2775J0967O6571n1425n7563k2913J5836n214m1319
29933i4412M649N5851L4331k6200K5498K5852O7953n5506n5933K4475m215j9171
$$ plain form
30017 -47949 -87697 -22956 -29815 -23455 -81037 -73840 -50364 -34683 7050 28087 12246 17410
30005 17410 -33672 -44870 -20657 -3024 -49628 -70296 -83067 -58073 -56343 -57448 -40468 1914
29993 1914 19209 -12073 -32313 -3085 21455 34626 60846 -3822 -53468 34515 11680 -53055
29981 -53055 2168 51462 40912 -12174 -15200 -16375 41781 64522 46478 36363 35512 88396
29969 88396 115832 63264 -5015 30998 81582 57179 -15360 7468 -6732 -28284 58637 93349
29957 93349 15186 -19877 -47651 -50042 -1208 6364 21297 31069 -3085 -45738 -79062 -61300
29945 -61300 -22538 -26168 3423 -9352 1615 68186 16761 -40802 -63715 -47879 -53093 -94412
29933 -94412 -89763 -33912 419 -25781 -283 25569 93522 38016 -17917 6558 2343 -16828
29921a6828p131L1010J9519j785k7914m7824k0641M6540M1111L3176j4119j8808
29909A6306j6333o3794J1440P7853j1960J1618K2713J2596O2702J2407j1524l1300
29897I2724o1515n935k493n1294N1224K6219l0529N5286K9984k7302j9988n1946
29885D435m7136L7743K7400J0620J8086L4510J9800p013l6332j8101K574K6900
29873G3486n0959r3981L964l994K3129L6714j735R119j8875j5498K0402M7415
29861B9187k0405l5426m526j3766q917O6643r257m1923K5085M2287J3675k2334
29849B0323o7904J2003M0327k8212o453M8929M0327J7554M089m9348K0595L3164
29837H5394r0558o7318N5832K2092J7967j474n7625k8107l3762K0366N9343P900
$$ plain form
29921 -16828 -23959 7051 26570 24785 -3129 -50953 -71594 -25054 16057 49233 35114 16306
29909 16306 -27 -63821 -52381 25472 13512 25130 47843 60439 123141 135548 124024 92724
29897 92724 31209 25274 22781 -28513 22711 48930 18401 73687 103671 76369 56381 4435
29885 4435 -42701 -4958 22442 33062 51148 85658 105458 98445 62113 44012 46586 73486
29873 73486 22527 -71454 -67490 -71484 -48355 -11641 -13376 -4257 -23132 -38630 -18228 29187
29861 29187 8782 -26644 -31170 -44936 -53853 12790 3533 -38390 -13305 28982 42657 20323
29849 20323 -47581 -35578 4749 -23463 -29916 19013 59340 76894 80983 31635 52230 85394
29837 85394 -5164 -72482 -16650 5442 23409 21935 -35690 -63797 -97559 -77193 -17850 -9950
29825i950l4409j0287J6391K0875N1123O826K1132J2579k6081k9292l5867j0127
29813b7087L0169L1313J1760m4477J0972J0890l6804K1570L7085q113J5351n912
29801D6717n1914J1711K3913k6049M385k1430o2544j6844K4705P712L8255J2159
29789i224k5464J33P865L7740J1957Q52K9804J0073j0565P0727k4004m2622q5695
29776b8423j04399j0020N8004l2959l7016J3647K0856L2756R365M2986j237k6929
29764f3369j3858J8945K4303l4837l6147J1361M8740O9426M6169n134l4086J8965
29752E0478o536n0091k2220j2218J0193N5077O3116j9988o6257j1085K1134j04306
29740i2703n5490J3011K333Q912J8734N557L5608K0710j4356M8204J9969K3047
$$ plain form
29825 -9950 -44359 -54646 -38255 -17380 33743 40569 61701 74280 48199 18907 -16960 -27087
29813 -27087 3082 34395 46155 1678 12650 23540 -13264 8306 45391 37278 52629 46717
29801 46717 -5197 6514 30427 4378 8763 -12667 -75211 -92055 -67350 -59638 -21383 -9224
29789 -9224 -34688 -34555 -26690 11050 23007 23859 53663 63736 53171 123898 99894 57272 -28423
29776 -28423 -132822 -142842 -84838 -117797 -154813 -141166 -120310 -87554 -78189 -35203 -36440 -63369
29764 -63369 -77227 -58282 -33979 -68816 -104963 -93602 -44862 24564 70733 65599 31513 50478
29752 50478 43942 -6149 -28369 -40587 -30394 24683 87799 67811 1554 -9531 11603 -92703
29740 -92703 -148193 -135182 -132849 -123937 -105203 -99646 -64038 -43328 -57684 -9480 10489 33536
29728C3536k0280j3505m2258R13J6550K0777O6574K671m0143O550L5429J8144
29716H4958m0002k3998M2521m2546m8897j7679l5758n943N2539Q1658k4356l9325
29704a6828L8609P8416L0487q9422k5914L0281J2171J3769j4771K7892n2216j0913
29692B1561o4526j1695K9938O677k1256o474m970L2202M7563K6849k4380m870
29680B6619l5090j2273M9534L4561l4821j01789J3165M0080M6481l2348m7036
29669e2917K9080J9922m3314l8466j4166J7759L5390N355N5390L4013j06097l3016
29657i1067J7875N1138J6660o4603p205L2613O340l238j6926K0048O2356M7719
29645G1710l6448l6272m027J4285m1952j7506R445j5625o976J2581P5662N4400
$$ plain form
29728 33536 13256 -249 -42507 -41594 -25044 -4267 62307 64978 24835 31385 66814 84958
29716 84958 44956 20958 63479 20933 -27964 -45643 -81401 -87344 -34805 46853 22497 -16828
29704 -16828 21781 100197 130684 41262 15348 45629 57800 71569 56798 84690 32474 21561
29692 21561 -42965 -54660 -24722 -18045 -39301 -45775 -50745 -18543 29020 55869 31489 26619
29680 26619 -8471 -20744 28790 63351 28530 -73259 -60094 -20014 26467 -5881 -52917
29669 -52917 -23837 -3915 -47229 -85695 -99861 -82102 -46712 -41357 14033 48046 -58051 -91067
29657 -91067 -73192 -22054 -5394 -69997 -77202 -44589 -38249 -41487 -58413 -38365 23991 71710
29645 71710 35262 -1010 -5037 9248 -32704 -50210 -40765 -56390 -63366 -50785 24877 79277
29633G9277k1628l1225J9957l6767J3922j1035m726N2172m5010n0276l1994N658
29621f1675K1639k3879l4603n824M2250L0252K4563K2591K0065L0653j8593m129
29609D3310k2799l1148j1371R792K8464k9058q7979P201J00670L1172m4294m9531
29597e5571j7598k8169L2111M5078j578k1608N803L8350j3237L6628L368l5865
29585a2288K1147k0859J2599M316l669K6393m987J2285K9562k712k1223m3120
29573b556Q601m9358o3450O3753R3787l5493m4710J97k3967P458K7937p967L5232
29560I464l9022M0158K0540q3686p6198J8131j3619M6304O6230L2749l6113r896
29548b4958J23j4802J1108N8849j5995l1140l7141k9081K5356M6218r500N9849
$$ plain form
29633 79277 57649 26424 46381 9614 23536 12501 7775 59947 14937 -35339 -67333 -61675
29621 -61675 -40036 -63915 -98518 -104342 -62092 -31840 -7277 15314 35379 66032 47439 43310
29609 43310 20511 -10637 -22008 -12216 16248 -12810 -100789 -93588 7082 38254 -6040 -55571
29597 -55571 -73169 -101338 -69227 -24149 -25727 -47335 -41532 -3182 -16419 20209 23577 -12288
29585 -12288 8859 -12000 599 4915 1246 27639 22652 34937 64499 61787 40564 -2556
29573 -2556 6045 -43313 -106763 -43010 50777 15284 -29426 -29229 -53196 -45738 -17801 -25768 9464
29560 9464 -29558 10600 31140 -52546 -128744 -110613 -124232 -77928 -11698 21051 -15062 -24958
29548 -24958 -24835 -39637 -28529 30320 14325 -16815 -53956 -83037 -57681 -11463 -20963 38886
29536C8886J7721r285J2015j0246M0050n5384n2191m768M2111K6670j2077O0600
29524I4102M3618n7445q4735k0035K6625M9943M8036r895J451m3605l8657l1227
29512b1824P261j657J0427N8373l175k78j1625q5423m0036P8259L5217j0043l6196
29499b0720N1487J4315K8947L7583p3147j15891q818J9187K2034K3559j7416O343
29487c2537l4493k9122Q9160k3091p3059j1793N7252O5408M6522l4806l6320o974
29475b3853J8638o913j7169K9122J4256q1463K983L2653l7788m6833Q00M5981
29463f9586M0441N0237P4551J9686n3702k5150L5613k6552l4806n1802M8529k6823
29451a9364k8280J10M1685k1292k6836J6967L1688J6815l6891j2743L7860O07
$$ plain form
29536 38886 56607 47322 59337 49091 89141 33757 -18434 -23202 18909 45579 33502 94102
29524 94102 137720 80275 -4460 -24495 2130 52073 100109 90214 91665 48060 9403 -21824
29512 -21824 -14563 -16220 -5793 52580 49405 49127 37502 -47921 -87957 -9698 25519 15476 -20720
29499 -20720 30767 45082 74029 111612 38465 -77426 -86244 -67057 -45023 -21464 -38880 -32537
29487 -32537 -67030 -96152 -6992 -30083 -103142 -114935 -57683 7725 54247 19441 -16879 -23853
29475 -23853 -5215 -12128 -29297 -175 14081 -67382 -64399 -31746 -69534 -116367 -115567 -69586
29463 -69586 -29145 21092 95643 115329 61627 36477 72090 45538 10732 -41070 7459 -19364
29451 -19364 -47644 -47534 -5849 -27141 -53977 -37010 -5322 11493 -25398 -38141 -281 326
29439C26j7861q708J1046N9946R537m2153k3617m365l7370l3311O6384K5994j125
29426D723L1152l4500L130M4341N8182K9903l1130j8712K3992j8826k2411l183
29414F6661m9412n9154p190k838j6711J6425J1455L2025j4355O167M3715R594
29402C6382K1490j5707k8674K8742K9654q380J4493k2355j5761j4497L6772J3247
29390G5406n1843J0206m2146p1548Q216M3407L2185l3573N969J6272O7083J3871
29378G3505k5572L9743K6673q6205k8689j354l9799K4726M6266L3453K2225j6854
29366F8118R112j988K4922o0555j6547N5797j9050l7375n2455l7703K7574K9923
29354a0227o820R337k2022p778q304J8967K1616J1254n839q656r270N3185L1685
$$ plain form
29439 326 -17535 -26243 -15197 44749 54286 12133 -11484 -15849 -53219 -86530 -20146 5848 4723
29426 4723 35875 1375 4505 48846 107028 136931 105801 87089 111081 92255 69844 66661
29414 66661 17249 -41905 -49095 -51933 -68644 -52219 -40764 -8739 -23094 -16927 26788 36382
29402 36382 57872 42165 13491 42233 71887 63507 78000 55645 39884 25387 62159 75406
29390 75406 23563 33769 -8377 -79925 -71709 -28302 3883 -29690 -23721 -7449 59634 73505
29378 73505 47933 87676 114349 28144 -545 -1899 -41698 -16972 29294 62747 84972 68118
29366 68118 77230 75242 100164 39609 23062 78859 59809 22434 -30021 -67724 -40150 -10227
29354 -10227 -17047 -7710 -29732 -37510 -45814 -26847 -5231 6023 184 -8472 -17742 35443 67128
29341F7128l7148r8550j4021K4588k0172K7899L8290K0506L0315k0627J8939k526
29329C4621j1522M765J4089O0069l6549l1274L0384J2493m8014q575M2679K7978
29317I1144k3081p731k8674J6348K1228l7517j1281N4394M7213k4657m7831J8368
29305F7923J5948l8691j11288J469O6659n2472j3021K4148J5472R789k0002k2549
29293e6615K4406J4928M9804j2780l8982J546M3862p3778K7552O0884L8051j4031
29281F4847l0980l2559j8292L9756O2363m3067K1982k4375l6945m1116K2997K4565
29269I176l5231k5966L6630J318m2528N115J9087L7654k1304K1100M8009m5144
29257G916l0979M2160n9689M28r252J9022K0427J2462P340M0815l819k7363l2252
$$ plain form
29341 67128 29980 -68570 -82591 -58003 -78175 -50276 -11986 8520 38835 18208 37147 34621
29329 34621 23099 27864 41953 102022 65473 34199 64583 77076 29062 20487 63166 91144
29317 91144 68063 60332 31658 48006 69234 31717 20436 74830 122043 97386 49555 67923
29305 67923 83871 45180 -66108 -64639 2020 -50452 -63473 -39325 -23853 -14064 -34066 -56615
29293 -56615 -32209 -17281 32523 19743 -19239 -17693 26169 -47609 -20057 40827 78878 64847
29281 64847 33867 1308 -16984 22772 85135 42068 64050 39675 2730 -38386 -15389 9176
29269 9176 -26055 -52021 -15391 -14073 -56601 -51486 -32399 5255 -16049 5051 53060 7916
29257 7916 -23063 19097 -40592 -40164 -49416 -30394 -9967 2495 9835 50650 46831 19468 -12784
29244a2784o477O883n864n3025N949M9501j7472J488N5555K0215K4087K400j2681
29231E7775J8242l1330l0559p771L3313k2136N1273K9851k4926j3310m9500l3022
29219b2100K2155L6958K4095N4854q681n1321l8188j9936k8832K1228J9963O693
29207A6888l9196K2144j3834J2560L8038m5282m2168j9715j0782K7097K6781K0340
29195g129J8534n5614R096Q8610N7054l4725N9505K3301k3319o2682n1918l8995
29183a8282P1233L4824n533j8293M975R439j2881K2356k9031K0787J057l2510
29171D8141k5583j5494L0047K0270n2543K542r541k4565j5916O698K3621M7832
29159C5509K1255R115j4051r780L0841j2722l9416l8888M2787j0811N747j2p982
$$ plain form
29244 -12784 -19261 -12378 -18242 -71267 -65318 -15817 -33289 -31801 23754 43969 68056 70456 57775
29231 57775 76017 44687 14128 6357 39670 17534 68807 98658 73732 60422 10922 -22100
29219 -22100 55 37013 61108 115962 107281 55960 17772 -2164 -30996 -9768 10195 16888
29207 16888 -22308 -164 -13998 -1438 36600 -8682 -50850 -70565 -81347 -54250 -27469 -7129
29195 -7129 11405 -44209 -35113 53497 110551 75826 135331 158632 135313 72631 20713 -18282
29183 -18282 52951 87775 82242 63949 68924 78363 65482 87838 58807 79594 80651 48141
29171 48141 22558 7064 37111 57381 4838 7380 -2161 -26726 -42642 -35944 -12323 35509
29159 35509 56764 65879 51828 42048 72889 60167 20751 -18137 24650 13839 19586 19574 11592
29146A1592K6710k5030m1361J05350M8299m9705k5326J5883J2605l1300p7752
29135c0035l9746L8648Q719k0768J7230M251K6459J1086l3493R487K9914K0721
29123D2473O7678K2439o0810o110l5620r342l3363k1567K2662K6017j6245p7766
29111g9554J1958K3155L1395l27n1589K0750K6691K329J07l2266K1129K2893k1881
29098b5210N3014J6879P324M4410L4287j2030m2074j4178j7794j845k3748Q8059
29086A07094p579j04614p9343m2146K0355K2868J0900Q789K1820K8066M0057M4546
29074G0813k6224n284K8784l223n7860p436k6477K5734N7513Q7966L668j8257
29062A29717j1064k6272j6002k6549r227m9883j7219L794J4619J0709l8056l0170
$$ plain form
29146 11592 38302 13272 -28089 77261 125560 75855 50529 66412 79017 47717 -30035
29135 -30035 -69781 -31133 -22414 -43182 -25952 -21701 4758 15844 -17649 -8162 21752 42473
29123 42473 110151 132590 71780 65670 30050 20708 -12655 -34222 -11560 14457 -1788 -79554
29111 -79554 -67596 -44441 -13046 -13373 -64962 -44212 -17521 -15192 -15085 -47351 -26222 -3329 -25210
29098 -25210 27804 44683 52007 96417 130704 118674 76600 62422 44628 42783 19035 107094
29086 107094 99515 -5099 -84442 -126588 -106233 -83365 -72465 -63676 -41856 -13790 26267 70813
29074 70813 44589 39305 68089 64866 7006 -430 -26907 -1173 56340 144306 147974 129717
29062 129717 118653 92381 76379 49830 40603 -9280 -26499 -22705 -8086 2623 -35433 -65603
29050f5603j7927J8876N8362k2155Q722L4422K8516P408J9304K561K2173L9253
29038A33912N0252O7011j3469m5794m4547p0207O452l2856J2729Q331j0514l9456
29026B1844J8478j039M1725j0956o944l5888n9136K6304K1385j630l3602q212
29014b7671n0297O3211M8030P47K3897o254n4251K0569M49n1959J3477M2703k9449
29001f798N012l862K1202K9650m2125m3051k4982P8631N5545m930l2274J5185
28989D7203L9536l6573n7337K3672M503r492M8802p017m7873p365K5205K0389
28977D3653M8439L310j3412M2685j3565j7184l770J532L4457r6010j4421J4119
28965B9833M3614o9511n3107j1897N2681M3581l5947k5747j5888l6347m379L6963
$$ plain form
29050 -65603 -83530 -64654 -6292 -28447 -19725 14697 43213 50621 69925 72486 94659 133912
29038 133912 184164 251175 237706 191912 147365 77158 83610 50754 63483 71814 61300 21844
29026 21844 40322 39283 81008 70052 63108 27220 -31916 -5612 15773 14143 -19459 -27671
29014 -27671 -77968 -14757 33273 34020 57917 51663 -2588 17981 18430 -33529 -20052 22651 -6798
29001 -6798 -1786 -5648 15554 45204 3079 -39972 -64954 13677 69222 64292 32018 47203
28989 47203 86739 50166 -7171 16501 21004 11512 60314 53297 5424 -1941 23264 43653
28977 43653 92092 95402 81990 124675 111110 93926 90156 91688 126145 30135 15714 29833
28965 29833 73447 3936 -49171 -61068 -8387 35194 -753 -26500 -42388 -78735 -83114 -46151
28953d6151Q0109K8167k0639J916k3278l1347l8033J7976O1996r712q947K0355
28941C2412P282l0225p3654j4532K8974L6165L448R024k5753R572j7802M8238
28929A3149N1800n7813r9829M9286N7456l394k7576P576K4409J6816j6138o196
28917I546n2353j9897J3240Q1744k9259m7741j3073M1112J9408O1535l756l6202
28905B4304O181n149R260J6144K2453R884l3797J5292k0721q607l6278r488M350
28892f172P675m85o786j3493l2386K4363j5330k1520J4582N7231N8599k1038j1917
28879C3323k4903J549J8149l9546K2677M7385J4318j1697q5617J3056L2448M1926
28867F3068L9969J1876k2485m7158l6131m4535l2175k3588O917K8891P5447j7031
$$ plain form
28953 -46151 33958 62125 41486 43402 20124 -11223 -49256 -31280 30716 21004 12057 32412
28941 32412 39694 9469 -64185 -78717 -49743 -13578 -10130 -1106 -26859 -17287 -35089 13149
28929 13149 64949 7136 -92693 -43407 14049 10655 -16921 -9345 15064 31880 15742 9546
28917 9546 -42807 -62704 -49464 32280 3021 -44720 -57793 -16681 2727 64262 60506 24304
28905 24304 30485 25336 34596 50740 73193 83077 49280 64572 43851 35244 -1034 -10522 -6172
28892 -6172 1503 1018 -5768 -19261 -51647 -27284 -42614 -64134 -49552 7679 66278 45240 33323
28879 33323 8420 9969 28118 -11428 11249 58634 72952 61255 -24362 -11306 21142 63068
28867 63068 103037 114913 92428 45270 9139 -35396 -67571 -91159 -84242 -55351 20096 3065
28855C065k1050N3475J2335O708n9780m2938k2521n36N4944j2380k3769m290M985
28842e1752N1430L426M064j4747o1646N7279J6012l8695l6310o047n323M9070
28830c3239J1618k9688P1237Q5313J6489o1899o7355j4145L2791N8670l5245l4708
28818a61l7807k1762L0527K0777K9307N739N3056k8180r8742j2860J3476L583
28806d3047j0995R352R67k2455k4642M9463P9565l098j3239j125j7566o3096J8259
28793d1657L7819L4799p7668q6023K3974L0835K0371N3654o330p1455L9065N3463
28781A0847J2304j3008R812L3940l6205n096k1874k1162p145L8484n799k1230
28769b6132m3090K9912O3782Q3819p197l40J5536l0143P8m8536J0682O9457j4433
$$ plain form
28855 3065 -17985 35490 47825 54533 -5247 -48185 -70706 -71242 -16298 -28678 -52447 -56737 -51752
28842 -51752 -322 3104 7168 -7579 -69225 -11946 4066 -34629 -70939 -76986 -82309 -33239
28830 -33239 -21621 -51309 19928 105241 121730 59831 -7524 -21669 11122 69792 34547 -161
28818 -161 -37968 -59730 -29203 -8426 20881 26620 79676 51496 -47246 -60106 -46630 -43047
28806 -43047 -54042 -44690 -43723 -66178 -90820 -41357 38208 35110 21871 20746 3180 -59916 -41657
28793 -41657 -3838 30961 -46707 -132730 -108756 -77921 -57550 -3896 -10226 -81681 -42616 10847
28781 10847 23151 10143 19955 53895 17690 12594 -9280 -30442 -37587 897 -4902 -26132
28769 -26132 -69222 -39310 24472 108291 101094 100754 116290 86147 86225 37689 48371 117828 103395
28756A03395o4800k666J4576l9283l1734k8421P766k6873M432K5139K4895j3626
28744b7200j6684L5531K1095l3169n0669m01N1810J01061O168l6132m5687n18
28732E205L1952L2144o487k906N412m655K7652L8247j9261j160j3381L1638l9426
28719H4974k4532p5178j1701N836K3525M4785L188K4408O843J4731p0966n8897
28707c2984j7062O9200M1362j8176k1893j9346l5979J4908j1688n6956N4729K857
28695c1028q4866k525Q1699J7602j374k5492M0766L0232m4545k4731K0551N5321
28683C1610l6676q4906J6789M2540J0713M2700K7233r685j4141J0792L2074J0339
28671G9382J6997m4011k9943J5241K6944L9028r531l6537q197K7708k3642j9730
$$ plain form
28756 103395 38595 35929 50505 11222 -20512 -48933 -41167 -68040 -63608 -38469 -13574 -27200
28744 -27200 -43884 -8353 12742 -20427 -71096 -71497 -19687 81374 87542 51410 5723 5205
28732 5205 37157 69301 62814 59908 65320 60665 88317 126564 107303 106143 92762 124400 84974
28719 84974 60442 -14736 -26437 -20601 2924 47709 50897 75305 82148 96879 25913 -32984
28707 -32984 -50046 19154 60516 42340 20447 1101 -34878 -19970 -31658 -88614 -33885 -31028
28695 -31028 -115894 -118419 -36720 -19118 -20492 -45984 -5218 25014 -19531 -44262 -23711 31610
28683 31610 -5066 -89972 -73183 -30643 -19930 22770 50003 40318 26177 36969 69043 79382
28671 79382 96379 52368 22425 37666 64610 103638 94107 57570 49373 77081 53439 33709
28659C3709L4132k7611m4582o221K7748j6592K9435%o435N5513j4130l4804j1410
28646A8752P6293K9892q238j9340m0823K7870L480k7440k6264j4887M3439k1290
28634D1444M432k3906M0036J4950l4910j2964J5844j5179k9761l4504j0732J6481
28622b8769M2398m9000K4069L3732K1607N736m7563n9640O509P0217l8534r241
28610b8479J4019Q1o247q892N0782r516j5802K7470Q694P881J7353l1598J8861
28597D4607L6455k8368o7435O492J4595Q326K1810L2454o046n801j3474m2184
28585A431J7007L1315j5762p482l9921m0612L6306J2326J6614Q160k1891J4337
28573A1828k5176L4823j925j0262l473j0060j0981J1247J997J5973j0015L2603
$$ plain form
28659 33709 67841 40230 -4352 -10573 17175 583 30018 30018 23583 79096 64966 30162 18752
28646 18752 95045 124937 116699 97359 56536 84406 87886 60446 34182 19295 62734 41444
28634 41444 45876 21970 62006 76956 42046 29082 44926 29747 -14 -34518 -45250 -28769
28622 -28769 13629 -35371 -11302 22430 44037 49773 2210 -57430 -50921 19296 -19238 -28479
28610 -28479 -14460 -14379 -20626 -29518 21264 11748 -4054 23416 32110 39991 57344 25746 44607
28597 44607 81062 52694 -14741 -8249 6346 14672 36482 68936 62890 57089 43615 1431
28585 1431 18438 49753 33991 26509 -13412 -54024 -17718 -5392 11222 19382 -2509 11828
28573 11828 -13348 21475 19550 9288 5815 -4245 -15226 -3979 -1982 13991 3976 36579
28561C6579q889l9446j2845M0732L6790l4220q0556L2420K603j8261p829l9109
28549i2031m7005L2702P9023N1216j2454k7577k426K9041j8026j1136k0228J5550
28537b3351O2866j3868m869o0648j2762j1090p513M7J9697p819K0174K1828l9341
28524e6649M7078K3689q016L193J4661k0010m0871j8767Q1274P2888l2721m6656
28512A9093o6145k7729O9572p158J6971M5854L9643L1653l6501n8651m5045j3866
28500c2309k0964n059M2951L7854q705k7184l9069K4617N0433m615j9914j063
28488c027N6913J7821m2932k1605o1303m0380k304K5424L1292j2383o960J2437
28476d7007r610L8364r437m5246k8598J8216j8474L9001M8729L211M3115N8026
$$ plain form
28561 36579 27690 -11756 -24601 16131 52921 18701 -61855 -29435 -26832 -45093 -52922 -92031
28549 -92031 -139036 -106334 -27311 23905 11451 -16126 -18552 10489 -7537 -18673 -38901 -23351
28537 -23351 39515 25647 20778 -39870 -52632 -63722 -71235 -71188 -51491 -59310 -39136 -17308 -56649
28524 -56649 -9571 14118 6102 9295 23956 3946 -36925 -55692 25582 98470 65749 19093
28512 19093 -47052 -74781 -5209 -12367 4604 50458 90101 121754 85253 26602 -18443 -32309
28500 -32309 -53273 -58332 -15381 22473 13768 -13416 -52485 -27868 22565 17950 -1964 -3027
28488 -3027 53886 71707 28775 7170 -54133 -94513 -96817 -71393 -40101 -52484 -59444 -47007
28476 -47007 -56617 -18253 -27690 -72936 -101534 -83318 -101792 -62791 -14062 -10851 32264 90290
28464I0290j1337q3543J6112O9697L8919r596k2546o5138M5495M9285m2993p5744
28452a099o3739l798K9936j764K2893k2306k112k8797l7474k6586K2369l2436
28440a44913J402P7372O1203p332k0416j9k1099J2518L4712J4060J2805j374o2881
28427d3962j744l4382K5876Q0325p423o6687j9957R923K440K8111L4922j5626
28415h184J6720M3068n4735J6502J8046m3747l5458L3311Q6757l400l1506K4135
28403F1509r214k6935J92J341p1008M2781N3890J8094m6866m2270L4043M0027
28391E5584Q3525l9201j13810m0690N5836K7279J3821o835k9128n946j7189M2515
28379B5761O1682n2311q0912J3269N9118p309j3071j2647l3818J3951J9298M2669
$$ plain form
28464 90290 78953 -4590 11522 81219 120138 110542 87996 22858 68353 117638 74645 -1099
28452 -1099 -64838 -68636 -38700 -40464 -17571 -39877 -41989 -70786 -108260 -134846 -112477 -144913
28440 -144913 -143511 -66139 -4936 -12268 -32684 -32703 -53802 -41284 -6572 7488 20293 18919 -43962
28427 -43962 -45706 -80088 -54212 26113 18690 -47997 -67954 -58031 -55591 -27480 7442 -8184
28415 -8184 8536 51604 -3131 13371 31417 -12330 -47788 -14477 72280 68880 37374 61509
28403 61509 52295 25360 25552 26893 -44115 -1334 52556 70650 23784 -18486 15557 55584
28391 55584 139109 99908 -13902 -54592 1244 28523 42344 35509 6381 435 -16754 25761
28379 25761 87443 35132 -45780 -32511 26607 19298 6227 -6420 -40238 -26287 -6989 35680
28367C5680J1022J8976k9227l39j2045n153N390K0380j1974J61k8957m5254m5845
28354h7185M0674P4004M5587n0412k9875m0726k6017j7632L6306M0726R129l4181
28342c9602k666J4338L2771L186k5490K2694Q59j3521l4501k1850M4297K7798
28330H313k0864l4419N368m387l8031m7414j8858P1828J6453P6468L475n3496
28318c5564q2471k582P3871m3514N3411L8322J3208K1741N341K2008j0454j4231
28306C9086n084n8209M160Q2173J4085n2525k0944P4817L437l7747l0013k4006
28294a0770m2004k4075O4993K6501J7637l2291l7661n0659L1251M4366O3707j5418
28282C5577j6228l8487j9598K7207M5436J6372J203k043m7483n0446P526J8909
$$ plain form
28367 35680 46702 65678 36451 36112 24067 18914 24304 44684 32710 32871 3914 -41340 -87185
28354 -87185 -46511 27493 73080 22668 -7207 -47933 -73950 -91582 -55276 -14550 -5421 -39602
28342 -39602 -42268 -27930 4841 8027 -17463 5231 6090 -7431 -41932 -63782 -19485 8313
28330 8313 -12551 -46970 -41602 -45989 -84020 -131434 -150292 -78464 -62011 14457 17932 -35564
28318 -35564 -118035 -120617 -46746 -90260 -36849 1473 14681 36422 41763 63771 53317 39086
28306 39086 34002 -24207 -20047 62126 76211 23686 2742 77559 80996 43249 13236 -10770
28294 -10770 -52774 -76849 -11856 14645 32282 -9 -37670 -88329 -57078 -12712 50995 35577
28282 35577 19349 -19138 -38736 -11529 33907 50279 51482 49439 1956 -48490 -40964 -22055
28270b2055J8450n9261l5356N1772J08345O5028j759j4568p3523L811n3904q6
28258a3106j7309l011O2450k2132l1041n7471j8954M239K5709L9960M7230J3312
28246B9876N43o0629K308k4199Q178K1601J7416m7312M305K5053K2524R061j2719
28233c994j7077j1251Q484O3721k6167l576J4160l0320o2313m7614J4799L4668
28221f6480k4590m63K0071N5588J1647J1376k3653L1931j3999j3870K9597k8840
28209a1685Q246j0458J28231n568l5756p9030n5354J3946J0168p728L2770J5852
28197C634L3769K8162o4976j5136N8813J7918m0236k2575p593q616j306m9334
28185f7476K6612Q0395K3091l401m6841l4977k1494M7632O8936o1795l990K1514
$$ plain form
28270 -22055 -3605 -62866 -98222 -46450 61895 126923 125164 110596 37073 40884 -13020 -13106
28258 -13106 -30415 -33426 29024 6892 -24149 -81620 -100574 -96335 -70626 -30666 16564 29876
28246 29876 30419 -30210 -27902 -52101 -43923 -22322 -4906 -52218 -47913 -22860 -336 8725 -3994
28233 -3994 -21071 -32322 -23838 39883 13716 10140 24300 -6020 -68333 -115947 -101148 -66480
28221 -66480 -91070 -91533 -71462 -15874 -4227 7149 -16504 15427 1428 -12442 17155 -11685
28209 -11685 -3439 -13897 114334 108766 73010 -6020 -61374 -47428 -37260 -44988 -12218 3634
28197 3634 37403 65565 589 -14547 44266 62184 21948 -627 -8220 -16836 -18142 -67476
28185 -67476 -40864 39531 62622 59221 12380 -22597 -44091 3541 72477 10682 6692 28206
28173B8206k9480J980j1189j8590M9129n6911o9421J1545Q5586M7972j2548n5236
28161b8957k1602m2261N8867l029J9856j763M1116J9563r860k5545J1370o9780
28149e2025p664O5923P4821J5755k7960k8491q4146k7963M8964N35K8446j9926
28137a3731M0788L1585k2874k5203P3898L0973j734n1416L703J8121j6010o3223
28125D877q5983J6266O2298K4532o6257J5833m90L3158J6123p1486k2869M8741
28113b5257Q781k5336j6034n0676m081L6179R697j7534K074m38J7204M8363l2434
28100d9492o4381n823R2844M5718m8240m9436M883r542L3918N9660L7609o1614
28088a3896n2924K38N7398O8743K6415l0407k6787J9530o740k196m5622k2797
$$ plain form
28173 28206 -1274 706 -10483 -29073 20056 -36855 -106276 -94731 -9145 38827 26279 -28957
28161 -28957 -50559 -92820 -33953 -36982 -17126 -18889 22227 41790 31930 6385 17755 -52025
28149 -52025 -59689 6234 81055 96810 68850 40359 -43787 -71750 -22786 -22251 6195 -13731
28137 -13731 27057 58642 35768 10565 84463 115436 113702 62286 65989 84110 68100 4877
28125 4877 -81106 -64840 -2542 21990 -44267 -28434 -28924 4234 20357 -51129 -73998 -25257
28113 -25257 -16476 -41812 -57846 -108522 -112603 -76424 -66727 -84261 -82187 -82625 -65421 -17058 -49492
28100 -49492 -113873 -119696 -26852 18866 -29374 -78810 -73927 -83469 -49551 10109 47718 -13896
28088 -13896 -66820 -66582 -9184 59559 85974 55567 28780 48310 41570 39374 -6248 -29045
28076b9045J4277J4351m2903M3221L3184m8160m0393K0189K9554L4125N3085m7501
28064C3984k2327l0541o5193Q893M866M9848M9207k2905m7923j0898J3588j870
28052d1271l4584J3067n5126N1259M6166Q358j2450L357K6634n0870l5700j8870
28040a00030K5739O5431L5906M601n5527n026K14N2859L5780K6400k820M370k1332
28027F6565k299n980m2455l8398o510J344O2137K2155j8084j3724K836l2784k0594
28014b5791j6765J4577K7290Q231l3478l479j6815j8680K0167k2829k1870O9023
28002b0419P5436l3258l7213J4787Q864J8884j6861j4905p4751n6159K161R2220
27990d1214O1390n8163p9519k5386P0809R2726o447l41J6216q016m2181q534k0533
$$ plain form
28076 -29045 -14768 -417 -43320 -99 33085 -15075 -55468 -35279 -5725 28400 81485 33984
28064 33984 11657 -18884 -84077 -75184 -70318 -20470 28737 5832 -42091 -52989 -39401 -41271
28052 -41271 -75855 -62788 -117914 -66655 -20489 -12131 -24581 -21224 5410 -45460 -81160 -100030
28040 -100030 -74291 -8860 27046 31647 -23880 -28906 -28692 24167 59947 86347 83527 87897 66565
28027 66565 64266 58286 15831 -22567 -29077 -27733 34404 56559 38475 24751 27587 -5197 -25791
28014 -25791 -42556 -27979 -689 7542 -25936 -29415 -46230 -64910 -44743 -67572 -89442 -20419
28002 -20419 55017 21759 -15454 -667 8197 27081 10220 -4685 -79436 -135595 -133434 -41214
27990 -41214 20176 -37987 -117506 -142892 -72083 20643 14196 13855 30071 22055 -20126 -28660 -49193
27977d9193j484k0014q130R309o995K3078J8807o327L2685J5698k7188j9049J947
27964c6856n9763M0058M2321n1728k2990K2004k9090N4934K8224l9714m3194J4293
27952h1501J0811l502N2236K6214J3209L9516l4413m0035p8901k1012l104J2116
27940a08366L3323m1306J5012K0687l2543k074J659K5859K5795j719K756N7812
27928c105O691j6565Q920l5762j8086L4958m4547k9122R228K9881l6470m1854
27916a35833L9640N7726M5523l0398J0633K3096k2826J0156J359M694l3017L598
27904b5649O2979j4702l3491J7898J7598k1760o216k8305K809p544n772j04L8236
27891d023K5449J7494N4669k0392K9907J0062j8902q5064m5312P067J3254k4021
$$ plain form
27977 -49193 -50677 -70691 -78821 -69512 -76507 -53429 -34622 -40949 -8264 7434 -19754 -38803 -36856
27964 -36856 -96619 -56561 -14240 -65968 -88958 -66954 -96044 -41110 -12886 -52600 -95794 -81501
27952 -81501 -70690 -74192 -21956 4258 17467 56983 22570 -17465 -96366 -117378 -120482 -108366
27940 -108366 -75043 -116349 -101337 -80650 -113193 -115267 -113608 -87749 -61954 -63673 -60917 -3105
27928 -3105 3586 -12979 -4059 -39821 -57907 -22949 -67496 -96618 -87390 -57509 -93979 -135833
27916 -135833 -96193 -38467 7056 -23342 -12709 10387 -12439 -2283 -924 3770 -29247 -25649
27904 -25649 37330 22628 -10863 7035 24633 2873 -3343 -31648 -28839 -36383 -42155 -42259 -4023
27891 -4023 21426 38920 93589 73197 103104 113166 94264 9200 -36112 -29045 -15791 -39812
27879c9812m8617p404M2623j2109L1641N7346K186k0898m6701l0605m234J3323
27867f3261N2047K8651M1290j3774m8410n3873J5806Q7254l9518P908p217J756
27855H659K7912r697K113K2475J2135m4629o8604m4011K1926L3673K7213q89K7286
27842A5562j7384l4005K3132Q7872K5236l7131l1186o5767o697K8568O4157K7218
27830G9575l651r0832l3691J057k0699m829M985m6078K3939n714m1848N0790J1977
27817g5019L28Q6367j0983k0771k2738k3854J7294L2656L0551J0622L0031K6380
27805H0864j8321m6152K2957k0298j4145O4305L8879L1268k5013n4578l8776p1338
27793e0348j5210J2945M9066N4652N1615l3214o4001k1981L850R43k2751K1673
$$ plain form
27879 -39812 -88429 -95833 -53210 -65319 -33678 23668 25854 4956 -41745 -72350 -76584 -63261
27867 -63261 -11214 17437 58727 44953 -3457 -57330 -41524 45730 6212 14120 6903 8659
27855 8659 36571 26874 28987 51462 63597 18968 -49636 -93647 -71721 -38048 -10835 -11724 15562
27842 15562 -1822 -35827 -12695 75177 100413 63282 32096 -33671 -40368 -11800 52357 79575
27830 79575 75924 -14908 -48599 -47542 -68241 -73070 -68085 -114163 -90224 -95938 -137786 -86996 -75019
27817 -75019 -74691 11676 693 -20078 -42816 -66670 -49376 -16720 13831 24453 54484 80864
27805 80864 62543 16391 39348 19050 4905 69210 108089 139357 114344 59766 20990 -50348
27793 -50348 -65558 -52613 -3547 51105 102720 69506 5505 -16476 -12626 -11683 -34434 -12761
27781a2761k4145q470M8773q210k270o430m1803n2878l5833l289K6454Q8789J1609
27768b0464K1324k9342l6352j6302J1152k1318m9964P0889O5911N547L1874P784
27756D0739L3533m028q2826l4444n384q784j1064M0802m283m2915J1582k2948
27744i0020J2493L8908P811k0699m3728K0013P5779J0635l5910M729K0158k7719
27732b7550j0595J6401j8459m3455m136L2720L5502J5754p142R639J2157M3461
27720E4297J5746j4114j9473l7099L536k241l3801M7967L1394j0098j0537k7369
27708a792n6926N8723J8582J2652J8967j5964j8743k0089m7657M2054M1713o415
27696B5105m0769Q010M1589K9983N451j0882L007j0392o988K753m6059k5361J5047
$$ plain form
27781 -12761 -36906 -45376 3397 -4813 -7083 -13513 -55316 -108194 -144027 -147316 -120862 -32073 -20464
27768 -20464 860 -28482 -64834 -81136 -69984 -91302 -141266 -70377 -4466 1081 32955 40739
27756 40739 74272 70244 -12582 -47026 -52410 -61194 -72258 -31456 -35739 -78654 -67072 -90020
27744 -90020 -77527 -38619 -30808 -51507 -95235 -75222 557 11192 -24718 -19989 169 -27550
27732 -27550 -38145 -21744 -40203 -83658 -87794 -55074 -19572 -3818 -10960 -1321 10836 54297
27720 54297 70043 55929 36456 -643 2893 652 -33149 14818 46212 36114 25577 -1792
27708 -1792 -58718 5 18587 31239 50206 34242 15499 -4590 -52247 -10193 31520 25105
27696 25105 -15664 -7654 33935 63918 69369 58487 61494 51102 44114 46867 808 -24553 -9506
27683i506j4508J6354k0854K0276j0200J9706K0231J4966O8230j4307m3505n9078
27671a2195L3697N2674M9070j8120n8875m1163k6639p7087N5957k3782j9279j1191
27659i6933O536R0154N8031l8654m5741J4343N6996n1464O34N289J4670j5925
27647b064m0269o1487J8618L5572L088k4470J8985R3605K0685j8517q9301m5454
27635i1009k4437Q867M6470N466j3669L683K3977L2702K1481K9157k5264j2817
27623D607r661k0869N878L4160J4926k2519j4112J330j6601N11O7221K056N97
27610D7524l5567J6378j4275l6233K0021m2668N6075L309k2899J7849L657q659
27598D512l4020l2394P1196K7399j9020j0964M3817J0584N233q339m6379k3067
$$ plain form
27683 -9506 -24014 -7660 -28514 -8238 -18438 1268 21499 36465 104695 90388 46883 -12195
27671 -12195 21502 74176 123246 105126 46251 5088 -21551 -98638 -42681 -66463 -85742 -96933
27659 -96933 -90397 -243 57788 19134 -26607 -12264 44732 -6732 -6098 -809 13861 -2064
27647 -2064 -42333 -103820 -85202 -49630 -46542 -71012 -52027 41578 62263 43746 -45555 -91009
27635 -91009 -115446 -106579 -60109 -54643 -68312 -64629 -40652 -7950 13531 42688 17424 4607
27623 4607 -5054 -25923 -20045 14115 29041 6522 -7590 -6260 -22861 -22350 44871 46927 47524
27610 47524 11957 28335 14060 -22173 -2152 -44820 11255 14564 -8335 9514 13171 4512
27598 4512 -29508 -61902 9294 36693 17673 6709 50526 61110 66343 58004 11625 -11442
27586a1442J1946j7693J7746J6829j0712m604k801J7298N3659K7694q034n5225
27574C4661M1472K4358r3541k1668j1503L181N5109J2867k57N2401j067k1588
27562G4425q434k512j0442J4691o019q0822J7339J8363k599m8244K2014o675R381
27549i534k0093L6118q576k1656k5670P1601k6498k4816N2110p734p7347K4737
27537c7358J5608N4142k8448M1398L3594m9493n0731o4071m130N4825O8791K0910
27525E5037m821l0624m252J8213J3169M4876j11o4278L334K6783L3732R690m2185
27512E8563p1507K1542N3271P662p6594p1124M8506L7609k3133l0165K6115j3892
27500c3147j9174L4891N6209K2408l6910L3326K4251m3977N826j7782p270J9159
$$ plain form
27586 -11442 504 -17189 557 17386 6674 2070 -731 16567 70226 97920 89886 34661
27574 34661 76133 100491 6950 -14718 -26221 -23040 32069 44936 44679 97080 96013 74425
27562 74425 65991 63479 53037 67728 61709 -19113 -1774 16589 13990 -34254 -12240 -18915 -9534
27549 -9534 -29627 6491 -2085 -23741 -49411 22190 -4308 -29124 22986 15252 -62095 -37358
27537 -37358 -21750 32392 3944 45342 78936 29443 -21288 -85359 -89489 -34664 34127 55037
27525 55037 50216 19592 15340 33553 46722 91598 91487 27209 30543 57326 91058 100748 58563
27512 58563 -12944 8598 61869 69531 -7063 -78187 -29681 7928 -15205 -45370 -19255 -33147
27500 -33147 -52321 -17430 38779 61187 24277 57603 81854 37877 43703 25921 18651 37810
27488C7810j3599k3745k2125M9582M279j5519j1270q7785K1555N8126R1686J368
27476I0363o5304j0660j4351Q192J8061P994m7592n5390K4210K2186L1518k6158
27464a6931j2795O2359J6341J9571m3324l9050K7038J8395P3894P616m549J6798
27452A25363l9059n4035k8149J9495o0593j9073M6649K4598k5592k2304J6850
27441a5850L1716M023k6760N5494l1627k8536k0969K3838L9537K0279K7127P592
27429H5864p1130j3507L4934l6986k8760N7547J8779k5074J5139n0276l5759n408
27417e4637K8304N2268N617K3334n5300M6665K9134o1289q9641L9240M0024n466
27405a747k7336K3570K5755j463k5285k399K4295j9095m317J5475L133j8223J6605
$$ plain form
27488 37810 24211 466 -21659 27923 32202 16683 5413 -82372 -60817 -2691 88995 90363
27476 90363 25059 14399 48 8240 26301 34295 -13297 -68687 -44477 -22291 9227 -16931
27464 -16931 -29726 32633 48974 68545 25221 -13829 13209 31604 105498 113114 108565 125363
27452 125363 86304 32269 4120 23615 -36978 -56051 -9402 15196 -10396 -32700 -15850
27441 -15850 15866 19889 -6871 48623 16996 -11540 -32509 -8671 30866 51145 78272 85864
27429 85864 14734 1227 36161 -825 -29585 27962 46741 21667 36806 -13470 -49229 -54637
27417 -54637 -26333 25935 31552 54886 -414 46251 75385 14096 -75545 -36305 3719 -1747
27405 -1747 -29083 -5513 20242 18779 -6506 -8905 15390 -3705 -8022 7453 10586 -7637 8968
27392H968k5389j12917k2333N9632L1495P8353L1181J908K416l6613k5068R90
27380g377n0093O652L2977M5839J7886l1909J0671j9699j4731N4129K5677M2854
27368A12876k9667j1660l5872k0890M3358L3209k5274N401n9575n4370M705P1706
27356C3947N331j8969o4220l2024J6303K1462L2603L8520N2273L4735p6283l9717
27344C961j3205L2125j0992p7107j2754J18495J4876l0594k3643J2334K5684p1608
27332c2428M5066N2339j6482K570P417k6797j5291L2300J3194k4109n5977k0483
27320c8681M5088J5121L6038o515J3188L7344k7140j1759k2547j4810l8752Q837
27308d588p2741l6671J3450J4593l6178M8727k6540P5922N7395J1648l2878k0852
$$ plain form
27392 8968 -16421 -129338 -151671 -92039 -60544 17809 48990 50898 53314 16701 -8367 -7377
27380 -7377 -57470 -50818 -17841 27998 45884 13975 24646 4947 -9784 44345 70022 112876
27368 112876 83209 71549 35677 14787 58145 91354 66080 71481 11906 -42464 -37759 33947
27356 33947 39278 20309 -43911 -75935 -59632 -38170 -5567 32953 85226 119961 43678 3961
27344 3961 -9244 22881 11889 -65218 -77972 40523 55399 24805 1162 13496 39180 -32428
27332 -32428 12638 64977 48495 51065 58482 31685 16394 48694 61888 37779 -18198 -38681
27320 -38681 6407 21528 57566 51051 64239 101583 74443 62684 40137 25327 -13425 -4588
27308 -4588 -77329 -114000 -100550 -85957 -122135 -73408 -99948 -24026 33369 45017 12139 -8713
27296h713j7594n074M0983N097k363m7943j9182O2497l1971l5329N5885K0534
27284A6827l0688j7098L329O335N5177J5280L738J3148l8454m5920l4082k9940
27272h2348P5823K2804j3184m7363Q851J8205M2676K552l1j064K8264p300m3416
27259D469l9055k3121J6087l2920M9504N6219n513k326q2381m7978L9623K3210
27247d4182M92Q7832J5282r1854r825K7702L3564L0473k0095p080M546K2612o883
27234D2584J0827L8779l9583o2491O707L3451j0829K66O15J2604K1615J3802L0104
27221I8451l2501m5139L4818n0J0146O7130m5661j01927p4292k9913J630o589
27209a23897M7813O7047K6073j0642l0173m6612J1338J1488J9157o4151j6828
$$ plain form
27296 -8713 -26307 -31381 9602 14699 12336 -35607 -54789 7708 -24263 -59592 -3707 16827
27284 16827 -13861 -30959 -27630 -21295 33882 49162 52900 66048 27594 -18326 -52408 -82348
27272 -82348 -6525 16279 3095 -44268 -35417 -17212 25464 28016 27985 26921 55185 47885 4469
27259 4469 -34586 -57707 -41620 -74540 -25036 31183 25670 23344 -59037 -107015 -67392 -44182
27247 -44182 -43690 44142 59424 -32430 -42255 -14553 19011 49484 29389 22309 26855 49467 42584
27234 42584 53411 92190 52607 -9884 -3177 30274 19445 19711 20326 32930 54545 68347 98451
27221 98451 65950 20811 55629 55579 65725 132855 87194 -14733 -89025 -118938 -117308 -123897
27209 -123897 -76084 -9037 17036 6394 -23779 -70391 -59053 -47565 -28408 -92559 -109387
27198a09387O695K9062J1152M5008J4877L273J6141K248j0034j9893k0567l1979
27186f3404K8111J3453P232N374Q840P2407M836o071k3239r127K325k8689L256
27173A5304K1583K8867n8043l7692n234k6024J4572J4507m1672k9725K2961J3258
27161f7338N0280K2732n771P748K2232N0578o4164k5584L46m2777j4413K4534
27149d1597J7560l0467J959l542K5851l3863J9520N9848o629j8951j8152o0955
27137h9418K944K0470J3747K026l1756K2680K5943L5273k710K6881M229L112j6838
27124A6583q1369J2937Q5K3901k9040n463J02974N1935o550J1210o3182l1495
27112B526R782j7369q504j0800J239K870L1547m1591k3147N1775p065r4292k7688
$$ plain form
27198 -109387 -102692 -73630 -62478 -17470 -2593 680 16821 19069 9035 -10858 -31425 -63404
27186 -63404 -35293 -21840 -14608 -9234 -394 72013 76849 70778 47539 38412 40737 12048 15304
27173 15304 36887 65754 7711 -29981 -35215 -61239 -46667 -32160 -73832 -103557 -80596 -67338
27161 -67338 -17058 5674 -97 7651 29883 80461 16297 -9287 -8941 -51718 -66131 -41597
27149 -41597 -24037 -54504 -52545 -56087 -30236 -64099 -44579 15269 8640 -10311 -28463 -89418
27137 -89418 -86474 -66004 -52257 -50231 -81987 -59307 -33364 1909 -801 26080 30309 33421 16583
27124 16583 -64786 -51849 -51764 -27863 -56903 -62366 40608 92543 85993 97203 34021 2526
27112 2526 12308 -5061 -13565 -24365 -23126 -20256 11291 -30300 -53447 -1672 -8737 -103029 -130717
27099a30717R691L7627k4756k4988J0267o696Q956m210Q462M4682k6823k3503
27087a22008O61N6974L2130M3206m268j2734n1683l3317L1365P114L7063L7776
27075B2279l0680l9538j6292j1312K6013N4521j7901J6733L5871J6680k8855M8894
27063G6413N7074m7134m920m1951o1724K0490J1103o4270K4206M1148N114K6028
27051D1577K5388l3148l667n8602k4455L3932J5134j4270K6818J3913O51l4411
27039a1140J9809M5108l9822k0830K4990O2327q303O61k3073L6416k941l8706
27027D4496q9498o4593J5662Q7446R2977K9641o5705l2421n406j9791O2334J079
27015E6221j7686J844J7563J0298k5381k8926l5865m7039J7827J5894K2989N6504
$$ plain form
27099 -130717 -121026 -83399 -108155 -133143 -122876 -129572 -120616 -124826 -116364 -71682 -98505 -122008
27087 -122008 -121347 -64373 -32243 10963 6695 -6039 -57722 -91039 -59674 -52560 -15497 22279
27075 22279 -8401 -47939 -64231 -75543 -49530 4991 -12910 3823 39694 56374 27519 76413
27063 76413 133487 86353 81433 39482 -22242 -1752 9351 -54919 -30713 10435 15549 41577
27051 41577 66965 33817 30150 -28452 -52907 -18975 -3841 -18111 8707 22620 23271 -11140
27039 -11140 8669 53777 13955 -6875 18115 80442 72139 72800 49727 86143 83202 44496
27027 44496 -45002 -109595 -93933 -6487 86490 116131 50426 18005 12599 -7192 55142 56221
27015 56221 38535 40379 57942 68240 42859 13933 -21932 -68971 -51144 -35250 -12261 44243
27003D4243K5333j3054m9793j2637k1611l270N7725M0314k1840k1742o0229p623
26991d4184K2755l3712N286K9910k59N1686l9538j9852L9564k076N835O927K7031
26978D9373J2814m5920n2210j1806J9177Q3074N9171l3110q653k373K4240m9264
26966D4513n9241J888N2875K3118K988l6008Q37p53k9019L0j8758l0572J9076
26953b9026J9418J0524P1942J4893k8730j8308m0000k7745J6542L3205j5021l593
26941D101K070n9444J0695K8628n1330K3124M8428k1816K4728L6816M382k0063
26929C0319l8483k2360m1227l6439J05004n210o4374O439q310L6063M4397j2321
26917f502n9066j2458P2171O7587l508l2945p8515m190J8139k2858j3304K3786
$$ plain form
27003 44243 69576 56522 6729 -5908 -27519 -30789 26936 67250 45410 23668 -36561 -44184
26991 -44184 -21429 -55141 -49855 -19945 -20204 31482 -8056 -27908 11656 9580 15415 22342 49373
26978 49373 62187 16267 -35943 -47749 -28572 54502 113673 80563 71910 69537 93777 44513
26966 44513 -14728 -12840 40035 63153 66141 30133 30970 30217 1198 1228 -17530 -48102 -29026
26953 -29026 -9608 916 72858 87751 59021 40713 713 -27032 -10490 22715 7694 4101
26941 4101 6171 -53273 -42578 -13950 -65280 -42156 6272 -15544 9184 46000 50382 30319
26929 30319 -8164 -30524 -71751 -108190 -3186 -8396 -72770 -66331 -74641 -38578 5819 -6502
26917 -6502 -65568 -78026 -5855 61732 58224 25279 -53236 -57426 -39287 -62145 -75449 -51663
26905e1663M1025J1303L0389j1522n1872r800m3577R124N8216P6155k4718m3355
26893a0295L340M3050k0977M4652J0410n9959n3662J8474R2069P5171r499L4072
26881A66846p841n0868n9591k7294L195m6684l8273O298N4605j1225j9210K2713
26869g329Q1848N0165p6468p8106L110K1876l2332j5997L3418L6703M001m780
26857A6109N6733j3028l8090m0650l1354l574P2451N2103R934p1045j1705K4738
26845B2622n4421k4980o0619K2979K6437j4052J9059P5001j2231p508l0711k0896
26833e9320k1741M3305K5622k5029n7947l5454N9192O3387N2078L3668l2461n4310
26821i010k5013L5873J360J1681k9468m490k6257j4669r174L9520R740j2624k5471
$$ plain form
26905 -51663 -10638 665 31054 19532 -32340 -42140 -85717 -76593 -18377 57778 33060 -10295
26893 -10295 -6955 36095 15118 59770 70180 10221 -43441 -24967 67102 142273 132774 166846
26881 166846 159005 108137 48546 21252 24447 -22237 -60510 -54212 393 -10832 -30042 -7329
26869 -7329 74519 124684 48216 -29890 -26780 -4904 -37236 -53233 -19815 16888 20889 16109
26857 16109 72842 59814 21724 -18926 -50280 -53854 18597 70700 80634 9589 -2116 22622
26845 22622 -31799 -56779 -117398 -94419 -67982 -82034 -62975 12026 -205 -7713 -38424 -59320
26833 -59320 -81061 -37756 -12134 -37163 -95110 -130564 -71372 -7985 44093 77761 45300 -9010
26821 -9010 -34023 1850 3210 14891 -14577 -19067 -45324 -59993 -69167 -29647 -19907 -32531 -58002
26808e8002m003M5657Q6896J8534l2659K6076n0771q422K1076p535k3782m0746
26796b7681n3132n1660j2790K3623n452l8534R3557K8671R7505M439l6475K0655
26784D2726K6164p292m7776m5951J885L0379l0918j3813m5735L1924P8359m4202
26772b4250P617q008q002J1423l2618q188N2068P122r294j051n204N9443P316
26759D8374N438n4371l0837j8556m9689l0604L4532O8751M0271j7306k2145n0547
26747g6689P0187N9934K5349r3443k7799L1268m2367r3436k0024K2561M7298K6563
26735g0598J9471Q130m0784q988J4625L8125K2465K5863K5341n0789j345K50Q53
26722a7381J1070O2677M3405l8363k7660n4144K2769K5270o1446m0502m4330P800
$$ plain form
26808 -58002 -62005 -16348 70548 89082 56423 82499 31728 23306 44382 36847 13065 -27681
26796 -27681 -80813 -132473 -145263 -121640 -127092 -165626 -72069 -43398 54107 58546 22071 42726
26784 42726 68890 61598 13822 -32129 -30244 135 -30783 -44596 -90331 -58407 19952 -24250
26772 -24250 -16633 -24641 -32643 -21220 -53838 -62026 -9958 -2836 -12130 -13181 -18385 41058 48374
26759 48374 53812 -559 -31396 -49952 -99641 -130245 -95713 -26962 13309 -3997 -26142 -76689
26747 -76689 -6502 53432 78781 -14662 -42461 -11193 -53560 -146996 -167020 -144459 -97161 -70598
26735 -70598 -51127 -42997 -83781 -92769 -78144 -40019 -17554 8309 33650 -17139 -18484 -18234 -17381
26722 -17381 -6311 56366 99771 61408 33748 -20396 2373 27643 -33803 -74305 -118635 -110835
26710a10835j7423J2410N6684K8208j7210O8046q322n6824L5489l3651n300j3935
26698f2663j4337o832r002P0958J08889K7394J935M507m0050o4865J7490l0592
26686B832K2424m834q7852m554J7431n0674J6709L954k3363K6338N3850J7624
26674a0115L3194K1472N698o2551p6997k9278J1979O5928K0489k0488K3358L4356
26662A7045N119j648k4865M372n333J4035P3893M8948j7046k7096k1298K857K4235
26649I3218J4209k0271j2931p018m3793K2113K7599q6765l7701l829n5864m7865
26637a58898L5220R4389L0719K84l2546j8356l113r841n4301L6066N1820M1398
26625A2841j4576j9759j2862j7078r989J9807K1011J2556K5276k2144k8310O4446
$$ plain form
26710 -110835 -128258 -115848 -59164 -30956 -48166 19880 11558 -45266 -9777 -43428 -48728 -62663
26698 -62663 -77000 -83832 -92834 -21876 87013 114407 116342 120849 80799 15934 33424 2832
26686 2832 25256 20422 -67430 -71984 -54553 -105227 -88518 -84564 -107927 -81589 -27739 -10115
26674 -10115 23079 44551 50249 -12302 -89299 -118577 -106598 -40670 -20181 -40669 -17311 17045
26662 17045 22164 20516 -4349 23 -5310 8725 82618 131566 114520 87424 66126 68983 93218
26649 93218 107427 87156 74225 67207 23414 45527 73126 -13639 -51340 -55169 -111033 -158898
26637 -158898 -123678 -29289 1430 1714 -30832 -49188 -52301 -62142 -116443 -80377 -28557 12841
26625 12841 -1735 -21494 -34356 -51434 -61423 -41616 -20605 -8049 17227 -4917 -33227 31219
26613C1219K3973M0137Q101k1270q1562o1590J3327L1261K375J986j2247J2215
26601a2075j1657q888N7022K3619n0992p407M529J09827J6814m9658J1519j8910
26589F3743p5465k5742n2705Q2911L4297k8534k9264k641l959L5006M4179k6803
26577A5023n3679n570k3639j5927K9828L9392j7767K0489Q3890K6000o2051n5139
26565a9150M4520O96j3697q3995m3493M341P9477P0415K9786K13k9609m2577J8010
26552A4937J8999Q661j0208k1501n3470L983O2735K8439m989p216l0253j4262
26540d145n2849L0146J0108p488j6644k2915L7450L9320J19978L5688l0013l9051
26528I9585l5185n2588l1413J0008P944k041J8308K4459R170m4123n7225L0632
$$ plain form
26613 31219 55192 95329 103430 82160 598 -60992 -47665 -16404 -14029 -12043 -24290 -12075
26601 -12075 -23732 -32620 24402 48021 -2971 -10378 -5849 103978 120792 71134 82653 63743
26589 63743 -11722 -37464 -90169 -7258 27039 -1495 -30759 -33400 -37359 -2353 41826 15023
26577 15023 -38656 -44226 -67865 -83792 -53964 -14572 -32339 -11850 72040 98040 35989 -19150
26565 -19150 25370 26066 12369 -71626 -115119 -110778 -31301 39114 68900 69113 39504 -3073 14937
26552 14937 33936 42597 32389 10888 -42582 -38599 24136 52575 47586 40370 10117 -4145
26540 -4145 -56994 -26848 -16740 -24228 -40872 -63787 -26337 12983 132961 168649 138636 99585
26528 99585 64400 11812 -19601 -9593 -1649 -3690 14618 39077 48247 4124 -53101 -22469
26516b2469L1411j82p771j0098L1763j985K373P530l3234k0316k4794N4492M910
26503A1630m4380j3207N109l3525L4990R0724k858l5824l5090k1778J9948J1319
26491a2942M004k9228L4624q724J0505L3349k0313k0208j6335k1450N6822l141
26479F963j8786m3612m1737J735K6485J3332M668j5903j0600L5148L2865j0190
26467a9632k7092j8701L2216M6652J0742n5627l1758j8062o310M3565L338j2897
26455e3566J2914L105L1638L458O9781L3641n1101L2862j4516j1542k1676J3689
26443D8687J4076o0086m3285o648O91K9614p447o916j1074l320k5018j3307J9692
26430f4341J3118k9543j5062m485R1972J11225j4906q8745l4899L9962O6174p118
$$ plain form
26516 -22469 8942 8760 989 -9109 22654 20669 23042 30572 -2662 -22978 -47772 6720 11630
26503 11630 -32750 -45957 -40848 -74373 -39383 51341 48483 12659 -22431 -44209 -24261 -12942
26491 -12942 -8938 -38166 -3542 -12266 -1761 31588 11275 -8933 -25268 -46718 10104 6963
26479 6963 -11823 -55435 -97172 -95437 -68952 -55620 -50952 -66855 -77455 -42307 -9442 -19632
26467 -19632 -46724 -65425 -33209 13443 24185 -31442 -63200 -81262 -87572 -44007 -40669 -53566
26455 -53566 -40652 -37547 -5909 -2451 67330 100971 49870 82732 68216 56674 34998 48687
26443 48687 62763 2677 -40608 -47256 -46565 -16951 -24398 -31314 -42388 -45708 -70726 -84033 -64341
26430 -64341 -51223 -80766 -95828 -100313 -8341 102884 87978 -767 -35666 4296 70470 63352
26418F3352j9960O460J9785J3554K211n3392o947P8677q417l4491m3321o9272
26406e1761n2486L6191O5572j1304o6468k1045N5181L3531R555O6123J7173L9735
26394A19997K2122n7537n895l2111M9194l9084j3295j18n2611j7257j1739j0491
26382d8825N408O199K4261L421K40k5825l6295j05596p953J2306J0771M4264R1661
26369b5963m170N50J561J1212j0498l8906m3104N418R861N2332m6756K8125j2204
26356g2542N122L8162O065Q665O3166m3094l1659k7518m7062m1491N9144L4759
26344d8283j244r58j5102Q818K0791M2574q5449o101M5263j5992K8449N2850M2457
26331F8073o398J0139j4416j03014J1298L3497j221j2608r866n2124p676L9446
$$ plain form
26418 63352 43392 49852 69637 83191 85402 32010 25063 103740 95323 60832 17511 -51761
26406 -51761 -104247 -68056 -2484 -13788 -80256 -101301 -46120 -12589 -3034 63089 80262 119997
26394 119997 142119 84582 78687 46576 95770 56686 43391 43273 -9338 -26595 -38334 -48825
26382 -48825 -43417 -37218 -12957 -9536 -9296 -35121 -71416 -177012 -184965 -172659 -161888 -117624 -25963
26369 -25963 -30133 -29583 -28022 -16810 -27308 -66214 -109318 -103900 -94039 -41707 -88463 -60338 -72542
26356 -72542 -67420 -29258 -23193 -14528 48638 5544 -26115 -53633 -100695 -142186 -83042 -48283
26344 -48283 -49527 -50485 -65587 -56769 -35978 6596 -78853 -84954 -39691 -55683 -27234 25616 68073
26331 68073 61675 71814 57398 -45616 -34318 -821 -2042 -14650 -24516 -76640 -84316 -44870
26319d4870O6028M9135r82o8526l5482L3476L720r106j7662k833k4385J5529K3343
26306a2615M145k6716l1195k9509Q015R9098L9713J0849n3869l0859j4182m6758
26294h3883N9140J7494R20j5813K0218j08236P488L2955L7146L030m720L3759
26282e02N9004j7685N222J2960L0488O981j9657j0354l7448k4166k9278k0842
26270d5277M179J1895K7227N5660M1497l1645N147P164K3123n6741q0233M6070
26258H066Q7678R065m4268q436m4204O635K1644K3567j8679j7666L4377O1083
26246A18862m6252l2113M7885o4385q1850Q780L4071J4862P897l5902J9762j9000
26234b7383J8198J6641j933L434L6012K6386j44j6745q2048k864M3642K0532m9653
$$ plain form
26319 -44870 21158 70293 69311 785 -34697 -1221 2499 -6607 -24269 -27102 -51487 -35958 -12615
26306 -12615 -8470 -35186 -66381 -95890 -87875 11223 50936 61785 7916 -22943 -37125 -83883
26294 -83883 -24743 -7249 -6329 -22142 -1924 -110160 -102672 -69717 -32571 -29541 -34261 -502
26282 -502 58502 40817 46039 58999 89487 96468 76811 66457 29009 4843 -24435 -45277
26270 -45277 -41098 -29203 -1976 53684 95181 63536 68683 75847 98970 42229 -38004 8066
26258 8066 95744 104809 60541 52105 7901 14536 36180 59747 41068 23402 57779 118862
26246 118862 72610 40497 88382 23997 -57853 -49073 -15002 -140 7757 -28145 -8383 -27383
26234 -27383 -9185 7456 5523 8957 44969 71355 71211 54466 -27582 -30446 13196 33728 -15925
26221a5925k4086M8642J2130K1239J4959l2641k8100j7159k4845k1419L6593N5191
26209B4579r270m8251l3912k2221L3596M7376Q2049r875j3116R306l2197n9562
26197c1498m6470L4892J06509K6151l6507k2574O221K5754k1994l2723L3284J01778
26185A42823k4513p3979l2685L118k974K5541k9871k4100L2311j1102j2869j4354
26173b2654J4216K4941o6808n1684J6799K9070J87K1878J0933J6519M0175L324
26161C6896l6139q646k4487n6654L0475J6834m2398J6305M7037o218p149M9500
26149A5356m1954L3827L253J7632j0852l02M4554J9278j354r6925j4489L9474
26137G498N0652J3908n3197k0507l941n3530J351N7325K8738K5483J550q809o219
$$ plain form
26221 -15925 -40011 8631 20761 42000 56959 24318 -3782 -20941 -45786 -67205 -30612 24579
26209 24579 15309 -32942 -66854 -89075 -55479 -8103 73946 64071 50955 60261 28064 -31498
26197 -31498 -77968 -43076 63433 89584 53077 30503 36724 62478 40484 7761 41045 142823
26185 142823 118310 44331 11646 14764 11790 37331 7460 -16640 15671 4569 -8300 -22654
26173 -22654 -8438 16503 -50305 -101989 -85190 -56120 -55933 -34055 -23122 -6603 33572 36896
26161 36896 757 -7889 -32376 -89030 -58555 -41721 -84119 -67814 -20777 -26995 -34144 15356
26149 15356 -26598 7229 10482 28114 17262 16960 61514 80792 79438 -17487 -31976 7498
26137 7498 58150 72058 18861 -1646 -5587 -59117 -57766 -441 28297 53780 55330 46521 40302
26124D0302k6448k3397m2490L510K1937m474n832N6115O793m5133j8047j1589
26112d8753O9177L029m1041k9320n424K5838j0488j0266j6554j2315J689n9074
26100a33502k3915L1252k832K0828J5051R866J9062j4971k747o0013N4056N6544
26088c1321R510K2714O4490r296Q240n3331l1276J196K0369j0613O1006M483L6699
26075I2870l5720m4995j7561L3421j4067j8944o129k9789o188L7109O8208j1965
26063D6250m256M4464Q509r84j6783l9125n27m463j5260j2568m7829K4010K9829
26050A1267N3383K5599l4575K6691P002n7985K660K2789k3793k6248k5070L4639
26038A6359L6252J6918m1784k979J5268l9194K8524j9653m798L3146K1622j2617
$$ plain form
26124 40302 13854 -9543 -52033 -48523 -26586 -31060 -36892 19223 26016 -19117 -37164 -48753
26112 -48753 20424 23453 -17588 -46908 -52332 -26494 -36982 -47248 -63802 -76117 -74428 -133502
26100 -133502 -157417 -126165 -128997 -108169 -93118 -83252 -64190 -79161 -81908 -141921 -87865 -31321
26088 -31321 -21811 903 65393 56097 64337 11006 -20270 -19074 1295 -9318 51688 56171 92870
26075 92870 57150 12155 -5406 28015 13948 -4996 -11125 -40914 -47102 -9993 58215 46250
26063 46250 41994 86458 94967 93983 77200 38075 37548 33085 17825 5257 -42572 -18562 11267
26050 11267 64650 90249 55674 82365 89367 31382 34042 56831 33038 6790 -18280 16359
26038 16359 52611 69529 27745 24766 40034 840 29364 9711 4913 38059 59681 47064
26026D7064k5462l4722m7672j7199J8703J6488k92N3699R1059L928J6870n5862
26014F6602q2866M268N3552m8149k6490L2565O914o867Q982L8768Q464M522j3302
26001D6963O1213r846l3516o4959o2882m2085l0376O1130N495l5763m7088N1761
25989i9953N8427k405J0982J7439M1148K1957l5215l6999L2326J1617J2039j1861
25977A9502M4678K0790o6316N8177K4739p5023l0232l171r846M996Q1487K3323
25965I3104p3577m3500q273M1721N807j7876K8788l8935K96J5350J8651R1477
25953A13033K1185m4291j7914J0451N726r888m6010R2488Q0407j0599o6672L4938
25941A62854K3348j1975n6032j16310L595N012L1091M9931l8772o2448R657L39
$$ plain form
26026 47064 21602 -13120 -60792 -77991 -59288 -42800 -43092 10607 101666 105594 122464 66602
26014 66602 -16264 -11996 41556 -6593 -33083 -518 6396 -471 8511 47279 55743 60265 46963
26001 46963 108176 98330 64814 -145 -63027 -105112 -135488 -74358 -68863 -104626 -151714 -99953
25989 -99953 -41526 -43931 -32949 -15510 25638 47595 12380 -24619 7707 19324 31363 19502
25977 19502 64180 84970 18654 76831 101570 26547 -3685 -6856 -16702 -11706 69781 93104
25965 93104 19527 -23973 -32246 9475 15282 -2594 26194 -12741 -12445 2905 21556 113033
25953 113033 134218 89927 72013 82464 88190 78302 32292 124780 205187 194588 127916 162854
25941 162854 186202 174227 118195 1885 5480 10492 41583 91514 52742 -9706 -49 290
25929B90J3951K4772l5364N681P702l9852J8205J802O1732R6423M1629k3923m8662
25916A24386k6270K9454m7558n0946j4268N0809K5718j6176L6314m6191m8300
25905A6972n039R771J6881j7509J8342Q06M7142K093p847J4886o5999J3662O6010
25892A10171m645N535q1341j7465l3097J0177L7459L034K0849m2893J606j6060
25880f670j1516M232q183O2602O7195J6116R264j3495J1662L3229J2055j14057
25868F2434o7673K3083P798m857j7277j056o8110r539L4223N7013M6784L5298
25856I8121L9082j6144m4734m5521P136J6041J9338J5752k9535k4146k7381k5247
25844a7238M3275O9810P2084o7337J08o6858p5191j788J5710L5218J7565k6795
$$ plain form
25929 290 14241 39013 3649 9330 17032 -22820 -4615 -2813 58919 155342 196971 173048 124386
25916 124386 98116 127570 80012 29066 14798 65607 91325 75149 111463 65272 16972
25905 16972 11933 21704 38585 21076 39418 40224 87366 89459 81612 96498 30499 44161 110171
25892 110171 105526 111061 29720 12255 -20842 -10665 26794 29828 50677 7784 9390 -6670
25880 -6670 -18186 -13954 -22137 40465 107660 123776 133040 119545 131207 164436 176491 62434
25868 62434 -5239 17844 25642 20785 3508 2452 -65658 -75197 -40974 16039 62823 98121
25856 98121 137203 121059 76325 30804 37940 53981 73319 89071 59536 35390 8009 -17238
25844 -17238 26037 95847 167931 100594 100702 33844 -41347 -43135 -27425 7793 25358 -1437
25832a437M5157M2886k7710k1756L3715J9037N998p2378p667L0578L2955K8022
25820A07400n1378n9050k2346M191M7361l3544n6126Q88L4403M7034O7702j2772
25808G3763J2063j0322L5652J4144q5992q9211p5483J45376M6033l9139k4079
25797B805L8570M713l0045k2668l1430M6249N404j230L2014J964j1890K2426j0355
25784D6527J8288q384k4484k2675l296L4506K7869j0703J6131k093J600k6580
25772D6706L3082j9315M3921K0910J2344k3942n1351l3879K1204M8209K5242R211
25760A32342l3713n6952m3747K7975K657n2088l127N6982M7973k7888k5552K9652
25748E4514o6161o5212q283j2337l9635K2421L028J2600K1219L5293R958o8542
$$ plain form
25832 -1437 43720 86606 58896 37140 70855 89892 95890 23512 15845 46423 79378 107400
25820 107400 56022 -3028 -25374 -21183 26178 -7366 -63492 -62604 -28201 18833 86535 73763
25808 73763 85826 75504 111156 125300 39308 -49903 -125386 19990 66023 26884 2805
25797 2805 41375 46088 16043 -6625 -38055 8194 13598 12368 44382 46346 34456 56882 46527
25784 46527 64815 56431 31947 9272 5976 40482 68351 57648 73779 71686 73286 46706
25772 46706 79788 60473 104394 125304 137648 113706 62355 28476 49680 97889 123131 132342
25760 132342 98629 41677 -2070 25905 28562 -23526 -26653 30329 78302 50414 24862 54514
25748 54514 -11647 -76859 -85142 -97479 -137114 -114693 -111665 -99065 -77846 -42553 -32595 -101137
25736a01137m1571m356p889M6656M1503O5053j1766M2139O3375K239k6409n016
25724F2821L1055J9287o567k7189k8215j4005o604M5156O590j1619J8350k5003
25712F4057k5873N8273J2437n627o6942l8424J3935O611q8360O439M7961m5376
25700f0889j0722K6383P7222J7895n2K9146n393m2355l8701m1913J8234N0182
25688A9037L7302j576k0531p329K1613O1405L799k7954J2643K1230J9511o7162
25676G1988q6058k1432N6239M8767M1095l9219l036j8309n3878O248J0861q063
25664E203N222K4536j7600p430m4379J3894m760n5157O7799J37418O3313L7473
25652B25532o2867m8907l7745k744n4556L1241k2198J2575l7560m9784l6090L3010
$$ plain form
25736 -101137 -142708 -147064 -154953 -108297 -66794 -1741 -13507 28632 92007 94246 67837 62821
25724 62821 93876 113163 106596 79407 51192 37187 30583 75739 82329 70710 89060 64057
25712 64057 38184 96457 108894 103267 36325 -2099 11836 18447 -69913 -63474 -15513 -60889
25700 -60889 -71611 -45228 31994 49889 49837 78983 73590 31235 -7466 -49379 -31145 19037
25688 19037 56339 54763 34232 26903 48516 109921 113720 85766 98409 119639 139150 71988
25676 71988 -14070 -35502 20737 69504 110599 71380 68344 50035 -3843 2405 13266 5203
25664 5203 10425 34961 17361 9931 -34448 -20554 -25314 -80471 -12672 124746 188059 225532
25652 225532 162665 113758 76013 73269 18713 49954 27756 40331 2771 -47013 -83103 -50093
25640e0093P5508L7345M229l5700k1163n124K2129J5839n4719l7589M1897R7887
25628I0446M52k1973J2626O4106L0263k7876m2202l89M5696m4340p3621m6473
25616a3285K7391J2572J5229M3108n235O043L1995m713o1622l9681L900R903l0235
25603d630k874K3417K8713M3584j3892j7275k244q640O737l0324L8089k519J0577
25590F8719p1183j03129q614N9457N0644K3703L3939j5222o998k0997l7591j5999
25578d3271P8379O4919j8135o8692j7946J1704R158K6416k5242q460n114M581
25566H297M1678k0106L0209J7110J7924R450O8001j6847l4751l3835o5461j3989
25554G680N555M6915L0418j2617m2151j3553k5718k7029n8524l9252O1591N2374
$$ plain form
25640 -50093 25415 62760 66989 31289 10126 5002 27131 42970 -11749 -49338 -7441 90446
25628 90446 90898 68925 81551 145657 175920 148044 105842 105453 151149 106809 33188 -13285
25616 -13285 14106 26678 41907 85015 79780 85823 117818 113105 51483 11802 15702 25605 -4630
25603 -4630 -7504 15913 44626 88210 74318 57043 54799 46159 52896 22572 60661 58142 68719
25590 68719 -2464 -105593 -114207 -54750 -4106 19597 53536 38314 31316 10319 -27272 -43271
25578 -43271 35108 100027 81892 13200 -4746 6958 16116 42532 17290 8830 3716 8297
25566 8297 49975 29869 60078 77188 95112 104562 172563 155716 120965 87130 21669 7680
25554 7680 13235 60150 90568 77951 35800 22247 -3471 -30500 -89024 -128276 -66685 -14311
25542a4311M5113L7008K6223q829m8479M2382p1098K733N6404L6420J0702n5846
25530E8422P046M4412L0266m9803J3618K3865k4394p2818j13923K3578R983l8859
25518h8607R92O1403k1406n0564J8660O255j03197l1383J19976J19023K4311m3754
25506A1709J692K1350l3698m3005n845m934J5732L1655J9297j4886o2852j3690
25494g7475M223J2574j8486n0678j6852N876n776N5562J1847o2568K727k038p702
25481a48766L6037J3996O230j4841l726K943L2941M96n3356m404P6542O4112m5784
25468c7580q1304j5437K6695M5828Q0107k5136J2588j9529j8327q1004k8244L4289
25456a07054K4750k5126j2580j8311Q127J3686k1721K0554L3707P0488K7010l4277
$$ plain form
25542 -14311 30802 67810 94033 85204 36725 79107 8009 10742 67146 103566 114268 58422
25530 58422 65468 109880 140146 90343 103961 127826 103432 30614 -83309 -59731 -49748 -88607
25518 -88607 -87615 -26212 -47618 -98182 -79522 -73267 -176464 -207847 -87871 31152 55463 11709
25506 11709 13401 34751 1053 -41952 -47797 -52731 -36999 -5344 13953 -933 -63785 -77475
25494 -77475 -73252 -60678 -79164 -129842 -146694 -140818 -146594 -91032 -79185 -141753 -139026 -141064 -148766
25481 -148766 -112729 -98733 -92503 -107344 -111070 -108127 -75186 -74690 -128046 -132450 -55908 8204 -37580
25468 -37580 -118884 -134321 -107626 -61798 18309 -6827 5761 -13768 -32095 -113099 -141343 -107054
25456 -107054 -82304 -107430 -120010 -138321 -130194 -116508 -138229 -117675 -83968 -13480 13530 -20747
25444b0747n3586Q102N761o0148o852N5118l2194p6802J9282M9172L0548M621
25432g7725j2531L123m0639J4364M3081R920J3863k5647k9993M9448k4466p1722
25420a48924j4101l7178q2089K2249J5703L165M660Q5467Q6885N4869j3934N391
25408a7837m076p2607k5853j8334j917J5370M2962L4815o442q77l325l0723k2378
25395a11222L0264Q0018J9242l8645q8179k0579o1538M1823j321P8356O5391m4432
25383e0822j6401K6766L0511j8951l0109n1066n0854N739j4029P2805P6501K0632
25371G22J3950N9645N6311L2244Q002k8607o2693q5900k6976j9127N9347m7875
25359d0957k4441k4163q5803K4732P6775L1895L5343j1902l9664j5680q175J6524
$$ plain form
25444 -20747 -74333 -66231 -60470 -120618 -127470 -72352 -104546 -181348 -162066 -112894 -82346 -77725
25432 -77725 -90256 -87133 -127772 -113408 -70327 -60407 -46544 -72191 -102184 -52736 -77202 -148924
25420 -148924 -163025 -200203 -282292 -260043 -244340 -241175 -236515 -151048 -64163 -9294 -23228 -17837
25408 -17837 -21913 -94520 -120373 -138707 -140624 -125254 -82292 -47477 -53919 -54796 -58121 -88844 -111222
25395 -111222 -80958 -940 18302 -20343 -108522 -129101 -190639 -148816 -150137 -71781 -6390 -50822
25383 -50822 -67223 -40457 -9946 -28897 -59006 -110072 -160926 -155187 -169216 -96411 -19910 722
25371 722 14672 74317 130628 162872 170874 142267 79574 -6326 -33302 -52429 6918 -40957
25359 -40957 -65398 -89561 -175364 -150632 -73857 -41962 -6619 -18521 -58185 -73865 -82040 -65516
25347f5516J5363m2932r9946l6232n310m8908q788L2819J7323k8461J514P0705
25335a98369o9871q8947j7539o208j1061o330Q4304Q0519J6371J1665R649k4061
25323b19878m084K8937J9053J8825L5580J00617J7488k6507K2585J17141J7517
25312A27274n0532j6456O3720K2878M7433l9908J7607K7210N497n4626n0841m8244
25300E1012K5538k7341j02956n4645j2547m7395l6234k0170L1902M8653K9914
25289a14269j9025l4461j5335n6530m6090N234l239N4857O5524O8232L7906K1772
25277c5424j8413L4616l284N8764L2167l8790n6425L0298K0356l2071l4696m2924
25265h5826J7672Q8601J08830L2923P384K8728Q8856P1537n1004j08990j12273
$$ plain form
25347 -65516 -50153 -93085 -193031 -229263 -234573 -283481 -292269 -259450 -242127 -270588 -269074 -198369
25335 -198369 -268240 -357187 -374726 -380934 -391995 -398325 -314021 -233502 -217131 -205466 -195817 -219878
25323 -219878 -223962 -195025 -175972 -157147 -121567 -20950 -3462 -29969 -7384 109757 127274
25312 127274 76742 60286 124006 146884 194317 154409 172016 199226 204723 150097 99256 51012
25300 51012 76550 49209 -53747 -108392 -120939 -168334 -204568 -224738 -192836 -144183 -114269
25289 -114269 -133294 -167755 -183090 -239620 -285710 -280476 -283715 -228858 -163334 -95102 -57196 -35424
25277 -35424 -53837 -19221 -22505 36259 68426 29636 -26789 3509 23865 -8206 -42902 -85826
25265 -85826 -68154 20447 129277 162200 169584 198312 287168 358705 307701 198711 86438
25254H6438r0645m5175M6231M2296Q097K1327n200j437L297O0673k637n6656p2945
25241f336j08524m1500k7597R110L2223m3654J5085N2265K0350P359l0766o4519
25229a86504J6872M7963M4885j645L7299Q8813K9924L9388L2606M6767R3082J19973
25217D09423M0938M8578J45687K1817m2366n4326j6399m9678l6120O4886J1446
25206E43886J6983j0868j1102k1045J8417m2781j9411q6217j25644p6264r2940
25195I3014q9954m8275K4456R4846Q7335M9732Q6265O3712N5666Q2216P732p1238
25183D35507p8045j06421p665L3433K5416J498k8418l6519J0954J10519O1443
25172D21702n9159j17359m6521K3180o739K6344P7920M0507l87N4053J2331K1254
$$ plain form
25254 86438 -4207 -49382 -3151 39145 47242 68569 63369 61932 65229 125902 123265 66609 -6336
25241 -6336 -114860 -156360 -183957 -174847 -142624 -186278 -171193 -118928 -98578 -91219 -121985 -186504
25229 -186504 -169632 -121669 -76784 -78429 -41130 47683 77607 116995 149601 196368 289450 409423
25217 409423 450361 498939 644626 666443 624077 569751 553352 503674 467554 532440 543886
25206 543886 560869 550001 538899 517854 536271 493490 474079 387862 262218 185954 93014
25195 93014 3060 -45215 -20759 74087 161422 211154 297419 361131 416797 499013 506745 435507
25183 435507 357462 251041 243376 276809 302225 303723 275305 238786 249740 360259 421702
25172 421702 362543 245184 198663 221843 215104 241448 319368 359875 359488 413541 425872 447126
25160D47126K2588L1743o0824M5203O8001N9896J58286J07878L5535O136j9651
25149I01917M7726P8035m818l4810m3467o8380o2428r0608o9883q8231j40167
25138D24886j39829p7080n5059o8523l7793M671J28560Q1967O3221P8328J03474
25127E06823R1983Q9449J43648N2057n8362o6891j23036j24671q5784p5118J07151
25116D57249J63989J77018j4567r7755L8238J48063J46657M8857K083R7988O1768
25105A229588o9155k22690k08425p1698J07399J30238Q3359J52429K87103J75362
25095A593510M1197l6676j15554m3056k217o2903j25029p2742O2734J42554J24421
25084A506239p6526j10711q9855o1552N1769j29480k17515j98166k24577j55629
$$ plain form
25160 447126 469714 501457 440633 485836 553837 613733 772019 879897 915432 921568 901917
25149 901917 949643 1027678 1022860 988050 944583 876203 813775 723167 653284 565053 424886
25138 424886 285057 207977 152918 84395 46602 51273 179833 261800 325021 403349 506823
25127 506823 598806 688255 831903 883960 825598 758707 635671 511000 425216 350098 457249
25116 457249 621238 798256 783689 685934 724172 872235 1018892 1067749 1069832 1167820 1229588
25105 1229588 1160433 937743 729318 657620 765019 895257 978616 1131045 1418148 1593510
25095 1593510 1634707 1598031 1482477 1439421 1437204 1374301 1249272 1176530 1239264 1381818 1506239
25084 1506239 1429713 1319002 1229147 1167595 1219364 1089884 872369 674203 449626 293997
25074B93997j85428o3431P6992J70999K16178J31882J4677j9874J41382K90145
25064A067519K16648n8006j80242j19846r0588M2261K62600L10616K96521K60324
25054B007807J83126J41128N0712O8574l4969j20524n5978O7544J76003J50622
25044B634045L10733M50099M90056L83684M86106N29802L49402r067m83219n29060
25034D612581o9981N40779Q98853Q71949O51595M60725O46002P94398N54323O06904
25024A0568128J418804K203433K019389J436992J458966K435759L782493M816748
25016C0140712N015157N315224O899085R575926J3770206K0126170K9634799M2530700
25008A63007979N8039117O5231780M6987317P802764k7456009l8789079l3649830
$$ plain form
25074 293997 108569 45138 122130 293129 509307 641189 655866 635992 777374 1067519
25064 1067519 1284167 1226161 1045919 926073 835485 877746 1140346 1450962 1747483 2007807
25054 2007807 2190933 2332061 2382773 2451347 2416378 2295854 2239876 2307420 2483423 2634045
25044 2634045 2944778 3394877 3884933 4268617 4754723 5284525 5633927 5624860 5141641 4612581
25034 4612581 4542600 5083379 5982232 6854181 7505776 7966501 8612503 9406901 9961224 10568128
25024 10568128 11986932 14190365 16209754 17646746 19105712 21541471 25323964 30140712
25016 30140712 35155869 40471093 47370178 56946104 70716310 90842480 120477279 163007979
25008 163007979 221047096 286278876 333266193 341068957 313612948 274823869 241174039
25001B41174039k6778174k2246421j8562143j4068348p931788l455973k315876
24994A45815316l478650o331399r062387j1545556j3220648j3258968j1889296
24987G7028412j0054788q535322p411763o471023n685883m669425l417315k566176
24979B8216717k432712k262968k083363j942726j899986j857320k008464k061502
24971A1667676j717604j273923r56784q37483o37944l56051l95724n60643n67032
24962D364488k94352j1992J67686L01299L10946Q7843k66607l42062k37812j90014
24952C889423j01610j38073j36101k59341n05159l97541j33209j14619j93511
24943A910259l28311j40769O3351J76408O5334j68453k07523p5294O1536J01329
$$ plain form
25001 241174039 214395865 192149444 173587301 159518953 151587165 148131192 145815316
24994 145815316 142336666 136005267 126942880 115397324 102176676 88917708 77028412
24987 77028412 66973624 58438302 51026539 44555516 38869633 34200208 30782893 28216717
24979 28216717 25784005 23521037 21437674 19494948 17594962 15737642 13729178 11667676
24971 11667676 9950072 8676149 7719365 6881882 6243938 5887887 5492163 4931520 4364488
24962 4364488 4070136 4058144 4225830 4527129 4838075 4925918 4659311 4317249 4079437 3889423
24952 3889423 3787813 3649740 3513639 3254298 2749139 2351598 2218389 2103770 1910259
24943 1910259 1581948 1441179 1504530 1680938 1746272 1577819 1370296 1295002 1356538 1457867
24933A457867J10854J12661N1332j6123j23678j41888j08309j07267j42680j31152
24923I61617o9477l265M5314J14603J6054j33608o7149J88946J94454j4759k21346
24912A011384k93062j89015j07724o4683j35562j99277j63393p0834o423J5665
24902b02924M3505J64455J48020Q5319O4071j128k62K7942J21839J15129L4693
24891F00659o4246j12669j54228r0038j20746j04397j31728p0716L607K426L9865
24880b02211p4580K6046J41742K06794J99698K30018O5713q4039p1587m4144m2190
24869C51260o6664n2176j06685j09137j16392j47140o1281k1486l1514M0527J02964
24858b17724M9154o3209k6584Q8183Q8665K5529O5493m4311j50940o8764p121
$$ plain form
24933 1457867 1568721 1681382 1732714 1716591 1592913 1451025 1342716 1235449 1092769 961617
24923 961617 892140 888875 934189 1048792 1064846 931238 864089 1053035 1247489 1232730 1011384
24912 1011384 718322 529307 421583 356900 221338 22061 -141332 -212166 -218589 -202924
24902 -202924 -159419 5036 153056 238375 302446 301318 301056 328998 450837 565966 600659
24891 600659 536413 423744 269516 179478 58732 -45665 -177393 -248109 -244502 -242076 -202211
24880 -202211 -276791 -250745 -109003 97791 297489 527507 593220 509181 437594 393450 351260
24869 351260 284596 232420 125735 16598 -99794 -246934 -308215 -329701 -361215 -320688 -217724
24858 -217724 -168570 -231779 -258363 -170180 -81515 -55986 9507 -34804 -185744 -254508 -261629
24847b61629O2599N5259l9088l0268K1632J12732J56613J07407K9900l0947o1387
24836A22823J3842P2114P1899K1727j55113k02708j17141o9862j34474k3189O5737
24825c34345J30993P1994N7054J05230K5205k9518M6728J04722Q0971k1739K843
24814B40138m204k9138j912J5912l483Q2293L6310m8852k0793o4217j01231j44000
24802d3177j30837j65254j56850j00200o7160P985M9998M4669M9757R8131N6773
24791c56165J0839m3912M1571J06449R4484J24023N1154O841l4171Q1170N0406
24780A32689N9716K6266n5854m6264M8998J25678J25280J0461k3592l6783n3634
24769C12961q1709o7323j1086O9464L8018m4744p035k2626N1082P6r0826o8204
$$ plain form
24847 -261629 -199030 -143771 -182859 -213127 -191495 -78763 77850 185257 215157 184210 122823
24836 122823 136665 208779 280678 302405 147292 -55416 -172557 -242419 -376893 -400082 -334345
24825 -334345 -203352 -131358 -74304 30926 56131 26613 73341 178063 259034 237295 240138
24814 240138 235934 206796 204884 220796 217313 299606 335916 287064 266271 202054 100823 -43177
24802 -43177 -174014 -339268 -496118 -596318 -663478 -655493 -605495 -560826 -511069 -412938 -356165
24791 -356165 -345326 -389238 -347667 -241218 -146734 -22711 28443 35284 1113 82283 132689
24780 132689 192405 218671 162817 116553 165551 291229 416509 426970 403378 366595 312961
24769 312961 231252 163929 152843 222307 260325 215581 208546 185920 237002 237078 146252 78048
24757G8048n8518j2943M2143P1874J9379J4116R31j9138J0307k5015k2106K913
24745A01991O1996N3629k2134p6877n1917M2679k5403l2567R6919J17772J00517
24734C66605M2573j672m0291k9124m2034l7174k3529K4164J7682n766k2674j0987
24722B37773L1245J0402J9406P8810O6328J28030O8345J2621j08197j38213p7238
24711C29312j9145q717R6112m5178r6901l8428r4621p6818J2081J6114n6531l029
24699A4251L8642j8830n668N4509m5616p0214n0873K2692O5313l716J7769O611
24687B4870J0168J9525J8605P3170L1864P755L5310P4951m8266n5093K8284J19240
24675C40383P5291K5696j7539q1998R803O5272j7386k5295M2185M3195R672r417
$$ plain form
24757 78048 19530 6587 48730 120604 139983 154099 155030 135892 146199 121184 99078 101991
24745 101991 163987 217616 195482 118605 66688 109367 83964 51397 148316 266088 366605
24734 366605 409178 407506 367215 338091 296057 258883 235354 259518 277200 271434 248760 237773
24722 237773 269018 279420 298826 377636 443964 571994 640339 652960 544763 406550 329312
24711 329312 310167 301450 397562 352384 255483 217055 122434 45616 57697 73811 17280 14251
24699 14251 52893 34063 28395 82904 37288 -32926 -83799 -61107 4206 490 18259 24870
24687 24870 35038 54563 73168 146338 178202 185957 221267 296218 247952 192859 221143 340383
24675 340383 415674 441370 423831 341833 351636 416908 399522 374227 416412 459607 469279 459862
24663D59862j6168q5949J250J3619N2388o0071K1097q1063p4530l6883k6954m1665
24651A24933R132M6067n0244J0611o2405n3480k9977m1040n5662j420M3025o83
24639f1143k4769J1625K7386P7146P9414k169O421K1851M031L7421R2220M3723
24627C13157j4284q4639l9633n2308m713q131Q78m5403j4977K9416L1086L9170
24615A49619P6613N1919j7806j7821m0250L1721l5407m9925M087M3922K519p1470
24603A27721j7735p8446k6016k2912j2325M0839K4835P3691J8343Q853m7509L1865
24591A21204K8752J4713P4613J771k2467n2262j1761M8299K9271L7309m4874k3935
24579B00633P3787O4096N677o3401o3382J1232N1977o8471o8798M1085K3264l7416
$$ plain form
24663 459862 443694 357745 358995 372614 425002 364931 386028 304965 230435 193552 166598 124933
24651 124933 134065 180132 129888 140499 78094 24614 -5363 -46403 -102065 -103485 -60460 -61143
24639 -61143 -85912 -74287 -46901 30245 109659 107490 113911 135762 139793 177214 269434 313157
24627 313157 298873 214234 174601 122293 117580 109449 110327 64924 49947 79363 110449 149619
24615 149619 226232 278151 260345 242524 202274 233995 198588 148663 152750 196672 199191 127721
24603 127721 109986 31540 5524 -17388 -29713 11126 35961 109652 127995 136848 89339 121204
24591 121204 149956 164669 239282 241053 218586 166324 154563 202862 232133 269442 224568 200633
24579 200633 274420 338516 344193 280792 217410 228642 280619 212148 143350 184435 207699 170283
24567A70283o8025M5482M6171J5583j579L6078l0969n6009o1833j8901L2331J3884
24555A22496o0221K2665O0631m7663l8798p1129p800M2675K9253l1535K3217M0920
24543H4711j6179k7487L1129Q291M6610k8261j5275J9797J5876M1789k1968o988
24531A32045j4516K2682j1171L8218K0494J7533N3967J7854k7820L1180L2430
24520C12896o9311q4955l8223k4889j0756n9560O0763O6639N844q5806j05456
24509c2814K4663N9259N2338N8862l469j8442O695L305k7369L29Q0074o190n5050
24496A42191q8148j24048O7037J09651o8967k6003O7702l706J2370k1907J3247
24485G9419k0884p1820p8386k2490k0367O2637O9302l1291J5971j1035K6850M8521
$$ plain form
24567 170283 102258 147740 193911 209494 207915 243993 213024 157015 95182 76281 108612 122496
24555 122496 62275 84940 145571 97908 59110 -12019 -19819 22856 52109 20574 43791 84711
24543 84711 68532 41045 72174 80465 127075 98814 83539 103336 119212 161001 139033 132045
24531 132045 117529 140211 129040 167258 187752 205285 259252 277106 249286 280466 312896
24520 312896 243585 158630 120407 95518 84762 25202 85965 152604 158448 72642 -32814
24509 -32814 -8151 51108 103446 162308 158839 140397 147092 150397 123028 123357 203431 197241 142191
24496 142191 54043 -70005 -2968 106683 37716 11713 79415 75709 88079 66172 79419
24485 79419 58535 -13285 -91671 -114161 -134528 -71891 -2589 -33880 -17909 -28944 -2094 46427
24473D6427l3706n7920J0430j7338M3844N7521K6105n1451m2912j9885k8646L430
24461f4101k9096m813M5292M923L9210J435n586k3033m1329j5621P954O611k6573
24448a04727n5903r869r419L0861M6393K4697P784L5138P4192K8417m954m2701
24436A9909m2197l4802q747p370L6795K9653O754R941L3539J1317m5729j0931
24424a868M1774O5836m8473p3251K5157K6097o9603k5487N2034j6357N651J8247
24412b43J0773J2035j4296l1632M4233M2093L152o9355j5450R5090j4236m7895
24400A4269k1600k0181J0176P70P673L0519l5605q91J9313R771k2146n3382n6774
24387a18088M9176M8894k557O958J6537m1587j2572j2333o643j1018K03L3449
$$ plain form
24473 46427 12721 -45199 -34769 -52107 -8263 49258 75363 23912 -19000 -38885 -67531 -64101
24461 -64101 -93197 -98010 -52718 -47795 -8585 -7150 -12736 -35769 -77098 -92719 -84765 -78154 -104727
24448 -104727 -160630 -170499 -179918 -149057 -102664 -77967 -70183 -35045 39147 67564 62610 19909
24436 19909 -22288 -57090 -65837 -73207 -36412 -6759 -5 9936 43475 54792 9063 -1868
24424 -1868 39906 105742 57269 -15982 9175 35272 -34331 -59818 -7784 -24141 -18490 -243
24412 -243 10530 22565 8269 -23363 20870 62963 66115 -3240 -18690 76400 62164 14269
24400 14269 -7331 -27512 -17336 -16566 -8893 21626 -13979 -14870 4443 14214 -7932 -61314 -118088
24387 -118088 -68912 -20018 -22575 -15617 920 -40667 -53239 -65572 -72215 -83233 -83030 -49581
24375d9581L6708j6526j1411N9734P4715M332q987r5395r0329o2281M6206J02043
24363a0772K5408j7772j7120m628l1450j1361P856L4404K5545k4093L4240L3638
24351D3895p054J656l2040m3829o7495P9072N5335n0652P4631L1666n6360n0052
24339b1227L645M497l3349m0155Q046k1013J7579O0056M5963k8794K2869m5197
24327b7080j07812j8658M0056N7894j3032J7729K4502k0964j4001k9992k9312
24316a20670N7331O6501j1314n094L6407J1533R893L5192M8291L2082n2733p3633
24304C3786o1460K6543L2650M9376m7875n864M883R011j3752j9237k3337n3528
24292f8804m282N505K2633M0128j7981r56l3558k1294N0051P5306j3512k2971
$$ plain form
24375 -49581 -12873 -29399 -40810 18924 93639 97971 88984 -6411 -96740 -159021 -112815 -10772
24363 -10772 14636 -3136 -20256 -24884 -56334 -67695 -59839 -25435 110 -23983 10257 43895
24351 43895 36841 38497 6457 -37372 -104867 -25795 29540 -21112 53519 85185 28825 -21227
24339 -21227 -17582 -13085 -46434 -86589 -78543 -99556 -81977 -21921 24042 -4752 18117 -27080
24327 -27080 -134892 -153550 -113494 -55600 -68632 -50903 -26401 -47365 -61366 -91358 -120670
24316 -120670 -63339 3162 -8152 -13246 23161 34694 44587 79779 128070 160152 107419 33786
24304 33786 -27674 -1131 31519 80895 33020 27156 32039 41050 27298 8061 -15276 -68804
24292 -68804 -73086 -67581 -44948 -4820 -22801 -23757 -57315 -78609 -28558 46748 33236 10265
24280A0265K2396K8430j6337m6122j1580M6223K9944k3929n0276p753N2298M3988
24268G7547L5719k9054K686m5610m9476l3540K4503j6683m4367N8755p368L5434
24256H546K066O443j7665Q102N3810l5568n7819l3240j478m1449m9966L0234L1272
24243i6712J7546l6952k7112M755j1088n68M8104O1798j0262n5813n501J6741
24231i5064n829l5025n3793r129L8605M6980n0608N775Q132N8819K8807J4433
24219d7897J9241o1776L748n2684j3064J18626M8907Q568l9163r2684N8945K8617
24207b0616m2777L7823M9923N4280k6911j06662l6548J00505N3814m5834M160
24196B1157J5768j8654J9060k1466o0464L300l878O084M3968j9503l23N4603n7787
$$ plain form
24280 10265 32661 61091 44754 -1368 -12948 33275 63219 39290 -10986 -18739 33559 77547
24268 77547 113266 84212 86898 41288 -8188 -41728 -17225 -33908 -78275 -19520 -26888 8546
24256 8546 10612 17055 -610 7492 61302 25734 -32085 -65325 -66803 -108252 -158218 -127984 -96712
24243 -96712 -79166 -116118 -143230 -138475 -149563 -150131 -102027 -40229 -50491 -106304 -111805 -95064
24231 -95064 -100893 -135918 -189711 -198840 -160235 -113255 -163863 -158088 -149956 -91137 -62330 -47897
24219 -47897 -28656 -90432 -86684 -139368 -152432 -33806 15101 23669 -15494 -108178 -49233 -20616
24207 -20616 -63393 -25570 24353 78633 51722 -54940 -91488 9017 62831 16997 21157
24196 21157 36925 18271 37331 15865 -44599 -41299 -45177 -39093 4875 -14628 -14951 39652 -18135
24183a8135n9982M6122M1530n656K5680K5121K7269M461m2971k2813p199m5025
24171c1598j8676L7512J1458J756J5919k8496P897j0389L9452J3662j8660L2486
24159E2323m842M883J6358j7955l6680l9907p2246K2602J1596k0723j2801Q3259
24147a4133K0159j5635L8496m7574p0159O282J4790q8353k2612L062j1848j0001
24135a97526M4075M8073P5857q064M562R121J0476J8426L3929L7088l9369j5702
24123B0946j5819r440L05M2116R693m164n846l6111o237N6776J0333o3165n51
24110a164l8731n1566L0916P3845l1286n2806k1579L8913R6424M0835N293N96
24098H9690n8746Q761m533L1513r1945o9170K4543P1654K1193J3823O5680L5102
$$ plain form
24183 -18135 -78117 -31995 9535 3879 29559 54680 81949 86410 43439 20626 13427 -31598
24171 -31598 -50274 -12762 -1304 452 16371 -12125 -4228 -14617 24835 38497 19837 52323
24159 52323 47481 52364 68722 50767 14087 -25820 -98066 -75464 -63868 -84591 -97392 -14133
24147 -14133 6026 -9609 28887 -18687 -88846 -82564 -67774 -156127 -178739 -175677 -187525 -197526
24135 -197526 -153451 -105378 -29521 -37585 -33023 -23902 -13426 5000 38929 76017 36648 20946
24123 20946 5127 -4313 -4008 38108 47801 43637 37791 1680 -4557 52219 62552 -613 -1164
24110 -1164 -39895 -91461 -60545 13300 -17986 -70792 -92371 -53458 42966 83801 89094 89690
24098 89690 30944 39705 35172 66685 -25260 -94430 -69887 1767 22960 36783 102463 137565
24086A37565n1490k1480j7213q740j9129q320K7284m0409R039l3043J7754L4189
24074B6007M3696p13J2700j2266J5915p8639p8698J7595P3783k2407j3920J6962
24062A5M0069K5249j8390j285o9015k9265J5795J5464M8149K6186j4150J2258
24050E1080j0759m1299p361N8663K9749o160J0012j4904q5991j6591M4126j4994
24038d429J1966L8488O7248N842o5012m6089l5582k2548M2994L3700k218k3501
24026H59n1976M7601R168L551J9005Q573L320L485j1514n4455j8181k4087J9578
24013d5073M4388j4756j5583n8195j8624O2733R7171o5503j4398P5059Q1900j6721
24001A12398j16332m7860O5376P4959l7022l293M9617O583k0546m2008l3035L2312
$$ plain form
24086 137565 86075 64595 47382 38642 19513 11193 38477 -1932 7107 -25936 -8182 26007
24074 26007 69703 68990 81690 69424 85339 6700 -71998 -54403 19380 -3027 -16947 15
24062 15 40084 65333 46943 45658 -23357 -52622 -36827 -21363 26786 52972 38822 51080
24050 51080 40321 -978 -8339 50324 80073 73913 83925 69021 -16970 -33561 10565 -4429
24038 -4429 7537 46025 113273 119115 54103 8014 -27568 -50116 -7122 26578 24360 859
24026 859 -51117 -3516 5652 9203 28208 36781 40101 43586 32072 -22383 -40564 -64651 -45073
24013 -45073 -685 -15441 -31024 -89219 -107843 -45110 52061 -13442 -27840 47219 129119 112398
24001 112398 -3934 -51794 13582 88541 51519 48226 97843 104426 83880 41872 8837 41149
23989D1149m2966j7582K8090k5725p193L241k1036j0812m7757J4632J28229N3066
23977I5336j1928J6798j6465m9642j9346j2657l6842O0759K0788o3697j8415L7295
23965A984m5142k0504J5549J1820M2207k27J3825K7411r567k1145k8876n3164
23953f5829L1102L6228l3723r0507j3808j3271L1548K0025J60616L5121J0700
23942A08202Q711l2592j2399k5234K5607K3610M705l0984r7596k8077O9001j2439
23930E15L9574j5969j6469M0076n9633o9185K3551j2332M6143j1976l6412Q5264
23918A3147K9636n7582M271k0555L5799J5697L8010k9711m0223m2061K2317J05409
23906G4154j6282m7271J5215o4009n1250o987M6186K3979j5722N806L3674m679
$$ plain form
23989 41149 -1817 -19399 8691 -17034 -24227 -20986 -42022 -52834 -100591 -85959 42270 95336
23977 95336 83408 100206 83741 34099 14753 2096 -34746 26013 46801 -16896 -35311 1984
23965 1984 -43158 -63662 -48113 -36293 5914 5687 19512 46923 37356 16211 -12665 -65829
23953 -65829 -34727 1501 -32222 -122729 -136537 -149808 -118260 -98235 62381 97502 108202
23942 108202 116913 84321 71922 46688 72295 95905 100610 69626 -27970 -56047 12954 515
23930 515 40089 24120 7651 47727 -11906 -81091 -57540 -69872 -23729 -35705 -72117 13147
23918 13147 42783 -14799 -10528 -31083 4716 20413 58423 28712 -11511 -53572 -31255 74154
23906 74154 57872 10601 25816 -38193 -89443 -96430 -50244 -26265 -41987 -36181 -2507 -7186
23894g186j4878j2385N382o6200K0069M2630K6519J543J2539r051l8761K6951
23882a2828O4692N863M0432j5970k4600p9306m2090L0333P3760J059r037l2171
23870A37l6050M109Q5863R1079K839n8613p1511n6458j6028M1329J2959n6497
23858e6842m4201K7960M5411N595p207L9870K0457l6517k9291J5594M2004J4805
23846C7638l2715J4083K2256O866j7281J9528K6134l5005J3956k3771J8722N621
23834E6032o6305K809R0993k987p616J1823n1001J7894k9208j3866J2264k2781
23822a949n8308J7869M0043j4464k0176K389k2744L3363P4763N969K0923M7458
23810A25136l5790l8442o6295P976l957j4772Q791m2206k0853J0771N2973j808
$$ plain form
23894 -7186 -22064 -34449 -29067 -95267 -75198 -32568 -6049 -4506 8033 -1018 -39779 -12828
23882 -12828 51864 57727 98159 82189 57589 -21717 -63807 -33474 40286 41345 32308 137
23870 137 -35913 -31804 54059 145138 147977 89364 17853 -38605 -54633 -13304 -345 -56842
23858 -56842 -101043 -73083 -27672 -22077 -29284 10586 31043 -5474 -34765 -19171 22833 37638
23846 37638 4923 19006 41262 48128 30847 50375 76509 41504 55460 31689 50411 56032
23834 56032 -10273 -7464 83529 80542 72926 84749 33748 51642 22434 8568 20832 -1949
23822 -1949 -60257 -42388 -2345 -16809 -36985 -34596 -57340 -23977 50786 56755 77678 125136
23810 125136 89346 50904 -15391 -7415 -11372 -26144 -17353 -59559 -80412 -69641 -16668 -18476
23798a8476k6431n60L4169j8090j0586J5917P5231J5470m7209q796K2432m2520
23786i449j5126J8576J6248K3099J2688K461k3232j1665K7930l363r450q024l8252
23773a7559L9264Q011r422l3645l378m221N571O1387p7m8431j3605m5186J1971
23760d9320K0838L8814K7348R204o984j6691K4036l1060O881L647k314j3294j1108
23747cn0142M5236N8320k4862m3703l8667n470L9569L2485j2885l1258N226J5168
23734a0986M8913m3043r9208K6175L2639L2813M0297J4994n5209n8880k203L2213
23722d1485J0115j7744l8824k740J0027K0776J8418k4084O945P0168K4866J2564
23710D9002J893J506L3825q322o801k0264l1570o8612m7385L9015M2792Q5207
$$ plain form
23798 -18476 -44907 -45467 -11298 -29388 -39974 -24057 51174 66644 19435 10639 33071 -9449
23786 -9449 -24575 -5999 10249 33348 46036 48497 25265 13600 41530 38167 28717 20693 -17559
23773 -17559 21705 29716 20294 -13351 -16729 -20950 -15379 46008 45931 -2500 -16105 -61291 -49320
23760 -49320 -28482 10332 37680 46884 39900 23209 47245 16185 23066 26713 24399 11105 -3
23747 -3 -50145 -4909 53411 28549 -15154 -53821 -59291 -19722 12763 -122 -31380 -26154 -10986
23734 -10986 37927 -5116 -104324 -78149 -45510 -12697 27600 42594 -12615 -71495 -73698 -41485
23722 -41485 -31370 -49114 -87938 -90678 -80651 -59875 -41457 -65541 -58596 11572 36438 49002
23710 49002 50895 52401 86226 77904 71103 50839 19269 -49343 -96728 -57713 -14921 70286
23698G0286L0645n5186j0709k0473m942j0009J9298n850o1241p2765j6265K3948
23686a13263J6062K3061L4832N8177J4445J4799j0347l8246P613n185o7964k8802
23674i4818j298m770O7678K5986q484l211K4659K4188l3112N750j1816j3110j5606
23661c7964k9658K4356J7494r199O308n290J7760M135j6714r029M528j4112m7992
23648i5377O2980N2361n648J1960J3333j3587l2325j6520L5761K9330j2358j7750
23636A2160P068n4301L4059O0988K6043K0303k3064l9437L923k1233J5539K3947
23624F5995n453n7132m234M109k1135j8335k0580p27L8194K111p8429K792O4094
23611b8730l649l9772q2835N2571r796j261L4728M5539P331J3909L9806M3833
$$ plain form
23698 70286 100931 45745 35036 14563 9621 -388 18910 13060 -48181 -120946 -137211 -113263
23686 -113263 -97201 -74140 -39308 18869 33314 48113 37766 -480 7133 1948 -66016 -94818
23674 -94818 -96116 -100886 -33208 -7222 -15706 -18917 5742 29930 -3182 2568 -9248 -22358 -37964
23661 -37964 -67622 -43266 -25772 -34971 -28663 -33953 -16193 -12058 -28772 -37801 -33273 -47385 -95377
23648 -95377 -32397 19964 14316 26276 39609 26022 -6303 -22823 12938 42268 29910 12160
23636 12160 19228 -35073 -1014 59974 86017 106320 83256 43819 47742 26509 42048 65995
23624 65995 60542 3410 -824 3285 -17850 -36185 -56765 -57492 -19298 -17187 -95616 -92824 -28730
23611 -28730 -32379 -72151 -154986 -102415 -112211 -113472 -78744 -33205 -25874 -11965 27841 71674
23599G1674l056J4098n1995m380O205k541K0565p28m3050m1987M857k2849K445
23586e0742k8987O1724K8228o2838K349K4540j800K7911R414r419L169K5067j4609
23573A4007o1665K1979J7144m0024O15K1459K8863k0026j842n6012P4353N8869
23561E7720l9067j6773m546N4047N397k9599k2042K2192M3442R848k9750j21156
23549g0287J5183p445K2459R2684l086l8448m4871L6468O9147P368p8227o1282
23537f0337L4441K8647L5123K3328j9373n7323p4989k6873J8888J33583O6393
23526A01508j16972k6982M2049M0253N352q3999J1742K791Q653l1586l8860J7227
23514f8824J5969N0565K1165k8116j6036j9988M657l7470l9434M4776J1527r461
$$ plain form
23599 71674 68618 82716 30721 26341 32546 30005 50570 49842 6792 -35195 -30338 -53187 -50742
23586 -50742 -79729 -18005 10223 -52615 -50266 -25726 -27526 385 9799 380 3549 28616 14007
23573 14007 -47658 -25679 -8535 -48559 -47944 -26485 2378 -17648 -19490 -75502 -1149 57720
23561 57720 18653 1880 -2666 51381 56778 27179 5137 27329 70771 80619 50869 -70287
23549 -70287 -55104 -62549 -40090 52594 49508 11060 -33811 2657 71804 79172 945 -60337
23537 -60337 -25896 2751 37874 61202 41829 -15494 -90483 -117356 -98468 35115 101508
23526 101508 -15464 -42446 -397 39856 45208 -38791 -27049 -24258 -15605 -47191 -86051 -68824
23514 -68824 -52855 -2290 18875 -9241 -25277 -45265 -40608 -78078 -117512 -72736 -61209 -70670
23502g0670o828m640K0096O9074L0905j3292Q424l2368n5907p9447O718j2208
23490a40143L2954k0849M0926J5518K5597K6983m0372o1186N5303J00415k1161
23479A3985J1945q70l1028j1397P9256j8030m3365p8875l4162L6070P8066M6423
23467D8018J9279j6247m5336K6970k140o4759o6594L1152P1526J7874j3123o5654
23455e9034k4376r659M4515K6067j1552M7598K0647k1896o8648l8173M8562L6253
23443i696N8300j5732l7824J5232L6823K5000K5867p25j8566p7568j03140K3971
23431g8058P3605J094O990K2651k7679l2919j2656M666L2575M535L204n709L7219
23418B9518P12Q094j1633q9661j8473J4937L9849m362M4668J1877l6249j7282
$$ plain form
23502 -70670 -77498 -82138 -62042 7032 37937 24645 33069 701 -55206 -134653 -127935 -140143
23490 -140143 -107189 -128038 -87112 -71594 -45997 -19014 -59386 -120572 -65269 35146 13985
23479 13985 25930 25060 -5968 -17365 61891 43861 496 -78379 -112541 -76471 1595 48018
23467 48018 67297 51050 5714 32684 30544 -34215 -100809 -69657 1869 19743 6620 -59034
23455 -59034 -83410 -93069 -48554 -22487 -34039 13559 34206 12310 -56338 -94511 -45949 -9696
23443 -9696 48604 32872 -4952 10280 47103 72103 97970 97245 78679 1111 -102029 -78058
23431 -78058 -4453 -3359 3631 26282 -1397 -34316 -46972 -42306 -9731 -5196 -1992 -7701 29518
23418 29518 30230 38324 26691 -62970 -81443 -66506 -26657 -31019 13649 25526 -10723 -28005
23406b8005l2267Q357J9094J6603n6316j683J1090m9652N9480P4453M4694j901
23394F3947P650L5450N6830r609l4545n6979j9610k6002j8361J2380J4720R133
23382C5004J365m4469l1594N9308r2j3921j9809k5468L3298p271q150L6164N8359
23369G2724k2133l2846j732p2408p3888Q862K0467l720M7437L5487p282Q889p444
23356b7587M1968P818R200P6895l591q4411J2366J0853n0116l3228m2119M7947
23344c4005k1112l2995p7204K9594R8742J7133k4043N8116K1226j9284o0794l9643
23332h4269j634K4875L8216M4562K8838J6285l4771p6338n1247m5309k9796K5324
23320a45264N7976m426k5148N5952P1819l5113l5298O0994N603l1423J3090K7857
$$ plain form
23406 -28005 -60272 -51915 -32821 -16218 -72534 -74217 -63127 -112779 -53299 21154 65848 63947
23394 63947 71597 107047 163877 154268 119723 62744 43134 17132 -1229 11151 25871 35004
23382 35004 36369 -8100 -39694 19614 19522 5601 -14208 -39676 -6378 -13649 -21799 14365 72724
23369 72724 50591 17745 16013 -56395 -130283 -121421 -100954 -104674 -57237 -21750 -29032 -20143 -27587
23356 -27587 14381 22199 31399 108294 104703 20292 32658 43511 -6605 -39833 -81952 -34005
23344 -34005 -55117 -88112 -165316 -135722 -36980 -19847 -43890 14226 35452 16168 -44626 -84269
23332 -84269 -85903 -61028 -22812 21750 50588 66873 32102 -44236 -95483 -140792 -170588 -145264
23320 -145264 -87288 -91714 -116862 -60910 10909 -24204 -59502 1492 7095 -24328 -11238 16619
23308A6619L8329K0538k5317N121l3592r8361K8224Q1576K9079k5893l2159L9963
23296D4127o2922J2315K6348m8934r3785q844O9066K4969J9187J1585P7095N4344
23284A24551q4637m9871N0654J1818l7750k7814j770m7491j9161j5122R037M4843
23272d2713k1141k9196L802j534O2487K0087k1434M1198K0563p921K8660m226
23260D8632m8669j9029K3656N8854M6652l9541k4449K927j3723J3229j8401m4381
23248a4243k3191k0736j3326L5810K7149j5567L4127M722p978l0894J7272K748
23236d107l2451p708J1838N896k1485l9596N0943m2418L9262K2271K6383L4900
23224D3728o3207l8911K2078N9997L2349p1695r7992l4075L9090Q0056M3344l7772
$$ plain form
23308 16619 54948 75486 50169 55290 21698 -76663 -48439 33137 62216 36323 4164 44127
23296 44127 -18795 -6480 19868 -29066 -122851 -131695 -62629 -37660 -18473 -6888 70207 124551
23284 124551 39914 -9957 40697 52515 14765 -13049 -14819 -62310 -81471 -96593 -87556 -42713
23272 -42713 -63854 -93050 -89248 -90782 -28295 -8208 -29642 11556 32119 24198 52858 48632
23260 48632 -37 -19066 4590 63444 110096 70555 46106 49033 35310 48539 30138 -14243
23248 -14243 -37434 -58170 -71496 -35686 -8537 -24104 10023 14745 6767 -24127 -6855 -4107
23236 -4107 -36558 -44266 -32428 -26532 -48017 -87613 -36670 -79088 -39826 -17555 8828 43728
23224 43728 -19479 -58390 -36312 23685 56034 -15661 -113653 -147728 -108638 -28582 14762 -23010
23212b3010l5077m1663N3231J7880j2915M4280p073o1959r291j4927M718L0045
23200e5761m8075j7324l7409J7886J1785l0205Q0380J02497K2963J3331l2767
23189B7301o1370q4572j5853K2188L226k4018p192J8621O664L8926L9510J5099
23177b1470k3239j2877J7308L3393J6019l7070Q603j0486L4414L1372k5820L569
23165A3716M7394k7340k0874j3680K4750K4479j908q4907j2171k7718L913M5134
23153b9212R611N2371M0921k6064o6751l412K1718K2477r678J4113l4056K6751
23141A8789J6833K3771q839k0622J1160o73j3432j6060J2025l951L8642k8824
23129B8819p1642m5874Q6892J6429M490N0879j8374j7825k6110J3079q904K004
$$ plain form
23212 -23010 -58087 -99750 -46519 -28639 -41554 2726 -4347 -66306 -75597 -90524 -85806 -55761
23200 -55761 -103836 -121160 -158569 -140683 -128898 -159103 -78723 23774 46737 60068 27301
23189 27301 -34069 -118641 -134494 -112306 -109080 -133098 -140290 -121669 -115005 -76079 -36569 -21470
23177 -21470 -44709 -57586 -40278 -6885 9134 -27936 -19333 -29819 4595 35967 10147 13716
23165 13716 61110 33770 12896 -784 23966 48445 46537 -38370 -50541 -78259 -74346 -29212
23153 -29212 -19601 32770 73691 47627 -19124 -22536 -818 21659 11981 26094 -7962 18789
23141 18789 35622 59393 50554 29932 41092 40419 26987 10927 22952 19001 57643 28819
23129 28819 -42823 -88697 -1805 14624 19114 69993 51619 33794 7684 20763 11859 13863
23117A3863r018n0828k5245M0743M2392P0376o2682r590k8735r06J02895j6269
23105F6996m3385j7113Q250J731k9255J1348j2400K1618m2132k6098M3687K7366
23093A0613q841o392L4143P223k6082k5535l4798l5185N4297N0512K2901K2147
23081F5003k8536p49k5747K679K1075j1592j3278k270k7961q430J8954j706L3972
23068B1414L0365l8426K5057J4944J6482o692l4797N55K6340J6062j8858L0574
23056H3020m6500r0329k9953K4169K5141o2011n370N4139n2186j0292O1714L3818
23044a4640J7577l5235R2118P1251m656q4668m3380m6486M600j4559L7196o387
23032b7269m8079m5147K7894L7695j811j2013J765N2589k3803k8968n8101k3151
$$ plain form
23117 13863 4845 -45983 -71228 -30485 11907 82283 19601 10011 -18724 -19630 83265 66996
23105 66996 23611 6498 14748 16479 -12776 -1428 -13828 7790 -34342 -60440 -16753 10613
23093 10613 1772 -4620 29523 36746 10664 -14871 -49669 -84854 -30557 19955 42856 65003
23081 65003 36467 35718 9971 12650 33725 22133 8855 6585 -21376 -29806 -10852 -12558 21414
23068 21414 51779 13353 38410 53354 69836 63144 28347 28902 55242 71304 52446 83020
23056 83020 36520 -53809 -83762 -59593 -34452 -96463 -101833 -47694 -99880 -110172 -48458 -14640
23044 -14640 2937 -32298 59820 131071 126415 41747 -1633 -48119 -43519 -58078 -20882 -27269
23032 -27269 -75348 -120495 -92601 -54906 -56717 -68730 -66965 -14376 -38179 -67147 -125248 -148399
23020a48399q2645J5554J11165N8251m109q1132j2627O8128J09915M2893M696
23009H1690r219j1256m6924J4031n9120k7579m2512P359K7008o53J5374l19k627
22996e4747n340j3330j7798j6948M3593O570J9772n7n4754L1388K2627O208M4105
22983A1289O4716k5741o994O058K1304q738M1003m0405J2620J578m4577j2328
22971A9785r988K3239J6117j0526o057K0588k8821o7973k2111l6945m0441K3351
22959a19782J3924K3832N7920o94p051k9453n7447j5717K9581M5808M7123j2192
22947b4148l5006j8543L0352O9401J0481j7776n0427L2881P1194m9122o161N6062
22935F9188j1976n5550j01000J853L3965O841L484J3079M9917p162l4357m7945
$$ plain form
23020 -148399 -231044 -215490 -104325 -46074 -50183 -131315 -143942 -75814 34101 76994 81690
23009 81690 72471 61215 14291 28322 -30798 -58377 -100889 -93530 -66522 -67175 -51801 -52120 -54747
22996 -54747 -60087 -73417 -91215 -108163 -64570 -58000 -38228 -38285 -93039 -61651 -39024 -32816 11289
22983 11289 76005 50264 43270 49328 70632 61894 102897 62492 75112 76690 32113 19785
22971 19785 9797 33036 49153 38627 32570 53158 24337 -43636 -65747 -102692 -143133 -119782
22959 -119782 -105858 -82026 -24106 -24800 -31851 -61304 -118751 -134468 -104887 -59079 -11956 -24148
22947 -24148 -59154 -77697 -47345 22056 32537 14761 -35666 -2785 68409 19287 13126 69188
22935 69188 57212 1662 -99338 -97485 -63520 -56679 -53195 -40116 9801 2639 -31718 -79663
22923g9663j5103J6429Q020l3843j3365R4812R1687Q940o1594q4312K1542N5028
22911H578j0687l9944O517M868r87j5546O0635k5305m3468j4886k2911L1849K0819
22898d0468j2593l3552j4477R393Q015M5665K9139K0719j8070K7368M2083j5290
22886D7932k8783k0165M4482N8926k7680K3068j2271k5263l1456k2111j351R446
22874A4774j5357R080J6975l6954o769O2244J4788J6336n5216m2127k7250l1987
22862h1463r754Q3190Q3741j3720m1850O5567l3561p2277m156o878K7749Q621
22850E209l8370P501r474N876L7995o710m154K2245R862L8382j9589m8305m7257
22837d6789m4948j2581N7096Q3563K1178k8668j6018p404l5482p1916j6032N7362
$$ plain form
22923 -79663 -94766 -78337 -70317 -104160 -117525 -22713 68974 77914 16320 -67992 -46450 8578
22911 8578 -2109 -42053 -35536 -30668 -31655 -47201 13434 -11871 -55339 -70225 -93136 -61287 -40468
22898 -40468 -53061 -86613 -101090 -91697 -83682 -38017 -8878 11841 -6229 21139 63222 47932
22886 47932 19149 -1016 43466 102392 74712 97780 85509 60246 28790 6679 5328 14774
22874 14774 -583 8497 25472 -11482 -18251 43993 58781 75117 19901 -22226 -49476 -81463
22862 -81463 -91217 -8027 75714 61994 20144 85711 52150 -20127 -24283 -31161 -3412 5209
22850 5209 -33161 -25660 -35134 -29258 8737 2027 -2127 20118 29980 68362 48773 468 -46789
22837 -46789 -91737 -104318 -47222 36341 57519 28851 12833 5429 -30053 -101969 -118001 -60639
22825f0639R4044Q778k0854j4288l1815L874j5432j0990o864j0915M4400L1895
22813A1194k2595N430r852l251P1353l1190P250Q366j8729J2366o329l5507l9597
22800e1091J0353M5561j4064p806m2192j453R278K6217M9118l7804j6524M4351
22788A3944j4921l7246K9153L6551m109N7582K8133n9446m8322K1198k4841N078
22776B754j0059N152m4532j1625l8579O770P3989Q714n3735l9858J1082N4765
22764c5162M4009m03j0036R337K1812o93l6187J4617O5220j919k777k2663k9497
22751A5658J3620k861k2226k943M3308M0759p434m5445J6479K8933K5531J2265
22739A15644L2802N1205Q2244p3069L191r56k9601m1483K0476j839l769n471O4432
$$ plain form
22825 -60639 33405 42183 21329 7041 -24774 -20900 -36332 -47322 -54186 -65101 -20701 11194
22813 11194 -11401 -5971 -15823 -19074 52279 21089 28339 36705 17976 30342 24013 -11494 -51091
22800 -51091 -40738 4823 -9241 -17047 -59239 -60692 -51414 -25197 23921 -13883 -30407 13944
22788 13944 -977 -38223 -9070 27481 23372 80954 109087 49641 1319 22517 -2324 2754
22776 2754 -7305 -2153 -46685 -58310 -96889 -90119 -16130 -7416 -61151 -101009 -89927 -35162
22764 -35162 8847 8444 -1592 7745 29557 28864 -7323 7294 72514 70595 67818 45155 15658
22751 15658 29278 26417 4191 1248 44556 85315 77881 32436 48915 77848 103379 115644
22739 115644 148446 199651 281895 208826 212017 211061 181460 139977 160453 158614 154845 149374 213806
22726B13806J7352J1587M7401J3619M0543k9856K322n0148q9670j1215m2868J4036
22714A36909J7699m030k1030J8096L0439n792J802m8106l4857K7115L3843J23
22702A52211l267o4301k1719n0771o663J5978j946L6601J9982J3494N937J5574
22690A11110j1174J7663M4668J8381n1944n6814l0413K9569O5783m484l6619J9551
22678A15277j7754J6340r442m5043j5677o478m4732R841P7029q329p774j145l463
22665E8650J5524L546m1369n9301O472K8942j6064j0853K3203M587p3347o8850
22653a28860L7770J05739K4542r9835m1966k8817k4417L6434O3037L3686L0935
22642H248N4222l3373j3335L2901K5923k8663K0187o999k3063K465j3150r696
$$ plain form
22726 213806 231158 242745 290146 303765 344308 314452 316774 266626 176956 165741 122873 136909
22714 136909 154608 150578 129548 147644 178083 172291 174093 125987 91130 118245 152088 152211
22702 152211 148944 84643 62924 12153 5490 21468 19522 56123 76105 89599 95536 111110
22690 111110 99936 117599 162267 180648 128704 71890 41477 71046 136829 132345 95726 115277
22678 115277 97523 113863 104421 59378 43701 37223 -7509 2332 79361 71032 63258 62113 58650
22665 58650 74174 77720 36351 -22950 -16478 12464 -3600 -14453 8750 13337 -60010 -128860
22653 -128860 -91090 14649 39191 -60644 -102610 -131427 -155844 -119410 -56373 -22687 8248
22642 8248 62470 29097 15762 48663 74586 45923 66110 59111 36048 38513 25363 15667
22630A5667k5851p6530k8163J8248M6786J1154L1313N0696P104K2961k2105p7639
22618b6359k5206L9494K2183q8101L9919K8181k0639m2940j6169J5049k2188m2606
22606a39382m058l258Q4670M5037r059k5420j3506O313j2073k8119l4152O1258
22594g1749j5228l265P9334J5821j3009o61l2266j1965p534K4991j785l3144J5890
22581e4570K0855j9172N083K5298j3110N272p527q813k9321L071O4963N0649R5858
22568A38536j4436j20493j9759J1953O399l1461r500m265p810J7215J147k0769
22556e3243k875M0987j8179j0109l1850l7013R296N50J8425o5139j3615N9495
22544a03270M1692L4880m9454k086J4328k1484K4518K3107N6919o1678o3455m1369
$$ plain form
22630 15667 -10184 -86714 -114877 -96629 -49843 -38689 -7376 43320 50424 73385 51280 -26359
22618 -26359 -51565 -12071 10112 -77989 -38070 -9889 -30528 -73468 -89637 -74588 -96776 -139382
22606 -139382 -143440 -146698 -62028 -16991 -26050 -51470 -64976 -58663 -70736 -98855 -133007 -71749
22594 -71749 -86977 -90242 -10908 4913 -8096 -8757 -41023 -52988 -60522 -35531 -37316 -70460 -54570
22581 -54570 -33715 -52887 -47804 -22506 -35616 -30344 -37871 -46684 -76005 -72934 -7971 42678 138536
22568 138536 124100 3607 -16152 -4199 2200 -29261 -38761 -43026 -50836 -33621 -32474 -53243
22556 -53243 -56118 -15131 -33310 -43419 -75269 -112282 -102986 -102436 -84011 -149150 -162765 -103270
22544 -103270 -61578 -26698 -76152 -78238 -63910 -85394 -60876 -37769 19150 -42528 -105983 -147352
22532a47352j994m6293L9535K0573M7599k1419j9156K0420P661K4099K7117L9563
22520i647p6312m6496l7325j3414P0741R4657M5091k5730Q07m857m69k8328j1790
22507d3072l8599j1588J1297K7826N1011o651o9891k4919l1348M1493L3924M2268
22495a8249K467l9788o26n038r667J6096j5980K9260J08903O3210k0039l7972
22483G2577l2240q776J7314k9274k8261n753p162k6994j2116L487K9380N8164
22471C0346l9413k0394l172K913O4893j3870j5368j1096K7316k4038m6702n1381
22459i9966j8490p232n937J6324k605m2918M079M4437n5419J657O0838J5736J9984
22446f9512r734l985L3828j0226l4662k3617P6060R8114n831q7054M2865K1882
$$ plain form
22532 -147352 -149346 -195639 -156104 -135531 -87932 -109351 -128507 -108087 -100426 -76327 -49210 -9647
22520 -9647 -85959 -132455 -169780 -183194 -112453 -17796 27295 1565 2372 -2485 -2954 -31282 -43072
22507 -43072 -81671 -93259 -81962 -54136 -3125 -9776 -79667 -104586 -135934 -94441 -60517 -18249
22495 -18249 -15782 -55570 -56196 -61234 -70901 -54805 -70785 -41525 67378 130588 110549 72577
22483 72577 40337 31561 48875 19601 -8660 -14413 -21575 -48569 -60685 -57198 -27818 30346
22471 30346 -9067 -29461 -32633 -29720 35173 21303 5935 -5161 22155 -1883 -48585 -99966
22459 -99966 -118456 -125688 -131625 -115301 -117906 -160824 -156745 -112308 -167727 -166070 -105232 -89496 -69512
22446 -69512 -79246 -83231 -49403 -59629 -94291 -117908 -41848 56266 50435 -36619 6246 28128
22434B8128P407K8561j323n4827k0602m8075J367L401j0991J0768j7009J455N3916
22421a7824L6900m1506r1210o0463Q236j830j671L6533J57m8216J7744k8775O658
22408a85267J00938r639j06917K0211P2399L2254J9890K7982K2615k8926j9015
22397e3475L5658l7516K5380J8903J1081o121n0040j2016L6733O036k7874n9151
22385a12402l6869K0748j715L3936O5507J8740m6271M7381R4954N942p5777k6607
22373a2433j8215O5404K4196M9087K302o7911j3908P2137J238m0587m3025o2950
22361d4665M6921N0772j1288o0823j08816l5551J352O5245M5684M064n720k9059
22349h1884K7091m7314J8355K0970K7944L8728L683J2441l2482P333l69r308L3822
$$ plain form
22434 28128 35535 64096 62773 7946 -12656 -60731 -59364 -55963 -66954 -56186 -73195 -71740 -17824
22421 -17824 19076 -22430 -113640 -174103 -165867 -167697 -169368 -132835 -132678 -180894 -163150 -191925 -185267
22408 -185267 -84329 -93968 -200885 -180674 -108275 -76021 -56131 -28149 -5534 -34460 -53475
22397 -53475 -17817 -55333 -29953 -11050 31 -6090 -56130 -68146 -31413 -25377 -53251 -112402
22385 -112402 -149271 -128523 -130238 -96302 -30795 -12055 -58326 -10945 84009 89951 14174 -12433
22373 -12433 -30648 34756 58952 108039 110341 42430 28522 100659 101897 61310 18285 -44665
22361 -44665 2256 53028 41740 -19083 -127899 -163450 -162098 -96853 -51169 -47105 -52825 -81884
22349 -81884 -54793 -102107 -83752 -62782 -34838 3890 7573 20014 -12468 -5135 -5504 -14812 19010
22336A9010P7247N4487L8327k5892k5642N886Q731l3636n761K3656O81N4745r610
22323A82229J2744O0530J0611n2116p6389m6874j4291l3222q0128q9152Q295O5633
22311e2130N8684L3556K7060M5499M2737L6823m2241o7191n5503k8116j6220K6872
22299I830L4598J5766n953P2148k5436J0262M7103J7426p6619n3077k851L5691
22287G8888K5674j0886L0570O138n4013k3362o5824J9767L9136p06L3525M0746
22275A19653K2454K5940P9594M5275J409j9355k4908J5725o434n0039M8666Q796
22263B66776l8337j6012o0153m8054o870j3126n0866J5505Q573j1328L91q940
22251C7559k0810M2151J7403N4100L2060O8989M9182k2791J194k9813p8499o6046
$$ plain form
22336 19010 96257 150744 189071 163179 137537 143423 152154 118518 112757 136413 137094 191839 182229
22323 182229 194973 255503 266114 213998 137609 90735 76444 43222 -36906 -126058 -117763 -52130
22311 -52130 6554 40110 67170 112669 155406 192229 149988 82797 27294 -822 -17042 9830
22299 9830 44428 60194 54241 126389 100953 111215 158318 175744 99125 46048 43197 78888
22287 78888 104562 93676 124246 130384 76371 53009 -12815 6952 46088 45382 78907 119653
22275 119653 142107 168047 247641 292916 294325 274970 250062 265787 259353 209314 257980 266776
22263 266776 228439 212427 152274 104220 97350 84224 33358 48863 57436 46108 46499 37559
22251 37559 16749 58900 76303 130403 162463 231452 280634 257843 259037 229224 150725 84679
22239H4679l2388j9353k7965M5886O9640P0171K3838K3070L6792k4278M324J833
22227B56249P988M0832N8000j3586j16954p1257J7199O1677L8579N0304M3308
22216C72339M4292N6697N2987p1942n3262j7754o7810n6321m7632L48O0051P6505
22204C48498M0221p073m6658k3017l0390l1352j09580q0649l827J065k5964m4188
22192a2914j2230Q0675J06921K6352n6728o1735L39O7401J08594Q0961J9967p4776
22180B72827p852J6571M0524N2038Q7480J24885Q7212L3119L4373n206P372l4838
22168G08505m7807L6418J33283R8739J19316K09795K70613J96464J86317J75562
22158B087205R9586l106j74733k36822p4104J96367K61745K86312K13171J68650
$$ plain form
22239 84679 52291 32938 4973 50859 120499 190670 214508 237578 274370 250092 254416 256249
22227 256249 264237 305069 363069 349483 232529 161272 178471 240148 278727 329031 372339
22216 372339 416631 473328 526315 454373 401111 383357 315547 259226 211594 211942 271993 348498
22204 348498 388719 381646 334988 311971 281581 250229 140649 60000 56173 57238 31274 -12914
22192 -12914 -25144 55531 162452 188804 132076 70341 70680 138081 246675 327636 347603 272827
22180 272827 264975 281546 322070 374108 461588 586473 673685 706804 741177 735971 743343 708505
22168 708505 660698 697116 830399 929138 1048454 1258249 1528862 1725326 1911643 2087205
22158 2087205 2186791 2183685 2008952 1772130 1698026 1894393 2156138 2442450 2655621 2824271
22148B824271J64165K59103K26438K08287M66659P08715O46522L49344K84115
22139F137619O74921J085390J389490J521369J549246K145642K929381L954848
22131B1387906N790380Q689306J2683807J7890205K0837826J5471239K798873
22124A05549542q960449j2554626j0428685q115046o680493n574891m278529k405357
22116D6551466j018384o86227j044722j892921k719502l488113l980391l976127
22108B7745079l560876l003473k633802k263418k011429j715032j510118j044340
22100A0002591p13191p24224o88291o71852o18763m97211m27504m96461o08734
22091D556360n38480m66582m27898l06005k73306j51662j61063k46716j84162
$$ plain form
22148 2824271 2988436 3247539 3473977 3682264 4148923 4857638 5504160 5853504 6137619
22139 6137619 6812540 7897930 9287420 10808789 12358035 14503677 17433058 21387906
22131 21387906 27178286 35867592 48551399 66441604 87279430 102750669 105549542
22124 105549542 96589093 84034467 73605782 65490736 58810243 53235352 48956823 46551466
22116 46551466 45533082 44846855 43802133 41909212 39189710 35701597 31721206 27745079
22108 27745079 24184203 21180730 18546928 16283510 14272081 12557049 11046931 10002591
22100 10002591 9289400 8565176 7876885 7205033 6586270 6089059 5661555 5165094 4556360
22091 4556360 4017880 3551298 3123400 2817395 2544089 2392427 2231364 1984648 1800486
22082A800486j43873l6116J12815P6514N6417k1972q4526j18611r8524n8886l5137
22071A448587m9733k8790q1042k04628j65661m6869k858j28963j62695j09759
22061D67589m7274P5826J12198k6512j55821o6789k485N0070J08131N5183j3623
22050E56493Q865m1595m9406l2632K892k0850p1140q8359J0956N5568Q3218J0833
22038D24843k0425o0413J4554O6212K1414j2412p4514j10531m6017o5432l1156
22027A06123n0993J2212O448l2191l7696k0813N2408N3785P261m148P3938O4699
22015B31033j7460k0845J5948l6962N9030j3539o8491j10694k7509N7014o3553
22004C972m2053J3257K1823P289j5800O0973N8353N8028j4149k5853M8436k7285
$$ plain form
22082 1800486 1656613 1620497 1733312 1809826 1866243 1844271 1759745 1641134 1542610 1483724 1448587
22071 1448587 1398854 1370064 1289022 1084394 918733 871864 869006 740043 577348 467589
22061 467589 420315 496141 608339 581827 426006 359217 356732 406802 514933 570116 556493
22050 556493 565358 523763 474357 441725 444617 423767 352627 264268 275224 330792 414010 424843
22038 424843 404418 344005 358559 424771 446185 433773 359259 248728 202711 137279 106123
22027 106123 55130 67342 73790 41599 3903 -16910 35498 89283 96544 92396 166334 231033
22015 231033 213573 192728 208676 171714 230744 217205 148714 38020 10511 67525 3972
22004 3972 -38081 -24824 -3001 4288 -11512 49461 107814 165842 151693 125840 174276 146991
21992A46991k4209K566K88l3291n996k1353K1125m7420k2067p7806m1604J6243
21980h6533n0241P7109R9518O170m1723l1056k3956J9942j2929k4156k111k5622
21968i5588K2361O5839N789m0449n2732M4645J3239L3110L4169L6915K2916K4141
21956A14355O856j2361k0852j8010k4989k9468l7587j1632L230J2489L145L6077
21944B1253M5764j4723p7552m0407L8052O9324N420N6305o313q2584o637J1138
21932A9040K2079k1634q087J3679L2818K4649m4411q2329j4066m9357j8068L0309
21920i5378n177j8968l2581k1649M5240K3704J638J697k6462K3J4915M6063J7849
21907d9086K8446n51J1421M215J4441j7534L2869J00158Q1414l3788p9971m7211
$$ plain form
21992 146991 122782 125348 125636 92345 86349 64996 86121 38701 16634 -61172 -102776 -86533
21980 -86533 -136774 -59665 39853 46023 4300 -26756 -50712 -30770 -43699 -67855 -69966 -95588
21968 -95588 -73227 -7388 -1599 -42048 -94780 -50135 -36896 -3786 30383 67298 90214 114355
21956 114355 121211 108850 87998 69988 44999 15531 -22056 -33688 -30458 -17969 -14824 21253
21944 21253 67017 52294 -25258 -65665 -27613 41711 47131 103436 97123 14539 7902 19040
21932 19040 41119 19485 11398 25077 57895 82544 38133 -44196 -58262 -107619 -125687 -95378
21920 -95378 -100555 -119523 -152104 -173753 -128513 -104809 -103171 -101474 -127936 -127913 -112998 -66935 -49086
21907 -49086 -20640 -21191 -9770 -5555 8886 -8648 24221 124379 205793 172005 92034 44823
21895D4823L8328L746p058n6007L4515J0812l6688k471Q761j7560J5640l0655
21883F186j2990O3068L4034K1438r194L2377n1601Q560J2228o7133l7069L592
21871C496j8608L6577L2871p222r20J9741L5326M6620n2247n0535J7377m6854
21859A5622j9791N2766L5189K2505J9355J2122R040K8156p155j2794j3451P04
21847A42268K7098L0555J8483j6693K2022R140o0765l5731Q7901J13252K6089
21836C63619L1399N1820l6625k8304p6993k9542j3438k6483r420n5069j4942O2107
21824B18129Q6481p9594p3181k3443L838N3902M44p8767J4880J3027j2147o3524
21812F0045p8371R72L412R727N8998M2234M8562k1785K1249L0304o073J7643L029
$$ plain form
21895 44823 83151 86897 79839 23832 58347 69159 32471 30000 38761 21201 36841 6186
21883 6186 -6804 56264 90298 111736 102542 134919 83318 91878 104106 36973 -96 3496
21871 3496 -15112 21465 54336 47114 46194 65935 101261 147881 95634 45099 62476 15622
21859 15622 -4169 48597 83786 106291 125646 137768 146808 174964 167809 155015 141564 142268
21847 142268 169366 199921 218404 201711 223733 232873 172108 136377 224278 337530 363619
21836 363619 395018 446838 410213 381909 304916 275374 261936 235453 226033 170964 156022 218129
21824 218129 304610 225016 151835 128392 132230 186132 186576 107809 122689 135716 123569 60045
21812 60045 -18326 -17354 -13942 -4215 54783 97017 145579 123794 145043 175347 169274 186917 189946
21799A89946m0027K9091j1927o5312Q0848K6929J685M1911J3812j7191K4725J9850
21787B94340n310R4496m3786j6041k1614o0086l7283o4269M9159N0081L3862l7441
21775B36108l3372k6197J4089j5080m9905N689p006m4858r5868K110M4543k5837
21763D416L539k870l8925k197j2391m3815K8879Q51P7226N6896o4422o8714M6314
21750a5213M5945P169J134L1204j280J736o042N736n309k1267J7854l8065K518
21737B6120K4614k7020l0436l5498P289M2578m7554N711q247k1891o1056L6118
21725h9272N8338n4263l3168l9928J2290k6423m2804M5770P0904P3277L223k8511
21713e0567J6801J783j7012J8128J3149J4740o959m6606K2809L9193M9812J2192
$$ plain form
21799 189946 149919 179010 167083 101771 182619 209548 211233 253144 266956 249765 274490 294340
21787 294340 289030 383526 339740 323699 302085 241999 204716 140447 189606 239687 273549 236108
21775 236108 202736 176539 190628 175548 125643 131332 124326 79468 -16400 -14290 30253 4416
21763 4416 7955 5085 -33840 -36037 -48428 -92243 -63364 -62513 14713 71609 7187 -61527 -15213
21750 -15213 30732 37901 39035 70239 68959 70695 64653 70389 65080 43813 61667 23602 26120
21737 26120 50734 23714 -6722 -42220 -34931 7647 -39907 -34196 -42443 -64334 -125390 -89272
21725 -89272 -30934 -85197 -118365 -158293 -146003 -172426 -215230 -169460 -98556 -25279 -22056 -50567
21713 -50567 -33766 -31983 -48995 -30867 -17718 -2978 -9937 -56543 -33734 5459 55271 67463
21701F7463j8723l1571k9212Q592J0224j934l0704P6545R3562M3814j7246m6057
21689A24753J1511K6064l0968j7757l9296Q8045K1440k3943K0837J383m4164r40
21677A36965L67k9405p793K6785M521K7769M123j9737P932P937j252N928j3769
21664A50371R90l3424p8476n1445l1188L8866p707M8215K7076L465K4857J0221
21652A01821j9196p474q583L3794q334m0287L7369M6998J3729M4850N8900j9790
21640B33797m0224m0466K0204L2976L1659j4338q8748J9381J5839k9965J2891
21629A53006l64L5378K869l9610j5149K7661k2725n3465r500J7429k2696l3942
21617C8892l9495M2441k8032M102j366k6229k7647k4703n187k4159K7835l4267
$$ plain form
21701 67463 48740 17169 -12043 -3451 6773 4839 -25865 50680 144242 188056 170810 124753
21689 124753 136264 162328 131360 113603 74307 162352 183792 159849 180686 182069 137905 136965
21677 136965 137332 107927 100134 126919 131440 159209 163332 143595 151527 159464 158212 164140 150371
21664 150371 151361 117937 39461 -11984 -43172 -4306 -12013 36202 63278 66743 91600 101821
21652 101821 82625 75151 66568 100362 92028 51741 89110 136108 149837 194687 253587 233797
21640 233797 193573 153107 173311 206287 237946 223608 134860 154241 170080 140115 153006
21629 153006 152642 188020 190889 151279 136130 163791 141066 87601 78101 95530 72834 38892
21617 38892 -603 41838 13806 17908 16542 -9687 -37334 -62037 -67224 -91383 -63548 -97815
21605i7815j5732L1093K5196L591N9000O563O5109j5727j9816Q999j7903j2736
21593A9822m595j2485m6586M7066J9387J7276j862l289j0682m05R191j2192m0795
21580b0149l2391J241K0832J9153K6663J4950m402m0100m9708J0251K6037K1632
21568e991k109o4550l0091L6721J4431l4448l1583k2997L0340L5393l6101p0611
21556a81596l8176j4852J1350l2430J4349K1403N6025P5052L2830N435q529j2455
21544g1594K5003J2463q386j5818K7933N3701j6014k1651J3007n707M132R582
21532F651k4890L7968K3505M3829R7360K6758M224j6401L0690n3980m2806J2290
21520A45198J2435n2622l6618P240J4299J4914n6831L3332O3381R326K6634K2832
$$ plain form
21605 -97815 -113547 -82454 -57258 -53667 5333 11896 77005 61278 41462 50461 32558 19822
21593 19822 15227 2742 -43844 3222 22609 39885 38023 34734 24052 23647 32838 20646 -20149
21580 -20149 -52540 -51299 -30467 -11314 15349 30299 25897 -14203 -63911 -53660 -27623 -5991
21568 -5991 -8100 -72650 -102741 -66020 -51589 -86037 -117620 -140617 -110277 -74884 -110985 -181596
21556 -181596 -219772 -234624 -223274 -255704 -241355 -219952 -163927 -88875 -56045 -50610 -59139 -71594
21544 -71594 -46591 -34128 -42514 -58332 -30399 23302 7288 -14363 -1356 -7063 -2931 6651
21532 6651 -18239 19729 43234 87063 184423 211181 215405 199004 229694 175714 132908 145198
21520 145198 157633 105011 68393 75633 89932 104846 48015 81347 144728 154054 180688 203520
21508B03520M563K5876N1258m028m1387l9585k0033j3870K9173J5839l1040j5375
21496A64911j7154J79P551o4934m887J8975J9695l3518n5860m364N2030K5377
21484A08001P398J2420o660l8131m6385n0134J4416N6227J920k7946j5719k0331
21472d924m3028J2060P5771L4758m693o5495m5491k1930M7950J3563k9290L6295
21460E546M9380J1375k364l3911m373m9175P937K6690L4382r207j6977N4359n7
21447G3605l2479M1099J1731l0038j0265K1597l1934j5797K3855K649l4634n390
21435A3999m1015N1486L2165L5481Q9325P9344n9554p8785j2034k5027n3544L2298
21423F4139N0402M337P0975K3681j9369n1470r694L4607Q239k116m8884m4393
$$ plain form
21508 203520 208083 233959 285217 281189 239802 200217 180184 166314 195487 211326 180286 164911
21496 164911 147757 147936 155487 90553 85666 104641 124336 90818 34958 30594 82624 108001
21484 108001 115399 127819 121159 83028 36643 -13491 925 57152 59072 31126 15407 -4924
21472 -4924 -47952 -35892 39879 74637 69944 4449 -41042 -62972 -15022 -1459 -30749 5546
21460 5546 54926 66301 63937 30026 25653 -23522 -15585 11105 45487 36280 19303 73662 73605
21447 73605 41126 82225 93956 63918 53653 75250 43316 27519 51374 54023 19389 13999
21435 13999 -27016 24470 56635 92116 181441 260785 201231 122446 110412 85385 31841 64139
21423 64139 114541 118878 189853 213534 194165 142695 133001 167608 175847 173731 124847 80454
21411H0454j0630K7970n1174l4655m2543P0141Q4619k2937n0035k0605J7258j0154
21399C7709j2373q377k5657J2486P0724J7383K744k1732L2736M5932K5924k1758
21387A55741j686r035n9134k3428K878M1678M7827j9549J2039M287J13269K6935
21375B91822l9715K6560M2479p3808l3088o6597k9621L9478P127M6641k9009o5157
21363A17112K6115P2072r978m4476l5747o5230j5938N8762Q5119Q7823l1758l4012
21351B09864O605p7473j2546O5095K1076l2625j0438J1774j2652m916j8743K0504
21339A65525P0130n8664N213j815N8061O0037M0437L408m884N409L0656n0700
21327C22813j999M0121N4951K8896K1058O5655N3447P2386K1731n1750l4170l4513
$$ plain form
21411 80454 69824 97794 46620 11965 -30578 39563 124182 101245 51210 30605 47863 37709
21399 37709 25336 16959 -8698 3788 74512 91895 94639 72907 105643 151575 177499 155741
21387 155741 154055 145020 85886 62458 65336 107014 154841 135292 147331 151618 264887 291822
21375 291822 252107 278667 321146 247338 214250 147653 118032 157510 164637 211278 182269 117112
21363 117112 143227 215299 205321 160845 125098 59868 43930 102692 187811 275634 243876 209864
21351 209864 216469 138996 126450 191545 212621 179996 169558 181332 168680 163764 145021 165525
21339 165525 235655 176991 182204 180389 238450 298487 338924 342332 337448 342857 373513 322813
21327 322813 320814 360935 415886 444782 465840 531495 584942 657328 679059 627309 593139 558626
21315E58626O181K0127m1275j5656M5788J06696q667L7098K6012P8101K4695j3391
21303H24335N534K2359P0815R9201J08166M3678M0240O2447P0079J46221J54796
21292A647871J67144K94527K76773L26629M12861N06116N20610N88222P88935
21283E529688R17987J002343J151123J384399J699117K301118K848725L156319
21275A9990819K856246J970275P52008k53653o48671n51479l17754l3900J64525
21266B3928416J23270J2343j03388m04784p74317j137204j352916j343690j266548
21257A7681182j160785j000848q52973o28937n16740m51704l92078k48237p6620
21248A2352260R9160L63565O23760Q43003J104357J279785J275304J142706J103434
$$ plain form
21315 558626 564807 584934 543659 528003 573791 680487 671820 708918 734930 813031 837726 824335
21303 824335 829869 852228 923043 1022244 1130410 1174088 1214328 1276775 1346854 1493075 1647871
21292 1647871 1815015 2109542 2386315 2712944 3125805 3631921 4152531 4740753 5529688
21283 5529688 6447675 7450018 8601141 9985540 11684657 13985775 16834500 19990819
21275 19990819 22847065 24817340 25569348 25315695 24667024 24115545 23797791 23763891 23928416
21266 23928416 24051686 24064029 23960641 23555857 22781540 21644336 20291420 18947730 17681182
21257 17681182 16520397 15519549 14666576 14037639 13520899 13069195 12677117 12428880 12352260
21248 12352260 12451420 12814985 13438745 14281748 15386105 16665890 17941194 19083900 20187334
21239B0187334J254553J463909J553572J659779J898074K523189L313693L850497
21231C7704600L573290K126045k1416j839748k648410k648535k336886k113524
21223C1795416k027806j879263j654186j392814j293133j371515j441421j548578
21215A9186700j605912j606947j550363j499298j289111j202941j079119r34050
21207H418959p96697p83219o71369n80406n34382n15443l92993l07268l34534
21198C502648l36090k77484k65959k33393k64939k19665j18245j00658r4288o9663
21188A522264o2359o8205o6386j30060k029J6034J7451l129l1412k1577m0130
21177A130462m3701q0429l6949k2378K955p967n4139m9945p9723o6529k5489k8393
$$ plain form
21239 20187334 21441887 22905796 24459368 26119147 28017221 30540410 33854103 37704600
21231 37704600 41277890 43403935 43382519 41542771 38894361 36245826 33908940 31795416
21223 31795416 29767610 27888347 26234161 24841347 23548214 22176699 20735278 19186700
21215 19186700 17580788 15973841 14423478 12924180 11635069 10432128 9353009 8418959
21207 8418959 7622262 6839043 6167674 5587268 5052886 4537443 4144450 3837182 3502648
21198 3502648 3166558 2889074 2623115 2389722 2124783 1905118 1786873 1686215 1591927 1522264
21188 1522264 1459905 1391700 1325314 1195254 1193225 1209259 1226710 1223581 1192169 1170592 1130462
21177 1130462 1086761 1006332 969383 947005 949960 941993 887854 837909 758186 691657 666168 637775
21165F37775J8601k6346K8903O8425l6390K667K6083k5203n896J2120O828n1848
21153F55719k7062j8333K254j8129J054N1931L1285j7529m8767K5120m3555j17315
21141D76673p8031o4978K9558j7122p5312L5360N6848j5718K8411n175L419O1858
21129D35791Q0493p971k0296k1131m0113K2568N623J3186K2995K3659O6528j2314
21117E69018l8990m464M2080K2284O6690O5491k6803k2033K1938M6224K4854O5553
21105H31842K5282L2524Q5944L4446O4876J05249M2909Q0266R4520J01095R7251
21094A596204R5869J81058K07363K02826J76906K42859K73723L04230M18652L97893
21084D097583M73901N63445O76802Q41593J131332J410609J664022J888969K155183
$$ plain form
21165 637775 656376 630030 658933 727358 690968 693635 719718 694515 688619 700739 707567 655719
21153 655719 628657 610324 612578 594449 595503 647434 678719 661190 612423 637543 593988 476673
21141 476673 398642 333664 363222 346100 270788 306148 362996 347278 375689 370514 373933 435791
21129 435791 516284 508313 488017 466886 426773 449341 454964 468150 491145 514804 581332 569018
21117 569018 530028 525564 567644 589928 656618 722109 695306 673273 695211 741435 766289 831842
21105 831842 857124 889648 975592 1010038 1074914 1180163 1223072 1303338 1397858 1498953 1596204
21094 1596204 1692073 1873131 2080494 2283320 2460226 2703085 2976808 3281038 3699690 4097583
21084 4097583 4571484 5134929 5811731 6653324 7784656 9195265 10859287 12748256 14903439
21075A4903439K653712L281556M143489M745662M520302L221128J241037m45695
21067C8264630j191626j134060q93482p34827o70221p03751p16245n45996n06642
21058C1167780p63403j175548j524866j782259j880819j820130j639518j427346
21050A9153891j281618j080772r30820q42351p22327n53276m39100j82779L5727
21041A3156575K05474M91973P60374R35237R63325R72441R41496Q88088O85773
21032B0000756N34525P30121J263015J769683K058959K038416J328718J02486
21024B9826679j062080j773527j891221j758636j589261j415193j283300j136185
21016A7917276j037667r17171r20531r78166r84092j141575j081484j024010r35149
$$ plain form
21075 14903439 17557151 20838707 24982196 29727858 34248160 37469288 38710325 38264630
21067 38264630 37073004 35938944 35045462 34310635 33640414 32936663 32220418 31674422 31167780
21058 31167780 30404377 29228829 27703963 25921704 24040885 22220755 20581237 19153891
21050 19153891 17872273 16791501 15860681 15018330 14296003 13742727 13303627 13120848 13156575
21041 13156575 13362049 13854022 14614396 15549633 16512958 17485399 18426895 19314983 20000756
21032 20000756 20535281 21265402 22528417 24298100 26357059 28395475 29724193 29826679
21024 29826679 28764599 26991072 25099851 23341215 21751954 20336761 19053461 17917276
21016 17917276 16879609 15962438 15041907 14063741 13079649 11938074 10856590 9832580 8897431
21007H897431q39206q12591o94803o46428n59163m56893m54575l79901l07571
20998C746300k38278k72928k92413j94796k19446k62869j83339j45364j63900
20989A772967j84739j53215q7341j27701k4742K7161N28o5247l6134k7559r013
20978A084965k3428k5449m5783n0612q4418q6078j02488P872q806j5382k3728
20967F26665n3500q30j133j5894j5996K556k0183m2815j0535j4672P4590L1772
20955E60025r0618m5637P045k900P479L6105l7430k7335Q1531J8435k1535P350
20943D92515o1442p0429k2210m041Q405m0978o410J5347K6422n592m8870n8679
20931B24038k1243L262j078n6385l0382m0520J252K7204m5124p769L5894l5347
$$ plain form
21007 8897431 8058225 7245634 6550831 5904403 5345240 4888347 4433772 4053871 3746300
20998 3746300 3508022 3235094 2942681 2747885 2528439 2265570 2082231 1936867 1772967
20989 1772967 1588228 1435013 1347672 1219971 1195229 1222390 1222918 1157671 1121537 1093978 1084965
20978 1084965 1061537 1036088 990305 939693 855275 769197 666709 674581 665775 650393 626665
20967 626665 573165 572335 571202 555308 539312 541868 521685 478870 468335 453663 528253 560025
20955 560025 469407 423770 430815 427915 435394 471499 434069 406734 488265 506700 485165 492515
20943 492515 431073 360644 338434 334393 342798 301820 295410 310757 337179 331587 282717 224038
20931 224038 202795 206057 204979 148594 118212 77692 78944 106148 61024 53255 89149 53802
20919E3802l7494J6700K2574K2430Q0816m8687m1677K5391k1021m0474n5988N7684
20907C4056L5220K4461j1113j9067M4950R904K3182M3727n8154L5211O9089P0048
20895C01514R811o9015o7350k1961J4982j8709n030K0737m4237k9571Q150M4684
20883A44005K3150M3528k7644p0363K3150N840P99j2327Q226N745j8470p3787
20871E1852k0559K0793K495o049j0166n6872k4172m4053L3202L6757L1581J1219
20859B6028k5173q286Q7454R9371N8462r514j04089m3675l5251k1011l5395J8804
20847G725L9146J8535N3247P5357m628L7738l65m2444J2741j3061j4823n558m9981
20834A13629l0450J4294M7869m5974K740O521M777N43j470q213n5833p573J1258
$$ plain form
20919 53802 16308 33008 55582 78012 158828 110141 68464 93855 72834 32360 -23628 34056
20907 34056 69276 93737 82624 63557 108507 118411 141593 185320 127166 162377 231466 301514
20895 301514 311325 242310 174960 152999 167981 149272 144242 164979 120742 91171 99321 144005
20883 144005 167155 210683 183039 112676 135826 141666 142465 130138 138364 144109 125639 51852
20871 51852 31293 52086 54581 48532 38366 -18506 -42678 -86731 -53529 -16772 14809 26028
20859 26028 855 -7431 80023 179394 237856 228342 124253 80578 45327 24316 -11079 7725
20847 7725 46871 65406 118653 194010 189382 227120 226755 184311 197052 183991 169168 163610 113629
20834 113629 83179 97473 145342 99368 102108 108629 113406 113949 112479 104266 48433 40860 52118
20821E2118o444j0133j4911K8549N3587k6287l6475p796K2605M3654m727k832
20809I0908r648K3600l557j7605j923l516N5655M1916l2176N3697M0420l8712
20797A99059q261L2016K8168M7278J873j6045n2529q4602k5021Q092k9561K2518
20785A22985L1996p2833J3217L7565P189N9243O8772K7957q8887j0046p7667m0394
20773G9097K0819J2324M5304R477k6346N380k9718J2730m706k1737J6854J2561
20761A32039j6102j9140J8647K7720M6320p902o8870m0319K1237O0517K3228J8366
20749A95741n3733o434k1691J9913m4661L3672k7851J216N0861J1660J2938J2902
20737A84533n2586j6650L1477l0775n8094J9432O3364M817l3288L375M0874K0913
$$ plain form
20821 52118 45674 35541 20630 49179 102766 76479 40004 32208 54813 98467 93740 90908
20809 90908 81260 104860 101303 83698 81775 78259 133914 175830 143654 197351 237771 199059
20797 199059 190798 222814 250982 298260 300133 284088 231559 146957 121936 130028 100467 122985
20785 122985 154981 82148 95365 132930 140119 199362 268134 296091 207204 197158 119491 79097
20773 79097 99916 112240 157544 167021 140675 146055 116337 129067 124361 102624 119478 132039
20761 132039 115937 96797 115444 143164 189484 181582 112712 72393 93630 154147 177375 195741
20749 195741 142008 135574 113883 133796 89135 122807 94956 96172 147033 158693 171631 184533
20737 184533 131947 115297 146774 115999 57905 77337 140701 145518 112230 115605 156479 177392
20725A77392K1170k0156r914q2384j0714M8027K3609l469L2948K6046k8300o1836
20713A12419m5457R2422J9344m2034k3031K2113J3979M3816n1113K0465L1859
20702A94782P0401K3046M3746M6202J6594o9782k8874j4191j5136j5535j4j6059
20690B35180N8047j189J9979k5926l0222m119j3941R25m6652M672K7677K4419
20678B48850j6785o0749p337k5065k3457J8595k084j8319J5227O6982p9833m8514
20666F7511k533L4865l445M6770l288J922n804J0529m6377k7552K5548K6700K0091
20653A44937L0019R2439M8921n1050r449j1837J1456K6942k9120p6082l5821n517
20641A35838L3339K2353p0620o7471j6071P4739n538k9520J002O11m6638l3077
$$ plain form
20725 177392 198562 178406 168492 86108 75394 123421 147030 143561 176509 202555 174255 112419
20713 112419 66962 159384 178728 136694 113663 135776 149755 193571 142458 162923 194782
20702 194782 265183 288229 331975 378177 394771 324989 296115 281924 266788 251253 251239 235180
20690 235180 293227 292038 312017 286091 255869 251750 237809 238734 192082 196754 224431 248850
20678 248850 232065 171316 163979 138914 115457 134052 131968 113649 128876 195858 116025 67511
20666 67511 64978 99843 96398 143168 139880 141802 135998 146527 100150 72598 98146 124846 144937
20653 144937 174956 267395 316316 265266 255817 243980 255436 282378 253258 177176 141355 135838
20641 135838 169177 191530 120910 53439 37368 112107 106569 77049 78051 78662 32024 -1053
20629a053J9243l4073K5365O12m2467N3871J2739m4260m669K1506N3914J5644
20617G6372m9673j05672P6L7296L1766K0836k8093j6765l7072j2766j6254M2972
20605e6977R6335R2854n6659n3923n480q882k2180j2718N7071M8672j084M8182
20593A25211J9468m4528k4388L2278o772Q273N6644J4070j4839j0330j9920k2146
20581A13021l4539l1556J632j4761k1158L7102Q1135O8343J0106M1173o7868n3131
20569A29499j7284J4781n3918m0614J1023o235L8520q225R187L9396K7206k8070
20557A15266O177L5043q465r667n854P612n5575j2290k7222m2338M5937K4478
20545G3102n1150j4683K4307J7625J9391K9796j7839M5246J265n4094o939q262
$$ plain form
20629 -1053 18190 -15883 9482 10094 -32373 21498 34237 -10023 -14692 6814 60728 76372
20617 76372 26699 -78973 -78897 -41601 -9835 11001 -17092 -33857 -70929 -83695 -99949 -56977
20605 -56977 39358 132212 75553 21630 16150 7268 -14912 -27630 29441 78113 77029 125211
20593 125211 144679 100151 75763 108041 101269 109542 166186 180256 165417 155087 135167 113021
20581 113021 78482 46926 48558 33797 12639 49741 130876 199219 209325 250498 182630 129499
20569 129499 112215 126996 73078 32464 43487 37252 75772 67547 76734 116130 143336 115266
20557 115266 121443 156486 148021 138354 132500 140112 84537 72247 45025 2687 48624 73102
20545 73102 21952 7269 31576 49201 68592 98388 80549 125795 127060 72966 66027 57765
20533E7765j2305o0304m366O9631M8415J3537L4731j954l5182l7412l1224p044
20521C4288J4460k5101k7291L3817J4734K8808j6221l3846l5350n4781K8603K7613
20509a0267P2967K6775o4795m3098O0645L2935k1095m3067j8225M2502J4687k0467
20497B9497L1013j8417m8474L1772N0127j0253k1182m6516l4213l681j7997J3122
20485d5202M2700J6702K6723j5108j4567j8379L1181l732L5385L4113p3313p3260
20473e6757P7802j5485J1489r797O6005k6564l4992J1590K4623P5928M8321m5899
20461A26264j0004n0122q3847j7905N8107O5204K7310L6811k357O665k6115p810
20449A22201l8686k1212N1144N5053m8374J8437M6742m237L38p6572k4159p2958
$$ plain form
20533 57765 45460 -14844 -19210 50421 98836 112373 147104 145150 109968 72556 41332 34288
20521 34288 48748 23647 -3644 30173 44907 73715 57494 23648 -11702 -66483 -37880 -10267
20509 -10267 62700 89475 24680 -18418 42227 75162 54067 11000 -7225 35277 49964 29497
20497 29497 60510 42093 -6381 25391 75518 65265 44083 -2433 -36646 -40327 -58324 -45202
20485 -45202 -2502 14200 40923 25815 11248 -7131 24050 20318 55703 89816 16503 -56757
20473 -56757 21045 5560 17049 7252 73257 46693 11701 23291 47914 123842 172163 126264
20461 126264 116260 66138 -17709 -35614 22493 87697 115007 151818 149461 156126 130011 122201
20449 122201 83515 62303 113447 168500 120126 138563 185305 181068 181406 104834 80675 7717
20437G717J4927O3663K187o0271j0105J00138O3112J3083j2833m1516P850K5984
20425A73936k5965l0305m1036j6628L7629N6185l011K0379K5392m1136j4766R030
20413A49704J4825L5685K9581j3035o1378k1692M3907O424k8975l6316j1662n8161
20401D8907L397Q27M7027L8151Q026l4670k4895L644p105l5832L1745M0321k6152
20388I3391L6549j1043l2658M133Q107n1526J6643M9323K2784k2586o1272n4836
20376b991K1728M673K7667j4866L3968N0996l5820n0107l5145J5320J7285l0625
20364B083k2959l4566l8576K7649k272P0013O7470L3947l6346n0362l7137J4953
20352f103M6900m027J1801M702J9931m9229J5947k8240o1749L7020M2490J4457
$$ plain form
20437 7717 22644 86307 88494 28223 18118 118256 181368 194451 181618 140102 147952 173936
20425 173936 147971 117666 76630 60002 97631 153816 150805 171184 196576 155440 140674 149704
20413 149704 164529 200214 229795 216760 155382 133690 177597 184021 155046 118730 107068 48907
20401 48907 52304 53131 100158 138309 146335 111665 86770 90414 83309 47477 79222 119543 93391
20388 93391 129940 118897 86239 90372 98479 46953 63596 112919 135703 113117 51845 -2991
20376 -2991 18737 23410 51077 36211 70179 121175 85355 35248 103 15423 32708 2083
20364 2083 -20876 -55442 -94018 -66369 -68641 1372 68842 102789 66443 16081 -21056 -6103
20352 -6103 40797 36770 48571 53273 73204 23975 39922 11682 -50067 -13047 29443 43900
20340D3900L7667J7919l8384m3436p823O900k4353K7699J334j9983M277m3099
20328c7382M488K734L059P6632M9841J3673M632k4798o4777J80M1207J5535l4325
20315E0699j8343O525j1373k6083j0745N2642j5621j6559M2759K3136l7137l1982
20303G918o796r592k2873J3940J9866J310k789l2814k744K7771M5869N3989M743
20290I7798n4762O569M5532k0672o697J4109J9339m1857l3651m5130j0877m6683
20278g6982m900L6769L4450l4288K8109j4242p352Q14M0544N332m5732m4110J4390
20265f7198O9984K6409k4003j6700m7423l8759J9485N6943o194n8030K2005K8115
20253c5366M1756K5669J1606k6887P297O4404L3493n0661k2516l2017j2549j5129
$$ plain form
20340 43900 81567 99486 61102 17666 9843 16743 -7610 20089 21423 1440 5717 -37382
20328 -37382 -32894 -30160 -27101 49531 99372 113045 117677 92879 28102 28282 69489 85024 50699
20315 50699 32356 38881 27508 1425 -9320 43322 27701 11142 53901 77037 39900 7918
20303 7918 1122 -8470 -31343 -17403 2463 3773 984 -31830 -34574 -6803 39066 93055 97798
20290 97798 43036 49605 95137 74465 67768 81877 101216 59359 25708 -19422 -30299 -76982
20278 -76982 -81882 -45113 -10663 -44951 -16842 -31084 -38436 -37622 2922 8254 -37478 -81588 -67198
20265 -67198 2786 29195 5192 -11508 -58931 -97690 -78205 -21262 -27456 -85486 -63481 -35366
20253 -35366 6390 32059 43665 16778 24075 88479 121972 71311 48795 16778 4229 -10900
20241a0900k7576M8910L1305j5514R43m4787j833J272J6568J521J969o880M6861
20228D1859m994M422J860Q01m0218l809K8858j6029j8285l9116j9390k9694J7547
20215g6188M3248R252k5683j1893K3461M6690J5069p5722n626O071J8206K6225
20203f890j537m1582m7992k9414L8554j541L4301M4899L5355j4449k0254O991
20191c559j8002j1693m4739N508P8804k9194m489L8228l6660l9549M47R6845R901
20178D1848L1941r64j2853o2395n3664P9009K9638k2487j2185k3584l5976K2146
20166a9526P3392P410q849j5841k9041j6229L9814O793k4129M2339Q408k4709
20154C9832R499L4687O937J6870k8972k1402m0882k2669l088J4115M1298p890
$$ plain form
20241 -10900 -38476 10434 41739 26225 27168 -17619 -19452 -18180 -1612 -91 1878 -5002 41859
20228 41859 36865 41287 43147 43948 3730 -79 28779 12750 -5535 -44651 -64041 -93735 -76188
20215 -76188 -32940 -23688 -49371 -61264 -37803 8887 23956 -51766 -57392 -51321 -33115 -6890
20203 -6890 -8427 -50009 -98001 -127415 -88861 -90402 -56101 -11202 24153 9704 -10550 -3559
20191 -3559 -21561 -33254 -77993 -72485 6319 -22875 -27364 10864 -25796 -65345 -64898 31947 41848
20178 41848 73789 72825 59972 -2423 -56087 22922 52560 30073 17888 -5696 -41672 -19526
20166 -19526 53866 61276 52427 36586 7545 -8684 31130 37923 13794 56133 64541 39832
20154 39832 49331 84018 90955 107825 78853 57451 16569 -6100 -9188 4927 46225 38335
20142C8335p871k8766l2128k6469L4258L8747L1131M6802j764r2195m9258K010
20130d7168O52O801M0762P819j5139k4616J231K1244K4632r495k8849N2534M6513
20117G6921k5093J9607K1465k229m1400l5409J1261m0010o256J9981K9274k7911
20105B01M489L3197j166j3831M934k772k1972K952l575J7627K8644n8359j1396
20092b1027k7529K5041M1057o0071l7055J5511P808o231N1874P326j9859n1069
20080g4224j4008L2201J2734j038n908j8166l3620m1465Q6884R5846O538m7110
20068a336o9819J8113L425p699J624M8427L6823r052q627l8156n64j4119k0379
20055f1339O9411J0346K568m6904k1592L904j9505k8964N4621p356O20N9375M3174
$$ plain form
20142 38335 30464 1698 -30430 -56899 -22641 16106 47237 94039 92275 80 -49178 -47168
20130 -47168 -46516 -39715 1047 8866 -6273 -30889 -29658 -8414 16218 6723 -22126 30408 76921
20117 76921 51828 71435 92900 90671 49271 13862 25123 -14887 -21143 -1162 28112 201
20105 201 4690 37887 36721 22890 27824 25052 3080 6032 2457 20084 48728 -9631 -21027
20092 -21027 -48556 -23515 17542 -42529 -79584 -64073 -56265 -62496 -10622 -3296 -23155 -74224
20080 -74224 -88232 -56031 -43297 -44335 -50243 -68409 -102029 -143494 -56610 39236 45774 -1336
20068 -1336 -71155 -53042 -49617 -57316 -55692 -7265 29558 20506 11879 -26277 -26841 -40960 -61339
20055 -61339 8072 18418 20986 -25918 -47510 -43606 -63111 -92075 -37454 -44810 -44190 15185 58359
20042E8359j2035m8295j5378l7494o151P8631J01437L4225q3927p2871o3758K5424
20030d1833O9043M5919M200J4691m2136j659O8551J1669n3665r3027j4767k3761
20018e6775N1655J7950j6357l4875J5850L3379L2605j237O3767l1551p0259k4623
20006b0471j7890m3194j1333J4249L5120o446o02Q795j8180m8556j6279n3892
19994a78679N7170P9005K7542O0166J7364j5080K6739K3097k9004k8875m5522
19983f077q128o4852L9793O5558K0138j9422j4385N5779M4604k9747o594l3838
19971D2829o9042m7724J4742k526L2665L1080j8657q1081l9223R8965P3107k8476
19959F659K8464N9224L8480p0738k8992J6399j0223M2053L4408L4162j9830l9821
$$ plain form
20042 58359 46324 -1971 -17349 -54843 -60994 17637 119074 153299 69372 -3499 -67257 -41833
20030 -41833 27210 73129 77329 92020 49884 48225 116776 128445 74780 -18247 -33014 -56775
20018 -56775 -5120 12830 -3527 -38402 -22552 10827 43432 42195 105962 74411 4152 -20471
20006 -20471 -38361 -81555 -92888 -78639 -43519 -49965 -50567 -41772 -59952 -108508 -124787 -178679
19994 -178679 -121509 -42504 -14962 45204 62568 47488 74227 97324 68320 39445 -6077
19983 -6077 -14205 -79057 -39264 26294 46432 27010 12625 68404 113008 83261 76667 42829
19971 42829 -26213 -73937 -59195 -61721 -29056 2024 -16633 -97714 -136937 -37972 35135 6659
19959 6659 35123 94347 132827 62089 33097 49496 39273 81326 115734 149896 130066 90245
19947I0245j8309K5578k8240r5473j7063J10346l8327n3328r110J4080K4179K3163
19935B7741k3275n457r627l8874O8472N9231P575J6023L767m8610j4453K4701
19923F7214R7655Q600Q530o5062j4843M379o6517k1041J8690K6670l1655J5890
19911D8510R282m2495m131j9754m7075q056N9223o314j5444N3497P4347k056k3110
19898G6424l2104k7744j4863K1793q1704n2312k1742K6114P5151O9034J8839m8798
19886H088o1100k6380K117N173J1645J5585k0495J894O4206L7873j9595k3941
19874d930l1511j4601K4668P0225M5442j6564M896j6896j0753j5434k3583k2686
19862a1727j83M8625m8352m7670R2368K1098o3572l2101k8891p008J259P078p358
$$ plain form
19947 90245 71936 97514 69274 -26199 -43262 67084 28757 -24571 -33681 -19601 4578 27741
19935 27741 4466 -991 -10618 -49492 18980 78211 85786 101809 105576 56966 42513 67214
19923 67214 164869 173469 181999 116937 102094 106473 39956 18915 37605 64275 32620 48510
19911 48510 57792 15297 11166 -8588 -55663 -63719 -4496 -10810 -26254 27243 101590 99534 76424
19898 76424 44320 16576 1713 23506 -58198 -110510 -132252 -106138 -30987 38047 56886 8088
19886 8088 -53012 -79392 -77275 -72102 -60457 -44872 -65367 -63473 733 38606 19011 -4930
19874 -4930 -36441 -51042 -26374 43851 89293 72729 77625 60729 49976 34542 10959 -11727
19862 -11727 -11910 36715 -11637 -59307 33061 54159 -9413 -41514 -70405 -77413 -76154 -69076 -76434
19849g6434K6575j6581k6917O4690O5772L8086n4932q8077L735L4116M830M0063
19837A4926P723k159r140j6788l2772l8320k1122N1026k1906J5632J1381M7697
19825F178N9718K1694o71N237j1070J3804M1251k0546p5216K9228O0621l3163
19813I7065r6668P635K910L9574k424m3915l217m9101k0722k000K9255L7134q132
19800a2606j1098n057M387M6022j0899l1125k6484K276n487p670J6470O429j6924
19787e1766K0264m6767L4230P7384K4594k4000n5574R837J5193J3641J9611Q923
19775D5570m5152j9064K5769L4507o519q0672m1825r514L7451Q2205M4430K2729
19763H9915o0152o9403l2803J7521J1415j10J5686k1248j1661m3529j4807K3295
$$ plain form
19849 -76434 -49859 -66440 -93357 -28667 37105 75191 20259 -67818 -64083 -29967 -25137 14926
19837 14926 22649 20490 11350 -5438 -38210 -76530 -97652 -46626 -68532 -52900 -41519 6178
19825 6178 65896 87590 86919 92156 81086 94890 136141 115595 40379 69607 130228 97065
19813 97065 397 8032 10942 50516 48092 4177 960 -48141 -68863 -70863 -41608 -4474 -12606
19800 -12606 -23704 -28761 -24374 21648 10749 -20376 -46860 -44584 -50071 -57741 -41271 -34842 -51766
19787 -51766 -31502 -78269 -44039 33345 57939 33939 -21635 -11798 3395 17036 36647 45570
19775 45570 418 -18646 7123 41630 35111 -45561 -87386 -96900 -59449 22756 67186 89915
19763 89915 29763 -39640 -72443 -54922 -43507 -43617 -27931 -49179 -60840 -104369 -119176 -95881
19751i5881M8797K4339J712J6666l7477J3847O5790k1832j1809m9585K7639n185
19739b2979L1856M0557K189M4962J1203l2520j5077o4424k0026J4334R799J3827
19727A3701L2527K3070l8374k1980n965j5525M091M5647K5957K8810J7513n1639
19715E7833q159k7525K9113J3887n7608n808L9254O340R170n8314j8832K0015
19703f34j9535k9493J6471M8894L0852K4739j4929K9233j2843p4484J8732O5216
19691H2219Q152l4937K0655o865K0150N096K2463j6127m7190j0356J9023m1733
19679B0550k0332J0325M4654Q3922J7233r3014q456P012O175J8178o5130j3507
19667G610p778q899R679l6228l3425k8498J4027K3831N5703p807M6594N33o8421
$$ plain form
19751 -95881 -47084 -22745 -21033 -4367 -41844 -27997 37793 15961 4152 -45433 -17794 -22979
19739 -22979 8877 49434 51623 96585 107788 75268 60191 -4233 -24259 -9925 -126 13701
19727 13701 46228 69298 30924 8944 2979 -12546 -8455 37192 63149 91959 109472 57833
19715 57833 49674 22149 51262 65149 7541 1733 40987 47327 56497 -1817 -20649 -634
19703 -634 -20169 -49662 -33191 15703 46555 71294 56365 85598 72755 -1729 17003 82219
19691 82219 90371 55434 76089 69224 89374 94470 116933 100806 53616 43260 62283 20550
19679 20550 218 10543 55197 139119 156352 63338 54882 61894 68069 86247 21117 7610
19667 7610 -168 -9067 612 -35616 -69041 -97539 -83512 -59681 -3978 -11785 34809 35342 -33079
19654c3079N2424K4794J528J6135M876j1075k8051j465L5607m6489l8276N5736
19642C2665O022k996R055L6595L4373l0238k7827k8325K9274N4797j2069o6645
19630C4681Q029o8260j4683l4512L0467L4422m67o866k5006o224k3727O2153J10850
19617A00857j3115j9093n6385L1275k3816j9719k3374j3734L864j1323O6549M263
19605B6249q252k0402k7702m0912j977M1660j4511R639M5912q1705K6710O1005
19593A5714L0169R632l7579R820j7676j2098L0630N7738m5239o0614n6270j2069
19581h7842K2494M8331j0060n9674k688M826K9554l6240n8722N6445L1653L072
19569e8851M5505N4070K2538J4364l6106j982M7605O8722n0217k9353m6626n1175
$$ plain form
19654 -33079 19345 44139 45667 61802 66678 55603 27552 26087 61694 15205 -23071 32665
19642 32665 38687 35691 44746 81341 115714 85476 57649 29324 58598 113395 101326 34681
19630 34681 42710 -25550 -40233 -74745 -44278 -9856 -10323 -17189 -42195 -48419 -72146 -9993 100857
19617 100857 87742 68649 12264 43539 19723 4 -23370 -37104 -33240 -44563 21986 26249
19605 26249 17997 -2405 -30107 -71019 -72996 -31336 -45847 -36208 9704 -72001 -45291 15714
19593 15714 45883 55515 17936 27756 10080 -2018 28612 86350 41111 -19503 -75773 -87842
19581 -87842 -65348 -17017 -27077 -86751 -89439 -84613 -55059 -91299 -150021 -93576 -61923 -58851
19569 -58851 -13346 40724 63262 77626 41520 39538 87143 155865 105648 76295 29669 -21506
19557b1506L0614R165k0129P869k3022j3368M0646J2597k9747k1328K564l2813
19545e8458m0386L5622L2700j0107K3825n7506q556M3330O0018m036o3438r669
19533e6661k2190M1913K9355k443N8170J2829o6936l9182J3260P429l6543r056
19521g0055N9973j0004L2524J8862M0333j4265m2330m2350m955M3192K4393j1790
19509B3528p636r748k2060j3636j7695L9909J1461m745J7418K7715J9066m2011
19497B1566L9747J7313o9415l5849k3504m0628O4621O3925P566P942m1535m1508
19485b9759r448l4079M2141r74n9519L240M3069K2347K5981j8795k7805J7233
19473b6368K2593L4545k2664r239l2112K5170j6078n094M0102k6677p918J5549
$$ plain form
19557 -21506 9108 18273 -1856 6013 -17009 -30377 10269 22866 -6881 -28209 -25645 -58458
19545 -58458 -98844 -63222 -30522 -40629 -16804 -74310 -82866 -39536 20482 16446 -46992 -56661
19533 -56661 -78851 -36938 -7583 -10026 48144 60973 -5963 -45145 -31885 -24456 -60999 -70055
19521 -70055 -10082 -20086 12438 31300 71633 57368 15038 -27312 -32267 10925 35318 23528
19509 23528 15892 6144 -15916 -29552 -47247 -7338 4123 -622 16796 44511 63577 21566
19497 21566 61313 78626 9211 -26638 -50142 -90770 -26149 37776 45342 53284 11749 -29759
19485 -29759 -39207 -73286 -31145 -32119 -91638 -88398 -45329 -22982 2999 -15796 -43601 -26368
19473 -26368 -3775 30770 8106 -1133 -33245 -8075 -24153 -29247 10855 -15822 -23740 -8191
19461h191M1236M4093p6541m8972K6647O3727J2291o5311j8397M1206K3557j4033
19449B1312n5763K847L7360l983K3988J377l708l9709M2827L396m6876L5317L0374
19436D8759j4155l6215J6316N296l266j730M4504L3575N6173N3988l8953q1361
19424H2931m5614k519K0935k8331n0995K0142L3399K8150n917K5112n3278n2591
19412b8576K8342L4719j9112K3686k3169j2463n0300k9135K235O5209q278k2965
19400c9807N8134o031k9092N6239K9973K2599k3425k9462N265m3197k4308J1878
19388a1234j624k2955m5296K7222M6621k2508L5025K1937l2091J4559N0465K9996
19376I0117m1382k0713o651J3819L2607k8791j3706K5475j6554J0407K5791L1635
$$ plain form
19461 -8191 33045 77138 597 -48375 -21728 41999 54290 -11021 -29418 11788 35345 21312
19449 21312 -34451 -31604 5756 1773 25761 27138 23430 -16279 26548 29944 -16932 18385 48759
19436 48759 34604 -1611 14705 20001 16735 15005 59509 93084 149257 203245 164292 82931
19424 82931 37317 34798 55733 27402 -23593 -3451 29948 58098 52181 77293 24015 -28576
19412 -28576 -234 34485 15373 39059 15890 3427 -46873 -76008 -73773 -8564 -16842 -39807
19400 -39807 18327 12296 -16796 39443 69416 92015 68590 39128 44393 1196 -23112 -11234
19388 -11234 -12858 -35813 -81109 -53887 -7266 -29774 5251 27188 -4903 9656 60121 90117
19376 90117 48735 28022 21371 35190 67797 39006 25300 50775 34221 44628 70419 102054
19364A02054m0627j77J3499k2222q6625p17K3727k989k359j6670m0733J587L3354
$$ plain form
19364 102054 61427 61250 74749 52527 -34098 -34815 -11088 -14077 -16436 -33106 -73839 -72252 -38898
$$ [...]
##END NTUPLES=NMR SPECTRUM
##END=
