##TITLE=Analysis number 330106
Compound Code cc 66626
Book Reference 5556/21
Project Code adrs
Chemist Name colinb
##JCAMPDX= 6.0         $$ Bruker NMR JCAMP-DX V2.0
##DATA TYPE= NMR SPECTRUM
##DATA CLASS= NTUPLES
##ORIGIN= Bruker BioSpin GmbH
##OWNER= nmr
$$ XWIN-NMR		Version 3.5
$$ Mon Oct 29 10:20:00 2007 GMT Standard Time (UT+0h)  MAYBRIDGE\nmr@NMR_250MHZ
##.OBSERVE FREQUENCY= 250.131544655141
##.OBSERVE NUCLEUS= ^1H
##.ACQUISITION MODE= SIMULTANEOUS (DQD)
##.ACQUISITION SCHEME= undefined
##.AVERAGES= 16
##.DIGITISER RES= 18
##SPECTROMETER/DATA SYSTEM= dpx250
##.PULSE SEQUENCE= zg30
##.SOLVENT NAME= CDCl3
##.SHIFT REFERENCE= (INTERNAL, CDCl3, 0, 16.522)
##AUDIT TRAIL= $$ (NUMBER, WHEN, WHO, WHERE, WHAT)
$$ ##TITLE= Audit trail, XWIN-NMR		Version 3.5
$$ ##JCAMPDX= 5.01
$$ ##ORIGIN= Bruker BioSpin GmbH
$$ ##OWNER= nmr
$$ C:\u/data/dgb/nmr/ADRS/1430/pdata/1/auditp.txt
$$ ##AUDIT TRAIL=  $$ (NUMBER, WHEN, WHO, WHERE, WHAT)
(   1,<2007-10-29 10:19:33.20 +000>,<MAYBRIDGE\nmr>,<NMR_250MHZ>,
      <created by zg, POWCHK disabled, PULCHK disabled
       configuration hash MD5:
       76 6E 9A 78 1E 09 19 81 EC 84 63 8F B0 6A 59 2D
       data hash MD5: 64K
       D3 88 64 9C 98 60 39 E5 9B 6B 77 58 3D 3B A9 4B>)
(   2,<2007-10-29 10:19:48.54 +000>,<MAYBRIDGE\nmr>,<NMR_250MHZ>,
      <Start of raw data processing
       ef LB = 0.3 FT_mod = 6 PKNL = 1 SI = 32K 
       data hash MD5: 32K
       93 14 5B 50 00 75 F2 2F 2C 1A D1 B9 B9 48 CC A5>)
(   3,<2007-10-29 10:19:50.15 +000>,<MAYBRIDGE\nmr>,<NMR_250MHZ>,
      <apk 
       data hash MD5: 32K
       C4 38 08 B2 F2 C2 08 E3 E5 4E 9E 57 29 29 3C DD>)
(   4,<2007-10-29 10:19:51.04 +000>,<MAYBRIDGE\nmr>,<NMR_250MHZ>,
      <abs ABSG = 5 
       data hash MD5: 32K
       6A 3E 99 62 29 16 2C 78 4B 44 C3 73 2C 52 2A 47>)
$$ ##END=
$$ 
$$ hash MD5
$$ 81 66 5E DF 2E 05 09 11 F6 85 C2 2B 48 15 8A 10
##$RELAX= 
##$RELAX= 
##$RELAX= 
##$RELAX= 
##$RELAX= 
##$RELAX= 
##$RELAX= 
$$ Bruker specific parameters
$$ --------------------------
##$DU= <C:\u>
##$EXPNO= 1430
##$NAME= <ADRS>
##$PROCNO= 1
##$TYPE= <nmr>
##$USER= <dgb>
##$AMP= (0..31)
100 100 100 100 100 100 100 100 100 100 100 100 100 100 100 100 100 100 
100 100 100 100 100 100 100 100 100 100 100 100 100 100 
##$AQSEQ= 0
##$AQ_mod= 3
##$AUNM= <au_zg>
##$AUTOPOS= <11 >
##$BF1= 250.13
##$BF2= 250.13
##$BF3= 250.13
##$BF4= 250.13
##$BF5= 500.13
##$BF6= 500.13
##$BF7= 500.13
##$BF8= 500.13
##$BYTORDA= 1
##$CFDGTYP= 0
##$CFRGTYP= 5
##$CHEMSTR= <none>
##$CNST= (0..31)
1 1 145 1 1 1 1 1 1 1 1 1 1 1 1 1 1 1 1 1 1 1 1 1 1 1 1 1 1 1 1 1 
##$CPDPRG= <>
##$CPDPRG1= <>
##$CPDPRG2= <>
##$CPDPRG3= <>
##$CPDPRG4= <mlev>
##$CPDPRG5= <mlev>
##$CPDPRG6= <mlev>
##$CPDPRG7= <mlev>
##$CPDPRG8= <mlev>
##$CPDPRGB= <>
##$CPDPRGT= <>
##$D= (0..31)
0 1 0 0 0 0 0 0 0 0.06 0 0 0 0 0 0 0.0002 0 0 0 0 0 0 0 0 0 0 0 0 0 0 
0 
##$DATE= 1193653171
##$DBL= (0..7)
120 120 120 120 120 120 120 120 
##$DBP= (0..7)
150 150 150 150 150 150 150 150 
##$DBP07= 0
##$DBPNAM0= <>
##$DBPNAM1= <>
$$ [...]
##$SUBNAM7= <"">
##$SUBNAM8= <"">
##$SUBNAM9= <"">
##$SW= 20.6930455092707
##$SWIBOX= (0..15)
0 0 3 0 0 0 0 0 0 0 0 0 0 0 0 0 
##$SW_h= 5175.983436853
##$TD= 65536
##$TD0= 1
##$TE= 295.16
##$TE2= 300
##$TE3= 300
##$TEG= 300
##$TL= (0..7)
0 120 120 120 120 120 120 120 
##$TP= (0..7)
150 150 150 150 150 150 150 150 
##$TP07= 0
##$TPNAME0= <>
##$TPNAME1= <>
##$TPNAME2= <>
##$TPNAME3= <>
##$TPNAME4= <>
##$TPNAME5= <>
##$TPNAME6= <>
##$TPNAME7= <>
##$TPOAL= (0..7)
0.5 0.5 0.5 0.5 0.5 0.5 0.5 0.5 
##$TPOFFS= (0..7)
0 0 0 0 0 0 0 0 
##$TUNHIN= 0
##$TUNHOUT= 0
##$TUNXOUT= 0
##$USERA1= <user>
##$USERA2= <user>
##$USERA3= <user>
##$USERA4= <user>
##$USERA5= <user>
##$V9= 5
##$VALIST= <valist>
##$VCLIST= <CCCCCCCCCCCCCCC>
##$VD= 0
##$VDLIST= <DDDDDDDDDDDDDDD>
##$VPLIST= <PPPPPPPPPPPPPPP>
##$VTLIST= <TTTTTTTTTTTTTTT>
##$WBST= 1024
##$WBSW= 4
##$XGAIN= (0..3)
0 0 0 0 
##$XL= 0
##$YL= 0
##$YMAX_a= 190264
##$YMIN_a= -209377
##$ZGOPTNS= <>
##$ZL1= 120
##$ZL2= 120
##$ZL3= 120
##$ZL4= 120
##$ABSF1= 16.522
##$ABSF2= -4.171173
##$ABSG= 5
##$ABSL= 3
##$ALPHA= 0
##$AQORDER= 0
##$ASSFAC= 0
##$ASSFACI= 0
##$ASSFACX= 0
##$ASSWID= 0
##$AUNMP= <proc_1d>
##$AZFE= 0.1
##$AZFW= 0.1
##$BCFW= 0
##$BC_mod= 0
##$BYTORDP= 0
##$COROFFS= 0
##$CY= 12.5
##$DATMOD= 1
##$DC= 0
##$DFILT= <>
##$DTYPP= 0
##$F1P= 14.0000005364418
##$F2P= -0.99999901652339
##$FCOR= 0.5
##$FTSIZE= 32768
##$FT_mod= 6
##$GAMMA= 0
##$GB= 0
##$INTBC= 1
##$INTSCL= 1
##$ISEN= 128
##$LB= 0.3
##$LEV0= 0
##$LPBIN= 0
##$MAXI= 10000
##$MC2= 0
##$MEAN= 0
##$ME_mod= 0
##$MI= 0
##$NCOEF= 0
##$NC_proc= -4
##$NLEV= 6
##$NOISF1= 0
##$NOISF2= 0
##$NSP= 0
##$NTH_PI= 0
##$NZP= 0
##$OFFSET= 16.522
##$PC= 1
##$PHC0= 161.1175
##$PHC1= 12.94638
##$PH_mod= 1
##$PKNL= yes
##$PPARMOD= 0
##$PSCAL= 4
##$PSIGN= 0
##$REVERSE= no
##$SF= 250.13
##$SI= 32768
##$SIGF1= 0
##$SIGF2= 0
##$SINO= 400
##$SIOLD= 32768
##$SREGLST= <1H.CDCl3>
##$SSB= 0
##$STSI= 32768
##$STSR= 0
##$SW_p= 5175.98343685301
##$SYMM= 0
##$S_DEV= 0
##$TDeff= 65536
##$TDoff= 0
##$TI= <Analysis number 999999
Compound Code 99
Book Reference 9
Project Code 9>
##$TILT= no
##$TM1= 0
##$TM2= 0
##$TOPLEV= 0
##$USERP1= <user>
##$USERP2= <user>
##$USERP3= <user>
##$USERP4= <user>
##$USERP5= <user>
##$WDW= 1
##$XDIM= 32768
##$YMAX_p= 542359408
##$YMIN_p= -500533
$$ End of Bruker specific parameters
$$ ---------------------------------
##NTUPLES= NMR SPECTRUM
##VAR_NAME=  FREQUENCY,     SPECTRUM/REAL,   SPECTRUM/IMAG
##SYMBOL=    X,             R,               I
##VAR_TYPE=  INDEPENDENT,   DEPENDENT,       DEPENDENT
##VAR_FORM=  AFFN,          ASDF,            ASDF
##VAR_DIM=   32768,         32768,           32768
##UNITS=     HZ,            ARBITRARY UNITS, ARBITRARY UNITS
##FACTOR=    0.157963299565203, 1,           1
##FIRST=     4132.6476996994, 0,             0
##LAST=      -1043.33573715361, 0,           0
##MIN=       -1043.33573715361, -500533,     0
##MAX=       4132.6476996994, 542359408,     0
$$ Real data points
##PAGE= N=1
##DATA TABLE= (X++(R..R)), XYDATA
$$ [...]
##PAGE= N=2
##DATA TABLE= (X++(I..I)), XYDATA
26572A212425k53010j32353M861J964P4194J60066j7958j63294j05004J35394
$$ 1212425 959415 827062 831923 833887 908081 1068147 1050189 886895 781891 917285
26562I17285l1749N8645k8083R523O7993o0825P1465L6303l2784q9232L7947r6840
$$ 917285 885536 944181 916098 925621 993614 932789 1004254 1040557 1007773 918541 956488 859648
26550H59648K5413k547K6343Q5253N0602j8845J50811j4044n015j10655K8868
$$ 859648 885061 882514 908857 994110 1044712 1025867 1176678 1162634 1157619 1046964 1075832
26539A075832P0799j57766j72583Q0044P5621o0669j3873K7311J1658M6868J454
$$ 1075832 1146631 988865 816282 896326 971947 911278 897405 924716 936374 983242 984696
26528I84696R0001P8306p1930r8197m7725q0628K306P8682Q6343K0677k6409m9716
$$ 984696 1074697 1153003 1081073 982876 935151 854523 856829 935511 1021854 1042531 1016122 966406
26516I66406L0565J24818J3490O9185k0749p0240L3088R6847O666j13346K3517
$$ 966406 996971 1121789 1135279 1204464 1183715 1113475 1146563 1243410 1250076 1136730 1160247
26505A160247o3163n3471r4701J9791k9075q0983r672L1157r0355n7672J30239
$$ 1160247 1097084 1043613 948912 968703 939628 858645 848973 880130 789775 732103 862342
26494H62342K1600K7298K5636M5166K4359K8889M7518n4391M0568P6704r1688
$$ 862342 883942 911240 936876 982042 1006401 1035290 1082808 1028417 1068985 1145689 1054001
26483A054001j04250J69598L2188l9418R70J31927k718j00833q3218j4103M0045
$$ 1054001 949751 1119349 1151537 1112119 1113089 1245016 1242298 1141465 1058247 1044144 1084189
26472A084189Q6282J692o2889p6321j09116r397N0593p841K2652R026P2826Q2829
$$ 1084189 1170471 1172163 1109274 1032953 923837 914440 965033 957192 979844 988870 1061696 1144525
26460A144525k6250k3801J0955o1645j10121N1318L3465J1291R8384M0118l762
$$ 1144525 1118275 1094474 1105429 1043784 933663 984981 1018446 1029737 1128121 1168239 1164477
26449A164477K3147P0042j09647j72492j4095N4854K6231q5847m7972P1050L6023
$$ 1164477 1187624 1257666 1148019 975527 961432 1016286 1042517 956670 908698 979748 1015771
26438A015771j50044K8770J08426j8079j6780r8394j31160R4816J04650R4004
$$ 1015771 865727 894497 1002923 984844 968064 869670 738510 833326 937976 1031980
26428A031980j0522o9886j11137P2783m4247k5803R1348K24212l9492J1729l5238
$$ 1031980 1021458 951572 840435 913218 868971 843168 934516 1158728 1119236 1130965 1095727
26417A095727j47792O3835n5213K5266o6636J04666l5327K8806N2924k70014n1546
$$ 1095727 947935 1011770 956557 981823 915187 1019853 984526 1013332 1066256 796242 744696
26406G44696J79894P1774J18369P1771p4851j74688j69149J35154K02346M2037
$$ 744696 924590 996364 1114733 1186504 1111653 936965 767816 902970 1105316 1147353
26396A147353j5793p4934Q663k3426j07389r5876N9310K43382k3969J49146J0118
$$ 1147353 1131560 1056626 1065289 1041863 934474 838598 897908 1141290 1117321 1266467 1276585
26385A276585M9662Q860K2507l5916j06900k7041j25361r0536o5643j7995R9448
$$ 1276585 1326247 1335107 1357614 1321698 1214798 1187757 1062396 971860 906217 888222 987670
26374I87670l2369r6093j9934J43103J0383l1920J44405n2382L7751M0453L7523
$$ 987670 955301 859208 839274 982377 992760 960840 1105245 1052863 1090614 1131067 1168590
26363A168590j09646k6401J1802J6205L9005J38807O2425j41316j07441J26077
$$ 1168590 1058944 1032543 1044345 1060550 1099555 1238362 1300787 1159471 1052030 1178107
26353A178107P3254j38259l467J5184j58553o3680L9791O1591L8048J34542p6812
$$ 1178107 1251361 1113102 1109635 1124819 966266 902586 942377 1003968 1042016 1176558 1099746
26342A099746r3995M4163O9914J49706K8557l7617n3952j27186N5564J50663j2129
$$ 1099746 1005751 1049914 1119828 1269534 1298091 1260474 1206522 1079336 1134900 1285563 1273434
26331A273434j19031j69487j02669o5242n2136O0269P4227K1566N7572M8038N6271
$$ 1273434 1154403 984916 882247 817005 764869 825138 899365 920931 978503 1026541 1082812
26320A082812Q6806O4556j2759k7408j53033q4962K1292J53748J39161N7886Q0305
$$ 1082812 1169618 1234174 1221415 1194007 1040974 956012 977304 1131052 1270213 1328099 1408404
26309A408404j76295j42320o336j87113k63109j20003J64412J80460J2977P1775
$$ 1408404 1232109 1089789 1083453 896340 633231 513228 677640 858100 871077 942852
26299I42852J7675m2939Q0281K9591L102J8188o2214l4249R989J366k1269r9714
$$ 942852 960527 917588 997869 1027460 1030562 1048750 986536 952287 962276 963642 942373 842659
26287H42659K5382J87544L5463k7718J9479k6814m3869o477O0663J33204k2371
$$ 842659 868041 1055585 1091048 1063330 1082809 1055995 1012126 1005649 1066312 1199516 1177145
26276A177145n9549r9319N7679p7336p4141l5583k7886N0420M8785J37214M8521
$$ 1177145 1117596 1018277 1075956 998620 924479 888896 861010 911430 960215 1097429 1145950
26265A145950J9385Q803p0624j7773N9923M3701q665r8794K0599j18209o8318
$$ 1145950 1165335 1174138 1103514 1085741 1145664 1189365 1180700 1081906 1102505 984296 915978
26254I15978M5001m5945K403P3176k6646N9486J06625M5286m8977j01992J5598
$$ 915978 960979 915034 917437 990613 963967 1023453 1130078 1175364 1126387 1024395 1039993
26243A039993Q2911R8486R507p0323l4531j57240o1271J71695n4390j60120P829
$$ 1039993 1122904 1221390 1230897 1160574 1126043 968803 907532 1079227 1024837 864717 872546
26232H72546j8296j04007J62858K28165k8823Q1254o8491j24633K95n2995p3904
$$ 872546 854250 750243 913101 1141266 1112443 1193697 1125206 1000573 1000868 947873 873969
26221H73969J4584P2101R8999l1311n4099j22650J9406L5745j1380J5793J00236
$$ 873969 888553 960654 1059653 1028342 974243 851593 870999 906744 895364 911157 1011393
26210A011393K2174j7561L3521l6783J36726J29784K8215l7126k3040j42960q9407
$$ 1011393 1033567 1016006 1049527 1012744 1149470 1279254 1307469 1270343 1247303 1104343 1014936
26199A014936q1074m7597J04369J16466o5590j24259j11600n2051Q7637L1322
$$ 1014936 933862 886265 990634 1107100 1041510 917251 805651 753600 841237 872559
26189H72559O5331K4227m0576o5106k8697O7989Q965j434J6165L5389q7936L3201
$$ 872559 937890 962117 921541 856435 827738 895727 904692 903258 919423 954812 866876 900077
26177I00077J23105m1037N4502P1929o4810l9498N8778K05871j27700k33563m6780
$$ 900077 1023182 982145 1036647 1108576 1043766 1004268 1063046 1268917 1141217 907654 860874
26166H60874R1480P7563j5377P5794O7027r3824p2053J35436o9389o9491M9491
$$ 860874 952354 1029917 1014540 1090334 1157361 1063537 991484 1126920 1057531 988040 1037531
26155A037531M5677q9414l2150J3710K0142j7424K3421K07685l147j24463m9742
$$ 1037531 1083208 993794 961644 975354 995496 978072 1001493 1209178 1206031 1081568 1031826
26144A031826K00402J06643n8052q3557J3966m7926q1377k21688m2343J31827
$$ 1031826 1232228 1338871 1280819 1197262 1211228 1163302 1081925 860237 817894 949721
26134I49721q4649r4542J00462l6823o0952P6100k5443J47998J19606o3691R0848
$$ 949721 865072 770530 870992 834169 773217 849317 823874 971872 1091478 1027787 1118635
26123A118635P100l17203p7996K40662N7309p5600Q7767K7606j17921J75101j08838
$$ 1118635 1125735 808532 730536 971198 1028507 952907 1040674 1068280 950359 1125460 1016622
26112A016622N2685m6004r2101j9785p7367K78J18795P9286J38887j886k7802
$$ 1016622 1069307 1023303 931202 911417 834050 834328 953123 1032409 1171296 1169410 1141608
26101A141608k36674j75385K4014J93738O5699O300J60088J54405j27405q6519
$$ 1141608 904934 729549 753563 947301 1013000 1019300 1179388 1333793 1206388 1119869
26091A119869j23315j5188o6562k7916J20006J84493j3198q4421q5135p764k6771
$$ 1119869 996554 981366 914804 886888 1006894 1191387 1178189 1093768 1008633 1000869 974098
26080I74098J86784j3650k05917J6736J49912p362j39594r7413J6984R2886m4751
$$ 974098 1160882 1147232 941315 958051 1107963 1100601 961007 863594 880578 973464 928713
26069I28713K2756J00890j829m3723Q7746P5865Q2170q7040r7429K13057O6769
$$ 928713 951469 1052359 1050530 1006807 1094553 1170418 1252588 1165548 1068119 1281176 1347945
26058A347945j44445j31315q8646R2471P2574J06503m6309j12766j1934r7559
$$ 1347945 1203500 1072185 983539 1076010 1148584 1255087 1208778 1096012 1084078 986519
26048I86519n7505N5831P790j28882L9774P821r6605n0900Q9469K5423M6977J9715
$$ 986519 929014 984845 992635 863753 903527 911348 814743 763843 853312 878735 925712 945427
26036I45427N7819j602o6455k6888J53042j8899q2917L606K8995j0279N9792K5126
$$ 945427 1003246 1001644 935189 908301 1061343 1042444 959527 963133 992128 981849 1041641 1066767
26024A066767J3187L7401n492l9342j11775J11780J55029J1669m6821L2467m3520
$$ 1066767 1079954 1117355 1111863 1072521 960746 1072526 1227555 1239224 1192403 1224870 1181350
26013A181350j14968K7513P9456o5291j49965n3875j38859O9095Q7438m9878L1734
$$ 1181350 1066382 1093895 1173351 1108060 958095 904220 765361 834456 921894 872016 903750
26002I03750P9782R8502P2017J8408o0871r0314k4931n0493m8692r9445K7388
$$ 903750 983532 1082034 1154051 1172459 1111588 1021274 996343 945850 897158 797713 825101
25991H25101J13081k353L4538P3124r466o7322L5357K8872L776q6188j51187o9096
$$ 825101 938182 935829 970367 1043491 1034025 966703 1002060 1030932 1034708 948520 797333 728237
25979G28237N1070Q1346J8660N4742J50438K79751M3031j19267j10047j26706
$$ 728237 779307 860653 879313 934055 1084493 1364244 1407275 1288008 1177961 1051255
25969A051255J0155M7974j62539j27842O6307N932O5131M534J9318J49881R1976
$$ 1051255 1061410 1109384 946845 819003 885310 891242 956373 960907 980225 1130106 1222082
25958A222082o0839K6344n6394m7003J20544O0464j13236j87389l578N3535l0201
$$ 1222082 1161243 1187587 1131193 1084190 1204734 1265198 1151962 964573 960995 1014530 984329
25947I84329M5564R4008J92241O6910j1336k07566j09047k4764L3563j11061j1015
$$ 984329 1029893 1123901 1316142 1383052 1371716 1164150 1055103 1030339 1063902 952841 941826
25936I41826o5763o837j5869K0870R1094J3299j005J04344o1033Q5367R1024j32744
$$ 941826 876063 869226 853357 874227 965321 978620 977615 1081959 1020926 1106293 1197317 1064573
25924A064573j72803L6237l6023M6636J92881P8893j74320L4502q694O9531k7920
$$ 1064573 891770 928007 891984 938620 1131501 1210394 1036074 1070576 1061882 1131413 1103493
25913A103493p5580j12729r752M1396M4597j09413r2903O8339J36314N6218N2347
$$ 1103493 1027913 915184 905432 946828 991425 882012 789109 857448 993762 1049980 1102327
25902A102327N9675K8634L2077M3687N4072K2351O0873j06431j08119P3069p2808
$$ 1102327 1162002 1190636 1222713 1266400 1320472 1342823 1403696 1297265 1189146 1262215 1189407
25891A189407r5472k14872k7737J24061J24258l2818M6477O3650K9892N5370j52422
$$ 1189407 1093935 879063 851326 975387 1099645 1066827 1113304 1176954 1206846 1262216 1109794
25880A109794j18312J6047k8652p898j14112R8588o8234R9677K25409j1217j25402
$$ 1109794 991482 1007529 978877 970979 856867 955455 887221 986898 1212307 1201090 1075688
25869A075688n4469L921q2992n7918l9656q1471R5758O9946j45804J05263J66638
$$ 1075688 1021219 1025140 942148 884230 844574 763103 858861 928807 783003 888266 1054904
25858A054904N6626p1199l6539L8349n7306N070m2761O6976J00124L1394M7948
$$ 1054904 1111530 1040331 1003792 1042141 984835 989905 947144 1014120 1114244 1145638 1193586
25847A193586k25851j45304k6311K40122K60091L9037m8258n5124j3498r5117
$$ 1193586 967735 822431 796120 1036242 1296333 1335370 1287112 1231988 1218490 1123373
25837A123373J5823P457L0728L6385l0997n8691k80482j24947N2648N6602l1088
$$ 1123373 1139196 1146653 1177381 1213766 1182769 1124078 843596 718649 771297 827899 796811
25826G96811J39368J00250M2703r9342L4673J1411j65905j11856O0669P2786m0177
$$ 796811 936179 1036429 1079132 979790 1014463 1025874 859969 748113 808782 881568 841391
25815H41391J6792R5382N0327k5191M5806O7482r3733p4279M7176J33263O7535
$$ 841391 858183 953565 1003892 978701 1024507 1091989 998256 923977 971153 1104416 1171951
25804A171951L6030L4015J459n9131o7468m0906N2534N8909n114p0940p1383M3465
$$ 1171951 1207981 1241996 1243455 1184324 1116856 1075950 1128484 1187393 1182279 1111339 1039956 1083421
25792A083421R5929p7243p2140k3195P7108N2654j85757j5478J8224M4658M1474
$$ 1083421 1179350 1102107 1029967 1006772 1083880 1136534 950777 935299 953523 998181 1039655
25781A039655L1715o3268J02020l0302r7760q0862O6701p3118M2761J56326k4411
$$ 1039655 1071370 1008102 1110122 1079820 982060 901198 967899 894781 937542 1093868 1069457
25770A069457j62771j0711J01300M6837j1573r4257p935J22294O1799O953N0417
$$ 1069457 906686 895975 997275 1044112 1032539 938282 930347 1052641 1114440 1121393 1171810
25759A171810K0459k7355m6785n0868p5377J2406K5328q711m1714q6705P8058
$$ 1171810 1192269 1164914 1118129 1067261 991884 1004290 1029618 1020907 979193 892488 970546
25748I70546K8369J16864j69j93933l1711J01268J41083J35994K9124l2912o0877
$$ 970546 998915 1115779 1115610 921677 889966 991234 1132317 1268311 1297435 1264523 1203646
25737A203646P571J7143r5455J12223l8656o3910j35418q917j4546N1792K5455
$$ 1203646 1211217 1228360 1132905 1245128 1206472 1142562 1007144 998227 983681 1035473 1060928
25726A060928o6950m4219L0704K1332r4652n0502K9870M3252J75218J13267q2082
$$ 1060928 993978 949759 980463 1001795 907143 856641 886511 929763 1104981 1218248 1136166
25715A136166j20197P4345J07733J44764J09543k6959r6865k3105o6741j32934
$$ 1136166 1015969 1090314 1198047 1342811 1452354 1425395 1328530 1305425 1238684 1105750
25705A105750j72972K5390n8630J21152J67597j24427K7653J06397M2392r9513
$$ 1105750 932778 958168 899538 1020690 1188287 1063860 1091513 1197910 1240302 1140789
25695A140789j70408p702L3558P7302R3379o8226j07934n4081J47914k4288Q150
$$ 1140789 970381 962679 996237 1073539 1166918 1098692 990758 936677 1084591 1060303 1068453
25684A068453J34207n3882n048j5894O9177O73L909j15054m697N4924K3842j2074
$$ 1068453 1202660 1148778 1143730 1127836 1197013 1197686 1201595 1086541 1081844 1136768 1160610 1148536
25672A148536m1820k7414o920J5651O5627L4984o371p792K1930r9058m9055J01921
$$ 1148536 1106716 1079302 1072382 1088033 1153660 1188644 1182273 1174481 1196411 1097353 1048298 1150219
25660A150219M4046M4061o7063k9626O3530M0816p9575p5107j8299J50281R8091
$$ 1150219 1194265 1238326 1171263 1141637 1205167 1245983 1166408 1091301 1073002 1223283 1321374
25649A321374j2677j26375m5799J0963j6168J0449q5654p0260M0484m7299m4377
$$ 1321374 1308697 1182322 1136523 1147486 1131318 1141767 1056113 985853 1026337 979038 934661
25638I34661p1525l4190m8883J87383J18088Q7905j87057N0609J01431O2843R0703
$$ 934661 863136 828946 780063 967446 1085534 1173439 986382 1036991 1138422 1201265 1291968
25627A291968j27688j79333j150M4632M6970p2695J16029J55540j0138r4492o7998
$$ 1291968 1164280 984947 983797 1028429 1075399 1002704 1118733 1274273 1264135 1169643 1101645
25616A101645o2826O7339N6730o4525N0213N1655r4132k15309J14862N7401Q8125
$$ 1101645 1038819 1106158 1162888 1098363 1148576 1200231 1106099 890790 1005652 1063053 1151178
25605A151178J03728L8994K9302o5318j25916M0085O1165q776J15415o9317j57899
$$ 1151178 1254906 1293900 1323202 1257884 1131968 1172053 1233218 1224442 1339857 1270540 1112641
25594A112641l7399J44279N0634o8873q573P0595j32819k08274M8053M3234R7285
$$ 1112641 1075242 1219521 1270155 1201282 1192709 1263304 1130485 922211 970264 1013498 1110783
25583A110783R9773R0690p8172o6874R5834J0707n7002l2187R6855K4025j88762
$$ 1110783 1210556 1301246 1223074 1156200 1252034 1262741 1205739 1173552 1270407 1294432 1105670
25572A105670M0944k9623q9345J3896o0334k4086J38457Q5858j834n8020O7331
$$ 1105670 1146614 1116991 1027646 1041542 981208 957122 1095579 1181437 1179603 1121583 1188914
25561A188914O7023n0117j7294P8310Q9642q097r5936K5141L6800l8743N1445
$$ 1188914 1255937 1205820 1188526 1266836 1356478 1348381 1252445 1277586 1314386 1275643 1327088
25550A327088l1792j05337J15382p0793o5668j3474J8610r113L1086L5628p1808
$$ 1327088 1295296 1189959 1305341 1234548 1168880 1155406 1174016 1164903 1195989 1231617 1159809
25539A159809m5281K2466r593l9189k5060J49010K4149J08884r8507o3789j23118
$$ 1159809 1114528 1136994 1127401 1088212 1063152 1212162 1236311 1345195 1246688 1182899 1059781
25528A059781J38025O2647m3637n2454m0576J21334J55925q7582r9052m7102Q717
$$ 1059781 1197806 1260453 1216816 1164362 1123786 1245120 1401045 1313463 1214411 1167309 1176026
25517A176026j6887K4609j09667M5366R0926j2529l0017n0407N5977L1792q9112
$$ 1176026 1159139 1183748 1074081 1119447 1210373 1197844 1167827 1117420 1173397 1205189 1116077
25506A116077q1339J25128R4057n2139J2081J20192j8125l2873j21264j35020
$$ 1116077 1034738 1159866 1253923 1201784 1213865 1334057 1315932 1283059 1161795 1026775
25496A026775J5979J5717q3217J19840J60170j5488p6200M6320o0674P9396J4411
$$ 1026775 1042754 1058471 975254 1095094 1255264 1239776 1163576 1209896 1149222 1228618 1243029
25485A243029l1573m8601J20431M6473q7122k2639P8021L9932j91332j57159Q989
$$ 1243029 1211456 1162855 1283286 1329759 1242637 1219998 1298019 1337951 1146619 989460 998449
25474I98449M318O5394J51432J5511J6354N0863l5588n986J79807P1204l5495
$$ 998449 1002767 1068161 1219593 1235104 1251458 1302321 1266733 1260747 1440554 1511758 1476263
25463A476263j62245j49453j23126Q3564K7602r9883J58222M2882J79l6361j42416
$$ 1476263 1314018 1164565 1041439 1125003 1152605 1052722 1210944 1253826 1254005 1217644 1075228
25452A075228L9734N7636R3176l0147j00819j46479P6595k279m4685J81021R0715
$$ 1075228 1114962 1172598 1265774 1235627 1134808 988329 1064924 1062645 1017960 1198981 1289696
25441A289696l8538p9506j61691J6433L1127O844l7506L3382J24083L8823r3951
$$ 1289696 1251158 1171652 1009961 1026394 1057521 1064365 1026859 1060241 1184324 1223147 1129196
25430A129196J1299k5255J44123J76469l6084j99266o3508m1688N6982K00062
$$ 1129196 1140495 1115240 1259363 1435832 1399748 1200482 1136974 1095286 1152268 1352330
25420A352330J1491j18000r3759j43648N3498J59430J42758p1990q4225l7041
$$ 1352330 1363821 1245821 1152062 1008414 1061912 1221342 1364100 1292110 1207885 1170844
25410A170844r836k4242J6366j30549r2923R7677J96697K6846n3325k2110L5714
$$ 1170844 1161008 1136766 1153132 1022583 929660 1027337 1224034 1250880 1197555 1175445 1211159
25399A211159m5695k07111k7458J05294L7987J382j01285l1050m1608K5434k8270
$$ 1211159 1165464 958353 930895 1036189 1074176 1075558 974273 943223 901615 927049 898779
25388H98779J52581O2965m0584o145N9651q8538q7912N7967J6053R859K4277r535
$$ 898779 1051360 1114325 1073741 1067596 1127247 1038709 950797 1008764 1024817 1034676 1058953 1049418
25376A049418K1271Q9751O4406o603r1141n3104M3328l7019k4075R1303o684J07894
$$ 1049418 1070689 1160440 1224846 1218243 1127102 1073998 1117326 1080307 1056232 1147535 1140851 1248745
25364A248745K07114J9264j52613n8879J6515J36927P5605j7104n2198j6200k18360
$$ 1248745 1455859 1475123 1322510 1263631 1280146 1417073 1492678 1475574 1423376 1407176 1188816
25353A188816k54897n2348P5954K05321J21849q9318o7391J27730P5108j13127
$$ 1188816 933919 881571 957525 1162846 1284695 1195377 1127986 1255716 1330824 1217697
25343A217697k01298j2349Q4549j6130j42574L2091J54060o9957o2815j7557L3324
$$ 1217697 1016399 1004050 1088599 1072469 929895 961986 1116046 1046089 983274 965717 999041
25332I99041O5520o6268j60541J09086K85765J58772K5462q1450j15248m564Q8312
$$ 999041 1064561 998293 837752 946838 1232603 1391375 1416837 1335387 1220139 1215575 1303887
25321A303887o02j32005L720J3228M5241N9334j01437J7463N1903j13980j37347
$$ 1303887 1303285 1171280 1175000 1188228 1233469 1292803 1191366 1208829 1260732 1146752 1009405
25310A009405o154J47223J37764o0219J7700M34j1095J02538j30534j0519J17230
$$ 1009405 1003251 1150474 1288238 1228019 1245719 1246153 1235058 1337596 1207062 1196543 1313773
25299A313773J3016j18134R5935n4182O066J60897R2807n4482q7109o4798q2301
$$ 1313773 1326789 1208655 1304590 1250408 1256474 1417371 1510178 1455696 1368587 1303789 1221488
25288A221488k3148J7072L9754O9461m2211q6602M3644m0751n2367K3465m0196
$$ 1221488 1198340 1215412 1255166 1324627 1282416 1195814 1239458 1198707 1146340 1169805 1129609
25277A129609p7381K2312Q0737N487n7312N920R174P9958O1913r932j47328j52507
$$ 1129609 1052228 1074540 1155277 1160764 1103452 1109372 1118546 1198504 1260417 1250485 1103157 950650
25265I50650J8874j66J0822M5039K2042o4577Q254Q2181M6564p1071n2526M2106
$$ 950650 969524 969358 980180 1025219 1047261 982684 990938 1073119 1119683 1048612 996086 1038192
25253A038192Q2093J27501M7994P1108l3243J0190j3532p3570l1710l8559K3766
$$ 1038192 1120285 1247786 1295780 1366888 1333645 1343835 1330303 1256733 1225023 1186464 1210230
25242A210230j27119j69761k1299N4225J93447N8367l1163L428N452j9284O9270
$$ 1210230 1083111 913350 892051 946276 1139723 1198090 1166927 1170355 1175807 1156523 1225793
25231A225793N6026o3666n2792r1032j3015P5992R6700m6175J25349P8315j2949
$$ 1225793 1281819 1218153 1165361 1074329 1061314 1137306 1234006 1187831 1313180 1391495 1378546
25220A378546K1341j88205j17737r618J10174k6730l7945N9213Q5278J92340j5666
$$ 1378546 1399887 1211682 1093945 1084327 1194501 1167771 1129826 1189039 1274317 1466657 1450991
25209A450991j70793o3339N7303l8759q1310K4440M5759K1843o1809J6863M2989
$$ 1450991 1280198 1216859 1274162 1235403 1154093 1178533 1224292 1246135 1184326 1201189 1244178
25198A244178j261j20646q5367P2033J24230J09531l9534m6174R3452k9960j02697
$$ 1244178 1242917 1122271 1036904 1108937 1233167 1342698 1303164 1256990 1350442 1320482 1217785
25187A217785M7200Q6521o9425m3113j43890J3202K4370K9543j26926J91277J64132
$$ 1217785 1264985 1351506 1282081 1238968 1095078 1108280 1132650 1162193 1035267 1226544 1390676
25176A390676q7424L380L1147j70941q5425J73893K02299j28969j19102q2757
$$ 1390676 1303252 1306632 1337779 1166838 1081413 1255306 1457605 1328636 1209534 1126777
25166A126777p2222L6846J44167L0479q2955j3338j8842l5819J5294R9746K8953
$$ 1126777 1054555 1091401 1235568 1266047 1183092 1169754 1150912 1115093 1130387 1230133 1259086
25155A259086J19586j8270n4629q9459R6072O820r7388o7588l1299K2074J30164
$$ 1259086 1378672 1360402 1305773 1216314 1312386 1319206 1221818 1154230 1122931 1145005 1275169
25144A275169n8588o0707R171O1164N4282J3337j40198q0040r2504n6048o168
$$ 1275169 1216581 1155874 1165045 1226209 1280491 1293828 1153630 1073590 981086 925038 918870
25133I18870J69261K40560J20650l095j24225j32342J0949J67232J01865r3303
$$ 918870 1088131 1328691 1449341 1446246 1322021 1189679 1200628 1367860 1469725 1376422
25123A376422j16696J38685j35267j8526Q6031j10211l5810R6942l1118j5162
$$ 1376422 1259726 1398411 1263144 1244618 1330649 1220438 1184628 1281570 1250452 1235290
25113A235290m5292L0357K4147N6456J63885J6450k94111p6755Q6893k2921o8639
$$ 1235290 1189998 1220355 1244502 1300958 1464843 1481293 1187182 1110427 1197320 1174399 1105760
25102A105760L6251L4147J28358N7005j04768q2238j7912m5568O1649K52746J01676
$$ 1105760 1142011 1176158 1304516 1361521 1256753 1174515 1156603 1111035 1172684 1425430 1527106
25091A527106l2384l5999j29206q9064p059J05046o1179j56127j83541M4441N2184
$$ 1527106 1494722 1458723 1329517 1240453 1233394 1338440 1277261 1121134 937593 982034 1034218
25080A034218O9653J51692r3728q5205j9719J44955J32065m8719J847J48120P6994
$$ 1034218 1103871 1255563 1161835 1076630 1056911 1201866 1333931 1285212 1287059 1435179 1512173
25069A512173j63795o988j9179j21344k4012J6118j34815M7382K34538l3396j3216
$$ 1512173 1348378 1341390 1322211 1200867 1176855 1192973 1058158 1105540 1340078 1306682 1293466
25058A293466R1663O8808p5000q1483r0565M972K8804J12795m1100o6247r9511
$$ 1293466 1385129 1453937 1378937 1297454 1206889 1211861 1240665 1353460 1312360 1246113 1146602
25047A146602m8765o9474P9750K5010L7515M4364o8529p0720l2160M7304J37726
$$ 1146602 1097837 1028363 1108113 1133123 1170638 1215002 1146473 1075753 1043593 1090897 1228623
25036A228623N5744p5620n3418r5103R2260N6927K7280m2238K4978j2525K6370
$$ 1228623 1284367 1208747 1155329 1060226 1152486 1209413 1236693 1194455 1219433 1206908 1233278
25025A233278J58114n3049k30249P7501K07259M4069j10579k00989K5765K05919
$$ 1233278 1391392 1338343 1108094 1185595 1392854 1436923 1326344 1125355 1151120 1357039
25015A357039l993K0897J0943j11792q5234J01025M7275n5185k0377J14502l460
$$ 1357039 1353046 1373943 1384886 1273094 1187860 1288885 1336160 1280975 1260598 1375100 1371640
25004A371640j52408m3979J17873R121m836m3109j2550k0823P1259N1026Q9626
$$ 1371640 1219232 1175253 1293126 1302247 1297411 1254302 1241752 1220929 1292188 1343214 1432840
24993A432840o2044j82964J23278J48071l2131j15691j003j5342K397J19425R14
$$ 1432840 1370796 1187832 1311110 1459181 1427050 1311359 1310356 1295014 1297411 1416836 1417750
24982A417750J8195l1275q4479P0876J96177j03421j72219n6172L9888J8937K9919
$$ 1417750 1435945 1404670 1320191 1391067 1587244 1483823 1311604 1255432 1295320 1314257 1344176
24971A344176Q3897o42o2525J11495M63j53809n0418l9318k9976J21532L0161
$$ 1344176 1428073 1427431 1364906 1476401 1476864 1323055 1272637 1233319 1203343 1324875 1355036
24960A355036N0442R8890N5080N1605j21702j26014j62932p0834J01789J19151
$$ 1355036 1405478 1504368 1559448 1611053 1489351 1363337 1200405 1129571 1231360 1350511
24950A350511n0483K1197m0817o930o9531p0550j0483Q4337J47469Q5024J8232
$$ 1350511 1300028 1321225 1280408 1273478 1203947 1133397 1122914 1207251 1354720 1439744 1457976
24939A457976L3299n4054j36066l6939K6506q8120l764j2528k5008p316j8413
$$ 1457976 1491275 1437221 1301155 1264216 1290722 1202602 1198838 1186310 1161302 1153986 1135573
24928A135573P6049j1307K0894M6365J0607N6089P015M5665j44582m8814o177
$$ 1135573 1211622 1200315 1221209 1267574 1278181 1334270 1341285 1386950 1242368 1193554 1187377
24917A187377j28319p514J88438K35655m5424N342m5237j32543k430l5104J02161
$$ 1187377 1059058 1051544 1239982 1475637 1430213 1435555 1390318 1257775 1255345 1220241 1322402
24906A322402p8284j55431K3565J22863o0756n8763j8174O7524L4513R0205j52418
$$ 1322402 1244118 1088687 1112252 1235115 1174359 1115596 1097422 1164946 1199459 1289664 1137246
24895A137246j44927J43698J09544J09442L7386j08796k3268n2826K6303O0655
$$ 1137246 992319 1136017 1245561 1355003 1392389 1283593 1260325 1207499 1233802 1294457
24885A294457O447k0337m5323J93642K0164j49009r7082n3835R3698J07986M4620
$$ 1294457 1300904 1280567 1235244 1428886 1449050 1300041 1202959 1149124 1242822 1350808 1395428
24874A395428j0011o2303K9490o1386r5749M5154J10760J2087N0330q6097j14760
$$ 1395428 1385417 1323114 1352604 1291218 1195469 1240623 1351383 1363470 1413800 1327703 1212943
24863A212943K6609J20993O8421P0900R2667o6168k57260j04941o6939J2535J24068
$$ 1212943 1239552 1360545 1428966 1499866 1592533 1526365 1269105 1164164 1097225 1109760 1233828
24852A233828M3109L1655n2346k8145J32391K10566n1202r5384K2925m1101j56780
$$ 1233828 1276937 1308592 1256246 1228101 1360492 1571058 1519856 1424472 1447397 1406296 1249516
24841A249516j18202P913J31856L9589Q9095N3660P890p4529k3786K0329j45856
$$ 1249516 1131314 1139227 1271083 1310672 1399767 1453427 1461317 1386788 1363002 1383331 1237475
24830A237475j45783j05407P458J70763J55721r5657N719J45530Q3655q0471j43218
$$ 1237475 1091692 986285 993743 1164506 1320227 1224570 1230289 1375819 1459474 1379003 1235785
24819A235785m3728q875j4306j1769j3623m329m3718O6015R2242K78j17941N4016
$$ 1235785 1192057 1183182 1168876 1157107 1143484 1139155 1095437 1161452 1253694 1253972 1136031 1190047
24807A190047r5846Q5599P2400j33639J30347J17248j46158M2854K40952O9800
$$ 1190047 1094201 1179800 1252200 1118561 1248908 1366156 1219998 1262852 1503804 1573604
24797A573604N7787M0572l3968j99439q1513p982j4399M5077O9396J21854q9701
$$ 1573604 1631391 1671963 1637995 1438556 1357043 1349061 1334662 1379739 1449135 1570989 1481288
24786A481288j01249q1586n989j5834m2211N6256o0510k0051Q1830K1201j4630
$$ 1481288 1380039 1298453 1292464 1276630 1234419 1290675 1230165 1210114 1291944 1313145 1298515
24775A298515r5697Q1209J03607N3403j9249m9564l7822R8088J1701M2835K4772
$$ 1298515 1202818 1284027 1387634 1441037 1421788 1372224 1334402 1432490 1444191 1487026 1511798
24764A511798M5577j38491p5709p5650k0708k7913j24416o3578P8436J6513R7871
$$ 1511798 1557375 1418884 1343175 1267525 1246817 1218904 1094488 1030910 1109346 1125859 1223730
24753A223730K21596m7223N7979L9164j43881o4164R132P3669N8634R8027J6984
$$ 1223730 1445326 1398103 1456082 1495246 1351365 1287201 1296333 1370002 1428636 1526663 1543647
24742A543647r0092r9860l1782K645j18958O5271M7441k943P692N7701L9465k2411
$$ 1543647 1453555 1353695 1321913 1324558 1205600 1270871 1318312 1315369 1323061 1380762 1420227 1397816
24730A397816J0472p2289R5579J55283o452l8060j05689R451j12963L292M7355
$$ 1397816 1408288 1335999 1431578 1586861 1580409 1542349 1436660 1446111 1333148 1336440 1383795
24719A383795O3515J24267M9735m4209j34379m6966J10692O0706P1056j750m9148
$$ 1383795 1447310 1571577 1621312 1577103 1442724 1395758 1506450 1567156 1638212 1636462 1587314
24708A587314l6542M7584K7687n7580j07138O1776j12112P814N2784j87195j63040
$$ 1587314 1550772 1598356 1626043 1568463 1461325 1523101 1410989 1418803 1471587 1284392 1121352
24697A121352K6939O7095L8630j03498M6846q70J10940J77546P3417p646p7131
$$ 1121352 1148291 1215386 1254016 1150518 1197364 1196494 1307434 1484980 1558397 1550751 1473620
24686A473620J09820K92j08430k5674j2757l9049J0304j07516n7455J56988J01286
$$ 1473620 1583440 1583732 1475302 1449628 1436871 1397822 1408126 1300610 1243155 1400143 1501429
24675A501429L8156q4384q0057j0951m030N7780N7691R029r4589k4990K5755m9613
$$ 1501429 1539585 1455201 1375144 1364193 1360163 1417943 1475634 1484663 1390074 1365084 1390839 1341226
24663A341226k4544J78k7673L2649N2675L0118L6294r452j00726r083P3697k6849
$$ 1341226 1316682 1316860 1289187 1321836 1374511 1404629 1440923 1431471 1330745 1321662 1395359 1368510
24651A368510n240J55148N6281K7803j39419l1536O3245Q808n8530p5796k8866
$$ 1368510 1363270 1518418 1574699 1602502 1463083 1431547 1494792 1503600 1445070 1369274 1340408
24640A340408j5041k042J10205J7141j79844o3265J93982p4815M4984J4024k2760
$$ 1340408 1325367 1323325 1433530 1450671 1270827 1207562 1401544 1326729 1371713 1385737 1362977
24629A362977J2673j9040j18358j0591J41069Q4834O040l8340M6867N7448j51504
$$ 1362977 1375650 1356610 1238252 1227661 1368730 1453564 1459604 1421264 1468131 1525579 1374075
24618A374075Q73Q4265j8786J4461m18m6017J0890k8019j27341J6756O5969j8864
$$ 1374075 1374948 1459213 1440427 1454888 1454470 1408453 1419343 1391324 1263983 1280739 1346708 1327844
24606A327844R7463K9773L979j14648q4687J08767k595J458j47197Q7739J64056
$$ 1327844 1425307 1455080 1459059 1344411 1259724 1368491 1365896 1367354 1220157 1307896 1471952
24595A471952j15809j4728Q06j48851R973J39683J06762J01187O8724k5879p6336
$$ 1471952 1356143 1341415 1342221 1193370 1203343 1343026 1449788 1550975 1619699 1593820 1517484
24584A517484l6391p5081K5036L1947j09622J4942J65102k1119j06072l9400o3418
$$ 1517484 1481093 1406012 1431048 1462995 1353373 1368315 1533417 1512298 1406226 1366826 1303408
24573A303408j7225n9620p2663M2709N2363p5109R3501L4974l5163J10434J59644
$$ 1303408 1286183 1226563 1153900 1196609 1248972 1173863 1267364 1302338 1267175 1377609 1537253
24562A537253N8757N4024R0208j31839k11965o5440o1445J891J99228J4640p0630
$$ 1537253 1596010 1650034 1740242 1608403 1396438 1330998 1269553 1271444 1470672 1485312 1414682
24551A414682r1545k6530P8646O4085J07467J49329j10632j21694k06699l5814
$$ 1414682 1323137 1296607 1375253 1439338 1546805 1696134 1585502 1463808 1257109 1221295
24541A221295J46976J43744J29693J39864l0239o1232j27017o9433r368l6542
$$ 1221295 1368271 1512015 1641708 1781572 1751333 1690101 1563084 1493651 1484283 1447741
24531A447741j17016N667L7088q3189j07035k0734J02047K8219k8246J0208K845
$$ 1447741 1330725 1336392 1373480 1290291 1183256 1162522 1264569 1292788 1264542 1274750 1277595
24520A277595l089K33796J25363m9464j10439N5993p027P8904j08544j51643K3846
$$ 1277595 1274506 1508302 1633665 1584201 1473762 1529755 1522728 1601632 1493088 1341445 1365291
24509A365291O0614R4954k9113j09768J0735J16165N6701q9306r1256n6318N642
$$ 1365291 1425905 1520859 1491746 1381978 1392713 1508878 1565579 1476273 1385017 1328699 1334341
24498A334341J54489j5137q4154K2445m6846p2083L1287J06453m9625l5314j14900
$$ 1334341 1488830 1473693 1389539 1411984 1365138 1293055 1324342 1430795 1381170 1345856 1230956
24487A230956N2233Q8274J8120O6550Q2690p6239Q604M894o6974n2400L1237r5405
$$ 1230956 1283189 1371463 1389583 1456133 1538823 1462584 1471188 1476082 1409108 1356708 1387945 1292540
24475A292540R8370J11012o9178K1184M6335o1575Q9308p288R5667q5426q2378
$$ 1292540 1390910 1501922 1432744 1453928 1500263 1438688 1527996 1520708 1616375 1530949 1448571
24464A448571q1932L988l2944r378J6306Q7591J15780k5441P468o943k1345P2932
$$ 1448571 1366639 1370627 1337683 1328305 1344611 1432202 1547982 1522541 1530009 1523066 1501721 1574653
24452A574653n4464j61056j48565Q7040L9651m1274l9361J0059J03324J1722o7575
$$ 1574653 1520189 1359133 1210568 1297608 1337259 1295985 1256624 1266683 1370007 1381729 1314154
24441A314154j791j45731j6469J43181K55709n5890r3536L4591J29466q2188Q6961
$$ 1314154 1312363 1166632 1150163 1293344 1549053 1493163 1399627 1434218 1563684 1481496 1568457
24430A568457k2489j99359p7483P005R7610Q8999j4454j9122j907m5601o5756
$$ 1568457 1545968 1346609 1269126 1276131 1373741 1462740 1448286 1429164 1427257 1381656 1315900
24419A315900m4295Q2948Q717m6592P9260J23832j70575j29990k8346O9528O8909
$$ 1315900 1271605 1354553 1363270 1316678 1395938 1519770 1349195 1219205 1190859 1260387 1329296
24408A329296J55064K7123r43j1180j1093n3352r8222M3445j23090m9694O8950
$$ 1329296 1484360 1511483 1510540 1499360 1488267 1434915 1336693 1380138 1257048 1207354 1276304
24397A276304L1417n0876k3624L9664J35841J00754o3744N4787M7699j91661j02938
$$ 1276304 1307721 1256845 1233221 1272885 1408726 1509480 1445736 1500523 1548222 1356561 1253623
24386A253623J60323K28856J6125O9260N4611j82323j01642r7732O2312L0932
$$ 1253623 1413946 1642802 1658927 1728187 1782798 1600475 1498833 1401101 1463413 1494345
24376A494345O6779o6784j77753k9903J17629k5957m8844R7131J27760k9769n6834
$$ 1494345 1561124 1494340 1316587 1286684 1404313 1378356 1329512 1426643 1554403 1524634 1467800
24365A467800R6190j10045q8923p7359r394Q262R2091o2476Q71K08776l4695m2871
$$ 1467800 1563990 1453945 1365022 1287663 1278269 1286531 1378622 1316146 1317017 1525793 1491098 1448227
24353A448227p550O982l0076M5822J19274j06624j28505l8119K403J06561M6613
$$ 1448227 1440677 1447659 1417583 1463405 1582679 1476055 1347550 1309431 1311834 1418395 1465008
24342A465008j10805L629K6427k3954l3055J43785m274J16657l446o2415o4737
$$ 1465008 1354203 1357832 1384259 1360305 1327250 1471035 1466761 1583418 1579972 1517557 1452820
24331A452820K8632j01203j11884R3357k1500K9236J38328J0029j00643K0908
$$ 1452820 1481452 1380249 1268365 1361722 1340222 1369458 1507786 1517815 1417172 1438080
24321A438080J18019M0755q2597p6153J31418k0924m9833O5561K9366p2216q1035
$$ 1438080 1556099 1596854 1514257 1438104 1569522 1548598 1498765 1564326 1593692 1521476 1440441
24310A440441j09361J23879L6949L2095J24468l1223q838j27206J35480J087j55850
$$ 1440441 1331080 1454959 1491908 1524003 1648471 1617248 1608410 1481204 1616684 1617771 1461921
24299A461921j23445J3034R4087J73041J0843m9891p3786m3884K40o4476P6287
$$ 1461921 1338476 1351510 1445597 1618638 1629481 1579590 1505804 1461920 1462160 1397684 1473971
24288A473971N5647J1147R822K1107k3852j11341l1016P9668l8315p5359N6455
$$ 1473971 1529618 1540765 1550587 1571694 1547842 1436501 1405485 1485153 1446838 1371479 1427934
24277A427934J1902m5656N3329K952o4169l5259J13268Q2705N4263J17654N0189
$$ 1427934 1439836 1394180 1447509 1450461 1386292 1351033 1464301 1547006 1601269 1718923 1769112
24266A769112j21046r5371n2502M67K1155P5169J26253j41628M3849L207j01297
$$ 1769112 1648066 1552695 1500193 1500660 1521815 1596984 1723237 1581609 1625458 1628665 1527368
24255A527368j8915O4641J4510j7437N357j29086o5488M318O356N5585K1112l0365
$$ 1527368 1508453 1573094 1587604 1570167 1575524 1446438 1380950 1385268 1391624 1447209 1468321 1437956
24243A437956R7904m3365l007j26352l4224P7320N4481R7441p7751J1982J41912
$$ 1437956 1535860 1492495 1489488 1363136 1328912 1406232 1460713 1558154 1480403 1492385 1634297
24232A634297L6227n8859j01103n1851O1524p4383p8226N629L0267o2029N9799
$$ 1634297 1670524 1611665 1510562 1458711 1520235 1445852 1367626 1373255 1403522 1341493 1401292
24221A401292J46337L9702J2492N6558o911j93109l9677K8475K193J6556l897
$$ 1401292 1547629 1587331 1599823 1656381 1649470 1456361 1416684 1445159 1447352 1463908 1460011
24210A460011q3513M5540K13900n1691K8874J71129o5268p4779p5015j14770L63
$$ 1460011 1376498 1422038 1635938 1584247 1613121 1784250 1718982 1644203 1569188 1454418 1454781
24199A454781m7538N0193J79845L0568j25597n5441L3493M9714P8514P5354k5713
$$ 1454781 1407243 1457436 1637281 1667849 1542252 1486811 1520304 1570018 1648532 1723886 1698173
24188A698173j07153M4410K8659k2635j28978P842K4912K8484k321l3960j9251
$$ 1698173 1591020 1635430 1664089 1641454 1512476 1520318 1545230 1573714 1571393 1537433 1518182
24177A518182o1226k8376O9121O7412j9618k0693o6784P226N5147J58791J72028
$$ 1518182 1456956 1428580 1497701 1565113 1545495 1524802 1458018 1465244 1520391 1679182 1851210
24166A851210O4481j12114k69123j53771k15153J4707J24895Q2345K39955K17618
$$ 1851210 1915691 1803577 1534454 1380683 1165530 1180237 1305132 1387477 1627432 1845050
24156A845050n0398k24686k45206k5829J30135M1178J1997j7522N2222P4637K7341
$$ 1845050 1794652 1569966 1324760 1298931 1429066 1470244 1482241 1464719 1516941 1591578 1618919
24145A618919K0404o7563j27843m8532r4994R0613J18873k4266l6603J22281J59294
$$ 1618919 1639323 1571760 1443917 1395385 1300391 1391004 1509877 1485611 1449008 1571289 1730583
24134A730583M6973j34831j18041j87172P885J03808q3041M3621N3648M0248N1257
$$ 1730583 1777556 1642725 1524684 1337512 1345397 1449205 1366164 1409785 1463433 1503681 1554938
24123A554938R9917L4840P3346N6764m4502p5101r0108j17016j39684J08405R1893
$$ 1554938 1654855 1689695 1763041 1819805 1775303 1700202 1610094 1493078 1353394 1461799 1553692
24112A553692j30724Q4436L165r6943R9257J46444R6529j26467k25232J2290O3761
$$ 1553692 1422968 1507404 1510569 1413626 1512883 1659327 1755856 1629389 1404157 1416447 1480208
24101A480208q6470K1589m3070p6467K4579p373J32331J60301M6489R3801k782
$$ 1480208 1393738 1415327 1372257 1295790 1320369 1312996 1445327 1605628 1652117 1745918 1743136
24090A743136k11974p4163K12630J51773M679l5947n9634j6331m2322k8761J99710
$$ 1743136 1531162 1456999 1669629 1821402 1826081 1790134 1730500 1714169 1671847 1643086 1842796
24079A842796N9140J9163r7878j30546j31050o752R0799p2903j80534O7675N6441
$$ 1842796 1901936 1921099 1823221 1692675 1561625 1554873 1645672 1572769 1392235 1459910 1516351
24068A516351K5088L8291q4355r2951Q7599J43527J39503r5471j43311J19413
$$ 1516351 1541439 1579730 1495375 1402424 1490023 1633550 1773053 1677582 1534271 1653684
24058A653684J79650K3783j81158n7684Q2772O7714m3297r6797p5142R4094L6211
$$ 1653684 1833334 1857117 1675959 1618275 1701047 1768761 1725464 1628667 1553525 1647619 1683830
24047A683830m4092q4889Q519p8948k6823Q4887Q1779M0104q0549p690O5149m2665
$$ 1683830 1639738 1554849 1563368 1484420 1457597 1542484 1624263 1664367 1583818 1576128 1641277 1598612
24035A598612N3468N852R440m2357N295R599Q1586Q172n0019L6760O8382K0375
$$ 1598612 1652080 1657932 1667372 1625015 1630310 1639909 1721495 1729667 1679648 1716408 1784790 1805165
24023A805165p2751j25008K961n4282J21455l9217q6838m1248J67450n3435o2887
$$ 1805165 1732414 1607406 1610367 1556085 1677540 1638323 1551485 1510237 1677687 1624252 1561365
24012A561365q970J14536N3970J39955O197j13537k03278k8516O4338p7978J26244
$$ 1561365 1552395 1666931 1720901 1860856 1867053 1753516 1550238 1521722 1586060 1508082 1634326
24001A634326J1742j32742k2491J25806p1487L1581O9006N0581m0700n2290k6431
$$ 1634326 1646068 1513326 1490835 1616641 1545154 1576735 1645741 1696322 1655622 1603332 1576901
23990A576901j19064r2909J34868J83190k0686j23336k05169p6714J66250O6514
$$ 1576901 1457837 1364928 1499796 1682986 1662300 1538964 1333795 1257081 1423331 1489845
23980A489845o9010j15896k2046J29356J96499j13644n8363M0734J38818J16673
$$ 1489845 1420835 1304939 1282893 1412249 1608748 1495104 1436741 1477475 1616293 1732966
23970A732966q3285n6292N519J03915M7942j57056j24674k6112J82031J72787
$$ 1732966 1649681 1593389 1598908 1702823 1750765 1593709 1469035 1442923 1624954 1797741
23960A797741l5796K9777Q190p9866R8191l9000j56322R3465L4774k8308j08088
$$ 1797741 1761945 1791722 1799912 1720046 1818237 1779237 1622915 1716380 1751154 1722846 1614758
23949A614758j81261m3994k4342R7853K15616J24818Q2074j23366j37608J07861
$$ 1614758 1433497 1389503 1365161 1463014 1678630 1803448 1885522 1762156 1624548 1732409
23939A732409m6520J3613O7720j41339M9985o0593o2633J32954J45597m8998j3494
$$ 1732409 1685889 1699502 1767222 1625883 1675868 1615275 1552642 1685596 1831193 1782195 1768701
23928A768701o0873N811K8894m2268q0835r8398j05981R4454P1417L5768J20979
$$ 1768701 1707828 1713639 1742533 1700265 1619430 1521032 1415051 1509505 1580922 1616690 1737669
23917A737669p0673j878O3037N0889K0465j7858m3483M4289M3281J5946P5084
$$ 1737669 1666996 1665118 1728155 1779044 1799509 1781651 1738168 1782457 1825738 1841684 1916768
23906A916768m3493j15258O6784K6006j4518j06204L3632j1902j7290L4693R875
$$ 1916768 1873275 1758017 1824801 1850807 1836289 1730085 1763717 1751815 1734525 1769218 1779093
23895A779093k8220j41297P32N8715k081j4027q617J38543j9687n7655J5840K8729
$$ 1779093 1750873 1609576 1610308 1669023 1666942 1652915 1644298 1782841 1763154 1705499 1721339 1750068
23883A750068m2600k6390Q49Q1283J7455J210n8536J6734j11108M4720N3736M9232
$$ 1750068 1707468 1681078 1681927 1763210 1780665 1781875 1723339 1740073 1628965 1673685 1727421 1776653
23871A776653Q5561r2247M0074n3906Q529N5368m8491l985r7959K3282j8535J04005
$$ 1776653 1862214 1769967 1810041 1756135 1764664 1820032 1771541 1767556 1669597 1692879 1674344 1778349
23859A778349n9259l416O9532J43229j01105k0734j24721r5490J1881M283N2593
$$ 1778349 1719090 1715674 1785206 1928435 1827330 1806596 1681875 1586385 1598266 1602549 1655142
23848A655142J0533P970R7171p8080j893l6504o1168p9674R7795J14000K852o8528
$$ 1655142 1665675 1673645 1770816 1692736 1690843 1654339 1593171 1513497 1611292 1725292 1728144 1659616
23836A659616J6631k576j8249k1547N9073j17409J03882J13259m2070k00402j19217
$$ 1659616 1676247 1673671 1655422 1633875 1692948 1575539 1679421 1792680 1750610 1550208 1430991
23825A430991J60174P7800J2012M6367j13601J01596n8190j27578Q4184J71684
$$ 1430991 1591165 1668965 1680977 1727344 1613743 1715339 1657149 1529571 1613755 1785439
23815A785439N2126q5871p3717j57409K1408J36699J0891k2412M3000N5091l764
$$ 1785439 1837565 1751694 1677977 1520568 1541976 1678675 1689566 1667154 1710154 1765245 1761481
23804A761481l4426o9858K4372J3630O2062m7294J4215O1752J3005p4643J649
$$ 1761481 1727055 1657197 1681569 1695199 1757261 1709967 1724182 1785934 1798939 1724296 1725945
23793A725945J99790R1368j97648j42326M9098J26862o221j31770N5246J07932
$$ 1725945 1925735 2017103 1819455 1677129 1726227 1853089 1846868 1715098 1770344 1878276
23783A878276K8120o468j4798p9487j58257j06754J34121K83315L4689m9884l4369
$$ 1878276 1906396 1899928 1885130 1805643 1647386 1540632 1674753 1958068 1992757 1942873 1908504
23772A908504p3957J38724J21292K3340j6313j45670M2375O1195r995k5707j17304
$$ 1908504 1834547 1973271 2094563 2117903 2101590 1955920 1998295 2059490 2049495 2023788 1906484
23761A906484j50242o782o99P2810l9491J390M9574m8966n1745Q8676J15500l4113
$$ 1906484 1756242 1749460 1748761 1821571 1782080 1783470 1833044 1784078 1732333 1821009 1936509 1902396
23749A902396r6042J5843J45136r9877J0584N8355k79500j12469M0682N2383j19246
$$ 1902396 1806354 1822197 1967333 1867456 1878040 1936395 1656895 1544426 1585108 1637491 1518245
23738A518245j1663J6687O5695R7449m8276L0667R9181k8543K2167n8484j60166
$$ 1518245 1506582 1523269 1588964 1686413 1638137 1668804 1767985 1739442 1761609 1703125 1542959
23727A542959Q0446J26522J5265n1612q272J32943O4694J34203o3490M6413K6052
$$ 1542959 1623405 1749927 1765192 1713580 1705308 1838251 1902945 2037148 1973658 2020071 2046123
23716B046123j46725q2205r8830l1424K17953R6753j09334K8220l8327n1123l064
$$ 2046123 1899398 1817193 1718363 1686939 1904892 2001645 1892311 1920531 1882204 1831081 1828017
23705A828017q0784k8050k7697J05592J5471p314j5399N6388n1227n2993K293
$$ 1828017 1747233 1719183 1691486 1797078 1812549 1805235 1789836 1846224 1794997 1742004 1744297
23694A744297J56550K1493m9533m3665j93269q3818k8732K1618R1513L2230M8853
$$ 1744297 1900847 1922340 1872807 1829142 1635873 1552055 1523323 1544941 1636454 1668684 1717537
23683A717537m5248n6881M2411L1335J20605R4493L4547L5201j68446j7388L3281
$$ 1717537 1672289 1615408 1657819 1689154 1809759 1904252 1938799 1974000 1805554 1788166 1821447
23672A821447K6333J4293J759j56806K7273j25874o490K25881o0880P8534R2987
$$ 1821447 1847780 1862073 1863832 1707026 1734299 1608425 1601935 1827816 1766936 1845470 1938457
23661A938457J2700l8632J03901K14K5294Q9896p9308j24704j44626j01092N4663
$$ 1938457 1951157 1912525 2016426 2016640 2041934 2131830 2052522 1927818 1783192 1682100 1736763
23650A736763J41145j64511N1614J85059j9682j9391p1219r8075P4926J40018
$$ 1736763 1877908 1713397 1765011 1950070 1930388 1910997 1839778 1741703 1816629 1956647
23640A956647P6778k4779n5657K6488k6522R7238K7950j22744n9452j25106j69508
$$ 1956647 2033425 2008646 1952989 1979477 1952955 2050193 2078143 1955399 1895947 1770841 1601333
23629A601333k9070K04564M5179p9922N0547P9222J7226J41043O3076j14414r2630
$$ 1601333 1572263 1776827 1822006 1742084 1792631 1871853 1889079 2030122 2093198 1978784 1886154
23618A886154m4949o2342n4559N1112J18639L9057O4444L9411k8893r0214r4769
$$ 1886154 1841205 1778863 1724304 1775416 1894055 1933112 1997556 2036967 2008074 1917860 1823091
23607A823091o0022L2959P5779Q9069l0985r0931k9882M2852N2954J8192R3461
$$ 1823091 1763069 1796028 1871807 1960876 1929891 1838960 1809078 1851930 1904884 1923076 2016537
23596B016537l8094r3419K3706m7915j17625k1786L421K616O2877J8964N7486
$$ 2016537 1978443 1885024 1908730 1860815 1743190 1721404 1724825 1727441 1790318 1809282 1866768
23585A866768j00372q7386O3061P5695J41056M6144k3312o3802j06621L5200j5262
$$ 1866768 1766396 1679010 1742071 1817766 1958822 2004966 1981654 1917852 1811231 1846431 1831169
23574A831169n3019J77117q6018j74137O5831K11855K7151m9847j44487l7026
$$ 1831169 1778150 1955267 1869249 1695112 1760943 1972798 1999949 1950102 1805615 1768589
23564A768589Q8313N3722m1698K8356m0170L3497M1164L0914k7956j2374R2378
$$ 1768589 1856902 1910624 1868926 1897282 1857112 1890609 1931773 1962687 1934731 1922357 2014735
23553B014735R3113M4079M8747K1480m9530k6736r9925O0433j35989j25693m0407
$$ 2014735 2107848 2151927 2200674 2222154 2172624 2145888 2045963 2106396 1970407 1844714 1804307
23542A804307r3909K01n8936n2199p7948J05316R6956j8854j70355k6159n647
$$ 1804307 1710398 1710599 1651663 1599464 1521516 1626832 1723788 1704934 1534579 1508420 1502773
23531A502773j59635J16777J32174R6984M3021M8294O6836Q1171K2920o2996J2616
$$ 1502773 1343138 1459915 1592089 1689073 1732094 1780388 1847224 1928395 1951315 1888319 1900935
23520A900935O9223K4366n3529m2621L9841K9652l8432m8140j9570N026K1370
$$ 1900935 1970158 1994524 1940995 1898374 1938215 1967867 1929435 1881295 1861725 1866751 1888121
23509A888121R5771q7906j49647J75068J24789n8012j03946p8865N0539m3913
$$ 1888121 1983892 1895986 1746339 1921407 2046196 1988184 1884238 1805373 1855912 1811999
23499A811999L5258q1185m0165J77329K8938Q3428l9058J5905k362n0591P1116
$$ 1811999 1847257 1766072 1725907 1903236 1932174 2015602 1976544 1992449 1990087 1939496 2010612
23488B010612p1464R1963k2356J6163o9776j41543j6694J6383J03428o0331j5497
$$ 2010612 1939148 2031111 2008755 2024918 1955142 1813599 1796905 1813288 1916716 1856385 1840888
23477A840888K61883m9762j08197j14564j8070L447m2152p3376J6462m5700n6900
$$ 1840888 2102771 2053009 1944812 1830248 1812178 1815625 1773473 1700097 1716559 1670859 1613959
23466A613959j12202m8940N9853Q5710J07886J09249P5885k6936r758J7378j06273
$$ 1613959 1501757 1452817 1512670 1598380 1706266 1815515 1891400 1864464 1854706 1872084 1765811
23455A765811L6253L8334L9344l8073J0502J02112J25024P4501k03994j25070
$$ 1765811 1802064 1840398 1879742 1841669 1852171 1954283 2079307 2153808 1949814 1824744
23445A824744O1576O3590O9231K7695K9369l6760q0068P329J29258o1472j23800
$$ 1824744 1886320 1949910 2019141 2046836 2076205 2039445 1959377 1966706 2095964 2034492 1910692
23434A910692M7877K8844l4777j29478K0485P0614q817L2873m3344k6223j00216
$$ 1910692 1958569 1987413 1952636 1823158 1843643 1914257 1905440 1938313 1894969 1868746 1768530
23423A768530J33034R2816p3046k5258l879J2854M9036M5554o9187N1200L8749
$$ 1768530 1901564 1994380 1921334 1896076 1892197 1905051 1954087 1999641 1930454 1981654 2020403
23412B020403l0169j3343l5221j09227j36694J10339N7710p7678j0715N7412J2447
$$ 2020403 1990234 1976891 1941670 1832443 1695749 1806088 1863798 1786120 1775405 1832817 1845264
23401A845264L6791J71300l2381O067O2623l4335j32503r0276l6465k8643q4675
$$ 1845264 1882055 2053355 2020974 2027041 2089664 2055329 1922826 1832550 1796085 1767442 1682767
23390A682767J38977J49907K4702o7858q1999R9991K8669N2146k8443k0216P7306
$$ 1682767 1821744 1971651 1996353 1928495 1846496 1946487 1975156 2027302 1998859 1978643 2055949
23379B055949Q6198n7597j0590o4285O1686J04874L4341j01841O039m637N6326
$$ 2055949 2142147 2084550 2073960 2009675 2071361 2176235 2210576 2108735 2114774 2110137 2166463
23368B166463J54705m2169j49494j05555j11061j92066L8210J04558O2363o4252
$$ 2166463 2321168 2278999 2129505 2023950 1912889 1720823 1759033 1863591 1925954 1861702
23358A861702n2997k1225J61092J84696q8268j42203p7623J6455N8484p6334k0703
$$ 1861702 1808705 1787480 1948572 2133268 2045000 1902797 1825174 1841629 1900113 1823779 1803076
23347A803076J6463R3008J4276k3693M052R3477J0514Q2497j1837K2384J0583
$$ 1803076 1819539 1912547 1926823 1903130 1907182 2000659 2011173 2093670 2081833 2104217 2114800
23336B114800l3369l6443n270L9091j5304M6571L7521m6441M7181J11186q8794
$$ 2114800 2081431 2044988 2039718 2078809 2063505 2110076 2147597 2101156 2148337 2259523 2170729
23325B170729j46781o1989r5174J01156J5809l8708n6287j870o178J00850J84206
$$ 2170729 2023948 1961959 1866785 1967941 1983750 1945042 1888755 1886885 1880707 1981557 2165763
23314B165763m4975l8130o9684q0578o2533q1817j848O6485J22765J19848J05636
$$ 2165763 2120788 2082658 2012974 1932396 1869863 1788046 1786198 1852683 1975448 2095296 2200932
23303B200932K55569K1828k48629o3797k9086m9978Q1614l5901Q0228r1888n9856
$$ 2200932 2456501 2478329 2229700 2165903 2136817 2086839 2168453 2132552 2212780 2120892 2061036
23292B061036J60468Q7429j41033k266L7295J04557q7870q9149j9545r447l6461
$$ 2061036 2221504 2308933 2167900 2165634 2202929 2307486 2219616 2130467 2110922 2101475 2065014
23281B065014m5448k4521j0591j1843n1042R2492P9032j10705o7554J8978O9512
$$ 2065014 2019566 1995045 1984454 1972611 1921569 2014061 2093093 1982388 1914834 1933812 2003324
23270B003324J720n0420L1278P223J55898K7478k427N3797k40522j18746K3058
$$ 2003324 2005044 1954624 1985902 1993125 2149023 2176501 2174074 2227871 1987349 1868603 1891661
23259A891661O8551L1076K124K8216J14329j7582J784J24621M7302p6940j30483
$$ 1891661 1960212 1991288 1993412 2021628 2135957 2118375 2120159 2244780 2292082 2215142 2084659
23248B084659L3244p9301o8833r6418P3611j7602l3469M7674R0277Q6732K33083
$$ 2084659 2117903 2038602 1969769 1873351 1946962 1929360 1895891 1943565 2033842 2120574 2353657
23237B353657j29835k47554R63Q3796j1254J18872J21526j50259k11301o6233
$$ 2353657 2223822 1976268 1977231 2061027 2049773 2168645 2290171 2139912 1928611 1862378
23227A862378L137P6219Q6632P053k9627J24902J5746L6979q0771j14980R0677
$$ 1862378 1865515 1941734 2028366 2035419 2005792 2130694 2146440 2183419 2102648 1987668 2078345
23216B078345K20847O1423m7660j56072j85657J02543J4600r5269j2586N6179
$$ 2078345 2299192 2360615 2312955 2156883 1971226 2073769 2088369 1993100 1980514 2036693
23206B036693N4963M6975K9545q1184J04683j1538j16422N2004K033q3388j69085
$$ 2036693 2091656 2138631 2168176 2086992 2191675 2180137 2063715 2115719 2117752 2034364 1865279
23195A865279J1070R0722J96171J46425L5749r1164j08440p2705r495r4331L3956
$$ 1865279 1876349 1967071 2163242 2309667 2345416 2254252 2145812 2073107 2063612 1969281 2003237
23184B003237J00697j1442J10113j24042k09135J21291P5039o1636P2381J31739
$$ 2003237 2103934 2092492 2202605 2078563 1869428 1990719 2065758 2004122 2076503 2208242
23174B208242n0747O2402J19297j71557q8508M0528J27340R4868J51255J3947
$$ 2208242 2157495 2219897 2339194 2167637 2079129 2119657 2246997 2341865 2493120 2507067
23164B507067l6808j01002l4930J8930k5076J5779J08461q1048J0982j8418j04438
$$ 2507067 2470259 2369257 2334327 2353257 2328181 2343960 2452421 2371373 2382355 2363937 2259499
23153B259499k3487J25972M7526j8461p7590O391m0236Q2j16536p6351j1203J04249
$$ 2259499 2236012 2361984 2409510 2391049 2313459 2319850 2279614 2279696 2163160 2086809 2075606 2179855
23141B179855N076j38677o4321N0792M8036L7758N2591L9064M2077n33L1441N4437
$$ 2179855 2184931 2046254 1981933 2032725 2080761 2118519 2171110 2210174 2252251 2251718 2283159 2337596
23129B337596j68050j35554L4703J03879r674Q8787P8063P5641m1383j88034j45865
$$ 2337596 2169546 2033992 2068695 2172574 2162900 2251687 2329750 2405391 2364008 2175974 2030109
23118B030109p789N3182J31876j789q9715j15378P2619J79654J39541l9622J5558
$$ 2030109 2022320 2075502 2207378 2205589 2115874 2000496 2073115 2252769 2392310 2352688 2368246
23107B368246p025p9855j90265K8181M5984N660K0732N508k2320M3211Q9967l3438
$$ 2368246 2361221 2281366 2091101 2119282 2165266 2170926 2191658 2197166 2174846 2218057 2308024 2274586
23095B274586p7781O6247L3442o4572l6330M4734J41140L0762n8301j65078j4406
$$ 2274586 2196805 2263052 2296494 2231922 2195592 2240326 2381466 2412228 2353927 2188849 2174443
23084B174443J97364J05248J0876k5228n6238l2648N4525K6723j24669j0955j4587
$$ 2174443 2371807 2477055 2487931 2462703 2406465 2373817 2428342 2455065 2330396 2319441 2304854
23073B304854N1302q4671J6388l7568J0394j8015L6786J00011k7241O839j6872
$$ 2304854 2356156 2271485 2287873 2250305 2260699 2242684 2279470 2379481 2352240 2359079 2342207
23062B342207J13120j701k11102l1002J06618o911m7600L2202J50663K3291n9941
$$ 2342207 2455327 2453626 2242524 2211522 2318140 2311229 2263629 2295831 2446494 2469785 2409844
23051B409844P2770q5420j7071R2498R4486O0124k6122m1657j53027o678j5008
$$ 2409844 2482614 2397194 2380123 2472621 2567107 2627231 2601109 2559452 2406425 2399747 2384739
23040B384739K7046J43627M4086j29485l1362p6701p2241m8331m8144N6430J31878
$$ 2384739 2411785 2555412 2599498 2470013 2438651 2361950 2289709 2241378 2193234 2249664 2381542
23029B381542Q6336M2619L7564j62637L28M5489j70695q7654n3014N7479N9456
$$ 2381542 2467878 2510497 2548061 2385424 2385752 2431241 2260546 2172892 2119878 2177357 2236813
23018B236813M8300P5891o3192k237J08622K03813J20858J68798j6985k60065
$$ 2236813 2285113 2361004 2297812 2295575 2404197 2608010 2728868 2897666 2880681 2620616
23008B620616j91917p2725J0048M8652j32947k0365k5733O7481O5285R3374R5706
$$ 2620616 2428699 2355974 2366022 2414674 2281727 2261362 2235629 2303110 2368395 2461769 2557475
22997B557475j0262n7893o3033J5299Q7228J9897m3955p7962q4476O1245O8044
$$ 2557475 2547213 2489320 2426287 2441586 2528814 2548711 2504756 2426794 2342318 2403563 2471607
22986B471607j09360j44282Q7919J72512n6734l1079P526J4557j4029k9078j62219
$$ 2471607 2362247 2217965 2305884 2478396 2421662 2390583 2398109 2412666 2398637 2369559 2207340
22975B207340L5627J43570J17971L4377r8923o6142J2604J0774J1396L4552L3714
$$ 2207340 2242967 2386537 2504508 2538885 2439962 2373820 2386424 2397198 2408594 2443146 2476860
22964B476860j18353m5216l7877K9097N2155L7118P7300M8527M648m9709M9208
$$ 2476860 2358507 2313291 2275414 2304511 2356666 2393784 2471084 2519611 2524259 2474550 2523758
22953B523758k9971j8566P8319m4160o9581J16147l3537m6885k8511o3110O7072
$$ 2523758 2493787 2475221 2553540 2509380 2439799 2555946 2522409 2475524 2447013 2383903 2450975
22942B450975j2212K2290N7284q8615R0901k5734n4317K2076n2309j1849k6523
$$ 2450975 2438763 2461053 2518337 2429722 2520623 2494889 2440572 2462648 2410339 2398490 2371967
22931B371967m436N3933m7440N0758J91436M1611K5286m5300q6318j15377K0092
$$ 2371967 2367531 2421464 2374024 2424782 2616218 2657829 2683115 2637815 2551497 2436120 2456212
22920B456212n9563R6607J04920M3986P282j24910k34251N2272R3867Q4712O942
$$ 2456212 2396649 2493256 2598176 2642162 2649444 2524534 2290283 2342555 2436422 2521134 2528076
22909B528076K4479M0193m9493O2046o7299j34249P2274J33514L8650N980r4496
$$ 2528076 2552555 2592748 2543255 2605301 2538002 2403753 2476027 2609541 2648191 2654171 2559675
22898B559675k4169p8788J12962Q6068K3873p8521N079N1605j55087M3047K1582
$$ 2559675 2535506 2456718 2569680 2655748 2679621 2601100 2606179 2657784 2502697 2545744 2567326
22887B567326J00930m6936p031J08044P1635l4751j87848r2205P4781M3485L7790
$$ 2567326 2668256 2621320 2614289 2722333 2793968 2759217 2571369 2479164 2553945 2597430 2635220
22876B635220K8134q0019J10283J43738N6165k1897j65853k76029P1381O4470
$$ 2635220 2663354 2583335 2693618 2837356 2893521 2871624 2705771 2429742 2501123 2565593
22866B565593l4709L8221l8340p0493N1447J00544L5300j10223J7616m400q2075
$$ 2565593 2530884 2569105 2530765 2460272 2511719 2612263 2647563 2537340 2554956 2550556 2468481
22855B468481J8190O6380P6355n3106j94639L1130J71500P4986j1346k1939K8910
$$ 2468481 2486671 2553051 2629406 2576300 2381661 2412791 2584291 2659277 2647931 2625992 2654902
22844B654902O532p0976j56518n6168M2740K3684o7352K2087K10932q5802q3093
$$ 2654902 2661434 2590458 2433940 2377772 2420512 2444196 2376844 2398931 2609863 2524061 2440968
22833B440968L0062O5787J50288J72641q0746j47016j25342N0806l4587j1195
$$ 2440968 2471030 2536817 2687105 2859746 2779000 2631984 2506642 2557448 2522861 2511666
22823B511666K30464J03614r0676J9783J12781P6685K7159k40718p6943J352p894
$$ 2511666 2742130 2845744 2755068 2774851 2887632 2964317 2991476 2750758 2673815 2675167 2667273
22812B667273k2682l5074q3178n221K1828P2912M9876j04593k6333K8988j45053
$$ 2667273 2644591 2609517 2526339 2521118 2542946 2615858 2665734 2561141 2534808 2563796 2418743
22801B418743M6417J82949N6127p8443o058J884J25664K3648P800k19410K592
$$ 2418743 2465160 2648109 2704236 2625793 2619735 2621619 2747283 2770931 2778731 2559321 2561913
22790B561913J15558j00486K5047J32550Q208k7600n8925k20262J87606J39097
$$ 2561913 2677471 2576985 2602032 2734582 2742790 2715190 2656265 2436003 2623609 2762706
22780B762706j69380o3790K20505n035n4759j73375j0170M0606K6163l164P5217
$$ 2762706 2593326 2529536 2750041 2745006 2690247 2516872 2506702 2547308 2573471 2570307 2645524
22769B645524J20770q8793l4963K7939p4099J09694K9240qk3859l8848J3315K8413
$$ 2645524 2766294 2677501 2642538 2670477 2596378 2706072 2735312 2735304 2711445 2672597 2685912 2714325
22757B714325M2401o2910k8385J01785P6025M239j5297K6833n2671J058J4962
$$ 2714325 2756726 2693816 2665431 2767216 2843241 2847480 2832183 2859016 2806345 2807403 2822365
22746B822365J2068l6893q7767j00181k90R5850k0603K0960J62085J08389j53272
$$ 2822365 2834433 2797540 2709773 2609592 2609302 2705152 2684549 2705509 2867594 2975983 2822711
22735B822711j80722l3389O1460Q3532n2047J29932J40519r9398J6238N2143j36714
$$ 2822711 2641989 2608600 2670060 2753592 2701545 2831477 2971996 2872598 2888836 2940979 2804265
22724B804265k7072P9379j4582L8904L9097m6997M7184j76744Q4320L4982k480
$$ 2804265 2777193 2856572 2841990 2880894 2919991 2872994 2920178 2743434 2827754 2862736 2860256
22713B860256N8672k2722p9662n9064j07254O4097L8607P9613K8256N3348n6495
$$ 2860256 2918928 2896206 2816544 2757480 2650226 2714323 2752930 2832543 2860799 2914147 2857652
22702B857652j04241N2859M0219J4606P8087L9740k7448j20054j35258m3180K18569
$$ 2857652 2753411 2806270 2846489 2861095 2939182 2978922 2951474 2831420 2696162 2652982 2871551
22691B871551J81703j14129j21536N2617l4197j6345J08441Q285k4025j9308l7192
$$ 2871551 3053254 2939125 2817589 2870206 2836009 2819664 2928105 2936390 2912365 2893057 2855865
22680B855865P5092J632m3203P7103k085j41873P0428J10498m9180J02130m2779
$$ 2855865 2930957 2932589 2889386 2966489 2964404 2822531 2892959 3003457 2954277 3056407 3013628
22669C013628j18016l3674j2321J22330O4533J23092P1528j21350j16238r8041
$$ 3013628 2895612 2861938 2849617 2971947 3036480 3159572 3231100 3109750 2993512 2895471
22659B895471K7718J21117J06908m3253n7505o475l6393r0575M4121j9207P1708
$$ 2895471 2923189 3044306 3151214 3107961 3050456 3043981 3007588 2917013 2961134 2941927 3013635
22648C013635m7374J21955k5089R321j75580n7612J60621J25443K1174k8566K5809
$$ 3013635 2966261 3088216 3063127 3072448 2896868 2839256 2999877 3125320 3146494 3117928 3143737
22637C143737q3669M9086j9887n0633j84447O4118j6903j76900P2824Q1667j5396
$$ 3143737 3060068 3109154 3089267 3038634 2854187 2918305 2901402 2724502 2797326 2878993 2863597
22626B863597P055J51705l744N6121k1776k42215K8693L5303m8896J43204N4727
$$ 2863597 2870652 3022357 3018613 3074734 3052958 2810743 2839436 2874739 2825843 2969047 3023774
22615C023774j1907L712k7491n5616j1966k006O1465L2530n7437J6457J15788
$$ 3023774 3011867 3015579 2988088 2932472 2920506 2918500 2979965 3012495 2955058 2971515 3087303
22604C087303J03772o0841j07693j4684J13456J31208p2019j20683j02152R2961
$$ 3087303 3191075 3130234 3022541 3007857 3121313 3252521 3180502 3059819 2957667 3050628
22594C050628J09506l7054p7871R578l456P1289N2839P1833P3200n0561j11447
$$ 3050628 3160134 3123080 3045209 3054787 3051331 3122620 3175459 3247292 3320492 3269931 3158484
22583C158484q2114j06110j2360J45130P5187L3319M4786O1662L2233m3501j46994
$$ 3158484 3076370 2970260 2957900 3103030 3178217 3211536 3256322 3317984 3350217 3306716 3159722
22572C159722J2590J39401o4580m9149J07861M6115M3503k933j69149j57404K6971
$$ 3159722 3172312 3311713 3247133 3197984 3305845 3351960 3395463 3392530 3223381 3065977 3092948
22561C092948p9056j4247J79019O1745k6422N7015O6626p3559j9075O7384L8193
$$ 3092948 3013892 2999645 3178664 3240409 3213987 3271002 3337628 3264069 3244994 3312378 3350571
22550C350571j33974j20881m65J3553N5450L6681M46J5852J16652p9282j9636
$$ 3350571 3216597 3095716 3095251 3108804 3164254 3200935 3201381 3217233 3333885 3254603 3234967
22539C234967P1368J797l4059p856p0240j4555l4583Q7083j5193Q1620J33225
$$ 3234967 3306335 3308132 3274073 3266217 3195977 3181422 3146839 3233922 3218729 3300349 3433574
22528C433574m1762j36597r3608o2370J3098M8272P5130o0065M1521P1697p2509
$$ 3433574 3391812 3255215 3161607 3099237 3112335 3160607 3235737 3175672 3217193 3288890 3216381
22517C216381R7672J25226Q0889o5874j60756q1647q8347J7030J30738k5065j09085
$$ 3216381 3314053 3439279 3520168 3454294 3293538 3211891 3123544 3140574 3271312 3246247 3137162
22506C137162J12129R175j34249Q8539K30333N5429P622n6000o7781p8412r0726
$$ 3137162 3249291 3258466 3124217 3212756 3443089 3498518 3506140 3450140 3382359 3303947 3213221
22495C213221L078Q3502Q2823P819j03117L6797k0778R4483K5718j44203m7590
$$ 3213221 3216299 3299801 3382624 3390443 3287326 3324123 3303345 3397828 3423546 3279343 3231753
22484C231753J61520K397o3497J0399J72j37782P4082k8292K1367J04828Q9084
$$ 3231753 3393273 3395670 3332173 3342572 3342744 3204962 3279044 3250752 3272119 3376947 3466031
22473C466031j78192L0289p2748j18944J23609J19832L4276J31556l7515j11099
$$ 3466031 3287839 3318128 3245380 3126436 3250045 3369877 3404153 3535709 3498194 3387095
22463C387095J52465L7541k1653k5293l3839j26190M0361J0678J08476J75117
$$ 3387095 3539560 3577101 3555448 3530155 3496316 3370126 3410487 3421165 3529641 3704758
22453C704758J73141q0266j10491j35545k1074J6183l7059l2731L4255P5675j76962
$$ 3704758 3877899 3797633 3687142 3551597 3530523 3546706 3509647 3476916 3511171 3586846 3409884
22442C409884p6891Q6825L1031L5301L2394J93761p16m0221J38886n2257J1180
$$ 3409884 3332993 3419818 3450849 3486150 3518544 3712305 3711589 3671368 3810254 3757997 3769177
22431C769177R3935j32368j74670q3092l5497J99561L9217j90467M5861P8351
$$ 3769177 3863112 3730744 3556074 3472982 3437485 3637046 3676263 3485796 3531657 3610008
22421C610008P2530m7413j27963l7302j7010Q0878J2076M0941J50529J25524k7186
$$ 3610008 3682538 3635125 3507162 3469860 3452850 3533728 3545804 3586745 3737274 3862798 3835612
22410C835612n7294o3341j7943J6660L8365P4120L5525r1265j40290p9888J90669
$$ 3835612 3778318 3714977 3697034 3713694 3752059 3826179 3861704 3770439 3630149 3550261 3740930
22399C740930O915j06633o3870P520K4850J39280n2462O1730J77576J65040k5638
$$ 3740930 3747845 3641212 3577342 3584862 3609712 3748992 3696530 3758260 3935836 4100876 4075238
22388D075238m1206l5061m0021j2269K6359j22082j20784K347R0934p2975m9620
$$ 4075238 4034032 3998971 3958950 3946681 3973040 3850958 3730174 3732521 3823455 3750480 3700860
22377C700860m6809L1954O3482L4571J00380R0022n1197k17088O2605J96423J09803
$$ 3700860 3654051 3686005 3749487 3784058 3884438 3974460 3923263 3706175 3768780 3965203 4075006
22366D075006m6895r7839O215J5105J90201J47615j72186M539J02489j2798p8954
$$ 4075006 4028111 3930272 3936487 3951592 4141793 4289408 4117222 4121761 4224250 4211452 4132498
22355D132498o282l2088n0849J01889J3085p5788J08707N903q4598M8284O2821
$$ 4132498 4126216 4094128 4043279 4145168 4158253 4082465 4191172 4197075 4112477 4160761 4223582
22344D223582M8665p6862O079Q1931Q5555J62792J50526J00773j9589p3739p5650
$$ 4223582 4272247 4195385 4201464 4283395 4368950 4531742 4682268 4783041 4763452 4689713 4614063
22333D614063j75472m21415l21511j98370j39570k1764J29303J75255K80615L6896
$$ 4614063 4438591 4017176 3695665 3497295 3357725 3335961 3465264 3640519 3921134 3958030
22323C958030N2421L09632J83579p6178J1518J19688j26158r4409j72975m30069
$$ 3958030 4010451 4320083 4503662 4427484 4439002 4558690 4432532 4338123 4165148 3735079
22313C735079l73039j56664p7245L0505N4288J4770M4845Q7365P0367l2098l3115
$$ 3735079 3362040 3205376 3128131 3158636 3212924 3227694 3272539 3359904 3430271 3398173 3365058
22302C365058M6794R9928J25561M4032q8847J3745R6453J11982k3249j9507m7724
$$ 3365058 3411852 3511780 3637341 3681373 3592526 3606271 3702724 3814706 3791457 3771950 3724226
22291C724226p5650J26086m3017m9435P8281J47578l5795K2080R726o4016J18889
$$ 3724226 3648576 3774662 3731645 3682210 3760491 3908069 3872274 3894354 3904080 3840064 3958953
22280C958953M6379M8266R9974N8320L4134j38762p0387L6646j5522o9362k4661
$$ 3958953 4005332 4053598 4153572 4211892 4246026 4107264 4036877 4073523 4058001 3988639 3963978
22269C963978K9449K10212k6318r3608n5712J2114l5231m3063L5041Q1037L8424
$$ 3963978 3993427 4203639 4177321 4083713 4028001 4040115 4004884 3961821 3996862 4077899 4116323
22258D116323J60806o6165n5464N5297P3339O6386K8566P2248o9218j07383M3079
$$ 4116323 4277129 4210964 4155500 4210797 4284136 4350522 4379088 4451336 4382118 4274735 4317814
22247D317814j205J54409N8398m6011j30421j14715r3258q983n8457K1626J18898
$$ 4317814 4316609 4471018 4529416 4483405 4352984 4238269 4145011 4136028 4077571 4099197 4218095
22236D218095m2567j2618N9373m1001o554J12539J28828k3014j7081j35458j68763
$$ 4218095 4175528 4162910 4222283 4181282 4174728 4287267 4416095 4393081 4376000 4240542 4071779
22225D071779l642K1150P5155J07165J79308J18627l6303m0769j3542r6731q6011
$$ 4071779 4068137 4089287 4164442 4271607 4450915 4569542 4533239 4492470 4478928 4382197 4296186
22214D296186P5091J08753Q0695J43321k22572j57003P7283J67216j980J9804
$$ 4296186 4371277 4480030 4560725 4704046 4481474 4324471 4401754 4568970 4566990 4586794
22204D586794Q3401K1076j5085p0332n0600j49890M260J30399J60705J92397J7046
$$ 4586794 4670195 4691271 4676186 4605854 4555254 4405364 4409624 4540023 4700728 4893125 4910171
22193D910171n2103r0418R0869N4254n4234p0585M5080r6515j17172k46467j4782
$$ 4910171 4858068 4767650 4858519 4912773 4858539 4787954 4833034 4736519 4619347 4372880 4358098
22182D358098K33773K48248m2539M6207M4245j51472j22253k1690l9035R9449
$$ 4358098 4591871 4840119 4797580 4843787 4888032 4736560 4614307 4592617 4553582 4653031
22172D653031R8415k017j07445j4366l2203J52979q90j05894J36147J28812Q180
$$ 4653031 4751446 4749429 4641984 4627618 4595415 4748394 4747504 4641610 4777757 4906569 4914749
22161D914749j15570m3133R6453n1439R5095k1434P2490n292O8773J14985q4365
$$ 4914749 4799179 4756046 4852499 4801060 4896155 4874721 4947211 4941919 5010692 5125677 5041312
22150E041312r5558J12162k2852p0084P5349o2792r2833p5254J14324J73742j29406
$$ 5041312 4945754 5057916 5035064 4964980 5040329 4977537 4884704 4809450 4923774 5097516 4968110
22139D968110j77747o7359J47113Q4610L6420J40456m7979j11411J33154J42331
$$ 4968110 4790363 4723004 4870117 4954727 4991147 5131603 5083624 4972213 5105367 5247698
22129E247698m9971j18913J3683m6736o7915J54123K8818j05546L688N3671P6981
$$ 5247698 5197727 5078814 5092497 5045761 4977846 5131969 5160787 5055241 5058929 5112600 5189581
22118E189581j2388j17479p2314o3784N4703J81423M5494M4440r079m8830O7155
$$ 5189581 5177193 5059714 4987400 4923616 4978319 5159742 5205236 5249676 5240597 5191767 5258922
22107E258922k4036Q7165R4230L2316L2740K5611J6869P6783J50592L6805j90197
$$ 5258922 5234886 5322051 5416281 5448597 5481337 5506948 5523817 5600600 5751192 5787997 5597800
22096E597800j15419q843Q9008K2714o1164o7950m4337P9163q3840k7775L3745
$$ 5597800 5482381 5473538 5562546 5585260 5524096 5456146 5411809 5490972 5407132 5379357 5413102
22085E413102J2436o4222o3979J88722R7532K1073J27394p987N4488j38238R5828
$$ 5413102 5425538 5361316 5297337 5486059 5583591 5604664 5732058 5724071 5778559 5640321 5736149
22074E736149N567k2127O2072N1307j6682N7949J395j07087p6790j06194O7894
$$ 5736149 5741716 5719589 5781661 5832968 5816286 5874235 5875630 5768543 5691753 5585559 5653453
22063E653453L941J1976O8714N4100O2506n545j5609o8976O2359k5149O7395P0571
$$ 5653453 5657394 5669370 5738084 5792184 5854690 5849145 5833536 5764560 5826919 5801770 5869165 5939736
22051E939736k7447p7658N7980R1455J17504P7840m0549j19960n7000m2188j0088
$$ 5939736 5912289 5834631 5892611 5984066 6101570 6179410 6138861 6018901 5961901 5919713 5909625
22040E909625J5386J1807r5421j26129r2160L2224K02776K07035J84676J17064
$$ 5909625 5925011 5936818 5841397 5715268 5623108 5655332 5858108 6065143 6249819 6366883
22030F366883M9168o5615k8016n6078J5077J44648J05325J79611J02173k840k53971
$$ 6366883 6416051 6350436 6322420 6266342 6281419 6426067 6531392 6711003 6813176 6810336 6556365
22019F556365m5925J43676o0790L8769p3207j63009J7499J34982J97829R2709
$$ 6556365 6510440 6654116 6593326 6632095 6558888 6395879 6413378 6548360 6746189 6838898
22009F838898P3755j4287j49581j41174l3845M6975K551K66619J01217j7990m3446
$$ 6838898 6912653 6898366 6748785 6607611 6573766 6620741 6623292 6889911 6991128 6973138 6929692
21998F929692q4794J24076R9852Q8620R5937j2815L4690n9300j07532r8198o4294
$$ 6929692 6844898 6968974 7068826 7157446 7253383 7240568 7275258 7215958 7108426 7010228 6945934
21987F945934K00210J89576j05607j70118k06184L8412K9316J08396K040j2234
$$ 6945934 7146144 7335720 7230113 7059995 6853811 6892223 6921539 7029935 7031975 7019741
21977G019741K73414P9299j11307k6306J8114J17560R1755M1560j27921l9164
$$ 7019741 7293155 7372454 7261147 7234841 7252955 7370515 7462270 7503830 7375909 7336745
21967G336745J68343P7816j09602N2800J61457j5319j04820M1303p467r5395Q3145
$$ 7336745 7505088 7582904 7473302 7526102 7687559 7672240 7567420 7608723 7601256 7505861 7589006
21956G589006Q78K35514J76578r6843M1702o354j31715j2270R5920P7565J35915
$$ 7589006 7589884 7825398 8001976 7905133 7946835 7940481 7808766 7796496 7892416 7969981 8105896
21945H105896o2995q9340M1276J7247P0965J24125l4205Q4359q695J00624N0847
$$ 8105896 8042901 7953561 7994837 8012084 8083049 8207174 8172969 8257328 8248633 8349257 8400104
21934H400104m1461m9265l6775Q6561J65081J4058j3220J13601O7595N7359K541
$$ 8400104 8358643 8309378 8272603 8359164 8524245 8538303 8525083 8638684 8706279 8763638 8766179
21923H766179N473L8097J411Q6882J08188l4541j8024J18743J09149O8943P5762
$$ 8766179 8771652 8809749 8811160 8898042 9006230 8971689 8953665 9072408 9181557 9250500 9326262
21912I326262j45465k2561J41077J27927J61558N4642n9629p2727j6808p6199
$$ 9326262 9180797 9158236 9299313 9427240 9588798 9643440 9583811 9511084 9494276 9418077
21902I418077L5384O7226M9538M0478P6912R7321N9734J47633K26413N4236l3324
$$ 9418077 9453461 9520687 9570225 9610703 9687615 9784936 9844670 9992303 10218716 10272952 10239628
21891A0239628n569K76r096q1515j8806K7390J07537J60968K61765M1567J0434
$$ 10239628 10234059 10234335 10225239 10143724 10124918 10152308 10259845 10420813 10682578 10724145 10734579
21880A0734579J03841N6878l0804q0997R3753J91106O9628R1753J31334K158o230
$$ 10734579 10838420 10895298 10864494 10783497 10877250 11068356 11137984 11229737 11361071 11363229 11356999
21869A1356999k7159R6917P8633J48969K5268j42487J14035J68682J92223J73159
$$ 11356999 11329840 11426757 11505390 11654359 11679627 11537140 11651175 11819857 12012080 12185239
21859A2185239J36735R4021n9520j4146J03186J80938J24150J51364o258N8164
$$ 12185239 12321974 12415995 12356475 12342329 12445515 12626453 12750603 12901967 12895709 12953873
21849A2953873J62270J45315P1091P5625J2757J2824J84513J36211O6612P8425
$$ 12953873 13116143 13261458 13332549 13408174 13420931 13433755 13618268 13754479 13821091 13899516
21839A3899516J60854J18778J42683K29422J90466J06637N7784J7160J35863J20722
$$ 13899516 14060370 14179148 14321831 14551253 14741719 14848356 14906140 14923300 15059163 15179885
21829A5179885J75239N4445Q0156K24956K42240J44016O0500K34862K11119J44307
$$ 15179885 15355124 15409569 15489725 15714681 15956921 16100937 16161437 16396299 16607418 16751725
21819A6751725K10760K03310K76129J30046L5725K39976L18447K1685J74362J89781
$$ 16751725 16962485 17165795 17441924 17571970 17607695 17847671 18166118 18187803 18362165 18551946
21809A8551946J52031L6881K39180K90514L41982L21006K22238L79948M07053
$$ 18551946 18703977 18740858 18980038 19270552 19612534 19933540 20155778 20535726 20942779
21800B0942779K24364J69892K73511M78492L58005K94246K72630L77113K06819
$$ 20942779 21167143 21337035 21610546 22089038 22447043 22741289 23013919 23391032 23597851
21791B3597851J82845L70070L37777M88548M22012L30662O20355O61973N19684
$$ 23597851 23780696 24150766 24488543 24977091 25399103 25729765 26350120 27012093 27531777
21782B7531777O06967M12358L98182L70099M38443P17840O52743N31843P64541
$$ 27531777 28138744 28551102 28949284 29319383 29757826 30475666 31128409 31660252 32424793
21773C2424793Q98882R63208Q55622R28744J001649J230229J322298J001929K48802
$$ 32424793 33323675 34286883 35142505 36071249 37072898 38303127 39625425 40627354 40876156
21764D0876156R37N91099R56740J374791J848862J832122J801770J800411K044231
$$ 40876156 40877093 41468192 42424932 43799723 45648585 47480707 49282477 51082888 53127119
21755E3127119K274112K344792K072360K493771K936978L314460L083012L173879
$$ 53127119 55401231 57746023 59818383 62312154 65249132 68563592 71646604 74820483
21747G4820483L921299M323743N276255O519563P637413R311548J1348611J3904265
$$ 74820483 78741782 83065525 88341780 94861343 102498756 111810304 123158915 137063180
21739A37063180J5405607J6785455J9569250K2292677K5645106L0572312K0761108
$$ 137063180 152468787 169254242 188823492 211116169 236761275 267333587 288094695
21732B88094695n7160777k07851823j72213265p3690927l6988320M533780K8500124
$$ 288094695 230933918 23082095 -149131170 -222822097 -259810417 -255276637 -226776513
21725b26776513K9490648K3964146J9220426J5662755J3059919J1446853J0099870
$$ -226776513 -197285865 -173321719 -154101293 -138438538 -125378619 -113931766 -103831896
21718a03831896Q618442P507455O431028N537337M789817L602023K619537K506788
$$ -103831896 -95213454 -87705999 -81274971 -75737634 -70947817 -67345794 -64726257 -62219469
21710f2219469K619301K449533K543632K614430K543678K380963K050590J680957
$$ -62219469 -59600168 -57150635 -54607003 -51992573 -49448895 -47067932 -45017342 -43336385
21702d3336385J502297J528519J634677J518636P52768m277L36743P09640Q95142
$$ -43336385 -41834088 -40305569 -38670892 -37152256 -36399488 -36403765 -36067022 -35357382 -34462240
21693c4462240J003980J027904R15817Q68468R03191Q65986R76267P85622N44852
$$ -34462240 -33458260 -32430356 -31514539 -30646071 -29742880 -28876894 -27900627 -27115005 -26570153
21684b6570153P22309P06530N20028M89879M46619N89887O34920M51359L56206
$$ -26570153 -25847844 -25141314 -24621286 -24131407 -23684788 -23094901 -22459981 -22008622 -21652416
21675b1652416M77085N03970N47902L97647K00496K99982K58761L31192L81791
$$ -21652416 -21175331 -20671361 -20123459 -19725812 -19525316 -19225334 -18966573 -18635381 -18253590
21666a8253590M48855M59156L52777K88290L07696K80482K02685K22273K56559
$$ -18253590 -17804735 -17345579 -16992802 -16704512 -16396816 -16116334 -15913649 -15691376 -15434817
21657a5434817L46119L00589J07050J30962J99309L02871L41764J91877K28371
$$ -15434817 -15088698 -14788109 -14681059 -14550097 -14350788 -14047917 -13706153 -13514276 -13285905
21648a3285905K12747K27761J69199K84260K08396K08722P3848K61379K48776
$$ -13285905 -13073158 -12845397 -12676198 -12391938 -12183542 -11974820 -11900972 -11639593 -11390817
21639a1390817J65763K18226Q2342P6820J08068R4023J32659K21534R9715k45723
$$ -11390817 -11225054 -11006828 -10924486 -10847666 -10739598 -10645575 -10512916 -10291382 -10191667 -10437390
21629a0437390j62160J65195J57062J12917K08497J71485L01631J82890J21965
$$ -10437390 -10599550 -10434355 -10277293 -10164376 -9955879 -9784394 -9482763 -9299873 -9177908
21620i177908Q3896J81017J27057O3772M2494Q5498J49800O7610L5386J17600
$$ -9177908 -9094012 -8912995 -8785938 -8722166 -8679672 -8594174 -8444374 -8376764 -8341378 -8223778
21610h223778N5229L4178O6683J22154J82670J39872n0802j30460Q9925Q064J34047
$$ -8223778 -8168549 -8134371 -8067688 -7945534 -7762864 -7622992 -7673794 -7804254 -7714329 -7706265 -7572218
21599g572218J87977J43125J63702J46455N8205n4445j53352N54J13322K02066
$$ -7572218 -7384241 -7241116 -7077414 -6930959 -6872754 -6927199 -7080551 -7079997 -6966675 -6764609
21589f764609L6955R6648J07517r0866L6501j1618O4885K43688K32739K3452r546
$$ -6764609 -6727654 -6631006 -6523489 -6614355 -6577854 -6589472 -6524587 -6280899 -6048160 -6024708 -6034254
21578f034254Q2558k5519n988J15943P0826J37848L2408R2970J88338q765K2485
$$ -6034254 -5951696 -5977215 -5983203 -5867260 -5796434 -5658586 -5626178 -5533208 -5344870 -5353635 -5331150
21567e331150K7696o0182j05234m1328J89126J84480J10914L0745P5049M8802
$$ -5331150 -5303454 -5363636 -5468870 -5510198 -5321072 -5136592 -5025678 -4994933 -4919884 -4871082
21557d871082p0019Q2245L237L9422O5791q0474k5964K31363J68331R9118P0249
$$ -4871082 -4941101 -4858856 -4855619 -4816197 -4750406 -4830880 -4856844 -4625481 -4457150 -4358032 -4287783
21546d287783j96489q1084M1708J24118O0080Q9368K0964R151K4183O5819l8104
$$ -4287783 -4484272 -4565356 -4523648 -4399530 -4339450 -4250082 -4229118 -4219967 -4195784 -4129965 -4168069
21535d168069j10149K22892J71095O2575P0643Q1882j73679K6192J13036N8746
$$ -4168069 -4278218 -4055326 -3884231 -3821656 -3751013 -3669131 -3842810 -3816618 -3703582 -3644836
21525c644836r862j02785J48146J01329J52763J60832R2319o7309L7537J47350
$$ -3644836 -3654698 -3757483 -3609337 -3508008 -3355245 -3194413 -3102094 -3169403 -3131866 -2984516
21515b984516O1018j18544k7363J39299j06374L7413J83575q2895m1757o6358
$$ -2984516 -2923498 -3042042 -3069405 -2930106 -3036480 -2999067 -2815492 -2898387 -2940144 -3006502
21505c006502J7165Q514R635J75772r7727l1968J30846K26979O2702j9395j69097
$$ -3006502 -2989337 -2980823 -2971188 -2795416 -2893143 -2925111 -2794265 -2567286 -2504584 -2523979 -2693076
21494b693076q6746J3338J24657N3672k4986K1393k9513j0083j9288J14802K01482
$$ -2693076 -2779822 -2766484 -2641827 -2588155 -2613141 -2591748 -2621261 -2631344 -2650632 -2535830 -2334348
21483b334348j538L0601J5685M822k147K0357Q6694J06662L8058L588k2930j32856
$$ -2334348 -2335886 -2305285 -2289600 -2284778 -2286925 -2266568 -2179874 -2073212 -2035154 -2031566 -2054496 -2187352
21471b187352l4696J68149J0096p2148M2236Q6645J12677P4623Q277r2513j03170
$$ -2187352 -2222048 -2053899 -2043803 -2115951 -2073715 -1987070 -1874393 -1799770 -1791493 -1884006 -1987176
21460a987176j39183R900P4097J97447R9749J5350o4573M0776q5472K4715j230
$$ -1987176 -2126359 -2116459 -2042362 -1844915 -1745166 -1729816 -1794389 -1753613 -1839085 -1814370 -1815600
21449a815600N8448R1534L6353m2711Q3621K4119M7502N8065Q4756J52866j26225
$$ -1815600 -1757152 -1665618 -1629265 -1671976 -1588355 -1564236 -1516734 -1458669 -1373913 -1221047 -1347272
21438a347272k30654p3384J52383J24217L6987P5263Q3997m0456R1907o8713k53764
$$ -1347272 -1577926 -1651310 -1498927 -1374710 -1337723 -1262460 -1178463 -1218919 -1127012 -1195725 -1449489
21427a449489o0945J09241R9832O4420j6043J27250L610N3372J91249j24255j48723
$$ -1449489 -1510434 -1401193 -1301361 -1236941 -1252984 -1125734 -1122124 -1068752 -877503 -1001758 -1150481
21416a150481l9032J12445m3651P7837J22252L1895k62713k00848J30301J923
$$ -1150481 -1189513 -1077068 -1120719 -1042882 -920630 -888735 -1151448 -1352296 -1221995 -1220072
21406a220072M9616R5879J00716J97964M522j489q2225j20959o7864N4697K42182
$$ -1220072 -1170456 -1074577 -973861 -775897 -771375 -772864 -855089 -976048 -1043912 -989215 -747033
21395g47033J14302n1331j12592j5970k6568m5504J04256J40059j7337N1834k9482
$$ -747033 -632731 -684062 -796654 -812624 -839192 -884696 -780440 -640381 -657718 -605884 -635366
21384f35366k4268K9959o8419q0057J41145Q2817L0347Q3896k7953j40929P6086
$$ -635366 -659634 -629675 -698094 -778151 -637006 -554189 -523842 -439946 -467899 -608828 -532742
21373e32742J57436l6812r8467K0559Q1921k8264M097R5687m1630q640k1310r3866
$$ -532742 -375306 -412118 -510585 -490026 -408105 -436369 -432272 -336585 -378215 -386855 -408165 -502031
21361e02031J14091R0185N6418J45891O3618K203O11p3451l1175Q3229L3134j12339
$$ -502031 -387940 -297755 -241337 -95446 -31828 -29625 -29014 -102465 -133640 -50411 -17277 -129616
21349a29616j60017N2408M4724J39258m303p030l1278P7231J18220p761M4885
$$ -129616 -289633 -237225 -192501 -53243 -57546 -64576 -95854 -18623 99597 91836 136721
21338A36721P1162q2255j54809k4325o935N1878l4290M8531R1297J30377j19171
$$ 136721 207883 125628 -29181 -53506 -60441 -8563 -42853 5678 96975 227352 108181
21327A08181k6251K11352J09450J7608k5289j60711l7628N4171J8158r4847k211
$$ 108181 81930 293282 402732 420340 395051 234340 196712 250883 269041 174194 171983
21316A71983j5156Q232N0863J09087R8208j35709p3409q503J12525N3053N0200
$$ 171983 156827 165059 215922 325009 423217 287508 214099 205596 318121 371174 421374
21305D21374q8295o333R0980M612K805J37285N5576j4126j95868j51637q737J05806
$$ 421374 333079 326746 417726 422338 425143 562428 618004 603878 408010 256373 247636 353442
21293C53442K58204N6257r714n1479O2138k3470K5134N7862m7973j795N6831J40935
$$ 353442 611646 667903 658189 606710 668848 645378 670512 728374 680401 678606 735437 876372
21281H76372k8390j24696j1826j6191R6165j6492o4868Q1884N6152j30396M969
$$ 876372 847982 723286 711460 695269 791434 774942 710074 791958 848110 717714 722683
21270G22683J03603L9119Q5293J865k8253n4203l2433N6380J09613N6378J104
$$ 722683 826286 865405 950698 952563 924310 870107 837674 894054 1003667 1060045 1061149
21259A061149Q4617K8049O1219K0498j28926o8150o1677J16256l0761n5672M3141
$$ 1061149 1145766 1173815 1235034 1255532 1126606 1058456 996779 1113035 1082274 1026602 1069743
21248A069743L7847n2585Q8586l7593N1081J42310J16367O6723r6310j56732j4931
$$ 1069743 1107590 1055005 1143591 1105998 1157079 1299389 1415756 1482479 1386169 1229437 1214506
21237A214506J38285K7622J32280r3561j43548l7308n4553k8473J31372j05023
$$ 1214506 1352791 1380413 1512693 1419132 1275584 1238276 1183723 1155250 1286622 1181599
21227A181599p959N3726J19185n697n6278J7987K5118J4020j72359o9837Q6026
$$ 1181599 1173640 1227366 1346551 1340854 1284576 1302563 1327681 1341701 1169342 1099505 1185531
21216A185531l4797m6462R9875P9437M4304Q4648Q7154J19120L7086M1821j660
$$ 1185531 1150734 1104272 1204147 1283584 1327888 1412536 1499690 1618810 1655896 1697717 1696057
21205A696057n7550q8438r8812M0338J06552L2210L0664N0135j03089j48237j23194
$$ 1696057 1638507 1550069 1451257 1491595 1598147 1630357 1661021 1711156 1608067 1459830 1336636
21194A336636m0101j6341k0928J45482R4462j6170j45571Q236P3656N2449J25340
$$ 1336636 1296535 1280194 1259266 1404748 1499210 1483040 1337469 1345705 1419361 1471810 1597150
21183A597150J01683o8953j53620o7607N1946J55036J34572P8037K8922l0205
$$ 1597150 1698833 1629880 1476260 1408653 1460599 1615635 1750207 1828244 1857166 1826961
21173A826961m5143K046p4569M7408J634m3127p9803m0980J25181N4188o5941
$$ 1826961 1781818 1783864 1709295 1756703 1758337 1715210 1635407 1594427 1719608 1773796 1707855
21162A707855O246M2983P6150k7651M252K04453R2755J9685j6032P1499R2877
$$ 1707855 1714101 1757084 1833234 1805583 1809835 2014288 2107043 2126728 2110696 2182195 2275072
21151B275072J38384m5415O5610M7767L3294j0178R860J1760L6578Q5545j0562
$$ 2275072 2413456 2368041 2433651 2481418 2514712 2504534 2514394 2526154 2562732 2648277 2637715
21140B637715m03581l87251l21584j39866l6829k0535j1005K58005K43630J08658
$$ 2637715 2234134 1846883 1525299 1385433 1348604 1328069 1317064 1575069 1818699 1927357
21130A927357J42233K27238N140K1909J14899J33867j0571M121l68423m37215
$$ 1927357 2069590 2296828 2301968 2323877 2438776 2572643 2562072 2566193 2197770 1760555
21120A760555k60899k50810o3965J67087J19558N8953J39815j4666l03J45571
$$ 1760555 1499656 1248846 1184881 1351968 1471526 1530479 1670294 1655628 1655325 1800896
21110A800896N5181m2726R5244J38213O3264q8288k8819K1924o5232j5818J20278
$$ 1800896 1856077 1813351 1908595 2046808 2110072 2021784 1992965 2014889 1949657 1933839 2054117
21099B054117j7851J5803K27752j8536Q7465J02504j80439j19277J85514L2685
$$ 2054117 2036266 2052069 2279821 2261285 2348750 2451254 2270815 2151538 2337052 2369737
21089B369737K6750k9811k0786o9283L0310k3936P9598P2516R8443O0020r5306
$$ 2369737 2396487 2366676 2345890 2276607 2306917 2282981 2362579 2435095 2533538 2593558 2498252
21078B498252j37692p615j00354p4936P2058J72519J30325n0955L648J3604r587
$$ 2498252 2360560 2352945 2252591 2177655 2249713 2422232 2552557 2501602 2505250 2518854 2509267
21067B509267k5719J4955M1052O6577J19722k0506j29031O5204M9107k308q3162
$$ 2509267 2483548 2498503 2539555 2606132 2725854 2705348 2576317 2641521 2690628 2688320 2605158
21056B605158J50910J57212n4152r5326K9144j19389l9089R1604J01991R3651
$$ 2605158 2756068 2913280 2859128 2763802 2792946 2673557 2634468 2726072 2828063 2921714
21046B921714N9343M1915K1306k2344P0176Q3650o6751m9957p661P0439O2778
$$ 2921714 2981057 3022972 3044278 3021934 3092110 3175760 3109009 3059052 3051391 3121830 3184608
21035C184608M8897m270n5055n8773R5002M2991j53799k052R6156O7515k0238
$$ 3184608 3233505 3229235 3174180 3115407 3210409 3253400 3099601 3097549 3193705 3261220 3240982
21024C240982k4019J7650J7917j77029k6893J00672M478P9833O5552O2093M4000
$$ 3240982 3216963 3234613 3252530 3075501 3048608 3149280 3153758 3233591 3299143 3361236 3405236
21013C405236M2642M4728M5221m1333N9538L8577k8338j52912m147L5885M6265
$$ 3405236 3447878 3492606 3537827 3496494 3556032 3594609 3566271 3413359 3409212 3445097 3491362
21002C491362o1322l4578j25175J10665J04095J9423L8867R0525K3530n310m9068
$$ 3491362 3430040 3395462 3270287 3380952 3485047 3504470 3543337 3633862 3657392 3652082 3603014
20991C603014o2579q0574K6254R6909K5447K4765N0179K4708Q4515J8717m9244
$$ 3603014 3540435 3459861 3486115 3583024 3608471 3633236 3683415 3708123 3792638 3811355 3762111
20980C762111M771J29982Q1407p9946J565N3225j02730r6863n3077J37526O4136
$$ 3762111 3766882 3896864 3978271 3898325 3899890 3953115 3850385 3753522 3700445 3837971 3902107
20969C902107P7514L5833P2479N0727q9220j07059n0414L7613M0931m1478N7263
$$ 3902107 3979621 4015454 4087933 4138660 4049440 3942381 3891967 3929580 3970511 3929033 3986296
20958C986296N9391J09830P881m4652j55495P4865J65548P1805J1106K585O6136
$$ 3986296 4045687 4155517 4163398 4118746 3963251 4038116 4203664 4275469 4286575 4289160 4355296
20947D355296j9067j7053q4006J10960Q2454k0637m1487J13586J19217N852K3845
$$ 4355296 4336229 4319176 4235170 4346130 4428584 4407947 4366460 4480046 4599263 4605115 4628960
20936D628960k6937K7835p896o7625K02154P1674M7279J42444Q8169k2581j44697
$$ 4628960 4602023 4629858 4621962 4554337 4756491 4828165 4875444 5017888 5106057 5083476 4938779
20925D938779j85109M943J28528P6427l4857r61J29446J06748K6039o244j6575
$$ 4938779 4753670 4758613 4887141 4963568 4928711 4927750 5057196 5163944 5189983 5183739 5167164
20914E167164O757j8902o0273N0347J77070N4531J7437n0029p2551Q0712N2458
$$ 5167164 5173921 5155019 5094746 5145093 5322163 5376694 5394131 5344102 5271551 5352263 5404721
20903E404721K7418r6899j8514j1670j09629m4983J76562K80421P8400o6178j2370
$$ 5404721 5432139 5335240 5316726 5305056 5195427 5150444 5327006 5607427 5685827 5619649 5607279
20892E607279J47888K6793j28080L118J42474n6097l8259m4566K6452k459K97255
$$ 5607279 5755167 5781960 5653880 5656998 5799472 5743375 5705116 5660550 5687002 5684543 5981798
20881E981798R0943j38045q498k3238J6223N9754R9626J43118m2913j02964n2468
$$ 5981798 6072741 5934696 5926198 5902960 5919183 5978937 6078563 6221681 6178768 6075804 6023336
20870F023336l2438J02902Q6523J38792k2622L7482J67006J74296q307N497l1940
$$ 6023336 5990898 6093800 6180323 6319115 6296493 6333975 6500981 6675277 6666970 6672467 6640527
20859F640527l0470n6819j44924J14386J42022K5243J92351K14295M9884j86567
$$ 6640527 6610057 6553238 6408314 6522700 6664722 6689965 6882316 7096611 7146495 6959928
20849F959928m1076J66572J25851k1210l3696J41234K8338m4501J38963j2923
$$ 6959928 6918852 7085424 7211275 7190065 7156369 7297603 7325941 7281440 7420403 7407480
20839G407480k0200R7156N0638q2892N360K6120j02271J02995R6486K2967J09704
$$ 7407480 7387280 7484436 7535074 7452182 7457542 7483662 7381391 7484386 7580872 7603839 7713543
20828G713543J5384L8163l4815P9256J78137M8605l1909o8409N630j8642N5480
$$ 7713543 7728927 7767090 7732275 7811531 7989668 8038273 8006364 7937955 7943585 7924943 7980423
20817G980423K10949Q6722M1008M6022l3565m9797J17314J95283J89640J00316
$$ 7980423 8191372 8278094 8319102 8365124 8331559 8281762 8399076 8594359 8783999 8884315
20807H884315N3154r4452j05167Q3544J74985J70067n6793L0002J88994J32479
$$ 8884315 8937469 8843017 8737850 8821394 8996379 9166446 9109653 9139655 9328649 9461128
20797I461128k8901P2970J32534J53733N1487k3366J00072R7317J45366J69482
$$ 9461128 9432227 9505197 9637731 9791464 9842951 9819585 9919657 10016974 10162340 10331822
20787A0331822m4133l1979P6927J17508M1007L9226P546m7634l0322J32490Q3293
$$ 10331822 10287689 10255710 10332637 10450145 10491152 10530378 10537924 10490290 10459968 10592458 10675751
20776A0675751Q4404J34492M8161J14281J03316J60369J51039R8118R1903Q5771
$$ 10675751 10760155 10894647 10942808 11057089 11160405 11320774 11471813 11569931 11661834 11747605
20766A1747605l7300P6569K05737J81706K40611J20889m2417R8244K51815J41309
$$ 11747605 11710305 11786874 11992611 12174317 12414928 12535817 12493400 12591644 12843459 12984768
20756A2984768r4443J04109J99142Q9408R1901J21760J57434L0726K50607K02231
$$ 12984768 12890325 12994434 13193576 13282984 13374885 13496645 13654079 13684805 13935412 14137643
20746A4137643N0622M173O4269L21644K25588k818J09158L29734K03165K00718
$$ 14137643 14188265 14192438 14256707 14578351 14803939 14801121 14910279 15240013 15443178 15643896
20736A5643896K75632J63710O2051K01448K12715K68704L44739K75490J36070
$$ 15643896 15919528 16083238 16145289 16346737 16559452 16828156 17172895 17448385 17584455
20727A7584455J46325J56148K21532K47783K11318J36577L18164L06831J84028
$$ 17584455 17730780 17886928 18108460 18356243 18567561 18704138 19022302 19329133 19513161
20718A9513161K48518L69237M47465K96822L01126L63557M05606L98255L41901
$$ 19513161 19761679 20130916 20578381 20875203 21176329 21539886 21945492 22343747 22685648
20709B2685648M24866N01039L40909N05348M05018L94132N53378N25837L68273
$$ 22685648 23110514 23611553 23952462 24457810 24862828 25256960 25810338 26336175 26704448
20700B6704448M74129N09408M46764N91174O01313N50677L78588O49381Q44568
$$ 26704448 27178577 27687985 28134749 28725923 29327236 29877913 30256501 30905882 31750450
20691C1750450R29693P38000P29892P37703R59383R73010Q42074R09409R57095
$$ 31750450 32680143 33418143 34148035 34885738 35845121 36818131 37660205 38569614 39526709
20682C9526709J158785J141668J062045R96397J096014R62924Q27415P03461N02412
$$ 39526709 40685494 41827162 42889207 43885604 44981618 45944542 46771957 47475418 47977830
20673D7977830L05415l96838r70481j445516k289483k920792l475529l996523
$$ 47977830 48283245 47886407 46915926 45470410 43180927 40260135 36784606 32788083
20665C2788083l964012l845210l569397l115300k793495k468665k188201j774816
$$ 32788083 28824071 24978861 21409464 18294164 15500669 13032004 10843803 9068987
20657I068987j720688j754954j744640j290367r13459o59840k18050J65770N49823
$$ 9068987 7348299 5593345 3848705 2558338 1644879 985039 766989 932759 1482582
20648A482582P25725R89931R24547J085596P81281O29947R6353k43271l50042
$$ 1482582 2208307 3198238 4122785 5208381 5989662 6619609 6715962 6472691 6122649
20639F122649q49130j227452j431360j735516k075323k183738k335224k686407
$$ 6122649 5273519 4046067 2614707 879191 -1196132 -3379870 -5715094 -8401501
20631h401501l076918l429224l898745m265711m345933m486942m208334l532842
$$ -8401501 -11478419 -14907643 -18806388 -23072099 -27418032 -31904974 -36113308 -39646150
20623c9646150k938435k247632j422795q28312k63155M48406N46134Q01518R59957
$$ -39646150 -42584585 -44832217 -46255012 -47083324 -47346479 -46898073 -46351939 -45550421 -44590464
20614d4590464R55072Q94146J122621J216627J147274R86522R64239J108925J128193
$$ -44590464 -43635392 -42741246 -41618625 -40401998 -39254724 -38268202 -37303963 -36195038 -35066845
20605c5066845R94277P38865P18014R41190O88266O37725O47403P53734O82231
$$ -35066845 -34072568 -33333703 -32615689 -31674499 -30986233 -30348508 -29701105 -28947371 -28265140
20596b8265140M92727N98579M97651O69920O19011M76681L93200M59302O09883
$$ -28265140 -27772413 -27173834 -26676183 -26006263 -25387252 -24910571 -24517371 -24058069 -23448186
20587b3448186N06888L14505M80616N10016K37311L03598M60063M37532K85071
$$ -23448186 -22941298 -22626793 -22146177 -21636161 -21398850 -21095252 -20635189 -20197657 -19912586
20578a9912586L24324N05027M19995K64050J28093K35915M13923L53913K77848
$$ -19912586 -19588262 -19083235 -18663240 -18399190 -18271097 -18035182 -17621259 -17267346 -16989498
20569a6989498K46920Q276K83046L04602J89906J92795L51237J86951J80913L02106
$$ -16989498 -16742578 -16734302 -16451256 -16146654 -15956748 -15763953 -15412716 -15225765 -15044852 -14742746
20559a4742746J89375J71816M9444J59153K98641M05213J24127l9661R7745L58338
$$ -14742746 -14553371 -14381555 -14332111 -14172958 -13874317 -13469104 -13344977 -13384638 -13286893 -12928555
20549a2928555J35287K07309J65821R0480O1701J09391K05240K51302J59048K17086
$$ -12928555 -12793268 -12585959 -12420138 -12329658 -12267957 -12158566 -11953326 -11702024 -11542976 -11325890
20539a1325890K05332k8914Q6520J62271L34965Q7095j9814J42284j1929R4227
$$ -11325890 -11120558 -11149472 -11062952 -10900681 -10565716 -10478621 -10498435 -10356151 -10368080 -10273853
20529a0273853J95623J52024P2386n6244J8841J00111J83514K4658J43969J55421
$$ -10273853 -10078230 -9926206 -9853820 -9910064 -9891223 -9791112 -9607598 -9582940 -9438971 -9283550
20519i283550O5339P7913J03484R3321L7730L9137J25276Q3008J64677K38641
$$ -9283550 -9218211 -9140298 -9036814 -8943493 -8905763 -8866626 -8741350 -8658342 -8493665 -8255024
20509h255024N8982q7696N6439M4857O4596K8019J80664J259N9018J46509K20823
$$ -8255024 -8196042 -8283738 -8227299 -8182442 -8117846 -8089827 -7909163 -7907904 -7848886 -7702377 -7481554
20498g481554R5135k9149m6709j1538J08499J62729J59172r348M5328K8049j9966
$$ -7481554 -7386419 -7415568 -7462277 -7473815 -7365316 -7202587 -7043415 -7052763 -7007435 -6979386 -6999352
20487f999352M5468J55784K25698J70223k8855K8388J24922O5794j6879J20672
$$ -6999352 -6953884 -6798100 -6572402 -6402179 -6431034 -6402646 -6277724 -6211930 -6228809 -6108137
20477f108137M2867K7881m796Q0034j2716N9267m4530j25036L4690K15100K14327
$$ -6108137 -6065270 -6037389 -6042185 -5962151 -5974867 -5915600 -5960130 -6085166 -6050476 -5835376 -5621049
20466e621049K13619L4069M1672m0666R3192J95560J24608q7954n4491L6515p3774
$$ -5621049 -5407430 -5373361 -5331689 -5372355 -5279163 -5083603 -4958995 -5046949 -5101440 -5064925 -5138699
20455e138699Q3717J65541Q1261J29815q0516k74759j07080J38022M5556p6187
$$ -5138699 -5054982 -4889441 -4808180 -4678365 -4758881 -5033640 -5140720 -5002698 -4957142 -5033329
20445e033329j18325M356N7224J19612O685R8046J69025N9775j58045r0189J16043
$$ -5033329 -5151654 -5147298 -5090074 -4970462 -4963777 -4865731 -4696706 -4636931 -4794976 -4885165 -4769122
20434d769122J57549J17042Q7817l9571o1009Q7379J51551J38678M5071N5947
$$ -4769122 -4611573 -4494531 -4406714 -4446285 -4507294 -4419915 -4268364 -4129686 -4084615 -4028668
20424d028668k1411J3693L9324j0019l177p682P2672n806j79685O2280J80582
$$ -4028668 -4050079 -4036386 -3997062 -4007081 -4010258 -4017940 -3945268 -3951074 -4130759 -4068479 -3887897
20413c887897Q3173j6463L1690n937p678k3432j8137O9852J3980J9782J5060P6887
$$ -3887897 -3804724 -3821187 -3789497 -3795434 -3803112 -3826544 -3844681 -3774829 -3760849 -3741067 -3726007 -3649120
20401c649120J3306o4576j09367Q5890J61742J50471P0530N36R5058R6183p0803
$$ -3649120 -3635814 -3700390 -3809757 -3723867 -3562125 -3411654 -3341124 -3340588 -3245530 -3149347 -3220150
20390c220150q1744m1507N5032J64398J01599l1312P683L4278n6039O0708J99159
$$ -3220150 -3301894 -3343401 -3288369 -3123971 -3022372 -3053684 -3046001 -3011723 -3067762 -3007054 -2807895
20379b807895J53321n9994L1283N4788p1200j91791j88177J28291J94039O2784
$$ -2807895 -2654574 -2714568 -2683285 -2628497 -2699697 -2891488 -3079665 -2951374 -2757335 -2694551
20369b694551Q4925N7016N7357j2379p6276l2124o801n7809J3413J00026J79861
$$ -2694551 -2609626 -2552610 -2495253 -2507632 -2583908 -2616032 -2622833 -2680642 -2667229 -2567203 -2387342
20358b387342l427J46298J3901p0364K07P2828o220J6126q3917O622j07887N34
$$ -2387342 -2390769 -2244471 -2230570 -2300934 -2300727 -2227899 -2234119 -2217993 -2301910 -2295288 -2403175 -2402641
20346b402641J37611J05407R1635J45728J6824p4062O3442J35893J89920P9236
$$ -2402641 -2265030 -2159623 -2067988 -1922260 -1905436 -1979498 -1916056 -1780163 -1590243 -1511007
20336a511007l3375l6305k8723n9744k5004J18589L3970k3386O7489j898L2773
$$ -1511007 -1544382 -1580687 -1609410 -1669154 -1694158 -1575569 -1541599 -1564985 -1497496 -1499394 -1466621
20325a466621J04758l9054j4310r6381p5049m0096J12049N484m5385r4464j0671
$$ -1466621 -1361863 -1400917 -1415227 -1511608 -1586657 -1626753 -1514704 -1509220 -1554605 -1649069 -1659740
20314a659740R5470R8534J38307J01981J3117N081K17280J18584j18977j7641
$$ -1659740 -1564270 -1465736 -1327429 -1225448 -1212331 -1207250 -989970 -871386 -990363 -1008004
20304a008004o6435K1112o073j05735P4140J6810J6222M5262J95695L4939n8631
$$ -1008004 -1074439 -1053327 -1059400 -1165135 -1090995 -1074185 -1057963 -1012701 -817006 -782067 -840698
20293h40698o4980N3244J61743M3716q9728o2188M1847M5455J16513J9425K4493
$$ -840698 -905678 -852434 -690691 -646975 -736703 -798891 -757044 -711589 -595076 -575651 -551158
20282e51158p5785m3472k73K4358J04240J05091K1905N8511K2685O6470K7575
$$ -551158 -626943 -670415 -670688 -646330 -542090 -436999 -415094 -356583 -333898 -267428 -239853
20271b39853j18758q2737J00785L3440p3197K1906J00878J54201o6277q3150m5317
$$ -239853 -358611 -441348 -340563 -307123 -380320 -358414 -257536 -103335 -169612 -252762 -298079
20260b98079l5953K8600J95918J86982P9601r7124j17598L7245L5344J23852J18150
$$ -298079 -334032 -305432 -109514 77468 157069 59945 -57653 -20408 14936 138788 256938
20249B56938J824j20544o8277j01813J45858L6560r0095J32680j23N3038K6239
$$ 256938 258762 138218 69941 -31872 113986 150546 60451 193131 193008 246046 272285
20238B72285k1852L8833O3951j5138j4614p5034L5495J12439J53489n1422j74586
$$ 272285 250433 289266 353217 338079 323465 248431 283926 396365 549854 498432 323846
20227C23846p7857J17794K20263L1989q3815P4339J60907J45310K9289k7573J3352
$$ 323846 245989 363783 584046 616035 532220 606559 767466 912776 942065 914492 927844
20216I27844p058j84372q9871R2355J75341J64566j8521J99929J55288l4336K3116
$$ 927844 920786 736414 646543 738898 914239 1078805 1060284 1260213 1415501 1381165 1404281
20205A404281p7080o4275p9326j15032J05813J01977l972L7701J08191p0410Q609
$$ 1404281 1327201 1262926 1183600 1068568 1174381 1276358 1272386 1310087 1418278 1347868 1356477
20194A356477j0905N6676k2289m6311O4518R5859J23453P926L5366o5382K9536
$$ 1356477 1345572 1402248 1379959 1333648 1398166 1494025 1617478 1625404 1660770 1595388 1624924
20183A624924N8480j6996j08608J11084J17288R9685j4320j3474j11214n767J99159
$$ 1624924 1683404 1666408 1557800 1668884 1786172 1885857 1871537 1858063 1746849 1741082 1940241
20172A940241J4876p0258Q2815Q3236J96591n050m7102N16J0518J4365j47346
$$ 1940241 1955117 1884859 1967674 2050910 2247501 2242451 2195349 2195865 2206383 2220748 2073402
20161B073402J12201J15300n8240m3121p3340L6188K43971N5425j5672j5514k9109
$$ 2073402 2185603 2300903 2242663 2199542 2126202 2162390 2406361 2461786 2446114 2430600 2401491
20150B401491M3596q7905l453P6041J25730R2355M8787R3446l9428n8962J43035
$$ 2401491 2445087 2357182 2353729 2429770 2555500 2647855 2696642 2790088 2750660 2691698 2834733
20139B834733K02163k0745j33784Q2055J13223K674m5970j44699M331K22005J014
$$ 2834733 3036896 3016151 2882367 2964422 3077645 3080319 3034349 2889650 2893981 3115986 3117000
20128C117000L865J2011Q879O4027p083k1558J57992J63717J15749L5411p7647
$$ 3117000 3120865 3132876 3141755 3205782 3198699 3177141 3335133 3498850 3614599 3650010 3572363
20117C572363J5277J8489J72977j0305N9881J7388M8603k0433k1008P6123J40342
$$ 3572363 3587640 3606129 3779106 3768801 3828682 3846070 3894673 3874240 3853232 3929355 4069697
20106D069697J0207p5883j9975L5186N1246Q2263K0263M861R7324L7692K59M3921
$$ 4069697 4079904 4004021 3984046 4019232 4070478 4152741 4173004 4177865 4275189 4312881 4313140 4357061
20094D357061O8985J49825J61227j06095j10628J1278J42772N1174M3519J0279
$$ 4357061 4426046 4575871 4737098 4631003 4520375 4531653 4674425 4725599 4769118 4779397
20084D779397R9256l6226k0124Q2740R9737J21651J66441P4568L6954r4842o471
$$ 4779397 4878653 4842427 4822303 4905043 5004780 5126431 5292872 5367440 5404394 5309552 5303081
20073E303081J29088q4365J01728J74955L3028O1677N2300j26090J348J29609
$$ 5303081 5432169 5347804 5449532 5624487 5657515 5719192 5771492 5645402 5646750 5776359
20063E776359k5932J93649K45388J05152r3470J9653P5672m3005J0390j6508m2748
$$ 5776359 5750427 5944076 6189464 6294616 6201146 6220799 6296471 6253466 6263856 6247348 6204600
20052F204600J41634J59938Q1760K1536p7923R7242J27176O0970K61228P7876
$$ 6204600 6346234 6506172 6587932 6609468 6531545 6628787 6755963 6816933 7078161 7156037
20042G156037j1749J13659K41220K08032R0275R9188J31587L3122N3994J88511
$$ 7156037 7144288 7257947 7499167 7707199 7797474 7896662 8028249 8061371 8115365 8303876
20032H303876J33677P0736j16042O9475J14455q5848p677J54775J58184J58976
$$ 8303876 8437553 8508289 8392247 8461722 8576177 8490329 8482652 8637427 8795611 8954587
20022H954587P2814N0237J2575K09613K46323J46307K33568K00560J66791M3793
$$ 8954587 9027401 9077638 9090213 9299826 9546149 9692456 9926024 10126584 10293375 10337168
20012A0337168P9811P5772Q5421J93683K33156J19092J15568P6566j0865J74421
$$ 10337168 10416979 10492751 10578172 10771855 11005011 11124103 11239671 11316237 11305372 11479793
20002A1479793J44905K99195K78486L23529J53606K05598R0367j9777M7342K06895
$$ 11479793 11624698 11923893 12202379 12525908 12679514 12885112 12975479 12955702 13003044 13209939
19992A3209939K53644K96430J78440L19826L74800L53051K91193J91729J95568
$$ 13209939 13463583 13760013 13938453 14258279 14633079 14986130 15277323 15469052 15664620
19983A5664620K17127K73936K97808K46506R4080K40694M33699M54366M20001
$$ 15664620 15881747 16155683 16453491 16699997 16794077 17034771 17468470 17922836 18342837
19974A8342837L99048L10761M00515L10032L66719L24838N16449N27486N05174
$$ 18342837 18741885 19052646 19453161 19763193 20129912 20454750 20971199 21498685 22003859
19965B2003859N35720O32122N88443N67985N36157O22314O97786O50120P89222
$$ 22003859 22539579 23171701 23760144 24328129 24864286 25486600 26184386 26834506 27623728
19956B7623728P50589P81466Q70938R54892R22196R90692J284730J244617J263193
$$ 27623728 28374317 29155783 30026721 30981613 31903809 32894501 34179231 35423848 36687041
19947C6687041J373012J501423J477689J516604J799960K000556K271856K396337
$$ 36687041 38060053 39561476 41039165 42555769 44355729 46356285 48628141 51024478
19939E1024478K626427K962820L458292L831717M348651M913217N165615N394437
$$ 51024478 53650905 56613725 60072017 63903734 68252385 73165602 78331217 83725654
19931H3725654M985187L786565R48245n475332j5290257k4542566k6195620j9506662
$$ 83725654 88710841 92497406 93445651 87970319 72680062 48137496 21941876 2435214
19923B435214j0899764l693503J591918M297340M632206K672743j473196o774390
$$ 2435214 -8464550 -12158053 -10566135 -6268795 -1636589 1036154 -437042 -7211432
19915g211432r899065q552762m961601j279623J980872M057872N087927N591666
$$ -7211432 -17110497 -25663259 -30624860 -31904483 -29923611 -25865739 -20777812 -15186146
19907a5186146N714839N702208N640874N263714N069445M511720L611714J583235
$$ -15186146 -9471307 -3769099 1871775 7135489 12204934 16716654 20328368 21911603
19899B1911603k156601o834249r237338p416750l912606k61041K499672M055204
$$ 21911603 19755002 12920753 3683415 -3733335 -7645941 -7906982 -5407310 -1352106
19891a352106L855103J430009m254283j3545929k2248830k3526931j7773398j0187539
$$ -1352106 2502997 3933006 -321277 -13867206 -36116036 -59642967 -77416365 -87603904
19883h7603904l354368J377203M042753M935148M927426M600211M116503L604307
$$ -87603904 -90958272 -89581069 -85538316 -80603168 -75675742 -71075531 -66959028 -63354721
19875f3354721L287794K894860K619778K393089K277792J990425J743663J566568
$$ -63354721 -60066927 -57172067 -54552289 -52159200 -49881408 -47890983 -46147320 -44580752
19867d4580752J539506J400556J460653J250664J180531J127062R94766Q64856
$$ -44580752 -43041246 -41640690 -40180037 -38929373 -37748842 -36621780 -35627014 -34762158
19859c4762158P34736P18456Q18130P89134O69258R02517O47333O32977M86962
$$ -34762158 -34027422 -33308966 -32490836 -31701702 -31032444 -30129927 -29482594 -28849617 -28362655
19850b8362655M87599N73530M22748N07175N39586M53174N27679N79720M70290
$$ -28362655 -27875056 -27301526 -26878778 -26371603 -25832017 -25378843 -24851164 -24271444 -23801154
19841b3801154K89228L33990M24510L57955K72458K31368M38546M41847L15859
$$ -23801154 -23511926 -23177936 -22753426 -22395471 -22123013 -21891645 -21453099 -21011252 -20695393
19832b0695393K65355K49107L47937K39560L05431J57519J85642J88018J49806
$$ -20695393 -20430038 -20180931 -19832994 -19593434 -19288003 -19130484 -18944842 -18756824 -18607018
19823a8607018K05271K08929K29771O0955K56049K70818L14644J81677O7808J47064
$$ -18607018 -18401747 -18192818 -17963047 -17902092 -17646043 -17375225 -17060581 -16878904 -16811096 -16664032
19813a6664032K02765K54837K18938J45188J26249L4914L8642k803K34097K79627
$$ -16664032 -16461267 -16206430 -15987492 -15842304 -15716055 -15681141 -15642499 -15645302 -15411205 -15131578
19803a5131578K89980R3642J30385K54850J17260O1598J44087L4037R2170J02100
$$ -15131578 -14841598 -14747956 -14617571 -14362721 -14245461 -14183863 -14039776 -14005739 -13913569 -13811469
19793a3811469J40219J04600J69992J57166R4280J18874l6758J8263J93431J82756
$$ -13811469 -13671250 -13566650 -13396658 -13239492 -13145212 -13026338 -13063096 -13044833 -12851402 -12668646
19783a2668646J53560O3235L8767N9833K7458P5117J44903K48645J12574q699
$$ -12668646 -12515086 -12451851 -12413084 -12353251 -12325793 -12250676 -12105773 -11857128 -11744554 -11753253
19773a1753253K6698J2531p0633J06027M6053J11517J04156j0809N9647j7536
$$ -11753253 -11726555 -11714024 -11784657 -11678630 -11632577 -11521060 -11416904 -11427713 -11368066 -11385602
19763a1385602K4669J01296J40020J36191J43878j697R1667J25352M3082J52129
$$ -11385602 -11360933 -11259637 -11119617 -10983426 -10839548 -10841245 -10749578 -10624226 -10581144 -10429015
19753a0429015J33889L3900Q2988Q6014q1464o9584n05J63490J49407O5164m9227
$$ -10429015 -10295126 -10261226 -10178238 -10092224 -10173688 -10243272 -10243777 -10080287 -9930880 -9865716 -9914943
19742i914943P3854R2976R8171J29606n712M8005Q3776N6927M056L8164q6444
$$ -9914943 -9841089 -9748113 -9649942 -9520336 -9526048 -9478043 -9394267 -9337340 -9333284 -9295120 -9381564
19731i381564J7028R3485J7648M5702O7128R9136M2346J06272m2566J3348O9048
$$ -9381564 -9364536 -9271051 -9253403 -9207701 -9140573 -9041437 -8999091 -8892819 -8935385 -8922037 -8852989
19720h852989Q0933Q1652R015o1977J0620J9812J72018J49210L560k0207r8548
$$ -8852989 -8772056 -8690404 -8681389 -8743366 -8732746 -8712934 -8540916 -8391706 -8388146 -8408353 -8506901
19709h506901O0634J10966l1953r761M5262P2211O7509J01271O8986L6690N0105
$$ -8506901 -8446267 -8335301 -8367254 -8377015 -8331753 -8259542 -8192033 -8090762 -8021776 -7985086 -7934981
19698g934981J16898M0685o1108J02900Q7296n5464m1683Q2546K4197J00625k5094
$$ -7934981 -7818083 -7777398 -7838506 -7735606 -7648310 -7703774 -7745457 -7662911 -7638714 -7538089 -7563183
19687g563183k6250L479J1228M2537o3516k8593J9376J535n1176o9124J43723
$$ -7563183 -7589433 -7585954 -7574726 -7532189 -7595705 -7624298 -7604922 -7603387 -7654563 -7723687 -7579964
19676g579964O7635o681J26888J5777J49674K62228R4605j85305k85140J15636
$$ -7579964 -7512329 -7519010 -7392122 -7376345 -7226671 -6964443 -6869838 -7055143 -7340283 -7224647
19666g224647K64012R3452L9486p8129m758l2862L0839R4816o0552j04032Q6472
$$ -7224647 -6960635 -6867183 -6827697 -6905826 -6910584 -6943446 -6912607 -6817791 -6878343 -6982375 -6895903
19655f895903N9122J26084N6529Q7680L3285O2887P0651J9360p9772j13321P3510
$$ -6895903 -6836781 -6710697 -6654168 -6566488 -6533203 -6470316 -6399665 -6380305 -6460077 -6573398 -6499888
19644f499888J34341Q8468O3601j03009j34863l9993M5623J27550K8000q7281
$$ -6499888 -6365547 -6277079 -6213478 -6316487 -6451350 -6491343 -6445720 -6318170 -6290170 -6377451
19634f377451Q9360N3552l3090Q5194J629l1952J4354J19354n090K2441R2382
$$ -6377451 -6288091 -6234539 -6267629 -6182435 -6180806 -6212758 -6198404 -6079050 -6084140 -6061699 -5969317
19623e969317M2336k6339p4546l7425J31898J8508J1151l403m1648L9010n9177
$$ -5969317 -5926981 -5953320 -6027866 -6065291 -5933393 -5914885 -5903734 -5907137 -5948785 -5909775 -5968952
19612e968952M5689K914K6710J33642r9339j4632K0412K5681N8439M0040K0468
$$ -5968952 -5923263 -5920349 -5893639 -5759997 -5859336 -5873968 -5853556 -5827875 -5769436 -5729396 -5708928
19601e708928k2428m9339j2496M4373k2313M5559N0118J55655J68167o768j87192
$$ -5708928 -5731356 -5780695 -5793191 -5748818 -5771131 -5725572 -5675454 -5519799 -5351632 -5358400 -5545592
19590e545592j27884J3553l2429r9003k2736J53880J49502M5092J2153P790o4539
$$ -5545592 -5673476 -5659923 -5692352 -5791355 -5814091 -5660211 -5510709 -5465617 -5453464 -5445674 -5510213
19579e510213j36646N9906J82045J21338k1423r5507l740L8026O9831o60r4755
$$ -5510213 -5646859 -5586953 -5404908 -5283570 -5304993 -5400500 -5404240 -5366214 -5296383 -5297043 -5391798
19568e391798l1749Q1477J9490Q778J04363J32920L7754j040K0164J66160m8580
$$ -5391798 -5423547 -5342070 -5322580 -5313802 -5209439 -5076519 -5038765 -5039805 -5019641 -4853481 -4902061
19557d902061j7776J3411j01763j18718J9269M6369L5493M3894K3958P3872K1204
$$ -4902061 -4919837 -4906426 -5008189 -5126907 -5107638 -5061269 -5025776 -4981882 -4957924 -4884052 -4862848
19546d862848j9756M5445N2547j5527N8068K6198j27592m463Q6949J41608r220
$$ -4862848 -4882604 -4837159 -4784612 -4800139 -4742071 -4715873 -4843465 -4847928 -4760979 -4619371 -4628591
19535d628591l6105n1349n3742l9992L1903j20061o1474M1135J41288l4490q0327
$$ -4628591 -4664696 -4716045 -4769787 -4809779 -4777876 -4897937 -4959411 -4918276 -4776988 -4811478 -4891805
19524d891805N1283K10443O3916J11124P7081j01219j7916J37823O428j64725
$$ -4891805 -4840522 -4630079 -4566163 -4455039 -4377958 -4479177 -4497093 -4359270 -4352842 -4517567
19514d517567m4101R079M1926J73523k9156j0832L4576O085j66624r3419p494
$$ -4517567 -4561668 -4552589 -4510663 -4337140 -4366296 -4377128 -4342552 -4336467 -4503091 -4596510 -4604004
19503d604004J01985J78911N6528k2834K7099j15046j46274o535M7037q849P2656
$$ -4604004 -4502019 -4323108 -4266580 -4289414 -4262315 -4377361 -4523635 -4530170 -4483133 -4491982 -4419326
19492d419326r8205k4602J09302O0863k7070n3736q0738J29476N8330m6074N9060
$$ -4419326 -4517531 -4542133 -4432831 -4371968 -4399038 -4452774 -4533512 -4404036 -4345706 -4391780 -4332720
19481d332720j6796j3661J7007K0828J55792Q1180n2481K902n1979m0399M9783
$$ -4332720 -4349516 -4363177 -4346170 -4325342 -4169550 -4088370 -4140851 -4137949 -4189928 -4230327 -4180544
19470d180544O0507l762J42838N2290K2631j00158l2182N2650p4015P5075O9377
$$ -4180544 -4120037 -4123799 -3980961 -3928671 -3906040 -4006198 -4038380 -3985730 -4059745 -3984670 -3915293
19459c915293J6617n5700j26159N8902J61309J20270O139j07901m5428p915j3286
$$ -3915293 -3898676 -3954376 -4080535 -4021633 -3860324 -3740054 -3733915 -3841816 -3887244 -3895159 -3908445
19448c908445m7487p789K544J46365J07337L0460o110N0784J35964p1950j19278
$$ -3908445 -3955932 -3963721 -3961177 -3814812 -3707475 -3677015 -3683125 -3632341 -3496377 -3568327 -3687605
19437c687605r4260k4843n2058j18227J7892N973K4235j9118N6907J3529R4435
$$ -3687605 -3781865 -3806708 -3858766 -3976993 -3959101 -3953128 -3928893 -3948011 -3891104 -3877575 -3783140
19426c783140K4801q8763r3663J6276O0063m671J13131M6922j5619M0552J44839
$$ -3783140 -3758339 -3847102 -3940765 -3924489 -3864426 -3869097 -3755966 -3709044 -3724663 -3684111 -3539272
19415c539272J23280j19782j60300N6179N2713J85246L2686j07691n3802l8703
$$ -3539272 -3415992 -3535774 -3696074 -3639895 -3587182 -3401936 -3369250 -3476941 -3530743 -3569446
19405c569446J45194J29283J12328L0929l3608q8606p9439J7337k4186p7672j34576
$$ -3569446 -3424252 -3294969 -3182641 -3151712 -3185320 -3273926 -3353365 -3336028 -3360214 -3437886 -3572462
19394c572462J815P1532l8743N1448K0462o6936r2214o5591L990J54415J02555
$$ -3572462 -3570647 -3499115 -3537858 -3486410 -3465948 -3532884 -3625098 -3690689 -3686699 -3532284 -3429729
19383c429729j00492l4381Q4446M8901n0106k7443j2435n6558J5121N9970R4027
$$ -3429729 -3530221 -3564602 -3480156 -3431255 -3481361 -3508804 -3521239 -3577797 -3562676 -3502706 -3408679
19372c408679j3862P3265N6495K9977q4536r1287j3780k22J58063J41910K5843
$$ -3408679 -3422541 -3349276 -3292781 -3262804 -3347340 -3438627 -3452407 -3452629 -3294566 -3152656 -3126813
19361c126813r2682j56175q4744J14458L8788k2358j12479m9448j47607j32576
$$ -3126813 -3219495 -3375670 -3460414 -3345956 -3307168 -3329526 -3442005 -3491453 -3639060 -3771636
19351c771636j17895j19575N0128J9431l6008J18041M4677O9327J94169j0244
$$ -3771636 -3889531 -4009106 -3958978 -3939547 -3975555 -3857514 -3812837 -3743510 -3549341 -3559585
19341c559585p4191n1219Q1109j322O6082q5919n1602J89301J38864l8278j9402
$$ -3559585 -3633776 -3684995 -3603886 -3605208 -3539126 -3625045 -3676647 -3487346 -3348482 -3386760 -3406162
19330c406162n9859K0685M9254N8817K4209J13998L5541O3549N6894k27633j89022
$$ -3406162 -3466021 -3445336 -3396082 -3337265 -3313056 -3199058 -3163517 -3099968 -3043074 -3270707 -3459729
19319c459729j34431k0069L3761r087J5546R9686J28322o9932L4891j6916k2885
$$ -3459729 -3594160 -3614229 -3580468 -3589555 -3574009 -3474323 -3346001 -3415933 -3381042 -3397958 -3420843
19308c420843J76810J26935R8332q2745m5589N7227o3005q9002N5890J5949r7836
$$ -3420843 -3244033 -3117098 -3018766 -3101511 -3147100 -3089873 -3152878 -3241880 -3185990 -3170041 -3267877
19297c267877k12083J0836J62136K26986P6114L3601r4424k18371k5844R4767
$$ -3267877 -3479960 -3469124 -3306988 -3080002 -3003888 -2970287 -3064711 -3283082 -3308926 -3214159
19287c214159R897N3492p743l2290J01991m8555N873J9776J9512R7963m5133l1671
$$ -3214159 -3204262 -3150770 -3158513 -3190803 -3088812 -3137367 -3131494 -3111718 -3092206 -2994243 -3039376 -3071047
19275c071047j9676J0060R2671r632j11388M7176J0630j08697R044R0781M7849
$$ -3071047 -3090723 -3080663 -2987992 -2997624 -3109012 -3061836 -3051206 -3159903 -3150859 -3060078 -3012229
19264c012229J43998O9130J24481p8691q6612J4731M8784k208o8513P76J03l6815
$$ -3012229 -2868231 -2799101 -2674620 -2753311 -2839923 -2825192 -2776408 -2778616 -2847129 -2846353 -2846250 -2883065
19252b883065K0432P3724j16437k2335R5583O6955k8536J3878q2802j79679j8967
$$ -2883065 -2862633 -2788909 -2905346 -2927681 -2832098 -2765143 -2793679 -2779801 -2862603 -3042282 -3061249
19241c061249P8896J79942J83455J53556j02210q2771l0979j64229r2516M1516
$$ -3061249 -2982353 -2802411 -2618956 -2465400 -2567610 -2650381 -2681360 -2845589 -2938105 -2896589
19231b896589K815j3662m9890q7787Q8784J80716J04101k7990p5113l5993L82
$$ -2896589 -2893774 -2907436 -2957326 -3045113 -2956329 -2775613 -2671512 -2699502 -2774615 -2810608 -2810226
19220b810226j2329n151Q0616J0257Q8791J2065j23406P0397J01443O5728q9957
$$ -2810226 -2822555 -2827706 -2747090 -2736833 -2648042 -2635977 -2759383 -2688986 -2587543 -2521815 -2611772
19209b611772r4659j34536P2819J40875L4573r504J05162R1n7899j36874L033
$$ -2611772 -2706431 -2840967 -2768148 -2627273 -2592700 -2602204 -2497042 -2496951 -2554850 -2691724 -2688691
19198b688691Q6256j3363J7432K9201j0057j87325p9179P9603J65568P2770P7952
$$ -2688691 -2602435 -2615798 -2598366 -2569165 -2579222 -2766547 -2845726 -2766123 -2600555 -2527785 -2449833
19187b449833N3058p7402j10549m6499j413k9958R7994N6141n636q5915m1650
$$ -2449833 -2396775 -2474177 -2584726 -2631225 -2632638 -2662596 -2564602 -2508461 -2514097 -2600012 -2641662
19176b641662n0711K5375k5072l2424J82368K6755j0290m8579j03400R497K384
$$ -2641662 -2692373 -2666998 -2692070 -2724494 -2542126 -2515371 -2525661 -2574240 -2677640 -2668143 -2665759
19165b665759J94569L4733R4026M5012j11957R5358m6586j09472P7419J08296
$$ -2665759 -2471190 -2436457 -2342431 -2297419 -2409376 -2314018 -2360604 -2470076 -2392657 -2284361
19155b284361L1821n6549l8000m5939n7306j7691r2866L6822Q690J685Q1515Q692
$$ -2284361 -2252540 -2309089 -2347089 -2393028 -2450334 -2468025 -2560891 -2524069 -2515379 -2513694 -2432179 -2423487
19143b423487J78881P6387L4651k58589l2501R6311r3053r5903R392K2114Q1451
$$ -2423487 -2244606 -2168219 -2133568 -2392157 -2424658 -2328347 -2421400 -2517303 -2507911 -2485797 -2404346
19132b404346J03775j13487K0789J07914l1540P3352j19931j6037J47091J61021
$$ -2404346 -2300571 -2414058 -2393269 -2285355 -2316895 -2243543 -2363474 -2379511 -2232420 -2071399
19122b071399o4880j19181j60048K3133J34303l9304j20179j41693L7822l9833
$$ -2071399 -2136279 -2255460 -2415508 -2392375 -2258072 -2297376 -2417555 -2559248 -2521426 -2561259
19112b561259j9016J03674O4005m0911O586K0629J16505j19626o599J51557J19089
$$ -2561259 -2580275 -2476601 -2412596 -2453507 -2446921 -2426292 -2309787 -2429413 -2436012 -2284455 -2165366
19101b165366j76917j57964j2617J23348J04814o7943n7172J31342j0657l9126
$$ -2165366 -2342283 -2500247 -2512864 -2389516 -2284702 -2352645 -2409817 -2278475 -2289132 -2328258
19091b328258N4371p8711k0663Q5663J00496j8735n7748o1325K806O3073n28m920
$$ -2328258 -2273887 -2352598 -2373261 -2287598 -2187102 -2205837 -2263585 -2324910 -2322104 -2259031 -2259559 -2264479
19079b264479J0194o3230j23326K151P9367O4639q3375n3981P2442P501J30264
$$ -2264479 -2254285 -2317515 -2440841 -2438690 -2359323 -2294684 -2378059 -2432040 -2359598 -2352097 -2221833
19068b221833P5297m2842N7697j32233j17972m803k1945P2645K6970O5646m1743
$$ -2221833 -2146536 -2189378 -2131681 -2263914 -2381886 -2386689 -2408634 -2335989 -2309019 -2243373 -2285116
19057b285116O7057P2502N8969n6682n0965j05229M2651J94243J35632m7742K7748
$$ -2285116 -2218059 -2145557 -2086588 -2143270 -2194235 -2299464 -2256813 -2062570 -1926938 -1974680 -1946932
19046a946932n0529p3203k19265q586k917M5464M9812P0558J6545J09413J5092
$$ -1946932 -1997461 -2070664 -2289929 -2298515 -2301432 -2255968 -2206156 -2135598 -2119053 -2009640 -1994548
19035a994548m3210j26669N4916n259J8548o3131L8520K59212l57m0555l6458
$$ -1994548 -2037758 -2164427 -2109511 -2114770 -2096222 -2159353 -2120833 -1861621 -1861978 -1902533 -1938991
19024a938991n2057p4199K5576J15947M3003J3013j28721o8011j29045l9302P8620
$$ -1938991 -1991048 -2065247 -2039671 -1923724 -1880721 -1867708 -1996429 -2064440 -2193485 -2232787 -2154167
19013b154167J5855k5575N1439K5229L8955L9859l6146j12902k5066Q1753p3061
$$ -2154167 -2138312 -2163887 -2112448 -2087219 -2048264 -2008405 -2044551 -2157453 -2182519 -2100766 -2173827
19002b173827K821J13199o0370O5396N2862n8862R4768J33977n0129m584n227
$$ -2173827 -2171006 -2057807 -2118177 -2052781 -1999919 -2058781 -1964013 -1830036 -1880165 -1884749 -1889976
18991a889976n4232o0503l7476K5544Q5621L2986p4027P3381J14132J78947K5692
$$ -1889976 -1944208 -2004711 -2042187 -2016643 -1931022 -1898036 -1972063 -1898682 -1784550 -1605603 -1579911
18980a579911k39523k06563K8171L9709j20136r998J48709O2364M2113L5089J0561
$$ -1579911 -1819434 -2025997 -1997826 -1958117 -2078253 -2088251 -1939542 -1877178 -1835065 -1799976 -1789415
18969a789415j15216m9522J29336n4348k3304J52616J00788j2846m9184q4709
$$ -1789415 -1904631 -1954153 -1824817 -1879165 -1902469 -1749853 -1649065 -1661911 -1711095 -1795804
18959a795804N2364n3245j10112o4942j50926m3865J23949R9026M8741m3204J5231
$$ -1795804 -1743440 -1796685 -1906797 -1971739 -2122665 -2166530 -2042581 -1943555 -1894814 -1938018 -1922787
18948a922787j6834n6307J30713Q2651N5821K0166J05465R260q6916j16460Q331
$$ -1922787 -1939621 -1995928 -1865215 -1782564 -1726743 -1706577 -1601112 -1591852 -1678768 -1795228 -1786897
18937a786897j03126m9059L3487J33366L4605j04364q7776m4346J78412N7962
$$ -1786897 -1890023 -1939082 -1905595 -1772229 -1737624 -1841988 -1929764 -1974110 -1795698 -1737736
18927a737736P5677n2966l8781N9026L8966m8844K148o2811J27917N3916R4115
$$ -1737736 -1662059 -1715025 -1753806 -1694780 -1655814 -1704658 -1702510 -1765321 -1637404 -1583488 -1489373
18916a489373N323j92237j52428l3152K13401o791o6058l9510n1473N6121j6518
$$ -1489373 -1484050 -1676287 -1828715 -1861867 -1648466 -1655257 -1721315 -1760825 -1812298 -1756177 -1772695
18905a772695K5175M1019l2821M0090P6164R7974J7739j16568q4963k067K958
$$ -1772695 -1747520 -1706501 -1739322 -1699232 -1623068 -1525094 -1507355 -1623923 -1708886 -1710953 -1707995
18894a707995j9851K703J1379O1547L3257K7759j05194q9544R8691O3326R8886
$$ -1707995 -1727846 -1725143 -1713764 -1652217 -1618960 -1591201 -1696395 -1785939 -1687248 -1623922 -1525036
18883a525036l0077m8549j51412j62579M7605J43777m6287J56931R9192k9011
$$ -1525036 -1555113 -1603662 -1755074 -1917653 -1870048 -1726271 -1772558 -1615627 -1516435 -1545446
18873a545446j6519j6310q4385L0885J7837J45111P3793j9644Q8950m2454o9961
$$ -1545446 -1561965 -1578275 -1662660 -1631775 -1613938 -1468827 -1395034 -1414678 -1325728 -1368182 -1438143
18862a438143q5865Q717m7357J16964M9706o8417j1718L6365M5689J1667j33767
$$ -1438143 -1524008 -1515291 -1562648 -1445684 -1395978 -1464395 -1476113 -1439748 -1394059 -1382392 -1516159
18851a516159l3234P8382n053J31599P1928l3298k2906j64959m6852n9952j67482
$$ -1516159 -1549393 -1471011 -1476064 -1344465 -1272537 -1305835 -1328741 -1493700 -1540552 -1600504 -1767986
18840a767986J00859N1607l2960J84862N1445K3848Q257k08039o2183L1981R4013
$$ -1767986 -1667127 -1615520 -1648480 -1463618 -1412173 -1388325 -1380068 -1588107 -1650290 -1618309 -1524296
18829a524296J29829m0379j77249j52449J09350N0586M8786J08991J3834o6292
$$ -1524296 -1394467 -1434846 -1612095 -1764544 -1655194 -1604608 -1555822 -1446831 -1432997 -1499289
18819a499289L1684R8589N8067M3589k5937j51606k1756J35313N8752L0086m7282
$$ -1499289 -1467605 -1369016 -1310949 -1267360 -1293297 -1444903 -1466659 -1331346 -1272594 -1242508 -1289790
18808a289790L6801K2339j07062k9177j6987o1876n3273M9881K25723K23223R3595
$$ -1289790 -1252989 -1230650 -1337712 -1366889 -1383876 -1445752 -1499025 -1449144 -1223421 -1000198 -906603
18797i06603N816q1949k2610q6106j39200l1539m0093m2227P360m0121o43N3428
$$ -906603 -900787 -982736 -1005346 -1091452 -1230652 -1262191 -1302284 -1344511 -1337151 -1377272 -1377915 -1324487
18785a324487l3843j3316R684m1875K63193J40271k30959j33989P1300K4762L3087
$$ -1324487 -1358330 -1371646 -1361962 -1403837 -1140644 -1000373 -1231332 -1365321 -1294021 -1269259 -1236172
18774a236172J34963R5025J62764J20575N5584m906k31487m98724l36713j91338
$$ -1236172 -1101209 -1006184 -843420 -722845 -667261 -672167 -903654 -1402378 -1739091 -1930429
18764a930429o0191R4513J45850o8581l8481Q4017L2267J48077k3063l735J19378
$$ -1930429 -1990620 -1896107 -1750257 -1818838 -1857319 -1773302 -1741035 -1592958 -1616021 -1619756 -1500378
18753a500378K0475p1497N1745Q6343P0480N8502r3851O681j00850j23088R1555
$$ -1500378 -1479903 -1551400 -1499655 -1413312 -1342832 -1284330 -1378181 -1371500 -1472350 -1595438 -1503883
18742a503883J05109P5795j9508q7490k2379O2568J65322R1994o0262j20091n1658
$$ -1503883 -1398774 -1322979 -1342487 -1429977 -1452356 -1389788 -1224466 -1132472 -1192734 -1312825 -1364483
18731a364483l6804l2651L682K8594J4833J84336L0538q1610O3417J03628J07995
$$ -1364483 -1401287 -1433938 -1430256 -1401662 -1386829 -1202493 -1171955 -1253565 -1190148 -1086520 -978525
18720i78525Q1892q3274r7301J13305m5396j75073l2438J63800M9945r0419j32220
$$ -978525 -896633 -979907 -1077208 -963903 -1009299 -1184372 -1216810 -1053010 -1003065 -1093484 -1225704
18709a225704M9020j7583m4912n4474n4648J56422J30940M3325J3360r1257n9211
$$ -1225704 -1176684 -1194267 -1239179 -1293653 -1348301 -1191879 -1060939 -1017614 -1004254 -1095511 -1154722
18698a154722j33113j72124j279j4173P9296Q6617O0227R6613J36246Q6545n3412
$$ -1154722 -1287835 -1459959 -1461238 -1475411 -1396115 -1309498 -1249271 -1152658 -1016412 -929867 -983279
18687i83279j33667j05433q1368J31111J44030Q1461r631k0688j17829o6116N8014
$$ -983279 -1116946 -1222379 -1303747 -1172636 -1028606 -947145 -956776 -977464 -1095293 -1161409 -1103395
18676a103395k8036N8324O4518K4486P3819n7785j30163j014l9457K8403n6312
$$ -1103395 -1131431 -1073107 -1008589 -984103 -910284 -968069 -1098232 -1099246 -1138703 -1110300 -1166612
18665a166612J41254O4484P5893O1539J8202j15962r4426l4110J20617J13631
$$ -1166612 -1025358 -960874 -884981 -823442 -805240 -921202 -1015628 -1049738 -929121 -815490
18655h15490j65482j08993Q878p9379O2338L3905p7275J16197K06808M5414o4156
$$ -815490 -980972 -1089965 -1081087 -1160466 -1098128 -1064223 -1141498 -1025301 -818493 -773079 -837235
18644h37235m6064K2127K174r6055k4915O7824j0153n4768O4527J0224m4535J62606
$$ -837235 -883299 -861172 -858998 -955053 -979968 -912144 -922297 -977065 -912538 -902314 -946849 -784243
18632g84243J3057m1485K9291K8728l5716l7182O4357J02851j19470j84847l4170
$$ -784243 -771186 -812671 -783380 -754652 -790368 -827550 -763193 -660342 -779812 -964659 -998829
18621i98829J14261Q4105J36939J2115j335p9651r977j60352q7564O7018J54021
$$ -998829 -884568 -800463 -663524 -651409 -652744 -732395 -742372 -902724 -990288 -923270 -769249
18610g69249j26016j3969p1970O6887J20232J36346J51919O3432l9253o1181o0463
$$ -769249 -895265 -909234 -981204 -914317 -794085 -657739 -505820 -442388 -481641 -542822 -603285
18599f03285P2369q9184K2780Q4969m6264j38761j4889Q923j68923r2136J20707
$$ -603285 -530916 -620100 -597320 -512351 -558615 -697376 -712265 -703342 -872265 -964401 -843694
18588h43694O6149Q3232M8833r3595n3288M1805N2064P7608P0552M297j3400K4178
$$ -843694 -777545 -694313 -645480 -739075 -792363 -750558 -698494 -620886 -550334 -546037 -559437 -535259
18576e35259n9029k3447K21768O2177o4295p5541n2760r4185n3740J31444l5647
$$ -535259 -594288 -617735 -395967 -333790 -398085 -473626 -526386 -620571 -674311 -542867 -578514
18565e78514j51021j8001L0097p0141p6001k4738m1105J42285R7555K63711J30228
$$ -578514 -729535 -747536 -717439 -787580 -863581 -888319 -929424 -787139 -689584 -425873 -295645
18554b95645j74559j70736M4982J14907J50152l9270j65296k4770P8556J586n5936
$$ -295645 -470204 -640940 -595958 -481051 -330899 -370169 -535465 -560235 -481679 -480093 -536029
18543e36029K4648J685j16163L9629N2485P8834l1855j1861O7382J02257J3257
$$ -536029 -511381 -509696 -625859 -586230 -533745 -454911 -486766 -498627 -431245 -328988 -315731
18532c15731j53519n5476j25926M1142N767K488n4734n3658J9656J54206J12638
$$ -315731 -469250 -524726 -650652 -609510 -603743 -601255 -655989 -709647 -689991 -535785 -423147
18521d23147P3273n8789M5321R668j3744j23707k9049K4590k1322L0043M1134
$$ -423147 -349874 -408663 -363342 -353674 -367418 -491125 -520174 -495584 -516906 -486863 -445729
18510d45729m8205q4144j09490J09387R3320o6289p3285R6892Q9231J41975O2859
$$ -445729 -493934 -578078 -687568 -578181 -484861 -551150 -624435 -527543 -438312 -296337 -233478
18499b33478j73682j34033J34463Q9644l3002q4044j48383M721J69166Q7824l2998
$$ -233478 -407160 -541193 -406730 -317086 -350088 -434132 -582515 -577794 -408628 -320804 -353802
18488c53802L2855J51829K5509m9455j19643J8532Q2033L6331k898K4783m5494
$$ -353802 -320947 -169118 -143609 -193064 -312707 -294175 -212142 -175811 -178709 -153926 -199420
18477a99420p4501K7327K8855P280j2813n3335N9904K25873J05404j31165r9668
$$ -199420 -273921 -246594 -217739 -210459 -223272 -276607 -216703 9170 114574 -16591 -116259
18466a16259R2528P566q136n8782k45L6629k37021j97018P9022l352n6056L1812
$$ -116259 -23731 -16165 -24301 -83083 -83328 -46699 -283720 -480738 -401716 -405068 -461124 -429312
18454d29312O2274j37253M3138K66393O2606L4507j56947q0913O4151J54415J38368
$$ -429312 -367038 -504291 -461153 -194760 -132154 -97647 -254594 -335507 -271356 -116941 21427
18443B1427j05618o5985J67211J00794K3767p2865N7099j9686r152J32673n2489
$$ 21427 -84191 -150176 17035 117829 141596 68731 125830 106144 96992 229665 177176
18432A77176J8458o6177j05328o6500N041J05861O9050Q2808j15173l105J2321
$$ 177176 195634 129457 24129 -42371 -37330 68531 137581 220389 105216 102111 114432
18421A14432Q607L0610R600M9934j02248j03990k1969m9779o8838Q930J02228
$$ 114432 123039 153649 163249 213183 110935 6945 -15024 -64803 -133641 -124711 -22483
18410b2483M0844Q9435J20702J3023r4955O0836Q6842L216L6101L2266m7046j07513
$$ -22483 18361 107796 228498 241521 146566 207402 294244 297460 333561 365827 318781 211268
18398B11268p1312j24073M5961o4130K6813L1842j261J04101r5835k5820J65817
$$ 211268 139956 15883 61844 -2286 24527 56369 55108 159209 63374 37554 203371
18387B03371K7645J18316P4381m5087O729L4332J3162Q800Q5066J68199J68178
$$ 203371 231016 349332 423713 378626 385355 419687 432849 441649 526715 694914 863092
18376H63092j21116l09656j66247J37473O9754J03879n5089m92j33160N0926J00030
$$ 863092 741976 432320 266073 403546 473300 577179 522090 521598 388438 439364 539394
18365E39394l9289J663J16530j53141k7023N8035J11394K3593P8639k3820p8130
$$ 539394 500105 501768 618298 465157 438134 496169 607563 631156 709795 685975 607845
18354F07845q8062l2974O9810K51415Q4368k4260j50936j33779O5372k8830L7616
$$ 607845 519783 486809 556619 808034 892402 868142 717206 583427 648799 619969 657585
18343F57585q434l476K5736K0346N3433M6743L7091R9118k806j60664j29059O5204
$$ 657585 649151 645675 671411 691757 745190 791933 829024 928142 925336 764672 635613 700817
18331G00817r339n7840J44911m906j45579k5045J51523J19324o6106J5449Q1173
$$ 700817 691478 633638 778549 773643 628064 603019 754542 873866 807760 823209 904382
18320I04382M654r4929R6599J01294J01366j26627l4545O182P0440J65323P2722
$$ 904382 909036 814107 910706 1012000 1113366 986739 952194 958376 1028816 1194139 1266861
18309A266861o9721m4955N7816K8681J49257J38988m5345j31776K4582r7527P9600
$$ 1266861 1197140 1152185 1210001 1238682 1387939 1526927 1481582 1349806 1374388 1276861 1356461
18298A356461p1431m0080J25228j17479J9852l9230N1841J18191l614J8130k5512
$$ 1356461 1285030 1244950 1370178 1252699 1272551 1233321 1285162 1403353 1399739 1417869 1392357
18287A392357o1981j2164J7173P6813j2404Q8236R325p8674j443J04004J36800
$$ 1392357 1330376 1318212 1335385 1412198 1399794 1488030 1497355 1418681 1417238 1521242 1658042
18276A658042J37476O6613o2547r6363m0255N5879P4172l4013J12094N4682n6115
$$ 1658042 1795518 1862131 1799584 1703221 1662966 1718845 1793017 1759004 1871098 1925780 1869665
18265A869665L1374J86300J76574O3290Q1184M528j47742j2893Q0064l4606j74442
$$ 1869665 1901039 2087339 2263913 2327203 2408387 2412915 2265173 2252280 2332344 2297738 2123296
18254B123296o9715N7529P7337J57281J70787m9867j99273j03332M5009J44473
$$ 2123296 2053581 2111110 2188447 2345728 2516515 2466648 2267375 2164043 2209052 2353525
18244B353525J00862Q8650M3251J02311O8025q6667j24308J2082Q5923O4170J79525
$$ 2353525 2454387 2543037 2586288 2688599 2756624 2669957 2545649 2557731 2643654 2707824 2887349
18233B887349J69084K2998k9661o353q7132N2884J15089J0455P5482J0047J32720
$$ 2887349 3056433 3079431 3049770 3043417 2956285 3009169 3124258 3134713 3210195 3220242 3352962
18222C352962o3023q5906J50678J28444m8697P078P7621J20370R4434M6496J42397
$$ 3352962 3289939 3204033 3354711 3483155 3434458 3441536 3519157 3639527 3733961 3780457 3922854
18211C922854L6448M2024p9685Q0983J05268O416P408J16341Q2627K3015J06487
$$ 3922854 3959302 4001326 3921641 4002624 4107892 4114308 4121716 4238057 4320684 4343699 4450186
18200D450186L2838P1702Q4269M9836L5945J25797K2963J20468J4278n8421R0821
$$ 4450186 4483024 4554726 4638995 4688831 4724776 4850573 4873536 4994004 5008282 4949861 5040682
18189E040682J45363K35212K62393J32617R2562n6127j04131J47877L6515J4471
$$ 5040682 5186045 5421257 5683650 5816267 5908829 5852702 5748571 5896448 5932963 5947434
18179E947434K35844J68872J17590O5990M8003J5835J25182J96306J92339J94308
$$ 5947434 6183278 6352150 6469740 6535730 6583733 6599568 6724750 6921056 7113395 7307703
18169G307703N4807J66038L09982L08317K19608Q5566J11743J41148K22270K17488
$$ 7307703 7362510 7528548 7838530 8146847 8366455 8452021 8563764 8704912 8927182 9144670
18159I144670J35017J74586J50793J48126K21576J93140K43385K75575K33558
$$ 9144670 9279687 9454273 9605066 9753192 9974768 10167908 10411293 10686868 10920426
18150A0920426M03774N19928L24823K73880L12917L70898M63754P01706O35160
$$ 10920426 11324200 11844128 12168951 12442831 12755748 13126646 13590400 14292106 14927266
18141A4927266N22774M43078M63860N10960O53893Q75004Q14958P04251P37100
$$ 14927266 15450040 15893118 16356978 16867938 17521831 18396835 19211793 19916044 20653144
18132B0653144J119955J036008J206584J194256J299236J685278J856086K102333
$$ 20653144 21773099 22809107 24015691 25209947 26509183 28194461 30050547 32152880
18124C2152880K337091K556214L017831L291475M131706N167892O311911P347311
$$ 32152880 34489971 37046185 40064016 43355491 47487197 52655089 58967000 66314311
18116F6314311Q505009R838448J0785363J3022160J6983054J3189375l3015064
$$ 66314311 74819320 84657768 95443131 108465291 125448345 138637720 105622656
18109A05622656j16101049p2814473k7427737j4083393O658098J5488572J4193150
$$ 105622656 -10478393 -83292866 -110720603 -124803996 -118145898 -102657326 -88464176
18102h8464176J1168904Q711449O844299N573585M879488M225585L409124K971158
$$ -88464176 -77295272 -68583823 -61739524 -56165939 -51286451 -47060866 -43651742 -40680584
18094d0680584K634783K273091J993328J740421J599062J571933J330955J162596
$$ -40680584 -38045801 -35772710 -33779382 -32038961 -30439899 -28867966 -27537011 -26374415
18086b6374415J189764J117161J171206J006570P21186M93681M44496O09028N27757
$$ -26374415 -25184651 -24067490 -22896284 -21889714 -21168528 -20674847 -20230351 -19621323 -19093566
18077a9093566M29352N02432M93519M26871M18647N61867M49757L08568L94147
$$ -19093566 -18664214 -18161782 -17668263 -17241392 -16822745 -16260878 -15811121 -15502553 -15108406
18068a5108406L21478L22079L07611M67229K19320K40895K36993L17930L37509
$$ -15108406 -14786928 -14464849 -14157238 -13690009 -13470689 -13229794 -12992801 -12674871 -12337362
18059a2337362K37423J45713J56403J32669J66242K10464J12334J10377K48480
$$ -12337362 -12099939 -11954226 -11797823 -11665154 -11498912 -11288448 -11176114 -11065737 -10817257
18050a0817257K20789K57363j6592Q1139K44019K91129J54249J43467K05498l7046
$$ -10817257 -10596468 -10339105 -10355697 -10274558 -10030539 -9739410 -9585161 -9441694 -9236196 -9273242
18040i273242N4649J21740O5027K0246K02893K16436O5777J57047j6205J3637
$$ -9273242 -9218593 -9096853 -9031826 -9011580 -8808687 -8592251 -8526474 -8369427 -8385632 -8371995
18030h371995K2152J57227J90682J87274J23190J05022P1786R0027j5380N27J3458
$$ -8371995 -8349843 -8192616 -8001934 -7814660 -7691470 -7586448 -7514662 -7424635 -7440015 -7439488 -7426030
18019g426030J8823M5673M2932J47836Q3400J9424R8170J31236K3700L6898L0876
$$ -7426030 -7407207 -7361534 -7318602 -7170766 -7087366 -7067942 -6969772 -6838536 -6814836 -6777938 -6747062
18008f747062R3999N9629L9513O2428j9014P4529K17103J18834L2077K505j20168
$$ -6747062 -6653063 -6593434 -6553921 -6491493 -6510507 -6435978 -6218875 -6100041 -6067964 -6065459 -6185627
17997f185627O1932l2406J24582R4021m8427O321m2066R5082R2493m9995m2323
$$ -6185627 -6123695 -6156101 -6031519 -5937498 -5985925 -5979604 -6021670 -5926588 -5834095 -5884090 -5926413
17986e926413L5996J1570K9958O6541j41218Q742K0572R1064O2897J21950J42638
$$ -5926413 -5890417 -5878847 -5848889 -5782348 -5923566 -5914824 -5894252 -5803188 -5740291 -5618341 -5475703
17975e475703M1726j8356N3905J00819J75804L1570m1465j24817j35318j3647
$$ -5475703 -5433977 -5452333 -5398428 -5297609 -5121805 -5090235 -5131700 -5256517 -5391835 -5405482
17965e405482J31339K04655J01610J21763M9602J08238K15240M3373j76779L062
$$ -5405482 -5274143 -5069488 -4967878 -4846115 -4796513 -4688275 -4473035 -4429662 -4606441 -4603379
17955d603379m0850m8740r5472P1338m8632j05694k4694M513J11510Q3882J08932
$$ -4603379 -4644229 -4692969 -4788441 -4717103 -4765735 -4871429 -4896123 -4891610 -4780100 -4696218 -4587286
17944d587286R8241J20991q4933m8287n9524n7013j08996Q416P1480K9215J36818
$$ -4587286 -4489045 -4368054 -4452987 -4501274 -4560798 -4617811 -4726807 -4718391 -4646911 -4617696 -4480878
17933d480878l2853k9595L5488j4803q1697J84967L8195l533N3590j47385o8105
$$ -4480878 -4513731 -4543326 -4507838 -4522641 -4604338 -4419371 -4381176 -4384709 -4331119 -4478504 -4546609
17922d546609J36046R3981R6851M5198M7193P2823j16564J08314k5463o9558J40603
$$ -4546609 -4410563 -4316582 -4219731 -4174533 -4127340 -4054517 -4171081 -4062767 -4088230 -4157788 -4017185
17911d017185P1549K7734p6549j74502j19927j2632R7236J75154J64691J84149
$$ -4017185 -3945636 -3917902 -3994451 -4168953 -4288880 -4301512 -4204276 -4029122 -3864431 -3680282
17901c680282l5664j39665n7406k1641o7342L1312R3177J7871m2796j1079r0940
$$ -3680282 -3715946 -3855611 -3913017 -3934658 -4002000 -3970688 -3877511 -3859640 -3902436 -3913515 -4004455
17890d004455m4179M9305J13160J14792R1054L4590j84280j48011q3565J14003
$$ -4004455 -4048634 -3999329 -3886169 -3771377 -3680323 -3645733 -3830013 -3978024 -4061589 -3947586
17880c947586K24937J79366p791l4324R559j0892j89896J26244J93214j1142j25643
$$ -3947586 -3722649 -3543283 -3551074 -3585398 -3575839 -3586731 -3776627 -3650383 -3457169 -3468311 -3593954
17869c593954J8562O6391M6980j09422p8680k0532J15820l1610n705J28285J53417
$$ -3593954 -3575392 -3509001 -3462021 -3571443 -3650123 -3670655 -3554835 -3586445 -3592150 -3463865 -3310448
17858c310448l6742n5295K9189P2861K02439n8606j56264j11527M8635L0846j493
$$ -3310448 -3347190 -3402485 -3373296 -3300435 -3097996 -3156602 -3312866 -3424393 -3375758 -3344912 -3346405
17847c346405P3758N7063n0646n928O4146j14080M995j17534n6621Q3471M4342
$$ -3346405 -3272647 -3215584 -3266230 -3272158 -3208012 -3322092 -3317097 -3434631 -3491252 -3407781 -3363439
17836c363439J4523J61852J84089M156j48691j95183r7702K04516r4535n9910
$$ -3363439 -3348916 -3187064 -3002975 -2998819 -3147510 -3342693 -3440395 -3235879 -3330414 -3390324
17826c390324m6073J45650P8076j09360M148N0063L6103P242l9187O7097J01924
$$ -3390324 -3436397 -3290747 -3212671 -3322031 -3317883 -3267820 -3231717 -3224475 -3263662 -3196565 -3094641
17815c094641Q806R9767q7036q7534n3391j12050R7649J66299j77724l9753J97079
$$ -3094641 -3085835 -2986068 -3073104 -3160638 -3214029 -3326079 -3228430 -3062131 -3239855 -3279608 -3082529
17804c082529J01703j0587J2459M633o1890q4708R9191O1716n6125k1524j11394
$$ -3082529 -2980826 -2991413 -2978954 -2974321 -3036211 -3120919 -3021728 -2960012 -3016137 -3037661 -3149055
17793c149055M6859N5763J25465P7006J6294j13742J5750j9032m4077j33568m7090
$$ -3149055 -3102196 -3046433 -2920968 -2843962 -2827668 -2941410 -2925660 -2944692 -2988769 -3122337 -3169427
17782c169427J44317J4888J45342J76881n462j76253J7019O0114p8698l9904m7701
$$ -3169427 -3025110 -3010222 -2864880 -2687999 -2693461 -2869714 -2852695 -2792581 -2871279 -2911183 -2958884
17771b958884o5779O9774L1159L1322K1253j6220l56J26843J74773M6577K0816
$$ -2958884 -3024663 -2954889 -2923730 -2892408 -2871155 -2887375 -2887731 -2760888 -2586115 -2539538 -2518722
17760b518722l6131k4938M9559N839r4238j51982K5280O3081N1326o5279j82353
$$ -2518722 -2554853 -2579791 -2530232 -2524393 -2618631 -2770613 -2745333 -2682252 -2630926 -2696205 -2878558
17749b878558L9003J37098l0746L2618J1280P9153m2172j16107q1529J41007J92907
$$ -2878558 -2839555 -2702457 -2733203 -2700585 -2689305 -2610152 -2652324 -2768431 -2849960 -2708953 -2516046
17738b516046J71533l2414o9079k7015L2490m2012N321k0147J881j45867j758
$$ -2516046 -2344513 -2376927 -2446006 -2473021 -2440531 -2482543 -2477222 -2497369 -2495488 -2641355 -2643113
17727b643113Q7481o5542r8094R6609j01386M7876J1547o8224M0921L5735j6793
$$ -2643113 -2555632 -2621174 -2719268 -2622659 -2724045 -2676169 -2664622 -2732846 -2691925 -2656190 -2672983
17716b672983J00023M5297r486Q9697o3017j26358q9331j5266P4901l0198J26294
$$ -2672983 -2572960 -2527663 -2537149 -2447452 -2510469 -2636827 -2726158 -2741424 -2666523 -2696721 -2570427
17705b570427J1858o5470J2123l2634m4322J02267K28646R5128n9466p7314j41912
$$ -2570427 -2558569 -2624039 -2611916 -2644550 -2688872 -2586605 -2357959 -2262831 -2322297 -2399611 -2541523
17694b541523k4943K0239j8472m6088m1768J56233O616l9697j26013n6281Q5005
$$ -2541523 -2566466 -2546227 -2564699 -2610787 -2652555 -2496322 -2489706 -2529403 -2655416 -2711697 -2626692
17683b626692J04340m9042l3285J83061J33839l9450N8838N2969q8026l5731j17599
$$ -2626692 -2522352 -2571394 -2604679 -2421618 -2287779 -2327229 -2268391 -2215422 -2303448 -2339179 -2456778
17672b456778K2927n5475P0683Q5657r3579j05458Q6325N4076k1236j5360q299
$$ -2456778 -2433851 -2489326 -2418643 -2332986 -2426565 -2532023 -2445698 -2391622 -2412858 -2428218 -2436517
17661b436517j9140L4044O4833K6966l2785L9286l698j07759M4191j206j90444
$$ -2436517 -2455657 -2421613 -2356780 -2329814 -2362599 -2323313 -2327011 -2434770 -2390579 -2391785 -2582229
17650b582229j05354J65201K25130J48683o9464L6398R0061j67242R982J924L7790
$$ -2582229 -2687583 -2522382 -2297252 -2148569 -2218033 -2181635 -2091574 -2258816 -2248834 -2246910 -2209120
17639b209120o8466j36912K8540O1090J697J00131J0780j92834r1535J83529M5875
$$ -2209120 -2277586 -2414498 -2385958 -2324868 -2323171 -2223040 -2212260 -2405094 -2496629 -2313100 -2267225
17628b267225J0780r786o5984o5575l2794L7433O2488M4721L1457j01078j5372
$$ -2267225 -2256445 -2266231 -2332215 -2397790 -2430584 -2393151 -2330663 -2285942 -2254485 -2355563 -2370935
17617b370935J72069K5197j44483P4005j5876k1508k5628N7574J00655Q7511j07939
$$ -2370935 -2198866 -2173669 -2318152 -2244147 -2260023 -2281531 -2307159 -2249585 -2148930 -2061419 -2169358
17606b169358l1440n5928M7992O8404J39490j20357k01593l6103K8972n984K2570
$$ -2169358 -2200798 -2256726 -2208734 -2140330 -2000840 -2121197 -2322790 -2358893 -2329921 -2335905 -2313335
17595b313335J43409q5599j20927o0850N4432J24997P8196l0681q6080j8681P1249
$$ -2313335 -2169926 -2255525 -2376452 -2437302 -2382870 -2257873 -2179677 -2210358 -2296438 -2315119 -2243870
17584b243870l0547K0000R1714n395k759j10438P2322l6109p7818n6882m4876
$$ -2243870 -2274417 -2254417 -2162703 -2168098 -2170857 -2281295 -2208973 -2245082 -2322900 -2379782 -2424658
17573b424658p3817Q5369P4730j8061J73588N5445K5167K1319l2706r7266l4029
$$ -2424658 -2498475 -2413106 -2338376 -2356437 -2182849 -2127404 -2102237 -2080918 -2113624 -2210890 -2244919
17562b244919R1814k6375j73473p5468N8253J39883R7268L4914m1131j2559m8677
$$ -2244919 -2153105 -2179480 -2352953 -2428421 -2370168 -2230285 -2133017 -2098103 -2139234 -2151793 -2200470
17551b200470L2424n6900K7477J9738M7397j04044M8796J62865Q5052o8710Q6960
$$ -2200470 -2168046 -2224946 -2197469 -2177731 -2130334 -2234378 -2185582 -2022717 -1937665 -2006375 -1919415
17540a919415q1613R3341R1494J2507j912j35132j38724Q8413m1020r6354l8922
$$ -1919415 -2001028 -1907687 -1816193 -1803686 -1805598 -1940730 -2079454 -1991041 -2032061 -2128415 -2167337
17529b167337K5937l0303K3067k5004K8034o7492K4790J00347M6382l260K4430
$$ -2167337 -2141400 -2171703 -2148636 -2173640 -2145606 -2213098 -2188308 -2087961 -2041579 -2044839 -2020409
17518b020409J5282L6451n6071k5113J13499L5120l7418k2064J9308p8453p6008
$$ -2020409 -2005127 -1968676 -2024747 -2049860 -1936361 -1901241 -1938659 -1960723 -1941415 -2019868 -2095876
17507b095876N8258j6168m8457L2762K3553o6020k1864J28851M3430l9815M0852
$$ -2095876 -2037618 -2053786 -2102243 -2069481 -2045928 -2111948 -2133812 -2004961 -1961531 -2001346 -1960494
17496a960494P7837J64109j56178j29661P497J97272j4794p3534o8273r290k7748
$$ -1960494 -1882657 -1718548 -1874726 -2004387 -1996890 -1799618 -1814412 -1887946 -1956219 -1965509 -1993257
17485a993257M5892Q3160p7097l9310M6107J13108j4341L8628o88j6663l4176
$$ -1993257 -1947365 -1864205 -1941302 -1980612 -1934505 -1821397 -1835738 -1797110 -1797798 -1814461 -1848637
17474a848637m802N8197O2841O1872n0065k6449l2099n5263n7335M4304j0740
$$ -1848637 -1853439 -1795242 -1732401 -1670529 -1720594 -1747043 -1779142 -1834405 -1891740 -1847436 -1858176
17463a858176J14379N1575j04290O5613n062j20524l7731K1192K954J86660J55283
$$ -1858176 -1743797 -1692222 -1796512 -1730899 -1735961 -1856485 -1894216 -1873024 -1870070 -1683410 -1528127
17452a528127p7528j35672Q525K0958k63M6311N9793K55191J13618m93431l53049
$$ -1528127 -1605655 -1741327 -1732802 -1711844 -1712107 -1665796 -1606003 -1350812 -1237194 -1730625 -2083674
17441b083674j96374k28006M6036J06235L4877K9760K4471k0410J36402J19078
$$ -2083674 -2280048 -2508054 -2462018 -2355783 -2320906 -2291146 -2266675 -2287085 -2150683 -2031605
17431b031605K085l4447N0927J63649N7713N4632k8864l7785j5090l1039j9145
$$ -2031605 -2029520 -2063967 -2013040 -1849391 -1791678 -1737046 -1765910 -1803695 -1818785 -1849824 -1868969
17420a868969n4927p6722j10J11780J09172K3129j10331j2254J3054J2351p4874
$$ -1868969 -1923896 -2000618 -2000728 -1888948 -1779776 -1756647 -1866978 -1879232 -1866178 -1853827 -1928701
17409a928701r6453L351L5452M1679l9402o5261R6864r173m760J3304k6263R8747
$$ -1928701 -2025154 -2021803 -1986351 -1944672 -1984074 -2049335 -1952471 -1961644 -1966404 -1953100 -1979363 -1880616
17397a880616J9706j816n644J31893n171q6843q5693K11791J43217k7376k75633
$$ -1880616 -1860910 -1862726 -1868370 -1736477 -1741648 -1828491 -1914184 -1702393 -1559176 -1586552 -1862185
17386a862185n202K46573K2665q2272r4866j71262R5634L4817r6272q4906N5559
$$ -1862185 -1867387 -1620814 -1598149 -1680421 -1775287 -1946549 -1850915 -1816098 -1912370 -1997276 -1941717
17375a941717Q8034j9878N34K9322J6298J04453q8276n4995l287o1583L9884j1399
$$ -1941717 -1853683 -1873561 -1873027 -1843705 -1827407 -1722954 -1811230 -1866225 -1869512 -1931095 -1891211 -1902610
17363a902610p0624r8791M4891r375O6927J26735o7249J9171N2559k0349O6309
$$ -1902610 -1973234 -2072025 -2027134 -2036509 -1969582 -1842847 -1910096 -1890925 -1838366 -1858715 -1792406
17352a792406O1021J2433K4241j16374q9736o6599J68627R5897j16001j10738
$$ -1792406 -1731385 -1718952 -1694711 -1811085 -1900821 -1967420 -1798793 -1702896 -1818897 -1929635
17342a929635N1773j1654J15458P6398J31033o610j2192j0223n9508N445M4624
$$ -1929635 -1877862 -1889516 -1774058 -1697660 -1566627 -1573237 -1585429 -1595652 -1655160 -1649715 -1605091
17331a605091L7026j37289O1756l9302O8938n2237m7737J4472m1875j12092q6226
$$ -1605091 -1568065 -1705354 -1643598 -1682900 -1613962 -1666199 -1713936 -1699464 -1741339 -1853431 -1939657
17320a939657J28604J31194j10821M0004l9107k3013R2710O6707L3586J8987j12495
$$ -1939657 -1811053 -1679859 -1790680 -1750676 -1789783 -1812796 -1720086 -1653379 -1619793 -1600806 -1713301
17309a713301j33908n2433l0751o0650P4350N5252J60208N8147q8086j06466P7729
$$ -1713301 -1847209 -1899642 -1930393 -1991043 -1916693 -1861441 -1701233 -1643086 -1731172 -1837638 -1759909
17298a759909M1459J15998k1612l5459j60J2390n3231j19226k2721o3106j16299
$$ -1759909 -1718450 -1602452 -1624064 -1659523 -1659683 -1647293 -1700524 -1819750 -1842471 -1905577 -2021876
17287b021876N8144J11116J72848J33544J30947q3056r2415J49185o7500m6741
$$ -2021876 -1963732 -1852616 -1679768 -1546224 -1415277 -1498333 -1590748 -1441563 -1509063 -1555804
17277a555804j07067j4906M7386P2225j13047j89878n2798J20742L3859Q005L4887
$$ -1555804 -1662871 -1677777 -1630391 -1558166 -1671213 -1861091 -1913889 -1793147 -1759288 -1751283 -1716396
17266a716396m0881p1511k9146J30894P9997m4710m2298l9245J14627N3453j17271
$$ -1716396 -1757277 -1828788 -1857934 -1727040 -1647043 -1691753 -1734051 -1773296 -1658669 -1605216 -1722487
17255a722487j9363l6240r4458p0454J4316J37732R3390q7364p7925l2168J25262
$$ -1722487 -1741850 -1778090 -1872548 -1943002 -1928686 -1790954 -1697564 -1784928 -1862853 -1895021 -1769759
17244a769759n3057Q1340J20964q940j04588k8956J23087L5592L0522P0179r433
$$ -1769759 -1822816 -1741476 -1620512 -1629452 -1734040 -1762996 -1639909 -1604317 -1573795 -1503616 -1513049
17233a513049l2962l1056J08492P7952k20706j48486n4695J391J22701k467J30118
$$ -1513049 -1546011 -1577067 -1468575 -1390623 -1611329 -1759815 -1814510 -1813119 -1690418 -1692885 -1562767
17222a562767Q6323j46266m4745q8907J71256P4387N0030J2714j49709o3241m8516
$$ -1562767 -1476444 -1622710 -1667455 -1756362 -1585106 -1510719 -1460689 -1447975 -1597684 -1660925 -1709441
17211a709441K3985N5296J82302L1026m128p0057J0906m1356m7456j08367n8033
$$ -1709441 -1685456 -1630160 -1447858 -1416832 -1420960 -1491017 -1480111 -1521467 -1568923 -1677290 -1735323
17200a735323n3939m3943J4768P384K03695K9618l6187j28077M1167J39315J19925
$$ -1735323 -1789262 -1833205 -1818437 -1811053 -1607358 -1577740 -1613927 -1742004 -1700837 -1561522 -1441597
17189a441597j08725p1577N6544o1276R4562J16363p3587l9442k8782l5340J3465
$$ -1441597 -1550322 -1621899 -1565355 -1626631 -1532069 -1415706 -1489293 -1528735 -1557517 -1592857 -1579392
17178a579392N2785P5790J60396m1747n1229j337N243l5827n3913K1591r8295
$$ -1579392 -1526607 -1450817 -1290421 -1332168 -1383397 -1384734 -1379491 -1415318 -1469231 -1447640 -1545935
17167a545935M6848m0956j230o5052P558L9186J5907k6065K7789k2539J4048L5475
$$ -1545935 -1499087 -1540043 -1541273 -1606325 -1598767 -1559581 -1543674 -1569739 -1541950 -1564489 -1550441 -1514966
17155a514966J04972l1551n0064o5835j8255M7722R9134Q424n2004j20094r8997
$$ -1514966 -1409994 -1441545 -1491609 -1557444 -1575699 -1527977 -1428843 -1420419 -1472423 -1592517 -1691514
17144a691514O1212L3555N552P7426M0836j50549p2858K03664K706l1413N1006
$$ -1691514 -1630302 -1596747 -1591195 -1513769 -1472933 -1623482 -1696340 -1492676 -1489970 -1521383 -1470377
17133a470377Q559l6038j30576J4087o1040L1594L5998J2472J13497J5280n5207
$$ -1470377 -1461818 -1497856 -1628432 -1614345 -1675385 -1643791 -1607793 -1595321 -1481824 -1466544 -1521751
17122a521751k944M8887p9745j73950K7231N1649Q6008l0488j0552O6103n4961
$$ -1521751 -1524695 -1475808 -1555553 -1729503 -1702272 -1650623 -1564615 -1595103 -1605655 -1539552 -1594513
17111a594513q525J28507o4086p1294Q466j3508J33359l031o8114q8535k8746
$$ -1594513 -1603038 -1474531 -1538617 -1609911 -1601445 -1614953 -1481594 -1484625 -1552739 -1641274 -1670020
17100a670020n933J49413J56896q8879n3476j1093R7196J026Q58M8980n9413j19433
$$ -1670020 -1675953 -1526540 -1369644 -1458523 -1511999 -1523092 -1425896 -1424870 -1424012 -1375032 -1434445 -1553878
17088a553878K2046O9956O4062J28025p1461O7895J8428J6122m1305J3388l9549
$$ -1553878 -1531832 -1461876 -1397814 -1269789 -1341250 -1273355 -1254927 -1238805 -1280110 -1266722 -1306271
17077a306271j76643j00241K0522J13681j470M1120N1169n0080p9161q0537L0841
$$ -1306271 -1482914 -1583155 -1562633 -1448952 -1450422 -1409302 -1358133 -1408213 -1487374 -1567911 -1537070
17066a537070J83177P0834q6325m4199k321J2237N1292J66759o4596o1854q0194
$$ -1537070 -1353893 -1283059 -1369384 -1413583 -1415904 -1403667 -1352375 -1185616 -1250212 -1312066 -1392260
17055a392260k8505O3830k1759r8548N2165L1027K5220j6215n365N3789Q1252
$$ -1392260 -1420765 -1356935 -1378694 -1477242 -1425077 -1394050 -1368830 -1385045 -1390410 -1336621 -1255369
17044a255369J8544M6999o9409j56481n9513M3731L2195O2110j5291O4887r6859
$$ -1255369 -1236825 -1189826 -1259235 -1415716 -1475229 -1431498 -1399303 -1337193 -1352484 -1287597 -1384456
$$ [...]
##END NTUPLES=NMR SPECTRUM
##END=
