##TITLE=Analysis number 330394
Compound Code cc 66909
Book Reference 510/104
Project Code adrs
Chemist Name jimp
##JCAMPDX= 6.0         $$ Bruker NMR JCAMP-DX V2.0
##DATA TYPE= NMR SPECTRUM
##DATA CLASS= NTUPLES
##ORIGIN= Bruker BioSpin GmbH
##OWNER= nmr
$$ XWIN-NMR		Version 3.5
$$ Wed Nov 21 13:27:05 2007 GMT Standard Time (UT+0h)  MAYBRIDGE\nmr@NMR_250MHZ
##.OBSERVE FREQUENCY= 250.131544655141
##.OBSERVE NUCLEUS= ^1H
##.ACQUISITION MODE= SIMULTANEOUS (DQD)
##.ACQUISITION SCHEME= undefined
##.AVERAGES= 16
##.DIGITISER RES= 18
##SPECTROMETER/DATA SYSTEM= dpx250
##.PULSE SEQUENCE= zg30
##.SOLVENT NAME= CDCl3
##.SHIFT REFERENCE= (INTERNAL, CDCl3, 0, 16.522)
##AUDIT TRAIL= $$ (NUMBER, WHEN, WHO, WHERE, WHAT)
$$ ##TITLE= Audit trail, XWIN-NMR		Version 3.5
$$ ##JCAMPDX= 5.01
$$ ##ORIGIN= Bruker BioSpin GmbH
$$ ##OWNER= nmr
$$ C:\u/data/dgb/nmr/ADRS/1990/pdata/1/auditp.txt
$$ ##AUDIT TRAIL=  $$ (NUMBER, WHEN, WHO, WHERE, WHAT)
(   1,<2007-11-21 13:26:22.19 +000>,<MAYBRIDGE\nmr>,<NMR_250MHZ>,
      <created by zg, POWCHK disabled, PULCHK disabled
       configuration hash MD5:
       76 6E 9A 78 1E 09 19 81 EC 84 63 8F B0 6A 59 2D
       data hash MD5: 64K
       F0 B3 03 F8 86 CB B9 1F A0 5C D0 A2 C8 60 0F 58>)
(   2,<2007-11-21 13:26:40.33 +000>,<MAYBRIDGE\nmr>,<NMR_250MHZ>,
      <Start of raw data processing
       ef LB = 0.3 FT_mod = 6 PKNL = 1 SI = 32K 
       data hash MD5: 32K
       16 F8 AF BB DE D3 9A CB 83 D0 B4 5D 4A EF 0D 6C>)
(   3,<2007-11-21 13:26:42.51 +000>,<MAYBRIDGE\nmr>,<NMR_250MHZ>,
      <apk 
       data hash MD5: 32K
       A4 EC C8 B0 F7 E5 98 6C A8 46 E3 1B 68 89 12 FA>)
(   4,<2007-11-21 13:26:44.72 +000>,<MAYBRIDGE\nmr>,<NMR_250MHZ>,
      <abs ABSG = 5 
       data hash MD5: 32K
       12 EE 37 C0 04 5F 9B B0 C3 00 86 E7 42 22 BA 58>)
$$ ##END=
$$ 
$$ hash MD5
$$ 19 4F A5 86 CE 9F 0B B5 92 59 E8 5D 8A 2B DC A5
##$RELAX= 
##$RELAX= 
##$RELAX= 
##$RELAX= 
##$RELAX= 
##$RELAX= 
##$RELAX= 
$$ Bruker specific parameters
$$ --------------------------
##$DU= <C:\u>
##$EXPNO= 1990
##$NAME= <ADRS>
##$PROCNO= 1
##$TYPE= <nmr>
##$USER= <dgb>
##$AMP= (0..31)
100 100 100 100 100 100 100 100 100 100 100 100 100 100 100 100 100 100 
100 100 100 100 100 100 100 100 100 100 100 100 100 100 
##$AQSEQ= 0
##$AQ_mod= 3
##$AUNM= <au_zg>
##$AUTOPOS= <29 >
##$BF1= 250.13
##$BF2= 250.13
##$BF3= 250.13
##$BF4= 250.13
##$BF5= 500.13
##$BF6= 500.13
##$BF7= 500.13
##$BF8= 500.13
##$BYTORDA= 1
##$CFDGTYP= 0
##$CFRGTYP= 5
##$CHEMSTR= <none>
##$CNST= (0..31)
1 1 145 1 1 1 1 1 1 1 1 1 1 1 1 1 1 1 1 1 1 1 1 1 1 1 1 1 1 1 1 1 
##$CPDPRG= <>
##$CPDPRG1= <>
##$CPDPRG2= <>
##$CPDPRG3= <>
##$CPDPRG4= <mlev>
##$CPDPRG5= <mlev>
##$CPDPRG6= <mlev>
##$CPDPRG7= <mlev>
##$CPDPRG8= <mlev>
##$CPDPRGB= <>
##$CPDPRGT= <>
##$D= (0..31)
0 1 0 0 0 0 0 0 0 0.06 0 0 0 0 0 0 0.0002 0 0 0 0 0 0 0 0 0 0 0 0 0 0 
0 
##$DATE= 1195651580
##$DBL= (0..7)
120 120 120 120 120 120 120 120 
##$DBP= (0..7)
150 150 150 150 150 150 150 150 
##$DBP07= 0
##$DBPNAM0= <>
##$DBPNAM1= <>
$$ [...]
##$SUBNAM7= <"">
##$SUBNAM8= <"">
##$SUBNAM9= <"">
##$SW= 20.6930455092707
##$SWIBOX= (0..15)
0 0 3 0 0 0 0 0 0 0 0 0 0 0 0 0 
##$SW_h= 5175.983436853
##$TD= 65536
##$TD0= 1
##$TE= 295.16
##$TE2= 300
##$TE3= 300
##$TEG= 300
##$TL= (0..7)
0 120 120 120 120 120 120 120 
##$TP= (0..7)
150 150 150 150 150 150 150 150 
##$TP07= 0
##$TPNAME0= <>
##$TPNAME1= <>
##$TPNAME2= <>
##$TPNAME3= <>
##$TPNAME4= <>
##$TPNAME5= <>
##$TPNAME6= <>
##$TPNAME7= <>
##$TPOAL= (0..7)
0.5 0.5 0.5 0.5 0.5 0.5 0.5 0.5 
##$TPOFFS= (0..7)
0 0 0 0 0 0 0 0 
##$TUNHIN= 0
##$TUNHOUT= 0
##$TUNXOUT= 0
##$USERA1= <user>
##$USERA2= <user>
##$USERA3= <user>
##$USERA4= <user>
##$USERA5= <user>
##$V9= 5
##$VALIST= <valist>
##$VCLIST= <CCCCCCCCCCCCCCC>
##$VD= 0
##$VDLIST= <DDDDDDDDDDDDDDD>
##$VPLIST= <PPPPPPPPPPPPPPP>
##$VTLIST= <TTTTTTTTTTTTTTT>
##$WBST= 1024
##$WBSW= 4
##$XGAIN= (0..3)
0 0 0 0 
##$XL= 0
##$YL= 0
##$YMAX_a= 308652
##$YMIN_a= -509080
##$ZGOPTNS= <>
##$ZL1= 120
##$ZL2= 120
##$ZL3= 120
##$ZL4= 120
##$ABSF1= 16.522
##$ABSF2= -4.171173
##$ABSG= 5
##$ABSL= 3
##$ALPHA= 0
##$AQORDER= 0
##$ASSFAC= 0
##$ASSFACI= 0
##$ASSFACX= 0
##$ASSWID= 0
##$AUNMP= <proc_1d>
##$AZFE= 0.1
##$AZFW= 0.1
##$BCFW= 0
##$BC_mod= 0
##$BYTORDP= 0
##$COROFFS= 0
##$CY= 12.5
##$DATMOD= 1
##$DC= 0
##$DFILT= <>
##$DTYPP= 0
##$F1P= 14.0000005364418
##$F2P= -0.99999901652339
##$FCOR= 0.5
##$FTSIZE= 32768
##$FT_mod= 6
##$GAMMA= 0
##$GB= 0
##$INTBC= 1
##$INTSCL= 1
##$ISEN= 128
##$LB= 0.3
##$LEV0= 0
##$LPBIN= 0
##$MAXI= 10000
##$MC2= 0
##$MEAN= 0
##$ME_mod= 0
##$MI= 0
##$NCOEF= 0
##$NC_proc= -3
##$NLEV= 6
##$NOISF1= 0
##$NOISF2= 0
##$NSP= 0
##$NTH_PI= 0
##$NZP= 0
##$OFFSET= 16.522
##$PC= 1
##$PHC0= 168.4568
##$PHC1= 8.806426
##$PH_mod= 1
##$PKNL= yes
##$PPARMOD= 0
##$PSCAL= 4
##$PSIGN= 0
##$REVERSE= no
##$SF= 250.13
##$SI= 32768
##$SIGF1= 0
##$SIGF2= 0
##$SINO= 400
##$SIOLD= 32768
##$SREGLST= <1H.CDCl3>
##$SSB= 0
##$STSI= 32768
##$STSR= 0
##$SW_p= 5175.98343685301
##$SYMM= 0
##$S_DEV= 0
##$TDeff= 65536
##$TDoff= 0
##$TI= <Analysis number 999999
Compound Code 99
Book Reference 9
Project Code 9>
##$TILT= no
##$TM1= 0
##$TM2= 0
##$TOPLEV= 0
##$USERP1= <user>
##$USERP2= <user>
##$USERP3= <user>
##$USERP4= <user>
##$USERP5= <user>
##$WDW= 1
##$XDIM= 32768
##$YMAX_p= 531056411
##$YMIN_p= -183773
$$ End of Bruker specific parameters
$$ ---------------------------------
##NTUPLES= NMR SPECTRUM
##VAR_NAME=  FREQUENCY,     SPECTRUM/REAL,   SPECTRUM/IMAG
##SYMBOL=    X,             R,               I
##VAR_TYPE=  INDEPENDENT,   DEPENDENT,       DEPENDENT
##VAR_FORM=  AFFN,          ASDF,            ASDF
##VAR_DIM=   32768,         32768,           32768
##UNITS=     HZ,            ARBITRARY UNITS, ARBITRARY UNITS
##FACTOR=    0.157963299565203, 1,           1
##FIRST=     4132.6476996994, 0,             0
##LAST=      -1043.33573715361, 0,           0
##MIN=       -1043.33573715361, -183773,     0
##MAX=       4132.6476996994, 531056411,     0
$$ Real data points
##PAGE= N=1
##DATA TABLE= (X++(R..R)), XYDATA
$$ [...]
18881A12720k28J5370K7036O023k0497j2685j8475j3363m503j5239L4505K4292
$$ 112720 112492 127862 154898 160921 140424 127739 109264 95901 91398 76159 110664 134956
18869A34956R647m1400k7213j2353J7147j0142j6377K94J8554q119J0179J2559
$$ 134956 144603 103203 75990 63637 80784 70642 54265 54559 73113 64994 75173 87732
18857H7732K293k6564k7511k7636K6586J1357j3342j538K0152L3695J7686L281
$$ 87732 90025 63461 35950 8314 34900 46257 32915 31377 51529 85224 102910 106191
18845A06191k6914j3236J934l960O815R583M757J5025N352j8590Q816K6851L9173
$$ 106191 79277 66041 67975 64015 70830 80413 85170 100195 105547 86957 95773 122624 161797
18832A61797k999K708J8700J418q526m846l0842l757O472J1106j0420j6255j5710
$$ 161797 158798 161506 180206 181624 173098 168252 137410 133653 140125 151231 140811 124556 108846
18819A08846j9569k222K153M784o654p65j444Q593K3527j3797l2454M824M375
$$ 108846 89277 87055 89208 93992 87338 86573 85129 93722 117249 103452 70998 75822 80197
18806H0197J8510L7313Q259k1966j6687N83P861K9096L5819L4270J5297j7324
$$ 80197 98707 136020 144279 122313 105626 106209 114070 143166 178985 213255 228552 211228
18794B11228j1102l9404k4189k2756l746J7419J2485P099m686N390N106K1662
$$ 211228 200126 160722 136533 113777 110031 127450 139935 147034 142348 147738 152844 174506
18782A74506m753Q777R405l1625q611K6999J973M056J9863K8623J7625O778M0602
$$ 174506 169753 178530 187935 156310 147699 174698 176671 180727 200590 229213 246838 253616 294218
18769B94218P3693J00533P9030l6331m4470l6267k4429L2081M9131K2085M3358
$$ 294218 367911 468444 547474 511143 466673 430406 405977 438058 487189 509274 552632
18758E52632Q5736P2521P4007L3158J5531k2408m8586m8264l8480l8965p0994
$$ 552632 638368 710889 784896 818054 833585 811177 762591 714327 675847 636882 565888
18747E65888m1317k2392o026j2269n3678O23J3193L05L5895N4382O1796O2499
$$ 565888 524571 502179 496153 483884 430206 430829 444022 444327 480222 534604 596400 658899
18735F58899O6667R3738Q8809N9930L2154R033p579N908M0990J02353R9629R1032
$$ 658899 725566 819304 908113 968043 1000197 1009230 1001651 1007559 1048549 1150902 1250531 1341563
18723A341563J69764J69204J79448K33220K84727L69753N09470O69567R17875
$$ 1341563 1511327 1680531 1859979 2093199 2377926 2747679 3257149 3926716 4844591
18714D844591J286440J976961L226507N068966O979617P563547N364407O59576
$$ 4844591 6131031 8107992 11334499 16403465 23383082 30946629 36311036 36970612
18706C6970612m084703o556109o261560m328001k094768j48613J783214L769176
$$ 36970612 32885909 26329800 20068240 15740239 13645471 13496858 15280072 19049248
18698A9049248N292930N673890M192128Q35929k935981n498840o290870n614831
$$ 19049248 24342178 30016068 34208196 35044125 32108144 26609304 20318434 14703603
18690A4703603m152515k685673j630608r98342o37669m37277l27429l03936l09630
$$ 14703603 10551088 7865415 6234807 5236465 4598796 4161519 3834090 3530154 3220524
18681C220524k86070k02321j19057K507J63992K51997K73288K63746J82442J93695
$$ 3220524 2934454 2732133 2613076 2615583 2779575 3031572 3304860 3568606 3751048 3944743
18671C944743L06874N40822Q42514J320388K157462L543673N706341Q346762R455769
$$ 3944743 4251617 4792439 5634953 6955341 9112803 12656476 18362817 26709579 36165348
18662C6165348O160257q45375o845420q509484o696213l869248j458515M70487
$$ 36165348 42325605 41480230 34634810 26125326 19429113 15559865 14101350 14571837
18654A4571837K378308M689969O967801P787567N529435K92557n284771q379356
$$ 14571837 16950145 21640114 28607915 36395482 41924917 42217474 36932703 28553347
18646B8553347q300971o291344m064208k472720j584299j111630q18507o80408
$$ 28553347 20252376 13961032 9896824 7424104 5839805 4728175 3909668 3229260
18638C229260m97560l96570l19113k43897j76947p8001q1668j00403j10862r6515
$$ 3229260 2731700 2335130 2016017 1772120 1595173 1517172 1435504 1335101 1224239 1127724
18628A127724p4419l6645J9100o862n3281j03522r3269m7951o1038o3017o8927
$$ 1127724 1053305 1016660 1035760 1028898 975617 872095 778826 730875 669837 606820 537893
18617E37893n3556k791L0692M8084N3328M0353P1127J07349J25926O8120J0924
$$ 537893 484337 481546 512238 560322 613650 654003 725130 832479 958405 1026525 1037449
18606A037449L1370J34071K56788K40191R4065j01548k37665k12005j58532j00929
$$ 1037449 1068819 1202890 1459678 1699869 1793934 1692386 1454721 1242716 1084184 983255
18596I83255l7334m9188q5144j28386j26919r5010o7412m8592m2122n6350l1982
$$ 983255 945921 896733 811589 683203 556284 461274 393862 345270 303148 246798 214816
18585B14816n254K8875L726k4056j876j1265O113r392j9693k3882j5418J3421
$$ 214816 209562 238437 242163 218107 216231 204966 211079 201687 181994 158112 142694 156115
18573A56115j3306L364J4256L7529M0912M1364N6749J35186J90981J37532J0092
$$ 156115 142809 146173 160429 197958 238870 280234 336983 472169 663150 800682 810774
18562H10774p9014j52523j48729q0524o2365j4892L0982N4754O6131R8396J23219
$$ 810774 731760 579237 430508 349984 287619 272727 303709 358463 424594 522990 646209
18551F46209Q6649m255r0418j37717j18411o3370o9068l8346j2367j4374o752
$$ 646209 732858 728603 638185 500468 382057 318687 249619 211273 198906 184532 177780
18540A77780k2519j8396J5132R262k7727L5154K1762l4299l6570q439j719j2006
$$ 177780 155261 136865 151997 161259 133532 168686 190448 156149 119579 111140 109421 97415
18528I7415j2466p17o135r406J7989J0710Q110l2997j8123j9767J4948J2965r60
$$ 97415 84949 84232 78097 68691 86680 97390 105500 72503 54380 34613 49561 62526 61566
18515F1566K47j0432J4248J2735J9407O0943J2372l2976l77l2159n5396K518M3738
$$ 61566 61813 51381 65629 78364 97771 158714 171086 138110 137733 105574 50178 52696 96434
18502I6434K4930n061r761o936p808k7794j8937k9023l0381Q966K5044L7758Q101
$$ 96434 121364 116303 106542 99606 91798 64004 45067 16044 -14337 -5371 19673 57431 65532
18489F5532j2550j8567j4603k4360J0161K5086K0755j7686j4474O199J6952l954
$$ 65532 52982 34415 19812 -4548 5613 30699 51454 33768 19294 25493 42445 38491
18477C8491j9172P731J6810k5552j519J912j557j6931J3094L3909J1423j2497
$$ 38491 19319 27050 43860 18308 16789 18701 17144 213 13307 47216 58639 46142
18465D6142j7304M006M856J1445J7778k1166j8910p723r624q999K4590M8307J603
$$ 46142 28838 32844 37700 49145 66923 45757 26847 19124 9500 501 25091 73398 75001
18452G5001N471j1121j4497L758O486n699k262l045Q98K189P974N823P733j9737
$$ 75001 80472 69351 54854 58612 65098 59399 57137 54092 54990 57179 65153 70976 78709 58972
18438E8972k3907O23j331r229m513K199l056J7553N775j1623j3512k907J8633
$$ 58972 35065 35688 34357 25128 20615 22814 19758 37311 43086 31463 17951 15044 33677
18425C3677J3763j1708j5228N260K317n113N700O905j2507r444j432L3636k255
$$ 33677 47440 35732 20504 25764 28081 22968 28668 35573 23066 13622 12190 45826 43571
18412D3571j8399j7028N93J7182l858L82J7100J635J13j4985j9182j4612K6603
$$ 43571 25172 8144 8737 25919 22061 22443 39543 41178 41291 26306 7124 -7488 19115
18399A9115n93K1417J8876J2765j1819l2449j3300M352k2425j8324j0272K307
$$ 19115 18522 39939 58815 71580 59761 27312 14012 18364 -4061 -22385 -32657 -30350
18387c0350J2423J4832J5878j4540k1528K6587J1458J4878K2042J5361r308M499
$$ -30350 -17927 -3095 12783 -1757 -23285 3302 14760 29638 51680 67041 57733 62232
18375F2232m312k3604l143j3051l351M5811P600k8965J2543r688j4309K0778J2205
$$ 62232 57920 34316 31173 18122 14771 60582 68182 39217 51760 42072 27763 48541 60746
18362F0746q746K0130k1182k6543k158J9392L6224q635j8048k228j0411n456k1744
$$ 60746 52000 72130 50948 24405 22247 41639 77863 69228 51180 48952 38541 33085 11341
18349A1341L9637N7060L4928QM195K6739M6731J9772n180P246K2265j3391k4826
$$ 11341 50978 108038 142966 142974 147169 173908 220639 240411 235231 242477 264742 251351 226525
18336B26525O904Q519n957k6302j6573m8884l9900j6226k3371J3768O477L2061
$$ 226525 233429 241948 235991 209689 193116 144232 104332 88106 64735 78503 84980 117041
18324A17041J4321k1540m277J8415K4702M6529M9251N0385J09548J18780Q4679
$$ 117041 131362 109822 105545 123960 148662 195191 244442 294827 404375 523155 607834
18313F07834L7231m2653l3832o7758j15481n8274l5545m8334k9881J3996K6438
$$ 607834 645065 602412 568580 500822 385341 327067 291522 243188 213307 227303 253741
18302B53741N6523K2294K3547L8587P2482M9266O2890N8514L3739L566l0591o7128
$$ 253741 310264 332558 356105 394692 467174 516440 579330 637844 671583 675149 644558 577430
18290E77430r8208r4802p0783n0224m0314j9510l4922n1140k7276L375l1376N876
$$ 577430 479222 384420 313637 263413 223099 203589 168667 117527 90251 93626 62250 68126
18278F8126K2619J5920l724j2369M709M612m50K326N2670P3274Q8737J4019q605
$$ 68126 90745 106665 102941 90572 95281 99893 99443 101769 154439 227713 316450 330469 321864
18265C21864k0164k6734j6882J6028J8939j7406o5895m0764j6472j3588k893k3697
$$ 321864 301700 274966 258084 274112 293051 275645 209750 168986 152514 138926 136033 112336
18253A12336k4930r377K1593j4928k3336J8054K8909K220p908J076k4313l2915
$$ 112336 87406 78029 99622 84694 61358 79412 108321 110541 102633 103709 79396 46481
18241D6481J0681K0319q609R957j2802j7355P862K5330J9865j2976j1797J7065
$$ 46481 57162 77481 68872 78829 66027 48672 56534 81864 101729 88753 76956 94021
18229I4021J5632K566J7331Q847k217j3160K353K6884K1718K5153L3313J8550
$$ 94021 109653 112219 129550 138397 136180 123020 125373 152257 173975 199128 232441 250991
18217B50991J1341L2418J0272o709l8545k8405n2828m3673j5557j0308j2317K702
$$ 250991 262332 294750 305022 298313 259768 231363 178535 134862 119305 108997 96680 99382
18205I9382M1118M0483J2773O121k0561Q851K0413k6732j8809J7695l704k7567
$$ 99382 140500 180983 193756 199877 179316 188167 208580 181848 163039 180734 177030 149463
18193A49463j2143J9549J6870J5924j2209k4494K5564L3645L8700l874m1301j3400
$$ 149463 137320 156869 173739 189663 177454 152960 178524 212169 250869 246995 205694 192294
18181A92294k0436p118J088J8968M947k6844k9188l269J2531R315P57l2661O090
$$ 192294 171858 164740 165828 184796 189743 162899 133711 130442 142973 152288 153045 120384 126474
18168A26474M4241j3743j4053J5757K1814Q362K0298N8878P0600L5885j5634p2966
$$ 126474 170715 156972 142919 158676 180490 188852 209150 268028 338628 374513 358879 285913
18156B85913p5803k4923m56j263L6037J2887J1228J5068J6471K1646m560Q2438
$$ 285913 210110 185187 184731 183468 219505 232392 243620 258688 275159 296805 292245 374683
18144C74683R3643K7125m1802m2859m5454l5583j7034Q543K9534K5365j2562M0264
$$ 374683 468326 495451 453649 410790 365336 329753 312719 321262 350796 376161 363599 403863
18132D03863K6333J9766K2333L6981O0460R0819O7698R6445J29560J31628J86909
$$ 403863 430196 449962 472295 509276 569736 660555 728253 824698 954258 1085886 1272795
18121A272795K31254K50315M30603N70581O89134Q54951J137201J715362K967398
$$ 1272795 1504049 1754364 2184967 2755548 3444682 4299633 5436834 7152196 10119594
18112A0119594N301669R595030J6560613J8028886l696610j4874877j6153233
$$ 10119594 15421263 25016293 41576906 59605792 55909182 41034305 24881072
18105B4881072j0319518n079159k676266j654152j148152p66117n45881m53127
$$ 24881072 14561554 9482395 6806129 5151977 4003825 3237708 2691827 2238700
18097B238700l66265k79824k59742j90575j24419j34179j04111r9121o7495p4968
$$ 2238700 1872435 1592611 1332869 1142294 1017875 883696 779585 680464 612969 538001
18087E38001o7974m8659l8228l599k6116r463j1939r507p26j1494l9020l3539
$$ 538001 470027 421368 383140 379541 353425 343962 332023 322516 321790 310296 271276 237737
18075B37737j8897j2634J5925P577L494R347L0572L3100O402k0085k7978m2644
$$ 237737 218840 206206 222131 229708 233202 242549 273121 306221 312623 292538 264560 221916
18063B21916k6289k3121j8662j4003L1113M254k2685n805J9808J2058K983j4124
$$ 221916 195627 172506 153844 139841 170954 175208 152523 146718 166526 178584 181567 167443
18051A67443j0606k4533l8658P234J5205j8267q715J7002J4089o821k7735K7078
$$ 167443 156837 132304 93646 100880 116085 97818 89103 106105 120194 113373 85638 112716
18039A12716P204R589L134J9135k0670k3510k4466J37j1766k5775J8286J4745
$$ 112716 119920 129509 132643 151778 131108 107598 83132 83269 71503 45728 64014 78759
18027G8759K9718n750p751j4296n865o315L0210M4723j3708o535k221n645j0163
$$ 78759 108477 102727 94976 80680 74815 68500 98710 143433 129725 123190 120969 115324 105161
18014A05161k0397J393J1882K47J6779J8572n276m211J0864P477k5195r028j5759
$$ 105161 84764 86157 98039 98286 115065 133637 128361 124150 135014 142491 117296 108268 92509
18001I2509j7642m541J9074N4698l177j239J1194j6588l2324r765J9002J732m635
$$ 92509 74867 70326 89400 144098 140921 139682 150876 134288 101964 92199 111201 112933 108298
17988A08298j1643j1975J1998j151Q673K3334J9267L4554k221l3065j2650Q375
$$ 108298 96655 84680 96678 95527 104200 127534 146801 181355 179134 146069 133419 141794
17976A41794n23L6790j4652m5109o542K3348J4646j5800o378q459l8L8998j188
$$ 141794 141271 178061 163409 118300 111758 135106 149752 133952 127574 119115 119077 158075 156887
17963A56887L165L123k5159M250K5210J7734j8509k0364j0668j2038K3732l414
$$ 156887 160052 163175 138016 142266 167476 185210 166701 146337 135669 123631 147363 143949
17951A43949j5184Q849N850n824j2013k1880K4753K8015J862j0584j0121J6488
$$ 143949 128765 137614 143464 137640 125627 103747 128500 156515 158377 147793 137672 154160
17939A54160L4463L381r379J5923R467J3262J3427K245q775k0618k3511j8833
$$ 154160 188623 192004 182625 198548 208015 221277 234704 236949 228174 207556 184045 165212
17927A65212j1737K6639K8209M5950L586Q29j4495J6706K5417j4972j490P790
$$ 165212 153475 180114 208323 254273 257859 258688 244193 260899 286316 271344 269854 277644
17915B77644o296O586K5453n682K368J8988j3540j67j5769k4863L756K4919J5794
$$ 277644 271348 277934 303387 297705 300073 319061 305521 305354 289585 264722 268478 293397 309191
17902C09191j0166J0483J2597J6218M059j5603k684j1714Q916J8930K0122K8625
$$ 309191 299025 309508 322105 338323 342382 326779 324095 312381 321297 340227 360349 388974
17890C88974K3284K7787M4603J0750J4250K6199M7191K7842K8029L4440M1505
$$ 388974 412258 440045 484648 495398 509648 535847 583038 610880 638909 673349 714854
17879G14854M8653O1543P3003Q4947M6459N6212Q8668J05185J12699J22957J40207
$$ 714854 763507 825050 898053 983000 1029459 1085671 1174339 1279524 1392223 1515180 1655387
17868A655387K07293L05510M50622P53183J123467J375111J514392J368827O72726
$$ 1655387 1862680 2168190 2618812 3371995 4495462 5870573 7384965 8753792 9426518
17859I426518J27112o64188j015353r16123n13710J76791J006018J769842K126000
$$ 9426518 9553630 8889442 7874089 6957966 6444256 6621047 7627065 9396907 11522907
17850A1522907K502718K433845J161242L19139q30436k155705k412345k405504
$$ 11522907 14025625 16459470 17620712 17939851 17109415 14953710 12541365 10135861
17842A0135861k104005j611604j103482p16580m64325l07007k10840j44110m1896
$$ 10135861 8031856 6420252 5316770 4600190 4135865 3828858 3618018 3473908 3432012
17833C432012Q683Q7706J78575K71119L34961L98902N18208O56801Q88414J217903
$$ 3432012 3440695 3528401 3706976 3978095 4313056 4711958 5230166 5886967 6775381 7993284
17823G993284J658866K337559L477616N229968P479766R123502J0447803R971531
$$ 7993284 9652150 11989709 15467325 20697293 28177059 37300561 47748364 57719895
17815E7719895N778213J924559m211140p730224q591287p140853l707666K25883
$$ 57719895 63498108 65422667 61211527 53481303 44890016 37749163 34041497 34267380
17807C4267380L849672O380308R076217J1304812J2072865J5525828J7662679
$$ 34267380 38117052 44497360 53573577 64878389 76951254 92477082 110139761
17800A10139761R990374p700228k2841861k5866424k0235242j2824096p785759
$$ 110139761 120130135 112429907 89588046 63721622 43486380 30662284 22876525
17793B2876525n050309l458902k491632j812870j358233j173158r67515p17196
$$ 22876525 17826216 14367314 11875682 10062812 8704579 7531421 6563906 5846710
17785E846710n70371l88957k24003j22774o528J05955J88422J60028J1069j81002
$$ 5846710 5276339 4887382 4663379 4540605 4534077 4640032 4828454 4988482 4999551 4818549
17775D818549l10859l35656j94099o4475J03152K07621K49798K65276L10809M33173
$$ 4818549 4507690 4172034 3977935 3913460 4016612 4224233 4474031 4739307 5050116 5483289
17765E483289N50309P59937R70841J254419J743397K581153M109354O728751J0825245
$$ 5483289 6033598 6793535 7764376 9018795 10762192 13343345 17452699 24181450 35006695
17756C5006695J5756707J7099350R150622m664604j4000638j4822820j0211465
$$ 35006695 50763402 67862752 77013374 72348770 58348132 43525312 33313847
17749C3313847m555078K55967M344040Q074381J0676477J0580896P190931J121283
$$ 33313847 28758769 29014736 33358776 41433157 52109634 62690530 69881461 71002744
17741G1002744n487811j0221291j2006423j0854501q188522n346584l156723j693768
$$ 71002744 65514933 55293642 43287219 32432718 24244196 18897612 15740889 14047121
17733A4047121o96685M9196P17980J565551K794598M716072P490208J0456944
$$ 14047121 13350436 13399632 14117612 15683163 18477761 23193833 30684041 41140985
17725D1140985J2250762J1230362O840866M4418o752773j1181743j2353570j0774674
$$ 41140985 53391747 64622109 71462975 71507393 64754620 53572877 41219307 30444633
17717C0444633p942188n117645k972745j377427J0237J607489L386575M373154
$$ 30444633 22502445 17384800 14412055 13034628 13044865 14652354 18038929 22412083
17709B2412083K658449j420244m574263n218317m078760k567831j509720r21815
$$ 22412083 25070532 23650288 19076025 13857708 9778948 7211117 5701397 4779582
17701D779582o00910l93628l05471k46851k15908k34333k13964j66853j64603
$$ 4779582 4178672 3785044 3479573 3232722 3016814 2782481 2568517 2401664 2237061
17692B237061j72220j30331q9197n5564q8751j15082j44053j11349j37329j43166
$$ 2237061 2064841 1934510 1845313 1789749 1700998 1585916 1441863 1330514 1193185 1050019
17682A050019j13575j03952j22559o9581m2424l4159j7230j7471J2934Q711O110
$$ 1050019 936444 832492 709933 640352 597928 563769 546539 529068 542002 550713 556823
17671E56823n7817q0063l0933j0374l7116m073k709o598K7719L684r152L58R810
$$ 556823 499006 418943 388010 377636 340520 336447 333738 327140 354859 358543 349391 349749 359559
17658C59559l0423k6545o177l7447l4680q620J8073K9673M908J7207K1953j0485
$$ 359559 329136 302591 296414 258967 224287 215667 233740 263413 268321 285528 307481 296996
17646B96996j0896j4438R80k0195R799K0551j1826l4330j4984M306l8099m6836
$$ 296996 286100 271662 272642 252447 262246 282797 270971 236641 221657 225963 187864 141028
17634A41028p149R648k177J9400J394j0217m947J0381j8102l147j607k3152j2581
$$ 141028 133879 143527 141350 160750 162144 151927 146980 157361 139259 136112 134505 111353 98772
17621I8772J152l227m758J8876K5114r164j4620j8608J6132J9601n119j2016L241
$$ 98772 99924 96697 91939 110815 135929 126765 112145 93537 109669 129270 124151 112135 115376
17608A15376j3888k6612J1774P349K3871N267m909q604k7481j1824K024J2945
$$ 115376 101488 74876 86650 93999 117870 123137 118228 109624 82143 70319 72343 85288
17596H5288J6873M853o974K9295J8384j0894j5495k82J8773k4252l5066j8823
$$ 85288 102161 107014 100040 129335 147719 136825 121330 121048 139821 115569 80503 61680
17584F1680j5106j2921M067K706K1025j662l0864j6685K4647J3576j3937K1222
$$ 61680 46574 33653 37720 40426 61451 59789 28925 12240 36887 50463 36526 57748
17572E7748K9362q419J1466J5303q33j3016k6097j642Q202o595r210n696m997
$$ 57748 87110 78691 90157 105460 104627 91611 65514 63872 72074 65479 56269 50573 45576
17559D5576l620M617J9353L903l9928n48Q288J267J5353M4614L875j0293M000
$$ 45576 41956 46573 65926 69829 29901 29353 37641 38908 54261 98875 102750 92457 96457
17546I6457j0323o428m752k8052j8783J6098J775j6710k0381K4J4671j5700j4486
$$ 96457 86134 79706 74954 46902 28119 44217 45992 29282 8901 8925 23596 7896 -6590
17533f590m62J5899J571j1171J1640J6606P576P447O399M152J6012o845j4672
$$ -6590 -7052 8847 10418 -753 10887 27493 35069 42516 48915 53067 69079 62234 47562
17520D7562L128L5423J1140k6308m2294j4679M37P867K0277k40P831j6475r983
$$ 47562 50690 86113 97253 70945 28651 13972 14409 22276 42553 42313 50144 33669 23686
17507B3686l373K386R174K5009k053k381Q373j9507m3326K1111K0522Q208J2692
$$ 23686 20313 22699 31873 56882 54829 52448 60821 41314 -2012 19099 39621 47829 60521
17494F0521O502j1712K26J2998O523j7826p179O445J0321K6392M3766M1147j0717
$$ 60521 67023 55311 55537 68535 75058 57232 50053 56498 66819 93211 136977 178124 167407
17481A67407k4584K2920L5068N4096Q4594J28885Q0180n5537j08003j05859q4444
$$ 167407 142823 165743 200811 254907 339501 468386 548566 493029 385026 279167 194723
17470A94723n3311J348J7122k4482k3858p437J4241L8221P090J4091K3161k3293
$$ 194723 141412 142760 159882 135400 111542 104105 118346 156567 163657 177748 200909 177616
17458A77616L1329P7717J18558N7328l4452r9278r9189j03711m9798M287n00j2840
$$ 177616 208945 286662 405220 462548 428096 328818 229629 125918 76120 80407 79907 67067
17446F7067n101M5791Q2657R4047K4707n3664p2119m1784k0766j1960k3325k7113
$$ 67067 61966 107757 190414 284461 309168 255504 183385 141601 120835 108875 85550 58437
17434E8437j3333L642j7679R171j6946r56j94q183j3880J5777K3841j332L995
$$ 58437 45104 48746 31067 40238 23292 22336 22142 13959 79 15856 39697 38365 42360
17421D2360k3528J1513L9091o954k2013k5174M189p716J4205R995j9451k2579
$$ 42360 18832 30345 69436 62482 40469 15295 19484 11768 25973 35968 16517 -6062
17409f062J4122j6807M155P968j9563K229L172j3031R633j1122J4311K2604R061
$$ -6062 8060 -8747 -4592 3376 -16187 -13958 -10786 -23817 -14184 -25306 -10995 11609 20670
17396B0670J1813j2432J0592l490R464K7146J446K0340K5062J38J90L8735L9957
$$ 20670 32483 20051 30643 27153 36617 63763 65209 85549 110611 110749 110939 149674 189631
17383A89631P052K5601N2940P9966Q1667N2997M8465Q4269J26962J18585J25198
$$ 189631 196683 222284 275224 355190 436857 489854 538319 622588 749550 868135 993333
17372I93333P6513K1120p5251l9201l809L3021M7290j9812j16047j31796j24928
$$ 993333 1069846 1090966 1015715 976514 972705 1005726 1053016 1033204 917157 785361 660433
17361F60433n4171n5683m8421o9040q5235l9235k2720j8626j0804J2163J360L3374
$$ 660433 606262 550579 502158 433118 347883 308648 285928 267302 256498 268661 270021 303395
17349C03395K4990k5824k1967p174j4218R200j7405R112k1280l3324k9870l7563
$$ 303395 328385 302561 280594 273420 259202 268402 250997 260109 238829 205505 175635 138072
17337A38072l2701l9918o1992O51J7922P121n275k02K3990J9065P486j6743l0988
$$ 138072 105371 65453 3461 4112 22034 29155 23880 23678 47668 66733 74219 57476 26488
17324B6488j2517J9916L4610o049k8500l373K3169L8796K0320k926J8568L4789
$$ 26488 13971 33887 68497 62448 33948 30575 53744 92540 112860 109934 128502 163291
17312A63291J9707J8384j3028N080K5804K1051M3304J09452Q1382L1323J546m6671
$$ 163291 182998 201382 188354 193434 219238 240289 283593 393045 474427 505750 507296 460625
17300D60625q0023m1142n5542n9364j8337j9525k7851k152m8712l9209j6675j1986
$$ 460625 380602 339460 283918 224554 206217 186692 158841 156689 107977 68768 52093 40107
17288D0107j1320o633K5507K377k9884k3174N180J0712L4371O594K6375k0658
$$ 40107 28787 22154 47661 50038 20154 -3020 2160 12872 47243 53837 80212 59554
17276E9554k9394k310J6603J1134L6333J9448j7124j3374m9917l786J8547P965
$$ 59554 30160 27850 44453 55587 91920 111368 94244 80870 30953 27167 45714 53679
17264E3679K5622j0933n41J7320M6397K0979N4078K4579J3018R177J5357J5314
$$ 53679 79301 68368 67827 85147 131544 152523 206601 231180 244198 253375 268732 284046
17252B84046n585l6560m4815l8869l9075m9009p407R307k8711k9837j5878J277
$$ 284046 278461 241901 197086 158217 119142 70133 62726 72033 43322 13485 -2393 -1116
17240a116P48j9650N173R211j5668K6345J5341J399j9781j1627K605L3518K3188
$$ -1116 -368 -20018 -14845 -5634 -21302 5043 20384 21783 2002 -9625 -7020 26498 49686
17227D9686l737j9588k1358p698J5716Q577j8078m072j0059n792L5182P823J1880
$$ 49686 45949 26361 5003 -2695 13021 21598 3520 -552 -10611 -16403 18779 26602 38482
17214C8482J7677O126j7467L1361O1766M7851K5145L904M590k8030l7628m6827
$$ 38482 56159 62285 44818 76179 137945 185796 210941 214845 219435 191405 153777 106950
17202A06950n9302j8296m2965J3109M2487J1368k0907q140k1704k3727o158J0417
$$ 106950 47648 29352 -13613 -504 41983 53351 32444 24304 2600 -21127 -27285 -16868
17190a6868J6770K0279J6193J8242k566K003k1813O957K9429R436j2103k8408
$$ -16868 -98 20181 36374 54616 52050 54053 32240 39197 68626 78062 65959 37551
17178C7551k5547J781q171r302J5417L8581L0591J1590L4347J6150M3691N1471
$$ 37551 12004 13785 5614 -3688 11729 50310 80901 92491 126838 142988 186679 238150
17166B38150L3500P0285M8255j273j6117p9094q6774k5703l2735n2457k6318L127
$$ 238150 271650 341935 390190 388917 372800 293706 206932 181229 148494 96037 69719 72846
17154G2846j343J4889J2431J2737L8014K8963M3639O1652P9314L5887J3267l0226
$$ 72846 71503 86392 98823 111560 149574 178537 222176 283828 363142 399029 412296 382070
17142C82070n7874p9172m8868o1011m4363j0474j2820j5280j6284J7378J5581
$$ 382070 324196 245024 196156 135145 90782 80308 67488 52208 35924 53302 68883
17131F8883R522j4197q648L0830l7754o577L7953n001k2172j0145j9602n545J6715
$$ 68883 78405 64208 55560 86390 48636 42059 80012 75011 52839 42694 23092 17547 34262
17118C4262Q503l1438k6576j3692k109OJ2220j686J244K315K315K9437O815n888
$$ 34262 42765 11327 -15249 -28941 -31050 -31044 -18824 -20510 -19266 -16951 -14636 14801 21616 15728
17104A5728J624o978J564J7988K8047j1270k0958l5824j0436J9015K4471J5067
$$ 15728 17352 10374 11938 29926 57973 46703 25745 -10079 -20515 -1500 22971 38038
17092C8038J2134p591j6169p066K719J3570q374k377n963k5624M430J122O02J4001
$$ 38038 50172 42581 26412 19346 22065 35635 27261 24884 18921 -6703 -2273 -1151 -549 13452
17078A3452L032m694o009L3871p149m450M085J2952O704K7697L8011M361o156
$$ 13452 16484 11790 5781 39652 32503 28053 32138 45090 51794 79491 117502 121863 115707
17065A15707n048j3509k9791n6980J7047M7028K1233k639k9231n3037n019J3275
$$ 115707 110659 97150 67359 10379 27426 74454 95687 93048 63817 10780 5761 19036
17053A9036K3826J4523j922K545Q634J5050N7460L9479M303k6402k2009j312K9949
$$ 19036 42862 57385 55463 58008 66642 81692 139152 178631 182934 156532 134523 133211 163160
17040A63160P801m1855l0016o0346k209J7975L1047L9768k052j8717J0033K7300
$$ 163160 170961 129106 99090 38744 36535 54510 85557 125325 123273 104556 114589 141889
17028A41889K8197Q979j6555J957K3752J6368M063j2019m4831j7511P220J856
$$ 141889 170086 179065 162510 164467 188219 204587 208650 196631 151800 134289 141509 143365
17016A43365o565j4881J5635j5054j4601m542J3114J5692J7363J3875j8584M7
$$ 143365 136800 121919 137554 122500 107899 103357 116471 132163 149526 163401 144817 144864
17004A44864j711k2468j094P445Q108o69j1787J5687R276K6423k6558k9615q501
$$ 144864 143153 120685 119591 127036 135144 134475 122688 138375 147651 174074 147516 117901 109400
16991A09400L6599K7526J4103n948R239P881o646n444R013K1691J5275L8308Q893
$$ 109400 145999 173525 187628 181680 190919 198800 192154 186710 195723 217414 232689 270997 279890
16978B79890J4000L3571K5068j3716k2424l679o380J415j2252J2939O2621K9482
$$ 279890 293890 327461 352529 338813 316389 312710 306330 307745 295493 308432 371053 400535
16966D00535M329O121M8497N0145L9921L0319M7510N8693P6369O8246Q4370J35417
$$ 400535 404864 410985 459482 509627 549548 579867 627377 686070 762439 830685 915055 1050472
16954A050472J49657J41780R4120L2602M3432J25803J95850J73661J51933K01874
$$ 1050472 1200129 1341909 1436029 1468631 1512063 1637866 1833716 2007377 2159310 2361184
16944B361184K50272L20966L10345K93891M16558O33749R35672J292390J692679
$$ 2361184 2611456 2932422 3242767 3536658 3953216 4586965 5522637 6815027 8507706
16935H507706K327754L416356N353342Q927903J5139827K2767623K1680431M269610
$$ 8507706 10835460 14251816 19605158 28533061 43672888 66440511 88120942 92390552
16927I2390552j6056881k2582713j8584024j1163502n990409l529828k289017
$$ 92390552 76333671 53750958 35166934 24003432 18013023 14483195 12194178
16920A2194178j404598o19701k8314N03520J146824J980633L273992N425846R359010
$$ 12194178 10789580 10169879 10141565 10645085 11791909 13772542 17046534 22472380 31831390
16911C1831390J5831909K2369622J7387233j528872j8746867k1763924j6486533
$$ 31831390 47663299 70032921 87420154 85891282 67144415 45380491 28893958
16904B8893958r546050n287869l230477k115651j478069j137817r18131p38941
$$ 28893958 19347908 14060039 10829562 8713911 7235842 6098025 5179894 4440953
16896D440953n68005l90736k51971k37607l02344k16734j87715k61760l00225
$$ 4440953 3872948 3482212 3230241 2992634 2690290 2473556 2285841 2024081 1723856
16887A723856k28584j91509j52707r7307l3531K7566N2985P700m7372j40855j37262
$$ 1723856 1495272 1303763 1151056 1053749 1020218 1047784 1100769 1108469 1061097 920242 782980
16876G82980j27933r5331l3891m5948k5436m6181m2874j7252j6336L1507J6417
$$ 782980 655047 559716 525825 479877 454441 408260 365386 348134 331798 363305 379722
16865C79722n2243l4703l9595j0232J0620n771j8042j4521l4396k2516J881k639
$$ 379722 327479 292776 253181 242949 253569 247798 229756 215235 180839 158323 160204 157565
16853A57565m748N56j9551m923Q551K0668q664J51J314l4596n636K5045J0501
$$ 157565 152817 153373 133822 128899 137450 158118 149454 149605 150919 116323 110687 135732 146233
16840A46233J464M549J7581L6663K1383L154k2988l4285k1230k8082l9997J8099
$$ 146233 147697 152246 169827 206490 227873 231027 208039 173754 152524 124442 84445 102544
16828A02544L9555q608q589J992j7815k4929k1593P984K5921o414O308K2165O360
$$ 102544 142099 133491 124902 126894 109079 84150 62557 70541 96462 90048 96356 118521 124881
16815A24881L842j29O259m4545j4180J020Q849P258P84J774k503q598k721K785
$$ 124881 128723 128594 134853 90308 76128 77148 85997 93255 94039 95813 93310 84712 81991 84776
16801H4776K1452K997l093l0845l0264J0020j3931j4021o63j6284k562m942K2936
$$ 84776 106228 109225 106132 75287 45023 55043 41112 27091 26428 10144 7582 2640 25576
16788B5576p127N897j6776k7781K819K156m952K3841J5847J4273J2785m1723j9483
$$ 25576 18449 24346 7570 -20211 -17392 -15236 -20188 3653 19500 33773 46558 4835 -14648
16775a4648K1325K4156l3891j475K5900l03k3360m012q265j0191K5173O204J181
$$ -14648 6677 30833 -3058 -4533 21367 21064 -2296 -6308 -14573 -24764 409 6613 7794
16762G794L74j555J0454m696N693M380j1787r293J1827L605J6841j807m6062k5199
$$ 7794 8168 6613 17067 12371 18064 22444 10657 1364 13191 16796 33637 31830 -14232 -39431
16748c9431J4288L4812J9p781q631N833P193j6504M346k80l7615k961L5547J9512
$$ -39431 -25143 9669 9688 1907 -6724 -891 6302 -10202 -5856 -6136 -43751 -46712 -11165 8347
16734H347j7889k3201o345J6899J8768J1923N292k2807j4386m864j0850j4088
$$ 8347 -9542 -32743 -39088 -22189 -3421 8502 13794 -9013 -23399 -28263 -39113 -53201
16722e3201r322L0328L5186M585N307j4130l0515J7744J7890J6208J669M554k0999
$$ -53201 -62523 -32195 2991 7576 12883 -1247 -31762 -14018 3872 20080 21749 26303 5304
16709E304P210R520m545K1582q102k4118k1658N138Q059K1185j2175j1867n915
$$ 5304 12514 22034 17489 39071 30969 6851 -14807 -9669 -1610 19575 7400 -4467 -10382
16696a0382o421n985J1391J2019k019Q202k921J1728J484k0470n631j6447k4667
$$ -10382 -16803 -22788 -11397 622 -1397 6805 3884 15612 17096 -3374 -9005 -25452 -50119
16683e0119j2132p929K49J3890K9350K528l3776J696l245J6651M1391J1517j6765
$$ -50119 -62251 -70180 -69931 -56041 -26691 -24163 -57939 -56243 -59488 -42837 -1446 10071 -6694
16670f694j8725j6825J4073L3646J9501j3612L2243K695j6567j6335J3315J242
$$ -6694 -25419 -42244 -28171 5475 24976 11364 43607 46302 29735 13400 26715 27957
16658B7957j311j8023j2592J4579P726r582Q090Q736o039N083k5155N265l312
$$ 27957 26646 8623 -3969 10610 18336 8754 16844 25580 19541 24624 -531 4734 1422
16645A422n126M670M836J7184l739m6013J834P114J4326J8972k9307m3450j1752
$$ 1422 -3704 966 5802 22986 19247 -26766 -24932 -17818 -3492 15480 -13827 -57277 -69029
16632f9029J611k915L4253K8977J9610m366n095k6882K1073q238R536K1898J3138
$$ -69029 -67418 -70333 -36080 -7103 12507 8141 3046 -23836 -2763 -11001 -1465 20433 33571
16619C3571k8293k1634j4448l055M922K1754K054j6739J3021K096o803Q371K9857
$$ 33571 5278 -16356 -30804 -33859 -28937 -7183 -5129 -21868 -8847 -6751 -13554 -5183 24674
16606B4674k0550l5038Q904j0347p155j6875p675L923K9742J3227O461k2913L612
$$ 24674 4124 -30914 -22010 -32357 -39512 -56387 -64062 -60139 -30397 -17170 -10709 -33622 -30010
16593c0010K4851j794o552n255k4801m899j2107q38M2997j2220j4163L175N034
$$ -30010 -5159 -6953 -13505 -18760 -43561 -48460 -60567 -61405 -18408 -30628 -44791 -41616 -36582
16580c6582r059k1339q177m802J7606K5807L244r053j1791R802n473L7313J9704
$$ -36582 -45641 -66980 -75157 -79959 -62353 -36546 -33302 -42355 -54146 -44344 -49817 -12504 7200
16567G200k742j4215J4101Q913j8314j6667j2590j5808j1291K1094J4091R156
$$ 7200 4458 -9757 4344 13257 -5057 -21724 -34314 -50122 -61413 -40319 -26228 -17072
16555a7072j9604K0242K5083j9718P534J9943j1591k2035J9160q624j7747k978
$$ -17072 -36676 -16434 8649 -11069 -3535 16408 4817 -17218 1942 -6682 -24429 -27407
16543b7407K543l9026j7941J291J2986L1802J0587j278r918k748O009r710P864
$$ -27407 -24864 -63890 -81831 -80540 -67554 -35752 -25165 -26443 -36361 -39109 -33100 -42810 -34946
16530c4946N723l822P033P373n321O039o860Q015J590n689J0742l535m239j9075
$$ -34946 -29223 -33045 -26012 -18639 -23960 -17921 -24781 -16766 -15176 -20865 -10123 -13658 -17897 -36972
16516c6972J9153l256j3727k7765l112q264Q49K938J1033L941K049K0605K4944
$$ -36972 -17819 -21075 -34802 -62567 -65679 -73943 -73094 -70156 -59123 -55182 -53133 -32528 -7584
16503g584L344J5978l0896k5585j0246l833j419J3976K6900Q973j0189M528K333
$$ -7584 -4240 11738 -19158 -44743 -54989 -58822 -60241 -46265 -19365 -10392 -20581 -16053 -13720
16490a3720k3064M548L1384k8407j7727R262Q264J3967R309J1979r929k1053J3296
$$ -13720 -36784 -32236 -852 -29259 -46986 -37724 -29460 -15493 -6184 5795 -4134 -25187 -11891
16477a1891j2399L77Q884k6l1890q467J8724m442J681p09j5131P463O128k3247
$$ -11891 -24290 -23913 -15029 -15055 -46945 -55412 -36688 -41130 -39449 -40158 -55289 -47826 -41698 -64945
16463f4945O184K6368o003J6612K4073K2376k365k8523k6843m9229M651M2163
$$ -64945 -58761 -32393 -38396 -21784 2289 24665 22300 -6223 -33066 -82295 -77644 -35481
16451c5481O625n076Q685k2186p304P118J0429J0726K4647R557l0422J6059J6904
$$ -35481 -28856 -33932 -25247 -47433 -54737 -47619 -37190 -26464 -1817 7740 -22682 -6623 10281
16438A0281j06j4271m5800j0190r829J8540k2322k5778J5079K8673o86Q058K2898
$$ 10281 10175 -4096 -49896 -60086 -69915 -51375 -73697 -99475 -84396 -55723 -56409 -48351 -25453
16425b5453K4029Q096K6617k6283l1634j1823R655K987o827o304N039k0228j2694
$$ -25453 -1424 6672 33289 7006 -24628 -36451 -26796 -23809 -30636 -36940 -31901 -52129 -64823
16412f4823K7112k919R061R081j0869O154q625K1211l517p502k2950l1622N562
$$ -64823 -37711 -40630 -31569 -22488 -33357 -27203 -35828 -14617 -18134 -25636 -48586 -80208 -74646
16399g4646K9994R968J5096K7099M89j3068j2819J8901j2189j0916N731Q674r211
$$ -74646 -44652 -34684 -19588 7511 8000 -5068 -17887 1014 -11175 -22091 -16360 -7686 -16897
16386a6897L981J5046L1513l197K5784L1736L4172O8342R7913J19539Q2537k7044
$$ -16897 -12916 2130 33643 30446 56230 87966 122138 190480 288393 407932 490469 463425
16374D63425j17897r6467q8750o4312k4836J948j6387k6036l6155q295K5944L0571
$$ 463425 345528 249061 160311 95999 71163 73111 56724 30688 -5467 -13762 12182 42753
16362D2753K0218L0549K6710O4760J24959J14168N6604l1259j20883j14661p6502
$$ 42753 62971 93520 120230 184990 309949 424117 480721 449462 328579 213918 137416
16351A37416l9091k7829k5905r473j6144J2644K5394k2435j8142l664q158q464
$$ 137416 98325 70496 44591 35118 18974 31618 57012 34577 16435 12771 4613 -3851
16339c851j0552K6121n529j9088p048j7047O582L0306J1997j5446p367j8245k2889
$$ -3851 -14403 11718 6189 -12899 -19947 -36994 -30412 -106 11891 -3555 -10922 -29167 -52056
16326e2056J0149P698K3638J670j0828J1523J774k7356k492N995j3848J2823L2022
$$ -52056 -41907 -34209 -10571 -8901 -19729 -8206 -6432 -33788 -36280 -30285 -44133 -31310 712
16313G12P899k3197O473J4594Q468j1500J935K9677n500k6978l1193p896k3494
$$ 712 8611 -14586 -8113 6481 14949 3449 5384 35061 29561 2583 -28610 -36506 -60000
16300f0000J8240J4583j5188q982J4919M703k803J8187K0930J199j2473R318k3185
$$ -60000 -41760 -27177 -42365 -51347 -36428 -31725 -34528 -16341 4589 5788 -6685 2633 -20552
16287b0552l304R760j8832L2649J31m4198J7529K4836p284M837k4425J927k070
$$ -20552 -23856 -14096 -32928 -279 -148 -44346 -26817 -1981 -9265 -4428 -28853 -26926 -28996
16274b8996j1308L9396P703l4820j3052Q544k9922k5344O909j2330J9362K5104
$$ -28996 -40304 -908 6795 -28025 -41077 -32533 -62455 -87799 -80890 -93220 -73858 -48754
16262d8754j7852j7246K7677J7059L1294o386m826J0053j749j1717K4052L675
$$ -48754 -66606 -83852 -56175 -39116 -7822 -14208 -19034 -8981 -10730 -22447 1605 5280
16250E280l0636j1745k4048N616L1996n183k1141o541m97M2608N214r485Q35J5271
$$ 5280 -25356 -37101 -61149 -55533 -23537 -28720 -49861 -56402 -56899 -14291 -9077 -18562 -17727 -2456
16236b456p155J4859J8962j7702k1533j6806j5004J3125L3711j7291K62J7177
$$ -2456 -9611 5248 24210 6508 -15025 -31831 -46835 -33710 1 -17290 -17028 149
16224A49J0068j6759j7687J2344m94L335K3627k3602j5644J0064K8952K656J390
$$ 149 10217 -6542 -24229 -11885 -12379 -9044 14583 -9019 -24663 -14599 14353 17009 18399
16211A8399j653l848j3306j0290J5229n207j7839l3979O880L0347K0755k995J2447
$$ 18399 16746 12898 -408 -10698 4531 -676 -18515 -52494 -45614 -15267 5488 2493 14940
16198A4940J8308Q640j4493j6540j4900J4438l57k85m251l7240k5239J8033k683
$$ 14940 33248 41888 27395 10855 -4045 10393 10036 9751 5500 -31740 -56979 -38946 -41629
16185d1629l607L4823jj8302o673K2362J2104R578j6499l2870j5907K2566L2080
$$ -41629 -45236 -10413 -10414 -28716 -35389 -13027 -923 8655 -7844 -40714 -56621 -34055 -1975
16172a975K6305K106o318k7010j1938L798k4179K531K5044M2231j3732l3938r802
$$ -1975 24330 26436 20118 -6892 -18830 -15032 -39211 -36680 -11636 30595 16863 -17075 -26877
16159b6877q337l7535R825J9255K3679J3160J2864m857k695R394j7863N957L0139
$$ -26877 -35214 -72749 -62924 -43669 -19990 -6830 6034 1177 -1518 7876 -9987 -4030 26109
16146B6109k4233j5819p882j6394J6705N91k745Q265l4763l942L1152j8862k5865
$$ 26109 1876 -13943 -21825 -38219 -21514 -20923 -23668 -15403 -50166 -54108 -22956 -41818 -67683
16133f7683J9867J3538j8273j5837L4227M3459R223J1119J5221j2805o055P36
$$ -67683 -47816 -34278 -52551 -68388 -34161 9298 18521 29640 44861 32056 26001 26737
16121B6737k524l5485j3193J0999m41n622K3833m309m187J0201k405j8162r501
$$ 26737 24213 -11272 -24465 -13466 -13907 -19529 4304 -5 -4192 6009 3604 -14558 -24059
16108b4059J9927J0374J1183P365l533j3313J546l279o683K502R479l3391k5820
$$ -24059 -4132 6242 17425 24790 21257 7944 9490 6211 -472 2030 11509 -21882 -47702
16095d7702J606Q787K3161J9991k4743j1139J137o580j3996p84K7517J0479j2549
$$ -47702 -46096 -37309 -14148 5843 -18900 -30039 -28902 -35482 -49478 -50262 -22745 -12266 -24815
16082b4815P64j5052J3526Q811r204P406L6446L613k4544J537J83m743l226Q10
$$ -24815 -24051 -39103 -25577 -16766 -25970 -18564 17882 21495 -3049 -1512 -1329 -6072 -9298 -8488
16068h488j3240k3493J0067J5146K9668j6621R171M372j8081k9709J5740M7000
$$ -8488 -21728 -45221 -35154 -20008 9660 -6961 2210 6582 -11499 -41208 -25468 21532
16056B1532J1462j21l4743o5028P228L9779P674n715r445k3408J9392j184R749
$$ 21532 32994 32873 -1870 -66898 -59670 -19891 -12217 -17932 -27377 -50785 -31393 -32577 -22828
16043b2828K3956r574R320k3003n221p767K4335o923Q615K8164j8978J7379K8124
$$ -22828 1128 -8446 874 -22129 -27350 -35117 -10782 -17705 -9090 19074 96 17475 45599
16030D5599l1047J5976n719j0509l0736K8169j0533l4079N508L967K2559j956
$$ 45599 14552 30528 24809 14300 -16436 11733 1200 -32879 -27371 -23404 -845 -2801
16018b801L601j1718l6673J6100J1586p598o3R471L40p579R129K936j0325k6041
$$ -2801 800 -10918 -47591 -31491 -19905 -27503 -27566 -18095 -17755 -25334 -16205 -13269 -23594 -49635
16004d9635j5267J3036L828L1245K8091O254Q843K579k8446P40q08J2918J2209
$$ -49635 -64902 -51866 -48038 -16793 11298 17552 26395 28974 528 1268 460 13378 25587
15991B5587j2792J065p707j3313J51L476K3842J6947R242j4017K2450Q346j6024
$$ 25587 12795 13860 6153 -7160 -7009 -3533 20309 37256 46498 32481 54931 63277 47253
15978D7253j0515k3843k4782J9408L7481j7368l1273K656J0983j6101O431J2732
$$ 47253 36738 12895 -11887 7521 45002 27634 -3639 -983 10000 -6101 330 13062
15966A3062J8442m40n006q992j4770M46j6583o903L123M05k67j6971o917M966
$$ 13062 31504 31064 26058 17066 2296 2742 -13841 -20744 -17621 -17216 -17483 -34454 -41371 -36405
15952c6405O660K2681o805j75J0159J7283N032k6310m171p167l0910j85K6736
$$ -36405 -29745 -7064 -13869 -14044 -3885 13398 18430 -7880 -12051 -19218 -50128 -50313 -23577
15939b3577N571m026Q616M366J1759n868K5788q4j3395j963j440l7906k1612j1277
$$ -23577 -18006 -22032 -13416 -9050 2709 -3159 22629 22545 9150 7187 5747 -32159 -53771 -65048
15925f5048K8977O149J3584J9253J8642m751k9494j5787O61J7675j1957j2897
$$ -65048 -36071 -29922 -16338 2915 21557 16806 -12688 -28475 -27814 -10139 -22096 -34993
15913c4993k0373J9376R660J140M480J6468P120o938o751Q933N330J6907N208
$$ -34993 -55366 -35990 -26330 -25190 -20710 -4242 2878 -4060 -10811 -1878 3452 20359 25567
15900B5567k1440k6150J5226K804j7604j4502N996J6626n207k0334P735J9520
$$ 25567 4127 -22023 -6797 -3993 -21597 -36099 -30103 -13477 -18684 -39018 -31283 -11763
15888a1763J4345j0321j0721J3809l170m1628o908K3450J9169J3464J146j2828
$$ -11763 2582 -7739 -18460 -4651 -7821 -49449 -56357 -32907 -13738 -274 872 -11956
15876a1956Q92q345k9256O204J6134R67o447j4734K0773K8750m136j575n157l309
$$ -11956 -11064 -19409 -48665 -42461 -26327 -25360 -31807 -46541 -25768 2982 -1154 -2729 -7886 -11195
15862a1195P648j3876j883o584j2830J8649J9348J3011J8905j660j2991j2291
$$ -11195 -3547 -17423 -19306 -25890 -38720 -20071 -723 12288 31193 29533 16542 4251
15850D251k0485j6639j7211P549q271K3979J7249J9763q481l030R046M985Q40
$$ 4251 -16234 -32873 -50084 -42535 -50806 -26827 -9578 10185 1704 -1326 7720 12705 13545
15837A3545p992j1840m1832O001K5091L1300m482j7327o519J2878j641j4586m8440
$$ 13545 5553 -6287 -48119 -42118 -17027 14273 9791 -7536 -14055 -1177 -2818 -17404 -65844
15824f5844R66P097M137j1795J3804L7009M0888J930k1177Q834L06j3479J89q754
$$ -65844 -64878 -57781 -53644 -65439 -51635 -14626 26262 28192 7015 15849 16155 2676 2865 -5889
15810e889j4424p848q871L0606K0004k1560l545O377N976j4841J0104j7052M726
$$ -5889 -20313 -28161 -37032 -6426 13578 -7982 -11527 -5150 826 -14015 -3911 -20963 -16237
15797a6237j6117k9810J9230L1123o014j6294j9539j8857K5403K7589J7975N716
$$ -16237 -32354 -62164 -42934 -11811 -17825 -34119 -53658 -72515 -47112 -19523 -1548 4168
15785D168k0235j9210l554j1503O853J1577j1594M9008M2995j9354k468j2710
$$ 4168 -16067 -35277 -38831 -50334 -43481 -31904 -43498 5510 48505 29151 26683 13973
15773A3973J676m689l535j0556K25j8111j2329M756j6226j9807j0590J4358n85
$$ 13973 15649 10960 7425 -3131 -2906 -21017 -33346 -28590 -44816 -64623 -75213 -60855 -61440
15760f1440m507L7609O620J9096J8151k9547r986k589J2857r049m868J633J4766
$$ -61440 -65947 -28338 -21718 -2622 15529 -14018 -24004 -26593 -13736 -22785 -27653 -26020 -11254
15747a1254L842j1362j9273J0574K0671k3470R805L4635N636n184K982n465j963
$$ -11254 -7412 -18774 -38047 -27473 -6802 -30272 -20467 14168 19804 14620 17602 12137 10174
15734A0174l0010j0757k0636J2112N509j6470J1227N400p727N868J0590l710j0418
$$ 10174 -19836 -30593 -51229 -39117 -33608 -50078 -38851 -33451 -41178 -35310 -24720 -28430 -38848
15721c8848k5908J9345K5931K8748J543j5736l387j0796L32L384j6086J333k812
$$ -38848 -64756 -45411 -19480 9268 10811 -4925 -8312 -19108 -18776 -15392 -31478 -30145 -32957
15708c2957K2681m160j3387n595k304j9907r032j9450r743K7551K3404m629K7994
$$ -32957 -10276 -14436 -27823 -33418 -35722 -55629 -64661 -84111 -93854 -66303 -42899 -47528 -19534
15695a9534k5021j1245J0760L6533R302J0833R576r638J501o406j8463k7971L670
$$ -19534 -44555 -55800 -45040 -8507 795 11628 21204 11566 13067 6661 -11802 -39773 -36103
15682c6103K0017p250M420k694n99L42J6288J2377J1413Q11l315l07L692O80n340
$$ -36103 -16086 -23336 -18916 -21610 -22209 -21867 -5579 6798 18211 19022 15707 15400 19092 19772 14432
15667A4432j9873j29K0001j3412j1998Q100Q349N365k601K3525k6527j7457Q660
$$ 14432 -5441 -5570 14431 1019 -10979 -2879 5470 10835 8234 31759 5232 -12225 -3565
15654c565J7276J8389M902J2249j9874m2018l8283o1j974j636j270J7469J3732
$$ -3565 13711 32100 37002 49251 29377 -12641 -50924 -50985 -52959 -54595 -55865 -38396 -24664
15641b4664j4357K3811K6692P416K170k7008j6515Q354J6537J4300n434J3464
$$ -24664 -39021 -15210 11482 18898 21068 -5940 -22455 -14101 2436 16736 11302 24766
15629B4766n0863l1848K0242K7897p87m395J808j7084m601J1406L523j1421j7088
$$ 24766 -26097 -57945 -37703 -9806 -10593 -14988 -13180 -30264 -34865 -23459 -19936 -31357 -48445
15616d8445l416K4487K6559j3172j5054q777j2466K7254Q103m975o847J4943j3392
$$ -48445 -51861 -27374 -815 -13987 -29041 -37818 -50284 -23030 -14927 -19902 -26749 -11806 -25198
15603b5198m0722K8059N7399j1379k5281o0k0272p742J1564K2879K3171j7729
$$ -25198 -65920 -37861 19538 8159 -17122 -17182 -37454 -45196 -33632 -10753 12418 -5311
15591e311L2985J1594k9358L574p889q349J4054k173j0232J8215J5765K792m113
$$ -5311 27674 39268 9910 13484 5595 -2754 11300 9127 -1105 17110 32875 35667 31554
15578C1554k6413L6613q840j8928j0605J2065L1649J1968j368j5496j1818j7112
$$ 31554 5141 41754 32914 13986 3381 15446 47095 59063 57695 42199 30381 13269
15566A3269j9913O954J8959n578L294k493l9042Q646K9573q233J0208j3022J105
$$ 13269 -6644 310 19269 13691 16985 14492 -24550 -15904 13669 5436 15644 2622 3727
15553C727O789k9662j8689j8231J6700J3282R091J7503J1920o607k0886Q857K6723
$$ 3727 10516 -19146 -37835 -56066 -39366 -26084 -16993 510 12430 5823 -15063 -6206 20517
15540B0517O439J1435j8272k4829J800j9306O991J0695k1706K0887J8198k042
$$ 20517 26956 38391 20119 -4710 -2910 -22216 -15225 -4530 -26236 -5349 12849 10807
15528A0807l743k1898r803J5236J0270K9687j1177j6150K492K514o635O758R08
$$ 10807 7064 -14834 -24637 -9401 869 30556 19379 3229 5721 8235 1600 8358 9266
15515I266l94j9046l375K5064r205J2426K2276N06k3932j8707l252k314P383l307
$$ 9266 8872 -10174 -13549 11515 2310 14736 37012 37518 13586 -5121 -8373 -10687 -3304 -6611
15501f611j73J860k0848j8298R863K41j672k72J4780p366k1122j6919n846J6411
$$ -6611 -6784 -4924 -25772 -44070 -34207 -33966 -35638 -35910 -21130 -28496 -49618 -66537 -72383 -55972
15487e5972J4997Q327J8927P795j3042p50O13J7400J3649l392j2583L342J9182
$$ -55972 -40975 -32648 -13721 -5926 -18968 -19718 -19105 -1705 11944 8552 -4031 -689 18493
15474A8493J8514J9291J9588k3412l3293k0503k466o169m0815r687O887l861J7905
$$ 18493 37007 56298 75886 52474 19181 -1322 -3788 -9957 -50772 -60459 -53572 -57433 -39528
15461c9528L8349J7576j2798k980k0255Q343J1950l1666M490j6038N907j943J7837
$$ -39528 -1179 16397 3599 619 -19636 -11293 657 -31009 -26519 -42557 -36650 -38593 -20756
15448b0756K4111P86k0577r148n046J2240o546P248J4592N905L397l187j6912
$$ -20756 3355 4141 -16436 -25584 -30630 -18390 -24936 -17688 -3096 2809 6206 3019 -13893
15435a3893p740p347O096R00j7498J1332J7536m857j8093j4446M50Q467M613M34
$$ -13893 -21633 -28980 -22884 -21984 -39482 -28150 -10614 -15471 -33564 -48010 -47560 -39093 -34480 -34046
15421c4046j4912j7042J512K0581J4774J9194O543j1567j9404k7289J031j66j343
$$ -34046 -48958 -66000 -64488 -43907 -29133 -9939 -3396 -14963 -34367 -61656 -60625 -60791 -62134
15408f2134J1419N470j8958Q094L239R571J8143n458r628K2514L9241J1643l6340
$$ -62134 -50715 -45245 -64203 -56109 -52870 -43299 -25156 -30614 -40242 -17728 21513 33156 -3184
15395c184m0241l4537P859J4855M9443M0236K749N117k1993n3098o365J2739M8127
$$ -3184 -43425 -77962 -70103 -55248 -5805 34431 37180 42297 20304 -32794 -39159 -26420 21707
15382B1707K0251q850k5883j3455L027J3249J7224k0761j2165R277n857J5017
$$ 21707 41958 33108 7225 -6230 -3203 10046 27270 6509 -5656 3621 -2236 12781
15370A2781M447O97J2322j3641k1249k2748k0320j0798K6875o589M497k226J5655
$$ 12781 17228 17925 30247 16606 -4643 -27391 -47711 -58509 -31634 -38223 -33726 -35952 -20297
15357b0297n078Q624k4688j6139K3786J5245O490J450j1944r141J0557K2066j7739
$$ -20297 -25375 -16751 -41439 -57578 -33792 -18547 -12057 -10607 -22551 -31692 -21135 931 -16808
15344a6808J0871J6628O703n684l431J4227L436q149k5309l0170j2617o181n553
$$ -16808 -5937 10691 17394 11710 8279 22506 25942 17793 -7516 -37686 -50303 -56484 -62037
15331f2037M6898L1041j4293j9276j594j0103M723P285J973K908J2079k9057k830
$$ -62037 -15139 15902 1609 -17667 -19261 -29364 -24641 -17356 -15383 -12475 -396 -29453 -32283
15318c2283K1714j2340l2092J7562J6816M121J913J8584np99K217j982j3483p625
$$ -32283 -10569 -22909 -55001 -37439 -20623 -16502 -14589 3995 3990 3191 5408 3426 -10057 -17682
15304a7682J6624p255J4022n167J2707P336p411l5694n022J3488L714K4398J4081
$$ -17682 -1058 -8313 5709 542 13249 20585 13174 -22520 -27542 -14054 -10340 14058 28139
15291B8139K237k0006l326j4710k2597k1345J485J8501j4327j2044J4226L7656
$$ 28139 30376 10370 7044 -7666 -30263 -51608 -50123 -31622 -45949 -57993 -43767 -6111
15279f111L8569j9105p532O085m117P084R798r251j893j6943M370k09j9138n328
$$ -6111 32458 13353 5821 11906 7789 14873 24671 15420 13527 -3416 954 745 -18393 -23721
15265b3721K3377J969j2321j211R960n689j1052P653o327K282K9226K0266l2928
$$ -23721 -344 1625 -10696 -11907 -1947 -7636 -18688 -11035 -17362 -15080 14146 34412 1484
15252A484k0866Q655P470K1684O555R315K982j7328j5836m0246l2773j04K3881
$$ 1484 -19382 -10727 -3257 18427 24982 34297 37279 19951 4115 -36131 -68904 -69008 -45127
15239d5127K1970n76K4058J2988l051L379j3054j5456j9854k114L612R275J8084
$$ -45127 -23157 -23733 325 13313 10262 13641 587 -14869 -34723 -36837 -33225 -23950 -5866
15226e866J6638K1476p214p967J2169k8504j102R948r999J1048K5281o567k4256
$$ -5866 10772 32248 25034 17067 29236 732 -370 9578 -421 10627 35908 29341 5085
15213E085j0973j6967m0403k4589L4429J5963j0555P370J1683j3659j9236k3310
$$ 5085 -5888 -22855 -63258 -87847 -53418 -37455 -48010 -40640 -28957 -42616 -61852 -85162
15201h5162K7604K3653J2120m428j1711K1866K2319K3025j0286k3284k2818R223
$$ -85162 -57558 -33905 -21785 -26213 -37924 -16058 6261 29286 19000 -4284 -27102 -17879
15189a7879J1804L575j8452Q473M1522p62k7185l5644j7718n046m390J7098J2468
$$ -17879 -6075 -2500 -20952 -12479 29043 28281 1096 -34548 -52266 -57312 -61702 -44604 -32136
15176c2136k4435O022M909K343M408K3384O226K0076l0036q571Q640M6791J7952
$$ -32136 -56571 -50549 -45640 -43297 -38889 -15505 -9279 10797 -19239 -27810 -19170 27621 45573
15163D5573p048j8453j1553k1492K476K140k7454p144l975J2489L4315Q487J196
$$ 45573 38525 20072 8519 -12973 -10497 -8357 -35811 -42955 -46930 -34441 -126 8361 9557
15150I557l964j031j7780j9806J06J4170J7147j2823m0596P359J1960j8877M849
$$ 9557 5593 4562 -13218 -33024 -32918 -18748 -1601 -14424 -55020 -47661 -35701 -54578 -49729
15137d9729L7039P013r4p637K3951j3471j487K6668j0492q509k816j4614k3818
$$ -49729 -12690 -5677 -5771 -13408 10543 -2928 -4415 22253 11761 3252 436 -14178 -37996
15124c7996K346J1052j101P994p087k3600K0671m155M4520J8942j1224J472J7200
$$ -37996 -35650 -24598 -25699 -17705 -24792 -48392 -27721 -31876 12644 31586 20362 21834 39034
15111C9034K191m6790j7676o902J2956J5272k033l473k1451J1376K1322N245J299
$$ 39034 41225 -5565 -23241 -30143 -17187 -1915 -3948 -7421 -28872 -17496 3826 9071 10370
15098A0370k5138l0502J4695K191P030q367Q597K1998J2074r282k173M798j0976
$$ 10370 -14768 -45270 -30575 -28384 -21354 -29721 -21124 874 12948 3666 1493 6291 -4685
15085d685k757K3502N853j8032q990j4896j4902J6792R441o818J653O590p690
$$ -4685 -7442 16060 21913 3881 -5109 -20005 -34907 -18115 -8674 -15492 -13839 -7249 -14939
15072a4939j2824K8620L7276Q987j3065k4826o348j8351l303K8757k7520j1639
$$ -14939 -27763 857 38133 47120 34055 9229 2881 -15470 -18773 9984 -17536 -29175
15060b9175O971K9467J5359k0746Q239J8442J8046k1910k809j1004r590n55j2408
$$ -29175 -22204 7263 22622 1876 10115 28557 46603 24693 21884 10880 1290 735 -11673
15047a1673N447K5391N603J1426J4399L9164K4634k860R731P836M400j0528l3667
$$ -11673 -6226 19165 24768 36194 50593 89757 114391 111531 121262 129098 133498 122970 89303
15034H9303r882J8920J8783K9852M249o548j2932k097j3919k4964k0046k4115
$$ 89303 79421 98341 117124 146976 151225 144677 131745 129648 115729 90765 70719 46604
15022D6604k216k932q246M5O756q548r267k912K0208j064o1359j802K1547J1162
$$ 46604 44388 41456 33210 33255 40011 31463 22196 19284 39492 38428 -22931 -24733 -3186 7976
15008G976l380N985p191j8556K1106K1181K2573P971L2150M520k0857n667m816
$$ 7976 4596 10581 3390 -15166 5940 27121 49694 57665 89815 94335 73478 67811 62995
14995F2995J1780p0J4263N656K4617K3563L4881L5895J4941q612J8320K971j3296
$$ 62995 74775 74705 88968 94624 119241 142804 177685 213580 228521 219909 238229 241200 227904
14982B27904J7371J2599l62L6604l664m211L0897k059o150k9557j5896p651J1935
$$ 227904 245275 257874 257512 294116 290452 286241 317138 315079 308929 279372 263476 255825 267760
14969B67760K6004L103j4376l2875j1446q192O096J9983K020K8438Q928m708J3464
$$ 267760 293764 296867 282491 249616 238170 229978 236074 256057 258077 286515 295443 290735 304199
14956C04199n784k5261n730O590r629k6085r300P975J3098j7795j5208k5624k4621
$$ 304199 298415 273154 267424 274014 264385 238300 229000 236975 250073 232278 217070 191446 166825
14943A66825J1207j3771k6287m230m039J8919j6163l9317j4175j6016j9123r966
$$ 166825 178032 164261 137974 133744 129705 148624 132461 93144 78969 62953 43830 33864
14931C3864J3871K8832J624l511j2756j579K817p521n354p250m39j453k842K043
$$ 33864 47735 76567 78191 74680 61924 60345 63162 55641 50287 43037 42598 41145 38303 40346
14917D0346k2716J672K6618M373j6140j5370P969J053N780k5575j2285J3875j2661
$$ 40346 17630 19302 45920 50293 34153 18783 26752 27805 33585 8010 -4275 9600 -3061
14904c061p278J1200k139K0097J11k968o674m55n787J3847j0650k9468j0081m774
$$ -3061 -10339 861 -1278 18819 18930 15962 9288 8833 3046 16893 6243 -23225 -33306 -38080
14890c8080P205n895K0700J4764P093O669P342j6558k1397J20L2840N89N543J145
$$ -38080 -30875 -36770 -16070 -1306 5787 12456 19798 3240 -18157 -18037 14803 15392 20935 22080
14876B2080p898J0678P02Q824j8871N351p732r630O817M913m915q06l0069p467
$$ 22080 14182 24860 25562 34386 15515 20866 13134 3504 10321 15234 10319 9513 -20556 -28023
14862b8023J805l9036r795N7200Q732J0851K5324J524m98p110O950r838k5222
$$ -28023 -26218 -65254 -75049 -17849 -9117 1734 27058 28582 28084 20974 27924 18086 -7136
14849g136j528k479m729j4374K5350K8176M400K772M85r365m895j3278j6765k1475
$$ -7136 -8664 -11143 -15872 -30246 -4896 23280 27680 30452 30937 21572 16677 3399 -13366 -34841
14835c4841j1334M653J0547j219J8258J5678J4784K0464N323L915K642l691l238
$$ -34841 -46175 -41522 -30975 -32194 -13936 1742 16526 36990 42313 46228 48870 45179 41941
14822D1941L634R033J3334k4475j9950l2322p965J4666K5118m619J7463J0129
$$ 41941 45575 54608 67942 43467 23517 -8805 -16770 -2104 23014 18395 35858 45987
14810D5987J9331j774j7889K152p985j1512j3795J5736j279k1710j3204R228J0129
$$ 45987 65318 63544 45655 47807 39822 28310 14515 30251 28972 7262 -5942 3286 13415
14797A3415L0808k3504J67K4668j9510k0012j0629O390K652M20K1210L4045K1781
$$ 13415 44223 20719 20886 45554 26044 6032 -4597 1793 4445 4865 26075 60120 81901
14784H1901m0175k7934K9195O907j8811J9582J5234j1391k4782N316K0488q561
$$ 81901 41726 13792 42987 49894 31083 50665 65899 54508 29726 35042 55530 46969
14772D6969J3928K2717j02p800k0267j7110m307k0076o281J2034K6839O47L213
$$ 46969 60897 83614 83512 75712 55445 38335 34028 13952 7671 19705 46544 47191 50404
14759E0404Q337P238r553l0914k2005K5733L9964L978j0780k7676j2764N091r838
$$ 50404 58741 65979 56426 25512 3507 29240 69204 73182 62402 34726 21962 27053 17215
14746A7215q307M424p666Q966J243K0230o166m535J6241J6400k873k4160r024
$$ 17215 8908 13332 5666 14632 15875 36105 29939 25404 41645 58045 55172 31012 21988
14733B1988J5722n1l80J7110J3267R963k0850k1977L845K0987J0422j2925k494
$$ 21988 37710 37659 37279 54389 67656 77619 56769 34792 38637 59624 70046 57121 54627
14720E4627l7094n20R509L3254J3421Q7k9988J4317N623k7331N720J4058J2326
$$ 54627 17533 17013 26522 59776 73197 73284 43296 57613 63236 35905 41625 55683 68009
14707F8009J2833j9861j0831J0464J1133K698L882J8964J320P527j2499k3699
$$ 68009 80842 60981 50150 60614 71747 74445 78327 97291 98611 106138 93639 69940
14695F9940L057O466p194j2525K383K719j9140m652j3945R499K0173m155k690
$$ 69940 72997 79463 72269 59744 62127 64846 45706 41054 27109 36608 56781 52626 49936
14682D9936K097j9046j0717R847Q026J55K0254J3535R96n929R646K2895k314j1674
$$ 49936 52033 32987 22270 32117 40143 40298 60552 74087 75083 69154 78800 101695 99381 87707
14668H7707p264L55p909K35K6552M132L326J0200k4873k0842l637J4158Q655K1679
$$ 87707 80443 80798 72889 73124 99676 103808 107134 117334 92461 71619 67982 82140 90795 112474
14654A12474L820K652j2742j5460j3894K7729J5060J2533L265j1772j438J1300
$$ 112474 116294 118946 106204 90744 76850 104579 119639 132172 135437 123665 122227 133527
14642A33527J1126L32j8895m103Q607K7109J1810j4462k495J4464O156j979L38
$$ 133527 144653 144985 126090 121987 130594 157703 169513 155051 152556 167020 173176 171197 171535
14629A71535l043J4483J1306K3857J4504J123j050k646L923J4730J7247k056K0765
$$ 171535 168492 182975 194281 218138 232642 233765 232715 230069 233992 248722 265969 263913 284678
14616B84678M0727o194j4601J7544q564p831m39k2128j669L2579O2995J2485J058
$$ 284678 325405 319211 304610 322154 313590 305759 305320 283192 281523 314102 377097 389582 390640
14603C90640P240m568l46J1878K6778K0967L660j1557J4759K6815M0125L0704
$$ 390640 397880 393312 392966 404844 431622 452589 456249 444692 459451 486266 526391 557095
14591E57095L7353l361M6035N8246L4462K1875K3246L1624O2132P4141J14856
$$ 557095 594448 591087 637122 695368 729830 751705 774951 806575 868707 942848 1057704
14580A057704Q4279N4157J31441J73548J39969J23518R5228J9411l292J7117l553
$$ 1057704 1141983 1196140 1327581 1501129 1641098 1764616 1859844 1879255 1875963 1893080 1889527
14569A889527M4122R6947J23398J44672J62263J82609J71352K14126K47620K52451
$$ 1889527 1933649 2030596 2153994 2298666 2460929 2643538 2814890 3029016 3276636 3529087
14559C529087L30999L60167L98149M74046N22260N54516O11884O89320P78908
$$ 3529087 3860086 4220253 4618402 5092448 5614708 6169224 6781108 7470428 8249336
14550H249336Q97803J002269J118554J270140J420978J582129J784538J965662
$$ 8249336 9147139 10149408 11267962 12538102 13959080 15541209 17325747 19291409
14542A9291409K193145K430377K592131K768278K950908L035385L018811K939199
$$ 19291409 21484554 23914931 26507062 29275340 32226248 35261633 38280444 41219643
14534D1219643K843352K574351K239771J881495J493447J094336P48127L88208
$$ 41219643 44062995 46637346 48877117 50758612 52252059 53346395 54094522 54482730
14526E4482730J43589n9379k54959l33308l47410l41946k70829j55577r5553k9922
$$ 54482730 54626319 54566940 54311981 53978673 53631263 53289317 53018488 52862911 52767358 52737436
14516E2737436J02797J89610L11585L89819M32835M98187M95056M16018L05845
$$ 52737436 52840233 53029843 53341428 53731247 54164082 54662269 55157325 55573343 55879188
14507E5879188J16384j09148m25356p64564j205414j619428j989061k372174k705292
$$ 55879188 55995572 55886424 55461068 54696504 53491090 51871662 49882601 47510427 44805135
14498D4805135k934316l013382l036126k997989k915662k736653k545281k318694
$$ 44805135 41870819 38857437 35821311 32823322 29907660 27171007 24625726 22307032
14490B2307032k101149j896427j702315j562084j393926j262953j085770r45331
$$ 22307032 20205883 18309456 16607141 15045057 13651131 12388178 11302408 10357077
14482A0357077q47923p97870p19358o17134n43245n13602m92543m75617l98142
$$ 10357077 9509154 8711284 7991926 7374792 6831547 6317945 5825402 5349785 4951643
14473D951643l54021l71159l03215k74770k58383k50094k47408j99174j94426
$$ 4951643 4597622 4226463 3923248 3648478 3390095 3140001 2892593 2693419 2498993
14464B498993j91065j61956j29907j19904j13738r6630q1006j26134q7984q2415
$$ 2498993 2307928 2145972 2016065 1896161 1782423 1685793 1604787 1478653 1390669 1308254
14454A308254o7180r3872o7640o1148n2303l3109k8696o0379k9560l2354k489
$$ 1308254 1241074 1147202 1079562 1018414 966111 933002 904306 843927 814367 782013 779524
14443G79524m7765l4215j4133l3615l4635l8763j3346j2911l2232p817j416m963
$$ 779524 731759 697544 683411 649796 615161 576398 563052 550141 517909 510092 508676 503713
14431E03713k3602l5179k6485P555J0026k6541m4600r061j8321j294j0834L264
$$ 503713 480111 444932 418447 426002 436028 409487 364887 355826 337505 336211 325377 328641
14419C28641J244K05l1239l8729k6553J927J5422j2376l3821j6015L3187K2287
$$ 328641 329885 330090 298851 260122 233569 235496 250918 238542 204721 188706 221893 244180
14407B44180j7089J7504J3408r634l3573j735q575r620j6086J3472J9205K9542
$$ 244180 227091 244595 258003 248369 214796 213061 204486 194866 178780 192252 211457 240999
14395B40999q304l2726k5793q352J243j2654j3121K253M4328K4897k3110k227
$$ 240999 232695 199969 174176 165824 167067 154413 141292 143545 187873 212770 189660 187433
14383A87433k7155q249j1665j0872r011O561K0515L36k3925r032J35r889J3879
$$ 187433 160278 152029 140364 129492 120481 127042 147557 147893 123968 114936 115071 105182 119061
14370A19061K87l7675n506J0408N284J783J4642K512O999j0238M979J6511J2k0375
$$ 119061 119348 81673 76167 86575 91859 93642 108284 110796 117795 107557 112536 129047 129059 108684
14356A08684j9434N496J6256L511k1073m298J8792L874J366j4546j3052N872r660
$$ 108684 89250 94746 111002 114513 93440 89142 107934 111808 113174 98628 85576 91448 81788
14343H1788j1276J017K9975J7510J7479j0869j6366r892L380l5803m4003k0733
$$ 81788 70512 71529 101504 119014 136493 125624 109258 99366 102746 66943 22940 2207
14331B207J8698p71Q48J5296J2347J5620K1163l2496j4990K784j1852l0766M3878
$$ 2207 20905 20134 20982 36278 48625 64245 85408 52912 37922 40706 28854 -1912 41966
14318D1966M4276p391J980J832K4914l8437M163j2997J193K6856J2820O188p127
$$ 41966 86242 78851 80831 82663 107577 69140 73303 60306 61499 88355 101175 107363 100236
14305A00236k4470n331k9270j9777m418R162j3097j2710L4513k782j0060J4131
$$ 100236 75766 70435 41165 21388 16970 26132 13035 325 34838 32056 21996 36127
14293C6127O678J0812K2388j2148r993K353O740J415k735M306K0l401p28n525
$$ 36127 42805 53617 76005 63857 53864 56217 62957 64372 61637 65943 65963 62562 61834 56309
14279E6309q612k1058o517k2266K2074J3834Q80N953J823K5350L1984m174m534
$$ 56309 47697 26639 20122 -2144 19930 33764 34644 40597 42420 67770 99754 95580 91046
14266I1046O153k2742j9148L925P564r13j5067J0662N819K2179J635j9360m7563
$$ 91046 97199 74457 55309 59234 66798 65885 50818 61480 67299 89478 91113 71753 24190
14253B4190k4883k366J9533p333o789K182K0375J8059J8002j3375j5510R069l280
$$ 24190 -693 -3059 16474 9141 2352 4534 24909 42968 60970 47595 32085 41154 37874
14240C7874k8022j4293K0766J7228q263R55j0845k5705j664J609J318R778j0390
$$ 37874 9852 -4441 16325 33553 25290 26245 15400 -10305 -11969 -10360 -9042 736 -9654
14227i654J6173k555k6018k8749K6749J7723K5302M102P501j6239j0245j7850
$$ -9654 6519 3964 -22054 -50803 -24054 -6331 18971 23073 30574 14335 4090 -13760
14215a3760K5084K2113J770K6381p987m5718k2561j1405m820L0693M9720K152
$$ -13760 11324 33437 35207 61588 53601 7883 -14678 -26083 -30903 -210 49510 51662
14203E1662o960k953J0681k0803k1591J2227K7311L872j3825l3662l8310r587
$$ 51662 44702 41749 52430 31627 10036 22263 49574 53446 39621 5959 -32351 -41938
14191d1938K7177L3992J9421N425j930K1066q213k3439j7001p985J4828o114k0385
$$ -41938 -14761 19231 38652 44077 42147 63213 55000 31561 14560 6575 21403 15289 -5096
14178e096J4291R625J892J4324j274k4942p713J3322k0433J1254J9703k1885l3135
$$ -5096 9195 18820 20712 35036 33762 8820 1107 14429 -6004 5250 24953 3068 -30067
14165c0067K4312p617j1952L653J3370J1877P08j7766n748R537K9603J8158N290
$$ -30067 -5755 -13372 -25324 -21671 -8301 3576 4284 -13482 -19230 -9693 19910 38068 43358
14152D3358j9169m1227J1778K0927J0761L297j3723k0959N10K7870n904q196k1622
$$ 43358 24189 -17038 -5260 15667 26428 29725 16002 -4957 -4447 23423 17519 9323 -12299
14139a2299k5009Q587K3948J0827j1518J581R947J3856N042L3126k2335k4084
$$ -12299 -37308 -28721 -4773 6054 -5464 -3883 6064 19920 24962 58088 35753 11669
14127A1669k4645j0688k781L2937L4123N204J076j7717k3859O545P294n435q65
$$ 11669 -12976 -23664 -26445 6492 40615 45819 46895 29178 5319 11864 19158 13723 12858
14114A2858j3521M358J1785J3172l0504l6400N63K1067J6496L2350j9991q398
$$ 12858 -663 3695 15480 28652 -1852 -38252 -37689 -16622 -126 32224 12233 3835
14102C835L6664L1797J3007k4234P574N653l1463M445L1421k4862P716k379K3182
$$ 3835 40499 72296 85303 61069 68643 74296 42833 47278 78699 53837 61553 59174 82356
14089H2356P363j3024k0804J7767K0976K8678J8770K654J2036L5536J6577R358
$$ 82356 89719 76695 55891 73658 94634 123312 142082 144736 156772 192308 208885 218243
14077B18243Q708R045J2159L3178L7154P242m177Q423l6183m6752q467K7373L3685
$$ 218243 226951 235996 248155 281333 318487 325729 321552 329975 293792 247040 238573 265946 299631
14064B99631K5924M964k6181O691K9642O932K859j5987N549l766Q050J7674j802
$$ 299631 325555 330519 304338 311029 340671 347603 350462 334475 340024 336258 344308 361982 360180
14051C60180r825R067J0633j5242j4228j7405l8087r859j3549k4759l2186j3477
$$ 360180 350355 359422 370055 354813 340585 323180 285093 275234 261685 236926 204740 191263
14039A91263p544o576p804j5160j9766j9203j985L1685O049l8405j0851j4737
$$ 191263 183719 177143 169339 154179 134413 115210 113225 144910 150959 112554 101703 86966
14027H6966M284J2139M656j4624k6022m756J3745N966l4359k0161k5556o077J694
$$ 86966 91250 103389 108045 93421 67399 62643 76388 82354 47995 27834 2278 -3799 -2105
14014b105J4269L380k9961l343J9110L3164p395L795J0015k1713k9115j9642J6242
$$ -2105 12164 15544 -14417 -17760 1350 34514 27119 30914 40929 19216 -9899 -29541 -13299
14001a3299J1716K7104o810k103J0879M81j3625K7887J59J4607j74j7314o059
$$ -13299 -1583 25521 18711 16608 27487 27968 14343 42230 42389 56996 56822 39508 33449
13988C3449o363j9915K656N284J7113m830O77k0615J1853o62j6693Q010P047l685
$$ 33449 27086 7171 9827 15111 32224 27394 28071 7456 19309 18647 1954 9964 17011 13326
13974A3326J7114K2580j1993p246L6453M2845r395k8808l5810j1201R132j0147
$$ 13326 30440 53020 41027 33781 70234 113079 103684 74876 39066 27865 36997 26850
13962B6850l1141o464K9781K4574J4899r993j9365o557n469O351j1377J1978N808
$$ 26850 -4291 -10755 19026 43600 58499 48506 29141 22584 17115 23466 12089 24067 29875
13949B9875k2946l860K417P48J7671J8532J853l758p398p459J0725J1648j5759
$$ 29875 6929 3069 5486 6234 23905 42437 44290 40532 33134 25675 36400 48048 32289
13936C2289N652r591O048N593O483r859M716k1049n35L388n992l723l7627P503
$$ 32289 37941 28350 34398 39991 46474 36615 41331 20282 19747 23135 17143 13420 -24207 -16704
13922a6704N526l9143j187K2124K426J2687L6252j458J7017o989n524j3998j6419
$$ -16704 -11178 -50321 -51508 -29384 -26958 -14271 21981 20523 37540 30551 25027 11029 -5390
13909e390k4442k0811J3328J0060Q570K1753O456K7648l714k6809k1758k5157
$$ -5390 -29832 -50643 -37315 -27255 -18685 3068 9524 37172 33458 6649 -15109 -40266
13897d0266K515K4033N469J5578K7806p444j6043r642j6734J4293N342n266j3272
$$ -40266 -37751 -13718 -8249 7329 35135 27691 11648 2006 -14728 -435 4907 -359 -13631
13884a3631J6985m471o840K0797j3786k4165K977J2018K4529L0948r930j7898
$$ -13631 3354 -1117 -7957 12840 -946 -25111 -22134 -10116 14413 45361 35431 17533
13872A7533m412k082q371J9374m181R889Q127o743k4786l121L845j0150l783l077
$$ 17533 13121 11039 2668 22042 17861 27750 35877 29134 4348 1227 5072 -5078 -8861 -11938
13858a1938j0726j74R598j3057l2114m048K1974K6682K68j9336J9042L890J9930
$$ -11938 -22664 -22838 -13240 -26297 -58411 -62459 -40485 -13803 -13535 -32871 -13829 -9939 9991
13845I991Q03m399J0128k6130q226K861k537L516Q711J6167l5404M467J5350P955
$$ 9991 10794 6395 16523 -9607 -17833 -14972 -17509 -13993 -5282 10885 -24519 -20052 -4702 3253
13831C253L1134p540j5565j1497p722L1380Q796k3277j7825j381k2819k2439j5589
$$ 3253 34387 26847 11282 -215 -7937 23443 32239 8962 -8863 -10244 -33063 -55502 -71091
13818g1091R475J190K1625r100Q782j1827J603J9043K6550K9021J9125m158K685
$$ -71091 -61616 -60426 -38801 -47901 -39119 -50946 -49343 -30300 -3750 25271 44396 40238 42923
13805D2923P070J1117j1257l2226j4441j2374q080J5359J0126M392k2926M199
$$ 42923 49993 61110 49853 17627 3186 -9188 -17268 -1909 8217 12609 -10317 -6118
13793f118m094n310J0098k7893j9208J2455j1731j3917L4714L2675J3346k3598
$$ -6118 -10212 -15522 -5424 -33317 -52525 -40070 -51801 -65718 -31004 1671 15017 -8581
13781h581j5131j7996K4529J1097r980l6862J0201J3419j0501k5682j5183K9042
$$ -8581 -23712 -41708 -17179 -6082 -16062 -52924 -42723 -29304 -39805 -65487 -80670 -51628
13769e1628J7456q56J3233n953R762n493j0346k288K9171K8319j4419j7621l517
$$ -51628 -34172 -35028 -21795 -27748 -17986 -23479 -33825 -36113 -6942 21377 6958 -10663 -14180
13756a4180j1590j4521K119K7511J3002k678q287R509l309k157J2032J0472p990
$$ -14180 -25770 -40291 -38172 -10661 2341 -337 -8624 885 -2424 -4581 7451 17923 9933
13743I933n878o076l0330j388K0698L7737P151k0277Q250N853q833k123k0250
$$ 9933 4055 -2021 -32351 -33739 -13041 24696 31847 11570 19820 25673 16840 14717 -5533
13730e533j7173J9179l2949k0596L5176M1968O865M7J7011j801P945j4633j6524
$$ -5533 -22706 -3527 -36476 -57072 -21896 20072 26937 26984 43995 42194 50139 35506 18982
13717A8982k3264K6100J0843J158j0326n487k0300k3961K0608n239m310k200m011
$$ 18982 -4282 21818 32661 33819 23493 18006 -2294 -26255 -5647 -10886 -15196 -17396 -21407
13704b1407o401j5356J7647K4641J6809L351j0977n924K9412J3639j7001k8402
$$ -21407 -27808 -43164 -25517 -876 15933 19284 8307 2383 31795 45434 28433 31
13692C1M656J964J1538O992j1764k4674L038J8723J6228k742j6932L569j467L2280
$$ 31 4687 6651 18189 25181 13417 -11257 -8219 10504 26732 23990 7058 10627 9160 41440
13678D1440o448k3089J4113l518j3180l1242K0245L2562N604P934J2219p636k1255
$$ 41440 34992 11903 26016 22498 9318 -21924 -1679 30883 36487 44421 56640 49004 27749
13665B7749l0558j4426J8759K0533j1214o480o375j0067l1109m544J4184Q749
$$ 27749 -2809 -17235 1524 22057 10843 4363 -2012 -12079 -43188 -47732 -33548 -24799
13653b4799N2238K0197k13j1755j1486p226M678M480m744k246J587J3154k3730
$$ -24799 27439 47636 47423 35668 24182 16956 21634 26114 21370 19124 20711 33865 10135
13640A0135r776J1192K3383j6055k5973m098R61N042J6391l867p890R77J3153
$$ 10135 359 11551 34934 18879 -7094 -11192 -10231 -5189 11202 7335 -555 422 13575
13627A3575r853J3968J4709j0657j4700k0936N911j024K1748L4559K6042j3133
$$ 13575 3722 17690 32399 21742 7042 -13894 -7983 -9007 12741 47300 73342 60209
13615F0209j2467k346j4993k2454j8751J8706R706q309J836J4248J9302q623p92
$$ 60209 47742 45396 30403 7949 -10802 7904 17610 9301 11137 25385 44687 36064 35272
13602C5272l296p587p3m553K1081K3722Q833j4505R553J6492k947K5588L112K8806
$$ 35272 31976 24389 24316 19763 40844 64566 73399 58894 68447 84939 81992 107580 110692 139498
13588A39498Q3199M9806N5899Q1722J62624K59323M48811O25734N97493K05480
$$ 139498 222697 272503 328402 410124 572748 832071 1280882 1906616 2504109 2709589
13578B709589k92277n98505n76498m24580k57648j50619r2860o1991n4088k0621
$$ 2709589 2417312 1818807 1242309 817729 560081 409462 316602 254611 200523 179902
13568A79902j2408j4044k931k4935j7162j0241l1229q324M730j0245j4895n407
$$ 179902 167494 153450 150519 125584 108422 98181 66952 58628 63358 53113 38218 32811
13556C2811k6251P459O945L381N435j3837o221K019p17k2184n755J0366K302L196
$$ 32811 6560 14019 20964 24345 29780 15943 9722 11741 11024 -11160 -16915 -6549 -4247 -1051
13542a051L7064j3783m919j7309k0865O233N209K9509K406j9159k42J5135J7979
$$ -1051 36013 22230 17311 2 -20863 -14630 -9421 20088 22494 3335 3093 18228 36207
13529C6207n175k0577k563K018Q031J0844l542j1846O744J7005r999o448O943
$$ 36207 31032 10455 7892 9910 17941 28785 25243 13397 20141 37146 27147 20699 27642
13516B7642O756j5k1606k481j7740j7199K7518K8039J8077k0378j4908J8402N291
$$ 27642 34398 34383 12777 10296 -7444 -24643 2875 30914 48991 28613 13705 32107 37398
13503C7398k212j1824J0390j0434j7382J1433n971j5842j3934j0147L9525J0675
$$ 37398 35186 23362 33752 23318 5936 17369 11398 -4444 -18378 -28525 11000 21675
13491B1675j2633m480J9851L858L299j2390J3610o184l4616N66J0323P626J6240
$$ 21675 9042 4562 24413 28271 31570 19180 32790 26606 -8010 -7444 2879 10505 26745
13478B6745J952k5861K0499K7241J2682P077q004J3070j065j7137k0170j4694
$$ 26745 28697 2836 23335 50576 63258 70335 62331 75401 74336 57199 37029 22335
13466B2335P678J6583J6103L259l5286k543l2876O305K6110K1510j952j1541M120
$$ 22335 30013 46596 62699 65958 30672 28129 -4747 1558 27668 49178 47226 35685 39805
13453C9805p429k8334q611j4037K813J0939Q859l991L6505N158o765R757J6639
$$ 39805 32376 4042 -4569 -18606 -15793 -4854 4005 14 36519 41677 34912 44669 61308
13440F1308K361o371k7656k4643o564j8373K5010k928j1289p230j6598Q709L656
$$ 61308 63669 57298 29642 4999 -1565 -19938 5072 2144 -9145 -16375 -32973 -24264 -20608
13427b0608j0446k3399Q943J4700K0905N115O706L7204n596l302J0309k9141r83
$$ -20608 -31054 -54453 -45510 -30810 -9905 -4790 1916 39120 33524 30222 40531 11390 10407
13414A0407L4504L351N108J863l1647o124J8294J1868J7217K3402L0297Q94O958
$$ 10407 44911 48262 53370 55233 23586 17462 35756 47624 64841 88243 118540 119434 126392
13401A26392J4507N3428Q9074P4669J3130k4715l7442n0450j05318m4675l5989
$$ 126392 140899 194327 283401 358070 371200 346485 309043 258593 153275 108600 72611
13390G2611k2191k6064p738J235L02J692K9271J5978R267j5039j0685k6817j5611
$$ 72611 50420 24356 16618 17853 18155 19847 49118 65096 74363 59324 48639 21822 6211
13377F211j3526J0273L314o961m606M721J1456L9079L758K4686M090l4973P343
$$ 6211 -7315 2958 6272 -689 -5295 -574 10882 49961 53719 78405 82495 47522 54865
13364E4865J4735j0306l8411k0530L6716J628K6149L8153P529M985j7539j0525
$$ 54865 69600 59294 20883 353 37069 38697 64846 102999 110528 115513 97974 87449
13352H7449m5999l8182j1234J4959L8885K7803k0163l1574j4785j849J6585K6070
$$ 87449 41450 3268 -7966 6993 45878 73681 53518 21944 7159 5310 21895 47965
13340D7965J4446o356j108m437j3080j4554j5291k9512l215K0974R631M4220M1019
$$ 47965 62411 56055 54947 50510 37430 22876 7585 -21927 -25142 -4168 5463 49683 90702
13327I0702J7127m330n023K8102P759n187m0535l7460k1648L1369J4930M459J4261
$$ 90702 107829 103499 98476 126578 134337 129150 88615 51155 29507 60876 75806 80265 94526
13314I4526j0358M054l988K0236j4042l9895J3966J8781J2173j638j1826O442
$$ 94526 84168 88222 84234 104470 90428 50533 64499 83280 95453 93815 81989 88431
13302H8431N705j488j4161N244P325L92M03M851J3010M0836J9698r887j6638J1049
$$ 88431 94136 92648 78487 83731 91056 91448 91851 96702 109712 150548 170246 160359 143721 154770
13288A54770J5626J6968j7587k986K2103L6159o600l661k2348k4194J6742k608
$$ 154770 170396 187364 169777 166791 188894 225053 218453 214792 192444 168250 184992 182384
13276A82384J4844K2673o148p2304p6523l1749K4360O6513Q3509N2992J2053P313
$$ 182384 197228 219901 213753 141449 64926 33177 57537 124050 207559 260551 272604 279917
13264B79917J3786J9572J74l590O763K8818n564p943j3584m222J9462k1437J241
$$ 279917 293703 313275 313449 309859 316622 345440 339876 331933 318349 314127 333589 312152 313393
13251C13393j7509k1633k4067l3725K9789J9871J2364k3501r978j7729j7657P390
$$ 313393 295884 274251 250184 216459 246248 266119 278483 254982 245004 227275 209618 217008
13239B17008Q05J8205J2627j5679K2374M4042K8933o204q902J2596j4457l5036
$$ 217008 217813 236018 248645 232966 255340 299382 328315 322111 313209 325805 311348 276312
13227B76312n528j4365j3481P557J8739L7917J1278L2932M7850O846j8424j5050
$$ 276312 270784 256419 242938 250495 269234 307151 318429 351361 399211 406057 387633 372583
13215C72583Q779N107J1918K6669K6588j694K0784K5747L4559K8861J8440j9926
$$ 372583 381362 386469 398387 425056 451644 449950 470734 496481 531040 559901 578341 558415
13203E58415J4917J8952M1100K4060L7888M8645L5673K3331J7025L1519O2864
$$ 558415 573332 592284 633384 657444 695332 743977 779650 802981 820006 851525 914389
13192I14389K0129j4537j6993j2258K3643K9407Q0969J10822R8847Q2197Q8091
$$ 914389 934518 919981 902988 890730 914373 943780 1024749 1135571 1234418 1316615 1404706
13181A404706J24192J02542O2013M6059O0134Q8023J74651K46858K68861L21522
$$ 1404706 1528898 1631440 1693453 1739512 1799646 1887669 2062320 2309178 2578039 2899561
13171B899561L94926M68093M80486M03043K84286K32506K74608M02934N82017
$$ 2899561 3294487 3762580 4243066 4646109 4930395 5162901 5437509 5840443 6422460
13162F422460Q84768J138184J432417J757007K272081K963703L654010M370157
$$ 6422460 7307228 8445412 9877829 11634836 13906917 16870620 20524630 24894787
13154B4894787N360494O716766Q358674J0912156J5929186K6051999M4663823
$$ 24894787 30255281 36972047 45330721 56242877 72172063 98224062 142887885
13147A42887885P6488616J18880160J28073652O4726098l2666873j14911385j23413565
$$ 142887885 219376501 338256661 466330313 531056411 498389538 383478153 260064588
13140B60064588r2704967n4930455l0624616j8440685j2320093q839985o715185
$$ 260064588 167359621 112429166 81804550 63363865 51043772 42203787 35488602
13133C5488602n253577m491824m073955l575894k884256k185846j651114j305344
$$ 35488602 30235025 25743201 21669246 18093352 15209096 13023250 11372136 10066792
13125A0066792j102770r99061r01501p68303o42845n32096m28558l71627l12370
$$ 10066792 8964022 7964961 7063460 6295157 5652312 5120216 4691658 4320031 4007661
13116D007661k43691j39258n3743j13519k08287k63634k96380k71404k01730j37946
$$ 4007661 3763970 3624712 3570969 3457450 3249163 2985529 2689149 2417745 2216015 2078069
13106B078069j51203p9980k0921k5474o5018r4328r8233j07697j29776j12124
$$ 2078069 1926866 1846886 1825965 1800491 1735473 1641145 1542912 1435215 1305439 1193315
13096A193315q0643k6539l4095q2641p4712j3341j4172r673r1J7286k2640q433
$$ 1193315 1112672 1086133 1052038 969397 894685 881344 867172 857499 857408 874694 852054 843621
13084H43621n753j6361k5096l3718m9651k1667P872j0507k1785k4862l8596l481
$$ 843621 837868 821507 796411 762693 713042 691375 699247 688740 666955 642093 603497 600016
13072F00016p236j0890K8595M4864P2367P7193Q4906K0586n4452q1520n8768o5267
$$ 600016 592780 581890 610485 655349 727716 804909 889815 910401 855949 774429 715661 650394
13060F50394o2634J624J8622R580j691l5165k4896k5788l9771l6879K015J0518
$$ 650394 587760 589384 608006 617586 615895 580730 555834 530046 490275 453396 455411 465929
13048D65929n10n428N292P257K2251J9593M9370M1250P3948J00768J54083J57662
$$ 465929 465419 459991 465283 472540 494791 514384 563754 605004 678952 779720 933803 1091465
13036A091465J86640L61120O18519R89620J496561J813297J435367K59820j094508
$$ 1091465 1278105 1639225 2257744 3247364 4743925 6557222 7992589 8252409 7157901
13027G157901j700160j510221j051685o81906m57218l46710k85044j82545n7589
$$ 7157901 5457741 3947520 2895835 2213929 1756711 1410001 1124957 942412 884823
13018H84823P834j9828o0492p4253q4526j00817o9764k6637k1570k9023l745K0329
$$ 884823 892657 872829 812337 738084 653558 552741 482977 456340 434770 405747 402002 422331
13006D22331J4532j8042m871k8439m4269k1312j0468k4021j4239j5927p935L006
$$ 422331 436863 418821 413950 385511 341242 319930 309462 285441 271202 255275 247340 250346
12994B50346L3878P018p381M0728M8035O9226Q0095O7619P0810j8343r0083j09883
$$ 250346 284224 291242 283861 324589 372624 441850 521945 589564 660374 642031 551948 442065
12982D42065m8988n4054p8223o1684j8934k9723j8760K541k622L5773j02l6579
$$ 442065 393077 339023 260800 199116 180182 150459 131699 134240 131618 167391 167289 130710
12970A30710N384P417l0426L837Q712j1958j3474j6631m1472j3447n492N2137
$$ 130710 136094 143511 113085 116922 125634 113676 100202 83571 42099 28652 23160 75297
12958G5297N3184L7126L1827L107k2225M429J4456j0748k863J2605R592j7552
$$ 75297 128481 165607 197434 200541 178316 182745 197201 186453 183590 196195 205787 188235
12946A88235k4747j3789J7192j6521m6853k1406J6004O334o35n85j3911o370L877
$$ 188235 163488 149699 166891 150370 103517 82111 98115 104449 103814 103229 89318 82948 86825
12933H6825j6117r237N896K3020L4934K1520j1675m5699q651o706j8309j2261
$$ 86825 70708 61471 67367 90387 125321 146841 135166 89467 80816 74110 55801 43540
12921D3540K1385J9736k9566R358J4964J2900J5221K8892j3323k3146L838K488
$$ 43540 64925 84661 55095 64453 79417 92317 107538 136430 123107 99961 103799 106287
12909A06287N524M2383K0640K5939N1170N1665L2144j7504j6237M138Q455O664
$$ 106287 111811 154194 174834 200773 251943 303608 335752 318248 302011 306149 314604 321268
12897C21268M9981N9636O5817P283n7367p9710n0798p6387m3364j3026k1562l2585
$$ 321268 371249 430885 496702 503985 446618 366908 316110 239723 196359 183333 161771 129186
12885A29186j5725k7090M858L068o230q367m144J0691k0387k9791m75n929J0806
$$ 129186 113461 86371 91229 94297 88067 79700 75556 86247 65860 36069 35594 29665 40471
12872D0471J4059m7023m1628K251L0597L8198J807P782K3644M378j0452L926p895
$$ 40471 54530 7507 -34121 -31870 -1273 36925 38732 46514 70158 74536 64084 68010 60115
12859F0115K107L592O266L1739Q818l0760m4122l1614l274j8590j2131N661L0695
$$ 60115 62222 65814 72080 103819 112637 81877 37755 6141 2867 -15723 -27854 -22193 8502
12846H502K8241R854O190J2165m237j7448K4103L7708O135J5153L0839p611J166
$$ 8502 36743 46597 52787 64952 60715 43267 67370 105078 111213 126366 157205 149594 150760
12833A50760L1351P0609M8944J15665P5530l3575q1657r0867n8826m8267l2913
$$ 150760 182111 252720 301664 417329 492859 459284 377627 286760 227934 179667 146754
12822A46754j9748o818p440o913J9561J6728O10k9174k0456k9610l6456J1857
$$ 146754 127006 120188 112748 105835 125396 142124 142734 113560 93104 63494 27038 38895
12810C8895L0250J2031k0315l173R633q084L776K7451M094O592k6691l3696o947
$$ 38895 69145 81176 60861 57688 67321 59237 63013 90464 94558 101150 74459 40763 33816
12797C3816m361J1190K0269j1645m90O646j998J5372j4326R655l5782k3112R377
$$ 33816 29455 40645 60914 49269 48779 55425 53427 68799 54473 64128 28346 5234 14611
12784A4611K9382j0481m5440P445L5677n739q212R85P480O540k1287l2709O74
$$ 14611 43993 33512 -11928 -4483 31194 25455 17243 18228 25708 32248 10961 -21748 -21074
12771b1074K1613J0125q275J4990M5323Q480p091N027J0408M946l661j5031L732
$$ -21074 539 10664 2389 17379 62702 71182 64091 69118 79526 84472 80811 65780 69512
12758F9512l102r374R120p46r593k8249j7096Q875L2815J1376k4956L33K5420
$$ 69512 66410 57036 66156 65410 55817 27568 10472 19347 52162 63538 38582 38915 64335
12745F4335L682K9781J9880J7123O0424J35593J76817R0875j1507j05602j19727
$$ 64335 68017 97798 117678 134801 195225 330818 507635 598510 587003 481401 361674
12734C61674j29819o4025l6372j3965K5463N878k9871l5406k3731K442J5374O025
$$ 361674 231855 167830 131458 117493 142956 148834 118963 83557 59826 62268 77642 83667
12722H3667k8542n35J1593q911L0465K8256p452K057M5365L8897J8997N6078N6433
$$ 83667 55125 54590 66183 57272 87737 115993 108541 110598 155963 194860 213857 269935 326368
12709C26368M3661Q3539J19151K17252L99766O14464O49109L09583j99473n91941
$$ 326368 370029 453568 572719 789971 1189737 1804201 2453310 2762893 2563420 1971479
12699A971479o18444m63089k66990j45227j03994o4438p0810k9489l9212j9936
$$ 1971479 1353035 889946 622956 477729 373735 309297 238487 208998 169786 149850
12689A49850k5044q474j6729k9254k7723M957l794p576J1114j372j1373k579M223
$$ 149850 124806 116332 99603 70349 42626 47583 43789 36213 47327 45955 34582 32003 36226
12676C6226j544J3236j9197k0468P03j4401K1562K9381j0434k960j1527m507k4130
$$ 36226 34682 47918 28721 8253 8956 -5445 16117 45498 35064 32104 20577 16070 -8060
12663h060j5531P744P688K0214J3600J4744j6322o654j4730j2475J0181J6145
$$ -8060 -23591 -15847 -8159 12055 25655 40399 24077 17423 2693 -9782 399 16544
12651A6544P630k935k679k687j2326J2945J6377k1326J8814j2843K8220m252K4260
$$ 16544 24174 21239 18560 15873 3547 16492 32869 11543 30357 17514 45734 41482 65742
12638F5742M6882J859l9495m9186J1626N473J9276q816q092j7313N428K3200P634
$$ 65742 112624 114483 74988 25802 37428 42901 62177 53361 45269 27956 33384 56584 64218
12625F4218N82l0845k3538J1331J5243k4273k4077P348J3029N259J6650j65K91
$$ 64218 64800 33955 10417 21748 36991 12718 -11359 -4011 9018 14277 30927 30762 31053
12612C1053l749J0494K899m471M688o407p588K8358J2835k2500j7018l094P967
$$ 31053 27304 37798 40697 36226 40914 34507 26919 55277 68112 45612 28594 25500 33467
12599C3467K0341j651o144P489L423m846j3014j4899J8372M5512L716n80q767
$$ 33467 53808 52157 46013 53502 56925 52079 39065 24166 42538 88050 91766 91186 82419
12586H2419k7330J160R251j7628L620K659L1423L9659L2832J5364l0083l6840
$$ 82419 55089 56249 65500 47872 51492 54151 85574 125233 158065 173429 143346 106506
12574A06506q862n846J2968N954j8778J090k209l1256j6564j4410J0802M0891
$$ 106506 97644 91798 104766 110720 91942 93032 90823 59567 43003 28593 39395 80286
12562H0286O107N527K1868M673j9920j0400m743l1083k3476M2452L0232K4557
$$ 80286 86393 91920 113788 118461 98541 88141 83398 52315 28839 71291 101523 126080
12550A26080P562k0356n360L749L665Q315L2478j2911K021M2453j2144l989M8636
$$ 126080 133642 113286 107926 111675 115340 123655 156133 143222 145243 187696 175552 171563 220199
12537B20199N1524P0657M1658j5864q2326o1650j7570j7519j6049J0444n341k5155
$$ 220199 271723 342380 384038 368174 285848 224198 206628 189109 173060 183504 178163 153008
12525A53008l5357O801j0429p000J0290J7303P594k5889l5411J413l968j0699
$$ 153008 117651 124452 114023 107023 117313 134616 142210 116321 80910 82323 78355 67656
12513F7656j4370N367k16J717K6284J1329j1856l3993j3468J2431L7819K8114
$$ 67656 53286 58653 58437 60154 86438 97767 85911 51918 38450 50881 88700 116814
12501A16814k1438l8152r828M3999J0881j2077o397P515M6003M500j4751l1524
$$ 116814 95376 57224 47396 91395 102276 90199 83802 91317 137320 141820 127069 95545
12489I5545j6204n042k9159M027K4806O345r705k2443k0995l4198J1751K6064
$$ 95545 79341 74299 45140 49167 73973 80318 70613 48170 27175 -7023 4728 30792
12477C0792J625J0088q154j329N519K730j4844j4321j8864P714K980J6779J1896
$$ 30792 32417 42505 34351 33022 38541 41271 26427 12106 -6758 956 3936 20715 32611
12464C2611l4513j3569l464N459J6136K6336J9084j3043P775N835o814m3609Q864
$$ 32611 -1902 -15471 -18935 -13476 2660 28996 48080 35037 42812 48647 41833 -1776 7088
12451G088q707J7154J4984j7584J3550r003j3971J833K1767j7183k143J194Q517
$$ 7088 -1619 15535 30519 12935 26485 17482 3511 5344 27111 9928 7785 8979 17496
12438A7496J2566K636k4557o562J6462L276m3586k2176K4321K5070m424K2061
$$ 17496 30062 32698 8141 1579 18041 21317 -22269 -44445 -20124 4946 522 22583
12426B2583L1535R523k096j1881J3669j0602j4042l335j2660Q601O302L917n47
$$ 22583 54118 63641 61545 49664 63333 52731 38689 35354 22694 31295 37597 41514 40967
12413D0967R807k0653k6432j7146n450K4317J2681n718j398m986k1113J0633r661
$$ 40967 50774 30121 3689 -13457 -18907 5410 18091 12373 10975 5989 -15124 -4491 -14152
12400a4152j2990K1698o188L969J591r593J6448J3317j3413J2407l769N264J7402
$$ -14152 -27142 -5444 -11632 -7663 -6072 -15665 783 14100 687 13094 9325 14589 31991
12387C1991j7025l2479p532R449M2254j3500m352j3961j612L2878K3892p996J3732
$$ 31991 14966 -17513 -25045 -15596 26658 13158 8806 -5155 -6767 26111 50003 42007 55739
12374E5739K639k424n189l4905n078k6257l554J0980K9063j2200M179j9142M445
$$ 55739 58378 55954 50765 15860 10782 -15475 -19029 -8049 21014 8814 12993 -6149 -1704
12361a704R690rJ852j7860O337O401k9286N715K2875J062j2991K6738R846K11
$$ -1704 7986 7977 9829 -8031 -1694 4707 -24579 -18864 4011 5073 -7918 18820 28666 28877
12347B8877K504N227j0602K726R537r966j3694j421j0507k5700j0240n083K2516
$$ 28877 31381 36608 26006 28732 38269 28303 14609 13188 2681 -23019 -33259 -38342 -15826
12334a5826J9600m435L0776j2809r084J1801O315O425K3738j4148l0135l2669
$$ -15826 3774 -661 30115 17306 8222 20023 26338 32763 56501 42353 12218 -20451
12322b0451q042k363P760J3830k7446k340K8117J6044l035m276p560J7664j8136
$$ -20451 -28493 -30856 -23096 -9266 -36712 -39052 -10935 5109 2074 -2202 -9762 7902 -10234
12309a0234j617J4498O049R455l7242k2465N978J6714J763J4027J1680K3159Q35
$$ -10234 -11851 2647 8696 18151 -19091 -41556 -35578 -18864 -17101 -3074 8606 31765 32600
12296C2600j3933J2491J1622j4088P23j2701J869K4065K6028j2321k8983j3680
$$ 32600 18667 31158 42780 28692 29415 16714 18583 42648 68676 56355 27372 13692
12284A3692J0208J3753j3402n751j590j3926n235L0731m481k7057k6759M668N767
$$ 13692 23900 37653 24251 18500 16910 2984 -2251 28480 23999 -3058 -29817 -25149 -19382
12271a9382O583J7351N766O059j5180q171Q247j7354j1897J0995p491n635l61
$$ -19382 -12799 4552 10318 16377 1197 -6974 1273 -16081 -27978 -16983 -24474 -30109 -30470
12258c0470L588l639R553J081p151J3555Q673Q372K0338J897j8639R383J2110
$$ -30470 -26882 -30521 -20968 -19887 -27038 -13483 -4810 3562 23900 25797 7158 16541 28651
12245B8651J788m952j4244p122j379N460K4546L5726J0062k3076l9158m0715l9998
$$ 28651 30439 25487 11243 4121 2742 8202 32748 68474 78536 55460 16302 -24413 -64411
12232f4411j0823K5735K2468J4157n95Q850j732l527j2775J4288L3294l294l1434
$$ -64411 -75234 -49499 -27031 -12874 -13469 -4619 -6351 -9878 -22653 -8365 24929 21635 -9799
12219i799j0715R471o758j1601J5699o715o574Q344o35Q479J273o009J3357M234
$$ -9799 -20514 -11043 -17801 -29402 -13703 -20418 -26992 -18648 -19283 -10804 -9531 -15540 -2183 2051
12205B051j9174j7373K2873M288m696j4555j6369L204p132L065K6814J983J8743
$$ 2051 -17123 -34496 -11623 -7335 -12031 -26586 -42955 -39751 -46883 -43818 -17004 -15021 3722
12192C722P11l0632o772j832N940J001j2926j0695R218k752k72N844K3212L3874
$$ 3722 4433 -26199 -32971 -34803 -28863 -27862 -40788 -51483 -42265 -45017 -45289 -39445 -16233 17641
12178A7641j7807k2561j7514j8205J8507J8311j3527N294J7050j0948J9509P236
$$ 17641 -166 -22727 -40241 -58446 -39939 -21628 -35155 -29861 -12811 -23759 -4250 2986
12166B986J1743j5648J0239j8079n556j027L710L4187l124p696J3553l0965j3975
$$ 2986 14729 -919 9320 -8759 -14315 -15342 -11632 22555 19431 11735 25288 -5677 -19652
12153a9652K3628r35k6827P930J1403K9534l984L911J399j2807K112q7m1364n366
$$ -19652 3976 3041 -23786 -15856 -4453 25081 21097 25008 26407 13600 15712 15625 -25739 -31105
12139c1105K0691j4380j6570J4924L3575K7256J600j5816j4368O01N661J1029
$$ -31105 -10414 -24794 -41364 -26440 7135 34391 35991 20175 5807 6408 12069 23098
12127B3098J0336j0195j0960j6258l1872n831M0549J5607J2856P298L342N145
$$ 23098 33434 23239 12279 -3979 -35851 -41682 -1133 14474 27330 34628 37970 43115
12115D3115j7494k5523l576k611P447J2801n429P108R572o617j738J4591j3566
$$ 43115 25621 98 -3478 -6089 1358 14159 8730 15838 25410 18793 17055 31646 18080
12102A8080j0788j3687k5753r161R365Q387m261J0650n095J0871Q156M124j573
$$ 18080 7292 -6395 -32148 -41309 -31944 -23557 -27818 -17168 -22263 -11392 -3236 888 -685
12089f85K3269O00K6657j2450P461n458j4700k3555l3380J7200n055R302M3068
$$ -685 22584 23184 49841 37391 44852 39394 24694 1139 -32241 -15041 -20096 -10794 32274
12076C2274l1512l551O426q293m968J0309n910j0453O234r220J8645p49j509M360
$$ 32274 762 -2789 3637 -4656 -9624 685 -5225 -15678 -9444 -18664 -19 -768 -2277 2083
12062B083p252m501K658j3725J925j6931j7887L1892o608J7765J2432K2823o913
$$ 2083 -5169 -9670 -7012 -20737 -18812 -35743 -53630 -21738 -28346 -10581 1851 24674 17761
12049A7761J1552L11o798L419j3664m0601k1371M5287K6887l498r752J5163Q471
$$ 17761 29313 29624 22826 26245 12581 -28020 -49391 -4104 22783 19285 9533 24696 33167
12036C3167n923j2553j5551J0291P471J2783K116j7879j8283J5517j6691M502
$$ 33167 27244 14691 -860 9431 16902 29685 31801 13922 -4361 11156 -5535 -1033
12024a033k042r424R139J8180j7408J994k420k1867l929P547N098L930j3132j869
$$ -1033 -3075 -12499 -3360 14820 -2588 -594 -3014 -24881 -28810 -21263 -16165 -12235 -25367 -27236
12010b7236K365O729P553J9900k954k3963J2792j1710J6846J1837r639K5253K5674
$$ -27236 -24871 -18142 -10589 9311 6357 -17606 -4814 -16524 322 12159 2520 27773 53447
11997E3447o627j0184o638r896J3046O157n058n660M3312L8904J6553K3613K7648
$$ 53447 46820 36636 29998 20102 33148 39305 34247 28587 71899 110803 127356 150969 178617
11984A78617K9834R6626R2563K104r0275j02257p5185m2590k9723R853M002j1023
$$ 178617 208451 305077 397640 399744 309469 207212 132027 89437 59714 69567 73569 62546
11972F2546K372k8147k5602k595J7031n211q760Q941n661J0686N221k6N222p383
$$ 62546 64918 36771 11169 8574 25605 20394 11634 20575 14914 25600 30821 30795 36017 28634
11958B8634J937m610k2587o099M503J2921j2322R855J0937N567j4208P697p421
$$ 28634 30571 25961 3374 -2725 1778 14699 2377 12232 23169 28736 14528 22225 14804
11945A4804r607r248J9797j2277j2110j3831O832J2038J336j5889k665M356M099
$$ 14804 5197 -4051 15746 3469 -8641 -22472 -15640 -3602 -2266 -18155 -20820 -16464 -12365
11932a2365r835J1218j45p618J7199K4629j1314k1021J791J2055p567J0231p549
$$ -12365 -22200 -10982 -11127 -18745 -1546 23083 11769 -9252 -7461 4594 -2973 7258 -291
11919b91j0039J6610l719n660k217o547o214j9894J378K9777j0653J3096K0423
$$ -291 -10330 6280 2561 -3099 -5316 -11863 -18077 -37971 -36593 -6816 -17469 -4373 16050
11906A6050J456k5362j0005J1747k2151j7104J8678L2043P443J3295K2426L490
$$ 16050 17506 -7856 -17861 -6114 -28265 -45369 -26691 5352 12795 26090 48516 52006
11894E2006k3028j7403k4845q065J4955k0022P359K6362n067j911J6138n528j8121
$$ 52006 28978 11575 -13270 -21335 -6380 -26402 -19043 7319 2252 341 16479 10951 -7170
11881g170Q942J7168k1078N124K983j2446j8971m500P716R921P544o996R42L500
$$ -7170 1772 18940 -2138 2986 5969 -6477 -25448 -29948 -22232 -12311 -4767 -11763 -10821 -7321
11867g321N204K297j3820o761J9918p351k3969k1603j5061J5767r271K4880L0232
$$ -7321 -2117 180 -13640 -20401 -483 -7834 -31803 -53406 -68467 -52700 -61971 -37091 -6859
11854f859K53j7469j1820q751O196K427j126O235J5764J4796M698l0814k6253
$$ -6859 -6606 -24075 -35895 -44646 -38450 -36023 -37149 -30914 -15150 -354 4344 -26470 -52723
11841e2723K7815N073n355q040L113J8658m201k409K743k7997J3118j953O433
$$ -52723 -24908 -19835 -25190 -33230 -30117 -11459 -15660 -18069 -15326 -43323 -30205 -32158 -25725
11828b5725m428J8113L8912r455l0036n026N55O042k71j2994J2938O821k8434
$$ -25725 -30153 -12040 26872 17417 -12619 -17645 -17090 -11048 -11319 -24313 -11375 -4554 -32988
11815c2988l6080k6900L7840K0949N290k4127N045L4882L3985l7609r838q051
$$ -32988 -69068 -95968 -58128 -37179 -31889 -56016 -50971 -16089 17896 -19713 -29551 -37602
11803c7602j0988j2000J7251j636K635L575j5202j8436L761K4685M0218K2892
$$ -37602 -48590 -60590 -43339 -44975 -42340 -38765 -53967 -72403 -68642 -43957 -3739 19153
11791A9153L0861k7108j1277m903q029k0121L003P709J131L6843L4884k1291o3326
$$ 19153 50014 22906 11629 6726 -1303 -21424 -18421 -10712 -9581 27262 62146 40855 -22471
11778b2471k1962K4584J1373k4532o587P991j4772P319P908q093J7642K0929K085
$$ -22471 -44433 -19849 -8476 -33008 -39595 -31604 -46376 -39057 -31149 -39242 -21600 -671 1414
11765A414q194O928J2031J1091p690q488K8961n066l1346r506j2565J1366K5906
$$ 1414 -6780 148 12179 23270 15580 7092 36053 30987 -359 -9865 -22430 -11064 14842
11752A4842K251l2507k7061m359K8644J403J699J0052M91Q598o115k1720Q034
$$ 14842 17093 -15414 -42475 -46834 -18190 -16787 -15088 -5036 -4545 4053 -2062 -23782 -15748
11739a5748j5527M464J8872L536m820j3491J6645o821N903J0989k1476J814k235
$$ -15748 -31275 -26811 -7939 -4403 -9223 -22714 -6069 -12890 -6987 4002 -17474 -15660 -17895
11726a7895j5214L4982K906k6612J0943p668K6390M316L35M123k0409l0779j0337
$$ -17895 -33109 1873 4779 -21833 -10890 -18558 7832 12148 12483 16606 -3803 -34582 -44919
11713d4919K6700K1371Q825o11k3093L479R03K4108J431o716l1679K1898L0377
$$ -44919 -18219 3152 11977 11366 -11727 -8248 -7345 16763 18194 11478 -20201 1697 32074
11700C2074l1146j2874j4177l3534k766J2575P380l430q825K5950r89Q227J5332
$$ 32074 928 -11946 -26123 -59657 -62423 -49848 -42468 -45898 -54723 -28773 -29762 -21535 -6203
11687f203n474n612r909O735j4241k1583J9006k0699R484J5602l940J4289L7293
$$ -6203 -11677 -17289 -27198 -20463 -34704 -56287 -37281 -57980 -48496 -32894 -36834 -22545 14748
11674A4748K703l4886J789j0817Q55J5859l130j8028K857o466R057J8571K0983
$$ 14748 17451 -17435 -15646 -26463 -25608 -9749 -12879 -30907 -28050 -34516 -25459 -6888 14095
11661A4095K8841N742j8116m8542J8573J2890n806L766j6998p931J2377j3143
$$ 14095 42936 48678 30562 -17980 593 13483 7677 11443 -5555 -13486 -1109 -14252
11649a4252J3839K8349r608J9786l456k3807j2256O179l9077J034k316l184N639
$$ -14252 -413 27936 18328 38114 34658 10851 -1405 4774 -34303 -33269 -35585 -38769 -33130
11636c3130L57J5947L7234J5764j9840K101k690p644q099j5333K905L625O077
$$ -33130 -32773 -16826 20408 36172 16332 18433 15743 8099 0 -15333 -12428 -8803 -2726
11623b726M709J822j173K2186j2583j8483j6310j0521N355J1917K2032J9015r429
$$ -2726 1983 3805 2632 24818 12235 -6248 -22558 -33079 -27724 -15807 6225 25240 15811
11610A5811l0878j7411L0949K1640P45j0299J5000M30q712M298k3365m67J2245
$$ 15811 -15067 -32478 -1529 20111 20856 10557 25557 25987 17275 21573 -1792 -2259 9986
11597I986j0362N109j948k1074k4842K3656q620P907K8521J2499K2338Q482j262
$$ 9986 -376 4733 2785 -18289 -43131 -19475 -28095 -20188 8333 20832 43170 51652 50390
11584E0390l0709j7521r209Q182j090n199j0226n56K8967J4394j2295l565r198
$$ 50390 19681 2160 -7049 1133 43 -5156 -15382 -15938 13029 27423 15128 11563 2365
11571B365K4232n114k4253J4762K2005q110j5788m323j5739K210j0164k313k0610
$$ 2365 26597 21483 -2770 11992 33997 25887 10099 5776 -9963 -7753 -17917 -20230 -40840
11558d0840J1477l032J7734r672k76k1471j8120r002K8906J8933K0440L750J9333
$$ -40840 -29363 -32395 -14661 -24333 -24609 -46080 -64200 -73202 -44296 -25363 -4923 -1173 18160
11545A8160q25j3623Q309J0227p166o567j9866j4797K6487J8664r12Q300j0028
$$ 18160 17335 3712 12021 22248 15082 8515 -11351 -26148 339 19003 18091 26391 16363
11532A6363O201K9107o370L929j6874j9694M694l635Q481q327j0621L846K709
$$ 16363 22564 51671 45301 49230 32356 12662 17356 13721 22202 13875 3254 7100 9809
11519I809J8004P400P884k3837j0570p926k1385K7077J4038l708R841k9166R727
$$ 9809 27813 35213 43097 19260 8690 764 -20621 6456 20494 16786 26627 -2539 7188
11506G188M138k3260r012M14L991K3176k955r866N457K165q294J5127J0933o868
$$ 7188 11326 -11934 -20946 -20532 -16541 6635 3680 -6186 -729 1436 -6858 8269 19202 12334
11492A2334O645j6850j666J2753r94p178k5825J150L3603L2636J4729l918k7562
$$ 12334 18979 2129 463 13216 12222 5044 -20781 -19631 13972 46608 61337 57419 29857
11479B9857R028J7909j730k367j7711j1808R730k1429k5233J0442n708O712J9272
$$ 29857 38885 56794 55064 52697 34986 23178 32908 11479 -13754 -3312 -9020 -2308 16964
11466A6964K6156l966r832j2195o255Q538J4720J4731k5694n814P18J2579k7328
$$ 16964 43120 39154 29322 17127 10872 19410 34130 48861 23167 17353 18071 30650 3322
11453C322j1423L7631J3251K8980l0536l4550j3534M1825L708l0493j7527r003
$$ 3322 -8101 29530 42781 71761 41225 6675 -6859 34966 38674 8181 -9346 -18349
11441a8349l202J4327J3931p931k5471L943K5623J0676k0879L635k783k365r950
$$ -18349 -21551 -7224 6707 -1224 -26695 -22752 2871 13547 -7332 -3697 -6480 -8845 -18795
11428a8795N081N273Q470n190k920j6060j4843L7171K533k5353O039K2093L4378
$$ -18795 -13714 -8441 29 -5161 -8081 -24141 -38984 -1813 720 -24633 -18594 3499 37877
11415C7877K8411k7903l8609k9016j1079j2663P054L569J6430N55J8802J4176
$$ 37877 66288 38385 -224 -29240 -40319 -52982 -45928 -42359 -25929 -25374 -6572 7604
11403G604K2571K0882k3836P250L884l0412k1860N496J8171j0424j3722K3653
$$ 7604 30175 51057 27221 34471 38355 7943 -13917 -8421 9750 -674 -14396 9257
11391I257K2860k2531k6840P112J7091J0577M638l1185j1287J6513j9523J9673
$$ 9257 32117 9586 -17254 -10142 6949 17526 22164 -9021 -20308 -3795 -23318 -3645
11379c645K7584J1182l153J448l0973k0691K6347L6111P918k2328j4371o847m879
$$ -3645 23939 35121 31968 33416 2443 -18248 8099 44210 52128 29800 15429 8582 3703
11366C703l1533m542L051L3796N483j9790j6336j676l7862J7393L726K4523J6296
$$ 3703 -27830 -32372 -29321 4475 9958 -9832 -26168 -27844 -65706 -48313 -44587 -20064 -3768
11353c768J9254K6093J9201k3307m517R577k187J1970k5194l4375L901J9679O356
$$ -3768 15486 41579 60780 37473 32956 42533 40346 52316 27122 -7253 -3352 16327 22683
11340B2683o667n435J2873J0304l427m4008n1617K1831K0355J94J802k7972j1934
$$ 22683 16016 10581 23454 33758 30331 -13677 -65294 -43463 -23108 -22914 -21112 -49084 -61018
11327f1018L8401J5790N762J226L842k30K5544m7121j6536K531J7785J4456k4309
$$ -61018 -22617 -6827 -1065 161 4003 3773 29317 -17804 -34340 -31809 -14024 432 -23877
11314b3877J6302K2486J2394O261j7571j4979J5375q060k8588j1329K7083m306
$$ -23877 -7575 14911 27305 33566 15995 1016 16391 8331 -20257 -31586 -4503 -8809
11302h809n340k0929j2788L8842L3331M5055K9477J4465N8137N2309l612n6936
$$ -8809 -14149 -35078 -47866 -9024 24307 69362 98839 113304 171441 223750 220138 163202
11290A63202o9268j1712L548k1900p173L421Q830o516M550k2123n6264k7550j5744
$$ 163202 93934 82222 85770 63870 56697 60118 68948 62432 66982 44859 -11405 -38955 -54699
11277e4699J3750J1675J7359j5308L4830J3378k2158Q551R506l5562q966J2174
$$ -54699 -40949 -29274 -11915 -27223 7607 20985 -1173 7378 16884 -18678 -27644 -15470
11265a5470j9031K100j5221j799L2859K8928J9119J0439J7129j9562l0116J1000
$$ -15470 -34501 -32401 -47622 -49421 -16562 12366 31485 41924 59053 39491 9375 20375
11253B0375j3254k9355Q652r672k2033k4586J8041K0713N254J6077N421l4p25
$$ 20375 7121 -22234 -13582 -23254 -45287 -69873 -51832 -31119 -25865 -9788 -4367 -4401 -5126
11240e126K552M310q260q705N220l717K1902N695J0001k7387L974K0157o74j251
$$ -5126 -2574 1736 -6524 -15229 -10009 -13726 8176 13871 23872 -3515 459 20616 19942 18691
11226A8691O594k415n209k6779j9756K6629J2699p562j75l073r834K202L148q525
$$ 18691 25285 22870 17661 -9118 -28874 -2245 10454 2892 2717 -356 -10190 -7988 -4840 -13365
11212a3365J0706J3153j2483j0852K126J5388J079k0758K295L492j224n636P737
$$ -13365 -2659 10494 -1989 -12841 -10715 4673 5752 -15006 -12711 -9219 -10443 -16079 -8342
11199h342j4643r692J102K3570K3471n849R222P937J4269j1545k8502j6101p844
$$ -8342 -22985 -32677 -31575 -8005 15466 9617 18839 26776 41045 29500 998 -15103 -22947
11186b2947j1220O017l268j247J3710O401k0757j167O965M052p178J6775J2641
$$ -22947 -34167 -28150 -31418 -32665 -18955 -12554 -33311 -34478 -27513 -23461 -30639 -13864 -1223
11173a223Q701M963j1314j292K282k5841J2987L810k3193P216J5211K4880K6484
$$ -1223 7478 12441 1127 -165 2117 -23724 -10737 -6927 -30120 -22904 -7693 17187 43671
11160D3671j0774k3304J0398O460l2746o957L6615M178k795j0594k3908j5493
$$ 43671 32897 9593 19991 26451 -6295 -13252 23363 27541 24746 14152 -9756 -25249
11148b5249Q853Q296P894J3858j6888N25J5557J359j6112n669j4289M96J4247
$$ -25249 -16396 -8100 -206 13652 -3236 -2711 12846 14205 -1907 -7576 -21865 -21369 -7122
11135g122J7383j1256l769K1535m723m1487n337J1166j3570J9271K1369k371k0885
$$ -7122 10261 -995 -4764 16771 12048 -29439 -34776 -23610 -37180 -17909 3460 1089 -19796
11122a9796r086Q12r758K6410K2297J7864L173r092j447n563L330k7515j9970
$$ -19796 -28882 -28070 -37828 -11418 10879 28743 31916 22824 21377 15814 19144 -8371 -28341
11109b8341k1425j6249J9833j1702j518K1836K6075L8023n285j7400j5868j9078
$$ -28341 -49766 -66015 -46182 -57884 -59402 -37566 -11491 26532 21247 3847 -12021 -31099
11097c1099K4317L1023O83k7320J9283J1458j3830j7035J909L1056j315k7648
$$ -31099 -6782 24241 24924 -2396 16887 28345 14515 -2520 -611 30445 29130 1482
11085A482j5762J2636K4484K0621L141j4278m3830j3157q234q524K728L4611L4848
$$ 1482 -14280 -1644 22840 43461 46602 32324 -11506 -24663 -32897 -41421 -38693 -4082 30766
11072C0766K3660l2964k9746j1902J0678O579p210J8034q764j7185R950K3521
$$ 30766 54426 21462 -8284 -20186 -9508 -2929 -10139 7895 -869 -18054 -8104 15417
11060A5417J630m526Q05J5644k493k7130k2216Q671k1609P824j0091p631q170
$$ 15417 17047 12521 13326 28970 26477 -653 -22869 -14198 -35807 -27983 -38074 -45705 -53875
11047e3875j1833J8245K7091J4582N011M963Q896L2163P164l1305m465K603R281
$$ -53875 -65708 -47463 -20372 -5790 -779 4184 13080 45243 52407 21102 16637 19240 28521
11034B8521K5105o315J0474k4124l1727J0335q116q807J3184j6639P388J1045
$$ 28521 53626 47311 57785 33661 1934 12269 4153 -4654 8530 -8109 -721 10324
11022A0324n064M299R360j2805K81k6967n825M374J3746K8693J7547n947j2718
$$ 10324 5260 9559 18919 6114 6395 -20572 -26397 -22023 -8277 20416 37963 32016 19298
11009A9298N126J5229j5243j2984o638j4330l665Q856Q740j651j1819K0147L6998
$$ 19298 24424 39653 24410 11426 4788 -9542 -13207 -4351 4389 2738 -9081 11066 48064
10996D8064m787m0146j1914j1370m555P394j4053J415P567J2858L921L089M566
$$ 48064 43277 3131 -8783 -20153 -24708 -17314 -31367 -29952 -22385 -9527 -5606 -2517 2049
10983B049n425p781k671j7359J2699L1654J9611l8770M745j8577M881O412k255
$$ 2049 -3376 -11157 -13828 -31187 -18488 13166 32777 -5993 -1248 -19825 -14944 -8532 -10787
10970a0787K8606l77k4506j8888p593Q490K0567M0426R759k1394j4687j0016M763
$$ -10787 17819 17442 -7064 -25952 -33545 -25055 -4488 35938 45697 24303 9616 -400 4363
10957D363k1258k4411j1570k719L2232L9432j5186o445j416R191p606N942r990
$$ 4363 -16895 -41306 -52876 -55595 -23363 16069 883 -5562 -6978 2213 -5393 549 -9441
10944i441p743Q31l302j7055q730J8897N708j165K2874p206l1549K634R356j2633
$$ -9441 -17184 -16353 -19655 -36710 -45440 -26543 -20835 -22000 874 -6332 -37881 -35247 -25891 -38524
10930c8524J8214J1227J3472p210j9170k4042j0840l102J8799J2117J0356r824
$$ -38524 -20310 -9083 4389 -2821 -21991 -46033 -56873 -59975 -41176 -29059 -18703 -28527
10918b8527k538J6998L0851K2877N13L090M247j4215j3380l422j905l894k424
$$ -28527 -31065 -14067 16784 39661 40174 43264 47511 33296 19916 16494 14589 10695 8271
10905H271J3437o541l877j5353j0108k0462L511j401J4709J1213J8299m450k265
$$ 8271 21708 15167 11290 -4063 -14171 -34633 -31122 -32523 -17814 -6601 11698 7248 4983
10892D983K6761j8904l4667n899k7029M530K8324J9058M61J2043J8787L843j4453
$$ 4983 31744 12840 -21827 -27726 -54755 -50225 -21901 -2843 -2382 9661 28448 32291 17838
10879A7838j8525q907L7586J8226m3222M164q571j828J0304j2549l6068k5360
$$ 17838 -687 -9594 27992 46218 2996 7160 -1411 -3239 7065 -5484 -41552 -66912
10867f6912J5239M3353J989p372j3718o20J8651K7668m458j9524k95k0583k305
$$ -66912 -51673 -8320 -6331 -13703 -27421 -28041 -9390 18278 13820 -5704 -5999 -26582 -28887
10854b8887J3310k5072k10J9014p204J9289J3096k049j5000k265J5505J435j0607
$$ -28887 -15577 -40649 -40859 -21845 -29049 -9760 3336 1287 -13713 -15978 -473 962 -9645
10841i645q138p596J8502K954j1895Q4K3494K9936r292j2754o788q620J1499r10
$$ -9645 -17783 -25379 -6877 -3923 -15818 -15734 7760 37696 28404 15650 8862 242 11741 10831
10827A0831q268l5091O642K3932M835m173l73o828R434L0801k2145l103P39q4
$$ 10831 2563 -32528 -25886 -1954 2881 -1292 -1665 -8493 941 31742 9597 6494 7233 7149
10813G149l54K3205M0923k8278m0353J1738o426j4952J2262J4108J2037j1254
$$ 7149 6795 30000 70923 42645 2292 14030 7604 -7348 4914 19022 31059 19805
10801A9805k2969M429P920J325q237k0861l3224K833K0560J4009j6866J5462j8774
$$ 19805 -3164 1265 9185 10510 2273 -18588 -51812 -48979 -28419 -14410 -31276 -15814 -34588
10788c4588k281L8398N1272L658l2476m4041j5121J8762J6846J0349L5774N300
$$ -34588 -36869 1529 52801 56459 23983 -20058 -35179 -16417 429 10778 46552 51852
10776E1852k6380k2249Q143p296M42m781M61J9095m954j5368j5660r92K990j5433
$$ 51852 25472 3223 11366 4070 4512 -269 192 19287 14333 -1035 -16695 -17687 -14697 -30130
10762c0130J9733Q930j2626P330l029j2647J8260K4035K2980j8195l1350J7196
$$ -30130 -10397 -1467 -14093 -6763 -9792 -22439 -4179 19856 42836 24641 -6709 10487
10750A0487K5874k7000j5912J9543j1098o350J4674j1792j4269N19J3942Q821
$$ 10487 36361 9361 -6551 12992 1894 -4456 10218 -1574 -15843 -15324 -1382 7439
10738G439p225K3185K074k273k53O434K19o541j9370P10M388m450k012j5973J7960
$$ 7439 214 23399 25473 23200 22947 29381 29600 23059 3689 4399 8787 4337 2325 -13648 4312
10723D312M3532k310J8017J5081k4010k7306j6222j6244j2859j4054K7098K1213
$$ 4312 47844 45534 63551 78632 54622 27316 11094 -5150 -18009 -32063 -4965 16248
10711A6248O937K4608k8576l5193J4429J0999j3397N423J5182M986n8j5452K623
$$ 16248 23185 47793 19217 -15976 -1547 9452 -3945 1478 16660 21646 21588 6136 8759
10698H759n037O699J7357K0404o155j6766k3290r444m78J7238K5555o929n706
$$ 8759 3722 10421 27778 48182 42027 25261 1971 -7473 -7951 9287 34842 27913 22207
10685B2207k214l781M699k13j9099j5488n029r940k9387J6709L2896M6119O566
$$ 22207 19993 16212 20911 20698 1599 -13889 -18918 -28858 -58245 -41536 -8640 37479 44045
10672D4045k4295P183K6243Q197l1104j9720j0277J7769j1233K3475j7100q304
$$ 44045 19750 26933 53176 61373 30269 10549 272 18041 6808 30283 13183 4879
10660D879M378k3342j1465Q909nkP828j0174J5876J4503L062M663j9509j0314
$$ 4879 9257 -14085 -25550 -16641 -16646 -16648 -8820 -18994 -3118 11385 14447 19110 -399 -10713
10646a0713L692Q508j284J2902J9868n761q489k6464j656J0827L979j4391J409
$$ -10713 -7021 1487 203 13105 32973 27212 18723 -7741 -9397 1430 5409 -8982 -7573
10633g573j1076J7502R385J1354M872Q252k2808j1979j499l0639p971M0112J7550
$$ -7573 -18649 -1147 8238 19592 24464 32716 9908 -2071 -3570 -34209 -42180 -2068 15482
10620A5482Q958J3053J1740j342j3420j2241j9096j0902J8472N829O560K3618
$$ 15482 24440 37493 49233 47891 34471 22230 3134 -7768 10704 16533 23093 46711
10608D6711k037q878j917m614J0488K3335r633j9120k9207r134J6575j2998J905
$$ 46711 44674 35796 33879 29265 39753 63088 53455 34335 5128 -4006 12569 -429 1476
10595A476o611o75J0907J1792J2042j7459j8351j0208N526J9692P959J7295l345
$$ 1476 -5135 -5810 5097 16889 28931 11472 -6879 -17087 -11561 8131 16090 33385 30040
10582C0040k5420M56O523P321j0421J2258Q301m148j0144K1451J1456J3590o642
$$ 30040 4620 5076 11599 18920 8499 20757 29058 24910 14766 36217 47673 61263 54621
10569E4621j5044N817O991J5159r251M141R81l8985q782R988j2184q517J8719
$$ 54621 39577 45394 52385 67544 58293 62434 63415 24430 15648 25636 13452 4935 23654
10556B3654K0961o206K211K1950q044l0415L0190J9830k2595k6768j2965J4638
$$ 23654 44615 38409 40620 62570 54526 24111 54301 74131 51536 24768 11803 26441
10544B6441r64J5934j7250R631J7238J1622k6618M322J0196l335o093L796K9953
$$ 26441 25477 41411 24161 33792 51030 62652 36034 40356 50552 47217 41124 44920 74873
10531G4873j0843m4248k865K759j7136J641K908K4219N344j4055l0779N267k4145
$$ 74873 64030 19782 16917 19676 2540 4181 7089 31308 36652 22597 -8182 -2915 -27060
10518b7060p969J8735L4589J4403k1143j5456p982j0024m80J8243J3270m58L193
$$ -27060 -35029 -16294 18295 32698 11555 -3901 -11883 -21907 -22387 -4144 9126 8668 11861
10505A1861J245J7542j6293q520P098O559j1071m056j4214j0417r652R678K4164
$$ 11861 13106 30648 14355 5835 12933 19492 8421 4365 -9849 -20266 -29918 -20240 3924
10492C924J1292k6147J2837J0054j0732K1839M958r465N099k681Q25J02O15m677
$$ 3924 15216 -10931 1906 11960 1228 23067 28025 18560 23659 20978 21803 21905 22520 17843
10478A7843r565q194j4850L1265J6182p109j1678q175J4482l996p342M268M697
$$ 17843 8278 84 -14766 16499 32681 25572 13894 5719 20201 16205 8863 13131 17828
10465A7828L7052Q487M607n809j0203q400j7161j6301j86j516J1188L5779O506
$$ 17828 54880 63367 67974 62165 51962 43562 26401 10100 9914 8398 19586 55365 61871
10452F1871O15o4L204J0625k1172o0724j3771O166K0001J2629Q836L934k6390
$$ 61871 62486 62422 65626 76251 55079 -5645 -19416 -13250 6751 19380 28216 32150 5760
10439E760k4267O787O353K7440J8414N652m921K5718j9347p945m029l115J9949
$$ 5760 -18507 -11720 -5367 22073 40487 46139 41218 66936 47589 39644 35615 32500 52449
10426E2449K234J2699L188j7360o353n08K647R478r477L14K720k563L374j7971
$$ 52449 54683 67382 70570 53210 46857 46349 48996 58474 48997 49311 52031 49468 52842 34871
10412C4871j7050J3461L0380K4210P83k2852R212j8707J0888k0325j003J0119
$$ 34871 17821 31282 61662 85872 86655 63803 73015 54308 65196 44871 43868 53987
10400E3987J933J6006L987q535m1509j5519J1671J9420n925k3132K1182J0663
$$ 53987 55920 71926 75913 67378 25869 10350 22021 41441 35516 12384 33566 44229
10388D4229k4862O294P020J2403N69j508J844J19k1592J6677n721K4672J4340
$$ 44229 19367 25661 32681 45084 45653 44145 45989 46108 24516 41193 35472 60144 74484
10375G4484o784j8788j6758J1792K8454L5300Q080j0943M745K6436j8448k8574
$$ 74484 67700 48912 32154 43946 72400 107700 115780 104837 109582 136018 117570 88996
10363H8996m7919k1623K6305L3532J8399M2134M5990J2267l0067j4656P524J4159
$$ 88996 41077 19454 45759 79291 97690 139824 185814 198081 168014 153358 160882 175041
10351A75041J4115L231j3051j5643L688J1085J83l3196j7453j8333j0407j4380
$$ 175041 189156 192387 179336 163693 167381 178466 178649 145453 128000 109667 99260 84880
10339H4880J42J1281k1105Q616J3176k917l8207k4483J8214J3877Q380L2094K982
$$ 84880 85022 96303 75198 83814 96990 94073 55866 31383 49597 63474 71854 103948 106930
10326A06930k443l5632k3006l29L116j451J1483J2071O296M004q499j2820n489
$$ 106930 104487 68855 45849 45520 48636 47185 58668 70739 77035 81039 72540 59720 54231
10313E4231q804J7131K5033N4221N03J0271N806j0312k823K1043M4463K8042j371
$$ 54231 45427 62558 87591 141812 142315 152586 158392 148080 145257 166300 210763 238805 237434
10300B37434N568K0033L1316N3116O7964R9749J12749K02561L50488N29248Q25070
$$ 237434 243002 263035 294351 347467 415431 515180 627929 830490 1180978 1710226 2535296
10289B535296J082521Q58065J50402m84180o23722k49099L48970O63705L55999
$$ 2535296 3617817 4475882 4626284 4142104 3518382 3269283 3618253 4281958 4637957
10280D637957l66403r36725r99018p67040m77708k70900j80168j04567p1757m1434
$$ 4637957 4271554 3334829 2335811 1568771 1091063 820163 639995 535428 463671 422237
10270D22237l4946l9751k9245L191l4204n0206k3812m643j9042j8040j3875k6998
$$ 422237 387291 347540 318295 321486 287282 237076 213264 208621 189579 171539 157664 130666
10258A30666q619Q897j6541j7219J5665O753M528m413N311M227M1668J6793J572
$$ 130666 122047 130944 114403 97184 112849 119602 124130 119717 125028 129255 170923 187716 189288
10245A89288l909O190O6473R7378J14643J79104J75023J08458J09965J40190J36208
$$ 189288 185379 191569 258042 355420 470063 649167 824190 932648 1042613 1182803 1319011
10234A319011j7736j25030j23618q8242j41473k12435j93565j23642q0444m1939
$$ 1319011 1301275 1176245 1052627 964385 822912 610477 416912 293270 212826 170887
10224A70887l1800r53j6477Q256R390k7852k833J4205p240j1076j8402k2554m17
$$ 170887 139087 138134 121657 129913 139303 111451 108618 122823 115583 104507 86105 63551 63134
10211F3134L262k0477r904l393M1890Q790q376k0725o672r973k7997M714O135
$$ 63134 66396 45919 36015 32622 74512 83302 74926 54201 47529 37556 9559 14273 20408
10198B0408L1877J1530l3835p872K1574N845J5107n305j1258j2243l760P643J0563
$$ 20408 52285 63815 29980 22108 43682 49527 64634 59329 48071 35828 32068 39711 50274
10185E0274R225J0693l2960m0722j2449N3547K9487O97N943L745j904k9753k2416
$$ 50274 59499 70192 37232 -3490 -15939 37608 67095 67792 73735 77480 75576 45823 23407
10172B3407M622K7800L897j3833q303j8286j430R653Q65K2214l456j4160k5022
$$ 23407 28029 55829 59726 45893 37590 19304 17874 27527 28392 50606 47150 32990 7968
10159G968m288Q599m792j3400Q810K399K3455k04L396J1129L601j396j4551R371
$$ 7968 3680 12279 7487 -5913 2897 5296 28751 28547 31943 43072 46673 45277 30726 40097
10145D0097O055K0980J2055l161l8168p089N101k1589j7178K7734M612l9099K7096
$$ 40097 46152 67132 79187 76026 37858 30769 35870 14281 -2897 24837 29449 -9650 17446
10132A7446L1384L240j5114Q719p623l8353k2453J8694M5420K9351j0471l7406
$$ 17446 48830 52070 36956 45675 38052 -301 -22754 -4060 41360 70711 60240 22834
10120B2834j7569R481k4538J98M972J2461m506P897r81K0297k096l1517j6574
$$ 22834 5265 14746 -9792 -9594 -4622 7839 3333 11230 10249 30546 28450 -3067 -19641
10107a9641j935J9945j6748P762O1917L1056k1818l98l3103k9696j0960Q81J736
$$ -19641 -21576 -1631 -18379 -10617 51300 82356 60538 60140 27037 -2659 -13619 -12738 -11002
10094a1002k591J9804N496j86j9509l2340O349K4722o532J7807q509k582o463
$$ -11002 -13593 6211 11707 11521 -7988 -40328 -33979 -9257 -15789 2018 -6491 -9073 -15536
10081a5536R172K2124J7160J0702J454K2901o788n0749%K3403j0774j5337k1640
$$ -15536 -6364 15760 32920 43622 45076 67977 61189 10440 10440 33843 23069 7732 -13908
10068a3908L3310K9783J8005N606m4481j2327q73k7768j8090K5227m113k409j4812
$$ -13908 19402 49185 67190 72796 28315 15988 15115 -12653 -30743 -5516 -9629 -12038 -26850
10055b6850J1752k163L310J8808k627R733N468k849k2741j047l380k154J1347
$$ -26850 -15098 -17261 -13951 4857 2230 11963 17431 14582 -8159 -9206 -12586 -14740 -3393
10042c393N246k110j6190j4319k348J8401M460q286J2238j4060M275J1572K4198
$$ -3393 1853 -257 -16447 -30766 -33114 -14713 -10253 -18539 -6301 -20361 -16086 -4514 19684
10029A9684J0262n588k0049j7168J5299j2459p086m31n225M271J4289J3069J0352
$$ 19684 29946 24358 4309 -12859 2440 -10019 -17105 -17536 -22761 -18490 -4201 8868 19220
10016A9220j4039j5282J943m929M008k724l4514m0506J7341J9865L2128M850k5759
$$ 19220 5181 -10101 -8158 -13087 -9079 -11803 -46317 -86823 -69482 -49617 -17489 -12639 -38398
10003c8398J2996L0604Q675n223J1337J3173j1719k8517o418l452n048n308o602
$$ -38398 -25402 5202 13877 8654 19991 33164 21445 -7072 -13490 -16942 -21990 -27298 -33900
9990c3900q233p229K8741K8965K0667J6444m1164k0059P928J3130k353J0979J5793
$$ -33900 -42133 -49362 -20621 8344 29011 45455 4291 -15768 -7840 5290 2937 13916 29709
9977B9709K4495j9677k6398p890p905r256K2319K3260j9956O116j6504j1620M690
$$ 29709 54204 34527 8129 239 -7666 -16922 5397 28657 8701 14817 -1687 -13307 -8617
9964h617J2205l066j8806n009K2355K8374j4545l9760o279j0998J5501M1488L8824
$$ -8617 3588 522 -18284 -23293 -938 27436 12891 -26869 -33148 -44146 -28645 12843 51667
9951E1667k0670m6577M462K409l0210k851N2721L2008m656j6897k1553m81P219
$$ 51667 30997 -15580 -11118 -8709 -38919 -41770 10951 42959 38303 21406 -147 -628 6591
9938F591N439J0543R983j6791j1863J2697l6568j3003N235K4778J0206p297K0392
$$ 6591 12030 22573 32556 15765 3902 16599 -19969 -32972 -27737 -2959 7247 -50 20342
9925B0342K1428l184q232j4435l398r724K135J4455j6943j9505J2682J5573J9213
$$ 20342 41770 38586 30354 15919 12521 2797 4932 19387 2444 -17061 -4379 11194 30407
9912C0407K4464O989O455j0717k958k2852j4773j8322J1041J2280Q516J2002k0094
$$ 30407 54871 61860 68315 57598 54640 31788 17015 -1307 9734 22014 30530 42532 22438
9899B2438p580j0265R398K1853J7574J2741K1076q013l3864k6636l1329K968J8463
$$ 22438 14858 4593 13991 35844 53418 66159 87235 79222 45358 18722 -12607 -9639 8824
9886H824J4681N72M28q287n731j102K4150J9459q808o882r839J6640q567q32j1522
$$ 8824 23505 24077 24505 16218 10487 9385 33535 52994 44186 37304 27465 44105 35538 34706 23184
9871B3184K714N491p228j408J6065J7802p538K1616k051k0690O111M287j310j1185
$$ 23184 25898 31389 24161 22753 38818 56620 49082 70698 68647 47957 54068 58355 57045 45860
9857D5860k050j1801L386j6327L918M912k6192r165O162Q372J3692J1568k2549
$$ 45860 43810 32009 35395 19068 22986 27898 1706 -7459 -1297 7075 20767 32335 9786
9844I786O752m019m416J2515J4589j5630k7089j1378J5304L660j2822L577J837
$$ 9786 16538 12519 8103 20618 35207 19577 -7512 -18890 -3586 74 -12748 -9171 -7334
9831g334K4907J8354j6527j8918k211p593j6833L846K617J5134K3468J5076J4162
$$ -7334 17573 35927 19400 482 -1729 -9322 -26155 -22309 -19692 -4558 18910 33986 48148
9818D8148j0103q285K342M381O850K7883m987j7502j1458l9200m931N089K0747
$$ 48148 38045 29760 32102 36483 43333 71216 66229 48727 37269 -1931 -6862 -1773 18974
9805A8974J6562j7198R13K9122j126l2438k7773R819K1385j5164J7906j7239J6845
$$ 18974 35536 18338 19251 48373 47247 14809 -12964 -3145 18240 3076 20982 3743 20588
9792B0588j4705l1003j6854R443L0291J3954K0991J7735l4847o608n537j5861
$$ 20588 5883 -25120 -41974 -32531 -2240 11714 32705 50440 15593 8985 3448 -12413
9780a2413Q139L1906J905j6953r20K715j920k7179M143m015J1967J2930J4816
$$ -12413 -4274 27632 29537 12584 11664 14379 12459 -14720 -10577 -14592 -2625 10305 25121
9767B5121j3307j9979J0216K4779J869k4779o221j7256l3828j8647K6658N843
$$ 25121 11814 -8165 2051 26830 28699 3920 -2301 -19557 -53385 -72032 -45374 -39531
9755c9531K9089K6753j8302J57j1823k0841P902J6864K7926p76K208R322j114
$$ -39531 -10442 16311 -1991 -1834 -13657 -34498 -26596 -9732 18194 17418 19626 28948 27834
9742B7834Q404P225q236j6811k6883k3289l683J4828J0179k3819Q521J709K1515
$$ 27834 36238 43463 35227 18416 -8467 -31756 -35439 -20611 -10432 -34251 -25730 -24021 -2506
9729b506J4329K8980j8703K5087J1735k3923J552K3818p565k8669k5132R582k665
$$ -2506 11823 40803 22100 47187 58922 34999 36551 60369 52804 24135 -997 8585 5920
9716E920jM099P617n880P169J0298k0988j9090m225l647J5765k2149k0148R587
$$ 5920 5919 10018 17635 11755 18924 29222 8234 -10856 -15081 -18728 -2963 -25112 -45260 -35673
9702c5673J0174j1844J5679M6000r68o819j2466j0307M563l667K5876J1945r78
$$ -35673 -25499 -37343 -21664 24336 23368 16549 4083 -6224 -1661 -5328 20548 32493 31515
9689C1515K6511R25N129m740n727k2834m0449L0091J6636k1274j2925J429l402
$$ 31515 58026 58951 64080 59340 53613 30779 -9670 20421 37057 15783 2858 4287 885
9676H85j5258m054L1153k0367K0070J2722q855J2487L1565M046j0504k3205j2886
$$ 885 -14373 -18427 12726 -7641 12429 25151 16296 28783 60348 64394 53890 30685 17799
9663A7799k839O932J4430J0749j3380K518j8523O264K685L5672R639k1574j7842
$$ 17799 14960 21892 36322 47071 33691 36209 17686 23950 26635 62307 71946 50372 32530
9650C2530m998Q601J1921k0971l0909j8291R251L7973n071k1728k681K6915N867
$$ 32530 27532 36133 48054 27083 -3826 -22117 -12866 25107 20036 -1692 -4373 22542 28409
9637B8409j0098q8j460P635J3175j6762l0503N276J8373J3685J2085j9625K925
$$ 28409 18311 18223 16763 24398 37573 20811 -9692 -4416 13957 27642 39727 20102 23027
9624B3027j465k2861Q709j052K2278j908j2758J0304J6493j2564R631J6733Q023
$$ 23027 21562 -1299 7410 6358 28636 26728 13970 24274 40767 28203 37834 54567 62590
9611F2590k8234j5761k136m341k700K5242K1948N927j8167k29J840j516N916O386
$$ 62590 34356 18595 16459 12118 9418 34660 56608 62535 44368 44139 45979 44463 50379 56765
9597E6765q377L8849R107L2446K2085p029l1619J4458L1905M2899n532k3622k8369
$$ 56765 48388 87237 96344 128790 150875 143846 112227 126685 158590 201489 195957 172335 143966
9584A43966p724j2953j8404j0957j8591J3744K0672O064O227J8738O129m882J0072
$$ 143966 136242 123289 104885 93928 75337 89081 109753 115817 122044 140782 146911 142029 152101
9571A52101J0322Q635K4131J2979k0686k7753K177K1505R192n917P52J2137k0133
$$ 152101 162423 171058 195189 208168 187482 159729 161906 183411 192603 186686 187438 199575 179442
9558A79442J644n703l4909k5659K4902K0289L5778J8294M3567J9021N5678P0700
$$ 179442 181086 175383 140474 114815 139717 160006 195784 214078 257645 276666 332344 403044
9546D03044O6109j7920r0577r4218l9158m0727k4109l2196j6588n965J1538L374
$$ 403044 469153 451233 360656 266438 227280 186553 162444 130248 113660 107695 119233 122607
9534A22607n952Q274L5233L410j1640L0692l953J1751r07k1126j5431Q842p817
$$ 122607 116655 124929 160162 163572 151932 182624 178671 190422 189515 168389 152958 161800 153983
9521A53983j9384N223K686k1971l6596m6041J0406N2635L0869p738j2138r502
$$ 153983 134599 139822 142508 120537 83941 37900 48306 100941 131810 124072 111934 102432
9509A02432J9482N585j2111K9300N9045L1158j1487m0296k5028l1795p467N29
$$ 102432 121914 127499 115388 144688 203733 234891 223404 183108 158080 126285 118818 119347
9497A19347J3983k1874j1882k5157J8424K4623K7506J1485j6461j1368k9635q465
$$ 119347 133330 111456 99574 74417 92841 117464 144970 156455 139994 128626 98991 90526
9485I0526k1974l7367n460K9665M9235L2700n367l1818N246k004K021j8420k3760
$$ 90526 68552 31185 25725 55390 104625 137325 131958 100140 105386 103382 105403 86983 63223
9472F3223l4169o140M3203L2383L124j9996J609K1201o240J2270n308R932O018
$$ 63223 29054 22914 66117 98500 101624 81628 83237 104438 98198 110468 105160 115092 121110
9459A21110L4902l565j4158j7432m335K4444J9857J1757l210N888q625K0198J5975
$$ 121110 156012 152447 138289 120857 116522 140966 160823 172580 169370 175258 166633 186831 202806
9446B02806q137q162l5404N040J4692j1506K5157L224j2101j601q815j2568K5913
$$ 202806 194669 186507 151103 156143 170835 159329 184486 187710 175609 174008 165193 152625 178538
9433A78538J9211J0142K1647L0587K4859k8220j270l40J3411J8033J547o399O801
$$ 178538 197749 207891 229538 260125 284984 256764 255494 255154 268565 286598 288145 281746 288547
9420B88547m247m131K1701L8938m201R918K4244K4417J5298J4125K1972K0095
$$ 288547 284300 280169 301870 340808 336607 346525 370769 395186 410484 424609 446581 466676
9408D66676l053j270P549L2736M0513K5940N967K5923N1660m816M3621M0173L1806
$$ 466676 463623 462353 469902 502638 543151 569091 575058 600981 652641 647825 691446 731619 763425
9395G63425N2104M1018N4089M7844L5103K9498N4255M8069M2745Q5456R9407P6723
$$ 763425 815529 856547 910636 958480 993583 1023081 1077336 1125405 1168150 1253606 1353013 1429736
9383A429736R3118J35870J39318J12441J02464J41992J73515J51433J46585K01280
$$ 1429736 1522854 1658724 1798042 1910483 2012947 2154939 2328454 2479887 2626472 2827752
9373B827752J96359J93513K39611K44785K80480K70187L32347L47877L29103L32497
$$ 2827752 3024111 3217624 3457235 3702020 3982500 4252687 4585034 4932911 5262014 5594511
9363E594511L50656L65952L66192L79297L66344L35333L38375L23923K88270K99900
$$ 5594511 5945167 6311119 6677311 7056608 7422952 7758285 8096660 8420583 8708853 9008753
9353I008753K78977K28707K35413J97844J85546J54140J96341K10411J89226K22367
$$ 9008753 9287730 9516437 9751850 9949694 10135240 10289380 10485721 10696132 10885358 11107725
9343A1107725K29004K32267K77009L03272L36410L84697M26480M89272N37832
$$ 11107725 11336729 11568996 11846005 12149277 12485687 12870384 13296864 13786136 14323968
9334A4323968N83250O50222P15921P34483P97516Q06265Q54829Q84215Q75980
$$ 14323968 14907218 15557440 16273361 17007844 17805360 18611625 19466454 20350669 21226649
9325B1226649Q28401P55966O36314N19413L57430J86034p847j98024l50678n02152
$$ 21226649 22055050 22811016 23447330 23966743 24324173 24510207 24502360 24304336 23953658 23451506
9315B3451506o39496p38142q05905q33775q30874p91573p60607p05380o76672
$$ 23451506 22812010 22073868 21267963 20434188 19603314 18811741 18051134 17345754 16669082
9306A6669082o76749n98768n38542m79474m77357m21106l54270l12980l14684
$$ 16669082 15992333 15393565 14855023 14375549 13898192 13477086 13122816 12809836 12495152
9297A2495152k64313k20793j89827j87447k06220k05148k03851j90556j87167
$$ 12495152 12230839 12010046 11820219 11632772 11426552 11221404 11017553 10826997 10639830
9288A0639830k15466k31178k42838k71584k85456l12921l30938l53902l44575
$$ 10639830 10424364 10193186 9950348 9678764 9393308 9080387 8749449 8395547 8050972
9279H050972l48276l17838l35133l69640l61975l47937l39102l00372k98406k79166
$$ 8050972 7702696 7384858 7049725 6680085 6318110 5970173 5631071 5330699 5032293 4753127
9269D753127k30999k55699k44428k26378j89400j80281k02732j63915j55558j48987
$$ 4753127 4522128 4266429 4022001 3795623 3606223 3425942 3223210 3059295 2903737 2754750
9259B754750j19433j27238j38600j16691q4532q2858r3964r2995o6121o0572p4406
$$ 2754750 2635317 2508079 2369479 2252788 2168256 2085398 1991434 1898439 1832318 1771746 1697340
9248A697340o4008m8769m4584p8187n6178m2108m1363j6296J4788k0965n2902
$$ 1697340 1633332 1584563 1539979 1461792 1405614 1363506 1322143 1305847 1320635 1299670 1246768
9237A246768m3032m0731m4243n9416m1791k0101n241j7543r295k1897k3421q097
$$ 1246768 1203736 1163005 1118762 1059346 1017555 997454 992213 974670 965375 943478 920057 911960
9225I11960P379j7165l4509l5436r660k2700j2560J1016l797j6779j9183J2767
$$ 911960 919339 902174 867665 832229 822569 799869 787309 798325 794528 777749 758566 771333
9213G71333m162l3941m3942m650M117K5038J1400j1601j0942j4355L634J7123
$$ 771333 767171 733230 689288 684638 688755 713793 725193 713592 702650 688295 691929 709052
9201G09052o465k8344j0889j548j4668k471M874M879k6260k0773J4626Q509J6143
$$ 709052 702587 674243 663354 661806 647138 644667 649541 654420 628160 607387 622013 630522 646665
9188F46665K195l56p740p740L288N511P820n813J3662L3961j3462l1516L494J9844
$$ 646665 648860 648504 640764 633024 636312 641823 649643 643830 657492 691453 677991 646475 649969 669813
9174F69813k489M704m316J8577J0395j4968j1762q842j8736K8196L6391J0453
$$ 669813 667324 672028 667712 686289 696684 681716 669954 661112 642376 670572 706963 717416
9162G17416K2498k390J5491K5891N716j4204N29K8772J9849o395r819L451p058
$$ 717416 739914 737524 753015 778906 784622 770418 770947 799719 819568 813173 803354 806805 799747
9149G99747m656R301J3381n430J1563K1709J8706K7528J0827R407K1162K2489
$$ 799747 795091 804392 817773 812343 823906 845615 864321 891849 902676 912083 933245 955734
9137I55734J7308O930L0113L1453J2857j4837p608K5008q718J2336J6775M0095
$$ 955734 973042 979972 1010085 1041538 1054395 1039558 1031950 1056958 1048240 1060576 1077351 1117446
9125A117446M8549K5903K910N012L414K4927M186k4847N266J7071j5893j2919
$$ 1117446 1165995 1191898 1194808 1199820 1203234 1228161 1232347 1207500 1212766 1229837 1213944 1201025
9113A201025L998L372k5427k0347j788k2224j1430q871J496J486j8941m6951k661
$$ 1201025 1205023 1208395 1182968 1162621 1160833 1138609 1127179 1118308 1119804 1121290 1102349 1055398 1052737
9100A052737N42k9076j4600j8532k1906k3484k8010j8002k7075l2957j3554j9983
$$ 1052737 1053279 1024203 1009603 991071 969165 945681 917671 899669 872594 839637 826083 806100
9088H06100k7822l7575l9108k6651L2599j4818l6065j7392l2332L75j0308j9051
$$ 806100 778278 740703 701595 674944 707543 692725 656660 639268 606936 607311 597003 577952
9076E77952l5563k7657k3073M115p103l0197l3375j3402k6845o580j635j1666
$$ 577952 542389 514732 491659 495774 488671 458474 425099 411697 384852 378272 376637 364971
9064C64971j8686R914Q558j7926J346m715k8532j8593j5293K328l1111R304K8737
$$ 364971 346285 356199 364757 346831 348177 343462 314930 296337 281044 283372 252261 261565 290302
9051B90302J1053J2305j3335l7930J5236j1515r971k9374j6930J0969k0561k1471
$$ 290302 301355 313660 300325 262395 277631 266116 256145 226771 209841 220810 200249 178778
9039A78778J0171L0607J441n450j2226j3460j0965k3160P811J198J035K83j7934
$$ 178778 188949 219556 220997 215547 203321 189861 178896 155736 163547 164745 165780 166063 148129
9026A48129j77J8243o460R223M5418j6807j3025p638O079J5467j3792l0507l0894
$$ 148129 147952 166195 159735 168958 214376 197569 184544 176906 182985 198452 184660 154153 123259
9013A23259K437K842j0244J9855J8346K3280r904k2404j8316n890p638l913K673
$$ 123259 125696 128538 118294 138149 156495 179775 169871 147467 129151 123261 115623 111710 114383
9000A14383k1817l800J5786Q615J857J8778L3581O471m764J3278k6898k8812p493
$$ 114383 92566 88766 104552 113167 115024 133802 167383 173854 169090 182368 155470 126658 119165
8987A19165j6346k0528L4065r4k7020q246O997l872k772o456K589K1058J1007
$$ 119165 102819 82291 116356 116262 89242 80996 87993 84121 81349 74893 77482 98540 109547
8974A09547k3439k3327k8145J921K8089M577Q086J4602j2921j649K048j924L3448
$$ 109547 86108 62781 34636 36557 64646 69223 77309 91911 78990 77341 79389 77465 110913
8961A10913N8715P801m7191m4138r780P24Q127P682L0292j1482k5271p268J3553
$$ 110913 169628 177429 130238 86100 76320 77044 85171 92853 123145 111663 86392 79124 92677
8948I2677j1933m138K4810p042q450k7735J8932J5578N283k1878j2445N526K3005
$$ 92677 80744 76606 101416 94374 85924 58189 77121 92699 97982 76104 63659 69185 92190
8935I2190P833l0072J9523M3034k661j1990P280R838K2534L4239M504K8087K1986
$$ 92190 100023 69951 89474 132508 129847 117857 125137 134975 157509 191748 196252 224339 246325
8922B46325K8611N9636O0673N6447M8879L3647M0505P0471R1092J12618J13431
$$ 246325 274936 334572 395245 451692 500571 534218 574723 645194 736286 848904 962335
8911I62335J48399K04141K98098M93552P68499J193382J924283K754715K596887
$$ 962335 1110734 1314875 1612973 2106525 2875024 4068406 5992689 8747404 11344291
8902A1344291K19979k049766k725230k202477j409243q47890n39057l77709k25623
$$ 11344291 11564270 9514504 6789274 4586797 3177554 2329664 1790607 1412898 1187275
8893A187275j45687j22575q0352o1596q9564q2538p4939l8649l8123n8232n4462
$$ 1187275 1041588 919013 838661 777065 687501 604963 530024 491375 453252 395020 340558
8882C40558j3538l2832k8353j8069m788k8195j2319k9853n258Q474J692l3784
$$ 340558 327020 294188 265835 247766 242978 214783 202464 172611 167353 175827 177519 143735
8870A43735k0824P586k8678j8327K44J6613K6811J6932O823j7359j1289j8842
$$ 143735 122911 130497 101819 83492 83736 100349 127160 144092 150915 133556 122267 103425
8858A03425j4294k431j3014j7985p92P423l1533N0773L0181M287R325k5426k5512
$$ 103425 89131 86700 73686 55701 54909 62332 30799 81572 111753 116040 125365 99939 74427
8845G4427J0241l6324J5217K6965J3676p576j7899q783k2709k8061Q131J9214
$$ 74427 84668 48344 63561 90526 104202 96626 78727 69944 47235 19174 27305 46519
8833D6519m606k0216l19r029j8965J3876L8682N0572K3779k6278K3056J5464l241
$$ 46519 41913 21697 21378 12349 -6616 7260 45942 96514 120293 94015 117071 132535 129294
8820A29294l0191j8927k8651k8957J601K5327k0356k3649M8981J2994j8584K885
$$ 129294 99103 80176 51525 22568 24169 49496 29140 5491 54472 67466 48882 51767
8808E1767n618L626k309j7051L079Q774L0337J8362J1504j8936l72K0126n274
$$ 51767 46149 49775 47466 30415 33494 42268 72605 90967 102471 83535 83163 103289 98015
8795I8015N541j8255m817l081k8023l9134K458J8031K4327O267J1004J0981J3338
$$ 98015 103556 85301 80484 77403 49380 10246 12704 30735 55062 61329 72333 83314 96652
8782I6652Q570k7159j2295L328J0144j6839j559N109j3951k5223O107J2811j0768
$$ 96652 105222 78063 65768 69096 79240 62401 60842 65951 52000 26777 32884 45695 34927
8769C4927m906k676j5887l1120K5973R716j0359J6407M0112j4516m460L3543j1648
$$ 34927 30021 27345 11458 -19662 6311 16027 5668 22075 62187 47671 43211 76754 65106
8756F5106j9579r142k6851K5905K0137m6361J3561J5159j4285j470J558L814m410
$$ 65106 45527 36385 9534 35439 55576 9215 22776 37935 23650 22180 23738 27552 23142
8743B3142k0758K8222L2640J2653k265k1650j654M681r5j2017J39k0207k0018
$$ 23142 2384 30606 63246 75899 73634 51984 50330 55011 54916 42899 43038 22831 2813
8730B813J1836K7050j5342m3479K051K0441J0474K1091P006L579k7162k3440L2921
$$ 2813 14649 41699 26357 -17122 -15071 5370 15844 36935 43941 47520 20358 -3082 29839
8717B9839J105l94j2447l821J8109P083J0253J8094n50L714j0574k1896M638l634
$$ 29839 30944 30550 18103 14282 32391 39474 49727 67821 67271 70985 60411 38515 43153 39519
8703C9519j7967J3131k5066k9785L5704K4963j2833r919J3505L0631j4047j9009
$$ 39519 21552 34683 9617 -20168 15536 40499 27666 17747 31252 61883 47836 28827
8691B8827o124r430j6291j8131j0115L7846L9941J1564q203p719l293j3353K0494
$$ 28827 22703 13273 -3018 -21149 -31264 6582 46523 58087 49884 42165 38872 25519 46013
8678D6013K9696m866j2395M178J845j3916j9170k8484P18j71M097N766L3293O770
$$ 46013 75709 70843 58448 62626 64471 50555 31385 2901 3619 3448 7545 13311 46604 53374
8664E3374r544k2219j8440J405j444O072L418Q104J5617K0911Q059n200p595k689
$$ 53374 43830 21611 3171 4576 3132 9204 12622 20726 36343 57254 65313 60113 52518 49829
8650D9829K0121n304j9445j9356l66R287K3006N280j0422l930K2848J4350L3976
$$ 49829 69950 64646 45201 25845 25479 34766 57772 63052 52630 48700 71548 85898 119874
8637A19874L9925K59j4838q804P434J2871j4826R956J5843O805k4372J8298L0628
$$ 119874 159799 160058 145220 136416 143850 156721 141895 151851 167694 174499 150127 168425 199053
8624A99053K1758k7320r959J1828Q116k7526k4420p061k4621J0935Q559j1180
$$ 199053 220811 193491 183532 195360 203476 175950 151530 144469 119848 130783 139342 128162
8612A28162k4935Q014L421l4445j2969k1054P631O660q009n35J0777K2348L5468
$$ 128162 103227 111241 114662 80217 67248 46194 53825 60485 52476 51941 62718 85066 120534
8599A20534j0655j1051r236j8818K70M368l6838k3056N111L1247j0145N887J7462
$$ 120534 109879 98828 89592 70774 71044 75412 38574 15518 20629 51876 41731 47618 65080
8586F5080j865j4782J600j3487m270J5106l84k896j1638k4527j3843J7976M708
$$ 65080 63215 48433 50033 36546 32276 47382 46998 44102 32464 7937 -5906 12070 16778
8573A6778K3599L0379Q187J9045l3922p018R582P531J5504k1020k0210j7444q084
$$ 16778 40377 70756 78943 97988 64066 57048 66630 74161 89665 68645 48435 30991 22907
8560B2907J6789K2102O121R974j2734j8550J5782J068R514J4318k3304j8328p71
$$ 22907 39696 61798 67919 77893 65159 46609 62391 63459 72973 87291 63987 45659 44888
8547D4888K4556l927J1857j5337k0392L493J5918r926m0448q474r57K0897L6447
$$ 44888 69444 65517 77374 62037 41645 45138 61056 51130 10682 2208 1251 22148 58595
8534E8595N797k3601k6441j5644J8570L078k244K233j9669P244K3347J665k4864
$$ 58595 64392 40791 14350 -1294 17276 20354 18110 20343 674 7918 31265 32930 8066
8521H066l00m12j658J9629J6398q018j1164k686J771k9187O086M9631J3046n373
$$ 8066 7766 7354 5696 25325 41723 33705 22541 19855 21626 -7561 -1475 48156 61202 55829
8507E5829r651j7805r07J9749N572J1747M348j7986j7472l8955n293k067K4691
$$ 55829 46178 28373 27466 47215 52787 64534 68882 50896 33424 -5531 -10824 -12891 11800
8494A1800J3895k1884J1533L8650J5519p959N077J5313J5261j2939k986k702k2532
$$ 11800 25695 3811 15344 53994 69513 61554 66631 81944 97205 84266 81280 78578 56046
8481E6046j9248j6317N31Q595r5J4625O258n760k3074o710K5380J5334j4858K401
$$ 56046 36798 20481 21012 29607 29512 44137 50395 44635 21561 14851 40231 55565 40707 43108
8467D3108M825J90L702j5674r864j170J9398R837K0279j077j9299q19J7454k1394
$$ 43108 47933 48123 51825 36151 26287 25117 44515 54352 74631 73554 54255 53436 70890 49496
8453D9496l7621n945J9421n182N292J8809J8941R95J2812m3669j5004L2317L882
$$ 49496 11875 5930 25351 20169 25461 44270 63211 64206 77018 33349 18345 50662 54544
8440E4544j7834j1862m802r942J0143J5651Q261J992Q93j6863L539K4017J6757
$$ 54544 36710 24848 20046 10104 20247 35898 44159 46151 47044 30181 33720 57737 74494
8427G4494K3949j2766l3119j1502N990J544j4039p59j886l151J6776J8414o516
$$ 74494 98443 85677 52558 41056 47046 48590 34551 33792 31906 28755 45531 63945 57429
8414E7429q650r72j8803P224j3839j9525l590K8425r448K284J5026j2303k0820
$$ 57429 48779 47807 29004 36228 22389 2864 -726 27699 18251 20535 35561 23258 2438
8401B438P537J8657R352J7617j1958k0875J421J7662O65k5159j918K7500J0042
$$ 2438 9975 28632 37984 55601 43643 22768 24189 41851 42516 17357 15439 42939 52981
8388E2981j1497m3371j2330J0390P387M324K286M732J6582K5523J5675P223l0507
$$ 52981 41484 -1887 -14217 -3827 3560 7884 10170 14902 31484 57007 72682 79905 49398
8375D9398l6174j6519J0700R174J6710K0313J5915o598k9411j2549o103p994r823
$$ 49398 13224 -3295 7405 16579 33289 53602 69517 62919 33508 20959 14856 6862 -2961
8362b961L650L4652J3700j8123k4042o735K3888k7380l4725P456L5264j0273k175
$$ -2961 689 35341 49041 30918 6876 141 24029 -3351 -38076 -30620 4644 -5629 -7804
8349g804K337K4649K5547r401l0739q266K912q650l720L4645J7186j9122j5152
$$ -7804 -5467 19182 44729 35328 4589 -3677 -765 -9415 -13135 21510 38696 19574 4422
8336D422k0272j5802Q954K0357K0224j765q700J025K4366p57j5698P089L005j5176
$$ 4422 -15850 -31652 -22698 -2341 17883 16118 7418 8443 32809 32052 16354 23443 26448 11272
8322A1272L640J4600k817O518L3378j084k2764k9051J214J7736J8254K1307N265
$$ 11272 14912 29512 26695 33213 66591 65507 42743 13692 14906 32642 50896 72203 77468
8309G7468k24l2517k4550J0591j4071j7178l893n228R671J4174J6074k6665j4215
$$ 77468 77244 44727 20177 30768 16697 -481 -4374 -9602 69 14243 30317 3652 -10563
8296a0563P832J8636N690K3340J148l662J4756k1892N692j0504k4273J2250N516
$$ -10563 -2731 15905 21595 44935 46083 42421 57177 35285 40977 30473 6200 18450 23966
8283B3966j9739k6701k1896K2865K8981j9777Q808q221K1764M0314k7394k2899
$$ 23966 4227 -22474 -44370 -21505 7476 -12301 -3493 -11714 10050 50364 22970 71
8271G1J2965j5302l389k0019K182L264J3121J1687J0430j4269j73K1619J0090
$$ 71 13036 -2266 -5655 -25674 -23492 -20228 -7107 4580 15010 741 568 22187 32277
8258C2277r177K47j2599k375j5757j44k7013J3612K0979j4350Q490O999P816M566
$$ 32277 23100 23347 10748 8373 -7384 -7528 -34541 -20929 50 -14300 -5810 1189 9005 13571
8244A3571O58J6180J5124j1925L720J2964k8035J582J2618j9713k996M812N649
$$ 13571 14229 30409 45533 33608 37328 50292 22257 23839 36457 16744 13748 18560 24209
8231B4209K0439j1778k555j0130J0837Q285j5480k6723j662Q13L156J0885K5137
$$ 24209 44648 32870 30315 20185 31022 39307 23827 -2896 -4558 -3745 -589 10296 35433
8218C5433J426j1845j7913k0458k9065L028K9018q612j133k424N065j2378K4455
$$ 35433 36859 25014 7101 -13357 -42422 -39394 -10376 -18988 -20121 -22545 -17480 -29858 -5403
8205e403J0323l7307l9246J4097J9886N0892J7800j214k5234j0628J0640o537
$$ -5403 4920 -32387 -71633 -57536 -37650 13242 31042 29828 4594 -6034 4606 -1931
8193a931k382L966J4588J5043K235J663J584j2736o028n83J623J2566K394J5066
$$ -1931 -4313 -347 14241 29284 31519 33182 34766 22030 16002 15419 17042 29608 32002 47068
8179D7068M924r999k0793J0751j0184j2246l6323M594n312r962J2551k2666R015
$$ 47068 51992 41993 21200 31951 21767 9521 -26802 -22208 -27520 -37482 -24931 -47597 -38582
8166c8582L7979K4076k6390p057J2561m895K9985J6644k375n173r122m422n618
$$ -38582 -603 23473 -2917 -9974 2587 -2308 27677 44321 41946 36773 27651 23229 17611
8153A7611Q060k4518k5355r919L2376M0272l57k2533J820o965n434q112j7476
$$ 17611 25671 1153 -24202 -34121 -1745 38527 38170 15637 17457 10492 5058 -3054 -20530
8140b0530L26K1997P899q913j9533K2096J8744k5678p469n204J1452J7690k2502
$$ -20530 -20204 1793 9692 779 -18754 3342 22086 -3592 -11061 -16265 -4813 12877 -9625
8127i625j1692m916K5938L1346J1010j3743k2963j982l8449J3413J2933N792J0015
$$ -9625 -21317 -26233 -295 31051 42061 28318 5355 3373 -35076 -21663 -8730 -2938 7077
8114G077k04j1824j2802J4716j0397p96Q994J3861j1711j9794j4001J2242Q328
$$ 7077 6873 -4951 -17753 -3037 -13434 -14230 -5236 8625 -3086 -22880 -36881 -24639 -16311
8101a6311r734j6231K6347J4927r171j125k0459K0824K1726K3990j1862n440l418
$$ -16311 -26045 -42276 -15929 -1002 -10173 -11298 -31757 -10933 10793 34783 22921 17481 14063
8088A4063J464K254j4542J0004j3861J0725nR642J9439m003j1486k4049j8527
$$ 14063 15527 17781 3239 13243 -618 10107 10102 19744 39183 35180 23694 -355 -18882
8075a8882p023J3576N763L51j2443l587k303J4190L731m085K248r420j0652J1581
$$ -18882 -25905 -12329 -6566 -6215 -18658 -22245 -24548 -10358 -6627 -10712 -8464 -17884 -28536 -16955
8061a6955K9102J8278R904k290M694o219k8735j3240O124K1895o95k6363R864
$$ -16955 12147 30425 40329 38039 42733 36514 7779 -5461 663 22558 21863 -4500 5364
8048E364L804P216K7544R534N19j0710k080J0323j3318j7486L69J2132l225k834
$$ 5364 9168 16384 43928 53462 53981 43271 41191 51514 38196 20710 21079 33211 29986 27152
8034B7152R542R812J5248q625p808j1605k0766k9684M238J1873R999R198j2911
$$ 27152 36694 46506 61754 53129 45321 33716 12950 -16734 -12496 -623 9376 18574 5663
8021E663L143K2335Q627k4801j4317m510J0188N337K8576J2050l5319j9103J9320
$$ 5663 8806 31141 39768 14967 650 -3860 6328 11665 40241 52291 16972 -2131 17189
8008A7189J9687K906j4059k5347j256M2710J0288P58J1797l7550l4816K5027J9970
$$ 17189 36876 39782 25723 376 -880 41830 52118 52876 64673 27123 -7693 17334 37304
7995C7304J1942M314N490j4773K84L7297j1264j8338J2306J5914j5720m7164k0182
$$ 37304 49246 53560 59050 44277 44561 81858 70594 52256 64562 80476 64756 17592 -2590
7982b590J1543o622r984R871K5880J7744l2972J981K1056R481l7981k6724P460
$$ -2590 8953 2331 -7653 2218 28098 45842 12870 14851 35907 45388 7407 -19317 -11857
7969a1857J0467j379r909k454J6495J7766K2609P487q667P728j8255k6408J4156
$$ -11857 -1390 -2769 -12678 -15132 1363 19129 41738 49225 40558 48286 30031 3623 17779
7956A7779j391j2737P392k862j0529r239p971j1662K3089J7357Q89n840o278k0825
$$ 17779 16388 3651 11043 8181 -2348 -11587 -19558 -31220 -8131 9226 10115 4275 -2003 -22828
7942b2828k519K8660K682j5772N735R701K5544J4571l204l234k1695L057j3852
$$ -22828 -25347 3313 5995 -9777 -4042 5659 31203 45774 42570 39336 17641 20698 6846
7929F846m297n28j945l6091q216J3910k3537k170L5432J9331J3405n767J4393
$$ 6846 2549 2021 76 -36015 -44231 -30321 -53858 -56028 -20596 -1265 12140 6373 20766
7916B0766J2625j2500k2442p447j0696o594J6180O474K2026R297M019n142J8903
$$ 20766 33391 20891 -1551 -8998 -19694 -26288 -10108 -3634 18392 27689 31708 26566 45469
7903D5469r907l4795j233Q766j1748J7062j1131k3206K5424m292J3047j2981J2125
$$ 45469 35562 767 -466 8300 -3448 13614 2483 -20723 4701 409 13456 475 12600
7890A2600P170j2443K510j2490k0772q883L4054K1620m252P159k0398j3481J607
$$ 12600 19770 7327 9837 -2653 -23425 -32308 1746 23366 19114 26273 5875 -7606 -5999
7877e999J3797O039k7474m5568q338K9255j763J3715k692M3499J4391k059j3171
$$ -5999 7798 13837 -13637 -59205 -67543 -38288 -40051 -26336 -29028 14471 28862 26803 13632
7864A3632j8245k8370k6156J6098M1137J440j90M080p78j3524j2908J9299J0521
$$ 13632 -4613 -32983 -59139 -43041 -1904 -464 -654 3426 2648 -10876 -23784 -4485 6036
7851F036j3203n69O811q987O602l230J765K8429J8408k7189J5791j1148m0041
$$ 6036 -7167 -7736 -925 -9912 -3310 -6540 -4775 23654 42062 14873 30664 19516 -20525
7838b0525j3617K1989p17m721J1935j2659l177j9321J9939K0523k687j6477K786
$$ -20525 -34142 -12153 -12870 -17591 -5656 -18315 -21492 -40813 -20874 -351 -3038 -19515 -16729
7825a6729J7746L951j549J5426K49p660k5509K587K8567j968J7194k6133k5688
$$ -16729 1017 4968 3419 18845 19094 11434 -14075 -11488 17079 15111 32305 6172 -19516
7812a9516J850R771K4446J774J872l641r864j6646J74j266J2197J3866j0378k8106
$$ -19516 -17666 -7895 16551 18325 20197 16556 6692 -9954 -9780 -11046 1151 15017 4639 -23467
7798b3467p447P881p381N515J7523L320q269q718J2477n959j8980K464K2064j7274
$$ -23467 -30914 -23033 -30414 -24899 -7376 -4056 -12325 -21043 -8566 -14525 -33505 -31041 -8977 -26251
7784b6251n147K5056O341l137j1940J4333M129p761l400J9515j415J0695j8078
$$ -26251 -31398 -6342 -1 -3138 -15078 -745 3384 -4377 -7777 11738 10323 21018 2940
7771B940k7503j6891Q798J0877k2512k04J2090K3334J8675m871J7058p195l2026
$$ 2940 -24563 -41454 -32656 -21779 -44291 -44495 -32405 -9071 9604 4733 21791 14596 -17430
7758a7430k1430k119J8118J8835O548j0966n810J0156k19N590K4024o077l1988
$$ -17430 -38860 -40979 -22861 -4026 2522 -8444 -14254 -4098 -4317 1273 25297 19220 -12768
7745a2768l4280K4298K037n456J5771L3520L562j5417l370j0754M037J1034j7748
$$ -12768 -47048 -22750 -20713 -26169 -10398 23122 26684 11267 7897 -2857 1180 12214 -5534
7732e534k6919J2961J1187J6402K2444n839m412k8800k346J6815o066m6067j9949
$$ -5534 -32453 -19492 -8305 8097 30541 24702 20290 -8510 -10856 5959 -107 -46174 -66123
7719f6123j2998M9919K4518K4000K609l1029j6920J1059K4014P175J933k1234
$$ -66123 -79121 -29202 -4684 19316 21925 -9104 -26024 -14965 9049 16224 18157 -3077
7707c077j9113M168j4671k64p071p338K1696J0058J0589j6362R056J4614j3846
$$ -3077 -22190 -18022 -32693 -32957 -40028 -47366 -25670 -15612 -5023 -21385 -12329 2285 -11561
7694a1561n066J427k9600J1167p185j0234L1822K1340L99k0791J8347R857N504
$$ -11561 -16627 -15200 -44800 -33633 -40818 -51052 -19230 2110 2509 -18282 65 9922 15426
7681A5426j9870l4763q485O448j4559L0843L4865J1246m804k3768j9635J2677
$$ 15426 -4444 -39207 -47692 -41244 -55803 -24960 9905 21151 16347 -7421 -27056 -14379
7669a4379R747P635k092R744j037k1082O210J1953J2434r352j112M83m1688l057
$$ -14379 -4632 3003 911 10655 9618 -11464 -5254 6699 19133 9781 8669 9152 -32536 -35593
7655c5593L0589J7515j6973j6281k6277j5113J7342K866j2415j094J1408j0383
$$ -35593 -5004 12511 -4462 -20743 -47020 -62133 -44791 -41925 -54340 -55434 -44026 -54409
7643e4409N273K4793J183q164K5995L437J294j2675K6702J6558J2755n303q160
$$ -54409 -49136 -24343 -23160 -31324 -5329 -1892 -598 -13273 13429 29987 42742 37439 29279
7630B9279j9448l5430m068J4955j0669J97M914n34j4300K980J0481J1398N450
$$ 29279 9831 -25599 -29667 -14712 -25381 -25184 -20270 -20804 -35104 -32124 -21643 -10245 -4795
7617d795k7375j6361m883J8300K2388O73j2580j9182K9367p362k6999j255K8347
$$ -4795 -32170 -48531 -53414 -35114 -12726 -12053 -24633 -43815 -14448 -21810 -48809 -50064 -21717
7604b1717m47r565j1367K2161K8444P569j9736K172L2381O895l4205k6428N660
$$ -21717 -22164 -31729 -43096 -20935 7509 15078 -4658 -2486 29895 36790 2585 -23843 -18183
7591a8183J6342n825j5389L703M7016j0544p516K0820J4052j636j9140l8993j5418
$$ -18183 -1841 -7666 -23055 -19352 27664 17120 9604 30424 44476 42840 23700 -15293 -30711
7578c0711J4728n677l286r62j1363O345L4212J9882L582K833j5686j464k1657
$$ -30711 -15983 -21660 -24946 -25908 -37271 -30926 3286 23168 26750 29583 13897 12433 -9224
7565i224R423O825m1481j6765j0690m425L7707J6840l1849j2456K4718K0093o701
$$ -9224 199 7024 -34457 -51222 -61912 -66337 -28630 -11790 -43639 -56095 -31377 -11284 -17985
7552a7985P099r956J3200O496j084L958j4679J4145L065k4645j4029J9184J3329
$$ -17985 -10886 -20842 -7642 -1146 -2230 1728 -12951 1194 4259 -20386 -34415 -15231 -1902
7539a902N415m121j6076j1926P027P680l38n544M233l196j7581J6956J2270j4694
$$ -1902 3513 -608 -16684 -28610 -21583 -13903 -14241 -19785 -15552 -18748 -36329 -19373 -7103 -21797
7525b1797p355M221l631j546j0431m22K859J299L590K1808k783N291J5307p566
$$ -21797 -29152 -24931 -28562 -30108 -40539 -40961 -38102 -36803 -33213 -11405 -14188 -8897 6410 -1156
7511a156j5116k2787j678p886J9221Q923J5589N045j5351O743l14m128K0468L10
$$ -1156 -16272 -39059 -40737 -48623 -29402 -20479 -4890 155 -15196 -8453 -8767 -12895 7573 7883
7497G883j2859R05K941P705p688k5701k123J5950K3783k5865j5779O387J9910
$$ 7883 -4976 -4071 -1130 6575 -1113 -26814 -28937 -12987 10796 -15069 -30848 -24461 -4551
7484d551J8265o720j8677k738K698N905p995J3825j0489l110R898J6496o918l4087
$$ -4551 13714 6994 -11683 -14421 -11723 -5818 -13813 12 -10477 -13587 -3689 12807 5889 -28198
7470b8198j5531K3756J6818n146l627k515k1844J2541L252q210M38J0857j9836
$$ -28198 -43729 -19973 -3155 -8301 -11928 -14443 -36287 -23746 -20494 -28704 -28266 -17409 -37245
7457c7245m775J7647j0805j9019J2623O447p084P029p206K2719k361Q130j0045
$$ -37245 -42020 -24373 -35178 -54197 -41574 -35127 -42211 -35182 -42388 -19669 -22030 -13900 -23945
7444b3945j0220J2948K0675j6588l463O885R748j735j0200j9143J1578j9636J3089
$$ -23945 -34165 -21217 -542 -17130 -20593 -13708 -3960 -5695 -15895 -35038 -23460 -43096 -30007
7431c0007K4536k771l1258K447M433K1378K6854M756l0511p247J6475j3419J0461
$$ -30007 -5471 -8242 -39500 -37053 -32620 -11242 15612 20368 -10143 -17390 -915 -14334 -3873
7418c873k6023j9310P750J3232l3824l0632m39L4004K5907o362J1755q415N761
$$ -3873 -29896 -49206 -41456 -28224 -62048 -92680 -93119 -59115 -33208 -39570 -27815 -36230 -30469
7405c0469M208Q483R053K0179L531j0730m863K4789J5142o220l397l6491J5549
$$ -30469 -26261 -17778 -8725 11454 14985 4255 -608 24181 39323 33103 29706 -6785 8764
7392H764J1675o813J6863j3649K352q978P016j3429k2968j8333j49n372L361Q47
$$ 8764 20439 13626 30489 16840 19192 10214 17230 3801 -19167 -37500 -37649 -43021 -39660 -38813
7378c8813N586o108J9563L495J1563J30n731j1488K8855j260k5904P201P581k2820
$$ -38813 -33227 -39335 -19772 -16277 -4714 -4584 -10315 -21803 7052 5792 -20112 -12911 -5330 -28150
7364b8150j1134K7549J8630J1380o588j9492o350O227j7128m859J7477K2984Q994
$$ -28150 -39284 -11735 6895 18275 11687 -7805 -14155 -7928 -25056 -29915 -12438 10546 19540
7351A9540L240J0598j9415l7600J947j315r348J9441J2053K532L640j2910m622
$$ 19540 22780 33378 13963 -23637 -21690 -23005 -32353 -12912 -859 1673 5313 -7597 -12219
7338a2219k609j3629J67K7305j6624j0413K3247P693p784R166k0436m2255K2321
$$ -12219 -14828 -28457 -28290 -985 -17609 -28022 -4775 2918 -4866 4300 -16136 -58391 -36070
7325c6070m197K8968P806m766o599j901j578j4282l388R929J80L21J4319J8125
$$ -36070 -40267 -11299 -3493 -8259 -14858 -16759 -18337 -32619 -36007 -26078 -25898 -25577 -11258 6867
7311F867j9674J221j0222J0545r873M4112L7456n156j4932m5620j3431L636M8
$$ 6867 -12807 -11586 -21808 -11263 -21136 22976 60432 55276 40344 -5276 -18707 -15071 -15023
7298a5023L539l9762k2052Q390K8654L1805J748k7755r274R217J5101j8516m1237
$$ -15023 -11484 -51246 -73298 -64908 -36254 -4449 -2701 -30456 -39730 -30513 -15412 -33928 -75165
7285g5165N774R373L050L1694r157j8590J849j3516j1938M58K3007K9913N449
$$ -75165 -69391 -60018 -56968 -25274 -34431 -53021 -51172 -64688 -76626 -76168 -53161 -23248 -17799
7272a7799q97J7177r695j5749j9968o329L0713L364n557Q245K3414J6168M579
$$ -17799 -18696 -1519 -11214 -26963 -46931 -53260 -22547 -19183 -24740 -16495 6919 23087 27666
7259B7666l1454K745q289N194j2457K302L2321J1408j4518k4863k7604K5681J1987
$$ 27666 -3788 -1043 -9332 -4138 -16595 -14293 18028 29436 14918 -9945 -37549 -11868 119
7246A19K817j5579l1707k3521j5981J3143L7195O192L988R861N552K7318m014
$$ 119 2936 -12643 -44350 -67871 -83852 -70709 -33514 -27322 -23334 -13473 -7921 19397 15383
7233A5383k4488j2288J9572N710L545m091n778K632k3665R987P482k333j1163
$$ 15383 -9105 -21393 -1821 3889 7434 3343 -2435 197 -23468 -13481 -5999 -8332 -19495
7220a9495L118M11j9310j1126K4353j4070j4294K5581o966Q782J3371k327M866
$$ -19495 -16377 -15966 -35276 -46402 -22049 -36119 -50413 -24832 -31798 -23016 -9645 -11972 -7106
7207g106q235k792j1074l7054K93M8589J9241M259j9378j4342k7470q459k0313
$$ -7106 -15341 -18133 -29207 -66261 -65968 -17379 1862 6121 -13257 -27599 -55069 -63528 -83841
7194h3841n832p877J1069J2110N883K0200L3274J3966j8987k2666r558J6859q988
$$ -83841 -89673 -97550 -86481 -74371 -68488 -48288 -15014 -1048 -20035 -42701 -52259 -35400 -44388
7181d4388J1334K9708J316k2109L128l0512l867n68J2925J9461j6058j1157K8922
$$ -44388 -33054 -3346 -2030 -24139 -21011 -51523 -55390 -55958 -43033 -23572 -39630 -50787 -21865
7168b1865Q26p834N527l131n071m349l2679J678L7094K711k6898J5997K5181R002
$$ -21865 -21039 -28873 -23346 -26477 -31548 -35897 -68576 -66898 -29804 -27093 -53991 -37994 -12813 -3811
7154c811o184j5841r689j172J5974J593j2239k728K2478J2428l533n582J0406
$$ -3811 -9995 -25836 -35525 -36697 -20723 -19130 -31369 -34097 -11619 809 -2724 -8306 2100
7141B100r220j4885q905J0888N303k244K2902L2290j6644j7467Q160K388j8581
$$ 2100 -7120 -22005 -30910 -20022 -14719 -16963 5939 38229 21585 4118 12278 14666 -3915
7128c915q454M793k3128r963J704n573r40J9738K1558L8742k026k8815j0524J687
$$ -3915 -12369 -7576 -30704 -40667 -38963 -44536 -45476 -25738 -4180 34562 32536 3721 -6803 -5116
7114e116L74K4414J878l405m2197j5334Q210j6255j584J8143J5367K1433K0062
$$ -5116 -4742 19672 21550 18145 -24052 -39386 -31176 -47431 -49015 -30872 -15505 5928 25990
7101B5990M49j3537j0066j1706M01L342J3163j3012P466L6502P902k0958j8324
$$ 25990 26439 12902 2836 -8870 -8469 -5127 8036 -4976 2490 38992 46894 25936 7612
$$ [...]
##END NTUPLES=NMR SPECTRUM
##END=
